##TITLE=Analysis number 315616
Compound Code cc 29908
Project Code adrs
Chemist Name endeavour
##JCAMPDX= 6.0         $$ Bruker NMR JCAMP-DX V2.0
##DATA TYPE= NMR SPECTRUM
##DATA CLASS= NTUPLES
##ORIGIN= Bruker BioSpin GmbH
##OWNER= NMR
$$ XWIN-NMR		Version 3.5
$$ Thu Nov 24 15:38:02 2005 GMT Standard Time (UT+0h)  MAYBRIDGE\NMR@NMR_250MHZ
##.OBSERVE FREQUENCY= 250.131544655141
##.OBSERVE NUCLEUS= ^1H
##.ACQUISITION MODE= SIMULTANEOUS (DQD)
##.ACQUISITION SCHEME= undefined
##.AVERAGES= 16
##.DIGITISER RES= 18
##SPECTROMETER/DATA SYSTEM= dpx250
##.PULSE SEQUENCE= zg30
##.SOLVENT NAME= CDCl3
##.SHIFT REFERENCE= (INTERNAL, CDCl3, 0, 16.522)
##AUDIT TRAIL= $$ (NUMBER, WHEN, WHO, WHERE, WHAT)
$$ ##TITLE= Audit trail, XWIN-NMR		Version 3.5
$$ ##JCAMPDX= 5.01
$$ ##ORIGIN= Bruker BioSpin GmbH
$$ ##OWNER= NMR
$$ C:\u/data/dgb/nmr/ADRS/12980/pdata/1/auditp.txt
$$ ##AUDIT TRAIL=  $$ (NUMBER, WHEN, WHO, WHERE, WHAT)
(   1,<2005-11-24 15:37:40.96 +000>,<MAYBRIDGE\NMR>,<NMR_250MHZ>,
      <created by zg, POWCHK disabled, PULCHK disabled
       configuration hash MD5:
       62 19 C7 07 E1 42 D1 B7 37 6C 3D D0 77 39 F9 E6
       data hash MD5: 64K
       EE 71 D9 B1 B7 71 13 C4 61 51 B1 F4 23 F3 F2 32>)
(   2,<2005-11-24 15:37:52.34 +000>,<MAYBRIDGE\NMR>,<NMR_250MHZ>,
      <Start of raw data processing
       ef LB = 0.3 FT_mod = 6 PKNL = 1 SI = 32K 
       data hash MD5: 32K
       A6 D8 61 1D 00 9E 51 74 F2 88 9F 10 A2 4D D3 AC>)
(   3,<2005-11-24 15:37:56.15 +000>,<MAYBRIDGE\NMR>,<NMR_250MHZ>,
      <apk 
       data hash MD5: 32K
       9D 23 6E D5 17 C5 DC 5E 59 31 07 C0 53 AD 42 55>)
(   4,<2005-11-24 15:37:57.23 +000>,<MAYBRIDGE\NMR>,<NMR_250MHZ>,
      <abs ABSG = 5 
       data hash MD5: 32K
       33 BC 1A 14 B2 03 38 23 96 46 D8 C4 61 68 F4 FB>)
$$ ##END=
$$ 
$$ hash MD5
$$ EB FF D7 21 64 84 A7 99 D2 73 9C D0 1C 0D 73 B6
##$RELAX= 
##$RELAX= 
##$RELAX= 
##$RELAX= 
##$RELAX= 
##$RELAX= 
##$RELAX= 
$$ Bruker specific parameters
$$ --------------------------
##$DU= <C:\u>
##$EXPNO= 12980
##$NAME= <ADRS>
##$PROCNO= 1
##$TYPE= <nmr>
##$USER= <dgb>
##$AMP= (0..31)
100 100 100 100 100 100 100 100 100 100 100 100 100 100 100 100 100 100 
100 100 100 100 100 100 100 100 100 100 100 100 100 100 
##$AQSEQ= 0
##$AQ_mod= 3
##$AUNM= <au_zg>
##$AUTOPOS= <44 >
##$BF1= 250.13
##$BF2= 250.13
##$BF3= 250.13
##$BF4= 250.13
##$BF5= 500.13
##$BF6= 500.13
##$BF7= 500.13
##$BF8= 500.13
##$BYTORDA= 1
##$CFDGTYP= 0
##$CFRGTYP= 5
##$CHEMSTR= <none>
##$CNST= (0..31)
1 1 145 1 1 1 1 1 1 1 1 1 1 1 1 1 1 1 1 1 1 1 1 1 1 1 1 1 1 1 1 1 
##$CPDPRG= <>
##$CPDPRG1= <>
##$CPDPRG2= <>
##$CPDPRG3= <>
##$CPDPRG4= <mlev>
##$CPDPRG5= <mlev>
##$CPDPRG6= <mlev>
##$CPDPRG7= <mlev>
##$CPDPRG8= <mlev>
##$CPDPRGB= <>
##$CPDPRGT= <>
##$D= (0..31)
0 1 0 0 0 0 0 0 0 0.06 0 0 0 0 0 0 0.0002 0 0 0 0 0 0 0 0 0 0 0 0 0 0 
0 
##$DATE= 1132846660
##$DBL= (0..7)
120 120 120 120 120 120 120 120 
##$DBP= (0..7)
150 150 150 150 150 150 150 150 
##$DBP07= 0
##$DBPNAM0= <>
##$DBPNAM1= <>
##$DBPNAM2= <>
$$ [...]
##$SUBNAM7= <"">
##$SUBNAM8= <"">
##$SUBNAM9= <"">
##$SW= 20.6930455092707
##$SWIBOX= (0..15)
0 0 3 0 0 0 0 0 0 0 0 0 0 0 0 0 
##$SW_h= 5175.983436853
##$TD= 65536
##$TD0= 1
##$TE= 294.16
##$TE2= 300
##$TE3= 300
##$TEG= 300
##$TL= (0..7)
0 120 120 120 120 120 120 120 
##$TP= (0..7)
150 150 150 150 150 150 150 150 
##$TP07= 0
##$TPNAME0= <>
##$TPNAME1= <>
##$TPNAME2= <>
##$TPNAME3= <>
##$TPNAME4= <>
##$TPNAME5= <>
##$TPNAME6= <>
##$TPNAME7= <>
##$TPOAL= (0..7)
0.5 0.5 0.5 0.5 0.5 0.5 0.5 0.5 
##$TPOFFS= (0..7)
0 0 0 0 0 0 0 0 
##$TUNHIN= 0
##$TUNHOUT= 0
##$TUNXOUT= 0
##$USERA1= <user>
##$USERA2= <user>
##$USERA3= <user>
##$USERA4= <user>
##$USERA5= <user>
##$V9= 5
##$VALIST= <valist>
##$VCLIST= <CCCCCCCCCCCCCCC>
##$VD= 0
##$VDLIST= <DDDDDDDDDDDDDDD>
##$VPLIST= <PPPPPPPPPPPPPPP>
##$VTLIST= <TTTTTTTTTTTTTTT>
##$WBST= 1024
##$WBSW= 4
##$XGAIN= (0..3)
0 0 0 0 
##$XL= 0
##$YL= 0
##$YMAX_a= 359150
##$YMIN_a= -645535
##$ZGOPTNS= <>
##$ZL1= 120
##$ZL2= 120
##$ZL3= 120
##$ZL4= 120
##$ABSF1= 16.522
##$ABSF2= -4.171173
##$ABSG= 5
##$ABSL= 3
##$ALPHA= 0
##$AQORDER= 0
##$ASSFAC= 0
##$ASSFACI= 0
##$ASSFACX= 0
##$ASSWID= 0
##$AUNMP= <proc_1d>
##$AZFE= 0.1
##$AZFW= 0.1
##$BCFW= 0
##$BC_mod= 0
##$BYTORDP= 0
##$COROFFS= 0
##$CY= 12.5
##$DATMOD= 1
##$DC= 0
##$DFILT= <>
##$DTYPP= 0
##$F1P= 14.0000005364418
##$F2P= -0.99999901652339
##$FCOR= 0.5
##$FTSIZE= 32768
##$FT_mod= 6
##$GAMMA= 0
##$GB= 0
##$INTBC= 1
##$INTSCL= 1
##$ISEN= 128
##$LB= 0.3
##$LEV0= 0
##$LPBIN= 0
##$MAXI= 10000
##$MC2= 0
##$MEAN= 0
##$ME_mod= 0
##$MI= 0
##$NCOEF= 0
##$NC_proc= -4
##$NLEV= 6
##$NOISF1= 0
##$NOISF2= 0
##$NSP= 0
##$NTH_PI= 0
##$NZP= 0
##$OFFSET= 16.522
##$PC= 1
##$PHC0= -51.87027
##$PHC1= -22.00115
##$PH_mod= 1
##$PKNL= yes
##$PPARMOD= 0
##$PSCAL= 4
##$PSIGN= 0
##$REVERSE= no
##$SF= 250.13
##$SI= 32768
##$SIGF1= 0
##$SIGF2= 0
##$SINO= 400
##$SIOLD= 32768
##$SREGLST= <1H.CDCl3>
##$SSB= 0
##$STSI= 32768
##$STSR= 0
##$SW_p= 5175.98343685301
##$SYMM= 0
##$S_DEV= 0
##$TDeff= 65536
##$TDoff= 0
##$TI= <Analysis number 999999
Compound Code 99
Book Reference 9
Project Code 9>
##$TILT= no
##$TM1= 0
##$TM2= 0
##$TOPLEV= 0
##$USERP1= <user>
##$USERP2= <user>
##$USERP3= <user>
##$USERP4= <user>
##$USERP5= <user>
##$WDW= 1
##$XDIM= 32768
##$YMAX_p= 311522942
##$YMIN_p= -313877
$$ End of Bruker specific parameters
$$ ---------------------------------
##NTUPLES= NMR SPECTRUM
##VAR_NAME=  FREQUENCY,     SPECTRUM/REAL,   SPECTRUM/IMAG
##SYMBOL=    X,             R,               I
##VAR_TYPE=  INDEPENDENT,   DEPENDENT,       DEPENDENT
##VAR_FORM=  AFFN,          ASDF,            ASDF
##VAR_DIM=   32768,         32768,           32768
##UNITS=     HZ,            ARBITRARY UNITS, ARBITRARY UNITS
##FACTOR=    0.157963299565203, 1,           1
##FIRST=     4132.6476996994, 0,             0
##LAST=      -1043.33573715361, 0,           0
##MIN=       -1043.33573715361, -313877,     0
##MAX=       4132.6476996994, 311522942,     0
$$ Real data points
##PAGE= N=1
##DATA TABLE= (X++(R..R)), XYDATA
$$ [...]
17677B0573N291j093n677p54P551m472L134N679l798K524j133p480j50Q046j580
17662B6661N505r865N89m285L525O765l765j0462K538P145K090m172r512p055
17648E702L0P099N150N518j544r922J249M472J089n813o76N461q303M215m27K615
17632A5915j70J0785o10L271P668k896j2075J943L252k51L861r396o16p02o017
17617A3962k234J18j729q961J0344J5331k508j6866r68J1653P861L8j590j5029
17603I422l666Q227J436P046Q234K412l414o509r484K47J0506O509o623J040o010
17588A9373j5183p457l417J3871J1307j858q215j477j343n153N873K297j2880
17575d262L138l36L422J593p42l511Q97j082p412K441J922M574l420N606j334
$$ y = [20573, 25864, 24771, 19094, 18340, 25891, 21419, 24553, 30232, 26434, 28958, 27825, 20345, 20195, 28241, 26661, 32166, 22301, 22890, 18605, 22130, 28895, 25130, 14668, 17206, 24351, 26441, 22269, 12757, 5702, 5732, 12831, 17981, 23499, 21955, 12033, 13282, 17754, 18843, 13030, 12354, 17815, 9512, 13727, 13300, 15915, 15745, 26530, 25920, 29191, 36859, 33963, 21888, 23831, 27083, 26832, 30693, 21297, 20681, 19979, 13962, 11728, 11846, 10117, 1156, 11500, 26831, 24323, 7457, 6489, 18142, 26003, 26041, 24451, 9422, 5756, 13983, 15419, 22465, 30699, 33111, 29697, 23188, 13704, 13951, 24457, 30966, 24343, 25383, 19373, 4190, -3267, -6684, 7187, 18494, 16636, 8421, 6944, 5601, 448, 6321, 8618, -4262, -1124, -1460, 1962, 3555, 2813, -698, 199, -883, -8295, -5854, -3932, 642, -2778, 2828, 1494]
17560A494K469J261O655j87l364n627j526J0166Q601Q66P128j142m47O576J0356
17545D3279L832J237L326j1052j0022j009P265J469q45k488p314q845n604l870
17531I359j0404n233L789N291K718J0419q42p543Q576L650n550j4206o920L597
17517c299k801L256K038P64k578k083O823k621m156M345N167Q402l51O171M715
17502B3792p403k276m877n505J641P234o82O559M344p261q645l5p161k239J0710
17487H196J0423j417m228p859N201J9003j5189j2651k715L856P39J328K602o101
17473A188k563J4011Q518k0154r08P610p83k352p371m147L783l376J137Q24l333
17458g916N626P100M142m877O30q24mJ1700L047j885K480l167K680j948p881l010
$$ y = [1494, 3963, 5224, 11879, 11692, 8328, 2701, 1175, 11341, 19942, 20808, 27936, 26794, 26347, 32923, 43279, 47111, 48348, 51674, 40622, 30600, 29591, 36856, 38325, 37480, 34992, 27678, 18833, 13229, 9359, -1045, -6278, -2489, 2802, 5520, 15939, 15097, 7554, 16130, 19780, 14230, 24, -6896, -3299, -6100, -2844, -806, -42, -2620, -4703, 2120, -501, -4657, -312, 4855, 13257, 12906, 19077, 23792, 16389, 14113, 9236, 3731, 5372, 12606, 11924, 18483, 22827, 15566, 6921, 6886, -275, -2514, 8196, 18619, 17202, 12974, 5115, 10316, 29319, 14130, 1479, -1236, 2620, 3359, 4687, 7289, 1188, -1375, 12636, 21154, 1000, 92, 7702, 6919, 4567, -2804, -6951, -3168, -6544, -5407, -4583, -7916, -2290, 4810, 8952, 4075, 4705, 3881, 3877, 15577, 18624, 16739, 19219, 16052, 18732, 16784, 8903, 5893]
17442E893K504R548J0572K7987K7663R485j0939k2817q719p970j7319j1852l917
17429A0119J32l07J868J508n665J627N007k111o54j568l888o420l880r985K153
17414a2064J7688M277m667L549l966j0188R19J0282M301r696n264K55m851K176
17400g249M934p25J463J5037n284j0470m821k968Q486N625m224j689o097n923
17386a3905P73P997n96L547j497o725j115Q059M520K323m965J648l999o612Q382
17371b165R911J7265p99r785m140o512k314J246q239O07k594R973Q206K664m971
17356H353O42M185m202o340M473j050N866J750L544Q67j5305p54J455n491q368
17341a0375o45Q88P693J0764j900K823o658q701P28R322l833n018R037R404J690
$$ y = [5893, 8397, 17945, 28517, 56504, 84167, 93652, 82713, 59896, 51177, 43207, 25888, 14036, 10119, 10251, 9944, 11812, 13320, 7655, 9282, 14289, 12178, 11524, 9956, 6068, -352, -4232, -14217, -12064, 5624, 9901, 5234, 8783, 4817, -5371, -4452, 5830, 10131, 435, -4829, -4574, -9425, -7249, -2315, -3040, -1577, 13460, 8176, -2294, -7115, -10083, -1597, 4028, -196, -1885, -7982, -13905, -13132, -5135, -5731, -2184, -3681, -10406, -11521, -3462, 1058, 3381, -1584, 64, -3935, -10547, -2165, 7746, 25011, 24212, 14427, 10287, 3775, 1461, 2707, -5532, -4925, -7519, 2454, 10660, 13324, 8353, 8995, 13180, 8978, 2638, 7111, 6061, 11927, 13677, 17221, 18088, 2783, 2029, 3484, -2007, -10375, -11020, -10132, -2439, 8325, 6425, 9248, 2590, -6111, -5383, 3939, 106, -4912, 4125, 13529, 15219]
17326A5219j425J016k936r315m542P258L288m95M681p955m247R034L990J318M508
17311A9397N487L714j0259j6416o832R49J2814L805j0458n027j861l688n28q0
17297h983M50j082J246k1N575P674J679j413k592r996j048P55N083k113j1805
17282a6591J695N561J078q92m33o34J851L881j602k523m53m72j03o416k023O571
17266a1505P541P408L962q689o033M848k669l520J337P962r591n665M468P361
17252b785P231L122m094j0600j1727k849O614Q099J3619k208j0386q708o590N843
17238a5419o10L04j572p98K457J2496J409J2l649n553L758L40r975m839M569L412
17222a3658n232m98P632q569J834P060Q530p8j1399l192L633O22R596J2661r119
$$ y = [15219, 13794, 14810, 11874, 2559, -1983, 5275, 8563, 8068, 12749, 4794, 547, 9581, 13571, 14889, 19397, 24884, 28598, 18339, 1923, -4909, -3960, 8854, 12659, 2201, -2826, -4687, -8375, -8903, -8983, -8533, -9615, -8369, -8390, -2815, 4859, 6538, 5125, 2533, -7463, -8511, -7756, -2673, -4786, -16591, -14896, -9335, -8257, -9149, -9582, -10216, -8365, -4484, -6086, -8609, -9062, -9534, -9637, -16053, -18076, -11505, -3964, 3444, 7406, -1283, -7316, -2468, -5137, -8657, -7320, 642, -8949, -14614, -10146, -2785, 4446, 7568, 3474, -7126, -18853, -21702, -15088, -6989, 6630, 4422, -5964, -14672, -21262, -15419, -16029, -15725, -17297, -18095, -15638, -3142, -1733, -1721, -5370, -10923, -7165, -6825, -16800, -21639, -17070, -13658, -18890, -19388, -11756, -20325, -18491, -11431, -2901, -2979, -14378, -17570, -13937, -13315, -3719, 8942, -177]
17207a77n467p683J631Q72j5O776J3113L610m755O566J114o252p818m979n935
17192i399J708J1568l888p838P344K924m794q99L811j0549r809N487O720P445
17178a69j312k140J419k359j1944q455O94J1805J2528J2192n97l641L200j3198
17164a977l868J977P637M617o24r340j0646k294Q330P718K273k760j990K972j073
17149I52n603q194o695R710J4538N310J515j634L28p423R033J4388o134o785j5098
17134a792n725N093n490k868P00O371R491P582q78q726q86Q22p538n17o89n593
17118a0643n347K834K410J628o624n257L432J0430m331m6m22Q81M950J426Ll199
17102g875K868R951M395j854m167p639j842j097N216j101l455O775P508L813O09
$$ y = [-177, -5644, -13327, -11696, -10824, -10839, -4063, 9050, 12660, 7905, 14471, 15585, 9333, 1515, -3464, -9399, -7691, 3877, -11, -7849, -505, 2419, -2375, -3274, 537, -10012, -19821, -14334, -7614, -169, -1481, -3621, -2202, -4561, -16505, -24960, -24266, -12461, 67, 12259, 11662, 8021, 11221, -1977, -5845, -3868, 3769, 8386, 7762, -1578, -12224, -14518, -6188, 1530, 3803, 1043, -947, 2025, 952, -4651, -12845, -19540, -9830, 4708, 10018, 11533, 9899, 10227, 2804, 11837, 26225, 20091, 13306, -1792, -7517, -2424, -7914, -10782, -10082, -3711, 5780, 13362, 12484, 3758, 2872, 3694, -3844, -4361, -5050, -10643, -15990, -13156, -10746, -9118, -15742, -20999, -17567, -7137, -11468, -11514, -11936, -11055, -6105, -4679, -4676, -7875, -5007, 4944, 9339, 7485, 3318, -4321, -6163, -7260, -2044, -3145, -6600, 175, 7683, 11496, 12105]
17087A2105l534l484o424k700j985o906k125O600N209M86l976r054p199J987p60
17072b1760l036N745N713n136K42J1135J4581o022k0980J595j131R38J133R821
17058g162K104q40k229M38j0115k202M542O154J339K48M796l736j375J289N454
17043a295m675l43n18l980j672L104j760l735l13M751k193K905J016m252O551
17028f409K136k539R867J2920n756o607k42O51L417m10j9754n921J4253q41n423
17013a0658J771L716J2976n634p079K576M606m399K95K456k545k181n201m403
16999a3704j667k809l151O915M008K575K399J2331n301q039m486K1l087j245M627
16984a0613J5043k975j0991M395O221L561m565k61L18k035j2676l320L753K602
$$ y = [12105, 8571, 5087, -1337, -4037, -6022, -12928, -15053, -8453, -3244, -2758, -6734, -15788, -22987, -21000, -21760, -24796, -19051, -13338, -18474, -18232, -7097, 7484, 1462, -19518, -17923, -19054, -18116, -16983, -7162, -5058, -5898, -8127, -7689, -17804, -20006, -15464, -9310, -7971, -7723, -2927, -6663, -8038, -6749, -1295, -5970, -6313, -6831, -10811, -12483, -9379, -11139, -14874, -15187, -10436, -12629, -9724, -8708, -12960, -6409, -4273, -6812, 3055, 15975, 10219, 3612, 3370, 4021, 7438, 7028, -12726, -18647, -4394, -5235, -10658, -8887, -5171, 7805, 2171, -4908, -2332, 2274, -2125, -1830, 626, -1919, -4100, -9301, -13704, -15371, -18180, -21331, -14416, -10408, -7833, -5434, 6897, 1596, -6443, -10929, -10908, -13995, -15240, -10613, 4430, 1455, -9536, -5141, 1080, 4641, 76, -185, 133, -1902, -14578, -17898, -14145, -11543]
16970a1543j0729k652J3156M620K357p95O454J724p190q171M428Q524n278N96
16956d499r56K824O435n068n190J053L302O119R203O20j269j3724r5l692p457
16941a2394m363K193j62k264R353k320l002l704O30Q055M158M013r053m199J270
16926a1789Q43l125M10R171J1395n798o179N68K408l674K8k804q39k821n244P692
16910i758j752L02k874k346o559j132k086o709J0206O692R389K181m487l459P05
16895a1687l306K397L006n979P722J694l207l056k934j527O234K883m908M571
16881h097k591O407R787N481l632m054j269j490J770j491J0058r154j1117K512
16867f880L090J3194J53r449m149l044N20O259L152J089l482J510L941K699r810
$$ y = [-11543, -22272, -24924, -11768, -7148, -4791, -5586, 868, 2592, -4598, -12769, -8341, 183, -5095, -4499, -5455, -2631, 3804, -1264, -6454, -5401, -2099, 4020, 13223, 13843, 12574, -1150, -1245, -4937, -12394, -16757, -14564, -14726, -16990, -7637, -9957, -12959, -16663, -16033, -7978, -3820, 193, -8860, -13059, -11789, -10946, -14071, -13661, -4490, 6905, 1107, -5072, -4504, -2096, -5770, -5742, -8546, -9385, -12206, -17450, -9758, -11510, -11208, -14082, -16428, -22987, -24119, -26205, -32914, -22708, -16016, -6627, -4446, -8933, -12392, -11687, -14993, -12596, -9590, -15569, -7847, -6153, -9360, -12416, -15350, -16877, -10643, -7760, -12668, -8097, -10688, -4281, 5506, 10987, 7355, 3301, 2032, 542, 2312, 821, 10879, 1725, -9392, -6880, -3790, 9404, 9557, 108, -4041, -7085, -6565, -306, 2846, 3935, 453, 1963, 5904, 8603, -1207]
16852a207j117m508l352m438q970o638J168R977K2656q08K827O202n568n736K162
16837B650j0405j8655m746N586J5896q58m631L763P799p854j2289j252P063R628
16823h305l607O586m427r352N266M909N825J902J932o366m591M842L770L40J718
16808D42O829N48m426M932Q652n709k2951j5796k848P375R078L079N445j570R177
16793B257k468m535m963K519j23N352J0049n678j0476k368k577l299QL063L069
16778a0170P180M298l948j1089n552J5747P667n847N879j4607p698O262J3457
16765A579l357q489n485k761j133K101L123J072L753L928L293m375j971L832R940
16750E050L222m512m753p773Q16p099K637K961O999J098J009M745J819j8598j193
$$ y = [-1207, -2324, -6832, -10184, -14622, -23592, -30230, -29062, -19085, 3571, 2763, 5590, 11792, 6224, 488, 2650, -7755, -26410, -31156, -25570, -9674, -10532, -15163, -11400, -3601, -11455, -23744, -24996, -17933, -8305, -11912, -5326, -9753, -19105, -13839, -8930, -3105, -1203, 729, -5637, -10228, -5386, -1616, -1276, 442, 7271, 7819, 3393, 8325, 16977, 11268, -11683, -27479, -30327, -22952, -13874, -10795, -5350, -6920, 2257, -211, -4746, -9709, -7190, -7313, -1961, 8088, 2410, -8066, -10434, -13011, -16310, -16302, -13239, -10170, -2990, 1308, -2640, -13729, -19281, -3534, 4133, -1714, 4165, -10442, -18140, -11878, 1579, -1778, -10267, -15752, -18513, -19646, -17545, -14422, -13350, -9597, -5669, -2376, -6751, -8722, -4890, 5050, 8272, 3760, -993, -8766, -7950, -15049, -12412, -9451, -2452, -1354, -345, 4400, 6219, -12379, -13572]
16735a3572J2028J593K95k231m399L765l369r320M368q49J422M771j554m945j6989
16720b8986o183O229K0333R737q212n792l421K459Q622N773K209j131p001k694
16706h058J2880J0662o987p46j0284J867R028J1626r893j4880J879j394N227n639
16692d712r161K007K599K25M668M355l53j0143p005m076M422J26l219j391Q195
16677a3463M572l810M799P703L875L775P26n202j229P67J856r110r259J658l96
16662a2738q063k63L39N065J2631J0545M980p093j2227j3092p08J2760O246q019
16648i637N95O690N55j623r44O039l713j715k891j000k266N559o63k240Q36j173
16632g591Q243M522l4p075R944m871q452L546O73J346j3638l785L238N844Q548
$$ y = [-13572, -1544, 49, 344, -1887, -6286, -2521, -5890, -15210, -10842, -11691, -10269, -5498, -7052, -11997, -28986, -35169, -28940, -8607, 1130, -7082, -12874, -16295, -13836, -5214, 559, 2768, 1637, -5364, -8058, 4822, 15484, 8497, 7751, -2533, -666, 8362, 19988, 10095, -4785, -2906, -4300, 927, -4712, -13873, -11866, -9267, -9042, -4374, -19, -372, -10515, -17520, -21596, -17174, -17048, -20267, -21658, -13463, -8891, -12701, -7902, -199, 3676, 7451, 8177, 2975, 1746, 2513, 4369, -4741, -14000, -12342, -12738, -20801, -21064, -20725, -15660, -3029, 7516, 12496, 5403, -6824, -19916, -20624, -7864, -1618, -9637, -9042, -2352, -1797, -3420, -4364, 1675, -2038, -3753, -6644, -7644, -9910, -4351, -5014, -7254, -6418, -7591, 652, 5174, 5140, -1935, 8009, 3138, -5314, -1768, -1095, 251, -13387, -17172, -13934, -8090, 458]
16617D58J492j2502l504n923k343N785J725P396L488n335N203J866M540Q78q900
16602e676j582k422J862Q797J02l602r109q450N64O211J2247m190j2980q359M423
16587b2164O41q690k893P8L558k311J2795Q927r489K004J0593R507l713q714l546
16572a3417l58Q537J0090k156n721j0147r490q287L15k078j680N987K546O490
16558a9369M418k998n652O407M964j320M804M240K278p296r818M927J3748m387
16544e054j897p267J255J152m324m915O250O285KK539Q459q918j2094R240K013
16529g274q38j2842m746R098J684k086N019Q680J1113P683l313q117p158j3900
16515a6997j2339P783O431j54N116m98m3K423o458r749L058R314k455r565L527
$$ y = [458, 1950, -10552, -14056, -19979, -22322, -16537, -14812, -7416, -3928, -9263, -4060, -2194, 2346, 3224, -5676, -7258, -9680, -7818, 979, 1081, -2521, -11630, -20080, -19516, -13305, -1058, -5248, -18228, -26587, -22164, -21523, -30213, -33106, -33028, -29470, -31781, -18986, -10059, -19548, -17544, -6951, 2556, -1157, -9871, -13417, -13775, -5238, 4852, 2696, -3025, -13172, -22662, -30949, -30634, -32712, -34392, -28405, -25859, -19369, -14951, -17949, -23601, -17194, -12230, -13550, -8746, -4506, -2228, -9524, -19342, -14415, -667, -5054, -6951, -14218, -12963, -11811, -16135, -21050, -14800, -8515, -8513, -5974, 2485, -6433, -18527, -9287, -7274, -8112, -20954, -25700, -16602, -14918, -17004, -11985, -3305, 7808, 15491, 12178, 4061, -3097, -16997, -29336, -21553, -15122, -15276, -10160, -10658, -10701, -8278, -14736, -24485, -21427, -12113, -14568, -24133, -20606]
16500b0606N497J1969n233j3118q072J30M582O703l30J017J198j591J1408O281
16486a65m647k32L311J752l127j2885M931O368j685j2391l759K516Q616K427j2750
16471b1720l182j004k975n079m435P351J8063K923m737p131j75J08J101M511P028
16456i353K852j895l136o800L384J866j090k183N136k989n00J325M13n901q54
16441a9725R67k13m31Q282O783k2L724o87N815O416m940k327j940o054l738o09
16425h699m307j022L778R851P722L277M840m694j0169j6783o883K853J0789r133
16411a8580K680J5769m53j407n430m816j1080O222M777m068j842k257K616O521
16397a1348R51q450p127J1944P144n597n454k118P076O690J841p5o453M81j4645
$$ y = [-20606, -15109, -3140, -8373, -21491, -29563, -29433, -24851, -18148, -18478, -17461, -16263, -17854, -6446, -165, -4812, -5044, -1733, 19, -3108, -15993, -11062, -4694, -6379, -18770, -22529, -20013, -11397, -8970, -21720, -24902, -25906, -28881, -33960, -38395, -31044, -12981, -10058, -14795, -21926, -22101, -21993, -20892, -16381, -9353, -6501, -8396, -11532, -18332, -14948, -13082, -14172, -16355, -11219, -14208, -14708, -13383, -12970, -18871, -19725, -18758, -18971, -19402, -11120, -4337, -4359, -635, -1322, 4493, 10909, 5969, 3642, 1702, -4352, -8090, -8699, -13006, -14028, -10250, -399, 7323, 10600, 15440, 10746, 577, -16206, -23089, -20236, -9447, -18580, -15900, -131, -584, -1991, -7421, -12237, -23317, -17095, -12318, -16386, -18228, -20485, -17869, -11348, -10397, -18847, -25974, -14030, -6886, -12483, -17937, -20055, -12979, -6289, -4448, -4523, -10976, -10495, -25140]
16382b5140r949L236O061q6r635M866M784N575K011J2993m644j2381J131P689
16368a3489M222M305M131o270j1588r806J685N676L146M046M706Q016L840N243
16354G863l746j434l945R24J118r743j1814m253K444K070k993K823k14m698L857
16339b1741M363K153L771l01p595j0889l936J0370R594M109j721M59n963m771
16325b2098K90K102J1186j2061j4125L908N101M780p602l01P053J979o213k602
16311b8603P254L106l754K006J5430J177j3481M727L230p698K872P62j0273Q840
16297a4405J1339L19p492R152j719j0327J26k460K231j759o949J688K012L381
16283a4863J0121L038j2597q901L800O895M649M820J753j030K270q338n367r778
$$ y = [-25140, -35089, -31853, -25792, -25878, -35513, -30647, -25863, -20288, -18277, -5284, -9928, -22309, -21178, -13489, -9267, -4962, -831, -7101, -18689, -28495, -26810, -21134, -17988, -13942, -9236, -1220, 2620, 7863, 4117, 2683, -1262, -338, 780, -8963, -20777, -25030, -22586, -20516, -23509, -20686, -20900, -25598, -21741, -17378, -15225, -11454, -11755, -19350, -30239, -34175, -23805, -14211, -10102, -11823, -11364, -17327, -22098, -21808, -19706, -8520, -20581, -34706, -30798, -25697, -20917, -28519, -28820, -21767, -19788, -26001, -28603, -21349, -18243, -21997, -19991, -4561, -3384, -16865, -12138, -8908, -16606, -13734, -12972, -23245, -14405, -3066, -2747, -10239, -1087, -2806, -13133, -13007, -15467, -13236, -14995, -21944, -20256, -18244, -14863, -4742, -1704, -14301, -23202, -19402, -12507, -7858, -3038, -1285, -2315, -45, -8383, -13750, -23528]
16269b3528K408R076Q98l503j032k184j362Q167k407M15M464k074n41p681r704
16254b8588O587j275j0803Q400L508J950J3623P848o564j4872l572O005R352r226
16240a7627m185m881M318J2508O378q88l343J062M478k602M394L251l984j1185
16226a2306j854K577J394n643j34O318q62M060r943q970J882p109J587j563n307
16211c5873O959Q948L175j415j392k367P078m685m527L918M14o785O768K910j377
16196a8251J746L772L624m921n854q208P046p485K170Q714k416r763l753k778
16182c6357P432J790k711J0373L729J1136N110j0651p735M756K504N031N391k870
16168c072R736l400m003m60q653j2152n645J836O186L896j0401k199P430J4777
$$ y = [-23528, -21120, -12044, -11146, -14649, -15681, -17865, -19227, -11060, -13467, -13052, -8588, -10662, -11203, -18884, -28588, -22001, -23276, -34079, -25679, -22171, -20221, -6598, 1250, -5314, -20186, -23758, -17753, -8401, -17627, -21812, -26693, -22375, -9867, -3489, -4377, -7720, -6658, -2180, -4782, -388, 2863, -1121, -12306, -14160, -11583, -10189, -15832, -15966, -9648, -10510, -6450, -16393, -25363, -23481, -30590, -29003, -30566, -35873, -28914, -19966, -16791, -18206, -19598, -21965, -14887, -19572, -24099, -20181, -19767, -26552, -19784, -16874, -18251, -16505, -12733, -9109, -14030, -19884, -28092, -21046, -28531, -26361, -17647, -20063, -29826, -33579, -36357, -28925, -27135, -29846, -19473, -15744, -4608, 502, -10149, -17884, -13128, -10624, -5593, -202, -3072, 6664, 3264, -739, -1199, -9852, -22004, -27649, -25813, -19627, -15731, -26132, -28331, -20901, -6124]
16154f124M568o480j715p827O460K667p196q365Q35O236P663J503K149r95r520
16139a6141n248o70J3046L689k302j4604k361p637J0240J1533P635n683o826M199
16125a1130k75q779n707K111O119Q430N229n401J01m147r483J1226P395K012n488
16110g787j166J236M284K687J0872m380l281j7986o923J753L460P366n815n392
16096b1072j0076L008J4662M072p28M900L684j943m245j0220p062K557j027Q853
16082a4637j430q180n74J287N322k426p663Q223K333R070m212j959j353K594k66
16067a3871J219m502L1J0529k820m413M69N148j835p324q9n967p233J1011O026
16052a3621j836M664j718M172n864l17L029J2452k481l722r388r949o798J302
$$ y = [-6124, -1556, -8036, -9751, -17578, -11118, -8451, -15647, -24012, -23177, -16941, -9278, -7775, -5626, -6621, -16141, -21389, -22059, -9013, -5324, -7626, -22230, -24591, -32228, -21988, -10455, -2820, -8503, -15329, -11130, -11405, -20184, -25891, -23780, -17661, -9231, -4002, -9403, -9302, -13449, -22932, -11706, -4311, -2299, -7787, -8953, -7717, -3433, -746, 10126, 5746, 2465, -15521, -22444, -20691, -17231, -9865, -15680, -21072, -31148, -28140, -13478, -9406, -10134, -5234, -1550, -3493, -7738, -17958, -25020, -22463, -23490, -14637, -16067, -24247, -24821, -23534, -18212, -20638, -28301, -20078, -17745, -8675, -12887, -14846, -16199, -13605, -13871, -12652, -17154, -17123, -6594, -9414, -13827, -13358, -8210, -10045, -17369, -17458, -23425, -30658, -19647, -13621, -15457, -10793, -12511, -8339, -14203, -14520, -11491, 961, -1520, -5242, -14630, -24579, -31377, -30075]
16038c0075j60J2808J2558m912n225P37l548l17l861p335j63m41M697N646N792
16023a3799P10j5966j2214J0672J2208L725l232p796P663L142m088J553L825J078
16009a2519j416k642K244O034J113O536K200j3409j0687j5j500O258J733n229
15995b1299J823K323K61n928r10J37L017O376L571n05o533q165l038K532j842
15980b8180J0445O097k715j2012n445r856O23K807K388O134q726K00J4761L399
15966b0080m368r9K102Q802l328j7845l828j983P163J1997n68m863L008O148O809
15951a0933O391Q9j4063n694P627m73k160L807K078p068Q629M184m686L097J3610
15936D435J177r258p482K150j377L758P347o097j1106k144K954j537p681m974
$$ y = [-30075, -30235, -17427, -4869, -9781, -15006, -14269, -17817, -18134, -21995, -29330, -29493, -29934, -25237, -19591, -13799, -13089, -29055, -41269, -30597, -18389, -14664, -17896, -25692, -18029, -14887, -18975, -17422, -13597, -12519, -13935, -16577, -14333, -8299, -7186, -650, 1550, -11859, -22546, -22561, -24061, -17803, -16070, -21299, -19476, -17153, -16892, -22820, -23730, -23593, -20576, -14200, -10629, -11134, -17667, -25832, -28870, -26338, -28180, -17735, -11638, -14353, -26365, -31810, -41666, -41043, -38236, -35848, -29714, -38440, -38240, -23479, -20080, -24448, -24547, -22445, -13643, -16971, -34816, -38644, -40627, -33464, -21467, -22035, -26898, -23890, -17742, -10933, -4542, -4453, -18516, -24210, -16583, -17056, -19216, -15409, -13331, -20399, -11770, -7586, -12272, -9175, 4435, 5612, -3646, -11128, -8978, -10355, -6597, 750, -5347, -16453, -18597, -15643, -17180, -24861, -29835]
15922b9835o959l772O568L588N152Q358m515j321M039p793P141P581l29o494l800
15907b2391N124l70k016N65q69L149N145k926l595q5O259o062M99K656R28j1460
15891b5449L803K823k315p467L667j492N485P539k260n407p37M69L164j775M145
15876a5807L070L249j566o956m50m772j290K657J57n27n092k159j452R603J0057
15861a1278M105J377k068n690L564j10r416p876O143N265K376l168n815J764k859
15846b3686k735Q095l055p973j8O1o549j832N651J5377j652j0288K312M854M928
15831a6510L620k212Q3m132p937j272J0292J679q687k890R409M094l800o402j082
15816b5747n298M061M037j555j364M843J363n209l923N406j369r070N772l267
$$ y = [-29835, -36794, -40566, -33998, -30410, -25258, -16900, -21415, -22736, -18697, -26490, -19349, -11768, -12097, -18591, -22391, -17267, -17637, -19653, -19088, -19957, -16808, -11663, -14589, -18184, -18269, -12010, -18072, -17573, -14917, -13989, -25449, -21646, -18823, -21138, -28605, -24938, -26430, -20945, -13406, -15666, -21073, -21810, -21341, -18177, -19952, -15807, -12737, -9488, -11054, -18010, -18460, -23232, -24522, -21865, -21708, -22235, -27327, -29486, -30938, -21335, -11278, -7173, -5796, -7864, -13554, -9990, -10100, -19516, -27392, -21249, -15984, -13608, -16776, -22591, -20827, -23686, -26421, -18326, -21381, -29354, -29372, -29311, -35860, -37692, -32041, -16664, -18316, -28604, -26292, -21438, -16510, -12890, -15102, -15019, -19151, -27088, -28360, -18068, -16389, -25076, -27966, -18557, -14463, -18263, -24665, -25747, -31045, -26984, -22947, -24502, -25866, -21023, -19660, -24869, -28792, -23386, -24755, -33825, -28053, -31320]
15802c1320L818J0989N285o470l221l990j2079j451J4505j198l34q923Q93J0712
15788b2784N94J57k728q257O358K901J868M915k881j430K268o633j5614M21R087
15773c1758J234M378K131q75K184J25K365J908o840m006L652M801r917K114Q866
15758a9638l203n368J632j4212j1099M483N739J1133L076q790J587J0818K899
15745b0943l005P357K292p976J801q26P905J0870l951m118o099n239N113k434
15731a9253l622p359j802M930K048o160Q542J4592J311k821j814J755q260N78
15717a7335M712m893j3596j340O803p241j847p3j920o044N547R648J286O589P17
15702a8987o173R531j555J57J943J2244M209r393l425j0211j556K793j678R26
$$ y = [-31320, -27502, -16513, -11228, -17698, -20919, -24909, -36988, -38439, -23934, -25132, -25466, -34389, -33496, -22784, -22190, -22033, -24761, -33018, -26660, -23759, -21891, -16976, -19857, -21287, -19019, -25652, -41266, -40845, -31758, -30524, -26146, -24015, -24890, -22706, -22581, -20216, -18308, -25148, -29154, -25502, -20701, -30618, -28504, -19638, -22841, -28209, -26577, -40789, -51888, -47405, -41666, -30533, -27457, -36247, -34660, -23842, -20943, -23948, -16591, -14299, -22275, -20474, -21300, -13395, -2525, -6476, -10594, -16693, -21932, -16819, -19253, -22875, -30234, -32036, -27106, -25058, -31218, -22676, -8084, -6773, -9594, -11408, -9653, -17913, -17335, -12623, -17516, -31112, -32452, -25649, -32890, -34737, -34810, -36730, -42774, -37227, -27579, -26293, -19704, -18987, -25160, -15629, -17184, -17027, -15084, -2840, 1369, -8024, -11449, -21660, -23216, -20423, -22101, -21175]
15688b1175M46j947K731r72J898o085p986J754J0707n83L517o615R02L685N375
15673a4348k616o021L730O398o022o593M433L180j050M237N79L081j4785k018
15659b7815Q93L094L162l746n113L38Q722J635m500L909p787m953r054j873J1006
15644c2082M369M219p18N080R81O792m869m832r134l256J0379N785j4370q702
15630d0358J2997M324J42r13M415n347o573j711M379J1433M522J2294L206j3505
15616a0695r494m967J509N649n748n614Q853O126l3J666n09m325J248J108o531
15601b1757j2038N778L246R2n58J014M152Q024O761l557j4618l563Q11M377J074
15586b0762K996K185P61J950q800l120m819j1089q375J1966L565k848q071o54
$$ y = [-21175, -20729, -22676, -19945, -20917, -19019, -25104, -33090, -31336, -20629, -21212, -17695, -24310, -23408, -19723, -14348, -16964, -22985, -19255, -12857, -18879, -25472, -21039, -17859, -18909, -14672, -14093, -11012, -25797, -27815, -26922, -23828, -20666, -24412, -29525, -29187, -20465, -18830, -23330, -19421, -27208, -32161, -41215, -43088, -32082, -27713, -23494, -24212, -19132, -18151, -11359, -16228, -21060, -30194, -33450, -23071, -17286, -31656, -40358, -27361, -23037, -22895, -23808, -19393, -24740, -31313, -33024, -28645, -17212, -12690, -396, 2810, -10695, -20189, -25156, -23647, -17998, -23746, -29360, -20507, -14381, -14414, -12748, -13257, -17582, -16334, -15226, -21757, -33795, -28017, -24771, -24679, -25237, -24223, -20071, -12047, -5286, -8843, -23461, -27024, -26213, -21836, -20762, -17766, -15581, -14820, -12870, -21670, -24790, -29609, -40698, -49073, -37107, -33542, -36390, -44461, -45115]
15572d5115L55p396J416K1331J2460n752j713o093q87J1590N744N05k498j601
15558a7654N499o55m719p932M878j536L92j735j80j536k549O017M057j1754o261
15543c5668k867Q578J6355l734l556QM030k38N323J3282o252j0267m831L349L471
15528a3017j196o551j0574P34p093n655l235N717J0261M241L745j174P921K939
15514a2937p860L888N830n270k527R15n817k20N041M558J155j267M4l589R324
15499h732r821j2202O8P046k312k184L773m217P886r7n276L147j730O385n91o797
15483b5654l220J673l510j452J033M032q029l123m86p636l364L46q18Q418J1150
15468c0640j782l937P106J798j985n488l411k530M093j201l26O405k634N268O644
$$ y = [-45115, -44760, -52156, -50740, -29409, -16949, -22701, -24414, -30507, -31394, -19804, -14060, -13555, -16053, -17654, -12155, -12810, -17529, -25461, -20583, -22119, -21727, -23462, -23642, -25178, -27727, -21710, -17653, -29407, -35668, -38535, -29957, -13602, -17336, -20892, -20884, -16854, -17092, -11769, 1513, -4739, -15006, -19837, -16488, -13017, -14213, -20764, -31338, -30604, -37697, -43352, -46587, -40870, -30609, -26368, -22623, -23797, -15876, -12937, -20797, -16909, -11079, -16349, -18876, -17961, -23778, -23998, -18957, -14399, -13244, -14511, -14467, -18056, -8732, -18553, -30755, -30687, -23641, -25953, -28137, -24364, -28581, -20695, -20792, -26068, -22921, -24651, -18266, -18857, -25654, -28874, -27201, -30711, -32163, -31130, -27098, -35127, -38250, -38736, -46372, -49736, -49390, -50208, -41790, -30640, -32422, -36359, -29253, -27455, -29440, -34928, -38339, -40869, -36776, -37977, -38303, -31898, -34532, -29264, -22620]
15453b2620R83j2673k024N219P061m695k547m089p0J5312k644k510M043p977j5575
15438d4806p806r201q36J1278J2294J3430L489J1511P255O532m10j1672q903K260
15424a5585l019j5747r534O972K275O028k603O604O687l643j7497j250k103q986
15410e1401Q553O605Q891M61n977P900P108k313m144k581L704J750p011n626j798
15395c5879N639K471j0211q477L585L429L103O905M840p756m306j346j876o554
15381d6433o44R821P598Q906j471r26l290m872p586m384J544p9P832m130N941
15366c2173J254M902K688P308L09k997m939j097P11m570J713Q506j925j54J984
15351a8480Q348k975r973m16l42m972k572J880Q416j346O635k757J2807R207r126
$$ y = [-22620, -21637, -34310, -36334, -31115, -24054, -28749, -31296, -35385, -35455, -20143, -22787, -25297, -21254, -29231, -44806, -52612, -61813, -62649, -51371, -39077, -25647, -22158, -10647, -3392, 3140, 2730, -8942, -17845, -15585, -18604, -34351, -43885, -36913, -34638, -28610, -31213, -24609, -17922, -21565, -39062, -40312, -42415, -51401, -42848, -36243, -27352, -26891, -32868, -24968, -17860, -20173, -24317, -26898, -23194, -21444, -28455, -34081, -35879, -30240, -27769, -37980, -46457, -42872, -39443, -36340, -29435, -24595, -32351, -36657, -38003, -39879, -46433, -47077, -37256, -29658, -20752, -22223, -23149, -26439, -31311, -38897, -43281, -41737, -41816, -33984, -38114, -32173, -30919, -26017, -23329, -16021, -15712, -18709, -23648, -24745, -24034, -28604, -26891, -18385, -20310, -20464, -18480, -10132, -13107, -23080, -23496, -23838, -28810, -31382, -29502, -21086, -22432, -15797, -18554, -5747, 3460, -5666]
15336e666j2138r219j950k319m841p42k701L791p21R15O409N040J152P933N36
15321a4521j745j64P40m212N11L229l580n355o359M134L850l901n121L250O842
15306b2402o331M632J2009J962m714r436Q97n64J604j582m334J0950L567K208
15292a1534N435k956J885K545l101p598k316k564j3321k714J3256O232j0071j1500
15278c8322o180N830N916Q129J129m787j7664m350J50j590P576n680L487J2922
15264c3434M901K373L399M317K280p011r664m702J839L13J296l217o552j987L401
15249d2448k406k864K988L084l881l04P400Q616M841q534k549l783L205O927J080
15234b8628l919n257j143J596O353P17k100p644K598N551l073j0770j1062l318
$$ y = [-5666, -17804, -27023, -28973, -31292, -36133, -36875, -39576, -35785, -36506, -35591, -29182, -24142, -22990, -15057, -14521, -16266, -16430, -15690, -19902, -19391, -16162, -19742, -25097, -31456, -27322, -23472, -27373, -32494, -29244, -22402, -28733, -24101, -12092, -10130, -14844, -24280, -23383, -23947, -22343, -23925, -28259, -17309, -13742, -11534, -6099, -9055, -7170, -4625, -7726, -15324, -17640, -20204, -33525, -36239, -22983, -16751, -26822, -38322, -44502, -38672, -32756, -24627, -23498, -28285, -45949, -50299, -50149, -51739, -44163, -49843, -46356, -33434, -28533, -26160, -22761, -18444, -16164, -23175, -32839, -37541, -35702, -35389, -34093, -37310, -43862, -45849, -42448, -44854, -47718, -44730, -41646, -45527, -45831, -38431, -29815, -24974, -33508, -36057, -39840, -36635, -29708, -28628, -32547, -37804, -38947, -37351, -30998, -30281, -32381, -40025, -37427, -31876, -34949, -45719, -56781, -60099]
15220f0099J058R479J1819O891j476L649O755O229K162l052j3156j0633n955p701
15206e4030P493O837M933q83L037P587M930n549q315n285L355n449r58k671j1926
15191e6894q65M922M189k677m769Q829l942L095P859P809l509J322J6516J5752
15177b363l974J084j1634k0008m174L704R309K526j058K287n179j6729m836R376
15163d1669r816L887J6402j226q629L395O161o15k603m838K593L05N215L646j816
15148b9608J144l185m482N327n25L075r595K363K683l476o165l888K959k744P478
15133c8639J581K661p975o895J1604M117l376q319n703J0602J2900m701Q299K438
15119b1406p913q949r499l671L872R828Q878l202l687L831l46o954L166l356j0060
$$ y = [-60099, -59041, -49562, -37743, -30852, -32328, -28679, -21924, -15695, -13533, -16585, -29741, -40374, -46329, -54030, -46537, -39700, -34767, -35650, -32613, -25026, -20096, -25645, -33960, -39245, -35890, -41339, -42297, -44968, -56894, -57759, -52837, -48648, -51325, -56094, -47265, -51207, -48112, -40253, -32444, -35953, -34631, -18115, -2363, -6337, -5253, -16887, -36895, -41069, -37365, -28056, -25530, -26588, -24301, -29480, -46209, -51045, -41669, -51485, -47598, -31196, -32422, -41051, -37656, -31495, -32110, -34713, -39551, -36958, -36653, -31438, -27792, -29608, -28464, -31649, -36131, -30804, -31329, -28254, -37849, -35486, -32803, -36279, -42444, -46332, -43373, -46117, -38639, -37058, -34397, -42372, -49267, -37663, -33546, -36922, -45241, -50944, -40342, -27442, -32143, -23844, -21406, -29319, -38268, -47767, -51438, -47566, -37738, -28860, -32062, -35749, -31918, -32264, -39218, -36052, -39408, -49468]
15104d9468n229P422n852l451O502k631j2772o35O696L451k627J784J0683J2992
15090c3135K906J498j164q083r06L617j1446P25R334N410K785K015J303q656n502
15075c9299l97q338N730M095M932M959L936K897O77m146r814Q124k970K639Q517
15060a8458r915q621k42m471m100R50Q556j928J433J623m215m503n428n428m143
15045e8890O060O393q533q334O573J576R218P964J099j5576j0565J144O117J3913
15031d1841R747j072k225M93N771Q71L249k388r027l691M339J397l157L231Q905
15016b5398m963n218n012k010L426l748m548J0813M605O547K265j797o894Q09
15002c1123m350m15J763o45k574j390k551L683R78k273k07K247p228p072J099
$$ y = [-49468, -54697, -47275, -53127, -56578, -50076, -52707, -65479, -66114, -59418, -55967, -58594, -56810, -46127, -33135, -30229, -28731, -29895, -37978, -38884, -35267, -46713, -45988, -36654, -31244, -28459, -26444, -25141, -33797, -39299, -39696, -48034, -42304, -38209, -33277, -28318, -24382, -21485, -20808, -24954, -34768, -26644, -29614, -26975, -18458, -28373, -36994, -37236, -41707, -45807, -44857, -36301, -38229, -36796, -35173, -39388, -43891, -49319, -54747, -58890, -52830, -46437, -54970, -63304, -56731, -55155, -45937, -37973, -36874, -52450, -63015, -61871, -55754, -41841, -32094, -33166, -35391, -34898, -29127, -28256, -25007, -27395, -36422, -40113, -35774, -34377, -37534, -34303, -25398, -30361, -35579, -40591, -42601, -39175, -42923, -47471, -36658, -32053, -25506, -23241, -25038, -31932, -31123, -35473, -35888, -34125, -34770, -37344, -38734, -41285, -37602, -36624, -38897, -39104, -36857, -44085, -51157, -50058]
14987e0058J7181N515K889j166l706r576n680q01L898k306n921N438m231n58M345
14972d4737J0983L650J5654K5583M8672L7431j6648k8032j6287r111k5845k5940
14960b4627j4373L230Q012P19J556Q125k878o464o739j054N616K015l703l822
14946c4387n629m028n81q627P891P511Q100j58L715l025j3105r956L430R632M397
14931c4820q009j114m194l332k516j251K062N820K302J0517n095p138N83k550
14917d8735J123M779m81M074J566m6k889m866J0434L558r55n985J969L467l930
14902c6917p977J3231P163o558j5853j0047m738Q791k191j750O082J208q383K02
14888e7737k534o788J594N078N274R104N097J1415J689p414m530k835K359N110
$$ y = [-50058, -32877, -27362, -24473, -25639, -29345, -38921, -44601, -45402, -41504, -43810, -49731, -44293, -48524, -49082, -44737, -33754, -30104, -14450, 11133, 59805, 97236, 80588, 52556, 36269, 27158, 1313, -24627, -39000, -35770, -27758, -27039, -25483, -17358, -20236, -26700, -33439, -34493, -28877, -26862, -30565, -34387, -40016, -44044, -44625, -53252, -45361, -37850, -29750, -29908, -26193, -29218, -42323, -52279, -48849, -39217, -34820, -42829, -43943, -48137, -51469, -53985, -55236, -53174, -47354, -45052, -34535, -39630, -46768, -46185, -48735, -47612, -42833, -43314, -39240, -37674, -37720, -40609, -45475, -35041, -31483, -32438, -38423, -36454, -32987, -36917, -44894, -31663, -24500, -31058, -46911, -56958, -61696, -52905, -55096, -56846, -50764, -49556, -57939, -57737, -60271, -67059, -65465, -60387, -55113, -46009, -40912, -29497, -27808, -35222, -39752, -42587, -40228, -35118]
14874c5118L175r973R756R472Q397J163n734j0930j7106o374j326p415J184M149
14860e6680M157M756P164k728p751n442j882q12K871j291o576O39N776J0821m584
14845e1562Q09K854J130J135l41k839l110o003o230P445P489J3877J1251K761
14831b1334j701o910m854K626J2327O572J007j6454p924K208R622m101j622j600
14817c2138L432n88p282j3929o975r564j036N124O696J0182R765L292j1242n573
14803d9836m29J0700kJ545J0086J1809r090p848j2468j0385K196J222j802M294
14789e0008k038k736l329o40j746J3763L877L804M628P325k454q648m9l176r39
14774d2366M996j382n887l264R189K307J161o231m292r74N123k917N214r530o225
$$ y = [-35118, -31943, -41916, -32160, -22688, -14291, -13128, -18862, -29792, -46898, -53272, -54598, -62013, -60829, -56680, -52523, -47767, -40603, -43331, -51082, -56524, -58406, -59218, -56347, -57638, -64214, -63575, -57799, -46978, -51562, -50753, -47899, -46769, -45634, -45975, -48814, -51924, -57927, -64157, -56712, -49223, -35346, -24095, -21334, -23035, -29945, -34799, -32173, -19846, -13274, -12267, -28721, -36645, -34437, -24815, -28916, -30538, -32138, -28706, -29294, -36576, -50505, -57480, -67044, -68080, -62956, -56260, -46078, -36313, -33021, -44263, -49836, -50265, -39565, -39567, -38022, -27936, -16127, -25217, -33065, -45533, -55918, -53722, -52500, -54302, -50008, -52046, -54782, -58111, -58751, -60497, -46734, -42857, -39053, -34425, -27100, -29554, -38202, -38251, -41427, -42366, -37370, -38752, -44639, -47903, -38714, -36407, -35246, -41477, -45769, -46743, -41620, -44537, -39323, -48853, -55078]
14759e5078K606J4557l367r994M157j487O663R396K573j5545m130k52P64m599
14745e3736k562r448L82O130L354J1056Q817J745q96j2018j942O091j517k241
14731d6785L62l961K052L204R850l647N407J904l179j2359j28m87n001j638o271
14716f0677m832j397R777J0821n174k004J0753M977K161l241o81l190Q26k669
14702d4550N914N700L842K641J944K986m950k833r808r200l185n38J850N65q51
14687e0473n690O862k191o458P202J0129K706n293K156J484j833m436K626N526
14673c7683n09p307o604k884p724J893J1997L155k908j219l483j2779M77N19k559
14658f7618Q193O04r197p860J1080J3138J6248K548L723j1340j3114m894r359
$$ y = [-55078, -52472, -37915, -41282, -51276, -47119, -48606, -41943, -32547, -29974, -45519, -49649, -49901, -49137, -53736, -56298, -65746, -65364, -59234, -55880, -44824, -36007, -34262, -35158, -47176, -49118, -43027, -44544, -46785, -46423, -50384, -48332, -45128, -35278, -38925, -33518, -31614, -34793, -47152, -47280, -47767, -52768, -54406, -60677, -65509, -66906, -57129, -46308, -51482, -53486, -42733, -37756, -35595, -38836, -39517, -42707, -41881, -44550, -38636, -32936, -29094, -26453, -24509, -21523, -26473, -29306, -39114, -48314, -51499, -52037, -50187, -49622, -50473, -56163, -49301, -51492, -57950, -50748, -40619, -37913, -43206, -41050, -39566, -41399, -45835, -43209, -37683, -38192, -45499, -52103, -54987, -62711, -60818, -48821, -45666, -48574, -49793, -53276, -66055, -65578, -65059, -67618, -59425, -58821, -68018, -75878, -64798, -51660, -35412, -32864, -29141, -40481, -53595, -58489, -67848]
14645f7848P311J0472L388N75J31o709K082O305m302n565n891m092Q550J7307
14631c8286L911j3817k070N956N192M475m168r067n690o415M496J415J567K166
14617e0335l105N043M80m174l870k936Q307P024n513r257p927J376M244p478j6722
14602h4843l093J2491L567R228K48N922N005K642k489J786j154N21o981o439N229
14587e8360K778l128p518k510N95O153M409L926k812o584n41j463k225O674J198
14572e9408P174J2360P864M310k392p147p687m438q054j790R810J3497M439j1080
14558d2542k692k785o784P008J017q614O498O824q103k564J1158j51O122R421
14544b6187j038j2745m906J0564n555j1855j0299k989m18L235J281j598k65J191
$$ y = [-67848, -60537, -50065, -46677, -46102, -45971, -52680, -50598, -44293, -48595, -54160, -60051, -64143, -55593, -38286, -34375, -48192, -50262, -44306, -39114, -34639, -38807, -47874, -53564, -59979, -55483, -54068, -52501, -50335, -53440, -48397, -47917, -52091, -55961, -58897, -50590, -43566, -49079, -58336, -66263, -64887, -60643, -68121, -84843, -87936, -75445, -71878, -62650, -62402, -56480, -51475, -48833, -51322, -49536, -50690, -50169, -57150, -63589, -58360, -55582, -58710, -66228, -68738, -68143, -61990, -57581, -53655, -56467, -63051, -63592, -65055, -67280, -60606, -59408, -52234, -39874, -32010, -27700, -30092, -37239, -44926, -49364, -57418, -59208, -49398, -35901, -31462, -42542, -45234, -48019, -54803, -47795, -46778, -55392, -48894, -42070, -50173, -52737, -41579, -41730, -35608, -26187, -27225, -39970, -44876, -34312, -39867, -51722, -62021, -65010, -65428, -62193, -60912, -62510, -62775, -61584]
14530f1584k02J4616M128l873Q537P831Q04J818o197o059r507n735N95m347L517
14515e5658M25m011m702N255L704P584M144J147j453k788k305J131m279M239J7
14500d7550K679J1265L379n149m020j909J217m82n260q434R394N174j0901m452
14486e5049P987m650n99K807Q811j736j036l525J157o192m179J3180O929M838
14472c1257l820r671m102p128j3761j0032M350P531J2424M927O428l391l484j28
14458e1114k032N385p166q343r000K687J3516q943K302K087M317Q386k978J2927
14444c7969n960n689n512J1963O748O555K749k424m244N39M245m272K21l122J1399
14429b4773K481k419r549l772L401l537P807J445o824j2976j5043Q263P455l693
$$ y = [-61584, -61786, -47170, -43042, -46915, -38378, -30547, -29743, -27925, -34122, -40181, -49688, -55423, -54828, -59175, -55658, -55233, -59244, -63946, -58691, -54987, -47403, -43259, -42112, -43565, -46353, -48658, -47527, -51806, -47567, -47550, -44871, -33606, -30227, -35376, -39396, -41305, -40088, -40570, -45830, -54264, -44870, -39696, -50597, -55049, -47062, -51712, -52311, -49504, -40693, -42429, -43465, -46990, -45833, -52025, -56204, -43024, -36095, -31257, -35077, -44748, -48850, -55978, -69739, -79771, -75421, -67890, -55466, -50539, -44111, -47502, -50986, -51114, -53146, -47761, -54927, -63270, -72270, -69583, -56067, -65010, -62708, -60621, -56304, -47918, -50896, -37969, -43929, -49618, -55130, -43167, -36419, -29864, -27115, -29539, -33783, -33244, -28999, -33271, -33050, -36172, -24773, -22292, -24711, -34260, -38032, -34631, -38168, -30361, -28916, -35740, -48716, -63759, -55496, -48041, -51734]
14415e1734K533k560k679k01O143P94q326j676n78p744J3108M602R146o917m618
14400e0707M1L932M821M972p291k309r8L313p01j7M401n82l540l492j756j3617
14384f2630m054O504J851q32l871J4476J3249k918p685q671k850k152l218K901
14370e9900j940N89r349L011J3557p433l780M006M269L82R60m904J1368R965N26
14355c8673p568n657j0446j1262N425N986L235O634M158Q881O93m703k061k349
14341d7707n459k406P55O987J788o351l211j860j616l522O02M522n307L830m460
14326f3415o697q714O518J979K25Q074K496n773R433L696k31J532K889K283m921
14311e0626o766K677K670q485n183K213k741l558o280R33q061J251J3700k725
$$ y = [-51734, -49201, -51761, -54440, -54641, -48498, -47704, -56030, -57706, -58284, -66028, -52920, -48318, -39172, -46089, -50707, -50666, -46734, -41913, -36941, -44232, -46541, -46639, -43326, -44027, -44044, -39643, -40225, -43765, -47257, -49013, -62630, -66684, -60180, -58329, -59161, -63032, -48556, -35307, -38225, -45910, -54581, -57431, -59583, -62801, -59900, -61840, -61251, -70600, -67589, -54032, -61465, -65245, -61239, -56970, -56588, -55628, -60532, -49164, -39199, -38673, -46241, -51898, -62344, -73606, -68181, -62195, -58960, -52326, -48168, -39287, -38594, -43297, -45358, -47707, -53166, -55572, -54817, -47830, -46042, -52393, -55604, -57464, -59080, -62602, -62000, -57478, -62785, -58955, -63415, -70112, -78826, -72308, -70329, -70104, -62030, -59534, -65307, -55874, -52178, -52409, -50877, -47988, -45705, -50626, -57392, -54715, -52045, -60530, -65713, -63500, -66241, -69799, -76079, -75146, -83207, -81956, -68256, -70981]
14297g0981j81M069j3375l549P750O72N27N28L340K156k021J3443R869R488o119
14282d4384q695j0942j618r509O223q88N34R360O375k747p003n733P523Q995P521
14267d4988N56m168q951l344p345M601J1136O517m157o872M186K918n398N18k986
14252e7777M488P045O074j810j0667r996r065k966Q378J908j693M329Q32J4734
14238d6186L438m019m72k277m186k023o213J274K305r243Q48J1927N729M081J045
14223d3972j7938j5311K434Q223j672P283P584p718j919m310r821n216N127k753
14209g9979N186j517m263p67j465P644j450j1162J221J1339O844k09J855j237
14195f7960J899m888q630J1510R186j0064K282n140r205K048j990O783J0991Q851
$$ y = [-70981, -71162, -67093, -80468, -84017, -76267, -75595, -75068, -74540, -71200, -69044, -71065, -57622, -47753, -38265, -44384, -53079, -64021, -65639, -75148, -68925, -69813, -69279, -59919, -53544, -56291, -63294, -69027, -61504, -52509, -44988, -44432, -48600, -57551, -60895, -68240, -63639, -52503, -45986, -50143, -57015, -52829, -49911, -55309, -54791, -57777, -53289, -46244, -40170, -41980, -52647, -62643, -71708, -74674, -66296, -64388, -66081, -61752, -60920, -46186, -42748, -46767, -47239, -49516, -53702, -55725, -61938, -60664, -58359, -67602, -66754, -54827, -49098, -45017, -43972, -61910, -77221, -74787, -66564, -68236, -60953, -53369, -61087, -63006, -67316, -77137, -82353, -77226, -79979, -74793, -76310, -80573, -81340, -82805, -75161, -76611, -87773, -86552, -75213, -68369, -68578, -66723, -67960, -66061, -70949, -79579, -68069, -58883, -68947, -66665, -71805, -81010, -78962, -80952, -74169, -63178, -54327]
14181e4327L881j4539r644J0040N671l307k884j033P514j520O456k347j1000j0488
14167g7527K252N88q475p140k791M654N023j762J0502J5012M098o590o239m382
14153g2777n193L189K818k910j0946n438P209J5069Q22n840J976j461L424L200
14139f6858K876K238l317l047l103J772q90J1194Q940k113m047J03K149l108m306
14124f1517K73l770m913k421j263L206o582O80l487q17P688K048L534m444r299
14109h1084j0905O269K935k090o60P551J0570J2621r553j0945J449j042n60P651
14095f7793K630o337q55L668J125j952J807j0015j2158o772J433R233J0285k637
14081g8338j1617l029O632P31R88j817j711N28O320J666J999O2j3670R6J858P427
$$ y = [-54327, -50446, -64985, -74629, -64589, -58918, -62225, -65109, -66142, -58628, -60148, -53692, -56039, -67039, -77527, -75275, -74687, -83162, -90302, -93093, -88439, -83416, -85178, -74676, -59664, -55566, -62156, -68395, -72777, -77970, -74781, -71963, -74873, -85819, -91257, -84048, -68979, -68157, -73997, -72021, -73482, -70058, -66858, -63982, -61744, -65061, -68108, -71211, -69439, -70329, -59135, -50195, -52308, -56355, -56252, -54103, -57211, -61517, -61244, -65014, -69927, -72348, -73611, -70405, -76987, -76307, -79794, -80611, -72923, -70875, -67341, -71785, -81084, -91989, -85720, -82785, -84875, -85535, -77984, -67414, -54793, -64346, -75291, -73842, -74884, -75444, -67793, -65163, -71500, -72355, -68687, -67562, -69514, -67707, -77722, -89880, -96652, -95219, -85986, -75701, -78338, -89955, -92984, -86352, -85621, -84633, -86450, -88161, -87633, -81313, -79647, -77648, -77586, -91256, -91160, -89302, -81875]
14065h1875Q44L620L166k852L70m823l843J264M214j272L129J350j0172j0720
14051i7600m342J4797K573p856P109K494r47m735O655J0379J1511m716m357r215
14037g8250M2R72q97q406J0418N548J756o958q983l956K64O989J0545R031R19
14022f0966L268q014m974n629j0183J502j36l963m795n345J23Q373M860J3848
14008g2031J3052J077k535N84J711K496J0600O187M584n562j5250j0127j9879
13995h5093j0172k895N459L426J4974L579j1839q022j043M284J1668l220o301
13982h5195l249R188M255N130k700q080M881M308L718R89q825l867o659j334M560
13967h2880M240L241l414N666P129K059P723M53Q281l258o312p835r019p631n07
$$ y = [-81875, -81031, -77411, -74245, -77097, -76727, -81550, -85393, -84129, -79915, -81187, -78058, -76708, -86880, -97600, -101942, -87145, -84572, -92428, -85319, -82825, -83772, -88507, -81852, -71473, -59962, -64678, -69035, -78250, -78208, -77236, -78133, -86539, -76121, -70573, -68817, -75775, -84758, -88714, -88450, -81461, -70916, -61885, -60966, -57698, -65712, -70686, -76315, -86498, -84996, -85132, -89095, -93890, -99235, -99112, -90739, -85879, -72031, -58979, -57902, -60437, -59853, -58142, -55646, -45046, -38859, -34275, -39837, -55087, -65214, -85093, -95265, -98160, -92701, -89275, -74301, -70722, -82561, -90583, -91626, -87342, -75674, -78894, -85195, -88444, -79256, -75001, -69871, -72571, -80651, -75770, -71462, -67744, -66755, -75580, -79447, -86106, -87440, -82880, -78640, -75399, -78813, -73147, -66018, -63959, -56236, -55783, -47502, -50760, -57072, -64907, -73926, -81557, -82064]
13952h2064M848j330o369M29q86o043r73N627M685j519m761j0440q83J0109L020
13937h6550m669p583K716P531J1820m584j546R4J2531K745j308P114k609N06o363
13922g0155p287J2487o487l821l659j0475p33j745k613L037n735l37O996M524
13908h6003Q464M96q66l599J0430J2477p700k0963R67q803m881k320j712L215
13894a00798L620N239m568J37J2224r54P06m723o254o038M746k926j437j3117
13880a14143l893J0002J3308J182M311j707M357O332m577k104L451p967K29L942
13866h7277k182j102n940K879N725m499l309K631N209j701N964J0489L549r818
13852g9382m168k576m550j0078j1903j531M641M371J2126j1503O758P344m818
$$ y = [-82064, -77216, -78546, -84915, -84486, -85372, -91415, -92388, -86761, -82076, -83595, -88356, -98796, -99679, -89570, -86550, -91219, -98802, -96086, -88555, -76735, -81319, -82865, -82771, -70240, -67495, -68803, -61689, -64298, -63792, -70155, -77442, -64955, -71442, -75263, -78922, -89397, -90130, -91875, -94488, -91451, -97186, -97523, -90527, -86003, -77539, -77043, -77909, -81508, -71078, -58601, -66301, -87264, -86297, -95100, -99981, -102301, -104013, -100798, -97178, -91939, -96507, -96370, -84146, -85100, -84394, -89117, -95371, -101409, -96663, -99589, -101026, -114143, -118036, -108034, -94726, -93544, -89233, -90940, -86583, -80251, -84828, -86932, -83481, -91448, -91219, -87277, -89459, -90561, -96501, -93622, -87897, -92396, -95705, -93074, -87865, -89566, -83602, -73113, -69564, -79382, -83550, -86126, -90676, -100754, -112657, -114188, -109547, -105176, -93050, -104553, -97795, -90451, -95269]
13839i5269N614m6k434o507J285M867L52M241J2842j724n847j3120J414k541p742
13824a04615J537J4775K063N534p644j1228r211N796K979O949L784Q46j975j2101
13810a02511P66J0383M195l339k012p526j3643Q670P781q610o331j931K314O284
13796a05510R031O548o391K242P422K92n984k166l588M142o845j1330M483Q909
13782i8745M241N784j788K753l490n858j2954j058P409m375l912j425M647L658
13768a05113J1666J633R83J507q037n738N006M083l132l355K638N562R180l96
13754h3513k557r691j1683L285J224n00P950k422N183M319l460N140m318j2734
13740a03777k453k490j39R93J166j1550L944P033J12J3055k267m287n805M092
$$ y = [-95269, -89655, -89701, -92135, -98642, -97357, -92490, -92138, -87897, -75055, -76779, -82626, -95746, -94332, -96873, -104615, -103078, -88303, -86240, -80706, -88350, -99578, -108789, -102993, -100014, -93065, -89281, -88435, -90410, -102511, -101745, -91362, -87167, -90506, -92518, -100044, -113687, -105017, -97236, -105846, -112177, -114108, -111794, -105510, -96479, -89931, -96322, -94080, -86658, -86366, -92350, -94516, -98104, -93962, -100807, -112137, -107654, -98745, -94504, -88720, -90508, -87755, -91245, -97103, -110057, -111115, -103706, -108081, -111993, -113418, -108771, -105113, -93447, -91814, -90831, -89324, -97361, -103099, -98093, -94010, -97142, -100497, -97859, -92297, -83117, -83513, -86070, -95761, -107444, -104159, -102935, -103435, -95485, -97907, -92724, -88405, -91865, -86725, -91043, -103777, -106230, -108720, -108859, -107866, -106700, -118250, -114306, -107273, -107161, -94106, -96373, -100660, -106465, -102373]
13726a02373R05j5593n342J355p85l248K487Q412k078L422O912Q987J6029J7050
13712f3860O494J2781J3319Q291J3053K0234K1710J9639K4782N5888R3599J54090
13700C80020K49995L98778M84993N15450M16367J61088p5813k36249l22272l77906
13690A594451l82336l21023k58938j86741j27167r4525n0209l3780k4713j9092
13680I5927k1927j8660m603q192j2380j0556j2742m845m965o134l972q404j1028
13667c2481j1676j0190j3953r76k533Q048N561j9724j0707L520J1139q1r462m740
13653h8255Q179O887l823p531j6607r502k793K812R649O247J466J300M773k059
13639h9257j5786r989N283M875N55K385J621j381k813n172K156O238O44M039J246
$$ y = [-102373, -101468, -117061, -122403, -121048, -121833, -125081, -122594, -114182, -116260, -112838, -105926, -96939, -80910, -63860, -57366, -44585, -31266, -22975, -9922, 10312, 32022, 51661, 76443, 132331, 225930, 380020, 630015, 1028793, 1513786, 2029236, 2445603, 2606691, 2530878, 2294629, 1972357, 1594451, 1212115, 891092, 632154, 445413, 318246, 223721, 173512, 139732, 115019, 95927, 74000, 55340, 50737, 42545, 30165, 19609, 6867, 2022, -2943, -9077, -13049, -21453, -32481, -44157, -54347, -68300, -69276, -71809, -63761, -58200, -77924, -88631, -85111, -73972, -74053, -83515, -88255, -80076, -73189, -77012, -84543, -101150, -110652, -113445, -110633, -100984, -94737, -93271, -91971, -87198, -89257, -105043, -115032, -109749, -104874, -104319, -101934, -100313, -101694, -104507, -109679, -107523, -101285, -100641, -96602, -95356]
13624i5356j497m507n271q865l310K44P18J250L228k392K71j635k815o289R495
13609a16731J0919R760K227j493k163n763j936j5124k517J3585M533l758P5P365
13595a01021O792J854p155l740j111J490o61P369j1487n810P820j811m466Q562
13581a03375l971p770j393Q538k490q04k840o582j988J545o314k22Q771p669m805
13566a31369l174m123k123k509M131N890Q222r155R45N524Q40j332l276n020k450
13551a38979P95J2347Q23j0917J0109O948q452Q922K434j4177m939L172j366r363
13537a42643n949J2568O723R77Q755J1017J452m668o724O485M544k211m183M948
13523a08909n447j5340K872Q78j2086q580j351l743M732k00o813K031K721n50
$$ y = [-95356, -96853, -101360, -106631, -115496, -118806, -118562, -117844, -116594, -113366, -115758, -115487, -117122, -119937, -126226, -116731, -105812, -96052, -93825, -95318, -97481, -103244, -105180, -120304, -122821, -109236, -104703, -108461, -108386, -101021, -94229, -92375, -99530, -103270, -104381, -102891, -103552, -96183, -107670, -113480, -105660, -107471, -111937, -103375, -107346, -115116, -116509, -107971, -110461, -111265, -114105, -120687, -122675, -121130, -127444, -127666, -118895, -126564, -131369, -134543, -138666, -140789, -143298, -139167, -133277, -125055, -134210, -133265, -127741, -126901, -128233, -131509, -136529, -138979, -138184, -125837, -125014, -135931, -125822, -118874, -127326, -118404, -115970, -130147, -135086, -131914, -133280, -142643, -148592, -136024, -129301, -128324, -119569, -108552, -107100, -111768, -118492, -112007, -107463, -109674, -113857, -108909, -114356, -129696, -126824, -125946, -138032, -146612, -147963, -151706, -146974, -147174, -153987, -151956, -149235, -149785]
13509a49785P487j517j561N107K983L516M420q404o282J750J1943J676q941O600
13495a31008j200L487J3673o623o187n41n236m60K060N772Q12k315n688j2540
13481a45994j427j1580p600Q866K3368P706j0449o167k770q15l692P405J0545
13468a32604k181j18K220P061o720j84m697r372j011O428q516p409Q25R749M28
13453a46101K193j408l36n716o034R91J785K928K204Q934R570J666J0783N431
13439a13110j4935q523m887n710n2L720p246j5293L843j708R574q82n973o818
13425a68000K291J6935j423m344O273L697r22Q368K862L634n387J282M144n420
13411a36010l368N586O795K333m967N792K2764K1194K6602J9292J5756K2874K9613
$$ y = [-149785, -142298, -143815, -145376, -140269, -137286, -133770, -129350, -137754, -144036, -142286, -130343, -128667, -137608, -131008, -132208, -128721, -115048, -121671, -127858, -128399, -133635, -134095, -132035, -126263, -125451, -127766, -133454, -145994, -147421, -159001, -166601, -157735, -134367, -126661, -137110, -143277, -146047, -146862, -150554, -143149, -132604, -134785, -134903, -132683, -125622, -132342, -132526, -137223, -146595, -147606, -141178, -149694, -157103, -156278, -146529, -146101, -143908, -145316, -145652, -151368, -157402, -156411, -154626, -151698, -149494, -140560, -130990, -129324, -118541, -113110, -128045, -136568, -141455, -147165, -147217, -143497, -150743, -166036, -162193, -163901, -154327, -155209, -161182, -168000, -165709, -148774, -150197, -154541, -148268, -144571, -145493, -137125, -134263, -130629, -136016, -134734, -130590, -136010, -139378, -133792, -126997, -124664, -129631, -123839, -101075, -79881, -53279, -33987, -18231, 4643, 34256]
13398C4256K2687J6962J6742L1134L0611J5363P541l991M433J1518O221O122p45
13385A98854M987j150j3099j0745j3660k7021j5239j83j0609n208j9470k9330
13373E8127L476J0494J2569J7125L0525K4893J0560J0079J1673Q590L824K383
13361B04318l199N81L061N527O203r154m698k669j7082k2890l0231k4917k4074
13348H0776k4810l3360k7854q885k4364k3803j1211q733o926m09k483m750q635
13335a05447k328M393J4374J2296J6689J9132K1963K9758L9115M0922L0483K7340
13323A48690L0802K2296J3317K277p331n709r63N69K873J7796N549O295P88j2328
13309B24921n495j4036j9030k0966k6056k9054k1422K392k471J553L163P765K2513
$$ y = [34256, 56943, 73905, 90647, 121781, 152392, 167755, 175296, 171305, 175738, 187256, 193477, 199599, 198854, 203841, 202691, 189592, 178847, 165187, 138166, 122927, 122744, 112135, 106927, 87457, 58127, 61603, 72097, 84666, 101791, 132316, 157209, 167769, 177848, 189521, 198111, 201935, 204318, 201119, 201700, 204761, 210288, 216491, 207337, 202639, 199970, 182888, 159998, 129767, 104850, 80776, 55966, 22606, -5248, -14133, -38497, -62300, -73511, -82244, -89170, -89579, -92062, -96812, -105447, -107775, -103382, -89008, -76712, -60023, -40891, -18928, 10830, 49945, 90867, 121350, 148690, 179492, 201788, 215105, 217382, 210051, 204342, 203379, 203948, 206821, 224617, 230166, 236461, 237249, 224921, 219426, 205390, 186360, 165394, 139338, 110284, 88862, 91254, 88783, 90336, 93499, 101264, 123777]
13296A23777K2391J2986J4784J5984K6285K1785K181l937l911n487P23M53M605
13283B32619J731n271q772k8928k7450k4446l4105l2163k8076l1268l3020k5012
13271d4161k8769l5343k2234k589p681n943m355r715l842n732j155m538q039O987
13257a77109n725j1276j1963n148m089J1348L300j7915m092L401k706L105M107
13244b14762K725m42l877K913M820J3285J3027j662l573m824j0282j809m542k861
13230b11864J4941N394J666K32O341J3334K073j3430j7537m277K048k980J844
13217b02215M86M259K742n881r4L946N835k442k406r037m101Q494k438M138R807
13202a88907K840N193J935P184L668p540J45J1087Q237N837M622r225j254j557
$$ y = [123777, 146168, 159154, 173938, 189922, 216207, 237992, 240173, 236236, 232325, 226838, 227561, 228014, 232619, 234350, 229079, 220307, 191379, 163929, 139483, 105378, 73215, 45139, 13871, -19149, -44161, -72930, -108273, -130507, -133096, -140777, -146720, -151075, -160790, -164632, -170364, -171519, -176057, -184096, -177109, -182834, -194110, -206073, -211221, -215310, -203962, -200662, -218577, -222669, -219268, -221974, -218869, -214762, -212037, -212479, -216356, -213443, -208623, -195338, -182311, -183973, -187546, -192370, -202652, -204461, -209003, -211864, -196923, -191529, -189863, -189631, -183290, -169956, -167883, -181313, -198850, -203127, -201079, -204059, -202215, -201729, -197470, -194728, -200609, -200703, -196757, -190922, -193364, -195770, -204807, -208908, -200414, -202852, -198714, -188907, -186067, -180874, -178939, -171755, -168087, -175627, -175482, -164395, -156158, -150321, -145699, -154924, -156178, -157735]
13188a57735j0910q957p439k778J004j402m531j497K796J619k465r817n493M47
13174b07158j844j4316N86J547O355O470P250n551J153K618k430R79P906P222
13160a89213M162Q929Q685N151O514l030K797l672o43j850K56j952n944j5717
13146a85527o897m814k740o084p654l788P364M201N222k660m175N164J3365M383
13132a84640N80L357J6501J7818M397q201j1988q1K0938J4900m145o103P641L986
13118a25040m072n241m865l986r6j98j1562l726N948o40o333j6410l443M693K449
13103a72522l948L170J4629n849p597l582j373Q603n82k946K37o816m324L343
13089a79557J0801L490K464L043m161o405j2491o754N93m967j1731j1361O051
$$ y = [-157735, -168645, -177602, -185041, -187819, -186815, -188217, -192748, -194245, -191449, -189830, -192295, -202112, -207605, -207158, -209002, -223318, -222732, -221185, -214830, -208360, -201110, -206661, -205508, -202890, -205320, -204341, -196435, -189213, -185051, -176122, -167437, -162286, -155772, -158802, -156005, -159677, -160320, -162170, -161914, -163866, -169810, -185527, -192424, -197238, -199978, -206062, -213716, -217504, -210140, -205939, -200717, -203377, -207552, -202388, -189023, -184640, -184060, -180703, -164202, -146384, -141987, -150188, -162176, -162257, -141319, -126419, -130564, -136667, -129026, -125040, -129112, -134353, -139218, -143204, -143300, -143498, -155060, -158786, -152838, -153478, -159811, -176221, -179664, -174971, -172522, -176470, -173300, -158671, -164520, -172117, -175699, -177072, -168469, -169051, -171997, -171760, -178576, -182900, -179557, -168756, -165266, -162802, -159759, -163920, -170325, -182816, -189570, -188977, -193944, -205675, -217036, -210985]
13076b10985q767j5388k160r058k2375o705n48l258p314j0174p667o989Q228J0592
13062b92568O207O124J320J4605J9767J1612J0315Q789l299k306L396J1564l082
13049b07556p166q977q48l756O41j1402p341m254j0377j7141j1966o369r023l075
13035c08610j270j05J0544J6017j419O926K505P190J9584K7127R157J046Q469
13022b02839M561m11p88J2481P115l338K108K607m51l414q599r39o213j9039j4220
13007b31379j1826j6897j8570j2380k949j3572k190l666j9m29M539J0878J1680
12994b86780P175K688O518O713N163J2430O112N565K3596K6205J4460Q948O805
12981a54402J9530J9994J5762J4509J1030J5438J3430J6973K3441L5662M0639
$$ y = [-210985, -219752, -235140, -237300, -246358, -268733, -275438, -275986, -279244, -286558, -296732, -304399, -311388, -303160, -292568, -286361, -280237, -278917, -264312, -244545, -232933, -222618, -213829, -217128, -219434, -216038, -204474, -207556, -214722, -223699, -224547, -228303, -227662, -239064, -246405, -250659, -261036, -278177, -290143, -296512, -305535, -308610, -309880, -309985, -299441, -283424, -284843, -277917, -275412, -268222, -248638, -221511, -212354, -211308, -202839, -198278, -198689, -199477, -186996, -179881, -183219, -181111, -178504, -178955, -182369, -190968, -191907, -198120, -217159, -231379, -243205, -260102, -278672, -291052, -294001, -307573, -309763, -313429, -313448, -313877, -309338, -298460, -286780, -279605, -276917, -270399, -263686, -258523, -246093, -239981, -234416, -210820, -184615, -170155, -161207, -154402, -134872, -114878, -99116, -84607, -73577, -58139, -44709, -27736, -4295, 31367, 72006]
12970G2006N1711M7213N1998O5615O7937P8280J00798J09071J14643J06920J07114
12959I73306J15677J44238J65503J84143K14643K55604K92684L20188L54874M43751
12949C464611N79443P74315J040989J355922J767445K467311L618677N088119
12941B0156832O164325O146935N352044M495944L873403L606341L284396K479037
12933E5559257J854886J848309J825990J044341k29001j081653r04419K32881
12925F0150591J338878J168280k61897j790149k536237k603938k939016l715128
12917D8811384m129341l722992k617140r77840J107414L090224M232472M245377
12909E0039558L463349K555756K002132J769778J399658R61694Q83973J268454
$$ y = [72006, 123717, 170930, 222928, 288543, 356480, 434760, 535558, 644629, 759272, 866192, 973306, 1088983, 1233221, 1398724, 1582867, 1797510, 2053114, 2345798, 2665986, 3020860, 3464611, 4044054, 4818369, 5859358, 7215280, 8982725, 11450036, 15068713, 20156832, 26321157, 32468092, 37820136, 42316080, 46189483, 49795824, 53080220, 55559257, 57414143, 59262452, 61088442, 62132783, 61903782, 60822129, 59917710, 60150591, 61489469, 62657749, 62395852, 60605703, 58069466, 55465528, 52526512, 48811384, 44682043, 40959051, 38341911, 37364071, 38471485, 41561709, 45794181, 50039558, 53502907, 56058663, 58060795, 59830573, 61230231, 62191925, 63075898, 64344352]
12901F4344352J520033R66142p1511o88872k41727P36500O73623j272649l653647
12892F2312244m599104m273023m074958m615304n390596n664170n077860m148104
12884B4469125l430065k890532k280734j614817j042923o15887l25779r2127J54329
12875A2330590M76779R35852J589058K459581L402986M063648M457904N090955
12867C4807353O109543P066377O947594N436093L490459K256078J941893J865960
12859F9921350J733571J603663J116597L11964k60217n85308q25094p90237l94128
12850G1832161o722m54864j955916l580413m456693m637973m511055l785466k175165
12841D6267894l21443J132051K331923L341384M349279N140341M641823L089794
$$ y = [64344352, 65864385, 66830527, 66759016, 66070144, 65828417, 66564917, 67238540, 65965891, 62312244, 57713140, 53440117, 49365159, 44749855, 39359259, 33695089, 28617229, 24469125, 21039060, 18148528, 15867794, 14252977, 13210054, 12594167, 12268388, 12176261, 12330590, 12807369, 13743221, 15332279, 17791860, 21194846, 25258494, 29716398, 34807353, 40916896, 47983273, 54930867, 60366960, 63857419, 66113497, 68055390, 69921350, 71654921, 73258584, 74375181, 74687145, 74426928, 73841620, 73016526, 72226289, 71832161, 71825439, 71370575, 69414659, 65834246, 61377553, 56739580, 52228525, 48443059, 46267894, 45946451, 47078502, 49410425, 52751809, 57101088, 62241429, 66883252, 69973046]
12833F9973046J498421O14436Q74148J531639J625482J240818R41777O80257l4840
12824G8945184j049937j598449j439143j188116j940673l870234n875429o916296
12816E5066907p079309o810995o336847n692914m857436l901140k994599k311027
12808A5082640j834408j452764j137385q99041p34881o28127n43430m67467m16340
12799F968797l85722l48031l18654k98354k82614k80104k67461k70659k56382
12790D260816k58628k43530k25738j94634j76759j60384j30923j20556j01854
12781B647810q5528q6705p2011m1704l0213l8004n0133m6571m9880o0544n8511
12770B028006m9764l6674k0572k0567l5710m3852m1824n5022o5693n9679n9161
$$ y = [69973046, 71471467, 72085903, 72960051, 74491690, 76117172, 77357990, 78299767, 78980024, 78945184, 77895247, 76296798, 74857655, 73669539, 71728866, 67858632, 61983203, 55066907, 47987598, 41176603, 34839756, 29146842, 24289406, 20388266, 17393667, 15082640, 13248232, 11795468, 10658083, 9759042, 9024161, 8396034, 7852604, 7385137, 6968797, 6583075, 6235044, 5916390, 5618036, 5335422, 5055318, 4787857, 4517198, 4260816, 4002188, 3758658, 3532920, 3338286, 3161527, 3001143, 2870220, 2749664, 2647810, 2562282, 2475577, 2403566, 2361862, 2331649, 2293645, 2243512, 2196941, 2147061, 2086517, 2028006, 1978242, 1941568, 1920996, 1900429, 1864719, 1820867, 1779043, 1724021, 1658328, 1598649, 1539488]
12759A539488m9027l7928l2038l1547l1719j7924j2166k5568m5098l7105l6170
12748A183198l2917l2369l3202l8621k6030k1450k5521j5452j5461q019j5614
12737I18542r044j1058q773J19q387o988k281O645P328Q675O388K6039L5854N3692
12723A016751N9243L9845P318k1811l5942m2035n0608n7921o0742m2479k5217
12712G86402l2165k6775j6063j2161j700j7661J51P259R015J9712L0030L3148
12700G79192K1415K1601Q270n766k1633k9228k8551l3897k1212r005j342l4j0849
12687F68961n975n810P92m109o447q836k1207j6623j2028p396l195M353J068J2699
12673E96247L4373L6457O7093P3721L1069k0054l8050l4476m3216o5632o1520
$$ y = [1539488, 1490461, 1452533, 1420495, 1388948, 1357229, 1339305, 1327139, 1301571, 1256473, 1219368, 1183198, 1150281, 1117912, 1084710, 1046089, 1020059, 998609, 973088, 957636, 942175, 934156, 918542, 909498, 898440, 889667, 889786, 881399, 874411, 872130, 878775, 886103, 894778, 901166, 927205, 963059, 1016751, 1075994, 1115839, 1123157, 1101346, 1065404, 1023369, 972761, 914840, 854098, 811619, 786402, 754237, 727462, 711399, 699238, 697538, 679877, 680028, 687287, 696302, 716014, 746044, 779192, 800607, 822208, 830478, 824712, 803079, 773851, 745300, 711403, 690191, 681186, 679844, 679810, 668961, 662986, 657176, 657968, 653859, 647412, 638576, 617369, 600746, 588718, 581322, 578127, 582480, 583548, 596247, 630620, 667077, 734170, 807891, 838960, 818906, 780856, 746380, 703164, 637532, 576012]
12662E76012m2385l0933k6441p082r157k549K570J042j3176o804J8116J6468R805
12649D85486K2780K2985K0311m989k0460j9162k6018k8291k2470k6088j1798j6063
12637C76223j9853k1826r150p248J658r712j3179J349J1980M439o071J814R812
12624C20236J3273J4817J2788J8311L5983K6166J4774J5422J5023J2410m966k4994
12612D69243l1608k8038r806k3155k4081j8901k301o4L625j1648j6197m914J956
12599C04111P243l343m226L425J9355N155M996q775O231J6584K9552L6363L3632
12586D50303J8424l341j7207j9289j7154j8430j6647p362j2752k4650j5303M232
12574C20824K01j3602j434k772j3341j2824M808p021p099m719j277j2994p932
$$ y = [576012, 533627, 502694, 476253, 469171, 460014, 457465, 460035, 461077, 447901, 441097, 459213, 475681, 485486, 508266, 531251, 551562, 546573, 526113, 506951, 480933, 452642, 430172, 404084, 392286, 376223, 356370, 334544, 325394, 318146, 319804, 310092, 296913, 298262, 310242, 314681, 308610, 310424, 320236, 333509, 348326, 361114, 379425, 415408, 441574, 456348, 471770, 486793, 499203, 494237, 469243, 437635, 409597, 399791, 376636, 352555, 333654, 331353, 331289, 334914, 323266, 307069, 302155, 304111, 311354, 308011, 303785, 307210, 326565, 331720, 336716, 327941, 334172, 350756, 380308, 416671, 450303, 468727, 465386, 448179, 428890, 411736, 393306, 376659, 369297, 356545, 331895, 316592, 320824, 321025, 307423, 305989, 303217, 289876, 277052, 281860, 274839, 267740, 263021, 261744, 248750, 240818]
12561B40818J291j1014p572o335O595J435l170O706J7572J1699J2977J870j1569
12548B61303R715N344q55Q365K1690L8477N8541N4748L7563K5893J4300n087k3049
12535E06948l6834j2244r687k0481k6988k4144k5686j8079j2983j0081j7473k2452
12523B69816q564O173J886L206j175N312J1943K618P496R400R13K641J4528K484
12509C28677p462q047l954K210n164J603L11J943k881o604L790N936O230K1958
12495C38546L0329O0194O0128L2518M831r033r242q109J334j0763p853j0376j4742
12482D57762k7972k7436q522q884q221O897P073J6280J1915J9828J7570K7813
12470D84103K1129K2488K0355Q615M643j232r583k39J3970L169Q486Q9r816O0
$$ y = [240818, 242109, 231095, 223523, 217188, 223783, 225218, 222048, 228754, 246326, 258025, 271002, 272872, 261303, 271018, 276362, 275507, 283872, 305562, 344039, 402580, 457328, 494891, 520784, 535084, 529997, 506948, 470114, 457870, 448183, 427702, 400714, 376570, 350884, 332805, 319822, 309741, 292268, 269816, 261252, 267425, 269311, 272517, 271342, 276654, 288597, 291215, 298711, 308111, 309024, 311665, 326193, 328677, 321215, 313168, 309214, 311424, 306260, 307863, 308174, 310117, 307236, 300632, 304422, 310358, 316588, 338546, 368875, 429069, 489197, 521715, 526546, 517513, 508271, 500162, 501496, 490733, 482880, 472504, 457762, 429790, 402354, 393832, 384948, 376727, 383624, 390697, 406977, 418892, 438720, 456290, 484103, 505232, 527720, 548075, 556690, 561333, 560101, 550518, 550279, 564249, 567418, 575904, 575993, 566177, 566237]
12456E66237J84j227l536q613j4477j1734k8168k6870k0500r631o19J7203R405
12443D67654J6032K6592L2483L8311L6726J3753j443k0309j0631k255j2709N192
12431E89396J1716K2984K8158L0846M8485N6859N3273K6893l242l6111n5916o5579
12419G07762o4534m8164l3321k4279N120J8261K8113M1442M7998J6184j6068m1827
12407F36687m9931n1304l2023k2436j8032J89R725J0029J0907J3860J3726P294
12395E28691J6794K3579K9016J3152M718j0985j9008q79R292n637l754j5599j5906
12382E53474k3377k6179k3014j9187k7937k0285j9109j4145l455R611K1592J7754
12370D25743J2391J7384K7359K8827K4169J6726K3417M749N094J4337L624M895
$$ y = [566237, 566421, 565194, 561658, 553045, 538568, 526834, 498666, 471796, 451296, 441665, 441046, 458249, 467654, 483686, 510278, 542761, 581072, 617798, 631551, 630108, 609799, 599168, 596913, 584204, 589396, 601112, 624096, 652254, 683100, 731585, 788444, 841717, 868610, 865368, 829257, 773341, 707762, 643228, 595064, 561743, 537464, 542584, 560845, 588958, 630400, 678398, 694582, 678514, 636687, 586756, 535452, 503429, 480993, 462961, 463150, 472875, 482904, 493811, 507671, 521397, 528691, 545485, 569064, 598080, 611232, 615950, 604965, 585957, 585078, 594370, 588733, 584979, 569380, 553474, 530097, 503918, 480904, 461717, 433780, 413495, 394386, 380241, 376786, 386397, 407989, 425743, 438134, 455518, 482877, 511704, 535873, 552599, 576016, 580765, 585859, 600196, 603820, 608715]
12358F08715J4899K8435L4190N1388P0113O4685O3357O3614N4480L3092P789j3505
12346A081252n0737o4353o6793o1659m0506k3342O518K4082L3188L1445K6018
12335H95113J0975p147n2451q6299j02063r7182p9763o0243n5809n5509l7889
12324B71733l2943k2331j6636j4034r960j4828k111M250m712j5161j8294r376
12312A15597l168K173o847J869J431m32l174o96L997o765L891M091n970j3815
12298I2182n406R730R999l562L139N106M166J0744P000R378Q062M264R003J0594
12284A74399P858K7820M2960L3742L0928N0747O3164Q1046R2273R0408P2809P5701
12272H43855J23503K11967K88328K76535J58141J4267j01997j52440j61225j69843
$$ y = [608715, 623614, 652049, 686239, 737627, 807740, 872425, 935782, 999396, 1053876, 1086968, 1094757, 1081252, 1030515, 966162, 899369, 837710, 797204, 773862, 780380, 804462, 837650, 869095, 895113, 906088, 898941, 846490, 760191, 658128, 560946, 481183, 420940, 365131, 309622, 271733, 238790, 216459, 199823, 185789, 175829, 161001, 158890, 163140, 158428, 143267, 124973, 115597, 112429, 114602, 107755, 109624, 111055, 110623, 107449, 106753, 110750, 103985, 107876, 111967, 105997, 92182, 86776, 96506, 106505, 102943, 106082, 111188, 115354, 126098, 133098, 142476, 150538, 154802, 163805, 174399, 182257, 210077, 253037, 286779, 317707, 368454, 431618, 512664, 604937, 695345, 768154, 843855, 967358, 1179325, 1467653, 1744188, 1902329, 1916596, 1814599, 1662159, 1500934, 1331091]
12262A331091j59287j46032j36294j20883j08942r7677p4361n1027n9907n0729
12252C25952l0065k6856k3432j2846o504k2476p789M591J0149k808J254J95J56
12239B09521M691J5687J7875K1420K9250L7369N6103J01002J38852J97166K32986
12228A061922K26166J66457O0882n4161j34638j75025j85492j81269j53519j33306
12218D98017q8131o2592m8062l5858k4611j1116j0874p780j2034r151r29P38j770
12205A85847n583r868j621j3325o357M827k157m537q701j3076q777r561j4674
12192I2437j4401l57L399j496k229k735K644J7309N115L663J0706K0934O057j1818
12178A29228j7971p278L631K738O971J6951K4011J8968J4094O681j702o329j7856
$$ y = [1331091, 1171804, 1025772, 889478, 768595, 659653, 561976, 487615, 436588, 376681, 325952, 295887, 269031, 245599, 232753, 226249, 203773, 195984, 200575, 210724, 207916, 209170, 209365, 209521, 214212, 229899, 247774, 269194, 298444, 335813, 391916, 492918, 631770, 828936, 1061922, 1288088, 1454545, 1515427, 1461266, 1326628, 1151603, 966111, 784842, 631323, 498017, 409886, 347294, 299232, 263374, 238763, 227647, 216773, 208993, 196959, 187808, 186879, 187617, 185847, 180264, 170396, 168775, 155450, 149093, 153920, 151763, 147226, 138525, 125449, 116672, 107111, 92437, 78036, 77679, 81078, 79582, 77353, 74618, 77262, 94571, 99686, 103349, 114055, 134989, 141046, 129228, 111257, 103979, 107610, 110348, 117319, 134270, 158281, 177249, 191343, 198024, 196322, 189993, 172137]
12165A72137l845q174j5951m069o710j5435O797J1642n83K697k589k881K1M165
12151A37222k107j5327j3400q610O315j008M896J0413K98L426J4722R534R394
12138A55768J7953O253k625n071j882o992j4005j3161p9k356r530j0409j3029
12125A00835j3860L498l552o589J3399J9185O058q374j9643l124Q665L1514R911
12112A37923j558J0648Q053m12j7283j2308j3608J1718M4627O5285P9473Q3699
12100C96257P8721N6579L6118J6234p076j6623k300j663n18j926j808K2211M4667
12087F18873N1829J4760j8343n035K7965N7855P3639P1821M8136N0175Q9052N9915
12075A140642N145m2692o2313p1384p6242n8751l2899q558J3506M4205P7627J29958
$$ y = [172137, 168292, 160118, 144167, 140098, 133388, 117953, 124750, 136392, 135809, 138506, 135917, 133036, 133057, 137222, 135115, 119788, 106388, 97778, 104093, 103085, 107981, 118394, 118692, 122118, 136840, 146374, 155768, 173721, 179974, 177349, 172278, 170396, 163404, 149399, 136238, 136159, 133803, 124273, 113864, 100835, 86975, 90473, 86921, 80332, 93731, 112916, 118974, 110600, 90957, 87833, 96498, 128012, 137923, 136365, 147013, 155066, 154654, 137371, 125063, 111455, 123173, 167800, 233085, 312558, 396257, 474978, 531557, 567675, 583909, 576833, 560210, 557910, 556247, 555729, 553803, 551995, 574206, 618873, 670702, 685462, 667119, 662084, 690049, 747904, 821543, 893364, 941500, 991675, 1080727, 1140642, 1145787, 1103095, 1040782, 969398, 893156, 834405, 801506, 792948, 806454, 850659, 928286, 1058244]
12063A058244K19168L76602N99669R26257J332138J256224L38972l63164k98696
12054E445414q6105r4684p2726J39030J65872r5618k58692k02097q9064j5489
12044D835841R4128J52393R356p6667O1665K63757L48724L13320L28253M89067
12034F819837N26579J95709j13042j40339j18055j23001M9046L95519N20463K56552
12024H269268O2197K40745O56119J206224K103234K895845J963005k69550j449124
12015A5677963j186247q57932r79993q98003n25633l96054m14749j78399K10800
12006A0451753M71475O05272P60900Q18839Q52771J031849J097090J016694J165712
11997A8272355J891636L192986M914950O978260R366987J1669043J1715933P753090
$$ y = [1058244, 1277412, 1654014, 2253683, 3179940, 4512078, 5768302, 6107274, 5744110, 5445414, 5359309, 5264625, 5191899, 5330929, 5496801, 5401183, 5142491, 4940394, 4851330, 4835841, 4929969, 5082362, 5091718, 5015051, 5076716, 5340473, 5689197, 6002517, 6330770, 6819837, 7346416, 7542125, 7429083, 7288744, 7170689, 7047688, 7096734, 7492253, 8012716, 8269268, 8331465, 8572210, 9228329, 10434553, 12537787, 15433632, 17396637, 17127087, 15677963, 14491716, 13633784, 12653791, 11755788, 11230155, 10834101, 10419352, 10240953, 10451753, 10923228, 11528500, 12289400, 13108239, 13961010, 14992859, 16089949, 17106643, 18272355, 20163991, 23356977, 28271927, 35250187, 44617174, 56286217, 68002150, 75755240]
11989G5755240K226227j242273k442908l508167m987086n259228l610249q49858
11981E6081698J831689M007234N882169P096305O804792L612415k120568o771085
11973G6424649q522043q746748q904002q763276p679847o028272m477641l331320
11965A9971500k560260k067808j685730j280793r83328q68298p99219o26502m59202
11956H640360m11647m31866m26980l90796l45729k90483k61790k54164k37939
11947E588966j76853j60690j91549j95919j69162j25164o7404P82O3559J48902
11937D715468K21519K93228L31564L90327M87701O17687P94884J015020J296805
11928A0164203J686723K146376K540721K916707L527754M632327O359091Q648934
$$ y = [75755240, 77981467, 76739194, 74296286, 70788119, 65801033, 60541805, 56931556, 56081698, 57913387, 61920621, 67802790, 74899095, 81703887, 85316302, 83195734, 76424649, 67902606, 59155858, 50251856, 41488580, 33808733, 27780461, 23302820, 19971500, 17411240, 15343432, 13657702, 12376909, 11393581, 10525283, 9726064, 9099562, 8640360, 8228713, 7796847, 7369867, 6979071, 6633342, 6342859, 6081069, 5826905, 5588966, 5412113, 5251423, 5059874, 4863955, 4694793, 4569629, 4502225, 4503007, 4566566, 4715468, 4936987, 5230215, 5561779, 5952106, 6439807, 7057494, 7852378, 8867398, 10164203, 11850926, 13997302, 16538023, 19454730, 22982484, 27614811, 33973902, 42622836]
11920D2622836J1042035J2831912J4543456J5740204J4705731J1453850P302588
11913A30242612K267910k702288n876020o902081o286889m379148j290849K318276
11905A07391523N429393P412040P743276N798250J793114k360357n800363r777095
11897A17629781j3381368j4828555j4081246j2594093j1049124r260736p235845
11890C5198814n469727m228745l378110k707984k196151j795727j492119j285305
11882A2644946j111429r47426p73627o47803n67983n10256m72331m17800l55216
11873F841075k88727k34524j92886j67762j69039j55400j29902r4888n1364r14
11863E355669K4755O1222J04847J21872J22896J32248J65981K21946L09688M34905
$$ y = [42622836, 53664871, 66496783, 81040239, 96780443, 111486174, 122940024, 130242612, 132510522, 129808234, 123932214, 117030133, 110743244, 106364096, 105073247, 107391523, 112820916, 120232956, 127976232, 133774482, 135567596, 133207239, 127406876, 117629781, 104248413, 89419858, 75338612, 62744519, 51695395, 42434659, 35198814, 29729087, 25500342, 22122232, 19414248, 17218097, 15422370, 13930251, 12644946, 11533517, 10586091, 9812464, 9164661, 8596678, 8086422, 7614091, 7196291, 6841075, 6552348, 6317824, 6124938, 5957176, 5788137, 5632737, 5502835, 5407947, 5356583, 5355669, 5380424, 5441646, 5546493, 5668365, 5791261, 5923509, 6089490, 6311436, 6621124, 7056029]
11853G056029O11486Q15902J015090J271798J645576K163384K961241M106649
11845B1647155N662003P641970R565101R999808Q503010N843762K114403j910392
11837F9066820m201769m541666m272428l639802j990717J61551K001488L586731
11829E6170208N081885N978561M914350J240439l408305o687134q031516q078837
11821D7179651p609042o767874n557939m189286k933171j890285j117506n38290
11813A6576258o6357L35365P68880J181333J520380J781559K147945K814322L867160
11804C0926845N409662P818244J1905869J9227986L1648236M8268846O0676454
11797B15882142N7505481L4919213L216106k0901296l2682679l7805946m0370480
$$ y = [7056029, 7667515, 8483417, 9498507, 10770305, 12415881, 14579265, 17540506, 21647155, 27309158, 34951128, 44516229, 54516037, 63019047, 68862809, 70977212, 69066820, 64865051, 60323385, 56050957, 52411155, 50420438, 50581989, 52583477, 56170208, 61252093, 67230654, 72145004, 73385443, 69977138, 63290004, 55258488, 47179651, 39570609, 32802735, 27244796, 23055510, 20122339, 18232054, 17114548, 16576258, 16509901, 16845266, 17614146, 18795479, 20315859, 22097418, 24245363, 27059685, 30926845, 36336507, 44154751, 56060620, 75288606, 106936842, 155205688, 215882142, 273387623, 308306836, 311522942, 290621646, 257938967, 220133021, 179762541]
11790A79762541l9241239l3644076k5620086j7876467j1940676q065252n804677
11783C7570068m509436l684234l058525k509983k041150j612582j242708r04800
11775A8006650n82207k46363R7537M60252Q32464J193223J514675J859559K272183
11766B5407973K777372L481759M578919O320527Q894422J2896293J9589026K9456308
11758A13402599M0355421M7959502M7582743L6340463J6100161o091222k4138633
11751B71511034l4944095l8992334l8442776l4797681k8994419k2038610j5440995
11744E7860124j0348456p016371n081467m027005l399850k929358k549610k230298
11736B0277709j913660j614470j371079j190999j056301r48580q57627p80106
$$ y = [179762541, 140521302, 106877226, 81257140, 63380673, 51439997, 43374745, 37570068, 33060632, 29376398, 26317873, 23807890, 21766740, 20154158, 18911450, 18006650, 17424443, 17178080, 17275617, 17735869, 18568333, 19761556, 21276231, 23135790, 25407973, 28185345, 31667104, 36246023, 42566550, 51460972, 64357265, 83946291, 113402599, 153758020, 201717522, 249300265, 285640728, 301740889, 295649667, 271511034, 236566939, 197574605, 159131829, 124334148, 95339729, 73301119, 57860124, 47511668, 40495297, 35413830, 31386825, 27986975, 25057617, 22508007, 20277709, 18364049, 16749579, 15378500, 14187501, 13131200, 12182620, 11324993, 10544887]
11728A0544887p08425o69886o37877n97747n55631m94595m19932l46017k91335
11719E823442k31721k16570k19175j96258j80129j82768j83496j78410j74822
11710D060093j77608j69315j76049j51281j34640j19419r8385q0948p0759m2848
11700B838841l4423m5192n3822n2672n0151m9773n4478n1676n4937n4860o3348
11689B273509o0339o2955p8948o5434m2980k2019j6605j7289j9013l1048l9610
11678A817269m7756m4169n6853p2735o2953m0373k7165m695J1306J5445J5516
11667A502837J5558J8514K4174M068j5919j1899l337j7784k1320k1277j3925k999
11655A456691j060j9924j9611j9017l2700j6844k5497j3639k5616l7419n3183
$$ y = [10544887, 9836462, 9166576, 8528699, 7930952, 7375321, 6880726, 6460794, 6114777, 5823442, 5591721, 5375151, 5155976, 4959718, 4779589, 4596821, 4413325, 4234915, 4060093, 3882485, 3713170, 3537121, 3385840, 3251200, 3131781, 3033396, 2952448, 2881689, 2838841, 2804418, 2759226, 2705404, 2652732, 2602581, 2552808, 2498330, 2446654, 2391717, 2336857, 2273509, 2213170, 2150215, 2071267, 2005833, 1962853, 1940834, 1924229, 1906940, 1887927, 1856879, 1817269, 1769513, 1725344, 1668491, 1595756, 1532803, 1492430, 1465265, 1460570, 1471876, 1487321, 1502837, 1518395, 1536909, 1561083, 1565151, 1549232, 1537333, 1533996, 1516212, 1494892, 1473615, 1459690, 1456691, 1455631, 1435707, 1416096, 1397079, 1364379, 1347535, 1322038, 1308399, 1282783, 1245364, 1192181]
11644A192181n8123n5230l9508l0132j9668n229J254R442J2543m013j6113j6722
11632I70682j6810j767N109R460L9495K7238J7830K0684J2805n690n591l255p356
11619A062834n772m33K79j0988j3607k7427l4528k2742l3530l3908k8565l2579
11607H19034m6035n4408m6304k3969p804r616L421J2894K2042L2439M8408M4052
11595G94154L6067K2929K5480J7519O087p47N011M932l177o166j3958q644j639
11582H77848L686J653j0415l149n241k283O281K345j1949m101j108j6914k9745
11569H06908m0275l3069l8671m5475m2646l8743l8767o709K076K6372L5381L4653
11557F21035M9635M1565L4469L9404L2652M5294N7977P5504O1433L8842J0079
$$ y = [1192181, 1134058, 1078828, 1039320, 1009188, 989520, 984291, 985545, 994987, 1007530, 1003517, 987404, 970682, 953872, 952105, 957214, 966674, 1006169, 1033407, 1051237, 1071921, 1084726, 1079036, 1073445, 1070190, 1062834, 1057062, 1056629, 1056908, 1045920, 1032313, 1004886, 970358, 947616, 914086, 880178, 851613, 819034, 772999, 718591, 672287, 648318, 640514, 630898, 634319, 647213, 669255, 701694, 750102, 794154, 830221, 853150, 878630, 896149, 902236, 901489, 906500, 911432, 908255, 902089, 888131, 879487, 877848, 881534, 883187, 872772, 869623, 864382, 862099, 868380, 870725, 858776, 854675, 853567, 836653, 806908, 766633, 733564, 694893, 649418, 606772, 568029, 529262, 522553, 524629, 551001, 586382, 621035, 670670, 712235, 746704, 786108, 818760, 864054, 922031, 997535, 1058968, 1097810, 1107889]
11546A107889q449k2495l4584m3492l4588j4879k901M646L0698M6895N4898M4026
11534A127664N958j9919k9836l6326n0123o7853n9701m2489l2459l1769k2233
11523G40914j7705l933l713j1834j3109j2166j1371m517j3339o336J908j496m310
11510F38993N594q414q816j6609j3582r70j5341j4672j0442p134q023p807k376
11497E30401J232q533k0898j8346j9254j2749N958L3571N5619O4929N6415L3494
11485G01839M1500K9696J5432M838O41K0972L3078O0934Q8866P7976P0158N7999
11473A203929M9701M5766J5820l6396o5634n5804l3710k2231l476K8462K1427
11462A147854K5150L5200K5648J820l2220m8701q4742r4505j00128q6240p8242
$$ y = [1107889, 1099440, 1076945, 1042361, 998869, 964281, 949402, 946501, 951147, 981845, 1028740, 1083638, 1127664, 1133622, 1113703, 1083867, 1047541, 997418, 929565, 869864, 827375, 794916, 763147, 740914, 723209, 719276, 715563, 703729, 690620, 678454, 667083, 662566, 649227, 642891, 644799, 643303, 638993, 644587, 636173, 627357, 610748, 597166, 596196, 580855, 566183, 555741, 548607, 540584, 532777, 530401, 531633, 523100, 502202, 483856, 464602, 451853, 457811, 491382, 547001, 611930, 668345, 701839, 743339, 773035, 788467, 793305, 793946, 814918, 847996, 908930, 997796, 1075772, 1145930, 1203929, 1253630, 1299396, 1315216, 1278820, 1213186, 1157382, 1123672, 1101441, 1097965, 1126427, 1147854, 1173004, 1208204, 1233852, 1235672, 1203452, 1154751, 1070009, 975504, 875376, 789136, 710894]
11451G10894o4236l9261j7147R215L5193M2908L2854R488K191j077n677n699j6146
11438F93500l0593j3134p718k3119j7058j3209q453K325r385r504r933p485L2
11425E46266j147J400o160m749p001J118j656r205k493K018J595Q49M021O973
11411E31829J2217J2498N829j663J5389J79J789J8969L1407L3954N7500N7375
11399G77272L8813K2447J2852k0766m0786l5877k2154j4424j6221Q604K2256K5510
11387G57526M1893L8934K3347j1020m1175m2947m8098n0908m5665l7855k6251
11376E57781k0303j5904r073m247j5r638j3482q855l757m524o688n281j097P55
11362D55672k468p639q980L697R457m960j3391o833N92p60k327k844O023j156
$$ y = [710894, 646658, 607397, 590250, 599465, 634658, 677566, 710420, 719908, 722099, 721022, 715345, 709646, 693500, 662907, 649773, 642055, 618936, 601878, 588669, 580216, 582541, 573156, 563652, 553719, 546234, 546266, 545119, 546519, 540359, 535610, 528609, 529727, 528071, 518866, 516373, 518391, 519986, 520835, 524856, 531829, 544046, 556544, 562373, 560710, 576099, 576278, 578067, 597036, 628443, 662397, 719897, 777272, 816085, 838532, 851384, 830618, 789832, 753955, 731801, 717377, 701156, 709760, 732016, 757526, 799419, 838353, 861700, 850680, 809505, 766558, 718460, 667552, 621887, 584032, 557781, 537478, 521574, 512501, 508254, 508239, 498601, 485119, 476264, 472507, 467983, 461295, 456014, 454917, 455672, 453204, 445565, 436585, 440282, 449739, 444779, 431388, 424555, 425147, 424387, 422060, 419216, 425239, 424083]
11348D24083J806k05N388J09k29m58j3022N069J242j306k310j458O293P569J3828
11333D46399P565P136J0814J5698J6980J5929J8089J3385K3035L5337N7418P9854
11321G47639J29200K04147K76860L20130K47782R7306n3358j41642j96829k14821
11311A416414k13103j81203j55813j06077o8057n6896l9410k6116j8901j8507
11301E32331k2830k1193j6876p5p14p939m984K33q97P53o72J639L312O744J9717
11286D88549J6074K1371K8925L4254N2632P7314J08299J79643K36346K82185K45845
11275A771437J64684M6797o9508j60299k00798k19253k16415j82890j40829j01575
11265F91351p1558m7091l9810k2715j0179q698j8010j2489j1685n95q193j7351
$$ y = [424083, 425889, 425684, 431072, 431181, 430952, 430494, 417472, 422541, 423783, 422477, 420167, 418709, 425002, 432571, 446399, 453964, 461100, 471914, 487612, 504592, 520521, 538610, 551995, 575030, 610367, 667785, 747639, 876839, 1080986, 1357846, 1677976, 1925758, 2023064, 1969706, 1828064, 1631235, 1416414, 1203311, 1022108, 866295, 760218, 692161, 635265, 595855, 569739, 550838, 532331, 509501, 488308, 471432, 471357, 470643, 462704, 457720, 457953, 457056, 457809, 457137, 458776, 462088, 468832, 488549, 504623, 525994, 554919, 589173, 641805, 719119, 827418, 1007061, 1243407, 1525592, 1771437, 1936121, 1982918, 1913410, 1753111, 1552313, 1333060, 1116645, 933755, 792926, 691351, 619793, 572702, 532892, 510177, 499998, 491300, 473290, 460801, 449116, 448521, 440328, 422977]
11253D22977m036l276K048j0406p850o111j107m5l154r569j195L705Q147j1444
11239C78684j8313L191J1940o779M821M931o912J270k213o177J388O462p946N050
11225C69397J863o099K379j3237j8166K9N884k384p40P691l981K90R73O165K44
11210C50308m318o555j985M195k564M5n66j909m356p84R475K104j5960m041n984
11195C17105k584J1811P709R0k570j343N529R219l327K467P981J437n364p386
11181C40774n894p145n492l77M117L112j933p173Q040L930n906l710O748l58n014
11166C23719n431L381J2904j114m135o257O2J3173r77l178j047J379k652m541
11152C25286j1152q356J1356Q276k926p04j224k50l437J0797j2001k457P997j229
$$ y = [422977, 418941, 415665, 417713, 407307, 399457, 393346, 392239, 392194, 389040, 379471, 378276, 381981, 390128, 378684, 360371, 363562, 375502, 368723, 373544, 378475, 371563, 372833, 370620, 364443, 365831, 372293, 364347, 369397, 371260, 365161, 367540, 354303, 336137, 336166, 342050, 339666, 338926, 346617, 342636, 342926, 343899, 350064, 350308, 345990, 339435, 337450, 341645, 339081, 339126, 338560, 336651, 332295, 331511, 340986, 343090, 327130, 323089, 317105, 314521, 326332, 334041, 334131, 331561, 330218, 335747, 344966, 341639, 344106, 352087, 353524, 348160, 340774, 334880, 327735, 322243, 321866, 325983, 329095, 327162, 319989, 328029, 331959, 326053, 322343, 329091, 328733, 323719, 318288, 321669, 334573, 333459, 329324, 323067, 323129, 336302, 335325, 332147, 331100, 332479, 329827, 325286, 314134, 305778, 317134, 325410, 322484, 321780, 320556, 320306, 316869, 327666, 315665, 313208, 321205, 319976]
11138C19976j0818q259P332M58n179o522j991N94L025J6576L630n782k739M689
11124C14990j782L05J475l487q773m38K774K571k118m690l139K252J249N737j0145
11109B96781J94J2453n624p017q024K333J0083L847N882J7738q26J461J9259L6107
11095C84647J883j7243j0478q618k2166k943m696j0519r253m593r800r440n290
11082B71491R058K652o67J3679j230m303j935J974j099m301k607j243j206R107
11068B89370L349l89O612j1014l257M408J827j971l166K26l200l211n81L243R178
11053B91424L857K030J656K436k853p719q876j030p39J0077j0458p662m113j326
11039B66704m943J5831O518n937j663n65l28l727p301k14L800r67j0007L699J0839
$$ y = [319976, 309158, 300899, 308231, 308689, 303510, 296988, 294997, 295591, 298616, 315192, 318822, 313040, 310301, 314990, 313208, 313513, 314988, 311501, 302728, 302290, 305064, 307635, 305517, 300827, 297688, 299940, 301189, 306926, 296781, 296975, 309428, 303804, 296787, 288763, 291096, 301179, 305026, 310908, 328646, 327820, 329281, 348540, 384647, 386530, 369287, 358809, 350191, 328025, 325082, 320386, 309867, 300614, 296021, 286221, 276781, 271491, 280549, 283201, 282534, 296213, 294983, 290680, 288745, 290719, 289620, 285319, 282712, 281469, 280263, 289370, 292719, 292330, 298942, 287928, 284671, 289079, 290906, 288935, 285769, 285995, 282795, 279584, 279003, 282246, 291424, 295281, 297311, 298967, 301403, 298550, 290831, 281955, 280925, 280186, 290263, 279805, 272143, 268030, 266704, 261761, 277592, 284110, 278173, 276510, 275945, 275617, 271890, 264589, 264375, 268175, 267208, 257201, 260900, 271739]
11024B71739O742k483k441N221r210j543P716k903P109J1328q931j3600J4529
11011B83273O585n175j805j477K709k968n818K803K939l160j2183m171k94n068
10997B56190j236J2474J0497l152K342R078j970o083n876J3780K767l263k472
10984B83076o379k171l231R59J1399N556J975q087l153K735k180L184K120k068
10970B83735j6048k341K769M012Q934P890J729L445o915q821K535R164n280p993
10956B76815l459m245n823Q53l874J845m18j1179P5l813r51L513J0002J823n705
10941B55459n180J54l039M463J5602j078r179J871l52m010L821J7985M497k862
10927B78152p242n861P165j585P995k063j3083k095q033m483J848O839j609O55
$$ y = [271739, 278481, 275998, 273557, 278778, 269568, 268025, 275741, 272838, 279947, 291275, 282344, 268744, 283273, 289858, 284683, 282878, 281401, 284110, 281142, 275324, 278127, 281066, 277906, 265723, 261552, 261258, 256190, 254954, 267428, 277925, 274773, 277115, 286193, 284223, 278140, 272264, 286044, 288811, 285548, 283076, 276697, 274526, 271295, 272254, 283653, 289209, 291184, 283097, 279944, 282679, 280499, 283683, 285803, 283735, 267687, 265346, 268115, 272127, 281061, 288951, 290680, 294125, 287210, 278389, 280924, 290088, 284808, 276815, 273356, 269111, 263288, 264141, 260267, 262112, 261694, 250515, 250590, 246777, 245826, 249339, 259341, 261164, 255459, 250279, 250433, 247394, 251857, 267459, 266381, 257202, 259073, 258721, 254711, 258532, 276517, 281014, 278152, 270910, 265049, 272214, 270629, 278624, 276561, 263478, 261383, 253350, 248867, 250715, 257554, 255945, 256600]
10913B56600O352Q889l870n178j197M30j59J658j610l75J790n583l159L756P694
10898B66038M620n652o49k505j899Q332J263L403k546o90J301j281j1928l3m528
10883B53246O627Q418k667Q30M022J714j912K70j08L26j97n37J835p247j416J00
10867B63304J711k886J486P979l200j939l239m540n604J759r174p723n485K675
10853B35124Q873N457L028J112J1279R322j735l764n849l17P98J159n389J1577
10839B70675N990j1173n038J738K355n891k945n158j2860o387P382K925J470J0694
10825B53777J5775j359j1516n415J3083N145l215J316O501j0712j3286n190K072
10812B46976o445J703J165P443J4788N639l73k944j629n797p333l89M451o234
$$ y = [256600, 262952, 271841, 267971, 262793, 261596, 262026, 261867, 263525, 261915, 261540, 263330, 257747, 254588, 258344, 266038, 270658, 265006, 264357, 261852, 259953, 268285, 269548, 272951, 270405, 269715, 271016, 269735, 257807, 257774, 253246, 259873, 268291, 265624, 266454, 270476, 272190, 270278, 270548, 270440, 270766, 270569, 270032, 271867, 264620, 263204, 263304, 265015, 262129, 263615, 271594, 268394, 266455, 263216, 258676, 253072, 254831, 245657, 237934, 232449, 235124, 243997, 249454, 252482, 253594, 264873, 274195, 272460, 268696, 262847, 262530, 263328, 264487, 259098, 270675, 276665, 265492, 260454, 262192, 264547, 258656, 255711, 250553, 237693, 231306, 238688, 241613, 243083, 253777, 269552, 268193, 256677, 251262, 264345, 269490, 266275, 267591, 274092, 263380, 250094, 244904, 246976, 240531, 242234, 243399, 250842, 265630, 271269, 270896, 267952, 266323, 260526, 253193, 252804, 257255, 251021]
10798B51021P03o130O717l565p862k975o035O528K093J612L852K078Q913M91j2805
10783B44636j3012n727O53P778P424N133j33m117J821p292j210J4328K531n411
10769B47402q859j0418q117j1291N272Q627J5795J521N169m100n588M840J1477
10756B51730j541l233o444j4395P04Q755O271l551M781J0847P803Q535M214l220
10742B71256j254j492o618n94M118J3266J1439J590j2096M81J0035q491J177k261
10728B80556J919L029j1843m158j2068l7O237O795q865m179n303k476J842j080
10714B50369R646Q850N562q758l889j1353l983j1738m137Q667J3058J0869J05
10701B63268o165m379J3721J7123n054k774P573Q445n2j345L065o070k076J564
$$ y = [251021, 251724, 245594, 252311, 248746, 240884, 237909, 231874, 238402, 240495, 242107, 245959, 248037, 256950, 257441, 244636, 231624, 225897, 226550, 234328, 241752, 246885, 246752, 242635, 244456, 237164, 235954, 250282, 252813, 247402, 238543, 228125, 220008, 208717, 213989, 222616, 238411, 239932, 245101, 241001, 235413, 240253, 251730, 250189, 246956, 240512, 226117, 226821, 235576, 241847, 238296, 243077, 253924, 261727, 270262, 274476, 271256, 270002, 268510, 261892, 261298, 265416, 278682, 290121, 291711, 279615, 280096, 290131, 281640, 282817, 280556, 282475, 285504, 273661, 269503, 257435, 257398, 263635, 270430, 261565, 257386, 252083, 249607, 251449, 250369, 260015, 268865, 274427, 265669, 261780, 250427, 246444, 234706, 230569, 239236, 252294, 263163, 263268, 257103, 252724, 266445, 283568, 278514, 275740, 283313, 291758, 291706, 290361, 293426, 287356, 285280, 286844]
10687B86844l293n201K913J0959k199j0359o840n402j6249j7473q165m016K578
10674B24097J3518O968r220L24k510m903L778Q715Q958j126j1424M108P893K61
10660B49437J119n36O84J125Q660O563K184p341j935p282k994N350K828L713J87
10645B61762L459k461n043J148j1049n441p365k698j3030q627J0745J8156Q369
10632B47925K395O709J0076K794J864r144n383J153j49p957K626k322L371j736
10618B52222q970l576o30L506N389m5P40r276p745j74l116j996L424M906Q298
10603B42957k468J375j292j0004j767M953O317P135n594J219N274r74O289k821
10589B50599l410j2405J574K463m862l442r520n023L890M405J4238m794k276j282
$$ y = [286844, 283551, 278350, 281263, 292222, 290023, 279664, 272824, 267422, 251173, 233700, 225535, 221519, 224097, 237615, 244583, 235363, 235687, 233177, 228274, 232052, 240767, 249725, 248599, 237175, 241283, 249176, 249437, 250556, 250020, 250704, 251829, 260489, 267052, 269236, 261895, 259960, 252678, 249684, 255034, 257862, 261575, 261762, 265221, 262760, 257717, 258865, 247816, 242375, 235010, 232312, 219282, 210655, 221400, 239556, 247925, 250320, 257029, 267105, 269899, 271763, 262619, 257236, 258389, 258240, 250283, 252909, 250587, 253958, 252222, 243252, 239676, 239046, 242552, 247941, 247896, 248636, 239360, 231615, 231441, 228325, 226329, 229753, 234659, 242957, 240489, 241864, 240572, 230568, 228801, 233754, 240071, 247206, 241612, 242831, 248105, 247131, 253420, 250599, 247189, 234784, 236358, 238821, 233959, 230517, 220997, 215974, 219864, 224269, 238507, 233713, 231437, 230155]
10575B30155p249o956M29O071Q462K136L031o271l351Q290Q816l76j916l770J1127
10560B48628k731j543J596m002J340J436o968j271L194J871L871L611j881O43
10546B47794r644j3356m275M551J2557o078n866O735j577j3735m465P959J002
10533B21602N132P201N994q816Q135j519N809M079P51l942n735l201N076q042
10519B32524j3301J119R55R408K03K333P23J433J0260J515q458K761j0776Q762
10505B39461R355m380p522L624O506m694M540O875p173j1275J019O843J2134j16
10491B55197r103j0146p90M689J504O056Q654J512K562q522L803Q662p767n372
10477B50939Q26N3q33O549O414Q369K860M719Q844L414J4055M002P11j4616j4136
$$ y = [230155, 222906, 215950, 216379, 222450, 230912, 233048, 236079, 229808, 226457, 234747, 243563, 243187, 241271, 237501, 248628, 245897, 244354, 245950, 241948, 243288, 244724, 237756, 236485, 239679, 241550, 245421, 249032, 247151, 247794, 238150, 224794, 220519, 225070, 237627, 231549, 225683, 232418, 230841, 217106, 212641, 220600, 221602, 226734, 233935, 239929, 231113, 239248, 237729, 243538, 247617, 248368, 244426, 238691, 235490, 240566, 232524, 219223, 220342, 221297, 230705, 230908, 233241, 233964, 235397, 245657, 247172, 238714, 241475, 230699, 239461, 248816, 244436, 236914, 240538, 247044, 242350, 246890, 253765, 246592, 235317, 236336, 243179, 255313, 255197, 246094, 235948, 235158, 239847, 241351, 247407, 256061, 257573, 260135, 251613, 255416, 264078, 256311, 250939, 251765, 251818, 250985, 257534, 263948, 272317, 275177, 279896, 288740, 292154, 306209, 310211, 310922, 296306, 282170]
10462B82170j034m821q981J296N401K093j1398j443n735n636O459O927j1710j1566
10448B42022p49J0349L757k357Q464L487j081K622j1602j2808N50N575K404J0093
10434B60726K583o879j030k631R744M496P549N595L765K1853J3651J9791J7890
10421C57103J4244J2729P125n630j2332n764J220r555j5983k1322j9642q487j2813
10408B80893q062o760j605m29L879N343l159j0505o13j479m889J2367J476N900
10394B72357O14k33j692m865m348K265Q08k191K34J2169J3385Q958P2N543K1345
10379C24421K0366J7408J5631J9890J730P546N978p761k380K427n432j9312j1711
10366C68801k5855k0406j8033j4453j0151p592k9j140m219L084M965m296n294
$$ y = [282170, 281136, 276315, 267334, 268630, 274031, 276124, 264726, 263283, 257548, 251912, 258371, 265298, 253588, 242022, 241273, 251622, 255379, 253022, 261486, 264973, 263892, 266514, 254912, 242104, 242654, 248229, 250633, 260726, 263309, 256430, 255400, 252769, 262513, 267009, 274558, 280153, 283918, 305771, 319422, 339213, 357103, 371347, 384076, 391201, 385571, 373239, 367475, 368695, 359140, 343157, 321835, 302193, 293706, 280893, 272831, 266071, 264466, 264037, 267916, 273259, 270100, 259595, 258982, 257503, 252614, 264981, 266457, 272357, 272971, 272738, 271046, 266181, 261833, 264098, 264906, 262715, 262949, 275118, 288503, 297461, 297533, 303076, 324421, 344787, 362195, 377826, 397716, 399446, 406992, 412970, 405209, 402829, 405256, 399824, 380512, 368801, 342946, 322540, 304507, 290054, 279903, 272311, 272282, 271142, 266923, 270007, 274972, 270676, 265382]
10353B65382q31j08k832k480J901n247L342N028J0811j383r754l444O185O895
10339B73465k287M578J3665J3016J1556J0851Q161P049J7151J8262J3081M137
10327C92685j48r11n178j2897k0484j8347j8433k931l378j1464q315j4772l266
10314B72161q40j609o534j2707n100k355k449K792J472n612K588P279j412m588
10300B43086K234J099M534o679n121P003J8934J0734J3570J7658J2144M222P181
10287C30599N020N377N413k027N582j099k686j628j704q556r625r18j2086m307
10273C07355m519p667R016k889j954l085j0174j8838r763q483N91N122J826J0349
10259B66887J4649n135o821J265N435R668k878p233j92k160J649P267k502P34
$$ y = [265382, 264551, 264443, 261611, 259131, 261032, 255785, 259127, 264155, 274966, 273583, 263829, 260385, 266570, 273465, 271178, 275756, 289421, 302437, 313993, 324844, 333005, 340054, 357205, 375467, 388548, 392685, 392537, 391626, 386448, 373551, 353067, 334720, 316287, 313356, 309978, 298514, 290199, 275427, 272161, 271321, 269712, 263178, 250471, 245371, 243016, 240567, 243359, 244831, 239219, 241807, 249086, 247674, 243086, 245320, 246419, 250953, 244274, 239153, 246156, 265090, 275824, 289394, 307052, 319196, 323418, 330599, 335619, 340996, 346409, 344382, 349964, 348865, 346179, 344551, 342847, 334291, 324666, 323748, 311662, 307355, 302836, 295169, 304185, 301296, 299342, 296257, 286083, 267245, 257482, 248999, 249590, 254712, 256538, 266887, 281536, 276401, 269580, 270845, 276280, 285948, 283070, 275837, 275645, 273485, 275134, 282401, 279899, 280633]
10245B80633O272J7944R127J719M313l259M175j997J409j748J9755J0628n521
10232C43450k391r948k0063j6649o867n97L746j0798M938J2008J8650J4340K4059
10219C53878J8102J693L564j2741j8322j4288j1769r821r414l987J111m66q91
10206B96649p946K447k579N15l171k652J7849J4971L193j2335L822N347K286l019
10192C15377N129L8j1177J553L788k023n100l740J638n777j7328j0864O612J2610
10178B90736Q376j86l439m726k525n218J501j209n908Q50J994R488K902k197o333
10163B84106L328n091o74l608l542N380O862J616r00r038q338J0118Q579r920
10149B78878Q289O226R726J7265J5282P870r91l446l621k1229j0612q087l434
$$ y = [280633, 286905, 304849, 313976, 315695, 320008, 316749, 320924, 318927, 320336, 318588, 338343, 348971, 343450, 341059, 331111, 311048, 294399, 287532, 286935, 290681, 279883, 284821, 296829, 315479, 329819, 353878, 371980, 373673, 377237, 364496, 346174, 331886, 320117, 310296, 300882, 296895, 298006, 297540, 296649, 288703, 291150, 288571, 289086, 285915, 283263, 301112, 316083, 319276, 306941, 310763, 316110, 318396, 315377, 320506, 320544, 309367, 310920, 314708, 312685, 307585, 303845, 305483, 299706, 282378, 271514, 278126, 290736, 299112, 298926, 295487, 290761, 288236, 283018, 284519, 283310, 277402, 278252, 280246, 289734, 292636, 290439, 284106, 287434, 282343, 281669, 278061, 274519, 279899, 286761, 288377, 287477, 278439, 270101, 280219, 288798, 278878, 287167, 293393, 303119, 320384, 335666, 343536, 342545, 339099, 335478, 314249, 303637, 295550, 292116]
10136B92116J399j979R074j907j4439l565J022m043j1375M597K319P37j08r17
10122B72931O317J904L318J4675o493l861J890J837M752L032J1720J7338J5248
10109C44608Q836J834j056n72K696j782q394m119k020j9101j1299k761J891m207
10095C04554m697p938M343J280n0J343J683N237J1117L688q028o694K439K670
10081C10947K062K7O40j4669q181P68Q814N267p622k606N914Q792J0018J0500
10067C30671j327k164M852J0432L264k043N59n532j9716L65j488K013Q793K851
10053C31530L809o772P524J3630L253j640j328l196J431o720l087J4510R077k252
10039C59769j2602n920j80j767l538M871k253j427R54M37j0173n123R169K0682
$$ y = [292116, 293515, 291536, 300610, 298703, 284264, 280699, 281721, 277678, 266303, 270900, 273219, 273956, 273848, 272931, 279248, 281152, 284470, 299145, 292652, 288791, 290681, 292518, 297270, 300302, 312022, 329360, 344608, 353444, 355278, 354222, 353650, 356346, 354564, 346170, 342051, 340031, 320930, 309631, 306870, 308761, 304554, 299857, 291919, 296262, 297542, 297492, 298835, 300518, 305755, 316872, 320560, 312532, 305838, 308277, 310947, 313009, 313036, 313676, 299007, 290826, 291594, 300408, 305675, 298053, 295447, 301361, 310153, 320171, 330671, 329344, 327180, 332032, 342464, 345728, 343685, 344244, 338712, 318996, 319361, 317873, 319886, 328679, 331530, 335339, 328567, 336091, 349721, 352974, 351334, 350006, 346810, 348241, 341521, 338434, 352944, 362021, 359769, 347167, 341247, 341067, 339300, 335762, 340633, 338380, 336953, 337907, 338344, 328171, 323048, 332217, 352899]
10025C52899J7224N499J1365R498J9226k773L197j298n087r791p309n276p786
10012C79588p251J706L25O53P00L520N270j0528m488N05P632N865R976k45L242
9997C96470L235M011J954O428K963J1902R490k706r798q432m37p7m077j453l603
9982D05870r81L499K3403L3160J2463K389q55M302O105q906j612L724o920j4784
9968D60857j3617L529j3511j1434j2055l360R382O445r038k081R301K02L679J0634
9954D38933K1650J9893J9176L3951K8856K0852K481J130o136j9421k5101k1415
9942E14849j2305j4607j6988j4410o622K975P645M074N630J3493K0691J5895J3360
9929E33680M621N985J2489Q061M944j1015k7898k0334m74r168j798r03L843l293
$$ y = [352899, 370123, 375622, 386987, 396485, 415711, 412938, 416135, 414837, 409750, 399959, 392650, 387374, 379588, 372337, 374043, 374368, 375021, 375721, 379241, 384511, 373983, 369495, 370000, 377632, 383497, 393473, 393228, 396470, 399705, 403716, 405670, 412098, 415061, 426963, 436453, 433747, 423949, 415517, 415080, 415003, 410926, 409473, 405870, 404889, 408388, 431791, 464951, 477414, 479803, 478948, 483250, 489355, 480449, 478837, 482561, 475641, 460857, 447240, 450769, 437258, 425824, 413769, 410409, 419791, 426236, 417198, 415117, 424418, 424620, 428299, 438933, 460583, 480476, 499652, 533603, 562459, 583311, 585792, 586922, 580786, 561365, 536264, 514849, 502544, 487937, 470949, 456539, 449917, 452892, 460537, 464611, 470241, 483734, 504425, 520320, 533680, 538301, 544286, 556775, 564836, 569780, 558765, 530867, 510533, 510059, 500891, 499093, 498190, 502033, 498740]
9915D98740j134n03m953q48J1748J3774Q832J6734K2326K6567L5797M7099M6683
9902G20862L8252N136q800j1241Q02K911L938R398p455k6994k5752k1747l488
9889F75822n775k0364j0888n6k144K174J0812R21l48o52J0011K0441K2616K9318
9875G31888K5441L3204M0269O8968Q1714P8405N3045N6391M6286j7305p5955p8047
9863A044304n7170o1569o6844m1103j5493k678R112K0549K7513K4769L4936L7883
9851I54209K2122N662M339N026J2605L6022N8345Q6207J39461K03236J53540j45
9839A680629o8531m3499l5136o9190o5558l7489J6281O5268J14781J74458K67340
9828A999354L74783M30543M98248P50121J172572J177340L20029l23227l15570
$$ y = [498740, 497606, 497103, 492150, 491302, 503050, 516824, 525656, 542390, 564716, 591283, 627080, 674179, 720862, 759114, 764250, 755450, 744209, 745011, 747922, 751860, 761258, 753803, 726809, 701057, 679310, 675822, 670047, 649683, 638795, 638739, 636595, 638769, 649581, 650502, 650154, 649502, 659513, 679954, 702570, 731888, 757329, 790533, 830802, 899770, 981484, 1059889, 1112934, 1169325, 1215611, 1198306, 1122351, 1044304, 987134, 925565, 858721, 817618, 802125, 799447, 808559, 829108, 856621, 881390, 916326, 954209, 976331, 981993, 986332, 991358, 1003963, 1039985, 1098330, 1184537, 1323998, 1527234, 1680774, 1680629, 1612098, 1568599, 1533463, 1464273, 1398715, 1361226, 1377507, 1442775, 1557556, 1732014, 1999354, 2374137, 2804680, 3302928, 4053049, 5225621, 6402961, 6722990, 6399763, 6084193]
9819F084193k89987l68876k68475j8141p814k15164k21624j5061J29666K33694
9809E042411M39970O76932P51022O61902N62066L36758J26795J08697O2565j46288
9799H622830l63603l92798l96777l52634k04282m2618N5258J29554J21471L4614
9789G211015J24200M83046J072727J857295K879926L597031K261230o67409k052145
9780A6766916j835773j641965j856097j747086j219135p42689m28361k53024k46525
9771F796261k38975o9203J37547K77390L57708L66162K96212J65682K12489L09733
9761H611006J15034k60233o06943p64751p55846o49832n49866m02769j40985J08741
9751D703556M2376j82369j74472P4096K95682M47267O48129P05281O9368o12041
$$ y = [6084193, 5794206, 5425330, 5156855, 5138714, 5130900, 4915736, 4694112, 4679051, 4808717, 5042411, 5482381, 6159313, 6910335, 7572237, 8134303, 8471061, 8597856, 8706553, 8769118, 8622830, 8259227, 7866429, 7469652, 7117018, 6912736, 6870118, 6925376, 7054930, 7176401, 7211015, 7335215, 7818261, 8890988, 10748283, 13628209, 17225240, 19486470, 18819061, 16766916, 14931143, 13289178, 11433081, 9685995, 8466860, 7724171, 7295810, 7042786, 6796261, 6557286, 6488083, 6625630, 6903020, 7260728, 7626890, 7923102, 8088784, 8301273, 8611006, 8726040, 8465807, 7858864, 7094113, 6338267, 5688435, 5138569, 4735800, 4594815, 4703556, 4745932, 4563563, 4389091, 4463187, 4758869, 5206136, 5854265, 6559546, 6628914, 6016873]
9741F016873o15755m26336n34839p23901o42174m57028l06732k12619j47750q3336
9731A866403m0195q718K0190N0953J04508J34747P1125o2454r5552o3493n8776
9720A918738r3664r5131p4358m6032m1657n0713n5388m4299m5973l2972j7850
9709A320701q308J2479L7100M2270N8110O6377N5761M8475O8362Q6823L7450M637
9697A830237J5456J5909J465N1455J07341K10184L23805M37514N31306N07034
9687D031706L76179J66674m7137k23062l45053l80066l72872l00635k28723j55016
9677B521995r2780l7751n902M3311Q3407J16256J58572K32372L62992N38052P42282
9666D662806R46826J048683R46587O58073L04148j09396n08778p47652q07209
$$ y = [6016873, 5401118, 4974782, 4439943, 3716042, 3073868, 2616840, 2310108, 2097489, 1949739, 1866403, 1826208, 1817490, 1837680, 1888633, 1993141, 2127888, 2199013, 2136559, 2041007, 1977514, 1918738, 1825074, 1729943, 1655585, 1609553, 1567896, 1517183, 1461795, 1417496, 1371523, 1338551, 1320701, 1312393, 1324872, 1361972, 1404242, 1462352, 1528729, 1584490, 1632965, 1701327, 1788150, 1825600, 1830237, 1845693, 1861602, 1863067, 1914522, 2021863, 2232047, 2555852, 2993366, 3524672, 4031706, 4407885, 4574559, 4527422, 4304360, 3959307, 3579241, 3206369, 2905734, 2677011, 2521995, 2429215, 2391464, 2385562, 2428873, 2512280, 2628536, 2787108, 3019480, 3382472, 3920524, 4662806, 5609632, 6658315, 7604902, 8262975, 8567123, 8457727, 7948949, 7201297, 6394088]
9657F394088p82316p04830n80257l91904j99584k5845J52279L59479N95163Q31278
9647E647551J012829J057938R50438P10968M38669K20261L3194j53868l53739
9638I564241n50499o91327p50651p07466o17629m87460l36168j64595J564J87305
9628E447315M17987P00066J081457J509342J886770K024411J806619J340653P40528
9619A6955148M3806n09598o95334n74324m90458n43957n96045o24946p31789r17226
9609A1315277r21773p14846m46007k02052O0495L27020N73140P87169R89270J173577
9599A2941270J212704J064759P65966M58952L31791M68121Q63421J301807J472799
9590B0881590J209679N30621l45857j097034j554063j667894j502605j133959
$$ y = [6394088, 5611772, 4906942, 4326685, 3934781, 3735197, 3709352, 3861631, 4221110, 4816273, 5647551, 6660380, 7718318, 8668756, 9379724, 9818393, 10038654, 10071848, 9917980, 9564241, 9013742, 8322415, 7571764, 6864298, 6246669, 5759209, 5423041, 5258446, 5260010, 5447315, 5865302, 6565368, 7646825, 9156167, 11042937, 13067348, 14873967, 16214620, 16955148, 16998954, 16489356, 15794022, 15219698, 14729240, 14185283, 13589238, 12964292, 12232503, 11315277, 10393504, 9678658, 9232651, 9030599, 9091094, 9418114, 9991254, 10778423, 11767693, 12941270, 14153974, 15218733, 15984699, 16443651, 16775442, 17243563, 18106984, 19408791, 20881590, 22091269, 22621890, 22276033, 21178999, 19624936, 17957042, 16454437, 15320478]
9582A5320478o64614k06987O6425K03594K49963K55793M25112Q49846J302560
9573A7802170J409115J226910R65725P19961M07581j8854l36109n83899r28528
9564B0664072j283430j499723j505079j276810q65606m04630J4726L45007O02011
9555A4790538Q47577J187737J739014K576523L537697M229403M127437L027227
9547C6063153J217035p41293k301900l178485l421520l276235k910662k418636
9539A9031457j942222j527538j165446q14013m17048M7055N67937J042819J375515
9530A6198516J664521K105408K786909L677585M640695M242174Q88661j503721
9522C4700748j730997j791865k368647k463967j893381j407110j215680j175917
$$ y = [15320478, 14655864, 14448877, 14515302, 14718896, 14968859, 15224652, 15649764, 16499610, 17802170, 19211285, 20438195, 21403920, 22123881, 22531462, 22512608, 22176499, 21592600, 20664072, 19380642, 17880919, 16375840, 15099030, 14233424, 13828794, 13843520, 14188527, 14790538, 15638115, 16825852, 18564866, 21141389, 24679086, 28908489, 33035926, 36063153, 37280188, 36538895, 34236995, 31058510, 27636990, 24360755, 21450093, 19031457, 17089235, 15561697, 14396251, 13582238, 13165190, 13212245, 13780182, 14823001, 16198516, 17863037, 19968445, 22755354, 26432939, 31073634, 35315808, 36204469, 34700748, 32969751, 31177886, 28809239, 26345272, 24451891, 23044781, 21829101, 20653184]
9514B0653184j166952j088184q30259l40554K94627R44414J383579J354232Q40610
9505B2044697P2427o28152j020491j033181q37713o32914n12806m66556m10701
9496A6574610k95208j27010n2593j46559l75902n71666o30473n52266k97838J23574
9486A3648669O25251J077940J345840J306475R70555P35184P56136Q27970O85904
9477B1979924M08690Q5250l36323o73262r53549j408008j916641k075877j883708
9468A3226496j654311j428340j143300q09400m94796k13213N8756L22196M89131
9459H353219N57247O65773J006922J627040K275610K640018K426322J500659J39648
9450B1192458j066643j720512j897613j830452j642537j251567p12159k04926
$$ y = [20653184, 19486232, 18398048, 17567789, 17227235, 17521862, 18466276, 19849855, 21204087, 22044697, 22117124, 21488972, 20468481, 19435300, 18597587, 17964673, 17451867, 16985311, 16574610, 16279402, 16152392, 16099799, 15953240, 15577338, 15005672, 14375199, 13822933, 13525095, 13648669, 14273920, 15351860, 16697700, 18004175, 18974730, 19709914, 20466050, 21294020, 21979924, 22388614, 22473864, 22137541, 21464279, 20510730, 19102722, 17186081, 15110204, 13226496, 11572185, 10143845, 9000545, 8191145, 7696349, 7483136, 7541892, 7864088, 8353219, 8910466, 9576239, 10583161, 12210201, 14485811, 17125829, 19552151, 21052810, 21192458, 20125815, 18405303, 16507690, 14677238, 13034701, 11783134, 11070975, 10866049]
9442A0866049J51542L94450P08654J124949J520196J715266J774862J768600J569959
9433B1594527J206123J017859J047453J197982J491080K051801K982378L979172
9425C6568375M795946N423608N760199N833228N763933N392781M171960K367307
9417G6077337J394675J053543P1117j110601j513028p76241N49325J053280K85198
9408G7084605p00919j340000j983061k827088l395012l379140k637172j584992
9400E9237221r32044o07931k34262k4221k43848r04748j571639j979626k286684
9391E0452218k399846k276517j827938q95297J85792O98971K65669o28699j360342
9382D2214011j888002k542701l221157l519481l368243k895987k276255j689023
$$ y = [10866049, 11017591, 11412041, 12120695, 13245644, 14765840, 16481106, 18255968, 20024568, 21594527, 22800650, 23818509, 24865962, 26063944, 27555024, 29606825, 32589203, 36568375, 41364321, 46787929, 52548128, 58381356, 64145289, 69538070, 73710030, 76077337, 77472012, 78525555, 78596672, 77486071, 75973043, 75196802, 75746127, 76799407, 77084605, 76383686, 75043686, 73060625, 70233537, 66838525, 63459385, 60822213, 59237221, 58305177, 57697246, 57462984, 57438763, 57194915, 56290167, 54718528, 52738902, 50452218, 48052372, 45775855, 43947917, 43052620, 43238412, 43937383, 44203052, 43574353, 42214011, 40326009, 37783308, 34562151, 31042670, 27674427, 24778440, 22502185, 20813162]
9374B0813162j170464o54964l08616l34800n56595p09966q01439r63570j149797
9365A4162951j216100j119771r04359o36682l40486M123M17112Q98854J447112
9356A2712754J985427K327910K356734K144204J833447J433246R15945N53512
9348B6263179O09970J045826J668408K392340L374418M603816N682962O172554
9340E1813473O007591N252471M106846K669103J076141k84264p21064j64833Q13645
9331G0569109J554227K066241K542344K875140K706430J956632J055660Q7437
9323H5413220r66602j995283k578946k494057j750580p37680L02050J203427J601050
9314G7996599J105245k06585j872169k954612l052765k566362k007545j596874
$$ y = [20813162, 19642698, 18987734, 18679118, 18344318, 17787723, 17077757, 16276318, 15312748, 14162951, 12946851, 11827080, 10922721, 10286039, 9945553, 9949676, 10366788, 11265642, 12712754, 14698181, 17026091, 19382825, 21527029, 23360476, 24793722, 25709667, 26263179, 26873149, 27918975, 29587383, 31979723, 35354141, 39957957, 45640919, 51813473, 57821064, 63073535, 67180381, 69849484, 70925625, 70641361, 69920297, 69755464, 70569109, 72123336, 74189577, 76731921, 79607061, 82313491, 84270123, 85325783, 85413220, 84446618, 82451335, 79872389, 77378332, 75627752, 74890072, 75192122, 76395549, 77996599, 79101844, 78895259, 77023090, 74068478, 71015713, 68449351, 66441806, 64844932]
9306F4844932j403324j165495r06139p69365p58389j019251j614262k528088l551595
9297E1129024m334413m651651m504043l959907l259260k550778k010395j696633
9289B4161944j593878j602789j602519j622635j654222j650520j599485j511446
9281A1324450j398889j273890j136908r99360q55085p26592n81625m70907l90116
9272C491078l29043k67868k26853j98641j86992j66557j41787j38795j31881j17974
9262A584687j11567r5440r0044o7378o0274n9485m7218o0582n6748m8609m2104
9251H45238k9336l9012l5932l4505l5928k4558j7181k4662l2478j9678n488j5049
9239E31431j119l465O953J7131J191j1372j0831j4472k0026j8744o379j3888n527
$$ y = [64844932, 63441608, 62276113, 61369974, 60600609, 59842220, 58822969, 57208707, 54680619, 51129024, 46794611, 42142960, 37638917, 33679010, 30419750, 27868972, 25858577, 24161944, 22568066, 20965277, 19362758, 17740123, 16085901, 14435381, 12835896, 11324450, 9925561, 8651671, 7514763, 6515403, 5660318, 4933726, 4352101, 3881194, 3491078, 3162035, 2894167, 2667314, 2468673, 2281681, 2115124, 1973337, 1834542, 1702661, 1584687, 1473120, 1377680, 1287636, 1220258, 1159984, 1100499, 1053281, 992699, 935951, 887342, 845238, 815902, 776890, 740958, 706453, 670525, 645967, 628786, 604124, 571646, 551968, 546480, 531431, 530312, 526847, 533800, 550931, 552122, 540750, 529919, 515447, 495421, 476677, 470298, 456410, 450883]
9226D50883J3338L1264K4840J4731j9557l0296l3122l7531m5475l0745j5231n548
9214C17551r753O066J2112Q013N77J2024P632J466K032k384N462J4699Q735J6889
9200D01121K420j130J8392M2112M6636K6988J7089l548j3905l4314k7385l2271
9188D42205l4725j9309o767j1655k0151k687J0799P055P820P81Q84m144n435n648
9174C59023j104m380O20l625j534r897n598N463P912M578J7212Q452J1304J0272
9160C98698L862M110P618M165J0316L0411K5486K8350K5580J5624J8052J7370
9148E89642J4464q749p087L683P588q908o445r863j4948k0976k7543l0812l3023
9135D47023m1426k8762j1408j561k534q269R049Q962R268J8907L4451M0732K9925
$$ y = [450883, 464221, 495485, 520325, 535056, 515499, 485203, 452081, 414550, 369075, 338330, 323099, 317551, 307798, 313864, 325976, 333989, 334566, 346590, 354222, 355688, 357720, 355336, 360798, 375497, 384232, 401121, 403541, 402411, 420803, 462915, 509551, 536539, 553628, 550080, 536175, 501861, 474476, 442205, 407480, 388171, 381404, 369749, 349598, 346911, 357710, 364765, 372585, 373366, 374250, 370106, 364671, 359023, 357919, 353539, 354159, 350534, 349000, 339103, 333505, 338968, 346880, 351458, 368670, 377122, 388426, 398698, 402560, 406670, 414288, 418453, 428769, 459180, 484666, 513016, 538596, 554220, 572272, 589642, 604106, 595357, 588270, 591953, 599541, 590633, 584188, 574325, 559377, 538401, 510858, 480046, 447023, 405597, 376835, 365427, 363866, 361332, 353063, 362112, 371074, 380342, 399249, 433700, 474432, 504357]
9122E04357K3116L3755M3623L1410P604j2942j1684J173j6684l4041m0448k8582
9110E00657q856l3541k5628j5144j8077j5089j6172j2291n140N671n47P403J8778
9097C82024J1704N205J2576J5145L376R598J0852l79l14n048o080j1110J040j2103
9083D16486j1586m424R363L0032K1339K6720K5679J5848J7509K3277J3074J7828
9071F01145J7608Q555J7557K2770J2150j1352k3012l6315l6811l0307m0075l4244
9059D67669k9411k5130j7534r768o8N756Q153J9837L3122N3224O6929O6201N6222
9046F95202L8115L4165L2235O919j0088k1406k7379k2137k4742m1278l7790l7667
9034E84149l5462l0582k7408j5379J620O748L737R944M682Q619N522J5749L603
$$ y = [504357, 527473, 561228, 604851, 636261, 643865, 630923, 619239, 620412, 603728, 569687, 529239, 500657, 491801, 458260, 432632, 417488, 399411, 384322, 368150, 355859, 350719, 356390, 355843, 363246, 382024, 393728, 398933, 411509, 426654, 430030, 439628, 450480, 450101, 449787, 444739, 438659, 427549, 428589, 416486, 404900, 400476, 409839, 439871, 461210, 487930, 513609, 529457, 546966, 570243, 583317, 601145, 618753, 627308, 644865, 667635, 679785, 668433, 645421, 609106, 572295, 541988, 501913, 467669, 438258, 413128, 395594, 385826, 385758, 391514, 399667, 419504, 452626, 505850, 572779, 638980, 695202, 733317, 767482, 799717, 806636, 796548, 775142, 747763, 725626, 700884, 659606, 621816, 584149, 548687, 518105, 490697, 475318, 476938, 483686, 487423, 497367, 502049, 510668, 516190, 531939, 535542]
9021E35542K2739K9523K7163K9263K6663K3396J2919n17n768j5052q955j6354
9009F60562m836J3599J8245K9388K5794L3952L0425K2698J2711J1277R356J2727
8997H75898K7223L1618K6891J8429m713m331j2992m0938m4374m0996m6463l7719
8985G47533l4539r268M366K39K0017J1322J826m188l367j2518j3750o245r729
8972F91699j886N043J6161L2168K9830J9163m1j4405k2504k9103l8861m1462k8754
8959F17048l8183k8175j4857j1545Q01L947J7381K5852K6460L0165L4343L4248
8947F97485J9411J5682J3650Q433j3277k4114j1302o75O297K8726L4338L1068
8935H05722L6538L4675K9932J6158n51p914j2958j3772m570M781J8470L6416O0329
$$ y = [535542, 558281, 587804, 614967, 644230, 670893, 694289, 707208, 706691, 700923, 685871, 676916, 660562, 655726, 669325, 687570, 716958, 742752, 776704, 807129, 829827, 842538, 853815, 863171, 875898, 903121, 934739, 961630, 980059, 975346, 971015, 958023, 917085, 872711, 831715, 785252, 747533, 712994, 703726, 708092, 708331, 728348, 739670, 741496, 737308, 733941, 721423, 707673, 701428, 691699, 689813, 694856, 711017, 743185, 773015, 792178, 792137, 777732, 755228, 726125, 687264, 645802, 617048, 578865, 550690, 535833, 524288, 525089, 529036, 546417, 572269, 598729, 628894, 663237, 697485, 716896, 732578, 746228, 754661, 741384, 717270, 705968, 705293, 711590, 740316, 774654, 805722, 842260, 876935, 906867, 923025, 922474, 914560, 901602, 887830, 883260, 888041, 906511, 942927, 1003256]
8922A003256O4394N3340L6679K4888J2408j0637q766n894k2455j5822K492J643
8910A135526R867P848l415j7057k6381k4010k8452k0357r614K682p373n322P397
8897A021339P613J3162P719P47j0231j6939j7246j3529k0249k1308k89P497p582
8884I50704J0794K2105K0220J7922J6007J8935K3418K5640J7388J3943K8575J4397
8872A180048J0635J9893J4434J1325J5570N617J6490J4808K7913L5130K7305L1138
8860A410306L8552N2017O2333Q5826J02356J22846J38227J44903J35470J59268
8850B452104K13295K60317K98604L55279M00143L85478K87815J96732K02045K70872
8840E322684M03220O06102Q52201J089891J263708J423454J706969K148862K620317
$$ y = [1003256, 1067650, 1120990, 1157669, 1182557, 1194965, 1184328, 1175562, 1169668, 1147213, 1131391, 1133883, 1135526, 1145393, 1153241, 1149826, 1132769, 1106388, 1082378, 1053926, 1033569, 1023955, 1026637, 1019264, 1013942, 1021339, 1028952, 1042114, 1049833, 1050580, 1040349, 1023410, 1006164, 992635, 972386, 951078, 950789, 958286, 950704, 961498, 983603, 1003823, 1021745, 1037752, 1056687, 1080105, 1105745, 1123133, 1137076, 1165651, 1180048, 1190683, 1210576, 1225010, 1236335, 1251905, 1257522, 1274012, 1288820, 1316733, 1351863, 1379168, 1410306, 1448858, 1500875, 1563208, 1649034, 1751390, 1874236, 2012463, 2157366, 2292836, 2452104, 2665399, 2925716, 3224320, 3579599, 3979742, 4365220, 4653035, 4849767, 5051812, 5322684, 5725904, 6332006, 7184207, 8274098, 9537806, 10961260, 12668229, 14817091, 17437408]
8831A7437408L001086L313950L602895L265839J696943R3002o71512j395540k372462
8822B7971609k838103k499164j971692j766796j748386j607610j349631j119658
8814A3070569r22529o64679l13999N5222L43788N57175P83220J064915J295865
8805A5269547J421287J557384J877977K392590L009999L351796K717178R43519
8797C2541277n42517j109999j517619k199781k639169k438984j918380j593861
8789A8580967j608142j660197j605678j496385j358245j143680q80428o35600
8781H192612m39815l26817k75830k33174j90020j29033l8900P2951K18462L66768
8771G217204M66862N07183N48148O33947P82297J010105J348665J779716K294820
$$ y = [17437408, 20438494, 23752444, 27355339, 30621178, 32318121, 32411123, 31739611, 30344071, 27971609, 25133506, 22634342, 20662650, 18895854, 17147468, 15539858, 14190227, 13070569, 12148040, 11483361, 11169362, 11224584, 11568372, 12125547, 12908767, 13973682, 15269547, 16690834, 18248218, 20126195, 22518785, 25528784, 28880580, 31597758, 32541277, 31998760, 30888761, 29371142, 27171361, 24532192, 22093208, 20174828, 18580967, 16972825, 15312628, 13706950, 12210565, 10852320, 9708640, 8828212, 8192612, 7752797, 7425980, 7150150, 6916976, 6726956, 6597923, 6559023, 6631974, 6850436, 7217204, 7684066, 8191249, 8739397, 9373344, 10155641, 11165746, 12514411, 14294127, 16588947]
8762A6588947K870921L431572L894668M381977M987313N414356N297839M705072
8754E1572665M184485L953463L290814J419864p74846j607344j265329j009400
8746E9764372j122159j108471j238717j923309k878477l691187m141071m103068
8738C9557913l663182k971179k190879j398556m58957O97523J949165L075953
8730C4597801L957194M530138M742555M601843M262221L890644L665687K996201
8722F7244284J264289p95093j982376k496966k972668l272297l047322k840295
8714E1101556l208833l839336m176093m205737m110041l883036l425143k881623
8706B1371714k483145k140937j796906j497221j279062j087134q59344o35736
$$ y = [16588947, 19459868, 22891440, 26786108, 31168085, 36155398, 41569754, 46867593, 51572665, 55757150, 59710613, 63001427, 64421291, 63646445, 62039101, 60773772, 59764372, 58642213, 57533742, 56295025, 54371716, 51493239, 47802052, 43660981, 39557913, 35894731, 32923552, 30732673, 29334117, 28875160, 29572683, 31521848, 34597801, 38554995, 43085133, 47827688, 52429531, 56691752, 60582396, 64248083, 67244284, 68508573, 67713480, 65731104, 63234138, 60261470, 56989173, 53941851, 51101556, 47892723, 44053387, 39877294, 35671557, 31561516, 27678480, 24253337, 21371714, 18888569, 16747632, 14950726, 13453505, 12174443, 11087309, 10227965, 9592229]
8698I592229m48878k96033j96240j15765m4932N9749J99908L93246O36728R44225
8688A0724237J293896J644475J997590K382549K889930L597756M380523M875787
8680C3786743M807922M100167K915464J663985P79752M40810O55648J185307J402917
8671E1738715R76013L87409p7343o49081j551917k648867l524339l940933l881815
8662C6827842l475930k996488k522332j903399r72796R0192R75429J688896K435566
8653C0146980L196570L864555M267163M130143L110833J388842n2228n23535k69719
8644D9259604K52112P03771P49906M13189j79657q82442j664798k668549l704848
8635D2278288m455419m679051m444163m008267l635463l284016k837816k317596
$$ y = [9592229, 9143351, 8847318, 8651078, 8535313, 8490381, 8550130, 8750038, 9143284, 9780012, 10724237, 12018133, 13662608, 15660198, 18042747, 20932677, 24530433, 28910956, 33786743, 38594665, 42694832, 45610296, 47274281, 48054033, 48494843, 49150491, 50335798, 51738715, 52714728, 53102137, 53024794, 52375713, 50823796, 48174929, 44650590, 40709657, 36827842, 33351912, 30355424, 27833092, 25929693, 24956897, 25047089, 26022518, 27711414, 30146980, 33343550, 37208105, 41475268, 45605411, 48716244, 50105086, 50052858, 49529323, 49259604, 49511716, 50215487, 50965393, 51378582, 51198925, 50316483, 48651685, 45983136, 42278288, 37822869, 33143818, 28699655, 24691388, 21055925, 17771909, 14934093, 12616497]
8627A2616497j844935j483957j181584q94737o83666n29032m24812l68899l41380
8618D863495k85516k30974j70434j03190l5557K5177L8069M7060M9570Q6048J78042
8607D461790L34362N18005P53770J042511J317611J492201J526338J492360J476508
8598A4415456J464874J447238J474187J368990R52136K95476n10804j301060j872477
8589A7734016k129799k186561k093496j835444j465952j063443o88930m20382
8581E850009k40214j48473p3109K8614J74140L98900O87331R86786J240835J422360
8571A0327179J550399J705058J828003J823638J701719J507587J036306K64037
8563B1743926p55396j664586k180888k350876k335216k233038k017542j666669
$$ y = [12616497, 10771562, 9287605, 8106021, 7211284, 6527618, 5998586, 5573774, 5204875, 4863495, 4577979, 4347005, 4176571, 4073381, 4037824, 4063001, 4101070, 4148130, 4197700, 4283748, 4461790, 4796152, 5314157, 6067927, 7110438, 8428049, 9920250, 11446588, 12938948, 14415456, 15880330, 17327568, 18801755, 20170745, 21122881, 21418357, 20907553, 19606493, 17734016, 15604217, 13417656, 11324160, 9488716, 8022764, 6959321, 6270391, 5850009, 5609795, 5461322, 5388213, 5416827, 5590967, 5989867, 6677198, 7663984, 8904819, 10327179, 11877578, 13582636, 15410639, 17234277, 18935996, 20443583, 21479889, 21743926, 20988530, 19323944, 17143056, 14792180, 12456964, 10223926, 8206384, 6539715]
8555F539715j281834r60386p12739n31770m17604l24042k56996k14593j76671
8546A663080j59423j51348j20804j23286j11009j07316j03779r7017p9608p1353
8536E38137o6739o3791o2785m7295l2312k9622l0344k0019k7051j1118k942k942
8524A41177M14j7570j6375r022p119j0128J247j4918j5415l749p840n483r988
8511B5231l910j1986r363N867Q853p712j5420m824k736p13K241k727j6825n065
8497c9089o679j0586q785p538j1150n321l534q289m596K519k648k498p45P04j5807
8482a24042q573j756J1187K285n547J483J032m97M602k772j788L126j577Q410
8468a14427R777M897n484j2416j347R22p03l017l029m915m507n634m999k731l028
$$ y = [6539715, 5257881, 4297495, 3584756, 3052986, 2635382, 2311340, 2054344, 1839751, 1663080, 1503657, 1352309, 1231505, 1108219, 997210, 889894, 786115, 689098, 609490, 538137, 471398, 407607, 344822, 297527, 265215, 235593, 205249, 185230, 158179, 147061, 144119, 141177, 141591, 124021, 107646, 98624, 91505, 81377, 82624, 67706, 52291, 48542, 40702, 35219, 25231, 21321, 9335, -28, 5839, 14692, 6980, -8440, -13264, -16000, -16713, -14472, -17199, -34024, -39089, -45768, -56354, -65139, -72677, -83827, -89148, -92682, -100971, -105567, -103048, -105696, -108194, -108939, -108235, -124042, -132615, -134371, -123184, -120899, -126446, -124963, -123931, -124428, -119826, -122598, -124386, -121260, -122837, -114427, -104650, -99753, -105237, -117653, -119000, -118078, -118781, -121798, -124827, -129742, -134249, -139883, -144882, -147613, -150641]
8453a50641m361p263J453n250n866O301J1818L387j335J0359J2734M703J7948
8440a06013J2226O044N560J2283M660K946m474K040Q584M896M576J5329J5872
8427a5471J5082K2085L2416L3594K4136M377o726k4093k2036j0974j1925k3388
8415A7077k4235j2276q934j3551j0909j839K503O112J556p92N493O148P082R758
8401a6807o104k775K1570K6987J9789L3554L4230K8631J4595j0164k0480k9115
8389I3911k5518k2069k9539k4974k2715r382p400j0239k1070m884n682j1419j861
8376a02841o357k998K851J1472N459Q35k374O438J2292J933N625J1724J5073J7702
8362b3166O411k853J127n57L289O375K3216J3588L1798L3023L5652M4148N3949
$$ y = [-150641, -155002, -162265, -160812, -166062, -171928, -165627, -153809, -150422, -151757, -141398, -128664, -123961, -106013, -93787, -87743, -82183, -69900, -65240, -62294, -66768, -64728, -56144, -51248, -46672, -31343, -15471, -389, 21696, 54112, 87706, 111842, 116219, 109493, 85400, 63364, 52390, 40465, 17077, -7158, -19434, -28368, -41919, -52828, -54667, -52164, -46052, -44496, -45288, -39795, -33647, -26565, -16807, -22911, -25686, -4116, 22871, 42660, 76214, 110444, 139075, 153670, 143506, 123026, 93911, 68393, 46324, 16785, -8189, -30904, -40286, -47686, -57925, -78995, -83879, -89561, -100980, -102841, -109198, -112196, -109345, -97873, -92414, -91579, -93953, -87515, -75223, -73290, -67665, -55941, -40868, -23166, -16755, -19608, -18481, -19038, -15749, -9374, 13842, 27430, 59228, 92251, 127903, 172051, 226000]
8349B26000L8785L1793J7657O153j7375l0946j9359l605K625p368k1011k2262
8337B01087j6775k8526l1968k0318j8352k3842q41O011J499O088J3112R131J4170
8324A10476L3310L6614L5316N3030M3282M3806J0802l835j1769l0190l0968j5684
8312B74190j2762r570j5410k6600l0425k3837l2026l0760l0605k1420j0142j4662
8300A5971j1010p197j4759j6703Q67M280N866r4M791n064j0434r271P525J6488
8286a8744R132L185K604l625N106L045Q62J6975L2455L1806L7966K9172K1055
8273A70994K2661J9699J4079O176J1953Q169Q397J5563J3328O198j3613j6353
8261B67251l3096l6517l3979l1719l4471k4894j6782j262K356p07l422O020L0989
$$ y = [226000, 264785, 296578, 314235, 320388, 303013, 272067, 252708, 249103, 251728, 244360, 223349, 201087, 184312, 155786, 123818, 103500, 85148, 61306, 60465, 66476, 67975, 74063, 87175, 96306, 110476, 143786, 180400, 215716, 268746, 312028, 355834, 366636, 362801, 351032, 320842, 289874, 274190, 261428, 251858, 236448, 209848, 179423, 155586, 123560, 92800, 62195, 40775, 30633, 15971, 4961, -2236, -16995, -33698, -32831, -28551, -22685, -22779, -17988, -23052, -33486, -42757, -35232, -18744, -9612, -6427, -3823, -7448, -2342, 703, 1565, 18540, 50995, 82801, 120767, 149939, 170994, 193655, 213354, 227433, 233609, 245562, 253731, 262128, 277691, 291019, 297217, 283604, 267251, 234155, 197638, 163659, 131940, 97469, 72575, 55793, 54531, 56887, 56180, 52758, 58778, 89767]
8248H9767K7896J5537K4347L5504K0845K4940K5522N064J0340r23K665N098R191
8235B95793j103K514j1934k8221m1792l8491l7914l5888k6790k7567j5481p792
8223B5334k961l102q888j3239j3837j7300l09j398k488K531J947L868o89j955
8209c2486j0522J2876J4478k565o700N97O791K320o83n234L113J772M226n60k730
8194a5307O12K3836L4593L0813J6436O13o715l949k3428j8323j8387j4603j9829
8181a3638j2592l482O159R37o175j388K656M666K014K63o768M947j841K787O109
8166a5346O712J5003K5724L0206J0161P229k531k89j741j4644j5670q550q067
8153B8197k2359k1601q768K775l088j0730r390m773m801N777l25l238J666J1128
$$ y = [89767, 117663, 133200, 157547, 193051, 213896, 238836, 264358, 269422, 279762, 278839, 281504, 286602, 295793, 294690, 297204, 285270, 257049, 215257, 176766, 138852, 102964, 76174, 48607, 33126, 25334, 22373, 19271, 10383, -2856, -16693, -33993, -34302, -35700, -38188, -35657, -33710, -29842, -30531, -32486, -43008, -30132, -15654, -18219, -24919, -24322, -17531, -15211, -15894, -21128, -18015, -16243, -12017, -12577, -15307, -14695, 9141, 43734, 74547, 90983, 91596, 84881, 80932, 57504, 39181, 20794, 6191, -13638, -26230, -29712, -23553, -22616, -28791, -30179, -27523, -22857, -20843, -20580, -27348, -22401, -24242, -21455, -15346, -8634, 6369, 32093, 62299, 72460, 79689, 77158, 76869, 75128, 60484, 44814, 36264, 28197, 5838, -15763, -24531, -21756, -24844, -35574, -44964, -49737, -54538, -48761, -49086, -52324, -50658, -39530]
8139c9530l597K39J513l953l762m574N123Q059k36n369l143j2581m739J141O315
8124e9094O521o8j1933o789R261j050O833L671O110K794n768m410j5411l573J3623
8109e9283P101K127j749O749K532m764p591m560L370J4001L159j0966o092n289
8095f1255R47K88p887k615R94J3852J6419k441q829J776N771J654p159j029O220
8080d3294R285Q759m587o38N223k168j7M077q791j0824k899M35km918o373J11
8064e6621L273O522M869o418q851O616N409k98J4384J0595o400l659p695j5837
8050e4111M832J8969M266m603O156r13K272P125q045l695p474J48k797P589L892
8035b6389K278Q202P695P704N819K294n426J308j231j549j3718p983m626m412
$$ y = [-39530, -43127, -42888, -41375, -45328, -49090, -53664, -48541, -40482, -40718, -46087, -49230, -61811, -66550, -65409, -59094, -52573, -52641, -64574, -71363, -62102, -63152, -56319, -52648, -46538, -43744, -49512, -53922, -69333, -72906, -59283, -52182, -50055, -51804, -45055, -42523, -47287, -54878, -59438, -56068, -42067, -38908, -49874, -55966, -61255, -60308, -60020, -67907, -70522, -69528, -55676, -39257, -41698, -50527, -48751, -42980, -41326, -48485, -49514, -43294, -34009, -25250, -29837, -30475, -25252, -27420, -27437, -23360, -32151, -42975, -45874, -45439, -45441, -50359, -56732, -56621, -53348, -46826, -41957, -48375, -57226, -50610, -45201, -45499, -31115, -20520, -26920, -30579, -38274, -54111, -49279, -30310, -26044, -30647, -24491, -25404, -23132, -16007, -24052, -27747, -35221, -35073, -37870, -30281, -26389, -24111, -15909, -8214, -510, 5309, 7603, 2177, 3485, 2254, 705, -13013, -20996, -25622, -30034]
8021c0034j820o066j0863o883P694O183K90k3P144M923O317Q136n965N552L255
8006a2160L205l265q42k491J907O01m079j802K183P388k212K492p92k292r981
7991b2140M03j0943j355k733j767J5373J0864P898P857L895K344n7J619J602r290
7976C570j5555O98j269k62m450J3498l494o898m430J711k630J250J413j303L287
7961a4864P038o178j451J6060O762l739p207Q255Q884O666j576P021o421r160
7947A0090j0392n243Q066N977p69m642O850m102j1504M622P6j1252n392n042N31
7932b2126o93k871M488J2923O35P318L134J942o392r247L65O704K540k995J404
7917b871K701N51M797L649n55Q680J3989n29k825m154p646k930p172p388o843
$$ y = [-30034, -31854, -37920, -48783, -55666, -47972, -41789, -41499, -41522, -34378, -29455, -23138, -15002, -20967, -15415, -12160, -8955, -12220, -13062, -15553, -13646, -13045, -17124, -18926, -16743, -9355, -11567, -9075, -9867, -12159, -22140, -21737, -32680, -34035, -36768, -38535, -23162, -12298, -4400, 3457, 7352, 9696, 9639, 11258, 12860, 3570, -11985, -11287, -12556, -12818, -17268, -3770, -7264, -14162, -18592, -16881, -19511, -18261, -16848, -18151, -14864, -7826, -14004, -15455, 605, 7367, 3628, -3579, 4676, 13560, 20226, 18650, 25671, 19250, 10090, -302, -5545, 2521, 8498, 7729, 3087, 9937, 5835, -5669, -1047, -971, -12223, -17615, -22657, -22126, -22819, -25690, -21202, -8279, -7644, -326, 2808, 4750, -1642, -10889, -10524, -3820, -1280, -4275, -2871, -170, 381, 5178, 8827, 8272, 16952, 30941, 30412, 27587, 23433, 15787, 12857, 5685, -1703, -8546]
7902h546j868k539P79M592m926J053m640j0234q10J1220j311J731J1166M80p999
7887a1852j0029O353Q248j043k357q335k036k416j732j013Q777N567L195K938
7873e735J364M024L202l895K226L261q231m829k152O089j806n193j0311m384J3254
7858a3116N969j7870j3425J2398N111n86N6j392k898Q079J2389j429p257K562
7844a1409J529n133j6552j2641N707Q868P89p087M75P931O942l368j567N679p78
7829b0615M161l284j0605M744o13Q619j009j995m549K757o888n27N610O201o483
7814b4476m784Q017P387j0929j0571N234l75N096m828N856L779p415k311P840
7800b2480l475n106m167j2112M630M793P205J288N520q05R99r44k774m311j150
$$ y = [-8546, -10414, -12953, -12174, -7582, -12508, -11455, -16095, -26329, -27139, -15919, -17230, -15499, -4333, -3853, -11852, -21881, -15528, -7280, -8323, -10680, -19015, -21051, -23467, -25199, -26212, -17435, -11868, -8673, -5735, -4371, -347, 2855, -1040, 1186, 4447, -3784, -8613, -10765, -4676, -6482, -11675, -21986, -26370, -13116, -7147, -25017, -38442, -26044, -20933, -21519, -21463, -22855, -25753, -17674, -5285, -6714, -13971, -11409, -9880, -15013, -31565, -44206, -38499, -29631, -28842, -35929, -35454, -27523, -20581, -23949, -25516, -19837, -20615, -16454, -19738, -30343, -25599, -26212, -17593, -18602, -20597, -25146, -22389, -29277, -29804, -24194, -17993, -24476, -29260, -21243, -13856, -24785, -35356, -30122, -30497, -25401, -30229, -24373, -20594, -28009, -30320, -22480, -25955, -31061, -35228, -47340, -42710, -37917, -30712, -29424, -23904, -24709, -23710, -24654, -27428, -31739, -32889]
7785c2889J757N47k549l256o638R145N534j2093r62k525k739L493J0821K924j475
7770c0905P444O26l237Q04k154M297J0754q944j0022j404O823r6j2006J803J4425
7755b1792l369L456K636l260L012m820N06N310J90n105j649K166J935O326L055
7740a1403L814n118J21n75k185j0901j3029k695Q357K553N669O07J4442o63o589
7725a7595J251q905l897k099Q364Q827L364q970o866M025N789l54m191J310N942
7710a4005N294q076j0841J65j438K984J0243L661q480l306P34Q594p084k569N120
7695a9004o29j956p911K88J0291M623q981m316O786J195m774N583M341n902l655
7680b4021P595O418K117k120L624p756p380L764L079L551P051N84p747j6067o009
$$ y = [-32889, -31132, -30585, -33134, -36390, -43028, -33883, -28349, -40442, -41404, -43929, -46668, -43175, -32354, -29430, -30905, -23461, -22835, -26072, -25268, -27422, -23125, -12371, -21315, -31337, -32741, -25918, -26014, -38020, -36217, -21792, -25161, -21705, -19069, -22329, -19317, -24137, -23631, -18321, -18131, -23236, -24885, -22719, -20784, -14458, -11403, -7589, -12707, -12586, -13161, -15346, -26247, -39276, -41971, -33614, -31061, -25392, -24785, -10343, -11006, -17595, -16344, -25249, -29146, -31245, -22881, -14054, -10690, -19660, -26526, -22501, -16712, -17066, -21257, -19947, -14005, -8711, -16787, -27628, -27463, -28901, -25917, -15674, -12013, -20493, -23799, -23065, -14471, -21555, -24124, -19004, -19633, -21589, -29500, -29212, -18921, -14298, -23279, -27595, -20809, -19614, -24388, -18805, -14464, -20366, -24021, -16426, -10008, -7891, -10011, -6387, -14143, -21523, -17759, -14680, -11129, -4078, -3494, -11241, -27308, -33317]
7665c3317K490m668k996j099l515m357J13J6128R936L151l179j701m691Q804P569
7650a1332q325j476N059L272N805k122l228r60j0246J760n907n401M283M193J3602
7635a1023J090o308M882K023M68K066j040J861K018m170L162r647j4181J1377
7621a7422K1195k588l23o621o615m729q96q048o876p04N116j246M475O119n461
7606b4624k084R69O49J326J81r774j879R746k480j268j04M285m997n032k783O562
7590c1307J250j293j798J0559J0575j385l622O182P918j0457j5335j2352m216
7577d5281n553Q948J3313O999l421K854K291l936q190P214J1322P778Q352j275
7563A415o637Q548o91k717j5224q101q513O502N542j608R520K0009m589k0053
$$ y = [-33317, -30827, -35495, -38491, -39590, -43105, -47462, -47349, -31221, -21285, -18134, -21313, -23014, -27705, -18901, -11332, -19657, -21133, -16074, -12802, -6997, -9119, -12347, -13307, -23553, -21793, -27700, -33101, -28818, -24625, -11023, -9933, -16241, -11359, -9336, -8868, -6802, -7842, -5981, -3963, -8133, -4971, -14618, -28799, -17422, 3773, 1185, 862, -5759, -12374, -17103, -17999, -26047, -32923, -33627, -28511, -29757, -25282, -19163, -24624, -26708, -25739, -25090, -23764, -23583, -33357, -35236, -25490, -27970, -29238, -29342, -25057, -30054, -35086, -37869, -31307, -30057, -31350, -33148, -22589, -12014, -13399, -17021, -10839, -2921, -13378, -28713, -41065, -45281, -50834, -41886, -28573, -21574, -24995, -22141, -19850, -23786, -31976, -24762, -13440, -5662, 2690, 1415, -5222, 3326, 2635, -82, -15306, -23407, -31920, -25418, -19876, -21484, -11964, 8045, 3456, -16597]
7549a6597r84K801n029o842l173J140L716L625m536m413J3872O914q111P892K134
7534g591L943j1482r011J257J5131p706j6896l907Q806N845J202N135L18j430
7520a6386M162l832J29K712O699j146m890q278k239M259Q945l074L668J0803l425
7505a893j405j493q249l328m721J859j434O030M02L555j550J473N037M444l538
7490d811r154J928K490j548N098k301j936Q157n409r804J941M832K229J953m93
7475f828q754k273J0483P984j0506m565J932j929l347m840R367J1205J879N700
7461E508J904q836r38p255J456n922j57N483N632K872j842j193p424p924M568
7446a4068Q4k93J0885M916k545o975K421m806m147J280J28N279R84l536l296n556
$$ y = [-16597, -17581, -14780, -19809, -26651, -29824, -28684, -24968, -21343, -25879, -30292, -16420, -9506, -17617, -9725, -7591, -3648, -15130, -24141, -22884, -7753, -15459, -32355, -36262, -27456, -21611, -20409, -15274, -14956, -16386, -12224, -16056, -15927, -13215, -6516, -7662, -12552, -20830, -23069, -18810, -9865, -12939, -9271, 1532, -1893, -3298, -4791, -13040, -16368, -21089, -19230, -20664, -14634, -14232, -10677, -12227, -10754, -5717, -1273, -4811, -13965, -12037, -9547, -11095, -5997, -8298, -10234, -2077, -7486, -17290, -15349, -10517, -8288, -6335, -6828, -15582, -17855, -7372, 612, -9894, -14459, -12527, -14456, -17803, -22643, -13276, -2071, -192, 5508, 7412, -1424, -2362, -9617, -8161, -14083, -14240, -8757, -3125, -253, -2095, -3288, -10712, -18636, -14068, -13984, -14277, -3392, 1524, -1021, -7996, -5575, -10381, -14528, -13248, -13120, -7841, -6857, -10393, -13689, -19245]
7430a9245j119j75m284j584l5k395K866L92K109J1170J288m426p545P872P653
7415g458m350P2m016j676j09M785j399n576k837L762Q823p89l39p567n627q706
7399c3007N059m10N855k254k51k962o069K414J1643J005J243R419m227j1610l955
7384b8107o45Q310p136P780o25l934N448L563q788K944L385m945J494O979l521
7369a7798K482N500k645j565k066K720J6812L222m230m899j037k050j4025o867
7355b6446M544J1736j103p290j68K06j286l281O525k330k713J753J844O098P34
7340a1177K232j185K521L971j3219r962k91m83Q223N403M880P502p030n654o152
7325b0421m507Q450L605j296k707k445R96o143N615o030m376j1408L651R810O485
$$ y = [-19245, -20364, -20539, -24823, -26407, -26442, -28837, -25971, -25579, -23470, -12300, -11012, -15438, -22983, -15111, -7458, -11808, -11736, -15752, -17428, -17537, -12752, -14151, -19727, -22564, -18802, -9979, -10768, -11107, -18674, -24301, -33007, -27948, -28358, -22503, -24757, -25008, -27970, -34039, -31625, -19982, -18977, -17734, -8315, -12542, -24152, -28107, -28752, -20442, -27578, -19798, -20423, -24357, -18909, -15346, -24134, -21190, -17805, -22750, -21256, -14277, -17798, -15316, -9816, -12461, -14026, -16092, -13372, 3440, 6662, 2432, -2467, -3504, -5554, -19579, -26446, -21902, -10166, -11269, -18559, -18727, -18521, -19807, -23088, -16563, -18893, -21606, -19853, -18009, -11911, -11177, -8945, -10130, -7609, -3638, -16857, -26819, -27110, -27593, -19370, -13967, -9087, -1585, -8615, -14269, -20421, -24928, -16478, -12873, -14169, -16876, -19321, -18325, -24468, -18853, -24883, -29259, -40667, -37016, -27206, -20721]
7310b0721k067k799P410j527J009p24J0968J0681O39p686n243l07k71j153l411
7295a5202q18k401k866K222Q096K877p666R14R43J042L457N33O708l445p427K08
7279a2825J947o360K586j834L87O227P713j208j0962r9j0562q72J9998O764j2456
7264a1556j1829o676P206N689q297M841J6329J4649L15j0950o524K091j085N288
7250e09k508j0519K57o535m750J4983P456M413n284p292r822J0710P738n143j1472
7235a8277k942J590J329O095k06n022J1957K768n229L077J4060r960j1802J5473
7221B911M171r864q525L059N220q33j390o364m756K239J521J033R373L170j426
7206d61P17m684R440O296p074k163p308j174J749O267L120k859L08o708M577k186
$$ y = [-20721, -22788, -25587, -18177, -19704, -18695, -19419, -8451, 2230, 2869, -4817, -10060, -10367, -10638, -11791, -15202, -16020, -18421, -21287, -19065, -10969, -8092, -15758, -14844, -13901, -12859, -9402, -8869, -2161, -5606, -13033, -12825, -10878, -17238, -14652, -16486, -16099, -9872, -2159, -3367, -14329, -14428, -24990, -25862, -5864, 900, -11556, -23385, -30061, -22855, -17166, -25463, -20622, -4293, 10356, 10671, -279, -6803, -4712, -5797, -509, -3017, -13536, -13279, -19814, -24564, -9581, -2125, 2288, -2996, -10288, -20110, -9400, -1662, -6805, -18277, -21219, -19629, -18300, -12205, -12411, -17433, -5476, -2708, -7937, -4860, 9200, -760, -12562, 2911, 7082, -2782, -11307, -8248, -3028, -3861, -5251, -11615, -16371, -14132, -12611, -11578, -2205, 965, -461, 256, -4428, 5012, 11308, 4234, 2071, -5237, -6411, -4662, 1605, 4725, 1866, 2174, -4534, 43, -2143]
7190b143N388J195J132o106k991O2K292r314K677j196o717J491O705Q478K608
7175C561k260j2724K093P527k417m427M622O579j174j0484l008M337m318L467
7161h626K052j3856k66J0318l151O383K298j492J182K181m11n461m078J013q428
7146b0342K496Q391P688m369j2364L282J0522J4707k571r509j0729j56k554R956
7132e552J1621j774p761p479k002Q921P114p361j471m337J88M087O032P10o347
7117e411N286q377K859M125J424L231m069l304K296J642j185K014j0013j3965
7103b3447J457J4689R837K693q831j46J2684o309j1833P07J471L675n744q319
7089a7416p243M492J4064K920P30o172J290P970j959L800r51p613n839P440Q316
$$ y = [-2143, 3245, 4440, 5572, -534, -3525, -3463, -1171, -10485, -7808, -9004, -15721, -14230, -7525, 953, 3561, 1301, -11423, -9330, -1803, -4220, -8647, -4025, 2554, 1380, -9104, -12112, -7775, -12093, -8626, -6574, -20430, -20696, -10378, -13529, -7146, -4848, -6340, -5158, -2977, -3388, -8849, -12927, -11914, -20342, -17846, -9455, -1767, -6136, -18500, -15218, -4696, 10011, 7440, -2069, -12798, -12954, -15508, -5552, 6069, 4295, -3466, -10945, -12947, -4026, 3088, -4273, -5744, -10081, -9893, -5806, 226, 936, -5411, -125, -8502, -5643, -1518, -94, 3137, -932, -4236, -1940, -298, -1483, 531, -9482, -23447, -21990, -7301, 2536, 5229, -3602, -3748, 8936, 2627, -9206, -8499, -7028, -3353, -9097, -17416, -24659, -20167, -6103, -3183, -2453, -8625, -7335, 635, -1324, 2476, 1525, -6088, -11927, -4487, 3829]
7074C829o448m712J4101R905K745m544r033o884n107m480p321l712Q100n156m090
7059b2807j319K42l915O397O260j970m062p182J4825J2205R922P525J97j3522
7045B796R04N410j421j9107q210L631L478Q212n36l164N248N653k93k208m259
7030c866j751M515M104j259N019Q378L876J97L351q735n896n729j2515q935Q972
7015a0274N383p125j542N388Q486R162p534j6396q474J1563J5472j529o369N629
7001A840k704m810n585N441J682j933k254P59J190j0828K61j837K653o27m460
6986b1212n19J7863J6470k247p506o532p113j841Q141K756j615p234p93J6912
6972E530K762K660k198L77n208j743j131P673p073p772O008n107n870L779K824
$$ y = [3829, -2619, -7331, 6770, 16675, 19420, 14876, 5843, -1041, -6148, -10628, -17949, -21661, -13561, -18717, -22807, -24126, -23884, -27799, -21402, -15142, -17112, -21174, -28356, -13531, -1326, 8596, 16121, 16318, 2796, 3700, 9110, 7689, -11418, -19628, -15997, -12519, -4307, -4843, -8007, -2759, 2894, 2601, 393, -3866, -5617, -1102, 3002, 1743, 6762, 15140, 19016, 19213, 22564, 13829, 7933, 2204, -10311, -19246, -10274, -4891, -12016, -13558, -8170, 316, 9478, 1944, -14452, -22926, -11363, 4109, 2580, -3789, 1840, -864, -5674, -11259, -5818, -4136, -6069, -8323, -7564, -6374, -17202, -16941, -18778, -16125, -16752, -21212, -21731, -3868, 12602, 10355, 2849, -3683, -10796, -12637, -4496, -1740, -3355, -10589, -11382, 5530, 8292, 10952, 8754, 9131, 3923, 2180, 1049, 8722, 1649, -6123, -115, -5222, -11092, -7313, -4489]
6957d489J3797N253K685N19n722Q503o90j5866o424r276k233M094Q691M003p511
6942d666q72J657L211k156k100j43M922j133Q52M377o080l943P060j430P9n237
6926e602p500K218L951N318J8312L431J829p17n868j2872p391L46N19k725k853
6911i604J977P393j423k475n139N116J612j887P03m007K284J392J939P750P459
6896A3090n643j6193j140K207N842R049J547j0521n925m215m557O79m91M970j914
6881a3215p310k849Q578J0025m759k55O374K195j024M669J143P614O905j016o164
6866A0911m035K528J085m835q13p20K462O19j894Q73k250O11n303k075M084k428
6850a180p86M246J913j010M98R80L885o985o260N925Q541N292j862l021K576K035
$$ y = [-4489, 9308, 14561, 17246, 17765, 12043, 20546, 19856, 3990, -2434, -11710, -13943, -9849, -1158, 2845, -4666, -5538, -3881, -670, -2826, -4926, -5069, -147, -1280, -428, 3949, -2131, -6074, 986, -444, -365, -5602, -13102, -10884, -6933, -1615, 16697, 20128, 21957, 21240, 15372, 2500, -4891, -4545, -4026, -6751, -9604, -7627, -234, -1657, -4132, -9271, -4155, -2543, -4430, -3727, -7734, -5450, -4058, -2119, 5631, 13090, 7447, -8746, -9886, -7679, -1837, 7212, 8759, -1762, -7687, -11902, -16459, -15780, -16271, -11301, -13215, -20525, -23374, -14796, -4771, -9530, -9785, -3411, -1216, -2240, 2429, 3572, 11186, 18091, 17075, 10911, 6876, 9404, 10489, 5654, 4841, 4121, 6583, 7202, 5308, 6181, 3931, 4542, -761, -2836, 1248, -1180, -1966, 2280, 4193, 3183, 3681, 4661, 8546, 1561, -4699, 1226, 9767, 15059, 13197, 10176, 12752, 14787]
6834A4787M44J715N045K542j3200o785n327m692k814N291Q118R357j374k845K934
6819A3196q535j0851o170M154R408K428J726O683m639j6087o067k551l209P070
6805a3444J3311L852q117o259Q230J264J264J544j1919n261L144J081j562J3662
6791G90J5605n040r360L176q041j664J203j2959l874J0880J0425K579j0687j1016
6777a7983r202J515N454O435j947Q302Q607O477P78p46l502o800p471l287K524
6762a0846J726L025Q390J1368P387J2520J0747k563o362j3776K252N385j5667
6749A3586n269l462m811L0P276J407L088Q124n627N078O258R34j24r4P32M152
6733C1278n265j0057j1031L348K553l216J2417J0666J210M455J0809m732n499
$$ y = [14787, 15231, 16946, 21991, 24533, 11333, 4548, -779, -5471, -8285, -2994, 5124, 14481, 13107, 10262, 13196, 4661, -6190, -12360, -8206, 1202, 3630, 5356, 12039, 7400, -8687, -14754, -17305, -20514, -13444, -133, 3719, -4398, -10657, -2427, -1163, 101, 1645, -10274, -15535, -12391, -11310, -12872, 790, 16395, 11355, 1995, 5171, -2870, -4534, -3331, -16290, -20164, -9284, 1141, 3720, -6967, -17983, -27185, -25670, -20216, -13781, -15728, -7426, 1181, 7658, 8436, 7690, 4188, -2612, -10083, -13370, -10846, -9120, -6095, 2295, 13663, 21050, 33570, 44317, 41754, 35392, 21616, 23868, 29253, 13586, 8317, 4855, 44, 74, 7350, 8757, 11845, 19969, 14342, 19420, 25678, 26612, 26488, 26394, 27126, 31278, 26013, 15956, 4925, 8273, 10826, 7610, 20027, 30693, 31903, 36358, 47167, 42435, 36936]
6720C6936p302j2J441l598m567p4j618o21J7437J1274J830j3755j756j1333M626
6705B8908J817k677J793l55n529k199l902m959q768m758O898J0004k275n789J1025
6690A9234J9879L350l627l12J2793P656M151j196K375M992P249q633k3768j6218
6676B7925m74o603j1262j742K019Q77p430r210l237j513J0748K816l533j749N1
6661b317J25L203j02P391Q366k984p532n571N7J1859k452q144M917m978K878J3165
6645A7881K513k187j1038p442J752J380r435n034J39m719K328N913J765O774N219
6630E809O771j0965j1257M534K314j366J497l556j253M951J2208K112l142k443
6616F214k029J60r86M166L569n015j449n454Q736J910m378j1804k877Q079J2994
$$ y = [36936, 29634, 29622, 31063, 27465, 22898, 22824, 21206, 20585, 38022, 49296, 51126, 37371, 35615, 24282, 28908, 30725, 28048, 29841, 29486, 23957, 21758, 17856, 12897, 4129, -629, 6269, 16273, 13998, 8209, 19234, 39113, 42463, 38836, 38524, 51317, 58973, 63124, 61928, 64303, 69295, 76544, 67911, 44143, 27925, 27451, 20848, 9586, 7844, 9863, 10740, 3310, -5900, -9137, -10650, 98, 2914, -619, -2368, -2317, -2192, 1011, 909, 8300, 16666, 13682, 6150, 579, 636, 12495, 10043, 1899, 6816, 1838, 4716, 17881, 20394, 18207, 7169, -273, 1479, 2859, -6576, -11610, -11471, -16190, -13862, -7949, -6184, 590, 5809, 12580, 1615, -9642, -5108, -2794, -4160, -2663, -6219, -7472, -2521, 9687, 11799, 8657, 6214, 4185, 4345, 3359, 7525, 11094, 6079, 4630, -824, 7912, 9822, 5444, -6360, -9237, -1158, 11836]
6601A1836k578o246l31p203j780M593p303j5184J16J3575Q566P511M841r57j1260
6586a804q517J4421M868m653p431L465Q49K154q064L924P554o652M241R413m55
6571A3313j591k459k769k537q180j491r363L252M591p430r187J2593J4539P442
6557A0723m786j8089O28P214J0873l700o70M311J550J98j282N530r27L710J2902
6542B8185P476p61j6267m661J897m82o664r391j0072o429Q914O079P379M737k472
6527G468L839k084r174L428P314N62O271M65l703j3740p746r202L25K434K115
6512a1428M366O530K550Q560k205l865J898J2256K091r204q864P804R41q011n874
6497b455L799J2151J263l746k545r248j245J842M861k153j814R66J1140j7409
$$ y = [11836, 9258, 3012, 2681, -4522, -6302, -1709, -9012, -24196, -24080, -10505, -1939, 5572, 10413, 9456, -1804, -10321, 4100, 8968, 4315, -3116, 349, 1198, 3352, -4712, -788, 6766, 114, 4355, 13768, 13313, 11722, 9263, 6494, 3957, -4223, -5714, -15077, -11825, -7234, -14664, -23851, -11258, 3281, 10723, 5937, -12152, -11524, -4310, 6563, 2863, 2193, 6504, 8054, 8252, 6970, 12500, 11573, 15283, 28185, 35661, 34900, 18633, 13972, 15869, 15387, 8723, -668, -10740, -17169, -8255, -2176, 5203, 9940, 7468, 11307, 9223, 49, 3477, 10791, 11353, 17624, 18089, 14386, 646, -7100, -16302, -15977, -13543, -11428, -7062, -532, 2018, 10578, 8373, 4508, 6406, 18662, 20753, 11549, 2685, 10489, 11430, 3419, -2455, 1344, 13495, 14758, 11012, 8467, -781, -2026, -184, 4677, 2524, 710, 1676, 12816, -4593]
6483d593n116K520K846R0l143n370P8m707P129P742M630P308j0047p700q84N622
6467c595P728Q414L415j938l083r440o656p917j336o38R319k624L075K527M462
6452A713q016k793J751N735N952N16j498j318J965J475k927q56k078R29j319J779
6436A010q315N048n398j3725j789J2929L508N155N437o11o163M40P098L680o501
6421A803j743m943m939J826J249Q177O314l240K575r677o832O03n359m612k04
6406a9002J290N302N207M17O029l310p801J703J4545Q738O353j020n572q444J1177
6391A5612l052q655O486J5k974j2162k562p126P832J3073M522n86n547l477J938
6376C337M177n590O612O704j1501j63j95l1N308P56q123p055q72P081N671P172
$$ y = [-4593, -9709, -7189, -4343, -4253, -7396, -12766, -12688, -17395, -10266, -2524, 2106, 9414, -633, -8333, -9217, -3595, 4133, 12547, 15962, 14024, 10941, 1501, -5155, -13072, -14408, -15046, -5727, -8351, -5276, -2749, 1713, -6303, -9096, -7345, -1610, 4342, 4858, 3360, 2042, 4007, 5482, 2555, 1699, -379, 550, -769, 1010, -7305, -2257, -7655, -21380, -23169, -10240, -6732, -1577, 3860, 3249, -2914, -2474, 4624, 8304, 1803, 60, -4883, -9822, -7996, -6747, 1430, 7744, 4504, 7079, -2598, -9430, -8827, -14186, -18798, -19002, -17712, -12410, -7203, -6786, -757, -4067, -11868, -10165, 4380, 13118, 19471, 18451, 12879, 4435, 15612, 12560, 3905, 10391, 10406, 7432, -4730, -7292, -14418, -6586, 6487, 11009, 10423, 4876, 1399, 3337, 7514, 1924, 8536, 15240, 3739, 3576, 3381, 3350, 8658, 9414, 1291, -5764, -6636, 445, 6116, 13288]
6360A3288J365n102K162r686q849M103N716p29m252P44j128p379K462L283J648
6345b354J2475N561o507J90n18N691O605L166l193K141j0160m966L177K510j1948
6330A870j963N317O643k366j0823k735l801K012k719K253P800j160R229M449q656
6315E350m111L406J272l019K774J1647J57K247l750J197n076q611j141L085L217
6300H644k710k879Q035n858j4979M900N463Q181rJ487r634l955R116O903L12j5342
6284b325k844J111m675P390n30k433j907o110K125N481j773Q167L965K779M67
6269H888j764m527P131M086O633l67n683q263n107O08j217q483l718N813J2495
6254F525J376k912k448l471K142R49k668m605Q166K989P397j587k01m829j3392
$$ y = [13288, 14653, 9551, 11713, 2027, -6822, -2719, 2997, 2268, -1984, -1240, -2368, -9747, -7285, -4002, -2354, 10121, 15682, 9175, 9365, 8847, 14538, 21143, 24309, 21116, 23257, 13097, 8131, 11308, 13818, 1870, -93, 5224, 11867, 9501, -1322, -4057, -7858, -5846, -8565, -6312, 1488, 328, 9557, 14006, 5350, 1239, 4645, 5917, 2898, 5672, 17319, 17476, 19723, 15973, 17170, 12094, 3483, 2342, 5427, 8644, 5934, 3055, 11090, 5232, -9747, -4847, 616, 8797, 8788, 10275, 641, -3314, 5802, 12705, 13017, -2325, -5169, -4058, -8733, -1343, -1873, -4306, -6213, -12323, -10198, -4717, -6490, 1677, 5642, 8421, 8888, 7124, 2597, 9728, 13814, 20447, 20080, 14397, 6134, 1027, 1635, 418, -8065, -11783, -5970, 6525, 7901, 4989, 2541, -930, 1212, 2161, -507, -5112, 3054, 6043, 13440, 11853, 11652, 6823, -6569]
6239f569k606J2054P977k408P98J519P029J1924q776l573n082r038K308k464J036
6224D129Q095o475p206k540J123n989q992N061P996N678l76k352l069N164%j728
6208a481K568J0405J991j1229L949p34j1192J157J7m926p34l144N074P044j366
6193b601l217q76m58L398j955q728l356R480P855L523l149Q85L604P746j216q347
6177B588k2452J453R625J556K072R529m125M484j549o386L63J0390N37l172M881
6162I794O072J638o574j0579O343n460l547K541L810L218k646m526R865R41P90
6147A1680P200M407r542r203O593p466j1507l65M531N529n854j885o71q92K110
6132e335l426O94J719K132K794R65Q552j2169k506J946J351n205j1534j391J662
$$ y = [-6569, -9175, 2879, 10856, 8448, 9246, 10765, 17794, 29718, 20942, 17369, 12287, 3249, 5557, 3093, 4129, 12224, 5749, -1457, -3997, -2874, -8863, -17855, -12794, -4798, 880, 504, -1848, -4917, 247, 247, -1481, 1087, 11492, 13483, 2254, 6203, 5469, -5723, -4566, -4549, -9475, -10209, -13353, -8279, -1235, -2601, -5818, -6694, -7152, -3754, -5709, -14437, -17793, -8313, -458, 3065, -84, 801, 4405, 12151, 10935, 2588, -19864, -18411, -8786, -7230, -5158, 4371, 246, 4730, 3181, -3205, -2842, 7548, 8085, 4913, 9794, 15866, 17504, 10930, 351, 6694, 1234, -2313, 228, 4038, 7256, 4610, 84, 9949, 10890, 11680, 18880, 23287, 13745, 4542, 11135, 3669, -7838, -8203, -3672, 1857, -3997, -5882, -6553, -7445, -5335, -8761, -8067, -6348, -4216, -1422, -457, 8095, -4074, -6580, -4634, -3283, -8488, -20022, -21413, -19751]
6117a9751Q673R165N974l334j948r887o345L868l370k205R16Q720R319q72Q94
6102a83J0229K785j6812p082Q292P064M640j3334j764J4392J82J521N392N248
6088B0570j532o445j2852l284j414J6760N290k254n747K224m832l401j892j946
6074g55p790j970P677P774Q334j1036n084p567n572O036j341k009J56R228j233
$$ y = [-19751, -11078, -1913, 4061, 727, -1221, -11108, -17453, -13585, -16955, -19160, -18244, -9524, -205, -1077, -183, 10046, 12831, -3981, -11063, -2771, 4293, 8933, -4401, -6165, 8227, 8409, 9930, 15322, 20570, 19038, 12593, -259, -3543, -4957, 11803, 17093, 14839, 9092, 11316, 6484, 3083, 1191, -755, -8545, -10515, -2838, 4936, 13270, 2234, -2850, -10417, -15989, -9953, -11294, -13303, -13147, -3919, -5152]
$$ [...]
##END NTUPLES=NMR SPECTRUM
##END=
