##TITLE=Analysis number 316167
Compound Code cc 29913
Project Code adrs
Chemist Name synthonics
##JCAMPDX= 6.0         $$ Bruker NMR JCAMP-DX V2.0
##DATA TYPE= NMR SPECTRUM
##DATA CLASS= NTUPLES
##ORIGIN= Bruker BioSpin GmbH
##OWNER= nmr
$$ XWIN-NMR		Version 3.5
$$ Thu Dec 22 08:57:10 2005 GMT Standard Time (UT+0h)  MAYBRIDGE\nmr@NMR_250MHZ
##.OBSERVE FREQUENCY= 250.131544655141
##.OBSERVE NUCLEUS= ^1H
##.ACQUISITION MODE= SIMULTANEOUS (DQD)
##.ACQUISITION SCHEME= undefined
##.AVERAGES= 16
##.DIGITISER RES= 18
##SPECTROMETER/DATA SYSTEM= dpx250
##.PULSE SEQUENCE= zg30
##.SOLVENT NAME= CDCl3
##.SHIFT REFERENCE= (INTERNAL, CDCl3, 0, 16.522)
##AUDIT TRAIL= $$ (NUMBER, WHEN, WHO, WHERE, WHAT)
$$ ##TITLE= Audit trail, XWIN-NMR		Version 3.5
$$ ##JCAMPDX= 5.01
$$ ##ORIGIN= Bruker BioSpin GmbH
$$ ##OWNER= nmr
$$ C:\u/data/dgb/nmr/ADRS/14070/pdata/1/auditp.txt
$$ ##AUDIT TRAIL=  $$ (NUMBER, WHEN, WHO, WHERE, WHAT)
(   1,<2005-12-22 08:56:07.58 +000>,<MAYBRIDGE\nmr>,<NMR_250MHZ>,
      <created by zg, POWCHK disabled, PULCHK disabled
       configuration hash MD5:
       62 19 C7 07 E1 42 D1 B7 37 6C 3D D0 77 39 F9 E6
       data hash MD5: 64K
       1F 8B 55 F7 8C 2E 4A 3D 1C 97 3D 78 AC AD 57 5A>)
(   2,<2005-12-22 08:56:41.02 +000>,<MAYBRIDGE\nmr>,<NMR_250MHZ>,
      <Start of raw data processing
       ef LB = 0.3 FT_mod = 6 PKNL = 1 SI = 32K 
       data hash MD5: 32K
       FC E0 13 D3 EC 3D 8C 8B 06 E3 54 90 32 DC 69 0D>)
(   3,<2005-12-22 08:56:51.22 +000>,<MAYBRIDGE\nmr>,<NMR_250MHZ>,
      <apk 
       data hash MD5: 32K
       41 96 A2 42 B3 10 4F B7 E5 99 CA EF A1 52 3B BD>)
(   4,<2005-12-22 08:56:52.91 +000>,<MAYBRIDGE\nmr>,<NMR_250MHZ>,
      <abs ABSG = 5 
       data hash MD5: 32K
       D2 02 8E 99 D6 AE AB A7 68 81 D2 45 21 E7 6E 83>)
$$ ##END=
$$ 
$$ hash MD5
$$ DD D3 08 AA 87 53 4C 22 0C 73 2A B3 D8 B5 7F E1
##$RELAX= 
##$RELAX= 
##$RELAX= 
##$RELAX= 
##$RELAX= 
##$RELAX= 
##$RELAX= 
$$ Bruker specific parameters
$$ --------------------------
##$DU= <C:\u>
##$EXPNO= 14070
##$NAME= <ADRS>
##$PROCNO= 1
##$TYPE= <nmr>
##$USER= <dgb>
##$AMP= (0..31)
100 100 100 100 100 100 100 100 100 100 100 100 100 100 100 100 100 100 
100 100 100 100 100 100 100 100 100 100 100 100 100 100 
##$AQSEQ= 0
##$AQ_mod= 3
##$AUNM= <au_zg>
##$AUTOPOS= <24 >
##$BF1= 250.13
##$BF2= 250.13
##$BF3= 250.13
##$BF4= 250.13
##$BF5= 500.13
##$BF6= 500.13
##$BF7= 500.13
##$BF8= 500.13
##$BYTORDA= 1
##$CFDGTYP= 0
##$CFRGTYP= 5
##$CHEMSTR= <none>
##$CNST= (0..31)
1 1 145 1 1 1 1 1 1 1 1 1 1 1 1 1 1 1 1 1 1 1 1 1 1 1 1 1 1 1 1 1 
##$CPDPRG= <>
##$CPDPRG1= <>
##$CPDPRG2= <>
##$CPDPRG3= <>
##$CPDPRG4= <mlev>
##$CPDPRG5= <mlev>
##$CPDPRG6= <mlev>
##$CPDPRG7= <mlev>
##$CPDPRG8= <mlev>
##$CPDPRGB= <>
##$CPDPRGT= <>
##$D= (0..31)
0 1 0 0 0 0 0 0 0 0.06 0 0 0 0 0 0 0.0002 0 0 0 0 0 0 0 0 0 0 0 0 0 0 
0 
##$DATE= 1135241765
##$DBL= (0..7)
120 120 120 120 120 120 120 120 
##$DBP= (0..7)
150 150 150 150 150 150 150 150 
##$DBP07= 0
##$DBPNAM0= <>
##$DBPNAM1= <>
##$DBPNAM2= <>
$$ [...]
##$SUBNAM7= <"">
##$SUBNAM8= <"">
##$SUBNAM9= <"">
##$SW= 20.6930455092707
##$SWIBOX= (0..15)
0 0 3 0 0 0 0 0 0 0 0 0 0 0 0 0 
##$SW_h= 5175.983436853
##$TD= 65536
##$TD0= 1
##$TE= 294.16
##$TE2= 300
##$TE3= 300
##$TEG= 300
##$TL= (0..7)
0 120 120 120 120 120 120 120 
##$TP= (0..7)
150 150 150 150 150 150 150 150 
##$TP07= 0
##$TPNAME0= <>
##$TPNAME1= <>
##$TPNAME2= <>
##$TPNAME3= <>
##$TPNAME4= <>
##$TPNAME5= <>
##$TPNAME6= <>
##$TPNAME7= <>
##$TPOAL= (0..7)
0.5 0.5 0.5 0.5 0.5 0.5 0.5 0.5 
##$TPOFFS= (0..7)
0 0 0 0 0 0 0 0 
##$TUNHIN= 0
##$TUNHOUT= 0
##$TUNXOUT= 0
##$USERA1= <user>
##$USERA2= <user>
##$USERA3= <user>
##$USERA4= <user>
##$USERA5= <user>
##$V9= 5
##$VALIST= <valist>
##$VCLIST= <CCCCCCCCCCCCCCC>
##$VD= 0
##$VDLIST= <DDDDDDDDDDDDDDD>
##$VPLIST= <PPPPPPPPPPPPPPP>
##$VTLIST= <TTTTTTTTTTTTTTT>
##$WBST= 1024
##$WBSW= 4
##$XGAIN= (0..3)
0 0 0 0 
##$XL= 0
##$YL= 0
##$YMAX_a= 344034
##$YMIN_a= -651342
##$ZGOPTNS= <>
##$ZL1= 120
##$ZL2= 120
##$ZL3= 120
##$ZL4= 120
##$ABSF1= 16.522
##$ABSF2= -4.171173
##$ABSG= 5
##$ABSL= 3
##$ALPHA= 0
##$AQORDER= 0
##$ASSFAC= 0
##$ASSFACI= 0
##$ASSFACX= 0
##$ASSWID= 0
##$AUNMP= <proc_1d>
##$AZFE= 0.1
##$AZFW= 0.1
##$BCFW= 0
##$BC_mod= 0
##$BYTORDP= 0
##$COROFFS= 0
##$CY= 12.5
##$DATMOD= 1
##$DC= 0
##$DFILT= <>
##$DTYPP= 0
##$F1P= 14.0000005364418
##$F2P= -0.99999901652339
##$FCOR= 0.5
##$FTSIZE= 32768
##$FT_mod= 6
##$GAMMA= 0
##$GB= 0
##$INTBC= 1
##$INTSCL= 1
##$ISEN= 128
##$LB= 0.3
##$LEV0= 0
##$LPBIN= 0
##$MAXI= 10000
##$MC2= 0
##$MEAN= 0
##$ME_mod= 0
##$MI= 0
##$NCOEF= 0
##$NC_proc= -5
##$NLEV= 6
##$NOISF1= 0
##$NOISF2= 0
##$NSP= 0
##$NTH_PI= 0
##$NZP= 0
##$OFFSET= 16.522
##$PC= 1
##$PHC0= -41.9881
##$PHC1= -33.79145
##$PH_mod= 1
##$PKNL= yes
##$PPARMOD= 0
##$PSCAL= 4
##$PSIGN= 0
##$REVERSE= no
##$SF= 250.13
##$SI= 32768
##$SIGF1= 0
##$SIGF2= 0
##$SINO= 400
##$SIOLD= 32768
##$SREGLST= <1H.CDCl3>
##$SSB= 0
##$STSI= 32768
##$STSR= 0
##$SW_p= 5175.98343685301
##$SYMM= 0
##$S_DEV= 0
##$TDeff= 65536
##$TDoff= 0
##$TI= <Analysis number 999999
Compound Code 99
Book Reference 9
Project Code 9>
##$TILT= no
##$TM1= 0
##$TM2= 0
##$TOPLEV= 0
##$USERP1= <user>
##$USERP2= <user>
##$USERP3= <user>
##$USERP4= <user>
##$USERP5= <user>
##$WDW= 1
##$XDIM= 32768
##$YMAX_p= 546084505
##$YMIN_p= -954836
$$ End of Bruker specific parameters
$$ ---------------------------------
##NTUPLES= NMR SPECTRUM
##VAR_NAME=  FREQUENCY,     SPECTRUM/REAL,   SPECTRUM/IMAG
##SYMBOL=    X,             R,               I
##VAR_TYPE=  INDEPENDENT,   DEPENDENT,       DEPENDENT
##VAR_FORM=  AFFN,          ASDF,            ASDF
##VAR_DIM=   32768,         32768,           32768
##UNITS=     HZ,            ARBITRARY UNITS, ARBITRARY UNITS
##FACTOR=    0.157963299565203, 1,           1
##FIRST=     4132.6476996994, 0,             0
##LAST=      -1043.33573715361, 0,           0
##MIN=       -1043.33573715361, -954836,     0
##MAX=       4132.6476996994, 546084505,     0
$$ Real data points
##PAGE= N=1
##DATA TABLE= (X++(R..R)), XYDATA
$$ [...]
20185 1094 14745 -212 -18333 -10701 5214 17661 19082 16033 20517 32250 20883 -3310 -13701
20172 -13701 -16278 -12395 -15338 -25486 -6203 -4379 3905 -1178 -3935 1169 5677 17747 20752 16150
20158 16150 10553 13646 4334 3586 -10513 -22037 -25375 -21879 -24398 -21508 -6876 -8680 204 14584
20144 14584 9975 -3438 21151 24854 14357 18891 20239 20082 7691 -415 -11597 -13622 -5212
20131 -5212 17097 8977 7400 13447 21317 23854 19330 22862 19213 20429 5509 15919 32389 21485
20117 21485 8727 10743 13679 14191 17441 21180 11832 17314 29140 40677 23188 16447 33457
20104 33457 21148 8766 11519 27760 27800 24812 10456 -140 11965 -516 -16516 -14797 2326
20091 2326 4080 9555 8782 14221 9074 14673 -5101 -1075 8144 1604 -5392 -14443 -17496 -5096
20077 -5096 -9989 -5540 -9501 -7222 3726 6706 21115 30628 35045 32332 39426 38682 25310 1898
20063 1898 -1386 -12268 -1468 11080 10935 4872 -1483 -7192 -17271 -22368 -24634 -9790 -21175
20050 -21175 -23710 -4358 -3506 9944 7815 -8239 -10753 -3944 200 7521 12816 8828 10268 9960
20036 9960 745 -3419 -8834 -3690 3489 -2148 -3827 -18510 -35728 -31010 -8981 5686 5366 -8152
20022 -8152 -24692 -19160 -19214 -17292 -17301 -11807 6494 20853 19465 14098 17114 10965 -5767 -12131 -13809
20007 -13809 -7624 6789 12779 2925 8960 3742 4790 5189 -10790 -22059 -5107 -1572 7098 17687
19993 17687 20175 -30 -2308 9183 4071 -18762 -33566 -23119 -1555 12634 4175 -1996 -1353
19980 -1353 2952 12616 26940 23031 7262 -7135 4218 4892 16604 19384 18005 -1650 4318
19967 4318 6893 -4168 2733 -980 -7444 -1774 9371 16979 10648 14451 14608 -1952 -8800 6755
19953 6755 5664 62 -1819 -254 -3650 -3665 4926 2121 11000 415 -11800 -16789 -5561 13023
19939 13023 16655 -5535 -20649 -3528 1583 8919 16276 -979 -7695 5044 4003 3327 9182
19926 9182 -10911 -20518 -15791 -7924 -2630 -4739 -15756 -12707 12299 27428 35748 21486 11214
19913 11214 3338 -6061 -7893 2773 19380 26483 22995 17274 16324 22157 21604 23108 10606 881
19899 881 10034 15960 21070 13073 12860 4947 5961 12914 10255 9272 -11842 -23419 -16709 -5451 4471
19884 4471 13001 1963 -8158 -15680 -11670 -9940 -13715 -13867 1908 -3589 -13610 -7963 7939 6783
19870 6783 -18889 -9626 2326 2876 2051 -12812 -11189 -13131 -6219 -4824 -4955 -3017 8071 4425
19856 4425 -11410 -9021 -2536 -2365 -10622 -8530 -24272 -18243 -16703 -22259 -28590 -11156 -17809 -24824
19842 -24824 -35432 -37693 -32033 -21163 -15111 -15035 -18414 -8166 -4631 -2830 15340 19974 10499 -281
19828 -281 5104 -809 2254 3503 2655 -1254 -9590 -4547 -127 1198 7592 3099 11233 15296 19828
19813 19828 23238 11060 4237 5558 7801 19543 21945 10320 3144 4907 -7600 -17133 -8120
19800 -8120 -6316 1910 -23491 -16614 4016 11991 -1879 -20228 -5351 4522 1789 8706 16761
19787 16761 19704 8487 7428 7293 -4782 749 -1257 1841 -3175 -11997 -4407 2487 11510 15456
19773 15456 23809 21024 17717 18607 6689 -3086 -9801 -24053 -15865 -10589 -20293 -15100 2689 27065
19759 27065 23135 4971 -5312 1622 -4889 -20553 -14015 -20072 -15279 -22667 -28304 -20501 3503
19746 3503 -4430 13253 15572 27881 31240 25170 18758 11426 15073 28711 11733 -32 -9098
19733 -9098 -9685 9991 19228 25024 27295 23385 3711 -21645 -22394 -10386 4806 15594 14205 6131
19719 6131 -555 -7664 -16332 -34635 -35481 -9880 18224 20920 14044 11964 23944 28269 13945 -5081
19705 -5081 -11548 -13681 -4717 6422 13012 13187 10044 26342 29478 21540 14261 3969 14942 25608
19691 25608 9966 -452 11197 22134 31355 14555 -210 -4 -10427 1829 15703 28697
19679 28697 11659 -7680 2486 4890 784 -6055 -14744 -27919 -26339 -19845 -8137 11435 7906
19666 7906 -27347 -30733 -29899 -22169 -14652 -4552 3268 -166 -3806 -1072 -8663 -19574 -9530 -16829
19652 -16829 -25271 -24402 -16967 -5806 -9940 3280 11217 26730 11747 -1813 2397 7172 12281
19639 12281 22270 17828 16950 5579 4372 -1810 350 6510 -504 4067 4774 15974 28515 27850
19625 27850 27807 5422 -188 -3801 -9045 -13075 -6395 -9305 -12146 -15262 -11831 771 15498 19338
19611 19338 1081 -3792 -4727 420 -3207 -20492 -12968 -1037 2465 12599 16300 13723 22174 15103
19597 15103 22812 18299 5536 7916 23594 25386 18788 23479 4378 -2086 11480 7589 -4183
19584 -4183 -15416 -20931 -18861 -8027 -308 18202 21324 14587 -6968 -17326 -11831 -1352 34
19571 34 -9011 -11978 -1178 -743 9212 28648 14255 5601 8832 6523 28224 24493 8041 2149
19557 2149 -1981 2807 -4934 -5742 3417 -8212 -20598 -11195 -2095 5073 1623 808 -12711 -12618 5551
19542 5551 9763 981 -9529 -12455 -30383 -37933 -19162 -6356 -16964 -23678 -26476 -42598 -45127
19529 -45127 -23819 -7002 -557 -7183 -6973 -7701 7977 11998 3609 -3657 -3101 5812 17642 9465
19515 9465 -4973 -21104 -32355 -27007 -16660 -22681 -29493 -23334 -12212 5630 8208 -1673 -7632
19502 -7632 -5233 -868 -7829 -8778 -2209 15400 25974 14479 5559 -7215 -18554 -14000 -12849 2395
19488 2395 14482 -1337 -1075 1399 3971 2888 -11215 -9714 6497 11467 12125 -5960 -2227 4154
19474 4154 14024 15639 -1676 -741 -3466 22 19635 25914 24897 13095 5982 -9494 -19293 -24875
19460 -24875 -28957 -15655 -2304 -703 5343 5017 -2686 -15314 -5421 2411 5123 -8167 -11154 -9569
19446 -9569 -9074 -21090 -19481 -16956 140 4896 17320 26010 -200 -14845 -17121 -12530 10000
19433 10000 28550 32953 24914 7589 -603 -674 11853 -5111 -18980 -10808 -10478 -13269 -17351 -22592
19419 -22592 -28275 -11064 -1711 1597 -8197 -25323 -29014 -30266 -15872 -24384 -22516 -18607 -17004 7825
19405 7825 16594 11093 10848 -10192 -20417 -25556 -20032 -4217 -6126 -16410 -23069 -14640 -18094 -17006
19391 -17006 -15937 -9141 5857 8613 -5646 -6893 -3093 -6959 -10314 -8351 7072 9546 827 -8859
19377 -8859 819 2524 -8423 -2726 -9301 -4296 623 25209 8638 -4990 -10603 3370 -10
19364 -10 3254 11399 26119 27252 18707 23418 40730 47327 30910 16274 6930 -17869 -24849 -3820
19350 -3820 12187 14163 16290 22814 19426 3371 -8950 -36111 -50523 -33479 -20195 -29606 -24834
19337 -24834 -22721 -14447 -4627 11903 16740 18413 9873 8593 13454 5862 8377 18262 11728 1432
19323 1432 6544 -6733 1877 -6525 -24053 -8268 2076 -2012 -10492 -7867 -13061 -15087 -23008 -14208
19309 -14208 -5113 -263 -376 7002 12259 16970 -922 -16048 -18659 -4233 -11564 -10924 2028 4073
19295 4073 -7594 -18101 -19606 -5936 -2144 -16576 -21131 -22080 -11935 -15238 -7895 12104 18448
19282 18448 -211 -7102 -11165 -26854 -21812 -6415 6202 17716 15649 9957 -3202 -3080 -3612
19269 -3612 -10769 -2239 -3765 -6729 -4664 -17837 -25393 -15006 4815 13067 9359 -1283 -8051 6471
19255 6471 355 10175 15108 -12371 -22760 -20966 -27668 -13510 4515 18545 22101 10694 465
19242 465 12099 6894 -2537 3375 10582 12060 -8275 -27615 -29704 -26124 -16916 -9512 -14492 -21524
19228 -21524 -15055 -7620 4749 11079 3400 -8961 -21686 -12924 -12 1636 5344 2379 14153
19215 14153 3858 3464 15772 1895 -9898 -1600 -5921 2854 9757 1325 4256 10097 7281 -11079
19201 -11079 -14463 2142 -52 -6312 956 15249 13081 6932 4627 -12680 -7538 -6541 -13550 -16578
19187 -16578 -6976 -1942 378 -14374 -28963 -16820 -17102 -24841 -23798 -6844 -9108 -24772 -32205
19174 -32205 -32995 -38015 -33665 -20918 2340 -3785 5282 28351 29127 10884 -4290 -4386 -10541 758
19160 758 -8620 -11156 2255 12633 8923 -2828 -13554 -4246 771 5220 666 -5823 -12605 -23191
19146 -23191 -16970 -630 1434 -14963 -29700 -14815 -9133 -20325 -12498 -12624 -16550 -26727 -40135
19133 -40135 -42437 -26420 -15985 -14604 -3492 6950 14437 3622 -17917 -29849 -27141 -6116
19121 -6116 126 -8009 -14794 -16004 -12560 -12066 -19547 -24804 -21724 -13009 -11948 -5710 3649 -6463 -7528
19106 -7528 -2550 2068 -2056 -11530 -17203 -15998 -16373 -2833 2029 16716 11291 6306 19140 5944
19092 5944 -2817 4630 3757 -4194 507 -5015 6569 2342 -13665 -22263 -17767 -3084 -3196 -12094
19078 -12094 -7219 -15715 -26743 -12912 -5667 -9085 1880 1895 -9452 -19589 -16222 -16891 -5826 4042
19064 4042 3230 806 10122 10836 5501 3539 -5654 3819 14580 4945 -2669 -13238 -26770 -37512
19050 -37512 -37394 -29655 -25031 -28938 -23904 -19722 -16461 -16212 -8249 -5434 -17066 -22333 -24164 -17166 -22587
19035 -22587 -14379 3876 14401 11233 -381 -11297 -3023 1661 -4329 -682 18540 10380 -7696
19022 -7696 -3906 -21807 -29490 -17480 -5950 -16738 -4118 10614 -9640 -30224 -30008 -17717 -21276
19009 -21276 -6934 6803 3862 5318 19158 5922 -8368 -5883 -1280 592 9487 12338 17738
18996 17738 7081 9447 12673 -2863 -5504 -12819 -1048 9405 9302 10931 2532 -17035 -16693 -15467
18982 -15467 -12985 -18255 -12771 -25283 -26347 -18903 -14628 -27489 -29292 -8772 1430 -1134 783
18969 783 8826 18676 20899 8390 -4405 3641 6592 -3551 -7493 -4597 -10803 -7498 -752 8882
18955 8882 8062 24229 15826 -1564 -14971 -15713 -6310 -12067 -18050 -2192 -5288 -11792 -12061 -16785
18941 -16785 -16089 -133 3416 10454 16980 10089 -3327 -19157 -24564 -18689 -19146 -27302 -28239 -8405
18927 -8405 -7295 -24281 -34899 -15953 -4405 -8582 6351 2132 -5887 -1130 -11596 -9628 -4241
18914 -4241 3563 -1592 -5396 -13485 -26687 -33988 -38817 -21640 1135 -6887 -12198 -10513 -23668 -30872
18900 -30872 -35953 -24512 -18545 -23161 -16516 -166 723 -7936 -7302 -2902 -9015 -831 7096 15072
18886 15072 -3333 -14675 -20324 -17444 -21107 -11411 -11379 -8472 870 17855 17194 8159 5143 1849
18872 1849 3114 535 -6515 -21426 -34169 -34606 -25306 -24347 -23238 -15254 -205 6635 3399 -1761
18858 -1761 261 -4181 -10510 -8386 -16808 -27324 -29908 -28460 -28023 -28141 -27436 -27525 -38977 -35560 -27551
18843 -27551 -28705 -12527 -3195 -2598 10 -4260 -13031 -14448 -3535 14994 11078 3426 15007 2181
18829 2181 -5285 -7423 -23756 -34565 -36043 -24467 -15381 -29688 -34753 -15719 -3031 2453 -2504
18816 -2504 -13246 -15523 -26245 -33150 -34362 -34065 -31487 -25419 -22225 -33379 -29116 -21753 -22461 -8429
18802 -8429 -12196 -28705 -12370 -7373 -8628 -24874 -41168 -32958 -17528 -6331 -1593 -11463 -15914
18789 -15914 -14669 -18955 -28334 -25407 -9130 -17356 -20574 -17168 -24158 -29811 -24736 -21034 -18549 -3378
18775 -3378 4893 -11559 -12088 -2277 4961 -6588 -3305 23983 61310 91358 76630 70729 69158
18762 69158 65342 56798 50537 44377 26692 5368 -12258 -10374 1579 4295 -15135 -21084 -10251
18749 -10251 -8624 -3746 1324 1875 1557 4282 3611 10831 -1678 -4287 -6973 -15709 -19028 -27103 -28976
18734 -28976 -41698 -26797 -6993 -8659 -19747 -19860 -10673 -10210 3567 -4979 -6210 -6696 -17049 -6812
18720 -6812 16807 640 -10895 -12652 -15876 -26231 -35936 -34507 -22307 -4398 5578 -7654 -7271
18707 -7271 -13934 -15991 -25875 -12851 -22054 -35236 -26825 -24433 -16016 -3099 -9493 -31882 -30822 -29985
18693 -29985 -24956 -24377 -10622 6679 -1085 -9466 -15355 -11608 -5580 -6971 -16406 -31110 -45959 -42494
18679 -42494 -33514 -27911 -25354 -23126 -27805 -26986 -41045 -41262 -40400 -24197 -29118 -26173 -4542 -2736
18665 -2736 -25817 -36028 -33352 -23493 -20733 -19020 -885 9168 1189 -27430 -38247 -41584 -39374
18652 -39374 -20661 -15102 -16621 -15356 -22711 -29505 -28606 -17464 -29282 -14943 -17705 -18469 -22389 -31897
18638 -31897 -18560 -10112 -10314 -21486 -13660 -6869 8820 7820 1586 -582 5687 -1485 -25122 -22303
18624 -22303 -10781 -13388 -20486 -35633 -44506 -33695 -21253 -21305 -9528 -4812 -15908 -23413 -28884
18611 -28884 -36284 -26533 -7246 -204 -9236 -17385 -30957 -43867 -32258 -10016 -7511 -31334 -29926
18598 -29926 -31442 -32315 -21729 -12330 -14280 -21659 -15281 -20560 -26501 -32071 -30720 -13843 -7324 -3486
18584 -3486 -2104 -263 -6412 -18957 -31246 -31036 -19419 -9054 -23705 -7479 22392 8155 -7457
18571 -7457 -7541 -5049 -6098 4246 14688 18134 10209 -1470 -20862 -30149 -21781 -16755 -24717 -31683
18557 -31683 -25166 -25654 -13665 -8586 -23096 -11330 -13156 -21364 -14812 -8475 -12012 -13749 -14114 -7099
18543 -7099 -10189 -7429 -3735 -10277 -13179 -8435 8431 6039 -4522 -7146 -12604 -21396 -32654 -24473
18529 -24473 -21408 -22494 -29306 -41256 -31468 -24268 -19621 -7580 -10736 -14368 -16074 -27275 -25239 -41428
18515 -41428 -49732 -38238 -34003 -23676 -20316 -31292 -39701 -37828 -30147 -24207 -30899 -35424 -25801 -24063
18501 -24063 -30823 -43497 -42618 -26375 -30600 -32734 -29008 -16298 -16768 -24228 -33062 -35459 -31664 -14521
18487 -14521 -16388 -29385 -23932 -25414 -21025 -24277 -28421 -32079 -35358 -38632 -39920 -36998 -37047 -44453 -41065
18472 -41065 -46550 -60751 -51635 -33648 -42304 -45709 -37723 -15027 -15182 -22841 -17221 -31051 -36363 -14925
18458 -14925 -13421 -23674 -21522 -12674 -9183 -11351 -16485 -15991 -12360 -2263 -10022 -16648 -30552 -32828
18444 -32828 -42013 -35960 -34568 -35258 -41832 -34067 -20939 -22785 -23892 -33868 -36068 -43435 -46417 -46829 -41044
18429 -41044 -32933 -47807 -58699 -40959 -29498 -24303 -31298 -44824 -54154 -62256 -66390 -66437 -56167
18416 -56167 -39983 -41702 -37049 -28200 -20341 -27311 -26627 -26835 -13206 -5719 -5783 358 -3554 13526 4241
18401 4241 -7713 -14428 -25950 -43485 -36087 -53860 -59086 -46829 -29675 -27711 -38621 -44214 -43619
18388 -43619 -35661 -34931 -44535 -41811 -35297 -22385 -30512 -32101 -34892 -52511 -54775 -67443 -62599 -61239
18374 -61239 -42997 -41828 -47380 -50720 -73817 -72445 -54474 -52636 -52994 -41924 -35406 -33445 -12570
18361 -12570 -5202 -11108 -6522 -6750 -19809 -32042 -44086 -36974 -27343 -20399 -29340 -40088 -34280 -31722
18347 -31722 -30071 -16533 -27149 -38369 -30895 -18557 -16448 -22580 -21651 -43515 -54298 -59951 -61839
18334 -61839 -55289 -56461 -57271 -60231 -54386 -55325 -56094 -44001 -32844 -29417 -24063 -20604 -32481 -41402
18320 -41402 -34078 -44291 -40804 -47023 -38937 -30739 -26616 -30901 -24232 -23170 -39698 -47264 -69016 -56534
18306 -56534 -39857 -30399 -37125 -47491 -60733 -62182 -57161 -48809 -38537 -40336 -45623 -47478 -43239
18293 -43239 -45662 -70913 -61737 -69970 -71871 -55993 -47486 -56991 -53065 -43335 -35224 -31735 -49251 -63533
18279 -63533 -41134 -50603 -77626 -90241 -77601 -64393 -64805 -69718 -57280 -64503 -69624 -71739 -69965
18266 -69965 -65389 -47591 -52354 -52130 -43797 -55547 -46297 -42848 -40946 -52288 -61362 -67128 -70223 -63713
18252 -63713 -69623 -66171 -65483 -71975 -82464 -78500 -65181 -60319 -63102 -68794 -69180 -81048 -97249 -98593
18238 -98593 -97959 -104040 -89175 -73309 -57737 -45369 -29517 -25649 -24544 -24338 -40861 -43738 -50691
18225 -50691 -61538 -74665 -73504 -72415 -79329 -76865 -74252 -80364 -71251 -63947 -59999 -60086 -78755 -81668
18211 -81668 -84646 -86116 -82669 -95770 -89010 -84331 -90387 -87793 -99993 -105383 -101843 -91407 -95413 -103450
18197 -103450 -103444 -101216 -86201 -87590 -104516 -122065 -126702 -119895 -113391 -112551 -119933 -113866 -120163 -124917
18183 -124917 -125998 -123340 -114603 -115232 -124213 -120140 -108357 -105690 -94042 -106675 -125613 -124752 -138583
18170 -138583 -133728 -135498 -153220 -160922 -151200 -134709 -129905 -123905 -124808 -125925 -134363 -149752 -148755 -145825
18156 -145825 -150779 -172526 -169250 -166177 -196217 -197349 -180306 -167301 -168044 -169820 -166148 -181624 -191457
18143 -191457 -202419 -192816 -192276 -209490 -225771 -207631 -220373 -228056 -216937 -223772 -229485 -209421 -200070
18130 -200070 -186407 -183033 -187955 -210512 -211277 -193823 -182316 -173780 -166229 -157727 -132298 -103926 -76614
18117 -76614 -29075 48271 147568 292016 508414 826508 1290684 2035823 3423522 6348973
18107 6348973 12625538 20263071 21451729 18852681 16692714 15086767 12467788 9063241
18099 9063241 6449606 4837958 3831408 3150909 2693795 2357128 2092119 1896145 1736733
18090 1736733 1597484 1473892 1339972 1210873 1108349 1024573 951601 907597 854708 788633
18080 788633 730088 684903 651752 630715 603480 565341 529703 499726 479788 465094 451650
18069 451650 440666 417337 394906 365731 337989 337395 354662 354139 348915 337490 315869 291736
18057 291736 268239 270031 283893 259282 232249 235531 242222 224371 220554 231375 234718 223921
18045 223921 200442 212350 212839 186837 174237 169570 170069 174203 177657 173519 162213 153618 146422
18032 146422 148124 133830 127504 133611 148723 159348 164255 148148 131185 125786 135217 147153 151914
18019 151914 144535 131802 128873 113682 119408 110532 108759 110214 116943 124877 115255 114783 126142 120364
18005 120364 112775 98319 97089 99264 96280 92008 96706 111514 103823 107876 111907 109530 102680 88877
17991 88877 97649 87909 77224 72542 77976 70167 77180 97001 97319 84466 80444 74996 73647 75475
17977 75475 71782 63299 62747 65818 72771 79370 88026 100547 89913 100932 106103 89090 68060
17964 68060 70752 72335 71201 66577 66541 71231 74562 69922 79511 86095 93452 98714 92516 80229 55237
17949 55237 43670 41516 41682 42361 49008 60585 60111 74130 79325 78121 77088 65366 51812 31696
17935 31696 24155 23399 24997 41244 47762 62174 54532 53476 53111 46696 45636 44328 51617 49945
17921 49945 48954 49507 49836 49481 45335 39616 34769 29965 25227 25550 40846 36996 19883 25340 33663
17906 33663 16171 9365 33640 47053 47714 38610 30717 37373 44342 42391 48794 61337 67836 65273
17892 65273 58062 48720 40962 34508 12836 15792 25036 45446 54226 38458 31315 24705 23328 5223
17878 5223 6837 27657 38170 26533 7474 7614 16266 31450 16206 19344 21411 22584 40357
17865 40357 42644 34773 35784 28979 21521 12791 21781 36359 32485 27869 38475 47823 57520 47588
17851 47588 35953 30964 31838 30925 22511 21400 20754 23698 35972 40801 28368 35554 44086 42108
17837 42108 52860 54402 46790 31245 30678 40045 48690 35535 33440 41899 49373 41594 37578 8960
17823 8960 -6510 1562 12371 8139 13045 19972 24031 32034 33871 28826 24774 19540 26152 25114
17809 25114 26636 30584 20722 -312 3856 12119 -2595 -11430 -6822 -3941 -7998 2458 23035
17796 23035 24505 33961 29558 31560 36203 40786 43150 35323 33324 18450 24284 21389 13491 520
17782 520 7209 12578 12033 6433 11326 25914 16303 16011 18218 42719 54113 36386 22569 26267
17768 26267 42508 38952 34042 31515 37218 36391 29926 24909 29945 29702 43189 30135 25855 10956
17754 10956 1823 2196 4776 -3029 -6968 -7368 -5835 -2478 6094 13696 11972 18676 10258 2287 16132
17739 16132 25588 19568 24730 30405 32716 31237 31792 28347 32837 24260 17155 21573 21517 26341 17604
17724 17604 20125 2081 -6118 -3447 -1644 -3753 -528 2621 32729 42253 31090 34594 50930
17711 50930 36267 15845 18998 18886 10616 -290 3733 8366 10391 14554 19949 22844 20643 27309
17697 27309 28738 13092 26381 34336 25985 16485 17637 17321 23838 14136 -404 8166 10783 17028
17683 17028 13422 2723 12577 12793 8169 -6801 -10979 8608 24761 3004 -5503 14198 27632
17670 27632 27767 35433 23687 10663 5993 5050 25682 23398 11722 7190 12850 28118 16257
17657 16257 -13 -11066 -4996 -318 -1463 12867 30118 40425 42154 30031 15945 -688
17645 -688 -2176 -1431 3296 -8924 -19044 -2927 376 3161 12271 -4141 5230 11547 18919 23555
17631 23555 23006 33389 41313 35856 21725 9542 -1730 -5557 -10444 -3223 -3239 1333 16335 -9681
17617 -9681 -7187 16279 31214 23738 12300 592 -15725 -9445 6193 -151 -18187 -24290 -18324
17604 -18324 -13823 -1596 16978 31418 39524 25396 15548 6031 16470 33225 34249 41920 23729
17591 23729 11988 1268 5905 18257 24362 16947 23324 28186 25858 35397 22699 -4941 -21539
17578 -21539 -31450 -37005 -36923 -22692 -6429 -948 -212 2548 3999 -8009 -10160 -7580 -1058 8688
17564 8688 -5442 -13507 -23754 -21550 1093 -2039 -12167 -10733 -2770 7486 11292 21768 24956
17551 24956 32061 38794 30757 24956 -4355 -18085 8176 19228 33442 39855 25302 12102 9643
17538 9643 13487 -6398 -12181 -16460 -12342 -6652 -13927 -6807 7490 23218 33927 47137 38083
17525 38083 13284 -5008 -9489 -7713 -10360 -3656 9726 18975 35644 25929 19472 30274 31781
17512 31781 19579 27229 19930 6192 -2309 8000 11821 8936 6139 -3041 -1920 2231 23807
17499 23807 29219 14336 7034 8463 9183 2944 5991 8024 9693 -1612 -282 -7723 -10560 -12007
17485 -12007 -15640 -8221 -8724 7786 3920 -6573 -6833 5880 6422 3561 19054 33460 31486 14145
17471 14145 9169 -8643 -6178 24108 29183 18750 7705 7310 19314 20604 13706 -12255 -6876
17458 -6876 5283 -4610 -13004 -16738 7347 14227 -240 -1730 5236 9807 20489 22180 18697 872
17444 872 6053 30849 26842 18557 13465 53324 97317 118285 114224 79739 63173 53690 44277
17431 44277 37017 18393 25065 14847 13931 30891 34447 36516 46566 48130 49136 33603 25942
17418 25942 13258 10257 8165 11956 8757 18453 15405 16988 12252 22668 19760 5016 19871
17405 19871 25173 14751 25180 22106 15127 12479 9365 16572 11465 -1890 6122 -2001 -10050 -13364
17391 -13364 -13910 1553 1948 -4921 -869 -11923 -5921 6061 14257 14304 18715 21157 8094 -760
17377 -760 5271 2479 -11121 -12748 -17646 10638 19010 18216 8560 251 -1432 -5020 1815 12645
17363 12645 11215 13684 -22 -11705 -1431 1508 2835 25969 27904 22990 29892 29378 39566
17350 39566 20435 9964 6578 24811 30850 18567 -737 -4424 4322 9763 15197 9534 2744
17337 2744 20567 35166 31868 20132 10499 11358 2926 13693 -796 -2247 10124 9165 6798 10146
17323 10146 5530 12579 13628 17099 21545 19958 11029 -10238 -11155 -253 2287 3590 9484 31300
17309 31300 22560 7980 -7247 -10822 -21734 -26999 -38930 -30771 -19117 -25500 -28474 -5402 514
17296 514 -1201 15995 17552 14222 562 -20312 -25270 -13041 -12998 -20619 -19167 -20033 -24614 -13603
17282 -13603 -11647 1732 1779 -9489 -3547 -9944 -23222 -21939 -22113 -23178 -15192 -5396 -5230 -3380 12133
17267 12133 14142 -6044 -22883 -16093 -17116 -21600 -19147 -31794 -40874 -34798 -21022 -10897 -10807 -3805
17253 -3805 -8163 -20443 -40559 -54571 -47836 -32743 -29155 -21218 -15471 1612 13954 20420 19824
17240 19824 8648 3601 -258 -4575 -11590 -30355 -22031 -28934 -38831 -33872 -27624 -10655 -3611 10902
17226 10902 17867 -5302 -17183 -13916 -3719 -1923 -7529 -32395 -36290 -25248 7286 16859 1447
17213 1447 -5336 -8223 224 2534 -7168 -20074 -13868 -20549 -17648 6325 380 -9132 -2090 102
17199 102 -8848 -20386 -27720 -23096 -18842 -11576 -8570 -7975 754 -3436 1149 4762 5242 3829 -1991
17184 -1991 -4708 2329 -26661 -20316 -12315 1220 13784 11086 12200 14364 6941 17345 5186
17171 5186 -6845 11614 35298 33408 19819 9966 12939 28321 35870 27030 23861 2549 4648
17158 4648 5784 7709 1234 800 -2055 -7346 7834 18274 4509 10527 15525 20117 12083 4230
17144 4230 12330 22388 20574 11880 6685 -3734 -10297 -18839 -12160 -692 15289 16776 15972 14406
17130 14406 575 -18517 -21137 -15979 -14630 -4570 -4214 69 4189 1277 7228 12487 12487 17640 9094
17115 9094 -162 -3864 2929 -4065 -5565 11794 4577 6003 10648 5474 12008 24094 6106 5841
17101 5841 11395 13586 7566 -6520 -23630 -30728 -30863 -24698 -10719 -4651 1392 6951 -1603 4874
17087 4874 2844 -10372 -17533 -18637 -15003 -2652 -9514 3492 15821 16511 3935 6715 8011 3538
17073 3538 3143 -3284 5439 1923 -8817 -11750 -10646 3065 -5275 -19651 -26367 -24339 -16997 -5557
17059 -5557 1973 -4367 -13013 -23922 -28132 -28933 -5284 5452 -9466 -22760 -5335 5664 -3321
17046 -3321 -12878 -10615 -4892 -13545 -24258 -26604 -30852 -19253 -4396 -7342 -8627 -14769 -9112 11671
17032 11671 16322 10402 -654 -14736 -23834 -31127 -9872 230 -12276 -22485 -14514 -83 3130
17019 3130 -12243 -10610 -7218 -28951 -20621 -31585 -31771 -34957 -19697 -8902 -11711 -16564 -8032 3664
17005 3664 4246 -15735 -21954 -20937 -21159 -34993 -32123 -21960 -11989 -5261 -13578 -11590 -13238 -20074
16991 -20074 -35446 -26723 -14761 -2796 10668 2211 -8901 -9424 -15263 -30972 -22085 -11149 -27725
16978 -27725 -40890 -32729 -35780 -22897 -19548 -15609 -13930 -5183 -1216 -4861 -4778 867 11612 18645
16964 18645 15665 -1142 -16026 -12969 -2740 4215 -9077 -18839 -12835 -19162 -16343 -11015 -9262
16951 -9262 -10649 -10600 -11931 -24627 -21190 -8076 -4379 4030 7480 22626 20975 -121 -10445 -16067
16937 -16067 -19937 -20701 -12881 -4656 -16921 -32167 -40238 -24413 -19234 -38720 -44523 -29306 -23324
16924 -23324 -22577 -9694 -14248 -13033 -17295 -10914 -21167 -19661 -23169 -11773 -8292 10196 6709 3939
16910 3939 1127 -13145 -38151 -37779 -32856 -16617 -12844 -29591 -34465 -29379 -9022 -18763 -19769 -12253
16896 -12253 -16785 -13560 -14793 -11193 -6711 -7454 -10451 -10484 4810 -9807 -13657 -10828 6240 10348
16882 10348 1611 -10346 -4485 -5173 -355 12184 12656 7865 8234 6925 9263 -7534 -3140 -18598
16868 -18598 -36273 -35279 -16866 -22044 -33417 -25134 -9588 3063 20128 14483 -3128 -8128 -8473
16855 -8473 -14833 -18932 -25649 -27912 -24661 -27766 -22175 -25784 -37100 -36417 -28427 -27602 -28169 -17438 -18765
16840 -18765 -20495 -15077 -23193 -10404 -18936 -23541 -21579 -6968 2882 2862 21141 24661 3390 -16960
16826 -16960 -8430 -8649 -18641 -32398 -31498 -28792 -21673 -13404 -16604 -32120 -19063 2145 6244 -711
16812 -711 3589 1192 -9082 -8083 10022 23330 17312 423 -7836 -21426 -27218 -7133 -12964 -14786
16798 -14786 -15356 -15915 -10085 -5993 -10682 -22253 -23697 -19183 -13438 -2863 -2494 395 -5987 -14274 -22025
16783 -22025 -14223 272 7180 -8545 -8383 -33888 -33356 -21223 -32780 -45003 -40063 -22505 -17462
16770 -17462 -22193 -28454 -33191 -42743 -34298 -29253 -38208 -38204 -26706 -13168 -1996 -552 -9579 -16667
16756 -16667 -30604 -34310 -24390 -29440 -21619 -26427 -22638 -25236 -15978 -4829 -13850 -16676 -10956 -10231
16742 -10231 1691 7798 5896 -377 1802 2445 -10112 -9432 -17156 -20812 -20852 -22048 -27918 -23199 -25082
16727 -25082 -32734 -31246 -20014 -14236 -15488 -23777 -16023 14032 11749 3855 -3797 -7448 -8349 -18264
16713 -18264 -11266 -5791 -10798 -12657 -4546 -19980 -15566 -6611 2443 -5856 -4013 -12031 -17979 3073
16699 3073 -7737 -8409 -5980 -3510 -7051 -3728 -4664 7426 22963 9874 -14366 -17976 -29869 -31869
16685 -31869 -22606 -20522 -21209 -24666 -10543 -2238 1095 -3541 -134 -13524 -11679 940 -6986 -12557
16671 -12557 -11149 6 2841 -7785 -4103 -666 2545 -6825 -8087 -1068 -15389 -8854 -1391 -471
16657 -471 12596 1846 -10096 -19524 -15844 -4958 -13085 -21505 -22085 -31294 -10640 2673 3293 2815
16643 2815 -4979 -6237 -1355 12235 -5343 -10797 -4534 -16900 -18304 -19310 -10653 1981 -15916
16630 -15916 -33217 -20216 1196 -3863 -8313 -12271 -19603 -24516 -23346 -28657 -14963 -5318 -20356
16617 -20356 -27555 -14470 1886 -4159 -11613 -9384 11821 14420 5917 -13477 -18637 -15732 -22854
16604 -22854 -43135 -39945 -36716 -36195 -34518 -33409 -33790 -24712 -14398 -24626 -25951 -25980 -23762 -24023 -20512
16589 -20512 -13824 -13552 -14709 -12427 -4370 -3887 -19745 -42954 -42436 -29925 -25148 -23032 -15682 -12975
16575 -12975 -3433 -14434 -23713 -28417 -16853 -20784 -27274 -19989 -25189 -46293 -33496 -37949 -43484
16562 -43484 -43225 -45554 -23461 -5757 12208 21918 22632 12557 15644 4865 -10370 -3521 2983
16549 2983 9347 4278 -12819 -28907 -17681 2185 9261 5909 -3548 2109 5811 -137 -93 -21561
16535 -21561 -54657 -59312 -62651 -60348 -52784 -41782 -20475 -9712 -16069 -18525 -16670 -14121 -13811 -15864
16521 -15864 -25347 -29435 -32094 -27068 -21447 -7305 -7467 -7370 -12157 -4768 -4496 -30718 -48834 -39614 -36641
16506 -36641 -28988 -21854 -20994 -17897 -5074 5234 -9912 -30176 -27531 -26220 -31251 -16333 2501
16493 2501 -6237 -19133 -19504 -9011 -232 3844 -3430 -5312 2037 -647 -13338 -25211 -7687 -7167
16479 -7167 -22236 -8313 -7349 8426 10328 18980 15263 -8242 -24156 -38394 -31967 -21744 -8083
16466 -8083 -13446 -12451 -11865 -16614 -19271 -29364 -46177 -34217 -16593 -22248 -39363 -39843 -31728 -15147
16452 -15147 -5928 -1659 -11292 -21972 -24724 -20151 -12142 -24910 -38737 -32052 -33032 -34643 -18108 -16419
16438 -16419 -10915 -28688 -31930 -42109 -28444 -9714 -22954 -26513 -28085 -32891 -28118 -35454 -27311
16425 -27311 -10618 -17396 -31890 -31208 -22686 -9928 -3700 -133 23 -14006 -4292 -7575 -24644 -13304
16411 -13304 -8802 -9927 -17910 -33524 -47114 -32499 -21216 -6974 948 4192 -13630 -14406 -10288
16398 -10288 -9117 -27282 -29072 -23547 -19801 -14234 -13661 -8746 -24399 -46933 -41363 -29408 -26948 -42439
16384 -42439 -50817 -49413 -43587 -45878 -45285 -43302 -32782 -20901 -8704 -14132 -19851 -26912 -27644 -19494
16370 -19494 -1981 -2307 -12937 -17263 -24097 -23100 -35973 -32315 -34229 -30825 -32909 -45126 -38108 -27509
16356 -27509 -43515 -23049 -18356 -25330 -19995 -26802 -34358 -35642 -30054 -24731 -31126 -39217 -32072 -27942
16342 -27942 -32062 -31925 -47246 -34196 -25866 -13830 -14838 -24685 -27690 -29761 -28531 -25955 -14741 -13717
16328 -13717 -4171 3920 11689 14195 9237 934 743 -10807 -17084 -21007 -25020 -15643 -4144 -18273
16314 -18273 -19032 -6520 -10634 -14482 -16992 -28924 -22999 -21194 -14491 -23782 -25765 -14504 -22053 -28288
16300 -28288 -19019 -30691 -30193 -27892 -36377 -42045 -29076 -34259 -45618 -42468 -33600 -46260 -49726 -33639
16286 -33639 -35278 -32967 -31731 -25389 -27940 -19944 -20174 -13650 -3771 -11739 -20558 -14979 -13526 -24963
16272 -24963 -23369 -7772 6877 1935 266 -1672 6754 4270 -5337 -17418 -33014 -46551 -30056
16259 -30056 -23316 -13893 -13066 -26667 -39657 -22388 -13638 -20372 -4118 -14160 -35880 -48966 -43286
16246 -43286 -35012 -32737 -38692 -40617 -41435 -43091 -49430 -47085 -40158 -21647 -31416 -42441 -36248 -50273
16232 -50273 -46599 -22994 -12823 -10597 -19327 -32934 -27169 -26666 -39117 -39464 -38829 -40614 -46288 -39719
16218 -39719 -52856 -50282 -40068 -33374 -21169 -5117 -1622 11275 14782 -4506 -7249 3636 -9084
16205 -9084 -22362 -17121 -8965 -9564 1453 5712 -9152 -5534 -7374 -29598 -37651 -15369 3973
16192 3973 -7181 -15166 -23370 -19480 -9208 -9653 -3682 -8781 -25471 -34254 -27968 -20946 -8768 -935
16178 -935 -9795 -28396 -41031 -56173 -52375 -50803 -49891 -35298 -31403 -40867 -41220 -31469 -28673 -26677
16164 -26677 -31118 -40582 -28442 -22353 -40524 -38879 -30582 -27426 -18014 -3006 4525 -8875 -15985
16151 -15985 -21178 -20825 -8339 -18921 -28307 -17569 -31431 -29908 -12401 -854 -6124 -2877 1522
16138 1522 -6370 -3761 -8940 -7304 -6421 -20558 -21773 -20502 -29234 -33862 -27073 -13108 -2266 -5198
16124 -5198 -27420 -46812 -37796 -30752 -29018 -15359 -11230 -11028 -21612 -31439 -39584 -44182 -40514 -26675
16110 -26675 -13750 -6037 -30395 -58949 -65179 -51693 -43109 -32835 -39635 -44041 -26025 -19062 -15474
16097 -15474 -20323 -19186 -19303 -26527 -30003 -29950 -24914 -19002 -21719 -39536 -50891 -52535 -58896 -55924 -51990
16082 -51990 -42288 -24929 -38492 -37399 -36102 -40706 -36617 -27754 -22869 -14879 -11651 -8769 -17896 -33643
16068 -33643 -21887 -15835 -20308 -37313 -46006 -51934 -49735 -42718 -44029 -29197 -32577 -30680 -26122 -10373
16054 -10373 -22045 -33127 -26026 -18099 -18893 -25044 -40669 -35214 -15767 -8866 -21934 -27140 -39346
16041 -39346 -36491 -42323 -43932 -35490 -24170 -27475 -43210 -43089 -38732 -48525 -45885 -30542 -45771 -52119
16027 -52119 -44488 -31230 -11478 -7583 -11814 -21714 -39321 -40080 -30950 -11793 -4726 -7777 -23025
16014 -23025 -12956 -4275 -14339 -32726 -35201 -30657 -36563 -41387 -25276 -18470 -4703 -5410 -7213
16001 -7213 -26740 -33404 -31104 -45162 -39040 -33152 -39580 -48155 -33347 -37295 -27615 -26143 -36082 -37628
15987 -37628 -21937 -16378 -15798 -26029 -36871 -35903 -30208 -18898 -18193 -10901 -2103 -13780 -24418 -23018
15973 -23018 -37535 -35093 -32184 -43274 -24061 -16475 -33470 -33822 -12171 7218 -2834 -23711 -39555
15960 -39555 -33098 -38328 -40307 -31699 -39590 -19245 -20217 -38857 -36970 -22441 -28463 -25783 -47448 -58498
15946 -58498 -43824 -33794 -43460 -47496 -44497 -27991 -17030 -25604 -28838 -26773 -49340 -47826 -34910
15933 -34910 -14870 -10066 -4068 -13624 -26941 -44314 -50042 -45854 -40812 -38067 -42502 -34182 -23821
15920 -23821 -16413 -19613 -24377 -37315 -31573 -22054 -25797 -6236 -10400 -22058 -31625 -47761 -54904
15907 -54904 -57269 -67853 -64981 -51361 -33086 -27810 -18713 -12432 -18425 -25583 -33326 -39022 -51626
15894 -51626 -60787 -49680 -51750 -60858 -53333 -36912 -34284 -28517 -23297 -34885 -16492 -29964 -37663
15881 -37663 -46595 -62035 -62978 -45474 -44792 -66036 -56234 -36039 -39402 -49720 -47618 -44332 -54625
15868 -54625 -72707 -64856 -69037 -76973 -61760 -58610 -47868 -31470 -30137 -40815 -64793 -62319 -46433
15855 -46433 -18108 -16052 -22479 -30868 -29007 -33357 -47914 -45874 -33036 -22202 -16044 -5736 1531
15842 1531 -7512 -11779 -19518 -38665 -46901 -44932 -48516 -55357 -47176 -50409 -32898 -19278 -30193 -21715
15828 -21715 -18473 -38536 -31963 -38679 -45178 -38046 -35803 -33815 -22108 -28526 -30634 -43269 -63459
15815 -63459 -62288 -60587 -42089 -39029 -29775 -35184 -36136 -34683 -28784 -24195 -22279 -28864 -33675 -22490
15801 -22490 -19131 -35498 -41451 -21896 -17396 -24203 -26756 -31493 -41131 -36860 -33452 -47327 -59714
15788 -59714 -44896 -37696 -25969 -16583 -32616 -39823 -50893 -59212 -57814 -52207 -41985 -56042 -74251
15775 -74251 -76660 -63213 -54549 -53388 -44653 -48096 -63741 -58576 -39045 -41162 -42039 -49527 -55269 -53646
15761 -53646 -55375 -52528 -34952 -34875 -28332 -36039 -40191 -39325 -30715 -28842 -33701 -37933 -50177 -54127 -50960
15746 -50960 -43203 -32816 -28914 -13918 -26683 -34606 -22499 -14904 -26982 -29000 -39326 -36701 -39663
15733 -39663 -44531 -40978 -44087 -47597 -44492 -34741 -22707 -27487 -41294 -47948 -43579 -41432 -26595 -42316
15719 -42316 -40079 -36339 -31192 -20089 -32622 -35497 -33251 -43415 -40619 -27852 -19476 -9368 -1494
15706 -1494 6777 -4488 -11725 -21572 -33006 -32812 -19009 -21795 -41397 -68751 -56319 -53679 -53865 -41424
15692 -41424 -41607 -63818 -57210 -41751 -46125 -56393 -55450 -58202 -52074 -46444 -50498 -62223 -68085 -53659
15678 -53659 -45655 -35047 -30567 -35988 -33917 -37277 -32658 -42077 -40508 -43435 -43065 -45483 -50399 -39015
15664 -39015 -34921 -50472 -72302 -87642 -71442 -55079 -45348 -43221 -47830 -51523 -49663 -45532 -55997
15651 -55997 -60056 -47518 -32402 -24700 -19047 -22135 -28834 -38602 -31837 -33494 -35266 -21342 -28863 -35725
15637 -35725 -33728 -18126 -8382 -17964 -29292 -19002 -19938 -25145 -28303 -24406 -35830 -43586 -37417 -23402
15623 -23402 -25423 -28191 -25187 -20973 -22083 -42864 -39199 -47389 -53309 -43587 -38807 -34397 -11628 -9679
15609 -9679 -21825 -33315 -38535 -29952 -27222 -31975 -30471 -31605 -34640 -44345 -33459 -28490 -30438 -23818
15595 -23818 -25283 -25372 -34749 -29679 -39519 -37443 -44016 -50299 -35754 -20378 -16953 -11444 -15022 -35036
15581 -35036 -51754 -68290 -67639 -60197 -49645 -32913 -29524 -26046 -25280 -27280 -33138 -33892 -24878 -33990
15567 -33990 -43183 -35803 -23734 -32454 -46722 -29286 -17131 -13960 -2879 -5974 -7428 -22078 -39756
15554 -39756 -49360 -53306 -55720 -47777 -45565 -49628 -44758 -38037 -35080 -43794 -45866 -53649 -52191 -43626
15540 -43626 -45814 -34332 -26994 -21869 -24433 -33174 -34836 -28170 -24268 -18107 -25062 -33940 -30791 -28027
15526 -28027 -28578 -45029 -55119 -36934 -26507 -29865 -53830 -68923 -50068 -33148 -24322 -27912 -37951
15513 -37951 -35392 -22684 -16331 -24576 -45224 -30010 -15569 -13187 -27871 -33260 -41397 -43234 -47027
15500 -47027 -46538 -35335 -43715 -56194 -55196 -43050 -14258 -728 -6811 -17962 -20456 -25994 -17303
15487 -17303 -9519 -1959 -6335 -5346 -15814 -28767 -29677 -36968 -27205 -35878 -43057 -33908 -34101 -47338
15473 -47338 -41183 -37400 -47618 -49245 -61872 -62574 -45393 -39308 -46633 -48918 -38818 -26854 -28189
15460 -28189 -31647 -37437 -29218 -34356 -34128 -32896 -35980 -42996 -56349 -70859 -65091 -60105 -58788 -63569
15446 -63569 -67961 -58580 -55200 -44062 -42458 -47271 -63240 -63442 -43902 -45224 -40960 -23069 -12598
15433 -12598 -23597 -29966 -38016 -34219 -36109 -22139 -18190 -16614 -12461 -22105 -32220 -26728 -29429 -29700
15419 -29700 -35364 -26107 -18625 -9491 -22549 -31373 -35293 -45761 -53326 -62210 -53834 -52350 -55970 -57039
15405 -57039 -52700 -47487 -55207 -62576 -57835 -61183 -76654 -71898 -59733 -43542 -39214 -39259 -44310 -47139
15391 -47139 -43321 -50551 -61166 -63406 -57465 -54404 -49986 -49352 -54687 -51429 -44027 -36787 -27965 -24207
15377 -24207 -37016 -38864 -40138 -49772 -42922 -37598 -26279 -28882 -55743 -50141 -40583 -56380 -67206
15364 -67206 -55133 -41793 -29015 -46576 -59606 -62923 -62244 -51297 -40709 -35229 -19512 -22805 -40690
15351 -40690 -39097 -45989 -54501 -59908 -60189 -66099 -63248 -60348 -58252 -34161 -33387 -32132 -37457 -42244 -44822
15336 -44822 -54854 -40169 -34005 -49451 -58060 -58135 -48908 -41865 -49009 -57244 -61171 -47357 -27259 -33982
15322 -33982 -27113 -23744 -34360 -46773 -40171 -31547 -36741 -46637 -46226 -60970 -53041 -51440 -52750 -61688
15308 -61688 -55009 -49948 -46356 -52796 -67010 -54290 -28667 -30668 -44185 -61939 -57549 -31439 -33973
15295 -33973 -51815 -74439 -74206 -42632 -29504 -46156 -51909 -49947 -32220 -27767 -28441 -27607 -39182
15282 -39182 -46886 -51200 -60838 -66202 -56835 -45088 -26585 -17962 -36177 -38017 -23585 -30190 -37782
15269 -37782 -39870 -52025 -46505 -41889 -61893 -60717 -56621 -51115 -50333 -40611 -45296 -59180 -62130 -64815
15255 -64815 -72861 -64262 -44727 -41678 -32297 -51954 -83335 -83306 -71702 -68803 -61196 -63614 -52135 -63313
15241 -63313 -49220 -45968 -56054 -63000 -69337 -73886 -57682 -70178 -77691 -69574 -51245 -48645 -43839
15228 -43839 -45105 -33394 -43488 -54834 -46171 -38698 -35737 -42291 -46533 -48523 -39227 -23844 -43367
15215 -43367 -59730 -44144 -58892 -72067 -62758 -42306 -34634 -37338 -39697 -59399 -77783 -94148
15203 -94148 -90337 -62479 -46486 -53486 -60851 -62701 -63407 -56839 -56873 -63428 -53177 -51646 -64482 -71940
15189 -71940 -59260 -52771 -55395 -60596 -66900 -62384 -63437 -67754 -62908 -38834 -39251 -32474 -26901 -15807
15175 -15807 -9685 -11537 -18419 -17295 -21370 -10905 -11002 -11539 -27653 -39176 -45031 -45901 -54682 -50914 -33519
15160 -33519 -39651 -36487 -30820 -32800 -47059 -48419 -36572 -38791 -53347 -62136 -54706 -60080 -62771 -58976
15146 -58976 -49357 -49431 -40302 -27592 -36667 -35482 -58151 -75803 -67420 -56613 -63359 -50528 -39313
15133 -39313 -52107 -61667 -57224 -37817 -41467 -51327 -55535 -61795 -73820 -65409 -59546 -51750 -44584 -32075
15119 -32075 -24661 -25778 -32892 -42138 -51667 -54586 -37403 -33398 -54731 -67392 -61338 -45751 -50877
15106 -50877 -59948 -53889 -41637 -29512 -36387 -25506 -5668 -30213 -59543 -73278 -68699 -56380
15094 -56380 -54983 -58433 -59047 -61958 -69156 -80950 -65233 -61062 -55749 -60453 -59167 -67254 -65187 -49883
15080 -49883 -43120 -37630 -34956 -30899 -44674 -70107 -79000 -67853 -63682 -70807 -78907 -77061 -81206 -69865
15066 -69865 -66806 -72600 -71093 -78548 -74509 -79632 -82717 -76448 -69254 -79104 -74374 -62556 -62647 -63125 -56159
15051 -56159 -43681 -54910 -54958 -39265 -38270 -39951 -34943 -45719 -55298 -59897 -71270 -76556 -76699 -75837
15037 -75837 -72864 -73280 -61784 -72269 -69048 -56309 -53423 -49727 -52916 -62391 -56722 -57253 -56892 -56886 -54449
15022 -54449 -58006 -75341 -84480 -73061 -78702 -81064 -62326 -62356 -53335 -44858 -53824 -56914 -50227 -57577
15008 -57577 -60010 -66469 -76811 -64057 -44946 -38295 -40421 -42630 -42628 -39988 -43635 -46138 -55969 -59121
14994 -59121 -54736 -43326 -45309 -72252 -75016 -61872 -50756 -64673 -73284 -86586 -77694 -76762 -89426
14981 -89426 -94406 -80891 -65259 -50095 -49672 -61059 -76119 -85699 -81121 -73201 -78768 -77535 -79451
14968 -79451 -81515 -64261 -62505 -77883 -87182 -80126 -56591 -47224 -51482 -58623 -59954 -62486 -37539
14955 -37539 -45423 -62862 -66737 -71301 -79215 -75959 -68355 -70947 -77602 -60115 -70869 -83463 -84437 -74949
14941 -74949 -70626 -64054 -65422 -64721 -67268 -65086 -72096 -85307 -75965 -77426 -66663 -68795 -62421 -55931
14927 -55931 -55592 -48032 -47264 -61110 -56273 -56232 -53201 -64372 -81175 -75154 -70883 -64234 -56847 -62405 -58585
14912 -58585 -49973 -54657 -47849 -43994 -42725 -64805 -82216 -73937 -77676 -69091 -57034 -50970 -43821 -45589
14898 -45589 -43217 -45351 -49399 -60812 -59724 -54892 -56114 -77278 -95118 -94862 -64750 -56956 -52898 -51590
14884 -51590 -51370 -58751 -68040 -76838 -64264 -61190 -57679 -54222 -54893 -51914 -62458 -76599 -61945 -39861
14870 -39861 -49915 -47244 -26544 -33112 -40503 -39414 -41395 -50254 -51652 -37612 -42611 -50344 -49940 -48829
14856 -48829 -43150 -48795 -40523 -43471 -55154 -41798 -48170 -49997 -57551 -56899 -66650 -67752 -54889 -49173
14842 -49173 -46429 -33946 -26349 -38490 -37041 -28333 -45463 -63453 -54750 -42992 -58644 -45017 -41772
14829 -41772 -65710 -78288 -96790 -103435 -92413 -82986 -79562 -60285 -53703 -69181 -73667 -62634 -62442
14816 -62442 -48123 -35775 -35546 -46015 -54236 -53724 -77051 -104565 -101973 -85812 -79319 -67709 -69706
14803 -69706 -66460 -51456 -36498 -47966 -52119 -38335 -45974 -53071 -58584 -62247 -59238 -59652 -81350
14790 -81350 -77953 -73217 -61675 -65803 -56282 -69853 -90171 -85813 -67495 -70693 -74062 -56378 -58533
14777 -58533 -52357 -40431 -35644 -46304 -50562 -49410 -47370 -48697 -50692 -41678 -40551 -37374 -37750 -44204
14763 -44204 -49168 -51054 -72133 -80670 -71525 -48793 -67518 -82754 -78022 -71626 -77660 -58648 -42388
14750 -42388 -34442 -35463 -42356 -45016 -52803 -60180 -58015 -61866 -69245 -62544 -37772 -39475 -39930 -38095
14736 -38095 -57792 -95233 -89748 -78393 -69167 -50056 -35745 -50437 -63691 -87281 -104036 -87326
14724 -87326 -66919 -71485 -86008 -77623 -64671 -59209 -61097 -73407 -78666 -82479 -84957 -89110 -92777
14711 -92777 -78953 -94133 -103001 -100282 -94325 -81317 -67144 -51695 -46884 -50477 -65369 -69334 -65999
14698 -65999 -59940 -56462 -58246 -71500 -86380 -80460 -53727 -48095 -71409 -74508 -59446 -54358 -65642
14685 -65642 -61225 -49908 -48779 -51545 -54129 -52304 -78584 -88382 -86202 -94147 -90953 -76461 -64150
14672 -64150 -61655 -58233 -68426 -70200 -93332 -86191 -93612 -83119 -93030 -98000 -85893 -81643 -73831
14659 -73831 -67060 -93774 -106134 -94704 -82410 -73236 -85055 -91831 -83913 -78129 -94572 -102064 -85761
14646 -85761 -77766 -78372 -88058 -101581 -105442 -107243 -94444 -77242 -67453 -71487 -71246 -86706 -87376 -74748
14632 -74748 -59066 -75435 -84429 -87274 -74359 -67665 -80664 -72686 -78591 -76113 -73275 -89268 -114885
14619 -114885 -120657 -95328 -69698 -57635 -52595 -38053 -50061 -60547 -58590 -46872 -42079 -44456
14607 -44456 -47958 -48570 -64094 -74633 -81468 -77711 -57468 -47604 -57121 -47181 -35283 -30434 -40317 -53482
14593 -53482 -61333 -67391 -80567 -79647 -76222 -57500 -54155 -58242 -66167 -67032 -75935 -71806 -62608 -87324
14579 -87324 -98690 -106233 -92295 -83583 -66085 -62771 -69512 -88712 -83819 -85283 -84125 -79466 -79159 -55648
14565 -55648 -57338 -77567 -75088 -85646 -78948 -69667 -63619 -76139 -79563 -80194 -75910 -62647 -62550 -76117
14551 -76117 -72268 -45017 -36631 -51864 -64620 -67993 -65405 -70035 -70519 -76207 -75081 -64679 -68584 -70565
14537 -70565 -74740 -74004 -74977 -78888 -81011 -80045 -80746 -73349 -61553 -51302 -61716 -74454 -73900 -68987 -55273
14522 -55273 -51830 -60323 -77402 -85192 -94748 -85343 -72158 -53703 -46307 -48885 -72549 -81373 -72786
14509 -72786 -69046 -72625 -66073 -65056 -75888 -90611 -90032 -80207 -73673 -80918 -92751 -102929 -96811 -97890
14495 -97890 -90436 -68043 -61282 -66177 -91557 -107932 -102286 -92489 -88037 -93647 -92387 -91076 -80100
14482 -80100 -57498 -60045 -54322 -66678 -58462 -45893 -42839 -43781 -69856 -89627 -87035 -83255 -102857
14469 -102857 -91387 -72988 -72365 -76646 -66917 -57424 -75868 -87129 -75613 -71383 -73150 -71408 -61909
14456 -61909 -47011 -45890 -48751 -65803 -64615 -57364 -64111 -65749 -76585 -69085 -68286 -68923 -65109 -67251
14442 -67251 -69717 -67042 -67740 -72491 -85480 -79440 -89707 -95181 -99737 -92921 -93066 -80597 -79963 -58285
14428 -58285 -64601 -79087 -74369 -82347 -90571 -95564 -88782 -66600 -67537 -70058 -70805 -78517 -63012 -65102
14414 -65102 -80157 -91284 -86205 -67685 -62510 -70092 -67738 -65588 -83279 -94823 -84718 -75744 -80279
14401 -80279 -93658 -89685 -94684 -103126 -80210 -51289 -58304 -93635 -104383 -91459 -79394 -64976
14389 -64976 -77283 -87601 -88819 -88891 -89856 -100655 -96496 -83277 -78911 -69130 -64996 -80496 -93178 -81534
14375 -81534 -78971 -87447 -82649 -69308 -73726 -81830 -98981 -111526 -108545 -105489 -104253 -101060 -79129
14362 -79129 -84016 -94614 -94835 -93909 -75119 -78179 -88527 -85181 -95515 -107092 -112335 -112000 -129422 -123306
14348 -123306 -104624 -97777 -96083 -84219 -65543 -70397 -87269 -104020 -105104 -92016 -76643 -59178
14336 -59178 -63294 -67095 -67816 -59401 -57989 -75195 -76736 -62624 -55948 -46189 -49700 -65903 -75190 -72278
14322 -72278 -59789 -55713 -40716 -39325 -61374 -74650 -79463 -99610 -100488 -83008 -71138 -68807 -72875
14309 -72875 -68067 -66130 -75351 -89993 -103187 -85706 -57208 -48389 -68462 -80489 -87799 -95588 -102164
14296 -102164 -109939 -115379 -125811 -122030 -119049 -116103 -101113 -92564 -103182 -109378 -100437 -81318 -89902
14283 -89902 -102278 -109431 -133307 -141085 -135945 -115924 -102719 -80569 -82013 -94189 -108165 -110083 -116789
14270 -116789 -114701 -97470 -82037 -72564 -58037 -59271 -72584 -74807 -73560 -78796 -93110 -75737 -62326
14257 -62326 -74145 -79801 -74133 -56610 -55923 -76721 -90134 -98501 -104442 -87363 -72545 -55244 -51486
14244 -51486 -75535 -77695 -77613 -85511 -89193 -92998 -86255 -87606 -98674 -100738 -83905 -82988 -87337 -82354
14230 -82354 -68237 -68225 -80987 -92056 -92522 -104213 -112387 -106694 -89274 -81495 -97155 -96723 -90804 -92786
14216 -92786 -84614 -72737 -71268 -75340 -83497 -68974 -60545 -67705 -71795 -73499 -72925 -64199 -58022 -70192
14202 -70192 -74740 -69828 -73139 -75057 -68828 -62354 -80375 -77781 -75490 -78955 -85673 -83746 -75590 -65248
14188 -65248 -85174 -87597 -88701 -97678 -89728 -93034 -92963 -93481 -115220 -115500 -107964 -105449 -97873 -108923 -114385
14173 -114385 -108587 -110754 -103311 -90107 -79446 -74919 -81831 -88805 -107423 -113507 -105935 -94547 -101030
14160 -101030 -112349 -98719 -81509 -80142 -98206 -109531 -102316 -104615 -105281 -107806 -102699 -93345 -88225
14147 -88225 -103987 -111321 -97871 -77545 -83609 -95594 -84878 -87705 -85368 -81983 -70483 -62899 -71001
14134 -71001 -82895 -80065 -84314 -102652 -101509 -102316 -109552 -105747 -103008 -110375 -98844 -107525 -117170 -125378
14120 -125378 -119371 -114771 -113256 -104808 -88495 -87478 -91519 -105375 -117564 -118597 -111454 -102347 -105620
14107 -105620 -114698 -128731 -115007 -114729 -128315 -150158 -146233 -135966 -118432 -111011 -109663 -114767 -107944
14094 -107944 -102818 -112985 -115757 -112331 -100846 -97159 -93697 -95824 -105035 -96347 -87913 -79635 -94116
14081 -94116 -123539 -128194 -121179 -107593 -122218 -138467 -141738 -140395 -113684 -94483 -89808 -92956 -86742
14068 -86742 -81516 -97919 -105084 -108971 -114986 -128115 -124505 -107369 -111334 -104805 -97348 -97545 -92026 -96491
14054 -96491 -93194 -95091 -113069 -115598 -122188 -125629 -131404 -144927 -151843 -146141 -135426 -117219 -108136
14041 -108136 -113510 -101132 -97506 -111703 -107497 -106007 -97078 -88938 -102807 -117756 -121856 -119482 -126564
14028 -126564 -133549 -140048 -127486 -121343 -112567 -94571 -87426 -92232 -107374 -129958 -141099 -117390 -98785
14015 -98785 -94473 -93425 -111205 -128920 -130289 -148374 -161100 -153450 -140118 -140933 -135790 -135319 -125866 -132852
14001 -132852 -134851 -132489 -129002 -128881 -131909 -123673 -112661 -111314 -121536 -126493 -123917 -125748 -144893 -146928
13987 -146928 -135408 -127961 -109559 -104357 -119843 -114158 -105558 -110834 -117947 -118006 -129536 -121938 -119488 -113440
13973 -113440 -110624 -121258 -133234 -135148 -127686 -131200 -125328 -117607 -105831 -108090 -107820 -115246 -125188 -119603
13959 -119603 -112154 -105466 -110177 -115541 -132281 -140933 -151834 -161165 -164060 -153573 -140508 -110139 -101812
13946 -101812 -105033 -100931 -110036 -120894 -133286 -141326 -128827 -107517 -103063 -84949 -98998 -116752
13934 -116752 -140710 -148032 -146503 -147402 -163744 -169634 -155719 -146289 -151001 -138176 -128201 -125904 -112434
13921 -112434 -96437 -99992 -121323 -117289 -121431 -133511 -143067 -138017 -135817 -121918 -107945 -117017 -134969
13908 -134969 -129422 -125854 -118882 -119124 -118033 -117600 -121705 -124143 -123532 -125745 -131046 -136461 -130256 -122534 -115555
13893 -115555 -117264 -103090 -89766 -87260 -95241 -114086 -107039 -108023 -123821 -130242 -129174 -124821 -129720
13880 -129720 -133067 -143980 -171914 -177378 -169604 -162469 -152645 -153889 -146610 -138045 -154058 -158097 -150158
13867 -150158 -142686 -142176 -149266 -143741 -127773 -135426 -144172 -142482 -135205 -117067 -120638 -122187 -125397 -129280
13853 -129280 -129518 -123762 -125091 -107460 -92591 -96850 -115445 -118852 -126410 -126200 -134908 -137387 -130548 -127977
13839 -127977 -123470 -131680 -141585 -148384 -148922 -149888 -157432 -164749 -161900 -163290 -153064 -146207 -137281 -124438
13825 -124438 -120292 -136611 -135346 -142622 -143794 -149622 -154747 -157464 -164676 -146547 -140731 -140879 -134599 -132977
13811 -132977 -145580 -143399 -133856 -124566 -135152 -140103 -138166 -133872 -147753 -133797 -133679 -135085 -133111
13798 -133111 -126552 -123924 -125961 -138071 -147209 -145183 -148619 -141461 -138308 -152371 -155967 -149299 -161051
13785 -161051 -148392 -143692 -153386 -166316 -158522 -139831 -131717 -128092 -123941 -121855 -120459 -104510 -93624
13772 -93624 -110880 -131958 -129514 -132306 -137504 -136729 -139469 -135007 -114789 -116976 -135736 -159629 -177389
13759 -177389 -169008 -149846 -153365 -152552 -141080 -145849 -150386 -153612 -164509 -170994 -159335 -149075 -152510
13746 -152510 -152754 -159091 -156353 -158742 -175380 -188649 -183887 -192028 -201685 -184771 -168471 -175910 -189942
13733 -189942 -181778 -172199 -168768 -157519 -153784 -160743 -163459 -136105 -137750 -157087 -161085 -159256 -168798
13720 -168798 -166466 -164906 -164847 -167104 -169686 -162831 -161345 -179973 -187845 -186328 -186730 -182346 -186516 -182995 -178422
13705 -178422 -187623 -181285 -163717 -161129 -156030 -160653 -167818 -176115 -184704 -175026 -161603 -146642 -130766
13692 -130766 -130790 -137963 -147154 -159870 -173960 -163090 -175174 -210190 -212492 -198505 -162980 -133064 -144281
13679 -144281 -151549 -175994 -177536 -162820 -164761 -162384 -167902 -157489 -156514 -163570 -165555 -178082 -183995
13666 -183995 -187271 -185430 -187812 -180417 -176586 -168882 -163644 -155394 -153519 -160454 -174451 -187788 -188602 -184788
13652 -184788 -178611 -177118 -160382 -164749 -184362 -183860 -177497 -176961 -168449 -163397 -164699 -162319 -170990 -186418
13638 -186418 -194263 -193204 -193090 -190596 -195078 -198357 -198970 -205910 -190965 -182902 -192067 -196529 -198972 -209845
13624 -209845 -204078 -195280 -194636 -188767 -198326 -193964 -188168 -200397 -195682 -203589 -201911 -185549 -198324 -206783
13610 -206783 -211305 -206673 -215992 -228429 -229583 -229856 -216948 -207192 -202303 -191157 -186582 -190412 -196234 -223526
13596 -223526 -231126 -211684 -199073 -202762 -201651 -201787 -197597 -195393 -211815 -215416 -212407 -209238 -212817 -204438
13582 -204438 -210826 -206541 -212638 -213212 -198444 -194887 -207101 -216545 -235102 -238556 -225816 -208767 -191108
13569 -191108 -190627 -185018 -198744 -212124 -218615 -217826 -223326 -228268 -224569 -221027 -214299 -220557 -207676 -194728
13555 -194728 -202573 -208294 -199934 -213572 -232965 -231153 -230323 -227842 -228250 -241040 -243412 -237270 -235793 -232815
13541 -232815 -241455 -245068 -230656 -232711 -245510 -247911 -221487 -209178 -204831 -202142 -212539 -220132 -204079
13528 -204079 -193444 -206142 -211902 -210787 -215651 -217017 -195071 -190450 -181929 -181354 -195065 -209998 -203035
13515 -203035 -213004 -232407 -237862 -235901 -228289 -216438 -214299 -219892 -227999 -223170 -216219 -219329 -217055 -212222
13501 -212222 -214380 -209477 -202176 -176987 -187014 -210046 -221488 -216811 -214222 -218627 -233614 -233676 -230165
13488 -230165 -224132 -229740 -210464 -207127 -216840 -236737 -226749 -233717 -241933 -239959 -250992 -254479 -242549
13475 -242549 -241409 -237635 -233889 -232918 -218135 -223789 -241592 -255777 -263517 -253507 -247212 -240520 -234803
13462 -234803 -224536 -218611 -215772 -232031 -246390 -243552 -232744 -238093 -236575 -227154 -229123 -243497 -243508
13449 -243508 -245803 -236953 -221290 -218218 -229242 -223363 -221380 -237406 -250787 -242161 -226951 -237144 -242699
13436 -242699 -224953 -228313 -232885 -238977 -250447 -260328 -263698 -261389 -250231 -245923 -239808 -232064 -232928 -223765
13422 -223765 -227273 -246311 -247114 -268687 -272490 -248660 -228607 -231927 -233202 -231626 -240412 -250733 -248770
13409 -248770 -242433 -244613 -248389 -257900 -269428 -260741 -250635 -249632 -242588 -234118 -244807 -248399 -238752
13396 -238752 -231911 -246465 -240199 -233214 -243694 -265980 -265000 -268120 -267975 -255958 -238163 -247784 -255347
13383 -255347 -267656 -259702 -258557 -255353 -254691 -254514 -255611 -254478 -268522 -279550 -284147 -262042 -268072 -280252
13369 -280252 -268231 -263471 -244720 -227853 -241135 -252642 -260876 -260852 -253180 -235847 -235254 -251343 -244778
13356 -244778 -244758 -248473 -244930 -253933 -258836 -251773 -263168 -289024 -272465 -260249 -260726 -279760 -269522
13343 -269522 -266932 -259729 -260838 -281222 -286288 -285592 -300804 -294286 -288893 -266010 -266002 -279899 -279717 -287759
13329 -287759 -293502 -305243 -301306 -306982 -300025 -299567 -296351 -284250 -275510 -261477 -283176 -292409 -292829 -300100
13315 -300100 -297602 -305266 -297437 -292519 -293842 -280040 -271594 -280817 -293433 -301822 -296365 -293416 -303441
13302 -303441 -308881 -304068 -295836 -285077 -286375 -271120 -253063 -260593 -271719 -267196 -269846 -271756 -261968
13289 -261968 -251266 -250935 -252106 -241144 -204126 -142088 -87715 -24468 38631 78067 123197 174127
13277 174127 198243 221408 230514 229318 251931 257153 289315 313433 309624 304104 310386 319230 302985
13264 302985 275180 237513 203034 171167 130417 91790 70661 59534 65996 75445 103805 123804
13252 123804 148809 181175 223083 245873 265802 283627 295405 284017 285729 306476 315840 323798
13240 323798 328589 315819 296852 261493 215995 199770 197406 190764 163642 115429 66478 9393
13228 9393 -47103 -104849 -146881 -174117 -200749 -218137 -216174 -204083 -210782 -200409 -194986 -198068 -199798
13215 -199798 -208104 -187463 -159726 -108289 -62634 -11563 50462 112942 162668 210579 268060 293767
13203 293767 308416 307709 293929 289372 299329 317028 335001 337715 350923 344874 328763 308034 281319
13190 281319 243324 207193 177811 148653 128842 119786 129250 142125 161841 167574 177046 217281
13178 217281 253116 274486 283355 309643 345749 356873 363109 370048 350078 348782 330088 321511
13166 321511 318473 312909 280525 236389 185636 128402 95573 63719 7592 -59449 -112232 -151375
13154 -151375 -186556 -214297 -245985 -281693 -302238 -299857 -319013 -330524 -330178 -333119 -336324 -359802
13142 -359802 -364580 -379930 -390887 -393650 -400823 -399170 -396881 -414485 -423599 -412393 -399990 -405065 -406362
13129 -406362 -395714 -387621 -392663 -415128 -418578 -423088 -433073 -439259 -425373 -417322 -415844 -401954 -398597
13116 -398597 -396186 -398250 -394628 -397977 -405122 -412543 -416932 -424891 -422412 -426422 -437819 -434057 -440399 -440917
13102 -440917 -428342 -436493 -447253 -442934 -441651 -436857 -436859 -432883 -449283 -482636 -491133 -486953 -480466 -478207
13088 -478207 -469303 -470451 -448362 -435146 -428124 -420605 -423881 -430031 -429074 -428876 -439214 -432085 -440824 -452066
13074 -452066 -452271 -454394 -453374 -451465 -443322 -445074 -442472 -457210 -464211 -474047 -485001 -495000 -498740 -510433
13060 -510433 -499576 -481696 -499901 -508383 -532987 -559762 -548558 -534056 -534390 -520814 -493664 -479107
13048 -479107 -494967 -499796 -500278 -495052 -486562 -477876 -474729 -491327 -477374 -461255 -473123 -493068 -510013
13035 -510013 -514820 -516833 -531107 -552682 -548717 -550102 -553907 -565873 -567972 -577824 -577805 -564273 -552619
13022 -552619 -550482 -566054 -586439 -603830 -604681 -600303 -602757 -599261 -603344 -593677 -571879 -559700 -553465
13009 -553465 -572337 -564281 -544752 -537933 -539612 -540122 -540833 -537670 -528951 -507410 -491725 -503647 -518898
12996 -518898 -533157 -544127 -547033 -546564 -554454 -577212 -582721 -593326 -587505 -575274 -568514 -573635 -580070
12983 -580070 -586340 -582776 -565822 -547352 -536330 -535751 -537687 -538717 -524789 -517923 -515329 -503976 -494907
12970 -494907 -509588 -507434 -510947 -533631 -525628 -532421 -544187 -540735 -548602 -564963 -590314 -622188 -654952
12957 -654952 -677912 -692529 -715149 -726847 -710507 -674063 -649192 -648023 -643530 -622395 -617403 -618858
12945 -618858 -614962 -637340 -639364 -641846 -665106 -682739 -693826 -691547 -688397 -686660 -671713 -678686 -715895
12932 -715895 -736826 -742698 -753603 -761176 -769656 -766804 -760211 -764141 -769508 -777236 -775937 -749619 -746875
12919 -746875 -763666 -738871 -734228 -720382 -728753 -723667 -734628 -710924 -679644 -671383 -676662 -681293 -668088
12906 -668088 -676160 -699234 -713874 -726335 -733153 -755852 -768008 -794772 -818245 -833783 -849537 -850966
12894 -850966 -872884 -896164 -895084 -904227 -911786 -922245 -943562 -951675 -954836 -939424 -918576 -909911 -895329
12881 -895329 -885807 -854539 -828925 -805860 -778664 -764503 -754507 -743118 -745373 -749550 -740711 -729498
12869 -729498 -717321 -703601 -694548 -696568 -687871 -664440 -643784 -644129 -649322 -645040 -640362 -634441 -612614
12856 -612614 -584207 -544920 -463751 -363795 -233702 -83274 94353 307761 522214 757139
12846 757139 986743 1242604 1505241 1779800 2089713 2424206 2779318 3177689 3649931 4216710
12836 4216710 4909883 5783149 6926932 8363130 10082643 12097255 14638908 18003167
12828 18003167 22583120 29042464 38052368 49461146 61793605 73027255 82328389 90185888
12820 90185888 97080822 103072562 107882286 111257591 113159440 113457766 111888079 108773509
12812 108773509 105587667 104150294 104921674 106416750 106641461 104638933 100710070 95666280
12804 95666280 90149701 84513169 78994053 73951671 70221057 69067346 71419442 77227734
12796 77227734 85073129 92836877 99104337 103487515 106349706 108336318 110167940 112230701
12788 112230701 114492465 116613174 117772498 117246586 115329574 113184316 111862070 111510028
12780 111510028 111370425 110160664 106439294 99805419 91492322 82782935 74161352 65731978
12772 65731978 57659211 50205512 43542242 37827717 33226742 29822055 27451821 25867644
12764 25867644 24877450 24382462 24414343 25099646 26552708 28790780 31917801 36456790 42811251
12755 42811251 50447943 58258811 66161053 75624072 87895467 101808431 113882535 121704109
12747 121704109 125963719 128463058 130294729 132156432 134276920 135696072 135423067 133544589
12739 133544589 130743743 127988100 126077471 125059990 124094749 121878105 117367554 110412397
12731 110412397 102206021 94712884 89728349 88035570 89148603 92061581 96076067 101314224
12723 101314224 108432239 116741707 124109211 128737666 129846461 128724139 128207990 129993786
12715 129993786 133665258 137599451 140244674 140929982 139684200 136798104 132605486 127691123
12707 127691123 123113008 119097238 114485128 107563032 97633346 85618511 73056904 61223086
12699 61223086 51107053 43224074 37379219 33027474 29650617 26935560 24670190 22760345
12691 22760345 21123866 19744695 18607605 17605559 16708520 15858109 15011083 14181539 13349670
12682 13349670 12513657 11704895 10951965 10270766 9682294 9152718 8707622 8292692 7926786
12673 7926786 7594054 7329518 7091780 6891589 6721103 6619733 6588274 6561108 6554963 6555449 6521703
12662 6521703 6442485 6332655 6142967 5879212 5592991 5339536 5117065 4919223 4787605 4732563
12652 4732563 4748981 4823844 4920203 5004381 5054139 5054684 4960564 4787624 4569187 4312845 4052581
12641 4052581 3822818 3594582 3411647 3290361 3199561 3144772 3102436 3050669 3048959 3072164 3116951
12630 3116951 3180415 3279980 3406819 3572643 3744848 3885612 3972139 4016664 3978154 3887882
12620 3887882 3753271 3604192 3465882 3388662 3392326 3488794 3641297 3848286 4069993 4224075
12610 4224075 4285445 4252020 4122518 3922302 3681695 3437714 3188119 2971637 2793897 2657201
12600 2657201 2547304 2457790 2393712 2372275 2371080 2383760 2437742 2540280 2685513 2868170 3083629
12589 3083629 3308007 3522564 3684684 3793953 3823709 3763856 3653353 3508048 3356555 3213891
12579 3213891 3125226 3112691 3201413 3360490 3583609 3824846 4007970 4081890 4020936 3833948
12569 3833948 3572071 3270672 2970469 2688338 2454469 2269118 2124840 2009216 1931963 1867381
12559 1867381 1819295 1800886 1810498 1866979 1968957 2099821 2264713 2491401 2771003 3052656
12549 3052656 3283302 3440978 3500205 3451549 3290479 3055518 2774476 2491894 2261665 2064017
12539 2064017 1888603 1731391 1619080 1538348 1461021 1424275 1389426 1342383 1330108 1336103 1336135
12528 1336135 1303792 1273539 1253583 1229089 1216115 1207636 1190155 1171039 1139006 1112830 1098760
12517 1098760 1101396 1099502 1105738 1102397 1096195 1100188 1104172 1092526 1072167 1060103 1053393 1057440 1067325
12504 1067325 1060903 1068527 1061926 1045804 1036550 1052645 1079832 1081849 1065242 1053311 1037370 1027367
12492 1027367 1012880 1003177 990183 966626 960753 948135 935398 938002 936232 938447 937105 937301 933988
12479 933988 939067 933313 943967 937509 913785 904943 909580 915623 906715 896007 894256 875896 874068
12466 874068 870849 847201 835868 829450 830070 841402 824438 821087 832000 819165 814324 824546 824857
12453 824857 801458 786386 776034 785747 786766 775682 757117 744811 738867 749298 761989 760176
12441 760176 743180 726654 715737 717958 716002 716815 724683 719553 705869 708087 714008 727187 729369
12428 729369 733116 730470 722542 725630 742533 745147 741053 735482 721627 709204 672559 658061 653029
12415 653029 641759 660970 663826 655775 651463 646832 646194 650389 658560 648686 643562 627055 623245 640815
12401 640815 649633 647382 658141 674077 693545 689235 663698 661936 653128 654006 662777 670473 667053
12388 667053 655259 639622 641100 644202 631152 615863 625847 615211 615850 632878 623090 623223 634018
12375 634018 637369 636431 629215 620366 632472 655915 657886 667072 677896 693635 713566 735054 761533
12362 761533 800016 860478 917469 953435 1000906 1046467 1093027 1124875 1156672 1178251 1178048 1177467
12350 1177467 1170389 1166726 1156959 1164302 1160706 1157758 1153950 1159818 1155600 1144278 1141040 1129816 1101628
12337 1101628 1081598 1080082 1115489 1186278 1292808 1439642 1603559 1748052 1858351 1905692
12327 1905692 1895555 1840201 1775675 1716080 1674819 1644798 1656914 1679386 1717637 1798854 1896870
12316 1896870 1951450 1936421 1853758 1718243 1569741 1406173 1258232 1129620 1039271 963166
12306 963166 886144 834900 807969 789062 767443 750182 717453 697771 693379 674752 664675 653940
12294 653940 656675 673283 703915 753255 801607 835425 880621 923774 952748 1014303 1063498 1095488
12282 1095488 1154883 1199977 1227785 1240296 1240395 1227510 1220812 1204357 1187156 1173764 1182397 1178069
12270 1178069 1156298 1140434 1137211 1131850 1112978 1131172 1162893 1213338 1282702 1396401 1538356
12259 1538356 1722599 1902700 2093301 2259459 2407742 2517964 2571442 2532862 2438023 2336790
12249 2336790 2229101 2149839 2121609 2148557 2224268 2290912 2328393 2333728 2331175 2311460 2231349
12238 2231349 2095910 1920656 1713884 1525982 1369371 1268527 1232699 1213375 1227843 1304588
12228 1304588 1423152 1557875 1759079 2010297 2258051 2459441 2603831 2639002 2541900 2354930
12218 2354930 2118886 1845562 1590691 1380130 1221728 1127368 1064091 1024069 994261 988684
12208 988684 1045802 1110565 1188728 1320508 1471292 1681021 1949443 2233715 2507271 2713863
12198 2713863 2782076 2700809 2502948 2245723 1990428 1757332 1565353 1419526 1348410 1300328
12188 1300328 1291065 1317318 1366366 1467644 1634239 1842516 2047507 2224146 2396631 2535140
12178 2535140 2653209 2761906 2851706 2904566 2900022 2836642 2716574 2552938 2378093 2214919
12168 2214919 2080291 1945533 1803160 1666396 1551062 1458437 1410800 1422071 1461531 1544090
12158 1544090 1713380 1932738 2167341 2451867 2742034 2999102 3207351 3325090 3350002 3307671
12148 3307671 3213837 3091097 2935583 2761769 2552108 2322966 2095054 1857415 1648407 1473346
12138 1473346 1316449 1200372 1125277 1057483 1008091 970110 955625 975242 1030353 1144394 1279250
12127 1279250 1465005 1668011 1863411 1993078 2052001 2018465 1904901 1726361 1548263 1390284
12117 1390284 1248466 1122527 1024342 937835 866770 808644 762782 744532 766562 803727 852073
12106 852073 923272 996431 1130815 1289378 1451187 1604298 1732135 1817892 1835082 1786433
12096 1786433 1694013 1577128 1431179 1295919 1170215 1050759 957162 892998 849389 833657
12086 833657 837397 842082 874282 976190 1112434 1258613 1468773 1699495 1896877 2043110
12076 2043110 2117941 2083986 1938406 1741389 1520681 1321001 1159597 1028439 928634 821943
12066 821943 755959 721018 698289 680178 650605 617014 578228 545777 529406 493457 482809
12055 482809 466269 450081 437773 412596 381411 357020 347127 327623 308654 289533 296197 292067
12043 292067 273964 268168 262778 250984 241030 223426 214061 208291 199708 179563 144356 142390 147579
12030 147579 141638 152135 176542 204844 232575 243207 253400 291311 318680 312753 303776 294770
12018 294770 271227 249827 229886 236283 262878 280862 295613 303813 318131 346625 369147 392687
12006 392687 396872 377250 353403 336717 326815 306620 296018 280454 273310 279781 276132 281372 286064
11993 286064 294012 295153 298544 297762 317326 344467 343942 336204 345060 351132 356363 351793 346003 330426
11979 330426 316835 309165 292375 279081 270474 262662 246316 229412 249717 265274 278450 278188
11967 278188 275169 263097 239200 211457 187812 177696 196303 204938 207226 209284 214608 221122 247215
11954 247215 293156 351179 396354 424095 457774 485735 503842 510401 534188 567114 585582 618265
11942 618265 664784 695626 726393 781924 831156 867646 915441 945190 965904 989634 1017196
11931 1017196 1053132 1118085 1201300 1304147 1428584 1589621 1761877 1903098 2058860 2237708
11921 2237708 2444672 2664680 2921010 3245776 3645803 4124190 4712823 5402220 6164077
11912 6164077 7003424 7953387 9083202 10492032 12290882 14551312 17371691 20908445
11904 20908445 25544806 31642784 39594885 50274328 65042618 84392917 105901372
11897 105901372 123598816 132375213 132395013 126866877 118295271 108830057 100848789 95728834
11889 95728834 93440533 93814123 97262898 104209260 113792511 123779212 130989008 132372642
11881 132372642 126779043 115368321 100262607 83757895 68138184 54945584 44577440
11874 44577440 36753527 31017408 26802799 23660597 21246859 19352078 17818179 16531894
11866 16531894 15414836 14448142 13607146 12867479 12192929 11605328 11066307 10567840 10139351
11857 10139351 9769881 9460928 9231041 9087416 8985236 8896432 8828375 8791680 8824134 8901614
11847 8901614 9044597 9285579 9639306 10113340 10734851 11545645 12553826 13773088 15233722
11838 15233722 16984297 19095282 21667926 24887335 28984121 34109630 40604050 49126271
11830 49126271 60590950 75649456 93925884 114397901 135944364 157782637 179775226
11823 179775226 200103297 215418712 223879749 225827078 221772551 212936566 202191702
11816 202191702 192413323 185785862 184357968 189206095 198641210 209047550 217368379 221156101
11808 221156101 218772435 210977285 199513710 184622898 166231797 145573526 124533296
11801 124533296 104792544 87533076 73382334 62279163 53582561 46688567 41083350
11794 41083350 36412306 32538413 29368071 26769693 24612481 22765837 21089506 19566411
11786 19566411 18204912 17002803 15968028 15087626 14359359 13762839 13244817 12792478 12413967
11777 12413967 12103985 11839291 11585643 11349601 11171692 11052674 10997501 11026305 11133349 11318956
11767 11318956 11561748 11853919 12195232 12667903 13333353 14280515 15598077 17345932 19547246
11758 19547246 22225454 25510179 29705341 35405821 43149733 53395065 66385903 81828148
11750 81828148 97965322 111268187 118570504 119726801 116451108 109812846 101006836 92610207
11742 92610207 86999131 85049740 86588147 90700692 96544102 103979343 112218864 118230067
11734 118230067 118368824 111703178 100281070 86699231 72914471 60507469 50426170
11727 50426170 42725453 36883341 32309200 28427218 24970879 21966731 19407341 17221377
11719 17221377 15417072 13942151 12708697 11655896 10748218 9956939 9268236 8648227 8110174
11710 8110174 7652379 7251887 6889301 6570923 6296582 6034019 5766005 5525903 5304595
11701 5304595 5112304 4923701 4741960 4562655 4389496 4231897 4063768 3904993 3769096
11692 3769096 3637771 3531522 3438750 3336192 3242917 3161376 3070233 2995200 2915221 2822462 2757175
11681 2757175 2712149 2649161 2605775 2573498 2529515 2481670 2432509 2412919 2385565 2357940 2310375
11670 2310375 2252780 2210753 2168916 2099067 2038559 2001474 1957491 1923250 1898159 1864442 1844102
11659 1844102 1825756 1800776 1778693 1747223 1700918 1682732 1651818 1618987 1593638 1563956 1521008
11648 1521008 1513442 1529037 1527823 1513621 1508732 1515465 1508289 1479259 1472598 1465903 1451727 1453001 1440684
11635 1440684 1447106 1452134 1455332 1448698 1431093 1420560 1413814 1424275 1423832 1402765 1386079 1368211 1345577
11622 1345577 1330213 1330454 1336221 1348309 1345837 1335795 1335122 1341139 1344800 1360741 1363730 1356220 1344134
11609 1344134 1328034 1315237 1288573 1268555 1274376 1285310 1277615 1271801 1272869 1273991 1264849 1250838
11597 1250838 1240888 1232789 1228156 1225323 1203384 1167931 1138940 1120489 1108712 1096433 1105810 1124127
11585 1124127 1119703 1112477 1101696 1112748 1119608 1120531 1090408 1074710 1066822 1051063 1048300 1057928 1055673
11572 1055673 1069401 1071677 1058286 1056778 1052128 1044603 1054403 1058594 1053856 1041911 1037051 1030950 1024707
11559 1024707 1008431 1009529 1005531 1009479 1015310 1021713 1027028 1033414 1035333 1036954 1027720 1027594 1021167 1020088
11545 1020088 1036760 1049653 1054323 1047555 1055660 1054912 1047146 1049611 1039449 1037141 1033962 1019669 1009716
11532 1009716 994741 1001826 1009058 1008647 1012005 1000114 990976 981324 966631 963871 958033 944811 939714
11519 939714 953195 943700 935743 937477 921638 913422 904301 885841 879419 906443 929607 916356 922854
11506 922854 920480 927618 942027 949375 957276 948714 953387 958744 940862 964986 973184 955993 941308
11493 941308 952804 958530 958799 964163 958678 951411 967685 960231 937632 936307 921351 913229 907555
11480 907555 905546 911959 910274 913212 911235 918422 926286 944105 968672 965419 943444 949248 955028
11467 955028 967236 955846 959640 996794 1035383 1069000 1116939 1176035 1273875 1397550 1495022
11456 1495022 1562774 1589042 1568879 1518329 1443984 1379040 1322781 1309405 1312303 1310301 1330797 1397054
11444 1397054 1478514 1537131 1562591 1546921 1478793 1386926 1297485 1210534 1133047 1061692 1019103
11433 1019103 995415 972271 949859 938693 933718 923895 914879 901695 898501 891113 874196 877295
11421 877295 877469 870123 869425 864445 851564 845504 830357 837669 846615 856878 856527 850350 849034 834794
11407 834794 822878 830338 828893 822170 812783 817239 822126 819549 821339 834278 832131 832442 863746 912879
11393 912879 951364 971879 994128 1051749 1131466 1223050 1337118 1462036 1602172 1752252 1870843
11382 1870843 1961097 2015202 2031308 1988532 1914799 1853533 1779714 1720103 1711844 1769879 1856448
11371 1856448 1948502 1989967 2008050 2008580 1967919 1894714 1792937 1666060 1523333 1396550 1270837
11360 1270837 1177862 1107413 1055668 1015182 985881 968700 934035 910033 884086 858683 833393
11349 833393 820452 809229 799152 804459 813930 818937 813275 795475 779827 766774 761286 757825 739134
11336 739134 735961 726488 723446 725793 734894 729990 739880 745264 756930 759217 750838 763860 786732
11323 786732 786269 777692 785589 793220 799121 801232 790088 810095 852775 879824 915335 981811 1102304
11310 1102304 1228168 1336208 1404121 1436671 1406934 1333787 1266062 1205550 1154162 1128773 1111617
11299 1111617 1120253 1178514 1257971 1329816 1391255 1417437 1374906 1280615 1198326 1105573 1010584
11288 1010584 953040 911175 875355 838054 811395 797602 798659 792658 785347 779675 759847 751654
11276 751654 743233 746318 742945 730427 715385 698890 702773 712332 713502 686948 679095 660312 660106
11263 660106 659667 668858 682587 691323 695824 681061 681901 667050 662365 665508 648286 642681 639773 645682
11249 645682 662956 689736 702093 694248 690967 689497 688116 696198 698842 690229 691755 689657 687280
11236 687280 679340 684904 691163 668504 663745 663027 673616 672433 669947 676577 670408 656473 673885
11223 673885 698701 689089 675301 666062 663341 644724 648120 654329 640673 635318 646511 650311 640479
11210 640479 641871 655005 637806 638548 662419 654840 631842 626255 644792 665884 662278 661011 633519
11197 633519 641469 653790 655100 653757 650536 658230 643399 631022 617278 624326 640968 644746 644110
11184 644110 641772 649534 660095 659263 652899 658518 651558 638672 625939 628548 628301 629157 632004 631009
11170 631009 624017 630671 640647 635439 620947 615926 618533 629273 631681 637463 640429 637276 644710 659224
11156 659224 678214 684413 664053 640801 630670 624058 626832 633035 642697 655055 653093 648802 637659
11143 637659 624954 609722 610751 618322 621709 624904 636988 640510 627166 625308 635311 644336 626448
11130 626448 611880 601024 602356 613891 614554 606433 620425 616012 610642 600217 604228 604779 601202
11117 601202 600971 605917 622947 647121 654898 639403 627631 637337 655867 671783 668286 665875 642842
11104 642842 620305 627960 649784 668404 684331 684909 676717 664559 661212 668605 721314 762146 794879
11091 794879 862419 928713 992577 1043019 1054669 1027442 1003203 961669 935375 897608 843798
11080 843798 803428 782088 783084 772218 775654 771833 759817 757185 773001 781299 772951 773598 772621 791137
11066 791137 846507 901721 955852 1036026 1144526 1282035 1388814 1469153 1517441 1510442 1459595
11055 1459595 1379445 1297918 1191826 1104296 1048151 1016967 976540 964837 946112 959841 1004792
11044 1004792 1055584 1122973 1221474 1296403 1369611 1460111 1520046 1564743 1584923 1574910 1522203
11033 1522203 1472106 1461143 1463735 1450540 1423045 1387502 1340947 1272458 1202122 1149896 1106422
11022 1106422 1063281 1058546 1049888 1059334 1094372 1163469 1274701 1414095 1572833 1781534 2001690
11011 2001690 2210342 2374271 2487734 2532917 2503694 2396126 2220708 2020008 1828109 1656522
11001 1656522 1521970 1455011 1458210 1539092 1721357 1988951 2355264 2801603 3252752 3629223
10991 3629223 3823107 3810927 3632377 3371292 3052014 2770870 2553738 2407230 2337167 2311085
10981 2311085 2288008 2237323 2165817 2055617 1911125 1760374 1619881 1465156 1344114 1266544
10971 1266544 1207967 1181719 1191156 1218974 1232450 1262159 1335983 1452632 1588712 1723118 1840118
10960 1840118 1959518 2053272 2149542 2272926 2435516 2679041 3030209 3434358 3773400 3954486
10950 3954486 3879087 3566714 3132923 2661722 2218505 1856140 1592683 1421199 1296007 1225044
10940 1225044 1185431 1144601 1113610 1085185 1081018 1098178 1137357 1172436 1208679 1249124 1262383
10929 1262383 1236925 1204000 1133869 1057250 1002549 950804 904813 871749 844210 797420 769523
10918 769523 756746 742342 726388 726979 722549 710814 714627 721075 715896 712448 712318 682677 647435
10905 647435 633187 652271 657991 661526 668123 671782 645642 639508 631806 606922 591984 573750 554600
10892 554600 515433 487583 484581 482435 479808 480444 505796 529937 557470 593323 622301 649808
10880 649808 677757 706583 728145 750878 765039 769674 748755 722697 718066 702178 673011 673637
10868 673637 674274 666300 653544 647164 650886 660736 652764 638165 623020 617208 606729 599586 593029
10855 593029 609557 631130 628430 621248 610131 577302 560986 546914 544018 560249 574722 600261
10843 600261 612976 649826 685702 727907 767413 793752 831704 855744 867563 885065 911038
10832 911038 967966 1040241 1116309 1148812 1156588 1109254 1043631 959259 861181 786981 742705 718154
10820 718154 704641 683832 677595 688822 692671 683241 667928 672127 687197 682706 685138 691695 691455
10807 691455 673941 662426 658219 648620 662794 678440 686223 681237 698962 697642 687332 684001 689313
10794 689313 694084 715882 775277 871884 983280 1065500 1108839 1096910 1027120 898928 779233
10783 779233 678753 617987 627593 648789 663543 671488 684345 698435 685761 702145 717842 723786
10771 723786 710573 698974 688524 673942 656908 640285 641560 668708 725175 747021 777123 804374
10759 804374 817523 862420 893736 881125 877845 881025 860617 846512 845209 833930 827695 826677
10747 826677 844626 851167 843538 819483 830242 830681 845948 862900 890076 926939 974448 1028227
10735 1028227 1088445 1145062 1179506 1181038 1154037 1097301 1034213 942464 834467 757555 728104
10724 728104 729601 758404 816728 873852 905445 925543 932087 940401 963128 980444 1006082 1021305
10712 1021305 1033206 1031721 1027736 1047458 1073122 1115731 1162577 1238392 1322230 1438828 1541785
10701 1541785 1632983 1696875 1721629 1737080 1741108 1709988 1697672 1667414 1631127 1594424 1532969
10690 1532969 1459924 1348150 1233002 1128019 1043518 973355 919277 917142 927372 938956 984555
10679 984555 1013716 1037569 1067759 1100445 1099954 1099910 1103680 1116358 1138749 1171063 1219352 1278444 1347799
10666 1347799 1420142 1522037 1627057 1746576 1885508 1988574 2064440 2113283 2126711 2105893
10656 2105893 2059014 2006144 1946304 1902417 1864218 1858305 1865714 1880691 1894563 1893931 1893134 1904947
10644 1904947 1917375 1943516 1977330 1992126 2011622 2040566 2056634 2064933 2082899 2118346 2147028
10633 2147028 2179777 2227166 2271587 2338364 2419414 2491326 2543535 2597962 2645624 2728920 2838538
10622 2838538 2979209 3146438 3324897 3534103 3756340 3979050 4206997 4444144 4641747
10613 4641747 4807648 4953376 5111169 5280634 5468810 5671399 5905459 6230537 6665555
10604 6665555 7196262 7807797 8478684 9182167 9876286 10550874 11263132 12030692 12877356
10595 12877356 13864232 14976930 16224236 17659940 19418142 21617005 24392989 27824940
10587 27824940 32009582 37072394 43144793 50533309 59830090 72020147 88809484 113211052
10579 113211052 149643151 202659478 272296499 349371378 417703729 461926661 473364332
10572 473364332 452503412 406954458 347678639 286059975 230768309 185927514 151972415
10565 151972415 127269609 109333742 95902699 85396723 76844180 69646529 63530356
10558 63530356 58330174 53915128 50249907 47387095 45371472 44174891 43778248 44238250
10550 44238250 45584391 47794283 50815228 54602290 59132815 64522487 71061539 79260697
10542 79260697 90031172 104868829 126090467 157432297 204007504 270150254 354484636
10535 354484636 444821390 516674987 546084505 526349357 467771957 388008859 303974085
10528 303974085 229293856 171722064 131912184 105692267 88287293 76323250 67611252
10521 67611252 60714260 54800781 49433356 44476078 39929225 35840924 32222258 29075012
10513 29075012 26373246 24044048 22023520 20303042 18825923 17567195 16494144 15585510
10505 15585510 14839298 14264995 13823674 13513428 13193644 12762651 12236333 11648765 10997456
10496 10997456 10319538 9669772 9100101 8591903 8137268 7724997 7333303 6955883 6590043
10487 6590043 6248152 5944274 5682484 5440288 5222967 4999092 4799387 4603561 4404655
10478 4404655 4218101 4053364 3936040 3842191 3738728 3617343 3488410 3347043 3205390 3075547
10468 3075547 2978421 2919838 2866449 2822173 2772470 2730401 2685950 2625705 2556567 2480069 2388810
10457 2388810 2315634 2235265 2166638 2094248 2049903 2011388 1962601 1914744 1857350 1794124 1733799
10446 1733799 1690151 1676773 1679513 1698201 1716767 1725709 1696342 1672182 1649058 1616385 1589755 1557415
10434 1557415 1551428 1560738 1549315 1536072 1526591 1521462 1515840 1511172 1517740 1520716 1516954 1505285 1501951
10421 1501951 1471595 1416972 1330105 1217344 1112887 1034239 956893 895157 872299 876938 884177
10410 884177 888093 894442 878843 850365 823170 791216 788316 821557 829721 828142 855333 898037
10398 898037 914696 907260 903529 898904 903563 884742 872058 873992 880733 900248 945151 965480 1006278
10385 1006278 1047896 1070885 1096194 1131907 1137896 1092032 995564 890488 772347 670393 627079
10374 627079 602104 579771 599773 646747 689590 720099 757095 781779 799443 822649 825852 818162
10362 818162 813364 811901 804871 783047 788863 809352 805090 794883 769741 752504 741384 731546 742951
10349 742951 746223 738734 732601 751778 778405 825556 877624 924584 965885 997555 1000932 981333
10337 981333 952359 918469 886631 853747 839560 845685 851090 841469 866030 903475 947361 985290
10325 985290 1001038 1008436 1025478 1008266 992191 964956 945139 905290 883611 892741 877660 873158
10313 873158 879322 875035 889774 905234 903453 900417 883608 872212 863809 860643 845877 853277 847741
10300 847741 839245 826399 816744 801838 797142 793075 796653 806125 811196 818209 826628 826001 838030 835951
10286 835951 815800 813097 818759 813669 821789 826595 829448 819244 808452 778398 723152 680595 675433
10273 675433 679106 657397 639504 640566 623700 621975 649783 681261 716395 750622 796450 832999
10261 832999 841872 839212 835826 831154 817857 815280 806163 803545 789521 783453 785739 794143 797232 785946
10247 785946 755580 742890 739100 736792 758970 768716 761184 746539 729668 704835 707508 700151 680381
10234 680381 680530 680084 646494 623091 620690 614054 619521 631381 639298 664362 723897 768083 816605
10221 816605 855495 878393 883874 864540 841734 833627 823952 814862 806837 792534 780174 776180 754828
10208 754828 756935 762921 768108 784169 802844 799432 773068 756819 756275 773221 783614 793893 797543
10195 797543 778809 767013 771719 784471 780048 779426 781589 783755 781570 775888 775558 766600 750121 755546
10181 755546 777220 776275 791655 799889 810772 821440 817513 813054 814610 825570 834023 833106 811695
10168 811695 817135 831467 839010 856772 858980 857144 889544 941513 974712 1016010 1084444 1170872
10156 1170872 1285029 1453385 1680068 1985086 2356288 2724854 3024236 3158176 3133474 2946957
10146 2946957 2660242 2322453 2015937 1771193 1576896 1427571 1335377 1276910 1222481 1177242
10136 1177242 1155802 1134995 1105302 1085153 1063607 1043197 1028963 1010611 1008667 1007213 1016870 1036280
10124 1036280 1037831 1054216 1067336 1098260 1136277 1175711 1221608 1292615 1395112 1536120 1750204
10113 1750204 2060526 2487889 2969755 3405173 3651445 3620964 3345259 2933235 2480131 2070218
10103 2070218 1745346 1494856 1326049 1231735 1150821 1070658 1001549 970839 940716 915967 893971
10092 893971 884638 863404 838140 822600 826257 821935 811518 789051 775841 778896 791132 799407
10080 799407 809595 795334 795031 815181 827662 848022 836140 825054 812965 799384 783313 784085
10068 784085 792071 798897 803149 803235 788452 750867 721028 698033 696191 686236 690874 692743 705277
10055 705277 717358 729305 743482 742799 730880 719772 711792 716928 727304 709026 704195 705736 712129
10042 712129 701885 698300 710666 701261 700289 703204 701426 697343 697806 711417 708447 702113 721248 742602
10028 742602 750183 742041 730488 711327 698750 699995 697455 702730 719583 745138 731890 718405
10016 718405 714581 712290 714890 726387 716559 702001 698732 726822 725484 715170 707048 701028 703590
10003 703590 700318 688018 681223 679462 697832 694011 707030 709699 719004 725152 729362 742584 727252
9990 727252 709741 710764 717823 713025 719242 738823 740270 719416 698299 701865 708471 710765 706118
9977 706118 703403 711879 717755 724882 718242 713361 715652 720073 714824 706703 707430 703056 689652 690153 692866
9962 692866 678870 687847 708957 725317 717783 719815 738435 742730 730857 719289 727645 725314 727357
9949 727357 723462 711499 714205 699886 699251 699205 698523 693131 689855 694390 680143 696165 687833 692180
9935 692180 698953 708841 725664 729522 735328 727750 724100 720785 733711 740413 734805 731129 727554 737638
9921 737638 745346 746640 734169 722171 728533 720473 717045 714134 711417 714059 721758 725256 716023 704971
9907 704971 708119 732387 744101 733787 720042 705513 696408 701945 726266 740623 754242 753813 749082
9894 749082 771106 769827 768807 759279 754589 757164 759397 766906 763666 749470 750649 751908 761518 767830
9880 767830 763673 770216 782277 773267 755105 752375 748429 738135 736728 742536 756507 765943 771772
9867 771772 776306 779266 779500 771014 748832 744005 744362 751024 738170 731367 753326 756311 749001 741342
9853 741342 750695 756560 762197 775702 762136 756325 762730 769261 772213 777690 774743 776746 773650 770513
9839 770513 778564 785481 775898 763345 755919 743165 734201 744463 736517 739678 755521 750671 753133
9826 753133 759187 753927 747580 762103 775877 790323 794755 781603 789619 786204 796425 794320 794716
9813 794716 798748 791439 789940 786132 795129 803208 801188 796545 806588 818416 816274 809372 811626 813521
9799 813521 810969 822071 823636 818104 813138 814593 803795 782279 789741 807442 793377 787421 793618
9786 793618 797316 787432 792689 793799 806994 817275 816314 810142 795054 788269 789978 789354 802604 817198
9772 817198 812225 803728 798834 799744 802296 794899 788141 796332 794727 778227 772560 775869 778109 773397
9758 773397 772308 784078 804272 811092 799019 783174 781294 769871 762601 769318 770702 771166 776269
9745 776269 790218 799591 792666 796384 797972 787509 780083 793006 811593 813591 812065 802040 803935
9732 803935 816286 813121 810976 822270 837772 848706 855385 855227 853722 851215 844471 837728 826204
9719 826204 817901 828224 852844 852227 853544 845115 836741 860810 859604 856487 845290 852591 832016
9706 832016 826356 851099 861732 851245 836819 823062 831999 851902 857016 868368 892425 899205
9694 899205 900826 889635 875784 869731 880519 890644 887383 891199 897399 903776 901081 902293 902109 900107
9680 900107 902698 885130 874792 871451 872727 877372 868999 867098 875250 876420 875657 868798 873072 870254
9666 870254 884144 884350 882591 878442 898885 923252 924502 920994 928705 930790 917788 918958 934206
9653 934206 944382 943935 926913 909665 922279 911356 915318 916400 907553 931033 958130 963707 971412
9640 971412 983952 999907 1021933 1026129 1030453 1065903 1100609 1142425 1177535 1218148 1238271 1267517
9628 1267517 1270219 1248324 1220758 1202574 1150961 1109480 1073758 1076100 1071477 1055828 1069102 1081353
9616 1081353 1091609 1119151 1156317 1199046 1252312 1304110 1371196 1421345 1486608 1543795 1587909
9605 1587909 1648178 1699989 1718372 1704171 1676145 1652506 1631276 1598386 1584779 1568257 1534392
9594 1534392 1514927 1490293 1483722 1477675 1447617 1414772 1395739 1374294 1363712 1354889 1370675 1413926
9582 1413926 1453288 1506048 1568820 1617013 1635892 1646435 1659951 1663098 1649897 1641822 1648177 1637345
9570 1637345 1626850 1639935 1684944 1749748 1780344 1804115 1813023 1781889 1745591 1722368 1705501 1672594
9558 1672594 1624212 1579090 1537112 1520003 1504501 1514747 1537197 1605888 1741503 1927373 2132186
9547 2132186 2361727 2616895 2824158 2929770 2977255 2991893 2979875 2900183 2760782 2599948
9537 2599948 2449405 2292190 2148734 2032680 1945334 1883621 1832543 1815764 1841089 1895190 2006737
9526 2006737 2163430 2379737 2599282 2836354 3068000 3276811 3474112 3655909 3825366 3952662
9516 3952662 3987303 3956296 3896800 3856620 3865852 3916877 3987772 4067835 4135449 4177919 4202692 4217056
9504 4217056 4221681 4217042 4272889 4440986 4671046 4898232 5054084 5127121 5083042 4925027 4696341
9493 4696341 4488720 4313473 4178394 4112602 4082905 4085182 4133901 4214207 4311929 4406868 4548432
9482 4548432 4724119 4915481 5076491 5150321 5163244 5194098 5264225 5333580 5367092 5305925 5121462
9471 5121462 4779235 4339588 3888084 3464239 3137909 2895314 2709741 2606759 2576776 2603919
9461 2603919 2691324 2830227 3020493 3285298 3594743 3943362 4334363 4776903 5226610 5634313
9451 5634313 5915080 6003832 5862098 5539770 5082830 4579229 4091790 3666481 3356157 3158798
9441 3158798 3029274 2945633 2883711 2843302 2817486 2814181 2840940 2879619 2986386 3196059 3495784
9430 3495784 3837007 4209831 4599106 4974708 5199557 5231224 5083455 4815470 4428721 3987697
9420 3987697 3565138 3207672 2928771 2731580 2630728 2594706 2582117 2560690 2561876 2549716 2514671
9409 2514671 2474064 2466422 2491065 2572594 2708334 2862806 3008626 3140263 3205468 3163722 3022562
9398 3022562 2834072 2633599 2457200 2288589 2156790 2089466 2062919 2066678 2090255 2127174 2198809
9387 2198809 2234531 2253927 2260153 2287612 2357992 2485712 2646248 2824315 2985185 3095889 3139940
9376 3139940 3093316 3001071 2875618 2713522 2539416 2407109 2340071 2356560 2402437 2458533 2517655
9365 2517655 2588981 2634632 2633298 2581002 2493667 2389654 2292412 2200088 2105314 2017537 1947987
9354 1947987 1894770 1859803 1831723 1820984 1805665 1804183 1824148 1834448 1854523 1921930 1999460 2096786
9342 2096786 2211802 2303545 2354779 2356180 2308581 2234074 2142925 2053506 1998419 1963808 1922292
9331 1922292 1868899 1845159 1829497 1804650 1788286 1775558 1769103 1761661 1775085 1797911 1841988 1895440
9319 1895440 1965530 2044950 2121862 2181984 2234381 2260264 2244653 2187916 2111170 2031228 1958508
9308 1958508 1918042 1872004 1840857 1834553 1850050 1878933 1913620 1951273 1972001 1993539 2002020 2018910
9296 2018910 2055485 2111924 2200581 2285443 2378449 2473277 2513103 2507667 2460856 2391007 2317788 2260851
9284 2260851 2199335 2147858 2127305 2105402 2068844 2046637 2018064 2019122 2015157 2008062 2020025 2056259
9272 2056259 2074619 2092238 2116125 2138924 2137232 2164046 2193422 2195514 2188667 2169724 2157330 2159290
9260 2159290 2149808 2156493 2153141 2145009 2138678 2144885 2144608 2148161 2152811 2148596 2163686 2190520 2220453 2238095
9246 2238095 2253874 2263197 2271051 2267028 2248924 2232326 2235551 2230690 2219490 2216185 2214947 2225716 2235256
9233 2235256 2264760 2284853 2286377 2306306 2334758 2363317 2404443 2433028 2454158 2471834 2487046 2496130
9221 2496130 2505204 2536057 2571300 2601019 2628922 2667357 2708889 2729182 2732969 2713178 2696886 2713762
9209 2713762 2727817 2737918 2747796 2747487 2766504 2784459 2793388 2807770 2817098 2833239 2871136 2906195
9197 2906195 2963976 3015425 3069626 3111214 3148861 3180824 3174860 3177762 3195264 3206845 3211687 3234782
9185 3234782 3279311 3312900 3350802 3387498 3437221 3469813 3502247 3551913 3614758 3673805 3752612
9174 3752612 3817971 3882455 3928561 3961879 4003884 4050094 4114112 4187155 4248984 4322007 4410917
9163 4410917 4516634 4647128 4788942 4956662 5133767 5328577 5546001 5782439 6058093 6348274
9153 6348274 6691228 7072356 7525498 8078514 8765546 9627084 10671077 11937300 13434547
9144 13434547 15164180 17088804 19193438 21424666 23723139 26063529 28384504 30641484
9136 30641484 32778040 34807997 36980219 39672884 43265227 47895289 53459764 59643298
9128 59643298 65961704 71880371 76996047 81028740 83931001 85906606 87234682 88070338
9120 88070338 88566030 89086706 90363054 93147595 97590682 102980463 108113668 111920920
9112 111920920 113922208 114236954 113392273 111969202 110475075 109236979 108282329 107696441 107765458
9103 107765458 108713691 110457203 112590653 114439684 115449116 115170324 113571759 110907833
9095 110907833 107776874 104874214 102464570 100340561 98048978 95119597 91435978 87181125
9087 87181125 82608892 77882712 73091399 68328131 63677388 59237877 55145497 51637238
9079 51637238 48812243 46516971 44373631 42176579 39840911 37393597 34928496 32533232
9071 32533232 30301576 28304191 26607832 25339621 24679110 24787922 25837361 27740572
9063 27740572 30202412 32862618 35582418 38231255 40426776 41676374 41851966 41420121
9055 41420121 41002730 41300882 42929155 46328709 51588753 58310491 65854851 73666629
9047 73666629 81071560 87196788 91588729 93901996 93812073 91769486 89343994 88159581
9039 88159581 89255981 93226788 100178324 109373814 118962557 126887829 132709387 136944786
9031 136944786 139744233 140970602 141142029 141449825 142904747 145933215 150457045 156179887
9023 156179887 163505612 172691532 182330730 189694261 192955656 192506139 189896445 185994985
9015 185994985 180626759 173691372 165934964 158154765 150293527 141949175 133450861 125626447
9007 125626447 118697376 112106222 104891469 96664950 87934682 79317120 71275638 64342013
8999 64342013 58888587 54714878 51339276 48444771 45881750 43567204 41645578 40480463
8991 40480463 40589831 42576101 46515242 50611794 52056350 50089973 45695098 39890540
8983 39890540 33689818 28203260 24070057 21254506 19478339 18426682 17876449 17739581
8975 17739581 17980395 18507001 19200485 19931069 20615290 21211985 21619067 21836525 22109769
8966 22109769 22758730 24045008 26102753 28732559 31212667 32686819 32774098 31590565 29479399
8957 29479399 26908784 24421336 22462941 21293732 20956311 21320414 22050109 22694465 22912180
8948 22912180 22636008 22103309 21640646 21568629 22165374 23540531 25735660 28708327 32068823
8939 32068823 35036767 36749126 36757810 35256562 32844546 30191387 27874759 26271811 25441703
8930 25441703 25258804 25579462 26369415 27745888 29950046 33172422 37338894 41921036 45982911
8921 45982911 48408274 48642728 46899157 43897613 40406876 36913320 33612975 30659520
8913 30659520 28099691 25881932 24025262 22714244 22078287 22058157 22639913 23806643 25556734
8904 25556734 27983097 31303009 35847005 41822083 48816021 55592473 60464681 62145677
8896 62145677 60544856 56665029 51822942 46991598 42804184 39489269 36775960 34332812
8888 34332812 32038498 30040255 28553665 27770450 27799345 28662094 30143935 31832959 33327251
8879 33327251 34459284 35297393 35969552 36510275 36745120 36542092 36070479 35680353 35733595
8870 35733595 36430897 37583610 38684064 39107804 38459693 36870250 34772120 32739873 31355058
8861 31355058 31102023 32157451 34260924 36657725 38437201 39026909 38541383 37665495 37169568
8852 37169568 37409897 38305233 39372677 39963454 39682514 38546605 36776913 34586481 32123742
8843 32123742 29487178 26823038 24333330 22232080 20746310 20031951 20063705 20716747 21745196
8834 21745196 22931967 24236278 25925308 28459995 32199405 37109553 42469265 47031230
8826 47031230 49448399 48906723 45567499 40295487 34234178 28382522 23395366 19592350
8818 19592350 16887758 15079167 13971495 13458820 13480345 14045823 15203479 16920323 19073116
8809 19073116 21487810 24000482 26473114 28798884 30718142 31763687 31453246 29634482
8801 29634482 26657067 23115365 19581917 16487608 14099031 12402777 11294596 10688694
8793 10688694 10512132 10766431 11491202 12803541 14822193 17509046 20485775 23081426 24520926
8784 24520926 24363051 22669791 19923717 16754987 13718370 11169122 9236570 7860901
8776 7860901 6913630 6269833 5835455 5598711 5504052 5553518 5720792 6047770 6564271 7398586
8766 7398586 8621891 10184922 11792951 12949252 13252660 12576077 11174741 9465734 7743972
8757 7743972 6277259 5151356 4349756 3793629 3387142 3100139 2882234 2729967 2613172
8748 2613172 2498721 2423230 2360055 2292414 2233529 2187768 2143256 2105231 2070992 2033764 1986729
8737 1986729 1939611 1912242 1889469 1862948 1845174 1825521 1821833 1855600 1913830 1959431 2028209 2096041
8725 2096041 2122406 2125351 2112332 2086648 2055302 2024791 2006178 1992212 1994106 2015067 2039836 2074567
8713 2074567 2117448 2154793 2178674 2210215 2229566 2221200 2215268 2214143 2232310 2275403 2331149 2382286
8701 2382286 2427771 2455130 2476769 2477767 2468084 2442387 2425053 2411412 2405308 2410686 2440263 2472182
8689 2472182 2494672 2489124 2490564 2477348 2457030 2453044 2461297 2466401 2461648 2453637 2458121 2466670 2480950
8676 2480950 2513662 2565199 2613985 2633522 2634160 2645510 2653364 2652341 2656578 2681428 2703172 2743906
8664 2743906 2756992 2758525 2770811 2780866 2808103 2844256 2885249 2932950 2969617 2996166 3011939 3033950
8652 3033950 3077405 3119427 3177029 3247237 3344849 3450298 3597036 3767037 3916466 4099384
8642 4099384 4246321 4357510 4434602 4485495 4521250 4596643 4742652 4916528 5075790 5199743
8632 5199743 5241286 5206123 5157967 5112111 5105208 5125057 5165189 5236186 5329557 5454174 5606257
8621 5606257 5750817 5877456 6006650 6160137 6340123 6565919 6867129 7221553 7600584 8023112
8611 8023112 8523469 9080537 9734082 10537882 11534122 12798509 14424589 16541050 19352781
8602 19352781 23038517 27733148 33607967 40710140 48743385 56722365 63155017 67046271
8594 67046271 68371332 67431078 64456790 60123918 55263626 50335069 45544068 41045963
8586 41045963 36901474 33186629 29999538 27368112 25309582 23813551 22834378 22263529
8578 22263529 21973040 21962721 22301312 23200490 24925471 27745158 31847481 37205626 43485052
8569 43485052 50020793 55794547 59954200 62285649 63045932 62473866 60581220 57459838
8561 57459838 53563296 49236108 44667431 40199333 36171849 32649491 29632277 27126516
8553 27126516 25041166 23242730 21655327 20261710 19072558 18077856 17315721 16808715 16521604
8544 16521604 16402144 16482985 16739208 17145490 17716215 18435306 19266441 20267825 21495550
8535 21495550 23059242 25121157 27733744 30844639 34397072 38384093 42978522 48549784
8527 48549784 55362703 63192205 71102754 78044373 83791614 88847292 93806625 98886029
8519 98886029 104039549 109432817 115014970 120219823 123994806 125167154 123004208 117462755
8511 117462755 109220609 99538306 89708189 80586747 72807276 66779348 62522297 59675769
8503 59675769 57967518 57348989 57819857 59368527 62162075 66249641 71171737 75934865
8495 75934865 79852348 83294845 87082041 91698900 97097194 102904387 108723090 114112854
8487 114112854 118333803 120451530 119464379 114850250 107042290 97199726 86374651 75393854
8479 75393854 65203920 56437734 49117489 43082017 38209404 34286312 31080102 28426192
8471 28426192 26213757 24406578 22965421 21869327 21051772 20485248 20172535 20146618 20491847
8462 20491847 21259600 22548627 24399163 26903682 30076392 33808886 37750401 41319473
8454 41319473 44208567 46592061 48903703 51774746 55840829 61177213 66724125 71032279
8446 71032279 73634947 75001556 75920881 76970464 78414111 80396061 83075209 86363352
8438 86363352 89526773 91344292 90863674 87635996 82030228 75105771 68000485 61651947
8430 61651947 56665109 53308832 51542859 51033144 51314793 52116243 53455144 55557361 58611628
8421 58611628 62520125 66743625 70378304 72955457 74606230 75545333 75980661 76305524 77146056
8412 77146056 78947490 81466368 83931758 85185453 84292705 80908475 75129219 67454295
8404 67454295 58843551 50404344 42763654 36157146 30672383 26288934 22860916 20239305
8396 20239305 18276417 16826162 15731258 14849716 14122238 13543280 13107812 12799198 12587616
8387 12587616 12467862 12428757 12465521 12577828 12736883 12957340 13231067 13583152 14041069 14603036
8377 14603036 15236069 16083417 17305331 18900636 20701373 22648010 24572749 26151868
8369 26151868 27135472 27738368 28343648 28908776 29070996 28725033 27846179 26369791 24475106
8360 24475106 22452616 20422091 18507807 16857689 15441160 14229957 13287758 12649657
8352 12649657 12395190 12503611 12888538 13459735 14242532 15277498 16589534 18130786 19825391
8343 19825391 21743768 23931721 26171420 27963336 29079757 29733993 29814054 29028895 27424332
8334 27424332 25069136 22236871 19339642 16671486 14371181 12514375 11072957 9931175
8326 9931175 9008855 8267588 7709066 7311841 7043811 6891153 6778662 6623877 6402774 6135631
8316 6135631 5831504 5516674 5252928 5022032 4809089 4621568 4453744 4300371 4174619 4089322
8306 4089322 4029217 3992631 3954346 3949513 3964148 3952290 3939318 3924239 3907857 3892255 3884570 3878241
8294 3878241 3870435 3866112 3870607 3851511 3832580 3826739 3830469 3839700 3862419 3866627 3882308 3904868 3919538
8281 3919538 3914997 3941947 3980472 4019180 4075478 4132814 4192130 4258922 4347610 4442786 4527506 4600265
8269 4600265 4677864 4748687 4809165 4847146 4874578 4921150 4963659 5008292 5045866 5092986 5144259
8258 5144259 5197290 5253843 5290496 5335323 5392368 5452370 5509153 5574638 5663738 5750286 5841888
8247 5841888 5939179 6049617 6156112 6272892 6390763 6512237 6641543 6767024 6883456 7001364
8237 7001364 7123869 7274181 7428334 7570378 7730139 7898620 8069592 8236243 8406261 8583122
8227 8583122 8758868 8947119 9137696 9349350 9552243 9777939 10008611 10230609 10474579 10708887
8217 10708887 10950526 11229333 11515217 11800718 12091969 12410491 12734018 13054841 13390702
8208 13390702 13744998 14126528 14540556 14944246 15383260 15852876 16356626 16885630 17432441
8199 17432441 18008250 18591400 19192215 19821626 20469182 21123376 21783459 22475305 23225290
8190 23225290 24030754 24903980 25827880 26797430 27828968 28949634 30148058 31433720 32773376
8181 32773376 34197879 35720109 37351250 39105033 40986553 43006754 45180211 47528589
8173 47528589 50037655 52749499 55688510 58857973 62280047 65973282 69906454 74130387
8165 74130387 78703959 83647254 89032033 94901247 101279081 108202110 115750267 123960653
8157 123960653 132887412 142554427 152991060 164251578 176321045 189148237 202667594
8150 202667594 216758575 231252638 245852716 260164565 273761978 286102591 296629487
8143 296629487 304774355 310045600 312096540 310821299 306238800 298644914 288499611 276312096
8135 276312096 262689844 248185095 233299585 218444526 203935576 189999779 176788520
8128 176788520 164418889 152875376 142164075 132281963 123151690 114741985 106984703 99842114
8120 99842114 93271686 87207030 81626905 76470505 71724335 67359582 63329101 59573314
8112 59573314 56096168 52864913 49878545 47134458 44571274 42177667 39953265 37882984
8104 37882984 35958678 34155388 32481836 30917743 29458752 28114384 26866398 25694950
8096 25694950 24596532 23530666 22538991 21567955 20640536 19762159 18921773 18107708 17344012
8087 17344012 16625104 15946219 15290566 14677035 14070436 13473203 12915656 12391724 11894592
8078 11894592 11411814 10964913 10554547 10172410 9818214 9451391 9095228 8749844 8427792
8069 8427792 8142380 7851190 7579014 7334880 7098320 6865532 6658039 6452232 6256248 6057863
8059 6057863 5874730 5708575 5542630 5395295 5267805 5142221 5025997 4932354 4845656 4775352
8049 4775352 4709761 4641863 4534751 4436590 4331795 4221371 4127179 4051198 3955888 3870501 3785132
8038 3785132 3692979 3574264 3443001 3327780 3204606 3088940 2980599 2872512 2784796 2692389
8028 2692389 2623471 2573079 2529831 2472707 2428410 2398477 2382137 2350773 2320109 2272934 2214557
8017 2214557 2152047 2127501 2087047 2033806 1974018 1932235 1897054 1845505 1795398 1728694 1630366
8006 1630366 1545675 1472954 1417367 1357676 1299854 1252068 1192614 1144842 1121920 1074514 1027398
7995 1027398 979871 933256 895128 863113 824241 806725 778346 736436 696606 633373 575711
7984 575711 522579 486252 438776 412108 397419 377940 363986 361545 367808 356659 347656 338142
7972 338142 319873 326586 344630 362274 391241 423083 426145 413252 394433 376206 347905 296960
7960 296960 256063 229490 200181 167241 165379 189556 191653 176719 168592 181154 200240 190151
7948 190151 181304 180020 193702 214396 220260 224573 253386 258136 261073 297534 339949 355542 357650
7935 357650 349852 313182 295210 271579 225216 198774 199650 189549 185700 176986 151336 125006 108681
7922 108681 104956 87457 65321 46607 27969 20170 14763 13603 11716 -2345 -5523 -13069 -23308
7909 -23308 -19114 -19754 -43262 -54669 -39732 -41722 -40770 -49493 -66833 -64502 -69356 -75215 -78505 -87899
7895 -87899 -75597 -82033 -84458 -82292 -80165 -78931 -83087 -101531 -125399 -113095 -103003 -113923 -119154
7882 -119154 -111853 -114763 -133233 -136161 -143272 -153121 -161024 -175477 -186522 -195142 -170036 -165453 -170953
7869 -170953 -179349 -172246 -199207 -210324 -210879 -204516 -195578 -204253 -219128 -234160 -237101 -241565 -247620 -251784
7855 -251784 -257559 -267368 -264883 -272975 -263522 -261286 -279649 -281625 -281565 -304206 -312214 -316295 -324396 -315271
7841 -315271 -326405 -335124 -327728 -335589 -317630 -297316 -296989 -299706 -298753 -280739 -269252 -260459 -264951 -250747
7827 -250747 -222180 -216127 -216597 -232652 -236315 -239631 -248811 -253380 -240056 -239546 -233113 -218063 -204300 -209166
7813 -209166 -215615 -211035 -200978 -205775 -228816 -243351 -248900 -252212 -236794 -229140 -227571 -236620 -240624
7800 -240624 -253896 -257997 -273989 -268831 -266769 -268591 -276650 -267410 -262344 -246041 -253323 -263243 -255215 -247015
7786 -247015 -263583 -282707 -280774 -267425 -269854 -279647 -268903 -283314 -297060 -302843 -304961 -314481 -327916
7773 -327916 -326086 -322238 -309455 -309362 -303756 -306514 -301917 -302940 -318259 -319833 -319232 -306638 -304661 -298596
7759 -298596 -299960 -317488 -329383 -317839 -324130 -341676 -339713 -352489 -355451 -351481 -341751 -342155 -329671
7746 -329671 -314891 -309660 -305491 -324003 -322107 -315143 -325113 -340034 -351011 -342043 -330989 -310909 -294446
7733 -294446 -291493 -287565 -295669 -304843 -325250 -318471 -308235 -304064 -306025 -303096 -300631 -299223 -302866 -308471
7719 -308471 -321429 -325372 -340812 -349569 -356402 -337890 -324021 -328043 -328635 -324713 -321611 -325443 -343029
7706 -343029 -340563 -333370 -331284 -336538 -333370 -322149 -321466 -316509 -318709 -312364 -304559 -318298 -326765 -346888
7692 -346888 -356149 -346216 -340773 -341228 -346901 -336956 -312563 -299098 -288963 -294302 -303701 -301408 -302434 -310621
7678 -310621 -297266 -282239 -276917 -295646 -311986 -317280 -326649 -329070 -314141 -313796 -308710 -307496 -303395
7665 -303395 -301221 -308354 -323374 -326051 -324292 -331863 -325568 -315749 -320598 -342086 -350532 -329794 -300417
7652 -300417 -297271 -307897 -312688 -310231 -325270 -337536 -332451 -319358 -316963 -328693 -331906 -333820 -343820
7639 -343820 -355736 -350087 -357530 -365342 -354808 -339354 -333387 -333905 -324169 -313845 -306231 -319682 -339132
7626 -339132 -360073 -364164 -363868 -351257 -348517 -339917 -315941 -318819 -334849 -348512 -339044 -326848 -328852
7613 -328852 -344483 -364407 -349534 -350321 -323596 -303001 -301046 -311566 -347079 -364832 -360104 -358991 -357313
7600 -357313 -348634 -350107 -350426 -339237 -327203 -332450 -352544 -364768 -365333 -351339 -367056 -361570 -350258
7587 -350258 -334250 -345529 -355142 -351106 -343478 -348261 -344414 -334104 -342882 -347603 -344811 -345389 -344790 -337433
7573 -337433 -336210 -345757 -344859 -355059 -366349 -359340 -344976 -349147 -350275 -346300 -338879 -332577 -319315 -318803
7559 -318803 -320072 -336692 -346294 -358676 -368297 -352595 -325131 -322884 -338632 -337422 -328081 -312565 -309383
7546 -309383 -310311 -307620 -318528 -337792 -358923 -348817 -339431 -329957 -320102 -334115 -353362 -353179 -342877
7533 -342877 -329747 -333629 -340031 -330026 -323418 -316628 -318036 -318843 -331333 -346387 -353114 -344773 -340855 -345118
7519 -345118 -346239 -335418 -317156 -315965 -305545 -310396 -321057 -324454 -332245 -336804 -340419 -315272 -299725
7506 -299725 -300867 -304184 -307050 -312230 -322142 -325362 -323244 -314637 -318356 -315388 -303317 -304530 -307931 -302179
7492 -302179 -302614 -313551 -323238 -320242 -319512 -333183 -337880 -327434 -318226 -323864 -335790 -340722 -339564 -341196
7478 -341196 -328941 -311187 -304275 -308599 -304115 -303792 -296921 -313730 -316065 -311735 -305798 -316912 -312271 -299062
7464 -299062 -298579 -317038 -306310 -296512 -305752 -298874 -290557 -288554 -278218 -287497 -300573 -296543 -300105 -294875
7450 -294875 -301560 -311904 -311097 -315617 -321119 -317611 -315869 -318946 -311900 -301840 -284289 -277454 -275459 -273387
7436 -273387 -277983 -278831 -277361 -295718 -303770 -302119 -308113 -318885 -315973 -305705 -299594 -301965 -299517 -287517
7422 -287517 -282750 -274889 -275642 -278546 -282213 -299485 -302504 -289932 -298817 -309117 -295432 -283633 -289075
7409 -289075 -307357 -330037 -311896 -309303 -303696 -302455 -292723 -291784 -298449 -308684 -306323 -287307 -277705
7396 -277705 -270360 -272353 -269860 -277173 -279651 -288292 -313210 -306065 -301737 -291130 -280958 -271671 -261298
7383 -261298 -286769 -302924 -304682 -310512 -285436 -273329 -278214 -275842 -286332 -290466 -277498 -263755 -270259
7370 -270259 -294361 -295702 -271452 -269200 -265863 -270332 -254588 -260353 -249863 -240460 -239194 -239316 -258566
7357 -258566 -263668 -245093 -246169 -253883 -243923 -246423 -242337 -249459 -252183 -255305 -260682 -258209 -247194 -253293
7343 -253293 -254568 -263229 -268415 -269618 -271564 -270053 -276859 -278943 -282135 -275587 -271530 -281261 -290792 -294380
7329 -294380 -293509 -280797 -280985 -275208 -260637 -266373 -278949 -284618 -270550 -267175 -272448 -272418 -270094 -270402 -272831
7314 -272831 -277760 -264838 -242584 -242522 -244139 -241729 -231863 -234261 -241868 -266618 -274193 -271405 -285479 -274226
7300 -274226 -265180 -253338 -250211 -261710 -262735 -259804 -250086 -245669 -251516 -246914 -238344 -236730 -245690 -242859
7286 -242859 -246601 -242885 -252618 -261641 -267494 -264386 -263054 -260181 -263937 -266524 -261677 -252350 -252649 -265176
7272 -265176 -273759 -267023 -271350 -272823 -260092 -253786 -235433 -224962 -224217 -233417 -223398 -209026 -233508
7259 -233508 -238438 -236043 -241848 -252339 -273398 -288391 -280244 -279761 -274267 -264934 -249801 -252960 -250633 -249173
7245 -249173 -241527 -233335 -236657 -233825 -234843 -242276 -257694 -234728 -230180 -216714 -225263 -229698 -231118 -231213
7231 -231213 -238924 -243125 -243411 -254228 -273086 -284415 -283908 -265149 -253624 -247743 -241906 -235274 -240616 -239182
7217 -239182 -233705 -240072 -247888 -248540 -245867 -220606 -218668 -226355 -227788 -225296 -223928 -237341 -241454 -226448
7203 -226448 -232620 -237864 -240384 -251520 -256173 -253373 -239102 -215141 -210078 -211526 -222527 -230301 -248437
7190 -248437 -261642 -260865 -247966 -246936 -254334 -256219 -250971 -253613 -238370 -236005 -232209 -241265 -254580 -258254
7176 -258254 -244048 -243170 -256582 -236067 -218076 -200496 -195986 -210468 -219553 -217978 -211380 -189711 -195207
7163 -195207 -202984 -211646 -206804 -203695 -201856 -201673 -195026 -203635 -205048 -208188 -195552 -176550 -175889 -197518
7149 -197518 -197250 -200218 -201893 -194722 -185655 -204616 -215917 -225386 -217932 -216443 -220104 -217546 -212880 -218644
7135 -218644 -221589 -234846 -229569 -211915 -211664 -222434 -216213 -218693 -230109 -249964 -249291 -240724 -238512 -234808
7121 -234808 -228574 -225138 -211526 -192443 -197334 -208329 -222285 -240835 -238106 -237962 -235350 -228183 -221462
7108 -221462 -231433 -226234 -212179 -210870 -211594 -202344 -205327 -200269 -204450 -222553 -219976 -222579 -215680 -198906
7094 -198906 -204388 -226482 -237902 -230616 -226181 -234575 -228232 -214153 -226150 -227604 -226101 -213542 -219091
7081 -219091 -212061 -220051 -212152 -204520 -207854 -214610 -216209 -210823 -200784 -201531 -186415 -176190 -174104 -188137
7067 -188137 -199743 -191209 -214187 -225347 -226599 -212491 -189263 -199396 -209224 -204722 -189263 -191937 -198736
7054 -198736 -198062 -200476 -202658 -212664 -223014 -217344 -212998 -212027 -200710 -181400 -189382 -177875 -163884
7041 -163884 -176343 -182343 -185573 -195013 -199894 -211748 -211058 -205547 -199483 -201676 -219000 -233813 -213506
7028 -213506 -186948 -170299 -184917 -187151 -179518 -184260 -183528 -172966 -169923 -169325 -158701 -165355 -183249
7015 -183249 -191193 -186365 -177717 -179423 -189527 -202019 -215924 -215707 -205287 -211976 -208137 -208409 -223020 -225122
7001 -225122 -215488 -222038 -222436 -220142 -229391 -221771 -219353 -196757 -194042 -202467 -205515 -195968 -196861 -196763 -183384
6986 -183384 -186398 -179500 -187737 -195362 -197949 -196666 -189721 -183632 -176767 -174997 -176592 -157851 -153469 -165312
6972 -165312 -183096 -194970 -202749 -206011 -206383 -200018 -196199 -189925 -178048 -184214 -192692 -194643 -193249 -191604
6958 -191604 -189786 -190778 -195829 -221882 -241812 -228789 -228419 -226081 -200509 -173819 -170076 -171568 -183875
6945 -183875 -188495 -174326 -153377 -155596 -157087 -160245 -160186 -177458 -185952 -164976 -153883 -158057 -162412 -169637
6931 -169637 -171343 -176104 -160158 -152217 -170800 -179156 -190105 -193055 -189490 -176712 -159225 -159195 -173683
6918 -173683 -162603 -161961 -159133 -172246 -172925 -173917 -179640 -179818 -175351 -167159 -171871 -168959 -168532 -165080 -172526
6903 -172526 -176851 -159790 -146601 -149335 -153047 -146975 -137953 -146535 -163197 -169590 -164948 -179301 -179403 -160115
6889 -160115 -153460 -175693 -181043 -171087 -169458 -158995 -145091 -146126 -162587 -158784 -176256 -186279 -180767
6876 -180767 -179311 -183795 -169776 -172206 -180673 -191851 -184522 -174642 -171750 -166208 -166037 -168832 -176502 -187117
6862 -187117 -190060 -179783 -164716 -155966 -141366 -137594 -133544 -132830 -146095 -146056 -129411 -116989 -101716
6849 -101716 -105061 -121468 -139969 -149859 -146902 -141533 -116086 -103087 -127953 -155326 -159250 -156736 -177005
6836 -177005 -182646 -164952 -140810 -142775 -148906 -133360 -134035 -151601 -165406 -178663 -178903 -173946 -158161
6823 -158161 -152102 -141560 -149108 -145461 -145528 -145303 -144069 -159313 -174446 -184174 -178872 -163541 -164094 -177092
6809 -177092 -179696 -180862 -181643 -173465 -152425 -150437 -154438 -165802 -142844 -147677 -155671 -150382 -147074 -155890
6795 -155890 -161620 -150307 -138503 -130483 -142248 -145329 -142183 -143919 -143112 -146161 -140965 -120012 -109221
6782 -109221 -119803 -140125 -147777 -147533 -156808 -154822 -152487 -147982 -134173 -144100 -152612 -158194 -162444 -153614
6768 -153614 -146394 -139747 -143856 -159211 -171967 -174071 -158001 -149250 -148553 -142672 -142809 -149729 -155569 -156229
6754 -156229 -157668 -156729 -148225 -148418 -152306 -155749 -170656 -170867 -154815 -155275 -168484 -163023 -160762 -141257
6740 -141257 -142021 -139120 -137263 -136794 -140623 -136588 -141694 -142793 -142210 -130645 -128179 -131488 -150028 -169587
6726 -169587 -156074 -146480 -163287 -174495 -177255 -189445 -176214 -157122 -145724 -148896 -149685 -157796 -181085
6713 -181085 -181951 -165965 -141889 -129278 -129651 -126902 -127172 -133528 -144914 -152769 -157862 -153089 -145391 -146869
6699 -146869 -144945 -137046 -131863 -134146 -131804 -124254 -133305 -142448 -148086 -143741 -144064 -150922 -137514 -133180
6685 -133180 -123171 -115798 -126392 -115702 -114366 -129567 -162357 -161995 -137809 -143991 -135083 -146646 -159828
6672 -159828 -172392 -157008 -130207 -128393 -126966 -141092 -139343 -141935 -140484 -140945 -155430 -158554 -147657
6659 -147657 -145837 -140463 -137299 -156964 -169101 -163512 -167741 -187766 -167581 -144987 -145072 -141372 -133870 -130752
6645 -130752 -131063 -132652 -146476 -155659 -156524 -141580 -125822 -118721 -138327 -146040 -143255 -135940 -123043 -134761
6631 -134761 -133804 -113051 -117856 -134588 -144844 -115451 -98212 -105264 -118195 -126441 -116865 -114938 -103431
6618 -103431 -93757 -98511 -84542 -105440 -118753 -121815 -115148 -113887 -111342 -110595 -109640 -108809 -101644 -100631
6604 -100631 -104355 -107936 -122066 -141488 -143816 -134585 -136672 -147165 -142041 -126195 -105148 -101117 -93031
6591 -93031 -91213 -96402 -95332 -85736 -89552 -99284 -97461 -112330 -124417 -125356 -116961 -116679 -103952 -106738
6577 -106738 -113372 -110712 -123584 -140853 -122911 -122104 -131184 -116111 -121602 -136992 -132690 -132491 -132948 -121615
6563 -121615 -123017 -127519 -121297 -108866 -111989 -107260 -95606 -92548 -85823 -98719 -109787 -142281 -150549
6550 -150549 -146740 -153648 -153882 -144240 -139085 -126044 -124748 -127557 -126937 -139525 -129677 -133329 -155504 -162584
6536 -162584 -139893 -121956 -118958 -114130 -118825 -122263 -123807 -132380 -143127 -143197 -162207 -152311 -128304 -121246
6522 -121246 -109179 -101747 -96236 -94605 -97251 -110411 -136237 -142906 -131494 -118833 -115243 -125085 -106817
6509 -106817 -99869 -105054 -97772 -100941 -109700 -115911 -135839 -133291 -113499 -81846 -69797 -77033 -87546
6496 -87546 -91442 -102883 -110259 -111246 -104546 -100387 -108903 -122457 -135642 -134782 -136206 -134614 -130270 -114382
6482 -114382 -102225 -114845 -117739 -101110 -93547 -98241 -98631 -99042 -102096 -102267 -97158 -85895 -78563 -88678
6468 -88678 -84256 -92183 -89757 -85657 -77642 -69540 -72604 -87763 -94572 -90112 -88348 -105047 -96841 -98091
6454 -98091 -105400 -110964 -100388 -105640 -99122 -96846 -99401 -90024 -100886 -103159 -84871 -95536 -102605 -98913
6440 -98913 -98184 -92871 -96374 -93338 -80447 -74482 -85403 -97053 -112244 -119345 -117389 -114702 -112840 -101260
6426 -101260 -98725 -101970 -101024 -96088 -102871 -88124 -98322 -99222 -107166 -106796 -110113 -114520 -113462 -104742 -123124
6411 -123124 -120884 -124021 -112218 -111683 -98216 -98255 -114167 -123837 -111862 -105109 -121149 -126907 -133276 -116696
6397 -116696 -93135 -94405 -103561 -97766 -102643 -106467 -107064 -94478 -100927 -101780 -102114 -102136 -97382 -100381 -109844
6382 -109844 -107754 -110883 -95931 -87595 -86258 -90446 -100441 -112356 -119742 -112944 -94099 -88503 -86561 -87489
6368 -87489 -94841 -87555 -103698 -119015 -127583 -129485 -113819 -102733 -104949 -109942 -107647 -88955 -80391
6355 -80391 -80393 -86134 -89930 -108641 -114303 -103660 -91627 -88259 -80390 -75553 -71849 -85321 -101207 -95213
6341 -95213 -94715 -113714 -111198 -101478 -103281 -94937 -83566 -85511 -94727 -95734 -86802 -83396 -76105 -82301
6327 -82301 -105974 -109283 -98922 -88860 -92844 -90848 -98382 -105213 -99193 -82177 -64990 -53441 -58467
6314 -58467 -63573 -72750 -101543 -110015 -111424 -108277 -107252 -90810 -78005 -83980 -91140 -90031 -90166 -103904
6300 -103904 -108466 -111146 -108368 -98295 -94255 -89629 -91829 -92406 -100416 -111533 -104068 -108271 -102852 -95649
6286 -95649 -91669 -72789 -55076 -57796 -73987 -81999 -87414 -94014 -105805 -100126 -95103 -90052 -79404
6273 -79404 -57369 -45402 -47575 -72915 -98264 -88300 -92444 -97970 -108267 -107624 -103936 -109967 -108273 -90457
6259 -90457 -87875 -98352 -97057 -88384 -88374 -84369 -90105 -96010 -95780 -95699 -96256 -90792 -84318 -91471 -89912 -80366
6243 -80366 -85309 -75567 -62428 -72632 -91784 -85467 -69557 -77706 -85102 -72391 -60368 -52855 -43247
6230 -43247 -64720 -71011 -65402 -72407 -75384 -64776 -70442 -79507 -82734 -97930 -102394 -109752 -105411 -105126
6216 -105126 -119583 -113438 -106110 -108723 -96973 -92782 -100466 -98288 -96573 -81656 -59530 -43016 -46250
6203 -46250 -57080 -59126 -65650 -52899 -54159 -57254 -71317 -76974 -78660 -73110 -81129 -95902 -97719 -102961
6189 -102961 -115055 -115454 -123993 -117224 -101706 -88060 -66057 -56981 -62929 -69201 -66479 -46444 -62958
6176 -62958 -84442 -82138 -85392 -93752 -98865 -73852 -76087 -84887 -94174 -108326 -113098 -99214 -93670 -72536
6162 -72536 -65379 -83090 -85286 -65045 -58559 -53477 -64165 -73687 -67270 -51246 -40359 -38989 -56992
6149 -56992 -74712 -79977 -91713 -95805 -87861 -92697 -90663 -89222 -91760 -86556 -87976 -97919 -100700 -82115
6135 -82115 -72275 -57306 -49112 -40022 -41481 -46065 -48955 -38378 -39660 -56635 -62836 -68333 -77669 -90276
6121 -90276 -81565 -76739 -84414 -79866 -69083 -71848 -74890 -86571 -104169 -114676 -108171 -97044 -74136
6108 -74136 -74185 -72904 -73823 -83560 -84424 -83801 -71215 -65220 -75110 -64577 -63117 -67029 -58899 -51527 -43766
6093 -43766 -49011 -66260 -76490 -72072 -73437 -69399 -69597 -82649 -88154 -77847 -70856 -67623 -56780 -54021
6079 -54021 -62417 -70528 -81979 -83524 -80848 -65350 -53950 -69605 -73515 -93423 -100493 -122209 -97074
6066 -97074 -79059 -73653 -68237 -65564 -72965 -83989 -97362 -99941 -79631 -73124 -89316 -82930 -83216 -71133
6052 -71133 -65409 -73861 -76599 -63100 -66393 -82577 -81886 -80087 -80567 -79711 -83740 -82945 -87482 -98076 -91995
6037 -91995 -75743 -71426 -72349 -77543 -73728 -77210 -75180 -62526 -66551 -68356 -79092 -88279 -83132 -67371
6023 -67371 -67251 -48019 -65501 -91666 -89614 -75386 -74916 -83193 -81782 -56935 -48054 -70264 -64187 -54813
6009 -54813 -64966 -81439 -81397 -74573 -68160 -56755 -65169 -78107 -79625 -84837 -88732 -84281 -85538 -83427
5995 -83427 -84401 -83262 -73671 -73023 -78055 -63825 -55078 -69865 -64087 -57617 -75516 -74466 -64859 -54305
5981 -54305 -63077 -67229 -66092 -47731 -50817 -61661 -59647 -57066 -58499 -46255 -48898 -48817 -45448 -51796
5967 -51796 -44734 -51554 -54514 -52971 -76264 -84573 -72635 -65447 -55080 -46346 -38444 -51230 -65382
5954 -65382 -55530 -47053 -53816 -74846 -73567 -67927 -82440 -90694 -70459 -41282 -29728 -32042 -29081
5941 -29081 -32224 -43153 -51215 -48739 -47381 -32198 -31895 -41916 -43397 -42323 -52049 -62324 -68747 -80598
5927 -80598 -69906 -51927 -50263 -56447 -60179 -50190 -49100 -43254 -56581 -64125 -70581 -79103 -69450 -66100
5913 -66100 -64384 -55287 -53625 -49719 -59178 -71008 -63997 -64825 -69980 -74794 -82702 -65368 -59399 -70774
5899 -70774 -62193 -47215 -35743 -55312 -48780 -48899 -45762 -36130 -35240 -36350 -32496 -44233 -40732 -45211
5885 -45211 -50757 -50663 -64005 -80971 -73576 -65091 -71537 -76743 -72456 -55775 -42031 -53192 -52523 -38806
5871 -38806 -30607 -24854 -18640 -41176 -27136 -6537 11237 21825 9078 -20731 -40206 -61804
5859 -61804 -93018 -91978 -67029 -55314 -67182 -63849 -55837 -70636 -80093 -72903 -67350 -61964 -52002
5846 -52002 -61485 -65963 -72675 -84315 -80237 -82696 -87849 -75396 -71211 -70633 -82682 -97112 -83650 -67174
5832 -67174 -63394 -67540 -78133 -73187 -73375 -68717 -69759 -80917 -67916 -63205 -72135 -74160 -88868 -82761
5818 -82761 -72553 -79942 -78688 -84934 -85849 -85228 -94764 -93916 -79314 -82729 -77404 -63960 -80010 -99236
5804 -99236 -79245 -75514 -74879 -73002 -75689 -81527 -82788 -80038 -80355 -80898 -73948 -68418 -81390 -67786 -60318
5789 -60318 -55547 -59442 -58678 -55500 -58710 -79821 -77799 -77160 -71685 -72069 -69746 -65595 -83707 -81253 -63669
5774 -63669 -58899 -54750 -58171 -53890 -48250 -54364 -57757 -47116 -37551 -35048 -24596 -46962 -53471 -41839
5760 -41839 -43366 -49945 -51108 -49284 -48814 -52929 -57636 -61638 -55389 -47573 -39791 -42635 -56741 -54705 -57403
5745 -57403 -37835 -22050 -7843 -17957 -27922 -18983 -7244 -25504 -45898 -60092 -59916 -32297 -35916
5732 -35916 -39143 -38964 -69081 -64048 -48447 -58148 -45653 -36480 -24997 -26590 -22136 -10803 -355
5719 -355 5268 -13358 -35513 -45740 -49473 -34716 -30359 -35690 -30474 -42391 -37441 -35591 -36259 -46051
5705 -46051 -58708 -68335 -68844 -70066 -66695 -67968 -65243 -52042 -48007 -43190 -48116 -66534 -64430 -51668
5691 -51668 -45440 -54166 -70893 -60237 -64477 -67680 -65742 -76537 -75402 -72955 -71962 -69493 -75983 -88890
5677 -88890 -83126 -74469 -61999 -67058 -77477 -82915 -72931 -65269 -79667 -79173 -90325 -99419 -87706 -76308
5663 -76308 -61982 -58153 -34335 -27321 -27299 -37715 -50449 -59474 -64743 -59160 -59070 -67624 -68195 -68994 -60225
5648 -60225 -55769 -59180 -57971 -50050 -43745 -50698 -36727 -36017 -41967 -46540 -65139 -66182 -57387 -46747
5634 -46747 -44844 -45056 -38880 -32984 -43859 -55339 -56613 -56758 -65938 -64788 -72947 -66097 -59374 -60955 -52455
5619 -52455 -51468 -56552 -45586 -33147 -33139 -16479 -4244 -17121 -37495 -62318 -65253 -53000 -50330 -51390
5605 -51390 -57840 -52984 -52586 -46823 -35295 -43786 -51943 -46765 -34150 -40644 -44165 -38030 -45016 -40378
5591 -40378 -46019 -38127 -32486 -36080 -42457 -44629 -51314 -66108 -61025 -45641 -44542 -48673 -48301 -33163
5577 -33163 -49374 -41187 -24030 -27087 -39476 -60252 -55721 -34789 -35241 -32651 -38752 -35804 -37483 -25689
5563 -25689 -14447 -16218 -8198 -12350 -24258 -30313 -40296 -36396 -30979 -28202 -40611 -50649 -48371 -57179
5549 -57179 -47332 -29085 -42893 -51069 -52310 -40104 -36416 -51048 -50831 -45748 -40480 -22410 -22629 -35721
5535 -35721 -41654 -38298 -34527 -31058 -41733 -39698 -13187 -12881 -17508 -27899 -30394 -24346 -17706 -32530
5521 -32530 -33387 -34962 -50748 -29320 -28118 -35132 -41295 -32678 -26558 -16983 -20142 -30433 -42717 -48836
5507 -48836 -53136 -45065 -34897 -40340 -44012 -48793 -37049 -18642 -21247 -25674 -23320 -38920 -48229 -55291
5493 -55291 -50103 -48306 -65853 -74948 -62893 -39913 -39654 -30142 -32756 -31633 -26190 -44044 -38756 -9039
5479 -9039 -7262 -33213 -44354 -46585 -51960 -40055 -47570 -47643 -57134 -46742 -34725 -33770 -42527 -42940 -23971
5464 -23971 -37556 -42594 -38596 -32035 -27798 -24109 -31735 -46831 -55090 -60024 -53162 -50978 -31616 -26955
5450 -26955 -30151 -36175 -38658 -42732 -25412 -23112 -23291 -11329 -7729 -10012 -14661 -13253 -22838 -32601
5436 -32601 -30396 -34647 -37630 -27600 -5870 -14259 -18714 -34010 -35642 -25782 -18484 -17672 -23897 -16159
5422 -16159 -3208 -17021 -19430 6916 7331 -6720 -23121 -24938 -22676 -17416 -24296 -32331 -22475 -12642
5408 -12642 -15806 -25565 -25938 -36358 -33478 -30601 -25237 -31357 -39439 -33626 -24734 -23214 -34330 -40661
5394 -40661 -39331 -34807 -38734 -35533 -54664 -64397 -54310 -35563 -33125 -41225 -42705 -49883 -62863 -46098
5380 -46098 -30234 -32904 -45416 -42753 -43694 -45430 -45168 -47978 -44652 -46502 -41968 -36378 -34470 -24070
5366 -24070 -24590 -29494 -38144 -35141 -47419 -53212 -47262 -36500 -47068 -53447 -64044 -58125 -29840 -9179
5352 -9179 11456 24600 18526 -4232 -14922 -14772 -19925 -44918 -57335 -38607 -41770 -36863 -28568
5339 -28568 -19518 -7788 -2716 -5428 -14536 -18217 -11670 -5783 -2907 -9864 -21815 -46625 -66550 -52252
5325 -52252 -29637 -29620 -21261 -11415 -33245 -50099 -44761 -27074 -25568 -15754 -14965 -40914 -54462 -54258
5311 -54258 -48106 -41859 -28395 -14387 -5998 -16412 -21245 -24012 -20115 -32349 -36692 -41421 -32835 -42982
5297 -42982 -38442 -8013 -4517 -20639 -41398 -31067 -28070 -26087 -27573 -34119 -32257 -34134 -35760 -34970
5283 -34970 -55285 -59251 -46957 -39282 -48711 -43052 -46006 -53873 -40031 -33167 -45847 -38676 -38762 -32371
5269 -32371 -16143 -5045 -7638 -29220 -35578 -43013 -42434 -61323 -57073 -50424 -53449 -36055 -26473 -20456
5255 -20456 -4711 -3531 -19680 -26557 -23255 -29211 -29864 -35599 -31244 -33328 -22811 -16094 -19543 -16600
5241 -16600 -16440 -22136 -11056 -9801 -14467 -9027 -13757 -21738 -12554 -3562 7946 6948 -16362 -31899
5227 -31899 -26737 -21955 -21882 -13630 -10688 -16105 -22998 -18393 -12332 -4648 2398 16249 30332 14603
5213 14603 -2070 -23943 -22726 -14448 -19275 -21001 -11651 -8728 -15941 -12427 -471 -14710 -35632
5200 -35632 -29904 -13403 -19516 -21886 -8705 -12210 -8149 -4857 250 5924 -1178 -8435 -23989 -38554
5186 -38554 -27587 -26380 -27018 -26144 -23807 -28603 -39012 -21735 -3197 31529 31003 1488 -12385 -9208
5172 -9208 -15582 -5659 -8296 -10454 -4431 -7701 -13899 -25386 -34872 -26761 -24464 -18147 -8399 -17822 -25651
5157 -25651 -13722 -12905 -24222 -12146 -1327 -3801 -16741 -29888 -32548 -30054 -35692 -43294 -51849
5144 -51849 -61783 -63163 -45782 -25714 -17192 -19255 -28942 -25936 -33360 -37571 -36708 -40952 -28844 -6594
5130 -6594 -11492 -27175 -24758 -13910 -4749 -26047 -24931 -1500 12777 21422 6445 -21859 -3821
5117 -3821 21648 22242 7254 -8580 -14661 -19203 -19010 -15147 -13828 -12845 -27375 -27611 -21867 -26647 -28931
5102 -28931 -28599 -25006 -24519 -12069 -14307 -17805 -36816 -49925 -41937 -30141 -15228 -24211 -46302 -44220
5088 -44220 -62500 -57416 -51226 -50036 -44038 -48641 -30926 -19954 -17646 -15811 -11967 -24038 -25481 -19325
5074 -19325 -23083 -19832 -13796 -19888 -13817 -14716 -13415 -4187 -7241 -31042 -51439 -43415 -21439 -2332
5060 -2332 2518 -8488 -3557 -13261 -10207 -12521 -22163 -32407 -33977 -19723 -28092 -24763 -14714 -4827
5046 -4827 -1976 -3121 -4471 -11726 -26726 -22153 -16150 -6161 -20797 -29690 -26341 -30829 -25181 -19602
5032 -19602 -3914 1366 -14698 -35846 -24100 -13900 -34651 -18340 -26470 -18132 -25295 -40696 -34846
5019 -34846 -1995 14653 22927 33644 20840 -11616 -27453 -24159 -19290 -25865 -30743 -45949 -63849
5006 -63849 -53628 -40195 -16874 535 -13852 -17136 -1111 -7286 -20878 -9959 -11527 -24380
4994 -24380 -29844 -42386 -44483 -39186 -19789 -8308 -25877 -20850 -25784 -22786 -15830 -7757 -4954 -5576
4980 -5576 -21033 -20840 -10269 -3094 -54 -15697 -26500 -10254 -8323 -15222 -7413 1603 5793 24782
4966 24782 20631 22513 21313 12228 -14745 -29581 -44079 -43907 -28216 -6522 -15082 -25472 -23591
4953 -23591 -19643 -29563 -37652 -23700 -7930 10587 -1635 -24791 -13578 6811 4318 -6905 -72
4940 -72 17542 21720 5179 -6936 -5739 -1456 -27887 -24279 -12356 -11051 -266 -39 5725 22780
4926 22780 18199 -903 2800 6607 815 -14279 -33603 -24981 -19677 -29406 -32430 -28641 -19599 -6810
4912 -6810 -7232 -9915 -7754 -11145 -5732 -2093 -17499 -21892 -18340 -15469 -5506 -20501 -16445 -6018
4898 -6018 231 4305 -3061 -13553 -20052 -40914 -54400 -52092 -30788 -34132 -31439 -27273 -34539 -35132
4884 -35132 -27526 -42679 -48867 -26563 -22653 -20976 -20482 -26151 -28308 -20956 -15838 -15203 1537 -8087
4870 -8087 -8997 -10206 -22177 -20242 -25874 -44950 -46452 -8676 -2119 -13957 -14435 -12057 -9357 -7330
4856 -7330 920 -10939 -33912 -29929 -29821 -28158 -18976 -18144 -28556 -19201 2415 13221 14271 16276
4842 16276 -4428 -11303 -4027 17203 31648 26853 13680 9022 -7789 -18137 -8992 6756 7515
4829 7515 11572 1800 1571 10158 16499 25963 21995 18021 7849 -3254 -11894 -16656 -19577 2083
4815 2083 10060 -11313 -12647 -5183 2829 1680 -26593 -40629 -37822 -29047 -18031 -2536 -4145 2156
4801 2156 2335 18625 9555 -1898 -11884 -4725 -3295 -1585 -19841 -37018 -26106 -20373 -9673 -12093
4787 -12093 -19868 3362 8783 -10625 -10905 -1785 -10553 -11419 -23287 -16485 -814 -11843 -10058 -943
4773 -943 -1059 12445 13225 14236 12738 25473 32548 31133 10185 -9264 -14560 -20016 -30014 -44595
4759 -44595 -36891 -15563 -13624 -21854 -24850 -19477 -13859 -8963 1206 5304 14700 6208 -13120 -4696
4745 -4696 -308 18165 27801 23225 23242 6117 3015 -911 -8957 -4960 -23898 -29977 -40676 -25996
4731 -25996 -13659 -28624 -45555 -49974 -65185 -47831 -16447 5074 -91 -7811 -19210 -30081
4719 -30081 -18040 -9068 -17235 -19942 -19289 -8079 -6740 -10885 -7877 -3963 9284 29548 17773 -9678
4705 -9678 -20734 -10940 -9126 868 3222 12603 17678 -584 -9294 -11465 -11936 -4300 -3987 -4566 7188
4690 7188 16725 9736 15747 12192 2116 1746 -11135 -16826 -21024 -20722 -19520 -9801 536 -4511 -15403
4675 -15403 -26821 -20688 -12250 -13336 18469 28739 12497 10363 9340 -427 -19564 -17998 -7034
4662 -7034 -12555 -19355 -12620 -7243 10126 7995 -158 -5560 -14479 -12803 -4311 -1242 -844 -6397 843
4647 843 4572 -10229 -13936 -8158 2907 7533 5697 -548 6477 10433 3216 13359 438 -17804
4633 -17804 -23454 -17445 -7814 -1080 -9203 -15709 -16114 -25651 -20081 -7120 12103 819 -24217 -30031
4619 -30031 -35297 -50714 -39469 -26954 -14966 -27116 -33869 -23288 -11559 -12768 -15666 -11551 -4295
4606 -4295 6635 12368 22562 23749 12405 8279 9388 20791 17866 15042 1837 2458 10261 8891
4592 8891 3484 6260 -2858 -10615 -8390 -14168 -11294 -6788 -9562 -16119 -8840 -447 -4437 -7389 -6818
4577 -6818 -3518 -1019 645 4123 -10356 -20981 -44672 -39206 -18668 -13271 -7543 -18216 -12905 -2793
4563 -2793 920 -6084 -16046 -22542 -20565 -19485 -18432 -14168 -12285 -3847 9952 6657 -9905 -11397
4549 -11397 -18749 -42794 -29474 -9241 -15649 -13695 -13677 -17883 -17424 -22272 -18659 105 11546 7192
4535 7192 17367 12085 6942 -4861 -4966 -3297 1124 -1792 -13097 -33079 -26789 -27233 -34761 -34162 -22138
4520 -22138 -17045 -13021 -14368 -20719 -19019 -10716 -15177 -32363 -24709 -14386 -10760 -23525 -27369 -19636
4506 -19636 -5668 -6954 -24064 -20176 -3548 -10289 -9350 -15053 -29376 -31220 -31169 -18884 -7236 -6177
4492 -6177 4170 1829 -7352 -18791 -13407 4647 17842 21325 24152 15357 937 -14997 1624
4479 1624 7590 -1161 -18922 -3652 12345 11617 7492 11572 19798 14207 -987 10840 19322 6717
4465 6717 -5418 12956 22537 21157 14080 28701 28911 21230 11784 10201 21247 36148 28530 26396
4451 26396 17823 10213 8971 8548 -4956 -7981 2612 9897 6991 7696 5029 4262 -12011 -3614 4791
4436 4791 2705 -4638 -1657 -3122 6713 11536 24419 18315 -4403 -16228 -137 9140 8930 11221
4422 11221 14729 2975 6665 15297 1317 -4690 349 15546 4018 -11020 -11666 -1355 6917
4409 6917 9043 472 -11906 -18956 -11601 1233 10425 26597 14335 -1631 12114 28824 12741
4396 12741 -3698 -14471 -846 21616 34431 24309 10263 4863 8399 601 2537 9628 6292
4383 6292 9534 7696 13800 19995 19386 19262 10118 3081 -12150 -6802 11136 7890 1403 4084 2464
4368 2464 -6628 -2889 2521 12248 22406 16637 23238 16601 10546 -2000 -9435 -9944 -2952 2221 448
4353 448 11418 24369 17496 5993 16157 12485 9658 11896 23029 12914 7093 10271 8169 4524
4339 4524 -5412 -5155 3194 13223 -6321 -18749 -22375 -34006 -32938 -22808 -23700 -13000 -15150 -18878
4325 -18878 -9616 -10149 -5723 1012 14282 20073 21585 23788 16173 13281 -2894 -7548 -1457 -4647
4311 -4647 -3918 -12182 -18987 -21048 -19326 -27665 -33456 -20022 -28056 -33275 -14953 -3443 1812 -6875
4297 -6875 -6703 -1984 -409 -8832 -9770 -233 -13591 -21468 -559 22194 15989 7086 -9275 -7578
4283 -7578 4412 22977 25067 30798 39556 15962 5442 10520 21696 39632 31758 22631 12039
4270 12039 7284 -4005 -4646 5076 3095 -3007 4093 1846 5292 1631 11934 5703 2981 -3597
4256 -3597 -4859 5811 10156 10148 3879 -16469 -9551 7962 13073 9316 14033 6870 -7739 -4558 6550
4241 6550 23114 19132 9596 20032 21054 27891 29719 27444 26628 25312 25944 27687 21782 6679 12464
4226 12464 19037 15339 12085 4201 -17330 -19019 -11069 10516 15594 -2744 -5572 -20846 -20292 -13617
4212 -13617 -16975 -7392 4629 6361 6813 5661 1133 3426 13593 5913 -2774 -4133 -3206 -5524 -2589
4197 -2589 14038 -4046 -2211 -14209 -24247 -25127 -28316 -17980 -12012 -9563 -16380 -13852 -13696 -18954
4183 -18954 -1591 7337 15091 34011 31423 4872 13697 -339 -13992 -22069 -17063 -5145 15943
4170 15943 7497 -3085 -37024 -29249 611 17718 18960 15201 23171 25991 25671 28351 21650 18963
4156 18963 10340 -1922 -11351 -6468 8535 14784 21179 11153 2858 -1240 14391 9625 2549 5721
4142 5721 7108 6043 -6453 -9106 2153 18843 24628 33509 45573 24849 11023 10573 30876
4129 30876 22880 21967 39743 29848 27090 36441 27506 25905 5040 -8583 -23630 -12917 2649
4116 2649 12154 27718 16468 12831 18858 7193 8987 8718 12821 18760 22626 41887 51784 39920
4102 39920 30668 22976 -772 3647 22070 3636 623 10339 27975 25805 28105 34956 38188 22033
4088 22033 8165 2204 -4005 -4033 16364 26284 28950 19632 5505 7511 24460 34714 22352 11520
4074 11520 16167 25827 17442 19077 7647 -490 -3825 14464 14096 5421 11004 -2088 1781 6191
4060 6191 3133 -16376 -12418 -4273 609 -9982 -27133 -26352 -8010 -110 7444 12769 25385 24569
4046 24569 4043 5603 2034 -4008 6996 1805 5876 3979 -914 4025 18818 26214 19365 8224
4032 8224 18390 18452 21851 8058 -2057 -1514 3461 5815 17666 13546 13244 -1108 -12417 -4398
4018 -4398 -1177 12202 22651 24499 28314 23290 32147 27825 16418 12280 21364 16985 2688 -3580
4004 -3580 1505 2119 -6125 -3263 7680 20678 19122 4419 1268 -691 -9237 -14403 -26274 -14361
3990 -14361 883 4518 3931 -9531 -5697 5742 27534 22670 3145 8783 20146 22838 19142
3977 19142 12996 13769 15767 13831 15890 10949 14380 14323 10355 -6100 -4871 12647 2430 3452 20743
3962 20743 20757 6496 -1532 -7800 3454 -3085 688 -3245 -4535 -15775 -35492 -22614 11108 1299
3948 1299 -27892 -21662 -14634 -8963 -7362 -11187 1604 20042 30762 26956 19484 4459 -6251
3935 -6251 -18847 -20936 -25071 -10904 -14425 -21174 -5023 -3999 -4679 -6635 -3054 2980 10350 15387
3921 15387 15198 13390 11083 9099 17958 18428 24952 42384 58430 56570 50201 39890 37637 26575
3907 26575 17707 11492 11588 11719 18289 -3782 -747 13642 11337 8115 16826 23094 40349 44686 45879
3892 45879 37070 35894 26373 33170 28376 30459 7641 -23773 -34908 -23654 -18357 -11359 -11305 3246
3878 3246 34860 25625 -2414 -6451 7307 -3927 -7000 -14648 -13161 9400 25613 26535 11901
3865 11901 12030 4602 -14198 -14187 -6932 -2413 -3133 6647 7986 19907 27998 29395 14178 27811 14635
3850 14635 -12419 -14105 2232 5698 5028 6122 13246 27715 43859 40641 44878 51251 33162 21533
3836 21533 11905 1204 -10104 1147 21654 11370 11599 20615 20201 16959 18738 16580 32511 39571
3822 39571 20680 28021 45489 25316 9178 -1417 6167 3468 16065 21445 20724 26148 26764 24312
3808 24312 25426 15672 25488 25119 12360 3880 6504 19746 24866 25002 19241 8697 19617 26072
3794 26072 17005 9812 13582 17912 17885 15519 20053 22041 26176 26695 21917 -1196 -7432 13178 13103
3779 13103 17222 8575 -444 -11483 -35845 -32948 -13530 -11044 -5215 -2972 99 -10333 -1382 30933
3765 30933 44097 35929 38301 34836 28636 30876 28435 32884 18168 12044 8988 11138 11904 16140
3751 16140 13419 15474 1212 7001 31531 23903 17568 18460 22432 8441 4626 8744 9312 16239
3737 16239 12865 21215 36589 12880 119 13212 6023 -6097 -10788 -4756 444 9193 -1874
3724 -1874 2126 14011 -3165 235 -270 15092 19776 14970 13203 12787 32139 35158 35718 35670 26228
3709 26228 311 -12866 -15083 -15404 -16087 894 14759 1468 -1016 1294 13693 6160 694 1563
3695 1563 10458 11470 17211 13566 7438 11459 7663 -3658 -2663 4001 15586 20864 10291 -2679
3681 -2679 3599 -2817 -444 6665 -1622 3371 4573 11852 13588 12965 14949 13218 8688 13655 15446
3666 15446 21652 32425 45343 39136 31863 14473 7953 16999 25507 42915 36543 16700 11603
3653 11603 17024 11164 9330 19099 18794 2986 1814 17393 34403 55800 61390 43490 18368
3640 18368 10438 36881 44796 23377 11471 10030 20570 28693 30832 31558 35973 22747 21757 17972
3626 17972 13167 14462 17526 14977 11869 15023 9683 7477 12378 -4603 -916 7963 15650 23874
3612 23874 13813 18036 18360 6372 3584 16438 30485 40395 48693 30911 22447 22702 30293 30921
3598 30921 39183 30670 19922 18183 23805 18432 17741 15559 14698 18127 27150 28225 31207 20655 18925
3583 18925 6232 -3978 -3792 -3182 19780 22797 14750 7552 14218 24366 22611 32620 34948 35582
3569 35582 32332 27434 24484 18554 2634 2097 4294 12433 26996 40996 32041 32154 34613 40919
3555 40919 40640 39744 23218 20904 26135 17389 12415 -4766 -3608 28628 40021 33325 20764 18965
3541 18965 25395 26922 28176 21643 19174 18075 26097 26594 26045 29208 31983 39107 36963 24930 25227
3526 25227 31819 42973 46876 41467 30043 28180 25888 14722 24239 35219 29392 23566 16766 23471
3512 23471 26007 32020 21457 10642 2838 11784 10770 1575 12319 17300 27038 20855 28184 21136
3498 21136 18995 21546 10907 12556 22953 19081 -4445 -1706 8397 868 -1123 -982 -5874 -8381
3484 -8381 -15166 -14757 -9350 -12193 -14690 -8085 -399 9060 21914 33986 29061 16815 2171 -7979
3470 -7979 -16131 -18756 -22249 -481 1008 -3887 -4195 -14683 1135 13549 13231 6263 10536 12802
3456 12802 -5050 -11538 -140 29946 42183 57362 58752 44011 34795 32944 39251 26516 17000
3443 17000 19870 17043 3759 -5537 11969 23600 20607 9024 -4310 -10466 10254 23875 30617
3430 30617 32879 14786 18633 21885 35948 32906 12134 8291 13082 12870 18267 23329 16621 16740
3416 16740 9397 4126 9888 19211 15813 4506 -11333 -3170 -863 -5517 -9106 -5460 10138 24247
3402 24247 36420 33753 33477 19357 12168 20320 29357 14962 13786 9839 8558 -3118 3210 12217
3388 12217 18653 21139 22647 28808 32944 31904 38100 36618 29191 38780 33365 37951 32588 21059
3374 21059 26674 26310 37337 20804 5624 6988 -1609 7206 19158 25236 16646 16014 26962 24278
3360 24278 21301 12837 14971 15880 13348 19415 20446 9684 1808 -4995 -683 4771 21250 31579
3346 31579 14380 3595 7101 34338 39459 29167 22973 13523 17357 21617 4666 3796 6779 -15
3332 -15 -18846 -27292 -12067 -8079 13109 22476 16210 3959 7447 22466 14539 2636 386 -8522
3318 -8522 -65 1248 5324 9601 9132 10447 21240 21113 12969 5566 -6715 3171 1569 1146 -2865
3303 -2865 11051 19630 11593 14945 13103 13792 10558 12158 5113 25611 40733 40281 21097 19466
3289 19466 23482 2237 -2546 8396 9255 -4400 1032 14407 16093 18776 10419 -116 11345
3276 11345 28699 31266 19685 25713 30792 25251 18803 8879 7272 10630 13490 23464 29355 17386
3262 17386 7981 20775 30982 39117 33458 30301 2794 8319 8972 9510 22030 29780 25117 19751
3248 19751 21087 17057 14928 27870 36621 38996 31198 27489 30063 34728 34497 20600 10876 195
3234 195 874 -3640 -7204 4359 4309 7880 -8926 -20645 -13264 -18203 -21457 -21128 -3500 27981 25890
3219 25890 38732 37242 23931 -8069 -15157 -7226 3044 7528 17650 30652 29575 28642 25036
3206 25036 10533 11489 20445 33780 35309 23822 15645 16736 25029 14441 3351 1721 -4525 -10862
3192 -10862 -5767 -11113 -14354 825 6016 5854 7523 14229 23445 18142 10346 7402 1560 -4078 -6027
3177 -6027 -7829 -1200 15377 7445 12718 6556 6984 2981 -11678 -211 32784 36122 35963 25822
3163 25822 31225 27530 20679 13024 21301 26272 21636 12393 5300 202 15471 32774 37449 40951
3149 40951 26496 19631 24827 24962 24289 20172 21270 17389 5623 4188 16871 34870 30829 27012
3135 27012 25826 30286 32535 31660 22466 15023 -475 4694 6229 -9544 -17485 -6870 5070 4509
3121 4509 -5023 -6717 -501 -3022 -1869 -974 10358 10492 12002 22086 4392 -4168 -9949 4461
3107 4461 9443 1111 -9366 -6401 -12460 7360 19022 14644 9744 15500 -4247 -4668 -16342 -16242
3093 -16242 1062 12799 17542 23951 42456 53469 49424 55475 43978 43876 50177 40955 19390
3080 19390 7362 -5050 613 15497 17011 12664 -763 -8475 -7133 1973 19376 27775 16214
3067 16214 15298 14699 7488 4470 19259 19935 8793 -608 108 -16492 -13549 -10196 7647 36434
3053 36434 50418 33588 16515 9672 13267 13413 6590 16773 19500 14383 14386 6713 14375 22272 7024
3038 7024 -5866 -700 10095 17730 18035 27664 19084 7283 9804 12408 15760 22501 31778 21339
3024 21339 8798 8403 -1472 -4862 -4479 302 7194 6821 1365 1810 12865 6022 -14029 -10722 3699
3009 3699 9008 10579 15352 20953 30163 38925 47727 42189 32507 39610 23369 31827 32334 17314 2393
2994 2393 -9636 4588 20313 18135 8640 10379 18840 7299 11118 25038 18173 9521 -12214
2981 -12214 -14796 -9069 -542 5457 5397 3121 1873 8611 18131 14787 4863 5764 6604 15424 16550 11047
2965 11047 19933 32888 33117 41756 39240 34587 26074 29050 24811 30348 29061 29117 28040 19811 -3457
2950 -3457 -17486 -14427 140 -11377 -1455 9896 29592 40408 33674 27787 33311 41612 39897
2937 39897 17698 4712 7836 5254 822 9933 15293 19478 24131 21179 23852 16477 16793 14521
2923 14521 20879 38527 29191 16176 30868 43873 24876 5541 14034 24634 20026 27455 28377
2910 28377 11889 21663 23038 22025 19856 17636 18974 27360 32463 42830 40911 29121 14556 12831
2896 12831 16220 14440 3574 1666 18765 8877 -2994 -7827 -904 12459 4423 -9730 -12083
2883 -12083 -13682 -10523 -2219 14395 17491 17322 5654 -2140 16562 27163 14144 -743 1212
2870 1212 -6281 -4037 21577 8467 10977 21200 21356 4620 7286 25209 26051 35614 32889 24597
2856 24597 26624 16003 14593 6159 711 2759 11353 19357 20922 34358 42559 25856 23571 14033
2842 14033 7208 289 -4637 1008 16262 12448 22502 10866 4075 15428 15940 14589 16842 22104
2828 22104 34771 34338 21951 46978 67057 67869 64412 61464 50305 37709 18120 25495 29486
2815 29486 32770 36248 42281 31471 26483 36506 42140 47902 48000 32742 26687 24584 7669 -13841
2801 -13841 -13798 -8524 3395 5901 2018 8378 5696 6161 19757 15672 7178 2310 15621 10029 16825
2786 16825 12445 2238 -640 4691 12249 8909 29310 27528 24272 28735 37904 40377 20139 8035
2772 8035 -1876 7064 7309 13809 33111 33986 19383 19081 18312 3922 -6589 -37 19295 11546 19488
2757 19488 8398 8288 2610 7684 16646 11830 6361 2406 315 3906 4041 -26 -1888 32310 32616
2742 32616 2531 -8753 4931 -7654 -24133 -11504 5985 11210 11961 20418 20444 13081 10177 10764
2728 10764 -11433 -13967 13660 28346 39230 24644 -3059 3382 14380 26472 19162 13748 18404
2715 18404 8692 3181 15595 21096 8329 6642 17991 14233 9875 12591 -12408 -17771 -4704
2702 -4704 -11178 -14403 -3870 16714 20081 18242 15445 11641 14470 17419 10883 6290 10528 18308
2688 18308 9648 3895 3921 24451 22088 1402 -2154 -2869 2808 3254 -6438 -7234 18523 38300 20212
2673 20212 14761 24520 17715 15792 25839 17676 13930 17481 20389 7437 -1899 -6146 6419 5209
2659 5209 10823 25487 9671 -3320 9559 -305 -3492 -1407 5884 17524 21432 21403 23870 13548
2645 13548 13277 14399 3849 4785 22594 39783 41539 36944 31891 34233 34282 43861 40610 32785 18658
2630 18658 21239 27381 39084 45342 42907 32815 25317 4029 17591 39337 61219 54293 43444
2617 43444 37860 25165 31882 19352 24824 29955 33763 50266 55626 58981 38968 30599 38451 47138
2603 47138 46729 31804 28043 34971 42521 46487 56368 42571 26025 22161 25224 10568 -7775 -3822
2589 -3822 12044 24010 31736 34995 17120 -2758 -1759 10127 18275 21639 34098 37565 56173
2576 56173 68322 58963 24534 4046 -5030 -5700 577 3276 4320 9533 17036 27771 35396 20189
2562 20189 4911 11132 20233 10327 12013 15122 12611 7152 6249 11453 20521 23171 28853 18733
2548 18733 8908 5542 522 22070 29367 33661 30723 18275 18410 19638 20474 12266 12445 11238 -1143
2533 -1143 -9976 4643 12991 9184 14281 27618 16211 12947 21447 28058 18181 20424 18225 6965
2519 6965 7709 14681 11425 162 -5564 815 4017 3428 2328 6110 14467 12774 21646 6045 -11600
2504 -11600 -11019 -6564 -7449 5434 14059 7054 -9102 -14273 -10814 -951 1879 4255 5447 13483 15869
2489 15869 12411 -1314 8491 21508 25783 26378 29173 31004 34856 28573 20988 22549 28646 20232
2475 20232 7120 -4152 -12769 14606 34584 26375 19250 5098 -6245 -5346 -1659 6284 3062
2462 3062 -11980 -10488 -2718 1385 364 9754 12944 10783 8247 333 610 -2331 4314 5075 3722
2447 3722 6033 -11299 -11091 -2106 17755 20671 32295 46090 45144 46701 47220 33194 28247 20321
2433 20321 19633 30528 26134 19801 27259 25673 21803 28512 19261 -743 -8579 -14518 -27570 -25651
2419 -25651 2672 28257 18238 16425 16671 7965 484 2615 -4683 -8183 12963 28395 35474 8381
2405 8381 -5299 -8240 -7509 -1926 -3510 12740 18843 21607 19799 16170 501 -4952 8538 3161
2391 3161 -3607 -3792 13609 29955 29533 22980 37411 41270 44508 43383 31032 15992 3555 -6780
2377 -6780 -834 -11058 -3015 -1377 7381 21811 29585 25294 28877 18953 15229 24389 32776 35107
2363 35107 37547 41732 37690 24554 9492 19316 30423 23303 15717 15877 8297 1195 6757 5139
2349 5139 20400 35688 28670 16174 27912 33988 17719 13794 12832 20727 46149 38689 32004 23584
2335 23584 10087 14383 20006 24523 12335 1515 2310 21855 32649 23942 6109 8089 23369
2322 23369 22642 23580 32257 30237 23210 15875 15322 5161 3210 10572 11494 13787 23432 15938 8493
2307 8493 14580 25022 16084 -10982 -12397 2352 -11064 -17567 -24488 -16979 -4328 -18632 -32214
2294 -32214 -30077 -12886 2363 18473 20114 5386 3500 -6006 -18155 -19534 -18444 -22747 -13201
2281 -13201 3919 5240 9954 9167 124 7022 24588 27697 22059 25320 14152 -9002 4334 24824
2267 24824 27553 30848 30362 43547 35190 14467 -1608 -2161 2952 9400 -2452 5533 21544 29440
2253 29440 22238 15223 25937 26528 14439 9195 12025 10790 15927 27458 39739 39800 32879 27167
2239 27167 15011 711 -1798 8295 4225 10407 23409 17717 26155 37600 43727 30215 19185
2226 19185 9285 8084 6805 4061 23690 32581 35288 30956 32740 20673 3618 11775 24669 29318
2212 29318 25912 22118 23673 31793 18806 2479 2010 -2918 2494 19088 20361 11267 8910 29050
2198 29050 21834 5068 -5880 -10258 -21633 -18649 -1720 22666 15831 14707 31989 25972 13689
2185 13689 14052 32660 23964 9679 11708 14890 32442 41120 40696 20762 25968 14471 7035 21205
2171 21205 33353 24294 21221 17744 16050 29001 41378 44871 25770 29660 40252 32437 20981
2158 20981 2863 2356 3281 6913 3845 386 -1075 -5281 5324 3568 3042 5227 9068 23538 53620
2143 53620 69755 68002 54993 49027 60027 60217 58899 28067 -11010 -23820 -23737 -13739 12458 11878
2129 11878 4384 11902 22053 15905 18357 14943 10377 5675 7878 18300 37451 44522 43313 49860
2115 49860 56486 56285 50557 24073 18178 20418 39570 37383 7976 521 5543 6829 11201 7559
2101 7559 -8218 -6229 6190 19459 7466 8901 22066 13390 13464 9196 11927 15088 9353 -5150
2087 -5150 -19627 -22681 -17850 -5188 -36 2587 6643 9088 -437 5915 5173 -8247 -1322 15211
2073 15211 12463 -8246 -10733 -4578 -7845 -12901 -23283 -17381 -13526 -8603 -6668 -6706 6701 19139
2059 19139 -5500 -5070 -13782 -16729 -8646 -11189 -13502 830 13578 14414 24733 25624 25823 15972 215
2044 215 -14444 -6643 -955 6380 23963 36469 20200 -535 7081 5458 10695 9435 15739 27995
2030 27995 30210 29008 41395 37654 20425 -6594 -3535 -5073 -2418 -492 -2610 -760 -4559 -1193
2016 -1193 -1497 -1528 -4791 -5324 -15314 -1977 22739 36338 32268 23006 17200 17357 23658 26276 26206 19555
2000 19555 22032 9929 12469 10817 1825 -5230 2035 16145 17202 10187 -92 3194 -1935 -14164
1986 -14164 -33951 -25609 -8501 1107 4389 6733 13374 13517 20732 23815 13713 -3125 5070 12973
1972 12973 9615 -4289 -3192 10531 18408 9188 14267 15118 14628 10091 991 -11206 -5381 -9468
1958 -9468 -15677 -13626 11346 22165 22443 6202 -1744 -6464 -3311 18240 14065 2729 33227 28200
1944 28200 10365 21536 20186 11785 7739 11551 5699 1936 4770 -7161 -3322 17202 14987 5700
1930 5700 7279 1505 -4905 -5772 -5993 -220 291 6029 4511 2401 -819 16660 21084 4050 7431
1915 7431 14039 9127 -1801 -15682 -28489 -31113 -17227 3988 6940 2011 4357 7589 -14479
1902 -14479 -15419 12063 16947 5268 4286 7304 9655 8336 1966 -2181 -1226 -21823 -21546 1863 7067
1887 7067 14346 14386 15525 12610 14725 5752 7268 15979 8894 -10536 -20696 -1059 -6079 -10312 4784
1872 4784 -674 -4767 -7854 -12616 -9351 -5169 8016 21737 21643 24105 -3963 -1202 28727 32832
1858 32832 7164 -6026 -174 -415 4592 21883 13770 7410 12115 21734 18510 8085 1010 3253
1844 3253 -985 -6746 -1300 26597 38489 25252 -4004 -8750 -6852 -19689 -46062 -26384 -6294
1831 -6294 -10279 -23851 -14383 -28928 -41158 -27490 -11241 -7689 -14545 -13971 -1834 4261 6933 12655
1817 12655 11144 -3493 -9369 -4717 8356 -745 -8263 4866 11323 10010 7832 -3581 -15333
1804 -15333 -20259 -11085 -22518 -39688 -24605 -15336 -30349 -19301 9010 27490 22824 14616 2303
1791 2303 11542 30868 32170 20353 20947 11261 -3031 4133 10709 20802 29550 29655 18884 13520
1777 13520 13113 -1064 -1119 15169 16054 11788 30265 16451 5683 13619 25079 28002 7775 -13882
1763 -13882 -20680 -1049 18895 33588 16828 -3127 -20471 -15417 -11979 -14289 -23113 -20973 -13566
1750 -13566 -23905 -12710 -3679 -8909 -6339 -13469 -25621 -37996 -39463 -30559 -11590 -2516 5044
1737 5044 4459 -9556 -17784 -2174 5150 -8311 1452 4523 -7486 -869 -2493 -12671 -6061 -6570
1723 -6570 1149 -18859 -33039 -17555 6661 29357 38500 37065 39162 40426 26525 20792 17044
1710 17044 23184 17824 16490 8449 2806 683 -10733 -24865 -37275 -39816 -33410 -30986 -16159 5423
1696 5423 13679 3151 -11181 -8064 -1820 -11756 -17437 -27341 -34152 -27685 -25418 -20982 -13920 -9872
1682 -9872 -9125 -13277 -33525 -41300 -41021 -32307 -15400 4627 8128 10807 21206 12765 -458 7019
1668 7019 -4891 -282 11659 25063 31863 29826 25890 16351 328 -13094 -13586 -6450 -1648 2066
1654 2066 3768 -5078 5708 18968 14425 9527 1524 3728 10886 18021 21222 405 -10868 -18074
1640 -18074 -15484 -10318 -15857 -11949 -6925 3856 220 -414 5006 -4454 -19464 -22236 -35135 -25354
1626 -25354 -16575 -16073 -22386 -14346 -1402 8718 10795 20712 13354 -3045 -6505 -17245 -16945 2640
1612 2640 -9264 -21737 -12760 -937 3427 -15304 -29161 -31452 -30064 -21181 -15726 -24109 -17941 134
1598 134 -1442 -18188 -21541 -27681 -14309 -20205 -13009 -5863 -6929 -11244 -11360 -9675 -9777 1478 8483
1583 8483 6800 -6064 -8701 -155 2402 -135 5986 -9153 -4577 19128 20404 -856 6129 13844
1569 13844 11771 6156 -18583 -38291 -39780 -23367 -13312 -10573 -15699 -37088 -38535 -28773 -24969
1556 -24969 -12774 -3631 3195 14629 -2408 -25928 -28350 -19858 2626 -964 -3225 -3382 2822 4184
1542 4184 -70 -13940 -33748 -29938 -19882 -16915 -14599 -24443 -27304 -32894 -43574 -31867 -34032 -16308
1528 -16308 1827 2725 6429 -8326 -13221 -8778 -12914 -20189 -9474 -7055 -11282 -11452 -4754 3089
1514 3089 14959 19102 15548 21966 21089 24289 21641 9601 825 -6367 -6288 3861 9081 1205 1324
1499 1324 7440 10108 19064 5866 6861 10418 5442 18280 28540 14358 18707 21621 12640 18094
1485 18094 9936 -1169 -7223 -4751 -15037 -26834 -20011 -16744 -13054 -11808 -2980 5390 765 15324
1471 15324 10204 -1514 -5670 -8222 3270 1853 -3163 -18814 -16277 -3182 4450 -2294 -24029
1458 -24029 -26797 -29302 -27760 -24425 -3940 14541 -4284 -21718 -30579 -26576 -17408 -9869 -4563 -3700
1444 -3700 -1660 9132 6146 4266 4924 -8449 -15716 -5534 3824 -8156 -22162 -32009 -35449 -20651
1430 -20651 -17563 -19916 -19791 -11335 -7636 -13242 -16615 -4417 3938 10729 18464 14221 7349 1949 -12366
1415 -12366 -21716 -30727 -15715 4461 20734 34431 38795 20647 12101 21084 29006 13613 -6088
1402 -6088 -12138 -18282 -3688 -3179 -8874 -15520 7963 19716 22964 21480 29224 22025 -3234 -12073
1388 -12073 -11679 -8102 -4722 -11666 -15735 -27845 -9635 3466 -1414 897 10902 15831 -6596 -23636
1374 -23636 -12986 -14821 -26734 -14783 -8986 -7873 -7529 -19770 -15011 -9754 -24183 -32861 -26742 -35246
1360 -35246 -34136 -33907 -20101 -13460 -17087 -22856 -23189 -37155 -36909 -20346 -9800 -8928 1665 -16276
1346 -16276 -27134 -42763 -46202 -31594 -26045 -22791 -28657 -26281 -13247 -10264 -19753 -36125 -44300
1333 -44300 -39245 -22609 -14965 -20341 -29420 -18220 -9205 -9322 -19815 -7273 -289 -2954 -9699 -21347
1319 -21347 -21399 -33928 -37979 -29266 -32073 -48987 -40023 -27093 -17997 -23362 -28316 -7517 -6769 -13017
1305 -13017 -18567 -21207 -32575 -38311 -32057 -33631 -30416 -22688 -26801 -36391 -39644 -40722 -40780 -35826 -42489
1290 -42489 -28945 -22177 -38561 -54279 -34779 -15904 -264 1625 -3962 -5592 -4158 9834 14116
1277 14116 3022 -11006 -14565 -11692 -5114 -6166 -18906 -15239 -12912 60 6804 4049 -7808
1264 -7808 -9835 -1234 -502 -1316 -8588 -13906 -15405 -16735 -5662 5061 7230 4105 11799 -42 -25134
1249 -25134 -28476 -22384 -22643 -20270 -27554 -25631 -23617 -18314 -10020 -3400 -13058 -18420 -32961 -49705
1235 -49705 -36357 -15548 -18365 -19194 2505 7374 6451 8791 -1848 -9803 -18518 -6494 9244 11039
1221 11039 8144 -10264 -4215 -7978 2611 6766 9168 22161 27228 13873 -9735 -12743 -14922
1208 -14922 -29137 -29131 -21728 -25723 -42891 -38695 -28487 -9216 10630 19597 -11898 -34018 -44382
1195 -44382 -31138 -14391 -16442 -18379 -9070 -6727 -1179 6215 14713 9647 -9 -9637 -5931 -7668
1181 -7668 -14982 -10473 -7616 5097 807 346 -3320 1407 -2728 -12094 -18763 -19400 -23816 -14426 -24336
1166 -24336 -37186 -44786 -40713 -43824 -48486 -31371 -24423 -33930 -44469 -43347 -35522 -18074 -16535 -30103
1152 -30103 -52144 -46465 -50488 -56482 -45167 -38886 -37915 -38737 -18157 -4748 -18287 -22107 -28053 -19342
1138 -19342 -6898 -8197 -12278 -29814 -39838 -35535 -25451 -33730 -48858 -31215 -19411 -25467 -27702
1125 -27702 -19078 -22854 -20661 -23455 -11136 -12354 -14313 -33616 -30447 -25279 -30460 -34551 -35051 -34521 -37341
1110 -37341 -50582 -39438 -23258 -2390 -5637 -15091 -18846 -4883 -13100 -17041 -10201 -9401 -11369 -14028
1096 -14028 -16972 -24583 -25281 -24524 -29867 -39624 -39183 -37147 -36097 -24583 -27090 -24671 -17460 -9908 -17101
1081 -17101 -28379 -17568 -8859 -15290 -2565 3018 -1771 9403 3269 -13583 -37120 -48559 -43404
1068 -43404 -40806 -29909 -33594 -32737 -27358 -27213 -30576 -25129 -29810 -27944 -26897 -17615 -23939 -39786 -34783
1053 -34783 -33888 -33310 -31693 -19750 -9939 -3481 -31806 -45411 -33444 -26259 -18799 -6172 -13597 -13250
1039 -13250 5010 -8048 -13879 -17571 -21021 -26130 -29633 -37557 -41355 -59675 -55159 -45684 -39144 -25792
1025 -25792 -16732 -20830 -21263 -23295 -27111 -29679 -24509 -18282 -8102 -6715 -9490 -14181 -19328 -31266
1011 -31266 -37356 -29168 -25471 -15635 -16214 -18623 -22729 -23632 -18846 -10775 -15809 -18766 -8246 8088 -1117
996 -1117 -22000 -27324 -23404 -27218 -21029 -14799 -16131 -35629 -40478 -45949 -39029 -32571 -25701 -29652 -22974
$$ [...]
##END NTUPLES=NMR SPECTRUM
##END=
