##TITLE=Analysis number 319696
Compound Code cc 29940
Project Code adrs
Chemist Name endeavour
##JCAMPDX= 6.0         $$ Bruker NMR JCAMP-DX V2.0
##DATA TYPE= NMR SPECTRUM
##DATA CLASS= NTUPLES
##ORIGIN= Bruker BioSpin GmbH
##OWNER= nmr
$$ XWIN-NMR		Version 3.5
$$ Wed May 24 13:44:45 2006 GMT Daylight Time (UT+1h)  MAYBRIDGE\nmr@NMR_250MHZ
##.OBSERVE FREQUENCY= 250.131544655141
##.OBSERVE NUCLEUS= ^1H
##.ACQUISITION MODE= SIMULTANEOUS (DQD)
##.ACQUISITION SCHEME= undefined
##.AVERAGES= 16
##.DIGITISER RES= 18
##SPECTROMETER/DATA SYSTEM= dpx250
##.PULSE SEQUENCE= zg30
##.SOLVENT NAME= CDCl3
##.SHIFT REFERENCE= (INTERNAL, CDCl3, 0, 16.522)
##AUDIT TRAIL= $$ (NUMBER, WHEN, WHO, WHERE, WHAT)
$$ ##TITLE= Audit trail, XWIN-NMR		Version 3.5
$$ ##JCAMPDX= 5.01
$$ ##ORIGIN= Bruker BioSpin GmbH
$$ ##OWNER= nmr
$$ C:\u/data/dgb/nmr/ADRS/5120/pdata/1/auditp.txt
$$ ##AUDIT TRAIL=  $$ (NUMBER, WHEN, WHO, WHERE, WHAT)
(   1,<2006-05-24 13:44:04.58 +100>,<MAYBRIDGE\nmr>,<NMR_250MHZ>,
      <created by zg, POWCHK disabled, PULCHK disabled
       configuration hash MD5:
       84 BC 41 DB A1 6E 1D 46 DA 25 12 A5 C1 ED C5 3A
       data hash MD5: 64K
       F2 11 49 92 7A 96 C5 37 F2 71 F8 7F 46 89 9F 44>)
(   2,<2006-05-24 13:44:21.33 +100>,<MAYBRIDGE\nmr>,<NMR_250MHZ>,
      <Start of raw data processing
       ef LB = 0.3 FT_mod = 6 PKNL = 1 SI = 32K 
       data hash MD5: 32K
       FB 93 17 0E FD 20 CD 01 1E 2E E8 51 56 3A 4D 83>)
(   3,<2006-05-24 13:44:27.58 +100>,<MAYBRIDGE\nmr>,<NMR_250MHZ>,
      <apk 
       data hash MD5: 32K
       CB 91 66 41 33 96 70 B3 F4 24 82 7F 72 EE AC 8E>)
(   4,<2006-05-24 13:44:29.43 +100>,<MAYBRIDGE\nmr>,<NMR_250MHZ>,
      <abs ABSG = 5 
       data hash MD5: 32K
       2A 37 0C 53 90 72 0B A7 9E FB E0 F8 45 48 B4 D6>)
$$ ##END=
$$ 
$$ hash MD5
$$ 6A 1E 94 9F B6 4F AF B6 CB 9B 40 38 AE 4B D2 CF
##$RELAX= 
##$RELAX= 
##$RELAX= 
##$RELAX= 
##$RELAX= 
##$RELAX= 
##$RELAX= 
$$ Bruker specific parameters
$$ --------------------------
##$DU= <C:\u>
##$EXPNO= 5120
##$NAME= <ADRS>
##$PROCNO= 1
##$TYPE= <nmr>
##$USER= <dgb>
##$AMP= (0..31)
100 100 100 100 100 100 100 100 100 100 100 100 100 100 100 100 100 100 
100 100 100 100 100 100 100 100 100 100 100 100 100 100 
##$AQSEQ= 0
##$AQ_mod= 3
##$AUNM= <au_zg>
##$AUTOPOS= <34 >
##$BF1= 250.13
##$BF2= 250.13
##$BF3= 250.13
##$BF4= 250.13
##$BF5= 500.13
##$BF6= 500.13
##$BF7= 500.13
##$BF8= 500.13
##$BYTORDA= 1
##$CFDGTYP= 0
##$CFRGTYP= 5
##$CHEMSTR= <none>
##$CNST= (0..31)
1 1 145 1 1 1 1 1 1 1 1 1 1 1 1 1 1 1 1 1 1 1 1 1 1 1 1 1 1 1 1 1 
##$CPDPRG= <>
##$CPDPRG1= <>
##$CPDPRG2= <>
##$CPDPRG3= <>
##$CPDPRG4= <mlev>
##$CPDPRG5= <mlev>
##$CPDPRG6= <mlev>
##$CPDPRG7= <mlev>
##$CPDPRG8= <mlev>
##$CPDPRGB= <>
##$CPDPRGT= <>
##$D= (0..31)
0 1 0 0 0 0 0 0 0 0.06 0 0 0 0 0 0 0.0002 0 0 0 0 0 0 0 0 0 0 0 0 0 0 
0 
##$DATE= 1148474642
##$DBL= (0..7)
120 120 120 120 120 120 120 120 
##$DBP= (0..7)
150 150 150 150 150 150 150 150 
##$DBP07= 0
##$DBPNAM0= <>
##$DBPNAM1= <>
##$DBPNAM2= <>
$$ [...]
##$SUBNAM7= <"">
##$SUBNAM8= <"">
##$SUBNAM9= <"">
##$SW= 20.6930455092707
##$SWIBOX= (0..15)
0 0 3 0 0 0 0 0 0 0 0 0 0 0 0 0 
##$SW_h= 5175.983436853
##$TD= 65536
##$TD0= 1
##$TE= 294.16
##$TE2= 300
##$TE3= 300
##$TEG= 300
##$TL= (0..7)
0 120 120 120 120 120 120 120 
##$TP= (0..7)
150 150 150 150 150 150 150 150 
##$TP07= 0
##$TPNAME0= <>
##$TPNAME1= <>
##$TPNAME2= <>
##$TPNAME3= <>
##$TPNAME4= <>
##$TPNAME5= <>
##$TPNAME6= <>
##$TPNAME7= <>
##$TPOAL= (0..7)
0.5 0.5 0.5 0.5 0.5 0.5 0.5 0.5 
##$TPOFFS= (0..7)
0 0 0 0 0 0 0 0 
##$TUNHIN= 0
##$TUNHOUT= 0
##$TUNXOUT= 0
##$USERA1= <user>
##$USERA2= <user>
##$USERA3= <user>
##$USERA4= <user>
##$USERA5= <user>
##$V9= 5
##$VALIST= <valist>
##$VCLIST= <CCCCCCCCCCCCCCC>
##$VD= 0
##$VDLIST= <DDDDDDDDDDDDDDD>
##$VPLIST= <PPPPPPPPPPPPPPP>
##$VTLIST= <TTTTTTTTTTTTTTT>
##$WBST= 1024
##$WBSW= 4
##$XGAIN= (0..3)
0 0 0 0 
##$XL= 0
##$YL= 0
##$YMAX_a= 592912
##$YMIN_a= -480183
##$ZGOPTNS= <>
##$ZL1= 120
##$ZL2= 120
##$ZL3= 120
##$ZL4= 120
##$ABSF1= 16.522
##$ABSF2= -4.171173
##$ABSG= 5
##$ABSL= 3
##$ALPHA= 0
##$AQORDER= 0
##$ASSFAC= 0
##$ASSFACI= 0
##$ASSFACX= 0
##$ASSWID= 0
##$AUNMP= <proc_1d>
##$AZFE= 0.1
##$AZFW= 0.1
##$BCFW= 0
##$BC_mod= 0
##$BYTORDP= 0
##$COROFFS= 0
##$CY= 12.5
##$DATMOD= 1
##$DC= 0
##$DFILT= <>
##$DTYPP= 0
##$F1P= 14.0000005364418
##$F2P= -0.99999901652339
##$FCOR= 0.5
##$FTSIZE= 32768
##$FT_mod= 6
##$GAMMA= 0
##$GB= 0
##$INTBC= 1
##$INTSCL= 1
##$ISEN= 128
##$LB= 0.3
##$LEV0= 0
##$LPBIN= 0
##$MAXI= 10000
##$MC2= 0
##$MEAN= 0
##$ME_mod= 0
##$MI= 0
##$NCOEF= 0
##$NC_proc= -5
##$NLEV= 6
##$NOISF1= 0
##$NOISF2= 0
##$NSP= 0
##$NTH_PI= 0
##$NZP= 0
##$OFFSET= 16.522
##$PC= 1
##$PHC0= 27.11842
##$PHC1= -9.751656
##$PH_mod= 1
##$PKNL= yes
##$PPARMOD= 0
##$PSCAL= 4
##$PSIGN= 0
##$REVERSE= no
##$SF= 250.13
##$SI= 32768
##$SIGF1= 0
##$SIGF2= 0
##$SINO= 400
##$SIOLD= 32768
##$SREGLST= <1H.CDCl3>
##$SSB= 0
##$STSI= 32768
##$STSR= 0
##$SW_p= 5175.98343685301
##$SYMM= 0
##$S_DEV= 0
##$TDeff= 65536
##$TDoff= 0
##$TI= <Analysis number 999999
Compound Code 99
Book Reference 9
Project Code 9>
##$TILT= no
##$TM1= 0
##$TM2= 0
##$TOPLEV= 0
##$USERP1= <user>
##$USERP2= <user>
##$USERP3= <user>
##$USERP4= <user>
##$USERP5= <user>
##$WDW= 1
##$XDIM= 32768
##$YMAX_p= 473122902
##$YMIN_p= -152013
$$ End of Bruker specific parameters
$$ ---------------------------------
##NTUPLES= NMR SPECTRUM
##VAR_NAME=  FREQUENCY,     SPECTRUM/REAL,   SPECTRUM/IMAG
##SYMBOL=    X,             R,               I
##VAR_TYPE=  INDEPENDENT,   DEPENDENT,       DEPENDENT
##VAR_FORM=  AFFN,          ASDF,            ASDF
##VAR_DIM=   32768,         32768,           32768
##UNITS=     HZ,            ARBITRARY UNITS, ARBITRARY UNITS
##FACTOR=    0.157963299565203, 1,           1
##FIRST=     4132.6476996994, 0,             0
##LAST=      -1043.33573715361, 0,           0
##MIN=       -1043.33573715361, -152013,     0
##MAX=       4132.6476996994, 473122902,     0
$$ Real data points
##PAGE= N=1
##DATA TABLE= (X++(R..R)), XYDATA
$$ [...]
17023a9335j561K4492Q281m796P291j112j2689L070P987P757p919J9280N207J110
17009C7063q199O49j7082L232K0276j3049j3988j5099k4588Q650p536Q184j3232
16996c4719j4579K937K6257P362j9317j298J0617P084r053P69K2530J4600j0423
16983B767P206P088j9522l5k9245l0135J2672N986J3085J3257J0459m656q254
16970a9327m695L3642J05P74J5024K021p130k1579o82j805j2777j9144k4635P359
16956e2849M3767K0489L35j326N851J4956m323k239j1705j7519L449J410l2726
16943c2430p262J6549J1900J1100M165J1395j1737l3656o567J4365J9224r032
16931a1986k8703J8105J8707k5691N619n945N748j592Q026m670K1312K5616P948
$$ plain form
17023 -19335 -20896 3596 11877 7081 14372 13260 571 3641 11628 19385 11466 30746 35953 37063
17009 37063 28864 29513 12431 15663 35939 22890 8902 -6197 -30785 -22135 -29671 -21487 -34719
16996 -34719 -49298 -46361 -20104 -12742 -32059 -33357 -22740 -15656 -24709 -23940 -1410 13190 2767
16983 2767 9973 17061 -2461 -2496 -31741 -61876 -49204 -43218 -30133 -16876 -6417 -11073 -19327
16970 -19327 -24022 9620 9725 10499 25523 27544 20414 -1165 -1847 -3652 -16429 -35573 -60208 -52849
16956 -52849 -9082 11407 11742 10416 16267 31223 26900 24661 12956 -4563 -1114 296 -32430
16943 -32430 -39692 -23143 -11243 -143 4022 15417 3680 -29976 -36543 -22178 -2954 -11986
16931 -11986 -40689 -22584 -3877 -29568 -23949 -29894 -24146 -25738 -17712 -22382 -1070 24546 32494
16918C2494j1577j7627j2381m915N325N858k3136Q9J7409J1167J7139k0694k5544
16905b6393N856J3988Q563p648k2969L978R186J7357J4465K4712K863j9798j7060
16892G100k396P395J0977j479j6483k022O706k2559j9662K1523o634O250l833
16879a5117L5345J1222l6752k6175l663Q850J5456J0330J56J2386k486L43j2933
16866c038m375l590L214k3252K505K4030j7361j952J6943j7678j7379N207J2641
16853b4085j3969J3611J5480K70L555j1205k6174L699L3104K4440O509Q048k1349
16840A1934k8749k191k17J6507N170j9512j1083R842n730q549J7478o86J5673
16827a13K602l987J4747m503O550m561n854J8562J453p995l412J1004k3696o782
$$ plain form
16918 32494 20917 3290 -9091 -14006 -8681 -2823 -25959 -25870 -8461 2706 19845 -849 -26393
16905 -26393 -20537 -6549 2014 -5634 -28603 -24625 -15439 1918 16383 41095 43958 24160 7100
16892 7100 4704 12099 23076 21597 5114 3092 9798 -12761 -32423 -10900 -17534 -11284 -15117
16879 -15117 20228 31450 -5302 -31477 -35140 -26290 -10834 -504 -348 12038 9552 9895 -3038
16866 -3038 -7413 -11003 -7789 -31041 -28536 -4506 -21867 -23819 -6876 -24554 -41933 -36726 -24085
16853 -24085 -38054 -24443 -8963 -8693 -5138 -16343 -42517 -38818 -5714 18726 25235 33283 11934
16840 11934 -16815 -19006 -19223 -2716 2454 -17058 -28141 -18299 -24029 -32578 -15100 -15786 -113
16827 -113 2489 -1498 13249 8746 15296 10735 4881 23443 24896 16901 13489 24493 797 -5985
16813e985J7290m338J0018O503O343p634q305Q175M525k5342k1898o054j015K702
16799b5015Q427j605K1263J1321q053k1196K80P402r726K097J1927O223j0991
16786g646o404m155k1453M693J0395l825k3818m944L1704N031J1196o829J0011
16773f044j6633j1688r116J0642L1036J3337j722J8388O057j4270p994O313K0535
16760C8841k826l659j9335r319O320o715J0287J333m057p015M973j0803k8657
16747c0632O517m893O077J1263n478k9551j8312Q059L5516L0263q139J207J8188
16734B0085j500l8950j6413K3602J5119Q915R538k9278l4446J793J4305j3638
16722d0868n006K8175K1969O947j4231Q273J4916k5533k7985K2827N7315J042
$$ plain form
16813 -5985 11305 6967 16985 23488 29831 22197 13892 22067 26592 1250 -20648 -26702 -27717 -25015
16799 -25015 -16588 -18193 3070 14391 6338 -14858 -14578 -7176 -16902 -14805 -2878 3345 -7646
16786 -7646 -14050 -18205 -39658 -34965 -24570 -28395 -52213 -57157 -25453 -20422 -9226 -16055 -6044
16773 -6044 -22677 -34365 -43481 -32839 -1803 11534 9812 28200 34257 19987 11993 18306 38841
16760 38841 36015 32356 13021 3702 10022 3307 13594 14927 10870 3855 8828 -1975 -30632
16747 -30632 -24115 -29008 -22931 -11668 -17146 -46697 -65009 -56950 -21434 8829 690 1897 20085
16734 20085 18585 -20365 -36778 -13176 1943 10858 20396 -8882 -43328 -41535 -27230 -40868
16722 -40868 -45874 -17699 4270 11217 -3014 5259 20175 -5358 -33343 -10516 46799 47841
16710D7841j1583k1416k1220J7761J1874J209r807r689J1139k904j8135j6131
16698b1061j1548k6938J0577M088K7655K1908P751j4764m1572p961M5861L7637
16686C1633j5225k1457K3747K3658k657P357Q167j7330m298J2641j828j6790J0511
16673C8129j0588k0512O454j67K358k7966j294J2292J5123J4464Q988k9699l3932
16660b6350j9982K3951J9467m115K2537K7822m2485k8286J7258J5902J3520q159
16648A1080p896o947j4695j3032j5907J4643J5809k110N344J8091k362k897J087
16635B08N557J5798m336p029j2153P548l75n213J4956M859m3210j2314J7009J3516
16621e179Q36l476Q909l6201j7020N908L5115J1577J4029j9692p490j0413N88
$$ plain form
16710 47841 36258 14842 -6378 11383 23257 24466 14659 4970 16109 13205 -4930 -21061
16698 -21061 -32609 -59547 -48970 -44882 -17227 4681 12432 -2332 -43904 -51865 -6004 31633
16686 31633 16408 -5049 18698 42356 39699 47056 55223 37893 33595 46236 44408 27618 38129
16673 38129 27541 7029 13483 13316 15674 -12292 -13586 -1294 13829 28293 37281 7582 -26350
16660 -26350 -46332 -22381 -2914 -7029 15508 43330 845 -27441 -10183 5719 19239 11080
16648 11080 3184 -3763 -18458 -31490 -47397 -32754 -16945 -19055 -13711 4380 2018 -879 208
16635 208 5765 21563 17227 10198 -1955 5593 5218 5 14961 19820 -23390 -35704 -18695 -5179
16621 -5179 -4343 -7819 1090 -35111 -52131 -46223 -11108 469 14498 -5194 -12684 -23097 -22509
16608b2509n004k6046J283K5336M057K5893J0205K218m908N853N990j9890k3024
16595b0546j9924K0446J5224J88r922j4233L261l189J646L2674q2l006K7019J0158
16581C9714j0149j5286J433m553l2017m830J8094J3613J9820j278l586k6838j4310
16568b0173j7514J1270J9863K4301N451l418m084J0981J2742r303l2274m129K3184
16555A6897M572j128o118k6424J7463J3331O14j2888k5273P679L0328K0315l700
16542C5668k584j4535j5135J3668L511l6766K532Q498J3805M805j6432J677O714
16529E426P314L527o087J2740K770j3091k143L875m210m93J5810l972p328k1264
16515g126j901N340l215N940j759J3861j271j4864J9243J078k90J0016o40l0612
$$ plain form
16608 -22509 -27513 -53559 -52276 -26940 -22883 3010 13215 15433 10525 16378 22368 2478 -20546
16595 -20546 -40470 -20024 -4800 -4612 -14534 -28767 -25506 -28695 -27049 5625 5543 2537 29556 39714
16581 39714 29565 14279 15712 11159 -20858 -25688 -7594 6019 25839 24561 20975 -5863 -20173
16568 -20173 -37687 -26417 -6554 17747 23198 19780 15696 26677 39419 30116 -2158 -6287 16897
16555 16897 21469 20341 14223 -12201 5262 18593 19207 6319 -18954 -11275 19053 39368 35668
16542 35668 33084 18549 3414 17082 20593 -16173 -13641 -5143 8662 13467 -2965 -1288 5426
16529 5426 12740 16267 10180 22920 25690 12599 10456 14331 10121 9628 25438 21466 14138 -7126
16515 -7126 -9027 -3687 -6902 -962 -2721 11140 9869 -4995 14248 15326 15036 25052 24412 -6200
16501f200l1873P617K1028p108%K1154j1507j7622N458R206K898N455j4887j198
16487a7579k299p191K1839K402p150N694N851L024o586K5343j7333j2138j4096
16474b0219O00K4537k7013n840L5509L3693m698j1888o576K179J94k340j0758
16461G380o796j2549K79J7057N21j6514l7301J737K3511K6709N945j0554R316
16448H741K407K131J4490O150l5309Q18j602J0285o141Q187L337o430k470j4557
16434i963q388P242k018k261P529O18Q948j5636r188Q543J8358j2634J1606J7992
16420B0748J060j3550j7988R379K994j5359j0388J8940K3734r142M684k094J5542
16407B8560k788k1514l426J6880j6973l581Q932j4621j2227j226L5019J5775p74
$$ plain form
16501 -6200 -38073 -30456 -9428 -16536 -16536 4618 -6889 -24511 -19053 -9847 -6949 -1494 -16381 -17579
16487 -17579 -19878 -27069 -5230 -2828 -9978 -4284 1567 4591 -1995 23348 6015 -6123 -20219
16474 -20219 -19619 4918 -22095 -27935 7574 41267 36569 24681 18105 20284 20478 18138 7380
16461 7380 584 -11965 -11686 5371 5892 -10622 -47923 -46186 -22675 4034 9979 -575 8741
16448 8741 11148 13279 27769 33919 -1390 -572 -2174 8111 1970 10157 13494 7064 4594 -9963
16434 -9963 -18351 -11109 -13127 -15388 -7859 -7241 1707 -13929 -23117 -14574 3784 -8850 2756 20748
16420 20748 21808 8258 -9730 -351 2643 -12716 -23104 -4164 19570 10428 15112 13018 28560
16407 28560 25772 4258 832 17712 739 -2842 6090 -8531 -20758 -21984 13035 28810 28036
16394B8036Q617j588k3140k4554k5144N652J025J3563J6749j963q530n788Q565
16381h500j06R326j4056p339K4860J8569j4020j6899J869k0890m782J8583J0651
16368b734K9704j2563q311k11j2909j8672N724Q139j752Q271j083M62q068r626
16354b3629K766J6081P048L0139J4950M404k6041j4539k5129k9840L98Q734J6363
16341a8295Q096J9081L417j0318n353J4963L24n21J6559k3915j6299k6638K8812
16328a0087O722j2007J2167Q782j0833j4527K5272K0858m704m291k297j6345j1530
16315a2820N173K303o439j057p226J5271J8315p83Q21J4460M524J1447k6699j0567
16301F723k1629L081Q345J1874O607k5036K1061K2511m336j3939k4421J4015j9440
$$ plain form
16394 28036 36653 35065 11925 -12629 -37773 -32121 -31096 -17533 -784 -2747 -11277 -17065 -8500
16381 -8500 -8606 720 -13336 -20675 4185 22754 8734 -8165 -6296 -27186 -31968 -13385 -2734
16368 -2734 26970 14407 6096 5885 -7024 -25696 -19972 -11833 -13585 -5314 -6397 -5935 -14003 -23629
16354 -23629 -20863 -4782 2266 32405 47355 51759 25718 11179 -13950 -43790 -43392 -34658 -18295
16341 -18295 -10199 8882 12299 1981 -3372 11591 11915 11394 27953 4038 -12261 -38899 -10087
16328 -10087 -3365 -15372 -3205 5577 -5256 -19783 5489 26347 21643 17352 15055 -1290 -12820
16315 -12820 -7647 -5344 -11783 -12840 -20066 -4795 13520 12737 13558 28018 32542 43989 17290 6723
16301 6723 -14906 -11825 -3480 8394 15001 -10035 11026 33537 29201 15262 -9159 4856 -14584
16288a4584j5882m584K1704K3457p63m5073k223L150P001K2356J2763j19K459
16275I662j2667k2226j9040k0168J8553L0735l625j5202m514K6721K0340j3365
16263d796k4677N517M0396N346k8937k6537j6439j9K1545J4797J7770J3334J1449
16250B8749l2430j8848K9174n963K221R699j9369r161O271M289l1440l6769K7195
16237d6382K6093J5140k861j4597R887K7913L2355l3640J751J2610j3749m93J0219
16224B4246N565j1528k5149l1347k077J226J1970K0176L193l095J9779j1700Q30
16211B089K420m731l874l486j3898o200K610J470P15L2707J8667l639m340m806
16197A5704k1153l4141r369n522J9018N2160k933j8049j8834k8182J9173L0823
$$ plain form
16288 -14584 -30466 -35050 -13346 10111 9348 -35725 -37948 -34798 -27797 -5441 7322 7203 9662
16275 9662 -3005 -25231 -44271 -64439 -45886 -15151 -18776 -33978 -38492 -11771 8569 -4796
16263 -4796 -29473 -23956 16440 21786 -7151 -33688 -50127 -50146 -28601 -13804 3966 17300 28749
16250 28749 -3681 -22529 6645 682 2903 12602 -6767 -15928 -9657 -5368 -36808 -73577 -46382
16237 -46382 -20289 -5149 -8010 -22607 -12720 15193 47548 13908 15659 28269 14520 14027 24246
16224 24246 29811 18283 -6866 -38213 -40290 -39064 -27094 -6918 -3725 -6820 12959 1259 2089
16211 2089 4509 -222 -4096 -7582 -21480 -27680 -25070 -23600 -22885 9822 28489 24850 20510 15704
16197 15704 -5449 -39590 -48959 -54481 -35463 16697 13764 -4285 -23119 -51301 -32128 -1305
16185a305K9043J9458j9725m8448m754k603l628J8079J1514l4984j3016J9504
16173c0865J9875J0049k0639n2J6113L818k568j2427m087j3965j5899O278J3144
16160c1225M021k212R063L3697L6771q652j3823k8154k1966L0438J7496K602j5722
16147A2334j7064j1368Q214K5773J1092k5698l4632l910k2227p660K5808R197
16135c0141K5683J215n873j7399k0171P003k565K8139K0102L33k0343Q031j6981
16122b2967j8789M192J9294K9569Q98M439j6212l0537j530J3212p568J9992J0236
16109D229R905j5363r335N194q077j0208O427m058Q977j4505J4410q283q143Q235
16095b0595J8225k3329l908K3146J2674j4875q814J8272J9630l5665k812j3432
$$ plain form
16185 -1305 27738 47196 27471 -20977 -25731 -28334 -31962 -13883 -2369 -37353 -50369 -30865
16173 -30865 -10990 -941 -21580 -21632 -5519 -1701 -4269 -16696 -20783 -34748 -50647 -44369 -31225
16160 -31225 -27204 -29416 -20353 13344 50115 41463 27640 -514 -22480 7958 25454 28056 12334
16147 12334 -4730 -16098 -7884 17889 28981 3283 -31349 -35259 -57486 -65146 -39338 -30141
16135 -30141 -4458 -3243 -9116 -26515 -46686 -39683 -42248 -14109 5993 6326 -14017 -5986 -22967
16122 -22967 -41756 -37564 -18270 11299 12197 16636 424 -30113 -31643 -18431 -25999 -6007 4229
16109 4229 14134 -1229 -10564 -5370 -13447 -23655 -17228 -21286 -12309 -26814 -12404 -20687 -28830 -20595
16095 -20595 -2370 -25699 -29607 -6461 6213 -8662 -17476 796 20426 -15239 -18051 -31483
16083c1483J5894O394p818M8o382R228O811K5928J9268l3250j7563j4343R847
16070a7421N954J1761k2857k731J8430l451j4470j6430J5267K0999J8412j4307
16058h44L821J6364p957j1740q428j7089K397J5475R911J4853q524j8071l5852
16045d5684LK1093L0046R543P498j2448k42R090m998q484K3261J3096n089N79
16031C7264j9561l6784l943O639J9094K609k3841j1804J8832K8052o174j4058
16019c675k5474N65m427m061J9316P376Q377j679J103n294k2426o622q61l873
16005d1655J0941L0764o671j1820K561M287K475J788Q574N098j295j2646K1688
15992A4089J4590k3559k2224L4k999J0442K207l1755j5553J4180l676k921L0970
$$ plain form
16083 -31483 -15589 -9195 -17013 -16965 -23347 -14119 -7308 18620 37888 4638 -12925 -27268 -17421
16070 -17421 -11467 294 -22563 -25294 -6864 -10315 -24785 -41215 -25948 -4949 13463 -844
16058 -844 2977 19341 11384 -356 -8784 -25873 -23476 -8001 1910 16763 8239 -9832 -45684
16045 -45684 -45681 -24588 5458 15001 22499 10051 9809 18899 13901 5417 28678 41774 36685 37264
16031 37264 17703 -19081 -23024 -16385 2709 5318 -18523 -30327 -11495 16557 10383 -3675
16019 -3675 -29149 -28584 -33011 -37072 -17756 -10380 -2003 -3682 -2579 -7873 -30299 -36921 -37782 -41655
16005 -41655 -30714 50 -6621 -18441 -15880 -11593 -9118 -7330 1244 6342 5047 -7599 14089
15992 14089 28679 5120 -17104 -17070 -20069 -9627 -7420 -39175 -54728 -40548 -44224 -47145 -16175
15979a6175K5830j3598n479Q89N14o053j3068K7859J4402o748j7949n752o530
15966b1858J2239J1034n85J7269o02l2321j8625k5574K1153M2654N753K423J0738
15953B3698j6338n788j2755m682R558j2347m051q463j6321o41j349r392j0871
15940f9742L0080J0948J7546j0400L245R411J5444k1248P588n533l53M768K2813
15927A4567j3215j1900m112k8391j1673P552M9646L622m0973p921P401M618L0349
15914d30k5796k645R903m456j7743N474O066Q176k378j4905K2204q436r815j0303
15900d5084K1473J7500k8075k9081P69o847p942N067K9371k744M64N244p431j3175
15886f0491J4661Q419J5550L7443M915m901l2762J2062Q556n514j1783j7140o522
$$ plain form
15979 -16175 9655 -3943 -9422 -8533 -8019 -14072 -27140 719 15121 8373 -9576 -15328 -21858
15966 -21858 -9619 1415 830 18099 17497 -14824 -33449 -59023 -37870 4784 10537 12960 23698
15953 23698 7360 1572 -11183 -15865 -6307 -18654 -22705 -31168 -47489 -48130 -49479 -58871 -69742
15940 -69742 -39662 -28714 -11168 -21568 -18323 -8912 6532 -14716 -7128 -12661 -13014 -8246 14567
15927 14567 1352 -10548 -14660 -43051 -54724 -47172 2474 6096 -34877 -42798 -35397 -30779 -430
15914 -430 -26226 -28871 -18968 -23424 -41167 -35693 -29627 -21451 -23829 -38734 -16530 -24966 -34781 -45084
15900 -45084 -23611 -6111 -34186 -63267 -62498 -69345 -77287 -72220 -42849 -45593 -45129 -39885 -47316 -60491
15886 -60491 -45830 -37411 -21861 15582 20497 15596 -17166 -5104 3452 -2062 -13845 -30985 -37507
15873c7507Q437r746K5189p020l5762P144J4219K7941J2217k0402q7K2370J0631
15860A7624k6992k0759J3811K089J8911M637k3921K0952m298k7001N211j4597
15848c4333k4475J1395K4203L0514K804Q250m101k6451m190k3257n122N1294R392
15835A5923q670m704J4290k824j0267j1302l968j680k0519j5178Q117R796q8Q737
15821b2337K6158K230j4369m244O308r016k5591j3343L5744J1472o651K2808J8584
15808B7753q815k2469K432Q608j8787j5959l951Q938l348M551K0094J2995k605
15795I437m2942o980O37R130P257P634J2383j9686l503K0469J343J640r134p747
15781b0062K4146J2160J0650k796j4768j4129K6429j3861k6987j3517J266R220
$$ plain form
15873 -37507 -29070 -38816 -13627 -20647 -56409 -49265 -35046 -7105 5112 -15290 -15377 6993 17624
15860 17624 -9368 -30127 -16316 -14227 4684 9321 -14600 6352 2054 -24947 -19736 -34333
15848 -34333 -58808 -47413 -23210 7304 10108 18358 14257 -12194 -16384 -39641 -44763 6531 15923
15835 15923 7253 2549 16839 14015 3748 -7554 -11522 -13202 -33721 -48899 -40782 -30986 -31074 -22337
15821 -22337 3821 6051 -8318 -12562 -6254 -15270 -40861 -54204 -18460 -6988 -13639 9169 27753
15808 27753 18938 -3531 -1099 7509 -11278 -27237 -31188 -22250 -25598 -21047 -953 12042 9437
15795 9437 -33505 -40485 -39848 -30718 -23461 -15827 -3444 -23130 -26633 -6164 -4821 -3181 -12315 -20062
15781 -20062 4084 16244 26894 24098 9330 -4799 21630 7769 -19218 -32735 -31469 -22249
15769b2249L068p064j0793M2901J669j2898j8543o177K9527J0833p552P64j1644
15756h158o059j8185k445J3594J5234m977J416N565o177m476j749Q71J0971o250
15742a0825r723Q505p631j1506o148J8306K9121Q756R995J7301k2939k1335J0809
15729A2686R130j315m216K08P296p070k2014q295M1054q167R328R091j1100j7398
15715I218m2792k1960K1735K5603J1150j4304L0843Q809k699k3463n362L509m337
15702d050J302K1402j750k333J6424N412J4764N154k4615j4089J404j857k2194
15689e026k4568L720R388j999O523J2587p790J79J8549r053j571K111j2340r548
15675a8838j5984M246j6621J1104J8300k7072j8383j2646K7214P620J2147J1218
$$ plain form
15769 -22249 -19181 -26245 -37038 5863 7532 -5366 -23909 -30086 -559 10274 2722 3486 -8158
15756 -8158 -14217 -32402 -34847 -21253 -6019 -10996 -9580 -4015 -10192 -14668 -16417 -15546 -4575 -10825
15742 -10825 -20548 -12043 -19674 -31180 -37328 -19022 10099 18855 28850 46151 23212 1877 12686
15729 12686 21816 20501 16285 16493 23789 16719 -5295 -13590 27464 19297 28625 37716 26616 9218
15715 9218 -33574 -55534 -33799 -8196 2954 -11350 19493 28302 25603 2140 -3222 287 -4050
15702 -4050 -2748 18654 16904 14571 30995 36407 51171 56325 31710 17621 19025 17168 -5026
15689 -5026 -29594 -25874 -16486 -18485 -11962 625 -7165 -6986 11563 2510 939 3050 -9290 -18838
15675 -18838 -34822 -30576 -47197 -36093 -17793 -44865 -63248 -75894 -48680 -41060 -28913 -17695
15663a7695Q920L577R307J5488j2517j7295q931J810j7570q389K4459K0428K2790
15650B4382j0640k3256Q572L901J4337Q855R949l3253l2609J308K9639R772k4677
15637a3720N445K524n528q065L377K5038L631j1252o68j4275o44J7088q667j2274
15623a7990J6565K0879J0554J177r063m4859q52j0989j657j9255J1002k842Q918
15610c8412J8216J0429o285j2078Q456J3701j9510r773L2341K7688r38j7966k5470
15597a9601k5870J9880N993p814J0373Q815J1933J9952J967j023N841n116l549
15584B1781R879o719j7494J3568m477J2395j2799m30k0728k0967N359J5698J3652
15571H718o816q173O082j27l6315J4756J8168j8485l6157J1950K7294L2691m472
$$ plain form
15663 -17695 -8775 -5198 4109 19597 7080 -10215 -19146 -17336 -34906 -43295 -18836 1592 24382
15650 24382 13742 -9514 -942 2959 17296 26151 36100 2847 -29762 -28454 1185 10957 -13720
15637 -13720 -8275 -5751 -11279 -19344 -15967 9071 12702 1450 782 -13493 -14137 2951 -5716 -17990
15623 -17990 -1425 19454 30008 31185 22122 -22737 -23589 -34578 -36235 -55490 -44488 -47330 -38412
15610 -38412 -20196 -9767 -16052 -28130 -19674 -5973 -25483 -35256 -2915 24773 23835 5869 -19601
15597 -19601 -45471 -25591 -19598 -27412 -17039 -8224 3709 23661 25628 24605 30446 25330 21781
15584 21781 31660 24941 7447 21015 16538 28933 16134 15704 -5024 -25991 -20632 -4934 8718
15571 8718 1902 -6271 -189 -316 -36631 -21875 -3707 -22192 -58349 -46399 -19105 13586 9114
15558I114k6085l0295M711L58j9549j6673K0775J5874K899P819M216r234K0948
15545a5122J6736M029r407l3218j8570J0811p375K253Q507N653j1173J4468J5900
15532a6508J5754J1668m1834J2472L4396O455k8594j9415J6578o328k671j7581
15520c5608o500J3175J9520j508k1065k5100m038K4163K4525K1665m616o437k8515
15507c0339q241K360n613J1738J5777j0182k8124k8023O409K7030J2967k1210
15495e5451l186L3809J8670J5042q448k4143J7665J3553j0666k0300j22p358J6505
15482a4430m832j0468J104R809J2038J3611j1602n5O87P319N041k0989M814K862
15468e091m121P586q013J8200n404k1210L71j1580J96p706J0076J0514K041p046
$$ plain form
15558 9114 -16971 -47266 -42555 -42197 -61746 -78419 -57644 -41770 -38871 -31052 -26836 -36070 -15122
15545 -15122 1614 5643 -3764 -36982 -55552 -44741 -52116 -49863 -41356 -35703 -46876 -32408 -16508
15532 -16508 -754 10914 -30920 -18448 15948 22403 -6191 -25606 -9028 -15356 -18027 -35608
15520 -35608 -42108 -28933 -9413 -10921 -31986 -57086 -61124 -36961 -12436 9229 4613 -1824 -30339
15507 -30339 -38580 -36220 -41833 -30095 -14318 -24500 -52624 -80647 -74238 -47208 -34241 -55451
15495 -55451 -58637 -24828 -6158 8884 436 -23707 -6042 7511 -3155 -23455 -23577 -30935 -14430
15482 -14430 -19262 -29730 -28626 -18817 -6779 6832 -4770 -4825 -4138 3181 8222 -12767 -7953 -5091
15468 -5091 -9212 -1626 -9639 8561 3157 -18053 -17682 -29262 -29066 -36772 -26696 -16182 -14141 -21187
15454b1187J2149K2273J0002o787N985M436j8876p889p843J9292J9032j5430J36
15441A5293k1703l9221J5760M1255O022l6853j9713j2128Q292K7673K6699j0985
15429C91p208J3900K5705q01k7941n795j7277J34L004m583J2001P570J7802m454
15415A2448j437j0204k3049j6382K9663J4773K4793N707l7945l5826j4262J4091
15403c7630j0700Q131j57j2098l256K4322N425k2700j4831K6866K3343l4328l0815
15390g8428L6167K9201K1936j2640j9721J5995K2887k2858l9814P260K8149J9972
15378H106j6600J3219k7596Q940j267M499L0308K076J8631J8383l5033k1238q724
15365f296r532k2313j5406l5480m043L9613J8569K9371j8931O112j6397j3899
$$ plain form
15454 -21187 -9038 13235 23237 16450 22435 26871 7995 106 -7737 11555 30587 15157 15293
15441 15293 -6410 -45631 -29871 11384 17406 -19447 -39160 -51288 -42996 -15323 11376 391
15429 391 -6817 7083 32788 31987 4046 -1749 -19026 -18892 -15888 -20471 -8470 -900 16902 12448
15415 12448 11011 807 -22242 -38624 -8961 5812 30605 36312 -1633 -37459 -51721 -37630
15403 -37630 -48330 -40199 -40356 -52454 -55710 -31388 -25963 -48663 -63494 -36628 -13285 -47613 -78428
15390 -78428 -42261 -13060 8876 -3764 -23485 -7490 15397 -7461 -47275 -40015 -11866 8106
15378 8106 -8494 4725 -22871 -13931 -15198 -10699 19609 21685 40316 58699 23666 2428 -6296
15365 -6296 -15828 -38141 -53547 -89027 -93070 -53457 -34888 -5517 -24448 -18336 -34733 -48632
15353d8632L422Q170K9329J7148m980k945J2515j9055j5361j5710q793M659J6669
15340b3564k925M750J9015q522M342r748k7781K5147K0796K7507J243l6369j8522
15327b4631J5114O06j294k1979m180J7156K0667j0158k1350m083K600J5332j099
15314a7299J5253P291k6972K331n428j1261L557K923N208j680l0809K958P180
15301d6748K6370j1056q001K5207J0243J4787l566K558j9585R599J5328j5204
15289f8k3518j562O010l804p598K0098R822m40J1396j943n396K6037j0480k4188
15275e634j969L2967j527j3782j5751K060j7443j2978k1316r533P581J5486K3993
15262a7846n188j0537n889M492m880N649P529Q604J4640R320J0972r793n004Q645
$$ plain form
15353 -48632 -45210 -37040 -7711 9437 4457 1512 14027 -5028 -20389 -36099 -44892 -40233 -23564
15340 -23564 -26489 -21739 -2724 -11246 -6904 -16652 -44433 -19286 1510 29017 30260 -6109 -24631
15327 -24631 -9517 -8911 -10205 -32184 -36364 -19208 1459 -8699 -30049 -34132 -31532 -16200 -17299
15314 -17299 -2046 5245 -21727 -19396 -24824 -36085 -32528 -29605 -24397 -26077 -56886 -53928 -46748
15301 -46748 -20378 -31434 -39435 -14228 -3985 10802 7236 9794 -9791 -192 15136 -68
15289 -68 -23586 -25148 -19138 -22942 -30540 -10442 -620 -1060 10336 8393 2997 29034 18554 -5634
15275 -5634 -7603 25364 23837 10055 -5696 -3636 -21079 -34057 -55373 -64906 -57325 -41839 -17846
15262 -17846 -23034 -33571 -39460 -34968 -39848 -34199 -26670 -18066 -3426 5894 16866 7073 2069 10714
15248A0714J7199p111l5270j2201k4769j2122l564J8529J9727r588Q510P501J406
15235b1039K0608O414k1896o230j5751o82K2494l86l52k065L969O24M725M912
15221d655l2550K225L8314K909j6131m832K710J2773L9702n029NL8196k0546l9873
15207A3218j2849j6315j408M525K1600K9448l0193k9588K189J339K0162N766q762
15194h68n031M397n169q79J6657L037j5546k2755k5282K5180K0721J0301J4936
15181A9699K191n611q544k197k0492J3531r045L103j6199J6745L005l3765j3736
15168e1315J4003L2704j1484q217J3270K3224J4103j7402l426o7k1422q057P737
15155a6349l127j7485J5229J0914m79J9407J4865R865k1739k0897r066R391J7742
$$ plain form
15248 10714 27913 20802 -14468 -26669 -51438 -63560 -67124 -48595 -28868 -38456 -29946 -22445 -21039
15235 -21039 -431 5983 -15913 -22143 -37894 -38576 -16082 -16468 -16820 -18885 -14916 -14292 -9567 -4655
15221 -4655 -37205 -34980 3334 6243 -9888 -14720 -12010 763 40465 35436 35441 73637 53091 13218
15207 13218 369 -15946 -17354 -12829 8771 38219 8026 -21562 -19373 -18034 2128 7894 -868
15194 -868 -5899 -1502 -6671 -7550 9107 12144 -3402 -26157 -51439 -26259 -5538 4763 19699
15181 19699 21890 16279 7735 5538 -14954 -1423 -10468 -7365 -23564 -6819 -3814 -37579 -51315
15168 -51315 -37312 -4608 -16092 -24309 -11039 12185 26288 8886 5460 5393 -16029 -24086 -16349
15155 -16349 -19476 -36961 -21732 -10818 -11297 8110 22975 32840 11101 -9796 -18862 -9471 8271
15142H271k239j1042j4685J83K997J8870J8831P553j0506O596q528j4446p596
15129e741m0392j6797K0663J5030J4316j5764L419n522K8094J7056l0734j5723
15117c2095O821K1192L808k888k5204j8057J7408K2551j4370L602L821j0628L193
15104b0846J3406m720k080M972M401J3559m464J9033j7647l2632j4217N557J0371
15091b5307K15J1803k3311k6203J2349J9953J4995J7444R211j540j6558r643K4831
15078H239j1510q847l23K4708K0441j5278k5084j2958N102J3290j615L622K0382
15065B0169Q53l5702k5824P83k484K1722j6712L219J4318J9026K2285J7259n0196
15052a1284k5550j4232J6610K9803K6918l119p121j722m52j7742r891L134R20
$$ plain form
15142 8271 6032 -5010 -19695 -19512 -16515 2355 21186 28739 18233 24829 16301 1855 -5741
15129 -5741 -46133 -62930 -42267 -27237 -12921 -28685 -25266 -30788 -2694 14362 -16372 -32095
15117 -32095 -25274 -4082 -274 -3162 -28366 -46423 -29015 -6464 -20834 -17232 -13411 -24039 -20846
15104 -20846 -7440 -12160 -14240 -9268 -4867 8692 4228 23261 5614 -27018 -41235 -35678 -25307
15091 -25307 -25092 -13289 -36600 -62803 -50454 -30501 -15506 1938 11149 9609 -6949 -16592 8239
15078 8239 -3271 -12118 -12441 12267 32708 17430 -7654 -20612 -15510 -2220 -3835 -213 20169
15065 20169 21022 -14680 -40504 -39721 -42205 -20483 -37195 -33976 -19658 -632 21653 38912 -11284
15052 -11284 -36834 -51066 -34456 -4653 22265 19146 12025 10303 9851 -7891 -17782 -14648 -13728
15039a3728k3549Q345J1583K1488Q889L208k4050K882L331j1226K2590m353n999
15026e89j9018k4020r619j0338K5060O020r912L631Q264O481n813j0603R408k153
15012c3201n197k7781j5600q487J8368K0417M604J0123K3350j1853k8275o526
15000f0058J0337Q280J0513K5757q995k4843K8706Q439k2087N66J3568K2835R448
14987B2466l2327O39j2672j3419Q551P151j6725k841R823J3242j919j1332L3257
14974C894J0985j3608k6414l49R309m297Q798o400r03j2572K5773n382k929j3234
14960b7329j571P819M630K0501j7479n565J8859J9768l822J575j8641J1230M902
14947A4877k948K4936L835L111j521j1497j4322j3735K967O008j8462k3224l711
$$ plain form
15039 -13728 -37277 -28932 -17349 4139 13028 16236 -7814 -4932 -1601 -12827 9763 5410 -589
15026 -589 -19607 -43627 -53246 -63584 -38524 -32504 -42416 -38785 -30521 -24040 -29853 -40456 -31048 -33201
15012 -33201 -38398 -66179 -81779 -90266 -71898 -51481 -46877 -36754 -13404 -25257 -53532 -60058
15000 -60058 -49721 -41441 -30928 -5171 -14166 -39009 -10303 -1864 -23951 -23385 -9817 13018 22466
14987 22466 -9861 -9222 -21894 -35313 -26762 -19611 -36336 -39177 -29354 -16112 -18031 -29363 3894
14974 3894 14879 1271 -25143 -25492 -16183 -20480 -11682 -18082 -18985 -31557 -5784 -11166 -14095 -27329
14960 -27329 -28900 -21081 -16451 4050 -13429 -18994 -135 19633 15811 17386 -1255 9975 14877
14947 14877 11929 36865 40700 43811 42290 30793 16471 2736 5703 11711 -6751 -29975 -33686
14934c3686q81j365j2025j1438j2488K2270J9511K8854J330o702Q057p248k4992
14921c0803J450L823p551k9263J0659n27k2121J7010M2373M773k6377J1663Q941
14908a5950P252j1331j5816R555j0513k0709L1239L259N609O735K5956k66k5512
14895a0492k3881j2067M303j2933p288k721K7851J8040j576n36j151R257q654
14882b1848j8270q780k030p431L4Q878j0565L5528J8193j9053j8796R655P299
14869b7186J1380J3428j5753j8516O338l991j6985Q963j812J8189k3196K846j5147
14856f1442j1128R411K1498K295k3286J3163L552L2749K2122p90J3650j00k1621
14843G3j3290J6102J3655L881M360M898k2048j6868p946K1323K2333n305j1187
$$ plain form
14934 -33686 -34567 -35932 -47957 -59395 -71883 -49613 -30102 -1248 82 -6620 1437 -5811 -30803
14921 -30803 -29353 -25530 -33081 -62344 -51685 -52212 -74333 -57323 -14950 -10177 -36554 -24891 -15950
14908 -15950 -8698 -20029 -35845 -26290 -36803 -57512 -26273 -23014 -17405 -10670 15286 15020 -10492
14895 -10492 -34373 -46440 -42137 -55070 -62358 -65079 -37228 -19188 -20764 -21300 -22451 -13194 -21848
14882 -21848 -40118 -48898 -50928 -58359 -58325 -49447 -60012 -24484 -6291 -25344 -44140 -34485 -27186
14869 -27186 -15806 -2378 -18131 -36647 -30309 -34300 -51285 -42322 -44134 -25945 -49141 -46295 -61442
14856 -61442 -72570 -63159 -41661 -39366 -62652 -49489 -45937 -13188 8934 8144 21794 21694 73
14843 73 -13217 2885 16540 20421 24781 29679 7631 -9237 -17183 4140 26473 21168 9981
14830I981k904r77n439j4270k0935q907J2624P496K0201J0388j4954k915J0510
14817a01k019k4203k3498j4217m558J4724J8173K7321l625j7222J5691L178l1069
14804d1425k3315J3006J8864P695K9080Q257J394L949q622k0190j2612j4473j0623
14791d9015J49J4296j8913N505J8430Q305j7163m187J775J3049K2441M781o056
14778f603j117m570l2367j0174J0148j6316o162k1166J229J4882M9L775Q702L5747
14764b3943K6412j6842k6668J110L719O028N881N924r720q349N064m331Q212J1537
14750a5966r890P06K306O23J5492q625o434j1540k0453N470K5663L7968j8111
14737b791m3841O419J5159K2228J1397k2708k5242j0575m55j458J7096M579K3294
$$ plain form
14830 9981 7077 6100 661 -13609 -34544 -43451 -30827 -23331 -3130 7258 -7696 -10611 -101
14817 -101 -2120 -26323 -49821 -64038 -68596 -53872 -35699 -8378 -12003 -29225 -13534 -10356 -41425
14804 -41425 -64740 -51734 -32870 -25175 3905 12162 13556 17505 8883 -11307 -23919 -38392 -49015
14791 -49015 -48866 -34570 -53483 -47978 -29548 -21243 -38406 -42593 -40818 -27769 -5328 -547 -6603
14778 -6603 -7720 -12290 -44657 -54831 -44683 -60999 -67161 -88327 -87098 -72216 -72167 -68392 -59690 -23943
14764 -23943 2469 -14373 -41041 -39931 -36212 -30184 -24303 -18379 -28099 -36448 -31384 -35715 -27503 -15966
14750 -15966 -25856 -25150 -22844 -22221 -6729 -15354 -21788 -33328 -53781 -48311 -22648 15320 -2791
14737 -2791 -46632 -40213 -25054 -2826 8571 -14137 -39379 -49954 -50409 -51867 -34771 -30192 -6898
14724f898K8313o806j0342L164r139p072j7182n284K2496P900k1943j9522O307
14711c6008K4900K6247L603k9350j7900r129J6253J8054Q617J5790J9883l856
14699C7104k1421r678k1290k2785J904J2270p201j4815p534k284J788Q931R013
14686c5998M8917L315j8182j6506p155J3308j9657k934K5767l73l2146j3653J7720
14673c7577J0086q451j8106q539p075j6929K7563L4207J7026l2856j7515J0249
14661d7917k727K0098j6709m922K3408O625J9863j0715J4221P270J8130k5663
14649I62k3828n510L0999M302J7803q005j6593p030n032r371n468K2446K2102
14636A7777l072k5600j426J2468J1475k3280j2398j0752N332P411l580k1903O635
$$ plain form
14724 -6898 21415 14609 4267 7431 -1708 -8780 -25962 -31246 -8750 -850 -22793 -42315 -36008
14711 -36008 -11108 15139 18742 -10608 -28508 -37637 -21384 -3330 5287 21077 40960 37104
14699 37104 15683 6005 -15285 -38070 -36166 -23896 -31097 -45912 -53446 -55730 -53942 -45011 -35998
14686 -35998 12919 16234 -1948 -18454 -25609 -12301 -31958 -34892 -9125 -9498 -41644 -55297 -37577
14673 -37577 -27491 -35942 -54048 -62587 -69662 -86591 -59028 -24821 -7795 -40651 -58166 -47917
14661 -47917 -50644 -30546 -47255 -52177 -28769 -22144 -2281 -12996 1225 8495 26625 962
14649 962 -22866 -28376 2623 6925 24728 16723 130 -6900 -11932 -21303 -26771 -4325 17777
14636 17777 14705 -10895 -12321 147 11622 -11658 -24056 -34808 -29476 -22065 -25645 -47548 -40913
14623d0913r579K9449K2932L818J3630k0967l5494r433N257o430j7669j4091n407
14610h4897J6424J7207J3437K3006n377k4056k233j2975R130r01r503q878K305
14597f7311p821J4199m805J645K1443J6409j9025k3554P19Q623J3493J2896K9485
14584c604J3042L047k9980l0478Q863M675m233L2888J5903j4913L500k019L804
14571D95j0639n239Q438P350j0869k0512J6086j12j1102j0730p301o453J1303
14558c9285J6115J9976K244j1721j3726p987L2838P239J3180M9307N1571L8312
14546A58063L2263j3968j6539k7785n1968m5046k6167J3904J7216J9180r180q80
14534D9093J1162j1299J655p200L721k3734j9718k6980j2197K1140L2822Q774
$$ plain form
14623 -40913 -50492 -21043 1889 5707 19337 -1630 -37124 -46557 -41300 -47730 -65399 -79490 -84897
14610 -84897 -68473 -51266 -37829 -14823 -20200 -44256 -46489 -59464 -50334 -51235 -60738 -69616 -67311
14597 -67311 -75132 -60933 -65738 -64093 -42650 -26241 -45266 -68820 -68101 -59478 -45985 -33089 -3604
14584 -3604 9438 12485 -17495 -47973 -39110 -34435 -38668 -5780 10123 -4790 -1290 -3309 495
14571 495 -10144 -15383 -6945 405 -10464 -30976 -14890 -15002 -26104 -36834 -44135 -50588 -39285
14558 -39285 -23170 -3194 -950 -12671 -26397 -34384 -1546 5693 18873 68180 119751 158063
14546 158063 190326 176358 159819 132034 80066 35020 8853 22757 39973 59153 49973 49093
14534 49093 60255 48956 50611 43411 47132 23398 3680 -23300 -35497 -14357 18465 27239
14522B7239J9114n975j6272l3010k5647K5971R877M98q005j5452J360L0487M235
14509A4420j0093j3308j8030J5753R062P529l841k4522k8802P72L2030P804j953
14496a3179Q84r655K4941N028k8860j6994m801K5160o637k9003j7937M7976J6567
14483f510l1090k6536j5178N841J5929J9654J510K078j4416j1760L1429L1063
14471B014o414k3708j2802J8651J9443k5126j4219L3895N658j2013l540J7253
14459i08K3387K3837k6697l3769k992j3143R434J3081j0326J3334K1878j8386
14447a270K813o761J3348R72j5584J095k3507j1221L2704Q093O163j3900K3544
14434A6489J0935j9922k6116j5152q988J3110J3618o336R356k1474k6855L246
$$ plain form
14522 27239 46353 40378 24106 -8904 -34551 -8580 1297 1795 -6210 -21662 -20302 10185 14420
14509 14420 4327 -8981 -27011 -11258 -2196 5333 1492 -23030 -51832 -51060 -19030 -11226 -13179
14496 -13179 -12295 -21950 2991 8019 -20841 -37835 -42636 -17476 -24113 -53116 -71053 -23077 -6510
14483 -6510 -37600 -64136 -79314 -73473 -57544 -37890 -36380 -34302 -48718 -60478 -29049 2014
14471 2014 -4400 -28108 -40910 -22259 -2816 -27942 -42161 -8266 -2608 -14621 -18161 -908
14459 -908 22479 46316 19619 -14150 -17142 -30285 -20851 -7770 -18096 -4762 17116 -1270
14447 -1270 1543 -5218 8130 9102 -6482 -5387 -28894 -40115 -7411 682 6845 -7055 16489
14434 16489 27424 7502 -18614 -33766 -42754 -29644 -16026 -22362 -13006 -34480 -61335 -58089
14422e8089K7385M371l5788j6694J6647K8324M803q840k4914j3935K592J7223
14410e6915O850J837K3152L3720J931j198j8128k9357k8658O654P569j1101L338
14397f0306K3164J3988n793O54j2155p845o22J4963J9214l140J3716m4382m4633
14384i3177J8380K1728Q514J8752J3093J5451J5511k944j0522q806l0238o598
14372d0856o033K7633J1812j0801q086L8678j0037m812J8413N351J2082j3810
14360A9534j4551m762k3910j983k156J4210n781m507k9393J0052o91J4917L1725
14347B704K669L095j814l1815J7063K7495j424K6818r766m1816p655K735l4794
14334d6505l0524J3101J1308J814J7275k397k6107q323J3754J7826P731N009j0715
$$ plain form
14422 -58089 -30704 -26333 -62121 -78815 -62168 -33844 -29041 -37881 -62795 -76730 -74138 -56915
14410 -56915 -50065 -48228 -25076 8644 10575 9377 -8751 -38108 -66766 -60112 -52543 -63644 -60306
14397 -60306 -37142 -23154 -28947 -28293 -40448 -48293 -48915 -33952 -14738 -17878 -4162 -48544 -93177
14384 -93177 -74797 -53069 -44555 -25803 -12710 2741 18252 15308 4786 -4020 -34258 -40856
14372 -40856 -46889 -19256 -7444 -18245 -26331 12347 2310 -2502 15911 21262 33344 19534
14360 19534 4983 221 -23689 -25672 -27828 -13618 -19399 -23906 -53299 -43247 -43938 -29021 2704
14347 2704 5373 8468 6654 -25161 -8098 19397 17973 44791 35025 -6791 -14446 -11711 -46505
14334 -46505 -77029 -63928 -52620 -50806 -33531 -35928 -62035 -70358 -56604 -38778 -31047 -26038 -36753
14321c6753J5046J1759R950N672Q523r871o802k2094k1306m832k1741k942K1208
14308e4183J6332R109k763K0306J81L519k0453j383N135l4056Q553L5375J7524
14295C196j5369j2773R411J098P662J534O354l512j3735k8973k0878M2621M076
14282a9288j8228q882j649m179K8013L3027p025n179q459J7923q080k3628k3854
14269d9488N258P689j9307n245K641J065J0664R78l578j9504j0592m237K1212
14256f2444L427L3629M6870J7283L924k5848l6268j723J8514j6878j6640K2484
14244a3670Q915j1835q059j7889J3092J1353N531j4906J971J6006J5458l0328
14232b4361l1879K1512J15r876R276k0960L512m62M170P159J1389n032J3197K0311
$$ plain form
14321 -36753 -21707 -9948 2 5674 14197 4326 -2476 -24570 -45876 -50708 -72449 -75391 -54183
14308 -54183 -37851 -28742 -31505 -11199 -11018 -7499 -27952 -29335 -24200 -58256 -49703 -14328 3196
14295 3196 -12173 -24946 -15535 -14437 -6775 -5241 1113 -2399 -16134 -45107 -65985 -23364 -19288
14282 -19288 -37516 -46398 -48047 -52226 -24213 8814 1789 -3390 -11849 6074 -2006 -25634 -49488
14269 -49488 -44230 -36541 -55848 -61093 -58452 -57387 -46723 -45745 -49323 -68827 -79419 -83656 -62444
14256 -62444 -59017 -25388 21482 38765 42689 16841 -19427 -21150 -2636 -19514 -36154 -13670
14244 -13670 -4755 -16590 -24649 -42538 -29446 -18093 -12562 -27468 -25497 -9491 5967 -24361
14232 -24361 -56240 -34728 -34613 -44489 -35213 -56173 -52661 -53123 -48953 -41794 -30405 -35437 -22240 -1929
14218a929L676k1155l2063j4769J0041j6108J0596M4749P944j046m536j5532k8951
14205e9083k6346K1071K0729j2506N343P627M425j9676k330J7744K1060p98j5449
14192c8189o238j4825p414K6758m735j2603N02O711r540l73J9893J4309M171p688
14178b9261k1751Q240K8694n032K722L992m293j9800J4359J7621k5185j2958P555
14165c5097p571m615j174L566l1979j4845k175r082K7912J1266N871n024O046
14152e6901N327J5322k3751K172K4779J8196q864q758j2457J3000j0161M271P340
14139c0485J0508L265R19J1464J5k140k1657j3807l696J3525R708L357k0720k2490
14125f2234M80K3304J9265r673j7996N117o503N432n486l271K5320K182j8190
$$ plain form
14218 -1929 1747 -19408 -51471 -66240 -56199 -72307 -61711 -16962 -9018 -10064 -14600 -30132 -59083
14205 -59083 -85429 -64358 -43629 -56135 -50792 -43165 -38740 -58416 -60746 -43002 -21942 -22740 -38189
14192 -38189 -44427 -59252 -66666 -39908 -44643 -57246 -56744 -50033 -59573 -59946 -40053 -25744 -21573 -29261
14178 -29261 -51012 -42772 -14078 -19110 -16388 -12396 -16689 -36489 -22130 -4509 -29694 -42652 -35097
14165 -35097 -42668 -47283 -48457 -44891 -76870 -91715 -93890 -102972 -75060 -63794 -57923 -62947 -56901
14152 -56901 -51574 -36252 -60003 -57831 -33052 -14856 -23720 -32478 -44935 -31935 -42096 -37825 -30485
14139 -30485 -19977 -16712 -15793 -4329 -4314 -6454 -28111 -41918 -45614 -32089 -22381 -19024 -39744 -62234
14125 -62234 -61754 -38450 -19185 -28858 -46854 -41737 -48240 -42808 -48294 -51565 -26245 -24063 -42253
14112d2253j8829j1805n465l222M270l415K2036J4601q682j9596J4952K5121l406
14099c5693j4789q660J193l657j137L0264j450J0267l448j074k0253j3522o135
14086f8094k967J2365J0089K0115K1152j883k8593M293l155n963R561p87P513
14073b6354M2070J0030j7602k8580n571p184q197Q072P852J2151m928K49r961
14060b7953J2705K83k766l5261K233j8348l593L3247K6864k711k7471K1733L9521
14047A8483J3924j3751m3741k252K6123K584k919m7215l676P490j4857J6371P972
14034c5464J1112J9508R06m297J3312J730q537J9055O403r047j5088j1298j7401
14021b9106l663p234N9J9367J6113P33J5073k2697j6542j0167K2629J3007l063
$$ plain form
14112 -42253 -61082 -72887 -78352 -81574 -77304 -80719 -58683 -44082 -52764 -72360 -57408 -32287 -35693
14099 -35693 -50482 -59142 -57949 -61606 -62743 -32479 -33929 -23662 -27110 -28184 -48437 -61959 -68094
14086 -68094 -71061 -58696 -48607 -28492 -7340 -9223 -37816 -33523 -36678 -42641 -33080 -33867 -26354
14073 -26354 15716 25746 8144 -20436 -26007 -33191 -41388 -33316 -25464 -13313 -18241 -17992 -27953
14060 -27953 -15248 -14965 -17731 -52992 -50759 -69107 -72700 -39453 -12589 -15300 -42771 -21038 18483
14047 18483 32407 18656 -25085 -27337 -1214 1370 -1549 -48764 -52440 -44950 -59807 -43436 -35464
14034 -35464 -24352 -4844 -3938 -8235 5077 6807 -1730 17325 23728 14681 -407 -11705 -29106
14021 -29106 -32769 -40003 -39944 -20577 -4464 -3731 11342 -11355 -27897 -38064 -15435 -2428 -5491
14008e491R40n33m50k2152j0420K0826j7278k2506K5867J0609J0986L1362r535
13995A2225o86m651p003k4905j6164K2535k9385k2520j1225J2752j8196l024L675
13982h6572K9586L3506N799m039J984j1782r391O230K6323K379R804j4720j2256
13969b3149M19j885k4169O648L4262k4946m6772Q278R200j369M129k373j0948
13956g2675J1941K0649O944j3982J8J1133J792r398l883j199J391r280m031K3487
13942c7093L0718N252j8252l7304J6544K1248K3528J3429q261j3426M397l3580
13930c2800k1122l734O747J0367L521k4995j766M29j1565P707L1000k290j1651
13917e0152J1571j340J687l806k8205k7025K1056J1364K1647n4L721k723K435
$$ plain form
14008 -5491 -4551 -5084 -5534 -27686 -38106 -17280 -34558 -57064 -31197 -20588 -9602 21760 12225
13995 12225 11539 6888 -115 -25020 -41184 -18649 -48034 -70554 -81779 -69027 -87223 -90247 -86572
13982 -86572 -56986 -23480 -17681 -21720 -19736 -31518 -40909 -34679 -8356 -5977 3827 -10893 -23149
13969 -23149 -22730 -24615 -48784 -42136 -7874 -32820 -79592 -71314 -62114 -63483 -59354 -61727 -72675
13956 -72675 -60734 -40085 -33141 -47123 -47105 -35972 -34180 -43578 -47461 -48660 -47269 -56549 -60580 -37093
13942 -37093 -6375 -1123 -19375 -56679 -40135 -18887 4641 18070 9809 -3617 780 -32800
13930 -32800 -53922 -57656 -50909 -40542 -37021 -62016 -63782 -63353 -74918 -67211 -36211 -38501 -50152
13917 -50152 -38581 -39921 -38234 -42040 -70245 -97270 -76214 -64850 -43203 -43257 -39536 -42259 -39824
13904c9824J9541p542j0987K2010N360J6903k2441l2246L324K1838J1845n930
13892a8149n781l7295J7856J0731J018M158m512j7391r360o475L602k1673N828
13879g7443J7376K0997J1985j101q254M337J2287J9124P430k8154r241r547J0535
13866b9669q940Q22l943O081M517j3614j0767J2080J9139R138l3990n504k2149
13853g6799M203J3380j2098J1817K1393P030r516q058q182o285P682J5241n343
13840d5535j8862K3478M0701L3468l4988k9266K1171p069P39r757p959L3469j4651
13827a5061j0540k3842k9947J5911K2699j0461k980j4438K6096J1397j730J0311
13815b2585J251J1676R193k2448r614J314k5566l0326o704P578P691O023m800
$$ plain form
13904 -39824 -20283 -27825 -38812 -16802 -11442 5461 -16980 -49226 -45902 -24064 -12219 -18149
13892 -18149 -23930 -61225 -43369 -32638 -31620 -27462 -31974 -49365 -58725 -65200 -61598 -83271 -77443
13879 -77443 -60067 -39070 -27085 -28186 -36440 -32103 -19816 -692 6738 -21416 -30657 -40204 -29669
13866 -29669 -38609 -37787 -41730 -35649 -31132 -44746 -55513 -43433 -24294 -15156 -49146 -54650 -76799
13853 -76799 -72596 -59216 -71314 -59497 -38104 -31074 -40590 -48648 -56830 -63115 -55433 -40192 -45535
13840 -45535 -64397 -40919 -218 33250 -1738 -31004 -9833 -16902 -16163 -25920 -33879 -410 -15061
13827 -15061 -25601 -49443 -79390 -63479 -40780 -51241 -54221 -68659 -42563 -31166 -32896 -22585
13815 -22585 -21334 -9658 -465 -22913 -32527 -31213 -56779 -87105 -93809 -86231 -78540 -72517 -77317
13802g7317K892m545L829K9661J1799j140j8565p086M480q497J0733p627J02R247
13788e2034L530J656k0625J6777L5107m683j2934P526J0194l5493L625j098K5099
13775b3353K5505K8470J3574j4335O968j7433j1230L397L124J8377l258j6760
13763A3046J991j9935m5330j4551L532l7986k282L3056L654M996k7565p887k0184
13750a15445j5451L4420M1988L8792p213j171k3743o429j7551n663M972N880o235
13737g2849j6900K103J5468K0635L651J0657n026n141j7911J3631j4373j2619
13725g8674K1277J7630J3345K78Q307r668k1894j6381K4495j7643k7946R597Q925
13712f8352J238j1071j3670p812K54J1523M2017L5879J1626j432j6426Q535k8798
$$ plain form
13802 -77317 -74425 -78970 -75141 -45480 -33681 -34821 -53386 -60472 -55992 -64489 -53756 -61383 -61281 -52034
13788 -52034 -48504 -46848 -67473 -50696 -15589 -20272 -33206 -25680 -15486 -50979 -47354 -48452 -23353
13775 -23353 2152 30622 44196 29861 36829 19396 8166 11563 14687 33064 29806 13046
13763 13046 15037 -4898 -50228 -64779 -61247 -99233 -101515 -68459 -64805 -59809 -87374 -95261 -115445
13750 -115445 -130896 -96476 -54488 -15696 -22909 -24080 -47823 -54252 -71803 -77466 -72494 -66614 -72849
13737 -72849 -89749 -87646 -72178 -51543 -47892 -37235 -42261 -47402 -65313 -51682 -66055 -78674
13725 -78674 -57397 -39767 -26422 -26144 -17837 -27505 -49399 -65780 -41285 -58928 -86874 -77277 -68352
13712 -68352 -67114 -78185 -91855 -99667 -99413 -87890 -45873 -9994 1632 200 -16226 -7691 -36489
13699c6489J8224K9558n169k8435n737l638o202j5957k1413j4133n186N223m3118
13686a32472j9541J8311M8460J1278k718J7929K4210J0519J3146N749l2755j5540
13674e3424j5469K3790P787O389m446j9613p403j3731K2440J4722j4892j975j4973
13661g0798o788j960L141J9108J5962L2440L2880j5061r046p193j2378j3440j5914
13648d9047p86R815m682j1654l189l412J9722J8279J5056J3736k132q689j0099
13635a7082m820j2694L157k0409P493q044j874J3701j2961j2942K8025J9089j754
13622b1115P6k660L1719l2443r242J3878J0997k7095k1466K4114L5166p455j7843
13609b3369k4154M940r249P307M2507R889o797j4557j0183j2929j4725p892J5730
$$ plain form
13699 -36489 -18265 11293 6124 -22311 -28048 -31686 -37888 -53845 -75258 -89391 -94577 -89354 -132472
13686 -132472 -152013 -133702 -85242 -73964 -76682 -58753 -34543 -24024 -10878 -5129 -37884 -53424
13674 -53424 -68893 -45103 -37316 -30927 -35373 -54986 -62389 -76120 -53680 -38958 -53850 -55825 -70798
13661 -70798 -77586 -79546 -76405 -57297 -41335 -8895 23985 8924 -122 -7315 -19693 -33133 -49047
13648 -49047 -49833 -40018 -44700 -56354 -59543 -62955 -43233 -24954 -9898 3838 1706 -6983 -17082
13635 -17082 -21902 -34596 -31439 -51848 -44355 -52399 -54273 -40572 -53533 -66475 -38450 -19361 -21115
13622 -21115 -21039 -23699 8020 -24423 -33665 -19787 -8790 -35885 -57351 -33237 1929 -5526 -23369
13609 -23369 -47523 -42583 -51832 -44525 -2018 7871 1074 -13483 -23666 -36595 -51320 -59212 -43482
13596d3482o653P00Q736n32l9606j9900O422J3417Q154J3487m877N870Q202o016
13582e6078l595j8717P712J5696j6075j5169K0419M3703K0935N666J2915j2146
13570E266k0163J838j8633p767P922j5672J9612J4070J266j1554J0692q395P91
13557b0727k4833j5888J949p419K450o477K4653K0912P097K6467Q255k2829m6465
13544e2855k6775j5588K968Q670r260J1349M916m394J7827j4565m085j421j4458
13531i7671n980L6456M0456J0170j5598J0792N981j6675k5209l2831l869J8201
13519g5777K7999R741L395j3896N665p534K467O848L012L390J0239J488R022k1876
13505c5817p887K34P096P718N167P041j7309j9447j1058j5229J8995L1084J9598
$$ plain form
13596 -43482 -50135 -49435 -40699 -41231 -80837 -100737 -94315 -80898 -72744 -59257 -64134 -58264 -50062 -56078
13582 -56078 -59673 -78390 -70678 -54982 -71057 -86226 -65807 -22104 -1169 4497 17412 5266
13570 5266 -14897 -13059 -31692 -39459 -31537 -47209 -27597 -13527 -12261 -23815 -13123 -21518 -20727
13557 -20727 -45560 -61448 -59499 -66918 -64468 -70945 -46292 -25380 -18283 8184 16439 -6390 -52855
13544 -52855 -79630 -95218 -92250 -83580 -92840 -81491 -76575 -80969 -63142 -77707 -81792 -83213 -97671
13531 -97671 -103651 -67195 -26739 -16569 -32167 -21375 -15394 -32069 -57278 -90109 -93978 -75777
13519 -75777 -47778 -38037 -34642 -48538 -42873 -50407 -47940 -41092 -38080 -34690 -24451 -22963 -13941 -35817
13505 -35817 -43704 -43470 -36374 -28656 -23489 -16448 -33757 -53204 -64262 -79491 -60496 -29412 -9814
13492i814o666r784j1407J0011J4720J9886k6162J1499K0310k850K1451K8743
13480E9937j6820j3004j0146k1934k1943k9510L148L1416P413J4276K816J0445
13468A6094o880j4669Q521K5478j8234j6961n839o919j3543L1739K2301J4976
13456C6064K611k5756k2023l9268J1961J9041k605j1930P181l383L609R86J0868
13443a2644r165n07l1327k2488J3180l110j0386J1931J2484j2173Q186K0524J4552
13430b0943K5530l2198k2502M919N273k6514R919K8899J225J2130Q280q693J9415
13417D740q860k7730j9402l605R232j3597L6006L8751J6361j4503j0874N299r650
13404B168J1949p526P093L58J510r922p082j1683l573J1813k7594o161J3148k2307
$$ plain form
13492 -9814 -16480 -26264 -37671 -27660 -12940 6946 -19216 -7717 12593 9743 31194 59937
13480 59937 43117 30113 19967 -1967 -23910 -53420 -50272 -18856 -11443 2833 5649 16094
13468 16094 9214 -5455 3066 28544 10310 -6651 -12490 -19409 -32952 -1213 21088 36064
13456 36064 38675 12919 -9104 -48372 -36411 -17370 -19975 -31905 -24724 -28107 -24498 -23512 -12644
13443 -12644 -21809 -22316 -53643 -76131 -62951 -66061 -76447 -64516 -52032 -64205 -56019 -35495 -20943
13430 -20943 4587 -27611 -50113 -45194 -39921 -66435 -56516 -27617 -26392 -14262 -5982 -14675 4740
13417 4740 -4120 -31850 -51252 -54857 -45625 -59222 -23216 15535 31896 17393 6519 11818 2168
13404 2168 14117 6591 13684 14042 15552 5630 -1452 -13135 -16708 -4895 -32489 -38650 -25502 -47809
13390d7809j776o087K1963M0858K026m0763R473N8222L8776O273J031J4069K4403
13377A20659N0337O0328O3695O3938N1123j2535L8545M1614j2498Q116M3629K6977
13365E43928J4344R784K4504j1377m7501m5030j3574m994J4598j7891n8944l4976
13353C72871k4434j7294J9627K3051K8582M3805J8547p415J9487L0779L0975L5214
13341E73795j282j4151j3034J6249r4m377L9106J9727k0147k7506l9683l5038
13329D93565j9113Q992j2235n9816m6499o1525m7059l1878m5985j64k2974l3955
13317A21354J2766K4485K1126Q558J7469J4736k1018J1456p280P806J3351N2349
13305B77158O5491K4065M3523L0237L8123L3532L0540L8737J3951K855K2778J3075
$$ plain form
13390 -47809 -49585 -55672 -33709 7149 9175 -31588 -22115 36107 74883 81156 82187 96256 120659
13377 120659 170996 231324 295019 358957 410080 397545 436090 477704 465206 473322 516951 543928
13365 543928 558272 568056 592560 581183 533682 488652 475078 470084 484682 466791 407847 372871
13353 372871 348437 331143 350770 373821 402403 446208 464755 457340 476827 507606 538581 573795
13341 573795 572513 558362 545328 561577 561483 557106 596212 615939 595792 568286 528603 493565
13329 493565 474452 483444 471209 411393 364894 303369 256310 224432 178447 178283 155309 121354
13317 121354 134120 158605 179731 188289 205758 220494 199476 210932 203652 211458 224809 277158
13305 277158 342649 366714 410237 440474 478597 512129 542669 581406 595357 598212 620990 634065
13293F34065K6382L0153j110j6317J6499n783m2696j0705j8448k6814m5186m5258
13281D94782m1546m8909j5566L492M0702L8841M1624L1893M1894K8221J4414J8250
13269F48092M3570K6620J1951m899k4340N430k171R682j7788j6244J0229j4139
13257F75993k5924o5629l2419j7051l6939q9416p0030m2971m6448l0064j0200
13246B08902p445j0933r997P90k7588j6221M471j4271q110M536L951J2079N451
13233A45615j8207j9295L751j3483l0303M198j2895J3973P869k1903j2642L963
13221E0641L3633K6514M185j6389m0045j8337q414K781m428j5539m048j9467k199
13208a1112l687L634O562K8869r798l2232P369n119k1121J3404J1618K2541K216
$$ plain form
13293 634065 660447 690600 689490 673173 689672 683889 641193 630488 612040 585226 540040 494782
13281 494782 453236 404327 388761 392253 432955 471796 513420 545313 587207 615428 629842 648092
13269 648092 691662 718282 730233 725334 700994 706424 704253 713935 696147 679903 690132 675993
13257 675993 650069 584440 552021 534970 498031 408615 338585 295614 249166 219102 208902
13246 208902 201457 190524 180527 181317 153729 137508 141979 127708 119598 124134 128085 140164 145615
13233 145615 127408 108113 111864 98381 68078 72276 59381 73354 81223 59320 46678 50641
13221 50641 84274 110788 114973 98584 58539 40202 31788 34569 30141 14602 10554 -8913 -11112
13208 -11112 -14799 -11165 -4603 24266 14468 -17764 -10395 -15514 -36635 -23231 -11613 10928 13144
13195A3144q527j7533j172j402O048j1529m879J6341p03L1994J412j761l1628
13182a0195l7902j6125j3889j1730p625K9391O51L841M0549k238o394q09j0029
13169d2504k972N591m12J0477P307J8109K7798K0911J0542j290k7862l5557l692
13156a3554j3915l590j965Q665j2313L192L3645J3208o10l9233j3200k6827k9454
13143i5951J8452L5630K7691n384k010P515K0799O967m309k4021o066N396J0176
13130e115M036k511o975L546j3263N777J7775n326j7678K980r875k1902p516j1617
13116f7664Q406M115J3171J7970j262l9885l589L4825J0859k934o328j2220j2617
13103e7153J1699J2783q124l3J6562j3467l1958n953L3645K2509Q810J0940r580
$$ plain form
13195 13144 4617 -12916 -14088 -15490 -9442 -20971 -25850 -9509 -10212 21782 23194 21433 -10195
13182 -10195 -48097 -64222 -78111 -89841 -97466 -68075 -67424 -63583 -23034 -25272 -31666 -32475 -42504
13169 -42504 -45476 -39885 -40297 -29820 -22513 -4404 23394 44305 54847 53557 25695 -9862 -13554
13156 -13554 -27469 -31059 -33024 -24359 -36672 -33480 165 13373 12763 -26470 -39670 -66497 -95951
13143 -95951 -77499 -41869 -14178 -19562 -21572 -14057 6742 13709 9400 -14621 -20687 -15291 -5115
13130 -5115 -1079 -3590 -10565 -7019 -20282 -14505 3270 -2056 -19734 -16754 -26629 -48531 -56047 -67664
13116 -67664 -59258 -55143 -41972 -24002 -25264 -65149 -68738 -33913 -23054 -25988 -32316 -44536 -57153
13103 -57153 -45454 -32671 -40795 -40828 -24266 -37733 -69691 -75644 -41999 -19490 -10680 260 -9320
13090i320q6j1490L74o518Q600J6511O93q200k6351j5104J3557l625j6954j5144
13076g3057n122K3127L959L523K1973M555Q588r403j3253j405L4050J4138k9869
13063a8196K747J0157O993J1100J3202k2261q148J3074K3144O736j4297l806J8132
13050C8577r037j7830r491P896K511k339p746K1639L9979K1157m137m266R322
13037H6235k105l0149K7394L6337J2417N994Q192J4508K7654L500j3200j1959
13025A64818o342l471J7747r961j2382L837J1920J5193q8n247L9211K0328j7028
13012B18535O319J0720K7828K0831J2744J6126J1263J0295J4549L1901K4872J3409
13000D19392k4058j9058j2678l0199K8584L6314O5J3704J1914k0971J6487J6586
$$ plain form
13090 -9320 -9406 -20896 -20522 -27040 -18440 -1929 -1236 -9436 -35787 -50891 -37334 -40959 -57913 -73057
13076 -73057 -78179 -55052 -51093 -47570 -25597 -21042 -12454 -21857 -35110 -36515 -2465 11673 -18196
13063 -18196 -15449 -5292 1701 12801 26003 3742 -4406 8668 31812 38548 24251 20445 38577
13050 38577 29540 11710 2219 10115 12626 10287 2541 24180 64159 85316 81179 76913 86235
13037 86235 84130 53981 81375 117712 130129 136123 144315 158823 186477 189977 176777 164818
13025 164818 158476 155005 172752 162791 150409 154246 166166 181359 181271 176024 215235 235563 218535
13012 218535 224854 235574 263402 284233 296977 313103 324366 334661 349210 381111 405983 419392
13000 419392 395334 376276 363598 333399 361983 398297 398362 412066 423980 403009 419496 436082
12988D36082l2169j1245K1574Q365R313K252n01K9470P304K3430J4582M517M6730
12975E59704M4246J5915K818J086P693J6275m308N2225O1601K3964M5001M3423
12963H69643N0457J01159N7616P0924Q9131R9162R8408J63543K03237K30909K32278
12952B266467K09350K03597J86384J24007J26508J25968J25764J76236K05625
12943C749906J82869K05810K26849K17610K14642J99916K47925K45602K14607
12934E705736J70626J50673J45546K00729K57250K91239L83285N43566P66653
12925H615303J024600J337760J696781K152236K766627L747570N157510P070339
12917C3568726Q944625R986026R828766Q382504O472558N379496N496070O068364
$$ plain form
12988 436082 403913 392668 414242 422607 431920 434172 433671 463141 470445 493875 508457 512974 559704
12975 559704 603950 619865 622683 623769 631462 647737 643429 695654 757255 781219 826220 869643
12963 869643 920100 1021259 1078875 1149799 1238930 1338092 1436500 1600043 1803280 2034189 2266467
12952 2266467 2475817 2679414 2865798 2989805 3116313 3242281 3368045 3544281 3749906
12943 3749906 3932775 4138585 4365434 4583044 4797686 4997602 5245527 5491129 5705736
12934 5705736 5876362 6027035 6172581 6373310 6630560 6921799 7305084 7848650 8615303
12925 8615303 9639903 10977663 12674444 14826680 17593307 21340877 26498387 33568726
12917 33568726 42513351 52499377 62328143 70710647 77183205 82562701 88058771 94127135
12909I4127135O152806N287482L544049J330906p54094j847553j542324o34303
12901A05664104o55220k142612m542144o278565o257448n431907m992968m991564
12893G0371676m614413l054805l06324K998240N984709P902745Q126602O349738
12885I3758168L720427J863228J490296K197056L146539L281222K498059J492129
12877A13447124N97754j88173r71716j237272p32203j97294m43593k033275m591305
12868A03650047o616093p469776p482634p213762p080911o873899o350496n361477
12860D9200999m148657l078449k270222j667176j202894q51153n55139k81419
12852C5145890J13441O70311J404976K321263L527156M959524O337561P358696
$$ plain form
12909 94127135 100279941 105567423 109111472 110442378 109688284 107840731 106298407 105664104
12901 105664104 105008884 102866272 98324128 92045563 85788115 80356208 75363240 70371676
12893 70371676 65757263 62702458 62396134 65394374 71379083 79281828 87408430 93758168
12885 93758168 97478595 99341823 100832119 103029175 106175714 109456936 111954995 113447124
12877 113447124 114044878 113856705 112884989 111647717 110915514 110718220 110274627 108241352 103650047
12868 103650047 97033954 89564178 82081544 74867782 67786871 60912972 54562476 49200999
12860 49200999 45052342 41973893 39703671 38036495 36833601 35982448 35427309 35145890
12852 35145890 35259331 35929642 37334618 39655881 43183037 48142561 54480122 61838818
12844F1838818Q119116Q727026R234435R853414R795624Q264419N778113L770247
12836A25381212L334426L789068L732988K459697J54976k035510l288419l518055
12828A30010383l002225k479102k845571m486924o988235q836864q826640o938919
12820H5605903m058356r66785J901215M234638N652533O173255O440263O736172
12812A11718838O797655N615173K863163K21697p11312K66028K224315L279113
12804A32274670K442661M06591j547179k733569l180865k900423k308420k320675
12796A20132791l409353n774988q670023j0610843j1077998j0225609q455526
12789F1908451o593686n174295m188668l479921k866706k331146j926394j659340
$$ plain form
12844 61838818 69957934 78684960 87919395 97772809 107568433 115832852 121610965 125381212
12836 125381212 128715638 132504706 136237694 138697391 138852367 136816857 133528438 130010383
12828 130010383 127008158 124529056 121683485 117196561 110208326 101371462 92544822 85605903
12820 85605903 81547547 80580762 82481977 86716615 92369148 98542403 104982666 111718838
12812 111718838 118516493 124131666 126994829 127216526 126505214 126771242 128995557 132274670
12804 132274670 134717331 135123922 133576743 130843174 127662309 124761886 122453466 120132791
12796 120132791 116723438 110948450 102278427 91667584 80589586 70363977 61908451
12789 61908451 55314765 50140470 45951802 42471881 39605175 37274029 35347635 33688295
12781C3688295j479990j391855j336395j240747j155322j063678j022288r41096
12773B4056924q57014q35092q28674p79572p80530p35104o96169o96518o65461
12764A7182790o06238n37455n22133m92492m91732m77077m36747m33480m02576
12755A2782860m07474l84841l68113l58415l34633l29122l21779k98418k93353
12746I686712k85547k70045k35514k21931k04967k14701k23781k10320j80243
12737G639663j82534j40412j80848k19319j36747j38255j77765j87873j41874
12728F134036j56295j76208j73043j55985j40884j47470j45889j22971j34426
12719D780865j24983j14482j09916q7724j07876j16365j20675j08444q3712r1890
$$ plain form
12781 33688295 32208305 30816450 29480055 28239308 27083986 26020308 24998020 24056924
12773 24056924 23199910 22364818 21536144 20756572 19976042 19240938 18544769 17848251 17182790
12764 17182790 16576552 16039097 15516964 15024472 14532740 14055663 13618916 13185436 12782860
12755 12782860 12375386 11990545 11622432 11264017 10929384 10600262 10278483 9980065 9686712
12746 9686712 9401165 9131120 8895606 8673675 8468708 8254007 8030226 7819906 7639663
12737 7639663 7457129 7316717 7135869 6916550 6779803 6641548 6463783 6275910 6134036
12728 6134036 5977741 5801533 5628490 5472505 5331621 5184151 5038262 4915291 4780865
12719 4780865 4655882 4541400 4431484 4343760 4235884 4119519 3998844 3890400 3806688 3714798
12709C714798n0100o4392m1990m2773n6338j26957j04870r1459p0580q3026q8358
12698B893955p4583o6475q7135q4487o1542q0729p8909o4752q3721m9673n7911
12687B104038m9598n9837p8195o9817p5831m8029l8505q322j6784j0358j2665
12676A636097m4594l831j9080k671l7408m2625j3901j0883l1527k3105n684j0396
12664A390392k1677j4576r912K079R316j4415j8221j9213J850O089r353l4561
12652A267798J23K3117J6546l5976l8035p330k9907r81J8285k4034k6063k8126
12640A135417k218r164q053K656k007l854k6927r737j4357j9197j8325k2831j2180
12627I89223K598N351J726J4861P355o993L837K0580j649j6157m540k4574l7167
$$ plain form
12709 3714798 3664698 3600306 3558316 3515543 3459205 3332248 3227378 3135919 3065339 2982313 2893955
12698 2893955 2819372 2752897 2665762 2581275 2519733 2439004 2360095 2295343 2211622 2161949 2104038
12687 2104038 2054440 1994603 1916408 1846591 1770760 1722731 1684226 1675904 1659120 1648762 1636097
12676 1636097 1591503 1587672 1568592 1565921 1528513 1485888 1471987 1461104 1429577 1406472 1400788 1390392
12664 1390392 1368715 1354139 1344227 1346306 1355622 1341207 1322986 1303773 1305623 1311712 1302359 1267798
12652 1267798 1267921 1291038 1307584 1271608 1233573 1226243 1196336 1195355 1213640 1189606 1163543 1135417
12640 1135417 1133199 1124035 1115982 1118638 1116631 1112777 1085850 1076113 1061756 1042559 1024234 1001403 989223
12627 989223 991821 997172 998898 1013759 1021114 1014121 1017958 1038538 1036889 1020732 1016192 991618 954451
12614I54451k2097j5868k6981q275k714k13J8825J0193l1744k8818P961j147j7382
12601H36191j4442J0547L9317J0712k643J6930k2434l0840j5251n639j0759N371
12589H17060J2722l0997j7313j604j308m3578k1298j3584k157N89M996L613p714
12576F99427q12o572K948j5778Q190o772P324k196j88J2756k099k1775j0093Q957
12562F73317o57j9010j3348l0295j8214N072K0958J9419R748L3020J1491j1766
12550F79735L054O896q767j4692r514j4768j3523j1311j6604p272k4889j5125
12538E53220l1140L298j1890r623M199r955J3628j0638j3153k132l0487r221j4641
12525D31465p368L1961J7849j1685j8343p488j2173r127k446l6720J834J9872
$$ plain form
12614 954451 932354 916486 889505 881230 878516 878303 897128 907321 875577 846759 854720 853573 836191
12601 836191 821749 832296 871613 882325 879682 896612 874178 843338 828087 822448 811689 817060
12589 817060 829782 798785 781472 779868 778560 734982 713684 700100 697943 698532 703528 707141 699427
12576 699427 698615 692043 694991 679213 687403 680631 687955 685759 685571 698327 696228 674453 664360 673317
12562 673317 672660 653650 640302 610007 591793 596865 617823 637242 646990 680010 691501 679735
12550 679735 682789 689685 680918 666226 656712 641944 628421 617110 600506 593234 568345 553220
12538 553220 522080 525378 513488 503865 508064 498109 511737 501099 487946 485814 455327 446106 431465
12525 431465 424097 456058 473907 462222 443879 436391 424218 415091 412645 375925 377759 397631
12513C97631J8864M329J3940J4013q426l4394l840K2118J1216K0664K7607J2844
12501D96566L4362L1803j9963j3029k9626k9443l2078j8434j9285P730k696j0115
12489C95792q873j23J4007L6068M021J6481L328l5448j4971J0025P800k5558l232
12476C99317K7270k638k2474L787L9276J0461j2421N775r310j4949k4068J0882
12464D10908K108q265Oj2552j2728K3247L2155j104K1124J2163J1583n061M5388
12451E18972P6277M7476L1507N8176O7980K6900j0753J008K1154N3595r002j2348
12439H70942J9194M672M154J158k3903N235m168k7590j7736k4489m4258m3020
12427G20191q137J3155j2421L1598O9954N6584P2828P7985P7493J12200J60721
$$ plain form
12513 397631 416495 420824 434764 448777 440351 405957 402117 424235 435451 456115 483722 496566
12501 496566 530928 562731 542768 529739 500113 470670 438592 420158 400873 408603 405907 395792
12489 395792 386919 386796 400803 436871 440892 457373 460701 425253 410282 420307 428107 402549 399317
12476 399317 426587 423949 401475 405262 444538 454999 442578 448353 439043 424094 400026 410908
12464 410908 413016 404751 404757 392205 379477 402724 434879 433775 454899 467062 478645 473584 518972
12451 518972 595249 642725 674232 732408 800388 827288 816535 817543 838697 892292 883290 870942
12439 870942 890136 894808 898962 900120 876217 881452 877284 849694 831958 807469 763211 720191
12427 720191 712054 725209 712788 744386 814340 870924 943752 1021737 1099230 1211430 1372151
12416A372151J25808O3496J4036L896k9233n1756l0866j6115K9028K3868K7305
12405A531618Q4435Q0721K0587n1413j03763j65781j55001j38310r7986r7162
12395I07945p6956n9819m237m6827n1593k2613j2726m813J7580J2520L149j9342
12383F42268j8111j2181J0524P891L8768N1126M8157O1175M8055M2095L2384L9113
12371I91264N2229M5230J0839m166j546j6847q489M185Q117K544k5517n6024n2771
12358I49048L277p314k7815k9320k9100n870M165K0422N0731J00736Q8256P7495
12346A194711R8886J39659J81532K00232J80340J45887N9712n120n6568o5246
12336B074025o2638l9999q151k1511J8313L2641N3917K3594j1862k2501q9417
$$ plain form
12416 1372151 1497959 1561455 1575491 1579387 1550154 1498398 1467532 1451417 1480445 1504313 1531618
12405 1531618 1616053 1696774 1717361 1665948 1562185 1396404 1241403 1103093 1005107 907945
12395 907945 830989 771170 766933 720106 668513 645900 633174 628361 645941 658461 661610 642268
12383 642268 624157 611976 622500 630391 669159 720285 768442 829617 877672 919767 952151 991264
12371 991264 1043493 1088723 1099562 1095396 1093850 1077003 1068514 1072699 1080816 1083360 1057843 1001819 949048
12358 949048 952325 945011 917196 887876 858776 852906 857071 877493 928224 1028960 1117216 1194711
12346 1194711 1293597 1433256 1614788 1815020 1995360 2141247 2200959 2195839 2139271 2074025
12336 2074025 2011387 1971388 1963237 1941726 1960039 1992680 2046597 2070191 2058329 2035828 1946411
12325A946411r0528j63831k14341j90345j80385j21602q4949k9508m0659n3550
12315G76713l2938l7193l2065q760j1127n4969k0979q22j2359l356l6675k4699
12303E00771m500l080m806L807R038J122o158p7R21N571m607K864q549m378l673
12288D84266k858k079P673k770J581O24m789p177j6247J0810O0r279k5000j3517
12274D21298Q800J7739M8432M1053N1792J18586Q9674P4893L4097j4657l4175
12263H57532l6243m2947j7769k0917k9304J5976Q463M0914P6062N5947K9385j7884
12251I19215q0717o5851m1587r0569q5636n3769m1902q431P663j331K830l4751
12239D25164l2793L376J676J0975J7707j1684M220l324m7103k0873K5313R290
$$ plain form
12325 1946411 1855883 1692052 1477711 1287366 1106981 985379 900430 870922 830263 776713
12315 776713 743775 706582 674517 665757 654630 599661 578682 577860 565501 562145 525470 500771
12303 500771 496271 493191 488385 492192 501230 502352 496194 496117 497038 502609 498002 500866 492317 487939 484266
12288 484266 481408 479329 487002 484232 485813 486437 481648 474471 458224 469034 469094 459815 434815 421298
12274 421298 430098 447837 496269 537322 589114 707700 797374 872267 906364 891707 857532
12263 857532 821289 778342 760573 739656 710352 726328 734791 775705 851767 907714 937099 919215
12251 919215 838498 772647 731060 640491 554855 501086 459184 450753 458416 457085 459915 425164
12239 425164 392371 395747 397423 408398 426105 414421 418641 415317 368214 347341 372654 381944
12227C81944J5069J3068K6542N142J0822J087O972P346L334k871M340l6547k2394
12214D13854k4555k0637J6739O740n542N246K2847k1740k3144j1461L734O057
12202C68138j5089o568M553l4723r348j5782r776j5970l60q914L053L6372K9326
12189C24912j1730N337j0597j8687Q922n615l4516K3766J1964J121J8722n02j1981
12176C01116J2020J6991l179r268O334K4163J1210k4464j6314K0609K9595J0876
12164C79689m972Q065K592J1658L591L3856L5122K1866K3288K0464J3886J204
12152E50309j9911P709J5892J7985j073J4673K2029M7905J8981L3865P2089Q6159
12140H66612R4114J22589J86335K88065M63904O18545O84902O22456L82460l9217
$$ plain form
12227 381944 397013 410081 436623 441765 452587 453674 460646 467992 471326 468455 472795 436248 413854
12214 413854 389299 368662 385401 392141 386599 391845 414692 392952 369808 358347 362081 368138
12202 368138 353049 346481 351034 316311 306963 291181 281405 265435 265075 256161 259214 295586 324912
12189 324912 313182 318519 307922 289235 298157 292542 258026 281792 293756 294877 313599 313097 301116
12176 301116 313136 330127 326948 317680 324014 348177 359387 334923 318609 339218 368813 379689
12164 379689 374717 382782 385374 397032 400623 434479 469601 491467 514755 535219 549105 550309
12152 550309 530398 538107 553999 571984 570911 585584 607613 655518 674499 708364 780453 866612
12140 866612 960726 1083315 1269650 1557715 2021619 2640164 3325066 3947522 4329982 4290765
12130D290765m08730n52857n53395m78561l53981k39928j62890j21071q5155p1317
12120A262880m7297k5696j3562k2467l5604o885J13j7620K4495L3806L5560N2283
12108A240006R6273R7302P4599J19658J70985K92398M31299N55772P80412Q48380
12098D707084Q18260O54217L53604N0435j18395j37820j97253l04767n03096o23509
12088D698760o22949n58408m24083k95562k29498j81076j40069j13040q1814o6876
12078A985385n9419m2420q673j6378l4096k2901m2243L466J8215Q635P901J9913
12066A817385N9842R4303J30634K41521L67979M52029N09436N34540M69296K56767
12056D933732n0391k73022m84861n30581n06881m32034k96469k01403j11623l9036
$$ plain form
12130 4290765 3882035 3329178 2775783 2297222 1943241 1703313 1540423 1419352 1334197 1262880
12120 1262880 1215583 1189887 1176325 1153858 1118254 1111369 1111482 1093862 1118357 1152163 1187723 1240006
12108 1240006 1336279 1433581 1508180 1627838 1798823 2091221 2522520 3078292 3858704 4707084
12098 4707084 5525344 6179561 6533165 6583600 6465205 6327385 6130132 5825365 5322269 4698760
12088 4698760 4075811 3517403 3093320 2797758 2568260 2387184 2247115 2134075 2052261 1985385
12078 1985385 1925966 1883546 1874873 1858495 1824399 1801498 1759255 1762721 1780936 1789571 1797472 1817385
12066 1817385 1877227 1971530 2102164 2343685 2711664 3163693 3673129 4207669 4676965 4933732
12056 4933732 4883341 4610319 4125458 3594877 3087996 2655962 2359493 2158090 2046467 2007431
12046B007431l6534l0712N139P315j3895K3042O2130Q3554J36349K41688L30371
12035B815878L53203L16720J90958J2131j21565j45169j29943q9783n1806J9194
12025C169818Q0702J38172K14086K98109L27353K67393J71011O387j38602j91563
12015D342866j86282j40327m3046j7412J0134O0793R1798J37558J74456J73830
12005D604368J85969J93316J56519K02408K40359L29023M19377M61111N59020
11996G351470O20214O92689Q12354R94800J253992J674385K243859L001703M075459
11987B2720925N721423Q235156J1766329J5806319J8568190J7892699J2899059
11980A13610100M589928l446093p224677o412512l797622j343996Q42904L345785
$$ plain form
12046 2007431 1970897 1940185 1945324 1952639 1938744 1961786 2023916 2107470 2243819 2485507 2815878
12035 2815878 3169081 3485801 3676759 3688890 3567325 3422156 3292213 3202430 3150624 3169818
12025 3169818 3250520 3388692 3602778 3900887 4228240 4495633 4666644 4673031 4534429 4342866
12015 4342866 4156584 4016257 3973211 3955799 3965933 4026726 4118524 4256082 4430538 4604368
12005 4604368 4790337 4983653 5140172 5342580 5582939 5911962 6331339 6792450 7351470
11996 7351470 7971684 8664373 9476727 10471527 11725519 13399904 15643763 18645466 22720925
11987 22720925 28442348 36677504 48443833 64250152 82818342 100711041 113610100
11980 113610100 118200028 114753935 107529258 101116746 97319124 95975128 96818032 100163817
11972A00163817O015540P933470Q348030O558567J863361m739988j0902335j4943010
11964A00297452j5720182j3669103j0711522p972301n730921m141086l134149
11957C9218188k503517k113631j838223j581630j377817j143588r56124p85343
11949B6918315o62000n68074m85095n16983o14940o94970p32003p61744p53356
11940B1129150p16822o24265n05810m10044l29222j79359K8653J59935K31063
11931A8783279J71389K1656j63555k57849j79704L8414K86707N18133O96417R29147
11921B0844034J231219J591608K049150K626277L327635M374990N931626Q156450
11913E0132989J1338651J5452173J9899763K3753384K5844118K5253409K1598126
$$ plain form
11972 100163817 106179357 114112827 122460857 129019424 130882785 126142797 115240462 100297452
11964 100297452 84577270 70908167 60196645 52224344 46493423 42352337 39218188
11957 39218188 36714671 34601040 32762817 31181187 29803370 28659782 27703658 26918315
11949 26918315 26256315 25688241 25203146 24686163 24071223 23376253 22644250 21882506 21129150
11940 21129150 20412328 19788063 19282253 18872209 18542987 18363628 18392281 18552216 18783279
11931 18783279 18954668 18976324 18812769 18554920 18375216 18413630 18700337 19218470 19914887 20844034
11921 20844034 22075253 23666861 25716011 28342288 31669923 36044913 41976539 50132989
11913 50132989 61471640 76923813 96823576 120576960 146421078 171674487 193272613
11906A93272613J4896044O097622k734347r088803j1242599r556443n294682N5457
11898A76404862N157726Q847722J0140003Q612083M581667n99448n698373j0328852
11890A97117390j4719995j8549310k0739590k0402385j7516993j3615999j0160443
11883H1412675p631857o062051n138790m546854m062046l490299k913039k498970
11875D5068769k192683j904781j634438j474677j436441j445357j440105j449437
11867C2090850j389666j214347j080271r08787p67218o90458o89769p20760p66341
11858B3863233p13199o12036n14915l76762l22834k85796k61543k09231j57684
11849B0409233l0842R1662K42882M47356P04535R80515J290731J647111K169577
$$ plain form
11906 193272613 208168657 214266279 211531932 202443129 191200530 181644087 176349405 176404862
11898 176404862 181562588 190410310 200550313 209162396 213744063 213144615 207446242 197117390
11890 197117390 182397395 163848085 143108495 122706110 105189117 91573118 81412675
11883 81412675 73780818 67718767 62579977 58033123 53971077 50480778 47567739 45068769
11875 45068769 42876086 40971305 39336867 37862190 36425749 34980392 33540287 32090850
11867 32090850 30701184 29486837 28406566 27497779 26730561 26040103 25350334 24629574 23863233
11858 23863233 23150034 22537998 22023083 21646321 21323487 21037691 20776148 20566917 20409233
11849 20409233 20378391 20470053 20712935 21160291 21864826 22845341 24136072 25783183 27952760
11840B7952760K978301M175463N874067Q223197J1021530J3601446J4892640J3658095
11832A02377499R111455K520422l641033p656840q670067p432793m903394j685993
11824H0019256J710563M682630O658216P670387P546851N763863J713148m191832
11816A11573082j0226319j3962576j4180273j1936859r010030o547391m734149
11809D0975485l469523k572709k140350j998366k050164k020037j753442j420115
11801B3550779j204387j089191j032625r51039q75055q17209p41918p25129o61236
11792A5452990n88971n52943n04776m74372m92548n01789m57187m00456l86913
11783A1093035l89249l87184l63759l28347k96636l04824l06739k60765k44633
$$ plain form
11840 27952760 30931061 35106524 40980591 49203788 60225318 73826764 88719404 102377499
11832 102377499 111488954 114009376 110368343 102711503 94041436 86608643 81705249 80019256
11824 80019256 81729819 86412449 93070665 100741052 108287903 114051766 115764914 111573082
11816 111573082 101346763 87384187 73203914 61267055 52257025 45709634 40975485
11809 40975485 37505962 34933253 32792903 30794537 28744373 26724336 24970894 23550779
11801 23550779 22346392 21257201 20224576 19273537 18398482 17581273 16839355 16114226 15452990
11792 15452990 14864019 14311076 13806300 13331928 12839380 12337591 11880404 11479948 11093035
11783 11093035 10703786 10316602 9952843 9624496 9327860 9023036 8716297 8455532 8210899
11774H210899k74353k22747k15100k40744k45690k19815j62256j48157j69117
11765F312920j50802j28080j16718j27211j18453j02809p9293q3495j19405j40757
11755E145897j20666j46984j15426j39351j33839j32747j13471j02929q3076p9344
11745C978064p9578j07325r7999p7003o9312j03360p9492o6360k5886n3192r3533
11734C125024o3934l1087l2347l2953l4377j8955j97j7748l3123m5445l6905m8645
11722B729308o3308l4750l9655m3099k8001o584R054j9783p0492n8119p6786p7218
11710B220567n2527o3368m2015l8375q525K5431K7912j1151n0168l5100l5757
11699A936924n3990p3324o8748o4810k3818j3270j3391l1628J5914M5560J05162
$$ plain form
11774 8210899 7936546 7713799 7498699 7257955 7012265 6792450 6630194 6482037 6312920
11765 6312920 6162118 6034038 5917320 5790109 5671656 5568847 5489554 5406059 5286654 5145897
11755 5145897 5025231 4878247 4762821 4623470 4489631 4356884 4243413 4140484 4057408 3978064
11745 3978064 3898486 3791161 3693162 3616159 3546847 3443487 3363995 3297635 3271749 3218557 3125024
11734 3125024 3061090 3030003 2997656 2964703 2930326 2911371 2911174 2893426 2860303 2814858 2777953 2729308
11722 2729308 2666000 2631250 2591595 2548496 2520495 2513911 2522965 2503182 2432690 2374571 2297785 2220567
11710 2220567 2168040 2104672 2062657 2024282 2015757 2041188 2069100 2057949 2007781 1972681 1936924
11699 1936924 1882934 1809610 1740862 1676052 1652234 1638964 1625573 1593945 1609859 1655419 1760581
11688A760581J60909K24885K81695K85953J44934l8370k01932j60876n7602L5745
11678B435922O8109L8647r313o1621j29073q8857n844P4673P8168O6476L2976
11667B500263Q25j9172J2395O2782Q2318Q1686J11969J10616Q4906K6600l2221
11656C022967p8758l0887L4832Q7725J34331J27979M9680N523j4534J27606M22585
11645C889049P39471P93722N88799J24154n67495q53002n80327k57783o6093l8142
11635C772353k4023p3813j20140p0376K6006J03690J32590O9853L395o2504j05692
11624C651339j24862j38775j62707j24234l8471L9228m949n0176m6389o5672n8744
11613B875588j5958N8251J45462J67043J13867L4500o7500l8259J4540J04711
$$ plain form
11688 1760581 1921490 2146375 2428070 2714023 2858957 2820587 2618655 2457779 2400177 2435922
11678 2435922 2504031 2542678 2533365 2471744 2342671 2253814 2247970 2322643 2400811 2467287 2500263
11667 2500263 2501088 2481916 2494311 2557093 2639411 2721097 2833066 2943682 3028588 3055188 3022967
11656 3022967 2944209 2913322 2948154 3035879 3170210 3298189 3347869 3353392 3338858 3466464 3889049
11645 3889049 4628520 5422242 6011041 6135195 5567700 4714698 4134371 3876588 3810495 3772353
11635 3772353 3748330 3674517 3554377 3484001 3510007 3613697 3746287 3816140 3819535 3757031 3651339
11624 3651339 3526477 3387702 3224995 3100761 3062290 3101518 3096569 3046393 3000004 2934332 2875588
11613 2875588 2859630 2917881 3063343 3230386 3344253 3378753 3311253 3272994 3287534 3392245
11603C392245J81823J48255m0424k20096l27533k76401j78359p5471m3103J8199
11593B579135M4174O1473Q624k3506L9790L5182K5612K7866k8031k7398k8321
11582B714600l6407o7516l2686r546o679j7943k437j0203P914n0177o3864n9785
11570B365271m316J8766L7601K9981L0052Q1890O0017L6266M5378K9763K9273
11559B759942L523Q506J6376O5411N4658N0722R8681J30699J41123J66721J68044
11548C664406K14102K33459K06520K27421K89407L05035L23550L74115L70240
11539F208255L73001M07458M15401M75992N81326P18928Q21418Q35257Q15423
11530A1652459P87621P84085P65608O77655O35713N86048N50484N52231O55623
$$ plain form
11603 3392245 3574068 3722323 3681899 3461803 3134270 2857869 2679510 2604039 2560936 2579135
11593 2579135 2623309 2684782 2693406 2669900 2709690 2744872 2770484 2798350 2770319 2742921 2714600
11582 2714600 2678193 2610677 2577991 2568445 2561766 2543823 2541386 2531183 2539097 2488920 2425056 2365271
11570 2365271 2360955 2379721 2417322 2447303 2477355 2559245 2619262 2655528 2700906 2730669 2759942
11559 2759942 2763465 2771971 2788347 2853758 2908416 2959138 3057819 3188518 3329641 3496362 3664406
11548 3664406 3878508 4111967 4318487 4545908 4835315 5140350 5463900 5838015 6208255
11539 6208255 6581256 6988714 7404115 7880107 8461433 9180361 10001779 10837036 11652459
11530 11652459 12440080 13224165 13989773 14667428 15303141 15889189 16439673 16991904 17647527
11521A7647527P78680R28500J082084J358445J747783K173626K631594L192510
11513C1540749M114969N732546Q441094J2756837J9299952K8648651M0381124
11506A50915922N2435835O0085715N8082116M3679721J8270725j1336311l5661762
11499C36471961m8167884m7787404l9165137k9082311k1206551j5777540j1978570
11492A23306564r075109p112994o043683n538889n294370n153014m805167m135877
11484G6147461l242667k245997j290392m67542J38395N66858R70339J394245J827703
11475G3798403K384876L099285M184298N904373Q259946J1377271J5686579K2343052
11467A47038083L2756237M7767898O4597656P4923564O7918581L8120883q567961
$$ plain form
11521 17647527 18426207 19354707 20436791 21795236 23543019 25716645 28348239 31540749
11513 31540749 35655718 41388264 49829358 62586195 81886147 110534798 150915922
11506 150915922 203351757 263437472 321519588 365199309 383470034 372133723 336471961
11499 336471961 288304077 240516673 201351536 172269225 151062674 135285134 123306564
11492 123306564 114231455 107118461 101074778 95535889 90241519 85088505 80283338 76147461
11484 76147461 72904794 70658797 69368405 68900863 69039258 69606116 70576455 71970700 73798403
11475 73798403 76183279 79282564 83466862 89371235 97631181 109008452 124695031 147038083
11467 147038083 179794320 227562218 292159874 367083438 435002019 473122902 464554941
11460D64554941n5077282q0811938p6740492n5996233l6569719k3932035j6295634
11453A19131608j1563709q533419o585439n452267m933483m786303m686549m359474
11445F8230965l811957l091575k386119j932972j782039j836811j850561j645866
11437D9893065j359079j153060j138928j262842j444957j688263j929710k024312
11429C7891914j980630j768080j586210j482291j379637j255283j113121r79372
11421B6347290q29670p52683p16234p47619p59437p81398p59189p24412p02193
11412A9574455o44486n80329n45435n61693n86327n52747n39015m72423l88666
11403A4703334l65161l03183k86459l08716l09298k88214k99936k42471k43782
$$ plain form
11460 464554941 409477659 328665721 251925229 195928996 159359277 135427242 119131608
11453 119131608 107567899 99034480 92449041 86996774 82063291 77276988 72590439 68230965
11445 68230965 64419008 61327433 58941314 57008342 55226303 53389492 51538931 49893065
11437 49893065 48533986 47380926 46241998 44979156 43534199 41845936 39916226 37891914
11429 37891914 35911284 34143204 32556994 31074703 29695066 28439783 27326662 26347290
11421 26347290 25517620 24764937 24048703 23301084 22541647 21760249 21001060 20276648 19574455
11412 19574455 18929969 18349640 17804205 17242512 16656185 16103438 15564423 15092000 14703334
11403 14703334 14338173 14034990 13748531 13439815 13130517 12842303 12542367 12299896 12056114
11394A2056114k91516k77304k59197k74313l04136l53213l88024m02976m12131
11385I093304l56821l24733k80054k93478k66537k17283j75958j51241j08098
11376F919101j09768j65091k38432k57831k17877k11886j79437j74994j61607
11367E202178j50803j58826j30669j15505j00123q5553q8353q0124p5983q4617
11357D131622p4284q5148j20417j59263j54062j31475j53685j07418r5068j22663
11347B928139j45740j37825j24714j19147j42611j30520j15591j03249q2151k9137
11337A797454N909M7603M1102k8409m9115r8547j13753o4830j0963m924M388k328
11325A523587k3722l1179k5945p990J0046j1810k6947k4495m954J5772j467j3021
$$ plain form
11394 12056114 11764598 11487294 11228097 10953784 10649648 10296435 9908411 9505435 9093304
11385 9093304 8736483 8411750 8131696 7838218 7571681 7354398 7178440 7027199 6919101
11376 6919101 6809333 6644242 6405810 6147979 5930102 5718216 5538779 5363785 5202178
11367 5202178 5051375 4892549 4761880 4646375 4546252 4460699 4372346 4292222 4216239 4131622
11357 4131622 4057338 3972190 3851773 3692510 3538448 3406973 3253288 3145870 3050802 2928139
11347 2928139 2782399 2644574 2519860 2400713 2258102 2127582 2011991 1908742 1826591 1797454
11337 1797454 1803363 1850966 1892068 1863659 1814544 1715997 1602244 1537414 1526451 1521527 1525915 1523587
11325 1523587 1499865 1468686 1442741 1434751 1444797 1432987 1406040 1381545 1376591 1392363 1390896 1377875
11313A377875j9545n8294k0105N083J5056J8344n672k8449k628K7653K370j087
11301A310601k3615k2784j4655k4160q316j553P969P823l190J0533J4293m188
11289A248758q78m3026m744j9218l1595k0059J2862J7568r384j1363j277J7362
11277A155006J1280O485k1040K8539L7082L20j6790l8109O581L2528r373k2474
11265A170035J3058j064Q800k1247l4915k1746j3844k5506k5505j2970J8300m104
11253A049292k4633k6345k7073N1n183Q871j2298j1406j5460k0484k4767q15O721
11240H96471k0131k2595k9602j40j5590L644J4700N639L8771K8054P20k4271k2096
11227H53574l0221j3260J7738J2882j1064j5285k4205j4021j9696M816O510j7517
$$ plain form
11313 1377875 1358330 1300036 1279931 1285014 1300070 1318414 1312742 1284293 1281665 1309318 1311688 1310601
11301 1310601 1286986 1264202 1249547 1225387 1217071 1215518 1223487 1231310 1228120 1238653 1252946 1248758
11289 1248758 1247880 1204854 1200110 1180892 1149297 1129238 1142100 1159668 1150284 1138921 1137644 1155006
11277 1155006 1166286 1172771 1151731 1180270 1217352 1217672 1200882 1162773 1169354 1201882 1192509 1170035
11265 1170035 1183093 1182029 1190829 1169582 1134667 1112921 1099077 1073571 1048066 1035096 1053396 1049292
11253 1049292 1024659 998314 971241 971292 966109 974980 962682 951276 935816 915332 890565 889750 896471
11240 896471 876340 853745 824143 824003 808413 812057 826757 832396 871167 899221 899941 875670 853574
11227 853574 823353 810093 827831 840713 829649 814364 790159 776138 756442 761258 767768 750251
11215G50251k1691k3041r226l1990j9020M106N728K1266p077m7659l1973r964
11203E79710J0190J2669k179p294Q891j6370m4197n6745k5355m2K3310J2076o370
11190D88294j2326M338J0794n650J2036j6412m3082j917J4511m396O71j767q502
11177D36592n173k5388m238L6035p822M068K7116J6540m277l1570J5840k1072
11165D36651j5257l93K1354J3520j7403r60M943k1354k0404l4700l2117k0448
11153C13432j0589J1873p454k229J7174L9818R229R707j298L843m310m7788k6899
11140C04509J0471R864K5362N0615J8375o230J3923J3244L7342m666k8595J3399
11128D57613j6390l3006j8818O304j5177L672J8717M109L8320n566l7819k8136
$$ plain form
11215 750251 728560 705519 696293 664303 645283 649389 655117 676383 669306 621647 589674 579710
11203 579710 589900 602569 600390 593096 601987 585617 541420 484675 459320 459278 482588 494664 488294
11190 488294 475968 480306 491100 485450 497486 481074 437992 436075 450586 446190 446861 445094 436592
11177 436592 431419 406031 401793 437828 430006 434074 461190 477730 473453 441883 457723 436651
11165 436651 421394 421001 442355 455875 438472 437512 442455 421101 400697 365997 333880 313432
11153 313432 302843 314716 307262 305033 322207 362025 371254 380961 379663 383506 379196 331408 304509
11140 304509 314980 324844 350206 400821 419196 412966 426889 440133 477475 472809 444214 457613
11128 457613 441223 408217 389399 395703 380526 384198 402915 407024 445344 439778 401959 373823
11116C73823r311m601R197q733k886N369L7580K9381M935j9583q428L3881k169
11103D38455k5569J505j3308j3433Q408P115J4954M814q186J249j7062k6404J081
11090C73619K4848P443k410p072k1242l6421k6891k604J7142L1081K218j5989
11078C43722J6479L6829J2799p732j1025J6046R092J0618l0141l0133j7456k511
11066C46587J4838J585M1588M9048J6178l1381O72M213J5183m334k4536j2035
11054D17606P549Q60k706j6246K192k0526J2492L0958L1992K5035J624N292o73
11041D95449Q844O069O862N217J5467K3647M8297O4096Q6877J29116J62627K19844
11029A272412K65488K74587K17547J54252K5181r9482j72211k10284k21067j72458
$$ plain form
11116 373823 364512 359911 369108 360375 357489 362858 400438 429819 434754 415171 406743 440624 438455
11103 438455 412886 414391 401083 387650 396058 403173 418127 422941 414755 416004 398942 372538 373619
11090 373619 398467 405910 403500 396428 375186 338765 311874 309270 326412 357493 359711 343722
11078 343722 360201 397030 409829 402097 391072 407118 416210 426828 396687 366554 349098 346587
11066 346587 361425 363010 404598 453646 469824 438443 439115 443328 458511 454177 429641 417606
11054 417606 425155 426015 423309 407063 409255 388729 401221 432179 464171 489206 490830 496122 495449
11041 495449 504293 510362 517224 522441 537908 561555 609852 673948 760825 889941 1052568 1272412
11029 1272412 1537900 1812487 2030034 2184286 2209467 2109985 1937774 1727490 1506423 1333965
11019A333965j55703r5735m2911o4162p1786m5259k0080k0227l9253k5792K0953
11008G74010p847o274j5453j4745K732L5797L5036k5051L35p713o439M3819O8217
10995H76424K0543K7429N1549R0545J29121J93713K97306M16320L60402J94276
10985B657628J7331j93964l65567l94659l14828k29358j43895q6496q4498n7810
10975H03884n8398m3005R057L1733K0103j9714l5381l5200l426m8193j6853k1668
10963E82939j7423q929M633p399Q613k1418j1748j7185l2475m3819j3131m717
10951D17941j2115o801K2121J8424q713J0314j9386Q920J281o808j1280j9154
10939C94744j0609l413k1684j8211J1440K1003J6167J1265M898m0477n0706J975
$$ plain form
11019 1333965 1178262 1082527 1039616 975454 903668 858409 838329 818102 778849 753057 774010
11008 774010 766163 759889 744436 729691 732423 768220 803256 778205 778540 770827 764388 808207 876424
10995 876424 896967 924396 975945 1066490 1195611 1389324 1686630 2102950 2463352 2657628
10985 2657628 2674959 2480995 2115428 1720769 1405941 1176583 1032688 946192 861694 803884
10975 803884 745486 702481 711538 743271 763374 743660 708279 673079 669653 621460 604607 582939
10963 582939 565516 556587 561220 553821 562434 541016 529268 512083 479608 435789 422658 417941
10951 417941 405826 399025 421146 439570 430857 441171 421785 430705 431986 425178 413898 394744
10939 394744 384135 380722 359038 340827 352267 373270 389437 400702 405600 365123 314417 316392
10927C16392M604k727j1640o70K0880j0967P599P75m880l513J847m419P484J0911
10913C31676J4843l8141o90k4571j4061L0445K5577K1722K835j2786M994j5301
10901C26542k4970j4730j0266Q846J8498K5946n90r613j8392K9392J5456k8631
10889C17488k8346K1217J4960j5529m453k1522j4223N446j6159j3400K7907R544
10877B82930N848R282k7120j0794o560j6044J0899K0992l66R734l1138J6456j
10864B64118j3620j587j8067L2266K3580J0369J8890K9228j0317j5910j2469j1722
10852B94759j5135Q393L4807K2044J7618J728k1761k9766k3427q389j4644J0532
10840B76759M00j5521j174Q182N474k8941m703K8712P279k2690J828J5834L626
$$ plain form
10927 316392 320996 318269 306629 305959 326839 315872 323471 324246 319366 315853 317700 313281 320765 331676
10913 331676 346519 308378 307688 283117 269056 299501 325078 346800 349635 336849 341843 326542
10901 326542 301572 286842 276576 285422 303920 329866 329276 319663 301271 330663 346119 317488
10889 317488 289142 310359 325319 309790 305337 283815 269592 275038 258879 245479 273386 282930
10877 282930 288778 298060 270940 260146 253586 237542 248441 269433 269067 278801 247663 264119 264118
10864 264118 250498 248911 230844 263110 286690 297059 315949 345177 334860 318950 306481 294759
10852 294759 279624 288017 322824 344868 362486 364214 342453 312687 289260 280871 266227 276759
10840 276759 277159 261638 260464 268646 274120 245179 240476 269188 276467 253777 255605 271439 275065
10827B75065j1744J4583J7043L713K3458q304K715j5598k0862j8778PL2746L664
10814B97708j9601j7083j2031O160L4608J3657j4580k3965o742R352R982k596
10802B74869N333q338j967m174j2414N657J2587k3209J8254K3825L2956K00k2994
10789C00585k673L1709J137n0317k0033n325m54k885j3745L168N390J2005Q563
10776B67125M788K0349J3721j4748m109j7315M143J2425J242N996L5735j7617
10764C11735l5356r161M91J2245j5972j9940K4226K3420L4191M750j2597O015
10752C24047l0397J315k255j276j4133J6479J864j0430r995m805M722R90k2268
10739B53858n716K4207K3096J508j7924k8915n098j5796n731M555L2844M482J7129
$$ plain form
10827 275065 263321 277904 294947 298660 322118 313814 316529 300931 280069 261291 261298 294044 297708
10814 297708 278107 261024 248993 255153 289761 303418 288838 264873 258131 267483 277465 274869
10802 274869 280202 271864 269897 265723 253309 258966 271553 248344 266598 290423 323379 323579 300585
10789 300585 297912 329621 330758 280441 260408 255083 254629 251744 237999 241167 246557 258562 267125
10776 267125 271913 292262 305983 291235 287126 269811 273954 286379 287621 293617 329352 311735
10764 311735 276379 267218 267709 279954 263982 244042 268268 291688 325879 330629 318032 324047
10752 324047 293650 294965 292710 291434 277301 293780 295644 285214 275219 270414 275136 276126 253858
10739 253858 248142 272349 295445 296953 279029 250114 245016 229220 223489 228044 260888 265370 282499
10726B82499j0862l946J4239M769m471M154l909j5710K8524j7367j5373K0418
10714B82965j0847j5020L987J2109M463l983j0716l229N801J6202j4987Q183J8914
10701B93842Q835L6154J1126l3771r600k2047J7828K9488J0308J0248j874j8998
10689C31539j0482M883n005q981k9647j3608O126K723J2066K519m133o46J0087
10676B97441R765m3227j9522L0170Q086K075l7586K4859J5421M613n007J8065
10664C05153J5104k0747p129L405R305l213j9737p359J3643l301k3923l8885q198
10651B14118K3161K2263k910Q197J9345P307K0615j1835j7994P87l0728k3412
10639B28914Q069J8860K315j9686j4165J2458K0639K1408J6227M134k3927k0028
$$ plain form
10726 282499 271637 267691 281930 286699 282228 286382 282473 266763 295287 277920 262547 282965
10714 282965 272118 257098 261085 273194 277657 273674 262958 259729 265530 281732 266745 274928 293842
10701 293842 302677 338831 349957 316186 306586 284539 302367 331855 342163 352411 350537 331539
10689 331539 321057 325940 320935 311954 282307 268699 274825 277548 289614 292133 288000 287354 297441
10676 297441 307206 263979 244457 274627 282713 284788 247202 272061 287482 292095 287088 305153
10664 305153 320257 299510 292381 295786 305091 301878 282141 274782 288425 285124 261201 222316 214118
10651 214118 237279 259542 256632 264829 284174 291481 312096 300261 282267 283054 252326 228914
10639 228914 236983 255843 258158 238472 224307 236765 257404 278812 295039 299173 275246 255218
10627B55218k4961J9216K4368J8395P886l2901o098M693J5606K2833j3017j5477
10615B75761q107k360j4017j8355j1145k812m83J4832L464k415j3344J6265L5849
10602B73133R656J574m008j6846r757O090Q863K0631J2209q610j86j5301j8954
10589B58494n732j1972k3020j048J3503N153J7614K2935N906J2118n717k9380
10577B58854r482r07J2940O315N601L213k627Q77j6922o072L161J7398K103j1182
10563B63270p499K979M0505L489j5198j7194k4868k7503J2478p309L0485J510
10551B55145l4598P388L634L370r90j00J5075K3230P798j2307m451j3721m587
10538B44886J3588j2116K8693Q384k3654N929O391R375o714k748j398J0862K0738
$$ plain form
10627 255218 230257 249473 273841 292236 300122 267221 261123 265816 281422 304255 291238 275761
10615 275761 267654 265294 251277 232922 221777 218965 218482 233314 236778 234363 221019 237284 273133
10602 273133 282789 284363 280355 263509 253752 259842 268705 289336 301545 292935 292749 277448 258494
10589 258494 252762 240790 217770 216722 230225 235378 252992 275927 281833 293951 288234 258854
10577 258854 249372 248465 261405 267720 273321 276534 273907 274784 257862 251790 254951 272349 274452 263270
10563 263270 255771 258750 299255 302744 287546 270352 245484 217981 230459 223150 253635 255145
10551 255145 220547 227935 231569 234939 233949 233849 248924 272154 279952 267645 263194 249473 244886
10538 244886 258474 246358 275051 283435 259781 265710 272101 281476 274762 272014 270616 281478 302216
10525C02216J24k9503k9362j3369J1834L1554j135j0791k5295K8529K4853k0952
10513B68703j1794k066J964j2713J9826K7362k8005M478r563k0073j6680K5986
10501B47425R720j4800j7467J1437J3182J3679J3042K3244J6381O571j6223j8244
10489B87947Q776R349k3567j4624j900k7381k6632J4427O615O095j380j6293j4071
10476B07361L0961P687N695P779Q761J5264j781k5448K6919J5832n02J5320o364
10463C07484j5984j4909J8205k142L59K179J8527J4990j082j8768l4487j0663
10451B63709L0891N042q558J187M477Q886k3607j7831J3947L27m164K1936o055
10438B90187M239J7950J889l810j0365J3660J0482j0468m6698k0330j2472J1403
$$ plain form
10525 302216 302340 272837 243475 230106 241940 273494 272359 261568 236273 264802 289655 268703
10513 268703 256909 254843 256807 244094 263920 291282 263277 267755 258192 238119 221439 247425
10501 247425 257145 242345 224878 236315 249497 263176 276218 299462 315843 322414 306191 287947
10489 287947 296723 306072 282505 267881 265981 238600 211968 226395 233010 239105 237725 221432 207361
10476 207361 238322 246009 251704 259483 268244 283508 281727 256279 283198 299030 298528 313848 307484
10463 307484 291500 276591 294796 292654 293013 295192 313719 328709 327627 308859 274372 263709
10451 263709 294600 299642 291084 292271 296748 305634 282027 264196 278143 278470 274306 296242 290187
10438 290187 294426 312376 314265 310455 300090 313750 324232 313764 267066 246736 234264 245667
10426B45667L067L160L442Q625J7656J7920k1491R563k691O382J8960l34p945
10413C01981k3604O910M0689O299j3938k2949n991J5456M101O080K0499j397q978
10400C25158r75n397k3179j6413j1020j6119K2227L9697J3797j2128o437j254
10388C07957k0056j4041m384n212K0594m49J64j1148q221L821R897N905k7500
10375B57327k2177J2151M2696J6230k204J6075M012P993o278k6240l2068l3416
10363B34101N153K3068J3262J2777J8615R370J3323N463r998J3821q206J427O603
10350C38779K4399J1709K415r31j6643l0021j0000P527p20p774j5178J93R225
10337C12980R43m761J1738J8304l294J6574M186j694k119j3303L623R646L2608
$$ plain form
10426 245667 248734 251894 255336 263961 281617 299537 278046 287609 284918 291300 310260 309926 301981
10413 301981 278377 285287 325976 332275 318337 295388 289397 304853 308954 315034 335533 334136 325158
10400 325158 324183 318786 295607 279194 268174 252055 274282 313979 327776 315648 309211 307957
10388 307957 287901 273860 269476 264264 284858 284409 284573 273425 265204 269025 278922 284827 257327
10375 257327 235150 247301 289997 306227 304023 320098 324110 332103 325825 299585 267517 234101
10363 234101 239254 262322 275584 288361 306976 316346 329669 335132 325134 338955 330749 332176 338779
10350 338779 363178 374887 377302 376371 359728 329707 319707 327234 326514 318740 303562 303755 312980
10337 312980 313923 309162 320900 339204 335910 352484 356670 354976 352857 339554 343177 352823 385431
10324C85431p156m219o504j1765p643j483j3102N84j0534n381j2256q353P092
10311C04711l881R969M874J104K4257n98o049J0J1357J0610r177K2627l434j0505
10297C55875K813r826K308l2157k5589k2258K5181J2239J8044L205j9553n621
10285C04661M4774J2115K3398K7286l315M966l674p556J245k4604k1743J9118
10273C76671L000K02k1132k1543J1676o547j7165q250J6076J140R151J6238J714
10260C61231K973j1982j217j8013J2730L761j8348J2515L197J0867P876l634O438
10247C68394n114J2594K536k1913N522M3289o755p616K6644Q280K539J3223K2006
10234D63629q960r157j0460o28J123L773m73j3969P895J5466m953l0022j73p990
$$ plain form
10324 385431 378275 374056 367552 355787 348144 346661 333559 334143 323609 318228 305972 297619 304711
10311 304711 300830 310799 315673 316777 341034 340436 334387 334397 345754 356364 347187 369814 366380 355875
10297 355875 358688 348862 351170 319013 293424 271166 296347 308586 326630 329835 310282 304661
10285 304661 349435 361550 384948 412234 408919 413885 410211 402655 403900 379296 357553 376671
10273 376671 379671 379873 358741 337198 348874 342327 325162 316912 332988 334128 343279 359517 361231
10260 361231 364204 352222 351005 332992 345722 349483 331135 343650 346847 357714 365590 361956 368394
10247 368394 363280 375874 378410 356497 362019 405308 398553 390937 417581 425861 428400 441623 463629
10234 463629 454669 445512 435052 434424 435547 439320 438847 424878 432773 448239 443286 413264 413091 405101
10220D05101J1151K3265j9983k5698J2970n320L10J1291J796j2323J590j6686
10208C87464j953Q310P542o367j2055k8351j1018K0637K643R45K1449q712P967
10195C88501K9109K2907N949j3392O087J7915L2093K1178L0117j2216J50L5332
10183E63730p131j949R188j5810p322m413J4589J921J3363P535K7805N3121O5714
10170G20341O9468Q0474P5668L3794L0454L1324o765o1438p1997o7610n1071n0384
10158G32258n7127k3050o195j2484k064j1680P330j1785j1761J921j0878j4977
10146E79508k8100m104k5248k0722j36J3653M57K9056M711m868J0991j2686K3842
10133E66354L5907K2687M2468K8350L6096K9403M7037J0549k9045r321m4059p2290
$$ plain form
10220 405101 416252 439517 419534 393836 406806 401486 401796 413087 414883 402560 404150 387464
10208 387464 385511 393821 401363 394996 382941 354590 343572 364209 366852 367797 389246 380534 388501
10195 388501 417610 440517 446466 433074 439161 457076 489169 510347 540464 528248 528398 563730
10183 563730 556599 554650 563838 548028 540706 536293 550882 552803 566166 573701 601506 654627 720341
10170 720341 789809 870283 945951 979745 1010199 1041523 1034758 973320 901323 833713 782642 732258
10158 732258 675131 652081 645886 633402 631338 619658 626988 615203 603442 605363 594485 579508
10146 579508 551408 547304 522056 501334 501198 514851 515308 544364 549075 544207 555198 542512 566354
10133 566354 602261 624948 667416 695766 731862 761265 808302 818851 789806 780485 736426 664136
10121F64136j9975m644l0138q121l0308j3441k2232k8496j2464K0404K2131k5393
10109E11459l5938l5220j6621L3427Q713J0909k5308L1178K160K728N3704M3642
10097E84833J0874J2406J3125R841j398K131L51Q339k8042j7314j7593k0135k1670
10084E35748N547J8430O590l301j0763j3558l0287k1769O847o180k0014Q931J9968
10071D96189j8115r392K0512J8136N597r818r39J3231K13J5138J1924j0856j1943
10058E19877J0842J6056p775Q37J369j6600M546o00M8427L6570L3033M4108O6427
10045G57117R5711Q8433M8358o447o4944j01968p1409k3687k4824m421k531j6072
10033F73316P627j5420j1930L4976N7301O3655M3482J6705M988K6049O2889O8619
$$ plain form
10121 664136 644161 639517 609379 601258 570950 557509 535277 506781 494317 514721 536852 511459
10109 511459 475521 440301 423680 457107 465820 476729 451421 482599 484759 487487 541191 584833
10097 584833 595707 608113 621238 631079 629681 631812 632163 640502 612460 595146 577553 557418 535748
10084 535748 541295 559725 566315 563014 552251 538693 508406 486637 493484 487304 467290 476221 496189
10071 496189 478074 468682 489194 507330 512927 503109 502170 515401 515614 530752 542676 531820 519877
10058 519877 530719 546775 539000 539837 541206 524606 529152 528552 576979 613549 646582 690690 757117
10045 757117 852828 941261 989619 983172 918228 816260 744851 721164 696340 691919 689388 673316
10033 673316 680943 665523 653593 688569 745870 809525 853007 869712 874700 900749 963638 1032257
10021A032257R8938J50158K10119K66766L73523N84808J030167J913643L373675
10012I034054M369205L379889J730096k208565n372446l794959j945610j076822
10004D114842o79824m67768l22910k35629j73177j07230r2272r1933j23001r2864
9994A728234n7564j2208l1243k8889m3748q2837p8400l1025k6619o4239n5677
9983A215785l5845n82j4701m3423j5471o781k8052k7398l0614L219j9386k2047
9971I74704l8837k6577k6656k5627j0220l920j8749P813p327l0179j5297R419
9959G88547K6863J9517j6025j7833j7175k1238k885J6017J7154j8969j5279J556
9947G60250J8711O58j019o576l347J0743J4573j4491j3246l1020j7513M575j6824
$$ plain form
10021 1032257 1131195 1281353 1491472 1758238 2131761 2716569 3746736 5660379 9034054
10012 9034054 13403259 16783148 18513244 16304679 10932233 7137274 5191664 4114842
10004 4114842 3435018 2967250 2644340 2408711 2235534 2128304 2036032 1944099 1821098 1728234
9994 1728234 1670670 1658462 1627219 1598330 1554582 1471745 1393345 1362320 1335701 1271462 1215785
9983 1215785 1179940 1179358 1164657 1121234 1105763 1098982 1070930 1043532 1012918 1016137 996751 974704
9971 974704 935867 909290 882634 857007 846787 842867 824118 831931 824604 794425 779128 788547
9959 788547 815410 834927 818902 801069 783894 762656 759771 775788 792942 773973 758694 760250
9947 760250 778961 779619 778600 772024 768677 779420 793993 779502 766256 735236 717723 722298 705474
9934G05474k1670Q774L238o174O060L3144j6879k7846l4277k5511j3852k1339
9922E89142n232J807L1243J8036j8627k0748L553K0657P957m5j7162k4562k9015
9909E57004K573J9718J0306n326J601n603j600k2382k1928P878K4635K6779K6810
9896F20465q656j0253j5442k2864l2j2702k1200j6502k281L994J3868J0772L5069
9883E74236O646k0884n326J4296k575M870l631P447R420q192R924L3037L3671
9870F52939k957L717J9599K6840J1682K1356K341K1807k048j2505q106J6650J3737
9857G65052K5771K5194P36J5706M8384M9378K7877K4891J2904J7009K5691K3531
9845A062124n274K8J9641K6593L3134L3025J8772N1153O7308Q4961J33218J36445
$$ plain form
9934 705474 683804 692578 695816 689642 695702 728846 711967 684121 649844 624333 610481 589142
9922 589142 583910 585717 616960 634996 616369 595621 599174 619831 627788 627743 610581 586019 557004
9909 557004 559577 579295 589601 584275 585876 580273 578673 556291 534363 542241 566876 593655 620465
9896 620465 611809 601556 586114 563250 563218 550516 529316 512814 510533 514527 528395 539167 574236
9883 574236 580882 559998 554672 568968 566393 571263 567632 575079 584499 576307 586231 619268 652939
9870 652939 649982 653699 673298 700138 711820 733176 735517 757324 755276 742771 734665 751315 765052
9857 765052 790823 816017 816753 832459 880843 930221 958098 982989 995893 1012902 1038593 1062124
9845 1062124 1056850 1056878 1076519 1103112 1136246 1169271 1188043 1239196 1306504 1391465 1524683 1661128
9833A661128P8506K5504o5969j09612q7699o4583n3308n8118m8407m3658k0055
9822A213729k3801m752K057J4138J4576R390j4661j6159j6621l6688q420k000
9810A130788p5759o6398k8857k1294k2431k6040P622M107k1372J267K0080j4085
9798H87628k6394Q96J2640j1141r13J420L4163J3590n140J6678K991K205R315
9785I37938P78M531j4681k489J9248r50j4634L5549M7274N1574M8562P4433O1804
9772A248937M8104O5909M9346K4310J6856j115r897j8622k1110N645M362L1847
9760A444572J8475M6166L8564L800m93M2157J4533j0183k2050q661J2762j0736
9748A568906m0282j1666L7179O360J5427L7115M9082k782J3373K5701K2511K682
$$ plain form
9833 1661128 1739634 1765138 1699169 1589557 1501858 1437275 1383967 1325849 1277442 1233784 1213729
9822 1213729 1189928 1185176 1187233 1201371 1215947 1225337 1210676 1194517 1177896 1141208 1132788 1130788
9810 1130788 1055029 988631 959774 938480 916049 890009 897631 901738 880366 881633 901713 887628
9798 887628 861234 862130 874770 863629 862716 864136 898299 911889 906749 923427 926418 928623 937938
9785 937938 938716 943247 928566 926077 945325 944375 929741 965290 1012564 1064138 1112700 1187133 1248937
9772 1248937 1297041 1362950 1412296 1436606 1453462 1452347 1442450 1423828 1402718 1408363 1412725 1444572
9760 1444572 1463047 1509213 1547777 1551577 1551084 1593241 1607774 1597591 1575541 1566880 1579642 1568906
9748 1568906 1528624 1516958 1554137 1560497 1575924 1613039 1662121 1659339 1672712 1698413 1720924 1723606
9736A723606Q10o6526p6591o1550r5789o8783l6878j3572k3739k9784J7937J6949
9724A286090k727j7459l904K9193L0336N6410L0394K0415j2006J5601j3370n9360
9712A359613p9423m9018j3707j4753J0273R288J1531M5879O5326J04216J33530
9701A582755J41347K05244L06763L29103K28017L3978j56420k23271j96430q2162
9691B168924l387L5186K1283m6913j07467o3355R828O4076J66354K14957K31521
9680B691007J83870R8738N9197Q8084P5238P6818R5521M8081p4557j88353k00403
9669B953241j30190p0707j4303M2356M5215O4381O7860O0933J73807L05694N25965
9658D024252Q02843Q81400P13978K39096n29741j048165q69645n57947l14607
$$ plain form
9736 1723606 1724416 1657890 1581299 1519749 1423960 1355177 1318299 1304727 1280988 1251204 1269141 1286090
9724 1286090 1283363 1265904 1262000 1291193 1321529 1377939 1408333 1428748 1416742 1432343 1418973 1359613
9712 1359613 1280190 1231172 1217465 1202712 1212985 1222273 1233804 1279683 1345009 1449225 1582755
9701 1582755 1724102 1929346 2236109 2565212 2793229 2827207 2670787 2447516 2251086 2168924
9691 2168924 2165537 2200723 2222006 2175093 2067626 2004271 2014099 2078175 2244529 2459486 2691007
9680 2691007 2874877 2973615 3032812 3120896 3196134 3272952 3368473 3416554 3341997 3153644 2953241
9669 2953241 2823051 2752344 2738041 2780397 2825612 2889993 2957853 3018786 3192593 3498287 4024252
9658 4024252 4827095 5708495 6422473 6661569 6131828 5083663 4214018 3656071 3341464
9649C341464j73181r3039m7122l5119k007j9091K0961O0696J24077J59934J63607
9638C501180J00284k5565j29087o8798K647Q888J2600o9775j61990k41183k32972
9627B696229j61230o3766j1170O8709Q7552N9583J4405o3422o2247K5133J22371
9616B712147J98873J59993O2377q6155k33309k72073k31385j58332o4667m7077
9606B040392j8986n1674n3010p412P204K5547L324K2375R327r665j1995n2710
9594A902717n4396o1976o1305p6452l0719N049l0609m856R014J2964Q55J0170
9582A620456Q92J6819K8188o583k8837j0777j020J9754J9126M402J8618M5101
9570A726139J5871M584r65j8789j6761m600j6700K2922L9745K9465N71Q528J6561
$$ plain form
9649 3341464 3168283 3075244 3028122 2993003 2990996 2971905 2992866 3053562 3177639 3337573 3501180
9638 3501180 3601464 3575899 3446812 3378014 3380661 3389549 3402149 3332374 3170384 2929201 2696229
9627 2696229 2534999 2471233 2460063 2528772 2616324 2675907 2690312 2626890 2564643 2589776 2712147
9616 2712147 2911020 3071013 3133390 3047235 2813926 2541853 2310468 2152136 2087469 2040392
9606 2040392 2021406 1969732 1916722 1909310 1916514 1942061 1945385 1967760 1977087 1967422 1955427 1902717
9594 1902717 1848321 1786345 1725040 1648588 1617869 1622918 1592309 1587453 1596467 1609431 1610286 1620456
9582 1620456 1621348 1638167 1666355 1659772 1630935 1620158 1619138 1638892 1658018 1662420 1681038 1726139
9570 1726139 1742010 1746594 1745629 1726840 1710079 1705479 1688779 1711701 1751446 1780911 1781482 1790010 1806571
9557A806571n102n924j989P519K605K4773J7219K8270J9540m254l2487J857j50
9544A858448J7893J4832O578j349k198J7504K6735K9162n235j0144Q32J605j9562
9531A935101j196L0746L828K346l5918J746M8936o819J5870J0963L7099K4381
9519B067083L4158M2199R590Q432M7425L7858M496L8042K2279K2162K6835L3768
9507B394327L0293J1600K4112N0178O7846O7055M1595M7967N3255M3614Q2500
9496B914342L8975M9765N4105P1243J03398J26067J59056J27515J20687J39340
9486C904493J75734J98764J70811K10477K53099K80414L08029L87305M48982N72644
9476F910752P51449R12123J110232J395977J639593J836627J965898J950083J842742
$$ plain form
9557 1806571 1801469 1795545 1793556 1801075 1803680 1828453 1845672 1873942 1893482 1889228 1856741 1858598 1858448
9544 1858448 1876341 1891173 1897751 1896402 1894204 1911708 1938443 1967605 1962370 1952226 1953058 1954663 1935101
9531 1935101 1933905 1964651 1968479 1970825 1934907 1936653 1985589 1978770 1994640 2005603 2042702 2067083
9519 2067083 2101241 2143440 2153030 2161462 2208887 2246745 2251241 2289283 2311562 2333724 2360559 2394327
9507 2394327 2424620 2436220 2460332 2510510 2578356 2645411 2687006 2734973 2788228 2831842 2914342
9496 2914342 2953317 3003082 3057187 3128430 3231828 3357895 3516951 3644466 3765153 3904493
9486 3904493 4080227 4278991 4449802 4660279 4913378 5193792 5501821 5889126 6338108 6910752
9476 6910752 7662201 8574324 9684556 11080533 12720126 14556753 16522651 18472734 20315476
9467B0315476J660374J506105J391906J362761J440652J755002K407441L413980
9459C5253697M600034N730842O358432O299178N567825M355098L010474J965797
9451G3141377J409094J344824J351570J243368J219112J607131K531907L927120
9443H7775503N096533N632874N937524O857250Q639981R175301O756520K734758
9435A38606244n034848q568817n726071k821872j060644k26357r3700m05087q67302
9426A13801546j154604j195265q92139l26293L21787P39262O14176l88907j992196
9417A09527367l345319m038697m273416m475919m884590n284311n554389n266046
9409G2404680m451298l391873k367349j528615j123489j329448j916570k394056
$$ plain form
9467 20315476 21975850 23481955 24873861 26236622 27677274 29432276 31839717 35253697
9459 35253697 39853731 45584573 51943005 58242183 63810008 68165106 71175580 73141377
9451 73141377 74550471 75895295 77246865 78490233 79709345 81316476 83848383 87775503
9443 87775503 92872036 98504910 104442434 111299684 119939665 129114966 135871486 138606244
9435 138606244 133571396 125002579 119276508 116454636 115393992 115167635 115073935 114668848 113801546
9426 113801546 112646942 111451677 110559538 110233245 110555032 111294294 111908470 111519563 109527367
9417 109527367 106182048 102143351 97869935 93394016 88509426 83225115 77670726 72404680
9409 72404680 67953382 64561509 62194160 60665545 59542056 58212608 56296038 53901982
9401E3901982k535767k463701k317287j901350j114768R755J199652J937700J940207
9392D8656423J094062k53290j260037j409461j275289j211690j309026j394991
9384D1636701j226019n21802N73667J683427K693355L544051M165929M530200
9376E7079509M352662L807245L158242K487282K261327K732044M000844N997507
9368H5876662Q377288J0556646J2152489J2900022J2797652J1821191R979571
9361A64461521P745463N764485M136929L238496L336168L609112L249017K803820
9353A98345011L036465L589930M038361L362351L38979m087176q112366j0512493
9345A89999062j0713271r482805p586627n542838l957695l265201l551324m033824
$$ plain form
9401 53901982 51366215 48902514 46585227 44683877 43569109 43578864 44778516 46716216 48656423
9392 48656423 49750485 49497195 48237158 46827697 45552408 44340718 43031692 41636701
9384 41636701 40410682 39888880 40462547 42145974 44839329 48383380 52549309 57079509
9376 57079509 61432171 65239416 68397658 70884940 73146267 75878311 79879155 85876662
9368 85876662 94253950 104810596 116963085 129863107 142660759 154481950 164461521
9361 164461521 172206984 177971469 182108398 185346894 188683062 192292174 195541191 198345011
9353 198345011 201381476 204971406 209009767 212372118 212711097 208623921 200511555 189999062
9345 189999062 179285791 169802986 162216359 156673521 152715826 149450625 145899301 141865477
9337A41865477l707272k752471k220920k866634m170687m920093m401152l191367
9329A13634881k405987k437125l204186m409533n386435n838646n722055m898570
9321G9332344l673545k518658j328156J67290J934629L702132M939254M761973
9313H7317263K562961j376867n737151q259579q307951o985370n312852l948752
9305D9951702l103500k622011k201388j739502j231618p77048k38677M18704J234864
9296C9691526K345230L708926N186545O410117O740991N745771L215499j39619
9288G2904986l172221n038413n549859n230691m612445m049711l440631k702328
9280C9108687j799204q51423q1194N13376R87407J450279J854296J796137J243406
$$ plain form
9337 141865477 138158205 135405734 133184814 130318180 126147493 121227400 116826248 113634881
9329 113634881 111228894 108791769 105587583 101178050 95791615 89952969 84230914 79332344
9321 79332344 75658799 73140141 71811985 71979275 73913904 77616036 82555290 87317263
9313 87317263 89880224 88503357 82766206 74506627 66198676 59213306 53900454 49951702
9305 49951702 46848202 44226191 42024803 40285301 39053683 38276635 38037958 38456662 39691526
9296 39691526 42036756 45745682 50932227 57342344 64083335 69829106 73044605 72904986
9288 72904986 69732765 64694352 59144493 53913802 49301357 45251646 41811015 39108687
9280 39108687 37309483 36458060 36376866 36890242 37877649 39327928 41182224 42978361 44221767
9271D4221767M78948o3478j45583J8920J08166M1509j17339k64519m93120q81373
9261D2903898j457500k103091k488327k451703k010536j217107j55362R91536
9253C2011808K082794K987503L455796L263573K399042J184137R2133m10225l70576
9244D6695985k92852n97545j254200j989340k530905k816248k751868k531778
9236C1931249k257854j928216j539484j132973p00231j83553L19807Q11843J267437
9227B6588025J693388K036001K407412K832630L321679L505417K946069J447839
9219D6778460p23188k863303m379545m984709m661620l795447k839288k037365
9211B0493995j440046r89366o30598k97747O0760M83335R35354J381831J720050
$$ plain form
9271 44221767 44700715 44637237 44491654 44510574 44618740 44660249 44542910 44278391 43785271 42903898
9261 42903898 41446398 39343307 36854980 34403277 32392741 31175634 31020272 32011808
9253 32011808 34094602 37082105 40537901 43801474 46200516 47384653 47476786 47066561 46695985
9244 46695985 46403133 45805588 44551388 42562048 40031143 37214895 34463027 31931249
9236 31931249 29673395 27745179 26205695 25072722 24372491 24188938 24508745 25320588 26588025
9227 26588025 28281413 30317414 32724826 35557456 38879135 42384552 45330621 46778460
9219 46778460 46055272 43191969 38812424 33827715 29166095 25370648 22531360 20493995
9211 20493995 19053949 18064583 17433985 17136238 17196998 17680333 18615687 19997518 21717568
9202B1717568J905975J926646J747254J327540O71284j25865j028890j923507
9194B6218005k526899k708279k523840k086778j560217j090110p13055m18859
9186A2589968j15500J98969N79444J079419J603278K057082K199000J940389J176755
9177B3308804L6114j151597k002641k393140k299563j879994j400254r68846o48960
9168A0599923m26998k96862j83601j37266p3790j8626M4752J68450L59309O33911
9158A0669202R29795J098278J044995P22420J97223m02237r15710j183417j218667
9149A0941882j085398r12324p04362n38754m11156k95759j76162j32293j18460
9140F567214j47122j73167j81202k00245k20407j74520j28904j04962q2960j26386
$$ plain form
9202 21717568 23623543 25550189 27297443 28624983 29296267 29170402 28141512 26218005
9194 26218005 23691106 20982827 18458987 16372209 14811992 13721882 13008827 12589968
9186 12589968 12474468 12673437 13252881 14332300 15935578 17992660 20191660 22132049 23308804
9177 23308804 23344918 22193321 20190680 17797540 15497977 13617983 12217729 11248883 10599923
9168 10599923 10172925 9876063 9692462 9555196 9481406 9462780 9507532 9675982 10035291 10669202
9158 10669202 11598997 12697275 13742270 14464690 14661913 14259676 13343966 12160549 10941882
9149 10941882 9856484 8944160 8239798 7701044 7289888 6994129 6817967 6685674 6567214
9140 6567214 6420092 6246925 6065723 5865478 5645071 5470551 5341647 5236685 5153725 5027339
9130E027339j20685j13047r0314q3483p4262p1454j09853j43224j56348j82840
9120C881829j83245j22829j32445j52856j23578j33629j19398j04496r0262o6911
9110B652180r6289r6182j02453j01798q7301q9669p0053m7403m3689m3434n7148
9099A816761j9260n0665o8968l2875k1499k3390l7121k1563k9991j2676k737q074
9087A487942n1301j5859p696K0929M2821N0424O0209O7361O0627K4224J9210j5097
9075A743794m5497m5138m1877m5455o0018o8605o7717n6027o8466l1069m789J1746
9063A220882J1717k1729k9003P35n445l606j0760L9115M3406M0989N2060Q6517
9051A424878J41653R8981M7895k977m070k3942l6395n9559m0276m7579n7708m1281
$$ plain form
9130 5027339 4906654 4793607 4703293 4619810 4545548 4474094 4364241 4221017 4064669 3881829
9120 3881829 3698584 3575755 3443310 3290454 3166876 3033247 2913849 2809353 2719091 2652180
9110 2652180 2555891 2459709 2357256 2255458 2168157 2078488 2008435 1961032 1917343 1873909 1816761
9099 1816761 1797501 1746836 1677868 1644993 1623494 1600104 1562983 1541420 1511429 1498753 1496016 1487942
9087 1487942 1436641 1420782 1413086 1434015 1476836 1527260 1587469 1654830 1715457 1739681 1758891 1743794
9075 1743794 1698297 1653159 1611282 1565827 1505809 1437204 1369487 1313460 1244994 1213925 1209136 1220882
9063 1220882 1232599 1210870 1181867 1182602 1177157 1173551 1162791 1201906 1245312 1286301 1338361 1424878
9051 1424878 1566531 1665512 1713407 1710430 1706360 1682418 1646023 1586464 1546188 1498609 1440901 1399620
9039A399620m3079k9383j5943K1478K6745j8808q813q38o847j3427j2227R803
9027A308281j8538j2682o238J0450k5179m5577k4500l4008m3929j8283L46N230
9015A095373M044L552K161M6537N5878K6559K0114J5698M8898j2026m8849j3454
9003A244485k8651j8029J9495K0598J6023k2227k1515l5125n6571o4113l7140
8992A017230l0564l653l1939m0565l692P150K0097L0685K0183L0084P1035N6202
8980A142253L4275M0113L2503K7272o177l2879k8130L192M746K5995P3577N6390
8968A373130L6455K0650k2933j1820p805n680j9249k4690q777k8079j7109K399
8956A286492J5621J894L3035N5162K6090J3060k5177j7991k8621j1748O443J1618
$$ plain form
9039 1399620 1356541 1327158 1311215 1332693 1359438 1340630 1331817 1330979 1324132 1310705 1298478 1308281
9027 1308281 1289743 1277061 1270823 1281273 1256094 1210517 1186017 1152009 1108080 1089797 1090143 1095373
9015 1095373 1099417 1102969 1105130 1151667 1207545 1234104 1254218 1269916 1318814 1306788 1257939 1244485
9003 1244485 1215834 1197805 1217300 1237898 1253921 1231694 1210179 1175054 1118483 1054370 1017230
8992 1017230 986666 983013 951074 910509 906817 913967 934064 964749 984932 1015016 1086051 1142253
8980 1142253 1176528 1216641 1249144 1276416 1270239 1237360 1209230 1212422 1217168 1243163 1316740 1373130
8968 1373130 1409585 1430235 1407302 1395482 1387677 1381997 1362748 1338058 1329281 1301202 1284093 1286492
8956 1286492 1302113 1304007 1337042 1392204 1418294 1431354 1406177 1388186 1359565 1347817 1354260 1365878
8944A365878j155K3019J7699q425j2216j0271R252j5136l4803j4942k9559J0341
8932A299682K7907L2767L2855K3113J1963J8337N5k4089o7079o6521o2747m7590
8920A178653o1992m3707j3026j3175R513M84j5619J2789L8304J6115k473q82l9429
8907A065555j6293Q675m72m5042j3036J4480q665q337j3740K540J5196M199j3051
8894I92009P635M2536L1167L6781Q040l517m8775l7155o625k5592k5388k390N631
8881I74357J5466J8518J959j7360P571K2723P715n164J287K1574K1634K8519j1516
8868A087283k837J2298j6482j492l452K753K9857N3911J2805J9579j5438j7255
8856A161530K0592K7145m419N0968N7380L6435M4710O0159M7552M3996N5556O6051
$$ plain form
8944 1365878 1364723 1387742 1405441 1397016 1384800 1374529 1383781 1368645 1333842 1318900 1289341 1299682
8932 1299682 1327589 1360356 1393211 1416324 1428287 1446624 1446679 1422590 1355511 1288990 1226243 1178653
8920 1178653 1116661 1072954 1059928 1046753 1056266 1056750 1041131 1053920 1092224 1108339 1105866 1104984 1065555
8907 1065555 1049262 1057937 1057465 1012423 999387 1013867 1005202 996865 983125 985665 1000861 1005060 992009
8894 992009 999644 1042180 1073347 1110128 1118168 1114651 1065876 1028721 1022096 996504 971116 968726 974357
8881 974357 989823 1008341 1010300 992940 1000511 1023234 1030949 1025785 1027072 1048646 1070280 1098799 1087283
8868 1087283 1084446 1096744 1080262 1078770 1075318 1078071 1107928 1161839 1174644 1194223 1178785 1161530
8856 1161530 1182122 1209267 1204848 1255816 1313196 1349631 1394341 1454500 1502052 1546048 1601604 1667655
8844A667655Q4266R0128J23974J94068K22913L55835N14086P21028R87115R40787
8834E901855N97963k9639q06709j109207q54852n16163l34562j94130j10600n8203
8824B485753l6566k0240l953Q807J8103L8499k225k8349k9326K584j0221K326
8812B425192L809J732K9225J5411J6893M2945N5194R7429J21196J40501J26473
8801C076000J48631J51845J51887J61924J87093K10336K03181K56149K73217K99965
8791E120228M04506L97370L41035K70717J69760Q7090R1473J05319J52251J74420
8781G314169N2980m6035n5206Q559J75673K50620L33019L79011M12474L90425
8771I215689L46540M12216N12903O97799J029524J529706K213138K984733L785078
$$ plain form
8844 1667655 1751921 1842049 1966023 2160091 2383004 2738839 3252925 3973953 4961068 5901855
8834 5901855 6499818 6470179 5663470 4554263 3699411 3183248 2848686 2654556 2543956 2485753
8824 2485753 2449187 2428947 2424994 2433801 2451904 2490403 2488178 2459829 2430503 2433087 2422866 2425192
8812 2425192 2429001 2430733 2459958 2475369 2492262 2535207 2590401 2687830 2809026 2949527 3076000
8801 3076000 3224631 3376476 3528363 3690287 3877380 4087716 4290897 4547046 4820263 5120228
8791 5120228 5524734 5922104 6263139 6533856 6703616 6790706 6882179 6987498 7139749 7314169
8781 7314169 7367149 7321114 7265908 7274467 7450140 7700760 8033779 8412790 8825264 9215689
8771 9215689 9562229 9974445 10487348 11185147 12214671 13744377 15957515 18942248 22727326
8762B2727326M508867M938679M782381L938997K508682R34336l32584j001592
8754D3005092j371295j739392j951164j857745j783776j706085j577319j375761
8746B9642555j079034p35566n23603l51129k98492m55701o66136p57476n66073
8737B4209345n7979O88248J445526K114266K467603K593933K453168K015471J458560
8728C9388141J013396O29712M04386L64228J52p92535j720114k320995k476302
8719C4490069k347273k131877j769264j296496q51672m60854p1651K12381K82555
8710B6055918N3638k52062n35592n27574k60107J37410M54888N54662N32208N49638
8700B6763027P12796J032199J391807J782200K066968K287804K528570K953770
$$ plain form
8762 22727326 27236193 32174872 36957253 40896250 43404932 44339268 44006684 43005092
8754 43005092 41633797 39894405 37943241 36085496 34301720 32595635 31018316 29642555
8746 29642555 28563521 27827955 27304352 26953223 26654731 26199030 25532894 24775418 24209345
8737 24209345 24151366 24839614 26285140 28399406 30867009 33460942 35914110 37929581 39388141
8728 39388141 40401537 41031249 41435635 41799863 41800015 41007480 39287366 36966371 34490069
8719 34490069 32142796 30010919 28241655 26945159 26093487 25632633 25560982 25773363 26055918
8710 26055918 26109556 25857494 25321902 24794328 24534221 24671631 25126519 25681181 26213389 26763027
8700 26763027 27475823 28508022 29899829 31682029 33748997 36036801 38565371 41519141
8692D1519141L642830M465625N050107N137555M530080L422248K344762J433079
8684G1545427P64541N18645O30313J145129K299147L826059N208076N788785M942075
8675I6668197K706195k72919l143171n199334n967174n525527m510372l209457
8667G1546438j887429p80306P9423O48567J025840J380306J899713K249186K046286
8658G8208024J240042K79186m62643p16976m87847q3520M88506J460786K764813
8649H2690371L968913M676846M141679K017574j191847m347857o349038p096902
8641G8509739p055096o495523n590919m502201l433405k530761j932059j605382
8633D5364393j612074j689388j596378j321867j027772o05321j56664R2512K75400
$$ plain form
8692 41519141 45161971 49627596 54677703 59815258 64345338 67767586 70112348 71545427
8684 71545427 72309968 72828613 73458926 74604055 76903202 80729261 85937337 91726122 96668197
8675 96668197 99374392 99101473 95958302 90758968 84791794 79266267 74755895 71546438
8667 71546438 69659009 68878703 68958126 69606693 70632533 72012839 73912552 76161738 78208024
8658 78208024 79448066 79727252 79264609 78547633 78059786 77976266 78464772 79925558 82690371
8649 82690371 86659284 91336130 95477809 97495383 96303536 91955679 85606641 78509739
8641 78509739 71454643 64959120 59368201 54866000 51432595 48901834 46969775 45364393
8633 45364393 43752319 42062931 40466553 39144686 38116914 37511593 37354929 37447441 37722841
8624C7722841L92769M57281N62392O23840O22608O70473Q87379J368596K000736
8615D5308915K812475L610089M135032M268771L996508L307034K375335J418887
8607G1233046Q04611P68092J337487K102116K573162K750331K518864J981171
8599H6068880J093429k72003k210688m375820n868186o167525n419473m063598
8591E8785016k587180j196643q2344O99100J383619K115270K811562L221286L151553
8582F8301239K759766K317152J746486R46410R9949m27091j95228P40059J883155
8573G8171897K493389K008319O15189j131845k963438m633734n918745o345461
8565F2295571n916993m987921m031911l195948k465699j825725j413283j353888
$$ plain form
8624 37722841 38115610 38572891 39135283 39759123 40381731 41052204 41939583 43308179 45308915
8615 45308915 48121390 51731479 55866511 60135282 64131790 67438824 69814159 71233046
8607 71233046 72037657 72805749 74143236 76245352 78818514 81568845 84087709 86068880
8599 86068880 87162309 86890306 84679618 80303798 74435612 68268087 62848614 58785016
8591 58785016 56197836 55001193 54918849 55617949 57001568 59116838 61928400 65149686 68301239
8582 68301239 71061005 73378157 75124643 76071053 76171002 75743911 75548683 76288742 78171897
8573 78171897 80665286 82673605 83288794 82156949 79193511 74559777 68641032 62295571
8565 62295571 56378578 51390657 47358746 44162798 41697099 39871374 38458091 37104203
8557C7104203j511959j695642j736977j575386j414632j368832j324470j196529
8549B5279776r49123p25521n02407k73838j02848N698J11012K72549N04245P31423
8539B4350966Q38102P99732P15836N76740L89742K11314q3673m00613l92234o2308
8529B6943604K40275M2710o42600j241825j427527j256666r23597o42655m29054
8520B0662665k00075R2188K33283K08448J18007L8822Q9761J68184L24951N13644
8510B2249878O50482N74960L18818M7920J904K64157N87760O11861J12881m96169
8500B4924452r35582j393514j729667j717895j454199j072091o47711k14530J48409
8491A5907672L69276L48206R4852l67242p52350p81586n54241l75430l31200l88797
$$ plain form
8557 37104203 35592244 33896602 32159625 30584239 29169607 27800775 26476305 25279776
8549 25279776 24330653 23605132 23102725 22828887 22726039 22731737 22842749 23115298 23619543 24350966
8539 24350966 25189068 25988800 26704636 27281376 27671118 27882432 27798759 27398146 27005912 26943604
8529 26943604 27183879 27226589 26583989 25342164 23914637 22657971 21734374 21091719 20662665
8520 20662665 20462590 20554778 20788061 20996509 21114516 21153338 21243099 21411283 21736234 22249878
8510 22249878 22900360 23475320 23794138 23842058 23843962 24108119 24695879 25307740 25420621 24924452
8500 24924452 23988870 22595356 20865689 19147794 17693595 16621504 15973793 15759263 15907672
8491 15907672 16276948 16625154 16720006 16352764 15600414 14818828 14264587 13889157 13557957 13169160
8481A3169160n22854p16082q43186q68317p81158p07677o39120n12382m32378
8472G146006m08582l32493l06616k87466k55890k13225k34828k26745k11100k11969
8462D457092j82869j81873j53455j39476j20835j11185q9032o9781p5775j29212
8452C203599j32628j10106j33816j24569j00253r8666o7074p0456j07029j13772
8442B145230o6588m8979o7129o0731m4087q6967m6120l8282l0757l4866n5609
8431A565115n9296k7898r902J0109m0654k7175p4301p6759m4301l2533k8775l2499
8419A121131l3763l5346m7609j1161l5350k9676l4880k1161l7464m3168r062j3359
8407G69132m1142o9322j4984L4979J3478k8467k3874k3448q329k2539k6260k9767
$$ plain form
8481 13169160 12646306 11930224 11087038 10218721 9437563 8729886 8090766 7578384 7146006
8472 7146006 6737424 6404931 6098315 5810849 5554959 5341734 5106906 4880161 4669061 4457092
8462 4457092 4274223 4092350 3938895 3799419 3678584 3567399 3478367 3408586 3332811 3203599
8452 3203599 3070971 2960865 2827049 2702480 2602227 2503561 2436487 2366031 2259002 2145230
8442 2145230 2078642 2029663 1962534 1901803 1857716 1770749 1724629 1686347 1655590 1620724 1565115
8431 1565115 1505819 1477921 1468019 1478128 1437474 1410299 1335998 1259239 1214938 1182405 1153630 1121131
8419 1121131 1087368 1052022 1004413 993252 957902 928226 893346 872185 834721 791553 782491 769132
8407 769132 727990 658668 643684 678663 692141 663674 639800 616352 608023 585484 559224 529457
8395E29457l2374j1445k7199j1464k8625j4425o932q101J564l770k9563k1842
8383C35281j6407L768k0862k6268l67J3893k1443m379j7613o122J3751o05j618
8370B51009L916m361m092k118j027R814N865J4693K5141J4500K6416j0097P457
8357C37116K3495K1001R608N292j0625m028k1231k3683m6767l5315m5807k3626
8345A85430K2953p411l4393J298Q43Q945j790j6750k9281n147K2299J4134j5450
8332A45680J5086J8946K75J0640K1545M0759L2213O082J5986j2435k7954m0512
8320B26311j6169l5017l0432k6966r352P36n033j3764J6519j3922Q128l676j398
8307I5965k0343r98j8426j1495j0980J0673K2339p525M911J7797O287j8153j6198
$$ plain form
8395 529457 497083 485638 458439 446975 418350 403925 396993 388892 390456 386686 357123 335281
8383 335281 318874 322642 301780 275512 275145 289038 267595 263216 245603 239481 253232 252627 251009
8370 251009 254925 250564 246472 244354 243327 253141 259006 273699 298840 313340 339756 329659 337116
8357 337116 360611 381612 391220 396512 385887 381859 360628 336945 290178 254863 209056 185430
8345 185430 208383 200972 166579 167877 168720 177665 175875 159125 129844 124697 146996 161130 145680
8332 145680 160766 179712 179987 190627 212172 252931 285144 291226 307212 294777 266823 226311
8320 226311 210142 175125 144693 117727 108375 109111 104078 90314 106833 92911 101039 97363 95965
8307 95965 75622 74624 56198 44703 33723 44396 66735 59210 64121 81918 88205 70052 53854
8294E3854J6502O153j076j2873J5604J8705L6890K0402K8807N2725N2887L0293
8282C18873N3538O1400N0100P079p989j1214j0361n220n744j7637j4088k3249
8270C95488j0989P811j4830m9858l7196m3003q058J370j5998k8425k5509L105
8258A73908K6086J5165L4107N0838O4925N5551M0086L9188J4990N850r183l2685
8246D78826k6484l6502k5932L472J6777j287k6627m3126l2756p3806m5892k9229
8234A57434j0147J534j3281l3920Q756J3719k860k9820k7100J6633J6487l0250
8222F7185k6619l0759j1357J9677Q341Q984K0235j3141Q640P252J6697K3405P158
8209A05698K6818L3244M4543N4647K6768k972M755J5164K6397j024Q192J9949
$$ plain form
8294 53854 70356 76509 75433 62560 78164 96869 133759 154161 182968 235693 288580 318873
8282 318873 372411 433811 483911 490990 483001 471787 461426 456206 450462 432825 418737 395488
8270 395488 384499 392310 377480 327622 290426 247423 239365 240735 224737 196312 170803 173908
8258 173908 199994 215159 249266 300104 365029 420580 460666 499854 514844 520694 511511 478826
8246 478826 452342 415840 389908 393380 410157 408870 382243 339117 306361 232555 186663 157434
8234 157434 147287 148821 135540 101620 110376 124095 121235 91415 64315 80948 97435 67185
8222 67185 40566 9807 -1550 18127 26468 35452 55687 42546 51186 58438 75135 98540 105698
8209 105698 132516 165760 210303 264950 291718 288746 293501 308665 335062 334038 342230 362179
8197C62179K0405r179q039J0460m0140o2526p997m141l0892k7392l2393k8770
8185A41575p912Q327O998K4852L1317J5768J6306J5526K9661K9245Q505O219k853
8172C23534K0471L780J4082K1367M0638K4122k4476k9073l8455p6162n8652l3517
8160A87659n2306l2230j3371m464r552J7706J5998l2R923j4279k3253m0106m5192
8147c499j4330R76L3216J8418Q146k0090o964k9684j9160m889J4472J268K9578
8134G458J6935L479J7601Q960j4164K3857N969M480k2366R29M3137K6689J4221
8121A37185L6374J6732j7801j3597J0676k8660n2956m8457k9617r816K2751J1625
8109C4439j6359j6931K0003K7202R521n309n177J7123r492j3591J8860j393P018
$$ plain form
8197 362179 382584 373405 365366 375826 335686 273160 265163 261022 230130 202738 170345 141575
8185 141575 133663 141990 148988 173840 205157 220925 237231 252757 282418 311663 320168 326387 323534
8172 323534 344005 347785 361867 383234 423872 447994 423518 394445 355990 279828 221176 187659
8160 187659 135353 103123 89752 85288 75736 93442 109440 109408 119331 105052 81799 41693 -3499
8147 -3499 -17829 -16853 16363 34781 42927 22837 15873 -13811 -32971 -37860 -23388 -22120 7458
8134 7458 24393 27872 45473 54433 40269 64126 70095 74575 52209 53138 96275 122964 137185
8121 137185 173559 190291 172490 158893 169569 140909 87953 39496 9879 63 22814 34439
8109 34439 18080 1149 21152 48354 57875 52566 47389 64512 55020 41429 60289 58896 65914
8096F5914L4658K8166O131J6322P091k6398k0832n060l1752k9395k4296j9289
8084A260j0160P927l81K4057N334l658J3287J4603l805l2156k9685j2349J412
8071b4314l381K1529L172Q128q809j9898k873J2064J1253J9048L985m263j2035
8058C606k9833J9598J0192j4026j2935k4899Q057J3056L6763J9860M638j7535
8046A6542j1620r187L0177j5285l935j0363J428J9276L214O808N711J839j3038
8033B1567j7834j4354j8080J9754n086J397K8092J6821J1483Q302k8381j5511
8021H170K2410K5582o489j4528m542R770j5568J1484K0823J9113J0228j3540l9662
8008C3251l4923M4893O656p733k937k892N896K7523J8860j5692Q57j9589j9996
$$ plain form
8096 65914 100572 128738 134869 151191 158282 131884 111052 105992 74240 44845 20549 1260
8084 1260 -8900 -973 -1354 22703 28037 24379 37666 52269 48464 16308 -13377 -25726 -24314
8071 -24314 -27695 -6166 -2994 5134 -3675 -23573 -26446 -14382 -3129 15919 19904 15641 3606
8058 3606 -26227 -6629 3563 -10463 -23398 -48297 -40240 -27184 9579 29439 34077 16542
8046 16542 4922 -4265 25912 10627 6692 -3671 -2243 17033 20247 27055 32766 34605 21567
8033 21567 3733 -10621 -28701 -8947 -14033 -12636 15456 32277 43760 52062 23681 8170
8021 8170 30580 56162 49673 35145 30603 40373 24805 36289 57112 76225 86453 72913 33251
8008 33251 -1672 43221 49877 42144 39207 36315 42211 69734 88594 72902 73759 54170 34174
7995C4174k756O295p757j6311l920O447k116J1730J1314R366J0156Q583J2459
7982G7664O527k7627j6956K057J0570N236k1296J310M1221p545L841K8630L7977
7969A41609K0504J2152l0433K1678K5230J5235j391j9544l1313J6246L6762o10
7957B06125j8217k5938q202J6746j1787j6446L469l3263l5353n359k0495j2234
7945C9046M559k404j0167L3623j1833j2432K5617K5443M166J8225K4408J375p880
7932A31746o300j0362m011j8710J2099k277N929M164Q685N114K1694L1864k050
7919A77585M165m23k5228p936J6621o022q469j114n156j1448n649P647j2225j1853
7905A10495j7495l5381j4909O145J1395j2813k5460l534K773N52L1024l913l7338
$$ plain form
7995 34174 31418 37713 29956 13645 9725 16172 14056 25786 37100 46466 56622 65205 77664
7982 77664 84191 56564 39608 41665 52235 57471 36175 37485 78706 71161 75002 103632 141609
7969 141609 162113 174265 143832 165510 190740 205975 204584 185040 153727 169973 206735 206125
7957 206125 187908 161970 153768 170514 158727 142281 145750 112487 77134 71775 51280 39046
7945 39046 43605 41201 31034 64657 52824 40392 66009 91452 95618 113843 138251 139626 131746
7932 131746 125446 115084 111073 92363 104462 102185 108114 112278 120963 126077 147771 179635 177585
7919 177585 181750 181327 156099 148163 164784 158762 150293 149179 144023 132575 126926 134573 122348 110495
7905 110495 93000 57619 42710 48855 60250 47437 21977 18443 21216 21768 52792 48879 11541
7892A1541J5888O894L184k0048J3430J5343J1517j698j6391J684P644L686l4691
7879A7983l124K2711P635K7645J5161j2723l2475l1861k3897K0798R571j9229
7867a805l031r145p939j2363K1898M4531M311k8551l7424j4936j290K8497Q327
7854h920P259Q790j076j1764K11J7638J1827k2147N659J9562K423J7998k993j9747
7840B4720l0140j0517R210K0617K848r679j6209m932J3581L602Q378j8394j9144
7827b6059J5297R717K1723K5387m819q903j3112j8845L51p809K3348j1553O496
7814A1219O020j4561k9470k604L8488N861n586p206k4033r435q479J360n854K5320
7800a8960J9215J5994K5014j8836j7576r655L426O615j9999k0353J5248L583j7807
$$ plain form
7892 11541 27429 34323 37507 17459 30889 46232 57749 56051 39660 41344 48988 52674 17983
7879 17983 14859 37570 45205 72850 88011 75288 42813 10952 -12945 7853 17424 -1805
7867 -1805 -4836 -13981 -21920 -34283 -12385 32146 36457 7906 -29518 -44454 -45744 -17247 -8920
7854 -8920 -1661 7129 6053 -5711 -5500 12138 23965 1818 7477 27039 29462 47460 44467 24720
7840 24720 -5420 -15937 -6727 13890 16738 7059 -9150 -14082 -501 3101 11479 -6915 -26059
7827 -26059 -10762 -1045 20678 46065 41246 32343 19231 386 737 -7072 16276 4723 11219
7814 11219 17239 2678 -26792 -29396 9092 14953 9367 2161 -21872 -31307 -39786 -38426 -44280 -18960
7800 -18960 255 16249 41263 22427 4851 -4804 -1378 5237 -14762 -35115 -19867 -16284 -34091
7787c4091j6841J752m277j331K3605N768J559j7953J810J1972L0800m808k5010
7774b7045l0287q272J7091J2056j7541J4356J2370j7592r936R560j1579j5764
7762g2583j8908l365K0063j146j4981k7650K2199K7020J8365J7775J7398j3204
7750b9017k3439J6732j3428k1258k4147O042q198N170L1134K0222j984J207j1689
7737e2653k0529o860J9270K0096j6961r728p753K7278K5647j3957j929N287k4935
7724e7727J5569J6519K1316k4077Q164K0064N839k6962J771j8078r446m489q049
7711e9586j2624O362J5895k0837J4169K7006N484j9434j5173l726r375k749K5417
7698d9171k4694j1572l463L0644J378N319O907l593r621j6171J6061J4777j6695
$$ plain form
7787 -34091 -50932 -49180 -53457 -54788 -31183 -25415 -23856 -41809 -39999 -28027 2773 -2035 -27045
7774 -27045 -57332 -65604 -48513 -36457 -53998 -39642 -27272 -44864 -54800 -45240 -56819 -72583
7762 -72583 -91491 -94856 -74793 -75939 -90920 -118570 -96371 -69351 -50986 -33211 -15813 -29017
7750 -29017 -52456 -35724 -49152 -70410 -94557 -88515 -96713 -91543 -60409 -40187 -42171 -40964 -52653
7737 -52653 -73182 -80042 -60772 -40676 -57637 -67365 -75118 -47840 -22193 -36150 -38079 -32792 -57727
7724 -57727 -42158 -25639 -4323 -28400 -20236 -172 5667 -21295 -19524 -37602 -47048 -51537 -59586
7711 -59586 -72210 -65848 -49953 -70790 -56621 -29615 -24131 -43565 -58738 -62464 -71839 -74588 -49171
7698 -49171 -73865 -85437 -88900 -58256 -56878 -51559 -44652 -48245 -57866 -74037 -57976 -43199 -59894
7685e9894j9353R710K9450J4945Q734N818o352n466j4264p167j2363k815M0638
7672a8379l628q928p18K6736J9308j1633l4663r425J6230o501k355k262k0393
7659e6611j952J3421J9959K3621l747j2475m265j819m3236k8918K1641L6443J4508
7646b3430o855J114j7329m938k027j4344L927J1923K1945j0487q65J9826J067
7633b0473j2430l025J2975j341J4625J2583k1312j8935k8034l2061J1531J3357
7621g2540O908N609L8274L463p179J629j7341O535M2672m384k3659q080L881J4183
7607a0029o663j275M715k5594p736J4874J3239J4339p260o522N983j1975j6898
7594d0802K083Q269J2866J0682j94N18O535P179J1868r548o196j1702j6879m477
$$ plain form
7685 -59894 -79247 -69537 -40087 -25142 -16408 -10590 -16942 -22408 -36672 -43839 -56202 -59017 -18379
7672 -18379 -22007 -30935 -31653 -4917 14391 2758 -31905 -41330 -25100 -31601 -33956 -36218 -56611
7659 -56611 -58563 -45142 -25183 -1562 -5309 -17784 -22049 -23868 -67104 -96022 -74381 -37938 -23430
7646 -23430 -30285 -29171 -46500 -51438 -53465 -67809 -63882 -51959 -30014 -40501 -41366 -21540 -20473
7633 -20473 -32903 -35928 -22953 -24294 -9669 2914 -18398 -37333 -65367 -97428 -85897 -72540
7621 -72540 -65632 -60023 -21749 -18286 -25465 -23836 -41177 -34642 8030 3646 -20013 -28093 -24212 -10029
7607 -10029 -16692 -17967 -13252 -38846 -46582 -31708 -18469 -4130 -11390 -17912 -11929 -23904 -40802
7594 -40802 -38719 -30450 -17584 -6902 -7096 -6578 -43 7136 19004 9456 3260 -8442 -25321 -29798
7580b9798k703n891N862J772K1429N723k2601j147J67J96k259Q807K1858p105
7566e690j7659N945j6526k306M4670R404p921j5212L915P51j2902r49K62l9o092
7551b0349j0619p049Q116K1746P764P2K51K926n598k5222q341j163j310j0749
7537d9525J4848K5753k617j9055k2626k657L474p699M2208j3541M976q146k570
7524c7177r297M501r679j7603Q486K5651M6002K6432j6684r368J7832j5654O099
7511A9541j3436q773J688l3177j9503k756j3339j2893J0239J0091K600K694k096
7498e9120K5943K2686p487N30j0291R071L0908K0119j3936J4932k2998o632L2064
7485C5789l399k1990j1868J7845n449r932j1419r863K582K1707o224J4750J1946
$$ plain form
7580 -29798 -32501 -38392 -32530 -30758 -9329 -3606 -26207 -27354 -27187 -26991 -29250 -20443 1415 -5690
7566 -5690 -23349 -17404 -33930 -36236 8434 17838 9917 -5295 -1380 -629 -13531 -14480 -14218 -14257 -20349
7551 -20349 -30968 -38017 -29901 -8155 -391 -319 -68 2858 -2740 -27962 -36303 -37466 -38776 -49525
7537 -49525 -34677 -8924 -11541 -30596 -53222 -55879 -52405 -60104 -17896 -31437 -26461 -34607 -37177
7524 -37177 -46474 -41973 -51652 -69255 -60769 -35118 10884 37316 20632 11264 29096 13442 19541
7511 19541 6105 -2668 -980 -34157 -53660 -56416 -69755 -82648 -72409 -62318 -59718 -57024 -59120
7498 -59120 -33177 -10491 -17978 -17448 -27739 -18668 12240 32359 18423 33355 10357 3725 35789
7485 35789 32390 10400 -1468 16377 10928 996 -10423 -20286 -17704 4003 -2221 12529 24475
7472B4475p391R059j7240J1539q0l5276N168Q680j7595l2388j278J7096k0895
7459e6126P229J8034J9193k804q149k3080k725J7296j5237j3917p904o882O657
7446f8415J1249M214J0280J1471K4519N703m978o2r217j0224J02r941j9445j777
7432e6521J0532k9737O782M0073J2074j4807k1840j663J9709N895k480K188m574
7419c4369n447j7593K706L0413j0688k517k905J7731l082O243j8177j7880K1436
7406c4129P092J3296Q056O013j3855r145j1482L049L109j1552k9492j4699J8957
7393f4782K2726Q105J2711p060j491j092J1284K9988j123j49j0273j0988j1970
7380b4114n072j6982p092n867J3768M896n958j3462J0886L2466J3359j0818j2722
$$ plain form
7472 24475 17084 26143 8903 20442 20362 -14914 -9746 -1066 -18661 -51049 -52327 -35231 -56126
7459 -56126 -48897 -30863 -11670 -14474 -22623 -45703 -48428 -31132 -46369 -60286 -68190 -75072 -68415
7446 -68415 -57166 -52952 -42672 -31201 -6682 -979 -5957 -6019 -15236 -25460 -25358 -35299 -54744 -56521
7432 -56521 -45989 -75726 -68944 -28871 -16797 -31604 -53444 -55107 -35398 -29503 -31983 -29795 -34369
7419 -34369 -39816 -57409 -54703 -24290 -34978 -37495 -40400 -22669 -25751 -19508 -37685 -55565 -34129
7406 -34129 -27037 -13741 -5685 328 -13527 -22672 -34154 -31105 -27996 -39548 -69040 -83739 -64782
7393 -64782 -42056 -33951 -21240 -28300 -29791 -30883 -19599 10389 9266 9117 -1156 -12144 -24114
7380 -24114 -29186 -46168 -53260 -59127 -45359 -40463 -46421 -59883 -48997 -16531 -3172 -13990 -26712
7367b6712k4071J851K3600o413j9820k34k867J9357Q80l220o855R546P728j1848
7353c9078r056R853m400j8974J5309K5705j0149M253r742o216O55P735K726L759
7339b7620J3032o966k2737r086P662j0894j6029Q395N1421J9364J263j419J9679
7326B6065r297K271m709l0621o167K3097L486j0824o873L805N770L121m520J9442
7312A4046Q048k1760q462R888r478j7882o389j9886j8349J7159K1079L554J299
7299b7133K6027N124P410j3731j4685m733n838q41k0769J1204K0222R882J1049
7286C188j6665j919r725m804L723J5591l112l1059k5229j1441K3909L6747j1257
7273c2053k6413J2965K5109M944r732l0203l3802J5626O985J4302J0839j8302
$$ plain form
7367 -26712 -50783 -48932 -25332 -31745 -51565 -51799 -54666 -35309 -34429 -37649 -44504 -34958 -27230 -39078
7353 -39078 -48134 -38281 -42681 -61655 -46346 -20641 -30790 -26537 -36279 -42495 -41840 -34105 -31379 -27620
7339 -27620 -14588 -21554 -44291 -53377 -45715 -56609 -72638 -64243 -12822 6542 7805 6386 26065
7326 26065 16768 19039 14330 -16291 -22458 639 4125 -6699 -13572 -9767 -3997 -876 -5396 14046
7312 14046 22094 334 -8128 1760 -7718 -25600 -31989 -51875 -70224 -53065 -31986 -28432 -27133
7299 -27133 -1106 4018 11428 -2303 -16988 -21721 -27559 -28400 -49169 -37965 -17743 -7861 3188
7286 3188 -13477 -15396 -25121 -29925 -26202 -10611 -13723 -44782 -70011 -81452 -57543 -20796 -32053
7273 -32053 -58466 -45501 -20392 -15448 -25180 -55383 -89185 -73559 -66574 -52272 -41433 -59735
7261e9735Q809K7357L483J3872j4841o712o380q265J1264Q495J377J882J3704
7248e690L2057J0504l167l2820j6943j1117J3170J4330k5994L228P007J3182k4463
7235b6716k2304L5960L8388N411N958N369q775k2755k4626j8397J446J0280m911
7222b5672k7492J3856J8549J8174l8o719J1712j0057k0028j4635K0399J2385J8752
7209I186J7907n85k3062M812j0047l3277p978P177J5242r575o940M0025K2499
7196B5384N408k9849k084M47J654J0426j184p269k0912k166j6529K451K0843J3588
7182B08k359k7067P562J7721K899O813J2681Q008O744k0002l5505k124J9828l36
7168d929p545k699k4045m654j342j582j0940r633R253K0975m118l9830k478K0148
$$ plain form
7261 -59735 -50926 -23569 -20086 -6214 -21055 -27767 -34147 -42412 -31148 -22653 -21276 -19394 -5690
7248 -5690 26367 36871 33704 884 -16059 -27176 -14006 324 -25670 -22442 -15435 -2253 -26716
7235 -26716 -49020 -13060 25328 30739 36697 42066 33291 10536 -14090 -32487 -31041 -20761 -25672
7222 -25672 -53164 -39308 -20759 -2585 -2623 -9342 2370 -7687 -27715 -42350 -21951 -9566 9186
7209 9186 27093 26508 3446 8258 -1789 -35066 -43044 -35867 -20625 -30200 -37140 2885 25384
7196 25384 30792 943 -1141 -694 960 11386 10202 2933 -17979 -20145 -36674 -34223 -13380 208
7182 208 -2151 -29218 -21656 -3935 -1036 5777 18458 26466 33210 13208 -22297 -24421 -4593 -4929
7168 -4929 -12474 -15173 -39218 -43872 -45214 -46796 -57736 -67369 -58116 -37141 -41259 -81089 -83567 -63419
7154f3419J7127J0102K1656L420J0433n900p525N758j8015p506R217J9274K848
7141b530j3274l3863J483o329L0632K4193Q414j5734m6689k78j7002J3222r125
7128f6880J1802j0157m974K5360K3842j801j9715j4481J2354K4193K1704l056
7116a809k0523P865N965r066k0469l421N026L876k948J4269N814j6202j272M86
7102c2409j6478K277L5873M053k531N619k7211j8105k4349k933K3165L3681m300
7089b3648l396o118k4330m833M0630j441l3027j510J8643M772L580J7347k9415
7076d2746J7771M6841J3582j096M578N414j0233k2723q838O31q968k985j6032
7063b4804k6867K863J6683K401J2990o207j5219k02L1095K914n5397j6700K017
$$ plain form
7154 -63419 -46292 -36190 -14534 -11114 -681 -6581 -14106 -8348 -26363 -33869 -24652 -5378 -2530
7141 -2530 -15804 -49667 -48184 -54513 -23881 312 8726 -7008 -53697 -53975 -70977 -57755 -66880
7128 -66880 -55078 -65235 -70209 -44849 -21007 -22808 -42523 -57004 -44650 -20457 1247 -1809
7116 -1809 -22332 -14467 -8502 -17568 -38037 -41458 -36432 -32556 -35504 -21235 -15421 -31623 -32895 -32409
7102 -32409 -48887 -46610 -10737 -6684 -9215 -3596 -30807 -48912 -73261 -76194 -53029 -19348 -23648
7089 -23648 -27044 -33162 -57492 -62325 -21695 -23136 -56163 -57673 -39030 -34258 -30678 -13331 -42746
7076 -42746 -24975 21866 35448 34352 38930 44344 34111 11388 2550 3181 -5787 -8772 -24804
7063 -24804 -51671 -48808 -32125 -29724 -16734 -22941 -38160 -38362 -7267 -4353 -59750 -76450 -74433
7050g4433L5047l625k916M771n549J4142n285j0582Q781q66j5627r287R118N309
7036e1002J6675K0395m515K021J0874j392J0934J0361q574J1818j4660j499J5229
7023A6665q464j4366K330j6990l009J3998m376j204N426q514J3233J0621R436
7010A4786o002J5047k169l1277L658P559p681j7112n271J7557L664k574O908p150
6996a0057K211p351P171r412j6591o693p734J0942J0411K1987K754j0601o895
6983a9858J9461l695j8007L654j7j1428k2636l083J5250K2357Q432K359k4801
6970c2012r41J3663J8607n557n900O580l1507m081m365j2514j2188K0050L1053
6957a9112J8818q796q511n139r315P510O549K3368m326J4685K427l5893j2841
$$ plain form
7050 -74433 -39386 -43011 -45927 -41156 -46705 -32563 -37848 -48430 -39649 -40515 -56142 -65429 -56311 -51002
7036 -51002 -34327 -13932 -18447 -16426 -5552 -6944 3990 14351 5777 17595 2935 1436 16665
7023 16665 8201 -6165 -3835 -20825 -23834 -9836 -14212 -15416 -9990 -18504 -5271 5350 14786
7010 14786 8784 23831 21662 -9615 -5957 1602 -6079 -23191 -28462 -10905 -7241 -9815 -2907 -10057
6996 -10057 -7846 -15197 -8026 -17438 -34029 -40722 -48456 -37514 -27103 -5116 -2362 -12963 -19858
6983 -19858 -397 -4092 -22099 -18445 -18462 -29890 -52526 -55609 -40359 -18002 -9570 -7211 -32012
6970 -32012 -32953 -19290 -683 -6240 -12140 -5560 -37067 -41148 -45513 -58027 -70215 -50165 -19112
6957 -19112 -294 -9090 -17601 -22740 -32055 -24545 -17996 5372 1046 15731 18158 -17735 -30576
6944c0576M250j6735J862N737K5367J1824q480j0891J6466P365k9064K574J641
6931a8660m286J662J6964R130k4077l1614K155M0429L474J7344K4798J3494j37
6918E0676k8761l1551k9690j2114M989J3585r036J549J0411q771l3113J7377L1641
6905b2808L091m830N302R112r295J436j4475m715m599K4456l426J6762M8362J748
6891D6121j4880j8488k5699j6307J0373P916l5066J535n746Q257J6368K6564l195
6878b247K0432L967k0350p788P8k355j1264k4169L93J4489J1781R833L7J2804
6864E641k1871M556K0589K4472J4910j1201j9903k1238j2647J2474J0415k0182
6852a3985q51o172R3o119j1242O152o566j0832N652J3505J4268J410l319L899
$$ plain form
6944 -30576 -26326 -43061 -41199 -35462 -10095 1729 -6751 -17642 -1176 6189 -22875 -20301 -18660
6931 -18660 -22946 -21284 -4320 4810 -19267 -50881 -48726 -8297 -4823 12521 37319 50813 50676
6918 50676 21915 -9636 -39326 -51440 -46451 -32866 -41902 -40353 -29942 -38713 -71826 -54449 -22808
6905 -22808 -19717 -24547 -19245 -10133 -19428 -17992 -32467 -37182 -41781 -17325 -20751 -3989 44373 46121
6891 46121 31241 12753 -12946 -29253 -18880 -10964 -46030 -44495 -50241 -41984 -25616 948 -2247
6878 -2247 18185 22152 1802 -5986 -5908 -8263 -19527 -43696 -43303 -28814 -17033 -7200 -7163 5641
6864 5641 -16230 -11674 8915 33387 48297 37096 17193 -4045 -16692 -4218 6197 -13985
6852 -13985 -14836 -21008 -20915 -27034 -38276 -32124 -38690 -49522 -43870 -30365 -16097 -14687 -18006 -14107
6838a4107j0614r41L94k2677Q732j7037p851J1176K934O140K9499Q781j1591o107
6824b3269p09K2117R726j6852k0530J5363Q887k2002O593J9522m676r623Q917
6811f536Q867J3886O966K5827l025j2898k969j3641p028K6277m672l052j1481
6798A6521k4541r396M903L709P963l207k902K2041Q544n808Q021k3634j2294J4492
6784D412J4984j4698k4236j766o711K1659J1789J1300k3350K441J5872J121J9426
6771C2243K807o187k3339j4449J9363J1630R748L604j8528j4241J8400n046K200
6758A8205q727p230m147l993o647J2169K6370M588j6404j7253J04L677q300L916
6744c672J829P764j183j6955p994K6078p53L874k80j356K285P077k4722j2785
$$ plain form
6838 -14107 -24721 -25662 -25268 -47945 -39213 -56250 -64101 -52925 -49991 -43851 -14352 -5571 -17162 -23269
6824 -23269 -23978 -1861 7865 -8987 -29517 -14154 -5267 -27269 -20676 -1154 -5830 -15453 -6536
6811 -6536 2331 16217 23183 49010 45985 33087 30118 16477 9449 35726 31054 28002 16521
6798 16521 -8020 -17416 -12513 -8804 -841 -4048 -6950 15091 23635 17827 25848 2214 -10080 4412
6784 4412 19396 4698 -19538 -21304 -28015 -6356 5433 16733 -6617 -4176 11696 12817 32243
6771 32243 35050 28863 5524 -8925 10438 22068 31816 35420 16892 2651 21051 16005 18205
6758 18205 9478 2248 -1899 -5892 -12539 -370 26000 30588 14184 -3069 -2965 712 -7588 -3672
6744 -3672 -1843 5921 4738 -12217 -20211 5867 5114 8988 8708 7352 9637 16714 -8008 -20793
6730b0793J0027P364j029r626J5567N978l181n402K7642L109j6378j6655J4L826
6716D63L2279P373m8185k5747N641p402J0512L3439J6207L338k0775L638j320
6703I461j3744J6874J3198j0978J4548J3096n6857j7732K8669N266k9607q90J4773
6690a3923J0886J5806L5366K2808j2773j5943J8512J5854l9223j4701P119r381
6678B0407j5564p990p873k692L2343K6483k7287k1379q858J352J0959j276Q219
6665F844j0480k3178j396J228K505J1214L162N879k0324J8347Q181k176J6307
6652A6113L0310l2413j9680J2316L23L029q65j0025j5605J1461M611k887K528
6639g84r223j7972k0799K0006K1399l7685k3571J9486K1386J0200q167L752J7616
$$ plain form
6730 -20793 -10766 -3402 -4431 -14057 1510 7488 4307 -1095 26547 29656 13278 -3377 -3363 463
6716 463 32742 40115 -8070 -33817 -28176 -35578 -25066 8373 24580 27918 7143 10781 9461
6703 9461 -4283 12591 25789 14811 29359 42455 -14402 -32134 -3465 1801 -27806 -28696 -13923
6690 -13923 -3037 12769 48135 70943 58170 42227 60739 76593 37370 22669 29788 20407
6678 20407 4843 -3147 -11020 -13712 18631 45114 17827 -3552 -12410 -11058 -99 -1375 6844
6665 6844 -3636 -26814 -28210 -26982 -24477 -13263 -10101 -4222 -24546 -6199 1982 -194 16113
6652 16113 46423 14010 -5670 6646 6969 9998 9133 -892 -16497 -5036 -425 -3312 -784
6639 -784 -10007 -27979 -48778 -28772 -7373 -45058 -68629 -49143 -27757 -17557 -25724 -21972 -4356
6626d356J9297k6952k1442P359M750Q062J3785Q912p15j199m013O834J9966k9137
6612A151M922K724k7424k1945J7935M629l509L1822J6927o001l1216o952j2703
6599b9640N392l728j3076k1751l001L4031K7174N521m510k7998k7925o138J3471
6586e2178K5399J6666J799P704K2247r299j5579q47k329j2220R604M252j0364
6573a5145k074k1j388J142O56p21N228j170k0J5403O885n489Q363L913j6430j2413
6557a3281n072k267j085m288k882l512m895L6124J0788l014O705K8659p162m8017
6543a3199l1644j486J2248l791o230J8581Q778R566N447K8400K5574r417k1491
6530B1336k920Q286k5486L282Q699P651Q198J0718k9876l3617k4297L48K0748
$$ plain form
6626 -4356 14941 -12011 -33453 -26094 -21344 -13282 503 9415 8700 7501 3488 10322 30288 1151
6612 1151 6073 8797 -18627 -40572 -22637 -18008 -21517 10305 27232 21231 -9985 -16937 -29640
6599 -29640 -24248 -27976 -41052 -62803 -65804 -31773 -4599 922 -3588 -31586 -59511 -65649 -52178
6586 -52178 -26779 -10113 -8314 -610 21637 12338 -3241 -4088 -6417 -18637 -9033 -4781 -15145
6573 -15145 -17219 -17240 -18628 -17486 -16830 -17551 -12323 -13493 -13513 1890 8775 3286 11649 15562 -868 -13281
6557 -13281 -18353 -20620 -21705 -25993 -28875 -32387 -37282 -1158 9630 6616 13321 41980 34818 -13199
6543 -13199 -44843 -46329 -34081 -37872 -44102 -25521 -16743 -7177 -1730 26670 52244 42827 21336
6530 21336 18416 26702 1216 4498 13197 20848 29046 39764 9888 -23729 -48026 -47678 -26930
6517b6930K5018K3432L1822J6205r903q206l3879j3775m903L330L2118j6954j8068
6504f93j7875J3473K2040l8J7681J1782n584Q138M992J0696j5197m213k0648p2
6490B4482k5819j5564J1607L5857l0070l1973J247J9815K495K0169n143Q278n739
6477I642l0504n129K2888K8054k1493l8106K062J0524J6429L914j15o345l575
6464a1754o897L1169j0603j653j1059j3310M850J8162J5461N003m834j5301O04
6451a62K5451j2986j3064r729J4116O056J891k1920p858K4853J823J2204J1416
6438C2091o769l91k812j254K4527J2396j4419j6347L1425K164j8610j5317j7863
6425H821m179N96l1631m429K3301J2654J683M898j8623k4686n848j0718J0622
$$ plain form
6517 -26930 -1912 21520 53342 69547 59644 51438 17559 3784 -1119 2211 34329 17375 -693
6504 -693 -18568 -5095 16945 16907 34588 46370 40786 48924 53916 64612 49415 45202 24554 24482
6490 24482 -1337 -16901 -5294 30563 493 -31480 -30233 -10418 -7923 12246 7103 15381 9642
6477 9642 -20862 -25991 -3103 24951 3458 -34648 -32586 -22062 -5633 -1719 -1834 -8179 -11754
6464 -11754 -18651 12518 1915 262 -10797 -24107 -19257 -1095 14366 19369 14535 -766 -162
6451 -162 25289 12303 -761 -10490 3626 9682 11573 -10347 -18205 6648 8471 20675 32091
6438 32091 25322 24931 22119 20865 45392 57788 43369 27022 58447 60611 42001 26684 8821
6425 8821 4642 5238 -26393 -30822 -7521 5133 6816 11714 -6909 -31595 -37443 -48161 -37539
6412c7539P929L1900K7036j1452j521K419N753j7256n517Q615j5200L608N284
6399D059J874R027K053p264K0470K3249q409N85j0384o104O01k9691L3832K1711
6385E5609j5282k2869k1836L755j363j368j5044J507R412r224n287Q253K036j2577
6371b4278j1898L8588J7981O617m620o884k3683K96n406k3395j5763M686J5292
6358c2467P429k0356j1463J7213J7093l262Q488j4095k5246K4540L9399p613n10
6345h50p2j0012k948k1640l5817J1036J6262L0172J3857K677O086J7597p833j8143
6331C72j9684j2563l305p097N976J459K949K4548M117J4184M920O321k7221k3737
6317b8761p396j4662J1132O710J0457L4469J9286J3014j2565k2565k2427l2686
$$ plain form
6412 -37539 -29610 2290 29326 17874 16353 18772 24525 7269 1752 10367 -4833 -1225 4059
6399 4059 5933 14960 17013 9749 30219 53468 45059 45644 35260 29156 29757 66 33898 55609
6385 55609 40327 17458 -4378 -623 -1986 -3354 -18398 -16891 -7479 -16703 -21990 -13737 -11701 -24278
6371 -24278 -36176 2412 20393 27010 22390 15506 -8177 -7881 -13287 -36682 -52445 -47759 -32467
6358 -32467 -25038 -45394 -56857 -39644 -22551 -25813 -17325 -31420 -56666 -32126 7273 -340 -850
6345 -850 -922 -10934 -13882 -35522 -71339 -60303 -44041 -13869 -12 2665 8751 26348 18515 372
6331 372 -19312 -31875 -35180 -42277 -36301 -34842 -31893 -7345 -3228 10956 15876 22197 -5024 -28761
6317 -28761 -36157 -50819 -39687 -32977 -22520 11949 31235 44249 31684 9119 -13308 -45994
6305d5994j1835L6004J9221o313j3004k9227J8106K4321M894Q171m814J2739j4130
6292a861j1145K0637j3431q148J9435K2968k3007J5968Q849j4807j183k4441K1255
6279A1089Q980O072O843q527j8145p617P126j3575k3988j7024J3993O095O083
6266b2595r754r28P446L521M997k269L2829O503O581m398J5415P054p512p054
6252B9836l809J4053k030k3082J6473O473r458j1444k1697P2J384L7765j0005
6239B4531l5032j0503p99J2067O390p97J2714J631k27j2394j4372l162J4703M1600
6225C6350J3120P063q456q944K431l1218m0800O594K8901O841J0784l559k1115
6212b008n820j866L007K2285K4066j1036j1560j779J4016m167J1140j7875p116
$$ plain form
6305 -45994 -57829 -21825 -2604 -8917 -21921 -51148 -33042 -8721 -3827 4344 -470 12269 -1861
6292 -1861 -13006 7631 -5800 -13948 5487 28455 5448 21416 30265 15458 14275 -10166 11089
6279 11089 20069 26141 32984 24457 6312 -1305 5821 -7754 -31742 -48766 -34773 -28678 -22595
6266 -22595 -32349 -33277 -25831 -22310 -17313 -19582 13247 19750 26331 21933 37348 44402 36890 29836
6252 29836 26027 40080 38050 14968 31441 37914 28456 17012 -4685 -4613 -3229 34536 24531
6239 24531 -10501 -21004 -21803 -9736 -3346 -4143 8571 10202 9975 -2419 -16791 -19953 -5250 36350
6225 36350 49470 56533 48077 39133 41564 10346 -30454 -23860 5041 11882 22666 19107 -2008
6212 -2008 -7828 -9694 -6687 15598 39664 28628 17068 15289 29305 25138 36278 18403 11287
6199A1287j4918j7578p27L618n562k3982K2443J6291l077L116m748j9694N009
6186b8522J3965J0790J0752l360j1945l902Q754R784K6154k993M762j4486k3128
6173c375j7014k847l828K883J3210R737j7648p246L0068j532j0291m322J2480
6160B75j3460k9212J3566J1310P052l257j4830k396P092J4260J1908o864j138
6147e694J9984L1687J6457l0891o794j1407r659R502K1089j4734k35j5085j9926
6134a5706m405l419J3885J462K407m894R63K0966k805J453j0873o079K0300M5246
6120E8501j2002J709k7183r637K1568o672m2711p001J4721Q697q641r76O728K1736
6106A8837R812k1181k5965J6480k6488n780K1717J5882Q484Q35k231J2603J5636
$$ plain form
6199 11287 -3631 -21209 -21936 -18318 -23880 -47862 -25419 -9128 -12205 -9089 -13837 -33531 -28522
6186 -28522 -14557 -3767 6985 3625 -8320 -12222 -3468 6316 32470 29477 34239 19753 -3375
6173 -3375 -20389 -23236 -27064 -24181 -10971 -1234 -18882 -26128 3940 2408 -7883 -12205 275
6160 275 -13185 -42397 -28831 -17521 -10469 -13726 -28556 -30952 -23860 -9600 2308 -4556 -5694
6147 -5694 14290 45977 62434 31543 24749 13342 3683 13185 34274 19540 19305 4220 -15706
6134 -15706 -20111 -23530 -9645 -8183 -5776 -10670 -9707 11259 8454 9907 -966 -7045 13255 58501
6120 58501 46499 48208 21025 11388 32956 26284 -16427 -23428 -8707 -10 -8651 -9627 -2899 18837
6106 18837 28649 7468 -18497 -2017 -28505 -34285 -12568 3314 11798 12633 10402 23005 38641
6093C8641J2191k2752n655p973K754r827m350L952Q46l740Q322j9303j4697o78
6079b2269q874m373J3879J6120k0401m6742J7156M309L7354M1763K92L589J4166
6066D5969j0928p383J3761J6497j0158L120j694l4653O980j0904J4321M11j2817
6053A2522p763j147J8618n083o029r4j0892j5577K21j1002j3190O402J8752J8924
6039D662j875k9848k2074K2942K3763N611L191Q235O991K684n952k5890k472J9041
6025I009J9412Q828l0608l5930N858K8070J7636j8347j0885J7793J0368J7882
6013C9086k191k0353M092n824p792k2829l0855J5557J9216j6065j6384N081K9904
6000i357M4872L0943k4912k8498j3635j9109P248J0153j0470o15j2397n840K8061
$$ plain form
6093 38641 50832 28080 22425 14452 17206 7379 3029 6981 7827 4087 12409 -6894 -21591 -22269
6079 -22269 -31143 -35516 -21637 -5517 -25918 -72660 -55504 -51195 -13841 27922 28214 31803 45969
6066 45969 35041 27658 41419 57916 47758 50878 49184 14531 21511 10607 24928 25339 12522
6053 12522 4759 3612 22230 17147 11118 11024 132 -15445 -15224 -26226 -39416 -33014 -14262 4662
6039 4662 2787 -27061 -49135 -26193 -2430 3181 6372 14607 21598 24282 18330 -7560 -10032 9009
6025 9009 28421 37249 6641 -29289 -23431 4639 22275 3928 -6957 10836 21204 39086
6013 39086 36895 16542 20634 14810 7018 -15811 -46666 -31109 -11893 -27958 -44342 -39261 -9357
6000 -9357 35515 66458 41546 13048 -587 -19696 -12448 -2295 -12765 -13380 -25777 -31617 -3556
5987c556J8190J5202J698l023k1854M565M953k1756o581J9878l76j7031j5966
5974b5657K717J7158J5442j2205o7l71j2503l4073J2653L1256j2148p792K4620
$$ plain form
5987 -3556 14634 29836 31534 28511 6657 11222 16175 -5581 -12162 7716 7340 -9691 -25657
5974 -25657 -22940 -5782 9660 -2545 -2612 -2983 -15486 -49559 -36906 -5650 -17798 -25590 -970
$$ [...]
##END NTUPLES=NMR SPECTRUM
##END=
