##TITLE=Analysis number 314705
Compound Code cc 30013
Book Reference 378/182
Project Code adrs
Chemist Name benw
##JCAMPDX= 6.0         $$ Bruker NMR JCAMP-DX V2.0
##DATA TYPE= NMR SPECTRUM
##DATA CLASS= NTUPLES
##ORIGIN= Bruker BioSpin GmbH
##OWNER= NMR
$$ XWIN-NMR		Version 3.5
$$ Mon Oct 24 14:38:29 2005 GMT Daylight Time (UT+1h)  MAYBRIDGE\NMR@NMR_250MHZ
##.OBSERVE FREQUENCY= 250.131544655141
##.OBSERVE NUCLEUS= ^1H
##.ACQUISITION MODE= SIMULTANEOUS (DQD)
##.ACQUISITION SCHEME= undefined
##.AVERAGES= 16
##.DIGITISER RES= 18
##SPECTROMETER/DATA SYSTEM= dpx250
##.PULSE SEQUENCE= zg30
##.SOLVENT NAME= CDCl3
##.SHIFT REFERENCE= (INTERNAL, CDCl3, 0, 16.4521)
##AUDIT TRAIL= $$ (NUMBER, WHEN, WHO, WHERE, WHAT)
$$ ##TITLE= Audit trail, XWIN-NMR		Version 3.5
$$ ##JCAMPDX= 5.01
$$ ##ORIGIN= Bruker BioSpin GmbH
$$ ##OWNER= NMR
$$ C:\u/data/dgb/nmr/ADRS/11300/pdata/1/auditp.txt
$$ ##AUDIT TRAIL=  $$ (NUMBER, WHEN, WHO, WHERE, WHAT)
(   1,<2005-10-24 14:38:08.82 +100>,<MAYBRIDGE\NMR>,<NMR_250MHZ>,
      <created by zg, POWCHK disabled, PULCHK disabled
       configuration hash MD5:
       62 19 C7 07 E1 42 D1 B7 37 6C 3D D0 77 39 F9 E6
       data hash MD5: 64K
       E7 9C 21 AC DD B2 18 11 31 69 36 8A 41 00 A3 5E>)
(   2,<2005-10-24 14:38:20.07 +100>,<MAYBRIDGE\NMR>,<NMR_250MHZ>,
      <Start of raw data processing
       ef LB = 0.3 FT_mod = 6 PKNL = 1 SI = 32K 
       data hash MD5: 32K
       4F A9 9D 26 87 BD 66 36 20 E1 FD D2 94 C5 27 45>)
(   3,<2005-10-24 14:38:21.82 +100>,<MAYBRIDGE\NMR>,<NMR_250MHZ>,
      <apk 
       data hash MD5: 32K
       31 60 9C C1 7F 56 1F 51 4F 52 79 2D F7 E5 31 CC>)
(   4,<2005-10-24 14:38:22.49 +100>,<MAYBRIDGE\NMR>,<NMR_250MHZ>,
      <abs ABSG = 5 
       data hash MD5: 32K
       74 EF A7 F9 E1 AE A2 B5 E2 04 17 7B 16 AA EF 06>)
$$ ##END=
$$ 
$$ hash MD5
$$ AC D9 84 79 EC A8 E5 C9 27 8C CD 0C B0 FC 30 B3
##$RELAX= 
##$RELAX= 
##$RELAX= 
##$RELAX= 
##$RELAX= 
##$RELAX= 
##$RELAX= 
$$ Bruker specific parameters
$$ --------------------------
##$DU= <C:\u>
##$EXPNO= 11300
##$NAME= <ADRS>
##$PROCNO= 1
##$TYPE= <nmr>
##$USER= <dgb>
##$AMP= (0..31)
100 100 100 100 100 100 100 100 100 100 100 100 100 100 100 100 100 100 
100 100 100 100 100 100 100 100 100 100 100 100 100 100 
##$AQSEQ= 0
##$AQ_mod= 3
##$AUNM= <au_zg>
##$AUTOPOS= <24 >
##$BF1= 250.13
##$BF2= 250.13
##$BF3= 250.13
##$BF4= 250.13
##$BF5= 500.13
##$BF6= 500.13
##$BF7= 500.13
##$BF8= 500.13
##$BYTORDA= 1
##$CFDGTYP= 0
##$CFRGTYP= 5
##$CHEMSTR= <none>
##$CNST= (0..31)
1 1 145 1 1 1 1 1 1 1 1 1 1 1 1 1 1 1 1 1 1 1 1 1 1 1 1 1 1 1 1 1 
##$CPDPRG= <>
##$CPDPRG1= <>
##$CPDPRG2= <>
##$CPDPRG3= <>
##$CPDPRG4= <mlev>
##$CPDPRG5= <mlev>
##$CPDPRG6= <mlev>
##$CPDPRG7= <mlev>
##$CPDPRG8= <mlev>
##$CPDPRGB= <>
##$CPDPRGT= <>
##$D= (0..31)
0 1 0 0 0 0 0 0 0 0.06 0 0 0 0 0 0 0.0002 0 0 0 0 0 0 0 0 0 0 0 0 0 0 
0 
##$DATE= 1130161087
##$DBL= (0..7)
120 120 120 120 120 120 120 120 
##$DBP= (0..7)
150 150 150 150 150 150 150 150 
##$DBP07= 0
##$DBPNAM0= <>
##$DBPNAM1= <>
$$ [...]
##$SUBNAM7= <"">
##$SUBNAM8= <"">
##$SUBNAM9= <"">
##$SW= 20.6930455092707
##$SWIBOX= (0..15)
0 0 3 0 0 0 0 0 0 0 0 0 0 0 0 0 
##$SW_h= 5175.983436853
##$TD= 65536
##$TD0= 1
##$TE= 296.16
##$TE2= 300
##$TE3= 300
##$TEG= 300
##$TL= (0..7)
0 120 120 120 120 120 120 120 
##$TP= (0..7)
150 150 150 150 150 150 150 150 
##$TP07= 0
##$TPNAME0= <>
##$TPNAME1= <>
##$TPNAME2= <>
##$TPNAME3= <>
##$TPNAME4= <>
##$TPNAME5= <>
##$TPNAME6= <>
##$TPNAME7= <>
##$TPOAL= (0..7)
0.5 0.5 0.5 0.5 0.5 0.5 0.5 0.5 
##$TPOFFS= (0..7)
0 0 0 0 0 0 0 0 
##$TUNHIN= 0
##$TUNHOUT= 0
##$TUNXOUT= 0
##$USERA1= <user>
##$USERA2= <user>
##$USERA3= <user>
##$USERA4= <user>
##$USERA5= <user>
##$V9= 5
##$VALIST= <valist>
##$VCLIST= <CCCCCCCCCCCCCCC>
##$VD= 0
##$VDLIST= <DDDDDDDDDDDDDDD>
##$VPLIST= <PPPPPPPPPPPPPPP>
##$VTLIST= <TTTTTTTTTTTTTTT>
##$WBST= 1024
##$WBSW= 4
##$XGAIN= (0..3)
0 0 0 0 
##$XL= 0
##$YL= 0
##$YMAX_a= 372827
##$YMIN_a= -564520
##$ZGOPTNS= <>
##$ZL1= 120
##$ZL2= 120
##$ZL3= 120
##$ZL4= 120
##$ABSF1= 16.45214
##$ABSF2= -4.241032
##$ABSG= 5
##$ABSL= 3
##$ALPHA= 0
##$AQORDER= 0
##$ASSFAC= 0
##$ASSFACI= 0
##$ASSFACX= 0
##$ASSWID= 0
##$AUNMP= <proc_1d>
##$AZFE= 0.1
##$AZFW= 0.1
##$BCFW= 0
##$BC_mod= 0
##$BYTORDP= 0
##$COROFFS= 0
##$CY= 12.5
##$DATMOD= 1
##$DC= 0
##$DFILT= <>
##$DTYPP= 0
##$F1P= 14.0000005364418
##$F2P= -0.99999901652339
##$FCOR= 0.5
##$FTSIZE= 32768
##$FT_mod= 6
##$GAMMA= 0
##$GB= 0
##$INTBC= 1
##$INTSCL= 1
##$ISEN= 128
##$LB= 0.3
##$LEV0= 0
##$LPBIN= 0
##$MAXI= 10000
##$MC2= 0
##$MEAN= 0
##$ME_mod= 0
##$MI= 0
##$NCOEF= 0
##$NC_proc= -3
##$NLEV= 6
##$NOISF1= 0
##$NOISF2= 0
##$NSP= 0
##$NTH_PI= 0
##$NZP= 0
##$OFFSET= 16.45214
##$PC= 1
##$PHC0= -79.55701
##$PHC1= 18.41061
##$PH_mod= 1
##$PKNL= yes
##$PPARMOD= 0
##$PSCAL= 4
##$PSIGN= 0
##$REVERSE= no
##$SF= 250.130017473889
##$SI= 32768
##$SIGF1= 0
##$SIGF2= 0
##$SINO= 400
##$SIOLD= 32768
##$SREGLST= <1H.CDCl3>
##$SSB= 0
##$STSI= 32768
##$STSR= 0
##$SW_p= 5175.98343685301
##$SYMM= 0
##$S_DEV= 0
##$TDeff= 65536
##$TDoff= 0
##$TI= <Analysis number 999999
Compound Code 99
Book Reference 9
Project Code 9>
##$TILT= no
##$TM1= 0
##$TM2= 0
##$TOPLEV= 0
##$USERP1= <user>
##$USERP2= <user>
##$USERP3= <user>
##$USERP4= <user>
##$USERP5= <user>
##$WDW= 1
##$XDIM= 32768
##$YMAX_p= 521586953
##$YMIN_p= -99437
$$ End of Bruker specific parameters
$$ ---------------------------------
##NTUPLES= NMR SPECTRUM
##VAR_NAME=  FREQUENCY,     SPECTRUM/REAL,   SPECTRUM/IMAG
##SYMBOL=    X,             R,               I
##VAR_TYPE=  INDEPENDENT,   DEPENDENT,       DEPENDENT
##VAR_FORM=  AFFN,          ASDF,            ASDF
##VAR_DIM=   32768,         32768,           32768
##UNITS=     HZ,            ARBITRARY UNITS, ARBITRARY UNITS
##FACTOR=    0.157963299565203, 1,           1
##FIRST=     4115.1742678143, 0,             0
##LAST=      -1060.80916903871, 0,           0
##MIN=       -1060.80916903871, -99437,      0
##MAX=       4115.1742678143, 521586953,     0
$$ Real data points
##PAGE= N=1
##DATA TABLE= (X++(R..R)), XYDATA
$$ [...]
14664e7386J5085K8349k651J788J2965M537J7859Q335j8075j6808k5134J0071
14652b1065m842n559j1948J9073J44J0731r704j7697K425O964j4801k2255O791
14639f1743R389J8884J2249N929k915o281N621J1034P460j7340k4659j3243L439
14626e2176N38P966L7913R92k3453j3210J3074L5751j0196j5892M427Q210m540
14613a0596j3897j0765K3580j1927k5149q519J4386J6455J399q410Q255N133j9970
14600d0025j8145q088m447l548j0267N429J8582K7273J2288p926J3603q815k6097
14587e0183Q400K8348J9824j6031j9313j0819J681J5504p493Q692J2237o41J2819
14574C025j1628J422J4380N345k1434k5470O257M0891l302N501p061j2003q225
$$ plain form
14664 -57386 -42301 -13952 -16603 -14815 -1850 2687 20546 28881 10806 -6002 -31136 -21065
14652 -21065 -25907 -31466 -43414 -24341 -24197 -13466 -23170 -40867 -38442 -31478 -46279 -68534 -61743
14639 -61743 -52354 -33470 -21221 -15292 -18207 -24488 -18867 -7833 -373 -17713 -42372 -55615 -52176
14626 -52176 -51638 -43672 -5759 -4767 -28220 -41430 -28356 7395 -2801 -18693 -14266 -6056 -10596
14613 -10596 -24493 -35258 -11678 -23605 -48754 -57273 -42887 -26432 -25033 -33443 -25188 -20055 -40025
14600 -40025 -58170 -66258 -70705 -74253 -84520 -79091 -60509 -33236 -20948 -28874 -15271 -24086 -50183
14587 -50183 -41783 -13435 6389 -9642 -28955 -39774 -38093 -22589 -30082 -21390 -9153 -9794 3025
14574 3025 -8603 -7181 7199 12544 -8890 -34360 -28103 12788 9486 14987 7926 -4077 -12302
14561a2302Q089j8829j2388N688J3070k6692J0156K0071k0101j4073J2218K1926
14549a3167J5219n111j626K544J927o301J0323k770l2956O715p663j9390K2735
14536b9521K415l037K2747K226k681J0646o142J1239j4934L53Q665j1121j9951
14523b9096J2737J6564p216j4696k571J4734o075r625P759O455r857N571Q20k777
14509a7273l81P511K260J3756N824l892j4706M280j4519j1144J733l980Q550r199
14495c1180K21l424J9881P982m82J31q378j7925j5793k1229j2563L145K3512k570
14481e8672L1169L2309M17j8477Q674k0438n985J2118R913O184M857l303j2472
14468a3706j5587K6076r881L53j6078k0166J878J4003j4492l841l193K223J8586
$$ plain form
14561 -12302 -4213 -23042 -35430 -29742 -16672 -43364 -33208 -13137 -33238 -47311 -35093 -13167
14549 -13167 2052 -3059 -4685 -2141 -214 -6515 3808 1038 -31918 -25203 -32866 -52256 -29521
14536 -29521 -27106 -30143 -7396 -5170 -7851 2795 -3347 7892 -7042 -6689 1976 -9145 -29096
14523 -29096 -16359 205 -7011 -21707 -24278 -9544 -15619 -25244 -17485 -11030 -20887 -15316 -14496 -17273
14509 -17273 -17654 -10143 -7883 5873 11697 7805 -6901 -2621 -17140 -28284 -26551 -30531 -21981 -31180
14495 -31180 -30959 -34383 -14502 -6520 -7002 -6871 -15249 -33174 -48967 -70196 -82759 -79614 -56102 -58672
14481 -58672 -27503 4806 5223 -13254 -4580 -25018 -31003 -18885 -8972 -2788 2069 -1234 -13706
14468 -13706 -29293 -3217 -13098 -12745 -28823 -48989 -47111 -33108 -47600 -51441 -54634 -52411 -33825
14455c3825N016r501j3118O324M999r175L583J3454q5M043j9312m884J2110P042
14441c3329J9166K153j8789K160n19j4157J0555K232K588J738j2385j6693K820
14428e2460j1474K1204J909K769K0716l759j3635j968J0012J3508m817j14N182
14415a2927j5737j1573P181N948J3964K2670J0042K996N91j882j8884k9843O918
14402b0536J2638K0261j8392n847j5841R54J6499n372j4223j0317j2251P718R760
14389c4949J9048M4O047J448O127N26M590k1450j592r831k807k0707K5622K5105
14375b779j8369L726j1112q655j2986J2314L4425J166j2320J063o087J1140M581
14362c893O168m251n25j1616Q857P007k4760N406n465k9182J982M1444N452k6195
$$ plain form
14455 -33825 -28809 -38310 -51428 -45104 -40105 -49280 -45697 -32243 -32328 -28285 -47597 -52481 -40371 -33329
14441 -33329 -14163 -12010 -30799 -28639 -29158 -43315 -32760 -30528 -27940 -26202 -38587 -55280 -52460
14428 -52460 -63934 -42730 -40821 -38052 -17336 -21095 -34730 -36698 -26686 -13178 -17995 -18109 -12927
14415 -12927 -28664 -40237 -33056 -27108 -13144 9526 19568 22564 23155 21273 2389 -27454 -20536
14402 -20536 -7898 12363 -6029 -11876 -27717 -26763 -10264 -15636 -29859 -40176 -52427 -44709 -34949
14389 -34949 -15901 -15857 -9810 -8362 -2235 -1709 2881 -18569 -20161 -29992 -32799 -53506 -27884 -2779
14375 -2779 -21148 -17422 -28534 -37189 -50175 -37861 -3436 -2270 -14590 -13527 -19614 -8474 -3893
14362 -3893 2275 -1976 -2501 -14117 -5260 1747 -23013 -17607 -23072 -52254 -50272 -8828 -3376 -29571
14348b9571m316K4740n164j2640L113r866K383K1698R205l5430N268Q178P82L052
14334a8568k120J70K27k6079R999K274J3337M727m343k645P307j6433J0467R264
14320a2416j1742J2950J5681J0604M90J5920n316L32K171m919k4698K0817j4864
14307E010l1704j0224K065P953k730J3102M912J9443j0049q395M268J5335o58
14294H328j5876k3292j3397n454n47N858R622p787j9430K4949K2839R364j4013
14281a8836J3189J37j8127n028J3822K8415k6723k5149K4435K827k1774J5107
14269a7705L012j1126L071K1937K7384K499Q173k8424l6604l148L8765J1413m655
14256A4592m842j2928L788L681k7880o947j694j2272q112J796J2940L031K0041
$$ plain form
14348 -29571 -33887 -9147 -14311 -26951 -23838 -33704 -31321 -9623 -418 -35848 -30580 -22402 -21620 -18568
14334 -18568 -20688 -20518 -20291 -46370 -36371 -34097 -20760 -16033 -20376 -23021 -15714 -32147 -21680 -12416
14320 -12416 -24158 -11208 4473 15077 15567 31487 26171 26503 28674 23755 -943 19874 5010
14307 5010 -26694 -36918 -34853 -26900 -29630 -16528 -11616 7827 -2222 -10617 -6349 8986 8328
14294 8328 -7548 -30840 -44237 -49691 -50238 -44380 -34758 -42545 -61975 -37026 -14187 -4823 -18836
14281 -18836 -5647 -5510 -23637 -28665 -14843 13572 -13151 -38300 -13865 -11038 -32812 -17705
14269 -17705 -14693 -25819 -22748 -811 26573 29072 37245 8821 -27783 -30931 7834 19247 14592
14256 14592 9750 -3178 610 4291 -23589 -30536 -32230 -44502 -52614 -50818 -37878 -34847 -14806
14243a4806J516L177l999j1048J3026N136K3270m210m610j5170r55R087j5761
14230a5347k027J8284L479j2260j4668p536J8722J5131J1994m685m3096j3258
14218d5267J1327n034o862R17J45R076J6067p761p94Q316j513l342J023l28K6066
14203B036Q740j3574j9507l578j041j4521L545o828J695K0573J2412Q575j6887
14190a8360K3J4052N117J652p509j3852N397j7809k4873N24L3445Q074l00k4436
14176c8855J105P639K8023q667P840K263k5556j824J275o266J6195J4260J8583
14163A6015k239O234n38n868j6525j2987j440j1562r69K0520K799j1758N056J4597
14149A335j1141R879P55j7800n535j9244o912J1617K852O152q998p359k0258J2782
$$ plain form
14243 -14806 -13290 -10113 -14112 -25160 -12134 -6998 16272 12062 7452 -7718 -8673 414 -15347
14230 -15347 -17374 910 4389 -7871 -22539 -30075 -11353 3778 15772 11087 -32009 -45267
14218 -45267 -33940 -38974 -45836 -44919 -44774 -35698 -19631 -27392 -28186 -19870 -21383 -24725 -23702 -24030 2036
14203 2036 10776 -2798 -22305 -25883 -26924 -41445 -37900 -44728 -43033 -22460 -10048 -1473 -18360
14190 -18360 -18337 -4285 832 2484 -5025 -18877 -13480 -31289 -56162 -55638 -22193 -14119 -14419 -38855
14176 -38855 -37750 -30111 -2088 -10755 -2915 -652 -26208 -28032 -26757 -33023 -16828 -2568 16015
14163 16015 13776 20010 19472 13604 -2921 -15908 -17348 -28910 -29879 -9359 -6560 -18318 -13262 1335
14149 1335 -9806 73 828 -16972 -22507 -41751 -48663 -37046 -34194 -28042 -37040 -44399 -64657 -51875
14135e1875P419J2012J635k048J5057J2360k3270l530M857k0697n862j1481n434
14122g0857J7111J0707j5731j402J1153P385N994R480K5849l309J6407N002r845
14109G944P672j2764j6574l879Q023o631P857j6587J9375J780m682q557k22J5450
14095a795j5278K090R770j265q246j253j2799l1382j6613L4248K7547R632R321
14082C977j633K4152N820J286J8926j1173M05J3800j7195k4285j8769M820n808
14069e677o283k2611j0677P507J7197K15n847L581j0518K996p776J7290K4651
14056D048j1720k5104p626j514J0145J3714J0335m79J0018m581j904o232L115
14043g785M775k906j2833L045J3760n858Q223J3391j81j7727j9562j892J3737
$$ plain form
14135 -51875 -44456 -32444 -30809 -32857 -17800 -5440 -28710 -32240 -27383 -48080 -53942 -65423 -70857
14122 -70857 -53746 -43039 -58770 -60172 -49019 -41634 -35640 -26160 -311 -3620 12787 17789 7944
14109 7944 15616 2852 -13722 -17601 -9578 -16209 -8352 -24939 -5564 -3784 -8466 -17023 -17245 -1795
14095 -1795 -17073 -14983 -5213 -6478 -14724 -15977 -28776 -60158 -76771 -42523 -14976 -5344 3977
14082 3977 2344 26496 32316 33602 52528 41355 41760 55560 38365 14080 -4689 131 -5677
14069 -5677 -11960 -34571 -45248 -37741 -20544 -20329 -26176 -22595 -33113 -30117 -37893 -20603 4048
14056 4048 -7672 -32776 -40402 -41916 -31771 -18057 -7722 -8201 1817 -2764 -4668 -10900 -7785
14043 -7785 -3010 -5916 -18749 -15704 -1944 -7802 421 13812 13631 -4096 -23658 -25550 -11813
14030a1813P645P13j2977r539j4387P379L3809p770j9618P176j1961J8953r58
14017a3348k060k655J4513K1758p986l9099p885N955J8920Q852j5298j6700K6366
14004h667J3367q599P167J3365j9620l4972K740L2031j0321R81O015J244k4304
13991b9573j1903J4667J8386M167k4454K0219J1356J3027Q581K8876K021k1353
13979C4017j5069J1081L633J0347j1949k0583j0017J1338K1849o979k6533m30
13967G05r441K840J0283J2806k768j1372l883n244J8234J5647j7892m655m786
13954D74j8337l8354j4611R710K5268j7871j574K0753J8362J5764j248j1550K0066
13941F852N770k54K80j0829m988J1669K4548R555j2215k4103j5346j1678Q682
$$ plain form
14030 -11813 -4168 -3455 -16432 -25971 -40358 -32979 830 -6940 -26558 -19382 -31343 -12390 -13348
14017 -13348 -15408 -18063 -3550 18208 10222 -28877 -36762 -30807 -11887 -3035 -18333 -35033 -8667
14004 -8667 4700 -3899 3268 16633 -2987 -37959 -35219 -3188 -13509 -12528 -6513 -5269 -29573
13991 -29573 -41476 -26809 -8423 -4256 -28710 -8491 2865 15892 24473 53349 55370 34017
13979 34017 18948 30029 33662 44009 32060 11477 1460 12798 34647 27668 1135 705
13967 705 -8736 -5896 4387 17193 14425 3053 -830 -6074 12160 27807 9915 5260 474
13954 474 -17863 -56217 -70828 -61118 -35850 -53721 -55295 -34542 -16180 -416 -1664 -13214 6852
13941 6852 12622 12368 12648 1819 -3169 8500 33048 42603 30388 6285 -9061 -20739 -12057
13928a2057J3209Q248j5864l4348j9182L4805K6109p591n057m32M594r757R293
13915h030J7980J1561q228J3223M943k4870l964R312M427j7898K280o385q403
13902a4052Q142K9804j8068k8760j9418K6008L4945K5716K0353P948j7550o801
13890D8267J2640K0512J8884k614N551j8296l3928l015J0508m0073m1530J621
13878b1473J4014J3532O0q593L038J068J1195K018p809P575J3044k1832J8819
13865B4656L1709o773j5494j5274j3749k4595o431K7765K1240M719O346j5560
13853A8559l2894n337p832K9314K3757j1571j2737p180j041J1502K2155k1397
13841E298J0898j0636j4710L631J6335j0920m236k394R890M716p226J308o182
$$ plain form
13928 -12057 1152 9400 -6464 -40812 -59994 -25189 920 -6671 -11728 -12160 -7566 -17323 -8030
13915 -8030 9950 21511 13283 26506 31449 6579 2615 11927 16354 -1544 736 -5649 -14052
13902 -14052 -5910 23894 5826 -22934 -42352 -16344 18601 44317 64670 72618 55068 48267
13890 48267 60907 81419 100303 97689 103240 84944 51016 48001 58509 18436 -23094 -21473
13878 -21473 -7459 6073 6133 -2460 578 1646 12841 14859 7050 14625 27669 5837 24656
13865 24656 56365 49592 34098 18824 5075 -19520 -25951 1814 23054 27773 34119 18559
13853 18559 -14335 -19672 -27504 1810 25567 13996 1259 -5921 -6962 4540 26695 5298
13841 5298 16196 5560 -9150 -5519 10816 -104 -4340 -6734 3156 7872 646 1954 -4228
13828d228m670M494L399j4131n978L271J2759O870K374M564j4621L900K088Q715
13814H806l402j3708J7559J9542j7157P948l019l2787k3633k32J4443k638J8022
13801a0256j8176J0587K2976P390k4386j7271o467J5492K6666J2405k736j6639
13789d15O3Q763p169O408N092K061q538q383L329r072n246j2704J5311K8476J2118
13774C0094j9072k5591L767N249O729o070M300J0891o915j6192j6762P978l045
13761b4639l2038m71K8213q25N822J985K525M1270O382j8298j0548N667J3349
13748A8394j2191n213O335j8029R364j2412j8066L902K4453K9552J2503N069j5172
13735B8489j1850j4482M376J443q918r018k1725j0305K0491K0903J3198J2856
$$ plain form
13828 -4228 -8898 -4404 -1005 -15136 -21114 -17843 -5084 1786 4160 8724 -5897 -1997 91 8806
13814 8806 5404 -8304 9255 28797 11640 19588 16569 -16218 -39851 -40083 -25640 -28278 -10256
13801 -10256 -28432 -17845 5131 12521 -11865 -29136 -35603 -20111 6555 18960 16224 -415
13789 -415 -352 8411 1242 7650 12742 14803 6265 -2118 1211 -7861 -13107 -25811 -10500 17976 30094
13774 30094 11022 -14569 -10802 -5553 1176 -4894 -594 10297 3382 -12810 -29572 -21594 -24639
13761 -24639 -56677 -57148 -28935 -29760 -23938 -21953 -19428 21842 28224 9926 -622 5045 18394
13748 18394 6203 990 7325 -10704 -1340 -13752 -31818 -27916 -3463 26089 38592 43661 28489
13735 28489 16639 2157 6533 7976 -942 -9960 -31685 -41990 -21499 -596 12602 25458
13723B5458J2490K1592Q452q21j7107l481K0234J8261j4432j84n991J5201L4652
13710A14324L8813R842j82L8190N3958N0814O0404K4682K2076K1069J2175K3738
13698D69903j7361n7783p4373n7902k0224k3386j657j7996k4458j6311j5121k2813
13686A20518j7164p420k1369N083P91j647J5270j1931j6026q761J2126O889k189
13673G4170J9270m350j0037j1146J2094m872j0635J2294J6265j389j6439Q799
13661H4024L4003P278L5791L2063m589J3492J8085L2647L6951L4519L6673M1945
13649D02882Q7318M9374O4215R3071J21649J10115J53808J94613K55137L14389
13639A846571M30668N32236N80079N94239O01398N18133L32439Q3014j33791l14619
$$ plain form
13723 25458 37948 59540 67992 67171 50064 46583 66817 85078 70646 70462 64471 79672 114324
13710 114324 153137 162979 162797 200987 254945 305759 366163 390845 412921 433990 446165 469903
13698 469903 452542 394759 320386 262484 242260 218874 217217 199221 174763 158452 143331 120518
13686 120518 103354 95934 74565 79648 80439 78792 94062 82131 66105 57344 69470 76359 74170
13673 74170 93440 89090 79053 67907 80001 75129 64494 76788 93053 91664 75225 84024
13661 84024 118027 125305 161096 193159 188570 202062 220147 252794 289745 324264 360937 402882
13649 402882 490200 539574 603789 696860 818509 928624 1082432 1277045 1532182 1846571
13639 1846571 2277239 2809475 3389554 3983793 4585191 5103324 5435763 5518777 5384986 5070367
13629E070367m84259n62222n47652n10650m42780l73548l02904j82672j40381
13620A523299j03609j11050j24147q4485j06006j11811o3324r7245o6585l6897
13610F18140k4855j4688l0378o7263k9587k1318k5512j8096k1436k4398l0623
13599C09986m2534l7702j3888k543k1146o549k0541l0214k1835j2723K0671J5667
13587A36649q664k2999p418j6297l0329O7j6433j4006J3201j373l627r353n250
13574A4168j572J4099J2786R849q348j1294p851j1199m236j4342J6593J5948J8611
13561D3212J606j6278j0301n734q383l173J744K4339Q904j884k3279j4289N644
13548B128J8204j0041k8070m562Q833r519o933j3754N374N6328J1325o357k2008
$$ plain form
13629 5070367 4586108 4023886 3476234 2965584 2522804 2149256 1846352 1663680 1523299
13620 1523299 1419690 1308640 1184493 1100008 994002 882191 818867 721622 655037 618140
13610 618140 593285 578597 548219 480956 451369 430051 404539 386443 365007 340609 309986
13599 309986 267452 229750 215862 213319 192173 185624 165083 134869 113034 100311 120982 136649
13587 136649 127985 104986 97568 81271 50942 51009 34576 20570 33771 32398 28771 19418 14168
13574 14168 12596 26695 39481 49330 40982 29688 21837 10638 6402 -7940 8653 24601 43212
13561 43212 44818 28540 18239 12505 4122 949 2693 27032 35936 34052 10773 -3516 2128
13548 2128 20332 10291 -17779 -22341 -13508 -23027 -29960 -43714 -38340 17988 29313 22956 948
13535I48J094J0946q926j5985k02j0164K935M788o637R312P035j9974q083J586
13521c1327j322O833j2888j6081K433J3495J9526K6269O196J0080p589k0794k3516
13508b8685j220N839Q912R296J5212j3256R354m244j1411j3769P152J6792j9849
13495a9877N173J0042K0385j6524p513K078L0581J4072n536q097N114M990j6125
13482A8763k5958J2855m632q119Q851p277O807l261j913l690J9334K2977k8857
13469E880k1709l381q872M11p265J8917K0729k54p52q727j3979R03P604q866P845
13454a1516P08k565P419l402N391N274k672N303o322l202K7973K2896k023j5669
13440B7593j3200K212o650m0396j3353k7J9136K4209K3186l0032j7516K644J540
$$ plain form
13535 948 2042 12988 4062 -11923 -12125 -22289 -19354 -14566 -21203 -11891 -4856 -24830 -32913 -31327
13521 -31327 -32649 -25816 -38704 -54785 -52352 -38857 -19331 6938 13134 23214 15625 -5169 -28685
13508 -28685 -29905 -24066 -15154 -5858 9354 -3902 5452 1208 -10203 -23972 -16820 -28 -19877
13495 -19877 -14704 -4662 15723 -801 -8314 -6236 24345 38417 32881 24784 29898 34888 18763
13482 18763 -7195 5660 1028 -7091 1760 -5517 1290 -1971 -3884 -7574 11760 34737 5880
13469 5880 -15829 -19210 -28082 -27671 -34936 -16019 4710 4456 3704 -5023 -19002 -18099 -10495 -19361 -11516
13454 -11516 -10808 -13373 -5954 -9356 -3965 1309 -1363 3940 -2382 -5584 22389 45285 43262 27593
13440 27593 14393 16605 9955 -30441 -43794 -43821 -24685 -476 22710 -7322 -24838 -22194 -20654
13427b0654K6414N16k8752P46K0764j1938r304j6352K5745K666q740R335k7788
13414c7342K369N0511Q068j3590j4010o915l239k578K2936K748K3286K825j2980
13401B2089M357k8323q420N754K476r070r606j7866l2341O217N1958K4650j4769
13388b894k3001J6216N988J3230J316J9707J7149j7256j1052n361J1225j146l055
13375B1066n132L32J222k8759p301L0727O785N563J411K4561L440k1282j5014
13362A7619j138J1948J2052J3231J6983J6049j3644Q567J5227j4888l251R398
13350H8153J024J597J5470J0912r49K1422K4812K3217M3629P7987J07819J55918
13338E71011K21603K63089K04128k4410k01339k52442k00996j34920o9147k9283
$$ plain form
13427 -20654 5760 6276 -22476 -21730 -966 -12904 -22208 -38560 -12815 -10149 -18889 -9554 -37342
13414 -37342 -34973 15538 23606 10016 -3994 -10909 -14148 -16726 6210 8958 32244 35069 22089
13401 22089 26446 -1877 -10297 -4543 -2067 -11137 -20743 -38609 -70950 -64733 -12775 11875 -2894
13388 -2894 -25895 -9679 -3691 9539 10855 30562 47711 30455 19403 14042 25267 24121 21066
13375 21066 15934 16266 17488 -11271 -18572 12155 18940 24503 25914 50475 53915 32633 17619
13362 17619 16481 28429 40481 53712 70695 86744 73100 81667 96894 82006 78755 88153
13350 88153 89177 90774 106244 117156 116207 137629 162441 185658 229287 307274 415093 571011
13338 571011 792614 1055703 1259831 1235421 1034082 781640 580644 445724 376577 347294
13328C47294k7654k7878l9155k0867j4881j335M779j6946j2371q387j4405o877
13316A61317r524J5118j020j2446J8771J7576K1907n870k0928J9516J8266K6473
13304B49156K7083M5898M0322N5910O3581O7501J00270J18904J57035K69989M52431
13293A648080O67627Q55482P18550J30616n90697q64132o93410m27609k70547
13284A173960j92459j22140n6491l2999O460p365M096n508m1488l9161n2268o5244
13272E69393n8382p3702m5923k2226o919q814j162L992j428l1520p107M0491L7548
13259C94241J4374J2734J9935N8101N6890O4377R1305J16466J57416K62026M22961
13248A670826O51671Q52047P89425K43514n26394q76480p06886m65011k75778
$$ plain form
13328 347294 319640 291762 252607 231740 216859 215524 220303 203357 190986 182599 168194 161317
13316 161317 151793 166911 165891 153445 172216 189792 211699 205829 184901 204417 222683 249156
13304 249156 276239 322137 362459 418369 481950 549451 649721 768625 925660 1195649 1648080
13293 1648080 2315707 3171189 3889739 4020355 3429658 2565526 1872116 1444507 1173960
13284 1173960 981501 859361 802870 769871 776331 768966 773062 767554 726066 686905 634637 569393
13272 569393 511011 437309 391386 369160 362241 353427 352265 356257 354829 323309 316202 356693 394241
13259 394241 408615 421349 441284 499385 556275 620652 711957 828423 985839 1247865 1670826
13248 1670826 2322497 3174544 3963969 4207483 3681089 2804609 2097723 1632712 1356934
13239A356934j51466r9626n5256l9539P90M2558L6883L2608J3379j5503q6446
13228A035316j11216j08794j11984q6284o9202l0382m4909o7232l7100j3907k42
13217C54064k9022k0607j2407o779N467J0999p395L767Q97J7635L6637Q6491J27217
13204E66964J50213K03028K70058K36353P9265j06467k40284k44781j73574j10841
13194F29934l8091k1246M261K0862L1045M9089O0150M4652K4671M734l2333r3458
13182F84270q9347p7398o8098l7183n4007m0947j1603l7069j2544k1084l662o421
13170B24907l6167j5244N885p227j8255k1683O059p950j7407j3673o902j7594
13158G4749j6296m019J9552K005K2544L8525l94K814j2954j7625R03K8060J8432
$$ plain form
13239 1356934 1205468 1105842 1050586 1011047 1011837 1054395 1091278 1123886 1137265 1121762 1035316
13228 1035316 924100 815306 703322 617038 547836 517454 472545 405313 368213 354306 354064
13217 354064 325042 304435 292028 285249 290716 301715 294320 298087 298984 316619 353256 439747 566964
13204 566964 717177 920205 1190263 1426616 1505881 1399414 1159130 914349 740775 629934
13194 629934 591843 570597 574858 595720 626765 675854 736004 780656 805327 810061 777728 684270
13182 684270 594923 517525 449427 412244 358237 317290 305687 268618 256074 234990 231328 224907
13170 224907 188740 173496 179381 172154 153899 132216 138275 130325 112918 99245 92343 74749
13158 74749 58453 54434 73986 75991 98535 137060 136666 139480 126526 108901 109804 137864 156296
13145A56296J8591K4656O955J1324j6751P229K7203j6663m5004l2497k1613j2901
13133A06825N184n470j5048m1005j0480M479J614N010j600k0170o769J3851L304
13120C9725J1879N50j4431m081j819n784O54R685M840p364r974j167P577L536
13106C3826k791k3499K6862M297l7585k0707j2507R204L5072K5616M225L757p304
13093C8466k5081O92J6689Q092j4824j1469J8021l587j6537m811Q375J5839j9135
13080A0730j1921m225L292q911J6576n798l8306O574J9237J8771K4317N095k8584
13067F847J4093K8445j0747l0659j1441k338l0000K3460m948N984J2743J7042
13055A8481J3830J577Q799j1465L844M952j3378m520J6952j1700Q474K3423o376
$$ plain form
13145 156296 174887 199543 206498 217822 201071 208300 235503 218840 173836 141339 119726 106825
13133 106825 112009 106539 91491 50486 40006 44485 46099 51109 49509 29339 22570 36421 39725
13120 39725 51604 52154 37723 33642 31823 26039 26693 36378 41218 33854 23880 22713 30290 33826
13106 33826 31035 7536 34398 38695 1110 -19597 -32104 -22900 12172 37788 42013 45770 38466
13093 38466 13385 14077 30766 38858 24034 12565 30586 26999 10462 5651 14026 29865 10730
13080 10730 -1191 -5416 -2124 -11035 5541 -257 -38563 -31989 -12752 6019 30336 35431 6847
13067 6847 20940 49385 38638 7979 -3462 -5800 -35800 -12340 -17288 -11304 1439 18481
13055 18481 32311 33888 42687 31222 35066 40018 26640 22120 39072 27372 35846 59269 52893
13042E2893l6614P748L8993K7386K8258K3620K5246N9644L5870L6619K7113L2321
13030C59097K930N706k7900l1287k3814k7901k2880k5592m7515k6726l3421j5268
13018H5429n592J2540p087l2266k4732J0925N417O35L759o996l3212j2000K7500
13005B4320k8329k1691K4349L7914J3616l0176k1523L310R786q830j3703j271
12993a2228p41J6710j761j6150J0196M6077R107l1849J1108j7424k8621J4821
12981g55K109k8693R118J2732l331K0565j216Q866K1384J0874J0424k6600l115
12968C2362J3698L693j9355J1353J0424j7397j6013j3987j471L55N327L493j9213
12955f731l142K2937K0890J9385o67l1089M684n705j9816j4290q57k1710J1801
$$ plain form
13042 52893 16279 24027 63020 90406 118664 142284 167530 227174 263044 299663 326776 359097
13030 359097 362027 367733 339833 308546 284732 256831 233951 208359 160844 134118 100697 85429
13018 85429 79837 92377 85290 53024 28292 39217 44634 45269 49028 42032 8820 -3180 24320
13005 24320 -4009 -25700 -1351 36563 50179 20003 -1520 1790 11576 2746 -10957 -12228
12993 -12228 -12969 3741 1980 -14170 -3974 42103 51210 19361 30469 13045 -15576 -755
12981 -755 1354 -27339 -18221 -5489 -8820 11745 10529 19395 40779 51653 62077 35477 32362
12968 32362 46060 49753 30398 41751 52175 34778 18765 4778 3307 3662 8989 12482 -6731
12955 -6731 -9873 13064 33954 53339 52672 21583 26267 20562 746 -13544 -14401 -36111 -24310
12942b4310J0088N118J0955J3371L330q474j2947q07J5666J1232j615l210q035
12929A0362Q060J5024J6437R82j8818j8425n053K4434K3433j8748l7026j8353
12917a7691m477J2066k518o758K2867J3527j1670J491J3526P906O325o629P788
12904C5753N160k2843k3962k1892K8749L2848J0137k7311J668L941k1887k0040
12892a9679p488q256L534M575p969j8579J5408J1096K0759J1432k609K0385J7610
12879D0219k799k3482j3477L1332M665j4741Q357P256J9524m762J7843J1708j3211
12866F8432r404K1276J2463n804j7103p858j973J1279P641j6039j3028q126J3682
12853E5438m062k2486Q6P991K880k123O384O991j0941J2384p901j8845l492j6255
$$ plain form
12942 -24310 -14222 -9104 1851 15222 18552 10078 -2869 -3676 11990 23222 21607 18397 10362
12929 10362 18422 33446 49883 50865 32047 13622 8569 33003 56436 37688 662 -17691
12917 -17691 -22168 -10102 -12620 -19378 3489 17016 5346 6837 20363 28269 34594 27965 35753
12904 35753 40913 18070 -5892 -27784 965 33813 43950 16639 18307 22248 361 -19679
12892 -19679 -27167 -35423 -31889 -27314 -35283 -53862 -38454 -27358 -6599 4833 2224 22609 40219
12879 40219 37420 13938 461 31793 36458 21717 30074 37330 56854 52092 69935 81643 68432
12866 68432 59028 80304 92767 86963 69860 62002 60029 71308 78949 62910 49882 41756 55438
12853 55438 51376 28890 28976 36967 39847 37724 44108 51099 40158 52542 44641 25796 22304 6049
12839F049n097L0246J4534M060K95j5405k1443N393R177O566j8516P053K5841
12826D8753N612k70j3q411M817J4533q314l771K354j5827J9704K9646q463k0667
12812E9683q452R060L6512O233j305k4070j2611k6002j5840j1722J4494P709j4417
12799A9272K84J275o50r964J1213J8795J343K7569O061J7587P131k3396J9147
12786I5667J4829k5040j4965q629J7523Q994q612j5026l781J0703J770j7399j4880
12773D1154J7593K6712J3432l5750n967m928K9362K2625o195J3240J1469Q373
12761A31120o299n379J4346j2486l4354l4242R491L1856N774J9987J2456O770
12749A39040J3897J5128J2465J5706K2662k488P787J6672K1705j7580j8897K3941
$$ plain form
12839 6049 952 31198 45732 49792 50087 34682 13239 18632 27809 34375 15859 22912 48753
12826 48753 54365 54095 54082 45671 50488 65021 56707 52936 55290 39463 59167 88813 80350 59683
12812 59683 51231 60291 96803 103036 101731 77661 65050 39048 23208 11486 25980 33689 19272
12799 19272 19556 20831 20181 10217 21430 40225 41568 69137 75198 92785 99916 76520 95667
12786 95667 110496 85456 70491 61862 79385 88379 79767 64741 60960 71663 73433 56034 41154
12773 41154 58747 85459 98891 63141 57174 52246 81608 104233 98038 111278 122747 131120
12761 131120 124821 119442 133788 121302 86948 52706 62197 94053 99827 119814 132270 139040
12749 139040 152937 168065 180530 196236 218898 216410 224197 240869 262574 244994 226097 250038
12737B50038p545J052K3739k045k7340L205n554p19K6247j6449J3258K7389N672
12724B90948k108R908j201n81m088J595L4274L6182J4981R315O962L0979N2042
12711D79208J7898R786L4253M2257O8620N2803N2668P8730M6091L6726N7239L1005
12699A007284k6506m5553m4868m8036r2075o8761n1073k7834l4449l2653j4653
12688E20823J071k0121k8278k433L703K9255K3566K1858L189J6905K1649p826
12676E83361k7669l8271j3152j7034J481j138m1139m5807k0678m23M859N455l004
12663C86841J8120j9060j2709K5600J9293K3867R190J0094K1608L1029J3120o611
12651E20382L053J5681J0211J0869K7470L3815L6228K3218J6416L3524O1175M7383
$$ plain form
12737 250038 242493 243545 267284 265239 237899 241104 235550 234831 261078 244629 257887 285276 290948
12724 290948 288840 298748 297547 296966 292878 294473 328747 364929 379910 389225 396187 427166 479208
12711 479208 497106 506892 541145 583402 652022 704825 757493 836223 882314 919040 976279 1007284
12699 1007284 980778 935225 890357 842321 750246 681485 630412 602578 568129 535476 520823
12688 520823 521894 501773 473495 471062 474765 504020 527586 549444 552633 569538 591187 583361
12676 583361 555692 517421 504269 487235 488716 487578 446439 400632 379954 379531 384390 389845 386841
12663 386841 404961 385901 373192 398792 418085 441952 451142 461236 482844 513873 526993 520382
12651 520382 523435 539116 549327 560196 587666 621481 657709 680927 697343 730867 792042 839425
12639H39425K6893L1596O3432Q5162J04367R4076J20897J13311J46816J68399
12629A794374K34221K93351L37581L82370M74785N46873O24686P23697P85462
12620F197400R12619J060762J325170J714013K346399L301597M696345O375526
12612B7929831P940958Q859268Q965374Q375192P067349M717354J344873k266526
12604G2933673n135219o945719p946262q306102p890929o681039n029186l549521
12596B1449696k446975j748790j336138j103400j015763j000465j032718j053859
12588A0711588j024194r85598r08331q12118p09392o14243n41363m78312m27823
12579D210214l60777l14535k91561k58758k20905k28037k06658j85548j66792
$$ plain form
12639 839425 866318 897914 961346 1046508 1150875 1244951 1365848 1479159 1625975 1794374
12629 1794374 2028595 2321946 2659527 3041897 3516682 4063555 4688241 5411938 6197400
12620 6197400 7110019 8170781 9495951 11209964 13556363 16857960 21554305 27929831
12612 27929831 35870789 44730057 53695431 62070623 69137972 73855326 75200199 72933673
12604 72933673 67798454 60852735 52906473 44600371 36709442 30028403 24999217 21449696
12596 21449696 19002721 17253931 15917793 14814393 13798630 12798165 11765447 10711588
12588 10711588 9687394 8701796 7793465 6981347 6271955 5657712 5116349 4638037 4210214
12579 4210214 3849437 3534902 3243341 2984583 2763678 2535641 2328983 2143435 1976643
12570A976643j44820j34003j38190j17087j13359o9907p5862q9032n4354n3940
12560I86089n6824m3240l7079o2752m1335M099j094K3783n740k6716m4940m3322
12548F50929n2205l0944k0784l4566n0784j5628j145l0218m2481j7300m791K0669
12536C70752J0169J4700j8682l2446k5623K089k0599q110K3345k309m63K7538
12524C40361J9170O637J9797Q288J7109Q205M014K0377j7025j6956J6164J2466
12512D38607Q641K5928R2253J57417J61207Q2148r2462j84856j49226j04762l9795
12501C95100n942M447j5957N985J0920J8496p938j49L6397J1697m734K6720p611
12488D67431j5695n362Q709k0904j7943j8345l9068m892m037J408j5175j4478
$$ plain form
12570 1976643 1831823 1697820 1559630 1442543 1329184 1259277 1183415 1094383 1040029 986089
12560 986089 929265 886025 848946 786194 744859 748958 747864 771647 765907 739191 694251 650929
12548 650929 598724 567780 546996 512430 461646 446018 444873 414655 372174 354874 350083 370752
12536 370752 380921 395621 376939 344493 318870 320959 300360 292250 315595 313286 312823 340361
12524 340361 359531 366168 385965 394253 411362 419567 423581 443958 426933 409977 426141 438607
12512 438607 447248 473176 565429 722846 884053 966201 873739 688883 539657 434895 395100
12501 395100 389158 393605 377648 383633 394553 413049 405111 404962 441359 453056 448322 475042 467431
12488 467431 451736 446374 455083 434179 416236 397891 358823 353931 349894 351302 336127 321649
12476C21649j2679l471J1734n253R450j6375J9036M9979L8036N7764J13588J57376
12464G40834J91488J39882M018j65086j65903j31110q1259m5502m3946n6679m1338
12453C45399l1118n972l889O314l0989j6093K848J7239K8285p112m65j1187K062
12440B95322O57N93j0184J7296L3083J0795j722J0945O691j2907k6414j3079J0776
12427C21852k365j5805j6203j2549J1624J7428K5567M9014N2270O240l1471m1658
12415C63944k9677k3773N689J2015M309k4925J2830P942r60j3852J9873Q334R945
12402C51694m283L288J3655J1904J7660N640O71o945k031K946n821o415p739j0609
12388C63615o522j2308K222J4585K3483J2458k429p229J3162J1425J9776K9118
$$ plain form
12476 321649 308970 305499 317233 311980 321430 305055 324091 374070 412106 469870 583458 740834
12464 740834 932322 1072204 1076222 911136 745233 614123 532864 487362 443416 386737 345399
12453 345399 314281 308309 304420 310734 279745 263652 266500 283739 312024 304912 304447 293260 295322
12440 295322 295979 296572 286388 303684 336767 347562 345840 356785 363476 350569 324155 311076 321852
12427 321852 319487 303682 287479 274930 286554 303982 329549 378563 430833 437073 405602 363944
12415 363944 334267 310494 316183 328198 332507 307582 320412 328354 327394 313542 333415 341749 351694
12402 351694 347411 350699 364354 376258 393918 399558 400229 393284 391253 394199 388378 381963 374224 363615
12388 363615 357093 344785 347007 361592 385075 397533 395104 387875 401037 412462 432238 461356
12376D61356k0975j9887J9266J6243J1430J4900Q985j4118L9724K6009M414Q215
12364E55562j94k0865J709J4750K2459K5353K2691R185R214K3228J2324K7446
12352G02862Q421J915K1017J9580J6413P852L0973N8671L8812K5453K9552L0186
12340I91707L1707K4733L7506O4372M9109M5742O3658M6244P8352R3976Q7442
12329A614548J23582J36377J33904J62377J70649J91577K45599K77761L24799
12320C381173L75309M38856N04320O10392P11991Q53431J016162J204113J446563
12311A0542310J748468K119960K517414K902139L207012L201349K808388J938034
12303C0985074P22316m86611j452041k033170k144027k017529j757670j408990
$$ plain form
12376 461356 440381 420494 439760 456003 467433 482333 491318 477200 516924 542933 547347 555562
12364 555562 555368 534503 536212 550962 573421 598774 621465 630650 639864 663092 675416 702862
12352 702862 711283 713198 734215 753795 770208 778060 809033 867704 906516 931969 961521 991707
12340 991707 1023414 1048147 1085653 1150025 1199134 1244876 1308534 1354778 1433130 1527106 1614548
12329 1614548 1738130 1874507 2008411 2170788 2341437 2533014 2778613 3056374 3381173
12320 3381173 3756482 4195338 4699658 5310050 6022041 6875472 7891634 9095747 10542310
12311 10542310 12290778 14410738 16928152 19830291 23037303 26238652 29047040 30985074
12303 30985074 31707390 31220779 29768738 27735568 25591541 23574012 21816342 20407352
12295B0407352j041901p10695l77702n3599K40100M90827O91324Q20121Q38311
12286B1304138Q46972R26607J058168J198174J432691J645846J750920J785401
12278C1948917J743992J752162J792381J833575J793677J540497J002582K45674
12270D3653457n20615j221086j622595j741720j588822j320504j025413q03779
12262C3808923o88086p49038r21581j053181j153090j115542j003635q85880p88251
12253B5450639p25990o97373o71376n66994l76526p3688K96924O71449J173797
12244B4480862J692871K235957K691632K999443K916794K285664J132494l48435
12236D0087282j772629k814147l364854l450858l250987k882745k518803k094652
$$ plain form
12295 20407352 19365451 18654756 18277054 18223455 18463555 18954382 19645706 20465827 21304138
12286 21304138 22151110 23077717 24135885 25334059 26766750 28412596 30163516 31948917
12278 31948917 33692909 35445071 37237452 39071027 40864704 42405201 43407783 43653457
12270 43653457 43132842 41911756 40289161 38547441 36958619 35638115 34612702 33808923
12262 33808923 33120837 32371799 31450218 30397037 29243947 28128405 27124770 26238890 25450639
12253 25450639 24724649 24027276 23355900 22788906 22412380 22338692 22635616 23307065 24480862
12244 24480862 26173733 28409690 31101322 34100765 37017559 39303223 40435717 40087282
12236 40087282 38314653 35500506 32135652 28684794 25433807 22551062 20032259 17937607
12228A7937607j779831j539518j283129j101529r87546q84122p99471p71471p33119
12219H057871o55854n97873n46011m83440m79879m00641l61809l28210k91288
12210C912866k52950k31937k35464k27658j67579j72148j70902j67654j17338
12201B169236j20010j41467j06467j07578j14364o0989n8148k1708n8869o1333
12191A318303o3634o2684m0360l0493k9646j6780k9667M295K8013M0822M138J6166
12179A138473K0118J0706K1151o912l276j0869p2912n9012q5012p9686p5233m9926
12167G47610l9871l8261m128l0017l7057k3249m62j9406j2325k0549j7908r901
12155D94476j0006j1200j3974j6729J563r949j5586p530k5078q287Q384J8939
$$ plain form
12228 17937607 16157776 14618258 13335129 12233600 11246054 10361932 9562461 8790990 8057871
12219 8057871 7402017 6804144 6258133 5774693 5294814 4894173 4532364 4204154 3912866
12210 3912866 3659916 3427979 3192515 2964857 2797278 2625130 2454228 2286574 2169236
12201 2169236 2049226 1907759 1801292 1693714 1579350 1518361 1460213 1438505 1379636 1318303
12191 1318303 1254669 1191985 1151625 1121132 1091486 1074706 1045039 1049334 1077347 1118169 1122307 1138473
12179 1138473 1158591 1169297 1190448 1183536 1180260 1169391 1096479 1037467 952455 872769 797536 747610
12167 747610 707739 669478 665350 635333 598276 575027 574565 555159 542834 522285 504377 494476
12155 494476 484470 473270 459296 442567 444130 434181 418595 411065 385987 377700 386084 405023
12143D05023P431j226l1243j6428K9080M603l3841m7106l4472k1515J4985K6937
12131C02228j6170l8132k72J0967L3519P20O549J8955j3773o304p319J0310J1654
12118C12932J2796n764O316L2052K7657p507k4251j3470K385j3513j5419j8605
12106B95609o608K227q421j1710j2539J7075p854j1717k4720j2822l300k0570
12094A94650r319O23j343j202l229l3086O382J1234L278N862l5903k267P708J1038
12080A54426J2430n111j2762Q077k480j315k0959j2904j5660L034J070J3055j4331
12067A06570j5459J8660O945L803n758J0045L3478o085j0140K4303j5546j9488
12055A31328q636j6492J8607R961J1591o617k7762n647K2816N435k1748j5595
$$ plain form
12143 405023 412454 411228 379985 363557 392637 397240 363399 316293 281821 260306 275291 302228
12131 302228 286058 247926 247654 258621 292140 292860 299409 318364 304591 298287 290968 301278 312932
12118 312932 325728 319964 326280 358332 385989 378482 354231 340761 343146 329633 314214 295609
12106 295609 289001 291228 282807 271097 258558 275633 267779 256062 231342 218520 215220 194650
12094 194650 185331 185954 184611 183409 180180 147094 153476 164710 167988 173850 137947 135680 143388 154426
12080 154426 166856 161745 148983 157060 154580 153265 132306 119402 103742 106776 107846 120901 106570
12067 106570 91111 109771 116716 120519 114761 124806 158284 152199 142059 166362 150816 131328
12055 131328 122692 106200 124807 134768 146359 139742 111980 106333 129149 134584 112836 97241
12043I7241J7560N181j0903O37l236J13J8651N284J1213K2475R104p477j5839
12030A50004j4668q644J3846K7840o803k872K592j1398J28j3759K9180K231j3967
12017A53710k779J1680R705k3364j9781j5971O230J0594K7284J1433j7583p502
12005A43656K2042K297J737O234P843N626p424k991Q704K4932m093j9443p529
11992A81591k2307J7035L6005K3692j1925j6381K714M8886K3392J2420j0534j0332
11980B74256j1711j1857J301R724j1254j4245j3895L203p946K0797K0549J3276
11968B72198n656k8559o061J0239N715n451k590J5341K2709l642J5097j0512m2467
11955B36361j1821K1941J2494M136q69R977k682J6583R210l5896l6961j7140J518
$$ plain form
12043 97241 114801 119982 109079 109716 106480 106593 125244 130528 141741 164216 173320 165843 150004
12030 150004 135336 126692 140538 168378 161575 158703 161295 149897 150025 136266 165446 167677 153710
12017 153710 150931 162611 172316 148952 129171 113200 119430 130024 157308 168741 151158 143656
12005 143656 165698 167995 169732 175966 183809 189435 182011 179020 187724 212656 208563 189120 181591
11992 181591 159284 176319 212324 236016 224091 207710 210424 259310 282702 295122 284588 274256
11980 274256 262545 250688 251989 261713 250459 236214 222319 225522 217576 238373 258922 272198
11968 272198 266542 237983 231922 242161 247876 242425 239835 255176 277885 274243 289340 278828 236361
11955 236361 224540 246481 258975 263111 262242 272219 269537 286120 295330 259434 222473 205333 206851
11942B06851K1153j153K5504O603j9603l1976k0777J3141O570J3483k9596k1967
11930A68233m314r369l249p038K5149J1176J1716r135j9984j3349L455J5257J0438
11917A78986j9425j1787J389Q277J3750J1902k7925k1712j4771j3375k9635n03
11905G5171p971J7697R059k1399M372J094l829M897l686Q240R788l545j0597j7808
11891F1483J1613O023q463K2493J6354j0123q134J7344P830J0913K8023L587p216
11878A51727p114l158l761J7814o066N737r837j3985q4J231L6122L2061K619M876
11864B08182M045M134M175R912l853j3584j7507l99J1860j1103p186k4473j8429
11851A45774r562J3007J1192J3745J3074r020j7788q536J7994K5355J1450K2437
$$ plain form
11942 206851 228004 226851 252355 258958 239355 207379 186602 199743 206313 219796 190200 168233
11930 168233 163919 154550 151301 144263 169412 180588 192304 183169 163185 149836 153291 168548 178986
11917 178986 159561 147774 149163 157440 171190 183092 155167 133455 118684 105309 75674 75171
11905 75171 67200 84897 93956 72557 76929 78023 74194 79091 75405 83645 93433 89888 79291 61483
11891 61483 73096 79119 70656 93149 109503 99380 91246 108590 116420 127333 155356 158943 151727
11878 151727 144613 141455 137694 155508 149442 155179 145342 131357 131273 132504 168626 200687 203306 208182
11864 208182 212227 216361 220536 230448 226595 213011 195504 195105 206965 195862 188676 164203 145774
11851 145774 136212 149219 160411 174156 187230 178210 160422 151886 169880 195235 206685 229122
11839B29122J738p953J7948O688J5976J2365O701j4470o231j7388l955K077J5713
11826B58331Q387N788n268l977j6094M941m896M444o003j764j0578l817j8602
11813B10892L53l1672J1704J4643j7535O425J5563J2609p92R459O155p651Q630
11800B38783P196J2753L444K256J6295J6048k2333p164r445R233k8377l4601j3992
11787A90096m1520J938K1690m412l1459l429R826J0999J0125m902k0179p522k4397
11774A06854N736K230j2861j3906J2033J6514o601p734J0457J4260J1195l5320
11762A02857l7113q448J5268J8835k4787k1814O736J2676J7334r248K8904J4918
11750A16118j7980k9983j7868J4922J9374J2039M657k2530k0842j2466R911J387
$$ plain form
11839 229122 230860 222907 240855 247543 263519 275884 282585 268115 261884 244496 240541 242618 258331
11826 258331 266718 272506 267238 263261 247167 252108 247212 251656 245653 243889 233311 229494 210892
11813 210892 211245 179573 191277 205920 188385 194810 210373 222982 222190 231649 237804 230153 238783
11800 238783 245979 258732 262176 264432 280727 296775 274442 267278 257833 267066 238689 204088 190096
11787 190096 148576 150514 172204 167792 136333 132904 142730 153729 163854 158952 138773 131251 106854
11774 106854 112590 114820 101959 88053 100086 116600 109999 102265 112722 126982 138177 102857
11762 102857 65744 57296 72564 91399 66612 44798 51534 64210 81544 72296 101200 116118
11750 116118 98138 68155 50287 65209 84583 96622 101279 78749 57907 45441 55352 56739
11738E6739J6747L0836P605J0361j2795q251M603r200J058j3122j9816J455L2480
11725I8700K2430O122K366p653j0468M667j3243j167k627o055j3923m276M9488
11712A24361J4630l49j1520j1119P488J6259K3210J8634q765n880O631k2256J922
11699A53246J3426j3004M884J9899q012O379L2016K0690n525J0224L6422L9474
11687C10119K3143j0807K669O31J4471l747l2614j0942N12Q887M505J514j0573
11674B97768q719J1159m377r003k947K5411N098k041K0638J0641j3026N3J4505
11661C45160k684J985M529k003R917J0291J1407k56j8151j1059L823J8092K0383
11648C91434R200J717j071J6379K0839J3063j2534J8833K1725J5355N734j2416
$$ plain form
11738 56739 73486 104322 111927 122288 109493 101242 105845 96645 97703 84581 64765 66220 98700
11725 98700 121130 127252 129618 121965 111497 116164 102921 101754 99127 93072 79149 74873 124361
11712 124361 138991 138642 127122 116003 123491 139750 162960 181594 172829 166949 173580 151324 153246
11699 153246 166672 153668 158552 178451 170439 176818 208834 229524 223999 234223 270645 310119
11687 310119 333262 322455 325124 325755 340226 336479 303865 292923 293435 302322 306827 308341 297768
11674 297768 289049 300208 295831 286828 283881 309292 314390 312349 332987 343628 330602 330655 345160
11661 345160 342476 344461 348990 346987 356904 367195 378602 378346 360195 349136 352959 371051 391434
11648 391434 400634 402351 401280 417659 438498 451561 439027 457860 479585 494940 500674 488258
11636D88258J1661Q780P534K0476J612o876J1267J0111J5836L3166R483L562m799
11623F10071J5956J6361J2017P995J0176J8502J8338L2383N0305L4877K0202N961
11611H53144L3059M9555M7794K9386M3811M6588M7117M6348P5610P2056N7076
11600A401544P3372R7320J02125R6945J16823J58299J33117J71161J71083J82555
11590B704344K18632K36583K74188K89916K99184K91168K99681K88687K89741
11581E192124K70120K42990K07567K25868K87099L49409M11833N17059O09575
11572H313644P24577Q72133J050054J252700J422856J673780J949258K196515
11564A9455517K386924K516107K496046K338061J907563J227635M61117l09216
$$ plain form
11636 488258 499919 508699 516233 536709 538321 531445 542712 552823 568659 601825 611308 614870 610071
11623 610071 626027 642388 654405 662400 672576 691078 709416 741799 792104 826981 847183 853144
11611 853144 886203 935758 983552 1012938 1056749 1103337 1150454 1196802 1272412 1344468 1401544
11600 1401544 1474916 1572236 1674361 1771306 1888129 2046428 2179545 2350706 2521789 2704344
11590 2704344 2922976 3159559 3433747 3723663 4022847 4314015 4613696 4902383 5192124
11581 5192124 5462244 5705234 5912801 6138669 6425768 6775177 7187010 7704069 8313644
11572 8313644 9038221 9910354 10960408 12213108 13635964 15309744 17259002 19455517
11564 19455517 21842441 24358548 26854594 29192655 31100218 32327853 32788970 32479754
11556C2479754r64504j385775j546530j511470j287287j022698p33742n15799
11548B3511949k74118j5127J15800K57313L61425M43848M99838N66422O24808
11539B6092158O94887P21213P47027P27341P19382O80456O80121P65054R54967
11530C2782606J142388J265290J311272J169527R04167M81607K1732l70240o80388
11521C8027961q87699r95350j064484j134977j218664j266490j314542j347653
11513B8798102j311917j223551j146954j101853j012274q93642p63746o20338
11505B0723827m25732k44477j9482K30439N00130P36110J022653J256158J352077
11496B5131703J325963J107921O52091M9885n88880j217659j673360j926979j992443
$$ plain form
11556 32479754 31515250 30129475 28582945 27071475 25784188 24761490 24027748 23511949
11548 23511949 23237831 23222704 23338504 23595817 23957242 24401090 24900928 25467350 26092158
11539 26092158 26787045 27508258 28255285 28982626 29702008 30382464 31062585 31827639 32782606
11530 32782606 33924994 35190284 36501556 37671083 38575250 39056857 39078589 38708349 38027961
11521 38027961 37140262 36144912 35080428 33945451 32726787 31460297 30145755 28798102
11513 28798102 27486185 26262634 25115680 24013827 23001553 22107911 21344165 20723827
11505 20723827 20298095 20053618 20034136 20264575 20764705 21500815 22523468 23779626 25131703
11496 25131703 26457666 27565587 28217678 28267563 27678683 26461024 24787664 22860685 20868242
11487B0868242j930211j789233j603948j382574j218660j085690r51538q50945
11479A0055443p28103o77150o38294n76639n28198m92752m61261m11545l87302
11470E154199l44597l44963l30375k76147k53019k22463j78420j76970j89956
11461B837289j66620j42667j42310j43550j15932j01494r1393j00798j09803p1026
11451A651696o1918o8933o2787n9324l4732m7324o9210l4893l5361n9058l6700
11440A081456k9708j0692l6590m2548o1347j4718k6735n7655l7903j0133j1832
11429G41595l3377j4752k7996k2448O000l854k0790m312k2116k8485j2528M584
11417E61521j0636l576m4558j6949Q547j4257j2603R711O700k1315j2382j9324
$$ plain form
11487 20868242 18938031 17148798 15544850 14162276 12943616 11857926 10906388 10055443
11479 10055443 9327340 8650190 8011896 7435257 6907059 6414307 5953046 5541501 5154199
11470 5154199 4809602 4464639 4134264 3858117 3605098 3382635 3204215 3027245 2837289
11461 2837289 2670669 2528002 2385692 2242142 2126210 2024716 1933323 1832525 1722722 1651696
11451 1651696 1589778 1520845 1458058 1398734 1364002 1316678 1247468 1212575 1177214 1118156 1081456
11440 1081456 1051748 1041056 1004466 961918 900571 885853 859118 801463 763560 753427 741595
11429 741595 708218 693466 665470 643022 649022 645168 624378 620066 597950 569465 556937 561521
11417 561521 550885 547309 502751 485802 494349 480092 467489 477200 483900 462585 450203 430879
11405D30879j8644k562J1570M053j1002k4846j5206j6121l566M367k855o021j9190
11392C30856K15K0355q686m412k4588j654R051J786k7032L074M3846R086r782
11379C42115j1271j3960R352p383r75N393k078k3683j8182N346J65J9688q710
11366B95817j4409J0692J7081j0816k8897M171j9031n70k019j3183n639Q317j9009
11353B22505k5518P474J039j5648l085K1187k3622p71q500l408J6105J7145j1691
11340A93212j4772k8375P094K0775O383J613j1249l906Q346M199Q31J6343l9818
11327A60676k3774K7093N828o91J7976k6661j366k5065k1394K1031L4948p467
11315A61134p917r863m485k0302j0986J0543J9228k845q129n651k077J0939M186
$$ plain form
11405 430879 412235 409673 421243 425296 414294 389448 374242 358121 354555 358922 356067 350046 330856
11392 330856 331071 351426 342740 338328 313740 312086 321137 322923 295891 298965 342811 351897 342115
11379 342115 330844 316884 326236 318853 317878 323271 321193 297510 279328 284674 284839 304527 295817
11366 295817 281408 292100 309181 298365 269468 273639 254608 254038 252019 238836 233197 241514 222505
11353 222505 196987 204461 205500 189852 186767 207954 184332 183561 175061 171653 187758 204903 193212
11340 193212 178440 150065 157159 177934 184317 185930 174681 170775 179121 183320 184151 200494 160676
11327 160676 136902 163995 169823 169132 187108 160447 159081 134016 112622 133653 168601 161134
11315 161134 153217 143354 138869 118567 107581 118124 137352 134507 126378 120727 118650 129589 133775
11302A33775n349j9194Q536K2042o235l767l500R5k631Q06o4j4074J1945N73k7899
11287I5059R817J852k3276j1719J6158L8989j5075o314Q226J3735R85K1158R753
11274A59348L544n211k4656j0980K773j1702k234j2108j8345K1143J5719o985
11262A10306q161m60J4256J9404j0461k0651M130l18q177k448P586J0582J9513
11249A35101J3075k7226j1417k3980l2860j450r453O502L2304J8991j0562O00
11237H9625l680J0198M19j8375O379J644M828K429m068N722m527j3556L194j3086
11223F7146q174L5395n884k506m41J2308J4172j6358k5150k0432j9372k975J9918
11210D7647R427k2564j777q47l576J4471J7249o768j0346J7338K7109j1614k0044
$$ plain form
11302 133775 128426 109232 117768 139810 133575 129808 126308 126403 123772 124578 124514 110440 122385 122958 95059
11287 95059 104876 106728 83452 71733 87891 126880 111805 105491 113717 127452 128437 149595 159348
11274 159348 162892 157681 133025 122045 124818 113116 110882 98774 80429 101572 117291 110306
11262 110306 102145 101685 115941 135345 124884 104233 108363 108045 99868 97420 105006 115588 135101
11249 135101 148176 120950 109533 85553 52693 51243 41790 48292 80596 99587 89025 89625
11237 89625 85945 96143 96562 78187 84566 86210 91038 93467 89399 95121 90594 77038 80232 67146
11223 67146 58972 94367 88483 85977 85536 97844 112016 95658 70508 50076 30704 27729 47647
11210 47647 57074 34510 32733 31886 28310 42781 60030 53262 42916 60254 87363 75749 55705
11197E5705P474j7150q272R252K838P323J4043l588n472j0037M957M303N903k648
11183F4631p399K955p029j7101k36q951N111L7135J4740K0506O033j4518k7757
11170F8120p564j4162j5779J1010J0465N027q352J0044N718j1374j0060J451J2619
11157E7163K7064p591o995L21Q477P209R290p26j3849j780r843J030j0848K0785
11143G9707r914k5428L3689J4597p754P505J7098J8031r2o759R433K129J0545
11130A42787M921l787m340L45K2828J1742j317l762j8173M1272K3805j608j4407
11117B00306j1340p972N820p296j825J9676j2826j1050O767J5163j5887q450M222
11104A75308O409Q627j0278j1312j5317M3025K0792P953r4O740J0529q061O989
$$ plain form
11197 55705 63179 46029 37757 47009 49847 57170 71213 67625 62153 52116 57073 61376 67279 64631
11183 64631 57232 60187 53158 36057 35821 26870 31981 69116 83856 104362 110395 95877 68120
11170 68120 60556 46394 30615 41625 52090 57117 48765 58809 64527 53153 43093 44544 57163
11157 57163 84227 76636 69641 69962 78439 85648 94938 94212 80363 78583 68740 69770 58922 79707
11143 79707 69793 44365 78054 92651 84897 92402 109500 127531 127439 120680 130113 132242 142787
11130 142787 147708 143921 139581 139926 162754 174496 173179 169417 151244 192516 216321 214713 200306
11117 200306 188966 180994 186814 179518 177693 197369 184543 173493 180260 195423 179536 171086 175308
11104 175308 181717 190344 180066 168754 153437 196462 217254 225207 225113 231853 242382 234321 241310
11091B41310M974m812p476M5J759l698Q911j5928m3911j8414K2575k931o320N209
11077A81293o59k977j5945n541k1272o086q028l5035p518J7334K6898K6687L895
11064A53046J8452P791l166j1069j1324J8756J9152R362o709J2486l0994m0961
11052A34822j5166j3198k3854q134Q122m267k7853j387J1080L234k7669j0859
11040B4871j3168J7358K6636k43j0102j452o167N708K7568R433l0073k194N028
11027E3203m590n188Q975j1916k3916P135J388q230m842j640N839r541J3700J0431
11013C0808o886M3m224p936K7928J6913P770j1319j216N214k3164k4276N8M575
10999A4288J153J1199Q767k5984P953L3665o609j3835k062k0320k2731L574K7984
$$ plain form
11091 241310 246284 241472 233996 234041 235800 232102 241013 225085 181174 162760 185335 182404 176084 181293
11077 181293 180634 177657 161712 156171 134899 128813 120785 85750 78232 95566 122464 149151 153046
11064 153046 171498 179289 176123 165054 153730 172486 191638 201000 194291 206777 175783 134822
11052 134822 119656 106458 82604 74470 82592 78325 50472 49085 60165 63399 35730 24871
11040 24871 11703 29061 55697 55454 45352 43900 37733 43441 71009 80442 50369 48175 53203
11027 53203 48613 43425 52400 40484 16568 23703 25091 16861 12019 10379 16218 6677 20377 30808
11013 30808 23922 23965 19741 11805 39733 56646 64416 53097 51881 57095 33931 9655 9713 14288
10999 14288 15441 26640 35407 9423 17376 51041 44432 30597 28535 8215 -14516 -10942 17042
10986A7042J5473j3513J0611N511l132K0009Q909j6427j4168J7667o165l2570
10974I247J5050J1736q053j769j532M633k0236P431K3265j0822m123K1384K9072
10961G5283k0491j3124k13k193j211N136J4537J5844J754l171l9328j8163N84
10948A5244J472J9254K1011n072j7349k7227K6160K2970j7253j9309q848L37j5548
10935d158P575K3177J8056j3074o317n789k5730j2412j5265j4926J0476K0941
10923a7446K9033j0803o717J949K883K2315j2698k5759P130L2355j281J6767M012
10910D1740O797M132j2285p118l1808q56j5397P213J7182L255m873L574J2078
10897B3634m2882L794J2161J1601J110K770K5536p251m476n743k293L0502O150
$$ plain form
10986 17042 32515 19002 29613 35124 31992 52001 60910 44483 30315 47982 41817 9247
10974 9247 24297 36033 27980 26211 24679 29312 9076 16507 39772 28950 24827 46211 75283
10961 75283 54792 41668 41455 39262 38051 43187 57724 73568 75322 72151 32823 14660 15244
10948 15244 16716 35970 56981 51909 34560 7333 33493 56463 39210 19901 11053 11390 -4158
10935 -4158 3417 26594 44650 31576 25259 19470 -6260 -18672 -33937 -48863 -38387 -17446
10923 -17446 11587 784 -5933 -3984 -1101 21214 8516 -17243 -10113 22242 20961 37728 41740
10910 41740 48537 52669 40384 33266 1458 602 -14795 -7582 9600 12855 7982 11556 23634
10897 23634 -19248 -15454 -3293 8308 9418 12188 37724 30473 25997 20254 17961 48463 54613
10884E4613n0075k2758J2409J0175M12J6022j7622j1210j6599n272Q526J5616
10872e763j3087O891J6245O767K9853K9018J3406j0203k9524l538Q30l3688l938
10859C269J3941J7976J0432j7615j9588Q87k86J6758J5323K583j6039m390l260
10846A9991J0017J4450o517q822Q515J8799j0027p582j9385l0269M422l768k780
10833a2956R500K2571L2342l7959j4658j306K4J5059J3753l110k6341N06J9191
10820A6616O745l273j7025J823j753P19L57j9065J228J4854Q398j8621j009J9541
10806I535J2329j4957N350n107p967J2256o664o856n191L676J9684r033J5252
10793B2307Q578J0582N017k4680J5766J6806M330p011p661o879q954r368N441
$$ plain form
10884 54613 4538 -18220 -5811 4364 4776 20798 3176 -8034 -24633 -29905 -21379 -5763
10872 -5763 -18850 -11959 4286 11053 40906 69924 83330 73127 43603 40065 40895 7207 3269
10859 3269 17210 35186 45618 28003 8415 9302 9016 25774 41097 43680 27641 23251 19991
10846 19991 30008 44458 37941 29119 37634 56433 46406 38824 19439 -10830 -6408 -10176 -12956
10833 -12956 -3456 19115 51457 13498 -1160 -2466 -2442 12617 26370 23260 -3081 -2575 16616
10820 16616 23361 20088 3063 4886 3133 3852 4209 -14856 -13628 1226 9624 -8997 -10006 9535
10806 9535 21864 6907 12257 7150 -817 11439 4775 -2081 -7272 -3596 16088 7055 22307
10793 22307 30885 41467 46484 21804 37570 54376 58706 51695 44034 37155 28201 18833 24274
10780B4274p582L816j6669k750j2394Q583j0110O894m675j5195O144J0366j2501
10767b1799j898J2425Q104j4085J7067k347l2572K8771O009j170m361O024J8387
10754A8555j768J4223Q263L1937L9872Q3319J14392N8383m6316q9302n9559k6829
10742A45170l0346k6804k2213O618r951k7478k209J9186j6647j4297p577j412
10730A2040p508K036L2236m101j5487Q69L135j1744M944L375o188k317K0922K6859
10716E9071K5003k5487j6875J2647J4609q173q669j070j4165j0819Q598n885k1248
10703G537j303K508Q288r732m716K3678J5722q209k2165n944K5969K2761r387
10690D5007k2051r044k844k642J4468K0989j6264k3091m327K3275r41j1258l01
$$ plain form
10780 24274 16692 20508 3839 1089 -11305 -2722 -12832 -5938 -10613 -25808 -19664 -9298 -21799
10767 -21799 -23697 -11272 -3168 -17253 -186 -2533 -35105 -6334 -325 -1495 -5856 168 18555
10754 18555 16787 31010 39273 71210 111082 194401 308793 367176 320860 231558 171999 145170
10742 145170 114824 88020 65807 72425 62474 34996 32787 51973 35326 21029 13452 12040
10730 12040 4532 6568 38804 34703 19216 20085 23220 11476 16420 19795 13607 11290 32212 59071
10716 59071 84074 58587 41712 54359 68968 60795 52126 51056 36891 26072 34670 28785 7537
10703 7537 6234 8742 17030 7298 2582 26260 41982 33773 11608 5664 31633 54394 45007
10690 45007 22956 13912 11068 8426 22894 43883 27619 4528 201 23476 22535 11277 10976
10677A0976Q60J8724J9833P523j3855k1665j2506J162N402n962j2856k1448R642
10664a4170J1452N265K5272j1451j7947n147K3484J0388j4725p532o368L150k2881
10651b1210n228j4836m181m097k95J9917J3564J8227L812l1472n851J4064j424
10638a9010j1509L822j674K7209J5022j7114l119J5937o626J743P528j7765L641
10625a915J0513j7820j9556K3952J7255J3727n436q005J5375J2749m70j0309j6372
10612A3688K3221Q813m515K0384l808j2961k5577n658j0522n207r110J0683J1692
10599A1123J8660N21n508J0825N997j0704j4526J164K937J2305P041l936N811
10586D1710j7383L503J3827j4502J64J582n664j1158Q403m358J2513k869j8828
$$ plain form
10677 10976 11836 30560 50393 57916 44061 22396 9890 11052 16454 10492 -2364 -23812 -14170
10664 -14170 -2718 2547 27819 16368 -1579 -6726 16758 27146 12421 4889 -1479 1671 -21210
10651 -21210 -26438 -41274 -45455 -49552 -49847 -29930 -16366 1861 5673 -25799 -31650 -17586 -19010
10638 -19010 -30519 -26697 -28371 -1162 13860 -3254 -6373 9564 2938 4681 12209 -5556 -1915
10625 -1915 8598 -9222 -28778 -4826 12429 26156 20720 12715 28090 40839 40369 30060 13688
10612 13688 36909 45722 41207 61591 57783 44822 19245 13587 3065 -2142 -11252 -569 11123
10599 11123 29783 30304 24796 35621 41618 30914 16388 17552 20489 32794 39835 35899 41710
10586 41710 24327 27830 41657 27155 27319 28901 23237 12079 20482 16124 28637 25768 6940
10573F940N373R901N541J3774j8789m696N120K048l3309j9002M946J0155J4207
10560B209J901j534K1160K409J5993k0868j9724K2468K0819k2443k4135J599J3960
10547A3814P84N358j3163m849J5553j7355j1724o509o43K0380K1469r040o734
10534G341Q340o305P451j486L64p418J5721J531k4553j9218k1133k314L8075K3534
10520A9930O526M630m584j575M621L3297J6161q311j7991k0805j3576k0686P734
10507E371K4861J4297J6384r945O908j2417j265P931m837K0458J7670J8621J3787
10494A17824l416j2294o339M873j1329l249O139l020j0478j4048K693J6393j5620
10481F8129p131J423J4455L539J3250l600Q225l675j1863j6196L780K1990j828
$$ plain form
10573 6940 12313 22214 27755 41529 22740 18044 23164 25212 -8097 -27099 -22153 -11998 2209
10560 2209 4110 2576 23736 26145 42138 21270 1546 24014 44833 22390 -1745 -146 13814
10547 13814 14598 19956 6793 1944 17497 142 -11582 -18091 -18734 1646 23115 14075 7341
10534 7341 15681 9376 16827 15341 15705 8287 24008 25539 986 -18232 -39365 -41679 -3604 19930
10520 19930 26456 31086 26502 24927 29548 62845 79006 70695 52704 31899 18323 -2363 5371
10507 5371 30232 44529 60913 50968 57876 45459 44194 52125 47288 67746 85416 104037 117824
10494 117824 114408 102114 95775 100648 89319 86070 92209 89189 78711 64663 67356 83749 68129
10481 68129 60998 62421 76876 80415 93665 90065 98290 94615 82752 66556 70336 92326 90498
10468I0498J1878P599N378O165J3970q754k3090k267j2161j4591J4900J4624J453
10455A05602R708p079k5240L104m119j0144o31J5157o584m089j2404Q03Q069J6963
10441H9116K50q875r47K1928J7305P875j8451j9869K991O704m512N78j3532o6
10427H0495k1456q672j500k2702Q672M288j3940j5369o476M389J2753j3497L356
10414A0341m153k7033K566L0987j0751j1673j153m590J6386J3549j2492J528K0307
10401B3819O902M436n276k5779k3310K351Q850L275M464K2112J7487j8895k2575
10388b139J5871o764N889P306J282J3006N983k7288k93R028J2266j2709k106J6405
10374C5737l187J587j8941O602j6062k94J4172N412r92m616q675k3789N181P265
$$ plain form
10468 90498 102376 109975 115353 121518 135488 126734 103644 101377 89216 74625 89525 104149 105602
10455 105602 115310 108231 82991 86095 81976 71832 71201 86358 79774 75685 63281 64084 72153 89116
10441 89116 89366 80491 79544 101472 118777 126652 108201 88332 91323 98027 93515 94093 80561 80495
10427 80495 59039 50367 48867 26165 34837 39125 25185 9816 3340 7729 20482 6985 10341
10414 10341 6188 -20845 -18279 12708 1957 -9716 -10869 -15459 927 14476 1984 3512 23819
10401 23819 30721 35157 29881 4102 -19208 -16857 -8007 -4732 -268 21844 39331 20436 -2139
10388 -2139 13732 6968 12857 20163 21445 34451 40434 13146 12853 21881 34147 21438 19332 35737
10374 35737 32550 34137 15196 21798 5736 5442 19614 25026 24034 19418 10743 -13046 -7865 -600
10360f00P057j9990j5547K4078K9761j6194j6881j8813K244K265M287j1186K2922
10347f597K7528J6640R245j4239j7915K725l852L162p071O848J9439P323k0673
10334B2563j2940J3904n944j3450j5019R294K540l254r14j2440K5004l540N984
10321A1788O986l892J1999k293p512J1594L137O376J255N691q649j7983k4441
10308e944J8761M0230L0710j9011l2331R516J4421J1885M508o310K551P0k4203
10295D4853k3241K2856j1714l520K8927n971O123J6000K515k4846Q922K2187k1890
10282F1201j9438L922K298p782j1880J0821J2466p737l869Q381k46K236j808j78
10268D8387k838J0507j5563L105N507J831j5829p399o68O726J4090L916J2738
$$ plain form
10360 -600 6457 -13533 -29080 -5002 24759 8565 -8316 -27129 -24885 -22620 -18333 -29519 -6597
10347 -6597 20931 37571 46816 32577 14662 17387 13535 16697 9626 16474 35913 43236 22563
10334 22563 9623 23527 17583 4133 -10886 -1592 948 -2306 -3220 -15660 9344 5804 11788
10321 11788 18774 14882 26881 24588 17076 28670 31807 38183 39438 45129 36480 18497 -5944
10308 -5944 12817 53047 83757 64746 32415 41931 56352 68237 72745 66435 68986 69056 44853
10295 44853 21612 44468 32754 29234 58161 52190 58313 74313 76828 51982 60904 83091 61201
10282 61201 41763 45685 47983 40201 28321 39142 51608 43871 40002 48383 48137 50373 48565 48387
10268 48387 45549 56056 40493 43598 49105 50936 35107 27708 27040 33766 47856 51772 64510
10255F4510J5006J0929r278j6647j2424j5003q063j537j0778j143j8280R010J1828
10242A8130m058K4033J2091j8567k7169J4615j2316N524m05M349L3237J22J318
10229E0904J0800M176q851j0350m892j0460k61o549J886Q423J4075o951j8800
10216B3150L864J5145J1614K6655n451Q184J118J5065L1163p691p877N141j8929
10203A01151k3534k5274o305j3605j0390j982q30m271J8084L745k529J0052R922
10190E4234r427O221j4549J249K2975o533n269J4617M72j6727k2196J0261n972
10177B9356p372J3504K7904R495P621j4388j1204l008J0581K568l21l179Q454
10164G0011R253J7632K2816O964m1404l6395J2447R072n401J5066j4291l929J423
$$ plain form
10255 64510 79516 90445 81167 64520 52096 37093 29030 27493 16715 15572 -2708 6302 18130
10242 18130 14072 38105 50196 31629 4460 19075 6759 12283 11878 16227 49464 49586 50904
10229 50904 61704 65880 57029 46679 41787 31327 31066 24517 26403 34826 48901 41950 23150
10216 23150 27014 42159 53773 80428 74977 83161 84279 99344 130507 122816 114939 120080 101151
10203 101151 77617 52343 46038 32433 22043 20061 19231 14960 33044 36789 34260 44312 54234
10190 54234 44807 51028 36479 37728 60703 54170 48901 63518 63990 47263 25067 35328 29356
10177 29356 21984 35488 63392 72887 80508 66120 54916 51908 62489 65057 64736 61557 70011
10164 70011 79264 96896 119712 126676 85272 48877 61324 70396 64995 80061 65770 61841 63264
10151F3264m56L717j2452p226O646j9646N954K901J157j3371l590j01O644k605
10137C0836N759N811q124J752J9750L0738k5663j0924n978J1337k1163j9508K066
10124A6689J156r862J8197K5863L5386j5908J800K4395k0153k9278k0762J3758
10112D1281K1258j6894j1907j8700N829K6640j1281k9263M584J6344K3353N349
10100E6593q900m382n588k1943j992J8976J1435o537J9485L345j5806N289M8o057
10086D3966j8251j3263R05N715K549k640j4474O214J0779K8549K981j0716J7086
10073E9400q938n92j7125n271O757m072j8543J160J6771L3194L1465j4976k0372
10060E8858j813M849r484j2322J0558R336r524J1852q347m187K792j9970q16K0250
$$ plain form
10151 63264 62808 66525 54073 46847 53493 33847 39801 42702 43859 30488 26898 26797 33441 30836
10137 30836 36595 42406 34282 36034 55784 86522 60859 49935 43957 55294 34131 14623 16689
10124 16689 17845 7983 26180 52043 87429 71521 73321 97716 77563 48285 27523 41281
10112 41281 62539 45645 33738 15038 20867 47507 36226 6963 11547 27891 51244 56593
10100 56593 47693 43311 37723 15780 13788 32764 44199 37662 57147 60492 44686 49975 50023 43966
10086 43966 25715 12452 13357 19072 21621 18981 4507 10721 21500 50049 53030 42314 59400
10073 59400 50462 49870 32745 27474 34231 30159 11616 12776 29547 62741 94206 79230 58858
10060 58858 57045 61894 52410 40088 50646 59982 50458 62310 53963 49776 52568 32598 31782 52032
10046E2032M3672J0464o189J4109R204k5057K1107K2656q416j2093k4324P277
10034A04442k0544j1355o294J5611k493N462J5135j8176n153J8920L906K258j0282
10021I1437P323L653N935k5111n271p605J5315N171m933j1505j1202M425J7247
10008H4879O409J2952q203n788J7496r34p33j3476j9550j8814J236L7607L1222
9995A24303K7559J2752L616J2082k5579j0222N40K901O171k3131j3471j9873q23
9982I6825K2230N407J4057J0074k2813n554j7908Q708J0146j7907m842p742j2595
9969G8086l752J677J2984K2616K2963l6919k8582Q818J6924O271J0764R246k191
9956A18905j4950k4814k0527j354J7657N747O080l349m323J7910M7047J3655L803
$$ plain form
10046 52032 95704 106168 99979 114088 123292 98235 119342 141998 133582 121489 97165 104442
10034 104442 83898 72543 66249 81860 79367 84829 99964 81788 76635 95555 99461 101719 91437
10021 91437 98760 102413 108348 83237 77966 70361 85676 90847 85914 74409 63207 67632 84879
10008 84879 91288 104240 96037 90249 107745 106811 106078 92602 73052 54238 55474 93081 124303
9995 124303 151862 164614 168230 180312 154733 144511 145051 147952 154123 130992 117521 97648 96825
9982 96825 119055 124462 138519 148593 125780 120226 102318 111026 121172 103265 98423 90681 78086
9969 78086 74334 76011 88995 111611 134574 97655 69073 77891 94815 101086 111850 121096 118905
9956 118905 103955 79141 58614 57260 74917 80664 86744 83395 79072 96982 144029 157684 161487
9943A61487p56m156k710k0687K53r479k0676J5122P274K108Q220n880j2083k4561
9929I3476Q372K2103L2695k366k5105l070J646j0534k0301K5189J1411j0278n591
9916A17647j4580N487k476j778k093j5619J2909J8084J4486j1470J1235Q616r440
9903A31008k3313k2220O666l17p401O95j7558K226K9238Q105j4358L828K1391
9890A17990K7237o40j4010J2414l12L106k9n546n037p069K5526J2789j4003j8496
9876A33920j1614O876J1633o350L317j3131Q459L5134N76m2122n501r669k2153
9863H9375R573o38O976Q046p610L158k758L211J1927m867J2387K4190N899j3707
9849A45162j1338J9982J2863K2825j177j8406j4147K1844J2593j9037j3746N387
$$ plain form
9943 161487 160731 156575 153865 133178 133431 123952 103276 118398 125672 127780 136000 130120 118037 93476
9929 93476 101848 123951 156646 154280 129175 126105 127751 117217 96916 122105 133516 123238 117647
9916 117647 103067 108554 106078 104300 102207 86588 99497 117581 132067 120597 131832 140448 131008
9903 131008 107695 85475 92141 91824 84423 85118 67560 69786 99024 107129 92771 96599 117990
9890 117990 145227 144587 130577 142991 142679 145785 145756 140210 135173 128104 153630 166419 152416 133920
9876 133920 122306 129182 140815 134465 137782 124651 133110 168244 168820 126698 121197 111528 89375
9863 89375 98948 98310 105286 113332 105722 108880 106122 109333 121260 116393 128780 152970 158869 145162
9849 145162 133824 153806 166669 189494 188317 169911 155764 177608 190201 171164 157418 162805
9837A62805J2546p332M790N507J0434J8018O603K6767P308n392j719l1151l1459
9824A77725j695q106k0562j9678J8024J8579R958J6109J4517j8O119J0200J6525
9811B37697M587r990K4945L9806K0703L8854P5861P5214J6933q3911o4190k9591
9799C46918l2924k4012m342o515k0657j815J7085J3057k1352k6529n178n336j4255
9786B14145k516Q755l769j3104K4633J5220j60k3357j4297Q88M922K0979K148
9773B34487k4947P473K2159K0329m0482j4678K3941K1231j0128j1919L2695N18
9761B60679p754n21n099J0264L714J1487M276j4308r632J0404J2845N538j8944
9748B62949J8668r539j8600p823K6525K3808M1410k6006j8772j362n38q045j1830
$$ plain form
9837 162805 175351 168019 172809 178316 188750 206768 213371 240138 247446 242054 240335 209184 177725
9824 177725 176030 167924 147362 127684 145708 164287 174245 190354 204871 204853 210972 221172 237697
9811 237697 242284 232294 257239 297045 317748 356602 432463 507677 524610 440699 376509 346918
9799 346918 313994 289982 285640 279125 258468 256653 273738 286795 265443 238914 233736 228400 214145
9786 214145 211629 220384 216615 203511 228144 243364 243204 219847 205550 206438 211360 232339 234487
9773 234487 209540 217013 239172 259501 219019 204341 228282 249513 239385 227466 260161 260679
9761 260679 252925 252404 247305 257569 261283 272770 277046 262738 253106 263510 276355 281893 262949
9748 262949 281617 272078 253478 245655 272180 295988 337398 311392 292620 291258 290720 282675 270845
9735B70845M840K9083j8118R49L7767N354J5107l413o404l560J3383K3212k308
9722C66737q528J9609L5041L0785N2121M2646P9883J18859J84426L21445L15722
9711A558746J14351j88246k69933k12751j19993r5566r3016l7273j5700j7742
9701F22877j9859j8810k9802j9969l11J3942p676n96k2688j9137J2753n656J994
9688E07062J8536l731l4355J073L301J4475J8427J9229k6649j4240N337K479Q80
9675E11824j3753j7844l12J4083Q483J0219O944K2642L759l130L653K919K0967
9662E70454K6148J9491J0387q426Q061J839l889J3412l457J7484K7964K4780K8753
9649G33001o011j4505j5810O252k6284j1263K6228Q6n444j7703J6948L5057K3594
$$ plain form
9735 270845 275685 304768 286650 287599 325366 330720 345827 342414 336010 332450 345833 369045 366737
9722 366737 358209 377818 412859 443644 495765 538411 618294 737153 921579 1243024 1558746
9711 1558746 1673097 1484851 1214918 1002167 882174 786608 693592 656319 640619 622877
9701 622877 603018 584208 554406 534437 534126 548068 540392 539796 517108 497971 510724 505068 507062
9688 507062 525598 521867 487512 488585 491886 506361 524788 544017 517368 503128 508465 510944 511824
9675 511824 498071 480227 479915 493998 502481 512700 519644 542286 546045 542915 546568 549487 570454
9662 570454 596602 616093 626480 618054 626115 627954 624065 637477 634020 651504 679468 704248 733001
9649 733001 726990 712485 696675 702927 676643 665380 691608 691694 686250 668547 685495 720552 744146
9636G44146J9156M863J4824p367O315K8625O48k975L234m49J5685Q478N074l4402
9622H05855J7294M5630j0041k233J9716M564o311J4522K4933n889O700L0440P568
9609I52748J4018J4682L8350l928j2734J0049R942R358K8354M3184J3615j072
9597A116566l014Q250j2431M782J5316K3378K4282L7846L2420J980K2587K7201
9585A299163K3271n605K5859R049N679N5124K9779P406K3236K1390K3739J9196
9573A537286L6730J7455L935K5727Q993K5220L9879K2361R846K8824K6934J7876
9561A801066K2931K1658L1435M9272K8535M1210K7256K2341K4654K6581L4533
9550B131472K9254L6279M7216P3582L3945J0229J7512M4442N5917N0464M3420
$$ plain form
9636 744146 763302 768165 782989 775622 781937 810562 811210 808235 811469 811020 826705 835183 840257 805855
9622 805855 823149 868779 858738 856505 876221 880785 874474 888996 913929 908040 914740 945180 952748
9609 952748 966766 981448 1019798 1015870 1003136 1013185 1023127 1032485 1060839 1104023 1117638 1116566
9597 1116566 1113552 1121802 1109371 1114153 1129469 1152847 1177129 1214975 1247395 1249375 1271962 1299163
9585 1299163 1322434 1316829 1342688 1351737 1357416 1412540 1442319 1449725 1472961 1494351 1518090 1537286
9573 1537286 1574016 1591471 1595406 1621133 1630126 1655346 1695225 1717586 1727432 1756256 1783190 1801066
9561 1801066 1823997 1845655 1877090 1926362 1954897 1996107 2023363 2045704 2070358 2096939 2131472
9550 2131472 2160726 2197005 2244221 2317803 2351748 2361977 2379489 2423931 2479848 2530312 2573732
9539B573732L8051J4875O0618P7518L4377K1176N0814L8102M1614O7171O7796
9528C085844N2205M1743M3721M7442N5595P0865Q2501O5441L9726O1042P6453
9517C722578P0616P2001R7235Q0011O6882Q1053J14803J13790P8369Q6484R4353
9506D678175Q9936P0828J04241Q6809R0452J35172J49622J23775J44778J27862
9496E801650J22244J26886J20725J39509J07954J39146J41982J39819J51220J94189
9486G185324J46630J40729J82624J67539J74363K13165J92807K02540J71493J83202
9476H960416K17392K14536K20363K06995K16115K14743K28591K45141K45035K57982
9466A1227309K26983J84037K04248K37988K45738K30834K12658K21717K47087
$$ plain form
9539 2573732 2611783 2626658 2687276 2764794 2799171 2820347 2871161 2909263 2950877 3018048 3085844
9528 3085844 3138049 3179792 3223513 3270955 3326550 3397415 3479916 3545357 3585083 3646125 3722578
9517 3722578 3793194 3865195 3962430 4042441 4109323 4190376 4305179 4418969 4497338 4583822 4678175
9506 4678175 4768111 4838939 4943180 5029989 5120441 5255613 5405235 5529010 5673788 5801650
9496 5801650 5923894 6050780 6171505 6311014 6418968 6558114 6700096 6839915 6991135 7185324
9486 7185324 7331954 7472683 7655307 7822846 7997209 8210374 8403181 8605721 8777214 8960416
9476 8960416 9177808 9392344 9612707 9819702 10035817 10250560 10479151 10724292 10969327 11227309
9466 11227309 11454292 11638329 11842577 12080565 12326303 12557137 12769795 12991512 13238599
9457A3238599K44353J97484J96245K09969K09278K08666J97760J71414J55251
9448A5029019J43045J42987J54369J54698J04450Q2107N9095M2965N0947M3098
9438A6006780L3558J2034J2459j1341n9730n3804o7677j06812j17632j00730j08010
9427A5439095j39138j40520j48055j66029j82352j87140j93705j90290k06719
9418A3885147j95481j90100j84053k11505k13485k23819k23358k09441k18839
9409A2015066k19400j79940j66913k04163k23458k17903k41511k29437k07471
9400A0124870k14237k39574j99872k02494k03534j83920j87696j80745j66777
9391H346021j64274j72523j70870j76924j60091j56593j72609j71399j37601j25700
$$ plain form
9457 13238599 13482952 13680436 13876681 14086650 14295928 14504594 14702354 14873768 15029019
9448 15029019 15172064 15315051 15469420 15624118 15728568 15810675 15869770 15912735 15963682 16006780
9438 16006780 16040338 16052372 16064831 16053490 15993760 15939956 15872279 15765467 15647835 15547105 15439095
9427 15439095 15299957 15159437 15011382 14845353 14663001 14475861 14282156 14091866 13885147
9418 13885147 13689666 13499566 13315513 13104008 12890523 12666704 12443346 12233905 12015066
9409 12015066 11795666 11615726 11448813 11244650 11021192 10803289 10561778 10332341 10124870
9400 10124870 9910633 9671059 9471187 9268693 9065159 8881239 8693543 8512798 8346021
9391 8346021 8181747 8009224 7838354 7661430 7501339 7344746 7172137 7000738 6863137 6737437
9381F737437j24772j39441j33397j28600j08771j25574j14830j19865j23327j08037
9371E510823j09407j12430j05587r0527p5987o8166q0939q9953n2857k8370j6022
9360D680578K953Q766J8244N2094P3817Q4953J13411J15662N2038K0567j359l8486
9348E183238r8419j76503k14919j78100k06280k15216j66512j59293j45913j24599
9338C497484j26642r2616q0862q7040p2400n1158n5935o7293p2169n4915k4769
9327B711685m6686o3731p7749n8566n1097m9830l6899j8517k6490l1266l7926
9316B212928n6057n2737l2625l2269p789k2495m1712l4668p381j6915k4195j5016
9304A869069l3951m7375l0063k8271j0089m53j6470k2985p311m2594l3804j0316
$$ plain form
9381 6737437 6612665 6473224 6339827 6211227 6102456 5976882 5862052 5742187 5618860 5510823
9371 5510823 5401416 5288986 5183399 5092872 5016885 4948719 4867780 4777827 4724970 4696600 4680578
9360 4680578 4683531 4692297 4710541 4762635 4836452 4921405 5034816 5150478 5202516 5223083 5221724 5183238
9348 5183238 5084819 4908316 4693397 4515297 4309017 4093801 3927289 3767996 3622083 3497484
9338 3497484 3370842 3278226 3197364 3110324 3037924 2986766 2930831 2863538 2791369 2736454 2711685
9327 2711685 2664999 2601268 2523519 2464953 2413856 2364026 2327127 2308610 2282120 2250854 2212928
9316 2212928 2156871 2104134 2071509 2039240 2031451 2008956 1967244 1932576 1925195 1908280 1884085 1869069
9304 1869069 1835118 1787743 1757680 1729409 1719320 1718867 1702397 1679412 1672101 1629507 1595703 1585387
9292A585387k6855k9195k2061j6192j0636k8234j3475k507O942l5146r054j8153
9280A380821l0708j3656l183J1032k821k2824m836j1272l7361j6978J1671k594
9268A257291j5348m0105k4898k8503n9348q3471n9312n0101j6713j2225O823M728
9256H78818k0788j3342j4386k7889J5919O670j27j5876j286J0142j2612j6081
9244G89162l428J7049q303k6671j0885J2801j2361q936Q914k0071l183q075J0173
9231G36186R354K7019K1577J698k1339j2869L960J8829j0199k5772j4474j0340
9219G23630k2524r607k68J174L559N414K3708R752J6931J9716J8864M4315L9575
9206H74239L8085j1067m5191k0874j2285q088l4424n8152l6984j2315j0349j6622
$$ plain form
9292 1585387 1558532 1529337 1507276 1491084 1480448 1452214 1438739 1436232 1443174 1408028 1398974 1380821
9280 1380821 1350113 1336457 1333274 1344306 1341485 1318661 1313825 1302553 1265192 1248214 1259885 1257291
9268 1257291 1241943 1201838 1176940 1148437 1089089 1005618 946306 896205 879492 867267 874090 878818
9256 878818 858030 844688 830302 802413 818332 825002 824875 808999 807713 817855 805243 789162
9244 789162 785734 802783 794480 767809 756924 769725 757364 748428 757342 737271 734088 726013 736186
9231 736186 745540 772559 794136 795834 774495 761626 765586 784415 774216 748444 733970 723630
9219 723630 701106 691499 691231 692405 695964 701378 725086 734838 751769 771485 790349 834664 874239
9206 874239 912324 901257 856066 835192 822907 814819 780395 722243 685259 672944 662595 645973
9194F45973j9295q97n407j0319k139m538K877j687p971j0999l1735l85J593J5318
9180E70389K0809k2904J0174K3914l871k693K4394L165k5307j675j2826j5743
9168E67826q045l2679k2637q187k2668l6615j9226R713K6596J3172J5977M525
9156D87752r42j6899k8972j5192N808j0259k4627j7003J4882L9154N0244M3754
9144E27700J9082J1219K766j505o066q810m466J5702j1799l2589k8584j9990j4773
9131D47887j7148p249K3465J6583R669p145j3287N916Q430j096j4425k0632O040
9118D37008L418J3208j317l611J1235L319L2372K8220K7585P2566M7999l2263
9106F39739q1366o2483n8847m7980k1261K478l565J3717J7304m954q206j7130
$$ plain form
9194 645973 626678 625781 620374 610055 607916 603378 606255 604568 596597 585598 553863 553478 555071 570389
9180 570389 591198 568294 578468 602382 598511 595818 620212 623377 598070 596395 583569 567826
9168 567826 559781 527102 504465 496278 473610 436995 417769 427482 454078 467250 483227 487752
9156 487752 486810 469911 440939 425747 431555 421296 396669 379666 394548 433702 483946 527700
9144 527700 546782 558001 560767 559262 553196 544386 539920 555622 543823 511234 482650 462660 447887
9131 447887 430739 423490 446955 463538 473207 466062 452775 458691 467121 466025 451600 430968 437008
9118 437008 440426 453634 452317 448706 459941 463260 495632 523852 551437 624003 672002 639739
9106 639739 558373 495890 437043 389063 367802 370280 366715 380432 397736 392782 384576 367446
9094C67446J6p874K9820L0526J1512L578j7765J3299P455p062n178J2910K7876
9081D66559J3223O9697J31258J28971M5674o5179p5309l5092m2434m7410p704
9070E82254j682k7099l737q037J2996J1909K5397N4146N8089M2268L2881J0157
9058G89542o289J2354J9271M573r939k5443k2343l6137k6476k1683k8913j7962
9046F30555J8456O984o057N079n856L279J0116K2419J7855N080J419Q951m3880
9033F74400l7820k5966m237Q872L4014N6266L4440J3737J4513j6254l7588j7270
9021F97107J699K743R54p260r653K6861J8605k0095l431j0941j5424L7956L9493
9008G58614N3664O6417J06556J22433R1205N7385N2437R1093J05255J14931J16825
$$ plain form
9094 367446 367462 359588 389408 419934 431446 435024 417259 430558 438013 430951 425773 438683 466559
9081 466559 479782 549479 680737 809708 855382 790203 714894 679802 637368 589958 582254
9070 582254 580572 553473 549736 541699 554695 566604 592001 646147 704236 746504 779385 789542
9058 789542 783253 795607 814878 819451 809512 784069 761726 725589 699113 677430 648517 630555
9046 630555 649011 655995 649938 655017 649161 652440 662556 684975 702830 707910 709329 718280 674400
9033 674400 636580 610614 606377 615249 649263 705529 739969 753706 768219 751965 714377 697107
9021 697107 698806 701549 702503 695243 685590 712451 731056 710961 707530 696589 681165 719121 758614
9008 758614 812278 878695 985251 1107684 1198889 1256274 1308711 1399804 1505059 1619990 1736815
8997A736815Q5589N9135M2255O5762O3450O7659J41998J60763J58808J81371J63989
8986B927594J68935J52172J98491K43874K64216L40488M26577M77450N44587O17674
8976F362058O95795Q24099R82096J133174J384563J680570K004798K472363L052701
8967B0592217L670712M362541N090442N686838O164963O843349Q285950J0878104
8959G1575116J5041981K1761553L2738800N0250170P5034758R9580969J01201626
8952D67184973N4401980l1670018r2016208r4225739p0563511m8246833l2925215
8945A51939429k3005028j6377427j1768697q399149n921043m247104l424647l726492
8937G5069842m996554o124040o364504n960220n360649m676383m044152l508756
$$ plain form
8997 1736815 1822404 1881539 1923794 1989556 2053006 2120665 2262663 2423426 2582234 2763605 2927594
8986 2927594 3096529 3248701 3447192 3691066 3955282 4295770 4722347 5199797 5744384 6362058
8976 6362058 7057853 7881952 8864048 9997222 11381785 13062355 15067153 17539516 20592217
8967 20592217 24262929 28625470 33715912 39402750 45567713 52411062 60697012 71575116
8959 71575116 86617097 108378650 141117450 191367620 266402378 365983347 467184973
8952 467184973 521586953 489916935 397900727 303674988 233111477 184864644 151939429
8945 151939429 128934401 112556974 100788277 92389128 86468085 82220981 78796334 75069842
8937 75069842 70073288 63949248 57584744 51624524 46263875 41587492 37543340 34034584
8929C4034584l023126k675934k441609k151657j880436j637753j446271j316542
8921A7461256j262344j169182j120708j016544r17527q00797o88004o10578n89593
8912I285979n72000n41283n25660m77611m80374m37803l65658k93298k14263k43340
8902E134689k60167k43351k20473j70475j43710j33239j11532j35354j33485j09936
8892C472967j28193j25521j42706j43849j41802p4952o8197l7069m6765m5605
8882B518308o4448r1561n2807n9943m7622j3841m8376k2467N212l1472o0023o6303
8870A964657p2571o0224l3617k810O477N864K3246K7507L2763k0096m7505o7496
8858A756195q3950o2753n0152o3323n0267m7400n7394m3098k1086l8098l1420
$$ plain form
8929 34034584 31011458 28335524 25893915 23742258 21861822 20224069 18777798 17461256
8921 17461256 16198912 15029730 13909022 12892478 11974951 11174154 10486150 9875572 9285979
8912 9285979 8713979 8172696 7647036 7169425 6689051 6251248 5885590 5592292 5378029 5134689
8902 5134689 4874522 4631171 4410698 4240223 4096513 3963274 3851742 3716388 3582903 3472967
8892 3472967 3344774 3219253 3076547 2932698 2790896 2715944 2647747 2610678 2563913 2518308
8882 2518308 2453860 2362299 2309492 2249549 2201927 2188086 2139710 2117243 2122455 2090983 2030960 1964657
8870 1964657 1892086 1831862 1798245 1795435 1801912 1807776 1831022 1858529 1891292 1871196 1823691 1756195
8858 1756195 1672245 1609492 1559340 1496017 1445750 1398350 1340956 1297858 1276772 1238674 1207254
8847A207254k6528l5752j5884k587J2870N37K6503K2202K2680J8548J208l688
8835A227363J1685k0553m8941j3580J694K0377K1105k5122p4516r9824j18496
8824H81192l9949R2381R4374K4287o902k0248l5211l5549k4584m260j1340J0347
8812I24538J7396J7700L7510N206k5906l3593l6360j9262M493K0679p846j6651
8800H87904l5018m6985n5254m9553J407K043K2387N1566M4993L577P419p534j7388
8787H09564k2877j0183J0283o547j3184o424M448l4370P175J6430m758j1298j0194
8774G28065j7933J1100J414j5195P855k3060l6815P860p67j1505j7913j4560l7748
8761E80798p690K4356K1091J1886J6218O225K3833J5178k2593r310N647J3770
$$ plain form
8847 1207254 1180726 1144974 1129090 1126503 1139373 1139910 1166413 1188615 1211295 1229843 1231051 1227363
8835 1227363 1239048 1218495 1169554 1155974 1157668 1178045 1199150 1174028 1099512 999688 881192
8824 881192 841243 933624 1027998 1052285 1045383 1025135 989924 954375 929791 925531 914191 924538
8812 924538 941934 959634 997144 1002350 976444 942851 906491 887229 891722 912401 904555 887904
8800 887904 852886 805901 750647 701094 702501 704544 726931 778497 823490 827067 834486 826952 809564
8787 809564 786687 776504 786787 780240 767056 760632 765080 730710 737885 754315 749557 738259 728065
8774 728065 710132 721232 722646 707451 715306 692246 655431 663291 662524 651019 633106 618546 580798
8761 580798 573108 597464 618555 630441 646659 652884 676717 691895 669302 659992 665639 679409
8749F79409N538p923j0620p668J8843N758O748M544j713j0917o288j0616k5215
8736F39880k4344k0837j1607j4849N917K0181J5038P889j406J4847L6630K0438
8724F87777J4317J5598j7233K4479L0400Q572K8842L7197L7618L1025P762n145
8712I01209l0591m4566j8897j9842j8149L300J8390l5077m567N277q518R74J193
8699G50136k682Q414K2572K7377K1723j1862j3548K8818J0542K952L2873J9339
8687H96654j494M0857M2661L6614M2644O8294J03787J45300K14097K91198M10397
8676B291009O27247R01391R50101L95958n62706r93491p89173m81867l11613j91524
8666A835332j24791q0092o3122l0131o66J1032K6258L0527K5401Q987K6403P4207
$$ plain form
8749 679409 684947 677024 666404 658736 677579 683337 690085 694629 692916 681999 675711 665095 639880
8736 639880 615536 594699 583092 568243 574160 594341 609379 617268 615862 630709 667339 687777
8724 687777 702094 717692 700459 724938 755338 763910 792752 829949 867567 898592 906354 901209
8712 901209 870618 826052 807155 787313 769164 772464 790854 755777 751210 756487 747969 748943 750136
8699 750136 747454 755868 778440 805817 827540 815678 802130 830948 841490 844442 877315 896654
8687 896654 895160 936017 978678 1015292 1057936 1126230 1230017 1375317 1589414 1880612 2291009
8676 2291009 2918256 3819647 4769748 5165706 4603000 3609509 2820336 2338469 2026856 1835332
8666 1835332 1710541 1630449 1567327 1537196 1536530 1547562 1573820 1604347 1629748 1638735 1665138 1739345
8654A739345O5253O4960M3687n349n8431q1932n2097k3560J394j069J6763M5509
8642A754473M9461K4025L7115Q3404J05943J27198J28387J77515K94829M94327
8632C276677P65284J168698J760573J982683R65558j093633k060659j618503j001350
8623D145328o07758l92382k54897j80950r6308o0790k1065k578M9102J05505J65975
8612B849182K21292K17584J37350j571n8715p3851o2183r5384j30495j25309q2602
8601B795298m3558k8122K2039K8713J02354J29723J10488J55300J69314J64100
8591C605649J99458K04454K22251K64670L28209M83777O94613P69163L83173n17989
8581F637428j102977j019338p06050m97015l28491k47991j79798j50303j08357
$$ plain form
8654 1739345 1804598 1869558 1913245 1907896 1849465 1767533 1715436 1691876 1693270 1692201 1708964 1754473
8642 1754473 1803934 1827959 1865074 1948478 2054421 2181619 2310006 2487521 2782350 3276677
8632 3276677 4041961 5210659 6971232 8953915 9919473 8825840 6765181 5146678 4145328
8623 4145328 3537570 3145188 2890291 2709341 2613033 2552243 2531178 2528600 2577702 2683207 2849182
8612 2849182 3070474 3288058 3425408 3423837 3365122 3291271 3229088 3133704 3003209 2877900 2795298
8601 2795298 2751740 2723618 2745657 2774370 2876724 3006447 3116935 3272235 3441549 3605649
8591 3605649 3805107 4009561 4231812 4496482 4824691 5308468 6003081 6772244 7155417 6637428
8581 6637428 5534451 4515113 3809063 3312048 2983557 2735566 2555768 2405465 2297108
8572B297108l8598O446O8725J50525K52007L46081K87869j02980l32833k91834
8562B642516j78800j26203j18488q1559n2357m5442O168M3455R8846J25171J22917
8551B436224J27549J02469N5142J069k0884q5705j08855j07714j37948k02036
8541B059311j95839j60546j35879j16168j12236p4942n3610k9171k7288j7761
8531A135871m7910n1402l4886l6914k3634J379L9988Q8135J58412J39773K4657
8520A393469j63691k02273j35908p8918n4015k5183j7440l2263o938j6219l4139
8509F26482m792J088J5985R227j4325k4486j4866k460j661m383P47J073n0059
8496E37570k6478j3715K874J2086J5680q292j3771O648J452K5687L1614J1600
$$ plain form
8572 2297108 2258510 2264956 2333681 2484206 2736213 3082294 3370163 3267183 2934350 2642516
8562 2642516 2463716 2337513 2219025 2137466 2085109 2039667 2045835 2089290 2188136 2313307 2436224
8551 2436224 2563773 2666242 2721384 2722453 2701569 2615864 2507009 2399295 2261347 2059311
8541 2059311 1863472 1702926 1567047 1450879 1338643 1263701 1210091 1180920 1153632 1135871
8531 1135871 1087961 1036559 1001673 964759 941125 942504 982492 1070627 1229039 1368812 1393469
8520 1393469 1229778 1027505 891597 812679 758664 733481 716041 683778 676840 660621 626482
8509 626482 621690 622778 638763 647990 633665 609179 594313 591853 590192 585809 586556 587629 537570
8496 537570 511092 497377 500251 512337 528017 519725 505954 512602 514054 539741 571355 582955
8484E82955j6706k4290k1085k3196k6676K547J8695Q011k3998j6377j4218k0848
8472D24814q224O606J4181J6837J1900J0545k5389k2090N651k752L864L0566o795
8459D59714k4006Q201J0202J202k196J946O687r905k308j263j3788q620K413J4574
8445D42853Q747q12K1067k8893k4958k9990j9520j683R228N08j5624j0305m16
8432C50202J6059J4405L788k6031j3706J186J085J3198P878M423n440L335o083
8419C64299J3844j2362k9672J1317M07j2754n520N0p808K5388J3623N474R8j1924
8405C54460l0730P576J5123J0067r911M26k898k1370J1434o788p283o678R140
8392C22568M921k354j8079j7308J8417j5729L202M0665J856k6826m986j0334j2367
$$ plain form
8484 582955 566249 541959 520874 497678 471002 473549 492244 500255 476257 459880 445662 424814
8472 424814 416590 423196 437377 454214 466114 476659 451270 429180 434831 432079 435943 466509 459714
8459 459714 435708 443909 454111 455313 453117 455063 461750 451845 449537 448274 434486 425866 428279 442853
8445 442853 451600 450788 471855 442962 418004 388014 368494 366811 376039 376547 360923 350618 350202
8432 350202 366261 380666 384454 358423 344717 345903 346988 360186 368064 372487 367047 370382 364299
8419 364299 378143 365781 336109 347426 347833 335079 329559 329609 321801 347189 360812 366286 366384 354460
8405 354460 323730 331306 346429 356496 346585 347011 344113 322743 334177 327389 320106 313428 322568
8392 322568 327489 325135 307056 289748 308165 292436 295638 336303 338159 311333 306347 296013 283646
8379B83646k4173N008L0414J0346o713o176Q443J1863M833N402k01O132J4386
8366C43210p852l3134r603j318q058m571k1106p567p088j2366J2133K7375r98
8353B69057J660M341O880j1020p068J5332j3024r248q230M906J8741j603p614
8340B63110k1119p662K6084k061L977l290p458R490J8238K6016p062O491Q806
8327C13560J4322o686k8714k4141r968j0840P367k269J471P704K7391N876k701
8314B92372j640J5768j1222l820K249K1574r567k9321j3217L456k3468N69K5079
8301B68812K1265k9195j7836N782R186q731L0612K9212J7452j4996L13j0614k2412
8288B78850r845j1363J0879J2310K3395R554L126P255j6887j8018j1493q982P120
$$ plain form
8379 283646 259473 264481 294895 305241 298528 292352 300795 312658 317491 322893 322692 328824 343210
8366 343210 335358 302224 292621 291303 283245 278674 257568 250001 242913 230547 242680 270055 269057
8353 269057 270717 275058 281938 270918 263850 279182 266158 256910 248680 253586 272327 270724 263110
8340 263110 241991 234329 260413 258352 262329 259039 251581 261071 279309 305325 298263 304754 313560
8327 313560 327882 321196 292482 268341 258373 247533 254900 252631 254102 261806 289197 295073 292372
8314 292372 290732 306500 295278 291458 293707 315281 305714 276393 263176 266632 243164 243733 268812
8301 268812 290077 260882 243046 248828 258014 249283 279895 309107 326559 311563 311876 301262 278850
8288 278850 269005 257642 268521 280831 304226 313780 316906 324161 307274 289256 277763 268781 275901
8275B75901p404k3335N229J3107m222R700J7971O09m3396k1500J9415K6279j5618
8262B52736o507J6742R977q429R219o04j2554k4261p303n602n615K3889R680J597
8248B52965q193O845q099J5359K0094K2079K901O348p097k8179M855M926k3411
8235B61393j5342J0226p756j5300K614K906J0012P324J2208J1910P511j8435j9097
8222B50174J9161J4512r147k1480q42J8188R038n937j5843r219j8095p059m622
8209B18829L1665M602n144L829J0158j5945k932J8015l08j0291J1133M566K674
8196B70851j6534j3098q8K1368J4194p45k2400n823r635p55J9371o984j6362j6554
8182B16806k200K4867K4654R381j4632k0746o515K630L5773N593j4061k4663q117
$$ plain form
8275 275901 268497 245162 250391 263498 259276 268976 286947 287556 244160 222660 242075 268354 252736
8262 252736 246229 262971 272948 264519 273738 273134 260580 236319 229016 223414 217799 241688 251368 252965
8248 252965 244772 251617 243518 258877 278971 301050 303951 310299 303202 275023 279878 284804 261393
8235 261393 246051 256277 248521 233221 235835 238741 248753 256077 268285 280195 287706 269271 250174
8222 250174 269335 283847 274700 253220 252378 270566 279604 273667 257824 248605 230510 223451 218829
8209 218829 250494 255096 249952 253781 263939 247994 245062 263077 262769 252478 263611 268177 270851
8196 270851 254317 241219 241131 262499 276693 275948 253548 247725 238090 237335 256706 249722 233360 216806
8182 216806 214606 239473 264127 273508 258876 238130 231615 234245 270018 275611 261550 236887 228770
8169B28770k66J0264K0866m01p318K042j5154k5157j4179K6389L848j9083J0152
8156B20773o804O092R235N777K2663J9593k4629r770P370r291O168k5882J0465
8143B31760j873j8781R40J9433l630o609J5921J328k670p338P509j1990k830O047
8129B27217j0661J4504J0061j8070J1751k286k0914K5398J1681p003J7711J6551
8117B75940J1075l8585m1468j3324L61J6230J3252L168J2276J1578p225p118J4376
8104B50536J6370o985m557K2669J3329N438j4778K813l15j0454n783N17k0922
8091B47878o404J5597K529k89N647L776K6319J2936j0490J0281k438j4731k0435
8078B70176J605J762L124K1426R41j0112k277J4497J5363n376k2529O425K418
$$ plain form
8169 228770 228504 238768 259634 259233 251915 253957 238803 213646 199467 225856 229704 210621 220773
8156 220773 213969 220061 229296 235073 257736 277329 252700 242930 250300 241009 247177 221295 231760
8143 231760 229887 211106 212046 231479 227849 221240 237161 238489 235819 228481 235990 224000 221170 227217
8129 227217 216556 231060 241121 223051 234802 232516 211602 237000 248681 241678 259389 275940
8117 275940 287015 248430 206962 193638 193999 210229 223481 226649 238925 250503 243278 236160 250536
8104 250536 266906 259921 255364 278033 291362 296800 282022 284835 284520 274066 268283 268800 247878
8091 247878 241474 257071 259600 259311 264958 268734 295053 307989 297499 307780 305342 290611 270176
8078 270176 271781 273543 276667 298093 299034 288922 286645 301142 316505 311129 288600 295025 297443
8065B97443q420J7850K7050L3236K7748J2536j7288l4060j1022q484K0118J151
8053C57858J2097J9455R880n525o582l191J6124J0030K441o18J437P899J9721
8040D41026K9272J0437J3960O151j5991j0020j1092l949M134j2943J667J5796
8028D68448m367J2147L614K1355O308l7356N02L3111K9430K575l690p483j4714
8015E09880J8791P675K745L4043N0803Q751j0189L6053J4655j6888M5655L3328
8003G35302O306J9441N6769L9118J8562M1913K8184l3898l5011j5567l3590k2035
7991H05494L176r147k5296j5052l739j5664l4550j2634j5893l620j4606k5369
7979F33100l328M664j044J4871j863J9477M659O681N0989M3085J3143K2196K6319
$$ plain form
8065 297443 289023 306873 333923 367159 394907 407443 390155 356095 345073 336589 356707 357858
8053 357858 369955 389410 399290 393765 387183 383992 400116 410146 412587 411969 413406 421305 441026
8040 441026 470298 480735 494695 500846 484855 474835 463743 459794 463928 450985 452652 468448
8028 468448 464081 476228 479842 501197 507505 470149 470651 503762 533192 535767 532077 524594 509880
8015 509880 528671 536346 539091 573134 623937 632688 622499 658552 673207 656319 701974 735302
8003 735302 741608 761049 817818 856936 875498 917411 945595 911697 876686 861119 827529 805494
7991 805494 808670 799523 774227 759175 755436 739772 705222 692588 676695 673075 658469 633100
7979 633100 629772 634436 633392 648263 646400 665877 670536 677217 728206 771291 784434 806630 832949
7966H32949J0963J4685K927L0637N3507L8823M1981L2166K9466J1278k7222Q500
7954A080660J9976L371Q974k3514k4057j0173j4648j7308k2192l1953j0570m8657
7942I09909m4657l5922j1299n964Q064J3281l4087k9074j5938J5707K718r653
7930G63085N308R993J8918j3659J0253Q640K3383J0940j7051K9725k607L9515
7918H86443K4504K6734q212m0162k3948Q906K2145j3369k3221j6240m9555m8808
7906G45217k609P667N876m478l0641k9422J1787M926k8825j8193L2400J1604n039
7893G00270q878q822k3072k0517m114m756j59p190k6194l8058j2936P713q005
7880E45282r936O520n962j2568j5574p170p010Q66k4035k736j6449k0830p471
$$ plain form
7966 832949 843912 858597 861524 892161 945668 984491 1026472 1058638 1088104 1099382 1072160 1080660
7954 1080660 1100636 1104007 1112981 1089467 1065410 1055237 1040589 1023281 1001089 969136 958566 909909
7942 909909 865252 829330 818031 812067 820131 833412 799325 770251 754313 770020 772738 763085
7930 763085 768393 778386 797304 783645 793898 802538 825921 836861 819810 849535 846928 886443
7918 886443 910947 937681 929469 889307 865359 874265 896410 883041 859820 843580 794025 745217
7906 745217 742608 750275 756151 751673 721032 691610 703397 708323 679498 661305 693705 705309 700270
7893 700270 691392 682570 659498 638981 634867 630111 629952 622762 596568 558510 545574 553287 545282
7880 545282 535346 541866 535904 523336 507762 500592 493582 494448 470413 467677 451228 430398 422927
7867D22927K67J1588J107k1546j6736N626l649j3286l1990p62R606j2344N585
7854C56393J1628L355J571j2876j8336J5461J1195j989k7379k7641K019Q119J3325
7841C34845K9j7965j8339j5600p468M914j8574j2189O553k6497K022J7422o980
7828B42173l2183o012J6090m898j6435j7155j1170J6700n147j958J4230J2534
7816B06769j7696J562J5768k3413j1922J0236J698j7969j448M264q232r12J053
7803A59758M852N147J317O967m944k987k116J4971m97j9146J126j3264O19l555
7789A48248N507L281L994m825r157j6111k4546M99K3470J3641m180J1503J3270
7776A64594m733K1370j1052J677k3481l569J5520m917r150Q329J2705j2504m3698
$$ plain form
7867 422927 423194 434782 435889 414343 397607 403233 399584 386298 354308 353546 363152 350808 356393
7854 356393 368021 371376 372947 360071 341735 357196 368391 366402 339023 311382 313401 321520 334845
7841 334845 334874 316909 298570 282970 275502 280416 261842 249653 256206 229709 231731 249153 242173
7828 242173 209990 203978 220068 215170 198735 181580 170410 187110 181963 180005 194235 206769
7816 206769 189073 190635 206403 182990 171068 181304 183002 165033 163585 167849 159617 158705 159758
7803 159758 164610 169757 171074 178041 173097 170110 167994 182965 182468 163322 164448 151184 151803 148248
7789 148248 153755 157036 161030 156205 147048 130937 106391 106890 130360 144001 139821 151324 164594
7776 164594 159861 181231 170179 171856 148375 144806 160326 155409 146259 154588 167293 154789 111091
7763A11091j406O342k5134r953k2363Q786L4579J3868n535k98j0389j6849j1108
7750G1631J7517J4042K927J4805j0939j921J7173j1948k3012k7855O015J1608
7738H0043K039k059Q215K4412k313p77M470j6239O190j8756q335K1312p363J042
7724I1881m713p61k1000O50p520n858J3477O529J4808K040m2978m5201L808J7584
7710B2746J2534K5516P256O979J3176J9102n400J2046l2753l1495k9300J1211
7698C1618J6470Q816N477k522j9592k4746K1657Q601j5313r186M133K2270l960
7685D3723K1899K6617j4854o311J5150J8216r12q665k1621j3887k0236n276M495
7672C8338O934m173n176L769J8289J7434J0280L78k0286n15J056k0304k1576K2228
$$ plain form
7763 111091 109685 116027 90893 80940 58577 67363 101942 115810 110275 109977 99588 82739 71631
7750 71631 89148 103190 106117 120922 109983 108062 125235 113287 90275 62420 68435 80043
7738 80043 82082 80023 88238 112650 110337 109560 114030 97791 103981 85225 76890 98202 90839 91881
7724 91881 87168 86407 65407 66057 58537 52679 66156 72685 87493 89533 46555 1354 5162 22746
7710 22746 35280 60796 68052 75031 88207 107309 101909 113955 81202 49707 20407 31618
7698 31618 48088 56904 62381 59859 40267 15521 37178 45779 30466 21280 25413 47683 43723
7685 43723 65622 92239 77385 71074 86224 104440 103528 94863 73242 59355 39119 33843 38338
7672 38338 45272 41099 35923 39692 57981 75415 85695 86073 65787 65272 66328 46024 24448 46676
7658D6676K4234j5283k578m148J0805O336N336J4951K2533J8858j6449l1665r358
7645G0248k4076J9408J9254J478j3298l436j9187j2337K772J0076J173m946L2567
7632G9696J4198n268j3055k6588j0740n490m976J1089R145R123j271J4482M358
7619G4703q549m188j2160R561K2094l540l775J451k3460k4221J2449L6213K5277
7606A01855j1812p151k099J667j1566j2793k2367R185K9468J1253P863j0071o004
7593G7428q55J6693J4052r131n492r921m523P581j0377k0215j0768j1334r695
7580B3443L037R873N508j874M228J0958j3849J1843J2437l155R978k635j0183
7567E9609k0462r10K1820P3p779J3132O849j3776j8755M523J8555J8291n202k1675
$$ plain form
7658 46676 70910 55627 53049 48901 59706 66042 71378 86329 108862 127720 111271 79606 70248
7645 70248 46172 65580 84834 86312 73014 69578 50391 38054 40826 50902 52075 47129 79696
7632 79696 93894 88626 75571 48983 38243 32753 27777 38866 48011 57134 55863 70345 74703
7619 74703 66154 61966 49806 59367 81461 77921 74146 75597 52137 27916 40365 76578 101855
7606 101855 90043 82892 80793 82460 70894 58101 35734 44919 74387 85640 93503 83432 77428
7593 77428 76573 93266 107318 98187 92695 82774 78251 85832 75455 55240 44472 33138 23443
7580 23443 26480 36353 41861 39987 44215 55173 41324 53167 65604 62449 72427 69792 59609
7567 59609 39147 38237 60057 60130 52351 65483 72332 58556 39801 44324 62879 81170 75968 54293
7553E4293j0449J7534J3271q623j4495j4301r83J5519J7531j1405j2901j1407
7541C3584j2797L3222L969j776L190j406j7235r256o540r33J9261o222j5309k1032
7527G20J3908J3343r95J1375J8199O996J1080r997l67j5509j5791O599K1691K5510
7513H6762J1978j2585p372j7662k5771J3460o43m914j329j1397p911l114n776
7500A3726J7582K0859K903l717m870j0877n503o22M820j3572P936J5603L080j1162
7486C6186l6219o04J8589R035J5266j419k4203j526Q847j0518j8425r21L363J1446
7472H897J5518J8323K584j385J1623j426j465k182k0468j6881K7097L8875m188
7459G4922r019m709k3936j3066J1887L514j2241P700J7450O936l7257m591K9069
$$ plain form
7553 54293 43844 61378 74649 66026 51531 37230 36247 51766 69297 57892 44991 33584
7541 33584 20787 54009 57978 56202 59392 57986 40751 31495 24955 24022 43283 37061 21752 720
7527 720 14628 27971 26976 38351 56550 63546 74626 64629 64262 48753 32962 39561 61252 86762
7513 86762 98740 86155 78783 61121 35350 48810 48167 43253 41924 30527 22616 19502 13726
7500 13726 31308 52167 55070 51353 46483 35606 30103 29481 34301 20729 28665 44268 47348 36186
7486 36186 -33 -637 17952 26987 42253 40834 16631 15105 23952 13434 -4991 -5912 -2549 8897
7472 8897 24415 42738 45322 43937 55560 54134 52669 50487 30019 13138 40235 79110 74922
7459 74922 65903 61194 37258 24192 36079 39593 27352 35052 52502 59438 22181 17590 46659
7446D6659O980j857q780L580J250k2658k5737R922J3686K746p253P707J4438J2480
7432E3163q858K490K31m219j0490j4250N111m991j085K8806J3620n932J733p123
7418D8206j3011K912J3987J7335k4379k0180N603J8263j723L11L609K551R13L644
7404E8041k0249J697L9357M400l529j9652j3384N180p855Q00j1455j3634j0637
7391I080J0299L5546J7300j0451j4334q706j3797p735K9425R623j9759k159m409
7378B9923R889K5820K839j8421k0332n454l039J755j6197r39M568L619J5581p164
7364B2448j7894K397n696M845J2090J9672J1710J9337k3485l3661k6872J3275
7352a834K9067P739N455N088l1766P577J2053P099O207J8485m1964r472L975N299
$$ plain form
7446 46659 53639 51782 43002 46582 47832 25174 -563 9359 23045 25791 18538 26245 40683 53163
7432 53163 44305 46795 47026 42807 32317 18067 23178 18187 17102 45908 59528 53596 55329 48206
7418 48206 35195 38107 52094 69429 45050 24870 30473 48736 47013 47324 50933 53484 54397 58041
7404 58041 37792 39489 78846 83246 79717 60065 46681 51861 44006 44806 33351 19717 9080
7391 9080 19379 54925 72225 61774 47440 38734 24937 17202 46627 56250 36491 34332 29923
7378 29923 39812 65632 68471 50050 29718 24264 21225 22980 6783 5844 10412 14031 29612 22448
7364 22448 4554 6951 1255 6100 18190 37862 49572 68909 45424 11763 -15109 -1834
7352 -1834 27233 34972 40427 45515 13749 21326 33379 40478 46685 65170 23206 13734 17709 23008
7338B3008n93J4478L5269j1996k4099J635n530l5221J1867Q360O107q115m694
7325A0476J5960P887j7527j3533O605n8L471K3387Q274L421l4545k5188m239q48
7311a6457J7507J1822N929L484O143J462J2769n618l1123J3964M564l1081J1906
7298E271K8166J0047n93k0520P522N284R059j050j7770j0249K1932J70p009j8288
7284A1972J0617j0449J7595K8092J597p826j6814k3512K082O066l853j3539q43
7271A185k17k139L062k273K1536J8759N009P615K7870l4497k0758J1391J1313
7258D7856q484k0314L085N189J8962R965O48o224m599j3677j9991L56J7128J876
7244C1776j3098l318l079J3216Q851j3004p242J398J2158L429R346K6917O938
$$ plain form
7338 23008 22415 36893 72162 60166 36067 37702 32172 -3049 8818 17178 23285 15170 10476
7325 10476 26436 34323 16796 3263 9868 9810 13281 36668 44942 48363 13818 -11370 -15609 -16457
7311 -16457 1050 12872 18801 22285 28428 29890 42659 37041 5918 19882 24446 -6635 5271
7298 5271 33437 43484 42891 22371 29893 35177 44236 43186 25416 15167 37099 37269 30260 11972
7284 11972 22589 12140 29735 57827 59424 51598 34784 11272 13354 19420 15567 2028 1185
7271 1185 968 -1171 1891 -382 21154 39913 44922 52537 80407 45910 25152 36543 47856
7258 47856 39372 19058 22143 27332 46294 56259 56907 50683 46084 32407 12416 12772 29900 31776
7244 31776 18678 15360 12281 25497 34348 21344 14102 15500 27658 31087 40433 67350 74288
7231G4288j4706j4774k297r15J046k3551j7816L937K0957L646K563l950N246J8108
7217E1782P137k5650j3619j5680J2227q396J5791J3075J6565J783k1658m20j4444
7204A8493o144J7151J0894N577N541l0455J2206N775k9739o421J1926L731J5326
7191C3861r585J5387r353m1949j8804K7821K3064j8466J6445N642L189R603P447
7178D4302q255j0632k4341j4231K454J7603N135m404J6146J1705j5134p734j3562
7165i48J432L771R032J9719j9016J7565o394k6432O948K3230j3026k649L5436
7152D8668L0707k5326l8364R110K3970J2960J83q043j8669q399J0623q093j2526
7139A6801l1013J4777K5721m506k0067k9873Q10J6639L0696k669o586J162q630
$$ plain form
7231 74288 59582 44808 42511 41596 42642 19091 1275 5212 26169 29815 32378 28428 33674 51782
7217 51782 58919 33269 19650 3970 16197 7801 23592 36667 53232 55015 33357 32937 18493
7204 18493 12349 29500 40394 45971 51512 21057 33263 39038 9299 2878 14804 18535 33861
7191 33861 24276 39663 30310 -11639 -30443 -2622 20442 1976 18421 24063 27252 36855 44302
7178 44302 36047 25415 1074 -13157 -10703 6900 12035 7631 23777 35482 20348 12614 -948
7165 -948 484 4255 13287 33006 13990 31555 25161 -1271 5677 28907 15881 13232 48668
7152 48668 79375 54049 15685 24795 48765 61725 61908 53865 35196 26797 37420 29327 16801
7139 16801 -14212 565 26286 21780 1713 -28160 -27350 -10711 19985 17316 10730 11892 3262
7126C262J3002J7854Q078K356k5200j7806o406o473L309J3568l138r26R710J5120
7112B6310O880M82l852k3648p610k816k1185k3037J4540J7420P368N706l190L2075
7098B5443J7078j9604k6182J7766J7237j96r128N321J8144l841R834K996O425
7085F1293k47J691k6561L129Q141J635K539k0369P205l099r834o290K519L8774
7071F0526N643k2730k0486r116J2662j0616o839j869l062K230K4897J0653J23
7058D2016k270J6922P078l2511m726j6059p466r585J3919K1387p404R928Q764
7045C9993k8847k713m080m873R803j6454l352K2202J3729J8081J0260k1333k1925
7032A0491K1738N900k688J1484k338j8285j5771j9265J8579J8597O17k3157j0434
$$ plain form
7126 3262 16264 34118 42196 44552 19352 1546 -4860 -11333 -8024 5544 2406 1480 11190 26310
7112 26310 33190 33672 29820 6172 -1438 -4254 -25439 -48476 -33936 -16516 -9148 -3442 -6632 25443
7098 25443 42521 22917 -3265 14501 31738 31542 22414 27735 45879 42038 51872 54868 61293
7085 61293 61046 62737 36176 39305 47446 49081 51620 31251 38456 35357 25523 19233 21752 60526
7071 60526 66169 43439 22953 13837 26499 15883 9044 7175 4113 6343 31240 41893 42016
7058 42016 39746 56668 63746 31235 26509 10450 2984 -6601 7318 28705 21301 31229 39993
7045 39993 11146 8433 4353 -520 9283 -7171 -10523 11679 25408 43489 53749 32416 10491
7032 10491 32229 38129 35441 46925 44587 26302 10531 -8734 9845 28442 29059 5902 -4532
7019d532J4210J1679M108J541n876O463R743n640q205k1608J5111K8917k4549
7006B1362k559k342k4288O185K340p723j1948K316l2162l973J8246J6264J5321
6993b961O873J3755n910J4705J1792J868j1691j0883J9162J3530K64p616k216
6980D0672k8304L695n599o593J8566k267j3812j982J4106O637N338k1122J3431
6967B2766N630J508k611p962l725J000m204j6351k6087J7633K0674N30m665j0963
6953f827J1882J1305l015j8427j5994M996J3268J4734J6964J3417l017j2978k2423
6940C885Q233K599o459J9732O552j6815k2141R827q946P721J2296N226J768P78
6926B4256N815j3576k0355R000J3013p205l0175r152J5886M2552J5615j3723j1845
$$ plain form
7019 -4532 9678 21357 25465 27006 21130 27593 37336 31696 23491 1883 16994 45911 21362
7006 21362 18803 16461 -7827 -1642 698 -7025 -18973 -16657 -48819 -52792 -34546 -18282 -2961
6993 -2961 3912 17667 11757 26462 38254 40122 28431 17548 36710 50240 50504 42888 40672
6980 40672 12368 16063 10464 3871 22437 20170 6358 4376 18482 25119 30457 9335 22766
6967 22766 28396 29904 27293 19331 15606 16606 12402 -3949 -30036 -12403 8271 8801 4136 -6827
6953 -6827 5055 16360 13345 -5082 -21076 -16080 -2812 11922 28886 42303 39286 26308 3885
6940 3885 12118 14717 8258 27990 34542 17727 -4414 5413 -3533 4188 16484 21710 23478 24256
6926 24256 30071 16495 -3860 5140 18153 10948 -19227 -28379 -12493 30059 45674 31951 20106
6913B0106J5168N909m193l104j032L700m677J4400R573r514P547J133j0042n789
6899C9185k4750k1784q390J2651P965N205j1421j0799J9716j633K5691J357n351
6886B7642Q769J18L884o506K8466J1757j7666k162j8293j9530j188J9199J1778
6873D6268j0658K754m133k0719k924q580p18r240R122K7299M936k5j3349j835
6859A8198L744j2909R551N93J6009J4522J0989m18k5329j8586k6565m564K0087
6846E322J1347P350J1946k3040k36N346J8831m419n551L544j1354j6724M461J1081
6832A7904o121O417K0433K0395J2429P215m220Q297j27k3862k5155j6144J2459
6819B9920J0169P916M94k0111N194K6094L1125n480j2017p559J528P80M066k794
$$ plain form
6913 20106 35274 41183 36990 33886 32854 36554 31877 46277 55850 46336 53883 55016 44974 39185
6899 39185 14435 -7349 -15739 -3088 4877 10082 -1339 -12138 7578 5945 31636 32993 27642
6886 27642 36411 36529 40413 33907 62373 74130 56464 54302 36009 16479 15291 34490 46268
6873 46268 35610 38364 34231 13512 10588 2008 1290 -7950 1172 28471 33407 33382 20033 18198
6859 18198 21942 9033 18584 19177 35186 49708 60697 60279 34950 16364 -10201 -14765 5322
6846 5322 16669 24019 35965 12925 12689 18035 36866 32447 26896 30440 19086 2362 6823 17904
6832 17904 11783 18200 38633 59028 71457 78672 74452 82749 82622 58760 33605 17461 29920
6819 29920 40089 48005 48499 28388 33582 59676 90801 85321 73304 65745 67273 68053 72119 69325
6805F9325k3576k206l7522J606J0607O771J2209o051j0854J1472r484M758J3016
6792D0071J8711L665k8960k9755r779m169J2547J9611o079J0175J3041Q242j965
6779D5356J117n225k5310k4994L273J2356O803K9775l431r678Q702J09j0414M367
6765C2806P332N081K6328l000j2306q432j7485p389R364L477r742Q998M9815L834
6751H8681n740j1114j6053o352O877K1026M1844J9102J3415k678l1169O105J8325
6738A42269J6072j3112O36l4936j6461j6307L297K7966L1747K6185K6191J9456
6726B13003O11J9432M336K8500P1676J07038J26758J66320J91006J46521P3368
6715A148569k5204j57501k28786j76192j25299q1850n8898o0672k4903j0550m3074
$$ plain form
6805 69325 45749 43543 6021 7627 18234 25005 37214 31163 20309 31781 22297 27055 40071
6792 40071 58782 62447 33487 3732 -6047 -10216 2331 21942 15863 26038 39079 47321 45356
6779 45356 46473 41248 15938 -9056 -5783 6573 13376 43151 39720 30042 38744 38853 28439 32806
6765 32806 40138 45219 71547 68547 56241 47809 30324 22935 32299 35776 26034 35032 84847 88681
6751 88681 82941 71827 55774 49422 56299 77325 119169 138271 151686 149008 117839 123944 142269
6738 142269 158341 145229 145865 110929 94468 78161 81458 109424 141171 167356 193547 213003
6726 213003 213614 233046 237382 265882 337558 444596 571354 737674 928680 1075201 1148569
6715 1148569 1123365 965864 737078 560886 435587 353737 294839 234167 209264 198714 155640
6704A55640j5452j1783J9217K6733k9504j7320P554k0473j6860j7163j0465k1305
6692D8819M429J628L865J0289p79m076K412j787K837j167j7038j1458N11N417
6678D3902j1952j8023J0604N878J3316J8641m377j9074p98N247n034L459j1136
6665C0653k067J6252J4308j3029j9820q597M389P748j3976j4131K452J2119J3762
6652C0063r317j0630l20R349J1558J1787j1140j932M609r614k1204j1752k47J7032
6638H242J7764N313j4807k725J8921q230J0249k2205m179m452O358j3641R768
6625F376j76O536L715P559K4919J489j6765k0461l3398J6252n509K0477K2889
6612C3903K726Q303K78R666J3581q097r086k9950j6642L936k464j3567l203K722
$$ plain form
6704 155640 140188 128405 147622 174355 144851 127531 135085 114612 97752 80589 70124 48819
6692 48819 53248 54876 58741 69030 68251 64175 66587 64800 67637 66470 49432 37974 38485 43902
6678 43902 31950 13927 24531 30409 43725 62366 57989 38915 38117 43364 38330 41789 30653
6665 30653 28586 44838 59146 46117 26297 17700 22089 29837 15861 1730 4182 16301 30063
6652 30063 20746 10116 9796 19145 30703 42490 31350 29418 34027 24413 3209 -8543 -8790 8242
6638 8242 26006 31319 16512 13787 32708 24478 34727 12522 8343 3891 10249 -3392 6376
6625 6376 6200 12736 16451 24010 48929 50418 33653 13192 -20206 -3954 -9463 11014 33903
6612 33903 36629 44932 45210 54876 68457 60360 51274 21324 4682 8618 6154 -7413 -10616 -7894
6598g894q089j1097R549L1634j3043j190K4329K6499Q608K607k7477l2083j3243
6585a0890M138K948j3352O061K1226j0422j9961l548K3556P671r67j2472o435
6572a2447p442J238k427L049J8955k545L91R080o218j0804l23K3793n504K371
6558A1167K5517Q335j1595j3579j2015j0334p06R065K1710J7263j7234j1290k0139
6545c835J1619K8045J1910m0024j9842j4801k1918J0051M3282J3714k0184p834
6533i817j7809k8809J6629K8888K389j861j6394J8301l169k8388O712J3093R900
6520a0335j5303m549J5802K6666J1866N760r381k0205j8798l839N473Q674K1914
6507A3745K2209o891j5465j5821j2907N11L684m039J0241J324o068j7254j2124
$$ plain form
6598 -7894 -15983 -27080 -17531 14103 1060 -130 24199 50698 59306 61913 34436 2353 -10890
6585 -10890 -6752 -3804 -17156 -11095 10131 -291 -20252 -23800 -244 7427 6460 -6012 -12447
6572 -12447 -19889 -18651 -21078 -18029 926 -1619 -1228 7852 1634 -9170 -9493 14300 8796 11167
6558 11167 36684 45019 33424 19845 7830 -2504 -3210 5855 27565 44828 27594 16304 -3835
6545 -3835 7784 35829 47739 7715 -12127 -26928 -48846 -38795 4487 18201 -1983 -9817
6533 -9817 -27626 -56435 -39806 -10918 -8529 -10390 -26784 -8483 -11652 -40040 -33328 -20235 -10335
6520 -10335 -25638 -30187 -14385 12281 24147 29907 20526 321 -18477 -22316 -16843 -8169 13745
6507 13745 35954 29063 13598 -2223 -15130 -14619 -10935 -14974 -4733 -3409 -9477 -26731 -38855
6494c8855L511R638J8314J1108p837j0140n728J0292N832J1988r475Q185n775
6481A058J7320K7553J3047r955k6578j5519o00Q159K012n190j4095J2958l147
6468G023Q278J5095J6967j0089j1045m513J4627l2020k7204Q460j453j1804J1078
6455a6600J3469j944j1223J7203L5665L838j3096r481R000j2855O954K0900J9879
6442F1709k5525l1182j7142r237J5487l391K392M423p348J2661Q615N488J3231
6429C0181k0306k3818K705m130l0447k4047l848M7513L4620L1007J6780j7600
6417C8610m272J3585j4869l0175l0318M417J4863q799n359l514J4261K9864K1122
6404C9416j2541j0827J800n16j5816l502L924n36k0879j834O813l0310J1613L4843
$$ plain form
6494 -38855 -35344 -25706 -7392 3716 -4121 -14261 -19989 -9697 -3865 8123 -1352 6833 1058
6481 1058 18378 45931 58978 49023 22445 6926 6326 14485 16497 11307 -2788 10170 7023
6468 7023 15301 30396 47363 37274 26229 21716 36343 4323 -22881 -14421 -15874 -27678 -16600
6455 -16600 -3131 -5075 -16298 905 36570 40408 27312 17831 26831 13976 20930 41830 61709
6442 61709 36184 5002 -12140 -21377 -5890 -9281 -6889 -2466 -9814 2847 11462 16950 30181
6429 30181 9875 -13943 -11238 -15368 -45815 -69862 -73710 -26197 8423 39430 56210 38610
6417 38610 34338 47923 33054 2879 -27439 -23022 -8159 -16958 -22317 -25831 -11570 18294 39416
6404 39416 26875 16048 17848 17332 1516 -1986 1938 1402 -19477 -21311 -14498 -44808 -33195 1648
6390A648l691L583K604k762j0715n29J8619L482j474O199K873J1106o680k3492
6376G71j1556J9942J5611q257o030j7965k3183Q867R402K6488q160l123j5913
6363a3106N620l354N202J623k479j1433J504K3230J2873K8172k6158n565J7119
6350C3248j6507j4941j625L3180Q997k0961k2341o389p436K961J8275Q32J1178
6337A8471j5337j4948J106L897P570l754p859j3310L2393J0093K7266Q123m2497
6324A1214j4992K2277M436k0429k8602J9333L1980K185p232J7144J1242j6093
6312C2463P599r962j2656p180J44P674J0317p644j0071o190l184J9873J3456k7419
6298G220l1146P351k172l396L0781M8698J6390k9238q367j9449P040P114J3019
$$ plain form
6390 1648 -2043 1540 4144 1382 -9333 -9862 8757 12239 10765 16964 19837 30943 24263 771
6376 771 -10785 9157 24768 16511 10481 -7484 -30667 -21800 -12398 14090 5930 2807 -13106
6363 -13106 -7486 -10840 -5638 -4015 -6494 -17927 -16423 6807 19680 47852 21694 16129 33248
6350 33248 16741 1800 175 33355 42352 21391 -950 -7339 -14775 -11814 6461 7293 18471
6337 18471 3134 -11814 -10708 -6811 759 -2995 -10854 -24164 8229 18322 45588 53711 11214
6324 11214 -3778 18499 22935 2506 -26096 -6763 25217 27402 20170 37314 48556 32463
6312 32463 40062 30100 17444 10264 10408 18082 28399 20755 10684 4494 1310 21183 34639 7220
6298 7220 -23926 -16575 -18747 -22143 8638 57336 73726 44488 36121 16672 23712 30826 43845
6285D3845k2262k4822r217l048J480J2262J6667J7664J5534J8802n901k3160q25
6272C7019o734k8264j0164j2202l3579k0490J5929J5296J9014N358o66k0658J7517
6259b2624Q523K2914j2550l0655r727k49J7212J1370k7116J8289L2109K573j7401
6246g332j1702N54j3600p964J4629j2099J676L0924N616n37m332j1300j2930J9683
6232h714L752q106l625o010o248M866P292J9152K1089n639M3749k222k6685Q99
6218C3550L896p578j0334p142j2775k8283n331N81K1790M184j1951n320m766Q362
6204b1117O297J2724J8755j5752l8113k2793j3601j689K2284J5046J6665m430
6192b5724Q666N315j1365k674J6190O504J5364J3100j9452j0659j956J1864Q633
$$ plain form
6285 43845 21583 -3239 -12456 -15504 -14024 -1762 14905 32569 48103 66905 61004 37844 37019
6272 37019 30285 2021 -8143 -20345 -53924 -74414 -58485 -43189 -24175 -18817 -19483 -40141 -22624
6259 -22624 -14101 8813 -3737 -34392 -44119 -44368 -27156 -15786 -42902 -24613 7496 10069 -7332
6246 -7332 -19034 -18480 -32080 -40044 -25415 -37514 -35838 -4914 702 165 -4167 -15467 -28397 -8714
6232 -8714 -4962 -13068 -16693 -22703 -28951 -24085 -16793 2359 23448 17809 61558 59336 32651 33550
6218 33550 37446 29868 19534 12392 -383 -28666 -33997 -33416 -11626 -7442 -19393 -24713 -29479 -21117
6204 -21117 -14820 -2096 16659 907 -37206 -59999 -73600 -75289 -53005 -37959 -21294 -25724
6192 -25724 -17058 -11743 -23108 -25782 -9592 -3088 12276 25376 5924 -4735 -6691 5173 13806
6179A3806R921r925k6519k451O198P805r838P074J8921J0648J809j8010J7869
6166B7308K4100n967l5182k4115m878j0232J5516K2411J6451p167J5915J0130
6154D4290j2603j1684R427R426k0668k417P867J0287R863q791m5123j2221O334
6141a6013K6490R923j875k3020P15J7132L443q035j1655k111m890J1958J4448
6128A6510j1026K78K8488r880j6441q062q050J3898J0298n402O643k934j2778
6115A542K5153J3584k5207k5607r527L4676R963j3535p452k0969J0079L820r912
6102a3392M364J0554J9232n072k6925k9279M159K8963J8682r986o877j2131O317
6089a1391k734P909L1308j2108l952l603j0964j1967n518Q417k440K57J9079J1535
$$ plain form
6179 13806 23727 13802 -12717 -15168 -8970 -1165 -11003 -3929 14992 25640 27449 9439 27308
6166 27308 51408 45441 10259 -13856 -18734 -28966 -13450 8961 25412 18245 34160 44290
6154 44290 31687 20003 29430 38856 18188 15771 23638 33925 43788 34997 -10126 -22347 -16013
6141 -16013 10477 20400 18525 -4495 -3780 13352 16795 8760 -2895 -5006 -9896 2062 16510
6128 16510 5484 5762 34250 24370 7929 -133 -8183 5715 16013 10611 17254 14320 1542
6115 1542 26695 40279 15072 -10535 -20062 14614 24577 11042 3590 -17379 -7300 -3480 -13392
6102 -13392 -9028 1526 20758 15686 -11239 -40518 -36359 -7396 11286 1300 -5577 -17708 -11391
6089 -11391 -14125 -6216 25092 12984 9032 5429 -5535 -17502 -23020 -14603 -17043 -16786 2293 13828
6075A3828P178M137J1304J4102j3899j9691j7455j6797m545Q094K1090j513o789
6062i56K4008q542j8182K7444k0444j3896J7045J0283j6606j5204L989L0795M515
6049B4249l175P393k463M275l7952q707J5701J238k0784j3798J377K1938r010
6036a9718J5414J7866K0047Q04k7978j0993K0891J691q947p656J2078j6724q307
6023a1532j246j52K023j8423O024p203j5977R491p443J2170J1078J136j1628m498
6009c6180j3526J3110J709j6600L1131K2776M523J7978J2936k0586j5571J671
5997C371K9286m398j7206l973K303q372J0052M301m2684j0262O367O558K1807
5984b850j2772J4178J7626m576j3456j1175l078M510J4635o917L08m775L676r194
$$ plain form
6075 13828 21006 25143 36447 50549 36650 16959 -496 -17293 -21838 -13744 7346 5833 -956
6062 -956 23052 14510 -3672 23772 3328 -10568 6477 16760 154 -15050 -11061 19734 24249
6049 24249 21074 28467 26004 30279 -7673 -16380 -679 559 -20225 -34023 -32646 -10708 -19718
6036 -19718 -4304 13562 33609 34413 6435 -4558 16333 18024 9077 1421 13499 -3225 -11532
6023 -11532 -12778 -12930 -10907 -29330 -23306 -30509 -46486 -36995 -44438 -32268 -21190 -20054 -31682 -36180
6009 -36180 -49706 -36596 -34887 -51487 -20356 2420 6943 24921 37857 17271 1700 3371
5997 3371 32657 28259 11053 7080 9383 1011 11063 15364 -27320 -37582 -31215 -24657 -2850
5984 -2850 -15622 -1444 16182 11606 -1850 -13025 -16103 -11593 3042 -3875 -3567 -8342 -4666 -13860
5970a3860j3473J2177J2436p467k5815r43O521L8048K3995N416k215J7802o281
5957D6341j892o957k6051j7034p893O79j4684n942J0028L3248k0807r123j780
5944b1867P704R949j54R308K7j7513n638r882m512L0260J1047L754j3241Q735
5930G977Q117O479J4844N500l408o905k5923j3798K9317K6889P604M005q876k3954
5916B7868k2015m220O282k8700m446J3597J1849J5488J3249k22k6836k7546J5169
5903a0483L019k0065k1353j445j35L5768K4963r612j7389j2728J7768J7287o897
5890a302M536R08n127O268J6082R184p86l8061k4377J2790M414J4202L62l471
5876d378l4738k0420K2246K6603J0463j7630l23M087J6775m631K4735n157k8670
$$ plain form
5970 -13860 -27333 -15156 -2720 -10187 -36002 -36945 -30424 7624 31619 37035 34820 52622 46341
5957 46341 44449 37492 11441 -5593 -13486 -12807 -27491 -33433 -23405 9843 -10964 -20087 -21867
5944 -21867 -14163 -4214 -4368 4940 4967 -12546 -18184 -28066 -32578 -2318 8729 12483 -758 7977
5930 7977 16094 22573 37417 42917 39509 32604 6681 -7117 22200 49089 56693 60698 51822 27868
5916 27868 5853 1633 7915 -20785 -25231 -11634 215 15703 28952 28730 1894 -25652 -10483
5903 -10483 -7464 -27529 -48882 -50327 -50462 -14694 10269 657 -16732 -29460 -11692 5595 -1302
5890 -1302 3234 4142 -985 5283 21365 30549 29763 -8298 -32675 -19885 -15471 -1269 -907 -4378
5876 -4378 -39116 -59536 -37290 -10687 -224 -17854 -18177 -14090 2685 -1946 22789 17632 -11038
5863a1038Q271n265p672J2495O641q515J054j2727O714Q781N154J7381P220j3933
5849A4561j8429o99p169j7082J7837L583J7997M942J779j4636k937k607j6566
5836a9426p242j937J5511O227m044M366q431J7746J3612l342l1314k7219J5477
5823c0016K3217J2828K3663j8427m502N799N32r850j768K479m49j0117j986J8954
5809A0357O580J531j3401j1975k0111J6644J4625k0151n079n999J8507K8281o187
5796A3622k3068M958Q958o219j4005j6634j2283L3457k134p216J7134j024j1951
5783a6405J0867P710j783q246R446J6226J5288j457r406k671j63R118o895R608
5769C1237l42p499N963k1289J1905k272J2461J089k6962P364M736J3054j419J262
$$ plain form
5863 -11038 -2767 -8032 -15704 -3209 3432 -5083 -4029 -16756 -10042 -1261 3893 21274 28494 14561
5849 14561 -3868 -4567 -11736 -28818 -10981 -7398 10599 15541 17320 2684 -253 -2860 -19426
5836 -19426 -26668 -28605 -13094 -6867 -10911 -6545 -14976 2770 16382 13040 -18274 -45493 -30016
5823 -30016 -6799 6029 29692 11265 6763 12562 13094 3244 1476 3955 3506 -6611 -8597 10357
5809 10357 16937 18468 5067 -6908 -27019 -10375 4250 -15901 -20980 -26979 -8472 19809 13622
5796 13622 -9446 -4488 4470 -1749 -15754 -32388 -44671 -11214 -13348 -20564 -3430 -4454 -16405
5783 -16405 -5538 2172 389 -7857 1589 17815 33103 31646 22240 19569 19406 28524 21629 31237
5769 31237 30895 23396 29359 8070 19975 17703 30164 31253 4291 11655 16391 29445 28026 29288
5755B9288p271l6299j8851R938J2914M785j3559K7821J8367p974K512j4890k5167
5742a8386m31j2205m058O300J5912K8826J0373L167O543M272k8553q470N92P499
5728A1381o238k3087k9963J1092K6275L233o222O069J573j6942j0906j2671J4941
5715c1465j272K2067K6981k2812k3633k786K6807J8282K3371n953j1245j8713
5703c71q609J0397R47N259P050k3709j0568j9889L197O280P767J9410K1303q023
5689A0441q78j9100K219q086q484L170j7343k2682J7709L8090J1604J6108l28
5676B2440Q2k2261m697j5539j4457L6234K7368J7500j4291l0328j1003P345P276
5663E669j0670J4460K531n16J2992K4454o749k1910l4499m943K1077l436O8J1837
$$ plain form
5755 29288 22017 -14282 -33133 -23195 -10281 -5496 -19055 8766 27133 19159 21671 6781 -18386
5742 -18386 -18817 -31022 -35080 -28780 -12868 15958 26331 29498 36041 40313 11760 3290 3882 11381
5728 11381 5143 -17944 -47907 -36815 -10540 -7307 -13529 -7460 -5887 -22829 -33735 -46406 -31465
5715 -31465 -32737 -10670 16311 -6501 -30134 -32920 -6113 12169 35540 29587 18342 -371
5703 -371 -8980 1417 2364 7623 14673 -9036 -19604 -39493 -36296 -30016 -22249 -2839 18464 10441
5689 10441 9563 -9537 -7318 -15404 -23888 -20718 -38061 -60743 -43034 -4944 6660 22768 22440
5676 22440 22522 261 -4436 -19975 -34432 1802 29170 46670 32379 2051 -8952 -1607 5669
5663 5669 -5001 9459 11990 11474 24466 48920 42171 20261 -14238 -19181 1896 -1540 -1472 10365
5649A0365J4019J1300o35m549J143M44J758k3134m4370n209N830K1871J9901J466
5635A0200J2326L413k8129O508K5864K336J2842Q966j9484k4087k0215q707L439
5622a4728J0270J6458R31l969p69o791J921J0350K085r625K222n922Q899j010
5608A0322j6689o055J194K1010K7339K169r237m077p662J9501m221j5950j2841
5595D803J6859J5807p912K2992J042j4857j7263j8448m66K0617J3503j0097k9426
5582b846n162n141l2008J340N099J3154J0925R451K9574L0700j7625m8154M75
5569a0218r670r902J9830J0672o405m3011j1813K2440J7701K1236J2241P393L382
5556B3876R743K0254j0577k4328l1289k7795L239J4445j293m583J075j3505Q01
$$ plain form
5649 10365 24384 35684 35049 30500 31643 32087 33845 10711 -33659 -38868 -33038 -11167 8734 10200
5635 10200 22526 25939 -2190 4318 30182 32518 45360 54326 34842 10755 -9460 -18167 -14728
5622 -14728 -4458 12000 12931 8962 8193 1402 3323 13673 15758 6133 8355 2433 11332 10322
5608 10322 -6367 -12422 -11228 9782 37121 39290 30053 25976 18314 37815 33594 17644 4803
5595 4803 21662 37469 29557 52549 53591 38734 21471 3023 2557 23174 36677 26580 -2846
5582 -2846 -8008 -13149 -45157 -43817 -38718 -25564 -14639 -5188 24386 55086 37461 -10693 -10218
5569 -10218 -19888 -29790 -9960 712 -5693 -48704 -60517 -38077 -20376 860 13101 20494 23876
5556 23876 33619 53873 43296 18968 -12321 -40116 -36877 -22432 -23725 -28308 -27233 -40738 -39937
5543c9937L0654K745k1427K6223J6018k2585J4261M707M951l859r744K960r900
5530d933P455k056m302p187j7125k3390K4695K6605J5649N731r169k261K628k2979
5516a0639r63J8818j398m776n517j1732j6279J8325Q067j0215q723K0379p856
5503a2509l517Q701k5989j1342K306J1527J8509P842j5623P641O097k8567l055
5490c7979J6076K3077k932j0450k0249j9892L0771K1054J7145o320k0518J3831
5478C614K989j6265J1699L575J7597K0901k2348k1276l162n090j2160o992J6985
5465i933O440o322j0201P28q261O923j0067K4219J1000N102L2J0352J5358j1206
5451B4164k865J454j9204n651J0303J4821j8770j8299n904l599j91J2088K9434
$$ plain form
5543 -39937 -9283 -6538 -27965 -1742 14276 -8309 5952 10659 15610 11751 2007 4967 -4933
5530 -4933 2522 466 -3836 -11023 -28148 -51538 -26843 -238 15411 21142 11973 9712 12340 -10639
5516 -10639 -11602 7216 5818 1042 -4475 -16207 -32486 -14161 -6094 -16309 -25032 -4653 -12509
5503 -12509 -16026 -7325 -33314 -44656 -42350 -30823 -12314 -4472 -20095 -12454 -6357 -34924 -37979
5490 -37979 -21903 1174 -1758 -12208 -32457 -52349 -21578 -524 16621 10301 -10217 3614
5478 3614 6603 -9662 2037 5612 23209 44110 21762 486 -2676 -7766 -19926 -26918 -9933
5465 -9933 -3493 -9815 -20016 -19288 -27549 -20626 -30693 -6474 4526 9628 9660 20012 35370 24164
5451 24164 21299 22753 3549 -2102 8201 23022 4252 -14047 -19951 -23550 -23741 -11653 17781
5438A7781O989k5001j6443O05J1909K429J860n705q503j2127J4757P267O487k857
5424e52j6908k3258K3955M858j2696M892n893m105n178q55K0037J2366J1296P529
5410A5488n420O42j7016P837J7872R866R36k818L190P355p021k0128j2145P328
5396E966J0155n314O27j1849j0293J2836J4210j3383m27J6041l6956p623K3369
5383b641Q263Q9j2515K247P812o157k0801n411J657l656K4268R490N532J9383
5369B7560O627j3009k5789j486q36k1174j5502K2057J7631N321j161j2920Q955
5356c726K40r711k122J7402J5970l376j4493m990k733K4090N533j0560o330n409
5342b15M372l733j1688l9495j0667K2712J7390o571j0015r451j2359J0852K1490
$$ plain form
5438 17781 24770 -231 -16674 -16069 -4160 -1731 129 -5576 -14079 -26206 -11449 -4182 2305 -552
5424 -552 -17460 -40718 -16763 -11905 -24601 -19709 -25602 -29707 -34885 -35740 -15703 -3337 7959 15488
5410 15488 10068 10710 -6306 1531 19403 29269 30205 27387 30577 37932 30911 10783 -1362 5966
5396 5966 16121 10807 11434 -415 -10708 2128 16338 2955 2528 18569 -18387 -26010 -2641
5383 -2641 5622 5711 -6804 -4557 3255 -2902 -23703 -29114 -27457 -31113 -6845 2645 8177 27560
5369 27560 34187 21178 -4611 -6097 -6933 -28107 -43609 -21552 -3921 1400 239 -12681 -3726
5356 -3726 -3486 -13197 -15319 2083 18053 14677 184 -4806 -7539 16551 22084 11524 5194 -215
5342 -215 4157 424 -11264 -50759 -61426 -38714 -21324 -27895 -37910 -47361 -59720 -48868 -27378
5329b7378J8911R272J875l10J8641J0734J904O47J1429j3179l2893j8795P886
5316a1256n563K114o584j0781J584J6474R363l2831K398L79K212J9245M421J0254
5302A429K5599j3429P186q336k4127J4107L0786R377l398k2301k2321j1928r59
5289a8315j5156o971J1346K9376J8232k6272j1452j1678j664L3536K1374p036
5277A5320j9091q6J9524q566m134j1296P73R010K2496K658k0685m1155l2639l058
5263g0929K0001j0783l231J9580K5621K2158q594K717J3395j7729k4514j060L2227
5250a141J6698j1033R548J89O99J064k376r965p859k258J8152j8937n437j1906
5236b4562j9783Q857K8465J0409J2785R929J3759j9438r725L38j7575j003J273
$$ plain form
5329 -27378 -8467 805 2680 2370 21011 31745 33649 34296 45725 32546 -347 -19142 -11256
5316 -11256 -16819 -14705 -21289 -32070 -30486 -14012 -4649 -37480 -35082 -34703 -32491 -13246 -8825 1429
5302 1429 27028 13599 20785 12449 -11678 2429 33215 42592 39194 16893 -5428 -17356 -18315
5289 -18315 -33471 -40442 -29096 280 18512 -7760 -19212 -30890 -32554 982 22356 15320
5277 15320 -3771 -3857 15667 7101 2967 -8329 -7556 1454 23950 26608 5923 -35232 -67871 -70929
5263 -70929 -50928 -61711 -64942 -45362 -19741 2417 -6177 -3460 9935 -7794 -32308 -33368 -1141
5250 -1141 15557 4524 14072 14261 14960 16024 13648 3683 -4176 -6434 11718 -7219 -12656 -24562
5236 -24562 -44345 -35488 -7023 3386 16171 26100 39859 20421 10696 11034 -6541 -7544 -6271
5223f271o941o836K595M3340J702j6615k5295m488J4760J3356L152k1553q609
5210a7703P324P313K958q466k6389O516K0241J9520r33j1592N644q528R324k261
5196B968K817J193N597N991j5108M45J5114P492M495R024j5573R460P689j0759
5182C0845k3455J008J1813K0633P641j3831j7761j1876J2068M856J3581q248o920
5169B0354M961O77k0837k3770j9542j0417j0964m496R5j747J9013n621j9888l496
5155g5678k72J0750J3014p953J095J1212J4680J4665m881M911o97l331J8915j2808
5141a6378j0669l2341r467J2944K3999J1737J4843J7918o586m757r400Q993L3802
5128C4638L1560p696k4632k909K6695J5466j0610j5789M746j7978k6239l687J516
$$ plain form
5223 -6271 -13212 -20048 -17453 25887 27589 10974 -14321 -18809 -4049 9307 12459 -9094 -17703
5210 -17703 -10379 -3066 -108 -8574 -34963 -28447 -8206 11314 10381 -1211 4433 -4095 5229 2968
5196 2968 5785 6978 12575 18566 3458 3903 19017 26509 31004 40028 24455 33915 41604 30845
5182 30845 7390 8398 20211 40844 48485 34654 16893 5017 17085 21941 35522 27274 20354
5169 20354 25315 25992 5155 -18615 -38157 -48574 -59538 -64034 -63939 -65686 -46673 -52294 -72182 -75678
5155 -75678 -75950 -65200 -52186 -60139 -59044 -47832 -33152 -18487 -23368 -18457 -19154 -22485 -3570 -16378
5141 -16378 -27047 -59388 -68855 -55911 -31912 -20175 -5332 12586 6000 1243 -8157 836 34638
5128 34638 66198 58502 33870 30961 57656 73122 62512 46723 51469 33491 7252 3565 5081
5115E081Q915J7633K949k782j7421J0136p448j0511J799J6192LJ1876o468J0894
5101D0848j1288j5172j0534j1555j3662P062o784K3312J5067L138j6273J0384
5089A4543K1447p569j1021J5884m883l2069p065q244o62O735m248j0648K276K2170
5075c354K44J497j2563m00J6411k058K239k0584j2236j4906L3955K1813q401R738
5061A1395K6664j4386j5952K896O789p900n547l2343O3j4291J5369M3260o101
5048I916N774J0417Q264j2197j0982j5930M112J5817p48L075j3512K180M419m22
5034A0183k28k3492j6420m386j3796J6191K9214O581j5199J1317J5382j5702k1366
5021b1721k4043L61K4138K5874J2849r328j1938j6546M746J7114K1425m343l1051
$$ plain form
5115 5081 13996 31629 34578 31796 14375 24511 17063 6552 8351 24543 24546 36422 29954 40848
5101 40848 29560 14388 3854 -7701 -21363 -14301 -21085 2227 17294 20432 4159 14543
5089 14543 35990 28421 17400 33284 28401 -3668 -10733 -18977 -19639 -12904 -17152 -27800 -25524 -3354
5075 -3354 -3110 -1613 -14176 -14576 1835 -223 2016 -18568 -30804 -45710 -11755 10058 1657 11395
5061 11395 38059 23673 7721 10617 17406 9506 3959 -28384 -28321 -42612 -27243 16017 9916
5048 9916 15690 26107 34371 22174 11192 -4738 -626 15191 14443 17518 4006 6186 10605 10183
5034 10183 9955 -13537 -29957 -34343 -48139 -31948 -2734 3847 -11352 -35 15347 -355 -21721
5021 -21721 -45764 -45403 -21265 4609 17458 8130 -3808 -20354 -15608 1506 22931 18588 -12463
5008a2463N007N429N088j753O237j0647j6853J878J323m304L2022J4479k4277
4995A166Q149Q226q855j3426m305N795p462K3540K1572j4449j1852k983j1829
4982f713J9134o661m252J6073K727j2041j4436M001j5902J5278j949N528R907
4969A0694Q171j125N868J591N410l758O496j1350j1559k7519R195J7703N233l772
4955A1278j8813M847n739p042j2967J1457K88N970J286j3000M759J5811K6768
4942B4903j259k1911J4622n483k7617J6120K5293l009q444R736j4640q054j609
4929a352p755m479J7936j0933k2822L538K5296m495J1788J4506j6890N65J6726
4916B1629L448r479p20J4551L44p387L362j9814j477n414j5373m414k3166J0446
$$ plain form
5008 -12463 -7456 -2027 3061 1308 7545 -3102 -19955 -18077 -16754 -21058 10964 25443 1166
4995 1166 9315 17541 8686 -4740 -9045 -3250 -10712 12828 34400 19951 8099 5116 -6713
4982 -6713 12421 5760 1508 17581 20308 8267 -6169 -2168 -18070 -2792 -4741 787 10694
4969 10694 18865 17740 23608 25199 30609 26851 33347 21997 10438 -17081 -7886 9817 15050 11278
4955 11278 -7535 -2688 -8427 -15469 -28436 -16979 -16691 -10721 -9435 -22435 -17676 -1865 24903
4942 24903 23644 1733 16355 10872 -16745 -625 24668 21659 13215 22951 8311 257 -1352
4929 -1352 -9107 -13586 4350 -6583 -29405 -25867 -571 -5066 6722 21228 4338 4903 21629
4916 21629 25077 15598 14878 29429 29773 22386 25748 5934 4457 -957 -16330 -20744 -43910 -33464
4902c3464K0197K409O055J0949J7556p730k1024l797l981n969P334N729j5098
4889b0834k0887J1968M358P736R431j8000j7034J6982L5380o170k3465j045J0388
4876a1192K02o677p925j4151l486j7061J6676J6327k3037l5100J3118J9197r655
4863f2764N413K9415R960R465K9387q390j9023L5022J5975k7929j6631m022O045
4850A923Q974J0548j9981j1622J3870P206j2399M952L425q367R927j073l6331
4837b8948J853O179J0915j7256J679Q869m404m46k1844l11j1329O650J9625J1326
4823a7442J7456n081J2235J3671J111j9003j2787k6968j6225j1277J3212K0832
4811c0266p508P479K1800K887M902k0533q059j2176k205N33J4469J1568j1029
$$ plain form
4902 -33464 -13267 -10858 -4803 6146 23702 15972 -5052 -8849 -12830 -18799 -11465 -5736 -20834
4889 -20834 -41721 -29753 -25395 -17659 -8228 -26228 -43262 -26280 9100 2930 -20535 -21580 -11192
4876 -11192 -10990 -17667 -25592 -39743 -43229 -60290 -43614 -27287 -50324 -85424 -72306 -53109 -62764
4863 -62764 -57351 -27936 -17976 -8511 20876 12486 -6537 28485 44460 16531 -100 -4122 1923
4850 1923 10897 21445 1464 -10158 3712 10918 -1481 3471 6896 -1471 8456 7383 -28948
4837 -28948 -27095 -20916 -10001 -27257 -25578 -16709 -21113 -21559 -43403 -43714 -55043 -48393 -28768 -17442
4823 -17442 14 -5067 7168 20839 21950 2947 -9840 -36808 -53033 -64310 -51098 -30266
4811 -30266 -37774 -30295 -8495 -5608 -706 -21239 -29298 -41474 -43679 -43146 -28677 -17109 -28138
4798b8138j6142P149J3074M289j9988P77K0834j7243k1245M591M4703K0378k577
4785A0462j3170k6199J532k65n286j1477j0586J1163q864O371K1390K9715K3689
4772B8475r051k658j237j0672j646n7J779R613j6093j7494K037l0350m01K3357
4758b4398K1601k205l645r980J4474J1116J634r78j1027k3558n592K3315J2752
4745C509J3646j5939k3118k320j2839J3745J4616J0874J2840l792o384n095k5653
4732b5910m143J7421L4657Q084l7181k0818m714L549J2460m504r656J3989O012
4719a0754j0911K308P488k679k0688K629M2094M308q477n975j941j5465k5269
4706d3332N26K2095k47J0241K4442m683k021j2120k7131q392J5009K6955J3057
$$ plain form
4798 -28138 -44280 -37131 -24057 -19768 -39756 -38979 -18145 -35388 -56633 -52042 -7339 13039 10462
4785 10462 -2708 -28907 -27375 -27640 -32926 -44403 -54989 -43826 -52690 -46319 -24929 4786 28475
4772 28475 19424 16766 15529 4857 3211 3154 4933 14546 -1547 -19041 -17004 -47354 -47755 -24398
4758 -24398 -2797 -5002 -8647 -18627 -4153 6963 8597 7619 -3408 -26966 -32558 -9243 3509
4745 3509 17155 1216 -21902 -24222 -37061 -23316 -8700 2174 15014 11222 4838 -257 -25910
4732 -25910 -30053 -12632 22025 30109 -7072 -27890 -32604 -29055 -16595 -21099 -30755 -16766 -10754
4719 -10754 -21665 -19357 -11869 -14548 -35236 -32607 9487 13795 5318 -657 -2598 -18063 -43332
4706 -43332 -42806 -20711 -20958 -10717 13725 9042 7021 -5099 -32230 -40622 -25613 1342 14399
4693A4399Q023k138k6203n472K2265j7548L836J2149j6172p602o386j1375n872
4680c8096l468P65J3108R709j2567J3250J1814K9499K7885k2559k2525o825K6061
4667B6051m1232l3641j939Q321L3879K9271k3475q983J6892M965q043l9435M273
4654c3096o015L388J8243J1253J3950o406m100j0357R874n307k486J4064R022
4641A2027j1302l9492k3253K9792M1144q83R463n483R864K3291k6459k4931J555
4628d667J3378j318q943j406q1l089j7334j0847m953N040K2310q83K786r661K1458
4613A790o881r607j9703R256L389J0326J4044J2931K3741j8630J6863n091j981
4600C0447j6338j1579j586j4862R153J4301k473m050l343n056k5651J4100J9732
$$ plain form
4693 14399 22422 20284 -5919 -11391 10874 -6674 -2838 9311 -6861 -14463 -20849 -32224 -38096
4680 -38096 -41564 -40799 -27691 -17982 -30549 -17299 -5485 24014 51899 29340 6815 -10 26051
4667 26051 -15181 -48822 -50761 -42440 -8561 20710 -2765 -11748 5144 10109 2066 -37369 -33096
4654 -33096 -39111 -35723 -17480 -6227 7723 1317 -2783 -13140 -3266 -8573 -11059 3005 12027
4641 12027 725 -38767 -62020 -32228 8916 8033 17496 12013 21877 45168 18709 -6222 -4667
4628 -4667 8711 7393 -1550 -2956 -3037 -6126 -23460 -34307 -39260 -34220 -11910 -12793 -10007 -19668 1790
4613 1790 -5091 -14698 -34401 -25145 -21756 -11430 2614 15545 39286 20656 37519 32428 30447
4600 30447 14109 2530 944 -13918 -4765 9536 7063 3013 -330 -5386 -31037 -16937 2795
4587B795j2459j9178M662J0239J2066O499j6102k4068N541K4278Q892L3151j2671
4574B3645j3000L611O644j6265m205M811j3649r234q048J9082K8657Q074j6055
4561A4068r406p177l593J4775J6299m677p169N970k1668j5667q48L573r981Q658
4547a6843l323j808J3318J2510j1244l1237j4325J5711J2817j063J250Q431J2471
4534c335K2619l6230k3398K0496K369n256K1039J8172k105j78L438j8674j7786
4521a8829M358m344j1442k693q676k089K7401K8657o265O629k4972k7543R007
4508c0801L8480N029j1543J828j2748n402M379J3386J0589j5922j3605K9025J1167
4495B3862m597k0420j4563q00K106k052j1600K672J6120O463L372k5329N143p08
$$ plain form
4587 2795 -9664 -28842 -24180 -13941 -1875 4624 -11478 -35546 -30005 -5727 3165 36316 23645
4574 23645 10645 14256 20900 4635 430 5241 -8408 -17642 -25690 -6608 22049 30123 14068
4561 14068 4662 -2515 -6108 8667 24966 20289 13120 19090 -2578 -18245 -19093 -15520 -25501 -16843
4547 -16843 -20166 -21974 -8656 3854 -7390 -38627 -52952 -37241 -24424 -25487 -24237 -15806 -3335
4534 -3335 19284 -16946 -40344 -19848 -17479 -22735 -1696 16476 14371 14193 17631 -1043 -18829
4521 -18829 -14471 -18815 -30257 -32950 -41626 -43715 -16314 12343 6078 12707 -12265 -39808 -30801
4508 -30801 7679 12708 1165 2993 -9755 -15157 -10778 2608 13197 -2725 -16330 12695 23862
4495 23862 19265 -1155 -15718 -16518 -14412 -16464 -28064 -25392 -9272 -2809 563 -24766 -19623 -20331
4481b0331P765J0674k7277L714N694J9008J0093j4867n197j3555Q545K752m084
4468a7066J162N315K4366K3086k1864J156j4043l0885l602j0387j5915J4817O236
4455c7624J7711K0689J9485k6523j7654J8452L612L953P315j6980K042j9919m403
4442b9844m788K094k145K606J4310K0051O682K94o208l6912l1402J598L2009J4707
4428a6948K4752Q674l4137j7485J5788N764Q268J1803m890k5289K5511J544l4574
4415c1219M282J5656j2427n864Q626j466j204J9502O962q351j8657k7798P670
4402d4288Q655J4984K2453K567J1065o991k407k058k0678j6476K7410L6589P917
4389C8742r43j4622k7469k2495r303Q7R840P248J0987j4220k0622j053Q034P970
$$ plain form
4481 -20331 -12566 -1892 -29169 -25455 -19761 -753 9340 -5527 -10724 -24279 -15734 -12982 -17066
4468 -17066 -15904 -10589 13777 36863 14999 16155 2112 -28773 -32375 -42762 -58677 -43860 -37624
4455 -37624 -19913 776 20261 -6262 -23916 -5464 -1852 2101 9416 -7564 -5522 -25441 -29844
4442 -29844 -34632 -32538 -34683 -32077 -17767 2284 8966 9260 3052 -33860 -65262 -63664 -31655 -16948
4428 -16948 7804 16478 -17659 -35144 -19356 -13592 -5324 6479 1589 -23700 1811 3355 -31219
4415 -31219 -26937 -11281 -23708 -29572 -20946 -22412 -23616 -4114 2848 -5503 -24160 -51958 -44288
4402 -44288 -35633 -20649 1804 4371 15436 8445 6038 3980 -16698 -33174 -5764 30825 38742
4389 38742 37799 23177 -4292 -26787 -36090 -36003 -26163 -18915 -7928 -22148 -42770 -43823 -35789 -27819
4375b7819k81j7856J5984J3612K991K40j0725j2337N472J6550J0874L224P653
4362G582j4097m703q956l950j2275m491N820L377j2251J1416L3463j773j2345
4349a3183k805J4922q476N887R734O312k0287j4116J0146L580L816m195K003K762
4335c900Q76l436j965Q256j7878j371R906K6949J3259k6491j3023r826k4489L1527
4321a1606M771l2409N401K2704o860O391J1012K9109J0701o882k7180j4330j547
4308a0725J6771K554j2842J6308r970p681n265J2589Q98j3810J5706j1690o860
4295a4017j5016K8550p889P165O613j8710J5706l59l0161j3787K5449Q172k464
4282a0748j5768J9919J2574n180m781q743J2473n813j1489l921k775j773K3280
$$ plain form
4375 -27819 -28100 -45956 -29972 -16360 -13369 -13129 -23854 -36191 -30719 -14169 -3295 -71 7582
4362 7582 -6515 -11218 -20174 -24124 -36399 -40890 -35070 -31693 -43944 -32528 935 -838 -13183
4349 -13183 -15988 -1066 -9542 -3655 6079 12391 -7896 -22012 -11866 -8286 -4470 -8665 -6662 -3900
4335 -3900 -3024 -6460 -8425 -169 -18047 -19418 -9512 17437 30696 4205 -8818 -18644 -43133 -11606
4321 -11606 -6835 -39244 -33843 -11139 -17999 -11608 -596 28513 39214 32332 5152 -9178 -10725
4308 -10725 6046 8600 -4242 12066 2096 -5585 -10850 1739 2637 -11173 4533 -7157 -14017
4295 -14017 -29033 -483 -8372 -1207 5406 -13304 2402 2043 -28118 -41905 -16456 -8284 -10748
4282 -10748 -26516 -6597 5977 797 -3984 -12727 -254 -6067 -17556 -21477 -24252 -26025 -2745
4269b745J5410j0537o435m443j0705m427k382J85K1857j1647J3637K5012j0848
4256A1932j4995j8485N377J1947L204p6k9694q201K1597K5359K0941j3509j1330
4243D067Q582J0781J1586k3848k4799q353j0411q875L59K0223K989J3417j277
4230e559L745q052J1074K300q441m48q800J023K743J588o647K371N182K794Q614
4215C487J1780J3334j7483J3796J4584K133r610r957k7712N923j4957J916m105
4202a6871o659o305J1523J267M173R347k1363Q167J3725l498O88O64K551J5350
4188A2759P45K8254J4674r971j5250n826j0913k1151j8493J0725R099K517N266
4175B435k6913J0878m711j6126L574L67p255O7K2662K5297Q398O386L776j7722
$$ plain form
4269 -2745 12665 2128 -4307 -8750 -19455 -23882 -26264 -26079 -4222 -15869 -2232 22780 11932
4256 11932 -3063 -21548 -16171 -4224 -1020 -1096 -30790 -38991 -17394 7965 28906 15397 4067
4243 4067 12649 23430 35016 11168 -13631 -21984 -32395 -41270 -40911 -20688 -17699 -4282 -5559
4230 -5559 -1814 -9866 1208 3508 -4933 -5381 -14181 -13158 -10415 -8827 -15474 -13103 -7921 -5127 3487
4215 3487 15267 28601 11118 24914 39498 41631 32021 22064 -5648 275 -14682 -12766 -16871
4202 -16871 -23530 -29835 -18312 -17045 -12872 -3525 -24888 -16721 -2996 -6494 -5806 -5142 -2591 12759
4188 12759 13504 41758 56432 46461 31211 25385 14472 -6679 -25172 -14447 -5348 -2831 2435
4175 2435 -24478 -13600 -18311 -34437 -30863 -30496 -37751 -37684 -15022 10275 18673 25059 28835 11113
4161A1113j1474m591q176O202K0286j340J275j7986k2400l7221M036J5709O936
4148c7631K616Q391J6658k280n344q935j4897k403l691J1664K8872j842o817Q273
4134g366J9412M578k4091P45P839K699j0612l7048j4511K819J5639O056L091n005
4120c5755R062J3079L276M367J6978j954r890k1280n072K2735K2395R222N809
4107C2972j5613N66P743k5757q936L8215J7492j0159k1476j9956j3319J2465K287
4094c476L0089J0742m0694j4719O456M931J168n030l578j05q249q526L551K8286
4080H46m666k3174J1644r007K516L546n897j735J1720j2742P79J1875K1061J5487
4066B2253L760l0407K756n42K154o292r086q260K378j3346K9291K5101P674j5146
$$ plain form
4161 11113 -361 -4952 -13128 -6926 13360 12020 13295 -4691 -27091 -64312 -60276 -44567 -37631
4148 -37631 -35015 -26624 -9966 -12246 -17590 -26525 -41422 -43825 -47516 -35852 -6980 -8822 -15639 -7366
4134 -7366 12046 16624 -7467 -6722 1117 3816 -6796 -43844 -58355 -55536 -39897 -33841 -30750 -35755
4120 -35755 -26693 -13614 -10338 -5971 11007 9053 -837 -22117 -27189 -4454 17941 27163 32972
4107 32972 17359 17925 25668 -89 -9025 29190 46682 36523 15047 -4909 -18228 -5763 -3476
4094 -3476 26613 37355 -3339 -18058 -11602 -6671 -5503 -10533 -14111 -14216 -22465 -30991 -27440 846
4080 846 -3820 -26994 -15350 -24357 -21841 -18295 -24192 -25927 -14207 -26949 -26170 -14295 6766 22253
4066 22253 26013 -4394 -1638 -2180 -26 -6318 -15404 -23664 -21286 -34632 -5341 19760 27434 12288
4052A2288l865o96m530j4784J019k1565k0012K3498J9457J135j1443J1031J3702
4039E235j12k5848j6605n242J3104K8610J4409M833N216J9908j5363o500J5310
4026C6955J4464j868j3949m415r83l053m0258j2260k111q3m87r81K3032J9660
4012A3663Q263m074l2139o322R493j2123o77Q008J8152Q415j240P827k62k0537
3998c553o040n219j4855r091J8290L4161q879j7782Q90O855N196r801K0621N564
3984A6357o966K684q325K903j8639o690j1332j1199J5795J9656n749j3703P037
3971a8171M258K62R091K1982k414n696n951L994j2085J834P880j1212J6001J8460
3957B8233l4960k2251n480J3424J0245Q117J2379j1296Q88j6027j39L3240K1779
$$ plain form
4052 12288 8423 7727 3197 -11587 -10568 -32133 -52145 -28647 -9190 -8055 -19498 -8467 5235
4039 5235 5123 -20725 -37330 -42572 -29468 -858 13551 18384 23600 43508 28145 21645 36955
4026 36955 51419 49551 35602 31187 30204 27151 -13107 -25367 -27478 -27561 -28048 -29029 -5997 13663
4012 13663 21926 17852 -14287 -20609 -11116 -23239 -23916 -15908 2244 10659 9419 17246 16984 -3553
3998 -3553 -9593 -14812 -29667 -38758 -20468 13693 4814 -12968 -12078 -5223 -27 -9828 10793 16357
3984 16357 9391 12075 3750 6653 -11986 -18676 -30008 -41207 -25412 -5756 -11505 -25208 -18171
3971 -18171 -13913 -13651 -4560 17422 15008 9312 3361 7355 -4730 -2896 4984 -6228 9773 28233
3957 28233 -6727 -28978 -34458 -21034 -10789 -2672 9707 -1589 -701 -16728 -16867 16373 38152
3944C8152j7523p710j0372J5517K8191K078k5116O406k9093j9463n96K0516K1949
3931B2936K849N83q039j7603o12j2066P298R026J1256j6380k2842J3212l8222
3918d8604l087J2362L2793J2444k271k0947j9724Q165J4900j4038l852j7116J2568
3905c6407J0644j3333Q75J9649Q163j4949p446j4942M489J2747K5810O477o425
3892d648j998m071q260J8353Q750m643R270N00k6846J4998o758k4373J0201j1095
3878c0620k0835j6231L0777K1943r780j2016J4006O328o855j1643P799L170l106
3865b7063k5259K0116N943l096K0764j7626l010P048J0337Q872J4997o963Q60
3852E920j9168o57J407L757n094o610J808j6061R637J2052o097j5492J124m502
$$ plain form
3944 38152 20629 12919 2547 18064 46255 48333 23217 29623 530 -18933 -19529 987 22936
3931 22936 25785 26368 18329 726 114 -11952 -4654 4372 15628 -752 -23594 -10382 -48604
3918 -48604 -51691 -39329 -6536 5908 3637 -17310 -37034 -28869 -13969 -28007 -31859 -48975 -36407
3905 -36407 -25763 -39096 -38221 -18572 -10409 -25358 -32804 -47746 -43257 -30510 -4700 1777 -4648
3892 -4648 -6646 -10717 -18977 -624 8126 3483 12753 13253 -13593 1405 -5353 -29726 -19525 -30620
3878 -30620 -51455 -67686 -36909 -14966 -24746 -36762 -22756 -16428 -23283 -34926 -27127 -23957 -27063
3865 -27063 -52322 -32206 -26263 -29359 -8595 -26221 -29231 -22183 -11846 -2974 12023 5060 5920
3852 5920 -13248 -13905 -12498 -8741 -13835 -20445 -18637 -34698 -25061 -13009 -19106 -34598 -33474 -37976
3838c7976L43K2932K4325o466j4357j507j9190k5307J197K9343j786m45O118k8132
3824e0908o50N259R250J9616J54j4348m898P187K750m886k7096J3296J4782r728
3810d0220N489J5445q960J8897M171J660P31q17j0826k1677o237K376q40Q793
3796c2015J7280J786j2097q059o559K0085J0193J8776j0299k447m196j4833J733
3783b0652J6922N733o003R92K2949K851n569L824J8047j2489l1154J1012O686
3770A3149q065r681q22N803M332j9452P725j1566n594m930M22K0474J0575r461
3756g091k635K5465r661m0655o399J6646r476M562K0634O777o731Q998P041p336
3742A39n191j9758j1987l936J0538J5325k576j0951K00j0571K1233J2088N949
$$ plain form
3838 -37976 -37633 -14701 9624 3158 -11199 -12706 -31896 -57203 -56006 -26663 -28449 -28894 -22776 -50908
3824 -50908 -51558 -46299 -37049 -17433 -17279 -31627 -36525 -29338 -26588 -31474 -58570 -45274 -30492 -40220
3810 -40220 -34731 -19286 -28246 -9349 -5178 -3518 -2787 -3604 -14430 -36107 -42344 -39968 -40808 -32015
3796 -32015 -14735 -12949 -25046 -33105 -39664 -19579 -9386 9390 -909 -3356 -7552 -22385 -20652
3783 -20652 -3730 2003 -4000 -3008 19941 22792 17223 21047 39094 26605 -4549 6463 13149
3770 13149 5084 -4597 -5419 384 4716 -14736 -7011 -18577 -24171 -29101 -28679 -8205 2370 -7091
3756 -7091 -9726 15739 6078 -34577 -40976 -24330 -33806 -29244 -8610 -1833 -8564 434 7475 139
3742 139 -5052 -24810 -36797 -40733 -30195 -14870 -17446 -28397 -28197 -38768 -17535 -5447 502
3729E02l2q984l446J4082p616k4450o660k991k1742R979K0594J1515K824J1732
3715d693N601j1035n307Q543J3303n623l7248n866K2959Q131J002j1180R140J9537
3701G264j1017r77Q709J6512J6054q182L201k930k9673l2320j9830O755K5310
3688b1124L6153J0369k9647j8089O383M52j344j0190Q384o78J3650k5118k7734
3675e8533J1574L797j3105L538N450K3432K1549K3231R850J0381j6600k5526P056
3662F094p951j5941q619k3618n451L8885N4138j7336m1705j8487j0611K1791k53
3649b9064R011K7475J9556J009J3291M5j4872j2520N457j589q528k7735r440M4333
3635A6429j778k74K2669k2582k0386j2421J2168J3115j3226r233k75J4098J1695
$$ plain form
3729 502 470 -8514 -11960 2122 -5494 -29944 -36604 -39595 -61337 -51358 -30764 -19249 -16425 -4693
3715 -4693 908 -10127 -15434 -6891 6412 789 -36459 -42325 -19366 -11235 -10233 -21413 -12273 7264
3701 7264 -3753 -4730 3979 20491 36545 28363 31564 28634 -1039 -33359 -53189 -46434 -21124
3688 -21124 15029 25398 -4249 -22338 -15955 -15503 -16847 -27037 -18653 -19331 -5681 -30799 -58533
3675 -58533 -46959 -43162 -56267 -52729 -47279 -23847 -2298 20933 30783 41164 24564 -962 6094
3662 6094 -1857 -17798 -26417 -50035 -55486 -16601 37537 20201 -21504 -39991 -50602 -28811 -29064
3649 -29064 -20053 7422 26978 27987 41278 41323 26451 13931 19388 17799 9271 -18464 -27904 16429
3635 16429 14651 14377 37046 14464 -5922 -18343 -6175 6940 -6286 -15519 -15794 -1696 9999
3622I999k3303j2762J127M060j4178J7467L717k5729j9706K2417K2852Q211j5843
3609b1671J2081k168j1539J6570j000p859j1543k062q198M0451R045N126K793
3596B0026r696l014J8726r875j5069m29m010j7247p832J5396J6913L5564k6701
3583A2752l2488O40K0307J8459O932J266K615j5189k5822J477J8714J1628J87
3570B1478N259K4435k4921j8023l801J1502m566j6466J0227J5385J2754k2700
3558A0563j9486q426n776J7445j9232q714P198M161l680K167Q450Q55k248j4938
3544c1661j0160K736K028o962L6828K2119M992k471M475l1920j175K4186J1319
3531B4334j8857k7738r105L4366L5543r925k9279j637J630j4097L578J2755J3910
$$ plain form
3622 9999 -13304 -26066 -24939 -20879 -35057 -17590 -13873 -39602 -59308 -36891 -14039 -5828 -21671
3609 -21671 -9590 -11758 -23297 -6727 -7727 -15586 -27129 -29191 -37389 3062 12107 17233 20026
3596 20026 10330 7316 26042 16167 1098 669 -3341 -20588 -28420 -13024 3889 39453 12752
3583 12752 -19736 -19096 1211 19670 26602 27868 30483 15294 -10528 -9051 9663 21291 21478
3570 21478 26737 51172 26251 8228 4427 15929 11363 -5103 5124 20509 33263 10563
3558 10563 -8923 -17349 -23125 -5680 -24912 -33626 -26428 -22267 -25947 -23780 -15330 -14475 -16723 -31661
3544 -31661 -41821 -39085 -37057 -44019 -7191 14928 19920 17449 21924 -9996 -11171 13015 24334
3531 24334 5477 -22261 -31366 3000 38543 28618 -661 -2298 -668 -14765 -11187 1568 15478
3518A5478O558j8647l1179j922J0084P388J0935q502j2265K415N604J2314n320
3505g059k3193j6389N939K1148J4427Q194l281J375Q536N397O377l401j3177k1899
3491a7006m0061q245k765K6403K72J0073L1580N702k8468m349J2043j6132R085
3478b1868K1076J9797J222Q905l1994m3333p059J2645O313P970n100n058J7666
3465a8818J9720J4462J6638L53k1877q821K766k0947r990p420j5741K9630J3286
3452f759l899r153O19L198o695O73l922k359J2142O4n662L0211K527l899k0736
3437a3650j5505p375q313j0368L1414N934M388J5261J060p638p735K7163R776
3424B4412k4469j9730L0203K1048k0869m455q769j1662j4011K5351K5412M951
$$ plain form
3518 15478 22036 3389 -27790 -29712 -19628 -12240 -1305 -9807 -22072 -19657 -14053 -1739 -7059
3505 -7059 -30252 -46641 -40702 -19554 -5127 3067 -214 1161 9697 15094 21471 18070 4893 -17006
3491 -17006 -57067 -65312 -68077 -41674 -41402 -31329 251 5953 -22515 -26864 -14821 -30953 -21868
3478 -21868 -792 19005 20227 29132 -2862 -46195 -53254 -40609 -34296 -26326 -31426 -36484 -18818
3465 -18818 902 15364 32002 32355 10478 1657 4423 -16524 -26514 -33934 -49675 -20045 -6759
3452 -6759 -10658 -19811 -19192 -15994 -22689 -22016 -25938 -28297 -16155 -16091 -21753 8458 10985 7086 -13650
3437 -13650 -29155 -36530 -44843 -55211 -23797 -17863 -13475 1786 2846 -4792 -12527 14636 24412
3424 24412 -57 -19787 10416 31464 10595 6140 -2629 -14291 -28302 -2951 22461 27412
3412B7412k2570Q17Q038k165j9500n433O965M483P365j3996m328J4314j7636j0529
3398b6763q945L391l007p496K3647Q040O702r623j7237M525J8866r074j3876O628
3384b4222R514j5577r511J8692k0769J149J7066k757k6574K6462P373j806j5236
3371c6196R774j1118K29J7896J3646K890Q217O842q338q249j0802k882L268j0825
3357b5648J1450K981m907P426n52J3661j323l745j4043L773j0507m653m357P68
3343b9676K62J8289J8356r765p614K2639J4170n215k5268l0483J8037J0372j242
3330g138j5883n146n974m63K617l062P476K6759J2510J2738P257M993J1827k3013
3316B5498l1239j4622l51n011L201j202L0724J1098j6122j0294J536J0192l384
$$ plain form
3412 27412 4842 5659 13697 11532 -7968 -13401 -6436 -1953 5412 -8584 -12912 1402 -16234 -26763
3398 -26763 -35708 -32317 -35324 -42820 -19173 -11133 -4431 -14054 -31291 -26766 -7900 -16974 -30850 -24222
3384 -24222 -14708 -30285 -39796 -21104 -41873 -40724 -23658 -26415 -52989 -26527 -19154 -20960 -36196
3371 -36196 -26422 -37540 -37311 -19415 -5769 -2879 5338 12180 3842 -4407 -15209 -18091 -14823 -25648
3357 -25648 -14198 -11217 -16124 -8698 -9250 4411 3088 -657 -14700 -10927 -21434 -26087 -30444 -29676
3343 -29676 -29414 -11125 7231 -2534 -10148 12491 26661 21446 -3822 -34305 -16268 -5896 -7138
3330 -7138 -23021 -28167 -34141 -34604 -31987 -35049 -27573 -814 11696 24434 31691 36684 48511 25498
3316 25498 -5741 -20363 -20714 -25725 -22524 -23726 6998 18096 1974 -8320 -6784 3408 24
3303B4k1840J642l83j6391k111j5094o985J4192K9364K4506O904j2948r997r680
3289a8797J2525o365r427q497J3176K9700P281l2265k8268K2505L0314o994k0336
3276a5448q63m00J2907Q936M245p171j0916Q297o89M493j2531L429J9008j051
3262A2246k1857j2183J3237J6918j9802n905j4419q009r318J6544O003M360k6607
3249d8792j877L628j557j4049L9547J4269j2327k1942j0535J4000K4886L614J8851
3236G716R921j7321r152K7534k5j9773n876p975J288N046j233N691J2096O163
3222A4100P948M482n011j1479l1798J535J0499j4351j1711m611J5017O165j1094
3209c0309M809q889K2074K744K4190K7566j6388l5306l10K5241M731j5928o101
$$ plain form
3303 24 -21816 -20174 -20557 -36948 -39059 -54153 -61138 -46946 -17582 6924 13828 880 -9117 -18797
3289 -18797 -6272 -12637 -22064 -30561 -17385 12315 19596 -12669 -40937 -18432 11882 4888 -15448
3276 -15448 -16311 -16711 -3804 5132 9377 2206 -8710 -413 -1102 3391 -9140 -5711 13297 12246
3262 12246 -9611 -21794 -8557 8361 -11441 -17346 -31765 -39774 -49092 -32548 -26545 -22185 -48792
3249 -48792 -50669 -47041 -48598 -62647 -23100 -8831 -21158 -43100 -53635 -39635 -14749 -11135 7716
3236 7716 17637 316 -8836 18698 18673 -1100 -6976 -14951 -13663 -8617 -9850 -4159 7937 14100
3222 14100 22048 26530 21519 10040 -21758 -20223 -9724 -24075 -35786 -40397 -25380 -19215 -30309
3209 -30309 -25500 -34389 -12315 -9571 14619 42185 25797 -9509 -9819 15422 20153 4225 -1876
3196a876k2753Q590p073k6957M19J2153J1286N793N046P41K719J7495j7380J1671
3182a26O955q519k6624n676L6828J1825k9751J3138k65P282K3740J4838m50j7325
3168B5870j7906j0636j8120r442Q417O282M31K200j5419j6106J8693Q806k963
3155a9893j4441J8104J6746o459R501J7342J1560j3158j8523j3175j635O521K7127
3142A9617J2078p75j8131q379n577Q07K781J707r270j3920m092l7J7399R146l345
3127Ij4220j2609J074k5029j3477O349O832L4447K074p115q18K487P644r651p802
3112b9805r733J3655J0504J6388K0283R790j1750O484j9403k5290J3414J4638
3100I175J6980K256K951j7288j9230m179o462M779K2858j2844j3616j5693L1534
$$ plain form
3196 -1876 -24629 -16039 -23112 -50069 -49650 -37497 -26211 -20418 -15372 -14631 -11912 5583 -11797 -126
3182 -126 6829 -1690 -28314 -33990 2838 14663 -15088 -1950 -2215 5067 28807 43645 43195 25870
3168 25870 7964 -2672 -20792 -30234 -21817 -15535 -15104 -12904 -28323 -44429 -25736 -16930 -19893
3155 -19893 -34334 -16230 516 -5943 3558 20900 32460 19302 779 -12396 -14031 -7510 19617
3142 19617 31695 30920 12789 4410 -1167 -360 2421 4128 -5142 -19062 -23154 -23191 -5792 3354 9
3127 9 -14211 -26820 -25746 -50775 -64252 -57903 -51071 -16624 -14550 -21665 -22483 -19996 -12352 -22003 -29805
3112 -29805 -39538 -25883 -15379 1009 21292 31082 19332 25816 6413 -18877 -5463 9175
3100 9175 26155 28411 31362 14074 -5156 -9335 -15797 -11018 11840 -1004 -14620 -30313 1221
3087A221j6648m1577p701J9239J8406N489j2179Q922J6202q40M752J2055K104
3074I445j0638q352J9167l399k9901o183Q420J0205j183Q923Q663j3206j870k1467
3060c1376j6322j8330j0436L1474K5346J6862M19O20j0104J3112j5869O753L0075
3047B2224j4017l5600k1157L768o805R469K577J4969J4161J0007P741m819l595
3034a077q003j7855L4071K7471Q244j9519j0151M261k676r01o61j6895j9608j5811
3020c9110k163N671J4895j134j5658K3440J8371J4568k814k1781k2832J2083K4633
3007H169k5571K7487J1056l0657p427K068K1945j214j4193N312L399k1350O746
2994a4230J6588J7045o620r730J9543j5994l2484j4458O589J7369P771j2786R737
$$ plain form
3087 1221 -15427 -57004 -64705 -45466 -27060 -21571 -33750 -24828 -8626 -9466 -4714 7341 9445
3074 9445 -1193 -9545 9622 6223 -23678 -29861 -21441 -11236 -12419 -3496 5167 -8039 -9909 -31376
3060 -31376 -47698 -66028 -76464 -44990 -19644 -2782 -2363 -1743 -11847 1265 -14604 -7851 22224
3047 22224 8207 -27393 -48550 -44782 -51587 -42118 -39541 -24572 -10411 -404 7337 2518 -1077
3034 -1077 -9080 -26935 7136 34607 42851 23332 13181 17442 14766 13865 13204 -3691 -23299 -39110
3020 -39110 -41273 -35602 -20707 -21841 -37499 -14059 4312 18880 16066 -5715 -28547 -16464 8169
3007 8169 -17402 10085 21141 -9516 -16943 -14875 7070 5856 -8337 -3025 374 -20976 -14230
2994 -14230 2358 19403 12783 3053 22596 6602 -25882 -40340 -33751 -16382 -8611 -21397 -11660
2981a1660L845J7286o875k5307p725l906L572P522r24L834j4006k5046j2926K6396
2967d5920P2N847O503o174j005K5802N573j2304P29J7642O349j4992j9430J9710
2953a1598K0893k4136k8499k3458R252k1335j334J5712R195J4567P06j3374R994
2940d3415K1275K158j4997q406L844L6197j2639q039J3736M320q242k92j2309
2927b6809k543N829o7Q942J117o303J5434J2503j0563q247O28M569J9081k9183
2913a5612j5626K406J1632M177J8744j444j564K4678j1710N34J62j5908k4924
2900b4455J3773J7213q532Q14J9791J722l0531M908N891j0996L007K4022P483
2887B4110K624j269P589j1916k1802j0476k70J2339m614J406j7111k098J3570
$$ plain form
2981 -11660 -7815 9471 2596 -22711 -30436 -34342 -30770 -23248 -24172 -20338 -34344 -59390 -72316 -45920
2967 -45920 -45848 -40001 -33498 -39672 -40677 -14875 -9302 -21606 -20877 -3235 3114 -11878 -31308 -11598
2953 -11598 9295 -14841 -43340 -66798 -57546 -78881 -80215 -64503 -55308 -40741 -40035 -53409 -43415
2940 -43415 -22140 -19982 -34979 -43385 -39541 -3344 -15983 -24022 -10286 -5966 -14208 -14500 -26809
2927 -26809 -29352 -23523 -23590 -14648 -13531 -19834 -4400 8103 -2460 -10707 -10079 -5510 13571 -15612
2913 -15612 -31238 -28832 -17200 -13023 5721 4277 2713 27391 15681 16215 16377 469 -24455
2900 -24455 -10682 6531 -2001 -1187 18604 20326 -10205 -5297 594 -10402 -7395 16627 24110
2887 24110 26734 25465 33054 21138 -664 -11140 -11410 929 -3685 -2279 -19390 -21488 -7918
2874g918q40p86N034Q903j3503j0320L187Q770R865P850J4749p442j2390j924
2860C235r78M558j789R445q926N131j1119k9798j731L7280j1439n303M539L569
2846c326n313J808J7443J2770M581j0220k8893j5625J3853L7676M55k1304j6223
2833a2318J1168l4227j4602k115o050J3646J4172J9879o3O267J6353j0895o422
$$ plain form
2874 -7918 -8758 -9544 -4510 4393 -9110 -19430 -16243 -7473 2392 10242 24991 17549 5159 3235
2860 3235 2257 6815 5026 14471 5545 10676 -443 -30241 -31972 5308 -6131 -11434 -6895 -3326
2846 -3326 -8639 -6831 10612 23382 27963 17743 -11150 -26775 -12922 24754 25209 3905 -12318
2833 -12318 -1150 -35377 -49979 -52094 -58144 -44498 -30326 -10447 -10510 -4243 12110 1215 -5207
$$ [...]
##END NTUPLES=NMR SPECTRUM
##END=
