##TITLE=	STANDARD PROTON PARAMETERS
##JCAMPDX=	6.0	$$ NMR LITE Plug-in 1.1 of MestReNova LITE 5.2.5-4119
##DATATYPE=	LINK
##BLOCKS=	2
##ORIGIN=	inova
##OWNER=	

##TITLE=	STANDARD PROTON PARAMETERS
##JCAMPDX=	6.0	$$ NMR LITE Plug-in 1.1 of MestReNova LITE 5.2.5-4119
##BLOCKID=	1
##DATATYPE=	NMRSPECTRUM
##DATACLASS=	NTUPLES
##NUMDIM=	1
##ORIGIN=	inova
##OWNER=	
##.OBSERVEFREQUENCY=	499.751068115234375
##.OBSERVENUCLEUS=	^1H
##.SOLVENTNAME=	5
##.PULSESEQUENCE=	s2pul
##.ACQUISITIONMODE=	SIMULTANEOUS
##$ORIGINALFORMAT=	Varian
##$PARAMETERFILE=	(log, ASCII, /Volumes/RANITA/STDo-tolyl_1H.fid/log, 0)
$$ Thu Jan  6 14:47:15 2011: Experiment started
$$ Thu Jan  6 14:47:33 2011: BS 1 completed
$$ Thu Jan  6 14:47:48 2011: BS 2 completed
$$ Thu Jan  6 14:48:04 2011: BS 3 completed
$$ Thu Jan  6 14:48:21 2011: Acquisition complete
$$ 
##$PARAMETERFILE=	(procpar, ASCII, /Volumes/RANITA/STDo-tolyl_1H.fid/procpar, 0)
$$ in 4 2 1 0 0 2 1 0 1 64
$$ 1 "n"
$$ 3 "n" "w" "y" 
$$ dmf2 7 1 2000000 1 0 2 1 2 1 64
$$ 1 200 
$$ 0 
$$ d2 3 1 14 14 14 2 1 8194 1 64
$$ 1 0 
$$ 0 
$$ bs 7 1 32767 0 1 2 1 0 1 64
$$ 1 4 
$$ 0 
$$ arrayelemts 1 1 9.99999984307e+17 -9.99999984307e+17 0 2 1 0 1 64
$$ 1 0 
$$ 0 
$$ acqstatus 7 1 32767 0 0 2 1 0 1 64
$$ 2 101 18 
$$ 0 
$$ acqdim 7 1 32767 0 0 2 1 0 1 64
$$ 1 1 
$$ 0 
$$ acqcycles 1 1 9.99999984307e+17 -9.99999984307e+17 0 2 1 0 1 64
$$ 1 1 
$$ 0 
$$ alock 2 2 8 0 0 2 1 0 1 64
$$ 1 "n"
$$ 5 "a" "n" "s" "u" "y" 
$$ alfa 6 1 13 13 13 2 1 8194 1 64
$$ 1 0 
$$ 0 
$$ aig 2 2 2 0 0 4 1 1 1 64
$$ 1 "nm"
$$ 2 "nm" "ai" 
$$ array 2 2 256 0 0 2 1 1 1 64
$$ 1 ""
$$ 0 
$$ ap 2 2 1023 0 0 4 1 6 1 64
$$ 13 "1:SAMPLE:date,solvent,file;"
$$ "1:ACQUISITION:sfrq:3,tn:2,at:3,np:0,sw:1,fb:0,bs(bs):0,ss(ss):0,tpwr(tpwr):0,pw:1,p1(p1):1,d1:3,d2(d2):3,tof:1,nt:0,ct:0,alock,gain:0;"
$$ "1:FLAGS:il,in,dp,hs;"
$$ "1(ni):2D ACQUISITION:sw1:1,ni:0,phase:0;"
$$ "1(ni2):3D ACQUISITION:d3:0,sw2:1,ni2:0,phase2:0;"
$$ "1:DISPLAY:sp:1,wp:1,vs:0,sc:0,wc:0,hzmm:2,is:2,rfl:1,rfp:1,th:0,ins:3,aig*,dcg*,dmg*;"
$$ "1(ni):2D DISPLAY:sp1:1,wp1:1,sc2:0,wc2:0,rfl1:1,rfp1:1;"
$$ "2:DEC. & VT:dfrq:3,dn,dpwr:0,dof:1,dm,dmm,dmf,dseq,dres:1,homo,temp(temp):1;"
$$ "2(numrfch > 2):DEC2:dfrq2:3,dn2,dpwr2:0,dof2:1,dm2,dmm2,dmf2:0,dseq2,dres2:1,homo2;"
$$ "2(numrfch > 3):DEC3:dfrq3:3,dn3,dpwr3:0,dof3:1,dm3,dmm3,dmf3:0,dseq3,dres3:1,homo3;"
$$ "2:PROCESSING:cf(nf):0,lb(lb):2,sb(sb):3,sbs(sb):3,gf(gf):3,gfs(gf):3,awc(awc):3,lsfid(lsfid):0,phfid(phfid):1,wtfile,proc,fn:0,math,,werr,wexp,wbs,wnt;"
$$ "2(ni):2D PROCESSING:lb1(lb1):3,sb1(sb1):3,sbs1(sb1):3,gf1(gf1):3,gfs1(gf1):3,awc1(awc1):3,wtfile1,proc1,fn1:0;"
$$ "2(ni2):3D PROCESSING:lb2(lb2):2,sb2(sb2):3,sbs2(sb2):3,gf2(gf2):3,gfs2(gf2):3,awc2(awc2):3,wtfile2,proc2,fn2:0;"
$$ 0 
$$ arraydim 7 1 32768 1 1 2 1 5 1 64
$$ 1 1 
$$ 0 
$$ axis 4 2 4 0 0 4 1 0 1 64
$$ 1 "p"
$$ 11 "c" "d" "1" "2" "3" "h" "k" "m" "n" "p" "u" 
$$ awc 1 1 1 -1 0.001 3 1 1 0 64
$$ 1 0 
$$ 0 
$$ at 1 1 14 14 14 2 1 8203 1 64
$$ 1 4 
$$ 0 
$$ [...]
$$ 1 0 
$$ 0 
$$ x2y2 7 1 19 19 19 2 1 8192 1 64
$$ 1 3474 
$$ 0 
$$ x1 7 1 19 19 19 2 1 8192 1 64
$$ 1 -10562 
$$ 0 
$$ x3 7 1 19 19 19 2 1 8192 1 64
$$ 1 219 
$$ 0 
$$ xz 7 1 19 19 19 2 1 8192 1 64
$$ 1 13385 
$$ 0 
$$ xy 7 1 19 19 19 2 1 8192 1 64
$$ 1 -4937 
$$ 0 
$$ xz2 7 1 19 19 19 2 1 8192 1 64
$$ 1 -3568 
$$ 0 
$$ y4 7 1 19 19 19 2 1 8192 1 64
$$ 1 0 
$$ 0 
$$ y3 7 1 19 19 19 2 1 8192 1 64
$$ 1 15317 
$$ 0 
$$ yz 7 1 19 19 19 2 1 8192 1 64
$$ 1 -580 
$$ 0 
$$ z3x 7 1 19 19 19 2 1 8192 1 64
$$ 1 1211 
$$ 0 
$$ z2x2y2 7 1 19 19 19 2 1 8192 1 64
$$ 1 4139 
$$ 0 
$$ z2 7 1 19 19 19 2 1 8192 1 64
$$ 1 -3306 
$$ 0 
$$ z1 7 1 19 19 19 2 1 8192 1 64
$$ 1 -12115 
$$ 0 
$$ z0_ 1 1 19 19 19 2 1 8208 1 64
$$ 1 11992 
$$ 0 
$$ z1c 7 1 19 19 19 2 1 8192 1 64
$$ 1 -1044 
$$ 0 
$$ z2c 7 1 19 19 19 2 1 8192 1 64
$$ 1 196 
$$ 0 
$$ z2y3 7 1 19 19 19 2 1 8192 1 64
$$ 1 0 
$$ 0 
$$ z2xy 7 1 19 19 19 2 1 8192 1 64
$$ 1 -4691 
$$ 0 
$$ z2x3 7 1 19 19 19 2 1 8192 1 64
$$ 1 0 
$$ 0 
$$ z3c 7 1 19 19 19 2 1 8192 1 64
$$ 1 0 
$$ 0 
$$ z3 7 1 19 19 19 2 1 8192 1 64
$$ 1 5279 
$$ 0 
$$ z5 7 1 19 19 19 2 1 8192 1 64
$$ 1 -10155 
$$ 0 
$$ z4x 7 1 19 19 19 2 1 8192 1 64
$$ 1 12415 
$$ 0 
$$ z3y 7 1 19 19 19 2 1 8192 1 64
$$ 1 -1360 
$$ 0 
$$ z3x3 7 1 19 19 19 2 1 8192 1 64
$$ 1 0 
$$ 0 
$$ z3x2y2 7 1 19 19 19 2 1 8192 1 64
$$ 1 0 
$$ 0 
$$ z3xy 7 1 19 19 19 2 1 8192 1 64
$$ 1 0 
$$ 0 
$$ z4 7 1 19 19 19 2 1 8192 1 64
$$ 1 1828 
$$ 0 
$$ z3y3 7 1 19 19 19 2 1 8192 1 64
$$ 1 0 
$$ 0 
$$ z4c 7 1 19 19 19 2 1 8192 1 64
$$ 1 0 
$$ 0 
$$ z4xy 7 1 19 19 19 2 1 8192 1 64
$$ 1 0 
$$ 0 
$$ z4x2y2 7 1 19 19 19 2 1 8192 1 64
$$ 1 0 
$$ 0 
$$ z4y 7 1 19 19 19 2 1 8192 1 64
$$ 1 -3475 
$$ 0 
$$ z7 7 1 19 19 19 2 1 8192 1 64
$$ 1 0 
$$ 0 
$$ z5y 7 1 19 19 19 2 1 8192 1 64
$$ 1 0 
$$ 0 
$$ z5x 7 1 19 19 19 2 1 8192 1 64
$$ 1 0 
$$ 0 
$$ z6 7 1 19 19 19 2 1 8192 1 64
$$ 1 -18392 
$$ 0 
$$ zx2y2 7 1 19 19 19 2 1 8192 1 64
$$ 1 -5842 
$$ 0 
$$ z8 7 1 19 19 19 2 1 8192 1 64
$$ 1 0 
$$ 0 
$$ zxy 7 1 19 19 19 2 1 8192 1 64
$$ 1 12839 
$$ 0 
$$ zx3 7 1 19 19 19 2 1 8192 1 64
$$ 1 -1541 
$$ 0 
$$ zy3 7 1 19 19 19 2 1 8192 1 64
$$ 1 5452 
$$ 0 
$$ 
##$PARAMETERFILE=	(text, ASCII, /Volumes/RANITA/STDo-tolyl_1H.fid/text, 0)
$$ STANDARD PROTON PARAMETERS
$$ 
##NTUPLES=	NMRSPECTRUM
##VARNAME=	FREQUENCY,	SPECTRUM/REAL,	SPECTRUM/IMAG,	PAGE NUMBER
##SYMBOL=	X,	R,	I,	N
##VARTYPE=	INDEPENDENT,	DEPENDENT,	DEPENDENT,	PAGE
##VARFORM=	AFFN,	ASDF,	ASDF,	AFFN
##VARDIM=	65536,	65536,	65536,	2
##UNITS=	HZ,	ARBITRARY UNITS,	ARBITRARY UNITS,
##FIRST=	6498.8114013671875,	-0.088423416018486022949,	-0.017611797899007797241,	1
##LAST=	-1501.1885986328125,	-0.17765134572982788086,	-0.024291148409247398376,	2
##MIN=	-1501.1885986328125,	-0.5219179987907409668,	-31.468706130981445312,	1
##MAX=	6498.8114013671875,	44.9277496337890625,	34.308380126953125,	1
##FACTOR=	-0.1220721751735713706,	0.00056159687042236334457,	0.00042885475158691406744,	1
##PAGE=	N=1
##DATATABLE=	(X++(R..R)), XYDATA
$$ [...]
-24617 -175 -22 -13 -308 -52 -22 -43 -109 -221 -100 -67 -89 -93 -249 -282 -118 -184 -248 -187 -118 -60 11 -15 -65 14 -121 -169 -159 -6 -71 -192
-24587 -192 -258 -84 -129 -95 -117 -37 -134 -125 -77 -100 -98 -151 -48 -137 20 -26 -234 -130 -170 -159 0 -174 -101 -170 -119 -180 -151 -173 -107 -81 -129
-24556 -129 -169 10 -104 -234 -159 -142 -69 -107 -153 -75 -189 -195 -204 -127 -224 -177 -146 -247 -214 -71 78 -329 -102 -115 -102 -172 -122 -23 8 -138
-24526 -138 -82 -126 -36 -97 -146 -205 -128 -140 -279 31 -125 -103 -18 16 -39 -97 -128 -46 -7 -134 -164 -11 -207 -188 -261 -177 -14 -117 -65 14
-24496 14 -64 -329 -193 -44 -107 -45 -248 -191 -37 -24 -87 -69 10 -172 -37 -90 -120 -65 -217 -138 26 -274 -144 -81 -75 -86 -238 -136
-24468 -136 40 -206 -135 -121 -294 -104 -301 -6 -90 -126 -158 -109 -229 -143 -68 -207 -24 4 -196 -163 -178 -157 -9 4 -38 -233 -246 -84
-24440 -84 -258 -230 -199 -197 -65 -365 -42 -116 -114 -116 -108 -236 -60 -99 -236 -162 -109 -166 -202 -151 -108 -70 -169 -90 -127 -223 -69 -80 -144 -11 -136
-24409 -136 -6 -24 -101 -173 -58 -183 -46 -122 -17 -68 -118 -61 -198 -27 -19 57 -130 -306 -38 -76 -100 -79 -122 -48 -107 -46 -156 -154 -203
-24380 -203 -124 -149 -114 -70 -151 -113 -211 -93 -105 -114 9 -152 -169 -208 -215 -55 -81 -43 -151 -31 -119 -195 -130 -144 3 -83 -165 -32 -236 -272
-24350 -272 30 -78 -82 -173 -70 -134 -28 -153 -209 -102 -104 -127 6 -31 -101 -91 -206 -131 -149 -48 -173 -264 -112 -55 -142 -61 -152 -158 -135 -35
-24320 -35 27 -144 -35 8 -138 -165 -80 -70 -64 -80 -150 -45 -42 45 -137 -134 -3 -34 -250 -144 -268 -182 -1 5 -39 -182 -58 -42 -104 -219
-24290 -219 -142 -210 -267 -54 -81 -156 -45 -126 -90 -87 0 -47 -83 -90 -77 -150 8 -1 -82 -104 -67 -150 -192 -177 -155 -144 -95 -133 -90 -170 -84 -30 -194
-24257 -194 -181 -89 -92 -103 -100 -165 -157 -196 -128 -163 -188 -128 -164 -339 -153 -211 -53 -167 -115 -96 12 -1 -108 -58 -16 -167 -233 -106 -159 -84 -156
-24226 -156 -175 -87 22 -40 -214 -88 -79 -164 -50 -25 -66 -222 -255 -144 -173 -182 -173 -152 -56 -190 -40 -45 -238 -74 -33 -263 -208 -116 -127 -96
-24196 -96 -39 -150 -71 -134 -142 -267 -41 -70 -52 -102 -186 -87 -170 -119 -57 -49 -182 -238 -320 -171 -168 -293 -190 -221 -143 -57 -136 -190 -187 22 -102 -170
-24164 -170 -135 66 -37 -39 -172 -154 -261 -59 -212 -122 -170 -51 -23 -203 -258 -172 -211 -240 -215 -419 -55 -124 25 -201 29 63 -46
-24137 -46 -172 -109 -11 -165 -269 -144 -241 -176 -139 -188 -328 -235 -210 -40 -58 -281 -139 -219 -109 -131 -108 -213 -206 -29 -94 -258 -209 -141 -136
-24108 -136 -88 -78 -264 -114 -181 -194 -115 -146 -144 -231 -123 -191 -144 20 -251 -250 -192 43 -149 -253 -166 -96 -38 -208 -275 -148 -181 -191 -190 -318
-24078 -318 -132 -138 -132 -161 58 25 -129 -107 -100 -93 -131 -260 -73 -241 -262 -178 -139 -167 -270 -169 -218 -157 -283 -283 -226 -225 -73 -89 -60 -84 -175 -150
-24046 -150 -197 19 -12 -154 -234 -259 -309 -202 -156 -203 -117 -98 -70 -71 -157 -116 -198 -244 -81 -121 -33 -119 -110 -115 -129 -71 -185 -15 19 -154 -56 -181
-24014 -181 -39 -92 -182 -83 -178 -124 -129 -127 -288 -178 -125 5 -164 -96 -167 -417 -68 -60 -157 -281 -196 -178 -166 -312 -332 -11 -53 -251 -183 -227
-23984 -227 -273 -48 -86 17 -226 -249 -28 -123 -240 -122 -128 -164 -132 26 -160 -373 19 -146 -200 -272 -219 -54 -36 -78 -3 -145 -122 -123
-23956 -123 -177 -150 -157 -44 -160 -160 -73 -218 -193 -100 19 -102 -223 -150 -213 -155 -136 -90 -190 -168 -220 -226 -105 -87 -48 -48 -125 -32 -118 -133 -194 -117
-23924 -117 -164 -28 -223 -224 -99 -180 -119 -208 -82 -205 -162 -107 -119 -155 -44 -119 -296 -105 -128 -255 -125 -105 -132 -163 -77 -88 -4 -221 -338
-23895 -338 -143 -91 -96 -56 -207 -226 -74 -36 -186 -63 -184 -123 -176 -219 -136 -347 -157 -71 -44 -201 -159 -78 -113 -287 -179 -153 -15 -108
-23867 -108 -49 -146 -47 -191 -254 -123 -183 -42 -158 -119 -185 -207 -183 -157 -16 -161 -199 59 -223 14 -126 -296 -67 -16 -118 -114 -184 -315
-23839 -315 -99 -78 -81 -160 -82 -92 -143 -84 -135 -138 -146 -115 -96 -106 -218 -127 -57 -202 -187 -112 -136 -53 -187 24 43 -245 -58 -115 -38 -90 -204
-23808 -204 -157 -175 -66 2 -66 -61 -157 -137 -47 -57 -203 -130 -119 -93 -74 -205 -5 174 -143 -176 -116 -167 79 -41 -149 -61 -22 -144 -194
-23779 -194 -141 -75 -149 -103 -152 -85 -168 -192 -142 -137 -83 -90 8 -10 52 -155 -48 -85 -158 -109 -184 -210 -151 -140 -143 -108 -245 -263 -97 -46 -182 -135 -195
-23746 -195 -248 -200 -113 -118 55 37 -106 -144 -269 -129 -103 -151 13 -181 -158 -113 -170 -170 -128 21 -184 -73 -51 -192 -151 -137 -86 -52 -179
-23717 -179 -76 -269 -166 -108 -69 -78 -90 -112 -224 -55 -222 -150 -190 -159 -125 -49 -271 -265 -104 -15 -27 -131 -55 -96 -26 -129 -98 -124 -282
-23688 -282 -92 -70 -114 -153 -285 -76 -124 -80 -21 -177 -103 -247 -116 -96 -247 -78 -124 -154 -176 -169 -132 42 -124 -227 -106 -70 -141 -197
-23660 -197 -89 -202 -63 27 -163 -272 -144 -50 -31 -80 -163 -152 -180 -186 -161 1 -134 -184 -160 -160 -90 -211 -192 -242 18 -155 -182 23 -149
-23631 -149 -280 -27 -224 -318 -97 -131 -189 -174 -166 -263 -52 -120 -55 -109 -237 -74 -104 -144 -174 -195 -74 -296 6 -274 -82 -101 -154 -41
-23603 -41 -198 -66 -251 -173 -170 -215 -167 -152 -190 -32 -218 -270 -84 -48 -284 -33 -346 -35 -63 -279 68 -45 -211 -75 -6 -164 -282
-23576 -282 -174 -73 -264 -117 -99 -16 -96 0 -57 -190 -266 -46 -156 -139 -2 8 -100 -90 -103 -260 -211 -128 88 -153 -144 -89 -117 -3
-23548 -3 -83 -121 -108 -163 -73 -178 -135 -101 -169 -134 -175 -148 9 -51 -249 -269 -233 -83 -57 -47 -207 -46 18 -114 -114 -81 -186 -159 -97 -92 10
-23517 10 -189 -85 -120 -308 -286 -203 -213 -175 -151 -98 -99 17 -67 -100 -129 -175 -139 -167 -103 -276 -89 -67 -211 -191 -184 -11 -44 -54 41 -104 -119
-23486 -119 -146 -162 -83 -140 -179 -22 -84 -292 -144 -250 -29 -57 -166 -33 -148 -99 9 -34 -152 -71 -283 58 -177 -145 -10 -163
-23460 -163 -233 -206 -232 -272 -132 -190 -52 -313 -154 -165 -144 -152 -83 -213 -145 -74 -127 -162 -293 -12 -121 -115 -138 -30 -100 -80 -18 -320 -63
-23431 -63 -114 -125 -112 -258 -171 -225 -238 -200 -69 -184 -163 -190 -82 -154 -153 -54 -269 -123 -227 -141 -190 -156 28 -104 -28 -147 -279 -104 -119
-23402 -119 -53 -89 -131 -76 -288 -259 30 -95 -26 -34 -35 -121 -273 -191 -144 14 -198 -81 -236 -125 -47 -209 -170 -183 -103 -116 -163 5 -51
-23373 -51 -75 -333 -270 -94 -14 -313 -296 -222 -246 -57 -191 -37 -136 -74 -58 -158 -210 -2 -197 -15 -192 -138 -250 -176 21 -169 -222
-23346 -222 -161 -256 -282 -243 -137 -156 -173 -116 -187 -140 -206 -93 -210 -176 -317 -195 -114 -135 -154 -119 -185 -78 -120 -9 -75 -105 -115 -212 -148 -107
-23316 -107 -162 -86 -219 -205 -191 -104 -274 -197 -102 -196 -43 -168 -164 -223 -220 -235 -67 -181 -146 -147 -123 -214 -56 -205 -147 -213 -164 -124 -75 -189 -174
-23285 -174 -45 -182 -256 -280 -82 -114 -122 -192 -39 -203 -361 -28 -83 -247 -172 -131 -162 -153 11 1 -151 -229 -143 -156 -56 -226 -171 -142 -42
-23256 -42 -156 -202 -120 -227 -295 -215 -252 -66 -218 -142 -25 -116 -61 -225 -112 -99 -121 -369 -80 -76 -72 -127 -323 -268 -11 -96 -191 20 -102
-23227 -102 -104 -25 -183 -134 -246 -174 -299 -231 -146 -231 -41 -142 -79 -144 -227 -172 -78 -163 -143 -228 -95 -166 -41 -99 -157 -64 -145 -184 -157 -142 -168
-23196 -168 -102 -129 -147 -131 69 -201 -133 -187 -196 10 -35 -184 -244 -279 -53 -236 -267 -202 -187 -182 -202 -179 -367 -57 -132 -43 -73 -47 -138 -108 -197
-23165 -197 -206 -242 -137 -341 -296 -46 -154 -3 -296 -266 -410 -191 -172 -193 -158 -217 -87 -197 -229 -219 -73 -195 -167 -206 -108 -10 -196 -144
-23137 -144 1 -78 -163 -128 -263 -237 -261 -124 -193 -287 -101 -101 -165 -134 -217 -101 -152 -79 -294 -173 -120 -111 -124 -255 -40 -53 -33 -178 -63
-23108 -63 -67 -60 -226 -89 -187 -14 -27 -155 -164 -7 23 -167 -162 -44 0 -89 -155 -271 -11 -202 -81 12 -108 -7 -33 -76 -105 -135 -66 -182
-23078 -182 -68 -49 -157 -112 -56 -102 -55 -198 -86 -68 -238 -213 -99 -95 -238 -186 -306 -215 -265 -132 -162 -218 -263 -164 -118 -216 -195 -73 -113
-23049 -113 -2 -233 -215 -52 -185 -65 -30 -106 -163 -69 -192 -160 -167 -170 -231 -176 -202 -276 -170 -173 -200 -52 -134 -61 -256 -83 -231 -144 -106 -253
-23019 -253 -218 -355 -167 -98 -174 -164 -104 -207 -209 -192 -123 -183 -139 -169 -110 -189 -247 -308 65 -304 -221 -107 -174 -89 -195 -147 -49 -140 -203 -106 -211
-22988 -211 -227 -81 -114 -153 -117 -265 -1 -113 -107 -130 -146 -128 -48 -110 -145 -43 67 -97 -171 -214 -278 -187 -132 -131 -200 -199 -182 -191 -138 -330 -92
-22957 -92 -60 -148 -104 -185 -159 -95 -162 -230 -211 -241 -66 -149 -45 -120 -262 -261 -126 -87 54 -193 -192 -210 -139 -121 -128 -70 25 -71 -261 -157 -328
-22926 -328 -194 -175 -194 -86 -86 -271 -7 -208 -136 -133 -276 3 -285 -178 -117 -115 -159 -168 -143 -193 -141 -51 -198 -111 -71 -294 -111 -154 -190 -83
-22896 -83 -111 -143 -182 -227 -203 -267 -259 -207 -88 -66 -141 -272 -107 -187 -141 -225 -175 -75 -161 53 49 -160 -112 -12 -124 -75 -104 -41 -224 -116
-22866 -116 -84 -242 -241 -284 -141 -204 -266 -104 -264 -127 -83 -218 -115 -63 -81 -38 -94 -232 -153 -112 11 -116 -201 -150 -252 -128 -205 -86
-22838 -86 -90 -212 -44 50 -183 -197 -33 -113 -137 -38 -135 -235 -118 -218 -161 -171 -37 -225 -176 -29 -152 -124 -236 -172 -96 -184 -158 -140 -191
-22809 -191 -132 -119 -157 -225 -96 -121 -240 -255 -273 -103 -263 -154 -253 -259 0 -141 -209 -244 -160 -205 -101 -303 -137 -156 -187 -180 -230 61 -237
-22780 -237 -167 -158 -112 -100 -179 -204 -106 -22 -192 -84 -102 -106 -179 -342 -189 -67 -148 -120 -93 -147 -60 -35 -292 -212 -218 -270 -242 -379 -274 -214 -162
-22749 -162 -191 -213 38 55 -285 -238 -48 -206 42 29 -207 -133 -273 -307 -207 -142 -120 -328 -247 -158 -165 -210 -176 -169 -94 -99 -99 -38 -192 -123 -155
-22718 -155 -117 -140 -152 -142 -191 -198 -93 -240 -107 -202 -83 -100 -97 -22 -202 -155 -97 -26 -40 -156 -111 -42 -159 -96 -42 -173 -87 -143 -252 -102
-22688 -102 -100 -178 -285 -138 -237 -153 -123 -74 -147 -176 -218 -179 -187 -217 -175 -82 -139 -33 -247 -159 -160 -170 -238 -166 24 -163 -187 -218 -152 -134 -99 -148
-22656 -148 -67 -260 -119 -114 -25 -293 -205 -151 -127 -76 -114 -122 -54 -135 -285 -126 -101 -125 -153 -151 -191 -220 -195 -182 -145 -100 -123 -37 -82 -284 -91 -234
-22624 -234 -148 -95 -166 -118 -237 -35 -130 -133 -124 -326 -235 -148 -253 -83 -294 -92 -163 -190 -201 -141 -184 -79 -319 -151 -54 -233 -114 -138 -251
-22595 -251 -290 13 -148 -52 -120 -68 -109 -58 -118 -113 -50 -191 -181 -205 -154 -221 -278 -156 -37 -179 -204 -48 -199 -106 -202 -319 -214 -180 -93
-22566 -93 12 -179 -133 -274 -154 -152 -185 -172 -238 -150 -216 -271 -133 -186 -149 -225 -220 -81 -132 -57 -262 -250 -128 -124 -284 -254 -134 -152 -272 -42
-22536 -42 -155 -140 -112 -77 -245 -71 -125 -97 -53 -149 -130 -152 -250 -130 -240 -357 -226 -189 -217 -151 -5 -182 -176 -91 -359 -318 32 -133 -152
-22507 -152 -65 -158 -309 -15 -331 -142 -393 -130 -131 -166 -238 52 -102 -234 -1 -267 1 -232 -37 -125 -80 -130 29 -128 -250 -246
-22481 -246 -221 -67 -147 -93 -48 -67 -119 -38 -107 -96 -62 -107 -54 -197 36 0 -154 -198 -130 -289 -200 -158 -141 -156 -201 -168 -250 -154 -205 -261 -296
-22450 -296 -228 -126 -244 -138 19 -101 -142 -282 -117 -241 -106 -132 -101 -183 -229 -53 -125 -105 -196 -304 -198 -195 -198 -211 -207 -190 -153 -241 -245 -127
-22420 -127 -113 -258 -220 -40 -262 -205 -131 -101 -196 -143 -130 -118 -79 -154 -128 -22 -340 -159 -200 -237 -99 -110 -85 -221 -193 -317 -94 -117 -202
-22391 -202 -159 -212 -245 16 -106 -43 -105 -65 -70 -252 -245 -270 -60 -204 -225 -294 -278 -175 -144 -144 37 -142 -194 -153 -224 -175 -227 -193 -133 -103 -125
-22360 -125 -39 -62 -122 -167 -182 -113 -135 -91 -202 -209 -206 -139 2 -185 12 -135 -115 -105 -178 -136 -57 -230 -194 -179 -355 -22 -137 7 -121
-22331 -121 -132 -111 -352 -201 -80 -237 -252 -180 -142 -101 -130 -115 -257 -65 -172 -120 -149 -167 -148 -155 -222 -199 25 -122 -204 -147 -91 -195 -71
-22302 -71 -108 -102 -109 24 -185 -247 -199 -63 -280 -330 -123 -296 -188 -84 -144 -231 -192 -123 -134 -96 -85 -159 -45 -152 -122 -77 -224 -170 -105 -260
-22272 -260 -29 -161 -141 -30 -68 -133 -173 -202 -71 -136 -54 -252 -166 -75 -261 -85 -256 -196 -264 -169 -84 -69 -193 -112 -102 -178 -130 -117 -145
-22243 -145 -184 -179 -218 -260 -165 -315 -138 -61 -39 -132 -104 -165 -101 -169 -356 -211 -101 -126 -39 -197 -128 55 -355 -80 -246 -49 -153 -183
-22215 -183 -127 -196 -147 -210 -162 -156 -122 -72 -159 -118 -124 -72 -6 -116 -119 -179 -195 -189 -20 -84 -105 -288 -193 -58 -3 -102 -159 -303 -357 -180 -121 -10
-22183 -10 55 12 -199 -46 -246 -89 -91 -162 -171 -284 -115 -377 -207 -145 -264 -98 -81 -165 -107 -184 -258 -114 -59 -111 -147 -285 -160 -198 -171
-22154 -171 -106 -242 -217 -54 -26 -92 -157 -32 -246 -82 -79 -245 -66 -223 -62 -138 -39 -88 -95 -192 -212 -172 -239 -230 -130 -206 -178 -231 -129 -63
-22124 -63 -240 -75 -130 -261 -167 -196 -224 -53 -74 -272 -252 -95 -56 -119 -127 -158 -225 -42 -105 -182 -206 -172 -187 -123 -152 -59 -155 -149 -100 -187 -217 -199
-22092 -199 -137 -211 -67 -155 -94 -325 -190 -49 -85 -61 -216 -71 -199 -43 -179 -99 -100 -158 -190 -71 -231 -308 -79 -163 -110 -171 -89 -161
-22064 -161 -3 -272 -244 -115 -149 -217 -145 48 -333 -205 -114 -271 -145 -286 -164 -210 -171 -49 -173 -124 -116 -249 -200 -182 -195 -154 -146 -120
-22036 -120 -230 -246 -95 -107 -81 -240 -213 -24 23 -63 -79 -194 -159 -22 -253 -63 -177 -149 -239 -147 -327 -54 -182 -168 -47 -100 -128
-22009 -128 -104 -88 -183 -62 -178 -219 -133 81 -192 -67 -5 -111 -180 -181 -158 -40 -210 -165 -166 -141 -146 -163 -235 -117 -211 -131 -312 -160 -130 -333
-21979 -333 -55 -103 -24 -184 -162 -83 -148 -242 -184 -258 -63 -77 -147 -176 -94 -59 -140 -157 -94 -33 -68 -179 49 -150 -67 -42 -139 -232 -267 -17
-21949 -17 -326 -114 -214 -170 -109 -210 -206 -259 -195 -285 -203 -204 -273 -149 -75 -199 -227 -18 -67 -154 -159 -99 -84 -197 -181 -193 -181 -103 -229 -232 -29
-21918 -29 -135 -254 -100 -63 -42 -234 -193 -217 -179 -65 -74 -120 -273 -42 -208 -169 -16 -178 -179 -299 -213 -159 -257 -147 -314 -201 -275 -256
-21890 -256 -212 -252 -103 -154 -222 -263 -87 -210 -108 -153 -145 -122 -341 -280 -235 -91 -121 -73 -116 -102 -211 67 136 -268 90 -254 -176 -200 -280
-21861 -280 -268 -157 -60 -265 -7 -286 -198 -283 -145 -116 -214 -220 -231 -259 -84 -152 -348 -299 -148 -118 -227 -47 -242 -214 -260 -158 -137 -57
-21833 -57 -19 -73 -276 -106 -157 -282 -214 -190 -111 -177 -174 -69 -3 -189 -22 -72 -125 -25 -180 -140 -123 -187 -19 -99 -98 -166 -120 -216 -150 -163 -128
-21802 -128 -150 -213 -191 -84 -42 -137 -43 -10 -41 -166 -114 -250 -242 -301 -150 -235 -147 -180 -126 -145 -284 -174 -151 -93 -81 -171 -245 -124 10 -107
-21772 -107 -188 -40 -155 -112 -337 -216 -96 -67 -192 -238 -280 -126 -168 -53 0 -229 -85 -203 -105 -26 -125 -159 -73 -205 -111 -7 -197
-21745 -197 -215 22 -27 8 -264 -224 -107 -122 -237 -219 -91 -236 -101 -230 -236 -215 -225 -167 -244 -50 -258 -167 -130 -274 -40 -285 -312 -207
-21717 -207 -341 -353 -159 -165 -202 -76 2 -146 -102 -206 -117 -145 -99 -192 -204 -183 -46 -194 -263 -93 -227 -147 -226 -201 -174 -127 -46 -56 -26 -208
-21687 -208 -166 57 -63 -149 -205 -78 -134 -109 -261 -203 -102 -7 -155 -125 -182 -93 -146 -149 -87 -189 -143 -246 -202 -43 -167 -122 -142 -255 -186
-21658 -186 -162 -212 -160 2 -235 -2 -266 -107 -111 -158 11 -154 -171 -152 -128 -225 -387 -113 -289 -289 -181 -159 -11 30 -117 -9 -258
-21631 -258 -250 28 -323 45 -166 -43 -54 0 -166 -120 -158 -309 -132 -278 -122 -156 -95 -151 -130 -152 -261 -208 -155 -62 -63 -47 -175 -236 -219
-21602 -219 -207 -197 -249 -268 -273 -203 -226 -122 -136 -212 -229 -282 -113 -206 -159 -83 -259 -246 -195 -154 -110 -135 -145 -67 -58 -139 -199 9 -237 -153 -164 -212
-21570 -212 31 -174 -47 -207 -212 -187 -280 -126 -123 -183 29 -105 -187 -156 -196 -347 -343 -144 -175 -36 -172 -111 -154 -246 -204 -181 -159 -60 -241
-21541 -241 -235 -306 -241 -318 -124 -183 -270 -210 -290 -149 -248 -231 -228 -175 7 11 -196 19 -302 -193 -270 -76 -138 -129 -125 -137 -157 -313 -126 -353 -293
-21510 -293 -164 -143 -224 -195 -130 -101 -122 -106 -86 -261 -161 -165 -243 -128 -242 -120 -238 -33 -149 -120 -106 -301 -193 -357 -205 -182 -49
-21483 -49 -144 19 -85 -199 -195 -239 34 -263 -133 -130 -214 -227 -54 -346 -137 -136 -279 -323 -279 -118 -137 -55 -155 -243 -277 -86 -113 -124 -168
-21454 -168 -134 -226 -192 -191 -127 -178 -46 -135 -210 -142 -73 -281 -154 -158 -170 -207 -216 -149 -89 -113 -247 -252 -208 -66 -93 -164 -137 -60 -239 -183 -138 -67 -89
-21421 -89 -159 -281 -360 -204 -254 -190 -56 -234 -166 -299 -147 -214 -103 -123 -193 -110 -353 -194 -263 -274 -155 -98 -224 -336 -96 -126 -86 -87
-21393 -87 -91 -143 -182 -206 -95 -67 -204 -170 -206 -141 -121 -136 -112 -181 -151 -181 -111 -133 -77 -195 -229 -155 -254 -85 -156 -70 -345 -233 -71 -18 -122
-21362 -122 -30 -228 -212 9 -11 -204 -210 -227 -90 -134 -194 -100 -253 -198 -189 -217 -282 -82 -55 -156 -204 -134 -237 -45 -132 -189 -300 -171 -123
-21333 -123 -188 -160 -179 -184 -193 -233 -226 -240 -105 -324 -125 -199 -333 44 -235 -220 -135 -180 -110 -166 -52 -53 -151 -179 -183 -74 -204 -62 -132 -112 -173
-21302 -173 -180 -288 -290 -200 -186 -111 -75 -322 -293 -52 -128 -297 -193 -146 -240 -121 -357 -178 -210 -184 -84 -255 -187 -209 -209 -385 -153 -126 -128 29
-21272 29 -159 -96 -178 -395 -204 -177 -188 -171 -74 71 -36 -201 -173 -67 -152 -76 -191 -183 -98 -196 -125 -39 -293 -104 20 -149 -203 -83
-21244 -83 -200 -203 -162 -177 -287 -233 -163 -337 -172 -200 -211 -161 -212 -278 -204 -146 -200 -254 -225 -341 -147 -79 -150 -96 -200 -154 -303 -121 -120 -52 -75
-21213 -75 -309 -22 -278 98 -65 -313 -70 -327 -299 -168 26 -271 -101 -198 -241 -162 -225 -169 -380 -174 -128 -145 -159 -155 -276 -46 -227
-21186 -227 -169 -245 -189 -99 -184 -244 -204 -210 -215 -52 -237 -127 -191 -113 -223 -50 -146 -231 -249 -59 -68 -81 -111 -149 -194 -110 -189 -336 -92 -226 -154
-21155 -154 -117 -73 -135 -87 -127 -232 -161 -339 -54 -172 -192 18 -183 -86 -160 -150 -92 -154 -141 -233 -273 -204 -233 -252 -130 -289 -185 -45 -227
-21126 -227 -203 -403 -214 -108 -40 -169 -127 -61 -144 -233 -179 -194 -90 -229 -209 -40 -116 -233 -42 -100 -154 -103 -113 -77 -134 -48 -259 -42
-21098 -42 -175 -51 -177 -159 -69 -134 -176 -111 -178 -56 -106 -225 -155 -154 -207 -141 -8 -68 -63 -166 -203 -151 -179 -130 -191 -181 -134 -40 15 -43 -53 -191
-21066 -191 -122 -201 -105 -156 -106 -105 -128 -85 -182 -317 -116 -123 -82 -107 -248 -133 -142 -103 -205 -289 -67 -225 -160 -33 -122 -42 -288 -254 -181 -183 -180 -59
-21034 -59 -207 -237 -181 -188 -56 -217 -42 -98 -120 -294 -212 -343 -146 -63 -165 6 -296 -166 -208 -136 -171 -27 -121 -105 -224 -85 -148 -121
-21006 -121 -167 -302 -329 -283 -159 -331 -208 -59 -240 -259 -141 -153 -92 -111 -5 -224 -316 -65 -73 -284 -212 -210 -323 -184 -136 -284 -211 -217
-20978 -217 -165 -208 -201 -191 -139 -272 -54 -260 -135 -184 -273 -222 -169 -265 -214 -57 -301 -211 -216 -169 -191 -82 -176 -93 -315 -55 -184 -106 -48 -174
-20948 -174 -102 -285 -234 -164 -82 -90 -203 -128 -252 -144 -29 -101 -240 -16 -92 -191 -104 -189 -50 -174 -197 -197 -176 -239 26 -246 -144 -163 -184
-20919 -184 -170 97 -194 -254 -41 -120 63 -213 -108 -284 -257 -3 -166 -194 -163 -258 -51 -209 -166 -94 -151 -141 -124 -148 -221 -144 -161 -270
-20891 -270 -95 -132 -255 -69 -130 -96 -74 -212 -122 -225 -127 -133 -212 -58 -200 -26 49 -133 -171 -204 -88 -34 -77 -77 -161 -63 -203 -264 -42
-20862 -42 -55 -295 -226 -104 -129 -111 -136 -105 -104 -25 -110 -194 -5 -246 -224 -33 -26 -85 -176 -220 -115 -169 -69 -151 -258 -98 -203 4 -5 -166
-20832 -166 -241 -215 -202 -184 -230 -93 -306 -152 -191 -106 -85 -97 -42 -160 -232 -255 -224 -168 -112 -283 -232 -176 -112 -162 -128 -207 -103 -303 -258 -188
-20802 -188 -38 -161 -345 -152 -241 -181 -196 -331 -315 -340 21 -289 -200 -299 -319 103 -266 -106 -114 -247 -216 -201 -64 -231 -304 34 -111
-20775 -111 -202 -295 -57 -56 -230 -201 -95 -165 -69 -147 -233 -73 -205 -271 -143 -96 -125 -112 -284 -175 -13 -262 -149 62 -78 -157 -257
-20748 -257 -238 -196 -129 -262 -124 -223 -66 93 -199 -99 -207 -198 -111 -257 -137 47 -86 -153 -56 -95 -115 -177 -129 -122 -256 -194 -218 -161 -48
-20719 -48 -299 -189 -77 -56 -164 -185 -137 -228 -172 -192 -196 -192 -227 -247 -64 -37 -220 -234 -25 -218 -388 -39 -46 -259 -49 -37 -164 -77 -172
-20690 -172 -300 -145 -96 -249 -201 -125 -177 4 -197 -190 -166 -122 -295 -124 -161 -191 -201 -276 -72 -201 -103 -236 -99 -242 -101 -217 -100
-20663 -100 -263 -270 -246 -136 -74 -53 -15 -163 -121 -156 -7 -269 -139 -148 -45 -156 -158 6 11 -119 -260 -114 -52 -144 -164 -166 -93 -18 -175 -106
-20633 -106 -106 -261 -123 -131 -129 -213 -142 -203 -41 -90 -234 -95 -238 -43 -161 -168 -203 -103 -254 -243 -122 -253 -204 -192 -288 -164 -18 -49 -122
-20604 -122 -109 -137 -199 -170 -17 21 -96 -144 -42 -118 -188 -49 -248 -177 -202 -92 -85 19 -95 -134 -229 -97 -94 -248 -18 -139 -153 -208 -66
-20575 -66 -67 -158 -131 -174 -41 -132 -47 -169 -248 -144 -283 -149 -303 -131 -152 -235 -172 -98 -196 -142 -48 -156 -153 -120 -40 -146 -153 -173 -231 -162 -237
-20544 -237 -140 -116 -315 -190 -48 -262 -239 -154 -250 -276 -107 -197 -209 -192 -303 -66 -175 -205 -130 1 -246 -181 -163 -105 -202 -225 -285 -270 -103
-20515 -103 -234 -118 -166 -170 -295 -168 -5 -232 -130 -118 -139 -143 -269 -107 -54 20 -304 -82 -197 -160 -29 -212 -98 -234 -63 -219
-20489 -219 -270 -101 -83 -154 -132 -232 -305 -93 -147 -112 -6 -262 -227 -244 -389 -149 -204 -293 -302 220 414 -82 -267 -331 -54 -202 -150 -158
-20461 -158 -178 31 -234 -56 -139 -267 -168 -93 -38 -97 -287 -170 -80 -39 -112 -154 -96 -14 -154 -175 -13 -136 -62 -219 -79 -123 -217 -255
-20433 -255 -91 -144 -77 -240 -241 -133 -60 -313 -375 -124 -213 -229 -23 -94 -86 -68 -314 -20 -219 -243 -202 -175 -219 -235 -264 -237 -188 5 -218
-20404 -218 -275 -211 -93 -191 -234 -214 -141 38 -179 -188 -77 -226 -156 -210 -147 -69 -223 -81 -142 -23 -191 -285 -221 -312 -188 -73 -169 -208 -200
-20375 -200 -197 -263 -190 -184 -87 -319 -211 -259 -214 -84 -115 -212 -143 -169 -366 -216 -127 -179 -115 -162 -96 -97 -274 -69 -235 -49 -103 -130 -213 -260 -164
-20344 -164 -345 -279 -176 -133 -168 -139 -121 -263 -150 -123 -208 -210 -185 -44 -168 -127 -100 -123 -26 -184 -166 -245 -205 -268 -166 -186 8 -167 -270
-20315 -270 -76 -158 -80 -315 -178 -15 -169 -133 -111 -140 -217 -146 -153 -131 -239 -291 -187 -263 -110 -270 -138 -364 -137 -236 -120 -55 -64 -137
-20287 -137 -242 -259 -179 -163 -257 -131 -265 -199 -242 -36 -343 -254 -60 -246 -62 -94 -254 -183 -89 -153 -285 -83 -139 -145 -172 -175 -267 -103 -227
-20258 -227 -240 -93 -64 -133 -314 -120 -215 -143 -107 -293 -60 40 -90 -145 -167 -213 -202 -163 -163 -124 -183 -233 -200 -95 -13 3 -161 -134 -166 -210
-20228 -210 -133 -230 -209 -17 -249 -272 -81 -198 -245 -273 -160 -153 -307 -56 -153 -196 -277 -128 -73 -280 -95 -85 -203 -109 -107 -186 -201 -71 -173
-20199 -173 -178 -101 -175 -129 -65 -198 -208 -73 -102 -115 -241 -83 -149 -236 -212 -231 -160 -36 -378 -50 -132 -251 -258 -209 -215 -167 -175 -247 -256 -127 -201 -126
-20167 -126 -101 -229 27 -307 -111 -186 -97 -197 -71 -275 -189 -71 -49 0 -26 -58 -191 -208 -258 -234 -369 -232 -117 -132 -214 -335 -186
-20140 -186 -198 -291 -117 -209 -98 -166 -172 -219 -159 -132 -94 -85 -147 -133 9 -158 -137 13 -276 -244 -97 -148 -264 -174 -198 -130 -226 -137 -88 -48 -187
-20109 -187 -215 -166 -155 -234 -167 -101 -311 -81 -122 -175 -169 -157 -122 -140 -208 -172 -224 -124 -237 -166 -108 -182 -61 -210 -328 -160 -353 -116 -115 -257
-20079 -257 -157 -160 -33 -124 -243 -185 -5 -220 -74 -255 -172 -119 -137 -125 -181 -220 -221 -296 -171 -51 -145 -226 -288 -214 -105 -134 -305 -277 -144
-20050 -144 -251 -209 -110 -217 -262 -75 -100 -250 -69 -232 -73 -237 -232 -67 -140 -93 -193 -246 -66 -248 -112 -77 -115 -228 -287 -272 -257
-20023 -257 -79 -196 -138 -196 -180 -171 -34 -314 -170 -43 -161 -97 -232 -146 -167 -129 -224 -138 -249 -188 -85 -316 -219 -262 -86 -124 -311 -281
-19995 -281 -219 -178 1 -112 -243 -205 -117 -126 -191 -231 -256 -219 -90 -128 -99 -28 -322 -117 -238 -101 -218 -208 -64 -193 -205 -382 -131 -302
-19967 -302 -85 -11 -112 -162 -89 -120 -296 -178 -137 -108 -169 -120 -223 -211 -116 -290 -293 -157 -155 -72 -168 -55 -243 -88 -22 -217 -151 -141 -222
-19938 -222 18 -40 -260 -203 -246 -59 -183 -132 -37 -349 -287 -72 -135 -189 -237 -173 -194 -84 -107 -222 -279 -234 -54 -70 -111 -196 -137 -131 -281
-19909 -281 -4 -351 -55 -84 -223 -156 -234 -188 -65 12 -70 -144 -333 -76 -195 -140 -123 -50 -156 -253 -213 -114 -147 -249 -296 -265 -242 -297 -225
-19880 -225 -75 -219 -90 -235 -57 -229 -396 -239 -168 8 -220 -61 -380 -242 -224 -202 -136 -255 -213 -237 -233 -382 -153 -150 -76 -209
-19854 -209 -247 -160 -331 -54 -128 -258 -92 -146 -269 -80 -237 -169 -220 -201 -190 -167 -135 -321 -177 -12 7 -211 -120 45 -185 -237 -176
-19827 -176 -207 -90 -117 -203 -198 -130 -139 -335 -268 -179 -136 -93 -266 -62 -176 -160 -167 -257 -131 -252 -349 -249 -124 -166 -134 -205 -285 -252 -95 -73
-19797 -73 -92 -297 -286 11 -206 -176 -137 -198 -223 -191 -255 -105 -147 -179 -160 -236 -110 -117 -104 -105 -201 -111 -177 -178 -187 -109 -129 -99 -15 -379 -201 -104 -40
-19764 -40 -258 -191 -99 -121 -92 -41 -170 -95 -145 -71 -205 -310 -289 -100 -180 -136 -214 -268 -164 -352 -165 -113 -214 -258 -96 -266 -24 -45
-19736 -45 -76 -305 -73 -251 -100 -97 -200 -171 -180 -109 -313 -76 -178 -295 -112 -232 -188 -83 -159 -162 -257 -126 -200 -150 -138 -140 -123 -220 -201 -112
-19706 -112 -149 -197 -139 -293 -358 -187 -220 -165 -61 -225 -165 -180 -283 -133 -120 -80 -114 -176 -231 -244 -263 -270 -324 -98 -147 -267 -239 -14 -168
-19677 -168 -14 -122 -327 -350 -184 -106 -152 -104 -238 -326 -212 -142 -265 -59 -155 -105 -151 -214 -205 -118 -187 -162 -29 -64 -383 -43 -141 -85 -221
-19648 -221 22 -235 -215 -71 -234 -11 -225 -165 -241 -201 -172 -97 -68 -27 -50 -108 -211 -220 -239 -73 -138 -111 -179 -60 -181 -190 -264 -197 -193 -213
-19618 -213 -228 -217 -110 -153 -79 -127 -195 -337 -261 -139 -204 -299 -235 -84 -188 -222 -97 -112 -180 -186 -151 -152 -164 -188 -209 -111 -213 -198 -160 -247 -242 -202
-19586 -202 -218 -199 -107 -132 -115 -19 -143 -244 -45 -279 -156 -135 -154 -226 -49 -155 -147 -107 -158 -167 -189 -316 -242 -135 -271 -279 -118 -76 -219
-19557 -219 -120 -20 -183 -174 -204 -413 -237 -172 -48 -120 -196 -82 -210 -256 -243 -198 -174 -156 16 -246 -15 -234 -68 -265 -62 -150 -133
-19530 -133 -286 -276 -91 -242 -15 -145 -138 -291 -222 -174 -108 -300 -188 -219 -197 -265 -238 -207 -115 -216 -127 -104 -111 -193 -253 2 -83 -189 -140
-19501 -140 -189 -117 -240 -242 -251 -191 -288 -278 -202 -134 -104 -144 -93 -236 -172 -94 -150 -134 -231 -263 -211 -99 -65 -53 -113 -332 -66 -139 -168 -96 -124 4
-19469 4 -67 -268 -38 -227 -52 -99 -137 -328 -291 -91 -247 -187 -257 -187 -171 -143 -5 -229 -263 -207 -210 -136 -237 -188 -193 -260 -100 -190 -245 -22
-19439 -22 -250 -143 -193 -84 -176 39 -102 -265 -187 -182 -156 -166 -122 -249 -198 -244 -159 -286 -272 -181 -113 -272 -134 -204 -193 -114 -188 97 -264
-19410 -264 -98 -243 -170 -238 8 -135 -236 94 -293 -51 -87 -138 -240 -359 -201 -25 -147 -215 -278 -148 -105 18 -362 -185 -71
-19385 -71 -271 -141 -112 -199 66 -147 -231 -18 -231 -167 27 -93 -269 -179 -216 -155 -211 -161 -281 -191 -213 -21 -213 -170 -101 -334 -264 -40
-19357 -40 -207 -217 -146 -116 -71 -116 -134 -236 -38 -102 -115 -138 -199 -233 -211 -262 -281 -211 -32 -124 -31 -145 -153 8 -135 -47 -188 -87 29 -138
-19327 -138 -152 -122 -214 -49 -315 -95 75 -155 -138 -189 -149 -150 -82 -132 -97 -178 17 -6 -67 -108 -330 -226 52 -227 -180 -41 -124 -116 -105
-19298 -105 -69 -106 -206 -66 76 2 -13 11 -164 -93 85 -256 -93 -146 -57 -263 -223 -75 -96 -131 -133 -127 -83 -141 -262 -22 -101 -53 -169
-19269 -169 -189 -122 -187 -173 -97 -261 -152 -31 -145 -144 -123 -217 -211 -162 -129 -96 -245 -234 -169 -3 -112 -252 -250 -299 -130 -116 -62 -82 -177 -194 -202
-19238 -202 -46 -72 -213 -179 -120 -213 -182 -64 -169 -117 -168 -172 44 -100 -55 -186 -222 -190 -73 -86 -206 -140 -151 -136 -213 -8 -145 8
-19210 8 -49 -144 -161 -124 -122 -375 -238 -222 -129 -227 -214 -182 -107 -179 -188 -152 -209 -12 -203 -47 -206 -225 -89 -388 -124 -171 -173 -155 -264 -169 -239
-19179 -239 -206 -197 -121 -113 -274 -210 -135 -195 -250 -234 -169 -162 -199 -242 -300 -287 -351 -274 -120 -206 -207 -118 -249 -58 -195 -124 -67 -254 -317 -209 -175 -286
-19147 -286 -193 -291 -83 -295 -188 -142 -207 -82 43 -89 -175 -266 -285 -114 -185 -191 -132 -171 -216 -175 -289 -305 -99 -96 -191 -134 -223 -150 -196 -40
-19117 -40 -165 -99 -111 -239 -123 -93 -16 -220 34 -26 -248 -18 -156 -219 -59 -269 -335 -263 -201 -103 -173 -7 -199 -64 -84 -125 -136 -170
-19089 -170 -82 -229 -96 -196 -17 -185 -103 -200 -257 -203 -331 -202 -246 -171 -80 13 -151 -186 -210 -205 -215 -297 -116 -113 -180 -252 -140 -127 -190 -165
-19059 -165 -170 -228 -326 -269 -261 -141 -51 -84 -211 -250 -192 -198 -170 -117 -302 -192 -177 -235 -30 -126 -174 -189 -89 -30 -191 -113 -297 -285 56 -159
-19029 -159 -247 -114 -51 -195 -184 -96 -157 -123 -266 -192 -171 -278 -192 -210 -176 -155 -273 -237 -249 -84 -140 -101 -223 -372 -142 -210 -133 -183 -148
-19000 -148 -231 -152 -93 -94 -172 -102 -151 -153 -148 -154 -247 -146 -144 -237 -152 -209 -34 -115 -68 -246 -51 -98 -179 -231 -202 -296 -240 -220 -244 -317 -234 -93 -238
-18967 -238 -68 -166 -151 -136 -88 -248 -167 -118 -8 -102 -231 -112 -114 -198 -220 -53 -192 -239 -321 -277 -173 -155 -61 -112 -123 -172 -257 -55 -98 -117
-18937 -117 -173 -373 -93 -163 -131 -198 -276 -165 -130 -154 -259 -265 -112 -248 -144 -165 -238 -111 -119 -109 -231 -82 -79 -114 -200 -144 -171 -67 -215
-18908 -215 -187 -181 -254 -181 -145 -172 -123 -149 -134 -215 -8 -334 -424 -36 -309 -134 -286 -133 -155 -180 -181 -232 -115 -121 -174 -96 -71 -116 -151 -280 -89
-18877 -89 -147 -100 -145 -282 -157 -275 -77 -198 -43 -160 -150 -107 -249 -177 -111 -257 -288 -176 -137 -63 -203 -91 -405 -126 -168 -157 -212
-18850 -212 -71 -177 -93 -190 -229 5 -223 -124 -186 -136 -161 -168 -236 -52 -96 -124 -84 -69 -144 -77 -217 -222 -102 -143 -142 -208 -296 -174 -167 -205 -200 -201 -155
-18817 -155 -138 -258 -352 -79 -260 -189 -203 -198 -231 -369 -75 -114 -314 -238 -296 -158 -104 -286 -398 -191 -120 -223 -122 -195 -163 -294 -340 -183
-18789 -183 -107 -335 -131 -121 -85 -129 -149 -111 -232 -185 -137 -238 -221 -175 -249 -149 -166 -114 -423 -78 -301 -227 -162 -247 -46 -139 -220 -191 -79
-18760 -79 -190 -230 -236 -108 -239 -109 -152 -140 -136 -146 -113 -15 -166 -26 -153 -255 -183 -220 -290 -357 -327 -179 -57 -245 -105 -222 -136 -277
-18732 -277 -250 -294 -200 -207 -250 -182 -84 -201 -110 -112 -340 -188 -209 -220 -230 -33 -185 -141 -316 -203 -88 -185 -255 -240 -70 -115 -253 -163 -141 -95
-18702 -95 -129 -215 14 -101 -120 -200 -87 -107 -195 -245 -247 -218 -57 -166 -251 -42 -156 -82 -204 -236 -394 -81 -200 -309 -176 -373 -267
-18675 -267 -311 -78 -87 -132 -156 -69 -187 28 -241 -233 -89 -350 -48 -166 -182 -110 -122 -235 -138 -179 -185 -146 -51 -87 -365 -228 -137 -179 -458
-18646 -458 -241 86 -161 -198 -234 -234 -145 -237 -171 -187 -161 -22 -168 -95 -134 -145 -191 -198 -162 9 -174 -348 -52 -64 -202 -218 -45 -40 -84 -251
-18616 -251 -186 -151 -160 -165 -145 -111 -259 -59 -210 -178 -89 -236 -249 -253 -198 -156 -64 -153 -106 -198 -99 -130 -3 -246 -266 -103 -171 -185 -228 -173 -254 -66
-18584 -66 -138 -241 -175 -214 -312 -67 -156 -70 -246 -162 -106 -309 -48 -229 -163 -152 -323 -234 -228 -180 -247 -148 -135 -282 -305 -299 -126 -188 -65 -228
-18554 -228 -162 -211 -306 -185 -222 -165 -273 -126 -212 -232 -188 -128 -250 -108 -158 -204 -193 -276 -171 -241 -145 -300 -222 -110 -75 -127 -40 -192 -200 0
-18524 0 -329 -279 -128 -172 -161 -185 -295 -271 -41 -206 -142 -180 -266 -140 -78 -101 -143 -92 -165 -263 -247 -181 -259 -124 -199 -218 -270 -205 -190 -152 -120
-18493 -120 -168 -233 -251 -220 -177 -170 -199 -133 -241 -192 -160 -62 -88 -43 -310 -232 -133 -320 -223 -89 -197 -129 -184 -289 -160 -149 -197 -217 -112 -215
-18463 -215 -144 -155 -159 -315 -156 -255 -188 -251 -87 -157 -183 -144 -179 -104 -234 -177 -250 -103 -316 -82 -89 -137 -175 -253 -229 -266 -233 -164 -169 -123 -67 -140
-18431 -140 -201 -146 -80 -50 -53 -226 -377 -166 -202 -147 -204 -283 -204 -151 -105 -152 -123 -203 -263 -315 -87 -131 -128 -241 -206 -65 -250 -112 -215 -264
-18401 -264 -129 -176 -186 -213 -167 -189 -322 -264 -203 -247 -127 -301 -144 -193 -225 -251 -125 -198 -204 -330 -166 -111 -165 -96 -163 -250 -221 -46 -395
-18372 -395 -277 -267 -13 -167 -242 -233 -122 -176 -241 -161 -229 -153 -154 -147 -155 -284 -83 -100 -176 -290 -134 -263 -138 -94 -161 -152 -236 -207 -205 -98 -181
-18341 -181 -302 -327 28 -289 -158 -125 -114 -241 -83 -137 -243 -148 -201 -274 -279 -104 -100 -77 -188 -198 -199 -107 -208 -195 -296 -328 -85 -280 -168
-18312 -168 -277 -330 -164 -105 -248 -133 -207 -180 -160 -287 -132 -100 -271 -260 -168 -334 -101 -234 -17 -163 -61 -265 -130 -86 -284 -184
-18286 -184 -271 -141 -172 -157 -67 -146 -223 -208 -112 -185 -209 -319 -197 -85 -298 -146 -180 -207 -178 -222 -254 -299 -245 -19 -199 -194 -209 -138 -352 -100
-18256 -100 -189 -155 -124 -205 -242 -159 -88 -250 -115 -260 7 -106 -166 -134 -172 -94 -178 -264 -286 -344 -158 -149 -276 -202 -171 -240 -252 -158 -191 -192 -186 -241
-18224 -241 -162 -164 -107 -331 -24 -102 -250 -244 -298 -92 -377 -315 -232 -64 -87 -272 -203 -259 -350 -143 -234 -180 -223 -351 -169 -230 -241 -109 -263
-18195 -263 -307 -218 -111 -114 -166 -196 -168 -138 -282 -141 -232 -10 -72 -172 -182 -61 -150 -194 -241 -289 -76 -361 -195 -235 -205 -167 -218 -241 -165 -267
-18165 -267 -212 -144 -229 -98 -125 -80 -170 -205 -108 -222 -173 -146 -195 -151 -108 -282 -207 -100 -223 -143 -44 -99 -330 -259 -312 -44 -185 -29 -234
-18136 -234 -173 -35 -372 -174 -153 6 -183 -162 -373 -238 -146 -124 -97 -154 -233 -243 -73 -163 -197 -241 -9 -169 -354 -87 -34 -213 -175
-18109 -175 -65 -139 -162 -68 -166 -254 -100 -50 -66 -271 -177 -215 -276 -121 -92 -146 -109 -77 -136 -211 -351 -221 -182 -47 -201 -222 -240 -114 -131
-18080 -131 -129 0 -179 -105 -160 -209 -31 -251 -139 -133 -252 -122 -228 -220 -246 -227 -36 4 -101 -181 -302 -178 -249 -114 -169 -74 -178 -215
-18052 -215 -106 -197 -153 -196 -275 -57 -191 -140 -279 -139 -46 -179 -138 -299 -15 -239 -199 -131 -126 -126 -161 -202 -180 -177 -165 -165 -266 -238 -128 -316
-18022 -316 -121 5 -98 -150 -265 -178 -198 -383 -152 -211 -118 61 -191 -201 -76 -233 -300 -39 11 -167 -107 -308 -224 -140 -140 -31 -293
-17995 -293 33 -46 -191 -127 -30 -179 -19 -15 -201 -242 -185 -82 -213 -316 -240 -164 -188 -81 -18 -197 -118 -208 -134 -91 -108 -260 -61 -41
-17967 -41 -198 -193 -145 -253 -186 -164 -301 -141 -263 -82 -274 -224 -25 -13 -314 -137 -236 -132 -357 -131 -196 -68 -123 -262 -42 -229
-17941 -229 -49 -271 -133 -284 -232 -67 -208 -349 -249 -104 -121 -103 -217 -235 -46 -142 -147 -125 -108 -76 -313 -293 -179 -198 -35 -211 -34
-17914 -34 -189 -187 -175 -229 -237 -185 -107 -132 -249 -200 -29 -162 -66 -176 -116 -254 -161 -232 -307 -162 -315 -426 -270 -128 -167 -209 -167 -117 -141 -26
-17884 -26 -285 -172 -160 -67 -150 -288 -198 -227 -230 -118 -217 -175 -77 -149 -49 -435 -188 -255 -96 -206 -108 -113 -228 -239 -190 -133 -165 -289 -235 -121
-17854 -121 -295 -240 -210 -82 -141 -100 -352 -363 -194 -198 -159 -203 -389 -335 -158 -221 -245 -210 -214 -107 -357 -300 -194 -90 -201 -147 -220 -154 -254
-17825 -254 -273 58 77 -140 -203 -165 -233 -219 -262 -217 -123 -171 -223 -179 -111 -99 -216 -233 -30 -115 -265 -202 -346 -120 -183 -109 -290 -205 -146 -215
-17795 -215 -256 -60 -135 -168 -77 -113 -259 -314 -171 -70 -109 -264 -159 -225 -141 -182 -178 -217 -306 -239 -150 -210 -103 -175 -257 -232 -222 -153 -219 -133 -163
-17764 -163 -296 -155 -153 -124 -215 -263 -212 -302 -246 -208 -336 -189 -290 -218 -263 -56 -209 -261 -221 -316 -185 -292 -92 -226 -188 -125 -161 -178 -192
-17735 -192 -189 -98 -266 -87 -226 -147 -211 -178 -98 -292 -261 -284 -60 -152 -94 -218 -106 -253 -223 -153 -92 -11 -280 -69 -219 -285 -136 -132 -254
-17706 -254 -229 -140 -103 -151 -149 -93 -173 -276 -254 -92 -165 -160 -82 -91 -132 -196 -260 -293 -122 -152 -146 -230 -296 -299 -189 -175 -396 -246 -200 -153 -83 -121 -239
-17673 -239 -154 -218 -113 -320 -259 -93 -180 -160 -72 -250 -181 -74 -249 -249 -345 -138 -211 -153 -217 -239 -304 -111 -106 -420 -227 -36 -113 -261 -103
-17644 -103 -39 -236 -81 -253 -185 -15 -156 -97 -217 -288 -157 -230 -265 -119 -311 -238 -117 -229 -156 -58 -200 -243 -294 -208 -232 -102 -116
-17617 -116 -109 -214 -352 -115 -105 -109 -139 -171 -319 -271 -139 -155 -105 -194 -223 18 -7 -254 -313 -69 -92 33 -129 -169 -166 -277 -127 -141 -190
-17588 -190 -121 27 -60 -73 -219 -118 -122 -123 -126 -108 35 -140 -224 -162 -58 -112 -243 -228 -185 -196 -86 -78 -308 -157 -238 -272 -129 -139 -179 -297
-17558 -297 -172 -203 -147 -153 -124 -3 -219 -306 -204 -200 -265 -236 -176 -202 -110 -49 -223 -105 -73 -149 -73 -218 -130 -63 -92 -111 -207 -300 -175 -85 -253
-17527 -253 -237 -248 -200 31 -102 -280 -64 -20 -127 -234 -136 -136 -307 -146 -180 -319 -192 -156 -293 -44 -74 -164 -85 -136 -204 -360 -244
-17500 -244 -239 -178 -150 -100 -177 -189 -189 -268 -62 -179 -190 -289 -82 -114 -286 -75 -246 -314 -229 -138 -245 -120 -122 -191 -229 -143 -194 -394 -263 -220
-17470 -220 -43 -122 -328 -209 -175 -204 -312 -258 -258 -238 -141 -230 -271 -136 -244 -365 -139 -203 -178 -226 -237 -92 -185 -255 -191 -167 -131 -295 -185
-17441 -185 -49 -81 0 -259 -84 -126 -140 -135 -179 -238 -60 -39 -326 -124 -263 -162 -163 -235 -336 -20 -160 -113 -85 -155 -256 -180 -200 -314
-17413 -314 -51 -291 -130 -102 -191 -367 -154 -246 -257 -188 -293 -222 -213 -281 -173 -279 -183 -144 -168 -222 -231 -204 -318 -275 -226 -117 -305 -93 -52
-17384 -52 -65 -250 -279 -289 -325 -127 -158 -158 -190 -122 -176 -82 -160 -180 -97 -143 -306 -24 -149 -264 -164 -136 -115 -283 -310 -226 -42 -308 -315 -344
-17354 -344 -207 -240 -187 -318 -143 -228 -263 -279 -286 -198 -65 -196 -263 -30 -176 -308 -127 -196 -183 -121 -369 -145 -187 -68 -429 -228 -188
-17327 -188 -355 -253 -33 -234 -251 -266 -333 -111 -247 -199 -110 -197 -189 -157 -24 -71 -264 -180 -278 -139 -226 -254 -57 -234 -164 -51 -202 -182
-17299 -182 -66 -84 -115 -256 -222 -160 -221 -37 -152 -262 -265 -55 -195 -213 -189 -243 -204 -242 -143 -258 -78 -149 -247 -91 -162 -172 -276 -120
-17271 -120 -145 -218 -243 -164 -150 -174 -177 -140 -162 -119 -220 -159 -262 -98 -94 -309 -223 -318 -168 -274 -119 -270 -196 -223 -256 -125 -146 -220 -115 -275
-17241 -275 -208 -298 -159 -108 -150 -345 -283 -125 -278 -123 -248 -211 -280 -259 -106 14 -146 -223 -311 -276 -253 -287 -201 -176 -77 -172 -153 -140 -186
-17212 -186 -185 -403 -109 -65 -62 -203 -177 -349 -192 -135 -150 -53 -224 -20 -205 -244 -74 -119 -100 -247 -164 -129 -215 -110 -166 -151 -242 -98 -149
-17183 -149 -189 -253 -140 -216 -239 -278 -261 -75 -120 -240 -129 -223 -297 -90 -104 -183 -269 -192 -178 -141 -168 -320 -132 -215 -293 -96 -99 -101 -299 -116
-17153 -116 -101 -152 -77 -163 -135 -132 -152 -116 -119 -178 -238 -213 -199 -202 -172 -319 -333 -242 -372 -212 -144 -219 -109 -74 -226 -223 -107 -207 -312 -382 -207
-17122 -207 -239 -181 -216 -308 -312 -197 -1 -155 -202 -21 -258 -342 -156 -205 -197 -257 -254 -204 17 -65 -64 -237 -334 -203 -208 -221 -58 -54 -183 -248 -52
-17091 -52 -76 -127 -179 -235 -173 -90 62 -248 -125 -71 3 -240 -290 -107 -119 -217 -35 -146 -110 -90 -165 -118 -13 -33 -87 -75 -44 -31 55 7
-17061 7 -204 46 -130 -15 -189 -72 -250 -120 -82 -161 -128 -281 -226 -377 -202 -137 -179 -137 -182 -141 -101 -158 -278 -348 24 -217 -220 -19
-17033 -19 -187 -137 -95 -31 -158 -88 -26 -178 -102 -105 -12 -29 -126 37 9 119 15 -19 -45 -191 0 72 145 95 172 77 116 32 337 324
-17003 324 130 64 203 168 80 69 -155 -135 -127 58 -223 -135 -114 -137 -147 -151 -181 -100 -302 -241 -163 -58 -202 -105 -114 -147 -136 -121 -7 -210
-16973 -210 -210 -214 -194 -152 -32 -73 -1 -122 -46 -10 -84 -80 -66 -41 213 -105 33 8 102 -98 136 137 81 87 180 115 24 245 235 277 70 164
-16941 164 -86 360 5 88 -7 -27 -153 -209 -80 -204 -105 -17 -88 -68 -79 -125 -211 -172 -152 -192 -158 -211 63 -102 -243 -184 -166 -110 -236
-16912 -236 -209 -189 -74 -68 -180 -6 -194 -102 -107 -51 -174 -40 -215 -116 -58 -73 -60 -202 -264 -56 -81 -118 -153 -127 -33 -163 9 -160 -147
-16883 -147 -107 -76 -119 23 -94 -123 -234 -243 -102 -128 -67 -145 -100 -193 -197 39 -33 -282 -387 -211 -200 -50 -74 -32 -192 -222 -188 -80 -231
-16854 -231 -173 -58 -227 -29 -196 -173 -173 -228 -259 -112 -185 -149 -87 -187 -91 -27 -164 -213 -243 -100 -32 -149 -188 -76 -244 -176 -141 -221 -228
-16825 -228 -233 -129 -130 -161 -257 79 -42 -264 -193 -199 -328 -148 -142 -93 -39 -192 -87 -126 -102 -272 -141 -4 -60 -175 -247 -123 -160 -82 -94
-16796 -94 -177 -134 -223 -145 -173 -183 -47 -56 -28 -150 -219 -129 -264 -254 -243 -277 -236 -113 -312 -261 -253 -228 -13 -295 -121 -247 -295 -318 -218 -248
-16766 -248 -171 -96 33 -125 -128 -139 -193 -132 -266 -102 -115 -269 -272 -144 -117 -51 -92 -127 -191 -79 -139 -184 -89 89 -54 -72 -121 -36 -241 -179
-16736 -179 -145 -244 15 -186 -298 -154 -269 -204 -214 -134 -71 -204 -299 -180 -103 -38 -197 -107 -40 -188 -165 -225 -135 -336 35 -220 -148 -191
-16708 -191 -188 -238 -96 -27 -73 -169 -358 -136 -161 -247 -309 -120 -133 -218 -120 -252 -243 -193 -155 -165 -113 -206 -388 -151 -249 -90 -175 -213 -174 -114 -236
-16677 -236 -92 -223 -368 -121 -265 -304 -209 -229 -133 -346 -237 -158 -227 -176 -291 -235 -130 -289 -274 -87 -184 -155 -243 -128 -283 -187 -80
-16650 -80 -59 -102 -298 -173 -201 -382 -198 -286 -288 -209 -61 -198 -141 -1 -168 -6 -167 -187 -262 -212 -74 -29 -229 -35 -242 -330 -91
-16623 -91 -342 -343 -223 -181 -319 -227 -166 -188 -312 -106 -231 -184 -267 -222 -96 -164 -118 -285 -157 -116 -217 -416 -178 25 -214 -208 -106 -40
-16595 -40 -162 -238 -68 -266 -71 -182 -249 -199 -189 -123 -11 -247 -209 -187 -214 -220 -312 -103 -224 -181 -190 -123 -205 -259 -251 -86 -174 -62 -76 -421
-16565 -421 -284 -210 -154 -67 -165 -189 -129 -153 -39 -212 -184 -116 -318 -142 -257 -166 -374 -182 -262 -164 -100 -197 -204 -152 -100 -372 -141 -86 -209
-16536 -209 -265 -139 -256 -160 -228 -75 -313 -256 -141 -140 -198 -211 -268 -374 -335 -350 -306 -186 -236 -287 -146 -141 -213 -86 -72 -236 -231 -282 -307 -279
-16506 -279 -183 -288 -145 -98 -213 -19 13 -387 -62 -128 -16 2 -247 -277 -209 -356 -283 -237 -320 -133 -157 -161 -125 -174 -258 -153 -304 -84
-16478 -84 -78 -158 -326 -225 -218 -318 -198 -178 -198 -163 -160 -297 -296 -227 -350 -250 -368 -215 -203 -256 -75 -217 -228 -137 -9 -31 -131 -345 -109
-16449 -109 -191 -130 -99 -195 -232 -189 -261 -217 -121 -361 -211 -101 -139 -110 -256 -275 -166 -125 -157 -238 -253 -213 -151 -226 -283 -276 -169 -301 -249 -247 -154
-16418 -154 -21 -210 -144 -62 -233 -204 -216 -119 -166 -65 -151 -243 -226 -365 -192 -144 -193 -264 -309 -216 -122 -155 -133 -178 -228 -116 100 -287 -147
-16389 -147 -273 -131 -228 -268 -125 -243 -161 -261 -161 -200 -38 -183 -103 -74 -153 -220 -104 -160 -156 -155 -164 -92 -242 -123 -230 -214 -358 -351 -143
-16360 -143 -143 -327 -185 -107 -344 -205 -209 -271 -426 -179 -249 -225 -242 -8 -253 -234 -126 -223 -72 -259 -169 -299 -317 -247 -110 -207 -144 -311
-16332 -311 -165 -156 -382 -246 -132 -218 -304 -223 -49 -100 -250 -216 -350 -260 -162 -252 -168 -152 -73 -221 -103 -140 -270 -25 -36 -286 -180 -296
-16304 -296 -295 -250 -395 -296 -251 -235 -107 -153 -301 -203 -146 -117 -70 -192 -439 -147 -269 -167 -310 -233 -276 -440 -205 -214 -162 -62 -177 -142
-16276 -142 -182 -260 -164 -237 -230 -17 -118 -98 -67 -311 -198 -246 -267 -146 -385 -294 -162 -310 -294 -121 -216 -149 -26 -285 -46 -277 -188 -271
-16248 -271 -158 -353 -331 -207 -231 -152 -347 -290 -248 -351 -211 -221 -281 -127 -187 -282 -257 -307 -194 -219 -169 -44 -264 -188 -264 -207 -267 -203 -293
-16219 -293 -216 -114 -268 -277 -155 -393 -366 -219 -186 -207 -58 -210 -22 -163 -289 -168 -118 12 -186 -251 -199 -303 -287 -250 -208 -137 -291
-16192 -291 -174 -296 -146 -250 -235 -177 -154 -217 -271 -290 -257 -149 -113 -233 -105 -276 -176 -219 -141 -133 -255 -228 -354 -237 -180 -223 -214 -155 -237
-16163 -237 -47 -298 -297 -280 -134 -202 -174 -148 -176 -19 -177 -255 -208 -178 -186 -144 -182 -151 -346 -275 -111 -219 -27 -311 -194 -190 -319 -149 -238
-16134 -238 -237 -190 -96 -278 -181 -204 -362 -189 -142 -228 -164 -223 -301 -208 -220 -189 -147 -100 -61 -116 -119 -195 16 -249 -301 -163 -204 -168 -104 -163 -340
-16103 -340 -244 -162 -174 -252 -222 -302 -197 -351 -199 -198 -165 -20 -215 -158 -221 -118 -102 -190 -146 -259 -132 -155 -51 -360 -271 -252 -378 -205
-16075 -205 -236 -116 -272 -216 -314 -144 -398 -364 -199 -212 -159 -108 -34 -132 -380 -113 -142 -175 -264 -131 -215 -310 -107 -269 -214 -238 2 -127
-16047 -127 -70 -192 -46 -158 -135 -123 -321 -258 -169 -184 -203 -185 -204 -219 -253 -254 -328 -180 -206 -289 -84 -90 -226 -191 -162 -188 -243 -232 -78 -228
-16017 -228 -139 -238 -421 -299 -244 -276 -353 -225 -128 -242 -229 -77 -245 -77 -263 -282 -243 -16 -50 -278 -278 -112 -112 -351 -202 -193 -262 -361 -320
-15988 -320 -235 -400 -238 -350 -261 -188 -197 -220 -421 -241 -218 -184 -347 -187 -257 -223 -322 -197 -134 -271 -36 -190 -215 -258 -161 -153 -355 -302 -266
-15959 -266 -214 -151 -99 -191 -191 -147 -142 -91 -178 -231 -208 -212 -380 -371 -177 -236 -218 -222 -157 -292 -112 -106 -218 -377 -338 -247 -354 -189 -111 -84 -187 -170
-15927 -170 -162 -72 -187 -153 -101 -176 -87 -146 -369 -96 -326 -89 -245 -352 -216 -287 -135 -299 -114 -66 -246 -67 -120 -325 -347 -276 -255
-15900 -255 -363 -177 -276 -48 -149 -117 -239 -293 -90 -113 -238 -333 -209 -300 -297 -241 -59 -108 -3 -99 -285 -9 -15 -85 -242 -133 -53 -138
-15872 -138 -188 -162 -277 -192 -158 -286 -105 -121 -131 -214 -242 -261 -245 -177 -302 -267 -230 -247 -251 -214 -303 -189 -45 -181 -192 -257 -249 -348 -117 -85 -306
-15841 -306 -213 -302 -191 -135 -178 -139 -266 -169 -181 -147 -80 -114 -325 -130 -300 -212 -215 -390 -97 -260 -154 -282 -242 -163 -121 -118 -221 -182 -270
-15812 -270 -230 -98 -190 -168 -168 -330 -165 -91 -206 -248 -141 -289 -280 -154 -290 -88 -278 -380 -256 -333 -170 -151 -125 -137 -270 -198 -72
-15785 -72 -189 -238 -113 -280 -225 -319 -296 -212 -250 -262 -104 -189 -123 -159 -261 -304 -207 -120 -213 -396 -285 -12 -218 -188 -320 -281 -297 -179 -256
-15756 -256 -15 -205 -250 -275 -289 -201 -247 -107 -201 -236 -162 -294 -226 -59 -198 -187 -257 -307 -346 -75 -16 -129 -337 -229 -207 -350 -305 -213
-15728 -213 -234 -286 -238 -239 -152 -183 -64 -179 -155 -113 -209 -53 -213 -148 -275 -278 -135 -260 -55 -143 -199 -242 -247 -120 -216 -260 -391 -267 -214 -241
-15698 -241 -247 17 -84 -211 -274 -342 -158 -228 -239 -234 -270 -336 -80 -261 -212 -27 -275 -115 -216 -171 -127 -155 -70 -59 -228 -185 -215 -383 -79
-15669 -79 -59 -240 -271 -179 -155 -106 -359 -150 -239 -199 -143 -140 -201 -289 -132 -77 -168 -171 -77 -116 -198 -230 -212 -219 -205 -243 -175 -293 -173 -179 -266 -265 -316 -270
-15635 -270 -107 -184 -55 -163 -127 -134 -364 -277 -194 -117 -155 -188 -282 -240 -80 -257 -173 -318 -268 -200 -165 -309 -278 -197 -280 -340 -304 -169 -293
-15606 -293 -218 -171 -183 -282 -234 -186 -214 -288 -132 -250 -183 -43 -48 -297 -173 -189 -158 -105 -112 -174 -240 -304 -202 -217 -218 -249 -155 -57 -144 -124 -193 -171
-15574 -171 -271 -152 -390 -133 -83 -70 -222 -200 -134 -217 -160 -255 -151 -147 -137 -109 -52 -282 -256 -226 -272 -237 -164 -197 -218 -61 -329 -215 -168
-15545 -168 -238 -309 -73 -143 -185 -181 -174 -125 -387 -183 -179 -105 -399 -99 -190 -177 -189 -268 48 -136 -158 -276 -19 -359 -353 -223 -133 -62 -199 -163
-15515 -163 -266 -248 -162 -165 -168 -361 -241 -99 -269 -180 -229 -332 -144 -101 -331 -160 -133 -196 -214 -210 -265 -85 -112 -120 -321 -63 -140 -160 -81 -344
-15485 -344 -170 -192 -102 -119 -302 -116 -265 -264 -124 -173 -266 -195 -134 -367 -167 -132 -131 -139 -188 -238 -110 -204 -113 -147 -117 -194 -57 -228 -261 -190
-15455 -190 -145 -407 -322 -207 -268 -230 -206 -212 -298 -206 -158 -109 -291 -237 -12 -185 -319 -317 -266 -103 -157 -84 -296 -119 -219 -120 -272 -159 -270
-15426 -270 -284 -181 -133 -212 -249 -223 -101 -210 -214 -196 -222 -143 -289 -260 -282 -335 -267 -220 -215 -206 -229 -80 -172 -201 -322 -207 -219 -90 -190 -234 -253
-15395 -253 -101 -254 -282 -220 -334 -202 -80 -285 -328 -179 -264 -343 -14 -171 -300 -256 -237 -256 -89 -292 -290 -84 -142 -144 -275 -243 -167 -77
-15367 -77 -390 -295 -274 -212 -298 -170 -231 -171 -252 -287 -288 -302 -273 -188 -241 -116 -238 -185 -203 -335 -54 -242 -165 -165 -259 -197 -158 -223 -339 -141 -243
-15336 -243 -135 -90 -298 -143 -195 -282 -341 -235 -269 -171 -146 -214 -67 -201 -240 -206 -275 -74 -170 -235 -245 -113 -292 -147 -143 -214 -235 -220 -254
-15307 -254 -68 -247 -196 -141 -290 -170 -400 -256 -204 -151 -103 -209 -187 -46 -282 -132 -203 -182 -252 -223 -148 -126 -179 -262 -195 -235 -219 -272 -130
-15278 -130 -192 -191 -234 -261 -68 -220 -86 -293 -233 -148 -221 -66 -178 -258 -205 -138 -225 -181 -262 -200 -158 -169 -189 -185 -103 -74 -76 -130 -340 -189 -62
-15247 -62 -296 -212 -126 -120 -152 -23 -111 -193 -70 -156 -198 -75 -51 -312 -194 -186 -111 -105 -189 -143 -15 -143 -141 -142 -176 -121 -110 -126 -224 -115 -2 -190
-15215 -190 -112 -239 -168 0 -96 -82 -150 -143 -125 -1 -271 -145 -231 -276 -118 -123 -207 -76 -61 -30 -71 -152 -235 23 8 -149 -52 -53 -11 -131
-15185 -131 -48 -8 -119 -20 -13 -6 136 31 31 103 297 433 92 99 163 127 185 173 357 355 449 148 300 358 349 297 400 348 356 524 385
-15154 385 335 531 450 488 412 388 513 464 533 349 453 404 532 512 394 409 641 533 534 594 659 564 605 688 555 702 581 655 832
-15125 832 626 728 596 702 792 763 754 767 963 844 859 814 992 1015 1008 995 1135 1104 1128 1157 1171 1274 1338 1423 1401 1546 1578 1492 1600
-15096 1600 1707 1684 1972 1974 2035 2145 2110 2151 2191 2366 2617 2616 2525 2697 2821 2839 2974 3167 3147 3278 3229 3438 3551 3482 3678 3743 3702 3922
-15068 3922 3804 3709 3975 3925 4101 3993 4098 4111 4229 4165 3997 4319 4150 4191 4235 4298 4250 4334 4284 4313 4419 4524 4601 4602 4729 4732 4927 4878
-15040 4878 4868 4814 4899 5046 5095 5017 5053 5051 5133 5231 5411 5447 5391 5438 5329 5333 5496 5526 5683 5720 5715 5727 5828 5906 5872 5856 6097 6153 5971 6182
-15010 6182 6105 6208 6234 6340 6252 6393 6359 6325 6472 6340 6298 6327 6416 6430 6349 6420 6228 6278 6382 6154 6285 6009 6114 6239 5995 6117
-14984 6117 6191 5949 5851 6000 5762 5676 5702 5737 5488 5534 5450 5425 5429 5204 5287 5351 5140 5143 5249 4995 5001 4881 5089 4905 5040 4611 4821 4856
-14956 4856 4714 4768 4712 4763 4700 4581 4457 4525 4363 4428 4450 4305 4074 4289 4096 4310 4059 4040 3957 3954 4020 3915 3947 3791 3833 3763 3671 3781
-14928 3781 3720 3652 3471 3516 3507 3430 3423 3279 3215 3089 3175 2994 2840 2616 2689 2449 2488 2330 2364 2289 2097 2118 1859 1993 1879 1770 1744 1838
-14900 1838 1833 1656 1594 1617 1406 1396 1359 1419 1340 1221 1287 1030 1163 1092 1051 1044 946 917 859 1018 881 977 838 818 1032 811 797 943 859
-14871 859 736 717 784 724 829 855 686 799 664 628 687 626 732 768 536 663 637 605 613 727 604 560 559 456 828 762 476 688
-14843 688 643 596 578 495 675 479 660 493 475 452 377 508 600 438 344 509 451 340 447 406 300 276 345 320 203 313 177
-14816 177 264 404 182 73 74 83 201 269 137 104 164 96 218 -4 126 183 108 84 134 81 190 90 26 -66 -4 198 65 146 -66
-14787 -66 102 190 201 69 45 45 -135 28 38 -139 -8 -42 65 72 123 90 -67 103 -92 -27 -17 -167 -21 107 -53 -62 46 71
-14759 71 -73 90 121 -129 18 -85 -121 -68 -59 -77 76 -20 46 3 -129 -7 117 -52 -97 -3 4 -57 -114 112 -135 47 -91 -309
-14731 -309 20 -88 97 29 -64 35 -128 -91 -65 -121 -67 45 -86 -88 -200 -167 -126 -102 -127 5 -14 155 -85 -35 31 -138 35 -69
-14703 -69 6 -125 -3 -87 -77 -68 -90 -40 -117 -164 -30 49 9 -85 110 -134 -149 -75 -113 -41 -6 -118 -171 38 -114 -138 -166 12 94 5
-14673 5 -70 119 -75 -97 -47 -69 -117 -138 28 -149 -126 -81 -69 -186 -215 -66 -65 -131 -171 -219 -136 -185 -87 78 -47 -24 8 -210 6 -144
-14643 -144 -135 -122 -84 48 -218 -33 -206 -59 -25 25 -53 -48 34 -105 -97 -95 -136 -113 -198 -58 10 -132 -208 -205 -102 -10 -179 -301 -4 -178
-14613 -178 -53 -275 4 -105 -200 57 -198 2 -145 34 -127 -245 49 -251 -161 -177 -167 -84 -78 -116 -216 -82 -27 -10 -75 -42 -231
-14586 -231 27 -70 -252 -137 -174 -81 -32 17 -269 -105 -108 -197 4 -122 -81 -220 -182 -144 -250 -55 -33 -120 -36 -128 -115 -233 -81 -8
-14558 -8 -198 -68 -67 5 -109 -194 -220 -115 -96 -42 -123 -91 -126 -109 -108 -183 -316 -188 48 -100 -39 -38 -186 -166 -169 -141 -160 -160 -136 -48 -16 -302
-14526 -302 -176 -169 -96 -52 -170 -142 -45 -124 60 -95 -213 -186 -49 -106 -55 -37 -101 -161 -173 -149 -187 -205 -114 -139 -243 -30 -144 -190 -231 -173
-14496 -173 -238 -107 -186 -128 -240 6 -204 -174 -28 -97 -59 -104 -166 -183 -129 -61 -160 -38 -98 -114 -111 -197 31 8 101 -108 -7 -91 -213
-14467 -213 -163 -133 -207 -88 -163 90 -132 -198 -36 -241 -214 55 -53 -190 -171 -41 -53 -91 -150 -56 -202 -34 81 -117 -68 -58 -37
-14440 -37 -256 -7 -129 -75 -141 -59 -11 -52 -4 -185 -171 -74 -151 -173 -176 -103 -155 16 -40 -90 -126 -91 -135 -206 -196 -94 -127 107 -83 -100 131
-14409 131 -210 -38 -184 -175 -13 -130 -174 -45 -68 -258 -220 -181 -142 -57 -292 -145 -218 -257 -113 -240 -153 -13 -287 -54 -206 -163 -131
-14382 -131 -139 -129 -141 -59 -238 -55 -26 -269 -295 -81 -46 -114 -40 -50 -65 -23 -243 -271 -193 -97 -246 -187 -99 -105 -165 -158 -123 -266 -164 -199 -275
-14351 -275 -120 -286 -63 -191 -174 8 -92 -235 -113 -38 -90 -177 -158 -169 -141 -109 -138 -166 -187 -163 -180 -42 -122 56 -205 -171 -148 -70
-14323 -70 -109 -293 -240 -260 -28 -90 -239 -100 -277 -201 -345 -136 -210 -186 -97 -96 -71 -120 -216 -270 -48 -151 -27 -263 -73 -287 -162 -130
-14295 -130 -259 -227 -4 -163 -147 -219 -223 2 -101 4 -137 -128 -263 -27 -111 -64 -209 -104 -203 -160 -153 -177 5 -253 -94 -39 10 -281
-14267 -281 -318 -193 -171 -223 -97 -12 -181 -149 -115 -305 -185 -74 -95 -117 -160 -138 -158 -59 -220 -203 -172 -122 -120 7 -78 -209 -68 -72 -48 -107
-14237 -107 -175 -50 -142 -213 -50 -134 -194 2 -60 -215 -61 -147 -135 -111 -254 -302 -135 -197 -102 -167 -232 -164 -143 -48 -132 -133 -108 -147 -201 -317
-14207 -317 -199 -30 -125 -36 -339 -240 -86 -194 -185 -134 -301 -300 -137 -194 -135 -244 -92 -119 -299 -233 -200 -208 -76 -126 -132 -77 -187 -46 -180
-14178 -180 -192 -115 -176 -225 -106 -82 -209 -190 32 -225 -68 -200 -281 -85 -328 -130 -350 -18 -244 -234 -118 -139 -112 -139 -179 -149 -119
-14151 -119 -282 -203 -212 -219 -310 -191 -187 -3 -75 -215 -102 -238 -176 -148 -36 -179 -319 -162 -244 -145 -42 -233 -268 -136 -267 -168 -269 -193
-14123 -193 -197 -91 -111 -163 -201 -219 27 -183 -230 -78 -79 -265 -309 -183 -159 -136 -144 -67 -13 -162 -24 -116 -229 -103 -116 -106 -321 -201 -68
-14094 -68 -223 -152 -221 -144 -172 -294 -226 -338 -263 -108 3 -227 -81 -86 -211 -110 -164 -218 -311 -124 -245 -196 -136 -24 -146 -213 -170 -141
-14066 -141 -189 -161 -173 -1 -134 -47 -239 -30 -129 -339 -181 -188 -113 -235 -141 -188 -161 -312 -207 -396 -30 -162 -325 -352 -71 -159 -140
-14039 -140 -59 -55 -127 -201 -135 -183 -138 -158 -226 -138 -88 -161 -191 -286 -160 -126 -145 -352 -244 -108 -51 -80 -228 -190 -247 -269 -167 -319 -91 -316
-14009 -316 -118 -211 -190 -186 -208 -256 -251 -92 -326 -231 -283 -174 -127 -191 -230 -216 -76 -211 -192 -211 -341 -127 -244 -46 -178 -208 -27 -303
-13981 -303 -295 -181 -208 -279 -150 -206 -289 -35 18 -227 -244 -133 -12 -113 -287 -150 -224 -167 -185 -265 -164 -180 -253 -184 -274 -67 -160 -157 -65
-13952 -65 -100 -170 -169 -57 -141 -240 -173 -180 -170 -121 -429 -136 -314 -219 -97 -334 -28 -277 -190 -104 -125 -201 -360 -316 -188 -71 -246 -212 -160
-13923 -160 -147 -236 -8 -219 -186 -232 -108 -218 -300 -236 -101 -93 -241 -42 -225 -248 -274 -195 -81 -215 -181 -135 -82 -105 -337 -173 -208 -46
-13895 -46 -92 -104 -112 -199 -268 -235 -198 -159 -150 -328 -173 -91 -238 -166 -105 -117 -129 -109 -11 -144 -171 -111 -197 -128 -190 -165 -106 -249 -160 -88 -250 -70
-13863 -70 -317 -201 -175 -191 -217 -249 -182 -256 -111 -238 6 -81 -56 -274 -174 -214 -204 -244 -162 -170 -258 -121 -113 -205 -90 -218 -204 -16 -287
-13834 -287 -255 -311 -290 -355 -241 -180 -302 -128 -145 -331 -195 -155 -231 -50 43 -226 -238 -176 -136 -213 -167 -116 -138 -116 -205 -254 -108 -311 -67
-13805 -67 -232 -235 -51 -166 -94 -162 -84 -202 -172 -235 -182 -166 -204 -366 -113 -69 -249 -179 -152 -135 -149 0 -159 -250 -186 -112 -246 -196 -154 -197
-13775 -197 -73 -94 -194 -196 -37 -223 -104 -165 -223 -208 -44 -138 -246 -209 -318 -223 -126 -103 -162 -264 -224 -108 -112 -144 -120 -106 -205 -99 -297
-13746 -297 -60 88 -287 -283 -185 -144 -33 -299 -350 -154 -77 -117 -180 -283 -44 -378 -249 -252 -307 -80 -219 -169 -185 -18 -285 -234 -258 -78
-13718 -78 -204 -142 -214 -33 -128 -252 -167 -275 -163 -37 -200 -302 -264 -272 -206 -289 -67 -168 -155 -317 -172 -261 -272 -99 -339 -279 -144
-13691 -144 -169 -234 -225 -111 -326 -167 -204 -157 -148 -331 -269 -143 -141 -125 -183 -286 -262 -350 -88 -262 -306 -224 -126 -203 -260 -227 -214 -127 -155 -90 -166
-13660 -166 -182 -262 -254 -302 -280 -157 -217 -198 -103 -114 -309 -133 -216 -54 -293 -146 -183 -240 -209 -254 -137 -222 -166 -262 -221 -143 -199 -246 -74 -117
-13630 -117 -105 -228 -163 -170 -4 -245 -213 -171 -79 -228 -187 -274 -233 -192 -234 -75 -345 -232 -153 -237 -173 -276 -176 -122 -252 -283 -232 -125 -367
-13601 -367 -159 -148 -82 -147 -183 -185 -123 -172 -248 -447 -51 -269 -161 0 -249 -233 -271 -105 -238 -177 -227 -143 -357 -121 -192 -48 -99 -218
-13573 -218 -58 -279 -149 -72 -159 -257 -268 -264 -217 -141 -172 -269 -365 -244 -247 -295 -216 -318 -194 -214 -242 -130 -154 -100 -143 -421 -304 -234 -214 -159
-13543 -159 -221 -191 -138 -69 -236 -267 -195 -270 -260 -133 -262 -185 -346 -180 -147 -274 -137 -152 -67 -165 -99 -330 -212 -75 -195 -188 -226 -276 -179
-13514 -179 -223 -309 -227 -235 -200 -171 -196 -230 -224 -128 -168 -287 -167 -254 16 -239 -240 -101 -248 -302 -287 -77 -244 -101 -174 -212 -316 -232 -25 -156
-13484 -156 -179 -135 -279 -221 -135 -212 -124 -73 -276 -239 -279 -160 -237 -311 -99 -146 -140 -143 -233 -261 -189 -177 -220 -203 -288 -322 -204 -305 -282 -72 -173
-13453 -173 -275 -215 -223 -112 -242 -160 -279 -171 -237 -142 -288 -321 4 -148 -201 -142 -190 -82 -174 -205 -154 -262 -150 -186 -271 -266 -107 -140 -196
-13424 -196 -152 -108 -233 -153 -216 -209 -174 -218 -275 -122 -206 -193 -174 -111 -192 -186 -233 -293 -247 -175 -104 -169 -40 -248 -212 -188 -211 -259 -288 -375 -263 -201
-13392 -201 -296 -79 -118 -147 -176 -241 -154 -121 -164 -222 -122 -195 -193 -123 -71 -132 -140 -254 -172 -167 -110 -79 -225 -230 -148 -175 -317 -109 -172 -44 -228 -233
-13360 -233 -127 -166 -137 -214 -219 -353 -220 -210 -255 -286 -167 -183 -85 -303 -125 -102 -189 -303 -371 -123 -329 -217 -409 -266 -277 -307 -344 -317
-13332 -317 -152 -238 -335 -224 -130 -293 -314 -273 -252 -213 -220 -261 -184 -238 -235 -172 -242 -206 -314 -49 -322 -184 -130 -320 -190 -229 -188 -270 -168 -110
-13302 -110 -128 -247 -301 -187 -121 -318 -166 -355 -109 -241 -275 -234 -194 -94 -191 -185 -348 -285 -59 -180 -273 -317 -122 -36 -215 -160 -277
-13275 -277 -40 -178 -240 -193 -88 -145 -285 -309 -85 -214 -271 -70 -160 -106 -244 -244 -192 -286 -210 -135 -213 -128 -187 -248 -166 -254 -169 -142 -228 -386
-13245 -386 -151 -54 -48 -232 -313 -167 -373 -263 -232 -241 -153 -246 -273 -161 -316 -147 -3 -128 -178 -223 -282 -146 -91 -152 -173 -192 -221 -246 -171
-13216 -171 -409 -291 0 -287 -206 -170 -256 -191 -182 -214 -225 -181 -313 -159 -127 -157 -357 -256 -120 -233 -288 -264 -187 -282 -140 -266 -85 -133
-13188 -133 -293 -195 -272 -167 -221 -161 -149 -413 -220 -99 -260 -243 -309 -226 -198 -192 -307 -413 -114 -159 -170 -124 -309 -199 -227 -251 -144 -218
-13160 -218 -233 -371 -444 -279 -104 -152 -317 -165 -286 -200 -267 -223 -113 -216 -194 -280 -325 -305 -202 -106 -79 -319 -63 -198 -329 -193 -246
-13133 -246 -224 -283 -229 -163 -220 -185 -144 -297 -225 -293 -238 -124 -189 -121 -10 -82 -236 -211 6 -114 -107 -179 -161 -81 -143 -74 -137 -162 -280 -144
-13103 -144 -34 -102 -338 -127 50 -95 -207 -157 -40 -272 -471 -207 -83 -241 -164 -116 -347 -182 -307 -284 -261 -161 -83 -207 -201 -196
-13077 -196 -199 -296 -169 -152 -189 -277 -269 -373 -21 -133 -134 -195 -236 -265 -125 -249 -198 -194 -317 -195 -230 -123 -268 -227 -178 -253 -318 -280 -242 -94
-13047 -94 -143 -147 -366 -168 -207 -325 -265 -283 -267 -326 -215 -385 -201 -69 -283 -139 -276 -245 -76 -279 -161 -103 -238 -225 -309 -36 -203
-13020 -203 -202 -205 -266 -209 -209 -239 -274 -159 -413 -174 -227 -225 -278 -409 -181 -134 -223 -207 -257 -160 -200 -266 -76 -93 -240 -208 -329 -102 -172 -328 -175
-12989 -175 -265 -271 -332 -180 -165 -154 -174 -199 -299 -288 -270 -26 -221 -231 -119 -233 -188 -282 -179 -112 -171 -243 -150 -228 -175 -329 -347 -256 -194 -210
-12959 -210 -255 -268 -219 -276 -207 -189 -276 -247 -203 -322 -86 -90 -147 -106 -180 -107 -353 -113 -351 -321 -284 -208 -188 -201 -64 -234 -258 -255 -274 -252 -192
-12928 -192 -130 -194 -159 -276 -333 -345 -138 -268 -317 -193 -226 -91 -103 -108 -235 -212 -202 -141 -159 -25 -275 -298 -275 -241 -106 -278 -237 -133 -269
-12899 -269 -326 -149 -149 -98 -80 -221 -12 -152 -187 -36 -274 -402 -181 -134 -95 -232 -351 -152 -271 -279 -222 -155 -169 -256 -106 -271 -188 -169
-12871 -169 -192 -175 -299 -291 -288 -217 -224 -87 -274 -307 -293 -211 -227 -337 -136 -109 -357 -284 -201 -66 -192 -269 -328 -111 -306 -166 -140 -337 -89
-12842 -89 -296 -142 -219 -392 -297 -346 -345 -251 -232 -258 -177 -294 -227 -152 -158 -171 -194 -163 -348 -147 -295 -194 -231 -237 -320 -289 -203 -134 -215 -280 -369 -238
-12810 -238 -221 -194 -230 -276 -306 -276 -249 -270 -98 -118 -94 -200 -239 -292 -186 -243 -221 -189 -303 -286 -79 -220 -219 -291 -289 -188 -169 -86 -297 -295 -107
-12779 -107 -318 -110 -311 -286 -212 -132 -162 -210 -239 -187 -77 -313 -149 -226 -196 -256 -289 -232 -217 -202 -171 -124 -233 -167 -219 -321 -261 -227 -143 -190
-12749 -190 -154 -189 -314 -196 -294 -99 -55 -427 -160 -252 -123 -215 -343 -356 -233 -297 -238 -83 -164 -200 -170 -196 -304 -322 -271 -192 -196 -78 -191
-12720 -191 -302 -235 -296 -126 -205 -300 -82 -240 -243 -133 -326 -264 2 -216 -194 -231 -279 -375 -326 -359 -158 -146 -217 -351 -266 -134 -207 -336
-12692 -336 -237 -37 -223 -264 -99 -54 -320 -196 -217 -201 -310 -395 -114 -223 -252 -225 -196 -273 -257 -268 -381 -193 -124 -276 -280 -250 -347 -48
-12664 -48 -100 -228 -101 -139 -164 -121 -215 -309 -240 -128 -124 -190 -358 -158 -428 -406 -227 -264 -202 -193 -99 -66 -149 -334 -249 -214 -267 -215 -179 -336 -330
-12633 -330 -230 -372 -303 -181 -99 -64 -40 -162 -136 -193 -330 -179 -307 -216 -238 -186 -224 -354 -252 -92 -275 -250 -169 -207 -305 -277 -279 -296 -339
-12604 -339 -238 -330 -338 -211 -143 -159 -285 -296 -98 -143 -180 -161 -247 -201 -195 -164 -199 -164 -247 -118 -70 -171 -217 -267 -325 -345 -248 -191 -228 -104 -266
-12573 -266 -227 -297 -45 -174 -255 -269 -209 -240 -329 -239 -270 -179 -295 -294 -211 -323 -189 -178 -152 -351 -269 -180 -403 -189 -179 -331 -277 -219 -417
-12544 -417 -141 -142 -223 -273 -273 -237 -234 -349 -125 -133 -180 -267 -297 -220 -183 -216 -167 -206 -77 -257 -205 -126 -170 -206 -255 -254 -148 -266 -206 -273 -345 -213
-12512 -213 -303 -262 -419 -189 -429 -253 -306 -103 -90 -243 -251 -235 -187 -10 -278 -213 -133 -304 -284 -286 -250 -221 -126 -213 -127 -274 -285 -328 -391 -101
-12482 -101 -260 -189 -191 -220 -143 -143 -92 -213 -129 -191 -214 -424 -207 -308 -156 -69 -288 -332 -251 -292 -222 -178 -178 -266 -384 -195 -240 -236 -101 -162 -237
-12451 -237 -91 -382 -357 -351 -351 -243 -202 -229 -163 -313 -289 -113 -267 -256 -379 -135 -194 -142 -298 -254 -192 -195 -339 -139 -227 -175 -135 -258 -244
-12422 -244 -251 -145 -479 -141 -324 -168 -375 -98 -188 -311 -15 -221 -140 -107 -171 -219 -288 -238 -213 -273 -296 -204 -174 -278 -226 -140 -379 -140
-12394 -140 -211 -350 -87 -305 -180 -264 -252 -248 -206 -59 -276 -275 -114 -210 -111 -295 -324 -408 -266 -381 -241 -144 -346 -105 -222 -235 -262 -258
-12366 -258 -301 -319 -188 -253 -185 -239 -421 -230 -181 -182 -224 -346 -186 -186 -292 -415 -223 -134 -154 -91 -95 -258 -321 -146 -194 -173 -178 -180 -125 -365 -332
-12335 -332 -195 -284 -246 -357 -136 -331 -112 -194 -245 0 -254 -301 -167 -130 -426 -254 -231 -325 -260 -238 -143 -213 -226 -332 -216 -252 -173 -176
-12307 -176 -115 -279 -216 -300 -227 -204 -382 -29 -214 -165 -120 -35 -250 -215 -182 -82 -159 -88 -198 -202 -283 -374 -320 -248 -230 -225 -188 -417 -148 -322
-12277 -322 -342 -182 -325 -220 -248 -316 -342 -261 -238 -336 -280 -123 -255 -265 -150 -140 -145 -206 -116 -189 -407 -271 -219 -268 -243 -308 -257 -238 -145 -286
-12247 -286 -125 -126 -233 -302 -143 -261 -246 -357 -188 -257 -234 -289 -367 -271 -276 -276 -342 -114 -259 -226 -278 -145 -116 -226 -127 -263 -186 30 -222
-12218 -222 -371 -230 -132 -317 -103 -125 -239 -402 -241 -388 -107 -194 -292 -403 -267 -209 -452 -125 -271 -188 -76 -235 -231 -176 -307 -196
-12192 -196 -250 -139 -187 -271 -252 -188 -319 -422 -216 -82 -279 -177 -243 -274 -173 -154 -254 -257 -342 -247 -290 -304 -369 -257 -123 -207 -201 -154 -86
-12163 -86 -371 -301 -281 -290 -296 -239 -316 -152 -181 -336 -193 -229 -295 -175 -127 -219 -345 -216 -268 -172 -130 -235 -410 -247 -144 -187 -147 -238 -176 -277
-12133 -277 -188 -227 -175 -402 -181 -114 -355 -79 -48 -295 -365 -277 -124 -243 -243 -222 -109 -162 -401 -149 -372 -319 -447 -330 -260 -352 -228
-12106 -228 -130 -115 -272 -214 -277 -253 -355 -156 -46 -200 -215 -161 -230 -188 -205 -358 -162 -390 -328 -183 -255 -165 -229 -535 -344 -229 -331
-12079 -331 -202 -263 -156 -444 -96 -263 -233 -145 -206 -144 -269 -172 -262 -309 -263 -116 -330 -186 -105 -295 -459 -319 -245 -202 -340 -248 -212
-12052 -212 -380 -240 -322 -62 -204 -296 -70 -164 -179 -253 -373 -352 -171 -254 -86 -300 -387 -289 -168 -77 -318 -192 -284 -264 -210 -401 -332
-12025 -332 -247 -285 -252 -32 -127 -225 -239 -327 -186 -375 -283 -190 -372 -268 -177 -300 -259 -366 -113 -203 -284 -181 -426 -340 -257 -331 -300 -293 -367
-11996 -367 -285 -254 -443 -369 -312 -266 -105 -335 -209 -224 -263 -148 -229 -360 -308 -213 -216 -197 -221 -331 -187 -308 -319 -96 -311 -388 -176 -221
-11968 -221 -133 -172 -314 -225 -305 -239 -145 -346 -255 -180 -281 -64 -169 -232 -212 -250 -492 -283 -340 -283 -198 -284 -185 -245 -374 -419 -389 -164 -60
-11939 -60 -333 -396 -140 -334 -435 -164 -403 -292 -371 -261 -231 -227 -165 -238 -412 -151 -115 -206 -224 -188 -233 -281 -113 -351 -290 -37 -228 -194
-11911 -194 -201 -259 -230 -263 -142 -198 -172 -358 -280 -365 -131 -304 -193 -317 -238 -171 -275 -209 -307 -214 -112 -91 -301 -124 -410 -218 -352 -151
-11883 -151 -352 -381 -155 -358 -152 -281 -168 -261 -256 -250 -184 -83 -247 -320 -159 -147 -93 -360 -156 -170 -370 -67 -100 -209 -302 -208 -344
-11856 -344 -317 -303 -131 -336 -183 -184 -172 -167 -206 -240 -267 -218 -308 -237 -334 -246 -264 -262 -216 -207 -308 -283 -197 -243 -291 -232 -344 -84 -166 -296 -272 -34
-11824 -34 -262 -285 -227 -240 -282 -370 -276 -185 -273 -370 -213 -383 -193 -253 -202 -287 -214 -229 -223 -312 -368 -229 -249 -153 -232 -159 -302 -252 -221 -445 -251
-11793 -251 -364 -34 -189 -257 -182 -295 -202 -187 -248 -423 -238 -136 -227 -248 -152 -459 -296 -236 -173 -363 -384 -268 -315 -142 -189 -289 -236
-11766 -236 -203 -118 -396 -274 -183 -272 -263 -270 -236 -335 -143 -366 -222 -217 -186 -254 -282 -208 -307 -105 -238 -308 -202 -266 -280 -206 -151 -370 -282 -245 -227
-11735 -227 -200 -188 -281 -198 -27 -140 -312 -228 -138 -199 -204 -288 -201 -141 -282 -368 -204 -57 -276 -248 -163 -198 -229 -219 -38 -491 -143 -287 -365
-11706 -365 -283 -271 -131 -90 -269 -224 -268 -361 -254 -329 -103 -241 -281 -196 -177 -329 -345 -205 -183 -224 -166 -199 -251 -282 -253 -348 -224 -192 -37
-11677 -37 -261 -261 -369 -278 -207 -341 -429 -318 -256 -378 -300 -198 -258 -443 -255 -213 -140 -255 -382 -237 -311 -206 -238 -300 -168 -406 -401 -325
-11649 -325 -257 -343 -149 -274 -392 -376 -178 -207 -139 -191 -154 -261 -229 -155 -332 -369 -221 -211 -319 -273 -367 -202 -297 -347 -205 -250 -229 -215 -320
-11620 -320 -265 -198 -244 -277 -358 -266 -82 -312 -236 -279 -233 -347 -88 -424 -320 -267 -394 -184 -181 -214 -258 -190 -352 -387 -251 -289 -193 -337 -190
-11591 -190 -109 -231 -161 -291 -185 -397 -207 -320 -218 -302 -206 -322 -228 -322 -350 -283 -228 -154 -160 -283 -317 -250 -344 -185 -377 -342 -141 -302
-11563 -302 -333 -262 -402 -224 -320 -244 -312 -292 -266 -252 -215 -437 -177 -162 -377 -274 -132 -193 -336 -22 -303 -343 -291 -246 -314 -355 -292 -309 -282
-11534 -282 -389 -351 -231 -298 -390 -163 -202 -298 -327 -270 -378 -347 -467 -304 -240 -375 -389 -244 -272 -210 -260 -348 -353 -418 -339 -313 -326 -256 -175 -179 -136
-11503 -136 -252 -276 -255 -204 -260 -283 -339 -308 -184 47 -261 -189 -267 -268 -242 -398 -255 -294 -102 -359 -318 -155 -319 -293 -149 -379 -301 -299 -264
-11474 -264 -96 -345 -257 -280 -182 -57 -213 -181 -199 -367 -264 -256 -416 -187 -244 -364 -204 -193 -406 -192 -276 -180 -198 -295 -246 -211 -135 -341
-11446 -341 -274 -189 -45 -208 -343 -307 -304 -393 -193 -240 -226 -214 -232 -287 -172 -292 -193 -267 -409 -294 -327 -61 -224 -392 -194 -254 -251 -234 -449
-11417 -449 -358 -316 -140 -283 -332 -332 -163 -198 -270 -322 -294 -213 -344 -285 -231 -333 -341 -355 -192 -143 -423 -147 -270 -360 -165 -317 -257 -225 -276
-11388 -276 -518 -382 -253 -184 -269 -265 -113 -334 -305 -290 -300 -299 -231 -392 -317 -274 -243 -383 -170 -256 -291 -264 -239 -126 -379 -341 -158 -224 -357
-11359 -357 -164 -246 -147 -245 -405 -310 -440 -163 -203 -281 -239 -250 -161 -334 -265 -281 -268 -458 -272 -442 -301 -194 -199 -324 -273 -187 -308 -229
-11331 -229 -289 -198 -130 -184 -423 -308 -325 -444 -353 -284 -273 -309 -272 -202 -295 -168 -380 -364 -361 -331 -343 -192 -334 -452 -346 -228 -256 -240 -237 -278
-11301 -278 -389 -301 -382 -361 -253 -345 -176 -340 -229 -248 -228 -219 -139 -327 -225 -376 -259 -139 -464 -353 -322 -359 -110 -267 -142 -342
-11275 -342 -229 -244 -200 -81 -258 -304 -240 -135 -327 -262 -251 -152 -346 -275 -192 -201 -388 -59 -307 -485 -292 -169 -354 -300 -140 -270 -404
-11248 -404 -267 -309 -422 -351 -358 -360 -333 -345 -307 -364 -355 -100 -405 -226 -169 -221 -314 -229 -232 -331 -260 -279 -289 -317 -406 -377 -347 -310 -314 -147 -293 -334 -159
-11215 -159 -246 -230 -421 -334 -378 -429 -155 -117 -197 -374 -233 -289 -235 -221 -376 -280 -276 -280 -293 -248 -412 -386 -393 -222 -297 -359 -428 -312 -143 -295
-11185 -295 -214 -309 -165 -315 -303 -277 -328 -150 -290 -254 -191 -393 -346 -316 -331 -195 -412 -255 -237 -364 -262 -260 -234 -261 -406 -218 -247 -282
-11157 -282 -323 -274 -194 -337 -170 -246 -503 -198 -246 -316 -309 -300 -310 -400 -205 -313 -481 -412 -349 -419 -420 -471 -152 -311 -232 -219 -250 -273 -306 -397 -360
-11126 -360 -275 -186 -318 -274 -286 -279 -238 -287 -363 -310 -356 -369 -129 -288 -195 -263 -359 -230 -239 -421 -254 -385 -341 -429 -205 -183 -167 -113 -191 -306
-11096 -306 -290 -252 -186 -253 -259 -324 -208 -424 -446 -299 -160 -222 -450 -223 -415 -253 -219 -238 -313 -276 -300 -346 -347 -135 -70 -167 -233 -220 -365 -309
-11066 -309 -434 -382 -362 -259 -272 -404 -340 -289 -369 -342 -316 -376 -399 -335 -322 -360 -181 -231 -399 -349 -279 -307 -199 -225 -231 -286 -330 -526 -241 -333
-11036 -333 -496 -356 -293 -363 -261 -385 -362 -191 -327 -424 -347 -242 -236 -113 -244 -403 -202 -263 -310 -277 -386 -187 -391 -394 -342 -336 -308 -244
-11008 -244 -301 -339 -258 -517 -314 -274 -382 -222 -260 -348 -275 -368 -349 -213 -261 -286 -322 -290 -355 -353 -354 -159 -83 -396 -341 -177 -303 -361 -422 -224
-10978 -224 -198 -360 -366 -334 -317 -113 -283 -237 -152 -361 -347 -347 -249 -226 -333 -409 -310 -362 -338 -350 -395 -380 -297 -271 -336 -249 -279 -289 -232 -322 -340 -164
-10946 -164 -335 -605 -281 -417 -346 -224 -278 -351 -211 -295 -316 -207 -342 -325 -398 -194 -414 -267 -313 -319 -188 -469 -375 -222 -316 -331 -279
-10919 -279 -290 -183 -388 -272 -403 -248 -302 -460 -190 -298 -253 -351 -393 -527 -384 -290 -265 -345 -458 -362 -404 -351 -295 -432 -221 -231 -279
-10892 -279 -232 -306 -268 -224 -401 -462 -404 -310 -278 -332 -276 -286 -292 -226 -334 -500 -309 -310 -274 -252 -364 -370 -484 -353 -228 -327 -327 -369 -285 -332 -131
-10861 -131 -329 -361 -407 -353 -302 -261 -241 -364 -271 -191 -325 -355 -432 -280 -307 -250 -131 -446 -178 -381 -332 -370 -361 -325 -157 -275 -299 -412 -287
-10832 -287 -340 -264 -247 -375 -235 -388 -293 -396 -143 -211 -309 -404 -369 -177 -330 -433 -340 -164 -222 -337 -200 -327 -328 -270 -301 -372 -349 -301
-10804 -301 -333 -357 -315 -337 -248 -364 -345 -306 -338 -335 -291 -247 -332 -265 -330 -167 -279 -143 -275 -315 -290 -325 -335 -291 -298 -425 -207 -392 -303 -286 -428
-10773 -428 -318 -348 -434 -392 -389 -341 -274 -278 -355 -334 -234 -224 -371 -407 -298 -345 -307 -328 -311 -293 -274 -454 -385 -67 -214 -460 -256 -296 -443 -263
-10743 -263 -265 -361 -423 -296 -464 -265 -194 -330 -412 -219 -205 -373 -238 -172 -306 -352 -248 -464 -257 -361 -293 -223 -337 -289 -272 -343 -214
-10716 -214 -325 -409 -192 -208 -228 -234 -296 -379 -235 -325 -335 -341 -361 -269 -126 -282 -294 -262 -330 -274 -303 -397 -319 -291 -428 -326 -499 -401 -443 -316
-10686 -316 -213 -408 -299 -271 -361 -312 -208 -376 -422 -261 -270 -243 -203 -448 -333 -434 -331 -246 -411 -308 -317 -346 -197 -370 -423 -306 -323
-10659 -323 -176 -243 -408 -289 -342 -473 -272 -396 -379 -423 -537 -432 -363 -198 -272 -376 -294 -450 -269 -349 -417 -307 -192 -374 -333 -285
-10633 -285 -396 -301 -379 -377 -391 -368 -268 -229 -428 -315 -368 -347 -545 -362 -384 -324 -343 -377 -229 -453 -411 -334 -148 -371 -295 -275 -315 -375 -280
-10604 -280 -369 -507 -310 -369 -308 -437 -275 -251 -240 -284 -358 -451 -412 -176 -359 -235 -451 -324 -221 -331 -305 -359 -434 -509 -444 -360 -330 -428
-10576 -428 -304 -357 -387 -329 -377 -363 -431 -355 -414 -292 -360 -281 -81 -411 -360 -449 -341 -352 -383 -444 -245 -339 -344 -427 -375 -386 -368 -219 -484 -425
-10546 -425 -353 -230 -462 -304 -483 -408 -385 -260 -359 -401 -358 -259 -407 -320 -381 -510 -299 -414 -217 -394 -419 -282 -247 -440 -337 -482
-10520 -482 -494 -369 -283 -379 -443 -343 -216 -467 -187 -173 -380 -337 -445 -368 -383 -318 -276 -372 -294 -422 -333 -244 -361 -233 -407 -300 -433
-10493 -433 -308 -590 -312 -270 -394 -481 -486 -354 -405 -310 -368 -387 -337 -264 -487 -497 -286 -302 -430 -445 -400 -254 -373 -353 -351 -379 -362 -288 -463
-10464 -463 -262 -418 -384 -269 -367 -316 -342 -453 -183 -294 -338 -301 -476 -332 -347 -302 -415 -167 -340 -431 -404 -379 -398 -310 -359 -348 -406 -440
-10436 -440 -553 -299 -323 -357 -362 -449 -384 -491 -349 -281 -242 -419 -378 -462 -367 -284 -436 -332 -326 -473 -344 -340 -415 -515 -359 -357 -306 -537 -432
-10407 -432 -397 -314 -335 -277 -335 -472 -271 -428 -275 -530 -380 -387 -326 -428 -385 -424 -406 -331 -427 -355 -349 -187 -507 -430 -353 -316 -292 -331 -414 -387
-10377 -387 -413 -484 -328 -292 -363 -455 -313 -456 -420 -336 -344 -485 -485 -357 -517 -310 -345 -317 -399 -549 -298 -353 -248 -341 -311 -442 -389 -366 -325
-10348 -325 -394 -309 -295 -350 -254 -459 -275 -239 -315 -303 -324 -497 -258 -389 -200 -422 -408 -213 -247 -279 -352 -197 -427 -366 -240 -342 -108
-10321 -108 -337 -313 -322 -318 -374 -275 -308 -482 -261 -420 -213 -345 -327 -438 -346 -338 -258 -435 -225 -377 -337 -462 -525 -388 -504 -362 -453 -474
-10293 -474 -414 -386 -440 -354 -427 -269 -254 -310 -436 -354 -423 -369 -515 -398 -317 -350 -454 -561 -430 -539 -332 -314 -375 -338 -342 -383 -488 -383 -463
-10264 -463 -532 -320 -383 -389 -373 -611 -398 -383 -451 -475 -504 -376 -426 -463 -340 -309 -337 -491 -412 -404 -325 -372 -372 -442 -367 -253 -600 -293 -457 -556
-10234 -556 -550 -371 -369 -258 -470 -526 -451 -379 -486 -435 -323 -510 -566 -436 -455 -598 -513 -545 -425 -516 -431 -518 -239 -471 -351 -345 -386 -476 -521
-10205 -521 -322 -492 -434 -565 -514 -524 -463 -502 -494 -354 -341 -378 -297 -377 -535 -402 -356 -427 -367 -347 -355 -374 -397 -301 -417 -272 -375 -378 -360 -563
-10175 -563 -512 -392 -304 -446 -341 -357 -226 -359 -308 -260 -343 -374 -188 -293 -194 -98 -354 -98 -194 -161 -112 -79 -164 -93 -120 -117 -127 15 27
-10146 27 -102 -16 -42 11 50 -2 39 -6 -65 43 -90 -69 -24 -127 -57 -171 -298 -63 -80 -208 -204 -177 -374 -272 -242 -416 -223 -199 -396
-10117 -396 -355 -297 -250 -329 -327 -262 -239 -252 -402 -218 -203 -247 -225 -322 -135 -260 -222 -46 -209 -83 -250 -159 -138 -145 26 -26 -154 -168 -146 -73
-10087 -73 -6 -81 -36 -73 -67 43 -157 -200 -142 -167 39 -132 -253 -186 -229 -188 -231 -200 -131 -288 -230 -256 -297 -311 -421 -315 -333 -397 -501 -267
-10057 -267 -430 -594 -368 -508 -455 -453 -427 -551 -440 -300 -522 -409 -549 -450 -396 -457 -417 -458 -460 -730 -472 -518 -294 -576 -608 -476 -556
-10030 -556 -510 -334 -411 -502 -347 -506 -375 -539 -470 -595 -353 -495 -626 -583 -517 -609 -376 -407 -438 -468 -595 -437 -485 -426 -450 -276 -368
-10003 -368 -437 -582 -608 -496 -579 -482 -569 -443 -515 -379 -333 -505 -367 -555 -383 -570 -536 -531 -614 -514 -467 -540 -615 -679 -548 -547 -495 -533 -534 -466
-9973 -466 -535 -534 -530 -637 -557 -429 -481 -418 -595 -554 -547 -643 -503 -518 -674 -490 -455 -500 -475 -527 -562 -664 -576 -508 -513 -505 -630 -387 -603 -573 -471
-9942 -471 -535 -685 -596 -394 -560 -586 -729 -546 -532 -602 -479 -653 -556 -448 -656 -545 -534 -543 -360 -462 -487 -707 -572 -492 -427 -369 -494
-9915 -494 -526 -629 -510 -437 -370 -477 -480 -664 -521 -577 -477 -582 -561 -489 -517 -584 -531 -493 -504 -479 -549 -622 -590 -441 -508 -663 -613 -377 -589
-9886 -589 -454 -480 -602 -648 -471 -492 -497 -576 -677 -589 -391 -497 -540 -479 -552 -402 -579 -474 -503 -686 -595 -683 -691 -581 -583 -704 -579 -654 -508
-9857 -508 -591 -578 -554 -726 -629 -485 -592 -819 -615 -700 -566 -627 -740 -615 -653 -685 -593 -659 -637 -685 -744 -748 -475 -642 -729 -731 -649 -791 -759 -579
-9827 -579 -763 -690 -642 -665 -634 -649 -692 -569 -929 -643 -661 -829 -754 -649 -632 -685 -676 -735 -728 -767 -626 -722 -727 -591 -769 -748 -777 -740 -703 -707 -739 -790
-9795 -790 -645 -670 -621 -751 -727 -566 -726 -654 -722 -797 -677 -756 -711 -828 -733 -610 -701 -825 -675 -638 -805 -643 -653 -730 -657 -820 -729 -639
-9767 -639 -723 -688 -590 -719 -766 -561 -673 -616 -658 -712 -662 -726 -790 -652 -659 -660 -632 -658 -755 -539 -574 -698 -541 -643 -629 -727 -628 -499 -467 -449 -478
-9736 -478 -729 -609 -374 -242 -342 -347 -239 -477 -306 -108 -355 -246 -50 -45 -115 -143 -41 -1 82 129 132 95 378 401 322 341 401 511
-9708 511 656 632 615 622 706 864 828 797 943 918 1132 1340 1386 1490 1443 1630 1764 1884 2101 2281 2356 2629 2771 2857 3018 3335 3514
-9681 3514 3838 4300 4522 5029 5363 5973 6311 6945 7529 7939 8645 9231 10244 10941 11828 12631 13782 14544 15744 16854 18124
-9660 18124 19400 20566 22146 23569 25258 26894 28592 30419 32447 34409 36643 38872 41271 43590 46440 49208 52112
-9643 52112 54797 57915 60936 63907 66936 69787 72411 74619 76696 78174 79180 79845 80000 79613 78863 77815 76731 75184
-9625 75184 73573 71598 69704 67312 64803 62117 59293 56244 53142 49900 46311 43225 40055 37304 34671 32524 30814
-9608 30814 29200 28036 27319 27005 26753 26887 27101 27587 28202 28963 29833 30868 32177 33358 34752 36449 37912 39679 41622
-9589 41622 43656 45745 48014 50428 52948 55479 58230 60990 63820 66844 69233 71921 74309 76269 77747 78939 79608
-9572 79608 79941 79828 79219 78193 76932 75415 73607 71539 69180 66880 64157 61110 58046 54516 51069 47180 43574 39809
-9554 39809 35934 32528 29076 25990 23266 20994 18704 16917 15339 14208 12808 12056 11246 10244 9708 9099 8486 8149
-9536 8149 7671 7439 7058 6934 6650 6291 6012 5899 5833 5353 5424 5071 4955 4712 4702 4487 4380 4208 4042 4161 4067 3979 3864 3752
-9512 3752 3723 3514 3610 3510 3288 3291 3197 3236 3054 3149 2983 2849 2921 2772 2810 2783 2673 2697 2704 2677 2651 2577 2507 2356 2234 2356 2368 2318 2108
-9483 2108 2182 2169 1974 2165 2028 1984 2110 1970 1831 2037 2007 1785 1878 1790 1942 1693 1737 1823 1688 1778 1719 1821 1717 1823 1724 1796 1656
-9456 1656 1656 1650 1451 1711 1641 1690 1558 1519 1459 1534 1635 1518 1492 1374 1357 1344 1452 1287 1304 1435 1301 1339 1317 1321 1336 1190 1263 1188 1185 1108
-9426 1108 1129 1227 1116 1185 1102 902 1120 1158 1005 1209 1186 1070 990 1097 945 1105 1145 1002 1073 1034 1047 1143 1124 1072 1044 1130 999 1112
-9398 1112 1173 928 1226 1042 1186 1142 977 1000 1066 1016 1060 1110 838 825 915 910 956 910 893 813 778 1000 807 937 890 845 873 858 727
-9369 727 761 894 689 913 804 701 689 753 783 694 632 532 784 602 731 761 452 550 680 763 629 731 729 659 682 606 742 592
-9341 592 746 623 459 597 563 765 541 635 590 488 539 471 704 652 628 412 609 649 518 646 571 643 499 587 814 633 367
-9314 367 627 495 452 673 453 558 605 455 510 495 460 365 403 505 408 466 451 363 393 214 517 314 589 631 435 366 423 509
-9286 509 421 512 346 337 260 584 312 435 408 506 335 416 371 429 582 377 290 403 431 272 351 549 427 419 394 297 381 377 570 433
-9256 433 442 350 390 407 348 305 397 269 327 216 365 399 411 314 388 322 414 185 284 223 213 514 205 335 250 322 337 342 381 376 388 428
-9224 428 221 338 269 263 443 329 275 320 239 362 179 388 393 349 396 381 420 247 339 330 299 188 240 242 203 223 291 313 268 384 298
-9193 298 321 416 295 301 343 394 177 224 398 136 341 281 228 363 345 241 205 237 243 255 168 349 270 420 266 187 249 348 289 192
-9163 192 279 343 275 311 178 284 317 239 256 43 257 362 222 162 183 302 149 291 370 227 368 263 342 354 244 316 384 374
-9135 374 377 355 240 333 577 172 305 438 453 359 522 416 404 350 533 410 494 614 498 666 530 619 549 686 588 720 623
-9108 623 646 515 695 609 589 763 583 607 766 646 614 704 804 684 574 615 682 425 566 804 647 672 405 562 503 706
-9082 706 616 409 694 636 475 547 611 628 548 440 445 520 617 473 505 516 518 569 358 483 633 380 531 475 395 482 449 474 529 545
-9052 545 598 691 571 550 537 528 532 582 648 563 332 404 471 503 386 636 574 472 383 360 482 399 490 391 236 389 357 245 256 273 235
-9021 235 114 218 70 180 203 155 186 238 129 133 265 90 233 296 196 186 127 183 113 199 33 227 251 308 72 128 191 39
-8993 39 96 183 172 222 249 46 64 149 178 23 136 79 201 54 23 147 121 -23 134 104 20 73 128 -115 57 64 67 158 103 73 164
-8962 164 26 -43 32 -19 36 119 172 49 126 155 36 134 255 -50 18 114 203 -28 53 28 179 191 76 248 33 -12 114 45 29
-8933 29 152 117 210 290 -26 113 103 56 98 99 209 149 207 54 83 143 6 -9 -7 92 -6 150 105 -46 60 158 150 -31 120 59 -20
-8902 -20 62 124 150 104 215 201 -45 76 45 88 -59 90 139 -9 -23 -16 -158 104 38 -118 80 132 119 162 63 -124 -80 -2 -64 8
-8872 8 189 42 -23 -115 -34 43 -1 38 65 29 94 -46 -111 -67 309 -79 202 8 66 49 -170 97 -31 86 25 35 42 139 -32 -87
-8842 -87 130 33 34 186 -132 -21 136 -16 133 112 -42 102 -30 -194 -92 187 -45 34 50 -23 12 25 -16 26 65 122 -83 111
-8814 111 80 -108 91 -34 135 79 55 -8 -125 -5 -188 -172 -21 -2 122 -2 39 -15 -24 55 52 -69 3 -30 0 21 -95 119 227
-8785 227 81 121 -59 91 93 -70 -36 -105 -85 22 -3 41 50 160 34 38 138 -20 -149 -33 -96 -52 113 -76 8 -111 117 -67
-8757 -67 -59 45 102 -24 -41 40 48 -127 -73 -69 -128 -52 66 103 81 83 202 -81 -122 79 -25 111 -138 31 -172 -212 -50 49 64 52
-8727 52 -21 -60 -62 36 0 -29 -36 -16 -19 -134 -71 -109 -88 138 64 -46 -136 -123 -56 -106 -11 18 13 -6 -60 -22 -139 40 88 -173 -58 -101 155
-8694 155 -31 -123 -106 11 -35 -90 -9 -111 -107 78 45 -50 -45 -103 -26 10 23 -35 52 -35 -105 73 11 -94 -109 -48 -24 36 -53 40 34 -63 139
-8661 139 -276 -33 28 -127 -11 -144 -179 -136 -57 24 4 -39 -40 -85 -174 -51 -95 25 6 -37 -56 -158 -99 -70 -64 -153 1 78 -80 -75 -115
-8630 -115 -91 28 0 -72 -107 -80 -162 95 -149 13 -47 19 -67 -153 -158 -197 -32 -222 52 42 -76 -28 -78 -271 -127 62 -148 -192 -92
-8601 -92 101 -37 -30 23 -6 80 -60 69 -155 9 7 -51 -68 -63 19 -30 -81 -46 -53 49 11 -19 56 14 58 -10 30 52 78 -13 -85 106 135
-8568 135 55 125 39 100 116 47 13 -99 -84 -91 -144 79 -41 -118 -19 3 -21 -80 -16 -5 -167 -58 65 -54 -187 -10 100 -31 4
-8539 4 19 66 99 28 163 -8 -102 0 -17 114 85 -42 -52 134 -78 53 81 13 129 18 220 93 116 102 147 248 219 341
-8511 341 205 290 77 240 285 287 369 496 427 369 532 496 528 512 695 811 834 774 784 781 949 936 1033 1230 1243 1325 1384 1446 1564 1539
-8481 1539 1627 1538 1690 1827 1705 1553 1116 939 653 579 595 468 328 290 156 45 85 273 159 81 265 118 192 122 213 158
-8455 158 182 166 80 129 114 129 96 138 130 12 63 79 -7 -9 56 12 42 -30 46 3 -160 143 -19 2 124 33 90 -73 -2 214 -93
-8424 -93 97 44 -52 54 83 -137 114 7 1 127 16 30 -72 37 134 11 -72 79 -158 52 -34 98 5 -133 -6 78 50
-8397 50 36 91 36 -97 -2 46 -5 24 -26 -62 -12 65 71 -47 -53 78 11 -163 -113 20 2 -71 -18 33 -69 -46 -50 -80 -3 3 -48 121 -9
-8364 -9 -178 170 114 -8 216 -86 52 -89 97 -15 32 46 24 16 62 46 105 185 -50 108 29 183 87 142 -23 81 -79 -41
-8336 -41 -185 37 5 -66 102 44 0 -51 -81 -8 60 22 117 -149 55 72 34 65 44 -27 -2 75 68 29 106 74 72 -17 -62 -198 -172 67
-8304 67 113 -239 -5 63 -93 108 74 32 -117 121 91 -58 -32 198 94 -59 54 -64 57 179 144 90 -74 181 -15 -17 -32
-8277 -32 -116 -178 -111 153 94 31 -164 -105 -17 -67 42 42 -192 34 25 81 -15 39 -63 52 111 -64 -121 -241 0 -107 -44 -39 -40 -103 54
-8246 54 76 -52 -101 -36 12 -130 53 161 -81 -148 -5 -32 -1 7 26 -47 -21 -23 -87 74 44 -255 -88 -30 -206 -16 -2 71 28 -97
-8216 -97 -45 41 6 -113 35 -58 29 -4 -192 -65 -72 -89 -186 -21 -159 -5 61 -137 -132 37 150 -7 -26 -67 -126 -70 0 -75 11 -150
-8186 -150 -160 -292 -101 -85 -120 -62 -122 -30 -52 43 -215 -28 -123 -166 -54 -75 -17 25 86 -66 109 -1 -100 -110 -62 -88 -277 -50 -62
-8157 -62 -73 111 46 -2 -164 -122 7 -220 44 -40 -188 16 -183 -204 -11 -8 -145 -38 -48 -16 -73 -85 -89 -99 58 -67 -34 -220 -93
-8128 -93 47 -284 -42 4 -179 -41 22 75 -48 -175 90 -63 -124 -86 -13 103 -119 -83 85 -183 -157 -48 -203 37 -185 -83
-8102 -83 -23 -87 -132 -153 -21 -22 -172 -52 -94 -92 72 -47 -30 -87 59 -61 -67 85 -36 -150 -14 -199 -49 -87 -139 -136 -120 -40 -188 -153
-8072 -153 -71 -60 -94 38 30 -113 39 -73 -294 -68 -18 105 -78 0 -108 -186 -138 21 -81 -52 -13 -115 -6 -11 -89 -122 -85 -52 78
-8043 78 88 -21 -269 -61 -113 66 -101 -50 -73 -107 -99 -92 -208 -80 -120 -206 -189 -130 -74 -86 -133 -319 -13 -159 47 -160 -72 -149 52
-8014 52 -80 -70 -26 -75 -44 -37 -83 -124 -166 -81 -72 -125 195 -222 -1 -2 -11 -45 -28 -18 -105 -121 -169 7 -143 -95 11 -189 -130 40 -32 -119
-7982 -119 -77 27 21 -242 107 -85 -18 88 -79 -160 -107 -39 -128 -144 -55 -39 -75 -62 -222 61 -138 -36 81 -144 -69 -26 -172 -145
-7954 -145 -152 -82 -63 -6 -83 -122 41 76 -153 -104 -29 -70 -226 7 17 -119 -20 -110 -3 -96 -151 60 -96 -201 -62 -87 -29 -98 -39 -75
-7924 -75 -95 0 -48 -115 1 -203 -199 -116 -101 -225 -199 -178 -31 -77 -139 -65 32 38 -211 -62 -122 2 -184 -142 7 -111 -72 -90 -129 -264
-7894 -264 40 13 -164 -197 102 15 -91 -206 -223 2 -39 -108 -166 -86 -191 -122 -217 -172 -210 -59 -132 -200 -158 -98 -41 -63 -49 -117 -202 -121
-7864 -121 -98 -185 -273 -128 -157 -143 -70 3 -3 -149 -103 -209 -153 -191 -128 -18 -125 -229 -33 -130 -215 -147 -156 -126 -24 -100 -116 -73 -195 -245 -99
-7833 -99 -59 -93 -236 -48 13 -238 -128 -57 1 -120 -223 -286 -36 -172 -157 -34 -136 11 -234 -98 -116 -288 -212 -123 -230 -99 -81
-7806 -81 -155 -204 -108 -218 -152 -97 -198 -71 -133 4 -47 -168 -59 79 -94 24 -81 -49 -205 -104 -66 -107 -6 -117 -173 -28 7
-7779 7 -176 -226 0 -39 -215 -214 -89 -218 -88 -67 -167 -49 -119 -91 -285 -26 -148 -1 -241 -10 -1 -181 -22 -167 -81 -129 -59 -109
-7751 -109 -57 -156 -82 53 -89 -92 -104 -94 -177 -117 -112 -197 -190 -168 -116 -241 -56 -165 -256 -147 -140 -177 -178 -192 -272 0 -66 -185 -225 -90 -52 -183
-7719 -183 -4 -275 -180 -64 -88 -220 -207 -126 -175 35 -200 -117 -216 -58 -54 -227 -72 -81 -117 -127 -111 -265 -34 -38 27 -209 -200 -120 -142 -100
-7689 -100 -197 -33 -7 -13 -77 -122 -22 12 -48 -57 -76 -103 -54 -2 -141 -138 -135 -109 31 -226 -318 -111 78 -18 -100 -77 79 102 -179 -109 62
-7658 62 92 -147 50 -98 -199 -61 -123 -146 -182 -86 -22 -214 -134 27 68 -51 -83 -152 -123 -27 -2 59 80 -35 -122 95 -41 -204 -10
-7629 -10 -19 28 -15 13 239 -69 -14 1 -32 -22 150 -214 89 250 60 -31 -66 152 8 169 -3 29 56 7 177 86 -35 26 158
-7600 158 197 259 181 195 178 225 -175 48 325 223 211 166 406 157 208 249 268 354 384 301 310 228 311 436 646 572 512 403 454 439
-7570 439 518 640 525 588 781 613 738 837 727 821 775 877 943 853 852 1023 1094 1194 1191 1083 1046 1095 1326 1307 1390 1407 1439 1632 1535
-7541 1535 1815 1734 2010 1963 2111 2059 2194 2123 2195 2307 2447 2613 2833 2820 2750 2910 2906 3047 3153 3214 3535 3478 3346 3641 3590 3826 3800
-7514 3800 3961 3978 4167 4157 4313 4474 4455 4478 4517 4822 4801 4581 4920 4880 5087 4819 5061 4925 4953 5135 5197 5246 5356 5296 5292 5361 5162
-7487 5162 5362 5105 5144 5164 5367 5126 5268 5205 5103 5124 5221 4955 5119 4997 4928 4897 4759 4822 4657 4652 4689 4504 4463 4429 4429 4388 4456 4382 4137
-7458 4137 4109 4069 4038 3974 4030 3791 3899 3680 3705 3700 3639 3632 3593 3539 3502 3511 3610 3555 3394 3514 3512 3431 3319 3466 3533 3563 3671 3739 3592 3604 3629
-7427 3629 3804 3814 3805 4041 3819 4044 3974 4103 4190 4278 4388 4258 4281 4484 4531 4524 4760 4685 4826 4812 4823 4925 5103 5162 5184 5265 5259 5278 5377
-7398 5377 5517 5444 5500 5610 5589 5602 5570 5657 5693 5780 5769 5551 5570 5567 5748 5664 5688 5604 5449 5691 5441 5676 5542 5320 5396 5231 5256 5154
-7370 5154 5063 5086 5113 4918 4801 4891 4623 4522 4595 4341 4329 4163 4078 4134 3972 3907 3699 3600 3660 3545 3437 3423 3228 3222 3009 2878 2978
-7343 2978 2802 2541 2678 2495 2391 2302 2259 2253 1978 2144 2083 1993 1835 1856 1707 1694 1485 1680 1474 1499 1432 1344 1410 1282 1381 1166 1175 1185
-7315 1185 1051 984 1020 836 1128 1088 870 900 869 867 926 757 663 816 741 639 873 817 690 698 566 603 560 441 643 662 593 586 612
-7286 612 587 557 374 485 452 437 468 509 576 376 432 570 484 371 407 456 563 398 368 355 366 290 467 365 333 417 315 404 403 307
-7256 307 284 245 234 423 211 227 307 333 294 144 290 304 184 233 380 265 169 198 177 256 197 141 343 145 82 186 315 120
-7228 120 182 204 200 144 150 220 195 290 184 211 218 213 124 183 99 16 76 170 246 132 101 330 27 84 197 106 176 304 251 144 98 134 63
-7195 63 199 168 238 296 208 67 3 37 102 84 109 132 55 61 160 101 195 160 -7 233 172 156 83 245 43 218 9 196 66 31
-7165 31 89 171 22 -80 181 -12 176 127 83 232 183 195 138 -11 -24 -44 46 53 100 168 -125 60 199 38 77 -20 24 -62 96
-7136 96 -88 179 -12 22 73 -84 54 -140 8 86 57 37 -149 165 75 -101 -105 165 173 91 33 67 78 33 47 67 68 -17 123 54
-7106 54 143 -59 107 76 73 27 81 27 44 150 73 19 -47 -188 7 -90 51 84 96 44 62 92 195 -14 -102 182 -4 88 -147 129
-7076 129 125 91 103 9 -39 62 111 104 -35 -59 112 82 -63 -65 -26 49 34 -80 124 48 129 -7 82 47 -85 88 53 199 -7 108
-7046 108 89 83 20 13 116 132 49 -55 42 105 -74 2 237 16 108 12 -38 -13 -40 8 -182 -124 74 -11 -62 -101 18 66 -49 -30 -99
-7015 -99 -67 -23 -155 -139 22 -71 161 137 -62 69 -56 102 -121 176 102 -19 13 -13 46 69 43 -8 -32 -13 21 -96 76 -65
-6987 -65 -89 -190 -104 -87 4 -37 89 -24 -38 -65 -2 50 113 13 -109 -211 -118 98 -17 91 -188 42 -132 32 79 69 -20 -15 104
-6958 104 -14 -43 13 -49 2 17 -215 -184 -11 68 -305 -97 -60 -6 -72 129 -10 -133 119 2 -8 98 3 72 -9 -66 -153 -53
-6930 -53 -38 -52 -7 -39 75 -143 -87 -57 -95 -99 -129 -120 5 -231 -173 -88 -151 -7 158 -75 128 -127 -107 11 -3 -10 21 90 -1 -163 -175
-6899 -175 70 33 -37 -51 -25 -97 82 -142 -117 -269 -43 -46 -209 -93 -57 -32 -19 -24 -149 -57 -66 9 -65 -45 -182 -206 80 9 -9 0 -7 -133
-6867 -133 87 -140 -87 -139 -161 69 -289 -14 -38 3 76 -174 0 -49 0 -60 -20 56 -115 -104 -86 -110 -73 -28 -16 28 -17 -138 -64 -85
-6837 -85 -202 77 57 -60 -86 28 -149 93 131 -146 -213 40 -151 -154 -28 -38 -167 -126 -3 -23 -59 -202 -29 73 22 -150 -241
-6810 -241 -18 70 -132 43 1 10 -62 -51 -43 -11 83 -8 -130 -105 -44 188 -160 47 79 13 30 4 -9 -70 -30 -118 -30 75 -93 -60 24
-6779 24 8 91 75 -54 -179 15 -99 68 19 -46 23 113 88 -40 -96 35 220 257 -54 -17 85 7 106 235 4 190 73 54
-6751 54 137 30 130 126 199 136 361 327 198 100 129 345 321 293 206 276 186 352 279 148 351 338 446 294 540 383 386 328 516
-6722 516 486 382 519 389 516 505 446 496 471 558 573 596 610 544 605 721 674 608 714 769 785 785 633 734 861 568 714 886 768
-6693 768 780 977 939 869 844 882 850 948 1056 1085 1050 1041 993 1128 1165 1149 1304 1155 1141 1440 1313 1381 1485 1327 1550 1465 1435 1615 1699
-6664 1699 1735 1847 1862 1834 1929 1996 2090 2111 2203 2228 2478 2506 2669 2823 2663 2800 2928 3028 2939 3004 3106 3363 3375 3365 3564 3699 3588
-6637 3588 3799 3888 3885 4228 4288 4302 4490 4570 4804 4824 4702 4984 5157 5261 5298 5472 5427 5607 5735 5791 5895 5880 5950 5816 5816 6141 6043 5944
-6609 5944 6077 6238 6326 6242 6200 6181 6272 6182 6359 6358 6358 6177 6305 6254 6264 6402 6406 6468 6383 6378 6290 6352 6409 6564 6450 6410 6522 6719 6740 6802 6978
-6578 6978 7161 7317 7472 7463 7677 7881 8002 8284 8521 8546 8784 9042 9417 9633 9933 10186 10485 10691 11001 11409 11795 12192 12567 12820
-6554 12820 13303 13812 14116 14982 15214 15835 16555 17314 17819 18412 19148 20028 20582 21261 21879 22309 22505 22589 22380 21981 21028 19926
-6532 19926 18679 16929 15653 14077 13142 12353 11309 10684 10047 9405 9034 8454 8166 7927 7612 7322 7086 6760 6521 6392 6132
-6511 6132 5926 5813 5572 5410 5262 5029 4870 4722 4611 4770 4468 4260 4074 4095 4041 3760 3763 3553 3514 3560 3332 3313 3232 3129 3061 3002
-6485 3002 3000 2875 2942 2679 2620 2612 2438 2437 2445 2348 2250 2283 2195 2008 2154 2015 1837 1999 2049 1857 1891 1740 1769 1702 1736 1816 1723 1573 1689 1754
-6455 1754 1720 1719 1586 1526 1557 1629 1450 1609 1618 1505 1410 1535 1340 1310 1457 1421 1606 1324 1302 1231 1117 1165 1217 1336 1051 1136 1161 1121 1131
-6426 1131 1120 1087 1219 1030 959 1001 1024 1061 945 879 1057 1113 954 1053 958 937 798 780 1011 1003 833 761 979 860 717 786 687 713 694
-6397 694 765 646 591 566 675 696 507 686 706 485 590 563 670 473 447 709 399 551 658 533 559 505 510 526 405 450 486 603
-6369 603 490 306 539 527 361 287 604 424 542 361 323 460 137 412 508 604 347 328 372 333 491 361 437 560 210 460
-6343 460 441 257 375 221 351 416 367 258 346 184 209 271 187 512 235 256 312 486 366 161 544 449 148 280 380 81
-6317 81 84 316 229 236 171 152 175 293 329 249 202 78 196 46 244 217 253 340 188 170 188 247 149 -30 192 168 302 473 148 85
-6287 85 214 234 406 281 207 170 244 88 272 359 85 275 113 275 205 217 295 108 63 31 164 292 311 270 164 59 159
-6260 159 319 202 169 21 192 152 236 205 38 94 124 79 220 156 220 173 293 225 202 239 124 195 118 257 323 247 127 261 202
-6231 202 312 123 146 277 371 172 195 109 104 318 365 63 82 251 154 186 115 136 111 109 190 8 167 176 165 78 140 284 190 236 66
-6200 66 100 204 107 106 252 73 112 108 196 86 274 74 202 143 85 93 271 191 -1 169 220 120 38 151 31 154 78 21 5
-6171 5 31 -17 1 145 294 -1 181 -68 38 135 156 306 87 49 5 215 135 79 130 235 193 -18 126 90 112 161 0 131
-6143 131 174 75 148 180 49 66 21 276 112 242 195 1 26 27 200 34 -22 42 30 114 212 84 28 -68 59 93 78 123 262 210
-6113 210 4 228 63 43 250 64 145 37 180 82 123 173 182 124 134 132 121 289 130 56 -23 86 123 101 7 111 -43 89 50
-6084 50 109 123 32 -38 -17 157 131 153 69 -1 51 -17 81 -31 83 40 -16 99 59 189 -2 254 90 69 276 27 8 172 111
-6055 111 121 105 110 10 51 170 6 -45 198 -93 116 184 -51 18 96 -10 -54 23 -43 75 -39 22 109 102 167 148 150 166 -20 121
-6025 121 54 168 -129 134 159 35 261 -9 128 -15 60 124 131 136 183 143 37 118 156 105 42 -59 -12 -7 50 190 72 36 88 85
-5995 85 71 212 161 228 63 94 -35 24 92 105 254 46 185 83 44 116 120 171 162 316 126 104 200 173 298 41 144 101 348
-5966 348 246 314 275 316 454 445 420 154 304 259 106 378 410 254 379 137 249 309 58 162 419 198 187 222 176 342 323
-5939 323 323 399 475 394 435 482 272 365 338 462 561 617 486 540 571 450 321 436 448 305 387 391 167 162 185 176 280 108 128 42 -3
-5908 -3 119 275 3 103 111 97 47 69 52 125 14 105 5 -91 185 22 87 -31 96 74 90 39 -8 90 12 157 37 13 170
-5879 170 109 52 -19 33 123 200 133 -19 114 -27 169 127 48 208 33 73 -38 55 216 169 150 -11 262 158 -5 282 -47
-5852 -47 146 -7 72 65 142 149 -49 104 114 114 91 17 148 94 32 7 41 120 190 17 -174 99 17 222 57 103 111 199 -2 100 130
-5821 130 -93 19 -65 -67 204 221 81 153 71 83 46 116 146 78 151 32 101 151 116 29 14 -66 -7 166 70 74 165 62 -33 98 -10
-5790 -10 48 90 28 -27 320 -28 -15 9 -19 98 128 180 146 182 148 45 13 104 129 21 58 217 133 112 76 93 122 83 -23 135 74
-5759 74 31 174 170 138 80 95 258 -10 74 112 125 198 192 180 188 196 287 238 365 318 380 456 163 280 290 137 247 237 214 298 208 393
-5727 393 390 320 285 411 338 274 336 409 423 477 360 409 430 303 171 391 463 270 191 280 220 116 309 168 237 114 296 237 159
-5698 159 228 94 177 132 74 211 181 -39 111 -100 267 90 14 61 67 87 133 274 -13 35 78 78 58 164 6 305 -34 73
-5670 73 22 -28 78 108 159 166 192 63 104 31 164 113 98 127 -196 26 117 153 92 129 310 21 152 51 31 9 38 129 128 68 55
-5639 55 -25 22 -2 -28 68 1 -133 185 57 176 142 62 52 114 191 153 161 -33 42 145 165 338 70 115 198 60 78 130 288 112
-5609 112 97 46 273 255 100 41 234 40 160 72 206 119 166 36 261 136 58 97 57 213 -14 116 147 316 236 209 90
-5582 90 256 138 143 136 221 225 152 139 313 250 173 243 339 189 300 318 174 252 91 133 155 252 377 188 329 371 292 183 185 202 214
-5551 214 261 91 348 226 227 322 121 95 220 174 174 146 118 176 145 348 255 136 157 177 203 295 238 251 304 -2 332 373 279 214 180
-5520 180 203 221 144 317 179 165 181 177 292 235 304 289 284 366 311 227 293 260 427 259 296 329 318 251 325 220 240 390 337 350 341 259
-5488 259 341 241 241 346 424 164 374 479 407 436 258 372 398 422 412 461 450 435 413 401 247 397 493 358 427 396 340 608 344
-5459 344 453 368 625 459 415 472 548 549 304 479 475 709 388 510 469 333 541 506 319 493 373 505 531 580 500 502 426 454 426
-5430 426 467 759 586 735 540 607 670 472 391 529 691 745 593 827 743 732 639 523 552 642 993 706 700 793 756 745 774 593
-5402 593 711 842 622 703 706 661 721 751 779 806 865 773 708 887 905 1044 1024 928 970 938 932 991 1060 1031 1120 1270 1053 1053 1233 1149 1283
-5371 1283 1121 1237 1333 1436 1338 1428 1422 1281 1481 1443 1501 1466 1289 1577 1642 1423 1400 1388 1301 1173 1424 1327 1278 1211 1343 1346 1291 1282 1256 1182
-5341 1182 1233 1254 1284 1504 1393 1359 1361 1227 1419 1482 1537 1540 1523 1534 1587 1667 1734 1736 1722 1853 1818 1861 1914 2004 2033 1908 1847 1931 1815 1881 1859 1922
-5309 1922 1879 1904 1863 2033 2117 2061 2081 2075 2104 2168 2186 2173 2187 2269 2340 2529 2492 2737 2854 2656 2843 2894 2939 3115 3197 3280 3524 3244 3587
-5280 3587 3745 3884 3996 4053 4393 4478 4575 4636 4882 5055 4928 5414 5606 5617 5673 6225 6453 6537 6759 6758 7186 7255 7571 7682 7899 7980
-5254 7980 8037 8053 8145 8285 8425 8434 8492 8673 8706 8864 8906 8834 8915 8977 8824 8846 8868 8829 8552 8523 8487 8297 8078 7886 7618 7295 7107 6765
-5226 6765 6584 6259 5882 5636 5229 4883 4710 4339 4255 3980 3733 3853 3479 3372 3526 3185 3219 2978 2977 2873 2919 2925 2737 2888 2701
-5201 2701 2686 2589 2608 2396 2387 2380 2321 2239 1998 1945 1995 1976 2046 1979 1993 1895 1788 1748 1883 1794 1611 1706 1700 1551 1803 1614 1659 1625 1544 1645 1502
-5170 1502 1595 1538 1636 1355 1487 1425 1411 1489 1494 1506 1467 1330 1349 1513 1439 1259 1422 1526 1401 1430 1528 1318 1305 1316 1332 1537 1398 1380 1411
-5141 1411 1259 1237 1491 1301 1392 1361 1291 1321 1186 1329 1257 1114 1261 1296 1155 1100 1150 1238 1141 1258 1149 1155 1244 1186 1170 1162 1144 1172 1122 1152
-5111 1152 1224 1231 1292 1217 1191 1159 1223 1107 1091 1181 1153 1071 1290 1098 1215 1165 1125 1109 1117 1192 1068 973 937 1252 1152 1061 1195 1196 1141 1014 1037
-5080 1037 1102 1111 1129 1118 1224 1062 1215 1126 1090 923 1257 1031 1107 1234 1004 1223 922 1202 1091 1059 1150 1036 1087 1090 996 1036 1036 883
-5052 883 977 1064 1036 872 1010 1009 927 972 1042 1034 936 1201 977 985 1126 975 984 899 1000 1002 983 1095 979 945 951 1025 921 1044 961 1033 1055 1047
-5020 1047 1094 944 965 1040 1095 841 1077 1112 1081 1004 1076 1124 1057 1086 1119 1060 980 1082 1153 1164 1061 1255 1228 1194 1278 1213 1269 1272 1056 1128 1162
-4989 1162 1249 1211 1120 1150 1125 1283 1274 1266 1104 1154 1259 1082 1212 1196 1159 1161 1159 1213 1056 1228 1224 1070 1122 1337 1090 1136 1282 1160 1222 1050
-4959 1050 1106 1321 1251 1163 1246 1313 1116 1140 1181 1201 1204 1102 1164 1055 1065 1003 1122 1291 1183 1005 1247 1182 1130 1361 1197 1099 1236 1256
-4931 1256 1290 1404 1283 1457 1601 1545 1542 1543 1588 1525 1625 1747 1810 1722 1900 1863 1881 2024 2128 2174 2127 2288 2410 2476 2478 2558 2632 2698 2821
-4902 2821 2922 3011 3026 3245 3305 3320 3227 3295 3597 3401 3584 3567 3651 3619 3832 3766 3763 3886 3955 3840 3822 3858 3903 3853 3938 3913 3966 4057 3892 4006
-4872 4006 3752 3942 3862 3900 3938 3794 3831 3877 3837 3805 3630 3737 3531 3453 3511 3594 3474 3596 3490 3471 3596 3326 3476 3370 3400 3594 3602
-4845 3602 3509 3504 3590 3594 3650 3735 3670 3888 3763 3799 3924 3862 3783 3901 4119 4231 4215 4413 4606 4522 4778 4717 4733 4918 5115 5179 5144 5253 5367
-4816 5367 5475 5558 5643 5898 5899 5883 6064 6121 6197 6013 6309 6304 6341 6884 6603 6566 6793 6839 7041 6769 6899 6906 6950 7015 6811 6866 6857 6738 6795
-4787 6795 6729 6704 6559 6534 6445 6171 6073 6067 6021 5809 5937 5747 5529 5440 5505 5363 5164 4977 5035 5070 4970 4749 4767 4623 4638 4456 4427 4509
-4759 4509 4202 4132 4136 3946 3902 3994 3792 3812 3755 3759 3770 3695 3623 3625 3759 3520 3522 3637 3551 3677 3536 3607 3618 3529 3625 3535 3539 3594 3479 3446 3740
-4728 3740 3782 3548 3798 3742 3891 3809 3847 3875 4091 3800 4050 4119 3941 3936 3946 4030 3903 4098 4064 3995 3874 4073 3923 4007 3729 3740 3789 3838
-4700 3838 3629 3675 3489 3353 3374 3217 3374 3267 3036 2884 2920 3013 2878 2647 2811 2669 2525 2571 2451 2349 2182 2247 2173 2142 1910
-4675 1910 1978 1856 1603 1741 1677 1736 1429 1402 1558 1429 1306 1210 1283 1436 1273 1305 1267 1201 1175 1275 1131 1063 1275 1075 1050 1072 1050
-4648 1050 1292 1146 1148 1057 1264 1328 1050 1162 1047 1016 1206 1091 1193 1072 1284 1344 1108 1138 1323 1302 1131 1255 1148 1282 1181
-4623 1181 1165 1260 1348 1254 1318 1303 1204 1102 1218 1146 1257 1220 1145 1303 1285 1163 1223 1342 1204 1224 1204 1126 1195 987 1154 1143 1028 1185
-4595 1185 1056 1168 1092 1114 1033 999 1130 1086 1074 975 975 1029 1034 832 861 1028 874 859 987 883 664 803 693 810 789 879 612 639
-4567 639 879 654 587 644 535 727 434 482 597 469 607 573 512 425 572 481 659 442 658 478 422 419 387 523 472 465 581 505
-4539 505 316 434 347 377 453 463 441 572 548 354 367 511 455 361 392 553 407 223 484 493 397 416 409 405 467 584 484 352 537
-4510 537 422 282 272 442 447 429 483 393 389 488 431 302 340 333 492 564 469 417 371 299 485 384 407 262 258 281 512 450 287 398 433
-4479 433 382 363 388 436 544 459 426 317 366 512 402 247 284 271 420 383 446 416 429 347 355 389 352 377 270 356 288 275 451 324
-4449 324 141 278 357 175 408 199 333 303 285 295 208 427 328 418 380 344 234 404 411 402 351 392 246 468 254 338 312 148 366
-4420 366 310 339 256 331 243 135 249 366 401 357 109 429 24 298 403 272 249 292 391 136 240 233 207 319 206 186 467 261
-4392 261 178 214 235 135 289 142 197 264 355 104 161 363 192 13 258 409 337 272 382 265 389 400 227 257 109 322 118
-4365 118 205 264 290 270 448 373 287 129 182 253 278 67 342 246 230 364 275 317 134 292 374 284 188 318 385 330 134 316 323 374
-4335 374 291 198 255 60 150 244 347 455 256 300 221 327 427 144 268 274 196 332 258 221 122 414 265 438 368 228 233 117
-4307 117 374 288 270 222 209 182 141 187 195 46 231 260 342 362 240 300 290 174 243 367 146 220 346 170 206 243 338 295 163 200
-4277 200 186 199 193 239 286 310 201 160 154 144 213 -105 356 204 305 203 161 228 15 318 142 92 127 303 145 346 138 213 130
-4248 130 115 295 118 273 79 52 190 258 269 170 250 178 170 251 230 142 84 240 270 217 178 287 262 176 315 168 209 228 232 114
-4218 114 246 176 86 179 123 231 222 122 82 235 177 216 84 53 69 9 154 189 62 94 84 232 153 201 59 36 260 64 80
-4189 80 106 77 170 142 110 182 127 -27 248 245 87 280 188 -10 164 181 226 170 153 42 -42 99 48 69 131 128 104 28 196 292 99
-4158 99 267 -56 108 24 146 66 138 253 109 107 95 167 104 1 -5 239 153 52 22 82 231 12 96 34 71 136 78 170 81 -10
-4128 -10 24 135 143 92 23 183 -76 296 182 158 183 96 -125 135 17 41 -4 195 233 102 206 56 116 72 39 -19 311 22
-4100 22 70 108 2 72 186 -30 173 114 -3 16 183 158 225 102 -6 51 118 195 178 -7 -42 74 270 8 52 97 -47 137
-4072 137 -28 80 101 77 46 195 77 232 -4 89 96 93 155 88 -24 125 147 24 208 145 18 157 165 -20 168 139 147 205 187
-4043 187 118 198 189 303 167 -16 116 61 167 34 116 145 63 115 84 144 10 61 126 256 269 229 62 172 158 188 132 62 193
-4014 193 90 116 76 176 -9 148 349 37 152 139 186 156 89 97 54 142 190 65 148 314 145 83 185 224 37 215 284 292 134
-3985 134 188 180 175 160 3 66 137 45 -50 -49 138 36 243 126 -79 187 94 209 43 120 258 177 118 175 129 147 215 260 189 189 21
-3954 21 189 238 205 235 148 205 213 113 282 180 164 123 285 170 127 232 72 234 6 270 215 162 121 145 117 216 78 94 240
-3925 240 205 145 309 179 54 172 59 65 107 152 139 129 107 67 174 55 12 120 199 206 116 129 140 117 62 179 137 63 -28 74
-3895 74 42 54 148 128 -9 105 81 306 89 175 213 0 1 82 39 42 28 5 213 79 68 41 57 -17 -32 116 161 46 133 -57 42
-3864 42 234 86 47 115 96 118 201 63 159 76 -70 82 34 84 96 138 82 270 94 137 53 -6 227 296 60 67 134 183 128 159 200
-3833 200 259 252 48 159 114 166 164 249 163 130 113 267 254 490 376 238 216 182 149 277 211 394 340 134 265 349 370 376 415 481 550
-3802 550 372 424 649 407 386 299 385 453 485 438 473 470 415 593 467 728 390 594 621 504 554 567 596 684 620 672 706 729 695 902
-3772 902 677 1009 820 968 1102 706 1093 1055 1170 1024 1081 1034 987 1127 1082 1039 1006 1046 1031 897 1100 976 1135 1014 986 1005 1049
-3745 1049 1064 1172 1047 1008 1023 933 1048 1127 1098 1036 986 1061 1051 1095 1073 1216 1059 1027 1161 1132 1061 1066 1148 1140 1322 1198 1297 1255 1506 1252
-3715 1252 1562 1519 1538 1577 1410 1506 1641 1632 1516 1579 1489 1627 1504 1529 1594 1621 1471 1456 1498 1336 1313 1189 1189 1285 1147 1180 1141 1139 1203 970
-3685 970 999 1025 1138 1139 1068 1215 1162 1090 1113 1125 1123 1227 1165 1117 1242 1277 1091 996 1179 1230 1268 1298 1188 1123 1119 1111 1084 1227 1339 1325 1165
-3654 1165 1196 1229 1262 1247 1302 1165 1156 1101 1237 1156 1155 1066 1190 1313 1021 1174 1078 1003 1081 995 860 1020 1003 1021 864 932 1131 1003 991
-3625 991 968 810 1032 928 1105 984 946 1022 956 1153 915 1019 917 970 1270 1068 1067 932 1074 1194 1157 1063 1099 967 1058 1093 1040
-3598 1040 1078 1030 1110 907 1233 1007 1050 999 1012 1092 1035 1159 1043 1129 1095 959 989 1122 1109 1094 1085 1073 1171 1064 1045 959 1123 1115 1293 1195
-3568 1195 1054 1304 1208 1163 1208 1199 1203 1173 1323 1183 1240 1311 1245 1189 1269 1253 1285 1447 1170 1395 1290 1383 1267 1468 1224 1150 1273 1370 1361
-3539 1361 1267 1258 1226 1300 1263 1161 1283 1429 1222 1230 1198 1210 1310 1143 1370 1201 1004 1274 1241 1187 1213 1150 1175 1404 1117 1295 1099 1180
-3511 1180 1276 1146 1232 1283 1245 1251 1164 1276 1102 1210 1290 1360 1307 1273 1231 1232 1350 1069 1199 1122 1233 1241 1146 1269 1103 1094 1069 1005 1056 1117 1003
-3480 1003 1122 1108 1026 1107 792 1024 976 1056 958 925 891 1120 800 1004 921 952 1033 816 934 797 1034 911 1045 1020 882 1107 945
-3453 945 856 1042 886 921 984 895 914 1021 815 1039 921 939 989 1037 953 939 998 1034 945 854 917 1070 1042 1088 1020 1006 963 901 1021 883
-3423 883 1039 985 1111 1026 1072 1031 878 971 972 1149 1074 1042 1081 986 951 1056 1117 1056 1238 1152 1046 972 1075 1183 1223 1039 1147 1118 1234
-3394 1234 1170 1232 1134 1135 1311 1097 1229 1146 1312 1201 1045 1253 1131 1134 1464 1408 1386 1319 1253 1334 1360 1268 1407 1351 1406 1400 1446 1438 1441 1437 1296
-3363 1296 1523 1558 1594 1629 1462 1539 1523 1602 1536 1667 1804 1591 1802 1759 1602 1687 1659 1634 1712 1636 1899 1796 1870 1987 1872 2038 1841
-3336 1841 1850 1914 1959 1970 1970 2017 1941 2123 2011 2069 1996 1947 2088 2016 2104 2124 2154 2145 2028 2209 2308 2129 2109 2202 2276 2279 2278 2295 2250 2398 2420 2374 2477
-3303 2477 2457 2438 2433 2586 2391 2493 2578 2506 2547 2601 2723 2662 2669 2742 2741 2805 2632 2850 2856 2741 2785 2803 2907 2877 2953 2875 2948 2973 3052 3094 3010 2898
-3271 2898 3102 3086 3102 3129 3061 3113 3170 3176 3374 3305 3327 3306 3277 3332 3175 3365 3428 3269 3317 3438 3338 3600 3346 3348 3421 3362 3556 3505 3495 3485
-3241 3485 3538 3683 3503 3490 3487 3367 3430 3392 3392 3436 3533 3448 3650 3611 3503 3603 3639 3618 3531 3549 3507 3510 3532 3707 3532 3385 3602 3708 3586
-3212 3586 3427 3575 3579 3476 3516 3506 3502 3786 3550 3476 3610 3430 3554 3498 3560 3612 3521 3646 3683 3640 3503 3532 3517 3446 3659 3576 3532 3642 3518
-3183 3518 3541 3506 3633 3622 3494 3673 3541 3486 3556 3595 3534 3539 3504 3561 3649 3657 3586 3597 3549 3477 3359 3444 3464 3293 3385 3391 3491 3350 3279 3407 3440
-3152 3440 3382 3343 3360 3381 3261 3279 3142 3224 3312 3151 3225 3106 3047 3359 3174 3125 3055 2939 3001 2977 2968 2937 2963 2812 2777 2798 2962 2808 3007
-3123 3007 2804 2854 2846 2791 2789 2802 2903 2612 2746 2700 2740 2639 2766 2691 2531 2604 2639 2529 2552 2513 2577 2492 2557 2673 2488 2498 2289 2544 2325
-3094 2325 2186 2396 2264 2344 2314 2272 2417 2261 2218 2231 2098 2186 2053 2129 2153 2082 2142 1980 2041 2074 2019 1898 1932 1862 2002 2036 1890 1782
-3066 1782 1762 1808 1665 1892 1812 1742 1703 1662 1803 1785 1661 1713 1634 1680 1657 1687 1538 1579 1560 1558 1694 1626 1554 1493 1552 1639 1468 1547 1741 1425
-3036 1425 1697 1577 1634 1461 1413 1686 1477 1344 1537 1432 1462 1333 1374 1531 1247 1454 1257 1216 1391 1122 1161 1204 1284 1195 1019 1069
-3010 1069 1172 1045 860 1104 980 1034 918 875 870 862 822 861 858 937 813 760 764 805 827 664 740 648 753 707 730 869 810 758 671 655 776
-2979 776 754 685 689 810 756 606 723 649 574 738 422 679 693 538 790 699 736 682 494 634 712 694 697 505 461 608 533 544 333
-2950 333 466 523 427 528 288 424 510 440 415 397 340 510 297 293 360 321 344 329 202 339 351 296 440 262 283 288 258 339 224 267
-2920 267 335 287 414 367 470 317 228 260 226 291 323 332 353 282 244 438 377 259 137 259 214 221 250 141 331 139 337 353 168
-2891 168 207 285 350 219 331 261 167 202 166 120 -64 76 221 79 187 274 103 129 344 273 -20 242 74 103 128 39 206 125
-2863 125 215 100 301 220 167 173 123 169 183 100 -14 202 337 145 214 121 215 157 252 115 212 178 38 82 183 288 60 47 -29
-2834 -29 226 270 255 68 102 76 140 -27 176 150 35 119 84 120 165 112 127 177 141 270 95 -14 74 66 132 77 136 116 133 166 201
-2803 201 188 166 182 -124 50 87 184 168 170 51 86 40 15 116 167 62 -3 -4 189 139 69 108 190 212 71 204 114 0 9 -69 141
-2772 141 122 109 197 116 194 19 219 34 178 109 72 84 -52 102 128 124 -40 44 98 46 213 -20 55 -151 174 221 34 51 -39
-2743 -39 128 19 162 108 146 40 47 -15 100 45 104 11 150 87 85 140 51 -29 157 163 19 48 51 123 -8 91 -55 2 55 37 -42 -35
-2711 -35 -83 8 4 21 89 27 227 137 23 -35 -102 153 183 -6 -60 137 103 25 21 4 171 135 -76 -27 77 70 74 72 78 39 108 -39 149
-2678 149 268 -95 103 246 -74 -89 23 -8 -45 144 172 38 179 239 -1 32 61 -65 128 93 144 -59 135 237 13 62
-2652 62 -31 -13 11 0 -88 -41 49 -87 -47 -51 -166 7 62 52 -31 -35 -123 110 64 21 -77 -84 -8 40 106 186 113 -63 37 115 38 -46 -7
-2619 -7 5 26 84 51 -142 128 72 147 -43 10 101 28 81 25 51 -79 -71 40 98 1 144 157 -101 -31 -73 121 16 27 101 -74 -24
-2588 -24 48 94 21 43 13 5 83 171 -4 31 47 79 -14 1 25 119 -34 43 92 28 -22 78 81 -66 -38 -50 53 76 -27 12 105 -81
-2556 -81 77 104 0 90 -68 -155 -55 35 -6 -40 27 -140 -1 -211 -135 -59 0 75 -30 -32 -16 -33 -82 -79 -20 -90 -157 -10 -138 -210 11
-2525 11 -32 35 67 -87 -65 4 217 -114 -105 91 -1 -22 -3 30 71 21 155 32 21 -43 -63 76 -66 -72 -31 73 -6 -201 -170 -202 -130
-2494 -130 -23 -16 160 31 56 37 -73 0 -118 -139 7 60 27 -80 41 -97 -11 -18 -125 -82 -156 -2 -63 36 -15 122 32 -171 -76
-2465 -76 -74 -88 -181 125 -92 -218 98 -7 -1 -10 -7 42 14 -47 -104 -37 -48 35 -28 -89 51 -71 -83 38 86 83 43 -133 -15 36 -150 -195
-2433 -195 -45 131 -35 47 35 -127 -33 -115 -57 60 -68 -33 -83 5 152 19 -127 -37 245 -81 -22 11 -97 110 -16 -30 -139
-2406 -139 8 96 56 -121 -13 32 -65 -138 -176 -71 6 25 -64 -53 4 -69 -157 -25 -132 -67 -186 -96 -124 -165 -9 15 -165 11 18 -19
-2376 -19 -41 -122 -88 -71 -185 -113 32 -101 -17 -88 85 -166 -11 -2 72 -123 -118 -103 -231 -63 -96 7 11 -24 -31 11 -143 -9 -136 -160
-2346 -160 -43 -155 -71 -34 -64 -10 55 -48 -148 -52 -15 50 -115 -42 -13 -92 -22 -151 -163 -75 -98 -21 -168 -268 -6 37 -179 -33 -2
-2317 -2 -132 109 -27 -41 8 -4 81 -28 -49 9 -77 -104 -84 -34 -167 74 164 -19 7 -283 -92 56 0 -55 73 -151 -138 -64 -52
-2288 -52 39 -167 -99 -81 -80 -101 81 -111 -85 -33 141 50 -165 17 -77 -120 -146 79 54 -116 81 17 -105 -5 -16 -76 -58 -206 -92
-2259 -92 30 21 -44 -22 -179 -35 40 -130 -78 -204 27 36 -57 -129 -89 -112 -167 -133 17 -10 -63 -167 -45 26 -43 -4 -118 -72 -27 -65 -148
-2228 -148 -132 -124 -163 111 -143 -146 -68 12 -55 -24 117 -212 -153 -148 -125 -263 1 63 -47 -158 -151 -185 -30 -73 55 106 -112 -92 -40 -203
-2198 -203 -274 -80 -62 -68 -111 -218 -175 -3 -172 -176 -89 -105 -111 117 -25 -16 -57 -213 -36 -159 -43 -197 -173 -9 70 80 -157 -138 -140 -76
-2168 -76 -228 -152 -105 -83 -64 -34 -79 -261 -148 92 -182 0 -49 -43 -172 -75 -87 -75 29 -107 -112 -153 -60 -181 4 -212 92 -243 -146
-2139 -146 -24 22 -53 -25 -148 -142 -37 -216 -17 -152 -276 -100 -119 -61 93 -96 -113 -139 -93 -60 -105 -99 5 57 -155 -211 -5 -203
-2111 -203 -125 -75 -155 -215 0 -144 -154 -146 70 -155 -83 -80 -125 -124 -126 -236 -8 40 -216 110 39 15 -185 80 96 0 -189 -72 -31 -123
-2081 -123 -202 -26 -186 42 -177 -77 22 -188 -200 -35 -139 -80 -121 -4 -25 -356 -37 -286 42 -133 -77 -351 -85 -111 -169 -25
-2055 -25 -73 -87 -161 -48 -49 55 -143 -142 -59 -82 -226 -200 -128 -104 -83 -88 -48 29 -7 -204 -39 -218 -31 -154 -222 -17 -25 29 -205 -70 -255
-2024 -255 -191 53 3 -108 -99 -135 95 -191 45 -226 -24 65 -194 11 -14 -75 -114 -181 -76 49 -95 -30 -359 -39 -90 -153 -41
-1997 -41 -68 74 51 -32 21 -148 -80 -109 -170 -202 -23 -167 32 -24 -320 -114 -168 -112 -33 -34 -146 -278 -263 -47 -149 -128 -213 -111 -30
-1968 -30 -224 -1 -56 -117 -175 -152 7 -98 75 13 44 -40 -43 41 -9 -91 -127 -102 -61 -129 -36 -20 -95 -244 -199 -59 -185 -66 26 -176
-1938 -176 -239 -96 -44 -60 -157 -132 -5 17 -116 -200 -218 -77 -183 -214 -172 -20 30 -56 -194 -71 -16 -122 -17 -7 -60 -49 32 -109 -35
-1909 -35 -66 -166 -204 -190 -222 -103 38 -285 -32 -77 -101 -243 -173 17 -197 -131 -246 -70 -93 -128 -142 -140 -96 -68 -121 -310 -54 3 -102
-1880 -102 -14 -277 -95 -74 -76 -71 -286 -74 -12 -94 -107 -57 -121 -162 -55 -55 -132 -219 -94 -124 -137 -115 -158 -64 -170 15 11 -190 -170 -55 -140
-1849 -140 -125 -84 -153 -93 80 -76 46 31 -65 -16 -218 -29 -73 -119 -177 -170 -105 -28 -170 -167 -134 -57 -25 -60 -226 -251 -181 -120 -90 -118 -142 -162
-1817 -162 -45 -47 -130 -302 -143 -150 -115 -182 -89 -187 -23 -161 -249 -156 -120 -157 -213 -170 -194 -123 -201 -155 -93 -6 -136 -205 -71 -29 -134 -40 -125
-1786 -125 -103 -62 -136 -143 -120 -80 -29 -234 -48 -84 -300 -188 -94 -62 -68 -34 -108 -272 -154 -190 -17 -249 -256 15 -133 -37 -199 -23 8 -163
-1756 -163 -176 60 6 -217 64 -56 -247 -49 -130 -155 -208 -82 -97 -54 -107 -186 -313 -34 -117 -75 -23 -260 9 -45 29 -168 -115 -47
-1728 -47 -286 -210 -143 -64 10 -118 -182 -85 -124 -139 -163 -204 -66 -87 -116 -131 -258 -157 -195 -84 -101 -79 75 -169 -105 -52 -63 -30 -43 -58 96
-1697 96 23 -51 -265 -165 -127 11 -51 -23 -145 -101 -207 -169 -196 -238 0 -115 -34 26 -109 -197 87 -199 -153 -49 -10 -360 -190 -119
-1669 -119 -153 -98 -16 -210 28 -171 -62 -189 -173 64 -151 0 -254 10 -103 -62 -63 -80 -141 -105 -106 1 -95 -115 -219 -153 -65 -195
-1641 -195 -36 -112 -166 -157 -331 -100 86 -64 -216 -178 -75 -121 28 -6 -102 -182 -50 -101 -259 -184 -124 -158 -169 -106 -205 -124 -184 -174 -170 -173 -180
-1610 -180 -87 -88 -103 71 -140 -117 -19 -125 -195 -200 -113 -57 23 -144 -261 -104 -179 -129 7 11 9 -85 -133 -14 -117 -37 -146 -137 -262 -80 -66
-1579 -66 -103 -64 -255 -114 -95 -105 -171 -31 -172 -52 13 -166 17 63 -179 -260 -57 -10 -190 -182 42 -129 -180 24 -206 -270 -26 -36
-1551 -36 -185 -238 -110 -263 -198 9 -178 -65 -239 -179 -91 18 -144 -245 -155 -125 -188 -288 -190 -60 -97 -182 -77 10 -76 -147 -254 -135
-1523 -135 -60 -190 68 -35 0 -5 -156 -88 20 -235 -158 -72 -46 5 -158 -128 -165 -97 -152 -239 -13 -95 -50 -93 -41 -182 -136 -235 -234 7
-1493 7 -61 -133 -165 -151 -87 24 -208 -208 -257 -158 -125 -38 -115 -152 -61 -42 -190 -22 -70 -128 -45 -133 -144 -198 -236 -279 -190 23 -98 -145 -49 -147 -39
-1460 -39 -61 -90 -146 -64 -185 -201 -48 -185 7 -57 -52 -81 -105 -3 -172 -82 -130 -90 -198 -280 -79 -116 -230 -166 -135 -204 -187 -104 -128 -267
-1430 -267 -293 -30 -229 -295 -289 -128 -145 -170 -119 -219 -31 -257 -53 -91 -105 -80 -166 -62 -185 27 -178 -153 -40 -303 -333 -91 -177 -154
-1402 -154 -88 -244 -86 -61 -101 -42 -121 -245 -150 -217 -167 -318 -115 -116 47 -80 -125 -90 -144 7 -79 -27 -238 -179 -225 -245 -36 -183 -144
-1373 -144 -49 -205 -51 -185 -104 -153 -17 -53 -189 -92 -210 -99 -141 -121 -164 -69 45 -147 -18 -214 -234 -39 -268 -74 -127 -112 31
-1346 31 -145 -114 -43 -32 -48 -112 -160 -232 -163 -162 -98 -15 -76 27 -236 -166 -44 -100 -182 -139 -263 -233 -45 -142 -155 -310 -170 -251 -132 -78 -206
-1315 -206 -113 -127 -85 -121 -158 -51 -245 -142 -84 -189 -74 -112 -125 -112 -198 -161 -115 -182 -54 -18 -70 -179 -69 -39 -60 -132 -147 91 -129
-1286 -129 -198 -63 -195 -286 -72 -67 -135 -68 -42 -62 -73 -120 -233 -130 -89 -135 -93 -179 -113 -47 -96 -213 -261 -29 -220 -165 -148 -278 -166 -123
-1256 -123 -128 -21 -65 -175 -163 -40 -221 -212 -26 -51 45 -191 -125 -186 -46 -47 -398 -1 -114 -71 -259 -228 -133 -120 -98 -166 -50 -217 -153
-1227 -153 -263 -76 -279 -200 -12 -143 -242 -78 -254 -54 -185 -265 -157 -99 -87 -84 -30 -344 -24 -83 -274 -92 -102 -84 -174 -289 -193
-1200 -193 -271 -144 -166 -179 -126 54 -241 -139 20 -180 -248 -131 -195 -45 -144 -309 54 -250 -299 -156 -157 -70 -234 -145 -56 -92 34 -43
-1172 -43 -201 -191 -68 -147 -81 55 -290 -69 -144 -306 -165 -172 -6 -210 -92 42 -49 -205 16 -156 -199 -54 -59 -130 -146 -140 -117 -131 -129
-1143 -129 -244 -81 -66 -236 -211 -241 -22 -89 -261 -175 -216 -200 -36 -96 -39 -142 -113 -189 -323 -179 -87 -9 -114 -179 58 -118 -201 -148
-1115 -148 -74 -179 -169 -191 -7 3 -250 -219 -186 -168 -68 -115 -172 -100 -74 -67 -228 -280 -192 -74 -173 -246 -108 -156 -197 -205 -133 -143 -61 -25 -109 -55
-1083 -55 -100 -85 -177 -123 -181 -125 -400 -111 -149 -112 -86 -75 -102 -165 -29 -84 -81 -255 -72 -278 -80 -140 -170 -189 -222 -22 -131 -109 -88 -143 -150
-1052 -150 -169 -190 -80 -242 -186 -74 -94 -135 -165 -76 -152 -169 -193 -209 -21 -130 -77 -29 -261 -42 -166 -178 -182 -71 -142 -200 -274 -218 -120 -81
-1022 -81 -58 -66 -99 -104 -189 -232 -168 -289 -133 -81 -166 -173 34 -283 -325 3 -60 25 -153 -90 -71 -264 -6 -101 54 -160 -66 -152 -105 -15 -226
-991 -226 -190 -6 -297 -144 -80 -289 -228 -259 -216 -157 23 -211 -135 -48 -72 -158 -249 -163 -53 -201 -161 -320 -69 -185 -199 -148 17 -6 -250
-962 -250 -109 -156 -222 -144 -181 -243 -62 7 -147 8 -86 -225 -247 -83 -180 -246 -120 -224 -123 -183 -98 -269 -131 -138 -72 -172 -62 -194
-934 -194 -175 -153 -285 33 -11 -154 -127 -163 -163 -210 -132 -96 -174 -141 -225 -199 -88 -322 -163 -81 -219 -259 -114 64 -28 -185 -255 -177 -157 -65
-904 -65 -228 -38 -183 -33 -206 -229 -140 -141 -132 -366 -168 -66 -80 -161 -196 -28 -163 -248 89 -198 -234 -183 -244 -147 -116 -10 -43 -44 -170 -263
-874 -263 -265 -196 -122 -63 -180 -196 -81 -114 -244 -218 -106 -264 -247 -144 -123 -134 -183 -69 -82 -230 -327 -25 -15 -231 -92 -288 -97 -130 -150
-845 -150 -94 -75 -233 -92 -124 -178 -131 -228 -165 -87 -163 -232 -159 -168 -144 -273 -140 -75 27 -45 -185 -271 -149 -173 -74 -254 -196 -167 -220 -221 -294 -27
-813 -27 -227 -220 -159 -194 -159 -168 -242 -169 -225 -288 -286 -118 -109 -265 -62 -102 -121 -79 -15 -102 -195 -187 -134 -77 -250 -296 -99 -102 -120 -167 -173 -321 -209 -162 -109
-778 -109 -121 -52 -82 -138 -46 -339 -132 -136 -127 -81 -88 -217 -121 -150 -83 -139 -130 -260 -260 -142 -88 -100 -231 -125 -153 -255 -299 -100 -151 -261 -164 -243
-746 -243 -287 -161 38 -56 -222 -50 -148 -110 -168 -84 -99 -250 -214 -160 -128 -163 -222 -79 -164 -239 -130 3 -72 -142 -293 -162 -23 -74 -90
-717 -90 -160 -190 -99 -179 -128 -106 -272 -208 -269 -103 -201 -135 -234 -202 -172 -264 -31 -113 -34 -57 -208 -73 -58 -128 -169 -225 -50 -116 -143 -21 -113 -122
-685 -122 -280 -164 -172 -69 -155 -26 -178 -116 -91 -118 -81 -103 -235 -197 -164 -197 -184 -198 -86 -159 -49 -312 -101 -194 -154 -117 -186 -126 -118 -177 -53
-654 -53 -191 -129 -133 -175 -181 -133 -266 -79 -184 -149 -22 -288 -133 -75 -82 -232 -144 -285 -228 -99 -173 -142 -348 -315 -47 -222 -210 -193 -176 -87
-624 -87 -110 -265 -295 -367 -193 -174 -76 -132 -102 -420 -85 -46 -299 -192 -226 -4 -127 -91 -135 -79 -124 -145 -185 -288 -336 42 -92 -93 -216 -270
-594 -270 -119 -205 -101 -219 -61 -192 -190 -115 -55 -132 -93 -104 -116 -112 -285 -9 -92 -161 -184 -127 -146 -46 -116 -220 -184 -276 -131 40 -341 -88
-564 -88 -45 -187 -60 -57 -193 -255 -212 -144 -91 -299 -230 -94 -82 -293 -118 -163 -162 -59 -77 -259 -43 -139 -264 -134 -107 -210 -161 -127 -135 -268
-534 -268 -131 -53 -240 -111 -250 -189 -131 -155 -221 -257 -274 -249 -96 -149 9 -222 -273 -113 -130 -97 -179 -127 -183 -61 -132 43 -254 -176 -131
-505 -131 -335 -182 -129 -79 -158 -109 -99 -234 -295 -375 -168 -91 -96 -143 -151 -153 -172 -22 -117 -221 -75 -149 -234 -109 -244 -64 -40 -204 -195 -194 -219 -89
-473 -89 -220 -274 -253 -137 -188 -157 -77 -8 -4 -76 -216 -170 -140 -148 -198 -179 36 -36 8 -31 -132 -240 -109 -248 -252 -78 -79 -52 -105 -219 -69 -67
-441 -67 -27 98 -118 -250 -220 -110 -124 -86 -119 -28 -205 -208 -12 -69 6 29 -17 77 86 1 0 32 46 23 58 44 137 29 275 106 59 142
-409 142 258 273 184 163 356 377 273 271 361 525 433 731 483 634 670 692 802 691 645 725 732 907 893 751 816 834 643 669 654 387
-379 387 398 234 183 139 -55 -80 34 52 91 -128 -206 -151 -20 12 -1 -52 -103 148 -109 -78 -12 -106 -37 -105 -133 -207 7 -56 -76 -61 -187
-348 -187 -228 -55 -71 -204 -138 -87 -177 -194 -114 -167 -239 -139 -118 -236 -102 -59 -112 -134 -194 -18 -189 -183 -71 -148 -88 -62 3 -219 -248 -142
-318 -142 -71 -248 -220 -167 -211 -123 -101 -179 -114 -51 -142 -86 -48 -57 62 -97 -66 -215 -147 64 -190 -30 -139 -144 -54 -158 -131 -105 0 -87 -198
-287 -198 -74 -169 -67 17 -182 -118 -215 -16 -117 -241 30 -94 -95 -98 -160 -88 -47 -141 12 -151 -107 -125 -265 -143 -98 -198 -99 -128 -184
-258 -184 -58 -16 -58 -242 -198 -131 -272 -153 -140 -170 -36 -282 -88 -166 -174 -94 -282 -163 -185 -106 -186 -159 -163 -186 -107 -40 18 -246 13 -222
-228 -222 -314 -232 -214 -323 -130 -142 -250 -160 -96 -76 -191 -78 -272 -244 -150 -116 -253 -163 -118 -219 -164 -89 -173 -101 -209 -58 -216 -58 -38
-199 -38 -248 -127 -258 -178 -202 -208 -191 -189 -215 -218 -125 -154 -74 -303 -246 -28 -134 -211 -338 -175 -187 -71 -204 -281 -206 -260 -397 -221 -198 -239 -157
-168 -157 -332 -212 -271 -162 -152 -167 -39 -261 -213 -91 -17 -153 -219 -221 -127 -154 -185 -259 -199 -169 -261 -262 -212 -116 -227 -99 -118 -144 -239 -176 -68
-137 -68 -172 -230 -49 -80 -273 -109 -149 -139 -154 -281 -68 -143 -202 -284 -251 -213 -97 -49 -242 -71 -195 -117 -76 -184 -173 -266 -14 -233 -230
-108 -230 -65 -142 -117 -69 61 -157 -186 -208 -280 -141 -171 -117 -186 -173 24 -48 -139 -183 -57 -209 -226 -137 -154 -176 -204 -13 -62 -30 -333 -334 -142
-77 -142 -257 -148 -122 -149 -107 -106 -253 -144 -295 -241 -332 -143 45 -12 -196 -10 -47 -192 -216 -175 -352 -280 -58 -33 -24 -247 -83 -213 -76
-48 -76 -224 -115 -113 -59 -120 -58 -293 -139 -245 -201 -231 -186 -171 -329 -207 -103 -47 -224 -203 -240 -214 -123 -18 -265 -163 -265 -184 -151 -229 -168
-18 -168 -216 -153 -158 -208 -16 -206 -152 -298 -27 -217 -220 -228 -211 -164 -259 -325 -156 23 -272 -151 -71 -168 -232 -350 -257 -31 -161 -118 -329 -15
11 -15 -64 -246 -241 -131 -350 -161 -186 -220 -183 -106 -71 -213 -305 -123 -24 -107 -142 -255 -233 -309 -85 -231 -186 -298 -350 -69 -209 -363 -137 -53
41 -53 -214 -264 -137 -300 -71 23 -178 -175 -119 -56 -117 -147 -192 -144 -194 -236 -170 -273 -207 -216 -138 -160 -142 -23 -23 -140 -124 -99 -131 -187 -217 -172 -160 -186
75 -186 -241 12 -126 -162 -138 -96 -184 -208 -82 -41 -50 -139 -297 -186 -97 -226 -132 -283 -250 -202 -242 -64 -28 -134 -83 -101 17 -33 -318 -63
105 -63 -245 -107 52 -214 -199 -82 -163 -134 -45 -274 -181 -50 -73 -86 -178 -172 -127 -23 83 -137 -176 -232 -165 -141 -203 -341 -96 -157 -203 -195 -133
136 -133 -11 -186 -13 -201 -196 -174 -239 -279 -113 -245 -277 -19 -201 -21 -240 -260 -72 -165 -229 -232 28 -137 -142 -224 -275 -271 -194 -246 -166 -135 -65
167 -65 -185 -265 -56 -44 -161 -254 -141 -149 -97 -133 -135 -345 -74 -154 -132 -260 -317 -147 -155 -24 -48 -57 -162 -279 -170 -245 -285 -182 -101 -120 -54
198 -54 39 -210 -50 -205 -203 -138 -116 -167 -198 -285 -134 -223 -236 -155 -112 -250 -231 -89 -254 -143 -210 -169 -116 -114 -182 -57 -128 -295 -239 -130 -236
229 -236 -197 -225 -147 -249 -222 -216 -255 -164 -147 -312 -157 -204 -341 4 -214 -217 -257 -250 -213 -179 -212 -204 -315 -149 -92 -125 -211 -255 -72 -269 -109 -215
261 -215 -163 -170 -146 -203 -209 -319 -265 -152 -179 -118 -299 -117 -126 -49 -97 -11 -239 -254 -96 -23 -180 -143 -180 -248 -97 -224 -152 -101 -60 -40 -144 -286
293 -286 -227 -163 -136 -219 -149 -232 -99 -221 -205 -146 -268 -291 -298 -143 -155 -324 -100 -222 -72 -232 -237 -197 -208 -146 -341 -187 -211 -125 -441 51
323 51 -57 -193 -169 -48 -162 -178 -206 -181 -143 -74 -168 -347 -224 -158 -163 -199 -212 -285 24 -225 -76 -237 0 -247 -186 -236 -184 -269 -334 35
353 35 -97 40 -186 -292 -153 -48 -192 -127 -219 -100 -251 -234 -92 -178 -259 -221 9 -156 -184 -177 -212 -148 -127 -62 -220 -175 -122 -152 -47
382 -47 -241 -241 -114 -211 -219 -184 -268 -311 -114 -197 -89 -66 -280 -249 -185 -102 -127 -320 -41 -117 -230 -165 -137 -264 -329 9 -77 -102 -201 -214 -87
413 -87 -66 -258 -137 -402 -260 -160 -195 -168 -136 -37 -164 -329 -82 -145 -263 -211 -275 -61 -182 -214 -226 -127 -151 -159 -299 -132 -51 -268 -316
442 -316 -276 -222 -299 -241 -126 -228 -129 -102 -226 -318 -105 -115 -134 -202 -118 -174 -239 -251 -142 46 -151 -219 -225 -157 -182 -171 -169 -134 -34 -167 -201 -56
474 -56 -268 -152 -214 -260 -85 -21 -188 -35 -30 -127 -191 -167 -229 -240 -108 -96 -104 -197 -255 -185 -178 -161 -165 40 -243 -311 -91 -300 -34 -218 -156 -388
506 -388 -66 -134 -285 -175 -207 -149 -192 -123 -124 -3 -199 -303 -163 -178 -276 -184 -116 -282 -113 -102 -139 -70 -370 -202 -73 35 -132 -104 -151
535 -151 -128 -70 -152 -191 -204 -299 -74 -125 -198 -138 -216 -208 -298 -105 -179 -16 -206 -152 -137 -218 -66 -120 -117 -104 -170 -55 -185 -248 -190 -253 -225 -183 -239
568 -239 -258 -242 -251 -120 -118 -22 -193 -308 -231 -239 -237 68 -225 -195 -115 -229 -232 -134 -113 -242 -248 -356 -97 -168 -142 -147 -87 -116 -119 -70 -140 -290 -57 -90
602 -90 -136 -252 -214 -88 -281 -73 -83 -160 -251 -213 -199 -187 -153 -135 -151 -339 -284 -105 -271 -269 -348 -226 -280 -275 -206 -227 -203 -197 -260 -85 -135 -49 -48
635 -48 -227 -115 -139 -151 -130 -177 -105 -79 -283 -100 -214 -102 -245 -162 -92 -235 -344 -198 -113 -119 -333 -124 -177 -187 -10 -50 -158 -333 -198
664 -198 -252 -127 -219 -127 -107 -179 -292 -193 -229 -166 -159 -127 -267 -237 -225 -190 -236 -255 -180 -193 -148 -172 -21 -7 -80 -152 -129 -163 -145 -114 -180 -105 -184 -37
698 -37 -90 -249 -161 -148 -241 -62 -107 -196 -150 -283 -22 -326 -370 -210 -154 -388 -188 -136 -180 -189 -274 -258 -193 -40 -191 -269 -92 -53 -116 -212 -174
729 -174 -67 -98 -232 -291 -131 -176 -174 -200 -107 -347 -157 -16 -133 85 -133 -184 -85 -214 -159 -234 -136 -110 -349 -199 -62 -272 -70 22
757 22 -299 -201 -194 -178 -127 -357 -41 49 -268 -346 -132 -297 -196 -149 -353 -284 -262 -59 -86 -176 -80 -247 -383 -259 -45 -208 -222 -159 -309
786 -309 -91 -376 -133 -145 -159 3 -185 -240 -237 -201 -136 -157 -211 -249 -83 -70 -179 -256 -116 -293 -168 -48 -181 -167 -63 -45 -375 -50
814 -50 -265 -58 -207 -261 -147 -301 -174 -151 -212 -233 -105 -234 -238 -243 -198 -311 -190 -144 -235 -164 -186 -281 -271 -308 -253 -82 -237 -192 -253 -224 -137
845 -137 -167 -225 -232 -74 -203 -309 -114 -166 -138 -244 -333 -127 -156 -179 -136 -26 -30 -192 -227 -182 -61 -191 -135 -266 -139 -261 -306 -72 -328
874 -328 -117 -51 -208 -221 -59 -276 -96 -246 -297 -163 -227 -270 -97 -229 -243 -218 -330 -181 -174 -196 -79 -205 -240 -123 -139 -18 -35 -251
902 -251 -257 -149 -113 -109 -144 -125 -297 -268 -364 -205 -203 -68 -105 -139 -217 -185 -223 -138 -45 -199 -182 -293 -390 -200 -185 -87 -163 -217 -172 -102 -142 -202 -116
935 -116 -157 -142 -203 -204 -41 -134 -206 -99 -255 -104 -264 -308 -111 -141 -145 -61 -342 -39 -116 -152 -201 -190 -167 -260 -290 -279 -197 -179 -154 -251 -221 -202
967 -202 -137 -191 -203 -20 -99 -182 -278 -268 -173 -192 -169 -169 -173 -110 -75 -113 -186 -195 -30 -215 -56 -227 -138 -163 -146 -82 -96 -328 -326 -159 -51 -224 -293
1000 -293 -114 -13 -141 -179 -276 -335 -150 -119 -213 -245 -141 -287 -114 -181 -97 -259 -233 -118 -76 -153 -225 -149 -230 -286 -127 -107 -416 -319 -93
1029 -93 -254 -220 -211 -157 -343 -151 -194 -160 -201 -183 -145 -230 -237 -219 -53 -243 25 -325 -257 8 -165 -354 -274 -162 -336 -163 -193 -132 -225 -159
1059 -159 -56 -268 -88 -279 -227 -188 -223 -178 -228 -196 -217 -228 -233 -330 -78 -73 -137 -249 -291 -258 -188 -225 -212 -98 -89 -213 -279 -203 -209 -122 -251 -150
1091 -150 -265 -231 -208 -106 -51 -212 -180 -259 -107 -95 -305 -138 -205 -144 -282 -332 -150 -117 -219 -221 -201 -216 -132 -1 -305 -95 -156 -320 -219
1120 -219 -271 -73 -107 -82 -303 -102 -160 -149 -108 1 -173 -172 -216 -250 -88 -21 -110 -361 -156 -203 -364 -236 -108 -240 -223 -324 -151 -65
1148 -65 -168 -216 -192 -63 -122 -28 -192 -143 -290 -281 -81 -218 -186 -166 -211 -278 -236 -400 -229 -94 -222 -272 -110 -61 -68 -204 -244 -119 -269
1177 -269 -126 -295 -317 -221 -157 -70 -216 -183 -205 -226 1 -258 -169 -162 -318 -221 -483 -150 -311 -286 -182 -220 -198 -133 -72 -349 -235 -242 -345
1206 -345 -121 -226 -226 -133 -196 -206 -253 -116 -178 -224 -194 -139 -96 -92 -274 -274 -183 -133 -191 -132 -252 -265 -131 -127 -212 -154 -100 -215 -211 -335 -226 -215 -220
1239 -220 -169 -140 -314 -197 45 -295 -257 -137 -201 -191 -315 -79 -270 -396 -71 -112 -202 -195 -246 -183 -168 -225 -184 -144 -190 -347 -252 -107 -281
1268 -281 -183 -204 -298 -199 -212 -115 -119 -272 -296 -191 -347 -181 -152 -203 -127 -61 -269 -323 -265 -259 -161 -170 -76 -146 -127 -250 -172 -197 -218 -367 -235 -179
1300 -179 -403 71 -10 -217 -145 -163 -208 -188 -94 -207 -143 -194 -163 -125 -253 -144 -296 -195 -229 -177 -43 -194 -28 -147 -250 -221 -157 -233
1328 -233 -181 -300 -290 -207 -274 -119 -157 -310 -210 -156 -188 -158 -283 -176 -168 -218 -292 -218 -230 -230 -226 -344 -154 -173 -199 -179 -220 -271 -221 -138 -344 -183
1360 -183 -248 -335 -200 -115 -96 -217 -195 -120 -136 -344 -315 -121 -212 -244 -383 -154 -142 -250 -277 -138 -96 -296 -296 -233 10 -230 -192 -82 -60
1389 -60 -110 -25 -408 -142 -124 -64 -241 -246 -23 -280 -129 -270 -241 -122 -168 -381 -11 -319 -166 -185 -259 -109 -205 -96 -190 35 -241 -316
1417 -316 -116 -188 -162 -208 -166 -237 -281 -233 -358 -212 -383 -339 -216 -222 -136 -156 -20 -211 -89 -251 -179 -299 -193 -156 -211 -196 -197 -122 -230 -152
1447 -152 -151 -235 -306 -101 -44 31 -153 -181 -141 -32 -435 -353 -194 -77 -234 -191 -190 -280 -108 -248 -177 -76 -61 -118 -55 -172 -44 48 -216
1476 -216 -349 -190 -243 -197 -272 -254 -123 -131 -144 -196 -45 -51 -179 -93 -221 -164 -200 -241 -231 -232 -232 -280 -118 -139 -186 -190 -117 -262 -193 -161 -357 -149
1508 -149 -331 -104 -252 -327 -236 -324 -198 -257 -172 -314 -154 -249 -172 -151 -169 -156 -197 -328 -363 -195 -243 -244 -403 -231 -60 -142 -244 -211 -269
1537 -269 -227 58 -384 -132 -207 -315 -129 -243 -157 -194 -169 -184 11 -141 -268 -218 -154 -154 -162 -347 -167 -199 -227 -204 -158 -247 -285 -190 -100 -80
1567 -80 -206 -146 -240 -136 -105 -309 -176 -50 -51 -145 -366 -158 -236 -322 -369 -120 -102 -226 -188 -173 -304 -255 -115 -57 -193 -77 -320 -247 -125
1596 -125 -163 -103 -241 -143 -228 -93 -247 -177 -423 -398 -320 -281 -176 -236 -226 -280 -179 -195 -311 -123 -222 -329 -290 -7 -122 -135 -159 -270 -275
1625 -275 0 -199 -370 -160 -52 -75 -264 -61 -187 -133 -181 -169 -188 -135 -325 -160 -141 -53 -228 -224 -279 -223 -253 -109 -123 -185 -200 -303 -89
1654 -89 -266 -188 -371 -132 -172 -275 -23 -126 -118 -150 -252 -202 -291 -208 -213 -144 -168 -205 -229 -174 -98 -1 -148 -269 -289 -205 -162 -308 -216 -225 -153 -131
1686 -131 -265 -354 -266 -285 -250 -89 -245 -190 -208 -152 -168 -158 -222 -238 -271 -124 -253 -350 -27 -120 -146 -100 -70 -254 -130 -208 -119 -219 -131 -272
1716 -272 -320 -90 -313 -260 -211 -18 -55 -150 -149 -220 -339 -202 -96 -178 -122 -257 -212 4 -195 -333 -110 -339 -130 -258 -159 -240 -201 -155
1744 -155 -302 -289 -240 -207 -321 -195 -140 -135 -246 -133 -264 -325 -383 -100 -188 -1 -212 -113 -126 -122 -240 -239 -165 -308 -216 -119 -99 -274 -266 -154
1774 -154 -238 -255 -94 -202 -261 -190 -86 -279 -188 -185 -200 -175 -179 -290 -197 -144 -233 -112 -52 -229 -213 -175 -56 -248 -163 -113 -211 -159 -181 -239 -174
1805 -174 -214 -122 -127 -106 -227 -69 -192 -494 -77 -192 -285 -229 -169 -287 -390 -195 -105 -193 -202 -149 -211 -219 -11 -147 -229 -291 -310 -77 -223 -338
1835 -338 -218 -156 -164 -323 -238 -191 -176 -256 -53 -168 -101 -305 -115 -183 -209 -166 -209 -122 -174 -190 -332 -189 -334 -189 -173 -278 -339 -241 -233 -235 -357
1866 -357 -272 -207 -268 -295 -82 -237 -234 -151 -233 -249 -242 -111 -264 -366 -47 -206 -174 -247 -83 -100 -163 -111 -182 -196 -182 -145 -251 -214 -308 -214 -252
1897 -252 -119 -215 -148 -181 -182 -324 -147 -234 -245 -253 -295 -132 -132 -200 -202 -113 -379 -166 -94 -260 -175 -284 -96 -188 -309 -146 -284 -41 -119 -182
1927 -182 -209 -233 -111 -124 -262 -214 -262 -282 -67 -215 -67 -190 -146 -131 -241 -213 -243 -253 -203 -325 -277 -260 -247 -124 -264 -155 -233 -207 -207 -173
1957 -173 -142 -200 -48 -278 -222 -152 -243 -45 -418 -38 -161 -128 -148 -117 -281 -323 -135 -173 -178 -203 -83 -139 -156 -235 -101 -173 -83 -158 -242 -310
1987 -310 -248 -278 -198 -247 13 -141 -136 -189 -140 -173 -249 -199 -203 -203 -155 -223 -348 -180 -232 -220 -182 -149 -239 -261 -269 -112 -239 -292 -87 -260 -116 -86
2019 -86 -221 12 -311 -248 -205 -244 -153 -213 -188 -280 -164 -91 -326 -79 -246 -114 -230 -283 -198 -235 -116 -227 -106 -218 -303 -139 -193 -291
2047 -291 -123 -233 -16 -167 -166 -190 -192 -206 -281 -198 -171 -118 -214 -195 -212 -229 -84 -136 -213 -122 -197 -253 -244 -240 -89 -227 -225 -267 -180 -205 -222 -85 -205
2080 -205 -73 -236 -277 -217 -252 -230 -228 -229 -158 -247 -113 -179 -193 -242 -73 -172 -292 -246 -254 -147 -93 -216 -322 -253 -361 -360 -252 -313 -295 -140 -283
2111 -283 -98 -281 -87 -265 -233 -106 -241 -174 -361 -226 -239 -271 -168 -184 -130 -229 -98 -180 -252 -259 -312 -225 -174 -84 -268 -179 -178 -84 -275 -385
2141 -385 -134 -47 -202 -295 -296 -194 -205 -280 -224 -241 -212 -93 -263 -231 -249 -152 -218 -246 -243 -227 -138 -344 -133 -292 -248 -139 -318 -89 -358 -182
2171 -182 -58 -133 -76 -178 -230 -233 -247 -231 -57 -272 -92 -262 -170 -328 -46 -138 -263 -182 -198 -266 -330 -156 -266 -93 -195 -211 -115 -118 -115 -267
2201 -267 -187 -91 -281 -136 -43 -121 -225 -310 -261 -203 -142 -191 -314 -202 -397 -297 -372 -133 -120 -302 -271 -181 -149 -157 -247 -266 -199 -253 -254 -126 -155
2232 -155 -160 -304 -271 -140 -242 -239 -236 -251 -149 -182 -267 -77 -211 53 -307 -340 -278 -171 -300 -130 -301 -174 -1 -120 -191 -382 -163 -330
2260 -330 -41 -191 -75 -259 -283 -100 -61 -57 -43 -204 -268 -228 -406 -150 -151 -205 -208 -88 -133 -104 -273 -78 -155 -216 -277 -332 -84 -307 -325 -255
2290 -255 -203 -195 -195 -37 -80 -390 -149 -205 -47 -235 -271 -258 -284 -276 -210 -118 -161 -267 -320 -161 -264 -169 -127 -165 -265 -237 -353 -244 -377 -246
2320 -246 -162 -308 -200 -223 -221 -308 -295 -65 -41 -194 -274 15 -161 -218 -77 -233 -165 -225 -91 -276 -82 -156 -238 -286 -315 -178 -249 -232 -276
2349 -276 -243 -282 -148 -215 -226 -179 -175 -127 -156 -215 -162 -258 -317 -275 -77 -298 -123 -130 -224 -153 -182 -226 -195 -235 -247 -104 -258 -110 -246 -47 -150
2380 -150 -114 -202 -290 -335 -136 -127 -341 -24 -315 -169 -266 -287 -233 -277 -191 -219 -121 -337 -182 -77 -82 -214 -88 -158 -121 -243 -237 -137 -199 -167
2410 -167 -235 -239 -289 -266 -163 -194 -158 -188 -199 -214 -163 -50 -289 -204 -337 -162 -208 -224 -316 -162 -108 -131 -201 -186 -215 -207 -182 -245 -217 -337 -266 -288
2442 -288 -385 -333 -169 -61 -312 -173 -94 -141 -98 -195 -191 -312 -85 -331 -223 -113 -291 -244 -181 -184 -339 -120 17 -280 -230 -219 -111 -271
2470 -271 -170 -16 -177 -461 -283 -255 -348 -185 -228 -306 -157 -169 -195 -355 -272 -23 -258 -209 -196 -40 -271 -259 -70 -313 -300 -253 -279 -69
2498 -69 -296 -166 -274 -380 -200 -219 -234 -272 -231 -77 -116 -146 -154 -333 -167 -182 -175 -99 -232 -360 -474 -201 -177 -100 -169 -183 -216 5 -216
2527 -216 -283 -218 -336 -45 -214 -135 -201 -202 -153 -169 -251 -286 -302 -151 -188 -88 -269 -278 -366 -168 -277 -131 -78 -226 -134 -200 -129 -394 -328 -80
2557 -80 14 -116 -283 -208 -137 -211 -223 -230 -248 -348 -181 -363 -155 -174 -273 -148 -227 -399 -222 -67 -242 -161 -155 -123 -91 -246 -174 -175 -297 -180
2587 -180 -321 -159 -111 -366 -326 -272 -201 -352 -328 -127 -161 -263 -195 -141 -267 -346 -244 -178 -142 -166 -94 -284 -190 -100 -246 -223 -274 -170 -278
2616 -278 -193 -357 -129 -82 -215 -212 -218 -290 -373 -68 -345 -367 -293 -252 -127 -141 -316 -271 -45 -395 -361 -261 -252 -175 -167 -323 -168 -92 -149 -246 -176
2647 -176 -297 -242 -256 -315 -126 -92 -78 -497 -298 -124 -356 -303 -80 -299 -54 -202 -209 -135 -321 -272 -290 -132 -264 -117 -125 -319 -153 -216
2675 -216 -234 -215 -114 -91 -228 -206 -204 -298 -163 -78 -186 -31 -124 -239 -47 -120 -281 -130 -126 -243 -131 -115 -327 -166 -78 -45 -100 -190 -311
2704 -311 -180 -53 -250 -244 -277 -162 -226 -232 -135 -98 -171 -266 -198 -209 -186 -208 -328 -222 -28 -200 -317 -314 -261 -257 -127 -200 -200 -136 -231 -74 -29 -317
2736 -317 -135 -4 -136 -226 -63 -210 -345 -101 -169 -132 -397 -284 -282 -254 -273 -210 -188 -129 -174 -154 -29 -190 -120 -253 -211 -216 -153 -182 -360
2765 -360 -53 -30 -356 -239 -170 -412 -268 -234 -170 -209 -334 -195 -235 -161 -133 -177 -273 -266 -27 -347 -235 -64 -180 -244 -300 -56 -154 -142 -119
2794 -119 -212 -221 -70 -160 -179 -183 -230 -295 -237 -219 -141 -195 -227 -403 -164 -173 -82 -103 -182 -139 -333 -138 -208 -86 -287 -46 -248 -247 -177 -253 -226 -321
2826 -321 -210 -201 -154 -210 -281 -211 -226 -270 -98 -289 -238 -94 6 -102 -146 -148 -248 -214 -402 -151 -218 -298 -165 -235 -228 -88 -298 -163 -232 -293
2856 -293 -278 -224 -122 -227 -215 -285 -283 -237 -253 -178 -257 -353 -143 -219 79 -370 -234 -234 -315 -128 -82 -171 -233 -265 -115 -172 -358 -157 -297 -229
2886 -229 -336 -219 -161 -263 -298 -170 -324 -390 -224 -259 -328 -242 12 -121 -176 -161 -277 -151 -211 -323 -339 -212 -294 -167 -279 -224 -227 -161
2914 -161 -248 -367 -192 -216 -180 -180 -80 -282 -161 -128 -231 -207 -206 -130 -295 -302 -255 -149 75 -283 -253 -180 -127 -222 -323 -141 -319 -206 -167
2943 -167 -229 -328 -76 -215 -225 -90 -332 -149 -439 -199 -87 -177 -269 -261 -214 -146 -135 -211 -115 -122 -240 -209 -198 -182 -259 -337 -101 -295 -148 -108
2973 -108 -189 -289 -284 -197 -37 -170 -150 -333 -287 -148 -202 -134 -181 -299 -226 -195 -343 -286 -230 -223 -404 -239 -278 -141 -350 -363 -92 -118 -148 -221
3003 -221 -203 -141 -240 -312 -185 -267 -300 -201 -259 -278 -169 -194 -161 -179 -284 -230 -346 -149 -181 -210 -206 -213 -127 -228 -168 -286 -196 -120 -215 -170 -216 -257
3035 -257 -186 -392 -162 -196 -205 -193 -151 -153 -154 -124 -225 -233 -187 -144 -211 -144 -215 -138 -5 -136 -252 -286 -94 -106 -278 -212 -170 -177 -239 -273 -328 -97 -320
3068 -320 -110 -184 -358 -352 -111 -79 -144 -138 -158 -206 -268 -109 -219 -84 -312 -290 -160 -196 -218 -284 -215 -179 -225 -100 -158 -212 -361 -181 -155 -229
3098 -229 -173 -161 -304 5 -236 -222 -208 -289 -78 -363 -89 -274 -179 -172 -316 -294 -389 -286 -272 -229 -206 -229 -124 -272 -119 -214 -301 -217 -321
3127 -321 -199 -155 -230 -106 -422 -142 -216 -196 -212 -291 -261 -348 -161 -297 -147 -210 -136 -345 -141 -189 -187 -61 -311 -369 -136 -240 -2 -159
3155 -159 -178 -168 -200 -147 -197 -105 -295 -285 -197 -122 -249 -142 -165 -279 -195 -176 -210 -218 -390 -178 -114 -46 -130 -168 -222 -206 -219 -96 -368 -254 -139
3186 -139 -506 -244 -148 -180 -267 -184 -222 -435 -174 -226 -164 -326 -84 -63 -453 -68 -257 -153 -263 -351 -121 -203 -210 -158 -324 -15 -390 -128
3214 -128 -219 -391 -220 -301 -186 -211 -71 -294 -226 -267 -315 -221 -170 -135 -263 -296 -113 -309 -184 -352 -347 -152 -356 -260 -209 -211 -320 -153 -101
3243 -101 -251 -218 -397 -176 -229 -188 -132 -252 -192 -260 -171 -304 -408 -256 -222 -247 -238 -245 -436 -265 -219 -373 -151 -189 -224 -89 -204 -93 -354
3272 -354 -310 -242 -213 -281 -180 -133 -414 -194 -308 -85 -167 -181 -351 -194 -193 -305 -100 -96 -70 -162 -243 -171 -270 -161 -210 -48 -227 -214 -187 -145
3302 -145 -153 -65 -127 -275 -135 -296 -352 -334 -88 -151 -170 -308 -156 -216 -212 -331 -194 -284 -160 -221 -157 -368 -348 -204 -231 -122 -154 -246 -268 -237
3332 -237 -274 -230 -238 -411 -256 -230 -251 -191 -275 -94 -226 -217 -177 -207 -269 -134 -232 -136 -221 -161 -150 -96 -362 -265 -232 -182 -281 -191 -78 -155 -310 -214
3364 -214 -226 -329 -200 -231 -248 -236 -92 -213 -305 -165 -207 -274 -197 -136 -112 -290 -137 -206 -78 -178 -202 -221 -191 -267 -256 -298 -176 -189 -129 -221
3394 -221 -20 -61 -226 -225 -163 -187 -160 -293 -203 40 -303 -160 -83 -205 -273 -206 -235 -57 -233 -165 -291 -206 -86 -124 -120 -286 -101 -128 -279
3423 -279 -93 -218 -190 -130 -138 -255 -281 -288 -222 -266 -320 -297 -367 -167 -236 -318 -271 -245 -135 -161 -206 -224 -265 -154 -124 -220 -224 -246 -228 -250 -198 -86 -91
3456 -91 -128 -107 -202 -314 -185 -333 -43 -362 -348 -169 -173 -166 -155 -32 -263 -379 -228 -94 -201 -273 -207 -190 -176 -98 -366 -218 -196 -226 -278
3485 -278 -439 -244 -300 -277 -220 -272 -292 -100 -20 -169 -237 -336 -219 -92 -232 -174 -173 -360 -303 -244 -390 -344 -216 -323 -227 -344 -236 -270 -171
3514 -171 -182 -236 -228 -113 -270 -357 -300 -213 -177 -202 -157 -211 -121 -254 -226 -170 -202 -314 -140 -178 -289 -145 -118 -249 -9 -155 -148 -149 -211 -220 -205 -263
3546 -263 -208 -219 -176 -175 -183 -186 -331 -168 -185 -277 -80 -171 -177 -120 -184 -222 -280 -152 -283 -147 -286 -190 -392 -161 -215 -174 -181 -320 -169 -172 -106 -290
3578 -290 -143 -118 -124 -221 -393 -192 -223 -212 -95 -105 -234 -218 -132 -306 -101 -190 -137 -209 -217 -322 -287 -311 -270 -330 -224 -234 -301 -132 -149 -162 -313
3609 -313 -147 -186 -185 -136 -102 -285 -2 -146 -413 -147 -296 -239 -201 -309 -263 -89 -34 -297 -115 -113 -269 -130 -40 -157 -113 -261 -296 -248
3637 -248 -116 25 -405 -166 -152 -231 -174 -201 -251 -238 -316 -242 -147 -176 -74 -206 -356 -220 -107 -229 -237 -276 -149 -187 -245 -167 -99 -169 -321
3666 -321 -34 -195 -199 -198 -326 -245 -236 -27 -260 -247 -175 -151 -209 -247 -186 -319 -335 -185 -322 -123 -108 -114 -321 -179 -172 -248 -89 -294 -141 -305
3696 -305 -144 -319 -226 -145 -115 -378 -137 -63 -361 -261 -156 -219 -63 -146 -270 -157 -274 -146 -268 -229 -171 -290 -263 -198 -329 -67 -262
3723 -262 -239 -261 -153 -55 -276 -225 -257 -381 -101 -129 -269 -125 -161 -197 -130 -124 -67 -120 -239 -168 -86 -195 -265 -105 -132 -123 -212 -117 -131 -151 -176
3754 -176 -300 -269 -242 -351 -164 -225 -135 -125 -147 -209 -310 -334 -281 -230 -161 -103 -105 -306 -315 -140 -158 -187 -81 -160 -284 -95 -421 -103 -195 -198 -321
3785 -321 -162 0 -180 -118 -289 -181 -294 -304 -306 -235 -206 -244 -383 -246 -35 -173 -163 -234 -281 -261 -276 -201 -62 -250 -176 -123 -185 -109 -90
3814 -90 -195 -174 -160 -227 -204 -254 -166 -360 -217 -157 -212 -251 -194 -266 -228 -90 -305 -98 -121 -344 -90 -197 -413 -237 -115 -202 -364 -250
3842 -250 -144 -253 -226 -239 -296 -296 -192 -171 -130 -266 -251 -177 -260 -180 -221 -294 -194 -252 -300 -195 -213 -162 -352 -118 -154 -213 -239 -421 -327 -174
3872 -174 -275 -256 -262 -356 -191 -232 -346 -154 -85 -327 -116 -89 -403 -304 -250 -212 -163 -252 -244 -258 -112 -207 -136 -295 -211 -188 -198 -202 -314 -187 -241
3903 -241 -179 -224 -173 -323 -253 -124 -172 -345 -299 -363 -246 -204 -285 -139 -127 -90 -184 -326 -268 -278 -177 -156 -262 -180 -345 -215 -246 -334 -328 -217
3933 -217 -410 -76 -172 -264 -254 -339 -363 -312 -178 -130 -106 -339 -196 -292 -232 -247 -145 -151 -206 -279 -264 -134 -36 -179 -199 -236 -272 -287 -40 -278
3963 -278 -204 -109 -125 -145 -331 -242 -254 -155 -146 -205 -270 -87 -210 -124 -257 -201 -197 -229 -231 -165 -159 -356 -228 -256 -133 -184 -192 -130 -354 -217 -286 -121
3995 -121 -136 -226 -233 -245 -131 -221 -245 -251 -82 -201 -242 -149 -60 -280 -209 -264 -344 -157 -292 -171 -337 -198 -125 -233 -156 -168 -112 -201 -326 -228
4025 -228 -145 -276 -232 -248 -229 -273 -174 -176 -420 -300 -222 -188 -204 -236 -211 -216 -250 -156 -297 -59 -186 -352 -151 -177 -111 -299 -130 -429 -178 -268
4055 -268 -276 -171 -105 -101 -256 -217 -226 -148 -110 -215 -239 -222 -271 -3 -129 -244 -308 -203 -252 -171 -210 -146 -190 -260 -194 -134 -314 -351 -193 -175 -133 -195
4087 -195 -300 -143 -244 -113 -266 -198 -113 -182 -245 -241 -272 -346 -90 -240 -230 -146 -201 -320 -166 -183 -280 -333 -235 -279 -223 -214 -113 -223 -32 -127
4117 -127 -216 -108 -74 -277 -218 -99 -52 -226 -183 -115 -445 -210 -62 -56 -157 -231 -259 -261 -500 -301 -332 -289 -309 -155 -86 -304 -38 -309 -358
4146 -358 -342 -237 -263 -211 -129 -272 -246 -251 -187 -334 -70 -52 -203 -354 -157 -185 -223 -379 -231 -277 -161 -278 -253 -191 -189 -49 -195 -288 -280 -137
4176 -137 -121 -204 -369 -215 -252 -162 -382 -226 -235 -363 -376 -166 -319 -105 -328 -347 -251 -25 -100 -210 -201 -234 -280 -317 -270 -190 -151 -304 -210 -302
4206 -302 -174 -203 -184 -251 -148 -344 -290 -449 -282 -267 -224 -264 -215 -42 -121 -104 -200 -260 -134 -159 -254 -295 -264 -400 -192 -232 -336 -239 -247 -172
4236 -172 -54 -155 -323 -341 -342 -269 -365 -178 -271 52 -224 -223 -232 -298 -175 -176 -303 -238 -277 -222 -310 -226 -45 -244 -56 -155 -32 -196 -103 -322
4266 -322 -151 -208 -298 -58 -157 -344 -360 -110 -158 -137 -286 -249 -223 -238 -324 -43 -303 -282 -237 -166 -229 -294 -108 -231 -72 -269 -54 -131 -125
4295 -125 -298 -88 -143 -94 -314 -287 -107 -226 -94 -475 -127 -354 6 -170 -265 -151 -293 -136 -333 -120 -253 -287 -325 -195 -190 -316
4321 -316 -144 -193 -184 -65 -201 -140 -349 -182 -215 -280 -164 -252 -229 -188 -107 -204 -331 -267 -39 -147 -247 -195 -137 -455 -114 -141 -318 -265 -161
4350 -161 -81 -239 -288 -202 -125 -74 -110 -262 -363 -344 -254 -197 -250 -255 -211 -196 -209 -213 -200 -387 -215 -200 -129 -238 -187 -261 -192 -225 -275 -333 -242 -142
4382 -142 -186 -133 -291 -258 -221 -129 -218 -266 -281 -157 -113 -151 -156 -97 -224 -166 -258 -303 -285 -362 -245 -172 -132 -135 -279 -285 -224 -288 -87 -241 -334 -296 -182
4415 -182 -206 -157 -247 -310 -198 -182 -133 -252 -226 -247 -322 -274 -128 -271 -164 -306 -120 -215 -409 -276 -287 -224 -236 -309 -244 -147 -381 -257 -234
4444 -234 -282 -300 -303 -359 -199 -215 -219 -269 -339 -171 -281 -150 -134 -373 -218 -338 -316 -295 -275 -256 -79 -156 -173 -78 -414 -319 -213 -113 -89 -144
4474 -144 -242 -172 -306 -313 -387 -110 -256 -239 -259 -442 -146 -297 -137 -115 -196 -246 -404 -343 -231 -211 -110 -181 -180 -288 -283 -264 -256 -224 -249 -272 -182
4505 -182 -171 -196 -154 -303 -330 -375 -128 -157 -324 -175 -88 -231 -218 -329 -296 -276 -253 -77 -269 -126 -253 -291 -259 -320 -236 -145 -282 -295 -194
4534 -194 -188 -132 -273 -147 -159 -213 -230 -291 -231 -146 -124 -256 -177 -173 -178 -223 -147 -273 -295 -67 -122 -179 -248 -384 -396 -167 -301 -140 -243 -266 -200
4565 -200 -347 -196 -118 -256 -286 -233 -183 -239 -336 -216 -115 -70 -162 -283 -121 -240 -286 -171 -307 -67 -143 -187 -358 -142 -220 -236 -134 -309
4593 -309 -274 -245 -109 -144 -262 -240 -205 -247 -158 -334 -259 -233 -300 -301 -317 -253 -146 -255 -80 -237 -279 -168 -219 -187 -173 -270 -183 -122 -353 -137
4623 -137 -266 -82 -327 -295 -209 -122 -116 -403 -219 -303 -185 -268 -212 -206 -395 -167 -283 -291 -353 -171 -80 -235 -115 -235 -112 -368 -291 -317 -321
4652 -321 -226 -207 -311 -109 -77 -224 -275 -358 -222 -205 -265 -253 -233 -328 -168 -297 -139 -287 -169 -306 -217 -138 -302 -194 -193 -200 -318 -197 -303
4681 -303 -189 -153 -234 -215 -223 -95 -17 -224 -269 -255 -199 -150 -145 -162 -296 -164 -233 -339 -189 -116 -310 -243 -251 -292 -55 -249 -269 -183 -224 -213 -256
4712 -256 -254 -282 -231 -180 -397 -215 -298 -255 -152 -184 -313 -389 -291 -281 -48 -179 -247 -273 -222 -90 -238 -181 -247 -258 -41 -203 -227 -305 -178 -100
4742 -100 -175 -313 -255 -57 -37 -296 -343 -261 -289 -312 -292 -175 -289 -238 -205 -139 -207 -381 -184 -136 -347 -215 -243 -143 -227 -348 -287 -276 -271 -242
4772 -242 -183 -272 -190 -258 -254 -435 -238 -282 -331 -216 -285 -93 -423 -263 -277 -132 -316 -298 -245 -281 -261 -278 -261 -310 -24 -259 -15 -155 -167
4801 -167 -343 -193 -257 -228 -168 -294 -91 -201 -192 -369 -259 -168 -191 -222 -169 -65 -216 -258 -310 -279 -54 -221 -309 -239 -309 -217 -144 -400 -357
4830 -357 -253 -202 -166 -194 -401 -125 -183 -136 -105 -289 -193 -321 -252 -218 -268 -318 -309 -147 -303 -352 -87 -276 -316 -227 -282 -213 -181 -294 -145 -247
4860 -247 -154 -266 -224 -183 -212 -245 -180 -172 -131 -42 -293 -175 -207 -314 -223 -184 -201 -264 -252 -326 -315 -208 -178 -54 -165 -253 -196 -189 -255 -202 -157 -310
4892 -310 -343 -139 -335 -94 -75 -258 -284 -183 -221 -351 -351 -50 -173 -232 -116 -264 -182 16 -167 -325 -132 -462 -275 -255 -8 -218
4918 -218 -274 -154 -312 -279 -277 -279 -162 -118 -456 -147 -123 -279 -152 -230 -262 -112 -126 -224 -242 -221 -47 -303 -279 -242 -241 -266 -310 -136 -218 -193 -219
4949 -219 -191 -100 -173 -187 -204 -146 -221 -221 -186 -221 -205 -152 -208 -140 -184 -377 -259 -337 -131 -169 -271 -343 -178 -171 -246 -235 -175 -258 -238 -152 -143 -127 -185 -284
4983 -284 -176 -266 -337 -251 -247 -268 -158 -1 -468 -273 -62 -139 -212 -253 -337 -122 -110 -139 -215 -386 -336 -413 -353 -100 -104 -129 -249 -271 -290 -307 -162
5014 -162 -155 -177 -201 -302 -259 -313 -345 -196 -191 -121 -261 -236 -275 -332 -348 -300 -71 -314 -295 -191 -292 -148 -202 -104 -276 -214 -207 -208 -341 -294 -391 -415
5046 -415 -67 -316 -246 -249 -126 -145 -325 -209 -222 -310 -164 -211 -305 -175 -351 -216 -284 -177 -171 -233 -239 -286 -187 -224 -144 -178 -138 -316 -216 -156
5076 -156 -238 -368 -174 -134 -430 -143 -103 -222 -17 -218 -226 -306 -378 -178 -259 -171 -216 -192 -120 -70 -220 -338 -205 -291 -247 -414 -154 -195 -165
5105 -165 -273 -275 -254 -448 -124 -97 -258 -158 -56 -204 -308 -217 -136 -339 -51 -81 -175 -131 -105 -329 -35 -205 -221 -159 -251 -235 -136 -272
5133 -272 -191 -164 -304 -63 -250 -221 -99 -243 -276 -57 -275 -286 -203 -190 -300 -205 -269 -35 -136 -218 -192 -319 -303 -203 -347 -349 -208 -204 -226
5162 -226 -172 -190 -173 -121 -201 -112 -125 -141 -290 -204 -191 -217 -131 -370 -316 -261 -245 -231 -166 -134 -354 -178 -165 -52 -125 -279 -301 -226 -186 -183 -149 -82
5194 -82 -267 -180 -175 -179 -201 -298 -242 -330 -180 -259 -178 -139 -202 -218 -157 -117 -374 -259 -143 -230 -288 -224 -95 -337 -305 -109 -310 -137 -279 -185 -341
5225 -341 -489 -188 -239 -254 -324 -263 -353 -296 -310 -264 -275 -101 -230 -254 -293 -171 -211 -154 -133 -99 -162 -201 -225 -126 -168 -166 -94 -372 -263 -258 -304 -288
5257 -288 -204 -434 -161 -274 -342 -371 -131 10 -191 -327 -245 -231 -223 -233 -95 -255 -261 -172 -405 -362 -245 -222 -259 -129 -287 -264 -201 -167 -165 -151
5287 -151 -277 -208 -392 -202 -327 -259 -85 -202 -181 -222 -234 -299 -174 -287 -122 -233 -134 -288 -63 -232 -177 -148 -157 -180 -489 -69 -258
5314 -258 -237 -116 -60 -334 -184 -230 -261 -389 -255 -210 -275 -143 -332 -255 -119 -243 -246 -389 -252 -407 -476 -58 -178 -290 -304 -128 -97
5341 -97 -165 -298 -103 -178 -27 -259 -281 -154 -172 -146 -199 -166 -391 -249 -68 -236 -219 -327 -286 -238 -246 -186 -286 -352 -101 -206 -277 -193 -269
5370 -269 -185 -233 -122 -165 -175 -326 -257 -178 -153 -215 -236 -264 -237 -254 -295 -168 -214 -223 -269 -181 -157 -142 -235 -459 -172 -214 -241 -285 -261 -136 -175 -340
5402 -340 -233 -207 -162 -173 -222 -29 -291 -321 -260 -336 -210 -238 -258 -183 -278 12 -117 -262 -211 -328 -78 -213 -277 -19 -237 -248 -151 -218 -164
5431 -164 -91 -375 -349 -239 -156 -192 -162 -133 -86 -423 -333 -184 -132 -273 -209 -154 -393 -219 -257 -99 -431 -231 -89 -206 -416 -188 -345
5458 -345 -196 -217 -387 -238 -311 -135 -196 -288 -243 -102 -257 -331 -314 -200 -235 -220 -310 -187 -236 -324 -213 -224 -221 -250 -310 -267 -223 -229 -68 -234
5488 -234 -249 -240 -34 -114 -248 -319 -305 -40 -364 -314 -249 -247 -279 -266 -138 -271 -275 -312 -220 -187 -264 -184 -142 -219 -268 -303 -182 -176 -234 -303 -251 -147 -304
5521 -304 -275 -184 -152 -262 40 -245 -314 -158 -144 -269 -112 -96 -314 -219 -221 -284 -183 -270 -215 -30 -348 -132 -176 -101 -290 -216 -256 -255 -151
5550 -151 -160 -354 -243 -170 -264 -295 -200 -73 -288 -376 -218 -157 -416 -133 -308 -267 -183 -354 -144 -249 -246 -277 -261 -95 -204 -163 -276 -101
5578 -101 -142 -263 -200 -324 -299 -321 -169 -275 -287 -237 -214 -91 -391 -71 -141 -284 -188 -363 -410 -299 -169 -315 -215 -352 -303 -160 -187
5605 -187 -206 -226 -253 -327 -276 -252 -286 -92 -42 -230 -168 -217 -222 -214 -226 -312 -173 -216 -113 -173 -302 -82 -312 -207 -152 -195 -273 -365 -282 -264 -204 -201
5637 -201 -233 -217 -189 -188 -277 -131 -246 -339 -301 -185 -235 -203 -293 -254 -218 -191 -275 -336 -110 -359 -77 -191 -284 -140 -160 -154 -278 -55 -274 -94
5667 -94 -269 -317 -143 -245 -160 -245 -115 -343 -208 -222 -217 -259 -109 -267 -272 -341 -193 -215 -384 -109 -219 -263 -230 -249 -63 -97 -276 -217 -331
5696 -331 -198 -187 -351 -208 -242 -142 -231 -244 -136 -367 -45 -348 -165 -254 -161 -244 -228 -176 -243 19 -259 -245 -352 -234 -122 -255 -266
5723 -266 -319 -298 -257 -184 -136 -85 -137 -117 -130 -259 -236 -458 -253 -126 -158 -134 -198 -101 -268 -250 -196 -313 -104 -193 -324 -197 -57 -352 -279
$$ [...]
12297e6
##ENDNTUPLES=	NMRSPECTRUM
##$OBSERVEDINTEGRALS=	(X Y Z)
(7.4451725155108947618, 7.7376049811946376877, 1.900776576066825152)
(6.8169842558934998777, 7.4018491872611784643, 14.13798256529076447)
(6.6111984467084905503, 6.7682455116128057426, 0.30011002330093772272)
(6.0479951794653032948, 6.4108280535547228496, 1.8589750655651195999)
(3.1832400989687199555, 3.8114283585864532355, 2.1225747369945375809)
(2.1868035492307784651, 2.5929597515696536369, 12)
(1.694000690392992281, 1.9431098278273557511, 1.8678678627285212333)
(1.4590080916013627998, 1.6836855686187837122, 2.9073076319939836765)
(1.026503948342197825, 1.388796380033454847, 4.3364278568182452744)
(0.88608052520610625091, 0.9562922367740606111, 0.37006579786924076458)
(0.79340106593628556553, 0.88608052520612590186, 1.0556757525406736953)
(0.6754453905019681681, 0.70072160666677552054, 0.023885422701856583172)
(0.65297764280019221506, 1.0377378221928672541, 2.8681705521150502314)
##END=	

##TITLE=	STANDARD PROTON PARAMETERS
##JCAMPDX=	6.0	$$ NMR LITE Plug-in 1.1 of MestReNova LITE 5.2.5-4119
##BLOCKID=	2
##DATATYPE=	NMRPEAKTABLE
##DATACLASS=	PEAKTABLE
##.OBSERVEFREQUENCY=	499.751068115234375
##.OBSERVENUCLEUS=	^1H
##NPOINTS=	17
##FIRSTX=	0.78272705654420726695
##LASTX=	3.6643371856463970992
##XFACTOR=	1
##YFACTOR=	1
##FIRSTY=	2.127011174123948134
##XUNITS=	PPM
##YUNITS=	ARBITRARY UNITS
##PEAKTABLE=	(XY..XY)
0.78272705654420726695, 2.127011174123948134
0.85871878782155552923, 0.78944761286090259222
0.86580062011150793477, 0.82485433017720199977
0.89305097425782864473, 0.75754426698771992754
0.90574129779735079726, 0.92963160905145536539
1.1521222216001136829, 2.3170414447345346609
1.1718719562662998079, 3.9551054265242449048
1.1906972761882508305, 2.2802511721750842177
1.2801153196557202296, 5.0445226269431051591
1.3084646270171986782, 0.92853330030311664878
1.5966847082234865152, 12.690012169803560838
1.8046526442485277819, 3.2502628141441589626
1.8277184267360269132, 3.0143255490957527876
2.3379193094616339543, 44.902613011745515337
2.3524437077940594243, 44.934745988781529036
3.6263975874107106101, 0.48036456173585140306
3.6643371856463970992, 3.6349249037965614129
##END=	

##END=	
