##TITLE=Analysis number 317297
Compound Code cc 30104
Book Reference 438/93
Project Code adrs
Chemist Name antons
##JCAMPDX= 6.0         $$ Bruker NMR JCAMP-DX V2.0
##DATA TYPE= NMR SPECTRUM
##DATA CLASS= NTUPLES
##ORIGIN= Bruker BioSpin GmbH
##OWNER= nmr
$$ XWIN-NMR		Version 3.5
$$ Wed Feb 15 11:29:34 2006 GMT Standard Time (UT+0h)  MAYBRIDGE\nmr@NMR_250MHZ
##.OBSERVE FREQUENCY= 250.131544655141
##.OBSERVE NUCLEUS= ^1H
##.ACQUISITION MODE= SIMULTANEOUS (DQD)
##.ACQUISITION SCHEME= undefined
##.AVERAGES= 16
##.DIGITISER RES= 18
##SPECTROMETER/DATA SYSTEM= dpx250
##.PULSE SEQUENCE= zg30
##.SOLVENT NAME= CDCl3
##.SHIFT REFERENCE= (INTERNAL, CDCl3, 0, 16.522)
##AUDIT TRAIL= $$ (NUMBER, WHEN, WHO, WHERE, WHAT)
$$ ##TITLE= Audit trail, XWIN-NMR		Version 3.5
$$ ##JCAMPDX= 5.01
$$ ##ORIGIN= Bruker BioSpin GmbH
$$ ##OWNER= nmr
$$ C:\u/data/dgb/nmr/ADRS/16060/pdata/1/auditp.txt
$$ ##AUDIT TRAIL=  $$ (NUMBER, WHEN, WHO, WHERE, WHAT)
(   1,<2006-02-15 11:29:04.43 +000>,<MAYBRIDGE\nmr>,<NMR_250MHZ>,
      <created by zg, POWCHK disabled, PULCHK disabled
       configuration hash MD5:
       84 BC 41 DB A1 6E 1D 46 DA 25 12 A5 C1 ED C5 3A
       data hash MD5: 64K
       D3 37 75 02 11 B4 E2 12 ED D3 1E 10 46 A1 7E DA>)
(   2,<2006-02-15 11:29:22.42 +000>,<MAYBRIDGE\nmr>,<NMR_250MHZ>,
      <Start of raw data processing
       ef LB = 0.3 FT_mod = 6 PKNL = 1 SI = 32K 
       data hash MD5: 32K
       23 C0 F9 2A 29 9E A1 4D AF AD 03 68 AD 6A 7D 84>)
(   3,<2006-02-15 11:29:24.25 +000>,<MAYBRIDGE\nmr>,<NMR_250MHZ>,
      <apk 
       data hash MD5: 32K
       4F 98 8E DD B0 C6 CD 18 45 FF 0D 8B 63 75 B2 93>)
(   4,<2006-02-15 11:29:24.96 +000>,<MAYBRIDGE\nmr>,<NMR_250MHZ>,
      <abs ABSG = 5 
       data hash MD5: 32K
       2E 85 E1 6B BB 7E 68 C0 92 3A FE 00 28 02 E0 58>)
$$ ##END=
$$ 
$$ hash MD5
$$ AB CF C9 DB BB 8C 46 7C A0 AC 94 04 72 40 DE 19
##$RELAX= 
##$RELAX= 
##$RELAX= 
##$RELAX= 
##$RELAX= 
##$RELAX= 
##$RELAX= 
$$ Bruker specific parameters
$$ --------------------------
##$DU= <C:\u>
##$EXPNO= 16060
##$NAME= <ADRS>
##$PROCNO= 1
##$TYPE= <nmr>
##$USER= <dgb>
##$AMP= (0..31)
100 100 100 100 100 100 100 100 100 100 100 100 100 100 100 100 100 100 
100 100 100 100 100 100 100 100 100 100 100 100 100 100 
##$AQSEQ= 0
##$AQ_mod= 3
##$AUNM= <au_zg>
##$AUTOPOS= <18 >
##$BF1= 250.13
##$BF2= 250.13
##$BF3= 250.13
##$BF4= 250.13
##$BF5= 500.13
##$BF6= 500.13
##$BF7= 500.13
##$BF8= 500.13
##$BYTORDA= 1
##$CFDGTYP= 0
##$CFRGTYP= 5
##$CHEMSTR= <none>
##$CNST= (0..31)
1 1 145 1 1 1 1 1 1 1 1 1 1 1 1 1 1 1 1 1 1 1 1 1 1 1 1 1 1 1 1 1 
##$CPDPRG= <>
##$CPDPRG1= <>
##$CPDPRG2= <>
##$CPDPRG3= <>
##$CPDPRG4= <mlev>
##$CPDPRG5= <mlev>
##$CPDPRG6= <mlev>
##$CPDPRG7= <mlev>
##$CPDPRG8= <mlev>
##$CPDPRGB= <>
##$CPDPRGT= <>
##$D= (0..31)
0 1 0 0 0 0 0 0 0 0.06 0 0 0 0 0 0 0.0002 0 0 0 0 0 0 0 0 0 0 0 0 0 0 
0 
##$DATE= 1140002943
##$DBL= (0..7)
120 120 120 120 120 120 120 120 
##$DBP= (0..7)
150 150 150 150 150 150 150 150 
##$DBP07= 0
##$DBPNAM0= <>
##$DBPNAM1= <>
$$ [...]
##$SUBNAM7= <"">
##$SUBNAM8= <"">
##$SUBNAM9= <"">
##$SW= 20.6930455092707
##$SWIBOX= (0..15)
0 0 3 0 0 0 0 0 0 0 0 0 0 0 0 0 
##$SW_h= 5175.983436853
##$TD= 65536
##$TD0= 1
##$TE= 294.16
##$TE2= 300
##$TE3= 300
##$TEG= 300
##$TL= (0..7)
0 120 120 120 120 120 120 120 
##$TP= (0..7)
150 150 150 150 150 150 150 150 
##$TP07= 0
##$TPNAME0= <>
##$TPNAME1= <>
##$TPNAME2= <>
##$TPNAME3= <>
##$TPNAME4= <>
##$TPNAME5= <>
##$TPNAME6= <>
##$TPNAME7= <>
##$TPOAL= (0..7)
0.5 0.5 0.5 0.5 0.5 0.5 0.5 0.5 
##$TPOFFS= (0..7)
0 0 0 0 0 0 0 0 
##$TUNHIN= 0
##$TUNHOUT= 0
##$TUNXOUT= 0
##$USERA1= <user>
##$USERA2= <user>
##$USERA3= <user>
##$USERA4= <user>
##$USERA5= <user>
##$V9= 5
##$VALIST= <valist>
##$VCLIST= <CCCCCCCCCCCCCCC>
##$VD= 0
##$VDLIST= <DDDDDDDDDDDDDDD>
##$VPLIST= <PPPPPPPPPPPPPPP>
##$VTLIST= <TTTTTTTTTTTTTTT>
##$WBST= 1024
##$WBSW= 4
##$XGAIN= (0..3)
0 0 0 0 
##$XL= 0
##$YL= 0
##$YMAX_a= 463909
##$YMIN_a= -410593
##$ZGOPTNS= <>
##$ZL1= 120
##$ZL2= 120
##$ZL3= 120
##$ZL4= 120
##$ABSF1= 16.522
##$ABSF2= -4.171173
##$ABSG= 5
##$ABSL= 3
##$ALPHA= 0
##$AQORDER= 0
##$ASSFAC= 0
##$ASSFACI= 0
##$ASSFACX= 0
##$ASSWID= 0
##$AUNMP= <proc_1d>
##$AZFE= 0.1
##$AZFW= 0.1
##$BCFW= 0
##$BC_mod= 0
##$BYTORDP= 0
##$COROFFS= 0
##$CY= 12.5
##$DATMOD= 1
##$DC= 0
##$DFILT= <>
##$DTYPP= 0
##$F1P= 14.0000005364418
##$F2P= -0.99999901652339
##$FCOR= 0.5
##$FTSIZE= 32768
##$FT_mod= 6
##$GAMMA= 0
##$GB= 0
##$INTBC= 1
##$INTSCL= 1
##$ISEN= 128
##$LB= 0.3
##$LEV0= 0
##$LPBIN= 0
##$MAXI= 10000
##$MC2= 0
##$MEAN= 0
##$ME_mod= 0
##$MI= 0
##$NCOEF= 0
##$NC_proc= -4
##$NLEV= 6
##$NOISF1= 0
##$NOISF2= 0
##$NSP= 0
##$NTH_PI= 0
##$NZP= 0
##$OFFSET= 16.522
##$PC= 1
##$PHC0= 101.5213
##$PHC1= 1.122681
##$PH_mod= 1
##$PKNL= yes
##$PPARMOD= 0
##$PSCAL= 4
##$PSIGN= 0
##$REVERSE= no
##$SF= 250.13
##$SI= 32768
##$SIGF1= 0
##$SIGF2= 0
##$SINO= 400
##$SIOLD= 32768
##$SREGLST= <1H.CDCl3>
##$SSB= 0
##$STSI= 32768
##$STSR= 0
##$SW_p= 5175.98343685301
##$SYMM= 0
##$S_DEV= 0
##$TDeff= 65536
##$TDoff= 0
##$TI= <Analysis number 999999
Compound Code 99
Book Reference 9
Project Code 9>
##$TILT= no
##$TM1= 0
##$TM2= 0
##$TOPLEV= 0
##$USERP1= <user>
##$USERP2= <user>
##$USERP3= <user>
##$USERP4= <user>
##$USERP5= <user>
##$WDW= 1
##$XDIM= 32768
##$YMAX_p= 293493042
##$YMIN_p= -283300
$$ End of Bruker specific parameters
$$ ---------------------------------
##NTUPLES= NMR SPECTRUM
##VAR_NAME=  FREQUENCY,     SPECTRUM/REAL,   SPECTRUM/IMAG
##SYMBOL=    X,             R,               I
##VAR_TYPE=  INDEPENDENT,   DEPENDENT,       DEPENDENT
##VAR_FORM=  AFFN,          ASDF,            ASDF
##VAR_DIM=   32768,         32768,           32768
##UNITS=     HZ,            ARBITRARY UNITS, ARBITRARY UNITS
##FACTOR=    0.157963299565203, 1,           1
##FIRST=     4132.6476996994, 0,             0
##LAST=      -1043.33573715361, 0,           0
##MIN=       -1043.33573715361, -283300,     0
##MAX=       4132.6476996994, 293493042,     0
$$ Real data points
##PAGE= N=1
##DATA TABLE= (X++(R..R)), XYDATA
$$ [...]
17625f7225L5872J19672O2791J6233m4880j02390J4842P5251j1983J5423m6203
17614F7403m1365n4216M0286O3353L9289j0881m2559k4782N7638J9688m3422m3539
17602B6893O0328K0089k189J0473L6968K4148j06323m5404m5953o341O4143l264
17590C3568L8103J2366m1225p963k5493j304J8745p623k0073N2578J103L0796
17578H3578L0260n0571n3092j7291K4363R6039q791l3013k5568m3937M2190P3852
17566A18019N325o8381k4574L5422N6618m0582j9480J5991O3916J0141k1754L3925
17554A64586O003l9026l697J5805O223R1274N0977O4061Q4115K8098K4164K2953
17542E15536j2589r6788L7576k2121r9912o9358k0109L0794O9804L7691j6880
$$ plain form
17625 -67225 -31353 88319 151110 167343 122463 20073 34915 110166 98183 113606 67403
17614 67403 26038 -28178 12108 75461 114750 103869 61310 36528 94166 113854 70432 26893
17602 26893 87221 107310 105121 115594 152562 176710 70387 24983 -20970 -27311 36832 33568
17590 33568 71671 84037 42812 34849 9356 8052 26797 19174 -899 51679 52782 83578
17578 83578 113838 63267 10175 -7116 17247 113286 104495 71482 45914 1977 44167 118019
17566 118019 123344 54963 30389 65811 122429 81847 62367 78358 142274 152415 130661 164586
17554 164586 170589 131563 127866 143671 149894 241168 292145 356206 440321 468419 492583 515536
17542 515536 502947 406159 443735 421614 321702 252344 232235 263029 332833 370524 353644
17531C53644O2924O5852O1321J293o3967m1071l3727K1682Q036j00573o0823p7527
17519A97064l8337k7993l6537L4257L9576j4590l3306j6679j405o5123J0887K0895
17507F8709k095m46k1226L6731O1949K8219j7393J1067M1173K5656J4203K4997
17495B71544K0108l2982k5147J3414O0208N4663j0914m221L3852L7942N4541J3193
17483D86201o7161k1905k6208J5424m7572p859O0013N0564M4824O4718J9525m4972
17471E25592j26211k136R934O5299l9581r5471o9566o1552q1170k8273J6310j4627
17459I8548M523k7647q4559K3726Q8821k7057J9602J4657n011k8755k8112O4882
17447A13618N177k3385K5819l0060j5317J9944N3217J44101J36120N5168k1695
$$ plain form
17531 353644 416568 482420 543741 545034 481067 439996 406269 427951 435987 335414 274591 197064
17519 197064 158727 130734 94197 128454 168030 153440 120134 103455 102050 36927 47814 68709
17507 68709 66614 66168 44942 81673 143622 171841 154448 165515 206688 232344 246547 271544
17495 271544 291652 258670 233523 246937 307145 361808 350894 346673 380525 418467 473008 486201
17483 486201 419040 397135 370927 386351 338779 330920 390933 441497 486321 551039 570564 525592
17471 525592 399381 397245 407179 472478 432897 337426 267860 206308 125138 96865 113175 98548
17459 98548 103071 75424 -9135 14591 103412 76355 95957 110614 105603 76848 48736 113618
17447 113618 118795 95410 121229 91169 75852 95796 149013 293114 429234 484402 462707
17436D62707q1872p9547n0358l2608j08009p9384J3469J6008j8625j5480p152
17425A9149m848P1306J9761L3357m3887j1196q1453k5703N2770M5856N5417j38
17413A30391k7820k2266l1973k2912k2235k8768M8879O4054J1591K9877L0784
17402A59602L3297o304r0417n3278q20k0687L2404J1099j1465J9951L9274j3379
17390I9277k4862M4195K0774m1173K7236k9842m4557m4541p2867m2632M9564j248
17378f0676J1320J2900L6362K0430K0934m5837k6074K4648J10802K3000J8876
17367A46685j0600j16360O028J2994L6207P1864q016r786n7497k991J4628o692
17355G6464n9763o1130N5497J6629R578n938O3097R433K5331q863q321l5447n9838
$$ plain form
17436 462707 380835 301288 250930 218322 110313 30929 44398 60406 41781 26301 19149
17425 19149 14301 85607 105368 138725 94838 83642 2189 -23514 29256 75112 130529 130391
17413 130391 102571 80305 48332 25420 3185 -25583 23296 87350 98941 128818 159602
17402 159602 192899 186595 96178 42900 42080 21393 53797 64896 53431 73382 112656 99277
17390 99277 74415 118610 139384 98211 125447 95605 51048 6507 -66360 -108992 -59428 -60676
17378 -60676 -49356 -36456 -94 20336 41270 -4567 -30641 -5993 104809 127809 146685
17367 146685 136085 19725 25753 38747 74954 146818 138802 129016 71519 68528 83156 76464
17355 76464 16701 -44429 11068 27697 37275 31337 94434 103867 129198 120335 112014 76567 16729
17342A6729N8800m1920l4406K8032l685J5487J4373q3925J1399L4432M4216O095
17330F5627K0678J1040N278l3214K1421q434q635q8034l2899K0271L530O2312
17318C8941L7810L1770j4870m7230n2191j5726P7916J6707l0158K2145J0905l4169
17306D1850l0829L070m32k3089O6032J01586N9517o8202k9566k9192l5852Q520
17294F3413j7558K5201K4251M471l2479L6524M3949K9428n5009J1581k1047n983
17282A06742K219o6987L8073O7170p1320m7634M5855q273j4597N6420J9041K5602
17270A52311n5778q0357M1578M6926N1293K8949l9477q0844k7837n03N5900M4941
17258A37102M715r0734n8127K8837J10208n408q6353n860Q5650K9891m0569O484
$$ plain form
17342 16729 75529 33609 -797 27235 23550 39037 53410 -30515 -19116 15316 59532 65627
17330 65627 86305 97345 102623 69409 90830 82396 73761 -14273 -47172 -26901 -23371 38941
17318 38941 76751 108521 93651 46421 -5770 -21496 56420 73127 42969 65114 76019 41850
17306 41850 11021 14091 13659 -9430 56602 158188 217705 149503 119937 90745 54893 63413
17294 63413 45855 71056 95307 99778 67299 103823 147772 177200 122191 133772 112725 106742
17282 106742 108961 41974 80047 147217 75897 28263 74118 65845 51248 107668 126709 152311
17270 152311 96533 16176 57754 104680 155973 184922 145445 64601 36764 36261 92161 137102
17258 137102 141817 51083 -7044 21793 132001 126593 40240 34380 120030 149921 109352 115836
17246A15836k1037O004o520l0052M469J3837O1503L822o0641m7727o3482k4708
17234d8696L9631P1889P2049j1725Q54k6695j3981n414j889r476l768l610L434
17221F2603l3856o6380J420L0518M5084K4967k9368l1171p319L7865L787l6479
17209A671N2526L0405m3556j0495K7247Q934j9181p2087N0356K1414p3873n0453
17197g7092L1698O7088j272q8802N088j7544M02N3723m0287l2379K4795J0763
17185f3819L0638Q981l0314J8087O5638K3977K9855q4841j09058K9461K2819M3876
17173a4700N4907j1401N748L2265l9738j6994P845j7014m096k462O6252Q9445
17161A50057J617m1115n7102K771m6687l2467O4500M4878k338j3271j4449j5633
$$ plain form
17246 115836 94799 100803 94283 64231 68700 82537 144040 147862 87221 39494 -23988 -48696
17234 -48696 -9065 62824 134873 123148 124002 97307 83326 77912 76023 66547 62779 59169 62603
17221 62603 28747 -37633 -36213 -5695 39389 64356 34988 3817 -3502 34363 38150 1671
17209 1671 54197 84602 41046 30551 57798 66732 47551 -24536 25820 47234 -26639 -77092
17197 -77092 -45394 21694 20422 -68380 -63292 -80836 -80434 -26711 -66998 -99377 -74582 -63819
17185 -63819 -33181 -24200 -54514 -36427 29211 53188 83043 -1798 -110856 -81395 -58576 -14700
17173 -14700 40207 28806 34554 66819 27081 10087 17932 918 -3178 -5640 60612 150057
17161 150057 151674 110559 53457 56228 9541 -22926 41574 86452 84114 70843 56394 40761
17149D0761o8533m498l0760N8205O1371l8169j140j8340m0367j2889K5901J8949
17137i509K4182P8942K01l1151q647k240m9727K2912O5824Q3380r135K066j2544
17124A54554L58M8861R347O5033j9300j3112L4581k8543k5344o984M1726J6213
17112B77390k3236q565l2986m617M0741L8161P3947L154J6941Q011l4690K5842
17100C80093R888L2450k5749Q515k9398N198k5325J4392l4097j6340O2466O4949
17088D47042N5229J407K128M3633O2025L5885j4080M1791P9568j3819k2072N2988
17076G71725L8558J05446M5166O9071O7483M3941L7768J19856J43946O2569J52047
17065A657576K53160K77835K72427K61248L22641M48876O15073P48910R31881
$$ plain form
17149 40761 -27772 -32270 -63030 -4825 56546 18377 17237 -1103 -41470 -54359 -28458 -9509
17137 -9509 14673 93615 93816 62665 54018 51778 2051 24963 90787 174167 165032 167098 154554
17124 154554 154912 203773 213120 278153 258853 245741 280322 251779 226435 219451 261177 277390
17112 277390 254154 245589 212603 207986 248727 286888 360835 363989 380930 388941 354251 380093
17100 380093 389981 422431 396682 405197 375799 380997 355672 370064 335967 319627 382093 447042
17088 447042 502271 503678 505806 549439 611464 647349 633269 675060 754628 740809 718737 771725
17076 771725 810283 915729 960895 1029966 1097449 1141390 1179158 1299014 1442960 1505529 1657576
17065 1657576 1910736 2188571 2460998 2722246 3044887 3493763 4108836 4857746 5789627
17056E789627J170751J498636J744581J900466J977149J826131J389363Q67680
17048A8164384L72182J00699J72439L52893R03526J967588L628644N963375R535340
17039D1161070J4338165J9460622K3251773K3927846K0599909J3346035L487137
17032A59572557o225491j3377400j6852051j6964393j4550583j1109151p676444
17025G2817044n058223l482615k846119k966191l720200m610682n361675n681825
17017C9089514n494361m874800m032867l276214k534314j854102j498152j229457
17009A4295247j022501p98204o77663n22653l68334k26522r2521J49552L35966
17000A1072367N27658P49152J022277J482931K102888K981412L884332M734240
$$ plain form
17056 5789627 6960378 8459014 10203595 12104061 14081210 15907341 17296704 18164384
17048 18164384 18536566 18637265 18809704 19162597 20066123 22033711 25662355 31625730 41161070
17039 41161070 55499235 74959857 98211630 122139476 142739385 156085420 159572557
17032 159572557 153347066 139969666 123117615 106153222 91602639 80493488 72817044
17025 72817044 67758821 64276206 61430087 58463896 54743696 50133014 44771339 39089514
17017 39089514 33595153 28720353 24687486 21411272 18876958 17022856 15524704 14295247
17009 14295247 13272746 12474542 11796879 11274226 10905892 10679370 10586849 10736401 11072367
17000 11072367 11600025 12349177 13371454 14854385 16957273 19938685 23823017 28557257
16992B8557257N231146N231278M817212L946297L052070K535630K728216L702314
16984E9801420N669689Q678610J2519566J6205134J8139760J6778302J1722859
16977A49515340L740725n732264j4358022j9657066k1122121j9397450j5720871
16970E7268271j1586090p978618n359078l585081k253745j289612p71399n49421
16962B3895227n29864p56006j187599j629695j932771k024528j957833j825693
16954A2051238j567545j282410j099789q79508p34096o66677n90414m68364l34342
16945D428093k92812k88881k27766k30101j66626j34394j11325j60606j98615
16936B616967j22617n5136j14783j27625j02598j51658j46792q1278j7207q2331
$$ plain form
16992 28557257 33788403 39019681 43836893 47783190 50835260 53370890 56099106 59801420
16984 59801420 65471109 74149719 86669285 102874419 121014179 137792481 149515340
16977 149515340 153256065 147523801 133165779 113508713 92386592 72989142 57268271
16970 57268271 45682181 37703563 32344485 28759404 26505659 25216047 24444648 23895227
16962 23895227 23365363 22609357 21421758 19792063 17859292 15834764 13876931 12051238
16954 12051238 10483693 9201283 8101494 7221986 6487890 5821213 5230799 4762435 4428093
16945 4428093 4135281 3846400 3618634 3388533 3221907 3087513 2976188 2815582 2616967
16936 2616967 2494350 2439214 2324431 2196806 2094208 1942550 1795758 1714480 1697273 1614942
16926A614942o9312k1732r0323r5064p8203o8770o0437N492o877j8406m1861q1727
16914I87722j7974o176q705n2284l5535p4196j2968R121q8084K0500m773j08245
16902F08403k6185m2190j8487p507j950k7942n5429j0200R968m0903l593M7380
16890D31365K5923l8918j24384k6483O5067J29579k7093J7067k859M778r61l7136
16878D15945j1152K8791L979j1273M5436M745j385M8200l6684p3626p3822k3327
16866C15827L3859K9649k9302J2819M2012M657l7853K7442r144P063J670m8405
16854C50294n7244j7215O8955O727J4168j1780K9934k6504m2917j6331M283q8555
16842B13815j12939j5872j3776N4344L6429L8898P0337N0027o574J2376j8779
$$ plain form
16926 1614942 1545630 1523898 1433575 1338511 1260308 1191538 1131101 1136593 1129716 1111310 1069449 987722
16914 987722 969748 963572 954867 902583 867048 792852 779884 789005 700921 721421 716648 608403
16902 608403 582218 540028 521541 514034 512084 484142 428713 418513 428481 387578 383985 431365
16890 431365 457288 418370 293986 267503 332570 462149 435056 452123 449264 454042 453081 415945
16878 415945 404793 433584 437563 426290 471726 476471 475086 523286 486602 412976 339154 315827
16866 315827 349686 379335 350033 362852 404864 409521 371668 399110 389966 397029 398699 350294
16854 350294 293050 275835 344790 351517 365685 353905 383839 357335 314418 298087 302370 213815
16842 213815 100876 85004 71228 125572 162001 200899 271236 321263 314689 327065 308286
16831C08286l4784q3271j041M3021M81K387l5434R453M0337M9002k0370o1123
16819B16944j7352O351j562j3927L9390L2064k2723k1067m4783R389K8981M924
16807B16629r4457j4690l5097R804j1269K7264K0206L3922M2968P467m7539n991
16795A49217K4778Q547N8046k5014k8504m3164o3655P312K594j4609J3052q906
16783G9694l0410j794m6158o2232k7923N089L1683M0438L4367M5526N4854q5232
16771C7902k1578L3601n1574M857O4552M3054L614k1380M6728K0550p9433L2191
16759A13084M4277j12912q4024k3060J4149L7464P0947j4009n4980J7072K3334
16748C1342k8216j5156j9373M0586n5769j734O5585O8423K5942m692p9111l2465
$$ plain form
16831 308286 273502 190231 189190 232211 232692 235079 199645 209098 249435 298437 278067 216944
16819 216944 199592 205943 204381 190454 229844 261908 239185 218118 173335 182724 211705 216629
16807 216629 122172 107482 72385 82189 70920 98184 118390 152312 195280 202747 155208 149217
16795 149217 173995 182542 240588 215574 187070 143906 80251 87563 90157 75548 88600 79694
16783 79694 49284 47490 1332 -60900 -88823 -83734 -52051 -11613 22754 68280 123134 37902
16771 37902 16324 49925 -1649 3208 67760 110814 114428 93048 139776 160326 80893 113084
16759 113084 157361 44449 -39575 -62635 -48486 -11022 59925 45916 -9064 8008 31342
16748 31342 3126 -12030 -31403 9183 -46586 -48320 17265 85688 111630 106938 27827 -4638
16736d638K5752N004J6428P0592k9392K7408j1618K9925K1369o3342n183L0851
16724A13156K0240l0311l420k878l6416O9456p496l7865L8255K8234p4979q3584
16712g608o3269L1962K659j0617K0595J7736m1588M1685J3757K1058J7432K9508
16700G3310K9623P011l8777j9681j1046N572M4012N2753l8843l2805M0033P993
16688A19155k5227q495J7197p020o7505M723l6658j6785J2515L0983O3671m2976
16676D3578o4279j0950N4702N779P396o2924N16O7521N9092n0127K2915l9083
16664C4136j8373K8318Q0962O1797K158k8325r4256p9041m2801K1791O3696m6250
16652a6188j6614J8898K6647J2328j0489Q067m8490M7098L5708j7460n8064M937
$$ plain form
16736 -4638 21114 26118 42546 113138 83746 111154 99536 129461 150830 87488 82305 113156
16724 113156 133396 103085 99665 96787 60371 129827 122331 84466 122721 150955 75976 -7608
16712 -7608 -70877 -38915 -36256 -46873 -26278 -8542 -50130 -8445 5312 26370 43802 73310
16700 73310 102933 109944 71167 51486 40440 46012 90024 142777 103934 71129 111162 119155
16688 119155 93928 85433 102630 95610 28105 32828 -3830 -20615 -8100 22883 86554 43578
16676 43578 -20701 -31651 23051 28830 36226 -26698 -26182 41339 100431 50304 73219 34136
16664 34136 15763 44081 125043 186840 188998 160673 66417 -12624 -55425 -33634 30062 -16188
16652 -16188 -32802 -13904 12743 25071 14582 22649 -25841 21257 56965 39505 -18559 -13622
16640a3622L0586P5697K0044l572j9694q1564l5670L4618j7322j5622o168Q382
16628b3907k2625n00L4554L717K1710m7071m3789l8517M2465J3647P2418L7648
16616D9750o1750m3615J6434j407N1433r511P3978M1827m3339o7459L675K5559
16604C5575j8356l577O12j1019P5862N2740j7723r4011n4150P446J201J2571k3873
16591c6702N115q630M459j2203o5522j8245O6317N5080l4671j8675M9176N7582
16579D3081p120l4806N4363J0748m4714l723J9791l4430M3665k2545m4678m3926
16567f4294K4321p894k6499R109O2422k2593J4178l3205l6897O2884N7462l6799
16555B195k4205j3606L183J01332K7177o4466p8488K7666J3423R953n7311j9326
$$ plain form
16640 -13622 16964 92661 112705 109133 89439 7875 -27795 6823 -10499 -26121 -32289 -23907
16628 -23907 -46532 -47032 -12478 -8761 12949 -34122 -77911 -116428 -73963 -60316 12102 49750
16616 49750 -12000 -55615 -39181 -40588 10845 1334 75312 117139 73800 6341 10016 35575
16604 35575 17219 13642 14254 3235 79097 131837 114114 20103 -34047 -26601 -25400 -12829 -36702
16591 -36702 -31587 -40217 -35758 -47961 -113483 -131728 -65411 -10331 -45002 -63677 -14501 43081
16579 43081 35961 1155 55518 66266 21552 17829 37620 3190 46855 24310 -20368 -64294
16567 -64294 -39973 -47867 -74366 -65257 -2835 -25428 -11250 -44455 -81352 -18468 38994 2195
16555 2195 -22010 -35616 -32433 68899 96076 31610 -46878 -19212 -5789 4164 -53147 -72473
16543g2473K7951N1051M62J9965R8634M0924J7782K7868J06658J21192L3653n667
16531D68000k0184l1105q045l5319n1021K1107R491P5395P0284l3468P2511K0964
16519E58610J3790j9024p2289m7332j5504k4913l7825o3272n5789p4850l5470
16508A26132J0523K2836m3836n7366m192M2821J3434K4810j9663o3555j8969k4711
16496H264K3959J8546L1431q908K7174l8241l4179j1564Q1823Q6199M2275Q4425
16484C11204J7426J3474N3113O9469Q916J0093J936L8302m6094r0040o1417l5243
16472B91139J171k1760q6210l9067M4959M4178M3806K4833M0245K0752K0127N5870
16460D40043L9826n0266n4351l0656J3332n7601j00883o2953L231j8888l3673
$$ plain form
16543 -72473 -44522 6529 6991 26956 125590 166514 184296 212164 318822 440014 473667 468000
16531 468000 447816 416711 408666 373347 322326 343433 352924 428319 498603 465135 537646 558610
16519 558610 572400 553376 481087 433755 418251 393338 355513 292241 236452 161602 126132
16508 126132 136655 159491 115655 58289 54097 96918 110352 135162 115499 51944 32975 8264
16496 8264 32223 50769 82200 73292 100466 62225 28046 16482 98305 184504 226779 311204
16484 311204 328630 342104 395217 464686 473602 483695 485631 523933 477839 387799 326382 291139
16472 291139 292310 270550 184340 145273 190232 234410 278216 303049 343294 364046 384173 440043
16460 440043 479869 429603 375252 344596 357928 300327 199444 136491 139722 120834 87161
16449H7161n4438j9491Q283m2261J7553J14m6627J710K4244Q7146l1156n9816
16437b7578L0278K2309K5307M4918n27m9751l6181p3095q8110J8738L0645N9210
16425d3837J7966j5496R642K9063k377J2931L0190o1069p7023j4919k263J1153
16413a06039L9083O3422J5276m5383K0479M5985M5824m8552k7037j4653l4100
16402d5695m0461k7028J02829M5674n059q5352q793L1408P848O1045M9772j5857
16390G0331m9069p2279n8637r322O4412J04323k200p9877l6302M286R564L9528
16378a5242K9048j0888k1144o43N2195k8359j9445M9113J605K4691q046p1369
16366a8484p153k2562N2916K4245j5836M4209m5769k3026J8102J6564K333m6449
$$ plain form
16449 87161 32723 13232 21515 -20746 -3193 -3079 -49706 -47996 -23752 63394 32238 -27578
16437 -27578 2700 25009 50316 95234 94707 44956 8775 -64320 -152430 -133692 -103047 -43837
16425 -43837 -25871 -41367 -31725 -2662 -5039 7892 38082 -22987 -100010 -114929 -117192 -106039
16413 -106039 -66956 -3534 11742 -33641 -13162 32823 78647 30095 3058 -11595 -45695
16402 -45695 -86156 -113184 -10355 35319 30260 -55092 -63885 -32477 -24629 36416 86188 70331
16390 70331 21262 -51017 -109654 -118976 -54564 49759 47559 -32318 -68620 -64334 -54770 -15242
16378 -15242 13806 2918 -18226 -18869 33326 4967 -14478 34635 36240 60931 52885 -18484
16366 -18484 -25637 -48199 4717 28962 13126 57335 11566 -11460 6642 23206 25539 -20910
16354b0910J432L7887M0462R700l5828R660L4399k5729p1733K6351L0247m0646
16342d708l4730M3740L2775k0828k4360J1672m4564l846j1211M569K1620J4461
16330a5410m5301j736k1547J6081O1889N3989M611p9932o1213L2378M2481k786
16318a6496L9663L8785J7792o3056l0522k0371p997K9687J6982Q968P452R382
16306C0269l9712n3058k1239O4332N5615R756j9080j3301l1410J7937O3563k8197
16294C5475l2039K8689K3813l0452l4368O91n142J418J3734r644j0153L8640L631
16281B4293L4799m5279j0393M2036j641N120n084N146J1354l5752k3134l3492
16269c2027m3599L6211p45L291J03m4395k6326K2724j1977J6287p435N8975L5942
$$ plain form
16354 -20910 -19478 18409 58871 68571 32743 42403 76802 51073 -20660 5691 35938 -4708
16342 -4708 -39438 4302 37077 16249 -8111 3561 -41003 -44849 -56060 -51491 -29871 -15410
16330 -15410 -60711 -62447 -83994 -67913 -6024 47965 52576 -27356 -88569 -56191 -13710 -16496
16318 -16496 23167 61952 79744 16688 -13834 -34205 -42202 -12515 4467 13435 20887 30269
16306 30269 -9443 -62501 -83740 -19408 36207 45963 26883 13582 -17828 109 63672 35475
16294 35475 3436 32125 55938 25486 -8882 -8191 -13333 -11915 1819 -7825 -17978 20662 24293
16281 24293 59092 13813 3420 45456 43815 48935 43851 48997 60351 24599 1465 -32027
16269 -32027 -75626 -39415 -40160 -36869 -36766 -81161 -107487 -84763 -96740 -80453 -87888 -28913 7029
16256G029r18K1235k7915q2046K5958L4750j2464J2974M1134j6523j627k040n114
16243e567j7707J9912P278M3094M4774o8782k3126q839N1616M2788k589q0091
16231B761m9714K0418l357l7826j4917k270M3896M6986J1539N911q703q343n6895
16218e0514q0989j7952J9051O909R8292K8141o9458k3845R1988M9194n2773o2987
16206f4943J6931M3261l3603o1033k3023K3350M3065M0768M1340L7077j9394l9303
16194D493m1616K1620P4374J5049l1508m5696K2792n4946M240m4015l3576K9658
16182g9131P4011n80l1742N7200J2472l7710L8880l5932p1168P483L4652L0295
16170a270k676J214j5957O233K7826j6928L7070n0775k8806P0650j0665k1125
$$ plain form
16256 7029 6111 27346 -569 -82615 -56657 -21907 -34371 -21397 19737 3214 1587 -453 -5567
16243 -5567 -23274 -3362 3916 47010 91784 23002 -124 -8963 42653 85441 82852 2761
16231 2761 -46953 -26535 -29892 -67718 -82635 -84905 -41009 5977 17516 23427 14724 6381 -50514
16218 -50514 -131503 -149455 -130404 -123495 -25203 2938 -66520 -90365 1623 50817 -1956 -64943
16206 -64943 -48012 -4751 -38354 -99387 -122410 -99060 -55995 -15227 26113 63190 43796 4493
16194 4493 -37123 -15503 58871 73920 42412 -3284 19508 -35438 -31198 -75213 -108789 -79131
16182 -79131 -5120 -5700 -37442 19758 32230 -5480 33400 -2532 -73700 -66217 -31565 -1270
16170 -1270 -3946 -2732 -18689 -12456 15370 -1558 35512 -15263 -44069 26581 15916 -5209
16158e209M1853O348m2568l197N109k7639k441j7099o694o3215l1181p833N9933
16145i3833P1093M4412k6987j7678K913N612m2517K4988N2331l8814M9565O4513
16133I5598l1135o5364q9949k0164P3897P6149J1973j3206k5064J745j9851m8612
16121e3983M8714m5342k9663J6707Q3351Q3890K6952p7428l701m9590m6531M4437
16109b187o0603n7270J2213J4219q96J7647J8853K6509r595m2339n3887p3751
16097b11087k3452L8908M6383K1596L5570j5109K6281M5863K5764Q403m5934J3306
16085c3508O6413m3184l0134N9400o0787o8243K814L6650J9970J254M27K6351
16073b2577K341m6934k5492L4114K8551q914k2932J7842J7646j2332K9099o2040
$$ plain form
16158 -5209 36644 42992 424 -2773 2336 -25303 -27744 -44843 -51537 -114752 -145933 -153766 -93833
16145 -93833 -22740 21672 -5315 -22993 -20080 -14468 -56985 -31997 20334 -18480 31085 95598
16133 95598 64463 -901 -90850 -111014 -37117 39032 51005 37799 12735 14480 -5371 -53983
16121 -53983 -5269 -50611 -80274 -63567 19784 103674 130626 53198 49497 -93 -46624 -2187
16109 -2187 -62790 -120060 -107847 -93628 -94524 -76877 -58024 -31515 -41110 -83449 -137336 -211087
16097 -211087 -234539 -195631 -149248 -127652 -92082 -107191 -80910 -35047 -9283 -880 -46814 -33508
16085 -33508 32905 -10279 -40413 18987 -41800 -110043 -107229 -70579 -50609 -49355 -48928 -22577
16073 -22577 -20236 -67170 -92662 -58548 -29997 -38911 -61843 -44001 -26355 -38687 -9588 -71628
16061g1628o6962J6853R0221M5490J0269L6912m562j772K5507l7421l9639k6294
16049b3026j8066p542k3586q552J5930M0217o061M0702N9023n0908k0249M8498
16037D6380P174m9641o2093J2018n7261j2021J2885O6652J3022r8635K4920Q7166
16025i434m2528L787O182J889k5943J9710L1254k4419k7732k2426J8652R432J9696
16012d1880K799j6936J9604N704k5868l98q099Q98M6098K3193R924j2191q187
15999e339J5581k1009j817L6007l5162j0218N918N1192O3634q9678j500N0385
15987E7994o0322K2536q061k0582m2735n2451n245J7060k289k2182k1798M0249
15975i7826L0283M3614M7706j8623k2315p062M533J44L4885K3190l4557m8697
$$ plain form
16061 -71628 -138590 -121737 -31516 13974 24243 61155 56593 54821 80328 42907 3268 -23026
16049 -23026 -41092 -48634 -72220 -80772 -64842 -24625 -30686 10016 69039 18131 -2118 46380
16037 46380 53554 3913 -58180 -46162 -103423 -115444 -102559 -35907 -22885 -121520 -96600 -9434
16025 -9434 -51962 -48175 -41993 -40104 -66047 -46337 -15083 -39502 -67234 -89660 -71008 -61576 -41880
16012 -41880 -39081 -56017 -36413 -30709 -56577 -56975 -65074 -64176 -18078 5115 15039 2848 -5339
15999 -5339 10242 -10767 -12584 23423 -11739 -21957 -16039 35153 98787 9109 7609 57994
15987 57994 -2328 20208 12147 -8435 -51170 -103621 -108866 -91806 -94095 -116277 -138075 -97826
15975 -97826 -67543 -23929 23777 5154 -17161 -24223 -19690 -19546 15339 38529 3972 -44725
15963d4725M2074J379o9357K6968j388j0007j939O602n209K0226M5209J9612p2658
15950d3213j1081R4837r817l6881O8072l3917n5833k6478k3969J5241J0369j0738
15938f3408N2677L6319k3449n1086J2100J3982n299o1601j3829L9651K8935j3104
15926d8112O592L0573n0388k1827J8410K9030j5311n1522L5378J6969m3038l9311
15914a32557P073P4273Q9798O372L8909K9934m9530j34847l9312L6755l206m0716
15902a17054n9281o894O3718L8422K2916J7146l2585k745L1549K6262j3348O0098
15890B8204K1939r718K003m5840o158j5589M3393p255k322p1289o0312K6274Q4102
15877a2568L5700j8918k4781o3994Q270L336J9419o813r909K4271O1798L4424
$$ plain form
15963 -44725 -2651 -1272 -70629 -43661 -45049 -55056 -56995 -50393 -55602 -35376 9833 29445 -43213
15950 -43213 -54294 40543 30726 -6155 61917 28000 -27833 -54311 -78280 -63039 -52670 -63408
15938 -63408 -10731 25588 2139 -48947 -36847 -22865 -28164 -89765 -103594 -63943 -35008 -48112
15926 -48112 -41520 -10947 -61335 -83162 -64752 -35722 -51033 -102555 -67177 -50208 -93246 -132557
15914 -132557 -125484 -51211 38587 44959 83868 113802 64272 -70575 -109887 -73132 -76338 -117054
15902 -117054 -176335 -183229 -119511 -81089 -58173 -41027 -73612 -76357 -44808 -18546 -31894 28204
15890 28204 50143 40425 42428 -3412 -9570 -25159 18234 10979 8657 -62632 -122944 -96670 -12568
15877 -12568 23132 4214 -20567 -84561 -76291 -72955 -53536 -60349 -70258 -45987 15811 50235
15865E0235Q224j2171p4431p8026K4964n827N4566K0612O2263P2375k3046J7060
15853A16798k6567p7152o3088l4800l5272O6557k7864l7032J5923K3971L0869
15842d7657K7322k0313m955l6260o79N6986j3868J7118j6896m0826n9652K0076
15830a19604O8947R176l0821q4718k0288K4038M3313L3654M2508L637j3423j75
15818d3756m6190J5875L4268O3145m4740l428K6644q215K1728k1751q680k894
15806a7994j2782j0275j947J8115k4206k9423k2145J1519M1149J067o0061J786
15794a05197P284K3098M0754L2373O7877J6230K2089q1622j9938N0077j996o6460
15782a5431k3407L066J1163l515l9846k2905P1687O4926O653k106K1676K2408
$$ plain form
15865 50235 58459 46288 -28143 -106169 -81205 -87032 -32466 -11854 50409 122784 99738 116798
15853 116798 90231 13079 -50009 -84809 -120081 -53524 -81388 -118420 -102497 -78526 -47657
15842 -47657 -20335 -40648 -45603 -81863 -82542 -25556 -39424 -22306 -39202 -80028 -139680 -119604
15830 -119604 -50657 -41481 -72302 -157020 -177308 -153270 -109957 -76303 -33795 -30158 -43581 -43756
15818 -43756 -89946 -74071 -39803 23342 -21398 -24826 1818 -6397 15331 -6420 -15100 -17994
15806 -17994 -30776 -41051 -42998 -24883 -49089 -78512 -100657 -89138 -47989 -46922 -106983 -105197
15794 -105197 -97913 -74815 -34061 -1688 66189 82419 104508 22886 2948 53025 51029 -15431
15782 -15431 -38838 -35772 -24609 -28124 -67970 -90875 -19188 45738 52391 50285 71961 94369
15770I4369N5886l3422r6963j8647p981l5169P459J1864O6019O6360j6685r7311
15758d221l9554K3805p116m0769M2937L6071m3719k8758p187J5237L6946O251
15746a0077l527n677k7461J9014O8959N6751n5265J0279J1162j5910o0375k0352
15734c2479j4490J3372k7000L0059P9835O106J2201K7448j1693o0399J7836K3561
15722F4357o5146n3303Q328j4754r400L236M599J2643o777m4518K3770j1534K2917
15709f5582K0372m5865L8514M3841K641J1921K0466k2642m1470L205Q6005J4065
15697F5471o3154l3303L1389J8209L1524k0972n9670J7791N619J5180M9417N5876
15685A13377l8944n6028l6872O5862r662k1144q763n0332K1429L5684K5042J6859
$$ plain form
15770 94369 150255 116833 19870 1223 -6758 -41927 -34468 -22604 43415 109775 93090 -4221
15758 -4221 -43775 -19970 -27086 -67855 -24918 11153 -32566 -61324 -68511 -53274 -16328 -10077
15746 -10077 -13604 -19281 -46742 -27728 41231 97982 42717 52996 64158 48248 -12127 -32479
15734 -32479 -46969 -33597 -60597 -30538 49297 55403 67604 95052 83359 22960 40796 64357
15722 64357 -789 -54092 -45764 -60518 -69918 -66682 -62083 -49440 -56217 -100735 -76965 -88499 -65582
15709 -65582 -45210 -91075 -52561 -8720 -6079 5842 26308 3666 -37804 -34599 51406 65471
15697 65471 2317 -30986 403 18612 50136 29164 -30506 -12715 -7096 8084 57501 113377
15685 113377 74433 18405 -18467 47395 37733 16589 7826 -42506 -21077 14607 39649 56508
15673E6508l6171n0606r999M6903j7695K2507J0583m5266k3421J4566K3946N07
15661g638J1993k2564n7068K2396M2511N47o49J4077K1628o462j4016j0905k0772
15648b6922j5078l3030j2352M1404M8875o8169r133N544K9580L3255N1983L6353
15636H2310m9346k6640N3090L4846J7419J0736J5520K1127m8804j08310q4503
15625h2555K8389J3724O777L9942j7481J821n3698j1170j0553M5425R134l8022
15613f8267M049l278j3916k1518K1202N5252k9527N4792P714P360J3891n5720
15601b7966j6324L9745L1413j4202M9353J9453k3670o1034M9187J6095m8846o4134
15589e0930j5954o3334K4319J4133o5739Q12J2167P6102M0618J0721k4555M737
$$ plain form
15673 56508 20337 -30269 -40268 6635 -11060 11447 22030 -23236 -46657 -32091 -8145 -7638
15661 -7638 4355 -18209 -75277 -52881 -10370 -9823 -10472 3605 25233 18771 4755 -6150 -26922
15648 -26922 -42000 -75030 -87382 -45978 2897 -65272 -74405 -68861 -39281 -6026 45957 82310
15636 82310 32964 6324 59414 94260 111679 122415 137935 159062 110258 1948 -82555
15625 -82555 -54166 -40442 -33665 6277 -11204 -9383 -63081 -74251 -84804 -39379 -30245 -68267
15613 -68267 -64218 -67496 -81412 -102930 -81728 -26476 -56003 -1211 6503 13863 27754 -27966
15601 -27966 -44290 -4545 26868 12666 62019 81472 57802 -3232 45955 62050 13204 -50930
15589 -50930 -66884 -130218 -105899 -91766 -157505 -156693 -144526 -68424 -27806 -17085 -41640 -36903
15577c6903j082O795m157m5241l851M3723N6308l3984k8501r3354J5962L3351
15565i0934r1637j9377J8303N6939J6341L7256j3360R684o728L8438P445k8779
15553f6409r5404l4187M2152j4677M1938M6377k81J5387j4523L7622K8565J1790
15541a650j237j7173j7379M1799P6592J5227m087j6857k8261o3478m5979l242
15529f5725J2350N6626O2569P1499p777p5352p3111j7239o3034q367O3006O5422
15517B0867R298j6283M6272o6616m6386M6183L4350L3670J6738n5152q0988p9783
15505a37830k639J3773M9471j1938K8667M0109R355O2609l0667o1389J253J0927
15493b8299j2415K6326N7491n0046n9601n087N2174L2085L0752j4122l5722K2308
$$ plain form
15577 -36903 -37985 -31190 -35347 -80588 -84439 -40716 15592 -18392 -46893 -140247 -124285 -90934
15565 -90934 -182571 -201948 -183645 -126706 -110365 -73109 -86469 -76785 -83513 -45075 -37630 -66409
15553 -66409 -161813 -196000 -153848 -168525 -126587 -80210 -80491 -65104 -79627 -42005 -13440 -1650
15541 -1650 -2887 -20060 -37439 4360 80952 96179 92092 75235 46974 -16504 -62483 -65725
15529 -65725 -53375 3251 65820 137319 129542 54190 -18921 -36160 -99194 -107561 -44555 20867
15517 20867 30165 13882 60154 -6462 -52848 -6665 27685 61355 78093 22941 -58047 -137830
15505 -137830 -140469 -126696 -77225 -89163 -60496 -20387 -11032 51577 20910 -40479 -39226 -28299
15493 -28299 -40714 -14388 43103 -6943 -66544 -71631 -19457 12628 43380 29258 -6464 15844
15481A5844L1423l492o896J0104J2652m9258J0775J8206l3553k7130k9278Q079
15469d2524M6125L8479J4747J1292L876m570j633l1155m2007K155j2538K455M7967
15456C2669j5999K513l2660j0812k2258l2267R179O3590K4803j2557j9149O722
15444f226O562L1974L0346p77o1591k8365K2174J8066K6097L9666O6123J5604
15432A59653l6844k7952j36856j02998j8823j45O0398O2666K9912m0316n7352
15421a08657J3665O7841L9300p451r208N1010N9819n7494k7142N5552m4780m4459
15409a2004n7187J103N0890K0999k6982m513k8579n057j0499R8637n5461j8227
15397d6880j3947K9522N917n342k840j0385P8711J0449j4934K8687m4740k7024
$$ plain form
15481 15844 47267 43775 36879 46983 59635 10377 21152 39358 5805 -21325 -50603 -42524
15469 -42524 3601 42080 56827 68119 71995 67425 65792 34637 -7370 -5215 -17753 -15298 32669
15456 32669 16670 19183 -13477 -24289 -46547 -78814 -69635 -6045 18758 6201 -12948 -6226
15444 -6226 336 32310 62656 61879 288 -28077 -5903 12163 38260 77926 144049 159653
15432 159653 122809 94857 -41999 -144997 -163820 -163965 -103567 -40901 -10989 -51305 -108657
15421 -108657 -94992 -27151 12149 4698 -4510 46500 106319 48825 21683 77235 32455 -12004
15409 -12004 -69191 -68088 -17198 3801 -23181 -27694 -56273 -61330 -71829 26808 -28653 -46880
15397 -46880 -60827 -31305 -25388 -30730 -33570 -43955 34756 45205 30271 58958 14218 -12806
15385a2806J6219M7701M8444M1071M863m6527L979n3478l3402P913J7951j130
15373D0798j4590j5063j0695N0644k3989j7570j6471k5776R990J7914J5688l823
15361G057n7371l9451M4428L6520o860N151k798M3021n0892k4846j183L5971M8438
15348C7185N4135k6802m9584M88O509m2572k9477p9951O379P1981M6480k1659
15336b6888K566J2335j1205K3461m0634l555N2882J1829Q0167N6526k0267l4517
15324A02700L2205k3050p8362j0243Q830R683L6527l6856k7077n1981j9117P3296
15312A6555K5251k4117J1728m0415m1151O9775J8985o4874n5981R620O0395j0094
15300b4323k5326n17m5834n1272m8100L8661R732M8627L035m6921K6176L2418
$$ plain form
15385 -12806 3413 51114 99558 140629 145492 98965 102944 49466 16064 23977 41928 40798
15373 40798 26208 11145 450 51094 27105 9535 -6936 -32712 -22722 -4808 10880 7057
15361 7057 -50314 -89765 -45337 -8817 -15677 -10526 -13324 29697 -21195 -46041 -47224 -11253 37185
15348 37185 91320 64518 14934 15422 21931 -20641 -50118 -130069 -123690 -51709 -5229 -26888
15336 -26888 -24322 -11987 -23192 269 -40365 -43920 8962 20791 100958 157484 137217 102700
15324 102700 134905 111855 33493 23250 32080 41763 78290 41434 14357 -37624 -56741 16555
15312 16555 41806 17689 29417 -10998 -52149 17626 36611 -28263 -84244 -74624 -14229 -24323
15300 -24323 -49649 -50166 -96000 -147272 -195372 -156711 -146979 -98352 -95317 -142238 -116062 -83644
15288h3644O1615P242K102Q426o5050l698N0595L1990N7210N3385o1302K191J2124
15275G3186n9069K0914k9882n2891m4463k3403K130N3468M5379L4013J540o6781
15263d5859j5724K9682R379N258j4412K5147K1028n4115j0525k312J3427P49l2716
15250g0993r6556O3996Q2149P0107j8565m1054m4248j8130J0571o006M315K4074
15238d0340P0874k214J1151o3794k0318J1901M870J2754n3082p0767O259K3765
15226a08941O432j580M4825l7885p470L9458J8686l5040J508L7718N0957l274
15214E394p0741Q725m884J6365N6980J7940p5947m7459L2043K4315O9395O4596
15202I6722j8500k862n2907m4141L6526L6448m5019Q498j016j4032j2428J5203
$$ plain form
15288 -83644 -22029 -14787 -12685 -4259 -69309 -73007 -22412 9578 66788 120173 58871 61062 73186
15275 73186 14117 35031 5149 -47742 -92205 -115608 -113478 -60010 -14631 19382 20922 -45859
15263 -45859 -61583 -31901 -22522 -17264 -31676 -6529 14499 -39616 -50141 -52453 -39026 -38277 -70993
15250 -70993 -167549 -103553 -21404 48703 30138 -10916 -55164 -73294 -62723 -68729 -64414 -40340
15238 -40340 30534 28320 39471 -24323 -44641 -32740 -27870 -15116 -68198 -138965 -132706 -108941
15226 -108941 -102509 -104089 -59264 -97149 -104619 -65161 -46475 -81515 -80007 -42289 8668 5394
15214 5394 -65347 -56622 -61506 -45141 11839 29779 -46168 -93627 -61584 -37269 32126 96722
15202 96722 78222 75360 22453 -21688 14838 51286 6267 14765 13749 -283 -12711 2492
15190B492M252j0137k1499k892Q612j1136K0462J2848o9013j0775M808j2829Q773
15177g6034N1070K6214n1618k5994J0589n183L3598Q418M5701J0774K528M3041
15165G3104r875m7701p586m9271q5481R979k8754J2329P2958J1863R515j9233
15153e8153l7219k6946l640L7682L9436P288J1441L3485M8329O1501j2189P017
15141A08032n6714m0702r6831J3253L1926j7070M211l987l1555K4435k4143o639
15129i5784Q942K7924k7317K7572k9502j1835J4013M894M856J0339O5792K7230
15117B7124J3111L2997j6618m2923m7087q934P583n410j6098O0067N613l2317
15105b2892l9590j1734m1276R825N8164k3686j8670k6199L2601Q5399J1432L066
$$ plain form
15190 2492 6744 -3393 -24892 -27784 -19172 -30308 -9846 3002 -66011 -76786 -71978 -84807 -76034
15177 -76034 -24964 1250 -50368 -76362 -65773 -70956 -37358 -28940 16761 27535 30063 73104
15165 73104 63229 15528 7942 -41329 -126810 -116831 -145585 -133256 -60298 -48435 -38920 -58153
15153 -58153 -95372 -122318 -125958 -88276 -48840 -41552 -30111 3374 51703 113204 101015 108032
15141 108032 51318 10616 -86215 -72962 -41036 -58106 -53895 -57882 -89437 -65002 -89145 -95784
15129 -95784 -86842 -58918 -86235 -58663 -88165 -100000 -85987 -81093 -76237 -65898 -106 27124
15117 27124 40235 73232 56614 13691 -33396 -42330 -34747 -40157 -56255 3812 9425 -22892
15105 -22892 -62482 -74216 -115492 -105667 -47503 -71189 -89859 -116058 -83457 1942 13374 16440
15093A6440j306m0696l6712L2037l9196J664J9464L1450j944p4286j6722k7403
15081a37210o843l514m843J9920r433Q137L649k0443j0328m343L1533M7996J3080
15068g2642M6432M0750m0030n9736R304L5549Q2494K8129J4254k0120p120J9385
15056G6649k4942j0118q6695j4628N9030j7151j5334m726N9666M3607o975k7180
15044C1203k7914j4633m2557L8098P9968K8313o5274k2018K0043j8381N8665J7390
15032H2903l2640M743J5271N0804M1394m1837l7594M2953p8802l9638k6172k8554
15020d7169n902M0967q020m3393j7702k3604K082J4309O3583L9737o5883k683
15008e3678l0819Q692K5996M1097K1184j8740m3490K4881Q425N201L4594K4173
$$ plain form
15093 16440 15134 -25562 -62274 -30237 -69433 -67769 -48305 -16855 -18799 -93085 -109807 -137210
15081 -137210 -144053 -147567 -152410 -132490 -141923 -133786 -130137 -150580 -160908 -165251 -133718 -85722 -72642
15068 -72642 -26210 14540 -25490 -85226 -75922 -40373 42121 70250 84504 64384 57264 76649
15056 76649 51707 41589 -45106 -59734 -704 -17855 -33189 -37915 21751 65358 58383 31203
15044 31203 3289 -11344 -53901 -15803 64165 92478 27204 5186 25229 6848 65513 82903
15032 82903 50263 55006 70277 121081 162475 120638 83044 125997 47195 7557 -18615 -47169
15020 -47169 -53071 -12104 -20124 -63517 -81219 -104823 -102741 -88432 -24849 14888 -50995 -53678
15008 -53678 -84497 -75805 -49809 -8712 12472 -6268 -49758 -24877 -16452 -11251 23343 47516
14996D7516k0612k4883l5311k1626j5963J3915K4875R456L1922J2025L2252k4474
14984B9092P832P6379K3407l0486p2778l4293k8258j349P5397O8967m3196m2106
14972B8608l4393k8103k7138N5374j3559L2076L2508j9703n4775L5550J7946L899
14960B8290N4605p433o5006r676r969o531k8617J9273L0584P464M3609q6256n7433
14947h7096J9946J763O648L4396p331K6441R921K800J0580K8530P3275L7097l7064
14934A19906n6346l8985N3000M3769m6801j576j9443m1567J3956j5385l9214N5544
14922B6858k5830j8241J6629M3885J0635j0496l2208m716O989k7546j4712J0945
14910a7808O831L8483J4932o09L921M160l9470J2433M1410l296q6653M6056j422
$$ plain form
14996 47516 26904 2021 -33290 -54916 -70879 -56964 -32089 -22633 9289 21314 53566 29092
14984 29092 36924 113303 136710 106224 33446 -847 -29105 -30454 44943 113910 70714 28608
14972 28608 -5785 -33888 -61026 -5652 -19211 12865 45373 25670 -29105 6445 24391 28290
14960 28290 82895 75462 10456 780 -9189 -15720 -44337 -25064 5520 12984 56593 -29663 -87096
14947 -87096 -67150 -65387 -58739 -24343 -31674 -5233 4688 7488 18068 46598 119873 156970 119906
14934 119906 63560 24575 77575 121344 74543 72967 53524 11957 25913 10528 -28686 26858
14922 26858 1028 -17213 -584 43301 53936 43440 11232 6516 13505 -14041 -28753 -17808
14910 -17808 -10977 27506 42438 41829 45750 49910 10440 22873 64283 60987 -25666 20390 18968
14897A8968l5736r821P1370L4888p897n4991k8217n523O265J4358J2540Q69J1573
14884B8646J1765k2344o2446k2450N248K3741K8485L3053M480O070J6259o0718
14872a0211l7632m052j3105K8725K7993M806K1715R880p1518m0976K8852q293
14860f3816M6342N3588Q949r0514l1900M592j4534K8816J3022l999K7388O50M4805
14847B3389K7100n1619o4390j2554N0818M8743L4931K8646l7141l5683R542R720
14835C1502j6371J3938P04k4877L3696M0967j7374m0999l7134k0039r9422l0481
14823a65890J06571M5548K6367m2874p5549L3667L7948J9073N2187K4668k1148
14812D0568k2169n7858l0540K8400O5730M8738j6411m2226o4234m2506l3342J7136
$$ plain form
14897 18968 -16768 -26589 44781 79669 71772 16781 -11436 -16959 -10694 3664 16204 17073 28646
14884 28646 40411 18067 -44379 -66829 -61581 -37840 -9355 23698 28178 34248 50507 -10211
14872 -10211 -47843 -51895 -65000 -36275 -8282 -3476 18239 28119 -43399 -84375 -55523 -63816
14860 -63816 -17474 36114 45063 -45451 -77351 -72759 -87293 -58477 -45455 -49454 -22066 -21416 23389
14847 23389 50489 -1130 -65520 -78074 -27256 21487 56418 85064 47923 12240 21782 31502
14835 31502 15131 29069 29773 4896 38592 79559 62185 21186 -15948 -35987 -135409 -165890
14823 -165890 -59319 -13771 12596 -30278 -105827 -72160 -34212 -15139 37048 61716 40568
14812 40568 18399 -39459 -69999 -41599 24131 72869 56458 14232 -50002 -92508 -125850 -108714
14800a08714R4322K9587n0600j0707k0588j4971K0990O653J2959K7405O2365J7000
14788F5701n1907l0525J1230l0909k8956L3979M0482L3082R971n2479r7097J3033
14776h4395N4101l6343l7199l7046N6321L2422J8632M4594N9900K6934j3764p5268
14764H889j01116K4883M1484j7817J9998j7003k2521L8372J0702m2904k3290L34
14752g9989O2558K7846j7275m641J2887j0153J5357L3960J5449n0421m63L7647
14740D2762M0223k2183m0434m9131L0528J6544K03R038j3243l0244o746L8911
14728A6228m4288P1199K8540o50j4687l192q053N522L875o832l8890j2384l6423
14715d0035k7666K004P2254P336L1839J3253Q066K8091L516l4827P035n2350l6120
$$ plain form
14800 -108714 -14392 15195 -35405 -46112 -66700 -81671 -60681 -54028 -41069 -13664 48701 65701
14788 65701 13794 -16731 -5501 -36410 -65366 -31387 9095 42177 52148 -331 -97428 -84395
14776 -84395 -30294 -66637 -103836 -140882 -84561 -52139 -33507 11087 70987 97921 84157 8889
14764 8889 -92227 -67344 -25860 -43677 -23679 -40682 -63203 -24831 -14129 -57033 -80323 -79989
14752 -79989 -17431 10415 -6860 -11501 1386 -8767 6590 40550 55999 5578 5115 42762
14740 42762 82985 60802 20368 -28763 1765 18309 18512 27550 14307 -15937 -22683 16228
14728 16228 -28060 43139 71679 71029 56342 53150 45097 50619 54494 47662 8772 -3612 -40035
14715 -40035 -67701 -65697 6557 13893 45732 58985 67051 95142 98658 63831 70866 18516 -17604
14702a7604J2398M5166k2219k0752j9846N173L5076J2471K639L4152k2928m1576
14690B150M3956n6448o8748K1990O7035m845o836K1354j7834k1201P3359k5009
14678B8923j8264n214j2438k7127K4505j4658k2522k410K8838q946J2526q703
14666b5490n8184n602K7496m6498L9783N3747j6985K0596J9127n035m5467L430
14654c9082n13P373l3229k2947K8241j6562J9776j2816l1788l5280O2667k4567
14642i8727j943O8868O258M4396L2212L1151p5536j11956j5300J6824P1289o4330
14630i6794r050R896R574N8931j7235k7211R661M1080P8723J2364n9040o5292
14618e4393N5464M0004l2275O3587j6618q8875l5303M6890J2552J3529M112K8154
$$ plain form
14702 -17604 -5206 39960 17741 -3011 -22857 -17684 17392 29863 32502 66654 43726 2150
14690 2150 46106 -10342 -79090 -57100 9935 5090 -1746 19608 1774 -19427 53932 28923
14678 28923 10659 5445 -6993 -34120 -9615 -24273 -46795 -49205 -20367 -29313 -16787 -25490
14666 -25490 -83674 -89276 -61780 -108278 -68495 -14748 -31733 -11137 7990 2955 -42512 -39082
14654 -39082 -39595 -32222 -65451 -88398 -60157 -76719 -56943 -69759 -101547 -136827 -74160 -98727
14642 -98727 -100670 -31802 -25544 18852 51064 82215 6679 -105277 -120577 -103753 -32464 -96794
14630 -96794 -105844 -95948 -86374 -27443 -44678 -71889 -62228 -21148 57575 69939 10899 -54393
14618 -54393 1071 41075 8800 72387 55769 -33106 -68409 -21519 -8967 4562 8674 36828
14606C6828J8066n2609j15230m0220J14366O2843L9293J71l0588k7476p0675p180
14594g2411n0893k6908N6549N4843P965j8403j2927J3238l4126o4052O0990M3876
14582d2259J6972k6756k8807j2896k02N1913j5018k9786K6922Q1503N9712l3051
14570D8247n9414j1431K819k0019l0925L4308J9067k5434l9598k4158n981L4200
14558g8319J2605m182j96L6603K2685L113k0049j3748J1725q495m2616l0139M5246
14545f5767J864R028K2670K0487J3608J5614o2915N909K6299p5944k2268p63k9614
14532a41792k4468M9596L5536K6980r241p270J1117K6314M8832k8079J0633O4884
14520F3042M3368j1588J3987J1118k3868j2284L9622q696k1494O288J2690n3836
$$ plain form
14606 36828 54894 2285 -112945 -153165 -38799 24044 63337 63508 32920 5444 -65231 -72411
14594 -72411 -123304 -150212 -93663 -38820 -30855 -49258 -62185 -48947 -83073 -147125 -86135 -42259
14582 -42259 -25287 -52043 -80850 -93746 -93948 -42035 -57053 -86839 -59917 21586 81298 48247
14570 48247 -11167 -22598 -19779 -39798 -70723 -36415 -17348 -42782 -82380 -106538 -112519 -78319
14558 -78319 -65714 -69896 -70092 -33489 -10804 -7691 -27740 -41488 -29763 -38258 -80874 -111013 -65767
14545 -65767 -63903 -54875 -32205 -11718 1890 17504 -45411 -39502 -13203 -89147 -111415 -112178 -141792
14532 -141792 -166260 -116664 -81128 -54148 -63389 -70659 -59542 -33228 15604 -12475 -1842 63042
14520 63042 106410 94822 108809 119927 96059 83775 123397 114701 93207 99495 112185 58349
14508E8349j17237Q072j0435M2128L0027M5090j4810q5836J0575N843m6632K7029
14496d7837M0558L8149M962k5828l0426J4184o953j3684N687L0423J2641m3770
14484b1894o848Q4453j0970l2419r459J8529K1590J0063j5266k7254L7764k869
14472D5420m256l4848m1602q531j7085L2016P2629n1778P422M0450j8856k7171
14460f190j3919K2215l7277J9334L7542M0569j2481n0947P926o8188k6202J6127
14448g1491J0226o1307K665l280K1938J04813O1712p521l3920l1279j7855l0050
14436e5349N2142L0761l0046j4784Q0129J330n2495j0001j101K5305k8019m3049
14424d5177q416k0141K4017Q2005k567K0178M9878k1057m4379L284P007k4993
$$ plain form
14508 58349 -58888 -50816 -61251 -19123 10904 55994 41184 -44652 -34077 -28234 -74866 -47837
14496 -47837 -7279 30870 35832 10004 -20422 -6238 -13191 -26875 -21188 9235 21876 -21894
14484 -21894 -28742 55711 44741 12322 2863 21392 42982 53045 37779 10525 48289 45420
14472 45420 41164 6316 -35286 -43817 -60902 -28886 43743 -8035 -613 39837 20981 -6190
14460 -6190 -20109 2106 -35171 -15837 21705 62274 49793 -1154 6772 -61416 -87618 -71491
14448 -71491 -61265 -122572 -119907 -123187 -101249 3564 65276 57755 23835 -7444 -25299 -55349
14436 -55349 -3207 27554 -2492 -17276 62853 64183 11688 1687 586 25891 -2128 -45177
14424 -45177 -53593 -73734 -49717 32288 29721 49899 99777 78720 34341 37625 44632 19639
14412A9639m5938j778J6279m7218J5110K9580M6186j3805j5460l9715k5219j9108
14400h1447j3791L7997J4283o2047J558m337j8954M82J26648J10697j4889o2154
14388C4046r3031K0130Q2912k1295p5665l7796J133j1071j8489Q3602P7399L7886
14376G9761j6768r1578k8288L174n089q825j1802l5784j9975L4519P9891L1469
14364A0705k6352R940m2149j0326M6009n6158r246k0429r214K2567M6639O9634
14352C1620l2008p5137k6104k495N0679J9697J44M7211K1502j8583Q891r012k0226
14339c821J3919j3282J3602j7157o951Q071N502k6742l5997q50k4744l4886M2928
14326h0408L3421L2419O4019k6178j912J4910j5257L1785J1107j5186l6308m77
$$ plain form
14412 19639 -26299 -28077 -11798 -59016 -43906 -14326 31860 18055 2595 -37120 -62339 -81447
14400 -81447 -95238 -57241 -42958 -105005 -103447 -107784 -126738 -126256 392 111089 96200 34046
14388 34046 -58985 -38855 44057 22762 -52903 -90699 -89566 -100637 -119126 -35524 41875 79761
14376 79761 62993 -28585 -56873 -53699 -58788 -67613 -79415 -115199 -135174 -100655 -20764 10705
14364 10705 -15647 -5707 -47856 -58182 -12173 -68331 -77577 -98006 -107220 -84653 -38014 31620
14352 31620 -388 -75525 -101629 -104124 -53445 -33748 -33604 13607 35109 16526 25417 16405 -3821
14339 -3821 10098 -3184 10418 -6739 -13690 -5619 -117 -26859 -62856 -63706 -88450 -123336 -80408
14326 -80408 -46987 -14568 49451 23273 21361 36271 21014 52799 63906 48720 12412 11935
14314A1935l308p056k6611k1837J6996J05748M0732n1930R22k8466l5920L5263
14302C6468L9026j9043q7259j06082m0668J5875M6858J7841K8799N9779o7010
14291g5416j2307J2103O6714J6966k5823m7843L2442M953l863N1043K0045j3547
14279B5467m4089n3242j3623J8317J9636m7308j8798L2216J05647l2633o7410
14268g5820R530L086M5718J5194j1577K3666K3252L8511o4360o8197J1987l340
14256e2350m9667j4732N161L4995N0372j1610o413j9932j2915l8598k6031J6795
14244a24925L7474M4980J3015N8398o565m4370l1578o3643J8606r92J02494N4856
14232E7750m5150o4874j5813N1732O4486j9504J2117K8679k4094m7197l8527J0603
$$ plain form
14314 11935 8627 1571 -25040 -46877 -29881 75867 116599 64669 65591 37125 1205 36468
14302 36468 75494 56451 -30808 -136890 -177558 -161683 -114825 -96984 -68185 -8406 -75416
14291 -75416 -87723 -75620 -8906 8060 -17763 -65606 -33164 -28211 -32074 18969 39014 25467
14279 25467 -18622 -71864 -85487 -67170 -47534 -94842 -113640 -81424 24223 -8410 -75820
14268 -75820 -66290 -63204 -17486 -2292 -13869 9797 33049 71560 7200 -60997 -49010 -52350
14256 -52350 -102017 -116749 -111588 -76593 -26221 -37831 -44244 -64176 -77091 -115689 -141720 -124925
14244 -124925 -87451 -42471 -29456 28942 22377 -21993 -53571 -117214 -98608 -99600 2894 57750
14232 57750 12600 -52274 -68087 -16355 48131 28627 40744 69423 45329 -1868 -40395 -29792
14220b9792L3139J9602N2705p600k3076n7833q433r323J5391N8369o267k2215
14208A4667o7752J1769O407j439L1256K0762K0136n1701l0003N709L2855m4787
14196e2121J7147J7755j9155m5955j7586M357K1585K7193L2050N2357J7026O2082
14184A16735k1607k8546k9099j3612k2516n9669k6195J6194N1423K410l8305l2468
14172h5255L0006K977L7609J5946L8047L0577J4251n5880q879R713K3098P0j3785
14159C8495M940j3562J907q912m7447M5391P784k989k8941l8552n548L8376k0988
14146c0046K3388O186j0732j2975k6922K0398L8875N8062j1705k9713L1438K0488
14134G6742k5360j00949J0081k119M3370k2652m0501j3924l0130P3496O6190r320
$$ plain form
14220 -29792 3347 22949 75654 68054 44978 -12855 -21288 -30611 -15220 43149 36882 14667
14208 14667 -53085 -41316 -34909 -36348 -5092 15670 35806 -15895 -45898 -40189 -7334 -52121
14196 -52121 -34974 -17219 -36374 -82329 -99915 -95558 -73973 -46780 -14730 37627 54653 116735
14184 116735 95128 66582 37483 23871 1355 -58314 -84509 -68315 -16892 -14482 -52787 -85255
14172 -85255 -55249 -52272 -14663 1283 39330 69907 84158 28278 19399 29112 52210 52280 38495
14159 38495 43435 29873 31780 22868 -24579 20812 28596 25607 -3334 -41886 -47434 -9058 -30046
14146 -30046 -6658 -472 -11204 -24179 -51101 -30703 8172 66234 54529 24816 56254 76742
14134 76742 51382 -49567 -39486 -41605 1765 -20887 -61388 -75312 -105442 -31946 34244 24924
14122B4924l6812r813k2660R3261j6101n7878j3856L363k7178n0009N2109j8522
14110g9172L8859L1413l8958K5383J07926J0940m4799n5106M3906Q120p516j7215
14098B3781l3449j5606k3436o2233K6327N9490j868p4558k2496j1906O779R9380
14086b9795L2972L492j0764j1792J7866K800M9573m4786j9980O723K9702R019
14074C5030k5636L3259J5384j6M926n7252o418R462l148K9599Q556l9566k0716
14061a6536l1725q188L1678J6117k600j9696o1197N718P0764j2357M271j5080
14049c8831L1735k5108n469Q7093N4672K846n9134n4248K3099L9811n8704k0362
14037b2600j6361l0777k1115j8262K7202J6523K6533O825P946k406L2718L3151
$$ plain form
14122 24924 -11888 -21701 -44361 48900 32799 -25079 -38935 -35572 -62750 -112759 -60650 -79172
14110 -79172 -40313 -8900 -47858 -22475 85451 96391 51592 -3514 40392 48512 40996 23781
14098 23781 -9668 -25274 -48710 -110943 -84616 -25126 -26994 -101552 -124048 -135954 -129175 -29795
14086 -29795 3177 6669 -4095 -15887 1979 4779 54352 9566 -10414 -3691 26011 35030
14074 35030 9394 42653 58037 58021 62947 5695 -723 8739 5591 35190 43746 4180 -16536
14061 -16536 -48261 -56449 -24771 -8654 -11254 -30950 -92147 -86429 -15665 -28022 -23751 -38831
14049 -38831 -7096 -32204 -37673 49420 104092 106938 47804 -6444 16655 56466 -2238 -22600
14037 -22600 -38961 -69738 -90853 -109115 -81913 -65390 -38857 -32032 -24086 -26492 6226 39377
14025C9377M9659j6779p2666J8926j9485j6508L1278N9878k6298j8280K5508N426
14013F0036M8747j7775n4445K24j7994L3142K8401L8619M4705l5448l8509L154
14001I2857K5530n4840n0078k4551L5505N4497k1397l7134J5470Q414k1108J8771
13989D1936m6581j6699n8254n5854M5843K2912N5587K0445m9830k3868J4954K6237
13977b3172n279L3735M3094J9859j6325m3068l4628L7785l3366N615M0163l4797
13965a0384o4118j9656M6641L1812J2711k0892r281K6087k5059l1817M4097m645
13953b4504n826M6483J6962k2544M694l4962l3335O621Q247j9543J2128m3442
13941h9021J2743L1048q868K5022M113K7668M7855j1912M3209k4554m375l3350
$$ plain form
14025 39377 89036 72257 -409 18517 -968 -17476 13802 73680 47382 29102 54610 60036
14013 60036 108783 91008 36563 36787 18793 51935 80336 118955 163660 128212 89703 92857
14001 92857 118387 63547 13469 -11082 24423 78920 57523 20389 35859 44273 23165 41936
13989 41936 -4645 -21344 -79598 -135452 -89609 -66697 -11110 9335 -40495 -64363 -49409 -23172
13977 -23172 -28451 5284 48378 68237 51912 8844 -25784 12001 -21365 -15750 24413 -10384
13965 -10384 -74502 -94158 -47517 -15705 -2994 -23886 -33167 -7080 -32139 -63956 -19859 -24504
13953 -24504 -30330 16153 33115 10571 15265 -19697 -53032 -46411 -38164 -57707 -45579 -89021
13941 -89021 -76278 -45230 -54098 -29076 -24963 2705 50560 38648 81857 57303 52928 19578
13929A9578K5385N768j7232k0749j8249j0025M8820P561n64J3684j8325j01206
13917f5554k7047K3002l8868O245Q8652K8407j8033n3738M0949Q8249j1544q4064
13905b3344J5878M604p3241j6077J8878M8296K3091M5283l9217o7889j4451K3472
13893e4717K7106p875L0622L7516j4895K8180K7285j0149m53J6178j3462K8600
13881I3936o4828p3162J6371J7466j6950j2588m6766j768m4507L7275M5569n3096
13869a03048N5460Q001q989O7948K895o2640o6875K4552J0943K4999L9729N955
13857a070k6557L051N8706J5675p757j6955q226n2577P85n2815J3514L1298p4055
13844a16983k6682L6143L5015K2679L0560J148n0770J2607j2462j904k4607J7421
$$ plain form
13929 19578 44963 50731 33499 12750 -5499 -15524 33296 40857 40293 53977 35652 -65554
13917 -65554 -92601 -69599 -108467 -102222 -13570 14837 -3196 -56934 -15985 72264 60720 -23344
13905 -23344 -7466 -2862 -76103 -92180 -73302 -25006 -1915 43368 4151 -63738 -78189 -54717
13893 -54717 -27611 -35486 -4864 32652 17757 45937 73222 63073 62620 78798 65336 93936
13881 93936 29108 -44054 -27683 -10217 -27167 -39755 -86521 -88289 -132796 -95521 -49952 -103048
13869 -103048 -47588 -39587 -48576 19372 22267 -40373 -107248 -82696 -71753 -46754 -7025 -1070
13857 -1070 -27627 -24576 34130 49805 42048 25093 16867 -35710 -34925 -87740 -74226 -42928 -116983
13844 -116983 -143665 -107522 -72507 -49828 -19268 -18120 -68890 -56283 -68745 -70649 -95256 -77835
13832g7835m056l1307P594M2783M1046J8404J8489R109K6067j222q514j0632j2284
13819A7642k4343j8100M1681L9335j9649j1093l7021k5908m782o3766J2296K6632
13807f7076k8621J8134j8987J7914M3683N2540p517p518k552K2151K7604m3716
13795F039m908j8390l917J1876m4988k483j5544n829L7708k5366l289L9644M910
13782b4537J6259L7698o8132L038l483j2568P0581K8278O1531m5544l2003l5773
13770d655L8712O2500j5210k5792M4513k1174j14180N798K7235K6586R1994k0295
13758I6032j5997m9877j0490p0594m2341N8823L1953k1947j9202K9154J3764K266
13746A544K4165m0488m817K3902m703l5626J9348n174J0623j558j0455O4895J9188
$$ plain form
13832 -77835 -81891 -113198 -105604 -62821 -21775 -3371 15118 24227 50294 49072 40558 29926 17642
13819 17642 -6701 -24801 16880 56215 36566 25473 -11548 -37456 -42238 -106004 -93708 -67076
13807 -67076 -95697 -77563 -96550 -78636 -34953 17587 10070 2552 0 22151 49755 6039
13795 6039 1131 -17259 -21176 -9300 -54288 -56771 -72315 -78144 -40436 -65802 -69091 -29447 -24537
13782 -24537 -8278 29420 -38712 -35674 -39157 -51725 18856 47134 108665 63121 31118 -4655
13770 -4655 34057 96557 81347 55555 100068 78894 -35286 -29488 -2253 24333 116327 96032
13758 96032 80035 30158 19668 -50926 -93267 -34444 -2491 -24438 -43640 -14486 -722 1544
13746 1544 25709 -14779 -19596 4306 -397 -36023 -16675 -21849 -11226 -12784 -23239 41656 60844
13733F0844M430q6324m9525K5058J2493l5248L3150Q4389J9244o3861n9491k9477
13721h4318k0685j5335M2513K3512J6970m459n0470l2960Q6363N7232l256n598
13709I509L5246k1192p7685L1511R1594M2408n0973m1352l3938K523l3547j7116
13697f3012R968O445j4079L3549n966l6425L1720O802p8093l1376R3127M7294
13685d6J8628m9034j1926J7612M2561j1557n009L0075n2516k4580J0225l1254
13673f6821m586L2222J9370L8004L9045q7478j4220O0054M7303j2179J9853m314
13661F6253r983K6984k7532j8563P003m861m6039L6875k6215P795J8724M7403
13649G7844q681J4833j1571j3109L3627L528j9698r4064m9772O989M4933M3378
$$ plain form
13733 60844 65274 -21050 -70575 -45517 -33024 -68272 -35122 49267 68511 4650 -54841 -84318
13721 -84318 -105003 -120338 -77825 -54313 -37343 -41802 -92272 -125232 -38869 18363 15107 9509
13709 9509 44755 23563 -54122 -22611 68983 111391 60418 19066 -14872 -12349 -45896 -63012
13697 -63012 -53044 -46599 -60678 -27129 -33095 -69520 -37800 -30998 -109091 -140467 -47340 -46
13685 -46 18582 -30452 -42378 -24766 17795 6238 1229 31304 -21212 -45792 -35567 -66821
13673 -66821 -71407 -39185 -19815 18189 57234 -30244 -44464 15590 62893 50714 70567 66253
13661 66253 56270 83254 55722 37159 44162 39301 -6738 30137 3922 11717 30441 77844
13649 77844 69163 83996 72425 59316 92943 96471 76773 -17291 -67063 -60074 -15141 28237
13637B8237J2533J5240M3936k1181J0380J3450K004l4133r3823l8075K9330j9537
13625e1639N1761R1750l9333m3443L110n6936N8362O4820k6196R33k4857l5176
13613f844M495O0732l4775j6823N5929q134p9252m7612M5149J10930P8187m6353
13601A15629m2585m4780n6532n9848O1998L2555k7221J6585k899P9670M1698n1876
13589F2394p669K4888L40l9855k9434P446K0224m146J1957p3010n0843m86J3139
13576f5055K6832N5865q957J7345j4179j1044o8l7884p4451m515N0942J0583K7310
13563b7276K1433K7422j6810k2134o174J2362K4269l2079J6549O4466N388k3050
13551D4366L7739K8052k6317J1184j6934l377O7335m7637r7494m68J7556M0109
$$ plain form
13637 28237 40770 56010 99946 78765 89145 102595 104599 70466 -23357 -61432 -32102 -51639
13625 -51639 122 91872 52539 9096 12206 -44730 13632 78452 52256 53189 28332 -6844
13613 -6844 -2349 58383 23608 6785 62714 54580 -24672 -72284 -27135 83795 161982 115629
13601 115629 73044 28264 -28268 -88116 -26118 6437 -20784 -4199 -7098 72572 114270 62394
13589 62394 54725 79613 79953 40098 10664 18110 38334 34188 46145 -26865 -77708 -78194 -65055
13576 -65055 -38223 17642 8685 26030 11851 807 739 -37145 -111596 -116111 -65169 -54586 -27276
13563 -27276 -5843 21579 4769 -17365 -23539 -11177 13092 -18987 -2438 62028 67416 44366
13551 44366 82105 110157 83840 95024 78090 74713 142048 94411 -3083 -3551 14005 54114
13539E4114K7193o4802l1401l9092k5400j1767l1666J0798O3631O5241k0412K6623
13527B3060j2837J8996k1041m6277n1183K2139M4199M5564P8046J04042P611p8040
13515A34279j13956j9467K7906J5326l47O724M7468l5667l4954m552r1667J295
13503f7612R5779L1698k3918n417M5479m3334m4933O4234p903n7660k7589l4200
13491g5376L294Q8759L3556K9773l1537m9772K836J5162J3873M0801L5802j2014
13479I5157R270k407k1235j3234J9174n4847m3074j4315m2091J7183K3433O4031
13467C7045K9058r744n91L5458M5200K6568k4201l4218l4660p778q1770j22962
13455a42595N6633J32606O4806l4250J8911P560l0031l4722j4724k9966K832J3380
$$ plain form
13539 54114 81307 16505 -14896 -53988 -79388 -91155 -122821 -112023 -48392 16849 -3563 23060
13527 23060 10223 29219 8178 -38099 -89282 -67143 -22944 22620 100666 204708 212319 134279
13515 134279 20323 856 28762 44088 43741 50465 97933 62266 27312 22760 -68907 -67612
13503 -67612 28167 59865 35947 30530 76009 32675 -12258 51976 44073 -13587 -41176 -75376
13491 -75376 -72082 16677 50233 80006 48469 -1303 1533 16695 30568 71369 107171 95157
13479 95157 104427 102020 80785 67551 86725 31878 -11196 -25511 -67602 -50419 -26986 37045
13467 37045 66103 56359 55768 91226 136426 162994 138793 104575 69915 62137 -19633 -142595
13455 -142595 -85962 46644 111450 77200 96111 103671 73640 38918 24194 -5772 -2940 10440
13443A0440j7544J2093M8152M8944j00391o3935p995J2533L4127L7288M873L3871
13431E2456K3369K4938l5816m3205M4518m5162l6802K562O705l5183L6185l0042
13419c5477J2472M2143L3946K5895k1478l1107m5835J9889J1006j0709J7252J4200
13407C2197k0853K5006m069m9974k8321M8998k3158l5451J3319M3591j6861l1149
13395d6725m971n9619O125K951J5960M4056j5771P1182R5757r803k2117m4175
13383C2850m9516J0938n694N5745N5009l1811r3260J7385J1254j0444j7925N7756
13371C2287J3859k959o314L701J6553J8224l776O513R1l8555J404j786m3135k1740
13357b5633J6378N8480m4137p0336N7825J6380o8078o235R569R8053o614l6573
$$ plain form
13443 10440 -7104 4989 53141 102085 1694 -62241 -70236 -57703 -23576 13712 18585 52456
13431 52456 75825 100763 64947 21742 66260 21098 -15704 -13142 -6437 -41620 -5435 -35477
13419 -35477 -23005 19138 53084 78979 57501 26394 -19441 448 11454 745 17997 32197
13407 32197 11344 36350 32281 -17693 -46014 2984 -20174 -55625 -42306 1285 -15576 -46725
13395 -46725 -51696 -111315 -105190 -102239 -86279 -42223 -57994 13188 108945 99142 77025 32850
13383 32850 -16666 -5728 -11422 44323 99332 67521 -25739 -8354 2900 -7544 -25469 32287
13371 32287 46146 43187 36873 40574 57127 75351 71575 78088 78179 39624 41028 39242 -3893 -25633
13357 -25633 -9255 49225 5088 -65248 -7423 8957 -59121 -65356 -55787 42266 35652 -921
13345i21P2668J503k7490n8839j0463k7606l8848k9627n3453K3592O0349M8584
13333d0551R659N0779J1584l3438k8467M848N1528N0576o2597n3986R426p83M6645
13320A5223K757j0969M0630N7672L7194j6577n0491o41M1948L6952K3832m8551
13308A28979l9396r289J011p1283L284J02904K0545k5876j0052J65k244k1047
13296G7701M3097o83N5447K918m4714J2017L0966m0017o1197m0234K1479p7775
13284b0995K1704K7228N1907N7107m4309K6814n0137N4504P3673M3572k0564m1860
13272A78644l1904n9010O427J347o0573Q0677L0529j5443O2837k1117K212J615
13260A76241o6765J4213K6381j4365k4461j6632m3338l8639K7649K3162O7998
$$ plain form
13345 -921 71747 73250 45760 -13079 -23542 -51148 -89996 -119623 -173076 -149484 -89135 -40551
13333 -40551 -30892 19887 31471 -1967 -30434 -25586 25942 76518 13921 -40065 -30639 -31422 15223
13320 15223 17980 7011 47641 105313 142507 125930 75439 74798 116746 153698 177530 128979
13308 128979 89583 80294 81305 10022 13306 116210 136755 110879 100827 100992 98748 77701
13296 77701 120798 120115 175562 178480 133766 145783 176749 136732 75535 35301 56780 -20995
13284 -20995 709 27937 79844 136951 92642 119456 69319 123823 197496 241068 220504 178644
13272 178644 146740 87730 94157 95504 34931 115608 146137 130694 193531 172414 174626 176241
13260 176241 109476 123689 150070 135705 111244 94612 51274 12635 40284 63446 131444
13249A31444m1390K0483L7887m7983m7187q302p2209n3512L9765M0652M8810K3246
13237G1704J6562J3307M7526N0630K8496n4442o8938j2263l207P462Q796K9620
13225A35253O2183L4984j7017N530p5950k9468n2102K5286K1965m5906m4282M4204
13213F4680N851L8698N8341m3331l4641m1000m3498j5355K5943J3916O756Q9535
13201A25895r155j6729j6206N528k6965o0983j7335K9449j05K185L1488m8298
13189a231n0116J1985N1191K1368k272k0255l1964k2277K3234R618J8705N241
13177A3227J3377J1813J8566l000N634j3961K2601l2344J4643L1071Q757j2168
13165G8216l4583k7705Q419j9927o8501p4022O0161N5765L318j810J856L2487
$$ plain form
13249 131444 90054 110537 148424 100441 53254 44952 -27257 -80769 -41004 -352 48458 71704
13237 71704 88266 101573 149099 199729 228225 173783 104845 92582 89375 96837 105633 135253
13225 135253 197436 232420 215403 220933 144983 115515 63413 88699 110664 64758 20476 64680
13213 64680 70531 109229 167570 124239 89598 48598 5100 -10255 15688 29604 36360 125895
13201 125895 116740 100011 83805 89333 62368 1385 -15950 13499 13394 15579 47067 -1231
13189 -1231 -51347 -39362 11829 33197 30925 10670 -21294 -43571 -20337 -10719 7986 13227
13177 13227 26604 38417 56983 53983 59617 45656 68257 35913 50556 81627 90384 78216
13165 78216 43633 15928 24347 4420 -64081 -138103 -77942 -22177 -18859 -20669 -18813 13674
13153A3674N2926J6174K5241j4261n3903l1525m1244K2813Q1376m093m5668N2713
13141G4223l1909o688j3533j8000q6798l5416M2569L6948R666L228M2799L3376
13129E0465M2664p8533n4242J4848J0113K4365N0443k5738j4597j8021o1831Q904
13117e1160M64L00J4418J3680j0622k2093K8088N7429l5207j8624l415Q117O748
13104a1877K8811M8081M4660k9520m7768p698k1194Q0965N5352p0305k2321K7645
13092G4831m4130k5193K3688N2624L6205n509J211l6825l8728r316O105K5216
13080F0179q3945m0873K9159L5903M498j1665n5517N5277M8004K009M3664k596
13068H4097j990j0181p8756j04907K0385K9970m0626l1721O9557L5755k1553L2698
$$ plain form
13153 13674 66600 82774 108015 93754 39851 8326 -32918 -10105 71271 67178 21510 74223
13141 74223 42314 35626 22093 4093 -82705 -118121 -75552 -38604 -28938 -25710 17089 50465
13129 50465 93129 14596 -39646 -24798 -14685 9680 60123 34385 19788 1767 -60064 -51160
13117 -51160 -50696 -50396 -35978 -22298 -32920 -55013 -26925 30504 -4703 -23327 -26742 -18625 -11877
13104 -11877 16934 65015 109675 80155 32387 24689 3495 84460 139812 69507 47186 74831
13092 74831 30701 5508 29196 81820 118025 112516 113727 76902 38174 28858 34963 60179
13080 60179 -23766 -64639 -35480 423 4921 -6744 -62261 -6984 41020 43029 86693 84097
13068 84097 82107 71926 -6830 -111737 -91352 -61382 -102008 -133729 -64172 -28417 -49970 -17272
13056a7272R8016l4061k3628O4640j2742p1217K4511k462m1738j2308m816J6216
13044a6861N9476j9399L9842j9540j6363N4821m7854k3273K6378o985k3095N580
13032A2727P590m9923m419n044P493K6515k8854R249K8715k2194j1326M3561N0922
13019F5012N802m0585m8943J5752Q2071K1921m7501j1909r937k5378m0693n0799
13007h5187M8597M8541j24K7812k0417O4376J801M8444l0246r0798k6194K8439
12995A5044J0308l0338l0424J4403K3538Q7159M0150q6691k5104J6111K5463N9408
12983A19027M0811P87r6997n5331N6415J2785j21174j0146k1317L4508M0361J9670
12971A9399J3504l1118l4788N3250J06611L7580n9526l8705K8664j0968m5064
$$ plain form
13056 -17272 80744 46683 23055 87695 74953 3736 28247 25785 -15953 -28261 -33077 -16861
13044 -16861 42615 23216 63058 43518 27155 81976 34122 10849 37227 30242 7147 12727
13032 12727 20317 -29606 -34025 -39069 -31576 -5061 -33915 -24666 4049 -18145 -29471 14090 65012
13019 65012 70814 30229 -18714 -2962 79109 101030 53529 41620 31683 6305 -34388 -85187
13007 -85187 -36590 11951 11827 39639 19222 83598 85399 133843 103597 12799 -13395 15044
12995 15044 25352 -4986 -35410 -21007 2531 89690 129840 43149 18045 34156 59619 119027
12983 119027 159838 160625 63628 8297 64712 77497 -43677 -53823 -75140 -40632 -271 19399
12971 19399 32903 1785 -33003 20247 126858 164438 104912 66207 94871 83903 38839
12960C8839O140M6632K0879k1240m3605K664m129J4026O70K2713k0276l7951n6141
12947c0779l1521k0996l7107J7466N7008J0630M00L6656r08K0646j1204k5450
12935a5159k1977l2035N981j8902P041L2922P7371K8652l8892O572n521m3998
12923a7945j5320K1860M945j2490K0321N4316M965l368N095l879K918n8514l4044
12910c1140J0185Q0440K54l2205m9708J9034K2387M0909K3938O9233k6430J4104
12898A41001k7328J0174N2245q977m9460k3106k6435m6187J6288m1072k0261K8148
12886E030k7287o6885K08P0412L6911J7099L0406R9916J1851j6463l2016j22289
12874F893o5288O8907Q6817L877j3273n4664l7912j329M427N1026P229P5046N346
$$ plain form
12960 38839 44979 91611 112490 91250 47645 50309 46180 60206 60876 83589 63313 25362 -30779
12947 -30779 -62300 -83296 -120403 -102937 -45929 -35299 -34899 1757 849 21495 10291 -15159
12935 -15159 -37136 -69171 -63190 -82092 -75051 -42129 35242 63894 25002 31574 26053 -17945
12923 -17945 -33265 -11405 -6460 -18950 1371 55687 60652 57284 62379 58500 61418 2904 -31140
12910 -31140 -20955 59485 59739 27534 -22174 -3140 19247 60156 84094 153327 126897 141001
12898 141001 113673 123847 176092 167115 117655 94549 68114 21927 38215 -2857 -23118 5030
12886 5030 -22257 -89142 -88934 -18522 18389 35488 65894 165810 177661 161198 129182 6893
12874 6893 -58395 10512 97329 101206 87933 33269 -4643 -5972 -1545 49481 56710 131756 137102
12861A37102q9029j3368j9005k3025j2517M5620l1367j7373K8605J7059k1157
12850A545j2828l8391M3691k7844M4848M7604j8861J5690N2566O440m3136j4740
12838E6584L8166j9037m4577n699L851J69k1709N6684N5212k4283o2279k6615
12826F467Q810l85M8614N3318J4912J347j0983P204n016l7575J8120j01l5961
12813F8771q1613m0792O288k2389O484N808j0619M8162M6970L8876J8282l562
12801H0666q6950k0681Q787P42l3061K7489K5586j2708l3072J9868L3265n3757
12789d3826o1099O6392P5575K7123j5925p339j0626j077k8339J2961L7796o222
12777D5394M0532K8450M4140P0470k2589q6807k0709r756m4212N977K3523m115
$$ plain form
12861 137102 48073 34705 15700 -7325 -19842 25778 -5589 -22962 5643 22702 1545
12850 1545 -11283 -49674 -5983 -33827 11021 58625 39764 55454 108020 114460 71324 56584
12838 56584 94750 75713 31136 25437 29288 29457 7748 64432 119644 95361 33082 6467
12826 6467 15277 14892 63506 116824 131736 133083 122100 129304 124288 86713 104833 104732 68771
12813 68771 -12842 -53634 -47346 -69735 -63251 -57443 -68062 -19900 27070 65946 84228 80666
12801 80666 -6284 -26965 -18178 -17436 -50497 -23008 2578 -10130 -43202 -23334 9931 -43826
12789 -43826 -104925 -38533 37042 64165 48240 40901 30275 29198 859 13820 51616 45394
12777 45394 85926 114376 158516 228986 206397 119590 98881 89125 44913 50890 74413 70298
12765G0298l0466P531p021K9076q97L849p0726J9133J8025o584l5892K7282M4669
12752F8277j763j6666L0062M0657n0953q8633j0915K3106P0653j9914k7930K8534
12740D4515m805j6648J1360Q7655o354j01385k5193M3838k3935j7026j2549m0480
12728f1007R4454M9351r514o1082j1310Q0414P0298j7051L565j8295l5956j3099
12716G0768k7734K5972j2426m6365o166J1977O0531R0542L7038r2302k7314K6024
12704A10545j8868o2651P7247L8431n9880o7802n6012L0151o355o2533K5510n9520
12692a11737o283M2137K5962J266j2647K4791k225M739K5007j6444K0917P8196
12680G3679Q554J2959O8038n3738J714j5719J9300N0799L3889j4762j3017J2287
$$ plain form
12765 70298 39832 47363 40342 69418 68521 72370 1644 20777 38802 32218 -3674 23608 68277
12752 68277 66514 49848 79910 120567 69614 -19019 -29934 -6828 63825 43911 15981 44515
12740 44515 39710 23062 34422 122077 115723 14338 -10855 32983 9048 -7978 -20527 -61007
12728 -61007 33447 82798 73284 12202 892 81306 151604 134553 138118 119823 83867 70768
12716 70768 43034 69006 56580 10215 4049 16026 76557 167099 204137 111835 84521 110545
12704 110545 91677 29026 106273 144704 84824 17022 -38990 -8839 -15194 -77727 -52217 -111737
12692 -111737 -118020 -75883 -49921 -48655 -61302 -36511 -38736 -33997 -8990 -25434 -4517 73679
12680 73679 82233 95192 163230 109492 111206 95487 114787 165586 199475 184713 171696 183983
12668A83983j9217m9731k1044p451L760J6790K0309J589p8086r880K5134M9018
12656A15174M2300m1436K3319o5740n2551j0278j1566L4573K8588j4536J6885
12645F4732j5333m4875o105K1936L2164K8302l8288n4033M1654M4376N184m4613
12633C5101l137k9929M2671k0344k0961n726l718j1191Q4196O6677J0208m1962
12621A01885m9565k324j7320K0401L1880j1057k0053p102O309K0726P382J4251
12609I5413N693j07J8785P22J4998K1607K8887K230k1405p3632j5338M828L9646
12596A22327j7566j1217L7487l0971l9710l9258j2782j8464k9048Q828O3413L507
12584C6546L0845J9764j6192K6050J1165J648K8744m167l6291J0385P578j977
$$ plain form
12668 183983 164766 115035 93991 86540 90300 107090 127399 128988 50902 41022 66156 115174
12656 115174 157474 116038 139357 73617 21066 10788 -778 33795 62383 47847 64732
12645 64732 49399 4524 -1581 20355 52519 80821 42533 -11500 30154 74530 79714 35101
12633 35101 31964 2035 44706 24362 3401 -2325 -6043 -17234 66962 133639 143847 101885
12621 101885 52320 49996 32676 53077 84957 73900 53847 46745 53054 73780 81162 95413
12609 95413 101106 100999 119784 120506 135504 157111 185998 188228 166823 93191 77853 82681 122327
12596 122327 104761 93544 131031 100060 60350 21092 8310 -10154 -39202 -30374 33039 36546
12584 36546 67391 87155 70963 97013 108178 109826 138570 134403 98112 108497 116075 114098
12572A14098Q952m821K9659M3997k536P893j9571j9897n4306l3454k8700n2756
12560a1442k0257O4148L4500l1845q937J3332K4009J2277o83L527M4383l629l676
12547A15707P6525k3106m7268l5438M6051N6717p0559k4787Q1006k5888m0702
12536A08258o2513K6123N1008L6641p477j4776o5207p1837l009L3294r457K4047
12524D5095j7615O472L8062N151m3885l4728O6497L6672K9955P3534O530l5947
12512A75793k9337l8041J569O200K4944L1830j3674q0315m9810K4516M4019l4574
12500F3120p351m559N5103k633m7767k6051L1483M151K766N0225J0678k0034J5115
12487A24246j4766Q4898L0253L545k7927k7735o1059M0952M5907P035J9705p4901
$$ plain form
12572 114098 123050 118229 147888 191885 189349 197242 177671 157774 103468 70014 41314 -11442
12560 -11442 -31699 32449 66949 35104 26167 39499 63508 75785 75102 78629 123012 119383 115707
12547 115707 192232 169126 121858 86420 132471 189188 118629 93842 174848 148960 108258
12536 108258 45745 71868 122876 159517 152040 137264 72057 220 -2789 30505 21048 45095
12524 45095 27480 33952 72014 77165 33280 -1448 65049 101721 131676 205210 211740 175793
12512 175793 146456 108415 109984 116184 141128 172958 159284 78969 29159 53675 97694 63120
12500 63120 55769 51210 106313 103680 55913 29862 61345 65496 68262 118487 129165 109131 124246
12487 124246 109480 194378 224631 228176 200249 172514 111455 152407 198314 205349 225054 150153
12475A50153r5548J7721N3213K5204J0129k0419J7576M0028K1999J1382j9800
12464B11638k2317K9352N2721L8326j8661p0969L9251J24954N8018K1282L3212
12453D96807R8343O2890J5361n9478m6550K3714K1251R697l8156m3983k3045p6774
12441D40077p290O4131q509M8292q75J0996m0183o7180L8820K7862o1605l4577
12429D09959o049k2534Q573m9575P0861K049O520Q1774K0956L3006L2554Q0065
12417F68159J58670J20391R9430J42586R7276Q7557J17735N0561J2887p2818r4810
12406A387624j59512j78415j53061o7300o8272o0296M08k4867j7776K3607O802
12395F88942K5897M5681J3132m0482l8564n3337m1100K458p375m6907o6395m54
$$ plain form
12475 150153 54605 72326 125539 150743 160872 140453 158029 198057 220056 231438 211638
12464 211638 189321 218673 271394 309720 291059 220090 259341 384295 442313 463595 496807
12453 496807 595150 658040 673401 613923 567373 591087 612338 622035 583879 539896 516851 440077
12441 440077 432787 496918 488409 536701 535826 546822 506639 439459 478279 506141 444536 409959
12429 409959 403910 381376 389949 340374 411235 413284 419804 501578 522534 555540 588094 668159
12417 668159 826829 947220 1046650 1189236 1286512 1374069 1491804 1542365 1555252 1482434 1387624
12406 1387624 1228112 1049697 896636 829336 761064 700768 701176 676309 658533 682140 688942
12395 688942 714839 760520 773652 733170 694606 641269 600169 602627 595252 548345 481950 481496
12383D81496K1229p072m4887J9963O7765k808p505N4906O2414N0496o0615k1958
12371F13424J3883N6896P4771k6067l9681p0182j6879l1994l1641q2614q2328
12360C77588j5329l816l663q361n3468p0619m973M8255o248P156j0078K9621K1225
12347C07290q1340J3303K6746R378O61m617k6783L4924J6537o1160l823L279L1507
12334B65902O8594k8885n1814p4522m4126O4026k0416j8851m571M3327K3500l7723
12322A84441j719M8378J4514m749k5313k4953m5659n6589o519O3131J01160Q0777
12310C26900K0059j8069l9436k4935J7480j235q2214m2617J051J4626m7073k8972
12298I5565J14268J06674o8263k2716j5516L129K7736K2268J1005p214L5255m811
$$ plain form
12383 481496 502725 495653 450766 470729 538494 535686 528181 583087 645501 695997 635382 613424
12371 613424 627307 684203 758974 732907 693226 623044 606165 574171 542530 459916 377588
12360 377588 362259 358443 354780 346419 292951 222332 217359 265614 259366 266522 256444 286065 307290
12347 307290 225950 239253 265999 275377 276038 271421 244638 279562 296099 234939 231116 234395 265902
12334 265902 334496 305611 253797 179275 135149 199175 178759 159908 155337 198664 222164 184441
12322 184441 182722 231100 245614 240865 215552 190599 144940 88351 81832 144963 246123 326900
12310 326900 346959 328890 289454 264519 281999 280764 198550 155933 156984 171610 124537 95565
12298 95565 209833 316507 248244 225528 210012 213141 240877 263145 274150 266936 302191 297380
12286B97380k514m1410J8742L4873o80j08609l9310L7653M5587L9005j0140l3859
12274B36718J6547N0208K726K4630j0410L9973k6916R982q846J1634k9866o1645
12262B54735k4171L6709N0257j0832O822J6533L9001l9306l2653k4560m7265m3713
12250A81557O4794K2310l1475n5591L9040m346j0712k454k1839L5315p81L4352
12238B50170L6339P3844L9720n1647k3352J1092J6197M2805O6464k5721o797K6828
12226D55942K3773j0811L129R2750J4107l4814P04m8666K3575q03K686j1513p1975
12213D38084q0830m5625O958K3114L0132K7504q338o8274L1511O228m562l4434
12201C21468j0993L9812N5973L1404K9423m6455J2064K1180J4620l2104j2894
$$ plain form
12286 297380 294866 253456 272198 307071 306391 197782 158472 196125 241712 280717 270577 236718
12274 236718 253265 303473 306199 330829 320419 360392 333476 343458 334612 346246 316380 254735
12262 254735 230564 267273 317530 306698 313520 330053 369054 329748 297095 272535 225270 181557
12250 181557 246351 268661 237186 181595 220635 216289 205577 203123 181284 216599 215818 250170
12238 250170 286509 360353 400073 348426 325074 336166 352363 395168 461632 435911 429114 455942
12226 455942 479715 468904 472033 564783 578890 544076 544780 496114 519689 518886 521572 510059 438084
12213 438084 357254 311629 318587 341701 371833 399337 390999 322725 354236 360464 355902 321468
12201 321468 310475 350287 406260 437664 467087 420632 432696 453876 468496 436392 423498
12190D23498l7355J722J6173k1685n531j8407M5391j122l1241l2548P964j586
12178C45273M0733O0288m0566k6178L49K1716M3244n3419l4681m5644j6844N414
12166B99685l4572k7189l457n635L1356M2161J1800K7724L5905j7652l221j0758
12154C46147j1334k9680J0020L648K090l4901n738O8106Q0621O754J6210j0529
12142D41414j4243k2988m3652L485r012O0052J4443J2944m7458N556N9566j4156
12130D45951j4605N5310n2412M896L2487Q11m282J9735Q782O9486R356l1637l369
12117E40509L2381Q7986Q4532J5934P7406j1144k1853m5955l3013K8747Q5528
12106H41058M7081m0406L8659L6505L0895M4747Q1128K3896n586L1688R742K9837
$$ plain form
12190 423498 386143 387865 404038 382353 376822 358415 403806 402684 371443 338895 346859 345273
12178 345273 386006 446294 405728 379550 379899 401615 444859 391440 356759 311115 294271 299685
12166 299685 265113 237924 234467 228832 260188 302349 314149 341873 377778 360126 356905 346147
12154 346147 334813 305133 315153 318801 320891 285990 280252 348358 428979 435733 451943 441414
12142 441414 427171 404183 360531 364016 355004 415056 429499 442443 394985 400541 460107 445951
12130 445951 431346 486656 434244 439140 471627 472438 468156 487891 496673 566159 575515 543878 540509
12117 540509 572890 660876 745408 761342 838748 827604 805751 759796 726783 755530 841058
12106 841058 888139 847733 886392 922897 953792 998539 1079667 1103563 1097977 1129665 1139407 1169244
12094A169244P8526J28754O2919L9931J03948J62613J63247J01887Q1076Q9271
12084B181416K0313M1085P9129J04255P9263P2688o6417j20202R19k9608n6040
12073B306801R4787J05032P6135J14415o303J5337O4408M5769k2762j01794j05642
12062B586183n8437p5714n1731n8169K9315l5662K9380M5949N0187M6307R6793
12051B604401Q8385K04523L52890L18300L28648M23031M29553M27739L65855L14830
12041E858155M40216M24098M14823N21936O96374Q06149Q24580Q72329Q71125
12032A1729785Q59314P02387M80769L06276J81581J67281K10710L31768O17097
12023A5586968J078342J562758K337154L538569N082203P073832R393573J1881959
$$ plain form
12094 1169244 1247770 1376524 1439443 1479374 1583322 1745935 1909182 2011069 2092145 2181416
12084 2181416 2201729 2242814 2321943 2426198 2505461 2578149 2511732 2391530 2392449 2362841 2306801
12073 2306801 2401588 2506620 2582755 2697170 2690867 2706204 2770612 2816381 2793619 2691825 2586183
12062 2586183 2527746 2452032 2400301 2342132 2371447 2335785 2365165 2411114 2461301 2507608 2604401
12051 2604401 2692786 2897309 3250199 3568499 3897147 4320178 4749731 5177470 5543325 5858155
12041 5858155 6298371 6722469 7137292 7659228 8355602 9161751 9986331 10858660 11729785
12032 11729785 12589099 13291486 13772255 14078531 14260112 14427393 14638103 14969871 15586968
12023 15586968 16665310 18228068 20565222 24103791 29185994 36259826 45653399 57535358
12015E7535358J4097299J4706448J2335687O944747p727o482810j0590893j1528473
12007G7009636r984862p184967m288281k024703l75382Q60324J887133K688580
11999E8587478L166023L218720K562642J402659M01736j32789j56018L60112J260183
11990G0670746K346606L272065L801140L617937K616102J048017n44287j943914
11982H4884412k447339j874421n13679J385847L568937O257585J0204060J6033377
11974A17498779K4214010L3602614M0349594L9217733K7851625Q937208j1420610
11967B80250953k7394717l5183153l4598489k8835023k1892828j5754165j0818936
11960A05773642o933533l694252j115023P09255J595111J285077Q7018j555656
$$ plain form
12015 57535358 71632657 86339105 98674792 105619539 105611812 99129002 88538109 77009636
12007 77009636 67024774 59839807 55551526 53526823 53151441 54011765 55898898 58587478
11999 58587478 61753501 64972221 67534863 68937522 69339258 69206469 69050451 69410563 70670746
11990 70670746 73017352 76289417 80090557 83708494 86324596 87372613 86828326 84884412
11982 84884412 82437073 80562652 80048973 81434820 85003757 91261342 101465402 117498779
11974 117498779 141712789 175315403 215664997 254882730 282734355 291671563 280250953
11967 280250953 252856236 217673083 183074594 154239571 132346743 116592578 105773642
11960 105773642 98840109 95145857 94030834 94740089 96335200 97620277 97707295 96151639
11952I6151639l168051m205693m426789m003281k985632j825273q37347k04830
11944G4494743k41192p44641j610751k476954k963377k945130k505964j833120
11936E9173614j060316j01504J481455L799001P018323J0647249J3281940J3202506
11928A07442268R441865K721830m736609j0829183j4191195j4784449j3317876
11921F1746651j1039445q788310o694860m805481l366068k354854j687002j107696
11913B1902935o73880m33784m17440m12648n31847o65448q45651j086385j208473
11904A5627379j289768j172712j040592q55298p41336p05631p18973o49031n54624
11895G899414n24309n51524o21505n57909m92257l81184l14218l14943k32381
$$ plain form
11952 96151639 92983588 88777895 84351106 80347825 77362193 75536920 74699573 74494743
11944 74494743 74253551 73508910 71898159 69421205 66457828 63512698 61006734 59173614
11936 59173614 58113298 58011794 59493249 63292250 70310573 80957822 94239762 107442268
11928 107442268 116884133 119605963 114869354 104040171 89848976 75064527 61746651
11921 61746651 50707206 41918896 35224036 30418555 27052487 24697633 23010631 21902935
11913 21902935 21229055 20795271 20377831 19965183 19433336 18767888 17922237 16835852 15627379
11904 15627379 14337611 13164899 12124307 11269009 10527673 9822042 9103069 8454038 7899414
11895 7899414 7375105 6823581 6202076 5644167 5151910 4770726 4456508 4141565 3909184
11886C909184k28106j82870j55623k25130j38430m8125k1162n102o6322M7866
11876B886180J17953J07184O4070L9412J03246J9384m2705j49524j28583n6230
11866B960387p6376m8018M5012O7469J1841p939l8683l3119l3117K3070j15329
11855B755198q0070o4456o9459n2951l1963k53495k18755j88337j29456j16950
11845A549306j44700j09896o5447l2896p4799r2241m4752L8991L8818m3633q9371
11834I29380n3258n1020l1562j793J2517j1792k686p6367n430k7798J1836M7674
11822G39701k9610L0277K8401L552J8531R889p4200p5637M7902J3423p8553q3732
11810E49944q0454L6929J1597n0664q5413o8734K1928N7084K1314k9190l5574
$$ plain form
11886 3909184 3681078 3498208 3342585 3117455 2979025 2930900 2909738 2904636 2838314 2886180
11876 2886180 3004133 3111317 3175387 3214799 3318045 3337429 3294724 3145200 3016617 2960387
11866 2960387 2884011 2835993 2881005 2948474 2960315 2952376 2913693 2880574 2847457 2870527 2755198
11855 2755198 2675128 2610672 2541213 2488262 2456299 2202804 1984049 1795712 1666256 1549306
11845 1549306 1404606 1294710 1229263 1196367 1121568 1029327 984575 1023566 1062384 1018751 929380
11834 929380 876122 825102 793540 791747 804264 792472 789786 713419 707989 680191 692027 739701
11822 739701 710091 740368 768769 772321 790852 800741 726541 650904 698806 712229 633676 549944
11810 549944 469490 506419 518016 467352 381939 313205 335133 392217 413531 384341 348767
11799C48767o3323K4327Q8388M342k748J847m0945N0235M60K2207k2286n9398
11787C51873p1509K1994O0107O2033o9900j17987l1343L8490j3843m1683L3397
11776B21629J6624L5807l182K0538n741n2470K3229M7434l4548p401l1351k1098
11764B09470J8245N456k9249l2434j5424n025o383m6581m3867l2283J6158J2435
11752E0518L5244M2522k000K8637L5631r738J8952j8930j3427k9713l7409j1913
11740H8374Q695p118k215j7894K162k9339J640o476L3224J6731n2739l5194k335
11727b484K8236K3067j1741j1676R670n395J9467J6991L5545l629l4857J099k2210
11714D2083J4470M5948k7335k8096J959q8K436P0277O5674O2472m6609j43930
$$ plain form
11799 348767 285444 309771 398159 402501 399753 401600 360655 410890 411350 433557 411271 351873
11787 351873 280364 302358 362465 424498 354598 236611 205268 243758 229915 188232 221629
11776 221629 238253 274060 270878 291416 285675 233205 256434 303868 269320 261919 230568 209470
11764 209470 227715 233171 203922 171488 156064 151039 144656 98075 54208 21925 38083 50518
11752 50518 85762 128284 126284 154921 190552 180814 199766 180836 167409 137696 100287 88374
11740 88374 97069 89951 87736 69842 72004 42665 44305 37829 71053 87784 35045 -149 -2484
11727 -2484 25752 48819 37078 25402 35072 29677 49144 66135 101680 98051 63194 64293 42083
11714 42083 56553 102501 75166 47070 49029 48941 51377 121654 187328 249800 203191 59261
11702E9261l0649P4630M8868j4999p0428q8322k4464K0603j7515j5340L9045K0450
11690A140N7102p908l7970M9598M5149o5854J8469K6742k8999k5243k4168l0449
11678b2391n423J8225l943j3763L825O440K1371J3596K4363M5032l3147K9571
11666H3756P7887J3677o0592m9042j2341Q625K118K4061K9274K971k2497k8537
11654F9360k7886n8491Q242L7418m9729j8411j6814J4723M2214J0707n7834l381
11642d9882k491K3423M8571k3452L5278l3565M6663K6357n0612k0040K7930m6996
11630a8816l1742k6425M355m377K6559Q0982O441o1911k9948q344j5692K8478
11618e0440K125m6876l5606N8478J07786P6317r657l3765k1383o350m9620M5875
$$ plain form
11702 59261 28612 103242 152110 137111 66683 -21639 -46103 -25500 -43015 -58355 -19310 1140
11690 1140 58242 50334 12364 61962 107111 41257 59726 86468 57469 32226 8058 -22391
11678 -22391 -27814 -9589 -13532 -27295 -23470 -17030 4341 17937 42300 87332 54185 83756
11666 83756 161643 175320 114728 65686 53345 61970 64088 88149 117423 120394 97897 69360
11654 69360 41474 -17017 -8775 28643 -21086 -39497 -56311 -41588 626 11333 -46501 -49882
11642 -49882 -52373 -28950 19621 -3831 31447 -2118 44545 70902 20290 250 28180 -18816
11630 -18816 -50558 -76983 -72628 -77005 -50446 30536 36977 -24934 -54882 -63226 -78918 -50440
11618 -50440 -48315 -95191 -130797 -72319 35467 111784 102127 68362 46979 40629 -8991 36884
11606C6884K2933l838k6317m6788k316q888j1407k0227J4640M2055K977l0064
11594c0356j3323L9328L1391K8738k8409Q080N4017J2334J0399J4163j1352r693
11582A05317O380n9553L8080K2173m1876L208K117O711K4926K5327Q9214J8014
11570B40038m767O8114Q9800P5208L5715L2107N5762J6012n4085o7846p5121p4322
11558C36615k9056o251k5956n717O5140j495k2747p929R283K8189k3758m7290
11546B69028J6355j0189Q9M0267P2089M1169L6494j8281N6845N0390p229q2290
11534D64737p6632K939J9582p395q234M9832J08513J19166J73147J47297J13398
11523A106350J49792J80046P4951k9595m4900n3739j89572j50118j71767j38507
$$ plain form
11606 36884 59817 55979 29662 -17126 -19442 -28330 -39737 -59964 -45324 -3269 -292 -30356
11594 -30356 -43679 -4351 27040 55778 27369 35449 89466 101800 112199 126362 115010 105317
11582 105317 111697 52144 90224 112397 70521 73729 75846 82557 107483 132810 222024 240038
11570 240038 235271 303385 393185 468393 504108 536215 591977 607989 553904 486058 410937 336615
11558 336615 307559 301308 275352 269635 334775 333280 310533 302604 311887 340076 316318 269028
11546 269028 285383 275194 275283 315550 387639 428808 465302 447021 503866 554256 547027 464737
11534 464737 388105 391044 410626 403231 394997 444829 553342 672508 845655 992952 1106350
11523 1106350 1256142 1436188 1511139 1481544 1436644 1382905 1193333 1043215 871448 732941
11513G32941j36615j03968p5460j9714l7611L475K0124l2955p1379J6359M2496
11502C37693L4431P9405K2821j5796m4591r7695j3243q500L0264N8631l6071L1387
11490C78736Q065j3881m6754k3587R4636M5483m699j3125M9619K9779M9805Q0987
11478F35064j7212n1885p1363p9349n6034q7093J5839j2123m9709n6367J4313
11467A84081J4482J8473r2868l7261J6213j9466K3421Q813j8107n7880n0365L2438
11455B1974K5167k9227L0573J3875j2631L7375L717P863n4200R603l6802O1486
11443G8773P5427l1334o9110o8122P597P6627j3782o5298j0302K8828K1601n8
11431C0847n357n9704j8860r741j419J9939J3278K0490J3656N8875P826n9730
$$ plain form
11513 732941 596326 492358 416898 397184 359573 363048 383172 350217 278838 295197 337693
11502 337693 372124 451529 474350 458554 413963 316268 303025 294525 324789 383420 347349 378736
11490 378736 386801 372920 326166 302579 397215 442698 437999 424874 474493 504272 554077 635064
11478 635064 617852 565967 494604 415255 359221 272128 287967 275844 226135 169768 184081
11467 184081 198563 217036 124168 86907 103120 83654 107075 115888 97781 39901 -10464 21974
11455 21974 47141 17914 48487 62362 49731 87106 90823 98686 44486 54089 17287 78773
11443 78773 154200 122866 53756 -14366 -6769 69858 56076 -9222 -19524 9304 30905 30847
11431 30847 25490 -34214 -53074 -62815 -64234 -44295 -31017 -10527 3129 62004 69830 10100
11419A0100k9392n1345l5277L8213J02550l1116j7251N886J7959J8477L5373K5302
11407H9479J5972p757k1141k4897m2507m9874J4037O6498L9696N83P327k3164
11395F4252j6900M7028M0326n8207o6843r2630p7325M3615L0646L0238j2259J43
11383f7916Q9976J1179O5585K6199l6813k6554l8674J924n8368K7881q741k8363
11371d2685Q0811L0706k8138n7533N76k353l5106K0324N4002n9161Q998N8380
11359B8821K1046j926k7967J1084O947p0416q5657l9366O5764M9146J4900j2544
11347d0168m0970m1667K2641J0620k582Q7415N4187L5955J4386P8260M8259L9519
11335B65855j8641j1049m0560r0323m4527o564r419j3562J6475p021j3j5984k4973
$$ plain form
11419 10100 -19292 -70637 -105914 -67701 34849 3733 -13518 -7632 10327 28804 64177 89479
11407 89479 105451 97694 76553 51656 9149 -40725 -26688 39810 79506 80089 87416 64252
11395 64252 47352 94380 134706 76499 9656 -82974 -160299 -116684 -86038 -55800 -68059 -67916
11383 -67916 22060 33239 98824 125023 88210 61656 22982 24906 -33462 -5581 -14322 -42685
11371 -42685 38126 68832 40694 -16839 -16263 -18616 -53722 -33398 20604 -38557 -29559 28821
11359 28821 49867 47941 19974 31058 38005 -32411 -118068 -157434 -91670 -42524 -27624 -40168
11347 -40168 -81138 -122805 -100164 -89544 -92126 -4711 49476 85431 99817 178077 226336 265855
11335 265855 247214 236165 195605 105282 60755 54191 44772 31210 47685 40664 40651 24667 -306
11322c06j7163P817L0679j881K6592m6468r016k5880n6273n5567K8621M2019O4058
11309a2768N707J1257m485m9918j902O8523M420j7625k1310p2150K4916M8272
11297a7063K7644k2012n5243j6835m7513J7012N2216J0999l7306k7635M042M4136
11285f7558O8877J6172k364j7403n0215l3168j1570R545j8717o5893l6479L0518
11273a78255O2708k7693N303J8976q909M4683J1349M9006N2218o5182l6761n626
11261g8183M4740M3102J6384k5258k5630j3075m0149M0613L0550o038l39M3233
11249B9950N6778k8311o1328J1276p828l3721M0077K7520p436K5800l6217k6173
11237i613L9960k6822k1387K2921M245j3514K315J5385o1418K7505P447l3223
$$ plain form
11322 -306 -17469 -9652 21027 19146 45738 -730 -9746 -35626 -91899 -147466 -118845 -76826 -12768
11309 -12768 -7061 4196 -289 -50207 -52109 16414 20834 3209 -18101 -90251 -65335 -17063
11297 -17063 10581 -11431 -66674 -83509 -131022 -114010 -61794 -50795 -88101 -115736 -111694 -67558
11285 -67558 1319 17491 15127 -2276 -52491 -85659 -97229 -87684 -106401 -172294 -208773 -178255
11273 -178255 -115547 -143240 -137937 -118961 -127870 -83187 -71838 -22832 29386 -35796 -72557 -78183
11261 -78183 -33443 9659 26043 785 -24845 -37920 -78069 -37456 -6906 -12944 -13283 29950
11249 29950 86728 58417 -2911 8365 537 -33184 6893 34413 26977 52777 16560 -9613
11237 -9613 30347 3525 -17862 5059 9304 -4210 -1895 13490 -47928 -20423 -12976 -46199
11225d6199j9877q374K6824M3567M8651K2208r2851k3757j8787N5536R3962M6522
11213A27425j4795j0696l4755k3306o1689J6831J3909j9987n9000k2180j4396
11202a02639O0177N4349J1393k4322P127Q601j7236j8955K0100K20N368J9598
11190B3781j500P663M669N038k2825L2926J0230j2029j279j74j4590l1901M358
11177D367K7242q390k4137r599L4365L0289m7781m3915M2751j923j7064l9649
11165e3444J5270k4319M0107j3915m891K7236L5662L6676k9445l7764J6270o4270
11153e6827P194k0253L156L9102O0746m518n7296L6408O9208o7679n7372M8901
11141G70J9446L8914k4151l9548l730L504L4541N2136m0513l4872j1681j872Q845
$$ plain form
11225 -46199 -66076 -74450 -47626 -4059 44592 66800 -26051 -49808 -68595 -13059 80903 127425
11213 127425 112630 101934 67179 43873 -17816 -985 12924 -7063 -66063 -88243 -102639
11202 -102639 -42462 11887 23280 -1042 6085 14686 -2550 -21505 -1405 -1185 4183 23781
11190 23781 22281 29944 34613 39651 16826 49752 59982 47953 46674 46500 31910 9 4367
11177 4367 31609 23219 -918 -10517 23848 54137 6356 -37559 5192 3269 -13795 -53444
11165 -53444 -38174 -62493 -22386 -36301 -41192 -13956 21706 58382 28937 -8827 7443 -56827
11153 -56827 -49633 -69886 -66730 -27628 33118 28600 -28696 7712 76920 9241 -48131 770
11141 770 20216 59130 34979 -4569 -8299 -4795 29746 81882 41369 6497 -5184 -7056 1789
11128A789M8027j7572n9875J4938N5067r533l3883R273n1715j1077J9033N050
11116c0478M6712N4689k6068o5469k2609j8713K0298K7546K1963M5604J2326n5630
11104A0171K833K688l1961K1521p248M7170L161k1934m3872L9617M4403M8700
11092A15249R2l8176q7882N9494J8659j4382q5861j5336O7218M1958j671j8673
11080D0689L6718l5854j0628l335k2373K6461k6652j9514K4937P000L9351N444
11068F2244l293P4979l8825k1209m456n1929j4870K8759j7703L2210Q926n9932
11056e099j1370j9205J6401L5083J4404L9658j9521o653J6366M9597K5220m1988
11044I2893p067m3671l066N1534L0792j517P3373k0261j6573j7737k7517n595
$$ plain form
11128 1789 49816 32244 -27631 -12693 42374 32841 -1042 8231 -43484 -54561 -35528 -30478
11116 -30478 16234 70923 44855 -20614 -43223 -61936 -41638 -14092 7871 53475 65801 10171
11104 10171 13004 15692 -16269 5252 -1996 45174 48335 26401 -17471 22146 66549 115249
11092 115249 115341 77165 -10717 48777 67436 53054 -32807 -48143 19075 61033 59362 40689
11080 40689 77407 41553 30925 27590 5217 31678 5026 -14488 10449 17449 56800 62244
11068 62244 58951 133930 95105 73896 69440 17511 2641 31400 13697 45907 54833 -5099
11056 -5099 -16469 -35674 -19273 15810 30214 69872 50351 43698 60064 109661 134881 92893
11044 92893 85826 42155 39089 90623 121415 119898 193271 173010 156437 138700 111183 105588
11032A05588M7768K6471m4542m5111n3103m7330M2064M8110k1442O438L0133o170
11020H8874l4029J147R296O2459N1389J1198O3162j1459n7630l8299l0394o6935
11008D8779K5958O2664k351n046K0597l9406k0773J4398L6980Q3968j004m575
10996B20189m6961m2390l7135n5921l43J5864M3782r660l4883J08750L3754j190
10984A93856k6636j6852L601K8816o8841o9297j0322n417N4465O221k3484K2578
10972H8688m2998m3076Q14M0042Q605M788j0994Q280J1755J0436o7749k3593O4460
10959D9458K1795p0984J034j044j0497O581K4545n8937j9018J06852K4352L9269
10947A13406l6268q2042j0895k1873j0320m770R764K0004l1503J6366O6807q661
$$ plain form
11032 105588 153356 179827 135285 90174 37071 -10259 31805 79915 58473 64911 95044 88874
11020 88874 54845 55992 65288 127747 179136 190334 253496 242037 184407 146108 115714 48779
11008 48779 74737 137401 135050 130004 150601 111195 90422 104820 141800 225768 224764 220189
10996 220189 173228 130838 93703 37782 37439 53303 97085 87425 52542 161292 195046 193856
10984 193856 167220 150368 153969 182785 113944 44647 34325 28908 83373 89594 66110 88688
10972 88688 45690 2614 3428 43470 52075 56863 45869 54149 65904 76340 8591 -15002 49458
10959 49458 71253 269 1303 259 -10238 -3657 20888 -38049 -57067 49785 74137 113406
10947 113406 77138 -4904 -15799 -37672 -47992 -52762 -42998 -22994 -54497 -38131 28676 20015
10935B0015l3865J5940l2469n2696M4721K7378K0610J5957l8317k0268J9127J7112
10923C245k3132j0670P084m7329O569O2282l042k3362K6672j1886M7787J3543
10911D7761m7224l1785k0679J455l8525N5763N6236l1748l2452K418Q335N2950
10899B2505j9680J939j0906P7302N2603j669Q661k0698n1803p8632K254J2576
10887e548K8983O604k1194J2913M3259k3530j6225K2268N624n0921k0000J0911
10875f856m810M2271M6811K9072n1899k9301O37m4742M5731O0812j6310l8812
10863C2604m297J0067L41N546k3784k9346M314K4929J3661j0363O887o240k6619
10850b300j06731P686M3276P156l6035N1504L1532l813L6724o672K8163L796n2494
$$ plain form
10935 20015 -13850 2090 -30379 -83075 -38354 -10976 9634 25591 -12726 -32994 -13867 3245
10923 3245 -19887 -30557 -23473 -70802 -64233 -1951 -4993 -28355 -1683 -13569 34218 47761
10911 47761 537 -31248 -51927 -50472 -88997 -33234 23002 -8746 -41198 -38780 -30445 22505
10899 22505 2825 4764 -6142 71160 123763 122094 130755 110057 58254 -20378 -18124 -5548
10887 -5548 23435 30039 8845 21758 65017 41487 25262 47530 53154 2233 -17767 -6856
10875 -6856 -11666 30605 77416 106488 54589 25288 25925 -18817 26914 87726 71416 32604
10863 32604 28307 38374 38715 44261 20477 -8869 -4555 20374 34035 23672 30559 24319 -2300
10850 -2300 -109031 -101345 -58069 -50913 -86948 -35444 -3912 -7725 28999 22327 50490 54286 1792
10837A792K3928L455m3026M085M0065P2059j1946K3643n717J4684j6712m2291
10825F4019m1635K5968L453L4676k7749k0757k4827p584K6170j2859k1788M2643
10813C9730J2287k2321n3234J6654Q318j04p9423l5874M1234J9385L240K357p51
10800d8502M7402L5628R937J0890J91N0994K5429n5287l0599l589K5038M0336
10788A07868J1263l7134m4181L9525P288j9981l4170K7747R5285K0136j327l0599
10776A41720l2416r483L3581m0763o5977r945K7126J8336m4963j9370P6700N2915
10764A27461N9771k2940k707K5667K1018o6760k2950L3008m5500N4958K8196K9262
10752B18484O0541J13865R7313J88172M47428Q53798Q43089J55579j79254m38629
$$ plain form
10837 1792 25720 29175 -13851 -9766 30299 102358 90412 114055 108338 123022 106310 64019
10825 64019 22384 48352 51805 86481 58732 37975 13148 5564 31734 18875 -2913 39730
10813 39730 52017 29696 -23538 -6884 1434 1330 -78093 -113967 -72733 -53348 -50108 -47751 -48502
10800 -48502 -1100 34528 44465 55355 55546 106540 131969 76682 46083 42494 67532 107868
10788 107868 119131 81997 37816 77341 84629 64648 30478 58225 153510 173646 172319 141720
10776 141720 109304 99821 133402 92639 26662 16717 43843 62179 17216 -2154 74546 127461
10764 127461 187232 164292 161585 187252 208270 141510 118560 151568 106068 161026 189222 218484
10752 218484 279025 392890 490203 678375 1125803 1979601 2822690 2978269 2799015 2360386
10742B360386p87431n71192l52048k02340j41321o1338r045J2287l3135q2358
10732A32465k384l0225m9824N1515K7148J2J2726k8122r4404j34630J8852Q6013
10720a0858J13406N3353K5265n9099l2481J8228J2853l8113k2081P177l7706K4019
10708E3963P9021p54j9945m1757n1103L1585K1558l6284j0753l6318j1543L0796
10696H466M8099j9555k2790M946m2858j9658j9949K5298M683l505J1000N9083
10684C3260l5733k9851K4365j6771k9949J8267K1493k845l1716L8702L7002J730
10672B7954r2069k5806J02938M741l1332M1856Q5749K018q9068n5479K8727L5028
10660C5257K1414k78l2334l0698k3841K2464Q6127O1643m908P252N5381K4119
$$ plain form
10742 2360386 1572955 1001763 649715 447375 306054 244716 235671 247958 214823 132465
10732 132465 130081 99856 50032 101547 128695 128707 141433 113311 18907 -115723 -96871 -10858
10720 -10858 102548 155901 181166 122067 89586 107814 120667 82554 60473 67650 29944 53963
10708 53963 132984 132230 112285 70528 19425 51010 72568 36284 25531 -10787 -22330 8466
10696 8466 56565 37010 14220 19166 -23692 -43350 -63299 -38001 -33318 -36823 -25823 33260
10684 33260 -2473 -32324 -7959 -24730 -54679 -36412 -14919 -17764 -49480 -10778 26224 27954
10672 27954 -64115 -89921 13017 17758 -13574 28282 114031 116049 26981 -28498 229 35257
10660 35257 56671 56393 24059 -6639 -30480 -8016 78111 139754 134846 142098 197479 221598
10648B21598J7145n3199r6878m4822J4238l4604l7947J3996O5268N1099K9912
10637A45806j720J3101o9411j09790J6492J2063o1138L5162L9460k7898o6871
10626g4744k0754M2355L2602j898M4137N0006l598k8645j6422K8247m1555M1052
10614E0783o652j8600l7015J080M4028q03n6319K031N4064k9687K0397O3965K7716
10601A14988L2445n6529l5012M2024n585o385J5393L1012n869j11706p0480O5328
10589I624Q6756j2321m4795o8718K8677R8347N3279n5985k0336Q644O4458J1303
10577A58933r2536o1865J545j1050k6440N4652K9017q628o908L7652M0924L396
10565A18692R804k0835k3242j4897J3071j2477k4526k8910Q599P3203L5389K6093
$$ plain form
10648 221598 238743 185544 88666 43844 58082 23478 -14469 -473 64795 115894 145806
10637 145806 144086 157187 87776 -22014 -5522 6541 -54597 -19435 20025 -7873 -74744
10626 -74744 -95498 -53143 -20541 -22439 21698 71704 68106 39461 23039 51286 9731 50783
10614 50783 44131 25531 -11484 -10404 33624 32821 -23498 -21467 32597 2910 23307 87272 114988
10601 114988 147433 90904 55892 97916 92331 85946 101339 132351 126482 14776 -55704 9624
10589 9624 96380 84059 39264 -29454 -777 97570 150849 94864 74528 83172 147630 158933
10577 158933 66397 4532 6077 -4973 -31413 23239 52256 43628 36720 74372 115296 118692
10565 118692 128496 107661 84419 69522 82593 70116 45590 16680 25279 98482 133871 159964
10553A59964O872o4487m5430K0783J1716l4075l8423j0969Q5240k5474o2059l033
10541F25m442L8348L4621P2682J9876k8740l1856o319j0232j1855J4172J0636
10529I7516p2323n7245k8978N3800J22137K4602n9795J6184L1006l1570j8801
10518G6533k3045L8152m955k2154k0056l3563n7861M1369P7063j9715L9608P2122
10506A63498K285p6501q522l3363j3508M1945J899n0785n7542J7899J9465j8065
10494a1295R328K1206J4445O4918K0525L064m2552q119K067k162n577J0643M660
10481H1151k4342K8432Q9369j9062m0026l9238k1229m7988J3068O1366p261J4203
10469H8443k4724p351N2758J9285P012k4147m7602p4471L6498j5554n398P423
$$ plain form
10553 159964 166836 102349 56919 77702 89418 55343 16920 5951 91191 65717 3658 625
10541 625 -3817 34531 69152 141834 161710 132970 101114 94795 84563 72708 86880 97516
10529 97516 25193 -32052 -61030 -7230 114907 139509 79714 95898 126904 95334 76533
10518 76533 53488 91640 86685 64531 44475 10912 -46949 -5580 71483 51768 91376 163498
10506 163498 165783 89282 80760 47397 33889 75834 77733 26948 -30594 -12695 6770 -11295
10494 -11295 -1967 19239 33684 98602 119127 122191 79639 71520 73587 71425 65848 76491 81151
10481 81151 56809 85241 174610 155548 115522 76284 55055 7067 20135 81501 74240 88443
10469 88443 63719 56368 109126 128411 135423 111276 63674 -10797 25701 10147 4749 12172
10457A2172K1770N9515M6231m5989p5073Q029J8733j5858r797k5695Q9186K0464
10445A03688k9713j8514j5439K8748j9877k8631Q556L3841j3651Q966j7366l855
10433C6753N4325Q9312J9261p8979o3925j4410k9954m7342k3992K2054M7822R744
10421B0669K4328K7973J4487k0657j2847N5760O0821j3773n0599l2782o7234j9960
10409a3814R5296J821n0317M3302J4065j2789J860n554j9084m677J6340j2219
10397E4230M034K9836P4235j0787m8858L1161R452K733K4841l5714p6010J4874
10385G4027j2000j594J5271N9645r038K7296O649J723J7960M0857p0351r4086
10373E6359M1951J7608K1817O8168l1134n02L9931J6040k1612K3956j6935j2610
$$ plain form
10457 12172 33942 93457 139688 93699 18626 26655 45388 29530 19733 -5962 83224 103688
10445 103688 73975 55461 40022 68770 48893 20262 28818 62659 49008 57974 40608 36753
10433 36753 91078 180390 199651 120672 56747 42337 12383 -34959 -58951 -36897 10925 20669
10421 20669 44997 72970 87457 66800 53953 109713 170534 156761 106162 73380 6146 -13814
10409 -13814 81482 83303 32986 76288 90353 77564 79424 73870 54786 50109 66449 54230
10397 54230 58264 88100 162335 151548 102690 133851 143303 146036 170877 135163 59153 74027
10385 74027 62027 60433 75704 135349 126311 153607 160256 161979 179939 220796 150445 56359
10373 56359 98310 115918 137735 205903 174769 174267 214198 230238 208626 232582 215647 203037
10361B03037M8391N3944P000K4795j1107J2587k6120K2966K1470o2906l4687k7068
10349B32302J8997k2305j02771l6027Q0269J7396J3816M957m8031l6275m4285
10338G8043q143L7021R7076R001M6156j5004l8281l3384n211m7753o124m6521
10326F6876L6691J11410N9638Q026J779M7818K2105N1767J26194R0562Q2101N3470
10314G58437L9434N2840P8774O7501J5807o9982j24613j14067o4715r8960r0194
10303D50262n3427n4928j15534n8256J1549L5109j7361M022l173O3138j2137O9561
10291C18825J4504j5242l1806Q557O0889Q652k1423l6756K889J9800J5776K1869
10279C66534j9646L6281P2502J14359R4678R6492J97478J14048J35335J57317
$$ plain form
10361 203037 251428 305372 312372 337167 326060 338647 312527 335493 356963 294057 259370 232302
10349 232302 251299 228994 126223 90196 170465 187861 201677 206634 158603 122328 78043
10338 78043 69900 106921 203997 212998 259154 244150 205869 172485 167274 119521 113397 66876
10326 66876 103567 214977 274615 282641 284420 332238 354343 406110 532304 622866 704967 758437
10314 758437 797871 850711 929485 996986 1012793 942811 818198 704131 639416 540456 450262
10303 450262 396835 341907 226373 168117 179666 214775 197414 201436 198263 261401 249264 318825
10291 318825 333329 318087 286281 294838 355727 364379 342956 306200 309089 328889 344665 366534
10279 366534 346888 383169 455671 570030 664708 761200 958678 1072726 1208061 1365378
10269A365378J06106L3583l3168o6396j13461j67215j24307j56340j92642j37171
10259E14367o0356j297m5483l7939R690j4409j6780n0429J9725K9099J4154O8431
10247D28773K2485k1487n4692p4665m8400J2043O5758Q922M9601J6951j4647p0260
10235C20382o955O6393P3306J03335L7878Q1504J57910J01464J87924R8804K3599
10224A245544k4698k2762j60103k26822j48181n7012j00536q7778l2272n5049
10214C30331O271N6298K8794L3343N947p3037j20839m822L6102l025r684J1931
10202B97610j825J079o8528p1119M8600N679L2791M909J2037k6529k7584j1132
10190A95988Q9736P6944N66k5436J12L6882J13602O1480o9933j9453j7271o3468
$$ plain form
10269 1365378 1471484 1505067 1471899 1405503 1292042 1124827 1000520 844180 651538 514367
10259 514367 454011 452714 407231 369292 378982 364573 347793 297364 317089 346188 360342 428773
10247 428773 451258 429771 375079 300414 252014 264057 329815 338737 388338 405289 390642 320382
10235 320382 313427 379820 453126 556461 594339 675843 833753 935217 1123141 1221945 1245544
10224 1245544 1220846 1198084 1037981 811159 662978 605966 505430 417652 385380 330331
10214 330331 336602 392900 421694 455037 460984 387947 267108 262286 298388 295363 285679 297610
10202 297610 295785 296864 228336 157217 205817 211496 244287 249196 261233 234704 207120 195988
10190 195988 285724 362668 363234 337798 337910 374792 488394 549874 479941 460488 443217 379749
10178C79749o361J506k9794n7492p2658K2845j8238j5727M6106O2979N1186K42
10166C64343m523q0843k6587J2410l6506m2949M7697J950l0103j6750J9520J15416
10154C23075K4648p406K4812k9578j7278P2597l797L3725p836p438n58L0209l1963
10141D03212p7661j5277J02407N6664n0340o4560L2468q952l975J776n441r975
10129C60346N1717R931j3614K8845L4171n321m6456k933p073J5748N108j5634
10117D14835J754l2464k6769p4984O564M6448J11921M8518L9181J099J6659j9731
10105E33031m0528j0J753k8134J8582K0380k2129k7422k9663k0347j9212L3947
10093D20248K6850k195K132J7146M1764P173k9646l7255r8600N2017K5156l6571
$$ plain form
10178 379749 373388 374894 345100 287608 214950 237795 219557 203830 249936 312915 364101 364343
10166 364343 359820 278977 252390 264800 228294 185345 233042 234992 204889 188139 207659 323075
10154 323075 347723 340317 365129 335551 318273 390870 387073 420798 412962 405524 404966 435175 403212
10141 403212 325551 310274 412681 469345 419005 354445 386913 377961 373986 375762 370321 360346
10129 360346 412063 421994 408380 437225 471396 466075 419619 416686 409613 425361 430469 414835
10117 414835 416589 384125 357356 282372 288936 335384 447305 495823 535004 536103 552762 533031
10105 533031 492503 492493 494246 466112 484694 505074 482945 455523 425860 405513 386301 420248
10093 420248 447098 444903 447035 464181 505945 513118 483472 446217 347617 399634 424790 388219
10081C88219J654J0669k0137l956N5092N5718M6467l2367o7087J6061M3335K0096
10069E13764n1530n4046j1291J3633K5526M3281K833n0504j345N6602L5835k3115
10057D99643J2240j5131r5617k3663J6626m8870K0618J8005J2353J1527N8158
10046D65889k289M6308R915k2241n6801n600N2116l6951q2931m7661J9859N7952
10034C97565K8456l5441L586k0483m7060K0303O862L4003M22k04N3717k409L6799
10021D76116j3690m8434m0057K9359Q2710j2784n0409M2509j559R543L4070l1896
10009D75478J363p7518m3152N2474L2187N8591M5723K8002K2444q186L7578P9175
9997G04159L2377N9876J6329k3797l6854N6004K52K5806M234N6811L8139m3445
$$ plain form
10081 388219 389873 400542 380405 376449 431541 487259 533726 501359 434272 450333 493668 513764
10069 513764 462234 408188 396897 410530 436056 479337 482170 431666 430321 486923 522758 499643
10057 499643 511883 496752 401135 377472 394098 345228 365846 383851 396204 407731 465889
10046 465889 463600 509908 519823 497582 440781 435181 487297 450346 367415 319754 339613 397565
10034 397565 426021 390580 394166 373683 326623 346926 353788 387791 388213 388009 441726 439317 476116
10021 476116 462426 413992 373935 403294 486004 473220 422811 465320 463761 473304 507374 475478
10009 475478 476841 399323 356171 408645 440832 499423 545146 573148 595592 587406 624984 704159
9997 704159 736536 796412 812741 788944 752090 808094 808346 834152 838386 895197 933336 889891
9985H89891P6037K2965j3758L9205R100K5892J19588J5849O3291O3861O0821J70646
9973A543388J53102J40467P3416P8445J19363J49762J16625J25196J80563K70742
9963B951069K58039K73427K39405K34869J30100m0826j05125j19690o0053q5861
9953C675354o9019o1865j7807k1994O304p445m6340k7348R6187J21559J58674
9942C806260K83142M85968N53264P19699R58196R57142P54435N21281K84485J74922
9932I498794O8094n7523j14798k94849m83114n34714n75935n32363m12015l11675
9922F249902k00274j44485p6042J8072O9442J73110J67573L07037M09381M67955
9912G441671N38480O68261P21911P65886R51978J179044J408163J805023K328124
$$ plain form
9985 889891 965928 988893 975135 1014340 1023440 1049332 1168920 1184769 1248060 1311921 1372742 1543388
9973 1543388 1696490 1836957 1910373 1988818 2108181 2257943 2374568 2499764 2680327 2951069
9963 2951069 3209108 3482535 3721940 3956809 4086909 4046083 3940958 3821268 3761215 3675354
9953 3675354 3606335 3544470 3526663 3504669 3510973 3503528 3457188 3429840 3526027 3647586 3806260
9942 3806260 4089402 4575370 5128634 5848333 6806529 7763671 8518106 9039387 9323872 9498794
9932 9498794 9566888 9509365 9394567 9099718 8616604 8081890 7505955 6973592 6561577 6249902
9922 6249902 6049628 5905143 5829101 5847173 5916615 6089725 6257298 6564335 6973716 7441671
9912 7441671 7980151 8648412 9370323 10136209 11088187 12267231 13675394 15480417 17808541
9903A7808541L119709M317776N930840P917821J0135732J2801552J5689500J7074377
9895I4795848J3858190O356620j762877r003643j3813384j4215459j1868421r075092
9887E5271782o521776m200901k150533j36490J792281L858655N936234P567176
9879F1416428Q357031Q473216Q015532O636029M892403L569212K412152J093996
9871A04865999O2515p05668j632468k827746l907890m573776m639811m319059
9863H2322096l535261k114222j17938K774099O891250J2726224K0369682K9156839
9855A48472769L8414689M5044616M0408941K1152027j881480k1745966l6634814
9848B33230782m0287508l4655714k7292327k0452396j4288965q998230m643133
$$ plain form
9903 17808541 20928250 25246026 31176866 39094687 49230419 62031971 77721471 94795848
9895 94795848 108654038 115010658 113247781 104244138 90430754 76215295 64346874 55271782
9887 55271782 48750006 44549105 42398572 42262082 44054363 47913018 53849252 61416428
9879 61416428 69773459 78246675 86262207 92898236 97790639 101359851 103772003 104865999
9871 104865999 104928514 104222846 102590378 99762632 95854742 91280966 86641155 82322096
9863 82322096 78786835 76672613 76554675 79328774 86220024 98946248 119315930 148472769
9855 148472769 186887458 231932074 272341015 293493042 291611562 269865596 233230782
9848 233230782 192943274 158287560 130995233 110542837 96253872 87255642 82612509
9841H2612509j324434J160641K750006L420895L517988L624825L725858L481876
9833A02970164K820905J455820M32307j46928j247152k734023m572742p035923
9825I1942428r224529j0068995r593380q183611o140584m075686k333857n99053
9817D1722733J123244L086643N401669Q046615J0797125J3124158J3710707J0177135
9809A07190029L141216m282388j0611017j4281681j4549481j2597587j0112826
9802D3896265p844103n975801m495574l404259k612071j982722j575301j369889
9794A4636545j224331j054023r01616q58469q32992p02299o19149n48143n18935
9785G376588l98134k97223j94053m1164l6804o9316O6101K96633L81623L88451
$$ plain form
9841 82612509 81288075 82448716 85198722 88619617 92137605 95762430 99488288 102970164
9833 102970164 105791069 107246889 107679196 107532268 106285116 103551093 98978351 91942428
9825 91942428 82717899 72648904 63055524 54871913 48731329 44655643 42321786 41722733
9817 41722733 42845977 45932620 51334289 59380904 70178029 83302187 97012894 107190029
9809 107190029 110331245 106048857 95437840 81156159 66606678 54009091 43896265
9802 43896265 36052162 30076361 25580787 22176528 19564457 17581735 16006434 14636545
9794 14636545 13412214 12358191 11456575 10598106 9765114 9062815 8443666 7895523 7376588
9785 7376588 6978454 6681231 6487178 6446014 6409210 6339894 6405995 6702628 7084251 7472702
9775G472702M69511M78640L62271J80671L6835l5955k65745m51742o49810p52079
9765F845299q64321q18282o74523n51200m00713l16693k25854j63756j33909m1793
9755B654255L9918N3222R2247k1609l0524M5206M1120J9506O620R7561J20949
9744C118471J4353n3378j20348j74254j93909k28716j47367j55475j81144j31545
9734A746688j60701j89100n7502r5942j20109j07884n9971o4555j23404j31573
9724F35947j15100n8607k5539j3751J8388j4430l8756L7757m1593j1735l0221
9713C42360n4577K2699J5370J2735k7218m5326q140l8327m1860J7942P3679J0009
9701B79346k7829j471K7663P3551J4053p9883O694k2689n4992n3553K0499L3543
$$ plain form
9775 7472702 7942213 8420853 8783124 8963795 9000630 8964675 8698930 8247188 7597378 6845299
9765 6845299 5980978 5162696 4488173 3936973 3536260 3219567 2993713 2829957 2696048 2654255
9755 2654255 2694173 2747395 2839642 2818033 2787509 2832715 2873835 2893341 2899961 2997522 3118471
9744 3118471 3132824 3079446 2959098 2784844 2590935 2362219 2214852 2059377 1878233 1746688
9734 1746688 1585987 1396887 1339385 1243443 1123334 1015450 955479 890924 767520 635947
9724 635947 520847 462240 436701 422950 441338 426908 388152 425909 384316 372581 342360
9713 342360 287783 310482 325852 338587 311369 266043 257903 219576 177716 195658 269337 279346
9701 279346 251517 250046 277709 351260 365313 285430 292124 269435 214443 160890 181389 214932
9689B14932K6873M6350N1642O193p1206J6360k8841p3313o2376M5147N913j0883
9677A66791p384k3101m8949K1905L6443O19J2371O913o2247n075k880K2131K9549
9664A47086m3619l0503j2312L081j3340K520k659O1084K8599k9613m8637K5305
9652H6992P533M1586l622k5615k8878l8754l9386M2457q300n2633m6816m3530
9640a08966L2837n320M9078R869m8118n4298l84M668l6351N0883L0750J6999l8353
9627i6706k5666L5401O849l6844r748O1821J547m2580j8829K7669l9924k0284
9615a57294N1221J3888M441L6679J5925L6987k391k4630k7265J8349K525M348
9603b7217K9348k1859j8598p379k1954j1032l1625J7079K5450J557j1477p4504
$$ plain form
9689 214932 241805 288155 339797 345990 274784 291144 262303 188990 126614 171761 177674 166791
9677 166791 159407 136306 87357 109262 145705 146324 158695 165608 103361 98286 95406 117537 147086
9664 147086 103467 72964 60652 63733 50393 52913 50254 111338 139937 110324 61687 86992
9652 86992 94525 136111 132489 106874 77996 39242 -144 42313 34013 -18620 -65436 -108966
9640 -108966 -76129 -81449 -32371 -22502 -70620 -124918 -125302 -120634 -156985 -106102 -75352 -58353 -96706
9627 -96706 -122372 -86971 -80122 -116966 -126714 -64893 -63346 -105926 -124755 -97086 -137010 -157294
9615 -157294 -106073 -92185 -87744 -51065 -35140 1847 -544 -25174 -52439 -34090 -31565 -27217
9603 -27217 2131 -19728 -38326 -45705 -67659 -78691 -110316 -93237 -67787 -66230 -77707 -152211
9591a52211l5788M3002M9822m0162K2138J5413N3043J11329n7730m9540K150j2427
9579e0961j2348N9645o516p6836M6919K2500n963j3513P718K1100K6496K2380
9567D0621j6080n0438k8071l9594N6241j6187j7268M0304K7985O1127J5159p977
9555F5822n3574m1119L1120o197l8777m3383L5952P0754R5736L8976n6672k901
9543I5737k2153j7378q251J5690j1278k9930k3611M955j372K8195L4800j5330
9531E0074p4247k9560Q1998k2592o1710k575P7732j7807k0872O0426k652K9588
9519F7803O5474l4618l7024O7101Q8713L0094J4164j2010j2262p6476p4282J2808
9507I9485j0969m830O824o402m0125j2984m765j6307P1135L6559l2963k0795m6328
$$ plain form
9591 -152211 -187999 -144997 -95175 -135337 -113199 -97786 -44743 66586 8856 -40684 -38534 -50961
9579 -50961 -63309 -3664 -10180 -87016 -40097 -17597 -23560 -37073 -29355 -8255 18241 40621
9567 40621 24541 -25897 -53968 -93562 -37321 -53508 -70776 -30472 -2487 58640 73799 65822
9555 65822 12248 -28871 2249 -3948 -42725 -86108 -50156 20598 116334 155310 98638 95737
9543 95737 73584 56206 47955 63645 52367 22437 -1174 3781 2409 30604 65404 50074
9531 50074 -24173 -53733 28265 5673 -56037 -58612 19120 1313 -19559 40867 38215 67803
9519 67803 133277 98659 61635 128736 217449 247543 261707 249697 237435 160959 86677 99485
9507 99485 88516 83686 90510 84108 43983 30999 26234 9927 81062 117621 84658 63863 17535
9494A7535k3366M135J6873j9625P4017q446j8002l0705P334m7883L6495j333l828
9481C201L30K3492M8502J35279J00579J29316J48291J68225J67349R5408K7336
9470A047308n844m6139j96519k09678j14453p9297j08794m6710m4850r5350r4893
9459D781J4235K1926m3912N6308L9359r261L2624L110m7149K2832Q6976q224p259
9446A66346K1986M4616n8888O740j3880J8968o1172r5496R8610Q9052J11988J04976
9434D33846Q7553J34156K24205K46174J49101Q4711O2530n9799j59630j59536
9424A043311j40283r0439j08191j80779r9144p1907j15108m2339L1376n3954q9787
9413H2756J021L5863k0413N4558N7913k3595l4638k2569l6619j742L1553n0980
$$ plain form
9494 17535 -5831 -1696 15177 -4448 69569 61123 43121 12416 19750 -28133 8362 7029 3201
9481 3201 3531 27023 75525 210804 311383 440699 588990 757215 924564 1019972 1047308
9470 1047308 1041464 995325 798806 589128 474675 395378 286584 239874 195024 99674 4781
9459 4781 19016 40942 -2970 53338 92697 83436 116060 119170 72021 94853 181829 173605 166346
9446 166346 188332 232948 174060 180800 166920 185888 124716 29220 127830 216882 328870 433846
9434 433846 521399 655555 879760 1125934 1275035 1359746 1422276 1362477 1202847 1043311
9424 1043311 903028 812589 704398 523619 424475 352568 237460 195121 226497 172543 82756
9413 82756 83777 119640 99227 153785 211698 188103 153465 130896 94277 92535 124088 73108
9401G3108P036K3070K4968O5489k6084k2009N4690N6437J5509J2613L177J05813
9389C93817R7246O4478O2311K0158N879j2290k8611L865n709q1230q8619m5929
9377C85366j26420j24905l7363k0452k0607n4939J1877R0119o4560p2831K592
9366c2123J7215M4258M3111L8461K3895o321m7804k7188k5528l7891k7825M7347
9354I607M6810J3381J2069j602O83p5306j6616M0473Q8812J1457k1164j2089R273
9341A05788K1656k7672j5301L7265K1159j0269n0340q7785j01593N434M2769N4939
9329c950o9135n4630J7349L6253N3718K7726K1304o182Q699l8622M3018Q606n4299
9316a0145l4816J0491J8864j8792l2953J8024J712J9909K6718N10r563L2327N0192
$$ plain form
9401 73108 80144 103214 128182 193671 167587 145578 200268 256705 272214 284827 288004 393817
9389 393817 491063 555541 617852 638010 643889 631599 602988 606853 601144 519914 431295 385366
9377 385366 258946 134041 96678 76226 55619 680 12557 102676 38116 -34715 -32123
9366 -32123 -14908 29350 72461 110922 134817 128496 80692 53504 27976 -9915 -37740 9607
9354 9607 56417 69798 81867 80265 80948 5642 -10974 29499 118311 129768 108604 96515 105788
9341 105788 127444 99772 84471 121736 142895 132626 82286 -5499 -107092 -101658 -58889 -3950
9329 -3950 -73085 -127715 -110366 -74113 -20395 7331 28635 22453 31152 -7470 35548 44154 -10145
9316 -10145 -44961 -34470 -15606 -34398 -67351 -49327 -47615 -27706 -988 -478 -10041 22286 72478
9303G2478K6173J1194p3169q374L2701l7520l1402k8708N3825O6757K0767j2099
9291I2623K4314o168l2195L8331p8594j1425L6961j9296N411P7024L9561o5547
9279A01000n0707N1316L3970k1663m5154m426q263Q108M6065j3422p745K6048
9267A15127O100l373Q2198L5578j6222r0774k216O318K5517J1999J6807K723Q4412
9254B74194L2663M847K8152L982j8500J9942N9607Q6520J09308L7868j7111N7687
9242F79159L2154K647K5055Q2381J6596J7993K0336M4127L6252J47441R9856K0026
9230A224023P6161J43035J95548K25842J76175K05978K34532K32409L33790L55544
9220C403037L46653M22958M39577L90254M03315M21336L81070K92150K40576O2455
$$ plain form
9303 72478 98651 109845 36676 28302 61003 23483 -7919 -36627 17198 83955 104722 92623
9291 92623 116937 110769 78574 116905 38311 26886 63847 44551 49962 126986 166547 101000
9279 101000 50293 101609 135579 113916 68762 64336 56073 64181 110246 96824 89079 115127
9267 115127 121227 117854 200052 235630 219408 128634 126418 132736 158253 170252 187059 189782 274194
9254 274194 306857 311704 339856 343838 325338 345280 404887 491407 600715 638583 621472 679159
9242 679159 711313 713960 739015 821396 837992 855985 876321 920448 956700 1104141 1203997 1224023
9230 1224023 1300184 1443219 1638767 1864609 2040784 2246762 2481294 2713703 3047493 3403037
9220 3403037 3749690 4172648 4612225 5002479 5405794 5827130 6208200 6500350 6740926 6803381
9210F803381p3823k33698l01702l75641m80725m11557l55474l88420l62841l11962
9200C507538l06880k68834l12046k97487j55488j42699j75412j67425j43132j06685
9190A431450q2897j24281j21695j03518k6214k7846J5536r3714j31137j34811
9180F00873k8713p256p4693j3081j814n476O524O8321j3967k0095o9944m6669
9168C94010m8434n0549K8629K1103R145m174m8220k6835j9542k3380K5359l9289
9156B17823k2784r1677p793J8633K2879K0830p448m8649j303K8665K1423K3467
9144A74066N715m227J598j2020R981m2288k2988K5053L8053k796l231k9651l8972
9131I8293k9711K0032L0419m6825n9344r908r345j4403p6269k0364j4005N1582
$$ plain form
9210 6803381 6729558 6495860 6194158 5818517 5337792 4926235 4570761 4182341 3819500 3507538
9200 3507538 3200658 2931824 2619778 2322291 2166803 2024104 1848692 1681267 1538135 1431450
9190 1431450 1348553 1224272 1102577 999059 972845 944999 960535 866821 735684 600873
9180 600873 572160 564904 490211 477130 475316 469840 476364 544685 530718 510623 440679 394010
9168 394010 345576 295027 323656 344759 353904 349730 301510 274675 255133 231753 257112 217823
9156 217823 195039 103362 95569 114202 137081 157911 150463 101814 100511 129176 150599 174066
9144 174066 179781 175554 177152 165132 175113 132825 109837 134890 172943 170147 166916 137265 98293
9131 98293 68582 88614 119033 72208 12864 2956 -6389 -20792 -97061 -117425 -131430 -79848
9119g9848L6449K3101K7883N0686K6825k1791k8909j8246m710J5208p617P782
9107B6813o2779j8276n816L9587o354O457k396l9118P5059J3030n2542n050N6448
9094B5063J7661m6487J4473K0918k5665n403L9697P877K682l6414m9240j9862
9082e4700N910J964K1305M0203M0211l0767l1479k3989J0865j9715J2129O2836
9070C4773M5985K1263j2265l3179k0535L2867m5930Q711K9668M1987k162r0141
9058A1042k453j5673l77J4537K3520J2109q0428k0692m3101K992j7218K779P5108
9045c7855O575J707J2522M3828j2897n6988l8090j2315J4845j0557j1590l466
9033a04281O1305L550l358L4990k6882L959J8504L2782m611J1120p0248J523L3662
$$ plain form
9119 -79848 -43399 -20298 7585 58271 85096 63305 34396 16150 11440 26648 19031 26813
9107 26813 -35966 -54242 -60058 -20471 -26825 -20368 -22764 -61882 13177 26207 -26335 -31385 25063
9094 25063 42724 -3763 10710 31628 5963 560 40257 48134 50816 14402 -34838 -54700
9082 -54700 -48790 -46826 -25521 14682 54893 24126 -7353 -31342 -20477 -40192 -28063 34773
9070 34773 80758 102021 89756 56577 36042 68909 22979 31690 61358 103345 101183 11042
9058 11042 8589 -7084 -7461 7076 30596 42705 -37723 -58415 -101516 -98524 -115742 -112963 -37855
9045 -37855 -31280 -29573 -17051 26777 13880 -43108 -81198 -93513 -78668 -89225 -100815 -104281
9033 -104281 -42976 -39426 -42784 -7794 -34676 -30717 -12213 20569 15958 27078 -43170 -41647 -7985
9020g985M8273O8898n5840k5810m7852P708K2694o0841q8850k665J08496K864
9008c0910j01408n2861O1965P0713M4795J9624N1346J5323l4881o9768n0161k9203
8996a05426q241k949O277P2467M7759k9224m6073l8960L906K0539p023Q5916K3973
8983B2941k8756Q074m5900m2265R038K6578K6464k5236r9995L3610R6747M0567
8971B1867k6232o9883j2127L6444K3371q168l6796J2857j6465j4653N8811J7818
8959a3156N171J4067K3801l5295J37j015j4034j8528K760L4564J0750l3909m6771
8946g1458q386j1779O888O1589J4769j4998o2208j6536O1182R2697k724m3632
8934E404q6215n1649N5566K5783l4445K6366N8394j9117p6m1079J094j7273n37
$$ plain form
9020 -7985 40288 109186 53346 27536 -20316 -12608 10086 -50755 -139605 -142270 -33774 -30910
9008 -30910 -132318 -185179 -123214 -52501 -7706 11918 63264 78587 43706 -26062 -76223 -105426
8996 -105426 -113667 -116616 -110339 -37872 9887 -19337 -65410 -104370 -100464 -79925 -86948 -1032 22941
8983 22941 -5815 2259 -43641 -85906 -76868 -50290 -23826 -49062 -149057 -115447 -18700 21867
8971 21867 -4365 -74248 -86375 -49931 -26560 -34728 -71524 -58667 -75132 -89785 -30974 -13156
8959 -13156 -7985 6082 29883 -5412 -5275 -6290 -20324 -38852 -36092 -1528 9222 -24687 -71458
8946 -71458 -79844 -91623 -84735 -23146 -8377 -23375 -85583 -102119 -40937 51760 49036 5404
8934 5404 -80811 -132460 -76894 -51111 -85556 -59190 -796 -19913 -19989 -61068 -59974 -77247 -77784
8921g7784R866q452j7317l247l3786o1069p810O9152N8882Q2296k2153n2431P674
8908e6179J8741l492J7907L8876m2182n0665j2409k3037n564K1271K2481J4082
8896f0170j0345k7881M4937O970P9969P6897p8157j07646l274N5356n1603J4179
8884f0768j2218n759P5932O6800J5590o2494p5528L582N7072J3175j9267p5230
8872g9113N3260N684K9065p700o6143l9061n4305L1390L7247O7070Q8087R3445
8860A58926J16176L4492l1083J975r2095o9895j0857o5564p5974J1141N5476j2031
8848B0687m4936o464n4754j9681K2057o408N622m4372r846M707M1390J6084K8296
8835d7618L1605L1940p8050O9340p330l7231n0528L6220M8179k3665m2660l8797
$$ plain form
8921 -77784 -67918 -76370 -93687 -96934 -130720 -191789 -199599 -130447 -71565 10731 -11422 -63853 -56179
8908 -56179 -37438 -40930 -23023 15853 -26329 -76994 -89403 -112440 -118004 -96733 -74252 -60170
8896 -60170 -70515 -98396 -53459 -46489 33480 110377 32220 -75426 -78700 -23344 -74947 -60768
8884 -60768 -72986 -78745 -2813 63987 79577 17083 -58445 -54863 2209 15384 -3883 -79113
8872 -79113 -25853 -20169 8896 1196 -64947 -104008 -158313 -126923 -89676 -22606 65481 158926
8860 158926 275102 309594 278511 280486 188391 118496 107639 42075 -33899 -22758 32718 20687
8848 20687 -24249 -30713 -85467 -105148 -83091 -89499 -83877 -128249 -138095 -133388 -91998 -75914 -47618
8835 -47618 -16013 15927 -62123 7217 -113 -37344 -87872 -51652 -3473 -27138 -69798 -108595
8823a08595j7655J8522R223O6983N4406K7121o0019m3958j7115M402O032L4262
8811b6391j1253m8914k4944L9438L4544j174l646l7911k4317P2957L9105j0141
8799b647r933M0064q609p2393m7323J2138J0890N563j9977J2260L3986Q47J7570
8786b7564L2616l2468Q528M7543l849q4902j0237L9138k7780l8698M4276P80N0642
8773a975k6516l1649k1039J0794k8558M9470m6543k0080K8001P526K6964O9758
8761A6153K434l2258l2057l540k8338k2278N8239N7272M1844L7279J0270j6197
8749H8823n1149j9787o779M1077j7094n6535k7879k4099n452J8779J3894N977
8737d0224m3081J7349K0979L2559J8736J4210k1722m5220K872R2647Q69j678O9019
$$ plain form
8823 -108595 -126250 -107728 -98505 -31522 22884 50005 -10014 -53972 -71087 -66685 -60653 -26391
8811 -26391 -37644 -86558 -111502 -72064 -37520 -38694 -42340 -80251 -104568 -31611 7494 -2647
8799 -2647 -12580 27484 18875 -53518 -100841 -88703 -77813 -72250 -92227 -79967 -45981 -45134 -27564
8786 -27564 5052 -27416 -18888 28655 24806 -60096 -70333 -31195 -58975 -97673 -53397 -52617 -1975
8773 -1975 -28491 -60140 -81179 -70385 -98943 -49473 -96016 -116096 -88095 -80569 -53605 16153
8761 16153 18587 -13671 -45728 -49268 -77606 -99884 -41645 15627 57471 94750 105020 88823
8749 88823 37674 17887 11108 52185 35091 -21444 -49323 -73422 -78874 -60095 -46201 -40224
8737 -40224 -83305 -65956 -44977 -12418 6318 20528 -1194 -46414 -43542 49105 49974 48296 117315
8724A17315L6325j21711p8127N8176P1981l7573m615J9194L2013J6532n7061j9327
8712C3122j119n185K3068n7442n7901m276P1119K4964k2937K910M5494n7420l3791
8699c9394K652p390O3482J2798n151j9112K2564P6902o1840j7394L7649l9045
8687B6721M628N2985L6029j2888L4180j9279j9366p8218l8407K0804J6106J1883
8675C5178L0766k5712j0210R679M540L7345j922m582L7227M4525L2473M588o2588
8662A31307o1586m0643l6257L0296L0946R3414P3114m1255k3684j805k2510l59
8650A30978J3232j9377L2248J1048L8795M3433j5143n8619n927j7352k1452R1934
8638B23798P8828r187o3790j9060N448l1720j6236l6021M2415P468J5841K9287
$$ plain form
8724 117315 153640 31929 -46198 11978 83959 46386 41771 60965 92978 109510 52449 33122
8712 33122 32003 26818 49886 -7556 -65457 -69733 1386 26350 3413 6323 51817 -5603 -39394
8699 -39394 -36742 -44132 19350 32148 26997 7885 30449 107351 45511 28117 65766 26721
8687 26721 31349 84334 120363 107475 141655 122376 103010 24792 -13615 7189 23295 35178
8675 35178 65944 40232 30022 39701 44241 81586 79664 75082 112309 156834 189307 193895 131307
8662 131307 69721 29078 -7179 23117 54063 147477 220591 179336 155652 153847 131337 130978
8650 130978 144210 124833 157081 168129 206924 250357 235214 176595 170668 153316 131864 223798
8638 223798 302626 293439 229649 210589 216037 184317 168081 132060 174475 181943 197784 227071
8626B27071K9422M2823l0201n3424k6674K6835J34827N1104L7425K5607L1715
8615D96530M1753K5704R571r710K3909N1180N8473L4267n1789m5064j3095n9752
8603E61977p7832k9232O034o4210j7813M1451K4586J2879K0681n7873q685k0780
8591C91183k3236J5669j1784m3305n3616Q593n0757p399k1333O932M7515k8361
8579B30101l9840m9680J3173l9816K5597o482K2183J0976L9018k5831q536l6056
8567A34807n8402o897j58m8983Q008j0065Q6325J1349r0874l6414M3973L726l9343
8554b948J4482n767K2671k3118J4750P429M283J0714m6459o1290N917L5902K4150
8541G16K471p408P2350j416j5573k9670m5687K9399j406N6580j7477n3320m8446
$$ plain form
8626 227071 256493 299316 269115 215691 189017 215852 350679 401783 439208 464815 496530
8615 496530 538283 563987 573558 563848 587757 638937 697410 731677 679888 634824 621729 561977
8603 561977 484145 454913 460947 396737 378924 420375 444961 457840 478521 420648 411963 391183
8591 391183 367947 383616 371832 328527 274911 283504 232747 225348 204015 210947 258462 230101
8579 230101 190261 140581 153754 113938 139535 133053 155236 166212 205230 179399 170863 134807
8567 134807 76405 69508 69350 20367 28375 18310 104635 115984 25110 -11304 32669 36395 -2948
8554 -2948 11534 5767 28438 5320 20070 27499 31782 42496 -3963 -65253 -59336 -23434 716
8541 716 3187 -4221 68129 66713 51140 21470 -24217 5182 3776 60356 42879 -10441 -58887
8528e8887J2391M1368R542j2090L5561j1943k7685j04359J8553J0306j0953P0330
8516b7866o618J3724L7290o814k4332m044l7267l841k0688j4244N9815O9817K8502
8503F3434q715p9824m4106J4648m1068P604J2112M2794j9438k3558J5136O685
8491e4296J2002O2180M5833K8366m2798m7366m3899j9697n0474m2023K9560M4821
8479g7791J3029J857r529m195p306J0736l028K4303K49m0907M276M2962M7670
8466B326m4867k6738K5956j2357j97j2586K2457O3744j8226j179L0797J1062k1642
8453A8550M907n945n525l5772m4729j1461L1218M518R2K9663n2894l5066j2638
8440a15082N8350J450J3344P2917Q7584l5029n8506J508m7106k5113L2787k887
$$ plain form
8528 -58887 -46496 -5128 4414 -7676 27885 15942 -11743 -116102 -97549 -87243 -98196 -27866
8516 -27866 -34484 -20760 16530 9716 -14616 -18660 -55927 -59768 -80456 -94700 -34885 34932 63434
8503 63434 54719 -25105 -69211 -54563 -95631 -88027 -75915 -33121 -52559 -76117 -60981 -54296
8491 -54296 -42294 19886 65719 94085 51287 3921 -39978 -59675 -110149 -152172 -122612 -77791
8479 -77791 -64762 -62905 -72434 -76629 -83935 -73199 -76227 -51924 -51675 -92582 -88306 -45344 2326
8466 2326 -42541 -69279 -43323 -55680 -55877 -68463 -46006 17738 -488 -1667 29130 40192 18550
8453 18550 23457 17512 11987 -23785 -68514 -79975 -48757 -44239 -44147 -14484 -67378 -102444 -115082
8440 -115082 -56732 -55282 -41938 30979 118563 83534 25028 26536 -20570 -45683 -12896 -15783
8428a5783L8854J7684j8531p6000k0973N864L1740l7885l5832J6991J1696L3894
8416d8281M0583J7070m202l0712N5146J3508n1596m561L4171j6976o063r183J6423
8403E327j9526j2297K2012m9523p6418L3617N6705k4203l484r610N3191M6340
8391B2131l9884k7400J0938O3067J7854k2395o5566L4722O1178l1911Q547j0839
8379B0442k9829q24J9780J1322K8417N906k7374l1249K8343j0569j4981n2032
8367e2648M3285j3662r053M5337K9269l9836k5084k1617O866J5525J4564M2565
8355C5511j1575m2472K0492L5581R906L762o9528o2856O8314P019l047J9910M4037
8342E5054J7975O627K2423o2163J41m5827J9720o916q5584l4265M7266q226j125
$$ plain form
8428 -15783 23071 40755 22224 -53776 -74749 -68885 -37145 -75030 -110862 -93871 -82175 -48281
8416 -48281 -7698 9372 5170 -25542 29604 43112 -8484 -13045 21126 4150 -1913 -11096 5327
8403 5327 -14199 -26496 -4484 -54007 -130425 -96808 -40103 -64306 -67790 -77400 -24209 22131
8391 22131 -17753 -45153 -34215 28852 46706 24311 -41255 -6533 54645 22734 31281 20442
8379 20442 -9387 -10211 9569 20891 49308 55214 27840 -3409 24934 14365 -616 -52648
8367 -52648 -9363 -23025 -32078 13259 42528 2692 -22392 -44009 -37143 -21618 -7054 35511
8355 35511 23936 -18536 1956 37537 47443 51205 -18323 -81179 -12865 -5846 -8893 11017 55054
8342 55054 73029 79656 102079 39916 40057 -5770 13950 7034 -78550 -112815 -65549 -73775 -74900
8329g4900J6516m7028q5569K9265J9344O5740P6201L840j4018N005k9897j2228
8317d7729r542N0686L4633m6607l8860j3414j4685J8855N3332K720J2241j98p022
8304e590P733r6405L9354Q4004L976L0347k3846k788j6771L0636j2816m5078k0096
8291b7340K1564K1206L8300j6607k7251J9473k6751k1739j1004J6731K9763l2897
8279a6552R179L5234n6984j5174L7817J3837L5929r970j3691j2208J0469m751
8267A3135k3113m1550Q123L2617N8450k1261m6257j3393k058j3534K938J0177
8255c5726L1293R180m4581L6769J6090k2658l8185K976Q9420M4635J3194o5614
8243C6793k7127O400L1688L6970k6019l6538j5610N2114K2115q8170j6313J375
$$ plain form
8329 -74900 -58384 -105412 -190981 -161716 -142372 -76632 -431 3409 -10609 -5604 -35501 -47729
8317 -47729 -57271 -6585 28048 -18559 -57419 -70833 -85518 -66663 -13331 -10611 1630 1432 -5590
8304 -5590 2143 -94262 -54908 29096 33072 63419 39573 36785 20014 50650 37834 -7244 -27340
8291 -27340 -5776 15430 53730 37123 9872 29345 2594 -19145 -30149 -13418 16345 -16552
8279 -16552 -7373 27861 -29123 -44297 -6480 7357 43286 33316 19625 7417 17886 13135
8267 13135 -9978 -51528 -43405 -10788 47662 26401 -19856 -33249 -35307 -48841 -45903 -35726
8255 -35726 -4433 4747 -39834 -3065 13025 -9633 -47818 -44842 44578 89213 102407 36793
8243 36793 9666 16066 47754 84724 58705 22167 6557 58671 80786 -7384 -23697 -22322
8231b2322l7813J8046J6918q425p596N8254K412l4179k801l1259j1045K2585L121
8218c4104l1766n1006k3718m4063O3413J17368O9093l135j8947m8295L4114P236
8206C6190j8775K2960l5368j0021j4687K7057k6534k341k0351k5493R998O9419
8194A2054M9640K024J385m7304l9593n0506k5086K3823M6445j9160Q019j2801
8182e1060L1918m0527j5148J2822j0834O5946N8462L1835K1860n055n0315j02123
8170e2219k7561O6253k0306n4744J9133R8778L7626m8218p6931N676J8572J0465
8158b3476O304J511m2694J0955P4750J8184K5160K326N2075J3171l9249l7168
8146F1849n234j7106l4927k9709L7373J8771m0676k3371l2172k9655m1125L6777
$$ plain form
8231 -22322 -60135 -42089 -25171 -33596 -41192 17062 19474 -14705 -17506 -48765 -59810 -37225 -34104
8218 -34104 -65870 -116876 -140594 -184657 -121244 -3876 65217 62082 43135 -5160 28954 36190
8206 36190 17415 40375 5007 -5014 -19701 7356 -19178 -21519 -41870 -67363 -57365 12054
8194 12054 61694 63718 65103 17799 -21794 -72300 -97386 -73563 -27118 -46278 -38259 -51060
8182 -51060 -19142 -59669 -74817 -61995 -72829 -6883 51579 83414 105274 100219 49904 -52219
8170 -52219 -79780 -13527 -33833 -88577 -69444 29334 66960 18742 -58189 -52513 -33941 -23476
8158 -23476 -17172 -15661 -58355 -47400 27350 45534 70694 73020 125095 138266 99017 61849
8146 61849 56615 39509 4582 -25127 12246 31017 -9659 -33030 -65202 -94857 -135982 -99205
8134i9205N0039J2054l3772O463j9908P231L9371N1867n3590o3726l5719J3298
8122a25597j0025l1505K7332M3645N1068M3765J992k4505N92O6248O9711M5969
8110A58690J1645m4831m1927j0447r665j6800J3925M5548p006o264J5426k3401
8098H4893J1320l261N403p9498l4511K200N5167r350p8054J2379k2614L6710L2495
8085A3279K2478L1969k4212J4397J9779n2551L1568L1280k3743n4957l4927j6390
8073d2030M5115O4439j6441l5145k502M014K3421p2696O474M7879O2030K4652
8061A09210m4919j0524P778l3275j7218K6614K9911l6734n085J0377J2836l2833
8049A6138k2924K0036J296L9536P5657L9160m195l2949m2664J2732L7288P5224
$$ plain form
8134 -99205 -49166 -37112 -70884 -64421 -84329 -77098 -37727 14140 -39450 -103176 -138895 -125597
8122 -125597 -135622 -167127 -139795 -96150 -45082 -1317 675 -23830 -23238 43010 112721 158690
8110 158690 170335 125504 83577 73130 63465 46665 60590 106138 99132 92868 108294 84893
8098 84893 96213 92952 98355 18857 -15654 -13454 41713 32363 -45691 -33312 -55926 -19216 13279
8085 13279 35757 67726 43514 57911 77690 25139 56707 87987 64244 9287 -25640 -42030
8073 -42030 3085 67524 51083 15938 13436 17450 40871 -31825 -25351 22528 84558 109210
8061 109210 64291 53767 61545 28270 11052 37666 67577 30843 25758 36135 48971 16138
8049 16138 -6786 13250 14546 54082 129739 168899 164704 131755 89091 101823 139111 214335
8037B14335r437J4378K1391J4979J7546k6949k1713J8094n975n4439k2089O190
8025A66311K882k4703L506m3878j2357K0199J8477l5094q681O4127M6376j8581
8013A78584J3945J3187K6588j6867k0265N1408N4430L9255K5000J45612J82937
8002F93814J39325J10639l2404q4354p8890p4039j08908m4714J4822m5533L643
7991D93401K701N2739R5379P0930L7080p5642j67452j55302j11300r1569m7774
7980A03191K9668P515o9918p4203J9873J9319K3361N0055L1242O5190K6269k9101
7968B02461m2777L1300Q343K2454P8516M2204M6545L3132O3320Q3119O6588K5949
7956F61154l2784L993J7844k4656l8466j6263l271O0806J56482J1982m35k9924
$$ plain form
8037 214335 204898 219276 240667 255646 273192 246243 224530 242624 236649 182210 160121 166311
8025 166311 169193 144490 147996 104118 91761 111960 130437 95343 86662 150789 197165 178584
8013 178584 192529 205716 232304 215437 195172 246580 301010 340265 365265 510877 693814
8002 693814 833139 943778 911374 827020 748130 674091 565183 520469 535291 489758 493401
7991 493401 496102 548841 644220 715150 752230 676588 509136 353834 242534 150965 103191
7980 103191 132859 140374 70456 -3747 16126 35445 58806 108861 140103 205293 231562 202461
7968 202461 159684 190984 199327 221781 300297 342501 389046 422178 485498 568617 635205 661154
7956 661154 628370 632363 650207 625551 587085 570822 567551 628357 784839 796821 796386 766462
7944G66462j12192j17275q8067n9313j01327n9048k3249m1326l048l4230j8451
7933A08936n209K9268J8529k6106M8684q311m0516n8360l4351k0404l5907J3191
7921a0556N3283L5149k061k7069K3146K7883N2263M5898N9351l9192n9301p07
7909A58087L4750N6730j2490n0709K49j4019O621o6953k8410m9333K0544R076
7897F4143L971l7843m2331N1525O7786o7212q1304J9734M5125L20m8177l4071
7885e8334m2962K7279O3137k9993j0183J7189j261l0407o214P914l1636O754M661
7872h4056j6021j8086K0466m9014J9204N7697Q2417N2781M6569J8166k5329p1328
7860C3466n6949k108N0948j2814N425P717l1443J3286L0400k4840j8781L1331
$$ plain form
7944 766462 654270 536995 448928 389615 288288 229240 205991 164665 161617 127387 108936
7933 108936 103727 132995 151524 125418 174102 165791 125275 66915 32564 12160 -23747 -10556
7921 -10556 42727 77876 75815 48746 71892 99775 152038 197936 257287 218095 158794 158087
7909 158087 192837 249567 237077 186368 186617 172598 179219 112266 83856 34523 55067 64143
7897 64143 68114 30271 -12060 39465 107251 40039 -41265 -21531 23594 23914 -24263 -58334
7885 -58334 -101296 -74017 -10880 -40873 -51056 -33867 -35128 -65535 -71749 -63835 -95471 -88717 -84056
7872 -84056 -100077 -118163 -97697 -146711 -127507 -69810 12607 65388 111957 130123 104794 33466
7860 33466 -23483 -25591 25357 12543 17968 25685 -5758 7528 37928 13088 -5693 25638
7848B5638q963k6104R844J8204k5463j4906k0807L5227L6903j9195n2656n5670
7836i7948rP3863L1936m4596m2089j9239l6905L9658J7448j7940J6626K2290R8640
7823D1735J9508k5753m0785m2099j2402k7730N5295N8095M4315J867k2734o5082
7811a5770n0550j8480n3239k590N3447K4097j1417N3082O7425J2696m2409l1229
7799a4937j2623j6001j503K5729N8246L386o2281m1317K6744L1889m0117k0788
7787f3573M6829N045J9224j7535j1108O5143j248l8563J9362O3818j9138q868
7775E9388k5084j8434j8287q830j7455j2162J7530n1554l2N682k6292M3373L9597
7762a2560l943J0849j0371R5814K0898l6455o2145J1325Q635K1447K6684p742
$$ plain form
7848 25638 16675 -9429 415 18619 -6844 -21750 -42557 -7330 29573 10378 -42278 -97948
7836 -97948 -97957 -24094 7842 -36754 -78843 -98082 -134987 -95329 -77881 -95821 -79195 -56905 41735
7823 41735 61243 35490 -5295 -47394 -59796 -87526 -32231 25864 70179 72046 49312 -15770
7811 -15770 -66320 -84800 -138039 -140629 -87182 -63085 -74502 -21420 46005 58701 16292 -14937
7799 -14937 -27560 -43561 -45064 -19335 38911 42297 -19984 -61301 -34557 -2668 -42785 -63573
7787 -63573 -16744 -11699 7525 -10010 -21118 44025 42777 4214 23576 87394 68256 59388
7775 59388 34304 15870 -2417 -11247 -28702 -40864 -23334 -74888 -74920 -69238 -95530 -52157 -12560
7762 -12560 -16503 -5654 -16025 79789 100687 64232 2087 13412 22047 43494 70178 62436
7750F2436p0098n4599p842N7257K8176k0589k0092l0843m4836L1358P6121P009
7738A3458L6091j4633k8795l5620R728J258Q963m3180l1573O777N2926m1468r107
7725g5175R04N7444m6663L229M1986P217j1732k986o560Q726l161n4187m3294
7712a24252m406M4561K6129l6597k295j9628J5327O1881K0063j6700k157J6356
7700b1718k9256j3728r611n582Q689J2350O8298P3969O1437o6567r5477m2604
7688e9800M4477k4387K1266j9535o5442M2593N7197J2346J6508J8919m9921o8656
7676g4435k2978l9999n174M8004j7765j3496K2304L9489o0768o5215P2845L6270
7664h0918k862K5703o877l3452k2508O1406J7083J4558K9427L838m8965j6055
$$ plain form
7750 62436 -7662 -62261 -70103 -12846 15330 -5259 -25351 -56194 -101030 -69672 6449 13458
7738 13458 49549 34916 6121 -29499 -19771 -18513 -9550 -52730 -84303 -77526 -24600 -66068 -75175
7725 -75175 -74271 -16827 -63490 -60261 -18275 -11058 -22790 -25776 -32336 -23610 -26771 -80958 -124252
7712 -124252 -128658 -84097 -57968 -94565 -96860 -116488 -101161 -39280 -19217 -35917 -38074 -21718
7700 -21718 -50974 -64702 -74313 -79895 -71206 -58856 9442 83411 144848 78281 -17196 -59800
7688 -59800 -15323 -39710 -18444 -37979 -103421 -60828 -3631 8715 25223 44142 -5779 -74435
7676 -74435 -97413 -137412 -142586 -94582 -112347 -125843 -103539 -64050 -124818 -190033 -117188 -80918
7664 -80918 -83780 -58077 -64954 -98406 -120914 -59508 -42425 -27867 1560 5398 -43567 -59622
7652e9622K6817P05k7344J518j5088L1559L8634O414P891L8144n331m6045N042
7639C294k0566o6871k1608J7884k2533J0193l6191l503o570M8225N1405L526L748
7626c9567p6182K3015r537o9226j593K3604L2932L932L6337K1599k1780M3298
7614c3168M7558J6154j3820m4468j3471L14K0712K166k6169l4413l2638r682M2290
7601g8635O2961M9879K0800n2103q7603j5531M4415p584J569M2162L2700m525
7589H505k7691k4123m1864N8549L2734Q4244K263p1444o8797J4170r526j2050
7577e5030K429l2479M124J1516j362l8435O3476M9214k1154k372N3436J9869k9878
7564B3354p4424j2961O8338q332J2749O2517K8068r108k8360m8805o88M4990q397
$$ plain form
7652 -59622 -32805 -32100 -59444 -57926 -73014 -41455 -2821 3593 11484 49628 44297 -1748 3294
7639 3294 -17272 -84143 -105751 -87867 -110400 -100207 -136398 -139901 -146471 -98246 -46841 -43315 -39567
7626 -39567 -115749 -92734 -102271 -171497 -173090 -149486 -116554 -112622 -76285 -54686 -76466 -33168
7614 -33168 14390 30544 16724 -27744 -41215 -40901 -20189 -18023 -44192 -78605 -111243 -120925 -78635
7601 -78635 -15674 34205 55005 2902 -84701 -100232 -55817 -63401 -61832 -19670 13030 8505
7589 8505 -19186 -43309 -85173 -26624 6110 90354 92617 21173 -47624 -33454 -42980 -55030
7577 -55030 -52601 -85080 -80956 -69440 -70802 -109237 -45761 3453 -17701 -20073 33363 53232 23354
7564 23354 -51070 -64031 4307 -4025 8724 71241 99309 90201 61841 13036 12348 57338 48941
7551D8941m180k1153k8261l9567j9942p832j1815J04188r12j0576p5230l9206
7539a05545K3358J2227L6014J1967J9824N9921j6878o7335n3431M002M9615r745
7527c6006k4948o55K3979J6293K8846j6916K9447j6443p7814M1669N3149n177
7515A5424L6613L0644m470k8349o5372j2348N6213J0062m6912l9361j7146n685
7503g0687m570n326K5505O0542K8868n063o028m9389k0770J7533M9948K6065O251
7490E2879n322J3639j7315J0246k7978l3427P133M5300p468R051k8343o4436P020
7477c9021M9322N6705L9949m6716p0672l7580L3434N3536P186o35n9016q189L4279
7464A2582M4287N1120j1202j2078O717j3567j6617k9969o1437R896K9056k6693
$$ plain form
7551 48941 44761 23608 -4653 -44220 -64162 -71994 -83809 20379 19467 8891 -66339 -105545
7539 -105545 -82187 -69960 -33946 -21979 -2155 57766 40888 -26447 -79878 -75876 -26261 -36006
7527 -36006 -60954 -61609 -37630 -21337 7509 -9407 20040 3597 -74217 -32548 20601 15424
7515 15424 52037 82681 78211 49862 -15510 -27858 28355 38417 -8495 -47856 -65002 -70687
7503 -70687 -75257 -80583 -55078 5464 34332 29269 23241 -26148 -46918 -29385 20563 46628 52879
7490 52879 47557 61196 43881 54127 26149 -7278 -145 45155 37687 46738 18395 -46041 -39021
7477 -39021 10301 67006 106955 60239 -10433 -48013 -14579 38957 46143 45508 -13508 -21697 12582
7464 12582 56869 107989 96787 84709 91426 77859 61242 31273 -30164 -20268 8788 -17905
7452a7905j3498o875N9794M5061o2653M752o5433l1262J8204M9116J3176J2631
7440E108J7512q1458l1037K6083k352n9110K430K6601J7980Q707L7160Q024P0250
7427D5898k068q2720m7213o411J0636R46p0253J5631K2433L5470J5311n388N6020
7414a1708J8118l1045n9244k6393M3995K7184J5458N2710n1182m4278M320J6049
7402d6016l7225J3932M171j761L3548P979Q36p3124l7674M0610K6885M1143k1081
7389d7777K8689J802n3067m680J4262K8762J1305j2657m8450m0529L2925L6560
7377e2855J1462K027k0096j1840j769M176N1815k6555o9256n2214O9783O1013
7365c4309O8j8089J2992P1344l2878k0920J2356P087r879J8228j1792n6567m1280
$$ plain form
7452 -17905 -31403 -38278 21516 66577 3924 8676 -56757 -88019 -69815 -20699 -7523 5108
7440 5108 22620 -58838 -89875 -63792 -66144 -125254 -122824 -96223 -78243 -69536 -32376 -24352 45898
7427 45898 43830 -38890 -86103 -92514 -81878 -80932 -151185 -135554 -113121 -77651 -62340 -67728 -11708
7414 -11708 6410 -24635 -83879 -110272 -66277 -39093 -23635 29075 -22107 -66385 -62065 -46016
7402 -46016 -83241 -69309 -65138 -66899 -33351 -25372 -24536 -97660 -135334 -94724 -67839 -26696 -47777
7389 -47777 -19088 -17286 -70353 -75033 -60771 -32009 -20704 -33361 -81811 -122340 -89415 -52855
7377 -52855 -41393 -39366 -59462 -71302 -73071 -68895 -17080 -43635 -112891 -165105 -95322 -34309
7365 -34309 -34241 -52330 -39338 32006 -872 -21792 -9436 -2349 -12228 6000 -5792 -62359 -103639
7352a03639k4903M0762K7999L9987K3195m8421k1412Q530K7502k9332k3692J5938
7340f7486J5762L576J330J4688N2271K6762j5967m2760j0693k671r841M0167K5224
7327C0362m1416j08888m4498O2090Q511J6316r768J8728L6795n5619k0445l4302
7315a42134R913K0791J5522J1394J1990k1246l2975L7828O4213N8917j9943K2933
7303C7203K4331J9098m1494j8816j4537N840J2774n5114n0479J5384L9655L2890
7291F735M975J6843l9990o8027n521m7454k7954N1418P6551P1456j212r1377q7080
7278a40637O9228N5383n6531j267J5104n2821p568K742L9054L9583P2326J626
7266C6222q2514n6964n254N8472J23139M4974p0126l0937n0711m2867j5141m1827
$$ plain form
7352 -103639 -128542 -87780 -59781 -19794 3401 -45020 -66432 -57902 -30400 -59732 -83424 -67486
7340 -67486 -51724 -48148 -46818 -32130 20141 46903 30936 -11824 -22517 -25188 -35029 5138 30362
7327 30362 -11054 -119942 -164440 -102350 -93839 -77523 -87291 -68563 -31768 -87387 -107832 -142134
7315 -142134 -132221 -111430 -95908 -84514 -72524 -93770 -126745 -88917 -24704 34213 14270 37203
7303 37203 61534 80632 39138 20322 5785 11625 24399 -30715 -81194 -65810 -26155 6735
7291 6735 11710 28553 -11437 -79464 -84985 -132439 -160393 -108975 -32424 39032 37820 -53557 -140637
7278 -140637 -71409 -16026 -72557 -73824 -58720 -111541 -119109 -116367 -77313 -37730 34596 36222
7266 36222 -46292 -103256 -108510 -50038 73101 118075 47949 17012 -33699 -76566 -91707 -133534
7254a33534J4860K9517J1374J8010Q187j5036N299M5915M3452J7117k1085k9551
7242e475L3649L1998N3160L3900o0802o3754o5248m241M3840l0067o891K7882
7230a2049k917j5447m3993M1625l935j954j476J0333K8679l1433k7483Q919O3500
7217A2369N2457k0121m6154O7387L012k6447l0872m6487o527R470n6155M8147
7205c9921J9858q7464p7786n441j831N1404J3640M8117O8457L9471k1936k7592
7193b1024m3172j4523j9788J7203Q2511Q2168k5006l797k5358k0693l4157k1901
7181d7537J4271O4469j0992l1731o4344m5836R084P004K311Q3221M854n667m6322
7168f7215Q304M4767m4505m3575N442L9952J1354M8047N7526j3737l0287k9832
$$ plain form
7254 -133534 -118674 -89157 -77783 -59773 -51586 -66622 -61323 -15408 28044 45161 24076 -5475
7242 -5475 28174 60172 113332 147232 86430 22676 -42572 -46813 -2973 -33040 -39931 -12049
7230 -12049 -14966 -30413 -74406 -32781 -36716 -38670 -40146 -29813 -1134 -32567 -60050 -51131 12369
7217 12369 64826 44705 -1449 65938 68950 42503 11631 -34856 -41383 -31913 -88068 -39921
7205 -39921 -20063 -107527 -185313 -190754 -192585 -141181 -127541 -79424 -10967 28504 6568 -21024
7193 -21024 -64196 -78719 -98507 -81304 1207 83375 58369 54572 29214 8521 -25636 -47537
7181 -47537 -33266 31203 20211 -11520 -75864 -121700 -112616 -105612 -103301 -20080 -15226 -20893 -67215
7168 -67215 -58911 -14144 -58649 -102224 -96782 -56830 -45476 2571 60097 46360 16073 -13759
7156a3759j1140o9074l8519N6004J7775r218M442K8025m3950m3856N2915J7648
7144e2707n1089m1836J6070J7985j7324l723L7200O0925l1265K7824N7589j5683
7132C966l531n9726J4815M0801J8718l1826k1631l2377L2996j1797J105Q605N336
7119c4546j2428p887o910K8316k7291l1719Q3442O9899J9499J1977l7885n1664
7107B803p3725n3817P1436J4904q675J2296P2289M7568p0026k6693J4290M267
7095F917k8224m9947j3003k4938M8207O7527J8018M244j2846n1675l5131K9799
7083d1052K9133J7425L3040j8574n035K9776K1966Q348j9002N437J2888J9176
7071I3526k7480j7899p1530l8359L3123j3838r598P0264K0807o0013m9185l0079
$$ plain form
7156 -13759 -24899 -93973 -132492 -76488 -58713 -67931 -63489 -35464 -79414 -123270 -70355 -52707
7144 -52707 -103796 -145632 -129562 -111577 -128901 -132624 -95424 -34499 -65764 -37940 19649 3966
7132 3966 435 -59291 -44476 -3675 15043 -16783 -38414 -70791 -37795 -49592 -48487 -39882 -34546
7119 -34546 -46974 -54861 -61771 -33455 -60746 -92465 -9023 60876 80375 92352 54467 2803
7107 2803 -70922 -124739 -53303 -38399 -47074 -34778 37511 85079 15053 -11640 2650 6917
7095 6917 -21307 -71254 -84257 -109195 -60988 6539 24557 28801 15955 -35720 -70851 -41052
7083 -41052 -11919 5506 38546 19972 14937 44713 66679 75027 56025 61462 74350 93526
7071 93526 66046 48147 -23383 -61742 -28619 -42457 -52055 18209 39016 -20997 -70182 -100261
7059a00261j1061n927O216K6591k4772L847M4717N2951j6305n6927J5866K2157
7047d2908j9489j2725m824J4870L1621N3714o4157n7810N5396N4708k1211j4153
7035b6968j1876J707j7219k2625L801O4614L6518L296n64l5980j2347L2514N9857
7022G4728n888n6199n3605n8743M4123M3375n0919l3602M9071L0394k5925j9231
7010f2421K5531J7895k4938M6596L4799q160r390k070k5411k8245k1701J7403
6998d0112O405l756L7240j34l6916m3552K388R239j0970P583L2379K2114o2290
6985h0382j502M8439k2554r490L4112j0866q827K2928L4987q108m963L9991k39
6972C3526l2004n3039l6888p220p539l45J6299K6667Q567J1744k085j1507p68
$$ plain form
7059 -100261 -111322 -117249 -111033 -84442 -109214 -105367 -60650 -7699 -24004 -80931 -65065 -42908
7047 -42908 -62397 -75122 -79946 -65076 -33455 20259 -43898 -101708 -46312 8396 -12815 -26968
7035 -26968 -38844 -37137 -54356 -76981 -73180 -8566 27952 31248 30684 -5296 -17643 14871 74728
7022 74728 68840 12641 -40964 -99707 -55584 -12209 -63128 -96730 -47659 -17265 -43190 -62421
7010 -62421 -36890 -18995 -43933 2663 37462 29302 19912 17842 -7569 -35814 -57515 -40112
6998 -40112 -33707 -37463 -223 -357 -37273 -80825 -78437 -69198 -80168 -72585 -40206 -18092 -80382
6985 -80382 -81884 -33445 -55999 -65489 -31377 -42243 -51070 -28142 6845 -1263 -6226 33765 33526
6972 33526 1522 -51517 -88405 -95625 -103164 -103509 -87210 -60543 -51976 -40232 -42317 -53824 -54592
6959e4592L0663M0312O0196k1504j2248K021j9475r724K4454J088m2910J5039
6947A3320J9847K7695J7486l7516j7846l6895M9057k3938l9003K2902L0499n870
6935A9738k8592k13l9466k77j806l2862k3849k5063j366N1752O4940L8411M0796
6922F2143R109l8385J3554M0288n8446p1733l607L785L0921J428J488O067M4094
6909D0706j4941K1549K015l2053o0597K241l4771o8363j1867M3083L4853j16L4970
6896d3291Q4272L4049l977j1718p5085J1953o195l3143L025K5553k0261k352J6626
6883b0544R1916K6886m5952O002j5356n3929j8005n0463l5515M1898M8771L754
6871b0537k1244j2728l8156J8360J11723M5570k5040j7915j0476J4386r898n822
$$ plain form
6959 -54592 -23929 16383 76579 55075 42827 44848 25373 15649 40103 41191 -1719 13320
6947 13320 33167 60862 78348 40832 22986 -13909 35148 11210 -27793 -4891 25608 19738
6935 19738 -8854 -9067 -48533 -48810 -50616 -83478 -107327 -132390 -133756 -82004 -17064 21347 62143
6922 62143 71252 32867 46421 86709 28263 -43470 -47077 -43292 -12371 -10943 -9455 -3388 40706
6909 40706 25765 47314 49329 17276 -43321 -41080 -75851 -144214 -156081 -112998 -78145 -78261 -43291
6896 -43291 40981 75030 71053 59335 -15750 -3797 -9992 -43135 -40110 -14557 -34818 -37170 -20544
6883 -20544 71372 98258 52306 58308 42952 -10977 -28982 -79445 -114960 -73062 -24291 -20537
6871 -20537 -41781 -54509 -92665 -74305 37418 82988 57948 40033 29557 43943 34045 28223
6859B8223K2279k1182m8412o0795p772o234L3801K490n5863k7961J07495R3882
6847E9951n016j3550k7772l3413m8042k397m0313k5333Q873M3470M1149K3662
6835a8731M9700M6305l6992m8535k6753p804M9200L4167N4500l7305p2272p991
6823b2511M0417K9131k4017l8806K2949K6080l1516n8071k617N4185Q9119J96
6811H4539J6626L3246j2965o1617n2159j1664j9578m6291m3800K7584M7615J1546
6799b6918J6101L5361j2502n3103J0202R286o274m6430l2192M7959L4796j4453
6787c8167j5102L4736P6426l8421j08797o2772M6628J4207K540M0882l8338Q721
6775g7457m6374j714P7678J6262k1661m8400j8097j0745L8836Q1008j3751L416
$$ plain form
6859 28223 50502 29320 -19092 -79887 -87659 -93893 -60092 -57602 -113465 -141426 -33931 59951
6847 59951 54935 41385 13613 -19800 -67842 -70239 -110552 -135885 -127012 -83542 -42393 -18731
6835 -18731 30969 77274 40282 -8253 -35006 -42810 6390 40557 95057 57752 -14520 -22511
6823 -22511 17906 47037 23020 -15786 7163 33243 1727 -56344 -58961 -4776 84343 84539
6811 84539 101165 134411 121446 59829 7670 -3994 -23572 -69863 -113663 -86079 -38464 -26918
6799 -26918 -10817 24544 12042 -41061 -30859 -21573 -27847 -74277 -106469 -58510 -23714 -38167
6787 -38167 -53269 -18533 57893 19472 -89325 -152097 -105469 -91262 -88722 -47840 -86178 -77457
6775 -77457 -123831 -125545 -47867 -31605 -53266 -101666 -119763 -130508 -91672 -10664 -24415 -20999
6763b0999N987J7789M066l6017j3345P0615Q9507J2527n1158j45353q0188Q6933
6751e9636J8104L7739l0984k6298M2338K4098k2985O170J0858M745M897J809l0615
6738a9760l285K437J6076O108K0071k8025m0623J4582M2959k5875m7863J6649
6726d6549J8823M9659J1301k0528k0387N9779L5408J8072M4944k4926r3113q442
6714B4041R300k5058k2047K1646K8782M057l2365k5210J4764o93l5968O800j8238
6701e0189n4553K5633O1884k9145l051J7633k8539o5750O5435N0708K5380r03
6689A4543l6020l4516J7128j5585J5733L2358K5240r063m0669m9639Q0764M4359
6677D4633q9165k3695J7951N968J4189j1119j3106l831M571O0105L6841l0171
$$ plain form
6763 -20999 -15012 2777 6843 -29174 -42519 28096 117603 130130 78972 -66381 -146569 -59636
6751 -59636 -41532 -3793 -34777 -61075 -18737 5361 -17624 -11454 -596 4149 9046 10855 -19760
6738 -19760 -23045 -20608 -4532 1576 21647 -6378 -47001 -32419 10540 -15335 -63198 -46549
6726 -46549 -27726 21933 33234 12706 -7681 52098 87506 105578 150522 125596 32483 24041
6714 24041 33341 8283 -13764 7882 36664 40721 8356 -16854 -2090 -2783 -38751 -31951 -50189
6701 -50189 -104742 -79109 -17225 -46370 -49421 -31788 -60327 -126077 -60642 -9934 15446 14543
6689 14543 -21477 -55993 -38865 -54450 -38717 -6359 18881 9818 -30851 -80490 274 44633
6677 44633 -44532 -68227 -50276 -44308 -30119 -41238 -54344 -58175 -53604 6501 43342 13171
6665A3171j8547M2489j7016k002k0708M1968n8936l8507j8822k4315L1545M9747
6653a9933J5492L0521J6826o2206n7582K5128L8028O6395j1264M8277N435p249
6641H7868l3345k2727n9965l6791M9078q38j0867R172n4334n4324L5833j733k7343
6628a20316K6262M9945L3665l6508L54K9198n2106l4586q894l1679j2955M8345
6616a09275R829o082o845m4329j8076Q8805J8240M598K1346L4751K1961m1863
6604b6940l6498j908N3439M401J8000n6759k8886L7424j4372m8473J780K6484
6592g2308Q4137j17j2721l7511l2885M237M9994J2637L3182N0881j6664k8736
6580C4126Q11o976J2273l1738m1374j0993j0966r699K4782N9957N6376J5202m4520
$$ plain form
6665 13171 -5376 37113 20097 18095 -2613 39355 -19581 -58088 -76910 -101225 -69680 -19933
6653 -19933 -4441 26080 42906 -19300 -76882 -51754 -13726 52669 41405 89682 95117 87868
6641 87868 54523 31796 -28169 -64960 -15882 -16720 -27587 -18415 -72749 -127073 -91240 -92973 -120316
6628 -120316 -94054 -44109 -10444 -46952 -46598 -17400 -69506 -104092 -112986 -144665 -157620 -109275
6616 -109275 -99446 -105528 -112373 -156702 -174778 -85973 -67733 -63135 -41789 -7038 14923 -26940
6604 -26940 -63438 -65346 -11907 -7506 10494 -46265 -75151 -37727 -52099 -100572 -98792 -72308
6592 -72308 11829 11712 -1009 -38520 -71405 -67168 -17174 -4537 28645 79526 62862 34126
6580 34126 34937 27961 40234 8496 -32878 -43871 -54837 -64536 -39754 20203 76579 91781 47261
6567D7261j0770l1548l2868k8545J9951N395m954O3377M501L7867j3408q4103
6555b7844o969p917M3325M3246k7817Q887M2096P309j7888J5566j3054l1731o7407
6542d0198J485L1761O372p547J3938j6063l7355L2645K0388q7367p249N9872j2682
6529d2000j7948k1591J5897N6748L7185m3369J5996N184o2722m6443K8287N6206
6517a8570j304j5443J8976n2261k5222K5927j623M0365j0512J9491k9858j1677
6505f1711N5471L5077k5325L1018Q415q6568n8612L2045J2467J20122m4086o3753
6493d5440M1138J0671O2147l0311q4613m1232J8616L7910r349l532N7266m9841
6481c6570L4998N3457R676k5026k098K3153N98o5293j1824P267n787P6056N96
$$ plain form
6567 47261 36491 4943 -27925 -56470 -36519 -31124 -36078 27299 31800 69667 56259 -27844
6555 -27844 -34813 -42730 595 43841 16024 24911 67007 74316 56428 71994 58940 27209 -40198
6542 -40198 -38713 -6952 -580 -8127 5811 -10252 -47607 -14962 5426 -81941 -89190 -29318 -42000
6529 -42000 -59948 -81539 -65642 -8894 28291 -15078 918 6102 -56620 -103063 -74776 -18570
6517 -18570 -19874 -35317 -16341 -68602 -93824 -67897 -69520 -29155 -39667 -20176 -50034 -61711
6505 -61711 -6240 28837 3512 34530 42945 -43623 -102235 -70190 -57723 62399 18313 -45440
6493 -45440 -4302 6369 68516 38205 -46408 -87640 -69024 -31114 -40463 -43995 13271 -36570
6481 -36570 -1572 51885 61561 36535 34437 57590 58188 -7105 -18929 -11662 -17449 58607 59203
6468E9203j54598r3929N1102J33256O7094J5000N659m1940j9132j4574j4919k0294
6456b8072O774N1164O4283m5367r2589q199K434M2371M1825k6879m5986R414J3964
6443a4863J8923q9807L8122J3291M6329J7976o9985L2990r450m4719n3056m3539
6431a57788q512K4751P8788M8509K7124j4605o369m2122j1036K526l3632m0608
6419a32974J7822K2352L724O7518j2273k0034k4282N5204K4375O953l9122m1810
6407g2547N418L0207L9244m8483o2493k5290M043k0538J9354J9610M2659N0632
6395a8184Q3643K2540p7942j9592l6906j6201P0688J8868k0456j0534M627l916
6383c365j3073J1313m2307k7785J2033M3195l0957m3998P0760K7849p1439l0334
$$ plain form
6468 59203 -95395 -189324 -138222 -4966 62128 77128 82787 40847 21715 7141 -7778 -28072
6456 -28072 -21298 29866 94149 48782 -43807 -52006 -49572 -7201 34624 7745 -38241 -28827 -14863
6443 -14863 4060 -85747 -47625 -34334 11995 29971 -40014 -7024 -16474 -61193 -114249 -157788
6431 -157788 -166300 -141549 -62761 -14252 12872 -1733 -8102 -50224 -61260 -58734 -92366 -132974
6419 -132974 -115152 -92800 -89076 -21558 -33831 -53865 -78147 -22943 1432 8385 -30737 -72547
6407 -72547 -67129 -36922 2322 -46161 -108654 -133944 -129901 -150439 -131085 -111475 -68816 -18184
6395 -18184 65459 87999 10057 -9535 -46441 -62642 8046 26914 6458 -4076 551 -3365
6383 -3365 -16438 -5125 -47432 -75217 -63184 -19989 -50946 -94944 -24184 3665 -67774 -98108
6371i8108M9975n648N4640L0370p0248l660k0187m0581J8380P0433J4094k1762
6359b2302O2276j5831q839M6310l332j7758l2514l604L9061L8709k9864L251k2544
6346C3019m3162p686l647O8418N1759m7377m481l6260l6271m8874m0116L2245
6334h2433P1124m5937l5199n690l3022L8885J02217R580l1981j947L702K629P139
6321i33j7691L1181l8964m4988m041j872N014M7439J08911K3611K119k8475m8056
6308C3255l5294L4465L019m834k5741M242L7578l9623q921J5460j2718k40J9093
$$ plain form
6371 -98108 -48133 -53781 859 31229 -39019 -42679 -62866 -103447 -85067 -14634 -540 -22302
6359 -22302 39974 24143 15304 61614 58282 40524 8010 4406 43467 82176 52312 55563 33019
6346 33019 -10143 -17829 -21476 46942 98701 51324 46843 10583 -25688 -74562 -114678 -82433
6334 -82433 -11309 -57246 -92445 -98135 -131157 -92272 9945 19525 -12456 -14403 -10701 -8072 -933
6321 -933 -18624 12557 -26407 -71395 -75436 -77308 -72294 -24855 84056 107667 109786 81311 33255
6308 33255 -2039 32426 35445 30611 4870 9112 46690 7067 -1854 13606 888 648 19741
$$ [...]
##END NTUPLES=NMR SPECTRUM
##END=
