##TITLE=Analysis number 314482
Compound Code cc 30110
Book Reference 454/32
Project Code adrs
Chemist Name stevep
##JCAMPDX= 6.0         $$ Bruker NMR JCAMP-DX V2.0
##DATA TYPE= NMR SPECTRUM
##DATA CLASS= NTUPLES
##ORIGIN= Bruker BioSpin GmbH
##OWNER= NMR
$$ XWIN-NMR		Version 3.5
$$ Tue Oct 18 11:43:04 2005 GMT Daylight Time (UT+1h)  MAYBRIDGE\NMR@NMR_250MHZ
##.OBSERVE FREQUENCY= 250.131544655141
##.OBSERVE NUCLEUS= ^1H
##.ACQUISITION MODE= SIMULTANEOUS (DQD)
##.ACQUISITION SCHEME= undefined
##.AVERAGES= 16
##.DIGITISER RES= 18
##SPECTROMETER/DATA SYSTEM= dpx250
##.PULSE SEQUENCE= zg30
##.SOLVENT NAME= CDCl3
##.SHIFT REFERENCE= (INTERNAL, CDCl3, 0, 16.522)
##AUDIT TRAIL= $$ (NUMBER, WHEN, WHO, WHERE, WHAT)
$$ ##TITLE= Audit trail, XWIN-NMR		Version 3.5
$$ ##JCAMPDX= 5.01
$$ ##ORIGIN= Bruker BioSpin GmbH
$$ ##OWNER= NMR
$$ C:\u/data/dgb/nmr/ADRS/10940/pdata/1/auditp.txt
$$ ##AUDIT TRAIL=  $$ (NUMBER, WHEN, WHO, WHERE, WHAT)
(   1,<2005-10-18 11:42:28.19 +100>,<MAYBRIDGE\NMR>,<NMR_250MHZ>,
      <created by zg, POWCHK disabled, PULCHK disabled
       configuration hash MD5:
       62 19 C7 07 E1 42 D1 B7 37 6C 3D D0 77 39 F9 E6
       data hash MD5: 64K
       DC EA E3 44 F2 58 2C 71 C7 FB D9 4D 29 2E DE 04>)
(   2,<2005-10-18 11:42:44.75 +100>,<MAYBRIDGE\NMR>,<NMR_250MHZ>,
      <Start of raw data processing
       ef LB = 0.3 FT_mod = 6 PKNL = 1 SI = 32K 
       data hash MD5: 32K
       D4 68 BC 64 96 20 68 10 4F 8A D0 CB 1F 9A 6B 9B>)
(   3,<2005-10-18 11:42:47.82 +100>,<MAYBRIDGE\NMR>,<NMR_250MHZ>,
      <apk 
       data hash MD5: 32K
       22 49 CD D0 F1 06 80 0A 40 E6 22 89 73 8F 6A 62>)
(   4,<2005-10-18 11:42:49.38 +100>,<MAYBRIDGE\NMR>,<NMR_250MHZ>,
      <abs ABSG = 5 
       data hash MD5: 32K
       76 A1 DE 4C 6D 81 26 BB 54 21 7C 91 32 A8 CD 2F>)
$$ ##END=
$$ 
$$ hash MD5
$$ 3F F2 16 AC 02 08 04 06 9B 63 F1 E4 70 39 AB 49
##$RELAX= 
##$RELAX= 
##$RELAX= 
##$RELAX= 
##$RELAX= 
##$RELAX= 
##$RELAX= 
$$ Bruker specific parameters
$$ --------------------------
##$DU= <C:\u>
##$EXPNO= 10940
##$NAME= <ADRS>
##$PROCNO= 1
##$TYPE= <nmr>
##$USER= <dgb>
##$AMP= (0..31)
100 100 100 100 100 100 100 100 100 100 100 100 100 100 100 100 100 100 
100 100 100 100 100 100 100 100 100 100 100 100 100 100 
##$AQSEQ= 0
##$AQ_mod= 3
##$AUNM= <au_zg>
##$AUTOPOS= <15 >
##$BF1= 250.13
##$BF2= 250.13
##$BF3= 250.13
##$BF4= 250.13
##$BF5= 500.13
##$BF6= 500.13
##$BF7= 500.13
##$BF8= 500.13
##$BYTORDA= 1
##$CFDGTYP= 0
##$CFRGTYP= 5
##$CHEMSTR= <none>
##$CNST= (0..31)
1 1 145 1 1 1 1 1 1 1 1 1 1 1 1 1 1 1 1 1 1 1 1 1 1 1 1 1 1 1 1 1 
##$CPDPRG= <>
##$CPDPRG1= <>
##$CPDPRG2= <>
##$CPDPRG3= <>
##$CPDPRG4= <mlev>
##$CPDPRG5= <mlev>
##$CPDPRG6= <mlev>
##$CPDPRG7= <mlev>
##$CPDPRG8= <mlev>
##$CPDPRGB= <>
##$CPDPRGT= <>
##$D= (0..31)
0 1 0 0 0 0 0 0 0 0.06 0 0 0 0 0 0 0.0002 0 0 0 0 0 0 0 0 0 0 0 0 0 0 
0 
##$DATE= 1129632146
##$DBL= (0..7)
120 120 120 120 120 120 120 120 
##$DBP= (0..7)
150 150 150 150 150 150 150 150 
##$DBP07= 0
##$DBPNAM0= <>
##$DBPNAM1= <>
$$ [...]
##$SUBNAM7= <"">
##$SUBNAM8= <"">
##$SUBNAM9= <"">
##$SW= 20.6930455092707
##$SWIBOX= (0..15)
0 0 3 0 0 0 0 0 0 0 0 0 0 0 0 0 
##$SW_h= 5175.983436853
##$TD= 65536
##$TD0= 1
##$TE= 294.16
##$TE2= 300
##$TE3= 300
##$TEG= 300
##$TL= (0..7)
0 120 120 120 120 120 120 120 
##$TP= (0..7)
150 150 150 150 150 150 150 150 
##$TP07= 0
##$TPNAME0= <>
##$TPNAME1= <>
##$TPNAME2= <>
##$TPNAME3= <>
##$TPNAME4= <>
##$TPNAME5= <>
##$TPNAME6= <>
##$TPNAME7= <>
##$TPOAL= (0..7)
0.5 0.5 0.5 0.5 0.5 0.5 0.5 0.5 
##$TPOFFS= (0..7)
0 0 0 0 0 0 0 0 
##$TUNHIN= 0
##$TUNHOUT= 0
##$TUNXOUT= 0
##$USERA1= <user>
##$USERA2= <user>
##$USERA3= <user>
##$USERA4= <user>
##$USERA5= <user>
##$V9= 5
##$VALIST= <valist>
##$VCLIST= <CCCCCCCCCCCCCCC>
##$VD= 0
##$VDLIST= <DDDDDDDDDDDDDDD>
##$VPLIST= <PPPPPPPPPPPPPPP>
##$VTLIST= <TTTTTTTTTTTTTTT>
##$WBST= 1024
##$WBSW= 4
##$XGAIN= (0..3)
0 0 0 0 
##$XL= 0
##$YL= 0
##$YMAX_a= 290015
##$YMIN_a= -317342
##$ZGOPTNS= <>
##$ZL1= 120
##$ZL2= 120
##$ZL3= 120
##$ZL4= 120
##$ABSF1= 16.522
##$ABSF2= -4.171173
##$ABSG= 5
##$ABSL= 3
##$ALPHA= 0
##$AQORDER= 0
##$ASSFAC= 0
##$ASSFACI= 0
##$ASSFACX= 0
##$ASSWID= 0
##$AUNMP= <proc_1d>
##$AZFE= 0.1
##$AZFW= 0.1
##$BCFW= 0
##$BC_mod= 0
##$BYTORDP= 0
##$COROFFS= 0
##$CY= 12.5
##$DATMOD= 1
##$DC= 0
##$DFILT= <>
##$DTYPP= 0
##$F1P= 14.0000005364418
##$F2P= -0.99999901652339
##$FCOR= 0.5
##$FTSIZE= 32768
##$FT_mod= 6
##$GAMMA= 0
##$GB= 0
##$INTBC= 1
##$INTSCL= 1
##$ISEN= 128
##$LB= 0.3
##$LEV0= 0
##$LPBIN= 0
##$MAXI= 10000
##$MC2= 0
##$MEAN= 0
##$ME_mod= 0
##$MI= 0
##$NCOEF= 0
##$NC_proc= -5
##$NLEV= 6
##$NOISF1= 0
##$NOISF2= 0
##$NSP= 0
##$NTH_PI= 0
##$NZP= 0
##$OFFSET= 16.522
##$PC= 1
##$PHC0= -64.80465
##$PHC1= 9.102227
##$PH_mod= 1
##$PKNL= yes
##$PPARMOD= 0
##$PSCAL= 4
##$PSIGN= 0
##$REVERSE= no
##$SF= 250.13
##$SI= 32768
##$SIGF1= 0
##$SIGF2= 0
##$SINO= 400
##$SIOLD= 32768
##$SREGLST= <1H.CDCl3>
##$SSB= 0
##$STSI= 32768
##$STSR= 0
##$SW_p= 5175.98343685301
##$SYMM= 0
##$S_DEV= 0
##$TDeff= 65536
##$TDoff= 0
##$TI= <Analysis number 999999
Compound Code 99
Book Reference 9
Project Code 9>
##$TILT= no
##$TM1= 0
##$TM2= 0
##$TOPLEV= 0
##$USERP1= <user>
##$USERP2= <user>
##$USERP3= <user>
##$USERP4= <user>
##$USERP5= <user>
##$WDW= 1
##$XDIM= 32768
##$YMAX_p= 485839912
##$YMIN_p= -817564
$$ End of Bruker specific parameters
$$ ---------------------------------
##NTUPLES= NMR SPECTRUM
##VAR_NAME=  FREQUENCY,     SPECTRUM/REAL,   SPECTRUM/IMAG
##SYMBOL=    X,             R,               I
##VAR_TYPE=  INDEPENDENT,   DEPENDENT,       DEPENDENT
##VAR_FORM=  AFFN,          ASDF,            ASDF
##VAR_DIM=   32768,         32768,           32768
##UNITS=     HZ,            ARBITRARY UNITS, ARBITRARY UNITS
##FACTOR=    0.157963299565203, 1,           1
##FIRST=     4132.6476996994, 0,             0
##LAST=      -1043.33573715361, 0,           0
##MIN=       -1043.33573715361, -817564,     0
##MAX=       4132.6476996994, 485839912,     0
$$ Real data points
##PAGE= N=1
##DATA TABLE= (X++(R..R)), XYDATA
$$ [...]
14910a47490j2985N0562L7301K39230K59559l3949j74641j16271m3348Q2626R4159
$$ -147490 -160475 -109913 -72612 166618 426177 392228 217587 101316 57968 140594 234753
14899B34753j35107p190J9646j45624l9607p412J56088K58238p028m3324m550
$$ 234753 99646 92456 112102 -33522 -73129 -80541 75547 333785 326757 283433 278883
14888B78883j08288p6072p9717P0044J79693J28140j28249j93756j34090L8791
$$ 278883 170595 94523 14806 84850 264543 392683 264434 70678 -63412 -24621
14878b4621J87527M0774k44568j86449P4528J57482J5816J21491K2257k47710
$$ -24621 162906 203680 -40888 -227337 -152809 4673 20489 141980 164237 -83473
14868h3473J3391k0608o412j74k6662J54017K10940m9686j73443N3130M996J15508
$$ -83473 -70082 -90690 -97102 -97276 -123938 30079 241019 191333 17890 71020 76016 191524
14856A91524j19633r6449J24744O6890N8439L0001k13906k02931j27493J53937
$$ 191524 71891 -24558 100186 167076 225515 255516 41610 -161321 -288814 -134877
14846a34877K43911J778n3443K40186J53858M973l33770l18515j17223j0796M972
$$ -134877 109034 110812 57369 297555 451413 456386 122616 -195899 -313122 -323918 -318946
14835c18946l5636O9498J89249J63349L1741j2412q6002r3116J61469P8923n584
$$ -318946 -354582 -285084 -95835 67514 99255 86843 841 -92275 69194 148117 142533
14824A42533p0555J0496r0220p4497Q0353l23186J22991J34777J05833j28659
$$ 142533 71978 82474 -7746 -82243 -1890 -325076 -202085 -67308 38525 -90134
14814i0134j197o5346l5926M8031N2631M8522L2509n7861M748j85721j07007J77281
$$ -90134 -91331 -156677 -192603 -144572 -91941 -43419 -10910 -68771 -64023 -249744 -356751 -179470
14802a79470L12997L4454q7481J2216j4885R2685J54773M9255l6220j41920k28024
$$ -179470 133527 167981 80500 92716 77831 170516 325289 374544 338324 196404 -31620
14791c1620j39147J00803m7769l0686J91242K01365k0687P2522o7051l69995j88532
$$ -31620 -170767 -69964 -117733 -148419 42823 244188 223501 296023 228972 -141023 -329555
14780c29555J67236o9789j93322O8218O3272J10007r0917K0997O6373k8550J8656
$$ -329555 -162319 -232108 -425430 -357212 -293940 -183933 -274850 -253853 -187480 -216030 -197374
14769a97374R3010J52619R5140j47694K5022P0880o2074K1011Q4659j20581j43463
$$ -197374 -104364 48255 143395 -4299 20723 91603 29529 50540 135199 14618 -128845
14758a28845p3608J43379R1359n0975R0052o1260j32871j0856r8882l8320Q4703
$$ -128845 -202453 -59074 32285 -18690 71362 10102 -122769 -133625 -232507 -270827 -186124
14747a86124O9270J64163M6612j22897r2288j77793m7951R3068J01490j24690
$$ -186124 -116854 47309 93921 -28976 -121264 -299057 -347008 -253940 -152450 -277140
14737b77140j28140J02346k9173J11973J16548K05255o52J16369R5483L4156j48116
$$ -277140 -405280 -302934 -332107 -220134 -103586 101669 101017 217386 312869 347025 198909
14726A98909J42599J16119j23966M2147k28955j74054J34474L5193o619l3668
$$ 198909 341508 457627 333661 375808 146853 -27201 107273 142466 135847 102179
14716A02179J0787K1720j27535j59387j72468J3964j21398R7143J57441j34238
$$ 102179 112966 134686 7151 -152236 -324704 -310740 -432138 -334995 -177554 -311792
14706c11792j57911J1328J59412j6572n6353J17706J84801Q2432Q5627R0333J05221
$$ -311792 -469703 -458375 -298963 -315535 -371888 -254182 -69381 13051 98678 189011 294232
14695B94232J2512J5387L8188j14556o5910J73972r219j99020j8938M6521N0424
$$ 294232 306744 322131 360319 245763 179853 353825 344606 145586 126648 173169 223593
14684B23593k3277J3987j29178P2887O1687j07404M1253k9697Q3012k08011r1159
$$ 223593 200316 214303 85125 158012 219699 112295 153548 123851 206863 -1148 -92307
14673i2307k7043J62966J30667j25075j62056R8907O8967l1909J43910j6054m4821
$$ -92307 -119350 43616 174283 49208 -112848 -13941 55026 23117 167027 150973 106152
14662A06152J56247J62485j25126k30766j77037M6084K21145P3789k00211k32499
$$ 106152 262399 424884 299758 68992 -108045 -61961 159184 232973 32762 -199737
14652a99737n2684J7665m2866k9111J55674J66390J05400m9046o2630R8511K8797
$$ -199737 -252421 -234756 -277622 -306733 -151059 15331 120731 71685 9055 107566 136363
14641A36363k2482j51765p1966o0725j18611K81161j9777j44502m7407R2702K7485
$$ 136363 113881 -37884 -109850 -170575 -289186 -8025 -27802 -172304 -219711 -127009 -99524
14630i9524J42228L5808n5129N5821n7442J01928r5426K8357k09860o1681k9989
$$ -99524 42704 78512 23383 79204 21762 123690 28264 56621 -153239 -214920 -244909
14619b44909j16777k07586J38308M42676m1060K69m1640n2606j9951R6472j2732
$$ -244909 -361686 -569272 -430964 11712 -29348 -29079 -70719 -123325 -143276 -46804 -59536
14608e9536m452O743m0622J35364l7000n6790K34739l7305l41613P154J68510
$$ -59536 -63988 -57245 -97867 37497 497 -56293 178446 141141 -200472 -193318 -24808
14597b4808r6756P1520M6312k4734n8218Q0223K8928k6895K7220k7782k54231
$$ -24808 -121564 -50044 -3732 -28466 -86684 -6461 22467 -4428 22792 -4990 -259221
14586b59221l0124J25726K21426j13986k28392M8048j22154J47332J00687R8623
$$ -259221 -289345 -163619 57807 -56179 -284571 -236523 -358677 -211345 -110658 -12035
14576a2035n6977J03995Q3295Q0052l1008l4555j75117j0918J96412Q7098m6561
$$ -12035 -69012 34983 118278 198330 167322 132767 -42350 -53268 143144 230242 183681
14565A83681j68683j2408n146M930k3151m8997P2162M9316N5156J39592l3366
$$ 183681 14998 2590 -2556 2374 -20777 -69774 2388 51704 106860 246452 213086
14554B13086r6824n42n6899K46089o2379l07050j85004K7281P0791o443J79383
$$ 213086 116262 115720 58821 304910 242531 -64519 -249523 -222242 -151451 -157894 21489
14543B1489n0199n1948J2186q2856P6921o0386j15789j67811m7086P0280K68289
$$ 21489 -28710 -80658 -68472 -151328 -74407 -134793 -250582 -418393 -465479 -395199 -126910
14532a26910J0892j03174p458K16756J97972N35O7821J47497k22824k12563J06980
$$ -126910 -116018 -219192 -226650 -9894 188078 188613 256434 403931 181107 -31456 75524
14521G5524K9091M9828k55054j36244M3776J16016K3402N7036M3790k18994j29277
$$ 75524 104615 154443 -100611 -236855 -193079 -77063 -53661 3375 47165 -171829 -301106
14510c01106J22573K27496m7545L4274Q1636k44573k5969L01712J07156J94450
$$ -301106 -178533 48963 1418 35692 117328 -127245 -153214 148498 255654 450104
14500D50104k2804l7423N6876l35080o1835N9664o4870J8415P6449L19767K03629
$$ 450104 427300 389877 446753 111673 49838 109502 44632 63047 139496 459263 662892
14489F62892P7245k90183j90207k8869J1422Q6030j10184j65072j10982Q831n745
$$ 662892 740137 449954 259747 230878 242300 328330 218146 53074 -57908 -49077 -54822
14478e4822O6776p6494j72139K3088P6020Q8218K88335K1847K5919J3389M4571
$$ -54822 11954 -64540 -236679 -213591 -137571 -49353 238982 260829 286748 300137 344708
14467C44708j41572K4342j87018j50648L52277J75362J32833j95342J4107J7731
$$ 344708 203136 227478 40460 -110188 242089 417451 550284 354942 369049 386780
14457C86780l4391Q3803k7984j30900o750q5488o7249j05082j74887Q0301J49022
$$ 386780 352389 436192 408208 277308 270558 185070 117821 12739 -162148 -81847 67175
14446F7175J35367p8284p1743k29572p6042K47174J34680O178m067M7616n4924
$$ 67175 202542 124258 52515 -177057 -253099 -5925 128755 134933 130866 178482 123558
14435A23558k6058j57848n8723O1592P8799N2048p6057o0419j6098L2288p8146
$$ 123558 97500 -60348 -119071 -57479 21320 73368 -2689 -63108 -79206 -46918 -125064
14424a25064Q8968p5633j7674J42045o0756j40674L8081J55826j2285r7633J18824
$$ -125064 -36096 -111729 -129403 12642 -48114 -188788 -150707 5119 -7166 -104799 14025
14413A4025R6875N7090j46502j4439M5512O9360p297j22672M4168k1574K1181
$$ 14025 110900 167990 21488 7049 52561 121921 114624 -8048 36120 14546 35727
14402C5727k9220j09432M7614J8048J31612j75863M5513R6643J17975J73630j93815
$$ 35727 6507 -102925 -55311 -37263 94349 -81514 -36001 60642 178617 352247 158432
14391A58432J1344o317j12864J13943j75925R4553n3369p4744K8066N5448k19587
$$ 158432 169776 163459 50595 164538 -11387 83166 29797 -44947 -16881 38567 -181020
14380a81020j04422K48431J84475j0433j04489j41729k11526j2561J37666M1817
$$ -181020 -285442 -37011 147464 137031 32542 -109187 -320713 -333274 -195608 -153791
14370a53791R242J02193K10493k3751O2852J93201R523l11348k45897P2758R5030
$$ -153791 -144549 -42356 168137 144386 207238 400439 409962 98614 -147283 -74525 20505
14359B0505J80107p7835p3973m0675K678j01706j07839P6135J65369Q6149p5454
$$ 20505 200612 122777 48804 8129 10807 -90899 -198738 -122603 42766 128915 53461
14348E3461M515R4869j44471o5482K04679J34741M5824k8806P4165m03054l08971
$$ 53461 57976 152845 8374 -57108 147571 282312 328136 299330 373495 -29559 -338530
14337c38530K55215J97390q4098K8957N2803J02349L9702r0557k05825q6466M9502
$$ -338530 -83315 114075 29977 58934 111737 214086 253788 163231 -42594 -129060 -79558
14326g9558R2776o5226r0102j05709r5074O6307K18613k8371k1015N559r4232
$$ -79558 13218 -52008 -142110 -247819 -342893 -276586 -57973 -86344 -107359 -101800 -196032
14315a96032P9375j02335J15509K23128j12911j34140o0293J29409j8058j05712
$$ -196032 -116657 -218992 -103483 119645 6734 -127406 -187699 -58290 -76348 -182060
14305a82060J70729J08512q6873k3298k9438n1681r787J6741K90841j67338J7410
$$ -182060 -11331 97181 10308 -12990 -42428 -94109 -103896 -87155 203686 36348 53758
14294E3758J7605j36301K27163Q7029j87821j7153J07154L8948J54193R196j63447
$$ 53758 71363 -64938 162225 249254 61433 44280 151434 190382 344575 353771 190324
14283A90324j32590m6001L5573r6473O0711J70355q0396n8430Q5712O4574k7534
$$ 190324 57734 11733 47306 -49167 11544 181899 101503 43073 128785 193359 165825
14272A65825j43437n6128o4588J37721J56025n6386k25627J8658N8997K2664n918
$$ 165825 22388 -33740 -98328 39393 195418 139032 -86595 -67937 -8940 13724 7806
14261G806M9592M239O2977N7371j06151N2355M3519j35536j56814o7679M0443
$$ 7806 57398 61637 124614 181985 75834 128189 171708 36172 -120642 -188321 -147878
14250a47878J7245M3228J2281R1359k9190j0943M7456k27659n050J3420P7535
$$ -147878 -130633 -87405 -75124 16235 -12955 -23898 23558 -204101 -209151 -195731 -118196
14239a18196Q4329m60r4946l5042j08196P0298J54874q9492J08797L51381J46581
$$ -118196 -33867 -34327 -129273 -164315 -272511 -202213 -47339 -136831 -28034 323347 469928
14228D69928j03235j87458q2180j41405j23379O3076j32466p9513j4054j38914
$$ 469928 366693 179235 97055 -44350 -167729 -104653 -237119 -316632 -330686 -469600
14218d69600j22461J70263P0210O0972J78635K29070K36439Q9157L1452q0586
$$ -469600 -592061 -421798 -351588 -290616 -111981 117089 353528 442685 474137 393551
14208C93551j39033N857k9381o7515j31991j7336k49264j79935J29162K30423
$$ 393551 254518 260375 230994 163479 31488 14152 -235112 -415047 -285885 -55462
14198e5462J74040K7824j29752j65242j96471M6091M6324P0176R2153J42591N5439
$$ -55462 118578 146402 16650 -148592 -345063 -298972 -252648 -182472 -90319 52272 107711
14187A07711m8823o8027j14546l0091r4434j4202l1356j08352J03445K58210Q3593
$$ 107711 58888 -9139 -123685 -153776 -248210 -262412 -293768 -402120 -298675 -40465 43128
14176D3128k71327l52624n4822O2594L00807L55597P7539k31188j99961k2254
$$ 43128 -228199 -580823 -635645 -573051 -272244 83353 160892 -70296 -270257 -292511
14166b92511J31833n2033J10336J1244J15589N6738J98500j4507q7216j87572
$$ -292511 -160678 -212711 -102375 -91131 24458 81196 279696 265189 177973 -9599
14156i599n6592Q7911M1086J07446k2881R0254j79448k28386m9171Q0643J28379
$$ -9599 -66191 21720 62806 170252 147371 237625 58177 -170209 -219380 -138737 -10358
14145a0358K7951m4129q9514l3550j79163L0448J70695J35304j20449n4213j2641
$$ -10358 17593 -26536 -116050 -149600 -328763 -298315 -127620 7684 -112765 -166978 -179619
14134a79619r5938j40629J74737J33438o2732j3793K1773L7626l2150K36784J74629
$$ -179619 -275557 -416186 -241449 -108011 -170743 -184536 -162763 -125137 -157287 79497 254126
14123B54126P147K03294J09120j85207q2965j02411j9058M4824J8670k20184j62268
$$ 254126 261273 464567 573687 388480 305515 203104 184046 228870 247540 27356 -134912
14112a34912k2424P3678O9453o8836N4524J20814M6267j00523N0024m1919q35
$$ -134912 -157336 -83658 -14205 -83041 -28517 92297 138564 38041 88065 46146 45311
14101D5311j26146J15067K83577N1790J11032j96420l12370j2624K8756o4795
$$ 45311 -80835 34232 317809 369599 480631 284211 -28159 -40783 -12027 -76822
14091g6822J18193K01191M0034r9707K54l4529k5328j26495Q0566p3759j06509
$$ -76822 41371 242562 282596 182889 183143 148614 123286 -3209 77357 3598 -102911
14080a02911K65181L2313p6875m2607N6004N3898j06048j40053m1155K6223n6419
$$ -102911 162270 194583 117708 75101 131105 185003 78955 -61098 -102253 -76030 -132449
14069a32449n5159J0104p5233R1762J31910J23870n7922J2936N8563j39213j91993
$$ -132449 -187608 -177504 -252737 -160975 -29065 94805 36883 49819 108382 -30831 -222824
14058b22824r9772K541j36993L72682J13450j08561K2112m3100L0090J39360j49304
$$ -222824 -322596 -320055 -457048 -84366 29084 -79477 -57365 -100465 -70375 68985 -80319
14047h0319p4720Q1677K51834K1166k74243l01435j88257R7564J94465J48795
$$ -80319 -155039 -73362 178472 199638 -74605 -376040 -564297 -466733 -272268 -123473
14037a23473J95617j52892m9475m8714q138j50809n82J3595p391Q7865O8617L4106
$$ -123473 72144 -80748 -130223 -178937 -187075 -337884 -338466 -324871 -332262 -244397 -175780 -141674
14025a41674j16890j99186J03177L11765K53703R4341Q895j47769p2570j69465
$$ -141674 -258564 -457750 -354573 -42808 210895 305236 314131 166362 93792 -75673
14015g5673o3682K24118J40215q7847k75560j37904J97328K6090p2448L4681J98310
$$ -75673 -139355 84763 224978 137131 -138429 -276333 -79005 -52915 -125363 -90682 107628
14004A07628p5206J17425K73323n5521k36389r8061L6817O1110L5465l8686n1311
$$ 107628 32422 149847 423170 367649 131260 33199 70016 131126 166591 127905 76594
13993G6594M0553J58227J21505K12681j44541j99210N1601M9867J18o1586l64590
$$ 76594 117147 275374 396879 609560 465019 265809 317410 367277 367395 305809 -58781
13982e8781j75062J09101Q8969j17544L7809j9366J4623j57693J97577p024J30181
$$ -58781 -233843 -124742 -35773 -153317 -115508 -134874 -120251 -277944 -80367 -87391 42790
13971D2790J10486Q166j13375k46731p8746J64526J57346j7784J61644q0586l23156
$$ 42790 153276 161442 48067 -198664 -277410 -112884 44462 26678 188322 107736 -215420
13960b15420N13M4309O4599J1704J23686J8883N8774p7274j70670r1805M8326
$$ -215420 -214907 -170598 -105999 -94295 29391 48274 107048 29774 -140896 -232701 -184375
13949a84375R6756j74022l2061J7031p8296j07979K2027L15904K26069P6343j39883
$$ -184375 -87619 -261641 -293702 -276671 -354967 -462946 -440919 -125015 101054 177397 37514
13938C7514j01227R8750L58707P4967k44023k05200j83494j1065m6096Q718O3126
$$ 37514 -63713 35037 393744 468711 224688 19488 -164006 -175071 -221167 -212449 -149323
13927a49323J9540j35642J0370R9343N8773P8185j06874n7791j78531J84608P8542
$$ -149323 -129783 -265425 -255055 -155712 -96939 -18754 -125628 -183419 -361950 -177342 -98800
13916i8800k6731j07749k2722J41801J97255R9549j24363M8391N2346j99758q0017
$$ -98800 -125531 -233280 -256002 -114201 83054 182603 58240 106631 158977 -40781 -120798
13905a20798J48079j04444O605k2151O5773n0580J26071j23481k91910N1383J17114
$$ -120798 27281 -77163 -70558 -92709 -26936 -77516 48555 -74926 -366836 -315453 -198339
13894a98339J06102K54288K8510j37577m1765K2576J98691k3819l29012p2704
$$ -198339 -92237 162051 190561 52984 11219 33795 232486 208667 -120345 -193049
13884a93049J24169l5457P3372R3641j56105j26783P1675M04076L2804j55007
$$ -193049 -68880 -104337 -30965 62676 -93429 -220212 -148537 255539 288343 133336
13874A33336j77151r0211M779J15004p5898j68146q400J02653J18562Q3863q6596
$$ 133336 -43815 -134026 -129247 -14243 -90141 -258287 -266687 -164034 -45472 38391 -48205
13863d8205j87149j49315k4214K04949N1832K24063N1356J9320j81685j96871
$$ -48205 -235354 -384669 -408883 -203934 -152102 71961 123317 142637 -39048 -235919
13853b35919M3386K00772K7076K5546j4286j3143L0736j51281j47635K4839J86659
$$ -235919 -192533 8239 35315 60861 46575 33432 64168 -87113 -234748 -209909 -23250
13842b3250l9949j11951K22245K18265j41780k19845l190P8879p7721N6116J65444
$$ -23250 -63199 -175150 47095 265360 123580 -96265 -99455 -20576 -98297 -42181 123263
13831A23263O9635j94458r6605P6220j13690j287M1056j21784M2564K37977P5670
$$ 123263 192898 -1560 -98165 -21945 -135635 -136922 -95866 -217650 -175086 62891 138561
13820A38561j70522j93925q9327M5698o6945N7004L3887J59261N8391K5098r8839
$$ 138561 -31961 -225886 -315213 -269515 -336460 -279456 -245569 -86308 -27917 -2819 -101658
13809a01658r9583Q4637p7307k6406m8187m642J23322l9365j17765K59365K8187
$$ -101658 -201241 -116604 -193911 -220317 -268504 -273146 -149824 -189189 -306954 -47589 -19402
13798a9402j76788j0440K24545N3638L9178R9357P5755n8309j48794N992J9669
$$ -19402 -196190 -206630 17915 71553 110731 210088 285843 227534 78740 84732 104401
13787A04401J2747n940k77225P2403k7265m9216R818K0910O3155o8495j39732
$$ 104401 117148 111208 -166017 -93614 -120879 -170095 -160277 -139367 -76212 -144707 -284439
13776b84439q0148j10600J56184Q5562J14734K03294j8769n830o6987K2224L9866
$$ -284439 -364587 -475187 -319003 -233441 -118707 84587 65818 59988 -6999 15225 55091
13765E5091R9347l5336p0101n6623J36862j95187Q7890P6721J0626J24384k6935
$$ 55091 154438 119102 49001 -7622 129240 -65947 21943 98664 109290 233674 206739
13754B06739j6043p2165r3110K05897m4802j18884J31862j29766k23152j65591
$$ 206739 190696 118531 25421 231318 186516 67632 199494 69728 -153424 -319015
13744c19015R1744N4260J49339k4324L5194J56952j5657P4003l5282p5185L8935
$$ -319015 -227271 -173011 -23672 -47996 -12802 144150 128493 202496 167214 92029 130964
13733A30964J17803j7213q0668j56098j52113k2922O2268O4183j75325n5135J24867
$$ 130964 248767 231554 150886 -5212 -157325 -180247 -117979 -53796 -229121 -284256 -159389
13722a59389K41009k31978n8935J75883K07370J46612l0348j51852k85364K1799
$$ -159389 81620 -150358 -209293 -33410 173960 320572 290224 138372 -146992 -125193
13712a25193K40006P2722L3144K192m9274n1002P6190P52q3358j35502p1617J2294
$$ -125193 114813 187535 220679 222871 173597 122595 198785 199537 116179 -19323 -90940 -78646
13700g8646r4113P5598J75377J12656j2055j07953m1123j30033J10212Q5059Q7672
$$ -78646 -172759 -97161 78216 190872 178817 70864 29741 -100292 9920 94979 182651
13689A82651j33124j74820o6609q4399j5354N3029L4994P9893K01199k4870l8790
$$ 182651 49527 -125293 -191902 -276301 -291655 -238626 -203632 -123739 77460 52590 13800
13678A3800J09889P1232j5988k73097j4025m6783K04529R5375j33389Q9331L4610
$$ 13800 123689 194921 178933 -94164 -108189 -154972 49557 144932 11543 100874 135484
13667A35484j51600J0040Q95l6588r0998O40J09059K6029L6437j98581j35539
$$ 135484 -16116 -6076 -5181 -41769 -132767 -132127 -23068 2961 39398 -159183 -294722
13656b94722J25137K44254K82423o7402k93701k74247Q6714J57585n2201j4664
$$ -294722 -169585 74669 357092 289690 -4011 -278258 -191544 -33959 -86160 -100824
13646a00824J6971K7201M7509l3610K23648J11336J49603r773j09599r1106j8155
$$ -100824 -83853 -56652 -9143 -42753 180895 292231 441834 432061 322462 231356 213201
13635B13201P926m0918k6713o945m758J40312k9205j07406m1218q5755j98399
$$ 213201 221127 180209 153496 146551 141793 282105 252900 145494 104276 18521 -179878
13624a79878m7651J11474r6040Q9698J22816p8914M7766p5644l6775M9057J66248
$$ -179878 -227529 -116055 -212095 -122397 419 -78495 -30729 -106373 -143148 -94091 72157
13613G2157o4981L3720P6070o5359r9196L6955J98121J80221r7506j31990n3626
$$ 72157 7176 40896 116966 51607 -47589 -10634 187487 367708 270202 138212 84586
13602H4586r9527P9666Q4484J08833l7594K5993n493p6256j06428j19413n1686
$$ 84586 -14941 64725 149209 258042 220448 246441 240948 164692 58264 -61149 -112835
13591a12835K8061N8174k7260Q5810J41202P3639J95689k48791j24761l3757k9946
$$ -112835 -84774 -26600 -53860 31950 173152 246791 442480 193689 68928 35171 5225
13580E225j61625K4498J45848K37528m7580j27747j6351j713K56014j45277k44892
$$ 5225 -156400 -131902 13946 251474 203894 76147 59796 58083 314097 168820 -76072
13569g6072N4669L2837j24597L3606l8188J14546J59152p7885j65767K7M9538
$$ -76072 -21403 11434 -113163 -79557 -117745 -3199 155953 78068 -87699 -87672 -38134
13558c8134N0268R2420O0989j25136l8634J5642q7060m1085K02451J46603q063
$$ -38134 12134 104554 165543 40407 1773 17415 -69645 -110730 91721 238324 230261
13547B30261j05365j44146J95605p5352j29044p5590q8212K13575n117M3317R841
$$ 230261 124896 -19250 176355 101003 -28041 -103631 -191843 21732 16615 59932 69773
13536F9773o5746O3610J30093q03l6072j43285j27795j06111L47392j05042P7760
$$ 69773 4027 67637 197730 196927 160855 17570 -110225 -216336 131056 26014 103774
13525A03774j7252R6484J13170n7332j53098q0476N272J37103j6897j12845k0098
$$ 103774 86522 183006 296176 238844 85746 5270 10542 147645 130748 17903 -2195
13514b195K4250L6153p2846q2713j28287J05984K00684k6400k7351k03715J04197
$$ -2195 22055 58208 -14638 -97351 -225638 -119654 81030 54630 27279 -176436 -72239
13503g2239K35908P3164k05057j48123O7222J7791K7160o4138p2390j07414K06163
$$ -72239 163669 236833 31776 -116347 -49125 -31334 -4174 -68312 -140702 -248116 -41953
13492d1953K05531M1383k43323j31904R4601J52369j33797J10595l6765j9360
$$ -41953 163578 204961 -38362 -170266 -75665 76704 -57093 53502 16737 -2623
13482b623r8908N9368q3313k12051k29978Q8848P8872R4136j4860L5659M7003
$$ -2623 -101531 -42163 -125476 -337527 -567505 -478657 -399785 -305649 -320509 -284850 -237847
13471b37847J06729j2634L4619L8689k10071K25043K53484l6204j51215l9524
$$ -237847 -131118 -143752 -109133 -70444 -280515 -55472 198012 161808 10593 -28931
13461b8931j41035J1835L19071m0116J1923N6480K7890k9470j67167j5387J02453
$$ -28931 -169966 -158131 160940 120824 132747 189227 217117 187647 20480 5093 107546
13450A07546j59772j80954J4184J82431P6145K8208j94362l8964Q9103J43688
$$ 107546 -52226 -233180 -218996 -36565 39580 67788 -126574 -165538 -76435 67253
13440F7253R2309J37091l4099k393j91602q1960J45253L5567p835l9745m3145
$$ 67253 159562 296653 262554 260161 68559 -13401 131852 167419 159584 119839 76694
13429G6694K47248k1724k31539r4038J0495N0681J35401j03331q5360J69372k8769
$$ 76694 323942 302218 70679 -23359 -12864 37817 173218 69887 -15473 153899 125130
13418A25130j66219j30438l9923J36078P5456j10133j56520Q6950J30138j16734
$$ 125130 -41089 -171527 -211450 -75372 84 -110049 -266569 -179619 -49481 -166215
13408a66215P3067K7543N7882J23114q0381j12027o5321J91953j43799o9388O00
$$ -166215 -93148 -65605 -7723 115391 35010 -77017 -142338 49615 -94184 -163572 -162972
13397a62972p8622j17501m3487n1940J41331N2709p5070o6008J10293L9786K78217
$$ -162972 -241594 -359095 -402582 -454522 -313191 -260482 -335552 -401560 -291267 -251481 26736
13386B6736J12761J991L4160J1738J1545j01183N1439p5694r9939p5091j1876
$$ 26736 139497 141488 175648 187386 198931 97748 149187 73493 -26446 -101537 -113413
13375a13413J06070J69690N5737j0321R9603p2750k4634p4384j46173J35734J81844
$$ -113413 -7343 162347 218084 207763 307366 234616 209982 135598 -10575 125159 307003
13364C07003J5847L1930P991o9378L9126n9101J73146m8971k2364K8205n6321
$$ 307003 322850 354780 362771 293393 332519 273418 446564 397593 375229 403434 347113
13353C47113r4485j87148j49179R781k3974j2753J56779j47803n9984J09176J32779
$$ 347113 252628 65480 -83699 -73918 -97892 -110645 46134 -101669 -161653 -52477 80302
13342H0302J36945k63360k85657K8255N463O5548J04470J21667P0652l3062K0932
$$ 80302 217247 -46113 -331770 -303515 -298052 -232504 -128034 -6367 64285 31223 52155
13331E2155L6485O9258j36922J74394l8188J23323m6366j11114r2778j90888J03834
$$ 52155 88640 157898 20976 195370 157182 280505 234139 123025 30247 -160641 -56807
13320e6807n072p2840Q2157j36253n4691P5789J8620j6925R7993M9389J5083J4433
$$ -56807 -61879 -134719 -52562 -188815 -243506 -167717 -149097 -166022 -68029 -18640 -3557 10876
13308A0876j1143O4122j90488k4159n2632j82668K2158O571K513N4281J11662
$$ 10876 -267 63855 -126633 -150792 -203424 -386092 -363934 -357363 -354850 -300569 -188907
13297a88907n2446K27284J25969p4841l73542K1640J86158j65007j1066J51737
$$ -188907 -241353 -14069 111900 37059 -336483 -314843 -128685 -293692 -304758 -153021
13287a53021l2793K0336k226o6086O6363J18557j61086k04371p181K18202J14548
$$ -153021 -185814 -165478 -167704 -233790 -167427 -48870 -209956 -414327 -421508 -203306 -88758
13276h8758o014R581K37744n5995j87109N8380J0217l649J52039j7560j8972J86008
$$ -88758 -94772 -85191 152553 96558 -90551 -32171 -21954 -25603 126436 108876 89904 275912
13264B75912j19738j64767n4533j06486j63666M7977L08911j2174j81179j36663
$$ 275912 156174 -8593 -63126 -169612 -333278 -285301 23610 11436 -169743 -306406
13254c06406n7011J02183J13766J15779r2897j03721J10717M2904j90158l4380
$$ -306406 -363417 -261234 -147468 -31689 -124586 -228307 -117590 -74686 -264844 -299224
13244b99224K00496P7013l2684n8157J0695l2670J43733J6998j12195j18747j2580
$$ -299224 -98728 -21715 -54399 -112556 -101861 -134531 9202 26200 -85995 -204742 -217322
13233b17322J04026K04805l8755M7575l0594j15506k87429j38090P6806Q3431
$$ -217322 -113296 91509 52754 100329 69735 -45771 -333200 -471290 -394484 -311053
13223c11053K10698O2742R8990K12185j03384j90413J33518K0804n7181R4183
$$ -311053 -100355 -37613 61377 273562 170178 -20235 113283 134087 76906 171089
13213A71089J26499Q0757l9247k45477k23806r5792J39448k5034K7999K48330
$$ 171089 297588 378345 339098 93621 -130185 -225977 -86529 -111563 -83564 164766
13203A64766J8471j33445K1718R2431j8035j43700j84792P5310M8616o2204r3047
$$ 164766 183237 49792 71510 163941 145906 2206 -182586 -107276 -58660 -120864 -213911
13192b13911j03519J93783J52146P3923O5557j7837r0866q7938K2916p9434k5735
$$ -213911 -317430 -123647 28499 102422 167979 150142 59276 -28662 -5746 -85180 -110915
13181a10915M373r7400k6578J24024K8769l1008J09642k40509J2749R8747j43727
$$ -110915 -106542 -203942 -230520 -106496 -77727 -108735 907 -239602 -226853 -128106 -271833
13170b71833j09078M08223L54675k61370l58408j52070K73654J57050R9897J10457
$$ -271833 -380911 27312 381987 120617 -237791 -389861 -116207 40843 140740 251197
13160B51197J67040m5535j32338K757j23200j76030l7354J22282O5335q1k4889
$$ 251197 418237 372702 240364 243121 119921 -56109 -93463 28819 94154 94073 69184
13149F9184j4918M0811O3018j89152j17270J10105j5486j55552J03240m2248J7924
$$ 69184 54266 95077 158095 -31057 -148327 -38222 -53708 -209260 -106020 -148268 -130344
13138a30344M9203K21435l3108j43450K41055m620l24376k48317j16230k03838
$$ -130344 -81141 140294 107186 -36264 204791 200171 -124205 -372522 -488752 -692590
13128f92590K05696J37142K8746K70025Q7593r5244O0039M1921j90725q8110K24510
$$ -692590 -486894 -349752 -321006 -50981 36612 -58632 1407 43328 -147397 -235507 -10997
13117a0997L4247j68493K2126j87970J34441J56540J82028J62856j92793r9187
$$ -10997 23250 -145243 -123117 -311087 -176646 -20106 161922 324778 131985 32798
13107C2798O1662J55045J50547J35397J3218k80055j45805P7454p9819n9721q4689
$$ 32798 94460 249505 400052 535449 548667 268612 122807 200261 120442 60721 -23968
13096b3968k59356j70142l776j48405R1304J38028O3622N9849K6931J62693j63744
$$ -23968 -283324 -453466 -457242 -605647 -514343 -376315 -312693 -252844 -225913 -63220 -226964
13085b26964j30056m9995L39956K49826P9470j15205k33266o673J83814q5510
$$ -226964 -357020 -407015 -67059 182767 262237 147032 -86234 -92907 90907 5397
13075E397J42636K09876j57048j77977Q3175J49244J2322l815Q3635o8917p0251
$$ 5397 148033 357909 200861 22884 106059 255303 267625 263810 347445 278528 208277
13064B08277j17802r0324l2234J45689O5167q8613j24308N6521L1333j97886J24742
$$ 208277 90475 151 -32083 113606 178773 90160 -34148 22373 53706 -144180 -19438
13053a9438J13312j62559k40331J61081K6140N6326R5697j16535q516k54946Q0194
$$ -19438 93874 -68685 -309016 -147935 -121795 -65469 30228 -86307 -94823 -349769 -269575
13042b69575R3704J5178J48051k2787l7714q6130R5252K4139j07133j35246p506
$$ -269575 -175871 -160693 -12642 -35429 -73143 -159273 -64021 -39882 -147015 -282261 -289767
13031b89767J0874K08507Q7760N2068j67877P0580j02425n3497J0404J28166M4602
$$ -289767 -278893 -70386 17374 69442 -98435 -27855 -130280 -183777 -173373 -45207 -605
13020f05n6143J6098k8367q2755J28138n2215j3292n1455L2217J41930q5660m8497
$$ -605 -56748 -40650 -69017 -151772 -23634 -75849 -89141 -140596 -108379 33551 -52109 -100606
13008a00606J65965j236q4032O1009P3467o4878m6490L1242Q3865J27163j46470
$$ -100606 65359 64123 -19909 41100 114567 49689 3199 34441 118306 245469 98999
12997I8999r1705j76939R478J25090J92038J11088j55086O349j14372k64146q0138
$$ 98999 7294 -169645 -160167 -35077 156961 268049 112963 119312 4940 -259206 -339344
12986c39344L8660J57706j27162j10113J67536J28623k2371k4403j55801Q1676
$$ -339344 -300684 -142978 -270140 -380253 -212717 -84094 -106465 -130868 -286669 -204993
12976b04993n6941q5448p8140K13806J28346j22916j38656Q8581K20083m5348
$$ -204993 -261934 -347382 -425522 -211716 -83370 -206286 -344942 -256361 -36278 -81626
12966h1626M806j41520K03212K38954k5680j39483q8252k9226j922j70269N3175
$$ -81626 -76820 -218340 -15128 223826 198146 58663 -29589 -58815 -60737 -231006 -177831
12955a77831r401K24602N0562l7664j38512k10600J39090J82550R864K8316p8145
$$ -177831 -187232 37370 87932 50268 -88244 -298844 -159754 22796 32660 60976 -17169
12944a7169n9983R1476J239j0093k5283j07002k7738q8163J34602K79957O9287
$$ -17169 -77152 14324 15563 5470 -19813 -126815 -154553 -242716 -108114 171843 241130
12933B41130K1668m6282j13508k18481J26338J52078O7508J56248M1206r3311
$$ 241130 262798 216516 103008 -115473 10865 162943 230451 386699 427905 334594
12923C34594r0519O1734j13484l5629k9980j30391o3837N7844j37171l4726J71373
$$ 334594 244075 305809 192325 156696 126716 -3675 -67512 -9668 -146839 -181565 -10192
12912a0192J51259l8738j15881M4988J00880m7249j25288R3210K54557O7543q9238
$$ -10192 141067 102329 -13552 31436 132316 85067 -40221 52989 307546 375089 285851
12901B85851q6370j67068o0631M6029p5479J3334R1372m8363j41666j07194Q6253
$$ 285851 199481 32413 -28218 17811 -57668 -44334 47038 -1325 -142991 -250185 -163932
12890a63932J6951n3589N9296O3686O8085o1949O3155M2266J36104p7291R730
$$ -163932 -146981 -200570 -141274 -77588 -9503 -71452 -8297 33969 170073 92782 102512
12879A02512J11466q5260k7271P0165M8480J9838k1820l1519N2667K8619q6129
$$ 102512 213978 128718 101447 171612 220092 239930 218110 186591 239258 267877 181748
12868A81748J01785l0792k6905k59785K0608J05978Q1064j62268j64195l5032
$$ 181748 283533 252741 225836 -33949 -13341 92637 173701 11433 -152762 -187794
12858a87794l962o203P3795O2006q366k7050j49028j1010K44836K01779j36697
$$ -187794 -191756 -197959 -124164 -62158 -70524 -97574 -246602 -257612 -12776 189003 52306
12847E2306j00383M9999J20859l6462j56789j8356q5340k1766m8349J56815J28329
$$ 52306 -48077 1922 122781 86319 -70470 -88826 -174166 -195932 -244281 -87466 40863
12836D0863q0147L6518J02737o7279O304P9112J03622l5063j11811k5599o8572
$$ 40863 -39284 -2766 99971 32692 38996 118108 221730 186667 74856 49257 -19315
12825a9315j39486j59106P0543K5615n7216L9649J71963R36p2801j23825Q0404
$$ -19315 -158801 -317907 -247364 -221749 -278965 -239316 -67353 -66417 -139218 -263043 -182639
12814a82639O2465J53741R4721j52625n6870m9553J00218J20847L5560L071j11263
$$ -182639 -120174 33567 128288 -24337 -81207 -130760 -30542 90305 125865 128936 17673
12803A7673P905J21558J33437R6456j48891r7856m8237q6324j22467Q4137J77830
$$ 17673 25578 147136 280573 377029 228138 130282 82045 -4279 -126746 -42609 135221
12792A35221L8815o5160n2818k21116p6675K47943K2803m5273m0528j13291M8080
$$ 135221 174036 108876 56058 -165058 -241733 6210 29013 -16260 -56788 -170079 -121999
12781a21999J7932K9857P769J43497k4852k29747m9292N4487L7636O6715l5882
$$ -121999 -104067 -74210 -66441 77056 52204 -177543 -226835 -172348 -134712 -67997 -103879
12770a03879o5691l30880j80171J03686K41254K67543k2340J72982Q4483O2049
$$ -103879 -169570 -500450 -680621 -576935 -335681 -68138 -90478 82504 166987 229036
12760B29036j53043Q0002k1278j98773N6241K29692p2125k22469j87130j34142
$$ 229036 75993 155995 134717 -64056 -7815 221877 149752 -72717 -259847 -393989
12750c93989K45317O838o353J60877M4060J17243J11687L6596j64325j41350r9762
$$ -393989 -148672 -141834 -148187 12690 56750 173993 285680 322276 157951 16601 -83161
12739h3161j17748N5197M4998J84140l8921q8098j66912j22711O5332L359K3888
$$ -83161 -200909 -145712 -100714 83426 44505 -43593 -210505 -333216 -267884 -264525 -240637
12728b40637L80708J3557j34388k2297k518j77333J06875J26751n7122n6979n7424
$$ -240637 140071 153628 19240 -3057 -5575 -182908 -76033 50718 -6404 -63383 -120807
12717a20807J96336P7446p5107m2676J1341r1794m809J31842O0804o8483j46816
$$ -120807 75529 152975 77868 35192 46533 -45261 -50070 81772 142576 74093 -72723
12706g2723J32673r010j56840j45600l5825q9683j08880j3829K88714J94195k65704
$$ -72723 59950 50940 -105900 -251500 -287325 -377008 -485888 -499717 -211003 -16808 -282512
12695b82512j60799m753J60077N2527K3529j99134n6993K5709K26891J09547P2587
$$ -282512 -443311 -448064 -287987 -235460 -211931 -411065 -468058 -442349 -215458 -105911 -33324
12684c3324R8808m0958n9819J33820q9633N828j0293o7249P4205K535n0035m6934
$$ -33324 65484 24526 -35293 98527 8894 14722 4429 -62820 11385 13920 -36115 -83049
12672h3049J13583J35406j15143k1794J92969J06563J45382M5108j4664l3137
$$ -83049 30534 165940 50797 29003 221972 328535 473917 519025 504361 471224
12662D71224j46203l7390q938k46731R1705P1594l2649j88135j16646K831O9367
$$ 471224 325021 287631 278693 31962 123667 195261 162612 -25523 -142169 -139338 -69971
12651f9971j28672j3564O5079O5398K54101K3717m8555k99612K9307K20016J91744
$$ -69971 -198643 -212207 -147128 -81730 172371 196088 147533 -152079 -122772 97244 288988
12640B88988r9153j50592p2913j34583N9554R5783J52047j52084O8404o749j50519
$$ 288988 189835 39243 -33670 -168253 -108699 -12916 139131 -12953 55451 48702 -101817
12629a01817K5650L3860l5483j10714J05845J22100J83300l2044r9353j89270
$$ -101817 -76167 -42307 -77790 -188504 -82659 39441 222741 190697 91344 -97926
12619i7926k08794J83883O6732L16413J52306j33934j80488L2846k7790N9957
$$ -97926 -306720 -122837 -56105 260308 412614 278680 98192 131038 103248 163205
12609A63205M3906j28110K0787k0830l49585L5019J60121o2010m8761o8943M1840
$$ 163205 207111 79001 99788 78958 -270627 -235608 -75487 -137497 -186258 -255201 -213361
12598b13361J52068j8403m0193l9815J27464P9751j69706j96210N1952O3090L6703
$$ -213361 -61293 -79696 -119889 -159704 -32240 47511 -122195 -318405 -266453 -203363 -166660
12587a66660L1815M1069M8967j16296n0453j13214J72502k5856J15172K03991
$$ -166660 -134845 -93776 -44809 -161105 -211558 -324772 -152270 -178126 -62954 141037
12577A41037R5473j30846J01358m3673n1699M5472o1913j06359P4536l1643Q0669
$$ 141037 236510 105664 207022 163349 111650 157122 95209 -11150 63386 31743 112412
12566A12412k56800k0040j81082Q7825K85565j85973k53204l8843J81457J69203
$$ 112412 -144388 -164428 -345510 -257685 27880 -158093 -411297 -450140 -268683 -99480
12556i9480j9319j92138q1540K02795K21950P2416l2236m3164K3179q8878n899
$$ -99480 -118799 -310937 -392477 -189682 32268 104684 72448 29284 52463 -36415 -42314
12545d2314j20252M8380k998J8996p7416o9149R4435j88780J74704J42431J60059
$$ -42314 -162566 -114186 -117184 -98188 -175604 -244753 -150318 -339098 -164394 -21963 138096
12534A38096M6940j55687l5062j47215K7950o4944K7299J79031p031l7608j39711
$$ 138096 185036 29349 -5713 -152928 -124978 -189922 -162623 16408 9377 -28231 -167942
12523a67942J04877J01747j67630k0315N7616J52756K3466K5515j42218j74585
$$ -167942 -63065 38682 -128948 -149263 -91647 61109 84575 110090 -32128 -206713
12513b06713J67110J27729m9033l5409r6232l8203Q1427q5333O4244p564L378
$$ -206713 -39603 88126 39093 3684 -92548 -130751 -49324 -134657 -70413 -77977 -74599
12502g4599K40225o1195j66997j015r3372p5253O2977J74544J06339K1630j12737
$$ -74599 165626 104431 -62566 -63581 -156953 -232206 -169229 5315 111654 133284 20547
12491B0547j69291J35895K98739L7339j36268Q6783j13888O7670O5507p6069j92074
$$ 20547 -148744 -12849 285890 323229 186961 273744 159856 227526 293033 216964 24890
12480B4890J7600l9594N8168K2049j03390O1342n849q5483L0632j6285j58880
$$ 24890 42490 2896 61064 83113 -20277 41065 35216 -50267 -19635 -35920 -194800
12469a94800K1072J14699j30700J61589J10998k15379q0293J03430J64486O2904
$$ -194800 -173728 -59029 -189729 -28140 82858 -132521 -212814 -109384 55102 118006
12459A18006m7320j28184j07176k06982Q7153J97620J85977P7865M7567k12095
$$ 118006 70686 -57498 -164674 -371656 -284503 -86883 99094 176959 224526 12431
12449A2431n4727o0920k2718P7703J17681Q3349j45010j28457R2258J99645r2482
$$ 12431 -42296 -103216 -125934 -48231 69450 152799 7789 -120668 -28410 171235 78753
12438G8753L4568J45352j6043j50552O6514Q8803r1407j81408o9129J32718P6999
$$ 78753 113321 258673 242630 92078 158592 247395 155988 -25420 -94549 38169 115168
12427A15168m5111j7994K21817q4352k55266j92612o4360J26102L8822N5638M92649
$$ 115168 70057 52063 273880 189528 -65738 -258350 -322710 -196608 -157786 -102148 390501
12416C90501l8871l35241o4917r0586k5004Q593K49202j46384N784J28357J35203
$$ 390501 351630 16389 -48528 -139114 -164118 -155525 93677 -52707 -46923 81434 216637
12405B16637R2175J12972M2659o289n3039L5347q9265j67939R9209l0725j01970
$$ 216637 308812 421784 464443 458154 405115 440462 351197 183258 282467 251742 149772
12394A49772j29770k74218j55951M1992K58399J64027k9845m6434K4448r5922
$$ 149772 20002 -254216 -410167 -368175 -109776 54251 24406 -22028 2420 -93502
12384i3502j86313J11129n4997j0847J34175J24418q595j56526J14667J50121
$$ -93502 -279815 -168686 -223683 -234530 -100355 24063 15468 -141058 -26391 123730
12374A23730k46226j98628J01733L14907m5944k10920j99134O6223M8623O5277
$$ 123730 -122496 -321124 -219391 95516 49572 -161348 -360482 -294259 -245636 -180359
12364a80359K34308Q5095K1199j59365J2423K9725j33080J00356J05118M1942
$$ -180359 53949 139044 160243 878 13301 43026 -90054 10302 115420 157362
12354A57362j86427k74624J77616L0365J1253m5972m4366M7538m3213K03646J54028
$$ 157362 -29065 -303689 -126073 -95708 -84455 -130427 -174793 -127255 -170468 33178 187206
12343A87206N7151j16067j15367r2547P8215J55880j38581j71264K1193R462Q7085
$$ 187206 244357 128290 12923 -79624 -1409 154471 15890 -155374 -134181 -124719 -37634
12332c7634j57599L4976J34957J62161k64939j10956J77016K48547r6752J6606
$$ -37634 -195233 -160257 -25300 136861 -128078 -239034 -62018 186529 89777 106383
12322A06383o0906J19907J05567k5050k1026q6704j91849l05358l5368J64109
$$ 106383 45477 165384 270951 245901 224875 138171 -53678 -359036 -394404 -230295
12312b30295P2761L17021N9645j46272O7160Q7022k15329j62728j83118P8950
$$ -230295 -157534 159487 219132 72860 140020 227042 11713 -151015 -334133 -255183
12302b55183k5756P6494k3936l4947Q5342K26129K8201o2153N2484J71187j83354
$$ -255183 -280939 -204445 -228381 -263328 -177986 48143 76344 14191 66675 237862 54508
12291E4508m6485j3041j51462k1220M3821L04193K25345o3779k4054k61239k38281
$$ 54508 8023 -5018 -156480 -177700 -133879 170314 395659 331880 307826 46587 -191694
12280a91694J97641n2389q530J91040l0443M8231J19624J24245J4667K14607P4343
$$ -191694 5947 -46442 -54972 136068 105625 153856 273480 397725 412392 626999 701342
12269G01342l60270j37475R696j33025j61157J34855J20505J35404j03858p3430
$$ 701342 341072 203597 213293 80268 -80889 53966 174471 309875 206017 132587
12259A32587Q7384l218n1623m4126q3284j33886L2017j14102p5523l652K29681
$$ 132587 219971 216753 165130 121004 37720 -96166 -64149 -178251 -253774 -257426 -27745
12248b7745J43912N3914N4529l18995r9996J40329J54737R875K4269O8771M0706
$$ -27745 116167 170081 224610 -94385 -194381 -54052 100685 110560 134829 203600 244306
12237B44306k23670L1701Q9465j67338m9718P1797q8986p4138N0439J14420K47860
$$ 244306 20636 52337 141802 -25536 -75254 -3457 -92443 -166581 -116142 -1722 246138
12226B46138J54794O0947N6134k59121j7431J9596P236J8083K39878N2606P2299
$$ 246138 400932 461879 518013 258892 241461 261057 268293 286376 526254 578860 651159
12215F51159N6326j1629J0790q0312O7811R5088K2993l12677K335J41120j5259
$$ 651159 707485 695856 706646 626334 694145 789233 812226 499549 501884 643004 627745
12204F27745J37648k18014n6788n2883r3974Q023k1257n7459N835J16298J7890
$$ 627745 765393 547379 490591 437708 343734 351757 330500 273041 278876 395174 413064
12193D13064j01287J20524P9220l5522j68836J6342K06832o8279j52709Q6821
$$ 413064 311777 432301 511521 475999 307163 323505 530337 462058 309349 396170
12183C96170J04343J80808J3780J6227p5126J78153J06550K29546L32178L22098
$$ 396170 500513 681321 695101 711328 636202 814355 920905 1150451 1482629 1804727
12173A804727N3859j45984k10830m1281J73066J0364j54228k84880l51876k44044
$$ 1804727 1858586 1712602 1501772 1460491 1633557 1643921 1489693 1204813 852937 608893
12163F08893j05523L554Q4378P1539n5999M7494j7395p3841K03427J84627j24220
$$ 608893 503370 506924 591302 662841 606842 654336 636941 563100 766527 951154 826934
12152H26934j73156r777k25667j31570j21862J66319j53345j53259K32439K89575
$$ 826934 653778 644001 418334 286764 164902 331221 177876 24617 257056 546631
12142E46631O1337k4883q4415l9293p758J1328L11017m1555k25166M6837J42956
$$ 546631 607968 583085 498670 459377 451619 462947 773964 732409 507243 554080 697036
12131F97036J6342O4969k7768l2880m9146J116K1328l2639k22877k27063j29284
$$ 697036 713378 778347 750579 717699 668553 669669 690997 658358 435481 208418 79134
12120G9134K3193J39694K75162L2250j5031L4632j94655j57331k5409j3108Q375
$$ 79134 102327 242021 517183 549433 534402 569034 374379 217048 191639 178531 186906
12109A86906j97296j70554Q6517J53123J06651o6986J18339J79218J42561K4684
$$ 186906 -10390 -180944 -94427 58696 165347 98361 216700 395918 538479 563163
12099E63163q3058j67298j65289J04393O4028N5532p056k2721J92673o3974n2729
$$ 563163 480105 312807 147518 251911 315939 371471 364415 341694 534367 470393 417664
12088D17664j35496k46171j18248J69251K17811j29996l8472j33691R8019j5106
$$ 417664 282168 35997 -82251 87000 304811 174815 136343 2652 100671 85565
12078H5565J6024k24632N3106j4519l3790O3877k175m542J35882J97346p9016
$$ 85565 101589 -123043 -69937 -84456 -118246 -54369 -56544 -61086 74796 272142 193126
12067A93126j77244O1048k6563O5972J6076M4537J1697o3404J7168O0901P5834
$$ 193126 15882 76930 50367 116339 132415 176952 188649 125245 142413 203314 279148
12056B79148R7660K6791p0966Q6715j97694q7557j0499j45311K53722J35188k98111
$$ 279148 376808 403599 332633 419348 221654 134097 123598 -21713 232009 367197 69086
12045F9086P6515J07922O0225o4186J35187M6426o526m624J67126R9569j27687
$$ 69086 145601 253523 313748 249562 384749 431175 424649 420025 587151 686720 559033
12034E59033j71999J21339J02437q3133K36698p8633k58486k3397q4623j42145
$$ 559033 387034 508373 610810 527677 764375 685742 427256 403859 319236 177091
12024A77091k0059r406K3148J47703J75628J09535k25481k70466L2123K13876
$$ 177091 157032 147626 170774 318477 494105 603640 378159 107693 139816 353692
12014C53692J40954j86057N9015o4096l0988j86709p6922K9743P3179J45266j27231
$$ 353692 494646 308589 367604 303508 272520 85811 8889 38632 111811 257077 129846
12003A29846k87454m5056K55148J52826Q7986L279O6826K12329R4548j91531k74102
$$ 129846 -157608 -202664 52484 205310 293296 296575 363401 575730 670278 478747 204645
11992B04645Q2363J14371J3342J64354J34281n2584P2375k2952j00143k41239
$$ 204645 287008 401379 414721 579075 713356 660772 733147 710195 610052 368813
11982C68813K9106o073N7165J51627M8867j44042J1694K672m9322M3586J3840
$$ 368813 397919 391846 449011 600638 649505 505463 517157 519829 470507 514093 527933
11971E27933J30906K9999n95n3242m0411Q042j22739R2090o9066n1278j89811
$$ 527933 658839 688838 688243 635001 594590 602632 479893 571983 502917 451639 261828
11960B61828k28342J73971J46183k3590q5866P7110N830m095O8541q5093k4939
$$ 261828 33486 207457 353640 330050 244184 321294 327124 323029 391570 306477 281538
11949B81538j08992j30645J27710K48013K8404k7759l7203O1779J7278J95155
$$ 281538 172546 41901 169611 417624 446028 418269 381066 442845 460123 655278
11939F55278m1580k05372q2621j72170J803N6930o924L9930N7129K47432N2532
$$ 655278 613698 408326 325705 153535 155338 212268 205344 245274 302403 549835 602367
11928F02367k25483m8692J51126L83369M8040j1207N6345j99302k54699l3490
$$ 602367 376884 328192 479318 862687 910727 899520 955865 756563 501864 468374
11918D68374L3323M6510j2326K51451J74403k3899k25572j20951j50354j3845
$$ 468374 501697 548207 535881 787332 961735 937836 712264 591313 440959 427114
11908D27114l8969J0444l7707l024m7757p5043K1441q181O1921j74869J87773
$$ 427114 388145 398589 360882 357858 310101 235058 256499 248318 310239 135370 323143
11897C23143K51022k5289n9192P3381R8979r7735j04361n8617j3083q8516J59078
$$ 323143 574165 548876 489684 563065 662044 564309 459948 401331 388248 299732 458810
11886D58810K44621O9925M8059R2957O9127j04055Q3948J51738p0326j89176p851
$$ 458810 703431 773356 821415 914372 983499 879444 963392 1115130 1044804 855628 847777
11875H47777K4383J22828J42903k1525l2898J93690P1777J54943J31754L3155
$$ 847777 872160 994988 1137891 1116366 1083468 1277158 1348935 1503878 1635632 1668787
11865A668787Q8575j21499o6301k6186Q7508j6238J19712p1339j3658M17959K43999
$$ 1668787 1757362 1635863 1569562 1543376 1630884 1614646 1734358 1663019 1649361 2067320 2311319
11854B311319K94548K62373L79244J79545j7323l30252M3651J44662q6962r1735
$$ 2311319 2605867 2868240 3247484 3427029 3409706 3079454 3123105 3267767 3180805 3089070
11844C089070k31234j35874J17302O4991J19089Q9799l655L7893J7416P3661N1977
$$ 3089070 2857836 2721962 2839264 2904255 3023344 3113143 3109488 3147381 3164797 3238458 3290435
11833C290435J79259K95849J56100j49354k50614l34643k16286J8877N4118K45761
$$ 3290435 3469694 3765543 3921643 3772289 3521675 3187032 2970746 2989623 3043741 3289502
11823C289502J65242O8185J0380j64649r2442K54079N46120M19062M84610L65823
$$ 3289502 3454744 3522929 3533309 3368660 3276218 3530297 4076417 4495479 4980089 5345912
11813E345912N42876P54180P58642M32950L33050M67245L66551M47397L57882
$$ 5345912 5888788 6642968 7401610 7834560 8167610 8634855 9001406 9448803 9806685
11804I806685P69908J026278J060593R68349J054717J197281J055122P67500O61259
$$ 9806685 10576593 11602871 12663464 13631813 14686530 15883811 16938933 17706433 18367692
11795A8367692N93502N87983P26163P26496R74236J176670J586227K219300K494283
$$ 18367692 18961194 19549177 20275340 21001836 21976072 23152742 24738969 26958269 29452552
11786B9452552K824500M192423N801333Q190460J1021467J3845708J6292984J7170358
$$ 29452552 32277052 36469475 42270808 50461268 61482735 75328443 91621427 108791785
11778A08791785J6120696J2109049M525666n089231j2840884j5509123j3203169
$$ 108791785 124912481 137021530 141547196 136457965 123617081 108107958 94904789
11771I4904789q650379m770872k058591k82470J023975K079241L100994M090235
$$ 94904789 86254410 81483538 79424947 79142477 80166452 82245693 85346687 89436922
11763H9436922M708647M375349L466115K074929M64406l41583k1451J114728K489385
$$ 89436922 94145569 98520918 101987033 104061962 104526368 104184785 104163334 105278062 107767447
11754A07767447L318706M268897M923728M453857L228973J323489m05722j252390
$$ 107767447 111086153 115355050 120278778 124732635 127961608 129285097 128879375 127626985
11746A27626985l70549J079414L357804O249960R781086J4387466K0457697K8118178
$$ 127626985 127256436 128335850 131693654 137943614 147724700 162112166 182569863 210688041
11738B10688041L5255449M0120007M0550522L3025803J4924246j1048767l4617861
$$ 210688041 245943490 286063497 326614019 359639822 374564068 363515301 328897440
11731C28897440m5798086m3143316l2880665k2632347j5076600r866378n884925
$$ 328897440 283099354 239956038 207075373 184443026 169366426 159500048 153615123
11724A53615123k924894l61512J345126J875013Q03737j509689m379896p044517
$$ 153615123 150690229 150328717 151673843 153548856 154352593 152842904 148463008 141418491
11716A41418491p788590o805834n183483l713378k351196j504211j186564j249975
$$ 141418491 133629901 126824067 121640584 117927206 115576010 114071799 112885235 111635260
11708A11635260k181420l384352m267602m494009l881797k467196j142667J63188
$$ 111635260 109453840 106069488 101801886 97307877 93426080 90958884 89816217 89979405
11700H9979405J774894L711514O191086R079271J2078831J3871803J3732784R629518
$$ 89979405 91754299 95465813 101656899 110736170 122815001 136686804 150419588 160049106
11692A60049106Q67328r751857j8246639k1480781j9982740j5780286j1669617
$$ 160049106 160916434 151164577 132917938 111437157 91454417 75674131 64004514
11685F4004514q224738n740108m060346l149175k219536j610673j461621j478781
$$ 64004514 55779776 50039668 45979322 42830147 40610611 38999938 37538317 36059536
11677C6059536j626853j324115j262683j498350j716897j627561j433918j750811
$$ 36059536 34432683 33108568 31845885 30347535 28630638 27003077 25569159 23818348
11669B3818348j835215j757640j504982j365944j129453q97475p74546o55888
$$ 23818348 21983133 20225493 18720511 17354567 16225114 15327639 14553093 13897205
11661A3897205o85917q15999j014815j084341q74169p92557n89665p58152o88203
$$ 13897205 13211288 12395289 11380474 10296133 9421964 8629407 8039742 7281590 6593387
11652F593387k42201j79800j25726k69611m00565k25769k84664l35283o8510J68848
$$ 6593387 6351186 6171386 6045660 5776049 5375484 5149715 4865051 4529768 4461258 4630106
11642D630106L8221j43314Q615J22920M6637O2041N8706q7946j55129j1540k77497
$$ 4630106 4668327 4525013 4533628 4656548 4703185 4765226 4823932 4735986 4580857 4569317 4291820
11631D291820n27271l12075J69125R2077J33481L6840j09263M5750K55458J82037
$$ 4291820 3764549 3452474 3621599 3713676 3847157 3883997 3774734 3820484 4075942 4257979
11621D257979K71329r466j58119j64170l21446l46879l65399j68456j27105j52971
$$ 4257979 4529308 4519842 4361723 4197553 3876107 3529228 3163829 2995373 2868268 2715297
11611B715297q0458J06592q9521k35028M1885m0343j95496p0854j08777p8823
$$ 2715297 2634839 2741431 2651910 2416882 2458767 2418424 2222928 2152074 2043297 1964474
11601A964474r5052j9511j61026j21255k1074q0613j0451L9732q5697N7612r9329
$$ 1964474 1869422 1849911 1688885 1567630 1546556 1465943 1455492 1495224 1409527 1467139 1367810
11590A367810j57730j02607p5717n0726O5552P4949J02126J2823k5227p4680N2698
$$ 1367810 1210080 1107473 1031756 981030 1046582 1121531 1223657 1236480 1211253 1136573 1189271
11579A189271J13499o4414k262k75505l12838j6385Q115j22137P2702J15132j05166
$$ 1189271 1302770 1238356 1236094 960589 647751 631366 639481 517344 590046 705178 600012
11568F00012n6219K1672N9636O4603j17439k25414j40405N038j41322J87291J04744
$$ 600012 543793 565465 625101 689704 572265 346851 206446 211484 70162 257453 362197
11557C62197K7355j08544n2170J33226N4216q4290r015J53140k4853j03571p6155
$$ 362197 389552 281008 228838 362064 416280 331990 322975 476115 451262 347691 271536
11546B71536J57373O3574j83338o3513L35776Q5436k3240j57587P4105P3928o9651
$$ 271536 428909 492483 309145 245632 581408 666844 643604 486017 560122 634050 564399
11535E64399k7619o2170K6966k70718j02897Q5052r780j59040R736J54782p5956
$$ 564399 536780 474610 501576 230858 127961 213013 203233 44193 53929 208711 132755
11524A32755j01398l4739K10949j20861N491N1766N2063R6476P4529j16008p7715
$$ 132755 31357 -3382 207567 86706 92197 143963 196026 292502 367031 251023 173308
11513A73308l0144q1646j8598J71455J95636m2633k29939k24001O485j17213J69049
$$ 173308 143164 61518 42920 214375 410011 367378 137439 -86562 -80077 -197290 -28241
11502b8241J78236p196o9773j32608N5330m3116J488R2428j89536J60077L70738
$$ -28241 149995 142799 73026 -59582 -4252 -47368 -45880 46548 -142988 17089 387827
11491C87827J00898j28610p1703Q0853j13978n2065l2221r2094q3423J60343J23737
$$ 387827 488725 360115 288412 369265 255287 203222 171001 78907 -4516 155827 279564
11480B79564k614J19042N0840k47772j98183J5220L8465J25125M1574q3384Q8083
$$ 279564 276950 395992 446832 199060 877 16097 54562 179687 221261 137877 225960
11469B25960M6476L2097j24466k40150k2449J98725P5398j55239p0951K56153
$$ 225960 272436 304533 180067 -60083 -82532 116193 191591 36352 -34599 221554
11459B21554m3467l1388J05695N6273k2512Q1255J6036K2867q771j42834k69479
$$ 221554 178087 146699 252394 308667 286155 367410 383446 406313 397542 254708 -14771
11448a4771j5835n3973O2244J76633K18999J02426L6285J6688o9422j74641j91088
$$ -14771 -30606 -84579 -22335 154298 373297 475723 512008 528696 459274 284633 93545
11437I3545J00102k8503q5321K6809J84803l1452j3359j12469Q8187J4376j7268
$$ 93545 193647 165144 79823 106632 291435 259983 246624 134155 222342 236718 219450
11426B19450k22909j55614L1114L10195L49794j10430m0651j85516j16063J64435
$$ 219450 -3459 -159073 -127959 182236 532030 421600 380949 195433 79370 243805
11416B43805O6716n2662k03964j10484R2348J09625J10462J82818n8145j18523
$$ 243805 310521 257859 53895 -56589 35759 145384 255846 438664 380519 261996
11406B61996l74273K8514K77061N3622p7676j07506K1294j22268L3657J50335
$$ 261996 -112277 -83763 193298 246920 169244 61738 83032 -39236 -5579 144756
11396A44756J17171M3437N6658R9699j02727m5139n8556j00431k16756J02902
$$ 144756 261927 305364 362022 461721 358994 313855 255299 154868 -61888 41014
11386D1014J87961O070l9761n5208j21875m0530N791O889N5262m5269j27054o152
$$ 41014 228975 235045 195284 140076 18201 -22329 -16538 -9649 45613 344 -126710 -132862
11374a32862J61472M0416j62550l5269J27146m8562J5246J2600J19059j58618
$$ -132862 28610 69026 -93524 -128793 -1647 -50209 -34963 -22363 96696 -61922
11364f1922j45576M5022K10582J86532J16790K46103o9838j52216J2240k25212
$$ -61922 -207498 -162476 48106 234638 351428 597531 527693 375477 387717 162505
11354A62505j54848J11367J06035P9848M6926O2490k34540k44411R8233K38190
$$ 162505 7657 119024 225059 304907 351833 414323 179783 -64628 33605 271795
11344B71795j34807j22818m5923Q0283K04825K85771K55797O3100m6035L5965
$$ 271795 136988 14170 -31753 48530 253355 539126 794923 858023 811988 847953
11334H47953q4930k1279N0162J83894p1327k48409j04915O8564j1612J708q8796
$$ 847953 763023 741744 791906 975800 904473 656064 551149 619713 608101 609809 521013
11323E21013n8878O9904J6254J79977K6659q8318j57402J3004p5030j89618K90061
$$ 521013 462135 532039 548293 728270 754929 666611 509209 522213 447183 257565 547626
11312E47626J96251o0258R891r3472J70041R3503k99144j09280J85673Q5740K9286
$$ 547626 743877 683619 693510 600038 770079 863582 564438 455158 640831 726571 755857
11301G55857r2893j27309q141N4587J67898M9161Q4267K3991J44107M25870L44473
$$ 755857 662964 535655 527514 582101 749999 799160 883427 907418 1051525 1477395 1821868
11290A821868K39090N5969O7186l55185j56824p1420m2645j69126j11292l04976
$$ 1821868 2060958 2116927 2184113 1828928 1672104 1600684 1558039 1388913 1277621 972645
11280I72645j26805l0088m1442P537k04487o3085J15787O8210J20403q878J6040
$$ 972645 845840 815752 774310 781847 577360 514275 630062 698272 818675 809797 825837
11269H25837k43365k1496P927M7166L7011j63785l653k3182J37502o2360o2967
$$ 825837 582472 560976 568903 616069 653080 489295 485642 462460 599962 537602 474635
11258D74635j25376j72553m5253J41333l2284L6878O8371L9243P3469J17285J3309
$$ 474635 349259 176706 131453 272786 240502 277380 345751 384994 458463 575748 589057
11247E89057j85482p9489m0115N0942n5535k9283j36983K5375J9071J74240K2726
$$ 589057 403575 324086 283971 334913 279378 250095 113112 138487 157558 331798 354524
11236C54524j38677J59093o38r0473j76142q7102k60169j84213O476K83366J07115
$$ 354524 215847 374940 374302 283829 107687 20585 -239584 -423797 -417321 -133955 -26840
11225b6840P3305M8730o4505j1406j00882k69700K7070N5553J14796O2722j181
$$ -26840 46465 95195 30690 19284 -81598 -351298 -324228 -268675 -153879 -91157 -92338
11214i2338J16606K17847O2934j56747K678O025r6905q3418R1564N088q5101j31931
$$ -92338 24268 242115 305049 148302 150980 157005 60100 -23318 68246 73334 -11767 -143698
11202a43698R9356K44649j66754j59003j61790o9489L3650J41535l1605l6900
$$ -143698 -44342 200307 33553 -125450 -287240 -356729 -323079 -181544 -213149 -250049
11192b50049L8017j38562M1259O4775J2501J56978j0779M2719J14256L28834j61069
$$ -250049 -212032 -350594 -309335 -244560 -232059 -75081 -85860 -43141 71115 399949 238880
11181B38880j88077q5501k29504R3067J95305n8517j00904j70998J42107K87777
$$ 238880 50803 -34698 -264202 -171135 24170 -34347 -135251 -306249 -164142 123635
11171A23635l3232m30963j74907J54773J82436J90868J97179j67237k07756r6539
$$ 123635 90403 -340560 -515467 -360694 -178258 12610 209789 42552 -165204 -261743
11161b61743R0457J01407j42970n943K03630J06086q98j11434M9244R971K02024
$$ -261743 -171286 -69879 -212849 -218792 -15162 90924 90026 -21408 27836 37807 239831
11150B39831k473L6462k12980q7907m170m3829q108j2060J54415N7489N0634L7896
$$ 239831 237358 273820 60840 -27067 -31237 -75066 -83174 -95234 59181 116670 167304 205200
11138B05200p5674r1473p8423r1888r4878j19279K21300K35747k0742j57509m4235
$$ 205200 129526 38053 -40370 -132258 -227136 -346415 -125115 110632 89890 -67619 -111854
11127a11854P8572j66107r238N0458l4609K02409J17845p0415j62742j69477K56677
$$ -111854 -33282 -199389 -208627 -158169 -192778 9631 127476 57061 -105681 -275158 -18481
11116a8481K12077k02324j99587Q8271q3606l0976j5260r752J68072k7192K07348
$$ -18481 193596 -8728 -208315 -120044 -203650 -234626 -249886 -259638 -91566 -118758 88590
11105H8590p4372j43595J06234J51487j33110k6101J3735j73778J40858K874p6035
$$ 88590 14218 -129377 -23143 128344 -4766 -30867 -17132 -190910 -50052 -47178 -123213
11094a23213L6433J19769K1998m2113n0961J04098R9482k8114k47887L8134L43184
$$ -123213 -86780 32989 54987 12874 -38087 66011 165493 137379 -110508 -72374 270810
11083B70810J41128j32334k31553k63208l7292j64911n7411J85043J33424K08293
$$ 270810 411938 279604 48051 -215157 -252449 -417360 -474771 -289728 -156304 51989
11073E1989J10943J12815M0619l22806r6989j01745O3562Q8588n9355j04554p8841
$$ 51989 162932 275747 316366 -6440 -103429 -205174 -141612 -53024 -112379 -216933 -295774
11062b95774j34640J09236J45984J35964L5222n0733r3342J58069R7465k38111
$$ -295774 -430414 -321178 -175194 -39230 -4008 -54741 -148083 9986 107451 -130660
11052a30660p7280J9997K9957L3769K30824o6239n3672p6704r1265j55363J37412
$$ -130660 -207940 -187943 -157986 -124217 106607 40368 -13304 -90008 -181273 -336636 -199224
11041a99224j187l8610K6845P3534P7958N1668q9000K5353o0577J10064P3713
$$ -199224 -200411 -239021 -212176 -138642 -60684 -9016 -98016 -72663 -133240 -23176 50537
11030E0537j01532K5211J43886q0148r7975r023J23502K4014p82n1169j33550
$$ 50537 -50995 -25784 118102 37954 -60021 -69044 54458 78472 77690 26521 -107029
11019a07029N0624J60834l6905l06452Q006L02449P1777l0599q7409k8920j29425
$$ -107029 -56405 104429 67524 -238928 -230922 71527 143304 112705 25296 -3624 -133049
11008a33049j08454r5404J40520K40757k21976l8944J28549K67402j02303r2777
$$ -133049 -241503 -336907 -196387 44370 -177606 -216550 -88001 179401 77098 -15679
10998a5679o0464m0772j6290R0814L77015K1210j58761k00309l21559k39478J52509
$$ -15679 -76143 -116915 -133205 -42391 334624 355834 197073 -3236 -324795 -564273 -411764
10987d11764J75093J81335J86007J2206k01686j98842r6575J9002Q5436J45364
$$ -411764 -236671 -55336 130671 142877 -58809 -257651 -354226 -335224 -249788 -104424
10977a04424K25192j9667P3027j57157k59500K9465M2382j58162m1606O7139Q6304
$$ -104424 120768 101101 174128 16971 -242529 -213064 -170682 -328844 -370450 -303311 -217007
10966b17007R4602q5366j756J5861Q1513N7213j5229K0034n4104j20524R4174
$$ -217007 -122405 -207771 -209527 -193666 -112153 -54940 -70169 -50135 -104239 -224763 -130589
10955a30589j7485n7468O2249J14419O9654K632p2256q5633k4913J73211M2256
$$ -130589 -148074 -205542 -143293 -28874 40780 43412 -28844 -114477 -139390 33821 76077
10944G6077N331m8578o8401J07370N6476n2285J34281j0939j24366J41744J59284
$$ 76077 81408 32830 -35571 71799 128275 75990 210271 199332 74966 216710 375994
10933C75994O9522j71094k0574k5484J49798p2355q1423p9829j52790Q398r7244
$$ 375994 445516 274422 253848 228364 378162 305807 224384 144555 -8235 163 -97081
10922i7081J04422J51942o0479o5329Q2460n8548k5151P1637j5488m9019k11744
$$ -97081 7341 159283 98804 33475 115935 57387 32236 103873 88385 39366 -172378
10911a72378j58416n083J63857Q3057j68042K4590J37454K9440J07169k4807p0342
$$ -172378 -330794 -335877 -172020 -88963 -257005 -232415 -94961 -65521 41648 16841 -53501
10900e3501J2388K29925M4437k6549k68170k18115J06048Q1496k2266J25084n3474
$$ -53501 -41113 188812 233249 206700 -61470 -279585 -173537 -92041 -114307 10777 -42697
10889d2697m5263k06818L3890J24892l8466l4896j17980p1200J4317O0057J17165
$$ -42697 -87960 -294778 -260888 -135996 -174462 -209358 -327338 -398538 -384221 -324164 -206999
10878b06999J20951k3277k04415j39022J31076R0016j40147R5323J90929R3111
$$ -206999 -86048 -109325 -313740 -452762 -321686 -231670 -371817 -276494 -85565 7546
10868G546J07961k17872j19058P6453K5750O5482q1112j3104L6637L3942j17522
$$ 7546 115507 -102365 -221423 -144970 -119220 -53738 -134850 -147954 -111317 -77375 -194897
10857a94897k044l2347O409R5306j26563K3339m3090J76630P0257Q9974n3438
$$ -194897 -196941 -229288 -222879 -127573 -254136 -230797 -273887 -97257 -27000 62974 9536
10846I536k01284J79221Q3481k57439j26344K5245Q2285K3792l9143K2047r8613
$$ 9536 -191748 -12527 70954 -186485 -312829 -287584 -205299 -181507 -220650 -198603 -297216
10835b97216M6384R5953J09037J28372j90116j35351j40158k4815J26263P1709
$$ -297216 -250832 -154879 -45842 82530 -107586 -242937 -383095 -407910 -281647 -209938
10825b09938M1028P8073K7309K9942J69543j360k69977k16679R7784K61208m0589
$$ -209938 -168910 -90837 -63528 -33586 135957 134597 -135380 -352059 -254275 6933 -33656
10814c3656j7536r9956l8361K23689K63931P7792J715K2731J51028j7601j56506
$$ -33656 -51192 -151148 -189509 34180 298111 375903 377618 400349 551377 533776 377270
10803C77270j8716J62437p4268l50555k21091o8679P1890j5705p2993J75899J99888
$$ 377270 358554 520991 446723 96168 -124923 -193602 -121712 -137417 -210410 -34511 165377
10792A65377Q2386j0482j77910r0387j4950j4100J4200L34P4593L6695n9382n383
$$ 165377 247763 237281 59371 -31016 -45966 -60066 -45866 -45532 29061 65756 6374 991
10780I91n6045o7944R884j15367j71574p4753J09966J67786j29901L7596J20086
$$ 991 -55054 -122998 -113114 -228481 -400055 -474808 -364842 -197056 -326957 -289361 -169275
10769a69275n0597Q3354P8683J28036k33406J0714L12095Q4901j50137J9213J45588
$$ -169275 -219872 -136518 -57835 70201 -163205 -152491 159604 244505 94368 113581 259169
10758B59169K2390J6112J24965O7442k11232l6688l3039j30181M6555k2868m5269
$$ 259169 281559 297671 422636 490078 278846 242158 209119 78938 125493 102625 57356
10747E7356n9597R6311l0898P9624k4853j49297J81204q9953n9674J969L46356
$$ 57356 -2241 94070 63172 142796 117943 -31354 149850 59897 223 2192 348548
10736C48548p6129k60810j50161j1495j0426J65369m5945J08969N3942r5435L9007
$$ 348548 272419 11609 -138552 -150047 -160473 4896 -41049 67920 121862 26427 65434
10725F5434N9136j84564j59377k8012J037Q5002q85P2546P4842l2962P5674j39356
$$ 65434 124570 -59994 -219371 -247383 -246346 -161344 -162229 -89683 -14841 -47803 27871 -111485
10713a11485o9513J50314J87877K33007J38435j42702j32061q252k35043J2103
$$ -111485 -180998 -30684 157193 390200 528635 385933 253872 245620 10577 22680
10703B2680J75038K9605j82852r0661k6396J3008j20113l1037j7609R7707J50402
$$ 22680 197718 227323 44471 -46190 -72586 -59578 -179691 -210728 -228337 -130630 19772
10692A9772J6887k7519j46502J776n6057k30894k12238k9088J53133L21714N6265
$$ 19772 36659 9140 -137362 -135586 -191643 -422537 -634775 -663863 -510730 -189016 -132751
10681a32751k29R6867J59277K5594p2066j20514j26030K9518N9210J5901p915
$$ -132751 -132980 -36113 123164 148758 76692 -43822 -169852 -140334 -81124 -65223 -73138
10670g3138P2458J99737l6616p8538N2827j38918j2005K5759J23968m8640m2027
$$ -73138 -680 199057 162441 83903 136730 -2188 -14193 11566 135534 86894 44867
10659D4867R1962R9212j94550r1309L1168J0451L5267j16405j1917J08172K19207
$$ 44867 136829 236041 41491 -49818 -18650 -8199 27068 -89337 -101254 6918 226125
10648B26125j40532p8258j99289M0900L7660J3786K93532M0689j00725j26235
$$ 226125 85593 7335 -191954 -151054 -113394 -99608 193924 234613 133888 7653
10638G653Q0313J9573k03183J1061K09386J156r1541J29205O8984p1101J0194
$$ 7653 87966 107539 -95644 -84583 124803 125959 34418 163623 232607 161506 171700
10627A71700k38757j31227N0774K41115K23804o2184k04678o3248O031J05556
$$ 171700 -67057 -198284 -147510 93605 317409 255225 50547 -12701 -6670 98886
10617I8886r832J06190o0263n3464l8276j9181k38858q3002j1983l463J72237
$$ 98886 89054 195244 134981 81517 43241 24060 -214798 -297800 -309783 -313246 -141009
10606a41009K4716P5816j8323p838j60855Q5532J20433M6180M2037j5005o8172
$$ -141009 -116293 -40477 -58800 -66638 -227493 -141961 -21528 24652 66689 51684 -16488
10595a6488K1228j06292k01137j3898J54499J67967n660l2665K94864j4624l05765
$$ -16488 4740 -101552 -302689 -316587 -162088 5879 219 -32446 262418 247794 -57971
10584e7971k62220n399J34719L7482j24600M8650K4264R2784J0427K04060J70049
$$ -57971 -320191 -325590 -190871 -153389 -277989 -229339 -205075 -112291 -101864 102196 272245
10573B72245k02239q6777j08170j395k1219k047K13585J85407j50196j56464k22291
$$ 272245 70006 -16771 -124941 -126336 -147555 -149602 63983 249390 99194 -57270 -279561
10562b79561J93098J88408J26869l5197m2874Q9548j7602J9278n2943o0991J7726
$$ -279561 -86463 101945 228814 193617 150743 240291 222689 241967 189024 128033 145759
10551A45759K1109k50180j19782m8788j08291K9270N5344P1164m2263Q3228K4246
$$ 145759 166868 -83312 -203094 -251882 -360173 -330903 -275559 -204395 -246658 -163430 -139184
10540a39184j08559p7631J23888m9293J28756J20900K04248j75559k20458J41041
$$ -139184 -247743 -325374 -201486 -250779 -122023 -1123 203125 27566 -192892 -51851
10530e1851n1342n789j0629l9860K4682O3032R9468j27890n3969L3859N406n7764
$$ -51851 -103193 -108982 -119611 -159471 -134789 -71757 27711 -100179 -154148 -120289 -114883 -172647
10518a72647m5923Q5314J58855M43M4233q384j52009j19611Q0495r2471N0908
$$ -172647 -218570 -133256 25599 26042 70275 61891 -90118 -209729 -129234 -221705 -170797
10507a70797p1650o3638P6026L056M2360M8179p158O9110J93520J40776j4137
$$ -170797 -242447 -306085 -230059 -227003 -184643 -136464 -143622 -74512 119008 259784 245647
10496B45647r7685m8811M2750j02216n5753p8713k4383J55727J28613j58292n9847
$$ 245647 147962 99151 141901 39685 -16068 -94781 -119164 36563 165176 6884 -52963
10485e2963J32162J28440O7968j21506j3031M4818J42938l7008N6166M2921l4427
$$ -52963 79199 207639 275607 154101 141070 185888 328826 291818 347984 390905 356478
10474C56478p1845j20137k25021j15849m8211M1393k486K25718J83139K4691r4906
$$ 356478 284633 164496 -60525 -176374 -224585 -183192 -185678 40040 223179 247870 152964
10463A52964L0346n8828j76668Q7686L9109k70059L537k8427J85206J73843k6924
$$ 152964 183310 124482 -52186 35500 74609 -195450 -191913 -220340 -35134 138709 111785
10452A11785j34941j1626Q8857O1781k56604K5547P897L5874M0326J14753J49254
$$ 111785 -23156 -34782 54075 115856 -140748 -115201 -107304 -71430 -31104 83649 232903
10441B32903O5716l07627j26434J38945J81194m4688j4151K6555J79827j64584
$$ 232903 298619 -9008 -135442 3503 184697 140009 125858 152413 332240 167656
10431A67656j78950j24948J42797J04608P3477O9755j23448P8348P2765j14504
$$ 167656 -11294 -136242 6555 111163 184640 254395 130947 209295 282060 167556
10421A67556J00371r2353J52110j79885l28634r913J59019m8689l6787o0440k7446
$$ 167556 267927 175574 327684 147799 -180835 -190748 -31729 -80418 -117205 -177645 -205091
10410b05091j1004k8754l4818J11630n0646J28910J44413j6127j28136j2455j523
$$ -205091 -216095 -244849 -279667 -168037 -218683 -89773 54640 38513 -89623 -102078 -103601
10399a03601J01346J26033N5346l33645k8464K26811J7788j36445M5636J59907
$$ -103601 -2255 123778 179124 -154521 -182985 43826 61614 -74831 -29195 130712
10389A30712p230j27748k7906J12153J08073l268J09300p1912j2474l3900j37816
$$ 130712 123482 -4266 -32172 79981 188054 184786 294086 222174 209700 175800 37984
10378C7984N7603Q2477J9652m4824k7700k28458j74567Q330R0615M9746p8745
$$ 37984 95587 178064 197716 152892 125192 -103266 -277833 -269503 -178888 -129142 -207887
10367b07887J14446J25429J27763j550j49687k02870j56165L5075J77047J28381
$$ -207887 -93441 31988 159751 158201 8514 -194356 -350521 -315446 -138399 -10018
10357a0018j688L1696j05009l1229N0705M309K8325J10505L7238l0249q3925p0133
$$ -10018 -11706 19990 -85019 -116248 -65543 -61234 -32909 77596 114834 84585 660 -69473
10345f9473k25742L1915J14193R4240j8012j30649k34486K05590K26845k4296
$$ -69473 -295215 -263300 -149107 -54867 -72879 -203528 -438014 -232424 -5579 -29875
10335b9875K030o7334l5604J13934j9369N9095N0812J5097j39301p4564j37403
$$ -29875 -27845 -95179 -130783 -16849 -36218 22877 73689 88786 -50515 -125079 -262482
10324b62482N5342J19423J82134J1666q2894k02290O1195L3382K0536k78623J98942
$$ -262482 -207140 -87717 94417 106083 23189 -179101 -117906 -84524 -63988 -342611 -143669
10313a43669M1697P8072k602N2976j5940j27527O7867k2814Q1980J51379l4878
$$ -143669 -101972 -23900 -26502 26474 10534 -116993 -49126 -71940 10040 161419 126541
10302A26541j69718j69672J9593R0110L3995J72750R0785O8198j49529M4410K3677
$$ 126541 -43177 -212849 -193256 -103146 -69151 103599 194384 262582 113053 157463 181140
10291A81140j51954p3360j8396J21194J26266J00487J04396K03124j51309N6751
$$ 181140 29186 -44174 -62570 58624 184890 285377 389773 592897 441588 498339
10281D98339J5367k33147q5874R8626j19185j68097m9060K5410J63899Q1242L540
$$ 498339 513706 280559 194685 293311 174126 6029 -43031 -17621 146278 227520 231060
10270B31060j0383n6422j78023j65054O0090K21491M5617J2373J45197N9018j46722
$$ 231060 220677 164255 -13768 -178822 -118732 102759 148376 160749 305946 364964 218242
10259B18242k4463k389j27056J08607R668L2573m7904j43231K6499o5854O3127
$$ 218242 193779 191390 64334 172941 182609 215182 167278 24047 50546 -15308 47819
10248D7819K18186K4860P9450J28232O4899o3044J26028j67620J53719J57368
$$ 47819 266005 290865 370315 498547 563446 500402 626430 458810 612529 769897
10238G69897J08373P4433k29751L8216j19142j45636q3958j28813p1202j7885
$$ 769897 878270 952703 722952 761168 642026 496390 412432 283619 212417 194532
10228A94532L2968l2831m4099J87648J41603o4939j66782j47999n0354M998O0867
$$ 194532 227500 194669 150570 338218 479821 414882 248100 100101 49747 54745 115612
10217A15612J14269J35564Q202j69592o6265j52794j29977J12689K69670l1912
$$ 115612 229881 365445 373647 204055 137790 -15004 -144981 -32292 237378 205466
10207B05466k28841j7070K31264K17460M6806J32620L03161J12689K56513J90858
$$ 205466 -23375 -40445 190819 408279 455085 587705 890866 1003555 1260068 1450926
10197A450926L1914O5078K8442J85182j45587k43837j65566Q124k71193n7565
$$ 1450926 1482840 1547918 1576360 1761542 1615955 1372118 1206552 1214676 943483 885918
10187H85918J6285j54857k36503n7628R5214n9219k11566k06556N8830J99887
$$ 885918 902203 747346 510843 453215 548429 489210 277644 71088 129918 329805
10177C29805O6375r8608r9712j28993P4420J73421M4854N6089r7130J22109J11910
$$ 329805 396180 297572 197860 68867 143287 316708 361562 417651 320521 442630 554540
10166E54540L8618j13583k06255J57492j1242k15218J18818N4486N045J31595
$$ 554540 593158 479575 273320 430812 419570 204352 323170 377656 382701 514296
10156E14296n787L5892K61981J53443L25703K52160o9187k95457j94639l18234
$$ 514296 508509 544401 806382 959825 1285528 1537688 1468501 1173044 978405 660171
10146F60171j81597n0187k09569j48251Q8725R4937l5198n5229J98387J12843
$$ 660171 478574 428387 218818 70567 159292 254229 219031 163802 362189 475032
10136D75032j60387j41259J05847r4869j2765p7526J32704N3215q2969o7197o1976
$$ 475032 314645 173386 279233 184364 171599 94073 226777 279992 197023 129826 67850
10125F7850Q7246J26356O132p2101j23215j06559o7923P692j6569J10671K31110
$$ 67850 155096 281452 287584 215483 92268 -14291 -82214 -74522 -91091 19580 250690
10114B50690p3492l21843J2682J90750L73151J19457n1683j09296j44391J3776
$$ 250690 177198 -144645 -131963 58787 431938 551395 499712 390416 246025 259801
10104B59801k3219k29276N3931J9530N7428L2611j1572P3056j76183j95739k03710
$$ 259801 236582 7306 61237 80767 138195 170806 159234 232290 56107 -139632 -343342
10093c43342k06856J64391P5132N7663j00208L8860N6024K9683P1640j15625K379
$$ -343342 -550198 -385807 -310675 -253012 -353220 -314360 -258336 -228653 -157013 -272638 -270259
10082b70259J58020L55896m5826j11659j301R7649Q6418L8462m8939J8897j07286
$$ -270259 -112239 243657 197831 86172 84871 182520 268938 307400 258461 277358 170072
10071A70072Q6369k63462j25370n4735j34319J7172J06709J27114M2342N4695
$$ 170072 256441 -7021 -132391 -187126 -321445 -304273 -197564 -70450 -28108 26587
10061B6587M9961P7930m7772P1647K6320J13120k38749q231L6231r1822K3482
$$ 26587 76548 154478 106706 178353 204673 317793 79044 70813 107044 15222 38704
10050C8704j56002j29805l7894K33601K15449r8116j20587J4389Q138J72768k046
$$ 38704 -117298 -247103 -284997 -51396 164053 65937 -54650 -40261 -32123 140645 138599
10039A38599j03784O425P0336J54841J30684r1361n5806J42959P1466j70906q2001
$$ 138599 34815 41240 111576 266417 397101 305740 249934 392893 464359 293453 211452
10028B11452O7943N4458R1357k6126j61667R0633J79438J05697N66p0613k9307
$$ 211452 279395 333853 425210 399084 237417 328050 507488 613185 613751 543138 513831
10017E13831j06673j57668k90632k6430J11613J38408Q2933J59325P8738k80719
$$ 513831 407158 249490 -41142 -67572 44041 182449 265382 424707 503445 222726
10007B22726m8132N4234n1098j47120R9182q6274k378O0357R6467J19745K3879
$$ 222726 174594 228828 177730 30610 129792 43518 41140 101497 197964 317709 341588
9996C41588K56407K54984j2904k80761n6274p7054N1591J76296J44715j46172
$$ 341588 597995 852979 840075 559314 503040 425986 477577 653873 798588 652416
9986F52416l17840j70586N8832M6088L2544J9850r3681j73815J29965R011L5064
$$ 652416 334576 163990 222822 268910 301454 321304 227623 53808 183773 192784 227848
9975B27848Q7335R6892q620k43326j26551K24780R3947r585J9713j82825M6013
$$ 227848 315183 412075 403455 160129 33578 258358 352305 342720 362433 179608 225621
9964B25621M909q2946K8754M6390J40733L1631o1087K8053J85780P0765k5709
$$ 225621 230530 147584 176338 222728 363461 395092 334005 362058 547838 618603 592894
9953E92894k13336m2646N4151K05968K3981j47481j55149o1273N4587m6979o3131
$$ 592894 379558 336912 391063 597031 621012 473531 318382 257109 311696 264717 201586
9942B01586r2233k12069J40728K91579r0676j66253j23883Q583J6874R0643q343
$$ 201586 109353 -102716 38012 329591 238915 72662 -51221 -42638 -25764 64879 56536
9931E6536k9430J54840K9817L5457P9032k5409M3221K54998J34432N3029J4960
$$ 56536 27106 181946 211763 247220 326252 300843 344064 599062 733494 786523 801483
9920H01483j41754o9317J71666K14675P2736L2628L597N562j07190J4107L21604
$$ 801483 659729 590412 762078 976753 1049489 1082117 1085714 1091276 984086 998193 1319797
9909A319797J48583n7951k5781J21933J26957r3243J50754J92683l0928J07223
$$ 1319797 1468380 1410429 1384648 1506581 1633538 1540295 1691049 1883732 1852804 1960027
9899A960027L92128J77088J76901K02476k8941j10259J30583J23180K30324N34064
$$ 1960027 2352155 2529243 2706144 2908620 2879679 2769420 2900003 3023183 3253507 3787571
9889C787571L95647M79991L71486K2922j72323k35980q6005L9977Q8793j61380
$$ 3787571 4183218 4663209 5034695 5057617 4885294 4649314 4563309 4603286 4692079 4530699
9879D530699l59346J7376k36174P8599J42267J62698M47940M62161L02194K58530
$$ 4530699 4171353 4188729 3952555 4031154 4173421 4336119 4784059 5246220 5548414 5806944
9869E806944L37697P44592J126715J248537J306717J247307J014457Q2590o04843
$$ 5806944 6144641 6889233 8015948 9264485 10571202 11818509 12832966 12915556 12310713
9860A2310713k75943M5636j57620n19429o97987r15069o99832m29565k23085j70634
$$ 12310713 12034770 12080406 11922786 11403357 10705370 9790301 9090469 8660904 8437819 8267185
9850H267185M2762p5759J31170J48150K28689K14889N01546N63207Q04781P90872
$$ 8267185 8309947 8234188 8365358 8513508 8742197 8957086 9458632 10021839 10826620 11617492
9840A1617492P37747Q37238J166014J375688J337661J693089K051293K462582
$$ 11617492 12355239 13192477 14358491 15734179 17071840 18764929 20816222 23278804
9832B3278804L217488L729075N070534O544041Q830495J1938429J5376702J8450403
$$ 23278804 26496292 30225367 35295901 41839942 50670437 62608866 77985568 96435971
9824I6435971J9085784J7215051J4807865P895316o600298j9013874k0970342
$$ 96435971 115521755 132736806 147544671 155439987 148839689 129825815 108855473
9817A08855473j7196504j2518485p980630m526821j725104O52256L082446N418722
$$ 108855473 91658969 79140484 71159854 66633033 64907929 65560185 68642631 74061353
9809G4061353P751379R533583J1259479J2179826J0821589Q814649P356337N221567
$$ 74061353 81812732 91346315 102605794 114785620 125607209 134421858 141778195 146999762
9801A46999762K090408j069037k596602l095084k853195k961284k778835k467175
$$ 146999762 149090170 148021133 145424531 142329447 139476252 136514968 133736133 131268958
9793A31268958k436354k178452q65389k07913L12608L014804Q417739J5951554
$$ 131268958 128832604 126654152 125788763 125580850 125893458 128908262 137326001 153277555
9785A53277555K4864016L4692785M3270050M6810197M3995481L4786827J3366710
$$ 153277555 178141571 212834356 256104406 302914603 346910084 381696911 395063621
9778C95063621k1691086n0768131n7801008m9478188l6017803k3654063j4160005
$$ 395063621 373372535 322604404 264803396 215325208 179307405 155653342 141493337
9771A41493337p523856l014512K58444K835231L953757L798644K429828J504395
$$ 141493337 133969481 130954969 131213413 134048644 138002401 141801045 144230873 145735268
9763A45735268K490378L402280K951688K138773J043168p00939k572451m387419
$$ 145735268 148225646 151627926 154579614 156718387 157761555 157060616 154488165 150100746
9755A50100746p711775j0861316j2854908j3585700j2648126r855591o572799
$$ 150100746 142388971 131527655 118672747 105087047 92438921 82583330 76010531
9748G6010531l911351k106716n7153J919903M321521P678192J1157249J3914945
$$ 76010531 72099180 69992464 69935311 71855214 76176735 83854927 95012176 108927121
9740A08927121J4983181J4017809J1417763L441949r964770k0158884k1493908
$$ 108927121 123910302 137928111 149345874 152787823 142823053 122664169 101170261
9733A01170261j8458731j4395986j1055263q292160o030848m388737l323283k405174
$$ 101170261 82711530 68315544 57260281 48968121 42937273 38548536 35225253 32820079
9725C2820079j869220j735947j716149j761741j893251j728255j552502j404027
$$ 32820079 30950859 29214912 27498763 25737022 23843771 22115516 20563014 19158987
9717A9158987j412244j439074j437406j281434r38639n82832o38078l71312j95755
$$ 19158987 17746743 16307669 14870263 13588829 12650190 12067358 11429280 11057968 10862213
9708A0862213k10354k27368j31224M1491M74251P47831O82871M80158L86185M1260
$$ 10862213 10651859 10424491 10293267 10334758 10809009 11556840 12239711 12719869 13106054 13147314
9698A3147314k09853j37194r7645o85521j505600j449845j095937q06364q97646
$$ 13147314 12937461 12800267 12702622 12017101 10511501 9061656 7965719 7159355 6261709
9689F261709l32465j20386j93396k69648l96389k42346j55038j43749r0714r1035
$$ 6261709 5929244 5808858 5615462 5345814 4949425 4707079 4552041 4408292 4317578 4226543
9679D226543K06615K05153j29341m4790K24613L09201R3784o2357p6415M022j65725
$$ 4226543 4433158 4638311 4508970 4464180 4688793 4997994 5091778 5029421 4953006 4957028 4791303
9668D791303l55693l92755m02893j91970l86894k3218J94533J75811k0532k46762
$$ 4791303 4435610 4042855 3639962 3447992 3061098 3037880 3232413 3408224 3387692 3140930
9658C140930l90308l29439j38615r1398k42857j02796r5477J0778J3430o2111
$$ 3140930 2750622 2421183 2282568 2191170 1948313 1845517 1750040 1760818 1774248 1712137
9648A712137r2023j88062k61537j2034J7325m1478J14876O3982P8501n7697J10393
$$ 1712137 1620114 1432052 1170515 1158481 1175806 1134328 1249204 1313186 1391687 1333990 1444383
9637A444383j91935k57745J7200J08830n4922j35719q6261J11556K55894J65143
$$ 1444383 1252448 994703 1011903 1120733 1065811 930092 843831 955387 1211281 1376424
9627A376424k6901k16444k80287J45544K13096o3384p9573o5245j21999L8798
$$ 1376424 1349523 1133079 852792 998336 1211432 1148048 1068475 1003230 881231 920029
9617I20029o823k9658j34710j76841k871N5086l6221L9342J34608K983r5172n3105
$$ 920029 913206 883548 748838 571997 569126 624212 587991 627333 761941 764924 669752 616647
9605F16647o2355O2605Q6960j57856j4273O0800j9462k04803K5494r7928j46988
$$ 616647 554292 616897 703857 546001 531728 592528 573066 368263 393757 295829 148841
9594A48841J4843J91452m8789J13125J10230j52603j19511m7806N1558j4865n6852
$$ 148841 163684 355136 306347 419472 529702 377099 257588 209782 261340 246475 189623
9583A89623q6428j07922L2367K34743r738j42653j27868R9429J42421L0944J11654
$$ 189623 103195 -4727 27640 262383 252645 109992 -17876 81553 223974 254918 366572
9572C66572K08841q286J8887M6041j52421q6373K6778j38951K83766n5003k22081
$$ 366572 575413 567127 586014 632055 479634 393261 420039 281088 564854 509851 287770
9561B87770k00207J9345J40960L2181J50452J07172j87449J7961q2146N0401P1273
$$ 287770 87563 106908 247868 280049 430501 537673 350224 368185 286039 336440 407713
9550D07713j33786K0325k28531l8797J26929j9441J33716J2772M7356J35833N3505
$$ 407713 273927 294252 65721 26924 153853 134412 268128 280900 328256 464089 517594
9539E17594R9025J3454k34871j33949q1089J31503j62431k30304J79644l4348
$$ 517594 616619 630073 395202 261253 180164 311667 149236 -81068 98576 64228
9529F4228K5244J79320l733j19358k4497j3582Q5143j3889j06781k3238N1256
$$ 64228 89472 268792 265059 145701 121204 107622 192765 178876 72095 48857 100113
9518A00113j70785L4827k4912l4013j98914k5820K02927p7959K55598K39519n7115
$$ 100113 -70672 -35845 -60757 -94770 -293684 -319504 -116577 -194536 61062 300581 243466
9507B43466r5375R9101l2326o9303q0656j47109J98862J56336q8984j17287J70770
$$ 243466 148091 247192 214866 145563 64907 -82202 116660 272996 184012 66725 237495
9496B37495k3700j30193r316m9280J68167K9645L9364j31567l9268m2016N2191
$$ 237495 213795 83602 74286 25006 193173 222818 262182 130615 91347 49331 101522
9485A01522M3198J42087J14863j22562K0804j05773M4397J7634J04712j3370K1179
$$ 101522 144720 286807 401670 279108 299912 194139 238536 256170 360882 347512 368691
9474C68691J48797Q2258k83833l7779J309M258J20088M4883J6673K59116j58922
$$ 368691 517488 599746 315913 278134 279443 283701 403789 448672 465345 724461 565539
9463E65539k71494j81146j3578K74958O6504L8655j48957k47215J80688J47496
$$ 565539 294045 112899 99321 374279 440783 479438 330481 83266 263954 411450
9453D11450j7258J43413L66583K6135k77743k2555j29965p8415m2087K22182J79284
$$ 411450 394192 537605 904188 930323 652580 630025 500060 421645 379558 601740 781024
9442G81024j7843j99462k6122L7549j75623k63729q6348L5670q021N2040J88344
$$ 781024 763181 563719 537597 575146 399523 135794 49446 85116 77095 129135 317479
9431C17479j76291k62882J71380J35855J61076J08507J08023K14743q9027k14861
$$ 317479 141188 -121694 49686 185541 346617 455124 563147 777890 688863 474002
9421D74002j89453L591N0761l5169l3171j70088k09909J24203K49187J43720J5449
$$ 474002 284549 288140 338901 303732 270561 100473 -109436 14767 263954 407674 423123
9410D23123J16269J18518K01562J20320P0676K61886J13699K49556J60615m7968
$$ 423123 539392 657910 859472 979792 1050468 1312354 1426053 1675609 1836224 1788256
9400A788256j22481k0274r7428r4564l13077j49126l1868L5487j5610k66151k91793
$$ 1788256 1665775 1645501 1548073 1453509 1140432 991306 959438 994925 979315 713164 421371
9389D21371P8622L8238j26228n3120j10375n3784J4407k14o4606M3310J21129
$$ 421371 499993 538231 412003 358883 248508 194724 209131 208917 144311 187621 308750
9378C08750m815M4490J73419Q6471L0452J6742o484j33681P4667o4326j53641
$$ 308750 303935 348425 521844 608315 638767 655509 649025 515344 590011 525685 372044
9367C72044P4979K84721K07702L11492J44639P2048J73928J60091m8566J41972
$$ 372044 447023 731744 939446 1250938 1395577 1467625 1641553 1801644 1753078 1895050
9357A895050j86660k09891R6777J99240j15526l90332l20575k43753K84322j55871
$$ 1895050 1708390 1498499 1595276 1794516 1678990 1288658 968083 724330 1008652 852781
9347H52781j50210k47754p1147M9086J4361l9488l421j16198r5932J24594J27124
$$ 852781 702571 454817 383670 432756 447117 407629 404208 288010 192078 316672 443796
9336D43796k9967j79500j14478m740J31409M5567j40638J35685K16438J0809j33845
$$ 443796 413829 234329 119851 115111 246520 292087 151449 287134 503572 514381 380536
9325C80536j26291J96416K70410K1958J20015K31942J91747J30114r0125j20284
$$ 380536 254245 450661 721071 743029 863044 1094986 1286733 1416847 1326722 1206438
9315A206438j91781k0446J42662J92282n346j50664r5109q2731k04733M9211J45934
$$ 1206438 1014657 994211 1136873 1329155 1323809 1173145 1078036 995305 790572 839783 985717
9304I85717l3859M826q3263k66668k13557j55277O2768m4705p9320L429K24961
$$ 985717 951858 956684 873421 606753 393196 237919 300687 255982 176662 180091 405052
9293D05052N5718k8125L198R4540J7986q4318j04313J66426m1118j00119j44060
$$ 405052 460770 432645 435843 530383 548369 464051 359738 526164 485046 384927 240867
9282B40867r2938J29026q0082k04280J34017J53226j8869K5841p8488J99407L3197
$$ 240867 147929 276955 196873 -7407 126610 279836 260967 286808 208320 407727 440924
9271D40924m1761p1679J4569N1626J58555m2908o0015k29381j19062n9968n7619
$$ 440924 399163 327484 342053 393679 552234 509326 449311 219930 100868 40900 -16719
9260a6719J14050Q9774j93881l18403N9982j25538P8375J04293j16630M8710l8816
$$ -16719 97331 187105 -6776 -325179 -265197 -390735 -312360 -208067 -324697 -275987 -314803
9249c14803J20224J83652J82854J19434J2719m651n7341k50185k56087J96004
$$ -314803 -194579 -10927 171927 291361 304080 299429 242088 -8097 -264184 -68180
9239f8180K73121J43848j31385m4869J64373L8988j28213P3865L2092o2093j12581
$$ -68180 204941 348789 217404 172535 336908 375896 247683 321548 353640 291547 178966
9228A78966K3768O4139p9272r5555j92773n727L4137n10L8091O3340O3526K1875
$$ 178966 202734 266873 187601 92046 -100727 -106454 -72317 -72827 -34736 28604 92130 114005
9216A14005j18795l7901j5374K0335j07001r6979J73628K25452m8549k30494J27243
$$ 114005 -4790 -42691 -58065 -37730 -144731 -241710 -68082 157370 108821 -121673 5570
9205E570J36559p9719p3745p2483R1966m450p600J4537O7400M7801p6130N3264
$$ 5570 142129 62410 -11335 -83818 8148 3698 -3902 10635 78035 125836 49706 102970
9193A02970Q8374j02030J68482K29019m4535j7869K769p4576r7555J69386R3587
$$ 102970 191344 89314 257796 486815 442280 424411 427180 352604 255049 424435 518022
9182E18022k69511j25542n850R2300J41805j0767k69199J25207K2447j7290o5889
$$ 518022 248511 122969 117119 209419 351224 340457 71258 196465 218912 201622 135733
9171A35733o66P1320J4440j86813L0457P4771Q7549j09617P8050R2797j28056
$$ 135733 135067 206387 220827 34014 64471 139242 226791 117174 195224 288021 159965
9160A59965O9332J74587l4j51906o6360J88448N4999o0937p8429P2670P5635j21208
$$ 159965 229297 403884 403850 251944 185584 374032 429031 368094 289665 362335 437970 316762
9148C16762l35647q1895N6319M0691l9070J28583K05582L7944k5307j21720K728
$$ 316762 -18885 -100780 -44461 -3770 -42840 85743 291325 329269 303962 182242 184970
9137A84970K1524j03611J2162Q3496l5297k12551J02621j88421M4857O2532J57571
$$ 184970 206494 102883 115045 198541 163244 -49307 53314 -135107 -90250 -27718 129853
9126A29853n0975j05653O1758j44470j66557K95050J42552k18925l2518K29854
$$ 129853 78878 -26775 34983 -109487 -276044 19006 161558 -57367 -89885 139969
9116A39969J42954p0803K18764N3539k90422l31388R8061L254n8719J77762K59666
$$ 139969 282923 212120 430884 484423 194001 -137387 -39326 -36072 -94791 82971 342637
9105C42637m8373m508J4398J57043J91893J14192j49973j11044j07771j27886
$$ 342637 294264 289756 304154 461197 653090 767282 617309 506265 398494 270608
9095B70608K52094J83628k34710r310P1635J22769J59615J39852J51048J22103
$$ 270608 522702 706330 471620 462310 533945 656714 816329 956181 1107229 1229332
9085A229332J64450L25091K51827K01283J9020L37770L96501L51857L94412M21484
$$ 1229332 1393782 1718873 1970700 2171983 2191003 2528773 2925274 3277131 3671543 4093027
9075D093027N49262M64204M88677O10972Q14258J186874Q38590J050586J505749
$$ 4093027 4642289 5106493 5595170 6206142 7020400 8207274 9045864 10096450 11602199
9066A1602199J913886K573897L290152M495327P542689J3647733K1976319K3185373
$$ 11602199 13516085 16089982 19380134 23875461 31418150 45065883 67042202 90227575
9058I0227575J8050160K7966056L4528043j4128178n2869032l7077606j9111044
$$ 90227575 108277735 136243791 170771834 156643656 103774624 66697018 47585974
9051D7585974j0400579o550376m540258l225680k121902j339927q77598o10846
$$ 47585974 37185395 30635019 26094761 22869081 20747179 19407252 18529654 17918808
9043A7918808j54221n33480j229648j818927j746607j411152j141774j031973
$$ 17918808 17764587 17231107 16001459 14182532 12435925 11024773 9882999 8851026
9035H851026j117746r23544p12142p01981p38427o17346l52371m04057k52739
$$ 8851026 7733280 6809736 6097594 5395613 4657186 4039840 3687469 3283412 3030673
9026C030673M5987k22298l08884k39963j99944q4300k08469j43692q1196o1426
$$ 3030673 3076660 2854362 2545478 2305515 2105571 2021271 1812802 1669110 1587914 1526488
9016A526488j38682K7756K7341k02518j55308j02766j14271k5467r3644k4960
$$ 1526488 1387806 1415562 1442903 1240385 1085077 982311 868040 842573 748929 723969
9006G23969L2043q5440p2403o7681J51660L08274M4629k38525j48452k57640j22929
$$ 723969 756012 670572 598169 530488 682148 990422 1035051 796526 648074 390434 267505
8995B67505K1333J21129j72784r0322J42735J52148j06980k81287J8274Q5760
$$ 267505 288838 409967 237183 146861 289596 441744 334764 53477 71751 157511
8985A57511J73456l4255j5975j00209k11756n6442J4339L39794N0786j39587l3847
$$ 157511 330967 296712 280737 180528 -31228 -87670 -73331 266463 317249 177662 143815
8974A43815p3500M5788N9271N2050r0452n7908K1622j62836m509J00090O5668
$$ 143815 70315 116103 175374 227424 136972 79064 100686 -62150 -66659 33431 99099
8963I9099N1589P294l4911j34337j92966Q9877L35296o318j89310R9976J39668
$$ 99099 150688 157982 123071 -11266 -204232 -114355 220941 214623 25313 125289 264957
8952B64957R1224j72504j33762M5238J26043m4544j0311J01717N7499q9474P9459
$$ 264957 356181 183677 49915 95153 221196 176652 166341 268058 325557 236083 315542
8941C15542J13174j0089p8498Q3211n2991j07612j25792j11284Q1986L11945J03944
$$ 315542 428716 418627 340129 423340 370349 262737 136945 25661 107647 419592 523536
8930E23536k53387l3865P3650M0705q3990k05194K1924J97024K8041k14659q6154
$$ 523536 270149 236284 309934 350639 266649 61455 83379 280403 308444 93785 7631
8919G631Q1603N5827k1618J81260k1655j41258j43378j67414K418J92781P4108
$$ 7631 89234 145061 123443 304703 283048 141790 -1588 -169002 -166584 26197 100305
8908A00305k0234J22286P1759j91208j60853N6745k9274M5814J33715j6126n3172
$$ 100305 80071 202357 274116 82908 -77945 -21200 -50474 -4660 129055 112929 59757
8897E9757K6413j3519K52607r6859O3224m0962L5185q4707r9286j52014l4454
$$ 59757 86170 72651 325258 228399 291623 250661 285846 201139 101853 -50161 -84615
8886h4615Q3539j4100k7647M0815J53756K5860m1665m7479j31984J26981R4069
$$ -84615 -1076 -15176 -42823 -2008 151748 177608 135943 88464 -43520 83461 177530
8875A77530J28524k57575o6195l8078J81885N7036j05829K11691J57403m4272
$$ 177530 306054 48479 -17716 -55794 126091 183127 77298 288989 446392 402120
8865D02120j52800j60941r4056j0677j14233j30029K96968K60225j01988P5693
$$ 402120 249320 88379 -5677 -16354 -130587 -260616 36352 296577 194589 270282
8855B70282k12422j50627J18317J58843k74174j2450J96910O0281N4801l9466
$$ 270282 57860 -92767 25550 184393 -89781 -102231 94679 154960 209761 170295
8845A70295k2485K5567L992J5435J04536j77461O5138j5793j37971j1002m0829
$$ 170295 147810 173377 177369 192804 297340 119879 185017 169224 31253 20251 -20578
8834b0578j25048K790J16704J11991P8340L4022j00458N1881o6300j87526J11233
$$ -20578 -145626 -142836 -26132 85859 164199 198221 97763 149644 83344 -104182 7051
8823G051J59396j66563L9330m332k6863J50996l8718j42834p3289L1845L1282
$$ 7051 166447 -116 39214 34882 8019 159015 120297 -22537 -95826 -63981 -32699
8812c2699n2477q361J73100R804o0456o5750J5827J23842K78540o7552l08822
$$ -32699 -85176 -93537 79563 89367 28911 -36839 -21012 102830 381370 313818 4996
8801D996j84222L28515P3690m8291r3865L6475k1555l0278M0727j85944j20036
$$ 4996 -179226 149289 222979 174688 80823 117298 95743 65465 106192 -79752 -199788
8790a99788J01090j395l3364o7994J11885M9136J4279N0561L2143j32739m1069
$$ -199788 -98698 -100093 -133457 -201451 -89566 -40430 -26151 24410 56553 -76186 -117255
8779a17255J37826R5609r8012j81902L2520p1924J70818K25391M9061k66102j93686
$$ -117255 20571 116180 18168 -163734 -131214 -203138 -32320 193071 242132 -23970 -217656
8768b17656K20744N6154n3372j9208j38931m688k8455O3689J06508O7619P2337
$$ -217656 3088 59242 5870 -13338 -152269 -156957 -185412 -121723 -15215 52404 124741
8757A24741j8262p7182O3435M3476N4494j11495j15719o6385Q5563R190j05682
$$ 124741 106479 29297 92732 136208 190702 79207 -36512 -102897 -17334 -8144 -113826
8746a13826l2207Q9847p4240j46541m1869j3412O6442J51119L2485M069J59204
$$ -113826 -146033 -56186 -130426 -276967 -318836 -332248 -265806 -114687 -82202 -78133 81071
8735H1071J39281j23682j76430J95255J08722j57084p2298O4205p2216J21244
$$ 81071 220352 96670 -79760 115495 224217 67133 -5165 59040 -13176 108068
8725A08068N8428K9903o98j63497j70451Q275J33264J85284K65881J31212k00431
$$ 108068 166496 196399 195701 32204 -138247 -129972 3292 188576 454457 585669 385238
8714C85238j71766l1804R5534p7703j07364j74141J69582M9561n6177N4264l0149
$$ 385238 213472 181668 277202 199499 92135 -82006 87576 137137 80960 135224 105075
8703A05075J15843M1476o4904j75366n5080J23492K0981j23910P7968O4961J61344
$$ 105075 220918 262394 197490 22124 -32956 90536 111517 -12393 65575 130536 291880
8692B91880J03634j11325j14860L2383j41199l90627k8188K28438J67855Q5684
$$ 291880 395514 284189 169329 201712 60513 -330114 -358302 -129864 37991 123675
8682A23675M3754L455M5358j10553q6783k4901N4203N9710M3134k22877o5472
$$ 123675 167429 170884 216242 105689 18906 -5995 48208 107918 151052 -71825 -137297
8671a37297j35722J28318J81806m335Q0138J0700k14563n1705Q0130R6406j34129
$$ -137297 -273019 -144701 37105 32770 112908 123608 -90955 -142660 -62530 33876 -100253
8660a00253L3253J29655M74j01834l3522Q1858n6948k2355K01956M9816R0607
$$ -100253 -67000 62655 63129 -38705 -72227 9631 -47317 -69672 132284 182100 272707
8649B72707n8034j50195p5777J50447J7914l6430J2740R4280M9936j02138k44615
$$ 272707 214673 64478 -11299 139148 157062 120632 133372 227652 277588 175450 -69165
8638f9165R176O6008o9874m0124J03540n1777k03382J3708n002J28771L35623
$$ -69165 -59989 6019 -63855 -103979 -439 -52216 -255598 -241890 -246892 -118121 217502
8627B17502Q6849j14322R4484j04386k31351M1985J59918J61067l19086l08239
$$ 217502 304351 190029 284513 180127 -51224 -9239 150679 311746 -7340 -315579
8617c15579p4592K64078Q2374j1825J18877K11695p1254j50766Q3917N9457j55957
$$ -315579 -390171 -126093 -43719 -55544 63333 275028 203774 53008 136925 196382 40425
8606D0425p7225P463k4492J96204J80211j2572j42750j39109j29462J68343K28228
$$ 40425 -36800 -29337 -53829 142375 322586 310014 167264 28155 -101307 67036 295264
8595B95264n6960j15776l0742q7770q5378J64306n7000P7028j15867m1580N3978
$$ 295264 238304 122528 91786 4016 -81362 82944 25944 102972 -12895 -54475 -497
8584d97J28800k2609j43253n1889J72208o153j11329o5180J3109J24376O3189
$$ -497 128303 105694 -37559 -89448 82760 76607 -34722 -99902 -86793 37583 100772
8573A00772p3002j71109J12611K17473j43808j26801J59655j84705j34693j95693
$$ 100772 27770 -143339 -30728 186745 42937 -83864 75791 -108914 -243607 -439300
8563d39300j0384n543J34035m3697L4980J38315n6933J7701J96991J23978k18719
$$ -439300 -449684 -455227 -321192 -364889 -329909 -191594 -248527 -230826 -33835 90143 -128576
8552a28576l04912j74920j6483K38913L28710J22891J41216J33543r2357k11003
$$ -128576 -433488 -608408 -624891 -385978 -57268 65623 206839 340382 248025 37022
8542C7022K744J27428K3269J49578J3513l9974J8065n3002k22967l15266q0220
$$ 37022 39766 167194 190463 340041 353554 313580 331645 278643 55676 -259590 -339810
8531c39810L3381j28432J20540K66497K28076J49206M0032J61846L9739j14083
$$ -339810 -306429 -434861 -314321 -47824 180252 329458 369490 531336 571075 456992
8521D56992j61129k22433j3417L20730j4024j71598l7967l6639N7531l7878J34536
$$ 456992 295863 73430 60013 380743 366719 195121 157154 120515 178046 140168 274704
8510B74704O8867l0748o2183n2619o0784n8198p1642J45586K43479L381L9918
$$ 274704 343571 312823 250640 198021 137237 79039 7397 152983 396462 399843 439761
8499D39761j57427j66703k87382q6449K23619k2629J09892R4290j5493r6878k11659
$$ 439761 282334 115631 -171751 -258200 -34581 -57210 52682 146972 131479 34601 -177058
8488a77058J04317J37913M3339N9172k0664J2369m5035p15N8993k3540q9114j96599
$$ -177058 -72741 65172 108511 167683 147019 159388 114353 113638 172631 149091 59977 -136622
8476a36622j26713K4141J40083n9205J28384j489j88380l7020j37499o1063R5490
$$ -136622 -263335 -239194 -99111 -158316 -29932 -31421 -219801 -256821 -394320 -455383 -359893
8465c59893K29810J59112o2153j1895l1433J1281R9434K16472M0950j41155l37223
$$ -359893 -130083 29029 -33124 -45019 -76452 -65171 34263 250735 291685 150530 -186693
8454a86693N1121j7303M5215J60275q7016j23984R7293l3795K3931P7286r991
$$ -186693 -135572 -152875 -107660 52615 -34401 -158385 -61092 -94887 -70956 6330 -3661
8443c661J29669J07547N0107J00594o0429n0905m7909l3711L0578k56013j52047
$$ -3661 126008 233555 283662 384256 323827 272922 225013 191302 221880 -34133 -186180
8432a86180J10843q4014L1808J54865J39094Q7949L3688m7642j43364k0045J90551
$$ -186180 -75337 -159351 -127543 27322 166416 254365 288053 240411 97047 77002 267553
8421B67553J01672j9135p8129k51730j37466M5080J55714N7927j15051j90169
$$ 267553 369225 350090 271961 20231 -117235 -72155 83559 141486 26435 -163734
8411a63734P2950N8165O5585j39946l5839R0291J43030J944o3107J72272J12450
$$ -163734 -90784 -32619 32966 -106980 -142819 -52528 90502 92446 29339 201611 314061
8400C14061j51757j58998L2172N583j39155k8967K00442K95197o8810j82414j24392
$$ 314061 162304 3306 35478 41061 -98094 -127061 73381 368578 299768 117354 -7038
8389g038j19782o3403P7105K6263J67600p9230j63759n7320n2779o3033J55969
$$ -7038 -126820 -190223 -113118 -86855 80745 1515 -162244 -219564 -272343 -335376 -179407
8378a79407J38591L6860O1923R7060J71521p6790j55718j19309l1360O2276N2213
$$ -179407 -40816 -3956 57967 155027 326548 249758 94040 -25269 -56629 5647 57860
8367E7860N1720J34024P3897o6905Q4703J52234j14624k0845n5954r7609Q2105
$$ 57860 109580 243604 317501 250596 335299 487533 372909 352064 296110 198501 280606
8356B80606j39285P9853k3949p584K14334j10039j01560l6304p5471P9275K60976
$$ 280606 141321 221174 197225 189641 403975 293936 192376 156072 80601 159876 420852
8345D20852j86568j59420P9024R4740P8242j73689j30642j23017j13221R610J99660
$$ 420852 234284 74864 153888 248628 326870 153181 22539 -100478 -213699 -204089 -4429
8334d429P0769M90L1310M4035n171j64596K0201O9825j15606j76277J8788J50460
$$ -4429 66340 66830 98140 142175 137004 -27592 -7391 62434 -53172 -229449 -210661 -60201
8322f0201J46160r8707k6269N2293N5469j292j07216R1246Q8212l6378j58648
$$ -60201 85959 -12748 -39017 13276 68745 67453 -39763 51483 139695 103317 -55331
8311e5331k1967Q3115N2600J89357N5695k48050m03977k0650J83016J21678r0768
$$ -55331 -77298 5817 58417 247774 303469 55419 -348558 -369208 -186192 -64514 -155282
8300a55282l8785J46364O1815J27714J32507j32408j05515R549J12806J48875
$$ -155282 -194067 -47703 14112 141826 274333 141925 36410 45959 158765 307640
8290C07640j10734k11545J0548N8118j08459N9174J31677j94778j4859J6115R5900
$$ 307640 196906 -14639 -4091 54027 -54432 4742 136419 -58359 -73218 -57103 38797
8279C8797l1062O6128J9150M7622l2271j62226Q2750Q524j36265J13610J36187
$$ 38797 7735 73863 93013 140635 108364 -53862 28888 37412 -98853 14757 150944
8268A50944p8167j31379j37668r2781K9059j01406N6641J24910J02644M6979J11894
$$ 150944 72777 -58602 -196270 -289051 -259992 -361398 -304757 -179847 -77203 -30224 81670
8257H1670j72221n3019p2952J12564R1120J4575o3475J82454j17937j85181J3914
$$ 81670 -90551 -143570 -216522 -103958 -12838 1737 -61738 120716 2779 -182402 -168488
8246a68488R2940M8432K10390k6105n1198j41637J5548N3553k33894j6522O4525
$$ -168488 -75548 -27116 183274 157169 105971 -35666 -20118 33435 -200459 -216981 -152456
8235a52456p0734j9813J13694M2403l094J45721J90867k3406n2785p6858O3605
$$ -152456 -223190 -243003 -129309 -86906 -90000 55721 246588 223182 170397 93539 157144
8224A57144M286k51336j61954n447j17359J14247J91012l8885j93468r025K13048
$$ 157144 161430 -89906 -251860 -257307 -374666 -260419 -69407 -108292 -301760 -310785 -97737
8213i7737J58474M0835m3655p787j94247O3263J23975K77922J93676j43871j84379
$$ -97737 60737 101572 57917 50130 -144117 -80854 43121 321043 514719 370848 186469
8202A86469r3403M4466k01301j68985N7930J02001R4406O3268j04213k66100J31166
$$ 186469 93066 137532 -63769 -232754 -174824 -72823 21583 84851 -19362 -285462 -154296
8191a54296L9105P1072J67168o3536l33016J3238K54298J00523O0371K7282j40178
$$ -154296 -115191 -44119 123049 59513 -273503 -260265 -5967 94556 154927 182209 42031
8180D2031j15463l9969P8213j44082J26300J05988j24172q9604J00059K21255
$$ 42031 -73432 -113401 -35188 -179270 -52970 53018 -71154 -160758 -60699 160556
8170A60556J24254j05119k85079j16703K23864J13172K40213J87711j76189k38022
$$ 160556 284810 179691 -105388 -222091 1773 114945 355158 542869 366680 128658
8160A28658j07034N6785N7156N9677k39880O3084k84061l00332K5913N9921J43753
$$ 128658 21624 78409 135565 195242 -44638 18446 -265615 -565947 -540034 -480113 -336360
8149c36360J91551L2316m3689M0140q984J08893J37272J7078j61394m0828m6336
$$ -336360 -144809 -112493 -156182 -116042 -125026 -16133 121139 138217 -23177 -64005 -110341
8138a10341j58767j83819k49540J55388K06518j09698J96341K43950J77594j78152
$$ -110341 -269108 -452927 -702467 -547079 -340561 -450259 -253918 -9968 167626 -10526
8128a0526M2639P1312j44469k70785k78815K91593K53846O9109m4397k02807o0168
$$ -10526 32113 103425 -41044 -311829 -590644 -299051 -45205 23904 -20493 -223300 -283468
8117b83468J15786N1783k4934n819l4613j22140l9108j5888J22197R8815J54036
$$ -283468 -167682 -115899 -140833 -146652 -181265 -303405 -342513 -358401 -236204 -137389 16647
8106A6647J34599l2859k21602J2894J10664L0865n6231j0063m6246Q1766o6780
$$ 16647 151246 118387 -103215 -90321 20343 51208 -5023 -15086 -61332 20434 -46346
8095d6346O950N6174j6931q435L1726J33896J08733N9964j83463J1115j14143
$$ -46346 -39396 16778 -153 -8588 23138 157034 265767 325731 142268 153383 39240
8084C9240J28299J9259o6258r8953O8328L23071o3142p7405r7880l9344J5643
$$ 39240 167539 186798 120540 21587 89915 412986 349844 272439 174559 135215 150858
8073A50858q1382j72552J11331j46880j567n632M9701J16623k38747j36428j27678
$$ 150858 69476 -103076 8255 -138625 -140192 -145824 -96123 20500 -218247 -354675 -482353
8062d82353k9450N5607p9194j3567J52688K29885J40639k4235j50785m5282J40551
$$ -482353 -511803 -456196 -535390 -548957 -396269 -166384 -25745 -49980 -200765 -246047 -105496
8051a05496k0642j28262j98640K213J46028J06258j33506R2062K5623J63599R9525
$$ -105496 -126138 -254400 -453040 -450827 -304799 -198541 -332047 -239985 -214362 -50763 48762
8040D8762q9831k03194j29981L27j0076K26619J35096J22799j15009l401m1212
$$ 48762 -41069 -244263 -374244 -373917 -383993 -157374 -22278 100521 -14488 -17889 -59101
8029e9101K05918q5455j45639l049m3174k5624O3493R3028J03809j14944J14502
$$ -59101 146817 61362 -84277 -87326 -130500 -156124 -92631 397 104206 -10738 103764
8018A03764j39446O0053j25930j5259J82440n1080J6358J48727N9709J063k46404
$$ 103764 -35682 24371 -101559 -116818 65622 14542 30900 179627 239336 240399 -6005
8007f005j02247j32525K1062k2764m9214P0024n0435M2457J59141j7184j02779
$$ -6005 -108252 -240777 -219715 -242479 -291693 -221669 -272104 -229647 -70506 -87690 -190469
7996a90469J48273P4866j46523j27739j25553J30564K05498M1875r9314J4649
$$ -190469 -42196 32670 -113853 -241592 -367145 -236581 -31083 10792 -88522 -73873
7986g3873M0836j20757m9296J36546J76171p5668J969l1675k49449p2901m8653
$$ -73873 -33037 -153794 -203090 -66544 109627 33959 35928 4253 -245196 -318097 -366750
7975c66750L55264R5468Q0046j02232j79159l9488l686J27199k0181j91524J62802
$$ -366750 -11486 83982 164028 61796 -117363 -156851 -160537 -33338 -53519 -245043 -82241
7964h2241J69814K9722J34417J73898r9895j81732m6047K1321p8300p8304m5327
$$ -82241 87573 117295 251712 425610 325715 143983 97936 119257 40957 -37347 -82674
7953h2674p1913J1583J76907o4307L3932n1932j26605K357K43067J59007O6535
$$ -82674 -154587 -143004 33903 -30404 3528 -48404 -175009 -172652 70415 229422 295957
7942B95957k13139r9794K2716o7814J12338P2051P9470j9782o1397J74777N5631
$$ 295957 82818 -16976 5740 -62074 50264 122315 201785 182003 120606 295383 351014
7931C51014J62946j435p2600k05659l9393J13887j66101j73809q6282O6352K26349
$$ 351014 513960 512525 439925 234266 194873 308760 142659 -31150 -117432 -51080 175269
7920A75269j86265p9946K59659K4018k32454m4823K73221R0815k08935P1264K65706
$$ 175269 -10996 -90942 168717 192735 -39719 -84542 188679 279494 70559 141823 407529
7909D07529r6249k18560k40003L5829l4442K1765q678k15161q4398J09935K02646
$$ 407529 311280 92720 -147283 -111454 -145896 -124131 -132809 -347970 -432368 -322433 -119787
7898a19787J57813N0673j82673j82690J04149J30981l4177J77051J01348J19346
$$ -119787 38026 88699 -93974 -276664 -172515 -41534 -75711 101340 202688 322034
7888C22034k5632p4190m7272K6225k06232j95676q3912k31416J17421K22715l0168
$$ 322034 296402 222212 174940 201165 -5067 -200743 -284655 -516071 -398650 -175935 -206103
7877b06103R6473L1842J23453j38554o9133R9576p4458m9150j28006N2222M6204
$$ -206103 -109630 -77788 45665 -92889 -162022 -62446 -136904 -186054 -314060 -261838 -215634
7866b15634J8403N8616O7523L1798n038j38814l5695J37016K20406k5164J61142
$$ -215634 -197231 -138615 -71092 -39294 -44332 -183146 -218841 -81825 138581 113417 274559
7855B74559k529p7296J10793p1870j12195J13162q6450j37141n8520O2448j6049
$$ 274559 272030 194734 305527 233657 121462 234624 148174 11033 -47487 14961 -1088
7844a088R4692J66655j06817j131p2733K0754R5161N837n687K4760n7781n191
$$ -1088 93604 260259 153442 152311 79578 100332 195493 201330 195643 220403 162622 157431
7832A57431j17597j36511J9014r0457n1842J13175J20676l8318J67018J19899
$$ 157431 39834 -96677 -77663 -168120 -219962 -106787 13889 -24429 142589 262488
7822B62488k40532r2929m3250M3700P2608J98390p5632m73496j02393L20011L37102
$$ 262488 21956 -70973 -114223 -70523 2085 200475 124843 -348653 -451046 -131035 206067
7811B06067r7674p1134J12161N906l39085k8741J97118K13276k9127l604P4331
$$ 206067 108393 37259 149420 155326 -183759 -212500 -15382 197894 168767 165163 239494
7800B39494m2867K1293j32341l16030j72179K36092M7571l6027j50328J54866
$$ 239494 196627 217920 85579 -230451 -402630 -166538 -118967 -154994 -305322 -150456
7790a50456K28951O7552j32214R9590o7240K53425K25223M3011k29842q3902P3079
$$ -150456 78495 146047 13833 113423 46183 299608 524831 567842 338000 254098 327177
7779C27177m08906k73551j06043O4788J03651m875k55407N7148J98966J18387
$$ 327177 -81729 -355280 -461323 -396535 -292884 -297759 -553166 -496018 -297052 -178665
7769a78665m4456J3848J28923K26113Q1593O5254r2903j30000O1301O1208k88954
$$ -178665 -223121 -209273 -80350 145763 227356 292610 199707 69707 131008 192216 -96738
7758i6738k60208J40593K18409N1020J72603k00003j10095J12560k4617j78138
$$ -96738 -356946 -216353 2056 53076 225679 25676 -84419 28141 3524 -174614
7748a74614M2673j37976j51277J63976K24235j0364l3173r4842j35211J5448m7886
$$ -174614 -131941 -269917 -421194 -257218 -32983 -43347 -76520 -171362 -306573 -291125 -339011
7737c39011j12607L3881P1638J98263K04680Q4343q2042k81703j46321J08632
$$ -339011 -451618 -417737 -346099 -147836 56844 141187 59145 -222558 -368879 -260247
7727b60247J62148M5450r7753R5954P6271r0050j21366M4614O0830J7557q9354
$$ -260247 -98099 -52649 -150402 -54448 21823 -68227 -189593 -144979 -84149 -66592 -155946
7716a55946j0415J58057o9394n2202N8142J67054j61j4498M0413j2598l0682R498
$$ -155946 -166361 -8304 -77698 -129900 -71758 95296 95135 80637 121050 108452 77770 87268
7704H7268J23j49345J797n6355j0703J68879J12896J28869J5965Q2151j87828
$$ 87268 87391 -61954 -60157 -116512 -127215 41664 154560 283429 299394 381545 193717
7693A93717j54478K5748J25438k9922L9920j49692j36408K31307K47213J21424
$$ 193717 39239 64987 190425 160503 200423 50731 -85677 145630 392843 514267
7683E14267j86163m43345j06203J67451J53261J744R996P7513o3275j45207j11073
$$ 514267 328104 -115241 -221444 -53993 99268 101012 111008 188521 125246 -19961 -131034
7672a31034L4259K06676K89009m3155l10703j37046q5508l2067N8334j3970J26180
$$ -131034 -96775 109901 398910 355755 45052 -91994 -177502 -209569 -151235 -165205 -39025
7661c9025O6937n8396m3424M0465q5726r1379l4407J07616K0392K7128j32933
$$ -39025 27912 -30484 -73908 -33443 -119169 -210548 -244955 -137339 -116947 -89819 -222752
7650b22752J4048J64750J55440R7760K39348k22604k21757k2025J03403n1663
$$ -222752 -208704 -43954 111486 209246 448594 225990 4233 -17792 85611 33948
7640C3948j30062j36175K9937m376K5753o0854J64546K7275j36090l625l5954
$$ 33948 -96114 -232289 -202352 -206728 -180975 -241829 -77283 -50008 -186098 -189723 -225677
7629b25677n6826J7028J2462n6846k3178M1165J72499Q1575k2934J78569j0777
$$ -225677 -282503 -265475 -253013 -309859 -333037 -291872 -119373 -37798 -60732 117837 107060
7618A07060q6185k67619r3229J90389R1694J9206m3611M0196O2101n010j32305
$$ 107060 20875 -246744 -339973 -149584 -57890 -38684 -82295 -42099 20002 14992 -117313
7607a17313j4038R637M8409K22767l1776j19811J10305q2054j64662J4725o8081
$$ -117313 -131351 -121714 -73305 149462 117686 -2125 108180 26126 -138536 -123811 -191892
7596a91892M9436J67614j99811j45459L5367p6238j9990K50851j79283j71659
$$ -191892 -142456 25158 -174653 -320112 -284745 -360983 -380973 -130122 -309405 -481064
7586d81064J82948K8963j04171K4887J7250p6945r5409J36607J35827J44343K5544
$$ -481064 -298116 -269153 -373324 -348437 -331187 -408132 -503541 -366934 -231107 -86764 -61220
7575f1220N4736R7785j11468k40410m6443O5245K0506M6723J34361Q9291j24338
$$ -61220 -6484 91301 -20167 -260577 -307020 -241775 -221269 -174546 -40185 49106 -75232
7564g5232o3698J50056P0699l0998n8673Q5634J6332l9372k02843j19143N1648
$$ -75232 -138930 11126 81825 50827 -7846 77788 94120 54748 -148095 -267238 -215590
7553b15590J89819J68218j28135j26145p3138J65440l1184k2175J90945P8048
$$ -215590 -25771 142447 14312 -111833 -184971 -19531 -50715 -72890 118055 196103
7543A96103j28596k51055P7814J40059O1794P5435k70214R2161R5958q2142M907
$$ 196103 67507 -183548 -105734 34325 96119 171554 -98660 -6499 89459 7317 12224
7532A2224K37088Q9615q1310k1085N222j1687n57O4205j04270k56488j35378L0966
$$ 12224 249312 338927 257617 236532 241754 230067 229510 293715 189445 -67043 -202421 -171455
7520a71455r5131R3967J36989J18221J36034j64674j91436k7495Q9815J45571
$$ -171455 -266586 -172619 -35630 82591 218625 53951 -137485 -164980 -75165 70406
7510G0406k0403m3008M2076j79944j47015k19010K78366K28802l1121j05352n0222
$$ 70406 50003 6995 49071 -130873 -277888 -496898 -218532 10270 -20851 -126203 -176425
7499a76425j4594p6060J04792J00232p3565J94075L7444n3181j92068j59067j4161
$$ -176425 -191019 -267079 -162287 -62055 -135620 58455 95899 42718 -149350 -308417 -322578
7488c22578R2770O2310J6864q4709K0023L5901M4037P4689j08908J10941n0052
$$ -322578 -229808 -167498 -150634 -235343 -215320 -179419 -135382 -60693 -169601 -58660 -108712
7477a08712p4517n1019k17785P307O8826r7275J46097J58295J34045p9705k03369
$$ -108712 -183229 -234248 -452033 -444726 -375900 -473175 -327078 -168783 -34738 -114443 -317812
7466c17812l2710O5479K15602J44042j44457k34980J09832R2497J72295L4179
$$ -317812 -350522 -285043 -69441 74601 -69856 -304836 -195004 -102507 69788 103967
7456A03967o2137p7444o8645k4883P4811K06553n086p0165j97353l6400j11845
$$ 103967 41830 -35614 -104259 -129142 -54331 152222 147136 76971 -120382 -156782 -268627
7445b68627k1960J80111j6054J29206J54623J24811j6112l7940q9489J1613j23908
$$ -268627 -290587 -110476 -126530 2676 157299 282110 265998 228058 138569 150182 26274
7434B6274L6558m8144j15675m3776P1978Q8144J75605p7854J0825o7156k08136
$$ 26274 62832 14688 -100987 -144763 -72785 15359 190964 113110 123935 56779 -151357
7423a51357J85332K31359N0688Q5135j49894l03089N5130J40150K07574k12880
$$ -151357 33975 265334 316022 401157 251263 -51826 3304 143454 351028 138148
7413A38148k05615O4832J36576p9419l23093q4130K2828N3004m2063R5028K29988
$$ 138148 -67467 -2635 133941 54522 -268571 -352701 -329873 -276869 -318932 -223904 6084
7402F084Q8871m5826J88690N0938r1182M712k89167p4668L94451M5976j74839
$$ 6084 94955 49129 237819 288757 197575 202287 -86880 -161548 232903 278879 104040
7391A04040K47261J17112l44395j20021N161k5671r1224n2760J33322K1133n3251
$$ 104040 351301 468413 124018 3997 9158 -16513 -107737 -160497 -27175 -6042 -59293
7380e9293k3115N1500r3268j1337m8807J56355J14050k4991l08137q8019J22567
$$ -59293 -82408 -30908 -124176 -135513 -184320 -27965 86085 61094 -247043 -335062 -212495
7369b12495O2486j83724L8431m2737L2897P8534j8419j7077J19944K16212j4575
$$ -212495 -150009 -333733 -295302 -338039 -305142 -226608 -245027 -262104 -142160 74052 59477
7358E9477L5426j2910k2262m9890j42000q3823J30396J93732J16632Q6650j37662
$$ 59477 94903 81993 59731 9841 -132159 -215982 -85586 108146 224778 311428 173766
7347A73766P3033k42984l6375Q2423J5494k19964m8573R6637J79097J13107J0474
$$ 173766 246799 3815 -32560 49863 65357 -154607 -203180 -106543 72554 185661 196135
7336A96135l33443k87843K2482Q4606K8066J31564J16798J90709J2336k42784
$$ 196135 -137308 -425151 -402669 -318063 -289997 -158433 -41635 149074 161410 -81374
7326h1374j45551L3722J55665j39549J42049J69758j21405q0457L1206p7970j03936
$$ -81374 -226925 -193203 -37538 -177087 -35038 134720 13315 -67142 -35936 -113906 -217842
7315b17842K8122J57935J58573k18498r5582J19717J09865r7353J8854K18904
$$ -217842 -189720 -31785 126788 -91710 -187292 -67575 42290 -55063 -36209 182695
7305A82695r1644q682p9398p0272p2288m4418J0544R5471J16354J89854L6739
$$ 182695 91051 82369 2971 -67301 -139589 -184007 -173463 -77992 38362 228216 264955
7294B64955j06951j27827q2665J74148k1041j52775m8936M7998j5802j88888n3280
$$ 264955 158004 30177 -52488 121660 100619 -52156 -101092 -53094 -68896 -257784 -311064
7283c11064J66600L3499J05608O1960m8655R499q4474M8529M5805Q1289j27487
$$ -311064 -144464 -110965 -5357 56603 7948 17447 -67027 -18498 27307 108596 -18891
7272a8891k5092K09621N5163j8820J05574n1969j65887m2235J34315R991j74543
$$ -18891 -43983 165638 220801 201981 307555 255586 89699 47464 181779 191770 17227
7261A7227j46847j80139N3155J59279J5468o755J44240K01305r2460k18874j03885
$$ 17227 -129620 -309759 -256604 -97325 -81857 -88612 55628 256933 164473 -54401 -158286
7250a58286r466J06163R4595N9150k5915j68777n6747j52219o4703N9977Q2749
$$ -158286 -167752 -61589 33006 92156 66241 -102536 -159283 -311502 -376205 -316228 -233479
7239b33479R8993J44268K23858J29369K08421q9171l59064l01272j5543n2046
$$ -233479 -134486 9782 233640 363009 571430 482259 123195 -178077 -193620 -245666
7229b45666p809Q1848J60564l6938j884J08419Q2911o4194k48759j73181Q9769
$$ -245666 -253475 -171627 -11063 -48001 -49885 58534 141445 77251 -171508 -344689 -254920
7218b54920J15032j23180M0972L07173o6849n4031J6438k9185K7400J4891J98402
$$ -254920 -139888 -263068 -222096 85077 18228 -35803 -19365 -48550 -21150 -6259 192143
7207A92143p6143l62R9761K5892o3437j53383M5843J53209P0821N4316O7696k30185
$$ 192143 116000 115638 215399 241291 177854 24471 70314 223523 294344 348660 416356 186171
7195A86171j30309p4241j15719j821J31641K31486K9813j406j19079R0400R518
$$ 186171 55862 -18379 -134098 -135919 -4278 227208 257021 255615 136536 226936 236454
7184B36454j63869j59780J60141R2329p0917n0198j35497J0899J98351J25350
$$ 236454 72585 -87195 72946 165275 94358 44160 -91337 -80438 117913 243263
7174B43263n4006j92317k69611o9623J27224J57919J42763K9472J08799p0551
$$ 243263 189257 -3060 -272671 -342294 -215070 -57151 85612 115084 223883 153332
7164A53332M3416j85411k18632J05870q3951j31396j00772k0467J11176K12340
$$ 153332 196748 11337 -207295 -101425 -185376 -316772 -417544 -438011 -326835 -114495
7154a14495M0864Q5021j26017k23666J56116K42317K50594K0710j28675k08002
$$ -114495 -73631 11390 -114627 -338293 -182177 60140 310734 331444 202769 -5233
7144e233p8438J39069O974k01350J80105K33394r5832M5077L8261k19889L1127
$$ -5233 -83671 55398 62372 -138978 41127 274521 178689 223766 262027 42138 73265
7133G3265r3345n6695m8951m7683L8298n5008l6518p371J16015J61580j24054
$$ 73265 -20080 -76775 -125726 -173409 -135111 -190119 -226637 -234008 -117993 43587 -80467
7122h0467r047q1085j19631K9106o0158p0204K8232J45893L5254m8350r8156J4817
$$ -80467 -89514 -170599 -290230 -261124 -321282 -391486 -363254 -217361 -182107 -230457 -328613 -313796
7110c13796M0274q0932O7421J01762K1975n6550k73834J01047J07128J68436K1742
$$ -313796 -273522 -354454 -287033 -185271 -163296 -219846 -493680 -392633 -285505 -117069 -95327
7099i5327r1212Q2275K68828J40686j50597J4861Q3692q4273o7107Q745M0303
$$ -95327 -186539 -104264 164564 305250 154653 169514 253206 168933 101826 110571 150874
7088A50874J1091l0447o0296p3731q0695l3132L1026K20879j83242j46883J13730
$$ 150874 161965 131518 71222 -2509 -83204 -116336 -85310 135569 -47673 -194556 -80826
7077h0826m7427j81752R5736p410J45766l6900j36406Q8818L2195J0622n8856
$$ -80826 -128253 -310005 -214269 -221679 -75913 -112813 -249219 -160401 -128206 -117584 -176440
7066a76440l1762j61857R2384j7237R9553K23287K9779j22509j41524p5622J8362
$$ -176440 -208202 -370059 -277675 -294912 -195359 27928 57707 -64802 -206326 -281948 -263586
7055b63586J0777N7819p169O3306j48861j04937J54186J02245j1540L07032J63327
$$ -263586 -252809 -194990 -202159 -138853 -287714 -392651 -238465 -136220 -147760 159272 322599
7044C22599j3644k55256p2438J13953N1458k9190J41900Q613j38337P2231K54864
$$ 322599 308955 53699 -18739 95214 146672 117482 259382 267995 129658 201889 456753
7033D56753J1930J60688n6242k65063o9273J77094j3194k07176j97379L9219n1524
$$ 456753 468683 629371 573129 308066 238793 415887 402693 195517 -1862 37357 -14167
7022a4167p6164n5299N598L7748J1093K10125K1902k15543j31987R5456J39488
$$ -14167 -90331 -145630 -140032 -102284 -91191 118934 140836 -74707 -206694 -111238 28250
7011B8250J4254k1266l7867Q8608P3948k9135J86535J2795j08551p8224n5568
$$ 28250 42504 21238 -16629 71979 145927 116792 303327 316122 207571 129347 73779
7000G3779k5133r8685p2910o0788J00638Q4292p769J89694j72111j03477L3434
$$ 73779 48646 -50039 -122949 -183737 -83099 1193 -6576 183118 11007 -92470 -59036
6989e9036J51508J19853k86703K265K3619k4143j91409r4242r020J53180K22705
$$ -59036 92472 212325 -74378 -72113 -48494 -72637 -264046 -358288 -367308 -214128 8577
6978H577K63751j04285k5750J27794m3490m901N3836L1264k01043N2070J03816
$$ 8577 272328 168043 142293 270087 226597 221696 275532 306796 105753 157823 261639
6967B61639j8253l69872l37048j34013L4063J78230J64358m0764m9118J21011
$$ 261639 243386 -126486 -463534 -597547 -563484 -385254 -220896 -261660 -310778 -189767
6957a89767J55681o4941j6046O1015P3030J55512J15483n7421p3961j94945k94509
$$ -189767 -34086 -99027 -115073 -54058 18972 174484 289967 232546 158585 -36360 -330869
6946c30869K1847j8150l9332M1351K49822J28832m2944J75967J373j49426p1565
$$ -330869 -309022 -327172 -366504 -325153 -75331 53501 10557 186524 187897 38471 -33094
6935c3094j20224n1169J87749m6646o3328p7740p0027J53948J35158k36106O5885
$$ -33094 -153318 -204487 -16738 -63384 -126712 -204452 -274479 -120531 14627 -221479 -155594
6924a55594O6516n1130N1720O5449j56684l9098L988J45132q1880q1210R1458
$$ -155594 -89078 -140208 -88488 -23039 -179723 -218821 -214833 -69701 -151581 -232791 -141333
6913a41333Q5136k1178r0185K2987J63388Q2722j97597k6550j02760P2296J32677
$$ -141333 -56197 -77375 -167560 -144573 18815 101537 -96060 -122610 -225370 -153074 -20397
6902b0397j0103p5489N2178j98497R2654K34007K54875q8862l78171o8572Q9668
$$ -20397 -30500 -105989 -53811 -252308 -159654 74353 329228 240366 -137805 -206377 -116709
6891a16709J75163m9810j99081p9544J44445M6848n3599J46188J45062M2687N9316
$$ -116709 58454 8644 -190437 -269981 -125536 -78688 -132287 13901 158963 201650 260966
6880B60966N2972j33431j82071o0455Q3156Q2639l8656q8313j7152J38330J56847
$$ 260966 313938 180507 -1564 -62019 21137 103776 65120 -23193 -40345 97985 254832
6869B54832M5517r8237N3265j0356m4894o0529k09185k93928J01668J23717J06910
$$ 254832 300349 202112 255377 245021 200127 139598 -69587 -363515 -261847 -138130 -31220
6858c1220j867o4531N387J38863R8029Q2694l5576m2129l19143j77199Q4057Q9758
$$ -31220 -33087 -97618 -92231 46632 144661 227355 191779 149650 -169493 -346692 -262635 -172877
6846a72877J12220J73751J40365k19920q3213r2327l1854r2984K7646J86965q452
$$ -172877 -60657 113094 253459 33539 -49674 -142001 -173855 -266839 -239193 -52228 -60680
6835f0680j30453j30857M3133M7708J94076O4291m4866m6965J54023L0916p7523
$$ -60680 -191133 -321990 -278857 -231149 -37073 27218 -17648 -64613 89410 120326 42803
6824D2803j7680k19991l8393Q5950O244j34808n7435l784J52153K33147J09234
$$ 42803 25123 -194868 -233261 -147311 -141067 -275875 -333310 -337094 -184941 48206 157440
6813A57440j01624j79613r5182J00915J60692J16641J38134R0140j00242j4164
$$ 157440 55816 -123797 -218979 -118064 42628 159269 297403 387543 287301 273137
6803B73137N9469r5496k9680j3646O8298k37995k13027P4196J28864J30582J18043
$$ 273137 332606 237110 207430 193784 262082 24087 -188940 -114744 14120 144702 262745
6792B62745J20113j20195l1641o9678J08467r503m8583j22078o7805k6171N4810
$$ 262745 382858 262663 231022 161344 269811 260308 211725 89647 21842 -4329 50481
6781E0481q32M213j15525l4538J5966L0357J24720J3225m5829o525o3021J25727
$$ 50481 49649 53862 -61663 -96201 -80235 -49878 74842 88067 42238 35713 -27308 98419
6769I8419J72058N0372j16496k48682o8161R5016L8767J95857K77323k13861j40222
$$ 98419 270477 320849 204353 -44329 -112490 -17474 21293 217150 494473 280612 140390
6758A40390o8573l9014P854O0146J49080k46650j87876q2120J1754r1874p6638
$$ 140390 71817 32803 40657 100803 249883 3233 -184643 -266763 -255009 -346883 -423521
6747d23521l9685Q7154J14094k24906j4459J89124K56356P0544r8241O4563J70428
$$ -423521 -463206 -376052 -261958 -486864 -501323 -312199 -55843 14701 -83540 -18977 151451
6736A51451J28247M4537M3826J8150r1839j82548q6897j14204Q5265J96693k42569
$$ 151451 279698 324235 368061 386211 294372 111824 24927 -89277 -4012 192681 -49888
6725d9888j03906J22224N2744q1259J75342K29401J42271o2188r1621p579o0228
$$ -49888 -153794 -31570 21174 -60085 115257 344658 486929 424741 333120 325541 265313
6714B65313o6843n391n8842n2150k96977j8747J33604r1151r2027L5756Q0383
$$ 265313 198470 193079 134237 82087 -214890 -233637 -100033 -191184 -283211 -247455 -167072
6703a67072O0283j26573k5347J89252K21153J19579j16777r0335J24593j8101
$$ -167072 -106789 -233362 -258709 -69457 151696 271275 154498 64163 188756 170655
6693A70655M071j3335k87135j34601j35721J27470J85400j39271N477K13048K34103
$$ 170655 174726 161391 -125744 -260345 -396066 -268596 -83196 -222467 -216990 -3942 230161
6682B30161J90259k61868j29135K6286K0042j77561K8538Q7981J35651m7866q8219
$$ 230161 420420 158552 29417 55703 75745 -101816 -73278 14703 150354 102488 14269
6671A4269J36441R149m0863j97389p1675M2787K3358q7570p1140R2059k209O3898
$$ 14269 150710 159859 118996 -78393 -150068 -107281 -83923 -171493 -242633 -150574 -152783 -88885
6659h8885J00874o5559P674q9925J47897P583O0402O3946O5862r3374l5045r3843
$$ -88885 11989 -53570 -45896 -135821 12076 19659 80061 144007 209869 116495 81450 -12393
6647a2393J07298J43991k05808j46238J1895J80902R0486j54350j74907O4942
$$ -12393 94905 238896 33088 -113150 -101255 79647 170133 15783 -159124 -94182
6637i4182o5161l1361J09808J73945J41255n8279j56668k68927j64744K70238
$$ -94182 -159343 -190704 -80896 93049 234304 176025 19357 -249570 -414314 -144076
6627a44076K5080P8384J7543K5255J26599J45873n3719N0417Q4153j34584J30867
$$ -144076 -118996 -40612 -23069 2186 128785 274658 220939 271356 355509 220925 351792
6616C51792k2077k44739n7660N8833J2263q1753p100J29217K7087j06555k08447
$$ 351792 329715 84976 27316 86149 98412 16659 9559 138776 165863 59308 -149139
6605a49139j03069o1529j15636K0647K4371J32209K80800J49127k9322K12015
$$ -149139 -252208 -313737 -429373 -408726 -384355 -252146 28654 177781 148459 360474
6595C60474j88636j81577N1664r0974Q7282J60300M4354j40915q3172r074K00195
$$ 360474 171838 -9739 41925 -49049 38233 198533 242887 101972 18800 9726 209921
6584B09921l8542j58925j83218k3671M6991J36709J26463N3985K104Q1338Q509
$$ 209921 171379 12454 -170764 -194435 -147444 -10735 115728 169713 171817 253155 261664
6573B61664j16477j78959L8782L935J07651Q6319q0864n9859j7796l4917J2610
$$ 261664 145187 -33772 5010 8945 116596 202915 122051 62192 44396 9479 22089
6562B2089l45582N3114L6950L6938M7179K3474R7942Q4438k3681k07679j49282
$$ 22089 -323493 -270379 -233429 -196491 -149312 -125838 -27896 56542 32861 -174818 -324100
6551c24100J9832n674o7199O352J05854n3541K5852j01840K6211J76749l8431
$$ -324100 -304268 -309942 -377141 -370789 -264935 -318476 -292624 -394464 -368253 -191504 -229935
6540b29935J69799J30815k59591r3132j3724M0872K9182O5884J82120k34369j15926
$$ -229935 -60136 70679 -188912 -282044 -295768 -254896 -225714 -159830 22290 -212079 -328005
6529c28005J29781O0850K55142J18002J60563j27592k26205m4658J8617r2985
$$ -328005 -198224 -137374 117768 235770 396333 268741 42536 -2122 16495 -76490
6519g6490n4147J53592J55366K8609j37359m1538K4239j73410J97859J2212j23019
$$ -76490 -130637 22955 178321 206930 69571 28033 52272 -121138 76721 88933 -34086
6508c4086j06492Q5890N4335j69547P4239p0430j53191J2729j16403J99016j7967
$$ -34086 -140578 -54688 -353 -169900 -95661 -166091 -319282 -306553 -422956 -223940 -241907
6497b41907P4452K83400l9806j60666j02242j4891N1373q894J1054J33241k6726
$$ -241907 -167455 115945 76139 -84527 -186769 -201660 -150287 -159181 -148127 -14886 -41612
6486d1612q8840j5413Q5504m6459o3406J34510J60985j99341j42730j02022R5117
$$ -41612 -130452 -145865 -60361 -106820 -170226 -35716 125269 -74072 -216802 -318824 -223707
6475b23707j09991P2560O5653R0031R5912J51571J58394j52613j23022O5749p9597
$$ -223707 -333698 -261138 -195485 -105454 -9542 142029 300423 147810 24788 90537 10940
6464A0940N0241o6707L7945j3941j11010p3688K9696j59823r5015J3142Q7643
$$ 10940 61181 -5526 32419 18478 -92532 -166220 -136524 -296347 -391362 -378220 -290577
6453b90577J36496P2453J47560J27646J7539r3678o6589j34161j82658o1763L3834
$$ -290577 -154081 -81628 65932 193578 211117 117439 50850 -83311 -265969 -327732 -293898
6442b93898k8552J03708J97818n8506m9722l9988J28469j74653n131J58851k1705
$$ -293898 -322450 -218742 -20924 -79430 -129152 -169140 -40671 -215324 -220455 -61604 -83309
6431h3309j98212R5727R5948R0472j5124r1905L2293Q2234p991M7768N7578K14
$$ -83309 -281521 -185794 -89846 626 -14498 -106403 -74110 8124 133 47901 105479 105693
6419A05693q6127J41614n8478l03789j00540M9485O1208n9238o8690M6665r8250
$$ 105693 19566 161180 102702 -201087 -301627 -252142 -190934 -250172 -318862 -272197 -370447
6408c70447p5495K11645L6075j52611o6889L1681j20101J25323K91196L0091q5956
$$ -370447 -445942 -234297 -198222 -350833 -417722 -386041 -506142 -380819 -89623 -59532 -145488
6397a45488J14946m5697p2141n0195j98601o203L07486L82974O6572m7739n591
$$ -145488 -30542 -76239 -148380 -198575 -397176 -403379 -95893 287081 353653 305914 300323
6386C00323P022q4917l6232o4356j47219r6322Q2776O2940l5476J51797r467j08931
$$ 300323 307345 222428 186196 121840 -25379 -121701 -38925 24015 -11461 140336 130869 21938
6374B1938J7228P2934k8227j19963O1129q6789J52112L6142r2918O9496K6432
$$ 21938 39166 112100 83873 -36090 25039 -61750 90362 126504 33586 103082 129514
6363A29514O2238j08942l8079J08913J04531j57909l8093M5849p6805J50238j66266
$$ 129514 191752 82810 44731 153644 258175 100266 62173 108022 31217 181455 15189
6352A5189p0098l0057o5387J05543j2893j86588m3687K00963q9284R3410K54311
$$ 15189 -54909 -84966 -150353 -44810 -57703 -244291 -287978 -87015 -176299 -82889 171422
6341A71422l0618j09292r8621P6758J55069K29953r7045k62061o3088j45269p5824
$$ 171422 140804 31512 -67109 9649 164718 394671 297626 35565 -27523 -172792 -248616
6330b48616J03644j0793r5448Q9279J56693j60103n3484J22621r897n5606J08143
$$ -248616 -144972 -155765 -251213 -161934 -5241 -165344 -218828 -96207 -106104 -161710 -53567
6319e3567J4651L0971l8008j05119j8248j39804k31378K34939R0976J25400K45712
$$ -53567 -38916 -7945 -45953 -151072 -169320 -309124 -540502 -305563 -214587 -89187 156525
6308A56525j33344m3451K06819L43373k7950k04573k59212k58475j21431K20595
$$ 156525 23181 -20270 186549 529922 501972 297399 38187 -220288 -341719 -121124
6298a21124O4946r3485l14594P54K29492j07495j61358K41227R3544j35390L3055
$$ -121124 -56178 -149663 -464257 -463503 -234011 -341506 -502864 -261637 -168093 -303483 -270428
6287b70428q9447R3052J37775m7967N4927J33545k09122P013q8383L3915L2243
$$ -270428 -359875 -266823 -129048 -177015 -122088 11457 -197665 -190652 -279035 -245120 -212877
6276b12877Q847j6915J12303l7071K1095P1706Q6261j00574N4944L1837j11464
$$ -212877 -204030 -220945 -108642 -145713 -124618 -52912 33349 -67225 -12281 19556 -91908
6265i1908K33629P8355j49445k03703j83881P2826P4632N6131Q0597R6351j4099
$$ -91908 141721 220076 70631 -133072 -316953 -244127 -169495 -113364 -32767 63584 49485
6254D9485J51849j96423k48992j68824P4175M9346J7334J40263J37340n2932R0744
$$ 49485 201334 4911 -244081 -412905 -338730 -289384 -272050 -131787 5553 -47379 43365
6243D3365p0959O1355J36783j33725N9581P9653J05397O8497k98674k90610k6851
$$ 43365 -27594 33761 170544 36819 96400 176053 281450 349947 51273 -239337 -266188
6232b66188J15345j18417j9688J69764N2540N6570k73471m9081p7725K73670K45934
$$ -266188 -150843 -269260 -288948 -119184 -66644 -10074 -283545 -332626 -410351 -136681 109253
6221A09253O1060j94568K8300M3989K2036j40426L7888n1810j26852o2453J11017
$$ 109253 170313 -24255 4045 48034 70070 -70356 -32468 -84278 -211130 -273583 -162566
6210a62566P2402J31719j89043k81676J22887J09940J38740q9510J2437R2426
$$ -162566 -90164 41555 -147488 -429164 -306277 -196337 -57597 -147107 -134670 -42244
6200d2244J54967n886k10306k8421J76463J12742p6465j71348j33141J67085r7529
$$ -42244 112723 106837 -103469 -131890 44573 157315 80850 -90498 -223639 -56554 -154083
6189a54083o9571J35559J38979M3989J2319l3438L1364K4691l5994j10469j2712
$$ -154083 -223654 -88095 50884 94873 107192 73754 105118 129809 93815 -16654 -29366
6178b9366o1505n316J14480J82677K7751j23207j47288l10427J18057J88036L9185
$$ -29366 -90871 -96187 18293 200970 228721 105514 -41774 -352201 -234144 -46108 -6923
6167f923j67072j34269P7131J80919J22089j90005P2497n4437o5287j49855K36040
$$ -6923 -173995 -308264 -231133 -50214 71875 -118130 -45633 -100070 -165357 -315212 -79172
6156g9172J49589O241r1646p0160l8911o7405n2596j10375J3967J21481p7376
$$ -79172 70417 76658 -14988 -85148 -124059 -191464 -244060 -354435 -340468 -218987 -296363
6145b96363L9294M886N4568K33002J44438J4597n0116j04636k87270j23381O8380
$$ -296363 -257069 -252183 -197615 35387 179825 194422 144306 39670 -247600 -370981 -302601
6134c02601O7861P5795q0194L9959l5266j58310J10905K41315J04374n9758k536
$$ -302601 -234740 -158945 -239139 -199180 -234446 -392756 -281851 -40536 63838 4080 1544
6123A544J86461q1310k14691j44522K7512J14558J6771o1799j0682M0529j3990
$$ 1544 188005 106695 -107996 -252518 -225006 -110448 -93677 -155476 -166158 -125629 -139619
6112a39619Q3330q5370k69604N8322K61886J27552k14850r3976O8340J81106j859
$$ -139619 -56289 -141659 -411263 -352941 -91055 36497 -178353 -272329 -203989 -22883 -24742
6101b4742j32846n0920Q2767J16506O5022q0256j82847K08453O6724k2899N5671
$$ -24742 -157588 -208508 -125741 -9235 55787 -24469 -207316 1137 67861 44962 100633
6090A00633r9864p5144k860J6769K5422K97790J16663q6476m5543k6041j74231
$$ 100633 769 -74375 -77235 -60466 -35044 262746 379409 292933 247390 221349 47118
6079D7118N796J22966j2450k08027J9544J71321J28406j68227r1200j29355j21213
$$ 47118 52914 175880 163430 -44597 -25053 146268 274674 106447 15247 -114108 -235321
6068b35321l0190J80017K39118J89297r9689p7705N1656k64054j96894k26911
$$ -235321 -265511 -85494 153624 342921 243232 165527 217183 -46871 -243765 -470676
6058d70676K84879J08178k0679J4333p3301j575P6277J75194O4018j50436j46398
$$ -470676 -185797 -77619 -98298 -83965 -157266 -158841 -82564 92630 156648 6212 -140186
6047a40186K0991L8531m2361J13812J8883P8535L2658j45331j619l028Q2169n5085
$$ -140186 -119195 -80664 -123025 -9213 9670 88205 120863 -24468 -26087 -29115 53054 -2031
6035b031n4536n8783Q2442p7756o6254m8479o2884R8179Q137K30701l6386j5790
$$ -2031 -56567 -115350 -32908 -110664 -176918 -225397 -288281 -190102 -181965 48736 12350 -3440
6023c440p0616K2798J06549j5252q9147K8200Q1264k1403L1264K6566m8763k2245
$$ -3440 -74056 -51258 55291 40039 -49108 -20908 60356 38953 70217 96783 48020 25775
6011B5775j86488O3522J50555j34564J19531Q7933q584p0790r5095k1450M1476
$$ 25775 -160713 -97191 53364 -81200 38331 126264 117680 46890 -48205 -69655 -28179
6000b8179n1303p2041n9525J19578O2874k36300q3298N8071R3918M1174o9788
$$ -28179 -79482 -151523 -211048 -91470 -28596 -264896 -348194 -290123 -196205 -155031 -224819
5989b24819k2346O7875J07012K82370K18612N3139j05437l3861j07063J21121
$$ -224819 -247165 -179290 -72278 210092 428704 481843 376406 342545 235482 356603
5979C56603J6699j76204k84683j03361J74252J09501O1897R6277Q4143k48310
$$ 356603 373302 197098 -87585 -190946 -16694 92807 154704 250981 335124 86814
5969H6814L0133M925J4765N3212j57464n9714j22230l4837J85557o8100P2705
$$ 86814 116947 121872 136637 189849 32385 -27329 -149559 -184396 1161 -66939 5766
5958E766P1964N4155K99441J16885o5203r1478r4063j08446q0787j03402j50813
$$ 5766 77730 131885 431326 548211 483008 391530 297467 189021 108234 4832 -145981
5947a45981j50643q0191R531m4412j8294J63404K50979J61244Q0376o9794n497
$$ -145981 -296624 -376815 -367284 -411696 -429990 -266586 -15607 145637 226013 156219 150722
5936A50722M1424j78355j15109l1536p7851J9918J33072M8046J11488n1003k65443
$$ 150722 192146 13791 -101318 -132854 -210705 -190787 -57715 -9669 101819 50816 -214627
5925b14627n6835J22767J23024N9444J32851J03557Q052j29388j42052r6381J16974
$$ -214627 -271462 -148695 -25671 33773 166624 270181 278233 148845 6793 -89588 27386
5914B7386J01664p4430n1382j67328K54636J90966j5348p4095j09667m4934p7446
$$ 27386 129050 54620 3238 -164090 90546 281512 266164 192069 82402 37468 -39978
5903c9978J33544J04741R5527k34215j57902N5057m7967j3752j35924q193P4841
$$ -39978 93566 198307 293834 59619 -98283 -43226 -91193 -104945 -240869 -249062 -174221
5892a74221j67844k21486K36810J95348K02898K53071l8006k48129j14938K99922
$$ -174221 -342065 -563551 -326741 -131393 71505 324576 286570 38441 -76497 223425
5882B23425J7886r4185n4499j07032K17752K73627j0825j95523j64240j30140
$$ 223425 241311 147126 92627 -14405 203347 476974 466149 270626 106386 -23754
5872b3754R1515n3850M298j35010j91296l9467K04499N3300n4901r0023O9368
$$ -23754 67761 13911 18209 -116801 -308097 -347564 -143065 -89765 -144666 -234689 -165321
5861a65321L9701L0830P7161n3080M3315j44257J38571m3634k07015M1732J33453
$$ -165321 -125620 -94790 -17629 -70709 -27394 -171651 -33080 -76714 -283729 -241997 -108544
5850a08544r6281k9651J68228J68334n8736N0160J05234q2872L1435r5349r5087
$$ -108544 -204825 -234476 -66248 102086 43350 93510 198744 115872 147307 51958 -43129
5839d3129k2954L2273N326n6313J72956O9076o3692j74793M7553K152j15068j24028
$$ -43129 -66083 -33810 -28484 -84797 88159 157235 93543 -81250 -33697 -31545 -146613 -270641
5827b70641J00614J81396k4211r5687O7161j18893P8614k3487p8521K41451K3035
$$ -270641 -170027 11369 -12842 -108529 -41368 -160261 -81647 -105134 -183655 57796 80831
5816H0831j20262j43424O4963N1023p3667q2315R0755P4007n1577j16817o8229
$$ 80831 -39431 -182855 -117892 -66869 -140536 -222851 -132096 -58089 -109666 -226483 -294712
5805b94712j32054J19851K70013K17571j86798L6620J64769j46855m636J29691
$$ -294712 -426766 -306915 -36902 180669 -6129 30491 195260 48405 43769 173460
5795A73460O6503L767k90145J32582r2043j42238J33287K55277k5575J45926k7922
$$ 173460 239963 243730 -46415 86167 -5876 -148114 -14827 240450 214875 360801 332879
5784C32879J4204j9389k61623q8294J74627q2557j31392M4899m9765O8122P4675
$$ 332879 347083 327694 66071 -22223 152404 69847 -61545 -16646 -66411 1711 76386
5773G6386O7615O9789k31149j59396P0220n3833j12198O8401K26768N7082O8898
$$ 76386 144001 213790 -17359 -176755 -106535 -160368 -272566 -204165 22603 79685 148583
5762A48583j56034J14879N8839k6244j85774m8316l4482R0770k17932Q4842P0943
$$ 148583 -7451 107428 166267 140023 -45751 -94067 -128549 -37779 -255711 -170869 -99926
5751i9926j62704L0768J68112q0621K472J04045K1853j44085j50385p7437N7328
$$ -99926 -262630 -231862 -63750 -144371 -141899 -37854 -16001 -160086 -310471 -387908 -330580
5740c30580K33121k1673n6209m8230L2819J2717N1247N2871j78667j75013K09258
$$ -330580 -97459 -119132 -175341 -223571 -190752 -178035 -126788 -73917 -252584 -427597 -218339
5729b18339O9482J12113M7608M7820R2754K34783n2020k18427j75654J48l4610
$$ -218339 -148857 -36744 10864 58684 151438 386221 334201 115774 -59880 -59732 -94342
5718i4342m3456K47945J3423j9233l9439R5545K0737m7827j70405l10540p5942
$$ -94342 -137798 110147 123570 104337 64898 160443 181180 133353 -37052 -347592 -423534
5707d23534L4131j0537L08265Q5916j07464j40978J09275K59736j23733j1499
$$ -423534 -389403 -399940 -91675 -5759 -113223 -254201 -144926 114810 -8923 -20422
5697b0422K6119Q3829n2340j85592l84400j5378k5671R1761K33305O4655N8780
$$ -20422 5697 89526 37186 -148406 -532806 -548184 -573855 -482094 -248789 -184134 -125354
5686a25354j44914j07574j799n1488J17777K80657J57812K83106k7162l2367J67579
$$ -125354 -270268 -377842 -379641 -431129 -313352 -32695 125117 408223 381061 348694 516273
5675E16273j6962q6828L841j35984j00596p2183q5844j61939J21542n2213j56367
$$ 516273 499311 412483 416324 280340 179744 107561 21717 -140222 -18680 -70893 -227260
5664b27260L3485K7210J8954J35568q0708p3258J10944K01084K04220q0917l34514
$$ -227260 -193775 -166565 -147611 -12043 -92751 -166009 -55065 146019 350239 269322 -65192
5653f5192j41650O3640J3324N5879K12624j5718L4742q2055o8015j72556k8040
$$ -65192 -206842 -143202 -129878 -73999 138625 122907 157649 75594 7579 -164977 -193017
5642a93017M6864q2566j40353J16444N8331j42797J1470J23990J14300K8430p5217
$$ -193017 -146153 -228719 -369072 -252628 -194297 -337094 -325624 -201634 -87334 -58904 -134121
5631a34121o2949l5756j52265L2199Q2280N4460O2230J7281J14657n356J12220
$$ -134121 -197070 -232826 -385091 -352892 -270612 -216152 -153922 -136641 -21984 -27340 84880
5620H4880O681j69832n3734L8801M9543M8198o4031q8402n7076M4511K38915n2031
$$ 84880 91561 -78271 -132005 -93204 -43661 4537 -59494 -147896 -204972 -160461 78454 26423
5608B6423r3598j5659O9933j36653J39914J72873o1702K0160q7710J17196j14867
$$ 26423 -67175 -82834 -12901 -149554 -9640 163233 101531 121691 33981 151177 36310
5597C6310o0105Q7614J25421P1785j58578j15514J5870J86095q1155J7568p1260
$$ 36310 -23795 63819 189240 261025 102447 -13067 2803 188898 107743 125311 54051
5586E4051J2566n6592j70468j82222K77935J20934n7113k0252n5973m3565j95307
$$ 54051 66617 10025 -160443 -342665 -64730 56204 -909 -21161 -77134 -120699 -316006
5575c16006J98748J37053K33595k42841k07516L1171J96226Q2786J12150n1049
$$ -316006 -117258 19795 253390 10549 -196967 -165796 30430 113216 225366 174317
5565A74317o2070P775J2694K12904q4335l40753j96382R7572J18832J24146j958
$$ 174317 112247 120022 132716 345620 261285 -79468 -275850 -178278 -59446 64700 62742
5554F2742Q2592L4811K7791q0043n5730R15J37066l7213j57919M7504j59105o1791
$$ 62742 145334 180145 207936 127893 72163 73078 210144 172931 15012 62516 -96589 -158380
5542a58380J04443q648k70535o9642K32325K72857L0438k36814r7469P9495J54257
$$ -158380 -53937 -62585 -333120 -402762 -170437 102420 132858 -103956 -201425 -121930 32327
5531C2327M7905J65549k39722j25031L39146O0855J9601n946n8341q1116j14302
$$ 32327 80232 245781 6059 -118972 220174 281029 300630 294684 236343 155227 40925
5520D0925n2324J25206l8920o265J07975m6426j04437M6769o441n1715j97503
$$ 40925 -11399 113807 74887 68622 176597 130171 25734 72503 66062 14347 -183156
5509a83156k3134J07955J0732j29268j4253J83091p9562k91207n018Q6399l3700
$$ -183156 -206290 -98335 -87603 -216871 -231124 -48033 -127595 -418802 -423820 -337421 -371121
5498c71121O843l9822J58153J89068r690j17133Q1253r6753j66188K0971K14613
$$ -371121 -364278 -404100 -245947 -56879 -66569 -183702 -102449 -199202 -365390 -344419 -129806
5487a29806O8611l4710p9012j20454j98001J02283L43875k01772j40582k9974
$$ -129806 -61195 -95905 -174917 -295371 -493372 -391089 -47214 -248986 -389568 -419542
5477d19542q3451k8098Q3917J11317J95378r4508M8323J42880K4798P1501J2902
$$ -419542 -502993 -531091 -447174 -335857 -140479 -234987 -186664 -43784 -18986 52515 65417
5466F5417r0771p5578Q1076L202M0353J00333J27375j36210O6453N4358R9968
$$ 65417 -25354 -100932 -19856 -16654 23699 124032 251407 115197 181650 236008 335976
5455C35976o4196J4141j99784j65789J20506L3572J8091J22995l33j25057k4662
$$ 335976 271780 285921 86137 -79652 40854 74426 92517 215512 215179 90122 65460
5444F5460k1117j1135j137J18777K0589j79276J35403N4038j29554J04852Q4274
$$ 65460 44343 33208 32071 150848 171437 -7839 127564 181602 52048 156900 241174
5433B41174j11555j6012o172n5024P3159K499K03210k4353m3612n0028K3218p7407
$$ 241174 129619 113607 107435 52411 125570 128069 331279 306926 263314 213286 236504 159097
5421A59097j3225k4778j3920J24187J33766j42179k52024l03883k09372J86959
$$ 159097 145872 121094 107174 231361 365127 222948 -29076 -332959 -542331 -355372
5411c55372J94492J35802k3986l3024j89772r168O0535R066J50538K66060p6626
$$ -355372 -160880 -25078 -49064 -82088 -271860 -281028 -220493 -211427 -60889 205171 128545
5400A28545m2301l12833J15485K59552l4883o2444j28885q7307K2799J71872K03672
$$ 128545 86244 -226589 -111104 148448 113565 51121 -77764 -165071 -142272 29600 233272
5389B33272J1006j16987k02254Q7320k38359k08838P6715J03993J82399K26923
$$ 233272 244278 127291 -74963 12357 -226002 -434840 -358125 -254132 -71733 155190
5379A55190N2524l91382j9392K44134L15132j72859j73761k06703j05412J77147
$$ 155190 207714 -183668 -203060 41074 356206 183347 9586 -197117 -302529 -125382
5369a25382J12211j6912J66316q5367j10923k4899J15881j97841R6589M7646j19150
$$ -125382 -13171 -30083 136233 50866 -60057 -84956 30925 -166916 -70327 -22681 -141831
5358a41831J06998P5571p0218j10335l2565J63698J35168l00475m9543K05546
$$ -141831 -34833 40738 -29480 -139815 -172380 -8682 126486 -173989 -223532 -17986
5348a7986J02810k14442j60383J14060K7374M7153j01522j0539J02784P8792J80
$$ -17986 84824 -129618 -290001 -175941 -148567 -101414 -202936 -213475 -110691 -31899 -31719
5337c1719j10576N9286K29464K73251j8871j55200j45598k3621K1521q7028j00896
$$ -31719 -142295 -83009 146455 419706 400835 245635 100037 76416 97937 10909 -89987
5326h9987l4567K7458K3343j5712J29480K4003j70225j55626K3552n9402J43195
$$ -89987 -124554 -97096 -73753 -89465 40015 64018 -106207 -261833 -238281 -297683 -154488
5315a54488K60162L9382J2347k71534o1516J44078L2778o5962n4659k9582m9225
$$ -154488 105674 145056 157403 -114131 -175647 -31569 1209 -64753 -119412 -148994 -198219
5304a98219L0297J11815J98153j5194r9527M1532L5284O734P169Q7207J96847
$$ -198219 -167922 -56107 142046 126852 27325 68857 104141 110875 118044 205251 402098
5293D02098k73752r2299k8760K6050j56260j7840J27983M0066j16318r7187J65268
$$ 402098 128346 36047 7287 33337 -122923 -140763 -12780 27286 -89032 -186219 -20951
5282b0951J90318M671m3871j56631j52548J02842J35526j7547m8288J6677J06389
$$ -20951 169367 174038 130167 -26464 -179012 -76170 59356 41809 -6479 10198 116587
5271A16587k5j5983q9421N0430j7612o3058j96358J46747J61170k19473j29792
$$ 116587 116562 100579 11158 61588 43976 -19082 -215440 -68693 92477 -126996 -256788
5260b56788J92287J03104O9616J4183j43768l28933N9854J7783J09553J96056
$$ -256788 -64501 38603 108219 122402 -21366 -350299 -290445 -272662 -163109 32947
5250C2947J85988j039M4206l9770o6326q5584p943o1774l79596J66312K28715
$$ 32947 218935 217896 262102 222332 156006 70422 62479 705 -378891 -212579 16136
5239A6136j5569J15811J1963j40681N5295j29147o2201O7149j26006K1672J3663
$$ 16136 567 116378 128341 -12340 42955 -86192 -148393 -81244 -207250 -185578 -171915
5228a71915q0856K1424Q2770m0717j55218P5182M6899J28791K00992J18489K0341
$$ -171915 -252771 -231347 -148577 -189294 -344512 -269330 -222431 -93640 107352 225841 246182
5217B46182o5359m9195j80006O1425L5015o7294j20852J9045J61326R527R143
$$ 246182 180823 131628 -48378 13047 48062 -19232 -140084 -121039 40287 49814 58957
5206E8957N7593j38064j27012K4759M4027M3108q4992j095J54537K31590j78917
$$ 58957 116550 -21514 -148526 -123767 -79740 -36632 -121624 -122719 31818 263408 84491
5195H4491k26583M0769K5024R5641k259n2627M5429J88546j285o2153j08095n7647
$$ 84491 -142092 -101323 -76299 19342 17083 -35544 9885 198431 197146 134993 26898 -30749
5183c0749J79427r1901k29870N7510J39724K5280p3098K2785N8588l181j5031
$$ -30749 148678 56777 -173093 -115583 24141 49421 -23677 -892 57696 54515 39484
5172C9484J82420Q5464r2884l31754K18901o207j1689Q5575K5973j03836m0039
$$ 39484 221904 307368 214484 -117270 101631 95424 83735 169310 195283 91447 51408
5161E1408p0658J68695o3947j16281j7734m1482m0706k1722N2819K48498K13377
$$ 51408 -19250 149445 85498 -30783 -48517 -89999 -130705 -152427 -99608 148890 362267
5150C62267L8910p4597Q9568Q087M4010o4459j23873j39696j85356J10438k2953
$$ 362267 401177 326580 416148 424235 468245 403786 279913 140217 -45139 65299 42346
5139D2346q2722M9953J5432o9001J51528r8702n6352l9861O1439J56278q9709
$$ 42346 -40376 9577 25009 -43992 107536 8834 -47518 -87379 -25940 130338 40629
5128D0629k72421j83017Q7673K73702j6145Q9694O0936j00977o9782R5578j20406
$$ 40629 -231792 -414809 -327136 -53434 -69579 20115 81051 -19926 -89708 5870 -114536
5117a14536J57041P7164J6884j35671k1415Q7406L01173j63194k75553j40762
$$ -114536 42505 119669 136553 882 -20533 66873 368046 204852 -70701 -211463
5107b11463n6708j38405m5708K33897j87954k16935Q3269J70620m2115K00721
$$ -211463 -268171 -406576 -452284 -218387 -406341 -623276 -540007 -369387 -411502 -210781
5097b10781J91580J29292P7662k96662n8654o169m5579J59763L9149j20957k43314
$$ -210781 -19201 110091 187753 -108909 -167563 -173732 -219311 -59548 -20399 -141356 -384670
5086c84670j39686m1377L6938K36699J11906L2516L3556J16447l4879k44317M3295
$$ -384670 -524356 -565733 -528795 -292096 -180190 -147674 -114118 2329 -32550 -276867 -233572
5075b33572J75505J55283J54930n8784j64244J38526m9674j33868r0937j2882
$$ -233572 -58067 97216 252146 193362 29118 167644 117970 -15898 -106835 -119717
5065a19717J85729N6020K3419n1173l16516P657J05723N464K0289J06108J26592
$$ -119717 66012 122032 145451 94278 -222238 -214581 -108858 -103394 -83105 23003 149595
5054A49595K0519M8416K0852k43894J9704M4134K00132l7740M544p8361k10616
$$ 149595 170114 218530 239382 -4512 15192 59326 259458 221718 226262 147901 -62715
5043f2715J805L857R4411M9601m5768j34245J05168J56464L9668j24537k21931
$$ -62715 -60910 -57053 37358 86959 41191 -93054 12114 168578 208246 83709 -138222
5032a38222j0376J18489j68269q1955K61793P0239N8689J44107l4030k35828p6711
$$ -138222 -148598 -30109 -198378 -280333 -18540 51699 110388 254495 220465 -15363 -92074
5021i2074Q2133J06471p5287j67445p8762l0728Q3788l4316j17286j27967J05618
$$ -92074 -9941 96530 21243 -146202 -224964 -255692 -171904 -206220 -323506 -451473 -345855
5010c45855K89442N5554R5419j38401j49855L0009J44656n6462K09830J13849
$$ -345855 -56413 -859 94560 -43841 -193696 -163687 -19031 -75493 134337 248186
5000B48186j70627j77057M5097K53350J02144k35582m1923k383p9514Q1985J46496
$$ 248186 77559 -99498 -54401 198949 301093 65511 23588 21205 -58309 23676 170172
4989A70172K4463q3802O4613Q2052p1613j99714j26544j67339j66571k5786L6278
$$ 170172 194635 110833 175446 257498 185885 -13829 -140373 -307712 -474283 -500069 -463791
4978d63791O6886K98719J60441K0822j07379j54634J02945P5165J05031N2941
$$ -463791 -396905 -98186 62255 83077 -24302 -178936 -75991 -826 104205 157146
4968A57146n4548J25070l2681j68830P6293O7598J46024R1915j84309j77407j40499
$$ 157146 102598 227668 194987 26157 102450 170048 316072 407987 223678 46271 -94228
4957i4228O5421j05723m9836J41924J12733m6538K037J7475j28862l25419R4977
$$ -94228 -28807 -134530 -184366 -42442 70291 23753 25790 43265 -85597 -411016 -316039
4946c16039K39743K11661J77741L0228j64654J4652j21665k03173K7751R7133
$$ -316039 -76296 135365 313106 343334 178680 193332 71667 -131506 -103755 -6622
4936f622J4424R7945J06618l8736o2581r48J20067j43809l43340l5373R3642K5716
$$ -6622 7802 105747 212365 173629 111048 110100 230167 86358 -256982 -292355 -198713 -172997
4924a72997m3302N8783N5617j7986j70650L2695L2638O527Q6639K20392l8005
$$ -172997 -216299 -157516 -101899 -119885 -290535 -257840 -225202 -218675 -132036 88356 50351
4913E0351j27225q5231J14953J1044K9411k21018R6709J1127R8877N507j22283
$$ 50351 -76874 -162105 -47152 -36108 -6697 -227715 -131006 -119879 -21002 -15495 -137778
4902a37778q4134J25869j9687l314J025O6050m9550J65931n441P7344j40442k17697
$$ -137778 -221912 -96043 -115730 -119044 -118019 -51969 -101519 64412 58971 136315 -4127 -221824
4890b21824K20887J12728N3353M7385R853j12829O3628J31143L6049j31739j15671
$$ -221824 -937 111791 165144 212529 222382 109553 173181 304324 340373 208634 92963
4879I2963J9615M8429k901j09245N190R0704j60495r4939j56378R6530j15332
$$ 92963 112578 161007 158106 48861 54051 144755 -15740 -110679 -267057 -170527 -285859
4868b85859J82257M13224J47981j40817j12768k06247r6671l183k4103k7122J39718
$$ -285859 -103602 309622 457603 316786 204018 -2229 -98900 -102083 -126186 -153308 -13590
4857a3590J57045m1811n775n6383j02245K53733n1392j66879p6481j48305R6098
$$ -13590 143455 101644 95869 39486 -62759 190974 139582 -27297 -103778 -252083 -155985
4846a55985L1920k4897J4171j57676j7715J99943K17673O9982J08266j32228j5783
$$ -155985 -124065 -148962 -134791 -292467 -310182 -110239 107434 177416 285682 153454 137671
4835A37671j26246p9254n9064l5737j85560L279K13028J08925J97225J53886j14183
$$ 137671 11425 -67829 -126893 -162630 -348190 -344911 -131883 -22958 174267 328153 213970
4824B13970j16423J21570p9611p1829j32618l5903J5032p2165p0596k2335o6878
$$ 213970 97547 219117 139506 67677 -64941 -100844 -85812 -157977 -228573 -250908 -317786
4813c17786J76094O1092q8985P445M8429J65222J26265N1402m5724n4320j3171
$$ -317786 -141692 -80600 -169585 -162140 -113711 51511 177776 229178 183454 129134 115963
4802A15963k676k8106m1603r4213j80531O2901R3145j01874Q4303L05204N0077
$$ 115963 113287 85181 43578 -50635 -231166 -168265 -75120 -176994 -92691 212513 262590
4791B62590m7621p2890N1573p9251j53827J47377n6676j12796J07955J34578k8555
$$ 262590 214969 142079 193652 114401 -39426 107951 51275 -61521 46434 181012 152457
4780A52457L3627l9528j16334j91278o8100l963j0266J00203p2047J7562J87239
$$ 152457 186084 146556 30222 -161056 -229156 -233119 -243385 -143182 -215229 -197667 -10428
4769a0428J59847J24355r0865l9444K4725j36150k22085O134q057J86493P8288
$$ -10428 149419 273774 182909 143465 168190 32040 -190045 -183911 -191968 -5475 72813
4758G2813K2763j601J880j33064J9053j0849j52035k7574K60128J12732n6416
$$ 72813 95576 93975 95855 -37209 -18156 -29005 -181040 -208614 51514 164246 107830
4747A07830l6563o9256L1302J04743J10473j02530k58908k49217q7079J40440
$$ 107830 71267 2011 33313 138056 248529 145999 -112909 -362126 -449205 -308765
4737c08765J39312J85065J60431j63091r5428m5598j60K1098k17018m7972J6833
$$ -308765 -169453 15612 176043 12952 -82476 -128074 -128234 -107136 -324154 -372126 -355293
4726c55293J4565K51467J1526q959j04519P1045p7745k073J34329n1332L0432
$$ -355293 -340728 -89261 -77735 -86694 -191213 -120168 -197913 -199986 -65657 -116989 -86557
4715h6557k71808j85117O0176K39564J93238J38611O6856k26150j03381R7815
$$ -86557 -358365 -543482 -483306 -243742 -50504 88107 154963 -71187 -174568 -76753
4705g6753K09286N2808p3401l0385o9519J3763L613J79835o0814k27782J33682
$$ -76753 132533 185341 111940 81555 12036 25799 29412 209247 148433 -79349 54333
4694E4333K1084O0847k8213J16546J24190k83942j97246r4916O2293N3799k513
$$ 54333 75417 136264 108051 224597 348787 64845 -132401 -227317 -165024 -111225 -113738
4683a13738N6513N7370K70964J77859k66416k03426K49L5173k9000K27273P3106
$$ -113738 -57225 145 271109 448968 182552 -20874 -20625 14548 -14452 212821 285927
4672B85927J92182j00553o3761j6622j12965k57061j95897k3105j41363Q6113
$$ 285927 478109 377556 313795 297173 184208 -72853 -268750 -291855 -433218 -347105
4662c47105L80666J58062o6236K75R1260j48394j54934J0522R3086J45976M9370
$$ -347105 33561 191623 125387 125662 216922 68528 -86406 -75884 17202 163178 212548
4651B12548r3112n8001P4971j80409j75862N7303R0931K27352O1769p1324l5827
$$ 212548 119436 61435 136406 -44003 -219865 -162562 -71631 155721 217490 146166 110339
4640A10339p4169l7213j47628K4482j6666n1452n2847J01546J43627P9104m1024
$$ 110339 36170 -1043 -148671 -124189 -140855 -192307 -245154 -143608 19 79123 38099
4629C8099m8753P8269j20197r9846j88249R5568J47112J15077J16978R5152Q7639
$$ 38099 -10654 67615 -52582 -152428 -340677 -245109 -97997 17080 134058 229210 316849
4618C16849j91005j90008j21503K5727M6880j0000k2395p0590p2734J47644r4938
$$ 316849 125844 -64164 -185667 -159940 -113060 -123060 -145455 -216045 -288779 -141135 -236073
4607b36073k15299j49000J68195O2646p4260J42895O9853K67629R698m7859L0154
$$ -236073 -451372 -600372 -432177 -369531 -443791 -300896 -231043 36586 46284 -1575 28579
4596B8579J36370J69166j78597k06951j93164M2998O6493J25292m2095K8954J90617
$$ 28579 164949 334115 155518 -51433 -244597 -201599 -135106 -9814 -51909 -22955 167662
4585A67662j13257J78084k0508j37058j95904j50495l8986L3254R5805O1273n0502
$$ 167662 54405 232489 211981 74923 -120981 -271476 -310462 -277208 -181403 -120130 -170632
4574a70632J07245M1548P2582M5620k24583j13273K02865K73776P3348j48970
$$ -170632 -63387 -21839 50743 96363 -128220 -241493 -38628 235148 308496 159526
4564A59526k30839j4746J04347r1912j79418k7411m8252o6603K33571L7587j09627
$$ 159526 -71313 -86059 18288 -73624 -253042 -280453 -328705 -395308 -161737 -124150 -233777
4553b33777j796Q0376J65313K7073q6419J48959K18886j40226P0730J29522j63439
$$ -233777 -235573 -155197 10116 37189 -49230 99729 318615 178389 249119 378641 215202
$$ [...]
##END NTUPLES=NMR SPECTRUM
##END=
