##TITLE=Analysis number 315783
Compound Code cc 30116
Project Code adrs
Chemist Name fudan
##JCAMPDX= 6.0         $$ Bruker NMR JCAMP-DX V2.0
##DATA TYPE= NMR SPECTRUM
##DATA CLASS= NTUPLES
##ORIGIN= Bruker BioSpin GmbH
##OWNER= NMR
$$ XWIN-NMR		Version 3.5
$$ Thu Dec  1 14:41:34 2005 GMT Standard Time (UT+0h)  MAYBRIDGE\NMR@NMR_250MHZ
##.OBSERVE FREQUENCY= 250.131544655141
##.OBSERVE NUCLEUS= ^1H
##.ACQUISITION MODE= SIMULTANEOUS (DQD)
##.ACQUISITION SCHEME= undefined
##.AVERAGES= 16
##.DIGITISER RES= 18
##SPECTROMETER/DATA SYSTEM= dpx250
##.PULSE SEQUENCE= zg30
##.SOLVENT NAME= CDCl3
##.SHIFT REFERENCE= (INTERNAL, CDCl3, 0, 16.522)
##AUDIT TRAIL= $$ (NUMBER, WHEN, WHO, WHERE, WHAT)
$$ ##TITLE= Audit trail, XWIN-NMR		Version 3.5
$$ ##JCAMPDX= 5.01
$$ ##ORIGIN= Bruker BioSpin GmbH
$$ ##OWNER= NMR
$$ C:\u/data/dgb/nmr/ADRS/13290/pdata/1/auditp.txt
$$ ##AUDIT TRAIL=  $$ (NUMBER, WHEN, WHO, WHERE, WHAT)
(   1,<2005-12-01 14:40:50.09 +000>,<MAYBRIDGE\NMR>,<NMR_250MHZ>,
      <created by zg, POWCHK disabled, PULCHK disabled
       configuration hash MD5:
       62 19 C7 07 E1 42 D1 B7 37 6C 3D D0 77 39 F9 E6
       data hash MD5: 64K
       72 68 A0 7A AE 89 35 94 41 BB 68 C8 8D 02 16 6C>)
(   2,<2005-12-01 14:41:10.76 +000>,<MAYBRIDGE\NMR>,<NMR_250MHZ>,
      <Start of raw data processing
       ef LB = 0.3 FT_mod = 6 PKNL = 1 SI = 32K 
       data hash MD5: 32K
       72 87 99 F7 59 37 C1 83 0E 2F BF F6 86 DB 92 4F>)
(   3,<2005-12-01 14:41:14.45 +000>,<MAYBRIDGE\NMR>,<NMR_250MHZ>,
      <apk 
       data hash MD5: 32K
       2F 0D 9E A6 E9 65 21 73 9C A1 50 69 3A 0E C8 5C>)
(   4,<2005-12-01 14:41:15.59 +000>,<MAYBRIDGE\NMR>,<NMR_250MHZ>,
      <abs ABSG = 5 
       data hash MD5: 32K
       D3 16 6A 10 15 F9 89 E2 DD 75 E1 40 FB EA 84 CE>)
$$ ##END=
$$ 
$$ hash MD5
$$ C6 0C F5 A4 5F 46 00 92 30 58 74 29 7E 91 CA 39
##$RELAX= 
##$RELAX= 
##$RELAX= 
##$RELAX= 
##$RELAX= 
##$RELAX= 
##$RELAX= 
$$ Bruker specific parameters
$$ --------------------------
##$DU= <C:\u>
##$EXPNO= 13290
##$NAME= <ADRS>
##$PROCNO= 1
##$TYPE= <nmr>
##$USER= <dgb>
##$AMP= (0..31)
100 100 100 100 100 100 100 100 100 100 100 100 100 100 100 100 100 100 
100 100 100 100 100 100 100 100 100 100 100 100 100 100 
##$AQSEQ= 0
##$AQ_mod= 3
##$AUNM= <au_zg>
##$AUTOPOS= <26 >
##$BF1= 250.13
##$BF2= 250.13
##$BF3= 250.13
##$BF4= 250.13
##$BF5= 500.13
##$BF6= 500.13
##$BF7= 500.13
##$BF8= 500.13
##$BYTORDA= 1
##$CFDGTYP= 0
##$CFRGTYP= 5
##$CHEMSTR= <none>
##$CNST= (0..31)
1 1 145 1 1 1 1 1 1 1 1 1 1 1 1 1 1 1 1 1 1 1 1 1 1 1 1 1 1 1 1 1 
##$CPDPRG= <>
##$CPDPRG1= <>
##$CPDPRG2= <>
##$CPDPRG3= <>
##$CPDPRG4= <mlev>
##$CPDPRG5= <mlev>
##$CPDPRG6= <mlev>
##$CPDPRG7= <mlev>
##$CPDPRG8= <mlev>
##$CPDPRGB= <>
##$CPDPRGT= <>
##$D= (0..31)
0 1 0 0 0 0 0 0 0 0.06 0 0 0 0 0 0 0.0002 0 0 0 0 0 0 0 0 0 0 0 0 0 0 
0 
##$DATE= 1133448047
##$DBL= (0..7)
120 120 120 120 120 120 120 120 
##$DBP= (0..7)
150 150 150 150 150 150 150 150 
##$DBP07= 0
##$DBPNAM0= <>
##$DBPNAM1= <>
##$DBPNAM2= <>
$$ [...]
##$SUBNAM7= <"">
##$SUBNAM8= <"">
##$SUBNAM9= <"">
##$SW= 20.6930455092707
##$SWIBOX= (0..15)
0 0 3 0 0 0 0 0 0 0 0 0 0 0 0 0 
##$SW_h= 5175.983436853
##$TD= 65536
##$TD0= 1
##$TE= 294.16
##$TE2= 300
##$TE3= 300
##$TEG= 300
##$TL= (0..7)
0 120 120 120 120 120 120 120 
##$TP= (0..7)
150 150 150 150 150 150 150 150 
##$TP07= 0
##$TPNAME0= <>
##$TPNAME1= <>
##$TPNAME2= <>
##$TPNAME3= <>
##$TPNAME4= <>
##$TPNAME5= <>
##$TPNAME6= <>
##$TPNAME7= <>
##$TPOAL= (0..7)
0.5 0.5 0.5 0.5 0.5 0.5 0.5 0.5 
##$TPOFFS= (0..7)
0 0 0 0 0 0 0 0 
##$TUNHIN= 0
##$TUNHOUT= 0
##$TUNXOUT= 0
##$USERA1= <user>
##$USERA2= <user>
##$USERA3= <user>
##$USERA4= <user>
##$USERA5= <user>
##$V9= 5
##$VALIST= <valist>
##$VCLIST= <CCCCCCCCCCCCCCC>
##$VD= 0
##$VDLIST= <DDDDDDDDDDDDDDD>
##$VPLIST= <PPPPPPPPPPPPPPP>
##$VTLIST= <TTTTTTTTTTTTTTT>
##$WBST= 1024
##$WBSW= 4
##$XGAIN= (0..3)
0 0 0 0 
##$XL= 0
##$YL= 0
##$YMAX_a= 590783
##$YMIN_a= -462352
##$ZGOPTNS= <>
##$ZL1= 120
##$ZL2= 120
##$ZL3= 120
##$ZL4= 120
##$ABSF1= 16.522
##$ABSF2= -4.171173
##$ABSG= 5
##$ABSL= 3
##$ALPHA= 0
##$AQORDER= 0
##$ASSFAC= 0
##$ASSFACI= 0
##$ASSFACX= 0
##$ASSWID= 0
##$AUNMP= <proc_1d>
##$AZFE= 0.1
##$AZFW= 0.1
##$BCFW= 0
##$BC_mod= 0
##$BYTORDP= 0
##$COROFFS= 0
##$CY= 12.5
##$DATMOD= 1
##$DC= 0
##$DFILT= <>
##$DTYPP= 0
##$F1P= 14.0000005364418
##$F2P= -0.99999901652339
##$FCOR= 0.5
##$FTSIZE= 32768
##$FT_mod= 6
##$GAMMA= 0
##$GB= 0
##$INTBC= 1
##$INTSCL= 1
##$ISEN= 128
##$LB= 0.3
##$LEV0= 0
##$LPBIN= 0
##$MAXI= 10000
##$MC2= 0
##$MEAN= 0
##$ME_mod= 0
##$MI= 0
##$NCOEF= 0
##$NC_proc= -4
##$NLEV= 6
##$NOISF1= 0
##$NOISF2= 0
##$NSP= 0
##$NTH_PI= 0
##$NZP= 0
##$OFFSET= 16.522
##$PC= 1
##$PHC0= 79.57665
##$PHC1= 7.403091
##$PH_mod= 1
##$PKNL= yes
##$PPARMOD= 0
##$PSCAL= 4
##$PSIGN= 0
##$REVERSE= no
##$SF= 250.13
##$SI= 32768
##$SIGF1= 0
##$SIGF2= 0
##$SINO= 400
##$SIOLD= 32768
##$SREGLST= <1H.CDCl3>
##$SSB= 0
##$STSI= 32768
##$STSR= 0
##$SW_p= 5175.98343685301
##$SYMM= 0
##$S_DEV= 0
##$TDeff= 65536
##$TDoff= 0
##$TI= <Analysis number 999999
Compound Code 99
Book Reference 9
Project Code 9>
##$TILT= no
##$TM1= 0
##$TM2= 0
##$TOPLEV= 0
##$USERP1= <user>
##$USERP2= <user>
##$USERP3= <user>
##$USERP4= <user>
##$USERP5= <user>
##$WDW= 1
##$XDIM= 32768
##$YMAX_p= 362203336
##$YMIN_p= -424997
$$ End of Bruker specific parameters
$$ ---------------------------------
##NTUPLES= NMR SPECTRUM
##VAR_NAME=  FREQUENCY,     SPECTRUM/REAL,   SPECTRUM/IMAG
##SYMBOL=    X,             R,               I
##VAR_TYPE=  INDEPENDENT,   DEPENDENT,       DEPENDENT
##VAR_FORM=  AFFN,          ASDF,            ASDF
##VAR_DIM=   32768,         32768,           32768
##UNITS=     HZ,            ARBITRARY UNITS, ARBITRARY UNITS
##FACTOR=    0.157963299565203, 1,           1
##FIRST=     4132.6476996994, 0,             0
##LAST=      -1043.33573715361, 0,           0
##MIN=       -1043.33573715361, -424997,     0
##MAX=       4132.6476996994, 362203336,     0
$$ Real data points
##PAGE= N=1
##DATA TABLE= (X++(R..R)), XYDATA
$$ [...]
$$ plain form
17513 12375 80840 87741 71173 42545 -1321 -58742 -86176 -86900 -65360 -81418 -16014 -945
17501 -945 -9075 -9290 -53120 -54203 -54828 -82068 -7455 -5741 -18848 40217 -15311 -21048 31041 87701
17487 87701 97649 146931 134206 75926 98942 74991 64888 29647 9668 23715 23729 68921
17475 68921 128648 111421 115735 99407 93038 77884 19678 62281 84579 107353 93985 103748
17463 103748 117464 126844 101198 143640 192873 163155 126716 145516 171977 161272 142528 99044
17451 99044 19625 68815 125910 130373 142712 180184 195352 163974 175551 251889 414834 718945
17439 718945 920979 923463 929670 902162 872887 740590 645595 618781 561635 469611 359454
17428 359454 343299 352510 345606 403206 441460 448256 485993 515332 551895 615995 662879 683401
$$ packed form
17513A2375O8465O901j6568k8628m3866n7421k7434p24K1540j6058O5404J5069
17501i45q130k15m3830j083o25k7240P4613J714j3107N9065n5528n737N2089N6660
17487H7701R948M9282j2725n8280K3016k3951j0103l5241j9979J4047J4M5192
17475F8921N9727j7227M314j6328o369j5154n8206M2603K2298K2774j3368R763
17463A03748J3716R380k5646M2442M9233k9718l6439J8800K6461j0705j8744m3484
17451I9044p9419M9190N7095M463J2339L7472J5168l1378J1577P6338J62945L04111
17439G18945K02034K484O207k7508k9275j32297r4995k6814n7146r2024j10157
17428C59454j6155R211o904N7600L8254O796L7737K9339L6563O4100M6884K0522
$$ plain form
17416 683401 640092 608451 585333 543450 480870 450276 438531 475607 451543 413889 352033
17405 352033 263946 183721 117229 56414 72581 93868 76810 100224 146206 129303 126740 123864
17393 123864 109589 132195 143901 164236 172392 200435 264266 292570 293320 224227 113157 93821
17381 93821 161591 267409 393766 432703 486137 497029 486252 459188 462205 487705 501084
17370 501084 493313 470919 457710 494840 497081 470143 478753 464008 529935 591452 590282 491822
17358 491822 446970 328242 274161 187359 128570 200964 245362 205181 167555 183428 206560
17347 206560 216768 208180 132261 93321 94429 74444 36690 71356 116436 167389 111538 55565
17335 55565 39295 38256 9511 43987 53630 69955 57804 117254 175798 189728 159462 82520
$$ packed form
17416F83401m3309l1641k3118m1883o2580l0594j1745L7076k4064l7654o1856
17405C52033q8087q0225o6492o0815J6167K1287j7058K3414M5982j6903k563k876
17393A23864j4275K2606J1706K0335Q156K8043O3831K8304P50o9093j11070j9336
17381I3821O7770J05818J26357L8937N3434J0892j0777k7064L017K5500J3379
17370E01084p771k2394j3209L7130K241k6938Q610j4745O5927O1517j170r8460
17358D91822m4852j18728n4081q6802n8789P2394M4398m0181l7626J5873K3132
17347B06560J0208q588p5919l8940J108j9985l7754L4666M5080N0953n5851n5973
17335E5565j6270j039k8745L4476R643J6325j2151N9450N8544J3930l0266p6942
$$ plain form
17323 82520 67409 133562 112620 73803 95579 65723 71166 103791 64797 11854 18103 64100
17311 64100 127552 163394 145406 97089 88900 67435 39236 51860 46885 6870 33992 40579
17299 40579 55541 75241 32355 26781 77367 -4345 -2138 -9413 -65480 -63159 -42556 -25980
17287 -25980 -59697 -65476 -38594 39583 117761 80780 50670 49338 49535 39978 81180 82928 71616
17274 71616 62307 2253 -18627 80403 67709 68913 99734 95166 59270 50269 83255 104961
17262 104961 97281 92530 87569 96366 74167 82015 106908 117626 98494 82539 123238 208060
17250 208060 242652 215785 174354 124386 82215 97285 172884 164096 122530 94256 94479 99716
17238 99716 143437 180992 202231 188967 170092 104635 116932 67389 48215 34917 22242 28796
$$ packed form
17323H2520j5111O6153k0942l8817K1776k9856N443L2625l8994n2943O249M5997
17311F4100O3452L5842j7988m8317q189k1465k8199J2624m975m0015K7122O587
17299D0579J4962J9700m2886n574N0586q1712K207p275n6067K321K0603J6576
17287b5980l3717n779K6882P8177P8178l6981l0110j332J97r557M1202J748j1312
17274G1616r309o0054k0880R9030j2694J204L0821m568l5896r001L2986K1706
17262A04961p680m751m961Q797k2199P848K4893J0718j9132j5955M0699Q4822
17250B08060L4592k6867m1431m9968m2171J5070P5599q788m1566k8274K23N237
17238I9716M3721L7555K1239j3264j8875o5457J2297m9543j9174j3298j2675O554
$$ plain form
17226 28796 45110 -22646 -93492 -52394 42922 94627 125576 115084 117303 64975 24888 -27160
17214 -27160 -66940 -9851 61535 78747 86108 110452 127382 105477 56137 36833 57575 99275
17202 99275 73856 108336 159301 164657 123356 111546 89263 17660 101097 147067 124270 121062
17190 121062 111214 132435 143521 142284 99356 84057 154295 154561 182101 204325 164760 200315
17178 200315 212014 175746 123893 154074 214096 189071 154624 107115 134092 143939 111099 74856
17166 74856 122184 208925 224065 247557 203336 128066 187100 218239 195976 164760 129995 120687
17154 120687 124359 121047 88794 106985 126137 189881 232605 265517 260457 228229 240473 211645
17142 211645 215592 151886 112874 120537 175284 172919 173233 216905 238326 236021 165404 151591 147715
$$ packed form
17226B8796J6314o7756p0846M1098R5316N1705L0949j0492K219n2328m0087n2048
17214b7160l9780N7089P1386J7212P361K4344J6930k1905m9340j9304K0742M1700
17202I9275k5419L4480N0965N356m1301j1810k2283p1603Q3437M5970k2797l208
17190A21062r848K1221J1086j237m2928j5299P0238K66K7540K2224l9565L5555
17178B00315J1699l6268n1853L0181O0022k5025l4447m7509K6977R847l2840l6243
17166G4856M7328Q6741J5140K3492m4221p5270N9034L1139k2263l1216l4765r308
17154A20687L672l312l2253J8191J9152O3744M2724L2912n060l2228J2244k8828
17142B11645L947o3706l9012P663N4747k365L14M3672K1421k305p0617j3813l876
$$ plain form
17129 147715 115450 108907 54940 149678 243308 220637 216264 243550 332807 318546 294653 298022
17117 298022 235639 281118 353088 410326 431040 492649 552320 551576 433144 398493 408662 421749
17105 421749 414177 374497 269629 239720 272814 321042 346013 347579 336655 370613 369068 359939
17093 359939 373247 284389 245680 278056 280922 259807 264141 259801 248079 253200 232919 190556
17081 190556 158412 205473 205218 191169 157973 157423 128806 140604 139115 142339 191306 248921 339635
17068 339635 383052 366857 334845 369268 386219 309536 169958 171770 213895 297060 342804
17057 342804 369948 450085 510192 542540 609275 585701 525807 468095 521443 617852 567839
17046 567839 468884 507927 492546 458768 403911 381899 375545 370213 341060 410059 368948 379380
$$ packed form
17129A47715l2265o543n3967R4738R3630k2671m373K7286Q9257j4261k3893L369
17117B98022o2383M5479P1970N7238K0714O1609N9671p44j18432l4651J0169J3087
17105D21749p572l9680j04868k9909L3094M8228K4971J566j0924L3958j545r129
17093C59939J3308q8858l8709L2376K866k1115M334m340j1722N121k0281m2363
17081A90556l2144M7061k55j4049l3196n50k8617J1798j489L224M8967N7615R0714
17068C39635M3417j6195l2012L4423J6951p6683j39578J812M2125Q3165M5744
17057C42804K7144Q0137O0107L2348O6735k3574n9894n7712N3348R6409n0013
17046E67839r8955L9043j5381l3778n4857k2012o354n332k9153O8999m1111J0432
$$ plain form
17034 379380 398261 372725 330302 336936 389518 476691 483726 481633 425445 410875 408718 374167
17022 374167 334884 281035 257376 272966 314635 396492 406472 356141 332163 363796 413783 441900
17010 441900 439602 483968 492983 443170 445455 492435 583796 584594 570935 566372 570552 531380 522983
16997 522983 624324 678467 710138 684952 752732 762054 791853 827604 810064 863190 830006
16986 830006 782737 785854 800231 827934 823652 773089 773855 865794 976052 1015558 1018974 1020766
16974 1020766 1084314 1079943 1122902 1109980 1133320 1268372 1348319 1423255 1484106 1518725 1610386
16963 1610386 1707856 1802449 1907039 1955820 1989919 2166035 2311234 2412273 2562472 2766074
16953 2766074 3023259 3377652 3786202 4231922 4791401 5414713 5964802 6491396 7002170
$$ packed form
17034C79380J8881k5536m2423O634N2582Q7173P035k093n6188j4570k157l4551
17022C74167l9283n3849k3659J5590M1669Q1857R980n0331k3978L1633M9987K8117
17010D41900k298M4366R015m9813K285M6980R1361P98j3659m563M180l9172q397
16997E22983J01341N4143L1671k5186O7780R322K9799L5751j7540N3126l3184
16986H30006m7269L117J4377K7703m282n0563P66R1939J10258L9506L416J792
16974A020766O3548m371M2959j2922K3340J35052P9947P4936O0851L4619R1661
16963A610386R7470R4593J04590M8781L4099J76116J45199J01039J50199K03602
16953B766074K57185L54393M08550M45720N59479O23312N50089N26594N10774
$$ plain form
16944 7002170 7745530 8830135 10496382 13045332 16569381 20505077 23960225 26011710
16936 26011710 26502992 25966762 24965155 23955453 23307417 23408017 24683086 27379091 31935921
16927 31935921 39475799 51872598 71916451 101746467 139661009 177293245 203845111
16920 203845111 213428638 208538804 193959941 172915027 147849267 122413909 100267808
16913 100267808 83573323 73066665 68382719 68477289 70917717 72659991 71221466 66333880
16905 66333880 59130381 50915678 42677629 34989824 28474718 23454852 19778155 17268971
16897 17268971 15659145 14669058 14048357 13651688 13478076 13325384 13141660 12938419 12786418
16888 12786418 12752493 12885662 13326401 14111412 15465093 17684399 21210389 26672346 34472608
$$ packed form
16944G002170P43360J084605J666247K548950L524049L935696L455148K051485
16936B6011710M91282n36230j001607j009702o48036J00600J275069K696005M556830
16927C1935921P539878J2396799K0043853K9830016L7914542L7632236K6551866
16920B03845111R583527m889834j4578863k1044914k5065760k5435358k2146101
16913A00267808j6694485j0506658m683946R4570K440428J742274j438525m887586
16905F6333880p203499q214703q238049p687805o515106n019866l676697k509184
16897A7268971j609826r90087o20701l96669j73612j52692j83724k03241j52001
16888A2786418l3925J33169M40739P85011J353681K219306L525990N461957P800262
$$ plain form
16879 34472608 44092207 53660708 60756669 63922723 63780378 62053249 60521224 60592770
16871 60592770 63741548 71377612 84321591 102853424 126943325 155562657 183288415
16864 183288415 201114664 201929161 186963047 162585062 135278443 108335181 83701785
16857 83701785 63171525 47850759 37389628 30565375 26314564 23959688 23172983 23684983
16849 23684983 25043514 26341728 26631768 25562076 23342880 20497466 17469339 14616592
16841 14616592 12083205 10076831 8615825 7581216 6835464 6217518 5616613 5140981 4641884
16832 4641884 4043601 3527466 3156042 2848408 2611866 2411694 2206668 2073930 1865806
16823 1865806 1702935 1615019 1517161 1421331 1238877 1151978 1095615 1019894 1014313 909466 818716
$$ packed form
16879C4472608R619599R568501P095961L166054j42345j727129j532025P1546
16871F0592770L148778P636064J2943979J8531833K4089901K8619332K7725758
16864A83288415J7826249Q14497j4966114k4377985k7306619k6943262k4633396
16857H3701785k0530260j5320766j0461131o824253m250811k354876p86705N12000
16849B3684983J358531J298214K90040j069692k219196k845414l028127k852747
16841A4616592k533387k006374j461006j034609p45752o17946o00905m75632m99097
16832D641884n98283n16135l71424l07634k36542k00172k05026j32738k08124
16823A865806j62871q7916r7858r5830j82454q6899n6363p5721n581j04847r0750
$$ plain form
16812 818716 820570 806101 746104 740460 727700 674736 665522 621996 585777 508186 462950 447343
16800 447343 432564 394799 343545 353236 320151 274821 267879 224797 133719 157578 232270 296805
16788 296805 351415 326868 265797 208117 201225 163961 171598 184714 217439 262626 220596 162207
16776 162207 139997 141853 174569 211098 189247 181362 184390 197209 156133 158229 204794 188770
16764 188770 151220 116118 105930 132445 161034 170280 195314 167684 134887 113322 97419 87411
16752 87411 81154 56552 62003 28257 56341 53543 19372 -5154 2640 21590 1621 18158
16740 18158 55419 33887 -48764 -50255 -79722 -163514 -170964 -227443 -293353 -362120 -346165 -386355
16728 -386355 -338028 -261017 -172705 -82300 -3903 16840 29546 -2952 -55938 -87034 -175491
$$ packed form
16812H18716J854j4469n9997n644j2760n2964r214m3526l6219p7591m5236j5607
16800D47343j4779l7765n1254R691l3085m5330o942m3082r1078K3859P4692O4535
16788B96805N4610k4547o1071n7680o892l7264P637J3116L2725M5187m2030n8389
16776A62207k2210J856L2716L6529k1851p885L028J2819m1076K096M6565j6024
16764A88770l7550l5102j0188K6515K8589R246K5034k7630l2797k1565j5903j0008
16752H7411o257k4602N451l3746K8084k798l4171k4526P794J8950j9969J6537
16740A8158L7261k1532q2651j491k9467q3792p450n6479o5910o8767J5955m0190
16728c86355M8327P7011Q8312R0405P8397K0743J2706l2498n2986l1096q8457
$$ plain form
16717 -175491 -185976 -169324 -144451 -73545 -19491 1034 2672 8894 13023 60106 76164 64313
16705 64313 61235 -4648 -74744 -122253 -146101 -87514 -42945 -38904 11746 10941 -33881 -68014
16693 -68014 -88916 -132254 -149735 -149864 -149386 -94304 -68026 -97070 -152801 -125568 -68730 -22518
16681 -22518 -15446 -6110 -73927 -151883 -199687 -296648 -312113 -314352 -318088 -301638 -299348 -304130 -257564
16668 -257564 -171062 -103027 -16453 -26824 -6855 24817 -3919 -6808 -107615 -160129 -164234 -117623
16656 -117623 -98452 -71157 3109 12990 -55490 -115838 -84010 1295 1804 -15874 -37824 -54062
16644 -54062 -74257 -57332 -8668 27070 26183 -10472 -75898 -94297 -81609 -95247 -68511 -53822
16632 -53822 -64884 -57020 -31131 -31837 -78535 -102385 -95338 -92379 -83207 -69581 -21281 -2406 1177
$$ packed form
16717a75491j0485J6652K4873P0906N4054K0525J638O222M129M7083J6058j1851
16705F4313l078o5883p0096m7509k3848N8587M4569M041N0650q05m4822l4133
16693f8014k0902m3338j7481j29M78N5082K6278k9044n5731K7233N6838M6212
16681b2518P072R336o7817p7956m7804r6961j5465k239l736J6450K290m782M6566
16668b57564Q6502O8035Q6574j0371J9969L1672k8736k889j00807n2514m105M6611
16656a17623J9171K7295P4266R881o8480o0348L1828Q5305N09j7678k1950j6238
16644e4062k0195J6925M8664L5738q87l6655o5426j8399J2688j3638K6736J4689
16632e3822j1062P864K5889p06m6698k3850P047K959R172J3626M8300J8875L583
$$ plain form
16619 1177 -37225 -77565 -70113 -19027 11472 33387 31869 40507 28403 -877 -16289 35387
16607 35387 43073 47350 -554 -29888 7824 -3557 9898 -34926 -110423 -124613 -103225 -89186
16595 -89186 -93474 -101730 -115453 -112728 -42572 -18512 -33873 -28668 -69609 -134838 -116424 -110962 -63064
16582 -63064 -24598 -58057 -75082 -49116 -58748 -126377 -141110 -128115 -80432 1455 32347 25306
16570 25306 34437 27832 -24287 -70295 -58972 -92613 -49192 -50165 -114788 -66332 -39799 -109417
16558 -109417 -58654 15138 -23851 -10348 -37725 -63369 -70915 -28472 -207 -17387 -19291 -54253
16546 -54253 -135051 -139361 -147624 -117952 -49361 40868 -41520 -58083 -76465 -78965 -55541 -49471
16534 -49471 -62108 -84346 -46832 -86822 -73570 -74539 -51518 -85735 -79918 -54134 -26476 -66886
$$ packed form
16619A177l8402m0340P452N1086L0499K1915j518Q638j2104k9280j5412N1676
16607C5387P686M277m7904k9334L7712j1381J3455m4824p5497j4190K1388J4039
16595h9186m288q256j3723K725P0156K4060j5361N205m0941o5229J8414N462M7898
16582f3064L8466l3459j7025K5966r632o7629j4733J2995M7683Q1887L0892p041
16570B5306R131o605n2119m6008J1323l3641M3421r73o4623M8456K6533o9618
16558a09417N0763P3792l8989J3503k7377k5644p546M2443K8265j7180j904l4962
16546e4253q0798m310q263K9672O8591R0229q2388j6563j8382k500K3424O070
16534d9471j2637k2238L7514l9990J3252r69K3021l4217N817K5784K7658m0410
$$ plain form
16522 -66886 -127310 -184692 -174676 -174157 -160147 -132205 -130417 -81311 -27380 -26593 -35523 -26793 -24592
16509 -24592 -9062 -19131 -48691 -34700 -56107 -73626 -94592 -143538 -211543 -207661 -92035 -93594
16497 -93594 -94132 -149603 -197677 -221779 -155035 -115612 -106501 -118735 -133189 -116371 -98166 -147435
16485 -147435 -174288 -100772 -54577 -49178 -53624 -66888 -39285 -35866 -104881 -100615 -48859 -2065
16473 -2065 9331 -8387 51047 15072 -39250 -77816 -63368 -79385 -106470 -118767 -115242 -122462
16461 -122462 -79349 -80589 -127598 -143307 -79013 -60185 -23268 17579 44528 31584 5097 -9425
16449 -9425 39388 22463 50005 418 -57639 -39885 -57299 -36396 5380 -5849 7903 -10426
16437 -10426 -11457 -35345 -67465 -97029 -104699 -108871 -74730 -35647 -21279 28061 12636 55181
$$ packed form
16522f6886o0424n7382J0016N19J4010K7942J788M9106N3931P87q930Q730K201
16509b4592J5530j0069k9560J3991k1407j7519k0966m8946o8005L882J15626j559
16497i3594n38n5471m8074k4102O6744L9423R111j2234j4454J6818J8205m9269
16485a47435k6853P3516M6195N399m446j3264K7603L419o9015M266N1756M6794
16473b065J1396j7718N9434l5975n4322l8566J4448j6017k7085j2297L525p220
16461a22462M3113j240m7009j5709O4294J8828L6917M0847K6949j2944k6487j4522
16449i425M8813j6925K7542m9587n8057J7754j7414K0903M1776j1229J3752j8329
16437a0426j031k3888l2120k9564p670m172L4141L9083J4368M9340j5425M2545
$$ plain form
16425 55181 122941 137539 163184 212696 303156 355012 436144 499429 533279 551290 575365 600244
16413 600244 575019 542332 457836 418488 425815 431532 458030 530425 595308 676548 692482 640716
16401 640716 606392 558810 486025 414668 321866 258924 208773 189794 193758 186627 200675 209857
16389 209857 184488 157143 149646 150904 178353 105606 42589 10803 20153 72022 108665 130563
16377 130563 149354 104557 82956 46206 28605 75531 173056 271679 347105 434163 450602
16366 450602 431666 444244 498867 565058 638664 649670 631872 585346 510577 415372 347675
16355 347675 299691 268846 249776 235796 193864 164594 231213 291679 375194 423407 436123
16344 436123 446693 448910 422963 355820 307606 273305 225720 166709 96680 82215 90060 66323
$$ packed form
16425E5181O7760J4598K5645M9512R0460N1856Q1132O3285L3850J8011K4075K4879
16413F00244k5225l2687q4496l9348P327N717K6498P2395O4883Q1240J5934n1766
16401F40716l4324m7582p2785p1357r2802o2942n0151j8979L964p131J4048R182
16389B09857k5369k7345p497J258K7449p2747o3017l1786R350N1869L6643K1898
16377A30563J8791m4797k1601l6750j7601M6926R7525R8623P5426Q7058J6439
16366D50602j8936J2578N4623O6191P3606J1006j7798m6526p4769r5205o7697
16355C47675m7984l0845j9070j3980m1932k9270O6619O0466Q3515M8213J2716
16344D36123J0570K217k5947o7143m8214l4301m7585n9011p0029j4465P845k3737
$$ plain form
16332 66323 77667 59195 6539 -26193 -26404 -26533 19342 33772 16056 -48991 -54852 10046 -6385
16319 -6385 -27254 -58947 -64015 -76454 -129909 -104435 -67110 -54311 -37744 -59425 -73607 -40692
16307 -40692 18127 -17445 -62170 -11128 -35491 -97135 -99243 -91142 -54310 11572 4136 -23070
16295 -23070 -38957 -68997 -67735 -45851 -73586 -91375 -54495 -37586 -59210 -74065 -92383 -33124
16283 -33124 -34888 -41922 -52691 -77788 -55839 -66924 -17578 15495 5875 10249 38335 -21576
16271 -21576 -29352 -38163 -38812 -81531 -126633 -106712 -94987 -82343 -52458 -41695 -64125 -99231
16259 -99231 -46032 21070 -7499 -51148 -73664 -61487 -42103 -74079 -88029 -69092 -86147 -94402
16247 -94402 -94726 -92997 -139562 -107459 -126012 -155990 -79276 -41812 -78222 -140251 -152069 -153373
$$ packed form
16332F6323J1344j8472n2656l2732k11j29M5875J4430j7716o5047n861O4898j6431
16319f385k0869l1693n068j2439n3455K5474L7325J2799J6567k1681j4182L2915
16307d0692N8819l5572m4725N1042k4363o1644k108Q101L6832O5882p436k7206
16295b3070j5887l0040J262K1884k7735j7789L6880J6909k1624j4855j8318N9259
16283c3124j764p034j0769k5097K1949j1085M9346L3073r620M374K8086n9911
16271b1576p776q811o49m2719m5102J9921J1725J2644K9885J0763k2430l5106
16259i9231N3199O7102k8569m3649k2516J2177J9384l1976j3950J8937j7055q255
16247i4402l24J729m6565L2103j8553k9978P6714L7464l6410o2029j1818j304
$$ plain form
16235 -153373 -164669 -172416 -142009 -82281 -1739 -71272 -113220 -80824 -63970 -108024 -94266 -82970
16223 -82970 -122318 -100947 -89595 -87733 -100160 -114317 -72530 -6768 -32117 -64490 -57611 -68366
16211 -68366 -94327 -94667 -51168 -19962 -10808 -24057 -47786 -71607 -51894 -59445 -81697 -90768 -66924
16198 -66924 -41970 -861 -50326 -131438 -111932 -139970 -188276 -105821 -45506 -22895 -22654 46166
16186 46166 67588 54248 35158 16619 -5288 -49158 -39023 -37561 -61454 -78085 -96828 -133179
16174 -133179 -94868 -89817 -106343 -126933 -104250 -90919 -86247 -56791 18110 43546 37321 33916
16162 33916 -13559 -2021 -34756 -38464 -123342 -124630 -65745 -43520 -28796 -102661 -157125 -158893
16150 -158893 -151526 -153275 -133303 -175589 -178701 -160414 -120447 -147847 -103863 -79410 -53596 -73312
$$ packed form
16235a53373j1296p747L0407N9728Q0542o9533m1948L2396J6854m4054J3758J1296
16223h2970l9348K1371J1352J862j2427j4157M1787O5762k5349l2373O879j0755
16211f8366k5961l40M3499L1206R154j3249k3729k3821J9713p551k2252r071K3844
16198f6924K4954M1109m9465q1112J9506k8038m8306Q2455O0315K2611K41O8820
16186D6166K1422j3340j9090j8539k1907m3870J0135J462k3893j6631j8743l6351
16174a33179L8311N051j6526k0590K2683J3331M672K9456P4901K5436o225l405
16162C3916m7475J1538l2735l708q4878j288N8885K2225J4724p3865n4464j768
16150a58893P367j749J9972m2286l112J8287L9967k7400M3984K4453K5814j9716
$$ plain form
16138 -73312 -127745 -164471 -166105 -121213 -80266 -125936 -88626 -54358 -86557 -82704 -76091 -123899
16126 -123899 -146991 -172000 -161375 -115973 -103182 -179669 -182149 -138187 -72919 -30934 -79598 -181848
16114 -181848 -191858 -169601 -179185 -140201 -101808 -22727 -2401 -27513 17605 31468 53816 80089
16102 80089 69817 13534 -16039 -52592 -85861 -98826 -139463 -131265 -106814 -81186 -86725 -78968
16090 -78968 -89734 -106361 -66624 9916 21675 18299 -30004 -3261 -16650 -62812 -63524 -38744
16078 -38744 22619 56258 45882 9042 2952 53473 74169 42085 -41397 -39425 -62498 -68677
16066 -68677 -74332 -91935 -110300 -58899 -40039 -74548 -53566 -34097 6897 34857 9377 -19398
16054 -19398 -22864 -16568 -67128 -57270 -11448 -3994 38486 17980 21618 -2775 -24725 -16283 -8504
$$ packed form
16138g3312n4433l6726j634M4892M0947m5670L7310L4268l2199L853O613m7808
16126a23899k3092k5009J0625M5402J2791p6487k480M3962O5268M1985m8664j02250
16114a81848j0010K2257r584L8984L8393P9081K0326k5112M5118J3863K2348K6273
16102H0089j0272n6283k9573l6553l3269j2965m0637Q198K4451K5628n539P757
16090g8968j0766j6627L9737P6540J1759l376m8303K6743j3389m6162p12K4780
16078c8744O1363L3639j0376l6840o090N0521K0696l2084q3482J972k3073o179
16066f8677n655j7603j8365N1401J8860l4509K0982J9469M0994K7960k5480k8775
16054a9398l466O296n0560R858M5822P454M2480k0506L638k4393k1950Q442P779
$$ plain form
16041 -8504 5852 26275 -43827 -87158 -42984 16548 14033 -28375 -56080 -34191 -13826 -37083
16029 -37083 -26986 1640 -17471 3999 32738 20165 -23458 -47275 -43285 -20923 -42284 -47437
16017 -47437 -61479 -62605 26839 116059 64659 106948 74186 -17247 -93801 -46532 -56399 -61714
16005 -61714 -92188 -134427 -131515 -85380 2352 25309 51785 112085 95536 6317 -57849 -62717
15993 -62717 -53200 -28165 -9143 27457 -12701 -20618 -39021 -41909 -64942 -90791 -34157 -33782 -61551
15980 -61551 -55707 937 30737 -6595 -26436 -11736 265 -14329 -15880 -40184 -69760 -68147
15968 -68147 -66539 -41737 -26820 -47412 -13018 10327 -15619 -44155 -67935 -64962 -23138 -28510
15956 -28510 5743 -31488 -49216 -44110 -59478 -60269 -88024 -118521 -73181 -44981 -93851 -72622
$$ packed form
16041h504J4356K0423p0102m3331M4174N9532k515m2408k7705K1889K0365k3257
16029c7083J0097K8626j9111K1470K8739j2573m3623k3817L990K2362k1361n153
16017d7437j4042j126Q9444Q9220n1400M2289l2762r1433p6554M7269r867n315
16005f1714l0474m2239K912M6135Q7732K2957K6476O0300j6549q9219o4166m868
15993f2717R517K5035J9022L6600m0158p917j8403k888k3033k5849N6634L75k7769
15980f1551N844N6644K9800l7332j9841J4700J2001j4594j551k4304k9576J613
15968f8147J608K4802J4917k0592L4394K3345k5946k8536k3780K973M1824n372
15956b8510L4253l7231j7728N106j5368p91k7755l0497M5340K8200m8870K1229
$$ plain form
15944 -72622 -61262 -44872 -103483 -101082 -52576 1992 -37760 -121554 -126224 -112102 -138986 -162768
15932 -162768 -170740 -178542 -134116 -72547 -43245 -59843 -80948 -105470 -78005 -49491 -18429 -53753
15920 -53753 -18058 26447 -3098 -35651 -68496 -65018 -65442 -26104 -14853 -27298 -65651 -82615
15908 -82615 -90611 -73827 -100222 -79963 -110581 -122849 -97049 -158220 -188629 -145959 -143415 -193943
15896 -193943 -171583 -166796 -184897 -134619 -49787 -49308 -144310 -156579 -113700 -50752 -27630 -1626
15884 -1626 -10913 -75345 -79737 31018 72839 2658 -61044 -18121 -102301 -94709 -83983 -71726
15872 -71726 -73134 -94534 -55078 -23731 20061 -43137 -43172 -93369 -86766 -24571 15308 -10311 -63964
15859 -63964 -113846 -127669 -84887 -70075 -24172 -6314 -34095 -12784 -5324 -50191 -39865 -51532
$$ packed form
15944g2622J1360J6390n8611K401M8506N4568l9752q3794m670J4122k6884k3782
15932a62768p972p802M4426O1569K9302j6598k1105k4522K7465K8514L1062l5324
15920e3753L5695M4505k9545l2553l2845L478m24L9338J1251j2445l8353j6964
15908h2615p996J6784k6395K0259l0618j2268K5800o1171l0409M2670K544n0528
15896a93943K2360M787j8101N0278Q4832M79r5002j2269M2879O2948K3122K6004
15884a626r287o4432m392J10755M1821p0181o3702M2923q4180P592J0726J2257
15872g1726j408k1400L9456L1347M3792o3198l5n0197O603O2195L9879k5619n3653
15859f3964m9882j3823M2782J4812M5903J7858k7781K1311P460m4867J0326j1667
$$ plain form
15847 -51532 -41961 -12636 -13749 -32836 -38186 -12462 25212 -1360 -18035 20431 43887 4047
15835 4047 -66843 -37443 35751 -10208 5595 -21446 -53651 -36349 -36576 -61462 -34329 -21732
15823 -21732 -36540 -73138 -92669 -96216 -98807 -72819 -100949 -70593 -29342 -36887 -30957 -55688
15811 -55688 -46644 -35714 -63534 -56377 -28613 -24755 -25170 -38001 -97143 -105741 21113 67965 15021
15798 15021 -19971 -3629 23686 -53166 -84566 -33630 -8795 -17558 -39567 -30112 1519 -19205
15786 -19205 -15300 -25857 -50331 -91476 -106498 -91895 -135152 -93664 -45126 -35126 -22207 -41964
15774 -41964 -11041 64852 46914 5749 21014 37381 61927 28744 -2111 -3521 -26137 -23553
15762 -23553 28695 41600 26795 27954 18321 2805 -85028 -107151 -84361 -40491 -126971 -101469
$$ packed form
15847e1532R571K9325j113j9087n350K5724L7674k6572j6675L8466K3456l9840
15835D047p0890K9400P3194m5959J5803k7041l2205J7302k27k4886K7133J2597
15823b1732j4808l6598j9531l547k591K5988k8130L0356M1251p545N930k4731
15811e5688R044J0930k7820P157K7764L858m15j2831n9142q598J26854M6852n2944
15798A5021l4992J6342K7315p6852l1400N0936K4835q763k2009R455L1631k0724
15786a9205L905j0557k4474m1145j5022J4603m3257M1488M8538J0000J2919j9757
15774d1964L0923P5893j7938m1165J5265J6367K4546l3183l0855j410k2616K584
15762b3553N2248J2905j4805J159r633j5516q7833k2123K2790M3870q6480K5502
$$ plain form
15750 -101469 -74084 -72940 -104335 -114054 -61358 -120129 -130984 -82582 -43748 -47757 -49822 -70739
15738 -70739 -84214 -24842 -40738 -133029 -150151 -98998 -68835 -54874 -32370 -56361 -127517 -122477
15726 -122477 -108391 -51374 5428 102518 151658 83120 34460 -22150 -53330 -50314 -31693 -17117
15714 -17117 -60591 -78495 -53761 -43365 -30950 -2147 5246 7452 -14697 -73076 -100718 -72709
15702 -72709 -67546 -156229 -93421 -56493 -65119 -43350 33881 111016 68435 1823 -31396 -33690
15690 -33690 -61533 -95142 -131724 -113768 -144049 -159590 -94139 -75275 -41421 22451 10893 23254
15678 23254 47491 16197 -22487 -26849 -8740 -60634 -24759 83848 79774 59243 53046 65621
15666 65621 28577 2405 1831 -44350 -105804 -59292 -63543 -30803 -31169 -75943 -103455 -83351 -53715
$$ packed form
15750a01469K7385J144l1395r719N2696n8771j0855M8402L8834m009k065k0917
15738g0739j3475N9372j5896r2291j7122N1153L0163J3961K2504k3991p1156N040
15726a22477J4086N7017N6802R7090M9140o8538m8660n6610l1180L016J8621J4576
15714a7117m3474j7904K4734J0396J2415K8803P393K206k2149n8379k7642K8009
15702g2709N163q8683O2808L6928q626K1769P7231P7135m2581o6612l3219k294
15690c3690k7843l3609l6582J7956l0281j5541O5451J8864L3854O3872j1558J2361
15678B3254K4237l1294l8684m362J8109n1894L5875J08607m074k0531o197J2575
15666F5621l7044k6172n74m6181o1454M6512m251L2740l66m4774k7512K0104K9636
$$ plain form
15653 -53715 -85005 -116700 -135031 -117866 -95370 -108334 -157998 -112835 -115049 -129053 -133637 -137849
15641 -137849 -118698 -75278 -105398 -62398 -36577 -18319 -669 1413 -22074 -80243 -83968 -25727
15629 -25727 3403 23960 80266 68177 37487 -9451 460 13298 3545 8198 11221 12524 11813
15616 11813 -43009 -50557 -47370 -30289 18949 -35796 -25839 30334 -5946 -24013 -6609 -12229
15604 -12229 -40665 -108870 -158126 -121939 -176611 -185538 -84528 -25076 -34880 -5700 7578 -10808
15592 -10808 -9460 -29144 -53812 -45453 -63454 -52807 -13550 26992 46008 35129 -17969 -28252
15580 -28252 -1585 20022 32384 33691 23129 16773 -4729 -26313 -11874 65928 119487 87172
15568 87172 -6052 -55781 -36862 -7336 -26329 -40272 -62404 -75209 -106030 -172848 -153729 -75766
$$ packed form
15653e3715l1290l1695j8331J7165K2496j2964m9664M5163k214j4004m584m212
15641a37849J9151M3420l0120M3000K5821J8258J7650K082k3487n8169l725N8241
15629b5727K9130K0557N6306j2089l0690m6938R911J2838r753M653L023J303p11
15616A1813n4822p548L187J7081M9238n4745R957N6173l6280j8067J7404n620
15604a2229k8436o8205m9256L6187n4672q927J01010N9452r804K9180J3278j8386
15592a0808J348j9684k4668Q359j8001J0647L9257M0542J9016j0879n3098j0283
15580b8252K6667K1607J2362J307j0562o356k1502k1584J4439P7802N3559l2315
15568H7172r3224m9729J8919K9526j8993j3943k2132j2805l0821o6818J9119P7963
$$ plain form
15556 -75766 -3213 4032 -29005 -8721 -26784 -81518 -136985 -84774 -90885 -101197 -108880 -103941
15544 -103941 -109383 -112129 -123940 -117985 -21884 -31074 -61560 -29762 -27612 -50573 -57856 -88415 -85409
15531 -85409 -16733 15886 1153 27677 38812 -6603 -26069 -25745 -9825 -8016 12434 -24420
15519 -24420 -14341 24519 46448 64354 -22791 -67279 -72281 -46174 -23001 -29025 -36115 -1633
15507 -1633 -25031 -22655 7164 8799 -20678 -31659 -12639 16062 10903 9091 38256 25693 8444
15494 8444 -56275 932 -18633 -61541 -62502 -30798 4094 41620 59684 27204 -3135 -18963
15482 -18963 -55221 -69915 -55970 -41264 -72402 -28422 -5229 18239 -12882 5592 10015 15404
15470 15404 3658 -24608 -53623 -100566 -118832 -91707 -52797 -48257 -22352 13481 -14427 -17672
$$ packed form
15556g5766P2553P245l3037K0284j8063n4734n5467N2211o111j0312p683M939
15544a03941n442k746j1811N955R6101r190l0486L1798K150k2961p283l0559L006
15531h5409O8676L2619j4733K6524J1135m5415j9466L24J5920J809K0450l6854
15519b4420J0079L8860K1929J7906q7145m4488n002K6107K3173o024p090L4482
15507a633k3398K376K9819J635k9477j0981J9020K8701n159j812K9165j2563j7249
15494H444o4719N7207j9565m2908r61L1704L4892L7526J8064l2480l0339j5828
15482a8963l6258j4694J3945J4706l1138M3980K3193K3468l1121J8474M423N389
15470A5404j1746k8266k9015m6943j8266K7125L8910M540K5905L5833k7908l245
$$ plain form
15458 -17672 -31823 -37921 -77381 -69342 40771 28286 -28773 -80150 -116931 -84778 -47306 -26945
15446 -26945 -24131 38026 47761 -27653 -73820 -26343 -16457 -24210 -40053 -76528 -98202 -117657
15434 -117657 -81447 4377 -8999 -14064 38390 22037 33259 58785 122290 100213 44421 13378
15422 13378 46108 44176 39479 104030 114343 68898 48171 42929 77025 -19245 -25672 -37286
15410 -37286 -82421 -46956 63691 107554 108234 59890 -36172 -56142 -74040 -29959 5935 -22984
15398 -22984 -31041 -27097 -72246 -85563 -119965 -62891 2274 -2738 -1763 35883 64158 65040 53676
15385 53676 25919 48387 -9556 -3047 -5703 -53849 -59125 -117774 -137047 -111520 -82314 -51064
15373 -51064 -2039 21518 55179 42370 73936 84670 32061 -29665 -65173 -26269 -30673 12209
$$ packed form
15458a7672j4151o098l9460Q039J10113j2485n7059n1377l6781L2153L7472K0361
15446b6945K814O2157R735p5414m6167M7477R886p753j5843l6475k1674j9455
15434a17657L6210Q5824j3376n065N2454j6353J1222K5526O3505k2077n5792l1043
15422A3378L2730j932m697O4551J0313m5445k0727n242L4096r6270o427j1614
15410c7286m5135L5465J10647M3863O80m8344r6062j9970j7898M4081L5894k8919
15398b2984q057L944m5149j3317l4402N7074O5165n012R75L7646K8275Q82j1364
15385E3676k7757K2468n7943O509k656m8146n276n8649j9273K5527K9206L1250
15373e1064M9025K3557L3661j2809L1566J0734n2609o1726l5508L8904m404M2882
$$ plain form
15361 12209 97170 87233 75414 69387 -16167 -49768 -18678 -19527 -6469 17877 4028 -28365
15349 -28365 -21600 28281 79027 112812 111108 113048 118871 65235 29643 3884 -6462 21337
15337 21337 -5838 644 -32106 -71839 -21252 10788 -6523 12671 -8175 -52522 -65487 -67263
15325 -67263 -63754 -130054 -112091 -130879 -109698 -69128 -40938 -8613 4684 -2760 8501 21775
15313 21775 64269 81411 31537 40131 31462 19667 17572 69152 36276 -4283 -9019 -17700 10794
15300 10794 -429 -49569 9911 9210 -25218 -32726 -19254 -39945 -75008 -27280 -19567 -53286
15288 -53286 -32705 -6283 -9235 -27902 -32923 14957 -5253 37973 109982 145274 172863 140554
15276 140554 54280 -32493 -43313 -14731 9710 62474 18356 -59990 -120400 -114342 -147495 -113094
$$ packed form
15361A2209Q4961r937j1819o027q5554l3601L1090q49J3058K4346j3849l2393
15349b8365O765M9881N0746L3785j704J940N823n3636l5592k5759j0346K7799
15337B1337k7175O482l2750l9733N0587L2040j7311J9194k0846m4347j2965j776
15325f7263L509o6300J7963j8788K1181M0570K8190L2325J3297p444J1261J3274
15313B1775M2494J7142m9874Q594q669j1795k095N1580l2876m0559m736q681K8494
15300A0794j1223m9140N9480p01l4428p508J3472k0691l5063M7728P713l3719
15288e3286K0581K6422k952j8667n021M7880k0210M3226P2009L5292K7589l2309
15276A40554q6274q6773j0820K8582K4441N2764m4118p8346o0410O058l3153L4401
$$ plain form
15264 -113094 -26288 -7974 -29586 -102254 -132956 -58954 28212 -11125 -64988 -56568 -54821 -40809
15252 -40809 -6478 72688 93322 99173 52580 -58982 -96899 -47223 17918 -19910 -30255 -52431
15240 -52431 -57427 -99268 -117635 -97650 -90657 -98838 -54836 -27847 5943 -19696 -75966 -137569
15228 -137569 -113922 -58000 24976 23765 -5827 -889 -3558 11640 36536 67921 61857 72313
15216 72313 73810 1644 -20935 -40362 -53962 -29474 17305 61690 90206 94224 99091 97317
15204 97317 24254 53465 63395 70766 87765 62179 37745 -1900 -1507 -6417 -24587 -33649 7607
15191 7607 6372 45668 36002 20270 58793 110501 103301 45567 -45593 -79927 -42875 580
15179 580 40037 35432 10914 -30126 -37972 26502 48067 -7401 18593 10249 26375 -13520 -3262
$$ packed form
15264a13094Q6806J8314k1612p2668l0702P4002Q7166l9337n3863Q420J747J4012
15252d0809L4331P9166K0634N851m6593j11562l7917M9676O5141l7828j0345k2176
15240e2431m996m1841j8367J9985O993q181M4002K6989L3790k5639n6270o1603
15228a37569K3647N5922Q2976j211k9592M938k669J5198K4896L1385o064J0456
15216G2313J497p2166k2579j9427j3600K4488M6779M4385K8516M018M867j774
15204I7317p3063K9211R930P371J6999k5586k4434l9645L93m910j8170r062M1256
15191G607j235L9296r666j5732L8523N1708p200n7734r1160l4334L7052M3455
15179E80L9457m605k4518m1040p846O4474K1565n5468K5994q344J6126l9895J0258
$$ plain form
15166 -3262 27666 42516 21897 13069 -19376 -28859 291 -74136 -105645 -79287 -70383 -69914 -64732
15153 -64732 -18886 -5355 9629 -14958 -19986 -25056 -73330 19365 55891 23630 -10338 22329
15141 22329 40528 2835 22908 -17489 -13351 -41539 -61555 -59564 -31215 -33221 -29575 -41345
15129 -41345 -59801 -99973 -151212 -92721 -16706 19947 -25171 -53660 -56070 -76959 -8746 41537
15117 41537 72977 67567 36195 -4810 -8592 42358 58312 44246 -39859 -84197 -52388 -44486
15105 -44486 -28354 -24388 -6009 2233 -15987 -72684 -135681 -121768 -62220 -28637 15948 14198
15093 14198 -21110 -5934 43083 46425 16193 51537 19946 20306 19835 27570 49146 47529 7363
15080 7363 -31005 7886 8331 49930 72997 100112 60796 50070 58919 58300 -14344 -65606 -102937
$$ packed form
15166c262L0928J4850k0619q828l2445r483K9150p4427l1509K6358Q904M69N182
15153f4732M5846J3531J4984k4587n028n070m8274R2695L6526l2261l3968L2667
15141B2329J8199l7693K0073m0397M138k8188k0016J991K8349k006L646j1770
15129d1345j8456m0172n1239N8491P6015L6653m5118k8489k410k0889O8213N0283
15117D1537L1440n410l1372m1005l782N0950J5954j4066q4105m4338L1809P902
15105d4486J6132L966J8379Q242j8220n6697o2997J3913N9548L3583M4585j750
15093A4198l5308J5176M9017L342l0232L5344l1591L60m71P735K1576j617m0166
15080G363l8368L8891M45M1599K3067K7115l9316j0726Q849o19p2644n1262l7331
$$ plain form
15067 -102937 -4803 32313 -45338 -42805 -38118 -107734 -132465 -101035 -91619 -139151 -159266 -74412
15055 -74412 -83513 -170067 -181862 -112305 -41920 -31923 3589 42629 23133 41052 28847 -3267
15043 -3267 -17619 -28754 -18125 -33732 -67347 -142695 -122068 -110908 -115619 -66839 -4789 33409
15031 33409 67307 11894 -20128 35464 52320 31925 65252 65105 50732 -12332 7390 16448
15019 16448 -1060 -73211 -143702 -160861 -142159 -42366 -22344 -15534 -37765 -76766 -80769 -36185
15007 -36185 -7123 34135 39361 50378 48207 11652 -24491 5353 42716 -2513 -50622 -42170
14995 -42170 -7485 14541 4927 -16813 -31298 -59234 -18933 1786 -6996 6976 -14431 20473
14983 20473 83821 68258 13251 -52703 3995 44760 26225 -65190 -97137 -86915 -82639 -68379
$$ packed form
15067a02937R8134L7116p7651K533M687o9616k4731L1430R416m7532k0115Q4854
15055g4412r101q6554j1795O9557P0385R997L5512L9040j9496J7919j2205l2114
15043c267j4352j1135J0629j5607l3615p5348K0627J1160m711M8780O2050L8198
15031C3409L3898n5413l2022N5592J6856k0395L3327j47j4373o3064J9722R058
15019A6448j7508p2151p0491j7159J8702R9793K0022O810k2231l9001m003M4584
15007c6185K9062M1258N226J1017k171l6555l6143K9844L7363m5229m8109Q452
14995d2170L4685K2026r614k1740j4485k7936M0301K0719q782J3972k1407L4904
14983B0473O3348j5563n5007o5954N6698M0765j8535r1415l1947J0222M276J4260
$$ plain form
14971 -68379 -58192 -19288 -31666 -38610 -7866 -26975 -16693 -90469 -134083 -62232 -20224 37647
14959 37647 25861 -3687 8252 8175 -16526 13279 86725 54638 15018 26160 8336 30412
14947 30412 31901 -17636 -128482 -111593 -64960 -79591 -74820 -89441 -106355 -83731 -78654 -68248
14935 -68248 -39788 -43259 -10312 -17829 -941 -6693 24147 -10377 -53410 -41526 14007 72542
14923 72542 64391 66461 49642 37918 54824 48875 17381 14477 34005 27573 -12899 12222 36423
14910 36423 -336 15736 -24420 -19032 -4626 -45971 -67132 -7683 -1700 -33056 -83719 -61982
14898 -61982 -19896 60778 92377 61842 12333 -28047 -63679 -60215 -9964 -4968 -26910 -15067
14886 -15067 19523 31581 19677 13044 -24448 -20734 -29978 -78126 -58349 -16624 17401 9589
$$ packed form
14971f8379J0187L8904j2378o944L0744j9109J0282p3776m3614P1851M2008N7871
14959C7647j1786k9548J1939p7k4701K9805P3446l2087l9620J1142j7824K2076
14947C0412J489m9537j10846J6889M6633j4631M771j4621j6914K2624N077J0406
14935f8248K8460l471L2947p517J6888n752L0840l4524m3033J1884N5533N8535
14923G2542q151K070j6819j1724J6906n949l1494k904J9528o432m0472K5121K4201
14910C6423l6759J6072m0156N388J4406m1345k1161N9449N983l1356n0663K1737
14898f1982M2086Q0674L1599l0535m9509m0380l5632L464N0251M996k1942J1843
14886a5067L4590J2058j1904o633l7492L714r244m8148J9777M1725L4025p812
$$ plain form
14874 9589 12964 -60050 -64946 -114330 -172729 -91896 -3196 -11529 -39080 -25109 -12988 4509
14862 4509 -26924 -12164 58122 82209 27289 -56572 -49182 -103594 -41538 30929 -16303 -49807
14850 -49807 -55399 -25715 23949 -47129 -50913 -60103 -74681 -101162 -96680 -62507 -47402 -48389 -86314
14837 -86314 -85076 -83684 -58104 804 -29635 -58839 -17723 -2674 -43110 -96370 -95437 -16588
14825 -16588 60828 66628 50933 61122 48471 41308 44065 28661 -1266 6932 -21727 -55880
14813 -55880 -126068 -104033 -34939 33346 58819 61047 16189 -14310 18505 59966 74812 9864
14801 9864 -49032 -20402 -32408 -10600 36335 65875 18944 -38682 -22503 -13946 6728 60895
14789 60895 104952 41074 33953 595 24853 13825 -5742 25160 25099 -28665 -35808 -71651 -45383
$$ packed form
14874I589L375p3014m896m9384n8399Q0833Q8700q333k7551J3971J2121J7497
14862D509l1433J4760P0286K4087n4920q3861P390n4412O2056P2467m7232l3504
14850d9807n592K9684M9664p1078l784r190j4578k6481M482L4173J5105r87l7925
14837h6314J238J392K5580N8908l0439k9204M1116J5049m0436n3260R33P8849
14825a6588P7416N800j5695J0189j2651p163K757j5404k9927Q198k8659l4153
14813e5880p0188K2035O9094O8285K5473K228m4858l0499L2815M1461J4846o4948
14801I864n8896K8630j2006K1808M6935K9540m6931n7626J6179Q557K0674N4167
14789F0895M4057o3878p121l3358K4258j1028j9567L0902o1n3764p143l5843K6268
$$ plain form
14776 -45383 -342 -31280 -57618 -34340 6233 5007 -43316 -73830 -105292 -75365 -48563 -55198
14764 -55198 -39491 24200 79083 91985 62234 54552 92353 62723 89047 45960 -3172 -31094
14752 -31094 4178 2858 24969 17883 -20884 -45573 -38663 -55159 -57929 -58405 -53992 -34987 -67509
14739 -67509 -66303 -36079 88 11312 23223 -51981 -28665 -44464 -51988 -46375 -10193 11819
14727 11819 -24311 -43924 -41228 -634 -38813 -82713 -18046 -28197 -7549 13211 20001 2580
14715 2580 26902 10215 -34548 -79381 -119971 -20712 -7721 -31990 -39609 -36184 -43243 -91451
14703 -91451 -51486 -66369 -82400 -49161 -72367 -66491 -75869 -66052 -33999 -12499 -22791 -31148
14691 -31148 28778 -35746 -76678 -11762 -8963 -3742 24086 -13175 8678 68898 69222 37790
$$ packed form
14776d5383M5041l0938k6338K3278M0573j226m8323l0514l1462K9927K6802o635
14764e5198J5707O3691N4883J2902k9751p682L7801k9630K6324m3087m9132k7922
14752c1094L5272j320K2111p086l8767k4689O910j6496k770m76M413J9005l2522
14739f7509J206L0224L6167J1224J1911p5204K3316j5799p524N613L6182K2012
14727A1819l6130j9613K696M0594l8179m3900O4667j0151K0648K0760O790j7421
14715B580K4322j6687m4763m4833m0590R9259J2991k4269p619L425p059m8208
14703i1451L9965j4883j6031L3239k3206N876r378R817L2053K1500j0292q357
14691c1148N9926o4524m0932O4916K799N221K7828l7261K1853O0220L24l1432
$$ plain form
14679 37790 45450 28352 19595 -7247 -97006 -118469 -53690 -60676 -75539 -54400 -51268 -105373
14667 -105373 -115402 -65771 -26743 32071 5215 57886 31499 6157 -12557 34922 57803
14656 57803 -17979 -28525 -21169 6811 60693 41481 -17063 -46785 -28070 -1234 -10561 -49084
14644 -49084 -42628 -28938 -19865 15415 -121 -63456 -93269 -83293 -87643 -58820 -33107 -31725 -26886
14631 -26886 -77842 -54208 -36510 -26463 -5446 2394 -22838 -103642 -141543 -104805 -29095 29961
14619 29961 26035 37958 9904 28331 35554 3255 13273 6651 4110 -12027 -16559 40411 38906
14606 38906 -8675 -49914 -104346 -69176 -809 15813 3557 22704 57109 46902 27187 25604
14594 25604 41964 81529 57006 -2897 -105180 -75543 8379 3770 -23859 13726 104658 137046
$$ packed form
14679C7790P660j7098q757k6842q9759k1463O4779o986j4863K1139L132n4105
14667a05373j0029M9631L9028N8814k6856N2671k6387k5342j8714M7479K2881
14656E7803p5782j0546P356K7980N3882j9212n8544k9722J8715K6836r327l8523
14644d9084O456J3690R073L5280j5536o3335k9813R976m350K8823K5713J382M839
14631b6886n0956K3634J7698J0047K1017P840k5232q0804l7901L6738P5710N9056
14619B9961l926J1923k8054J8427P223l2299J0018o622k541j6137m532N6970j505
14606C8906m7581m1239n4432L5170O8367J6622j2256J9147L4405j0207j9715j583
14594B5604J6360L9565k4523n9903j02283K9637Q3922m609k7629L7585R0932L2388
$$ plain form
14582 137046 87986 100648 67209 7379 45265 21192 13290 -26793 -41625 50782 110959 75019
14570 75019 47519 79033 61215 61644 20325 20860 12689 18958 -21541 -33329 -82270 -61358 -88736
14557 -88736 -100100 -93433 -54492 -40742 -72296 -102167 -70097 -92873 -89244 -915 41447 13211
14545 13211 -1316 20754 35884 18986 53230 82407 58502 10911 16911 66609 111898 81440
14533 81440 24004 46001 67188 45134 35888 60379 46533 10922 -7025 32331 51808 46133
14521 46133 22854 -14427 -9929 67543 118851 42809 58236 60112 75935 66634 56098 63481
14509 63481 -33010 -7332 852 -41005 -68731 -40400 -5888 -24711 -50803 -17627 34228 30002
14497 30002 31860 42759 -339 -13678 -32483 -4780 -111666 -214428 -114169 44952 48166
$$ packed form
14582A37046m9060J2662l3439n9830L7886k4073p902m0083j4832R2407O0177l5940
14570G5019k7500L1514j7818M29m1319N35q171O269m0499j1788m8941K0912k7378
14557h8736j1364O667L8941J3750l1554k9871L2070k2776L629Q8329M2362k8236
14545A3211j4527K2070J5130j6898L4244K9177k3905m7591O000M9698M5289l0458
14533H1440n7436K1997K1187k2054r246K4491j3846l5611j7947L9356J9477n675
14521D6133k3279l7281M498P7472N1308p6042J5427J876J5823r301j0536P383
14509F3481r6491K5678Q184m1857k7726K8331L4512j8823k6092L3176N1855m226
14497C0002J858J0899m3098j3339j8805K7703j06886j02762J00259J59121L214
$$ plain form
14486 48166 -27545 -67236 -60273 -74894 -121167 -139002 -57686 -46073 -62231 -113470 -54237 -9882
14474 -9882 -18404 -49020 -19924 -17217 -22864 23530 -17814 18547 21149 11519 38660 -31073 -96893
14461 -96893 -83072 -103371 -157408 -101908 -21527 7675 -48607 -37714 -7059 13091 61998 131308
14449 131308 112613 30307 3825 -63240 -56078 32862 38777 -17823 -30511 10413 -15111 -21611
14437 -21611 -74771 -39291 30678 25593 4849 322 22898 2957 -19857 -23393 -18786 25815
14425 25815 614 -61191 -111165 -60883 -37897 39994 99913 72217 67213 50964 81620 97294
14413 97294 39231 35346 51310 105278 101532 54442 27226 -50866 -77357 -140212 -127148 -109109
14401 -109109 -75631 -67577 -83702 -104605 -119567 -87463 -39996 -74302 -87186 -109645 -68498 -50480
$$ packed form
14486D8166p5711l9691O963j4621m6273j7835Q1316J1613j6158n1239N9233M4355
14474i882q522l0616K9096K707n647M6394m1344L6361K602r630K7141o9733o5820
14461i6893J3821k0299n4037N5500Q0381K9202n6282J0893L0655K0150M8907O9310
14449A31308j8695q2306k6482o7065P162Q8940N915n6600j2688M0924k5524o500
14437b1611n3160L5480O9969n085k0744m527K2576j9941k2814l536M607M4601
14425B5815k5201o1805m9974N0282K2986P7891N9919k7696n004j6249L0656J5674
14413I7294n8063l885J5964N3968l746m7090k7216p8092k6491o2855J3064J8039
14401a09109L3478Q054j6125k0903j4962L2104M7467l4306j2884k2459M1147J8018
$$ plain form
14389 -50480 -91377 -140593 -84822 -90359 -46789 -28579 -29491 -34234 -45245 -49166 -61126 -40510 22196
14376 22196 9438 -21618 2490 26408 65158 111311 117147 142185 140554 89227 85639 86460 128472
14363 128472 78531 44700 8564 26737 48152 96542 55047 -4317 -1580 32263 -13862 -51073
14351 -51073 -12640 68336 59626 31069 1785 -38660 -58306 -50626 -76331 -47364 -37266 -93242
14339 -93242 -127739 -104464 -119354 -145914 -97301 -128567 -152056 -80648 -30964 3148 21041 91503
14327 91503 72099 18932 24823 -4668 27138 20709 -9565 -45501 -28791 -34886 -51521 -71494
14315 -71494 -71452 -84291 -100855 -99311 -98817 -87820 -59050 -77192 -90369 -59744 -30390 9364 1011
14302 1011 8104 -14288 -40387 -70749 -52626 22579 89428 62102 60450 40665 24614 -116
$$ packed form
14389e0480m0897m9216N5771n537M3570J8210r12m743j1011l921j1960K0616O2706
14376B2196j2758l1056K4108K3918L8750M6153N836K5038j631n1327l588Q21M2012
14363A28472m9941l3831l6136J8173K1415M8390m1495n9364K737L3843m6125l7211
14351e1073L8433Q0976q710k8557k9284m0445j9646P680k5705K8967J0098n5976
14339i3242l4497K3275j4890k6560M8613l1266k3489P1408M9684L4112J7893P0462
14327I1503j9404n3167N891k9491L1806o429l0274l5936J6710o095j6635j9973
14315g1494M2j2839j6564J544M94J0997K8770j8142j3177L0625K9354L9754q353
14302A011P093k2392k6099l0362J8123P5205O6849k7326j652j9785j6051k4730
$$ plain form
14290 -116 -21242 -16154 -41085 -11935 -3647 21299 23617 16660 48343 54358 65592 81497 91858
14277 91858 35500 -9231 13038 -23121 -59135 -4436 45913 15145 -38481 -2429 2675 -12834
14265 -12834 -15181 26460 43215 66989 66877 34540 -2910 33012 37793 37441 68099 42931 39686
14252 39686 17227 -61068 -52721 52688 58272 58962 9784 -32190 -42191 -68613 -19598 -46876
14240 -46876 -62363 -93872 -126147 -39092 18518 34828 38488 -14891 -59886 -61963 4760 28263
14228 28263 28428 -56124 -58112 -29009 -4520 34620 42102 15914 30700 31708 -40136 -67097 -65454
14215 -65454 -35291 -18807 -24356 -9878 27094 15694 -18517 -81548 -25547 -22269 19648 80679
14203 80679 53233 -20619 -87272 -114511 -90278 -37941 30647 21531 37520 37289 51941 59843
$$ packed form
14290a16k1126N088k4931K9150Q288K4946K318o957L1683O015J1234J5905J0361
14277I1858n6358m4731K2269l6159l6014N4699N0349l0768n3626L6052N104j5509
14265a2834k347M1641J6755K3774j12l2337l7450L5922M781l52L0658k5168l245
14252C9686k2459p8295Q347J05409N584O90m9178m1974j0001k6422M9015k7278
14240d6876j5487l1509l2275Q7055N7610J6310L660n3379m4995k077O6723K3503
14228B8263J65q4552j988K9103K4489L9140P482k6188J4786J008p1844k6961J643
14215f5454L0163J6484n549J4478L6972j1400l4211o3031N6001L278M1917O1031
14203H0679k7446p3852o6653k7239K4233N2337O8588r116J5989k31J4652P902
$$ plain form
14191 59843 54118 53611 52615 73013 42797 8835 -9462 -71209 -21765 26089 74949 143099 145690
14178 145690 96023 86799 131625 110046 49810 28951 35624 70456 44211 5400 -54060 -66425
14166 -66425 -41845 -71877 -140040 -68052 -21833 -42795 -15734 -14155 -15597 -15004 -49970 -67649
14154 -67649 -46556 -41041 -47400 -43468 -59967 -85029 -64462 -66131 -42176 -12950 22114 -2540
14142 -2540 -8102 5995 7916 67068 91202 79101 54025 -2451 -52258 -75718 -53987 -43910
14130 -43910 -55848 -62266 -107240 -73510 -29530 -78068 -90829 -90937 -88000 -54549 -71283 -57752
14118 -57752 -86012 -89612 -91772 -52988 -26841 -14481 5508 29744 58109 24689 51869 68807
14106 68807 -2462 -57062 -16606 -379 -44122 -46807 -35672 -58427 -58119 -31709 3197 -6087
$$ packed form
14191E9843n725n07r96K0398l0216l3962j8297o1747M9444M7854M8860O8150K591
14178A45690m9667r224M4826k1579o0236k0859O673L4832k6245l8811n9460j2365
14166f6425K4580l0032o8163P1988M6219k0962K7061J579j442N93l4966j7679
14154f7649K1093N515o359L932j6499k5062K0567j669K3955K9226L5064k4654
14142b540n562J4097J921N9152K4134j2101k5076n6476m9807k3460K1731J0077
14130d3910j1938o418m4974L3730M3980m8538j2761j08K937L3451j6734J3531
14118e7752k8260l600k160L8784K6147J2360J9989K4236K8365l3420K7180J6938
14106F8807p1269n4600M0456J6227m3743k685J1135k2755L08K6410L4906r284
$$ plain form
14094 -6087 -8229 18058 24121 2315 2379 -15539 -45886 -60422 -67202 -42462 -41910 -40285 -39192 -20196
14080 -20196 -6223 -5812 12327 -29662 -1268 -23040 -21000 -23755 -39775 -26786 5512 4847 2610
14067 2610 9067 -36046 -55843 -79507 -67042 -65252 -8160 43871 1012 -65649 -46477 -66397
14055 -66397 -105188 -109162 -46254 1474 -14149 -57339 -74183 -42174 -24540 -57989 -19564 1091
14043 1091 10879 -1337 19063 -54712 -80860 -5397 36169 67806 81869 71693 28707 46224
14031 46224 55305 64010 63047 71684 24170 -1131 7591 -35766 -66550 -10904 26996 30017 45430
14018 45430 -28730 -35488 34124 55977 50160 45438 21715 -22713 -17070 915 -53005 -3562
14006 -3562 25341 -70774 -20324 28917 14773 12921 35066 40516 -8975 -32815 -30478 -53882
$$ packed form
14094f087k142K6287O063k1806O4j7918l0347j4536o780K4740N52J625J093J8996
14080b0196J3973M11J8139m1989K8394k1772K040k755j6020J2989L2298o65k237
14067B610O457m5113j9797k3664J2465J790N7092N2031m2859o6661J9172j9920
14055f6397l8791l974O2908M7728j5623m3190j6844L2009J7634l3449L8425K0655
14043A091R788j2216K0400p3775k6148P5463M1566L1637J4063j0176m2986J7517
14031D6224R081Q705r63Q637m7514k5301Q722m3357l0784N5646L7900L021J5413
14018D5430p4160o758O9612K1853n817m722k3723m4428N643J7985n3920M9443
14006c562K8903r6115N0450M9241j4144j852K2145N450m9491k3840K337k3404
$$ plain form
13994 -53882 -44695 22373 68445 58107 -4144 -69676 -86676 -102673 -112471 -114410 -91148 -63682
13982 -63682 -15085 -23500 -40226 -11157 31237 65472 10658 -47170 -1999 37020 88204 105238
13970 105238 104901 154362 188504 156316 114200 63777 -25993 -74856 -108625 -64532 -14627 -17087
13958 -17087 -40247 -77474 -81310 -14409 38490 -1986 -12647 -31967 50754 97214 56086 -5797
13946 -5797 -65338 -50819 -9306 -6798 -19028 1380 46174 57432 13274 -5142 -61964 -49345
13934 -49345 -40166 -53593 -69187 -59434 -135739 -109943 -54180 -12938 -19520 -7881 -14873 -8986 15389
13921 15389 16779 2017 -2149 6804 26250 40398 81413 64740 27777 -10433 -5234 47950
13909 47950 60016 19385 -4594 -1216 9659 11993 50798 89615 93194 62375 71510 95461
$$ packed form
13994e3882R187O7068M6072j0338o2251o5532j7000j5997r798j939K3262K7466
13982f3682M8597q415j6726K9069M2394L4235n4814n7828M5171L9019N1184J7034
13970A05238l37M9461L4142l2188m2116n0423q9770m8863l3769M4093M9905k460
13958a7087k3160l7227l836O6901N2899m0476j0661j9320Q2721M6460m1128o1883
13946e797n9541J4519M1513K508j2230K0408M4794J1258m4158j8416n6822J2619
13934d9345R179j3427j5594R753p6305K5796N5763M1242o582J1639o992N887K4375
13921A5389J390j4762m166Q953J9446J4148M1015j6673l6963l8210N199N3184
13909D7950J2066m0631k3979L378J0875K334L8805L8817L579l0819R135K3951
$$ plain form
13897 95461 81078 58472 -6578 2214 -77522 -95853 -81303 -20196 -16277 -36142 -15982 4130
13885 4130 -30337 -12056 55272 71560 49332 30131 10058 75471 114192 116690 63821 76650
13873 76650 79872 55899 3057 -53129 -70728 -12671 -2159 -14165 -5712 8591 52769 10359
13861 10359 -12729 -16393 78125 66929 50725 6958 -28742 -52915 -73035 -83073 -63151 -52487
13849 -52487 -14859 -43010 -44340 39021 109018 81312 -10872 -4680 46610 62169 11282 -40387
13837 -40387 -28837 -50101 -82107 -21523 -12081 18170 66651 68431 40316 -29546 -51632 -34921
13825 -34921 -18417 -29473 -32565 -41541 -54605 -82477 -103710 -62233 -40516 -70106 -68565 -42638
13813 -42638 -34039 6858 -185 53207 42486 54204 14725 285 -19194 -67283 -77912 -49118
$$ packed form
13897I5461j4383k2606o5050Q792p9736j8331J4550O1107L919j9865K0160K0112
13885D130l4467J8281O7328J6288k2228j9201k0073O5413L8721K498n2869J2829
13873G6650L222k3973n2842n6186j7599N8057J0512j2006Q453J4303M4178m2410
13861A0359k3088l664R4518j1196j6204m3767l5700k4173k0120j0038J9922J0664
13849e2487L7628k8151j330Q3361O9997k7706r2184O192N1290J5559n0887n1669
13837d0387J1550k1264l2006O0584R442L0251M8481J780k8115o9862k2086J6711
13825c4921J6504j1056l092q976j3064k7872k1233M1477K1717k9590J541K5927
13813d2638Q599M0897p043N3392j0721J1718l9479j4440j9479m8089j0629K8794
$$ plain form
13801 -49118 -43626 -18410 12705 976 52216 87373 6424 31824 38793 51614 48236 45323
13789 45323 58811 59813 36189 58220 60464 61229 51915 -7705 -54242 -7337 47483 44285 -45815
13776 -45815 -22282 -2729 -15369 27023 49940 43448 56410 22347 -17941 31464 15572 -26979
13764 -26979 -36206 -29813 -61303 -42817 -16747 -11969 2597 -33824 -46012 -56430 -54691 -64662 -64948
13751 -64948 -21115 -22858 -20278 -26577 24706 131761 168222 217042 224220 213788 126105 70346
13739 70346 102929 104437 60816 34894 49052 14828 -44193 -65684 -16103 37772 50376 40709
13727 40709 15500 67744 126973 134294 59766 58330 59532 34684 35150 56465 28684 6437 -61959
13714 -61959 -44008 -14990 -176 -70570 -156358 -146429 -107402 -45992 41980 66856 -8323 -18399
$$ packed form
13801d9118N492K5216L1115j1729N1240L5157q0949K5400O969J2821l378k913
13789D5323J3488J002k3624K2031K244P65r314n9620m6537M6905N4820l198r0100
13776d5815K3533J9553j2640M2392K2917o492J2962l4063m0288M9405j5892m2551
13764b6979r227O393l1490J8486K6070M778J4566l6421j2188j0418J739r971k86
13751f4948M3833j743K580o299N1283J07055L6461M8820P178j0432q7683n5759
13739G0346L2583J508m3621k5922J4158l4224n9021k1491M9581N3875J2604r667
13727D0709k5209N2244N9229P321p4528j436J202k4848M66K1315k7781k2247o8396
13714f1959J7951K9018J4814p0394q5788R929L9027O1410Q7972K4876p5179j0076
$$ plain form
13702 -18399 52662 23327 58597 95671 90611 87881 78465 42934 17961 16678 -11755 -57408
13690 -57408 -34075 -63172 -118469 -102197 -27060 -696 14838 42650 21213 24116 34908 93221
13678 93221 38673 9468 -31196 -72373 -44788 -11806 1381 34562 7229 -15438 -3723 6327
13666 6327 20434 49770 7011 -22957 -15215 -6908 38755 55720 18140 -16640 -37752 -54384
13654 -54384 -87905 -81015 -11492 20807 -1585 -77418 -104406 -146312 -121157 -70737 -24130 -58153
13642 -58153 -125084 -114959 -61457 -2921 -20974 -13868 30128 13303 17339 -1957 823 -5253
13630 -5253 -11114 21850 52873 92344 61356 67844 30819 -2034 -43498 -66313 3214 40081
13618 40081 13506 -23634 -8279 -46547 -39901 -68977 -73193 -29683 -76 3747 -36115 -23403
$$ packed form
13702a8399P1061k9335L5270L7074n060k730r416l5531k4973j283k8433m5653
13690e7408K3333k9097n5297J6272P5137K6364J5534K7812k1437K903J0792N8313
13678I3221n4548k9205m0664m1177K7585L2982J3187L3181k7333k2667J1715J0050
13666F327J4107K9336m2759k9968P742Q307M5663J6965l7580l4780k1112j6632
13654e4384l3521O890O9523L2299k2392p5833k6988m1906K5155N0420M6607l4023
13642e8153o6931J0125N3502N8536j8053P106M3996j6825M036j9296K780o076
13630e253n861L2964L1023L9471l0988O488l7025l2853m1464k2815O9527L6867
13618D0081k6575l7140J5355l8268O646k9076m216M3510K9607L823l9862J2712
$$ plain form
13606 -23403 -50542 -87849 -62191 -19956 -15544 8471 49991 49179 2457 -21884 -37531 -65289
13594 -65289 -97227 -48223 -68525 -73683 -5590 21466 1494 -32176 -23624 18545 19236 55418
13582 55418 20784 -19565 12889 45035 67188 42819 31596 23737 -33633 -93802 -80649 -63331
13570 -63331 -20778 41669 50244 49241 20322 25437 20162 42235 -42878 -121641 -77623 -113821
13558 -113821 -59229 -42222 -8485 38354 50790 34726 4800 74653 37880 -12913 -1896
13547 -1896 42071 32999 58586 106715 108358 119291 75247 133060 134095 84148 85161 113464 93070
13534 93070 42232 -29468 -62544 -91580 -78521 -96360 -54189 22161 87796 97291 84228 85935
13522 85935 67424 53356 25757 6947 37132 35137 -40770 -64563 -60188 -51357 -29662 -6603
$$ packed form
13606b3403k7139l7307K5658M2235M412K4015M1520q12m6722k4341j5647k7758
13594f5289l1938M9004k0302n158O8093K7056j9972l3670Q552M2169O91L6182
13582E5418l4634m0349L2454L2146K2153k4369j1223p859n7370o0169J3153J7318
13570f3331M2553O2447Q575j003k8919N115n275K2073q5113p8763M4018l6198
13558a13821N4592J7007L3737M6839J2436j6064k9926O9853l6773n0793J1017
13547a896M3967r072K5587M8129J643J0933m4044N7813J035m9947J013K8303k0394
13534I3070n0838p1700l3076k9036J3059j7839M2171P6350O5635R495j3063J707
13522H5935j8511j4068k7599j8810L0185j995p5907k3793M375Q831K1695K3059
$$ plain form
13510 -6603 -8654 23695 51700 33100 41770 39576 -31165 -75236 -9104 -57084 -83371 -76042 -94285
13497 -94285 -115035 -77353 -61136 24515 90963 130969 47753 -6506 -3017 30184 -25933 -93723
13485 -93723 -106670 -73683 -32551 -35293 -44447 -57549 -39336 -10170 -19225 -9481 52049 71791
13473 71791 78803 33467 18152 42175 -29619 -23459 -3344 -33402 29106 43848 117368 141493
13461 141493 115595 25105 95 -28596 -20352 -67637 -51904 -14136 -9730 -11184 -53634 -74841
13449 -74841 -59962 -68697 -57958 -85692 -95831 -40806 19548 -10456 7728 23190 26624 31264
13437 31264 53192 50127 -28277 8292 24234 25651 37527 77168 135529 75007 16389 25432
13425 25432 16570 -33885 18824 29838 15302 50597 25977 -10179 37497 28793 16432 35586
$$ packed form
13510f603k051L2349K8005j8600Q670k194p0741m4071O6132m7980k6287P329j8243
13497i4285k0750L7682J6217Q5651O6448M0006q3216n4259L489L3201n6117o7790
13485i3723j2947L2987M1132k742r154j3102J8213K9166r055R744O1530J9742
13473G1791P012m5336j5315K4023p1794O160K0115l0058O2508J4742P3520K4125
13461A41493k5898r0490k5010k8691Q244m7285J5733L7768M406j454m2450k1207
13449g4841J4879q735J0739k7734j0139N5025O0354l0004J8184J5462L434M640
13437C1264K1928l065p8404L6569J5942J417J1876L9641N8361o0522n8618R043
13425B5432q862n0455N2709J1014j4536L5295k4620l6156M7676q704j2361J9154
$$ plain form
13413 35586 47414 96676 57134 90173 179214 143415 86282 15371 18524 5474 -39739 -19523
13401 -19523 18711 -15938 -102532 -129946 -100036 3082 -9914 -40621 -83161 -61766 -30459
13390 -30459 -31177 -49613 -19304 -43176 -47577 -10514 10687 27262 -8348 -49627 -31881 -72334
13378 -72334 -171462 -123396 -38517 -2739 -31922 -59646 -49693 -58678 -94607 -24861 69220 53637
13366 53637 55090 85468 88486 93833 122930 80200 2764 -6442 -25075 -15152 -20041 -12251 -28997
13353 -28997 8245 68256 105821 89393 63685 57469 58889 36297 -8166 -5251 9765 21464
13341 21464 70971 27589 -31411 -3159 1010 1420 53455 48971 668 -15840 11540 -12162
13329 -12162 -72133 -18632 41171 75383 65759 100983 96374 70549 -9597 -32540 -23471 56851
$$ packed form
13413C5586J1828M9262l9542L3039Q9041l5799n7133p0911L153j3050m5213K0216
13401a9523L8234l4649q6594k7414K9910J03118j2996l0707m2540K1395L1307
13390c0459p18j8436L0309k3872m401L7063K1201J6575l5610m1279J7746m0453
13378g2334r9128M8066Q4879L5778k9183k7724R953q985l5929O9746R4081j5583
13366E3637J453L0378L018N347K9097m2730p7436r206j8633R923m889P790j6746
13353b8997L7242O0011L7565j6428k5708o216J420k2592m4463K915J5016J1699
13341B1464M9507m3382n9000K8252M169M10N2035m484m8303j6508K7380k3702
13329a2162n9971N3501N9803L4212r624L5224m609k5825q0146k2943R069Q0322
$$ plain form
13317 56851 100147 84941 30635 38504 20 30596 43577 -15952 -14844 -66048 -17416 -22241
13305 -22241 -25361 25882 32512 48400 61722 117713 62763 31529 59553 23502 -4414 4605
13293 4605 22131 25573 42783 43618 -41982 -56826 -42947 -21597 -22168 -72230 -16392 27069 -5939
13280 -5939 21818 12845 -71304 -92548 -61905 -4017 24405 -342 11908 -11523 12489 55293
13268 55293 45684 51874 10548 -31555 -74224 -6961 -1159 -4749 38841 86057 25139 -59876
13256 -59876 -79937 -132670 -124993 -4562 10035 -5171 18264 18762 17681 3895 56651 52972
13244 52972 30147 -50746 -127494 -136283 -117024 -67261 -33152 -63096 -21790 45973 75379 62704
13232 62704 51984 13460 -11837 42565 64914 90306 110157 75684 95704 73490 70342 52314
$$ packed form
13317E6851M3296j5206n4306P869l8484L0576J2981n9529J108n1204M8632m825
13305b2241l120N1243O630J5888J3322N5991n4950l1234K8024l6051k7916R019
13293D605J7526L442J7210Q35q5600j4844J3879K1350n71n0062N5838M3461l3008
13280e939K7757q973q4149k1244L0643N7888K8422k4747J2250k3431K4012M2804
13268E5293r609O190m1326m2103m2669O7263N802l590M3590M7216o0918q5015
13256e9876k0061n2733P677J20431J4597j5206K3435M98j081j3786N2756l679
13244E2972k2825q0893p6748q789J9259M9763L4109k9944M1306O7763K9406j2675
13232F2704j0720l8524k5297N4402K2349K5392J9851l4473K0020k2214l148j8028
$$ plain form
13220 52314 19142 30559 -25465 -33712 -7519 9783 29457 40789 50120 64047 22980 3290
13208 3290 46614 25648 8266 29307 43965 69497 134905 123977 160990 214862 219328 143316
13196 143316 68582 23528 20546 1639 -56656 -54829 -34889 22657 97311 100479 65727 8048
13184 8048 -47782 -39565 2914 560 11120 32007 77881 118804 98492 63237 42622 72723
13172 72723 28420 41250 32838 56687 74594 -1457 -9724 33127 55033 70934 68453 70498
13160 70498 64000 115861 171475 156875 159638 232108 310245 389791 458267 433483 341828 246943
13148 246943 187067 132706 97074 24950 23846 85115 63116 10702 4260 23022 36000 85155
13136 85155 60156 36486 25829 9112 12952 19218 -6547 -13926 1743 59905 59392 -312 -15620
$$ packed form
13220E2314l3172J1417n6024q247K6193J7302J9674J1332R331J3927m1067j9690
13208C290M3324k0966j7382K1041J4658K5532O5408j0928L7013N3872M466p6012
13196A43316p4734m5054k982j8907n8295J827J9940N7546P4654L168l4752n7679
13184H048n5830Q217M2479k354J0560K0887M5874M0923k0312l5255k0615L0101
13172G2723m4303J2830q412K3849J7907p6051q267M2851K1906J5901k481K045
13160G0498o498N1861N5614j4600K763P2470P8137P9546O8476k4784r1655r4885
13148B46943n9876n4361l5632p2124j104O1269k1999n2414o442J8762J2978M9155
13136H5155k4999k3670j0657j6717L840O266k5765p379J5669N8162n13n9704j5308
$$ plain form
13123 -15620 -16434 -46502 -43473 -21501 -27435 -16457 47564 76337 116235 158844 179057 221389
13111 221389 207691 259381 342100 444427 468090 435072 420687 324514 254020 194432 116230
13100 116230 47742 55887 -4226 34894 106189 113610 62837 37881 28646 55096 39179 56089
13088 56089 49160 28185 5560 26558 102825 124884 66734 28317 2938 30008 -12824 -11295
13076 -11295 14639 10421 36344 19160 -31067 -67022 -104480 -114677 -103386 2899 63356 87912
13064 87912 94698 100137 128358 145317 186569 168548 166213 130823 44144 -4372 32011 54043
13052 54043 92039 70801 68557 90195 119671 119260 118531 133071 128449 146581 121331 96768 31982
13039 31982 14074 6488 -26511 -39157 15320 37414 16981 36066 65455 93343 126983 97281
$$ packed form
13123a5620q14l0068L029K1972n934J0978O4021K8773L9898M2609K0213M2332
13111B21389j3698N1690Q2719J02327K3663l3018j4385r6173p0494n9588p8202
13100A16230o8488Q145o0113L9120P1295P421n0773k4956r235K6450j5917J6910
13088E6089o929k0975k2625K0998P6267K2059n8150l8417k5379K7070m2832J529
13076a1295K5934m218K5923j7184n0227l5955l7458j0197J1291J06285O0457K4556
13064H7912O786N439K8221J6959M1252j8021k335l5390q6679m8516L6383K2032
13052E4043L7996k1238k244K1638K9476m11p29J4540m622J8132k5250k4563o4786
13039C1982j7908p586l2999j2646N4477K2094k0433J9085K9389K7888L3640k9702
$$ plain form
13027 97281 42285 46640 -22069 -6440 -7584 3030 -32534 -40724 -3101 94705 144247 172178
13015 172178 196487 126294 101003 84956 26189 -16183 32713 72530 17323 -3207 14104
13004 14104 -26362 -15203 -30137 -61644 13165 1956 -8412 18451 56261 59379 98168 147698
12992 147698 114865 27264 -21959 -45045 -83708 -62866 -29617 -12860 -34503 -41993 -28958 -19904
12980 -19904 -20723 39526 43491 32989 18788 6264 11874 -8515 -24732 -14178 953 -27399
12968 -27399 -105209 -54990 -41191 -32080 -23046 -4179 35416 50238 70907 87120 142848 115375
12956 115375 38053 35790 39952 53558 46224 85272 107819 118736 118250 86888 31474 41475
12944 41475 61326 107164 130900 101799 85025 15634 21347 15792 45580 109589 82764 -8098
$$ packed form
13027I7281n4996M355o8709J5629j144J0614l5564q190L7623R7806M9542K7931
13015A72178K4309p0193k5291j6047n8767m2372M8896L9817n5207k0530J7311
13004A4104m0466J1159j4934l1507P4809j1209j0368K6863L7810L118L8789M9530
12992A47698l2833q7601m9223k3086l8663K0842L3249J6757k1643p490J3035R054
12980a9904q19O0249L965j0502j4201j2524N610k0389j6217J0554J5131k8352
12968b7399p7810N0219J3799R111R034J8867L9595J4822K0669J6213N5728k7473
12956A15375p7322k263M162J3606p334L9048K2547J0917m86l1362n5414J0001
12944D1475J9851M5838K3736k9101j6774o9391N713n555K9788O4009k6825r0862
$$ plain form
12932 -8098 -6067 9978 80287 83294 14846 7535 2189 -44532 3773 12226 11211 -23678 -42993
12919 -42993 18804 12316 4430 33628 -8147 -36078 -21410 15475 51159 38717 12662 -5881
12907 -5881 -27239 -59726 -48722 -18982 -45365 -98357 -161540 -171957 -123709 -41385 23059 -3591
12895 -3591 -9729 15736 9489 -54634 -83869 -61342 -18402 36107 21830 11976 66839 96374
12883 96374 108332 5656 -15676 47578 111690 119135 107210 87952 78461 42245 11699 -54869
12871 -54869 -94810 -45537 39507 113945 98408 78438 41633 -20072 -14773 -53391 -25613 47764
12859 47764 39987 11228 75543 95352 44362 27619 22262 20773 -5789 2053 -18660 -18897 -59526
12846 -59526 -73426 9485 51384 79898 111028 107612 41152 -2759 41310 59868 31220 29048
$$ packed form
12932h098K031J6045P0309L007o8448p311n346m6721M8305Q453j015l4889j9315
12919d2993O1797o488p886K9198m1775k7931J4668L6885L5684j2442k6055j8543
12907e881k1358l2487J1004K9740k6383n2992o3183j0417M8248Q2324O4444k6650
12895c591o138K5465o247o4123k9235K2527M2940N4509j4277r854N4863K9535
12883I6374J1958j02676k1332O3254O4112P445j1925j9258r491l6216l0546o6568
12871e4869l9941M9273Q5044P4438j5537j9970l6805o1705N299l8618K7778P3377
12859D7764p777k8759O4315J9809n0990j6743n357j489k6562P842k0713k37m0629
12846e9526j3900Q2911M1899K8514L1130l416o6460m3911M4069J8558k8648k172
$$ plain form
12834 29048 87327 86893 10538 163 33209 74320 57244 34516 26265 -28564 -23972 -1720
12822 -1720 -21022 -10493 -14694 26091 74922 74347 48804 38742 48931 78787 51428 -31058
12810 -31058 -93772 -53310 -13734 -21714 -52681 -88631 2271 17265 23915 17429 7722 16482 30870
12797 30870 79377 82464 13992 -4264 1646 22886 44977 59360 39160 18977 -8965 -11899
12785 -11899 -40440 -48177 -61584 -20688 -23118 -92327 -106894 -68110 -3367 17786 67331 82352
12773 82352 108588 97975 56598 34048 14174 11486 31383 19944 -35054 -6989 29868 77471
12761 77471 60401 54847 16731 50697 107700 98207 54098 59119 97937 90328 41397 1611
12749 1611 -7088 48392 47047 -7087 -52421 -2172 19075 89771 84869 107821 101732 57570 23788
$$ packed form
12834B9048N8279m34p6355j0375L3046M1111j7076k2728q251n4829M592K2252
12822a720j9302J0529m201M0785M8831n75k5543j0062J0189K9856k7359q2486
12810c1058o2714M0462L9576p980l0967l5950R0902J4994O650o486r707Q760J4388
12797C0870M8507L087o8472j8256N910K1240K2091J4383k0200k0183k7942k934
12785a1899k8541p737j3407M0896k430o9209j4567L8784O4743K1153M9545J5021
12773H2352K6236j0613m1377k2550j9874k688J9897j1439n4998K8065L6857M7603
12761G7471j7070n554l8116L3966N7003r493m4109N021L8818p609m8931l9786
12749A611q699N5480j345n4134m5334N0249K1247P0696m902K2952o089m4162l3782
$$ plain form
12736 23788 10536 17759 27215 -18940 -61731 -49249 -84601 -62584 -63610 -44314 10155 -4610
12724 -4610 -20173 -49799 -62184 -72138 -50317 30893 77220 41933 35937 -12399 -29329 2537
12712 2537 15631 57875 96511 91958 75874 61276 54808 55059 22619 -3133 29710 99732 126993
12699 126993 121693 92534 54785 37741 18851 26987 41260 49191 53928 61835 16531 13897 -3794
12686 -3794 -3961 52662 24361 38040 76966 64496 18898 8670 81392 140027 154136 155625
12674 155625 111150 58781 49301 71489 36272 -15521 17448 31761 86296 83980 91746 87570
12662 87570 126110 127841 97650 23169 16977 53864 40663 43138 9039 75858 118728 112625
12650 112625 102915 113275 124678 105430 25944 73873 82417 37997 -12106 6054 3732 -53531
$$ packed form
12736B3788j3252P223R456m6155m2791J2482l5352K2017j026J9296N4469j4765
12724d610j5563k9626j2385r954K1821Q1210M6327l5287n996m8336j6930L1866
12712B537J3094M2244L8636m553j6084j4598o468K51l2440k5752L2843P0022K7261
12699A26993n300k9159l7749j7044j8890Q136J4273P931M737P907m5304k634j7691
12686c794j67N6623k8301J3679L8926j2470m5598j0228P2722N8635J4109J489
12674A55625m4475n2369r480K2188l5217n1793L2969J4313N4535k316P766m176
12662H7570L8540J731l0191p4481o192L6887j3201K475l4099O6819M2870o103
12650A12625r710J0360J1403j9248p9486M7929Q544m4420n0103J8160k322n7263
$$ plain form
12638 -53531 -19441 32444 72513 103028 121034 69591 -48619 -70332 -59647 27276 78577
12627 78577 110020 83240 40982 7144 22111 70886 81334 31097 43196 85485 98905 78975
12615 78975 101831 91394 46743 54221 76571 55527 16435 -28171 18224 77448 87123 113962
12603 113962 133258 129398 76617 59748 75818 85041 105522 120821 76330 30979 20897 22358
12591 22358 74801 134275 114875 32107 37359 67327 56826 21234 -35670 -81893 10486 43082
12579 43082 19324 45221 80835 94155 134132 96146 25021 25270 -14101 16802 27729 5674
12567 5674 5468 37237 110654 133080 82472 69745 117500 122072 165374 142359 121416 150421
12555 150421 127622 161299 193081 189062 180087 129508 120286 96072 54301 23388 26219 60127
$$ packed form
12638e3531L4090N1885M0069L0515J8006n1443j18210k1713J0685Q6923N1301
12627G8577L1443k6780m2258l3838J4967M8775J0448n0237J2099M2289J3420j9930
12615G8975K2856j0437m4651P478K2350k1044l9092m4606M6395N9224R675K6839
12603A13962J9296l860n2781j6869J6070R223K0481J5299m4491m5351j0082J461
12591B2358N2443N9474j9400q2768N252K9968j0501l5592n6904m6223R2379L2596
12579D3082k3758K5897L5614J3320L9977l7986p1125K49l9371L0903J0927k2055
12567E674k06L1769P3417K2426n0608j2727M7755M572M3302k3015k0943K9005
12555A50421k2799L3677L1782m019q975n0579r222k4214m1771l0913K831L3908
$$ plain form
12543 60127 120355 144589 153018 159782 172608 202401 130511 104826 111311 98872 135136 165860
12531 165860 91958 441 -62882 -57166 -26027 59382 121984 106903 86299 66632 24743 33496
12519 33496 94318 159066 169772 155039 107051 129251 163135 139760 106758 75157 73719 95445
12507 95445 126708 164132 148356 110657 107709 114349 129565 175985 156303 122044 84666 111984
12495 111984 160231 163471 149657 109515 46925 37674 664 -28053 36071 119945 139045 90389
12483 90389 72846 47587 59923 33212 47740 47795 54714 78266 33338 60571 120244 104726
12471 104726 89017 119189 128921 58971 56895 135906 217399 207136 130275 115377 130400 118092
12459 118092 123113 120284 93000 67788 105618 94384 67080 61588 15356 22220 -22944 6985
$$ packed form
12543F0127O0228K4234Q429O764J2826K9793p1890k5685O485j2439L6264L0724
12531A65860p3902r1517o3323N716L1139Q5409O2602j5081k0604j9667m1889Q753
12519C3496O0822O4748J0706j4733m7988K2200L3884k3375l3002l1601j438K1726
12507I5445L1263L7424j5776l7699k948O640J5216M6420j9682l4259l7378K7318
12495A11984M8247L240j3814m0142o2590r251l7010k8717O4124Q3874J9100m8656
12483I0389j7543k5259J2336k6711J4528N5O919K3552m4928K7233N9673j5518
12471A04726j5709L0172R732o9950k076P9011Q1493j0263p6861j4898J5023j2308
12459A18092N021k829k7284k5212L7830j1234k7304n492m6232O864m5164K9929
$$ plain form
12447 6985 34753 92833 119231 179857 158840 88604 90399 106375 86573 92820 132211 120730
12435 120730 114719 101736 70030 55602 59639 106615 144172 147311 103815 44813 17518 29660
12423 29660 64630 145169 181585 163310 152931 91663 98413 138617 161158 178699 224017 208697
12411 208697 161797 106713 144446 146995 160048 158056 174104 138578 64140 54745 80220 119783
12399 119783 82054 71594 112700 142870 157148 155241 147218 98976 58641 66645 104838 168156
12387 168156 163721 84408 109348 137230 135634 185936 104415 55299 43711 100763 139807 140134
12375 140134 135975 148399 159002 131001 108858 124314 142764 183018 199489 146462 153672 241148
12363 241148 294739 286934 220699 222144 251336 257688 316301 325337 435701 575844 626153 683776
$$ packed form
12447F985K7768N8080K6398O0626k1017p0236J795J5976j9802O247L9391j1481
12435A20730o011j2983l1706j4428M037M6976L7557L139m3496n9002k7295J2142
12423B9660L4970Q0539L6416j8275j0379o1268O750M0204K2541J7541M5318j5320
12411B08697m6900n5084L7733K549J3053j992J6048l5526p4438r395K5475L9563
12399A19783l7729j0460M1106L0170J4278j907q023m8242m0335Q004L8193O3318
12387A68156m435p9313K4940K7882j596N0302q1521m9116j1588N7052L9044L27
12375A40134m159J2424J0603k8001k2143J5456J8450M0254J6471n3027P210Q7476
12363B41148N3591p805o6235J445K9192O352N8613R036J10364J40143N0309N7623
$$ plain form
12351 683776 785231 798427 766133 747072 758625 686239 652345 641054 662071 679782 649515
12340 649515 605190 556662 518201 516850 493145 453102 455830 481967 495463 483426 517114 500791
12328 500791 483542 441852 455147 463274 471587 484285 505338 566803 570569 522971 503716 585452
12316 585452 684237 782502 914959 1062257 1283955 1534494 1740013 1847095 1949282 1889035
12306 1889035 1784516 1682643 1542728 1306535 1084584 968354 855472 773783 759699 746958
12296 746958 761367 772139 752442 818459 805171 732977 742039 735251 729555 653958 624822 645233
12284 645233 638370 622773 644237 628693 633781 555114 542977 528064 520206 554251 558003 568245
12272 568245 599665 663552 689705 704982 745437 802163 861564 878531 837032 794971 735560
$$ packed form
12351F83776J01455J3196l2294j9061J1553p2386l3894j1291K1017J7711l0267
12340F49515m4325m8528l8461j351k3705m0043K728K6137J3496j2037L3688j6323
12328E00791j7249m1690J3295Q127Q313J2698K1053O1465L766m7598j9255Q1736
12316E85452R8785R8265J32457J47298K21698K50539K05519J07082J02187o0247
12306A889035j04519j01873j39915k36193k21951j16230j12882q1689j4084j2741
12296G46958J4409J0772j9697O6017j3288p2194R062o788n696p5597k9136K0411
12284F45233o863j5597K1464j5544N088p8667j2137j4913p858L4045L752J0242
12272E68245L1420O3887K6153J5277M0455N6726N9401J6967m1499m2061n9411
$$ plain form
12261 735560 638648 601784 560151 467735 423288 417368 397798 311214 192484 164995 213845
12250 213845 196025 171393 215041 233160 254491 227774 177903 189774 221896 215762 225313 169316
12238 169316 211633 192282 173439 229747 285674 262825 225082 238393 252946 264756 253505
12227 253505 190788 180036 219929 242160 226618 182430 140554 182626 221974 196006 162047
12216 162047 155105 185516 168030 162165 178264 190247 245656 255629 210997 210109 258719 264727 250541
12203 250541 242772 235459 206719 209099 242292 239120 227865 181642 183592 206627 231619 193821
12191 193821 240993 259169 239838 255528 238488 180044 187079 199364 183011 186144 169711 127526
12179 127526 108713 175730 196835 235660 237574 192872 119272 92974 159057 191653 181239 155725
$$ packed form
12261G35560r6912l6864m1633r2416m4447n920j9570q6584j18730k7489M8850
12250B13845j7820k4632M3648J8119K1331k6717m9871J1871L2122o134R551n5997
12238A69316M2317j9351j8843N6308N5927k2849l7743J3311J4553J1810j1251
12227B53505o2717j0752L9893K2231j5542m4188m1876M2072L9348k5968l3959
12216A62047o942L0411j7486n865J6099J1983N5409R973m4632q88M8610O008j4186
12203B50541p769p313k8740K380L3193l172j1255m6223J950K3035K4992l7798
12191A93821M7172J8176j9331J5690j7040n8444P035J2285j6353L133j6433m2185
12179A27526j8813O7017K1105L8825J914m4702p3600k6298O6083L2596j0414k5514
$$ plain form
12167 155725 201311 257328 312963 336995 257778 238690 226914 227556 276258 338594 378975 391152
12155 391152 283596 187444 139384 172128 236514 242279 239847 250422 258837 265072 318406 336559
12143 336559 314382 275470 291235 268970 282145 303085 306417 337010 358458 329008 347553 365329
12131 365329 355890 335924 359450 365954 317939 291186 313043 407887 474128 440503 452816 509194
12119 509194 588639 551668 479829 424999 428439 446554 492659 464440 378564 375588 419294 419313
12107 419313 498855 576638 570695 532988 527323 555795 600982 664806 695488 654165 613441 580429
12095 580429 504194 487111 490979 504821 549916 524354 524145 514829 544747 623370 591744 473849
12083 473849 460682 511269 555765 528180 509197 475725 466531 511788 555591 562813 626067 674774
$$ packed form
12167A55725M5586N6017N5635K4032p9217j9088j1776O42M8702O2336M0381J2177
12155C91152j07556r6152m8060L2744O4386N765k432J0575Q415O235N3334J8153
12143C36559k2177l8912J5765k2265J3175K0940L332L0593K1448k9450J8545J7776
12131C65329r439j9966K3526O504m8015k6753K1857R4844O6241l3625J2313N6378
12119E09194P9445l6971p1839n4830L440J8115M6105k8219q5876k976M3706J9
12107D19313P9542P7783n943l7707n665K8472M5187O3824L0682m1323m0724l3012
12095E80429p6235j7083L868J3842M5095k5562k09r316K9918P8623l1626j17895
12083D73849j3167N0587M4496k7585j8983l3472r194M5257M3803P222O3254M8707
$$ plain form
12071 674774 642754 588118 630801 670691 637275 602351 544147 528792 634488 710388 797543
12060 797543 877476 945225 993674 1019325 981397 937624 891765 866915 789819 685731 650965
12049 650965 637399 714348 693361 595189 615032 688148 766008 790904 788787 793696 790468 798558
12037 798558 754525 714389 709342 732453 764153 714279 764477 825828 767324 742233 735161 718998
12025 718998 742806 747554 696266 680255 777238 876897 914527 925278 968806 995089 1035940 1057240
12013 1057240 1092986 1073031 1020740 1055125 1066165 1057426 1009445 1053543 1111325 1137552 1086467
12002 1086467 1091655 1125219 1139473 1141935 1192550 1227699 1311248 1412809 1444449 1508978 1584511
11991 1584511 1685504 1807700 1956790 2165481 2311426 2405175 2558235 2683760 2748693 2841529
$$ packed form
12071F74774l2020n4636M2683L9890l3416l4924n8204j5355J05696P5900Q7155
12060G97543P9933O7749M8449K5651l7928m3773m5859k4850p7096j04088l4766
12049F50965j3566P6949k0987r8172J9843P3116P7860K4896k117M909l228Q090
12037G98558m4033m0136n047K3111L1700m9874N0198O1351n8504k5091p072j6163
12025G18998K3808M748n1288j6011R6983R9659L7630J0751M3528K6283M0851K1300
12013A057240L5746j9955n2291L4385J1040q739m7981M4098N7782K6227n1085
12002A086467N188L3564J4254K462N0615L5149Q3549J01561L1640O4529P5533
11991A584511J00993J22196J49090K08691J45945R3749J53060J25525O4933R2836
$$ plain form
11981 2841529 2932031 2991219 3026720 3043535 3092995 3029035 2918915 2906073 2896281 2900251 2943489
11970 2943489 3006488 3066448 3210011 3318392 3400086 3412486 3378149 3341991 3269709 3204575 3096694
11959 3096694 3032993 2975983 2915811 2864766 2930278 3008138 3047825 3146867 3241258 3416012 3665638
11948 3665638 3997586 4335197 4768354 5284503 5822732 6303972 6771151 7313468 7813723
11939 7813723 8373269 8930822 9537914 10220184 10963321 11890443 12953438 14125928 15239607
11930 15239607 16128628 16855685 17338346 17657477 17960298 18346630 18842685 19493112 20473092
11921 20473092 21917564 24021473 27121895 31678718 38250894 47455643 59932562 75889458
11913 75889458 94703581 113446472 127337348 132789174 129706998 120696959 108961285
$$ packed form
11981B841529R0502N9188L5501J6815M9460o3960j10120j2842r792L970M3238
11970B943489O2999N9960J43563J08381Q1694J2400l4337l6158p2282o5134j07881
11959C096694o3701n7010o0172n1045O5512P7860L9687R9042R4391J74754K49626
11948C665638L31948L37611M33157N16149N38229M81240M67179N42317N00255
11939G813723N59546N57553O07092O82270P43137R27122J062995J172490J113679
11930A5239607Q89021P27057M82661L19131L02821L86332M96055O50427R79980
11921B0473092J444472K103909L100422M556823O572176R204749J2476919J5956896
11913G5889458J8814123J8742891J3890876N451826l082176r010039j1735674
$$ plain form
11906 108961285 96775437 85702272 76908904 70839199 67455039 66370835 67324206 69951146
11898 69951146 73607507 77736187 81567432 84252668 85640261 86184313 86486357 86957273
11890 86957273 87780441 89493942 92390514 96479211 101051353 105090066 107839147 108852609
11882 108852609 108202989 106405842 104330243 103032898 103304611 105620708 110269455 118284432
11874 118284432 131638849 153365294 187124241 233619131 286346698 331617577 355661784
11867 355661784 354286208 332984594 300323752 262674269 224701534 190385048 162304030
11860 162304030 141516982 127601830 119474108 115897561 115392413 116613053 118288163 118919138
11852 118919138 117709764 114643808 110382241 105608528 100852832 96612426 93419671 91644078
$$ packed form
11906A08961285j2185848j1073165q793368o069705l384160j084204R53371K626940
11898F9951146L656361M128680L831245K685236J387593N44052L02044M70916
11890H6957273Q23168J713501K896572M088697M572142M038713K749081J013462
11882A08852609o49620j797147k075599j297345K71713K316097M648747Q014977
11874A18284432J3354417K1726445L3758947M6494890N2727567M5270879K4044207
11867C55661784j375576k1301614l2660842l7649483l7972735l4316486k8081018
11860A62304030k0787048j3915152q127722l576547n05148J220640J675110O30975
11852A18919138j209374l065956m261567m773713m755696m240406l192755j775593
$$ plain form
11844 91644078 90927202 90493534 89608836 87894139 85381581 82367561 79116827 76072860
11836 76072860 73558119 71722875 70771258 71168529 73700910 79727347 90499070 106038922
11828 106038922 123756369 138477541 145532596 143694967 134694897 121059621 104728657
11821 104728657 87482875 71270019 57567641 46909387 39069425 33491554 29599041
11814 29599041 27018525 25303126 24084215 23274648 22761562 22371416 21920225 21350844 20627140
11805 20627140 19630103 18460594 17234676 15957578 14652676 13404503 12311499 11399294
11797 11399294 10567419 9802869 9142157 8470673 7853953 7233833 6546173 5908605 5355410
11788 5355410 4848966 4352648 3973241 3689692 3480243 3382990 3221747 3031816 2904787 2884674
$$ packed form
11844I1644078p16876m33668q84698j714697k512558l014020l250734l043967
11836G6072860k514741j835244r51617L97271K532381O026437J0771723J5539852
11828A06038922J7717447J4721172P055055j837629r000070j3635276j6330964
11821A04728657j7245782j6212856j3702378j0658254p839962n577871l892513
11814B9599041k580516j715399j218911q09567n13086l90146m51191n69381p23704
11805B0627140r97037j169509j225918j277098j304902j248173j093004r12205
11797A1399294q31875p64550o60712o71484o16720o20120o87660o37568n53195
11788E355410n06444m96318l79407k83549k09449r7253j61243j89931j27029k0113
$$ plain form
11778 2884674 2916859 2994462 3040828 3114671 3248981 3342534 3446696 3482640 3482079 3442600 3355255
11767 3355255 3298715 3243928 3172547 3110621 3114441 3165340 3264712 3300899 3273618 3235504 3291261
11756 3291261 3308487 3265266 3210565 3140943 2982916 2848524 2728656 2511943 2304975 2075285
11746 2075285 1837697 1702247 1570701 1409426 1226738 1135147 1117236 1104881 1103521 1147278
11736 1147278 1167400 1131520 1092647 1037099 1022060 1063753 981107 927210 878587 769346 681334
11725 681334 658498 561641 486951 488762 426309 433734 467840 461113 403182 408421 419389 465322
11713 465322 581643 605949 495825 475200 441807 345591 280773 245810 169482 138437 121287
11702 121287 134332 211032 197183 138448 126937 133383 128371 64992 19823 75819 84697 69030
$$ packed form
11778B884674L2185P7603M6366P3843J34310R3553J04162L5944n61l9479q7345
11767C355255n6540n4787p1381o1926L820N0899R9372L6187k7281l8114N5757
11756C291261J7226m3221n4701o9622j58027j34392j19868k16713k06968k29690
11746B075285k37588j35450j31546j61275j82688r1591j7911j2355j360M3757
11736A147278K0122l5880l8873n5548j5039M1693q2646n3897m8623j09241q8012
11725F81334k2836r6857p4690J811o2453P425L4106o727n7931N239J0968M5933
11713D65322J16321K4306j10124k0625l3393r6216o4818l4963p6328l1045j7150
11702A21287J3045P6700j3849n8735j1511O446n012o3379m5169N5996Q878j5667
$$ plain form
11690 69030 113937 105995 155240 113453 80863 48067 -40078 -93832 -156645 -215326 -295412 -316782
11678 -316782 -376653 -386030 -324664 -262469 -156466 -88445 -115061 -57139 5699 37685 9406
11667 9406 21684 20409 -13136 -32476 51225 51628 -11327 -72807 -42153 -43558 -60601 -21434 23157
11654 23157 41853 19037 -24461 -32381 13917 8011 4863 -23507 -29784 -86312 -64396 -70892 -62857
11641 -62857 -33276 -80341 -68565 -88317 -134265 -138501 -88348 -76392 43680 75064 51561 72951
11629 72951 114100 143967 115464 45293 7870 9995 58526 92696 126167 24940 -57817 -30954
11617 -30954 -2225 475 -4426 -18732 -46122 -26383 -6940 33547 56159 50700 103888 108743
11605 108743 74552 51194 28536 45626 87815 122017 159705 197921 170909 89090 54128
$$ packed form
11690F9030M4907p942M9245m1787l2590l2796q8145n3754o2813n8681q0086k1370
11678c16782n9871r377O1366O2195J06003O8021k6616N7922O2838L1986k8279
11667I406J2278j275l3545j9340Q3701M03o2955o1480L0654j405j7043L9167M4591
11654B3157J8696k2816m3498p920M6298n906l148k8370o277n6528K1916o496Q035
11641f2857K9581m7065J1776j9752m5948m236N0153J1956J20072L1384k3503K1390
11629G2951M1149K9867k8503p0171l7423K125M8531L4170L3471j01227q2757K6863
11617c0954K8729K700m901j4306k7390J9739J9443M0487K2612n459N3188M855
11605A08743l4191k3358k2658J7090M2189L4202L7688L8216k7012q1819l4962
$$ plain form
11594 54128 32180 58109 83369 12450 23874 83597 107917 131620 106024 97692 127388 106209
11582 106209 29711 -21720 -3942 2419 30942 27419 96055 158978 144387 103003 121623 89387
11570 89387 70347 117966 130644 118718 119974 107132 101331 120205 117974 165771 188349 172905
11558 172905 127073 170345 133923 66846 79862 120487 111170 90947 50458 27627 31808 19204
11546 19204 37649 57460 53986 14998 48366 11161 2298 -17278 -3928 45693 41772 36292
11534 36292 80021 102323 100484 50441 5115 63818 120707 89004 121904 115038 110945 125128
11522 125128 127110 84603 53611 53633 45833 58412 68922 29884 24469 32066 34404 12289 -2701
11509 -2701 23361 -10419 -8942 -20828 -44569 -79116 -103238 -104070 -104533 -73415 -60439 -31240 -71459
$$ packed form
11594E4128k1948K5929K5260p0919J1424N9723K4320K3703k5596q332K9696k1179
11582A06209p6498n1431J7778O361K8523l523O8636O2923j4591m1384J8620l2236
11570H9387j9040M7619J2678j1926J256j2842n801J8874k231M7797K2578j5444
11558A72905m5832M3272l6422o7077J3016M0625r317k0223m0489k2831M181j2604
11546A9204J8445J9811l474l8988L3368l7205q863j9576J3350M9621l921n480
11534C6292M3729K2302j839n0043m5326N8703N6889l1703L2900o866m093J4183
11522A25128J982m2507l0992K2p800J2579J0510l9038n415P597K338k2115j4990
11509b701K6062l3780J477j1886k3741l4547k4122q32m63L1118J2976K9199m0219
$$ plain form
11496 -71459 -71313 -25111 29810 8278 -42293 -7398 33087 19831 19604 8785 2976 29693 91525
11483 91525 62823 57243 89429 92362 60920 67003 113317 203725 190966 173424 128857 63601
11471 63601 88755 151334 255634 384184 432019 495311 630235 740104 751381 770014 703551
11460 703551 578916 555468 506761 471757 474326 469664 450190 479265 422827 370464 385422 382852
11448 382852 390372 372538 405528 437056 424598 410719 434158 457128 475345 546316 559889 561694
11436 561694 580127 555604 567191 528472 534636 570458 559384 593746 571616 581769 676754 904432
11424 904432 1130018 1292238 1489488 1673519 1778229 1750243 1660538 1544868 1381767 1153534
11414 1153534 964568 851132 765469 645225 558370 518336 499170 485788 458771 449367 437174
$$ packed form
11496g1459J46M6202N4921k1532n0571L4895M0485j3256k27j0819n809K6717O1832
11483I1525k8702n580L2186K933l1442O083M6314R0408j2759j7542m4567o5256
11471F3601K5154O2579J04300J28550M7835O3292J34924J09869J1277J8633o6463
11460G03551j24635k3448m8707l5004K569m662j9474K9075n6438n2363J4958k570
11448C82852P520j7834L2990L1528j2458j3879K3439K2970J8217P0971J3573J805
11436E61694J8433k4523J1587l8719O164L5822j1074L4362k2130J0153R4985K27678
11424I04432K25586J62220J97250J84031J04710k7986q9705j15670j63101k28233
11414A153534j88966j13436q5663j20244q6855m0034j9166j3382k7017r404j2193
$$ plain form
11403 437174 380089 346985 304752 316588 385528 386310 314498 405357 496166 518168 541243 504162
11391 504162 487117 517466 517764 479090 513681 554944 586401 662667 678670 652350 713370 718707
11379 718707 684103 713699 659436 638890 640272 602099 524548 411102 290411 255713 185654
11368 185654 119456 45377 1637 37853 41482 32120 82542 107390 113599 103748 89227 67706
11356 67706 30990 -27048 -28948 50516 76529 82837 100683 91466 -12543 -64255 -36142 7885
11344 7885 28262 -32047 -108111 -156735 -128952 -82084 -7356 24871 89258 112007 86932 57329
11332 57329 28563 12806 -9409 28102 33235 -9493 12072 -37840 -36146 25668 86522 58692
11320 58692 23735 15905 35601 35165 34212 -14347 -77393 -78170 -39718 -26424 -28022 -35755 -59945
$$ packed form
11403D37174n7085l3104m2233J1836O8940P82p1812R0859R0809K2002K3075l7081
11391E04162j7045L0349K98l8674L4591M1263L1457P6266J6003k6320O1020N337
11379G18707l4604K9596n4263k0546J382l8173p7551j13446j20691l4698p0059
11368A85654o6198p4079m3740L6216L629r362N0422K4848O209r851j4521k1521
11356F7706l6716n8038j900P9464K6013O308J7846r217j04009n1712K8113M4027
11344G885K0377o0309p6064m8624K7783M6868P4728L2227O4387K2749k5075k9603
11332E7329k8766j5757k2215L7511N133m2728K1565m9912J694O1814O0854k7830
11320E8692l4957p830J9696m36r53m8559o3046p77L8452J3294j598p733k4190
$$ plain form
11307 -59945 -42246 -26423 -21068 86106 100895 20502 -33145 -28738 -36832 -36421 -47798 -14250
11295 -14250 -25511 -51772 -44205 -23940 -59179 -66035 -59578 -80845 -53639 15791 34154 63705
11283 63705 65428 31765 -6408 -19247 -3312 21665 42808 10184 -22199 -37449 -94319 -70022
11271 -70022 -49133 -22179 -11907 10977 30121 28600 -8062 1653 22325 24900 34261 25617 -48696
11258 -48696 -52402 -54269 -97864 -84001 -90967 -62688 10025 78653 100684 62493 -45487 -115313
11246 -115313 -99594 -132531 -79037 -50589 -25613 -17586 -34598 -61843 -60788 -29236 -520 37500
11234 37500 18325 -40501 -25097 -9597 -766 40773 -26242 -62922 -998 38500 26607 -43057
11222 -43057 -59683 -74171 -57544 -24110 -51006 -71945 -56676 -44201 -10427 19020 -24992 -88295
$$ packed form
11307e9945J7699J5823N355J07174J4789q0393n3647M407q094M11j1377L3548
11295a4250j1261k6261P567K0265l5239o856O457k1267K7206O9430J8363K9551
11283F3705J723l3663l8173j2839J5935K4977K1143l2624l2383j5250n6870K4297
11271g0022K0889K6954J0272K2884J9144j521l6662R715K0672K575R361q644p4313
11258d8696l706j867m3595J3863o966K8279P2713O8628K2031l8191j07980o9826
11246a15313J5719l2937N3494K8448K4976Q027j7012k7245J055L1552K8716L8020
11234C7500j9175n8826J5404J5500Q831M1539o7015l6680O1924L9498j1893o9664
11222d3057j6626j4488J6627L3434k6896k0939J5269J2475L3774K9447m4012o3303
$$ plain form
11210 -88295 -127785 -124655 -38170 17392 9546 43394 31534 -244 -27663 -46264 -40237 -8035
11198 -8035 6775 -262 362 26610 6693 -7778 -12505 -34413 -63157 -87278 -100745 -23024 -5855
11185 -5855 -11160 25068 48746 48575 86850 55577 8082 -50209 24083 55459 67482 77376 38731
11172 38731 12048 -5411 39025 77910 46803 57461 99107 100242 55094 49724 37041 38055
11160 38055 13399 50012 31454 -4895 10482 -40620 -109949 -123603 -136671 -146177 -132566 -87935
11148 -87935 -80847 -83850 -89878 -76501 -66486 -16759 27135 33745 26695 -8509 -15166 6156 82539
11135 82539 100596 54170 34417 28848 -459 -67455 -110787 -138123 -102778 -54234 -21359 23364
11123 23364 -3961 -6839 -30530 -73326 -99143 -43793 15317 -1043 52766 25661 -8261 9429
$$ packed form
11210h8295l9490L130Q6485N5562p846L3848j1860l1778k7419j8601O027L2202
11198h035J4810p037O24K6248j9917j4471m727k1908k8744k4121j3467P7721J7169
11185e855n305L6228K3678j71L8275l1273m7495n8291P4292L1376J2023R894l8645
11172C8731k6683j7459M4436L8885l1107J0658M1646J135m5148n370j2683J014
11160C8055k4656L6613j8558l6349J5377n1102o9329j3654j3068r506J3611M4631
11148h7935P088l003o028J3377J0015M9727M3894O610p050l5204o657K1322P6383
11135H2539J8057m6426j9753n569k9307o6996m3332k7336L5345M8544L2875M4723
11123B3364k7325k878k3691m2796k5817N5350N9110j6360N3809k7105l3922J7690
$$ plain form
11111 9429 5612 4016 48600 39075 27314 42227 32377 19447 26375 49783 60696 24322 42080
11098 42080 53012 15704 -29302 -28028 -51151 -51560 -103809 -61140 -82604 -61897 -51519 -111462
11086 -111462 -133258 -92139 -5486 66389 66709 49570 49493 -5761 -57217 -102905 -89117 -63075
11074 -63075 -13939 -24985 -51686 -26859 -39086 -8210 48 -66620 -130958 -66369 -9888 -8280
11062 -8280 40723 44288 41856 60470 17102 -42407 -8262 -10825 -1029 32123 76131 81267 46132
11049 46132 4667 -14814 -48536 -82972 -44694 -16698 -46584 -96180 -85779 -127214 -137841 -175463
11037 -175463 -169495 -120600 -78379 -40597 -2559 16437 -1013 8844 60194 77735 47954 -5408
11025 -5408 -27283 -11013 46433 111478 57382 -19418 -69131 -49122 -83504 -20085 55151 -8587
$$ packed form
11111I429l817j596M4584r525j1761J4913r850j2930O928K3408J0913l6374J7758
11098D2080J0932l7308m5006J274k3123m09n2249M2669k1464K0707J0378n9943
11086a11462k1796M1119Q6653P1875L20j7139p7n5254n1456m5688J3788K6042
11074f3075M9136j1046k6701K4827j2227L0876Q258o6668o4338O4589N6481J608
11062h280M9003L565k432J8614m3368n9509L4145k563R796L3152M4008N136l5135
11049D6132m1465j9481l3722l4436L8278K7996k9886m9596J0401m1435j0627l7622
11037a75463N968M8895M2221L7782L8038J8996j7450R857N1350J7541k9781n3362
11025e408k1875J6270N7446O5045n4096p6800m9713K0009l4382O3419P5236o3738
$$ plain form
11013 -8587 -54090 -33502 13925 41096 56220 46908 -3479 -562 15960 31966 7466 -13214
11001 -13214 -37782 -59182 -66545 -92119 -66187 -54557 -55105 -100146 -162875 -192390 -157946 -206650
10989 -206650 -237259 -177084 -97933 -52788 -25991 -53957 -39044 -13958 -44668 -64795 46160
10978 46160 64665 83929 169976 126658 56363 -13794 -18366 12030 12331 52896 158363 128003
10966 128003 95632 33307 -21943 -62372 -87724 -91175 -101323 -90380 -74864 -41773 -6960 54971
10954 54971 48157 -13560 -15474 -28789 -89622 -87858 -24835 -55953 -98113 -101320 -63357 -80339
10942 -80339 -117135 -104675 -99119 -82193 -105043 -88385 -87941 -78603 -29098 -12186 19482 -25511
10930 -25511 -60625 -84225 -93095 -46094 -64482 -69206 -22891 40966 -11306 -66186 -114664 -75759
$$ packed form
11013h587m5503K0588M7427K7171J5124r312n0387K917J6522J6006k4500k0680
11001a3214k4568k1400p363k5574K5932J1630n48m5041o2729k9515L4444m8704
10989b06650l0609O0175P9151M5145K6797k7966J4913K5086l0710k0127J10955
10978D6160J8505J9264Q6047m3318p0295p0157m572L0396L01M0565J05467l0360
10966A28003l2371o2325n5250m0429k5352l451j0148J0943J5516L3091L4813O1931
10954E4971o814o1717j914j3315o0833J764O3023l1118m2160l207L7963j6982
10942h0339l6796J2460N556J6926k2850J6658M44R338M9505J6912L1668m4993
10930b5511l5114k3600q870M7001j8388m724M6315O3857n2272n4880m8478L8905
$$ plain form
10918 -75759 -67268 -64142 -34822 -15282 22999 15040 3113 15920 33033 -12118 5370 -14293
10906 -14293 -10195 -72748 -110840 -103573 -83690 -54362 -54917 -19042 -22451 -18818 -93871 -116665 -46719
10893 -46719 -93924 -106680 -118833 -130585 -66718 -44685 -73340 -14561 -3636 13729 31377 24194
10881 24194 20431 34299 22967 -482 -46598 -87298 -81649 -52954 -27828 -27951 -33839 -23685 8262
10868 8262 24662 16 -5732 -3445 -75955 -84641 -100815 -87008 -95463 -85075 -92145 -56810 -32340
10855 -32340 -65538 -24614 -13037 -34946 12435 19324 17461 67504 67309 2756 -6181 81473 128631
10842 128631 104490 126372 96214 62932 84591 131363 159788 126005 84039 72554 27412
10831 27412 2970 58563 161872 140208 154559 145894 38911 49875 60092 62747 67767 104023
$$ packed form
10918g5759Q491L126K9320J9540L8281p959j1927J2807J7113m5151J7488j9663
10906a4293M098o2553l8092P267J9883K9328n55L5875l409L633p5053k2794O9946
10893d6719m7205j2756j2153j1752O3867K2033k8655N8779J0925J7365J7648p183
10881B4194l763J3868j1332k3449m6116m0700N649K8695K5126j23n888J0154L1947
10868H262J6400k4646n748K287p2510q686j6174J3807q455J0388p070L5335K4470
10855c2340l3198M0924J1577k1909M7381O889j863N0043j95o4553q937Q7654M7158
10842A28631k4141K1882l0158l3282K1659M6772K8425l3783m1966j1485m5142
10831B7412k4442N5593J03309k1664J4351q665j06983J0964J0217K655N020L6256
$$ plain form
10819 104023 114796 78435 93899 101125 126339 124725 80857 97009 102219 31320 -22804 -63371
10807 -63371 -21180 27465 66346 26578 -30845 -14247 -28462 -17046 -16355 -54623 -29571 59186
10795 59186 117144 86371 -667 31032 24022 24379 -14503 8537 -26973 -35915 -19334 2143
10783 2143 51969 46881 60212 10504 -29451 -19912 -2004 -22199 18494 43724 67087 95035
10771 95035 90010 53344 15245 -10271 10908 13885 -20516 -4391 41092 -4550 20707 -19206
10759 -19206 14586 45513 86154 71111 8920 20081 74842 69254 72381 53861 73816 66561
10747 66561 -15100 13879 21202 44559 15726 21455 -62541 -132990 -124263 -75143 -14462 -23030
10735 -23030 -3975 12294 9573 -29907 -5491 7606 -10703 -19466 -4999 46152 36503 40170
$$ packed form
10819A04023J0773l6361J5464P226K5214j614m3868J6152N210p0899n4124m0567
10807f3371M2191M8645L8881l9768n7423J6598j4215J1416O91l8268K5052Q8757
10795E9186N7958l0773q7038L1699p010L57l8882K3040l5510q942J6581K1477
10783B143M9826n088J3331m9708l9955R539J7908k0195M0693K5230K3363K7948
10771I5035n025l6666l8099k5516K1179K977l4401J6125M5483m5642K5257l9913
10759a9206L3792L0927M0641j5043o2191J1161N4761n588L127j8520J9955p255
10747F6561q1661K8979P323K3357k8833N729q3996p0449Q727M9120O0681q568
10735b3030J9055J6269k721l9480K4416J3097j8309q763J4467N1151r649L667
$$ plain form
10723 40170 40696 87673 41310 -511 -9701 -1705 11273 81994 76529 22072 -10709 -6877 3692
10710 3692 31691 119110 139714 159443 149315 66223 -8704 3112 6766 -11264 -46204 -4972
10698 -4972 64842 100112 89487 51993 -22141 24508 115397 144080 93817 19108 -21078 -16216
10686 -16216 27593 94883 71718 4934 -1510 25519 92280 93685 69568 94584 116743 70279
10674 70279 60792 63610 107601 100635 62067 31354 -26579 5817 20829 27341 82464 103940
10662 103940 66488 38704 3532 -13248 -11661 2897 -12475 -2243 38478 72906 105272 73035
10650 73035 74237 33364 -852 28817 75927 54449 70637 15978 -4048 54164 60031 26969
10638 26969 77530 65320 -175 -37816 -36879 -37755 -45148 20757 103675 76608 5492 10564 59647
$$ packed form
10723D0170N26M6977m6363m1821r190P996J2978P0721n465n4457l2781L832J0569
10710C692K7999Q7419K0604J9729j0128q3092p4927J1816L654j8030l4940M1232
10698d972O9814L5270j0625l7494p4134M6649R0889K8683n0263p4709m0186M862
10686a6216M3809O7290k3165o6784o444K7029O6761J405k4117K5016K2159m6464
10674G0279r487K818M3991o966l8568l0713n7933L2396J5012O512N5123K1476
10662A03940l7452k7784l5172j6780J587J4558j5372J0232M0721L4428L2366l2237
10650G3035J202m0873l4216K9669M7110k1478J6188n4659k0026N8212N867l3062
10638B6969N0561j2210o5495l7641R37q76p393O5905Q2918k7067p1116N072M9083
$$ plain form
10625 59647 78772 60447 43655 62963 -3422 -53905 -69256 -61051 34901 55428 35971 27441
10613 27441 3778 22200 -3543 -26155 -58810 -23606 26081 57010 56589 12619 1300 31476
10601 31476 48223 104525 94330 68179 70222 89430 83697 27177 26916 61064 75378 37244
10589 37244 8429 19566 -14208 -29031 11808 57328 -16639 -23259 -14701 39 33395 -17904
10577 -17904 -50104 28156 54471 19105 14823 48822 33236 96929 78758 76828 32063 77818
10565 77818 74065 41001 40707 25285 57923 42345 11486 -35757 10819 31459 -41555 -16851
10553 -16851 20950 40024 -22871 -54252 -6312 -32576 -76006 -34177 -9214 -9987 -13607 -18076
10541 -18076 21464 77358 53374 -35646 -86373 -92048 -65304 -35972 -29125 -3648 863 18400
$$ packed form
10625E9647J9125j8325j6792J9308o6385n0483j5351Q205R5952K0527j9457q530
10613B7441k3663J8422k5743k2612l2655L5204M9687L0929m21m3970j1319L0176
10601C1476J6747N6302j0195k6151K043J9208n733n6520k61L4148J4314l8134
10589C7244k8815J1137l3774j4823M0839M5520p3967o620Q558J4740L3356n1299
10577a7904l2200P8260K6315l5366m282L3999j5586O3693j8171j930m4765M5755
10565G7818l753l3064k94j5422L2638j5578l0859m7243M6576K0640p3014K4704
10553a6851L7801J9074o2895l1381M7940k6264m3430M1829K4963p73l620m469
10541a8076L9540N5894k3984q9020n0727n675K6744K9332O847K5477M511J7537
$$ plain form
10529 18400 3591 41319 -4502 -40300 -76555 -55333 -53105 -1528 4539 24245 -24886 -60916
10517 -60916 -57211 6435 23663 55866 80177 53356 50600 52983 51377 18736 -722 3968 66696
10504 66696 138846 130933 93211 54599 42734 64206 38461 -17294 -33837 4099 65128 70672
10492 70672 50194 33658 -2584 2712 12572 29261 44082 43109 30329 61117 77437 153554
10480 153554 168080 81050 26163 -8863 96431 124822 62405 131304 153423 124428 98620
10469 98620 73478 50055 37036 75259 79722 85056 128378 62036 12842 43945 14104 70703
10457 70703 84865 54739 47247 132828 151283 105804 32987 42403 37308 19891 53333 52399 9929
10444 9929 -20099 10632 6180 18438 62716 61632 59781 27308 -10457 -2025 -25982 -54402 -5271
$$ packed form
10529A8400j4809L7728m5821l5798l6255K1222K228N1577O067J9706m9131l6030
10517f0916L705O3646J7228L2203K4311k6821k756K383j606l2641j9458M690O2728
10504F6696P2150p913l7722l8612j1865K1472k5745n5755j6543L7936O1029N544
10492G0672k0478j6536l6242N296R860J6689J4821r73j2780L0788J6320P6117
10480A53554J4526q7030n4887l5026J05294K8391o2417O8899K2119k8995k5808
10469I8620k5142k3423j3019L8223M463N334M3322o6342m9194L1103k9841N6599
10457G0703J4162l0126p492Q5581J8455m5479p2817R416n095j7417L3442r34m2470
10444I929l0028L0731m452J2258M4278j084j851l2473l7765Q432k3957k8420M9131
$$ plain form
10431 -5271 23187 -7040 -8455 -5718 24207 -43193 -85938 -46452 -55679 -20494 -7808 14218
10419 14218 -19526 3760 98188 101430 25724 4874 70156 108885 127911 124043 115443 148025
10407 148025 138983 139811 124392 61112 32384 33858 76710 100879 61668 58379 50132 46180 77532
10394 77532 122124 131016 90054 107482 121367 146038 142378 86435 42228 64880 67547 91048
10382 91048 146988 162551 153968 163650 142074 98000 78580 91479 93242 60324 2616 -9644
10370 -9644 -34902 -23876 71243 103419 121293 145208 144987 119948 120847 127543 65200 98318 175915
10357 175915 132188 74435 55376 111132 135873 112671 105102 104792 119501 129243 155968 183941
10345 183941 227182 298593 378227 399457 426103 453022 542082 610595 667733 664531 679932 679465
$$ packed form
10431e271K8458l0227j415K737K9925o7400m2745L9486r227L5185J2686K2026
10419A4218l3744K3286R4428L242p5706k0850O5282L8729J9026l868q600L2582
10407A48025r042Q28j5419o3280k8728J474M2852K4169l9211l289q247l952L1352
10394G7532M4592Q892m0962J7428J3885K4671l660n5943m4207K2652K667K3501
10382I1048N5940J5563q583R682k1576m4074j9420J2899J763l2918n7708j2260
10370i644k5258J1026R5119L2176J7874K3915k21k5039Q99O696o2343L3118P7597
10357A75915m3727n7753j9059N5756K4741k3202p569l10J4709R742K6725K7973
10345A83941M3241P1411P9634K1230K6646K6919Q9060O8513N7138l202J5401m67
$$ plain form
10333 679465 632805 526915 506359 427312 352754 357067 331270 269001 257422 279701 321460
10322 321460 316651 264943 256153 237428 204468 218201 198888 158890 188548 163599 137244 181415
10310 181415 164556 133745 129492 155882 248790 283873 323539 437918 533078 591060 685949
10299 685949 815752 986481 1090422 1166942 1124777 1049996 937125 818582 709353 562435
10289 562435 448923 406163 345414 263354 203031 156717 179196 168973 181986 194383 243683
10278 243683 307356 338171 351583 320242 284017 299048 295323 321477 329780 305842 273944 272223
10266 272223 310174 387676 449542 474430 545856 617884 691303 848350 1065815 1181180 1375173
10255 1375173 1535235 1604100 1641982 1671960 1642788 1556169 1417237 1232706 1032662 858095
$$ packed form
10333F79465m6660j05890k0556p9047p4558M313k5797o2269j1579K2279M1759
10322C21460m809n1708q790j8725l2960J3733j9313l9998K9658k4949k6355M4171
10310A81415j6859l0811m253K6390R2908L5083L9666J14379R5160N7982R4889
10299F85949J29803J70729J03941P6520m2165p4781j12871j18543j09229j46918
10289E62435j13512m2760o0749q2060o0323m6314K2479j0223J3013J2397M9300
10278B43683O3673L0815J3412l1341l6225J5031l725K6154Q303k3938l1898j721
10266B72223L7951P7502O1866K4888P1426P2028P3419J57047K17465J15365J93993
10255A375173J60062O8865L7882K9978k9172q6619j38932j84531k00044j74567
$$ plain form
10245 858095 730430 607730 457528 343587 348855 340555 363640 404420 371814 335578 325479
10234 325479 330822 354760 363345 358280 306628 330666 387075 426450 391950 377613 430631 399632
10222 399632 359956 330909 361735 416281 471958 478252 564224 671933 804163 1010969 1231127
10211 1231127 1358241 1414495 1378293 1281845 1149418 982983 807675 678515 578728 479562
10201 479562 394733 361362 332326 276575 269217 257765 306920 318475 395584 376739 303374 249532
10189 249532 274112 244142 252734 285113 303067 336205 261843 168304 111846 132540 158082 98514
10177 98514 173070 206315 224214 229064 294162 347468 369262 421498 436662 432808 439718 459600
10165 459600 429980 377163 366938 352835 368906 294906 218824 220103 189651 145350 169314 153906
$$ packed form
10245H58095j27665j22700j50202j13941N268q300K3085M0780l2606l6236j0099
10234C25479N343K3938Q585n065n1652K4038N6409L9375l4500j4337N3018l0999
10222C99632l9676k9047L0826N4546N5677O294Q5972J07709J32230K06806K20158
10211A231127J27114N6254l6202r6448j32427j66435j75308j29160r9787r9166
10201D79562q4829l3371k9036n5751p358j1452M9155J1555P7109j8845p3365n3842
10189B49532K4580k9970Q592L2379J7954L3138p4362r3539n6458K0694K5542n9568
10177I8514P4556L3245J7899M850O5098N3306K1794N2236J5164l854O910J9882
10165D59600k9620n2817j0225j4103J6071p4000p6082J279l0452m4301K3964j5408
$$ plain form
10153 153906 129356 127517 86687 66520 122631 199012 180427 141062 71948 -9212 9540 4906
10141 4906 -17505 -33708 26966 170737 246446 196290 155170 212329 240932 243930 272683 264363
10129 264363 231743 144377 150208 135189 87724 151898 175593 155341 114126 135097 206056 220051
10117 220051 241212 298846 304003 258731 203783 170800 206084 232349 249809 239726 258766 316289
10105 316289 368882 313925 248079 210636 228334 256203 266527 340477 365339 342569 318860
10094 318860 302075 291712 310624 376038 393489 415928 456595 399223 407035 459056 396560 363825
10082 363825 320500 274748 257540 271687 334409 342394 391465 442203 453999 448166 440031 442858
10070 442858 504272 533666 570642 625537 615883 579397 515359 507269 535033 495712 495859 529769
$$ packed form
10153A53906k4550j839m0830k0167N6111P6381j8585l9365o9114q1160J8752m634
10141D906k2411j6203O0674J43771P5709n0156m1120N7159K8603K998K8753q320
10129B64363l2620q7366N831j5019m7465O4174K3695k0252m1215K0971P0959J3995
10117B20051K1161N7634N157m5272n4948l2983L5284K6265J7460j0083J9040N7523
10105C16289N2593n4957o5846l7443J7698K7869J0324P3950K4862k2770k3709
10094C18860j6785j0363J8912O5414J7451K2439M0667n7372P812N2021o2496l2735
10082C63825m3325m5752j7208J4147O2722P985M9071N0738J1796n833q135K827
10070D42858O1414K9394L6976N4895r654l6486o4038q090K7764l9321J47L3910
$$ plain form
10058 529769 497879 510956 488993 478525 475111 464699 480719 551914 609470 615901 673654 695184
10046 695184 666440 674356 662517 692141 692034 719887 679246 636422 577565 497593 472962 498841
10034 498841 501155 450240 425444 440064 527407 640355 795291 982782 985485 940554 925602
10023 925602 882671 750411 625772 545005 523670 508691 523594 503249 496080 499807 551320
10012 551320 582007 612873 607191 611613 660552 659033 634175 655703 672337 693260 756284 748304
10000 748304 706530 733047 701448 653645 643698 621609 638627 640765 672969 621612 624323 619879
9988 619879 624904 716404 797792 860224 929038 904654 876655 846631 838094 835892 855311 854446 809702
9975 809702 797941 772267 803336 843664 865211 902778 900283 931828 964330 1071632 1159002 1259522
$$ packed form
10058E29769l1890J3077k1963j0468l414j0412J6020P1195N7556O431N7753K1530
10046F95184k8744P916j1839K9624j07K7853m0641m2824n8857p9972k4631K5879
10034D98841K314n0915k4796J4620Q7343J12948J54936J87491K703m4931j4952
10023I25602m2931j32260j24639q0767k1335j4979J4903k0345p169L727N1513
10012E51320L0687L0866n682M422M8939j519k4858K1528J6634K0923O3024p980
10000G48304m1774K6517l1599m7803r947k2089J7018K138L2204n1357K711m444
9988F19879N025R1500Q1388O2432O8814k4384k7999l0024q537k202J9419q65m4744
9975H09702j1761k5674L1069M0328K1547L7567k495L1545L2502J07302Q7370J00520
$$ plain form
9963 1259522 1289036 1306265 1370210 1440766 1526389 1598971 1773000 2013659 2274834 2415802 2503963
9952 2503963 2628095 2753693 2980418 3208933 3467002 3832904 4279518 4594304 4746075 4791527
9942 4791527 4779806 4720713 4564694 4371246 4295744 4200773 4115517 4062138 4001503 3958081 3960056
9931 3960056 3908763 3885149 4003469 4223320 4553027 5002019 5611394 6553403 7794463 9166704
9921 9166704 10331846 10988020 11270837 11512490 11822397 11997519 11834776 11366506 10702757
9912 10702757 9998203 9255938 8616715 8110354 7694312 7388092 7188192 7067579 7089739 7070446
9902 7070446 7154716 7335048 7723058 8194611 8757761 9457470 10204400 11069574 12083225 13293282
9892 13293282 14667405 16201036 18143117 20646396 23930274 28364326 34441818 42781087
$$ packed form
9963A259522K9514J7229O3945P0556Q5623P2582J74029K40659K61175J40968Q8161
9952B503963J24132J25598K26725K28515K58069L65902M46614L14786J51771M5452
9942D791527j1721n9093j56019j93448p5502r4971q5256n3379o0635m3422J975
9931C960056n1293k3614J18320K19851L29707M48992O09375R42009J241060J372241
9921I166704J165142O56174K82817K41653L09907J75122j62743m68270o63749
9912A0702757p04554p42265o39223n06361m16042l06220j99900j20613K2160j9293
9902G070446Q4270J80332L88010M71553N63150O99709P46930Q65174J013651J210057
9892A3293282J374123J533631J942081K503279L283878M434052O077492Q339269
$$ plain form
9884 42781087 53960726 68448049 86896456 109344258 131570095 143772026 142436635
9877 142436635 133775652 121746550 107147692 91520899 77296573 66102429 58300106
9870 58300106 53542107 51650005 52514432 56135207 62629458 71741693 82087032 92381544
9862 92381544 102720993 112615854 120263557 125276005 128979432 131334045 131688343 130324182
9854 130324182 127985487 125066171 120981932 115638245 110192010 105692911 101989607 98997537
9846 98997537 97630792 99048556 104477712 115842931 135885422 167425770 211778786 267922317
9838 267922317 326095228 362203336 361872720 339351174 307449023 267994414 224633971
9831 224633971 184129539 151215056 127126465 111214511 102205237 98576441 98556670 100764183
$$ packed form
9884D2781087J1179639J4487323J8448407K2447802K2225837J2201931j335391
9877A42436635q660983j2029102j4598858j5626793j4224326j1194144p802323
9870E8300106m757999j892102Q64427L620775O494251R112235J0345339J0294512
9862I2381544J0339449R894861P647703N012448L703427K354613L54298j364161
9854A30324182k338695k919316m084239n343687n446235m499099l703304k992070
9846I8997537j366745J417764N429156J1365219K0042491L1540348M4353016N6143531
9838B67922317N8172911L6108108l30616k2521546l1902151l9454609m3360443
9831B24633971m0504432l2914483k4088591j5911954r009274l628796j9771K207513
$$ plain form
9823 100764183 104206491 108138497 112720718 117766726 122872592 127469713 130367367 131524884
9815 131524884 132439929 132949366 130842901 125398723 116888942 105736254 93378671 81592962
9807 81592962 71216967 62609396 56041963 51693541 49663460 50001865 52693579 58040591
9799 58040591 66921231 79859181 96617769 115503095 130989470 136037537 130761288 119709183
9791 119709183 105677141 89756249 73455288 58854767 47062468 38023946 31267601
9784 31267601 26298517 22676336 20053985 18019208 16347065 15003562 13871607 12791471
9776 12791471 11855392 10959778 10158275 9413191 8753223 8248088 7805424 7468451 7267952
9767 7267952 7100487 6985869 7031648 7186856 7481774 7856350 8412987 9100024 9765229 10288052
$$ packed form
9823A00764183L442308L932006M582221N046008N105866M597121K897654J157517
9815A31524884R15045N09437k106465n444178q509781j1152688j2357583j1785709
9807H1592962j0375995q607571o567433m348422k030081L38405K691714N347012
9799E8040591Q880640J2937950J6758588J8885326J5486375N048067n276249j1052105
9791A19709183j4032042j5920892j6300961j4600521j1792299r038522o756345
9784C1267601m969084l622181k622351k034777j672143j343503j131955j080136
9776A2791471r36079q95614q01503p45084o59968n05135m42664l36973k00499
9767G267952j67465j14618M5779J55208K94918L74576N56637O87037O65205N22823
$$ plain form
9757 10288052 10549770 10714486 10922159 10959646 10507293 9599666 8551310 7569663 6628777
9748 6628777 5760987 4958202 4362049 3911181 3609609 3406910 3243646 3179884 3163888 3144037
9738 3144037 3160130 3234034 3332975 3494101 3628511 3698007 3744188 3816400 3933695 4008397 3930285
9727 3930285 3818938 3694026 3493270 3352230 3101155 2864618 2675538 2493055 2283701 2122749
9717 2122749 1968327 1852788 1627921 1484539 1364316 1250838 1122699 991435 923717 864187
9707 864187 779550 712034 726041 686664 683846 690554 696679 750799 720380 624446 586104 634950
9695 634950 612261 521479 453154 396399 341118 223412 171336 181181 170861 180950 277037 335990
9683 335990 396433 433508 375487 407472 392835 366560 305207 287386 260544 261540 206217 192770
$$ packed form
9757A0288052K61718J64716K07673L7487m52353r07627j048356r81647r40886
9748F628777q67790q02785n96153m50868l01572k02699j63264o3762j5996j9851
9738C144037J6093P3904R8941J61126J34410O9496M6181P2212J17295P4702p8112
9727C930285j11347j24912k00756j41040k51075k36537j89080j82483k09354j60952
9717B122749j54422j15539k24867j43382j20223j13478j28139j31264o7718n9530
9707H64187q4637o7516J4007l9377k818O708O125N4120l0419r5934l8342M8846
9695F34950k2689r0782o8325n6755n5281j17706n2076R845j0320J0089R6087N8953
9683C35990O0443L7075n8021L1985j4637k6275o1353j7821k6842R96n5323j3447
$$ plain form
9671 192770 158215 132595 81665 70827 32037 -4332 29226 65389 63904 24784 28346 24904
9659 24904 -9352 6604 31993 54123 46374 38748 -3875 -71619 -83284 -57745 -172203 -268662
9647 -268662 -357770 -424997 -386792 -307904 -207857 -113244 -64652 -25242 27749 92557 94726 77003
9635 77003 112504 144661 51605 -32449 -27003 -3087 -38220 -47981 -50103 -38728 -48077 -66494 -82873
9622 -82873 -82461 -74134 -116737 -67452 80131 78811 71676 100772 36394 7147 20732 565 -2056
9609 -2056 -3254 -72942 -120337 -165961 -238283 -208988 -166845 -143692 -66462 -35088 -12052 54682
9597 54682 79883 107585 105248 81391 38888 76824 39202 38559 75259 104138 90059 89418 86506
9584 86506 57635 60099 84163 104543 149876 194920 173951 151576 136428 71636 46156 91263
$$ packed form
9671A92770l4555k5620n0930j0838l8790l6369L3558L6163j485l9120L562l442
9659B4904l4256J5956K5389K2130p749p626m2623o7744j1665K5539j14458r6459
9647b68662q9108o7227L8205P8888J00047R4613M8592L9410N2991O4808K169j7723
9635G7003L5501L2157r3056q4054N446K3916l5133r761k122J1375r349j8417j6379
9622h2873M12Q327m2603M9285J47583j320p135K9096o4378k9247J3585k0167k621
9609b056j198o9688m7395m5624p2322K9295M2143K3153P7230L1374K3036O6734
9597E4682K5201K7702k337k3857m2503L7936l7622o43L6700K8879j4079o41k912
9584H6506k8871K464K4064K0380M5333M5044k0969k2375j5148o4792k5480M5107
$$ plain form
9572 91263 105589 108800 109827 65962 27108 -33984 30259 28758 35764 65773 83878 145074 186812
9559 186812 177746 193942 180395 149293 152776 130693 120563 101015 82689 86476 116890 145343
9547 145343 78686 -17362 -10623 33244 58780 73895 118969 146039 127439 148726 181043 143881
9535 143881 164906 191871 197144 171414 162045 178595 181262 143814 153044 152006 106493 55208 64432
9522 64432 30985 -17760 51002 114263 144001 155894 132025 106070 89605 86141 28944 53502
9510 53502 80749 95309 116413 121772 164969 177285 137817 177398 259156 342179 393684 362207
9498 362207 355930 383540 387026 337777 298420 265501 194577 146220 105519 85329 74260 37647
9486 37647 23246 58683 80007 64944 84462 62854 90322 142260 147204 109284 132289 115024
$$ packed form
9572I1263J4326L211J027m3865l8854o1092O4243j501P006L0009J8105O1196M1738
9559A86812r066J6196j3547l1102L483k2083j0130j9548j8326L787L0414K8453
9547A45343o6657r6048O739M3867K5536J5115M5074K7070j8600K1287L2317l7162
9535A43881K1025K6965N273k5730r369J6550K667l7448R230j038m5513n1285R224
9522F4432l3447m8745O8762O3261K9738J1893k3869k5955j6465l464n7197K4558
9510E3502K7247J4560K1104N359M3197J2316l9468L9581Q1758Q3023N1505l1477
9498C62207o277K7610L486m9249l9357l2919p0924m8357m0701k0190j1069l6613
9486C7647j4401L5437K1324j5063J9518k1608K7468N1938M944l7920K3005j7265
$$ plain form
9474 115024 109394 92790 94659 48956 32163 92454 165470 185078 169810 214634 318470 443307
9462 443307 455462 561937 800384 1039811 1197738 1322392 1327326 1283381 1197860 1087520 907198
9451 907198 752251 635774 460820 374712 288479 244491 265743 271631 258269 202166 215366
9440 215366 277033 271564 233944 199300 168956 162223 150478 218874 193663 167057 215045 270035
9428 270035 232766 187207 190623 229346 229073 238405 258645 330070 425428 477811 701078 943475
9416 943475 1168714 1413731 1541327 1571227 1548461 1517344 1427621 1229107 1044364 934284
9406 934284 784685 630209 539349 430251 338268 274839 269912 243707 218743 206110 180928
9395 180928 208867 235364 232273 189319 103496 118217 97765 81400 84390 89642 68338 93654
$$ packed form
9474A15024n630j6604J869m5703j6793O0291P3016J9608j5268M4824J03836J24837
9462D43307J2155J06475K38447K39427J57927J24654M934m3945q5521j10340j80322
9451I07198j54947j16477j74954q6108q6233m3988K1252N888j3362n6103J3200
9440B15366O1667n469l7620l4644l0344o733j1745O8396k5211k6606M7988N4990
9428B70035l7269m5559L416L8723k73R332K0240P1425R5358N2383K23267K42397
9416I43475K25239K45017J27596K9900k2766l1117q9723j98514j84743j10080
9406I34284j49599j54476r0860j09098r1983o3429m927k6205k4964j2633k5182
9395A80928K7939K6497l091m2954q5823J4721k0452j6365K990N252k1304K5316
$$ plain form
9383 93654 146253 170288 177823 180408 200635 214745 267456 349414 486480 570703 706216 902212
9371 902212 1014086 1005833 926360 877512 860008 756021 700723 611679 460930 307610 295380
9360 295380 231243 210925 140948 113068 124508 146084 114198 39199 -33707 5917 9425 -50546
9348 -50546 -23971 -4398 -14366 -11525 56213 46681 -23502 -39998 1349 -2236 65816 107326 104371
9335 104371 109975 123445 166667 144153 130813 169233 242424 203079 178601 186759 194241 226664
9323 226664 296398 292490 242696 174307 135655 97928 79359 132023 72933 29991 -20004 -6407
9311 -6407 32828 96271 152216 162302 113619 9785 -67157 -88442 -72436 -28133 -56870 -37963
9299 -37963 11897 20392 -5352 -5381 1300 26637 19204 16696 80218 129604 137753 86367 100700
$$ packed form
9383I3654N2599K4035P535K585K0227J4110N2711Q1958J37066Q4223J35513J95996
9371I02212J11874q253p9473m8848j7504j03987n5298q9044j50749j53320j2230
9360B95380o4137k0318o9977k7880J1440K1576l1886p4999p2906L9624L508n9971
9348e0546K6575J9573r968K841O7738r532p0183j6496M1347l585O8052M1510k955
9335A04371N604J3470M3222k2514j3340L8420P3191l9345k4478Q158P482L2423
9323B26664O9734l908m9794o8389l8652l7727j8569N2664n9090m2942m9995J3597
9311f407L9235O3443N5945J0086m8683j03834p6942k1285J6006M4303k8737J8907
9299c7963M9860Q495k5744k9O681K5337p433k508O3522M9386Q149n1386J4333
$$ plain form
9286 100700 98168 106961 37693 17254 15180 -19327 -3596 -10516 -14307 28470 -2060 -74191 -50532
9273 -50532 -18957 -24615 -47229 -54094 -23262 25462 -10108 -70452 -75090 -66971 -54375 -42253 9175
9260 9175 53854 41680 39653 38015 39844 87153 134013 49561 -65445 -54192 -27214 -25013 -33188
9247 -33188 -39186 -58210 29378 99495 87022 77095 53840 66181 51508 35894 5664 -4833
9235 -4833 42861 18802 -42679 -25671 -4187 10697 65669 67133 24098 -24336 -2095 23737
9223 23737 31018 50231 96669 59566 47713 107372 75495 -8457 -46313 41555 127250 141255
9211 141255 90474 72463 53731 67065 80732 121846 134626 124385 110241 81808 91405 140112
9199 140112 169587 117675 78282 36494 15703 3004 42875 15119 25168 89855 116212 196023
$$ packed form
9286A00700k532Q793o9268k0439k074l4507J5731o920l791M2777l0530p2131K3659
9273e0532L1575n658k2614o865L0832M8724l5570o0344m638Q119J2596J2122N1428
9260I175M4679j2174k027j638J829M7309M6860q4452j15006J1253K6978K201q175
9247c3188n998j9024Q7588P0117j2473r927k3255J2341j4673j5614l0230j0497
9235d833M7694k4059o1481J7008K1484J4884N4972J464m3035m8434K2241K5832
9223B3737P281J9213M6438l7103j1853N9659l1877q3952l7856Q7868Q5695J4005
9211A41255n0781j8011j8732J3334J3667M1114J2780j0241j4144k8433R597M8707
9199A40112K9475n1912l9393m1788k0791j2699L9871k7756J0049O4687K6357P9811
$$ plain form
9187 196023 254866 208131 126152 104425 115636 120182 106363 50829 28613 60523 136004 178394
9175 178394 209507 250447 212472 189500 217325 201720 208685 246128 288035 279705 299755 306424
9163 306424 310915 344983 320220 361186 416121 435734 503537 454189 465824 477129 503155 501302
9151 501302 494503 543617 638032 664255 690865 792357 971634 1069407 1157252 1252736 1407616
9140 1407616 1530082 1699850 2041858 2417170 2740096 3112613 3642473 4275930 4950592 5863797
9130 5863797 7083946 8450789 10244760 12506055 15014224 17344079 18951054 19462460
9122 19462460 18965341 17714525 15937245 13960951 11978557 10029295 8312586 6953372
9114 6953372 5858637 4984906 4291647 3730648 3296584 2947731 2632847 2341564 2131542
$$ packed form
9187A96023N8843m6735q1979k1727J1211M546j3819n5534k2216L1910P5481M2390
9175A78394L1113M0940l7975k2972K7825j5605O965L7443M1907q330K0050O669
9163C06424M491L4068k4763M0966N4935J9613O7803m9348J1635J1305K6026j853
9151E01302o799M9114R4415K6223K6610J01492J79277R7773Q7845R5484J54880
9140A407616J22466J69768L42008L75312L22926L72517N29860O33457O74662R13205
9130E863797J220149J366843J793971K261295K508169K329855J606975N11406
9122A9462460m97119j250816j777280j976294j982394j949262j716709j359214
9114F953372j094735q73731o93259n60999m34064l48853l14884k91283k10022
$$ plain form
9105 2131542 1937825 1709060 1468225 1376230 1296851 1178067 1087577 1037132 949067 822185
9095 822185 724567 666139 638063 597613 566021 544334 564823 563369 499479 547662 540736 468087
9083 468087 401804 402512 402931 352813 331421 305750 292908 306878 299831 221239 260156 306542 278085
9070 278085 215166 220859 183354 128545 58405 33768 39582 51188 94711 134632 96332 106979
9058 106979 167551 128437 142872 263911 319210 245816 149532 112305 76922 70385 137664 198983
9046 198983 183352 142587 170367 146147 101897 127046 131085 112155 133902 153750 122478 135933
9034 135933 151065 133806 68478 64610 38313 62100 72349 18396 45076 98790 93464 142441
9022 142441 151718 145084 153984 133363 115045 95653 83348 33606 58456 22130 28135 -19949
$$ packed form
9105B131542j93717k28765k40835r1995p9379j18784r0490n0445q8065j26882
9095H22185r7618n8428k8076m0450l1592k1687K0489j454o3890M8183o926p2649
9083D68087o6283P08M19n0118k1392k5671j2842J3970p047p8592L8917M6386k8457
9070B78085o2919N693l7505n4809p0140k4637N814J1606M3523L9921l8300J0647
9058A06979O0572l9114J4435J21039N5299p3394r6284l7227l5383o537O7279O1319
9046A98983j5631m0765K7780k4220m4250K5149M039j8930K1747J9848l1272J3455
9034A35933J5132j7259o5328l868k6297K3787J0249n3953K6680N3714n326M8977
9022A42441R277o634Q900k0621j8318j9392j2305m9742K4850l6326O005m8084
$$ plain form
9010 -19949 -16602 5860 -49269 -18848 -52835 -30467 23184 13306 73923 113126 138829 132502
8998 132502 122317 133685 145427 137177 81477 71126 100179 110208 100770 67157 54964 86540
8986 86540 153288 179908 131212 134369 112609 113725 78812 69446 127616 91511 76852 63940
8974 63940 16728 38231 87851 49742 41253 -8951 -41422 -77840 -87831 -74732 -37610 22423
8962 22423 39197 26045 28698 -5955 40057 84149 73067 9267 43153 39540 43497 68249
8950 68249 76949 84868 105567 105678 44078 18270 72990 61124 61529 17139 -4061 -22208 -45214
8937 -45214 -19659 -37459 -49076 -103327 -63602 15725 68267 73231 97841 77380 106096 75487
8925 75487 45878 -4986 -37010 -31498 -37773 -27390 -57518 -71243 -105222 -104340 -45035 58564
$$ packed form
9010a9949L347K2462n5129L0421l3987K2368N3651r878O0617L9203K5703o327
8998A32502j0185J1368J1742q250n5700j0351K9053J0029r438l3613j2193L1576
8986H6540O6748K6620m8696L157k1760J116l4913r366N8170l6105j4659j2912
8974F3940m7212K1503M9620l8109q489n0204l2471l6418r991J3099L7122O0033
8962B2423J6774j3152K653l4653M6012M4092j1082o3800L3886l613L957K4752
8950F8249Q700P919K0699J11o1600k5808N4720j1866M05m4390k1200j8147k3006
8937d5214K5555j7800j1617n4251L9725P9327N2542M964K4610k0461K8716l0609
8925G5487k9609n0864l2024N512o275J0383l0128j3725l3979Q82N9305J03599
$$ plain form
8913 58564 134227 60819 -2893 5620 -1145 -6351 -31037 -39512 46910 76073 34019 -14146 -20784
8900 -20784 -12790 -17621 21 -2634 -10554 -40330 -45727 -33028 -75760 -110402 -111132 -49660 -15662
8887 -15662 23351 99634 76753 25839 -44910 -72869 -56017 18597 68072 92450 105168 84084
8875 84084 24273 -28147 -17153 34128 25374 27393 20514 -3843 12623 33485 61286 31302
8863 31302 15922 6820 -17234 -31435 -83128 -71211 -32017 23409 35338 -10039 -9212 -36768
8851 -36768 -19680 -44276 -63965 -54651 -12808 40748 21493 -32919 -15796 -2733 32193 17917
8839 17917 -13328 6366 -6990 5824 -7694 -15903 -53642 -58585 -39874 24327 35296 2972
8827 2972 20438 17259 34825 -34355 -35063 61237 91877 113887 121984 58892 -29587 -114396 -129869
$$ packed form
8913E8564P5663p3408o3712Q513o765n206k4686q475Q6422K9163m2054m8165o638
8900b0784P994m831J7642k655p920k9776n397J2699m2732l4642p30O1472L3998
8887a5662L9013P6283k2881n0914p0749k7959J6852P4614M9475K4378J2718k1084
8875H4084n9811n2420J0994N1281q754K019o879k4357J6466K0862K7801k9984
8863C1302j5380r102k4054j4201n1693J1917L9194N5426J1929m5377Q27k7556
8851c6768J7088k4596j9689R314M1843N3556j9255n4412J7123J3063L4926j4276
8839A7917l1245J9694j3356J2814j3518q209l7739m943J8711O4201J0969l2324
8827B972J7466l179J7566o9180p08R6300L0640K2010Q097o3092q8479q4809j5473
$$ plain form
8814 -129869 -61155 -48749 -64608 -43930 -54760 -120755 -86456 -37495 -83854 -103993 -43741 3195
8802 3195 22504 18528 -1829 14291 12200 -23130 -31579 14052 38721 15073 20381 75970 42738
8789 42738 24882 43180 45847 72484 28293 -31573 -21607 -12584 55655 -9614 -34663 -63004
8777 -63004 -93630 -82744 -41422 -12221 -73713 -119084 -48321 27006 51228 23832 49652 82323
8765 82323 126803 85354 -4396 -96372 -69690 4125 69365 80966 27967 -16726 -19563 -8772
8753 -8772 -14653 -42856 -50706 -14888 55581 33088 46179 113298 97159 4245 1198 18020 28581
8740 28581 54178 45492 94266 89052 73869 88253 91597 62456 -32207 -50800 6874 11658 53450
8727 53450 74559 97072 152156 157592 141185 108434 112600 117078 67912 13387 -3437 -24511
$$ packed form
8814a29869O8714J2406j5859K0678j0830o5995L4299M8961m6359k0139O0252M6936
8802C195J9309l976k0357J6120k091l5330q449M5631K4669k3648N308N5589l3232
8789D2738j7856J8298K667K6637m4191n9866R966R023O8239o5269k5049k8341
8777f3004l0626J0886M1322K9201o1492m5371P0763P5327K4222k7396K5820L2671
8765H2323M4480m1449q9750r1976K6682P3815O5240J1601n2999m4693k837J0791
8753h772n881k8203p850L5818P0469k2493J3091O7119j6139r2914l047J6822J0561
8740B8581K5597q686M8774n214j5183J4384L344k9141r4663j8593N7674M784M1792
8727E3450K1109K2513N5084N436j6407l2751M166M478m9166n4525j6824k1074
$$ plain form
8715 -24511 -47191 -21517 20898 80404 129954 90818 93077 106304 90105 8004 -32050 -17915
8703 -17915 14740 82721 97341 52013 12021 68101 100397 82263 74017 100814 107254 53784
8691 53784 42321 63684 61794 60442 63875 62709 50568 72564 105346 122852 110205 56779 118368
8678 118368 169645 187678 115883 71544 84210 51281 84736 46157 47388 114245 72609 28702
8666 28702 49147 71538 34782 26868 -5474 -14739 21697 55686 107864 104520 93426 102951 133800
8653 133800 181624 193385 181956 224986 325801 427116 537830 629528 741239 687737 580569
8642 580569 595279 623356 560040 527499 487009 440713 415277 351374 304865 319231 305772 355357
8630 355357 412133 352441 315957 312546 339244 378712 381773 410562 422589 483830 573186 581309
$$ packed form
8715b4511k2680K5674M2415N9506M9550l9136K259J3227j6199q2101m0054J4135
8703a7915L2655O7981J4620m5328l9992N6080L2296j8134q246K6797O440n3470
8691E3784j1463K1363j890j352L433j166j2141K1996L2782J7506j2647n3426O1589
8678A18368N1277J8033p1795m4339J2666l2929L3455l8579J231O6857m1636m3907
8666B8702K0445K2391l6756p914l2342r265L6436L3989N2178l344j1094R525L0849
8653A33800M7824J1761j1429M3030J00815J01315J10714R1698J11711n3502j07168
8642E80569J4710K8077o3316l2541m0490m6296k5436o3903m6509J4366j3459M9585
8630C55357N6776n9692l6484l411K6698L9468L061K8789J2027O1241Q9356Q123
$$ plain form
8618 581309 621733 630616 607227 619734 639810 598751 586865 682552 754525 781430 813675 815661
8606 815661 818693 815094 817282 907615 1020363 1259449 1565913 1562917 1336701 1197240 1210713
8595 1210713 1102849 918867 793793 716777 658965 628198 624196 602023 583372 505694 435611
8584 435611 407868 390633 394061 357201 341174 307297 271896 210197 191912 143236 180682 273843
8572 273843 278141 241285 182458 193807 241973 289365 216038 108770 116077 147427 151389 155422
8560 155422 153332 172016 200491 227586 407127 607470 631005 497184 400495 359253 335246
8549 335246 332759 275841 217298 200336 152163 83446 10304 -10155 -28241 17634 85724 36667
8537 36667 16655 58035 74322 72518 121719 174719 136763 146581 166197 148865 76857 9411
$$ packed form
8618E81309M0424Q883k3389J2507K0076m1059j1886R5687P1973K6905L2245J986
8606H15661L032l599K188R0333J12748K39086L06464k996k26216j39461J3473
8595A210713j07864j83982j25074p7016n7812l0767m002k2173j8651p7678p0083
8584D35611k7743j7235L428l6860j6027l3877l5401o1699j8285m8676L7446R3161
8572B73843M298l6856n8827J1349M8166M7392p3327j07268P307L1350L962M033
8560A55422k090J8684K8475K7095J79541K00343K3535j33821r6689m1242k4007
8549C35246k487n6918n8543j6962m8173o8717p3142k0459j8086M5875O8090m9057
8537C6667k0012M1380J6287j804M9201N3000l7956R818J9616j7332p2008o7446
$$ plain form
8525 9411 -37507 -20037 84114 93121 104269 21379 38864 83810 14756 -32094 -50585 -11149
8513 -11149 49160 2275 -7759 -196 21352 53664 32445 33094 3259 21067 -18626 -35176
8501 -35176 -27509 23291 53006 26946 -19395 -26201 9234 14286 -35100 -14888 25119 31100 68972
8488 68972 76038 101388 90048 63445 23130 36458 45722 52196 46371 64425 43735 61520 103205
8475 103205 79859 116938 165345 187716 148400 103214 115543 89041 20372 -8363 13357 31703
8463 31703 46390 37850 60734 66671 79800 82539 18011 14498 81988 76032 96191 91402 38960
8450 38960 10260 23470 76702 65799 56986 53188 72628 79551 67196 103834 132415 122335
8438 122335 85167 155605 220676 216566 209402 213799 107620 62872 99999 122950 101010 117725
$$ packed form
8525I411m6918J7470J04151R007J1148q2890J7485M4946o9054m6850j8491L9436
8513a1149O0309m6885j0034P563K1548L2312k1219O49k9835J7808l9693j6550
8501c5176P667N0800K9715k6060m6341o806L5435N052m9386K0212M0007N981L7872
8488F8972P066K5350j1340k6603m0315J3328R264O474n825J8054k0690J7785M1685
8475A03205k3346L7079M8407K2371l9316m5186J2329k6502o8669k8735K1720J8346
8463C1703J4687q540K2884N937J3129K739o4528l513O7490n956K0159m789n2442
8450C8960k8700J3210N3232j0903q813l798J9440O923j2355L6638K8581j0080
8438A22335l7168P0438O5071m110p164M397j06179m4748L7127K2951k1940J6715
$$ plain form
8426 117725 86895 58270 73906 60209 7688 -13096 56202 105836 6269 13335 32020 26949
8414 26949 35790 7190 -35795 32697 40106 3776 36984 94070 99346 98283 88079 162083 198441
8401 198441 97087 38908 15546 -44637 -48261 -2285 67983 41385 15654 71201 112196 157318
8389 157318 105864 120416 111560 117755 115601 102987 67543 34609 97514 103923 91440 119087
8377 119087 125125 115541 94068 114536 137172 128635 117320 113825 110135 129519 100658 83394 70222
8364 70222 91846 96576 85966 29355 14200 17009 -5051 708 47127 29623 69620 142458
8352 142458 97237 72055 36693 -22962 9844 12833 18317 -13099 22326 44011 -18932 -25380
8340 -25380 -15240 45964 123945 122349 50695 71580 162523 183921 235847 156665 72315 12094
$$ packed form
8426A17725l0830k8625J5636j3697n2521k0784O9298M9634r9567P066J8685n071
8414B6949Q841k8600m2985O8492P409l6330L3208N7086N276j063j0204P4004L6358
8401A98441j01354n8179k3362o0183l624M5976P0268k6598k5731N5547M0995M5122
8389A57318n1454J4552q856O195k154j2614l5444l2934O2905O409j2483K7647
8377A19087O038r584k1473K0468K2636q537j1315l495l690J9384k8861j7264j3172
8364G0222K1624M730j0610n6611j5155K809k2060N759M6419j7504L9997P2838
8352A42458m5221k5182l5362n9655L2806K989N484l1416L5425K1685o2943o448
8340b5380J0140O1204P7981j596p1654K0885R0943K1398N1926p9182q4350o0221
$$ plain form
8328 12094 22924 41330 -21445 -21119 -13616 -229 -21078 -43133 -67818 -68434 19283 58191 67733
8315 67733 69750 -11031 -15365 43075 13776 -1773 -21557 -3521 -12899 -25269 -50117 -53930 -59717
8302 -59717 -74468 -40267 24731 14601 -57252 -63013 -30139 -29622 -39695 23043 21114 -5634 31761
8289 31761 38675 79935 96082 57481 9249 29225 89756 65741 5783 -17724 10271 42800
8277 42800 -14365 -69467 -89038 -81699 -75854 -74570 -76992 -101528 -176360 -168127 -167468 -135247 -86202
8264 -86202 -51482 -67407 -5160 -8265 16462 69171 61596 45244 74450 101306 120483 81666
8252 81666 53760 39807 -2519 34162 3399 -8895 -8504 -63816 -31955 -11762 35572 17139
8240 17139 -11356 -57953 -17185 -36746 -80399 -71892 -47358 10828 47545 75065 29983 -10039
$$ packed form
8328A2094J0830J8406o2775L26P503J3387k0849k2055k4685o16Q7717L8908R542
8315F7733K017q0781m334N8440k9299j5549j9784J8036r378j2370k4848l813n787
8302e9717j4751L4201O4998j0130p1853n761L2874N17j0073O2738j929k6748L7395
8289C1761O914M1260J6147l8601m8232J9976O0531k4015n9958k3507K7995L2529
8277D2800n7165n5102j9571P339N845J284k422k4536p4832Q233O59L2221M9045
8264h6202L4720j5925O2247l105K4727N2709p575j6352K9206K6856J9177l8817
8252H1666k7906j3953m2326L6681l0763j2294L91n5312L1861K0193M7334j8433
8240A7139k8495m6597M0768j9561m3653Q507K4534N8186L6717K7520m5082m0022
$$ plain form
8228 -10039 -22132 -21163 15332 15841 26118 86854 67962 19454 -51546 -39814 22603 2436 1264
8215 1264 -27762 -33017 -40776 -54095 11521 -19201 -73731 -41088 9430 29604 29179 60715 35970
8202 35970 -1339 -50225 -59253 -48467 -94498 -69812 -10093 11406 -12904 -45432 -48013 -33638
8190 -33638 -7823 -65882 -133342 -136069 -85235 -33282 14560 96496 100636 52402 36527 33325
8178 33325 -12877 -16846 19512 62856 21369 257 -42533 -47126 -48021 -33735 -15108 -51231 -64780
8165 -64780 -27023 -26128 -3493 -409 23762 -15574 46497 16043 15222 39649 68395 168247 193856
8152 193856 157244 110385 95503 61052 40677 -683 -18168 22913 43354 51788 39830 57673
8140 57673 100889 35497 12603 50160 44735 -60833 -119753 -79343 7191 31329 -37101 -93119
$$ packed form
8228a0039j2093R69L6495N09J0277O0736j8892m8508p1000J1732O2417k0167j172
8215A264k9026n255p759j3319O5616l0722n4530L2643N0518K0174m25L1536k4745
8202C5970l7309m8886r028J0786m6031K4686N9719K1499k4310l2528k581J4375
8190c3638K5815n8059o7460k727N0834N1953M7842Q1936M140m8234j5875l202
8178C3325m6202l969L6358M3344m1487k1112m2790m593q95J4286J8627l6123j3549
8165f4780L7757Q95K2635L084K4171l9336O2071l0454q21K4427K8746R9852K5609
8152A93856l6612m6859j4882l4451k0375m1360j7485M1081K0441Q434j1958J7843
8140E7673M3216o5392k2894L7557n425j05568n8920M0410Q6534K4138o8430n6018
$$ plain form
8128 -93119 -63238 -78133 -31379 -40864 -55275 -52992 -96818 -92162 -58563 -6643 6657 58086
8116 58086 -15981 -31629 -23562 -44536 -53807 -62527 -17796 36779 -1030 38865 99687 97054 84797
8103 84797 89624 89161 137770 92611 -7725 -37680 -79839 -50574 -38584 -6148 13371 -7292
8091 -7292 -5436 9723 44028 40358 2890 -32698 -88641 -92518 3721 48094 22228 -18470 -43514
8078 -43514 -62839 -78008 -13739 23860 13024 -12117 -26752 -69547 -73881 -54639 -67177 -23210
8066 -23210 22415 47898 -10260 -38124 -3878 52697 80477 47658 -9664 -8091 -7885 21989
8054 21989 104382 160358 185122 86642 53605 79392 113942 122777 146253 168285 227118 243444
8042 243444 222954 230127 235807 249921 225737 206535 278261 309367 355304 390232 387288 323078
$$ packed form
8128i3119K9881j4895M6754r485j4411K283m3826M656L3599N1920J3300N1429
8116E8086p4067j5648Q067k0974r271q720M4731N4575l7809L9895O0822k633j2257
8103H4797M827m63M8609m5159j00336k9955m2159K9265J1990L2436J9519k0663
8091g292J856J5159L4305l670l7468l5588n5943l877R6239M4373k5866m0698k5044
8078d3514j9325j5169O4269L7599j0836k5141j4635m2795m334J9242j2538M3967
8066b3210M5625K5483n8158k7864L4246N6575K7780l2819n7322J573K06K9874
8054B1989Q2393N5976K4764r8480l3037K5787L4550Q835K3476K2032N8833J6326
8042B43444k0490P173N680J4114k4184j9202P1726L1106M5937L4928k944o4210
$$ plain form
8030 323078 273696 256195 289643 264756 301152 369525 370550 394977 389835 374878 296226 247409
8018 247409 204155 136937 119906 193591 250657 220939 216416 253337 295208 327308 412909 496727
8006 496727 609090 736215 967531 1166306 1245744 1303522 1239897 1102708 962897 865679
7996 865679 784410 764743 795187 877350 1051795 1324981 1723447 1968711 1826180 1531187
7986 1531187 1277391 1075270 885140 663340 474025 438955 417863 353419 354165 374586 344333
7975 344333 343420 399167 369934 338838 410196 477009 492668 487971 493897 476153 453174 490815
7963 490815 556653 697894 852039 1056496 1232287 1340088 1460831 1607811 1739022 1712967
7953 1712967 1602985 1521702 1515895 1520869 1623619 1849150 1918541 1789885 1635729 1478385 1289619
$$ packed form
8030C23078m9382j7501L3448k4887L6396O8373J025K4427n142j4957p8652m8817
8018B47409m3254o7218j7031P3685N7066k9718m523L6921M1871L2100Q5601Q3818
8006D96727J12363J27125K31316J98775P9438N7778o3625j37189j39811r7218
7996H65679q1269j9667L0444Q2163J74445K73186L98466K45264j42531k94993
7986A531187k53796k02121j90130k21800j89315l5070k1092o4444P46K0421l0253
7975C44333r13N5747k9233l1096P1358O6813J5659m697N926j7744k2979L7641
7963D90815O5838J41241J54145K04457J75791J07801J20743J46980J31211k6055
7953A712967j09982q1283n807M974J02750K25531O9391j28656j54156j57344j88766
$$ plain form
7942 1289619 1009655 816254 632185 456826 343306 383639 465762 458137 390510 373398 278941
7931 278941 256289 316320 368364 353605 283563 217978 229292 230526 270580 311092 254790 268948
7919 268948 328160 383690 456600 597727 666034 627711 665620 611142 536176 433875 389767
7908 389767 481435 479600 488522 461619 387721 352640 359294 265366 151229 100237 93307 97902
7896 97902 165443 169690 130743 67557 36773 29730 12466 19203 24861 25732 2060 -26550 -56907
7883 -56907 -36040 5924 34502 11307 -10418 3161 -16814 11108 60942 89156 83601 19562
7871 19562 22 -40997 -57230 -106846 -107238 -43635 14892 27990 -24786 -93768 -102691 -53955
7859 -53955 -58747 -97526 -121190 -54302 -15040 -17155 -12762 -34808 -87338 -136052 -128036 -76322 -6456
$$ packed form
7942A289619k79964j93401j84069j75359j13520M0333Q2123p625o7627j7112r4457
7931B78941k2652O0031N2044j4759p0042o5585J1314J234M0054M0512n6302J4158
7919B68948N9212N5530P2910J41127O8307l8323L7909n4478p4966j02301m4108
7908C89767R1668j835Q922k6903p3898l5081O654r3928j14137n0992o930M595
7896I7902O7541M247l8947o3186l0784p043j7264O737N658Q71k3672k8610l0357
7883e6907K0867M1964K8578k3195k1725J3579j9975K7922M9834K8214n555o4039
7871A9562j9540m1019j6233m9616l92O3603N8527J3098n2776o8982q923M8736
7859e3955m792l8779k3664O6888L9262k115M393k2046n2530m8714Q016N1714O9866
$$ plain form
7846 -6456 -387 -8322 26057 73033 117423 109965 51471 26301 -15510 -55341 -59809 -9705 26761
7833 26761 21343 18213 27152 30153 32439 41266 52909 61327 63604 77993 117977 99125 111436
7820 111436 107241 46069 42733 33283 4969 9627 42741 109464 85185 5185 2919 -20764 -47929
7807 -47929 28229 63158 102404 98255 19623 -70318 -103951 -43651 4370 20805 -4009 -17006
7795 -17006 2616 25357 79811 77071 63811 -2929 -72260 -54364 -43607 -56857 -78844 -77846
7783 -77846 -42660 -62867 -61713 -64624 -73071 -30743 -67609 -48160 -26293 -66298 -110310 -97014
7771 -97014 -78959 -67396 -53630 -40058 -4035 -29573 -80171 -37009 -6805 4065 -8362 315
7759 315 -22295 1674 5010 70903 69030 -8032 -9654 -6125 7748 25696 16076 10161 8517 -7211
$$ packed form
7846f456O069p935L4379M6976M4390p458n8494k5170m1811l9831m468N0104L6466
7833B6761n418l130Q939L001K286Q827J1643Q418K277J4389L9984j8852J2311
7820A11436m195o1172l336r450k8314M658L3114O6723k4279q0000k266k3683k7165
7807d7929P6158L4929L9246m149p8632q9941l3633O0300M8021J6435k4814j2997
7795a7006J9622K2741N4454k740j3260o6740o9331J7896J0757j3250k1987R98
7783g7846L5186k0207J154k911q447M2328l6866J9449K1867m0005m4012J3296
7771i7014J8055J1563J3766J3572L6023k5538n0598M3162L0204J0870j2427Q677
7759C15k2610K3969L336O5893j873p7062j622L529J3873J7948r620n915j644j5728
$$ plain form
7745 -7211 14017 -46114 -51289 -33974 61986 65997 -27882 -117602 -45049 -8051 -40039 -13859
7733 -13859 49433 49771 21699 -1268 -42630 -90185 -77817 -68297 -52330 -3787 671 17190 73817
7720 73817 35414 -13133 -473 10110 12819 16180 65798 98413 62371 49851 35826 46365
7708 46365 53964 47426 37424 71142 57918 22712 44142 110039 111154 41700 -8854 21747
7696 21747 427 35154 96864 53662 24071 17122 9888 29377 -25400 -94121 -38102 -24628
7684 -24628 -3605 24280 29677 -20837 -79926 -151488 -147444 -100239 -49988 -15319 -68817 -125935
7672 -125935 -59344 20834 2282 -16008 23149 22790 23939 7469 -15738 -6453 64845 70805 49571
7659 49571 -27995 -139990 -172227 -114770 -51566 -76556 -68199 -89545 -109678 -127810 -62322 10966
$$ packed form
7745g211K1228o0131n175J7315R5960M011r3879q9720P2553L6998l1988K6180
7733a3859O3292L38k8072k2967m1362m7555J2368R520J5967M8543M458J6519N6627
7720G3817l8403m8547J2660J0583K709L361M9618L2615l6042j2520j4025J0539
7708D6365P599o538j0002L3718j3224l5206K1430O5897J115o9454n0554L0601
7696B1747k1320L4727O1710m3202k9591o949p234J9489n4777o8721N6019J3474
7684b4628K1023K7885N397n0514n9089p1562M044M7205N0251L4669n3498n7118
7672a25935O6591Q0178j8552j8290L9157l59J149j6470k3207R285P1298N960k1234
7659D9571p7566j11995l2237N7457O3204k4990Q357k1346k0133j8132O5488P3288
$$ plain form
7647 10966 16769 -23007 -95955 -102408 -68238 -106525 -76630 -31169 -12527 -53783 -67252 -13834
7635 -13834 -34996 -31895 -37649 -31762 -67829 -101798 -117639 -122406 -77053 -6169 -4320 -31294 -71797
7622 -71797 -61554 -16798 -33538 1908 -16076 -69427 -64509 -1661 22048 33472 -9353 -5517
7610 -5517 -37588 -66276 -50688 2669 -12789 -45619 -59512 -40977 24752 14973 26389 73991
7598 73991 59858 48257 15676 -15866 -18176 -21191 -28 -8575 4912 -2548 -10102 -77768 -53911
7585 -53911 -31806 -25397 -3688 39745 94493 91457 40325 -45555 -56607 -48836 -58667 -70191 -63463
7572 -63463 -56171 -60702 -80837 -59650 -69526 -77490 -66923 -56831 -40159 -16369 -67072 -95807 -117445
7559 -117445 -124626 -107371 -20071 57283 4393 10143 32659 121405 125495 69397 -16978 -83244
$$ packed form
7647A0966N803l9776p2948o453L4170l8287K9895M5461J8642m1256j3469N3418
7635a3834k1162L101n754N887l6067l3969j5841m767M5353P0884J849k6974m0503
7622g1797J0243M4756j6740L5446j7984n3351M918O2848K3709J1424m2825L836
7610e517l2071k8688J5588N3357j5458l2830j3893J8535O5729r779J1416M7602
7598G3991j4133j1601l2581l1542k310l015K1163q547J3487p460p554o7666K3857
7585e3911K2105O409K1709M3433N4748l036n1132q5880j1052P771r831j1524O728
7572f3463P292m531k0135K1187r876p964J0567J0092J6672K3790n0703k8735k1638
7559a17445p181J7255Q7300P7354n2890N750K2516Q8746M090n6098q6375o6266
$$ plain form
7547 -83244 -86881 -91602 -78957 -27912 1633 51205 73752 50109 -70 -28885 -51714 -89581
7535 -89581 -67452 -62436 -108658 -113099 -131794 -92932 -40 46802 29732 14223 11249 23449
7523 23449 17719 43559 55279 32026 33303 71672 66427 33621 44296 36436 2435 49587 19187
7510 19187 -6809 -7366 -19942 -25409 -5773 -10660 -93462 -134789 -87614 -52541 -56234 -56101 -4750
7497 -4750 59313 88207 60479 67962 47022 1941 69328 91477 60401 -7883 -34300 -19329
7485 -19329 -49042 -69764 -63377 -24023 29046 36159 26981 -11761 -18376 -12700 8897 50112 97033
7472 97033 63652 25415 -24338 12853 40294 -23676 -81590 -104043 -64625 -38028 -24264 30260
7460 30260 63612 88357 119535 59169 -2124 -24132 -39920 -19255 37583 105521 121557 51146
$$ packed form
7547h3244l637m721J2645N1045K9545M9572K2547k3643n0179k8815k2829l7867
7535h9581K2129N016m6222m441j8695L8862R2892M6842j7070j5509k974J2200
7523B3449n730K5840J1720k3253J277L8369n245l2806J0675p860l4001M7152l0400
7510A9187k5996n57j2576n467J9636m887q2802m1327M7175L5073l693J33N1351
7497d750O4063K8894k7728P483k0940m5081O7387K2149l1076o8284k6417J4971
7485a9329k9713k0722O387L9354N3069P113r178l8742o615N676K1597M1215M6921
7472I7033l3381l8237m9753L7191K7441o3970n7914k2453L9418K6597J3764N4524
7460C0260L3352K4745L1178o0366o1293k2008j5788K0665N6838O7938J6036p0411
$$ plain form
7448 51146 62321 116332 133410 54899 487 -11493 12114 39930 67936 19915 37379 12031
7436 12031 -46389 -98998 -71719 -9500 -41594 -91114 -148145 -107809 -51497 -40264 -26920 14459
7424 14459 49185 35883 42775 82004 94980 58550 48091 38630 -2287 -83148 -106708 -72634
7412 -72634 -83083 -65397 1296 28736 -21269 -45699 -21405 13394 19984 33225 64632 42929
7400 42929 3273 -68686 -97952 -116718 -115984 -158230 -173664 -143204 -159877 -119598 -128021 -113543
7388 -113543 -140573 -222321 -235948 -218236 -118260 -42785 -64481 -33147 -26811 29846 51120 31088
7376 31088 56337 88168 48447 -69264 -135664 -84912 -29837 39284 -2169 -48483 -40364 -38511
7364 -38511 -6898 24456 12969 27003 5989 -58176 -37999 -48548 -51702 8249 11924 -182
$$ packed form
7448E1146J1175N4011J7078p8511n4412j1980K3607K7816K8006m8021J7464k5348
7436A2031n8420n2609K7279O2219l2094m9520n7031M0336N6312J1233J3344M1379
7424A4459L4726j3302O892L9229J2976l6430j0459r461m0917q0861k3560L4074
7412g2634j0449J7686O6693K7440n0005k4430K4294L4799O590J3241L1407k1703
7400D2929l9656p1959k9266j8766P34m2246j5434L0460j6673M0279q423J4478
7388a13543k7030q1748j3627J7712R9976P5475k1696L1334O336N6657K1274k0032
7376C1088K5249L1831l9721j17711o6400N0752N5075O9121m1453m6314Q119J853
7364c8511L1613L1354j1487J4034k1014o4165K0177j0549l154N9951L675j2106
$$ plain form
7352 -182 8452 -16075 -11130 -35211 -29425 21904 -9030 -34474 -8388 -46519 -11341 -4487 -9477
7339 -9477 -83460 -158149 -118910 -39507 -31139 -67896 -76337 -64919 -118739 -133049 -122213 -78570
7327 -78570 -22005 -23337 4787 31108 20146 37472 55502 36938 -66142 -62514 -49767 -39261
7315 -39261 5813 113 -39760 13814 15780 -15460 -46011 -32783 -27671 70 17321 -23026
7303 -23026 -97891 -79942 -80433 -75430 -71719 -94744 -34924 -25843 -35859 -29792 -11844 -32709 -50253
7290 -50253 -52396 -56722 -20602 -41231 -75046 -53702 -30842 28981 -19772 -77867 -112886 -92486
7278 -92486 -83457 -72165 -72073 -56065 -56955 -44159 -24946 -69088 -30502 1154 -37775 -90586 -96466
7265 -96466 -76670 -58439 -56716 -21244 8809 -23081 -23524 -20827 -43665 -20440 3550 31550 13701
$$ packed form
7352a82Q634k4527M945k4081N786N1329l0934k5444K6086l8131L5178O854m990
7339i477p3983p4689L9239P9403Q368l6757q441J1418n3820j4310J0836M3643
7327g8570N6565j332K8124K6321j0962J7326J8030j8564j03080L628J2747J0506
7315c9261M5074n700l9873N3574J966l1240l0551J3228N112K7741J7251m0347
7303b3026p4865J7949m91N003L711k3025N9820R081j0016O067J7948k0865j7544
7290e0253k143m326L6120k0629l3815K1344K2860N9823m8753n8095l5019K0400
7278i2486R029J1292R2J6008q90J2796J9213m4142L8586L1656l8929n2811n880
7265i6466J9796J8231J723L5472L0053l1890m43K697k2838K3225K3990K8000j7849
$$ plain form
7252 13701 -17061 -60924 -65028 -60393 -51678 -47342 -7784 46686 12702 41860 71660 36810 5579
7239 5579 7013 21168 78053 87116 26105 -15967 -20928 25577 14179 -64677 -79789 -129548 -175670
7226 -175670 -120524 -34668 -964 35961 32862 57993 83406 98093 13153 -51883 -49736 -11316
7214 -11316 -16794 22246 75886 55258 21181 -16162 -45623 -75779 -28370 34455 44026 58561
7202 58561 57955 45469 27818 -68597 -98296 -39649 29770 43755 85947 46553 -29337 -62994
7190 -62994 -83789 -78552 23290 42612 -7022 -28138 -43905 -11922 -2259 -72734 -75903 -65153
7178 -65153 -64861 -63306 -60449 -12314 -4641 -26157 -36201 -48621 -124680 -176903 -184809 -154973 -61398
7165 -61398 -603 10026 -32938 -60934 -75709 -74947 -100510 -43427 26838 53069 57878 29732
$$ packed form
7252A3701l0762m3863m104M635Q715M336L9558N4470l3984K9158K9800l4850l1231
7239E579J434J4155N6885R063o1011m2072m961M6505j1398p8856j5112m9759m6122
7226a75670N5146Q5856L3704L6925l099K5131K5413J4687q4940o5036K147L8420
7214a1316n478L9040N3640k0628l4077l7343k9461l0156M7409O2825R571J4535
7202E8561o06j2486j7651r6415k9699N8647O9419J3985M2192l9394p5890l3657
7190f2994k0795N237J01842J9322m9634k1116j5767L1983R663p0475l169J0750
7178f5153K92J555K857M8135P673k1516j0044j2420p6059n2223p906K9836R3575
7165f1398O0795J0629m2964k7996j4775P62k5563N7083P0265K6231M809k8146
$$ plain form
7153 29732 4495 11568 -15912 -33191 -46424 -35737 -43184 -21243 2332 -36916 -63634 -23803
7141 -23803 15602 43078 49035 53629 27037 -33480 -52071 -59181 -109026 -103426 -88530 -108506 -87737
7128 -87737 -43893 -3530 -69181 -101137 -127511 -130366 -80832 -74381 -32905 2239 -13090 -46168
7116 -46168 -66080 -98899 -117062 -123754 -93634 -63386 3100 18998 14046 -5286 -24733 -58660
7104 -58660 -78792 -26283 -2245 -31123 -31389 -43064 -64213 -61051 11559 -7108 -24171 -51563
7092 -51563 -40922 -14755 8586 1188 -21674 -50693 -56879 -16649 10664 -7486 1470 31816
7080 31816 -24688 -61583 -61701 -57071 -23016 -39907 -30351 -25160 -50980 -98963 -94859 -79539 -94275
7067 -94275 -64057 -25031 -8490 -42909 -48318 -33040 3328 -4723 -17945 -37612 -59375 -21864
$$ packed form
7153B9732k5237P073k7480j7279j3233J0687p447K1941K3575l9248k6718L9831
7141b3803L9405K7476N957M594k6592o0517j8591p110m9845N600J4896j9976K0769
7128h7737M3844M0363o5651l1956k6374k855M9534O451M1476L5144j5329l3078
7116d6168j9912l2819j8163o692L0120L0248O6486J5898m952j9332j9447l3927
7104e8660k0132N2509K4038k8878k66j1675k1149L162P2610j8667j7063k7392
7092e1563J0641K6167K3341p398k2862k9019o186M0230K7313j8150Q956L0346
7080C1816n6504l6895j18M630L4055j6891R556N191k5820m7983M104J5320j4736
7067i4275L0218L9026J6541l4419n409J5278L6368q051j3222j9667k1763L7511
$$ plain form
7055 -21864 -34629 -75242 -15281 -26718 -50490 -8289 16357 16857 64757 55025 56494 27990 -21560
7042 -21560 -68278 -22488 50182 37754 65917 50011 4889 53907 -14485 -38176 -58498 -84266
7030 -84266 -58544 -20227 2341 -39728 -86401 -47938 -66218 -78327 -33550 -74802 -74769 -53734
7018 -53734 -25654 11437 69165 68603 43584 5077 -72282 -107590 -62539 -42564 -15661 -12582
7006 -12582 -39669 -25363 -27434 -72144 -100964 -41277 12829 29638 10440 9972 9699 -36299 -6037
6993 -6037 22110 25361 -3402 -4473 10111 23885 23024 36344 -13884 9756 59815 72228 71354
6980 71354 65623 51671 -66301 -58119 -24877 -20367 54104 34250 24425 52285 52083 -11690 -50431
6967 -50431 -38498 -78056 15828 70641 92511 54453 -16483 -96762 -109135 -100545 -45514 35418
$$ packed form
7055b1864j2765m0613N9961j1437k3772M2201K4646N00M7900r732J469k8504m9550
7042b1560m6718M5790P2670j2428K8163j5906m5122M9018o8392k3691k0322k5768
7030h4266K5722L8317K2568m2069m6673L8463j8280j2109M4777m1252L3K1035
7018e3734K8080L7091N7728n62k5019l8507p7359l5308M5051J9975K6903L079
7006a2582k7087J4306k071m4710k8820N9687N4106J6809j9198m68k73m5998L0262
6993f037K8147L251k8763j071J4584J3774q61J3320n0228K3640N0059J2413q74
6980G1354n731j3952j17972Q182L3242M510P4471j9854r825K7860k02o3773l8741
6967e0431J1933l9558R3884N4813K1870l8058p0936q0279j2373Q590N5031Q0932
$$ plain form
6955 35418 95817 8094 -35188 -17451 31951 55811 25111 -6999 11041 11096 -12106 2295
6943 2295 -20680 -40380 41079 13796 -37688 -65843 -23903 -4577 -60854 -75209 -34455 -26824
6931 -26824 35268 52976 60696 21744 16144 31841 48811 28232 -6950 -42747 -74412 -70703
6919 -70703 -31612 21276 101250 104587 74756 28736 20953 25334 28483 -4712 492 5575 -5358
6906 -5358 15864 48068 45127 43589 10500 32138 92852 71335 24107 -34465 -46495 -19168
6894 -19168 -2992 -76268 -70882 -44208 22990 7738 -14241 -14783 -9449 -34889 56706 68946 2231
6881 2231 5326 -49957 -34096 30720 484 5433 16647 -4116 -30585 28330 45678 66403
6869 66403 92615 99743 10861 -97550 -161121 -96601 -77420 -85211 -86407 -61488 -23341 3996
$$ packed form
6955C5418O0399q7723m3282J7737M9402K3860l0700l2110J8040N5k3202J4401
6943B295k2975j9700Q1459k7283n1484k8155M1940J9326n6277j4355M0754P631
6931b6824O2092J7708P720l8952n600J5697J6970k0579l5182l5797l1665L709
6919g0703L9091N2888P9974L337k9831m6020p783M381L149l3195N204N083j0933
6906e358K1222L2204k941j538l3089K1638O0714k1517m7228n8572j2030K7327
6894a9168J6176p3276N386K6674O7198j5252k1979n42N334k5440R1595J2240o6715
6881B231L095n5283J5861O4816l0236M949J1214k0763k6469N8915J7348K0725
6869F6403K6212P128q8882j08411o3571O4520J9181p791j196K4919L8147K7337
$$ plain form
6857 3996 37228 19413 -51868 -21287 -10097 19493 30825 27896 31796 49103 21076 -25375
6845 -25375 -36008 23629 51182 63404 79447 37821 54319 31057 6030 56535 74261 82265
6833 82265 77556 59122 22476 44721 42616 35079 -14194 -58277 -39520 -11448 28593 110676
6821 110676 114792 77858 17110 50365 -3902 -40741 -49914 -105511 -79655 -14903 -54583 -78126
6809 -78126 -60538 -70796 -87802 -138046 -45526 29770 46201 38282 -5994 -40635 -40372 -12459
6797 -12459 -17784 -22066 14886 30808 42265 13314 5754 36516 37228 59813 63638 27984 -19534
6784 -19534 -41889 43892 57632 42731 -18063 -36996 -1983 -10681 -17248 -1597 -19694 -50513
6772 -50513 -24169 50175 30032 -17164 -15761 -30688 -87295 -90539 -18708 -18627 -80542 -97199 -41933
$$ packed form
6857C996L3232j7815p1281L0581J1190K9590J1332k929L900J7307k8027m6451
6845b5375j0633N9637K7553J2222J6043m1626J6498k3262k5027N0505J7726Q004
6833H2265m709j8434l6646K2245k105p537m9273m4083J8757K8072M0041Q2083
6821A10676M116l6934o0748L3255n4267l6839r173n5597K5856O4752l9680k3543
6809g8126J7588j0258j7006n0244R2520P5296J6431p919m4276l4641K63K7913
6797a2459n325m282L6952J5922J1457k8951p560L0762P12K2585L825l5654m7518
6784a9534k2355Q5781J3740j4901o0794j8933L5013q698o567J5651j8097l0819
6772e0513K6344P4344k0143m7196J403j4927n6607l244P1831Q1o1915j6657N5266
$$ plain form
6759 -41933 -6271 7731 -8807 -55787 -104277 -144545 -185567 -215789 -194687 -144276 -44838 -26222
6747 -26222 -93035 -55674 12983 43202 18815 -4632 -56374 -63474 -65236 -42663 -47286 -60395
6735 -60395 -81592 -85143 -30384 10564 1045 -14485 41972 50749 50531 77138 56941 -3375 -43095
6722 -43095 -38854 -9185 -19319 10489 58654 68633 27739 32625 14789 -28644 -60835 -22203
6710 -22203 -369 -19942 -20426 -1822 -23192 -9565 -39690 -38928 6675 44310 78425 68271 13971
6697 13971 -66614 -75991 -3336 -3498 -63907 -91319 -85481 -84828 -122446 -36933 -17040 -87384 -80919
6684 -80919 -23978 15006 -14478 -709 24662 -21388 -112519 -113089 -80344 -48122 -51439 32880
6672 32880 127088 90394 -10572 2879 9652 -45491 21421 78036 71865 101483 113358 84124
$$ packed form
6759d1933L5662J4002j6538m6980m8490m0268m1022l0222K1102N0411R9438J8616
6747b6222o6813L7361O8657L0219k4387k3447n1742p100j762K2573m623j3109
6735f0395k1197l551N4759M0948r519j5530N6457Q777k18K6607k0197o0316l9720
6722d3095M241K9669j0134K9808M8165R979m0894M886j7836m3433l2191L8632
6710b2203K1834j9573m84J8604k1370J3627l0125P62M5603L7635L4115j0154n4300
6697A3971q0585r377P2655j62o0409k7412N838O53l7618Q5513J9893p0344O465
6684h0919N6941L8984k9484J3769K5371m6050r1131n70L2745L2222l317Q4319
6672C2880R4208l6694j00966J3451O773n5143O6912N6615o171K9618J1875k9234
$$ plain form
6660 84124 39162 57300 93588 129200 97892 86054 59670 49613 -37188 -33934 -20087 14121
6648 14121 12605 -30412 -21382 -13417 -11134 -55553 -132488 -122283 -48156 21015 45256 52357 67869
6635 67869 69105 73409 3262 -15167 -4072 -35070 -29751 -5646 -9074 -22957 -58745 -36509 22717
6622 22717 19491 -25940 1948 39240 47567 73756 -6265 -15915 -15535 -43710 -51303 -25931 -75838
6609 -75838 -64353 9826 37642 21190 -9091 -29831 -62014 -119694 -92855 -67610 -35560 -34718
6597 -34718 -8907 -15191 -25664 -45423 -34144 -5171 -52680 -103510 -91954 -28667 -1161 -20210
6585 -20210 -44560 -42902 5627 -42233 -37940 -39927 -75105 -64419 -29072 -62564 -100225 -68981
6573 -68981 -110084 -62200 -30590 -525 11372 -18090 13109 45601 25211 -9005 -48529 -146944
$$ packed form
6660H4124m4962J8138L6288L5612l1308j1838k6384j0057q6801L254J3847L4208
6648A4121j516m3017R030P965K283m4419p6935J0205P4127O9171K4241P101J5512
6635F7869J236M304p0147j8429J1095l0998N319K4105l428j3883l5788K2236N9226
6622B2717l226m5431K7888L7292Q327K6189q0021r650L80k8175p593K5372m9907
6609g5838J1485P4179K7816j6452l0281k0740l2183n7680K6839K5245L2050Q42
6597c4718K5811o284j0473j9759J1279K8973m7509n0830J1556O3287K7506j9049
6585b0210k4350J658M8529m7860M293j987l5178J0686L5347l3492l7661L1244
6573f8981m1103M7884L1610L0065J1897k9462L1199L2492k0390l4216l9524r8415
$$ plain form
6561 -146944 -196542 -128126 -68121 -42838 -21257 -33393 -45121 -129607 -142786 -56135 26488 -4261
6549 -4261 -69239 -73447 -14584 62758 66797 34867 12959 -11552 11001 20259 -38327 -96993 -46420
6536 -46420 -14426 38838 135473 114798 54860 12649 43388 -3704 -46467 -52153 -86434 -123297
6524 -123297 -123186 -98513 -18141 43167 -7588 -19068 3472 -42887 -49836 -42841 -32884 14651 46132
6511 46132 6218 -17113 -11874 74602 71946 4977 -107399 -85744 -11421 79555 71165 -14425
6499 -14425 -75009 -46220 2063 -9561 8005 70822 40783 9734 48066 78232 83627 18508
6487 18508 39569 11916 -22540 -28777 -19458 -6652 2659 -14480 22923 36251 49745 33429
6475 33429 27138 76135 38776 -12587 -17792 -41043 -82000 -48197 8027 -3323 20349 44823
$$ packed form
6561a46944m9598O8416O0005K5283K1581j2136j1728q4486j3179Q6651Q2623l0749
6549d261o4978m208N8863P7342M039l1930k1908k4511K2553R258n8586n8666N0573
6536d6420L1994N3264R6635k0675n9938m2211L0739m7092m2763n686l4281l6863
6524a23297J11K4673Q0372O1308n0755j1480K2540m6359o949O995R957M7535L1481
6511D6132l9914k3331N239Q6476k656o6969j12376K1655P4323R0976q390q5590
6499a4425o0584K8789M8283j1624J7566O2817l0039l1049L8332L0166N395o5119
6487A8508K1061k7653l4456o237R319J2806R311j7139L7403J3328J3494j6316
6475C3429o291M8997l7359n1363n205k3251m0957L3803N6224j1350K3672K4474
$$ plain form
6463 44823 35315 -5264 -85771 -125120 -101705 -107005 -78069 -81575 -80085 -89927 -100065 -110035 -63791
6450 -63791 -17896 -23881 -28649 -9556 17894 14491 -38322 -109578 -119086 -60811 -4942 28774 38854
6437 38854 4280 -21839 37192 -15700 -4732 51904 91181 79991 50769 -10659 -30959 -90199
6425 -90199 -77728 -90274 -89513 -133269 -124573 -106104 -143275 -131655 -127287 -89516 -24719 27032 60970
6412 60970 58093 44777 34558 -25091 -28559 -45314 -79300 -28459 -10960 -20356 -100306 -111916
6400 -111916 -107938 -67383 -67361 -91443 -39957 21774 17868 -5702 -13587 2313 51983 8584 -27610
6387 -27610 -34580 -112363 -146072 -100834 -113045 -152822 -134888 -83852 -16329 6164 3023 28944
6375 28944 48348 48856 17399 -26662 -28500 -13496 -33518 -56660 -56193 -25828 -15698 -52003 -65115
$$ packed form
6463D4823r508m0579q0507l9349K3415n300K8936l506J490r842j0138r970M6244
6450f3791M5895n985m768J9093K7450l403n2813p1256r508N8275N5869L3716J0080
6437C8854l4574k6119N9031n2892J0968N6636L9277j1190k9222o1428k0300n9240
6425i0199J2471j2546P61m3756Q696J8469l7171J1620M368L7771O4797N1751L3938
6412F0970k877j3316j0219n9649l468j6755l3986N0841J7499r396p9950j1610
6400a11916L978M0555K2k4082N1486O1731l906k3570p885J5900M9670m3399l6194
6387b7610o970p7783l3709M5238j2211l9777J7934N1036O7523K2493l141K5921
6375B8944J9404N08l1457m4061j838J5004k0022k3142M67L0365J0130l6305j3112
$$ plain form
6362 -65115 -32444 -32555 -60400 -49501 -32987 -1526 3868 65178 91733 103810 47672 -11072
6350 -11072 -53485 -66303 -63323 -8401 47918 83887 60745 41127 56048 6341 -66146 -12450
6338 -12450 -10935 48625 85583 65651 90516 106356 88932 66215 81643 69387 47329 -9835
6326 -9835 -20669 -6874 -30474 -26906 12300 22178 -4073 -4369 8285 -33579 -47831 -5854 7570
6313 7570 -65711 -84920 -5959 25673 32411 54091 28833 35755 68953 21647 -18345 -6918
6301 -6918 -34918 -91516 -44912 -30541 53771 100044 77891 -5051 -55756 -52398 -10722 -23951
6289 -23951 -84050 -115767 -119925 -66113 -16003 34351 68473 48931 16362 51725 73036 29128
6277 29128 64336 21987 5265 -31657 5556 38929 12637 -93949 -84271 -77123 -93456 -64980
$$ packed form
6362f5115L2671j11k7845J0899J6514L1461N394O1310K6555J2077n6138n8744
6350a1072m2413j2818K980N4922N6319L5969k3142j9618J4921m9707p2487N3696
6338a2450J515N9560L6958j9932K4865J5840j7424k2717J5428j2256k2058n7164
6326i835j0834J3795k3600L568L9206R878k6251k96J2654m1864j4252M1977J3424
6313G570p3281j9209P8961L1632O738K1680k5258O922L3198m7306l9992J1427
6301f918k8000n6598M6604J4371Q4312M6273k2153q2942n0705L358M1676j3229
6289b3951o0099l1717m158N3812N0110N0354L4122j9542l2569L5363K1311m3908
6277B9128L5208m2349j6722l6922L7213L3373k6292j06586R678P148j6333K8476
$$ plain form
6265 -64980 -64034 -49934 13666 -37759 -85239 -73641 -63214 -72993 -68406 -77931 -56530 -100881 -91718
6252 -91718 -32019 -4104 -82166 -120758 -54243 -20999 -14641 -1402 -102850 -103900 -69315 -59350
6240 -59350 -68094 -58523 -47404 -37667 11212 -17929 -24302 5747 18434 -24379 -23476 -5664 -51821
$$ packed form
6265f4980R46J4100O3600n1425m7480J1598J0427r779M587r525K1401m4351R163
6252i1718N9699K7915p8062l8592O6515L3244O358J3239j01448j050L4585R965
6240e9350q744R571J1119R737M8879k9141o373L0049J2687m2813R03J7812m6157
$$ [...]
##END NTUPLES=NMR SPECTRUM
##END=
