##TITLE=Analysis number 315784
Compound Code cc 30122
Project Code adrs
Chemist Name fudan
##JCAMPDX= 6.0         $$ Bruker NMR JCAMP-DX V2.0
##DATA TYPE= NMR SPECTRUM
##DATA CLASS= NTUPLES
##ORIGIN= Bruker BioSpin GmbH
##OWNER= NMR
$$ XWIN-NMR		Version 3.5
$$ Thu Dec  1 14:50:30 2005 GMT Standard Time (UT+0h)  MAYBRIDGE\NMR@NMR_250MHZ
##.OBSERVE FREQUENCY= 250.131544655141
##.OBSERVE NUCLEUS= ^1H
##.ACQUISITION MODE= SIMULTANEOUS (DQD)
##.ACQUISITION SCHEME= undefined
##.AVERAGES= 16
##.DIGITISER RES= 18
##SPECTROMETER/DATA SYSTEM= dpx250
##.PULSE SEQUENCE= zg30
##.SOLVENT NAME= CDCl3
##.SHIFT REFERENCE= (INTERNAL, CDCl3, 0, 16.522)
##AUDIT TRAIL= $$ (NUMBER, WHEN, WHO, WHERE, WHAT)
$$ ##TITLE= Audit trail, XWIN-NMR		Version 3.5
$$ ##JCAMPDX= 5.01
$$ ##ORIGIN= Bruker BioSpin GmbH
$$ ##OWNER= NMR
$$ C:\u/data/dgb/nmr/ADRS/13300/pdata/1/auditp.txt
$$ ##AUDIT TRAIL=  $$ (NUMBER, WHEN, WHO, WHERE, WHAT)
(   1,<2005-12-01 14:49:50.22 +000>,<MAYBRIDGE\NMR>,<NMR_250MHZ>,
      <created by zg, POWCHK disabled, PULCHK disabled
       configuration hash MD5:
       62 19 C7 07 E1 42 D1 B7 37 6C 3D D0 77 39 F9 E6
       data hash MD5: 64K
       0E E0 27 D9 39 02 FA DD 56 D2 0C 4F 61 95 01 AF>)
(   2,<2005-12-01 14:50:11.40 +000>,<MAYBRIDGE\NMR>,<NMR_250MHZ>,
      <Start of raw data processing
       ef LB = 0.3 FT_mod = 6 PKNL = 1 SI = 32K 
       data hash MD5: 32K
       F2 CD 74 E4 E1 1A 68 F7 72 2E 90 BB 47 35 E3 F1>)
(   3,<2005-12-01 14:50:16.29 +000>,<MAYBRIDGE\NMR>,<NMR_250MHZ>,
      <apk 
       data hash MD5: 32K
       CB 10 1D E1 16 A6 71 12 18 88 85 17 3C B3 F1 4F>)
(   4,<2005-12-01 14:50:17.80 +000>,<MAYBRIDGE\NMR>,<NMR_250MHZ>,
      <abs ABSG = 5 
       data hash MD5: 32K
       0F B7 0F 19 06 D2 EE F1 F1 24 9A 26 8A 5C 64 4C>)
$$ ##END=
$$ 
$$ hash MD5
$$ D0 DF 86 AD A4 20 1F 99 87 1B F1 C8 70 67 9B B6
##$RELAX= 
##$RELAX= 
##$RELAX= 
##$RELAX= 
##$RELAX= 
##$RELAX= 
##$RELAX= 
$$ Bruker specific parameters
$$ --------------------------
##$DU= <C:\u>
##$EXPNO= 13300
##$NAME= <ADRS>
##$PROCNO= 1
##$TYPE= <nmr>
##$USER= <dgb>
##$AMP= (0..31)
100 100 100 100 100 100 100 100 100 100 100 100 100 100 100 100 100 100 
100 100 100 100 100 100 100 100 100 100 100 100 100 100 
##$AQSEQ= 0
##$AQ_mod= 3
##$AUNM= <au_zg>
##$AUTOPOS= <27 >
##$BF1= 250.13
##$BF2= 250.13
##$BF3= 250.13
##$BF4= 250.13
##$BF5= 500.13
##$BF6= 500.13
##$BF7= 500.13
##$BF8= 500.13
##$BYTORDA= 1
##$CFDGTYP= 0
##$CFRGTYP= 5
##$CHEMSTR= <none>
##$CNST= (0..31)
1 1 145 1 1 1 1 1 1 1 1 1 1 1 1 1 1 1 1 1 1 1 1 1 1 1 1 1 1 1 1 1 
##$CPDPRG= <>
##$CPDPRG1= <>
##$CPDPRG2= <>
##$CPDPRG3= <>
##$CPDPRG4= <mlev>
##$CPDPRG5= <mlev>
##$CPDPRG6= <mlev>
##$CPDPRG7= <mlev>
##$CPDPRG8= <mlev>
##$CPDPRGB= <>
##$CPDPRGT= <>
##$D= (0..31)
0 1 0 0 0 0 0 0 0 0.06 0 0 0 0 0 0 0.0002 0 0 0 0 0 0 0 0 0 0 0 0 0 0 
0 
##$DATE= 1133448588
##$DBL= (0..7)
120 120 120 120 120 120 120 120 
##$DBP= (0..7)
150 150 150 150 150 150 150 150 
##$DBP07= 0
##$DBPNAM0= <>
##$DBPNAM1= <>
##$DBPNAM2= <>
$$ [...]
##$SUBNAM7= <"">
##$SUBNAM8= <"">
##$SUBNAM9= <"">
##$SW= 20.6930455092707
##$SWIBOX= (0..15)
0 0 3 0 0 0 0 0 0 0 0 0 0 0 0 0 
##$SW_h= 5175.983436853
##$TD= 65536
##$TD0= 1
##$TE= 294.16
##$TE2= 300
##$TE3= 300
##$TEG= 300
##$TL= (0..7)
0 120 120 120 120 120 120 120 
##$TP= (0..7)
150 150 150 150 150 150 150 150 
##$TP07= 0
##$TPNAME0= <>
##$TPNAME1= <>
##$TPNAME2= <>
##$TPNAME3= <>
##$TPNAME4= <>
##$TPNAME5= <>
##$TPNAME6= <>
##$TPNAME7= <>
##$TPOAL= (0..7)
0.5 0.5 0.5 0.5 0.5 0.5 0.5 0.5 
##$TPOFFS= (0..7)
0 0 0 0 0 0 0 0 
##$TUNHIN= 0
##$TUNHOUT= 0
##$TUNXOUT= 0
##$USERA1= <user>
##$USERA2= <user>
##$USERA3= <user>
##$USERA4= <user>
##$USERA5= <user>
##$V9= 5
##$VALIST= <valist>
##$VCLIST= <CCCCCCCCCCCCCCC>
##$VD= 0
##$VDLIST= <DDDDDDDDDDDDDDD>
##$VPLIST= <PPPPPPPPPPPPPPP>
##$VTLIST= <TTTTTTTTTTTTTTT>
##$WBST= 1024
##$WBSW= 4
##$XGAIN= (0..3)
0 0 0 0 
##$XL= 0
##$YL= 0
##$YMAX_a= 581304
##$YMIN_a= -393102
##$ZGOPTNS= <>
##$ZL1= 120
##$ZL2= 120
##$ZL3= 120
##$ZL4= 120
##$ABSF1= 16.522
##$ABSF2= -4.171173
##$ABSG= 5
##$ABSL= 3
##$ALPHA= 0
##$AQORDER= 0
##$ASSFAC= 0
##$ASSFACI= 0
##$ASSFACX= 0
##$ASSWID= 0
##$AUNMP= <proc_1d>
##$AZFE= 0.1
##$AZFW= 0.1
##$BCFW= 0
##$BC_mod= 0
##$BYTORDP= 0
##$COROFFS= 0
##$CY= 12.5
##$DATMOD= 1
##$DC= 0
##$DFILT= <>
##$DTYPP= 0
##$F1P= 14.0000005364418
##$F2P= -0.99999901652339
##$FCOR= 0.5
##$FTSIZE= 32768
##$FT_mod= 6
##$GAMMA= 0
##$GB= 0
##$INTBC= 1
##$INTSCL= 1
##$ISEN= 128
##$LB= 0.3
##$LEV0= 0
##$LPBIN= 0
##$MAXI= 10000
##$MC2= 0
##$MEAN= 0
##$ME_mod= 0
##$MI= 0
##$NCOEF= 0
##$NC_proc= -3
##$NLEV= 6
##$NOISF1= 0
##$NOISF2= 0
##$NSP= 0
##$NTH_PI= 0
##$NZP= 0
##$OFFSET= 16.522
##$PC= 1
##$PHC0= 86.6843
##$PHC1= 5.589827
##$PH_mod= 1
##$PKNL= yes
##$PPARMOD= 0
##$PSCAL= 4
##$PSIGN= 0
##$REVERSE= no
##$SF= 250.13
##$SI= 32768
##$SIGF1= 0
##$SIGF2= 0
##$SINO= 400
##$SIOLD= 32768
##$SREGLST= <1H.CDCl3>
##$SSB= 0
##$STSI= 32768
##$STSR= 0
##$SW_p= 5175.98343685301
##$SYMM= 0
##$S_DEV= 0
##$TDeff= 65536
##$TDoff= 0
##$TI= <Analysis number 999999
Compound Code 99
Book Reference 9
Project Code 9>
##$TILT= no
##$TM1= 0
##$TM2= 0
##$TOPLEV= 0
##$USERP1= <user>
##$USERP2= <user>
##$USERP3= <user>
##$USERP4= <user>
##$USERP5= <user>
##$WDW= 1
##$XDIM= 32768
##$YMAX_p= 407923899
##$YMIN_p= -168007
$$ End of Bruker specific parameters
$$ ---------------------------------
##NTUPLES= NMR SPECTRUM
##VAR_NAME=  FREQUENCY,     SPECTRUM/REAL,   SPECTRUM/IMAG
##SYMBOL=    X,             R,               I
##VAR_TYPE=  INDEPENDENT,   DEPENDENT,       DEPENDENT
##VAR_FORM=  AFFN,          ASDF,            ASDF
##VAR_DIM=   32768,         32768,           32768
##UNITS=     HZ,            ARBITRARY UNITS, ARBITRARY UNITS
##FACTOR=    0.157963299565203, 1,           1
##FIRST=     4132.6476996994, 0,             0
##LAST=      -1043.33573715361, 0,           0
##MIN=       -1043.33573715361, -168007,     0
##MAX=       4132.6476996994, 407923899,     0
$$ Real data points
##PAGE= N=1
##DATA TABLE= (X++(R..R)), XYDATA
$$ [...]
18549B4613K21Q888J410j2978j0894j1913m450j1261M7364K8272j9502n0476k9605
18536d0311n789J246L8445q045r437k6974p780L187J9999O3395n202m3551j0855
18523c1672J1889P070J1471M2281L2355q275m7004q115J0904j058l6801K2843
18511E888o220j6334r407l1059K2919m611K5812N3864q494Q322J3604L85K0478
18498G5147j8906l4268J2523M4912m3860n2125k5983k3003j3796k9916q709P3731
18486d4253L0614K0165j6008j096m5570k3936J448J6471N1447L6087M2715O5319
18474A33403J0797r3155j02323m4846L3121L1903K1771k9577j6699N4586N7574
18463E6555k2683m2772j9329L943r825Q196P772N923J3620o673k2918k2558K0510
$$ y = [24613, 24834, 33722, 35132, 22154, 11260, -653, -5103, -16364, 31000, 59272, 39770, -10706, -40311, -46100, -44854, -6409, -14454, -23891, -50865, -58645, -55458, -35459, 27936, 22734, -20817, -31672, -19783, -12713, -1242, 41039, 73394, 65119, 18115, 10000, 20904, 19846, -16955, 5888, -332, -16666, -26073, -57132, -34213, -38824, -13012, 40852, 32358, 40680, 54284, 54669, 75147, 56241, 21973, 34496, 79408, 35548, -16577, -42560, -65563, -79359, -109275, -117984, -44253, -13639, 6526, -9482, -10578, -56148, -80084, -78636, -62165, -10718, 25369, 68084, 133403, 144200, 51045, -51278, -96124, -63003, -31100, -9329, -38906, -55605, -1019, 56555, 33872, -8900, -28229, -24286, -34111, -25915, -18143, -12220, 1400, -5273, -28191, -50749, -30239]
18450c0239j8393j9585K3946J0341N503K1995j5916J2379o836j5816J0282J0041
18438a2298j9236J0390m170k6518q213K7468J5761k9722j5042N0368K3448R550
18426B1786j3431J5551j0782j16l050J0227n9082m7171j5822K4857R0768K7919
18414D1654m880K05l883j2988m4976k6982k8065L2903M6254K91p425k5290J679
18401c1503K3588m810k902J6633K630r53J8752K1570Q354k5503R908j1846q11
18388B3107J0695J2069P643M3160M655p1057l1144K4404j8956l5574J9459p051
18376a8590l0644J8473L9516j4822l1825N914l0986j2818N8456J3949k8253N849
18364b5781L5441o032k4171j3090J1679J9712M44j673j9615j2612R053M4421J7432
$$ y = [-30239, -48632, -68217, -44271, -33930, -28427, -6432, -22348, -9969, -16805, -32621, -22339, -12298, -31534, -21144, -25314, -51832, -60045, -32577, -16816, -46538, -61580, -11212, 12236, 21786, 8355, 23906, 13124, 13008, 9958, 20185, -38897, -86068, -101890, -77033, 13735, 41654, 36774, 36979, 33096, 20108, -24868, -51850, -79915, -47012, -758, -467, -7892, -33182, -31503, -7915, -12725, -15627, 1006, 3636, 2683, 21435, 43005, 51359, 25856, 35764, 23918, 23107, 33802, 45871, 53514, 96674, 101329, 30272, -872, 23532, 4576, -30998, -11539, -18590, -49234, -30761, 8755, -6067, -37892, -31978, -62964, -75782, -17326, -3377, -31630, -25781, 9660, 3628, -20543, -33633, -21954, -2242, -1798, -3471, -23086, -35698, -26645, 17776, 35208]
18351C5208J2142K5372l8254o8256p053L8646N765k0399K0583K4026J3451P764
18339D8995k1543J7160j1206K764j1986K3636M068p232J9464k2485L2690K501
18327G6826k7268l9451m6927Rr998J6134L7024K2561l024k3323j7745k3284J0153
18314b8313J6308N567K3420j8479K2008k693l9301j2096K3363j0754O844O0606
18302D6480J5904j0071k168J8801j9806l4054j4829m598J2830l0907k937M9835
18290B4480O442J5639m655N818j916n822m8855k9979L5608J0112j9469P129j5599
18277b1067l6866K8966J5900M0719L734p865K5365j0260L4307o479j9416l2822
18265A4216J6985N0335n852j9811M94l785k6380m2558l4250l4111j2141L1070
$$ y = [35208, 47350, 72722, 34468, -33788, -40841, -2195, 3570, -16829, 3754, 27780, 41231, 48995, 27452, 44612, 33406, 36170, 24184, 47820, 51888, 44656, 64120, 41635, 74325, 76826, 49558, 10107, -36820, -36811, -46809, -30675, 6349, 28910, 25886, 2563, -15182, -38466, -28313, -12005, -6438, 16982, -1497, 20511, 17818, -21483, -33579, -10216, -20970, -14126, 46480, 62384, 52313, 50145, 68946, 49140, 15086, 257, -4341, 8489, -22418, -25355, 24480, 30922, 46561, 41906, 47724, 45808, 39986, -8869, -38848, -3240, 6872, -12597, -5468, -21067, -57933, -28967, -13067, 27652, 31386, 23521, 48886, 38626, 72933, 66454, 47038, 14216, 31201, 81536, 75684, 55873, 56367, 52582, 26202, -16356, -50606, -84717, -96858, -65788]
18253f5788K7242J0114j5498o40l3519J633M850M7933J5431p543K5050k5675k5997
18240d2407K7064J2066J5630K5384L4979j7595j0185K43J4810L3998L4833L796
18228A32616k9824l4855j4466n5725j3565j6278J842J5847n432M778L8879j171
18216B2646p221l5518j8923K942O226K7116M6330M1841j4463m2874M724J6924
18204D9750k6490j7135l2338J4745n902j0269K4827M3031P991p121j3196l995
18192B3898l740L3259j8627o661J9954K2155J0004J3234m6562m814j8452Q158
18180C1806p396l3272J3383J8876N0139R506N370k2047k4490L941O624j4108j520
18167C6812M380K3861K7747k4779j261Q322J6376Q882L975J5376l5602J5505j2526
$$ y = [-65788, -38546, -28432, -43930, -44570, -78089, -76456, -71606, -23673, -8242, -15785, 9265, -16410, -42407, -15343, -3277, 12353, 37737, 72716, 55121, 44936, 45179, 59989, 93987, 128820, 132616, 102792, 67937, 53471, -2254, -15819, -32097, -30255, -14408, -19840, -15062, 23817, 22646, 15425, -20093, -39016, -36074, -29848, -2732, 43598, 85439, 70976, 28102, 32826, 49750, 23260, 6125, -26213, -11468, -17370, -27639, -2812, 40219, 48210, 41089, 27893, 23898, 20158, 53417, 34790, 28129, 48083, 70238, 80242, 93476, 46914, 42100, 23648, 31806, 24410, -8862, 4521, 23397, 73536, 83042, 88412, 66365, 41875, 45816, 52440, 38332, 36812, 41192, 65053, 92800, 68021, 66760, 75082, 91458, 100340, 104315, 119691, 84089, 99594, 87068]
18154H7068l0475k1898k14Q8709N9250o841K9560l6350k8831k696N7663P331k2340
18141A79936Q471M0041l3801j1612L1540M7153j2774M0308M1871l1893K5141M4082
18129C68463L4133O8400M9083N8190O8816J22647J29909J23002J06396J15846
18119A244885J76524K03320L25211L64406M33322O30296Q96589J282484J834311
18110G391348K769178M838835Q924221J6687641K5131208R494079j1725895j0525328
18102E2985287r604524j1848945j0946825o985709l876410k264745j452760r66183
18094E039186p70822n86466m37624l77809l07765k86056k63795j96988j54094
18085A657767j19230j67542j31153p3253o7435n8831q6754j40421p5417m7009
$$ y = [87068, 56593, 34695, 34481, 123190, 182440, 175599, 205159, 168809, 139978, 137282, 194945, 202276, 179936, 188407, 228448, 194647, 183035, 214575, 261728, 248954, 289262, 331133, 299240, 324381, 368463, 402596, 470996, 520079, 578269, 647085, 769732, 899641, 1022643, 1129039, 1244885, 1421409, 1624729, 1949940, 2314346, 2747668, 3377964, 4274553, 5557037, 7391348, 10160526, 14999361, 23923582, 40611223, 65742431, 75236510, 63510615, 52985287, 43380763, 31531818, 20584993, 13599284, 9722874, 7458129, 6005369, 5039186, 4268364, 3681898, 3244274, 2866465, 2558700, 2272644, 2008849, 1811861, 1657767, 1538537, 1370995, 1239842, 1166589, 1099154, 1040323, 953569, 813148, 737731, 690722]
18075F90722k5748m6165o4825l3340o5016n8611j3771k0866k9664l8000Q868j5097
18063B88487k3657m8873j8078K3958n1909M742L3937J2213k8267m5923K7022K0964
18051A94616J2416p361o8275m3055r611m86m6015K2539j3884L2384K5845J996
18039A01109J5964R154m9597k8056J7924k4892j7456O872j1950l2859L290L5392
18027B4895L3734L2692m732l5384M7824M648l3778m5286K2401j71j850J2560k5569
18014C1984l7464K769M785o725J6357K7157J1014J004l1457J0495J8910n7387
18002h558J5928k0439M9273k4412J8856K1370J3849j4074N198R920M8459p645
17990A07725o1663n716k033k213m9391o0239j398M5426M0049L8727q770j7465
$$ y = [690722, 664974, 618809, 553984, 520644, 455628, 397017, 383246, 362380, 332716, 294716, 303584, 288487, 264830, 215957, 197879, 221837, 169928, 174670, 208607, 220820, 192553, 146630, 173652, 194616, 207032, 199671, 131396, 88341, 78730, 78244, 32229, 54768, 40884, 73268, 99113, 101109, 117073, 126227, 76630, 48574, 66498, 41606, 24150, 31022, 19072, -13787, -10497, 24895, 58629, 91321, 86589, 51205, 99029, 103677, 69899, 24613, 47014, 46843, 44993, 57553, 31984, -5480, -2711, 2074, -4651, 11706, 38863, 49877, 50881, 19424, 29919, 48829, -8558, 7370, -13069, 36204, 11792, 30648, 52018, 65867, 51793, 56991, 66911, 115370, 107725, 46062, 40346, 38313, 36100, -13291, -73530, -74928, -29502, 10547, 49274, 40504, 23039]
17978B3039k191l3793j487l858J3122P977l820L8448k0936j2070q139J0584K0680
17965B7556K2922K7918l3280Q191k8615m7860p159k2851K7071M2732J8947j9609
17953A5963M1026J4734k5256j1967p732k2044j9381j274M4059m738p5008m8809
17941a00427K4880N5726r974L1280L305p575j0748L3906Q102L8929L057n0512
17929A9949k3158l365M5629j0402j8893j2680j2692J6541j6588j2712k3144J2763
17917c8752M2035k5763K0563K8790p399l0726l6315k6261J1778K2632K7380K8264
17905A6226J5478m3923p825m940K6881L5837j0353j4449M672r239l1925K8871
17893E311L8862k3089l1062k3535k7570j8603K1784k7j8097J1823M0854K6418
$$ y = [23039, 20848, -12945, -14432, -18290, -5168, 2809, -1011, 37437, 16501, 4431, -3708, 6876, 27556, 50478, 78396, 45116, 53307, 24692, -23168, -30327, -53178, -26107, 16625, 35572, 15963, 56989, 71723, 46467, 34500, 26768, 4724, -14657, -15931, 28128, 23390, -51618, -100427, -75547, -19821, -29795, 1485, 4790, -2785, -13533, 20373, 28475, 67404, 70461, 19949, -3209, -6574, 39055, 28653, 9760, -2920, -15612, 929, -15659, -28371, -51515, -38752, 3283, -22480, -1917, 26873, 19474, -11252, -47567, -73828, -62050, -39418, -12038, 16226, 31704, -12219, -20044, -24984, 1897, 37734, 27381, 12932, 17604, 8365, -23560, 5311, 44173, 21084, -9978, -33513, -61083, -79686, -57902, -57929, -76026, -64203, -23349, 3069]
17881C069j8040j7705m9006n239J0299j4385K6976K2130o389q193J9998L830J0717
17868b1938J2903R81K3123l7223k2320K6667K7806L5538L8923J0672j7226j8815
17856E9091l5800l156j2327q71K1809k8328J7586J0448k7539m7798p396K4564
17844b9717k0408j0965k9495K5856N8171k6277l600J5011J4792k0627l3127J2992
17832d7394M9483L9242j2638l6007K130j610J5218K6131q635k1441J9430J7595
17820D1504l4357j1626j4370K5262P478K0200M3466J614l4798J602k1739k1900
17808B336J1197J9050j3470j948l994J3655J2183q25j0778m7509k0791r482R85
17795d9391M6147N7433K2792l2457l0366p396Q08m572L6528J0472O851O158n4375
$$ y = [3069, -14971, -32676, -81682, -86921, -76622, -91007, -64031, -41901, -48290, -56483, -36485, -32655, -21938, -9035, -8054, 15069, -22154, -44474, -17807, 9999, 45537, 84460, 95132, 77906, 59091, 23291, 20135, 7808, 6937, 28746, 418, 18004, 28452, 913, -46885, -54281, -29717, -50125, -61090, -90585, -64729, -6558, -32835, -36435, -21424, -6632, -27259, -60386, -47394, 2089, 41331, 28693, -7314, -5184, -6794, 8424, 34555, 25920, 4479, 23909, 41504, 7147, -4479, -18849, 6413, 13891, 34091, 77557, 79171, 44373, 45975, 24236, 2336, 13533, 32583, 19113, 17165, 13171, 26826, 39009, 38184, 27406, -20103, -40894, -50376, -49391, -3244, 54189, 76981, 44524, 14158, 6762, 7570, 2998, 39526, 49998, 56849, 63007, 8632]
17782H632n962K1499j5653l1098j0663K0922j6136R668l8408R382L1262Q226R554
17769A225L5543K1562R747l2377o2458j0563Q525l0851k213o667L4980J5610p043
17756b4980P501J3479Q365k154m9861j1815O6791Q1697R620k4487l1343k5626
17744A7187l3444k0659L0230L2451K5649k7475m0190n829m4640J3631K5352J0500
17732a7237K714p562L8865R937J6615J0461K947k7796J216M9741n630n0939n0366
17719b7034k8178L3335m997n905j5820K1265k5392j1750L1216k3339M128J8997
17707c3474J4500J0827M483j7821L200N715j8569L0229Oj0788N737K2249O973
17694B3267K8955j5047P053J086K7318k5699l6610j5366l1477j0782O75J1153
$$ y = [8632, 2670, 24169, 8516, -22582, -33245, -12323, -28459, -18791, -57199, -47817, -16555, -8329, 1225, 36768, 58330, 68077, 35700, -26758, -37321, -28796, -59647, -61860, -68527, -33547, -17937, -24980, -17479, -4000, 4365, 2211, -47650, -59465, 7326, 89023, 98643, 74156, 42813, 17187, -16257, -36916, -6686, 25765, 51414, 23939, -16251, -22080, -66720, -53089, -27737, -17237, -14523, -22085, 16780, 26717, 43332, 53793, 56740, 28944, 30160, 79901, 74271, 23332, -27034, -55212, -21877, -26874, -32779, -48599, -27334, -52726, -64476, -33260, -56599, -52471, -33474, -18974, -8147, -3664, -21485, -18285, -12570, -31139, -910, -904, -11692, -5955, 16294, 23267, 52222, 37175, 44228, 45314, 72632, 46933, 10323, -5043, -36520, -47302, -46627, -35474]
17682c5474J7442J0209j462j097J0481j6421M961N5134J7961o8602m2217L6697
17670a2388K8787j3054k678j5410m5634j4853J4938N1940J0910K8167J6856J6134
17658F3715j2211k5842K3509n2463n8727J8395K4851L4160R490J9255j5315o428
17646B2389o4043L34R76n845K2167j1030k4588O414j3790K3492o989l7263L9114
17633d8662J5266n1159q3452K4317R7867N9891J7063n4134k9201l8356j7977J8256
17621i0281P5243L7826L274R469p709j8253o734q359J4994r136N384j9902L510
17608a0674q762l5093m136J3361K6597K0994j5177J2418o007j1186Q407k0194
17596b9452j2558J3332j2684Q049j5850j0472K4722J528j1737K4716q103J9709
$$ y = [-35474, -18032, -7823, -9285, -10382, 99, -16322, -11361, 43773, 61734, -6868, -49085, -12388, 16399, 3345, 667, -14743, -60377, -75230, -60292, -8352, 2558, 30725, 47581, 63715, 51504, 25662, 49171, -3292, -62019, -43624, -18773, 15387, 24877, 44132, 28817, 22389, -41654, -41320, -40344, -46189, -24022, -35052, -59640, -53226, -67016, -43524, -50513, -87776, -48662, -33396, -84555, -168007, -143690, -45823, 14068, 31131, -23003, -52204, -90560, -108537, -90281, -15038, 22788, 26062, 35531, 27822, 9569, 2835, -5524, 9470, 334, 5718, -14184, -10674, -19436, -54529, -58665, -45304, -18707, 2287, -12890, -472, -6479, -17665, -9258, -29452, -42010, -28678, -41362, -33313, -49163, -59635, -34913, -33385, -45122, -20406, -28509, -8800]
17584h800K7617p476k015o150J9223P405K9175j1147M829k9744j7444m67k5356
17571b0350o0593%K0033j2099L1470J4556r426J2777M4296K4236M247m5719m7012
17558d3584j5508O0502M5365J470l5879J8076q571j4785J6706j024K0683M1887
17546H5338l553k5862j4226j5307m5603R566J9843L5620j8020m0772j5202k7311
17534e5489o913L7639J3290q845k7751j2946Q1M039Q502O008M3529o258l4045
17521c9159k6531j5972K0243M3893M071k7991L990r321K0841J3208k5745Q2p972
17508d6363J6802M0375l0963j3029j6300r022J9047K0125M2551n1198p3593K6001
17496g5567M4650L4305K4068K6382J4603o114j5561o0415N583N0952J420m8854
$$ y = [-8800, 18817, 11341, 9326, 3176, 22399, 29804, 58979, 47832, 52661, 22917, 5473, 5006, -20350, -80943, -80943, -60910, -73009, -41539, -26983, -36409, -23632, 20664, 44900, 49147, 3428, -43584, -59092, 1410, 46775, 48245, 12366, 30442, 21871, 7086, 23792, 22768, 43451, 85338, 81785, 55923, 41697, 26390, -19213, -9647, 10196, 45816, 27796, -12976, -28178, -55489, -62402, -24763, -11473, -20318, -48069, -61015, -60934, -56895, -48393, -42385, 1144, -5114, -39159, -65690, -81662, -61419, -17526, -13455, -41446, -37456, -46777, -25936, -12728, -38473, -38391, -46363, -29561, 10814, -20149, -33178, -49478, -58500, -39453, -19328, 23223, -27975, -101568, -75567, -30917, 3388, 27456, 53838, 68441, 62327, 46766, -13649, -8066, 42886, 44306, -4548]
17484d548k501k345j6000j9624L2861M955l0669k8204j8556l2217K4404M0983
17472e1461N9017l1681j7649R010j493K0425k4180l8555L3552L8100O019l1437
17460c0333j2138L8347L5770J1744k0993r3022m5613L3295J8287L0422L7521J5227
17448A8514K3788L9564J8819K4307K7593N7811N9633P8427J50067J19268k7219
17437E90572j37703j08109m1823m8980q1002m5013K0658M372k9137N8471K1107
17426B03413k9582K4706K8870J2301p614Q53j6133o170k7997j0973n1969m4424
17414G5281m7132J1321l239l6915P053P149N0862O846j2707p311k6073J1800M8401
17401H5336K8142M993l314J85r995j6142p429k2034k2575m4787K1846N3329O1936
$$ y = [-4548, -7049, -9394, -25394, -45018, -12157, -7202, -37871, -66075, -84631, -116848, -92444, -51461, 7556, -24125, -41774, -32764, -34257, -13832, -38012, -76567, -43015, -4915, 1104, -30333, -42471, -4124, 31646, 43390, 22397, -70625, -116238, -82943, -64656, -34234, 3287, 18514, 42302, 81866, 100685, 124992, 152585, 210396, 270029, 348456, 498523, 617791, 590572, 452869, 344760, 302937, 253957, 172955, 127942, 148600, 152972, 123835, 182306, 203413, 173831, 198537, 227407, 239708, 232094, 232947, 216814, 210644, 182647, 171674, 119705, 75281, 28149, 39470, 36231, -684, 6369, 13518, 64380, 71226, 58519, 51208, 25135, 36935, 85336, 113478, 118471, 115157, 115342, 105347, 89205, 81776, 59742, 37167, -7620, 14226, 67555, 129491]
17388A29491N344J1214J5003l2502r302L4239J7840m069l072J0402l9188L989
17376A39389N915l037Q208L9791J5130m68J3720J2909k3946l047K6886P457m2716
17363A96191k0990L299L067l6022J3264k417j2505j4181n585n319P65L383j5925
17350A07025o596m0958m9472m1034K0333j6365K2530O2485l276M913l29K6295
17338H5551l6936j1812j0507k9381O912o68j7879J3321m782j4154k5026Q412K0866
17325a6083K1367j363j4955k9653m013n20K5385K1183l3390k2562L2909P071L765
17312a0859J7453k0915L291r462J0060J8653K6791J2035p563j910J9489j4712
17300D2351q51K7491m291N550K4130j7313o536k4798l8744k363J1231J6002J9438
$$ y = [129491, 134835, 146049, 161052, 128550, 119248, 153487, 171327, 167258, 164186, 174588, 135400, 139389, 145304, 142267, 150475, 190266, 205396, 204928, 218648, 231557, 207611, 204564, 231450, 238907, 196191, 175201, 178500, 181567, 145545, 158809, 156392, 143887, 129706, 124121, 118802, 119567, 122950, 107025, 100429, 59471, 9999, -31035, -10702, -27067, -4537, 57948, 54672, 59585, 59256, 85551, 48615, 36803, 26296, -3085, 3827, 3159, -14720, -1399, -6181, -20335, -45361, -36949, -16083, 5284, 3921, -11034, -40687, -44700, -45220, -19835, 1348, -32042, -54604, -21695, -14624, -10859, 6594, -14321, -11030, -20492, -10432, 8221, 35012, 47047, 39484, 37574, 57063, 42351, 41500, 68991, 64700, 70250, 94380, 77067, 70531, 45733, 6989, 4626, 15857, 31859, 51297]
17287E1297P195q708K1530J4099J4936k3620m0621m8887m9993M775K6803J7926
17275a3268k4402k7242O4593K6383K1648l6158j2069j3983p30j0493m4930k0788
17263i1439M8177K9441K6543m0876k5897M545K4873K0351r382j282j72K1013K4646
17250C0541J6349j6874l6967r924o440j0479M2620M0529k686j4749j6039J7459
17238C3340p187J1249K1839K6058O645R5J4433m3873j309l4737m6285k7393r171
17225e6296J4748O732l7059O350N3115o906k7295L1389N5679M3854o0926n6806
17213c3421l4348j8992L4739p169j0777L9371n659J7852J0094K8600k4729k2698
17201b7137J641j019M6451j8020L839L1827j7430o518k234j7996L4081M3637j8344
$$ y = [51297, 58492, 49784, 71314, 85413, 100349, 76729, 36108, -12779, -62772, -57997, -31194, -13268, -37670, -64912, -319, 26064, 47712, 11554, -515, -14498, -15228, -25721, -70651, -91439, -43262, -13821, 12722, -28154, -54051, -49506, -24633, -4282, -13664, -14946, -15118, 5895, 30541, 46890, 30016, -6951, -16875, -23315, -33794, 8826, 49355, 46669, 31920, 15881, 33340, 26153, 37402, 59241, 85299, 91944, 92039, 106472, 62599, 61290, 26553, -19732, -47125, -56296, -41548, -34816, -71875, -65525, -12410, -19316, -46611, -15222, 40457, 84311, 23385, -33421, -67769, -86761, -52022, -59191, -69968, -30597, -36256, -18404, -8310, 20290, -4439, -27137, -25496, -26515, 19936, 1916, 5755, 37582, 20152, 13634, 11400, -6596, 27485, 71122, 52778]
17188E2778l9314l7748J2149L5809L2178k073K3720N39m3970M295N1094K0042
17176A09499P227J501j5225R770K6091r917m1961k9759k8939N424J2258l0547
17164A5422M0784N0040k2805k9347j2609l3958J1129j8202k911L311m153L8697
17152C5398K7968j4493l819K0278o70o050j0945M809m7910j5565K1944L6904j4953
17139C2896j3317m354L4803K9342J5285K103J4719J5375l2065k5029j2874q208
17127D8676J350j7388M662J2631J8589j1296j5550j4869k2425n898J9358L3457
17115E1297O1560K219j4947Q354k653j6668Q689j2587P48n613n665j6515k0358
17102C7861O391K7026l9444L4047J4128K3591j9010k5462N549J0430J8868J5483
$$ y = [52778, 13464, -24284, -12135, 23674, 55852, 53779, 77499, 78038, 34068, 38363, 89457, 109499, 116726, 118227, 103002, 112772, 138863, 128946, 86985, 57226, 28287, 33711, 45969, 15422, 56206, 106246, 83441, 54094, 41485, 7527, 18656, 454, -2457, 854, -3299, 35398, 63366, 48873, 45054, 65332, 64662, 58612, 47667, 52476, 4566, -10999, 10945, 47849, 32896, 19579, 15225, 50028, 79370, 94655, 96758, 111477, 126852, 94787, 69758, 56884, 48676, 50026, 32638, 37300, 49931, 68520, 57224, 41674, 26805, 4380, -1518, 17840, 51297, 112857, 115076, 100129, 108483, 105830, 89162, 97851, 85264, 86012, 80399, 74734, 58219, 37861, 44252, 71278, 31834, 65881, 80009, 103600, 84590, 59128, 64677, 75107, 93975, 109458]
17090A09458n063J618k7608m4813m2402k3011l9445K060M7512j9485O310J1039
17078b3830L1594J4208q716j7712J2923k7438J7683L2615O573J2242J3987K6117
17066I0246M0759j7455k4282J592J3854P763M6227K2645k66l9719j3008q170q285
17053A11901k4960m8533O0354L8014l0466m1284k6360j3381L4462N7745J7480
17042A34972m8102k8873R692O112K7735K9840m434N879L1802J8876J6291l638
17030A96152j8456l1571m3565j7444Q027M975L1924M102o2631j0085N8335K2200
17018A41963j4221J4168k869N078r620K6935O048R405K1125J584Q741K5407j3144
17005B20600k2374j5868J5538K5046k336J9648J3515O050J605j7637J0931l58
$$ y = [109458, 104395, 106013, 78405, 33592, -8810, -31821, -71266, -69206, -21694, -41179, -34869, -23830, 7764, 21972, 13256, -4456, 8467, -18971, -1288, 31327, 37900, 50142, 64129, 90246, 131005, 113550, 89268, 90860, 104714, 112477, 158704, 181349, 181083, 141364, 128356, 120186, 111901, 86941, 38408, 98762, 136776, 106310, 65026, 38666, 25285, 59747, 117492, 134972, 86870, 57997, 67689, 73801, 101536, 131376, 126942, 132821, 164623, 183499, 199790, 196152, 177696, 146125, 102560, 85116, 93143, 98118, 130042, 134144, 71513, 61428, 119763, 141963, 127742, 141910, 139041, 144119, 134499, 161434, 167482, 176887, 198012, 199596, 208337, 233744, 220600, 198226, 182358, 197896, 222942, 220606, 240254, 253769, 259819, 261424, 243787, 254718, 254360]
16993B54360k4136j1927K2134N954l729N68Q621K2539L9065j315j8860M599O0229
16980C58102L6585K8860J0417k6852J0586L1899M2208L2438N889K2663P3581O1917
16968F88293R0141N4090O0281M3104M0460J00395O2935M6521J25969J78441K56970
16957A747600L47197L82033M64928N63502Q68373J148613J368025J345826R11758
16948I147855K97664k08754m99297n73312m30720j06736K80105P36408J297808
16939I941021K115241L258586N085182P879726J1463051J4342078J4226174R941151
16931G8252210L410369k602310o961215r654288j0481513r654964p718644n449769
16923B9139876l162861j078604N24042J182008P48994o04887k001547k967900
$$ y = [254360, 230224, 218297, 240431, 246385, 242656, 243224, 251845, 274384, 313449, 312134, 293274, 297873, 358102, 394687, 423547, 433964, 407112, 417698, 449597, 491805, 524243, 530132, 552795, 626376, 688293, 778434, 832524, 892805, 935909, 976369, 1076764, 1139699, 1186220, 1312189, 1490630, 1747600, 2094797, 2476830, 2941758, 3505260, 4373633, 5522246, 6890271, 8236097, 9147855, 9445519, 9236765, 8737468, 8164156, 7733436, 7626700, 7906805, 8643213, 9941021, 12056262, 15314848, 20400030, 28279756, 39742807, 54084885, 68311059, 78252210, 81662579, 79060269, 72099054, 62444766, 51963253, 42308289, 34589645, 29139876, 25977015, 24898411, 25422453, 26604461, 27353455, 26748568, 24747021, 21779121]
16915B1779121l302369l196178k802404k239417j622298j066500p26843n30521
16907F292591m71838m18144l08185k32716k01049j48958n8593j0551J24488J69593
16897D736638K62980M18085N83328Q34860J316376J971636K737512L430671L554768
16888A9846854K769022J300791p0246q03386q54914k07086R99261K805431N039967
16879C0825694P444420R623355J1156717J1003290P672614J230183n451347r873528
16871F3631398j1520316j1240482r773627p614578n355264l613382k375158j514178
16863A0624413r60262m90663o3959K85209N11271M39188l6001o27329r73777j071213
16853G636877j099774r89066q22338o39129n37679m15288l92238l71441k93337
$$ y = [21779121, 18476752, 15280574, 12478170, 10238753, 8616455, 7549955, 6823112, 6292591, 5820753, 5402609, 5094424, 4861708, 4660659, 4511701, 4453108, 4442557, 4567045, 4736638, 4999618, 5417703, 6001031, 6835891, 8152267, 10123903, 12861415, 16292086, 19846854, 22615876, 23916667, 23846421, 23043035, 22188121, 21981035, 22980296, 25785727, 30825694, 38270114, 47893469, 59050186, 70053476, 77726090, 78956273, 73504926, 63631398, 52111082, 40870600, 31096973, 23482395, 18127131, 14513749, 12138591, 10624413, 9664151, 9173488, 9109529, 9394738, 9906009, 10345197, 10309196, 9681867, 8708090, 7636877, 6537103, 5548037, 4725699, 4086570, 3548891, 3133603, 2741365, 2369924, 2076587]
16844B076587k49266k20863j45536r2579o1341r1780p8693j28545m3753q1275
16834H82956m6689k1220l5530m0312Q61k0554r6655n5263m6032j2848J6768n9380
16822D66102n6916k3474j209q260Q156k3674l444k8921l6937n6860k833p199P576
16809B32107K2933N668M556j1488J4091J3105k4568m0241K7178m4661j2121j4032
16797A72527K5543J8874k0486J78K3002R626q439m8512o0652o853k8306j8798
16785E7704J6996O314P407q959L6857K3994j5408P694n687l2299o1543J6172k3796
16772B5446J4735J85J6856k1654N736K0909K2402j9090M0227J1112J2104q406
16760A20562L562j0240j6658J8013p822l3255j4974K9723K4573K6704j8505k2714
$$ y = [2076587, 1827321, 1606458, 1460922, 1368343, 1307002, 1215222, 1136529, 1007984, 964231, 882956, 836267, 815047, 779517, 739205, 740066, 719512, 622857, 567594, 521562, 508714, 525482, 466102, 409186, 385712, 384503, 376243, 384399, 360725, 357281, 328360, 291423, 234563, 231730, 224531, 232107, 255040, 260708, 265264, 253776, 267867, 280972, 256404, 216163, 243341, 198680, 186559, 172527, 198070, 216944, 196458, 196636, 219638, 229264, 220825, 172313, 111661, 104808, 76502, 57704, 74700, 81014, 88421, 79462, 116319, 140313, 124905, 132599, 126912, 94613, 33070, 49242, 25446, 40181, 40366, 57222, 35568, 41304, 62213, 84615, 65525, 105752, 116864, 128968, 120562, 124124, 113884, 97226, 115239, 107417, 74162, 59188, 88911, 113484, 140188, 121683, 98969]
16748I8969k1427K491k954j9843J0396J2242J8429q52j2319o084J2879j9285j1582
16735F1060p240l3894O414M8357K0784k6653k3432J6317J1127k6207L4123l489
16723G7267o5994j7366K7839J3671J7305l1966n7379M677J4642M9223J7369m4974
16711D314n1525L6090M2313N651J4620r196k3781r173k3998J1502N7052j5635
16699C8234k1740j5082P816N965j8592J2203J6083K95m0138N4240K2378l8310
16687B3352p602n743K4469k0412K1779J8249p8818l4103N3281Q606q052K4947
16675A9953K4358p0528J1093j4244m2169j1336L2708j2884j3434K1257M2039J7100
16663C913k7181o2883j3065Q3121M9932n52j0803J2408K5702Q438p458m5435n3197
$$ y = [98969, 77542, 80033, 77079, 57236, 67632, 79874, 98303, 97451, 85132, 79048, 91927, 72642, 61060, 53820, 19926, 26340, 74697, 95481, 68828, 45396, 61713, 72840, 46633, 80756, 77267, 11273, -6093, 21746, 35417, 52722, 20756, -36623, -31946, -17304, 31919, 49288, 4314, -47211, -11121, 31192, 36843, 51463, 42267, 18486, 9313, -14685, -3183, 53869, 38234, 16494, 1412, 9228, 15193, -3399, 8804, 24887, 25182, -14956, 39284, 61662, 23352, 15750, 10007, 34476, 14064, 35843, 54092, -24726, -58829, -5548, 3058, -4994, 19953, 44311, -26217, -15124, -29368, -71537, -82873, -50165, -63049, -76483, -55226, -13187, 3913, -23268, -86151, -99216, -16095, 33837, 33285, 22482, 34890, 60592, 69030, 61572, 16137, -37060]
16650c7060k83M8767J8025J0188j4964j5795P393R748N660j3050l4224j3112j212
16637b9919R588Q09k0121J9502J8828k6889k3169J6282M8249K466p861j4910q499
16624a5644p558q658m030K3442J4636N307l8566r475K3010K1599L3131K0710k0716
16611C7188k7288j421l64j8211P084J3517K1756J7848J3745r242k7175P509M927
16598C9873O38K7954J6725m4586o208K7153m1288Q592k376R447r281o591K1571
16585D1623K2486R182j1729k0579K908j6171M292O8155J3856m1038n1261j5790
16573E934J1710R692K437J086K2357r741L4673m9496l2570o638n216M2221L3824
16560F0273o4198l5933L5035P153k865l9878p675L459N4313K774l509Q087R7k6183
$$ y = [-37060, -37343, 11424, 29449, 39637, 24673, 8878, 16271, 26019, 31679, 18629, -15595, -28707, -29919, -20331, -19522, -39643, -20141, -1313, -28202, -51371, -35089, 13160, 15626, 7765, -7145, -15644, -23202, -31860, -35890, -12448, 2188, 7495, -31071, -40546, -17536, 4063, 37194, 57904, 37188, 9900, 8479, 8115, -10096, -3012, 10505, 32261, 50109, 63854, 54612, 27437, 34946, 39873, 40511, 68465, 85190, 40604, 34396, 61549, 20261, 28853, 26477, 35924, 26643, 20052, 41623, 64109, 73291, 61562, 40983, 43891, 27720, 32012, 100167, 114023, 72985, 21724, 5934, 17644, 27336, 29773, 30859, 53216, 43475, 78148, 28652, -3918, -10556, -15772, 26449, 60273, -3925, -39858, -4823, 2330, -535, -40413, -48088, -44629, 9684, 12458, 8949, 17036, 17133, -9050]
16546i050l5102K1915K0963P516J1167J1082j4401n5840P107K466J0413K711L0677
16533A1624J8242j5486J7066M641N475J2141k8201l5895n4571L4847O602m9283
16521g2798j6803N1707K6856J9067N7762L0393k1965m9272q108R359J8385J1247
16509E5830m6368k7541o38j5970r762K6281k3388r634M6886K3063l9787k8682
16497d9710M6891J6577m8850l2984M532Q014R928O3268m5156j837J2936J5340
16485a051K1196K897K9714L2503l0976k0711k6166K439l2069J2424j9359k0482
16473d9641r890M728N2524L1052K4652k7060J8798J3519R434j3948l7280k4902
16461h014J1503O790m9256j7682K9028J9207j5520J4246k1577n359K8139J1983
$$ y = [-9050, -44152, -22237, -1274, 6242, 17409, 28491, 14090, -41750, -34643, -32177, -21764, -19053, 11624, 29866, 14380, 31446, 36087, 41562, 53703, 25502, -10393, -64964, -30117, -23515, -72798, -89601, -37894, -11038, 8029, 65791, 96184, 74219, 24947, 16839, 26198, 44583, 55830, 9462, -18079, -18717, -34687, -44449, -18168, -41556, -51190, -4304, 18759, -21028, -49710, -2819, 13758, -35092, -68076, -63544, -55530, -45602, 17666, -27490, -29327, -16391, -1051, 20145, 23042, 52756, 85259, 54283, 33572, 7406, 9845, -22224, -9800, -29159, -49641, -59531, -54803, -2279, 28773, 53425, 26365, 45163, 58682, 68116, 54168, 16888, -8014, 3489, 10279, -38977, -56659, -27631, -8424, -23944, -9698, -31275, -36634, -8495, 3488]
16449C488k5070k143j3574l9253K0982K9081N4445K627o8738K8603M3737M4960
16437G9145L2681K1514J1631o800M118k9178M9756M7775J2692j8908o4124m8605
16425I1697j9189L1324N2126j2201L8231K2923j3847m553j8991m2051Q2j6720
16413A08831J2271M7754l6189n0118k5281r445L0095P0J225K764K6893J2727n8333
16400F3264J9708j06m1098m4269j9089M0065K8340J8653n10p267r973j2801l6550
16387a633k8760M9367N2699L9984M2564N0930J1140k2921n4655J1833L8990K9752
16375B19290j6125m6510k9081p217J2946M5979k2065k0163j4370q365K071n254
16363A11136J3175N7352P783K4965J5857k670O289m0295n4635m4373O572j1687
$$ y = [3488, -21582, -23725, -37299, -76552, -55570, -26489, 27956, 30583, -38155, -9552, 34185, 79145, 111826, 133340, 144971, 138171, 142289, 113111, 162867, 210642, 223334, 204426, 140302, 91697, 72508, 103832, 155958, 143757, 181988, 204911, 191064, 186511, 167520, 125469, 125551, 108831, 121102, 168856, 132667, 82549, 57268, 47823, 77918, 77988, 79213, 81977, 108870, 121597, 63264, 82972, 82866, 41768, -2501, -21590, 18475, 46815, 65468, 64958, 57691, 47718, 34917, -1633, -30393, 18974, 71673, 111657, 154221, 205151, 216291, 193370, 138715, 150548, 189538, 219290, 203165, 156655, 127574, 120357, 133303, 179282, 157217, 137054, 122684, 114319, 116390, 111136, 124311, 181663, 189446, 214411, 230268, 227598, 233887, 193592, 138957, 94584, 101156, 89469]
16351H9469m1430k1809k4364J1849L0066J0126j4894o774r352l329l4690k3388
16339c8520J2602L591J8248K3070L1060J1107n3963J5628Q848l475m447O324M357
16326C4430j7795J606l0224m023J274Q68J4265L5753k3540j4331o348o2226k157
16313g2448j2148J2100K1509L5993j2612o148O700k3459k1668L9526L4370M848
16301F563m09K4284o22J3519J1824m1689k4982J4288L6775k6867l3308m9929J9980
16288e0573L0100L095l883k6760Q999N0682J408o205J5719j8909k2505K513l4017
16275e0336k8570J58K2861K4866J6673M849k9061j3458J6331K3788R232P302M2687
16262D7322j4884m9371M3L1220j1241j2714j6932k8568J866O5827J7095r285j317
$$ y = [89469, 48039, 26230, 1866, 13715, 43781, 53907, 39013, 32239, 22887, 19558, -15132, -38520, -25918, -22327, -4079, 18991, 50051, 61158, 7195, 22823, 31671, 28196, 23749, 30073, 34430, 16635, 18241, -11983, -16006, -14732, -13864, 401, 36154, 12614, -1717, -8065, -70291, -72448, -84596, -72496, -50987, -14994, -27606, -33754, -27054, -50513, -72181, -32655, 1715, 6563, 6154, 30438, 29816, 43335, 55159, 13470, -11512, 2776, 39551, 12684, -20624, -70553, -50573, -20473, -17378, -21261, -48021, -39022, 11660, 13068, 6863, 22582, 3673, -18832, -16319, -50336, -78906, -78748, -55887, -31021, -14348, -9499, -38560, -52018, -35687, -11899, -2667, 4635, 47322, 32438, -16933, -16890, 14330, 3089, -9625, -26557, -55125, -53259, 12568, 29663, 20378, 19061]
16249A9061J573n6684j4073K2083R654k0446r611k3674j0766j9137M4334O4571
16237F885M3759k7778n313r262K111R464M302j7216l9920j9504m779P796j2149
16224f1604k5209p278K0877K7458J0834k3595j3493O729K278K1675N053m591l1823
16211g2689L9237L2030Q442j8904L446j2312K5416O1921L6315J3114k6995k7240
16199F1781m2439j3837J0044m7200J1807J6856j2457O760R659K2594J4877k1616
16187A6829K2007L1210m0651k6085j8666L2763j4092q508m096j9968k469j637
16175c3363M2370L5127n4563j1842J2935j5699l2103l5883M610N4516K0877j3997
16163b7015r636J133J990Q336j2380m525J9681Q334m21N886j0512L1126J9772
$$ y = [19061, 20634, -36050, -50123, -28040, -18386, -38832, -48443, -72117, -82883, -102020, -57686, 6885, 50644, 22866, 17553, 8291, 10402, 19866, 24168, 6952, -32968, -52472, -57251, -49455, -61604, -86813, -94091, -73214, -45756, -34922, -58517, -72010, -65281, -63003, -41328, -36275, -40866, -72689, -33452, -1422, 7020, -11884, -8438, -20750, 4666, 66587, 102902, 116016, 89021, 61781, 19342, 5505, 15549, -31651, -19844, -2988, -15445, -8685, 974, 23568, 38445, 16829, 38836, 70046, 29395, 3310, -15356, 17407, 3315, -5193, -9289, -29257, -31726, -33363, 9007, 44134, -10429, -22271, -9336, -25035, -57138, -93021, -88411, -33895, -13018, -27015, -36651, -35518, -33528, -25192, -37572, -42097, -22416, -14082, -14503, -8617, -19129, 11997, 31769]
16150C1769J4199l5389j9489j423K3519R883L4007j7168l47q320j8399k2319Q704
16137g73J4439k6250o2166K4047J6447j4550L2345M3402p081r777k8654j2980
16125c1551j9325p04P940j484l7011p9L6584J1927n738J923j2396Q175K4805J6518
16111d16J5673J2256q144j7330P923J8439l0516j9450K3945J421n3776o6620M768
16098a11827L7139Q339k394o211M3200O706O159j5071Q343q726P37p34M778j5685
16084d5247N0561L6679p439l0683o004R713K6717N816m85k5303j2495k2372m1577
16071f2119j9788N0235N2500k4501m2090j612O775m4193j5785k61L653K3731R220
16058f4235J1958K470J9192K4922K7031O708M60l4974m0083J8297j6174j046J1668
$$ y = [31769, 45968, 10579, -8910, -10333, 13186, 23069, 57076, 39908, 39561, 31241, 12842, -9477, -773, 13666, -12584, -74750, -50703, -34256, -48806, -16461, 26941, 19860, 10083, -18571, -31551, -50876, -51580, -43640, -45124, -82135, -82214, -45630, -33703, -39441, -37518, -49914, -41739, -16934, -416, 15257, 27513, 19369, 2039, 9962, 28401, -2115, -21565, 2380, 3801, -49975, -116595, -111827, -74688, -66349, -68743, -74954, -31754, -25048, -18889, -33960, -25617, -34343, -33606, -34340, -29562, -45247, 5314, 41993, 34554, 3871, -2133, 7580, 34297, 40113, 39628, 14325, 1830, -20542, -62119, -81907, -31672, 20828, -3673, -45763, -47375, -40600, -84793, -100578, -100839, -97186, -73455, -64235, -52277, -49807, -30615, -5693, 21338, 28046, 28506, -6468, -46551, -28254, -44428, -45474, -33806]
16045c3806J535q370J6959m462L9565N0214N2377k2630n8706n3932J1080o538
16033a6714j6452j389K8991j316l0221j1821O050J644m1304j4257K7783K8013
16021d0993Q738k4598j5797J1631M8336q62j9873M2731K496m7167l904M4274j3604
16008h592l4555o177j7570L4087J7599J1575L0282l3762m0877o821K3353J0476
15996b0982L5599J0352n2168n3308k6768K796K9671J7942P145M3754j0526l0094
15984d6587J7651j3393N275J3808J2122k1837k644N7350k3140l4834L1251l1098
15972c6076k5485J0215j9474K2621M8261K2266k3806j2439J285k8259J4687J4032
15960a2172k9763k5670J7483J7271K3327P053K1463r373k7794J3517K149L910
$$ y = [-33806, -32271, -40641, -23682, -28144, 11421, 61635, 114012, 91382, 32676, -21256, -10176, -16714, -33166, -34555, -5564, -6880, -37101, -48922, -42872, -41228, -82532, -96789, -69006, -40993, -32255, -56853, -72650, -61019, -12683, -13545, -33418, 9313, 11809, -35358, -39262, 5012, -8592, -43147, -49324, -66894, -32807, -15208, -3633, 26649, -7113, -47990, -54811, -31458, -20982, 14617, 24969, -27199, -80507, -107275, -104479, -74808, -56866, -49721, -5967, -16493, -46587, -28936, -42329, -37054, -23246, -11124, -32961, -35605, 21745, -1395, -36229, -4978, -36076, -61561, -51346, -70820, -48199, 62, 22328, -1478, -13917, -12632, -40891, -26204, -12172, -41935, -67605, -50122, -32851, -9524, -2471, 18992, 9619, -18175, -4658, -2509, 1401]
15948A401K3544J8110L2827J6384m6726k4215J0231N118l5292o3844K3444J5139
15936b3879M21j5071N999j6515k800o006l6631n218K3577M0196P640O86L1195
15923C594L1050m129N62J82J5860k1028l4677J1991R564N440l7358l905R560L9122
15909B5828L6502j9476m6915n5832j7391P174O1318J3496J1267O887l257J507
15897B1108j0157k408j3791J951K3963K4148k2157r272k7264O833L6889p907n0593
15884b8657o752K0815l63k3720k6932j1659L4918J6131K253j1886K4416n581j6354
15871c3371J1612j5860J5137J6824k8047j8200J3490N7179L9214j3696r742j7634
15859A6906o519K8447J8637m1504m4696K2853K8642J7146K560P737R07n0845k8587
$$ y = [1401, 24945, 43055, 75882, 92266, 45540, 21325, 31556, 36674, 1382, -62462, -39018, -23879, -23458, -38529, -32530, -49045, -51845, -57851, -94482, -99700, -76123, -35927, -28287, -27601, 3594, 34644, 30515, 31077, 31259, 47119, 26091, -8586, 3405, 12969, 18409, -18949, -22854, -13294, 25828, 62330, 42854, -4061, -59893, -77284, -70110, -8792, 4704, 15971, 22858, 19601, 21108, 10951, 8543, -5248, -3297, 20666, 44814, 22657, 13385, -13879, -7046, 29843, 21936, -28657, -35409, -14594, -14957, -38677, -65609, -77268, -42350, -26219, -23966, -35852, -11436, -17017, -33371, -21759, -37619, -22482, -5658, -33705, -51905, -38415, 18764, 57978, 44282, 34540, 16906, 10387, 38834, 57471, 15967, -28729, -5876, 22766, 39912, 42472, 50209, 51116, 271, -28316]
15846b8316K7514M187J5648J0781K300l0129m471J6644L6909K8119l3439o072
15834C9675N938J4930o1586o260J9051P574M626k2107J8658k3650l4815k775l2233
15821g2974j1763J3372J6359j0816K0089J4726k6503M531o621K0092L135N878
15809c0495n183J5769j895n583m729K0966K0655K1523J3981K06l2796m6028n4620
15796h8229K3200J9589J1592l004L1413K6192l332j4968K9425j2807j2947j0673
15784d549q385K424K0390j5953j3849l154K0306L4932L943k2682J1919k1784P019
15771A0577l8112l5249J2808L9822L0528j5958J1001J1858k4799p197k4200J0839
15759a8082J5012N716k3872l0033L3350M6981j4363k5583M504p527j4224j1232
$$ y = [-28316, -802, 3385, 19033, 29814, 32114, 1985, -2486, 14158, 51067, 79186, 45747, 39675, 45613, 60543, -1043, -7303, 11748, 19322, 23948, 1841, 20499, -3151, -37966, -40741, -72974, -84737, -71365, -55006, -65822, -45733, -31007, -57510, -52979, -59600, -39508, -36373, -30495, -35678, -19909, -21804, -27387, -32116, -11150, 9505, 31028, 45009, 45215, 12419, -33609, -88229, -65029, -45440, -33848, -36852, -5439, 20753, 17421, 2453, 31878, 19071, 6124, -4549, -12934, -10510, 9880, -6073, -19922, -23076, -2770, 32162, 36105, 13423, 25342, 3558, 10577, -27535, -62784, -49976, -10154, 20374, 4416, 15417, 27275, 2476, -4721, -28921, -18082, -3070, 2646, -21226, -51259, -17909, 29072, 14709, -10874, -6370, -13897, -28121, -39353]
15747c9353J5661J9457j5060M860J5656J3502j2735m375m34k010o210K641j27
15734h527K1827m4818O962O2975k4714l2135l4490N882M8722q737j9945k5937
15722e2935N499K8485j6169l8901L0557j6614k7816j018L5774J2239L9801K9688
15710B8590j9653q168l2574l6440J2480M9681j454K692l8726j1210l2960K3470
15698f4272L1177L4848J3970l8885r427K4592J0188J5778J70j2851k2063m166
15686b0941n3949J6954O5052J8669k9238j3754J2359R893m4724l647K1689J779
15674a9858j3310j7233n0557j794K2173l764K2618J1175P141P039K4049m98j1253
15661b4072j7533p430n090J1374L4220P918k16K0347j164o0469j4707l873k100
$$ y = [-39353, -23692, -4235, -19295, -14435, 1221, 14723, 1988, -2387, -2821, -4831, -11041, -8400, -8527, 13300, -31518, -24556, 38419, 13705, -18430, -52920, -47038, 1684, -7053, -26998, -52935, -47436, -18951, -35120, -74021, -43464, -60078, -87894, -88912, -53138, -40899, -1098, 28590, 8937, 769, -31805, -68245, -55765, -6084, -7538, -4846, -43572, -54782, -87742, -64272, -33095, 1753, 15723, -23162, -32589, -7997, 2191, 17969, 18139, 5288, -16775, -20941, -74890, -57936, 7116, 25785, -3453, -17207, -4848, 5045, -39679, -43326, -21637, -19858, -33168, -50401, -100958, -102752, -80579, -84343, -61725, -50550, -43409, -36370, -12321, -12819, -24072, -41605, -49035, -54125, -42751, -8531, -613, -829, 19518, 18354, -42115, -56822, -60695, -62795]
15648f2795L1076M440j9209O961k860K5652L6962J6579N448j4982j2404L3320
15636D8188K0644q94M497k4345m9060j7215L2484L3163J3977l5199j211n035K1466
15623D1460m1883J408r068O7422K1330m3848n0959k0186p745J3956P421K4081
15611C389q338m7282j2611M910K31K8495L4603J367N569r116j2494n700O50l5602
15597e1929K4379N9189m4052p0654J4293L7469N8988J8849J753J2221j0227m1347
15585H932l2068k442m9N5435Q877k0533k6590m1175j511n214k8694j0824Q841
15572h7015R198J6488K506N5186L8706n677l4784l6991K3199L0118j0360m4856
15560d4282j6492L2494K4015o439j3178j391k94j1450j458L1888j1432j8226j3720
$$ y = [-62795, -31719, -27279, -46488, -39527, -42387, -16735, 20227, 36806, 42254, 27272, 14868, 48188, 68832, 67938, 72435, 48090, -970, -18185, 14299, 47462, 61439, 26240, 25029, 19994, 41460, -423, 985, -8083, 59339, 80669, 36821, -14138, -34324, -42069, -28113, -20692, 3389, -4949, -52231, -64842, -59932, -59701, -31206, 3397, 4764, 10333, 1217, -11277, -16977, -16327, -51929, -27550, 31639, -12413, -83067, -68774, -31305, 27683, 46532, 48285, 60506, 50279, 8932, -23136, -25578, -25627, 29808, 38685, 18152, -8438, -49613, -51124, -56338, -85032, -95856, -87015, -77817, -61329, -58823, -3637, 35069, 29392, -5392, -42383, -19184, 10934, 574, -44282, -60774, -28280, -4265, -10704, -23882, -25273, -25567, -37017, -38475, -6587, -18019, -36245, -49965]
15547d9965J2087J9479k301j8453K234K9943R801m4385o1205K9485L8619j7082
15535e1743r030L5877J6633j2821j2450j1229j8103k0585j590K3147K8287J5522
15523a8085l12N707K4262k0525l0337k8373j3236L0919J4877J2994K6060j1127
15511g176j7775L6401L056j9904L627L9955l683l1456k0375L220L3707L3486j9875
15498C3208j3364J465J4593K3797j2238k2768j7335o114j6305J0740l173q687
15486a6181J7977J4993k0499j5787K709N0944n2348l9666J431J0133J9264Q460
15474a8570m6046m1990N3370J7327n398M0135K78k5354k4364K0749q79k7570N668
15461e2644J9773k0319j1323p134J9592M732R503j93J643L6581k958J0581k1945
$$ y = [-49965, -37878, -18399, -20700, -39153, -36919, -6976, 2825, -41560, -102765, -73280, -34661, -51743, -60773, -24896, -8263, -21084, -33534, -44763, -62866, -83451, -85041, -61894, -33607, -18085, -18397, -12690, 11572, -8953, -39290, -67663, -80899, -49980, -35103, -22109, 3951, -7176, -24951, 11450, 14506, -5398, -1771, 38184, 34501, 3045, -17330, -14110, 19597, 53083, 33208, 19844, 21309, 35902, 59699, 47461, 24693, 7358, 1244, -15061, -4321, -7494, -16181, 1796, 16789, -3710, -19497, -16788, 34156, -18192, -57858, -56427, -46294, -27030, -18570, -64616, -106606, -53236, -35909, -41307, -1172, -894, -26248, -50612, -29863, -30742, -58312, -52644, -32871, -53190, -64513, -71647, -52055, -47323, -37820, -38013, -36370, 211, -2747, 7834, -14111]
15448a4111l9511j6929k847P9121L4604j6840l0084n978K1798N117j809j6688
15436d157l814J2887r312m001j1751m5964L6250K3029m1650J1253J5558J4002
15424g670K7911J0740l0719p521O941J2459q469o443n073R971l5491l201M0800
15411D235L0919j7678M5504n633K0457k0031m0987j7227J9322P677l8416l3824
15399d5682J2266L9963K5771j3967j830j1423k1198p563j8933J1161k3038M7044
15387g429L3728j9527L017k1472j3451q136O811O2576p25k8986l476k0392k9795
15374d7257N103N0951M713o9142k9479K6306N9879J0926J2434P199j3200m3384
15362b4951l8555k4359j7909J5931K4803k407J4798J2913K8048o74R083j3044
$$ y = [-14111, -53622, -70551, -73398, 5723, 40327, 23487, -6597, -12575, 9223, 14340, 12531, -4157, -7971, 4916, -4396, -8397, -20148, -66112, -29862, -6833, -48483, -37230, -21672, -7670, 20241, 30981, 262, -7259, -318, 12141, 3672, -2771, -7844, 2127, -33364, -36565, 4235, 35154, 17476, 62980, 57347, 77804, 57773, 16786, -441, 18881, 26558, -11858, -45682, -33416, 6547, 32318, 18351, 16521, 5098, -16100, -23663, -42596, -31435, -54473, -7429, 26299, 6772, 9789, -11683, -25134, -33270, -26459, 36117, 35392, 6406, 2930, -17462, -47257, -42154, 8797, 13510, -55632, -85111, -58805, 1074, 12000, 24434, 31633, 18433, -24951, -63506, -87865, -105774, -89843, -65040, -67447, -52649, -39736, -11688, -12362, -3279, -16323]
15350a6323l777q595q75k1386K2100K3116R781k6401K886K0291j0734q89K010
15337h796j3709L0760n92j3953l3567O11K9514K7180k4360o910K533o078j3428
15324c0795K1144k4068n395L5370L3380N328K212j0781m2874k0543M7399L1745
15312D2122k25N092q153L5049P068m1933J7129K6774k6770k0786p6r318j4813
15299A1160m7382l3604L2598j5526Q06J9373L62J0652P641m1281r365k978J7587
15286d9957J6040M282K5638q444K9323K04j8184l8467q375M8544P000J8567L8619
15273F4790r095R347j4044k3004j6586J3908r448l1446K6156j067o4237L6049
15261a8677Q30J1502L595O501J8425J1472r202j3641J2346k1929l0863j0130m310
$$ y = [-16323, -20100, -28695, -29570, -50956, -28856, -5740, 4041, -22360, -19474, 817, -9917, -10806, -8796, -22505, 8255, 7663, -6290, -39857, -39246, -9732, 17448, -6912, -13822, -11289, -17367, -30795, -9651, -33719, -39114, -3744, 29636, 34964, 37176, 26395, -16479, -37022, 10377, 42122, 41897, 46989, 38836, 73885, 80953, 39020, 56149, 82923, 56153, 35367, 35291, 25973, 11160, -36222, -69826, -37228, -52754, -51948, -32575, -32213, -21561, -13920, -55201, -64566, -67544, -49957, -33917, -29635, -3997, -12441, 16882, 17086, -1098, -39565, -47940, 604, 7604, 26171, 64790, 55695, 65042, 50998, 27994, 11408, 25316, 15868, -15578, 10578, 9511, -54726, -18677, -17847, -6345, -2750, 3751, 22176, 33648, 24446, 10805, 23151, 1222, -29641, -39771, -44081]
15248d4081K5198N7110J2495M3430L278n8531j9803O799L0703k532k0626j2774
15236B0666p200p419j7665k1101J5594r198k1184O781J0535j6705K809K2345L1157
15223I415O398J8848N985j3118j640Q968n2136m824K9576K0731L08K7982p939
15210D8554J3258j4252j8394m3396J1280O871M32K4229r950l4439n6436J6163
15198e6080M4214K9892q429J7839o278j5865j5433m1713K757K545J8515J0008
15186a8028M0325J9708l5447k0726M927o609j3431J1477J8405K4137j2674l7781
15174b5717j4760J6719R887J916n581J7458r723K1740N972K217j7962j4927J6014
15161C253l3169r932j0062j5059J7379L1079J7318j170R613M0226m2862k2410
$$ y = [-44081, -18883, 38227, 50722, 94152, 97430, 38899, 19096, 25895, 56598, 54066, 33440, 20666, 13466, 6047, -11618, -32719, -17125, -26323, -47507, -40726, -30191, -46896, -44087, -21742, 9415, 15813, 34661, 40646, 27528, 25888, 34856, -17280, -22104, 7472, 28203, 28511, 56493, 48554, 61812, 47560, 29166, -14230, -2950, 3921, 4353, 28582, 18632, -15807, -72243, -56080, -11866, 18026, 9597, 27436, 21158, 5293, -10140, -51853, -49096, -46551, -28036, -18028, 22297, 42005, 6558, -14168, -9241, -15850, -29281, -17804, 601, 24738, 12064, -25717, -40477, -23758, -13871, -11955, -17536, -78, -9801, 11939, 17911, 20128, 2166, -12761, 3253, -29916, -39848, -49910, -64969, -47590, -16511, 807, -363, 9250, 49476, 6614, -15796]
15149a5796r820L5031L7244k2544k2292J0482k5943P271R389M864k3031k4654
15137c9799j1654K5511L5684m676J3960l1666N857j007K0320M9024P46m3735q694
15124I871L0413q947l3512n0630m0205o048M1850M6106l3539k4216K0897L8750
15112i210J5793K3608M5110J0137j2918k1571p4945N718J307l2274k3L742R121
15099c6405j7292O337J1278K8401J675P535j5707r036J3232j5071K1382K4148
15087B0477K3049M4571r644l0419m3080K2696R479l7946k7449M1293Q998j3725
15075H300j5421J2776J7113k4092r774m5849k4451M0650O8110M2454n4104k2290
15063f578j5530L605k3655o209K1626L770m0529k913M6990L3573K8504j7092l972
$$ y = [-15796, -25616, 9415, 46659, 24115, 1823, 12305, -13638, -6367, 3022, 7886, -15145, -39799, -51453, -25942, 9742, 5066, 19026, -12640, -6783, -7790, 12530, 61554, 62300, 18565, 9871, 40284, 31337, -2175, -52805, -93010, -99058, -57208, -11102, -44641, -68857, -47960, -9210, 6583, 30191, 75301, 85438, 72520, 50949, -23996, -18278, -16971, -49245, -49268, -45526, -36405, -53697, -47360, -36082, -7681, -6006, 1529, -14178, -23214, -9982, -25053, -3671, 20477, 43526, 88097, 78453, 48034, 4954, 27650, 37129, -817, -28266, 13027, 22025, 8300, -7121, 5655, 22768, -1324, -11098, -56947, -81398, -40748, 27362, 69816, 15712, -6578, -22108, -18503, -42158, -48367, -26741, -22971, -63500, -66413, -19423, 14150, 42654, 25562, 21590]
15050B1590L697m2772j904K3893j9986j4430j3788k6590J7226N2986K7073J2763
15038C9758K6723r209j5831l1194j7362k8112j3881M2829L9758n729J0557r191
15026B9116k0893j3763J2521j9412k5561L1670P541M144J7695O567k4905p604
15014b884J4701j7580k8801J2415J8636N417J2677K5677P049n9788Q695O6840
15002F3054k0433l3841m950k2982l2517K994j9312J4203l192L346k1030M6247
14990b8413K3959K0169l1922n637o420J3902J5949J5641J6909Q363n3134l2916
14978d3550K0324M8067M9183l2265j5462J5549K6031r247j3312j2754K2430K9207
14966H4201m6411Q777j6350J0841J9664R700m7262k0922j1993n566Q332k517R298
$$ y = [21590, 25287, -17485, -19389, 4504, -15482, -29912, -43700, -70290, -53064, -78, 26995, 39758, 66481, 57272, 41441, 10247, -7115, -35227, -49108, -6279, 33479, 27750, 38307, 29116, 8223, -5540, 6981, -12431, -37992, -6322, 1219, 5363, 23058, 29625, 4720, -2884, 11817, -5763, -34564, -22149, -3513, 1904, 14581, 40258, 47307, -12481, -3786, 63054, 42621, 8780, 3830, -19152, -51669, -48675, -67987, -53784, -56976, -53630, -74660, -28413, -4454, 15715, -16207, -21844, -28264, -14362, 1587, 17228, 34137, 42500, -10634, -43550, -23226, 24841, 74024, 41759, 26297, 41846, 67877, 58630, 45318, 32564, 54994, 84201, 37790, 46567, 30217, 41058, 60722, 70422, 23160, 2238, -9755, -15321, -6989, -9506, -208]
14953b08K0250l0252j6199K342K2611K8570k3357n9759j3607N890L3211Q263k1129
14940d3374m218M6031m428j0089k5476k5732L1060M5086J3151o77l1832p299J9941
14927B144J3118l7968k4472J7007M7666o546L4336k9966j9705K2163J8035M873
14915D0685l4160J2265j1873j5544n499n6510k8603K1292M903k2675J9102n041
14903h1658p301M4584N0380M0323n654j9034J099j3379m5067o72J3643M8579R792
14890C5635J8287N4811j0935k8832k3434p349Q580K3729m3708j5493M8732M623
14878F4646k3866R967K4722k7021m5160j5923k472j024p264k0120k8070K5880
14866d5705M4274L8124O359o1409k6950J5066k1391k1585J871J4293L265J7434
$$ y = [-208, 20042, -10210, -26409, -24067, -1456, 27114, 3757, -56002, -69609, -63719, -30508, -22245, -43374, -47592, -1561, -5989, -16078, -41554, -67286, -36226, 8860, 22011, 21334, -10498, -17797, 2144, 15262, -22706, -47178, -30171, 17495, 10949, 45285, 15319, -4386, 17777, 35812, 40685, 6525, 18790, 6917, -8627, -14126, -70636, -99239, -77947, -73044, -95719, -76617, -81658, -88959, -44375, 6005, 46328, 40674, 21640, 22739, 9360, -35707, -36379, -22736, 25843, 35635, 53922, 108733, 97798, 68966, 45532, 38183, 46763, 70492, 26784, 11291, 60023, 64646, 40780, 50747, 75469, 48448, 3288, -12635, -15107, -16131, -23395, -43515, -71585, -45705, -1431, 36693, 43052, -18357, -45307, -30241, -51632, -73217, -71346, -57053, -53788, -36354]
14854c6354j1788l758l177M3994L4397K972J5J4284O502j9926k9442K7636j719
14841B3636k413j1098l6769J9021R809M732K2295k1771n1491l390M6274J909n8655
14828e7911j1663L3740N636l6238k1724J9774J4822J8603K5283K1164l2938M758
14816a6694j1499J5114L0609Q816J8151k8680n8255Q593K2185M788R969k1405
14804a8308K3194M6717k7039m6872k6621j2413N5969K6793K334R946k1668N755
14792A7787K0936n0709n186L5528K7590J2335j2344m2007k4978k1948q596K6327
14780b5265j0540N07L1689L0266K2508j5618k411k805j5208o0093J0077K9542
14768g351k3894o890Q047J2974J0008j7n488k878J4791l949M131L2714L0234l3255
$$ y = [-36354, -48142, -51900, -55077, -11083, 23314, 26286, 26301, 40585, 47087, 27161, -2281, 25355, 23636, 21223, 10125, -26644, -7623, 2186, 6918, 29213, 7442, -44049, -47439, -1165, 744, -57911, -69574, -35834, -30198, -66436, -88160, -68386, -53564, -34961, -9678, 11486, -21452, -16694, -28193, -13079, 17530, 26346, 44497, 15817, -42438, -33845, -11660, -6872, 3097, -18308, 4886, 51603, 24564, -22308, -48929, -61342, -5373, 21420, 23754, 33700, 12032, 17787, 38723, -11986, -17172, 18356, 45946, 58281, 45937, 3930, -21048, -42996, -51592, -25265, -35805, -35298, -3609, 26657, 49165, 33547, 31136, 28331, 13123, -46970, -36893, -7351, -31245, -38135, -30088, -17114, -7106, -7123, -12611, -15489, -698, -4647, -516, 32198, 62432, 29177]
14754B9177L0539K9202O570j3858l7820n0644N217L048M1571K621k2231k0883
14742B509r530J3066K2980j4789m7980n1942L0587K0672n65n157N637K5235l383
14729a2660P064J5774Q422k5149n2583j1406J4059K1861j1215k515R23j7998L137
14716f2286K0833K1012j529L4254M2166K9632l6548k9194k1132M522k785l695
14704d750K7516K277O098J371M043n898l4512j3264J4885M2797N5112j2623l0254
14691E2798m0377K698J1225k439J3027J1685n2511n969l1395M73k8525k4737L3579
14678f0468O3407K2159n2768n491K274m6096J5446K1786j7326L149L3170P993
14666a2765J2600j5630l7263R935j0531P098k3287N1322K9533K4114m7532R949
$$ y = [29177, 59716, 88918, 95488, 81630, 43810, -6834, -1617, 1431, 43002, 45623, 23392, 2509, -7021, 6045, 29025, 14236, -33744, -85686, -55099, -34427, -34992, -40149, -34512, -9277, -12660, -5596, 10178, 18600, -6549, -59132, -70538, -56479, -34618, -45833, -48348, -47425, -65423, -62286, -41453, -20441, -21970, 12284, 54450, 84082, 47534, 18340, -2792, 1730, -1055, -4750, 22766, 25043, 31141, 32512, 36555, 30657, -3855, -17119, -2234, 40563, 95675, 83052, 52798, 12421, 15119, 26344, 23905, 36932, 48617, -3894, -9863, -41258, -40785, -69310, -94047, -60468, 2939, 25098, -27670, -33161, -30887, -76983, -61537, -39751, -57077, -53928, -20758, -12765, -165, -15795, -53058, -43123, -53654, -46556, -69843, -18521, 11012, 35126, -12406, -2457]
14654b457K5167K1017K4184m3332m5241k2154Q242k4985J7774P834N6444J4584
14642C7077k0922K185k539J1274J2141l7982j8761j8126K0274N0485j9992k9728
14630a4614j5K3040K815J0359J1411k4217l6957O485o768j3248J9901j168J7189
14617e787p699m1944L8801K4705P441K514l7967J8172L0773l4179n3843K4289
14605c4724j5652M959j009j0416J8376J7614q607M7472M4241m641n1940k0814
14593a5141J0949L3521q429k7948j0443J6677j648l0647j9871L1647J2114p849
14581a7068J7569J974P593P474m8208j0266L303J9352o528J2761L4116L9035J9002
14568H0109J8988m8603J401M798q2023m3181O995K5705L6817l6221j7568R345
$$ y = [-2457, 22710, 43727, 67911, 24579, -20662, -42816, -34574, -59559, -41785, -33951, 22493, 37077, 16155, 18340, 15801, 27075, 39216, 1234, -17527, -35653, -15379, 35106, 15114, -14614, -14629, 8411, 11226, 21585, 32996, 8779, -28178, -21693, -28461, -41709, -21808, -22976, -5787, -13486, -55430, -16629, 8076, 15517, 18031, -19936, -1764, 29009, -5170, -59013, -34724, -50376, -45417, -46426, -56842, -38466, -20852, -29459, 18013, 62254, 57613, 5673, -15141, -4192, 29329, 20900, -7048, -17491, -814, -2462, -33109, -52980, -21333, -9219, -17068, 501, 2475, 10068, 17542, -30666, -40932, -37629, -18277, -24805, -12044, 22072, 61107, 80109, 99097, 50494, 51895, 56693, -25330, -68511, -61516, -35811, 1006, -35215, -52783, -43438]
14556d3438L9640K0095k8119m8794j9111L4906O1110K3204k5947k2780L268J5565
14544I599M883k4652o857J1562L9959p754l6847J1240P646J3485k2676r90l1766
14531c3168J6488K6226J2814k8956Q2L673K748J6237j8580J185k177j9523j3007
14518c5958K4518K007J5509n875j6791j3634q74P198m934Q162j3992R217J2272
14505a3175J4343k6718j1890P879j4044l4030J0574K2242M3498J4998M877k7785
14493i231Q02M5683J5388j6868j622K5388K1958m3085l0582l4317l5869J3902
14481d8453J6747j8263r148K3655L6032j8865K9264p326j7563j4656M1865l0501
14469a7212m5251J082l610j37J8173K4847L0177O019n0861j9051l0119j3503L2563
$$ y = [-43438, -3798, 16297, -11822, -60616, -79727, -44821, 16289, 39493, 13546, -9234, -5966, 9599, 14482, -10170, -17027, -5465, 34494, 26740, -10107, 1133, 8779, 22264, -412, -1402, -33168, -16680, 9546, 22360, -6596, -6514, -2841, -93, 16144, -2436, -1251, -3428, -22951, -35958, -11440, -9433, 6076, 201, -16590, -30224, -31098, -23900, -28834, -20672, -34664, -25447, -13175, 1168, -25550, -37440, -29561, -43605, -77635, -67061, -44819, -1321, 13677, 18554, -9231, -8429, 37254, 52642, 35774, 34152, 59540, 81498, 38413, 7831, -26486, -62355, -48453, -31706, -49969, -59117, -35462, 570, -18295, 10969, 3643, -13920, -28576, 13289, -17212, -62463, -61381, -64991, -65128, -46955, -22108, 8069, 14088, -36773, -55824, -85943, -99446, -66883]
14456f6883J0720J4078j6652J394p980L0439M6203L1597J4047k766o927l4935
14444A2335r745q363j85N20j2483k7655N451N9092R51p32k3392l4946J7954m251
14430b5449Q583J7146K4644k8580j1149L1522j8957k6817K4304L5229P138r463
14418B8151J7274l1346j4477J7667J1986J4035m583j942p43k7583K2166j1966
14406A8639j6348j5936k39j3980j1032m2091m347K7876N4222j5726L9371K1722
14394D2131m0307J2195r98J7771n461j924m3274j5212p473K564j9187M9498L7460
14381B7783L535R566o337k1544k3887J138j4993k0193k0382J8317J5389K6217
14369e391k1172J7113l5105l6008M398L9199N2198Q221j4986K1658j6611k0891
$$ y = [-66883, -56163, -42085, -58737, -57343, -65323, -34884, 11319, 42916, 56963, 54197, 47270, 12335, 2590, -5773, -5958, -5438, -17921, -45576, -40125, 18967, 19918, 19186, -4206, -39152, -21198, -25449, -16866, 280, 24924, -3656, -14805, 16717, -2240, -29057, -4753, 30476, 37614, 28151, 45425, 14079, -398, 17269, 29255, 43290, 38707, 36765, 36022, 8439, 30605, 18639, 2291, -13645, -13884, -27864, -38896, -80987, -85334, -57458, -3236, -18962, 20409, 42131, 1824, 14019, 13021, 30792, 25331, 23407, -19867, -35079, -42552, -39988, -59175, -9677, 27783, 31318, 40884, 34547, 13003, -10884, -9746, -24739, -44932, -65314, -46997, -31608, -5391, -26563, -9450, -44555, -80563, -76165, -36966, 15232, 23453, 8467, 30125, 13514, -7377]
14357g377J2453J7757J639l2065q779m496m5520Q073R816q290N4717P617l1667
14344b6122k1454J8399j6269p793J4817k1602K7963K9202J2088N185K7955q943
14332C3426j6402L050J4805R970J1994P45l5197k3962K0597k9991m8927j2805
14320g2697M7086j5588l4191l612K2836L0795n178j0322J6490K4874n550O973
14308A916j4459j134L1451N833l0572k828P2216L328m3999j310l314L7625K9633
14295H4386J6993m0856l4877k096k7779m4496j3312J5044K7140L1966J4063l3327
14283g151l9814j5505n87L9724L9624m6065k7388J4281L0270J8581Q730j3466
14271A234k7214m2130n128j4533j66K2259K2695K0497J6439q487n133j8064j6989
$$ y = [-7377, 5076, 22833, 24472, -7593, -16372, -20868, -66388, -58315, -48499, -56789, -2072, 5545, -26122, -47576, -29177, -45446, -53239, -38422, -60024, -32061, -2859, 9229, 14414, 42369, 33426, 17024, 20074, 34879, 44849, 56843, 57588, 22391, -1571, 19026, -10965, -59892, -72697, -25611, -41199, -75390, -79002, -56166, -25371, -30549, -40871, -24381, 493, -5057, 1916, -12543, -13677, 17774, 23607, -6965, -9793, 62423, 65751, 21752, 20442, 17128, 54753, 84386, 101379, 60523, 25646, 23550, -4229, -48725, -62037, -46993, -19853, 12113, 26176, -7151, -46965, -62470, -63057, -23333, 16291, -29774, -57162, -42881, -12611, 5970, 14700, 1234, -25980, -68110, -73238, -87771, -87937, -65678, -42983, -22486, -6047, -14534, -19667, -37731, -54720]
14258e4720L7945K8286K3522L5771q761j7181N094o554n4234K550l3135J3101
14246b8316M3984j1529j0027K695j0028P777K4537k9395l1719M0039M828j3680
14234a0834m6551p361j0066J0197N6193M5253K0886J6274m5103m6389m5019q897
14222g1417k4760M8439L2703j7678R201j5930L8104L558r690K9831J9516k4421
14210A7456j5846q592M3720j8279j6308j6491k329K8005J918M228m903J6041j5922
14197A2698m9081k3409P978K0422p278K9980p357k1643q505M4029J3317K0141
14185C1292j9800j395j1261k6902L09J9599K5838j1578P634J7381N801l1835j1445
14172f362r108j8136j8124j2170J4410p453l96P571N187P779p18k2984L9940N9073
$$ y = [-54720, -16775, 11511, 35033, 70804, 62043, 44862, 49956, 43402, -10832, -8282, -41417, -28316, 15668, 4139, -5888, -3193, -13221, -5444, 19093, -10302, -42021, -1982, 2846, -10834, -57385, -64746, -74812, -64615, -8422, 36831, 57717, 73991, 28888, -17501, -62520, -71417, -96177, -47738, -15035, -32713, -23512, -39442, -1338, 2220, -7470, 22361, 41877, 17456, 1610, -6982, 36738, 18459, 2151, -14340, -16669, 11336, 13254, 17482, 12579, 28620, 12698, -36383, -59792, -51814, -31392, -38670, -8690, -16047, -37690, -46195, -2166, 11151, 31292, 11492, 10097, -1164, -28066, -27757, -8158, 17680, 6102, 13736, 31117, 36918, 5083, -6362, -15470, -33606, -51730, -63900, -49490, -56943, -57339, -49768, -44581, -36802, -37520, -60504, -20564, 38509]
14158C8509L7867K7421j9090n0647K3188R836m0147l3298J5131J8185m6584J1160
14146h469j2965n3155J422O1319N0243K7362j2718l4824l9143l7722L5178O768
14134a6704J989J8259n839R9p438r992p085R107M5561k1095k9843r743l375j1429
14120d7528m0198J0909J3614j8209j722L120M2109J2103l2956J5016J8352K0999
14108d391J6998j1416j7366K0826m0711m1846k1664N210L331L071P83L9822L1115
14095a6238N6165J4573k5618M699J1336O417k5130m3946q506P632k6752J5887
14083b9481q599j7598m537M0375J3448l438n0019k5516O2277L8349l5495l9192
14071e9426M6053M2316l5672j9592J9237J2985J4175l9508l6409n915j79J3626
$$ y = [38509, 76376, 103797, 84707, 34060, 57248, 67084, 26937, -6361, 8770, 26955, -19629, -8469, -21434, -74589, -73167, -11848, 38395, 65757, 53039, 18215, -20928, -58650, -23472, -16704, -14715, 3544, -2295, -2196, -9634, -19626, -26711, -17604, 27957, 6862, -22981, -32724, -36099, -47528, -87726, -76817, -63203, -81412, -83134, -80014, -37905, -25802, -58758, -43742, -25390, -4391, 12607, 1191, -16175, 4651, -36060, -77906, -99570, -94360, -91029, -87958, -87175, -47353, -16238, 39927, 54500, 28882, 33581, 44917, 51334, 26204, -17742, -26248, -18616, -45368, -29481, -38080, -55678, -60215, -19840, -6392, -9830, -59849, -85365, -23088, 15261, -20234, -59426, -13373, 28943, -6729, -26321, -7084, 5901, 20076, -19432, -55841, -61756, -61935, -48309]
14059d8309J1043M0158L7831J59J5790k3079j4692J6783j3283n0067R212K1338
14047B884N3393N4544j9380p0326K108K6513k259p5268m7168J6992L3688l144
14035b7423l9979k2020M7774O1015k1298J9429K5685m5681n769k1658m2517M329
14023f8113L1814L6095L7930J2211l0420j5939j519q328J1738L1503o078M290
14011C5184l720m5039m3916L278J849p723J9184K1842L3559Q690J8706N136l5793
13998A1237j7388J2893k4551n2766j8113L8271L2999M4846J0243n0437k0848N3592
13986A9978J0541j493j7867J4542J3869r97k701J601j2016k0067L7430K514k5291
13973B0043J63L0282N318j9013k592m8543m3014K8641L9366N7417j9038m7783
$$ y = [-48309, -37266, 2892, 40723, 40882, 56672, 33593, 18901, 35684, 22401, -27666, -18454, 2884, 56277, 110821, 91441, 21115, 23223, 49736, 47477, -27791, -74959, -57967, -24279, -27423, -67402, -89422, -41648, 19367, -1931, 17498, 43183, -2498, -8267, -29925, -72442, -68113, -36299, -204, 37726, 49937, 19517, 3578, 2059, -6269, 5469, 36972, 30894, 35184, 31464, -13575, -57491, -54213, -52364, -60087, -40903, -19061, 14498, 23188, 41894, 47030, 11237, -6151, 6742, -17809, -70575, -88688, -50417, -17418, 27428, 37671, -12766, -33614, 19978, 30519, 29026, 11159, 25701, 39570, 38573, 35872, 37473, 25457, 5390, 42820, 45334, 20043, 20206, 50488, 55806, 36793, 34201, -14342, -57356, -28715, 10651, 68068, 49030, 1247]
13961A247k3851O783J851j1473J1720n067j2168j8658p424K2918K7197K7826O7647
13948H8548j3175r308M513m396k8413m1271K7888J829P886J8419J2348r345k7070
13935B8453m041j4147r019J7856j1092k1018J5657j6620K670M255l9204k6330
13923g2580J615K1143K0419J9919K9469j513k2867k4226L382o605K1217M4018
13911C3391k3409L990k378p719n860l2394j1287M5597R53j5709k9682Q334p519
13898d3692N743M02K2037R64J0911J2750l9037q341k0667k2792L5813N2224k8680
13885b2365m4527N4734M3295l9704j4463J793j0590P447K644j1793J7635K9899
13873A4005J0913k6150l7277q286K4301N083J0759J9946J9821m1283p197M99l9463
$$ y = [1247, -22604, -15821, -13970, -25443, -13723, -18790, -30958, -49616, -57040, -34122, -6925, 20901, 88548, 75373, 66065, 70578, 66182, 37769, -3502, 24386, 26215, 34101, 52520, 64868, 55523, 28453, 24412, 10265, 1246, 19102, 8010, -13008, 2649, -13971, -11301, -7046, -46250, -72580, -70965, -49822, -29403, -9484, 19985, 18472, -4395, -28621, -25239, -31844, -10627, 33391, 9982, 13972, 11594, 3875, -1985, -34379, -45666, -69, 884, -14825, -44507, -36173, -43692, -37949, -37547, -15510, -14546, -3635, 9115, -29922, -38263, -58930, -81722, -45909, 6315, -22365, -66892, -12158, 31137, -8567, -23030, -21237, -31827, -24380, -21736, -33529, -15894, 14005, 24918, -1232, -38509, -46795, -22494, -17411, -6652, 13294, 33115, -8168, -15365, -14866, -54329]
13860e4329j4539M2984M0835J4990k6727J98K7671K697k446m1091l0535N2759
13848A2467m054j3178n2978P984j0317K287j1039l2887K4788J9436M8321O625
13836b545P841l7702K1165O468N685k071k1589O290K1520J5336l881k5075R258
13823G00J5873l9455m4274n4534J2153K3616K1881P730J6330N160j5120j67n369
13810e5476K6185L4905P307j4656l3475P169N532r937M629L036K6500M4844K6674
13797G3237K6925l0160o8078l2600k7868J9955M6297j5116L8006N222k6054k5664
13785a5898m5216N7971L3561j4452Q337M302r205k1779L8618k4270l1913L4164
13773A4220J3590M8314o3697o6526k0349K590n264K3561K9827J7811R546N627
$$ y = [-54329, -68868, -25884, 14951, 29941, 3214, 3412, 31083, 33780, 31334, -9757, -40292, 12467, 8413, -4765, -57743, -49759, -60076, -57789, -68828, -101715, -76927, -57491, -9170, -2545, 5296, -32406, -11241, -4773, 912, -1159, -22748, -16458, 5062, 20398, 16517, -8558, 700, 16573, -22882, -67156, -121690, -109537, -85921, -64040, -56310, -39980, -34820, -49940, -50107, -55476, -29291, 5614, 12921, -1735, -35210, -28041, -22509, -32446, -27817, -24781, 1719, 46563, 73237, 100162, 70002, 1924, -30676, -58544, -38589, 7708, -7408, 30598, 35820, 9766, -15898, -61114, -3143, 30418, 15966, 24303, 28605, 19400, -2379, 36239, 11969, -19944, 14220, 27810, 76124, 12427, -54099, -74448, -71858, -77122, -53561, -23734, -5923, 3623, 9250]
13761I250M380J0832r364n0481r496J4820j4496J4285N154J8864k792l6925l308
13748d9277K0872L3701M1263K0698j2321k2459Q921J9545m8542k7342n87J7964
13736B436k7896j7645Q181J5173m5021j0502j6201j960M3218M430J4841K5130
13724e816N52j1038k6196l5643J287L7381J312J4486J9743J2854k777L12k5652
13711a9195k4384M004l552K5389M1175J9701N050k488L6950k7054k2920N579n300
13698C2955l1479P232j0401l9390L3122o524m128N0211L9767k7484j719N12k4001
13685A8673k4222K8185M674j3384J1154L2198J8166k4391k0901m9355L548m517
13673b0172k5764k645j1309j068M0377N3524J3803l2428p53K8601l2802j5075
$$ y = [9250, 13630, 24462, 15098, -35383, -44879, -30059, -44555, -30270, -25116, -6252, -9044, -45969, -49277, -28405, 5296, 46559, 67257, 54936, 32477, 41398, 60943, 12401, -14941, -15528, 2436, -25460, -43105, -34924, -19751, -64772, -75274, -91475, -93435, -50217, -45787, -30946, -5816, -5264, -16302, -42498, -78141, -76854, -39473, -38161, -23675, -3932, 8922, 6145, 6457, -19195, -43579, -39575, -43127, -17738, 23437, 43138, 48188, 45700, 82650, 55596, 32676, 38255, 32955, 1476, 8708, -1693, -41083, -7961, -14485, -18613, 31598, 71365, 43881, 42162, 42674, 18673, -5549, 22636, 27310, 13926, 25080, 57278, 75444, 51053, 30152, -19203, -15655, -20172, -45936, -48581, -59890, -60958, -20581, 32943, 46746, 14318, 13565, 42166, 9364, -5711]
13661e711L2125J8012k0754m4566q548o083Q835K9738L295l8961l9763m3954K532
13648a13803M9624O8762K1667j0102J0514l5103k1776R237J3754k4654j3010J1071
13636c3819N6675L4853q801k289N450o5052p510n012l7229K1840J3664k3602P4
13623e0758L8868K4104L1410N943l5283l3677L0400Q016K4714J0067J8069k451
13611F9422o1471rJ3063K6566J968j3291J7709k5544k8504j2567J2701k4282J7676
13598f563M4620j5182j6845J2694j1865J3396l2553Q184n191j3653l3136l249
13586e9343J3834J5703M603j1280L8105k5427k4838K0250M1346L465k6090m0091
13574d9763m505O89P8763N2013j5646j0383j1041j6169j4915l4852j7940l139
$$ y = [-5711, 26414, 44426, 23672, -20894, -29442, -35525, -26690, 3048, 6343, -32618, -72381, -116335, -113803, -64179, 4583, 26250, 16148, 26662, -8441, -30217, -20980, -7226, -31880, -44890, -33819, 22856, 57709, 48908, 46619, 52069, -12983, -20493, -25505, -62734, -40894, -27230, -50832, -50758, -11890, 12214, 43624, 49567, 14284, -19393, 11007, 19023, 43737, 53804, 71873, 69422, 7951, 7942, 21005, 47571, 49539, 36248, 53957, 28413, -91, -12658, 43, -24239, -6563, 38057, 22875, 6030, 18724, 6859, 20255, -12298, -4114, -9305, -22958, -56094, -59343, -45509, -29806, -25203, -36483, 1622, -23805, -48643, -28393, 12953, 16418, -9672, -49763, -54268, -53579, 25184, 77197, 61551, 51168, 40127, 23958, 9043, -25809, -43749, -46888]
13562d6888l745k356p905L2304O1582o057m427p124l0488k4021j4887l477O5189
13549G700J5407l7737K5728N8498L47k2678K5886m4481n8962J8510o687J6064
13537b405J4934r661J3638J4753k1904P895J5191l527o792j1010L661J7514m6216
13524a3929m1356l3292l8571n352L8931Q9425M9447j0459m5585k2978m14K2810
13512a1323n502k937k1181k359j2051K9799j041k6379n851N1308L2481m257K4888
13499D5595R590p664j3642k914M612k4031k6658j8650k0994N5070L3233M4011
13487G7558j1353l0886N720m2548R008K6222l1679l3084j5433k1980K4362M3252
13475h41K2620L0145K579k3656l712j1884o311K777l3560R186L0073j6135l2175
$$ y = [-46888, -50633, -52989, -60894, -28590, 32992, 26935, 22508, 15384, -15104, -39125, -54012, -57489, 7700, 23107, -14630, 11098, 69596, 69943, 47265, 73151, 28670, -30292, -11782, -18469, -2405, 12529, 2868, 16506, 31259, 9355, 17250, 32441, 28914, 22122, 11112, 14773, 32287, -13929, -55285, -88577, -127148, -132500, -93569, -4144, 45303, 34844, -10741, -33719, -34133, -11323, -16825, -19762, -40943, -43302, -55353, -25554, -26595, -52974, -58825, -7517, 24964, 20707, 45595, 55185, 47521, 33879, 30965, 35577, 11546, -15112, -33762, -54756, 314, 33547, 77558, 66205, 35319, 41039, -1509, 7499, 33721, 2042, -31042, -46475, -68455, -44093, -841, 21779, 51924, 54503, 30847, 27135, 15251, 8940, 11717, -21843, -12657, 17416, 1281, -30894]
13462c0894l984M3473J3949m79K7992L0291l3416l8622k7874j3041K0175L080
13450i350m695Q126J4227K9696o1377J1779J3231k0550n366K3000j9351L5908
13438A5278K8343k089j9377K9010N226j5466k9369n5419m3952M9481M9305K1237
13426C2208l0566r572j4162L9897K954J6920J5462K4794j2479n8523k7725k9793
13414e0585L1448N1124K6746j0666m628K2064K7660r199m5323Q959J2141j8811
13402D0930j1986J620K0391l9696L2233Q171Q27l093j718R211n299k4189j4440
13389A2962K1388J1784l591J6233j5745l6694P459O9352j4125l6393j2243j9335
13377A052m0329j5959q751L2257J0680J2556J3218N473l1785m096L0707L4605
$$ y = [-30894, -34878, 8595, 22544, 22065, 50057, 80348, 46932, 8310, -19564, -32605, -12430, -9350, -14045, -5919, 8308, 38004, -23373, -11594, 1637, -18913, -24279, -1279, -20630, 15278, 43621, 41532, 22155, 51165, 56391, 40925, 11556, -43863, -87815, -38334, 10971, 32208, 1642, -7930, -22092, 17805, 20759, 37679, 53141, 77935, 65456, 6933, -20792, -50585, -19137, 31987, 58733, 48067, 43439, 65503, 93163, 83964, 38641, 47600, 59741, 40930, 28944, 30564, 50955, 11259, 43492, 51663, 52490, 49397, 47679, 56890, 51591, 27402, 12962, 34350, 46134, 42543, 58776, 43031, 6337, 13796, 83148, 69023, 32630, 20387, 1052, -39277, -55236, -63987, -31730, -21050, -8494, 4724, 10197, -21588, -25684, 5023, 39628]
13365C9628j8092N375J2303j227k6346J0043J2927m6019K4453K427j4551m968
13353d047j4105m047k5601Q473L0268J1693J9997j2366K1265k0850j5466K0371
13341A5585N968j1455r364L336o206k920L2318j8881k8288l7409Q562M4673k5541
13328b9622m4038K624K3043O710K3746J3148l3357L1182K3694l9721m409M474
13316b2526N4354M1353k8372l4081o203J8151K4772l5684j6773j4219K0366L3534
13304C4672J9834P328J345j7743k4726J6445K5218l0216o2718K4482j330K9287
13292B1878J6833k8206l4575k3057k3744J7340M0095N1893J5653k3656r736m352
13280A6366Q724k112j3123k0047l5537J5838J6555P740j9780J607M459p967k5901
$$ y = [39628, 21536, 26911, 39214, 37987, 11641, 21684, 34611, -11408, 13045, 15472, 921, -4047, -18152, -22199, -47800, -39327, -9059, 2634, 22631, 10265, 31530, 10680, -4786, 15585, 21553, 10098, 734, 4070, -2136, -5056, 27262, 8381, -19907, -57316, -48754, -4081, -29622, -73660, -71036, -47993, -41283, -17537, -4389, -37746, -6564, 17130, -22591, -27000, -22526, 31828, 73181, 44809, 10728, 4525, 22676, 47448, 11764, -5009, -19228, 1138, 34672, 54506, 61834, 63179, 45436, 20710, 37155, 62373, 32157, -30561, -6079, -7409, 21878, 38711, 10505, -24070, -47127, -70871, -53531, -13436, 38457, 54110, 30454, 20718, 16366, 25090, 22978, 9855, -10192, -45729, -29891, -13336, -5596, -25376, -23769, -19310, -27277, -53178]
13267e3178J0613L0791J6522P818l766k8250k3276L5169K3536L9228L2192l9395
13255D8004j7062J506k4019J3914K5188M945k1417J4836k7598J2924L5133L595
13243F9949L4170j2361j6641o5614l6330k1432J16J8827J2638m098n2661L8674
13231c4763L0250K2844R432k6987j7446N6679L1720J9992l5548m2129J4449N217
13219C3710R907k2814K0333K5286l2549k8920l328K3753J7506o486k6084J3344
13207B3658J5863l155R772J8139M7346M3481K9430j6969j6395k158l5987p5978
13195C7047j3958K9835r300l4596k1942k9254J2494J988K3911K9530j4989j0508
13183B58J2629J6078N8925L2304m7076q874J9769N8274K4859P954K0216K8150
$$ y = [-53178, -42565, -11774, 4748, 12566, 8800, -19450, -42726, -7557, 15979, 55207, 87399, 48004, 30942, 32448, 8429, 22343, 47531, 52476, 31059, 45895, 18297, 31221, 66354, 69949, 104119, 91758, 75117, 9503, -26827, -48259, -48143, -29316, -16678, -20776, -73437, -34763, -4513, 18331, 27763, 776, -16670, 40009, 71729, 91721, 56173, 14044, 28493, 33710, 43617, 20803, 41136, 66422, 33873, 4953, 1625, 25378, 42884, 36398, 10314, 23658, 39521, 36366, 46138, 64277, 111623, 155104, 184534, 167565, 151170, 149012, 113025, 37047, 23089, 52924, 43624, 9028, -12914, -42168, -29674, -27686, -3775, 25755, 10766, 258, 12887, 28965, 87890, 120194, 73118, 64244, 84013, 142287, 167146, 175100, 195316, 223466]
13171B23466M1997L6345P4430J22774J98353L30160M58531M78481Q8984j62760
13161A890761j80516k37386k54963k24989p9666m3810p6095j46530j00009p8641
13151D68156j15228r9887l2145m5000m6761k4874j19O156l5592j9059m8596J485
13139H536L7141O603N129j4411k1862L937l1895j4342J259M3759K1514O080q468
13126D2980j8270k2887L4524J9366L5091R17O478J4969j1079J4812O4874M8685
13114B30460N2778P7220J13988P6159J9618m9138o3425j23935j27334p4135j1609
13103A20647J8949j7803J3438l2981j7230R75l0135j8064J3181m7350j6915J3228
13091f0N2823q105N285m9265J66K8082j0651n9605O181O8897N1552K8763m4005
$$ y = [223466, 265463, 301808, 376238, 499012, 697365, 1027525, 1486056, 1964537, 2053521, 1890761, 1710245, 1472859, 1217896, 992907, 913241, 869431, 793336, 646806, 546797, 468156, 352928, 253041, 220896, 175896, 129135, 104261, 104142, 110298, 74706, 55647, 7051, 8536, 45677, 52280, 57409, 42998, 21136, 25073, -6822, -21164, -19905, 23854, 45368, 51448, 42980, 24710, 1823, 36347, 55713, 90804, 91721, 98199, 113168, 102089, 116901, 181775, 230460, 283238, 360458, 474446, 550605, 570223, 521085, 457660, 333725, 206391, 132256, 120647, 139596, 121793, 135231, 102250, 85020, 85995, 55860, 37796, 50977, 3627, -13288, -60, 52763, 44658, 49943, 678, 844, 28926, 18275, -41330, -35149, 33748, 85300, 114063, 70058]
13078G0058l5078M0755N2413m386n3268m3321j5510K802P1130N6119K3073J0960
13066A75747J0093r480k7162k715K9104j1527l8802n7335q342O811j4150l489
13054D8753J0673j0966L271K2063o720q784l5554k269J6673j7109k7634j3328
13042b0931L7307K4747k0060l2237k5769l9710J4668L9517K6082L8900N182j5100
13030C2596P327K1068j6244m0115l0809J1887l7747m1505j1340L0247J5613q825
13018f7847j6114j1606J1427J05051P0632k4932P835M8758k369J2944j5631j2886
13006A05262q69J922m8930L9451j2281R701m5341j5511k3996l5557k5667J9692
12994c2124N0361J9676J98k7295j1644K1998K3418l4602J1515L2732j0930q4923
$$ y = [70058, 34980, 75735, 128148, 123762, 70494, 27173, 11663, 14465, 85595, 141714, 164787, 175747, 185840, 176360, 149198, 146483, 175587, 164060, 125258, 67923, 59581, 66392, 52242, 48753, 59426, 48460, 51731, 73794, 67074, 58290, 22736, 20467, 37140, 20031, -7603, -20931, 16376, 41123, 21063, -11174, -36943, -76653, -61985, -22468, 3614, 42514, 47696, 32596, 39923, 60991, 44747, 4632, -26177, -14290, -52037, -93542, -104882, -74635, -59022, -67847, -83961, -95567, -84140, 20911, 91543, 66611, 74446, 123204, 120835, 133779, 118148, 105262, 104393, 106315, 57385, 96836, 84555, 94256, 48915, 33404, 9408, -26149, -51816, -32124, 18237, 37913, 38111, 10816, -828, 21170, 44588, 9986, 21501, 54233, 43303, -41620]
12982d1620k020N6148P988j5380J5402N267j0050m014L1221K020l5513k3960L3226
12969A8715M0329K7884J0373J237m144K0769m099m27M8375N4166M8308J2015L3988
12956C07489K7235k9404k2098j6936n7454p848j5910k1894k2716j1983m1349o7274
12944A9858M209L4763K1028K8017j6424k0218O865o206N2203K4228q465K706M5886
12931A88450l273j7006j2884k9353n6412j4300K8081j3939m4166k5310N4758M2787
12919I7433k655j9103m1757N723L0315J6047j2936k322j3967l2722J712p897m472
12906A3399M7217O16K6682j709n0184P515l5678L6096M8911j245q358p276p5615
12893C71m8329O7383Q4184K4331O957L0553K8569j6457J16j4626p5590k2163M9248
$$ y = [-41620, -43640, 12508, 20496, 5116, 20518, 25785, 15735, 11721, 42942, 44962, 9449, -14511, 18715, 59044, 86928, 97301, 98538, 94394, 115163, 111064, 110637, 159012, 213178, 261486, 273501, 307489, 334724, 305320, 283222, 266286, 208832, 200984, 185074, 163180, 140464, 128481, 87132, 19858, 24067, 58830, 79858, 107875, 91451, 71233, 78098, 71892, 124095, 148323, 139858, 142564, 188450, 185177, 168171, 155287, 125934, 69522, 55222, 83303, 69364, 25198, -112, 54646, 97433, 94778, 75675, 33918, 39641, 69956, 86003, 73067, 70745, 56778, 24056, 25768, 17871, 13399, 60616, 61232, 87914, 86205, 36021, 43536, 7858, 43954, 92865, 91620, 83262, 75986, 371, -47958, 19425, 103609, 127940, 134897, 165450, 194019, 177562, 177678, 163052, 87462, 65299, 114547]
12880A14547j354q953k9783r006R39O2149L3975K3302k7399j9212K1763J6239
12868A77207O566K7256O710j8880M8824L1828j2635Q171p7534j05291n9305k1438
12856A1479k6303l7022J6092J782M2291K8559K9147K4757K511j132J8081L5416
12844A45658J4788L7042K0918M4019k557p405r24L1691M0644M4845O9729J07158
12832E45606M3820K9281J975l7617q2385j81580j93786j21081r6856J4179L8032
12821d0412K4010M9200L0129l5392k6773K3233J8004L3545K0534K3347R813K5836
12809A55074L7529N8834P536j9566m0936j3333L4363J438J4173M142K4011K7293
12797B90558J56889J89155J04889j376n1228l9987j0695k1667r577m2743l8497
$$ y = [114547, 113193, 104240, 74457, 65451, 66390, 128539, 162514, 185816, 158417, 139205, 160968, 177207, 183773, 211029, 217739, 198859, 247683, 279511, 266876, 275047, 197513, 92222, 32917, 11479, -14824, -51846, -35754, -33972, 8319, 36878, 66025, 90782, 93293, 92161, 110242, 145658, 160446, 197488, 218406, 262425, 259868, 252463, 251539, 283230, 323874, 368719, 438448, 545606, 589426, 618707, 620682, 583065, 500680, 319100, 125314, 4233, -92623, -78444, -40412, -16402, 32798, 62927, 27535, 762, 23995, 41999, 75544, 96078, 119425, 129238, 155074, 192603, 251437, 258973, 239407, 198471, 185138, 219501, 220939, 235112, 239254, 263265, 290558, 447447, 636602, 741491, 740115, 688887, 648900, 638205, 616538, 606961, 564218, 525721]
12786E25721k0621j2352L178J8399p296j8452l1893L4765J1947l2786j1089L780
12774D63301M4461k263l6901m321J8064K7523Q8181M5805O50O839m228M4877L4789
12761G26777L3080M2873K3786K9215m480N8648L6372L7712M8171M2384J7795J5411
12749A107744R4257R8551M9328L0645L6727J06537P1898R2467J12415O0899J11671
12738A973139R9520P2234J18229J57552Q4224J50075J76479J09191J82670K86147
12728C409460K94884L10056L90374M86546O17735P37640Q12553R55090J167864
12719I182202J413801J651376K177512K546173K544655L174163M330963O037356
12711C3058201Q820980J2992013J9762086L2387632N5248922R0380108J12686013
$$ y = [525721, 505100, 492748, 495926, 514325, 507029, 488577, 456684, 491449, 503396, 470610, 459521, 463301, 507762, 505499, 468598, 464277, 482341, 509864, 598045, 643850, 644500, 651339, 647111, 691988, 726777, 759857, 802730, 826516, 855731, 851251, 909899, 946271, 983983, 1032154, 1074538, 1092333, 1107744, 1202001, 1300552, 1349880, 1380525, 1417252, 1523789, 1595687, 1688154, 1800569, 1861468, 1973139, 2072659, 2144893, 2263122, 2420674, 2504898, 2654973, 2831452, 2940643, 3123313, 3409460, 3704344, 4014400, 4404774, 4891320, 5509055, 6246695, 7059248, 8014338, 9182202, 10596003, 12247379, 14424891, 16971064, 19515719, 22689882, 27020845, 33058201, 41879181, 54871194, 74633280, 107020912, 162269834, 252649942, 365335955]
12704C65335955M2587944m4251491n3962926n4750138o2853953n8202749m0534608
12697I3368034k4826428j5227931r918212o718177m658543l653114l466064l107474
12689B1792091k616017k384998k140994j687976j257628j016357r52747p91053
12681H944321o79490n96910n98140n58987n52765n47303m65747m26292l42817
12672D175870k83902k80062k55646k60723j95856k25397j76449j41007j09806
12663B247022j65331j58376j57419j40271p5745o8779r2747n3484o7416o4910
12653A202544n3562l7564m4457n8400k5582l4112j3466n5997k1262m0848l5204
12642G82090l8957m0956k5398k4545J3059j4130l5797j2693k8920l9030m7652
$$ y = [365335955, 407923899, 363672408, 309709482, 254959344, 192105391, 133902642, 93368034, 68541606, 53313675, 43395463, 36677286, 32018743, 28365629, 24899565, 21792091, 19176074, 16791076, 14650082, 12962106, 11704478, 10688121, 9735374, 8944321, 8264831, 7667921, 7069781, 6510794, 5958029, 5410726, 4944979, 4518687, 4175870, 3891968, 3611906, 3356260, 3095537, 2899681, 2674284, 2497835, 2356828, 2247022, 2081691, 1923315, 1765896, 1625625, 1549880, 1481101, 1388354, 1334870, 1267454, 1202544, 1148982, 1111418, 1066961, 1008561, 982979, 948867, 935401, 879404, 858142, 817294, 782090, 743133, 702177, 676779, 652234, 665293, 651163, 615366, 602673, 573753, 534723, 487071]
12631D87071n7837j2744N4851O977m7041k290J9518K4824q570o4043m7947m9876
12619C02893l8457P739K4347L1406L8419k5858l0993K3645L8160m0436k6310l3379
12607B71176j2552J6035K1671j5004n1221K5464K718j4426j8471q518K1242P5381
12595C13495J5905j1321Q538P594P083l8789j772j5445k2043j4625L3806P7999
12583C60425N6767J9261J2597K5623p3800j78289j02712M4387l779l5560l1705
12572I3215j4099N393M123O2900J4361j5633J6342K6340Q159n7635N44n984l3703
12559A04323L3404K8121l255K4356K5393l5492K3772M8354N1563n6998p1794j12804
12547E8943o7590j2918K2505P585l8973n6178k414J4407N0143J6869J5912K1160
$$ y = [487071, 429234, 416490, 471341, 478318, 431277, 428987, 448505, 473329, 464759, 400716, 352769, 302893, 264436, 272175, 296522, 327928, 366347, 340489, 309496, 333141, 371301, 330865, 304555, 271176, 258624, 274659, 296330, 281326, 230105, 255569, 258287, 243861, 225390, 216872, 238114, 313495, 329400, 318079, 326617, 334211, 341294, 302505, 300733, 285288, 263245, 248620, 282426, 360425, 417192, 436453, 449050, 474673, 400873, 222584, 119872, 164259, 160480, 124920, 93215, 79116, 84509, 88632, 151532, 165893, 150260, 166602, 192942, 201101, 143466, 144010, 138026, 104323, 137727, 165848, 162593, 186949, 212342, 176850, 200622, 248976, 300539, 243541, 171747, 58943, -8647, -21565, 940, 8525, -30448, -86626, -89040, -74633, -24490, -7621, 8291, 29451]
12535B9451J3771o056l1016J9880L1358j2684n2839K0519K649k4437k8668p634
12523d5706M7635L7697k0462o397J3345L0799n758J4259K2783J5748N74l4308
12511G0209l5685K8365J4271o836m9340R961M9561j7546Q326P1246J4680k9919
12499A27293k2802k4594R024L6858P788P812M3558k5676j8917j4624k7622o3196
12487C4902q086k143j5504N600l191k224j7586k647J8584o664L151l7723J8644
12474a4887R519j4560J6826R910K0529M2879q196K0032K9164l3993l1847j9443
12462B5933j817K0094J6186M7785l1545m0447J7871J3260k0871l6188n7292J5598
12450c1433P5031L0992l3134j3619J0171k9708K594L7022k7927o719j9654k2011
$$ y = [29451, 43222, 37166, 6150, 26030, 57388, 44704, -8135, 12384, 15033, -9404, -38072, -45706, 1929, 39626, 19164, 12767, 26112, 56911, 51153, 65412, 88195, 103943, 104517, 70209, 34524, 62889, 77160, 70324, 20984, 30945, 80506, 62960, 71286, 142532, 157212, 127293, 104491, 79897, 88921, 125779, 133567, 141379, 184937, 159261, 140344, 125720, 98098, 34902, 26816, 24673, 9169, 14769, 11578, 9354, -8232, -10879, 7705, 1041, 4192, -33531, -14887, -5368, -19928, -3102, 6808, 27337, 70216, 62020, 82052, 111216, 77223, 45376, 25933, 24116, 44210, 60396, 108181, 76636, 36189, 54060, 67320, 46449, 10261, -47031, -31433, 43598, 74590, 41456, 27837, 38008, 8300, 10894, 47916, 19989, 13270, -6384, -28395]
12438b8395J7670N5238l98J8275k3386m0044J1830L6099l8585Q695M1991o1525
12426b535K0474M1570J1962k5946l7473Q384O676j4769k0933J2619L2657J0229
12414D2915J7868R314J4473M4591K8945on0327k9135J5907l35l7995o0719N0582
12401D6078L5118k4778o9496o0269L4170K7961K4296M3718J03711J13212N0477
12390C24198L663J3963L9025n2219k0364l8350L769k212M0185O935p1677n8579
12378A88337J7893K3615n556m9724Q357P733j4762M983l0538J5085K5510n476
12366A85457k5172L0745J2916K3593j0597o176q626N2331K5557n603k7879k771
12354B43775j3857L0725O3140N2917M3096R9010O1983Q2726K2657m5893K0562
$$ y = [-28395, -10725, 44513, 44115, 62390, 39004, -1040, 10790, 46889, 8304, 16999, 58990, -2535, 17939, 59509, 71471, 45525, 8052, 16436, 23112, 8343, -12590, 29, 32686, 42915, 60783, 70097, 84570, 129161, 158106, 158100, 107773, 78638, 94545, 94210, 56215, -4504, 46078, 81196, 56418, -13078, -73347, -39177, -11216, 13080, 56798, 160509, 273721, 324198, 327861, 341824, 380849, 328630, 308266, 269916, 273685, 271473, 311658, 318593, 246916, 188337, 206230, 229845, 224289, 174565, 182922, 190655, 175893, 180876, 150338, 165423, 190933, 185457, 160285, 191030, 203946, 227539, 216942, 210766, 202140, 254471, 280028, 274425, 246546, 243775, 229918, 260643, 323783, 376700, 419796, 518806, 580789, 663515, 686172, 640279, 660841]
12343F60841J207q7146r0258r1989n2571k0749o304o322j0649l489J2542J278
12331C06391m648j014R82J2383n811l1798k4346m4899m3929j0014K7728N3878
12319B34903m7862K1205J9625m829j4364K1812m010n8480j517L4789L9543J5827
12307B56642K1076L062j8003J6204L7380q411m5929K1670p4013q8205m2249J9975
12295I9199K2463j8042j0784j8823J1976J1566k2493k6333P285R574L0108l3253
12283F2443k3695L5385J934j0063k5439j0620o886q464L4189J1709o871j16J0228
12270F3734r876k0675K152L2690J4662l081L0352p701J0475L2072J6321k1729
12258A39396o8817m4995K8451K2605J9780l2578L5495O3049M4746k178K9814J4884
$$ y = [660841, 662048, 574902, 484644, 392655, 340084, 319335, 313031, 306709, 296060, 292571, 305113, 306391, 301743, 300729, 301711, 314094, 308283, 276485, 252139, 207240, 163311, 153297, 181025, 234903, 187041, 208246, 227871, 223042, 208678, 230490, 226480, 168000, 166483, 201272, 240815, 256642, 277718, 280780, 262777, 278981, 316361, 307950, 262021, 283691, 209678, 121473, 79224, 99199, 121662, 103620, 92836, 74013, 85989, 97555, 75062, 48729, 56014, 65588, 95696, 62443, 38748, 74133, 76067, 66004, 40565, 29945, 23059, 14595, 48784, 60493, 53622, 53506, 63734, 53858, 33183, 35335, 68025, 82687, 79606, 109958, 102257, 112732, 144804, 161125, 139396, 70579, 25584, 54035, 76640, 96420, 63842, 99337, 162386, 207132, 204954, 234768, 249652]
12246B49652K9465J6438L4082R4281J35778J30836K34291M10421N56611K65897
12236B157752k06765k75689l21066l19430k67893k13594j30227o5255o8505k4788
12226B64540k2386l9432n1544j9817k9845k3968L6327P532r733k7910J8933k9178
12214G3519j5616o975L6004K4845j7167n1413K0850M0477L3414m38k8985j1857
12202I6658j7792J7569K9123j3978m0165l7828L54P4176j741l0286N579m687l1163
12189D5819q619K0395K5749o158l484Q76L0862k041k1956j6520O839L1519L1177
12176A34458M6686N983M931m9694o9859o1392K1379K4470L2377K1713J3657K7736
12164A52445J9364K4883k2048l3736l7383M2450J2716k3353L188J2367L9922L452
$$ y = [249652, 279117, 295555, 329637, 423918, 559696, 690532, 924823, 1335244, 1891855, 2157752, 1950987, 1675298, 1354232, 1034802, 766909, 553315, 423088, 357833, 289328, 264540, 242154, 202722, 151178, 131361, 101516, 77548, 113875, 121407, 111674, 83764, 102697, 73519, 57903, 50928, 86932, 111777, 94610, 43197, 64047, 104524, 137938, 137500, 108515, 96658, 78866, 96435, 125558, 111580, 71415, 33587, 33941, 108117, 106376, 76090, 81669, 76982, 45819, 37200, 57595, 83344, 77186, 73702, 74578, 105440, 103399, 81443, 64923, 71762, 103281, 134458, 181144, 187127, 192058, 142364, 72505, 11113, 32492, 56962, 89339, 111052, 124709, 152445, 171809, 196692, 174644, 140908, 103525, 145975, 158691, 135338, 138526, 150893, 190815, 194267]
12152A94267l4106l6350O560n205r635J817K8280p629l4816k9145J1369N298O12
12139I1317J2942J9937q60J5626k278n578M189p050j8197J6427K0005M4353J2812
12126B03645K922k3702R155K2558j7091N113k3189m1835p805k533K1576K0574
12114A69388J9651m0304n0549n618K1212k0370J6811N325M4979m275o1791L2680
12102A27139J7529m243K3629K3355K540l2780j9846l2653J4402n477l4478L0617
12090A09734M0685P1573J6799k0134m1367l3743K2529L0829J8370j9665j0147
12079A85463L0135O996M796K0062L0794m1874m8722r736j9553n342J9074J6123
12067A88216J0593K3751J3350L0854K5064O0483k105n6388n4456n250Q952J6651
$$ y = [194267, 160161, 123811, 130371, 125166, 115531, 117348, 145628, 137999, 103183, 74038, 85407, 90705, 91317, 104259, 124196, 123336, 138962, 136684, 131106, 135295, 128245, 110048, 126475, 146480, 190833, 203645, 206567, 182865, 192020, 214578, 197487, 202600, 179411, 137576, 129771, 127238, 148814, 169388, 189039, 148735, 98186, 92568, 113780, 93410, 110221, 115546, 160525, 156250, 94459, 127139, 144668, 140425, 164054, 187409, 189949, 157169, 137323, 104670, 119072, 113595, 79117, 109734, 150419, 221992, 238791, 218657, 177290, 143547, 166076, 196905, 215275, 195610, 185463, 215598, 222594, 227390, 247452, 278246, 236372, 187650, 177914, 158361, 153019, 172093, 188216, 198809, 222560, 235910, 266764, 291828, 352311, 350206, 293818, 239362, 234112, 243064, 259715]
12055B59715l6612q947J2451K105J4118M7488L3719J1300K1990K9561K4602M362
12043D15852j2982J2573J5089l8910k1644J7688Q9121N0946K4694k8232M0493
12032E64688M1691j2362k3741l2989J8486N5449R8657J01395O3009j127J7507
12021H90663O2949N3490K3448J0677N186k1687o2951m0653K3516Q216m773J0966
12009I59047J1349J8247M0244L9043n507L7368M6789j9186j2509q634L596o817
11997A103030j5014k7510O809J5382j0555R302J2043M1623R5756R3434O2086J04621
11985A491007J66060J58294J75498J82508K32849J52918J52773J73187J73477
11976C058571K39591K25555K75811L20285L71408M10242M18190M06249L23161
$$ y = [259715, 223103, 214156, 226607, 228712, 242830, 290318, 324037, 335337, 357327, 386888, 411490, 415852, 402870, 415443, 430532, 391622, 369978, 387666, 476787, 527733, 552427, 524195, 564688, 606379, 594017, 570276, 537287, 555773, 611222, 709879, 811274, 874283, 873156, 890663, 953612, 1007102, 1030550, 1041227, 1046413, 1024726, 961775, 921122, 944638, 952854, 948081, 959047, 970396, 988643, 1028887, 1067930, 1062423, 1099791, 1146580, 1127394, 1114885, 1106251, 1109847, 1103030, 1088016, 1060506, 1067315, 1082697, 1072142, 1081444, 1093487, 1135110, 1230866, 1324300, 1386386, 1491007, 1657067, 1815361, 1990859, 2173367, 2406216, 2559134, 2711907, 2885094, 3058571, 3298162, 3523717, 3799528, 4119813, 4491221, 4901463, 5319653, 5725902, 6049063]
11967F049063K31233J14770O9600R7774J74106K11628K98428N13948O89467R54101
11957I404118J413974K080329K925993L900952N142553O302559O910610O207192
11949D4288280L976067P92242k135139m029022m741004m520425l668261k572811
11941B7389927j494595o73800K7535O34264J067808J294736J350785J159948P70035
11932C1526643L83583J40835J29680L14830N62747R22379J330195J607025J690610
11923C8608527J321529O97246J9429m74745p21780o97021k14698N12586J404682
11914D0455755K591834M186956O684324J0204484J4523777J8252242J8779036
11907A15678408J4059858N188465m205499j1123080j4665664j5415140j4022323
$$ y = [6049063, 6280296, 6395066, 6464666, 6562440, 6736546, 6948174, 7246602, 7760550, 8450017, 9404118, 10818092, 12898421, 15824414, 19725366, 24867919, 31170478, 38081088, 44288280, 48264347, 49056589, 46921450, 42892428, 38151424, 33630999, 29962738, 27389927, 25895332, 25221532, 25249067, 25883331, 26951139, 28245875, 29596660, 30756608, 31526643, 31910226, 32051061, 32180741, 32495571, 33058318, 33980697, 35310892, 36917917, 38608527, 39930056, 40627302, 40646731, 40171986, 39450206, 38753185, 38538487, 39051073, 40455755, 43047589, 47234545, 53918869, 64123353, 78647130, 96899372, 115678408, 129738266, 134926731, 130721232, 119598152, 104932488, 89517348, 75495025]
11900G5495025j1366794q407916n702029l514966j837644o03905J39534M16601
11892D4617906K68646k11041r09162j442133j711434j769426j663540j336399
11884C5843417q24962m02445k30669k90918m73049q00313j149751j281938j230490
11875B9158882r92388o94177l52933P4990O88728J705163L093298M749167N974467
11866D3405197N901372M106556J024653k170024m650209o129070o645989o303330
11858B8539156n317877m201504l092140k252964j561673j073687p59413n58981
11850I720917m36826l56602l21254k07709j36318k13929l28076m08391m57220
11841F854592m77807m59481m39251l88047l80606l45423l06498k83615k41342
$$ y = [75495025, 64128231, 55720315, 50018286, 46503320, 44665676, 44061771, 44201305, 44617906, 44886552, 44675511, 43766349, 42324216, 40612782, 38843356, 37179816, 35843417, 35018455, 34616010, 34385341, 34094423, 33621374, 32821061, 31671310, 30389372, 29158882, 28166494, 27472317, 27119384, 27194374, 27883102, 29588265, 32681563, 37430730, 43405197, 49306569, 53413125, 54437778, 52267754, 47617545, 41488475, 34842486, 28539156, 23221279, 19019775, 15927635, 13674671, 12112998, 11039311, 10279898, 9720917, 9284091, 8927489, 8606235, 8398526, 8262208, 8048279, 7720203, 7311812, 6854592, 6376785, 5917304, 5478053, 5090006, 4709400, 4363977, 4057479, 3773864, 3532522]
11832C532522k07013k47188k48425k26023k40364j95271j48225j60573j20257
11823A739183j53894j16694m5671l5106q2242l4053J096j9629k346Q2156O7302
11812A400102L103L8370n277P621k7226j3712k1476n7935m0128j9739n3635R890
11800A219958O5860O3001L1852L6252l2918l1944j9729k3247j4343o171p8101
11789A210470n3984j01582m8654o4460p6624l8179J739n2044q9559j17441l4690
11778E34992p809J142l5991m7627j5298K718J5987N7414m4162o4545L2909J2586
11766D42316J3833j0795p1209m0523l406K1378l5571j8053K3852L4278J1176l5670
11754C31606m4391J3371K0675j9307n5088o837o055m0494l6732j5027k0776K9984
$$ y = [3532522, 3325509, 3078321, 2829896, 2603873, 2363509, 2168238, 2020013, 1859440, 1739183, 1585289, 1468595, 1422924, 1387818, 1305576, 1271523, 1272619, 1252990, 1250644, 1332800, 1400102, 1403205, 1441575, 1436298, 1443919, 1416693, 1402981, 1381505, 1323570, 1283442, 1263703, 1210068, 1219958, 1285818, 1348819, 1380671, 1416923, 1384005, 1352061, 1332332, 1309085, 1294742, 1288571, 1210470, 1156486, 1054904, 1006250, 941790, 865166, 826987, 828726, 776682, 687123, 569682, 534992, 527183, 528325, 492334, 444707, 429409, 432127, 448114, 505528, 461366, 396821, 429730, 442316, 456149, 445354, 374145, 333622, 330216, 351594, 316023, 297970, 321822, 356100, 367276, 331606, 287215, 300586, 321261, 301954, 246866, 240029, 233974, 193480, 156748, 141721, 120945, 150929]
11742A50929J8115r874J106l2552J6435n848L2884j8762l2071J3064M0475m1088
11730A32813p002J3968l1769k1275j4201M2117L8208l3239n5356n6260R709N1642
11718F9355M1548k8497j6705M1949m1872J1603K683r670M1112K2709k2795k4180
11706H7240k3772m4095j3535K9196n5773m13N0277M377m08l3247L2158J7215l3503
11693A5717J7845N061l2190O1J8243J3736K6722J4252n897m771k3071n9672J2873
11680a091J1222J9856J6111k3881j2792J2836K0900n295J4825o029l0692l7819
11668b1849J890L638J8581P698j1431j4354J2701l998N843P4429j4541m1253j5072
11655B282j4148r51J8286L5155J6218M399J6134j6473j7126q759l749J2922k0988
$$ y = [150929, 169044, 159170, 160276, 127724, 144159, 138311, 171195, 152433, 120362, 133426, 173901, 132813, 125811, 139779, 108010, 86735, 72534, 114651, 152859, 119620, 64264, 8004, 17713, 69355, 110903, 82406, 65701, 107650, 65778, 77381, 80064, 70394, 111506, 134215, 111420, 87240, 63468, 19373, 5838, 35034, -20739, -21152, 29125, 33502, 33094, -153, 32005, 49220, 15717, 33562, 38623, 6433, 6494, 24737, 38473, 65195, 79447, 73550, 68779, 45708, -13964, -1091, 10131, 29987, 46098, 22217, 9425, 22261, 43161, 37866, 52691, 46662, 15970, -21849, -19959, -16321, 2260, 9958, -1473, -15827, -3126, -7124, -1281, 73148, 58607, 17354, 2282, -11866, -12817, 5469, 40624, 56842, 61241, 77375, 60902, 43776, 35017, 31268, 44190, 23202]
11642B3202m329j5949j573P1959L6963K2497o9295n1004J2247o665j5788M760
11630G025J7148L4374J3456K1854l6110l8595o223J8039N8228R165n0330l1192
11618A6839J8046K210k4918k8485M2083K9699K915l3906n678k99l3042J2286J3515
11605A1265J7669N783J1153J9578J035j6055l7295o513r429k6K0871K1961O913
11592D6910J8544l891N300K487j8927J2389p432k0437L3705l0971o925K6365J7565
11579G4682J7204q267M0817j3685m3325m063n983J1110j4055l3010L960M365o69
11566B9081J7465k698o225j3169k1295k081L3629L6610L2027r232J3312l218k4394
11553G9812m1041q433J5366J8824j6935l7337j1449q110L4486O411n2850k9522
$$ y = [23202, 18873, 2924, 1351, 73310, 110273, 132770, 63475, 12471, 24718, 18053, 2265, 7025, 24173, 58547, 72003, 93857, 57747, 19152, 12929, 30968, 89196, 98361, 48031, 16839, 34885, 37095, 12177, -16308, 25775, 55474, 58389, 24483, 18805, 18506, -14536, -2250, 11265, 28934, 34717, 45870, 65448, 66483, 50428, 13133, 6620, -2809, -2835, 18036, 39997, 46910, 65454, 61563, 66863, 69350, 50423, 62812, 55380, 34943, 68648, 37677, 30752, 57117, 74682, 91886, 83619, 124436, 110751, 67426, 63363, 57380, 68490, 54435, 21425, 25385, 29750, 29081, 46546, 43848, 37623, 24454, 3159, 1078, 34707, 71317, 103344, 94112, 107424, 104206, 79812, 38771, 30338, 45704, 64528, 47593, 10256, -1193, -9303, 25183, 31594, -21256, -50778]
11541e0778j5575n056K9331R309K4208J4050j6213R625K5330Q197J6835J6394
11529F5657k5779q6387k8137K9630J6511J2005j3703K4191N8117O679j0042o853
11517D1889l4492k5919J3288j1274K6059K7397J2183j0513j8679K9116M8949K3175
11505A21179M5562m913K7536N2030N6303J0638n0971o3899n0932k1605n223j4745
11493A00960J3797M0731K9844J4263q842j0687j6912j4156J5483m304K0306K7865
11481B08348l7530K5576L3231j7092j6447M1894l7314j0012J6402K4660J3700
11470B45416m3772j9888J3518J4460K9835K3132L0325O3744Q7320Q6737P2505
11459F03332K4455j2602k5426m2224p0803j01178r1126n7439j9140q09K3881j7663
$$ y = [-50778, -66353, -71409, -42078, -32769, -8561, 5489, -10724, -1099, 24231, 32428, 49263, 65657, 39878, -46509, -74646, -45016, -28505, -16500, -30203, -6012, 52105, 58784, 48742, 41889, 7397, -18522, -5234, -16508, 9551, 36948, 49131, 38618, 19939, 49055, 98004, 121179, 166741, 161828, 189364, 241394, 297697, 308335, 257364, 193465, 142533, 120928, 115705, 100960, 114757, 155488, 185332, 199595, 190753, 180066, 163154, 148998, 164481, 160177, 180483, 208348, 170818, 196394, 229625, 212533, 196086, 237980, 200666, 190654, 207056, 231716, 245416, 201644, 181756, 195274, 209734, 239569, 262701, 293026, 356770, 444090, 530827, 603332, 627787, 615185, 589759, 547535, 476732, 375554, 284428, 226989, 207849, 207040, 230921, 213258]
11447B13258k3588m6692k2475J373K5064K1953N4525K6438r774m0917l4207L7058
11435B02016L5065n3970l6011P328k3042J3970M0677M620k2528n6753L4138J573
11423A47083l3992M50M5019L4945M8816N5110j668j7855o3565k7792k6011K3628
11411A84168K3054j2288n1456k8214j0732p9086k0764O0693K784q653m2548K7174
11399D4132N6610k4782l2375j9943l1330K2816p541j1641K2715J2228L6193J3285
11387H0367o3358j1034K8142M7453k2162j8107o295J1946K169j2899p473q890
11375A9859K6340j059m5204j2777K292J4421K937m910j8643k3639l4720k725P6783
11362a045P6598Q93N118j5282K807p902N998j9625k6787m1444k6649k1488Q163
$$ y = [213258, 189670, 142978, 120503, 121876, 146940, 168893, 223418, 249856, 240082, 199165, 164958, 202016, 237081, 183111, 147100, 154428, 131386, 145356, 186033, 190653, 168125, 111372, 145510, 147083, 113091, 113541, 158560, 193505, 242321, 297431, 295763, 277908, 214343, 186551, 160540, 184168, 207222, 194934, 143478, 115264, 104532, 25446, 4682, 65375, 68159, 59506, 16958, 44132, 100742, 75960, 43585, 23642, -7688, 15128, 7587, -4054, 18661, 30889, 67082, 80367, 17009, 5975, 34117, 81570, 59408, 41301, 35006, 46952, 49121, 36222, 28749, 19859, 46199, 45140, -64, -12841, -10549, 3872, 6809, 1899, -16744, -40383, -75103, -77828, -1045, 75553, 76446, 81564, 66282, 69089, 61187, 67185, 47560, 20773, -20671, -47320, -68808, -60645]
11349f0645K9097N8629J7968l180j9052l5518l3783j6244J5091K282L4958J7622
11337G225K9881j8335j8832K4467r775n1802l2659j7487j0583K9759J941J3158
11325e3042j0J5825L9866l1512L5912L8361m386j4251k7163j4798r451j3862l011
11312d1522J9088k0361p871K8823M4360J3130p705O390j1276k7989k0444o204
11300c1581R891J5707o73j9146l3414L7214L9280j139q476l3296j1194K6722K3602
11287A3497L4376P9m5799l9225j2778j4182K6005p91j0838K0856L2545j7867J0936
11274c186J3168k4430m0102L938K0464k3208p565J7678K8055J418j6568J7138
11262a3200M4064k6399l9404r196O272M253N3488K3046L2696k6150R661O083n754
$$ y = [-60645, -31548, 27081, 45049, 41869, 22817, -12701, -46484, -62728, -47637, -45355, -10397, 7225, 37106, 18771, -61, 24406, 14631, -37171, -69830, -87317, -97900, -68141, -66200, -53042, -53052, -37227, 2639, -28873, 7039, 45400, 41014, 26763, -400, -15198, -24649, -38511, -41522, -22434, -42795, -50666, -21843, 22517, 35647, 27942, 34332, 23056, -4933, -25377, -31581, -21690, -5983, -6656, -25802, -59216, -22002, 17278, 16139, 7663, -25633, -36827, -10105, 13497, 47873, 47952, 2153, -37072, -49850, -64032, -38027, -38818, -49656, -28800, 3745, -14122, -3186, 9982, -14448, -54550, -50612, -30148, -53356, -60921, -43243, -15188, -13770, -30338, -13200, 30864, 4465, -34939, -44135, -37863, -33610, 19878, 42924, 75620, 49470, 59131, 65214, 59460]
11249E9460m9917n3617M715M0632r591j0718K2729K7505K7124k7137k5150j2013
11237e978Q921o675l3891L482J9380j3143j4984J1556m810k141o160M2794K8516
11224B6867m0693m4552K3232J2970N959k246R956m5Q932L921r034M0241K1406
11211E6914k7756l6432l8178j4670J8686J4409J2516J1159R068J4233l0113j3274
11199b3438K186J2855m526r097K9297J524j1596M788J1626J6066k1908l0788j7015
11186d0026M0123o04l4042j4657K2257m7101m1567N0972P6478m610k0187R395
11174c569L9908o2431l487M1152J8387j0338m3588k0335N2902J9290j4938k3852
11162a0899J9812k471l2875m5941M0882Q409j7207k3644k527Q525L2521O1730
$$ y = [59460, 9543, -44074, -39359, 1273, -8318, -19036, 3693, 31198, 58322, 31185, 6035, -5978, 2943, -3732, -37623, -34141, -14761, -27904, -42888, -31332, -36142, -38283, -44443, -1649, 26867, -13826, -58378, -35146, -22176, -16217, -18463, -8507, -8552, 380, 4301, -4733, 35508, 56914, 29158, -7274, -45452, -60122, -41436, -27027, -14511, -3352, 5716, 19949, -10164, -23438, -21252, -8397, -12923, -22020, 7277, 8801, -2795, 1993, 13619, 29685, 7777, -23011, -40026, 97, -507, -34549, -49206, -26949, -74050, -115617, -64645, 11833, 7223, -12964, -3569, 36339, -26092, -29579, 11573, 29960, 19622, -23966, -44301, 8601, 27891, 12953, -10899, 8913, 6442, -26433, -72374, -31492, -23083, -40290, -63934, -66461, -57936, -25415, 36315]
11150C6315J8696l2021l1926l5478L367l2197K951k291K8263J1158J1712J6248
11138e203N919q414k8493k9909o068L627M5961J5963N793J2333J1636j9376j1537
11125g768j2283j321j306j2337Q267L5672j2626q744k439J5299n240K0201K4670
11112D0045j7881J0049j0700M0565j0585o0463l7250J5439L1073l5356l4422M4808
11100b4678L4195L79k5460j0943n701k7815j9065J3278l597J482J023J2735J2493
11087d1674J872l80O458L4056K1164K1384p606k9581J700k6194l489J2867k6873
11074c6296J7340p874k2920L366L3042J8261j4991J66K2745l3639J9966J3217
11062A2383l3517k6153m5809K1240O4341O0230J2670o356m1267n5544Q657J6462
$$ y = [36315, 55011, 22990, -8936, -44414, -41047, -73244, -70293, -72584, -44321, -33163, -21451, -5203, 716, -7698, -36191, -66100, -72168, -68541, -22580, -6617, -824, 11509, 23145, 3769, -7768, -20051, -21372, -22678, -35015, -26748, 8924, -3702, -12446, -14885, 414, -4826, 15375, 40045, 22164, 32213, 21513, 62078, 51493, -8970, -46220, -30781, 292, -35064, -69486, -24678, 9517, 9896, -15564, -26507, -32208, -60023, -79088, -65810, -69407, -67925, -66902, -54167, -41674, -39802, -40182, -33724, 332, 21496, 42880, 35274, 5693, 7393, -18801, -22290, -9423, -36296, -18956, -26830, -49750, -46384, -13342, 4919, -10072, -9906, 12839, -20800, -834, 12383, -21134, -47287, -93096, -71856, -7515, 52715, 65385, 59029, 17762, -37782, -29125, -12663]
11050a2663l0470j2019Q502j3576M2058M0285r126k570k1818m226j5208k384k4938
11037e8153K3898K4122j5456K9879K5780M5673j4713l7724j2118j7218J6490k9710
11025a9250j3095K4599L1363j3805n656Q666j0219K737j9671k0787M958j0771
11013d0931k4543j6389J0708J779L7500J3709L395J2240K492l3786N938L902j8078
11000d2064l4708k008O8293M7993k2132j5837J381q725o881R705J4297J7530O102
10987C2946j1402L5657K110J027l133k4976o753o241j863K5960N180n1490k1123
10974b4101Q738J2151q602k8632l5592N1807L7167l8179L8632J2699J1711K0429
10962E8228Q596K028o192Q456m8106k2053o1905k6528K9403M8074J4884m902m350
$$ y = [-12663, -43133, -55152, -46650, -60226, -18168, 22117, 12991, 10421, -11397, -15623, -30831, -33215, -58153, -34255, -10133, -25589, 4290, 30070, 75743, 61030, 23306, 11188, -6030, 10460, -19250, -32345, -7746, 23617, 9812, 4156, 12822, 2603, 5340, -14331, -35118, -30160, -40931, -65474, -81863, -71155, -69376, -31876, -18167, -14772, -2532, -40, -33826, -27888, -23986, -42064, -76772, -78780, -10487, 37506, 15374, -463, 918, -7807, -14688, -4983, 9314, 26844, 32946, 21544, 57201, 59311, 60338, 57205, 32229, 25476, 19235, 17372, 43332, 48512, -2978, -24101, -15363, -3212, -11814, -40446, -76038, -24231, 12936, -25243, 13389, 26088, 37799, 58228, 66824, 68852, 62660, 71116, 23010, 957, -60948, -87476, -58073, -9999, 4885, -17, -4367]
10949d367m2q246j8257m671j2731J1417K4449o708K9824l8039J8091K237J0563
10936C520L0996J5425n1291j0188L0477J6470p4346O893M4011j1575K3828O673
10924C0893K2264m4441k9095K2608J9116k8708l5596J1657K9483K4035o032l1135
10912a4951Q748K4679k3837Q931K3091K3066R593n1161j4029K3263K0471k3261
10900A4603j2510j0280k5138J2550J7413M390m260J4291O024L556m8569n9217
10888h7147R270O8930K5152j9537P78k574N847L138J4327J80L3694k4477k6763
10875H18n833k6431O82J873R666M6112k4207L216P470k6842M0548K8649k9700
10862B6021o6549M8995J9608k0722l6030Q995L6639O2822J5583n1096k5094q00
$$ y = [-4367, -4409, -12655, -30912, -35583, -48314, -36897, -12448, -19156, 10668, -27371, -9280, -7043, 3520, 34516, 49941, -1350, -11538, 18939, 35409, -38937, -32044, 11967, 392, 24220, 30893, 53157, 8716, -20379, 2229, 21345, -7363, -42959, -31302, -1819, 22216, 16184, -14951, -6203, 18476, -5361, 3570, 26661, 49727, 59320, 8159, -5870, 17393, 37864, 14603, 2093, -8187, -33325, -20775, -3362, 1028, -3232, 11059, 17083, 20639, -27930, -87147, -77877, -8947, 16205, -3332, -2554, -5128, 719, 3857, 18184, 18364, 52058, 27581, 818, -5015, -31446, -30764, -28891, -19225, 26887, 2680, 5896, 13366, -13476, 27072, 55721, 26021, -40528, 8467, 28075, 7353, -28677, -19682, 16957, 79779, 95362, 44266, 19172, 18372]
10850A8372J3712O914j524J5614L1032j0028O890k3751l5797j0877N620k1289
10838e112R355L7808l3825J1402K1513j2436l8654l5902J199O458m04O926P473
10825b4199J9821l383R275J485l715K7839M52l2633J4129M5545K9810l9995l318
10812D1113L4518j546j5296k0812J2019K0554p713L8816J2835J4582q710j8386
10800A01974O045j739k0732m6645o4841J181K5679J6917m6730m176K7760J790
10788c517l0777J6060K4290J815k3337l8292L229N0301L1000l1917M641J2594
10776A6090j009J9570L456K0280Q805k5222k6426k3139l079J4553K8457L7375
10764F9711K8080m8233l6504m2188k6471M0554N1317L7024o722k5854j917K5203
$$ y = [18372, 32084, 38998, 37474, 53088, 84120, 74092, 80982, 57231, 21434, 10557, 16177, -5112, 4243, 42051, 8226, 19628, 41141, 28705, -9949, -45851, -44652, -38194, -38598, -31672, -24199, -4378, -7761, 1514, 2999, -716, 27123, 27575, -5058, 9071, 54616, 84426, 44431, 41113, 75631, 74085, 58789, 37977, 49996, 70550, 62837, 101653, 114488, 129070, 120360, 101974, 108019, 106280, 85548, 38903, -25938, -24757, 922, 17839, -28891, -33067, -5307, -3517, -34294, -18234, 6056, 7871, -15466, -53758, -50529, -228, 30772, -1145, 3496, 16090, 15081, 34651, 38107, 58387, 67192, 41970, 15544, -7595, -10674, 3879, 32336, 69711, 97791, 49558, 13054, -29134, -55605, -15051, 36266, 73290, 66568, 40714, 38797, 64000]
10752F4000P1081j6809k5263j3176k884n5266j8168l605l3202l8134R544K7446
10740c4436J0037q453j8291J0206k5669k466L6824L9221k387j7914K3283M465
10728A4420J1883m8237l2564J96O823q933M2430m9726p744O044K3870M870K3642
10715a3026K6838P481j4780k0959j1824j9804j2873p567P2013K3458k3674M047
10703I330K5128J4586k8409q6K2230J1932n992j2692j1360l6813k3947m1554J8628
10690e9019K2553k2871k544n373n694J8789P9631M9203k2223m7711m5143O21j7484
10677e7265J4712K777O331j348j751P759L6829J6118n4132j1891L1720j5932K4322
10664a751K7606p356m0238l0839L8541M2686j84m6309j9847J8317J7238k3982
$$ y = [64000, 135081, 118272, 93009, 79833, 76949, 21683, 3515, -90, -33292, -71426, -61882, -34436, -24399, -32852, -51143, -40937, -66606, -69072, -32248, 6973, 4586, -13328, 9955, 14420, 26303, -21934, -54498, -54302, -47479, -56412, -13982, -63708, -71452, -65408, -41538, -36668, -13026, 13812, 21293, 6513, -14446, -26270, -46074, -58947, -66514, 5499, 28957, 5283, 9330, 34458, 49044, 20635, 20549, 42779, 54711, 48719, 36027, 24667, -12146, -36093, -77647, -59019, -36466, -59337, -61881, -67254, -72948, -54159, 25472, 74675, 52452, 4741, -40402, -39781, -57265, -42553, -39776, -33445, -34793, -36544, -28785, 8044, 24162, -29970, -41861, -10141, -26073, -1751, 25855, 18499, -21739, -52578, -14037, 28649, 28465, -17844, -37691, -19374, -2136, -26118]
10652b6118N217o049l4294J0720q746L8249L2902J5172P875r546O345l2921k2487
10639b3681P129O1766q975j3193k5609j7579o276J5665O1719L2974n0543m5002
10627a1605Q269O329j363k4996j5987L9412L8144j6267m3967L2209K0001M436
10615C4615j3905n9407j1593j6112J392n61M189j8287M728K9162m7645k0839L1321
10602h2942K6239J1479J0752L0474p331p953j9694R104K9356l3454k9238o900
10590g0108J3901J2129K6613L0771M0754o071K550j967j543P063j2377j1530P281
10577C7466J0378k8048j7074j1018K4610L395m7089m0556j1482r769n904K6569
10565f8522N0643L5431k4492k5066J2081M2777m626K4582o6927l9941N9469O1665
$$ y = [-26118, -20901, -26950, -61244, -50524, -59270, -21021, 11881, 27053, 34928, 25382, 31727, -1194, -23681, -16552, 45214, 36239, 23046, -2563, -20142, -26418, -10753, 50966, 83940, 33397, -11605, -3336, 2993, 1630, -23366, -39353, 59, 38203, 21936, -22031, 10178, 30179, 34615, 20710, -38697, -50290, -66402, -65010, -65571, -61382, -79669, -74941, -45779, -93424, -114263, -82942, -56703, -45224, -34472, -3998, -11329, -19282, -38976, -29872, -516, -33970, -63208, -70108, -56207, -44078, -17465, 13306, 54060, 47989, 50539, 48572, 47029, 54092, 41715, 30185, 37466, 47844, 19796, 2722, -8296, 16314, 19709, -27380, -67936, -79418, -89187, -95091, -68522, -17879, 17552, -6940, -32006, -19925, 22852, 18226, 42808, -24119, -64060, -4591, 57074]
10553E7074r070l8196K6026M0309l8919m4718p829j017K4243K3888L4987J6560
10541H3338J0162m7481k6836j7507j5661L390j3985L0444M4666J6769j6077m3001
10529H221n4957R165Q6913L5296k3310K0973n308o3018j6675K7282N920K7715
10517E8217j5046k1440J096o457l5999j5842P272K8757N766J3979j9080J3432
10505A4655q144k2400j5540K0643J5008N3282J5530J6436j541n367k5968o9254
10493a2660j7431K694k1991p766N4357K3287r710j3053k9684j2114L5109k1323
10481c0285K6819Q2667K4454m7283l6619R089n693m1732j3736K9035n93n383k144
10468a1404m315j6604M9011L1125K2019k5327k9398j3585o884K7503l7773L5378
$$ y = [57074, 48004, 9808, 35834, 76143, 37224, -7494, -15323, -16340, 7903, 31791, 66778, 83338, 93500, 46019, 19183, 1676, -13985, -10595, -24580, 5864, 50530, 67299, 51222, 8221, -46736, -37571, 49342, 84638, 61328, 82301, 76993, 13975, -2700, 24582, 30502, 58217, 43171, 21731, 22827, 16370, -19629, -35471, -28199, 558, 6324, 20303, 1223, 14655, 6511, -15889, -31429, -10786, 4222, 57504, 73034, 89470, 87929, 82562, 56594, -12660, -30091, -27397, -49388, -57154, -2797, 20490, 10780, -2273, -31957, -44071, -8962, -30285, -3466, 79201, 103655, 56372, 19753, 28842, 23149, -18583, -32319, -3284, -3877, -9260, -11404, -15719, -32323, 16688, 47813, 69832, 44505, 15107, 1522, -5362, 22141, -15632, 19746]
10456A9746K7538J5064J2890j4043o375o9074p628K5204J5441m776k589l49r79
10443A0070l5882j7846J3462K6903O1255N4126M988m3299m0567M721J3750Q675
10431F0356j1685K3484J7099m253K3375l4102j1221J0248n0942l0658K3693J9325
10419C4719m650l9501j7062k4870J0650J0263J82P504K2713m152N1694j2459m0612
10406e581q992K9261L0712n1207l778K812L9938n321j6042K6949O626k067l0579
10393A2731o342O348j0344m775P867K8207n807n0009Q554M9326k598l5465q195
10380a0502L715K0724R554k2882J7961L2847l3081k5484J5770r463l7451k6633
10368f4925K3077L2757K4105J8001K20k120j5358J4052J6226j1077j1686K0129
$$ y = [19746, 47284, 62348, 75238, 61195, 54820, -14254, -21882, 3322, 18763, 13987, 11398, 11049, 10070, -25812, -43658, -30196, -3293, 57962, 112088, 117076, 73777, 33210, 37931, 51681, 60356, 48671, 72155, 89254, 85001, 108376, 74274, 63053, 73301, 22359, -8299, 15394, 34719, 30069, -9432, -26494, -51364, -40714, -30451, -30269, -22765, -52, -4204, 47490, 35031, -5581, -14573, 14688, 45400, -5807, -9585, -6773, 33165, 27844, 11802, 38751, 45377, 43310, 12731, 6389, 12737, 2393, -2382, 5485, 33692, 27885, -22124, -13570, 35756, 33158, -2307, -10502, -6787, 13937, 23491, 609, 18570, 51417, 18336, -7148, 8622, -841, -38292, -64925, -41848, -9091, 15014, 33015, 33235, 31115, 15757, 29809, 46035, 34958, 23272, 43401]
10356D3401l7861M902J5649j2099r250j133k2843j5348M1933J5725j7049L6109
10344D2136K8895k2748J2728o565k7139j1394p619r594K727j9032l9222j673K7022
10331c1478L2988N3183L2957j7528j3297L4600k582L617K8452k3292J86L7307
10319A35113o287l6o104j7512k5280m2722J2066p134l04N769q674n538K5019o091
10305E2285j2398J2883p09r321j0356j0189J9889M444q970m6081M382L3008K6261
10292E5128L4981J2948l7503L0662K3878m208K3094L342M4645Q3856K7889K640
10280C01352Q487K1441O5536K0176P685k0196m0856p2765k8632K1414o2474o2766
10268A58402o1306j3048j4488l035k8305j2860L0894Q477l907K2933L2860J2582
$$ y = [43401, 5540, 10442, 26091, 13992, 4742, 3609, -19234, -34582, 7351, 23076, 6027, 42136, 71031, 48283, 61011, 54446, 27307, 15913, 8294, -1300, 1427, -17605, -56827, -58500, -31478, 1510, 54693, 87650, 70122, 56825, 91425, 88843, 92460, 120912, 97620, 97806, 135113, 128826, 128790, 122686, 105174, 79894, 37172, 49238, 42104, 41800, 47569, 38895, 33357, 58376, 52285, 39887, 52770, 52061, 42740, 32384, 22195, 42084, 46528, 37558, -8523, -4141, 28867, 55128, 90109, 103057, 65554, 96216, 120094, 115886, 138980, 142322, 186967, 270823, 298712, 301352, 309839, 331280, 396816, 416992, 424677, 404481, 363625, 290860, 262228, 283642, 221168, 158402, 97096, 84048, 69560, 66525, 38220, 25360, 56254, 64731, 60824, 83757, 116617, 129199]
10256A29199m8076l7443L0818o86J8407m6940l0953N1598k2751P790J611K1841
10244G4415Q075Q412R2365Q2725L2952N2313M6158K8878O4553Q9020N7476J0653
10232F47995K8074r6229p5048n1864o7656o2725p1019m1305n7828m0205J0360
10221A22550J2685J6996m262m3518l1932o328Q031L6973Q276P908K789o661p105
10208A16402l542q966j5209m97o046k013M7170K5947L0738J5206l2561k3782J6623
10195A59470O2421J15445O8946L6434N2361J1634K8887m7691o0076l4353r1897
10184C01581q5698m4409l2974m9250j0095L7741P122j9032r641k5292k5493K599
10172D7159L9170M425m7224m2564J1259l24k9460j2501K154k9905O4888O7491
$$ y = [129199, 81123, 43680, 74498, 73812, 92219, 45279, 14326, 65924, 43173, 50963, 52574, 74415, 82490, 90902, 183267, 265992, 298944, 351257, 397415, 426293, 490846, 579866, 637342, 647995, 676069, 579840, 504792, 452928, 385272, 322547, 251528, 210223, 152395, 112190, 122550, 135235, 152231, 147969, 104451, 72519, 66191, 74222, 111195, 119471, 127379, 130168, 123507, 116402, 112860, 103894, 88685, 88188, 82142, 80129, 127299, 153246, 183984, 199190, 166629, 142847, 159470, 221891, 337336, 406282, 442716, 495077, 506711, 535598, 487907, 427831, 393478, 301581, 215883, 171474, 138500, 89250, 79155, 116896, 124018, 104986, 95345, 70053, 44560, 47159, 86329, 90754, 43530, 966, 12225, 11901, -17559, -30060, -27906, -57811, 7077, 74568]
10160G4568L7746K3960M4955j6772k3242k9099Q561j0364l3244J2318O0882L7575
10148A87844J637r516j6177J9797l5155J669J4386j707p335k8547k360J2316m3615
10135I3237l3076k1604k743k0964j798J744k221L538N6986K5116k5456M1336J7021
10122A31116l7176P595M9645k2569N205j4193r024N627k0276j0695j1945K693
10110G6003O273L8115O179J0912j2559m5536k6300Q711M0349J6548j0944K7915
10098A35666J5409J3906l3979j3788j0023j2306Q382j9197m199k292J5787N490
10086I8856J127J4294J2779N800K6929J6713j0441L6304J3483j3414K0162n495
10074B17097j8098J0894K9642k8323k6194l839k1628k0475P497m2572j3593K4960
$$ y = [74568, 112314, 136274, 181229, 164457, 141215, 112116, 120677, 110313, 77069, 89387, 150269, 187844, 189481, 179965, 163788, 183585, 148430, 150099, 164485, 162778, 155443, 126896, 124536, 136852, 93237, 60161, 38557, 35814, 14850, 13052, 14796, 12575, 16113, 73099, 98215, 72759, 114095, 131116, 93940, 101535, 151180, 128611, 133816, 119623, 110599, 116226, 95950, 85255, 73310, 76003, 82276, 120391, 126570, 137482, 124923, 79387, 53087, 61798, 102147, 118695, 107751, 135666, 151075, 164981, 131002, 117214, 107191, 94885, 103267, 84070, 79871, 77579, 93366, 98856, 99983, 114277, 127056, 132856, 159785, 176498, 166057, 202361, 215844, 202430, 222592, 217097, 198999, 209893, 239535, 211212, 185018, 181179, 159551, 139076, 146573, 104001, 90408, 115368]
10062A15368L5610L0282k74J2863j9409n3079j8406j3905J0759L823k5379l843
10050G4410N4212J6969J2360K654J2394J8440R255l4828m4658j354r920Q649j7792
10037A00791k6356N910P826O0007K6995J330j5355R302r310L503q625o72m3994
10024A11352k0077j1035K5860O1667K3559M9050N540n5984m9191k7906J2218j6787
10012A08266p101n689p188M0457J8935Q245J9877J6765L072j005K4750N213j8895
9999B05702m5322m8633k8389K3294J6594M291K2826J179k5566r760J3669o838
9987A23047M7415J5702j4279J9304L5083p216m9373j4964K7331O4242K6566k758
9975B70100M05j5238K3118O232J6738k5576k8492j2893j4885m0815m3680j9355
$$ y = [115368, 150978, 181260, 180986, 193849, 174440, 121361, 102955, 89050, 99809, 103632, 78253, 74410, 128622, 145591, 157951, 160605, 172999, 191439, 200694, 165866, 121208, 119854, 109934, 118583, 100791, 74435, 80345, 88171, 148178, 175173, 176503, 161148, 170450, 161140, 164643, 156018, 155346, 111352, 91275, 80240, 106100, 167767, 191326, 240376, 245916, 189932, 140741, 112835, 125053, 108266, 101165, 95476, 88288, 128745, 147680, 155925, 175802, 192567, 195639, 194634, 219384, 224597, 205702, 160380, 111747, 83358, 106652, 123246, 127537, 150363, 151542, 125976, 116216, 129885, 123047, 170462, 186164, 171885, 191189, 226272, 219056, 169683, 154719, 182050, 246292, 272858, 270100, 270505, 255267, 278385, 284617, 301355, 275779, 247287, 234394, 219509, 178694, 135014, 115659]
9963A15659Q1438N9975n444J0224L7099R905k1409K1818M2676L66n396j2785j510
9950C32616L9989l65N2228M7097J5306R334O5929M7418L9957J86O595k4868J5176
9937F46598N7000R8399J09595M7266L9153M5187N6358R9907J61681J08249O1500
9926A530893P8669M0198J3720J2940l5559R005l233m1671o8488m5082p140r995
9914A474257n0212o3584j9085N2073O7910J28588J55215J56473K14042L54804
9904B470481M60495N28112M38896K59714Q4950Q6647O3397M1546q7350j56852
9894D190036k33406k66662k35260k40414k29332j29998j17697r7138p0660Q470
9884B577939L5279Q6197J02392J62295K05109K03881K50665K19851L31014L87241
$$ y = [115659, 197097, 257072, 251628, 261852, 298951, 308856, 287447, 309265, 351941, 352307, 346911, 334126, 332616, 372605, 372240, 424468, 471565, 486871, 496205, 562134, 609552, 649509, 649695, 656290, 631422, 646598, 703598, 801997, 911592, 958858, 998011, 1043198, 1099556, 1199463, 1361144, 1469393, 1530893, 1609562, 1649760, 1663480, 1676420, 1640861, 1649866, 1646633, 1604962, 1536474, 1491392, 1484252, 1474257, 1424045, 1360461, 1341376, 1393449, 1461359, 1589947, 1745162, 1901635, 2115677, 2470481, 2930976, 3459088, 3897984, 4157698, 4242648, 4329295, 4392692, 4434238, 4346888, 4190036, 3956630, 3689968, 3454708, 3214294, 2984962, 2854964, 2737267, 2640129, 2569469, 2577939, 2613218, 2699415, 2801807, 2964102, 3169211, 3373092, 3623757, 3843608, 4174622, 4561863]
9874D561863M04394M95815N71821P24425R95821J333309J788121K458169L338451
9865A6672189M339187N594783O944208P840501P325335M230461p9572l165929
9857D9701163m937525n834258n722761m805293l494742k132653q06997J93319
9849B2160253P97733J279033K043398K863200L314782L405603L436728L286289
9841D2587019K664488J861138J289617P27774J0779n77797r52332j235798j577894
9832D4796994j967737k026733j789308j445652r44280j47732J081624K845977
9824D0403153N249031Q504917J2674516J7081929K0444617J9756561J1722654
9817A35837378k34233q899181j3834891j6660773j6735859j4339281j0996539
$$ y = [4561863, 4966257, 5462072, 6033893, 6758318, 7754139, 9087448, 10875569, 13333738, 16672189, 21011376, 26606159, 33550367, 41390868, 48716203, 52946664, 52867092, 49701163, 44763638, 38929380, 33206619, 28401326, 24906584, 22773931, 21966934, 22160253, 22957986, 24237019, 26280417, 29143617, 32458399, 35864002, 39300730, 42587019, 45251507, 47112645, 48402262, 49130036, 49140815, 48563018, 47610686, 46374888, 44796994, 42829257, 40802524, 39013216, 37567564, 36623284, 36475552, 37557176, 40403153, 45652184, 54157101, 66831617, 83913546, 104358163, 124114724, 135837378, 135603145, 126703964, 112869073, 96208300, 79472441, 65133160, 54136621]
9810E4136621p699247m886941k664377r53926K04183R11717J234638J369341J554893
9801D3206902J733206J718551J500292J036334M84395J26345k87475j237463k324178
9792D5956909l364470m171145m490164m272864l667678k905953k017540j206886
9784A9860209l93117M37222J336377K374102L615240M995257O107458O337109
9776D4669857M722601J258356k279066m676336n997328o386878n920658n007736
9768B0382812l879286k880590k183281j644888j227159r16541p71239n99970n17829
9759E762029m37725m24239l78413l12491k93347k46737k23115j98145j44160r4404
9749C009253q8009r4984m2164N095O5109R7147J37846J81525K52032K17042J83048
$$ y = [54136621, 46437374, 41550433, 38886056, 37932130, 38136313, 39048030, 40282668, 41652009, 43206902, 44940108, 46658659, 48158951, 49195285, 49679680, 49806025, 49518550, 48281087, 45956909, 42592439, 38421294, 33931130, 29658266, 25990588, 23084635, 21067095, 19860209, 19467092, 19904314, 21240691, 23614793, 27230033, 32225290, 38332748, 44669857, 49392458, 50650814, 48371748, 43695412, 37698084, 31311206, 25390548, 20382812, 16503526, 13622936, 11439655, 9794767, 8567608, 7651067, 6879828, 6279858, 5762029, 5324304, 4900065, 4521652, 4209161, 3915814, 3669077, 3445962, 3247817, 3103657, 3009253, 2921244, 2826260, 2784096, 2789191, 2854300, 2951447, 3089293, 3270818, 3522850, 3739892, 3922940]
9738C922940J14551L8966N9166k5630k00625l34560m29608l73910l40556l09248
9728B121486k30545j91628j27064j11530n8432l1767j9382k5386J6768M1469O852
9717A390841K2402L700N164L8738K8153L5935Q116J3579N892m8536o9286p4617
9705A360081q1227r6864j33805r5994l9805l3033j554l902k8807m4933j11929
9694F88228p8058o6850p2087o3585k5781q06l734n0016l8198R805L6205J0830
9682C45953k2615k8269J847j2882j8757R917r707k483j9730o033j225L1236j5474
9669B51778l3361l8600j3164J5271p244j4344K3360L9701k4601k5460q290j2772
9657A52274k4296K8021J347J6472M0018j2316l9649j0024k6626m540m572j8783
$$ y = [3922940, 4037491, 4076457, 4135623, 4109993, 3909368, 3574808, 3145200, 2771290, 2430734, 2121486, 1890941, 1699313, 1572249, 1460719, 1402287, 1370520, 1351138, 1325752, 1342520, 1383989, 1390841, 1413243, 1416943, 1422107, 1460845, 1488998, 1524933, 1533049, 1546628, 1552520, 1503984, 1434698, 1360081, 1278854, 1181990, 1048185, 952191, 912386, 879353, 877799, 873897, 845090, 800157, 688228, 610170, 543320, 471233, 407648, 381867, 381061, 377327, 327311, 289113, 298918, 335123, 345953, 323338, 295069, 296916, 284034, 265277, 275194, 265487, 263004, 243274, 237241, 236016, 267252, 251778, 218417, 179817, 166653, 181924, 174680, 160336, 183696, 223397, 198796, 173336, 165046, 152274, 127978, 155999, 157346, 173818, 213836, 201520, 161871, 151847, 125221, 120681, 116109, 97326]
9645I7326k3323l0878K8353M5144M2507L9912j7271m9800n0138r2464n4722n722
9633g1076O2023N0935K3147M1695M1117R253k4280o3694n0982l1591j833L4763
9621A9477M5394M054n046N395k8198l8039M006K5661J1960N0232J1989r869k6453
9608G0563j0337K5709r884o405k1324j212j0013j6449j345N6200r392l2729J4501
9595D7883p016j7475L3624O795L824j4460J3513K9631R672j0770n941k5043k018
9582F2219J4546q388l3295m3389j5800N937K2917J9257K0030m962l3J0303k1991
9569B7351K5517k5939m9093m679L7726j7366j0132J3269j2523k8266N0658J8971
9557B5494k338J2992M6829K1669J3167k0483o6009j9769J2018m356J0709j3121
$$ y = [97326, 74003, 43125, 71478, 116622, 159129, 199041, 181770, 131970, 81832, -10632, -65354, -71076, -9053, 41882, 65029, 106724, 147841, 157094, 132814, 69120, 18138, -13453, -15286, 19477, 64871, 68925, 63879, 69274, 41076, 3037, 7043, 32704, 44664, 94896, 106885, 97016, 70563, 60226, 85935, 76051, 69646, 48322, 47110, 37097, 20648, 19303, 75503, 66111, 33382, 47883, 40867, 23392, 57016, 63811, 67635, 53175, 66688, 96319, 105991, 95221, 89280, 64237, 62219, 76765, 68377, 35082, -8307, -24107, -18170, 4747, 24004, 44034, 39072, 39039, 49342, 27351, 52868, 26929, -22164, -26843, 10883, -6483, -16615, -3346, -15869, -44135, 6523, 25494, 23156, 36148, 82977, 104646, 117813, 97330, 31321, 11552, 23570, 19214, 29923, 16802]
9545A6802j7621K3658j0446o795N965R628L5207l3036J3707L0751k4749l6083
9533F988l7985m162R574R720l811N57N6130m529k8244O6225J3156K5430o803m5634
9519E6612K005J9026M527l0159j7189K791n092j2682N250l1922J1273L6869P508
9506D8817J1892n216N756k0201K6337j8691l6293j2248j361K5388M5306l5555
9494C3931J8946l326j2901K9115K610l351l3961J6568L9018K4236L6584r667M1165
9481A78967M6359r52j8946n4542m56q756j0873q960j0698k7752j1594m2801k1109
9468G887M6292K3051n543J9077K7753j6297J2321K45j350l0894k26J0432M913
9455I7661k0838k5972r040K0205Q587N865J0004M1124M4101K8475K6535j905K8598
$$ y = [16802, -819, 22839, 12393, 5598, 11563, 21191, 56398, 23362, 37069, 67820, 43071, 6988, -30997, -35159, -25585, -15865, -19676, -19119, 37011, 32482, 4238, 70463, 83619, 109049, 102246, 56612, 58617, 77643, 82170, 52011, 34822, 37613, 32521, 19839, 25089, -6833, 4440, 41309, 48817, 60709, 55493, 61249, 41048, 67385, 48694, 12401, 153, -1208, 24180, 69486, 33931, 52877, 49551, 36650, 65765, 68375, 65024, 31063, 47631, 86649, 110885, 147469, 137802, 178967, 225326, 224374, 205428, 150886, 150430, 141674, 130801, 121841, 111143, 83391, 71797, 28996, 7887, 54179, 77230, 71687, 90764, 118517, 102220, 114541, 114786, 113436, 82542, 82316, 92748, 97661, 76823, 50851, 41811, 62016, 70603, 76468, 86472, 127596, 171697, 200172, 226707, 224802, 253400]
9442B53400O0940N6476L6817L3231M1005q627j2327j4380n8382m9986m9214l1758
9430B57195k2614m0673n4640o0000M285K7142k4588l4716K7331J7037K8313l1196
9418I2876m0107k2874K6887K3660J3063j500K4440M6918j0172m3724m3421P042
9406G3088M3692J4426N286p213K7824J8912Q6237J27382R5074J07922P8592Q972
9394F80194j512n2402l2857o3605n5962l0642k7927n9496m5673o9048m9537M378
9382A95911O619m7535q379J328N7358k8937q2142l4844k1620M9440L1100l1788
9370H6511k3380M3309K1534k5588J0176P089m2561j9181K5462J9468p226O424
9358A02037J8451R1190M8831L9808M9072N0081J3666L258j1416l8568p6578l7561
$$ y = [253400, 314340, 370816, 407633, 440864, 481869, 473242, 460915, 446535, 388153, 338167, 288953, 257195, 234581, 193908, 139268, 79268, 83553, 110695, 86107, 51391, 78722, 95759, 124072, 92876, 52769, 29895, 56782, 80442, 93505, 92005, 116445, 163363, 153191, 109467, 66046, 73088, 116780, 131206, 136492, 129279, 157103, 176015, 262252, 389634, 484708, 592630, 671222, 680194, 678682, 626280, 593423, 529818, 473856, 443214, 415287, 355791, 310118, 241070, 191533, 195911, 202530, 154995, 146616, 147944, 205302, 176365, 94223, 59379, 37759, 87199, 118299, 86511, 63131, 106440, 127974, 102386, 112562, 119651, 77090, 57909, 83371, 102839, 95613, 102037, 120488, 211678, 260509, 300317, 349389, 399470, 413136, 416394, 404978, 366410, 289832, 252271]
9346B52271l5627n5981n051k0560k4350k1744J0923R782q533j1118k9117o830
9334E4065J5132q252l4673J5499J8751l0871j1130K5549m8145j6310J7572L332
9322E19L5969j1580n2232n249L0341M2851l2290j7264L4430J01316M0443k8533
9310A38721m5404J8966J6544k891M9705l022o2388m6898J5151l3490m2778M1570
9298D3786J8376L548o243m3284j2081J2933M2963l149n1421j5068L1412o287j2564
9285B921J324k297k2338J0188J4252l748K0151J5447K9278m893k4634j9053m798
9272A1800M4585J1006j2868k5850k6058J6593J6923m1117J899P1059L8855l5611
9260G1216j7165R535k7291k0475j1466m3016l0315K3801J3827J6943j031J435
$$ y = [252271, 216644, 160663, 155612, 135052, 110702, 88958, 99881, 109663, 101130, 90012, 60895, 54065, 69197, 60945, 26272, 41771, 60522, 29651, 18521, 44070, -4075, -20385, -2813, 519, 36488, 24908, -27324, -32573, -2232, 40619, 8329, -8935, 25495, 126811, 167254, 138721, 93317, 112283, 128827, 125936, 175641, 172619, 110231, 63333, 78484, 44994, 2216, 43786, 62162, 65710, 59467, 16183, 4102, 17035, 59998, 56849, 5428, -9640, 21772, 15485, 2921, 4245, 1948, -20390, -10202, 4050, 302, 20453, 35900, 65178, 60285, 35651, 16598, 11800, 56385, 67391, 54523, 28673, 2615, 19208, 36131, -4986, -3087, 67972, 106827, 71216, 54051, 63586, 36295, 15820, 4354, -38662, -68977, -45176, -31349, -14406, -15437, -14002]
9248a4002K5536K6047J5577O557L9720q376j1879n1666m305J2400O487L0090J1668
9235H3854Q658J2432l7202m3132l022K6870M8663N234m5525j3514J2058l390j4963
9222C7021j4525J5919K8451O7693j7026m2398j7844k2028r555J5751K5954J6221
9210H3634L0279r981R800l8826N610L4242K3755M321l494k3951l2111K4229J0226
9197A17733J2044j7093j0923k7944j1041J7810k610P251m040j1469j3613m561
9185E1544N2298K2220n5139k8818L9137K6360K5673o113J5463K4982K857M009
9173A74473K7899K7565K382K0981N153j6153l3482J8423L9127J9781l515J9611
9161C02245K6521k7576P0255L4317K0784J9640K610J7597K8260M5919L4579Q8895
$$ y = [-14002, 11534, 37581, 53158, 59715, 99435, 91059, 79180, 27514, 23209, 35609, 42096, 72186, 83854, 92512, 104944, 67742, 24610, 21588, 48458, 97121, 102355, 56830, 43316, 55374, 51984, 37021, 22496, 38415, 66866, 134559, 117533, 75135, 57291, 35263, 25708, 41459, 67413, 83634, 113913, 103932, 113732, 74906, 80516, 114758, 138513, 142834, 139340, 115389, 83278, 107507, 117733, 129777, 112684, 101761, 73817, 62776, 80586, 77976, 85227, 81187, 69718, 56105, 51544, 103842, 126062, 70923, 42105, 81242, 107602, 133275, 127162, 142625, 167607, 170464, 174473, 202372, 229937, 232319, 253300, 258453, 242300, 208818, 227241, 266368, 286149, 282634, 302245, 328766, 301190, 371445, 405762, 426546, 446186, 448796, 466393, 494653, 540572, 575151, 664046]
9149F64046R8992J06161J04720Q9412O7469J12673J58302K15557K29971K69263
9139B116566L23628M37996N81608P37262R49256J342171J871684K600425L837624
9130A4798220N411953O555606N481510J576880k055079l750153m508302m805503
9122A8705132m336551l355872k428262j696159j216409r54030p17845n54228m49448
9113B996328l69665l08006k41549j88438j71533j88904j16924j07919j19018r3424
9103A090948q5647m0144p6988o8145m7401q1259r2909k2555N1058j8977q1214
9092E26767m2272n0026q729k3821k1492k2550J4654m8871j2616j6211l2930l990
9080B57913k0514J5392P92M82Q758n91j2558n8517m3753k2579J8669k0863k3235
$$ y = [664046, 763038, 869199, 973919, 1063331, 1130800, 1243473, 1401775, 1617332, 1847303, 2116566, 2440194, 2878190, 3459798, 4197060, 5146316, 6488487, 8360171, 10960596, 14798220, 20210173, 26765779, 32247289, 33824169, 31769090, 28018937, 23510635, 18705132, 14368581, 11012709, 8584447, 6888288, 5671879, 4717849, 4000004, 3445776, 2996328, 2626663, 2318657, 2077108, 1888670, 1717137, 1528233, 1411309, 1303390, 1184372, 1090948, 1005301, 965157, 888169, 820024, 772623, 691364, 598455, 575900, 626958, 607981, 526767, 484495, 434469, 425740, 401919, 380427, 357877, 372531, 323660, 311044, 294833, 261903, 257913, 237399, 252791, 253583, 254065, 262823, 262232, 249674, 191157, 147404, 124825, 143494, 122631, 99396]
9067I9396N44K9104L5384K6913k3875m5214k5089K351N3977J6191o3124l9959
9055F6599l0159M381j1699K2810n962N837p212m465J2331K1353o064k4845Q313
9042E1218J0209K9873n1488r011k4860K6301L8584j0948O399k9286j4033M6189
9030F9147K2955p4513O080K2173k2562k6368M6531K5960p133L1524K5975j8757
9018A01012Q152k3104m7247k8362m8747J3642O4261L88j5134J0131j0397L1032
9006E5627N978K0876J7084P817P806j2253m0487L4020j8751l5780L7614J5852
8994I5403l8632M778j9353k1502j6058j3248J8005K2174J1272k0649j7338J0851
8982A5703r174J2789j9874N174M9768J4601j3957k5229j3932M474K008k4074K1878
$$ y = [99396, 99940, 129044, 164428, 191341, 167466, 122252, 97163, 99514, 153491, 169682, 106558, 66599, 36440, 40821, 29122, 51932, 45970, 51807, 44595, 40130, 52461, 73814, 67750, 42905, 51218, 61427, 91300, 39812, 30801, 5941, 32242, 70826, 59878, 66277, 36991, 22958, 69147, 92102, 17589, 23669, 45842, 23280, -3088, 43443, 69403, 62270, 93794, 119769, 101012, 109164, 86060, 38813, 10451, -38296, -24654, 39607, 39995, 24861, 34992, 24595, 55627, 61605, 82481, 99565, 107382, 115188, 102935, 62448, 96468, 77717, 41937, 79551, 95403, 56771, 61549, 42196, 20694, 4636, -8612, 9393, 31567, 42839, 22190, 4852, 15703, 6529, 19318, -556, 4618, 54386, 68987, 55030, 29801, 15869, 20343, 22351, -1723, 20155]
8969B0155j5433j0986n697j3373J0531K4309p63q056k8885K0814K8323j869o601
8956A2469Q216j878l1357p934n7113J6779M6337K8491m2000R706j7138J7486j1319
8943b9255l034J600j9560l7825K1022N9567l678L3438M4644o070q617J1750k0353
8930D3629k5980j4753q851k3747L3710P571L1769k9339J098K9200L350m414m9335
8917f092k7287J1873L8164K6201Q909j4436k2519j5033N5074j6574k9243N3263
8905F2300k7571l0202K5916N5848k826p8416l6539l759o765m5426K0100J9081
8893d8259k944J7176L1458o810o2925k2092J7216J323O13j8063n730j159M4262
8880e5934L8171J5290j3790K277k1698j3235J4233J0792P873J1943m4685j9976
$$ y = [20155, 4722, -6264, -11961, -25334, -14803, 9506, 8743, 687, -28198, -7384, 20939, 19070, 12469, 20685, 18807, -12550, -20484, -77597, -60818, -14481, 14010, -27990, -18284, -35422, -17936, -29255, -32289, -30689, -50249, -88074, -67052, -7485, -11163, 22275, 66919, 60849, 52232, 63982, 43629, 17649, 2896, -5955, -29702, 4008, 11579, 43348, 14009, 15107, 44307, 47657, 43243, -6092, -33379, -21506, 16658, 42859, 51768, 37332, 14813, -220, 54854, 38280, 9037, 62300, 34729, 4527, 30443, 86291, 83465, 5049, -31490, -35249, -42014, -87440, -67340, -48259, -51203, -34027, -2569, -9379, -72304, -94396, -77180, -75857, -75244, -93307, -99037, -100196, -55934, -17763, -2473, -16263, -13986, -35684, -48919, -34686, -23894, -16021, -4078, -48763, -68739]
8868f8739K9611M7541j9608l2070K345K4738M3979o444r276L3127M8775p946k1768
8855F4265K5673k175l8502m4135L6570r212n9591l7490K0062J4511K0055j7204
8843b7173n484J1137o947K7158M6905J5694J0785k8363P770K0395M198j2260j5247
8830D8568j4059k3703k4989j1717M0337L6247J0204l7628m4388R606j6008j0151
8818c7681M1108j6808J672M0700L7609m2038m8782J4903J4112r07L86L5982O509
8805D6765j1088M410r884K2838m03n1544k8501j2068M8845K3954m0912N037L3709
8792C1158J281j7182o537m496j5434l7622L0921M9105K634N736n7555k1750N2031
8779A2290K7159p992k1744j0345J4837m8048k6956O8910K5130k2737N4626L5624
$$ y = [-68739, -39128, 8413, -11195, -43265, -40920, -16182, 27797, 21353, 12077, 45204, 93979, 86033, 64265, 89938, 87763, 49261, 5126, 41696, 32484, -27107, -64597, -44535, -30024, -9969, -27173, -32657, -21520, -28467, -1309, 45596, 61290, 72075, 43712, 51482, 71877, 76075, 63815, 48568, 34509, 10806, -14183, -25900, 14437, 50684, 60888, 23260, -21128, -11522, -27530, -37681, 3427, -13381, -11709, 28991, 66600, 24562, -24220, -9317, 4795, 3888, 4274, 40256, 46765, 35677, 40087, 30203, 53041, 52638, 1094, -27407, -39475, 9370, 33324, -7588, -2551, 31158, 32439, 15257, 8720, 4224, -11210, -48832, -17911, 31194, 33828, 39564, -17991, -39741, 12290, 39449, 31457, 9713, -632, 14205, -33843, -60799, 8111, 33241, 10504, 65130, 100754]
8767A00754j3684K8835M5547k2381o2796k4412k7579k9793r896K9866J5351Q679
8755C8491n692k552j1112K281r202K5160J3733J1595j8840m7947L1907R323M657
8742D1802O819m599J8897j3030k9615q0584m8582K7510L5572L4654k2903m7432
8730h1491J0899L8925n829M9519L3442o4957j3302O896R298N3007O563L358l521
8717D2807j4418m443l2749j4221L0550K7083j2612o2011k4114L9646L4524K5851
8705C5893m8376j1846J2567K5253M1941L3850J4604l4750k9334J4928Q911j0284
8693E3357L198J6456N163R185J1220j1725j8739k543K2203k0873j8385k3314j0363
8680A4840j688O176L6957N1177J6778j9236l4002J3070L6236J6397k6170o153
$$ y = [100754, 87070, 115905, 161452, 139071, 76275, 51863, 24284, -5509, -15405, 14461, 29812, 38491, 32799, 30247, 19135, 21416, 12214, 37374, 51107, 62702, 43862, -4085, 27822, 37145, 41802, 48621, 44022, 62919, 49889, 20274, -60310, -108892, -81382, -45810, -11156, -34059, -81491, -70592, -31667, -37496, 12023, 45465, -19492, -32794, -25898, -16600, 36407, 42970, 46328, 42807, 28389, 23946, -8803, -23024, 7526, 34609, 21997, -40014, -64128, -24482, 10042, 35893, -12483, -24329, -11762, 13491, 55432, 89282, 103886, 69136, 39802, 54730, 63641, 53357, 56555, 73011, 78174, 87359, 98579, 86854, 68115, 65572, 87775, 66902, 48517, 25203, 14840, 13152, 19328, 56285, 107462, 124240, 105004, 71002, 84072, 120308, 136705, 110535, 104382]
8668A04382j9288p011J52m7507l2578j3425k7933k450J7793k530K1455L1602K3685
8655D6347M8020N7180J3416J643N2578Q1088J53864K18825J4841j01993j08335
8644D77474q4745p1495m5818k8867n779p785m2323K763k6192k2948l5071O932
8632A16146M8215j4987K9314p07l7390n5824J4929L1751l7605L2776L5797M35
8620A62850K0420L2592p040l46J3352j7041j4568J4910N8513k157J366J5715L2996
8607C11562O7955M7159J48119K97925M03702J30163j65493j50177j72032j56054
8597G62829j82965j22514o5121n3041r3006k9296j4309L7895M4775K621n7987
8586B29881j1985k107k3333m9270k4857J5240n3641n250L03o8304k1167M0959
$$ y = [104382, 85094, 78083, 78235, 30728, -1850, -15275, -43208, -45658, -27865, -30395, -8940, 22662, 46347, 94367, 151547, 164963, 166606, 219184, 300272, 454136, 672961, 687802, 585809, 477474, 392729, 321234, 275416, 246549, 240770, 232985, 190662, 193425, 167233, 144285, 109214, 116146, 164361, 149374, 178688, 177981, 140591, 84767, 99696, 131447, 93842, 126618, 162415, 162850, 183270, 215862, 208822, 208476, 221828, 204787, 190219, 205129, 263642, 261485, 262851, 278566, 311562, 379517, 426676, 574795, 872720, 1276422, 1406585, 1241092, 1090915, 918883, 762829, 579864, 457350, 392229, 339188, 246182, 216886, 202577, 240472, 285247, 287868, 229881, 217896, 215789, 192456, 143186, 118329, 133569, 79928, 74678, 74981, 6677, -14490, 26469]
8574B6469K5111k820k6388m6780l9721J7852L3774M068K4152j2864L549P3859
8562H0261O1529K5377M0550J47199J53726R8498m5987j01568r7860j08884o9377
8551A83464m2893j794k385o4284n9710L1520L6312k5096j458n023k0975Q437o759
8538B9356O118J2005L5157l821n4366p664L7464j2191p494k3989J039L158k2853
8525h081J393K4271M2043r475n4293M246N987q113J4840J449L410m097j1672o0787
8511e8879K7609K4940R117o725K8525k7415k6904L1851L2580M9340j5643k8758
8499C9638L4111M11l1648j3583j8308K498p524K2443L3145K8811k192n7795Q227
8486C8234J0274J8745j6981P42q048k1145r045j4013J3757m0021J3440L8897n2832
$$ y = [26469, 51580, 48760, 22372, -24408, -64129, -46277, -12503, -8435, 15717, 2853, 6402, 80261, 141790, 167167, 207717, 354916, 508642, 607140, 561153, 459585, 361725, 252841, 183464, 140571, 138777, 136392, 72108, 12398, 43918, 80230, 55134, 53676, 48653, 27678, 36115, 29356, 35474, 47479, 82636, 78815, 24449, 16785, 54249, 42058, 34564, 10575, 11614, 14772, -8081, -6688, 17583, 59626, 50151, -4142, 104, 6091, -2022, 12818, 14267, 17677, 13580, 1908, -58879, -31270, -6330, 2787, -3938, 24587, -2828, -29732, 2119, 34699, 84039, 68396, 39638, 73749, 74160, 42512, 28929, 10621, 13119, 5595, 28038, 61183, 89994, 87802, 30007, 38234, 48508, 67253, 50272, 51014, 42966, 21821, 12776, -1237, 12520, -27501, -14061, 24836, -27996]
8473b7996j3280J0898k634J5094k1421K443L4798k3248l1350k6637L946M5389
8461c3998J4830K2848J6712J3911l3169k083k6074l9353j512M4788M3616J5214
8449C5730k4770k4850k5005o595J4814o988K9590L9400N109j6689k6982j1237
8437a8473J1979M4584O493j0287m6405K8537j4984Q294J0779k3758m2944J5759
8425c0426Q820K1783Q424p114N1801J5714m794j5472o7799k3596K6843J2041l145
8412f920p543J1821M485J966N325l0943n0436M5202K0301j7774M188J8010j3941
8399a6259K2625k220K1064j4251K5303K0084P134j5550n688O158K1686N183m6880
8386B8389n0732J1288M8178L5075L7197k9026m3014m004k0032K6118Q593j0108
$$ y = [-27996, -41276, -30378, -33012, -17918, -39339, -36896, -2098, -25346, -56696, -83333, -79387, -33998, -19168, 3680, 20392, 34303, 1134, -949, -27023, -66376, -67888, -23100, 20516, 35730, 10960, -13890, -38895, -45490, -30676, -37664, -8074, 31326, 36435, 19746, -7236, -18473, -6494, 38090, 44583, 34296, -12109, 16428, 1444, 9738, 20517, -3241, -46185, -30426, -21606, 177, 8601, 1487, 53288, 69002, 64208, 48736, -19063, -42659, -15816, -3775, -6920, -14463, -2642, 1843, 3809, 9134, -21809, -72245, -27043, -6742, -24516, -20328, -2318, -16259, 6366, 4146, 25210, 10959, 36262, 56346, 63480, 47930, 42242, 48400, 70086, 75269, 28389, -22343, -11055, 37123, 72198, 109395, 80369, 37355, 33351, 13319, 39437, 48030, 37922]
8374C7922L1789j0314l0159L466j7337l6261L4986K9382J5345P564r072k039m421
8361E0851k9864m0490O170L155m6541k6211K6023M8542J1394J857j3292l4079
8349d2485m1935L0610N0323J6784P265l8140K8440J0440o035j3023k3593j508
8337b2857R475J2311J9208r957J5748j5003j1046J6777K3618K4200k0861l459
8325C8154j402j7663j1617m72j5958l4910K9230M3404k1049l3158N045n090l3291
8312e8777k782P722J9820J175J1119K3557L838N0069J5146k477K031n4679l1760
8299a5998P036K7084K3371j3385J0161K0766k5794n2978k1675M7272K6947l4688
8287a881j8878K2614J5488j2553k2882j2066L0065k9962q938j7190P536J2182
$$ y = [37922, 69711, 59397, 29238, 32704, 15367, -20894, 14092, 43474, 58819, 66383, 57311, 55272, 50851, 20987, -19503, -13333, -10178, -56719, -82930, -56907, -8365, 3029, 4886, -8406, -42485, -84420, -53810, -3487, 13297, 20562, -17578, 10862, 21302, 15267, 2244, -21349, -22857, -13382, -1071, 18137, 8180, 23928, 8925, -2121, 14656, 38274, 62474, 41613, 38154, 36752, 19089, 7472, 7000, -8958, -43868, -14638, 28766, 7717, -25441, -20396, -25486, -58777, -61559, -53837, -34017, -32842, -21723, 1834, 5672, 55741, 70887, 68410, 70441, 15762, -15998, -8962, 18122, 41493, 28108, 38269, 59035, 33241, -19737, -41412, 5860, 32807, -1881, -20759, 1855, 17343, 4790, -18092, -30158, -93, -30055, -38993, -56183, -48647, -36465]
8275c6465J3132R1036J7962o9543n4840J2692J2270m165j0759M3464j0856k2848
8263a8920J3087k9031J3341O176m371L3106L6080Q518j9731q306k7086O982J7894
8250B7739j8944K0148j9542k2809K4157N119J204J3097k2350k8847k4648M8790
8238C114N0767n444K865j6909j5929K2223M2434j7341k0801l1519M3959R803m676
8225F2546r387j641j8769k9771j7422J9740o117l2248k0186j0721k4065J6109
8213g1932O3945L9990M390p679j1852j6489O582l1680k2143N7864l52k8447J8542
8200G39j4229j9575R781j4705N906J4948m827n9428M8920N4309K5549j7906j4802
8187A4680O377R263p667k8179l8123m5955K4267L1980J1112O298j5311L508j6536
$$ y = [-36465, -23333, 67703, 85665, 16122, -38718, -26026, -13756, -17921, -28680, 14784, 3928, -18920, -5833, -34864, -21523, -15347, -19718, 13388, 49468, 57986, 38255, 29949, 2863, 9845, 27739, 8795, 28943, 9401, -13408, 10749, 15868, 17072, 30169, 7819, -21028, -45676, 3114, 53881, 48437, 51302, 34393, 18464, 40687, 83121, 65780, 44979, 13460, 57419, 67222, 62546, 53159, 51518, 32749, 2978, -14444, 5296, -821, -33069, -53255, -63976, -88041, -71932, -7987, 32003, 36393, 28714, 16862, 373, 6955, -24725, -46868, 10996, 10644, -17803, 739, -13490, -33065, -23284, -37989, -32083, -17135, -21962, -81390, -32470, 21839, 47388, 29482, 14680, 21057, 30320, 22653, -5526, -43649, -89604, -65337, -33357, -22245, -15947, -31258, -27750, -44286]
8174d4286m70J8289j1873r097k949J2710L9132K8881J0515n2326k9043L4318l1000
8161c7199m1319N4062P186M6241K9097o346l2238j3894j9331j0150k0611J2868
8149c1634J9128K0030K738j0698j8965j5382L0941j5838j3136K856j664J3133
8137a8491M5235j1891j7749P643l1110K6080M120n8053K3083M3882J281j1570
8125B460N2140j7584k1156J245j1421K957j3683l489k8446J198L4149l2995q356
8112d2981k0464K8705O6271j9366j4260Q124o1596l3632l2213M6941K4310j1710
8100f1871j8643J8769K056K0101M6908K5648p954k1986n083J1045L5105j8455
8088B5640k5613j0222K7319l0418J1731J6399k1206L33L030q549J7265j0000l6159
$$ y = [-44286, -44756, -26467, -38340, -47437, -50386, -37676, 1456, 30337, 40852, -11474, -40517, -6199, -37199, -78518, -24456, -17270, 28971, 58068, 51722, 19484, 5590, -13741, -23891, -44502, -31634, -12506, 7524, 10262, -436, -19401, -34783, -3842, -19680, -32816, -29960, -31624, -18491, 26744, 14853, -2896, 4747, -26363, -283, 3837, -54216, -31133, 12749, 14030, 2460, 54600, 37016, 15860, 17105, 5684, 8641, -5042, -8531, -36977, -35779, -1630, -34625, -42981, -63445, -34740, 31531, 12165, -2095, 6029, -55567, -89199, -121412, -74471, -50161, -61871, -80514, -61745, -59689, -39588, 7320, 32968, 25014, 3028, -2055, 8990, 44095, 25640, 27, -10195, 17124, -13294, -1563, 14836, -6370, -6037, -3007, -11556, 5709, -4291, -40450]
8075d0450m1417K141M315M7570L1461o792k2439j0091K0224L2784l925N0356j2520
8062E1217k8731k3737o418O928K1933l3162q0J2885l3352j788O1328M6650M938
8049G8611l0390l9476p074J1951J765L3914J9383r210J5991K3773q369j9105P873
8036G9637k1791K3845j8069l712P002J9435P392L496n182k9401m2506o81P3525
8023I2990Q45l9439r421J3856m0564k1105P0644L7138J5000l2933m3674M4370
8011H7707J5804r852N105L4437J03420N0775J5535j1454O117J6976k8408m1547
7999B44615k8686L6655J3891J5838N3795J05201J12804j6782q7405j00972p6823
7988B72131m2254m5991m9769l2930J0872k1931k1160j8790p452k3257j9261J8781
$$ y = [-40450, -81867, -79726, -75411, -27841, 3620, -3172, -25611, -35702, -15478, 17306, 13381, 63737, 51217, 22486, -1251, -7669, -741, 21192, -11970, -12050, 835, -32517, -34305, 27023, 73673, 78611, 48221, 8745, 1671, 13622, 15387, 49301, 68684, 59474, 75465, 99238, 90869, 71764, 79637, 57846, 81691, 63622, 59910, 66912, 86347, 93739, 97235, 92053, 62652, 20146, 19465, 92990, 93835, 54396, 44975, 58831, 18267, -2838, 67806, 104944, 119944, 87011, 43337, 87707, 103511, 93659, 98764, 133201, 236621, 287396, 302931, 291477, 297594, 314570, 286162, 244615, 215929, 252584, 266475, 282313, 336108, 441309, 554113, 537331, 449926, 348954, 272131, 229877, 183886, 134117, 101187, 112059, 90128, 68968, 50178, 42726, 19469, 208, 18989]
7976A8989J5744K7197N5001P715r603K3381K1067L0666j4674j0198K2356K8327
7964B15968L2163L8336K4064j0344K9473N7553n208k6080l9656J978R585L2084
7952C59916L3086O559L8773l2585o6847k2832j1620n0152j7017o3385o4222m0891
7940F8783J4765q231j7511k1964j2980l6990l0470J7409L2592M3262M3951j7005
7928G5611j968m6577o88M062M6238J044K3628K9156K5622K7353J88R621N85N44
7914A94419l3344J255R783k2966N928o924l065L0746M223k9517l2457l2679k5545
7901E9857Q242l1394m332J6360J0901l609m1277k4168j0878O3146O7188k83k0512
7888H9241k0715j215l1741k0547J1497l0246o0931J7239J1376K6884J1913m1252
$$ y = [18989, 34733, 61930, 116931, 124646, 115043, 138424, 159491, 190157, 175483, 165285, 187641, 215968, 248131, 286467, 310531, 300187, 329660, 387213, 382005, 355925, 316269, 318247, 327832, 359916, 393002, 399561, 438334, 405749, 338902, 316070, 304450, 254298, 237281, 173896, 109674, 68783, 83548, 75317, 57806, 35842, 22862, -14128, -44598, -27189, 5403, 48665, 92616, 75611, 73643, 27066, 26378, 30440, 76678, 77722, 101350, 130506, 156128, 183481, 183669, 193290, 193875, 194419, 161075, 162330, 172113, 149147, 155075, 148151, 145086, 175832, 180055, 150538, 118081, 85402, 59857, 68099, 36705, 32373, 48733, 59634, 56025, 14748, -9420, -20298, 42848, 110036, 109753, 89241, 68526, 67311, 35570, 15023, 26520, -3726, -64657, -47418, -36042, -9158, 2755, -38497]
7876c8497J675Q98j1754J4158j9576J6099L5201j4809k8165L5409N5089O668j0174
7863D2222k0188k4002L0852K7628l5109O837q071o111R456j4632j8701J3087L2931
7850C6199k7195p9075k3689K828R934J9062J5759K7553j2075j7260L725J7988
7838b6246J2194L8582M1j821m729L1773K8961m209k5212J1061n115k1225k6708
7825G347J2010N950l636N897m4137l253J0375J0383M2730J902K9923K6948j946
7812A00493o8445o6017j3285k3250J1098L8087K6037m7633k1814L2412j1304l2406
7800g6027O60m833K7597j4512n2k128R598K152j3105R581R589K794P026K1745
7786a9915L6635o232J8251J7716k921n5834k2465J1649o122n610j3955j0844L5072
$$ y = [-38497, -36822, -35924, -47678, -33520, -53096, -36997, -1796, -16605, -44770, -9361, 45728, 52396, 42222, 22034, -1968, 28884, 56512, 21403, 28240, 20169, 14058, 23514, 8882, -9819, 3268, 36199, 9004, -70071, -93760, -90932, -80998, -61936, -46177, -18624, -30699, -47959, -44234, -26246, -14052, 24530, 24571, 22750, 18021, 49794, 78755, 74546, 49334, 60395, 55280, 34055, 7347, 19357, 25307, 21671, 27568, -16569, -19822, -9447, 936, 43666, 45568, 75491, 102439, 100493, 32048, -33969, -47254, -70504, -59406, -21319, 4718, -42915, -64729, -32317, -43621, -76027, -75367, -80200, -52603, -67115, -67167, -69295, -59697, -57545, -70650, -61069, -51480, -48686, -41660, -19915, 16720, 10488, 28739, 46455, 43534, -12300, -34765, -23116, -29238, -34848, -48803, -59647, -24575]
7773b4575J996k8589N3M5058J9054j9681j1918l1776Q912n541j6443J0779m943
7760e7614j4882M8190N546l0776J5861L3741J7896K3208J6637k7502j0109K992
7748B3188K102j722K3458l8441l3385k2185k694N0094J933j0691Q031O6308J1944
7735G7940J1998O918j6317j9185n0836l4059q173j8364J6225l5697j1012P9953
7723f09M002k8833M9752L4577k0296P48J9881J1119O692j3756r070J9804J2104
7710H6115m7455m6698r876n006J9017L3908j0611k0646J3032m8855k9171M0302
7698b5944P736j5460K0000Ml5839R065L964q541p282j270L2076O753j0478K0105
7684e111J8112m0229l0579J8049L8377j6673R709K2644k8492j6289j8157k7796
$$ y = [-24575, -22579, -51168, -51115, -6057, 12997, -6684, -18602, -50378, -41466, -47007, -63450, -52671, -57614, -72496, -24306, -18760, -49536, -33675, 66, 17962, 41170, 57807, 30305, 20196, 23188, 25290, 23568, 47026, 8585, -24800, -46985, -49679, 415, 2348, -8343, -312, 65996, 77940, 89938, 96856, 80539, 61354, 10518, -23541, -31714, -50078, -33853, -69550, -80562, -609, 3393, -25440, 24312, 58889, 38593, 39341, 59222, 70341, 77033, 63277, 54207, 74011, 86115, 38660, -8038, -17914, -22920, -3903, 30005, 19394, -1252, 11780, -37075, -66246, -25944, -18208, -33668, -13668, -13664, -49503, -40438, -36474, -45015, -52297, -53567, -21491, -14738, -25216, -5111, 13001, -27228, -57807, -39758, -1381, -18054, -8345, 14299, -14193, -30482, -48639, -76435]
7672g6435M287K4369j3224k5753J524R368J4139J6124L3894R637J3202M390J0939
7659B6461n475J2368K5277m6246J403j5325r239j9305J2646o114L1714j8494O28
7646i701L1504n79k3j5859n074l893l1634p428p766J8394j7250m1254J9376L0627
7632d0560p944m8782k796O6028J5361l716j949l0366l2584K2305M8480N2051j0913
7619B4615o1566K073J2426m590m682o6P878j5397J2785M3288M632m5328k3332
7606d7264M3598n9140k6178N6627K3909K6170j4993K051J9578N823j0007o4588
7594d4414o2580M4852L5073l044l842K3700J4918m3703K9258K6002l465n8814
7582d6059R530K3933j5490k5503M7989J4302O275j6705j8850n513k6736K4261
$$ y = [-76435, -72148, -47779, -61003, -86756, -85232, -75864, -61725, -45601, -11707, -2070, 11132, 15522, 26461, 20986, 33354, 58631, 12385, 13788, -1537, -10776, -30081, -17435, -23549, 8165, -10329, -9701, 21803, 21224, 21201, 5342, 268, -3625, -35259, -42687, -50453, -32059, -49309, -90563, -71187, -40560, -48504, -97286, -100082, -34054, -18693, -22409, -24358, -54724, -87308, -65003, -16523, 35528, 24615, -36951, -34878, -22452, -27042, -31724, -31790, -23912, -39309, -26524, 16764, 21396, -23932, -47264, -3666, -62806, -88984, -32357, -8448, 17722, 2729, 4780, 24358, 30181, 20174, -44414, -106994, -62142, -27069, -30113, -33955, -10255, 4663, -39040, -9782, 16220, 12755, -46059, -36529, -12596, -28086, -53589, -5600, 8702, 14977, -1728, -20578, -26091, -52827, -28566]
7570b8566J4766K5847j7600k6452K4188L4393k4687j9309O362L788k1972K9308
7558F6K9969k0838L908j1730J5173L5595Q69k5731l4865L69J7512j3645k1035
7545b4383L9603O1279J4349p260k6533l1996J6246P701n4338k8917m888P853J1882
7532a9402l125k3969m19Q256r984K4271K4279k9443o405k6058R27M6640L7049
7519B2617j2231k8686K4841k4138j2668r850o139Q776n934J1776k4371n785L2060
7506b9732K6017L6772P8518j3575q9326n5067N462j0233m0808L692K2412M0660
7494b5208K8929m38q148M463J6443J5733j1843j5532q851l02J9269k0229q443
7481a4157K07J3082K2650J9985k2301q088j0537q390J2187j8421m4231K2846K2353
$$ y = [-28566, -13800, 12047, -5553, -32005, -7817, 26576, 1889, -17420, -11058, -7270, -29242, 66, 30035, 9197, 13105, 1375, 16548, 52143, 53012, 27281, -7584, -7215, 10297, -3348, -24383, 15220, 76499, 90848, 83588, 57055, 25059, 41305, 49006, -5332, -34249, -39137, -31284, -19402, -22527, -46496, -46915, -38659, -48643, -24372, -93, -29536, -35941, -61999, -61072, -14432, 22617, 10386, -18300, 6541, -17597, -30265, -40115, -46254, -37478, -43412, -31636, -56007, -61792, -29732, -3715, 33057, 111575, 98000, 8674, -46393, -40931, -51164, -91972, -88280, -65868, -25208, 3721, 3283, -4865, -402, 16041, 31774, 19931, 4399, -4452, -4754, 14515, -5714, -14157, -13950, -868, 21782, 41767, 19466, 11378, 841, -7549, 4638, -13783, -58014, -35168, -12815]
7468a2815L3592K2575q707l6666j9205K5903K1306L8935L962k0074k9603k6322
7456g119k8349L914l7154j0565j6483J6996j3753K7983L1994L9132M9435l8634
7444A7397j2129p753j8509J0810K8441o591j9952J4855m772j2954k6781N3439
7432A5501N0599l8011k1722P123j0693L4132K7208m2445k9401j3281j6617P077
7420c0530N2255J1407j4166M4L331j1441P84J3132M4107k7177M567M496K6977
7407G7786M371k5739p6995k7098j7562l451n355j2101N917J7410J0686K4255L3420
7394E544J5223J1844l489m7117l2505J825K6766k0823M249j6124J6616L3111J0021
7381E141l406Q383J6723r344n025l1326p2211l6568K7760K8178N2500L6723K3938
$$ y = [-12815, 20777, 43352, 34645, -2021, -21226, 4677, 25983, 64918, 68880, 48806, 19203, -7119, -35468, -31554, -68708, -79273, -95756, -78760, -92513, -64530, -32536, 6596, 56031, 17397, 5268, -2485, -20994, -10184, 18257, 11666, -8286, 6569, 1797, -11157, -37938, 15501, 66100, 28089, 6367, 13490, 2797, 36929, 64137, 21692, -7709, -20990, -37607, -30530, 21725, 33132, 18966, 19010, 22341, 10900, 11684, 24816, 68923, 41746, 46313, 50809, 77786, 82157, 56418, -20577, -47675, -65237, -68688, -74043, -86144, -80227, -62817, -52131, -27876, 5544, 20767, 32611, 29122, -17995, -50500, -48675, -21909, -42732, -38483, -54607, -37991, -4880, 5141, 1735, 10118, 26841, 17497, 12472, -18854, -91065, -127633, -99873, -71695, -19195, 17528, 41466]
7368D1466Q05m9794j6340K8635k9326M1177k4962k4621J6589n6199r735K1018
7356f1287K6804J9895n562m9864n6899j5209P1075N1757m4884j2974K6777O539
7344d3832M3565j371j8231K3392j5483m0780N6737J3876k3189R193K0337R311
7332C3525P17L625r276k7541P209L3293J4948q4839o0917r764N3518O1133L0963
7319D6594j7540L848M589k6435K411k5954j0130L3868J5636j3294m041o646L0518
7306C3424J4835m995K9861k2353j9896j6578p428o4032r076O237o028L7511N1079
7293B2561J517j5090m861j501P535P923l9984k0575K0290r025o046K2856R739
7280d661L5990J6107j1754n4410J9874L935k0353k634K902N704O0121J1581n7622
$$ y = [41466, 42271, -7523, -23863, 4772, -24554, 16623, -8339, -32960, -16371, -72570, -82305, -61287, -34483, -14588, -20150, -70014, -126913, -142122, -71047, -19290, -64174, -77148, -50371, -43832, -267, -1638, -19869, 3523, -11960, -52740, 3997, 17873, -5316, 3877, 24214, 33525, 34242, 37867, 28591, 1050, 8259, 41552, 56500, -28339, -89256, -99020, -45502, 15631, 46594, 29054, 32902, 37491, 11056, 13467, -12487, -22617, 11251, 26887, 13593, 9552, 2906, 33424, 48259, 43264, 73125, 50772, 30876, 14298, 6870, -57162, -66238, -60001, -66029, -28518, 22561, 24078, 8988, 4127, 2626, 10161, 18084, -21900, -42475, -22185, -31210, -37256, -14400, -4661, 31329, 47436, 35682, -18728, 1146, 5081, -15272, -17906, -15004, -9300, 50821, 62402, 4780]
7267D780l9902n730j4029p575K5274J370l0189Q393K768J2085L1652m7071J9415
7254c8759J4942K4092R90K3651J0806J6255l1066n3533J89K5866k2100r05L9679
7241A0107l4676k7791k3734k4997L8879j1761K0930O8448L308m1032L9078L0126
7229D6885k1259j4768l0561m4230r881M746L5615M4380K885K9882j2810j8194
7217A2690M7299L2632m7446k9103j7228k4429J3049N3109K1221m1026l4998j6208
7205c0438j559O568J7859K5028l300j0834J6516j0946k4290m7084K0195P7820
7193C5535J3444k5885j3849q693J5650j2665k090n340p540K895M2498k2075j3764
7180a879k0014N580J4682o018n7048k6860j1737K3534J7068K4734N9870L5544
$$ y = [4780, -35122, -40852, -54881, -62456, -37182, -35812, -66001, -57608, -54840, -42755, -11103, -58174, -38759, -23817, 275, 1265, 24916, 35722, 51977, 20911, -32622, -32433, -6567, -28667, -29572, 10107, -24569, -52360, -76094, -101091, -62212, -73973, -53043, 15405, 18713, -22319, 16759, 46885, 25626, 10858, -19703, -63933, -73814, -69068, -33453, 10927, 13812, 43694, 30884, 12690, 59989, 92621, 45175, 16072, -1156, -25585, -12536, 40573, 61794, 20768, -14230, -30438, -31997, -25429, -7570, 17458, 14158, 3324, 19840, 8894, -15396, -62480, -42285, 35535, 48979, 23094, 9245, 552, 16202, 3537, 1447, -3893, -11433, -8538, 33960, 11885, -1879, -21893, -16313, -1631, -7649, -64697, -91557, -103294, -79760, -62692, -37958, 21912, 57456]
7168E7456j3993l5455j4046j1015m3935k2803K7267L8166j9609k4043N1397J3599
7156B986j749Q262N7j0230J2023K3026J1078k4169k4676M2927N2607l035k4525
7143F4582J2963l3739j6011J927k1610k0032O430k563M0446k2414K5691J0673
7131D6343m040l4817o7069n3505k477J7293K8710N1893q336L4516j7971Q657k3979
7118b4782k9211J5506O2826K9517k4234j8774P869K0513L8846J6302m6538k6827
7106B1013p580j1974n723p435k0389M1102k3502o860M1730M756k534N385l26J6818
7092D4481J0323P480m3320l9206L464r999m1980m3785j2851L3713K7424Q962p929
7079f3223K7862K9568K3229K527m8128L7448L3504r441m6320k5981o283m1087
$$ y = [57456, 43463, 8008, -6038, -17053, -60988, -83791, -56524, -18358, -37967, -62010, -10613, 2986, 1237, 9499, 9556, -674, 11349, 34375, 45453, 21284, -3392, 39535, 92142, 89107, 64582, 77545, 43806, 27795, 29722, 8112, -11920, -5490, -8053, 32393, 9979, 35670, 46343, 42303, 7486, -59583, -113088, -115565, -98272, -69562, -17669, -26005, 8511, -9460, -803, -24782, -53993, -38487, 24339, 53856, 29622, 10848, 18717, 39230, 78076, 94378, 47840, 21013, 13433, 1459, -4264, -11699, -32088, 9014, -14488, -21348, 20382, 25138, 22604, 27989, 27663, 44481, 54804, 62284, 18964, -20242, -16778, -26777, -68757, -112542, -125393, -91680, -64256, -55294, -63223, -35361, -5793, 17436, 19963, -28165, 9283, 42787, 33346, -12974, -38955, -45238, -86325]
7067h6325J2010q806L8187J0145K5662N0702J8432k3038m8143k1587k1206K863
7055e1104N0167J4158J2684R466l4754j4309N872j3728J5596m3485j474k2097
7043g3008j2652J2659K5440J4479L4331l86P233j5250k3566j4368J1637N3024
7031A9573L306n0909o303M4537l2835k5031N2075J2543k7969J1064p66k753k4695
7018b8163m445J6753K3984l4398l8891K5729L5939J5489l339K4264k3433J865
7006A1354L1760k6771m2850k5162L4007K4336J4246l6271K675M7170p823k6491
6994A80o522M456j3036K0359J7809J4044J0417Q58m2573j9528j2476M8872P2017
6981I4877k6856o5387q011N5401r182l6743q570L5970p347k1499l3936m3361M6265
$$ y = [-86325, -74315, -83121, -44934, -34789, -9127, 41575, 60007, 36969, -11174, -32761, -53967, -51104, -937, 13221, 25905, 35371, 617, -13692, -7820, -21548, -5952, -49437, -50911, -73008, -85660, -73001, -47561, -33082, 1249, 863, 8096, -7154, -30720, -45088, -33451, 19573, 22879, -28030, -34333, 10204, -22631, -47662, 4413, 16956, -11013, 51, -715, -3468, -28163, -32608, -15855, 8129, -26269, -65160, -39431, -3492, 11997, 8658, 32922, 9489, 11354, 43114, 16343, -26507, -51669, -17662, 6674, 20920, -15351, -12676, 34494, 26671, 180, -6342, -1886, -14922, 5437, 23246, 37290, 47707, 48565, 5992, -13536, -26012, 22860, 94877, 68021, 2634, -5377, 50024, 40842, 4099, -4471, 31499, 24152, 2653, -31283, -74644, -28379]
6968b8379L3331J1539M398k1190K448Q709l124M7607L0036j7522n1639M387k2545
6955a944J1144O0747l101j3997m501j4203j9648j6711P816K7693j2970l8097r429
$$ y = [-28379, 4952, 16491, 20889, -301, 2147, 10856, 7732, 55339, 85375, 67853, 16214, 20601, -1944, 9200, 69947, 66846, 52849, 48348, 34145, 14497, -2214, 5602, 33295, 20325, -17772, -27201]
$$ [...]
##END NTUPLES=NMR SPECTRUM
##END=
