##TITLE=Analysis number 314613
Compound Code cc 30139
Book Reference 454/36
Project Code adrs
Chemist Name stevep
##JCAMPDX= 6.0         $$ Bruker NMR JCAMP-DX V2.0
##DATA TYPE= NMR SPECTRUM
##DATA CLASS= NTUPLES
##ORIGIN= Bruker BioSpin GmbH
##OWNER= NMR
$$ XWIN-NMR		Version 3.5
$$ Fri Oct 21 08:37:11 2005 GMT Daylight Time (UT+1h)  MAYBRIDGE\NMR@NMR_250MHZ
##.OBSERVE FREQUENCY= 250.131544655141
##.OBSERVE NUCLEUS= ^1H
##.ACQUISITION MODE= SIMULTANEOUS (DQD)
##.ACQUISITION SCHEME= undefined
##.AVERAGES= 16
##.DIGITISER RES= 18
##SPECTROMETER/DATA SYSTEM= dpx250
##.PULSE SEQUENCE= zg30
##.SOLVENT NAME= CDCl3
##.SHIFT REFERENCE= (INTERNAL, CDCl3, 0, 16.522)
##AUDIT TRAIL= $$ (NUMBER, WHEN, WHO, WHERE, WHAT)
$$ ##TITLE= Audit trail, XWIN-NMR		Version 3.5
$$ ##JCAMPDX= 5.01
$$ ##ORIGIN= Bruker BioSpin GmbH
$$ ##OWNER= NMR
$$ C:\u/data/dgb/nmr/ADRS/11170/pdata/1/auditp.txt
$$ ##AUDIT TRAIL=  $$ (NUMBER, WHEN, WHO, WHERE, WHAT)
(   1,<2005-10-21 08:36:32.94 +100>,<MAYBRIDGE\NMR>,<NMR_250MHZ>,
      <created by zg, POWCHK disabled, PULCHK disabled
       configuration hash MD5:
       62 19 C7 07 E1 42 D1 B7 37 6C 3D D0 77 39 F9 E6
       data hash MD5: 64K
       5B 66 A8 0F BC E0 E5 C0 55 39 83 B1 28 C7 81 1C>)
(   2,<2005-10-21 08:36:52.14 +100>,<MAYBRIDGE\NMR>,<NMR_250MHZ>,
      <Start of raw data processing
       ef LB = 0.3 FT_mod = 6 PKNL = 1 SI = 32K 
       data hash MD5: 32K
       AD 20 33 AE 09 C2 DB C0 09 53 64 19 51 F5 83 72>)
(   3,<2005-10-21 08:36:57.02 +100>,<MAYBRIDGE\NMR>,<NMR_250MHZ>,
      <apk 
       data hash MD5: 32K
       2B 41 E1 ED D0 D2 98 99 25 6F E1 B0 43 59 A4 FE>)
(   4,<2005-10-21 08:36:58.74 +100>,<MAYBRIDGE\NMR>,<NMR_250MHZ>,
      <abs ABSG = 5 
       data hash MD5: 32K
       E0 6C 3E 32 53 FB 26 A5 2C 9B 5A A0 AF A4 F2 78>)
$$ ##END=
$$ 
$$ hash MD5
$$ A0 C0 CE 7C B9 89 EF 4A 30 D6 62 31 3D C9 10 7B
##$RELAX= 
##$RELAX= 
##$RELAX= 
##$RELAX= 
##$RELAX= 
##$RELAX= 
##$RELAX= 
$$ Bruker specific parameters
$$ --------------------------
##$DU= <C:\u>
##$EXPNO= 11170
##$NAME= <ADRS>
##$PROCNO= 1
##$TYPE= <nmr>
##$USER= <dgb>
##$AMP= (0..31)
100 100 100 100 100 100 100 100 100 100 100 100 100 100 100 100 100 100 
100 100 100 100 100 100 100 100 100 100 100 100 100 100 
##$AQSEQ= 0
##$AQ_mod= 3
##$AUNM= <au_zg>
##$AUTOPOS= <4 >
##$BF1= 250.13
##$BF2= 250.13
##$BF3= 250.13
##$BF4= 250.13
##$BF5= 500.13
##$BF6= 500.13
##$BF7= 500.13
##$BF8= 500.13
##$BYTORDA= 1
##$CFDGTYP= 0
##$CFRGTYP= 5
##$CHEMSTR= <none>
##$CNST= (0..31)
1 1 145 1 1 1 1 1 1 1 1 1 1 1 1 1 1 1 1 1 1 1 1 1 1 1 1 1 1 1 1 1 
##$CPDPRG= <>
##$CPDPRG1= <>
##$CPDPRG2= <>
##$CPDPRG3= <>
##$CPDPRG4= <mlev>
##$CPDPRG5= <mlev>
##$CPDPRG6= <mlev>
##$CPDPRG7= <mlev>
##$CPDPRG8= <mlev>
##$CPDPRGB= <>
##$CPDPRGT= <>
##$D= (0..31)
0 1 0 0 0 0 0 0 0 0.06 0 0 0 0 0 0 0.0002 0 0 0 0 0 0 0 0 0 0 0 0 0 0 
0 
##$DATE= 1129880191
##$DBL= (0..7)
120 120 120 120 120 120 120 120 
##$DBP= (0..7)
150 150 150 150 150 150 150 150 
##$DBP07= 0
##$DBPNAM0= <>
##$DBPNAM1= <>
$$ [...]
##$SUBNAM7= <"">
##$SUBNAM8= <"">
##$SUBNAM9= <"">
##$SW= 20.6930455092707
##$SWIBOX= (0..15)
0 0 3 0 0 0 0 0 0 0 0 0 0 0 0 0 
##$SW_h= 5175.983436853
##$TD= 65536
##$TD0= 1
##$TE= 295.16
##$TE2= 300
##$TE3= 300
##$TEG= 300
##$TL= (0..7)
0 120 120 120 120 120 120 120 
##$TP= (0..7)
150 150 150 150 150 150 150 150 
##$TP07= 0
##$TPNAME0= <>
##$TPNAME1= <>
##$TPNAME2= <>
##$TPNAME3= <>
##$TPNAME4= <>
##$TPNAME5= <>
##$TPNAME6= <>
##$TPNAME7= <>
##$TPOAL= (0..7)
0.5 0.5 0.5 0.5 0.5 0.5 0.5 0.5 
##$TPOFFS= (0..7)
0 0 0 0 0 0 0 0 
##$TUNHIN= 0
##$TUNHOUT= 0
##$TUNXOUT= 0
##$USERA1= <user>
##$USERA2= <user>
##$USERA3= <user>
##$USERA4= <user>
##$USERA5= <user>
##$V9= 5
##$VALIST= <valist>
##$VCLIST= <CCCCCCCCCCCCCCC>
##$VD= 0
##$VDLIST= <DDDDDDDDDDDDDDD>
##$VPLIST= <PPPPPPPPPPPPPPP>
##$VTLIST= <TTTTTTTTTTTTTTT>
##$WBST= 1024
##$WBSW= 4
##$XGAIN= (0..3)
0 0 0 0 
##$XL= 0
##$YL= 0
##$YMAX_a= 378621
##$YMIN_a= -439345
##$ZGOPTNS= <>
##$ZL1= 120
##$ZL2= 120
##$ZL3= 120
##$ZL4= 120
##$ABSF1= 16.522
##$ABSF2= -4.171173
##$ABSG= 5
##$ABSL= 3
##$ALPHA= 0
##$AQORDER= 0
##$ASSFAC= 0
##$ASSFACI= 0
##$ASSFACX= 0
##$ASSWID= 0
##$AUNMP= <proc_1d>
##$AZFE= 0.1
##$AZFW= 0.1
##$BCFW= 0
##$BC_mod= 0
##$BYTORDP= 0
##$COROFFS= 0
##$CY= 12.5
##$DATMOD= 1
##$DC= 0
##$DFILT= <>
##$DTYPP= 0
##$F1P= 14.0000005364418
##$F2P= -0.99999901652339
##$FCOR= 0.5
##$FTSIZE= 32768
##$FT_mod= 6
##$GAMMA= 0
##$GB= 0
##$INTBC= 1
##$INTSCL= 1
##$ISEN= 128
##$LB= 0.3
##$LEV0= 0
##$LPBIN= 0
##$MAXI= 10000
##$MC2= 0
##$MEAN= 0
##$ME_mod= 0
##$MI= 0
##$NCOEF= 0
##$NC_proc= -2
##$NLEV= 6
##$NOISF1= 0
##$NOISF2= 0
##$NSP= 0
##$NTH_PI= 0
##$NZP= 0
##$OFFSET= 16.522
##$PC= 1
##$PHC0= -69.22473
##$PHC1= 6.478302
##$PH_mod= 1
##$PKNL= yes
##$PPARMOD= 0
##$PSCAL= 4
##$PSIGN= 0
##$REVERSE= no
##$SF= 250.13
##$SI= 32768
##$SIGF1= 0
##$SIGF2= 0
##$SINO= 400
##$SIOLD= 32768
##$SREGLST= <1H.CDCl3>
##$SSB= 0
##$STSI= 32768
##$STSR= 0
##$SW_p= 5175.98343685301
##$SYMM= 0
##$S_DEV= 0
##$TDeff= 65536
##$TDoff= 0
##$TI= <Analysis number 999999
Compound Code 99
Book Reference 9
Project Code 9>
##$TILT= no
##$TM1= 0
##$TM2= 0
##$TOPLEV= 0
##$USERP1= <user>
##$USERP2= <user>
##$USERP3= <user>
##$USERP4= <user>
##$USERP5= <user>
##$WDW= 1
##$XDIM= 32768
##$YMAX_p= 303917381
##$YMIN_p= -55709
$$ End of Bruker specific parameters
$$ ---------------------------------
##NTUPLES= NMR SPECTRUM
##VAR_NAME=  FREQUENCY,     SPECTRUM/REAL,   SPECTRUM/IMAG
##SYMBOL=    X,             R,               I
##VAR_TYPE=  INDEPENDENT,   DEPENDENT,       DEPENDENT
##VAR_FORM=  AFFN,          ASDF,            ASDF
##VAR_DIM=   32768,         32768,           32768
##UNITS=     HZ,            ARBITRARY UNITS, ARBITRARY UNITS
##FACTOR=    0.157963299565203, 1,           1
##FIRST=     4132.6476996994, 0,             0
##LAST=      -1043.33573715361, 0,           0
##MIN=       -1043.33573715361, -55709,      0
##MAX=       4132.6476996994, 303917381,     0
$$ Real data points
##PAGE= N=1
##DATA TABLE= (X++(R..R)), XYDATA
$$ [...]
19421 -6771 -4631 7697 675 -1330 12359 17005 2561 452 5521 1133 -5733 -20997 -6888
19408 -6888 9806 8805 -3918 -4550 11412 5078 1058 6543 9735 3947 -6895 -11001 -2150 -6010
19394 -6010 8144 20058 13087 -6360 -8671 -12336 -15761 -6928 -11187 -2827 -9786 -8359 6743 21042
19380 21042 19807 12988 18896 17781 12504 3974 1790 -4693 -4325 -2506 4149 -3752 -4954 -5194 7773
19365 7773 16659 17381 3532 -221 12031 9930 -2702 17406 26402 23509 8841 14257 2759
19352 2759 -11089 -20985 -21263 -3759 1270 -3165 -8642 -4193 -12930 -7873 -6747 -10383 -12526 -16718
19338 -16718 -24779 -35803 -39817 -29808 -13570 8782 28000 24489 12149 -6490 -17436 5426
19326 5426 17969 -5239 -13313 -12001 -14486 -14932 -7225 4864 10647 1774 -5239 4560 22471 31226
19312 31226 14309 -9037 -11208 -10119 -24583 -25628 -18953 -21793 -23954 -17297 4809 12910 -10098
19299 -10098 -22788 -13483 1771 16293 6827 -6693 -12478 320 4653 619 5132 29661 34793
19286 34793 44975 37143 37083 28701 40932 42516 34334 26731 40506 54741 67586 57694 58749 59581
19272 59581 67807 65578 55690 50996 49495 39968 34221 39737 48502 47788 36865 38307 49756 37762
19258 37762 18908 22875 30057 30620 24821 28895 35731 37084 28517 22679 17639 14941 11515 9331
19244 9331 8595 22495 30362 31654 12662 11794 16429 28497 40386 36401 38032 45594 54204 64317
19230 64317 65760 80563 88413 69406 54020 52713 51653 51033 49830 46928 57669 53436 54231 45711
19216 45711 48967 28681 23028 30146 33426 39537 21531 1791 3457 1773 2446 12437 10715 15272
19202 15272 23924 21183 15966 6040 -8323 -5199 8706 14169 26165 29387 42121 45198 20444
19189 20444 3482 -4416 -4409 6103 16165 13865 -867 -5892 7619 6860 3510 -3579 -10344 -14621
19175 -14621 -15509 2694 2654 -4798 -4158 1471 -2948 -11063 -3773 -3538 -8807 -11581 -13720 -6561 -14983
19160 -14983 -29202 -16247 -10275 1087 14299 14352 26024 32222 33790 25454 17765 -4341 -5902
19147 -5902 -1442 -1755 3051 4654 -458 -10822 -8072 -10073 -11671 -1928 24251 23440 6372 -2497
19133 -2497 -14778 -28558 -31741 -28263 -18899 -14615 -10138 -4702 7694 12238 489 -14719 -19323
19120 -19323 6801 -2576 -7162 -9977 -7333 -2478 -1676 -3735 -3503 799 3963 -869 3124 19937
19106 19937 29742 9351 -18386 -12765 2018 8725 7057 19306 17854 16640 16993 7401 -1331 -4564
19092 -4564 -4932 2828 13636 21832 14264 18651 13419 3545 14067 33174 31042 15232 9919 15463
19078 15463 21463 25480 25649 16616 8922 1084 -10201 -8799 -9527 13022 17723 15278 15550 4552
19064 4552 1397 -3851 -10428 -8695 -10744 -7741 -7746 -11950 -229 -450 -6002 -6345 -6361 -16014 -23782 -2076
19048 -2076 10491 10218 23387 9172 -8068 -7776 8322 9986 5353 9853 3939 -1396 4807 4332
19034 4332 1005 6268 17782 27012 26981 28437 20603 22172 19365 -424 7929 12861 9905 9222 2094
19019 2094 -14029 -15075 -6951 -4436 14215 25115 16555 10626 7291 11305 1452 2420 11431 13776
19005 13776 16937 22113 27751 22666 21319 15825 6309 802 -9537 2155 24613 31475 24177 23735
18991 23735 27019 28033 15024 21993 28277 27174 27222 33448 28840 29853 24727 16736 27198 29420
18977 29420 15512 8442 20238 17108 23042 25343 17286 25721 22539 22501 27101 13559 3862 7817
18963 7817 12787 17222 17210 4482 -8373 -15861 -12666 -14114 -18873 -11426 -3627 1593 1550 1254 4875
18948 4875 20403 26437 28890 30161 19007 16843 12114 5944 8075 8557 -925 -5839 4385 -5740
18934 -5740 -9449 -8200 -3607 17931 20345 29637 36897 22985 12979 18643 20574 30547 34270 37778
18920 37778 42033 33652 38133 38766 33802 29313 28636 18412 12107 11229 22927 26209 12787 16303
18906 16303 17866 19676 27528 23805 10229 9645 17049 30178 17153 1483 14340 30212 21390
18893 21390 24254 32055 34544 38386 35947 22245 24029 42803 45417 52707 61068 51942 53224 49785
18879 49785 44685 46236 49812 52100 49872 49678 48437 48117 48485 39270 32099 30620 43056 49814 42487
18864 42487 47995 45817 28894 34684 34498 28614 30881 38553 37918 45528 50466 55545 56831 54157 65636
18849 65636 77524 75238 73835 75248 71887 76159 77136 65621 62946 66200 67263 73938 93342 114351
18835 114351 122422 133307 144440 125577 125415 147046 164367 187929 220309 247932 246955 249420 241702
18822 241702 244445 257327 285383 308846 340887 352636 380804 423803 482632 528982 561039 600947
18810 600947 662438 731362 803680 896860 1007214 1143870 1338866 1600827 1945691 2331365
18800 2331365 2626457 2754197 2744652 2726097 2806213 2997816 3289384 3714343 4341847 5263533
18790 5263533 6639412 8677996 11525072 14748770 16908537 16522890 14324000 12218190
18782 12218190 10892556 10065565 9215417 8244848 7442761 7017137 6964408 7177549 7409985
18773 7409985 7311053 6747971 5936465 5132954 4478708 3983692 3601332 3288373 2998482 2765788
18763 2765788 2601569 2461461 2367265 2306466 2264185 2205527 2148986 2097903 2097060 2115256 2175735
18752 2175735 2258128 2369512 2539556 2802923 3200355 3759475 4495519 5365551 6162865 6591509
18742 6591509 6575785 6395939 6387609 6716002 7424391 8463348 9628592 10690905 11942231
18733 11942231 13885910 16472632 18439762 17912191 14970724 11671518 9168877 7498828
18725 7498828 6355039 5553544 5004249 4649555 4432066 4317689 4318262 4389509 4390132 4136514
18715 4136514 3673366 3156786 2708554 2373462 2099147 1882990 1708347 1553540 1410461
18706 1410461 1298935 1209640 1124120 1043623 960910 875236 789102 731626 676002 622325 572141
18695 572141 525057 479737 443277 423044 411170 385535 358602 334014 304413 276981 251302
18684 251302 222947 201877 183951 176226 181076 191079 180715 150697 144647 143836 147164 145371 148716
18671 148716 131641 121156 124111 119343 93944 78850 88819 96116 98577 94434 79890 83898 88192
18658 88192 85863 88173 75555 66306 64511 64436 62288 43417 34127 37579 48989 66816 72862 57892
18644 57892 39711 35825 49338 40383 46564 57960 53636 38215 42646 46091 33934 25533 34878
18631 34878 40859 49171 48865 46264 39572 41986 30439 35990 48837 55022 46396 41326 40120 49139
18617 49139 52092 46082 35347 38770 45983 50672 51727 45701 35851 37851 39917 40426 39369 47792
18603 47792 45659 38246 34417 35329 34517 24186 18325 34970 30643 29126 15457 26265 49080 35994
18589 35994 12370 24860 24157 10905 7978 18427 23501 13192 6777 20431 20920 38411 42352
18576 42352 31782 37299 30880 17795 10157 -371 9443 18091 15746 19724 21131 9216 11937
18563 11937 9929 8679 13565 6290 2030 -4795 3680 19379 32073 25050 10937 20807 15464 4812
18549 4812 4023 -4628 -15006 -8852 -7342 -4331 1379 10378 8225 392 2036 -7010 -15481 -8845 -10496
18534 -10496 -14617 -13149 -20585 -21232 483 12766 12535 13511 19144 19388 18112 10068 8134 16259 22721
18519 22721 18920 23163 29293 25694 6745 -4908 -8787 -14764 -4716 11761 5951 3372 3573 7886
18505 7886 19944 20332 14571 16653 21262 30000 27698 13477 -919 7168 226 -10486 -9766 10555
18491 10555 14446 17455 27032 33155 26330 1060 -9394 -8396 3047 5368 7519 2404 4659 7697
18477 7697 6322 8511 -3517 -21369 -25300 -11436 -2372 13433 11145 8553 8023 9501 27058 24159
18463 24159 2467 -17338 -9006 -11149 -2461 280 -937 5572 14474 26454 30302 13762 -18644
18450 -18644 -26488 -18535 -3731 11718 19314 22346 22239 7466 6325 8980 17893 19395 17626 5064
18436 5064 -8712 -5659 -13442 -15710 -21201 -28231 -15754 2188 5854 4660 18202 29960 27994
18423 27994 20120 1989 2446 15246 18178 6802 -8423 -9996 -13034 -7278 -6981 -5774 -2597 -6613
18409 -6613 1200 21392 10667 193 -8484 4501 21084 20006 12359 1355 4144 17069 15630
18396 15630 14641 5791 -1053 -325 193 224 4319 11251 10802 21564 39130 50069 42720 24830 -7945
18381 -7945 -20428 -13209 684 13429 -7329 -11305 -9686 -11379 -4207 -11862 -4695 -10050 -17166 -16187
18367 -16187 -8973 -5912 7195 3056 14520 5770 3395 15891 19907 3483 9340 21803 29424
18354 29424 27705 21674 14561 20130 12660 5090 9245 9219 -3807 -5637 7191 5634 24289 35836
18340 35836 20383 16618 18335 3189 -8705 -7422 892 -3071 2187 8918 -3702 -5646 1987
18327 1987 -5002 -13847 -15122 -9466 6376 15391 13204 265 5762 8316 1744 -192 -2667 -9792
18313 -9792 -8789 -2608 891 8711 9630 15816 10480 9698 25863 30126 33685 38979 56677 63615 43819
18298 43819 15355 5528 26775 47270 41120 28748 34522 39210 39164 36780 27200 36867 56378 67799
18284 67799 63314 57191 62663 70376 63023 51010 48853 51046 49825 43203 56500 64313 44365 30383
18270 30383 32887 24859 16164 14850 24568 42323 48087 35770 23801 44894 50633 25607 15319
18257 15319 12193 10928 6187 -2648 -4031 3093 -4374 -381 -535 1970 12520 25881 29879 23803
18243 23803 18923 39282 62618 79068 87856 87307 77791 78344 66505 49488 40707 45170 41826 51313
18229 51313 49918 51471 52068 59798 60201 59010 51467 44864 47819 27474 28991 35433 30317 2790
18215 2790 -14157 5373 12016 33830 36661 33154 25880 19409 21332 15540 16211 27655 28454 25810
18201 25810 33551 43004 54603 61360 50373 47025 42148 39118 44555 49687 45431 46724 42846 23305
18187 23305 -2088 -937 10432 17862 17835 19583 31617 30324 25513 25833 21412 16350 25654 32283
18173 32283 31443 28918 32456 48372 48880 30658 28271 23538 6033 10209 28475 15153 9273 17472
18159 17472 38117 45587 44957 37213 42867 50073 56581 65010 66924 54291 51184 50976 52923 67076
18145 67076 83334 98630 97969 94812 112771 125089 134005 161574 177433 187243 208765 238157 261311
18132 261311 298028 337111 356664 391973 440037 491115 541473 593774 657456 736131 845953
18121 845953 991369 1142868 1332279 1552092 1821134 2170319 2685914 3414308 4541050
18112 4541050 6386954 9697952 15619971 23549566 26673558 19910739 12293220 8245704
18104 8245704 6123451 4868447 4038150 3460894 3046723 2740632 2517629 2376482 2292063
18095 2292063 2256760 2183591 2025738 1826823 1615792 1423552 1255744 1114863 983883 867066
18085 867066 770361 691270 627135 560217 497262 441833 399484 380235 355904 333979 313772
18074 313772 282581 244572 215485 212837 207456 187305 152871 138383 139992 142049 135461 128623 118390
18061 118390 118946 107794 98580 103944 98569 79183 71791 73961 61578 55516 58090 72072 76035
18048 76035 58350 46907 56524 66220 60828 56614 59494 51052 47811 39588 37217 32481 37048 35572
18034 35572 34179 33174 24840 17554 18100 19538 589 -7837 -239 13577 13664 15646 9312 5224 5204
18019 5204 11848 13498 6232 28781 26625 15314 6600 1959 15399 29539 25109 15810 15781 10579
18005 10579 17374 24913 31038 17466 989 -15080 -7375 4837 14425 31967 23517 13501 11250
17992 11250 5243 408 5446 20758 29853 29414 21462 13632 24103 26854 25951 36389 33931 34424
17978 34424 29188 12781 20141 24568 25888 24356 24274 14153 7992 -2700 -17325 -12702 3504 11944
17964 11944 2261 12945 19059 20557 36340 36262 37857 33205 21610 9930 -8394 -5383 2595 1770
17950 1770 287 -7512 -1243 -5311 -14169 4234 15408 5277 16526 21777 14982 7832 -743 8208
17936 8208 12959 21687 7365 -4059 -15670 -19125 -10313 -13734 -11610 -21494 -20664 -7958 143 -2102
17922 -2102 -4896 -1764 -8167 -2048 -9888 -24795 -25329 -14897 -2821 -2456 8601 7940 17620 10957
17908 10957 2995 -9676 -19875 -25442 -21742 -6072 -10954 -12970 -10077 5086 7032 1963 -4747
17895 -4747 -15028 -16868 -7476 -649 -3363 -11200 -7686 -17974 -5334 7585 19909 11144 -2075
17882 -2075 5006 13787 20405 18414 4208 9876 20404 15479 18999 22672 26316 32503 41996 38831
17868 38831 28155 4443 -5911 -15279 -11767 -19997 -20031 -25968 -21817 -14283 7975 7696 -17893 -26348
17854 -26348 -32238 -14932 -13349 -17040 -2257 7550 1625 -276 -19050 -30325 -32030 -6443 -9501
17841 -9501 -19173 -24363 -16486 -7446 -27 -5383 -7742 -6784 2355 6136 4567 -10505 -1260 -2187 -1250
17826 -1250 14905 9297 685 4943 23038 30865 17626 -1424 -17340 -13774 -13181 8602 16302
17813 16302 12808 6043 -15737 -21792 -6894 -19481 -21225 -17848 -11839 -14811 -12811 -1807 14034
17800 14034 3692 15925 25315 27838 23397 10920 9195 12157 401 6691 15614 10942 6846
17787 6846 15044 19106 4350 -2989 43 -2578 -5336 -15364 -7121 -5579 228 -5760 2174 6948
17773 6948 -10184 1189 3284 2789 -343 -6651 -12119 -2593 3957 11355 21479 28691 22291 15878
17759 15878 13264 14413 29930 25586 10775 6137 5094 -2608 11144 31859 30556 11173 12269
17746 12269 14018 -2040 -12332 -23908 -24463 -9080 -3503 -15833 -14987 -29066 -23481 -544 22578
17733 22578 13978 10851 820 -6093 -9684 -24704 -27088 -21978 -16018 -13742 -21475 -10869 -88
17720 -88 -6098 -9067 -22035 -23367 -7249 -6107 1320 6907 17163 15781 13326 14850 10119 5905
17706 5905 -1754 -3684 4320 14775 4946 7711 14444 21718 8843 2731 -1300 -1142 -3243 -11013
17692 -11013 -14069 -6533 3184 8877 -6419 -20907 -1945 13947 14409 8295 8392 -6325 -9065 175
17678 175 4370 2079 -1485 -1628 -580 11386 10009 512 -2587 16902 20701 10886 -8505 -9306 -5864
17663 -5864 -5873 -5973 -7911 -1194 5538 11775 3871 -7070 4209 4154 -2267 -21474 -22685 -12161 3810
17648 3810 18186 11106 -1130 -5842 1164 12192 22184 31149 17684 -4093 -7858 3844 11811
17635 11811 21447 21715 -6607 -10799 -50 -7873 -12039 -10965 -13716 445 5898 9491 8031 8860
17621 8860 16119 14823 18378 12616 1757 -441 -5822 1801 17708 19482 11014 7717 -2680 -19416
17607 -19416 -8246 -14133 -25037 -9018 -917 474 1680 12413 -1168 -18841 -18851 -1612 4521
17594 4521 -1044 11550 24185 14464 2480 68 -5182 -8547 -14047 -13322 -6294 353 11107 13550
17580 13550 5971 -5888 -8805 -10900 -11726 -16123 -29456 -42581 -30589 -7128 5113 5795 3051
17567 3051 -1507 -4460 -4756 -5096 70 -11302 -22208 -19241 -16700 -17295 -20867 -28742 -43681 -40334 -20479
17552 -20479 -10538 -10465 -25223 -34033 -21547 2851 17962 18832 10981 12008 15961 15528 -1429 -4397
17538 -4397 9289 2900 -1068 5410 13373 14440 -2758 -4801 10670 12906 3307 -303 3924 7903
17524 7903 8280 4811 2239 -4293 -2631 -17370 -20297 -15780 -17825 -16419 -13121 -5706 -22386 -29188
17510 -29188 -26483 -7991 900 12140 4820 3034 18056 8935 -7401 -4168 -1631 8015 5762
17497 5762 -2727 1978 10359 17171 39202 41832 20628 5681 3089 6018 13660 24195 40312
17484 40312 46952 50370 54590 51429 49049 48116 32117 6861 9543 18093 35065 34095 33423 55245
17470 55245 65984 61393 61103 49422 46467 51872 49675 48178 41608 32075 22635 29143 38364 41983
17456 41983 26769 21919 21219 15324 14925 26365 20892 10116 14514 25005 30252 43432 70009
17443 70009 120889 148470 127018 79939 48827 34925 31974 41510 48672 59473 69265 65846 64041
17430 64041 71848 77694 62566 56829 58905 49732 40760 42673 50059 60187 67487 69738 78189 82220
17416 82220 72357 56986 62513 63545 56930 32651 10819 15274 21672 7882 17473 25823 8994
17403 8994 -8030 735 8798 4476 17489 26767 35654 18591 8343 -731 -12078 3468 14801
17390 14801 29781 21619 10486 7076 4231 2027 2220 13926 33874 36006 27112 22587 13017 6174
17376 6174 864 8085 7739 4819 8505 12488 14841 16313 7064 3815 13388 14296 13863 18915 20295
17361 20295 18945 11333 6182 9583 5962 -5042 -6634 -6117 -6261 11211 11673 5582 12342 12547 -4002
17346 -4002 10836 11016 26935 29125 28979 17683 -5442 -12523 12073 16317 -6854 -11480 -7965 -370
17332 -370 254 7053 -3379 -12293 -1544 -2275 -4167 -20017 -25788 -17400 -15098 -17370 -12970 -1821
17318 -1821 10373 2179 -899 1242 -8136 -9372 -8370 61 -2167 340 1471 2086 3682 4416 -8361
17303 -8361 -163 2787 -251 -6363 -12971 -13488 -18092 -6201 -5344 -2958 6668 5352 4249 13062 -4818
17288 -4818 -10224 -2427 16467 20774 8463 10519 9448 9086 10720 11067 -9330 -8078 3412 7068
17274 7068 6275 8450 3897 -2989 2771 10459 13653 15685 1167 -23169 -25470 4655 17247 18249
17260 18249 10082 5746 2699 -5967 -11360 -6974 5030 -4531 -4442 1452 13407 9564 -25064 -30470
17246 -30470 -9148 -1700 -2368 -6544 7603 18208 19532 20477 13661 16714 20514 11800 513 11191
17232 11191 4599 10363 15366 888 -3219 9494 7069 -6178 242 -1784 -8019 -3594 -2636 -15892
17218 -15892 -32061 -20226 -9492 -6897 6100 5070 3882 6956 5078 -5489 -9098 -10853 15012
17205 15012 25747 21513 27999 26312 31284 40128 36559 41279 43845 30105 24208 15836 4676 7665
17191 7665 13937 28399 28687 36483 29185 28803 41453 38219 40117 38529 38886 30031 24615 8454 9463
17176 9463 8095 19343 28444 7743 -13084 -13018 -3291 -4249 9475 16506 20818 23572 11126 6884
17162 6884 17073 26964 30369 21079 16170 13105 11568 5259 18106 17476 9681 4791 21601 33935
17148 33935 38636 35676 32549 26370 45294 55224 44938 44469 41131 20485 13182 15269 8623 14680
17134 14680 13322 12977 24619 31232 20573 25145 19751 14172 8091 3883 13784 11941 4732 1970
17120 1970 7955 -3203 -5941 3171 3461 7066 7775 12334 23889 29796 18969 13492 16527 30533
17106 30533 50729 51338 40074 32684 18937 2052 8747 27934 26418 35415 41527 37574 32259
17093 32259 29517 25821 38108 31441 28655 33581 32672 37706 35047 40683 36961 37651 44978 52023 53225
17078 53225 47330 42647 31225 34191 30826 29263 21418 26593 47400 49318 37702 44042 36538 31282
17064 31282 21695 23990 33916 41145 30704 31325 38646 43630 38739 32295 27592 40597 65557 79602
17050 79602 73571 66108 54831 45012 38207 44571 46957 38030 36487 42667 43743 36521 26037 42162
17036 42162 56276 60818 56736 64923 71862 78885 89429 99701 96388 97806 128233 151448 161871
17023 161871 165363 171985 164391 175832 212075 229601 247094 266634 291299 317001 342324 357204
17011 357204 393398 446900 506226 577688 640113 695393 784166 897256 1032360 1186020 1372856
17000 1372856 1623080 1959566 2326313 2651589 2856040 2909666 2908002 2926726 3049327 3318986
16990 3318986 3743298 4395526 5378919 6875572 9058769 11924283 14976084 17236011 17775540
16981 17775540 16601864 14631613 12768151 11341398 10219769 9224872 8370033 7789178
16973 7789178 7547124 7588272 7714723 7700058 7366907 6692904 5859097 5058079 4379865 3847145
16963 3847145 3435613 3132893 2864428 2636555 2458825 2306156 2206613 2111822 2032692 1966464
16953 1966464 1932639 1928081 1935448 1977923 2050506 2166977 2322230 2545855 2882756 3350532 3981037
16942 3981037 4747223 5523493 6097785 6350981 6372565 6371740 6548821 7033396 7789716 8721245
16932 8721245 9769123 11060053 12779651 14836760 16640684 17230475 16052035 13571216
16924 13571216 10828585 8529721 6902772 5810646 5086357 4608880 4286733 4115755 4063474
16915 4063474 4064548 4059310 3955890 3698379 3317001 2891591 2503038 2178612 1919987 1714200
16905 1714200 1550075 1399909 1249169 1121972 1023600 937721 849491 772600 724334 664975
16895 664975 595581 546566 519883 494021 457340 418325 378256 348409 328199 308544 292579
16884 292579 277023 258323 238497 230588 204163 186950 180152 177711 169677 153781 144897 139407 133874
16871 133874 127556 117757 107571 100368 89888 96006 102190 96150 92971 90369 96430 78466 68994
16858 68994 85899 101306 94358 73622 49299 58749 55268 50226 54120 65431 49225 44467 48431
16845 48431 56661 55125 44599 33039 14668 16896 36411 56856 65473 68344 65164 71002 66089
16832 66089 60924 54629 49509 42227 48399 58088 57842 47531 44036 44578 38245 35968 46032 44170
16818 44170 25351 44525 52846 43938 37268 34472 43869 54702 57701 41106 30388 18706 11140
16805 11140 20206 31877 32056 33945 14503 7100 -1472 8294 11123 25877 35292 34646 21351 29242
16791 29242 34169 21490 17284 11782 11819 19301 31671 46270 60832 62501 52299 40360 28455
16778 28455 28881 26946 26293 33652 35275 26452 21592 21420 29844 40043 30405 26400 23428 -1827 -21572
16763 -21572 -15428 9934 22378 18436 25501 13215 10042 17159 4332 4605 2140 3836 -2343 -1281
16749 -1281 6499 19217 25079 22888 15020 12171 9069 3331 6024 11875 14719 13368 12133 18603
16735 18603 7607 4529 4748 -1261 -10429 -5659 -8966 -8611 183 10668 17429 20498 8290 9562
16721 9562 1090 -11733 -16671 -8137 -11993 -147 6408 26463 28358 7190 9042 13814 10661 5368
16707 5368 3425 10788 9698 15268 3189 -23842 -24162 -9320 839 2188 15752 19995 17012 17921
16693 17921 14191 7478 -983 3726 13665 3018 5705 21679 34592 35600 43338 39872 25745
16680 25745 7916 4348 15776 20375 112 -5377 -6706 -14259 -8511 14667 25234 25544 26690
16667 26690 36228 35595 34054 33993 34599 19865 17615 14119 28466 44594 30618 14802 12703 13026
16653 13026 2363 -1474 5175 9969 18939 20822 16547 7636 -7604 -10743 -26201 -23080 -6072
16640 -6072 -14141 -16505 -3872 14500 8241 1147 -3406 -17349 -9915 -8677 132 13228 26644
16627 26644 18260 7951 7069 7759 5848 309 9784 -1023 -155 -4559 -3414 786 -5715 -5021 8968
16612 8968 27596 32609 16560 19684 31747 26920 15190 2716 5981 -8101 -177 11539 -2115
16599 -2115 -21789 -12856 -28178 -32649 -9684 -1359 -1419 9893 7871 -5476 -11469 -4017 -7627 6896
16585 6896 11118 14098 5731 -5874 995 4003 5641 8988 4139 -3020 -6022 -6444 -15596 -7780 -1700
16570 -1700 -65 -1996 16766 24161 15034 11903 16545 20648 27919 29286 10517 -7121 -5404 -1972
16556 -1972 10462 23231 10050 -741 -7803 -3290 6420 402 2250 934 78 -9736 -23183 -35723
16542 -35723 -18965 -8967 -12688 -301 9489 6841 15319 -1876 -8185 -13498 -1439 16160 21924
16529 21924 23918 17000 14343 2337 -9039 -1033 2441 -15421 -23328 -18799 -20371 -7079 17805
16516 17805 26596 28278 19782 17187 6296 -295 -13715 -8934 6876 12735 12638 2451 -3516 -7889
16502 -7889 -7204 -11455 -7162 -922 13779 7058 9596 11135 20741 35334 50636 66934 69067 61703
16488 61703 61173 60690 56704 49845 44983 49018 40520 34735 34000 28609 26639 40300 61766 69965 79511
16473 79511 84923 80371 62118 48243 26280 21773 26172 27809 24139 15074 7521 -1438 1796 -893
16459 -893 -1625 12672 17899 9831 7617 4047 -10515 -11977 5547 9750 19802 11624 -4615 -9359
16445 -9359 19360 35080 45765 45269 46797 52894 45855 50772 61413 65383 69396 70449 63209 40623
16431 40623 25477 17061 20325 28882 28055 27229 25270 45932 66768 68847 71934 78916 72142 65543
16417 65543 56140 40438 41587 33703 23412 23711 17106 16861 24566 15545 9584 7378 7540 16311 23407
16402 23407 17873 20773 8427 1265 9516 21557 18502 8930 4719 10255 16604 2330 -8131
16389 -8131 -7325 -4577 -4733 -9767 1368 -1232 4717 4154 8148 5788 20179 20726 4645 7953 7602
16374 7602 4970 2716 8277 -2076 -6625 -2834 -9183 -14400 -19463 -27605 -27795 -3658 18124 26147
16360 26147 3530 -16634 -27234 -17275 -10523 -5994 2665 23193 14508 -2482 1678 8516 -14600
16347 -14600 -13695 -16918 -21150 -11559 1984 -4526 -1318 -2198 -2795 7079 12888 8084 -6128 -16820
16333 -16820 -17971 -16280 -18133 -23849 -4371 10769 13960 18355 8316 -4308 -9294 -11379 -14993
16320 -14993 -15490 -9580 -5131 -12415 -17529 -1828 4415 7848 7642 15725 23671 1810 2824 -17
16306 -17 5935 4340 3456 -4928 -13602 -25854 -13600 3549 13519 17647 27606 13743 -9895 -4176
16292 -4176 -5606 -13797 -24372 -21072 -11181 -3516 -797 -4974 -2420 -3614 -11662 -17735 -19189 -9252
16278 -9252 -15125 -14100 8863 6495 1044 9103 13797 15151 25471 24790 4473 10413 24869 26937
16264 26937 15663 10605 14958 796 -4385 -8737 -7970 -1956 -8548 -12279 -4200 -5351 -17983 -21400
16250 -21400 -15956 2748 8791 4391 8457 14740 20794 18668 17648 -2903 -62 -1732 -7472 -11017
16236 -11017 -25798 -23158 -27279 -28579 -11836 8489 1963 -950 -1528 8915 -497 -9052 -76 522
16222 522 -12963 -11972 -12887 -22503 -24701 -22658 -12872 1918 15964 2014 -11301 623 -9161 -18136
16208 -18136 -2652 1625 9720 -1924 -14264 -11324 -6225 -10105 -6714 -3940 -11696 -11660 -12248 -25940
16194 -25940 -25317 -23196 -16683 -24628 -6639 7080 -8006 -17830 -18520 -14625 -16317 -9305 -7651 -7641 -3077
16179 -3077 -949 1181 6097 14523 4772 2501 -4498 -2169 -1021 -5340 -10758 -6224 3630 16295
16165 16295 4697 -244 8541 24255 27587 23619 15393 -202 -16250 -24811 -22063 -17351 -9971
16152 -9971 -26928 -22008 -12953 -3029 5572 -7340 -14412 -8748 4739 18591 17697 -7373 -24181
16139 -24181 -5968 6589 7227 7041 6344 -2825 -2682 -8008 -1341 -7291 10224 17314 20964 11435 5624
16124 5624 4291 6405 -3593 5432 6424 -7478 -8737 7621 11448 2817 -1966 -3918 -6945 3705
16110 3705 7948 1086 1596 188 3239 10738 8510 13501 6195 -373 -3077 6060 13621 12493 -8359
16095 -8359 3368 16737 12817 7079 11910 536 -11525 -25831 -34596 -32455 -35518 -23373 -10849
16082 -10849 -10791 -35613 -33962 -26951 -29534 -25667 -7441 6325 4232 8561 6060 -14366 -31696 -22332
16068 -22332 -451 1959 3603 -1728 559 4824 20989 31932 12394 -3902 -13800 -9748 -12466
16055 -12466 -10370 -17930 -8092 528 4016 -6320 -16129 690 17422 18739 19116 10026 -16810 -31791
16041 -31791 -29549 -18559 11690 5206 -6575 -13558 -17190 -13521 -18235 -9605 -12982 -8180 2635
16028 2635 -11635 -20128 -23117 -29428 -9338 1563 3142 10206 4572 9337 20291 16545 7418 1833
16014 1833 4815 -6969 -18807 -16732 -25731 -10485 -994 -4300 4005 15416 15391 8125 814 -6764
16000 -6764 -4298 12163 8515 18812 28059 27306 37249 33448 13965 3726 3381 2674 36 3905
15986 3905 14171 16887 13954 20768 33782 24229 1991 -2433 -10181 2253 17403 29633 22949
15973 22949 22704 23193 22013 12279 1696 -2123 11997 22836 9592 -10377 -9873 -6004 -6869 -12301
15959 -12301 -3808 -2968 9155 2613 -16150 -35231 -34537 -7664 -8510 -11771 -10792 -7723 16281 13626
15945 13626 1588 -4274 -7391 -11308 -19162 -20963 -32509 -37689 -28046 -26985 -23008 -32247 -28524 -30179
15931 -30179 -26029 -21216 -6182 -18112 -27426 -14764 -11803 -23415 -30245 -24703 -16167 -10891 7019
15918 7019 13261 13399 9332 -8331 1073 2676 8722 5215 -12437 -12645 -4860 -3207 -1069 -14595
15904 -14595 -19217 -26296 -20169 -182 11418 5421 5204 -4328 -5538 -556 11907 17221 3707 -3522
15890 -3522 -4884 2113 -3309 -21585 -36306 -35001 -31749 -22141 -4408 4072 9451 -5218 -25342
15877 -25342 -35080 -37644 -28568 -19042 -16060 -21424 -7519 4329 16627 9628 -6843 4123 8160
15864 8160 3763 5724 2 -4455 3937 6422 -13559 -22727 -36392 -32663 -34839 -14480 -2119 -3273
15850 -3273 1508 -590 -11584 -11284 -242 8587 7370 5354 -2417 4571 6928 1823 3302 1794
15836 1794 2167 -7779 -9101 -8750 -8037 5528 11366 3937 -13809 -16070 -8283 -17354 -24456 -9234 695
15821 695 5912 16821 29734 32982 39124 16049 5475 4712 -638 -5117 -13618 -3606 9213 12501
15807 12501 21684 6640 5138 1750 372 2303 4979 19747 22350 15812 9764 9203 18039 12545
15793 12545 10368 15771 22680 15220 1220 -8172 -8847 -2583 -14610 -12296 -7733 853 -7956 -11214
15779 -11214 -22471 -26168 -33958 -27053 -3360 540 2373 -313 -845 8815 4819 479 -326 -162 -5826
15764 -5826 -1027 6132 8755 -749 464 5121 1550 -8047 -25286 -28955 -22039 -22759 -27288 -32773 -16209
15749 -16209 -1659 12220 16241 15538 15801 9195 10223 -3146 -26535 -15630 -12312 53 16908
15736 16908 8760 -4878 -15492 -3278 -2245 -8738 -5860 11055 8020 766 1685 -89 2434 -16207
15722 -16207 -35562 -28765 -15688 -14814 -10293 -12386 -11348 -6109 -10861 -14704 -3881 7135 258 2599
15708 2599 10641 7097 -12833 -25347 -15697 -4301 8416 4927 -2676 -15558 -16324 -2160 5902
15695 5902 12878 5143 -6548 -29669 -36099 -32498 -27854 -20990 5256 7912 2990 5402 -2215 -16438
15681 -16438 -11554 4659 6510 -8630 -4114 22179 30409 23128 11330 -1772 -2126 2873 -2310
15668 -2310 -3067 5834 9499 9401 -14186 -14690 1675 15334 10363 4873 2386 -9736 638 3987
15654 3987 19625 21036 15788 705 -14524 -9855 -1546 4281 -7162 -11620 -16673 -20557 -22752 -21379
15640 -21379 -20229 3278 26420 26792 12370 -6078 -8495 -12363 -7065 -11121 -25259 -26148 -19565 -7534
15626 -7534 -17616 -672 12875 15211 4879 8231 13814 1193 9199 16627 8309 -57 -5103
15613 -5103 5405 7089 3956 -17 7373 14704 19480 21937 21032 11290 3407 -14616 -6618 6746
15599 6746 11856 7118 10576 3393 5567 8979 6063 2968 17679 14024 6747 4297 -4390 -4829 10430
15584 10430 4559 -4020 -10918 -19661 -22058 -19542 -13312 -12130 -1501 4315 3928 9566 -1551 4064
15570 4064 3244 -6520 -10598 -14548 1408 6992 5006 11779 13167 1779 -3574 -6981 10682 19893
15556 19893 -13729 -28740 -24528 -15812 -7131 1438 5688 11852 9410 -3658 794 -5882 -8776 -12413
15542 -12413 -8977 6988 5507 6126 8647 8302 4151 6890 1581 196 2850 14078 10479 -7121
15528 -7121 -17808 -25137 -3100 12317 8237 -4297 -6436 -10515 -5038 9188 22834 13081 10218
15515 10218 643 -11799 -3976 991 410 15975 10557 4456 3270 -4051 -6880 3545 10723 -3292
15501 -3292 -13424 -559 14644 21000 15007 6176 954 -1674 1773 -9868 -23561 -20436 -14011
15488 -14011 -10277 -6684 -3845 6158 14123 8116 17544 8864 2922 14765 17117 4784 -4418 -23264
15474 -23264 -17702 -1946 -382 -5657 -24644 -32349 -31975 -9365 3780 7442 2756 -9423 -311
15461 -311 3407 -7193 -11421 -9751 -17686 -12754 -2181 10113 9801 6148 -5434 -15569 -18810 -5686
15447 -5686 2923 22477 15454 6066 2018 815 12164 5837 -4823 10352 21210 21938 15397 1400
15433 1400 -9200 -2074 -1642 5364 -7331 -13756 -12842 -17281 -2959 10397 19917 15695 7289 -2436
15419 -2436 -197 2075 -15156 -26890 -20434 -23438 -22015 -4900 -1609 1170 5343 10710 3820 -5089
15405 -5089 7438 -2400 2664 2058 3375 2930 -1601 9891 4389 1180 -9121 -22988 -23221 -29173
15391 -29173 -14245 7318 13975 -109 -7907 -6245 -7736 -5897 3636 8409 9060 12888 11048 -5188
15377 -5188 -9867 18779 45887 32457 3288 -16782 -18818 -5947 6680 1959 -8222 -18811
15365 -18811 -27941 -22694 -14132 -6276 18710 17685 9803 3172 -7932 -19325 -2174 -6539 -17368
15352 -17368 -22763 -11986 -10025 1343 -5302 -4634 -8103 -1020 6381 10202 -2871 -20196 -26224 -17998
15338 -17998 -3751 4442 -12048 -11134 -5807 -12260 -16493 -20045 -31839 -25375 -30773 -48043 -37382
15325 -37382 -2053 9654 4488 -8270 -10899 -7129 -6037 846 3888 5714 7328 6507 4153 -2543
15311 -2543 -7037 -8030 -2936 -726 -6056 464 -5193 -26480 -19991 -3884 -8468 -12985 -3330 17740
15297 17740 36549 36358 32906 32078 37087 25047 6704 7259 19552 14714 6239 17260 18588 6099
15283 6099 -8784 -4078 -3263 -13482 -13526 11235 10340 4369 2273 -3103 -7678 -2520 -18139 -28837
15269 -28837 -22594 -19104 -15099 -4710 -12262 -10132 -24707 -25799 -7718 309 916 4555 9624 -2359
15255 -2359 698 -13148 -20683 -22584 -33525 -24790 -15267 -8847 -5843 -4597 -2757 6003 22455 20847
15241 20847 16751 -1853 -4316 -2089 26819 28587 10896 -8775 -23082 -21422 -17694 -12158 -22711
15228 -22711 -33257 -26840 -12590 -11642 -15122 -6092 7412 14467 19366 19464 19830 19430 20335 16959 13412
15213 13412 5067 9340 3043 -10915 -12995 -8803 6294 25282 9410 2491 8575 9683 15881
15200 15881 10504 -1523 -9300 -8178 5412 -2240 -9043 -17169 -15949 -8972 -20264 -21911 -30044 -27283
15186 -27283 -18281 -14895 -12153 -17232 -7746 -1728 -1270 -17875 -28272 -26500 -29973 -22532 -12734 -3307
15172 -3307 -6388 -2913 3807 2325 -9232 -4874 -5054 -15077 -13143 -9245 -12602 -19303 -25327 -32703
15158 -32703 -17480 -12149 -6606 -50 -1751 2882 3031 -1544 7110 2951 -9018 -8299 2756 722
15144 722 -7061 -7550 -8687 -6768 -4934 -4972 -4745 7461 10490 17705 20157 22006 2170 -12174 -19207
15129 -19207 -3780 18430 15662 11115 -5477 -15202 -18668 -17524 -21314 -17985 5491 12863 2365
15116 2365 -6681 2466 5752 -7026 -11541 -10295 -9082 674 9776 16535 20684 14222 10252 8628
15102 8628 1223 -18290 -29012 -9652 7677 8518 12667 9475 6356 2693 6587 12604 28838 28217
15088 28217 16460 13256 -2020 7466 6305 9854 18111 20506 25978 27923 12909 163 -14500
15075 -14500 -3534 -3709 -4336 3505 9744 11489 5946 -10779 -24304 -27507 -21168 -16486 -12033 -492
15061 -492 -2698 -12071 -6437 -9299 -7970 2349 -2580 3509 -11393 -18062 -6200 -7322 -3481 9905
15047 9905 7528 12150 9799 6487 7766 1678 15666 672 -3830 3801 15003 34883 30624 31648
15033 31648 12130 9508 16381 12730 11020 -1605 -13688 -3517 12677 16614 14802 17029 10162
15020 10162 3594 -4240 -4159 -6230 -4218 5219 10598 9660 27381 30606 17381 17414 17710 5792 7545
15005 7545 3557 6865 -7743 -28907 -33746 -33441 -30927 -30430 -22846 -33930 -34273 -30905 -19775 -15393
14991 -15393 -20227 -34532 -36543 -17919 -10626 -10214 -8929 -1020 -9563 -21084 -15552 -1158 4886 4609
14977 4609 -239 -10337 -3 15882 24175 17841 2252 -2824 1498 -426 -7361 363 6548 -1978
14963 -1978 -9822 -15114 -189 9142 3600 -3780 760 -2950 -12613 -21326 -13967 -10463 -28457 -23556
14949 -23556 -18262 -36235 -46032 -36482 -36647 -42789 -22798 -6719 -13708 -8405 -1611 2256 11317 13193
14935 13193 16584 3319 -5713 -7833 11172 1083 -1643 9909 5925 -544 12445 5787 -13067
14922 -13067 -18887 -15815 -2620 -13812 -21762 -11273 -11390 6700 11318 14381 -3660 -11154 1789
14909 1789 2114 -786 -3422 -7935 -21029 -25464 -37817 -35940 -21627 -1470 1196 -4391 459 561
14895 561 -5639 -13261 -12008 -16688 -20126 4348 2059 266 1982 2771 -12645 -17820 -15707 -5932 3005
14880 3005 -2659 -1971 9034 -81 -914 -191 8607 18994 21769 16036 10880 -12910 -16562 -2135
14866 -2135 8704 6667 -1110 -349 6593 11017 14118 14911 8887 -14132 -13289 557 -6112 -14895 -4262
14851 -4262 10997 16278 19296 24479 17520 17848 22470 34753 21854 16835 10126 -2425 -5413 1856
14837 1856 -7556 -21155 -20443 -25734 -23036 -14522 -13535 -17999 -19155 -10424 103 1620 -3282 8279
14823 8279 -3191 -7348 -13552 -8148 -4820 -8849 -14757 -2140 -4567 -15006 -8058 1460 1116 -12619
14809 -12619 -22371 -8561 6661 -6486 -9368 9820 6812 10714 -1186 2469 7037 5004 -2892
14796 -2892 -5196 -15915 -10753 -11239 -9399 -2217 -10510 -9061 17304 8674 8378 7280 -5645 -23711
14782 -23711 -15898 4553 22850 28547 23402 10838 4485 7249 5188 -4770 -9723 -8701 -7667 -12055
14768 -12055 -1057 5527 5424 4781 10045 14774 11203 321 -729 10472 15553 20138 13785 8508
14754 8508 11719 19653 22907 1561 -13887 -9144 -10198 -6537 -1851 -7419 -8839 -4882 1549 12096
14740 12096 24925 25394 21649 6776 2641 5128 -14187 -28590 -16141 4043 28383 37334 20570
14727 20570 2634 1620 -9314 -7617 -7093 -1917 -6718 -10929 -13359 -20412 -24389 -26202 -35247 -23396
14713 -23396 -18816 2946 30652 29950 24560 24868 8613 -4814 1477 -12802 -17221 -21593 -17786 -11067
14699 -11067 -6975 610 -2606 -12578 -3732 -1297 -3204 -5317 -2842 -477 -8271 -8923 1780 3115
14685 3115 -2995 -1168 -26085 -28841 -23502 -24147 -32532 -39073 -30871 -21584 -16474 -3371 2625 4741
14671 4741 -6144 -8365 -7881 -8022 -6539 -609 -981 9997 10960 17636 25663 27166 16900 5633 -2475
14656 -2475 -9935 -24121 -15746 -7924 -12447 -13119 -14328 -10399 -2847 -3138 -8502 -26884 -36641 -29551 -19934
14641 -19934 -3692 -3405 -10720 -3324 12157 9831 18340 25853 35579 29311 11261 9874 10243 12458
14627 12458 10077 -3602 -7131 1557 -14986 -22994 -21245 -28586 -20215 1846 1584 3676 7035 8733
14613 8733 -9978 -6876 -1947 -10210 -12747 -7639 -10347 -1628 -4630 -3085 -4796 -9844 5396 -6323
14599 -6323 -17237 -10518 -6132 -2706 -766 -2040 8866 20758 28007 15594 -7924 -12329 3396
14586 3396 13607 -8984 -23278 -19770 -2270 8529 4010 7035 -2576 4082 25131 11317 2274
14573 2274 4426 19044 11619 -3419 -8771 -6989 -1691 -10277 -13545 -17061 -5654 -3689 -1356 1627
14559 1627 -67 2305 6175 5195 9327 6189 8159 10505 9235 9359 1400 5835 6064 563 -123 -2340
14543 -2340 -6182 -5172 -15576 -19333 -13966 -1818 -5324 -6460 -5692 -12919 -9728 -13444 -6355 -11904
14529 -11904 -20825 -14539 -8374 5 -2950 -4030 2580 -12059 -19580 -6506 -3950 -4875 -9088 -4325
14515 -4325 4380 7035 5572 8391 7619 12275 16695 9231 2489 9158 -508 -2610 2022 3228 13311
14500 13311 1433 -7027 -19967 -14305 1475 2745 -6814 -8956 -5804 -8520 -15977 -31277 -29464
14487 -29464 -23446 -25315 -22768 1054 19347 15416 13971 17060 23756 39568 34932 23604 7395
14474 7395 -8595 -12792 -11231 -16453 -12185 18327 11424 -3785 -335 -13218 -13352 1666 14420
14461 14420 16797 11061 14548 10283 -6279 -4773 -6510 -719 1056 9082 4724 -9879 -21776 -15102
14447 -15102 -13546 -10723 -20964 -19189 -7593 1667 3227 -3143 8097 4816 -5321 4963 1670
14434 1670 -5526 -5549 100 11205 12264 -1715 1622 -46 -5219 -2513 1794 3686 13693 16784
14420 16784 4026 15018 18556 7594 7597 9052 -2850 -15595 -19819 -9816 -2883 9547 -1016
14407 -1016 459 -11839 -18629 -14910 -15302 -9427 -14211 -21047 -16336 -6196 9553 21819 16179 22
14393 22 -1588 8766 4463 877 7567 2013 -3623 -9247 -12808 -16507 -4464 5267 -5883 -1356
14379 -1356 3942 -678 -7155 -9395 -3352 -5872 -12329 -4319 -5677 -13125 -22175 -15636 4961 16075
14365 16075 8039 9009 4782 -1213 -14055 -4649 7237 14652 5247 -6987 -2220 7733 1437 -9693
14351 -9693 3197 72 -14923 -18147 -32656 -31637 -26329 -13592 -2450 -4131 -5578 -12773 -8888
14338 -8888 -4148 11328 18882 6758 -10153 -24731 -31556 -19262 6440 15126 17609 18819 15076
14325 15076 4695 -1589 -4241 2186 11981 14799 7459 -10826 -35959 -32477 -20517 -19876 -24714 -16311
14311 -16311 -8363 156 16170 21759 13149 10902 12291 20096 16658 19915 27992 23034 -1507 2699
14297 2699 -3230 648 3802 3879 -4513 -7754 -12159 -8144 991 -912 -13898 -19194 -10733 -7782 -15040
14282 -15040 -11062 -5216 -15501 -23515 -4516 -8442 -18027 -9387 -10935 1185 4062 11105 3218 12958
14268 12958 13598 2772 -8314 809 3404 4124 -2816 -15541 -3388 -5157 -5606 -1663 4425 22218
14254 22218 21090 3925 2749 -3856 4049 883 -13650 -18495 -23510 -8504 -7107 -28363 -20599
14241 -20599 -15815 -18452 -5373 -262 -6484 5420 -6194 -8632 1725 2247 -888 -11342 3758
14228 3758 11995 7115 -8961 -1581 7953 6168 -15068 -17263 -10343 -9720 -22356 -25191 -20161 -19698
14214 -19698 -5506 -4334 -1084 -5390 -7630 -6067 -6489 -653 9054 3377 -6347 12768 24691 20919
14200 20919 425 9026 11241 -7328 -20481 -14799 -19163 -21680 -23341 -22182 -9527 -14933 -4417
14187 -4417 9471 9030 14164 19908 9706 1460 -6445 2976 6219 1133 -2344 -16394 -31439 -18961
14173 -18961 6809 13331 8703 -2182 -5663 4526 3412 -5786 -1942 7348 20039 19534 25736 13103
14159 13103 8710 15237 15371 6652 369 -755 4490 4415 12178 9517 5371 5894 9672 6369 -1755
14144 -1755 -6142 -14031 -14258 -23587 -27835 -18254 -19014 -9144 884 2470 4046 8182 8274 12039 4799
14129 4799 -12866 -12730 -6313 4778 1583 -11275 955 11707 591 -13436 1642 20 5029
14116 5029 1201 -250 -6222 -20399 -19262 -13655 -19439 -17826 271 11923 14743 15656 8498 10733
14102 10733 5805 -2719 -9786 -10076 -1780 11282 12599 11202 25038 33375 27487 15295 3145 -7253
14088 -7253 -2536 4562 -9606 -6168 -8113 -13309 -32622 -39570 -31383 -20101 -11535 -12517 -26892 -33946
14074 -33946 -18849 -493 3143 -10086 884 11451 13257 3171 213 -1474 -4829 -11007 573
14061 573 14425 29161 28022 16430 5636 6590 -1834 -10163 -7290 -7386 -1 9287 11172 -4970
14047 -4970 -23967 -25088 -16872 -9257 -6756 10895 22690 6066 3540 -1965 -940 341 10535
14034 10535 3964 -7324 -14780 -20065 -28900 -29159 -11436 2226 59 5464 7855 10054 19495 31798
14020 31798 23635 10477 9108 3471 495 2437 -15411 -22240 -28114 -30556 -36393 -41352 -36782 -25209
14006 -25209 -14274 -17386 -10688 -7257 -11048 -17318 -11878 -15899 -10055 14652 21866 -3567 -23473
13993 -23473 -26461 -15519 -13551 -11824 -6663 -7913 3999 10628 5641 -8118 -19130 -8277 -14140
13980 -14140 -10709 17016 26420 14953 14051 15744 4767 989 -607 -1256 -1826 4341 5109 -2015 -21266
13965 -21266 -43603 -40917 -15579 -16512 -22084 -9055 -7668 -16457 -20952 -28454 -29494 -14781 -4255
13952 -4255 -1955 -7277 -12536 -1162 10092 13938 15773 16824 21811 48 -10291 -16922 -17888 -32059
13938 -32059 -31434 -13959 2739 7065 12505 3134 -15430 -23182 -28852 -11945 276 5201 13936
13925 13936 23061 13798 -582 -3281 3645 1150 -14720 -14431 -8125 7991 -1864 -7827 -13930 -20505
13911 -20505 -20372 -15959 -546 -1212 -6416 -6660 -3274 2417 5642 -6691 -19828 -20150 -31693 -20591
13897 -20591 -6691 -10182 -15791 -9780 662 15840 33223 31237 18610 10880 2731 -7656 -12307
13884 -12307 -14890 -21431 -19167 -19929 -10717 -6828 -16870 5425 611 5403 9234 -4374 -11210 -14607
13870 -14607 -13977 -11996 -12536 -9252 -7026 -1368 -13039 -13610 -10858 -12549 -17814 -11251 -5198 -5286 8311
13855 8311 27639 17276 898 -6577 -10756 97 9676 -2304 -16272 -15689 -10764 3349 11082
13842 11082 3529 11662 19839 23118 15752 6717 10822 18519 5727 -13018 -609 -5273 -16000
13829 -16000 -22179 -25247 -25818 -22041 -18428 -22008 -5712 -15727 -23818 -23652 -21238 -8436 -17964 -35819
13815 -35819 -34147 -24311 -16419 -7330 -7098 -1763 -76 4163 1698 -10530 -9799 -6003 -8764 -20357
13801 -20357 -24288 -20466 -17791 -10287 2180 13713 9273 -2140 590 3300 -18211 -19891 -3237
13788 -3237 1836 -503 -8011 -12966 -1824 5883 -2352 -9439 -13944 -10831 -17274 -21911 -27887 -24157
13774 -24157 -23850 -17606 -7931 677 20270 12354 -2004 -2143 4443 1771 5268 12654 21554 10285
13760 10285 -8374 -20724 -6620 12791 14733 13386 -2101 -20755 -21774 -22301 -23606 -15253 -18449
13747 -18449 -28469 -25427 -17687 -7179 -8229 -15662 -20978 -14138 -1836 5799 -5355 -17315 -1581
13734 -1581 8383 1836 -915 -9702 -12961 -17701 -12179 -17458 -23644 -22420 -11529 -5265 -14136 -14739 -4664
13719 -4664 1162 -3573 -7269 -9250 3252 8595 13049 3706 2928 9105 3471 2330 614 -14145
13705 -14145 -21420 -19776 -15791 -7767 -13056 -10358 -5157 -1329 -9443 -14783 -20585 -14432 899 11715
13691 11715 10388 3974 -3912 -6665 10392 10533 9772 -2694 -8978 -15416 -23718 -14206 -7485 -8658
13677 -8658 -18036 -16795 -12792 -29187 -36867 -36145 -25701 -18374 -19421 -12151 -6565 -7512 -7985 -3011 -77
13662 -77 -320 7199 -3756 -11606 -23963 -29507 -20860 -17353 -23804 -23889 -24734 -18634 -5620 -1000 -3370
13647 -3370 -8211 -12650 -8260 -7551 3814 7666 -1606 -6438 389 -15065 -25843 -22210 -7578 -810
13633 -810 -7088 -5103 1674 -618 -3884 -7534 -3447 1155 -9397 -24833 -22347 -29765 -27593 -11675
13619 -11675 -424 -10814 -12941 -9077 -6404 -624 -3497 -11133 -19001 -31104 -27139 -13393 -3295
13606 -3295 2468 -705 -13763 -11279 -6072 -12644 9044 25467 15132 10628 8863 8553 6634 8496
13592 8496 13248 7563 -635 6886 16880 -822 -16915 -20500 -12626 -10486 -5387 1611 -4104 -9588
13578 -9588 -5083 -805 -1453 -103 2359 8596 3197 -8645 -9466 -10255 -13062 -2418 6149 6903 -9303
13563 -9303 248 -8877 -19190 -18924 -11048 -17507 -17268 -7427 -4393 -8180 -3167 554 6382 2483 -2871
13548 -2871 -11231 -5547 -7303 -659 -7242 -4500 1550 8962 7010 11939 2572 -6110 876 -7767 -11439
13533 -11439 -9551 -5150 -19777 -32242 -30818 -20289 -12620 -21944 -29688 -21896 -18119 -4127 -7946
13520 -7946 1513 8672 -9959 -29866 -30915 -7872 1546 -3848 104 26325 49616 59272 34446
13507 34446 18889 21182 24434 17093 18546 15329 12672 11941 777 -7301 2596 4665 11532 7816
13493 7816 6647 -86 -6877 -14213 -15197 -13590 -13105 -7328 -7209 7989 19527 15755 -2840 -12774 -21696
13478 -21696 -16334 1851 10774 1566 -10810 871 -7017 -18782 -9573 -6752 -9455 13019 11781
13465 11781 5319 7664 -1716 -5141 1617 11304 11585 1891 1539 13331 4998 7833 6240 -1185 -12975
13450 -12975 -20798 -30584 -9276 1863 -10812 -14780 -6445 -1885 585 -10435 -19115 -29293 -34264
13437 -34264 -16038 -4619 -4721 1363 -1384 -4593 9725 13102 -15259 -28430 -19596 -5178 6193
13424 6193 4891 -2356 975 5644 11231 19393 22951 24124 19761 3601 -784 -13804 -15975 -11542
13410 -11542 -18494 -22931 -23208 -9505 2195 3878 6053 23752 29153 15114 2010 -8855 -13419
13397 -13419 -9607 -10431 1778 15877 11348 -12037 -13973 -12941 5037 15778 15471 12597 -10528
13384 -10528 -22004 -19702 -22909 -21926 -11080 -2580 -11340 -9777 -2941 -5124 -1401 -11600 -12397 -11568
13370 -11568 -25759 -22857 -31 14988 7880 5387 19152 10121 -5978 -1536 9819 899 -7574
13357 -7574 -8051 -14136 -9438 3373 10537 26807 20409 3937 7866 9620 3970 -16562 -18704 -21629
13343 -21629 -12951 -12027 -28640 -34065 -36029 -14536 -7218 -3123 2317 1168 9031 5667 4103 6447
13329 6447 -15578 -20920 -15948 -26231 -22037 -19904 -16662 -6772 -537 15099 12256 501 2041 6458
13315 6458 9840 -12462 -27657 -30257 -25285 -23360 -16324 -27982 -25612 -11869 -4000 808 -4985 -5110
13301 -5110 -17184 -15220 1662 8939 984 9611 11602 1812 -5182 -1039 2676 -5375 -8110 3952
13287 3952 5531 13021 11707 -7355 -13134 -16463 -12057 -6445 -1203 -23750 -27619 -14215 -13378 -21976
13273 -21976 -32937 -34980 -30844 -38566 -23072 -10141 -20845 -13524 -3628 7197 12031 1547 -7468
13260 -7468 -9784 -7832 -20814 -29885 -21950 -13888 -14147 -20128 -18998 -13270 -18712 -7558 -10743 -18606
13246 -18606 -11252 -11447 -6801 5496 12147 17107 21658 13547 -8413 -19922 -21605 -31201 -26896 -20510
13232 -20510 -10012 -7691 -24 -17204 -24768 -35132 -27822 -8814 4200 1388 -5997 -4499 -7510
13219 -7510 12205 10143 -5050 -15564 -14538 -5338 -8390 -16491 -845 5937 4376 -6260 6371
13206 6371 2020 -4373 7839 3346 4284 14967 317 -9550 -9735 956 3518 273 -5655 2242
13192 2242 3187 -16133 -8006 -5455 641 12034 12032 -4681 -5932 456 -5532 3820 10103 15316 -51
13177 -51 3399 2980 9241 19897 18588 12862 -9040 -5227 1362 6924 26870 41740 27905 999
13163 999 7202 15341 -2352 -4809 1706 -1356 -17733 -17817 -3507 -5426 -13345 -18501 -12137 -23605
13149 -23605 -26461 -26967 -34866 -24136 -19599 -4527 2489 -11690 -26138 -33568 -22762 -9477 -1627
13136 -1627 2846 10758 6045 -4391 -513 14561 17250 10986 23961 25814 12373 9871 22015
13123 22015 11405 -480 -7952 -2686 -1468 -464 -6328 -24629 -27207 -17157 -11527 -18410 -8950
13110 -8950 -111 7306 -10608 -17363 -22054 -18985 -14971 -22930 -22996 -8028 -11319 -22070 -17775 -10542
13096 -10542 -6220 2486 -3650 6026 7430 -14477 -29129 -19234 -1174 5565 6917 -7334 -12426
13083 -12426 705 -3036 -12722 -6048 -75 -2365 -2148 3264 -7917 -13882 -16831 -21090 -5656 -3360
13069 -3360 -2922 -12270 -17643 -23583 -21631 -20798 -20652 -17027 -5593 1082 -7792 -30484 -24311 -19099 -1302
13054 -1302 13194 16625 -7725 -21167 -3885 8414 7198 3442 -7952 -14171 -1928 -3491 -9973
13041 -9973 -24795 -17759 -9682 -585 -16579 -27440 -24476 -17087 -28481 -17591 -7462 -9329 -4144
13028 -4144 -6393 -277 -7245 -6680 -2946 -5245 10496 14581 2391 -3355 -21 3502 -3685 -10446
13014 -10446 -14325 -18837 -23674 -16529 -6220 14405 23651 11559 5186 -2312 -4845 -15007 -8961
13001 -8961 6600 14201 14344 -2052 -10701 -23420 -26352 -17432 5379 20988 5854 -16252 -25022
12988 -25022 -24550 -20178 -18013 -13055 -3668 7915 -2807 -23926 -20899 -3931 5123 13335 18632 12286
12974 12286 14648 10375 8865 19532 22106 15371 13095 4941 -7446 -23202 -9475 -5234 -17061
12961 -17061 -11915 665 -8083 -12934 -20310 -18960 -17804 -18027 -9231 -1214 1450 -8330 -21425 -13671
12947 -13671 380 4309 -2319 -12464 -26908 -41132 -23991 -16864 -3627 5725 2240 -13002 -16145
12934 -16145 -10191 -9141 -6915 11030 11401 10587 -3863 -23489 -25710 -19104 -34291 -45251 -27449
12921 -27449 -25774 -34207 -36705 -26242 -21500 -28404 -25606 -22599 -23876 -15936 -3751 4740 -172 8496
12907 8496 12488 1766 9440 3194 -1442 -7402 -14503 -18930 -13033 -1174 -2352 -4410 -6796 14180
12893 14180 39981 40844 25108 22892 31964 15767 8057 -5016 -18676 -18832 -21113 -15822 -11663 985
12879 985 -6544 -5079 -4535 -6355 -4185 9977 12700 4772 1123 12361 1150 -5042 -3260 7567
12865 7567 4170 -10880 -25633 -17028 -17624 -15623 -13863 -8445 1466 9725 13133 5250 2809 1833 7037
12850 7037 16558 11268 13328 19274 6750 -7747 -2547 2355 -8837 -9586 712 3791 -6307 -19853
12836 -19853 -18163 -24339 -27750 -32150 -30220 5717 22415 13879 9541 1543 2226 2753 1882 1979 -1327
12821 -1327 -9286 -17702 -9109 417 -3908 -7084 8260 16695 12644 -7500 -10749 10487 13127 14361
12807 14361 14788 13161 11794 18741 14822 20390 21087 16551 13994 18350 20180 7143 -5327 -8083
12793 -8083 -10852 -15615 -15381 -1433 -53 -4628 -6341 -10309 -11515 -16865 -14688 -4463 -16333 -31062
12779 -31062 -22377 -7034 -2079 -5751 -5296 -16175 -17164 -11222 -11017 -8461 353 -8850 -5056 2370 3676
12764 3676 10935 1028 2567 8015 5098 -5261 -1753 1107 -4267 -3662 -6786 -16250 -11724 -763
12750 -763 -6854 -13992 -15913 -9959 7840 20736 30109 12369 -667 -11011 -5480 -10193 -21900
12737 -21900 -26574 -13452 -11708 -5400 -13350 -14304 -5100 14775 24027 16027 6125 14475 20472 21855
12723 21855 22449 18972 382 -4343 8735 16118 11524 10347 12072 970 -391 -9378 -10804 -8902
12709 -8902 351 7690 741 -12872 -16440 -9036 2190 1375 8774 17577 15697 11535 16098 10170
12695 10170 9761 11408 11923 -1751 -21363 -17886 -9425 -1887 1379 3533 6054 9176 12273 10052
12681 10052 14777 7016 11389 655 -5640 -20452 -21613 -23679 -22956 -6500 -10457 -17573 -9118 -11074
12667 -11074 -17032 -15873 -10447 -927 9036 7965 6720 6192 882 -1427 3893 2874 1983 -3344 -3065
12652 -3065 -5248 -13040 -16510 -12444 -5181 1102 3199 13388 14531 13800 8982 6323 7058 3588 2677
12637 2677 5184 -5826 -10560 -2172 8616 10008 82 -2006 -9391 -12611 -24735 -20385 3258 4078
12623 4078 -18338 -27106 -19958 -437 12350 11439 925 -4689 3445 11355 15256 6466 -5700 -8777
12609 -8777 -17781 -13722 -8700 -2967 2236 -11615 -18615 -29110 -21827 -5900 6727 12855 11275 -4063
12595 -4063 -1357 -2956 3905 -6949 -19446 -27354 -25642 -25518 -21064 -16057 -6429 -6469 7362 8636 -4794
12580 -4794 -20947 -13021 5719 7850 -10585 -17376 -5964 1736 -4504 -6244 11895 11939 -7490 -15085
12566 -15085 -9140 -8045 -5293 6212 -571 -4332 -10209 -7286 -5867 2858 14362 17771 5430 11074
12552 11074 12989 6475 10968 3111 -9165 -18260 -22126 -22120 -8855 -13245 -14705 -17620 -16462 -12144 -7665
12537 -7665 -11508 -20069 -23772 -15964 -12468 -10033 -6670 -7633 -10407 -8446 -17818 -24195 -7797 7417
12523 7417 7487 9058 685 1639 964 -6830 -2624 -6874 -11131 503 2883 5242 7226 3043 3803 -5272
12507 -5272 -11993 -20793 -6822 -3846 -63 10024 8693 5149 6350 307 -17309 -12580 -1343 -5990
12493 -5990 -10968 2140 -6995 -18902 -22219 9632 32396 29253 16494 15325 20464 9644 -2301
12480 -2301 -16333 -16930 -10014 -17253 -22727 -13831 11164 12397 11553 19423 9997 11194 8021 2020 11176
12465 11176 -590 -1651 -10073 -18868 -25025 -19979 -13807 -7141 8399 6037 5762 -8012 -20830 -5056
12451 -5056 -7128 -16724 -20249 -10989 -4067 354 -9205 -15120 -12970 -17778 -34978 -34562 -31572 -25428 -29340
12436 -29340 -28972 -28576 -17887 -2173 8418 14298 16926 23023 27985 25494 18272 17508 16577 5773
12422 5773 12677 21937 26955 35784 24045 14410 9866 496 1569 1382 -1941 5834 2573 2317 3596
12407 3596 7493 5155 -4889 -352 8148 7227 5298 -4880 -18133 -12646 -23165 -26831 -18783 -24986
12393 -24986 -28946 -23280 -23101 -19357 -7218 -4016 -6822 -13910 -16310 -11151 -3444 3528 1192 17460
12379 17460 15880 3395 6311 9824 7774 10166 1179 1437 3232 -7791 -2082 1589 5140 -11372
12365 -11372 -22160 -27233 -22959 -14258 12664 17637 14325 19503 23399 15844 27815 16462 5777
12352 5777 5705 -1466 -16697 -28884 -36165 -35017 -12127 7863 11523 193 6133 16088 17188 22630
12338 22630 22844 19667 18396 22906 33559 34777 43065 45518 49125 54165 70814 53850 57625 67579
12324 67579 68102 55560 56796 61760 54834 33403 29337 27814 30876 49586 54172 32856 26313 37357
12310 37357 53716 57916 58284 51664 48352 48895 38535 45423 60412 49816 54281 67706 68788 76120
12296 76120 94391 101545 113815 118556 129376 147893 137591 120022 116171 100096 86992 83849
12284 83849 72651 64248 61696 80066 90577 88548 77430 60355 54113 59235 66959 73405 65864
12271 65864 70123 70159 68940 62824 54864 57383 64828 61849 54363 41714 19822 15230 39390 35213
12257 35213 37541 44502 55588 55521 53562 61705 69589 59129 57008 55558 62532 49374 29532 24421
12243 24421 11092 11927 7188 18352 24204 11878 -2468 6315 12881 29206 24285 31747 28375
12230 28375 14867 8245 10352 11844 9108 10176 11714 10661 3012 7317 14193 17328 8775 4365
12216 4365 18192 20014 -4773 -9595 -13904 3271 4739 14936 26057 25008 15703 16786 6062
12203 6062 4842 -2848 -12289 -3552 -8425 -7330 13671 20417 4767 -1742 -12902 -15076 -14268 -13254
12189 -13254 -1479 -6262 -5177 -18353 -15224 -10461 -2824 4219 8088 21487 22284 17985 15002 1450
12175 1450 -6187 -1922 8880 15490 7492 -10271 -10140 10503 8876 6957 12499 12613 10605 123
12161 123 -18700 -16497 -4376 10720 15822 11829 15358 22413 21306 14979 6600 5571 16971 10069
12147 10069 17923 14032 13979 24421 8716 9002 16197 5441 -9042 -15678 -11808 -704 -182 -1976
12133 -1976 389 -2992 -10785 -16674 -8393 -9213 -1035 11356 23955 13068 2073 -5426 -1322 5319
12119 5319 16013 9007 14885 18757 8484 8625 12345 8149 22175 40801 41083 31201 27606 27063
12105 27063 21127 17778 29512 29969 15669 4285 601 5688 -8691 -11472 6022 -3050 -18229
12092 -18229 -13366 4616 22722 24899 13411 12938 15903 25849 31045 38516 29983 15551 10193 17452
12078 17452 6150 5701 12970 24328 35571 24454 19013 12038 15226 18899 10592 12705 20344 18902
12064 18902 10094 11303 8848 19832 42330 46691 34156 25142 10378 14326 33118 30305 24372
12051 24372 31358 35302 35458 35168 36316 33034 36221 37494 25309 37289 39506 37377 42577 41258
12037 41258 38656 43997 36368 27082 43289 50870 48440 43176 32987 21949 10662 7325 29283
12024 29283 41075 39607 33938 30898 35505 43606 40747 33773 49431 51410 50343 46915 56532 73995
12010 73995 74656 69540 60418 48256 56470 61706 65930 61683 58091 45614 49952 48099 53382 62761
11996 62761 57393 60844 66818 75585 80413 105682 112298 95397 77814 72619 76384 87815 94625
11983 94625 97206 113750 118000 119789 126548 137153 151349 160364 157131 159081 185161 216417 233368
11970 233368 241804 265401 272275 273417 260741 245391 241878 249044 249065 244482 240548 232256 236282 243763
11956 243763 265572 279213 287676 291778 308941 329371 318532 311933 315681 302138 287662 293707
11944 293707 301568 299631 305519 300399 291136 286833 307897 316103 344674 383857 416446 434445 461808
11931 461808 500437 538204 580105 629094 668368 713020 768820 825492 882320 926246 987158
11920 987158 1081908 1169683 1252807 1344883 1438604 1502933 1562737 1625789 1671452 1726797 1802794
11909 1802794 1905818 2046008 2217000 2439924 2687224 3009217 3451162 4059587 4881191
11900 4881191 5944125 7262796 8714610 10036785 10921457 11079665 10511923 9504281 8471326
11891 8471326 7650565 7085197 6769134 6637518 6633065 6703816 6859009 7105538 7416576 7755567
11881 7755567 8043000 8237826 8327565 8362664 8408822 8492434 8618334 8814705 9093174 9427854
11871 9427854 9784111 10101609 10297790 10359328 10327035 10269394 10260382 10354809 10600836 11019102
11861 11019102 11668974 12649665 14084888 16205190 19188141 22994235 27086690 30262451
11853 30262451 31252631 29701360 26414362 22683413 19423492 16968101 15236369 14052051
11845 14052051 13253587 12759840 12522432 12476224 12559638 12676677 12698450 12520113 12140406 11655289
11835 11655289 11124075 10627441 10217403 9894551 9635819 9452124 9326158 9196852 9001427
11826 9001427 8749749 8455277 8159610 7909564 7735484 7648534 7630336 7682368 7831722 8183562
11816 8183562 8795488 9715582 10897941 12074957 12843934 12846998 12015186 10655122 9157262
11807 9157262 7761853 6590417 5671722 5001847 4502023 4120237 3840634 3632660 3444780
11798 3444780 3297222 3165254 3041301 2931754 2812544 2676924 2535235 2393184 2242317
11789 2242317 2074197 1915509 1779660 1652634 1550750 1452867 1368969 1291966 1207481 1128210
11779 1128210 1053684 999875 934189 861445 804932 746964 686212 647533 617270 581921 549015
11768 549015 547238 534234 498064 461868 466833 446688 446405 455574 440843 443923 448799 437797 429653
11755 429653 416328 407872 386462 380769 379829 375771 359862 345426 336808 344448 349884 360608 371375
11742 371375 370957 367423 368016 360952 340761 323724 314043 310083 288932 254183 252453 235983 217031
11729 217031 212374 212805 200429 188066 190244 173263 158714 166043 177533 183981 175800 177591 170872
11716 170872 168617 157817 144205 130510 116256 116239 124593 126586 115869 101812 103509 111635 105724
11703 105724 109330 128503 152051 142693 120672 92710 86644 86037 85482 80143 83583 79641 68290
11690 68290 76220 88737 86496 69983 64695 66520 79113 65931 53587 45157 34693 35521 41266
11677 41266 41385 31727 40512 40772 42432 27488 16224 28830 42664 49139 36054 14071 9620
11664 9620 21862 27027 32372 37459 35380 18912 24178 27740 34060 42366 31953 20033 25174 22235
11650 22235 21764 20064 24857 20648 11634 17843 9506 7880 15862 27826 11404 4581 23486 31268
11636 31268 29919 29841 25569 18236 12296 19594 25786 29539 31822 11624 -1300 10586 15678 4604
11622 4604 14551 29052 24018 14700 8603 13149 20139 7312 -804 -579 12248 25104 29452 25266
11608 25266 20056 30613 22643 17141 14634 14364 15704 17161 23958 27516 24574 25196 33091 30216 14736
11593 14736 -1124 -8511 -4079 -9293 -8319 8240 14885 28378 40751 32917 17469 20882 6429
11580 6429 2468 115 -22786 -17919 -13618 5322 28206 25723 16080 3327 11846 21408 16790 5640
11566 5640 2664 59 7506 -14436 -16068 -6462 -11715 -1829 5691 3980 772 6630 2692 8119
11552 8119 18167 7787 10708 18194 14001 1118 -5403 -5861 2032 8666 1531 -1999 -1551 8069
11538 8069 18078 10914 8592 8583 14229 4055 -16996 -8880 1518 -2945 -2429 -1597 -16385 -14511 -13747
11523 -13747 -7137 3472 12313 11866 12263 -337 -4315 3045 17382 12054 5685 -6349 -16683 2118
11509 2118 16560 18351 16163 8449 9303 4056 9729 -4992 1661 1898 1928 3544 -4278 -18068 -17520
11494 -17520 -13417 -8652 8859 1701 -4284 1529 1203 2842 5129 1278 -236 9207 13648 12453
11480 12453 -2448 -4934 18932 33080 30177 33599 35918 32049 30266 27312 15633 15955 15581 10034
11466 10034 20792 21927 12123 18171 22062 13506 10372 32037 47066 61721 70284 63558 60000
11453 60000 68580 85577 73437 55553 50327 55451 60033 62182 63771 72347 71722 66038 71897 57187
11439 57187 45439 43988 44182 55735 45445 40097 36758 27587 25915 31481 43380 46951 49944 55259
11425 55259 59303 61951 59902 51413 45996 56588 69811 83164 83333 62031 51787 66058 84605
11412 84605 100264 105325 104055 117794 123922 142474 169783 154051 121476 101128 77497 68506
11400 68506 73345 67939 56466 48448 38144 25914 51658 55236 64489 60287 48662 49596 48619 48737
11386 48737 40639 37783 32151 23081 32306 37022 52132 58144 48473 36511 25453 24150 31685 34502
11372 34502 47500 59882 73184 74054 70850 63918 52414 48070 56316 48419 48598 67219 58230 54400
11358 54400 52230 45334 31503 29041 29665 26745 40409 39196 31478 19672 15269 15787 26279 34870
11344 34870 33537 11633 3590 4192 648 12143 19544 34087 35303 33177 34008 19657 6975 10881
11330 10881 9039 13918 27981 15096 10159 9494 1949 3 2821 1817 -14153 -14510 -3301 1688
11316 1688 -5292 -8204 -4492 -8539 -9723 5253 20388 7844 16009 33404 34858 27064 13264
11303 13264 5622 3902 -9456 -13208 -8431 -5729 10528 26617 22546 12773 9722 8277 22059
11290 22059 11952 16627 15472 1940 8506 12705 10338 9459 13703 6081 831 6768 4839 4229
11276 4229 2145 -1059 -4076 -12288 -10836 -4483 -6235 -8181 11186 23808 383 -18130 -6256
11263 -6256 -7569 -6705 5779 10981 -6415 -15994 -24262 -26529 -14296 -6279 3516 17340 11102 -9527
11249 -9527 -12372 -10369 -625 3743 5851 8053 -2278 -7663 -12505 -17352 -5076 13094 11133 567
11235 567 -3381 -6075 -13464 -28408 -27383 -10852 -16843 -25217 -14236 -10391 -14411 -13469 4912 2956
11221 2956 5577 1121 -805 -7285 835 6724 4435 12246 10021 10720 -8188 -7953 -3791 5473 8840
11206 8840 3006 -15371 -14993 -9026 6067 14280 7797 5849 -2213 -17236 -20820 -16984 -7970 -312
11192 -312 1218 -6154 -15338 -17136 -6265 -8484 -13400 4066 11396 12479 -197 -6790 1630 10325
11178 10325 2178 -5591 -5369 5709 15570 -998 -5151 -1316 19947 28253 20131 738 -15955
11165 -15955 -22966 -11377 2939 7698 3431 1417 -3683 7163 22462 22254 17026 25051 18169 5778
11151 5778 -4343 -9502 -18424 -11850 -8652 -1329 3249 -132 -10020 -11109 -10591 -3328 -1234 -4052 -16940
11136 -16940 -17397 3850 16618 29507 33799 25187 15312 14332 -53 -4844 -17517 -25933 -13507
11123 -13507 -17648 -30228 -23671 -11360 -11332 -2032 6324 24778 31600 27040 13706 14615 16340 15873
11109 15873 29264 28022 16868 7080 7352 4466 6532 -6722 -2940 15697 8718 19 16651
11096 16651 30053 18841 15808 1940 -9705 -7512 -774 -8270 -3972 11336 6799 -6514 -11167
11083 -11167 3505 14658 18597 6401 5067 -8528 -10775 -10413 -13770 -17567 -18651 -20643 -27947 -25804
11069 -25804 -38339 -27930 -789 4450 12026 9661 -5606 -20080 -14604 -10977 -28856 -28804 -24094
11056 -24094 -12700 -5706 -3244 1708 8864 25059 33886 26722 25298 21561 17819 16412 8560 7688
11042 7688 -3191 4775 -698 7117 21789 23289 13199 3994 3400 14033 13021 -2560 -12458 6425
11028 6425 5898 -187 11328 23649 26548 19033 2190 5932 8287 2340 7658 7489 7035 -2551 -7858
11013 -7858 -13479 -316 -953 2075 -16234 -26606 -12450 -9058 1524 1052 -7797 -9389 -8232 -19853
10999 -19853 -17000 -6768 1627 -896 882 -9572 -106 -979 1773 12719 13044 -892 3983 5388
10985 5388 3632 5995 -7637 -21588 -14645 -1 7361 5693 964 -10703 -12860 -18923 -20677 -4617
10971 -4617 6617 17407 29556 24138 10065 7633 18471 28285 14625 7267 12904 16687 9607
10958 9607 -12623 -24707 -20393 -13673 923 816 -4297 -1123 -1693 6752 22342 26372 24241 14516
10944 14516 1606 1541 2982 -3793 556 8601 11829 13585 5731 10444 3429 4534 -3129 -8488 5026
10929 5026 11291 -18143 -25316 -19588 -3323 -13623 -23401 -26490 -25695 -18363 -19904 -16163 -15508 -14291
10915 -14291 -359 -9529 -18071 -18370 -14871 -9706 -8173 -4538 -8294 -23645 -24335 -15916 -12162 -7896
10901 -7896 -7351 -6560 -13688 -7872 -4938 -5837 -20219 -29234 -18506 117 821 -6667 747 4286 7773
10886 7773 5617 -6206 -17095 -7196 3092 -1909 3461 8624 -10027 -14040 -12389 -17091 -22422 -26827
10872 -26827 -12031 1963 -962 -11009 3241 11024 21876 14669 7750 -2427 -5309 -15235 -12174
10859 -12174 -7693 -17225 -14405 -12641 -12067 -23847 -25737 -20140 -23454 -20853 -21758 -10253 -2137 -226
10845 -226 4284 -1468 -15104 -12276 -5625 -11762 -10577 -11959 -18086 -16314 -6347 -3411 -6639 6277
10831 6277 9490 14449 5829 -4752 -8942 -8472 -11638 -19810 -21884 -13484 -1489 6350 18152 -833
10817 -833 3771 7497 9380 10422 13640 11691 11839 2480 -3666 7422 6514 11058 17303 15473 205
10802 205 -6300 -8821 -1644 -4607 -14837 -17419 -25663 -15952 -28255 -27612 -4103 -12440 -34835 -26931
10788 -26931 -14682 -14112 -28094 -16049 -14362 -3890 16689 6114 926 5820 -14181 -17339 -19262
10775 -19262 -9536 -10658 -8120 -8533 -8888 -14437 -15376 -11964 -6340 -6707 7050 7206 -8312 -22640 -18673
10760 -18673 701 10387 6750 11076 12242 7924 841 -15437 -9899 -4139 7484 6164 -8460
10747 -8460 -15437 4849 19872 22376 22795 13314 -3269 -15876 -17956 -14799 -19951 -23923 -31740 -34493
10733 -34493 -20551 -10547 -16302 -21274 -15173 -15044 -1824 3722 8740 7170 -998 -9981 -8340 -9569
10719 -9569 -2568 -4946 1520 3798 4835 8266 6489 -1738 -6786 -9274 -8142 -14912 -1505 21885
10705 21885 28933 23805 13380 8374 5109 13052 15080 20956 21083 14474 9357 -46 -7088 -10575
10691 -10575 -7228 -1501 1222 -11532 -21782 -19106 338 7552 8649 19821 23151 25265 22371
10678 22371 14735 12140 6157 -5703 -14869 -22947 -22799 -7907 -13542 -14774 -16776 -29241 -28958 -28392
10664 -28392 -27992 -29384 -2336 17636 32124 23384 12637 9564 17620 10260 -12164 -34120 -33047
10651 -33047 -19659 -8271 -3110 -8866 -11504 -12763 -7770 -9982 -1174 -4750 -8371 -12983 -21037 -25536
10637 -25536 -33666 -23422 -18763 -25502 -24118 -21113 -11249 -5081 17892 19684 -2267 -6596 -8437 5181
10623 5181 10054 14978 11620 1563 3185 -2853 8542 -2920 -19400 -22001 -22074 -31466 -29298 -4102
10609 -4102 18185 15526 -3488 -2445 -12196 -22096 -15932 -9486 -8785 -14734 -12655 -8388 -5930 -4740
10595 -4740 -8745 -14630 -9318 -137 3437 3175 1192 12799 12800 -6444 -6828 -11903 -20016 -28656 -13901
10580 -13901 1210 23865 33679 28976 25270 14736 -592 -5344 -2239 -3790 -9482 -10259 284
10567 284 2576 -5729 -9280 -12545 -23500 -29992 -9470 5360 -1684 2311 9407 10547 12524 -3712
10553 -3712 -16496 -6249 -4056 -4099 -8910 -11568 -4669 -9681 -7186 -7321 -7052 -627 2014 -3687 -99
10538 -99 -13588 -8499 -7075 -3613 3457 9621 16545 5546 4161 -10903 -23614 -21284 -3463 5234
10524 5234 6144 -730 -4968 -8157 -20033 -13202 4093 14485 3589 -6795 -6128 -11167 1906 12059
10510 12059 7329 -6659 -19177 -27491 -19304 -21157 -30174 -11232 -13325 -22401 792 20243 16601
10497 16601 7333 -7423 -1548 10357 22069 14336 5681 5561 18347 17646 6937 4518 -7580
10484 -7580 -13724 -12583 -14158 -12601 -26714 -38336 -29236 -12437 -14160 -17021 -15559 -12472 -20363 -4314
10470 -4314 -1394 -10003 -27691 -38411 -40006 -33987 -22598 -23023 -23757 -24196 -26008 -21835 -20029 -31291
10456 -31291 -28122 -15186 -15890 -17009 -17254 -15576 -9630 -3103 4783 -2326 -1788 12513 10950 11201 -20142
10441 -20142 -34202 -22643 -8502 -13400 -20173 -19885 -12091 -14786 -26213 -29071 -23311 -17453 -11205 8730
10427 8730 15104 4034 -3665 -12288 -16512 -8291 -3673 -13750 -25182 -22526 -19052 -18950 -8714 -3508
10413 -3508 11422 19239 25812 13420 10648 -4431 -11602 -18764 -37404 -46500 -55709 -36998 -21536
10400 -21536 -2974 -14497 -22863 -12211 -17613 -21396 -19057 -24756 -13366 -17047 -24513 -31219 -26664
10387 -26664 -25012 -28168 -32807 -18407 -1612 -591 -5373 -1351 -433 -2778 -4984 9143 13559 2198
10373 2198 -11368 -12317 -10842 -2029 -6180 -13515 -14266 -8584 3162 4328 7658 14347 18039 12607 6109
10358 6109 11687 -2745 -15481 -12879 -11345 -17649 -18424 -14192 7876 5651 -6941 -9343 -3321 5546
10344 5546 2366 -1514 -6979 -91 3080 6275 5532 12860 14340 11926 8557 867 -21847 -24489 -575
10329 -575 -338 -7581 -1904 -26881 -34479 -32726 -26601 -15350 -6621 -9118 -8178 1044 2259 -4713 -13167
10314 -13167 -11839 -3500 10516 9876 3386 1694 12594 7253 4981 15200 12769 4220 -5040 2016
10300 2016 6840 8746 3282 9173 13155 12510 1027 -2313 9095 2721 13702 28113 36787 13888
10286 13888 14629 33121 45240 30861 34149 33924 34783 34010 21222 21122 9584 -4952 -10802 -8390
10272 -8390 -7305 -5014 -3762 -5787 -10344 7483 11117 -1430 -4007 -16408 -18157 -10774 -6329 -6126
10258 -6126 -3951 -5615 4999 18549 16840 5370 -5989 -26161 -25810 -15957 -13561 -13190 -1578 6855
10244 6855 9881 5095 4020 18262 24823 34272 39448 42538 55027 69701 71649 82723 74840 71486
10230 71486 75609 66094 53516 31244 36548 27052 9273 -2463 4776 14771 22767 28919 9440
10217 9440 33 6517 8006 20688 28132 23806 31006 30748 35986 24076 10337 6540 7867 12687
10203 12687 12886 22941 29065 39230 46106 56150 60487 78547 81856 90158 111574 136927 134198
10190 134198 115200 101835 92359 84948 97833 94676 76991 59358 44716 30511 41526 40619
10178 40619 40492 39914 29107 19929 11235 11622 25390 32186 24747 9187 -328 12626 14957 15806
10164 15806 24533 30361 17443 10158 20339 22756 15790 13440 9145 8112 15674 38634 54243
10151 54243 68201 82504 93872 99028 104508 108682 86717 72975 71321 63324 39350 24082 31246
10138 31246 37442 43020 43898 42158 28109 13140 16997 23214 23676 19630 18665 5000 -8783 486
10124 486 13364 22858 25672 20983 14894 15012 18952 22393 11456 6456 923 -2288 9173 19362
10110 19362 24854 30689 33232 41068 28773 16192 17231 14747 17641 15855 6826 9376 13682 12743
10096 12743 8095 7377 14274 -4782 -26183 -18229 -1634 11181 7585 -10683 -19067 -25101 -5133
10083 -5133 6275 15950 24273 31785 18830 14099 9013 3796 2469 3859 2316 -12375 -20470 -4630
10069 -4630 5248 8404 9294 7671 20081 28662 26013 25498 33137 28332 35717 62974 104009 153374
10055 153374 165897 121498 87537 69270 55847 53798 47490 34249 32567 36730 35161 11086
10043 11086 751 -8721 -8346 13184 11478 10285 7883 -5898 -1029 19674 35814 38143 45332
10030 45332 39412 43241 27194 17932 6491 2946 5046 6456 14059 19113 17929 9786 8531 14598
10016 14598 18278 27993 28653 30171 40143 30777 11859 11862 26573 37030 27942 18854 15098 11601 -2968
10001 -2968 -12535 -18204 -4767 5873 9280 8636 -10205 -3017 7420 17178 28298 31433 19949
9988 19949 18189 36124 27699 21340 32248 40951 25396 12271 24088 27497 30073 15468 9555
9975 9555 23159 24973 32228 38712 40683 38731 48184 55328 62169 59572 58553 34138 26482 26957 37866
9960 37866 54384 59905 47327 55546 63727 52852 50721 46294 55659 62384 59909 44829 34129
9947 34129 37537 31686 37230 25842 -1217 -8385 17602 20305 19207 19779 31602 42453 59142
9934 59142 57778 52433 59928 64795 60891 41816 28112 32982 50535 51176 55852 62761 42191 36768
9920 36768 30446 22308 27881 45229 45173 51571 70056 81065 69838 64403 63223 66479 73733 77178
9906 77178 73762 80480 98280 119901 127016 131507 122490 119265 135535 144190 156026 187937 197169
9893 197169 211732 220090 238039 267600 288736 281007 268353 288602 311109 341119 371457 384037
9881 384037 394179 396786 392372 385854 389179 399183 395674 381448 365124 359233 348192 344691 347157
9868 347157 375982 412633 439123 463765 507439 560886 633789 736495 846099 923931 961574
9857 961574 992175 1007047 1027390 1033509 1009037 983783 919091 868928 835507 814777 791823 769749
9845 769749 750211 742493 749461 765796 790788 822439 846553 890989 954495 1022218 1077354 1140445
9833 1140445 1218541 1314559 1449510 1596089 1762745 1978911 2219312 2525946 2939340 3488255
9823 3488255 4189424 5115483 6304948 7777647 9404669 10934265 11918734 11935787 11038310
9814 11038310 9720693 8423002 7377102 6626305 6119357 5834179 5721027 5787817 6012261
9805 6012261 6403559 6959918 7665398 8462727 9282889 10052143 10695815 11217971 11585522 11804127
9795 11804127 11881604 11800900 11628504 11421327 11202419 10970513 10739496 10515401 10306410 10170679
9785 10170679 10156574 10334042 10752758 11510445 12743790 14648522 17398930 21018025 25257976
9776 25257976 29303631 31699343 31267072 28336773 24357081 20480269 17306772 14968909
9768 14968909 13369335 12320908 11681309 11353824 11303622 11429262 11677463 11933260 12131827
9759 12131827 12304321 12480408 12643922 12771944 12843117 12810117 12662676 12398708 11971449 11343683
9749 11343683 10518446 9570455 8610510 7776767 7134680 6689224 6383557 6207020 6171435 6314519
9739 6314519 6613398 7125022 7882761 8897239 10081752 11253169 12018439 11974777 11050987
9730 11050987 9599568 8087874 6776009 5725543 4899451 4261956 3779818 3420190 3140883
9721 3140883 2906699 2733567 2575506 2417504 2260101 2100611 1966166 1817669 1682706 1554520
9711 1554520 1429449 1331080 1247699 1160721 1098526 1048065 1013594 987362 971139 962528 959074 961813
9699 961813 984685 1021125 1053614 1070116 1069198 1073910 1070269 1064731 1020876 933986 828899 730223
9687 730223 644009 587554 556744 534662 520714 497537 478781 473093 459677 436591 435169 427983
9675 427983 408905 415696 435782 453036 460232 457544 449958 451963 445166 442575 429559 411817 390041
9662 390041 359897 338694 328959 310107 298598 291290 287460 267426 255847 225291 204616 202886
9650 202886 202527 200253 195244 179610 172425 166141 156379 147361 132614 130791 130064 126003 135393 131078
9636 131078 133561 127302 113189 100370 97769 110466 125383 106474 82973 93630 100593 81231
9624 81231 73602 64768 59105 68279 63487 76273 82051 87159 75630 72910 78708 73931 67435 79298
9610 79298 77031 76659 70738 63501 60244 59390 65846 64743 45587 44878 55812 65403 60762 48815 50899
9595 50899 44559 52182 49247 46844 37011 48256 54166 57423 50149 45391 37160 32312 27357 21664
9581 21664 13637 23024 37154 41997 34493 13082 16489 27449 36377 36225 32290 31289 34015 29341
9567 29341 31112 25384 8941 19053 17762 7443 18509 35641 38979 38120 31732 14333 17594
9554 17594 18357 22105 27772 17949 12442 19220 19273 11578 11314 11711 18078 10690 7630 4820 12350 13129
9538 13129 -7804 -10349 1243 2191 4479 -5859 -12845 -9193 -6652 6954 23018 16070 2834
9525 2834 -8648 -19624 -19293 -18912 -9034 509 7614 5994 15768 32401 31287 40329 40392 42893 33669
9510 33669 19426 23511 23793 21050 11802 18470 26590 35084 23414 28191 34849 36336 37457 27430
9496 27430 8322 25670 26440 12096 9890 20843 45265 37423 17242 17826 21474 23545 24130 43695
9482 43695 45951 42545 36682 25148 13842 17246 25329 14357 8041 13735 19853 13271 18161 17630
9468 17630 12481 26812 29050 21136 17445 15523 10817 19849 24887 34020 27679 20886 29779 22758
9454 22758 20919 23889 26678 21047 22182 17002 15690 23766 18921 21816 11670 23228 33374 30756
9440 30756 40068 41113 28077 31111 36715 37756 45315 49531 38267 36847 43624 33622 15824 10422
9426 10422 7230 19747 31909 32533 27894 22240 20984 23415 23366 19832 24918 36408 35247 41199 36253
9411 36253 28488 18776 8446 -1399 -11712 -8912 7649 30802 34401 46644 67281 76450 102524
9398 102524 118236 111143 105676 106189 115536 109205 92100 68790 55849 39427 34801 34345 43219 52036
9384 52036 62107 70607 60070 52767 54810 50911 38262 43444 42769 40015 25784 29261 28055 16113
9370 16113 22169 28559 19607 28967 31754 22803 36942 45225 46424 64487 56905 69534 91787 113145
9356 113145 137438 150814 162480 159022 168090 160167 131488 123363 121439 100260 88513 76898 58713
9343 58713 66708 75360 74643 59526 67123 69529 56754 51422 40239 20935 20070 33820 54295 53696
9329 53696 26827 22547 21934 35845 36709 34306 38101 38551 36825 27958 22358 21446 23330 36597 59291
9314 59291 66329 65258 81688 83796 65065 57701 62360 66006 62734 49934 59077 70320 51589
9301 51589 38183 38982 27838 13145 26022 19040 8238 22980 37882 27807 14786 18926 24558
9288 24558 39598 24412 19157 27223 29760 29023 23595 19542 5644 -14046 -8641 11693 15576 27294
9274 27294 23284 22783 31850 40292 40427 48897 48187 43129 43441 38125 28278 10459 13601 12336 14643
9259 14643 18302 330 -9983 7475 16370 7851 4797 14445 25043 23967 16348 -5343 -17353
9246 -17353 -15375 -17282 -15756 7040 11505 506 7683 6225 -6641 -11677 -2810 7060 1053 -6653
9232 -6653 -47 16445 7339 -4019 9735 21006 21524 19413 10207 -93 3979 4781 37 627
9218 627 17266 39571 37441 27273 27775 29386 35558 41560 43774 33970 27540 28343 28838 15702 11931
9203 11931 28798 35386 30757 19275 22465 24563 31553 29600 34283 43321 38210 25130 34115 25603
9189 25603 6173 5493 5789 11965 9722 1433 -8406 2255 11808 12637 10531 26700 10772 13740
9175 13740 18111 16105 27903 24528 24124 20219 17009 15638 11211 20623 36875 39181 45126 47110
9161 47110 28670 22824 39178 35632 26528 26606 36179 39982 35818 28919 32122 36480 27755 5876
9147 5876 -956 15186 -399 9443 16983 26132 38111 38705 32954 41937 61776 66605 66592 67897 78476
9132 78476 92506 91674 90649 94808 105232 117967 144140 166237 180086 184823 204710 221435 236678
9119 236678 262954 304997 346438 378280 416443 472028 551905 650307 769982 906406 1064030
9108 1064030 1233355 1414617 1620785 1818608 2048051 2309119 2647923 3198714 4238214
9099 4238214 6205085 9084557 10754464 8753013 5673403 3860614 2886899 2317311 1949375
9090 1949375 1705114 1510911 1372859 1267529 1183917 1120979 1079605 1038006 970175 879651 778637
9079 778637 675778 600434 532927 473961 427518 386998 359642 333797 300486 271423 253257
9068 253257 230254 207433 191320 175062 178484 181910 179287 169426 149985 123491 104701 99909 92295
9055 92295 83540 93877 91321 83320 59488 49863 47838 48699 56158 52216 42048 41598 61482 45837
9041 45837 31025 44653 64310 66929 50336 56677 64639 43255 46589 51434 43486 57298 56807
9028 56807 56124 64356 66072 63387 48382 36496 33593 44861 55643 59716 65250 60613 36964 35763
9014 35763 47292 55134 65108 68248 79003 67807 46710 31215 15366 6202 6595 12039 14545
9001 14545 17537 19098 10340 2308 9207 3779 -11140 -10314 2754 6249 6916 5698 17376 12122
8987 12122 -674 -3261 5800 10762 29793 27702 24001 31975 47040 47357 39112 22851 29240 41407
8973 41407 47123 47539 41155 36118 44714 56906 79950 105672 122974 149018 175118 195700 200116
8960 200116 178420 162529 147718 133832 98872 71818 62573 69199 85836 83966 66260 59058
8948 59058 59507 65762 73786 72526 72324 72342 65930 48740 48783 42821 47268 53729 65737 75850 88218
8933 88218 99534 91139 68101 45620 48316 52801 76447 86982 89173 82444 67319 54886 50828
8920 50828 56446 51788 43145 43042 49664 40546 41210 55114 68618 88840 98190 110961 118460 112877
8906 112877 109586 107049 117052 128891 137432 159122 206342 246040 257185 229626 212784 217671
8894 217671 216293 191029 161173 122638 108181 127705 126527 133804 132493 115264 117024 117412 114907
8881 114907 109828 95747 88736 84529 77864 81010 92733 114631 145507 162282 154206 148793 130001
8868 130001 132129 161193 186862 218886 249349 260983 217424 162565 128837 87340 60370 33436
8856 33436 15951 12773 15448 27080 35428 37645 32305 21005 11568 23100 44449 59953 73935
8843 73935 91566 86100 94850 117603 149114 170052 175044 192461 199162 193220 196352 187646 189904
8830 189904 207809 206796 208088 202613 199566 206918 214682 204101 192254 205478 216744 219196 217497
8817 217497 228146 236338 269970 287345 313881 329459 331434 351539 367404 386923 392260 392743 401309
8804 401309 412980 423816 434181 429699 439773 438219 447308 467996 483608 488543 484979 496624 511756
8791 511756 520380 518490 499964 478694 470717 465389 468329 483375 499414 504715 510014 515759 522047
8778 522047 527301 549150 578036 603974 605949 601441 609590 615669 613242 621581 644812 672537 723483
8765 723483 761773 787539 805775 826712 849484 867715 885107 915880 947925 999951 1057116 1111874
8753 1111874 1205589 1354414 1525897 1706149 1855481 1951520 2025111 2134801 2263014 2385989
8743 2385989 2525524 2680408 2842850 3039100 3258880 3541656 3874700 4222327 4626666 5099653
8733 5099653 5641994 6238322 6909295 7668094 8504912 9407309 10427134 11605863 12949613
8724 12949613 14510420 16348049 18590548 21381518 24660651 28249845 32087130 36331928
8716 36331928 41393993 47939876 56952478 69644142 87759440 114074514 152439641 205360272
8708 205360272 265220967 303917381 291050329 237700294 181742090 140166835 111788347
8701 111788347 92296660 78562622 68654408 61417677 56093062 52142877 49124629 46741183
8693 46741183 44508478 41774558 38295171 34494472 30814359 27500458 24594440 22036054
8685 22036054 19777132 17798648 16070294 14565989 13272033 12124498 11095307 10181701
8677 10181701 9378013 8641384 7972865 7379824 6838220 6322798 5842272 5408312 5029656
8668 5029656 4692737 4355523 4045958 3764760 3521495 3327224 3185704 3042409 2885918 2709961
8658 2709961 2528921 2357400 2208925 2077324 1948421 1831933 1723393 1636051 1573201 1514706
8648 1514706 1465046 1418663 1367513 1301813 1244096 1210106 1161244 1115555 1062412 1000582 956113
8637 956113 918777 876209 844387 822705 819185 813095 801096 779206 782387 766545 746418 725147
8625 725147 699704 664886 622910 591308 570102 542817 526638 526794 533751 520497 513352 495513
8613 495513 494081 493043 493319 496451 494617 478700 480185 472670 469657 476355 466109 463679 462479 457014
8599 457014 448742 436356 440517 443180 437774 441392 438758 430265 403569 381717 379198 388102 406001
8586 406001 427136 448810 455064 463121 480535 503291 509732 495512 464397 434133 417140 406358
8574 406358 400227 406025 404051 399116 397825 385943 379356 377199 387015 406749 400695 394746 381289 377382
8560 377382 382041 382606 381555 360139 352242 342783 313575 282188 246088 216731 229582 242182 238341
8547 238341 235470 249780 263279 251992 235555 227264 229505 234962 240790 236069 232453 226699 221137
8534 221137 202776 191830 189887 184119 175370 140954 112586 114695 125411 130748 127068 118938 96027
8521 96027 67783 45923 30962 25769 23496 18073 26489 48099 63224 71313 66698 68727 69713 64608
8507 64608 62184 64171 73520 89732 117081 130047 127317 132733 143896 154568 167097 169228 161188
8494 161188 143637 132477 119561 118387 123097 108547 112475 110381 110529 108667 109230 108121 93451 89444
8480 89444 89963 109770 116628 119312 105476 102475 115630 113353 103235 100784 89963 75882 75825 78769
8466 78769 100270 128271 134905 121769 120033 125582 125855 120905 113653 141401 147202 133092 113190
8453 113190 98012 96093 81922 69370 70603 76669 85824 91121 82624 77271 79264 70137 60979 63477
8439 63477 68113 57503 71457 63822 50651 57338 61807 59396 70207 89501 96329 91876 90009
8426 90009 96864 109293 105131 115870 118569 92664 98151 100311 101045 105396 93686 86247 94019 97971
8412 97971 105021 100519 86346 75295 76453 67973 57742 64535 57037 58078 46210 32157 20337
8399 20337 29185 40318 57496 71212 70381 60016 52800 70991 74357 73989 72038 59905 44718
8386 44718 37614 49982 65871 71426 59531 49495 56870 66798 63838 82153 92188 73509 62133
8373 62133 70804 83763 79668 63134 52275 37085 37625 35018 30301 33603 50623 60708 61669 55480
8359 55480 60190 69332 60638 57566 47402 32854 24610 34158 37334 34740 43334 58819 66689 64656
8345 64656 55852 51497 54714 53221 75101 74921 72271 60398 59398 54725 49337 45726 48059 59850
8331 59850 64966 72009 74365 79744 78635 86456 96898 104973 99247 114707 132487 149447 162389
8318 162389 172169 197454 222652 250798 275895 302055 370136 454363 559006 665761 768261
8307 768261 896966 1001268 1064121 1098688 1085766 1032783 949293 850680 749523 654570 568463
8296 568463 491308 429653 386579 358814 327291 313715 297087 273244 262594 240192 211164 187712
8284 187712 183005 169977 141772 130507 119130 113390 115663 119185 106214 105874 109174 103014 86958
8271 86958 77206 69543 72917 99350 96056 72330 54628 40935 33302 37751 43046 39099 33171 42209
8257 42209 55987 46774 34414 24565 20951 16616 17840 21969 37932 43444 33439 35558 36039 23351
8243 23351 14997 16045 13364 12881 13363 12641 7395 12632 13202 21352 26339 27261 24722 33135 37392 28964
8227 28964 18321 20992 14234 2511 8896 16378 15669 17789 27361 28761 33590 27985 31642 22393
8213 22393 15850 9817 6129 23557 30474 32207 33151 33502 32385 18543 12447 9486 18803 31702
8199 31702 33385 24597 4564 10167 15992 22742 24272 17855 23078 27290 37400 30996 24809 27304
8185 27304 34134 33973 30711 30298 27302 33952 40732 43815 37971 30398 23023 10727 25182 22833 32282
8170 32282 29672 30905 28742 20102 17549 16473 4729 -165 1495 13486 26982 10987 -8755
8157 -8755 -4650 1814 5665 10305 5570 1626 10771 2925 9910 19777 20703 29149 18433 6781 12671
8142 12671 22643 30486 22103 18808 13039 5572 7637 3433 -12438 1073 4937 5654 18996 15144
8128 15144 10329 15542 24693 28004 12441 -1509 11959 32572 27559 16184 21271 35447 38356
8115 38356 28667 31541 29085 33113 25366 15385 7288 9975 16487 6601 -19468 -26395 -25909 -18372 -16103
8100 -16103 -12469 -9319 -16294 -31823 -28657 -36820 -41262 -25446 -2524 22493 34999 46180 36656
8087 36656 34775 27037 10235 -913 -3133 1184 23590 28984 40384 30366 22766 14770 19105
8074 19105 39754 49962 42847 27714 22640 17086 5942 -4286 8422 36547 44868 31527 13332
8061 13332 24979 38829 36431 15301 8745 467 -7482 -2047 9630 20329 28836 27150 25230
8048 25230 8097 6894 18996 37372 43107 38647 39061 21593 17237 24612 35051 37756 36261 34956
8034 34956 37246 20180 26326 17240 9717 24448 26173 -5837 -28501 -26884 -10214 35 14494
8021 14494 7731 -3202 4187 1403 -469 1996 1337 1535 16029 11612 -3319 8716 15322 20767
8007 20767 14649 -3289 1040 9888 26357 21056 13278 3975 3976 8275 -5519 -12317 -7543 18268
7993 18268 37968 39476 30595 15844 19794 26996 14246 4400 -2801 -8592 -1419 6334 19094 11863
7979 11863 7101 4810 -1033 2719 18834 23810 22038 14450 16439 22116 18249 7685 11004 17042
7965 17042 13375 18393 22477 17153 25161 41618 43802 42176 30738 17709 10105 17277 19910 -1334
7951 -1334 7891 10857 13691 21653 20107 2143 -5092 -6499 10187 7687 17428 20948 20860 23164 18586
7936 18586 12890 6554 10255 21410 32534 37537 37228 36475 40582 32221 20114 15248 10841 274
7922 274 -6884 15541 23546 24311 10606 1600 219 3827 9841 20834 29338 26922 21756 20186 9363
7907 9363 3719 6823 9697 12729 23340 9566 8812 13395 21482 19527 18075 20334 13994 37590
7893 37590 37409 27706 26234 28137 30517 28479 -489 -10314 -11967 -5424 -3250 2864 -7999 -17276
7879 -17276 -31883 -25382 4847 16922 19664 14038 11080 17768 21538 22189 11474 10875 18644 19021
7865 19021 24069 17491 15325 24407 38249 52727 36594 23365 26059 31284 26355 23689 17380 19230
7851 19230 15507 17317 17303 26831 25150 15924 28819 29876 26666 16885 11699 8418 -6300 387 7065
7836 7065 1667 9100 20068 2038 1792 7804 181 -1447 4482 24911 32620 25845 22580 17383
7822 17383 8342 10264 10221 18169 23841 22074 20282 26109 15896 -17 -6434 -8656 -3301 7238
7808 7238 -181 -9682 2909 2071 7626 7789 2420 -1509 6025 15553 18141 21694 28585 30185 28067
7793 28067 20638 21086 21455 27520 20306 7482 17431 30740 29589 32807 36996 24960 15029 17098
7779 17098 17988 13391 -1514 331 -4546 7744 14518 10173 17248 30546 40282 39778 31249 21254
7765 21254 17885 21903 12857 -1260 -5628 -3252 4146 5635 9001 425 -14057 -9652 -9721 -6465 -12039
7750 -12039 -18847 -13448 -4142 -2057 755 3316 6710 11255 6060 4353 -163 -13371 -23419 -18318
7736 -18318 -5889 -15339 -14812 3895 4168 445 9776 10027 3353 13197 22979 20065 -702 -7760 -22145
7721 -22145 -36117 -16253 9129 23390 16949 5457 13962 14964 7991 -7668 -9075 19218 34014
7708 34014 34787 17294 5368 2410 3346 -3129 -16974 -13709 843 5304 8681 1616 4454 -5334
7694 -5334 -15326 -9970 -6389 -2218 -7706 2202 6695 -1473 5913 -241 -485 4911 2558 6394 4817
7679 4817 -5670 -4875 2785 10287 13984 -1578 -9635 3955 1812 506 13372 20950 26071 20678
7665 20678 11447 17663 10978 6366 2060 -1399 32986 42465 38519 31994 20176 22124 21217 20616 20638
7650 20638 13611 11131 9609 1241 -4076 -5606 -3124 11579 4861 297 -3391 -15471 -16522 -6457
7636 -6457 3547 -2607 -14230 -27749 -32673 -30316 -17215 -8520 -9845 -20386 -6282 1381 -2167
7623 -2167 4616 11829 11118 7627 9055 3301 7147 12413 11324 -416 -1754 -2022 -6636 -2991 -8517
7608 -8517 -1794 3078 7894 5437 7225 1371 535 -15182 -8795 -4569 -18076 -14924 -7199 19811
7594 19811 33924 30198 19633 21643 11870 -4400 -17320 -26631 -15804 -628 11056 9951 17926
7581 17926 12608 15122 14260 20149 -3424 -22230 -18176 -16268 -9957 -4970 1567 -896 -11894 -16884
7567 -16884 -1338 1805 4671 8508 16170 8047 -22933 -16273 -9714 -13053 -20241 -8700 7483 -7016
7553 -7016 -16441 -25770 -19825 583 -4242 -16320 -20211 -13504 -4550 1560 18743 26165 24134 16238
7539 16238 8502 5940 3346 7231 14448 19487 12348 2306 -3642 -11409 -14344 -2228 8368 14201
7525 14201 19990 13397 6477 3382 8307 4673 -1459 -2515 211 2668 8137 -1899 1865 -1757
7511 -1757 -12877 -21645 -11647 7955 15982 33408 34088 32300 24225 3547 -2246 -11517 -12236 -7906
7497 -7906 7105 6822 4906 -3584 7587 19303 18296 3239 -7405 -18606 -3847 -1930 2211
7484 2211 15639 11617 6994 1836 -6257 -4821 -3313 -17613 -11999 -7098 -8139 -10366 -3035 -3032 -1094
7469 -1094 -174 247 -2848 -12277 -11800 2201 5157 1111 9647 5560 5270 16176 9177 -789 1696
7454 1696 7323 11300 -821 -15167 -8127 2756 7272 -566 -14680 -14329 -17389 -14554 -25198 -23044
7440 -23044 -13920 10182 18247 11848 5962 19656 27776 16681 10941 5983 -3204 3640 -33 5484
7426 5484 778 -6326 -14169 -8354 -20668 -17076 1869 2560 14555 8254 -9554 189 11544 20674
7412 20674 31289 30867 38441 26568 11350 12315 11906 11153 27411 31910 29236 6917 -4102 87
7398 87 7405 31992 25537 13031 -1748 4885 12689 8623 6713 4548 -5160 -8078 -8747 -29 11758
7383 11758 7919 21922 19410 9914 -8833 -6978 4948 9639 21104 16694 -2304 -16587 -18773
7370 -18773 -24103 -27863 -21765 -15598 -3445 398 16265 30578 13698 -14445 -30134 -20528 -7637
7357 -7637 -5586 -10040 -17232 -13144 -4561 -2685 -126 7903 -4167 -1825 -2947 -3766 -4762 -11399 -1299
7342 -1299 1487 -7539 -13266 -11224 -1510 199 2926 7972 3582 -2587 6716 22478 24175 19113 12058
7327 12058 7074 -9585 -12868 -8764 -10846 -14231 -5146 8205 12718 10016 8539 1831 -7081 -2035
7313 -2035 13283 32767 30963 7107 -4724 -17792 -8054 -10514 3088 7644 -15951 -20139 -13840
7300 -13840 -3437 329 2955 -5631 -11737 -11582 14 -537 2211 7941 9522 13905 9395 6032 5051
7285 5051 -4826 -7934 2716 -4137 -8221 -12443 -13156 -12140 -4514 -625 -2661 3706 9446 13120 10636
7270 10636 12825 -4220 -7131 2035 6581 294 -10935 -16764 -14588 -11404 -7397 -3728 -1242 5954
7256 5954 -1318 -13267 -17523 -13981 -4468 7679 23510 20097 7225 -366 3615 5181 10462 146
7242 146 -1988 4087 4194 7773 2317 6606 9383 -6724 -7334 9446 5179 -9316 -15386 611 12540
7227 12540 5536 -1723 -570 -2836 -6432 -13341 -18326 -14621 -17390 -9907 -14020 -16987 -1279 -11316
7213 -11316 -15478 -9149 -11527 -9569 -3502 -1059 -1429 -5868 -7334 -9430 -2496 6271 22952 13805 4112
7198 4112 -8309 -9163 -10692 -13297 -16255 -18445 -23332 -23288 -11694 -8414 394 21573 14574 -7348 -3473
7183 -3473 -979 -17085 -23084 -4521 1748 -3824 -11173 -12495 1817 20521 25973 6338 7176 27293
7169 27293 20085 6952 -7532 -4596 7727 6348 4718 13339 10655 -2448 695 15917 18467
7156 18467 22528 16767 17938 20353 14983 18154 5131 3872 3353 3853 11858 9922 9593 11761 467
7141 467 1803 3910 -12420 -24504 -9801 15286 11600 1709 259 1196 2329 3782 -11829 -6235
7127 -6235 9685 5462 9005 1391 -7794 238 3470 -5830 -8688 -9736 -7527 -6109 -4714 -8087 -6847
7112 -6847 4307 3938 9186 5206 3889 -4791 -8333 -10051 -22373 -20591 -22935 -17622 -5534 -931
7098 -931 3922 5736 -3772 -15402 -6082 -10143 9295 22689 15381 1891 14589 14621 14244 -5532
7084 -5532 -7788 -3644 -17830 -29282 -16057 -8533 -12220 -8387 11215 16644 14377 12462 -395 -8459
7070 -8459 -17217 -10212 -10456 -1685 -10429 -16694 -15387 -14570 -16063 -18359 -23115 -28650 -11589 -1030 9433
7055 9433 502 -14189 -12732 9326 14642 18898 20537 14369 21501 7391 12609 13407 8465 12353
7041 12353 18782 22180 22592 31014 25561 19883 10117 6906 2968 1255 9823 6408 7877 -14535 -22997
7026 -22997 -22342 -2649 2199 -4774 6121 2129 -5876 -14478 2375 -7894 -21036 -20526 -11323 -7560
7012 -7560 -10051 -5911 2067 5356 3633 -20986 -42818 -37615 -28015 -20503 -14759 -6348 -587 -4684
6998 -4684 -6103 -11189 -15686 -17497 -16908 -26048 -32590 -19435 1209 9291 5782 -2496 728 -1553 2013
6983 2013 2659 3282 2960 -5824 -10533 -11764 -12583 -12891 -18380 -18820 -14688 4015 13824 17467 15363 -568
6967 -568 -10601 -9991 15594 17771 11448 11729 12128 5445 8906 6860 6604 -4288 -15567 -2880 10651
6952 10651 7441 1482 10832 472 -3617 3715 -920 -1549 -3092 10528 7296 -9087 -23150 -29219
6938 -29219 -17943 1839 9344 15102 16523 24182 22557 11443 23544 17045 9791 17885 20286 6626
6924 6626 1598 22001 24945 6973 -3219 -908 -320 397 9473 2236 -5480 2485 10499 -605
6910 -605 -17409 -16759 -6238 7682 18977 13213 9530 -1451 -19233 -13396 -12286 -21941 -21685 -9704
6896 -9704 -3337 6862 17827 15425 -1767 -10336 -16010 -21716 -19148 -14832 -20530 -6242 6264 5828
6882 5828 1800 7232 8036 7321 3518 -13198 -14555 -15110 -26219 -12263 -1797 315 5503 3566 8363
6867 8363 3963 8079 6342 1628 -17071 -32710 -34626 -24839 -17723 -5804 -3075 8717 12240 11097
6853 11097 2637 5457 11244 20905 6375 5421 451 3189 16746 12054 -3232 1629 -8713 -21933
6839 -21933 -4869 -8486 -7899 -6444 -13381 -5285 -244 -1198 -12553 -12102 -17835 -6276 3080 -3503 -5784
6824 -5784 9525 21871 11151 -4407 -16722 -14987 -4025 -7857 -2494 -9745 -27244 -21142 -2633
6811 -2633 6874 -4419 -12848 -7035 -5986 -10138 -6568 -2186 -4100 -73 -1121 -4293 38 -371 454
6796 454 -3981 -19561 -27247 -12803 -639 6207 15421 19823 11482 -645 -7871 -3529 -2223 -904
6782 -904 5508 -5042 -9640 -10654 -11698 1684 4087 -12166 -12425 -10110 -10295 -14088 -10428 -16388 -2275
6767 -2275 -3523 -6609 -23218 -30341 -24421 -14877 -5455 -6231 4801 11578 6950 1806 17623 18371 26483
6752 26483 44725 41803 22858 12105 15626 8884 -417 -3168 309 8442 -6598 -16685 -10464
6739 -10464 1466 16701 6643 2434 6351 -3791 -10395 271 -4709 -9480 11219 18390 9275
6726 9275 -3581 -15501 -6287 -10400 -9294 -5202 3710 17519 15441 13682 7512 310 13985 7043
6712 7043 -986 -7962 -11093 1896 2202 -3018 -8433 -1867 -9614 3815 17314 13471 17888 18963
6698 18963 12721 1844 -2654 866 -881 1824 -2804 10168 2437 -1793 -10561 -16982 -402 12720
6684 12720 14275 1264 -4619 -2868 -1329 -7600 -8792 -10430 -10907 -16468 -19992 -21653 -30907 -29543 -13427
6669 -13427 -3446 6197 -959 -8164 -8070 -18070 -10344 5825 10451 10259 17526 10685 -8489 -20205
6655 -20205 -21721 -13226 -9927 -4681 8936 8225 16073 16308 18365 19166 20439 -3827 -11481 -1633 1786
6640 1786 -8908 -6162 -13370 -12511 -12254 5205 20745 10384 2674 -4596 1493 -18063 -36133 -36332
6626 -36332 -28808 -22303 -15926 -18643 -16001 -11018 -8028 -5006 3088 1078 8649 78 -18039 -17048 -2628
6611 -2628 4006 9937 20957 14397 -311 -8695 -7189 7042 14284 14516 15601 9533 3842 -7870
6597 -7870 -5259 -7939 -9431 7378 -2794 -10088 -7933 968 9840 6159 2455 2349 5016 12435 495
6582 495 -11466 -3469 4347 6189 13811 29338 24444 12661 -6521 -25554 -22599 -20077 -18426 -22548
6568 -22548 -12116 -911 6400 -608 -10126 -5601 2745 2009 -9965 -10252 -11934 -4288 -9336 -25518
6554 -25518 -26588 -28768 -26728 -25379 -15218 -20308 -15886 -9009 -17302 -11502 -18011 -15966 -8483 10521
6540 10521 342 -3868 252 -2062 -10879 -9426 -2617 7725 11419 17572 14532 237 -6501 -6659
6526 -6659 -2858 5310 17836 15109 12942 2931 -6972 -15993 -6177 6586 5478 -1336 -9813 -2744
6512 -2744 -7454 -22679 -23341 -10978 -12426 -18241 -12379 -18684 -22593 -13127 -10302 -4345 8330 7379 1059
6497 1059 3648 2902 -10514 -7410 11005 21455 20893 28377 29697 25074 21890 5624 9175 7141
6483 7141 6870 6167 -253 -3475 6362 8321 16732 11322 5864 -585 -835 684 9067 13707 7419 12598
6467 12598 7363 -7552 -15439 -15832 -13113 -9989 -10128 -11300 -3580 3534 -9271 -14250 -21261 -13376 -5610
6452 -5610 -4175 -9672 -7823 -7292 12287 11351 949 -11266 -14365 -20614 -20019 -7796 -6225 -1098 -612
6437 -612 6159 22156 19331 21989 18926 15750 12136 5399 -10312 -3140 -505 -9750 3461 10360
6423 10360 13019 9363 16838 17082 11891 -36 -11821 -21910 -19903 -11183 10215 8900 -1525 -4800
6409 -4800 -12502 -23210 -23810 -16628 -5539 11647 7157 -743 -15614 -21577 -11856 2705 4476 9887
6395 9887 12281 4658 1804 3090 902 -3149 -4316 -8759 -4921 -655 4599 -107 -3246 -12129 -13215
6380 -13215 -15089 -32027 -29299 -16022 -8666 -5324 -12516 -17769 -18418 -21146 -14724 -2922 -8733 -14102
6366 -14102 -19529 -26011 -9880 1561 8886 5709 6970 20836 17512 10783 8797 15677 25586 16735
6352 16735 4598 2619 7662 8734 7591 -4142 -1190 7027 -59 -8433 -2165 6541 5699 6516 24671
6337 24671 29238 22271 14457 11311 7432 26406 22974 10605 9020 3371 2456 12070 7199 1184
6323 1184 -7889 -11607 -6442 -2629 3518 -1201 -8224 -3924 -10061 -10991 -12518 -12844 -6783 -9769 -6454
6308 -6454 -6395 -14934 -17558 -8038 7674 8366 14277 12559 -19793 -14859 457 5593 3507 -11345 -21822
6293 -21822 -8858 -15820 -2873 -1894 -2789 7352 -2453 -9433 -12867 -7754 -1214 -5963 -10868 -102
6279 -102 17376 19800 14818 -14601 -15265 718 -477 -963 2229 -7936 -13429 -20362 -19618 -5814 7041
6264 7041 5096 11569 16441 -562 5868 15494 19145 3671 -16935 -21764 -15604 -8163 -8363 -17421
6250 -17421 -28869 -24790 -8704 11637 11474 11187 14151 10639 11316 11863 15581 11932 22891 16674 7312
6235 7312 8635 8889 -303 -8328 5053 15417 16752 12088 -2969 -5693 -11882 -28444 -27502 -16282
6221 -16282 -6969 2720 -2124 -2710 5268 11984 11791 12885 16150 -1623 -13687 -13902 -23987 -30589 -17307
6206 -17307 -2746 4676 -6033 -6647 -3850 -3639 -9686 -18482 -9403 -9661 -6322 -5901 -12118 -12840 -8410
6191 -8410 -10559 -1045 1808 -20 1668 6286 572 -2810 6049 10313 12172 6300 1500 -5568 -9852
6176 -9852 -12059 -1063 -5629 -9489 -4222 -9827 -13025 -9293 -13174 -11471 5122 8001 4215 -1718
6162 -1718 -11500 -17024 -11061 -8083 -5211 5319 21477 8052 4981 407 2600 -635 7702 -1571
6148 -1571 -17584 -10495 3 -7118 -2070 2359 1090 10536 9097 13473 27631 18147 18139 24687 10371
6133 10371 1463 9911 4937 -891 1532 -2740 -4118 -7374 2057 11104 9566 11471 12503 6678 -969
6118 -969 8067 14072 4306 -2061 -7870 -9936 -11613 -34799 -26264 -5747 -5265 3073 6648 -4737 -1720
6103 -1720 4008 17787 28469 19366 6395 -10918 -14686 -10021 -6600 -10434 -12525 -10985 1955 -872
6089 -872 -3880 -953 766 4063 2975 8316 -4709 -13529 -23637 -29619 -36201 -13660 7267 4911
6075 4911 -6759 -14950 -24053 -16494 -8097 -9988 5925 28216 22640 12748 8081 -8090 -18162 -13713
6061 -13713 -2015 -4442 -1978 5350 6539 -1394 -5267 -12299 -20587 -22638 -12106 -7989 -5384 3888
6047 3888 11598 6668 -3750 -4904 -5617 -5584 -4674 -9422 -13548 -4339 3206 6131 159 -6647 -15188 -1404
6031 -1404 4611 11419 3949 -9844 -21348 -29903 -20407 -21924 -15700 -2292 9304 17742 13223 1576
6017 1576 -5393 -16039 -15848 -16438 -33821 -41617 -28564 -15074 -4612 3328 -516 -4848 2431 5791
6003 5791 114 5059 5837 -11004 -2573 6975 1125 114 -8242 -19490 -21368 -2314 -76 14240
5989 14240 20045 6698 -1584 -5566 -7136 -2166 -10224 -23499 -6306 1559 6958 2276 -15257 -18424
5975 -18424 -13457 -18759 -14563 -6340 -3371 -884 -3562 -4429 10165 17886 13807 17950 7583 7288 19655
5960 19655 31037 24718 14675 5627 6560 -5332 -9182 -1937 -1317 -1945 6048 15018 3927 -4604
5946 -4604 -5282 -9730 -21600 -10367 15674 11246 10234 3650 5680 6691 18607 18969 24095 28859
5932 28859 31001 27221 7549 -2027 -3875 -11314 -236 12004 13616 13440 26202 31313 25074 18775
5918 18775 7818 12179 23251 27079 20560 -2502 -655 3445 7309 5239 337 3395 5168 14239
5904 14239 19286 11832 -8589 -11723 -15280 -31581 -32398 -17762 600 14062 15632 15659 16651 10528
5890 10528 3275 5594 16360 9711 7885 -709 -14184 -23275 -11867 -2105 1217 5638 -6662 -5717
5876 -5717 -16291 -27903 -13052 2322 -9028 -16728 -8809 -19297 -13951 7887 11994 2023 8337
5863 8337 10735 5385 -3348 -3595 -4870 -17823 -10262 -1812 5716 -7683 -12824 -14898 -17201 -17839 -11937
5848 -11937 -6466 -2133 -5122 -619 2588 9519 16454 11090 -5928 -8657 -3906 4828 7875 1809
5834 1809 -4262 -5341 840 2537 6643 -1829 -4063 5398 -4026 -5167 -937 -4111 -7234 10935 21290
5819 21290 18054 18617 26181 16292 8059 -1158 -9826 -7356 -18331 -12059 -12898 -19091 -11645 -67 -8314
5804 -8314 -8477 -11367 -4586 5984 14481 4811 2963 3852 5378 18292 25434 12313 4587 320 -9676
5789 -9676 -8737 -965 -13805 -21166 -16169 -10525 2884 15714 13738 20499 13607 6310 -6229 -12777
5775 -12777 -3626 -610 -7948 -10856 329 -8541 -28993 -24716 -25532 -6687 10476 13245 9005 6800
5761 6800 11932 3604 -4704 -7500 -6030 -7221 1546 -1744 -10864 -13054 -8745 -14572 -16323 -7177 -10863
5746 -10863 843 13281 -25 3018 3831 -3562 -5062 -1075 6163 3690 9685 12489 22062 2396
5732 2396 -14038 -16325 -17906 -22577 -20544 -6644 3117 6394 3436 -7496 5187 -2094 -12695 -17584
5718 -17584 -11594 -4200 -9434 -16966 -37686 -35423 -22184 -9113 986 610 -11374 -11207 5123 10115
5704 10115 958 -12088 -12216 -17212 -14952 -17242 -23760 -24134 -33230 -28152 -14950 -9114 -13276 321
5690 321 1088 -2263 -3537 -1725 -5171 -7950 -9777 -6890 -5905 -7296 -8872 95 6312 6395 4286 -1631
5674 -1631 -8093 -11786 -5674 526 3799 -2492 -9358 -15892 -18106 -565 15718 7215 2061 2728 14726
5659 14726 18074 18965 6192 -392 -3631 -9572 510 -833 4741 66 -4413 -12265 -8900 -6210
5645 -6210 -14024 -27939 -26436 -30166 -12979 7370 20751 24837 9644 -1832 -7204 -17304 -23660
5632 -23660 -18116 -14978 4630 12173 7841 18166 12386 -7124 -16793 2447 12991 9148 307
5619 307 -736 2960 -6398 -5367 5859 9127 14234 18393 17471 22816 9107 3671 -4139 -5404 4107
5604 4107 3240 2286 -8296 -7897 -17761 -25854 -10905 -11802 -9482 -30539 -30732 -26508 -33935 -29510 -25848
5589 -25848 -21821 -18249 -26438 -13782 -11289 -13607 -10131 -7430 -1850 1551 -4211 2613 -5236 -28181
5575 -28181 -28829 -16949 784 576 4647 5305 5386 -12942 -17989 -9359 7633 6467 6900 -966 -582
5560 -582 6219 3459 796 -7113 -16830 -23861 -23484 -22883 -15036 -3511 1607 906 -2882 -5152 2795 3678
5544 3678 -2761 -16841 -6518 11898 19143 25188 15826 -1467 -5855 -1445 3656 -1671 -1038 7361
5530 7361 -10009 -6031 6079 2044 -10157 -9704 -5347 -6804 -6553 -2751 -8051 -8652 -1970 28913 34499
5515 34499 17874 -4173 -11581 -11204 7858 23263 29305 20658 2418 -1132 -2923 -23857 -12045
5502 -12045 -17427 -25338 -8848 -507 -5246 1033 4727 7077 4173 3702 -798 -12319 -7634 -1238
5488 -1238 -5084 -7618 -9491 -11238 -10830 -3023 -1458 -9410 4893 -4200 -5741 -4774 -2757 4310 2416
5473 2416 -6240 -5618 7298 8605 -1393 -10679 -9256 5303 17985 16144 7782 14742 14604 6593 2324
5458 2324 4346 282 5983 25570 20143 1996 -10873 -5771 2391 18407 21500 12262 23679 16383
5444 16383 9106 8859 10224 8725 18684 22820 7845 5188 -3225 -874 7276 -1751 8404 8200 8400
5429 8400 21644 14930 -1400 -11862 -9784 2819 5202 22790 22624 21599 22415 11869 2541 6844
5415 6844 6676 10646 264 6142 12919 -8718 -20015 -8587 -9048 -14880 -17638 -16701 11 19544
5401 19544 17818 28132 22883 8377 16359 21508 18184 -2574 -18352 -20301 -9961 -6879 530
5388 530 7958 2737 -1873 -2225 10896 22009 22344 20477 15056 2783 9308 13090 1119 -13553
5374 -13553 -6018 3517 -821 -6688 -9158 -12840 -12014 -19891 -16034 3271 18860 29044 16701 3864
5360 3864 3379 3551 -1035 -5955 12864 17906 4080 2791 6287 -865 -4478 -3721 -5613 -8204 1545
5345 1545 16677 27469 14262 -2501 1336 5312 4996 3820 -16535 -13791 3742 8890 18516 15387
5331 15387 6328 -2856 -4759 12073 12803 -4919 -13184 -35910 -48755 -38936 -14994 -10268 -13359 1374
5317 1374 -1281 -14409 -15982 -20986 -25370 -22278 -5165 6006 -6517 -18129 -29483 -28394 -11256
5304 -11256 -2412 -7295 2756 13021 16760 19755 9409 7435 18638 20564 7964 9611 483
5291 483 -3973 -9279 -14342 -14410 -11169 -4906 -1719 -11348 7201 16166 10678 8010 8961 -2431 -18501
5276 -18501 -24731 -15865 15786 25828 8140 -13945 -18006 -7748 -1092 -3209 -22164 -30277 -32039
5263 -32039 -16751 3149 10540 12655 600 -5062 -10306 -13167 -5628 9693 9186 -2730 -12988
5250 -12988 -21474 -27815 -17789 -5685 -859 -9890 -17384 -34052 -44073 -31055 -13701 -5757 -3372
5237 -3372 -2816 389 1029 207 8885 11420 14968 17433 18076 8146 8482 12207 5178 12677 5830 -4783
5221 -4783 -17523 -5346 14110 14434 3231 13746 13652 4227 -2719 -3273 2610 5424 8267 4372 -1912
5206 -1912 -4579 -9843 -12177 -6026 2892 9820 12398 14230 10625 21086 15830 11424 -16174 -21300
5192 -21300 -12221 -16575 -19149 -24202 -25184 -24871 -12660 2771 -2791 -9925 -20477 -13338 -2046 -6919
5178 -6919 -5719 -7028 -15825 -14763 -23099 -14062 -8956 -7061 -802 794 9300 6563 -10483 -13119 -1207
5163 -1207 3956 -4471 -9379 -17490 -24249 -16402 6472 9341 11767 8786 5092 -3038 -15062 -14557 -24875
5148 -24875 -15112 -7900 -1918 -5185 -14234 -16328 -11860 -5487 -7018 -8976 -16453 -26186 -28596 -23358 -17502
5133 -17502 -25872 -18962 -15864 -15400 -5578 13059 5623 -11446 -2561 -4877 -11031 -10354 -22572 -21094
5119 -21094 -5061 7567 16214 17950 20516 41152 37830 15163 5429 -5022 -7801 -16486 -14329
5106 -14329 -18883 -10517 7752 4062 3934 15398 13739 4856 -1787 -7565 -8004 -3226 5982 10097 -5020
5091 -5020 -21176 -27313 -30642 -15399 -2973 -15088 -22242 -9528 595 4665 10218 14988 254
5078 254 -22934 -16080 -12517 -2430 8215 16234 17535 24391 9452 -6676 -10229 -3904 -13608 -18928
5064 -18928 -1719 -1002 -5337 -1275 -1732 -2897 -2668 -2274 -9940 -20588 -3227 -8419 -5947 4116 -9366
5049 -9366 -11627 -6892 3301 -5282 -14262 -15017 -5131 -5528 -3541 2357 -5062 -12857 -13044 -12092 -7408 -11388
5033 -11388 -16254 -15959 -10417 -5146 -19628 -25922 -16011 -8487 4834 14490 13439 4266 -2281 -4227
5019 -4227 -11083 -12062 -13240 -10968 -10137 -6897 -8569 573 -533 6722 -5801 -23443 -28065 -30603 -17603
5004 -17603 -15164 -10830 4011 2417 -6899 -9868 -268 -1091 -3459 -14837 -25445 -23279 -17081 -11597
4990 -11597 -3290 -4783 -751 -6926 -22799 -25012 -37152 -35224 -21022 -5571 1006 -16552 -21114
4977 -21114 -4928 5047 6490 4847 17050 6868 -3645 -24704 -16692 1888 16984 13196 5483
4964 5483 12679 3430 -7277 -19330 -37479 -33121 -29030 -15085 -15617 -19910 -8200 6764 14708 -1455
4950 -1455 -14021 -7044 -2456 -13319 -32272 -22329 -21470 -28961 -26659 -21133 -13669 -1854 10972 4362
4936 4362 -3211 -6889 -4129 -2928 -11389 -9580 -4035 -4654 -1647 -5533 -6348 -17296 -15394 -15660 -3595
4921 -3595 5606 2618 -4630 14 6715 5839 -3729 -1625 9045 17328 11171 -1466 -13445 -196
4907 -196 14896 5444 8983 18701 17974 12594 726 -6471 -1315 -6801 -14441 -10682 -58 2542 4038
4892 4038 -2003 -17604 -11181 -773 -9182 -9986 -15224 -26228 -24750 -6565 9481 2777 8628 25592
4878 25592 40071 33448 11836 -10411 -11480 -1064 3072 -4745 -3601 8777 -6618 -28573 -34922
4865 -34922 -27376 -16448 -20028 -11754 7354 15046 11435 6048 -3809 -14171 -5686 -2385 -2858 3151
4851 3151 -4919 -7120 3583 8370 4031 -1113 -6904 -14349 -10513 3222 9306 13269 19392 15094
4837 15094 4637 -11610 -18295 -6691 4221 -1417 5148 18711 24177 32423 44663 44868 32552
4824 32552 17766 13111 7178 -7039 -13645 -33089 -44790 -31415 -21770 -27112 -34244 -33997 -19789
4811 -19789 -10817 -13653 -15082 -9870 -11540 2869 2037 -17890 -19263 -3312 2666 4086 -1863 -7727
4797 -7727 1002 -721 -12973 -8931 -5604 -3754 3709 -5137 1810 11529 15638 10453 8126 -17203
4783 -17203 -36811 -40233 -20171 -9803 3090 12931 4671 -5234 -8940 -11719 -8994 -4582 -6456 184
4769 184 11558 10357 17829 7775 2067 8421 17238 7941 11517 18173 15440 -6172 -7197 -6537 -4973
4754 -4973 4064 4877 299 15254 32314 28591 12027 2635 11389 16940 -1986 5398 13027 -3936
4740 -3936 -10756 -19216 -18525 -11891 5121 15630 20015 15259 23995 49791 42343 33772 25360 6997
4726 6997 -3358 -13788 -10945 -10216 -16576 -16197 404 7575 8156 17358 18102 12950 18934 13764 5712
4711 5712 1756 3803 7726 -8936 -39846 -46182 -35710 -16165 9812 6171 -2344 -7234 -9505 -15742
4697 -15742 -4269 -4675 -2847 -1140 -515 4909 2325 1239 -716 1570 -1608 7551 6185 2803 5583
4682 5583 4875 1926 1408 -16101 -4414 8739 13147 1455 -12033 -25971 -20080 -17785 -11503 -8503
4668 -8503 -17255 -27915 -23667 -6765 -9590 -8773 3301 7749 7558 13807 13132 -8357 -12435 -505
4654 -505 11739 -2941 6649 14194 1200 -2280 2639 14578 20314 10112 9811 14190 7380 -6096
4640 -6096 229 -225 -1110 -8646 -105 581 6521 3715 -1406 8101 10945 4720 -2815 -1757 2624 6667
4624 6667 12539 13670 19088 16856 14522 12649 -9413 -15055 -20548 -19152 -16144 -18454 -11206 -13382 -20434
4609 -20434 -11839 -10410 -13176 -1916 -2772 -3164 -384 -2996 -12791 -10154 -1467 3598 2690 -186 5535
4594 5535 5414 7202 5820 5086 3914 -7966 -6054 -7523 -9984 -10692 -550 13988 17238 14414 16079
4579 16079 11963 2232 4513 5529 10552 7231 -15909 -14772 -25053 -18045 -15416 -4818 -877 -4014
4565 -4014 3228 15175 28217 18376 11801 16039 14824 1808 -3198 -4173 -15050 -14159 -243 -1177
4551 -1177 7338 29435 22680 11590 15668 15815 -7453 -9312 -7587 -19262 -29590 -35317 -31929 -17670
4537 -17670 11819 11830 9883 10238 9207 -8312 -27422 -25629 -23824 -27465 -27281 -14644 -1304 -7138
4523 -7138 -10701 2675 -1580 -10376 -10291 -15816 -19195 -22486 -30424 -45329 -40544 -21771 490 4839
4509 4839 -11186 -13472 -15592 -14518 -8291 -7718 -1280 5056 6186 13018 8182 8406 2218 -3832 -2545
4494 -2545 -2052 -144 -2017 3380 -3893 5305 1461 -5028 -2755 12157 25091 22813 13143 13754 25810
4479 25810 29256 20113 -231 9173 6850 439 4124 9977 8489 6098 -2327 2608 15028 4774
4465 4774 -1330 -7226 6616 20847 3842 -12001 -11938 -4884 -3538 -2832 -10758 -6386 -4451 690 4367
4450 4367 2540 1635 7060 5726 -6045 -7529 -14067 4516 13436 502 4095 15155 -5579 -9300
4436 -9300 -7539 -4965 12084 3278 -10189 -20731 -27490 -15667 -15598 -12249 -8536 -9072 6557 12552
4422 12552 11185 -5824 -5941 6368 15900 9741 -13173 -22150 -13275 -10731 -15593 -3969 -3684 -10690
4408 -10690 -10619 4925 10907 10567 2307 -2390 -432 -8592 -1464 -6472 -13523 -15918 -15696 -13902 -30084
4393 -30084 -38934 -40877 -31277 -21539 -27320 -21853 1097 7108 5656 7516 -3411 -10255 9876 24571
4379 24571 14417 6811 -19913 -39345 -31937 -25406 -10279 -13125 -6003 4024 -5299 -9475 6792
4366 6792 8491 17462 -4165 -8990 5502 11616 7416 -175 -838 -1119 2575 11344 7755 -2294 -1846
4351 -1846 4432 -4029 -4628 -11841 -27203 -22763 -6922 5580 3448 290 -6883 -7618 -6388 4101
4337 4101 -3675 4868 4799 15661 16542 10175 13926 -6480 -27624 -8771 -11061 -16701 -11347 -10113 -9300
4322 -9300 2867 3638 -4753 -4700 5441 -5977 -2114 6329 8665 5349 -13385 -23051 -23899 -7009 -538
4307 -538 -7859 -12980 -11257 -8822 3278 -4664 -13647 -10203 2778 3294 11138 8697 -708 -4903 5019
4292 5019 -2735 -7103 -17024 -15800 -12794 -15029 -18881 -17179 -11901 -9792 -11955 -12808 -16159 -4912 7174
4277 7174 5716 -7320 -12857 -8816 -892 -6458 -12221 -16367 -14279 -6055 -2107 -10134 -10684 -15039 -14075
4262 -14075 -21562 -15241 -14981 -13163 -2715 -1392 -4642 -1313 11798 8225 -10096 -11128 -18054 -11366
4248 -11366 9193 7962 8133 6111 2202 -3456 -27611 -24386 -16318 -4374 -1714 4836 7161 6705
4234 6705 8537 14728 15558 3571 -3177 -6989 -7115 -13004 -14704 1590 -8448 -2273 -893 -2043 -1998
4219 -1998 -2705 2270 -5486 -7565 -3915 -4949 15479 16597 15743 27789 26399 24276 17949 3538 -2604
4204 -2604 3401 -6966 -13598 -4987 6826 -2993 -13760 -1532 2453 -2887 6775 11837 673 680
4190 680 9920 11872 836 2133 9831 10212 8950 -6663 -13359 -15262 -20766 -16345 -15168 -11504 -7344
4175 -7344 -1741 -2737 -10434 -17702 -16446 -13899 -14027 -16855 -23199 -12056 -12989 66 -950 -19142 -10888
4160 -10888 15577 14187 13864 10652 -6754 -11951 -16425 -19811 -12874 -2654 -9769 -27905 -24037 -11530
4146 -11530 -10059 -21132 -17180 -18330 -26171 -31101 -26504 -20191 -4468 4720 7453 16904 20079 9691
4132 9691 9898 10920 -646 -12050 -3611 -15382 -20087 -8145 2064 2182 -8200 -10774 -17143 -29821
4118 -29821 -30053 -19468 -20101 -18035 -7249 9318 10112 -4550 -21470 -20900 -3800 9296 18525 13956
4104 13956 6257 49 4214 2266 976 -9078 -22754 -18322 -16691 -404 13247 -1189 -16204
4091 -16204 -25474 -20638 -3892 -14403 -5587 6014 1549 -3477 2325 1074 -2475 265 1353 -2450
4077 -2450 -12957 -1967 907 -4639 3589 6870 4287 5953 7301 15546 10671 7154 12041 26480
4063 26480 15739 8949 -3323 -6938 -14762 -30211 -9784 -4215 -14342 -23394 -15333 -2799 -6363
4050 -6363 -15962 -17885 -11041 2127 -5375 -13389 -9763 -1439 -1502 7948 16182 18126 10269 2173 -2197
4035 -2197 -1438 5616 10231 11919 1080 -10033 -23668 -31682 -23780 -8508 582 690 2028 11980
4021 11980 17819 15516 12249 13115 2951 2013 -1289 3864 499 801 5847 9056 5388 -756 -10953
4006 -10953 -19208 -5128 21020 24944 21209 13801 6632 -4786 4254 10126 7177 20114 22985 14607
3992 14607 7313 8032 -312 -2664 -20881 -39759 -33674 -31652 -29843 -21617 -19777 -16751 -14208 71
3978 71 1323 10809 -7355 -7893 -8969 -15595 -11104 -2534 3393 7969 1287 3126 5061 11014 21349
3963 21349 13416 -1101 11150 3746 -5751 -11541 727 8511 17530 21152 21640 5959 -5391 -14169
3949 -14169 -28403 -14700 -17807 -27644 -12025 2375 8849 12188 9270 12061 9326 16168 16504 3043
3935 3043 10743 21953 13522 -3651 9398 8007 -17160 -12627 2960 -904 -8349 -16108 -13745 -13395
3921 -13395 -9920 -105 6632 -1872 -2349 6888 -1656 -20100 -10778 -5885 -12755 9837 23769 23432
3907 23432 2933 1190 15147 28020 4798 -7266 2729 19113 11304 -1830 -10030 -13580 1622
3894 1622 9322 7266 -3787 4868 11083 4145 -3065 7453 7500 2620 9570 10982 -3352 -15996
3880 -15996 -26481 -16846 10546 15155 11666 13361 1399 -5395 -13002 -7648 5607 -2722 -12602 -9223
3866 -9223 -3656 15011 21512 7282 2057 12547 5880 -6404 -10038 3510 -2946 9743 13617
3853 13617 10286 20627 12797 13195 13669 7404 1042 -10903 -8093 -11497 -2836 -4050 -16636 -11271
3839 -11271 -3290 14973 15614 16172 2230 5117 2349 7239 -10318 -21008 -12243 1889 17327 29150
3825 29150 30861 8357 -4157 -18573 -28708 -12231 2054 -10029 -5772 -143 13025 6584 2855
3812 2855 10502 9080 21383 23617 22568 19033 -4498 -5294 11998 6687 -4617 -3368 -5250 591
3798 591 9881 18178 15209 16318 2868 -658 16663 21168 22557 30826 28144 19210 -5130 -4978 -3486
3783 -3486 -5481 -7331 -4826 -409 -11061 -18304 -29231 -19770 -14701 -7551 -6023 -3937 2539 6648
3769 6648 -4600 -6966 12020 8900 18113 22087 22657 22283 23667 20455 19149 5603 -11107 -16424
3755 -16424 -6719 12363 3867 -24593 -26850 -17422 -13991 -15791 -22073 -28362 -19277 -12270 -10910 -9103
3741 -9103 -403 1502 -8585 -13053 -9909 -13396 -5402 1722 -5396 -4137 10679 18183 22317 15405
3727 15405 5364 6832 -2133 3339 9766 7041 -5870 -11262 -5878 -9225 -13652 -7954 -1205 5080
3713 5080 8183 19896 10801 610 -2636 -9421 -27554 -37180 -42858 -40150 -23884 -15081 2155 9060
3699 9060 14313 11595 1198 -7400 -2790 3487 11480 5844 2442 124 1340 5976 6168 -2479 -5275
3684 -5275 824 4966 7307 16504 11921 15803 8575 -16869 -16532 -10733 -13868 -15929 -12260 -12560 -18690
3669 -18690 -11085 5803 65 8257 -3145 -7674 -15114 -25041 -19502 -13790 2121 -976 6003 12703
3655 12703 3888 13177 -1821 -3034 4521 -8814 -2365 10691 281 5794 10667 299 7482
3642 7482 14597 6136 214 797 5154 12606 19806 14489 24392 18433 17575 7811 89 -5317 -11982
3627 -11982 -18276 -12987 -14689 -26452 -16877 -7348 -3557 3986 3420 932 -18537 -15308 -10183 927
3613 927 1172 -2693 -814 6823 13563 -8738 -11957 -2062 -5277 -7088 -25524 -16087 -3764 3184 454
3598 454 1748 7436 7501 -101 -883 -2774 4130 5473 17147 19476 12469 7558 1980 9873 16018 10612
3582 10612 15642 21418 12269 11508 6081 1939 15488 20798 10607 11388 12590 14206 10512 -5275
3568 -5275 -10963 -23813 -24128 -13267 -19584 -11292 -18984 -14537 3970 18504 7782 -4589 -4584 -7769
3554 -7769 -6220 -6400 -5030 -6286 -11890 -13704 -6832 3993 26386 28288 4852 -9076 -17614 -7114
3540 -7114 7694 16437 2309 -9572 -2108 3662 6265 15440 14682 3218 -9256 -10941 -10896 -13109
3526 -13109 -19760 -10168 9066 4448 -7461 -8772 -22792 -35164 -36134 -26347 -4151 705 9164 -12
3512 -12 -12398 -6403 1599 -1767 -6381 -8261 -680 -1134 -2689 -5198 -10624 6473 10294 -6510 -16809
3497 -16809 -18863 -14653 -10975 -13309 -16661 2543 7402 16220 18897 -2409 -22065 -22440 -9198 -8856
3483 -8856 -1146 -1557 -7318 -2642 7636 1845 -3739 -7514 -12926 -5366 2338 -3580 -10630 -10275 -13568
3468 -13568 -5223 7008 11930 1609 -15014 -18469 1763 18649 16082 7432 3858 2213 7363
3455 7363 -8743 -14245 -11434 -4839 3183 -4890 -7209 -10097 -15810 -5279 -32 -3148 -5748 226
3441 226 9506 2122 -14582 3017 4367 -5976 -4816 3089 -3907 -9614 -11591 -12022 -3171 11151
3427 11151 9029 -4922 -1921 -13539 -14665 -14597 -2246 11876 2704 -10807 -10691 -3223 -8820 -6462
3413 -6462 -5200 -2336 12565 8315 9934 21157 6671 4828 24512 31779 30547 34115 32039 11093
3399 11093 -4564 -13671 -26637 -27019 -30687 -19195 -15411 -5473 14013 19044 10062 -3424 -1683 -233
3385 -233 -16013 -16758 -12131 -12410 -15992 -13543 -2700 -468 -17905 -23381 -9791 1984 11931 8797
3371 8797 12963 30303 26761 7061 7849 -11530 -29250 -27025 -25249 -27503 -30239 -9775 -6964 1729
3357 1729 -2575 -14797 -10880 -4098 4132 14456 8822 -525 -7186 -4690 -9935 -11435 -4696 -6619
3343 -6619 -13376 -19762 -4347 8128 5633 21235 25873 15723 7639 -317 1831 3102 -9488 -202
3329 -202 15217 8580 -6080 3305 10234 15345 10688 7183 10103 7756 14207 20827 17613 9197 -5849
3314 -5849 -10431 -11371 -12166 5792 18969 11964 21082 18755 1760 -7409 -8323 -12226 -14739 -11265 -13952
3299 -13952 -7146 -1623 981 6615 6618 14642 21994 10697 10195 11822 4120 -7215 -17426 -21309 -6127
3284 -6127 -10718 -9898 6596 17131 3522 -3735 -2079 3502 11815 2882 -4407 -4873 -9866 -12133 -6401
3269 -6401 12108 14210 14972 19999 15051 -8405 -18212 -9907 5728 19507 16939 2224 -16451 -9653
3255 -9653 -11944 -8953 -5272 -5975 2284 9720 11868 34105 36933 27652 20151 17456 16722 21074 25047
3240 25047 17421 2170 2007 6811 -3762 -13177 -9824 9540 19293 17325 14559 18335 15483 14595
3226 14595 10044 209 15058 13452 15345 19443 6026 -4984 -14056 -15742 -14052 -6513 -3414 -6560
3212 -6560 -7322 -1830 2940 10056 3639 8110 -849 -9248 -7712 -3027 4391 23920 42153 41643 41325
3197 41325 27381 25447 16562 7373 -3658 -3456 -15423 -12217 1311 13048 16730 25741 34642 27059
3183 27059 20214 3883 -3261 -12053 -11356 -11247 -7023 -11472 355 12642 12695 404 -10105 -18664
3169 -18664 -14902 -9202 -7808 -17575 -22485 -4770 15055 28414 11673 14619 10605 21271 18572
3156 18572 15090 6741 4059 10851 10939 11604 10316 17891 21238 20662 14039 16764 31177 23686 18711
3141 18711 23678 20199 20153 21562 15109 23988 26040 30200 20393 24071 16336 21188 16655 393 7608
3126 7608 10039 12521 19516 20851 6278 -8545 -11228 -6920 -2978 7363 12777 19851 18691 21973
3112 21973 20790 1278 -436 7392 -8428 -21964 -24254 -17575 -12359 -19692 -11634 6738 -394 -15034
3098 -15034 -5817 -18704 -35489 -43102 -33627 -26631 -31070 -32278 -25899 1788 -11268 -21846 -6610
3085 -6610 -4914 -8730 -18686 -24970 -19506 -17870 -16629 1235 15560 9106 -4443 -10322 -13729 -20930
3071 -20930 -25648 -19691 -21442 -2092 -2621 -8470 -11646 -13199 -17524 -19178 -6905 -4628 -13817 -13411 -10299
3056 -10299 4548 10385 133 -1022 -464 5541 4123 4142 4711 5907 -4989 -17017 -11742 -264
3042 -264 -9541 -4919 5182 -1387 2278 1767 15633 8205 -5741 -13431 1768 3491 4059 -10104
3028 -10104 -11865 -18343 -25841 -26749 -24678 -17500 -14072 -17042 -4617 2596 -7118 -11275 -11995 -19700 -30223
3013 -30223 -21733 -19100 -20439 -11693 -6727 -7068 -13383 -6450 -4773 -3850 3141 10138 6319 133 -4815
2998 -4815 -6040 2442 1408 -3877 -8067 -16394 -17266 -17587 -5642 14084 9367 4798 -2134 -10753 -7277
2983 -7277 -1525 16512 19646 7967 2371 -1081 -8379 2879 12029 -77 -2936 3040 3861 8165
2969 8165 8534 12725 12419 21875 23490 15982 13242 10640 8440 9341 5264 4766 1741 4888 3209 1090
2953 1090 6599 20385 16839 -15325 -32782 -10164 5194 3835 -1584 -14538 -18558 -25044 -23761
2940 -23761 -12748 14564 24150 36234 29763 8700 7189 7215 3800 2046 -2486 1582 14891 11950
2926 11950 4171 -635 -34 4559 1546 -1032 -21777 -37465 -24979 -14226 -849 -1234 -866 2768
2912 2768 629 5852 5361 14820 6195 -3195 1192 -1071 -11638 -8844 -3949 8319 6616 -7266
2898 -7266 1382 13390 19385 9565 10243 7596 -10919 -11228 3472 5297 -7035 -12489 2006 9467
2884 9467 5302 -2689 799 -12706 -16924 -18186 -22135 -18057 -4833 4085 3687 98 444 746 5772
2869 5772 596 6350 -3487 -8124 -13508 -19409 -16519 -5614 -8171 -15016 -19326 -23637 -22954 -17600 -21104
2854 -21104 -14369 -16014 -10739 -2916 -789 -5635 -10535 6094 41588 43503 34644 19838 10199 -1541
2840 -1541 -9704 -9142 -490 -2598 -6482 -10840 -18285 -19482 -18893 -14779 -19856 -19063 -21717 -17226 -7328 17167
2824 17167 28172 18986 -4155 7861 33343 38303 33979 26809 -376 -3259 10735 16669 18750
2811 18750 7730 -9782 -21920 -18219 -15694 -5133 11206 12434 14299 8671 -3191 -1462 -3559
2798 -3559 5931 13452 8070 -2589 -49 -5698 -2090 -572 -14293 -21316 -15010 -4225 4132 15503
2784 15503 12932 19564 24521 15145 13060 9645 8326 16608 14770 16417 -937 -11213 -14489 -17043
2770 -17043 -7923 579 -3725 -4375 -7800 -10295 -12316 -16020 10094 18706 3858 -225 -920 -8614 -3287
2755 -3287 3762 14144 13273 -895 -4611 -2167 -9200 -16220 -4101 11527 15952 14633 14776 12206
2741 12206 18719 19360 12384 11130 -992 -8914 -13593 -16831 -20325 -13588 -10625 -9961 1881 -18008
2727 -18008 -17349 12266 13021 1614 3356 -5251 -10903 -27052 -31198 -27551 -24359 -21355 -3348 13743
2713 13743 16040 17813 -5224 -17598 -7254 -2993 -10194 -6964 8710 4706 -4774 -10007 1247
2700 1247 -2852 -8580 1168 11226 26286 26151 6677 -5950 -5420 9784 17695 11785 -7349 -16956
2686 -16956 -20625 -4071 -2134 -6016 -18530 -27522 -26726 -26622 -12271 -12651 -13369 -11734 -11571 -2337 -5608
2671 -5608 -14003 -20290 -26685 -10431 -10102 -5816 9167 19789 15935 -4989 -7270 -1587 5549 8957
2657 8957 1396 -209 -369 -8427 -11118 -11607 -20922 -33907 -31734 -10442 1382 -11599 -13879 3517
2643 3517 196 -7799 -19859 -28330 -28508 -13886 -13971 -14490 -7622 7775 17496 31400 18313 3078
2629 3078 -3708 7454 9009 10488 8318 15092 17151 24226 18082 -4838 -5428 7383 19885 8538
2615 8538 8229 14041 3654 -12041 -7795 -7229 -17751 -22111 -3124 4239 -1018 4321 2549 3713
2601 3713 2999 -8177 -1345 2138 8239 3267 -1611 -358 -7650 -15144 1979 21479 34024 30780
2587 30780 23582 12277 -6873 -5504 -3203 -4024 -2501 -17298 -14840 -1497 3830 2465 19993 30838
2573 30838 18202 5930 4639 2555 7675 1809 -1572 -3454 10416 6933 -2217 -9933 -1883 -1419
2559 -1419 -4077 802 1695 1121 6096 -1991 -21518 -8604 6517 -17787 -27944 -31615 -19348 -2629
2545 -2629 -5135 1892 6359 7468 8599 -1251 -15408 -3121 -7145 -11185 -15794 -12061 -31431 -36795
2531 -36795 -14140 -5207 -15153 -36679 -34807 -20901 -16462 -8973 -20594 -18728 -19994 -18962 -11249 -12207
2517 -12207 -17325 -15563 -14305 -7667 -3012 -5835 14540 11994 -4360 871 11597 10827 16557 -5230
2503 -5230 -19986 -7651 -16900 -12711 -12497 -9594 -1150 10601 15426 10170 147 -1870 -11145 -12835
2489 -12835 -7133 -1670 12801 16739 4009 10431 13563 11349 13945 10066 10895 17166 15843 7387
2475 7387 2098 1903 9188 -5604 -21777 -21754 -8707 278 -4680 -15388 -18506 -27367 -32689 -20690
2461 -20690 -15396 -21053 -14180 -13037 -12859 -10427 -2968 -2141 -4885 -3856 10356 12561 1186 -11552
2447 -11552 1292 876 -6465 -5127 -6684 -21589 -27330 -23220 -35245 -29888 -27300 -7769 1731 6918
2433 6918 16606 14148 -2007 -18234 -13582 -3077 -2058 -5836 4917 6285 -1681 -5982 -11312 -19183
2419 -19183 -25285 -23176 -6105 1920 2124 -4860 -5997 -4413 10092 9284 -2749 9887 21027 10762
2405 10762 9395 -5641 -17215 -8059 1856 8591 11012 17732 14476 -4946 -9947 5663 7091 11722
2391 11722 11206 6946 830 -4183 -8351 -10144 -6785 -947 -4387 6276 2537 -646 -8588 -797 705
2376 705 2904 11218 24793 22327 23290 -2016 -19217 -29840 -31952 -33110 -28763 -24482 -24410 -19275 -22927
2361 -22927 -15616 -13378 -1855 6280 11092 5987 7531 13783 10812 14580 14179 10737 -1034 -9954
2347 -9954 7544 7578 -2454 15336 27063 22976 9911 -11510 -17036 -11742 -4693 6668 -1606 -10482
2333 -10482 -14430 37 4508 -1854 -13338 -17172 -9462 -4182 -11898 -8575 9241 17685 34146 23630
2319 23630 14371 7188 6000 10681 23978 9741 5703 17948 11364 -11005 -14093 -15839 -8210 3412
2305 3412 7515 18952 21246 15253 14465 14070 -5985 -10741 -2538 3954 -1057 -14975 -11139 -6975 7906
2290 7906 3384 3599 13526 11192 3782 1799 1925 14315 12032 22573 27629 26494 27251 28032 37928
2275 37928 30685 11897 5425 -2317 -11501 -5485 -5005 -20618 -23813 -25916 -12283 -5172 -4315 8145
2261 8145 5221 1052 8741 -4252 -2614 -5894 5411 34800 34839 15402 2842 3973 15916 12021
2247 12021 -5931 -7597 -7435 18999 20540 2963 -4967 -4270 -10739 -14675 -10893 -11702 -5085 -8038 6009
2232 6009 1507 6271 -1297 -7569 -575 14010 17832 26734 33169 17740 16134 13342 12254 15240
2218 15240 11650 10029 9103 -4674 -5189 -1160 -1304 -16002 -4334 7524 -6940 -733 5819 -1545
2204 -1545 4595 7485 20273 15041 8020 4127 -1789 -6937 5294 16332 8534 -1115 12446 18941
2190 18941 22948 19796 8208 13074 7382 3409 4081 4235 -2202 -4825 13961 -838 -21035 -32250
2176 -32250 -31312 -21703 -10476 2224 2788 -10132 -17499 -3190 3208 17469 15383 12005 11915 13836
2162 13836 22052 7418 -19834 -15039 -21385 -21480 -14261 -31776 -50533 -44714 -16660 8805 408 -13159
2148 -13159 -19193 -5291 -21823 -16382 -8803 -12655 -14093 -2891 -3356 -5201 -17846 -22385 -5625 8024
2134 8024 5206 10918 10020 15873 19672 9076 2455 1207 4589 -3321 3304 6712 511 3170 3238
2119 3238 -11659 -19849 -23020 -32197 -25771 -26260 -18026 -1423 -2309 142 -1140 -1815 10084 -294 -13708
2104 -13708 -18222 -15989 2381 6087 -175 2395 4907 -3680 -14254 -11359 -5190 5030 12977 19102
2090 19102 10797 -10675 -28794 -28499 -19558 -7823 12709 20147 24991 12348 5575 7352 28941
2077 28941 15407 8986 -6447 -30943 -24794 -15107 -13680 -9433 8654 1384 -14161 -14344 1291
2064 1291 7568 12497 11410 -4037 -10815 -6472 -15561 -26599 -15141 3444 7981 -5389 -965 11266
2050 11266 20323 20681 17232 8582 4319 -10939 -15363 -12601 -17750 -18721 -14300 -11816 -4787 3441 -1927
2035 -1927 -11271 -2094 14242 5730 3177 5640 11454 -64 -21204 -13691 -1587 1089 -8268 -2746
2021 -2746 562 8757 5697 -8999 -25866 -25648 -20814 -6026 2914 9229 6317 11197 6381 3245
2007 3245 -6575 -16043 -28243 -33061 -34732 -27626 -16118 -15388 -17018 -10017 -8144 -23093 -21232 -18530
1993 -18530 -24377 -12972 -15294 -14483 142 11006 11993 10842 9057 14189 4544 10787 25502 19669
1979 19669 10793 2834 -4664 8772 9045 7829 11023 11653 14390 15920 13181 501 -5064 -6905 -20364
1964 -20364 -11400 853 -3014 -11455 -16354 -14708 -18699 -6166 -1177 -8743 -11269 -3723 702 -1400
1950 -1400 -5678 -5896 -13933 4775 10633 8161 801 -803 13546 13312 -228 -17225 -4676 -1352
1936 -1352 8306 13594 8231 8690 16628 12252 6248 4678 11226 11810 17984 4632 -4142 -1620 -7753
1921 -7753 -4411 10445 22537 15821 27623 15894 -3508 -7644 542 -1904 -6151 1868 -4757 2425
1907 2425 2484 -1489 3012 2196 25351 25827 22912 14247 397 2235 13940 -9016 -27889 -24265 -2664
1892 -2664 10752 3630 -4063 14942 25566 12537 -5183 -10638 -14013 -8867 -1992 -2244 -2065 3505
1878 3505 13767 20309 20575 42498 24067 -3129 -12822 9603 16943 17073 9918 2970 -3494 -8614
1864 -8614 -11731 -13294 -6519 -4854 -8385 -7357 -12310 -23592 -28345 -16910 6634 11701 13005 -3682
1850 -3682 -13698 -19597 -18341 -6398 5118 3461 -11226 -12584 -753 -3680 -19018 -18703 -6572
1837 -6572 901 -10776 -27055 -8095 755 4707 18903 4469 -4029 -2120 8904 6222 -8960
1824 -8960 -3278 -7918 -11316 -11729 -10012 -12877 -15863 -14084 -31620 -25984 -16149 -7128 -14612 -23830 -24192
1809 -24192 -14501 -9829 -26694 -23451 -951 -2436 -11068 -11201 -10515 -1718 -2306 -14915 -21182 -7256
1795 -7256 15467 15785 10306 13570 30015 29018 1849 6478 10204 198 -7743 -845 -8786 -6773
1781 -6773 -7670 -4655 -5665 -6529 -17439 3515 5638 -1344 5357 9652 17275 16000 8704 10435 3096
1766 3096 8577 23472 34300 21973 14813 24870 22456 20625 18980 11042 10286 1705 1137 9637
1752 9637 -2340 -13851 -676 -168 2755 16431 7510 3902 -1448 -5083 -18017 -28107 -17268
1739 -17268 -9328 -24260 -17845 -11619 1743 9744 15356 18191 34251 19142 6414 -1982 -1246 -4830
1725 -4830 6951 30054 19732 11081 3842 12561 23990 22178 14660 5108 -13884 -22479 -23060 -12613
1711 -12613 -15312 -10563 -6712 -10621 -16856 -13648 -12483 9242 15470 2410 -4636 -5704 -6099 -8718
1697 -8718 -22232 -27802 -1480 6824 11643 14618 24233 24820 10688 12683 -4040 -5345 -1137 -7500
1683 -7500 -7795 -6408 14804 22181 10880 3787 1567 17331 28609 17547 13073 15501 5972 -1271
1669 -1271 12526 9785 572 -8597 -10237 4799 2839 6116 3125 8163 6247 -7691 -5467 4076
1655 4076 2724 5233 16322 4120 -8841 -7281 -12973 -14204 -5844 4080 21483 24994 13942 3886
1641 3886 -12140 -18409 -13967 -2495 19504 11392 -19670 -21091 -14247 -8780 7783 229 -7562 -525
1627 -525 10896 16879 12871 24775 13513 183 3506 2338 -8563 -11761 2700 7144 5495 -9523
1613 -9523 -7812 11990 21190 21501 11544 -4562 2764 3408 11953 12532 3756 -3781 -8300 -7010 -12173
1598 -12173 -25382 -18520 -20418 -17787 3154 13910 19078 17963 26389 29572 2409 -4906 -8581 -13135
1584 -13135 -6879 -6038 7700 7512 11546 -3085 -13908 -21911 -19780 -3079 -3962 4944 6027 8810
1570 8810 10203 6473 3042 9878 3789 7742 17304 21673 19876 21281 23740 5435 1560 -4062 -5553
1555 -5553 -6512 -12223 -14608 -4804 6987 20817 34554 27593 1907 -5701 6780 21726 5321
1542 5321 -8039 3349 10091 13431 5741 -292 344 591 3489 122 6569 1520 -697 -1040 -6856
1527 -6856 -3989 -5103 -14646 -2698 394 -3776 -3452 -7760 -10501 -10292 -20344 -14283 19753 20064 9166
1512 9166 -9736 -12881 -1074 1795 -4306 6082 8279 1270 7773 -5423 -16034 -7122 3596
1499 3596 5075 628 -13083 -20691 -10284 -2232 -5172 2938 15224 5734 -13055 -11896 87 3152
1485 3152 -2841 8676 -6117 -15782 -23409 -11224 -9080 -1899 2470 5242 11621 3507 -2852 -4546
1471 -4546 -6259 1913 -483 837 10716 20039 19231 16016 12241 16530 26000 32966 23012 18001 4132
1456 4132 -2327 5999 5385 -3037 -7402 -3335 -6327 -13909 -21285 -23778 -18622 -10819 -16642 -16165 -11026
1441 -11026 -8696 -11124 -8344 -723 -9872 -9789 -6547 898 5026 22543 18747 1900 5084 12998 19612
1426 19612 17132 5104 -6917 -8834 -14109 -2306 5518 364 3924 19827 17153 6242 5295 1211
1412 1211 8836 14933 6411 -10198 -11018 15289 12761 2448 13557 5133 -6429 -13550 -19083 -16700
1398 -16700 -11520 7400 26245 28778 16231 6583 1492 -857 -6691 216 9473 14727 11117 23109
1384 23109 24460 20412 13201 16845 21283 10279 1138 -1412 -9276 6007 14424 10240 9948 4070
1370 4070 10342 7068 8859 12722 28217 33096 20298 -2505 -7261 4945 6058 2282 5256 10067
1356 10067 927 -1901 15082 25648 33261 32623 21334 14379 8262 454 -8551 2041 15557 16755
1342 16755 5348 10896 15496 25051 18218 2275 1852 11982 14510 8737 1301 3505 17993 18324
1328 18324 12344 9610 11596 8425 6186 2922 7163 10044 1562 -4715 -5918 -4925 -5501 4419 4492 -1030
1312 -1030 -2969 2573 9437 18606 4693 -8139 -10256 -11250 -15969 -6786 992 10182 3978 11433 34683
1297 34683 20761 15403 12841 10412 10217 21252 16937 6768 5037 7792 5311 11276 14266 1608
1283 1608 -16379 -13530 -4071 -2692 11054 785 66 -694 -6249 -10582 -7624 -5992 13705 32972
1269 32972 36870 5555 -32136 -37016 -13100 3588 -1847 -3253 7711 614 -21674 -12681 -748
1256 -748 -5117 -8363 -1641 -3512 10093 14631 8582 15104 17671 16032 16309 8917 -5213 -6025 4341
1241 4341 7059 816 -117 7567 3580 -3430 7654 16370 24752 12415 -2896 -7082 -10096 -12324
1227 -12324 -14959 -2869 1867 15166 24882 7703 -10006 -8730 -1813 6055 5928 6551 13175 7929
1213 7929 -1961 -7160 -8867 -12853 -15932 -29672 -47948 -36920 -18817 -17905 -3602 10591 12453 17604
1199 17604 22006 15590 4802 -1265 9559 14956 19160 25405 34849 34777 26745 17547 8549 4640 3435
1184 3435 9426 12862 22517 18193 29254 22605 3183 -879 -9163 -7800 1643 1134 5109 -169 -644
1169 -644 4952 4232 -11915 -10507 -6693 -10377 -13072 -4904 -2832 -1152 -8487 -5507 71 4720 12485
1154 12485 16136 250 303 14128 31196 35922 42687 39074 14242 18212 35050 27797 24060 15844
1140 15844 12315 13881 27255 29194 19152 12869 22174 10802 4934 8712 9594 17798 27874 4715
1126 4715 1296 5170 -392 6681 15943 19496 24206 30350 21277 6835 -4995 -2502 2646 -225
1112 -225 -8601 -10077 -9393 -3435 2738 -6172 -2258 -1183 -6699 -5805 5950 -339 -653 12541 9381
1097 9381 3988 5675 17380 14991 16115 17435 9168 1815 -5337 2568 817 7148 1651 -7747 -8333
1082 -8333 -26821 -33794 -33374 -21778 -11155 -5575 -3543 5853 7034 13998 22557 2931 -26954 -36972
1068 -36972 -33640 -24505 -28931 -27742 -16660 -8447 4759 -8776 -16505 -7745 -6321 -2297 -3901 -3111
1054 -3111 -10329 -11581 -1256 1298 -2701 -5049 9429 23377 23472 15111 9130 16524 19788 7299
1040 7299 3506 7681 -6498 -9849 10626 24744 30359 26855 11367 5585 15813 19450 19019 27345
1026 27345 20641 7199 5445 -15883 -31143 -18804 -1955 -9575 -12529 -14775 -20451 222 11578
1013 11578 3087 -16464 -25910 -18938 -6194 6701 -5388 -10658 -12319 -1349 5671 2988 8133
1000 8133 15851 14812 405 -2248 9438 8686 1110 374 -4387 -858 -1164 -4595 1073 20203 27838
985 27838 23597 6450 -3375 -11020 -11488 -141 9058 11699 1709 2635 4004 4819 13672 2859 1274
970 1274 151 -7148 647 5277 4922 -5716 -1080 -1757 -15142 -20699 -11078 -4119 10495 15883 10151
955 10151 4877 -5057 1266 -918 -2408 1404 5832 8629 6448 13597 9274 -3934 -11928 -20477 -13953
940 -13953 -10964 -4067 13159 20487 10903 -3728 -2439 -5829 -4300 -2222 -6826 -17461 -26055 -21556
926 -21556 1611 9035 3267 2811 -2005 -12852 -3663 -2267 -2459 5722 -7694 -16885 -7228 -12340 -20848
911 -20848 -14298 -1093 9586 9096 -4634 -15403 -16877 -19135 -27355 -23816 -24948 -11162 -9492 -19985
897 -19985 -13053 -18781 -8313 -197 13917 26312 30294 18204 15905 6915 -12353 -18289 -21883 -26248
883 -26248 -22621 -12631 2082 -7382 -4847 15113 18458 23615 28328 15579 13894 17226 5344 11567
869 11567 9747 10911 12766 17389 26038 32899 26771 12235 1627 -853 -3267 5237 16400 33061
855 33061 30731 26843 10885 -120 -5373 7033 14376 16600 10097 -4116 -11256 -25275 -16308 -10505
841 -10505 -7996 -3596 -19657 -27197 -25131 -20424 -6084 -6543 -12832 -12664 1200 17059 -1409 -9737
827 -9737 2693 20607 19326 11273 12737 -2343 -13022 344 5638 2037 4386 17182 9901 6509
813 6509 1806 -4049 -2212 -15251 -21767 -8244 -95 -10445 -25884 -17720 -6239 -751 -9314 -12541
799 -12541 -9004 -10789 -12493 -13918 -19076 -17282 -7360 -11123 -9047 -14179 -11822 -2340 -14872 -24018 -19304
784 -19304 -19380 -17601 -1922 4394 5262 -13377 -19270 -12034 -15264 -22052 -13184 -3467 -4902 -889 -17565
769 -17565 -13134 1886 8498 2765 7116 3129 -8517 -7068 -14397 -21446 -26072 -21178 -2964 -8044
755 -8044 -6975 -1067 -3823 10311 10856 3836 3008 2412 9982 11058 14826 14301 14401 13462 3851 -7544
739 -7544 -531 16089 12294 4357 -15712 -8065 -1889 -695 -9851 -9700 -14924 -26587 -32056 -25075 -25143
724 -25143 -18472 -7099 -154 11595 10007 14315 8258 3422 8010 -5768 -19402 -12572 1095 8409
710 8409 10946 -2924 -16465 -10611 -9962 1969 6302 -7920 -11277 -8826 -8719 -9833 -3966 -7515 -11560
695 -11560 -16326 -16749 -331 -4048 -19117 -31259 -27524 -13697 -5352 84 4270 2753 -2621 1570
681 1570 -7776 -21880 -19862 -22138 -13325 -10257 -17841 -29985 -28064 -27722 -31425 -14401 10653 24326
667 24326 20038 897 -4151 6868 14387 12259 -3653 -3164 5253 16865 16363 991 -13177 -18439
653 -18439 -15001 7170 8066 -6025 -3873 10276 16237 4334 203 -6727 -4514 5496 3320 -11068
639 -11068 -19444 -27502 -27226 -37539 -25113 -21060 -18622 -13534 -24189 -20486 -28411 -17163 -5494 -73
625 -73 531 -320 -664 -2162 4599 10180 15811 2140 -2677 1038 2046 730 -917 -7922 -8959 -2801
609 -2801 -390 -2718 714 -10097 -14559 -17355 -13079 2018 2847 9847 1670 -3414 -945 -2679 -27249
594 -27249 -36380 -45291 -46854 -36100 -27295 -23644 -14512 -16488 -13862 -7074 -14740 -7261 -3685 -17525
580 -17525 -29067 -20153 -16941 -5078 6445 -12221 -22065 -26559 -27416 -12862 -642 6137 4705 -1763
566 -1763 -4836 3182 13401 20660 12315 502 17679 20161 7604 2734 -12279 -25066 -30425 -24996
552 -24996 -21287 -22795 -8163 -155 -8866 -11527 -6360 3453 -7389 -2078 14062 23863 12034 3589
538 3589 2703 6851 5416 2918 -3793 -13173 -1979 13520 16081 -99 -7188 -2809 8836 10120
524 10120 9599 -1652 -6682 567 7180 9662 8980 -17316 -31200 -33303 -22237 -20359 -21856 -15032
510 -15032 -6223 -6667 -14550 -19142 -5835 -12072 -36555 -36714 -18271 -8749 -2790 9587 -954 -10132
496 -10132 -8046 -19676 -19766 -15101 -21933 -18620 -18603 -15222 -7758 -13172 -1930 -2556 -11694 -20758 -28454 -26212
480 -26212 -14115 -14308 -3314 7986 9259 -3463 -11119 -21881 -31092 -20637 -17569 -26002 -28069 -24687
466 -24687 -40600 -34514 -23337 -22024 -25396 -27024 -13553 -2402 -18866 -12689 -4993 -2560 -9454 -6875
452 -6875 1092 -1133 -12678 -17253 -23834 -26397 -17419 -68 13786 -2520 -12770 -11095 -15433 -17629
438 -17629 -9579 -4436 2869 303 -2258 -7953 -3971 2211 7951 430 -16448 -12581 -3873 -1078 -5183
423 -5183 -1021 4347 3839 -6287 -12649 -17720 -13671 -16579 -11842 -9801 -730 7199 -1302 -6775 -17530
408 -17530 -26121 -29728 -24563 -16708 -9652 -9391 -11074 -825 17375 17825 6112 -9704 -6065 4566
394 4566 -6 -9779 3145 6339 -3202 -2835 -589 -5182 3148 12282 13465 15038 24298 19383 20359
379 20359 19668 7709 -15156 -21124 -8597 4276 1901 4358 7007 914 -7129 -9450 -16666 -12562
365 -12562 -5735 12911 7639 4009 3293 -718 -4210 159 2223 3214 831 5402 9587 5482 3408
350 3408 -286 -2253 -3053 -9174 -6871 98 -6382 -20349 -21927 -20122 -16722 -8708 1151 5794 13884
335 13884 20157 6246 2518 -3008 -14679 -19538 -14581 801 2969 -6711 -16193 -23793 -17039 -3823
321 -3823 4710 326 -7069 -14476 -19196 -5322 12709 8668 -4193 280 6220 2936 -9658 -16816
307 -16816 -19147 -20510 -24337 -16087 -5071 -5615 -9226 -20109 -25734 -22434 -22147 -15346 -18021 -20072 -15304
292 -15304 -21946 -18659 -14854 -12942 -7129 8309 5537 1145 -12318 -9163 9607 9780 527 -8164
278 -8164 -12964 -15678 -19358 -19887 -11240 -25921 -31088 -28484 -12113 -12472 -11044 -4286 -6866 -14196 -8729
263 -8729 3795 -3849 2245 11436 7901 -3766 -20332 -28291 -41121 -24127 1275 -913 -8825 -10722
249 -10722 -8846 10802 13969 13175 12590 7285 1424 -6562 -15894 -17633 -25277 -26627 -16360 -26864 -18903
234 -18903 -7306 -1863 -5678 -13145 -11962 -13608 -4149 -11642 -22527 -9795 -6075 -5330 -23123 -32024
220 -32024 -32342 -32463 -34009 -30289 -30681 -29647 -17421 -14602 -20455 -28531 -27290 -12504 -3119 -9017 641
205 641 -2369 2777 -2974 -17012 -12330 748 -3396 -863 -6596 -6793 -3224 -12264 -17364 -14590 -17691
190 -17691 -14950 -13967 -25588 -33705 -23872 -14303 -8461 -5471 -7267 -11643 -11596 -10975 -1599 1902 -2094 4309
174 4309 5611 -3831 378 -2515 -463 -12012 -16333 -20215 -14507 -3623 2420 -6598 -18043 -24324
160 -24324 -16969 -9564 -14915 -13759 -17653 -13516 -17024 -11789 -14504 -13579 -14352 -10900 -15086 -14065 -1140
145 -1140 5264 10850 15765 10499 -830 -7939 -6680 -1608 -4678 -11429 -15927 -25461 -23226 -15557 -13761
130 -13761 -1939 297 -5141 -7836 -10429 -2361 9311 5698 698 -6197 -10950 -13436 -12144 -11063
116 -11063 -6264 -6458 -14802 -17207 -6237 1541 6539 -7680 -7483 -6076 -9959 -2964 -11281 -20094 -24768
101 -24768 -21667 -15730 -8304 -2258 -3489 5302 8889 7828 1753 -6306 -24645 -19328 -9244 -13054
87 -13054 -15266 -12055 -2473 6088 4046 -3938 -11536 -4973 6296 6277 11509 11511 6526 2746 4447 -2664
71 -2664 -10913 -11262 -3629 2854 4156 5742 -3134 -9394 -18802 -23043 -25738 -20385 -17162 -12847 -3483 2085
55 2085 -664 -5691 -14427 -17272 -13478 -15290 -17537 -18988 -19127 -11199 -5724 -279 -454 -5558 -815 -1502
39 -1502 -12380 -18764 -15588 -10623 -530 4723 -5538 -14691 -19603 -22746 -14095 -12416 -23902 -23725 -13087
24 -13087 -4793 -309 -3592 -3558 3530 -10117 -13249 -7482 -8305 -10230 -9664 -16944 -17904 -15055 -9814 -5936
8 -5936 -18676 -37612 -29571 -17549 -12414 -4813 -1204 6241
0 6241
$$ Imaginary data points
##PAGE= N=2
##DATA TABLE= (X++(I..I)), XYDATA
32767 1499 2013 3708 802 -7325 -2701 3319 5449 10153 8841 5412 2420 -4438 -11558 -7904 6539
32752 6539 19930 27371 23464 16208 10278 15252 18110 14710 16358 14452 24476 25388 20300 27822
32738 27822 26635 25332 25175 24665 15873 20744 24736 39883 49456 48858 42236 33085 34749 41841 45127
32723 45127 32745 25575 34224 34040 17606 15116 10956 17933 33974 38194 29206 30105 22474 17431
32709 17431 14830 20367 13901 11328 13635 16948 18264 21969 27994 28904 32157 30023 35039 42396 45472
32694 45472 42107 42204 46296 49113 48329 47566 46865 52288 49181 38978 34080 36083 41166 52045 43609
32679 43609 45066 56829 53225 45209 44477 41577 39640 42815 45034 49309 46384 46018 60536 54355
32665 54355 43938 52677 64625 61776 49397 50426 46959 48518 47106 54950 61434 64041 64910 67477
32651 67477 72839 76001 61235 47950 57870 58594 62758 62416 65614 62622 56835 54908 51542 56414
32637 56414 55552 52522 55532 65366 65536 61643 54472 66740 70399 73464 79556 77073 73424 78535 88479
32622 88479 88720 93030 88921 71877 80079 85663 77148 67717 63639 60882 58447 52217 50227 56662
32608 56662 54479 59906 70038 70955 62313 69772 77605 81746 73538 68388 71056 76161 78878 80168
32594 80168 78723 78317 86922 86584 84493 90042 92097 84266 86781 80716 79654 79454 78468 75119 74848 89425
32578 89425 90386 87028 83170 88983 93211 96282 93788 90484 89035 85656 86998 83115 84792 81173 90706
32563 90706 87481 73728 80720 103668 107475 104536 96730 100371 103851 102921 102638 86775 80410 89000
32549 89000 88287 94246 101824 104497 100960 90675 86503 92571 96587 95503 87881 75740 65896 66952
32535 66952 77168 90777 97050 95554 92478 100434 107790 103121 103304 97235 97590 93511 88844 90011
32521 90011 89822 100895 96333 94317 95147 93148 96483 108190 113518 120154 128467 124276 112358 102461
32507 102461 93633 74184 77459 77030 83041 94095 87667 95582 106338 106767 105843 102040 108096 110650
32493 110650 115412 120064 108160 99151 108237 120861 108737 99548 114922 119257 124990 109007 90396
32480 90396 88342 103029 104942 105535 110391 119592 122199 131428 142736 147898 132886 122210 110381
32467 110381 101478 108372 118543 123100 128369 133117 128595 132440 126333 124462 128734 124962 110228 112679
32453 112679 115290 123616 130092 128398 118225 104995 95516 103063 105873 100613 105155 106895 97029 83930
32439 83930 89619 86599 91071 107946 116184 109802 113068 113612 107898 110972 98956 114027 130531 124394
32425 124394 118199 120137 119493 114651 111574 117405 124746 118214 122853 126202 127420 117857 122728 114443
32411 114443 113374 106675 116853 123131 133288 140584 152588 148226 147614 137046 123885 105556 92835
32398 92835 120162 125363 114913 115270 105477 107308 116885 132900 123751 112503 115501 127642 128606 123577
32384 123577 127185 132442 135222 139189 127825 122545 135940 131276 119037 118178 115525 114927 117684 128624
32370 128624 119821 108614 109558 117566 132365 145976 139830 136626 129947 134370 134097 141944 147207 147052
32356 147052 151618 150860 133030 130937 140920 146480 132464 128000 120379 126350 141627 147975 138371 151428
32342 151428 161526 151752 143953 150028 150003 144295 145201 153537 140202 141405 133829 127493 122319 134254
32328 134254 139840 133066 137547 149976 150452 135445 132030 138337 122062 119712 117106 113996 109816 118721
32314 118721 119272 123768 119352 114719 127800 138639 140878 147890 137066 112334 111431 123607 127534
32301 127534 120459 140992 151008 156274 153328 144208 141149 136838 135741 134241 132983 139796 146219 155477
32287 155477 165030 153468 142549 130201 123301 137865 145330 150932 158593 172346 168929 161131 172565
32274 172565 162057 163981 166221 141055 128921 125502 128271 140440 150451 143979 132367 141558 151228
32261 151228 155988 152311 140713 129134 124708 129863 141338 149818 151844 151945 160591 156915 148597 142312
32247 142312 141774 149800 149257 142245 135633 135761 126655 126123 134547 136268 127624 131504 146432 141783 136093
32232 136093 127961 129582 134064 142846 137935 134143 132090 129390 130185 129566 135511 132670 135290 144281 135675
32217 135675 125435 125752 129174 125002 111986 116314 122848 138920 145792 142524 131480 117822 117868 133847
32203 133847 140164 138586 139847 144828 139831 131713 134078 140313 146911 143936 149232 152434 161085 150419
32189 150419 147461 147834 139245 134853 144021 157412 167897 163318 147610 153917 164358 164939 158549 155003
32175 155003 152516 152209 150167 150920 142090 130121 122180 120115 127108 138410 141527 141751 146771 143920
32161 143920 156563 161411 153266 146253 149700 159416 166426 169389 169318 145003 137809 137132 142424 163604
32147 163604 162734 153409 149045 150507 158345 157435 158712 154711 157323 157862 150179 135603 144775 152848 147949
32132 147949 132761 122972 123634 129031 126861 143715 167332 160053 152482 164198 166506 160060 150489
32119 150489 130580 125214 134355 137445 131909 126575 129180 139902 158838 161205 154387 147313 139293
32106 139293 127446 122122 132170 130885 145399 144596 151071 148187 142540 137325 133113 128909 125540 121880
32092 121880 118564 120670 127152 132499 137725 142783 142765 140337 134085 140796 140018 139462 140135 153886 155268
32077 155268 144374 132506 122063 124129 140839 130956 122806 125472 132857 130389 133178 147570 139571
32064 139571 156487 174800 164421 155625 156074 147819 143990 156361 174167 171869 156920 147575 147122
32051 147122 140892 144353 139652 143356 157784 166534 177505 188492 183443 176183 169532 162661 151965
32038 151965 147723 156623 154449 149616 151275 159031 150067 149682 154923 150622 127651 130052 140685 135688
32024 135688 129902 127905 120751 117732 132120 137672 128522 137276 150716 147256 147581 146189 148713 150781
32010 150781 147470 160053 169130 156985 146917 151608 148148 130737 130710 142855 140247 135070 124879
31997 124879 127025 126281 115565 106175 99380 114002 131152 143520 146710 146093 149379 152155 147782 141974
31983 141974 144130 143998 138049 132479 132383 131078 122987 131907 138520 147900 153654 158830 158416 139079 136079
31968 136079 148152 148488 142487 144049 145759 133417 138370 145266 156701 151333 140561 139712 141453 139509
31954 139509 139434 150075 150207 150995 155190 155546 142023 144128 141312 144754 148055 149139 150484 142620 124620
31939 124620 133508 133146 125490 115257 119117 117870 124571 137713 146160 143276 138601 154727 162791 164691
31925 164691 162707 157405 146027 138138 137586 140465 133847 138501 149381 150544 139020 135157 124117
31912 124117 114459 125269 131588 130841 127751 131882 126307 125220 119688 129450 127507 136622 149718 144034
31898 144034 134512 146180 153841 149546 144035 151551 150246 144039 145626 153508 148500 135997 123449
31885 123449 129391 128559 127910 128900 123298 136341 143986 145803 142672 143274 157223 158185 151628 147680 141853
31870 141853 137219 145602 152569 150739 139853 134511 127898 123472 122674 123842 135392 140320 150275 165608
31856 165608 155505 174299 171455 150455 147064 154494 152223 134206 125946 128052 129076 131294 129950
31843 129950 140196 135309 138278 127821 133235 142126 120944 108606 110609 121020 128601 122138 128978
31830 128978 152610 168135 163587 155945 154450 153716 162262 168153 146608 126937 123340 146468 144849
31817 144849 130304 104572 107975 119158 131131 131915 136605 140073 136346 136643 146450 162488 167153
31804 167153 151974 152061 130205 114023 124571 134642 125247 117553 109979 115913 142570 147469 151415
31791 151415 151468 155916 139873 136381 143517 140541 138612 136087 148581 155515 151087 150220 150573 157934 136990
31776 136990 125333 126959 133377 147557 151967 147528 139742 140911 149657 150727 151407 160332 152904 139050
31762 139050 134242 141832 145511 150039 154816 153000 135942 135505 146568 142186 145804 152516 152855 150979
31748 150979 153625 154298 175144 169198 168670 175230 161136 149134 143461 149286 145780 142109 129700 135575
31734 135575 134034 130626 141687 153835 163831 148996 146548 145308 137838 129547 123352 145351 149354
31721 149354 144419 135394 148771 164341 167381 169071 169405 156901 134330 135418 160800 149373 155631
31708 155631 157367 157222 151625 153403 161094 157580 136243 123303 129582 128704 145280 151689 154808 153113
31694 153113 143909 139478 148507 146485 140676 132497 136523 143318 142723 147269 154009 149104 128253 119139
31680 119139 129880 137198 154973 151574 151248 147654 144076 133686 124374 125523 122907 133684 136343
31667 136343 132533 126872 129313 137063 152921 144492 147824 155084 152126 145784 134479 131470 134856 140241
31653 140241 139606 136822 124075 125243 133470 129965 137744 150988 160199 163101 170584 174187 161211 156906
31639 156906 152563 153596 158645 154131 162654 173298 171629 176282 174149 159242 152960 144876 131057
31626 131057 128686 140987 146376 146410 146355 153994 141647 147360 146202 136879 128146 131428 150293 160538
31612 160538 149407 136098 134744 136091 132587 131986 140202 131659 117322 121596 136870 142752 142924 124127
31598 124127 116564 120487 142445 147542 134911 150455 155240 139107 137009 139540 149331 158658 154251
31585 154251 132896 129935 141026 140544 129418 115233 119462 144264 151223 152387 160856 167249 157548
31572 157548 130185 132583 129616 127447 132225 132480 134161 138417 145422 158076 168155 161246 170272 167084
31558 167084 165667 165123 157864 157911 162954 154406 144675 149193 143873 133042 136011 124313 115531 110374
31544 110374 108624 119775 128572 133694 147303 152507 152813 167149 167560 164381 167814 167367 157002 152342
31530 152342 159713 165049 156364 153377 151650 138683 142076 144761 150446 161321 161056 166603 151712 141817
31516 141817 141121 145215 154018 161249 156029 163164 166025 153361 154955 147582 143656 154414 153487 140413
31502 140413 133927 134002 134927 143076 141574 141367 144441 161994 169900 159001 143641 134460 173048 194219
31488 194219 179708 171039 164735 162898 159607 155929 144804 146775 147873 146221 140881 147740 157036 156143
31474 156143 135612 128419 127569 129560 142272 144012 150446 151511 139609 127782 115474 121844 135980
31461 135980 133345 142422 147586 144897 130089 137022 140013 140563 152810 156211 156343 151661 156600 159155
31447 159155 147846 144138 140480 132666 129943 127073 139340 148337 158018 155699 158998 165460 168751 166786
31433 166786 155234 154679 167421 175803 172115 175616 174873 147473 132712 129134 138837 144923 152772 144211
31419 144211 149852 143640 135045 140723 146267 145753 157707 148270 145136 139758 161155 180433 185377 175696
31405 175696 174512 161694 143013 152752 163778 153913 139966 131683 150516 157824 154588 152315 139919
31392 139919 145497 147539 151728 149684 165773 175186 162691 132640 120786 114255 128639 137519 157724
31379 157724 147345 144515 158287 155827 146241 153249 146508 141384 136826 153962 159574 151594 141097
31366 141097 139037 154516 157328 162827 165188 158253 168821 165693 159203 155127 134610 126752 132826
31353 132826 135081 132117 129190 145466 159977 162658 158148 149964 153158 144691 133332 127390 128340 137036
31339 137036 142611 142436 139915 138201 159120 172063 174628 170155 158268 141084 135049 128603 133041
31326 133041 145981 147213 142996 155907 151506 151296 155957 157767 151286 137165 136911 146599 152123 135477
31312 135477 124724 131019 126770 128027 137159 147260 155913 165373 164154 157753 169403 155474 136213
31299 136213 139342 150973 152755 154533 154430 155327 150057 153560 151237 147091 143594 130058 129041 124988
31285 124988 111379 122197 147904 149360 141743 153228 142259 140156 139461 141981 136727 124472 129310
31272 129310 127135 126280 126590 126490 133984 125700 119735 121627 125990 123823 130042 151845 175453 171519
31258 171519 155387 142483 152287 166422 162594 151374 158083 165750 157218 156309 154081 160044 152335
31245 152335 142940 145043 157662 158243 134486 131297 133487 136748 146202 156836 158109 154669 152585 161556
31231 161556 165244 157718 152155 146691 163696 162326 154912 161197 173597 167323 169294 173035 171236 169267
31217 169267 168329 166239 154648 144026 154177 159878 153126 133796 144282 146725 154735 170101 175082
31204 175082 149731 133893 126319 137981 142477 139381 130665 139832 150982 143477 140835 141800 148571
31191 148571 143067 148325 159080 163735 156804 147744 132056 137030 141635 156311 151386 148015 149090
31178 149090 150286 156516 149302 146881 137861 144461 150325 141355 150187 157126 159946 156267 159032 146258
31164 146258 133749 129209 131206 135657 137965 146983 154909 159437 146878 130243 135957 140352 155790
31151 155790 155703 161091 161578 163766 160718 143637 133930 138204 136572 137602 140517 135192 132917 134210 135175
31136 135175 129982 125931 146007 162204 154214 140168 138471 142394 146984 152252 149458 151624 144882
31123 144882 142466 151621 156321 158493 149216 149102 166898 167531 140508 125237 117233 132847 151440
31110 151440 160432 150548 137159 136697 124422 127960 137635 146805 154976 155304 137557 140350 149393 156146
31096 156146 154766 142376 136881 143833 155061 148470 149446 163032 155091 141769 139662 136408 122379
31083 122379 114164 124169 128565 137568 143393 138043 132149 127649 141336 143236 138806 135257 139968 155295
31069 155295 156651 168874 175417 161900 154337 160810 157447 151285 140451 140886 132671 121652 128327
31056 128327 134818 139043 145723 151675 148481 146573 139234 148977 149692 153093 147902 153512 166560 173313
31042 173313 172042 171239 178029 172306 173375 163724 164849 147685 134136 136819 132236 133575 138915 150467
31028 150467 150599 154890 149515 157954 158351 159141 163821 156506 152509 136913 134038 153115 171592 167054
31014 167054 158332 160683 158419 147867 125542 120942 122529 137562 149662 161433 155815 158349 167420
31001 167420 156680 141019 134841 150146 150656 151848 147997 137690 118448 112655 118471 116375 120901
30988 120901 132740 147489 148195 124365 123693 140769 148573 166644 175121 160490 144539 130572 125580
30975 125580 136098 161442 162260 155212 155693 151440 134213 141424 155178 155156 145502 130676 128154 135926
30961 135926 140431 147345 171187 180830 175623 177698 176431 161326 142391 155336 169322 170674 168265
30948 168265 175504 182083 160512 155398 150034 142313 144732 129671 129362 134061 134635 145736 139682 140139
30934 140139 138440 137041 140516 148824 146433 142063 150632 148536 142752 147810 140040 132604 144722 152894
30920 152894 150553 147776 144762 140251 141153 149537 148766 131081 112984 130286 145322 153636 153857 154514
30906 154514 165682 163673 147331 129363 138541 160837 182695 186776 176575 172101 168014 175925 170903
30893 170903 154364 144609 148183 133865 136533 148582 156957 168818 164229 157862 157099 158904 155025
30880 155025 163630 151604 152265 153695 140120 139061 134514 134090 137970 140415 153327 145262 132399 137088
30866 137088 156552 179915 190973 194958 186338 171159 155221 153200 153190 143496 133780 142500 147317
30853 147317 156366 158701 154298 162067 165048 160156 152143 141212 140751 145370 145886 155987 164849 161267
30839 161267 162368 173151 161686 153949 160099 161673 165366 170347 165049 163565 141574 137922 154344
30826 154344 168006 175005 164740 152238 153700 160747 159421 154695 147957 148440 147942 155800 160308 166314
30812 166314 172408 165508 161958 155200 133851 140123 154951 168967 158210 120906 116475 149912 162992
30799 162992 160325 164134 151295 142847 139589 144629 146884 142616 143010 152266 144514 151157 163894 164886
30785 164886 159365 152405 144220 135436 142119 145622 141871 146591 137508 118182 122604 126600 123785 125168
30771 125168 126309 121954 124095 129235 129345 128207 125086 146331 169924 170849 164984 172960 172983 165301 166829
30756 166829 164804 149268 152635 162178 155353 154151 160099 151392 141120 138237 129628 130346 135282 146070
30742 146070 152756 151111 144607 156550 155462 157739 165579 165075 165384 166171 160197 157220 144662 154469
30728 154469 154329 150047 149163 143397 157369 162113 164643 168400 173757 175704 156159 152364 164948 166742
30714 166742 154309 147172 153571 170020 169666 170851 165388 168802 163432 150583 156816 144479 143097
30701 143097 145908 152457 138637 145126 144451 144502 144596 155283 159990 149406 144362 153084 154862 154989 160260
30686 160260 167553 169151 160223 153340 156684 157507 154374 155162 153384 150186 152060 138768 134972 132940
30672 132940 119553 120365 133375 149362 162569 179408 185467 196339 185200 175210 164552 163673 169955
30659 169955 177100 173513 171018 168322 153099 136433 127004 125609 129136 139545 152474 147156 159320
30646 159320 164304 171608 161132 138957 137944 138478 141717 152181 162280 185930 183632 179056 171649
30633 171649 166592 154402 145202 139523 129411 121822 134312 148256 145461 147273 143650 151276 155372
30620 155372 148137 155469 164588 140484 138323 136670 145698 153150 145935 148829 147959 154651 155259 139904
30606 139904 130599 133006 137038 147036 154350 157711 159708 149222 145316 140166 136535 141584 142740 136773
30592 136773 132464 149724 160127 153554 149800 148694 152802 158613 149468 139272 148973 165001 157301
30579 157301 151456 160506 163110 163629 151020 150337 150731 152379 152771 148132 155803 163040 168114 177811 178294
30564 178294 173782 161708 161050 161104 160531 166262 157620 154002 154914 154990 144794 142699 141131 150079 150155 144454
30548 144454 159355 163159 157279 152611 156438 149907 157161 160262 156330 151313 139905 151128 150764 150904
30534 150904 148816 150025 134783 146187 158737 153835 136035 140055 152797 154270 145827 156614 150434
30521 150434 137516 129531 126660 145820 149209 139317 134830 137385 145248 158312 166027 168800 165926
30508 165926 168959 177510 182339 182197 189708 168669 158923 161488 167467 155729 151297 156640 171670 168153
30494 168153 160261 165343 158394 141696 123734 127918 129696 131466 138978 141566 136702 143008 160698
30481 160698 161957 155197 151660 150220 149714 147596 145106 132911 136322 144408 138039 136675 144899 127898
30467 127898 123859 143295 148338 151598 159302 166551 164721 157080 144885 140235 141950 140449 137764 147820
30453 147820 150518 153354 156737 155289 144579 141150 134482 126909 136809 150249 155015 153350 145810 161491
30439 161491 167541 163625 167187 158620 137352 115567 129134 138566 150626 161818 152346 133814 126100
30426 126100 131850 131479 135851 161582 170231 157477 157882 174957 166303 156139 129776 126652 118341
30413 118341 120656 116283 124929 149490 138554 127309 135937 150157 169255 161950 149259 152991 162131
30400 162131 159320 174996 175251 166054 154138 154918 168475 160374 151420 143437 137137 135848 143236 148862
30386 148862 127774 134214 152780 153473 140679 134035 147196 154604 164999 165052 159003 163727 155696 142180
30372 142180 142800 159243 181030 187092 176434 162630 151130 154936 162121 173847 164818 147197 140568
30359 140568 143588 138862 134585 126777 142445 155395 162468 168263 175641 173343 168119 163997 178653
30346 178653 187529 182070 163919 146519 156585 155453 158670 153544 155773 146866 134675 147237 153431
30333 153431 149056 133442 143330 140404 138161 143663 146011 149343 140598 128231 124109 134617 144147
30320 144147 163810 166049 148668 139908 149504 154108 141901 142529 150239 174096 174034 156604 152490 147502
30306 147502 149574 154403 144356 142360 147098 148289 143999 140826 154277 163247 155569 148543 150193 163864
30292 163864 163381 152416 140517 152803 173341 171546 180629 181609 176608 191907 186258 176746 172773
$$ [...]
##END NTUPLES=NMR SPECTRUM
##END=
