##TITLE=Analysis number 317948
Compound Code cc 30146
Book Reference 438/98
Project Code adrs
Chemist Name antons
##JCAMPDX= 6.0         $$ Bruker NMR JCAMP-DX V2.0
##DATA TYPE= NMR SPECTRUM
##DATA CLASS= NTUPLES
##ORIGIN= Bruker BioSpin GmbH
##OWNER= nmr
$$ XWIN-NMR		Version 3.5
$$ Wed Mar  8 15:12:29 2006 GMT Standard Time (UT+0h)  MAYBRIDGE\nmr@NMR_250MHZ
##.OBSERVE FREQUENCY= 250.131544655141
##.OBSERVE NUCLEUS= ^1H
##.ACQUISITION MODE= SIMULTANEOUS (DQD)
##.ACQUISITION SCHEME= undefined
##.AVERAGES= 16
##.DIGITISER RES= 18
##SPECTROMETER/DATA SYSTEM= dpx250
##.PULSE SEQUENCE= zg30
##.SOLVENT NAME= CDCl3
##.SHIFT REFERENCE= (INTERNAL, CDCl3, 0, 16.406)
##AUDIT TRAIL= $$ (NUMBER, WHEN, WHO, WHERE, WHAT)
$$ ##TITLE= Audit trail, XWIN-NMR		Version 3.5
$$ ##JCAMPDX= 5.01
$$ ##ORIGIN= Bruker BioSpin GmbH
$$ ##OWNER= nmr
$$ C:\u/data/dgb/nmr/ADRS/330/pdata/1/auditp.txt
$$ ##AUDIT TRAIL=  $$ (NUMBER, WHEN, WHO, WHERE, WHAT)
(   1,<2006-03-08 15:12:06.65 +000>,<MAYBRIDGE\nmr>,<NMR_250MHZ>,
      <created by zg, POWCHK disabled, PULCHK disabled
       configuration hash MD5:
       84 BC 41 DB A1 6E 1D 46 DA 25 12 A5 C1 ED C5 3A
       data hash MD5: 64K
       DE 98 40 64 B8 4B 6A F6 03 88 1C 09 A0 B0 99 91>)
(   2,<2006-03-08 15:12:19.32 +000>,<MAYBRIDGE\nmr>,<NMR_250MHZ>,
      <Start of raw data processing
       ef LB = 0.3 FT_mod = 6 PKNL = 1 SI = 32K 
       data hash MD5: 32K
       67 E4 21 23 32 AE 8B F8 81 BD 84 F3 1B 9E B5 E4>)
(   3,<2006-03-08 15:12:21.37 +000>,<MAYBRIDGE\nmr>,<NMR_250MHZ>,
      <apk 
       data hash MD5: 32K
       AD 21 F9 4E EB FE 15 47 D2 EB E0 62 FF FF A7 2A>)
(   4,<2006-03-08 15:12:22.15 +000>,<MAYBRIDGE\nmr>,<NMR_250MHZ>,
      <abs ABSG = 5 
       data hash MD5: 32K
       CD 8B 34 D3 E7 82 AF 0E CF 8B 88 55 64 12 25 4E>)
$$ ##END=
$$ 
$$ hash MD5
$$ A8 75 BF B4 0A 23 BA 79 F2 C2 16 1C 75 44 BF 15
##$RELAX= 
##$RELAX= 
##$RELAX= 
##$RELAX= 
##$RELAX= 
##$RELAX= 
##$RELAX= 
$$ Bruker specific parameters
$$ --------------------------
##$DU= <C:\u>
##$EXPNO= 330
##$NAME= <ADRS>
##$PROCNO= 1
##$TYPE= <nmr>
##$USER= <dgb>
##$AMP= (0..31)
100 100 100 100 100 100 100 100 100 100 100 100 100 100 100 100 100 100 
100 100 100 100 100 100 100 100 100 100 100 100 100 100 
##$AQSEQ= 0
##$AQ_mod= 3
##$AUNM= <au_zg>
##$AUTOPOS= <46 >
##$BF1= 250.13
##$BF2= 250.13
##$BF3= 250.13
##$BF4= 250.13
##$BF5= 500.13
##$BF6= 500.13
##$BF7= 500.13
##$BF8= 500.13
##$BYTORDA= 1
##$CFDGTYP= 0
##$CFRGTYP= 5
##$CHEMSTR= <none>
##$CNST= (0..31)
1 1 145 1 1 1 1 1 1 1 1 1 1 1 1 1 1 1 1 1 1 1 1 1 1 1 1 1 1 1 1 1 
##$CPDPRG= <>
##$CPDPRG1= <>
##$CPDPRG2= <>
##$CPDPRG3= <>
##$CPDPRG4= <mlev>
##$CPDPRG5= <mlev>
##$CPDPRG6= <mlev>
##$CPDPRG7= <mlev>
##$CPDPRG8= <mlev>
##$CPDPRGB= <>
##$CPDPRGT= <>
##$D= (0..31)
0 1 0 0 0 0 0 0 0 0.06 0 0 0 0 0 0 0.0002 0 0 0 0 0 0 0 0 0 0 0 0 0 0 
0 
##$DATE= 1141830725
##$DBL= (0..7)
120 120 120 120 120 120 120 120 
##$DBP= (0..7)
150 150 150 150 150 150 150 150 
##$DBP07= 0
##$DBPNAM0= <>
##$DBPNAM1= <>
$$ [...]
##$SUBNAM7= <"">
##$SUBNAM8= <"">
##$SUBNAM9= <"">
##$SW= 20.6930455092707
##$SWIBOX= (0..15)
0 0 3 0 0 0 0 0 0 0 0 0 0 0 0 0 
##$SW_h= 5175.983436853
##$TD= 65536
##$TD0= 1
##$TE= 294.16
##$TE2= 300
##$TE3= 300
##$TEG= 300
##$TL= (0..7)
0 120 120 120 120 120 120 120 
##$TP= (0..7)
150 150 150 150 150 150 150 150 
##$TP07= 0
##$TPNAME0= <>
##$TPNAME1= <>
##$TPNAME2= <>
##$TPNAME3= <>
##$TPNAME4= <>
##$TPNAME5= <>
##$TPNAME6= <>
##$TPNAME7= <>
##$TPOAL= (0..7)
0.5 0.5 0.5 0.5 0.5 0.5 0.5 0.5 
##$TPOFFS= (0..7)
0 0 0 0 0 0 0 0 
##$TUNHIN= 0
##$TUNHOUT= 0
##$TUNXOUT= 0
##$USERA1= <user>
##$USERA2= <user>
##$USERA3= <user>
##$USERA4= <user>
##$USERA5= <user>
##$V9= 5
##$VALIST= <valist>
##$VCLIST= <CCCCCCCCCCCCCCC>
##$VD= 0
##$VDLIST= <DDDDDDDDDDDDDDD>
##$VPLIST= <PPPPPPPPPPPPPPP>
##$VTLIST= <TTTTTTTTTTTTTTT>
##$WBST= 1024
##$WBSW= 4
##$XGAIN= (0..3)
0 0 0 0 
##$XL= 0
##$YL= 0
##$YMAX_a= 547273
##$YMIN_a= -344822
##$ZGOPTNS= <>
##$ZL1= 120
##$ZL2= 120
##$ZL3= 120
##$ZL4= 120
##$ABSF1= 16.40601
##$ABSF2= -4.287161
##$ABSG= 5
##$ABSL= 3
##$ALPHA= 0
##$AQORDER= 0
##$ASSFAC= 0
##$ASSFACI= 0
##$ASSFACX= 0
##$ASSWID= 0
##$AUNMP= <proc_1d>
##$AZFE= 0.1
##$AZFW= 0.1
##$BCFW= 0
##$BC_mod= 0
##$BYTORDP= 0
##$COROFFS= 0
##$CY= 12.5
##$DATMOD= 1
##$DC= 0
##$DFILT= <>
##$DTYPP= 0
##$F1P= 14.0000005364418
##$F2P= -0.99999901652339
##$FCOR= 0.5
##$FTSIZE= 32768
##$FT_mod= 6
##$GAMMA= 0
##$GB= 0
##$INTBC= 1
##$INTSCL= 1
##$ISEN= 128
##$LB= 0.3
##$LEV0= 0
##$LPBIN= 0
##$MAXI= 10000
##$MC2= 0
##$MEAN= 0
##$ME_mod= 0
##$MI= 0
##$NCOEF= 0
##$NC_proc= -4
##$NLEV= 6
##$NOISF1= 0
##$NOISF2= 0
##$NSP= 0
##$NTH_PI= 0
##$NZP= 0
##$OFFSET= 16.40601
##$PC= 1
##$PHC0= 16.18448
##$PHC1= 4.757745
##$PH_mod= 1
##$PKNL= yes
##$PPARMOD= 0
##$PSCAL= 4
##$PSIGN= 0
##$REVERSE= no
##$SF= 250.13002901072
##$SI= 32768
##$SIGF1= 0
##$SIGF2= 0
##$SINO= 400
##$SIOLD= 32768
##$SREGLST= <1H.CDCl3>
##$SSB= 0
##$STSI= 32768
##$STSR= 0
##$SW_p= 5175.98343685301
##$SYMM= 0
##$S_DEV= 0
##$TDeff= 65536
##$TDoff= 0
##$TI= <Analysis number 999999
Compound Code 99
Book Reference 9
Project Code 9>
##$TILT= no
##$TM1= 0
##$TM2= 0
##$TOPLEV= 0
##$USERP1= <user>
##$USERP2= <user>
##$USERP3= <user>
##$USERP4= <user>
##$USERP5= <user>
##$WDW= 1
##$XDIM= 32768
##$YMAX_p= 333131194
##$YMIN_p= -36424
$$ End of Bruker specific parameters
$$ ---------------------------------
##NTUPLES= NMR SPECTRUM
##VAR_NAME=  FREQUENCY,     SPECTRUM/REAL,   SPECTRUM/IMAG
##SYMBOL=    X,             R,               I
##VAR_TYPE=  INDEPENDENT,   DEPENDENT,       DEPENDENT
##VAR_FORM=  AFFN,          ASDF,            ASDF
##VAR_DIM=   32768,         32768,           32768
##UNITS=     HZ,            ARBITRARY UNITS, ARBITRARY UNITS
##FACTOR=    0.157963299565203, 1,           1
##FIRST=     4103.63567572585, 0,            0
##LAST=      -1072.34776112716, 0,           0
##MIN=       -1072.34776112716, -36424,      0
##MAX=       4103.63567572585, 333131194,    0
$$ Real data points
##PAGE= N=1
##DATA TABLE= (X++(R..R)), XYDATA
$$ [...]
$$ plain form
16643 67082 66209 65826 63182 60485 59053 55724 50643 47979 45514 42201 42420 46898 49990 46506 46887
16628 46887 48865 43733 46056 51407 52776 45302 37979 40336 41331 36627 40016 47748 47828 47137 46166 41315
16612 41315 38082 39926 43939 43288 41913 51153 56922 51360 46552 46449 40602 33473 26503 31764 36026
16597 36026 40136 47805 48250 43037 38951 34858 31764 29950 27528 25851 23872 21912 23402 26942 25220
16582 25220 28548 29089 32409 32159 28839 27269 26601 26796 31204 30204 32675 38820 33711 29133 29842 31191
16566 31191 30359 27775 32487 35100 32466 27940 22708 20531 28145 36326 32951 27610 25123 14720
16552 14720 15019 21684 22423 24824 23612 26054 31866 36411 41517 46096 53092 56993 54523 49909 50289
16537 50289 52920 57160 61299 63890 74896 84326 94986 96997 93953 92260 86965 89898 114092 132269
$$ packed form
16643F7082q73l83k644k697j432l329n081k664k465l313K19M478L092l484L81
16628D6887J978n132K323N351J369p474p323K357R95m704L389P732Q0o91r71m851
16612D1315l233J844M013o51j375R240N769n562m808j03n847p129o970N261M262
16597C6026M110P669M45n213m086m093l094j814k422j677j979j960J490L540j722
16582B5220L328N41L320k50l320j570o68J95M408j000K471O145n109m578P09J349
16566C1191q32k584M712K613k634m526n232k177P614Q181l375n341k487j0403
16552A4720K99O665P39K401j212K442N812M545N106M579O996L901k470m614L80
16537E0289K631M240M139K591J1006R430J0660K011l044j693n295K933K4194J8177
$$ plain form
16523 132269 161147 197332 237873 277089 308060 334952 346668 352677 351737 345003 329131 311991
16511 311991 299674 283881 269581 275847 293485 323469 357044 387398 409991 408980 384196 346083
16499 346083 311594 279250 242359 206825 188106 171363 158180 151052 144201 147306 160195 171005
16487 171005 175516 179163 179403 168369 155538 141379 127006 120016 115524 111482 111680 115628 125694
16474 125694 139168 158092 181117 211366 247718 279245 310341 339534 362472 387062 400148
16463 400148 399490 382582 348140 308068 267983 225906 193587 174793 163681 163740 169362 176353 197581
16450 197581 235622 274302 312845 349130 374427 378111 359520 330675 284616 238456 196086 163086
16438 163086 140867 120759 97764 81783 69884 65453 64210 60672 59084 63008 64577 63024 53360
$$ packed form
16523A32269K8878L6185M0541L9216L0971K6892J1716O009r40o734j5872j7140
16511C11991j2317j5793j4300O266J7638K9984L3575L0354K2593j011k4784l8113
16499C46083l4489l2344l6891l5534j8719j6743j3183p128o851L105J2889J0810
16487A71005M511L647K40j1034j2831j4159j4373o990m492m042J98L948J0066
16474A25694J3474J8924K3025L0249L6352L1527L1096K9193K2938K4590J3086
16463D00148o58j6908l4442m0072m0085m2077l2319j8794j1112N9N622O991K1228
16450A97581L8041L8680L8543L6285K5297L684j8591k8845m6059m6160m2370l3000
16438A63086k2219k0108k2995j5981j1899m431j243l538j588L924J569j553r664
$$ plain form
16425 53360 52138 51204 48988 46340 37694 35043 36382 36697 36927 34634 35195 41666 41999 32759 26080 20702
16409 20702 19583 14662 4564 9000 11774 9646 7190 6383 10389 15048 18089 18847 17710 11780 10904
16394 10904 8020 2425 1978 2926 2787 6804 8412 4610 7160 3741 2597 5399 952 -4057 -1282
16379 -1282 3778 6353 3981 2777 1603 2143 8562 11685 6069 5878 5724 1026 3884 10688 6046
16364 6046 4557 5011 4711 7071 9572 12860 12628 10572 6628 10171 9911 3381 -2641 -2425 -2640 -4
16348 -4 5157 3094 2967 -2456 -1954 -1481 6438 12335 11667 6491 -4868 -3770 4790 6280 4387 3339
16332 3339 368 709 -2700 820 6655 9310 12052 9222 -1017 -3070 2622 10477 11805 14019 19027
16317 19027 20598 16092 15102 7125 3575 -1594 -5946 -4173 -115 4011 3448 -2377 -9391 -12008 -15111
$$ packed form
16425E3360j222r34k216k648q646k651J339L15K30k293N61O471L33r240o679n378
16409B0702j119m921j0098M436K774k128k456q07M006M659L041P58j137n930q76
16394A0904k884n595m47R48j39M017J608l802K550l419j144K802m447n009K775
16379a282N060K575k372j204j174N40O419L123n616j91j54m698K858O804m642
16364F046j489M54l00K360K501L288k32k056l944L543k60o530o022K16k15K636
16348dN161k063j27n423N02M73P919N897o68n176j1359J098Q560J490j893j048
16332C339k971L41l409L520N835K655K742k830j0239k053N692P855J328K214N008
16317A9027J571m506r90p977l550n169m352J773M058M126n63n825p014k617l103
$$ plain form
16302 -15111 -19555 -18009 -9686 -3217 366 5477 7305 10164 20287 19782 17155 10962 -1491 -1605
16288 -1605 1682 573 4148 5165 12437 15534 16136 9609 7140 9424 13139 12111 10701 11804 9549
16273 9549 9248 7499 14587 14179 8636 3767 5624 2474 7845 8914 5578 7315 3086 1711 2715
16258 2715 -4814 -1226 -1064 -985 5682 5401 2064 1411 -2773 -11099 -16564 -9565 1401 9625 16689 18533
16242 18533 12677 15371 21059 16613 11734 4566 1795 -2239 -2503 -3876 -7480 -5532 -7393 -9058 -8718
16227 -8718 -9226 -12751 -19181 -15957 -5343 4136 5434 7211 6498 5925 11925 15722 16312 12026 1620
16212 1620 -5524 -11824 -5768 -5670 -605 545 6909 9195 -1041 1399 7372 1575 -2676 3058 5862
16197 5862 4262 5820 5831 1921 174 -4287 -4537 -5911 -5291 -6341 -6487 9058 12460 11088 8169 5459
$$ packed form
16302a5111m444J546Q323O469L583N111J828K859J0123n05k627o193j2453j14
16288a605L287j109L575J017P272L097O02o527k469K284L715j028j410J103k255
16273I549l01j749P088m08n543m869J857l150N371J069l336J737m229j375J004
16258B715p529L588J62P9O667k81l337o53m184q326n465O999J0966Q224P064J844
16242A8533n856K694N688m446m879p168k771m034k64j373l604J948j861j665L40
16227h718n08l525o430L224J0614R479J298J777p13n73O000L797N90m286j0406
16212A620p144o300O056R8N065J150O364K286j0236K440N973n797m251N734K804
16197E862j600J558J1l910j747m461k50j374O20j050j46J5545L402j372k919k710
$$ plain form
16181 5459 13006 20105 18955 14562 9275 5328 13 120 5161 978 -3368 -3397 -593 3990 10143
16166 10143 5464 5486 1704 -2543 997 113 -2004 -3553 -2046 523 1830 2082 -5094 -6201 -6706 -6859
16150 -6859 -5955 -8733 -9698 -6845 -2533 -2019 -3395 -2437 1877 5890 5250 -110 45 992 524 -3549 -2083
16133 -2083 2093 639 607 -45 -7220 -4767 1327 -171 -618 2509 -199 -5355 -4662 -4263 -3462 996
16117 996 2115 3967 4010 2558 -812 2138 4151 3851 -2919 -2953 1841 7574 6025 9768 11166 5138
16101 5138 3175 4831 5389 2429 3893 4191 -1337 -4743 -7210 -8677 -9271 -10317 -15650 -18325 -13235
16086 -13235 -12631 -9850 -8536 -280 773 -1961 -4224 -4239 -2325 374 -1517 -6319 -8578 -9133 -9781 -9874
16070 -9874 -9540 -147 1217 1650 -1050 -3867 -803 2284 2152 1025 -7710 -14045 -16095 -18646 -18806 -14890
$$ packed form
16181E459P547P099j150m393n287l947n315J07N041m183m346k9K804M583O153
16166A0143m679K2l782m247L540q84k117j549J507K569J307K52p176j107n05j53
16150f859R04k778r65K853M312N14j376R58M314M013o40n360J55R47m68m073J466
16133b083M176j454l2o52p175K453O094j498m47L127k708n156O93L99Q01M458
16117I96J119J852M3j452l370K950K013l00o770l4M794N733j549L743J398o028
16101E138j963J656N58k960J464K98n528l406k467j467n94j046n333k675N090
16086a3235O04K781J314Q256J053k734k263j5J914K699j891m802k259n55o48r3
16070i874L34R393J364M33k700k817L064L087j32j127q735o335k050k551j60L916
$$ plain form
16054 -14890 -10923 -6040 -1570 2970 12829 16615 15057 16174 13257 9099 6270 5916 704 -1582 -4450
16039 -4450 -7741 -10832 -7664 -7694 -7702 -9243 -15437 -13307 -11692 -11918 -9583 -2306 1599 2230 -2747 -12284
16023 -12284 -10677 -6771 398 -46 -4290 -5190 2616 1743 -225 -4741 -6381 -3988 -1303 -5782 -17416
16008 -17416 -20233 -16156 -10124 -8931 -4625 650 -321 -1075 -6280 -9856 -10011 -5449 487 1038 -28
15993 -28 -5758 -9050 -12487 -8575 -5265 -2174 210 -5122 329 9535 9652 8123 8213 7892 -2095 -13694
15977 -13694 -20301 -18240 -13180 -7199 -8593 1018 4999 9794 8644 9040 4372 -4621 -7741 -5193 -7260
15962 -7260 -13032 -10469 1610 4987 -2688 -6679 -557 1614 5094 2544 8 -398 -2089 -7293 -9806
15947 -9806 -5471 -1826 -3083 -9560 -9096 -356 1813 -10289 -14966 -11996 -16655 -12940 -11581 -10417 -4932
$$ packed form
16054a4890L967M883M470M540R859L786j558J117k917m158k829l54n212k286k868
16039d450l291l091L168l0qj541o194K130J615k26K335P277L905O31m977r537
16023a2284J607L906P169m44m244r00P806q73j968m516j640K393K685m479j1634
16008a7416k817M077O032J193M306N275r71p54n205l576j55M562N936N51j066
15993b8n730l292l437L912L310L091K384n332N451R206J17j529R0l21r987j1599
15977a3694o607K061N060N981j394R611L981M795j150L96m668q993l120K548k067
15962g260n772K563J2079L377p675l991O122K171L480k550k536m06j691n204k513
15947i806M335L645j257o477M64Q740K169j2102m677K970m659L715J359J164N485
$$ plain form
15932 -4932 -763 167 -2867 -8080 -6441 -5274 -233 -2999 -6370 -10917 -14787 -14479 -11069 -12291 -11887
15917 -11887 -9691 -3747 6591 2613 -11528 -6906 -6315 897 6216 7193 4865 -495 -8472 -4729
15903 -4729 963 -6539 -3286 1619 -3203 -9081 -9017 -4233 -7027 -4685 -5615 -9149 -8041 -2763 -791
15888 -791 -1116 1 2093 -2991 -7679 1798 6520 6640 4965 2838 -4315 -13530 -8250 -3877 -7194
15873 -7194 -15371 -13172 -16901 -15925 -10173 -9730 -10907 -13151 -16775 -12324 -12779 -10365 -3743 -9105 -14733
15858 -14733 -11444 -11279 -10672 -10768 -7389 -8046 -9347 -7300 -10990 -8465 -9916 -10533 -10129 -11611 -12928 -8189
15842 -8189 -7743 -2809 -4579 -7637 -630 -2915 -3020 -7297 -6185 -3709 -265 4344 5754 -1648 -12004
15827 -12004 -16352 -19354 -15148 -6303 1749 -2667 -6883 -8173 -13419 -11898 -10128 -12128 -11295 -13088 -7992
$$ packed form
15932d932M169R30l034n213J639J167N041k766l371m547l870L08L410j222M04
15917a1887K196N944J0338l978j4141M622N91P212N319R77k328n360p977L743
15903d729N692p502L253M905m822n878O4M784k794K342r30l534J108N278J972
15888g91l25J117K092n084m688R477M722J20j675k127p153r215N280M373l317
15873g194q177K199l729R76N752M43j177k244l624M451m55K414O622n362n628
15858a4733L289J65O07r6L379o57j301K047l690K525j451o17M04j482j317M739
15842h189M46M934j770l058P007k285j05m277J112K476L444M609J410p402j0356
15827a2004m348l002M206Q845Q052m416m216j290n246J521J770k000Q33j793N096
$$ plain form
15812 -7992 -5752 -8300 -9223 -9671 -9697 -9748 -7297 -3838 -4950 -10462 -8134 -10494 -16554 -18645 -17321 -8982
15796 -8982 517 -326 -9401 -10238 -7566 -4458 -1259 1786 -2624 -7863 -10567 -2125 2537 4747 4708 507
15780 507 -6983 -12052 -14971 -14777 -13398 -14061 -14048 -12941 -13485 -7691 -10476 -9985 -9627 -9890 -2491 -6288 -9229
15763 -9229 -15802 -19454 -20846 -14169 -14744 -10984 -16776 -17193 -15796 -14512 -22203 -17027 -5697 -11319 -15395
15748 -15395 -14827 -14102 -13348 -9687 -5845 -792 -2669 -7650 -14612 -16528 -11828 -5977 -8040 -14785 -8997
15733 -8997 -5273 -1937 -1649 -312 -4438 -6304 -2484 -3898 -5585 -7514 -6547 -4329 -6389 -15571 -16953
15718 -16953 -12974 -12999 -10062 -10644 -9654 -10463 -5638 -4730 -10219 -10419 -8145 -8621 -15048 -23356 -27278 -22708
15702 -22708 -19488 -11628 -8477 -12085 -14201 -23290 -14836 -9971 -9111 -5267 -4126 -8428 -6274 4697
$$ packed form
15812g992K240k548r23m48k6n1K451L459j112n512K328k360o060k091J324Q339
15796h982R499q43r075q37K672L108L199L045m410n239k704Q442M662K210l9m201
15780E07p490n069k919J94J379o63J3J107n44N794k785M91L58k63P399l797k941
15763i229o573l652j392O677n75L760n792m17J397J284p691N176J1330n622m076
15748a5395N68P25P54L661L842N053j877m981o962j916M700N851k063o745N788
15733h997L724L336K88J337m126j866L820j414j687j929R67K218k060r182j382
15718a6953L979k5K937n82R90q09M825R08n489k00K274m76o427q308l922M570
15702b2708L220P860L151l608k116r089Q454M865Q60L844J141m302K154J0971
$$ plain form
15688 4697 10940 10881 3275 -4787 -6606 -9499 -10357 -2371 -3287 -10203 -5348 -3858 -9271 -10895 -11522 -8575
15672 -8575 -5476 -7058 -9278 -9292 -11333 -16100 -16725 -17752 -17459 -14897 -8246 -7962 -10803 -6896 -7306 -10249
15656 -10249 -16427 -20606 -19466 -20201 -22140 -16215 -11844 -10858 -7387 -582 2911 -1469 -12058 -21431 -20333
15641 -20333 -16360 -6435 2595 6647 8963 2403 -3368 -3280 -1692 -8627 -15702 -18607 -20056 -21941 -22702
15626 -22702 -24959 -23585 -19349 -17532 -20939 -20463 -16813 -9368 -4854 -12078 -16201 -10985 -5254 2286 1038
15611 1038 -2480 -3238 -6610 -13006 -11091 -13607 -14553 -11144 -4105 -4205 -9896 -13068 -12113 -10388 -7327 -3426
15595 -3426 -3763 -9659 -13091 -11289 -6842 -6446 -4234 501 1329 4463 1779 -8333 -14460 -12345 -8688
15580 -8688 -3782 -8094 -9355 -5401 -2862 -940 -1481 -4961 -6712 -9898 -17529 -19649 -18614 -17987 -16762
$$ packed form
15688D697O243n9p606q062j819k893q58P986r16o916M855J490n413j624o27K947
15672h575L099j582k220j4k041m767o25j027K93K562O651K84k841L907m10k943
15656a0249o178m179J140p35j939N925M371R86L471O805L493m380j0589r373J098
15641b0333L973R925R030M052K316o560n771Q8J588o935p075k905j449j885p61
15626b2702k257J374M236J817l407M76L650P445M514p224m123N216N731P540j248
15611A038l518p58l372o396J915k516r46L409P039j00n691l172R55J725L061L901
15595c426l37n896l432J802M447L96K212M735Q28L134k684j0112o127K115L657
15580h688M906m312j261L954K539J922n41l480j751l186p631k120J035O27J225
$$ plain form
15565 -16762 -18170 -10764 -8392 -6265 -12973 -11845 -5886 -3283 -1704 -5629 -11896 -15825 -18593 -18506 -16027
15550 -16027 -13957 -11382 -9868 -12082 -12541 -7842 -9921 -13463 -11314 -12280 -8347 -2287 -1234 -2690 925
15535 925 -2280 -6278 -12121 -15510 -20852 -21986 -21828 -24410 -20819 -22494 -22168 -22094 -20681 -21652 -21926 -17108
15519 -17108 -19865 -19864 -11876 -11760 -14109 -18869 -21839 -16314 -13353 -12810 -9584 -12640 -14874 -9677 -6648 -5134
15503 -5134 -2373 -4182 -10772 -19561 -18891 -19868 -22355 -23162 -17433 -11071 -9520 -5186 -8639 -7641 -8548 -15122
15487 -15122 -17701 -9072 -2930 -1699 -9537 -11823 -10533 -11978 -11325 -12065 -13852 -15498 -19480 -19228 -15103
15472 -15103 -14775 -13990 -13867 -13499 -15847 -16693 -19714 -16396 -14506 -19775 -20931 -16546 -12545 -10161 -14478 -18756
15456 -18756 -20703 -19946 -19655 -16115 -13115 -12077 -16801 -14812 -13173 -15216 -11515 -11609 -10255 -11396 -8876
$$ packed form
15565a6762j408P406K372K127o708J128N959K603J579l925o267l929k768Q7K479
15550a6027K070K575J514k214m59M699k079l542K149r66L933O060J053j456L615
15535I25l205l998n843l389n342j134J58k582L591j675L26P4J413r71k74M818
15519a7108k757JP988J16k349m760k970N525K961N43L226l056k234N197L029J514
15503e134K761j809o590q789O70r77k487q07N729O362J551M334l453R98r07o574
15487a5122k579Q629O142J231p838k286J290j445O53p40j787j646l982K52M125
15472a5103L28P85J23L68k348q46l021L318J890n269j156M385M001K384m317m278
15456a8756j947P57K91L540L000J038m724J989J639k043L701r4J354j141K520
$$ plain form
15441 -8876 -8958 -13766 -19807 -27859 -31690 -31014 -23733 -15548 -10917 -11556 -13601 -12353 -12417 -10944 -13180 -14017
15425 -14017 -12499 -21095 -23045 -25586 -29538 -23254 -14996 -9803 -6581 -10451 -12268 -11663 -12016 -12848 -13478
15410 -13478 -8759 -1615 -2287 -7451 -8651 -6392 -10283 -9957 -11383 -11133 -7302 -6281 -4433 -10660 -15263
15395 -15263 -9651 -6910 -7690 -14190 -12426 -6319 -6463 -11859 -10135 -11319 -9266 -7596 -12314 -16151 -15964
15380 -15964 -12902 -16996 -22157 -16060 -10599 -11062 -14287 -16146 -18596 -18492 -16216 -11361 -10220 -13353 -20448
15365 -20448 -21184 -17495 -17407 -13424 -11236 -11628 -11994 -10516 -5879 -6420 -11017 -10255 -12492 -13496 -11533 -14561
15349 -14561 -14431 -12789 -10999 -13285 -19826 -19649 -11511 -8469 -7196 1821 -2202 681 615 -2669 -1884 -7044
15333 -7044 -10025 -12216 -11886 -15237 -17866 -20939 -22144 -15066 -17383 -17870 -21681 -21283 -19420 -12384 -11016
$$ packed form
15441h876q2m808o041q052l831O76P281Q185M631o39k045J248o4J473k236q37
15425a4017J518q596j950k541l952O284Q258N193L222l870j817O05l53q32o30
15410a3478M719P144o72n164j200K259l891L26j426K50L831J021J848o227m603
15395a5263N612K741p80o500J764O107j44n396J724j184K053J670m718l837J87
15380a5964L062m094n161O097N461m63l225j859k450J04K276M855J141l133p095
15365b0448p36L689Q8L983K188l92l66J478M637n41m597P62k237j004J963l028
15349a4561J30J642J790k286o541J77Q138L042J273R017m023K883o6l284P85n160
15333g044k981k191L30l351k629l073j205P078k317m87l811L98J863P036J368
$$ plain form
15318 -11016 -13985 -12589 -13194 -13812 -16722 -13491 -11561 -12026 -9825 -12332 -7945 -7192 -10635 -8135 -4088
15303 -4088 -6558 -7115 -7177 -7719 -8621 -7634 -5117 189 -4614 -17449 -21533 -19684 -21421 -15775 -13758 -8262
15287 -8262 -7534 -7967 -13312 -14608 -12696 -5929 -298 762 -2044 -6967 -12553 -10323 -7843 -7920 -7887 -4921
15271 -4921 -8528 -9761 -12651 -8624 -9699 -11334 -11985 -8823 -9616 -9296 -9166 -8887 -12562 -13981 -9288 3564
15255 3564 8859 5226 8037 17585 22798 18965 15265 14383 17072 15610 15078 7866 -1309 -3210 -3293 -1032
15239 -1032 -3247 -7710 -5650 -6521 -8384 -12146 -19813 -19038 -17655 -8428 -588 -1090 1740 -7863 -9978
15224 -9978 -187 4127 4717 8739 15567 10413 7786 7382 4184 4065 3423 6108 8209 8111 6252 7061
15208 7061 882 -339 -605 988 -244 -936 -3261 -5932 -7609 -4695 -7742 -6673 -1219 -8023 -11935
$$ packed form
15318a1016k969J396o05o18k910L231J930m65K201k507M387P53l443K500M047
15303d088k470n57o2n42r02R87K517N306m803j2835m084J849j737N646K017N496
15287h262P28m33n345j296J912O767N631J060k806m923n586K230K480p7L3K966
15271d921l607j233k890M027j075j635o51L162p93L20J30K79l675j419M693J2852
15255C564N295l633K811R548N213l833l700q82K689j462n32p212r175j901q3K261
15239a032k215m463K060q71j863l762p667P75J383R227P840n02K830r603k115
15224i978R791M314N90M022O828n154k627m04l198j19o42K685K101r8j859Q09
15208G061o179j221k66J593j232o92k325k671j677K914l047J069N454o804l912
$$ plain form
15193 -11935 -14417 -9461 -8872 -15526 -21067 -23418 -23602 -21657 -11152 -6119 -5133 -8197 -4581 2955 2209
15178 2209 106 -2255 1289 -4814 -11736 -18858 -18653 -17661 -23064 -19324 -10466 -14659 -17387 -19545 -15504
15163 -15504 -13301 -12138 -13862 -16019 -14339 -2987 51 -2352 -2546 -7160 -11633 -16881 -19521 -21579
15149 -21579 -19261 -21474 -22767 -27048 -24426 -19238 -18691 -14757 -12905 -18432 -20142 -22224 -22854 -16295 -13892
15134 -13892 -11657 -9308 -9376 -6684 -3918 -6364 -6941 -9316 -10117 -9967 -10889 -10774 -14173 -16697 -17350 -18951
15118 -18951 -23577 -27001 -24274 -21617 -19498 -16602 -11180 -6878 -7275 -17292 -20421 -18042 -22498 -17374
15104 -17374 -15700 -10219 -7250 -6038 -267 8271 12124 12617 14910 18633 13224 6378 -509 -6297 -4681
15089 -4681 -9562 -11466 -11100 -11450 -13034 -9092 -5667 -4238 -2505 -2358 -1251 -1133 -4055 -4261 -9061 -16682
$$ packed form
15193a1935k482M956N89o654n541k351j84J945J0505N033R86l064L616P536p46
15178B209k103k361L544o103o922p122K05R92n403L740Q858m193k728k158M041
15163a5504K203J163j724k157J680J1352L038k403j94m614m473n248k640k058
15149b1579K318k213j293m281K622N188N47L934J852n527j710k082o30O559K403
15134a3892K235K349o8K692K766k446n77k375q01J50r22J15l399k524o53j601
15118a8951m626l424K727K657K119K896N422M302l97j0017l129K379m456N124
15104a7374J674N481K969J212N771Q538L853M93K293L723n409o846o887n788J616
15089d681m881j904L66l50j584L942L425J429J733J47J107J18k922k06m800p621
$$ plain form
15073 -16682 -17902 -19294 -10935 -8190 -10133 -12734 -14288 -11465 -11116 -14541 -10041 -10727 -10355 -4079 -1836
15058 -1836 -2614 -6882 -10062 -10848 -7547 -10394 -6593 -2163 -959 1611 9018 11559 14530 17950 19938
15043 19938 18665 11294 3563 -78 -2799 -4882 -594 -10163 -16110 -15056 -9682 -7332 -11691 -8498
15029 -8498 -5010 -7463 -15741 -15380 -9860 -4992 -5676 -4125 -660 -5325 -7843 -4917 2094 7620 10958
15014 10958 7002 4404 1758 -3956 -8174 -14484 -11566 -6012 -5380 -5237 -10025 -21489 -20822 -13745 -13565
14999 -13565 -15311 -15985 -11831 -8669 -8614 -9036 -7264 -6565 -3346 430 -211 -2260 -2846 -9138 -16055 -22200
14983 -22200 -18418 -10048 -3252 -171 7746 12548 14722 17258 21673 14582 4305 -6842 -14645 -18431
14969 -18431 -12426 -3518 2743 11325 7973 2272 756 -552 -9420 -13292 -13611 -12001 -12535 -7125 -7111
$$ packed form
15073a6682j220j392Q359K745j943k601j554K823L49l425M500o86L72O276K243
15058a836p78m268l180p86L301k847L801M430J204K570P407K541K971L420J988
15043A9938j273p371p731l641k721k083M288r569n947J054N374K350m359L193
15029h498L488k453q278L61N520M868o84J551L465m665k518K926P011N526L338
15014A0958l956k598k646n714m218o310K918N554O32J43m788j1464O67P077J80
14999a3565j746o74M154L162N5m22J772O99L219L776o41k049n86o292o917o145
14983b2200L782Q370O796L081P917M802K174K536M415p091j0277j1147p803l786
14969a8431O005Q908O261Q582l352n701j516j308q868l872l19J610n34N410J4
$$ plain form
14954 -7111 -9514 -6060 -7683 -6851 -5366 -10683 -8301 -6827 -10113 -12081 -9483 -8611 -9809 -10016 -8601
14939 -8601 -4751 -2951 1138 -2768 -3465 5549 6984 161 -14509 -16394 -17662 -17121 -10078 -5801 -2140
14924 -2140 4253 1344 -731 -1374 -3454 783 1554 -3779 -8196 -11379 -12097 -11136 -10678 -10772 -10914 -9742 -8324
14907 -8324 -9480 -14916 -20390 -18582 -20600 -19186 -20171 -27341 -25348 -21136 -25952 -32187 -26896 -16998 -13978
14892 -13978 -14949 -13177 -14361 -15472 -16264 -16128 -16029 -14576 -13075 -13576 -12326 -10430 -11376 -18135 -22822 -17990
14876 -17990 -14904 -15058 -16290 -18061 -18201 -13439 -17707 -24778 -28089 -24218 -29180 -34589 -25846 -20853 -21964
14861 -21964 -21396 -18958 -11431 -6993 -12405 -18063 -13139 -12588 -15679 -17246 -14650 -13716 -15562 -17064 -11045
14846 -11045 -9575 -8379 -10045 -13153 -6532 2503 3698 2735 -3546 -13093 -12693 -8819 -10752 -9263 -11459
$$ packed form
14954g111k403L454j623Q32J485n317K382J474l286j968K598Q72j198k07J415
14939h601L850J800M089l906o97R014J435o823j4670j885j268N41P043M277L661
14924b140O393k909k075o43k080M237P71n333m417l183p18R61M58r4j42J172J418
14907h324j156n436n474J808k018J414r85p170J993M212m816o235N291R898L020
14892a3978r71J772j184j111p92J36R9J453J501n01J250J896r46o759m687M832
14876a7990L086j54j232j771j40M762m268p071l311L871m962n409Q743M993j111
14861b1964N68K438P527M438n412n658M924N51l091j567K596R34j846j502O019
14846a1045J470J196j666l108O621R035J195r63o281r547M00L874j933J489k196
$$ plain form
14831 -11459 -12150 -10392 -7078 -9151 -10596 -4593 -2001 -4511 -5940 -9680 -12783 -15036 -14357 -20514 -19285
14816 -19285 -17339 -11338 -12799 -10411 -2898 -2435 -4694 -3942 1141 4934 13314 13935 5396 1719 1704 -2880
14800 -2880 -7231 -13280 -15860 -14235 -18229 -24078 -19709 -16204 -17217 -14578 -12583 -9914 -5593 -12354 -16174
14785 -16174 -13691 -15472 -19331 -23048 -25262 -23074 -22852 -23775 -21674 -19342 -16195 -14167 -8242 -4053 -6731
14770 -6731 -11196 -18134 -17901 -9697 -8730 -7611 -8942 -5290 3274 1801 -3089 -2857 -427 -2242 -712
14755 -712 -242 -5623 -8688 -7998 -7805 -7228 -7153 -13774 -18918 -19337 -15002 -12351 -13612 -16762 -22919 -20617 -15264
14738 -15264 -22935 -18240 -24258 -21973 -17816 -15617 -16708 -15957 -15235 -17518 -23324 -25685 -27712 -22489 -17331
14723 -17331 -11902 -11135 -16381 -10643 -8477 -7772 -15390 -16422 -11711 -10105 -8372 -8560 -10539 -15371 -12358
$$ packed form
14831a1459o91J758L314k073j445O003K592k510j429l740l103k253O79o157J229
14816a9285J946O001j461K388P513M63k259P52N083L793Q380O21q539l677j5m584
14800b880m351o049k580J625l994n849M369L505j013K639J995K669M321o761l820
14785a6174K483j781l859l717k214K188K22r23K101K332L147K028N925M189k678
14770f731m465o938K33Q204R67J119j331L652Q564j473m890K32K430j815J530
14755g12M70n381l065O90J93N77P5o621n144m19M335K651j261l150o157K302N353
14738a5264p671M695o018K285M157K199j091P51P22k283n806k361k027N223N158
14723a7331N429P67n246N738K166P05p618j032M711J606J733j88j979m832L013
$$ plain form
14708 -12358 -5549 -5306 -13079 -11199 -7834 -9685 -11430 -8648 -12517 -15711 -16868 -17953 -18810 -20875 -21656
14693 -21656 -16836 -8689 -10819 -17563 -24087 -29571 -33875 -36424 -30476 -20954 -15169 -14397 -18544 -17742 -17618
14678 -17618 -17171 -6819 -4195 -2325 -11973 -18415 -20411 -25892 -21793 -18513 -24029 -22753 -21648 -12633
14664 -12633 -13644 -18864 -16032 -17174 -19802 -17063 -16881 -22052 -24133 -20126 -23681 -16914 -14414 -18298 -25963
14649 -25963 -25471 -23378 -16393 -14045 -15348 -17867 -17449 -16761 -11642 -8944 -9439 -18802 -20866 -20573 -23641 -22076
14633 -22076 -24518 -20591 -14754 -13213 -10331 -6952 -8796 -12137 -7920 -5970 -14344 -18665 -22445 -19410
14619 -19410 -18603 -18184 -10898 -8178 -7660 -5426 -6486 -12846 -19814 -21344 -19456 -15788 -11873 -17799 -16933
14604 -16933 -13160 -12065 -14953 -17085 -13652 -13562 -15858 -14209 -12553 -4810 -1404 -2157 -4511 -2124 31
$$ packed form
14708a2358O809K43p773J880L365j851j745K782l869l194j157j085q57k065p81
14693b1656M820Q147k130o744o524n484m304k549N948R522N785P72m147Q02J24
14678a7618M47J0352K624J870r648o442j996n481M099L280n516J276J105R015
14664a2633j011n220K832j142k628K739J82n171k081M007l555O767K500l884p665
14649b5963M92K093O985K348j303k519M18O88N119K698m95r363k064K93l068J565
14633b2076k442L927N837J541K882L379j844l341M217J950q374m321l780L035
14619a9410Q07M19P286K720N18K234j060o360o968j530J888L668L915n926Q66
14604a6933L773J095k888k132L433R0k296J649J656P743L406p53k354K387K155
$$ plain form
14589 31 -4335 -6727 -8463 -11836 -10223 -9721 -8087 -3275 -6240 -4788 -3111 -10550 -12374 -5485 -8890
14574 -8890 -9612 -11341 -11092 -145 724 -4393 -10872 -11955 -15739 -18257 -20120 -17934 -13496 -17954 -18048 -17713
14558 -17713 -19347 -18280 -23221 -29192 -27760 -26009 -29919 -29252 -23993 -21916 -20167 -20131 -13828 -4240 -6885
14543 -6885 -11623 -12512 -19446 -25061 -25734 -22928 -15540 -14020 -17419 -22650 -18146 -13876 -18764 -13637 -5870
14528 -5870 -8397 -8140 -15870 -17281 -14232 -5842 -5029 -11392 -11573 -15462 -17956 -13321 -10324 -11053 -19161 -20836
14512 -20836 -20608 -17542 -15240 -22748 -23837 -23795 -31128 -30239 -28145 -20879 -13436 -5168 -5233 -12217 -20187 -23492
14496 -23492 -22032 -19778 -18301 -17960 -20597 -21087 -13298 -11459 -10543 -10165 -12585 -10916 -9505 -12113 -12157 -13338
14480 -13338 -16687 -13508 -12113 -11778 -14381 -10586 -3808 4578 1532 -6643 -7154 -9753 -13281 -9232 -8217
$$ packed form
14589C1m366k392j736l373J613N02J634M812k965J452J677p439j824O889l405
14574h890p22j729K49J0947Q69n117o479j083l784k518j863K186M438m458r4L35
14558a7713j634J067m941n971J432J751l910O67N259K077J749L6O303R588k645
14543f885m738q89o934n615o73K806P388J520l399n231M504M270m888N127P767
14528e870k527K57p730j411L049Q390Q13o363j81l889k494M635K997p29q108j675
14512b0836K28L066K302p508j089M2p333Q89K094P266P443Q268o5o984p970l305
14496b3492J460K254J477L41k637m90P789J839R16L78k420J669J411k608m4j181
14480a3338l349L179J395L35k603L795O778Q386l046q175n11k599l528M049J015
$$ plain form
14465 -8217 -7779 -7439 -13371 -16311 -15961 -17112 -13621 -12215 -14734 -13776 -8782 -6625 -11147 -13492 -5183 -5386
14449 -5386 -9757 -16993 -17623 -21348 -21508 -15209 -9075 -5175 -11068 -15561 -18149 -19347 -16797 -15375 -7335
14434 -7335 -3769 994 870 -900 -2010 -4265 -8753 -10761 -5715 -734 -6015 -12635 -9446 -9126 -11314
14419 -11314 -12726 -6523 -4984 -5506 -9273 -2037 265 -4900 -7551 -12841 -22642 -22724 -13880 -11180 -12010
14404 -12010 -13434 -15047 -20156 -18714 -14313 -14436 -11486 -8351 -8008 -7832 -7329 -8419 -12302 -11841 -14629 -16092
14388 -16092 -15362 -16340 -13862 -12833 -11881 -10770 -16619 -20780 -16372 -14155 -12540 -13062 -19361 -21000 -22298
14373 -22298 -24402 -19241 -12762 -11169 -13819 -18589 -16926 -11061 -12552 -18522 -26251 -23578 -17451 -15025
14359 -15025 -21503 -26627 -27608 -22067 -17813 -19187 -16959 -17210 -22092 -20643 -21474 -21438 -18564 -17043 -16785 -10443
$$ packed form
14465h217M38L40n932k940L50j151L491J406k519R58M994K157m522k345Q309k03
14449e386m371p236o30l725j60O299O134L900n893m493k588j198K550J422Q040
14434g335L566M763j24j770j110k255m488k008N046M981n281o620L189L20k188
14419a1314j412O203J539n22l767P236K302n165k651n290r801q2Q844K700q30
14404a2010j424j613n109J442M401j23K950L135L43J76N03j090l883M61k788j463
14388a6092P30r78K478J029R52J111n849m161M408K217J615n22o299j639j298
14373b2298k104N161O479J593k650m770J663N865j491n970p729K673O127K426
14359a5025o478n124r81N541M254j374K228k51m882J449q31L6K874J521K58O342
$$ plain form
14343 -10443 -8887 -12369 -25414 -30746 -30775 -25412 -19723 -22106 -16304 -14234 -19671 -17192 -12055 -10087 -13887
14328 -13887 -11691 -11588 -13389 -16273 -13957 -12603 -10403 -12341 -9193 -2553 -354 2118 3221 12001 9195
14313 9195 8855 12557 11657 4116 798 600 -2434 -7345 -12576 -17561 -17812 -16405 -19914 -17798 -17460 -16883
14297 -16883 -11012 -5709 -3973 -12166 -16747 -15658 -15558 -15558 -15616 -17760 -14426 -16711 -26293 -20325 -10188 -4812
14281 -4812 -3609 -3797 -1738 -4787 -11014 -16366 -20735 -28353 -25362 -19339 -11136 -16629 -23545 -24685 -26995
14266 -26995 -28093 -24406 -20815 -20255 -15659 -17348 -19477 -19619 -18928 -20321 -17103 -13958 -16084 -10950 -8391
14251 -8391 -14492 -21079 -19212 -16855 -16421 -22097 -19116 -13141 -11859 -11797 -11933 -16413 -15150 -7118 -8230 -10128
14235 -10128 -15048 -19267 -18587 -14203 -13337 -11107 -8250 -2866 -5329 -13651 -17206 -15945 -11740 -8827 -9123
$$ packed form
14343a0443J556l482j3045n332k9N363N689k383N802K070n437K479N137J968l800
14328a3887K196J03j801k884K316J354K200j938L148O640K199K472J103Q780k806
14313I195l40L702r00p541l318j98l034m911n231m985k51J407l509K116L38N77
14297a6883N871N303J736q193m581J089J00%n8k144L334k285r582N968J0137N376
14281d812J203j88K059l049o227n352m369p618K991O023Q203n493o916j140k310
14266b6995j098L687L591N60M596j689k129j42O91j393L218L145k126N134K559
14251h391o101o587J867K357M34n676K981N975J282O2j36m480J263Q032j112j898
14235a0128m920m219O80M384Q66K230K857N384k463q322l555J261M205K913k96
$$ plain form
14220 -9123 -14269 -20891 -21312 -19709 -14685 -13599 -19922 -21204 -21082 -16788 -9715 -12535 -19584 -26290 -27814
14205 -27814 -24465 -14643 -723 2163 -4547 -10793 -12967 -21116 -24209 -19891 -13665 -12973 -18831 -21247
14191 -21247 -15111 -15212 -20261 -23873 -20066 -8454 -2656 -293 3773 2029 5444 2596 -4525 -3431
14177 -3431 -9300 -10275 -5453 -4854 -8517 -18249 -27917 -29128 -26246 -17665 -14031 -15817 -21306 -20019 -20293
14162 -20293 -17360 -13638 -7432 -7380 -8577 -8435 -7932 -4215 -1966 847 1164 1883 2834 629 -7195 -7576
14146 -7576 -5197 -6990 -10607 -16121 -11628 -8538 -3626 -4191 -13686 -11896 -16957 -20511 -17632 -16306 -17699
14131 -17699 -17651 -14959 -10643 -6351 -6574 -5922 -7264 -17150 -17542 -9828 -4512 -7493 -12854 -16775 -22610 -25002
14115 -25002 -22719 -22039 -17491 -11312 -13802 -17785 -18779 -13939 -9464 -4750 -6035 -7661 -8067 -11859 -17224
$$ packed form
14220i123n146o622m21J603N024J086o323j282J22M294P073k820p049o706j524
14205b7814L349R822J3920K886o710o246k174q149l093M318O226O92n858k416
14191b1247O136j01n049l612L807J1612N798K363M066j744L415k848p121J094
14177c431n869r75M822N99l663r732r668j211K882Q581L634j786n489J287k74
14162b0293K933L722O206N2j197J42N03L717K249K813L17P19R51k205p824l81
14146g576K379j793l617n514M493L090M912n65r495J790n061l554K879J326j393
14131a7699M8K692M316M292k23O52j342r886l92P714N316k981n361l921n835k392
14115b5002K283O80M548O179k490l983r94M840M475M714j285j626m06l792n365
$$ plain form
14100 -17224 -17758 -18672 -18460 -17307 -19294 -24916 -20245 -17832 -10210 -7407 -9290 -8764 -7757 -11760 -13592
14085 -13592 -14974 -15144 -11975 -10701 -11883 -12200 -11933 -11943 -16329 -17964 -16166 -14467 -20958 -25363 -22239 -22553
14069 -22553 -26962 -26937 -22622 -19550 -12127 -11682 -11820 -11212 -15317 -7499 -4519 -6793 -11113 -8173 -4849 -9621
14053 -9621 -11381 -2843 -1477 -2661 -6660 -5338 -3368 -2798 -4283 -3167 404 -1621 3550 2250 3073
14038 3073 4525 -1444 1187 8754 19212 24474 31926 34699 37956 42251 49522 65464 70912 68191
14024 68191 71217 68404 61340 56534 53886 41999 33524 36025 40431 39547 28062 18178 13736 11613
14010 11613 9642 7482 3579 -963 -6303 -10341 -9421 -9827 -11403 -4453 1147 7060 8423 4776 1554
13995 1554 689 861 -4552 -598 -2422 -2492 -2792 -2586 -8209 -10261 -7475 -5122 -1006 1010 286 495 -5314
$$ packed form
14100a7224n34r14K12J153j987n622M671K413P622K803j883N26J007m003j832
14085a3592j382j70L169J274j182l17K67j0m386j635J798J699o491m405L124l14
14069b2553m409K5M315L072P423M45j38O08m105P818K980k274m320K940L324m772
14053i621j760Q538J366j184l999J322J970N70j485J116L571k025N171j300Q23
14038C073J452n969K631P567J0458N262P452K773L257M295P271J5942N448k721
14024F8191L026k813p064m806k648j1887q475K501M406q84j1485r884m442k123
14010A1613j971k160l903m542n340m038R20m06j576O950N600N913J363l647l222
13995A554q65J72n413L954j824p0l00K06n623k052K786K353M116K016p24K09n809
$$ plain form
13978 -5314 -4676 -1300 712 -1272 -4587 -5512 -4311 -5753 -6245 -7522 -10543 -3585 -1460 268 1102 -4629
13962 -4629 -4839 -4848 -5251 -1928 172 3313 -872 -9908 -14303 -13862 -12681 -11330 -14990 -15574 -18270 -21057
13946 -21057 -19145 -15257 -13163 -6289 -6258 -4224 -5178 -3127 -5136 -7808 -12347 -17335 -16935 -16338 -21368 -13444
13930 -13444 -13449 -13754 -8138 -1826 3652 7398 5096 7956 5340 5270 1271 3986 4300 3482 4146 6542 6669
13913 6669 1132 -3288 -3384 -4219 -5003 -8200 -2623 -2584 -2977 -5563 -7181 -7402 -2721 -2590 -2379 -2863 -4347
13896 -4347 -9255 -12527 -9875 -5476 -4643 -4320 -7139 -9533 -6696 -1651 2288 2144 6550 5920 3307 8488
13880 8488 3060 -7925 -14550 -17739 -18481 -19183 -16210 -15001 -14360 -18562 -18642 -18642 -13533 -11034 -4990 -2560
13864 -2560 -2274 -850 -2155 -7687 -7053 -5956 -11543 -15246 -16384 -17149 -11103 -5079 -4278 -10867 -19962 -22650
$$ packed form
13978e314O38L376K012j984l315r25J201j442m92j277l021O958K125J728Q34n731
13962d629k10rm03L323K100L141m185r036m395M41J181J351l660n84k696k787
13946b1057J912L888K094O874L1K034r54K051k009k672m539m988M00N97n030P924
13930a3444nl05N616O312N478L746k302K860k616p0l999K715L14q18O64K396J27
13913F669n537m420r6q35p84l197N577L9l93k586j618k21M681J31K11m84j484
13896d347m908l272K652M399Q33L23k819k394K837N045L939j44M406o30k613N181
13880H488n428j0985o625l189p42p02K973J209O41m202q0%N109K499O044K430
13864b560K86J424j305n532O34J097n587l703j138p65O046O024Q01o589r095k688
$$ plain form
13848 -22650 -21340 -18696 -16308 -6420 -812 3493 5951 6018 8174 11913 8833 5956 -3858 -11777 -10986
13833 -10986 -13006 -17404 -14454 -9687 -9962 -9467 -9237 -6332 308 3822 2784 -1941 2860 7460 9811
13818 9811 13870 14852 16742 17572 14175 14348 24236 40076 52649 59680 62807 68137 63300 52242 47590
13803 47590 40655 29377 29124 28207 26889 16881 14157 17022 14405 8847 9032 -1129 3934 9791
13789 9791 8964 5994 6150 7848 9946 7656 11524 18359 23958 32397 33995 35777 33615 32582 36645
13774 36645 32701 32859 39920 43117 47603 46274 43817 42655 44728 43252 34460 27973 21537 19744 21045
13759 21045 11801 5395 6623 8107 8456 8509 8665 3979 2191 4426 9438 8209 12226 7083 1115
13744 1115 -3511 -11533 -13182 -8607 -1040 8432 7221 5622 6475 14083 21868 24498 21287 24632 34631
$$ packed form
13848b2650J310K644K388R888N608M305K458O7K156L739l080k877r814p919P91
13833a0986k020m398K950M767k75M95K30K905O640L514j038m725M801M600K351
13818I811M059R82J890Q30l397J73R888J5840J2573P031L127N330m837j1058m652
13803D7590o935j1278k53r17j318j0008k724K865k617n558J85j0161N063N857
13789I791q27k970J56J698K098k290L868O835N599Q439J598J782k162j033M063
13774C6645l944J58P061L197M486j329k457j162K073j476q792o487o436j793J301
13759B1045r244o406J228J484L49N3J56m686j788K235N012j229M017n143n968
13744A115m626q022j649M575P567R472j211j599Q53P608P785K630l211L345R999
$$ plain form
13729 34631 42777 46481 54055 57378 50840 49481 49465 59038 65786 63604 60358 61189 57503 56893 51348
13714 51348 39908 32924 23631 15113 18251 21647 14083 3415 257 1714 -727 -2373 -628 -4150
13700 -4150 -13221 -18769 -11779 -9918 -6744 578 2893 2495 -8174 -11668 -12319 -10588 -1518 4468 294
13685 294 -3927 -549 633 -1087 -6618 -4568 -7753 -12318 -7728 -3143 3809 6051 777 -6408 -11569
13670 -11569 -17450 -20354 -13126 -6535 -3914 -2654 -9587 -11710 -6620 -6842 -15459 -11591 -5792 -2380 -820
13655 -820 -2627 -7351 113 3807 1363 -3228 1483 3643 34 5190 3742 3994 9225 4333 4810
13640 4810 3618 3705 3826 -2165 -6321 -5591 -4521 -6678 -8806 -12005 -10369 -9560 -7766 -4417 3742 5645
13624 5645 2246 -3095 -963 -3188 -4617 -1839 1371 -160 4564 7231 6457 4910 -91 1904 3175
$$ packed form
13729C4631Q146L704P574L323o538j359j6R573O748k182l246Q31l686o10n545
13714E1348j1440o984r293q518L138L396p564j0668l158J457k441j646J745l522
13700d150r071n548O990J861L174P322K315l98j0669l494o51J731R070N986m174
13685B94m221L378J182j720n531K050l185m565M590M585O952K242n274p185n161
13670a1569n881k904P228O591K621J260o933k123N090k22q617L868N799L412J560
13655h20j807m724P464L694k444m591M711K160l609N156j448K52N231m892M77
13640D810j192Q7J21n991m156P30J070k157k128l199J636Q09J794L349Q159J903
13624E645l399n341K132k225j429K778L210j531M724K667p74j547n001J995J271
$$ plain form
13609 3175 -1751 -5977 -7844 -1072 -2063 -11065 -8877 -4418 -5386 -3376 -753 1177 4227 8660 10088
13594 10088 11018 14344 13211 10893 10896 4808 846 -1343 -3830 -6469 -6574 -3831 -1320 2334 8499 11028
13578 11028 5848 7600 5943 -594 -6306 -8567 -12930 -20163 -15006 -4819 -5898 -1253 8049 12387
13564 12387 12349 17118 13689 11124 9539 5117 -3233 -2587 -4212 -1504 -1886 3656 3412 1031 2015 3552
13548 3552 5064 11298 12792 10028 8778 9538 10123 1643 -8084 -10908 -13651 -13967 -6558 696 2871
13533 2871 7202 6949 -701 -7661 -12892 -21124 -22948 -22736 -16100 -5238 -2120 3576 7188 6586 -544
13518 -544 -4073 -4363 -5637 -5955 -5433 -5426 -2863 1940 3673 3134 5577 5433 3947 3186 6850 -3203 -7694
13501 -7694 -8116 -9433 -4346 -1930 -5913 -2861 -1496 1614 6479 3718 1954 -1096 -2887 -1006 -601
$$ packed form
13609C175m926m226j867O772r91r002K188M459r68K010K623J930L050M433J428
13594A0088R30L326j133k318Lo088l962k189k487k639j05K743K511L654O165K529
13578A1028n180J752j657o537n712k261m363p233N157J0187j079M645R302M338
13564A2387l8M769l429k565j585m422q350O46j625K708l82N542k44k381R84J537
13548C552J512O234J494k764j250P60N85q480r727k824k743l16P409P254K175
13533B871M331k53p650o960n231q232j824K12O636J0862L118N696L612o02p130
13518e44l529k90j274l18N22PK563M803J733n39K443j44j486p61L664j0053m491
13501g694m22j317N087K416l983L052J365L110M865k761j764l050j791J881M05
$$ plain form
13486 -601 -2710 -2013 7881 8779 12030 17160 20081 12720 13183 13462 12499 20968 33913 35821 33015 38850
13470 38850 51395 68374 73570 87119 110449 124418 130774 132436 125471 119640 118975 106243 92374
13457 92374 79060 64108 58255 48854 35623 29811 31136 27487 26751 26130 19370 10756 6626 -3634
13443 -3634 -7823 -9706 -10344 -5749 -5052 -7321 1754 4078 5296 1726 3915 2855 -2274 -3628 -2790
13428 -2790 -3549 -6619 -4316 -677 2408 3294 2882 2898 1735 5357 9885 6435 9699 17335 15086 10308
13412 10308 7715 5743 10788 12530 12124 10779 5822 4989 8743 12477 15240 11672 1077 791 6247
13397 6247 4073 571 2274 10627 18123 16904 17859 13425 8765 7281 2014 -4281 -3072 4575 -867
13382 -867 2249 6013 4133 8270 12925 9812 5639 3603 -828 -7061 -10444 -8742 -3786 -2060 442
$$ packed form
13486f01k109O97R894Q98L251N130K921p361M63K79r63Q469J2945J908k806N835
13470C8850J2545J6979N196J3549K3330J3969O356J662o965n831o65j2732j3869
13457I2374j3314j4952n853r401j3231n812J325l649p36o21o760q614m130j0260
13443c634m189j883o38M595O97k269R075K324J218l570K189j060n129j354Q38
13428b790p59l070K303L639L085Q86m12J6j163L622M528l450L264P636k249m778
13412A0308k593j972N045J742m06j345m957q33L754L734K763l568j0595k86N456
13397F247k174l502J703Q353P496j219R55m434m660j484n267o295J209P647n442
13382h67L116L764j880M137M655l113m173k036m431o233l383J702M956J726K502
$$ plain form
13367 442 6375 3063 3328 11225 10516 4092 6373 9101 14127 12393 11264 12786 15597 14419 16676
13352 16676 19575 19189 15372 14912 17527 11971 2359 -1077 440 4059 5432 6591 3487 1461 5128
13337 5128 7179 13624 11778 10002 13284 21186 27705 23478 18310 23970 22168 21637 27368 26923 32079
13322 32079 29719 17099 17724 22477 23012 25527 21015 25512 35778 39167 35852 27956 21495 14960
13308 14960 13871 16126 20307 21618 20529 26453 28075 22282 17571 19117 23709 25633 22664 22598 23129
13293 23129 21481 25050 25103 30328 34768 42639 46723 44630 48362 52762 50894 43580 36832 29015 29377
13278 29377 31960 34820 35933 45276 52527 59873 63899 67474 68496 62086 55090 43078 37336 38058
13264 38058 33545 27808 32206 34540 32405 25275 26368 27322 25581 23388 27218 35040 37885 41368 47681
$$ packed form
13367D42N933l312K65P897p09o424K281K728N026j734j129J522K811j178K257
13352A6676K899l86l817m60K615n556r612l436J517L619J373J159l104k026L667
13337E128K051O445j846j776L282P902O519m227n168N660j802n31N731m45N156
13322C2079k360j2620O25M753N35K515m512M497J0266L389l315p896o461o535
13308A4960j089K255M181J311j089N924J622n793m711J546M592J924k969o6N31
13293B3129j648L569N3N225M440P871M084k093L732M400j868p314o748p817L62
13278B9377K583K860J113R343P251P346M026L575J022o410o996j2012n742P22
13264C8058m513n737M398K334k135p130J093R54j741k193L830P822K845L483O313
$$ plain form
13249 47681 48813 46188 49755 50859 43956 41658 43042 42295 33891 30310 34866 37026 33545 41268 46587
13234 46587 45628 46673 41091 33389 29390 30001 32512 32235 31190 29982 29033 29419 29618 30829 33623 34317
13218 34317 34813 26649 13134 7266 9327 13455 13177 17823 19198 19308 19975 21932 26446 30572 32282
13203 32282 25378 26836 24213 19117 10658 12032 16781 22741 17454 11022 6120 7280 10673 10962 8641
13188 8641 9129 5745 9796 10882 15018 16051 10276 11840 12002 6057 3982 3840 4518 4027 -539 -383
13172 -383 -2402 -5409 2942 6948 14193 14964 18189 16977 16645 19518 14432 15487 19594 18737 14227 15182
13156 15182 13821 17193 14844 6872 1763 6394 7558 15177 24206 24731 25508 28004 25048 22369 21538
13141 21538 22542 14713 15251 14592 15442 11049 6905 -4785 -5756 929 9787 18238 28303 39700 44198
$$ packed form
13249D7681J132k625L567J104o903k298J384p47q404l581M556K160l481P723N319
13234D6587r59J045n582p702l999O11K511k77j045j208r49L86J99J211K794O94
13218C4317M96q164j3515n868K061M128k78M646J375J10O67J957M514M126J710
13203C2282o904J458k623n096q459J374M749N960n287o432m902J160L393K89k321
13188H641M88l384M051J086M136J033n775J564J62n945k075j42O78m91m566J56
13172c83k019l007Q351M006P245P71L225j212l32K873n086J055M107q57m510R55
13156A5182j361L372k349p972n109M631J164P619R029N25P77K496k956k679q31
13141B1538J004p829N38o59Q50m393m144j1690r71O685Q858Q451J0065J1397M498
$$ plain form
13126 44198 36573 25109 22621 22722 21990 17921 17879 21321 28832 40928 54050 58806 64488 68903 65185
13111 65185 59113 59523 55370 48755 43368 41033 41460 38998 40630 38788 32529 27977 33349 31123 27727
13096 27727 29200 26944 27460 26049 16644 11250 12125 13831 20791 21181 22287 23016 20511 14376 7117
13081 7117 3120 604 2771 5948 7770 9761 12738 12780 10502 5002 5056 9847 14941 16742 19100 10947
13065 10947 4010 3048 4503 6533 10346 8871 5531 3796 2845 2347 7889 7602 4555 3246 5756
13050 5756 8213 6544 5059 7492 6468 11352 14560 14606 10748 8226 7710 7634 11916 12577 8212 836
13034 836 3839 8255 10609 10690 8946 6642 6839 10558 12438 17700 16963 13136 15366 18911 23969 22958
13018 22958 20222 19203 21945 20245 14860 12092 10541 5530 821 1891 6174 9052 10660 8935
$$ packed form
13126D4198p625j1464k488J01p32m069m2L442P511J2096J3122M756N682M415l718
13111F5185o072M10m153o615n387k335M27k462J632j842o259m552N372k226l396
13096B7727J473k256N16j411r405n394Q75J706O960L90J106P29k505o135p259
13081G117l997k516K167L177J822J991K977M2k278n500N4M791N094J801K358q153
13065A0947o937r62J455K030L813j475l340j735r51m98N542k87l047j309K510
13050E756K457j669j485K433j024M884L208M6l858k522n16p6M282O61m365p376
13034H36L003M416K354Q1j744k304J97L719J880N262p37l827K230L545N058j011
13018B2958k736j019K742j700n385k768j551n011m709J070M283K878J608j725
$$ plain form
13004 8935 5838 9828 11106 17663 23816 27329 27543 21150 20185 16942 22773 26989 21040 19747 27744
12989 27744 28024 26168 25236 29616 32111 33811 31583 24442 28294 32757 38341 36853 32096 32664 35901
12974 35901 33167 28550 24321 26289 32557 31273 29941 32524 39175 38144 36150 37060 39761 37726 32903
12959 32903 30829 33809 40474 48361 51322 51106 47064 47150 52185 50956 49886 54840 64029 69450 71808
12944 71808 80115 85635 85985 96743 104273 106453 118903 130229 143831 155651 162839 170427 192108
12931 192108 224460 261315 310625 375713 442969 530263 620068 720922 828656 934153 1023820
12920 1023820 1092453 1137492 1160471 1150855 1109870 1042853 960977 866776 773802 683304 599447
12909 599447 520547 441204 381299 331234 295171 258734 222591 200986 187464 175480 166035 155037
$$ packed form
13004H935l097L990J278O557O153L513K14o393r65l243N831M216n949j293P997
12989B7744K80j856r32M380K495J700k228p141L852M463N584j488m757N68L237
12974C5901k734m617m229J968O268j284j332K583O651j031j994R10K701k035m823
12959C2903k074K980O665P887K961k16m042Q6N035j229j070M954R189N421K358
12944G1808Q307N520L50J0758P530K180J2450J1326J3602J1820P188P588K1681
12931A92108L2352L6855M9310O5088O7256Q7294Q9805J00854J07734J05497Q9667
12920A023820O8633M5039K2979r616m0985o7017q1876r4201r2974r0498q3857
12909E99447p8900p9343n9905n0065l6063l6437l6143k1605j3522j1984r445j0998
$$ plain form
12897 155037 139960 132694 129806 118670 104890 97392 92180 86727 75482 69488 62913 65262 63948
12884 63948 64058 64522 66733 64799 59818 56924 49951 38660 31367 29116 25626 21085 18598 12767 10528
12869 10528 10935 9692 12090 22112 27507 28802 28542 27633 30214 39337 45667 48635 54485 61482 65163
12854 65163 59400 57630 64885 67903 69297 70609 70149 63069 62703 73863 86716 98952 104224 106338
12840 106338 111708 118123 121594 126197 137835 151093 171066 184071 198883 221097 260001 301825
12828 301825 354701 412924 472871 544711 634819 721665 802179 872844 935154 972727 980747 965200
12816 965200 922434 856280 779284 696404 618411 546902 483626 422886 380166 353013 326379
12805 326379 306646 283422 266390 254321 238460 219740 204069 187130 174923 165205 152628 138927
$$ packed form
12897A55037j5077p266k888j1136j3780p498n212n453j1245n994o575K349j314
12884F3948J10M64K211j934m981k894o973j1291p293k251l490m541k487n831k239
12869A0528M07j243K398J0022N395J295k60r09K581R123O330K968N850O997L681
12854F5163n763j770P255L018J394J312m60p080l66J1160J2853J2236N272K114
12840A06338N370O415L471M603J1638J3258J9973J3005J4812K2214L8904M1824
12828C01825N2876N8223N9947P1840R0108Q6846Q0514P0665O2310L7573Q020j5547
12816I65200m2766o6154p6996q2880p7993p1509o3276o0740m2720k7153k6634
12805C26379j9733k3224j7032j2069j5861j8720j5671j6939j2207r718j2577j3701
$$ plain form
12793 138927 135979 132042 131424 123785 117380 113793 117514 115353 107451 103018 90035 90735 89388 84249
12779 84249 85002 89720 94162 103122 102948 98843 101828 98034 95853 94379 89209 86568 85499 85194 80637
12764 80637 80966 87826 92050 89066 87034 86751 77805 78976 83841 83801 87362 85469 78716 72380 68676
12749 68676 72405 77414 68864 58288 54833 56186 61173 64766 67472 73752 79954 84006 89070 93342
12735 93342 95114 97343 107821 115585 124202 133547 137722 142755 141453 144650 143663 140894 137090 137650 130419
12720 130419 115230 109977 99685 90228 88189 84166 79681 86956 86528 88187 91652 99240 109891 110872
12706 110872 111008 111466 112572 110928 111810 110218 110812 114840 121447 128463 136785 141388 152421 165240 179414
12691 179414 189662 200626 219653 241319 251583 255560 257936 256477 243405 223954 213014 201028
$$ packed form
12793A38927k948l937o18p639o405l587L721k161p902m433j2983P00j347n139
12779H4249P53M718M442Q960j74m105K985l794k181j474n170k641j069l05m557
12764H0637L29O860M224k984k032k83q946J171M865m0L561j893o753o336l704
12749F8676L729N009q550j0576l455J353M987L593K706O280O202M052N064M272
12735I3342J772K229J0478P764Q617R345M175N033j302L197r87k769l804N60p231
12720A30419j5189n253j0292r457k039m023m485P275m28J659L465P588J0651R81
12706A10872J36M58J106j644Q82j592N94M028O607P016Q322M603J1033J2819J4174
12691A79414J0248J0964J9027K1666J0264L977K376j459j3072j9451j0940j1986
$$ plain form
12679 201028 188157 176383 173512 168430 161390 159730 155138 159048 171711 182963 188422 197259 204227
12666 204227 209001 212864 219626 230814 246836 262907 274002 286945 296754 315362 328076 335485
12654 335485 343343 350727 360281 355446 342282 331638 320577 307408 294384 284701 285787 284517 277006
12641 277006 267229 253570 240384 229614 227551 219864 214095 209654 203995 197548 195122 199790 199904 198996
12627 198996 194264 193898 192752 189032 185128 196218 201202 206206 209864 212281 214769 221586 231282 238412
12613 238412 246811 248110 248144 247162 246766 239437 228089 226108 223191 218536 210929 203779 197366 195727 193562
12598 193562 192549 193977 193233 191456 192749 189733 183501 180949 176421 178794 181796 182077 184052 180753 180468
12583 180468 179851 166973 163112 158131 158919 158549 160916 165880 173222 174724 180526 177127 180661 195345
$$ packed form
12679B01028j2871j1774k871n082p040j660m592L910J2663J1252N459Q837O968
12666B04227M774L863O762J1188J6022J6071J1095J2943R809J8608J2714P409
12654C35485P858P384R554m835j3164j0644j1061j3169j3024r683J086j270p511
12641B77006r777j3659j3186j0770k063p687n769m441n659o447k426M668J14r08
12627A98996m732l66j146l720l904J1090M984N004L658K417K488O817R696P130
12613B38412Q399J299L4r82l96p329j1348j981k917m655p607p150o413j639k165
12598A93562j013J428p44j777J293l016o232k552m528K373L002K81J975l299k85
12583A80468o17j2878l861m981P88l70K367M964P342J502N802l399L534J4684
$$ plain form
12569 195345 210474 225310 241010 259929 276804 285035 292989 300689 318605 333984 353973 376711
12557 376711 404478 430639 450076 469390 479729 480459 469056 448402 432511 414546 395794 388968
12545 388968 386968 385919 381347 370227 362237 356128 350265 350292 356229 377130 400707 428815 455512
12532 455512 475604 492269 500783 508227 521454 539611 557016 576012 586753 596577 604785 610176
12520 610176 603887 589989 576038 558587 535061 518014 512309 512045 518426 528816 538687 545647 546509
12507 546509 545907 550084 556914 565546 577958 584477 592036 602182 625051 650000 673785 696020 714503
12494 714503 745345 769961 795740 819398 834272 842658 848792 861963 874243 884641 898610 916635
12482 916635 935433 953405 973086 996092 1014707 1027106 1038050 1053056 1066732 1085708 1103694
$$ packed form
12569A95345J5129J4836J5700J8919J6875Q231P954P700J7916J5379J9989K2738
12557C76711K7767K6161J9437J9314J0339P30j1403k0654j5891j7965j8752o826
12545C88968k000j049m572j1120p990o109n863K7N937K0901K3577K8108K6697
12532D55512K0092J6665Q514P444J3227J8157J7405J8996J0741R824Q208N391
12520F10176o289j3898j3951j7451k3526j7047n705k64O381J0390R871O960Q62
12507E46509o02M177O830Q632J2412O519P559J0146K2869K4949K3785K2235J8483
12494G14503L0842K4616K5779K3658J4874Q386O134J3171J2280J0398J3969J8025
12482I16635J8798J7972J9681K3006J8615J2399J0944J5006J3676J8976J7986
$$ plain form
12471 1103694 1130240 1161901 1190073 1225660 1255333 1284260 1319036 1362089 1409750 1458316 1510542
12460 1510542 1562806 1615590 1675468 1736599 1800115 1862173 1921286 1975302 2034218 2094570 2166306
12449 2166306 2246985 2335168 2435046 2535497 2644608 2775097 2919777 3065393 3224802 3398637
12439 3398637 3584207 3786128 4005414 4240974 4504071 4797186 5116698 5463205 5841657
12430 5841657 6258955 6729050 7265001 7869186 8562502 9361606 10280064 11341944 12568806
12421 12568806 13974537 15561114 17352685 19365928 21631449 24202413 27157603 30625083
12413 30625083 34796204 39912752 46289242 54277734 64215454 76322783 90561489 106531731
12405 106531731 123414049 140023901 154949456 166768057 174278250 176701718 173851525
$$ packed form
12471A103694K6546L1661K8172L5587K9673K8927L4776M3053M7661M8566N2226
12460A510542N2264N2784N9878O1131O3516O2058N9113N4016N8916O0352P1736
12449B166306Q0679Q8183R9878J00451J09111J30489J44680J45616J59409J73835
12439C398637J85570K01921K19286K35560K63097K93115L19512L46507L78452
12430E841657M17298M70095N35951O04185O93316P99104R18458J061880J226862
12421A2568806J405731J586577J791571K013243K265521K570964K955190L467480
12413C0625083M171121N116548O376490P988492R937720J2107329J4238706J5970242
12405A06531731J6882318J6609852J4925555J1818601P510193K423468k850193
$$ plain form
12398 173851525 166155962 154545468 140292871 124782768 109309409 94864906 82079309
12391 82079309 71192663 62138992 54670686 48486275 43300765 38869409 35007846 31590243
12383 31590243 28523663 25770400 23290800 21067676 19084027 17326058 15773774 14412308
12375 14412308 13205932 12149629 11227031 10411059 9692344 9059082 8493490 7985008 7528874
12366 7528874 7112886 6730995 6384820 6063642 5761849 5478353 5206472 4948411 4702570
12357 4702570 4470336 4243039 4033082 3841527 3651914 3464423 3289260 3132993 2988995
12348 2988995 2856671 2729589 2612372 2498782 2400634 2309318 2224512 2146514 2083065 2021748
12338 2021748 1968181 1924792 1886960 1848252 1822572 1804099 1794373 1792365 1822052 1868967 1922404 1982745
$$ packed form
12398A73851525p695563j1610494j4252597j5510103j5473359j4444503j2785597
12391H2079309j0886646r053671p468306o184411n185510m431356l861563l417603
12383C1590243l066580k753263k479600k223124j983649j757969j552284j361466
12375A4412308j206376j056303r22598q15972p18715o33262n65592n08482m56134
12366G528874m15988l81891l46175l21178l01793k83496k71881k58061k45841
12357D702570k32234k27297k09957j91555j89613j87491j75163j56267j43998
12348B988995j32324j27082j17217j13590r8148r1316q4806p7998o3449o1317
12338B021748n3567m3389l7832l8708k5680j8473r726k008K9687M6915N3437O0341
$$ plain form
12326 1982745 2052558 2119546 2171117 2200044 2205885 2174411 2104660 2008163 1896934 1779218 1659032
12315 1659032 1552190 1451847 1371338 1302144 1244949 1189772 1144790 1108802 1084249 1064420 1047686
12304 1047686 1036463 1025344 1013827 995228 974622 962843 954275 948053 940369 927909 929381 947903
12292 947903 979916 1024450 1077857 1128993 1182090 1212792 1218968 1205498 1170895 1128301 1093835 1070110
12280 1070110 1055967 1049130 1053925 1078426 1100590 1118408 1143050 1167517 1184488 1193703 1199495 1217076
12268 1217076 1231424 1255316 1285938 1314884 1340306 1373182 1408711 1454252 1511969 1584759 1673059
12257 1673059 1772668 1891720 2030225 2193589 2394462 2632080 2920852 3289829 3763000 4363471
12247 4363471 5099600 5990088 7049945 8291709 9709127 11281936 12955283 14631505
$$ packed form
12326A982745O9813O6988N1571K8927N841l1474o9751r6497j11229j17716j20186
12315A659032j06842j00343q0509o9194n7195n5177m4982l5988k4553j9829j6734
12304A047686j1223j1119j1517j8599k0606j1779q568o222p684j2460J472J8522
12292I47903L2013M4534N3407N1136N3097L0702O176j3470l4603m2594l4466k3725
12280A070110j4143o837M795K4501K2164J7818K4642K4467J6971R215N792J7581
12268A217076J4348K3892L0622K8946K5422L2876L5529M5541N7717P2790Q8300
12257A673059R9609J19052J38505J63364K00873K37618K88772L68977M73171O00471
12247D363471P36129Q90488J059857J241764J417418J572809J673347J676222
$$ plain form
12239 14631505 16162916 17387545 18158499 18381187 18025215 17128453 15810404 14227647 12536711
12230 12536711 10881310 9369566 8066829 6984479 6096527 5377253 4791369 4299572 3885285
12221 3885285 3535749 3230582 2954843 2711783 2502034 2310593 2139052 1989225 1849399
12212 1849399 1727315 1619888 1527200 1451216 1395824 1360744 1337537 1331518 1319889 1295359 1256462
12201 1256462 1198198 1131017 1052395 967999 891760 825269 771903 725033 685179 653810 622989
12190 622989 596035 568736 545748 517138 492799 470084 451054 436848 428013 421219 415961 410952
12178 410952 404772 397604 388897 383403 384894 384770 383032 383387 374508 363982 368666 375935 379526 385936
12164 385936 391042 392200 387720 382659 380913 372896 370733 361715 351548 343315 338201 330318 331700 331044
$$ packed form
12239A4631505J531411J224629P70954K22688l55972q96762j318049j582757j690936
12230A2536711j655401j511744j302737j082350q87952p19274n85884m91797m14287
12221C885285l49536l05167k75739k43060k09749j91441j71541j49827j39826
12212A849399j22084j07427r2688p5984n5392l5080k3207o019j1629k4530l8897
12201A256462n8264o7181p8622q4396p6239o6491n3366m6870l9854l1369l0821
12190F22989k6954k7299k2988k8610k4339k2715j9030j4206q835o794n258n009
12178D10952o180p168q707n494J491j24j738L55q879j0526M684P269L591O410
12164C85936N106J158m480n061j746q017k163r018j0167q233n114p883J382o56
$$ plain form
12150 331044 331111 330063 329508 329301 332622 334355 323310 312693 306403 296969 290041 284197 284426 279718 275479
12135 275479 274091 272855 267414 267714 270130 274832 272891 268409 257450 248165 244268 244723 249345 252681
12121 252681 247582 243406 246842 245657 239353 237646 236981 239905 246804 258009 266618 284167 291260 299626
12107 299626 305298 308630 305972 305082 303355 305004 308611 314632 336811 352076 358847 362407 350351 341662
12093 341662 337573 339725 335628 337301 344114 354487 369115 380022 386883 396511 405087 408889 412420
12080 412420 426797 434012 439616 445824 462174 482380 497694 515139 538444 569528 605301 645642
12068 645642 699108 757308 817893 906673 1022148 1171618 1362990 1595520 1848884 2112029
12058 2112029 2362779 2583052 2735351 2801402 2782966 2680059 2500863 2274327 2018412 1778283
$$ packed form
12150C31044O7j048n55k07L321J733j1045j0617o290r434o928n844K29m708m239
12135B75479j388j236n441L00K416M702j941m482j0959r285l897M55M622L336
12121B52681n099m176L436j185o304j707o65K924O899J1205Q609J7549P093Q366
12107B99626N672L332k658q90j727J649L607O021K2179J5265O771L560j2056q689
12093C41662m089K152m097J673O813J0373J4628J0907O861R628Q576L802L531
12080D12420J4377P215N604O208J6350K0206J5314J7445K3305L1084L5773M0341
12068F45642N3466N8200O0585Q8780J15475J49470J91372K32530K53364K63145
12058B112029K50750K20273J52299O6051j8436j02907j79196k26536k55915k40129
$$ plain form
12048 1778283 1558232 1368031 1209814 1082187 987683 908130 839969 792887 749383 707227
12038 707227 670907 635488 606140 583375 554108 535303 525863 513932 501757 500583 500528 495748 490277
12025 490277 478386 467288 464811 469378 462274 453949 447992 450385 451217 455993 460617 467482 467807 460564
12011 460564 458141 451759 439355 425766 413333 410506 406300 407945 415416 422517 424534 421150 420913 412042
11997 412042 408179 413739 415863 424492 432062 440536 453532 461545 476857 501395 530634 571925 626324
11984 626324 687913 752529 831576 918402 1007996 1103770 1194021 1265485 1302354 1309841 1299883 1257660
11972 1257660 1187258 1104820 1020356 950108 889998 840454 802559 772341 752548 750751 754891 764695
11960 764695 780774 790628 785014 769010 741291 711045 689897 679784 671318 668610 674970 681249 698852
$$ packed form
12048A778283k20051j90201j58217j27627r4504p9553o8161m7082m3504m2156
12038G07227l6320l5419k9348k2765k9267j8805r440j1931j2175j174n5m780n471
12025D90277j1891j1098k477M567p104q325n957K393Q32M776M624O865L25p243
12011D60564k423o382j2404j3589j2433k827m206J645P471P101K017l384k37q871
11997D12042l863N560K124Q629P570Q474J2996Q013J5312K4538K9239M1291N4399
11984F26324O1589O4616P9047Q6826Q9594R5774R0251P1464L6869P487r958m2223
11972A257660p0402q2438q4464p0248o0110m9544l7895l0218j9793j797M140R804
11960G64695J6079R854n614j6004k7719l0246k1148j0113q466k708O360O279J7603
$$ plain form
11947 698852 721519 750484 775425 804773 836325 861134 873668 878039 881078 886551 894192 921544
11935 921544 964374 1015652 1084429 1170920 1271512 1389202 1524718 1671494 1825166 1963917
11925 1963917 2066777 2131406 2161525 2151807 2124799 2096868 2084931 2090552 2106738 2128724 2154915
11914 2154915 2179583 2216324 2286426 2426513 2645818 2960306 3359681 3827514 4328972 4821690
11904 4821690 5246358 5545496 5687680 5653594 5460215 5127621 4707853 4262283 3842768 3488860
11894 3488860 3226178 3055831 2975602 2972541 3049452 3198173 3411412 3681921 3999610 4333948
11884 4333948 4649744 4922430 5150800 5333502 5501916 5708572 5998430 6387816 6884758
11875 6884758 7461212 8068639 8635980 9120673 9514847 9830929 10079643 10286199 10477150
$$ packed form
11947F98852K2667K8965K4941K9348L1552K4809J2534M371L039N473P641K7352
11935I21544M2830N1278O8777Q6491J00592J17690J35516J46776J53672J38751
11925A963917J02860O4629L0119r718k7008k7931j1937N621J6186K1986K6191
11914B154915K4668L6741P0102J40087K19305L14488L99375M67833N01458M92718
11904D821690M24668K99138J42184l4086j93379l32594m19768m45570m19515l53908
11894C488860k62682j70347q0229l061P6911J48721K13239K70509L17689L34338
11884D333948L15796K72686K28370J82702J68414K06656K89858L89386M96942
11875F884758N76454O07427N67341M84693L94174L16082K48714K06556J90951
$$ plain form
11866 10477150 10689817 10989776 11437881 12070169 12944417 14116288 15706836 17911574 21009483
11857 21009483 25372675 31406442 39421296 49431949 60802675 71931849 80453955 84236220
11849 84236220 82482093 76140068 67423347 58745751 51775755 47082047 44419909 43210223
11841 43210223 42995504 43544978 44788113 46686005 49064001 51525100 53585647 54897109
11833 54897109 55446284 55553240 55655471 56147686 57271727 59147126 61723515 64650417 67309701
11824 67309701 69069939 69561178 68894652 67630001 66571172 66453893 67780868 70840563
11816 70840563 75866982 83350937 94241692 109858121 131206313 157530088 185056897
11809 185056897 207497523 218743896 215809632 200078475 176397111 150783890 128037513
$$ packed form
11866A0477150K12667K99959M48105O32288Q74248J171871J590548K204738L097909
11857B1009483M363192O033767Q014854J0010653J1370726J1129174Q522106L782265
11849H4236220j754127o342025q716721q677596o969996m693708k662138j209686
11841D3210223k14719N49474J243135J897892K377996K461099K060547J311462
11833E4897109N49175J06956J02231M92215J124041J875399K576389K926902K659284
11824F7309701J760238M91239o66526j264651j058829j17279J326975L059695
11816G0840563N026419P483955J0890755J5616429K1348192K6323775K7526809
11809A85056897K2440626J1246373k934264j5731157k3681364k5613221k2746377
$$ plain form
11802 128037513 110396833 97877535 89446173 84027217 80882515 79516216 79460835 80068110
11794 80068110 80461925 79829942 77772942 74489115 70631545 66964249 64023621 62022181
11786 62022181 60915627 60465950 60302630 59935913 58912435 57024234 54434368 51607236
11778 51607236 49106995 47372707 46584346 46718737 47729412 49712355 53052954 58328678
11770 58328678 65967628 75561630 85381039 92742274 95155791 91595534 82884406 71181680
11762 71181680 58962061 48078346 39419531 33028871 28500000 25322229 23032042 21263936
11754 21263936 19815674 18577220 17520800 16648479 15921666 15323206 14804345 14323142 13842566
11745 13842566 13310486 12705314 12014278 11241640 10442591 9677126 9002956 8443349 7995193
$$ packed form
11802A28037513j7640680j2519298q431362n418956l144702j366299n5381O07275
11794H0068110L93815o31983k057000l283827l857570l667296k940628k001440
11786F2022181j106554m49677j63320l66717j023478j888201k589866k827132
11778E1607236k500241j734288p88361J34391J010675J982943L340599N275724
11770E8328678P638950R594002R819409P361235K413517l560257q711128j1702726
11762G1181680j2219619j0883715q658815o390660m528871l177771k290187j768106
11754B1263936j448262j238454j056420q72321p26813n98460n18861m81203m80576
11745A3842566n32080o05172o91036p72638p99049p65465o74170n59607m48156
$$ plain form
11736 7995193 7628318 7290173 6934841 6533060 6084359 5608293 5121653 4663159 4258045
11727 4258045 3921063 3652149 3435336 3263381 3138915 3041713 2961651 2896938 2840475 2800246
11717 2800246 2779254 2781674 2800159 2833234 2871749 2900068 2906750 2882003 2811191 2710550 2590999
11706 2590999 2471639 2370383 2301805 2255004 2232723 2227737 2226248 2240727 2288473 2371744 2468928
11695 2468928 2561011 2624366 2620539 2550525 2422672 2247964 2055660 1845643 1646498 1485261
11685 1485261 1368044 1298144 1270289 1258810 1246749 1235164 1215142 1184651 1155981 1127754 1101717
11674 1101717 1073951 1041281 1001455 957127 921193 896213 880832 852674 820547 783581 748226
11663 748226 706910 669403 639165 615825 603973 605331 614924 620168 633745 649337 652796 641916
$$ packed form
11736G995193l66875l38145l55332m01781m48701m76066m86640m58494m05114
11727D258045l36982k68914k16813j71955j24466r7202q0062o4713n6463m0229
11717B800246k0992K420J8485L3075L8515K8319O682k4747p0812j00641j19551
11706B590999j19360j01256o8578m6801k2281m986j489J4479M7746Q3271R7184
11695B468928R2083O3355l827p0014j27853j74708j92304k10017j99145j61237
11685A485261j17217o9900k7855j1479j2061j1585k0022l0491k8670k8227k6037
11674A101717k7766l2670l9826m4328l5934k4980j5381k8158l2127l6966l5355
11663G48226m1316l7507l0238k3340j1852J358R593N244J3577J5592L459j0880
$$ plain form
11651 641916 622111 596369 573859 551224 519963 497800 486202 481253 486339 506995 528081 542192
11639 542192 551670 556535 552044 538893 525728 513579 500997 494925 495044 493825 491185 488366 482527
11626 482527 472398 460165 447812 447960 457625 468343 480154 482138 487212 494120 505663 524624 555191
11613 555191 603494 663818 710053 739427 746051 732575 712800 690690 668240 648525 624766 600497
11601 600497 580426 555491 535681 524060 523254 521871 520734 519880 524890 527874 524639 527578 540305
11588 540305 556907 586272 611327 629770 639717 643180 636421 629168 633007 634938 642957 658484 686149
11575 686149 716300 752942 796861 857854 937376 1026146 1108731 1151072 1150872 1111116 1042485 970162
11563 970162 908548 859513 826163 794201 765555 741357 718841 701259 698804 684771 667923 651299
$$ packed form
11651F41916j9805k5742k2510k2635l1261k2163j1598m949N086K0656K1086J4111
11639E42192R478M865m491j3151j3165j2149j2582o072J19j219k640k819n839
11626D82527j0129j2233j2353J48R665J0718J1811J984N074O908J1543J8961L0567
11613E55191M8303O0324M6235K9374O624j3476j9775k2110k2450j9715k3759k4269
11601F00497k0071k4935j9810j1621q06j383j137q54N010K984l235K939J2727
11588E40305J6602K9365K5055J8443R947L463o759p253L839J931Q019J5527K7665
11575F86149L0151L6642M3919O0993P9522Q8770Q2585M2341k00l9756o8631p2323
11563I70162o1614m9035l3350l1962k8646k4198k2516j7582k455j4033j6848j6624
$$ plain form
11551 651299 628908 597434 571214 537666 512847 498161 491341 485439 480070 468927 453579 434693
11539 434693 421045 412110 409736 418402 434548 448055 468519 488933 505859 519746 529791 536646
11527 536646 542391 534998 510742 482843 446880 408864 384583 364179 351614 341615 336136 326031
11515 326031 310604 294255 286277 279685 270238 262552 262765 256639 246263 238491 224287 212685 207270
11502 207270 215718 221553 215168 209735 209115 212594 205851 201645 201432 197827 190014 182203 170846 168469
11488 168469 164858 161017 157261 155372 157918 163693 171177 171258 164143 159349 146781 138872 136243 138929
11474 138929 142583 142591 145913 148235 148764 150250 159599 163245 167165 170871 167377 163349 151725 146295 150253
11459 150253 155524 153014 151778 149985 147374 142858 136960 134252 139276 149477 159300 168985 175243 176957
$$ packed form
11551F51299k2391l1474k6220l3548k4819j4686o820n902n369j1143j5348j8886
11539D34693j3648q935k374Q666J6146J3507K0464K0414J6926J3887J0045O855
11527E36646N745p393k4256k7899l5963l8016k4281k0404j2565r999n479j0105
11515C26031j5427j6349p978o592r447p686K13o126j0376p772j4204j1602n415
11502B07270Q448N835o385n433o20L479o743m206k13l605p813p811j1357k377
11488A68469l611l841l756j889K546N775P484Q1p115m794j2568p909k629K686
11474A38929L654QL322K322N29J486R349L646L920L706l494m028j1624n430L958
11459A50253N271k510j236j793k611m516n898k708N024J0201R823R685O258J714
$$ plain form
11445 176957 177440 179943 179429 171331 166085 162632 161379 158607 160002 159010 154723 149517 152758 157156 161838
11430 161838 169919 177574 184728 189569 196365 208973 217105 226187 238574 265064 289260 308829 321147
11417 321147 317352 311801 307504 309293 327032 352804 388771 431004 478573 522002 552125 566597
11405 566597 566329 544440 513386 476059 445523 433096 431793 433971 443231 451202 458187 466978 474579
11392 474579 477846 480445 492361 517592 544290 574333 607886 644655 687611 727420 767638 804911
11380 804911 836006 876398 927479 976879 1034174 1105251 1194298 1302831 1437453 1600652 1803897
11369 1803897 2061004 2373986 2752851 3212143 3755579 4405951 5187833 6142920 7320547
11360 7320547 8668750 10011498 11041653 11460055 11126283 10153063 8816283 7409693 6147058
$$ packed form
11445A76957M83K503n14q098n246l453j253k772J395r92m287n206L241M398M682
11430A61838Q081P655P154M841O796J2608Q132R082J2387K6490K4196J9569J2318
11417C21147l795n551m297J789J7739K5772L5967M2233M7569M3429L0123J4472
11405E66597k68k1889l1054l7327l0536j2427j303K178R260P971O985Q791P601
11392D74579L267K599J1916K5231K6698L0043L3553L6769M2956L9809M0218L7273
11380H04911L1095M0392N1081M9400N7295P1077Q9047J08533J34622J63199K03245
11369A803897K57107L12982L78865M59292N43436O50372P81882R55087J177627
11360G320547J348203J342748J030155M18402l33772r73220j336780j406590j262635
$$ plain form
11351 6147058 5117626 4318085 3717404 3264845 2914991 2635827 2404129 2193406 1992779
11342 1992779 1818045 1661617 1520407 1392357 1286620 1197357 1125628 1061694 1011410 961077
11332 961077 917790 874202 828772 793157 775864 776114 794037 817255 839993 850441 833749 800488
11320 800488 750149 683985 611964 542577 495177 454968 421573 390039 362997 341955 324653
11309 324653 306342 288589 274213 262436 253584 251251 237929 225112 222759 219138 210571 213664 213047
11296 213047 203485 196807 192410 189750 184295 184836 186752 184965 187366 198161 204620 209421 214265 216259
11282 216259 218033 217978 215400 207272 200579 195392 183945 177033 171984 168598 163012 181607 197748 192023
11268 192023 182085 169094 152862 135659 125782 119611 116564 114930 115000 123597 135489 143631 146171 142480
$$ packed form
11351F147058j029432p99541o00681m52559l49854k79164k31698k10723k00627
11342A992779j74734j56428j41210j28050j05737q9263p1729o3934n0284n0333
11332I61077m3287m3588m5430l5615j7293K50J7923K3218K2738J0448j6692l3261
11320H00488n0339o6164p2021o9387m7400m0209l3395l1534k7042k1042j7302
11309C24653j8311j7753j4376j1777q852k333j3322j2817k353l621q567L093o17
11296B13047r562o678m397k660n455N41J916j787K401J0795O459M801M844J994
11282B16259J774n5k578q128o693n187j1447o912n049l386n586J8595J6141n725
11268A92023r938j2991j6232j7203r877o171l047j634P0Q597J1892Q142K540l691
$$ plain form
11254 142480 140391 133351 118427 106492 95299 91399 90551 92945 95088 92275 90675 90558 86697 86254
11240 86254 87996 82607 77595 75588 79565 85367 80264 77988 74719 72578 76696 81605 85483 94499
11226 94499 97082 101048 93721 83878 79167 78098 82200 84302 85512 86849 86128 82912 66009 53810
11212 53810 55222 58270 57185 64167 71766 76518 76484 77182 84211 91729 91004 86795 89781 87752 86610
11197 86610 79630 69828 66311 62831 57890 55599 59423 60631 63298 65626 70139 78597 75541 66709
11183 66709 67421 79053 91231 103570 114036 117260 114865 107152 99343 95437 94342 91518 83151 78229
11169 78229 70987 64429 65330 55707 47307 46676 58948 65060 67143 68596 70708 73154 72191 70421 65266
11154 65266 61565 55600 44001 48393 50605 53859 45347 36331 34608 39551 43044 46942 55490 64084
$$ packed form
11254A42480k089p040j4924j1935j1193l900q48K394K143k813j600j17l861m43
11240H6254J742n389n012k007L977N802n103k276l269k141M118M909L878R016
11226I4499K583L966p327r843m711j069M102K102J210J337p21l216j6903j2199
11212E3810J412L048j085O982P599M752l4O98P029P518p25m209K986k029j142
11197H6610o980r802l517l480m941k291L824J208K667K328M513Q458l056q832
11183F6709P12J1632J2178J2339J0466L224k395p713p809l906j095k824q367m922
11169G8229p242o558R01r623q400o31J2272O112K083J453K112K446r63j770n155
11154F5266l701n965j1599M392K212L254q512r016j723M943L493L898Q548Q594
$$ plain form
11140 64084 68435 73117 71562 77322 79447 74077 69983 68223 69761 67174 65058 76020 82064 84901
11126 84901 80603 75317 71854 70177 75272 78415 79274 88447 92935 87298 85050 73015 70298 69770 69683
11111 69683 75011 81309 84383 85187 83139 77240 69783 67994 66003 69187 72388 85665 99281 110405
11097 110405 115054 116927 118332 124308 128467 124355 120710 117691 104064 88860 87349 92121 102404
11084 102404 112507 113939 110777 106042 99091 92306 87192 82721 80714 86523 89728 86962 86793 80039
11070 80039 79540 74376 70998 76763 83292 89983 92096 90067 88036 89310 88750 95164 101384 116643 128129
11055 128129 137340 138454 136476 135187 137736 139413 134900 126294 122348 119498 114849 107866 98994 94629
11041 94629 92776 85690 85590 90176 95222 101825 110355 114698 114319 110040 113570 115870 111854 104903 101265
$$ packed form
11140F4084M351M682j555N760K125n370m094j760J538k587k116J0962O044K837
11126H4901m298n286l463j677N095L143Q59R173M488n637k248j2035k717n28q7
11111F9683N328O298L074Q04k048n899p457j789j991L184L201J3277J3616J1124
11097A10405M649J873J405N976M159m112l645l019j3627j5204j511M772J0283
11084A02404J0103J432l162m735o951o785n114m471k007N809L205k766j69o754
11070H0039m99n164l378N765O529O691K113k029k031J274n60O414O220J5259J1486
11055A28129R211J114j978j289K549J677m513q606l946k850m649o983q872m365
11041I4629j853p086j00M586N046O603Q530M343l79m279L530K300m016o951l638
$$ plain form
11026 101265 104257 103634 98941 90347 94389 98829 97976 100841 102942 103884 107391 113550 106597 100865 97479
11011 97479 99064 101304 105298 105670 103844 107403 109821 105054 102587 96387 91808 91500 93328 93713 93209
10996 93209 92270 96548 106349 110494 115619 111961 105382 104810 109997 112276 112707 117984 123299 126336 123631
10981 123631 113823 115304 115763 115076 123364 126859 130209 133572 129273 125114 117039 107212 96801 95043
10967 95043 86254 79054 81320 80724 84628 87618 86385 75400 66222 59389 57798 60093 70492 78017
10953 78017 85345 92772 105725 107389 111651 119743 127917 140394 154696 170309 197172 231257 270690
10940 270690 323635 386128 440274 467831 464133 437785 399361 356525 322559 294165 274085 263647
10928 263647 266566 267029 273824 285848 292279 301884 317607 333664 362675 399627 440845 494069 561428
$$ packed form
11026A01265K992o23m693q594M042M440q53K865K101R42L507O159o953n732l386
11011I7479J585K240L994L72j826L559K418m767k467o200m579l08J828L85n04
10996I3209r39M278R801M145N125l658o579n72N187K279M31N277N315L037k705
10981A23631r808J481M59o87Q288L495L350L363m299m159q075r827j0411j758
10967I5043q789p200K266n96L904K990j233j0985r178o833j591K295J0399P525
10953G8017P328P427J2953J664M262Q092Q174J2477J4302J5613K6863L4085L9433
10940B70690N2945O2493N4146K7557l698k6348l8424m2836l3966k8394k0080j0438
10928B63647K919M63O795J2024O431R605J5723J6057K9011L6952M1218N3224O7359
$$ plain form
10915 561428 647601 747907 873039 1034203 1238911 1465475 1679637 1843293 1922253 1893400
10905 1893400 1771604 1575791 1351743 1148794 977857 840021 741049 666356 607265 553637
10895 553637 504336 464095 428436 400747 379168 357403 334894 317381 298971 283990 266903
10884 266903 254287 247201 235726 224615 218752 211297 205039 200170 205312 200558 197316 196159 189282
10871 189282 180249 174162 166620 162009 159089 154336 157336 157057 145832 151939 160589 159245 157182 154269
10857 154269 149283 150875 154304 156015 152356 145418 148552 152431 151927 146983 148830 149757 145167 138960 136254
10842 136254 140520 138569 133769 128503 123241 121377 118330 114637 105972 98070 98256 97086 90973 98530
10828 98530 113020 122076 128758 143474 145207 154345 168468 185697 199224 201325 193287 188182 175860
$$ packed form
10915E61428Q6173J00306J25132J61164K04708K26564K14162J63656P8960k8853
10905A893400j21796j95813k24048k02949j70937j37836r8972p4693n9091n3628
10895E53637m9301m0241l5659k7689k1579k1765k2509j7513j8410j4981j7087
10884B66903j2616p086j1475j1111n863p455o258m869N142m754l242j157o877
10871A89282r033o087p542m611k920m753L000k79j1225O107Q650j344k063k913
10857A54269m986J592L429J711l659o938L134L879n04m944J847R27m590o207k706
10842A36254M266j951m800n266n262j864l047l693q665p902J86j170o113P557
10828I8530J4490R056O682J4716J733R138J4123J7229J3527K101q038n105j2322
$$ plain form
10815 175860 170020 162758 153609 152790 147539 144475 146101 145243 145429 145738 153718 159039 163979 166304 168511
10800 168511 168166 167945 170031 169317 170119 169886 177006 187865 203688 212114 214594 213507 207929 205519 204992
10785 204992 204792 205726 209918 217181 226934 224192 215659 216668 215205 211716 214515 217598 221229 228469 230530
10770 230530 230037 230325 226358 218904 222529 228145 233728 243216 249194 263130 275741 277349 282380 288288
10756 288288 289398 297487 312797 326550 342427 354519 369930 386160 398933 411057 422758 437804
10744 437804 441330 454493 463656 464619 465576 459244 443896 430059 407094 385032 364298 352856 339248
10731 339248 316911 298373 289029 287530 275172 267019 269196 271909 268346 264687 262031 262976 258394 251070
10717 251070 256339 258833 258197 260553 260973 270899 287060 309620 331225 342502 349267 343664 339455 336050
$$ packed form
10815A75860n840p262r149q19n251l064J626q58J86L09P980N321M940K325K207
10800A68511l45k21K086p14Q02k33P120J0859J5823Q426K480j087n578k410n27
10785B04992k00R34M192P263R753k742q533J009j463l489K799L083L631P240K061
10770B30530m93K88l967p454L625N616N583R488N978J3936J2611J608N031N908
10756B88288J110Q089J5310J3753J5877J2092J5411J6230J2773J2124J1701J5046
10744D37804L526J3163R163R63R57o332j5348j3837k2965k2062k0734j1442j3608
10731C39248k2337j8538r344j499j2358q153K177K713l563l659k656R45m582p324
10717B51070N269K494o36K356M20R926J6161K2560K1605J1277O765n603m209l405
$$ plain form
10703 336050 341587 341565 341772 335557 325250 323331 316001 308806 304939 296842 294864 288501 282023 276881 276559
10688 276559 272442 267883 267252 262699 257150 251689 246187 243258 239896 234078 225199 225558 232545 241362 245406
10673 245406 252429 246810 239534 231105 232061 223587 217763 217982 224032 228047 228818 233433 244295 257876
10659 257876 257038 259250 272354 280904 283986 287527 295994 304182 311653 314429 316109 319643 326117 338818
10645 338818 355770 371606 394618 426454 447454 454515 462405 463621 462587 458728 452305 442704 434227
10632 434227 430260 421353 415616 413392 406469 404930 412585 426248 436079 441218 442008 447184 458017 469820
10618 469820 487694 510113 540672 570874 606677 633420 657345 670453 682782 692521 692993 685074
10606 685074 674264 672553 670099 674835 685600 701251 719339 735237 741626 750012 755656 761055 764488
$$ packed form
10703C36050N537k2K07o215j0307j919p330p195l867q097j978o363o478n142l22
10688B76559m117m559o31m553n549n461n502k929l362n818q879L59O987Q817M044
10673B45406P023n619p276q429R56q474n824K19O050M015P71M615J0862J3581
10659B57876q38K212J3104Q550L082L541Q467Q188P471K776J680L534O474J2701
10645C38818J6952J5836K3012L1836K1000P061P890J216j034l859o423r601q477
10632D34227l967q907n737k224o923j539P655J3663R831N139P90N176J0833J1803
10618D69820J7874K2419L0559L0202L5803K6743K3925J3108J2329R739M72p919
10606F85074j0810j711k454M736J0765J5651J8088J5898O389Q386N644N399L433
$$ plain form
10593 764488 768161 773392 780160 778108 780858 791201 814856 845907 879489 910896 942853 974883
10581 974883 1002258 1023675 1052157 1087866 1122878 1159382 1202791 1232399 1259714 1278796 1306755
10570 1306755 1342873 1385333 1425783 1460055 1496765 1535806 1563071 1587103 1602247 1631691 1679239
10559 1679239 1734790 1799684 1876520 1944350 1996475 2045975 2093910 2142984 2194166 2249028 2305895
10548 2305895 2372862 2451142 2540508 2630923 2726870 2811642 2884317 2939647 2991622 3058464 3145085
10537 3145085 3254208 3388497 3545907 3716307 3897339 4085971 4285974 4506164 4738683
10528 4738683 4992904 5264249 5552083 5864247 6198215 6558744 6963709 7421897 7921355
10519 7921355 8464123 9058770 9723218 10485238 11346459 12315676 13409247 14650727 16074708
$$ packed form
10593G64488L673N231O768k052K750J0343K3655L1051L3582L1407L1957L2030
10581I74883K7375K1417K8482L5709L5012L6504M3409K9608K7315J9082K7959
10570A306755L6118M2460M0450L4272L6710L9041K7265K4032J5144K9444M7548
10559A679239N5551O4894P6836O7830N2125M9500M7935M9074N1182N4862N6867
10548B305895O6967P8280Q9366R0415R5947Q4772P2675N5330N1975O6842Q6621
10537C145085J09123J34289J57410J70400J81032J88632K00003K20190K32519
10528D738683K54221K71345K87834L12164L33968L60529M04965M58188M99458
10519G921355N42768N94647O64448P62020Q61221R69217J093571J241480J423981
$$ plain form
10510 16074708 17708949 19574563 21673741 23994568 26553409 29424594 32737522 36698562
10502 36698562 41565139 47663976 55394072 65270745 77963194 94294023 115274413 142022377
10494 142022377 175357800 214865529 257462294 296637239 324002151 333131194 322484395
10487 322484395 295495031 258867175 219952199 184185841 154104086 129999432 111016361
10480 111016361 95984345 83846459 73781396 65243265 57931481 51680270 46351422
10473 46351422 41814000 37901079 34464258 31382840 28592585 26060444 23781223 21747282
10465 21747282 19958943 18403243 17051861 15884305 14849324 13905542 13035922 12227636
10457 12227636 11493235 10827553 10228650 9698946 9207460 8752596 8321026 7916040 7526434
$$ packed form
10510A6074708J634241J865614K099178K320827K558841K871185L312928L961040
10502C6698562M866577O098837P730096R876673J2692449J6330829K0980390K6747964
10494A42022377L3335423L9507729M2596765L9174945K7364912R129043j0646799
10487C22484395k6989364l6627856l8914976l5766358l0081755k4104654j8983071
10480A11016361j5032016j2137886j0065063q538131p311784o251211n328848
10473D6351422m537422l912921l436821l081418k790255k532141k279221k033941
10465B1747282j788339j555700j351382j167556j034981r43782q69620q08286
10457A2227636p34401o65682n98903n29704m91486m54864m31570m04986l89606
$$ plain form
10448 7526434 7152026 6820041 6523327 6252186 6000826 5779149 5586834 5431561 5326869
10439 5326869 5291058 5343398 5474068 5635977 5725174 5660898 5417390 5036387 4599579 4166951
10429 4166951 3792878 3478376 3223847 3019259 2852149 2708937 2585785 2465957 2359385
10420 2359385 2262182 2171907 2081647 1993290 1911730 1832903 1757896 1688061 1625559 1567715 1512404
10409 1512404 1458586 1414855 1373331 1335358 1298208 1262860 1236083 1216835 1188673 1166286 1149333
10398 1149333 1131469 1113216 1090868 1075977 1064909 1060595 1061534 1061410 1052890 1037281 1015240 991946
10386 991946 964233 934238 910257 884160 857763 830570 803907 785422 776990 773373 771064 768654
10374 768654 762029 749018 724645 697950 672539 653096 635487 639202 671832 729930 786658 832885
$$ packed form
10448G526434l74408l31985k96714k71141k51360k21677j92315j55273j04692
10439E326869l5811N2340J30670J61909Q9197o4276k43508l81003m36808m32628
10429D166951l74073l14502k54529k04588j67110j43212j23152j19828j06572
10420B359385r7203r0275r0260q8357q1560p8827p5007o9835o2502n7844n5311
10409A512404n3818m3731m1524l7973l7150l5348k6777j9248k8162k2387j6953
10398A149333j7864j8253k2348j4891j1068m314R39j24q520j5609k2041k3294
10386I91946k7713k9995k3981k6097k6397k7193k6663j8485q432l617k309k410
10374G68654o625j3011k4373k6695k5411j9443j7609L715L2630N8098N6728M6227
$$ plain form
10362 832885 854702 846369 816431 782338 747968 714939 681920 655489 642977 635290 626528 625324
10350 625324 618059 604533 589659 568888 543604 517382 490645 465819 441111 425059 412443 412861
10338 412861 415926 422922 439084 455173 466358 466584 460669 456841 456587 453481 456409 460549 459619 458982
10324 458982 455515 460940 468924 471680 472559 466285 461640 460654 458440 459333 461902 464379 465386 456843 447479
10309 447479 442808 434781 424215 422825 416398 411161 412754 412436 412228 407356 396580 384948 378906 367384
10295 367384 362479 364132 360061 362904 359850 346493 331748 324024 317174 313725 313928 315397 322550 339258
10281 339258 358064 375575 380399 379604 372100 357111 337005 316801 300447 286536 273685 265702
10269 265702 254956 253669 262528 261935 260075 266085 277063 285057 296677 303767 305951 308275 308580 296626
$$ packed form
10362H32885K1817q333k9938l4093l4370l3029l3019k6431j2512p687q762j204
10350F25324p265j3526j4874k0771k5284k6222k6737k4826k4708j6052j2616M18
10338D12861L065O996J6162J6089J1185K26n915l828k54l106K928M140r30o37
10324D58982l467N425P984K756Q79o274m645r86k214Q93K569K477J007q543r364
10309D47479m671q027j0566j390o427n237J593l18k08m872j0776j1632o042j1522
10295C67384m905J653m071K843l054j3357j4745p724o850l449K03J469P153J6708
10281C39258J8806J7511M824p95p504j4989k0106k0204j6354j3911j2851p983
10269B65702j0746j287Q859n93j860O010J0978P994J1620P090K184K324L05j1954
$$ plain form
10255 296626 295275 285016 276337 277042 283902 288784 290955 291014 290015 292558 298867 317269 357343 405094
10241 405094 462096 525056 583756 638226 690744 738295 778478 813454 842570 838042 795156 732044
10229 732044 661482 591667 536529 487495 455150 433724 419661 406106 388275 376266 371012 371546
10217 371546 376384 384421 393281 399578 403754 406424 408048 420023 439179 464368 490400 524584 558407
10204 558407 584497 604993 621510 635818 654973 698137 760177 840988 934506 1034291 1146487
10193 1146487 1265822 1368045 1430816 1452944 1441849 1393186 1315968 1220508 1119337 1035990 971431
10182 971431 927107 900752 889129 878547 872743 873183 879722 880068 892655 923711 965482 1013338 1074749
10169 1074749 1151025 1227141 1314151 1419475 1525099 1630571 1742719 1886410 2061469 2285289
$$ packed form
10255B96626j351j0259q679P05O860M882K171N9r99K543O309J8402M0074M7751
10241D05094N7002O2960N8700N4470N2518M7551M0183L4976K9116m528m2886o3112
10229G32044p0562o9815n5138m9034l2345k1426j4063j3555j7831j2009n254N34
10217C71546M838Q037Q860O297M176K670J624J1975J9156K5189K6032L4184L3823
10204E58407K6090K0496J6517J4308J9155M3164O2040Q0811R3518R9785J12196
10193A146487J19335J02223O2771K2128j1095m8663p7218r5460j01171q3347o4559
10182I71431m4324k6355j1623j0582n804M40O539L46J2587L1056M1771M7856O1411
10169A074749P6276P6116Q7010J05324J05624J05472J12148J43691J75059K23820
$$ plain form
10159 2285289 2579209 2974381 3512666 4260251 5310132 6798323 8936976 11807837 15053658
10150 15053658 17773565 19089994 18876207 17649199 16292729 15645902 16187295 18060819
10142 18060819 21261280 25575111 30385113 34608510 36969771 36713016 33985417 29615573
10134 29615573 24701135 20120093 16328493 13381168 11168102 9504131 8223928 7209590
10126 7209590 6377136 5675386 5076410 4559836 4117786 3726303 3380940 3077439 2816214
10117 2816214 2582806 2369922 2184389 2024588 1884473 1764427 1666389 1591442 1539185 1506627
10107 1506627 1488537 1478693 1457864 1424738 1380702 1329693 1270551 1222781 1185769 1146266 1107865
10096 1107865 1072098 1040104 1003045 968765 935419 905096 872219 835492 807856 782418 752129
$$ packed form
10159B285289K93920L95172N38285P47585J049881J488191K138653K870861L245821
10150A5053658K719907J316429k13787j227008j356470o46827N41393J873524
10142A8060819L200461M313831M810002M223397K361261k56755k727599m369844
10134B9615573m914438m581042l791600k947325k213066j663971j280203j014338
10126G209590q32454p01750n98976n16574m42050l91483l45363l03501k61225
10117B816214k33408k12884j85533j59801j40115j20046r8038p4947n2257l2558
10107A506627j8090r844k0829l3126m4036n1009n9142m7770l7012l9503l8401
10096A107865l5767l1994l7059l4280l3346l0323l2877l6727k7636k5438l0289
$$ plain form
10085 752129 730757 718053 700102 692368 695944 707974 730840 750427 776232 805657 854300 925667
10073 925667 1016651 1120855 1253759 1430572 1639744 1869153 2083330 2240506 2298773 2245396
10063 2245396 2101590 1912204 1711830 1533562 1391606 1281365 1196635 1123484 1060084 1001604
10053 1001604 948854 909380 880442 854009 826603 801635 775740 763886 762954 766851 777915 795467
10041 795467 824232 873338 940661 1032665 1160085 1327653 1530825 1777081 2070328 2372507
10031 2372507 2637312 2802601 2829234 2705133 2476060 2193598 1913741 1673343 1479915 1318716
10021 1318716 1185408 1073501 977030 892572 823127 764194 723315 697547 673728 653841 637792
10010 637792 617403 598256 581749 566513 556431 547558 547376 542926 531097 514800 495838 476274
$$ packed form
10085G52129k1372j2704j7951p734L576J2030K2866J9587K5805K9425M8643P1367
10073I25667R0984J04204J32904J76813K09172K29409K14177J57176N8267n3377
10063B245396j43806j89386k00374j78268j41956j10241q4730p3151o3400n8480
10053A001604n2750l9474k8938k6433k7406k4968k5895j1854r32L897J1064J7552
10041G95467K8765M9106O7323R2004J27420J67568K03172K46256K93247L02179
10031B372507K64805J65289K6633j24101k29073k82462k79857k40398j93428j61199
10021A318716j33308j11907r6471q4458o9445n8933m0879k5768k3819j9887j6049
10010F37792k0389j9147j6507j5236j0082q873j82m450j1829j6297j8962j9564
$$ plain form
9998 476274 459063 451277 448577 441427 435127 432083 427337 423921 423956 418164 418676 421906 424385 427485 424473
9983 424473 418881 409584 398750 386564 380714 376159 368244 354997 351645 356756 371233 380408 383814
9970 383814 390534 398930 403660 410795 418834 422996 431974 438581 441520 446279 453841 470134 492163 517325
9956 517325 550704 596018 652501 708034 763013 809202 827240 818762 783947 731159 680397 631132
9944 631132 593916 563872 537005 519177 501687 483953 465893 451921 435967 417734 396881 376437
9932 376437 372306 373181 384674 405578 427890 442800 446641 438249 431549 425579 421069 423195 422098 427512
9918 427512 433838 440568 458306 481686 508603 535103 561174 579713 585238 588259 591586 603618 622934
9905 622934 657157 701962 753618 812147 874759 946798 1029380 1121754 1238856 1382924 1529035
$$ packed form
9998D76274j7211p786k700p150o300l044m746l416L5n792N12L230K479L100l012
9983D24473n592r297j0834j2186n850m555p915j3247l352N111J4477R175L406
9970C83814O720Q396M730P135Q039M162Q978O607K939M759P562J6293K2029K5162
9956E17325L3379M5314N6483N5533N4979M6189J8038q478l4815n2788n0762m9265
9944F31132l7216l0044k6867j7828j7490j7734j8060j3972j5954j8233k0853k0444
9932C76437m131Q75J1493K0904K2312J4910L841q392o700n970m510K126j097N414
9918D27512O326O730J7738K3380K6917K6500K6071J8539N525L021L327J2032J9316
9905F22934L4223M4805N1656N8529O2612P2039Q2582R2374J17102J44068J46111
$$ plain form
9894 1529035 1655271 1750710 1830350 1924775 2052998 2191305 2336579 2502715 2683719 2867096
9884 2867096 3007599 3066159 3036621 2945646 2831498 2722817 2622999 2519728 2428834 2360161 2312358
9873 2312358 2282477 2285079 2325046 2402492 2513697 2650481 2823990 3071971 3450355 4009991
9863 4009991 4785972 5700491 6541203 7124573 7428488 7555604 7597214 7561179 7393684 7062722
9853 7062722 6601532 6106177 5673936 5347002 5111198 4933740 4772709 4623400 4494088 4402700
9843 4402700 4367313 4404609 4516616 4709067 4960781 5252023 5583995 5950617 6354028 6802279
9833 6802279 7331009 7973601 8757530 9733270 10992419 12668939 14969728 18194394 22710003
9824 22710003 28892539 37083360 47547902 60251358 73950801 85300138 90696797 89034855
$$ packed form
9894A529035J26236R5439P9640R4425J28223J38307J45274J66136J81004J83377
9884B867096J40503N8560k9538r0975j14148j08681r9818j03271r0894o8673m7803
9873B312358k9881K602L9967P7446J11205J36784J73509K47981L78384N59636
9863D009991P75981R14519Q40712N83370L03915J27116M1610l6035j67495l30962
9853G062722m61190m95355m32241l26934k35804j77458j61031j49309j29312r1388
9843D402700l5387L7296J12007J92451K51714K91242L31972L66622M03411M48251
9833F802279N28730O42592P83929R75740J259149J676520K300789L224666M515609
9824B2710003O182536Q190821J0464542J2703456J3699443J1349337N396659j661942
$$ plain form
9816 89034855 81418783 70555780 59649642 50669097 44116787 39711897 37017222 35728579
9808 35728579 35711061 37000416 39774949 44146956 49861467 56385513 63212741 69788784
9800 69788784 75354857 79359538 81658300 82287051 81662273 80233489 78288986 76098254
9792 76098254 73794526 71423504 69005174 66592307 64245216 62213737 61029294 61392012
9784 61392012 64219774 70750624 82538515 101141944 127246092 159613031 193282521
9777 193282521 219441287 229999936 222944911 201429496 172311949 143468044 119730199
9770 119730199 102332262 90353656 82345484 77238224 74322202 72901009 72231124 71874871
9762 71874871 71921517 72729339 74474804 77096619 80250129 83317338 85780091 87435487 87917708
$$ packed form
9816H9034855p616072j0863003j0906138q980545o552310m404890k694675j288643
9808C5728579j7518J289355K774533M372007N714511O524046O827228O576043
9800F9788784N566073M004681K298762O28751o24778j428784j944503k190732
9792G6098254k303728k371022k418330k412867k347091k031479j184443L62718
9784F1392012K827762O530850J1787891J8603429K6104148L2366939L3669490
9777A93282521K6158766J0558649p055025k1515415k9117547k8843905k3737845
9770A19730199j7397937j1978606q008172n107260k916022j421193o69885l56253
9762G1874871M6646Q07822J745465K621815L153510L067209K462753J655396M82221
$$ plain form
9753 87917708 86624111 83269017 77773633 70497352 62457966 54745586 48115308 42933187
9745 42933187 39184962 36700571 35385326 35304940 36715373 40029065 45782000 54371839
9737 54371839 65450178 77171366 86038177 89014787 85586820 77223691 66457065 55794242
9729 55794242 46628735 39226293 33372254 28757384 25077128 22063794 19524940 17367898
9721 17367898 15519458 13959709 12660620 11566597 10642907 9857848 9170727 8531831 7924588
9712 7924588 7345145 6815421 6359067 6007270 5762039 5604591 5521343 5464935 5429050 5446017
9702 5446017 5548805 5767389 6118939 6578167 7049208 7420586 7679931 7851070 7903822 7752270
9692 7752270 7339186 6696106 5939899 5214099 4619407 4171111 3843069 3576328 3337238 3106110
$$ packed form
9753H7917708j293597l355094n495384p276281q039386p712380o630278n182121
9745D2933187l748225k484391j315245q0386J410433L313692N752935Q589839
9737E4371839J1078339J1721188Q866811K976610l427967q363129j0766626j0662823
9729E5794242r165507p402442n854039m614870l680256l013334k538854k157042
9721A7367898j848440j559749j299089j094023r23690p85059o87121o38896o07243
9712G924588n79443n29724m56354l51797k45231j57448q3248n6408l5885J6967
9702E446017J02788K18584L51550M59228M71041L71378K59345J71139N2752j51552
9692G752270m13084o43080p56207p25800n94692m48296l28042k66741k39090k31128
$$ plain form
9682 3106110 2889001 2704320 2565322 2479169 2438976 2437133 2464570 2508404 2572579 2656960 2749920
9671 2749920 2835431 2898606 2916126 2883759 2812510 2722978 2632861 2558252 2474468 2379506 2273492
9660 2273492 2175256 2077692 1969513 1848207 1704513 1577072 1491540 1458832 1462048 1475785 1476549
9649 1476549 1448802 1390695 1311624 1227532 1153957 1092065 1045164 1026762 1020135 1006912 1008664 1008542
9637 1008542 1003452 1005675 1005776 1006722 1006448 1001177 997238 987899 972362 956888 942003 923984 912005 908279
9623 908279 902986 898023 894521 888876 886014 896893 913455 942796 981926 1036857 1116118 1224052
9611 1224052 1345789 1445631 1478850 1445865 1361263 1243283 1125888 1034693 969567 926639 904403
9600 904403 885835 866793 862904 865120 855545 843952 833415 823294 816985 808329 814052 819338 808416
$$ packed form
9682C106110k17109j84681j38998q6153m0193j843K7437M3834O4175Q4381R2960
9671B749920Q5511O3175J7520l2367p1249q9532r0117p4609q3784r4962j06014
9660B273492r8236r7564j08179j21306j43694j27441q5532l2708L216J3737P64
9649A476549k7747n8107p9071q4092p3575o1892m6901j8402o627j3223J752j22
9637A008542n090K223J01R46k74n271l939r339j5537j5474j4885j8019j1979l726
9623I08279n293m963l502n645k862J0879J6562K9341L9130N4931P9261J07934
9611A224052J21737R9842L3219l2985q4602j17980j17395r1195o5126m2928k2236
9600I04403j8568j9042l889K216r575j1593j0537j0121o309q656N723N286j0922
$$ plain form
9587 808416 785463 753717 720921 675853 629588 597198 573256 549070 531798 525259 528786 537218
9575 537218 549748 566040 576657 582730 588587 598463 604250 599428 573937 538352 496084 453034 419458
9562 419458 393050 370340 361480 357283 349528 341842 340174 330923 317442 301519 288416 271004 264094
9549 264094 250731 237659 233066 225382 217113 216462 214952 204128 198263 195371 188060 190404 190467 190380 181298
9534 181298 174191 171518 173500 170411 162739 156080 159871 169812 175910 173844 162904 152639 154758 152046
9520 152046 145723 139438 133492 137892 140774 136499 135900 135239 134493 133579 133585 134811 136807 135632 134321 132021
9504 132021 133294 135459 132281 130167 141453 153215 155386 153630 140116 125840 115976 110306 112585
9491 112585 119367 123787 134812 140743 144100 150401 156668 158566 158733 160563 157561 151103 151467 148354 146719
$$ packed form
9587H08416k2953l1746l2796m5068m6265l2390k3942k4186j7272o539L527Q432
9575E37218J2530J6292J0617O073N857R876N787m822k5491l5585m2268m3050l3576
9562D19458k6408k2710q860m197p755p686j668r251j3481j5923j3103j7412o910
9549B64094j3363j3072m593p684q269o51j510j0824n865k892p311K344O3q7r082
9534A81298p107k673J982l089p672o659L791R941O098k066j0940j0265K119k712
9520A52046o323o285n946M400K882m275n99o61p46r14OJ226J996j175j311k300
9504A32021J273K165l178k114J1286J1762K171j756j3514j4276r864n670K279
9491A12585O782M420J1025N931L357O301O267J898J67J830l002o458L64l113j635
$$ plain form
9476 146719 143826 140276 139401 138265 139817 142246 142003 136564 135791 134317 133404 130875 136026 141413 144031
9461 144031 146371 149731 158012 167019 171898 170692 164762 161534 159336 168054 177088 182599 190289 202553
9447 202553 231110 259598 282116 301096 321319 340842 356096 366534 365965 352260 336703 312533
9435 312533 290578 275738 258523 245158 227101 213406 212988 209240 206109 206000 193888 179651 173830
9422 173830 171140 171585 177961 181550 188973 192773 192122 191945 195224 197880 200177 206295 212747 228793 248008
9407 248008 270654 296483 344262 413545 513448 632747 763404 869140 923970 930852 890958
9396 890958 829179 755122 680981 601546 527475 467159 415466 374222 334261 305804 287593 274133
9384 274133 264185 253559 243964 240293 239793 238030 231422 222683 211154 201147 193025 190278 189595 194532
$$ packed form
9476A46719k893l550q75j136J552K429k43n439p73j474r13k529N151N387K618
9461A44031K340L360Q281R007M879j206n930l228k198Q718R034N511P690J2264
9447B02553K8557K8488K2518J8980K0223J9523J5254J0438n69j3705j5557k4170
9435C12533k1955j4840j7215j3365j8057j3695m18l748l131j09j2112j4237n821
9422A73830k690M45O376L589P423L800o51j77L279K656K297O118O452J6046J9215
9407B48008K2646K5829M7779O9283R9903J19299J30657J05736N4830O882l9894
9396H90958o1779p4057p4141p9435p4071o0316n1693m1244l9961k8457j8211j3460
9384B74133r948j0626r595l671n00j763o608q739j1529j0007q122k747o83M937
$$ plain form
9370 194532 198771 202280 215087 227044 243144 270618 311407 363000 431465 525978 649180 785679
9358 785679 915350 1028018 1106407 1132923 1116578 1071828 1005978 926153 834247 742328 655474
9347 655474 569780 490663 433975 394812 363418 335586 310937 296193 287114 281399 270731 262087
9335 262087 263848 261362 260928 258308 252664 252356 252248 246954 242845 243417 236552 244451 259466 271380 282705
9320 282705 305720 340189 380040 445045 529975 613211 680318 722063 734330 731880 717770 693398
9308 693398 663565 626157 579164 523067 459411 403570 358820 323891 297085 271738 251998 237501
9296 237501 225184 207014 196607 188882 183174 190356 195493 190457 182168 185138 185292 184324 187582 185709
9282 185709 182328 183752 186640 184994 184267 185297 189398 187542 194902 205816 226967 251732 265733 271810
$$ packed form
9370A94532M239L509J2807J1957J6100K7474M0789N1593O8465R4513J23202J36499
9358G85679J29671J12668P8389K6516j6345m4750o5850p9825r1906r1919q6854
9347F55474q5694p9117n6688l9163l1394k7832k4649j4744r079n715j0668q644
9335B62087J761k486m34k620n644l08j08n294m109N72o865P899J5015J1914J1325
9320B82705K3015L4469L9851O5005Q4930Q3236O7107M1745J2267k450j4110k4372
9308F93398k9833l7408m6993n6097o3656n5841m4750l4929k6806k5347j9740j4497
9296B37501j2317j8170j0407p725n708P182N137n036q289K970J54r68L258j873
9282A85709l381J424K888j646p27J030M101j856P360J0914K1151K4765J4001O077
$$ plain form
9268 271810 268071 275560 278339 272070 257896 249796 234466 213284 192065 176085 165662 155601 147353
9255 147353 145392 145874 143151 136838 135732 137301 137783 138584 141037 137772 135342 136509 131724 127530 121707
9240 121707 119981 124171 126351 123676 123975 123027 125787 128702 132537 137875 145247 143441 137677 134697 130379
9225 130379 130199 129367 129330 129088 132364 137171 132231 136254 137206 140472 137892 137742 138763 145527 144981 143520
9209 143520 144558 147720 149023 150662 151933 147444 141806 138944 131247 135110 138078 137718 136036 135829 138054
9194 138054 140665 142894 141039 137500 139344 148631 163256 171120 168593 167356 159345 151230 142231 130988
9180 130988 118959 120587 126349 129792 133602 141486 142257 136847 134933 137269 143922 139272 130204 123866
9166 123866 114891 107949 104795 105085 104531 103991 110264 121756 123443 119179 118008 112498 104982 100700 96938
$$ packed form
9268B71810l739P489K779o269j4174q100j5330k1182k1219j5980j0423j0061q248
9255A47353j961M82k723o313j106J569M82Q01K453l265k430J167m785m194n823
9240A21707j726M190K180k675K99r48K760K915L835N338P372j806n764k980m318
9225A30379j80q32l7k42L276M807m940M023R52L266k580j50J021O764n46j461
9209A43520J038L162J303J639J271m489n638k862p697L863K968l60j682k07K225
9194A38054K611K229j855l539J844R287J4625P864k527j237q011q115q999j1243
9180A30988j2029J628N762L443L810P884P71n410j914K336O653m650r068o338
9166A23866q975o942l154K90n54n40O273J1492J687m264j171n510p516m282l762
$$ plain form
9151 96938 96137 99313 102252 105403 105750 108342 113491 112617 111481 117198 123292 128627 134324 131477 126173
9136 126173 113490 106886 106356 110846 111573 119023 123506 122217 117730 125562 130339 129617 126776 123541 122007
9121 122007 122870 124195 120932 118036 111514 109748 112304 108098 102204 96813 96482 97367 98586 96954 100766
9106 100766 109899 114072 107223 107999 106782 100806 94181 91743 93177 99588 100520 99148 99242 100635 98969
9091 98969 94282 98236 99789 99872 94920 91903 90171 90605 90950 93594 92515 85749 85709 90914 95470 101819
9075 101819 100126 103589 102270 92957 78511 74234 76831 89767 97823 105903 112419 113093 112255 109377
9061 109377 107282 107987 112564 107665 101859 90941 79428 80084 84383 85141 86096 88024 90620 92745 95304
9046 95304 93426 99439 103777 105110 110941 117068 122770 117555 103646 102321 98740 97117 98538 101571
$$ packed form
9151I6938q01L176K939L151L47K592N149q74j136N717O094N335N697k847n304
9136A26173j2683o604n30M490P27P450M483j289m487P832M777p22k841l235j534
9121A22007Q63J325l263k896o522j766K556m206n894n391l31Q85J219j632L812
9106A00766R133M173o849P76j217n976o625k438J434O411R32j372R4J393j666
9091I8969m687L954J553Q3m952l017j732M34L45K644j079o766m0N205M556O349
9075A01819j693L463j319r313j4446m277K597J2936Q056Q080O516O74q38k878
9061A09377k095P05M577m899n806j0918j1513O56M299P58R55J928K596K125K559
9046I5304j878O013M338J333N831O127N702n215j3909j325l581j623J421L033
$$ plain form
9032 101571 102409 99417 99430 103204 105130 99805 95796 98330 99381 105534 108890 115720 120802 122137 115356
9017 115356 109931 117097 110699 106683 117406 120007 128184 125451 122049 123661 119331 115408 117460 116988
9003 116988 115995 110769 107404 103383 105769 117749 127951 126615 118615 123301 121195 130561 135211 130421
8989 130421 132778 132858 144370 156783 167318 172065 174008 169141 162588 154349 149250 144205 138141 132837
8975 132837 129066 130710 136888 151713 166501 176290 179134 174189 169051 157018 148685 147913 147374 146725
8961 146725 141740 138921 137408 132438 132634 134037 141134 147511 142786 142741 144033 145230 136729 135053 137778
8946 137778 145705 143114 143233 147182 149401 148910 148830 145120 141318 139264 138873 138422 142966 144100 139409 130993
8930 130993 125008 125116 124581 128955 140685 145622 146376 147113 143739 145015 145438 146225 150507 156677 157640 155859
$$ packed form
9032A01571Q38k992J3L774J926n325m009K534J051O153L356O830N082J335o781
9017A15356n425P166o398m016J0723K601Q177k733l402J612m330l923K052m72
9003A16988r93n226l365m021K386J1980J0202j336q000M686k106R366M650m790
8989A30421K357Q0J1512J2413J0535M747J943m867o553q239n099n045o064n304
8975A32837l771J644O178J4825J4788R789K844m945n138j2033q333p72n39o49
8961A46725m985k819j513m970J96J403P097O377m725m5J292J197q501j676K725
8946A37778P927k591J19L949K219m91q0l710l802k054l91m51M544J134m691q416
8930A30993n985J08n35M374J1730M937P54P37l374J276M23P87M282O170R63j781
$$ plain form
8914 155859 160632 166967 171977 169273 163492 161446 162039 164250 165888 165667 161329 159553 164220 171245 175810
8899 175810 181495 189532 196253 207021 217659 220817 216889 219232 218014 215800 213242 213205 210550 206509
8885 206509 204091 206792 212262 222066 230563 242202 253948 252127 242534 236820 232151 228460 231159 234216
8871 234216 234724 232309 234868 234291 234211 232909 235086 238890 241726 242424 238954 233721 236701 238655 245311 247164
8855 247164 249678 248879 247289 251538 253194 256062 264069 262990 260456 259236 258375 257106 259648 256499 256412
8840 256412 267517 272450 270442 268163 273130 269464 272330 286391 290507 287897 285684 282134 284558 284147
8826 284147 280403 282762 285901 290074 294844 301791 305575 304493 308940 309293 310504 307006 305742 308842 313526
8811 313526 318527 322099 328628 333532 330485 328827 330433 331653 331686 338370 347698 355475 355486 352546 352752 351272
$$ packed form
8914A55859M773O335N010k704n781k046N93K211J638k21m338j776M667P025M565
8899A75810N685Q037O721J0768J0638L158l928K343j218k214k558l7k655m041
8885B06509k418K701N470R804Q497J1639J1746j821r593n714m669l691K699L057
8871B34216N08k415K559n77q0j302K177L804K836O98l470n233K980J954O656J853
8855B47164K514p99j590M249J656K868Q007j079k534j220q61j269K542l149q7
8840B56412J1105M933k008k279M967l666K866J4061M116k610k213l550K424m11
8826B84147l744K359L139M173M770O947L784j082M447L53J211l498j264L100M684
8811C13526N001L572O529M904l047j658J606J220L3O684R328P777J1k940K06j480
$$ plain form
8795 351272 355622 360863 371059 377323 381500 387665 397600 402659 404647 409007 419694 430399 435714 447064
8781 447064 461978 464155 466494 475956 478389 475058 476398 487924 506336 514760 516740 513083 508854 511952
8767 511952 514829 514943 515560 522176 533245 536447 545609 562123 579046 585896 598050 603883 611614 619925
8753 619925 627166 634380 644073 654295 668314 671608 676978 687391 704287 715627 725680 731178 745827
8740 745827 761170 771720 778172 784080 797265 816518 830512 839616 848119 862079 879872 899559
8728 899559 917905 927247 941751 955663 962440 975731 992626 1009582 1029273 1047729 1066312 1085938
8716 1085938 1107384 1129137 1146663 1165515 1186701 1210420 1237770 1265119 1296632 1324684 1342348
8705 1342348 1362239 1397288 1436799 1464982 1493619 1524736 1553752 1585428 1621319 1659572 1705029
$$ packed form
8795C51272M350N241J0196O264M177O165R935N059J988M360J0687J0705N315J1350
8781D47064J4914K177K339R462K433l331J340J1526J8412Q424J980l657m229L098
8767E11952K877J14O17O616J1069L202R162J6514J6923O850J2154N833P731Q311
8753F19925P241P214R693J0222J4019L294N370J0413J6896J1340J0053N498J4649
8740G45827J5343J0550O452N908J3185J9253J3994R104Q503J3960J7793J9687
8728H99559J8346R342J4504J3912O777J3291J6895J6956J9691J8456J8583J9626
8716A085938K1446K1753J7526J8852K1186K3719K7350K7349L1513K8052J7664
8705A342348J9891L5049L9511K8183K8637L1117K9016L1676L5891L8253M5457
$$ plain form
8694 1705029 1755521 1808487 1856839 1904930 1953537 2000775 2051394 2101105 2161324 2230972 2303655
8683 2303655 2392877 2494346 2597752 2697654 2797684 2893698 2978841 3051948 3122855 3191099 3252761
8672 3252761 3313363 3377658 3450435 3533980 3627571 3730647 3844984 3976590 4124511 4280106
8662 4280106 4448246 4618434 4801518 5006486 5229276 5455431 5690286 5931311 6175937 6436384
8652 6436384 6706343 6989688 7283314 7592910 7911569 8238789 8578275 8934393 9311038 9712715
8642 9712715 10138860 10596335 11088042 11620447 12191005 12803171 13452889 14152920 14906260 15719380
8632 15719380 16587130 17499645 18475252 19515957 20605416 21746790 22929620 24137794 25356496
8623 25356496 26586656 27796678 28975691 30105613 31149763 32093502 32913968 33578111 34068957
$$ packed form
8694A705029N0492N2966M8352M8091M8607M7238N0619M9711O0219O9648P2683
8683B303655Q9222J01469J03406R9902J00030R6014Q5143P3107P0907O8244O1662
8672C252761O0602O4295P2777Q3545R3591J03076J14337J31606J47921J55595
8662D280106J68140J70188J83084K04968K22790K26155K34855K41025K44626K60447
8652F436384K69959K83345K93626L09596L18659L27220L39486L56118L76645M01677
8642I712715M26145M57475M91707N32405N70558O12166O49718P00031P53340Q13120
8632A5719380Q67750R12515R75607J040705J089459J141374J182830J208174J218702
8623B5356496J230160J210022J179013J129922J044150R43739Q20466O64143M90846
$$ plain form
8614 34068957 34371386 34478914 34375933 34074420 33598767 32956877 32167405 31251642 30231505
8605 30231505 29134489 27992980 26825015 25643801 24461886 23304058 22175284 21079559
8597 21079559 20022443 19003508 18033567 17114707 16241527 15412162 14640358 13914686 13221804
8588 13221804 12577985 11975758 11416564 10908937 10440451 10012070 9619192 9251760 8898552
8579 8898552 8552935 8208816 7861384 7521330 7180623 6852726 6540601 6238445 5959493 5714012
8569 5714012 5483739 5270445 5066448 4867806 4680368 4502085 4335929 4178693 4028258 3892141
8559 3892141 3761313 3634718 3513340 3404680 3300172 3205386 3116241 3020808 2930730 2841967
8549 2841967 2747837 2660704 2577004 2504852 2430512 2359970 2297679 2236835 2173743 2113082 2050813
$$ packed form
8614C4068957L02429J07528j02981l01513m75653o41890p89472r15763j020137
8605C0231505j097016j141509j167965j181214j181915j157828j128774j095725
8597B1079559j057116j018935r69941r18860q73180q29365p71804p25672o92882
8588A3221804o43819o02227n59194n07627m68486m28381l92878l67432l53208
8579H898552l45617l44119l47432l40054l40707l27897l12125l02156k78952k45481
8569E714012k30273k13294k03997j98642j87438j78283j66156j57236j50435j36117
8559C892141j30828j26595j21378j08660j04508r4786q9145r5433r0078q8763
8549B841967r4130q7133q3700p2152p4340p0542o2291o0844o3092o0661o2269
$$ plain form
8538 2050813 1993172 1940168 1888526 1840421 1796166 1758459 1722151 1686192 1647374 1609837 1577678
8527 1577678 1540867 1514206 1483268 1449956 1412373 1384817 1363815 1339433 1308982 1285894 1263726
8516 1263726 1236854 1214512 1188696 1161327 1141337 1120385 1103159 1090379 1075621 1053359 1032853
8505 1032853 1027536 1028980 1039784 1048719 1062692 1097337 1127965 1139649 1122996 1079044 1012049 948655
8493 948655 901684 871184 845351 828108 812363 801473 792664 778393 765296 760628 748873 737288
8481 737288 726660 719310 715829 707659 689963 675236 663302 655686 643744 634322 625780 617509 610977
8468 610977 603309 593361 578816 583196 601285 633099 676653 732091 776176 790331 779428 742017
8456 742017 691034 645829 601338 561764 529293 505754 494922 491137 496876 495629 488356 472104
$$ packed form
8538B050813n7641n3004n1642m8105m4255l7707l6308l5959l8818l7537l2159
8527A577678l6811k6661l0938l3312l7583k7556k1002k4382l0451k3088k2168
8516A263726k6872k2342k5816k7369j9990k0952j7226j2780j4758k2262k0506
8505A032853n317J444J0804Q935J3973L4645L0628J1684j6653m3952o6995o3394
8493I48655m6971l0500k5833j7243j5745j0890q809j4271j3097m668j1755j1585
8481G37288j0628p350l481q170j7696j4727j1934p616j1942r422q542q271o532
8468F10977p668r948j4545M380J8089L1814M3554N5438M4085J4155j0903l7411
8456G42017n0983m5205m4491l9574l2471k3539j0832l785N739j247p273j6252
$$ plain form
8444 472104 459576 451911 443484 442045 442462 444248 441936 432347 425836 421685 415321 404592 396264 392654
8430 392654 394353 397037 399042 387678 377375 362396 341436 337530 343029 345295 349870 355519 358496
8417 358496 355495 355347 354036 349794 341983 329993 319260 313065 307412 301156 297638 291161 284000 277303
8403 277303 274445 271282 270383 268540 266252 263626 263551 263408 260498 253565 253680 248706 243043 236870 230897 234568
8387 234568 232033 234287 239453 241249 240104 244898 235969 226385 217882 223632 229389 231511 231603 234462 230342
8372 230342 227900 224806 216976 215479 216520 220395 214326 208474 205867 204693 194796 194510 190293 187713 188295
8357 188295 188968 191222 195611 195985 189831 183967 178765 181198 185290 184963 180376 182541 187644 180894 174262
8342 174262 172595 178174 182114 179831 172347 169880 160412 158377 165217 167125 167759 168141 171046 178260 179269
$$ packed form
8444D72104j2528p665q427j439M17J786k312r589o511m151o364j0729q328l610
8430C92654J699K684K005j1364j0303j4979k0960l906N499K266M575N649K977
8417C58496l001j48j311m242p811j1990j0733o195n653o256l518o477p161o697
8403B77303k858l163q99j843k288k626p5j43k910o933J15m974n663o173n973L671
8387B34568k535K254N166J796j145M794q929r584q503N750N757K122R2K859m120
8372B30342k442l094p830j497J041L875o069n852k607j174r897k86m217k580N82
8357A88295O73K254M389L74o154n864n202K433M092l27m587K165N103o750o632
8342A74262j667N579L940k283p484k467r468k035O840J908O34L82K905P214J009
$$ plain form
8327 179269 173378 169798 167109 165334 159466 158055 155023 153100 156498 154399 150090 153895 155353 157793
8313 157793 149664 144858 148692 148098 143124 140302 143021 143673 147515 156169 162213 157244 148043 141782 140664
8298 140664 138433 138495 137148 137241 138817 141006 144011 152326 152171 156157 151943 152525 148248 145653 146322 143791
8282 143791 137935 138284 136585 133279 129377 131129 125131 130098 133958 135137 134705 131963 134870 137766 131777
8267 131777 132242 129441 132779 132422 137806 141679 139882 135017 128519 120146 114178 113258 111622 105765 111586
8252 111586 115276 111250 112884 108869 105073 108841 112167 104153 102193 110127 111872 114900 116144 115398 116103
8237 116103 114448 115119 114719 111140 115286 114328 109795 110384 111053 108401 115786 115155 102559 91573 86516
8222 86516 93011 93950 96693 97180 98129 89873 82125 83012 88917 91245 90288 90566 83626 77318 80461 89131
$$ packed form
8327A79269n891l580k689j775n868j411l032j923L398k099m309L805J458K440
8313A57793q129m806L834n94m974k822K719O52L842Q654O044m969r201o261j118
8298A40664k231O2j347R3J576K189L005Q315j55L986m214N82m277k595O69k531
8282A43791n856L49j699l306l902J752n998M967L860J179m32k742K907K896n989
8267A31777M65k801L338l57N384L873j797m865o498q373n968r20j636n857N821
8252A11586L690m026J634m015l796L768L326q014j960P934J745L028J244p46P05
8237A16103j655O71m00l579M146r58m533N89O69k652P385o31j2596j0986n057
8222H6516O495R39K743M87R49q256p748Q87N905K328r57K78o940o308L143Q670
$$ plain form
8206 89131 90819 85480 74673 71727 71744 79576 86301 87019 90254 96212 101019 99826 94751 94662 101361 102484
8190 102484 92456 91384 96635 101815 99729 96528 96738 90704 91629 92037 93013 99483 101912 97261 98462
8175 98462 105429 105390 97695 91334 91483 87255 83429 78996 82864 89222 82505 78080 75950 77418 77970 82295
8159 82295 85696 87861 95293 96916 97845 97198 90051 87794 87174 85078 89909 89796 90135 95325 98648 99123
8143 99123 95757 91273 93013 97671 94310 91843 92013 91395 92970 89065 81506 82436 83410 83127 83363 79059
8127 79059 74508 73676 76523 78904 80654 81735 88016 90797 93330 99630 104206 102161 102373 99509 92787
8112 92787 90699 95465 97889 97477 101032 103309 107810 112895 119816 128663 131441 133390 132654 126300 131454
8097 131454 134832 135413 139590 145874 145334 148128 144306 142836 142202 135113 129994 125670 122176 123574 123774
$$ packed form
8206H9131J688n339j0807k946J7P832O725P18L235N958M807j193n075q9O699J123
8190A02484j0028j072N251N180k086l201K10o034R25M08R76O470K429m651J201
8175I8462O967l9p695o361J49m228l826m433L868O358o717m425k130J468N52M325
8159H2295L401K165P432J623R29o47p147k257o20k096M831j13L39N190L323M75
8143I9123l366m484J740M658l361k467J70o18J575l905p559R30R74k83K36m304
8127G9059m551q32K847K381J750J081O281K781K533O300M576k045K12k864o722
8112I2787k088M766K424m12L555K277M501N085O921Q847K778J949p36o354N154
8097A31454L378N81M177O284n40K794l822j470o34p089n119m324l494J398K00
$$ plain form
8082 123774 131280 135283 134858 138309 131122 126248 128508 129707 134657 138406 143267 148196 147437 154476 162676
8067 162676 160923 159933 159632 162941 170463 174874 180068 192073 203672 216972 239339 263149 279053
8054 279053 289352 288880 276855 261086 240741 224489 218051 215467 214814 204763 189343 180289 173749
8041 173749 160648 152507 155956 156032 154243 157205 150697 149371 148568 154883 159493 165962 176073 184217 190617
8026 190617 191314 192793 197880 202971 209338 213952 216224 222679 229892 241126 255059 266718 274108 279449
8012 279449 290828 298361 300539 294379 277188 273458 266636 260477 253037 242887 226119 210071 200793
7999 200793 201640 204063 194311 185631 184749 178498 176137 174625 173317 166634 166588 166314 167437 175412 180949 182998
7983 182998 188741 194881 199216 211726 228066 225289 225986 227249 222948 222695 230000 233235 233269 229701 221798
$$ packed form
8082A23774P506M003m25L451p187m874K260J199M950L749M861M929p59P039Q200
8067A62676j753r90l01L309P522M411N194J2005J1599J3300K2367K3810J5904
8054B79053J0299m72j2025j5769k0345j6252o438k584o53j0051j5420r054o540
8041A73749j3101q141L449P6j789K962o508j326q03O315M610O469J0111Q144O400
8026A90617O97J479N087N091O367M614K272O455P213J1234J3933J1659P390N341
8012B79449J1379P533K178o160j7191l730o822o159p440j0150j6768j6048r278
7999B00793Q47K423r752q680q82o251k361j512j308o683m6k74J123P975N537K049
7983A82998N743O140M335J2510J6340k777O97J263m301k53P305L235L4l568p903
$$ plain form
7968 221798 215161 205613 202011 196583 187257 179649 185521 184020 180179 173890 167274 165987 160503 155273
7954 155273 149719 140126 133557 130631 127229 128656 132158 130557 130407 129889 127108 124522 123188 122250 121361
7939 121361 125813 123284 115515 106276 104661 103625 100085 93266 96978 101391 98831 96752 100317 100685 93448
7924 93448 88493 84816 82480 83307 81251 77771 78306 75555 71859 69525 71513 75075 77964 72176 71072
7909 71072 71371 61824 55484 55873 54517 57514 57297 61493 63425 63550 64581 62709 63264 55915 53515 49923
7893 49923 46978 44933 41241 39374 35790 32773 28615 18530 17957 18942 16637 22256 27296 29696 31930
7878 31930 33699 29892 32045 31000 30675 25237 27607 36770 36470 39760 48214 48997 52908 53431 57538 55591
7862 55591 41454 32683 30409 32626 36747 27900 22334 27170 32446 30106 25427 22687 23726 30934
$$ packed form
7968B21798o637r548l602n428r326p608N872j501l841o289o616j287n484n230
7954A55273n554r593o569k926l402J427L502j601j50n18k781k586j334r38q89
7939A21361M452k529p769r239j615j036l540o819L712M413k560k079L565L68p237
7924I3448m955l677k336Q27k056l480N35k751l696k334J988L562K889n788j104
7909G1072K99r547o340L89j356K997k17M196J932J25J031j872N55p349k400l592
7893D9923k945k045l692j867l584l017m158j0085n73R85k305N619N040K400K234
7878C1930J769l807K153j045l25n438K370R163l00L290Q454P83L911N23M107j947
7862E5591j4137q771k274K217M121q847n566M836N276k340m679k740J039P208
$$ plain form
7848 30934 37626 44115 44702 40170 38172 32530 25026 20690 15816 14849 10545 13770 17724 19176 27947
7833 27947 28558 27651 34496 31343 25821 23700 20244 25167 30540 28629 32742 33725 26842 23841 26279
7818 26279 18704 17177 12244 8724 5972 6810 12292 10402 8564 13894 17499 15028 11646 13056 14304
7803 14304 12188 7723 13995 11831 13927 19848 17412 15023 9623 9302 8912 13988 17036 17730 27410
7788 27410 26239 17915 14006 15096 16226 12252 6953 -1233 -6300 3427 11353 16718 16382 13652 14443
7773 14443 14772 11627 9404 13134 15543 13099 15075 21987 19967 15009 13697 8572 10776 12232 17588
7758 17588 19009 26873 23257 15973 2053 -7279 -6655 -2832 1220 7634 9384 10270 18762 18944 16175
7743 16175 15884 18678 16709 13679 7247 4221 3630 6215 12482 15623 15582 13627 12021 11396 6544 5557
$$ packed form
7848C0934O692O489N87m532j998n642p504m336m874r67m304L225L954J452Q771
7833B7947O11r07O845l153n522k121l456M923N373j911M113R83o883l001K438
7818B6279p575j527m933l520k752Q38N482j890j838N330L605k471l382J410J248
7803A4304k116m465O272k164K096N921k436k389n400l21l90N076L048O94R680
7788B7410j171q324l909J090J130l974n299q186n067R727P926N365l36k730P91
7773A4443L29l145k223L730K409k444J976O912k020m958j312n125K204J456N356
7758A7588J421P864l616p284j3920r332O24L823M052O414J750Q86Q492J82k769
7743A6175k91K794j969l030o432l026n91K585O267L141m1j955j606o25m852r87
$$ plain form
7727 5557 15971 21687 24274 24529 23711 21645 21309 15586 14839 14140 14913 17878 17118 7026 -1522 -1195
7711 -1195 5571 3470 -1123 3727 9792 11903 18012 22839 22437 17946 18163 13143 8125 12433 9948
7696 9948 2232 -1446 6952 16737 20267 19124 16339 19016 10804 10543 11388 11942 17796 18181 10934 7368
7680 7368 6820 5322 8179 7628 21051 23712 21957 23228 24976 16452 14527 19920 18210 11422 11247
7665 11247 12394 7879 -1034 -2635 3452 7319 4446 8290 10341 8820 2541 939 1358 6526 10235
7650 10235 9565 7238 3645 723 5621 10520 6100 2875 5640 10458 10514 8444 13753 12573 10727
7635 10727 7858 3971 274 5856 8019 6418 8328 7688 13417 8603 3570 5347 5759 1692 3686
7620 3686 7169 11707 13187 11019 7331 10335 12747 17897 25115 20164 16140 20473 20599 14222 9329
$$ packed form
7727E557J0414N716K587K55q18k066l36n723p47o99P73K965p60j0092q548L27
7711a195O766k101m593M850O065K111O109M827m02m491K17n020n018M308k485
7696I948p716l678Q398R785L530j143k785K677q212k61Q45N54N854L85p247l566
7680G368n48j498K857n51J3423K661j755J271J748q524j925N393j710o788j75
7665A1247J147m515q913j601O087L867k873L844K051j521o279j602M19N168L709
7650A0235o70k327l593k922M898M899m420l225K765M818N6k070N309j180j846
7635A0727k869l887l697N582K163j601J910o40N729m814n033J777M12m067J994
7620C686L483M538J480k168l688L004K412N150P218m951m024M333J26o377m893
$$ plain form
7605 9329 -1097 -444 6614 12276 13225 20152 14647 7730 4441 8602 12712 9072 3252 2507 3081 503
7589 503 3279 5630 7197 5860 5753 3058 6911 10232 11191 12158 7153 -535 61 2431 2186 -1319
7573 -1319 -5435 -5871 -3436 -2360 -2242 -3916 2843 2795 2952 4291 9808 11833 12106 12881 12238 3675 727
7556 727 -1284 2243 11341 18122 15420 12853 13273 15471 12717 15342 18718 23836 21640 12756 8003
7541 8003 7766 7495 10934 15810 14898 13759 9295 12926 13620 11919 7406 9189 12656 6282 4396 -405
7525 -405 2825 -363 -3952 -2579 283 1499 742 -4077 375 7800 9882 7888 10455 10095 4957 3574
7509 3574 6462 5622 2328 -2019 -2624 15 8489 14459 18515 14297 7596 6893 7337 3966 980 -129
7493 -129 1691 1881 1195 3623 10389 5388 3437 -16 1100 1636 1746 4595 11264 15871 21341 20060
$$ packed form
7605I329j0426O53P058N662R49O927n505o917l289M161M110l640n820p45N74k578
7589E03K776K351J567j337j07k695L853L321R59R67n005p688N96K370k45l505
7573a319m116m36K435J076J18j674O759m8J57J339N517K025K73P75o43q563k948
7556G27k011L527R098O781k702k567M20K198k754K625L376N118k196q884m753
7541H003k37k71L439M876r12j139m464L631O94j701m513J783L467o374j886m801
7525d05L230l188l589J373K862J216p57m819M452P425K082j994K567l60n138j383
7509C574K888q40l294m347o05K639Q474N970M056m218o701p03M44l371k986j109
7493a29J820J90o86K428O766n001j951l453J116N36J10K849O669M607N470j281
$$ plain form
7477 20060 18085 15319 17661 14626 11449 13363 15127 10072 -4583 -394 7000 12264 12132 9065 3833
7462 3833 3715 7749 10557 11589 10811 8037 6167 667 -2354 -3485 -5513 -8229 -3369 -5240 -347
7447 -347 3537 2246 5407 12880 12052 4147 5041 7636 4613 375 -2736 113 4942 6578 10039 7026
7431 7026 6113 10154 11989 12275 11546 12848 11422 6815 965 -345 49 282 1253 773 5850 5599 6150
7414 6150 5526 971 -1440 4403 8178 10336 10697 12330 14287 11735 10566 11561 8684 2190 -4952 -6973
7398 -6973 -6049 -5115 -6273 -1813 79 3618 5156 3390 -369 3850 12694 12066 8663 11384 13112 7387
7382 7387 1816 -5240 -8878 -11465 -5416 3587 6616 1373 -936 -1652 2352 7492 9533 11214 11454
7367 11454 9669 3234 -3799 -5160 -2547 -1728 -3637 2265 2893 -4864 -6721 -8013 -7530 -6771 -1973 -1171
$$ packed form
7477B0060j975k766K342l035l177J914J764n055j4655M189P394N264j32l067n232
7462C833j18M034K808J032p78k774j870n500l021j131k028k716M860j871M893
7447c47L884j291L161P473q28p905Q94K595l023m238l111K849M829J636L461l013
7431G026r13M041J835K86p29J302j426m607n850j310L94K33R71m80N077k51N51
7414F150o24m555k411N843L775K158L61J633J957k552j169R95k877o494p142k021
7398f973R24R34j158M460J892L539J538j766l759M219Q844o28l403K721J728n725
7382G387n571p056l638k587O049R003L029n243k309p16M004N140K041J681K40
7367A1454j785o435p033j361K613Q19j909N902O28p757j857j292M83P59M798Q02
$$ plain form
7351 -1171 -611 -893 1569 4479 7023 11263 12071 13389 12803 9101 7667 6863 4978 -3853 -4150 -2331
7335 -2331 1513 2136 -1995 -4628 2359 7754 10825 3693 -656 -487 -8153 -13745 -12647 -13258 -11751 -12637
7319 -12637 -14670 -11066 -10940 -6805 6684 11818 11688 10509 9437 13517 10124 5867 6541 5087 4703
7304 4703 4663 515 332 2056 -2101 -627 -2052 -4356 2204 362 -3228 -4970 1878 12140 14025
7289 14025 12455 11585 10002 8350 6698 7541 6658 4152 8316 3490 5561 768 -5421 -9580 -12080
7274 -12080 -7950 -6983 -9476 -7106 -7696 -11931 -9066 -4863 -12077 -11959 -10335 -16647 -10880 -8784 -9795
7259 -9795 -11217 -9034 -9871 -10708 -4785 8077 15572 15701 9827 9580 8821 1786 -1684 -2640 -2743 6693
7243 6693 12480 9756 6948 6603 4324 924 5325 2915 8358 8747 7959 2550 472 -4938 -3983 -6874
$$ packed form
7351a171N60k82K462K910K544M240Q08J318n86l702j434q04j885q831k97J819
7335b331L844O23m131k633O987N395L071p132m349J69p666n592J098o11J507q86
7319a2637k033L604J26M135J3489N134j30j179j072M080l393m257O74j454l84
7304D703m0m148j83J724m157J474j425k304O560j842l590j742O848J0262J885
7289A4025j570q70j583j652j652Q43q83k506M164m826K071m793o189m159k500
7274a2080M130R67k493K370n90m235K865M203p214J18J624o312N767K096j011
7259i795j422K183q37q37N923J2862P495J29n874k47p59p035l470r56j03R436
7243F693N787k724k808l45k279l400M401k410N443L89p88n409k078n410R55k891
$$ plain form
7227 -6874 -6050 -6915 -1277 -901 1862 1941 4425 10242 11080 9962 13834 12597 10116 7478 5692 7580
7211 7580 7596 5341 1915 -6129 -7330 2644 7075 10207 6852 5566 7462 5559 -276 -1441 -1203 -2498
7195 -2498 -21 3959 3951 4302 1883 4930 6041 2905 -2347 -5000 -219 1936 5268 9756 5321 119
7179 119 -3604 -2986 1037 4724 10328 10993 6943 3982 5639 8547 6430 -6748 -9434 -11491 -8837
7164 -8837 -11623 -11291 -8200 -943 -4162 -1278 1715 -1306 -2318 1472 6407 71 -4922 -1948 2375
7149 2375 11313 14336 11787 7124 -3266 -11051 -19903 -13397 -12012 -11892 -14448 -25278 -25703 -24063 -19471
7134 -19471 -15280 -12351 -8360 -2390 2860 4844 2668 518 3812 2717 -749 1575 9076 7087 1863
7119 1863 3313 -280 -6218 -11196 -6735 -4189 -5840 780 1075 4936 8202 6820 7609 8536 7836 7942
$$ packed form
7227f874Q24q65N638L76K763P9K484N817Q38j118L872j237k481k638j786J888
7211G580J6k255l426q044j201R974M431L132l355j286J896j903n835j165K38j295
7195b498K477L980qL51k419L047J111l136n252k653M781K155L332M488m435n202
7179A19l723O18M023L687N604O65m050k961J657K908k117j3178k686k057K654
7164h837k786L32L091P257l219K884K993l021j012L790M935o336m993K974M323
7149B375Q938L023k549m663j0390p785q852O506J385J20k556j0830m25J640M592
7134a9471M191K929L991N970N250J984k176k150L294j095l466K324P501j989n224
7119A863J450l593n938m978M461K546j651O620K95L861L266j382P89R27p00J06
$$ plain form
7103 7942 8350 4407 -3246 -1135 -8696 -15419 -12702 -9464 -3388 -3392 -2069 -4185 -5843 -11202 -3953 3044
7087 3044 6116 5989 8297 10134 9308 9781 13597 8027 4530 -7897 -7980 -8845 -13196 -11641 -8545 -5631
7071 -5631 -4189 -2120 -772 1952 7468 565 -10715 -10513 -4405 -514 1585 3565 2470 -3367 -11740
7056 -11740 -16291 -19745 -17695 -14969 -13607 -15024 -13956 -4901 -1670 -4081 -5202 78 -1130 -5439 -494
7041 -494 6096 12878 12141 8490 -198 -8546 -11139 -4074 4290 3435 1691 4107 6746 -1102 -5468 -1293
7025 -1293 6767 4554 -3023 2749 7363 9651 9467 10787 9499 8743 13389 10321 4069 1797 -3398
7010 -3398 -8591 -5349 3073 4647 465 -2155 -18 4510 3343 -3269 -4558 1577 2868 -1482 -5237
6995 -5237 -1446 -2874 -8221 -4281 -1991 -1500 -2241 2 4709 3814 -1791 -4301 3439 15663 20739
$$ packed form
7103G942M08l943p653K111p561o723K717L238O076mJ323k116j658n359P249O997
7087C044L072j27K308J837q26M73L816n570l497j2427q3q65m351J555L096K914
7071e631J442K069J348K724N516o903j1280K02O108L891K099J980j095n837q373
7056a1740m551l454K050K726J362j417J068R055L231k411j121N280j208m309M945
7041d94O590O782p37l651q688q348k593P065Q364q55j744K416K639p848m366M175
7025a293Q060k213p577N772M614K288j84J320j288p56M646l068o252k272n195
7010c398n193L242Q422J574m182k620K137M528j167o612j289O135J291m350l755
6995e237L791j428n347L940K290M91p41K243M707q95n605k510P740J2224N076
$$ plain form
6980 20739 14635 5235 1889 -290 -2362 -508 3409 4780 1942 -2740 -3278 -1955 -1683 -1861 -442
6965 -442 -1623 -4085 -5686 -8547 -11111 -1661 2468 -970 3948 3071 -202 3 1577 4979 3702 6598
6949 6598 2844 -12415 -18909 -14009 -10566 -8865 -2954 -5572 -7073 -9298 -10513 -8184 -6770 -2288 5232
6934 5232 7798 8264 7841 7192 1228 2533 7029 3108 787 -917 -1446 -2906 -1611 -6770 -11525 -10933
6918 -10933 -8121 -11264 -10793 -7843 -6701 -2833 -7512 -14648 -21825 -20641 -18650 -13291 -11809 -9359 -4311
6903 -4311 2602 536 -6657 -16516 -20676 -14349 -4741 -2022 12 423 131 -3391 -5782 -4914 -1791 436
6887 436 808 -3406 -3003 3588 6725 2118 6282 3758 384 -719 837 1729 -78 -1764 1710 2095
6871 2095 398 11 4207 3324 -954 467 -2085 -1526 -2127 -802 5443 6025 9894 5543 -1735 -5183
$$ packed form
6980B0739o104r400l346k179k072J854L917J371k838m682n38J323K72j78J419
6965d42j181k462j601k861k564R450M129l438M918q77l273K05J574L402j277K896
6949F598l754j5259o494M900L443J701N911k618j501k225j215K329J414M482P520
6934E232K566M66m23o49n964J305M496l921k321j704n29j460J295n159m755N92
6918a0933K812l143M71K950J142L868m679p136p177J184J991N359J482K450N048
6903d311O913k066p193r859m160O327R608K719K034M11k92l522k391Q68L123K227
6887D36L72m214M03O591L137m607M164k524l374j103J556Q92j807j686L474L85
6871B095j697l87M196q83m278J421k552N59o01J325O245N82L869m351p278l448
$$ plain form
6855 -5183 -3928 3953 10836 10389 8506 6200 12899 17065 19693 23920 21928 19478 20530 17939 8730
6840 8730 3548 2261 3934 8428 4617 2124 10730 16275 16270 17995 18118 15492 22197 29647 34366 37191
6824 37191 47809 69205 94024 110612 112084 104435 92432 79787 71782 67319 79373 104530 136214
6811 136214 148204 141509 126930 106069 87458 81625 80964 90511 107973 133381 162595 183194 202716
6798 202716 220428 237971 253151 280951 326015 399361 499611 625841 739788 789378 768816
6787 768816 679469 552877 418970 308320 233596 177307 136176 108921 93200 81128 71591
6776 71591 61940 58393 56596 56292 51336 41527 30500 26766 27338 29140 34048 35055 39237 37933 22506
6761 22506 12723 6292 2008 2963 11635 12200 11744 12980 11525 5578 2789 2451 10469 13493 13477 17021
$$ packed form
6855e183J255P881O883m47j883k306O699M166K628M227j992k450J052k591r209
6840H730n182j287J673M494l811k493Q606N545nJ725J23k626O705P450M719K825
6824C7191J0618K1396K4819J6588J472p649j2003j2645q005m463J2054K5157L1684
6811A36214J1990o695j4579k0861j8611n833o61R547J7462K5408K9214K0599J9522
6798B02716J7712J7543J5180K7800M5064P3346J00250J26230J13947M9590k0562
6787G68816q9347j26592j33907j10650p4724n6289m1131k7255j5721j2072r537
6776G1591r651l547j797l04m956r809j1027l734N72J802M908J007M182j304j5427
6761B2506r783o431m284R55Q672N65m56J236j455n947k789l38Q018L024j6L544
$$ plain form
6745 17021 18178 10040 6694 7998 9459 -612 -4468 -651 -5359 1267 5034 5076 3377 2618 -704
6730 -704 -2119 -3086 -5683 -2379 4474 3164 1106 5474 11538 12424 8906 3849 73 -1527 2879 2346
6714 2346 1695 3297 6640 13558 13086 12450 12649 11580 6521 2390 -25 5298 5240 9814 11109 10084
6698 10084 3694 4310 7836 4619 798 3269 3150 4925 8225 6995 2133 3975 6596 3046 -524
6683 -524 -1260 2009 -1538 475 3081 9598 4958 1861 2975 4518 -180 -5746 -14059 -16893 -14857
6668 -14857 -13330 -10480 -9905 -11551 -11636 -8316 -8584 -8713 -7737 -7631 -8704 -6538 -8047 1868 4308 165
6652 165 1255 -3834 -4 -2135 -4606 -6038 -8009 -8185 -10199 -9369 -9480 -8008 -8494 -5455 4314 5875
6636 5875 6363 4843 9670 11970 10753 8238 4853 2191 8160 7863 9735 10218 2943 600 -3683 323
$$ packed form
6745A7021J157q138l346J304J461j0071l856L817m708O626L767M2j699p59l322
6730g04j415r67k597L304O853j310k058M368O064Q86l518n057l776j600M406n33
6714B346o51J602L343O918m72o36J99j069n059m131k415N323n8M574J295j025
6698A0084o390O16L526l217l821K471j19J775L300j230m862J842K621l550l570
6683e24p36L269l547K013K606O517m640l097J114J543m698n566q313k834K036
6668a4857J527K850N75j646q5L320k68j29R76J06j073K166j509R915K440m143
6652A65J090n089L830k131k471j432j971j76k014Q30j11J472m86L039R769J561
6636E875M88j520M827K300j217k515l385k662N969k97J872M83p275k343m283M006
$$ plain form
6620 323 9669 14619 16617 15991 12869 6792 702 -3562 -7 4055 2591 6788 7364 1374 -4454 238
6604 238 2736 -1841 -802 -4148 -12375 -13758 -7947 -840 -1739 -3373 -4452 -6551 -1415 3108 2592 -3818
6588 -3818 -6789 -7639 -3375 -4531 -10513 -14218 -10544 -9946 -10115 -6883 -7116 -14397 -13831 -8911 -3380 807
6572 807 2392 1351 402 4929 12382 11847 11851 7243 765 -2295 -2542 -1431 10 -7460 -12005 -7414 -3716
6555 -3716 -8962 -14120 -6170 2508 6779 0 -4575 -7804 -11265 -11776 -11150 -10625 -11873 -12046 -12800 -11813
6539 -11813 -13098 -10431 -7192 -5747 -7054 -6998 -7352 -7066 -5653 -11239 -14933 -15435 -11949 -12225 -6446 -691
6523 -691 4043 910 -1125 -6562 -8911 -2056 -1853 -4195 -3900 -1246 -1930 -11319 -13976 -12419 -9564 -9023
6507 -9023 -10009 -1790 2847 2180 5706 9237 12870 10824 6175 1560 2117 -173 -1380 -5542 -5615 -5368
$$ packed form
6620C23R346M950J998o26l122o077o090m264L555M062j464M197N76n990n828M692
6604B38K498m577J039l346q227j383N811P107q99j634j079k099N136M523n16o410
6588c818k971q50M264j156n982l705L674N98j69L232k33p281N66M920N531M187
6572H07J585j041r49M527P453n35Mm608o478l060k47J111J441p470m545M591L698
6555c716n246n158P950Q678M271o779m575l229l461n11O26N25j248j73p54R87
6539a1813j285K667L239J445j307N6l54K86J413n586l694n02L486k76N779N755
6523f91M734l133k035n437k349O855K03k342K95K654o84r389k657J557K855N41
6507i023r86Q219M637o67L526L531L633k046m649m615N57k290j207m162p3K47
$$ plain form
6491 -5368 -6784 -12767 -13552 -12594 -7003 -4589 -2658 -2987 -5378 -10356 -10908 -11571 -14135 -8787 1778 11891
6475 11891 12493 4534 206 -7823 -9624 -14864 -13921 -12584 -11823 -10826 -8062 -7279 -1725 -284 3747 9259
6459 9259 5271 1758 5676 9776 6980 2424 3604 5480 3816 7571 3994 -1463 -7696 -11857 -10840
6444 -10840 -6722 -10095 -18717 -22056 -21743 -24751 -18143 -6159 322 9175 13634 8981 816 -4744 -16472
6429 -16472 -24980 -25399 -20532 -10095 -10011 -16576 -11753 -8007 -6182 -2401 878 5501 -1727 -2697 -387
6414 -387 -836 -1430 -2676 4015 5583 4305 3749 270 -8035 -7728 -10578 -11900 -9755 -9145 -8226 -5183 -2780
6397 -2780 -750 -263 5435 7869 3797 5264 2912 -2155 -4838 -3357 -3243 -1472 -3736 -7292 -9778
6382 -9778 -12226 -13748 -9847 -7891 -9216 -9007 -7190 -4897 -3105 -8236 -9620 -4969 1131 6278 5407
$$ packed form
6491e368j416n983p85R58N591K414J931l29k391m978n52o63k564N348J0565J0113
6475A1891O02p959m328q029j801n240R43J337P61R97K764P83N554J441M031N512
6459I259l988l513L918M100k796m556J180J876j664L755l577n457o233m161J017
6444a0840M118l373q622l339L13l008O608J1984O481Q853M459m653q165n560j1728
6429a6472q508m19M867J0437Q4o565M823L746J825L781L279M623p228r70K310
6414c87m49n94j246O691J568j278n56l479q305L07k850j322K145O10R19L043K403
6397b780K030M87N698K434m072J467k352n067k683J481J14J771k264l556k486
6382i778k448j522L901J956j325K09J817K293J792n131j384M651O100N147q71
$$ plain form
6367 5407 4933 7 1907 7824 8212 5458 8538 7067 9794 8067 -2351 -9130 -10370 -7582 -3581
6352 -3581 138 4291 4838 5817 1525 -2851 -664 -332 -10042 -13211 -5924 -852 1398 3110 3169 -239
6336 -239 -7169 -5527 -2653 -5841 -7103 -1231 373 -4435 -8888 -8526 -3140 -1931 -1724 -2470 -4394 -440
6320 -440 -417 -4319 -11375 -8328 1543 2449 -6641 -6393 -5843 -9532 -9332 -11770 -18928 -15185 -7432 -2483 -4968
6303 -4968 -3317 580 2190 -2405 241 1884 2273 -2872 -7448 -10443 -12138 -12375 -9034 -7300 -12242
6288 -12242 -8630 -7895 -5944 -8539 -11790 -11712 -8127 -7009 -7222 -8681 -5558 335 -4050 -5778 -6145 -4001
6272 -4001 868 2032 -24 -4630 -2342 -4680 -5927 467 -333 -3460 -9723 -11958 -6042 6041 7364
6257 7364 7417 3760 4066 2343 5420 6928 5784 8829 5299 1932 -3276 -7671 -13829 -11343 -9265 -13899
$$ packed form
6367E407m74m926J900N917L88k754L080j471K727j727j0418o779j240K788M001
6352c581L719M153N47R79m292m376K187L32r710l169P287N072K250J712N9l408
6336b39o930J642K874l188j262N872J604m808m453L62N386J209K07p46j924L954
6320d40K3l902p056L047R871R06r090K48N50l689K00k438p158L743P753M949k485
6303d968J651L897J610m595K646J643L89n145m576k995j695k37L341J734m942
6288a2242L612P35J951k595l251P8L585J118k13j459L123N893m385j728l67K144
6272d001M869J164k056m606K288k338j247O394q00l127o263k235N916J2083J323
6257G364N3l657L06j723L077J508j144L045l530l367n208m395o158K486K078m634
$$ plain form
6241 -13899 -8386 -2874 2991 1420 1001 -677 359 2984 2637 -515 -2547 -5600 -7000 -10 -1917
6226 -1917 -6085 -6461 -7848 -9940 -15205 -12370 -393 8479 8205 -3617 -8093 -8926 -10832 -6394 -2872
6211 -2872 -7907 -10417 -7067 853 3793 841 -810 -926 -219 748 -1873 -648 -4484 -6389 -4330 -1849
6195 -1849 -514 7608 5574 3668 4909 1567 -161 -10625 -7228 1922 594 3857 6593 661 2583
6180 2583 5129 5241 2029 7295 8539 7144 3671 5522 2802 -2215 -1881 -4999 -10253 -6822 -4721
6165 -4721 -1657 -2004 -1084 201 -1253 -6249 -6676 -6454 -8945 -9207 -3879 645 -2371 -5589 -8503 -8915
6149 -8915 -5246 -1006 -4597 -3617 6098 3765 -5255 -10202 -12099 -14354 -15582 -12855 -8519 -1297 -5087
6134 -5087 -13876 -18045 -15885 -15849 -11178 -9759 -4551 -4106 -8319 -6829 -2653 -1791 -4249 -3177 -73 -74 5196
$$ packed form
6241a3899N513N512N865j571m19j678J036K625l47l152k032l053j400O990j907
6226a917m168l76j387k092n265K835J1977Q872k74j1822m476q33j906M438L522
6211b872n035k510L350P920K940k952j651j16P07R67k621J225l836j905K059K481
6195a849J335Q122k034j906J241l342j728j0464L397R150j328L263K736n932J922
6180B583K546J12l212N266J244j395l473J851k720n017L34l118n254L431K101
6165d721L064l47R20J285j454m996m27K22k491k62N328M524l016l218k914m12
6149h915L669M240l591R80R715k333r020m947j897k255j228K727M336P222l790
6134e087q789m169K160L6M671J419N208M45m213J490M176Q62k458J072L104jN270
$$ plain form
6117 5196 4650 -2070 -8130 -11864 -4242 2087 -2395 -6291 -3683 -2133 -78 -5789 -10222 -5070 -620
6102 -620 -2500 -4070 4556 7321 -3299 -11558 -8902 -12165 -9802 -11700 -10652 -9374 -3758 7009 8179
6087 8179 3284 1078 -1077 767 -3489 -6189 -6419 -9490 -16565 -15440 -7128 -5147 -6330 -11522 -6845
6072 -6845 -7201 -10983 -8581 -1973 5371 11998 11371 7411 4518 1802 -6415 -12189 -10476 -4661 -4536 -10126
6056 -10126 -7525 -3350 -2283 2685 -3301 -3402 -4316 -7117 -10981 -6477 755 3982 94 797 1467 6109
6040 6109 8080 5801 6498 1362 3052 2255 1165 -753 -7455 -7733 -3236 -72 654 2592 3887 537
6024 537 -4634 -7426 -9693 -13398 -13939 -13433 -6013 2477 5888 -366 -6138 -3236 -5768 -5323 -4582 -3608
6008 -3608 -1469 -2130 -8852 -8094 -2102 -6460 -6770 -1681 -4443 -1000 -1042 -6675 -6377 -4625 -5137 391 -223
$$ packed form
6117E196n46o720o060l734P622O329m482l896K608J550K055n711m433N152M450
6102f20j880j570Q626K765j0620q259K656l263K363j898J048J278N616J0767J170
6087H179m895k206k155J844m256k700k30l071p075J125Q312J981j183n192M677
6072f845l56l782K402O608P344O627o27l960k893k716q217n774J713N815J25n590
6056a0126K601M175J067M968n986j01r14k801l864M504P232L227l888P03O70M642
6040F109J971k279O97n136J690p97j090j918o702k78M497L164P26J938J295l350
6024E37n171k792k267l705n41N06P420Q490L411o254n772K902k532M45P41R74
6008c608K139o61o722P58N992m358l10N089k762L443m2n633K98J752n12N528o14
$$ plain form
5991 -223 -7334 -5249 -6118 -8684 -5038 -2219 -1662 -3243 -9612 -9670 -12115 -15787 -16007 -12352 -10229 -3761
5975 -3761 -570 -1358 -7524 -5701 -1861 -6341 -7324 -5130 -7848 -10178 -14030 -9817 -6041 -4558 -3568 -2493
5959 -2493 -1270 -4233 -4042 -9045 -15948 -18698 -14343 -10387 -6231 -8923 -8090 -8881 -10027 -11440 -143
5944 -143 7848 14314 10601 6856 10402 18486 18721 6444 7228 13032 12349 14335 14239 15076 8520 -2220
5928 -2220 -11539 -14585 -18257 -12160 -5690 -5536 -10686 -8656 -7430 -5993 -3701 -7079 -12128 -9360 -2786
5913 -2786 -3779 -10813 -13244 -15958 -12248 -10227 -13428 -15360 -11815 -4348 -3510 -7699 -5348 -5309 -11005 -13297
5897 -13297 -16332 -10156 -7742 -7759 -10667 -11650 -12337 -4508 5054 12644 17495 15471 14459 13879 14803 18649
5881 18649 18851 14805 13967 10105 5231 862 262 -5217 -8249 -4649 -3172 -1647 -2676 -5135 -5088 -1941
$$ packed form
5991b23p111K085q69k566L646K819N57j581o369n8k445l672k20L655K123O468
5975c761L191p88o166J823L840m480r83K194k718k330l852M213L776J483R90J075
5959b493J223k963J91n003o903k750M355L956M156k692Q33p91j146j413J1297
5944a43P991O466l713l745L546Q084K35j2277P84N804o83J986r6Q37o556j0740
5928b220r319l046l672O097O470J54n150K030J226J437K292l378n049K768O574
5913b786r93p034k431k714L710K021l201j932L545P467Q38m189K351L9n696k292
5897a3297l035O176K414j7k908r83o87P829R562P590M851k024j012n80R24L846
5881A8649K02m046q38l862m874m369o00n479l032L600J477J525j029k459M7L147
$$ plain form
5865 -1941 -3457 -7205 -5017 -1935 -4092 -8929 -13659 -15320 -17310 -15368 -15765 -14759 -10572 -10739 -10911 -10832
5849 -10832 -10279 -12195 -8096 -8950 -10800 -4070 187 -5370 -12241 -17951 -15274 -16723 -20465 -17078 -12101
5834 -12101 -18974 -21150 -20932 -16101 -9372 -4469 -6151 -6116 -2421 50 -3586 -5303 -529 853 4971
5819 4971 451 -6639 -6942 -6634 -7814 -9194 112 3683 1599 3653 3408 -825 -1562 -696 -4682 -2450
5803 -2450 2981 6147 5620 10055 15834 12018 14659 12151 8497 4450 -3330 -3427 -4361 -8312 -9949 -1417
5787 -1417 3157 3645 3592 -2595 -5310 -4710 528 5096 1683 2909 1088 -1620 -4318 -1256 5 994
5771 994 -3748 -8184 -15372 -18838 -11473 -7585 -6698 -5661 -6044 -2779 -5796 -6529 -10675 -7341 -3642 231
5755 231 -2302 -1727 -761 -2116 -5268 -423 -9379 -6643 866 780 3004 -3087 -7248 -6615 -4940 -6146
$$ packed form
5865a941j516l748K188L082k157m837m730j661j990J942l97J006M187j67j72P9
5849a0832N53j916M099q54j850O730M257n557o871n710K677j449l742L387M977
5834a2101o873k176K18M831O729M903j682L5L695K471l636j717M774J382M118
5819D971m520p090l03L08j180j380R306L571k084K054k45m233p37Q66l986K232
5803b450N431L166n27M435N779l816K641k508l654m047p780r7r34l951j637Q532
5787a417M574M88n3o187k715O00N238M568l413J226j821k708k698L062J261R89
5771I94m742m436p188l466P365L888Q87J037l83L265l017p33m146L334L699L873
5755B31k533N75R66j355l152M845q956K736P509q6K224o091m161O33J675j206
$$ plain form
5739 -6146 -334 8530 11706 7244 1045 -638 -5202 -2625 143 -213 6321 4627 -1463 -8313 -3788
5724 -3788 1844 -4115 -2593 1161 6729 5083 -1765 980 -2160 -2339 3431 5006 -4472 -4377 -800 -3744
5708 -3744 -2629 -2553 -1787 534 -2850 -8930 -7610 -9172 -9450 -13314 -18162 -16351 -15616 -18299 -9906 -2226
5692 -2226 -1457 647 -1434 -4807 -8449 -3150 -2162 -5981 -15034 -17696 -13319 -15354 -17606 -13468 -7335
5677 -7335 -4715 -1081 97 -922 -492 -7275 -9967 -9112 -4333 -487 -3572 -9376 -6490 560 480 -3370
5661 -3370 -503 3732 2254 4380 4666 2653 -802 -4065 984 2515 5223 -892 -5123 -8318 -10433
5646 -10433 -13061 -13344 -9651 -8897 -14834 -10278 -9865 -12127 -19035 -16998 -7027 -4256 -4568 -51 2392 6771
5630 6771 10117 8397 5169 1880 2287 -2217 -6651 -8828 -11901 -11001 -9889 -1047 -2375 -1989 -1610 763
$$ packed form
5739f146N812Q864L176m462o199j683m564K577K768l56O534j694o090o850M525
5724c788N632n959J522L754N568j646o848K745l140j79N770J575r478R5L577k944
5708c744J115P6P66K321l384o080J320j562k78l864m848J811P35k683Q393P680
5692b226P69K104k081l373l642N299R88l819r053k662M377k035k252M138O133
5677g335K620L634J178j019M30o783k692Q55M779L846l085n804K886P050q0l850
5661c370K867M235j478K126K86k013l455l263N049J531K708o115m231l195k115
5646a0433k628k83L693P54n937M556M13k262o908K037R971K771l12M517K443M379
5630F771L346j720l228l289M07m504m434k177l073R00J112Q842j328L86L79K373
$$ plain form
5614 763 4461 1814 -2159 -4833 -7913 -7928 -10454 -12895 -10154 -3749 142 -792 1685 5261 3274 6312
5598 6312 8283 1118 -3898 -3028 -2649 -4522 -8402 -6338 -4079 -2685 2382 5486 11676 19176 12292
5583 12292 9781 6765 2663 4018 6470 8681 3033 -827 -1931 -4938 -1069 -3842 -3223 2301 -1539
5568 -1539 -3140 -3740 -3565 -1710 4726 4289 1641 -1981 -2162 -5330 -12860 -12721 -10076 -3385 -3006 -1871
5552 -1871 -1197 -4330 -5773 -5517 -6460 -5981 -4308 -2745 -4218 -4190 1763 -3019 -5454 -9712 -10602 -3257 81
5535 81 5081 9420 3384 -1932 -6298 -5952 -1441 -8449 -9321 -3660 -6315 -11769 -15926 -18403 -20571 -17191
5519 -17191 -20583 -17331 -15473 -16298 -8714 -3023 1454 4431 2244 -1338 -1445 -3846 -2192 -3170 -574
5504 -574 -1218 -2755 -1560 1523 -1196 -3238 -2285 -4152 -10625 -13846 -13802 -13715 -7859 -4874 -1740 -1450 -5474
$$ packed form
5614G63L698k647l973k674l080j5k526k441K741O405L891r34K477L576j987L038
5598F312J971p165n016Q70L79j873l880K064K259J394N067L104O190P500o884
5583A2292k511l016m102J355K452K211n648l860j104l007L869k773O19N524l840
5568a539j601o00J75J855O436m37k648l622j81l168p530J39K645O691L79J135
5552a871O74l133j443K56r43M79J673J563j473K8N953m782k435m258q90P345L338
5535H1N000M339o036n316m366L46M511p008q72N661k655n454m157k477k168L380
5519a7191l392L252J858q25P584N691M477K977k187l582j07k401J654r78K596
5504e74o44j537J195L083k719k042R53j867o473l221M4Q7N856K985L134K90m024
$$ plain form
5487 -5474 -7910 -11239 -9225 -9028 -11427 -11403 -8393 -7714 -9237 -14559 -15663 -13534 -11268 -9346 -12217 -8525
5471 -8525 -3232 -5738 -8479 -3050 -2834 -4184 -11372 -14257 -12677 -12788 -6293 -4658 -7669 -7049 -5357 -6740
5455 -6740 -10020 -11085 -17415 -15322 -3613 2127 -4514 -5318 3460 5203 -3987 -4816 -169 338 -2437
5440 -2437 -6816 -7188 -3966 -4577 -7607 -10514 -10580 -9813 -10873 -9543 -7934 -7492 -9060 -6665 -5639 597
5424 597 2531 -39 940 4638 4278 -948 4075 7943 4770 2035 5277 5072 6630 6333 3418 4701
5408 4701 3959 -6917 -8518 -5038 3319 404 -6246 -4798 -8613 -11177 -12101 -9949 -4503 -641 -1247
5393 -1247 1278 937 -8994 -8133 -6757 -5757 -5606 -4288 -6684 -1401 1854 2516 1958 2713 -3433 -7227
5377 -7227 -5195 -4531 -2810 -5897 -16651 -17794 -15264 -14883 -11573 -3753 1225 2727 -438 -759 4 -5218
$$ packed form
5487e474k436l329K014J97k399K4L010O79j523n322j104K129K266J922k871L692
5471h525N293k506k741N429K16j350p188k885J580j11O495J635l011O20J692j383
5455f740l280j065o330K093J1709N740o641q04Q778J743r190q29M647N07k775
5440b437m379l72L222o11l030k907o6P67j060J330J609M42j568K395J026O236
5424E97J934k570R79L698l60n226N023L868l173k735L242k05J558k97k915J283
5408D701p42j0876j601L480Q357k915o650J448l815k564r24K152N446L862o06
5393a247K525l41r931Q61J376J000J51J318k396N283L255O62n58P55o146l794
5377g227K032O64J721l087j0754j143K530L81L310P820M978J502l165l21P63n222
$$ plain form
5361 -5218 -5583 -8125 -8806 -10033 -12805 -17240 -17276 -15625 -16736 -18183 -12391 -4797 -5749 2060 7428 6753
5345 6753 10716 10953 7750 11912 12323 15183 7882 -4082 -6400 -7034 -6077 -6560 -5656 -1910 5741 6909
5329 6909 2046 4999 2993 -8084 -14152 -17344 -9279 253 -2993 -3472 -1523 661 -2139 -9215 -10868
5314 -10868 -2625 3993 7155 3737 1375 -630 -2364 -4352 -6563 -2230 6602 15723 13648 10194 8169
5299 8169 3158 -7711 -15794 -16378 -14234 -4579 6362 7477 12482 10188 4045 6041 9326 7808 458
5284 458 -5317 -10312 -20747 -22842 -20497 -9346 -3113 -164 -2677 -8681 -6811 -2754 -1162 -939 -1407
5269 -1407 -6055 -8054 -351 3224 -160 -5478 -766 7924 10043 10664 5234 537 502 1129 -2964 -4639
5253 -4639 -8103 -11442 -5595 -10359 -7641 -4086 -1717 -2720 -5874 -7565 -11587 -9450 -8952 -11724 -16098
$$ packed form
5361e218l65k542o81j227k772m435l6J651j111j447N792P594r52P809N368o75
5345F753L963K37l203M162M11K860p301j1964k318o34R57m83R04L746P651J168
5329F909m863K953k006j1077o068l192Q065R532l246m79J949K184k800p076j653
5314a0868Q243O618L162l418k362k005j734j988k211M333Q832R121k075l454k025
5299H169n011j0869q083n84K144R655J0941J115N005k294o143J996L285j518p350
5284D58n775m995j0435k095K345J1151O233K949k513o004J870M057J592K23m68
5269a407m648j999P703L575l384n318M712Q690K119O21n430m697l5O27m093j675
5253d639l464l339N847m764K718L555K369j003l154j691m022K137M98k772m374
$$ plain form
5238 -16098 -10537 -13771 -16662 -14505 -8610 -8425 -10146 -7952 -7313 -7064 -771 -1086 -3306 -3905 1586 7079
5222 7079 -1710 -9465 -15564 -19615 -19780 -18053 -16783 -14427 -4371 1558 5934 8767 4669 -546 -5213
5207 -5213 -3515 2021 1956 2991 1322 2545 -3199 -3076 135 -1649 2052 3913 -1734 -341 7878 9946
5191 9946 6150 5295 8724 5094 4701 8850 7746 10662 9663 6545 2760 1849 9930 11668 5373 2270
5175 2270 597 -846 -2087 -2902 2433 1410 2951 -1690 1645 3569 3829 -3365 -7708 -3598 -2061
5160 -2061 3295 -1282 -5607 -3252 4237 436 -5304 -7168 -4416 -2341 -1095 -2593 -2249 -9707 -11334
5145 -11334 -7934 -2929 -4890 -2851 1672 3533 4192 137 -577 -2705 -3713 -5590 -3430 -3184 -2684 -834
5129 -834 -194 3236 447 -5521 -687 1799 1712 -213 1372 93 4237 6324 10702 8552 2604 4577
$$ packed form
5238a6098N561l234k891K157N895J85j721K194O39K49O293l15k220n99N491N493
5222G079q789p755o099m051j65J727J270K356J0056N929M376K833m098n215m667
5207e213J698N536o5J035j669J223n744J23L211j784L701J861n647J393Q219K068
5191I946l796q55L429l630l93M149j104K916r99l118l785r11Q081J738o295l103
5175B270j673j443j241q15N335j023J541m641L335J924K60p194m343M110J537
5160b061N356m577m325K355P489l801n740j864K752K075J246j498L44p458j627
5145a1334L400N005j961K039M523J861O59m055p14k128j008j877K160K46N00J850
5129h34O40L430k789n968M834K486q7j925J585j279M144K087M378k150n948J973
$$ plain form
5113 4577 6120 7939 4211 4106 6312 5791 -5528 -4713 2334 2646 4399 2659 4149 1141 -5358 -5060
5097 -5060 -1413 -190 -1338 -4359 -3381 -181 -374 676 -4518 -8529 -10127 -10144 -12638 -9909 -5812 -4051
5081 -4051 -7481 -8642 -3510 -2382 -6535 -9332 -9758 -9478 -8127 -9105 -5481 -5382 -4026 -3711 -4587 -1339 -5473
5064 -5473 -4834 -3234 -4137 -2341 3755 6490 5397 -1164 -4880 -8675 -13003 -11784 -12365 -8986 -5533 -4774
5048 -4774 -7025 -11451 -17956 -11761 -9860 -6956 -4084 -6718 -6413 -6913 -7391 -7999 -3634 -10774 -14082 -9812
5032 -9812 -7903 -2379 3884 -3018 -4512 -1926 -3037 -2141 -368 2429 417 762 5817 8403 4370
5017 4370 864 2666 -2297 -1822 3337 -256 -2886 -3758 -1848 -1172 -6351 -11123 -8677 -1162 3098 5255
5001 5255 4387 1992 4865 468 -5234 -5111 -4000 3396 1209 6979 5592 -811 4575 9575 10855
$$ packed form
5113D577J543J819l728j05K206n21j1319Q15P047L12J753j740J490l008o499K98
5097e060L647J223j148l021R78L200j93J050n194m011j598j7k494K729M097J761
5081d051l430j161N132J128m153k797m26K80J351r78L624R9J356L15q76L248m134
5064e473O39J600r03J796O096K735j093o561l716l795m328J219n81L379L453P59
5048d774k251m426o505O195J901K904K872k634L05n00m78o08M365p140l308M270
5032i812J909N524O263o902j494K586j111Q96J773K797k012L45N055K586m033
5017D370l506J802m963M75N159l593k630q72J910O76n179m772K446P515M260K157
5001E255q68k395K873m397n702J23J111P396k187N770j387o403N386N000J280
$$ plain form
4986 10855 7482 -1187 -1658 888 4148 6414 4944 4614 -3218 -6139 -6772 -12861 -21954 -22096 -19906 -17325
4970 -17325 -13966 -8288 -5923 -9752 -12598 -10886 -3868 -410 2081 -911 1074 1675 -5720 -8905 -10090
4955 -10090 -4810 1515 3519 5571 9441 11617 9313 1552 -2292 -5011 -7585 -10400 -18103 -14209 -5879
4940 -5879 -4838 2615 12375 11735 8286 11424 14379 12767 13014 9952 8200 12204 18251 17176 10565
4925 10565 7186 6256 1230 727 -3581 -3965 -4790 -5777 -5400 -5299 -3152 -4365 -2426 3809 7382 2200
4909 2200 -1706 1035 3860 4384 1159 -4806 -12596 -18250 -18443 -11032 -6307 -6411 -4943 -6335 -8555 -11936
4893 -11936 -10815 -11197 -15334 -13295 -15854 -12263 -12966 -16010 -14224 -9651 -6559 -2269 1586 12299 13249
4878 13249 14197 15619 22041 24165 16693 4367 3758 5291 8078 4491 -1802 -3993 -2053 -995 -3331
$$ packed form
4986A0855l373q669m71K546L260K266j470l30p832k921o33o089r093j42K190K581
4970a7325L359N678K365l829k846J712P018L458K491k992J985O01p395l185j185
4955a0090N280O325K004K052L870K176k304p761l844k719k574k815p703L894Q330
4940e879J041P453R760o40l449L138K955j612K47l062j752M004O047j075o611
4925A0565l379r30n026n03m308l84q25r87L77J01K147j213J939O235L573n182
4909B200l906K741K825N24l225n965p790n654j93P411M725j04J468j392k220l381
4893a1936J121l82m137K039k559L591p03l044J786M573L092M290L855J0713R50
4878A3249R48J422O422K124p472j2326o09J533K787l587o293k191J940J058k336
$$ plain form
4863 -3331 612 2529 -5910 -5939 -5291 -3360 -879 3256 8216 4538 691 -6590 -7446 -4296 3802 37
4847 37 -5801 -2782 -5393 -3025 -3647 -3019 -5846 -2459 -1868 -6363 -3190 363 3500 2560 -2990 -3387 -1022
4830 -1022 -1680 -2225 -1278 -5407 -7550 -7138 -3787 -4327 -3636 -3927 -6364 -5507 -9172 -10428 -9598 -1253 4122
4813 4122 4531 1610 2772 2233 3096 1761 866 3399 4068 2387 -3338 -8011 -6925 -6267 -7430 -5375
4797 -5375 -3358 -9715 -16187 -18263 -16391 -10065 -8382 -11309 -10709 -13031 -14260 -6402 1225 8314 8426
4782 8426 9213 10330 6736 -909 -901 1835 3560 -1303 845 1340 -2788 -5859 -849 -447 2488 6342
4766 6342 8640 7008 5418 4101 1966 7129 9293 7261 2587 304 60 -472 3935 1020 799 -2084
4750 -2084 1134 2796 4242 7431 7975 8604 6504 1811 -3575 -1490 -2592 -6875 -2154 551 2599
$$ packed form
4863c331L943J917q439k9O48J931K481M135M960l678l847p281q56L150Q098l765
4847C7n838L019k611K368o22O28k827L387N91m495L173L553L137r40n550l97K365
4830a022o58n45R47m129k143M12L351n40O91k91k437Q57l665j256Q30Q345N375
4813D122M09k921J162n39Q63j335q95K533O69j681n725m673J086O58j163K055
4797e375K017o357o472k076J872O326J683k927O00k322j229P858P627P089J12
4782H426P87J117l594p645QK736J725m863K148M95m128l071N010M02K935L854
4766F342K298j632j590j317k135N163K164k032m674k283k44n32M407k915k21k883
4750b084L218J662J446L189N44O29k100m693n386K085j102m283M721K705K048
$$ plain form
4735 2599 3241 4337 5361 3658 6968 7716 7904 84 -6857 -6144 -4045 -9361 -10102 -1615 -1486 2209
4719 2209 -2230 -5392 -2522 -521 -3601 -849 4471 669 -2825 -90 6594 7397 6112 7599 6686
4704 6686 6330 8536 10147 1593 -5723 -7453 -656 -687 -1398 7130 7366 5651 279 -4544 -6826 -8910
4688 -8910 -13192 -7785 -2102 -568 -10431 -18925 -15984 -7860 -5731 -988 -4898 -4589 -4191 -4436 -1731 2660
4672 2660 6785 7525 2812 -5517 -4680 20 -435 -3166 4057 2449 668 -9664 -15968 -11951 -4320
4657 -4320 1485 611 -2127 162 -5070 -1612 4901 3075 2285 -1867 -6258 -1543 1830 7359 8102 3372
4641 3372 3002 -660 -4343 -9377 -14917 -16285 -4762 6861 16086 17706 22391 23888 22383 17552 4062
4626 4062 -10562 -17721 -17957 -17141 -7179 2104 5741 5630 923 2133 9703 9942 11279 7798 -1101 -1858
$$ packed form
4735B599O42J096J024j703L310P48J88p820o941P13K099n316p41Q487J29L695
4719B209m439l162K870K001l080K752N320l802l494K735O684Q03j285J487r13
4704F686l56K206J611q554p316j730O797l1p11Q528K36j715n372m823k282k084
4688h910m282N407N683J534r863q494K941Q124K129M743l910L09L98k45K705M391
4672B660M125P40m713q329Q37M700m55k731P223j608j781j0332o304M017P631
4657d320N805q74k738K289n232L458O513j826p90m152m391M715L373N529P43m730
4641C372l70l662l683n034n540j368J1523J1623R225J620M685J497j505m831j3490
4626D062j4624p159k36Q16R962R283L637j11m707J210P570K39J337l481q899p57
$$ plain form
4610 -1858 2561 5153 5500 5676 4221 1307 3971 3846 2433 2664 2252 4646 6284 2221 2262 -516 -3074
4593 -3074 -4351 3100 1400 -3125 -4082 -9353 -8595 -14243 -21915 -21893 -22762 -13586 -5941 -2223 9040 17417
4577 17417 15816 8428 -912 -2515 287 -283 -3595 -8721 -5702 -1545 -3962 1496 7404 7723 3062
4562 3062 -7508 -8624 -7045 -5237 -6621 -9868 -9138 -8227 -7747 -11487 -13477 -10702 -11940 -10380 -9306
4547 -9306 -1557 -412 -1955 2473 -1305 -4155 -4192 -62 3300 5719 4424 4270 5601 12208 15148 15236
4531 15236 7735 155 -3367 -4810 -1111 3364 -2125 -3252 -5362 -8555 -1930 -2471 -4384 -798 2118
4516 2118 6639 15640 15359 8838 2205 1148 4421 6768 4884 1263 -5874 -8821 -12193 -6684 2721
4501 2721 4014 310 -2665 -3675 -2290 -1733 -220 3057 -423 -3543 -3370 -4480 -8097 -11808 -9709
$$ packed form
4610a858M419K592L47J76j455k914K664j25j413K31m12K394J638m063M1k778k558
4593c074j277P451j700m525r57n271P58n648p672K2q69R176P645L718J1263Q377
4577A7417j601p388r340j603K802n70l312n126L019M157k417N458N908L19m661
4562C062j0570j116J579J808j384l247P30R11M80l740j990K775j238J560J074
4547i306P749J145j543M428l778k850l7M130L362K419j295j54J331O607K940Q8
4531A5236p501p580l522j443L699M475n489j127k110l193O625n41j913L586K916
4516B118M521R001k81o521o633j057L273K347j884l621p137k947l372N509R405
4501B721J293l704k975j010J385N57J513L277l480l120J73j110l617l711K099
$$ plain form
4486 -9709 -6452 -6406 -2656 998 -2397 -6027 -8350 -9237 -4961 -2790 -7524 -9995 -10446 -7739 -10691 -10247
4470 -10247 -8673 -9419 -9368 -6812 -267 283 685 -2738 -6415 -3217 1116 6551 10025 15660 16342 12781
4454 12781 4864 -6903 -4278 1424 396 -6501 -6961 -547 1878 -2433 -6523 -6763 -7573 -8671 -5833
4439 -5833 -10058 -7537 -4960 -4230 -3037 2213 -386 -4463 -3765 -3993 3175 1655 -2625 2618 -196 -2481
4423 -2481 -9312 -8689 -2898 389 -1449 -1571 3165 5092 2397 -5229 -2935 1843 555 -6239 -3624
4408 -3624 -3063 -223 1191 -879 -3290 -4722 -9642 -6063 758 8395 8281 2595 1373 -2480 -7557
4393 -7557 -12286 -9299 -6896 -5286 -4416 -6912 -3880 2416 -274 -1874 -2058 24 1210 740 -3023 -15308
4377 -15308 -18786 -13134 -5389 -628 -5249 -8722 -9992 -6038 -2906 -6203 -9031 -6246 -6647 -8145 -7915
$$ packed form
4486i709L257M6L750L654l395l630k323q87M276K171m734k471m51K707k952M44
4470a0247J574p46N1K556O545N50M02l423l677L198M333N435L474N635O82l561
4454A2781p917j1767K625N702j028o897m60O414K425m311m090k40q10j098K838
4439e833m225K521K577P30J193N250k599m077O98k28P168j520m280N243k814k285
4423b481o831O23N791L287j838j22M736J927k695p626K294M778j288o794K615
4408c624N61K840J414k070k411j432m920L579O821P637j14n686j222l853n077
4393g557m729K987K403J610Q70k496L032O296k690j600j84K082J186m70l763j2285
4377a5308l478N652P745M761m621l473j270L954L132l297k828K785m01j498K30
$$ plain form
4362 -7915 -6981 -7574 -3356 4991 10123 9566 4525 2032 -5500 -7426 -6286 -3576 -3620 -3659 -3041 -4996 -10185
4345 -10185 -9860 -11346 -14667 -4488 5907 9254 13303 15554 10067 8807 11955 9860 8384 4135
4331 4135 3336 8448 9976 5088 3637 4474 6827 9553 8551 7546 5392 -6062 -13479 -14880 -5700
4316 -5700 -4581 -2196 -775 -5813 -6135 -9279 -7508 -9825 -1687 3638 2384 86 -5845 -9587 -6878
4301 -6878 -1352 -679 3911 11476 13069 10357 5719 9729 9038 8600 540 -4358 -5718 -4610 -3603 5533
4285 5533 10409 12618 11039 9300 6672 3764 -3332 -10436 -13079 -9997 -5653 -803 4285 2346 -5090
4270 -5090 -8382 -8765 -10341 -10685 -14647 -21315 -22815 -17692 -14119 -9366 -4716 4138 4723 5011 4565 6686
4254 6686 -962 -8367 -7876 -3045 -1991 -2909 -722 3887 5499 5736 763 -745 11 1090 987 2195
$$ packed form
4362g915R34n93M218Q347N132n57n041k493p532j926J140K710m4l9O18j955n189
4345a0185L25j486l321J0179J0395L347M049K251n487j260L148k095j476m249
4331D135p99N112J528m888j451Q37K353K726j002j005k154j1454p417j401R180
4316e700J119K385J421n038l22l144J771k317Q138N325j254k298n931l742K709
4301f878N526O73M590P565J593k712m638M010o91m38q060m898j360J108J007R136
4285E533M876K209j579j739k628k908p096p104k643L082M344M850N088j939p436
4270e090l292l83j576l44l962o668j500N123L573M753M650Q854N85K88m46K121
4254F686p648p405M91M831J054r18K187M609J612K37m973j508P56J079j03J208
$$ plain form
4238 2195 7996 4685 300 9351 12793 9991 5051 3142 327 -6139 -15978 -14163 -8581 -5326 -5342
4223 -5342 -1005 -2571 740 1489 10462 11399 6855 4533 910 -1675 1553 3489 5997 1730 -1875
4208 -1875 -1830 2163 2963 1012 -3402 -6882 -2200 -586 -2565 1652 -405 -1383 -3269 -3584 -2830 -4064
4192 -4064 -5188 -10386 -8547 -1579 4167 6424 3165 16 -3599 -6878 -2926 2841 9091 7801 10034
4177 10034 8722 5250 -104 670 1300 4060 4071 -1940 -5550 -163 3343 1641 3464 4347 8997 9463
4161 9463 11601 9907 3159 -790 3654 3932 1139 4393 4692 10283 8106 5107 7330 6784 -2046 -7031
4145 -7031 -7966 -6082 -2042 132 5277 7312 9246 -689 -7428 -12280 -9346 -9814 -9410 -5404 -5586 -7555
4129 -7555 391 -2416 -3095 3923 -905 -4978 -4734 -4632 -7004 -2658 -5495 -8692 -3293 897 2962 7171
$$ packed form
4238B195N801l311m385R051L442k802m940j909k815o466r839J815N582L255j6
4223e342M337j566L311P49Q973R37m544k322l623k585L228J936K508m267l605
4208a875M5L993Q00j951m414l480M682J614j979M217k057r78j886l15P54j234
4192d064j124n198J839O968N746K257l259l149l615l279L952N767O250j290K233
4177A0034j312l472n354P74O30K760J1o011l610N387L506j702J823Q83M650M66
4161I463K138j694o748l949M444K78k793L254K99N591k177k999K223n46q830m985
4145g031r35J884M040K174N145K035J934r935o739m852K934m68M04M006j82j969
4129g555P946k807o79P018m828m073K44J02k372M346k837l197N399M190K065M209
$$ [...]
##END NTUPLES=NMR SPECTRUM
##END=
