##TITLE=Analysis number 314594
Compound Code cc 30504
Book Reference 441/159
Project Code adrs
Chemist Name colinb
##JCAMPDX= 6.0         $$ Bruker NMR JCAMP-DX V2.0
##DATA TYPE= NMR SPECTRUM
##DATA CLASS= NTUPLES
##ORIGIN= Bruker BioSpin GmbH
##OWNER= NMR
$$ XWIN-NMR		Version 3.5
$$ Thu Oct 20 13:15:02 2005 GMT Daylight Time (UT+1h)  MAYBRIDGE\NMR@NMR_250MHZ
##.OBSERVE FREQUENCY= 250.131544655141
##.OBSERVE NUCLEUS= ^1H
##.ACQUISITION MODE= SIMULTANEOUS (DQD)
##.ACQUISITION SCHEME= undefined
##.AVERAGES= 16
##.DIGITISER RES= 18
##SPECTROMETER/DATA SYSTEM= dpx250
##.PULSE SEQUENCE= zg30
##.SOLVENT NAME= CDCl3
##.SHIFT REFERENCE= (INTERNAL, CDCl3, 0, 16.522)
##AUDIT TRAIL= $$ (NUMBER, WHEN, WHO, WHERE, WHAT)
$$ ##TITLE= Audit trail, XWIN-NMR		Version 3.5
$$ ##JCAMPDX= 5.01
$$ ##ORIGIN= Bruker BioSpin GmbH
$$ ##OWNER= NMR
$$ C:\u/data/dgb/nmr/ADRS/11120/pdata/1/auditp.txt
$$ ##AUDIT TRAIL=  $$ (NUMBER, WHEN, WHO, WHERE, WHAT)
(   1,<2005-10-20 13:14:43.52 +100>,<MAYBRIDGE\NMR>,<NMR_250MHZ>,
      <created by zg, POWCHK disabled, PULCHK disabled
       configuration hash MD5:
       62 19 C7 07 E1 42 D1 B7 37 6C 3D D0 77 39 F9 E6
       data hash MD5: 64K
       9A D4 4E 54 FD C6 69 D0 A4 4C 4A 80 22 DF 32 4C>)
(   2,<2005-10-20 13:14:54.08 +100>,<MAYBRIDGE\NMR>,<NMR_250MHZ>,
      <Start of raw data processing
       ef LB = 0.3 FT_mod = 6 PKNL = 1 SI = 32K 
       data hash MD5: 32K
       A8 FE CF 9E 07 6D F3 58 55 FC CC B2 C5 1A 05 3C>)
(   3,<2005-10-20 13:14:55.85 +100>,<MAYBRIDGE\NMR>,<NMR_250MHZ>,
      <apk 
       data hash MD5: 32K
       69 03 D1 01 D9 72 CC F8 C6 20 BB A8 16 C9 32 B2>)
(   4,<2005-10-20 13:14:56.60 +100>,<MAYBRIDGE\NMR>,<NMR_250MHZ>,
      <abs ABSG = 5 
       data hash MD5: 32K
       F0 DA E3 FE 23 C5 11 90 CC 17 8C 83 0E A0 37 B8>)
$$ ##END=
$$ 
$$ hash MD5
$$ 24 67 25 A5 B3 F1 AE 2C 2C C8 FE 29 D1 F6 88 19
##$RELAX= 
##$RELAX= 
##$RELAX= 
##$RELAX= 
##$RELAX= 
##$RELAX= 
##$RELAX= 
$$ Bruker specific parameters
$$ --------------------------
##$DU= <C:\u>
##$EXPNO= 11120
##$NAME= <ADRS>
##$PROCNO= 1
##$TYPE= <nmr>
##$USER= <dgb>
##$AMP= (0..31)
100 100 100 100 100 100 100 100 100 100 100 100 100 100 100 100 100 100 
100 100 100 100 100 100 100 100 100 100 100 100 100 100 
##$AQSEQ= 0
##$AQ_mod= 3
##$AUNM= <au_zg>
##$AUTOPOS= <34 >
##$BF1= 250.13
##$BF2= 250.13
##$BF3= 250.13
##$BF4= 250.13
##$BF5= 500.13
##$BF6= 500.13
##$BF7= 500.13
##$BF8= 500.13
##$BYTORDA= 1
##$CFDGTYP= 0
##$CFRGTYP= 5
##$CHEMSTR= <none>
##$CNST= (0..31)
1 1 145 1 1 1 1 1 1 1 1 1 1 1 1 1 1 1 1 1 1 1 1 1 1 1 1 1 1 1 1 1 
##$CPDPRG= <>
##$CPDPRG1= <>
##$CPDPRG2= <>
##$CPDPRG3= <>
##$CPDPRG4= <mlev>
##$CPDPRG5= <mlev>
##$CPDPRG6= <mlev>
##$CPDPRG7= <mlev>
##$CPDPRG8= <mlev>
##$CPDPRGB= <>
##$CPDPRGT= <>
##$D= (0..31)
0 1 0 0 0 0 0 0 0 0.06 0 0 0 0 0 0 0.0002 0 0 0 0 0 0 0 0 0 0 0 0 0 0 
0 
##$DATE= 1129810482
##$DBL= (0..7)
120 120 120 120 120 120 120 120 
##$DBP= (0..7)
150 150 150 150 150 150 150 150 
##$DBP07= 0
##$DBPNAM0= <>
##$DBPNAM1= <>
$$ [...]
##$SUBNAM7= <"">
##$SUBNAM8= <"">
##$SUBNAM9= <"">
##$SW= 20.6930455092707
##$SWIBOX= (0..15)
0 0 3 0 0 0 0 0 0 0 0 0 0 0 0 0 
##$SW_h= 5175.983436853
##$TD= 65536
##$TD0= 1
##$TE= 295.16
##$TE2= 300
##$TE3= 300
##$TEG= 300
##$TL= (0..7)
0 120 120 120 120 120 120 120 
##$TP= (0..7)
150 150 150 150 150 150 150 150 
##$TP07= 0
##$TPNAME0= <>
##$TPNAME1= <>
##$TPNAME2= <>
##$TPNAME3= <>
##$TPNAME4= <>
##$TPNAME5= <>
##$TPNAME6= <>
##$TPNAME7= <>
##$TPOAL= (0..7)
0.5 0.5 0.5 0.5 0.5 0.5 0.5 0.5 
##$TPOFFS= (0..7)
0 0 0 0 0 0 0 0 
##$TUNHIN= 0
##$TUNHOUT= 0
##$TUNXOUT= 0
##$USERA1= <user>
##$USERA2= <user>
##$USERA3= <user>
##$USERA4= <user>
##$USERA5= <user>
##$V9= 5
##$VALIST= <valist>
##$VCLIST= <CCCCCCCCCCCCCCC>
##$VD= 0
##$VDLIST= <DDDDDDDDDDDDDDD>
##$VPLIST= <PPPPPPPPPPPPPPP>
##$VTLIST= <TTTTTTTTTTTTTTT>
##$WBST= 1024
##$WBSW= 4
##$XGAIN= (0..3)
0 0 0 0 
##$XL= 0
##$YL= 0
##$YMAX_a= 458705
##$YMIN_a= -350896
##$ZGOPTNS= <>
##$ZL1= 120
##$ZL2= 120
##$ZL3= 120
##$ZL4= 120
##$ABSF1= 16.522
##$ABSF2= -4.171173
##$ABSG= 5
##$ABSL= 3
##$ALPHA= 0
##$AQORDER= 0
##$ASSFAC= 0
##$ASSFACI= 0
##$ASSFACX= 0
##$ASSWID= 0
##$AUNMP= <proc_1d>
##$AZFE= 0.1
##$AZFW= 0.1
##$BCFW= 0
##$BC_mod= 0
##$BYTORDP= 0
##$COROFFS= 0
##$CY= 12.5
##$DATMOD= 1
##$DC= 0
##$DFILT= <>
##$DTYPP= 0
##$F1P= 14.0000005364418
##$F2P= -0.99999901652339
##$FCOR= 0.5
##$FTSIZE= 32768
##$FT_mod= 6
##$GAMMA= 0
##$GB= 0
##$INTBC= 1
##$INTSCL= 1
##$ISEN= 128
##$LB= 0.3
##$LEV0= 0
##$LPBIN= 0
##$MAXI= 10000
##$MC2= 0
##$MEAN= 0
##$ME_mod= 0
##$MI= 0
##$NCOEF= 0
##$NC_proc= -4
##$NLEV= 6
##$NOISF1= 0
##$NOISF2= 0
##$NSP= 0
##$NTH_PI= 0
##$NZP= 0
##$OFFSET= 16.522
##$PC= 1
##$PHC0= -69.00742
##$PHC1= 7.803429
##$PH_mod= 1
##$PKNL= yes
##$PPARMOD= 0
##$PSCAL= 4
##$PSIGN= 0
##$REVERSE= no
##$SF= 250.13
##$SI= 32768
##$SIGF1= 0
##$SIGF2= 0
##$SINO= 400
##$SIOLD= 32768
##$SREGLST= <1H.CDCl3>
##$SSB= 0
##$STSI= 32768
##$STSR= 0
##$SW_p= 5175.98343685301
##$SYMM= 0
##$S_DEV= 0
##$TDeff= 65536
##$TDoff= 0
##$TI= <Analysis number 999999
Compound Code 99
Book Reference 9
Project Code 9>
##$TILT= no
##$TM1= 0
##$TM2= 0
##$TOPLEV= 0
##$USERP1= <user>
##$USERP2= <user>
##$USERP3= <user>
##$USERP4= <user>
##$USERP5= <user>
##$WDW= 1
##$XDIM= 32768
##$YMAX_p= 370003011
##$YMIN_p= -704748
$$ End of Bruker specific parameters
$$ ---------------------------------
##NTUPLES= NMR SPECTRUM
##VAR_NAME=  FREQUENCY,     SPECTRUM/REAL,   SPECTRUM/IMAG
##SYMBOL=    X,             R,               I
##VAR_TYPE=  INDEPENDENT,   DEPENDENT,       DEPENDENT
##VAR_FORM=  AFFN,          ASDF,            ASDF
##VAR_DIM=   32768,         32768,           32768
##UNITS=     HZ,            ARBITRARY UNITS, ARBITRARY UNITS
##FACTOR=    0.157963299565203, 1,           1
##FIRST=     4132.6476996994, 0,             0
##LAST=      -1043.33573715361, 0,           0
##MIN=       -1043.33573715361, -704748,     0
##MAX=       4132.6476996994, 370003011,     0
$$ Real data points
##PAGE= N=1
##DATA TABLE= (X++(R..R)), XYDATA
$$ [...]
$$ plain form
22937 477941 281341 138665 21445 -29136 -10854 45116 52271 93600 163450 154300 95832
22926 95832 80134 80077 28396 -11740 -32840 -25450 35592 51442 50119 1854 -11359 -56187 -77569
22913 -77569 -75258 -70660 9868 11026 31360 46437 10452 -16291 -42204 15964 32170 33678
22901 33678 -41517 -47266 -57222 -103339 -79121 -46267 -42725 -59860 -145605 -137124 -48051 -30888
22889 -30888 -60099 -48511 -47597 -36397 -53987 -7049 40426 109912 142372 177791 178188 180219 137502
22876 137502 114151 138618 129627 123842 45428 12201 -3461 -30337 31346 54988 43247 16011
22864 16011 55992 98651 122932 160020 227719 225065 185921 162467 129496 130595 211535 233844
22852 233844 199767 210953 262671 316244 376538 393032 522323 563733 497761 465831 422820
$$ packed form
22937D77941j96600j42676j17220n0581J8282N5970P155M1329O9850r150n8468
22926I5832j5698n7n1681m0136k1100P390O1042J5850j323m8265j3213m4828k1382
22913g7569K311M598Q0528J158K0334J5077l5985k6743k5913N8168J6206J508
22901C3678p5195n749r956m6117K4218L2854L542j7135q5745Q481Q9073J7163
22889c0888k9211J1588R14J1200j7590M6938M7475O9486L2460L5419L97K031m2717
22876A37502k3351K4467q991n785p8414l3227j5662k6876O1683K3642j1741k7236
22864A6011L9981M2659K4281L7088O7699k654l9144k3454l2971J099Q0940K2309
22852B33844l4077J1186N1718N3573O0294J6494J29291M1410o5972l1930m3011
$$ plain form
22841 422820 341186 302006 249514 317931 433792 434334 545962 678916 886214 1230813 1617345
22830 1617345 2039362 2216894 1963796 1660900 1221885 911028 733819 648253 611970 617722
22820 617722 609166 595387 598749 598123 558836 510638 428470 440393 426623 358077 316987 368610
22808 368610 367387 368994 403212 424996 432155 474236 515034 532415 499969 571589 582275 496587
22796 496587 536821 605202 704182 737017 783953 804523 829826 905145 977036 1122706 1095206
22785 1095206 1113208 1280566 1425416 1474475 1578538 1712509 1875131 1935243 2100769 2294249
22775 2294249 2407861 2586809 2895114 3223622 3611517 3988748 4337924 4807225 5424670
22766 5424670 6276547 7401575 8872804 10734995 12741265 14799941 17393435 21096515
$$ packed form
22841D22820q1634l9180n2492O8417J15861N42J11628J32954K07298L44599L86532
22830A617345M22017J77532k53098l02896m39015l10857j77209q5566l6283N752
22820F17722q556j3779L362o26l9287m8198q2168J1923j3770o8546m1090N1623
22808C68610j223J607L4218K1784P159M2081M0798J7381l2446P1620J0686q5688
22796D96587M0234O8381R8980L2835M6936K0570K5303P5319P1891J45670k7500
22785A095206J8002J67358J44850M9059J04063J33971J62622O0112J65526J93480
22775B294249J13612J78948L08305L28508L87895L77231L49176M69301O17445
22766E424670Q51877J125028J471229J862191K006270K058676K593494L703080
$$ plain form
22758 21096515 26663744 35317449 49208530 72197810 110142425 168886134 246585924
22751 246585924 323468378 370003011 355417262 306132346 226891354 152006202 108691425
22744 108691425 84452756 69797054 60543236 54466396 50557084 47956888 45601541 42755403
22736 42755403 39332221 35116882 30861476 27078276 23703570 20822080 18340623 16297100
22728 16297100 14597357 13065936 11687871 10475216 9431604 8609138 7933028 7247706
22720 7247706 6591092 6017027 5509118 5128468 4707490 4381920 4001544 3688225 3339966
22711 3339966 3018676 2780902 2640527 2534064 2298907 2076920 1894214 1791194 1638957
22702 1638957 1506001 1416706 1300684 1132977 1083257 1080771 1028871 970417 921125 898093 931628
$$ packed form
22758B1096515N567229Q653705J3891081K2989280L7944615N8743709P7699790
22751B46585924P6882454M6534633j4585749m9284916p9240992p4885152m3314777
22744A08691425k4238669j4655702r253818o076840l909312k600196k355347k846138
22736D2755403l423182m215339m255406l783200l374706k881490k481457k043523
22728A6297100j699743j531421j378065j212655j043612q22466o76110o85322
22720G247706o56614n74065n07909l80650m20978l25570l80376l13319l48259
22711C339966l21290k37774j40375j06463k35157k21987j82706j03020j52237
22702A638957j32956q9295j16022j67707m9720k486n1900n8454m9292k3032L3535
$$ plain form
22691 931628 960426 919175 887775 836076 729654 638291 596948 598964 641687 665214 571215
22680 571215 531019 490833 481950 494930 579946 606426 725277 911610 1245295 1667204 2072547
22669 2072547 2297907 2320704 2135446 1722305 1264522 1007283 862577 849477 743264 617600
22659 617600 567941 526096 504968 531444 504640 441684 455483 479057 399977 362570 418613
22648 418613 395924 384760 391553 352687 359572 346748 309878 251380 236415 306267 393520 401063
22636 401063 355801 315077 326318 331147 319154 238231 247673 288565 402968 502315 441706 393292
22624 393292 390926 412878 394420 397761 390894 407386 343447 237642 168420 200595 165919 143206
22612 143206 116943 114411 109869 112114 170021 187213 218833 250784 330121 346367 376241 388347
$$ packed form
22691I31628K8798m1251l1400n1699j06422r1363m1343K016M2723K3527r3999
22680E71215m0196m0186q883J2980Q5016K6480J18851J86333L33685M21909M05343
22669B072547K25360K2797j85258m13141m57783k57239j44706j3100j06213j25664
22659F17600m9659m1845k1128K6476k6804o2956J3799K3574p9080l7407N6043
22648D18613k2689j1164O793l8866O885j2824l6870n8498j4965O9852Q7253P543
22636D01063m5262m0724J1241M829j1993q0923R442M0892J14403R9347o0609m8414
22624C93292k366K1952j8458L341o867J6492o3939j05805o9222L2175l4676k2713
22612A43206k6263k532m542K245N7907J7192L1620L1951P9337J6246K9874J2106
$$ plain form
22600 388347 339458 311080 346396 310907 333498 292533 264761 256127 230215 187543 183784 198278
22588 198278 179711 182763 214623 284502 262575 182423 162358 199470 175518 136217 120232 153208
22576 153208 209753 204376 219001 189949 229407 264474 297465 270571 244082 233166 251652 237579
22564 237579 183013 113012 -28450 -284283 -540385 -669781 -704748 -577094 -437222 -342588
22554 -342588 -271331 -229204 -199252 -195278 -166133 -125011 -53954 -99958 -125339 -127672 -122607 -96407
22542 -96407 -66347 -57564 -1175 -18143 -34833 -4930 -35301 -92319 -75277 -104081 -137570 -86315
22530 -86315 -37002 -7584 50167 108162 42708 26574 86392 59840 14891 9691 44973 94579
22518 94579 114996 128943 80450 88244 145058 169398 215173 326114 432236 719196 1202927
$$ packed form
22600C88347m8889k8378L5316l5489K2591m0965k7772q634k5912m2672l759J4494
22588A98278j8567L052L1860O9879k1927q0152k0065L7112k3952l9301j5985L2976
22576A53208N6545n377J4625k9052L9458L5067L2991k6894k6489j0916J8486j4073
22564B37579n4566p0001j41462k55833k56102j29396l4967J27654J39872R4634
22554c42588P1257M2127K9952L974K9145M1122P1057m6004k5381k333N065K6200
22542i6407L0060Q783N6389j6968j6690K9903l0371n7018J7042k8804l3489N1255
22530h6315M9313K9418N7751N7995o5454j6134N9818k6552m4949n200L5282M9606
22518I4579K0417J3947m8493P794N6814K4340M5775J10941J06122K86960M83731
$$ plain form
22507 1202927 1836285 2469153 2775543 2478371 1692489 1144947 794414 573830 461360
22498 461360 390583 368802 372035 389667 361033 296181 252084 260714 207531 128751 99950 92987
22486 92987 120795 136621 179044 177737 131468 122609 66548 27832 9394 58742 70698 20870
22474 20870 -54907 -63905 -36775 -34633 38352 -6858 -57368 -85913 -46725 -24107 12122 -37762
22462 -37762 -69546 49195 53588 -9172 -29633 -50770 -13075 37963 62772 67573 -18022 -107510
22450 -107510 -51879 24096 27024 -74702 -105843 -134748 -136803 -100650 -92789 -103408 -126198 -66116
22438 -66116 -27659 19731 78993 46825 101691 89041 49891 -16186 -102769 -83759 -30801 -24392
22426 -24392 6828 -30340 -42537 18433 43218 -14728 958 -26871 -56521 -13575 -35207 -135760
$$ packed form
22507A202927O33358O32868L06390k97172p85882n47542l50533k20584j12470
22498D61360p0777k1781L233J7632k8634o4852m4097Q630n3183p8780k8801o963
22486I2987K7808J5826M2423j307m6269q859n6061l8716j8438M9348J1956m9828
22474B0870p5777q998K7130K142P2985m5210n0510k8545L9188K2618L6229m9884
22462c7762l1784J18741M393o2760k0461k1137L7695N1038K4809M801q5595q9488
22450a07510N5631P5975K928j01726l1141k8905k055L6153P861j0619k2790O0082
22438f6116L8457M7390N9262l2168N4866j2650l9150o6077q6583J9010N2958O409
22426b4392L1220l7168j2197O0970K4785n7946J5686k7829k9650M2946k1632j00553
$$ plain form
22414 -135760 -136780 -116458 -157957 -96431 -80892 -101339 -32361 1758 1101 17598 529 -34577
22402 -34577 -67179 -74131 -49610 12227 -10083 1063 82242 146307 146538 68467 84286 94208
22390 94208 87009 88751 90168 82131 71930 2587 -16203 -26380 39518 69302 64420 44309 47304
22377 47304 53777 23670 -16482 -43982 -25115 -26062 15496 -25090 -23101 -7778 -66512 -95135
22365 -95135 -56328 46422 51634 25630 -30676 -35099 -61257 -69905 -86226 -148946 -108421 -124968
22353 -124968 -92813 -107012 -69539 -10287 -22007 -57001 -82215 -92698 -63409 -37600 28380
22342 28380 9666 -7900 -34465 -25944 -59555 -42760 -21418 615 31951 -66339 -92320 -18029
22330 -18029 -5635 -48110 -6559 14307 20211 34217 21417 -20924 -82927 1501 8821 -10782
$$ packed form
22414a35760j020K0322m1499O1526J5539k0447O8978L4119o57J6497j7069l5106
22402c4577l2602o952K4521O1837k2310J1146Q1179O4065K31p8071J5819R922
22390I4208p199J742J417q037j0201o9343j8790j0177O5898K9784m882k0111K995
22377D7304O473l0107m0152k7500J8867r47M1558m0586J989J5323n8734k8623
22365i5135L8807J02750N212k6004n6306m423k6158q648j6321o2720M0525j6547
22353a24968L2155j4199L7473N9252j1720l4994k5214j0483K9289K5809O5980
22342B8380j8714j7566k6565Q521l3611J6795K1342K2033L1336r8290k5981P4291
22330a8029J2394m2475M1551K0866N904J4006j2800m2341o2003Q4428P320j9603
$$ plain form
22318 -10782 -40 -152 -15384 -1882 26351 2778 -43161 -4460 24256 15853 9924 -22458
22306 -22458 48692 87881 66543 51864 40419 -47385 -94969 -48694 11779 67374 54402 19904
22294 19904 -42252 18724 79425 98871 102876 75614 40333 45891 37762 84794 120776 43602
22282 43602 -18905 9340 20109 20466 32664 68570 80692 29150 -39860 -86028 -84974 -53586
22270 -53586 -50776 -69474 -85298 -50339 -24878 -8169 -46569 -24532 27731 28672 642 21353
22258 21353 -17975 -31443 10982 11016 -22811 -37720 -45147 62937 125935 46577 -3437 44365
22246 44365 38263 7057 18522 14821 19328 -34776 -78574 -82995 -43496 -49151 -32744 -16907 -34007
22233 -34007 -528 41975 -13189 -69343 -56214 32245 15879 -30515 -48885 -63005 -36321 39169
$$ packed form
22318a0782J0742j12j5232J3502K8233k3573m5939L8701K8716q403n929l2382
22306b2458P1150L9189k1338j4679j1445q7804m7584M6275O0473N5595j2972l4498
22294A9904o2156O0976O0701J9446M005k7262l5281N558q129M7032L5982p7174
22282D3602o2507K8245J0769L57J2198L5906J2122n1542o9010m6168J054L1388
22270e3586K810j8698j5824L4959K5461J6709l8400K2037N2263R41k8030K0711
22258B1353l9328j3468M2425L4l3827j4909p427J08084O2998p9358n0014M7802
22246D4365o102l1206J1465l701M507n4104m3798m421L9499n655J6407J5837j7100
22233c4007L3479M2503n5164n6154J3129Q8459j6366m6394j8370j4120K6684P5490
$$ plain form
22221 39169 57993 39264 40628 -68141 -115583 36436 181713 155737 82739 35601 6374
22210 6374 -1337 -2010 24081 49396 53068 72036 53772 46287 32266 -4463 -54488 -107706 -182363
22197 -182363 -128193 -115947 -101171 -84649 -18612 31943 49461 10861 -16882 -102340 -123993
22186 -123993 -117506 -121511 -89207 -69826 -65742 -76636 -68747 -93555 1247 39659 20089 -30268
22174 -30268 -35018 37920 61485 64052 110243 92505 92271 119241 142661 132628 75466 84971 96516
22161 96516 115346 188673 303767 382922 474454 635756 890881 1282172 1743051 2062466
22151 2062466 1989618 1748980 1331436 885456 637106 528559 497483 483669 408053 354018
22141 354018 319576 287370 239369 253723 306257 296821 294416 233078 107015 28095 -48358 -46127
$$ packed form
22221C9169J8824j8729J364j08769m7442J52019J45277k5976p2998m7138k9227
22210F374p711o73K6091K5315L672J8968j8264p485j4021l6729n0025n3218p4657
22197a82363N4170J2246J4776J6522O6037N0555J7518l8600k7743q5458k1653
22186a23993O487m005L2304J9381M084j0894P889k4808R4802L8412j9570n0357
22174c0268m750P2938K3565K567M6191j7738k34K6970K3420j0033n7162R505J1545
22161I6516J8830P3327J15094P9155R1532J61302K55125L91291M60879L19415
22151B062466p2848k40638m17544m45980k48350j08547l1076j3814p5616n4035
22141C54018l4442l2206m8001J4354N2534r436k405o1338j26063p8920p6453K231
$$ plain form
22129 -46127 -6303 -8610 37611 17658 16067 -52937 -81405 6757 71899 145394 127803 39458
22117 39458 55371 3389 -19073 -45711 -50940 -52586 -23102 10224 7341 7962 16540 40470 96110
22104 96110 101791 105663 129843 160574 79910 2758 -3043 4368 -21170 -24294 -70827 -88893 -120960
22091 -120960 -163938 -168858 -76961 18261 71818 110652 116201 65612 12893 72952 44198 71923
22079 71923 57338 46529 21644 -29736 -11687 3990 18513 27799 61390 84672 105501 140357
22067 140357 125637 77126 32087 -39497 -122051 -143541 -80857 -35486 -22888 22214 66662
22056 66662 113545 163022 158448 74549 33372 7326 74299 83364 32946 -2518 6336 19229
22044 19229 68439 55216 59155 46718 -16500 -81034 -77954 37134 103947 96685 20211 -16730
$$ packed form
22129d6127L9824k307M6221j9953j591o9004k8468Q8162O5142P3495j7591q8345
22117C9458J5913n1982k2462k6638n229j646K9484L3326k883O21Q578K3930N5640
22104I6110N681L872K4180L0731q0664p7152n801P411k5538l124m6533j8066l2067
22091a20960m2978m920R1897R5222N3557L8834N549n0589n2719O0059k8754K7725
22079G1923j4585j0809k4885n1380J8049J5677J4523R286L3591K3282K0829L4856
22067A40357j4720m8511m5039p1584q2554k1490O2684M5371J2598M5102M4448
22056F6662M6883M9477m574q3899m1177k6046O6973R065n0418l5464Q854J2893
22044A9229M9210j3223L939j2437o3218o4534L080J15088O6813p262p6474l6941
$$ plain form
22032 -16730 -60100 -82798 -42736 22510 -4511 24607 37394 39692 -11495 -22278 -69860 21431
22020 21431 102695 44805 2414 -34647 11377 14183 25536 27790 68307 -26673 -48429 -79849
22008 -79849 -145499 -139699 -145060 -127151 -44365 9347 -172 -28405 -9900 26871 -4736 -82768
21996 -82768 -91537 -71106 -124235 -187678 -212692 -120285 -139920 -129933 -78790 -36442 -29747 -114485
21984 -114485 -106610 -83040 -68993 -79355 -65997 -57910 26750 80876 90214 51819 -14358 5395
21972 5395 37920 12229 25205 16697 -52762 -78330 -97393 -59375 -93609 -148126 -162561 -151753
21960 -151753 -101259 -13574 6606 -15073 -14074 -33311 10776 63610 7048 -14628 -8711 -2548
21948 -2548 -44758 -52748 -34714 -33659 -14198 -18690 -59858 -7014 53505 50898 19825 -161 22281
$$ packed form
22032a6730m3370k2698M0062O5246k7021K9118J2787K298n1187j0783m7582R1291
22020B1431Q1264n7890m2391l7061M6024K806J1353K254M0517r4980k1756l1420
22008g9849o5650N800n361J7909Q2786N3712r519k8233J8505L6771l1607p8032
21996h2768q769K0431n3129o3443k5014R2407j9635R987N1143M2348O695q4738
21984a14485P875K3570J4047j0362J3358Q087Q4660N4126R338l8395o6177J9753
21972E395L2525k5691J2976q508o9459k5568j9063L8018l4234n4517j4435J0808
21960a51753N0494Q7685K0180k1679R99j9237M4087N2834n6562k1676N917O163
21948b548m2210p990J8034J055J9461m492m1168N2844O0519k607l1073j9986K2442
$$ plain form
21935 22281 49216 26683 -43957 1557 18002 14360 -43980 -16828 1326 48411 91371 72428
21923 72428 62135 24309 -13387 3003 47201 9313 -3664 42648 49231 65619 5279 85200
21911 85200 106831 61994 6351 -91435 -121776 -71428 44801 54327 10276 -14286 -39712 -98713
21899 -98713 -125371 -45848 41431 64710 18164 32417 85395 59193 75068 96298 56585 30446
21887 30446 -37511 -22181 -51009 -29225 -83371 -25922 66190 36609 -11084 -53003 461 -34576
21875 -34576 -135119 -136884 -70692 -23865 7883 28927 57033 24223 -16103 31824 55080 7698
21863 7698 17914 71686 46282 32076 37647 -57199 -91344 -64839 -58979 -45664 -24788 37137
21851 37137 87264 61343 52723 11512 -7751 -47311 -54219 -49485 -41367 -28712 483 774 3843
$$ packed form
21935B2281K6935k2533p0640M5514J6445l642n8340K7152J8154M7085M2960j8943
21923G2428j0293l7826l7696J6390M4198l7888j2977M6312O583J6388o0340P9921
21911H5200K1631m4837n5643r7786l0341N0348J16229R526m4051k4562k5426n9001
21899i8713k6658P9523Q7279K3279m6546J4253N2978k6202J5875K1230l9713k6139
21887C0446o7957J5330k8828K1784n4146N7449R2112k9581m7693m1919N3464l5037
21875c4576j00543j765O6192M6827L1748K1044K8106l2810m0326M7927K3256m7382
21863G698J0216N3772k5404j4206N571r4846l4145K6505N860J3315K0876O1925
21851C7137N0127k5921q620m1211j9263l9560o908M734Q118J2655K9195K91L069
$$ plain form
21838 3843 -8514 -27883 -3193 -29388 -90152 -57417 -76827 -44168 10136 14423 -18741 -62175
21826 -62175 -59400 -54857 -117167 -156715 -202139 -206946 -154826 -104462 -123714 -128987 -105367 -188342
21814 -188342 -221584 -218901 -147154 -155377 -145029 -112747 -89115 -51746 35617 128282 159340 59886
21802 59886 31431 -43638 -106263 -134108 -130524 -119975 -76331 -37403 -15226 43119 23226 55090
21790 55090 67858 54689 49089 34153 -23776 -137949 -146484 -96953 -130417 -94912 -102338 -107185
21778 -107185 -60012 7224 67031 90420 46887 23058 10551 -4251 2872 50230 51760 27580
21766 27580 45214 -29109 346 80141 67073 73875 51281 -43625 -24484 7147 -15215 -33733
21754 -33733 -66620 -47075 -34537 -4462 26690 69587 18056 2833 23901 20161 65921 75727
$$ packed form
21838C843j2357j9369K4690k6195o0764L2735j9410L2659N4304M287l3164m3434
21826f2175K775M543o2310l9548m5424m807N2120N0364j9252n273K3620q2975
21814a88342l3242K683P1747q223J0348L2282K3632L7369Q7363R2665L1058r9454
21802E9886k8455p5069o2625k7845L584J0549M3644L8928K2177N8345j9893L1864
21790E5090J2768j3169n600j4936n7929j14173q535M9531l3464L5505p426m847
21778a07185M7173O7236N9807K3389m3533k3829j2507j4802P123M7358J530k4180
21766B7580J7634p4323K9455P9795j3068O802k2594r4906J9141L1631k2362j8518
21754c3733l2887J9545J2538L0075L1152M2897n1531j5223K1068l740M5760R806
$$ plain form
21742 75727 26634 28159 67495 54189 18550 13772 30481 24489 -7120 -38975 -12023 29112
21730 29112 12474 -2621 -23143 -60657 -38117 -8346 48641 7533 235 7401 58131 66103
21718 66103 72586 34773 11474 35661 45329 18372 -67846 -61452 -40273 -56894 -39865 -41329
21706 -41329 -12359 -27359 5237 -18584 -44147 -11336 20371 -23833 -81924 -66957 -9620 -25526
21694 -25526 -72113 -31367 -36176 -66819 -118547 -112075 -163167 -144420 -146991 -134431 -89024 -130704
21682 -130704 -84204 -75402 -90754 -114388 -77636 -40629 -26769 -76542 -18682 -2562 46199 58338
21670 58338 24135 25206 25133 737 -13735 -3866 51307 29468 -8498 -68176 -46259 -73457 -13101
21657 -13101 56958 71718 35155 20643 94870 48905 -28274 -29458 -43104 -40347 -46876 2491
$$ packed form
21742G5727m9093J525L9336j3306l5639m778J6709n992l1609l1855K6952M1135
21730B9112j6638j5095k0522l7514K2540K9771N6987m1108p298P166N0730P972
21718F6103O483l7813k3299K4187R668k6957q6218O394K1179j6621J7029j464
21706d1329K8970j5000L2596k3821k5563L2811L1707m4204n8091J4967N7337j5906
21694b5526m6587M0746m809l0643n1728O472n1092J8747k571J2560M5407m1680
21682a30704M6500Q802j5352k3634L6752L7007J3860m9773N7860J6120M8761J2139
21670E8338l4203J071p3k4396j4472R869N5173k1839l7966n9678K1917k7198O0356
21657a3101P0059J4760l6563j4512P4227m5965p7179j184j3646K757o529M9367
$$ plain form
21645 2491 -62807 -148413 -140266 -115357 -42180 -21258 -46033 -83596 -59980 -28674 -30369 -104939
21633 -104939 -95861 37002 89021 24149 -28811 -31970 -40997 -51329 -4371 -10701 -21234 -26750
21621 -26750 -65192 -45391 -93847 -93631 -81339 -90333 -35676 38232 117985 91535 78970 42675
21609 42675 19824 -30363 8725 39752 15883 -13146 -67293 -2549 -4953 -18145 -86782 -66770
21597 -66770 -83613 -139090 -116139 -81810 -85865 -68621 -69861 -33134 -53071 -5761 -3343 -62845
21585 -62845 -92937 -59349 17709 72509 87856 59165 22174 -49194 -69720 -52021 -24133 -57517
21573 -57517 -69346 -18203 9722 3658 4929 42543 50170 46963 8705 -53185 -65335 -116742
21561 -116742 -98394 -38559 19067 88927 30112 14212 29671 -9529 -46759 -29811 -57023
$$ packed form
21645B491o5298q5606Q147K4909P3177K0922k4775l7563K3616L1306j695p4570
21633a04939R078J32863N2019o4872n2960l159r027j0332M6958o330j0533n516
21621b6750l8442J9801m8456K16J2292q994N4657P3908P9753k6450j2565l6295
21609D2675k2851n0187L9088L1027k3869k9029n4147O4744k404j3192o8637K0012
21597f6770j6843n5477K2951L4329m055J7244j240L6727j9937M7310K418n9502
21585f2845l0092L3588P7058N4800J5347k8691l6991p1368k0526J7699K7888l3384
21573e7517j1829N1143K7925o064J271L7614P627l207l8258o1890j2150n1407
21561a16742J8348N9835N7626O9860n8815j5900J5459l9200l7230J6948k7212
$$ plain form
21550 -57023 -12546 13427 -13769 -16928 -58917 -47340 -35169 -37980 -43616 -56562 -2341 42776
21538 42776 29577 7039 -10890 -9863 -14664 27173 36575 3637 -72764 -139267 -137634 -106037
21526 -106037 -54584 -42970 9204 45588 29010 8947 -40073 -95740 -170568 -161706 -120068 -73958
21514 -73958 -76196 -61031 -49902 -81428 -63670 -51444 -104001 -95457 -78836 -10678 -4193 77473
21502 77473 69352 72160 52351 119477 147457 109170 37042 45013 73074 70512 45845 1781
21490 1781 -58812 -52924 -7392 -27927 -78443 16147 12575 -7517 64631 116245 60838 -16452
21478 -16452 -21915 -29622 -43041 -44098 -6991 -44782 -67332 -72420 -74076 -45208 -27330 -39858 -29767
21465 -29767 11622 30132 33878 7696 -18508 31713 20303 11462 -126 13539 5692 -1529
$$ packed form
21550e7023M4477K5973k7196l159m1989J1577J2171k811n636j2946N4221M5117
21538D2776j3199k2538j7929J027m801M1837R402l2938p6401o6503J633L1597
21526a06037N1453J1614N2174L6384j6578k0063m9020n5667p4828Q862M1638M6110
21514g3958k238J5165J1129l1526J7758J2226n2557Q544J6621O8158O485Q1666
21502G7473q121K808j9809O7126K7980l8287p2128P971K8061k562k4667m4064
21490A781o0593N888M5532k0535n0516R4590l572k0092P2148N1614n5407p7290
21478a6452n463p707j3419j057L7107l7791k2550n088j656K8868J7878j2528J0091
21465b9767M1389J8510L746k6182k6204N0221j1410q841j1588J3665p847p221
$$ plain form
21453 -1529 -48539 -46393 -38879 -70443 -64923 -32056 -45826 -31067 34211 121956 104899 -34085
21441 -34085 -73177 6085 11576 -26795 -11298 55244 36506 -38118 -63499 -11910 -21366 -49710
21429 -49710 -38319 -184 33667 36764 -39804 -63262 -23881 7160 24261 37716 72839 46841
21417 46841 62018 38149 -44202 -97372 -103035 -25309 -50053 -100955 -113033 -100515 -82148 -6005
21405 -6005 52945 56489 64807 31367 30130 79279 74320 25603 -5002 -49181 -53678 -37900 -37186
21392 -37186 -34911 15754 65156 71134 77005 23426 217 -41975 -71114 -39141 40820 63313
21380 63313 49909 17272 58024 70604 8791 19080 75532 86210 90570 111544 142958 77338
21368 77338 11211 36394 -15659 55357 81707 6452 -1357 9510 330 2958 -41494 46914
$$ packed form
21453a529m7010K146P514l1564N520L2867j3770J4759O5278Q7745j7057j38984
21441c4085l9092P9262N491l8371J5497O6542j8738p4624k5381N1589r456k8344
21429d9710J1391L8135L3851L097p6568k3458L9381L1041J7101J3455L5123k5998
21417D6841J5177k3869q2351n3170n663P7726k4744n0902j2078J2518J8367P6143
21405f005N8950L544Q318l3440j237M9149m959m8717l0605m4179m497J5778P14
21392c7186K275N0665M9402N978N871n3579k3209m2192k9139L1973P9961K2493
21380F3313j3404l2637M0752J2580o1813J0289N6452J0678M360K0974L1414o5620
21368G7338o6127K5183n2053P1016K6350p5255p809J0867r180K628m4452Q8408
$$ plain form
21356 46914 100188 55888 -18831 4649 22144 11407 15133 -25370 -19711 -50108 -29424 -42096
21344 -42096 -3348 68154 46508 -12511 -6998 -36126 -55959 6119 41936 86846 112321 63244
21332 63244 -6761 -45362 -22720 -48605 -113156 -130447 -120248 -171713 -135357 -54124 -22110 -47221
21320 -47221 -121063 -96177 -31344 -21079 -22633 -24189 -30006 -53273 -66933 -18959 70612 61448
21308 61448 -49794 -84055 5250 -16254 -87393 -127452 -113511 -16469 37705 -4471 -12787 -1711
21296 -1711 -22591 7264 12066 -16631 -59394 -44627 -43849 -52142 -13345 -5969 -28968 -53885 -25854
21283 -25854 -12766 5521 57484 40846 4753 -15703 -56921 -54082 -74292 -107246 -86927 -89448
21271 -89448 -18544 76126 61203 121371 92140 45458 -9461 -31525 -27698 -76470 -116073 -94090
$$ packed form
21356D6914N3274m4300p4719K3480J7495j0737L726m0503N659l0397K0684j2672
21344d2096L8748P1502k1646n9019N513k9128j9833O2078L5817M4910K5475m9077
21332F3244p0005l8601K2642k5885o4551j7291J0199n1465L6356Q1233L2014k5111
21320d7221p3842K4886O4833J0265j554j556n817k3267j3660M7974Q9571r164
21308F1448j11242l4261Q9305k1504p1139m0059J3941R7042N4174m2176q316J1076
21296a711k0880K9855M802k8697m2763J4767P78q293L8797P376k2999k4917K8031
21283b5854J3088J8287N1963j6638l6093k0456m1218K839k0210l2954K0319k521
21271h9448P0904R4670j4923O0168k9231m6682n4919k2064L827m8772l9603K1983
$$ plain form
21259 -94090 -57487 8976 27595 53169 3801 -5886 6361 -37155 -43237 -34940 1805 -3499
21247 -3499 8622 21426 93369 56943 -19427 -70684 -26505 -11397 -19454 51987 19945 -22197
21235 -22197 -9730 66854 55272 66928 7676 -39452 -57452 -29631 38881 53532 -22048 -38068
21223 -38068 -31748 -63096 -32310 -46150 -86838 -65542 -48191 -42706 -33049 37481 46133 63648
21211 63648 19151 15805 19496 -6792 -15960 -18141 3689 23967 56414 27599 31384 788 -68692
21198 -68692 -34928 -35791 -35663 -96396 -111807 -54189 -5609 25213 -19677 -100018 -68564 -97258
21186 -97258 -92297 -111789 -99898 -56289 11332 -29341 -36473 -31908 -61036 -100229 -84229 19505
21174 19505 28386 11697 -25998 -51743 -77468 -46564 -94392 -96923 -15447 56006 82269 56104
$$ packed form
21259i4090L6603O6463J8619K5574m9368r687J2247m3516o082Q297L6745n304
21247c499J2121J2804P1943l6426p6370n1257M4179J5108q057P1441l2042m2142
21235b2197J2467P6584j1582J1656n9252m7128j8000K7821O8512J4651p5580j6020
21223c8068O320l1348L0786j3840m0688K1296J7351N485R657P0530Q652J7515
21211F3648m4497l346L691k6288r168k181K1830K0278L2447k8815L785l0596o9480
21198f8692L3764q63J28o0733j5411N7618M8580L0822m4890q0341L1454k8694
21186i7258M961j9492J1891M3609O7621m0673p132M565k9128l9193J6000J03734
21174A9505Q881j6689l7695k5745k5725L0904m7828k531Q1476P1453K6263k6165
$$ plain form
21162 56104 61452 53678 21511 15679 36106 43565 -45426 -87286 18166 78827 -5217 -38498
21150 -38498 -36436 -82738 -79544 -101522 -124892 -113338 -26666 -16362 56363 70121 85548 79757
21138 79757 20434 5962 -25542 8142 27141 -52899 -93605 -36396 -46662 -136210 -142864 -89367
21126 -89367 -4893 53488 -3755 -41023 -79618 -36790 29282 -30197 -97322 -63773 -40925 -17357
21114 -17357 7665 -46990 -136576 -81432 -40074 -56882 -87378 -43221 -72272 -11608 36796 38844
21102 38844 -4552 -14117 1174 -56871 -133257 -171501 -167060 -127520 -133092 -111100 -33394 60423
21090 60423 77966 41839 39891 -131 -57858 -53085 -76328 -104279 -36467 -49432 -120661 -151216
21078 -151216 -84292 -35851 -22001 -64539 -86080 -90879 -33788 -3956 56703 57673 -19848 27357
$$ packed form
21162E6104N348p774l2167n832K0427P459q8991m1860J05452O0661q4044l3281
21150c8498K062m6302L194k1978k3370J1554Q6672J0304P2725J3758J5427n791
21138G9757n9323j4472l1504L3684J8999q0040m0706N7209j0266q9548o654N3497
21126h9367Q4474N8381n7243l7268l8595M2828O6072n9479o7125L3549K2848K3568
21114a7357K5022n4655q9586N5144M1358j6808l0496M4157k9051O0664M8404K048
21102C8844m3396r565J5291n8045p6386l8244M441L9540n572K1992P7706R3817
21090F0423J7543l6127j948m0022n7727M773k3243k7951O7812j2965p1229l0555
21078a51216O6924M8441J3850m2538k1541m799N7091K9832O0659R70p7521M7205
$$ plain form
21066 27357 35856 21680 -32150 -75562 -59357 -27379 -21061 -103891 -51537 -24599 -64568 -24982
21054 -24982 -37557 -57431 565 24330 12984 6776 26539 -14025 -54100 -33045 10448 25865
21042 25865 -12397 -43605 -68775 -39471 -81549 -105799 -77378 -25554 37904 92362 20380 -75376
21030 -75376 -80281 -19750 -45003 -23975 27096 80022 89483 77916 24214 -8846 -6961 -3740
21018 -3740 -10173 -12114 34161 63019 42838 27528 -23570 -65312 -13277 -34880 -76125 -46452
21006 -46452 -52093 3529 24819 25590 21427 44847 51788 -18787 -9448 21763 14584 -28154 -117343
20993 -117343 -177490 -176601 -219841 -219951 -117993 -31731 -41710 -14827 -35433 -42547 6984 13082 -6944
20980 -6944 -40514 -22080 -19143 -6191 42931 -49969 -52379 -57491 -71872 -49860 -50335 -19656 -18695
$$ packed form
21066B7357Q499j4176n3830m3412J6205L1978O318q2830N2354K6938l9969L9586
21054b4982j2575j9874N7996K3765j1346o208J9763m0564m0075K1055M3493J5417
21042B5865l8262l1208k5170K9304m2078k4250K8421N1824O3458N4458p1982r5756
21030g5376m905O0531k5253K1028N1071N2926R461j1567n3702l3060J885L221
21018c740o433j941M6275K8858k0181j5310n1098m1742N2035k1603m1245K9673
21006d6452n641N5622K1290P71m163K3420O941p0575R339L1211p179m2738q9189
20993a17343o0147Q89m3240j10J01958Q6262r979K6883k0606p114M9531O098k0026
20980f944l3570J8434K937J2952M9122r2900k410n112j4381K2012m75L0679R61
$$ plain form
20967 -18695 22298 -3719 18006 69013 21897 -8953 -48513 -109254 -124539 -78970 -87169 -88154
20955 -88154 -115118 -121722 -77595 -55435 -97758 -123501 -98044 -88552 -46789 -49400 -79844 -85819
20943 -85819 -35255 -61955 -91325 -34681 -21563 -79016 -116463 -75934 -7673 -47739 -33820 -66827
20931 -66827 -79656 -101965 -87059 -113852 -100307 -36674 2545 -52497 -25284 31822 85507 36010
20919 36010 -31956 -44346 -53322 -64838 -14220 -19683 -38037 -3844 28429 39705 48982 94170
20907 94170 62655 89172 116153 126277 60593 37019 48922 5350 24797 43342 45278 44077
20895 44077 32 -5165 -8740 -9761 -18173 828 939 6773 105 12034 -51417 -139440 -135014
20882 -135014 -84365 -105673 -99346 -134926 -105820 -85929 -58680 -29638 -31203 -24146 -24465 -73568
$$ packed form
20967a8695M0993k6017K1725N1007m7116l0850l9560o0741j5285M5569q199r85
20955h8154k6964o604M4127K2160m2323k5743K5457R492M1763k611l0444n975
20943h5819N0564k6700k9370N6644J3118n7453l7447M0529O8261m0066J3919l3007
20931f6827j2829k2309J4906k6793J3545O3633L9219n5042K7213N7106N3685m9497
20919C6010o7966j2390q976j1516N0618n463j8354L4193L2273J1276R277M5188
20907I4170l1515K6517K6981J0124o5684k3574J1903m3572J9447J8545J936j201
20895D4077m4045n197l575j021q412J9001J11N834o668J1929o3451q8023M426
20882a35014N0649k1308O327l5580K9106J9891K7249K9042j565P057l19m9103
$$ plain form
20870 -73568 -46656 -55839 -47109 -54396 -103284 -98505 -17101 92752 57176 -6627 -46839 -1933
20858 -1933 23361 -44365 -97694 -49220 -8522 -23242 -18872 34149 68843 81415 77163 72948
20846 72948 42626 17976 18570 20958 -55652 -88044 -93862 -50985 -45817 -97870 -114694 -114713 -96893
20833 -96893 -58075 -149519 -166615 -172463 -202870 -163553 -155546 -92094 -54301 -10257 -26491 -65670
20821 -65670 -73406 -82661 -74152 -141136 -97775 -48118 -41216 38213 101009 108073 13773 -84859 -130131
20808 -130131 -140252 -137156 -167195 -91393 -1241 -15083 -15926 19575 34764 79217 79087 55825
20796 55825 -35213 -70155 -61315 -60954 -106175 -140874 -130997 -75099 -120978 -144670 -108443 -83578
20784 -83578 -95491 -95675 -34463 -7821 -28997 -76602 -110916 -56217 20973 40725 -19165 -76606
$$ packed form
20870g3568K6912r183Q730p287m8888M779Q1404J09853l5576o3803m0212M4906
20858a933K5294o7726n3329M8474M0698j4720M370N3021L4694J2572m252m215
20846G2948l0322k4650N94K388p6610l2392n818M2877N168n2053j6824j9J7820
20833i6893L8818r1444j7096n848l0407L9317Q007O3452L7793M4044j6234l9179
20821f5670p736r255Q509o6984M3361M9657O902P9429O2796P064r4300r8632m5272
20808a30131j0121L096l0039P5802R0152j3842q43L5501J5189M4453j30k3262
20796E5825r1038l4942Q840L61m5221l4699R877N5898m5879k3692L6227K4865
20784h3578j1913j84O1212K6642k1176m7605l4314N4699P7190J9752n9890n7441
$$ plain form
20772 -76606 -71049 -101384 -172485 -122168 -43696 44197 45325 43523 62600 32748 40924 22036
20760 22036 -16789 -79632 -90491 -99269 -128347 -88203 -13427 -41267 -113151 -112683 -68561 -40762
20748 -40762 -20035 -32784 -28142 -18094 49188 63016 25148 32944 83639 71355 2349 -7589
20736 -7589 -47054 -41455 -118151 -128160 -59519 -18147 -66391 -100846 -162483 -115262 -63826 -32774
20724 -32774 -46061 -112061 -143896 -75039 -71968 -65404 -61317 -26445 1349 101135 88649 65455
20712 65455 -47954 -129789 -135582 -99341 -106516 -66116 -37716 -58015 -43697 -31055 -39652 -79222
20700 -79222 -85978 -73292 -25878 -27575 -71120 -99458 -59593 -54341 -47337 -37244 -40807 -20265 -28070
20687 -28070 -9973 18616 -10158 18605 1602 2298 39285 45691 39141 58902 29074 49396
$$ packed form
20772g6606N557l0335p1101N0317P8472Q7893J128j802J9077k9852Q176j8888
20760B2036l8825o2843j0859q778k9078M0144P4776k7840p1884M68M4122K7799
20748d0762K0727j2749M642J0048O7282J3828l7868P796N0695j2284o9006r938
20736g589l9465N599p6696j0009O8641M1372m8244l4455o1637M7221N1436L1052
20724c2774j3287o6000l1835O8857L071O564M087L4872K7794R9786j2486k3194
20712F5455j13409q1835n793L6241p175M0400K8400k0299J4318J2642q597l9570
20700g9222o756J2686M7414j697m3545k8338L9865N252P004J0093l563K0542p805
20687b8070J8097K8589k8774K8763j7003O96L6987O406o550J9761k9828K0322
$$ plain form
20675 49396 76507 127980 82932 22841 30294 -18998 -121033 -119784 -108827 -59825 -36647 -35413
20663 -35413 -42322 -65996 -103374 -22235 8155 19191 26010 11074 -15596 -32499 -46340 -30866
20651 -30866 5138 35077 2805 -20719 15984 -32517 -27239 -56714 -94247 -64888 72615 30698
20639 30698 -34064 -45272 -70577 -31057 -5484 53331 74506 36448 57544 101171 55641 -7714
20627 -7714 2240 -169 18367 74353 104765 136518 96983 63533 -13499 -43213 -54129 -49572
20615 -49572 31361 66595 29863 -9657 -41438 31542 47297 62381 120323 146135 133200 148461
20603 148461 151253 131149 145925 111039 56206 66921 61742 90201 107074 114603 108916 129721
20591 129721 146541 139641 116881 146808 168664 182701 194563 225190 188198 100055 110845 128410
$$ packed form
20675D9396K7111N1473m5048o0091P453m9292j02035J249J0957M9002K3178J234
20663c5413o909k3674l7378Q1139L0390J1036O819j4936k6670j6903j3841J5474
20651c0866L6004K9939l2272k3524L6703m8501N278k9475l7533K9359J37503m1917
20639C0698o4762j1208k5305L9520K5573N8815K1175l8058K1096M3627m5530o3355
20627g714R954k409J8536N5986L0412L1753l9535l3450p7032k9714j0916M557
20615d9572Q0933L5234l6732l9520l1781P2980J5755J5084N7942K5812j2935J5261
20603A48461K792k0104J4776l4886n4833J0715n179K8459J6873P529n687K0805
20591A29721J6820o900k2760K9927K1856J4037J1862L0627l6992q8143J0790J7565
$$ plain form
20579 128410 153862 188677 219440 260661 264749 253442 177025 203508 196305 210563 173589 201739
20567 201739 225062 291401 326572 272152 257441 206143 216354 269460 286256 297925 254413
20556 254413 321061 323864 330935 435996 497202 505540 492939 499546 516801 539912 540769 564526
20544 564526 581051 680586 784285 799953 775682 868684 965573 975276 1092159 1135111 1170497
20533 1170497 1190159 1231083 1282019 1290838 1288489 1373831 1418066 1448912 1487655 1536630 1562821 1602733
20521 1602733 1628550 1628593 1670370 1703403 1744489 1773238 1801114 1843487 1861373 1813172 1765860 1753601
20509 1753601 1705272 1693650 1727045 1683643 1662956 1685597 1719954 1747291 1728541 1675698 1664525
20498 1664525 1629783 1627637 1630079 1691413 1739176 1816518 1834561 1842461 1792175 1745451 1738776 1762622
$$ packed form
20579A28410K5452L4815L0763M1221M088j1307p6417K6483p203J4258l6974K8150
20567B01739K3323O6339L5171n4420j4711n1298J0211N3106J6796J1669m3512
20556B54413O6648K803P071J05061O1206Q338j2601O607J7255K3111Q57K3757
20544E64526J6525R9535J03699J5668k4271R3002R6889R703J16883M2952L5386
20533A170497J9662M0924N0936Q819k349Q5342M4235L0846L8743M8975K6191L9912
20521A602733K5817M3M1777L3033M1086K8749K7876M2373J7886m8201m7312j2259
20509A753601m8329j1622L3395m3402k0687K2641L4357K7337j8750n2843j1173
20498A664525l4742k146K442O1334M7763P7342J8043P900n0286m6724o675K3846
$$ plain form
20486 1762622 1729532 1771111 1780446 1767889 1778008 1768070 1714263 1622551 1508399 1445593 1365356
20475 1365356 1324248 1239506 1201098 1191376 1136555 1075121 1056260 999394 956902 944370 920578
20464 920578 917837 935815 816617 743481 708760 683106 662212 612661 554324 567286 507789
20453 507789 456936 446631 486208 453083 376947 365875 382749 290271 203061 195755 265584 252704
20441 252704 240932 223200 245069 248495 259315 237977 249133 185906 190751 121072 85695 149914
20429 149914 207067 196266 164176 182829 229794 255999 228241 204027 171327 161526 230039 184164
20417 184164 104935 46645 54549 82649 95705 75823 80890 59647 42317 21760 20273 3558
20405 3558 -38984 -25997 -20104 20682 99464 93868 43526 39918 44770 20183 12347 21148 35633
$$ packed form
20486A762622l3090M1579R335j2557J0119r938n3807r1712j14152o2806q0237
20475A365356m1108q4742l8408r722n4821o1434j8861n6866m2492j2532k3792
20464I20578k741J7978j19198p3136l4721k5654k0894m9551n8337J2962n9497
20453E07789n0853j0305L9577l3125p6136j1072J6874r2478q7210p306O9829j2880
20441B52704j1772j7732K1869L426J0820k1338J1156o3227M845o9679l5377O4219
20429A49914N7153j0801l2090J8653M6965K6205k7758k4214l2700r801O8513m5875
20417A84164p9229n8290P904K8100J3056j9882N067k1243j7330k0557j487j6715
20405C558m2542J2987N893M0786P8782n596n0342l608M852k4587p836Q801J4485
$$ plain form
20392 35633 138988 139300 127561 84630 55077 -3421 -97810 -86312 23996 37580 62972 99310
20380 99310 116049 101533 120776 97487 112588 80327 807 27106 72979 64751 56109 13675
20368 13675 33443 62080 7264 -12084 -35453 -42329 -46887 -685 18148 -3370 22866 56919
20356 56919 57198 56365 50503 1956 -14480 -66166 -36135 -32293 -40256 25756 31437 32129 95308 91488
20342 91488 13459 -54791 -71599 -72019 -87614 -95010 -16605 47992 34724 64084 47136 -24008
20330 -24008 -63311 -28304 -13948 -14106 -5531 -5862 -102235 -125162 -377 8367 -70028 -89532 -55896
20317 -55896 -26936 -38936 -16788 -31921 -25320 -6309 -7977 12809 -48682 -108888 -56888 -23911
20305 -23911 -8287 -60855 -72524 -91649 -91069 -40779 -38565 5458 -29619 -101692 -115791 -146365
$$ packed form
20392C5633J03355L12j1739m2931k9553n8498r4389J1498J10308J3584K5392L6338
20380I9310J6739j4516J9243k3289J5101l2261p9520K6299M5873q228q642m2434
20368A3675J9768K8637n4816j9348k3369o876m558M6202J8833k1518K6236L4053
20356E6919K79q33n862m8547j6436n1686L0031L842p963O6012N681O92O3179l820
20342I1488p8029o8250j6808m20j5595p396P8405O4597j3268K9360j6948p1144
20330b4008l9303L5007J4356j58Q575l31r6373k2927J24785Q744p8395j9504L3636
20317e5896K8960j2000K2148j5133O601J9011j668K0786o1491o0206N2000L2977
20305b3911J5624n2568j1669j9125N80N0290K214M4023l5077p2073j4099l0574
$$ plain form
20293 -146365 -133155 -46206 29860 -133 -46924 -88453 -110538 -86737 -93544 -75780 -68574 -33413
20281 -33413 -29044 -7821 -34194 -37769 -2784 -14138 -26798 -2732 22622 3978 -36402 -27220
20269 -27220 6201 47422 27331 -54796 -95757 -50957 35494 93125 59587 56294 44986 64202
20257 64202 94828 4931 -22978 -25330 -53036 -3988 34357 29730 24284 -22037 -48573 6984
20245 6984 15646 -31205 2156 29281 40138 75073 26011 -31913 -106091 -110732 -71443 -67211
20233 -67211 -91160 -81422 -74824 -53289 -69597 -38962 -43937 -52300 -78627 -81998 -84565 -53294 -49582
20220 -49582 -6764 31218 44039 -12175 -56528 -96961 -131294 -62538 -80172 -99282 -81687 -37213
20208 -37213 -32501 -1974 -61846 -57496 -52023 -164236 -167843 -118898 -92750 -95447 -118231 -116562 -84901
$$ packed form
20293a46365J3210Q6949P6066k9993m6791m1529k2085K3801o807J7764P206L5161
20281c3413M369K1223k6373l575L4985j1354j2660K4066K5354j8644m0380R182
20269b7220L3421M1221k0091q2127m0961M4800Q6451N7631l3538l293j1308J9216
20257F4202L0626q9897k7909k352k7706M9048L8345m627n446m6321k6536N5557
20245F984Q662m6851L3361K7125J0857L4935m9062n7924p4178m641L9289M232
20233f7211k3949R738O598K1535j6308L0635m975q363k6327l371k567L1271L712
20220d9582M2818L7982J2821n6214m4353m0433l4333O8756j7634j9110J7595M4474
20208c7213M712L0527n9872M350N473j12213l607M8945K6148k697k2784J669L1661
$$ plain form
20195 -84901 -69647 -56343 -70695 -94410 -95048 -87481 -89101 -26396 -45805 -143513 -165196 -163696 -109781
20182 -109781 -67476 -77003 -111962 -40234 25576 31706 40246 97471 42386 -91417 -120268 -156308
20170 -156308 -69605 -9346 -14897 -28197 3048 -12635 -10589 1288 28486 -3054 -3416 -16504
20158 -16504 -59242 -47641 -2780 -17060 -60189 -70686 -71929 -67301 -91297 -83399 -52774 -18869
20146 -18869 49292 72061 30910 -58260 -84439 -105218 -127493 -146820 -154480 -73193 -36905 -17068
20134 -17068 22582 -12777 -73909 -24724 -18500 -24546 -59772 -87518 -111247 -88155 -112174 -81374
20122 -81374 -35458 60657 33204 -53339 -108158 -55364 30658 64776 44561 -19650 -62207 -56722
20110 -56722 -117353 -130156 -71508 -44202 -52130 -34016 -7681 22600 20553 7285 63444 39316
$$ packed form
20195h4901J5254J3304j4352k3715o38P567j620O2705j9409r7708k1683J500N3915
20182a09781M2305r527l4959P1728O5810O130Q540N7225n5085j33803k8851l6040
20170a56308Q6703O0259n551j3300L1245j5683K046J1877K7198l1540l62j3088
20158a6504m2738J1601M4861j4280m3129j0497j243M628k3996P898L0625L3905
20146a8869O8161K2769m1151q9170k6179k0779k2275j9327p660Q1287L6288J9837
20134a7068L9650l5359o1132M9185O224o046l5226k7746k3729K3092k4019L0800
20122h1374M5916R6115k7453q6543n4819N2794Q6022L4118k0215o4211m2557N485
20110e6722o0631j2803N8648K7306p928J8114K6335L0281k047j3268N6159k4128
$$ plain form
20098 39316 40392 2601 -52754 -41323 -17521 -6087 -20307 -79386 -112951 -10484 70491 53019
20086 53019 -43369 -96075 -14410 -43993 -50490 -69626 -75005 -68624 -18026 49156 13362 -26701
20074 -26701 -24481 -47336 -116289 -105723 -85261 -70765 -66092 -27977 -43949 -88909 -56566 -57242
20062 -57242 -43126 -86844 -102749 -120989 -105517 -67335 -128588 -141310 -11747 46123 -1809
20051 -1809 -12091 -25462 -71212 -58209 -66110 -49601 6652 -27092 -106326 -149337 -88362 -51558
20039 -51558 -36259 -32105 9836 -15771 -78955 -68488 -85336 -22571 42221 30622 -20623 -46678
20027 -46678 -116737 -144503 -150064 -126096 -106483 -11875 14083 -11656 -29998 -50090 -30578 7042
20015 7042 47811 59316 9866 1514 21386 28183 -6482 -25260 -52999 3811 -41288 -119998
$$ packed form
20098C9316J076l7791n5355J1431K3802J1434j4220n9079l3565J02467Q0975j7472
20086E3019r6388n2706Q1665k9583o497j9136n379O381N0598O7182l5794m0063
20074b6701K220k2855o8953J0566K0462J4496M673L8115j5972m4960L2343o76
20062e7242J4116m3718j5905j8240J5472L8182o1253j2722J29563N7870m7932
20051a809j0282j3371m5750J3003p901J6509N6253l3744p9234m3011O0975L6804
20039e1558J5299M154M1941k5607o3184J0467j6848O2765O4792j1599n1245k6055
20027d6678p0059k7766n561K3968J9613R4608K5958k5739j8342k0092J9512L7620
20015G042M0769J1505m9450q352J9872O797l4665j8778k7739N6810m5099p8710
$$ plain form
20003 -119998 -124460 -150011 -219543 -210376 -111063 -103748 -172290 -198881 -167548 -102421 -80597 -4592
19991 -4592 27865 5989 11562 1861 24659 -41135 -52364 -5148 -30299 -4836 2970 12804 46974
19978 46974 40953 -18171 -114234 -93468 -1658 29309 31456 1112 -56960 -17708 74053 111389
19966 111389 113471 83925 -19776 -86696 -76747 -44029 8720 -26678 -116254 -53809 -32761 -118358
19954 -118358 -99074 -83981 -139439 -55240 -37661 -97839 -61715 -55799 -30965 68696 115295 56292
19942 56292 -43836 -68038 -109523 -131675 -47728 -41211 -77021 -81178 -4823 22959 9537 -2294
19930 -2294 -36505 -89193 -123170 -103995 -98344 -89534 -120955 -140356 -113039 -147613 -113361 -18707
19918 -18707 53122 40224 1469 -17668 55444 74461 -20536 -1782 29162 -6799 -60432 -45768
$$ packed form
20003a19998m462k5551o9532R167R9313P315o8542k6591L1333O5127K1824P6005
19991d592L2457k1876N573r701K2798o5794j1229M7216k5151K5463P806R834L4170
19978D6974o021n9124r6063K0766R1810L0967K147l0344n8072L9252R1761L7336
19966A11389K082k9546j03701o6920R949L2718N2749l5398q9576O2445K1048q5597
19954a18358J9284J5093n5458Q4199J7579o0178L6124N916K4834R9661M6599n9003
19942E6292j00128k4202m1485k2152Q3947O517l5810m157P6355K7782j3422j1831
19930b294l4211n2688l3977J9175N651Q810l1421j9401K7317l4574L4252R4654
19918a8707P1829j2898l8755j9137P3112J9017r4997J8754L0944l5961n3633J4664
$$ plain form
19906 -45768 -54699 -50934 -4672 27193 46906 157156 219246 269764 309110 382751 366430 335538
19894 335538 386066 420749 528278 641407 701561 776058 799291 794625 687833 622078 565507
19883 565507 488480 425827 431496 460420 420455 448871 438432 380887 338083 286264 256785 270932
19871 270932 271742 173887 145941 246209 297593 265819 211094 169120 173635 204553 208529 235784
19859 235784 189263 205062 221424 269184 287199 367025 468542 526583 547551 612534 697400
19848 697400 829832 911333 957190 970638 940194 1022718 1155182 1393006 1576669 1606483 1641152
19837 1641152 1602003 1474329 1346448 1199184 1086684 1071324 1049817 1003541 1048654 1033032
19827 1033032 1022879 913371 859807 760492 603549 501022 380931 283568 335112 332154 295401
$$ packed form
19906d5768q931L765M6262L1865J9713J10250O2090N0518L9346P3641j6321l0892
19894C35538N0528L4683J07529J13129O0154P4497K3233m666j06792o5755n6571
19883E65507p7027o2653N669K8924l9965K8416j0439n7545m2804n1819k9479J4147
19871B70932Q10r7855k7946J00268N1384l1774n4725m1974M515L0918L976K7255
19859B35784m6521J5799J6362M7760J8015P9826J01517N8041K0968O4983Q4866
19848F97400J32432Q1501M5857J3448l0444Q2524J32464K37824J83663K9814L4669
19837A641152l9149j27674j27881j47264j12500j5360k1507m6276M5113j5622
19827A033032j0153j09508n3564r9315j56943j02527j20091r7363N1544k958l6753
$$ plain form
19816 295401 368103 388943 287517 196941 213873 200048 202275 196174 176971 189565 208245 271634
19804 271634 279528 301962 331337 378399 478705 542445 558744 567011 534516 481725 497082 614563
19792 614563 650571 736080 757798 776582 837799 799859 694861 631762 616280 601072 573328
19781 573328 543006 552790 563697 523536 506940 501347 419711 316471 189064 153319 170241
19770 170241 172325 167300 131879 105214 109045 22434 10244 -14489 -14255 -51499 -77044 -114188
19758 -114188 -78624 -41859 -80185 -93031 -111435 -111405 -4039 48000 -11282 -25635 12951 15762
19746 15762 27041 3316 23970 20320 39618 -29085 -44514 -39713 -78871 -140779 -160144 -119026
19734 -119026 -43966 -27739 -68933 -101597 -107685 -113585 -74935 -100131 -150863 -154184 -138875 -71285
$$ packed form
19816B95401P2702K0840j01426r0576J6932j3825K227o101j9203J2594J8680O3389
19804B71634P894K2434K9375M7062J00306O3740J6299Q267l2495n2791J5357J17481
19792F14563L6008Q5509K1718J8784O1217l7940j04998o3099j5482j5208k7744
19781E73328l0322R784J0907m0161j6596n593q1636j03240j27407l5745J6922
19770A70241K084n025l5421k6665L831q6611j2190k4733K34l7244k5545l7144
19758a14188L5564L6765l8326j2846j8404L0J07366N2039n9282j4353L8586K811
19746A5762J1279k3725K0654l650J9298o8703j5429M801l9158o1908j9365M1118
19734a19026P5060J6227m1194l2664o088n900L8650k5196n0732l321J5309O7590
$$ plain form
19722 -71285 -58060 -133970 -170376 -165589 -196148 -154625 -126205 -84726 -68799 -75180 -114044 -104037
19710 -104037 -106163 -89877 -6269 47982 29607 40529 25901 20074 45598 -35717 -117866 -151685
19698 -151685 -82380 -2954 18059 -57501 -65174 -13213 59916 47589 -19951 -67463 -156815 -141239
19686 -141239 -100521 -121478 -55092 19430 89254 66579 -9100 -19250 -38788 -26317 -38476
19675 -38476 -65111 -87536 -120124 -126314 -85083 -31311 -42483 -47829 -19841 16908 -31287 -27780
19663 -27780 -2898 14103 39036 62086 -18885 -138098 -160097 -119708 -36512 4755 -1069 -66965
19651 -66965 -82440 -9887 -56648 -113680 -51007 -61051 -23727 19627 27158 32773 9965 23931
19639 23931 20494 42443 24551 49377 6639 -62521 -115864 -73579 -83807 -37260 -19899 7227
$$ packed form
19722g1285J3225p5910l6406M787l0559M1523K8420M1479J5927o381l8864J0007
19710a04037k126J6286Q3608N4251j8375J0922j4628n827K5524q1315q2149l3819
19698a51685O9305P9426K1013p5560p673N1961P3129j2327o7540m7512q9352J5576
19686a41239M0718k0957O6386P4522O9824k2675p5679j0150j9538J2471j2159
19675c8476k6635k2425l2588o190M1231N3772j1172n346K7988L6749m8195L507
19663b7780K4882J7001K4933K3050q0971j19213k1999M0389Q3196M1267n824o5896
19651f6965j5475P2553m6761n7032O2673j0044L7324M3354P531N615k2808J3966
19639B3931l437K1949j7892K4826m2738o9160n3343M2285j0228M6547J7361K7126
$$ plain form
19627 7227 -22054 -2018 -56610 -35054 32588 1426 -20518 -48514 -59431 -38456 -91136 -132085
19615 -132085 -147078 -165264 -123566 -101274 -103100 -65223 -108449 -110521 -83580 -75041 -97474 -52792
19603 -52792 -86744 -85903 -106392 -125996 -95353 -42255 -57010 -73879 -58379 -67578 -49449 76306
19591 76306 145823 129092 81170 36054 11931 -11023 3036 -643 -12822 -84031 -102424 -97932
19579 -97932 -64979 -25006 -64191 -72698 -49630 -38034 -74543 -38594 35906 40032 52759 43925
19567 43925 29280 57757 85702 99037 72093 42746 72905 120975 131719 143567 175856 133520
19555 133520 157141 159658 63103 52658 78933 62918 121803 169293 218052 268699 309521 303359
19543 303359 311810 326104 331279 251347 173200 179977 108115 82184 158075 206760 218660 274310
$$ packed form
19627G227k9281K0036n4592K1556O7642l1162k1944k7996j0917K0975n2680m0949
19615a32085j4993j8186M1698K2292j826L7877m3226k072K6941Q539k2433M4682
19603e2792l3952Q41k0489j9604L0643N3098j4755j6869J5500r199J8129J25755
19591G6306O9517j6731m7922m5116k4123k2954J4059l679j2179p1209j8393M492
19579i7932L2953L9973l9185q507K3068J1596l6509L5949P4500M126J2727q834
19567D3925j4645K8477K7945J3335k6944k9347L0159M8070J0744J1848L2289m2336
19555A33520K3621K517r6555j0445K6275j6015N8885M7490M8759N0647M0822o162
19543C03359Q451J4294N175p9932p8147O777p1862k5931P5891M8685J1900N5650
$$ plain form
19531 274310 380851 420371 417844 305064 230179 238401 290536 376691 420497 500463 514197
19520 514197 455995 399246 390160 418172 501447 465928 449167 437218 415348 408797 362048 311398
19508 311398 315449 301853 301339 310094 364908 393090 407482 477485 589189 726662 812015 881276
19496 881276 805175 693685 595178 496927 396198 330178 239288 227709 245759 223431 244766
19485 244766 292323 390586 425178 526688 576597 622499 642915 590938 461146 301005 313194
19474 313194 263342 195543 276826 388769 447418 392556 390005 365327 300467 199989 182502
19463 182502 212529 136181 91765 45275 23801 75619 138629 201849 214503 203849 159206
19452 159206 92474 61321 12064 -25839 -55702 -78331 -87272 -101989 -89363 -121709 -135562 -116062
$$ packed form
19531B74310J06541L9520k527j12780p4885Q222N2135Q6155M3806P9966J3734
19520E14197n8202n6749r086K8012Q3275l5519j6761j1949k1870o551m6749n0650
19508C11398M051j3596n14Q755N4814K8182J4392P0003J11704J37473Q5353O9261
19496H81276p6101j11490r8507r8251j00729o6020r0890j1579J8050k2328K1335
19485B44766M7557R8263L4592J01510M9909M5902K0416n1977j29792j60141J2189
19474C13194m9852o7799Q1283J11943N8649n4862k551k4678o4860j00478j7487
19463A82502L0027p6348m4416m6490k1474N1818O3010O3220J2654j0654m4643
19452A59206o6732l1153m9257l7903k9863k2629q941j4717J2626l2346j3853J9500
$$ plain form
19440 -116062 -58532 -32124 -55990 -61142 -95229 -71933 -34776 -61647 -55521 -84484 -94599 -95317
19428 -95317 -67251 -66538 -78342 -80970 -21730 26866 43870 31841 22231 25829 -68964 -97578 -30448
19415 -30448 -14626 -38564 -44560 -76189 -71346 34853 1709 4008 -12821 -77530 -72398 -29504
19403 -29504 18792 -4229 -29950 -57737 -114596 -101508 -134410 -149454 -94750 -57113 -22316 34486
19391 34486 26778 26442 69202 18217 -1941 17233 -18764 -6200 -63009 -37234 -15006 -23820
19379 -23820 23359 -11252 295 72527 55323 52853 38586 42859 24555 -15251 -50939 5004
19367 5004 -86014 -100273 -52570 -87806 -83340 -51440 -82628 -59656 -70989 -99491 -67616 -20086
19355 -20086 -69342 -110914 -104296 -100444 -71833 -17075 -23901 -43632 18457 -14859 10718 -73395
$$ packed form
19440a16062N7530K6408k3866n152l4087K3296L7157k6871O126k8963j0115p18
19428i5317K8066P13j1804k628N9240M8596J7004j2029r610L598r4793k8614O7130
19415c0448J5822k3938n996l1629M843J06199l3144K299j6829o4709N132M2894
19403b9504M8296k3021k5721k7787n6859J3088l2902j5044N4704L7637L4797N6802
19391C4486p708l36M2760n0985k0158J9174l5997J2564n6809K5775K2228q814
19379b3820M7179l4611J1547P2232j7204k470j4267M273j8304l9806l5688N5943
19367E004r1018j4259M7703l5236M466L1900l1188K2972j1333k8502L1875M7530
19355b0086m9256m1572O618L852K8611N4758o826j9731O2089l3316K5577q4113
$$ plain form
19343 -73395 -18407 40235 -8581 -53184 -93041 -32719 -995 -27617 -13374 -382 -23894 10585
19331 10585 -34693 -65946 -62059 -48377 -74442 -31660 25013 -31555 1367 -13130 -9758 19123
19319 19123 14154 50613 67360 79949 -7637 -8450 -3769 -6682 15040 34972 24639 9414 4004
19306 4004 18567 35278 47165 5511 6045 3784 21681 75168 44686 22384 104483 133700
19294 133700 37089 6335 60400 39427 73282 81205 -20225 -23222 29209 50801 52081 89858
19282 89858 192451 161825 122104 109651 111519 93182 97187 111245 81186 35355 66540 112986
19270 112986 76410 52064 50407 53152 45584 81294 70750 50556 98714 147907 144997 107026
19258 107026 101885 79816 64058 101758 87686 3835 7364 -17912 25247 73298 128098 112229
$$ packed form
19343g3395N4988N8642m8816m4603l9857O0322L1724k6622J4243J2992k3512L4479
19331A0585m5278l1253L887J3682k6065M2782N6673n6568L2922j4497L372K8881
19319A9123m969L6459J6747J2589q7586q13M681k913K1722J9932j0333j5225n410
19306D004J4563J6711J1887m1654N34k261J7897N3487l0482k2302Q2099K9217
19294A33700r6611l0754N4065k0973L3855P923j01430k997N2431K1592J280L7777
19282H9858J02593l0626l9721j2453J868j8337M005J4058l0059m5831L1185M6446
19270A12986l6576k4346j657K745p568L5710j0544k0194M8158M9193k910l7971
19258A07026n141k2069j5758L7700j4072q3851L529k5276M3159M8051N4800j5869
$$ plain form
19246 112229 177118 255990 237268 246813 214571 165596 109113 160969 216007 229448 247804 248879
19234 248879 234456 195981 184602 255241 305486 368042 363370 338784 321727 303025 272348 275172
19222 275172 303158 337979 294224 311301 266242 250307 226436 195572 244686 224725 226910 241277
19210 241277 223101 246705 333256 330599 249347 160766 162039 192161 204672 256155 309375 393094
19198 393094 393300 318894 295422 293588 237807 238150 222773 243663 352771 314116 273696 272311
19186 272311 282468 263584 210037 200688 223833 263159 247911 212207 261242 342710 381547 383282
19174 383282 301157 273392 239156 123746 136772 190917 170230 197695 215165 198452 232690
19163 232690 264333 334849 442077 523600 567399 489253 452957 403369 369953 291991 235319
$$ packed form
19246A12229O4889P8872j8722R545l2242m8975n6483N1856N5038J3441J8356J075
19234B48879j4423l8475j1379P0639N0245O2556m672k4586j7057j8702l0677K824
19222B75172K7986L4821m3755J7077m5059j5935k3871l0864M9114j9961K185J4367
19210B41277j8176K3604Q6551k657q1252q8581J273L0122J2511N1483N3220Q3719
19198C93094K06p4406k3472j834n5781L43j5377K0890J09108l8655m0420j385
19186B72311J0157j8884n3547r349K3145L9326j5248l5704M9035Q1468L8837J735
19174C83282q2125k7765l4236j15410J3026N4145k0687K7465J7470j6713L4238
19163B32690L1643P0516J07228Q1523M3799p8146l6296m9588l3416p7962n6672
$$ plain form
19152 235319 257047 266623 294218 354162 371830 382703 438483 465333 458384 517506 488171 519228
19140 519228 626628 607320 616660 675522 783812 820677 827009 921659 1059235 1242749 1274812
19129 1274812 1278943 1356475 1453184 1496663 1620231 1692172 1607189 1542120 1521665 1467887 1457465
19118 1457465 1435772 1426403 1402654 1393039 1394598 1348597 1284198 1231636 1240643 1237505 1238432 1230610 1227163
19105 1227163 1222172 1261405 1324836 1404653 1455266 1512969 1600142 1735228 1826277 1884355 1911491
19094 1911491 1994135 2111641 2229557 2289687 2371700 2474040 2601177 2677622 2739642 2793787
19084 2793787 2977059 3129304 3225126 3369129 3557542 3719163 3756831 3736289 3825550 3961610
19074 3961610 4181608 4383235 4432617 4416237 4566486 4615889 4659544 4647308 4710501 4961016
$$ packed form
19152B35319K1728R576K7595N9944J7668J0873N5780K6850o949N9122k9335L1057
19140E19228J07400j9308R340N8862J08290L6865O332R4650J37576J83514L2063
19129A274812M131P7532R6709M3479J23568P1941q4983o5069k0455n3778j0422
19118A457465k1693r369k3749r615J559m6001o4399n2562R007l138R27p822l447
19105A227163m991L9233O3431P9817N0613N7703Q7173J35086R1049N8078K7136
19094A911491Q2644J17506J17916O0130Q2013J02340J27137P6445O2020N4145
19084B793787J83272J52245R5822J44003J88413J61621L7668k0542Q9261J36060
19074C961610K19998K01627M9382j6380J50249M9403M3655j2236O3193K50515
$$ plain form
19064 4961016 5477025 6354108 7586713 9019730 10067709 10177157 9353389 8399243 7948861
19055 7948861 8125052 8851794 9841069 10678994 10917018 10599049 10169393 10111796 10474368 11137591
19045 11137591 12056340 13453720 15595463 18984663 24064468 30559673 37141419 41483169
19037 41483169 42295301 42121669 45466004 55028901 70579200 88517180 100848311 99512678
19029 99512678 85386970 71586663 65474856 65118094 67429715 70109394 71254282 68933717
19021 68933717 64036275 62090657 65143888 70611802 74639578 74425453 70411576 66886420
19013 66886420 67215237 72974684 85322724 104477172 127356581 145248250 148053913 133382756
19005 133382756 111970872 95548771 88444019 90473241 98219912 105693145 106112138 96067982
$$ packed form
19064D961016N16009Q77083J232605J433017J047979J09448q23768r54146m50382
19055G948861J76191P26742R89275Q37925K38024l17969m29656n7597L62572O63223
19045A1137591R18749J397380K141743L389200N079805O495205O581746M341750
19037D1483169Q12132j73632L344335R562897J5550299J7937980J2331131j335633
19029I9512678j4125708j3800307o111807l56762K311621K679679J144888k320565
19021F8933717m897442j945618L053231N467914M027776k14125m013877l525156
19013F6886420L28817N759447J2348040J9154448K2879409J7891669K805663j4671157
19005A33382756k1411884j6422101p104752K029222P746671P473233M18993j0044156
$$ plain form
18997 96067982 81345904 69730063 62872249 59832377 59670164 61414994 63909644 66410107
18989 66410107 70372731 79647924 96495910 119137548 140642918 150661563 143031851
18982 143031851 125713682 112757318 106617468 100956062 90299737 76755739 67642648
18975 67642648 65042217 68346931 78097765 95170488 118440986 141638530 153610043
18968 153610043 145198248 121833217 99245666 81917410 67183606 55389785 47119736
18961 47119736 41678701 38115024 35783487 34692769 34465659 34107175 32935725 31043710
18953 31043710 29622921 29240127 29448167 29635414 29513063 29032743 28224359 27030719 25082599
18944 25082599 22184081 19017201 16685263 15160987 14243001 13419198 12512851 11840011 11585922
$$ packed form
18997I6067982j4722078j1615841o857814l039872j62213J744830K494650K500463
18989F6410107L962624R275193J6847986K2641638K1505370J0018645p629712
18982A43031851j7318169j2956364o139850n661406j0656325j3543998r113091
18975F7642648k600431L304714R750834J7072723K3270498K3197544J1971513
18968A53610043q411795k3365031k2587551j7328256j4733804j1793821q270049
18961D7119736n441035l563677k331537j090718k27110l58484j171450j892015
18953C1043710j420789l82794K08040J87247j22351m80320q08384j193640j948120
18944B5082599k898518l166880k331938j524276r17986q23803r06347o72840k54089
$$ plain form
18935 11585922 11761730 12109375 12035236 11128293 9698056 8398695 7382328 6591095 6029066
18926 6029066 5533655 5147798 4762366 4405591 4050537 3793168 3542678 3401226 3179116
18917 3179116 3052164 2915236 2729425 2559403 2404495 2350704 2368112 2366441 2232376 2184428
18907 2184428 2137471 2040994 1945295 1904671 1872161 1826352 1802254 1734724 1594824 1490249 1443118
18896 1443118 1414994 1416744 1386723 1387828 1246030 1115530 1096520 1197338 1235173 1237750 1285994
18885 1285994 1269314 1167191 1016695 992987 1054052 1016357 962544 948438 920354 890258 868399
18874 868399 821207 797792 850198 751744 702803 665598 720035 735465 731332 745480 678760 673786
18862 673786 600744 620802 706167 740415 808840 807428 812512 723395 720825 696519 649501 663247
$$ packed form
18935A1585922J75808L47645p4139r06943j430237j299361j016367p91233n62029
18926F029066m95411l85857l85432l56775l55054k57369k50490j41452k22110
18917C179116j26952j36928j85811j70022j54908n3791J7408j671j34065m7948
18907B184428m6957r6477r5699m0624l2510m5809k4098o7530j39900j04575m7131
18896A443118k8124J750l0021J105j41798j30500j9010J00818L7835K577M8244
18885A285994j6680j02123j50496k3708O1065l7695n3813j4106k8084l0096k1859
18874H68399m7192k3415N2406r8454m8941l7205N4437J5430m133J4148o6720m974
18862F73786p3042K0058Q5365L4248O8425j412N084q9117k570k4306m7018J3746
$$ plain form
18850 663247 671952 665309 628094 637344 619606 567837 501474 435891 370426 348456 320087 349884
18838 349884 368993 348824 292909 294928 302364 374942 415080 476335 429054 352650 348944 373300
18826 373300 380467 361249 365567 400522 395736 382265 348874 323682 229664 207368 205223 224258
18814 224258 289077 313446 308016 265300 256829 260018 274283 296186 291549 252716 217250 226504
18802 226504 233075 265487 253878 224658 254615 239126 186062 124100 26964 44538 76458 83112
18790 83112 88795 68447 70770 114579 117974 110701 147233 86137 93866 133269 118433 -8572
18778 -8572 -41540 63564 199542 245558 266256 320595 382830 450729 547379 686227 848801
18767 848801 957042 981293 831655 663611 521049 451309 522497 492349 461214 446137 423230
$$ packed form
18850F63247Q705o643l7215R250j7738n1769o6363o5583o5465k1970k8369K9797
18838C49884J9109k0169n5915K019P436P2578M0138O1255m7281p6404l706K4356
18826C73300P167j9218M318L4955m786j3471l3391k5192r4018k2296k145J9035
18814B24258O4819K4369n430m2716q471L189J4265K1903m637l8833l5466R254
18802B26504O571L2412j1609k9220K9957j5489n3064o1962r7136J7574L1920O654
18790H3112N683k0348K323M3809L395p273L6532o1096P729L9403j4836j27005
18778h572l2968J05104J35978M6016K0698N4339O2235O7899R6650J38848J62574
18767H48801J08241K4251j49638j68044j42562o9740P1188l0148l1135j5077k2907
$$ plain form
18756 423230 397408 400870 448659 412856 360731 319188 294650 301651 302709 369229 412769 374607
18744 374607 316739 361552 350029 377169 434642 493783 434825 414468 452687 495877 512273
18733 512273 505493 458251 453454 501946 526246 595177 590231 560146 595384 612527 626863 591688
18721 591688 568373 543619 554398 578900 519938 518965 566464 595063 535445 531885 508412 487052
18709 487052 472494 524163 604460 665768 658555 659491 581151 509947 502760 536043 508365 497910
18697 497910 467090 441264 443523 436812 453577 502382 518775 575542 578320 509624 414111 421521
18685 421521 425692 467095 467871 532966 668954 673233 569236 460187 502917 508049 473825 424955
18673 424955 385170 375728 420595 406586 359544 376129 482282 626512 793385 847740 841797
$$ packed form
18756D23230k5822L462M7789l5803n2125m1543k4538P001J058O6520M3540l8162
18744C74607n7868M4813j1523K7140N7473N9141n8958k0357L8219M3190J6396
18733E12273o780m7242m797M8492K4300O8931m946l0085L5238J7143J4336l5175
18721E91688k3315k4754J0779K4502n8962r73M7499K8599n9618l560k3473k1360
18709D87052j4558N1669Q0297O1308p213R36p8340p1204p187L3283k7678j0455
18697D97910l0820k5826K259o711J6765M8805J6393N6767K778o8696r5513P410
18685D21521M171M1403P76O5095J35988M279j03997j09049M2730N132l4224m8870
18673D24955l9785r442M4867j4009m7042J6585J06153J44230J66873N4355n943
$$ plain form
18662 841797 768200 660385 509066 400613 298424 230812 199803 180290 163108 136864 103371
18651 103371 113994 145461 103033 144461 197376 280778 317104 344793 263697 207580 205767 209810
18639 209810 225777 218357 164735 144790 120920 101133 122690 165756 167145 205817 224414 209360
18627 209360 188388 230736 233539 246640 274721 351545 420253 464518 465398 476371 536333 499544
18615 499544 528026 540086 506126 501433 517728 553634 557956 513680 595360 684331 824359 971297
18603 971297 1111214 1150157 993412 908309 851072 810748 875104 932304 946785 931182 1027824
18592 1027824 1055131 1072609 1204984 1311922 1377762 1429455 1566028 1883585 2225433 2635962
18582 2635962 3161975 3911670 4800145 5854872 6691012 6786331 5916071 4877252 4360493
$$ packed form
18662H41797p3597j07815j51319j08453j02189o7612l1009j9513j7182k6244l3493
18651A03371J0623L1467m2428M1428N2915Q3402L6326K7689q1096n6117j813M043
18639B09810J5967p420n3622j9945k3870j9787K1557M3066J389L8672J8597j5054
18627B09360k0972M2348K803J3101K8081P6824O8708M4265Q80J0973N9962l6789
18615D99544K8482J2060l3960m693J6295L5906M322m4276Q1680Q8971J40028J46938
18603I71297J39917L8943j56745q5103n7237m0324O4356N7200J4481j5603R6642
18592A027824K7307J7478J32375J06938O5840N1693J36573L17557L41848M10529
18582B635962N26013P49695Q88475J054727Q36140R5319q70260j038819n16759
$$ plain form
18573 4360493 4378195 4807958 5457628 6186427 6629792 6518621 6182069 6025832 5791565 5077178
18563 5077178 4314479 3857259 3609688 3489988 3513429 3586829 3670283 3906872 4123840 4313630
18553 4313630 4639082 4950850 5351397 5926928 6755506 7993903 9838382 12384549 15809524
18544 15809524 19444288 22020380 22611622 21728780 21592379 23279998 26598073 31340062
18536 31340062 37255210 43361860 47309833 46481938 42823394 41698008 43419104 45534561
18528 45534561 46116064 44923181 42506571 41414594 43887927 49366157 56494305 64313803
18520 64313803 73575253 88776044 113084920 143489879 171748249 186930379 185760669
18513 185760669 173916154 159118963 154032742 159924455 168018499 168289135 156680683 140158088
$$ packed form
18573D360493J7702M29763O49670P28799M43365j11171l36552j56237k34267p14387
18563E077178p62699m57220k47571j19700K3441P3400Q3454K36589K16968J89790
18553D313630L25452L11768M00547N75531Q28578J238397J844479K546167L424975
18544A5809524L634764K576092N91242q82842j36401J687619L318075M741989
18536C1340062N915148O106650L947973q27895l658544j125386J721096K115457
18528D5534561N81503j192883k416610j091977K473333N478230P128148P819498
18520F4313803R261450J5200791K4308876L0404959K8258370J5182130j169710
18513A85760669j1844515j4797191n086221N891713Q094044K70636j1608452j6522595
$$ plain form
18505 140158088 126430646 121680748 124998808 131241450 134554864 130996431 122684824 115294001
18497 115294001 110670032 111416594 119218573 135126571 161254043 195692320 230265163
18490 230265163 253981708 260941617 254252196 238475876 218400407 199098227 181998796
18483 181998796 168176117 153662658 135864779 122035383 117378255 121359478 133479070
18476 133479070 154163167 184284702 223500794 264567420 288388602 273371100 220466459
18469 220466459 173165564 144734774 126046365 112995131 103295714 93812198 85626311
18462 85626311 80840280 78238795 75222846 69498551 61160903 53365470 47299091 42832062
18454 42832062 39647412 37583041 36743738 37574797 40192955 44136805 47697243 48476609
$$ packed form
18505A40158088j3727442m749898L318060O242642L313414l558433q311607p390823
18497A15294001m623969P46562P801979J5907998K6127472L4438277L4572843
18490B30265163K3716545O959909o689421j5776320k0075469j9302180j7099431
18483A81998796j3822679j4513459j7797879j3829396m657128L981223J2119592
18476A33479070K0684097L0121535L9216092M1066626K3821182j5017502n2904641
18469B20466459m7300895k8430790j8688409j3051234r699417r483516q185887
18462H5626311m786031k601485l015949n724295q337648p795433o066379m467029
18454D2832062l184650k064371q39303Q31059K618158L943850L560438P79366
$$ plain form
18446 48476609 44674900 37466532 30680135 25738554 22397603 19979882 18068372 16462232
18438 16462232 15059532 13887483 13017288 12392319 11883772 11234679 10549993 9981028 9629966
18429 9629966 9483766 9334107 9005294 8409487 7674480 7121759 6675420 6255720 5815508
18420 5815508 5411297 5051440 4782524 4562224 4375078 4275112 4154429 4053867 3778290 3556425
18410 3556425 3434539 3320986 3230032 3097718 3031414 2937685 2857091 2771286 2685878 2654437 2578748
18399 2578748 2486926 2445433 2374481 2320762 2182927 2143660 2109087 2096418 2184236 2183523 2175669 2115247
18387 2115247 2046561 1959346 1872013 1811478 1748817 1688437 1671622 1656783 1606540 1563574 1486417
18376 1486417 1419512 1449670 1413319 1355569 1400431 1436869 1399053 1450976 1515447 1486699 1450430
$$ packed form
18446D8476609l801709p208368o786397m941581l340951k417721j911510j606140
18438A6462232j402700j172049q70195o24969n08547o49093o84686n68965l51062
18429I629966j46200j49659l28813n95807p35007n52721m46339m19700m40212
18420E815508m04211l59857k68916k20300j87146r9966j20683j00562k75577k21865
18410C556425j21886j13553r0954j32314o6304r3729q0594q5805q5408l1441p5689
18399B578748r1822m1493p0952n3719j37835l9267l4573j2669Q7818p13p854o0422
18387B115247o8686q7215q7333o0535o2661o0380j6815j4839n0243m2966p7157
18376A486417o6905L0158l6351n7750M4862L6438l7816N1923O4471k8748l6269
$$ plain form
18365 1450430 1438153 1402220 1329714 1255281 1200772 1170191 1129017 1069684 1024770 1006707 1052012
18354 1052012 1072701 1072455 1061558 981959 1025136 1087403 1087788 1017665 995971 969140 1006261 1079964
18342 1079964 1080536 1046633 984660 964912 962500 890886 829300 845574 834375 806366 804505 838888
18330 838888 840027 835187 795437 738235 693134 640264 576022 539787 530129 498599 489158 456059
18318 456059 445177 372031 381359 407788 440066 482935 544873 458877 352850 397363 413656
18307 413656 446028 508047 467339 421807 295107 178142 191996 198095 174914 88769 47217
18296 47217 100912 159187 127417 39174 -7814 48227 97498 114066 179420 191945 98453 -14938
18284 -14938 -82839 -194190 -282827 -358790 -331674 -277530 -223172 -171755 -189261 -181318 -119569 -90296
$$ packed form
18365A450430j2277l5933p2506p4433n4509l0581m1174n9333m4914j8063M5305
18354A052012K0689k46j0897p9599M3177O2267L85p0123k1694k6831L7121P3703
18342A079964N72l3903o1973j9748k412p1614o1586J6274j1199k8009j861L4383
18330H38888J139m840l9750n7202m5101n2870o4242l6235r658l1530r441l3099
18318D56059j0882p3146R328K6429L2278M2869O1938q5996j06027M4513J6293
18307D13656L2372O2019m0708m5532j26700j16965J3854O099k3181q6145m1552
18296D7217N3695N8275l1770q8243m6988N6041M9271J6568O5354J2525r3492j13391
18284a4938o7901j11351q8637p5963K7116N4144N4358N1417j7506P943O1749K9273
$$ plain form
18272 -90296 -78112 -46593 -14975 51119 88156 158122 175440 101907 136964 183714 148548 130166
18260 130166 162181 92655 11845 21033 81622 23043 128 37994 41037 67710 121548 132865
18248 132865 120945 103466 77227 121475 105509 43372 27437 57855 110556 197251 199093 198397
18236 198397 228036 142714 175743 214685 236635 112156 98577 132639 144845 144270 133332 144328
18224 144328 98867 76898 102690 106347 161910 187476 214705 216700 176687 124756 129089 156462
18212 156462 130080 100883 142152 141131 234134 262988 192096 184902 161447 210115 201422 228507
18200 228507 242182 213757 224129 225771 169599 108051 112358 124861 105415 121063 177837 205606
18188 205606 182091 176174 197317 159314 148119 192512 234460 190090 207271 237807 230771 214929
$$ packed form
18272i0296J2184L1519L1618O6094L7037O9966J7318p3533L5057M6750l5166j8382
18260A30166L2015o9526q0810R188O0589n8579k2915L7866L043K6673N3838J1317
18248A32865j1920j7479k6239M4248j5966o2137j5935L0418N2701Q6695J842o96
18236A98397K9639q5322L3029L8942K1950j24479j3579L4062J2206n75j0938J0996
18224A44328m5461k1969K5792L657N5563K5566K7229J995m0013n1931M333K7373
18212A56462k6382k9197M1269j021R3003K8854p0892p194k3455M8668q693K7085
18200B28507J3675k8425J0372J642n6172o1548M307J2503j9446J5648N6774K7769
18188B05606k3515n917K1143l8003j1195M4393M1948m4370J7181L0536p036j5842
$$ plain form
18176 214929 165333 114811 105363 100525 122885 150968 128576 207386 290394 300255 400007 450974
18164 450974 373745 452201 494621 671619 1037760 1594937 2284338 2871918 3036993 2656296
18154 2656296 1925430 1320929 1064069 950309 786058 692130 644372 655778 697330 723350
18144 723350 704497 662800 621191 699236 789685 809296 736333 667765 667749 757780 808293 834427
18132 834427 892960 955029 989454 1043391 1137060 1191125 1294195 1473334 1671404 1966585 2275197
18121 2275197 2724792 3248574 3888710 4768981 5915169 7669254 10353492 14562766 21415127
18112 21415127 32767343 50750892 75457579 100186514 111187527 95820907 63457948
18105 63457948 41610402 30003410 23382253 19332992 16700901 14822054 13544162 12659752
$$ packed form
18176B14929m9596n0522r448m838K2360K8083k2392P8810Q3008R861R9752N0967
18164D50974p7229P8456M2420J76998L66141N57177O89401N87580J65075l80697
18154B656296p30866o04501k56860j13760j64251r3928m7758J1406M1552K6020
18144G23350j8853m1697m1609P8045R0449J9611p2963o8568j6R0031N0513K6134
18132H34427N8533O2069L4425N3937R3669N4065J03070J79139J98070K95181L08612
18121B275197M49595N23782O40136Q80271J146188J754085K684238M209274O852361
18112B1415127J1352216J7983549K4706687K4728935J1001013j5366620l2362959
18105F3457948k1847546j1606992o621157m049261k632091j878847j277892q84410
$$ plain form
18097 12659752 12096182 11576566 10867004 9749043 8590553 7572167 6654023 5840775 5116092
18088 5116092 4575271 4155007 3711126 3395855 3085191 2745203 2428755 2192926 1991968
18079 1991968 1923181 1830731 1666636 1540527 1462293 1345178 1213429 1151445 1084307 958469
18069 958469 879690 856559 719094 627109 669724 724839 694348 656614 594164 512756 495219
18058 495219 404210 395899 411545 404848 441772 438037 413316 407127 393628 399038 435334 390612
18046 390612 332771 309875 372490 372294 391455 450575 456909 496995 478032 505563 574803 505166
18034 505166 493582 563770 595541 569542 551277 503221 498544 497650 518643 498712 543514 591479
18022 591479 566946 538981 582983 559943 599075 730026 891381 994557 1015913 967154 915325
$$ packed form
18097A2659752n63570n19616p09562j117961j158490j018386r18144q13248p24683
18088E116092n40821m20264m43881l15271l10664l39988l16448k35829k00958
18079A991968o8787r2450j64095j26109p8234j17115j31749o1984o7138j25838
18069I58469p8779k3131j37465r1985M2615N5115l0491l7734o2450q1408j7537
18058D95219r1009q311J5646o697L6924l735k4721o189j3499N410L6296m4722
18046C90612n7841k2896O2615j96J9161N9120O334M0086j8963K7531O9240o9637
18034E05166j1584P0188L1771k5999j8265m8056m677q94K0993j9931M4802M7965
18022E91479k4533k7965M4002k3040L9132J30951J61355J03176K1356m8759n1829
$$ plain form
18011 915325 748535 727988 702670 657545 692775 656862 676474 620592 575839 635768 647691
18000 647691 568520 512496 486898 486509 492172 527750 524544 588995 575288 572129 657956 740905
17988 740905 799790 791548 793723 849357 864973 935649 991961 1000570 939907 901934 915163 895337
17976 895337 844777 890620 873813 855830 804536 837876 891845 984573 979848 1010385 972942 927574
17964 927574 917286 880968 930945 879784 748444 672331 653623 609567 566580 601632 575313
17953 575313 608398 617696 621629 607117 579861 532042 518850 485173 390204 265255 234938 324268
17941 324268 435377 494669 440404 395436 365280 386546 353050 278358 239328 214862 262426
17930 262426 399807 550196 636369 683157 651189 554079 482831 430870 455615 403684 343454
$$ packed form
18011I15325j66790k0547k5318m5125L5230l5913J9612n5882m4753N9929J1923
18000F47691p9171n6024k5598l89N663L5578l206O4451j3707l159Q5827Q2949
17988G40905N8885q242K175N5634J5616P0676N6312Q609o0663l7973J3229j9826
17976H95337n0560M5843j6807j7983n1294L3340N3969R2728m725L0537l7443m5368
17964I27574j0288l6318M9977n1161j31340p6113j8708m4056m2987L5052k6319
17953E75313L3085R298L933j4512k7256m7819j3192l3677r4969j24949l0317Q9330
17941C24268J11109N9292n4265m4968l0156K1266l3496p4692l9030k4466M7564
17930B62426J37381J50389Q6173M6788l1968r7110p1248n1961K4745n1931o0230
$$ plain form
17919 343454 199367 129614 99917 149149 162715 160365 214175 200918 251712 261282 238489 239622
17907 239622 149119 137669 130986 110592 169864 175782 194048 240980 231708 210406 166445 111513
17895 111513 99479 121402 154150 170050 91891 -13794 -34348 11751 -24412 -45749 33250
17884 33250 67325 31642 61219 36332 -14861 26450 91175 181906 182848 103107 47873 73867
17872 73867 116219 145401 79600 79756 94016 96079 136765 80647 100493 121903 103788 73847
17860 73847 61366 127162 164151 182501 176713 159826 94525 27349 59297 13575 19989 31234
17848 31234 31357 98562 80230 57430 22198 -10142 26319 51404 47352 55728 97790 118041
17836 118041 136983 155601 111097 131385 160248 62730 -60274 -53368 9690 35280 62564
$$ packed form
17919C43454j44087o9753k9697M9232J3566k350N3810j3257N0794R570k2793J133
17907B39622r0503j1450o683k0394N9272N918J8266M6932r272k1302m3961n4932
17895A11513j2034K1923L2748J5900p8159j05685k0554M6099l6163k1337P8999
17884C3250L4075l5683K9577k4887n1193M1311O4725R0731R42p9741n5234K5994
17872G3867M2352K9182o5801J56J4260K063M0686n6118J9846K1410j8115k9941
17860G3847j2481O5796L6989J8350n788j6887o5301o7176L1948m5722O414J1245
17848C1234J23O7205j8332k2800l5232l2340L6461K5085m052Q376M2062K0251
17836A18041J8942J8618m4504K0288K8863r7518j23004O906O3058K5590K7284
$$ plain form
17825 62564 69236 133957 127447 38095 -48324 22698 47729 49053 33697 54181 66162 76416
17813 76416 97855 109814 121341 110397 104328 116649 124105 116022 132492 117598 43327 -64685
17801 -64685 -63260 -1283 67755 67731 81412 138831 84023 84412 81150 87367 92135 128217 172775
17788 172775 200757 223831 197710 221727 231649 238733 232473 247420 245690 240119 264567 306868
17776 306868 312723 263863 199520 236709 249226 200676 118742 115322 144467 191154 207118 196033
17764 196033 200267 239005 151584 92419 73185 154078 180681 187055 184555 121979 112094 101833
17752 101833 95889 82568 126731 84354 72737 44290 44926 60633 49222 42710 68608 102879
17740 102879 17884 16697 51034 2885 38467 106972 122813 52963 28329 71111 94569 44491
$$ packed form
17825F2564O672O4721o510q9352q6419P1022K5031J324j5356K0484J1981J0254
17813G6416K1439J1959J1527j0944o069J2321P456q083J6470j4894p4271j08012
17801f4685J425O1977O9038k4J3681N7419n4808L89l262O217M768L6082M4558
17788A72775K7982K3074k6121K4017R922P084o260J4947j730n571K4448M2301
17776C06868N855m8860o4343L7189J2517m8550q1934l420K9145M6687J5964j1085
17764A96033M234L8738q7421n9165j9234Q0893K6603O374k500o2576r885j0261
17752A01833n944j3321M4163m2377j1617k8447O36J5707j1411o512K5898L4271
17740A02879q4995j187L4337m8149L5582O8505J5841o9850k4634M2782K3458n0078
$$ plain form
17728 44491 6792 144 56326 140821 239383 310010 375032 507450 655766 790663 851789
17717 851789 847901 684523 519644 327028 224025 157244 52224 42416 -5902 -3590 56523
17706 56523 118186 141891 98855 83324 40384 51103 17321 -3023 11995 13318 29117 31813
17694 31813 -22339 -85398 -98305 -37226 -23496 -25267 -34909 16983 53773 67104 91562 92048
17682 92048 136601 82844 40543 33889 30116 -2812 14011 10402 -26683 17577 46478 26639
17670 26639 -19730 21509 50921 40660 18057 -14318 28195 96990 185281 245751 232738 229182
17658 229182 82412 3433 77578 169419 182276 164115 150032 152707 149880 178177 95737 -3714
17646 -3714 30301 141726 220346 202783 209148 240852 224547 188140 98462 203805 290332 254703
$$ packed form
17728D4491l7699o648N6182Q4495R8562P0627O5022J32418J48316J34897O1126
17717H51789l888j63378j64879j92616j03003o6781j05020r808m8318K312O0113
17706E6523O1663K3705m3036j5531m2940J0719l3782k0344J5018J323J5799K696
17694C1813n4152o3059j2907O1079J3730j771r642N1892L6790J3331K4458M86
17682I2048M4553n3757m2301o654l773l2928J6823l609l7085M4260K8901j9839
17670B6639m6369M1239K9412j0261k2603l2375M2513O8795Q8291O0470j3013l556
17658B29182j46770p8979P4145R1841J2857j8161j4083K675k827K8297q2440r9451
17646c714L4015J11425P8620j7563O365L1704j6305l6407q9678J05343Q6527l5629
$$ plain form
17634 254703 221736 190811 220833 219110 180236 130576 95182 98465 186489 251758 269574 280547
17622 280547 330455 381070 333324 278952 259487 275002 297596 318866 314309 343581 385007 393675
17610 393675 339017 240424 255438 308308 261125 263703 367660 351112 381745 398686 509508
17599 509508 509930 537717 604811 758349 877437 995955 1067921 1223991 1422213 1754200 2348318
17588 2348318 3313928 4935876 7464516 11033376 14790827 16997224 15841993 11832451
17580 11832451 7961911 5654683 4443352 3702395 3215420 2898796 2656978 2529205 2536849
17571 2536849 2685908 2719069 2627253 2458781 2338705 2226073 2101573 2073927 2065737 2180699
17561 2180699 2402806 2701755 3087919 3555066 3913079 4052927 3931744 3619590 3418417
$$ packed form
17634B54703l2967l0925L0022j723l8874m9660l5394L283Q8024O5269J7816J0973
17622B80547M9908N0615m7746n4372j9465J5515K2594K1270m557K9272M1426Q668
17610C93675n4658r8593J5014N2870m7183K578J03957j6548L0633J6941J10822
17599E09508M22K7787O7094J53538J19088J18518P1966J56070J98222L31987N94118
17588B348318R65610J621948K528640L568860L757451K206397j155231m009542
17580A1832451l870540k307228j211331p40957m86975l16624k41818j27773P644
17571B536849J49059L3161r1816j68472j20076j12632j24500k7646q190J14962
17561B180699K22107K98949L86164M67147L58013J39848j21183l12154k01173
$$ plain form
17552 3418417 3355444 3360194 3549683 3758678 4033040 4373217 4817273 5370790 6149176 7169349
17542 7169349 8563168 10068281 11680543 13369607 15470844 18223482 22378862 28945232
17534 28945232 39300519 55801491 82670367 125254002 186808933 261313900 328691834
17527 328691834 361276673 345101418 293544074 220692439 154148546 111469419 86713168
17520 86713168 71635082 61925642 55491030 51259378 48325148 45901660 43374550 40378898
17512 40378898 36638027 32587966 28628478 25035176 21907071 19299612 17059956 15226131
17504 15226131 13710179 12362419 11211458 10257018 9466492 8793263 8331193 8046680 7868703
17495 7868703 7727361 7378274 6792761 6063329 5262871 4659139 4145354 3745532 3453450
$$ packed form
17552C418417o2973M750J89489K08995K74362L40177M44056N53517P78386J020173
17542G169349J393819J505113J612262J689064K101237K752638M155380O566370
17534B8945232J0355287J6500972K6868876M2583635O1554931P4504967O7377934
17527C28691834L2584839j6175255n1557344p2851635o6543893m2679127k4756251
17520H6713168j5078086r709440o434612m231652k934230k423488k527110k995652
17512D0378898l740871m050061l959488l593302l128105k607459k239656j833825
17504A5226131j515952j347760j150961r54440p90526o73229m62070k84513j77977
17495G868703j41342l49087n85513p29432q00458o03732n13785l99822k92082
$$ plain form
17486 3453450 3140628 2926876 2746778 2563497 2361535 2201819 2024393 1873153 1820262 1676123
17476 1676123 1510248 1342451 1246327 1212251 1150581 1114944 1164831 1129644 1055474 1020739 1031289
17465 1031289 971911 909546 817679 807419 814178 739323 729709 845740 842163 788071 800553 755360
17453 755360 748987 709766 651101 630353 624770 638910 621704 674972 798418 884819 1040079
17442 1040079 1140267 1051561 897933 734825 603055 641910 621988 570953 565215 523310 515527
17431 515527 499746 520069 537125 492967 512393 587368 631924 598959 500205 475208 520634
17420 520634 513863 411550 236279 242104 353916 394059 350172 355153 385330 401342 410770 393338
17408 393338 388026 401885 437560 517275 553112 538804 505208 434401 350485 338533 343310 333448
$$ packed form
17486C453450l12822k13752j80098j83281k01962j59716j77426j51240n2891j44139
17476A676123j65875j67797r6124l4076o1670l5637M9887l5187p4170l4735J0550
17465A031289n9378o2365r1867j0260O759p4855r614J16031l577n4092J2482m5193
17453G55360o373l9221n8665k0748n583J4140j7206N3268J23446Q6401J55260
17442A040079J00188q8706j53628j63108j31770L8855j9922n1035n738m1905p783
17431E15527j5781K0323J7056m4158J9426P4975M4556l2965r8754k4997M5426
17420E20634o771j02313j75271N825J11812M0143m3887M981L0177J6012R428j7432
17408C93338n312J3859L5675P9715L5837j4308l3596p0807q3916j1952M777r862
$$ plain form
17396 333448 354853 358125 322317 280813 274277 218755 241163 323990 355772 347510 311502 334020
17384 334020 384705 401497 449565 439800 437861 407366 392614 419309 362206 362186 353383 319222 278992
17371 278992 272484 318503 334774 265221 177065 203275 243169 261603 251840 275043 318663 377790
17359 377790 400453 372063 347918 320614 362487 344431 256202 255834 225791 222604 284080 304095
17347 304095 301004 304368 345045 307006 290544 253090 118643 -25543 -235583 -408218 -483934
17336 -483934 -531041 -545569 -437101 -298507 -228097 -158243 -90812 -38950 8430 -2914 -67825
17325 -67825 -48670 -12659 43300 30414 -11835 -7715 2107 4035 67081 73291 49860 82154
17313 82154 75731 91701 53913 63565 9290 -1977 59448 67349 102899 136375 115618 97600
$$ packed form
17396C33448K1405L272l5808m1504o536n5522K2408Q2827L1782q262l6008K2518
17384C34020N0685J6792M8068r765j939l0495j4752K6695n7103k0q803l4161m0230
17371B78992o508M6019J6271o9553q8156K6210L9894J8434r763K3203M3620N9127
17359C77790K2663k8390k4145k7304M1873j8056q8229l68l0043l187O1476K0015
17347C04095l091L364M0677l8039j6462l7454j34447j44186k10040j72635p5716
17336d83934m7107j4528J08468J38594P0410O9854O7431N1862M7380j1344o4911
17325f7825J9155L6011N5959j2886m2249M120R822J928O3046O210k3431L2294
17313H2154o423J5970l7788R652n4275j1267O1425P901L5550L3476k0757j8018
$$ plain form
17301 97600 44332 84579 78598 49115 123764 205946 190549 110658 37893 32759 159327 288473
17289 288473 211606 109973 128503 77655 46214 -10397 67274 101579 39558 106360 200240
17278 200240 157051 97446 70862 84374 170792 194757 179469 174274 152619 144143 135967 190768
17266 190768 239565 160493 84575 48015 75483 100308 180340 261700 175431 113653 123604 82546
17254 82546 52915 96585 131103 117314 114582 94162 70676 61597 30068 57674 114817 119918
17242 119918 96180 61488 54778 35086 70906 131771 175051 134751 116047 32448 38979 153346
17230 153346 161386 147317 120134 162397 258676 297926 230134 157812 132316 140888 111440 91366
17218 91366 183202 235709 223647 205388 234989 260225 219161 226357 249100 249315 276860 270946
$$ packed form
17301I7600n3268M0247n981k9483P4649Q2182j5397p9891p2765n134J26568J29146
17289B88473p6867j01633J8530n0848l1441n6611P7671L4305o2021O6802R3880
17278B00240m3189n9605k6584J3512Q6418K3965j5288n195k1655q476q176N4801
17266A90768M8797p9072p5918l6560K7468K4825Q0032Q1360q6269o1778R951m1058
17254H2546k9631M3670L4518j3789k732k0420k3486r079l1529K7606N7143N101
17242A19918k3738l4692o710j9692L5820O0865M3280m0300j8704q3599O531J14367
17230A53346Q040j4069k7183M2263R6279L9250o7792p2322k5496Q572k9448k0074
17218I1366R1836N2507j2062j8259K9601K5236m1064P196K2743K15K7545n914
$$ plain form
17206 270946 240183 131993 142311 147428 99643 84560 120454 114403 62911 83454 116745 81220
17194 81220 62907 35764 33100 1345 -7765 94807 156886 156464 135108 130097 125740 49031 75692
17181 75692 67175 82787 58411 138788 203711 204077 174062 205112 196944 176330 145673 115016
17169 115016 56310 15205 76793 86372 60179 65574 175078 214998 218357 201953 197752 243699
17157 243699 206046 183786 180712 179262 145548 82165 50325 91574 155483 186739 227056 205374
17145 205374 229320 260756 232481 170609 114303 98116 105421 104101 49762 63745 139707 102867
17133 102867 66916 77279 92141 106467 74292 159225 127718 90943 133166 170721 214942
17122 214942 227579 141640 162899 177185 209105 243057 323692 350448 404540 397250 365182 376883
$$ packed form
17206B70946l0763j08190J0318N117m7785j5083L5894o051n1492K0543L3291l5525
17194H1220j8313k7143k664l1755r110J02572O2079m22k1356n011m357p6709K6661
17181G5692q517J5612k4376Q0377O4923L66l0015L1050q168k0614l0657l0657
17169A15016n8706m1105O1588R579k6193N395J09504L9920L359j6404m201M5947
17157B43699l7653k2260l074j450l3714o3383l1840M1249O3909L1256M0317k1682
17145B05374K3946L1436k8275o1872n6306j6187P305j320n4339J3983P5962l6840
17133A02867l5951J0363J4862J4326l2175Q4933l1507l6775M2223L7555M4221
17122B14942J2637q5939K1259J4286L1920L3952Q0635K6756N4092p290l2068J1701
$$ plain form
17110 376883 261951 184408 95127 118076 194816 240812 274720 189450 184552 172152 125328
17099 125328 121326 56831 19284 67807 90170 77668 78733 60176 46634 60762 71774 36781
17087 36781 73781 85623 80971 105527 33986 -69391 -64500 26823 42416 25938 43716 80019
17075 80019 92688 104136 74706 76715 92246 129143 141476 91012 32034 74034 68906 20821
17063 20821 13542 -10949 45559 62623 85588 121980 80120 41531 48312 50187 62446 47535
17051 47535 24494 25061 250 -20087 -16719 -19238 -2713 -35778 -62125 -95614 -26364 10809
17039 10809 9850 100845 65425 -58638 -69122 52333 110893 128298 83274 55824 36246 49893
17027 49893 95812 160565 130533 106375 63163 68584 57249 72772 31026 -20161 42069 121787
$$ packed form
17110C76883j14932p7543q9281K2949P6740M5996L3908q5270m898j2400m6824
17099A25328m002o4495l7547M8523K2363j2502J065j8557j3542J4128J1012l4993
17087C6781L7000J1842m652K4556p1541j03377M891R1323J5593j6478J7778L6303
17075H0019J2669J1448k9430K009J5531L6897J2333n0464n8978M2000n128m8085
17063B0821p279k4491N6508J7064K2965L6392m1860l8589O781J875J2259j4911
17051D7535k3041N67k4811k0337L368k519J6525l3065k6347l3489O9250L7173
17039A0809r59R0995l5420j24063j0484J21455N8560J7405m5024k7450j9578J3647
17027D9893M5919O4753l0032k4158m3212N421j1335J5523m1746n1187O2230P9718
$$ plain form
17015 121787 147467 102098 93750 117589 84788 122751 166988 116648 82053 40028 87085 137652
17003 137652 22343 -68652 -96074 -61448 5656 118395 165776 171427 112427 102472 133459
16992 133459 142970 157374 68822 56253 48778 36585 75545 72995 60520 23023 -5950 -45160
16980 -45160 -94714 -119299 -109579 -43293 7492 -9231 -16244 27233 89615 105734 176882 195900
16968 195900 172061 51242 31198 75061 70629 26404 6878 67668 14690 -50681 -32931
16957 -32931 37265 100080 90871 91253 98712 112680 126437 124262 195966 178760 207559 210562 261618
16944 261618 309769 397696 534139 730925 1065110 1496342 1769983 1838441 1774322 1536482
16934 1536482 1167942 858804 625473 472810 375968 405081 412956 405600 386216 385452 395283
$$ packed form
17015A21787K5680m5369q348K3839l2801L7963M4237n0340l4595m2025M7057N0567
17003A37652j15309r0995k7422L4626O7104J12739M7381N651n9000r955L0987
16992A33459R511J4404q8552j2569p475j2193L8960k550j2475l7497k8973l9210
16980d5160m9554k4585R720O6286N0785j6723p013M3477O2382J6119P1148J9018
16968A95900k3839j20819k0044M3863m432m4225j9526O0790n2978o5371J7750
16957c2931P0196O2815r209L82P459J3968J3757k175P1704j7206K8799L003N1056
16944B61618M8151Q7927J36443J96786L34185M31232K73641O8458o4119k37840
16934A536482l68540l09138k33331j52663r6842K9113P875p356j9384p64R831
$$ plain form
16923 395283 400316 316659 233264 162304 122691 131039 124918 98767 55574 28121 2419 5747
16911 5747 -13028 -28708 -2563 39565 61076 16143 36922 86355 100520 65092 72070 60796
16899 60796 76511 52929 -31255 -97040 -56951 -23214 7295 -9385 -64 34392 66752 44187
16887 44187 75046 134668 183764 130355 141960 150512 66854 9406 7281 46692 65378 13610
16875 13610 -30334 -49620 -37214 -10738 19871 102156 152790 157716 226311 237815 203779 142436
16863 142436 100987 102831 130197 90340 130987 124610 112790 64034 70569 110877 77894 88172
16851 88172 18155 -40085 -25149 18963 67360 31781 -91 15525 79943 70281 49002 33756
16839 33756 33270 55669 76424 100293 167959 178486 129692 141048 99544 64852 68361 18756
$$ packed form
16923C95283N033q3657q3395p0960l9613Q348o121k6151m3193k7453k5702L328
16911E747j8775j5680K6145M2128K1511m4933K0779M9433J4165l5428O978j1274
16899F0796J5715k3582q4184o5785M0089L3737L0509j6680R321L4456L2360k2565
16887D4187L0859N9622M9096n3409J1605Q552q3658n7448k125L9411J8686n1768
16875A3610m3944j9286J2406K6476L0609Q2285N0634M926O8595J1504l4036o1343
16863A42436m1449J844K7366l9857M0647o377j1820m8756O535M0308l2983J0278
16851H8172p0017n8240J4936M4112M8397l5579l1872J5616O4418r662k1279j5246
16839C3756m86K2399K0755K3869O7666J0527m8794J1356m1504l4692L509m9605
$$ plain form
16827 18756 8084 30493 -28668 -17797 44555 97403 82221 86892 107633 179381 236649 207475
16815 207475 85508 101771 101817 50911 38399 49494 36584 23064 63984 62460 -15770 -54880
16803 -54880 -65951 -43100 -77953 -99631 -75169 -17430 -33172 -14369 48988 56791 27469 17542
16791 17542 32157 20018 -14774 -50995 3211 15093 22819 65140 55910 63383 24316 40110
16779 40110 64826 80006 100533 155931 158232 129196 198292 213897 210194 196276 234351 206611
16767 206611 123861 68369 43993 -2961 -65407 -49516 13547 33069 28571 10542 -21768 -3183
16755 -3183 6656 -71701 -56307 37235 85881 73059 17415 -37662 -39848 -24679 -8022 -3454
16743 -3454 -301 16518 23114 9904 -30084 -2388 8930 -16249 919 36870 50671 -3417
$$ packed form
16827A8756j0672K2409n9161J0871O2352N2848j5182M671K0741P1748N7268k9174
16815B07475j21967J6263M6n0906j2512J1095j2910j3520M0920j524p8230l9110
16803e4880j1071K2851l4853k1678K4462N7739j5742J8803O3357P803k9322r927
16791A7542J4615j2139l4792l6221N4206J1882P726M2321r230P473l9067J5794
16779D0110K4716J5180K0527N5398K301k9036O9096J5605l703j3918L8075k7740
16767B06611q2750n5492k4376m6954o2446J5891O3063J9522m498j8029l2310J8585
16755c183R839p8357J5394R3542M8646j2822n5644n5077k186J5169J6657M568
16743c454L153J6819O596j3210l9988K7696J1318k5179J7168L5951J3801n4088
$$ plain form
16731 -3417 -3973 -11436 -73161 -1557 69991 8881 66034 87215 14511 -38637 -26427 -23569 -87221
16718 -87221 -129073 -111352 -154735 -195050 -144932 -85050 -49158 -10770 -58476 -60715 -7504 -40682
16706 -40682 -30410 11759 18734 -21388 41862 122758 100712 26787 26617 80866 56877 -3511
16694 -3511 -1308 -54303 -55822 -30011 -23847 -20646 49401 25496 -34613 -88081 -22068 -7298 23786
16681 23786 126992 157718 100615 112391 166221 144754 118223 75745 -3650 -59668 -33891
16670 -33891 -55350 -33919 -17866 -13218 44722 36702 87267 32295 23043 16609 11889 -5328 37607
16657 37607 68567 73241 -15969 -51059 -55869 43968 18592 -62856 -80860 -81699 5919 83175
16645 83175 27579 28889 98599 108502 112021 87395 -19391 -56741 -12808 7603 -28638 5107
$$ packed form
16731c417n56p463o1725P1604P1548o1110N7153K1181p2704n3148J2210K858o3652
16718h7221m1852J7721m3383m0315N0118N9882L5892L8388m7706k239N3211l3178
16706d0682J0272M2169O975m0122O3250Q0896k2046p3925j70N4249k3989o0388
16694c511K203n2995j519K5811O164L201P0047k3905o0109n3468O6013J4770L1084
16681B3786J03206L0726n7103J1776N3830k1467k6531m2478p9395n6018K5777
16670c3891k1459K1431J6053M648N7940q020N0565n4972r252o434m720j7217M2935
16657C7607L0960M674q9210l5090m810R9837k5376q1448j8004q39Q7618P7256
16645H3175n5596J310O9710R903L519k4626j06786l7350M3933K0411l6241L3745
$$ plain form
16633 5107 11400 -64785 -117592 -49781 16737 61335 132129 138745 35406 -30552 -1057 -22713
16621 -22713 -117588 -91914 -5814 28327 -30004 -32798 -20141 16219 2809 -43508 -44960 -32225
16609 -32225 -37934 -22596 -16823 24224 27206 16898 27501 20103 -17936 11485 37264 40303 15000
16596 15000 54978 33966 -17670 -81810 -77558 -37001 29020 69182 38988 18908 -8749 76306
16584 76306 89456 102315 89637 22081 58714 34919 3051 60303 33040 -24184 -37406 -15580
16572 -15580 42323 -11163 -21928 10954 83099 108407 101458 68289 26537 50878 57875 83086
16560 83086 81995 2102 -144814 -135077 -102854 -85953 -18920 38791 50864 33570 -5334 -26389
16548 -26389 -49875 -42152 -66251 -44114 20840 49801 47834 1430 -42573 8938 40357 28258
$$ packed form
16633E107O293p6185n2807O7811O6518M4598P0794O616j03339o5958K9495k1656
16621b2713r4875K5674Q6100L4141n8331k794J2657L6360j3410m6317j452J2735
16609c2225n709J5338N773M1047K982j0308J0603p398l8039K9421K5779L039k5303
16596A5000L9978k1012n1636o4140M252M0557O6021M0162l0194k0080k7657Q5055
16584G6306J3150J2859j2678o7556L6633k3795l1868N7252k7263n7224j3222K1826
16572a5580N7903n3486j0765L2882P2145K5308o949l3169m1752K4341O997K5211
16560H3086j091p9893j46916R737L2223J6901O7033N7711J2073j7294l8904k1055
16548b6389k3486P723k4099K2137O4954K8961j967m6404m4003N1511L1419j2099
$$ plain form
16536 28258 52660 91599 112651 84492 79219 46063 12344 14891 13135 149 -22909 15447
16524 15447 72592 75282 -27755 -21783 33695 78922 87711 85759 53583 47145 38943 29067 26099
16511 26099 68836 82985 54036 80869 43807 -17889 -55496 -47624 -38790 -38463 -107623 -148250
16499 -148250 -194387 -125470 -92856 -54145 -34512 50081 37547 -3880 2445 -28177 -28201 50241
16487 50241 111831 63365 83371 -2706 -2952 44641 -19781 -111662 -66080 -55765 32882 44855
16475 44855 5121 -25793 -73831 -95816 -146809 -74536 -6662 85422 88256 18006 24699 -71406
16463 -71406 -3363 87633 93040 93389 29110 -67283 -90878 -17972 81787 50236 -4977 -14994
16451 -14994 -44950 9844 11079 62779 87474 29799 -5977 -49454 -57379 -15864 -18070 -54933
$$ packed form
16536B8258K4402L8939K1052k8159n273l3156l3719K547j756j2986k3058L8356
16524A5447N7145K690j03037N972N5478M5227Q789j952l2176o438q202r876k968
16511B6099M2737J4149k8949K6833l7062o1696l7607P872Q834L27o9160m0627
16499a48250m6137O8917L2614L8711J9633Q4593j2534m1427O325l0622k4P8442
16487E0241O1590m8466K0006q6077k46M7593o4422r1881M5582J0315Q8647J1973
16475D4855l9734l0914m8038k1985n0993P2273O7874R2084K834p0250O693r6105
16463g1406O8043R0996N407L49o4279r6393k3595P2906R9759l1551n5213j0017
16451a4994k9956N4794J235N1700K4695n7675l5776m3477p925M1515k206l6863
$$ plain form
16439 -54933 -90485 -99725 -62186 -57737 -56600 -5727 50585 39460 -5142 -7892 -36052 -31680 -47337
16426 -47337 -40475 -36891 -77793 -104568 -87163 -71503 -69232 -74487 -24699 -37351 -6712 -50730
16414 -50730 -62595 -110444 -134425 -97377 -91224 -39526 767 41222 66501 115244 96396 9638
16402 9638 -20402 -3746 120987 154774 159357 72551 25360 -53332 -1566 55257 46344 -9616
16390 -9616 -25518 -41762 4298 36591 54574 89785 55477 17751 23209 61455 63478 43899
16378 43899 -9296 -57763 -74477 -23619 -32203 11871 29617 -7973 -14061 -29737 -15731 -29470
16366 -29470 12471 23675 7594 -4743 -1652 23202 12754 47298 50902 26934 31677 27271
16354 27271 -6426 -31487 16061 39394 29983 -7001 -5196 25001 12737 -7825 -41183 -144129
$$ packed form
16439e4933l5552r240L7539M449J137N0873N6312j1125m4602k750k8160M372j5657
16426d7337O862L584m0902k6775J7405J5660K271n255M9788j2652L0639m4018
16414e0730j1865m7849k3981L7048O153N1698M0293M0455K5279M8743j8848q6758
16402I638l0040J6656J24733L3787M583q6806m7191p8692N1766N6823q913n5960
16390i616j5902j6244M6060L2293J7983L5211l4308l7726N458L8246K023j9579
16378D3899n3195m8467j6714N0858q584M4074J7746l7590o088j5676J4006j3739
16366b9470M1941J1204j6081j2337L091K4854j0448L4544L604k3968M743m406
16354B7271l3697k5061M7548K3333r411l6984J805L0197j2264k0562l3358j02946
$$ plain form
16342 -144129 -95941 -36867 -55230 -89739 -130944 -154855 -105142 -58550 -87346 -74988 -10296
16331 -10296 7784 47268 43612 -5495 -51748 -62484 -79870 -60062 -8760 26907 38746 6584
16319 6584 -89658 -92016 -22898 13100 11722 50681 17351 45055 34097 -12787 982 -54783
16307 -54783 -113649 -147008 -162148 -176411 -121387 -99466 -110303 -108473 -126734 -85156 -33941 3404
16295 3404 -42610 -48871 -3645 -3264 -33457 -2880 26892 74520 -8752 -75449 -75132 -70369 -53951
16282 -53951 -44623 -43995 -8935 -2964 73320 149980 101757 38252 37841 76947 114010 90320 31238
16269 31238 40198 2849 -75280 -78661 -28332 22681 38259 71723 45787 42181 27590 2042
16257 2042 -9247 -24343 -1328 28186 49148 -1322 -68398 -82150 -119490 -65752 -6365 -10721
$$ packed form
16342a44129M8188N9074j8363l4509m1205k3911M9713M6592k8796J2358O4692
16331a0296J8080L9484l656m9107m6253j0736j7386J9808N1302L5667J1839l2162
16319F584r6242k358O9118L5998j378L8959l3330K7704j0958m6884J3769n5765
16307e4783n8866l3359j5140j4263N5024K1921j0837J830j8261M1578N1215L7345
16295C404m6014o261M5226L81l0193L0577K9772M7628q3272o6697L17M763J6418
16282e3951R328O28L5060N971P6284P6660m8223o3505m11L9106L7063k3690n9082
16269C1238Q960l7349p8129l381N0329N1013J5578L3464k5936l606j4591k5548
16257B042j1289j5096K3015K9514K0962n0470o7076j3752l7340N3738N9387m356
$$ plain form
16245 -10721 -29892 -29868 -67416 -100719 -109577 -113341 -133148 -70147 -14806 -42329 -57768 -45125 -18658
16232 -18658 -8605 -8429 -16708 37318 16583 -60069 -158444 -153268 -117496 -129668 -145878 -176819
16220 -176819 -62539 -15052 -11505 -60444 -32572 -21191 -36623 -8948 -31619 -102799 -110566 -109509
16208 -109509 -106812 -101583 -2223 -2446 -45738 -105863 -111506 -84680 -114091 -102482 -42841 -30313
16196 -30313 -40131 -22815 -23542 17386 81367 99608 76513 28740 -15447 -31815 -25817 5529
16184 5529 -19598 -54850 -60979 -5964 57774 120825 56123 16395 2556 13956 35540 86199
16172 86199 59362 22709 60802 92017 93857 100019 114174 53889 23297 92041 120919 71984
16160 71984 48048 10547 -15049 -40892 -10285 44681 17286 -25638 7882 3280 2336 46599
$$ packed form
16245a0721j9171K4l7548l3303q858l764j9807O3001N5341k7523j5439J2643K6467
16232a8658J0053J76q279N4026k0735p6652r8375N176L5772j2172j6210l0941
16220a76819J14280M7487L547m8939K7872J1381j5432K7675k2671p1180p767J057
16208a09509K697N229R9360k23m3292o0125n643K6826k9411J1609N9641J2528
16196c0313r818J7316p27M0928O3981J8241k3095m7773m4187j6368N998L1346
16184E529k5127l5252o129N5015O3738O3051o4702l9728j3839J1400K1584N0659
16172H6199k6837l6653L8093L1215J840O162J4155o0285l0592O8744K8878m8935
16160G1984k3936l7501k5596k5843L0607N4966k7395m2924L3520m602r44M4263
$$ plain form
16148 46599 18876 5810 55974 39602 40494 51101 33934 24142 58228 101855 73167 1527
16136 1527 5859 16709 -73182 -113253 -85922 -35064 37102 58377 -7293 -87678 -106775 -81985
16124 -81985 -84049 -66317 -34208 -3605 52843 61915 20720 164 -36633 -77485 -61577 -17530
16112 -17530 -14784 -51565 3065 -7774 -43965 -15691 54765 76703 87437 91457 94689 61337
16100 61337 -17959 -47839 -74857 -10458 25578 23749 53565 70701 67918 76540 106715 13008
16088 13008 -22810 -8425 -24412 4715 56837 26462 30673 47586 64212 94273 123472 123141
16076 123141 122177 66712 8132 -57746 -84489 -35973 -27986 -20278 61224 13180 9331 59690
16064 59690 68433 98354 71001 -22414 2808 17701 -43760 13030 11203 287 -14358 -26278
$$ packed form
16148D6599k7723j3066N0164j6372Q92J0607j7167r792L4086M3627k8688p1640
16136A527M332J0850q9891m0071K7331N0858P2166K1275o5670q0385j9097K4790
16124h1985k064J7732L2109L0603N6448R072m1195k0556l6797m0852J5908M4047
16112a7530K746l6781N4630j0839l6191K8274P0456K1938J0734M020L232l3352
16100F1337p9296k9880k7018O4399L6036j829K9816J7136k783Q622L0175r3707
16088A3008l5818J4385j5987K9127N2122l0375M211J6913J6626L0061K9199l31
16076A23141r64n5465n8580o5878k6743M8516P987P708Q1502m8044l849N0359
16064E9690Q743K9921k7353r3415K5222J4893o1461N6790j827j0916j4645j1920
$$ plain form
16052 -26278 -4125 48371 46197 27791 46297 35205 -3372 7782 -9195 -59410 -73556 -18181
16040 -18181 -41750 -46960 -27653 -48055 31957 28686 -26614 -61945 -39432 26277 30402 3027
16028 3027 79666 66138 69721 118479 101238 68217 68998 36923 41969 26560 -11608 -37797 -24367
16015 -24367 14585 10830 13967 4022 -13213 38448 116289 56264 -15922 -23817 -27004 -2114 -35753
16002 -35753 -41016 -106204 -113767 -84881 -5531 -4604 -23018 -4275 -6344 11497 60908 32292 58432
15989 58432 77118 83023 107684 74708 110059 131381 45387 -50047 -31055 27691 -2466 -1589
15977 -1589 36096 58969 17887 -37184 -46857 -35659 55259 55380 -138 -27425 2718 4728 -16054
15964 -16054 15108 91399 97308 48522 -67041 -38289 -51447 -54880 6086 2502 6372 -3219
$$ packed form
16052b6278K2153N2496k174j8406J8506j1092l8577J1154j6977n0215j4146N5375
16040a8181k3569n210J9307k0402Q0012l271n5300l5331K2513O5709M125k7375
16028C027P6639j3528L583M8758j7241l3021P81l2075N046j5409l8168k6189J3430
16015b4367L8952l755L137r945j7235N1661P7841o0025p2186p895l187K4890l3639
16002c5753n263o5188p563K8886P9350R27j8414J8743k069J7841M9411k8616K6140
15989E8432J8686N905K4661l2976L5351K1322q5994r5434J8992N8746l0157Q77
15977a589L7685K2873m1082n5071r673J1198R0918J21n5518k7287L0143K010k0782
15964a6054L1162P6291N909m8786j15563K8752j3158l433O0966l584L870r591
$$ plain form
15952 -3219 -24151 15937 -11196 -96876 -180983 -147740 -110094 -94158 -138643 -154966 -165427 -123321
15940 -123321 -79400 -30208 -19100 39158 53555 40104 42050 47043 33701 -18042 -36321 22284
15928 22284 63099 -4402 -12605 61730 72916 84941 140485 106846 13460 -45278 -53390 17481
15916 17481 37433 68194 43552 -39815 -86720 -91771 -112819 -101495 -114113 -78671 -73832 -25376
15904 -25376 602 -22033 -18258 -99930 -130537 -148916 -122385 -26514 8234 11335 259 22661
15892 22661 38754 47378 -7029 -40111 -37280 -70859 41 124344 129183 61183 -2885 40160
15880 40160 -19226 5059 39421 2726 4030 41076 32930 15997 25617 19854 51001 49576 67070
15867 67070 64489 21709 13432 46617 65450 48716 41153 39246 48630 19119 14750 10264 -20096
$$ packed form
15952c219k0932M0088k7133q5680q4107L3243L7646J5936m4485j6323j0461M2106
15940a23321M3921M9192J1108N8258J4397j3451J946M993j3342n1743j8279N8605
15928B2284M0815o7501q203P4335J1186J2025N5544l3639r3386n8738q112P0871
15916A7481J9952L0761k4642q3367m6905n051k1048J1324j2618L5442M839M8456
15904b5376K5978k2635L775q1672l0607j8379K6531R5871L4748L101j1076K2402
15892B2661J6093Q624n4407l3082K831l3579P0900J24303M839o8000o4068M3045
15880D0160n9386K4285L4362l6695J304L7046q146j6933R620n763L1147j425J7494
15867F7070k581m2780q277L3185J8833j6734p563j907R384k9511m369m486l0360
$$ plain form
15854 -20096 -23502 -49779 -72654 -38830 5751 78371 37799 -33747 -42423 -17658 -23620 -26073
15842 -26073 -31993 -1752 63974 77322 48881 -34168 -67980 -14101 23758 73793 22120 -34556
15830 -34556 -29136 12706 50482 28266 -8609 -66747 -96318 -15097 41604 82682 83474 67404
15818 67404 27492 76200 42555 -30507 -114036 -98842 -110339 -116286 -141164 -140022 -48420 22534
15806 22534 -45938 -66699 -107076 -170083 -124855 -26075 -7876 19619 56075 -11410 -19488 -70928
15794 -70928 -93826 -95631 -40362 16475 -45644 -67362 -103146 -145246 -188713 -123094 -71944 -34012
15782 -34012 -46803 22043 -26692 -152085 -181781 -132621 -135617 -77796 -49282 -103669 -164778 -159489
15770 -159489 -89385 -50087 -2211 6771 29311 68167 88927 77772 49622 35187 -11731 -46102
$$ packed form
15854b0096l406k6277k2875L3824M4581P2620m0572p1546q676K4765n962k453
15842b6073n920L0241O5726J3348k8441q3049l3812N3879L7859N0035n1673n6676
15830c4556N420M1842L7776k2216l6875n8138k9571Q1221N6701M1078P92j6070
15818F7404l9912M8708l3645p3062q3529J5194j1497n947k4878J142R1602P0954
15806B2534o8472k0761m0377o3007M5228R8780J8199K7495L6456o7485q078n1440
15794g0928k2898j805N5269N6837o2119k1718l5784m2100m3467O5619N1150L7932
15782c4012j2791O8846m8735j25393k9696M9160k996N7821K8514n4387o1109N289
15770a59489P0104L9298M7876Q982K2540L8856K0760j1155k8150j4435m6918l4371
$$ plain form
15758 -46102 -16303 21858 79891 40603 -5609 42908 33378 -35381 -48082 -39435 10891 -58907
15746 -58907 -82516 -115333 -112471 -73185 -37032 -24559 -36354 -70075 -89871 -135930 -95756 -101158
15734 -101158 -92206 -14796 -9311 -48010 -43193 -33795 -44689 -73971 -68267 -6454 -2303 9744 32689
15721 32689 15835 11312 21139 49226 32752 45167 13105 -53226 -71151 -68385 -26485 -23550
15709 -23550 -22169 13761 29441 61714 44303 27575 -16506 3549 73425 39299 38990 2540
15697 2540 23725 -43943 -150196 -168680 -159262 -104559 -113335 -115114 -35147 -52842 -26288 -33225
15685 -33225 -71608 -18960 4673 -45848 -48849 -11554 -11820 6049 35264 52706 35175 -12210
15673 -12210 -3528 6580 28260 20686 -38105 -73597 -1188 65540 -1898 18946 55848 116058
$$ packed form
15758d6102K9799L8161N8033l9288m6212M8517r530o8759j2701Q647N0326o9798
15746e8907k3609l2817K862L9286L6153J2473j1795l3721j9796m6059M0174n402
15734a01158Q952P7410N485l8699M817R398j0894k9282N704O1813M151J2047K2945
15721C2689j6854m523R827K8087j6474J2415l2062o6331j7925K766M1900K935
15709b3550J381L5930J5680L2273j7411j6728m4081K0055O9876l4126l09l6450
15697B540K1185o7668j06253j8484R418N4703q776j779P9967j7695K6554o937
15685c3225l8383N2648K3633n0521l001L7295k66J7869K9215J7442j7531m7385
15673a2210Q682J0108K1680p574n8791l5492P2409O6728o7438K0844L6902O0210
$$ plain form
15661 116058 124800 127458 147525 91359 42176 46088 3469 -13078 13110 92945 88915 35988
15649 35988 14838 7370 -32428 -21491 -12115 -20802 -1237 -26532 -90477 -57412 -89957 -68769
15637 -68769 -135664 -111271 -30602 33316 46495 15065 -41790 -11873 -46078 -85942 -115968 -103644
15625 -103644 -81955 -8786 -28677 -43101 -58200 -29416 -71487 -56718 -28015 -11090 -22881
15614 -22881 -12008 -37615 -49039 -68085 -106279 -32123 45651 36632 40422 37485 41492 47381 18393
15601 18393 4878 -33567 -70054 -164729 -128043 -57329 -56920 -112837 -59986 -2569 -34065 -28802
15589 -28802 -84616 -72970 -44213 -27261 -1220 3830 6758 -3305 81236 46958 63045 112095
15577 112095 15438 -66506 -84807 -98965 -25758 16069 40464 -478 -1741 23394 73448 80781
$$ packed form
15661A16058Q742K658K0067n6166m9183L912m2619j6547K6188P9835m030n2927
15649C5988k1150p468l9798J0937R376q687J9565k5295o3945L3065l2545K1188
15637f8769o6895K4393Q0669O3918J3179l1430n6855K9917l4205l9864l0026J2324
15625a03644K1689P3169j9891j4424j5099K8784m2071J4769K8703J6925j1791
15614b2881J0873k5607j1424j9046l8194P4156P7774r019L790k937M007N889k8988
15601A8393j3515l8445l6487r4675L6686P0714M09n5917N2851N7417l1496N263
15589b8802n5814J1646K8757J6952K6041N050K928j0063Q4541l4278J6087M9050
15577A12095r6657q1944j8301j4158P3207M1827K4395m0942j263K5135N0054P333
$$ plain form
15565 80781 109869 72631 3799 -21652 -4038 32501 72194 35349 5850 -380 -41935 -69812
15553 -69812 -60855 -25783 -3482 -22413 -84389 -90980 -141691 -132604 -103595 -50381 -25525 32767
15541 32767 84457 142909 161621 199856 155498 95857 29756 -107462 -75649 -66331 -105186 -101350
15529 -101350 -82278 -23156 18136 -55410 -8277 7837 -10797 -28332 -25525 29090 134213
15518 134213 41235 -50199 -14832 -60245 -17417 -40372 -46558 -57873 -73346 -78707 -10060 11678
15506 11678 22774 -29431 -59816 -45960 -9402 -88146 -125339 -135381 -78126 -17709 63100 75470
15494 75470 28024 5533 -19758 -66996 -64811 -53368 -11758 18111 45995 68126 66440 -6065
15482 -6065 4923 52607 25371 25936 7458 3038 -41211 -40494 -34566 -92019 -115084 -95530 -98874
$$ packed form
15565H0781K9088l7238o8832k5451J7614L6539L9693l6845k9499o230m1555k7877
15553f9812Q957L5072K2301j8931o1976o591n0711R087K9009N3214K4856N8292
15541C2767N1690N8452J8712L8235m4358n9641o6101j37218L1813R318l8855L836
15529a01350J9072N9122M1292p3546M7133J6114j8634j7535K807N4615J05123
15518A34213r2978r1434L5367m5413M2828k2955o186j1315j5473n361O8647K1738
15506A1678J1096n2205l0385J3856L6558p8744l7193j0042N7255O0417Q0809J2370
15494G5470m7446k2491k5291m7238K185J1443M1610K9869K7884K2131j686p2505
15482f065J0988M7684k7236N65j8478m420m4249P17N928n7453k3065J9554l344
$$ plain form
15469 -98874 -65044 -68625 -68773 9113 73311 85823 49720 -3305 26537 56294 3451 -11811
15457 -11811 2859 -45914 8085 -38167 -62031 -36370 17201 24943 -18005 -63249 -59644 -97757
15445 -97757 -138819 -50231 29647 -9373 -41570 -2357 12751 30943 9919 -38796 -64743 -28651
15433 -28651 -16245 -65016 -63962 35846 24616 35084 27766 7558 72491 84617 17200 -10781
15421 -10781 -68239 -109587 -124544 -140253 -110264 -57572 -35760 28025 53530 38517 18705 39488
15409 39488 27493 54520 1249 -42567 -42810 -28577 29416 69621 8039 -24497 13895 9243
15397 9243 43167 128149 122138 111710 56862 -59267 -58670 -55331 -85540 -65426 347 12628
15385 12628 9520 -36330 -57698 -51767 14980 -9539 -84079 -128376 -54538 -13708 -13809 -50609
$$ packed form
15469i8874L3830l581j48P7886O4198J2512l6103n3025K9842K9757n2843j5262
15457a1811J4670m8773N3999m6252k3864K5661N3571P742m2948m5244L605l8113
15445i7757m1062Q8588P9878l9020l2197L9213J5108J8192k1024m8715k5947L6092
15433b8651J2406m8771J054R9808j1230J0468p318k0208O4933J2126o7417k7981
15421a0781n7458m1348j4957j5709K9989N2692K1812O3785K5505j5013j9812K0783
15409C9488j1995K7027n3271m3816k43J4233N7993M0205o1582l2536L8392m652
15397I243L3924Q4982o011j0428n4848j16129N97L339l0209K0114O5773J2281
15385A2628l108m5850k1368N931O6747k4519p4540m4297P3838M0830j01l6800
$$ plain form
15373 -50609 -89464 -135869 -161156 -113867 -52779 -17816 9081 -54852 -26132 -15690 -3261 15293
15361 15293 -18094 -67742 25335 50119 50309 40713 -3347 -18088 -44050 -46400 -17266 42779
15349 42779 16242 -38466 17736 71857 67528 68048 76737 94367 87618 96491 131109 112562 73739
15336 73739 22778 -4947 -52963 -173867 -156243 -93099 -29417 25636 12670 -75269 -140585
15325 -140585 -69987 -31781 -15361 -23836 -63764 -73115 -61161 5159 3928 -27703 -43855 297
15313 297 -15243 -12496 45911 99350 62948 -5013 -68106 -56063 -4560 20149 -48279 -33522
15301 -33522 -17579 23851 27347 -28162 -4354 45367 7642 -82786 -106737 -106657 -89853 -53832
15289 -53832 -50669 -86260 -17534 82213 94768 -33331 -36815 6039 83094 59727 7099 -40913
$$ packed form
15373e0609l8855m6405k5287M7289O1088L4963K6897o3933K8720J0442J2429J8554
15361A5293l3387m9648R3077K4784J90r596m4060j4741k5962k350K9134O0045
15349D2779k6537n4708N6202N4121m329N20Q689J7630o749Q873L4618j8547l8823
15336G3739n0961k7725m8016j20904J7624O3144O3682N5053j2966q7939o5316
15325a40585P0598L8206J6420q475l9928r351J1954O6320j231l1631j6152M4152
15313B97j5540K747N8407N3439l6402o7961o3093J2043N1503K4709o8428J4757
15301c3522J5943M1430L496n5509K3808M9721l7725r0428k3951Q0J6804L6021
15289e3832L163l5591O8726R9747J2555j28099l484M2854P7055k3367n2628m8012
$$ plain form
15277 -40913 -28474 -26493 11185 -59954 -113133 -93343 -77889 -70475 -94207 -59244 24334 -5634
15265 -5634 -5445 -44603 -53951 -30834 -19727 -15495 9359 59888 81436 77681 19940 14820 38826
15252 38826 25253 30727 62129 88496 43497 29753 43066 1205 22366 58697 -23040 -45039
15240 -45039 -29559 -26100 4305 7492 -37595 4523 -75760 -96773 -76522 -98358 -76382 -84044
15228 -84044 -35762 -58540 -85208 -76541 -115730 -84775 -80127 -101054 -115966 -107211 -92776 -29040
15216 -29040 4070 -18097 -56001 -49200 -59316 21915 34633 -26496 -51570 -59246 -63952 -99742
15204 -99742 -147510 -163983 -129512 -73886 14832 102317 53454 -10212 -12171 7142 50551 37797
15192 37797 44448 22529 -6976 24442 14252 -16601 -43271 -7832 22656 -7837 -4271 28775
$$ packed form
15277d0913J2439J981L7678p1139n3179J9790J5454P414k3732L4963Q3578k9968
15265e634J89l9158r348K3117J1107M232K4854N0529K1548l755n7741n120K4006
15252C8826j3573N474L1402K6367m4999j3744J3313m1861K1161L6331q1737k1999
15240d5039J5480L459L0405L187m5087M2118q0283k1013K0251k1836K1976p662
15228h4044M8282k2778k6668Q667l9189L0955M648k0927j4912Q755J4435O3736
15216b9040L3110k2167l7904O801j0116Q1231J2718o1129k5074p676m706l5790
15204i9742m7768j6473L4471N5626Q8718Q7485m8863o3666j959J9313M3409j2754
15192C7797O651k1919k9505L1418j0190l0853k6670L5439L0488l0493L566L3046
$$ plain form
15180 28775 26788 82001 25877 9860 45275 26643 -25165 -34197 -38770 -83127 -87513 -11548
15168 -11548 33430 2909 -25765 -22001 -25380 13921 18789 36697 -37927 -54995 -53334 -52135 -68989
15155 -68989 -115805 -131131 -187248 -179856 -70335 14072 -34822 -19318 -27645 -115578 -132327 -56228
15143 -56228 -18777 21289 -14939 -15815 -21184 -25266 -31603 -34248 -38399 -24031 -32456 -85195 -115829
15130 -115829 -71021 -25774 -8366 18725 24877 -9472 28485 47055 19799 55565 27460 43959
15118 43959 47550 5731 -2857 -50340 -43372 25517 33941 -40610 -54198 -77022 -47122 -37717 -37746
15105 -37746 62006 66440 23054 6634 13736 -14993 -35317 -1350 -76104 -91421 -84570 -91661
15093 -91661 991 51032 56796 35986 12321 -26717 -61235 -88357 -102429 -71706 -6747 56732
$$ packed form
15180B8775j987N5213n6124j6017L5415j8632n1808r032m573m4357m386P5965
15168a1548M4978l0521k8674L764l379L9301M868J7908p4624j7068J661J199j6854
15155f8989m6816j5326n6117P392J09521Q4407m8894J5504q327q7933j6749P6099
15143e6228L7451M0066l6228q76n369m082o337k645m151J4368q425n2739l0634
15130a15829M4808M5247J7408K7091O152l4349L7957J8570k7256L5766k8105J6499
15118D3959L591m1819q588m7483O968O8889Q424p4551j3588k2824K9900R405k9
15105c7746R9752M434m3386j6420P102k8729k0324L3967p4754j5317O851p091
15093i1661R2652N0041N764k0810k3665l9038l4518k7122j4072L0723O4959O3479
$$ plain form
15081 56732 27307 24227 -5475 -98203 -130982 -40711 68062 137078 53979 -27872 -43521 4416
15069 4416 55360 5519 -75840 -92564 -105708 -68138 -82879 -45752 -10983 56321 17624 -30260
15057 -30260 -26155 36421 -3872 -66034 -118360 -60128 -24974 -18002 -19592 -59048 -18494 16315
15045 16315 32257 38256 50462 53156 65136 111848 127873 117052 167699 149693 104867 63024
15033 63024 11912 -3758 -46702 -37149 -43235 38173 54157 29591 46345 9200 -19044 7548
15021 7548 48718 38182 31269 12361 8201 16362 9986 -15376 -92188 -131368 -88841 -92525 -102968
15008 -102968 -75664 -75404 -110848 -108724 -72870 -26901 -20227 11911 77671 61679 53887 64053
14996 64053 29224 36690 21956 43148 -20614 -61462 -42185 8160 -61612 -54513 -29016 -85467
$$ packed form
15081E6732k9425l080k9702r2728l2779R0271J08773O9016q3099q1851j5649M7937
15069D416N0944m9841q1359j6724j3144L7570j4741L7127L4769O7304l8697m7884
15057c0260M105O2576m0293o2162n2326N8232L5154O972j590l9456M0554L4809
15045A6315J5942N999J2206K694J1980M6712J6025j0821N0647j8006m4826m1843
15033F3024n1112j5670m2944R553o086Q1408J5984k4566J6754l7145k8244K6592
15021G548M1170j0536o913j8908m160Q161o376k5362p6812l9180M2527l684j0443
15008a02968K7304K60l5444K124L5854M5969O674L2138O5760j5992p792J0166
14996F4053l4829P466j4734K1192o3762m0848J9277N0345o9772P099K5497n6451
$$ plain form
14984 -85467 -125064 -53736 -40284 -62804 -36206 15517 -8700 -52683 -19653 -15702 -67653 -100692
14972 -100692 -80955 619 80041 30803 -39507 -53917 11803 17122 -965 31505 62058 85841
14960 85841 83023 12800 -1885 -1887 -7842 -12419 29060 11088 15621 -2675 -21496 37451 63777
14947 63777 64758 -22950 -10574 86452 82686 -20724 -40084 -38326 26151 47992 62147 69267
14935 69267 103095 93423 36220 8135 8353 30985 60504 49185 14189 35209 21261 -59574
14923 -59574 -83099 -70343 -80241 -83174 -151998 -165933 -119963 -115130 -88053 -87384 -79384 -73425 -1253
14910 -1253 24992 -5581 -54162 24778 56728 26337 -6855 9939 -3013 -20182 -48301 -5486
14898 -5486 15494 43726 13899 -41429 -51893 -12169 38184 54686 -40002 -90156 -37539 -19414
$$ packed form
14984h5467l9597P1328J3452k2520K6598N1723k4217m3983L3030L951n1951l3039
14972a00692J9737Q1574P9422m9238p0310j4410O5720N319j8087L2470L0553K3783
14960H5841k818p0223j4685kn955m577M1479j7972M533j8296j8821N8947K6326
14947F3777R81q7708J2376R7026l766j03410j9360J758O4477K1841J4155P120
14935F9267L3828r672n7203k8085K18K2632K9519j1319l4996K1020j3948q0835
14923e9574k3525J2756r898k933o8824j3935M5970M833K7077O69Q000N959P2172
14910a253K6245l0573m8581P8940L1950l0391l3192J6794j2952j7169k8119M2815
14898e486K0980K8232k9827n5328j0464L9724N0353J6502r4688n0154N2617J8125
$$ plain form
14886 -19414 -35802 -33472 3521 77523 109209 57018 19545 23727 78964 140361 192699 230628
14874 230628 236505 339665 340982 266094 185490 121081 99561 80882 30875 -8531 -10734 22914
14862 22914 19961 85220 85259 43504 40409 55569 16769 19682 -4878 -57548 -69218 -67088 -13140
14849 -13140 63251 38283 41020 56052 -1216 -36840 5518 59388 26859 10294 44970 64823
14837 64823 15539 -11320 18850 76126 43820 92838 42967 -87529 -107990 -14108 37097
14826 37097 64169 78761 56909 35472 31866 49834 445 10280 29669 32444 37675 60206
14814 60206 58266 2848 -12625 -3655 22630 43410 44663 40472 42321 54771 41336 -19583 -41581
14801 -41581 -12764 -20076 -33412 -9766 -38034 -52854 10514 -12651 -73514 -115608 -76139 -54823
$$ packed form
14886a9414j6388K330L6993P4002L1686n2191l7473M182N5237O1397N2338L7929
14874B30628N877J03160J317p4888q0604o4409k1520j8679n0007l9406k203L3648
14862B2914k953O5259L9m1755l095J5160l8800K913k4560n2670j1670K130N3948
14849a3140P6391k4968K737J5032n7268l5624M2358N3870l2529j6565L4676J9853
14837F4823m9284k6859L0170N7276l2306M9018m9871j30496k0461R3882N1205
14826C7097K7072J4592k1852k1437l606J7968m9389R835J9389K775N231K2531
14814F0206j940n5418j5473Q970K6285K0780J253m191J849J2450j3435o0919k1998
14801d1581K8817p312j3336K3646k8268j4820O3368k3165o0863m2094L9469K1316
$$ plain form
14789 -54823 -42060 -74268 -72537 -103927 -120544 -71296 -32985 -12132 24596 53770 43758 33720
14777 33720 15990 -50401 -109521 -30663 -5463 -11308 -64445 -17740 -27293 -21923 15535 -15498
14765 -15498 -51770 -16877 66787 110886 100164 81981 74800 64035 -50259 -56478 -12519 42778
14753 42778 94042 134399 64550 3172 66080 91746 80986 72107 93268 89335 123344 114057
14741 114057 71310 80174 35743 41902 88835 14208 -26687 20544 84941 80661 25143 -5102
14729 -5102 -59687 10047 44108 37 -14158 12086 -14206 -6183 1243 -52730 -42264 -42310 -32075
14716 -32075 -64453 -98319 -60090 -48234 -71165 -36824 -5964 -17439 -80245 -116619 -123218 -182918
14704 -182918 -152868 -36453 -18141 -39954 -37468 10417 -43587 -122147 -111927 -114747 -75937 -60771
$$ packed form
14789e4823J2763l2208J731l1390j6617M9248L8311K0853L6728K9174j0012j0038
14777C3720j7730o6391n9120P8858K5200n845n3137M6705r553N370L7458l1033
14765a5498l6272L4893Q3664M4099j0722j8183p181j0765j14294o219M3959N5297
14753D2778N1264M0357o9849o1378O2908K5666j0760q879K1161l933L4009r287
14741A14057m2747Q864m4431O159M6933p4627m0895M7231O4397m280n5518l0245
14729e102n4585O9734L4061m4071j4195K6244k6292Q023P426n3973J0466m6J0235
14716c2075l2378l3866L8229J1856k2931L4341L0860j1475o2806l6374o599n9700
14704a82918L0050J16415J8312k1813K486M7885n4004p8560J0220k820L8810J5166
$$ plain form
14692 -60771 -121976 -66726 -36875 -57412 -38400 -65009 -102418 -128662 -119510 -84401 -122275 -198297
14680 -198297 -194697 -188459 -147832 -91908 -126525 -148198 -71221 -15649 48643 15127 -15236 -26081
14668 -26081 -23937 -14524 -71553 -44398 -2623 -31690 -30716 -14655 -4463 -11273 23157 44011 78022
14655 78022 71138 40900 45145 50969 79576 36343 -65394 -60321 -75538 -115505 -81109 -74969
14643 -74969 -138734 -154236 -116636 -57465 -58708 -111779 -107360 -5580 78161 129303 75262 -1804
14631 -1804 -33967 -50824 1978 79667 126645 109168 72902 17657 -2840 -14646 -2457 -7568
14619 -7568 9106 3257 7924 -20198 -83521 -76666 -76012 -42870 -39168 -26497 6782 32187 -33893
14606 -33893 -40742 -11454 -72648 -92660 -73461 -29612 -16065 -5222 33026 93735 69244 -10678
$$ packed form
14692f0771o1205N5250K9851k0537J9012k6609l7409k6244R152L5109l7874p6022
14680a98297L600O238M0627N5924l4617k1673P6977N5572O4292l3516l0363j0845
14668b6081K144R413n7029K7155M1775k9067R74J6061J0192o810L4430K0854L4011
14655G8022o884l0238M245N824K8607m3233j01737N073j5217l9967L4396O140
14643g4969o3765j5502L7600N9171j243n3071M419J01780Q3741N1142n4041p7066
14631a804l2163j6857N2802P7689M6978j7477l6266n5245k0497j1806J2189n111
14619g568J6674n849M667k8122o3323O855O54L3142L702J2671L3279K5405o6080
14606c3893o849K9288o1194k0012J9199M3849J3547J0843L8248O0709k4491p9922
$$ plain form
14594 -10678 -33015 -52814 -67111 -54118 18082 -25304 -47857 -6410 -23804 -57201 8432 -31763
14582 -31763 -125528 -78368 -49867 -10157 16751 59466 16901 26327 94943 77894 59669 82721
14570 82721 47508 73297 77946 30964 -617 11919 45892 30709 82010 99972 66665 9378
14558 9378 -32161 -31763 -37864 -25873 55516 142681 129614 64519 49196 33611 -1315 28939
14546 28939 14283 -39140 -99497 -116666 -130004 -162535 -88083 -111771 -137215 -100084 -66822 -14514
14534 -14514 -43117 -80074 -103823 -48267 -32090 3557 -12918 -70834 -8586 -12744 -30499 -50756
14522 -50756 -74932 -26371 -7714 -26187 -62468 -82795 -85944 -70145 -17534 -7787 23563 15577
14510 15577 18474 6145 -31025 -69169 -87566 -17906 15284 -33658 2433 58985 40098 27674
$$ packed form
14594a0678k2337j9799j4297J2993P2200m3386k2553M1447j7394l3397O5633m0195
14582c1763r3765M7160K8501L9710K6908M2715m2565R426O8616j7049j8225K3052
14570H2721l5213K5789M649m6982l1581J2536L3973j5183N1301J7962l3307n7287
14558I378m1539L98o101J1991Q1389Q7165j3067o5095j5323j5585l4926L0254
14546B8939j4656n3423o0357j7169j3338l2531P4452k3688k5444L7131L3262N2308
14534a4514k8603l6957k3749N5556J6177L5647j6475n7916O2248m158j7755k0257
14522e0756k4176M8561J8657j8473l6281k0327l149J5799N2611R747L1350p986
14510A5577K897j2329l7170l8144j8397O9660L3190m8942L6091N6552j8887j2424
$$ plain form
14498 27674 9006 33350 -33329 -105044 -129219 -85766 -61669 -57385 -18453 2302 -2932 26692
14486 26692 56152 52207 15239 -1125 -20614 -60270 -51263 -39939 -51657 -51224 37069 -14547
14474 -14547 -81215 -93778 -98193 -32012 23411 23603 25372 48808 57698 32447 15091 51433 113395
14461 113395 112203 69768 24552 -11221 -49068 -12905 8282 14730 55475 33956 -31066 -85520
14449 -85520 -77370 52 55334 74263 70902 10694 3033 -56362 -32506 26906 57288 -29962
14437 -29962 -51149 -23378 30962 23729 34298 50634 45587 37078 10070 -53482 -50386 -45095 -73949
14424 -73949 -18692 -27641 5017 13066 2637 -23697 -25517 -25165 -7994 -15678 -19350 -25107 23495
14411 23495 27956 27458 28542 47296 43126 -19495 -68134 40850 85562 65307 53961 9705
$$ packed form
14498B7674j8668K4344o6679p1715k4175M3453K4097M284L8932K0755n234K9624
14486B6692K9460l945l6968j6364j9489l9656R007J1324j1718M33Q8293n1616
14474a4547o6668j2563m415O6181N5423J92J769K3436Q890k5251j7356L6342O1962
14461A13395j192m2435m5216l5773l7847L6163K1187O448M0745k1519o5022n4454
14449h5520Q150P7422N5282J8929l361o0208p661n9395K3856N9412L0382q7250
14437b9962k1187K7771N4340p233J0569J6336n047q509k7008o3552L096N291k8854
14424g3949N5257q949L2658Q049j0429k6334j820L52J7171p684l672n757M8602
14411B3495M461m98J084J8754m170o2621m8639J08984M4712k0255j1346m4256
$$ plain form
14399 9705 -24487 -53313 -9679 9267 13793 9014 6816 -25689 -19074 31290 31932 67873 84754
14386 84754 67416 26551 -37639 -35258 -109732 -115295 -67203 11770 3884 31760 32898 -39378
14374 -39378 -106760 -103860 -120365 -101015 -82222 -32620 -7185 62035 132085 127332 75920 49202
14362 49202 77451 67663 19242 62853 26794 -18363 -12568 36786 20765 40287 44550 61131
14350 61131 87739 36318 48102 26630 -48678 -53302 -721 -10417 -52675 -65769 -133215 -103677
14338 -103677 17282 -7459 -60459 -72736 -41194 -29714 -53084 -57058 20457 -14390 -13682 -17336
14326 -17336 22391 38760 4232 -49015 8489 -17142 -87897 -147011 -109341 -83047 -94296 -80004
14314 -80004 -114581 -104617 -95106 -35491 63539 109250 74289 -29363 -38704 39535 -328 -44000
$$ packed form
14399I705l4192k8826M3634J8946M526m779k198l2505O615N0364O42L5941J6881
14386H4754j7338m0865o4190K381p4474n563M8092P8973p886K7876J138p2276
14374c9378o7382K900j6505J9350J8793M9602K5435O9220P0050m753n1412k6718
14362D9202K8249r788m8421M3611l6059m5157N795M9354j6021J9522M263J6581
14350F1131K6608n1421J1784k1472p5308m624N2581r696m2258j3094o7446K9538
14338a03677J20959k4741n3000j2277L1542J1480k3370l974P7515l4847P08l654
14326a7336L9727J6369l4528n3247N7504k5631p0755n9114L7670K6294j1249J4292
14314h0004l4577R964R511N9615R9030M5711l4961j03652r341P8239l9863m3672
$$ plain form
14302 -44000 -79227 -30873 -14954 54011 103669 89896 60633 8264 -56970 -41378 10911 -13128
14290 -13128 -30332 3716 -15870 2278 36828 -2298 12232 -30634 -26764 -57984 -77845 -55081
14278 -55081 -97772 -84617 -84975 -137454 -90765 -35651 1334 56417 22403 -27772 -4708 -3534
14266 -3534 -47241 -57294 -37303 -80289 -93779 -32682 12551 20966 -16797 15334 -6801 -16244
14254 -16244 -5540 -4287 -78951 -111892 -106267 -42829 -23566 -47714 -54239 -67362 -59328 23840
14242 23840 33766 75986 65438 6130 -18172 -45195 -11855 -322 -23294 -53659 -37944 -101366
14230 -101366 -109945 -52614 42068 41104 65393 16415 -54096 -43841 -64632 -48986 -15887 23864
14218 23864 1843 6329 60060 111606 30454 -47189 -27189 80617 74758 24046 15127 -35025
$$ packed form
14302d4000l5227M8354J5919O8965M9658j3773k9263n2369o5234J5592N2289k4039
14290a3128j7204L4048j9586J8148L4550l9126J4530m2866L870l1220j9861K2764
14278e5081m2691J3155l58n2479M6689N5114L6985N5083l4014n0175K3064J174
14266c534m3707j0053J9991m2986j3490O1097M5233Q415l7763L2131k2135r443
14254a6244J0704J253p4664l2941N625O3438J9263k4148o525j3123Q034Q3168
14242B3840R926M2220j0548n9308k4302k7023L3340J1533k2972l0365J5715o3422
14230a01366q579N7331R4682r64K4289m8978p0511J0255k0791J5646L3099L9751
14218B3864k2021M486N3731N1546q1152p7643K0000J07806n859n0712q919n0152
$$ plain form
14206 -35025 -57551 -111097 -104029 -57195 -7990 -25115 -59549 -59467 -24245 29012 22596 -21814 -49796
14193 -49796 -100557 -89555 -65251 -15031 23732 29682 -36324 -104332 -108210 -86071 -44502 -37217
14181 -37217 -19557 3557 -14478 -113900 -159531 -72531 17374 16649 -20061 -1835 1262 -48369
14169 -48369 -21608 -62249 -91243 -31241 -35146 -61187 -90801 -82568 -68495 -92204 -127030 -170223
14157 -170223 -147695 -83338 -34849 32058 28473 -3475 -43975 -1275 29799 11971 68996 68370
14145 68370 101991 88906 64082 36541 -17200 29189 114748 84181 91391 99365 55827 -18017
14133 -18017 -57172 -81332 -81654 -52030 -7168 36271 23870 44191 31077 16097 53224 58248
14121 58248 57076 75602 134307 49717 -28307 -48665 -72205 18254 -23486 -93523 -106064 -124870
$$ packed form
14206c5025k2526n3546P068M6834M9205j7125l4434Q2L5222N3257o416m4410k7982
14193d9796n0761J1002K4304N0220L8763N950o6006o8008l878K2139M1569P285
14181c7217J7660K3114j8035r9422m5631Q7000Q9905p25l6710J8226L097m9631
14169d8369K6761m0641k8994O0002l905k6041k9614Q233J4073k3709l4826m3193
14157a70223K2528O4357M8489O6907l585l1948m0500M2700L1074j7828N7025o26
14145F8370L3621j3085k4824k7541n3741M6389Q5559l0567P210P974m3538p3844
14133a8017l9155k4160l22K9624M4862M3439j2401K0321j3114j4980L7127N024
14121E8248j172J8526N8705q4590p8024k0358k3540R0459m1740p0037j2541j8806
$$ plain form
14109 -124870 -56219 9627 51805 11981 16071 24646 55513 82408 93042 96646 61297 34946
14097 34946 44943 11555 -44158 -4514 77243 58020 -3108 -3908 -40075 -91434 -14903 6662
14085 6662 -25588 -105583 -87252 -81934 -111188 -146458 -148396 -89638 -125004 -135866 -68439 -23189
14073 -23189 41524 35970 -38796 -65004 -55249 -73678 -11968 -3516 -56270 -43489 -51525 -162507
14061 -162507 -146887 -95229 -60927 -77713 -49230 -33198 -28756 -73279 -79640 -128207 -84051 -23014
14049 -23014 -27510 8526 9885 -35674 -45761 -62229 -1411 27839 -24731 -79488 -112004 -86928
14037 -86928 -73075 -81772 -101361 -156293 -118253 -60848 -88550 -83745 -83149 -122953 -179434 -164183
14025 -164183 -112561 -93548 -115224 -131968 -139281 -111929 -91196 -30469 17038 -6626 -14028 -24139
$$ packed form
14109a24870O8651O5846M2178l9824M090Q575L0867K6895J0634L604l5349k6351
14097C4946R997l3388n5713L9644Q1757j9223o1128q00l6167n1359P6531K1565
14085F662l2250p9995J8331N318k9254l5270j938N8758l5366j0862O7427M5250
14073b3189O4713n554p4766k6208R755j8429O1710Q452n2754J2781q036j10982
14061a62507J5620N1658L4302j6786K8483J6032M442m4523o361m8567M4156O1037
14049b3014m496L6036J359m5559j0087j6468O0818K9250n2570n4757l2516K5076
14037h6928J3853q697j9589n4932L8040N7405k7702M805N96l9804n6481J5251
14025a64183N1622J9013k1676j6744p313K7352K0733O0727M7507k3664p402j0111
$$ plain form
14013 -24139 -66397 -56115 -33228 -70383 -107751 -83094 -19904 20962 64520 111931 138775 82254
14001 82254 55795 30395 -53334 -53214 -66111 -28359 -11240 -38729 -81396 -25643 -11576 -9535
13989 -9535 -46148 -70575 -41882 -3503 61509 38879 38508 62395 82578 65518 52025 1619
13977 1619 -15230 3732 -23832 -109379 -125622 -115246 -46820 -40363 -71979 -54018 6613 -9929
13965 -9929 -4202 -13314 34985 75965 209574 399976 547342 603482 631714 633296 487080 314235
13953 314235 244168 202819 166633 104061 106877 53001 -10652 -51441 -62577 -37782 -71883 -111246
13941 -111246 -28259 43291 12502 -29646 -8724 4953 -48271 -43889 -22776 20844 7126 -50174
13929 -50174 -14139 41644 37526 37310 14364 -2508 -15835 -48500 -123426 -116600 -134254 -131124 -137366
$$ packed form
14013b4139m2258J0282K2887l7155l7368K4657O3190M0866M3558M7411K6844n6521
14001H2254k6459k5400q3729J20j2897L7752J7119k7489m2667N5753J4067K041
13989i535l6613k4427K8693L8379O5012k2630l71K3887K0183j7060j3493n0406
13977A619j6849J8962k7564q5547j6243J0376O8426O457l1616J7961O0631j6542
13965i929N727r112M8299M0980J33609J90402J47366N6140K8232J582j46216j72845
13953C14235p0067m1349l6186o2572K816n3876o3653m0789j1136K4795l4101l9363
13941a11246Q2987P1550l0789m2148K0922J3677n3224M382K1113M3620j3718n7300
13929e0174L6035N5783m118k16k2946j6872j3327l2665p4926O826j7654L130o242
$$ plain form
13916 -137366 -96128 -93371 -40472 -42867 -2859 -17586 -13988 -27080 -102279 -147410 -107629 -73936
13904 -73936 -115718 -95489 -18852 -20945 -39090 -77037 -14570 9493 12895 -45608 -67740 -109406
13892 -109406 -153177 -180557 -152890 -63008 -50319 -78894 -67644 -98395 -100470 9821 13356 -3137
13880 -3137 -1690 -6759 -38128 -53870 -48098 3811 66666 27729 -67858 -82728 12851 78464
13868 78464 121829 131212 137725 131587 103629 42644 -23038 36093 25171 -44445 -49550 -33705
13856 -33705 40434 77493 22011 -52709 -47049 -88466 -113634 -119756 -116168 -28089 -12284 -84329
13844 -84329 -152244 -171216 -150337 -110775 -65655 -18622 -112843 -145903 -95008 -56143 -36611 -3502
13832 -3502 -27215 -31295 22096 38124 -532 -23977 -42149 -42507 -37634 -43993 -1590 -35934 -20260
$$ packed form
13916a37366M1238K757N2899k395M0008j4727L598j3092p5199m5131L9781L3693
13904g3936m1782K0229P6637k093j8145l7947O2467K4063L402n8503k2132m1666
13892a09406m3771k7380K7667Q9882J2689k8575J1250l0751k075J10291L535j6493
13880c137J447n069l1369j5742N772N1909O2855l8937r5587j4870R5579O5613
13868G8464M3365R383O513o138k7958o0985o5682N9131j0922o9616n105J5845
13856c3705P4139L7059n5482p4720N660m1417k5168o122L588Q8079J5805p2045
13844h4329o7915j8972K0879L9562M5120M7033r4221l3060N0895L8865J9532L3109
13832c502k3713m080N3391J6028l8656k3445j8172l58M873o359M2403l4344J5674
$$ plain form
13819 -20260 -17824 -1335 81289 74574 54710 106771 56279 36454 66111 79510 53171 -5693
13807 -5693 28495 -4806 -17016 2004 7100 -59261 -20732 12082 7805 -53465 -39290 21072
13795 21072 -888 -53790 -37084 -31252 -34575 -64802 -41624 -19129 -2611 38144 93142 92656
13783 92656 55694 16765 12147 41707 80323 146118 285494 381024 388867 425840 582804 816087
13771 816087 1162968 1676357 2287551 2933983 3363337 3227187 2632878 1926670 1429761 1142353
13761 1142353 960679 778528 646262 581304 580844 603318 559094 498153 467093 424965 406491
13750 406491 395948 353187 289690 256055 283501 276720 297540 307055 287037 330432 318417 295215
13738 295215 315882 312112 382109 501090 594336 623891 741336 928903 1130710 1389011 1785725
$$ packed form
13819b0260K436J6489Q2624o715j9864N2061n0492j9825K9657J3399k6339n8864
13807e693L4188l3301j2210J9020N096o6361L8529L2814m277o1270J4175O0362
13795B1072k1960n2902J6706N832l323l0227K3178K2495J6518M0755N4998m86
13783I2656l6962l8929m618K9560L8616O5795J39376R5530P843L6973J56964K33283
13771H16087L46881N13389O11194O46432M29354j36150n94309p06208m96909k87408
13761A142353j81674j82151j32266o4958m60K2474m4224o0941l1060m2128j8474
13750D06491j0543m2761o3497l3635K7446o781K0820R515k0018M3395j2015k3202
13738B95215K0667l770O9997J18981R3246K9555J17445J87567K01807K58301L96714
$$ plain form
13727 1785725 2459333 3427910 4912082 6881157 9028684 10637121 10733649 8865155 6437166
13718 6437166 4647425 3557594 2821188 2342364 2060306 1874828 1776558 1766880 1748758 1582362
13708 1582362 1393203 1220731 1123426 971915 955442 892478 785888 733552 722481 679503
13698 679503 583552 490150 460226 509221 539056 542694 572329 646384 680622 738815 845994
13687 845994 969001 1036991 1129344 1346056 1775061 2388429 3326950 4703244 6533894 8804595
13677 8804595 10674760 11148483 9645280 7104297 5140106 3884029 3064747 2567439 2279642
13668 2279642 2102586 1949110 1754130 1636776 1551693 1368181 1215681 1018028 893155 917332
13658 917332 900278 857663 755296 689310 641775 652856 632190 540452 487659 453003 456816
$$ packed form
13727A785725O73608R68577J484172J969075K147527J608437R6528j868494k427989
13718F437166j789741j089831p36406m78824k82058j85478r8270r678j8122j66396
13708A582362j89159j72472r7305j51511j6473o2964j06590n2336j1071m2978
13698F79503r5951r3402k9924M8995K9835L638K9635P4055L4238N8193J07179
13687H45994J23007O7990R2353K16712M29005O13368R38521J376294J830650K270701
13677H804595J870165M73723j503203k540983j964191j256077q19282m97308k87797
13668B279642j77056j53476j94980j17354q5083j83512j52500j97653j24873K4177
13658I17332j7054m2615j02367o5986m7535J1081k0666r1738n2793l4656L813
$$ plain form
13647 456816 395155 372216 337476 359778 347476 360806 410142 489238 560931 637816 844855
13636 844855 1135903 1545279 2134403 2818301 3442522 3709020 3375075 2606486 1934487 1436001
13626 1436001 1102024 926370 796850 676616 552327 558150 569302 500300 451149 406949
13616 406949 315993 222335 180595 114113 152545 191064 174928 222397 218979 76704 82274 168947
13604 168947 224598 170057 122636 92055 37612 71406 59899 114061 124396 113396 89509
13593 89509 87199 118855 140827 136572 98215 48160 25185 37345 10828 -20688 50189 101047
13581 101047 106053 -7512 -34030 14699 71442 59746 12630 3144 11920 34032 60783 32826
13569 32826 7524 23320 47869 25117 13627 -8524 -7508 -12957 21279 53229 23129 -13444
$$ packed form
13647D56816o1661k2939l4740K2302j2302J3330M9336P9096P1693P6885K07039
13636H44855K91048M09376N89124O83898O24221K66498l33945p68589o71999m98486
13626A436001l33977j75654j29520j20234j24289N823J1152o9002m9151m4200
13616D06949r0956r3658m1740o6482L8432L8519j6136M7469l418j42275N570Q6673
13604A68947N5651n4541m7421l0581n4443L3794j1507N4162J0335j1000k3887
13593H9509k310L1656K1972m255l8357n0055k2975J2160k6517l1516P0877N0858
13581A01047N006j13565k6518M8729N6743j1696m7116r486Q776K2112K6751k7957
13569C2826k5302J5796K4549k2752j1490k2151J016n449L4236L1950l0100l6573
$$ plain form
13557 -13444 36538 36678 15366 61462 23107 -69738 -105694 5949 112136 111547 132856 117674
13545 117674 83560 12708 -40078 1689 50978 88720 55481 -51193 -87507 -142987 -158279
13534 -158279 -78304 -59925 -16312 32245 54077 16125 -38586 -56955 -72461 -60540 -101001
13523 -101001 -137839 -101157 -57554 -46317 -36790 -25520 -39915 -1490 36400 39772 43915 75285
13511 75285 62293 48654 50351 15276 -15906 -11588 31029 95381 105163 85145 16679 -5699
13499 -5699 6898 31143 -12910 -95713 -100288 -82759 -80975 -128504 -74284 2386 3221 -46730 59806
13486 59806 82186 2383 -69658 -73943 23083 39841 -17975 -58534 -27933 1415 24112 20415
13474 20415 -20304 -108664 -131079 -97801 -107895 -91942 -27782 11493 18831 86503 80211 38577
$$ packed form
13557a3444M9982J40k1312M6096l8355r2845l5956J11643J06187n89K1309j5182
13545A17674l4114p0852n2786M1767M9289L7742l3239j06674l6314n5480j5292
13534a58279P9975J8379M3613M8557K1832l7952n4711j8369j5506J1921m0461
13523a01001l6838L6682M3603J1237R527J1270j4395L8425L7890L372M143L1370
13511G5285j2992j3639J697l5075l1182M318M2617O4352R782k0018o8466k2378
13499e699J2597K4245m4053q2803m575J7529J784m7529N4220P6670Q35m9951J06536
13486E9806K2380p9803p2041m285R7026J6758n7816m0559L0601K9348K2697l697
13474B0415m0719q8360k2415L3278j0094J5953O4160L9275P338O7672o292m1634
$$ plain form
13462 38577 55287 42700 4107 15796 2156 -11819 -30012 -25935 2904 14264 -60556 -150943
13450 -150943 -162199 -183243 -171056 -172336 -161244 -171940 -145305 -100422 -23113 -1840 -11283 -10337
13438 -10337 -5308 8464 18892 62961 -8827 -55504 -40673 -4968 36384 -42300 -21791 36600
13426 36600 23881 -35857 17872 55643 73394 79069 27377 2424 -1650 -5091 -55080 -57087
13414 -57087 -4344 -78393 -110365 -113232 -100584 -55904 12559 49269 74369 7443 2638 -32900
13402 -32900 -41996 13355 46361 46013 15089 -67846 -136167 -150456 -161672 -68350 -56887 -25930
13390 -25930 -16832 -21281 38612 -67836 -24671 35524 -612 26027 69123 31195 -15690 -61046
13378 -61046 -67581 -88988 -142911 -101654 -65139 -33503 82913 73255 29705 5185 -49743 -66409
$$ packed form
13462C8577J6710j2587l8593J1689j3640j3975j8193M077K8839J1360p4820r0387
13450a50943j1256k1044J2187j280J1092j0696K6635M4883P7309K1273r443R46
13438a0337N029J3772J0428M4069p1788m6677J4831L5705M1352p8684K0509N8391
13426C6600j2719n9738N3729L7771J7751N675n1692k4953m074l441m9989k007
13414e7087N2743p4049l1972k867J2648M4680O8463L6710K5100o6926m805l5538
13402c2900r096N5351L3006l48l0924q2935o8321j4289j1216R3322J1463L0957
13390b5930R098m449N9893j06448M3165O0195l6136K6639M3096l7928m6885m5356
13378f1046o535k1407n3923M1257L6515L1636J16416r658m3550k4520n4928j6666
$$ plain form
13366 -66409 -103623 -140876 -191363 -172683 -137994 -115676 -123540 -163423 -167790 -122962 -70055 -144404
13354 -144404 -169025 -86912 -47865 -62299 -38294 -5520 -23643 4114 66385 69950 48733 1190
13342 1190 -49847 -65792 -39696 13611 25184 14556 58415 28411 59062 76913 53523 50421
13330 50421 70790 86471 137804 73462 35286 57274 4109 31971 31033 -40892 -44397 -5539
13318 -5539 -40340 -121970 -107205 -19617 4852 -40910 -116278 -106954 -31164 -1963 -78681 -102473
13306 -102473 -55590 -21649 -69481 -70852 -75524 -120172 -82146 -84640 -55674 -24016 -50729 -56015
13294 -56015 -14975 18451 -34778 -99895 -71081 13721 24489 7594 -13229 -4112 2568 -21853
13282 -21853 3672 -13497 -27818 -66488 -100816 -97280 -95162 -96187 -135130 -140648 -50342 -22393
$$ packed form
13366f6409l7214l7253n0487J8680L4689K2318p864l9883m367M4828N2907p4349
13354a44404k4621Q2113L9047j4434K4005L2774j8123K7757O2271L565k1217m7543
13342A190n1037j5945K6096N3307J1573j0628M3859l0004L0651J7851k3390l102
13330E0421K0369J5681N1333o4342l8176K1988n3165K7862r38p1925l505L8858
13318e539l4801q1630J4765Q7588K4469m5762p5368R324P5790K9201p6718k3792
13306a02473M6883L3941m7832j371m672m4648L8026k494K8966L1658k6713n286
13294e6015M1040L3426n3229o5117K8814Q4802J0768j6895k0823R117O680k4421
13282b1853K5525j7169j4321l8670l4328L536K118j025l8943n518R0306K7949
$$ plain form
13270 -22393 -44159 -16059 -15404 -41742 -35139 1700 14783 -9586 9862 13631 -10647 -10864 34904
13257 34904 39714 -103335 -136439 -82067 6140 18234 -11603 -19243 -46558 -24959 47669 -11897
13245 -11897 -39600 6684 -18210 -145505 -95042 -53506 -42784 -34657 -20898 -3700 30819 19823
13233 19823 -11878 -43361 -10359 905 -18008 -34498 -5455 61966 108401 96366 62745 -26225
13221 -26225 -62825 -30581 -23355 -14183 -58399 -153903 -146339 -115651 -100921 -16666 -8421 -11402 30031
13208 30031 77624 86521 149876 126131 64758 82534 132669 119093 77285 36361 -4049 45996
13196 45996 19525 -15496 -29805 17915 29247 28349 -23910 -86780 -36897 -17085 -33346 -36361
13184 -36361 -39536 -50344 -47091 -19410 -37995 -68728 -74567 -63413 -64080 -21729 -72857 -47869 -75699
$$ packed form
13270b2393k1766K8100O55k6338O603L6839J3083k4369J9448L769k4278k17M5768
13257C4904M810j43049l3104N4372Q8207J2094k9837p640k7315K1599P2628n9566
13245a1897k7703M6284k4894j27295N0463M1536J0722Q127J3759J7198L4519j0996
13233A9823l1701l1483L3002J1264j8913j6490K9043O7421M6435j2035l3621q8970
13221b6225l6600L2244P226R172m4216r5504P564L0688J4730Q4255Q245k981M1433
13208C0031M7593Q897O3355k3745o1373J7776N0135j3576m1808m0924m0410N0045
13196D5996k6471l5021j4309M7720J1332q98n2259o2870M9883J9812j6261l015
13184c6361l175j0808L253K7681j8585l0733n839J1154o67M2351n1128K4988k7830
$$ plain form
13171 -75699 -110528 -55691 -46772 -106840 -120663 -87597 -48950 -61481 -70934 -29042 -12298 -33932
13159 -33932 -38273 -64220 -68228 -62362 -84341 -24094 18640 -50372 -57998 -54213 -94447 -50653 -59747
13146 -59747 -76332 -68619 -76351 -78546 -14478 17935 35786 58677 68449 67020 26131 35044 -18024
13133 -18024 -2038 -18850 -2885 12496 -10791 -127258 -163304 -80078 -18669 -42782 -24142
13122 -24142 -23174 -21605 -22210 -24476 2269 45005 9753 34710 11777 -46696 -93638 -97915 -46792
13109 -46792 -38638 -17755 16694 94285 39269 -57440 -132418 -114883 -53929 -108248 -150543 -171338
13097 -171338 -197064 -163675 -114832 -82832 4405 -21589 -20957 -6009 -22014 -47745 297 35462
13085 35462 35584 48246 50854 84288 67112 -1901 20003 3052 7656 -9796 -47979 -17015
$$ packed form
13171g5699l4829N4837Q919o0068j3823L3066L8647j2531r453M1892J6744k1634
13159c3932m341k5947m008N866k1979O0247M2734o9012p626L785m0234M3794r094
13146e9747j6585P713p732k195O4068L2413J7851K2891R772j429m0889Q913n3068
13133a8024J5986j6812J5965J5381k3287j16467l6046Q3226O1409k4113J8640
13122b4142R68J569o05k266K6745M2736l5252K4957k2933n8473m6942m277N1123
13109d6792Q154K0883L4449P7591n5016r6709p4978J7535O0954n4319m2295k0795
13097a71338k5726L3389M8843L2000Q7237k5994O32J4948j6005k5731M8042L5165
13085C5462J22J2662K608L3434j7176o9013K1904j6951M604j7452l8183L0964
$$ plain form
13073 -17015 55677 27775 -37659 -10330 39617 49642 16717 35561 51265 33122 2865 12580
13061 12580 -14662 -130580 -97018 -53372 -104002 -125706 -60996 -18447 -62376 -29708 -72779
13050 -72779 -88178 -20529 -57342 -57040 -22435 -21080 15286 27951 -9134 -73747 -94944 -84354
13038 -84354 -114162 -133974 -55645 41247 50915 8685 -47779 -125726 -216339 -193755 -121023 -78149
13026 -78149 -81705 -82623 -54488 -46425 -52529 -40431 -67524 -56604 4884 8236 3578 65230 93202
13013 93202 74503 43907 30673 40189 10951 -2532 -33458 47518 13941 26434 -8228 -57286
13001 -57286 -20412 2189 -69283 -87045 -22310 21572 -55065 720 68858 44217 -34376 -51971
12989 -51971 -50950 -32526 46389 55994 16988 -45760 -69581 -53605 -33026 -62765 -126273 -105937
$$ packed form
13073a7015P2692k7902o5434K7329M9947J0025l2925J8844J5704j8143l0257R715
13061A2580k7242j15918L3562M3646n0630k1704O4710M2549m3929L2668m3071
13050g2779j5399O7649l6813L02L4605J355L6366J2665l7085o4613k1197J0590
13038h4354k9808j9812P8329R6892R668m2230n6464p7947r0613K2584P2732M2874
13026g8149l556r18K8135Q063o104J2098k7093J0920O1488L352m658O1652K7972
13013I3202j8699l0596j3234R516k9238j3483l0926Q0976l3577J2493l4662m9058
13001e7286L6874K2601p1472j7762O4735M3882p6637N5785O8138k4641p8593j7595
12989e1971J021J8424P8915R605l9006o2748k3821J5976K0579k9739o3508K0336
$$ plain form
12977 -105937 -80159 -60084 -93153 -98997 -63907 -12561 -51632 -27377 -10999 5945 -236 -21747
12965 -21747 -44803 31474 98802 82459 52899 32620 89456 52842 97626 169997 132018 32819
12953 32819 -87556 -111218 -46668 -63231 -59961 713 17987 -66454 -73350 -45184 -69978 -86608
12941 -86608 -95420 -87379 -71262 -77398 -97220 -85373 -18684 5650 47500 41319 -22754 -12320
12929 -12320 -14346 -28099 -42726 -27338 -43213 -42424 -54672 -117231 -114747 -92997 -115717 -91642
12917 -91642 15330 58018 -14804 37028 25277 1884 2551 -38927 -12910 22629 63036 161
12905 161 -42875 -13515 -39711 -62470 -108062 -57012 -7812 62401 53053 74128 65382 42264
12893 42264 36411 -8743 -65480 -58156 -1203 -10243 -6123 -14324 -2339 59894 53950 29105 17944
$$ packed form
12977a05937K5778K0075l3069n844L5090N1346l9071K4255J6378J6944o181k1511
12965b1747k3056P6277O7328j6343k9560k0279N6836l6614M4784P2371l7979r9199
12953C2819j20375k3662O4550j6563L270O0674J7274q4441o896K8166k4794j6630
12941h6608q812Q041J6117o136j9822J1847O6689K4334M1850o181o4073J0434
12929a2320k026j3753j4627J5388j5875P89j2248o2559K484K1750k2720K4075
12917i1642J06972M2688p2822N1832j1751k3393O67m1478K6017L5539M0407o2875
12905A61m3036K9360k6196k2759m5592N1050M9200P0213r348K1075q746k3118
12893D2264n853m5154n6737P324N6953r040M120q201J1985O2233n944k4845j1161
$$ plain form
12880 17944 48352 15931 -49574 -62549 -45892 1199 29428 14999 4045 -46075 -84695 -86110
12868 -86110 -26789 -47785 -97953 -50726 -51194 -123682 -137228 -126656 -101766 -47448 -38359 -7723
12856 -7723 -349 -32501 -44260 -34942 4864 -21993 -42532 -45449 -46573 -48053 -46145 -37331 -52444
12843 -52444 16163 75464 2442 -42542 -18198 29193 -636 -20977 -60000 -67213 -39472 -19378
12831 -19378 -20467 40155 92247 61443 -38946 -85764 -20712 34048 9474 -42099 -42573 -27103
12819 -27103 -54004 -91574 -149318 -147680 -67698 -33394 -43350 -69708 -116701 -27769 50546 29717
12807 29717 34699 92289 41153 -17464 -21427 -58434 -153006 -162894 -192331 -129711 -72326 -46700
12795 -46700 -4483 10505 -64861 -57591 -50975 -78794 -82308 2655 23711 62571 84308 53938
$$ packed form
12880A7944L0408l2421o5505j2975J6657M7091K8229j4429j0954n0120l8620j415
12868h6110N9321k0996n0168M7227m68p2488j3546J0572K4890N4318R089L0636
12856g723P374l2152j1759R318L9806k6857k0539k917j124j480J908Q814j5113
12843e2444O8607N9301p3022m4984K4344M7391k9829k0341l9023p213K7741K0094
12831a9378j089O0622N2092l0804j00389m6818O5052N4760k4574n1573m74J5470
12819b7103k6901l7570n7744J638P9982L4304r956k6358m6993Q8932P8315k0829
12807B9717M982N7590n1136n8617l963l7007r4572r888k9437O2620N7385K5626
12795d6700M2217J4988p5366P270O616k7819l514Q4963K1056L8860K1737l0370
$$ plain form
12783 53938 71831 93332 71594 48756 37747 -1005 -54440 -25431 -90345 -133179 -94592 10756
12771 10756 -42767 -42584 -743 19112 -53583 -84641 -158678 -141796 -63978 -72502 -86726 -93074
12759 -93074 5985 50804 63720 27561 33821 71838 6562 -4879 19669 -22712 -100568 -62001
12747 -62001 -48854 -113449 -111250 -95143 -82996 -58728 -51150 -61522 -124410 -157248 -224589 -155764
12735 -155764 -101856 -69772 -55504 -38363 -9791 -27422 -62227 3338 62421 19540 17219 34947
12723 34947 20891 8715 -43136 -8675 -40584 -47146 -40595 -58900 -81527 -95745 -121057 -96264
12711 -96264 -57158 -30288 -34193 -23877 1007 61266 27209 18599 61540 -23123 -38635 -1761
12699 -1761 -11477 62821 106303 85041 65399 52524 -14352 -75147 -94730 -59476 -77478 -61440
$$ packed form
12783E3938J7893K1501k1738k2838j1009l8752n3435K9009o4914m2834L8587J05348
12771A0756n3523J83M1841J9855p2695l1058p4037J6882P7818q524j4224o348
12759i3074R9059M4819J2916l6159O260L8017o5276j1441K4548m2381p7856L8567
12747f2001J3147o4595K199J6107J2147K4268P578j0372o2888l2838o7341O8825
12735a55764N3908L2084J4268J7141K8572j7631l4805O5565N9083m2881k321J7728
12723C4947j4056j2176n1851L4461l1909o562O551j8305k2627j4218k5312K4793
12711i6264L9106K6870l905J0316K4884O0259l4057q610M2941q4663j5512L6874
12699a761r716P4298M3482k1262j9642j2875o6876o0795j9583L5254j8002J6038
$$ plain form
12687 -61440 -7688 35622 -25293 -52406 -56765 -84346 -111046 -144209 -26894 -32239 -73928 -21913
12675 -21913 26800 8826 -49766 -77698 -61527 -10977 -78083 -108097 -84613 -139603 -119656 -155485
12663 -155485 -141274 -97317 11723 6717 -28194 -89383 -8963 31656 9267 20451 33334
12652 33334 33891 50331 41501 -47137 -95261 -40723 -43607 -89361 -60051 -76352 -123772 -88510
12640 -88510 -142590 -128828 -25289 -12560 -73324 -105417 -147754 -137588 -51814 32531 -46658
12629 -46658 -109095 -76853 -79832 -135782 -119717 -42681 -20770 -76527 -177384 -172916 -99553 -60071
12617 -60071 -23025 -76206 -74501 -12747 -73589 -66451 -79991 -135991 -129726 -152832 -131320 -71065
12605 -71065 15685 85180 78596 -1750 -114032 -179011 -117450 -69298 1191 46185 59642 120236
$$ packed form
12687f1440N3752M3310o0915k7113m359k7581k6700l3163J17315n345m1689N2015
12675b1913M8713j7974n8592k7932J6171N0550o7106l0014K3484n4990J9947l5829
12663a55485J4211M3957J09040n006l4911o1189Q0420M0619k2389J1184J2883
12652C3334N57J6440q830q8638m8124N4538k884m5754K9310j6301m7420L5262
12640h8510n4080J3762J03539J2729o0764l2093m2337J0166Q5774Q4345p9189
12629d6658o2437L2242k979n5950J6065P7036K1911n5757j00857M468P3363L9482
12617f0071L7046n3181J705O1754o0842P138j3540n6000O265k3106K1512O0255
12605g1065Q6750O9495o584q0346j12282o4979O1561M8152P0489M4994J3457O0594
$$ plain form
12593 120236 69375 -48964 -110859 -208322 -126964 -84371 -98240 -81377 -69119 -73019 -112806
12582 -112806 -78357 -37466 -88693 -61550 -49114 -49464 -21644 -15177 -40601 7893 -35016 -38703
12570 -38703 -56563 1185 15462 26904 11064 20823 9347 -66933 -26977 -5850 -69335 -70115
12558 -70115 -50000 -51478 25424 63676 12862 -54017 -100498 -51398 -33262 -83948 -87939 -36431
12546 -36431 -28152 41916 119299 85447 39193 17904 60836 33038 17679 -31569 -81156 -33238
12534 -33238 19114 -37291 -27061 -58721 -22803 19862 -14595 67886 50237 -13631 -34788 -75789
12522 -75789 -140045 -209802 -156850 -102408 -106072 -119349 -71161 -104938 -57244 -50134 -127862 -143392
12510 -143392 -111245 -40072 63419 83302 -5695 -10054 -70193 -223909 -223779 -177164 -136014 -90697
$$ packed form
12593A20236n0861j18339o1895r7463Q1358M2593j3869J6863J2258l900l9787
12582a12806L4449M0891n1227K7143J2436l50K7820O467k5424M8494m2909l687
12570c8703j7860N7748J4277J1442j5840R759j1476p6280L9956K1127o3485p80
12558g0115K0115j478P6902L8252n0814o6879m6481M9100J8136n0686l991N1508
12546c6431Q279P0068P7383l3852m6254k1289M2932k7798j5359m9248m9587M7918
12534c3238N2352n6405J0230l1660L5918M2665l4457Q2481j7649o3868k1157m1001
12522g5789o4256o9757N2952N4442l664j3277M8188l3777M7694P110p7728j5530
12510a43392L2147P1173J03491J9883q8997m359o0139j53716J30M6615M1150M5317
$$ plain form
12498 -90697 -76219 -33578 -97948 -65407 -26471 -65107 -4757 31119 -11149 299 -18603 -22945
12486 -22945 36281 33620 53208 32087 31002 45835 35552 -42695 -49300 -23173 -7858 21845
12474 21845 34186 26628 -49302 -129248 -146374 -117671 -111417 -113490 -86799 -48218 24702 66746
12462 66746 61013 63868 16356 19892 -38701 -138773 -92307 -84381 -104186 -111370 -103951 -65406 -56243
12449 -56243 -38194 -102528 -127307 -107778 -142644 -147928 -148969 -90847 -36576 20918 65648 -3950
12437 -3950 -23554 -3994 22294 38769 43256 7464 -58436 -88439 -91617 -3226 74756 65088
12425 65088 34375 -37488 -87480 -150613 -134970 -83614 -56216 -32716 -29454 -5908 -90291 -79701
12413 -79701 -5522 85860 50504 18996 -23214 -31933 4011 -16868 -41221 -26249 7214 42355
$$ packed form
12498i0697J4478M2641o4370L2541L8936l8636O0350L5876m2268J1448j8902m342
12486b2945N9226k661J9588k1121j085J4833j0283p8247o605K6127J5315K9703
12474B1845J2341p558p5930p9946j7126K8703O254k073K6691L8581P2920M2044
12462F6746n733K855m7512L536n8593j00072M6466P926j9805p184P419L8545R163
12449e6243J8049o4334k4779J9529l4866n284j041N8122N4271N7494M4730o9598
12437c950j9604J9560K6288J6475M487l5792o5900l0003l178Q8391P7982r668
12425F5088l0713p1863m9992o3133J5643N1356K7398K3500L262K3546q4383J0590
12413g9701P4179R1382l5356l1508m2210q719L5944k0879k4353J4972L3463L5141
$$ plain form
12401 42355 64822 31988 30803 20315 10415 -22786 -15591 19051 40383 47259 44903 6879 -3658
12388 -3658 37610 87678 56769 -28811 -36490 8877 -331 -59626 -85423 -117857 -110067 -42385
12376 -42385 4750 45572 37128 -42738 -21615 -66096 -119020 -72403 -128036 -108877 -87935 -90271
12364 -90271 3551 16278 -72632 -66342 -38675 -28143 26291 14554 2980 70033 104677 70423
12352 70423 15741 -68635 -60631 -52485 -79036 -66058 -112835 -69602 -101255 -64326 -12552 62
12340 62 -9161 11783 28188 -24821 -74276 -72925 -69234 -88742 -148839 -182556 -145538 -94057 -111728
12327 -111728 -86142 -41652 -19286 -31324 28938 32889 -5850 -79898 -46234 -90999 -135367 -153824
12315 -153824 -117091 -42383 -5008 -27385 -63598 -58826 -3309 37939 84767 54095 7955 6341
$$ packed form
12401D2355K2467l2834j185j0488r900l3201P195L4642K1332O876k356l8024j0537
12388c658M1268N0068l0909q5580p679M5367r208n9295k5797l2434P790O7682
12376d2385M7135M0822q444p9866K1123m4481n2924M6617n5633J9159K0942k336
12364i0271R3822J2727q8910O290K7667J0532N4434j1737j1574O7053L4644l4254
12352G0423n4682q4376Q004Q146k6551J2978m6777M3233l1653L6929N1774J2614
12340F2r223K0944J6405n3009m9455J351L691j9508o0097l3717L7018N1481j7671
12327a11728K5586M4490K2366j2038O0262L951l8739p4048L3664m4765m4368j8457
12315a53824L6733P4708L7375k2377l6213M772N5517M1248M6828l0672m6140j614
$$ plain form
12303 6341 42355 16484 -24694 -62373 -69169 -32028 -5066 -6636 -40608 -24092 -10165 -75411
12291 -75411 -134771 -129888 -132168 -95621 -69918 -96292 -117214 -113403 -148704 -154692 -131285 -153232
12279 -153232 -154324 -157230 -108683 -41510 -49469 -68561 5266 -9872 5720 42346 87374 -40005
12267 -40005 -125448 -165651 -46264 -11767 -36255 -22551 -42156 -1217 -4567 -12339 -4170 -33955
12255 -33955 -41885 -33794 -21517 -4592 -1375 -48971 -47093 -63440 -41732 -6396 -1334 9000 96351
12242 96351 104310 58603 -18858 4236 -27656 -33986 51957 31579 5848 -24412 -17438 -4035
12230 -4035 890 4050 -78141 -87771 -142518 -202459 -104268 -40193 10053 13420 -5325 -4942 18837
12217 18837 -31952 -85499 -88763 -27686 -23077 -26951 -23367 -81774 -105310 -100222 -75866 -22344 20178
$$ packed form
12303F341L6014k5871m1178l7679o796L7141K6962j570l3972J6516J3927o5246
12291g5411n9360M883k280L6547K5703k6374k0922L811l5301n988K3407k1947
12279a53232j092k906M8547O7173p959j9092P3827j5138J5592L6626M5028j27379
12267d0005q5443m0203J19387L4497k4488J3704j9605M0939l350p772Q169k9785
12255c3955p930Q091J2277J6925L217m7596J878j6347K1708L5336N062J0334Q7351
12242I6351P959m5707p7461K3094l1892o330Q5943k0378k5731l0260O974J3403
12230d035M925L160q2191r630n4747n9941R8191O4075N0246L367j8745L83K3779
12217A8837n0789n3547l264O1077M609l874L584n8407k3536N088K4356N3522M2522
$$ plain form
12204 20178 15105 33689 -7437 -43666 -29019 4313 -25928 -45652 -14334 -2664 -17871 -71884
12192 -71884 -54759 -93340 -129407 -124731 -104799 -55227 -41175 -38145 -32324 -58378 -67309 -77193 -79607
12179 -79607 -90221 -111102 -55059 -45029 -86161 -61346 -65696 -42106 -23987 11069 -10018 -39509
12167 -39509 -128931 -71603 -80767 -54779 -39778 -35414 -31211 -25898 34264 104134 87148 55174
12155 55174 21854 -31263 -4397 48820 -27166 -123084 -117943 -38936 -66029 -89997 -33572 6970
12143 6970 -25309 -20216 -98557 -168683 -108088 -61389 -108558 -108774 -88662 -98210 -88920 -22279 4388
12130 4388 -58901 -101569 -59140 17836 40916 51180 68193 15747 -87854 -56295 -66042 -157332
12118 -157332 -130142 -47267 -8824 7724 15020 33123 76313 137983 156488 125685 35635 -29198
$$ packed form
12204B0178n073J8584m1126l6229J4647L3332l0241j9724L1318J1670j5207n4013
12192g1884J7125l8581l6067M676J9932M9572J4052L030N821k6054q931r884k414
12179g9607j0614k0881N6043J0030m1132K4815m350K3590J8119L5056k1087k9491
12167c9509q9422N7328r164K5988J5001M364M203N313O0162O9870j6986l1974
12155E5174l3320n3117K6866N3217p5986r5918N141P9007k7093k3968N6425M0542
12143F970l2279N093p8341p0126O0595M6699m7169k16K0112r548R290O6641K6667
12130D388o3289m2668M2429P6976K3080J0264J7013n2446j03601L1559r747r1290
12118a57332K7190Q2875L8443J6548P296J8103M3190O1670J8505l0803r0050o4833
$$ plain form
12106 -29198 -27469 -5955 19726 25408 54402 37762 -11816 7885 24135 751 -22252 -60472
12094 -60472 -128952 -113780 -9572 9953 22487 45832 72942 111551 116469 65530 11465 -35531
12082 -35531 7254 45530 99183 126586 126939 135514 160554 104008 22442 -7737 -8720 7198 14136
12069 14136 -18784 -52766 -124305 -48736 170 -63309 -40407 -3428 36816 32347 -32613 -117839
12057 -117839 -156177 -152131 -62242 -22429 -6713 55962 54311 -54058 -116451 -59102 -21314 -10873
12045 -10873 -3646 11368 478 3431 18612 -5357 -55415 -92650 -103850 -49135 12500 -32413
12033 -32413 -80596 -95574 -88909 -45068 16686 34565 57900 35535 52609 12705 -72005 -49896
12021 -49896 17765 50864 18848 12916 6519 17940 -23573 -18253 -19262 -18784 28011 43407 50051
$$ packed form
12106b9198J729K1514K5681N682K8994j6640m9578J9701J6250k3384k3003l8220
12094f0472o8480J5172J04208J9525J2534K3345K7110L8609M918n0939n4065m6996
12082c5531M2785L8276N3653K7403L53Q575K5040n6546q1566l0179r83J5918O938
12069A4136l2920l3982p1539P5569M8906o3479K2902L6979M0244m469o4960q5226
12057a17839l8338M046Q9889L9813J5716O2675j651j08369o2393N7349L7788J0441
12045a0873P227J5014j0890K953J5181k3969n0058l7235j1200N4715O1635m4913
12033c2413m8183j4978O665M3841O1754J7879K3335k2365J7074l9904q4710K2109
12021d9896O7661L3099l2016n932o397J1421m1513N320j009M78M6795J5396O644
$$ plain form
12008 50051 56899 35154 28685 26391 -11850 -2368 -9820 36501 -6913 -51378 -115196 -84695 -70137
11995 -70137 -127837 -134520 -179154 -185863 -117673 -115444 -94270 -14648 55578 75801 51133 53069
11983 53069 55127 58608 46276 48513 19300 -26490 24885 38715 6065 -7689 -18317 -73308
11971 -73308 -35254 -11375 -38829 -82396 -71522 -12690 15924 18243 9508 65014 104223 119776
11959 119776 91395 90084 158650 179633 56353 61950 120584 55672 40852 7009 74297 148780
11947 148780 139859 128471 70928 38548 -26830 -112965 -144223 -77410 78959 87627 46450 34871
11935 34871 116846 127354 79741 51494 18998 -59688 -123052 -111250 -127019 -121568 -73532 -114234
11923 -114234 -170323 -181656 -150775 -133356 -154272 -119512 -102677 -117911 -75424 -57657 -46689
$$ packed form
12008E0051O848k1745o469k294l8241R482p452M6321m3414m4465o3818L0501J4558
11995g0137n7700o683m4634o709O8190K229K1174P9622P0226K0223k4668J936
11983E3069K058L481j2332K237k9213m5790N1375J3830l2650j3754j0628n4991
11971g3308L8054K3879k7454m3567J0874N8832K8614K319q735N5506L9209J5553
11959A19776k8381j311O8566K0983j23280N597N8634o4912j4820l3843O7288P4483
11947A48780q921j1388n7543l2380o5378q6135l1258O6813J56369Q668m1177j1579
11935C4871Q1975J0508m7613k8247l2496p8686o3364J1802j5769N451M8036m0702
11923a14234n6089j1333L0881J7419k0916L4760J6835j5234M2487J7767J0968
$$ plain form
11912 -46689 -53406 28074 -4083 -41755 -34652 404 -44179 -73622 -44999 -131674 -95244 -49648
11900 -49648 -17989 -58320 -110055 -49099 -28444 -23474 -17902 6926 27473 25154 13641 34768
11888 34768 -18029 -42402 52575 30312 -28069 -2546 12890 2894 36370 70746 69098 104456
11876 104456 116394 66921 90729 65102 -26401 -74034 -22517 9717 -23318 -26244 -59216 -103807
11864 -103807 -111230 11223 111046 56136 8911 12498 -24899 -102833 -72685 -14643 -25019 -22671
11852 -22671 -97596 -147575 -87857 -117315 -111884 -60380 -5439 28141 68686 84233 62196 83241
11840 83241 6856 31248 36402 1578 -53822 -113413 -95293 -15244 94 -20835 -28956 -44421
11828 -44421 8325 -5623 -122089 -193851 -173977 -139794 -68256 -29317 -52085 -60983 -46840 -14416
$$ packed form
11912d6689o717Q1480l2157l7672P103L5056m4583k9443K8623q6675L6430M5596
11900d9648L1659m0331n1735O0956K0655M970N572K4828K0547k319j1513K1127
11888C4768n2797k4373R4977k2263n8381K5523J5436r996L3476L4376j648L5358
11876A04456J1938m9473K3808k5627r1503m7633N1517L2234l3035k926l2972m4591
11864a03807p423J22453R9823n4910m7225L587l7397p7934L0148N8042j0376K348
11852b2671p4925m9979N9718k9458N431N1504N4941L3580M0545J5547k2037K1045
11840H3241p6385K4392N154l4824n5400n9591J8120Q0049J5338k0929q121j5465
11828d4421N2746j3948j16466p1762J9874L4183P1538L8939k2768q898J4143L2424
$$ [...]
##END NTUPLES=NMR SPECTRUM
##END=
