##TITLE=Analysis number 314368
Compound Code cc 30524
Book Reference 441/157
Project Code adrs
Chemist Name colinb
##JCAMPDX= 6.0         $$ Bruker NMR JCAMP-DX V2.0
##DATA TYPE= NMR SPECTRUM
##DATA CLASS= NTUPLES
##ORIGIN= Bruker BioSpin GmbH
##OWNER= NMR
$$ XWIN-NMR		Version 3.5
$$ Mon Oct 17 11:56:21 2005 GMT Daylight Time (UT+1h)  MAYBRIDGE\NMR@NMR_250MHZ
##.OBSERVE FREQUENCY= 250.131544655141
##.OBSERVE NUCLEUS= ^1H
##.ACQUISITION MODE= SIMULTANEOUS (DQD)
##.ACQUISITION SCHEME= undefined
##.AVERAGES= 16
##.DIGITISER RES= 18
##SPECTROMETER/DATA SYSTEM= dpx250
##.PULSE SEQUENCE= zg30
##.SOLVENT NAME= CDCl3
##.SHIFT REFERENCE= (INTERNAL, CDCl3, 0, 16.4478)
##AUDIT TRAIL= $$ (NUMBER, WHEN, WHO, WHERE, WHAT)
$$ ##TITLE= Audit trail, XWIN-NMR		Version 3.5
$$ ##JCAMPDX= 5.01
$$ ##ORIGIN= Bruker BioSpin GmbH
$$ ##OWNER= NMR
$$ C:\u/data/dgb/nmr/ADRS/10870/pdata/1/auditp.txt
$$ ##AUDIT TRAIL=  $$ (NUMBER, WHEN, WHO, WHERE, WHAT)
(   1,<2005-10-17 11:55:48.36 +100>,<MAYBRIDGE\NMR>,<NMR_250MHZ>,
      <created by zg, POWCHK disabled, PULCHK disabled
       configuration hash MD5:
       62 19 C7 07 E1 42 D1 B7 37 6C 3D D0 77 39 F9 E6
       data hash MD5: 64K
       E4 EE 99 F3 42 8F B1 4B 9C 10 A8 3D 71 7B 5D 6C>)
(   2,<2005-10-17 11:56:03.97 +100>,<MAYBRIDGE\NMR>,<NMR_250MHZ>,
      <Start of raw data processing
       ef LB = 0.3 FT_mod = 6 PKNL = 1 SI = 32K 
       data hash MD5: 32K
       53 34 8A D9 76 15 4F 79 86 84 2F 7F E4 6D 3B 83>)
(   3,<2005-10-17 11:56:08.61 +100>,<MAYBRIDGE\NMR>,<NMR_250MHZ>,
      <apk 
       data hash MD5: 32K
       0C 82 EC 5E E5 46 06 D7 A8 5F A8 34 44 44 BD BC>)
(   4,<2005-10-17 11:56:10.13 +100>,<MAYBRIDGE\NMR>,<NMR_250MHZ>,
      <abs ABSG = 5 
       data hash MD5: 32K
       8A 70 BB 26 D6 CE EC BC BB 4A 8B BB E0 6A 89 17>)
$$ ##END=
$$ 
$$ hash MD5
$$ E5 F7 E1 F5 A4 2A 79 46 6C E0 C8 5F D9 4E 44 39
##$RELAX= 
##$RELAX= 
##$RELAX= 
##$RELAX= 
##$RELAX= 
##$RELAX= 
##$RELAX= 
$$ Bruker specific parameters
$$ --------------------------
##$DU= <C:\u>
##$EXPNO= 10870
##$NAME= <ADRS>
##$PROCNO= 1
##$TYPE= <nmr>
##$USER= <dgb>
##$AMP= (0..31)
100 100 100 100 100 100 100 100 100 100 100 100 100 100 100 100 100 100 
100 100 100 100 100 100 100 100 100 100 100 100 100 100 
##$AQSEQ= 0
##$AQ_mod= 3
##$AUNM= <au_zg>
##$AUTOPOS= <18 >
##$BF1= 250.13
##$BF2= 250.13
##$BF3= 250.13
##$BF4= 250.13
##$BF5= 500.13
##$BF6= 500.13
##$BF7= 500.13
##$BF8= 500.13
##$BYTORDA= 1
##$CFDGTYP= 0
##$CFRGTYP= 5
##$CHEMSTR= <none>
##$CNST= (0..31)
1 1 145 1 1 1 1 1 1 1 1 1 1 1 1 1 1 1 1 1 1 1 1 1 1 1 1 1 1 1 1 1 
##$CPDPRG= <>
##$CPDPRG1= <>
##$CPDPRG2= <>
##$CPDPRG3= <>
##$CPDPRG4= <mlev>
##$CPDPRG5= <mlev>
##$CPDPRG6= <mlev>
##$CPDPRG7= <mlev>
##$CPDPRG8= <mlev>
##$CPDPRGB= <>
##$CPDPRGT= <>
##$D= (0..31)
0 1 0 0 0 0 0 0 0 0.06 0 0 0 0 0 0 0.0002 0 0 0 0 0 0 0 0 0 0 0 0 0 0 
0 
##$DATE= 1129546546
##$DBL= (0..7)
120 120 120 120 120 120 120 120 
##$DBP= (0..7)
150 150 150 150 150 150 150 150 
##$DBP07= 0
##$DBPNAM0= <>
##$DBPNAM1= <>
$$ [...]
##$SUBNAM7= <"">
##$SUBNAM8= <"">
##$SUBNAM9= <"">
##$SW= 20.6930455092707
##$SWIBOX= (0..15)
0 0 3 0 0 0 0 0 0 0 0 0 0 0 0 0 
##$SW_h= 5175.983436853
##$TD= 65536
##$TD0= 1
##$TE= 294.16
##$TE2= 300
##$TE3= 300
##$TEG= 300
##$TL= (0..7)
0 120 120 120 120 120 120 120 
##$TP= (0..7)
150 150 150 150 150 150 150 150 
##$TP07= 0
##$TPNAME0= <>
##$TPNAME1= <>
##$TPNAME2= <>
##$TPNAME3= <>
##$TPNAME4= <>
##$TPNAME5= <>
##$TPNAME6= <>
##$TPNAME7= <>
##$TPOAL= (0..7)
0.5 0.5 0.5 0.5 0.5 0.5 0.5 0.5 
##$TPOFFS= (0..7)
0 0 0 0 0 0 0 0 
##$TUNHIN= 0
##$TUNHOUT= 0
##$TUNXOUT= 0
##$USERA1= <user>
##$USERA2= <user>
##$USERA3= <user>
##$USERA4= <user>
##$USERA5= <user>
##$V9= 5
##$VALIST= <valist>
##$VCLIST= <CCCCCCCCCCCCCCC>
##$VD= 0
##$VDLIST= <DDDDDDDDDDDDDDD>
##$VPLIST= <PPPPPPPPPPPPPPP>
##$VTLIST= <TTTTTTTTTTTTTTT>
##$WBST= 1024
##$WBSW= 4
##$XGAIN= (0..3)
0 0 0 0 
##$XL= 0
##$YL= 0
##$YMAX_a= 387042
##$YMIN_a= -360024
##$ZGOPTNS= <>
##$ZL1= 120
##$ZL2= 120
##$ZL3= 120
##$ZL4= 120
##$ABSF1= 16.44781
##$ABSF2= -4.245363
##$ABSG= 5
##$ABSL= 3
##$ALPHA= 0
##$AQORDER= 0
##$ASSFAC= 0
##$ASSFACI= 0
##$ASSFACX= 0
##$ASSWID= 0
##$AUNMP= <proc_1d>
##$AZFE= 0.1
##$AZFW= 0.1
##$BCFW= 0
##$BC_mod= 0
##$BYTORDP= 0
##$COROFFS= 0
##$CY= 12.5
##$DATMOD= 1
##$DC= 0
##$DFILT= <>
##$DTYPP= 0
##$F1P= 14.0000005364418
##$F2P= -0.99999901652339
##$FCOR= 0.5
##$FTSIZE= 32768
##$FT_mod= 6
##$GAMMA= 0
##$GB= 0
##$INTBC= 1
##$INTSCL= 1
##$ISEN= 128
##$LB= 0.3
##$LEV0= 0
##$LPBIN= 0
##$MAXI= 10000
##$MC2= 0
##$MEAN= 0
##$ME_mod= 0
##$MI= 0
##$NCOEF= 0
##$NC_proc= -3
##$NLEV= 6
##$NOISF1= 0
##$NOISF2= 0
##$NSP= 0
##$NTH_PI= 0
##$NZP= 0
##$OFFSET= 16.44781
##$PC= 1
##$PHC0= -67.55561
##$PHC1= 6.830437
##$PH_mod= 1
##$PKNL= yes
##$PPARMOD= 0
##$PSCAL= 4
##$PSIGN= 0
##$REVERSE= no
##$SF= 250.1300185543
##$SI= 32768
##$SIGF1= 0
##$SIGF2= 0
##$SINO= 400
##$SIOLD= 32768
##$SREGLST= <1H.CDCl3>
##$SSB= 0
##$STSI= 32768
##$STSR= 0
##$SW_p= 5175.98343685301
##$SYMM= 0
##$S_DEV= 0
##$TDeff= 65536
##$TDoff= 0
##$TI= <Analysis number 999999
Compound Code 99
Book Reference 9
Project Code 9>
##$TILT= no
##$TM1= 0
##$TM2= 0
##$TOPLEV= 0
##$USERP1= <user>
##$USERP2= <user>
##$USERP3= <user>
##$USERP4= <user>
##$USERP5= <user>
##$WDW= 1
##$XDIM= 32768
##$YMAX_p= 320491630
##$YMIN_p= -115614
$$ End of Bruker specific parameters
$$ ---------------------------------
##NTUPLES= NMR SPECTRUM
##VAR_NAME=  FREQUENCY,     SPECTRUM/REAL,   SPECTRUM/IMAG
##SYMBOL=    X,             R,               I
##VAR_TYPE=  INDEPENDENT,   DEPENDENT,       DEPENDENT
##VAR_FORM=  AFFN,          ASDF,            ASDF
##VAR_DIM=   32768,         32768,           32768
##UNITS=     HZ,            ARBITRARY UNITS, ARBITRARY UNITS
##FACTOR=    0.157963299565203, 1,           1
##FIRST=     4114.09082521619, 0,            0
##LAST=      -1061.89261163682, 0,           0
##MIN=       -1061.89261163682, -115614,     0
##MAX=       4114.09082521619, 320491630,    0
$$ Real data points
##PAGE= N=1
##DATA TABLE= (X++(R..R)), XYDATA
$$ [...]
19733g229J0388r916j294q085J6871j2100Q12j2510L2452P674j3575k6994M77
$$ -7229 3159 -6757 -8051 -16136 735 -11365 -10553 -23063 9389 17063 3488 -23506 -23029
19720b3029Q890J2412M1250J1171K538j5632m6075k3870K4971N1119m371k5171
$$ -23029 -14139 -1727 39523 50694 53232 37600 -8475 -32345 -7374 43745 39374 14203
19708A4203K592k379m1359n679J8348N606J0026j4711J177j4184L5044Q258j6287
$$ 14203 16795 14416 -26943 -32622 -14274 -8668 1358 -13353 -12176 -26360 8684 16942 655
19695F55j8758l3798J4089O016j4566J9375K613l390R158j0388N792J9989K5377
$$ 655 -18103 -51901 -37812 -31796 -46362 -26987 -24374 -27764 -18606 -28994 -23202 -3213 22164
19682B2164K255j7526M95J0087o538j2368k139J807K869q852j7879K5832K3370
$$ 22164 24419 6893 7388 17475 10937 -1431 -3570 -1763 1106 -7746 -25625 207 23577
19669B3577J866M1733K2776m3200l3914j4958N586r712K297j4591J9116K9804
$$ 23577 25443 67176 89952 46752 12838 -2120 3466 -6246 -3949 -18540 576 30380
19657C0380J174r682q402r070L50K4047K8657j936p23k2402k7802j4676r518M096
$$ 30380 31554 21872 13470 4400 4750 28797 57454 55518 54795 32393 4591 -10085 -19603 -15507
19643a5507L8894K4750m9254l0557K9896R683K3529K2538k3443k9282k1377j7963
$$ -15507 23387 48137 -1117 -31674 -1778 7905 31434 53972 30529 1247 -20130 -38093
19631c8093L000M9823J4881K2098j3072j9896n968L5329J3388m27j2904j5472
$$ -38093 -35093 14730 29611 51709 38637 18741 12773 48102 61490 61063 48159 32687
19619C2687l395N264j4593k7794O707k9201M0772J8484j4241k630Q4k5154k9865
$$ 32687 29292 34556 19963 -7831 -1124 -30325 10447 28931 14690 12060 12144 -13010 -42875
19606d2875j4358L1065K7270K9317k724J78j8454j6762J214j6942j5967o686K6213
$$ -42875 -57233 -26168 1102 30419 27695 27873 9419 -7343 -6129 -23071 -39038 -45724 -19511
19593a9511L9371n850l71K3363O929j6192k916m977k1935q002Q199J7485q712
$$ -19511 19860 14010 13639 37002 43931 27739 24823 19846 -2089 -10091 -1892 15593 6881
19580F881j8411M921J853k9453J7009M0517m149j0218o259j2672L8172J6909k1768
$$ 6881 -11530 -6609 -4756 -34209 -17200 23317 19168 8950 2691 -9981 28191 45100 23332
19567B3332L961L367r766j6648O24K1538K9644P64j1709k1557J0082M128j7499
$$ 23332 27293 30660 20894 4246 4870 26408 56052 56816 45107 23550 33632 37760 20261
19554B0261p462j2306j8092Q834J814l716K3809J2346j7737j8000j0050R251J3986
$$ 20261 12799 493 -17599 -8765 -6951 -10667 13142 25488 7751 -10249 -20299 -11048 2938
19541B938L968J0061J5852J427l562J502j5095P388O159q537K2420K4029J831
$$ 2938 6906 16967 32819 34246 30684 32186 17091 24479 30638 22101 44521 68550 70381
19528G0381Q103J3382r324j5999m7821P076J5673j4947J1380J6085j0909j1147
$$ 70381 78484 91866 82542 66543 18722 25798 41471 26524 37904 53989 43080 31933
19516C1933J9459k7589j2637J7371L686J8305J7259j7948j3768J0788J5438k4437
$$ 31933 51392 23803 11166 28537 32223 50528 67787 49839 36071 46859 62297 37860
19504C7860O179l079m2548k2888M6953J4123J7163N539j0607r392K109R803o041
$$ 37860 44039 40960 -1588 -24476 22477 36600 53763 59302 48695 39303 41412 51215 45174
19491D5174j1662J0423N080o700J4799j4981L5157J4785Q24j1443M6794N4875
$$ 45174 33512 43935 49015 42315 57114 42133 77290 92075 92899 81456 128250 183125
19479A83125K4345o662l2650j9458k0064k4307P037J2715j7756K67K2011N4729
$$ 183125 207470 200808 168158 148700 128636 104329 111366 124081 106325 106592 128603 183332
19467A83332P2624O222m9569m477k8708l4266n095K2393M4148M2404M6349K8168
$$ 183332 255956 262178 212609 208132 179424 145158 140063 162456 206604 249008 295357 323525
19455C23525k785j3218n7933m8636m15L2682L2557J1049O972m6227n6907n868
$$ 323525 320740 307522 249589 200953 200538 233220 265777 276826 283798 237571 180664 174796
19443A74796P342j8366J83M016L4082N3571K3039N2814K1414L6023O651p0259
$$ 174796 182138 163772 163955 167971 202053 255624 278663 331477 352891 388914 395565 325306
19431C25306o3501l9444q683l4114J3797L8580K1676l1870j2866j2538P498L4106
$$ 325306 261805 222361 213678 179564 193361 231941 253617 221747 208881 196343 203841 237947
19419B37947O5840K4444m9869k8036K2402p895n1210j4152j3721q130m210j3262
$$ 237947 303787 328231 278362 250326 272728 264833 213623 199471 185750 177620 173410 160148
19407A60148J2640L8134k6471k8599j0518k4235j7367O97L979J3063M59l1200
$$ 160148 172788 210922 184451 155852 145334 121099 103732 104429 108408 121471 121930 90730
19395I0730r87L661p257L3527K1121J1686m4499j4230K4410K7185q810j1984L925
$$ 90730 89743 93404 86147 119674 140795 152481 107982 93752 118162 145347 136537 124553 128478
19382A28478M01j819l2917k6926j2205K252M37p261N375j3470P431r800j7873
$$ 128478 128879 127060 94143 67217 55012 57264 57701 50440 55815 42345 49776 39976 22103
19369B2103N003L6031P745k1232l16J0740k2221j9137J9365K0842P540J0348N799
$$ 22103 27106 63137 70882 49650 49334 60074 37853 18716 38081 58923 66463 76811 82610
19356H2610N217J274j2516K2420n947k2117J4126M455j2260j296k3153j3231K009
$$ 82610 87827 89101 76585 99005 93058 70941 85067 89522 77262 75966 52813 39582 41591
19343D1591j1075j6973M001R317J2687J3519J8698m151K5330L345m1199j0804
$$ 41591 30516 13543 17544 26861 39548 53067 71765 67614 92944 96289 55090 44286
19331D4286L1452o30m5352j3719M3113R949j506K6356L9764J0863j2143J4798
$$ 44286 75738 75108 29756 16037 59150 69099 67593 93949 133713 144576 132433 147231
19319A47231j1452l1672l5816p085J2187j5578Q574J6591r755k1646k3051K9038
$$ 147231 135779 104107 68291 61206 73393 57815 66389 82980 73225 51579 28528 57566
19307E7566L5868r247j9723o006l9972l121L114j171O13Q073J713l594L977K972
$$ 57566 93434 84187 64464 58458 18486 15365 18479 17308 17921 25994 27707 24113 28090 31062
19293C1062q438J2453Q692J1858J7427n023J9683J7793p329J900J9894j4324k765
$$ 31062 22624 35077 43769 55627 73054 68031 87714 105507 98178 100078 119972 105648 102883
19280A02883J4867P863N3k5917l3150o001k469o151L0429K4658k2045l2014P683
$$ 102883 117750 125613 125666 99749 66599 60598 58129 51978 82407 107065 85020 53006 60689
19267F0689k902K672J2872j3338j8789r572J0224j3434j4809j2547j87J9391K3328
$$ 60689 57787 60459 73331 59993 41204 31632 41856 28422 13613 1066 879 20270 43598
19254D3598K0075m615R747J7029J2878o545J4699l866j5331J8L0311k4572k2890
$$ 43598 63673 59058 68805 85834 98712 92167 106866 103000 87669 87687 117998 93426 70536
19241G0536j6280j5345r830J4423O320M168l14j1357M103J5217J8399j5289j8774
$$ 70536 54256 38911 29081 43504 49824 53992 53678 42321 46424 61641 80040 64751 45977
19228D5977r136O586M9128L3225L9598J1821j1620k409M142P367n157k5589p61
$$ 45977 36841 43427 92555 125780 165378 177199 165579 163170 167312 174679 169522 143933 143172
19215A43172K7746L539l4460J1305J6253q585l0395l0077J7063K0631K102m53
$$ 143172 170918 174457 139997 151302 167555 158970 128575 98498 115561 136192 138294 137841
19203A37841j0260O547K0911m922j9288j2115L17J991K4569J6682l0085l5096
$$ 137841 127581 134128 155039 150117 130829 118714 119031 121022 145591 162273 132188 97092
19191I7092k2924J3573K4772p33j2347o444k5227k2494K4809J6847J234K2572
$$ 97092 74168 87741 112513 111780 99433 92989 67762 45268 70077 86924 88158 110730
19179A10730J2740K0572L015j1294J1318r911j1099K055J2031r827m154J5199
$$ 110730 123470 144042 147057 135763 147081 137170 126071 128126 140157 130330 126176 141375
19167A41375R737R86p760n2024J821J4915j0058K5724J0212P020J8269l40j617
$$ 141375 151112 152098 144338 92314 94135 109050 98992 124716 134928 141948 160217 159877 158260
19154A58260p125j9348j5258p092N023M11m209j4961M495R492r228k4654L96L598
$$ 158260 151135 131787 116529 109437 114460 114871 110662 95701 100196 109688 100460 75806 76202 79800
19140G9800K1479K0902k3010K2598K252j1595L663L397J0327J3927j4294R84k65
$$ 79800 101279 122181 99171 121769 124021 112426 116089 119486 129813 143740 129446 130430 130165
19127A30165l0127M898L485k4502j3632K0096K2091M098j3460j5368j6357L587
$$ 130165 100038 104936 108421 83919 70287 90383 112474 116572 103112 87744 71387 74974
19115G4974j711l4967p62J1050N637K053R578J926J5017L3849J1005k3804O59
$$ 74974 73263 38296 37534 48584 54221 56274 65852 67778 82795 116644 127649 103845 104504
19102A04504J1757n992M382n913K0023O764j9963k8567j3987n051j4709M13J7836
$$ 104504 116261 110269 114651 108738 128761 135525 115562 86995 73008 67957 53248 53661 71497
19089G1497L1772K2388L96o369J8590L4211K7149R545k9085l7786N289Q10L2391
$$ 71497 103269 125657 126053 119684 138274 172485 199634 209179 180094 142308 147597 148407 180798
19076A80798L031l379N516P470k6251K8894J6222M226j4091n872j0054q224K2820
$$ 180798 183829 180450 185966 193436 167185 196079 212301 216527 202436 196564 186510 178286 201106
19063B01106K0966K749k1669M843J2127l1401k0712o114l146k739j165L1712M5543
$$ 201106 222072 224821 203152 207995 220122 188721 168009 161895 158749 156010 154845 186557 232100
19050B32100K4135K4729J041l751P89j6063j5245k8704J8367j8556j9429L6896
$$ 232100 256235 280964 282005 278254 279043 262980 247735 219031 237398 218842 199413 236309
19038B36309K1461j443j5658M7010L0029P761K2969K2150J38L135Q140K0282J2695
$$ 236309 257770 256327 240669 287679 317708 325469 348438 370588 370726 373861 382001 402283 414978
19025D14978k2532J1868O0292O9476N3179K6078N3287R1673O8324K9683K0272
$$ 414978 392446 404314 464606 534082 587261 613339 666626 758299 826623 856306 876578
19014H76578K7501O7951K8657l1365m0851k168N5109J01675J46074J04223Q8826
$$ 876578 904079 972030 1000687 969322 928471 926303 981412 1083087 1229161 1333384 1422210
19003A422210J36284K59777L32741L10133J20427j83880k38492j03045J7487N9823
$$ 1422210 1558494 1818271 2151012 2461145 2581572 2397692 2159200 2056155 2073642 2133465
18993B133465l4216o5306J3835R2526J75970K46632L82657N85217P95166R92187
$$ 2133465 2099249 2033943 2047778 2140304 2316274 2562906 2945563 3530780 4325946 5318133
18983E318133R39630N85675L00690L10679K25992k9862J48798P66236J374805
$$ 5318133 6257763 6843438 7144128 7454807 7680799 7650937 7799735 8565971 9940776
18974I940776J889163K486178L421710M736067N947266P365841P876023L595572
$$ 9940776 11829939 14316117 17737827 22473894 28421160 35787001 43663024 47258596
18966D7258596m643702p773479m446844l32697K108854J416148k153922m244179
$$ 47258596 42614894 34841415 30394571 30061874 32170728 33586876 31432954 27188775
18958B7188775k854504o16726J432092K950477K947562Q38563j448435j039824
$$ 27188775 24334271 23717545 25149637 28100114 31047676 31886239 30437804 29397980
18950B9397980J402689L844095M501523K387506j202624l458780k422617J337986
$$ 29397980 30800669 34644764 39146287 41533793 40331169 36872389 34449772 35787758
18942C5787758N419841P902458O495980J658386j909219m847884p955433q164500
$$ 35787758 41207599 49110057 55606037 57264423 55355204 50507320 42551887 34387387
18934C4387387n789290l546866k091856j133247j14390P99321J014177J89234
$$ 34387387 28598097 25051231 22959375 21826128 21711738 22511059 23525236 23714470
18926B3714470o58360o7340J532067L714838O517666R291413J0475077Q462080
$$ 23714470 23056110 22988770 24520837 28235675 34753341 44044754 54519831 62981911
18918F2981911L049637k990652n805379p691685r441936p538725m250210j518058
$$ 62981911 66031548 63040896 57235517 49543832 40101896 32563171 28312961 26794903
18910B6794903R16918L874069P768740J1612576J1482799L559126p235854j0808487
$$ 26794903 27711821 31585890 39354630 50967206 62450005 66009131 58773277 47964790
18902D7964790r022741o717491n015515l623429k558040k344526k612488k170258
$$ 47964790 38942049 32224558 27209043 23585614 21027574 18683048 16070560 13900302
18894A3900302j397871r32452p06155o22539n79932n19009l93916j40124K22653
$$ 13900302 12502431 11569979 10863824 10241285 9661353 9142344 8748428 8608304 8830957
18885H830957N60161L03977n56828j214966j081405o45930k68074k804J28481
$$ 8830957 9391118 9695095 9138267 7923301 6841896 6195966 5927892 5925088 6053569
18876F053569q9143n29082p40603o14215l62307n5361L6054k3436k31658m28010
$$ 6053569 5964426 5435344 4694741 4080526 3718219 3662858 3698912 3675476 3443818 3015808
18866C015808m24493l31735k25912j28563n0251j1653p029o5990j27697j62977
$$ 3015808 2591315 2259580 2033668 1905105 1854854 1843201 1836172 1770182 1642485 1479508
18856A479508j79885r8957j12169q5388p9917q0870p0288n0179l4229l9295K0148
$$ 1479508 1299623 1200666 1088497 1003109 923192 842322 772034 721855 687626 648331 668479
18845F68479l428P978Q93R574j8523j5769k2594m3711n3604n7959j6351j6271
$$ 668479 665051 673029 673922 683496 664973 649204 626610 582899 529295 471336 454985 438714
18833D38714j7237k2105l3516j4536J9578K4046m953L3361q639m934N789L194
$$ 438714 421477 399372 365856 351320 370898 394944 389991 423352 414713 409779 415568 418762
18821D18762J2054N722j4653l533k3413p933O494j1437J2343J5188Q03k9324j6045
$$ 418762 430816 436538 421885 418352 394939 387006 393500 382063 394406 409594 410397 381073 365028
18808C65028l092k8637k2481m0277j8513Q66K9716K5038J1681k1689j4099J7566
$$ 365028 361936 333299 310818 270541 252028 252894 282610 307648 319329 297640 283541 301107
18796C01107O549J5521M454q422l328J3400K0963R83m1390k5849J0887J9606k262
$$ 301107 307656 323177 327631 319209 315881 329281 350244 351227 309837 283988 294875 314481 312219
18783C12219k5393q196J4428L711J8725M3408j2454q615n496j7261o212k5422
$$ 312219 286826 278630 293058 296769 315494 358902 346448 337833 332337 315076 308864 283442
18771B83442l9670l9180P779K2179O9760P0348O5072P3745N3027p4901j14591
$$ 283442 243772 204592 212371 234550 304310 374658 439730 513475 566502 491601 377010
18760C77010j5631k6954n0789k8981J2575Q97n451l2577m809j281r055J144p573
$$ 377010 361379 334425 283636 254655 267230 268127 262676 230099 225290 224009 214954 216098 208525
18747B08525k6753J1361K457p372l417J743R941N903J0499L3006j2476j2907n896
$$ 208525 181772 193133 195590 188218 184801 186544 196485 202388 212887 245893 233417 220510 214614
18734B14614k223k1450n767j5989J3249R554J3975K3025Q249J5278l6467j4011
$$ 214614 212391 190941 185174 169185 182434 191988 205963 228988 237237 252515 216048 202037
18722B02037N151q933J300J8716m949p001j002R251K5493R258k1790n435m136
$$ 202037 207188 198255 199555 218271 213322 206321 205319 214570 240063 249321 227531 222096 217960
18709B17960k3850M22l67J5853j3768j8582L0313n933J1020J1405J336k6463k8404
$$ 217960 194110 194532 194165 210018 196250 177668 207981 202048 213068 224473 225809 199346 170942
18696A70942R151J2242J4090l099J9208j8602j0399L5863J8076J8115j2768J295
$$ 170942 180093 192335 206425 203326 222534 203932 193533 229396 247472 265587 252819 254114
18684B54114j1496p269J8878J3205l9293l4266P69q692k5962M3220K7240O09k5524
$$ 254114 242618 235349 254227 267432 228139 193873 194642 185950 159988 203208 230448 231057 205533
18671B05533j3202J7780K3027R163l929j2567k8974q616O22J5073l0827j2017
$$ 205533 192331 210111 233138 242301 238372 225805 196831 188215 188837 203910 173083 161066
18659A61066P868J4892l8266L413J1899O72o061K2835j4106M835j232L562J2580
$$ 161066 168934 183826 145560 148973 160872 161544 155483 178318 164212 169047 167815 171377 183957
18646A83957j2614L4237J7570j9378l049K1469j8790j8916K3281J5198L541o015
$$ 183957 171343 205580 223150 203772 200723 222192 203402 184486 207767 222965 226506 220491
18634B20491O413l2818j8069J431P879J9099J2499L964o893j8983l3122l9206
$$ 220491 226904 194086 176017 177448 185327 204426 216925 220889 213996 195013 161891 122685
18622A22685J8358J8403n41k3071J4035J0480J0217R205n230j4487m33J029j2152
$$ 122685 141043 159446 158905 135834 149869 160349 170566 179771 174541 160054 159621 160650 148498
18609A48498k2350j7099J9197M7183O2418J838l874m262n894N393K7341J6981
$$ 148498 126148 109049 128246 175429 237847 239685 235811 231549 225655 231048 258389 275370
18597B75370P980j5733l0164j1880K9724K4032o9m933p101k2003J9304Q124K7448
$$ 275370 283350 267617 237453 225573 255297 279329 279260 274327 267226 245223 264527 272651 300099
18584C00099n846l8750J0235O935k273J1172K4310j5632J644J7691J0507L3044
$$ 300099 294253 255503 265738 272673 270400 281572 305882 290250 291894 309585 320092 353136
18572C53136J2247Q410K1249J0332r564J6371J6049K743L9384Q675N662J2367
$$ 353136 365383 373793 395042 405374 395810 412181 428230 430973 470357 479032 484694 497061
18560D97061L9982O7341M061j6787m0801m6487K309k853n088L9002L3218m542
$$ 497061 537043 604384 608445 591658 550857 504370 506679 503826 498738 537740 570958 566416
18548E66416l6621J732K2194l669l17j4910k2125L8410K2548N1932N2347N5166
$$ 566416 529795 531527 553721 550052 549735 534825 512700 551110 573658 625590 677937 733103
18536G33103N1509Q5797R9285J00606J42515J98615J01322K5041K8402N6553J73123
$$ 733103 784612 870409 969694 1070300 1212815 1411430 1512752 1537793 1566195 1622748 1795871
18525A795871L42607O10699R55601J115334O38325l80714p34979l26705J40365
$$ 1795871 2138478 2749177 3704778 4820112 5458437 5077723 4342744 4016039 4156404
18516D156404M26094L76198j26741n10154k63004J64833L91320J84148m50604
$$ 4156404 4582498 4958696 4831955 4321801 4058797 4223630 4614950 4799098 4348494
18507D348494p25348m35475k57329j77175q5416j5112L7218M9359J21317K12553
$$ 4348494 3623146 3187671 2930342 2753167 2667751 2652639 2689857 2739216 2860533 3073086
18497C073086L15743M09414O19857R70725J295805J203501P05875Q45212K083418
$$ 3073086 3388829 3798243 4418100 5388825 6684630 7888131 8594006 9439218 11522636
18488A1522636L680237M493319K661508j826539m125597k919019j386884m94642
$$ 11522636 15202873 19696192 22357700 20531161 16405564 13486545 12099661 11605019
18480A1605019R9915P99985J397367J180960q8118p62369J45969J168645J371132
$$ 11605019 11704934 12504919 13902286 15083246 14995128 14232759 14378728 15547373 16918505
18471A6918505N56643k33509N28877K164568L884572N755824P983673J0454152
$$ 16918505 17475148 17241639 17770516 19935084 23819656 29575480 37559153 48013305
18463D8013305J0140246N594018K477953R04497m449930q242294n202764m03795
$$ 48013305 58153551 63747569 66225522 67130019 62680089 54437795 49235031 48831236
18455D8831236K095064R87826k68041L026101Q181966J0329869N301527n000373
$$ 48831236 50926300 51914126 51646085 54672186 62854152 73184021 78485548 73485175
18447G3485175j1346258j1025253p514313m669086l597457l285806k348216j058098
$$ 73485175 62138917 51113664 43599351 38930265 35332808 32047002 29698786 28640688
18439B8640688K50610J838697M001617O960509J0660787J4051787J5326234J3103159
$$ 28640688 28891298 30729995 34731612 41692121 52352908 66404695 81730929 94834088
18431I4834088R234333P150026K956696n208821j2566254j6092406j3625867q050617
$$ 94834088 104068421 111218447 114175143 108966322 96400068 80307662 66681795 58631178
18423E8631178k983349J554J402459M634963J2057553K1068495K3836698Q715961
$$ 58631178 55647829 55649383 57051842 61686805 73744358 94812853 118649551 127365512
18415A27365512j8794541k4374923j3874161p370528o560073q022765q066463
$$ 127365512 108570971 84196048 70321887 62951359 56391286 48368521 40302058
18408D0302058o385555m456348k885268j597770n62075J66504L55572m68078k215796
$$ 40302058 33916503 29460155 26574887 24977117 24415042 24581546 24937118 24469040 22253244
18399B2253244k860050k004588j007893k20637J69586k19524j003612r49632k32981
$$ 22253244 19393194 17388606 16380713 16160076 16329662 16110138 15106526 14156894 13923913
18390A3923913r1408q76750j543800j587109j424442j146379r14636p18591n39434
$$ 13923913 13832505 12955755 11411955 9824846 8400404 7254025 6339389 5620798 5081364
18381E081364l94832l30359l01898k88912k71142k53967k13070j75967j78740
$$ 5081364 4686532 4356173 4054275 3765363 3494221 3240254 3027184 2851217 2672477
18372B672477j22264r9576l8713K3656J69181K57462L10039R5500k88743m41061
$$ 2672477 2550213 2450637 2411924 2435580 2604761 2862223 3172262 3267762 2979019 2537958
18362B537958l47650k10784j29432q0988o5864m6835m192Q6459J60378J47008
$$ 2537958 2190308 1979524 1850092 1769104 1703240 1656405 1652213 1738672 1899050 2046058
18352B046058j059j83930k60099j60254q7127o2700q5184r3734l8419J5890p732
$$ 2046058 2044999 1861069 1600970 1440716 1353589 1290889 1205705 1111971 1073552 1089442 1081710
18341A081710n3038m8106j9122m4148m1083m672j9792m0036l1696p123r530m1686
$$ 1081710 1028672 980566 961444 917296 876213 871541 851749 811713 780017 772894 763364 721678
18329G21678l9437j3400m816m343J8952o725j066J4354m0851k7826m2809j2411
$$ 721678 682241 668841 664025 659682 678634 671909 670843 685197 644346 616520 573711 561300
18317E61300m2100k0290k015k4638N811j8552j969K8115K0035J4293q756M3227
$$ 561300 519200 498910 496895 472257 478068 459516 457547 485662 505697 519990 511234 554461
18305E54461L4785K0956K8869j8416m3950k6173j7547k0717j6379J2937J6466
$$ 554461 589246 610202 639071 620655 576705 550532 532985 512268 495889 508826 525292
18294E25292M0383K8374O850k9947j4264l156j3506m6275k2559j5827j5374l323
$$ 525292 565675 594049 600899 570952 556688 553532 540026 493751 471192 455365 439991 436668
18282D36668m691j1525p164l1538k4580P603j3033q170M470P489L226K768J9201
$$ 436668 431977 420452 413288 381750 357170 364773 351740 343570 348040 355529 358755 361523 380724
18269C80724n472J2300k3355l322l316M182k30J0678p004l7300K4299J6242L292
$$ 380724 375252 387552 364197 360875 357559 361741 361511 372189 365185 327885 352184 368426 371718
18256C71718j6377k355j6771j1717j4733o251J8915J9089K326o548j8978p535
$$ 371718 355341 352986 336215 324498 309765 303514 322429 341518 343844 337296 318318 310783
18244C10783N864J5831p305j8815p161j1256J2859j042J6524K1812j8765l0485
$$ 310783 316647 332478 325173 306358 299197 287941 300800 299758 316282 338094 319329 288844
18232B88844l1654l1472k435j8629R491o875j2542K0667K0187K1941j2497j2318
$$ 288844 257190 225718 223283 204654 214145 207270 194728 215395 235582 257523 245026 232708
18220B32708J7548k0104j8910p811O261m394J6071L580k0863P871M752K837j1988
$$ 232708 250256 230152 211242 203431 209692 205298 221369 224949 204086 211957 216709 219546 207558
18207B07558k3680P151J0571j9084k2288l80O951j3583J4395J942j8982K2722
$$ 207558 183878 191029 201600 182516 160228 159848 166799 153216 167611 169553 150571 173293
18195A73293j0952l722L190P503L166J282j067P130k0630L96O871J4806P628k1081
$$ 173293 162341 158619 161809 169312 172478 173760 172693 179823 159193 159589 166460 181266 188894 167813
18181A67813m6887k0522J5897R484J6995J2171L5160K568l3900j4185J0204J2852
$$ 167813 120926 100404 116301 125785 142780 154951 190111 192679 158779 144594 154798 167650
18169A67650Q972j3922j9653J5672l520M1655K3522L640J821j4686n322J2286
$$ 167650 176622 162700 143047 158719 155199 196854 220376 224016 225837 211151 205829 218115
18157B18115l668p1o621K9419M902j4751l0840N594L497M523J7369k9524l36R240
$$ 218115 214447 214376 207755 237174 242076 227325 196485 202079 205576 210099 227468 197944 197608 206848
18143B06848k817J1430Q672K3118r509r932j3442q905J2319L6885O9299N4251
$$ 206848 204031 215461 224133 247251 237742 227810 214368 205463 217782 254667 323966 378217
18131C78217Q210j768K7600m327K558k772N7819Q0298K2439M6779Q9793J13174
$$ 378217 386427 384659 412259 407932 410490 407718 465537 545835 568274 615053 704846 818020
18119H18020P8830J47283K53538K66096L23638M01503O02205R50322J514052K525008
$$ 818020 896850 1044133 1297671 1563767 1887405 2288908 2891113 3841435 5355487 7880495
18109G880495M473043Q120896J3495880J6546054Q328451j1493091j6939331r889604
$$ 7880495 12353538 20474434 33970314 50516368 58844819 47351728 30412397 20522793
18101B0522793n348046l206532k210536j602552j164486p71281n00369l04853
$$ 20522793 15174747 11968215 9757679 8155127 6990641 6219360 5718991 5414138
18093E414138j90044k77148m27540m98666n19416m37422l83678l53776k72232
$$ 5414138 5224094 4946946 4519406 4020740 3501324 3063902 2680224 2326448 2054216
18084B054216k34998k04425j74349j36827p2593j00465j11616p1967p7156p6690
$$ 2054216 1819218 1614793 1440444 1303617 1231024 1130559 1018943 946976 869820 793130
18074G93130l0249p7303n7109p1622m4900l7906L119k4842m7695k1077m3463l3470
$$ 793130 762881 685578 628469 556847 511947 474041 477160 452318 404623 383546 340083 306613
18062C06613l717k1459k8373j1697O714J2070J183q157k1296o631Q38J5389k7114
$$ 306613 302896 281437 253064 241367 248081 260151 261334 253177 231881 225250 226088 241477 214363
18049B14363j7270m053k2042m990m9426m059J9333R503R142m0610j8813J9863
$$ 214363 197093 193040 170998 166008 116582 112523 131856 141359 150501 109891 91078 110941
18037A10941K9947L3228k1483o071j4439j0256J1571L031P271J0455N892J5511
$$ 110941 140888 174116 152633 146562 132123 121867 133438 136469 143740 154195 160087 175598
18025A75598P572j0174q4R053k868m9067l2928J5326J4714j4739l3537j2863l581
$$ 175598 183170 172996 172912 181965 179097 130030 97102 112428 127142 112403 78866 66003 62422
18012F2422n683j736L7401J5103k7306j4833K975O390M442J4058R716j2882o419
$$ 62422 56739 55003 92404 107507 80201 65368 68343 74733 79175 93233 102949 90067 83648
17999H3648N242J5800J430N733K5849K0437j115m956R975L2563M0167N340q171
$$ 83648 88890 104690 106120 111853 137702 158139 157024 152068 162043 194606 234773 240113 231942
17986B31942q659J3527r347k2383j81K4143N729o967J0397j6588o833k594n473
$$ 231942 223283 236810 227463 205080 204899 229042 234771 227804 238201 221613 214780 212186 206713
17973B06713J5544k5878q907k1500k4162J4814O9331L2052l861j1177N829L3010
$$ 206713 222257 196379 187472 165972 141810 156624 225955 258007 254146 242969 248798 281808
17961B81808j1154q136J5470o096K3255L2198K2183P264k4181K0308j3390k8632
$$ 281808 270654 262518 277988 271892 295147 327345 349528 356792 332611 352919 339529 310897
17949C10897j5403J0247j5536l2052j8127K0243j5288k1833K9374J9297K3326
$$ 310897 295494 305741 290205 258153 240026 260269 244981 223148 252522 271819 295145
17938B95145K1050R365O3150N0134M0263J4871m2429l4058l3905m9597m8662n3563
$$ 295145 316195 325560 388710 438844 479107 493978 451549 417491 383586 333989 285327 231764
17926B31764j4434r945j7113m797j9402N808J4522M541K4284M9788L1265L5554
$$ 231764 217330 207385 190272 185475 166073 171881 186403 190944 215228 265016 296281 331835
17914C31835J9281j8579j8210K6661L0006j1839l7922j6311L4858O3040J9632
$$ 331835 351116 332537 314327 340988 370994 359155 321233 304922 339780 402820 422452
17903D22452j9779k6732l1052m1328n492j6094k223j1120l044K7973o314k9057
$$ 422452 402673 375941 344889 303561 298069 281975 279752 268632 265588 293561 287247 258190
17891B58190m4909j2795m3386k2715j6834k5110J1882j209o297k1525j1499L4284
$$ 258190 213281 200486 157100 134385 117551 92441 104323 103114 96817 75292 63793 98077
17879I8077N3003M1375k6255m3545j8738j1369J7927K068m9045l8521L892K1739
$$ 98077 151080 192455 166200 122655 103917 92548 110475 112543 63498 24977 28869 50608
17867E0608K9879J434j3061J3229K2493L1834j6675l1184j8883O660L4344O959
$$ 50608 80487 81921 68860 82089 104582 136416 119741 88557 69674 76334 110678 117637
17855A17637L1886Q140k747l5113k3539j3313q853j5392l688q213j8144j2954
$$ 117637 149523 157663 154916 119803 96264 82951 74098 58706 55018 46805 28661 15707
17843A5707J9073N201k6102q569K0166M0263j000Q7j8273k6797j1023J662Q041
$$ 15707 34780 39981 13879 5310 25476 65739 64739 64826 46553 19756 8733 10395 18436
17830A8436r40K7346O336j2659m96l0761k1386Q306J0626j6603K903K4711K6011
$$ 18436 17496 44842 51178 38519 38023 7262 -14124 -5818 4808 -11795 -8892 15819 41830
17817D1830R605j643j2389J4709j0217j5365K3341j4429l6159j7543J1256K1474
$$ 41830 51435 49792 37403 52112 41895 26530 49871 35442 -717 -18260 -7004 14470
17805A4470L0597l235m4749J8107R972J1872k2425J3848K995p161m906j090j8017
$$ 14470 45067 41832 -2917 15190 25162 37034 14609 28457 31452 24291 19385 18295 278
17792B78j6824j3551J2159N9565L1175j4499o377l1051j4249L4515J6663K8601
$$ 278 -16546 -30097 -17938 41627 72802 58303 51926 20875 6626 41141 57804 86405
17780H6405Q420L545J4154k9488j1751K886k131j9937j5231J7710K2057J6595
$$ 86405 94825 98370 112524 83036 71285 74171 72040 52103 36872 54582 76639 93234
17768I3234J2967M0951P466l8631j9942K3851k1658j7735r402l2359R511j2080
$$ 93234 106201 147152 154618 115987 96045 119896 98238 80503 71101 38742 48253 36173
17756C6173J3489k3656j1192k2060K3112J0566J9621q048j4300j4083J4884K817
$$ 36173 49662 26006 14814 -7246 15866 26432 46053 38005 23705 9622 24506 27323
17744B7323r293K5111J7992J0195k5476p196J7586k2484k0113M408j566J5171
$$ 27323 18030 43141 61133 71328 45852 38656 56242 33758 13645 18053 16487 31658
17732C1658k591J2087J5368k573m0462j3793n910j1796N472Q974L4683r190J4953
$$ 31658 29067 41154 56522 53949 13487 -306 -6216 -18012 -12540 -3566 31117 21927 36880
17719C6880j4690k1998n610k2997K3613j200j8397J853j8997L1821j0216o364
$$ 36880 22190 192 -5418 -28415 -4802 -6002 -24399 -22546 -41543 -9722 -19938 -26302
17707b6302j4756J3423J8105K0051O844R245K641L55J9111J5144J449J8180m414
$$ -26302 -41058 -27635 -9530 10521 17365 26610 29251 29606 48717 63861 65310 83490 79076
17694G9076j2500K9849R3746J35501R9195R9046J23012R4184m617p0940j19979
$$ 79076 66576 96425 190171 325672 424867 523913 646925 741109 736492 665552 545573
17683E45573j25101o6996n1696m8464m5114m2457j6268j36r306j4121l956R377
$$ 545573 420472 353476 301780 253316 208202 165745 149477 149341 140035 125914 121958 131335
17671A31335l386l2478k3620j4707O77o106k2137J105p969m386k781O825p70K2947
$$ 131335 127949 95471 71851 57144 57821 51715 29578 30683 22714 18328 15547 22372 21602 44549
17657D4549n010l3313M793K2706j6079l63J9346l908J2839K499j3898M968N555
$$ 44549 39539 6226 11019 33725 17646 17283 36629 32721 45560 48059 34161 39129 44684
17644D4684j7278q703l3788L967J6475n185k1141J0026L382K824R798J8846o457
$$ 44684 27406 18703 -15085 -11118 5357 172 -20969 -10943 -7561 -4737 5061 23907 17450
17631A7450k2520J1564L7161k733j2785k3786j3027J5279N354P695l498n195K511
$$ 17450 -5070 6494 43655 40922 28137 4351 -8676 6603 11957 19652 16154 10959 13470
17618A3470K6328l563k4700j6450p261J5187J5972R366M4106m039l4192L1984
$$ 13470 39798 36235 11535 -4915 -12176 3011 18983 28349 72455 68416 34224 66208
17606F6208J0379l4985o278k1174l0445K5933K4422J4542p892m8629k2620N534
$$ 66208 76587 41602 35324 14150 -16295 9638 34060 48602 40710 -7919 -30539 -25005
17594b5005J855J4479J96K602j5957J2104J4664L3274j57l1401l449k3602k1139
$$ -25005 -23150 -8671 -8475 -5873 -21830 -9726 4938 38212 38055 6654 3205 -20397 -41536
17581d1536J2756M989K1982J7317j4441J0742L168q926J6166j4442k37j8752j5636
$$ -41536 -28780 -23791 -1809 15508 1067 11809 14977 6051 22217 7775 7538 -11214 -26850
17568b6850K1458K0454J5308K8319J0564m6543m8526K4818K6838L22p816k3746
$$ -26850 -5392 15062 30370 58689 69253 22710 -25816 -998 25840 26162 18346 -5400
17556e400K5376J777j2542r408J3599K2598l3237q902O686J1335j8583J442K1711
$$ -5400 19976 21753 9211 -197 13402 36000 2763 -6139 547 11882 -6701 -5259 16452
17543A6452R459k5703l530J0323p197l093p260Q290J210J3805K8829J6007L474
$$ 16452 25911 208 -3322 7001 -196 -3289 -10549 -2259 -1049 12756 41585 57592 61066
17530F1066L8007L0004J0472j9991k2985o579j0694k7934j4389j3277K3015J9739
$$ 61066 99073 129077 139549 119558 96573 89994 79300 51366 36977 23700 46715 66454
17518F6454k654Q601n018l0143j8681l2625J8030M0328Q096j8458l7305j1952
$$ 66454 63800 72401 67383 37240 18559 -14066 3964 44292 52388 33930 -3375 -15327
17506a5327K9297J4388j9640k8505K257J4379K6265P06L114p945k1896k926K0537
$$ -15327 13970 28358 8718 -19787 -17530 -3151 23114 23820 26934 18989 -2907 -5833 14704
17493A4704K1313J7210m093L373k8333N049q453j2319J139L813j8869k0119J6983
$$ 14704 36017 53227 49134 52507 24174 29223 20770 8451 9590 13403 -5466 -25585 -8602
17480h602K3017J5853J0847J6752m29m2845n082K1768K5594l779o210k214j6332
$$ -8602 14415 30268 41115 57867 57438 14593 9511 31279 56873 53094 46884 44670 28338
17467B8338J5389J4965j5320j4403J2359j0604n4749k5881L6086L7381O797q023
$$ 28338 43727 58692 43372 28969 41328 30724 -24025 -49906 -13820 23561 30358 22335
17455B2335j1197l5097J2633o643J4488Q544P899M409J4872L0641J2712K9800
$$ 22335 11138 -23959 -11326 -17969 -3481 5063 12962 17371 32243 62884 75596 105396
17443A05396j668P699N5319Q7804P6106l9196p5110n1516n6876n3813k0710Q219
$$ 105396 103728 111427 166746 254550 330656 291460 216350 164834 107958 54145 33435 41654
17431D1654r392j3214R733K7847q390j0427K0900k9265l9625L4008J5630K715
$$ 41654 32262 19048 28781 56628 48238 37811 58711 29446 -10179 23829 39459 42174
17419D2174k7347j3819J1591J1202J0785K6115L602r13j3945m571k306K653p660
$$ 42174 14827 1008 12599 23801 34586 60701 64303 63390 49445 44874 42568 45221 37561
17406C7561j7888l172p659j1926j7830r559J6156K0321q724K3733o438m0481Q469
$$ 37561 19673 16501 8842 -3084 -20914 -30473 -14317 6004 -2720 21013 14575 -25906 -17437
17393a7437J8316k2251j6862J7459J1270Q279q650m961L8564L2567k0397j5081
$$ -17437 879 -21372 -38234 -20775 -9505 -1226 -9876 -14837 23727 56294 35897 20816
17381B0816J5932k547j5917n702j5812o670J2411M0180L0930J822M1840q586j0504
$$ 20816 36748 34201 18284 12582 -3230 -9900 2511 42691 73621 75443 117283 108697 98193
17368I8193L9926q699j3314m6155L519K128m772k3243j5578k8652r15P479J8016
$$ 98193 138119 129420 116106 69951 73470 75598 70826 47583 32005 3353 2438 9917 27933
17355B7933J1927m745n487p3m996k0627N82p167P482K0842j2848j3679j5225K2950
$$ 27933 39860 35115 29628 29555 24559 3932 4514 -2653 4829 25671 12823 -856 -16081 6869
17341F869O286M46R52J9216P430j067J9134K266j9657L490j2437Q64P281m115
$$ 6869 13155 13601 14553 33769 41199 40132 59266 61532 41875 45365 32928 33792 41073 36958
17327C6958o111J5891l0904j5999N749K7280J086j6920n625p045k5538l8104m658
$$ 36958 30847 46738 15834 -165 5584 32864 33950 17030 11405 4360 -21178 -59282 -63940
17314f3940K4948K0694J9061P656M201J5091j214j3197n0483M037Q747M6678M9204
$$ -63940 -38992 -18298 763 8419 12620 27711 26497 13300 -37183 -33146 -24399 22279 71483
17301G1483m886l2345j8493k4107j0017R882N033j3336o491M3915L7027o090l1637
$$ 71483 66597 34252 15759 -8348 -18365 -8483 -3450 -16786 -23277 20638 57665 51575 19938
17288A9938k3314J7918L7523J2048N305J820j633J8350J9933j9668l2526J165
$$ 19938 -3376 14542 52065 64113 69418 71238 69605 87955 107888 88220 55694 56859
17276E6859j5797J1026J2449J5593K1548O221k5171k7696k5290Q409J8224k5877
$$ 56859 41062 52088 64537 80130 101678 107899 82728 55032 29742 38151 56375 30498
17264C0498J674j3659k3057J7975P8170P158p166k2285j0985K6836K7295j9257
$$ 30498 32172 18513 -4544 13431 91601 98759 91593 69308 58323 85159 112454 93197
17252I3197k4928R920M285R793O902n0063k1891J0411M13L452J5092k1361l5169
$$ 93197 68269 78189 82474 92267 99169 49106 27215 37626 38039 41491 56583 35222 53
17239E3L726j1966k918R779J084K7280r386P415P432L894j4854P730K1604J0293
$$ 53 3779 -8187 -11105 -1326 -242 27038 17652 25067 32499 36393 21539 29269 50873 61166
17225F1166j5411k640L723J3283L1352R77j4636j4425R912L193J5379j471N944
$$ 61166 45755 43115 46838 60121 91473 92450 77814 63389 73301 76494 91873 90402 96346
17212I6346k5618l1660k48Q080P042J0158M5217K9662R423j9721M69j2586n696
$$ 96346 70728 39068 38820 46900 53942 64100 109317 138979 148402 128681 129150 116564 110868
17199A10868M545j7728l7035j139L6175J8559j6898j4275k4211O690k8247l974
$$ 110868 115413 97685 60650 59511 95686 114245 97347 83072 58861 65551 37304 33330
17187C3330K7686L4361j9246j1374j0399J3089j4278j7869K8853K3365J2950K4149
$$ 33330 61016 95377 76131 64757 54358 67447 53169 35300 64153 87518 100468 124617
17175A24617K8019k3180k0431O413J6182L615r073N5516O1629R054M672L4597
$$ 124617 152636 129456 109025 115438 131620 135235 126162 181678 243307 252361 257033 291630
17163B91630L3627J1624K0903r578j3755l495J5335O023j944L0782K7219L2463
$$ 291630 325257 336881 357784 348206 334451 330956 346291 352314 350370 381152 408371 440834
17151D40834L8506M9089P8996J13975J57365J84535J93392J87904J42168M0589
$$ 440834 479340 528429 607425 721400 878765 1063300 1256692 1444596 1586764 1627353
17141A627353l3106o1923j2543L1619P6753P9535J09357J71986J93601K44648
$$ 1627353 1594247 1532324 1519781 1551400 1628153 1707688 1817045 1989031 2182632 2427280
17131B427280L80433N42779O75496P15495O95415Q43962J225127J676521K305106
$$ 2427280 2807713 3350492 4025988 4741483 5436898 6280860 7505987 9182508 11487614
17122A1487614L677748O264791J0692002J7349265K5021357K9593983K6718271
$$ 11487614 15165362 21430153 32122155 49471420 74492777 104086760 130805031
17115A30805031J6247012j620366j9064924k5429011k5575611k0214726j3129161
$$ 130805031 147052043 145431677 126366753 100937742 75362131 55147405 42018244
17108D2018244q329305n511215l778719k565457j750095j279610j103373j143179
$$ 42018244 33688939 28177724 24399005 21833548 20083453 18803843 17700470 16557291
17100A6557291j301657j469174j572327j514570j389787j211589r84474q27847
$$ 16557291 15255634 13786460 12214133 10699563 9309776 8098187 7113713 6285866
17092F285866o77794n70810m85552m25921k88426j56130j01114q1729j25554j94711
$$ 6285866 5608072 5037262 4551710 4125789 3837363 3681233 3580119 3498390 3372836 3178125
17082C178125k87299l20246l18750k73502j75834j14728j21129j30560j20209
$$ 3178125 2890826 2570580 2251830 1978328 1802494 1687766 1566637 1436077 1315868
17073A315868j12869r6828j14024j16618j07423p4811q4353n0997k9800k3895
$$ 1315868 1202999 1106171 992147 875529 768106 693295 608942 557945 528145 504250
17063E04250m7804n6026k7432k1154L582L0366m582j6666N688M361N560M8126
$$ 504250 456446 400420 372988 351834 355416 385782 381200 364534 370222 374583 380143 428269
17051D28269J7572j5759k0579o2448m0955l2148j1686j133o484J9147k0189j7532
$$ 428269 445841 430082 409503 347055 306100 273952 262266 261133 254649 273796 253607 236075
17039B36075m147l38k0106j2677j2310R375O422j8075l0971K0908K0690L218m943
$$ 236075 231928 231590 211484 198807 186497 195872 202294 184219 153248 174156 194846 198064 193121
17026A93121m89j7597K6685N649k8157l2107J129J4803M766l5892k3448J1531
$$ 193121 192632 175035 201720 207369 179212 147105 148234 163037 167803 131911 108463 119994
17014A19994l61K0465K2086K3339M7390M6102m2177n0484n817j0993J980j6548
$$ 119994 119633 140098 162184 185523 232913 279015 236838 186354 180537 169544 171524 154976
17002A54976k8283l4163k538J00j5212Q797K5281J8128L8258L6321L2508K3956
$$ 154976 126693 92530 89992 90092 74880 83677 108958 127086 165344 201665 234173 258129
16990B58129J8689J9373J8409k763j7557j0168o7572m6495k4324l4417r228l0590
$$ 258129 276818 296191 314600 311837 294280 284112 216540 170045 145721 111304 102076 71486
16978G1486J092M771j9769Q992J0111m1646l0616L3547J0133O852K4999K8725
$$ 71486 72578 77349 57580 66572 76683 35037 4421 37968 48101 54953 79952 108677
16966A08677j6845j4250p21J6579J6205n401o189p922r763m409O835j5832K4655
$$ 108677 91832 77582 76861 93440 109645 104244 98055 90133 80370 75961 82796 66964 91619
16953I1619m306k2797J896j4359k352J7756j3793o670J0532j0642l0577K6730
$$ 91619 87313 64516 66412 52053 49701 67457 53664 46994 57526 46884 16307 43037
16941D3037K9993k6051l928N985K0020j1338p887p733k8452l3562j9425J3930
$$ 43037 73030 46979 43051 49036 69056 57718 49831 42098 13646 -19916 -39341 -25411
16929b5411M900k917K2475L7530N0052J78p683j850j2595p050N414J5777m034
$$ -25411 -20511 -23428 -953 36577 86629 86807 79124 77274 64679 57629 63043 78820 74786
16916G4786O289n344k8370j4100k861J7152r469l6971M675N7187j1059j9559k1807
$$ 74786 81075 75731 47361 33261 30400 47552 38083 1112 5787 62974 51915 32356 10549
16903A0549J2879J045k1117J0241J168o141J4916M306O448L334l7534l636K283
$$ 10549 23428 24473 3356 13597 14765 8624 23540 27846 34294 37628 94 -3542 -1259
16890a259J1956K8267l0172l3889j0539N307j2220J3823L313K0693M364m5766
$$ -1259 10697 38964 8792 -25097 -35636 -30329 -42549 -28726 -25413 -4720 -356 -46122
16878d6122J8053J2080J798L594l8232k1189K3912K3799k877L0712K2696M1398
$$ -46122 -28069 -15989 -14191 -10597 -48829 -70018 -46106 -22307 -25184 5528 28224 69622
16866F9622k2758j7399l406J1330j1338K922J4964j8122l6135k9258p594K6048
$$ 69622 46864 29465 26059 37389 26051 28973 43937 25815 -10320 -39578 -47172 -21124
16854b1124K4954L033J5375r814k228j077K533n363Q87K7820K131j0399k9574
$$ -21124 3830 6863 22238 12424 10196 9119 11652 6289 7176 34996 37127 26728 -2846
16841b846j6580K0849J5074L1336j4086k4892J9468O144j6829j7688K2140J6099
$$ -2846 -19426 1423 16497 47833 33747 8855 28323 34467 17638 -50 22090 38189
16829C8189j4178l6255l1815J1712O284J7148J8425n1339J25J7449k1688M767
$$ 38189 24011 -12244 -44059 -32347 -26063 -8915 9510 -41829 -41704 -24255 -45943 -41176
16817d1176K1717L1185n943k8122L977L2782m308l61K780j8579k6225j1538l376
$$ -41176 -19459 11726 5783 -22339 -18362 14420 10112 9751 12531 -6048 -32273 -43811 -47187
16804d7187L6591M588j1435j350J1298P082N676l8977j5841J1170N1574K4055
$$ -47187 -10596 -6008 -17443 -18793 -7495 -413 5263 -33714 -49555 -38385 13189 37244
16792C7244n6598k6064J6929M2200P795k4784k6775L366L2419N710l3696j7797
$$ 37244 -19354 -45418 -28489 13711 21506 -3278 -30053 -26687 5732 11442 -22254 -40051
16780d0051o166N681J1037j351K0002n103j770Q388M196M3861J4252k6459l2445
$$ -40051 -46217 -40536 -29499 -30850 -10848 -15951 -17721 -9333 -5137 38724 52976 26517 -5928
16767e928j0546N119K61J5980J9740o143R506K2204p356j4030k4435k0604o07
$$ -5928 -16474 -11355 -11094 4886 24626 18483 27989 50193 42837 28807 4372 -16232 -16839
16754a6839K0407J406l3101K6749l582k4701j3384J6755p807J70K0047l3598J1671
$$ -16839 3568 4974 -28127 -1378 -4960 -29661 -43045 -26290 -34097 -33927 -13880 -47478 -35807
16741c5807J8382r639j005K3198p492J6029N51N014q910k0013j2228j3689J4126
$$ -35807 -17425 -27064 -28069 -4871 -12363 3666 4217 9231 321 -19692 -31920 -45609 -31483
16728c1483k702M262J5337q727N332J7257j5817O322O209l8751r003k036L3586
$$ -31483 -34185 -29923 -14586 -23313 -17981 -724 -16541 -10219 -4010 -42761 -51764 -53800 -20214
16715b0214J6052j5505k0052J4050J7138M404k3820l974m995j3737N296J1893
$$ -20214 -4162 -19667 -39719 -25669 -8531 -4127 -27947 -31921 -36916 -50653 -45357 -33464
16703c3464Q211n41k990l514K7390o690r417L3683j191k5450L6741O603N24R686
$$ -33464 -25253 -25794 -28784 -32298 -4908 -11598 -21015 12668 11477 -13973 22768 29371 29895 39581
16689C9581p084j2778r718j2516P106P782O372j2475P887J0580K8652O703j8647
$$ 39581 32497 19719 10001 -2515 4591 12373 18745 6270 14157 24737 53389 60092 41445
16676D1445k0631K851j1003J2468j3819r288j3136l0823J9243J2147j7581m680
$$ 41445 20814 23665 12662 25130 11311 2023 -11113 -41936 -22693 -10546 -28127 -32807
16664c2807L0747J3796j947R013L579k1977l2137L5644M931K7172P808k7359k4620
$$ -32807 -2060 11736 9789 18802 22381 404 -31733 3911 8842 36014 43822 16463 -8157
16651h157l107J2412j1213l275k7170j9536M1437L1319l9717J6154K4107o02j3713
$$ -8157 -11264 1148 -10065 -13340 -40510 -60046 -18609 12710 -27007 -10853 13254 12652 -1061
16638a061K967p435j7842K046j2839k147K3736r572k208M8561J3318p30J3841
$$ -1061 1906 -5529 -23371 -21325 -34164 -36311 -12575 -22147 -24355 24206 37524 36794 50635
16625E0635o20j1719k9988j4960r110K123J0077o966q568k1772j3532K4969J269
$$ 50635 50015 38296 8308 -6652 -15762 -13639 -3562 -10528 -19096 -40868 -54400 -29431 -28162
16612b8162O909J8314J6065k796K86j0771j2838j4344J0783O639J0227j2219K483
$$ -28162 -21253 -2939 13126 10330 10616 -155 -12993 -27337 -16554 -9915 312 -11907 -9424
16599i424k1566l956J0210J6605L3825L609q936j0640j7188J8098K1296l540J2412
$$ -9424 -30990 -34946 -24736 -8131 25694 29303 20367 9727 -7461 10637 31933 28393 40805
16586D0805j7974k9430n054L487J582p398p631k1255O974L0108M2443r906j5289
$$ 40805 22831 -6599 -11653 -8166 -6584 -13982 -21613 -42868 -35894 -5786 36657 26751 11462
16573A1462j4602K5222j9318j4388J2080j1687J5297O245o013J0805K0549K8915
$$ 11462 -3140 22082 2764 -11624 456 -11231 4066 10311 4298 15103 35652 64567
16561F4567l2646m0466J4945J4630J2751J8018k7603j6398j9702J647K5895j1526
$$ 64567 31921 -8545 6400 21030 33781 51799 24196 7798 -11904 -10257 15638 4112
16549D112O588O4750J8745l164K2006N0472K8087J9292M8672J17085J56448J54711
$$ 4112 10700 75450 94195 91031 113037 163509 191596 210888 259560 376645 533093 687804
16537F87804J16393L242q9952j45513j64313j24364q7117n8827m1453K870o390
$$ 687804 804197 807439 717487 571974 407661 283297 196180 137353 95900 98770 92380
16526I2380j7732j0580K7182n509k553K3068k8587j1349j3273J8202J683j7946
$$ 92380 74648 64068 91250 85741 83188 106256 77669 66320 53047 71249 72932 54986
16514E4986J2030J4681m254p729l0939j3429J4398L605k028p223N957J2394N056
$$ 54986 67016 81697 77443 69714 38775 25346 39744 43349 41321 34098 40055 52449 57505
16501E7505J6675r026P965n832k0171j1806J1561j26M88j338j6854j8062J3643
$$ 57505 74180 65154 73119 67287 47116 35310 46871 46745 47233 45895 29041 10979 24622
16488B4622J28l5340k3752j9759L2464K4295K9505L9159Q446K1777k785m0965
$$ 24622 24750 -10590 -34342 -54101 -21637 2658 32163 71322 79768 101545 98760 57795
16476E7795j6037k634j4580k5343l0013J2301K1989J963k9325q344n909J9284
$$ 57795 41758 39124 24544 -799 -30812 -18511 3478 5441 -23884 -32228 -38137 -18853
16464a8853N131j5098L84L8413K3872n43n192k2461l3908j7359L0740L775k5132
$$ -18853 -13722 -28820 -28436 9977 33849 33306 28114 5653 -28255 -45614 -14874 -11099 -36231
16451c6231j1417R005M1832J5756M631J4574l1393l0425J1131j0058Q029J3524
$$ -36231 -47648 -38643 3189 18945 23576 38150 6757 -23668 -12537 -22595 -14566 -1042
16439a042j0431J0967J0954J8558J7623j7447Q861j7352o432R163J98k6081r697
$$ -1042 -11473 -506 10448 29006 46629 29182 38043 20691 14259 23422 23620 -2461 -12158
16426a2158K2488J1398p20j400n933P84R9J1061j566j0973O364k6117k6836j2000
$$ -12158 10330 21728 21008 19608 13675 14459 14558 25619 24053 13080 19444 -6673 -33509 -45509
16412d5509K5268o703K987J0993O493J1004o874j3605Q097J8918J8760m221k0056
$$ -45509 -20241 -26944 -23957 -12964 -6471 4533 -2341 -15946 -7849 11069 29829 25608 5552
16399E552k5768k6129J115M450r486J094R246J0913K0256o940q659l653J6930
$$ 5552 -20216 -46345 -45230 -40780 -50266 -49172 -39926 -29013 -8757 -15697 -24356 -28009 -11079
16386a1079o313O81M027k124q747j5738M863k4974J1039k1931J0189L5295J1608
$$ -11079 -17392 -16711 -12684 -14808 -23555 -39293 -34430 -59404 -48365 -70296 -60107 -24812 -13204
16373a3204j0366K6983N117m567P187k147k9600J9898J9874k1956o956j9874n834
$$ -13204 -23570 3413 8530 3963 11150 9003 -20597 -699 19175 -2781 -9737 -29611 -35445
16360c5445K0302K5062l2624P398M3355n174j2593n862K242j3106N396J2870P170
$$ -35445 -15143 9919 -22705 -15307 28048 22874 10281 4419 6661 -6445 -1049 11821 18991
16347A8991J3283j2325j7256P465P888K384j2029K1337q655k4266j3065j6017
$$ 18991 32274 19949 2693 10158 18046 20430 8401 29738 21083 -3183 -16248 -32265
16335c2265L784R607R444j9073K5780K8035j0151L397O112K4391j5657k3229J6290
$$ -32265 -28481 -18874 -9430 -28503 -2723 25312 15161 18558 24670 49061 33404 10175 26465
16322B6465j8640k4370k3786K1045J7263J2117k3167p095r358p085j6280O771
$$ 26465 7825 -16545 -40331 -19286 -2023 10094 -13073 -20168 -29526 -36611 -52891 -46120
16310d6120J4792J5507J7207J4891k7663J2518q768L260J4140O474N909l696o181
$$ -46120 -31328 -15821 1386 16277 -11386 1132 -7636 -4376 9764 16238 22147 18451 12270
16297A2270l6495l8760L0663J6723L5620j131l1094l861j910J523N115j8346j51
$$ 12270 -24225 -62985 -32322 -15599 20021 18890 -12204 -16065 -17975 -16452 -11337 -29683 -29834
16284b9834R933K7958l056l5319j0941R296J3774q972J0841O934J2620j8726j0738
$$ -29834 -19901 8057 5001 -30318 -41259 -31963 -18189 -27161 -16320 -9386 3234 -15492 -26230
16271b6230M1026J2138r883j360l089l5638J2504J1555Q06o441r623J2754O31
$$ -26230 14796 26934 17051 15691 12602 -23036 -10532 1023 1829 -4612 -14235 -1481 -850
16258h50l169p003n325k598J5339j5550J75j758K1558q629J197q097N609J8279
$$ -850 -4019 -11022 -16347 -18945 -3606 -19156 -18981 -20739 819 -7810 -6613 -14710 -9101 9178
16244I178j796J0597N975p833J7174J1179j4900l1068j4063K557j0272J723k6330
$$ 9178 7382 17979 23954 16121 33295 44474 29574 -1494 -15557 -13000 -23272 -21549 -47879
16231d7879n465L0790Q4O798k2052L6123Q515k8485j1618O974j5119L084p147
$$ -47879 -53344 -22554 -22470 -15672 -37724 -1601 6914 -21571 -33189 -26215 -41334 -38250 -45397
16218d5397r892J1269L0208K4203l2116j0244J3983l19Q29L78K905R830j3308
$$ -45397 -55289 -44020 -13812 10391 -21725 -31969 -17986 -18305 -17476 -17098 -14193 -4363 -17671
16205a7671n349K0498N155q558n998J0233J3363m700l666o995K3260M6136L1931
$$ -17671 -23020 -2522 2633 -5925 -11923 -1690 11673 6973 3307 -3688 19572 65708 97639
16192I7639l555l4646n0008m267P446J7202Q413j4684J794r722K1450j480o338
$$ 97639 94084 59438 9430 5163 12609 29811 38224 23540 25334 15612 37062 35582 29244
16179B9244j1535j2878j6666J7733P365J0861O909K8124j4226l7929l363J540
$$ 29244 17709 4831 -11835 5898 13263 24124 31033 59157 44931 7002 3639 5179
16167E179J1123J4996q995l7049j6986j2302j036q284Q796K4188J2561J0988P152
$$ 5179 16302 31298 22303 -14746 -31732 -44034 -45070 -53354 -44558 -20370 -7809 3179 10331
16154A0331J9986O713L5193Q710o1998k6086R90n733n3806o608K5280K8109J5592
$$ 10331 30317 37030 72223 80933 18935 -7151 -6161 -11894 -65700 -72308 -47028 -18919 -3327
16141c327k788j7127K565K3292P165l0401k0248q153J8554J9611K3439J2496P409
$$ -3327 -6115 -23242 -20677 2615 9780 -20621 -40869 -49022 -30468 -10857 12582 25078 32487
16128C2487j0830N837j4524k5406m2349j2138q022J992K6660L6751J0071m512
$$ 32487 21657 27494 12970 -12436 -54785 -66923 -74945 -72953 -46293 -9542 529 -3983
16116c983Q41k1395j3981l297j8016j3951j3505J4485K1276L5553K4855J9l0524
$$ -3983 -3142 -24537 -38518 -41815 -59831 -73782 -87287 -72802 -51526 -15973 8882 8901 -21623
16103b1623L136j4799K840M4805j8228j5745n419O346Q294L4883j6041k1973l1638
$$ -21623 -18487 -33286 -30446 14359 -3869 -19614 -25033 -18687 -10393 24490 8449 -13524 -45162
16090d5162j8258L5059J7683l4096o235J8537L4925j655j4457J0789m94J0774
$$ -45162 -63420 -28361 -10678 -44774 -51009 -32472 2453 798 -13659 -2870 -3364 7410
16078G410J6522j0263j4490j1861J2143j8511k1693O181K0395K0266J2836j9832
$$ 7410 23932 13669 -821 -12682 -539 -19050 -40743 -34562 -14167 6099 18935 -897
16066h97k4680O241l85l7015q210J0421M5952k900L31l867r903K4597Q163K1944
$$ -897 -25577 -19336 -19721 -56736 -64946 -54525 -8573 -11473 -11142 -15009 -24912 -315 7848 29792
16052B9792L1550p17n584p1799k2040M4463j6490l919j037Q449k4706K6434J8260
$$ 29792 61342 60625 55041 -16758 -38798 5665 -10825 -14744 -15781 -7332 -32038 -5604 12656
16039A2656j7581M236j3426j1231J2681L086J2128J0399n867K966K2199p56l8963
$$ 12656 -4925 -689 -14115 -25346 -12665 -9579 2549 12948 7081 10047 32246 31490 -7473
16026g473j6860J5416p002k559k114J9030J8254R738k846k139k9725o698j4943
$$ -7473 -24333 -8917 -15919 -18478 -20592 -1562 16692 26430 23584 21445 -8280 -14978 -29921
16013b9921l091j4314K5329J5015J3600J9640j5293n100J0640J8545L06l223m123
$$ -29921 -33012 -47326 -21997 -6982 6618 26258 10965 5865 16505 35050 35356 32133 28010
16000B8010l2112K3475P768k2826o9k2131J0814l965M231Q840J0047k5254m0888
$$ 28010 -4102 19373 27141 4315 4246 -17885 -7071 -11036 -6805 2035 12082 -13172 -54060
15987e4060L1894K8905L5415j8695k6689J9878O226m744m04J273j5823o966J2750
$$ -54060 -22166 6739 42154 23459 -3230 16648 22874 18130 17726 18999 3176 -3790 8960
15974H960q512J1964M0854J075k6747j7548J7280k0455k361J6678j0676l2282
$$ 8960 448 12412 53266 54341 27594 10046 27326 6871 4510 21188 10512 -21770
15962b1770P436K8975n2629k5732L9087J6600o810L895r370J1591J2927j5723
$$ -21770 -14334 14641 -37988 -63720 -24633 -8033 -14843 -10948 -20318 -8727 4200 -11523
15950a1523n719Q615j5446n4802N1522L9684l858k6977l1420k1520J5943P306
$$ -11523 -17242 -8627 -24073 -78875 -27353 12331 8473 -18504 -49924 -71444 -55501 -48195
15938d8195J8887J9483L4981R329n1079p808K0911J4948J0864R969k0136Q793
$$ -48195 -29308 -9825 25156 34485 -16594 -24402 -3491 11457 22321 32290 12154 20947
15926B0947J6754K358L093j0784K060j265j9257j9386p999K3812p536l408K7650
$$ 20947 37701 40059 43152 32368 34428 33163 13906 -5480 -13479 10333 2797 -611 27039
15913B7039j125r272J402q651O216J944n2546j8082Q271l0447o138L197J4612
$$ 27039 25914 16642 18044 9393 15609 17553 -34993 -53075 -44804 -75251 -81389 -78192 -63580
15900f3580J6065K8309K3864J036J753P670j8612n583l193j2515J2761R053m125
$$ -63580 -47515 -19206 4658 5694 7447 15117 -3495 -9078 -12271 -24786 -12025 -2972 -7097
15887g097R427J858k361p799K1741j306k7803P205J1936k0182J9214J228k6275
$$ -7097 2330 4188 1827 -5972 15769 14463 -13340 -6135 5801 -14381 4833 6061 -20214
15874b0214k3938j9001R554K5058K8225J1034j6680k4605J6109o324l8675k1883
$$ -20214 -44152 -63153 -53599 -28541 -316 10718 -5962 -30567 -14458 -20782 -59457 -81340
15862h1340J9277J2306j3314L740L6945J3935l7885O98K3955j8290J3300N150
$$ -81340 -62063 -49757 -63071 -59331 -22386 -8451 -46336 -45638 -21683 -39973 -26673 -21523
15850b1523j5341p300J8861K7910m969k133l538O400J4173M386j3351Q475P55
$$ -21523 -36864 -44164 -25303 2607 -2362 -4495 -8033 -1633 12540 16926 3575 12050 12805
15837A2805l1530j3161J4204K6804o473O413K418j2264j4432j3250m96K629L144
$$ 12805 -18725 -31886 -17682 9122 2649 9062 11480 -784 -15216 -28466 -28962 -26333 -23189
15824b3189O683N904L2397K032k3480o0K0839j3714n367J1975n166k4147k2239
$$ -23189 -16506 -10602 21795 23827 347 287 21126 7412 2045 14020 8854 -15293 -37532
15811c7532k083L9592j259k0874Q940j7374J401K4460J3375j614J752r005K6119
$$ -37532 -39615 -23 -1282 -22156 -13216 -30590 -29189 -4729 8646 7032 8784 -221 25898
15798B5898j770p124j715p975J7952j6393N715k1186n765k4257j5183J1687J4543
$$ 25898 24128 17004 15289 7314 25266 8873 14588 -6598 -12363 -36620 -51803 -40116 -25573
15785b5573J716N1732L8505k1574m3490n758K5006J3008P813m5856K846L3418
$$ -25573 -23857 27875 66380 44806 1316 -4442 20564 33572 41385 -4471 -1625 31793
15773C1793j3614j7947l857j1622j9102l173P539k0568q442K9607K7825J6682
$$ 31793 18179 232 -3625 -15247 -34349 -37522 -29983 -50551 -58993 -29386 -1561 15121
15761A5121m956O358j2659j8849J2529j2585m1500J5341j0123o200P705K4024
$$ 15121 10165 16523 3864 -14985 -2456 -15041 -56541 -41200 -51323 -57523 -49818 -25794
15749b5794L3836J5428l0146l703K6263J6377n161J2870k239l5263k1589K2165
$$ -25794 8042 23470 -6676 -10379 15884 32261 27100 39970 37731 2468 -19121 3044
15737C044K9838P395m598J0514L68K685O12j1282k1276n7447k2716J1868J8179
$$ 3044 32882 40277 35679 46193 46561 49246 49858 38576 17300 -40147 -62863 -50995 -32816
15724c2816j0422K1801K3635k7190N024K1202J6218O92J6224j0804q362k9905
$$ -32816 -43238 -21437 2198 -24992 -19968 1234 17452 18144 34368 23564 15202 -14703
15712a4703l91l5154Q705M9392N12j4801j498K9054Q024N6o643m731j8151j0069
$$ -14703 -15094 -50248 -41543 7849 8361 -6440 -7938 21116 29140 29196 22553 17822 -329 -10398
15698a0398L628K9226j3305J3476l24l969j4709j1978K1107k2634k07n457K7730
$$ -10398 -6770 22456 9151 22627 22303 18334 3625 -8353 12754 -9880 -10087 -15544 12186
15685A2186K9084n516k7240j9368k534J0073k3839k9931P239K7036M998O731L167
$$ 12186 41270 35754 8514 -10854 -13388 -3315 -27154 -57085 -49846 -22810 -17812 -11081 -7914
15672g914k106R523L7406k4337l1621r054j7053O057Q025j7610K258L4780Q230
$$ -7914 -10020 -497 36909 12572 -19049 -28103 -45156 -39099 -31074 -48684 -46426 -11646 -3416
15659c416K0284j2376L694j5197q426M540J0818l50q625k007l0230j99o692L1252
$$ -3416 16868 4492 8186 -7011 -15437 -10897 -79 -429 -9054 -11061 -41291 -41490 -48182 -16930
15645a6930M5642j6691k4917J3159J3335r83l0104m962K4391j8860j1484k613
$$ -16930 28712 12021 -12896 263 13598 12615 -17489 -22451 1940 -16920 -28404 -31017
15633c1017M3942R574j9026l6488k155M452k1720j6285L165K1556N314j986K4911
$$ -31017 12925 22499 3473 -33015 -35170 -30718 -52438 -68723 -65558 -44002 -38688 -40674 -15763
15620a5763k891j6333J0208J7626k0632m595J341k934j119J8875L376j6523K443
$$ -15763 -18654 -34987 -24779 -7153 -27785 -32380 -31039 -33973 -35092 -16217 -12841 -29364 -26921
15607b6921J6832J9719j3679j3882o362q846L2072q176j7038m336J8496R254M978
$$ -26921 -10089 9630 -4049 -17931 -24293 -33139 -1067 -9243 -26281 -30617 -12121 -2867 2111
15594B111K0704q598L522k3904k9594j2113L8736J2074j8610j393R432O419m696
$$ 2111 22815 14217 17739 -6165 -35759 -47872 -9136 2938 -15672 -17065 -7633 -1214 -5910
15581e910K052J909J4557L1548k2994j8753l465J3923n225k6817K7512l686o787
$$ -5910 -3858 -1949 12608 44156 21162 2409 -1056 12867 7642 -19175 8337 4651 -2136
15568b136K055o028q058n738n407J6323M544J714J9017q232K039P205r270k5923
$$ -2136 -81 -6109 -14167 -19905 -25312 -8989 -4445 -2731 16286 8054 10093 17298 8028 -17895
15554a7895J1374K1823J6412j5994r866j7508j7364k672Q162J4217O714K432K112
$$ -17895 -6521 15302 31714 15720 5854 -11654 -29018 -31690 -23528 -9311 -2597 -165 1947
15541A947l0225J5647J8394J6200j4356l8252j0936J0756Q514J9119r221M628
$$ 1947 -28278 -12631 5763 21963 7607 -30645 -41581 -30825 -22311 -3192 -12413 -7785
15529g785J8290k2389j6332n783J2619k1802j2351K5862L9953l2509O09j132j3759
$$ -7785 10505 -11884 -28216 -33999 -21380 -43182 -55533 -29671 10282 -22227 -21618 -22750 -36509
15516c6509j7800o009J5943J6771M535L9171R763J5579k2264j4118q796O923R925
$$ -36509 -54309 -60318 -44375 -27604 -23069 16102 25865 41444 19180 5062 -3734 3189 13114
15503A3114j2720j4149m314J030p856o140k3619k727L8406j6218q159k2577Q620
$$ 13114 394 -13755 -18069 -17039 -24895 -31035 -54654 -57381 -18975 -35193 -43352 -65929 -57309
15490e7309K143L3030L379j8088m084L7599J2002J1613J669o806O139j9641l4359
$$ -57309 -55166 -22136 -18757 -36845 -40929 -3330 8672 20285 21954 15148 21287 1646 -32713
15477c2713k1644J3356L2731J0429L7721O999k4960o692L5289J8633j3085K831
$$ -32713 -54357 -41001 -8270 2159 39880 46879 21919 15227 50516 69149 56064 58895
15465E8895o731j8112l4708k4039J3021J5696N646n760R203j4536J055k567J3398
$$ 58895 52164 34052 -656 -24695 -11674 4022 9668 3908 13111 -1425 -370 -2937 10461
15452A0461k554n621k3835m180l297L803J2345L2606j0421K103J0313j3282k0221
$$ 10461 7907 2286 -21549 -25729 -29026 -25223 -12878 19728 9307 11410 21723 8441 -11780
15439a1780j2066O555L3934j1805j2048O264k5188l771k3271J3236J8724K1002
$$ -11780 -23846 -17291 16643 4838 -7210 -946 -26134 -29905 -53176 -39940 -21216 -214
15427b14J3546j7050k3035o739J8759J4046m087K0673j7042q282q874n413K4266
$$ -214 13332 -3718 -26753 -33492 -14733 -687 -4774 15899 -1143 -9425 -18299 -23712 554
15414E54k715K3428J4779k8543k3262J0121K66l758J587j113R007P070j4568j1683
$$ 554 -2161 21267 36046 7503 -15759 -5638 -5372 -9130 -7543 -8656 351 7421 -7147 -18830
15400a8830j6878M46J4579j509J7839N5781L4708k0673l1262m7375m2982M347
$$ -18830 -35708 -35262 -20683 -22192 -4353 51428 86136 65463 34201 -13174 -56156 -51809
15388e1809J2010j8443P200M2611L5528m273k3312L5526j219j8054K4726k1665
$$ -51809 -39799 -58242 -51042 -8431 27097 22824 -488 35038 33819 15765 40491 18826
15376A8826k1988J7115j3775j3097k7580p638J3529L906j2439P686K2040O791
$$ 18826 -3162 13953 178 -12919 -40499 -48137 -34608 -30702 -43141 -35455 -13415 -6624
15364f624P490J2114q96p235k5511j8803J4095L2940P961K9397o206r263o695
$$ -6624 866 12980 12084 4849 -20662 -39465 -25370 7570 15531 44928 38722 29459 22764
15351B2764L754j7015n392j4423j948r420M770k437N357M9380N52n4737Q52L2184
$$ 22764 26518 9503 4111 -10312 -12260 -21680 -16910 -19347 -13990 35390 35942 -18795 -17943 14241
15337A4241J5764l1957p649J5202K6896Q8l7980r043R603L0828N31j1408M124
$$ 14241 30005 -1952 -9601 5601 32497 32585 -5395 -14438 -4835 25993 26524 15116 19240
15324A9240n955j6248p463k080j1363n541J0038K1401J3851J6737k4659r238q258
$$ 19240 13285 -2963 -10426 -12506 -23869 -29410 -19372 2029 15880 32617 7958 -1280 -9538
15311i538j3344Q274j5285j5939J9486O748K0671J1924J3228q463J8609k2347
$$ -9538 -22882 -14608 -29893 -45832 -26346 -19598 1073 12997 26225 17762 36371 14024
15299A4024j3552j034N05q518j0251j3526K3480L027R753o318J629m3019m251
$$ 14024 472 -562 -57 -8575 -18826 -32352 -8872 -5845 3908 -2410 -781 -43800 -48051
15286d8051K6083L3059J4764j4852k1944j2205L4214r421K0193L3284j4113k0516
$$ -48051 -21968 11091 25855 11003 -10941 -23146 11068 1647 21840 55124 41011 20495
15274B0495N13O023j9391J252P942Q666m812N183J3863K2225k4666r076K9344
$$ 20495 21008 27031 7640 8892 16834 25500 20688 25871 39734 61959 37293 28217 57561
15261E7561M831j8395N02q20m0462K139n102K0625r266j2367l0209k2695J8880
$$ 57561 62392 43997 44499 43679 3217 5356 254 20879 11613 -754 -30963 -53658 -34778
15248c4778K5306K3686K8081M639l2312J196k0680j5830J4302Q734j5809j005
$$ -34778 -9472 14214 42295 46934 14622 15818 -4862 -20692 -6390 2344 -13465 -14470
15236a4470j968N757K1942j5443L807J0109K143n1010j4144O719K2252J247n113
$$ -14470 -16438 -10681 11261 -4182 -375 9734 11877 -39133 -53277 -46558 -24306 -23059 -28172
15223b8172j0765J6742J5652j6514j4274J3597N567O794j4957n240J6110Q664
$$ -28172 -38937 -22195 -6543 -23057 -37331 -23734 -18167 -11373 -26330 -31570 -15460 -6796
15211f796k0066J7007J7196K8641N865k9173k2287K1901J1225j8099j555P628
$$ -6796 -26862 -9855 7341 35982 41847 12674 -9613 12288 23513 5414 3859 11487
15199A1487L4637k062K4606O533n205j0556m1017p520J1135J5022N879j002p347
$$ 11487 46124 44062 68668 75201 69996 59440 18423 10903 22038 37060 42939 41937 34590
15186C4590j3277m1684L68L1726J1520J4207j1114k4828p921K5792J7283M831
$$ 34590 21313 -20371 -20003 11723 23243 37450 26336 1508 -6413 19379 36662 41493
15174D1493l5225m2713K6621J2718j8131J9926p568K842j7793k945K4927J1127
$$ 41493 6268 -36445 -9824 2894 -15237 4689 -2879 -37 -17830 -20775 4152 15279
15162A5279k6387j4777K1004K692L2788k1931j3979m709k0730J6985K9881M1350
$$ 15279 -11108 -25885 -4881 -2189 30599 8668 -5311 -10020 -30750 -13765 16116 57466
15150E7466P467p747n9128n813q353o651k548j4931j0400J1893M3881J2570n150
$$ 57466 64933 57186 -1942 -7755 -16108 -22759 -25307 -40238 -50638 -38745 5136 17706 12556
15137A2556k5845k9921m0988Q503L8907K3667N618j6336N733K3782Q321J1246
$$ 12556 -13289 -43210 -84198 -75695 -36788 -13121 -7503 -23839 -18106 5676 13997 25243
15125B5243J2700n030K4093K9644n09k6741p298k3863l3891k1807k714J6909j1181
$$ 25243 37943 32913 57006 86650 86141 59400 52102 28239 -5652 -27459 -30173 -13264 -24445
15112b4445J0761J6076q186J0586J6464j1781J21l0663j3369J3038L6326J6005
$$ -24445 -13684 2392 -5794 4792 21256 9475 9596 -21067 -34436 -21398 14928 30933
15100C0933j2733j6682J9508j4216l3462j4210p762P374O719j7179P208N6889
$$ 30933 18200 1518 21026 6810 -26652 -40862 -48624 -41250 -34531 -51710 -44502 12387
15088A2387K5628k7785l4465j6363K3382m168J208M677j341J5403O62K038K454
$$ 12387 38015 10230 -24235 -40598 -17216 -21384 -20176 -15499 -16840 -1437 -775 1263 3717
15075C717Q56o281J1973n202j0826R012K7213m852q712m429r02J7535j6703L923
$$ 3717 4573 -1708 10265 5063 -5763 3249 30462 25610 16898 12469 11567 29102 12399 16322
15061A6322J5196J4689N932l2764n4482k1306p723J1708J6791m558K2749J4110
$$ 16322 31518 46207 52139 19375 -35107 -56413 -64136 -52428 -35637 -40195 -17446 -3336
15049c336j534N347r499J207j0194n938K4527K4626l1298j4478J67r101m844P843
$$ -3336 -4870 477 -9022 -7815 -18009 -23947 580 25206 -6092 -20570 -20403 -29504 -34348 -26505
15035b6505J0652J8904J8360j7520P156L1464J6268K4120m5172m7218K0146J0174
$$ -26505 -15853 3051 21411 3891 11047 42511 58779 82899 37727 -9491 10655 20829
15023B0829p376M166J3903J7879j7535o355n070k8969j0420o049L9108o795M411
$$ 20829 13453 17619 31522 49401 31866 25511 20441 -8528 -18948 -24997 14111 7316 11727
15010A1727j4650l5969Q134J0030k2325K5724j0824j5995N7257L2872J1063l4203
$$ 11727 -2923 -38892 -30758 -20728 -43053 -17329 -28153 -44148 13109 45981 57044 22841
14998B2841k0557J2695j2893J8620K9948N585l9992q378P157k3980n782K337L8442
$$ 22841 2284 14979 2086 20706 50654 56239 16247 7869 15026 -8954 -14736 -12399 26043
14985B6043K3448J2194q758K265j9616P133p407l6152J1239l946k6543j3245P39
$$ 26043 49491 61685 52927 55192 35576 42709 35302 -850 10389 6443 -20100 -33345 -32606
14972c2606J6341L724K3293j5286j3379J1821J6456J3003j313r625K932j1013
$$ -32606 -16265 -12541 10752 -4534 -17913 -6092 10364 23367 22054 12429 15361 4348
14960D348o933k4l301j0850J6489K8742N916j3560k8300L622N699K176K1158L241
$$ 4348 -2585 -2609 -5910 -16760 -271 28471 34387 20827 -7473 -3851 1848 4024 25182 28423
14946B8423j05j51J082j8281k8400l6194N090K7564Q820L893j9844J4947m873
$$ 28423 28318 28167 29249 10968 -17432 -53626 -48536 -20972 -12152 -8259 -28103 -13156 -18029
14933a8029K7189j0982j2477J0900j1083j5891J7829J07J3191O059N389K3383
$$ -18029 9160 -1822 -14299 -3399 -14482 -30373 -12544 -12437 754 6813 12202 35585
14921C5585J5298N686l3155l2416P501j7961L746Q676j4328n483l736O050J3619
$$ 35585 50883 56569 23414 -9002 -1501 -19462 -15716 -7040 -21368 -26851 -30587 -24537 -10918
14908a0918o525j0906P749J9348J1707J2145n400J0282n821n299p802r335K6K2524
$$ -10918 -17443 -28349 -20600 -1252 10455 22600 17200 27482 21661 16362 8560 -775 -749 21775
14894B1775k1j2497k7180J2730K5407K4473l1759l5123k2168p236J4707N8239
$$ 21775 21754 9257 -17923 -5193 20214 44687 12928 -22195 -44363 -51599 -36892 21347
14882B1347K2129j5062j2704J4020M7013N8588O9765L9967K8094n5361n2800l3681
$$ 21347 43476 28414 15710 29730 76743 135331 205096 245063 273157 217796 164996 131315
14870A31315m9326M456K4356m786l6831J869N754k0782j4192l5522j452J4421
$$ 131315 81989 86445 110801 106015 69184 71053 76807 56025 41833 6311 4859 19280
14858A9280l66N596K4578J2903k0903k4073R481n99L62N502j853n505r889k5887
$$ 19280 18914 24510 49088 61991 41088 17015 26496 25897 26259 31761 29908 24403 14514 -11373
14844a1373K7429J4976j0692N483R288L99K0165j0485K758k303j8913n289k3266
$$ -11373 16056 31032 20340 25823 35111 35510 55675 45190 47948 45645 26732 21443 -1823
14831a823p77j659l254m993K807J9434j1982J8070K1120q907o355K2834k373j6116
$$ -1823 -2600 -4259 -7513 -12506 -9699 9735 -2247 15823 36943 28036 21681 44515 42142 26026
14817B6026k2845j1054L6144Q220m171k548j8980p747m802O503j1988Q668N080
$$ 26026 3181 -7873 28271 36491 32320 29772 10792 3045 -1757 4746 -7242 1426 6506
14804F506J4724J5047j1657k3297q157K7775k6399j6486j6869J3377n499L5149
$$ 6506 21230 36277 24620 1323 -6834 20941 -5458 -21944 -38813 -25436 -30935 4214
14792D214K6608n476J3788l051J233o236L1977K2599j9841l7127k2076j6646o377
$$ 4214 30822 25346 39134 36083 37316 31080 63057 85656 65815 28688 6612 -10034 -16411
14779a6411L1695m207j0627J7128J8235j5641j1187l790Q395k0839l644M528J1248
$$ -16411 15284 11077 450 17578 35813 20172 8985 5195 13590 -7249 -10893 -6365 4883
14766D883q774J3992p942K4478K7129l7919j2433N281k591k5906j4417l3839J071
$$ 4883 -3891 10101 2159 26637 53766 15847 3414 8695 6104 -19802 -34219 -68058 -66987
14753f6987K0653J0371K2271N4697J7262k2514j041j1307r811M141J0309l2254
$$ -66987 -46334 -35963 -13692 41005 58267 35753 34712 23405 13594 17735 28044 -4210
14741d210j1872L0355k0353N395M5488r303k3108m0379j9037j4892L976J0498
$$ -4210 -16082 14273 -6080 -685 44803 35500 12392 -27987 -47024 -61916 -57940 -47442
14729d7442K6173J1537j2916k0464l0285l600J7061M9238p279o639J1107K9753
$$ -47442 -21269 -9732 -22648 -43112 -73397 -76997 -59936 -10698 -17977 -24616 -13509 16244
14717A6244J7149R041k38k2310J3933j1714l9975j7477J319K3009J4116L520L026
$$ 16244 33393 42434 42196 19886 33819 22105 -17870 -35347 -34028 -11019 3097 6617 9643
14704I643J0400r097k7391K686J2737j276q0r320j7213j9500l610K1007J6333
$$ 9643 20043 10946 -16445 -13759 -1022 -2298 -2378 -11698 -28911 -48411 -52021 -31014 -14681
14691a4681o108j3180L8968k387j3273J3914l560k0063j6946J6651k1765O36K2549
$$ -14681 -20789 -33969 4999 2612 -10661 3253 -307 -20370 -37316 -20665 -42430 -41794 -19245
14678a9245k6946J0314l1571J6838K5360O6K721j265j342Q483K2345J7930o968
$$ -19245 -46191 -35877 -67448 -50610 -25250 -25184 -22463 -23728 -25070 -16587 5758 23688 16720
14665A6720j507K2619P093J5825J0226J400K585l4401j9249o425N328P912j8210
$$ 16720 15213 37832 44925 60750 70976 72376 74961 40560 21311 14886 20214 28126 9916
14652I916r026Q892j3762j9387k7522L1771N027M713K8339j7661k6368m488N425
$$ 9916 890 9782 -3980 -23367 -50889 -19118 -14091 -9378 18961 1300 -25068 -29556 -24131
14639b4131K6941p489q833l2072P584J7270J8104N692l028L6476j5610k2543n016
$$ -24131 2810 -4679 -13512 -45584 -38000 -20730 -2626 3066 38 36514 20904 -1639 -6655
14626f655L739o446k0499q415P64R205J5016J4957K4265j8826p695J8354K5067
$$ -6655 -2916 -9362 -29861 -38276 -37512 -28307 -13291 1666 25931 7105 -590 17764 42831
14613D2831j5428k7743m7405r401K3099J4827K0098J9307k0880l8039j9151K4997
$$ 42831 27403 -340 -47745 -57146 -34047 -19220 878 20185 -695 -38734 -57885 -32888
14601c2888J8174j5319r614K062l959J1633J9931j0598L193K9223r401l1294K9675
$$ -32888 -14714 -30033 -39647 -37585 -41544 -29911 -9980 -20578 -17385 11838 2437 -28857 818
14588H18L5506k0745l3257k4804L698K0360j7569j4678K7286M5411J3378l0731
$$ 818 36324 15579 -17678 -42482 -38784 -18424 -35993 -50671 -23385 22026 35404 4673
14576D673l8058p491j0910J9567L6045K295N854P582J895k4178r357r582P535
$$ 4673 -33385 -40876 -51786 -32219 3826 6121 11975 19557 21452 -2726 -12083 -21665 -14130
14563a4130j000j9664J4869N5r15L0727p718j0494j4100M237K967k5674O337J8875
$$ -14130 -15130 -34794 -19925 -19870 -20785 9942 2224 -8270 -22370 -18133 -15166 -40840 -34503 -15628
14549a5628k9077j543N989p603m329M2698J9651O459k007j1841j0140k7859q139
$$ -15628 -44705 -46248 -40259 -47862 -52191 -9493 10158 16617 14610 2769 -7371 -35230 -43369
14536d3369R458J1100J9640M1991J920j5031j2764q541l4771j296J3792k1200
$$ -43369 -33911 -22811 -3171 38820 40740 25709 12945 4404 -30367 -31663 -17871 -39071
14524c9071J2796n319j4691l583n05n304j8225R369M9970R176q720K3662K9861
$$ -39071 -26275 -31594 -46285 -49868 -50373 -55677 -73902 -64533 -14563 -5387 -14107 9555 39416
14511C9416J4141N957j1885m66l6389j1826p848R823j4721k776R441j4250j0014
$$ 39416 53557 59514 47629 47163 10774 -1052 -8900 923 -13798 -16574 -7133 -21383 -31397
14498c1397N793K4893J2697l0551R54j732O74l1100Q884M1943L3804n56k5809
$$ -31397 -25604 -711 11986 -18565 -17611 -19343 -18669 -49769 -40885 1058 34862 34306 8497
14485H497l66o299K4085l492j5762k0967j747m263L061Q685L749n305N233k0252
$$ 8497 8131 1832 25917 22425 6663 -14304 -16051 -20314 -17253 -8568 -4819 -10124 -4891 -25143
14471b5143J6512J8572O261j8045K3105L6633K6815k6982k1212j53j7030j2081
$$ -25143 -8631 9941 16202 -1843 21262 57895 84710 57728 36516 36363 19333 7252
14459G252J5263J9826j2740L492K5333K3957L488J7144K6736k075K4171K4077
$$ 7252 22515 42341 29601 33093 58426 82383 85871 103015 129751 127676 151847 175924
14447A75924N5627Q2572O4858J68010K79264L60837L96962K10185n1630k52534
$$ 175924 231551 314123 378981 546991 826255 1187092 1584054 1794239 1742609 1490075
14437A490075l84715k87751j80090j14584o6967o8484p7670l8130j7343l8598
$$ 1490075 1105360 817609 637519 522935 455968 387484 309814 271684 254341 215743
14427B15743j9278R523Q057j0803j9978j8713k0996l4914R311j7534j4876k507
$$ 215743 196465 205988 214045 203242 183264 164551 143555 108641 117952 100418 85542 83035
14415H3035N313k6518J7332K4113j2394k7169p419o167j0299j7531j8097p367
$$ 83035 88348 61830 79162 103275 90881 63712 56293 50126 39827 22296 4199 -3168
14403c168K1576L827J1882K1914M259n3439m4835M671K0486K9045J8516k6209
$$ -3168 18408 22235 34117 56031 60290 6851 -37984 -33313 -12827 16218 34734 8525
14391H525j619l3970K7361P475J0953L726j474R679j3804r403J5994m695Q651
$$ 8525 6906 -27064 297 7772 18725 22451 20977 30656 16852 7449 23443 18748 27399
14378B7399J4408K8916K306l0904K714m422k3346j2248J2344m0801n157M0676
$$ 27399 41807 70723 73029 42125 44839 40417 17071 4823 17167 -23634 -28791 11885
14366A1885Q705n108J2614O447j6644j7088N307K6023J5700k517k3704l2153L824
$$ 11885 20590 15482 28096 34543 17899 811 6118 32141 47841 45324 21620 -10533 -6709
14353f709R577n588l6789K2L4438l612j4270Q073K5000K3432R54l2505p147J3718
$$ -6709 2868 -2720 -39509 -39487 -5049 -8661 -22931 -14858 10142 33574 34528 2023 -5124 8594
14339H594r586m926N00O297L0278j09l2907j495j8j3818k940p19l976K1414N175
$$ 8594 -992 -5918 -5418 879 31157 31048 -1859 -3354 -3372 -17190 -20130 -20849 -24825 -3411 1764
14324A764j8908j5874j008J7251K8616M9921o453l8672p432J0215j8638P91J7495
$$ 1764 -17144 -33018 -34026 -16775 11841 61762 55309 16637 9205 19420 782 1573 19068
14311A9068N572K5550j604j7981k05J5235l834j8875q362J9934Q838r96M112j3344
$$ 19068 24640 50190 48586 30605 30400 45635 41801 22926 14564 34498 43336 42340 46452 33108
14297C3108p512M809k0355j0931K4172j867l1295k7904K5171J0337J314K2515
$$ 33108 25596 30405 10050 -881 23291 21424 -9871 -37775 -12604 -2267 -953 21562
14285B1562P52j068j2685K447j580p122Q107K4114J4125n783j6338q201m852j7595
$$ 21562 22314 21246 8561 11008 9428 2306 10413 34527 48652 42869 26531 18330 13478 -4117
14271d117L395N027k1540q320L0397J6178j6353J2853L4200K8124Q057P347R353
$$ -4117 -722 4305 -17235 -25555 4842 21020 4667 17520 51720 79844 87901 95248 104601
14258A04601J1518J1805J8462J8495j0360J1097J0990j3593J4603j2888k4223
$$ 104601 116119 127924 146386 164881 154521 165618 176608 163015 177618 164730 140507
14247A40507m4794l6004k4318J1514N839l452P56r067l0122r933j1212q566K6856
$$ 140507 95713 59709 35391 46905 52744 49292 50048 40981 10859 926 -10286 -18852 8004
14234H004N5223J4734k4550j1227r71l207m685N573K3733R583J233K345n930J2337
$$ 8004 63227 77961 53411 42184 41213 38006 33321 38894 62627 72210 73443 75788 69858 82195
14220H2195Q004L0463j5416k2791K1379M9184K9786j816Q433l874j0555r337k3389
$$ 82195 90199 120662 105246 82455 103834 153018 182804 180988 189421 185547 174992 165655 142266
14207A42266l8262q206J318K4348J6303n8837k1346J0835K2825R191n201J0379
$$ 142266 104004 95798 97116 121464 137767 78930 57584 68419 91244 100435 95234 105613
14195A05613q59K964k4245n914o260j0520j5397J8889J1188Q380L926m0257L775
$$ 105613 104754 107718 83473 77559 71299 60779 45382 64271 75459 83839 87765 47508 51283
14182E1283L426o711o296j2417j3335O180L1344J9870j4363o61J1137n696m3751
$$ 51283 54709 47998 41702 29285 15950 22130 53474 73344 58981 58320 69457 63761 20010
14169B0010j5109r182r809L2625J1409K7272p730o028l5500k8725n230m121o804
$$ 20010 4901 -4281 -14090 18535 29944 57216 49486 43458 7958 -20767 -25997 -30118 -36922
14156c6922J7493j8139l806j0954j8820j2512O75l0554J3265L8596L0791L5387
$$ -36922 -19429 -37568 -41374 -52328 -71148 -83660 -82985 -113539 -100274 -61678 -30887 4500
14144D500K8990Q513j9580j8011l8226q353L2057J6214L4420Q734q937k2732k109
$$ 4500 33490 42003 22423 4412 -33814 -42167 -10110 6104 40524 49258 40321 17589 15480
14131A5480k1310k0550M116k4958K1394K3820J9820K3539K9074J1982l249L995
$$ 15480 -5830 -26380 -22264 -47222 -25828 -2008 17812 41351 70425 82407 79158 83153
14119H3153N3245N434k9516Q930l661j3610k5439q350o67K8963M2333J0530j9404
$$ 83153 136398 141832 112316 121246 117585 103975 78536 70186 69519 98482 140815 151345 131941
14106A31941J172j9409l1877P37J1604P115j3819O554K5179q160L0112L2254o595
$$ 131941 133113 113704 81827 82564 94168 101283 87464 94018 119197 111037 141149 173403 166808
14093A66808K9772L0093k0139j1093l3584k9747m2430p3860o4345o4129Q807N513
$$ 166808 196580 226673 206534 195441 161857 132110 89680 15820 -48525 -112654 -103847 -98334
14081i8334J323o935M1645M0916K9213K9591J3401j7374J0920K9230k0209n619
$$ -98334 -97011 -103946 -62301 -21385 7828 37419 50820 33446 44366 73596 53387 47768
14069D7768M7768L2787J1835L2104K7276J1040J4020j0807K8480n361q686k2243
$$ 47768 95536 128323 140158 172262 199538 210578 224598 213791 242271 236910 228224 205981
14057B05981j4317K0071k7638k4387j2554J5148j2116n760L7024K9585J1656K7846
$$ 205981 191664 211735 184097 159710 147156 162304 150188 144428 181452 211037 222693 250539
14045B50539K4372j4042k7582R374K2645j1406k4637K706L349O784j5921k4772
$$ 250539 274911 260869 233287 242661 265306 253900 229263 231969 235318 242102 226181 201409
14033B01409k4099N170P308p197m504j6551J8276K9518J0436K171n953k5247K6792
$$ 201409 177310 182480 189788 182591 178087 161536 179812 209330 219766 221937 215984 190737 217529
14020B17529K1419K4233M8755K2339M7221L3701J8386O4149O8900L6240M5400
$$ 217529 238948 263181 311936 334275 381496 415197 433583 497732 566632 602872 648272
14009F48272P1888J29860J51648K32666K58392L70659M31119K00319j04346l7251
$$ 648272 720160 850020 1001668 1234334 1492726 1863385 2294504 2494823 2390477 2353226
13999B353226J41565P1503k53070l83265k03564n9814n4778l5715l5657l6512
$$ 2353226 2494791 2566294 2313224 1929959 1726395 1666581 1611803 1576088 1540431 1503919
13989A503919N4406J67390K23442K15569J60116J15482J44229K25509K51280K59942
$$ 1503919 1558325 1725715 1949157 2164726 2324842 2440324 2584553 2810062 3061342 3321284
13979C321284L30601L66745M76196O58087Q40590R16565R03690J023377J213379
$$ 3321284 3651885 4018630 4494826 5152913 5993503 6910068 7813758 8837135 10050514
13970A0050514J683468K311787K859531L566263N015456P854275J3074424K2565415
$$ 10050514 11733982 14045769 16905300 20471563 25487019 33341294 46415718 68981133
13962F8981133L8671634O0953689P6604973O1355005J3925196k4848758o1533278
$$ 68981133 107652767 168606456 245211429 306566434 320491630 295642872 234109594
13955B34109594o9698414m5965936k7449243j7312745j1683278q188383n821780
$$ 234109594 164411180 118445244 90996001 73683256 61999978 53811595 47989815
13948D7989815m152015k991916k530060k435105k572897k923360l121634l137694
$$ 47989815 43837800 40845884 38315824 35880719 33307822 30384462 27262828 24125134
13940B4125134k977464k801379k393644j919414j612577j347014j128992r79868
$$ 24125134 21147670 18346291 15952647 14033233 12420656 11073642 9944650 8964782
13932H964782q46258o97608n38135m60179m93660m66367m59741m44499m08578
$$ 8964782 8118524 7420916 6882781 6422602 5928942 5462575 5002834 4558335 4149757
13923D149757l39464k98264k31141j94824k08828k38372k33247k39482k33763
$$ 4149757 3810293 3512029 3280888 3086064 2877236 2638864 2405617 2166135 1932372
13914A932372k01873j69200j45294j32967j04405o8069o5674o6651m8098l6644
$$ 1932372 1730499 1561299 1416005 1283038 1178633 1110564 1044890 978239 930141 893497
13904H93497n7585n4582l2285R989R239L162o292m9583l3636K5924q948n0260
$$ 893497 835912 781330 749045 759034 768273 771435 765143 715560 681924 707848 698900 648640
13892F48640m3345j9137O221o902j7568o622J4903j2137j8573k5925k5681k8696
$$ 648640 605295 586158 592379 585477 567909 561287 576190 564053 545480 519555 493874 465178
13880D65178k8723k9254J5555l061j5170P670j676J552j7523l7667k8988J6853
$$ 465178 436455 407201 422756 419695 404525 412195 410519 412071 394548 356881 327893 344746
13868C44746K0330J5451L170P830L467q642r812j4898l1001k9399j7485m3072
$$ 344746 365076 380527 383697 391527 394994 386352 376540 361642 330641 301242 283757 240685
13856B40685r47q670j4812J1910j3301L3722K3213j8403k7138l9036J251p665
$$ 240685 239738 231068 216256 228166 214865 248587 271800 253397 226259 187223 188474 180809
13844A80809J9194J8554p289J050J7957J9884M9292P0742P4106M9856L3687L7362
$$ 180809 200003 218557 211268 212318 230275 250159 299451 370193 444299 494155 527842 565204
13832E65204K0830J9730M725o3369r4184q1798o9546m7563m5498R197K27j9909
$$ 565204 586034 605764 610489 547120 452936 371138 301592 254029 208531 217728 217955 198046
13820A98046k0410M02q936l509r904l481R884L3379J4462l7187o129N589l3780
$$ 198046 177636 178038 169102 165593 155689 152208 162092 195471 209933 172746 166617 172206 138426
13807A38426J0773J8096J7586j9363m176J8404J8608R391m6338k8653j7677N210
$$ 138426 149199 167295 184881 165518 161342 179746 198354 207745 161407 132754 115077 120287
13795A20287k0433J33p380R833K1202L793j837K7767Q924q802j4620k2480k5908
$$ 120287 99854 99987 92607 102440 123642 127435 125598 153365 162289 153487 138867 116387 90479
13782I0479r048j3765K2276M284J574j6934j9006R815k6163k1052l256M5229N7525
$$ 90479 81431 67666 89942 94226 95800 78866 59860 69675 43512 22460 19204 64433 121958
13769A21958L4800K6311j0297J569k2896k5126j8060J6190N351p316r315J818
$$ 121958 156758 183069 172772 174341 151445 126319 108259 124449 129800 122484 113169 114987
13757A14987k2726m691j1351k4702R120J845j4560m858J6731J9803k584J1121
$$ 114987 92261 87570 76219 51517 60637 62482 47922 43064 59795 79598 77014 88135
13745H8135l5190k1023j3926M5441L8518r666j7546k9780k162Q82j1846j1743
$$ 88135 52945 31922 17996 63437 101955 92289 74743 44963 42801 43683 31837 20094
13733B0094m362J1460K537k7535K9123N6004J1548r764k0111j8404J4319r340
$$ 20094 15732 27192 29729 2194 31317 87321 98869 89105 68994 50590 64909 55569
13721E5569n922J1705l2448k7198K5291L1041K0892K7948j179m1018J544k6061
$$ 55569 49647 61352 28904 1706 26997 58038 78930 106878 105699 64681 66225 40164
13709D0164j1168L0629J199M789j9233k5019p361K9546J7564L357O658J5983p169
$$ 40164 28996 59625 60824 65613 46380 21361 14000 43546 61110 64467 71125 87108 79939
13696G9939l720q975L082K2273J9290o524m809j9943j400r143O522n357k0673
$$ 79939 76219 67244 70326 92599 111889 105365 100556 80613 79213 70070 76592 71235 50562
13683E0562K8238K0474P781k5534M476j923k9966j2122J1030p423r290m547j2538
$$ 50562 78800 99274 107055 81521 85997 84074 54108 41986 53016 45593 36303 31756 19218
13670A9218k92M5254L2017j0857l4449r761r555J541J1j7612k4298k9860O193
$$ 19218 18926 64180 96197 85340 50891 41130 31575 33116 33127 15515 -8783 -38643 -32450
13657c2450J9130k7681j1622J881k1684J9116J7938o716J937K6418L4565L8884
$$ -32450 -13320 -41001 -52623 -50742 -72426 -53310 -35372 -42088 -40151 -13733 20832 59716
13645E9716K3870O274k2782k2723O915M648j7990K6183Q438l1324k3073j7674
$$ 59716 83586 89860 67078 44355 51270 55918 37928 64111 72549 41225 18152 478
13633D78N694k629N448K5550J9910K287K0860l2572m4880r977J139J1532P069
$$ 478 6172 3543 8991 34541 54451 56738 77598 45026 146 -9831 -8692 2840 9909
13620I909K733M928N79k8214Q59J9025Q796M456l932L9307L0819o412l7420j4158
$$ 9909 12642 17570 18149 -10065 -9206 9819 18615 23071 19139 58446 89265 82853 45433 31275
13606C1275j9044k7889K3578J7137L7978J0259j3255j1076j0917j4775j2487N715
$$ 31275 12231 -15658 7920 25057 63035 73294 60039 48963 38046 23271 10784 16499
13594A6499l914j0628O213J618p107L1492L6612m159m2311M039j163K265M457
$$ 16499 12585 1957 8170 9788 2681 34173 70785 66626 24315 28354 27191 29456 33913
13581C3913j9763j4395J8252m871j0579l488p245p029O58P873J9566L7948l055
$$ 33913 14150 -245 18007 13136 2557 -931 -8176 -15205 -14547 -6674 12892 50840 47785
13568D7785l7586J3772L7690j8668k2813P919J2241j5990l349l7059R465o917
$$ 47785 10199 23971 61661 42993 20180 28099 40340 24350 21001 -16058 -6593 -13510
13556a3510K9882J9459j9879N814k155n460J0090j0192k1909n0977j5166J8348
$$ -13510 16372 35831 15952 21766 19611 14151 24241 14049 -7860 -58837 -74003 -55655
13544e5655J1646K5135O404j2152J2147L116j3720K1285K7599K8248N664k5402
$$ -55655 -44009 -18874 -12470 -24622 -12475 -9359 -23079 -1794 25805 54053 59717 34315
13532C4315q878n367r248j4817l5116P736P563P902J2676L4286k849o485J7801
$$ 34315 25437 20070 10822 -3995 -39111 -31375 -23812 -15910 -3234 31052 28203 21718 39519
13519C9519m935Q910J7171j9492K273m303K8341J3453Q08k7106J530p650r560
$$ 39519 34584 43494 60665 41173 43446 39143 67484 80937 81745 54639 56169 48519 38959
13506C8959M659N500M624J1916L568j4891L96J0470m207r745j0827k3482p622
$$ 38959 43618 49118 53742 65658 69226 54335 54731 65201 60994 51249 40422 16940 9318
13493I318l703J7246k839j3185k1811J6037R068J4102J1309J5083J9294L796J7177
$$ 9318 5615 22861 20022 6837 -14974 1063 10131 24233 35542 50625 69919 73715 90892
13480I0892j6223L8707J9348P391M6007Q6150J68469K98876L73445L85021K67127
$$ 90892 74669 113376 132724 140115 186122 272272 440741 739617 1113062 1498083 1765210
13469A765210R4k12884l60764l72962k05585j11265q6367n9032l0886k2659j9291
$$ 1765210 1765304 1552420 1191656 818694 613109 501844 415477 356445 325559 302900 283609
13458B83609k3574l2128l1885l1343k9539L993K416k4616k4408J2723k0720m0175
$$ 283609 260035 227907 196022 164679 135140 139133 141549 116933 92525 105248 84528 44353
13446D4353j3541j0749K381q81J2226R274J0661J1959N073j9388j8766l731j1016
$$ 44353 30812 20063 22444 21563 33789 43063 53724 65683 70756 51368 32602 28871 17855
13433A7855m059k1651O262J8436M7561r075M874J1224p258j5798k2523k4869R283
$$ 17855 13796 -7855 -1593 16843 64404 55329 60203 71427 64169 48371 25848 979 10262
13420A0262J4682K326p926k753J9512O165k5585p428J0207n44k8444k4498M360
$$ 10262 24944 27270 19344 16591 36103 42268 16683 9255 19462 18918 -9526 -34024 -29664
13407b9664M805L990L298l617r578j3098J9209O542r646J9068R675k6687k7053
$$ -29664 -24859 -20869 -17571 -21188 -30766 -43864 -24655 -18113 -27759 -8691 984 -25703 -52756
13394e2756o05K4255K612L591k3113N60N0526K9062j8016j7083j1586k927R950
$$ -52756 -53361 -29106 -26494 -22903 -46016 -45456 5070 34132 16116 -967 -12553 -15480 -5530
13381e530J1404K4876K0532m775j4128j5122j0610R414N02K2274j3538l4004j0859
$$ -5530 5874 30750 51282 46507 32379 17257 6647 16061 16563 38837 25299 -8705 -19564
13368a9564k0179j6714O855K0865j459J1298J2837K605R736j452j0488L7901Q394
$$ -19564 -39743 -56457 -49602 -28737 -30196 -18898 -6061 -3456 6280 4828 -5660 32241 40635
13355D0635j1020j0200k707l9910j4719L008l67P353J3407J5557O199n814J1842
$$ 40635 29615 19415 16708 -23202 -37921 -34913 -35280 -27927 -14520 1037 7236 1422 13264
13342A3264M2736N489l6129j3363n13l0974M823j618J5599q001q920J4282P025
$$ 13264 56000 61489 25360 11997 11484 -19490 -14667 -16285 -686 -8687 -17607 -3325 3700
13329C700J1232R986j3458q027j990P882J904K1215j5380j093J9252j3000j422
$$ 3700 14932 24918 11460 3433 1443 9325 11229 32444 17064 15971 35223 22223 20801
13316B0801l985J9077J8673K355M956p319k2568r933R166p363J0299j5535R721
$$ 20801 16816 35893 54566 56921 61877 54558 31990 22057 31223 23860 34159 18624 28345
13303B8345K7405J5308k8574k6158j4180q165J8283k174K5418j2017l2693j6875
$$ 28345 55750 71058 42484 16326 2146 -6019 12264 10090 35508 23491 -9202 -26077
13291b6077K2275O74J291M965j3422l5055k979K1822J0915M344K3846O26l192
$$ -26077 -3802 -3128 -1837 3128 -10294 -45349 -48328 -26506 -15591 -11247 12599 13225 10033
13278A0033K2331j7516k5744r969j265L940J1528K0825N3899J5819k7281n4015
$$ 10033 32364 14848 -10896 -20865 -22130 -18190 -6662 14163 68062 83881 56600 2585
13266B585k4821J1778K5573O554p88r698K933M443J6373p005k4265l3374Q706
$$ 2585 -22236 -10458 15115 21669 20881 11183 14116 18559 34932 27927 3662 -29712 -21006
13253b1006M0971M138J3062l1758q447k1287l5708L3215N1688K1424j6760k2914
$$ -21006 19965 24103 37165 5407 -3040 -24327 -60035 -26820 24868 46292 29532 6618
13241F618l2163q959m729J7114j0414K4735J6668k940p049N948j1182o946N163
$$ 6618 -25545 -34504 -39233 -22119 -32533 -7798 8870 5930 -1119 4829 -6353 -13299 -8136
13228h136J9894P056K320j8750n795j1781k9529k188J7100K867J5765R188m529
$$ -8136 11758 18814 21134 2384 -3411 -15192 -44721 -46909 -29809 -26942 -11177 -1989 -6518
13215f518j0566p022J0047O71r696j6503O139K7508J9465p378m0710J4753L12
$$ -6518 -17084 -24106 -14059 -13388 -23084 -39587 -33448 -5940 13525 6147 -34563 -19810 -19498
13202a9498J6673N261R976J218l52L685J8671j175l780n26j0017k8990J5420P52
$$ -19498 -2825 2436 12412 13630 13278 16963 35634 34459 30679 30153 20136 -8854 6566 7318
13188G318L6122N99n2381j7511L143k6386J4509K2392n641k1459k7679j2053J7494
$$ 7318 43440 44039 -8342 -25853 -22710 -49096 -34587 -12195 -17836 -39295 -66974 -79027 -61533
13175f1533K3368Q530J5134j2135j2970j1257K7684K7851J1410N062k4253k1483
$$ -61533 -38165 -29635 -14501 -26636 -39606 -50863 -23179 4672 16082 21144 -3109 -24592
13163b4592K9578K6638j9964j7961O084o672k7971j7794J4270J5345J216j8175
$$ -24592 4986 31624 11660 -6301 -217 -6889 -34860 -52654 -38384 -23039 -21823 -39998
13151c9998K984L3218j1088k1460j7536J5316p93J5456J8976j512Q802O859p720
$$ -39998 -37014 -3796 -14884 -36344 -53880 -38564 -39357 -23901 -4925 -6437 2365 9224 1504
13138A504K909J6238n095m061j8250k4830K815K9235K4207k883R92j1110k6853
$$ 1504 4413 20651 15556 11495 -6755 -31585 -28770 465 24672 21789 22781 11671 -15182
13125a5182K8326J4496k8745l8761j5955L651J5426m60K772j4815j9184R761j1785
$$ -15182 13144 27640 -1105 -39866 -55821 -52170 -36744 -37204 -34432 -49247 -68431 -58670 -70455
13112g0455k412j363j5380J7651N9752N4359k6638k5650k2365J3413J2254J3630
$$ -70455 -72867 -74230 -89610 -71959 -12207 42152 15514 -10136 -32501 -19088 -6834 6796
13100F796Q043K0623r372K70j8257j1235p310k8691j5075J0327M1210L5949j2621
$$ 6796 14839 35462 26090 26360 8103 -3132 -10442 -39133 -54208 -43881 -2671 33278 20657
13087B0657r586q571L0622p307n2172J3468M091j1383J157K5721j1725n85K2523
$$ 20657 11071 2500 33122 25815 -26357 -12889 -8798 -20181 -19024 6697 -5028 -5613 16910
13074A6910J5399R951j526j2529k7409j9898K373O868j4499P423r00L4345P395
$$ 16910 32309 42260 40734 28205 796 -19102 -16729 -9861 -24360 -16937 -17837 16508 23903
13061B3903j5903k4372n615R1K4730O402j0398l652q177j6517j6241k0023J7518
$$ 23903 8000 -16372 -21987 -21896 2834 9236 -1162 -4814 -12991 -29508 -45749 -65772 -48254
13048d8254k1990J2329K601M012j164J1429j5790j075L1186L1797j0795O407J8154
$$ -48254 -70244 -57915 -55314 -51302 -52466 -41037 -56827 -57902 -26716 5081 -5714 693 18847
13035A8847j352R65m848k2096Q77R102n427j6032K966K6793j6610k0613J0680
$$ 18847 17495 18460 13612 -8484 -7607 1495 -3932 -19964 -16998 9795 -6815 -27428 -16748
13022a6748J4486M7236J8991j8892m465j0481q61l958J0347j379k6506m403M83
$$ -16748 -2262 44974 63965 45073 40608 30127 29266 25308 35655 34276 7770 3367 3850
13009C850j1940n469p02q458J2057J3899k7236j6406J8740J6856k8046l880O36
$$ 3850 -8090 -13559 -14261 -22719 -10662 3237 -23999 -40405 -21665 -4809 -32855 -36735 -36099
12996c6099Q546M4771K0962l0205k3615J0596l202p286o248j2901K3538O064j5121
$$ -36099 -27553 17218 38180 7975 -15640 -5044 -8246 -15532 -21780 -34681 -11143 -5079 -20200
12983b0200J0259K583k0371l1489o577Q889J6161k70o056k946L879j366M0778
$$ -20200 -9941 -7358 -27729 -59218 -65795 -56906 -40745 -41015 -47071 -50017 -46138 -47504 -6726
12970f726K0854J0148q769j5553n510K96J0173K1153j7254L341Q885j8276k0816
$$ -6726 14128 24276 15507 -46 -5556 -5260 4913 26066 8812 12153 21038 2762 -18054
12957a8054k7443j3236J5254K0331K3950J4756j7850p726L4594q946l2125k0043
$$ -18054 -45497 -58733 -43479 -23148 802 15558 -2292 -10018 24576 15630 -16495 -36538
12945c6538Q344r703q753P697J0880J9400N859L4406j1131j9438l3054J3017L9882
$$ -36538 -28194 -37897 -46650 -38953 -28073 -8673 -2814 31592 20461 1023 -32031 -19014 20868
12932B0868K8377J3498k1048j5261j5127K2900k9563l913P109j9451o185J3859
$$ 20868 49245 62743 41695 26434 11307 34207 4644 731 7840 -11611 -17796 -3937
12920c937J7264k2696j3995O723K1378R93j4706n346j4054l3307N262J8641L0866
$$ -3937 13327 -9369 -23364 -16641 4737 5730 -8976 -14322 -28376 -61683 -56421 -37780 -6914
12907f914K1450j9587n972l329j4630O719Q4K636R26O133O994m513J9793j652
$$ -6914 14536 -5051 -11023 -14352 -28982 -22263 -22179 -19543 -18617 -12484 -5490 -10003 9790 8138
12893H138K404J0143j8903k44J4849R618K0100n11l3085J1415K5413N828k1106
$$ 8138 10542 20685 1782 1538 16387 26005 46105 45594 12509 23924 49337 55165 34059
12880C4059j8756k9621j0257j9433j106N7146J6597j3403k5224J7858K928J9448
$$ 34059 15303 -14318 -24575 -44008 -45114 12032 28629 15226 -9998 7860 10788 30236
12868C0236r259j676L945M614J1293r630j0734N0K894j0630N624J4779l1921p846
$$ 30236 20977 19301 23246 27860 39153 29523 18789 18839 21733 11103 16727 31506 -415 -8261
12854h261k323J3831J159N834p595J2956p537J8576J0708j4279j8350p621J8360
$$ -8261 -10584 3247 4406 10240 2645 15601 8064 26640 37348 23069 4719 -2902 15458
12841A5458N489O84n517k0344o166K7621q182J913j0370k9779k3374K4094J7755
$$ 15458 20947 21631 16114 -4230 -10396 17225 9043 10956 586 -29193 -52567 -28473 -10718
12828a0718J4729J5133J5626K4787r364j5994R438k991k3006k0155j6817J4846
$$ -10718 4011 19144 34770 59557 50193 34199 43637 40646 17640 -2515 -19332 -4486
12816d486j0782k185j5578J5892L7482K260O885L8490k2454o2811j716l053o909
$$ -4486 -15268 -17453 -33031 -17139 20343 22603 29488 67978 45524 -17287 -19003 -22056 -28965
12803b8965Q997J8175K2781j191l801K2036k0355l3967q27L1750L1937m253j689
$$ -28965 -19968 -1793 20988 19797 15996 38032 17677 -16290 -17117 14633 46570 42317 40628
12790D0628J505j1926l8778j7566L490j1648l546J7228J3793N161K0520K325q34
$$ 40628 42133 30207 -8571 -26137 -22647 -34295 -37841 -20613 -6820 -1659 18861 21186 20352
12777B0352j5678j2789k46j6750l532K3714L6506R195K2954o77l2360r709k5045
$$ 20352 4674 -8115 -8361 -25111 -28643 -4929 31577 40772 63726 63049 30689 20980 -4065
12764d065k1077J8833q235q91N132j9633m65K4288L5926o496m2465j6109L6278
$$ -4065 -25142 -6309 -14544 -15435 -10303 -29936 -30401 -6113 29813 23317 -19148 -35257 1021
12751A021J9011n1963r553J0356J5459J4360q242p170k5626k6408J3867K9826
$$ 1021 20032 -31931 -41484 -31128 -15669 -1309 -9551 -16721 -42347 -68755 -54888 -25062
12739b5062M3438Q969J8837J3349k4274n682N089j5502j8211L2775j3003l8283
$$ -25062 18376 27345 46182 59531 35257 29575 34664 19162 951 33726 20723 -17560
12727a7560J5176R364J1867L691J0255J0263O813j4344k3734j9699k5577j1895
$$ -17560 -2384 6980 18847 22538 32793 43056 49869 35525 11791 -7908 -33485 -45380
12715d5380Q442K5088J8203J8203p608m0390j9023r249j3909j2620K3558L7586
$$ -45380 -36938 -11850 6353 24556 16948 -23442 -42465 -51714 -65623 -78243 -54685 -17099
12703a7099K7217o163J3234q841K01j7112M361N303k7817k8261Q147K0147N5192
$$ -17099 10118 3955 17189 8348 8549 -8563 -4202 1101 -26716 -54977 -46830 -26683 28509
12690B8509l642k566j1345m881o976R628j3676k3198j1781K0026Q528p497K934
$$ 28509 24867 22301 10956 6075 -901 8727 -4949 -28147 -39928 -19902 -11374 -18871 -15937
12677a5937L4316J1758P614j7079l4952j7506J5506J1185p4J0210K1176J7918
$$ -15937 18379 30137 37751 20672 -14280 -31786 -16280 -5095 -5169 5041 26217 44135
12665D4135k085j767n613m250n036P47k6953M05O579J52K94k1361l3666K4117
$$ 44135 42050 40283 34670 30420 25384 26131 -822 -417 6162 6314 6608 -14753 -48419 -24302
12651b4302J346J6117r940j3586J6799J6412J8891O339l2897j7184M7008J9158
$$ -24302 -22956 -6839 -16779 -30365 -13566 2846 21737 28076 -4821 -22005 25003 44161
12639D4161j9161J3897n905j3260k6513j0898j5529q756J3276R391P000K661j9896
$$ 44161 25000 38897 32992 19732 -6781 -17679 -33208 -41964 -28688 -19297 -12297 -9636 -29532
12626b9532r374K5927N1205K7418J9601M729J7495L081k1074n0297J84j3917k8588
$$ -29532 -38906 -12979 38226 65644 85245 89974 107469 110550 89476 39179 39363 25446 -3142
12613c142k707L0543J058j2577P850K9675K0455k5406k8440j6369J2510M25J1655
$$ -3142 -5849 24694 25752 13175 21025 50700 71155 45749 17309 940 13450 13875 25530
12600B5530J9023j9205o578k7739k0696L004L7251m2316j2689L4835K4759k2418
$$ 25530 44553 25348 18770 -8969 -29665 -26661 10590 -31726 -44415 -9580 15179 -7239
12588g239P584K1762K8877L3685k1966l8041O116o670j0992l023j2514m05M269
$$ -7239 345 22107 50984 84669 62703 24662 30778 24108 13116 10093 -2421 -2826 1443
12575A443J8565R246k8231j6851j3969L978l60k6266n188J2045K4343K3602j5243
$$ 1443 20008 29254 1023 -15828 -29797 -25819 -26179 -52445 -57633 -45588 -21245 2357 -12886
12562a2886J3811J9033K2499k744j4258L887j8900j3572J423N268k226j2676Q55
$$ -12886 925 19958 42457 39713 25455 29342 10442 -3130 -1707 3561 1335 -11341 -10486
12549a0486L4685J9216K100j3129k8162J3426L6054Q75r922l7214l5609O814J4548
$$ -10486 24199 43415 45515 32386 4224 17650 53704 54579 44657 7443 -28166 -21352 -6804
12536f804J3267r527j1933k036K4702M781p575p865j3782o393L528J2337j7915
$$ -6804 6463 -3064 -14997 -17033 7669 12450 4875 -2990 -16772 -23165 -19637 -7300 -25215
12523b5215J8123o2J541k995j998K6061L3793L758j54K4373k4469n146j7533j7211
$$ -25215 -7092 -7154 -5613 -8608 -10606 15455 49248 53006 52852 77225 52756 47610 30077 12866
12509A2866R284o138j20L470l5684k0744K0872K611o98L416K0550j6699k2188
$$ 12866 22150 16012 15892 19362 -16322 -37066 -16194 -13583 -14281 -10865 9685 -7014 -29202
12496b9202k6967N855K1057P955K8976K0447l6602J2339K1607o117k1466k0842
$$ -29202 -56169 -50314 -29257 -21302 7674 28121 -8481 3858 25465 19348 -2118 -22960
12484b2960k1203l193J5218k2861k3308P168K8639L619R75N1965J2141j595N709
$$ -22960 -44163 -47356 -32138 -54999 -78307 -71139 -42500 -38881 -37906 14059 26200 24605 30314
12471C0314m58R722k647R319j428j0083j9952j7959l6223J5l397o042M395j1316
$$ 30314 29856 39578 36931 46250 44822 34739 14787 -3172 -39395 -39380 -42777 -48819 -44424 -55740
12457e5740K485p974Q059N895Q720L2067K7725L244o507m170k3235j9509j4152
$$ -55740 -53255 -61229 -53170 -47275 -38555 -6488 21237 24481 17974 13804 -9431 -28940 -43092
12444d3092p298k096L4179J5233P935K4778p20J3521n356l7521m805r781L443
$$ -43092 -50390 -52486 -18307 -3074 4861 29639 28919 42440 37084 -437 -5242 -15023 -11580
12431a1580K5341m645m07k6581r288K4602L7404J0237j4331k1577k5526J9911
$$ -11580 13761 9116 8709 -17872 -27160 -2558 34846 45083 30752 9175 -16351 3560
12419C560N3854k3847l7846r700Q05k363j1161J0523J6945k3842j2131j6075M126
$$ 3560 57414 33567 -4279 -13979 -13174 -15537 -26698 -16175 770 -23072 -35203 -51278 -47152
12406d7152K8562m81p647K6391J9376J3425P333N968K553j9637J406J1975k1773
$$ -47152 -18590 -19071 -26718 -327 19049 32474 39807 45775 48328 28691 30097 42072 20299
12393B0299K1036j0044J529Q183l287n559j9817j486R197L468J5036Q185r683
$$ 20299 41335 31291 32820 41003 37716 32157 12340 10854 20051 23519 38555 46740 37057
12380C7057l2168n4818L3126L5724J8692M0236m276l7152k1948k2864k7973L1727
$$ 37057 4889 -49929 -16803 18921 37613 77849 73573 36421 14473 -8391 -36364 -4637
12368d637M7762N097J1336l4246l2167j1277k845J7249K2595r807k2717k618M265
$$ -4637 43125 48222 59558 25312 -6855 -18132 -20977 -3728 18867 9060 -13657 -16275 -12010
12355a2010k4499J1202j0044l882L2823K4162q647k396m790l74L8076P33m117
$$ -12010 -36509 -25307 -35351 -39233 -6410 17752 9105 6709 1919 1545 39621 40354 36237
12342C6237l6635j4013k0703l797M301J813Q550j5771L512P392j1806n132L0634
$$ 36237 -398 -14411 -35114 -38911 -34610 -32797 -24247 -40018 -36506 -29114 -40920 -46052 -15418
12329a5418K2661j068r313l0877L474J0761K8428j6084J0193O486k0021j6506
$$ -15418 7243 6175 -3138 -34015 -30541 -19780 8648 -7436 2757 9243 -10778 -27284
12317b7284O416k0282J4915K4022L128J718J4604R740R977k7428j9671N920M073
$$ -27284 -20868 -41150 -26235 -2213 915 2633 17237 26977 36954 9526 -10145 -4225 -152
12304a52R313m065M626m453Q057K1601J0746K7847j9991p0002P32J6355l833J7933
$$ -152 9161 5096 9722 5269 13326 34927 45673 73520 53529 -16473 -15741 614 -3219 14714
12290A4714j1828m6579P650M0586J1005N84J6518k3411j9891j6447K4147j8884
$$ 14714 2886 -43693 -36043 4543 15548 16132 32650 9239 -10652 -27099 -2952 -21836
12278b1836q752l436k8910J5048K4986R330k8550j1408p910K1824K0327j3068
$$ -21836 -30588 -34024 -62934 -47886 -22900 -13570 -42120 -53528 -61438 -39614 -19287 -32355
12266c2355j8356J679r818k497K5621K5245J0313n261m50j1259L126M238r769
$$ -32355 -50711 -49032 -58850 -61347 -35726 -10481 -168 -5429 -5879 -17138 -14012 -9774 -19543
12253a9543k158J9753P547K4826L661k6014J733M802J2196L281j3013r627k4267
$$ -19543 -21701 -1948 5599 30425 34086 8072 9805 14607 26803 30084 17071 7444 -16823
12240a6823J6630J0183n30l8518j4702J9623K5293J8542j7973k1842p585L588
$$ -16823 -193 9990 9460 -29058 -43760 -24137 1156 19698 1725 -20117 -27702 -24114
12228b4114l9570J2456j7428K7100K8899L619J1494j9482k7708K146K2612J275
$$ -24114 -63684 -51228 -68656 -41556 -12657 -9038 2456 -17026 -44734 -42588 -19976 -18701
12216a8701l103r584k4033k871J1943L671J5812J4324J0118K141R69K5231O230
$$ -18701 -21804 -31388 -55421 -58292 -46349 -42678 -26866 -12542 -2424 -283 686 25917 32147
12203C2147p482n992J0463J2777j0600k9419J6321j6935k578P924K5125k3900
$$ 32147 24665 18673 29136 41913 31313 1894 18215 1280 -1298 6626 31751 7851
12191G851k5103J4130O87j7602K2790J1715k8442Q462j7413k3448j040J2057M801
$$ 7851 -17252 -3122 -2435 -20037 2753 14468 -13974 -5512 -22925 -46373 -47413 -35356 -30555
12178c0555R774J0777j4440R974J6321P748j0387p097J1641O20q366j4730L541
$$ -30555 -20781 -10004 -24444 -14470 1851 9599 -788 -7885 3756 4376 -3990 -18720 -15179
12165a5179J1431R566l4100J296j2092K0627J5425n381J354Q49l545J8304M01
$$ -15179 -3748 5818 -28282 -26986 -39078 -18451 -3026 -8407 -7053 -6204 -9749 8555 8956
12152H956j5198O84J3414J1299k9275O213J768M859R65k0639m846K9320J2476
$$ 8956 -6242 -5558 7856 19155 -10120 -3907 -2139 2720 3685 -16954 -21800 7520 19996
12139A9996r762l1309M058L0462L801K024L3897o592l2914l3452m5337K1275M1463
$$ 19996 10234 -21075 -17017 13445 17246 19270 53167 46575 13661 -19791 -65128 -43853 -2390
12126b390j3652J0667J9627k8107l3210j2912P512J9489q314K2168M296n076J2069
$$ -2390 -16042 -5375 14252 -13855 -47065 -59977 -52465 -32976 -41290 -19122 -14826 -19902 -7833
12113g833K5878j2150m1498J4044K9199l0215l3928L5977K1545k75l5237j5908
$$ -7833 18045 5895 -35603 -21559 7640 -22575 -56503 -20526 1019 744 -34493 -50401
12101e0401K2367J8871k264l7409j7033J7386K7245J0937Q317j1759n079K2179
$$ -50401 -28034 -9163 -11427 -48836 -65869 -48483 -21238 -10301 -1984 -13743 -18822 3357
12089C357m981N81K2512J11j9351q707m754O091j0286M1407L6289k1344j6278
$$ 3357 -1624 -1043 21469 21580 2229 -6478 -11232 -5141 -15427 25980 62269 40925 24647
12076B4647J5676j3274k8553r675n950J3841Q018K213J617j0178J5844p779k7634
$$ 24647 40323 27049 -1504 -11179 -17129 -3288 4730 6943 8560 -1618 14226 6447 -21187
12063b1187j3759m78J5432K2257J7225k4765p792r699J1606K1607r38l762K6477
$$ -21187 -34946 -35424 -19992 2265 19490 -5275 -13067 -22766 -11160 10447 9509 5747 32224
12050C2224k5005k5914l3359K1319K5709j3441J351J2475M251j4518j5856q478
$$ 32224 7219 -18695 -52054 -30735 -5026 -18467 -17116 -4641 -390 -14908 -30764 -39242
12038c9242P967k867K4428m295Q218k822n279L6819N01k7416M941J1435J5844
$$ -39242 -31275 -34142 -9714 -14009 -5791 -8613 -13892 22927 23428 -3988 953 12388 28232
12025B8232K4164l4122M150J4590k1122N696j992l5039q350P556k87n918O929
$$ 28232 52396 18274 22424 37014 15892 21588 19596 -15443 -23793 -16237 -16524 -22442 -15513
12012a5513j1393k3394j5134J3740M6498m038l0319K172J5267N013k076J938j2674
$$ -15513 -26906 -50300 -65434 -51694 -5196 -9234 -39553 -37381 -22114 -17101 -19177 -17239 -29913
11999b9913p381K2444k476J865n760j399K715l0109q794K3284o501j7006k1118
$$ -29913 -37294 -14850 -17326 -15461 -21221 -22620 -19905 -50014 -58808 -35524 -42025 -59031 -80149
11986h0149l327j4168K9020K7033J3215J153J1257k7906l5895J1992L007M5588
$$ -80149 -83476 -97644 -68624 -41591 -28376 -27223 -15966 -43872 -79767 -67775 -64768 -19180
11974a9180r115m216p698J529N485J3961J1236n521O58J3258J7317J6324j4191
$$ -19180 -28295 -32511 -40209 -38680 -33195 -19234 -7998 -13519 -12861 397 17714 34038 19847
11961A9847j0627j0974K374k750J0501q553m973O432M2884J3059q522j3415l7072
$$ 19847 9220 -1754 620 -2130 8371 -182 -5155 1277 44161 57220 48698 35283 -1789
11948a789j9262k816K020j4723K6782K7092o696l5875p938n772o02J9560K0182
$$ -1789 -21051 -23867 -21847 -36570 -9788 17304 10608 -25267 -33205 -38977 -39579 -20019 163
11935A63l66J7201J1590l2854Q772L5727p237j5375l896l2251n700r226Q045J4011
$$ 163 -203 16998 28588 -4266 4506 40233 32996 17621 13725 -18526 -24226 -33452 -25407 -11396
11921a1396n5440m8778K2652K6199l695K7559J9329j297j328j6251J5939o423
$$ -11396 -66836 -115614 -92962 -66763 -70458 -42899 -23570 -24867 -26195 -42446 -26507 -32930
11909c2930m762l514r732j5142K8982N5452L0578J366r069n540L6720k8338l6547
$$ -32930 -37692 -41206 -50938 -66080 -37098 18354 48932 50298 41229 35689 72409 44071 7524
11896G524K5205N654j8027P20P985p117J9431L80n776j5913m055J2257k0890K72
$$ 7524 32729 38383 20356 21076 29061 21944 41375 41755 35979 20066 16011 28268 7378 7650
11882G650O42m847k2827m2428J1491L8622L1441N828j5165J3960R31j3816N331
$$ 7650 8292 3445 -19382 -61810 -50319 -11697 19744 25572 10407 24367 25298 11482 16813
11869A6813n255k7133j0453n870L807Q389j3532l2085P036J8511K6296l779k6995
$$ 16813 11558 -15575 -26028 -31898 -28091 -19702 -33234 -65319 -58283 -39772 -13476 -17255 -44250
11856d4250j3702j519N9827L4829j7141m3672o454J4632L8049p404j1345m087
$$ -44250 -57952 -59471 356 35185 18044 -25628 -32082 -17450 20599 13195 1850 -2237
11844b237Q743K3175j1013k6388l9599J3179N492k843P92N269R834K2864R72N381
$$ -2237 6506 29681 18668 -7720 -47319 -34140 -28648 -31491 -30699 -25430 -15596 7268 8240 13621
11830A3621k2008Q006k919l6660N286L1282K3701j4374l8472O226M6144J0984
$$ 13621 -8387 -381 -3300 -39960 -34674 -3392 20309 5935 -32537 -26311 19833 30817
11818C0817O283j017J437M024l2923Q484J6237p210j9414k2982J5732J9430j4106
$$ 30817 37100 36083 37520 41544 8621 17105 33342 26132 6718 -16264 -532 18898 4792
11805D792k2049j2540l547K0794J0728J2989J086p882k4680k9375J0119O571k2223
$$ 4792 -17257 -29797 -33344 -12550 -1822 11167 12253 4371 -20309 -49684 -39565 -32994 -55217
11792e5217J444J4116M059K1696j1064R567O065k0414o690L2135J348j2659O797
$$ -55217 -53773 -39657 -35598 -13902 -24966 -15399 -9334 -29748 -36438 -4303 -2955 -15614 -8817
11779h817N750Q58j4226J5776R906L3610K5922k2193j5297k0830o555k380J1440
$$ -8817 -3067 -2209 -16435 -659 9247 42857 68779 46586 31289 10459 3904 1524 12964
11766A2964n1451L232J8567M243J469k518l0390J3988K9198J8408O431k5408M089
$$ 12964 -38487 -35255 -16688 -12445 -10976 -13494 -43884 -29896 -698 17710 24141 -1267 2822
11753B822l237k0913j8064R849K0226L575j1094p869O217m566J8740O679K535
$$ 2822 -415 -21328 -39392 -29543 -9317 -5742 -16836 -24705 -18488 -23054 -4314 2365 4900
11740D900m1409l8670K978K5762J2262L6779j9248j9838j1788J9950L351M372
$$ 4900 -36509 -75179 -72201 -46439 -34177 2602 -16646 -36484 -48272 -28322 -24971 -20599
11728b0599Q99J3113j5841J0935m53J8052J4650l2203l5992J454l904P525K8551
$$ -20599 -19700 -6587 -22428 -11493 -11946 6106 20756 -11447 -47439 -45985 -49889 -42364 -13813
11715a3813j829j1754K7210K3541k261j504k7034L802m555K4725l0802j9005J8466
$$ -13813 -15642 -27396 -186 23355 21094 19590 -7444 -3642 -8197 16528 -14274 -33279 -14813
11702a4813K1555r007k1631K7515K0526j2382j5094K6418j0133q907q454k9146
$$ -14813 6742 -2265 -23896 3619 24145 11763 -3331 23087 12954 4047 -4407 -33553
11690c3553L873n400L0480L1300m5853j2785K6496M741k5955j1112O56J0773j0699
$$ -33553 -29680 -35080 -4600 26700 -19153 -31938 -5442 -701 -26656 -37768 -37112 -26339 -37038
11677c7038R224K409O459J664o615o446n132j7895j4185j759K7068L5480j3521
$$ -37038 -27814 -25405 -18946 -17282 -23897 -30343 -35475 -53370 -67555 -69314 -42246 -6766 -20287
11664b0287p221K6243J08k0834K0593o515j4409J2779j5875k6206K6981j4800
$$ -20287 -27508 -1265 -1157 -21991 -1398 -7913 -22322 -9543 -25418 -51624 -24643 -39443
11652c9443j2233M416J3830j3651j2675J3063K1385O704K1765j7440n032l136
$$ -39443 -51676 -47260 -33430 -47081 -59756 -46693 -25308 -18604 3161 -14279 -19311 -22447
11640b2447p711K6984P021k9916j7613j1583P78L6126K8250K3350j1316M458l007
$$ -22447 -30158 -3174 3847 -26069 -43682 -55265 -54487 -18361 9889 33239 21923 26381 23374
11627B3374j5797K6027J8806J6792k4901j9567m614q4Q325j3332j3643K533M0251
$$ 23374 7577 33604 52410 69202 44301 24734 20120 20036 28361 15029 1386 3919 44170
11614D4170J1441n460k0590j741L130k0823q760P072n898j6392N880J9823j7994
$$ 44170 55611 50151 29561 27820 30950 10127 1367 8439 2541 -13851 -7971 11852 -6142
11601f142j5282k8152m484M0784p451l6414j3056L2675L2515J8449j235q536L310
$$ -6142 -21424 -49576 -54060 -13276 -20727 -57141 -70197 -37522 -5007 13442 12207 3671 6981
11588F981M974L592m087j6959l3027J2389L4707Q663k0846Q345K3193j409p445
$$ 6981 11955 15547 11460 -5499 -38526 -26137 8570 17233 -3613 4732 27925 26516 19071
11575A9071j8687j079n141J7577J8786j636m961m752j0253p551K7976j3530q232
$$ 19071 384 -695 -5836 11741 30527 28891 23930 19178 8925 1374 29350 15820 7588
11562G588O753r548j3926J6661k2187Q051M0784J4599j7468j5879j0700m3964
$$ 7588 14341 4793 -9133 7528 -14659 -6608 34176 48775 31307 15428 4728 -39236
11550c9236o707L1915L4022j6821k9431k6829k329M3747P729Q673l0408J7469
$$ -39236 -45943 -14028 19994 3173 -26258 -53087 -55416 -11669 -3940 4733 -25675 -8206
11538h206J5520k8210j9117j0852J7955J9721j3194k3951l417J6674J5090R352
$$ -8206 7314 -20896 -40013 -50865 -32910 -13189 -26383 -50334 -53751 -37077 -21987 -12635
11526a2635l402K0643j2404M500L716p535j4638J2748J6849j2229J2391Q569K1633
$$ -12635 -16037 4606 -7798 -3298 418 -7117 -21755 -9007 7842 -4387 8004 16573 38206
11513C8206O524K0828J4322k3725l6627J051J2031q205j4324r071M2243N276m6552
$$ 38206 44730 65558 79880 56155 19528 20579 32610 24405 10081 1010 43253 48529 1977
11500A977l0585j4508J258L0276M0530K1725J147k0221J771q14j7383O309L1886
$$ 1977 -28608 -43116 -41858 -11582 28948 50673 51820 31599 33370 32556 15173 21482 53368
11487E3368K396j6917k9700m6691j3172J9734J8838J8000J2131n091Q645r601
$$ 53368 55764 38847 9147 -37544 -50716 -30982 -12144 5856 17987 12896 21541 11940
11475A1940P198k7444j5132K3569J4208M5999K4177Q296m643k8786l7239p366
$$ 11940 19138 -8306 -23438 131 14339 60338 84515 92811 88168 59382 22143 14777
11463A4777Q717j332J654j3571o075J671J3881K015j4261J4216N536p634m755
$$ 14777 23494 22162 23816 10245 4170 5841 19722 21737 7476 21692 27228 19594 14839
11450A4839N514R725J169K8377l4318k0741j325o90k032k1258R625J27k818J0015
$$ 14839 20353 30078 31247 59624 25306 4565 3240 2550 518 -20740 -11115 -10988 -13806 -3791
11436c791r495j1887P751K0522M4609n008j5089J2736J0726l3982k608j5764l0047
$$ -3791 -13286 -25173 -17422 3100 47709 42701 27612 40348 51074 17092 14484 -1280 -31327
11423c1327R053L1003L0751R359L2243k1187j9446j0467j1968K4950J1553k9715
$$ -31327 -22274 8729 39480 48839 81082 59895 40449 29982 18014 42964 54517 24802
11411B4802M215Q079j7507l7502R835J1707J8951j7208j8709k3570j9503K1921
$$ 24802 29017 37096 19589 -17913 -8078 3629 22580 5372 -13337 -36907 -56410 -34489
11399c4489J4344M802k7607o177R572J7273J4563k1759j3953L1498L3308k4851
$$ -34489 -20145 -15343 -42950 -49127 -39555 -22282 -7719 -29478 -43431 -11933 21375 -3476
11387c476j5740J5513m940p067J4218J2344L2141j3507j6970J5337J5840l8j0580
$$ -3476 -19216 -3703 -8643 -15710 -1492 10852 42993 29486 12516 27853 43693 43655 33075
11374C3075k9826p899K173o282j7749K7358N111j3506r358k385J0757j1278J0693
$$ 33075 3249 -4650 -2477 -8759 -26508 850 5961 -7545 -16903 -19288 -8531 -19809 -9116
11361i116J9737j1315L032j4179M220j0222J240k129J0213j4001J991Q200J2524
$$ -9116 10621 -694 2338 -11841 -7621 -17843 -16603 -18732 -8519 -22520 -20529 -12329 195
11348A95N887r478N406R435j4086m496j0455o365j1707O88K060O497J5063J6567
$$ 195 6082 -3396 2010 11445 -2641 -7137 -17592 -23957 -35664 -34976 -32916 -26419 -11356 5211
11334E211L4919K021l7254m4426M57K3160J7846J5938N426N435p459q068l551
$$ 5211 40130 42151 4897 -39529 -39072 -15912 1934 17872 23298 28733 21274 13206 9655
11321I655j2812k542k406j1236j0670j8433L758M0548M7701j136k6044j9125j5923
$$ 9655 -3157 -5699 -8105 -19341 -30011 -48444 -44686 -4138 43563 42427 16383 -2742 -18665
11308a8665Q023K8474m128j0066K1974m325J726j9142N587j6293r231j340j507
$$ -18665 -10642 17832 13704 3638 25612 21287 23013 3871 9458 -6835 -16066 -17406 -18913
11295a8913J0404K28m783j14j5632M057L4043K2934j1755m986k707l3244k1376
$$ -18913 -8509 -8281 -13064 -13178 -28810 -24753 9290 32224 20469 15483 12776 -20468 -41844
11282d1844L69J8333N3696L311K4122m1701n7457k8615J5132J6931K700p638K257
$$ -41844 -41475 -23142 30554 33865 57987 16286 -41171 -69786 -54654 -37723 -35023 -42661 -40404
11269d0404j973J226R788J4188J7532L3284J8448k9663N944O31r446j8521l337
$$ -40404 -42377 -41151 -31363 -17175 357 33641 52089 22426 28370 29001 19555 1034 -2303
11256b303k0923j6018J806P973L2255J9036l8638m2092P055L9315J1385O22K8600
$$ -2303 -23226 -39244 -37438 -29465 2790 21826 -16812 -58904 -51849 -12534 -1149 -527 28073
11243B8073j302j9269k2673N014j5001j8580J643M144l1174L1358J3380r421M254
$$ 28073 26771 7502 -15171 -10157 -25158 -43738 -42095 -37951 -69125 -37767 -24387 -33808 -29554
11230b9554j5642l1162J0286K6085K7850L4687j5680R240K718K938j2531J3980
$$ -29554 -45196 -76358 -66072 -39987 -12137 22550 6870 16110 18828 21766 9235 23215
11218B3215O480q887K796P410j9790l7778o136l075J2768M227p249j0563j5940
$$ 23215 29695 20808 23604 31014 11224 -26554 -32690 -35765 -22997 -18770 -26019 -36582 -52522
11205e2522N575Q210K6000J8516k98k685l800k974k204l387J3787P985k9779J2392
$$ -52522 -46947 -38737 -12737 5779 5481 2796 -1004 -3978 -6182 -9569 4218 12203 -17576 -5184
11191e184J804k48j0480J5756K9524j5534K2846j846k6278M003J2896J2680k900
$$ -5184 -3380 -3628 -14108 1648 31172 15638 38484 36638 10360 14363 27259 39939 37039
11178C7039k2759l9822k1065L7284M213P090J8096p160M111J1720Q511K3701J1325
$$ 37039 14280 -25542 -46607 -9323 -5110 1980 20076 12916 17027 28747 37258 60959 72284
11165G2284r209k9778k3985j164j5123j7055r499J3458j0268r033J8800J7501
$$ 72284 63075 33297 9312 8148 -6975 -24030 -33529 -20071 -30339 -39372 -20572 -3071
11153c071r343j2201r399j3304K9991L2076q861K751K6810Q77k3021N097j777
$$ -3071 -12414 -24615 -34014 -47318 -17327 14749 5888 8639 35449 36326 13305 18402 16625
11140A6625L569k1347j1363q20K1966R541J8125K2590l226j8498J7856l4504J0355
$$ 16625 20194 -1153 -12516 -13336 8630 18171 36296 58886 55660 37162 55018 20514 30869
11127C0869j2738K2381m1209l6122k162J1773J0507J5144K5809M2886j1745k8557
$$ 30869 18131 40512 -697 -36819 -38981 -27208 -16701 -1557 24252 67138 55393 26836
11115B6836j4272o135j0537l8763J608J4991L6328J8183j9836n1315J7885K6004
$$ 26836 12564 6429 -4108 -42871 -41263 -26272 10056 28239 8403 -42912 -25027 977
11103I77M748k463J120k5701J528K1773J0023j1295j4960K0289K0087K0877m880
$$ 977 5725 3262 4382 -21319 -19791 1982 12005 710 -14250 6039 26126 47003 42123
11090D2123j4175q514J3603O720K7105k4418k8950k6990K3355j5003l5097J5541
$$ 42123 27948 19434 33037 39757 66862 42444 13494 -13496 9859 -5144 -40241 -24700
11078b4700J0223K8839N599l1928L545J5071J0587k6541j1071J9544j109o442
$$ -24700 -14477 14362 19961 -11967 -8422 6649 17236 -9305 -20376 -832 -1941 -8383
11066h383K1685O648j7201k0842J857L0570n414k0664L569J0896n84J2544k1119
$$ -8383 13302 19950 2749 -18093 -16236 14334 8920 -11744 -8175 2721 2137 14681 -6438
11053f438r65n931j2314M15J5783L1934N985p463qk002n811L5503K4554j5524
$$ -6438 -7403 -13334 -25648 -25233 -9450 22484 28469 21006 20998 18996 13185 48688 73242 57718
11039E7718j3871k3058m89R29j6187j6028l0223n149J6247M0378J7038L036p937
$$ 57718 43847 20789 20300 21229 5042 -10986 -41209 -46358 -30111 10267 27305 30341 22404
11026B2404k9566j6191p124J5059K408l847K757n788J4530q793n439j7815R20
$$ 22404 -7162 -23353 -30477 -15418 -13010 -16857 -14100 -19888 -5358 -14151 -19590 -37405 -36485
11013c6485J4008j0772k641j1122K7808K1495j4138K5847L5827m845l3628j3091
$$ -36485 -22477 -33249 -35890 -47012 -19204 2291 -11847 14000 49827 44982 11354 -1737
11001a737K3879j1201J9766L2371l9638o587J3143K267m136j7239k650j3952K1057
$$ -1737 22142 10941 30707 63078 23440 16853 29996 32263 28127 10888 8238 -5714 15343
10988A5343N607l0942k1745j278q737k0689l292R411K2763K0587L9420p901k5019
$$ 15343 20950 -9992 -31737 -33015 -41752 -62441 -65733 -56322 -33559 -12972 26448 18547 -6472
10975f472j341L407K5887K728l8936k1188J5110K3278J8310M144R623j1617R422
$$ -6472 -7813 -4406 21481 24209 -14727 -35915 -20805 2473 20783 24927 34550 22933 32355
10962C2355j3797j2027L415J6124J6883R352j2856q30R720k1357j5739J1082J8
$$ 32355 18558 6531 9946 26070 42953 52305 39449 38619 48339 26982 11243 22325 22343
10949B2343k4492j0385k3637j2482p977L1182J6193p302J4534j2332l1518j4199
$$ 22343 -2149 -12534 -36171 -48653 -56630 -25448 -9255 -16557 -2023 -14355 -45873 -60072
10937f0072J9279m921L946q078J5811J7400K7290N114J8824K2876k522n2307o8864
$$ -60072 -40793 -45714 -41768 -49846 -34035 -16635 10655 15769 34593 57469 54947 2640 -66224
10924f6224k534M0022J2382R726J4585K3410k4878J9549Q104j5679l2371m988
$$ -66224 -68758 -28736 -16354 -6628 7957 31367 6489 26038 34142 18463 -13908 -18896
10912a8896m464J3221J0380K5698k588n288Q17K2019k8184k0976j0056K6294k344
$$ -18896 -23360 -10139 241 25939 23351 18063 18880 40899 12715 -8261 -18317 7977 5633
10899E633j5038n309q691l160k1636n348L424L3775M954j4101M952r600J1024
$$ 5633 -9405 -14714 -23405 -26565 -48201 -53549 -50125 -16350 -11396 -25497 -20545 -30145 -19121
10886a9121P089L3183K6637l0059j9222o809k2541j5261k17k966K202J4580p707
$$ -19121 -12032 21151 47788 17729 -1493 -8302 -30843 -46104 -46321 -49287 -47085 -32505 -40212
10873d0212J2331P206l0522J1892J9953j1980P842r750k0990J3134L3475L5489
$$ -40212 -27881 -20675 -51197 -39305 -19352 -31332 -23490 -33240 -54230 -41096 -7621 27868
10861B7868J3559j9454j591K4173k863m0754k5826k548o134K5381Q878q811m4029
$$ 27868 41427 21973 20382 44555 41692 938 -24888 -27436 -33570 -8189 689 -8122 -52151
10848e2151N946J5875Q991J8463J9042q629l5951l4360m826M3438K5907j4975
$$ -52151 -46205 -30330 -21339 -2876 16166 7537 -28414 -62774 -67600 -24162 1745 -13230
10836a3230j2681o706L971R23r753j624r792j495K6178L4350j0328k0733k8082
$$ -13230 -25911 -32617 -28646 -27723 -37476 -39100 -48892 -50387 -24209 10141 -187 -20920 -49002
10823d9002M567J3510K9125L5535l3051k9554l4170j9179K2117J7712J664R393
$$ -49002 -44435 -30925 -1800 33735 684 -28870 -63040 -82219 -60102 -42390 -40726 -31333
10811c1333q797J023o691J8480K5412K0809J2702l88j8470L5258R849m6587j2033
$$ -31333 -40130 -39107 -45798 -27318 -1906 18903 31605 31217 12747 48005 57854 11267 -766
10798g66j7024q129J4856K018O981K1975j2181j6346l3773o974N380o79n832K2387
$$ -766 -17790 -25919 -11063 -9045 -2064 19911 7730 -8616 -42389 -49363 -43983 -44662 -50494 -28107
10784b8107p889k680P595J3144J8136P648K6204N510l5012O108j3596J512O426
$$ -28107 -35996 -38676 -31081 -17937 199 7847 34051 39561 4549 10657 -2939 -1427 4999
10771D999o330k8063l2809j0354J0149K2088K0977j2556j914p167Q066K9243q151
$$ 4999 -1331 -29394 -62203 -72557 -62408 -40320 -19343 -31899 -33813 -40980 -32914 -3671 -11822
10758a1822j0323j1905J7886K8939k4907m59P589j1550r869j1770m125R1K5254
$$ -11822 -22145 -34050 -16164 12775 -12132 -12591 -5002 -16552 -26421 -38191 -42316 -42225 -16971
10745a6971J0576j689k8J0456J683n264j6727L562J3958m542n7269J429K3352
$$ -16971 -6395 -8084 -8112 2344 4027 -1237 -17964 -14402 -444 -4986 -62255 -60826 -37474
10732c7474P809L511K0119k6811j5163M2J7880P898J4427J733m083N383q751L479
$$ -37474 -29665 -26154 -6035 -32846 -48009 -47967 -30087 -22189 -7762 -6029 -10112 -4729 -13480 -10001
10718a0001K0621k009p681j135P816M816o043p956J9228J658O37k8497j4382k1852
$$ -10001 10620 8611 930 -205 7611 12427 6384 -1572 17656 19314 19951 -8546 -22928 -44780
10704d4780p105J430L295J1087K4460k426k6921n501O127L6669Q414l6k811k5411
$$ -44780 -51885 -50455 -47160 -36073 -11613 -14039 -40960 -46461 -40334 -3665 4749 4713 1902 -23509
10690b3509k8979K2980J7864k379o831j8024k1951N090K7202J8211K922j5337
$$ -23509 -52488 -29508 -11644 -14023 -20854 -38878 -60829 -55739 -28537 -10326 -7404 -22741
10678b2741K0338J702l4783k9204O883L1701L4857K0153j9893k1568j0573j033
$$ -22741 -2403 -701 -35484 -64688 -57805 -26104 8753 28906 9013 -12555 -23128 -24161
10666b4161n599j2461Q050K1027j9284m081l051K1293J4653j109j5597j9873j2852
$$ -24161 -29760 -42221 -34171 -13144 -32428 -36509 -39560 -18267 -3614 -4723 -20320 -40193 -53045
10653e3045o568k624K6135Q879k7658J6979K9291Q800n470k1034N74N821j7569
$$ -53045 -59613 -62237 -36102 -27223 -54881 -37902 -8611 189 -5281 -26315 -25741 -19920 -37489
10640c7489k2405J3846K463P756M233k8279j1278Q975R88K3102p504K8964L5278
$$ -37489 -59894 -46048 -43585 -35829 -31596 -59875 -71153 -62178 -61190 -38088 -45592 -16628 18650
10627A8650M3090J517l1356k4917Q295J1414l2993n539K5353j6400N388k144k8257
$$ 18650 61740 63257 31901 6984 15279 26693 -6300 -11839 13514 -2886 2502 358 -27899
10614b7899O548j3613n196j23K8804j221n054O060Q519k0288J0193l655k4323
$$ -27899 -21351 -34964 -40160 -40283 -11479 -12700 -17754 -11694 -3175 -23463 -13270 -16925 -41248
10601d1248j2926R537M267j8661L5122K0049j7268J0799J9977L038L235j584j5374
$$ -41248 -54174 -44637 -40370 -59031 -23909 -3860 -21128 -10329 9648 12686 15921 14337 -1037
10588a037p162L6754K8573j5914n965q334l2313N086M8991m3183n2232J8360M1632
$$ -1037 -8199 28555 57128 41214 35249 26915 -5398 -312 48679 5496 -46736 -28376 13256
10575A3256K919m2909m887J2100J6362J2750M88m6043j5454m284m315J1234K0524
$$ 13256 16175 -26734 -31621 -19521 -3159 9591 10079 -35964 -51418 -55702 -60017 -48783 -28259
10562b8259k3939J311j6744K4990N8359L1098N270J8165J7936p953l488j5849
$$ -28259 -52198 -50887 -67631 -42641 15718 46816 52086 70251 88187 80234 76746 60897
10550F0897N289L109j0263k0606j7211J7191l644J5913m2026l8368Q43K6714K2327
$$ 60897 66186 69295 59032 38426 21215 38406 34762 50675 8649 -29719 -28876 -2162 20165
10537B0165r330k1230O330K7599P465K995k464j2009J1368m705q870J8564L1919
$$ 20165 10835 -10395 -4065 23534 30999 33994 31530 19521 30889 26184 17314 35878 67797
10524F7797p116l1333j6465n018k34r52j5131P152L0601n735m549j339J4715j228
$$ 67797 60681 29348 12883 7865 7631 6679 -8452 -1300 29301 23566 19017 17678 32393 31165
10510C1165J4181k4753j4857n111K3485M240j8902l5847k2467K642j0758j1555
$$ 31165 45346 20593 5736 625 24110 28350 9448 -26399 -48866 -46224 -56982 -68537
10498f8537J7475M4215L1259j8089q674K560m009J7706j7637P628J1591q336m741
$$ -68537 -51062 -6847 24412 6323 -2351 209 -3800 13906 -3731 3897 15488 7152 2411
10485B411K5026j2759l8789j882J761J2937o34j2169k5995r931K8363O728K8036
$$ 2411 27437 14678 -24111 -25993 -24232 -11295 -11929 -24098 -50093 -60024 -31661 -24933 3103
10472C103K3765k210P498j4904n4707l960Q816K4709j7472R950L6394K119k4335
$$ 3103 26868 24658 32156 17252 -37455 -41415 -32599 -7890 -25362 -15412 20982 23101 -1234
10459a234j6750j4440o11M1308M782K1992L0369q05m1062k6850P060k3044m107
$$ -1234 -17984 -32424 -33035 8273 13055 35047 65416 64611 23549 -3301 3759 -19285 -23392
10446b3392M469n002J2312K1720k0087M808K9830P581J680k6065k0711O212q74
$$ -23392 -18923 -23925 -11613 10107 -9980 -5172 24658 32239 33919 7854 -12857 -6645 -7519
10433g519r889K1857J6319l0512j7034r455J2856J0955j6922P422J6579K5210
$$ -7519 -17408 4449 20768 -9744 -26778 -36233 -23377 -12422 -29344 -21922 -5343 19867
10421A9867J851J4316j475j7625L2533Q578N897j3680k2482o347l8225k3251J7165
$$ 19867 21718 36034 34559 16934 49467 58045 63942 50262 27780 21433 -16792 -40043 -22878
10408b2878R777M0449R465j3798j8357J148R703M099J6025k7504K529P924J0976
$$ -22878 -13101 27348 36813 23015 4658 5806 15509 19608 35633 8129 10658 18582 29558
10395B9558k0338q18L492K5230k412L530J3597j0410k5639j0729p168L3666J1205
$$ 29558 9220 8402 11894 37124 34712 38242 51839 41429 15790 5061 -2107 31559 42764
10382D2764m2985k3569k1770J2959M3189p192k4343n654q327l39k153L117j8926
$$ 42764 -221 -23790 -45560 -32601 10588 3396 -20947 -26601 -34928 -35267 -37420 -34303 -53229
10369e3229j0852M9701L281Q062K7327L2200M466j1410k9733l5390k5504L007
$$ -53229 -64081 -14380 -11099 -3037 24290 56490 60956 49546 19813 -15577 -41081 -38074
10357c8074J2165J0759J6628j0829j3261J1215o583m2044P236L1220L6150j9427
$$ -38074 -25909 -15150 1478 -9351 -22612 -11397 -17980 -60024 -52788 -21568 14582 -4845
10345d845q622R590K749K008R416J7042j417J0297N524o745q654j4874l2301J3079
$$ -4845 -13467 -3877 -1128 880 10296 27338 25921 36218 41742 34997 26343 11469 -20832 -7753
10331g753K0262k1271L520j1095q299k3698q559L0862K7868M145l4930j664J903
$$ -7753 12509 -8762 -5242 -16337 -24636 -48334 -56893 -26031 1837 5982 -28948 -30612 -28709
10318b8709O947L0159J8054K2067j0608j0656r997k8526o376n985k349K6503M717
$$ -28709 -21762 8397 26451 48518 37910 27254 17257 -11269 -17645 -23630 -25979 524 5241
10305E241k840N997j8977o554M4155K6386o379l5358M841K1721k3238l4820P560
$$ 5241 2401 8398 -10579 -17133 27022 53408 47029 11671 16512 38233 14995 -19825 -12265
10292a2265J9040l480J5326j7207j9920p713L4180l687k8334O047L686N992R287
$$ -12265 6775 3295 18621 1414 -18506 -26219 7961 4274 -24060 -18013 -14327 -8335 952
10279I52J1660Q799m00j8942k4630r646O139J7788j1214k5271J9491L6387J2167
$$ 952 12612 21411 21011 2069 -22561 -32207 -26068 -8280 -19494 -44765 -25274 11113 23280
10266B3280j3723j0260Q362J7620J1589j5449m2297j7152K2629J8745m2371L3319
$$ 23280 9557 -703 7659 25279 36868 21419 -20878 -38030 -15401 3344 -39027 -5708
10254e708K7073J5708k3761m446J4567j0370j5064K122J0529J5983Q500m113l1266
$$ -5708 21365 37073 13312 8866 23433 13063 -2001 121 10650 26633 35133 31020 -246
10241b46k4280N296K1439J3336j7924k0317K6008N783k327j4408k1458j1646M899
$$ -246 -24526 -19230 2209 15545 -2379 -22696 3312 9095 6768 -7640 -29098 -40744 -35845
10228c5845J7059M0725o766O554j1246N909P704M619L842j1353j4531J2728R907
$$ -35845 -18786 21939 15173 21727 10481 16390 24094 28713 32555 21202 6671 19399 29306
10215B9306J162L568J0242O608j1089j2522l0662L1372J5908r872J569N481j4827
$$ 29306 30468 34036 44278 50886 39797 27275 -3387 27985 43893 34021 35590 41071 26244
10202B6244j2586j465J993J969k4473j7515R133K237J7609R952o591j1673k5147
$$ 26244 13658 12193 14186 16155 -8318 -25833 -16700 -14463 3146 13098 6507 -5166 -30313
10189c0313P8J4083K3023K911k4797j0027o962O145J3383P040K1795J1313k8569
$$ -30313 -30235 -16152 6871 9782 -15015 -25042 -32004 -25859 -12476 -5436 16359 27672 -897
10176h97l1152j269J5993p1l972J5837L0145k6694o498P337j1080L3503J0921
$$ -897 -32049 -33318 -17325 -17396 -21368 -5531 24614 -2080 -8578 -1241 -12321 21182 32103
10163C2103k4644j2348M594M3796P968j6344n078K0077j0583j780k1199l642j5002
$$ 32103 7459 -4889 -295 43501 51469 35125 30047 50124 39541 37761 16562 12920 -2082
10150b082P644j0524j347j0764l857m64J9224J5747o684m9210o029K0239J6376
$$ -2082 5562 -4962 -6309 -17073 -20930 -21394 -2170 13577 6893 -42317 -48346 -28107 -11731
10137a1731l881K6672K1437R49l0953l0707J4461K1350k363P896J3744o545l1668
$$ -11731 -15612 11060 32497 33446 2493 -28214 -13753 7597 5234 13130 26874 20329 -11339
10124a1339r847L4362j8196K3767J2172R119m757l3527m1170k015L1180J9012
$$ -11339 -21186 13176 -5020 18747 30919 40038 35281 1754 -39416 -41431 -10251 8761
10112H761J0323P523r715j3053Q240p754k7920J0566n6L1309j9975k5976J104
$$ 8761 19084 26607 16892 3839 12079 4325 -23595 -13029 -13085 18224 -1751 -27727 -26623
10099b6623Q274l75k1228j9388J2889J1642l87J1344J8197l0832Q994L1458J2436
$$ -26623 -18349 -18724 -39952 -59340 -46451 -34809 -35196 -23852 -5655 -36487 -27493 3965 16401
10086A6401j0216j4763k0170L821P444J1748l926J6195J5959n083K1912P957j3799
$$ 16401 6185 -8578 -28748 -24927 -17483 -5735 -9661 6534 22493 17410 39322 47279 33480
10073C3480k8350j7312K78Q670J2060r769l607k5737K5171L3697J1973n582J0182
$$ 33480 5130 -12182 -11904 -3234 8826 -943 -4550 -30287 -5116 28581 40554 34972 45154
10060D5154K477l8453r423N986j832j0712k432k001J9587J4644L8175J1818J0431
$$ 45154 47631 9178 -245 5741 3909 -6803 -9235 -11236 8351 22995 61170 72988 83419
10047H3419j5674m9656k9799J6891M5198M0156j7121k689o695O231K3323j84j5128
$$ 83419 67745 18089 -11710 5181 50379 90535 73414 70725 64030 70261 93584 93400 78272
10034G8272l6373j2341j1324K2296o318J6210k3081J5807N3703L6792P5911J24587
$$ 78272 41899 29558 18234 40530 34212 50422 27341 43148 96851 133643 209554 334141
10022C34141J21028L4377j10336j29062n5263l1297k9628l0099l1583k932j685
$$ 334141 455169 489546 379210 250148 194885 163588 133960 103861 72278 69346 67661
10011F7661M969j5960o1590j5376L7633q104k6159J2923K5459R22n009j829R260
$$ 67661 72630 56670 -4920 -20296 17337 9233 -16926 -4003 21456 22378 17369 15540 24800
9998B4800j253k6004l5401J69N6523K1693l4800k5185n126J4146J635m177Q617
$$ 24800 23547 -2457 -37858 -37689 18834 40527 5727 -19458 -24584 -10438 -8803 -12980 -4363
9985d363j2440K341K1051k4017k4394P908n718J4437K3040k034K1587K2940M483
$$ -4363 -16803 -14462 6589 -17428 -41822 -33914 -39632 -25195 -2155 -4189 17398 40338 44821
9972D4821m5186q695Q761j9166k6063M679L4041M5061J9927R56j8727o502j0676
$$ 44821 -365 -9060 -299 -19465 -45528 -40849 -6808 38253 58180 59136 40409 33907 23231
9959B3231j0242j9216j1402m086m585K0691j3394k6293J3705J0087j577J0690
$$ 23231 12989 -6227 -17629 -21715 -26300 -5609 -19003 -45296 -31591 -21504 -23081 -12391
9947a2391J5491p939K028O203M916K3717K7268J4342p130j4677j7542j7135K6874
$$ -12391 3100 -4839 -2811 3392 8308 32025 59293 73635 66505 51828 34286 17151 44025
9934D4025r093l3755J2141N175J0081M777k0833j658O013l2981k8718j035P037
$$ 44025 34932 1177 13318 18493 28574 33351 12518 10860 16873 -16108 -44826 -45861 -38824
9921c8824q141Q565K5153L0982j252k7694j6458J7603k886q046m468R981J983
$$ -38824 -46965 -38400 -13247 17735 16483 -11211 -27669 -10066 -12952 -20998 -25466 -15485 -13502
9908a3502J2483j620K1606K0567R836J1246K0854j727l7110m5313j981Q123o47
$$ -13502 -1019 -2639 18967 39534 49370 60616 81470 79743 42633 -2680 -4661 3462 2815
9895B815O039K1821K3187j052k3134j5327r688k3393k612J1533J4543L3065M7682
$$ 2815 8854 30675 53862 52810 29676 14349 4661 -18732 -21344 -9811 4732 37797 85479
9882H5479L2749J7856j5974n6001j7877j2404L681j1228o621K9098K1126k7636
$$ 85479 118228 136084 120110 64109 46232 33828 37509 26281 19660 48758 69884 42248
9870D2248j0905J0379J9154l1162L6420L3726k9756m0073r944j6475j9493K6963
$$ 42248 31343 41722 60876 29714 66134 99860 70104 30031 20087 3612 -15881 11082
9858A1082O597J6562J7218K2442N73l3863n981J1531J7463n9k5814K1875K1497
$$ 11082 17679 34241 51459 73901 74474 40611 34630 46161 63624 63565 37751 59626 81123
9845H1123j8513l2611j9712k04J8808L7857j236J163j320j3951j3701k9438j0315
$$ 81123 62610 29999 10287 10083 28891 66748 65512 66675 65355 51404 37703 8265 -2050
9832b050K3628j9607Q667R531j8242j3745Q087L0847n87m444q372j3456K6360
$$ -2050 21578 1971 10638 20169 1927 -11818 -3731 27116 26529 22085 13713 257 26617
9819B6617K020L663R941j4618j070K3810L6528P096j3625k2484j2807m2592k9459
$$ 26617 28637 32300 42241 27623 26553 50363 86891 93987 80362 57878 45071 2479 -26980
9806b6980L1467j1285Q217J5764k369L6660Q274j5753J7251K5665k0811k8863
$$ -26980 4487 -6798 1419 17183 14814 51474 59748 43995 61246 86911 66100 37237
9794C7237M616j9038m792K4461k0972L224J3249K5693k5180l8777o045P198O919
$$ 37237 41853 22815 18023 42484 21512 24736 37985 63678 38498 -279 -6324 874 7793
9781G793R757O789j7593k5620K3035M6812j0964l2100Q96Q056J084Q071k1916
$$ 7793 17550 24339 6746 -18874 4161 50973 40009 7909 8805 16861 17945 26016 4100
9768D100K0796N770j8897J261Q689r941o808m2288o307L2712K0498m063K680L1657
$$ 4100 24896 30666 11769 13030 21719 11778 4970 -37318 -43625 -10913 9585 5522 8202 39859
9754C9859L335n67n623j0250N586l0753l2720J8644P274k2467J2519J7957O534
$$ 39859 43194 42627 37004 26754 32340 1587 -31133 -12489 -5215 -27682 -15163 2794 9328
9741I328p204q623p824R208O404M0444L0517j3995k456p636j3866n500P510J7725
$$ 9328 2124 -6499 -14323 -5115 1289 41733 72250 58255 55799 48163 34297 28797 36307 54032
9727E4032P799l4542j7015K3920K109n883R219K173k5606K626j8489j2504J2092
$$ 54032 61831 27289 10274 34194 36303 30420 39639 41812 16206 18832 343 -12161 -69
9714f9L2620M3821j5579j6358m34k5292K2397J7035r654j8773N749J3166j5943
$$ -69 32551 76372 60793 44435 44001 18709 41106 58141 48487 29714 35463 48629 32686
9701C2686r646j6554k3843k8669J0951K7271j4219j3638K2422L9781K0303k5854
$$ 32686 23040 6486 -17357 -46026 -35075 -7804 -22023 -35661 -13239 26542 46845 20991
9689B0991l2418o518K0109j529J4302J4149K6308k1885k7980p20J1633p996j981
$$ 20991 -11427 -17945 2164 635 14937 29086 55394 33509 5529 4809 16442 8446 6465
9676F465K0357K4387l2484J8038P521r847m5562o522P831K8935J8525J0512j3663
$$ 6465 26822 51209 18725 36763 44284 34437 -11125 -17647 -9816 19119 37644 48156 34493
9663C4493J2138J0761O11j6284l8285J6272Q946j041P480j4574J961k517l260
$$ 34493 46631 57392 58003 41719 3434 19706 28652 27611 35091 20517 22478 19961 16701
9650A6701L645k749o28O206k4752j6791K7084J8741l2670K9084K7617k9886N035
$$ 16701 20346 17597 16969 23175 -1577 -18368 8716 27457 -5213 23871 51488 21602 26637
9637B6637P883p933l6989J5051R825j6370O041O6938m056l5911k4164R168K2646
$$ 26637 34520 26587 -10402 4649 14474 -1896 4145 71083 67027 31116 6952 16120 38766
9624C8766j002l0701l806R884k615k1420N073L3694j1910j300J9859N567j2218
$$ 38766 37764 7063 3257 13141 10526 -10894 -5821 27873 15963 14663 34522 40089 27871
9611B7871j6359k366K5980J1731j6746M5102o170k3753K694K613l405l5794Q869
$$ 27871 11512 9146 35126 46857 30111 75213 69043 45290 47984 50597 47192 11398 20267
9598B0267L5750K0495O548j2330Q930j2457k2283n668k0829J37j081P804N41j7142
$$ 20267 56017 76512 83060 70730 79660 67203 44920 39252 18423 18560 17479 25283 25824 8682
9584H682J9378n114j5613J6138J3982l3754m78L4475j5408q863J385O638L2860
$$ 8682 28060 22946 7333 23471 37453 3699 3221 37696 22288 13425 14810 21448 54308
9571E4308J5526j3768k437m7134K769p313m328l579j6320m656K5471R256K6119
$$ 54308 69834 56066 53629 6495 9264 1951 -2377 -5956 -22276 -26932 -1461 7795 33914
9558C3914M0238n168l1247k4106M625M126k6207l1352L6844M0131L914J7162O77
$$ 33914 74152 68984 37737 13631 18256 22382 -3825 -35177 1667 41798 45712 62874 63551
9545F3551j5596o154J120L964j8534R095p699j7330j3727L5566K0226K9452m5378
$$ 63551 47955 41801 42921 46885 28351 37446 29747 12417 -1310 34256 54482 83934 38556
9532C8556j6261L3042k331j3682L742R359J3719l5728j4423J0667j7069k0161
$$ 38556 22295 55337 53006 39324 43066 52425 66144 30416 15993 26660 9591 -10570
9520a0570L9464P896K053q13K4777q968k3609m559m860j0128n366L519K9929L2199
$$ -10570 28894 36790 38843 38030 62807 53839 30230 25671 20811 10683 5317 8836 38765 70964
9506G0964P965k0667l868J1184K477N128J2759l0849l6843M130k637J0629L1380
$$ 70964 78929 58262 54394 65578 68055 73183 85942 55093 18250 22380 19743 30372 61752
9493F1752L5547N4009l0554l6149J3140N750k6282l407M236k2920k9366k148j024
$$ 61752 97299 151308 120754 84605 97745 103495 77213 73806 78042 55122 25756 23608 22584
9480B2584k4992j389J8062J9221k4808M233M503L300P445J4207K2319j9679l3233
$$ 22584 -2408 -3797 14265 33486 8678 12911 17414 20714 28159 42366 64685 45006 11773
9467A1773J3797K877j6475j9768J1388Q783Q8k3643N746M8085J6051N054j4237
$$ 11773 25570 28447 11972 -7796 3592 12375 12463 -11180 -5434 42651 58702 63756 49519
9454D9519O10k609k5214j4808J00J7266K6792j6747l9009K007L1329J7842j4972
$$ 49519 50129 47520 22306 7498 7598 24864 51656 34909 -4100 -2093 29236 47078 32106
9441C2106j0814J4586j629K992j5710Q696J9963j1618j572K8144J2425N95J690
$$ 32106 21292 35878 34249 37241 21531 30227 50190 38572 37000 65144 77569 78164 79854
9428G9854J7078j2621k7715P835N4884j3808m4039q622r02k938J5008N97k9200
$$ 79854 96932 84311 56596 64431 119315 105507 61468 52846 51944 49006 64014 64611 35411
9415C5411q172N075K5981k85j6398l875M359J571J7185K0006L233o649M561R040
$$ 35411 27239 32314 58295 58010 41612 37737 42096 43667 60852 80858 84091 77442 82003 91043
9401I1043j1244m6475k1575M869j6125J0699J8827K2890L8671J8172j1916k5462
$$ 91043 79799 33324 11749 16618 493 11192 30019 52909 91580 109752 97836 72374
9389G2374j4105n36r220j4140J0132J9142l0438k8254J5976j991R090L2377J9745
$$ 72374 58269 57733 48513 34373 44505 63647 33209 4955 20931 18940 28030 60407 80152
9376H0152R920N266k0947p598r588O182K0438n784k5527J6498O758K408M687l30
$$ 80152 90072 95338 74391 66793 57205 63387 83825 78041 52514 69012 75770 78178 82865 82535
9362H2535Q500j5960j0909j9096P259J5508N047K2162j5262j3049K0240j2873
$$ 82535 91035 75075 64166 45070 52329 67837 72884 95046 79784 66735 86975 74102
9350G4102k6716J3048K3916R868m14M175k8046K2037K3169k1019j8983K810J7547
$$ 74102 47386 60434 84350 94218 93804 97979 69933 91970 115139 94120 75137 77947 95494
9337I5494J793j813L9666j9982l2911j3970j1851K5147K6561k863j2526N05n185
$$ 95494 97287 95474 135140 115158 82247 68277 56426 81573 108134 105271 92745 93250 88065
9324H8065j9887R505K3057J7414L0247K0099K684q519j2604j9830l3849j6922
$$ 88065 68178 77683 100740 118154 148401 168500 171184 162665 150061 130231 96382 79460
9312G9460J1827K7958J8500j7820j3878l495P557j7213r035Q245p481j5032J4362
$$ 79460 91287 119245 137745 119925 106047 102552 110109 92896 83861 92106 84625 69593 83955
9299H3955K9161J680J6571j6081K8003K4545r638M656L099L3450N973m3520M618
$$ 83955 113116 114796 131367 115286 143289 167834 158196 162852 165951 199401 205374 161854 166472
9286A66472J2151j6053k595K1161J4984k8218q45M664N035j3071L748r072m797
$$ 166472 178623 162570 159975 181136 196120 167902 167057 171721 176756 163685 167433 158361 153564
9273A53564n2518K5721L9049K28k4287J0049L46J9977J6494n452M476k0843m442
$$ 153564 101046 126767 165816 166044 141757 151806 152152 172129 188623 183171 187647 166804 162362
9260A62362K6096L7891j0937j1442L0581k1297j3979r639L093J1477j6297J1849
$$ 162362 188458 226349 215412 203970 234551 213254 199275 189636 192729 204206 187909 199758
9248A99758L171q472j2207J0474L5462J0303j1776N476N305N943J1592J5409J7606
$$ 199758 202929 194457 182250 192724 228186 238489 226713 232189 237494 243437 255029 270438 288044
9235B88044K2729O957j5728o518O424L2309j2950P966K1672j3313n07k795Q044
$$ 288044 310773 317730 302002 295484 301908 334217 321267 329233 350905 337592 337085 334290 342334
9222C42334k6704r914K0013M3640J9941K6830K19j7848j5004J0749L9292K2465
$$ 342334 315630 305716 325729 369369 389310 416140 416359 398511 383507 394256 433548 456013
9210D56013k743K281K2970j2873o318Q745j5942K263L5209L2615J9983R502n061
$$ 456013 453270 455551 478521 465648 459330 468075 452133 454396 489605 522220 542203 551705 546644
9197E46644J6397K6194L4968L2396j5077k219L1874J4474k390K6927N7688J7607
$$ 546644 563041 589235 624203 656599 641522 639303 671177 685651 683261 710188 767876 785483
9185G85483M80L8009K0657K5806K2767k3941J8030M6860M4646M1089M1873P3112
$$ 785483 785963 823972 844629 870435 893202 869261 887291 934151 978797 1019886 1061759 1134871
9173A134871P5354K2302o256K1195L7150R0091N7892M0774N1186N6193R2474Q8304
$$ 1134871 1210225 1232527 1226271 1247466 1284616 1374707 1432599 1473373 1524559 1580752 1673226 1761530
9161A761530O8166M5317O0576O7203M2979R7890J38962J04606R4149P3397R6444
$$ 1761530 1829696 1875013 1935589 2002792 2045771 2143661 2282623 2387229 2481378 2554775 2651219
9150B651219J11887J11542J12392J01518J08731J24879J40574J24552J20222J28481
$$ 2651219 2763106 2874648 2987040 3088558 3197289 3322168 3462742 3587294 3707516 3835997
9140C835997J21654R5699O1813P2554Q3954O5851L7540L7188M1160J326J3145
$$ 3835997 3957651 4053350 4115163 4187717 4271671 4337522 4375062 4412250 4453410 4454736 4467881
9129D467881M825o1207l3218m3107p4715o4099q2762r5733q5571r1852j24783
$$ 4467881 4472706 4411499 4378281 4335174 4260459 4196360 4113598 4017865 3932294 3840442 3715659
9118C715659j41623r1615j01447q8494q8332j24086j32869j32130q6565j05772
$$ 3715659 3574036 3482421 3380974 3292480 3204148 3080062 2947193 2815063 2728498 2622726
9108B622726o6226p1613j03514o9880p0607m6215p0577q4201j00409o8448o8926
$$ 2622726 2556500 2484887 2381373 2311493 2240886 2194671 2124094 2039893 1939484 1871036 1802110
9097A802110j00398m6513k7899n7623p9507o5432m1794j8431n3762n5732q4136
$$ 1802110 1701712 1655199 1627300 1569677 1490170 1424738 1382944 1364513 1310751 1255019 1170883
9086A170883k5860j8767n6696l1028j4941l7840m0707l7309k2223j2581l5431
$$ 1170883 1145023 1126256 1069560 1038532 1023591 985751 945044 907735 885512 872931 837500
9075H37500j3106o861L186l7681m7317k0025N707m2036n1886l1321J0131L980
$$ 837500 824394 817533 820719 783038 735721 715696 721403 679367 627481 596160 606291 610271
9063F10271O51k3722l3843k4135j0284P679j4426k0365K959L812k0861l9671l9515
$$ 610271 610922 587200 553357 529222 518938 526617 512191 491826 494785 498597 477736 438065 398550
9050C98550J397J848o862K171K3280R55Q39j3886k6295j2558l339j5310j1900
$$ 398550 399947 401795 394933 397104 420384 421339 422178 408292 381997 369439 366100 350790 338890
9037C38890K112O827o599j2936j3549k3044j0674J1075P188k9632r772K7590J4637
$$ 338890 341002 347829 341230 328294 314745 291701 281027 292102 299290 269658 259886 287476 302113
9024C02113j1673j2048J6061j3149R817j3503m2858j0277K2914j1607j7270K572
$$ 302113 290440 278392 294453 281304 291121 277618 234760 224483 247397 235790 218520 221092
9012B21092j2702J4024J4415K4554K1851l3260l3924K5233j8733k0311o76L3773
$$ 221092 208390 222414 236829 261383 283234 249974 216050 241283 222550 202239 201563 235336
9000B35336j8206m1804j8821n642J771J4974k0495K2069J6740N140L966K8042
$$ 235336 217130 175326 156505 150863 152634 167608 147113 169182 185922 191062 195028 223070
8988B23070R939j7342j9466k1012K304J7364j5284k3492j835L4442K5660k3142
$$ 223070 233009 215667 196201 175189 177493 194857 179573 156081 154246 188688 214348 191206
8976A91206m5325p106J0248j4721k4934K0711K6674M189j9042k6195j2739r778
$$ 191206 145881 138775 149023 134302 109368 130079 156753 160942 141900 115705 102966 93188
8964I3188J3390j435l703J3992L610k572K0223O088o761J252Q490J5365J3102
$$ 93188 106578 105143 101440 115432 119042 116470 136693 142781 136020 137272 145762 161127 174229
8951A74229o841K2241Q607j8252l6932l6202J7642J3126K5669J2231k5485l3507
$$ 174229 167388 189629 198236 179984 143052 106850 124492 137618 163287 175518 150033 116526
8939A16526P158r103m168L214j0859o696K7987N009j232k0180l0364K7863K0699
$$ 116526 123684 114581 110413 113627 102768 96072 124059 129068 127836 107656 77292 105155 125854
8926A25854J210J370J1026K2164l6262k4079q45J9358L2331j4426P217P961l3782
$$ 125854 127064 128434 139460 161624 125362 101283 100438 119796 152127 137701 144918 152879 119097
8913A19097j707K4098P181n917j7765j1825l0496J0077q346j6242K5721j4385
$$ 119097 117390 141488 148669 142752 124987 113162 82666 92743 84397 68155 93876 79491
8901G9491n347K2209K4707J9441r358n3104q426k4350J6642J5990L2937O918J378
$$ 79491 74144 96353 121060 140501 131143 78039 69613 45263 61905 77895 110832 117750 119128
8888A19128r888P006o239l2504N320N4573L1405j6458k9367K5001L6046j5089
$$ 119128 109240 116246 110007 77503 82823 137396 168801 152343 122976 147977 184023 168934
8876A68934O914m084m4195j8059J2577Q292q184K7683N3030N0956P5416P4552
$$ 168934 175848 171764 127569 109510 122087 130379 122195 149878 202908 253864 329280 403832
8864D03832J739n8786r4855m7662k3189j5202q208J221l4310K162R657j1097l700
$$ 403832 405571 346785 251930 204268 181079 165877 157669 158890 124580 126742 136399 125302 121602
8851A21602R231j6292j2641M114j5941J6716J8925k3099r060r011L390k6555j5687
$$ 121602 130833 114541 101900 106014 90073 106789 125714 102615 93555 84544 87934 61379 45692
8838D5692R194L0870K7997m0365r863L9076J325j7180k1342k1493M950k700k40
$$ 45692 54886 85756 113753 73388 63525 102601 103926 86746 65404 43911 48861 46161 45921
8825D5921j0947K35J8982R270M25J948J4638J3832n174j2018l8687l9559l8378
$$ 45921 34974 35209 54191 63461 63886 65834 80472 94304 89130 77112 38425 -1134 -39512
8812c9512K57K0879M7189L3749L3988J9022j8914k3314j0998J819J9612J2510
$$ -39512 -39255 -18376 28813 62562 96550 115572 96658 73344 62346 64165 83777 96287
8800I6287j9291r525l067k1470n493L4253L2677K7263k5830k5181j5986K1848
$$ 96287 76996 67471 64404 42934 37441 71694 104371 131634 105804 80623 64637 86485
8788H6485L0416J6748N94l1188o776M476j5133j3184k5821j5227J2974N057j7616
$$ 86485 116901 133649 134243 103055 96279 100755 85622 72438 46617 31390 44364 49421 31805
8775C1805k023l000k661L397M2445j356j6842J420J0899p412m643o1l766p398
$$ 31805 29782 26782 24121 27518 69963 68607 51765 53185 64084 56672 52029 51968 48202 40804
8761D0804O286J1257j9492J5168O540l718L1177K4367j2318k6948j6541K8417
$$ 40804 47090 58347 38855 54023 60563 56845 88022 112389 100071 73123 56582 84999
8749H4999M181K9533J7429j7024k8550O955K114l2156L72P070j9400Q184J2037
$$ 84999 89180 118713 136142 119118 90568 97523 99637 67481 67853 74923 55523 63707 75744
8736G5744K328J0513j547j669P927m409k083K3844O189P739p165j2682j1456J2828
$$ 75744 78072 88585 87038 85369 93296 88887 86804 110648 116837 124576 117411 104729 93273 106101
8722A06101j227k7049K3108r371m6936j278K3100K2356j244R463j0129o504J9916
$$ 106101 104874 77825 100933 91562 44626 43348 66448 88804 87560 97023 86894 80390 100306
8709A00306L8672J2839k5819n984R044M137r343k4216N219L076l475n507J0936
$$ 100306 138978 151817 125998 120014 129058 133195 123852 99636 104855 107931 104456 98949 109885
8696A09885J0888m346L231K5311j0814k9115l8275K0671J7118n110j7293J2526
$$ 109885 120773 116427 119658 144969 134155 105040 66765 87436 104554 99444 82151 94677
8684I4677J8636j1514j4690m6276k691M5074R280q742q346N644J1231K4888P288
$$ 94677 113313 101799 87109 40833 38142 83216 92496 83754 75408 81052 92283 117171 124459
8671A24459k7725J949j387j1430L890p703J4578k2499k5780K7821O481j6132J8168
$$ 124459 96734 98683 97296 85866 89756 82053 96631 74132 48352 76173 82654 66522 84690
8658H4690J6264m611r818P212J8299J5958K1062n234j9088k101Q770q714j5224
$$ 84690 100954 96343 86525 93737 112036 127994 149056 143822 124734 122633 131403 122689 107465
8645A07465j385K791J2428J1465j2004j4629K0559J4739R182j2368J1905J9371
$$ 107465 106080 108871 121299 132764 120760 106131 126690 141429 150611 138243 150148 169519
8633A69519j3240q692L5210K9017k7127J0929j951N426J284j5130L097j2224j1557
$$ 169519 156279 147587 182797 211814 184687 195616 193665 199091 200375 185245 188342 176118 164561
8620A64561M945L3949L2055L0816k209L679K3933k556j8308M880K3839k7655m6181
$$ 164561 169506 203455 235510 266326 264117 267796 291729 289173 270865 275745 299584 271929 225748
8607B25748l4331K3869L6643N326J9683J8701M0237K0854M810j8082J910K131
$$ 225748 191417 215286 251929 257255 276938 295639 335876 356730 361540 343458 345368 347499
8595C47499K394l496l3196k1000l9435K734q249j9214k0966k6207O660N137Q371
$$ 347499 349893 346397 313201 292201 252766 255500 247251 228037 207071 180864 187524 192661 201032
8582B01032l236r027m4591k9512l9408k3146m805L4116J5592l455j2107J2969
$$ 201032 197796 188769 144178 114666 75258 52112 47307 81423 97015 93560 81453 94422
8570I4422r971l2458J0146L525J1988n173L98j6676j419P096l7279j1608M2709
$$ 94422 84451 51993 62139 65664 77652 72479 72877 56201 54782 61878 24599 12991 55700
8557E5700J5449o01r465j9978k1695R514j5478P228K511k2940R350L9573M3346
$$ 55700 71149 70548 61083 41105 19410 28924 13446 20674 23185 245 9595 49168 92514
8544I2514P194p060K562k4432k7049J397M6648k400j8974j4401j6923R587J3061
$$ 92514 99708 92648 95210 70778 43729 45126 91774 89374 70400 55999 39076 48663 61724
8531F1724l2584j4230L741K1561p755j8880J0583J9552K0778j1611l7895J326
$$ 61724 29140 14910 18651 40212 32457 13577 24160 43712 64490 52879 14984 16310
8519A6310O8595k649n8940l1488Q692n884K101k035l1791j6948N0472R872j4669
$$ 16310 84905 82256 23316 -8172 520 -5364 -3263 -5298 -37089 -54037 -3565 6307 -8362
8506h362k1037J5735M253J808L6358K5336K8663j4588Q276O433j8108j7939J36
$$ -8362 -29399 -13664 -9411 -7603 28755 54091 82754 68166 76442 82875 64767 46828 46964
8493D6964K0464j7924R130k3234j7212m926o649k7110n233r946J5836K7422L3518
$$ 46964 67428 49504 58634 35400 18188 13262 6613 -20497 -25730 -35676 -19840 7582 41100
8480D1100j0027k9895j7261N079N154j160k6708M1144L5718J4455m446j6761j3801
$$ 41100 31073 1178 -16083 -11004 -5850 -7010 -33718 7426 43144 57599 53153 36392 22591
8467B2591k7061j2816j371J1234M689J5423j7733M301O481o329J112J8302N763
$$ 22591 -4470 -17286 -18657 -7423 -2734 12689 -5044 -743 5738 -591 521 18823 24586
8454B4586J8459J1942o37J2575J5976P723n692k1095k6910m406j1711m306L4827
$$ 24586 43045 54987 54350 66925 82901 90624 84932 63837 36927 32521 20810 16504 51331
8441E1331N322J7298k6338n1975O119J8346j1343J1035J1031j5611l3142L1080
$$ 51331 56653 73951 47613 -4362 1757 20103 8760 19795 30826 15215 -17927 13153
8429A3153L6965n971j3546J4539K3226Q655m3l0793J2499j6393k1328P562m095
$$ 13153 50118 44147 30601 45140 68366 77021 76978 46185 58684 42291 20963 28525 24430
8416B4430K6249L0476j3132l9799j3076j0762J0783M338j1605J6236K1150R995
$$ 24430 50679 81155 68023 28224 15148 4386 15169 19507 7902 24138 45288 55283
8404E5283j1329J1654J1991R730j2998j8474K863j4084q230j684K9781J340k0010
$$ 55283 43954 55608 67599 77329 64331 45857 48720 34636 26406 24722 54503 55843 35833
8391C5833k8472R793O338K2718J3841k7781P779q719k5171l0044K9857L6356R580
$$ 35833 7361 17154 23492 46210 60051 32270 40049 31330 6159 -23885 5972 42328 51908
8378E1908r022o101J1055N363m139j3221J6391J5076p391j7590n258P735P361
$$ 51908 42886 36785 47840 53203 49064 35843 52234 67310 59919 42329 37071 44806 52167
8365E2167j7619m951j2802k0526J1555j927j5211J5148J990J7070l79o774p978
$$ 52167 34548 29597 16795 -3731 7824 5897 -9314 5834 7824 24894 24515 17741 9763
8352I763K089k4016l523J3737K3003L4955j8701l5173N036R619o57j0158j6073
$$ 9763 11852 -12164 -15687 -1950 21053 56008 37307 2134 7170 16789 16132 5974 -10099
8339a0099j122K1785K5455J3565J4433j0142r292N679j6578k0177L3414K9787
$$ -10099 -11221 10564 36019 49584 64017 53875 44583 50262 33684 13507 46921 76708
8327G6708m35P021k1025o263m563L324K581L466j2705m630n13j7820k7313m062
$$ 76708 76273 83294 62269 56006 51443 54767 57348 60814 48109 43479 42966 25146 -2167 -6229
8313f229K4220j7441j7393n096p630M773K7927L118P688M2827K0441k9984l7138
$$ -6229 17991 550 -16843 -21939 -29569 -24796 3131 6249 13937 56764 77205 47221 10083
8300A0083J1526N691j0946P608k861L787j7964J2427J9735K0863M936j6989j6495
$$ 10083 21609 27300 16354 23962 21101 24888 6924 19351 39086 59949 64885 47896 31401
8287C1401j0956K0019O110r541j2187j2990N570N545j052l119j8197O488K7066
$$ 31401 20445 40464 46574 37033 24846 11856 17426 22971 21919 18800 603 7091 34157
8274C4157J33k7051O634p767M364J2683l882j2208n285q801K1790J4641n583R555
$$ 34157 34290 7239 13873 6106 10470 23153 19271 7063 1778 -7023 14767 29408 23825 33380
8260C3380Q683J8374l4212j895L0624L983J3814M1222r281N75j4083j4597j3923
$$ 33380 42063 60437 26225 24330 54954 58937 72751 113973 104692 105267 91184 76587 62664
8247F2664k1172J2539L5951R495l3814q879L933N179k6615k16k0435P4J4539m311
$$ 62664 41492 54031 89982 99477 65663 56784 60717 65896 39281 39065 18630 18704 33243 28932
8233B8932r160r319j6518n704j9545J4721L1304J6158R106p319j6662j7593K79
$$ 28932 19772 10453 -6065 -11769 -31314 -16593 14711 30869 39975 32656 15994 -1599 -1320
8220a320j9710o493L8784J9970K298n0273j2012J8358K6192m650P864n719j0310
$$ -1320 -21030 -27523 11261 31231 33529 -16744 -28756 -10398 15794 11144 19008 13289 2979
8207B979J81R052k669N763N869K2389J1598J498k2566j0529j906J6055N233K745
$$ 2979 3160 12212 9543 15306 21175 43564 55162 56660 34094 23565 21659 37714 42947 45692
8193D5692M326j3575K2136k000l8651j7742K4304K0893j3883l380k4135K7231
$$ 45692 50018 36443 58579 56579 17928 186 24490 45383 31500 28120 3985 31216
8181C1216P820j5800R286L9615K2714l6407m8779J56j366k0320J32J6049L9527
$$ 31216 39036 23236 32522 72137 94851 58444 9665 9821 8455 -11865 -11733 4316 43843
8168D3843q49k305J493J678K3754P530k1993r016L2733M0624L6088k1358k3268
$$ 43843 42994 40689 42182 43860 67614 75144 53151 44135 76868 117492 153580 132222 108954
8155A08954l6764j566j5445p749l1034m349J1948J3475K8161O591r382n45q671
$$ 108954 72190 70624 55179 47430 16396 12047 23995 37470 65631 72222 62840 62295 53624
8142E3624m952Q830k4885l3096J9634J9086J1424K0983k543l9263K5220P230j0538
$$ 53624 48672 57502 32617 -479 19155 38241 49665 70648 68105 28842 54062 61292 50754
8129E0754j5316R658J0036j2120M828J4256N003K1174L0052k7723P375L9852L078
$$ 50754 35438 45096 55132 43012 47840 62096 67099 88273 118325 90602 97977 137829 140907
8116A40907j5319k0090l637L587J4650l797R951l656l4J2669k5072J051l757j530
$$ 140907 125588 105498 101861 105448 120098 116301 126252 122596 122562 135231 110159 111210 107453 105923
8102A05923k3109J4044m430o148j1393k8910J0134J7904O119j7539j4649k4301
$$ 105923 82814 96858 92428 86280 74887 45977 56111 74015 80134 62595 47946 23645
8090B3645J0813J1059J6188P348k6816n503p25J906o874o122L2206L4958N159
$$ 23645 34458 45517 61705 69053 42237 36734 36009 37915 31041 24919 57125 92083 97242
8077I7242O655J2223L250k7422m6047o821K280K3084p007M246q29K462J4258M7
$$ 97242 103897 116120 119370 91948 45901 39080 41360 64444 57437 61683 60854 63316 77574 77621
8063G7621j6161L3981K6118R312K5494j5677j7400j2224M2195K3401j0647J1266
$$ 77621 61460 95441 121559 130871 156365 140688 123288 111064 153259 176660 166013 177279
8051A77279j750j7801J6445K1492K3502j954k2672j0093K7567M107p73j3735k9585
$$ 177279 175529 157728 174173 195665 219167 217213 194541 184448 212015 216122 215349 201614 172029
8038A72029l3723J3982M887k0530j4188N168k537J5222Q202M415K5147L4196k230
$$ 172029 138306 152288 157175 136645 122457 127625 125088 140310 148512 152927 178074 212270 210040
8025B10040j7759j4625n1237J3837l465j4259J7815R833j8884K1587K2171j2009
$$ 210040 192281 177656 126419 140256 136791 122532 140347 150180 131296 152883 175054 163045
8013A63045l548p559P64L8730L726O5829O1314M6118L302j0640k0040o3591m9441
$$ 163045 159497 151938 152702 191432 195158 260987 322301 368419 371721 361081 341041 277450 228009
8000B28009j4459k9213l664J504L1769N0386L7766J3352o172l2918k9422l5093
$$ 228009 213550 184337 180673 182177 213946 264332 302098 315450 309278 276360 246938 211845
7988B11845m3723j0634J366j3441m8994n5447J8854J8210J8795m994k437P467
$$ 211845 168122 157488 158854 145413 96419 40972 59826 78036 96831 91837 89400 96867
7976I6867K4341o875K4711J660m4833p759M1078L5056j2416o467K5959J2758N780
$$ 96867 121208 114333 139044 140704 95871 88112 129190 164246 151830 145363 171322 184080 189860
7963A89860K7332J7132o112K8125L6734j0783l2534l1529n3202j5914K6812N3624
$$ 189860 217192 234324 228212 256337 293071 282288 249754 218225 165023 149109 175921 229545
7951B29545J9391k0598o2331j2161K6137o928m7639k200l6735k8364N497j1555
$$ 229545 248936 228338 166007 153846 179983 173055 125416 123216 86481 58117 63614 52059
7939E2059K945K4564j7584m2890k335J4697m013k26J2591J3536K7960P393P515
$$ 52059 55004 79568 61984 19094 16759 31456 27443 27217 39808 53344 81304 88697 96212
7926I6212J3364K2152j8209j9416O526K0404j3259j9750k2622P236O967Q248m9520
$$ 96212 109576 131728 113519 94103 100629 121033 107774 88024 65402 72638 79605 87853 38333
7913C8333p309L455r410k043J3849J639P440P720J0744k4362j3634n481J0906
$$ 38333 31024 34479 25069 23026 36875 38514 45954 53674 64418 40056 26422 20941 31847
7900C1847j072j499j7974j6640n791L3682J2693k4217l1398j0587J6345K3165
$$ 31847 30775 29276 11302 -5338 -11129 22553 35246 11029 -20369 -30956 -14611 8554
7888H554q855Q803K3466J6928k1368k92k1107k1928O817n518k5223L3868K2409
$$ 8554 -301 8502 31968 48896 27528 27236 6129 -15799 -8982 -14500 -39723 -5855 16554
$$ [...]
##END NTUPLES=NMR SPECTRUM
##END=
