##TITLE=Analysis number 315046
Compound Code cc 30546
Book Reference 441/165
Project Code adrs
Chemist Name colinb
##JCAMPDX= 6.0         $$ Bruker NMR JCAMP-DX V2.0
##DATA TYPE= NMR SPECTRUM
##DATA CLASS= NTUPLES
##ORIGIN= Bruker BioSpin GmbH
##OWNER= NMR
$$ XWIN-NMR		Version 3.5
$$ Thu Nov  3 14:32:48 2005 GMT Standard Time (UT+0h)  MAYBRIDGE\NMR@NMR_250MHZ
##.OBSERVE FREQUENCY= 250.131544655141
##.OBSERVE NUCLEUS= ^1H
##.ACQUISITION MODE= SIMULTANEOUS (DQD)
##.ACQUISITION SCHEME= undefined
##.AVERAGES= 16
##.DIGITISER RES= 18
##SPECTROMETER/DATA SYSTEM= dpx250
##.PULSE SEQUENCE= zg30
##.SOLVENT NAME= CDCl3
##.SHIFT REFERENCE= (INTERNAL, CDCl3, 0, 16.522)
##AUDIT TRAIL= $$ (NUMBER, WHEN, WHO, WHERE, WHAT)
$$ ##TITLE= Audit trail, XWIN-NMR		Version 3.5
$$ ##JCAMPDX= 5.01
$$ ##ORIGIN= Bruker BioSpin GmbH
$$ ##OWNER= NMR
$$ C:\u/data/dgb/nmr/ADRS/11900/pdata/1/auditp.txt
$$ ##AUDIT TRAIL=  $$ (NUMBER, WHEN, WHO, WHERE, WHAT)
(   1,<2005-11-03 14:32:08.85 +000>,<MAYBRIDGE\NMR>,<NMR_250MHZ>,
      <created by zg, POWCHK disabled, PULCHK disabled
       configuration hash MD5:
       62 19 C7 07 E1 42 D1 B7 37 6C 3D D0 77 39 F9 E6
       data hash MD5: 64K
       66 0C 74 58 94 2C 10 93 AB F8 8B EB 05 1D 20 15>)
(   2,<2005-11-03 14:32:30.25 +000>,<MAYBRIDGE\NMR>,<NMR_250MHZ>,
      <Start of raw data processing
       ef LB = 0.3 FT_mod = 6 PKNL = 1 SI = 32K 
       data hash MD5: 32K
       D3 2E C0 82 69 6F 97 07 FD C9 30 BB A9 95 92 12>)
(   3,<2005-11-03 14:32:32.52 +000>,<MAYBRIDGE\NMR>,<NMR_250MHZ>,
      <apk 
       data hash MD5: 32K
       6C F6 45 BE 70 53 AE B1 9F 5F F8 1C DC D0 BC 4B>)
(   4,<2005-11-03 14:32:33.91 +000>,<MAYBRIDGE\NMR>,<NMR_250MHZ>,
      <abs ABSG = 5 
       data hash MD5: 32K
       09 41 59 99 C8 F4 DC 8B 53 55 CC 66 80 0E A2 E5>)
$$ ##END=
$$ 
$$ hash MD5
$$ DD AA 55 81 63 AF 0F B4 E6 DB 6A FB F4 15 A6 31
##$RELAX= 
##$RELAX= 
##$RELAX= 
##$RELAX= 
##$RELAX= 
##$RELAX= 
##$RELAX= 
$$ Bruker specific parameters
$$ --------------------------
##$DU= <C:\u>
##$EXPNO= 11900
##$NAME= <ADRS>
##$PROCNO= 1
##$TYPE= <nmr>
##$USER= <dgb>
##$AMP= (0..31)
100 100 100 100 100 100 100 100 100 100 100 100 100 100 100 100 100 100 
100 100 100 100 100 100 100 100 100 100 100 100 100 100 
##$AQSEQ= 0
##$AQ_mod= 3
##$AUNM= <au_zg>
##$AUTOPOS= <12 >
##$BF1= 250.13
##$BF2= 250.13
##$BF3= 250.13
##$BF4= 250.13
##$BF5= 500.13
##$BF6= 500.13
##$BF7= 500.13
##$BF8= 500.13
##$BYTORDA= 1
##$CFDGTYP= 0
##$CFRGTYP= 5
##$CHEMSTR= <none>
##$CNST= (0..31)
1 1 145 1 1 1 1 1 1 1 1 1 1 1 1 1 1 1 1 1 1 1 1 1 1 1 1 1 1 1 1 1 
##$CPDPRG= <>
##$CPDPRG1= <>
##$CPDPRG2= <>
##$CPDPRG3= <>
##$CPDPRG4= <mlev>
##$CPDPRG5= <mlev>
##$CPDPRG6= <mlev>
##$CPDPRG7= <mlev>
##$CPDPRG8= <mlev>
##$CPDPRGB= <>
##$CPDPRGT= <>
##$D= (0..31)
0 1 0 0 0 0 0 0 0 0.06 0 0 0 0 0 0 0.0002 0 0 0 0 0 0 0 0 0 0 0 0 0 0 
0 
##$DATE= 1131028327
##$DBL= (0..7)
120 120 120 120 120 120 120 120 
##$DBP= (0..7)
150 150 150 150 150 150 150 150 
##$DBP07= 0
##$DBPNAM0= <>
##$DBPNAM1= <>
$$ [...]
##$SUBNAM7= <"">
##$SUBNAM8= <"">
##$SUBNAM9= <"">
##$SW= 20.6930455092707
##$SWIBOX= (0..15)
0 0 3 0 0 0 0 0 0 0 0 0 0 0 0 0 
##$SW_h= 5175.983436853
##$TD= 65536
##$TD0= 1
##$TE= 296.16
##$TE2= 300
##$TE3= 300
##$TEG= 300
##$TL= (0..7)
0 120 120 120 120 120 120 120 
##$TP= (0..7)
150 150 150 150 150 150 150 150 
##$TP07= 0
##$TPNAME0= <>
##$TPNAME1= <>
##$TPNAME2= <>
##$TPNAME3= <>
##$TPNAME4= <>
##$TPNAME5= <>
##$TPNAME6= <>
##$TPNAME7= <>
##$TPOAL= (0..7)
0.5 0.5 0.5 0.5 0.5 0.5 0.5 0.5 
##$TPOFFS= (0..7)
0 0 0 0 0 0 0 0 
##$TUNHIN= 0
##$TUNHOUT= 0
##$TUNXOUT= 0
##$USERA1= <user>
##$USERA2= <user>
##$USERA3= <user>
##$USERA4= <user>
##$USERA5= <user>
##$V9= 5
##$VALIST= <valist>
##$VCLIST= <CCCCCCCCCCCCCCC>
##$VD= 0
##$VDLIST= <DDDDDDDDDDDDDDD>
##$VPLIST= <PPPPPPPPPPPPPPP>
##$VTLIST= <TTTTTTTTTTTTTTT>
##$WBST= 1024
##$WBSW= 4
##$XGAIN= (0..3)
0 0 0 0 
##$XL= 0
##$YL= 0
##$YMAX_a= 638575
##$YMIN_a= -479307
##$ZGOPTNS= <>
##$ZL1= 120
##$ZL2= 120
##$ZL3= 120
##$ZL4= 120
##$ABSF1= 16.522
##$ABSF2= -4.171173
##$ABSG= 5
##$ABSL= 3
##$ALPHA= 0
##$AQORDER= 0
##$ASSFAC= 0
##$ASSFACI= 0
##$ASSFACX= 0
##$ASSWID= 0
##$AUNMP= <proc_1d>
##$AZFE= 0.1
##$AZFW= 0.1
##$BCFW= 0
##$BC_mod= 0
##$BYTORDP= 0
##$COROFFS= 0
##$CY= 12.5
##$DATMOD= 1
##$DC= 0
##$DFILT= <>
##$DTYPP= 0
##$F1P= 14.0000005364418
##$F2P= -0.99999901652339
##$FCOR= 0.5
##$FTSIZE= 32768
##$FT_mod= 6
##$GAMMA= 0
##$GB= 0
##$INTBC= 1
##$INTSCL= 1
##$ISEN= 128
##$LB= 0.3
##$LEV0= 0
##$LPBIN= 0
##$MAXI= 10000
##$MC2= 0
##$MEAN= 0
##$ME_mod= 0
##$MI= 0
##$NCOEF= 0
##$NC_proc= -2
##$NLEV= 6
##$NOISF1= 0
##$NOISF2= 0
##$NSP= 0
##$NTH_PI= 0
##$NZP= 0
##$OFFSET= 16.522
##$PC= 1
##$PHC0= 73.73812
##$PHC1= 4.510357
##$PH_mod= 1
##$PKNL= yes
##$PPARMOD= 0
##$PSCAL= 4
##$PSIGN= 0
##$REVERSE= no
##$SF= 250.13
##$SI= 32768
##$SIGF1= 0
##$SIGF2= 0
##$SINO= 400
##$SIOLD= 32768
##$SREGLST= <1H.CDCl3>
##$SSB= 0
##$STSI= 32768
##$STSR= 0
##$SW_p= 5175.98343685301
##$SYMM= 0
##$S_DEV= 0
##$TDeff= 65536
##$TDoff= 0
##$TI= <Analysis number 999999
Compound Code 99
Book Reference 9
Project Code 9>
##$TILT= no
##$TM1= 0
##$TM2= 0
##$TOPLEV= 0
##$USERP1= <user>
##$USERP2= <user>
##$USERP3= <user>
##$USERP4= <user>
##$USERP5= <user>
##$WDW= 1
##$XDIM= 32768
##$YMAX_p= 343049784
##$YMIN_p= -249581
$$ End of Bruker specific parameters
$$ ---------------------------------
##NTUPLES= NMR SPECTRUM
##VAR_NAME=  FREQUENCY,     SPECTRUM/REAL,   SPECTRUM/IMAG
##SYMBOL=    X,             R,               I
##VAR_TYPE=  INDEPENDENT,   DEPENDENT,       DEPENDENT
##VAR_FORM=  AFFN,          ASDF,            ASDF
##VAR_DIM=   32768,         32768,           32768
##UNITS=     HZ,            ARBITRARY UNITS, ARBITRARY UNITS
##FACTOR=    0.157963299565203, 1,           1
##FIRST=     4132.6476996994, 0,             0
##LAST=      -1043.33573715361, 0,           0
##MIN=       -1043.33573715361, -249581,     0
##MAX=       4132.6476996994, 343049784,     0
$$ Real data points
##PAGE= N=1
##DATA TABLE= (X++(R..R)), XYDATA
$$ [...]
16916C68653m8543k9872k7881m6944k0209j3606k2501J473j1443p767K197P740
16904A51297J230Q657L924p914R1J064K770N719K138j1410k2894j2377m269l782
16890A14244o326q411m997J0131R667j73r164p441l45R884L494R694M861L870
16876A28988J0724M6169M8613M2968J1987J8470N6817P9654K6247n8688p6058
16865C35891l4163j0089l3119o1084n4255l0435k3468j4692j4626k861p805r244
16853D0050k771j493o992j629o618j1443K139J3568q106m759J3574P498p741n841
16839A9436L92r888p661n203J3129j6658p905j076P567P965J2507K9210J7192
16826E9007J6089m738j3071p6p843j7565j1350l832N754Q040J8551j476j5174
$$ plain form
16916 368653 320110 290238 262357 215413 195204 181598 159097 160570 149127 141360 143557 151297
16904 151297 152527 161184 165108 157194 157285 158349 161119 166838 168976 157566 134672 122295 118026 114244
16890 114244 107918 99507 94510 104641 114308 114135 104971 97530 97185 107069 110563 120257 125118 128988
16876 128988 139712 185881 234494 277462 289449 307919 364736 444390 470637 411949 335891
16865 335891 301728 291639 258520 197436 143181 112746 89278 74586 59960 57099 49294 40050
16853 40050 37279 35786 28794 27165 20547 9104 11243 24811 16705 11946 25520 33018 25277 19436
16839 19436 19828 9940 2279 -2924 10205 -6453 -14358 -15434 -7867 98 12605 41815 59007
16826 59007 75096 70358 57287 57211 49368 31803 20453 16621 22375 30415 48966 47490 32316
16813C2316j6063j780J3323k082L496q174j2138L991L505n154j0503p885k7165
16800c4313P96L493J5017K6577R858k779m514K463m173q002O449J2148J899K419
16786B7338l061k709P213R530J6444j995l557j495p219p126j472j4753j4436M494
16772G196M607k065N745K0285L2261K9266J7928L910j9741j8624k5673q631j5060
16759C1404o936j4681Q21j2189O880J2680J3479n097j2281n976j0616j2460P565
16746g407J5470m775j9457P769N912J4170Q775r093j3778j0078M946J0713P334
16733A0501j1205p914J843M427o56m725j3217N944j115N51P826k33J550J3313
16719F890O557N387M79K121n994R8p411j197j949n369L274P153Q055q699n859
$$ plain form
16813 32316 16253 14473 27796 25714 29210 21036 8898 12889 16394 11240 737 -7148 -34313
16800 -34313 -33517 -30024 -15007 11570 21428 18649 14135 16598 12425 4423 10872 23020 24919 27338
16786 27338 24277 21568 28781 38311 54755 52760 49203 47708 40489 33363 31891 17138 2702 7196
16772 7196 11803 9738 15483 35768 68029 97295 115223 119133 99392 80768 55095 46464 31404
16759 31404 24468 9787 10608 -1581 5299 17979 31458 26361 14080 8104 -2512 -14972 -7407
16746 -7407 8063 3288 -16169 -8400 -2488 11682 20457 11364 -2414 -12492 -7546 3167 10501
16733 10501 -704 -8618 -6775 -2348 -3004 -7729 -20946 -15002 -16117 -15566 -7740 -7973 -6423 6890
16719 6890 13447 18834 19313 21434 15440 15538 8127 6930 4981 -388 2886 10039 18094 9395 3536
16704C536K636L216J0856m301M117J658j2691M047r83j0516p753m4P752L773n412
16689a09M340L472l418n063j805J1640n487j0559J737J4283q14j6587l621L138
16675h853J043Q962r96j238n85R887l329N208J037j7776j3418j3984R096J3987
16661a0959J8287Q766r263r652J1206N199J1274o906n330P655J2278P31n303n366
16647B2617J011L362j1987j5045J145r843j0190M435L801J093L702j6753j4480
16634c7132O029N22k319P771M337oK709J6134p340n6j45J1344K3842k590j3789
16619I311N819l121l818q473q623l913J4870L179n056p350O041J4528K347o777
16605H964L267n948j1205L530R64q171R65L603r922k559O53P651N546o262M610
$$ plain form
16704 3536 6172 9388 20244 15943 20060 21718 9027 13074 12091 1575 -6178 -6222 1530 5303 -109
16689 -109 4231 7703 4285 -778 -2583 9057 3570 -6989 -5252 9031 8217 -8370 -11991 -8853
16675 -8853 -7810 1152 156 -1082 -1667 8220 4891 10099 11136 -6640 -20058 -34042 -24946 -10959
16661 -10959 7328 16094 6831 -2821 8385 13584 24858 17952 12622 20277 32555 33286 27983 22617
16647 22617 23628 26990 15003 -42 1103 -8740 -18930 -14495 -10694 -9601 -5899 -22652 -37132
16634 -37132 -31103 -30581 -32900 -25129 -20792 -20798 -18089 -1955 -9295 -9351 -9496 1848 25690 23100 9311
16619 9311 15130 12009 8191 -282 -8905 -12818 2052 5231 175 -7175 -1134 13394 15741 8964
16605 8964 12231 6283 -4922 -1392 -428 -8599 -7634 -4031 -13953 -16512 -15859 -8208 -2662 -8924 -4314
16590d314K479N724Q938L196p538q870p709l32q327N96j212K791r065Q850O227
16575h566l675J4400J318J420J0891m362q547p609J8661Q78q004j0903q875O860
16561f113n04M949m497L705P046L808M99l769Q923j209j2451j2275P738R798j7557
16546a1909j1064J0624m385j2863J2778J4592J2540r335l870j524m73J1828n888
16533A051j3779J389J300J0712J8797J5433J565m855r430p361m277M738k205j5133
16519b055J191L888j0430j397N370R818o869n159M860j5206j817n629j84O043
16505a7576k06k977j7486j523O520P129r7O761O555O561O08P783n228O4P733K61
16489D882k984J462P63k058r105j6701P109J0304j4834q029M878M391R796R850
$$ plain form
16590 -4314 -1835 3889 12827 16023 8485 -385 -8094 -8426 -16753 -16157 -17369 -14578 -23643 -14793 -8566
16575 -8566 -12241 2159 3477 4897 15788 11426 2879 -4730 13931 14809 6805 -4098 -12973 -6113
16561 -6113 -6617 -1668 -6165 -2460 4586 8394 8893 5124 14047 12838 387 -11888 -4150 5648 -11909
16546 -11909 -22973 -12349 -16734 -29597 -16819 -2227 10313 978 -2892 -4416 -4889 6939 1051
16533 1051 -12728 -11339 -10039 673 19470 34903 36468 31613 22183 14822 10545 15283 13078 -2055
16519 -2055 -864 3024 -7406 -8803 -3433 6385 -484 -5643 -783 -15989 -17806 -23435 -23619 -17576
16505 -17576 -17782 -20759 -38245 -39768 -33248 -26119 -26216 -19455 -12900 -6339 -5731 2052 -3176 -3112 4621 4882
16489 4882 1898 3360 4123 2065 -7040 -23741 -16632 -6328 -21162 -29191 -24313 -19922 -10126 -276
16475b76O917l093j965n585nP383o958r34j957j067l275l160P839l665M577p8
16459e302J3312O287j4583J90l447K361P112p026j6175M520M290m912J0268O14
16445b491n49k305J0589J5742J1819n336n250m868q267j1758j0293j935N965P65
16431h172l430j341O719O15j0190N583n738P153l149K647k299Q671P621j7225
16417a2535l265J6226J5330n071j1994L362J843J435j847j3709K740P521R812
16404I848m399j629R896j5682J86J4766P269k440o543L150p656J2706N624k338
16390B2758Q661J9418L7417M6143Q1268J07984J12079P1435j0870o3722r6614
16379C35957j02112p8465m7881j8992k7368k2283k3619j895P904J2649j687p922
$$ plain form
16475 -276 6641 3548 1583 -4002 -4007 3376 -3582 -4516 -6473 -7540 -10815 -13975 -6136 -9801 -5224 -5302
16459 -5302 8010 14297 -286 -96 -3543 -1182 5930 -1096 -17271 -12751 -8461 -13373 -3105 -2491
16445 -2491 -3040 -5345 5244 20986 32805 27469 22219 17351 9084 -2674 -12967 -14902 -8937 -8172
16431 -8172 -11602 -12943 -6224 -5609 -15799 -10216 -15954 -8801 -11950 -9303 -11602 -2931 4690 -12535
16417 -12535 -15800 426 15756 10685 -1309 2053 3896 5331 3484 -10225 -7485 36 9848
16404 9848 5449 3820 13716 -1966 -1780 12986 20255 17815 11272 14422 6766 19472 25096 22758
16390 22758 31419 50837 88254 134397 215665 323649 435728 507163 496293 432571 335957
16379 335957 233845 155380 107499 88507 61139 38856 15237 13342 21246 33895 32208 24286
16367B4286J0008M981j0046j3639N626o97l859n24J975l588r40O40L420j091q233
16352H319o418K926k042q924p74J440q475o176p21K749J4118p740j1079M039R20
16337a7838j947J640J3097J2702L124n394N101m10j0093m946q617j1345J5590
16324i336J0192p209N485O27l009k013O30N320L65j5262q201J0863N917N834n583
16309e380j1337j1824R625J5102j98O546p47r93J675n81j2856j1583N669R167
16295g715p552R154P854m380m733M259j0125j5035J3033J545L272R977M884m905
16281d67Q607M445M063q607l973n332k993l568N013l787p618o260j806J2872M372
16266e039O322P257j0960m36P879j36j037j0048r82J0799j806p764j5614j018
$$ plain form
16367 24286 34294 39275 29229 15590 21216 20519 16660 16136 18111 14523 13583 14223 17643 16552 8319
16352 8319 1901 4827 2785 -6139 -6913 -5473 -13948 -20124 -20845 -18096 -3978 -11718 -22797 -18758 -17838
16337 -17838 -19785 -18145 -5048 7654 10778 5384 10485 10075 -18 -4964 -13581 -24926 -9336
16324 -9336 856 -6353 -868 -241 -3250 -5263 -4633 687 1052 -14210 -22411 -11548 -5631 203 -5380
16309 -5380 -16717 -28541 -18916 -3814 -4012 2534 1787 794 2469 1888 -10968 -22551 -16882 -7715
16295 -7715 -15267 -6113 1741 -2639 -7372 -3113 -13238 -28273 -15240 -13695 -10423 -446 4438 -467
16281 -467 8140 12585 16648 8041 4068 -1264 -4257 -7825 -2812 -6599 -14217 -20477 -22283 -9411 -5039
16266 -5039 1283 8540 -2420 -2856 5023 4887 3850 -6198 -7180 3619 1813 -5951 -21565 -22583
16252b2583J2200k829M522J0021P022j097o538n552N158m406r559P985J1544o680
16238g92j9587R20J0203Q98Q230Q69O3J0393k505o502j475k647p820L453j294
16223g593O664j0385M477l055k055m462q921K171Q941K1352L835o940N845m986
16209D888j3472q438r624J1614R666j827J0157R118L304N914m347r994j794j856
16195C309p387j1038N76L933n46k307j072l395L261J5670R210l780o260j6362
16181a6188n64N05l672j88M05N266Q072R978O214j903J623n388o603K026Q196
16166G779l583m941k962M253j242m196o319q923N369N802l665N12M115j3094J727
16151a9368J7328k550m002R743Q444j803j455P877l263p951l25p494j882J0429
$$ plain form
16252 -22583 -10383 -13212 -8690 1331 8353 7256 718 -4834 324 -4082 -13641 -5656 5888 -792
16238 -792 -20379 -19459 -9256 -8358 -128 741 804 11197 8692 2190 715 -1932 -9752 -6299 -7593
16223 -7593 -929 -11314 -6837 -9892 -11947 -16409 -25330 -23159 -14218 7134 10969 4029 9874 4888
16209 4888 -8584 -17022 -26646 -15032 -5366 -7193 2964 12082 15386 21300 16953 6959 5165 3309
16195 3309 -4078 -15116 -14540 -10607 -11153 -13460 -14532 -17927 -14666 1004 10214 6434 174 -16188
16181 -16188 -16752 -16247 -19919 -20107 -19702 -14436 -6364 3614 9828 7925 9548 4160 -2443 -417 7779
16166 7779 4196 -745 -3707 546 -696 -4892 -11211 -20134 -14765 -8963 -12628 -12116 -8001 -21095 -19368
16151 -19368 -2040 -4590 -8592 1151 9595 7792 6337 14214 10951 3000 2675 -4819 -6701 3728
16137C728K2013J3549n335k9889k6417J503p831N687O33k874j807m071K811n992
16123c4292M688K4173K3468P93j6621j7793r46R808J6957p736o902r090K690N922
16109d881Q22m791j5074P409N657J1452J0402n356n456m0J413l756q568j1066
16095b1833P644J5054K312J102p467k350J2193l632l188l266j2417Q321K462l847
16081h912L711L552J0227J0756r617r227o378O208K209j0069l588k253m646M246
16067a3781Q369J4958Q352k867q753P357j7320j2164N143K677N701L020J2128
16054A2820K947k0248j9217m19J3042r2R991N856r66m968j0744J5677O016j3184
16040c489n880j2379J997J4482J2428R14m547K362m343R27k426j400J0160K126
$$ plain form
16137 3728 25741 39290 33955 4066 -22351 -20848 -28679 -22992 -22359 -25233 -27040 -31111 -28300 -34292
16123 -34292 -29604 -5431 18037 18830 2209 -15584 -16530 -6722 10235 2499 -4403 -13493 -10803 -4881
16109 -4881 -4059 -8850 -23924 -16515 -10858 594 10996 5640 184 144 1557 -2199 -10767 -21833
16095 -21833 -14189 865 3177 4279 -3188 -5538 6655 3023 -165 -3431 -15848 -7527 -5065 -8912
16081 -8912 -5201 -1649 8578 19334 9717 490 -5888 320 2529 -7540 -11128 -13381 -18027 -13781
16067 -13781 -5412 9546 17898 15031 6278 13635 -3685 -15849 -10706 -8029 -2328 692 12820
16054 12820 15767 -4481 -23698 -24117 -11075 -11167 -1176 4680 3714 -1254 -11998 3679 9695 -3489
16040 -3489 -9369 -21748 -19751 -5269 7159 8073 3526 5888 1545 2472 46 -1354 8806 10932
16026A0932L98l888r923m979j0050J0426J0316l656o880q698M414J0558J1106
16013A0076N744J0839j415n96q615j2615n14o4P870q902K782o264j7630J3282
15999f022n451M976J289p492j2942K629J3055l646m965L397K763Q398K175O539
15985D703n29j3853j853Q128J1028J904n255j8479j2168J3698J9595k721j3299
15972i101p424L269J0577K7k979N793j920J5740M409n30O043o698j612j1452m246
15957a04r387O29P330j718j347m655p08k502N248O511o602j477k80j6555M75J0031
15941a5111Q610R388q687m439k782j498l140r905l214K0971J0l181L213l381J818
15926a1328M627R64R757k124r991p565P853J2108l850j2829o385J0807P037l702
$$ plain form
16026 10932 11330 7442 -2481 -7460 -17510 -7084 3232 -424 -7304 -16002 -11588 -1030 10076
16013 10076 15820 26659 25244 24648 16033 3418 2904 2840 10710 1808 4590 -1674 -19304 -6022
15999 -6022 -11473 -6497 -5208 -12700 -25642 -23013 -9958 -13604 -18569 -15172 -12409 -4011 -1836 4703
15985 4703 4174 -9679 -11532 -3404 7624 9528 4273 -14206 -26374 -12676 6919 4198 -9101
15972 -9101 -16525 -13256 -2679 -2652 -5631 162 -1758 13982 18391 17861 23904 17206 15594 4142 -104
15957 -104 -9491 -8862 -1532 -3250 -4597 -9252 -9960 -12462 -7214 -703 -7305 -8782 -9062 -25617 -25142 -15111
15941 -15111 -6501 2887 -5800 -10239 -13021 -14519 -17659 -27564 -30778 -9807 -9797 -12978 -9765 -13146 -11328
15926 -11328 -6701 -5737 4020 1896 -8095 -15660 -7807 4301 451 -12378 -18763 -7956 -919 -4621
15912d621k3104j5332J959R03J6185K243J405J3988M133M280J200n324n700r75
15898h760L930M23K109K959j633j3786j731l652p03J2543L564N225o166L033J1794
15883I149q626j8087l250K712p28K122p249N702R305j313n785P138J2143M538
15869G771L444p751j4965m997J3209J7470l670k2363j4112j163L528j0834j2221
15856d6654J627J8303J2305j912l781j1248J438Q554j481N349K610K182r56n930
15842a9594K280l370n590N616J0587N646l316n274l789k676L764K646R924L197
15828E1j0602r962p476J5322k661j1246o780O011N409j1N252n48K575J992o162
15813a8836o678R269j367K081O797p191M917p58p130J4604K570n59M883n910j4156
$$ plain form
15912 -4621 -27725 -43057 -41098 -40195 -24010 -21767 -20362 -6374 -2241 2039 3239 -2085 -7785 -8760
15898 -8760 -4830 -4407 -2298 661 -972 -14758 -16489 -20141 -20844 -8301 -4737 488 -5678 -2645 9149
15883 9149 523 -17564 -20814 -18102 -18830 -16708 -23957 -18255 -8950 -10263 -16048 -8910 3233 7771
15869 7771 11215 3464 -11501 -16498 -3289 14181 10511 -11852 -25964 -27127 -23599 -34433 -46654
15856 -46654 -45027 -26724 -14419 -16331 -20112 -31360 -29922 -21368 -22849 -17500 -14890 -12708 -13664 -19594
15842 -19594 -17314 -20684 -26274 -20658 -10071 -4425 -7741 -13015 -16804 -19480 -15716 -13070 -3146 51
15828 51 -10551 -20513 -27989 -12667 -15328 -26574 -33354 -27343 -21934 -21945 -16693 -17241 -14666 -12674 -18836
15813 -18836 -25514 -16245 -17612 -15531 -8734 -15925 -11008 -11766 -18896 -4292 -1722 -2281 2602 -3308 -17464
15798a7464J941J5919l817r243L930R965M441N654r26j7343k624R13k70L390j1743
15783a7277P634J4099q606m085J0915O787l270O10J2226O066M749j8589k6689
15770a5430k531J0330O545o118k876M32J3896J2675r424m480P32r701m809N684
15756e075K456k098r800j916P083k466J676R291q757j3165Q061R660k286J641
15742e695J532k018o560l486Q210O446o433J859p926n271j70M3n338J892N784
15727a7131j4416O765J2684o603l512R399R935m407m533k371L744n396K304Q099
15713e439l04o873l585R923J0943m275j775j2086o110n222J0253P096j375j8101
15699b6930j7983J674L2305J4237j683p119m623R82p221O3K879P053l672J333
$$ plain form
15798 -17464 -15523 396 -3421 -12664 -8734 1231 5672 11326 10400 -6943 -9567 -8654 -8924 -5534 -17277
15783 -17277 -9643 4456 -4150 -8235 2680 9467 6197 6807 19033 25099 29848 11259 -15430
15770 -15430 -17961 -7631 -1086 -7204 -10080 -9648 4248 16923 7499 3019 3751 -5950 -10759 -5075
15756 -5075 -2619 -4717 -14517 -16433 -9350 -11816 -10140 -849 -9606 -22771 -14710 -5050 -7336 -5695
15742 -5695 -4163 -6181 -12741 -16227 -8017 -1571 -8004 -6145 -14071 -19342 -19512 -19469 -24807 -22915 -17131
15727 -17131 -31547 -24782 -12098 -18701 -22213 -12814 -2879 -7286 -11819 -14190 -10446 -15842 -13538 -5439
15713 -5439 -5743 -12616 -16201 -6278 4665 390 -1385 -13471 -19581 -24803 -14550 -7454 -8829 -26930
15699 -26930 -44913 -43239 -10934 3303 1620 -5499 -10122 -9140 -16361 -16298 -13419 -6366 -10038 -8705
15685h705j4247j5777J0650J3035R869L272J5471R837j3646k5005k125J6575R784
15672H988J1888P05o194j2314n215k123J0214K600L292J069l933k377j2956q330
15658a4686K174j0868Q998K0732r16q817j3239O742M96L801l953j378Q387L181
15644F54M443N989K774p236m045p607j3916q846R217P580l398N815J3226P56j9258
15629a3852K372J1116R062l448n946k020J203q841j4272N387k721L643N391l650
15615a6576o558P757m663j5351L9K3629M46j2906q791Q369O642r37K031P117j291
15600a1043N588p173N451J9388j0609m617q691o387n776O475J4941M89l903j0951
15586a6818j681k706q781j0544K0221K905k719J6573R653k0221o481J2255P52
$$ plain form
15685 -8705 -22952 -38729 -28079 -15044 -5175 -1903 13568 23405 9759 -15246 -17371 -796 8988
15672 8988 20876 21581 15387 3073 -2142 -4265 5949 8549 11841 12910 8977 6600 -6356 -14686
15658 -14686 -12512 -23380 -14382 6350 5434 -3383 -16622 -9880 -9384 -5583 -9536 -10914 -2527 654
15644 654 5097 11086 13860 6624 2579 -5028 -18944 -27790 -18573 -10993 -14391 -8576 4650 5406 -13852
15629 -13852 -11480 -364 8698 5250 -696 -2716 -1513 -10354 -24626 -19239 -21960 -18317 -12926 -16576
15615 -16576 -23134 -15377 -20040 -35391 -35352 -11723 -11277 -24183 -32974 -24605 -17963 -18900 -16869 -9752 -11043
15600 -11043 -5455 -12628 -7177 12211 1602 -3015 -11706 -18093 -23869 -17394 -2453 -1964 -5867 -16818
15586 -16818 -18499 -21205 -29986 -40530 -20309 -17404 -20123 -3550 6103 -14118 -20599 -8344 -7592
15573g592Pp63r496n204n833L920J626J5790l321k263J5106r536j3595J1906K147
15558g101j4639o54M532N037J0820O19O501O881j008r551M468j1131k1262m69
15544b6957J7428J974r898J978J0189J0055K189L648l695m771J220J020j0446
15531f066J4872O849J352j2797p613P834q951M62n340j6790J2329O774J5734P062
15517A5711o411j3769o378J947m743j4661j096J4657O056J0800K248j894l812
15504a345l173o77j182m280k380m241R78R510n494L112K321N695q227R415J2061
15489A2093j6101j1189P064K339J053k043l70l294p31K605Q606r233n70n861P670
15474g962m73M507q40K820N771l781q384n501P058N593m085r620o424J755J5868
$$ plain form
15573 -7592 -7585 -8348 -17844 -23048 -28881 -24961 -23335 -7545 -10866 -13129 1977 -7559 -21154 -9248 -7101
15558 -7101 -21740 -22394 -17862 -12825 -2005 -1386 5115 11996 10988 1437 5905 -5226 -26488 -26957
15544 -26957 -9529 -7555 -17453 -15475 -5286 4769 6958 10606 6911 2140 3360 4380 -6066
15531 -6066 8806 15655 17007 4210 -3403 4431 -4520 -4058 -9398 -26188 -13859 -7085 8649 15711
15517 15711 9300 -4469 -10847 -8900 -13643 -28304 -29400 -14743 -8687 2113 4361 2467 -1345
15504 -1345 -4518 -5195 -6377 -10657 -13037 -17278 -16300 -6790 -12284 -9172 -6851 -1156 -9383 32 12093
15489 12093 -4008 -15197 -8133 -5794 -4741 -6784 -7154 -10448 -11179 -8574 32 -9201 -9771 -15632 -7962
15474 -7962 -8435 -3928 -4768 -1948 3823 42 -8342 -13843 -6785 -1192 -5277 -14897 -21321 -19566 -3698
15459c698L482p974J7402K1897J842j122J577n158j3427j8280j9090J0701J252
15446a0596M609q208N458p075l702k958n300Q412J4638J1071L780O7p942j0179
15432g925o212j2690J580K763k762L420J3634M205q393P23J1433K497m109N961
15418D125q264l927M564l424r296r874P022j347r113J1585J6453n471k195P180
15404a982j010n531N814R090n679j760K281J525k956J937m25J0531j5532l443
15390g140O024K603L51j0218Q536M478O655O969k204k3031r670J9729J8130n326
15376A5886j1602m113m86J138j4822K909Q392O460n044L412J2848k362l576l326
15362E714M350J944j0023p524p808r592j2546N367J3529P451M777j2318n069K46
$$ plain form
15459 -3698 -216 -8190 9212 31109 32951 31829 33406 28248 14821 -3459 -22549 -11848 -10596
15446 -10596 -5987 -14195 -8737 -15812 -19514 -22472 -27772 -19360 -4722 6349 10129 10196 2254 -7925
15432 -7925 -14137 -26827 -25247 -22484 -25246 -21826 -8192 -3987 -12380 -11657 -224 2273 -1836 4125
15418 4125 -4139 -8066 -3502 -6926 -16222 -26096 -19074 -20421 -29534 -17949 -1496 -6967 -9162 -1982
15404 -1982 -2992 -8523 -2709 6381 702 -1058 1223 2748 -208 1729 1304 11835 -3697 -7140
15390 -7140 -1116 1487 1838 -8380 156 4634 11289 18258 16054 -6977 -16647 3082 21212 15886
15376 15886 4284 171 -315 823 -13999 -11090 -2698 3762 -1282 2130 14978 12616 9040 5714
15362 5714 10064 12008 1985 -5539 -13347 -22939 -35485 -30118 -16589 -9138 -4361 -16679 -21748 -21502
15348b1502J4047J2976l44Q860k752j1802l811L348n128M046J1817J1140J5k269
15334A8641j8011r452m58K295r813m196K409l239N492J3165J398J3947j87m153
15320G838q447j3313n013L356q15j3674P637M993N610K40M51j8279K84J5857J524
15305a1751J0041k0J738Q165j0058j3457k687N605P785k949r750J60Q527k430
15291a1081r429n125q142R676R62l93j406K662J2291N354j2890J1527K5809J2086
15277C1901m356k501j145J382m806p94q159m160m25M288q897j0335p621p822J828
15262b1622N52L416J4769J6569J1954j4616k6627M403O270m62L366n658j6580
15249b4266Q500J7269M140j6221o933m344m40N195M878J4592P018O93j5009j5439
$$ plain form
15348 -21502 -7455 5521 5177 14037 11285 -517 -4328 -980 -6108 -2062 9755 20895 20910 18641
15334 18641 630 -8822 -9280 -6985 -16798 -20994 -18585 -21824 -16332 -3167 -1769 12178 11991 7838
15320 7838 -609 -13922 -18935 -15579 -16394 -30068 -22431 -17438 -11828 -11588 -11137 -29416 -29132 -13275 -11751
15305 -11751 -1710 -1730 8 8173 -1885 -15342 -18029 -12424 -4639 -7588 -17338 -17178 -8651 -11081
15291 -11081 -20510 -25635 -33777 -24101 -23139 -23532 -24938 -22276 -9985 -4631 -17521 -5994 19815 31901
15277 31901 27545 25044 23899 25281 20475 19681 11522 7362 6937 11225 2328 -8007 -15628 -23450 -21622
15262 -21622 -21070 -17654 -2885 13684 25638 11022 -15605 -11202 -4932 -5394 -2028 -7686 -24266
15249 -24266 -15766 1503 5643 -10578 -17511 -21855 -22295 -17100 -12222 2370 9388 10081 -4928 -20367
15235b0367Q547Q232J1162j5296j0438P392j4785j83O025K003O204o657K93O83
15221a7185j0523K894K2458R216J3247L677q437L022J259l080j4548o031N89j0079
15207a3521l273M187J951R052M62J793O116J128K606j406J821l658j4718r678
15193a7138J5752n671k64M796M980k01o505o032p210j1745O572Q413J2460J023
15179g70q148o947k167m392J0523J1793j426J6145n037j4863l870L204k800M878
15165c877J5579P640o741L226R76Q526j4885k6251l236J1549L051M22m499l344
15151a1864k084Q342L241l285J2867L219o147j858k019K153l718k810r389N297
15137h055O374m75M999m461N982p744Q722O797j2571J003J4271j416k477k085
$$ plain form
15235 -20367 -11820 -3588 7574 -7722 -18160 -10768 -25553 -25736 -19711 -17708 -11504 -18161 -17868 -17185
15221 -17185 -27708 -24814 -2356 6860 20107 23784 15347 18369 19628 16548 2000 -4031 -3442 -13521
15207 -13521 -16794 -12607 -10656 -1604 -1142 651 6767 7895 10501 9095 10916 7258 -7460 -17138
15193 -17138 -1386 -7057 -7321 -2525 2455 2254 -4251 -10283 -17493 -29238 -22666 -14253 -1793 -770
15179 -770 -8918 -15865 -18032 -22424 -11901 -108 -1534 14611 9574 -5289 -9159 -5955 -8755 -3877
15165 -3877 11702 19342 12601 15827 16803 25329 10444 -15807 -19043 -7494 -4443 -4021 -8520 -11864
15151 -11864 -13948 -5606 -2365 -5650 7217 10436 4289 2431 412 2565 -1153 -3963 -13352 -8055
15137 -8055 -1681 -2156 2843 -1618 4364 -3380 5342 12139 -432 571 14842 13426 10949 8864
15123H864j4491p203m406j2952P071p260N255M288J1534J1103M156j032j11j2235
15109g419k079l638j208j771Q614J18k8J0512m875j1665N341O962j798Q255M646
15094I967R038n675j3020p802p617l678J3076j927l305K877O831l028J745o18
15080c136j042j572J1927J0475J2190j1701q165P755n417p227m215j2755k019
15067a4902J74j5718N319M332n537J241P788M36M879L818R874P944r54K634p385
15052C943l707m926l462K067k445J1036J5073o48p731p509N694Q733J0457M818
15038C1393j2906r954j1244r42P225N62j1597L988J7362P977p255q629j5142K459
15024f703Q610j1904N15J0872P232J7482K057k5397j6207n87m628R603J0212O441
$$ plain form
15123 8864 -5627 -12830 -17236 -30188 -23117 -30377 -25122 -20834 -9300 1803 5959 4927 4816 -7419
15109 -7419 -9498 -13136 -14344 -16115 -7501 -7383 -7411 3101 -1774 -13439 -8098 -1136 -2934 5321 9967
15094 9967 19005 13330 310 -7492 -15109 -18787 -5711 -7638 -10943 -8066 -1235 -4263 -2518 -3136
15080 -3136 -4178 -5750 6177 16652 28842 17141 8976 16731 11314 4087 -128 -12883 -14902
15067 -14902 -14728 -30446 -25127 -20795 -26332 -25091 -17303 -16867 -11988 -8170 1704 9648 8694 11328 3943
15052 3943 236 -4690 -8152 -6085 -8530 2506 17579 16931 9200 1691 7385 16118 26575 31393
15038 31393 18487 8533 -2711 -3653 3572 4134 -7463 -3475 13887 21864 14609 5980 -9162 -6703
15024 -6703 1907 -9997 -9482 1390 8622 26104 28161 2764 -13443 -14030 -18658 -9055 1157 7598
15010G598j995o224q861j9412J799O43Q280J4339R357P21L289M496J408l483m694
14995G261N962l784J752j1187j876k87p871J6784J9693K560m698M154q672k0463
14981f72j5644J757J9908K285P844l486m216j1580R93J3695P167J02j1132l045
14967C976l38J7540L022n391r711j5138o123O562R164n178M961L180o166l209
14953b849j562M84j396k939R156n241j1968R657R969R269q194o129L297k821r480
14938a0747j2686l835M629J3729N256O876N422N287p17P529j3227O449l236r937
14924G92Q755n388j1138r23m207l868j3106O769J609O727j185K31r449J243q673
14909c1811n929N870Q557N36L446Q104P604R628j0459J10q377R278o797j4465
$$ plain form
15010 7598 5603 -621 -9482 -28894 -27095 -26452 -18172 -3833 5524 6245 9534 14030 15438 11955 7261
14995 7261 13223 9439 11191 4 -1872 -2159 -10030 6754 26447 29007 24309 28463 19791 -672
14981 -672 -16316 -14559 5349 7634 15478 11992 7776 -3804 -2811 10884 18051 18153 7021 3976
14967 3976 3638 21178 24200 18809 9098 -6040 -12163 -5601 3563 -1615 3346 6526 360 -2849
14953 -2849 -4411 -3927 -5323 -8262 894 -4347 -16315 -6658 3311 12580 4386 -1743 1554 -1267 -10747
14938 -10747 -23433 -27268 -22639 -8910 -3654 3222 8644 13931 13214 20743 7516 13965 10729 792
14924 792 9547 4159 -6979 -7902 -12109 -15977 -29083 -22314 -20705 -13978 -15163 -14932 -24381 -23138 -31811
14909 -31811 -37740 -31870 -23313 -22777 -19331 -11227 -3623 6005 -4454 -4344 -12721 -3443 -10240 -24705
14895b4705M170J6553Q179J915j3865q059l960n067j1788J1705P726J848K6567
14882A1219n26j1768q993j5096k424o073P788L027K257R897j030p242J3418O176
14868F30j726K033l53Q97j0602j194j2174k10K728O282p822R024k705l97K079
14853a3510n461J641J1658K993K955J627L85K0249R300n832l667j4591J404J070
14839A0221r249O877J2582M690k1191j6177N512P066k71l150N690M869R213m117
14825A2565j6099R17P23q163J906q678R576J5968O68p43m620J244K385R838K46
14810A7733k391m414O699j136j722j4012j0353j3188l409J0500J6918J9890M302
14797B5417o630m905L471j0231R347n89L590j703J583o078K932p19q241n968j5583
$$ plain form
14895 -24705 -20535 -3982 4197 6112 -7753 -15812 -19772 -24839 -36627 -24922 -17196 -15348 11219
14882 11219 10693 -1075 -10068 -25164 -27588 -33661 -25873 -22846 -20589 -10692 -11722 -18964 -5546 630
14868 630 -1096 937 584 1481 -9121 -10315 -22489 -22699 -19971 -13689 -21511 -12487 -15192 -15589 -13510
14853 -13510 -18971 -17330 -5672 -2679 276 1903 2288 22537 31837 26005 22338 7747 9151 10221
14839 10221 972 7849 20431 25121 3930 -12247 -6735 331 60 -3090 2600 7469 16682 12565
14825 12565 -3534 -2617 -1894 -10057 -8151 -16829 -7253 8715 9383 8640 4020 5264 7649 17487 17733
14810 17733 15342 10928 17627 16491 14769 757 -9596 -22784 -26193 -15693 1225 21115 25417
14797 25417 18787 13882 17353 7122 16469 15880 19470 17767 19350 13272 16204 15485 7244 1276 -14307
14782a4307j3884o23J1838j492O803M396j254P310J7142P547j1384j1554R380
14769I918j284P697N958m11j5098j4822K004Q561R435m22r650o192l353m804J8151
14754E688Q65J421P491j018j3701m320k087Q80m335l481N871O174L505o995j9462
14739b3504j3334o915P896J4890J2043J391j7437j2735O910J8824n68k26R668
14726c097J5433j3159k3252r026O340R66j704j349J176J617J4711J4660j420q792
14712f896J783j1789J6350J8862k654M734J0501l603j6050L491J612p049j6045
14699f753N394N155j968n308J0536o38j0004q630O455M472j156m303j316l147
14685a1211N392K287K291M418J3447l586K67j722l184L837J783j7421m638J0547
$$ plain form
14782 -14307 -28191 -28814 -16976 -18468 -11665 -7269 -8523 -1213 15929 23476 12092 538 9918
14769 9918 8634 16331 22289 21878 6780 -8042 -6038 2523 11958 11536 1886 -4306 -7659 -12463 5688
14754 5688 6553 7974 15465 14447 746 -3574 -5661 -4781 -9116 -12597 -6726 -552 2953 -4042 -23504
14739 -23504 -36838 -43753 -35857 -20967 -8924 -7533 -24970 -37705 -30795 -11971 -12539 -12765 -3097
14726 -3097 12336 -823 -24075 -33101 -26761 -25795 -27499 -28848 -27672 -26055 -11344 3316 1896 -6896
14712 -6896 -5113 -16902 -552 18310 15656 20390 30891 27288 11238 14729 16341 9292 -6753
14699 -6753 -1359 3796 1828 -3480 7056 6418 -3586 -12216 -5761 -1289 -2445 -6748 -8064 -11211
14685 -11211 -5819 -3532 -1241 3177 16624 13038 13305 11583 8399 12236 14019 -3402 -8040 2507
14671B507j717j0119J467R538J278q88R001o05l378L935o919N650q101j0126N224
14656c253L797M261P310k718m631p91L080o11l444j170o055n240K541J2539J8966
14641B4581K692k0379q818p88p564l32o829O012M080J1632M01j1083l157o546
14627a6098M024Q555P969j6854m181R467l050P796J1486K210p348l98Q356O754
14613A8688j504L93j6560r646L825m112j5962m832Q842O753M031L216p125m342
14599a8335K099O674L380m909q670o423J2160M302p25q866P261J2022j955O590
14585D605K483n451j4946j3713j3406J1358J2070o630J872n582O374N537J0356
14572e073M688q875q371N894j828m913m393K550P854l72J0762k618j726r56P602
$$ plain form
14671 2507 790 -9329 -7862 1676 2954 2066 11067 10462 7084 11019 4100 9750 1649 -8477 -3253
14656 -3253 544 4805 12115 9397 4766 3975 7055 6444 3000 1830 -4225 -9465 -6924 5615 24581
14641 24581 27273 6894 -1924 -2712 -10276 -10608 -17437 -11425 -7345 4287 4688 -6395 -9552 -16098
14627 -16098 -12074 -3519 4450 -12404 -16585 -7118 -10168 -2372 9114 11324 3976 3578 11934 18688
14613 18688 17184 17577 1017 -8629 -4804 -8916 -24878 -29710 -20868 -14115 -10084 -6868 -13993 -18335
14599 -18335 -16236 -9562 -6182 -11091 -19761 -26184 -14024 -9722 -10447 -19313 -12052 -30 -1985 4605
14585 4605 7088 1637 -13309 -27022 -40428 -29070 -17000 -23630 -21758 -27340 -20966 -15429 -5073
14572 -5073 -385 -9260 -17631 -11737 -13565 -18478 -22871 -20321 -12467 -12839 -2077 -4695 -6421 -7377 225
14557B25N239n019K674q692j6341k192P418P871J1661J4417L884m254j3424k580
14543H87j679J611k616o174r826l427R268J0872o801r507p772J599J7525J6095
14529A0055q514l753R311O059L804K341L842l712j6914J143N668J119q482o705
14515d738K796J469n563J329j3505n61J184J0576O095n781l051J1554K999q35
14501C968J5243Q181j1569p886o736q786k3720l58R996L131J0596J6403M800k890
14487A0373j2223j2208j355J3321n626J2987K730j2666J162j1686Q72n772m501
14474b4592J9614O005n708P549J228j5689j8350l777K9590k322q197J0924J0782
14461G057j1445o75j0165j3998J1696J4448R642R704j5396j1653J0538j6071j9564
$$ plain form
14557 225 5464 445 3119 -5573 -21914 -24106 -16688 -8817 2844 17261 21145 16891 3467 887
14543 887 -792 819 -1797 -7971 -17797 -21224 -11956 -1084 -7885 -17392 -25164 -23565 -6040 10055
14529 10055 1541 -2212 7099 13158 16962 19303 23145 19433 2519 3662 9330 10449 1967 -4738
14515 -4738 -1942 -473 -6036 -4707 -18212 -18773 -17589 -7013 -918 -6699 -9750 1804 4803 3968
14501 3968 19211 27392 15823 7937 1201 -7585 -31305 -31663 -21667 -18536 -7940 8463 13263 10373
14487 10373 -1850 -14058 -15413 -2092 -7718 5269 7999 -4667 -3505 -15191 -14319 -20091 -24592
14474 -24592 -4978 1027 -4681 2868 4096 -11593 -29943 -33720 -4130 -6452 -14649 -3725 7057
14461 7057 -4388 -5063 -15228 -29226 -17530 -3082 6560 16264 868 -10785 -247 -16318 -35882
14448c5882J2882R812J94l971J0361l539j996N058J203j1216k2570K685R756J1364
14434a5859J6521K3j386K738J2057j3479j0570P390j0511R76J0420o283m240j689
14420a3892Q889P271k043o369q503J18O571J9611j326j7294n090J598o049L907
14406a2601J8125l36M573r129R203m540k671L173j650J3086k569k285M408p567
14392I220o00j630n45J0711k735k4639j892J1196l474O36l430j556O454l896N375
14377h05N058o144j1558m403J5329L689M099j5017r45P298k2260j1098J2068J5646
14363i043o651J0323n181o844Q159l85l018J383o053M644l557m198Q120Q431M880
14348A010R114J231J369j0260m322n181o669J889o949M169n010J03J5959J3596
$$ plain form
14448 -35882 -23000 -13188 -12994 -16965 -6604 -10143 -12139 -7081 -5878 -17094 -39664 -36979 -27223 -15859
14434 -15859 662 685 -701 2037 14094 615 -9955 -2565 -13076 -12100 -1680 -7963 -12203 -13892
14420 -13892 -5003 2268 225 -6144 -14647 -14529 -7958 11653 10327 -6967 -12057 -10459 -16508 -12601
14406 -12601 5524 5188 9761 632 9835 5295 2624 5797 4147 17233 14664 12379 16787 9220
14392 9220 8620 6990 6445 17156 14421 -10218 -12110 -914 -4388 -3752 -7182 -8738 -2284 -6180 -805
14377 -805 4253 -1891 -13449 -17852 -2523 1166 5265 -9752 -10697 -3399 -25659 -36757 -24689 -9043
14363 -9043 -15694 -5371 -10552 -17396 -9237 -9622 -12640 -11257 -17310 -12666 -16223 -20421 -12301 -3870 1010
14348 1010 10124 11355 12724 2464 -1858 -7039 -13708 -11819 -18768 -14599 -19609 -19506 -3547 10049
14334A0049J688k2107p104N701R637J2341n248P35k899o588m820P165N479R632
14320A3661M198o615l407k111O437J2147J542j1317j1098P656n686j8129o156
14307a8878n64J4761J0327J864j8874K120Q450M467q086m461l909J263l041m415
14293a8976q182J8616M636l839J0403l422p613J327n838L805R071J0252L586k572
14279A1254j3270q690R020P234l954k853O491J131j405k222N121K429O78K827
14265A3791p948k845l112j1332P011o358kJ1996J3601o206o922Q794o745r256
14251e533J3969N863N389j5783j5535O861J826M08O806k83n666N065K614m383
14237A618n788N384q68J073O681M305J162m988M207j2038j0674J225J0266n015
$$ plain form
14334 10049 11737 -10370 -17474 -11773 -2136 10205 4957 5692 2793 -3795 -8615 -1450 4029 13661
14320 13661 17859 11244 7837 5726 12163 24310 25852 14535 3437 11093 5407 -12722 -18878
14307 -18878 -19442 -4681 5646 7510 -11364 -9244 -794 3673 -4413 -8874 -12783 -11520 -14561 -18976
14293 -18976 -27158 -8542 -3906 -7745 2658 -764 -8377 -7050 -12888 -9083 -12 10240 13826 11254
14279 11254 -2016 -10706 -1686 5548 1594 -1259 5232 6363 4958 2736 7857 10286 10964 13791
14265 13791 5843 2998 -114 -11446 -4435 -10793 -10795 1201 14802 8596 1674 10468 3723 -5533
14251 -5533 8436 14299 19688 3905 -11630 -4769 -2943 -2535 4271 3988 -1678 3387 6001 1618
14237 1618 -4170 1214 346 1419 8100 12405 13567 8579 12786 748 -9926 -8701 1565 -3450
14223c450N323N368o730o908P313l607N442l939J201J6957R020r581q495l761
14209D153P68n915j2912J6718R661Q974O708R2r057m784J434n142R083N506J1600
14194C6887J2558J2883J1776J8756O7281J06854J28854J08837L8454m3553j10852
14183C88735j30182r7409n0560j9980j2333j7953j1054q151j9266j0578P683J0466
14171B9418P583j0647o32O998j3953O869J0941L996j6090j802l247j4929o168
14158a663P704p882J7164j601j8390J4169M184j1213P669M212L858r628j1157
14145b574Q073J5608J981m549l494o80q421j559j0569N3j092o7P858l902q464
14130a1798J94J990k54O045m36Q578K429q851p651o09J386M320j955Q802Q581
$$ plain form
14223 -3450 1873 7241 511 -6397 916 -2691 2751 -1188 13 16970 25990 16409 7914 4153
14209 4153 4921 -994 -13906 2812 12473 21447 28155 28247 19190 14406 15840 10698 19781 25287 36887
14194 36887 49445 62328 74104 92860 160141 266995 395849 504686 543140 499587 388735
14183 388735 258553 161144 110584 90604 78271 60318 49264 41113 21847 11269 18952 29418
14171 29418 37001 26354 25722 32720 18767 25636 36577 40573 24483 22681 19434 4505 -1663
14158 -1663 6041 -1841 15323 13722 -4668 9501 13685 2472 10141 14353 18211 8583 -2574
14145 -2574 5499 21107 23088 18539 15045 14365 5944 4385 -6184 -6131 -7223 -7290 568 -3334 -11798
14130 -11798 -11604 -9614 -9868 -3823 -4259 4319 6748 -2103 -9754 -10363 -8977 -4657 -6612 2190 10771
14115A0771j273l988J2280Q319o216j1017m67q019j1063K767J0250Q806o607j5871
14101a1328R18Q257l886k507J1319L681r831N47O182N831o000o561r938Q401P169
14086B254N145N45M683L096o415n930K858n096j4651L747L136N398J151m56L924
14071C389R452J631j58j8490k6445Q68J6926K143M254L812q825K272J2321J647
14057D797n633q700R74N324k1N916J0327j5663j1177k60J2319J5001P73j5518
14043a541n17J2901m720l120j331O701O603o448o096l829Q886o734p576J0522
14029C701P952K003o039o608j0664m917m186K317P195O568J656J468N169J0877
14015A6492Q978o601r875p675j1129n360J0178J9726J933j3980l275J4304k391
$$ plain form
14115 10771 9498 5510 17790 26109 19893 8876 8409 390 -10673 -7906 2344 11150 4543 -11328
14101 -11328 -10410 -2153 -6039 -8546 2773 6454 -3377 -2830 3352 9183 3183 -3378 -13316 -4915 2254
14086 2254 7399 7944 12627 15723 9308 3378 6236 1140 -13511 -9764 -6628 -1230 -79 -535 3389
14071 3389 12841 14472 14314 -4176 -30621 -29753 -12827 -10684 -6430 -2618 -11443 -9171 3150 4797
14057 4797 -836 -9536 -8562 -3238 -3259 2657 12984 -2679 -13856 -14116 -1797 13204 13977 -1541
14043 -1541 -2058 10843 6123 3003 1672 8373 14976 8528 2432 -1397 7489 755 -6821 3701
14029 3701 11653 13656 7617 1009 -9655 -14572 -18758 -16441 -9246 -2678 -1022 446 5615 16492
14015 16492 25470 18869 8994 1319 -9810 -15170 -4992 14734 16667 2687 -588 13716 11325
14002A1325q198P166R108k202j1554k4155P537P63m068J1311J7468L354p837K533
13988A2551J93M98J450r402r166M812J4150P849j0291j7032k145m826p956R435
13974i880K3961O208j1002q147l463L973J7368j647j3830k133K228J0261J85k391
13960A1691J1513j6531j0527j3884L125O374q013r542M193L747J3067n75j1673
13947a7035n299N408N626J2081Q687l854j1823j1931q861o565L207J9844Q868
13934a647o567P22K631o732l123Q137P024j3558j132M440J9813M03j8788j031
13920i408q87J4261Q544m265N089L34p201q120K986m515j4101L832J3787J2398
13906A2734j331j0921N4j040Q583q379j0993l981J3400L059K190m631K823M093
$$ plain form
14002 11325 3127 10293 19401 17199 5645 -18510 -10973 -10210 -14278 -2967 14501 17855 10018 12551
13988 12551 12744 13242 14692 5290 -3876 936 15086 22935 12644 -4388 -6533 -11359 -19315 -9880
13974 -9880 14081 20289 9287 1140 -2323 1650 19018 17371 3541 1408 3636 13897 14082 11691
13960 11691 23204 6673 -3854 -17738 -14613 -8239 -16252 -25794 -21601 -17854 -4787 -5362 -17035
13947 -17035 -22334 -16926 -11300 781 9468 5614 -6209 -18140 -27001 -33566 -30359 -10515 -1647
13934 -1647 -8214 -7492 -4861 -11593 -14716 -6579 445 -13113 -14245 -9805 10008 10411 -8377 -9408
13920 -9408 -10295 3966 12510 8245 13334 13668 6467 -1653 1333 -3182 -17283 -13451 336 12734
13906 12734 11403 482 536 -504 8079 -300 -11293 -15274 -1874 1185 3375 -1256 1567 5660
13892E660Q853j0640r649O844P91k6374Q22M502r088n594J1069Q918K778M853
13878f255j259j193Q23O797j1715K383q665l509R138O628l24K140Q983j7n120
13863a165k596K47j2672j1738K0570M059r099j96M66M794J8122J1308r547m893
13849G660q095n722j0138L562J6559m88j2017K717l419N071P694m763j0468p526
13835a9373L740n498j2751K994J2226J1645O920M476R66L903m88p66n436m115
13821a557L755O510p863m616q135M475Q578K228R964j0145k0143N110J3336J030
13807B527J3397J8028N776q901j4049n363J1885M65k4143j7680P377K223r282
13794a7740L891L002R97m989L350M859O541J5475l566j6036q77k469j069J0403
$$ plain form
13892 5660 14513 3873 -5776 1068 1859 -24515 -23693 -19191 -28279 -33873 -22804 -13886 -11108 -6255
13878 -6255 -7514 -8707 -7884 -1087 -12802 -10419 -19084 -22593 -13455 -6827 -7151 -5011 3972 3955 -1165
13863 -1165 -3761 -3514 -16186 -27924 -7354 -3295 -12394 -12590 -12124 -7330 10792 22100 12553 7660
13849 7660 -435 -6157 -16295 -12733 3826 3338 -8679 -5962 -9381 -4310 3384 -1379 -11847 -19373
13835 -19373 -15633 -21131 -33882 -30888 -18662 -7017 -97 4379 5345 9248 8760 7994 2558 -1557
13821 -1557 2198 8708 845 -3771 -11906 -7431 1147 3375 13339 3194 -16949 -11839 1497 2527
13807 2527 15924 33952 39728 30827 16778 11415 23300 23765 -378 -18058 -10681 -8458 -17740
13794 -17740 -13849 -10847 -9850 -14839 -11489 -6630 -89 15386 11820 -4216 -5093 -7562 -8631 1772
13780A772k2569r224J6401P513k68J4469k89j3047j1793N206M723K711O227j2656
13766a0824o41J1295m390l533J1974N152n48o350o883m742j987R14N85P872j808
13751c914O648P312l027M418n138o597O04J560J5820Q143j8025r411Q105J5219
13737B1717r608j1563j453m925R659J262j1956J0225Q863L612J548R789L804l228
13723B7746j4382r338l14j182L562o268Q28q005m300M142k527R154J1313N771
13709A6200r251m956l570j0336m625L358j101J4778m775J735R283K538J66j3547
13695d103j4497J3936J6213L131K058n868L709J0700k599L355M54j3160j4499
13682a170r12N172p397p218J1089J3204r223r875L330J0663p580j1859O492N61
$$ plain form
13780 1772 -20797 -30021 -13620 -6107 -6375 8094 7805 -5242 -17035 -11829 -7106 -4395 1832 -10824
13766 -10824 -11465 -170 -4560 -8093 3881 9033 8485 2135 -4748 -9490 -11477 -10563 -9978 -2106 -3914
13751 -3914 2734 10046 7019 11437 6299 -298 306 1866 17686 25829 7804 -1607 6498 21717
13737 21717 12109 546 -907 -5832 3827 5089 -6867 3358 12221 15833 17381 27170 30974 27746
13723 27746 13364 4026 3712 2530 6092 -176 652 -7353 -11653 -7511 -10038 -884 10429 16200
13709 16200 6949 1993 -1577 -11913 -16538 -13180 -14281 497 -4278 -2543 6740 9278 9444 -4103
13695 -4103 -18600 -4664 11549 14680 16738 10870 14579 25279 22680 26035 26489 13329 -1170
13682 -1170 -2082 3090 -4307 -11525 -436 12768 3545 -6330 -3000 7663 83 -11776 -5284 -4723
13668d723k336J0952J0734K88p234j0047p098J4303J1467k441k219p079j5484
13655a0917j3117l708J5637J0477j0393J1264Q946o656J1065Q936N634o557j0238
13642A0373R173O551k428j8371q097Q629M72k05n651o542M620J9742l139j3731
13628A396r601J2660L984m801k113O371q442J3369L351m847k06J186r753O561
13614I115K018j107K182M895p842j7834j047p912J0141K960l537J1181N707j2061
13600c141r682j0147P876N899M378M187N850k302o469L703J1854N246k32K276
13586A9296n579o886K397M735L728O569j0199m655j1365J1602L439n018J4963
13573B3027J2207j1028O567K529k1631p71J2070q514j7498L786N89l356J0656
$$ plain form
13668 -4723 -7059 3893 14627 14915 7681 -2366 -9464 4839 16306 13865 11646 4567 -10917
13655 -10917 -24034 -27742 -12105 -1628 -12021 -757 8189 1533 12598 21534 27168 20611 10373
13642 10373 19546 26097 23669 5298 -2799 5830 6302 6097 446 -6096 -1476 18266 15127 1396
13628 1396 -8205 4455 8439 3638 1525 7896 -546 12823 16174 11327 11121 12307 2554 9115
13614 9115 11133 10026 12208 17103 9261 -8573 -9620 -17532 -7391 -4431 -7968 3213 8920 -3141
13600 -3141 -12823 -22970 -15094 -9195 -4817 -630 5220 2918 -3551 152 12006 17252 17020 19296
13586 19296 13717 6831 9228 13963 17691 24260 14061 9406 -1959 9643 13082 8064 23027
13573 23027 35234 24206 30773 33302 11671 10900 22970 14456 -3042 744 1333 -2023 8633
13560H633j48j784L92p425j0733N212J5518q66j3783K823P438m33j3020L746N892
13545A462L324M852r47l485k975o386j0165q213J6746Q533n623j1328M560L808
13531e837J5072J4955K307k157j2119j2000m89J220N723J405l607o244N170K236
13517E635l776M128O910o023l563m007J727q869M603J2530l869j0375J511j99
13503c637J2044M521p256j6347N012O66k831L32n606J0510J1508q474L555q57
13489C140j410J1739j3390j5955o088J0109Q915Q298N330r64J2166J3427l1236
13476D081j9565N163m840L884J5015J269j0355l214N852j099l124p474Q109Q625
13462B327Q576j570j3017K927P352M775k939m604N939J801l899K485m003m020
$$ plain form
13560 8633 8485 6701 7093 -332 -11065 -5853 9665 8799 -4984 -2161 5277 4844 -8176 -4430 1462
13545 1462 4786 9638 8691 5206 2231 -4155 -14320 -22533 -5787 2746 -2877 -14205 -9645 -5837
13531 -5837 9235 24190 26497 24340 12221 221 -268 952 6675 8080 4473 -1771 3399 5635
13517 5635 1859 5987 12897 6874 3311 -696 1031 -7838 -3235 9295 5426 -4949 -3438 -3637
13503 -3637 8407 12928 5672 -10675 -5663 -4997 -7828 -7496 -13102 -2592 8916 442 3997 3140
13489 3140 1730 13469 79 -15876 -21964 -11855 -2940 5358 10688 9724 21890 35317 4081
13476 4081 -15484 -10321 -15161 -11277 3738 5007 -5348 -8562 -2710 -3809 -6933 -14407 -6298 2327
13462 2327 10903 9333 -3684 -757 6595 11370 8431 3827 9766 11567 7668 10153 6150 2130
13448B130j1228N396N690j280K1866P836K457j4014N245r656k905k346N321M495
13434A9007l149j162L423L212Q283p374j2802l752j3864l304J087j2270K259R810
13420a0596L482J392K659j075N917n427k417J5487k381j691r165j6899M760J5858
13406i6m499K034K577l767N326R475o66r456L663M249K963J164R3J902m88n971
13390H503j25J8246M514m287R037l870k2784n481j979M950K602j1190R94L748
13376B878K2258O798j6163n535K01p583k855M183l762P458J101P821P754n235
13362A9319j1340q189L583n356n408q494J543J1243L486j677n119k535k328P686
13348c586n856m053k920K37R151R961k852l316J0924O923o433j1582K702j777
$$ plain form
13448 2130 -9098 -3702 1988 708 22574 30410 32867 18853 24098 14442 11537 9191 14512 19007
13434 19007 15858 14696 18119 21331 29614 22240 9438 5686 -8178 -11482 -10395 -22665 -20406 -10596
13420 -10596 -7114 -5722 -3063 -4138 1779 -3648 -6065 9422 7041 5350 -3815 -20714 -15954 -96
13406 -96 -4595 -2561 16 -3751 1575 11050 10384 928 4591 8840 11803 12967 13060 14962 14474 8503
13390 8503 8378 26624 31138 26851 35888 32018 9234 3753 1774 6724 9326 -1864 -870 2878
13376 2878 25136 31934 15771 10236 10437 2854 -1 4182 420 7878 8979 16800 24554 19319
13362 19319 7979 -210 3373 -1983 -7391 -15885 -14342 -3099 387 -1290 -6409 -8944 -11272 -3586
13348 -3586 -9442 -13495 -16415 -16178 -7027 2934 82 -3234 7690 14613 8180 -3402 -700 -2477
13334b477m543J3967J4727M549j0242q067R40p150p224N065N765k926p94j955
13320c65j9374J733k58K766J0232M458N123Q701l577l400k305k500O276j048o792
13305c30N115P827K423j6003r374L256L184N102J1095p5P795K434j6562p774K642
13290G55N363L435r70J022O376o974K578j3635j3721O337P958p339o110K197M83
13275a2245N947J1081p342J6747J536L312L962n380o742j0925n480J6945O244
13262A7660r179l7M737L451j638j201j5989j7287L668R107O046J122m602J0585
13248F443Q031q824N140P713l601j754Q775N62L060j3410j2669L926j902o48q817
13233g975J2375N778q951j1893p336J3435J0179o279J3670j387j4811L378l196
$$ plain form
13334 -2477 -7020 6947 21674 26223 15981 7914 8854 1704 -5520 -455 5310 2384 1590 -365
13320 -365 -19739 -18006 -18264 -15498 -5266 -808 4315 13016 9439 6039 3734 1234 7510 6462 -330
13305 -330 4785 12612 15035 -968 -10342 -7086 -3902 1200 12295 12220 20015 22449 5887 -1887 755
13290 755 6118 9553 8583 9605 15981 9007 11585 -2050 -15771 -9434 -1476 -8815 -14925 -12728 -12245
13275 -12245 -6298 4783 -2559 14188 15724 19036 22998 17618 10876 -49 -5529 11416 17660
13262 17660 8481 8444 13181 16632 14994 13793 -2196 -19483 -15815 -6708 -662 460 -4142 6443
13248 6443 14474 5650 10790 18503 14902 13148 21923 22485 25545 12135 -534 3392 1490 842 -7975
13233 -7975 4400 10178 1227 -10666 -18002 -4567 5612 -667 13003 11616 -3195 183 -3013
13220c013j600J310j291Q706N235R070M747r76j0462M512j3865p546l667j477
13206a0317J35J3504J5721p789q298n871N817L099R147N38J5625J252N607R639
13192D7809p65j6538o427o783o103k673l639J054R020l426m256n653Q935N104
13178A5659J9151N264R295P798J0646M252J2475N538J2523L5165L9079P3238J34222
13165C84305J91746K17537J80722P9296n9840j73346k22967j79320j00863q6446
13155B30824o2593l3296l9074k0214q643j6143r022m141O548J845j4437q25r490
13142B1339n750L391O900J097j736k221L436N332o728n484k748j3174m747p288
13128h381r397J4428J8631l809j1553k954M040J0701o129O58k589j0681J4946
$$ plain form
13220 -3013 -4613 -3303 -4594 4112 9347 18417 23164 22188 11726 16238 2373 -5173 -8840 -10317
13206 -10317 -10182 3322 19043 11254 2956 -2915 2902 6001 15148 15686 31311 32563 38170 47809
13192 47809 47044 30506 24079 17296 11193 8520 4881 5935 14955 11529 7273 1620 10555 15659
13178 15659 34810 40074 49369 57167 67813 72065 84540 90078 102601 137766 176845 250083 384305
13165 384305 576051 793588 974310 1053606 993766 820420 597453 418133 317270 230824
13155 230824 168231 134935 95861 75647 67004 50861 41839 37698 44246 46091 31654 30829 21339
13142 21339 15589 18980 25880 26977 25241 23020 26456 31788 25060 19576 16828 3654 -1093 -8381
13128 -8381 -17778 -3350 15281 11472 -81 -3035 1005 11706 5577 6235 3646 -7035 7911
13115G911M724k061M088J0398q017p319p789n554P123j198m979m267R033k030
13101F3n369n789N898J2125K170Q978j8191k1450K797m986N370J1318J3281J1778
13087A7993J6595J5418r765r259j0516o193j0097J0667K761m520r062o971J2364
13074I415J3705P531J1612j2833m276R155k183N25J073k000j1413o343p083P093
13060A3978q798O368q532O828J0944M266J03J2588r350k17j962J2683j1739r342
13046A7818k0430j8144j6672p135j8898l164J3375P066J3430K3516L133J631N009
13033E35J3642J1835j24j0660k0493K505J631J0334J3298o975j2491J1399J0115
13020B4551N927j3652p707N801j1800J803L42o708J1693J8979J1976q686j8911
$$ plain form
13115 7911 12635 10574 14662 25060 17043 9724 1935 -3619 3504 2306 -2673 -6940 2093 63
13101 63 -5306 -11095 -5197 6928 9098 18076 -115 -21565 -18768 -23754 -18384 -7066 6215 17993
13087 17993 34588 50006 40241 30982 20466 14273 4176 14843 17604 13084 4022 -2949 9415
13074 9415 23120 30651 42263 29430 25154 34309 32126 32651 33724 31724 20311 13968 6885 13978
13060 13978 5180 11548 3016 9844 20788 25054 25157 37745 28395 28178 26216 38899 27160 17818
13046 17818 -2612 -20756 -37428 -44563 -63461 -66625 -53250 -46184 -32754 -9238 -6105 -4474 535
13033 535 14177 26012 25888 15228 -5265 -2760 -1129 9205 22503 15528 3037 14436 24551
13020 24551 30478 16826 9119 14920 3120 4923 5265 -1443 10250 29229 41205 32519 13608
13007A3608j673N383Q333M219L069r119q776k610J006j656N684J3263J3756N889
12993E0376N161J1309J5673J7708K7643K3196P587k2029j9505j9426j5708j6492
12981F5493k1415M849K804k682j4634j1132q702l325p754l127P630N253J592N347
12967B0197k650o193m177l394J379Q231N82J2444o750N82K658o54O231R337J867
12952C9690k451L606K966P668M617k625J868P412N744j8183k0479o335J327L148
12938B7973L091k297N176o476m813q173j079R183P577j2657k5477l5128l1552
12925g4652l7031j6772J9687L1996L1101M3773K6224J383J1970R204O183M038
12913E7104o155j3140j1604l742m954K992M259k569o082j50J0691K360J6323J3134
$$ plain form
13007 13608 11935 17318 25651 29870 32939 23820 15044 12434 13440 11784 17468 30731 44487 50376
12993 50376 55537 66846 82519 100227 127870 151066 158653 136624 117119 97693 81985 65493
12981 65493 44078 48927 51731 49049 34415 23283 14581 11256 3502 375 8005 13258 14850 20197
12967 20197 17547 11354 7177 3783 5162 13393 13975 26419 19669 20251 22909 22255 28486 37823 39690
12952 39690 37239 40845 43811 51479 56096 53471 55339 62751 68495 50312 29833 23498 24825 27973
12938 27973 31064 28767 33943 27467 22654 14481 13402 22585 30162 17505 -7972 -43100 -74652
12925 -74652 -111683 -128455 -108768 -76772 -45671 -1898 24326 25709 37679 46883 53066 57104
12913 57104 50949 37809 26205 22463 17509 20501 24760 22191 16109 15959 26650 29010 45333 58467
12899E8467n444j28N71L008K739j0597Q159K0091K3135J3873J2691L45k1104j6495
12885H9311o685j6962o035L610l960M488R161m102q298j2624J335k456r906r602
12871B7275m346N816N117r266o016j0872j3877P450J2652K4825L6150N9236L3725
12858A67869K7145P325l731j2557j6956q728K574q677J3717L596l69J226o810
12845A65624M7P600M865J7344J3341J1541Q977K1158K5264O7739J20712J56873
12833F21085J44873Q8293Rj6654q40L4177l6558j15590j59741j23021r0918n6739
12821B88376k2237q795j5434j2632J599O723j1367l309n779m084j97L574O759
12808B23197k813m011N236J4691J496l314L396N367J977N704R184J6218J4503
$$ plain form
12899 58467 53023 52895 53466 56474 59213 48616 56775 76866 100001 113874 126565 126910 105806 89311
12885 89311 82626 65664 59629 63239 59279 63767 72928 68826 60528 47904 49239 46783 36877 27275
12871 27275 22929 28745 33862 24596 18580 7708 -6169 1281 13933 38758 74908 134144 167869
12858 167869 195014 202339 198608 186051 169095 160367 162941 154264 167981 171577 171208 172434 165624
12845 165624 165671 173271 178136 195480 208821 220362 229339 250497 275761 343500 464212 621085
12833 621085 765958 854251 854260 837606 836766 870943 834385 718795 559054 436033 345115 288376
12821 288376 266139 257344 241910 229278 230877 237600 226233 222924 217145 213061 212864 216438 223197
12808 223197 220384 216373 221609 236300 237796 234482 237878 243245 245222 250926 260110 276328 290831
12795B90831K706m716r733n637R150J4897K4172L0207L3609K4424K8016K7729
12783D65655L0107K3504K9426K1011J9807K4030J3922o219q29R083Q727K1426
12771F59650K1650M9202N4357L8406M5023O4169P1352Q1133R0051J12050J09809
12760A396852J22361J24490J33991J71877K28158L03937M30130N89861P16454
12751D218111P76768P29297O18914N31156N89059Q73931J338745J890507K535318
12742A4101806L495313N223771Q483445J4471821K4187683L5669678M1057432
12735A46690949L2712906J2294068j2620754l2505169l9738423l4276193k3771593
12728D8785791j4870866r132032n774956l880323k815041k113926j562546j083346
$$ plain form
12795 290831 293537 288821 279088 273451 282601 297498 321670 351877 385486 409910 437926 465655
12783 465655 495762 519266 548692 569703 589510 613540 627462 621243 620414 629497 638224 659650
12771 659650 681300 730502 784859 823265 868288 932457 1003809 1084942 1174993 1287043 1396852
12760 1396852 1519213 1643703 1777694 1949571 2177729 2481666 2911796 3501657 4218111
12751 4218111 4994879 5724176 6343090 6874246 7463305 8337236 9675981 11566488 14101806
12742 14101806 17597119 22820890 31304335 45776156 69963839 105633517 146690949
12735 146690949 179403855 191697923 179077169 146572000 106833577 72557384 48785791
12728 48785791 33914925 24782893 19007937 15127614 12312573 10198647 8636101 7552755
12720G552755p05276m77428l89590m24632n10210n90741o32818n85866m70371
12711B765823l82771k89818k17401j77405j35547j08789j13604r4387p6788o0335
12701A108978o9533p3133n5242m2965l5622n8250n0047n7500p0687m4820l4500
12690E16679m2973l1894k2793k4707j6694o898l450P272K1505R734l228p795j626
12677C93132p365k2587l3698k6815j9571P47j1418k525r660j3716j7772q696p464
12664B12592j467j1675K956l492k1705j1822m388P366M726n426j0963k2132j6395
12651A18175n75P309R75L929P628j4407j253R689J1893J834p040j4960j4489k965
12637A05743j3684j4566m025o884q072K787q385L911j135l792L106Q914O055o360
$$ plain form
12720 7552755 6847479 6370051 5980461 5555829 5045619 4454878 3822060 3236194 2765823
12711 2765823 2383052 2093234 1875833 1698428 1562881 1454092 1340488 1246101 1169313 1108978
12701 1108978 1039445 966312 911070 868105 832483 774233 724186 666686 595999 551179 516679
12690 516679 473706 441812 419019 394312 377618 370720 367270 374542 396047 405781 402553 394758 393132
12677 393132 385767 363180 329482 302667 283096 283843 272425 269900 260240 246524 228752 220056 212592
12664 212592 211125 199450 202406 198914 177209 165387 160999 168365 173091 167665 156702 134570 118175
12651 118175 117600 124909 125884 129813 137441 123034 121781 131470 143363 145197 138157 123197 108708 105743
12637 105743 92059 77493 73468 66584 58512 61299 52914 56825 55690 51898 55004 63918 69973 63613
12623F3613j2710j4024k1387j787L317R283J4325O358j2053j5169j308j4723j4289
12610a0554O08L2765R620L7631M9557L0324J2473q056j1591r826j4309r075j9431
12597I0136j8616o141K579m901j578k643n112j0705m357J0411R867m579o232p250
12583D0879j2710k1791k6691j3602o262J6916K1746O095K5904K4394O983O643
12571F8504K915N473L583l617j112j833l858M790P325N296j64j2001J42J728r13
12556G6258O665J7086K1631J3978J3770L7714O7375J25248K18537M18544O05887
12545A622693M42971q7459m96518n28692l53071j92533j10233o1468m6698l1587
12535A57405k9056k5288j0571p845M793J4343N974q775j1522K140N256N853j1072
$$ plain form
12623 63613 50903 36879 15492 13705 17022 26305 40630 46988 34935 19766 18458 3735 -10554
12610 -10554 -9946 22819 32439 70070 119627 149951 162424 154368 142777 132951 118642 109567 90136
12597 90136 71520 65379 67958 63057 61479 58836 53724 43019 38662 49073 58940 54361 48129 40879
12583 40879 28169 6378 -20313 -33915 -40177 -23261 -1515 4580 30484 54878 61861 68504
12571 68504 71419 76892 80475 76858 75746 73913 70055 74845 82170 87466 87302 75301 75443 77171 76258
12556 76258 82923 100009 121640 135618 149388 187102 254477 379725 598262 1016806 1622693
12545 1622693 2065664 1978205 1481687 952995 599924 407391 297158 235690 188992 157405
12535 157405 128349 103061 92490 84645 89438 103781 109755 100980 89458 91598 96854 102707 91635
12522I1635p151J425L299l079k673P4J0109J6843J4840O407J4979L9930O5797
12509B52435O4754O8400R1008J45841K44324M57065Q74746J495241J725194N06637
12499E925645j108429j705381j209048o81482l78885k30722j44533r2941o2257
12490C11967m4361m0230k9890j4946j7627j8008p904j5703j6746k903L392N681
12478A12722k815j2542m181K925J2370J032p500J8499K5187J1330J8285L3065
12466B08377K8608M4368P2470R0823J33552J91997L47282O85148J253519J773084
12456D829228J211246m81451j666205j533710r15825n03541k81087j70406j09231
12447C79018o5386n8043l8848k2084j4905k0945k3106p275j6609j1709j446O177
$$ plain form
12522 91635 84484 85909 89208 86129 83456 83530 93639 110482 125322 131729 146708 186638 252435
12509 252435 317189 385589 476597 622438 866762 1323827 2198573 3693814 5419008 5925645
12499 5925645 4817216 3111835 1902787 1221305 842420 611698 467165 374224 311967
12490 311967 267606 227376 197486 182540 164913 146905 139001 123298 106552 103649 107041 112722
12478 112722 109907 97365 93184 96109 108479 109511 102011 120510 145697 157027 175312 208377
12466 208377 236985 281353 353823 444646 578198 770195 1117477 1802625 3056144 4829228
12456 4829228 6040474 5559023 3892818 2359108 1443283 939742 658655 488249 379018
12447 379018 313632 255589 216741 194657 179752 158807 135701 128426 111817 100108 98662 104839
12435A04839l472j585j4186L162R297J1121K5553J88j0166q187N837Q239j882
12422A28758k0751r220K2068K8794L5477N4366R5936J69817L40568N73083N39599
12411A958495O1079m43788n61658l84845k30380j22628p0299n2235l1799k4325
12401I7617j0339Lj2001j5678j0038q081j8100k496r435j4407K0385J2625J143
12388C1198j5939k2447r254p910K9109Q005o72J5622J0029L278L385l482r165
12375C1757k759J928j5110K700J796j3925r857r40R096J943J007P104k801J463
12361A3402O101j0374n216J9749R652M254N643o997j6014k160N339P002J661j1606
12347B0436o582P262j0929K377O823p595k968P495J2495K911j686r838j0026p280
$$ plain form
12435 104839 101367 99782 85596 88758 98055 109176 134729 134917 124751 116564 122401 130640 128758
12422 128758 108007 98787 120855 149649 185126 239492 335428 505245 845813 1418896 1958495
12411 1958495 2019574 1575786 1014128 629283 398903 276275 205976 153741 121942 97617
12401 97617 87278 87281 75280 59602 49564 41483 23383 20887 11452 -2955 17430 30055 31198
12388 31198 15259 -7188 -16442 -24352 4757 12762 12090 27712 37741 41019 44404 40922 31757
12375 31757 28998 30926 15816 18516 20312 6387 -3470 -4410 4686 6629 7636 14740 11939 13402
12361 13402 19503 9129 3913 23662 33314 37568 43211 36214 20200 18040 23379 30381 32042 20436
12347 20436 13854 21116 10187 12564 19387 11792 8824 16319 28814 31725 30039 20201 10175 2895
12333B895K744P84j0446P161J498P894r16m64M351J929P961L592l116J4390K478
12318D2735m56p719l114O176J1972N649M43J3017J0113P151J3874L4222M7705
12305A81768O3690J06246J75338K26064J86244R9459k1356j49839k10424j87694
12295D69496j41022j05796p6039l3380r715j9565K363p674j9703n976l631p454
12283D1904l088j2231j3540Q13q257k319m68n067J3211n223P250J5373K97L439
12269C2094J3952O450L569K7218K0041K9283P1891R5626R5352P8548M4461O609
12257E25094l2681p5591q9200q9314p0624n2342l4792j3972Q791k0508j4825p245
12245C2791o649O386J927K515k581r66m084j2019r291N851J2110l05n315j2998
$$ plain form
12333 2895 5639 6423 -4023 3138 4636 12530 11614 11150 15501 17430 25391 28983 25867 40257 42735
12318 42735 42279 34560 31446 37622 49594 55243 55686 68703 78816 85967 99841 134063 181768
12305 181768 245458 351704 527042 753106 939350 1038809 1017453 867614 657190 469496
12295 469496 328474 222678 146639 113259 103544 83979 86342 78668 58965 52989 49358 41904
12283 41904 38816 26585 13045 13858 5601 3282 2814 -2253 10958 5735 12985 28358 28655 32094
12269 32094 46046 52496 56065 83283 103324 132607 204498 300124 395476 474024 518485 525094
12257 525094 492413 416822 327622 238308 167684 115342 80550 66578 75369 54861 40036 32791
12245 32791 26142 32528 34455 36970 34389 33423 29339 17320 8029 13880 25990 25685 20370 7372
12231G372m112m11J1268O13N423l329n557m449j0531J3296J1078o683j4532r060
12217i614k89k027J0866k235O975J941m060J9740Q064n023n543o899O159m454
12203A3601M674m995j8089l027q44l786l77m022Q232P755j2206o383Q639N057
12189e771l228r281J139Q392O706N099j4275J895J3557n267r599O84J2728Q910
12175A1689J1350o11K618J368J3833l041j6220J860n45J350k891j9800j3713k529
12161a5282j213J4449J0779N418R562n638j1439J049m525k32L753j777p153j814
12147d063k272k278q811k394L257J1101J5908n020j3063N377o631j1745J0182
12134a0452J6810j0649R549J0017P972J5652L0963M0683K8271L884l4684m3803
$$ plain form
12231 7372 3260 2849 14117 14730 20153 16824 11267 6818 -3713 9583 20661 13978 -554 -9614
12217 -9614 -9903 -11930 -1064 -3299 3676 5617 1557 21297 29361 24338 18795 11896 18055 13601
12203 13601 18275 13280 -4809 -7836 -8680 -12466 -12843 -16865 -8633 -878 -13084 -19467 -10828 -5771
12189 -5771 -8999 -18280 -17141 -8749 -2043 3056 -11219 -9324 4233 -1034 -10633 -9949 2779 11689
12175 11689 23039 22428 25046 26414 40247 37206 20986 22846 22301 23651 20760 960 -12753 -15282
12161 -15282 -16495 -2046 8733 14151 23713 18075 6636 7685 3160 2928 6681 4904 -2249 -4063
12147 -4063 -6335 -8613 -17424 -19818 -16561 -5460 10448 5428 -7635 -2258 -8889 -20634 -10452
12134 -10452 6358 -4291 5258 15275 23247 38899 69862 110545 138816 142700 108016 64213
12122F4213k3677j7324J791J1191l581j9632J0434L089J956n751m082N566o545
12109A7648n658k2446k217K734N026K969k726J0240P371j1257L034l085l787j1983
12095a4137L332N454j0627N049J3293Q013Q095J5852n558J8900J9082J4235K6825
12082A07808L2931J1061j3141l5481l2272k6252n996j088J489j3618r208P406
12070B3639j849j5899M530N346j141O673J627p072j0030j5906p382J201P74j487
12056a6976Q931J485P017J418o3Q546K0065M006m953n236Qk093N119J0107k0120
12041A7261j0596N599J2666O092Q769K195L242k5474j1800j674j3407M56J1518
12028D847m56r291q839o671k57O782m745k358O13J0404O920J0310k450R432r89
$$ plain form
12122 64213 40536 23212 25003 36194 32613 12981 23415 26504 28460 22709 18627 24193 17648
12109 17648 11990 -10456 -12673 -9939 -4913 -1944 -4670 5570 12941 1684 4718 1633 -2154 -14137
12095 -14137 -10805 -5351 -15978 -10929 2364 10377 18472 34324 28766 47666 66748 80983 107808
12082 107808 140739 151800 138659 103178 70906 44654 38658 37570 39059 25441 16233 23639
12070 23639 21790 5891 10421 15767 14626 21299 22926 15854 5824 -10082 -17464 -16263 -15489 -16976
12056 -16976 -8045 -6560 457 1875 1812 10358 30423 34429 29476 24240 24248 22155 27274 37381 17261
12041 17261 6665 12264 24930 31022 39791 41986 45228 19754 7954 6280 -7127 -6671 4847
12028 4847 4391 -4900 -13739 -20410 -20667 -13885 -18630 -20988 -20375 -9971 -3051 7259 4809 14241 13252
12013A3252M985n941J130q17o013K705r56j161J1566K679m256k88j0918M016M750
11998A4733j3319j750R205O869l988K484N734M647K87n34j2412k0769l003J198
11984a0618M241k913J4995K61m701o531K654l428P300k635j3824j4249P708J5009
11970f731P881j408J4600N381n784M453k310r5J0074n666j763J0128N846j232
11956C3374j3828k2499k973o279m768n558N074p9L826N438k882o536M151j148
11942a4687R942J1974n598n889K981J228J0673K213j594m538l659l97j0307j1787
11928a9445L747J3587n743r410N098J0433k899o97m214L092j312O470O928m476
11914A159N678O266l653l1700p584R587K507L169L789o772m990P083J6749M112
$$ plain form
12013 13252 18237 12296 13426 12609 6596 9301 8345 7184 18750 21429 17173 16885 5967 9983 14733
11998 14733 1414 -336 8869 15738 11750 14234 19968 24615 24902 24368 11956 -8813 -11816 -10618
11984 -10618 -6377 -9290 5705 5966 1265 -5266 -2612 -6040 1260 -1375 -15199 -29448 -21740 -6731
11970 -6731 1150 -258 14342 19723 13939 18392 16082 15987 26061 20395 18632 28760 34606 33374
11956 33374 19546 -2953 -5926 -12205 -16973 -22531 -17457 -17536 -13710 -8272 -11154 -17690 -13539 -14687
11942 -14687 -4745 7229 1631 -4258 -1277 -49 10624 12837 11243 6705 3046 2649 -7658 -19445
11928 -19445 -15698 -2111 -7854 -17264 -12166 -1733 -4632 -5329 -9543 -6451 -7763 -1293 5635 1159
11914 1159 6837 13103 9450 -22250 -29834 -20247 -17740 -14571 -10782 -17554 -22544 -15461 1288 5400
11900E400O833J0283o493R087k891O194k921l60k320j2470r944j0547M120J2007
11886E978R349L983n032j4268q428l767L064l016M836m715P010J4293k215o940
11872A32m263J378M377j5111P911N213p501q300M552M144J2226J6661j3817j7744
11858a0142k979k421M422k676P319J0341M19J1506q291j0330p530N217K079r26
11844c992P992P631K615l973N728j2994j0868Q178J338P54Q405R922J0828q598
11830B2966p051j5933j4977L213J6754J8414L165o966R714M172j6775j4498L418
11817E616K81J589j3473k312J2102N047m996J0216R91K167q429j6725j7181l328
11803b8435J4689K966j382J5856K2139o318j7815J083J7673j1277j7191J919N211
$$ plain form
11900 5400 12233 22516 16023 25110 22219 28413 25492 25132 22812 10342 398 -10149 -6029 5978
11886 5978 15327 19310 14278 10 -8418 -12185 -9121 -12137 -7301 -12016 -5006 9287 7072 132
11872 132 -4131 -2753 1624 -13487 -5576 -363 -7864 -16164 -11612 -7468 4758 21419 7602 -10142
11858 -10142 -13121 -15542 -11120 -13796 -6477 3864 4283 15789 7498 -2832 -10362 -5145 -3066 -3992
11844 -3992 4000 11631 14246 10273 16001 3007 -7861 317 1655 2409 10814 20736 31564 22966
11830 22966 15915 -18 -14995 -11782 4972 23386 26551 19585 29299 33471 16696 2198 5616
11817 5616 5897 7486 -5987 -8299 3803 8850 3854 14070 15061 17228 8799 -7926 -25107 -28435
11803 -28435 -13746 -10780 -12162 3694 25833 19515 1700 2783 20456 9179 -8012 -6093 -882
11790h82j5516p21M355j19P021O847j1427o800L99J4962J2801J1953p800m462
11776A0611l897n437o933N344j0659P567j515j3699N651Q749Q038j598L391M654
11762A0267J5930m030p168j5247J232J4019k1P3m364l916J510j114j199o580J0442
11747I834J9752k226j7000j5228j3615j08j0623R526J7703k261n968J4048o179
11734b345r25L582J191P18L51K844K73o427O366r339j5986q01N59J0555J4158
11719D774M569j1883K630L011l737j0319p014Q091Q588k505Q278P100P82K536
11705A4901m840j957J5120L117n830r838j0596J480k182N59P515n576o97R274
11691A0450k097p285j710M503o500k112R953J1075j4254j1430j856M736J3026
$$ plain form
11790 -882 -16398 -17119 -12764 -12883 -5862 985 -10442 -17242 -16843 -1881 10920 22873 15073 10611
11776 10611 6714 1277 -5656 -312 -10971 -3404 -4919 -18618 -12967 -4218 3820 2222 5613 10267
11762 10267 26197 22167 14999 -248 984 15003 14982 15055 10691 6775 8285 7171 5972 -608 9834
11747 9834 29586 27360 10360 -4868 -18483 -18591 -29214 -19688 -1985 -4246 -10214 3834 -2345
11734 -2345 -3270 312 1503 2221 2572 5416 5689 -738 5628 -3711 -19697 -20498 -19939 -9384 4774
11719 4774 9343 -2540 90 3101 -636 -10955 -17969 -9878 -1290 -3795 4483 11583 12365 14901
11705 14901 10061 8104 23224 26341 20511 10673 77 1557 -625 -66 7449 1873 1176 10450
11691 10450 8353 1068 -642 3861 -2639 -4751 5202 16277 2023 -9407 -11263 -6527 6499
11678F499K669m774k376l763m973p038J1076L233L513J3906J1153j796k873j4433
11664A0023j1138j0430J265j766P294l43J494o875L646J1871m911j7142Q89P733
11650h390O817L906k259m394k817J38P646q676p862L631Q996j3106j3785j0094
11636d0249N649J7688P268j9472m82J5803J0341j7524K82J2089M820L085L811
11623C109r115j4272O178J1164n450N701q709P396N248K118M985o244l113l464
11609d468l596l769O187l035K0162J823j758j185n40j2270j705P518K025K428
11595G817j613J194n013q078l953J2763Q521k262Q297j478j1891j1487N687J3808
11581A2312P064m336N958j1028j374M24l705m978k754l41J2577Q681j780j1792
$$ plain form
11678 6499 9168 4394 2018 -1745 -6718 -13756 -2680 553 4066 17972 29125 27329 24456 10023
11664 10023 -1115 -11545 -10280 -12046 -4752 -5095 -3601 -10476 -6830 5041 130 -17012 -16123 -8390
11650 -8390 -1573 2333 74 -4320 -7137 -6999 647 -8029 -15891 -12260 -3264 -16370 -30155 -40249
11636 -40249 -34600 -16912 -9644 -29116 -29598 -13795 -3454 -20978 -20696 -8607 -3787 -702 3109
11623 3109 -6006 -20278 -14100 -2936 -8386 -2685 -11394 -3998 1250 3368 8353 2109 -1004 -4468
11609 -4468 -8064 -11833 -5646 -8681 11481 13304 11546 10361 9821 -2449 -4154 3364 5389 7817
11595 7817 6204 7398 2385 -5693 -9646 3117 11638 9376 17673 16195 4304 -7183 -1496 12312
11581 12312 19376 15040 20998 9970 8596 9020 5315 337 -2417 -2758 9819 18500 16720 4928
11567D928o82o2N528K684l380k529o734r408P858J1911L239O746K290j7602k641
11552B146j871o198L231q724j0276K364J1554J1963K613P575l788K814j5309n021
11538f927J7501M948J444p271j7892m883Q062k149j0034N849J4821j1933o335
11525a4799m024O473m22Q209R136k636R863k878j6330J747J0058o25P285J2015
11511B3072l599j0799n945j1461O21K288J756j8643j701J0194m754k140J3866
11498g245J7885o105L554P085N691r126m865j9335n494J9909j972n547j2200L230
11484a4535O010J2602J40O63k09K958l190n154l30l162m367K509j7353q563K751
11469b9230J4086J7747O992j746p275L697M69m313O937Q6R133P179o767r189J823
$$ plain form
11567 4928 4246 4184 9712 12396 9016 6487 -247 -9655 -1797 10114 13353 20099 22389 4787 2146
11552 2146 275 -5923 -2692 -11416 -21692 -19328 -7774 4189 6802 14377 10589 13403 -1906 -6927
11538 -6927 10574 15522 16966 9695 -8197 -13080 -5018 -7167 -17201 -11352 3469 -8464 -14799
11525 -14799 -18823 -12350 -12772 -4563 4573 1937 11800 8922 -7408 -5661 4397 3772 11057 23072
11511 23072 19473 8674 2729 -8732 -8111 -5823 -4067 -22710 -24411 -14217 -18971 -21111 -7245
11498 -7245 10640 4535 8089 15174 20865 11739 6874 -12461 -17955 1954 -18 -5565 -17765 -14535
11484 -14535 -8525 4077 4217 4880 4671 7629 4439 -715 -1045 -4207 -8574 -6065 -23418 -31981 -29230
11469 -29230 -15144 2603 9595 7849 574 4271 4740 427 7364 7450 16583 23762 16995 7806 9629
11454I629l611r001L111p852N526N163R457k32j1409q150J0662R957q828N09n969
11439a038m879K366J5282j1503j0472J082R645j747J0718O721m351l881r179J3021
11425A1785R316k43o810j1970n324k654J2299J1573K818R359K9945L0461K3794
11412A14349J6596j0173l7562k7766k3296j5637M68j0109l612N204O417K321j880
11399A5320N661J4679Q073n22j02j5837j8941N393Q892J2731N137j0386q430J3163
11385C4831Q183o913R162L2118M6363K2203k4092m6665l2670j3703j4021j2551
11373B245M152J8450N897l212q178N004O529R862K21p77L639j8354j0504J272
11359A6246Q372n270J0801J340k062Q66p465n40p885o639l601o276l683O836k652
$$ plain form
11454 9629 6018 -2983 128 -7724 -2198 2965 12422 12190 781 -7369 3293 13250 4422 4931 -1038
11439 -1038 -5917 -3551 11731 228 -10244 -9162 483 -1264 9454 16175 11824 7943 -1236 11785
11425 11785 21101 20858 14048 2078 -3246 -5900 6399 17972 20790 30149 60094 90555 114349
11412 114349 130945 120772 83210 55444 32148 16511 16979 6870 3258 8462 14879 17200 15320
11399 15320 20981 35660 43733 43211 43109 27272 8331 13724 22616 35347 40484 30098 21668 34831
11385 34831 43014 36101 45263 77381 123744 145947 121855 75190 42520 28817 14796 2245
11373 2245 6397 24847 30744 27532 19354 24358 30887 40749 40970 40193 43832 25478 14974 16246
11359 16246 24618 19348 30149 31489 29427 30293 22828 22288 14403 7764 4163 -2113 -5796 1040 -1612
11344a612l355m798L021N007M535N78J1729K267j1149k0318P767O693o060j3542
11330a9237l917l586N391k916N743P747N195k948l371J3166O389n212J439J5037
11316A8920L450j95R551J281J102L960o181m726R14O033J091k4655K088J6068
11302B8701O866q78j3789k201P117p93k479l175m877j0019p417m74J1381n063
11288B900n772J102J4243J0548J323j177p096k2482P998K0760R727O050K011j4655
11274B5480n749J6573J3430J2855j17k576l009j9644j3847J2943k4371j5000K091
11261i41N430o915J061J4099J1591K714o147k638j1735p966j50Q791J1736N175
11247B4105N562m536j2692M422K035L421N777j3472n200P924j498J837K782q848
$$ plain form
11344 -1612 -4967 -9765 -6744 -1737 2798 3376 15105 17372 6223 -14095 -6328 365 -5695 -19237
11330 -19237 -23154 -26740 -21349 -24265 -18522 -10775 -5580 -8528 -11899 1267 7656 2444 3883 18920
11316 18920 22370 22175 31726 33007 34109 38069 31888 27162 28076 34109 35200 10545 12633 28701
11302 28701 35567 34689 20900 18699 25816 25023 22544 19369 14492 4473 -2944 -3418 7963 2900
11288 2900 -2872 -1770 12473 23021 24344 23167 16071 -6411 1587 22347 32074 38124 40135 25480
11274 25480 19731 36304 49734 62589 62472 59896 56887 37243 23396 36339 11968 -3032 -941
11261 -941 4489 -2426 -1365 12734 24325 27039 20892 18254 6519 -1447 -1597 7194 18930 24105
11247 24105 29667 25131 12439 16861 18896 22317 28094 14622 9422 17346 15848 17685 20467 11619
11233A1619L508l221J61J2771j534j6293r833J3709K701J477j5605k976J5066
11220A1550j8870J00N990J7791J2313Q901n576j591J283N542j4410j2757m88O756
11206A6534R011J180P406M116j0838o457k736r69r526j1000P215N798m776K537
11192G495j540l086m265J4118J692J0021J032j8151j3743J7478N826l704j769
11179A1404M93M690k448K88K3661K660o36j1775q099M679K28o561j4159L196m845
11164B776L515O738R612J813J2250R857q646n345p22J269l739J1831p120R77M49
11149C5515j3166q122l077O677R291J3537Q508j4189j6320n618O545j228r02j612
11135A5839p769J7450l998n314r344R920R488R010l123M049P023n590p818N92
$$ plain form
11233 11619 15127 11906 12067 24838 23304 7011 -2822 10887 13588 15065 -540 -3516 11550
11220 11550 -7320 -7220 -1230 16561 28874 37775 32199 30608 31891 37433 23023 10266 9778 16534
11206 16534 25545 26725 34131 38247 27409 20952 18216 17247 7721 -3279 3936 9734 4958 7495
11192 7495 5955 2869 -1396 12722 14414 24435 25467 7316 -6427 11051 16877 13173 11404
11179 11404 11897 16587 14139 14427 38088 40748 40112 28337 20238 24917 25145 18584 4425 7621 2776
11164 2776 6291 13029 22641 24454 36704 46561 37915 32570 31848 33117 29378 41209 34089 35066 35515
11149 35515 22349 14227 11150 17827 27118 40655 49163 34974 18654 13036 19581 18353 17451 15839
11135 15839 8070 25520 21522 16208 6864 16784 26272 35282 32159 36208 43231 37641 29823 30415
11121C0415m269p523r417M886l490j36R588O728L89O46r136l126m331j3918j0637
11106a3331P792J0003J2408M509n182j37O734K470k086n804R04R263n220j7800
11092D523j2066P014K469Q040J2013r94J36o172N674K146n199p7J4373K657r75
11077C3562m548R084o57r968j6205M396p272l522K8329P310j3501j8215j3535
11064d742n796J171K0597K877l233O44n41l434n102Q634m64J450N747P132J324
11049B6264q525m404N070L365M640L061N357k0519k5249p831M307J2088K1682
11036A9306N601N593J1341J0434R971J75j0194j8075j1453j168j278K48K748p192
11022A6057K216O774J0683P410m117j0677q025J2531P260n051j555M585J3961
$$ plain form
11121 30415 26146 18623 9206 14092 10602 10466 20054 26782 27171 27817 18681 15555 11224 -2694 -13331
11106 -13331 -5539 4464 16872 21381 16199 16062 22796 25266 23180 17376 18280 27543 22323 4523
11092 4523 -7543 -529 1940 9980 21993 20999 21135 14963 20637 22783 17584 17507 31880 34537 33562
11077 33562 29014 38098 37441 27473 11268 15664 8392 4870 33199 40509 27008 8793 -4742
11064 -4742 -10538 -9367 11230 14107 10874 11518 10977 7543 2441 11075 10611 12061 17808 24940 26264
11049 26264 17739 13335 18405 21770 26410 29471 34828 14309 -10940 -18771 -14464 -2376 19306
11036 19306 24907 30500 41841 52275 62246 62421 52227 34152 22699 21531 20253 20501 23249 16057
11022 16057 18273 25047 35730 43140 39023 28346 20321 32852 40112 35061 33506 38091 52052
11009E2052K2510R562J0578R709J2757K3335L2194M6524P2588J19898K21454L56729
10997I89890M38916L25905Q903l29938m26512l36758k24175j35274q5064n9227
10987A66666k6585q685k0634j3184j6509q723r966o407k069o290O514N621k928
10974E6821j3999m164r499n636P30J583O094J949J710j94m820j517J0260j785
10960C7533n51K518M429J0036K013o193n013j309O64l471j7621N58n332j3325
10946D936l355j162P267K766Q559J4714j490l276J233N181j5506q525n21o037
10932D784R766J0618Q972j7662r009O712o450O616O151J7046J0983o140J616j4120
10918B9883k5165J1839R700Q658Q192k1826l055Q988J1556L493P84j4161j5303
$$ plain form
11009 52052 74562 84124 94702 104411 117168 140503 172697 219221 291809 411707 633161 989890
10997 989890 1428806 1754711 1763614 1433676 1007164 670406 446231 310957 225893 166666
10987 166666 140081 131396 110762 97578 81069 72346 62380 55973 53904 47614 54128 59749 56821
10974 56821 42822 38658 29159 23523 24253 25836 31930 33879 35589 35395 30575 29058 39318 37533
10960 37533 36982 39500 43929 53965 55978 49785 44772 43463 44127 40656 23035 23593 18261 4936
10946 4936 1581 419 7686 10452 19011 33725 32235 28959 30192 35373 19867 11342 10821 4784
10932 4784 14550 25168 34140 16478 7469 14181 7731 14347 20498 37544 48527 42387 44003 29883
10918 29883 4718 16557 26257 34915 43107 21281 18226 27214 38770 42263 43047 28886 13583
10905A3583L708K2106J3469L230j9776n659M243r189O63K719M249J1264n032j3182
10891B6396M325n447j1019o817j5926k1692j8534q252j2263j2969M03K6421K7426
10878b7948J5646M570R715J3317J1471N552k298P453Q230J883j4252j099L971
10865C6211L951J229j665L812N171o531k376K950j2505n433O527J3245K115J514
10851D8215l238m895m971o426J1715N947M09n278k719o046Q875P849j2909P222
10837D3750K2089K2704J4014n45M762J2892M1466L4745K9290j790j8443l7348
10825A67586l0034j1309j7959k1412j4442m905P374m666M129l768p050j456k0838
10812D1250k1730r597J1103K5758J4870J1048Q66j2160q071j0950R728r660K08
$$ plain form
10905 13583 17291 39397 52866 56096 36320 30661 34904 25715 26378 29097 33346 44610 39578 26396
10891 26396 30721 25274 14255 7438 -8488 -30180 -48714 -56966 -69229 -82198 -81795 -55374 -27948
10878 -27948 -12302 -7732 1983 15300 26771 32323 30025 37478 45708 47591 33339 32240 36211
10865 36211 40162 41391 39726 43538 48709 42178 39802 42752 30247 24814 31341 44586 46701 48215
10851 48215 44977 40082 35111 28685 40400 46347 46756 41478 38759 32713 41588 49437 36528 43750
10837 43750 65839 88543 102557 102012 106774 119666 161132 195877 225167 223377 204934 167586
10825 167586 137552 126243 108284 86872 72430 67525 74899 70233 74362 70594 63544 62088 41250
10812 41250 19520 9923 21026 46784 61654 72702 73568 61408 53337 42387 52115 42455 42663
10799D2663K265N255J2556J8089M909j0007p931n320j0197L558O680J6509O421
10786H5450k089o128Q493M252L60q026k0124l981J9211K963q073P537q03o839
10772G2203j5764j4458j5563m4746p2357q6179o7076n641N3791Q8921Q2925N3157
10760B9213L0585J2404P502L581l116K569j630j3685j1336j418l618n112l902
10747D2037j5831N576J7032P026k574q424j8186J486J5097k792K164J9589J9509
10734H1709K3004M4964N0561K3716Q98j6537m2105k1384j6707o065k159j2612
10722A07283q691j117o803j7272J0925J3517J23j5165q260P321o002k5686n748
10709D4425j5225j3104j1699m517J1287K7173O6258R8408R4115N0322L469k6579
$$ plain form
10799 42663 44928 50183 62739 80828 85737 75730 67799 62479 52282 55840 62520 79029 85450
10786 85450 83361 77233 85726 89978 90338 82312 62188 58207 77418 80381 72308 79845 79042 72203
10772 72203 56439 41981 26418 -18328 -90685 -176864 -243940 -249581 -195790 -106869 -23944 29213
10760 29213 59798 72202 79704 83285 80169 82738 81108 67423 56087 54669 51051 45939 42037
10747 42037 26206 31782 48814 55840 53266 44842 26656 28142 43239 40447 42611 62200 81709
10734 81709 104713 149677 200238 223954 224852 208315 166210 144826 128119 122054 119895 107283
10722 107283 98592 97475 90672 73400 84325 97842 97965 82800 74540 81861 75859 50173 44425
10709 44425 29200 16096 4397 -120 11167 38340 104598 203006 297121 347443 350912 324333
10697C24333l3287l5111j3346j3261j7694M19k799L45q469M47K2591K1905P505
10684B53578K790O18k436J664J3720J748q969j0402J6649M925r054n960q631j6262
10670B33978m392l644p755L042K0065Q19k925O839J0777N383N437J4700J6110
10657B98434R832j226j8002k694J8288L2168J2826J279J1585M072n516o236J451
10644C56261J1783J0163n26O09J8678K1609J8921k647j1320k954o467N097K5327
10631D44534J8690J5281K7206M1517M9458M5483N7022N8916N1117N3699L9723
10620I02646K0616K023Q970O510J6620J8903Q023J8277M7833O7014P8432Q5328
10608A281195Q7634Q7017J04183J07682J39266J78653J60103J70922K01113K52910
$$ plain form
10697 324333 291046 255935 242589 229328 211634 212053 209254 209599 201130 201577 224168 246073 253578
10684 253578 256368 256986 254550 256214 269934 271682 262713 252311 268960 273885 264831 258871 250240 233978
10670 233978 229586 225942 218187 221229 241294 242113 239188 246027 256804 262187 267624 282324 298434
10657 298434 308266 307040 289038 286344 304632 336800 349626 350905 362490 366562 361046 354810 356261
10644 356261 368044 378207 377681 378290 396968 418577 437498 434851 423531 420577 414110 419207 444534
10631 444534 463224 478505 505711 547228 596686 642169 699191 758107 809224 862923 902646
10620 902646 923262 925285 934255 940765 957385 976288 984311 1002588 1050421 1117435 1195867 1281195
10608 1281195 1368829 1455846 1560029 1667711 1806977 1985630 2145733 2316655 2517768 2770678
10598B770678L23469M33089O06841P87775P90409N42921K95400K72055N00458
10589G323095P83379J089930J506865K082968K813295L823181N334663P835300
10581C2592676J2363734K0901889L6692148O2196980Q7053535P6811843J4436979
10574C43049784n5875379q4642663p0597989m5784731k7722158j7021521j0867775
10567C0537568p195017m892904l418335k528528j958517j488023j068421o97518
10559G290305l63331j37659j65904m76247p83380q35820o81384n15875l90166
10550B940539l15184k48779k09354j51043j13185j07245j11289r9271r8051r4751
10540A392387q1646n9704n5114n5322p8765r3059r2268q4454q2583p8485n6288
$$ plain form
10598 2770678 3094147 3527236 4134077 4921852 5712261 6255182 6550582 6822637 7323095
10589 7323095 8106474 9196404 10703269 12786237 15599532 19422713 24757376 32592676
10581 32592676 44956410 65858299 102550447 164747427 251800962 328612805 343049784
10574 343049784 287174405 202531742 131933753 86149022 58426864 41405343 30537568
10567 30537568 23342551 18449647 15031312 12502784 10544267 9056244 7987823 7290305
10559 7290305 6926974 6789315 6623411 6147164 5363784 4527964 3846580 3330705 2940539
10550 2940539 2625355 2376576 2167222 2016179 1902994 1795749 1684460 1585189 1487138 1392387
10540 1392387 1310741 1251037 1195923 1140601 1061836 968777 876509 792055 709472 630987 574699
10529E74699l3461k0607j0193J4152K3922K5859Q359j079j1014j3703j0386J778
10517E48326o840l0292n6278l9595j9093j4019k0637q073K711j7610k5379j5647
10505B97574j2939r555o506j624k365M452j1480j3373K393O94k471k0710k3021
10492B01069l898k686l642J1257n193o848L925Q455q765m48p24j9130l3225j4618
10478A25529j0637l642l494l958r182K088k130k1583j6980R302M006r320j3693
10465D6306m804J0527L396Q901J3391r055l4383k2058J2717J3337j9454j1597
10453G224j1687k1494j1469J8134N6409Q9543P3769K4501O308p599Q5j4626j9784
10440A89314j7499j9553j0109j4944k4650k0154L038O778M092j197P564m025j0907
$$ plain form
10529 574699 541238 520631 510438 524590 548512 574371 582730 581651 570637 556934 546548 548326
10517 548326 541486 511194 454916 415321 396228 382209 361572 353499 356210 338600 313221 297574
10505 297574 284635 275080 268574 266950 264585 269037 257557 244184 246577 247271 244800 224090 201069
10492 201069 197171 194485 190843 202100 196907 190059 193984 202439 193674 193226 192502 173372 140147 125529
10478 125529 114892 111250 107756 103798 94616 96704 94574 72991 56011 65313 69319 59999 46306
10465 46306 41502 52029 55425 64326 77717 68662 34279 12221 24938 38275 18821 7224
10453 7224 -4463 -25957 -37426 -19292 37117 126660 200429 224930 231238 223639 223724 209098 189314
10440 189314 171815 152262 142153 127209 102559 82405 85443 92221 96313 95116 102680 98655 87748
10427H7748j6580k0596j7633o247k0170l8075l4171k598K4947M6037M3058L1192
10415G6912J3889p975J308J111j7595n207P321P903k9o924M571O855M939k220
10401H4859Q382R342q873j3854k0868o589J638L764K437N744K403J3981M1927
10388A24293P1978R1225P0550J0063n9874p2994p4441n6014l2261j0905k66J0543
10376G1897P58K303k050o076q373o88k421l7J11o12Q965J472k409j3216r942k600
10360C7082n586J0323q354P740N54j0468o705J4157O647J4038R376M360r829q682
10346E4653q538o754L665R181j91M583N919m118r949P68j059m608p896R611K76
10331D5543M091O820J3521P405P16n630k058j762r259k449Q714K451R177M529
$$ plain form
10427 87748 71168 50572 32939 26692 6522 -31553 -65724 -68322 -43375 2662 45720 76912
10415 76912 90801 82826 84134 85245 67650 62443 69764 77667 77638 70714 75285 82140 87079 84859
10401 84859 93241 102583 93710 79856 58988 52399 54037 57801 60238 65982 68385 82366 124293
10388 124293 196271 287496 358046 368109 308235 235241 160800 104786 72525 61620 61354 71897
10376 71897 72655 74958 72908 66832 58459 57771 55350 55313 55424 54812 63777 65249 62840 49624 39682 37082
10360 37082 31496 41819 33465 41205 41759 31291 24586 38743 45390 59428 68804 73164 63335 54653
10346 54653 46115 39361 43026 52207 52016 56599 62518 58400 48451 49219 48160 43552 35656 45267 45543
10331 45543 49634 56454 69975 77380 78096 72466 70408 68646 59387 56938 65652 68103 77280 81809
10317H1809n381p575j092j7623q283O020N741J163O87Q286L696j1963o257j1473
10303C7755J335L361L305J1745J2024R480P049R914J3984J2278J2484K59K087
10290A37060L3448N9515M6930P7032J33596K38776L55410M43706L46436O0525
10280A932434k38382m02030l89803k72587j80317j18329o4115l6504j7286k2240
10270A90841m22O321L25k5883k7544k6949q714k0524k4493j2095k3354r656P853
10257B5706K2806J0907L135k180m628P595K971j6685o361L254r273j4709j6818
10244E720o204P719J6937O00Q005k140o811o219l324k830l2l352m34J3852P168
10229B8655m429M205P27K384J598J0041J244L372r513M062q510k381n084l441
$$ plain form
10317 81809 76428 68853 67761 50138 41855 47875 53616 54779 55466 63752 67448 55485 49228 37755
10303 37755 39090 42451 45756 57501 69525 79005 86054 95968 109952 122230 134714 134973 137060
10290 137060 170508 230023 276953 353985 487581 726357 1081767 1525473 1871909 1932434
10280 1932434 1694052 1292022 902219 629632 449315 330986 266871 230367 213081 190841
10270 190841 190419 196740 197065 171182 143638 116689 107975 87451 62958 50863 27509 17853 25706
10257 25706 48512 59419 62554 60374 55746 63341 66312 49627 43266 46520 37247 22538 5720
10244 5720 -484 7235 24172 24772 32777 30637 23826 17607 14283 11453 11421 8069 7635 21487 28655
10229 28655 24226 28431 29158 31542 33140 43181 44425 47797 38284 42346 33836 31455 26371 22930
10215B2930p124j458L439n148j08N789M554J2815N747J961k405q983j5802L387
10201A9594J378j199K159k95k806J3109J4350o67j1400j2052J0192P122r473J79
10187C0191L044j292M089M507K735j6473j0902K4J1731Q096n009k863N661j00
10173C3439m51r107M566J904n12Q988J3074R394J8660M68L411J1198J7222K1694
10159A33948J1176J6230Q416K8601N7713Q4797J45412K57221L63713M32957K72292
10148A812476q7091l71054m09667l15826k06098j27672p9178m6274j4292l1956
10138A23368k5418n911k0983j963j593k4107j1018J8146J7180q11j4720l240o520
10125D2410j0906j4911P314J1363j5465n417q541r14P61k382J4040j72l560J5121
$$ plain form
10215 22930 15806 14348 17787 12639 12531 18320 22874 35689 41436 43397 40992 32009 16207 19594
10201 19594 20972 19773 21932 21637 18831 31940 46290 45623 34223 22171 32363 39485 30012 30191
10187 30191 33235 31943 36032 40539 43274 26801 15899 15923 27654 35750 30741 27878 33539 33439
10173 33439 32988 23881 28447 30351 29839 38827 51901 61295 79955 80423 83834 95032 112254 133948
10159 133948 145124 161354 169770 198371 256084 340881 486293 743514 1107227 1540184 1812476
10148 1812476 1725385 1354331 944664 628838 422740 295068 215890 169616 155324 123368
10138 123368 97950 92039 71056 69093 67500 43393 32375 50521 67701 66890 52170 48930 42410
10125 42410 31504 16593 23907 35270 19805 14388 5847 4933 5694 3312 17352 17180 13620 28741
10111B8741Q469j4443r702O783N954P707N151L58j009K84j648k877J0660N768
10097E0196r363q942j1109P839J157Q006k764k196q046K112r593j1240P74j138
10083E693L666K4000L827k0336p03j2300N193K111M587J20m160m05P455J490O627
10068B6865k944L560J1023j686p975l704M302j80m753j5028m668m1k659m908P223
10053D427j871R803J0493J8846L96q735J027m028r929P621J0064r300j5800K955
10039A5969R432M024M514p21k663M859J6682J0179L263j8601j5943k440k0086
10026H468q266M78R396O089l91P056M729J4161j3991n029j1316n912M706j0612
10012d34L728Q459r733L363K1720K073j0523j0550o426O457J0630M065J3926K630
$$ plain form
10111 28741 37210 22767 13065 19848 25802 33509 38660 39018 38009 38293 36645 33768 44428 50196
10097 50196 40833 31891 20782 28621 29778 37784 35020 32824 24778 26890 17297 6057 6831 5693
10083 5693 9359 33359 37186 16850 16147 3847 9040 11151 15738 15858 11698 11293 18748 20238 26865
10068 26865 23921 27481 38504 36818 28843 25139 29441 29261 24508 9480 4812 4771 2112 -2796 4427
10053 4427 2556 12359 22852 41698 42094 33359 34386 30358 20429 28050 38114 28814 13014 15969
10039 15969 25401 29425 33939 33218 30555 35414 52096 62275 65538 46937 30994 28554 8468
10026 8468 202 680 10076 16165 15774 22830 27559 41720 27729 22700 11384 5472 10178 -434
10012 -434 3294 11753 2020 5383 27103 29176 18653 8103 1677 8134 18764 22829 36755 39385
9998C9385J250j1018M718L940m341L572p47j4516K763l539Q251R448L960j883
9984D1243j1460k0711m589P470N753j902k5649r905K1315J9105R235J0625k369
9971C8161l717q656K742n919O549m174l087J1135J006k4240l279K8245J2570j1895
9957C5441j023j0309l161j0831q244j3668K398Q078L701J2524R676J8693P525
9944E0800j9164j0360l652m000L833j281j0569J981R795K577K948R635M738M496
9930D1777p435j8166M289J660l864j88L784J650n479J5644K872K758M774Q22j3147
9915C1751k257n78N338R55j2218k727L323J0448K555N86j3950m180R010K446j669
9900B8833J4385n324j4345j1815L317R607J1654N139L37L661j204q448m392m363
$$ plain form
9998 39385 40635 29617 34335 38275 33934 37506 36759 22243 25006 21467 29718 39166 43126 41243
9984 41243 29783 9072 4483 11953 17706 15804 -9845 -19750 1565 20670 29905 40530 38161
9971 38161 34444 25788 28530 22611 29160 24986 21899 33034 34040 9800 6521 34766 47336 35441
9957 35441 34418 24109 20948 10117 1873 -11795 -9397 -1319 2382 14906 24582 43275 50800
9944 50800 31636 21276 17624 13624 17457 16176 5607 7588 17383 19960 22908 32543 37281 41777
9930 41777 34342 16176 20465 22125 18261 18073 21857 23507 18028 33672 36544 39302 44076 44898 31751
9915 31751 29494 28916 34254 35209 22991 20264 23587 34035 36590 37176 23226 19046 28056 30502 28833
9900 28833 43218 37894 23549 11734 15051 24658 36312 41451 41788 45449 44245 35797 31405 27042
9886B7042p597j54o17M21J753O571R373l854o840L814J181m330K288J2162O207
9871D7420n917j835J151M469J1161K128P097m61j1013j5660M075j928l309P42
9857C8120M702L34p007L087r430k959M086P790j2725j3850P346Q311j0075j1483
9843F247P954J7834J0574J5864K231O07k735k1778L494N660J433N515J6N397j992
9828E6321k13l251j4686j2400o8J2508N979K272m144M570L583j2965j8280m604
9814A4622J3839J576k082J1831j0919k0057J0685L5j0497J5184J8299N425p969
9801C9972K562P194k176k938j1021N699k786j146J585o46k997o31J0517k411r723
9786C1054K996J5669J1617o616M644o5j1748j3362j328J723O765J7317r690l231
$$ plain form
9886 27042 19445 19291 18674 19095 20848 27419 36792 32938 26098 29912 31093 26763 29051 41213 47420
9871 47420 41503 39668 40819 45288 56449 58577 65674 65213 54200 38540 42615 40687 37378 38120
9857 38120 42822 43156 36149 39236 29806 26847 30933 38723 25998 12148 19494 27805 17730 6247
9843 6247 14201 32035 42609 58473 60704 61311 58576 36798 40292 45952 47385 52900 52916 58313 56321
9828 56321 56108 52857 38171 25771 25703 38211 44190 46462 42318 46888 50471 37506 19226 14622
9814 14622 28461 30037 27955 39786 28867 8810 19495 19530 9033 24217 42516 47941 39972
9801 39972 42534 49728 47552 44614 33593 39292 36506 35360 36945 36299 33302 32671 43188 40777 31054
9786 31054 34050 49719 61336 54720 59364 59299 47551 34189 32861 34584 41349 58666 48976 45745
9772D5745L498l62J7297q251j7444j219N158l60n769o857j0020m978J4718K486
9758C3642R89K226J7967k546j7301p071P112J0241P460J810q166j1742P718Q341
9744E0680O630o429l333L333n336Q285R545k582j4348M649q42r480P869J8637
9730F7278O568r197o529L218R474q311j2763m919L579K666J919J4361K404j0081
9716E9667j6930n231J0262m506J147L605K849M569N51L06q393O303p216K018r101
9701C9900q533O843R322J2802R072m86j1148j2317m606M184L335P666J1905j821
9687F6118j554K817m538k96J213j8669j0398R98J6785L761L481M842J22P493Q68
9672G3043l374J0231M543K639n262n469j5294L782R427j683j021Q257l955j6355
$$ plain form
9772 45745 49243 48881 66178 57927 40483 39264 44422 44062 38293 31436 21416 16438 31156 33642
9758 33642 34631 36857 54824 52278 34977 27906 35018 45259 52719 54529 46363 34621 42339 50680
9744 50680 57310 50881 47548 50881 45545 53830 63375 60793 46445 51094 50252 40772 48641 67278
9730 67278 73846 64649 58120 61338 70812 62501 49738 44819 48398 51064 52983 67344 69748 59667
9716 59667 42737 37506 47768 43262 44409 48014 50863 55432 55983 56289 47896 54199 46983 49001 39900
9701 39900 31367 38210 47532 60334 69406 68920 57772 45455 40849 45033 48368 56034 67939 66118
9687 66118 64564 67381 62843 62547 63760 45091 34693 35691 52476 56237 59718 64560 64682 72175 73043
9672 73043 69669 79900 84443 87082 81820 76351 61057 64839 74266 72583 71562 79819 75864 59509
9658E9509q218J3162J5382O118j161j1149j158L095j391q708k840Q908J3158k183
9644H2524m627r184r984m961J915K405R495P456o611j0023o814l76J4640J8809
9630H4664n361L383Q601q529N057Q330q487M272L011j7414j1294J4462J9034M941
9616A04670j6754j4690j1248j6275J2838Q430N101M363L767k780N935M99J797
9603H5653J7326J2487j7795k4368l096J3146J2678P749l728j4055M147l785P769
9590I4128Q127q790K435q992J294O445O31l37L558L166J051j476m345P216M658
9575A08769p681j0527n759o948k673M841M192o485m586J947J7172M277M04k902
9561I4041O668k629j4339m696N878k592K980Q858J3416N043N039L132p522K823
$$ plain form
9658 59509 51291 64453 79835 85953 84792 73643 72485 75580 74189 65481 62641 71549 84707 82524
9644 82524 77897 68713 58729 53768 55683 58088 67583 75039 68428 58405 51591 51215 65855 84664
9630 84664 79303 82686 91287 82758 87815 96145 87658 91930 94941 77527 66233 80695 99729 104670
9616 104670 87916 73226 61978 45703 58541 66971 72072 76435 80202 77422 83357 83856 85653
9603 85653 102979 115466 97671 73303 70207 83353 96031 103780 100052 85997 90144 86359 94128
9590 94128 102255 93465 95900 86908 88202 94647 95278 94941 98499 101665 102716 101240 96895 104111 108769
9575 108769 101088 90561 84802 77854 75181 80022 84214 77729 73143 75090 92262 96539 96943 94041
9561 94041 100709 98080 83741 79045 84923 82331 85311 94169 107585 112628 117667 120799 113277 116100
9547A16100n817j1003N359R69Q320j5757p194J5816R429K453J2292q61r367p702
9533A13037N272k174q996p337N846J831L068j112k75J3566J0741O69M608k0751
9519A17993q163O481K352J5129K500l164n061P309j2704o499K590n315M467M950
9505A22865L952p7O086M780l914j0374n181K943J0542Q030l139P81j812O246N063
9490A46791m197o601J371K024j64r426l984J0521J026j989J3263L388r753J38
9476A42408q527Q625M358Q528P746j148N266R212Q515k321m901o198k271L666
9462A72958L54N471j354m483j2487J199O034P81N857J1509J5209k035m207n740
9448A89066j1599m929k118o942J405l499r62n023J019J7183M873M386R007J916
$$ plain form
9547 116100 110283 99280 104639 105608 113928 98171 90977 106793 116222 118675 130967 130106 120739 113037
9533 113037 118309 116135 107139 99802 105648 107479 110547 109435 109160 122726 133467 134136 138744 117993
9519 117993 109830 116311 118663 133792 136292 133128 128067 135376 122672 116173 118763 113448 117915 122865
9505 122865 126817 126740 132826 137606 133692 123318 118137 121080 131622 139652 136513 137294 135482 141728 146791
9490 146791 142594 135993 137364 139388 139224 129798 125814 136335 137361 135372 148635 152023 142270 142408
9476 142408 133881 142506 146864 155392 163138 161990 167256 176468 184983 182662 177761 171563 169292 172958
9462 172958 173312 178783 177429 172946 160459 161658 167692 168473 174330 185839 201048 199013 194806 189066
9448 189066 177467 172538 170420 163478 164883 161384 160422 155399 156418 173601 178474 182860 191867 193783
9434A93783o159M714O053J173n311m008Q789L795L965j254r203L133p963K034
9420A93541K00J621M529J962R09L162K0674J0531n804j0590K795K330o599J2477
9406B31738O27k503l588J459L615K915r6m131N33J1378R66j2101o186j527Q753
9391B31852Q158q572N542J4715J4985O020m590j1303k827L199J0786N81M097L069
9377B75712N718m462l356P951J3002J217o802l75J0560J1046M374L991N601n918
9363C18259r35j1806K398o928O356l267N449K566J0850J1009l84R818N637l695
9349C45327R441P613L10j0605p945M625k048J047J2711L118M684Q123o890r803
9335C59708K760m006P767K5735p49q722J4030Q787k757K985P205K0379J875j0950
$$ plain form
9434 193783 187624 192338 198391 199564 194253 190245 199034 202829 206794 205540 196337 199470 191507 193541
9420 193541 193741 195362 199891 201853 202762 205924 226598 237129 231325 220735 223530 225860 219261 231738
9406 231738 232365 229862 226274 227733 231348 234263 234167 230036 230569 241947 242913 230812 224626 223099 231852
9391 231852 240010 231438 236980 251695 266680 272700 268110 256807 253980 257179 267965 268546 272643 275712
9377 275712 281430 276968 273612 281563 294565 295782 288980 288605 299165 310211 314585 318576 324177 318259
9363 318259 317324 305518 307916 300988 307344 304077 309526 312092 322942 333951 333567 343385 349022 345327
9349 345327 354768 362381 362691 352086 344141 348766 346718 347765 360476 363594 368278 376401 369511 359708
9335 359708 362468 358462 366229 391964 391215 382493 396523 405310 402553 405538 412743 433122 434997 424047
9321D24047J561M689r856J644P860O682L486o50M891N397J5362P822Q805j0P064
9306D88794O719K459n519N288J807L480l086k452K467J325J4663J6258R332R224
9292E50759p209K298J3600P641N700J1134J2260K073l762L373k927J1048J1237
9279F17225J1321K3245J8831J938K632j5403K991Q845J6572J3144O298M340J1780
9266G23759n718k784J4500J0667J2911K4322J7299K931J2839J1805J3917L650
9254H40098o350J6764J5057J5557L866L197L43J5823J6200K7004J7849J2064J0518
9241I87990j567J154K7870K5837J0152m426K357L0937J9818J4773J8357J8107
9229A151359J0874J5697L4196J2652J7389K3953K2223l979N683K4657K9918J5640
$$ plain form
9321 424047 425608 430297 420441 422085 429945 436627 440113 439463 444354 449751 465113 472935 481740 481730 488794
9306 488794 495513 497972 492453 497741 499548 503028 499942 497490 499957 501282 515945 532203 541535 550759
9292 550759 543550 545848 559448 567089 572789 583923 596183 598256 594494 597867 594940 605988 617225
9279 617225 628546 651791 670622 672560 675192 659789 662780 671625 688197 701341 707639 711979 723759
9266 723759 718041 715257 729757 740424 753335 777657 794956 797887 810726 822531 836448 840098
9254 840098 833748 850512 865569 881126 884992 888189 888532 904355 920555 947559 965408 977472 987990
9241 987990 986423 987577 1015447 1041284 1051436 1047010 1049367 1080304 1100122 1114895 1133252 1151359
9229 1151359 1162233 1177930 1212126 1224778 1242167 1266120 1288343 1284364 1290047 1314704 1344622 1360262
9217A360262K2608L5076K3910J9289P443J0591K3841L5113K8711K5099J4767L0199
9205A636909K4808L3727K3191J8010L6923L3171K6145L9541M1266J3632J4289
9194A941612K6878M0090M1908M8682L4074K8440L9760M3056M9090M2009N0171
9183B385770N1834L1387M3925N4483O5391M2794M9801N5242M7217L6463N9184
9172B923491N9444N9501O3602Q5190O4745M9185O1354O1992O4908P6325P6371
9161C646108P9571R0226Q6694O8973O3317P9851J04577R3465Q5955R1441J04114
9150D594292J17502R6837R8840J18816J22524J07223J11728J13702J12695J10162
9140E704321J11552J37406J41520J24088J35317J39479J31092J32358J36460J31496
$$ plain form
9217 1360262 1382870 1417946 1441856 1461145 1468588 1479179 1503020 1538133 1566844 1591943 1606710 1636909
9205 1636909 1661717 1695444 1718635 1736645 1773568 1806739 1832884 1872425 1913691 1927323 1941612
9194 1941612 1968490 2008580 2050488 2099170 2133244 2161684 2201444 2244500 2293590 2335599 2385770
9183 2385770 2437604 2468991 2512916 2567399 2632790 2675584 2725385 2780627 2827844 2864307 2923491
9172 2923491 2982935 3042436 3106038 3191228 3255973 3305158 3366512 3428504 3493412 3569737 3646108
9161 3646108 3725679 3815905 3902599 3971572 4034889 4114740 4219317 4312782 4398737 4490178 4594292
9150 4594292 4711794 4808631 4907471 5026287 5148811 5256034 5367762 5481464 5594159 5704321
9140 5704321 5815873 5953279 6094799 6218887 6354204 6493683 6624775 6757133 6893593 7025089
9130G025089J30850J23281J37070J40692J30839J43589J50701J47508J45589J26075
9120H401283J29315J38143J18339J11459J14455J14460R8275R6977J03748R3292
9110I519746Q1577O8988O5230N8588M8223M2612K5771K9064J2857M548o395j6775
9098I934034k0904m0858m6992n4202n7570o0589p3677p8076r7194q9643q8968
9087I225361j02794j17070j17366j21072j38048j37005j38591j27966j42711j28861
9077G953877j33819j55739j38980j32318j43336j34521j40377j34335j39935j35037
9067F565480j30901j44442j23720j07256j26418j39083j37975j24850j16757j06549
9057E307529j17238j21381r7802r4870j06862j09008j07231j08653r7027q5506
$$ plain form
9130 7025089 7155939 7279220 7416290 7556982 7687821 7831410 7982111 8129619 8275208 8401283
9120 8401283 8530598 8668741 8787080 8898539 9012994 9127454 9225729 9322706 9426454 9519746
9110 9519746 9601323 9670311 9735541 9794129 9842352 9884964 9910735 9939799 9952656 9957204 9950809 9934034
9098 9934034 9913130 9872272 9825280 9771078 9713508 9652919 9579242 9501166 9403972 9314329 9225361
9087 9225361 9122567 9005497 8888131 8767059 8629011 8492006 8353415 8225449 8082738 7953877
9077 7953877 7820058 7664319 7525339 7393021 7249685 7115164 6974787 6840452 6700517 6565480
9067 6565480 6434579 6290137 6166417 6059161 5932743 5793660 5655685 5530835 5414078 5307529
9057 5307529 5190291 5068910 4971108 4876238 4769376 4660368 4553137 4444484 4347457 4261951
9047D261951p4038q7170p8159p6759p8743q7999q0254o6997o9169q4350q8521
9036C389792o9829o1836o9287o7628o7603n4544n4686o4674n0659n0860n9462
9025B718724o3830n7375l9057m8686m9823m2929l5056n1148m7333l0374m2096
9014B211017m3874m8538l8970l8059l2364j3585k8656l6948m0806l5208l7975
9003A816034l7262j7188k9589k8758j7527k7774j8805l2683l8589k9354k0062
8992A518443j6757k7663k5085l0086k9043p571k0256j7414k1207k2606k3162k2581
8980A255012k1478j6632k0318j2067j2953j8689j2896j8156j1911p056n348p667
8968A089841r011j5183j9312k4966j9840j3816k5199o757P475j9793j7012j8342
$$ plain form
9047 4261951 4187913 4100743 4022584 3945825 3867082 3779083 3698829 3631832 3562663 3478313 3389792
9036 3389792 3319963 3258127 3188840 3121212 3053609 2999065 2944379 2879705 2829046 2778186 2718724
9025 2718724 2654894 2597519 2558462 2509776 2459953 2417024 2381968 2330820 2283487 2253113 2211017
9014 2211017 2167143 2118605 2079635 2041576 2009212 1995627 1966971 1930023 1889217 1854009 1816034
9003 1816034 1778772 1761584 1731995 1703237 1685710 1657936 1639131 1606448 1567859 1538505 1518443
8992 1518443 1501686 1474023 1448938 1418852 1389809 1382238 1361982 1344568 1323361 1300755 1277593 1255012
8980 1255012 1233534 1216902 1196584 1184517 1171564 1152875 1139979 1121823 1109912 1102856 1097508 1089841
8968 1089841 1080830 1065647 1046335 1021369 1001529 987713 962514 955757 963232 943439 926427 908085
8956I08085m395L315O642J8925M293j8407l9509k5532j1069l0136k3595j1144
8944G77473j1909j066m425j1684m345j1432k971m381o963N626o324j5660j3890
8931F88049j162k667j7659j7100O48q049j0575r397j2383K213J0082r684j8699
8918E93617j9325j3421o113p983k157Q337L329q49n630Q389R075j1922j9754r681
8904E25912j5163l466j1435n411P510j522k522Q287j5673k4694j0259k594j0016
8891D38954N898n484j2119o610Q330N805j1721j1567j9471L070J0042J1046O87
8878D16860L939q178j0307j38k050j2795j7024J047K461K008O913J1094J7949
8865D11779K3710L6378K4650o482m2929l4027k4486k2948j2090j2038l113p0j4453
$$ plain form
8956 908085 903690 907005 913647 932572 936865 918458 878949 853417 842348 812212 788617 777473
8944 777473 765564 764498 760073 748389 744044 732612 729641 725260 718297 723923 717599 701939 688049
8931 688049 686887 684220 666561 649461 650109 642060 631485 622088 609705 611918 622000 612316 593617
8918 593617 574292 560871 554758 546775 544618 552955 556284 555435 549805 558194 567269 555347 535593 525912
8904 525912 510749 507283 495848 490437 497947 496425 493903 502190 486517 461823 451564 448970 438954
8891 438954 444852 439368 427249 420639 428969 434774 423053 411486 392015 395085 405127 416173 416860
8878 416860 420799 412621 402314 402176 400126 387331 370307 371354 373815 375823 382736 393830 411779
8865 411779 435489 471867 496517 490035 447106 413079 388593 365645 353555 341517 338404 338334 323881
8852C23881j763L766N677n217k194R39O313k902j1928p490j614m340j4272m160
8838B84696m010n742p014k067m11m20l472N14n763k29M870j171n980q60L940k469
8822B54412q925k1089N35Q154Q458J0752M103J9445r599j9035M237l174o807n28
8808B40939l666q125o571R401l964Q988l552l639p28r431K235L245r249r063P05
8793B07525j9214o509N297N667Q539J2904r076j9164n333M973q269Q68O107N53
8779A84868J2835m932m830k839N27L622k262k895Q883k956j3621L586k389j233
8765A76364q18P62N805r988r835J511J1514L820q22l877j248o256K986m196m502
8750A61220j6556o725K7r65K236J4172Q052L67L148l877l093j67J872k301n978
$$ plain form
8852 323881 322118 325884 331561 326344 324150 325089 331402 328500 316572 309082 307468 303128 288856 284696
8838 284696 280686 274944 267930 265863 265452 265032 261560 262074 256311 256082 260952 259781 253801 252941 256881 254412
8822 254412 245487 224398 224933 233087 241545 252297 256400 275845 266246 247211 251448 248274 241467 240939
8808 240939 237273 229148 222577 231978 228014 237002 233450 229811 229083 219652 221887 225132 215883 206820 207525
8793 207525 188311 181802 187099 192766 201305 214209 205133 185969 180636 185609 177340 178208 184315 184868
8779 184868 197703 192771 187941 185102 185629 189251 186989 184094 192977 190021 176400 179986 177597 176364
8765 176364 175546 176308 182113 172125 162290 163801 175315 179135 178313 174436 173188 166932 169918 165722 161220
8750 161220 144664 137939 137966 137001 139237 153409 161461 161828 164976 161099 158006 157839 159711 157410 151432
8735A51432P96O742K305L397J044k21N149p946O372n465p71J9956j54k3306j0985
8720A48345l89k658j783o2J5500J087k434j956L517k2924m165k162M74O732k920
8705A34202r067l445m834M982J381p91q094K100P600K822j0750j3382n693j0385
8691H6646l187J6805L607N869L601o661n068K2761O538J1010n716r471j1212M062
8677A19584l808J981J6130p053k1069k289J0350m561j1220O293R044J0325L079
8664A26786m159P575j3886j1345l313M43N360J7633k04j0727K998n012n579P604
8650A14174l308l095P636M020P649N536j1193K236J793n329J799J4201M571j1738
8636A28952j2683r563o484Q589J1421R399n653p870m047J7061J9250l229m827
$$ plain form
8735 151432 152228 158970 161275 164672 165716 165495 170644 162698 169070 163605 162834 182790 182636 159330 148345
8720 148345 147956 145298 143515 143453 158953 160040 157606 155650 159167 136243 132078 129916 130390 137122 134202
8705 134202 125135 121690 116856 121838 123219 122428 114334 116434 124034 126856 116106 102724 97031 86646
8691 86646 83459 100264 103871 109740 113341 106680 101612 124373 130911 141921 136205 126734 115522 119584
8677 119584 115776 117757 133887 126834 105765 103476 113826 109265 98045 104338 113382 123707 126786
8664 126786 122627 130202 116316 104971 101658 102101 107461 125094 124890 114163 117161 112149 106570 114174
8650 114174 110866 107771 115407 119427 127076 132612 121419 123655 125448 120119 121918 136119 140690 128952
8636 128952 116269 106706 100222 108811 120232 129631 123978 116108 112061 129122 148372 145143 140316
8623A40316j1248J678M165K9799J8628K0752J3602R216p98J3129L6581L0177M9782
8610C55779P1645J09555J81280L15189O05466J197032J912965J530222k41247
8601F037886j657406j680710j025403n60892l21117j94589j25705p7894n0518
8592C43652m2809k0371q94o645Q534j0187o570r824j9339k5895j6818r137M146
8579A87843Q579N022J7400K0467J8570M0866L5037K8285K4270J7833M3089N1946
8567D99207P9205J15592J65669K55193M47448Q76562J774713L368045L978635
8558A1560269R92015k606261l657125k428574j340067p75197m89457l29911k18580
8549G07112j34392r7509p1821l3123l2347j5470j6249k0328k5067j4584l353k4207
$$ plain form
8623 140316 129068 130746 134911 164710 183338 204090 217692 226908 226110 239239 275820 305997 355779
8610 355779 427424 536979 718259 1033448 1638914 2835946 4748911 6279133 6037886
8601 6037886 4380480 2699770 1674367 1113475 792358 597769 472064 394170 343652
8592 343652 300843 280472 279578 272933 281467 271280 264710 254886 235547 209652 192834 183697 187843
8579 187843 196422 201444 218844 239311 257881 298747 333784 362069 386339 404172 447261 499207
8567 499207 578412 694004 859673 1114866 1562314 2438876 4213589 7581634 11560269
8558 11560269 12552284 9946023 6288898 3860324 2520257 1745060 1255603 925692 707112
8549 707112 572720 475211 403390 370267 337920 322450 306201 285873 260806 246222 242869 218662
8537B18662k4110j6406n323L251J4441J3341o76K204J6008J7204j952K241K0769
8524B59654K5667M7265M6913N9744J11343J92129L31586O40420J221595J855611
8514D791927J295616m35122j664274j492019q21249m41778l14021k63256j65097
8505D90727j00272o9230o0198l3985k2441j4365j2473j5190k2681r746j616k0582
8493A07948l228j692j4412M717j3005k0304j344M306P490m157p711j2810J8260
8480F4058p88J359n002r197j2498K224J9937o65l732M43R1M402K2250J8843L7862
8465A39587N5496K0750m1134n8081l3272j2546q534m717M215j989k0536r855J0544
8452C9928O444K037q929P94O560Q711j2318j1152J40L616M950K857J2683n003
$$ plain form
8537 218662 194552 178146 172823 176074 190515 203856 203180 205384 221392 238596 236644 238885 259654
8524 259654 285321 332586 379499 439243 550586 742715 1074301 1714721 2936316 4791927
8514 4791927 6087543 5652421 3988147 2496128 1674879 1233101 919080 655824 490727
8505 490727 390455 321225 261027 227042 204601 190236 177763 162573 139892 130146 128530 107948
8493 107948 104720 103028 88616 93333 80328 60024 58680 62986 70476 66319 58608 45798 64058
8480 64058 63270 64629 59627 50430 37932 40156 60093 59428 55696 56139 56230 60632 82882 101725 139587
8465 139587 195083 215833 174699 116618 83346 70800 62266 57549 61764 59775 39239 29384 39928
8452 39928 46372 48409 39480 40274 46834 55545 43227 32075 32215 35831 40781 43638 56321 51318
8438E1318j3856m869j6555m301L779J1090N343Q275J984J537J973q653l002Q492
8424D2555k351P405j4873j1128K690J3542K3160K1755o419j3599k4636j3520J169
8411B5750J5160R753j6050j4482J1555J0812k3265j4774k890J6803O770K0000
8399D5142R932N15m104j0031p992N720J2000n8q30k1615j1254J6177J0706l386
8385D0922r751kO004J2822j1349q706n748J0320Q34q290L969J1503j212k589n058
8370C3669o640l006J691M953K005J2577P805O321k780j9421k5842L186J8608q045
8356B5081l32q819j217J9192N277j1867l079J945J3221J9374N770J3488J2453
8343I0487j2806q792j3921r876p996k036j4248j2492R616J0074J855n627j3208
$$ plain form
8438 51318 37462 32593 16038 11737 15516 26606 31949 40224 42208 43745 45718 37065 34063 42555
8424 42555 40204 47609 32736 21608 24298 37840 61000 82755 76336 62737 38101 24581 25750
8411 25750 40910 50663 34613 20131 31686 42498 19233 4459 1569 18372 25142 45142
8399 45142 55074 55589 51485 41454 33462 39182 51182 51124 50294 28679 17425 33602 44308 40922
8385 40922 31171 31169 37173 49995 38646 29940 24192 34512 35346 27056 31025 42528 41316 38727 33669
8370 33669 27029 24023 25714 30667 32672 45249 53054 59375 56595 37174 11332 14518 33126 25081
8356 25081 24749 15930 14713 33905 39182 27315 24236 26181 39402 58776 64546 78034 90487
8343 90487 77681 68889 54968 45092 37096 35060 20812 8320 17936 28010 29865 24238 11030
8330A1030k140J1224R793j1911L216P455r494J2179J1998l009j3625r161q013
8317I542k715M514o68l662K195n738K1049K3590Q14r621K006L084Q263L6473K3845
8302A12971N644k4703k8325j0961j5530o810J0438J4250j4203r418K82M608j0006
8289B8237L33j969K699m655L794j2272j985N838n785l633o224L582L85J0261J1073
8274B9679J1761r160q712Q365n83k0035p824j955R500o987P498J3099R840k444
8260C2042K733q268r902l374O531m717j954n78n105k30R441K375p483J0080P316
8245B8907m65k296K798k809q990J0272m989j4967Q443L194j3163p400o76J6714
8231A4573J1857l27p309m121j1608Q875K089k457R830P35r915n141j1157O839
$$ plain form
8330 11030 8890 20114 29907 17996 21212 28667 19173 31352 43350 40341 26716 17555 9542
8317 9542 6827 11341 10673 7011 9206 3468 24517 48107 48921 39300 41306 44390 52653 89126 112971
8302 112971 118615 93912 65587 54626 39096 32286 42724 56974 42771 33353 33635 38243 28237
8289 28237 28570 26601 29300 24645 28439 16167 14182 20020 14235 10602 4378 7960 8345 18606 29679
8274 29679 41440 32280 23568 31933 31350 11315 3491 1536 11036 4049 11547 24646 34486 32042
8260 32042 34775 26507 16605 13231 19762 15045 13091 12513 7408 7178 16619 18994 11511 21591 28907
8245 28907 28442 26146 28944 26135 17145 27417 22428 7461 15904 19098 5935 -1465 -2141 14573
8231 14573 26430 26103 18794 14673 3065 11940 14029 11572 21402 22137 12222 7081 -4076 2763
8217B763J1877M588l828j584l404P380l111q732J6734R425l489O791N425N351
8203D6186J6000L354r61q387j4598p755o378j6694L478k06O477J0746N40q299
8189B3503o381k093k572K910R130l780J858k115J0059N503k054J696J6047l119
8175D8592j9411k379R638k967p613O297k490j309J398M072k898K231N26L408N495
8160D2590J9104J4132k485r267l2740j1913l033J2456M582K848q565R902P371
8147D4982n096j3213j7069J4945R507j4685r799J1868j668q106k938P851p04j4829
8133A046j1154l237O233K6686O336q905k034P012o34k242k452n934M985l94j703
8118A3609o3N099J2718J9904p834j0328l647j3231j8077m731Q453J2931K699L87
$$ plain form
8217 2763 14640 19228 15400 13816 10412 17792 14681 5949 22683 32108 28619 35410 40835 46186
8203 46186 62186 65540 64579 56192 41594 33839 27461 10767 14245 14039 20516 31262 31802 23503
8189 23503 17122 15029 12457 15367 24497 20717 22575 20460 30519 36022 33968 35664 51711 48592
8175 48592 29181 26802 36440 33473 25860 32157 29667 28358 29756 33828 30930 33161 33687 37095 42590
8160 42590 61694 75826 73341 64074 31334 19421 16388 28844 33426 36274 27709 37611 44982
8147 44982 39886 26673 9604 24549 34056 19371 9572 21440 19772 11666 8728 16579 15875 1046
8133 1046 -10108 -13345 -7112 19574 25910 17005 14971 21983 21349 19107 16655 10721 15706 15312 13609
8118 13609 13546 18645 31363 51267 43433 33105 29458 16227 -1850 -6581 1872 14803 17502 17889
8104A7889j196k9306k622J9483P103q864j501O626l499k77N801J5076K414m181
8090B2946P634P437n60j7161j2572k354J0032l389m516j0964n524J585L361K132
8076a913R902n339j0939O360j431q737J1133J1307o254M183R73p362M183j97Q235
8061A4104Q232j1591Q50P181m755q148n240p42Q183K2090Q943Q916J818o096o235
8046C7510r971j6888n664j652j04Q753J820J92p576k846O795K33j1315N952N757
8031A0996O325P35k303q447J503R448M53j3219j392M524J7943Q619K809j3803
8017B4191j5611L431J165r046n022J1561J1087J908o445J635l061J62r431M895
8003A1419p613O17J1759l019K299r60q391J7699R317j9025j0591R788J4507q7
$$ plain form
8104 17889 16693 -12613 -15235 4248 11351 2487 986 7612 4113 3836 9637 24713 27127 22946
8090 22946 30580 38017 37457 20296 7724 5370 15402 12013 7497 -3467 -8991 -7406 -4045 -1913
8076 -1913 7989 2650 -8289 -1929 -3360 -12097 -964 10343 4089 8272 9245 1883 6066 5869 14104
8061 14104 22336 10745 11595 18776 14021 5873 633 -109 8074 30164 39107 48023 49841 43745 37510
8046 37510 27539 10651 4987 3335 3231 11984 13804 13996 6420 3574 10369 10602 -713 5239 10996
8031 10996 17321 18056 15753 7306 8809 18257 18710 5491 4099 8623 26566 35185 37994 24191
8017 24191 8580 12011 13176 4130 -892 10669 21756 23664 17219 18854 15793 15955 6524 11419
8003 11419 3806 4423 16182 13163 15462 14502 6111 23810 33127 14102 3511 13299 27806 27719
7989B7719n598j5163J0604R309n681j1633p78j433P895Q919o348j637o319P70
7975A0626L469j0189q203O080O337J0216J691j964m403M503O733P108j3951j7443
7961F10J0730K2985q939N68m901K676p116k145R019N216M878k176k070j2471m074
7946A2790K166q580N041M013P746r35p323l742P684j819l702p617m249n882L259
7931a150L984o157o269J567q6N706N876L827p397n454Q660O118J096m326L118
7916I113M379J4493P840o52P71j474p056o5J2539m530l590N430q124n140o812
7901A7122p363l215P491O721R97O014k27Q794M221n07r096N573N0k0273k974P5
7885A3403M73q25Q91O998l772j2121l558J1323N699Q92r659m916p856o832P019
$$ plain form
7989 27719 22121 6958 17562 26871 21190 9557 8779 7346 15241 24160 17812 16175 9856 10626
7975 10626 14095 3906 -4297 1783 8120 18336 20027 18063 13660 18163 24896 32004 18053 610
7961 610 11340 34325 25386 25954 21053 23729 16613 14468 23487 28703 33581 31405 29335 16864 12790
7946 12790 14956 6376 11417 15430 23176 22241 14918 11176 18860 17041 13339 5722 1473 -4409 -1150
7931 -1150 2834 -3323 -9592 -8025 -8111 -2405 3471 7298 -99 -5553 3107 9225 10321 5995 9113
7916 9113 13492 27985 35825 35173 35944 34470 27414 27349 39888 35358 31768 37198 29074 23934 17122
7901 17122 9759 6544 14035 20756 21753 27767 27540 36334 40555 40048 30952 36525 36575 16302 13328 13403
7885 13403 13876 13051 13942 20940 17168 5047 1489 12812 18511 19403 9744 4828 -3028 -9860 -2841
7870b841M454p684j608L427q066P005O560J358r050p44J6220J5433k049K903J0585
7855C5903j2078O408J7925q650j4511l549M178n824j2630j630J2241N269P438
7842C0490o108j7514l294L999N331J85j2817j1774Q353J0834Q208k074q846k2921
7828a7948m070R244p489R88J3533J0854J290N597J2027J606p268j9992K605J617
7814B594r89o766M587J1602M77j037m032N211Q295m389m358N10l737l892m792
7799g16J351K0676J2220k686n098J462l465q686l217r441k179J12j305J129j760
7784a603J4600l403O555p98q491j2812K736M797N805n89P535j556q103K259Q435
7769A5367M449P29j0751j0480j2761K981n511l391Q740p87k130K570J0093n868
$$ plain form
7870 -2841 1613 -6071 -7679 -4252 -12318 -5313 1247 2605 -6445 -7189 9031 24464 22415 25318 35903
7855 35903 23825 30233 48158 39508 24997 21448 25626 19802 7172 5542 17783 23052 30490
7842 30490 24382 6868 3574 7573 12904 13089 272 -11502 -3149 7685 15893 13819 4973 -17948
7828 -17948 -22018 -12774 -20263 -19275 -5742 5112 6402 11999 24026 25632 18364 -1628 977 2594
7814 2594 1605 -5161 -574 11028 11505 10468 6436 11647 19942 15553 11195 11705 7968 4076 -716
7799 -716 635 21311 33531 30845 25747 27209 23744 15058 11841 2400 221 333 -972 157 -1603
7784 -1603 12997 9594 16149 15351 6860 -5952 -3216 1581 7386 6797 14332 12776 4673 6932 15367
7769 15367 19816 20545 9794 -686 -13447 -10466 -15977 -19368 -10628 -11415 -13545 -10975 -882 -6750
7755f750p574p520N862K1526J1853m819r732N4j38o39l534j2964p90P148L76K530
7739e111j771m362j151l349K690j876L906l495N306R573M089p187L718J2632k179
7724A1433j207j092L07N434L573p475P906J407p088k681l309j1724J611Q89L23
7709a693j881L299Q22o815M269K250j393j2436M476k083k400k290J386J0693J2209
7694H413N62j548m211j2285o696l411J5289Q550j177l815M871m28k331j001M770
7679E552p067p807n66J2547J7305j375q157p587j5031J0288P671K383J972M107
7665A4235r908j3375k092J2766J1097L740Q528J453k0600q295M501L217k91q562
7651c586j1663J6169J1168j610q035o952o30J528n417J0345Q954j2045J482L633
$$ plain form
7755 -6750 -14324 -21844 -15982 5544 17397 12578 2846 2900 2762 2123 -1411 -14375 -15165 -8017 -7641 -5111
7739 -5111 -6882 -11244 -12395 -15744 -13054 -14930 -11024 -14519 -9213 360 4449 -2738 980 13612 11433
7724 11433 10226 9134 9441 14875 18448 10973 18879 20286 13198 10517 7208 -4516 -2905 -2016 -1693
7709 -1693 -3574 -275 547 -6268 -1999 251 -1142 -13578 -9102 -11185 -13585 -15875 -14489 -3796 8413
7694 8413 8975 7427 3216 -9069 -15765 -19176 -3887 4663 3486 -329 4542 4114 1783 782 5552
7679 5552 -1515 -9322 -9888 2659 19964 18589 10432 2845 -12186 -1898 5773 8156 10128 14235
7665 14235 4327 -9048 -11140 1626 12723 16463 24991 26444 5844 -2451 2050 5267 4976 -3586
7651 -3586 -15249 920 12088 10478 2443 -4509 -5139 -3611 -9028 1317 10271 -1774 -292 3341
7637C341N007l878O210l363r196j424m235R833P951m876n843p735j4182m949N698
7622b1641K376N051O859J4792M798m56l532J180k848j0498J62N414N673R650P817
7607B4797J0961p754j4936o65Q118r507O222L127n918j4246j4074K1690P722j2153
7593C384j6609j2238n833M976Q400K973R631J057m805L340R383M84L340o675j5950
7578a5142j2197O862J915j7262Q535K8130J2072L657k0696k460Q101n474m410
7565h369K390R903J049o567O448k133P085r1J903o640J519M746p004n994K922
7550A167J1673n058j1737N10J034L708k052N37R631M214O01R59K068j5120j9315
7535a7180Q135m889K650j692O160L655J1584j401O87l243o075N806K449j0186
$$ plain form
7637 3341 8348 4470 10680 7317 -1879 -3303 -7538 2295 10246 5370 -473 -8208 -22390 -27339 -21641
7622 -21641 -19265 -14214 -7355 7437 12235 11779 8247 9427 6579 -3919 -3757 1657 7330 16980 24797
7607 24797 35758 28004 13068 12403 20521 11014 17236 20363 14445 199 -13875 7815 15537 3384
7593 3384 -13225 -25463 -31296 -26320 -17920 -14947 -5316 -4259 -9064 -5724 3659 4143 7483 808 -15142
7578 -15142 -27339 -20477 -18562 -35824 -27289 841 12913 16570 -4126 -6586 1515 -3959 -8369
7565 -8369 -5979 3924 4973 -1594 4854 2721 9806 9715 11618 4978 6497 11243 4239 -1755 1167
7550 1167 12840 7782 -3955 -3445 -2411 1297 -755 -218 9413 13627 14228 15187 17255 2135 -17180
7535 -17180 -9045 -13934 -11284 -12976 -6816 -3161 8423 7022 7709 4466 -1609 4197 6646 -3540
7521c540j047q223K026J1016M522m640p186m090L540J1523k068k54O942N985P447
7506B1953K512n393l585J293p665m869o953l628O706L785j663r149j1395J1205
7492f846R963o685K39P328k800L031p317N317R576L797M304o746l414j0341j2989
7477a3583J1232N717J391j2075j4455M388J0774m141Q222J3088l223l168N357
7464I524l424l349n368j906j486P454L758j75J423l962k402r026O115J2652J029
7449A0857J216j829L349K063N069K423l740o183l531l852K643J3579Q152j1870
7435A8346k1446q290J5315Q008K442k0332j7870k467N836k5k337K0777L617N883
7421G457q036k644M048o435n208o71M1j999J7528J959n270Q089m640o125L546
$$ plain form
7521 -3540 -4587 -12810 -10784 232 4754 114 -7072 -11162 -7622 3901 1833 1579 8521 14506 21953
7506 21953 24465 19072 15487 16780 9115 4246 -2707 -6335 371 4156 2493 -6656 -18051 -6846
7492 -6846 3117 -3568 -3329 3999 1199 4230 -3087 2230 11806 15603 19907 13161 9747 -594 -13583
7477 -13583 -2351 3366 4757 -7318 -21773 -17385 -6611 -10752 -2530 10558 7335 4167 9524
7464 9524 6100 2751 -2617 -4523 -6009 1445 5203 5028 6451 2489 87 -8939 -2824 9828 10857
7449 10857 12073 10244 13593 15656 20725 23148 19408 13225 9694 5842 8485 22064 30216 18346
7435 18346 -3100 -11390 3925 11933 14375 -5957 -23827 -26294 -20458 -20483 -22820 -2043 1574 7457
7421 7457 -579 -3223 825 -5610 -10818 -11489 -11448 -13447 4081 6040 770 8859 4219 -1906 1640
7406A640j451j0423l42j1096n22J8086M14q85n190j882K846J4496Q704L591p305
7391A0681J881K61O656k898J3J814J0670j2907r144j319o538j0698q213K585N503
7376a1653k931Q099l909o570N830p016r288J2483J4686K979m837L99l970J0541
7362D843L453J2113N439L850r669k27O471q701j3755m030j3252N22N779j1364
7348a8528K252J2260J0151q019q10M839K470j06q588j3190O459O576M726P08j798
7333e98l70r966L4J4938K177l282m18J192K195l78L327j431O588m123p19N602
7317A4768j904j1053j1392J1700Q354j871J300J404m284O787K658J701p46q22
7303A6600j4112m585n622m63p604p320P142m79o12J956Q366L802r989K444Q641
$$ plain form
7406 1640 189 -10234 -10576 -21672 -22194 -4108 -3694 -4579 -9769 -11651 -8805 5691 14395 17986 10681
7391 10681 12562 12823 19479 16581 16594 18408 29078 16171 7027 5708 -830 -11528 -19741 -17156 -11653
7376 -11653 -14584 -6485 -10394 -16964 -11134 -18150 -27438 -14955 -269 2710 -2127 -1728 -5698 4843
7362 4843 8296 20409 25848 29698 20029 19802 26273 17572 3817 -213 -13465 -12943 -7164 -18528
7348 -18528 -16276 -4016 6135 -1884 -2694 2145 4615 4509 -4079 -17269 -10810 -4234 492 1200 -598
7333 -598 -968 -10934 -10900 4038 6215 2933 2515 3707 5902 5524 8851 7420 14008 9885 9166 14768
7317 14768 12864 1811 -9581 2119 10473 8602 9902 11306 7022 13809 16467 18168 17422 16600
7303 16600 2488 -2097 -7719 -8182 -15786 -23106 -15964 -16443 -17055 -15099 -6733 -2931 -12920 -10476 -1835
7288a835m389l683p730Q523J526K323M217j492K436L282o367j1951L178o412P599
7273a0775R357N238J487k915j2227r803l203J2138J6130L421J661n919N58p25
7259D423j2772m389L243q005p149m486M549R795o974J272Q678K694K127k426j2675
7244b2095M148J3440J6417j4176m58j759l212k832J4234J073n98J4939J352j2357
7230H116j336p253Q823j902k799j4533M840J0619J8725j5740j4759N359j324M417
7216A253O729K955O189q666j5851r414J0450K845l154P932J2780M340r590j8568
7202i770O627K6627J2915j0327p472j5571j7029J848J6333P668n429j8778q273
7189b0631m369j7511K299n465Q49k24J9228K0194O164N73K226m845q983L282O037
$$ plain form
7288 -1835 -6224 -9907 -17637 -9114 -7588 -5265 -1048 -2540 -104 3178 -3189 -15140 -11962 -18374 -10775
7273 -10775 -1418 3820 5307 2392 -9835 -19638 -22841 -10703 5427 8848 10509 4590 5148 4423
7259 4423 -8349 -12738 -9495 -17500 -24649 -29135 -24586 -14791 -21765 -20493 -11815 -9121 -6994 -9420 -22095
7244 -22095 -17947 -4507 11910 -2266 -2724 -4483 -7695 -10527 3707 4780 4182 19121 20473 8116
7230 8116 6780 -473 8350 6448 3649 -10884 -6044 4575 23300 7560 -7199 -1840 -3164 1253
7216 1253 7982 10937 17126 8460 -7391 -16805 -6355 -3510 -6664 1268 14048 18388 8798 -9770
7202 -9770 -3143 23484 36399 26072 18600 3029 -14000 -12152 4181 11849 6420 -12358 -20631
7189 -20631 -25000 -42511 -40212 -45677 -44828 -45052 -25824 -5630 534 1107 3333 -1512 -10495 -7213 -1176
7174a176p020q560R450O805n327J5847M899r056J728Q024r355J707p273j0593
7160i900N441j271n663P68Q768o571n047J0993k804p61r940O804P50j2991k966
7145b4390J679Q686l02J4060O40o801M312N923J62l88K885o849N815J517j4747
7130g798J3868J032r207j2831m891J0863Q306j3417M171Q518k2652j2830P244
7117b9624O752Q119R994L21K214r412j2306n320K1064J4778r736m332O18P25j1762
7102a7907P925J2521n121K212J4927k555q431l399o612J3710J1303j474j3989
7089C110r969k398L993O330o422j162p924k671R188N708P616M526m450j4287j3488
7074b2300N854j238N589J1752m523k871m324L096J934N191k896L988K830n604
$$ plain form
7174 -1176 -8196 -16756 -7306 -501 -5828 10019 14918 5862 7590 15614 6259 7966 693 -9900
7160 -9900 -4459 -5730 -11393 -10625 -1857 -8428 -13475 -2482 -5286 -6047 -15987 -9183 -8433 -21424 -24390
7145 -24390 -22711 -14025 -14327 -267 373 -6428 -2116 3807 3969 3581 6466 -383 5432 6949 -7798
7130 -7798 6070 7102 -2105 -14936 -19827 -8964 -658 -14075 -9904 -1386 -24038 -36868 -29624
7117 -29624 -22872 -14753 -4759 -4438 -2224 -11636 -23942 -29262 -8198 6580 -3156 -7488 -6870 -6145 -17907
7102 -17907 -9982 2539 -2582 -370 14557 12002 3571 172 -6440 7270 18573 17099 3110
7089 3110 -6859 -9257 -5264 1066 -5356 -6518 -14442 -17113 -7925 -2217 5399 9925 5475 -8812 -22300
7074 -22300 -16446 -17684 -12095 -343 -4866 -7737 -12061 -8965 -7031 -1840 -4736 -748 2082 -3522
7060c522L687j574j249N02m591n730Q749N286K96j603L268K661k068O895o398
7045D609j0526N835P905J4304l208k1906J4421Q522q031j5048j1957K943N004
7032g133Q467N34k974m321l053K792J5740r377k8691J782M341Q006l294N469k275
7017a3987o297J2419P308Q610j2586q723k202m349J788m730L864O691J1251L270
7003B327j4589j2816J0121K574R229j410n885j3482M066L194m473j1812M673O472
6989b1811J9261J67j3831p577R851R67K426K414L116j7P756j89n180p018k163
6974a1828j1734q943O872p882L597L642K351K8787J271j0421J692Q410l209j2914
6960a0309j8339p018N934l593J717J0355J2383J796M883J1841P473k3027k209
$$ plain form
7060 -3522 165 -1409 -2658 -2156 -6747 -12477 -3728 1558 1854 251 3519 6180 4112 11007 4609
7045 4609 -5917 -82 7823 22127 18919 -2987 11434 19956 11925 -3123 -15080 -12137 -7133
7032 -7133 1334 1868 -1106 -5427 -8480 -5688 10052 675 -28016 -26234 -21893 -13887 -17181 -11712 -13987
7017 -13987 -20284 -7865 -557 8053 -4533 -13256 -15458 -19807 -18019 -22749 -18885 -12194 -943 2327
7003 2327 -12262 -25078 -14957 -12383 -3154 -4564 -10449 -23931 -19865 -16671 -21144 -32956 -28283 -21811
6989 -21811 -2550 -2383 -16214 -23791 -13940 -12973 -10547 -8133 -5017 -5034 2722 2533 -2647 -9665 -11828
6974 -11828 -23562 -32505 -25633 -33515 -29918 -26276 -23925 4862 6133 -4288 -2596 5814 2605 -10309
6960 -10309 -28648 -35666 -29732 -33325 -31608 -21253 -8870 -7074 -2191 9650 17123 -5904 -8113
6947h113n173k779J030K870J4570j650j9550j3595o49R485N102P306j913J727
6933a1332N381R650J924m374N586R045P18r994l699M86L905k393j8546n637M416
6918a4864M545O21k165K758J7159m208j589l283J2162j1155r460J640L442N563
6904A166j0945l214M627k767L544j977J1342K990m840q269M173l911m14N374L042
6889g9r890J1227O840q966q958p099N863J623N334m62M331o712m546P937J0561
6874G004J22p269N13m374J5r761L854j927j3426K076J019R522J1732p32j556n5
6858c243J1224R93P623r670l698m696o215q824J4380J2921J3840k18L863O726
6844C5006l621p568k0833j2162n563J2593J0621o739m811j142j1820R97L235J2957
$$ plain form
6947 -8113 -13286 -16065 -15035 -12165 2405 755 -18795 -32390 -33039 -23554 -18452 -11146 -13059 -11332
6933 -11332 -5951 3699 5623 1249 6835 15880 16598 6604 2905 3391 7296 4903 -13643 -19280 -14864
6918 -14864 -10319 -9698 -11863 -9105 8054 3846 2257 -1026 11136 -19 -9479 -7839 -4397 1166
6904 1166 -9779 -12993 -8366 -11133 -7589 -9566 1776 4766 -74 -8343 -4170 -8081 -8495 -3121 -79
6889 -79 -9969 1258 8098 -868 -9826 -16925 -11062 -9439 -4105 -4567 -236 -6948 -11494 -3557 7004
6874 7004 7126 -143 370 -4004 -3989 -13750 -9896 -11823 -25249 -23173 -22154 -12632 -900 -1632 -3188 -3243
6858 -3243 7981 8974 16597 6927 3229 -1467 -7682 -16506 -2126 10795 24635 24417 28280 35006
6844 35006 31385 23817 2984 -9178 -14741 -2148 8473 1734 -3077 -4219 -16039 -15042 -11807 1150
6830A150O57j3312k463n354O245M456M226O606j974R786J8081o37r015K65q636
6815A0081j1274O957p588p519m378J294J0409P059l860J2408K435j433J3328l431
6801B4488j0975j4631j7140m096j7158K52J0393L275K133Q427J0452P049P684
6788A0153j1004m919q018M350J4037j5237q386o210N980p077j273J2517L094J2545
6774E52k568n699p443l171O451J3453J3259n445j5437o820o035L696J1771L664
6760B28J836L085l049n861J3467J2391p063j9002q834O40k883Q494J7028J0946
6746B1423j4021k1047N998J1735l073j1969k819P342P955N769l759M77K1483O08
6732B6102p37p473j5032j880J1400N134q273q354m369L904J813q646k37Q125n201
$$ plain form
6830 1150 1807 -11505 -13968 -19322 -13077 -8621 -4395 2211 237 10023 28104 27467 18452 18717 10081
6815 10081 -1193 5764 -1824 -9343 -13721 -12427 -2018 5041 1181 13589 16024 14591 27919 24488
6801 24488 13513 -1118 -18258 -22354 -39512 -39260 -28867 -25592 -23459 -15032 -4580 2469 10153
6788 10153 -851 -5770 -13788 -9438 4599 -10638 -19024 -25234 -19254 -26331 -27604 -15087 -11993 552
6774 552 -2016 -7715 -15158 -18329 -11878 1575 14834 9389 -6048 -12868 -18903 -15207 -3436 228
6760 228 2064 5149 2100 -3761 9706 22097 15034 -3968 -12802 -12162 -15045 -6551 10477 21423
6746 21423 7402 -13645 -7647 4088 1015 -10954 -13773 -6431 1524 7293 3534 4011 25494 26102
6732 26102 25365 17892 2860 980 12380 17514 9241 887 -3482 422 2235 -6411 -6648 1477 -3724
6717c724o965Q536J270J019k697M194N603j8517k856l39J7673J7391l897q806
6703G885j6263r339P257j304K157M409M987r624l376O623p560l517j98J529j2221
6688b8555j4620Q953J8396J1270p808J616R542J3163J173j400l280Q882j1117
6675F215j4508m616J581N7P67Q117o58l960k507m43R653n998M174m35n190K362
6659e389K064M083P437l62p043j2705m73j369J8351o499j0513k6j0924k478N315
6644b0531J4299k628J656K0827N377q106j3629q126K119J4975J2104j832J0001
6631B6506k871n999M00L027k269j0970n602r721L505Q191n352m510o510M696J5520
6616H041M033m562n995l725j1653l664l31J832k761O92N344R885J5482P298k0564
$$ plain form
6717 -3724 -10689 -2153 -883 136 -2561 1633 7236 -11281 -14137 -14476 3197 20588 16691 7885
6703 7885 -8378 -17717 -10460 -11764 -9607 -5198 -211 -9835 -13211 -6588 -14148 -17665 -17863 -16334 -28555
6688 -28555 -43175 -34222 -15826 -4556 -12364 -10748 -1206 11957 13130 11730 8450 17332 6215
6675 6215 -8293 -12909 -11328 -11271 -10504 -2387 -3045 -7005 -9512 -9955 -302 -6300 -2126 -2561 -7751 -5389
6659 -5389 -3325 758 8195 7833 790 -11915 -12388 -13757 4594 -1905 -12418 -12444 -23368 -25846 -20531
6644 -20531 -6232 -8860 -7204 13623 19000 10894 -2735 -10861 -8742 6233 18337 16505 26506
6631 26506 23635 17636 18036 21063 18794 7824 2222 -7499 -3994 4197 -1155 -5665 -12175 -7479 8041
6616 8041 12074 7512 1517 -2208 -13861 -17525 -17856 -16024 -18785 -18093 -12749 -2864 12618 19916 -648
6601f48j3101O661k673M76M564l882M655J132j10k511J206p11l360M4l289R628
6585a919m092p596J230M432N537L147L826k840M902l250l740n210q895o469J262
6570a9675P101m546l023J315J2696L422p300k090o160Q56R750r334l205O808k023
6555a5408J0942O329j1959q117Q19r443O667J9538p414o69R430N706r073j4539
6541a7191N822K0348q247j0769O48M036P887Q678n269o901N319j6185j8864J3930
6527a6758J6656M052j7055j0277J488L313K302O157j595P559J0650P86o117n732
6513d571J693o347J810k504p541o709O726J0405q663l598q603J4282R150o945
6499a1415J93m830q689J1513O420K1809P106o143l073o408n627j711M825Q776
$$ plain form
6601 -648 -13749 -7088 -9761 -9285 -4721 -8603 -3948 -2816 -2926 -5437 -4231 -4942 -8302 -8258 -11547 -1919
6585 -1919 -6011 -13607 -12377 -7945 -2408 739 4565 1725 6627 3377 -363 -5573 -14468 -20937 -19675
6570 -19675 -12574 -17120 -20143 -18828 -6132 -2710 -10010 -12100 -18260 -17404 -7654 -16988 -20193 -13385 -15408
6555 -15408 -4466 1863 -10096 -18213 -17394 -26837 -20170 -632 -8046 -8715 715 6421 -2652 -17191
6541 -17191 -11369 8979 732 -10037 -9389 -5353 2534 11212 5943 -958 4361 -11824 -30688 -16758
6527 -16758 -102 3950 -13105 -23382 -21894 -18581 -16279 -10122 -11717 -4158 6492 7278 1161 -4571
6513 -4571 -2878 -9225 -7415 -9919 -17460 -24169 -17443 -7038 -15701 -19299 -27902 -13620 -4470 -11415
6499 -11415 -11222 -16052 -24741 -13228 -6808 15001 22107 15964 12891 6483 856 -855 3970 12746
6485A2746p71j3446j340R089O45j3954o150q796M676J9720M369n277N713r319
6471b095K107J866n568J0946Q388M169m935p318n128J755l750n665r172q317k458
6456b5175N642J0801N252n278n592M177J0605N060j4403r78l375p516Q132p763
6442b0411k003J5732j870l224J105R166P468p400Q17J393j0427j8834J4293K1965
6428G770r61j5656q017L143R887K097L640J4678J151m212j1288j0825K060Q34
6414e699K644j846O442K790k464j676l802L896n065J2291P322j575N61j3946j2256
6399a2383P381Q34q604J3953O853R323L22J747j85j0504k924J2072R81j6178m051
6384a363m505q156P313J6049M607m288o498N321M274O10j096p388m217J1089R231
$$ plain form
6485 12746 11975 -1471 -2811 6278 6923 -7031 -13181 -21977 -17301 2419 6788 1511 7224 -2095
6471 -2095 12 1878 -3690 7256 15644 19813 14878 7560 2432 4187 437 -5228 -14400 -22717 -25175
6456 -25175 -19533 -8732 -3480 -8758 -14350 -10173 432 5492 -8911 -9889 -13264 -20780 -12648 -20411
6442 -20411 -22414 -6682 -8552 -11776 -10671 -1505 5963 -1437 -620 773 -9654 -28488 -14195 7770
6428 7770 6809 -8847 -16864 -13721 -3834 -1737 1903 16581 17732 13520 2232 -8593 -6533 -5699
6414 -5699 -3055 -4901 1541 4331 1867 191 -3611 285 -4780 7511 14833 13258 13819 -127 -12383
6399 -12383 -5002 -4168 -12772 1181 8034 17357 17679 19426 19241 8737 5813 17885 18866 2688 -1363
6384 -1363 -5868 -14024 -6711 9338 13945 9657 3159 8480 12754 13364 12268 4880 663 11752 20983
6369B0983J0748n496p817j0238q862m19o445m579J100K933J3168L847O445R411
6355B4779J2486q094k1382j3885p210K394j1769r612J1173J1149p89J0309N306
6342D855J0057Q078P02L755j2569k1501p442m125K80J1135L24l157j296o132m906
6327b1942K725j122N154J7703r808k5280L509J0096R87j854J54K1796M552n180
6313A490n647j1028q716O300O920R406J855r990L674R525r138j4710q361m002
6299c2422L434l258K735Q437K429M052K099M966J2129k79J809n983O100P756j0508
6284C496K646l22n683M811J4423K344j6156j2826N309J0086l650m200p2J0248
6270A0454j139J706K285k165q196m015N422K414N32N53p034m636o731k135K294
$$ plain form
6369 20983 31731 26235 18418 8180 -682 -1101 -7546 -12125 -11025 -8092 5076 8923 15368 24779
6355 24779 37265 29171 7789 -6096 -13306 -10912 -22681 -32293 -21120 -9971 -10760 -451 4855
6342 4855 14912 22990 23692 27447 14878 -6623 -14065 -18190 -17910 -6775 -6451 -9608 -10904 -17036 -21942
6327 -21942 -19217 -20339 -15185 2518 -7290 -32570 -29061 -18965 -17978 -19832 -19678 2118 6670 1490
6313 1490 -4157 -15185 -23901 -17601 -10681 -1275 580 -9410 -5736 3789 -5349 -20059 -28420 -32422
6299 -32422 -28988 -32246 -29511 -21074 -18645 -14593 -12494 -7528 4601 4322 6131 148 6248 14004 3496
6284 3496 6142 5820 137 4948 19371 21715 5559 -7267 -1958 8128 4478 278 206 10454
6270 10454 9315 11021 13306 11141 2945 -1070 4352 6766 7298 7851 817 -3819 -10550 -12685 -10391
6255a0391P625m602L703P174P384L093j9641o936K70p668L843M02K260L888N043
6240d553J868O557p269N27Q55l806k044N682J0834j1009m827P051K258o612K565
6225a923M312j129q48r92p234N274J0434k434j2429n194m924O471P697o061j3688
6210b2668n891M436j0000O94J1518Q666Q530k012J494r607j239J452J793m914
6196a7748m48J246L525O77p357P623O018O210P098J829p478M043L491O083K414
6181A7226m307j1677j1900j0122k751J3222Q069Q231K117o954j2424M868R128
6168B726j440J077Q841k824o891o94l73M604j052j237m571n840r642J619k174
6153a7871k953J08R922R0p054J0139m977Q231L076J630r138j106N346l492Q681
$$ plain form
6255 -10391 -2766 -7368 -3665 3509 10893 13986 -5655 -12591 -12321 -19989 -16146 -15744 -13484 -9596 -4553
6240 -4553 -2685 3872 -3397 -2870 -2015 -5821 -7865 -2183 8651 -2358 -7185 -134 2124 -4488 -1923
6225 -1923 2389 1260 412 -580 -7814 -2540 7894 5460 -6969 -12163 -17087 -10616 -2919 -8980 -22668
6210 -22668 -28559 -24123 -34123 -33429 -21911 -13245 -4715 -6727 -5233 -14840 -16079 -14627 -12834 -17748
6196 -17748 -18196 -16950 -13425 -12748 -20105 -12482 -6464 -254 6844 8673 1195 5238 8729 14812 17226
6181 17226 12919 1242 -10658 -20780 -23531 -10309 -2240 5991 8108 1154 -11270 -6402 2726
6168 2726 1286 2363 11204 8380 1489 795 422 5026 3974 2737 -1834 -7674 -17316 -15697 -17871
6153 -17871 -20824 -20716 -10794 -10704 -17758 -7619 -12596 -4365 -1289 341 -8797 -9903 -4557 -8049 632
6138F32J1445q12j4700k705P486o76k229n633R834r481p171N859M931l232o49
6123g101P560J097j5671P075n509r089Q739K41q280K494M808l454J1815P151L952
6108E828j0741j891J3042j0700j2248Q701O659Q619m562q085l019K052P963k177
6094e59j301L874P14L446m772J710L223o596M593J1043q068r38P627m52p746m708
6078A090j1757N200m928m219N80n465J4547J4550P495l149j0837m720j0425j3203
6064b5241L484j583O144j3489P692J0640o19J380M128Q056k656l422M905K990
6050B409j3202j0702J0702R769n793j7826M106J5988m271o628J4427j271p384
6037i676j0928n934L079R652P267N224k820P745l877j3148o624O89K1180N987
$$ plain form
6138 632 12077 11265 -3435 -6140 1346 670 -1559 -7192 2642 -6839 -14010 -8151 -3220 -6452 -7101
6123 -7101 459 1556 -14115 -7040 -12549 -21638 -12899 -12658 -20938 -18444 -13636 -17090 -5275 1876 5828
6108 5828 -4913 -6804 6238 -4462 -16710 -8009 -1350 7269 2707 -5378 -8397 -6345 1618 -559
6094 -559 -1860 2014 2728 6174 1402 3112 6335 -261 4332 15375 7307 6369 13996 13544 5798 1090
6078 1090 -10667 -5467 -10395 -14614 -14034 -19499 -4952 9598 17093 13944 3107 -1613 -12038 -25241
6064 -25241 -21757 -23340 -17196 -30685 -22993 -12353 -12972 -11592 -7464 592 -2064 -5486 -581 2409
6050 2409 -10793 -21495 -10793 -1024 -6817 -24643 -20537 -4549 -8820 -15448 -1021 -2292 -9676
6037 -9676 -20604 -26538 -23459 -13807 -6540 -1316 -4136 3609 -268 -13416 -20040 -19351 1829 7816
6023G816M536o879r099n81N689j9218K946K1n550Q899N559L238m161O284q532
6008i032k569o96r754p68J1207J5374j0162J885M01J05O667L964o988j2770J1788
5993a348J8669K131J579j6866L17J4954K831q924l271k154j4851r230J8166P499
5979I502q856J0934j481m399m599k819N17q835k858O990N357j3276o421l897r875
5964c4016R53P869N66O089J3999M898j862J553K28o121l65K647K452P748J600
5949H238L726l832n617M586p582p82L006R624p623j5501j4316p281J4834J5266
5935c254N772n505j106N24J8380J1192q149p827j087r16J574P592J5550l776j1184
5920A7780k0419j4257l362J2058l053N544l376J504m499N536O831J1089m314m425
$$ plain form
6023 7816 12352 5473 -3626 -4207 1482 -17736 -14790 -14769 -20319 -11420 -5861 -2623 -6784 -500 -9032
6008 -9032 -11601 -12297 -22051 -22819 -11612 3762 -6400 -4515 -4114 -4009 2658 6622 -366 -13136 -1348
5993 -1348 17321 19452 21031 4165 4482 19436 22267 13343 10072 7918 -6933 -16163 2003 9502
5979 9502 646 11580 10099 5700 1101 -1718 -1201 -10036 -12894 -5904 -547 -13823 -20244 -24141 -34016
5964 -34016 -33063 -25194 -24628 -18539 -4540 358 -1504 49 277 -5844 -6209 -3562 -1110 6638 8238
5949 8238 11964 8132 2515 7101 -481 -1263 1743 11367 3744 -11757 -26073 -33354 -18520 -3254
5935 -3254 2518 -2987 -4093 -3569 14811 26003 17854 10027 8940 8024 9598 17190 32740 28964 17780
5920 17780 -2639 -16896 -20258 -8200 -11253 -5709 -9085 -7581 -12080 -6544 287 11376 7062 2637
5906B637j0544m916O978J8934n751l921L255n895J738j866l609j8640M5Q476P144
5891e935r242M70J558k171M804J6775K530o002j4596J689K95J775n486j993P738
5876g791n571K505j3059K170l455Q251Q066p91L18L320J400j219J7942J2967j4199
5861A0854j7184k96r694o207n210R905R479j2971J848N095l621P671J6453o771
5847f49j8330M718J428J9447P923j1927J77L680m821j82K17L373L074k184l510
5832B434M674O113N146l405j4932j763n172K462P156K709l093P005m138j1907
5818f711L568n640j2757j09J5383P906o056l416P85m45P16Q277r56P884L243j1358
5802C14q513J3070O071n889q49N163J5482J0209m029n750r024j3897l553K732
$$ plain form
5906 2637 -7907 -12823 -5845 13089 7338 3417 6672 777 2515 649 -2960 -21600 -21555 -13079 -5935
5891 -5935 -15177 -14707 -13149 -15320 -10516 6259 8789 2787 -11809 -10120 -9825 -8050 -13536 -15529 -7791
5876 -7791 -13362 -10857 -23916 -21746 -25201 -16950 -8884 -9675 -9357 -6037 -4637 -5856 12086 25053 10854
5861 10854 -6330 -6626 -16320 -22527 -27737 -17832 -8353 -21324 -19476 -14381 -18002 -10331 6122 -649
5847 -649 -18979 -14261 -12833 6614 14537 2610 2787 6467 1646 1464 1681 5054 8128 5944 2434
5832 2434 7108 13221 18367 14962 30 -1733 -6905 -4443 2713 5422 2329 9334 5196 -6711
5818 -6711 -3143 -8783 -21540 -21649 -6266 1640 -4416 -7832 -7047 -7492 -6776 1501 545 8429 11672 314
5802 314 -8199 4871 10942 5053 4204 9367 24849 35058 31029 25279 16255 2358 -1195 1537
5788A537r199q791p061o160R611j038m637J1318J5827J222Q373J494J755n121
5774I130J1316p892j3137O445O03j517m722j1128j391J895K689J171L428N53J0842
5759H285l687k0357j0699p030L545N987O23j227J1520R848J6894j6791j5221o619
5745b4929Q704m091k543J0612K359P445R047K879J281q393r260J430P36N063Q380
5730H720l063k050J146p36q992j0523J2100N441q591j396J960O845L365j0545
5716f319n109Q886m542j2633j78J0197K635l567j08m511q775Q6J0221O647J2540
5701E470q684L57l878r880J682J7312k125o481l706J4262j11r537m639Q944J4810
5686A3796R324q670l10m641j579r332q675M84M724P717m549n642p787r370N493
$$ plain form
5788 1537 -7662 -16453 -23514 -29674 -20063 -21101 -25738 -14420 1407 2629 11002 12496 14251 9130
5774 9130 20446 12554 -583 5862 6465 4948 226 -10902 -12293 -10398 -7709 -6538 -3110 -2557 8285
5759 8285 4598 -15759 -26458 -33488 -29943 -23956 -23333 -24560 -13040 -3192 13702 -3089 -18310 -24929
5745 -24929 -16225 -20316 -22859 -12247 -9888 -2443 6604 9483 10764 2371 -6889 -5459 -4723 340 8720
5730 8720 5657 3607 4753 4017 -4975 -15498 -3398 2043 -6548 -7944 -5984 861 4226 -6319
5716 -6319 -11428 -2542 -7084 -19717 -19895 -9698 -7063 -10630 -10738 -15249 -24024 -23938 -13717 -7070 5470
5701 5470 -3214 -2857 -6735 -16615 -14933 2379 254 -6227 -9933 4329 4218 -5319 -9958 -1014 13796
5686 13796 23120 14450 14140 9499 7920 -1412 -10087 -9603 -4879 2838 -1711 -7353 -15140 -24510 -19017
5671a9017K900m496L232j1m415N711j0849K560Q077K1855Q80L850N12P72m47m331
5655F783o354J106L410j0979o163N895J176j51O586L759o77m409K481n188Q399
5640E674J898n283l287q397j3825j8226J0115J2789O624J458Q01M813O231L025
5626D410j4938p896O528p5J2053r439j2591J1434M629M526k709P285M270J1568
5612A9055j2135l674J2545o11K40N675j3524j225J3327L709p160J28O264J858
5598B4472j3830r751m42J5306r411j6443o070L846J6458r29R0j1011P715P837
5584G837p160m035n357n650Q018L781J4549L04R156j1351j4686J564j167Q438
5570D241k068q794l16j7482k759Q806K869O968L917J674m232Q480q695j6699k629
$$ plain form
5671 -19017 -16117 -20613 -17381 -17392 -21807 -16096 -26945 -24385 -16308 5547 6427 10277 10789 11561 11114 6783
5655 6783 429 1535 4945 -6034 -12197 -6302 -5126 -5277 1309 5068 4391 -18 2463 -2725 5674
5640 5674 7572 2289 -998 -9395 -23220 -41446 -31331 -18542 -11918 -10460 -9659 -4846 1385 4410
5626 4410 -10528 -18424 -11896 -11971 82 -9357 -21948 -10514 -5885 -1359 -4068 3217 7487 19055
5612 19055 6920 3246 15791 15180 15420 21095 7571 6346 19673 23382 16222 16350 22614 24472
5598 24472 10642 891 449 15755 6344 -10099 -16169 -12323 4135 3206 3296 -7715 0 7837
5584 7837 677 -3358 -8715 -14365 -6347 -2566 11983 12287 21443 10092 -4594 -3030 -4197 4241
5570 4241 2173 -6621 -6937 -24419 -27178 -18372 -15503 -8535 -4618 -2944 -7176 1304 -7391 -24090 -26719
5555b6719N708P466J0588O077O802l080K030J721l612n779j4072n620J5707J2654
5541I871q146o419M074J1536j4319m935N839j41L244k2380p682Q834O890J0888
5527b846k086N169k322N605k610R718J398j0192j1081o875M083P516n436J1805
5513A846Q67l617R660l965Q92j2265j136M176L050q434N694j250m852n745m52
5498a5531N522O974K341m406o935p3N542N30p981n944J2100J0073j286j1641J321
5483i394Q42J489O914j6423j908P732J110q38o422L061M769P046N485L996J4325
5468B1784n34K408j7038j4141O008J909P334l530o599j3485M519P315M65q753
5454a2338k994q250J2347R90K018K886J9002J0842k005j5758p946J2002M476k015
$$ plain form
5555 -26719 -21011 -13545 -2957 3120 9922 6842 8872 10593 6981 1202 -12870 -18490 -2783 9871
5541 9871 1725 -4694 -620 10916 -3403 -8338 -2499 -2640 604 -21776 -29458 -20624 -13734 -2846
5527 -2846 -4932 237 -2085 3520 910 10628 12026 1834 -9247 -16122 -12039 -4523 -9959 1846
5513 1846 2713 -904 8756 4791 5683 -6582 -7718 -3542 -492 -8926 -3232 -4482 -9334 -15079 -15531
5498 -15531 -10009 -3035 -694 -5100 -12035 -12108 -6566 -6036 -14017 -19961 -7861 2212 926 -10715 -9394
5483 -9394 -8552 -7063 -149 -16572 -18480 -10748 -9638 -10476 -16898 -13837 -9068 -2022 3463 7459 21784
5468 21784 21250 23658 6620 -7521 -1513 396 7730 4200 -2399 -15884 -11365 -4050 -3585 -12338
5454 -12338 -15332 -23582 -11235 -10245 -8227 -5341 13661 24503 22498 6740 -1206 10796 15272 13257
5440A3257p265m956n634r831l965J5214J2225N895Q413j888K847j7137l421O738
5426A0492J158r189j3266m205O338L99j3721J581K03L154l180J200j893J0865
5412a0064J5006Q631R536m296j5093l403m184M026j522k392J0607n088r224k141
5398i601J5944J1887j716m210j0474l841J0455j249q332K854Q265n258O386o550
5384D560q451P294M945m934k17K380o283K203j2198q178k021P243M980j2623L644
5369a7656R691K807J2037k04M269k26J946M259j2074j6913n293J2081M784N640
5355E148m759K343J019k509M496j9565j4801j056J2000M92N10m457p431k202J4810
5340a5962J0612p096J384j2876M67N530J5565k215q932n193O781P123P795j1012
$$ plain form
5440 13257 5992 1036 -4598 -14429 -18394 -3180 9045 14940 23353 21465 24312 7175 3754 10492
5426 10492 11650 2461 -10805 -15010 -8672 -8273 -21994 -20413 -20210 -17056 -20236 -19036 -20929 -10064
5412 -10064 4942 13573 23109 18813 3720 317 -3867 159 -1363 -3755 6852 1764 -7460 -9601
5398 -9601 6343 18230 16514 12304 1830 -2011 8444 7195 -1137 1717 9982 4724 11110 4560
5384 4560 -3891 3403 8348 3414 3197 5577 -706 1497 -10701 -18879 -20900 -13657 -8677 -21300 -17656
5369 -17656 -7965 -5158 6879 6675 10944 10718 12664 16923 4849 -12064 -17357 -5276 -492 5148
5355 5148 389 2732 3751 1242 5738 -13827 -28628 -29684 -17684 -17192 -16682 -21139 -28570 -30772 -15962
5340 -15962 -5350 -12446 -11062 -23938 -23471 -17941 -2376 -4591 -13523 -18716 -11935 -4812 2983 -8029
5326h029j046M65l676N060R542M168j2159L201k181n653J3562J0615q056o260
5312d47K925J7936o390j0764j0875N200k285J7391m306r003j1686k370r784o131
5298c0589J8139P741L45L008j5851j2862J0529J1988K362l36j621N994J2128J142
5284A2117m686m517p164m094P075j0146L904K0577j45q705l032l308j62L955l067
5269a398M263n524l305Q494Q703p351n96J7273M476j1889j0542j080r01l484J99
5254b662j0839j574l592O393l124L027J0263N681J977q829j1208K058J0171J0916
5240H658n391n228R512L662k492j0061R20p192r97P059r422q072o39J0561J6971
5225G849q451j7832n683O587J1597P747N818j221k611p794J0103J5672o598r246
$$ plain form
5326 -8029 -9075 -8610 -12286 -7226 2316 6484 -5675 -2474 -4655 -10308 3254 13869 5813 -447
5312 -447 2478 20414 14024 3260 -7615 -2415 -4700 12691 8385 -618 -12304 -14674 -24458 -30589
5298 -30589 -12450 -4709 -4364 -1356 -17207 -30069 -19540 -7552 -5190 -5526 -7147 -1153 10975 12117
5284 12117 7431 2914 -4250 -8344 -1269 -11415 -7511 13066 12921 4216 1184 -2124 -2286 1669 -1398
5269 -1398 2865 -2659 -5964 2530 11233 3882 3286 20559 25035 13146 2604 1524 623 -2861 -2662
5254 -2662 -13501 -15075 -18667 -12274 -15398 -12371 -2108 3573 5550 -3279 -14487 -12429 -2258 8658
5240 8658 3267 -1961 7551 11213 8721 -1340 -420 -7612 -8609 -1550 -10972 -19044 -19683 -9122 7849
5225 7849 -602 -18434 -24117 -17530 -5933 1814 7632 6411 3800 -3994 6109 21781 15183 5937
5211E937J134r342K358R832j1651m797Q206n541J5358M525Q677O437k0078j4820
5197c765Q31J624m383p194O645p966J087J4999N561n868L307K922j2304j956Q232
5182A772M790n253r69l842O412J198o61j50m862R59R205m349j0892j1171k524
5167b0337J4041J3452o443K752J774K099J758m472j4166p283r007J3730J6787
5154D685J2636J5160j3541k4610q48J3615j777k1834r440N502J048K370J171o104
5140b1967P673Q044M375M771J888j053j856m19j1479k298N409J395j568r826L575
5125a3336O54l645J2174J3448P134j2364Q201L673Q94m532j1321P83J2405Q93
5111A5061p613J2416n375o275J141r096j1901k834J4487K134o399n704M537J0931
$$ plain form
5211 5937 7071 -2271 87 9919 -1732 -6529 1677 -3864 11494 16019 24696 31133 11055 -3765
5197 -3765 -2934 -1310 -5693 -12887 -6242 -14208 -13121 1878 7439 1571 4878 7800 -4504 -6460 1772
5182 1772 6562 1309 340 -3502 2910 4108 3447 3297 -1565 -606 8599 4250 -6642 -17813 -20337
5167 -20337 -6296 7156 713 3465 5239 7338 9096 4624 -9542 -16825 -25832 -12102 4685
5154 4685 17321 32481 18940 -5670 -6518 7097 5320 -16514 -25954 -20452 -19404 -17034 -15863 -21967
5140 -21967 -14294 -6250 -1875 2896 4784 3731 1875 1456 -10023 -12321 -6912 -5517 -7085 -16911 -13336
5125 -13336 -12682 -16327 -4153 9295 16429 4065 12266 15939 16833 12301 980 1763 14168 15061
5111 15061 7448 19864 14489 8214 9355 259 -11642 -14476 11 2145 -4254 -9958 -5421 5510
5097E510P392k8533j0950J1655o31q333o820M659J4487J2481k358Q872N404n829
5083G006r329J38l969N640n008m296O615J3556J9618j2691q249p18N51l060r783
5068c979o67k853N077M602J0443Q424M195j0096m670m738k348k408m033j616Q124
5053C457j369J124K024n268j007O957M994j0797j2494M558O316j1041r864J8084
5039d326P894J064p01p027o645O030J5255Q239j6685q895O345M355n013m281k254
5024f645M361r12k4495o212J9503J3162j726J721k496j0377r750Q107J7102J680
5010C023j3396p202Q402P542M562q89K179o835Q102k126r91q580l312L13p599
4995a6807K263N148j47J0634l40q020n559k164k101Q743j968J450m148O159l89
$$ plain form
5097 5510 12902 -15631 -26581 -14926 -15557 -23890 -30710 -26051 -11564 917 -1441 7431 12835 7006
5083 7006 -2323 -2185 -6154 -514 -5522 -9818 -3203 10353 29971 17280 9031 8313 8864 5804 -3979
5068 -3979 -4646 -7499 -2422 2180 12623 21047 25242 15146 10476 5738 3390 982 -3051 -4667 3457
5053 3457 2088 3212 5236 -32 -1039 5918 10912 115 -12379 -7821 -1505 -12546 -22410 -4326
5039 -4326 3568 4632 3931 -3096 -9741 -3711 11544 19783 3098 -5797 548 4903 -110 -4391 -6645
5024 -6645 -2284 -3196 -27691 -33903 -14400 -1238 -2964 -1243 -3739 -14116 -23866 -15759 1343 3023
5010 3023 -10373 -17575 -9173 -1631 2931 2042 4221 -2614 5488 3362 2371 -6209 -9521 -9208 -16807
4995 -16807 -14544 -9396 -9543 1091 751 -7269 -12828 -14992 -17093 -8350 -10318 -8868 -13016 -6857 -7246
4980g246N689P85j4909j195L832r026J0103K2448J6291o272k7027o546m103K223
4966a4953R911J4542r005o758Q072Q236M299l053l114L887R82j1182p918m940
4952a0994K813K827m484j3361R897J2407j0187j5487P292J3896l06p315j623J33
4938a4492Q884J0061o213Q579o747K169k505q234l139r498J0295Q334k733M124
4924a115N63R51j2469M325l076J909k332k171O285m86j3459j580O663j0655N484
4909b1163R584Q76n04k955K63Q419r04o158k980J7561K514j0738l674q455j576
4894a9890k577O211Q762M500Q303j0670j2630m016j859k252o972o18J3512J3621
4880f575k961q034k844R749j177J066j0319l590O255J246k806M395N493J2484
$$ plain form
4980 -7246 -1557 -772 -15681 -16876 -13044 -22070 -11967 10481 26772 20500 -6527 -13073 -17176 -14953
4966 -14953 -5042 9500 495 -6263 1809 10045 14344 11291 8177 12064 13046 1864 -6054 -10994
4952 -10994 -8181 -5354 -9838 -23199 -13302 -895 -11082 -26569 -19277 -5381 -5687 -13002 -14625 -14492
4938 -14492 -5608 4453 -1760 6819 72 2241 -264 -8498 -11637 -21135 -10840 -2506 -5239 -1115
4924 -1115 -552 399 -12070 -7745 -10821 -8912 -11244 -13415 -7130 -7616 -21075 -22655 -15992 -26647 -21163
4909 -21163 -11579 -10703 -11207 -14162 -13899 -5480 -6384 -12542 -15522 2039 4553 -6185 -9859 -18314 -19890
4894 -19890 -22467 -16256 -7494 -2994 5309 -5361 -17991 -22007 -23866 -26118 -33090 -33708 -20196 -6575
4880 -6575 -9536 -17570 -20414 -10665 -11842 -10776 -21095 -24685 -18430 -17184 -19990 -15595 -10102 2382
4866B382J0430r123j629O35L910L611K121r753o489J064J1860j4761k1623J269
4852b6096J0720j147J2492M33j2494M249O586M711k389j707n22N874O483K560
4838I753o95j6634k563K994O876n948o114Q080J4021j0146l970J2805n918j1462
4824h921n669J0172J1335K973O85K740O985r200p490O73J1528M655j0886N46p540
4809B586j7213R709o557j493M672L07l46J4566M322p766j966O095n562p734o938
4794a3318N084N535m62J207R310P885R380j1482j7379J942J3821N604o212k844
4780H071p48m329n137J923J0090L495N019P04J855L204L198L307j6685j5992j1150
4765a3175p684O093m021K225J2935l516m262j057p615Q314Q426J0612N243J640
$$ plain form
4866 2382 12812 3689 2060 2695 6605 10216 12337 2584 -3905 -2841 9019 -5742 -27365 -26096
4852 -26096 -15376 -16523 -4031 -3598 -16092 -11843 -5257 -546 -2935 -4642 -5164 710 7193 9753
4838 9753 9058 -7576 -10139 -7145 -269 -6217 -12331 -4251 9770 -376 -4346 8459 2541 -8921
4824 -8921 -14590 -4418 6917 9890 10575 13315 20300 11100 3610 4283 15811 20466 9580 10126 2586
4809 2586 -14627 -4918 -11475 -12968 -8296 -7989 -8335 6231 10553 2787 821 6916 1354 -6380 -13318
4794 -13318 -8234 -2699 -3161 -1954 7356 15241 24621 13139 -4240 -2298 11523 17127 10915 8071
4780 8071 7323 2994 -2143 -220 9870 13365 18384 19088 20943 24147 27345 30652 13967 -2025 -13175
4765 -13175 -20859 -14766 -18787 -16562 -3627 -7143 -11405 -12462 -20077 -11763 -3337 7275 12518 14158
4751A4158j4499J355J335j0179Q732m257q415N023M987k79K626P326r960j1458
4737a3505P234m384k977K300J3359L802O343K619j8584l506l301K075O296O239
4723D010j4385r715Q511q01O207J3959K874j659m403j7639l335j1938J1046J1647
4709e621J1612K755j2670P780M06K801k45k144n32J2285n677m406L010p471K4
4694A907q613j934l236O795K3644O386n866j1051L449j6175n751k009N589l009
4680i874q58n569O313P987L04N498L815o935O60K67R19r137n251N794J0453o501
4664b115m430n212j2459N370J2474J276P760J1721n884L10k358n070O261P784
4650A5428K196M031j2991p434O680K554Q643m675j2107K352n654n059J4905J2368
$$ plain form
4751 14158 -341 1014 2349 -7830 902 -3355 -11770 -6747 -1760 -2039 587 7913 -2047 -13505
4737 -13505 -6271 -10655 -13632 -11332 2027 5829 12172 14791 -3793 -7299 -10600 -8525 -2229 4010
4723 4010 -10375 -20090 -11579 -12380 -6173 7786 10660 9001 4598 -13041 -16376 -28314 -17268 -5621
4709 -5621 5991 8746 -3924 3856 4262 7063 6818 4674 4142 16427 10750 6344 9354 1883 1907
4694 1907 -6706 -8640 -11876 -5081 18563 24949 19083 8032 11481 -4694 -10445 -12454 -6865 -9874
4680 -9874 -10732 -16301 -9988 -2001 -1697 3801 7616 681 1341 1608 2527 -6610 -11861 -6067 4386 -2115
4664 -2115 -6545 -11757 -24216 -18846 -6372 -5096 2664 14385 8501 8811 6453 1383 7644 15428
4650 15428 17624 21655 8664 1230 7910 10464 19107 14432 2325 4677 -977 -6036 8869 21237
4636B1237j9667j7230l202R0J4189k694p555k708r964N636K1987K861l059m641
4622d720Q49n784j3791o405N61p25N146K0514R546K323J0341r246j7362k045m647
4607a5445O361J0418J373L501J5770p094q43m62L984j9746o903k0187o712K0954
4593a5031J0803l04o810k475O62J272k26j68R360j9598p242N520k115p790P63
4578c3379P375J6189L764%j971P464K966m520j512P524m488p738o974J2064O078
4563B842p488j2530p853J134K854J9135P664P295q457k742L649q612k429m212
4549i750M891J0086m5J499R2J0829p156m681k936l578J3154m307m903M8k933k18
4533I2Q44k767k206J512o214j0582J5223P176m037L030k49j4781j1036n019R728
$$ plain form
4636 21237 1570 -15660 -18862 -18772 -4583 -7277 -14832 -17540 -27504 -21868 119 2980 -79 -4720
4622 -4720 -3871 -9655 -23446 -29851 -29290 -30015 -24869 -4355 5191 7514 17855 8609 -8753 -10798 -15445
4607 -15445 -9084 1334 2707 6208 21978 14884 14041 13579 17563 -2183 -9086 -29273 -35985 -15031
4593 -15031 -4228 -4532 -11342 -13817 -13155 -11883 -12109 -12277 -2917 -22515 -29757 -24237 -26352 -34142 -33379
4578 -33379 -26004 -9815 -6051 -6051 -8022 -558 2408 -2112 -3624 3900 -588 -8326 -15300 -3236 2842
4563 2842 -4646 -17176 -25029 -23895 -21041 -1906 5758 13053 4596 1854 5503 -3109 -5538 -9750
4549 -9750 -4859 5227 5182 6681 6773 17602 10446 5765 2829 -749 12405 8098 3195 3243 310 92
4533 92 936 -1831 -4037 -2525 -8739 -19321 -4098 3078 -959 2071 1822 -12959 -23995 -29014 -19286
4518a9286J56m568P608N168j7904m770N304r92J797R6L857O934J3937j2775q997
4503b4435L270N956M341K676r25O653m785R975M143m138Q099j755q139j0158N060
4488d162L184L07n092N003M280j9577m236O815k413K3241J4214j2893j5467O23
4474f173R498J4563q815j4420O116j425N90q24P327K1732p379j5658q442L972
4460F62O009P470L808N165P524k382j3137j5831K69J747Q266m090o565K085M77
4445A477p238J018M528l29J5965M722o925m912L093r070L695Q268Q752r102j4536
4430e94p815Q286j551N593j128p501R939L391j9080l916L553J0929J5227o632
4416H701K431p11n714J027P086o892r961M120O073Q667j1989n510j60k118j0570
$$ plain form
4518 -19286 -19130 -23698 -16090 -10922 -28826 -33596 -28292 -29284 -27487 -27391 -23534 -16600 -2663 -15438 -24435
4503 -24435 -21165 -15209 -10868 -8192 -9117 -2464 -7249 2726 6869 2731 10830 9075 936 -9222 -4162
4488 -4162 -978 -671 -5763 -760 3520 -16057 -20293 -13478 -15891 7350 21564 8671 -6796 -6173
4474 -6173 3325 17888 9073 -5347 769 -656 -66 -890 6437 28169 20790 5132 -3310 662
4460 662 6671 14141 17949 23114 30638 28256 15119 -712 -443 1304 9570 5480 -1085 1000 1477
4445 1477 -5761 -4743 -215 -544 15421 20143 13218 8306 11399 2329 6024 14292 23044 13942 -594
4430 -594 -8409 -123 -1674 3919 2791 -4710 5229 8620 -10460 -14376 -10823 106 15333 8701
4416 8701 11132 10421 4707 5734 12820 5928 -4033 87 6160 14827 2838 -2672 -2832 -4950 -15520
4401a5520p996J7573J8308m836n812k84n089l520M541r493j292K104L229R093
4387A006K648p393j215R821J6782l72o075j335m536m294j1795p210Q382J0427
4373D841M871Q655N837l051p951on092k1301j715P504O420J012o504J630L033
4358a817k039m60M653L092K147j392N891K864j7899p733p200k315l519J1287J1212
4343c228J3703J846p071l433j662o587J230J0538O686m95J313K621j0092N60K278
4328H207n956N696O408j258L707o668j2396n623r544k917K0598Q129R28M159J1530
4313B5000j3330n898N679j2768j6270Q040J1082r465J189N494p025o459L124Q861
4299b746K680l314K570l13j1976o688j876J4704K584m62k105o352P240P296l182
$$ plain form
4401 -15520 -23516 -5943 12365 7529 1717 1433 -3656 -7176 -2635 -12128 -13420 -11316 -8087 1006
4387 1006 3654 -3739 -4954 4867 21649 21277 15202 13867 9331 5037 -6758 -13968 -5586 4841
4373 4841 9712 18367 24204 21153 13202 13196 8104 -13197 -14912 -7408 -988 24 -6480 -4850 -1817
4358 -1817 -3856 -4316 337 3429 5576 4184 10075 12939 -4960 -12693 -19893 -22208 -25727 -14440 -3228
4343 -3228 10475 12321 5250 1817 155 -6432 -5202 5336 12022 11527 12840 15461 5369 5929 8207
4328 8207 2251 7947 14355 13097 16804 10136 -2260 -7883 -17427 -20344 254 8383 9311 13470 25000
4313 25000 11670 5772 11451 -1317 -17587 -9547 1535 -7930 -6741 -1247 -8272 -14731 -11607 -2746
4299 -2746 -66 -3380 -810 -1123 -13099 -19787 -21663 -6959 -4375 -4837 -6942 -13294 -6054 1242 -1940
4284a940m447O377j988r601m970J4924J1888n999m386l777n052j5800j3265Q896
4270b9140J2951J2059j2468J1909P968P214M046m426M45l191m957n900K783J714
4256A007O674j4094j1880N829k914O187M251J6j2615O520M704K089k866o520N22
4241a3090P716P224j638L299R37N046j019m412r886m989K920J238L243m831P14
4226g528l593n646l788l146K986n204J1216J242L557J0904l8j1246k082R647J1251
4211H532J159k468M429L701j0072J218n91J3195K3522l846k5959j8357n516J3502
4197B449q74P232n044j7137j5897l030j466N979M700R052j911Q112O90m811q262
4182b0218N888P611l51J329O278o460J0073O254q266L98n444N557m022o768n484
$$ plain form
4284 -1940 -6387 -10 -1998 -11599 -16569 -1645 10243 4244 -142 -3919 -8971 -24771 -38036 -29140
4270 -29140 -16189 -4130 -16598 -4689 3279 10493 14539 10113 10558 7367 2410 -3490 -707 1007
4256 1007 7681 -6413 -18293 -12464 -15378 -9191 -4940 -4924 -17539 -11019 -6315 -4226 -7092 -13612 -13090
4241 -13090 -5374 1850 212 3511 4448 9494 8475 4063 -5823 -10812 -7892 -6654 -3411 -8242 -7528
4226 -7528 -11121 -16767 -20555 -23701 -20715 -25919 -14703 -13461 -9904 1000 962 -10284 -12366 -2719 8532
4211 8532 9691 7223 11652 15353 5281 6499 5908 19103 42625 38779 12820 -5537 -11053 2449
4197 2449 1575 8807 3763 -13374 -29271 -32301 -33767 -27788 -23088 -14036 -15947 -7835 -7145 -11956 -20218
4182 -20218 -14330 -6719 -7070 -5741 537 -5923 4150 10404 2138 2536 -2908 2649 -1373 -8141 -13625
4167a3625K25M800N443l08l617K033j626l984O90P708K455O778N342m277n137
4152B900p625j681o170p309P3K1583J3899j8488L908k626P57n727K321j391l773
4137i349P511L798l401J0904J0552j0482R073p794q538j4823l238N030O66j0839
4123b0930R948K2533o327j0279m91K213L720k770j5417M413P964n775M704J419
4109e075q597n536l167m335k064J7068M020n773J5707j591O335J411K507N487
4095A6397J888j2883p892K443o127n29M810j7640j227J6016j2864o561J3992P241
4081b936K506J1350J5267m10k4912j100N267N106N181J0349o990n766J1509j0371
$$ plain form
4167 -13625 -13400 -8600 -3157 -3465 -7082 -5049 -6675 -10659 -9969 -2261 194 6972 12314 8037 2900
4152 2900 -4725 -6406 -12576 -19885 -19812 1771 15670 -2818 1090 -1536 -779 -6506 -4185 -5576 -9349
4137 -9349 -1838 1960 -1441 9463 20015 9533 18606 10812 2274 -12549 -15787 -10757 -10091 -20930
4123 -20930 -10982 11551 5224 -5055 -5546 -3333 387 -2383 -17800 -13387 -5423 -11198 -6494 -5075
4109 -5075 -13672 -19208 -22375 -26710 -28774 -11706 -7686 -13459 2248 657 6992 8403 10910 16397
4095 16397 18285 5402 -2490 -47 -6174 -6703 -1893 -19533 -20760 -4744 -17608 -24169 -10177 -2936
4081 -2936 -430 10920 26187 25777 865 -235 5032 10138 15319 25668 18678 12912 24421 14050
$$ [...]
##END NTUPLES=NMR SPECTRUM
##END=
