##TITLE=Analysis number 319384
Compound Code cc 30604
Book Reference 486/2
Project Code adrs
Chemist Name simons
##JCAMPDX= 6.0         $$ Bruker NMR JCAMP-DX V2.0
##DATA TYPE= NMR SPECTRUM
##DATA CLASS= NTUPLES
##ORIGIN= Bruker BioSpin GmbH
##OWNER= nmr
$$ XWIN-NMR		Version 3.5
$$ Fri May 12 08:53:56 2006 GMT Daylight Time (UT+1h)  MAYBRIDGE\nmr@NMR_250MHZ
##.OBSERVE FREQUENCY= 250.131544655141
##.OBSERVE NUCLEUS= ^1H
##.ACQUISITION MODE= SIMULTANEOUS (DQD)
##.ACQUISITION SCHEME= undefined
##.AVERAGES= 16
##.DIGITISER RES= 18
##SPECTROMETER/DATA SYSTEM= dpx250
##.PULSE SEQUENCE= zg30
##.SOLVENT NAME= CDCl3
##.SHIFT REFERENCE= (INTERNAL, CDCl3, 0, 16.522)
##AUDIT TRAIL= $$ (NUMBER, WHEN, WHO, WHERE, WHAT)
$$ ##TITLE= Audit trail, XWIN-NMR		Version 3.5
$$ ##JCAMPDX= 5.01
$$ ##ORIGIN= Bruker BioSpin GmbH
$$ ##OWNER= nmr
$$ C:\u/data/dgb/nmr/ADRS/4210/pdata/1/auditp.txt
$$ ##AUDIT TRAIL=  $$ (NUMBER, WHEN, WHO, WHERE, WHAT)
(   1,<2006-05-12 08:53:28.35 +100>,<MAYBRIDGE\nmr>,<NMR_250MHZ>,
      <created by zg, POWCHK disabled, PULCHK disabled
       configuration hash MD5:
       84 BC 41 DB A1 6E 1D 46 DA 25 12 A5 C1 ED C5 3A
       data hash MD5: 64K
       27 B4 EF E0 68 4F 1B F7 48 D7 EF 6F 11 89 8E C3>)
(   2,<2006-05-12 08:53:43.55 +100>,<MAYBRIDGE\nmr>,<NMR_250MHZ>,
      <Start of raw data processing
       ef LB = 0.3 FT_mod = 6 PKNL = 1 SI = 32K 
       data hash MD5: 32K
       F0 7E 45 4E 00 56 A9 7B B5 3D 99 29 DA DD B9 C7>)
(   3,<2006-05-12 08:53:45.30 +100>,<MAYBRIDGE\nmr>,<NMR_250MHZ>,
      <apk 
       data hash MD5: 32K
       60 5D E7 B0 5F 75 6D 0F 55 1B 43 EF 59 2A 01 81>)
(   4,<2006-05-12 08:53:46.17 +100>,<MAYBRIDGE\nmr>,<NMR_250MHZ>,
      <abs ABSG = 5 
       data hash MD5: 32K
       B2 3D EE E9 86 08 A8 81 D6 76 7C 4D 4A 37 A0 5D>)
$$ ##END=
$$ 
$$ hash MD5
$$ D6 71 0E 12 7C 7D 1D 8A DF D4 E3 45 99 C1 CB 71
##$RELAX= 
##$RELAX= 
##$RELAX= 
##$RELAX= 
##$RELAX= 
##$RELAX= 
##$RELAX= 
$$ Bruker specific parameters
$$ --------------------------
##$DU= <C:\u>
##$EXPNO= 4210
##$NAME= <ADRS>
##$PROCNO= 1
##$TYPE= <nmr>
##$USER= <dgb>
##$AMP= (0..31)
100 100 100 100 100 100 100 100 100 100 100 100 100 100 100 100 100 100 
100 100 100 100 100 100 100 100 100 100 100 100 100 100 
##$AQSEQ= 0
##$AQ_mod= 3
##$AUNM= <au_zg>
##$AUTOPOS= <5 >
##$BF1= 250.13
##$BF2= 250.13
##$BF3= 250.13
##$BF4= 250.13
##$BF5= 500.13
##$BF6= 500.13
##$BF7= 500.13
##$BF8= 500.13
##$BYTORDA= 1
##$CFDGTYP= 0
##$CFRGTYP= 5
##$CHEMSTR= <none>
##$CNST= (0..31)
1 1 145 1 1 1 1 1 1 1 1 1 1 1 1 1 1 1 1 1 1 1 1 1 1 1 1 1 1 1 1 1 
##$CPDPRG= <>
##$CPDPRG1= <>
##$CPDPRG2= <>
##$CPDPRG3= <>
##$CPDPRG4= <mlev>
##$CPDPRG5= <mlev>
##$CPDPRG6= <mlev>
##$CPDPRG7= <mlev>
##$CPDPRG8= <mlev>
##$CPDPRGB= <>
##$CPDPRGT= <>
##$D= (0..31)
0 1 0 0 0 0 0 0 0 0.06 0 0 0 0 0 0 0.0002 0 0 0 0 0 0 0 0 0 0 0 0 0 0 
0 
##$DATE= 1147420407
##$DBL= (0..7)
120 120 120 120 120 120 120 120 
##$DBP= (0..7)
150 150 150 150 150 150 150 150 
##$DBP07= 0
##$DBPNAM0= <>
##$DBPNAM1= <>
$$ [...]
##$SUBNAM7= <"">
##$SUBNAM8= <"">
##$SUBNAM9= <"">
##$SW= 20.6930455092707
##$SWIBOX= (0..15)
0 0 3 0 0 0 0 0 0 0 0 0 0 0 0 0 
##$SW_h= 5175.983436853
##$TD= 65536
##$TD0= 1
##$TE= 295.16
##$TE2= 300
##$TE3= 300
##$TEG= 300
##$TL= (0..7)
0 120 120 120 120 120 120 120 
##$TP= (0..7)
150 150 150 150 150 150 150 150 
##$TP07= 0
##$TPNAME0= <>
##$TPNAME1= <>
##$TPNAME2= <>
##$TPNAME3= <>
##$TPNAME4= <>
##$TPNAME5= <>
##$TPNAME6= <>
##$TPNAME7= <>
##$TPOAL= (0..7)
0.5 0.5 0.5 0.5 0.5 0.5 0.5 0.5 
##$TPOFFS= (0..7)
0 0 0 0 0 0 0 0 
##$TUNHIN= 0
##$TUNHOUT= 0
##$TUNXOUT= 0
##$USERA1= <user>
##$USERA2= <user>
##$USERA3= <user>
##$USERA4= <user>
##$USERA5= <user>
##$V9= 5
##$VALIST= <valist>
##$VCLIST= <CCCCCCCCCCCCCCC>
##$VD= 0
##$VDLIST= <DDDDDDDDDDDDDDD>
##$VPLIST= <PPPPPPPPPPPPPPP>
##$VTLIST= <TTTTTTTTTTTTTTT>
##$WBST= 1024
##$WBSW= 4
##$XGAIN= (0..3)
0 0 0 0 
##$XL= 0
##$YL= 0
##$YMAX_a= 696055
##$YMIN_a= -617631
##$ZGOPTNS= <>
##$ZL1= 120
##$ZL2= 120
##$ZL3= 120
##$ZL4= 120
##$ABSF1= 16.522
##$ABSF2= -4.171173
##$ABSG= 5
##$ABSL= 3
##$ALPHA= 0
##$AQORDER= 0
##$ASSFAC= 0
##$ASSFACI= 0
##$ASSFACX= 0
##$ASSWID= 0
##$AUNMP= <proc_1d>
##$AZFE= 0.1
##$AZFW= 0.1
##$BCFW= 0
##$BC_mod= 0
##$BYTORDP= 0
##$COROFFS= 0
##$CY= 12.5
##$DATMOD= 1
##$DC= 0
##$DFILT= <>
##$DTYPP= 0
##$F1P= 14.0000005364418
##$F2P= -0.99999901652339
##$FCOR= 0.5
##$FTSIZE= 32768
##$FT_mod= 6
##$GAMMA= 0
##$GB= 0
##$INTBC= 1
##$INTSCL= 1
##$ISEN= 128
##$LB= 0.3
##$LEV0= 0
##$LPBIN= 0
##$MAXI= 10000
##$MC2= 0
##$MEAN= 0
##$ME_mod= 0
##$MI= 0
##$NCOEF= 0
##$NC_proc= -3
##$NLEV= 6
##$NOISF1= 0
##$NOISF2= 0
##$NSP= 0
##$NTH_PI= 0
##$NZP= 0
##$OFFSET= 16.522
##$PC= 1
##$PHC0= 165.0294
##$PHC1= 5.854524
##$PH_mod= 1
##$PKNL= yes
##$PPARMOD= 0
##$PSCAL= 4
##$PSIGN= 0
##$REVERSE= no
##$SF= 250.13
##$SI= 32768
##$SIGF1= 0
##$SIGF2= 0
##$SINO= 400
##$SIOLD= 32768
##$SREGLST= <1H.CDCl3>
##$SSB= 0
##$STSI= 32768
##$STSR= 0
##$SW_p= 5175.98343685301
##$SYMM= 0
##$S_DEV= 0
##$TDeff= 65536
##$TDoff= 0
##$TI= <Analysis number 999999
Compound Code 99
Book Reference 9
Project Code 9>
##$TILT= no
##$TM1= 0
##$TM2= 0
##$TOPLEV= 0
##$USERP1= <user>
##$USERP2= <user>
##$USERP3= <user>
##$USERP4= <user>
##$USERP5= <user>
##$WDW= 1
##$XDIM= 32768
##$YMAX_p= 511012250
##$YMIN_p= -55096
$$ End of Bruker specific parameters
$$ ---------------------------------
##NTUPLES= NMR SPECTRUM
##VAR_NAME=  FREQUENCY,     SPECTRUM/REAL,   SPECTRUM/IMAG
##SYMBOL=    X,             R,               I
##VAR_TYPE=  INDEPENDENT,   DEPENDENT,       DEPENDENT
##VAR_FORM=  AFFN,          ASDF,            ASDF
##VAR_DIM=   32768,         32768,           32768
##UNITS=     HZ,            ARBITRARY UNITS, ARBITRARY UNITS
##FACTOR=    0.157963299565203, 1,           1
##FIRST=     4132.6476996994, 0,             0
##LAST=      -1043.33573715361, 0,           0
##MIN=       -1043.33573715361, -55096,      0
##MAX=       4132.6476996994, 511012250,     0
$$ Real data points
##PAGE= N=1
##DATA TABLE= (X++(R..R)), XYDATA
$$ [...]
16662a3159j677p969L119L666M945q199J455J2002Q293L764m970j848j1700P255
16648e023R416J3441J1536m572L086Q3j183l833o755j9154n839p105k510k840
16634b1252m218J1936j336l451K792O542L656r108q83q806J37L186M230j103M023
16619a3655j3596n687L185J16J2540L104J7386j769j1684O272j899l333J132j5357
16605b3245n402j297r626k694J2425J239M83m415q22N093J1120P819J1447J974
16591D099K491k117J235R575L700j6j4482K992Q14J949N13p152J976R407n481
16576I503k1139j583R686O511J4047p771k252r604p486Q961o626L760J2425N739
16562A4171J603q169l320J0104j863n220l219k961j666r987K081R161n695j1539
$$ y = [-13159, -14836, -22805, -19686, -16020, -11075, -19274, -17819, -5817, 2476, 6240, 1270, -578, -12278, -5023, 4393, 17834, 29370, 24798, 27884, 27967, 26784, 22951, 16196, -2958, -8797, -15902, -18412, -21252, -25470, -13534, -14870, -18321, -15529, -8987, -5331, -14439, -15322, -24128, -23991, -20805, -16575, -17678, -13655, -27251, -32938, -29753, -29637, -17097, -13993, 3393, 1624, -10060, -3788, -5687, -9020, -7888, -23245, -28647, -29944, -39570, -42264, -29839, -28600, -28117, -32532, -33354, -28261, -17141, -9322, 2125, 4099, 6590, 4473, 5708, 15283, 18983, 18967, 4485, 7477, 8291, 10240, 10753, 3601, 5577, 14984, 9503, -11636, -13219, -3533, 2978, 17025, 9254, 7002, -2602, -10088, -1127, -7753, -3993, 8432, 14171, 15774, 7605, 4285, 14389, 12526, 7306, 4087, 1126, -540, -10527, -8446, 715, -4980, -16519]
16548a6519l167r6j651R245J8212K390p083k320P293j066p297j1891N81J7136
16534C767Q688j3471n695k867K856N168Q715L055k833p261L859l03j8674j9658
16520c4654O679J6678P499l899q469N171j1278K834N215N66l441l326o018M43
16506b6000R822N790O951M421n685j327K786L528p037k1239K134J995J1891J4730
16492B760J334J675O895l443p894j794j5259P408J8460j8140j1877J7229P691
16479E045J3294j012j4782k649j047J1787Q594j2508r782j7253K940R376l159
16466a1156K734K0586J8371J62j0513j1187O39J8007j0134l0195q920Q346L015
16453a0245j915O180M736R829o660q086J1566q952K732L13m372m843k024M453
$$ y = [-16519, -19686, -19782, -21433, -12188, 6024, 8414, 1331, -989, 6304, 5238, -2059, -13950, -13369, 3767, 12455, -1016, -6711, -9578, -6722, -1554, 7161, 10216, 7383, 122, 3981, 3678, -14996, -34654, -27975, -11297, -3798, -7697, -16166, -10995, -22273, -19439, -14224, -13658, -17099, -20425, -26443, -26000, -16178, -10388, -3437, 984, -4701, -6028, -3242, 286, -6751, -27990, -25856, -23861, -11970, 2760, 4094, 5769, 12664, 9221, 1327, -467, -15726, -8318, 10142, -7998, -19875, -2646, 5045, 18339, 17327, 2545, -104, -1151, 10636, 19230, 6722, -3060, -20313, -17373, -7997, -11156, -8422, 12164, 30535, 30697, 20184, 8997, 9636, 27643, 17509, -12686, -21606, -13260, -10245, -12160, -5980, -1244, 8585, 1925, -6161, 5405, -3547, -815, -502, -4874, -9717, -11741, -7288]
16439g288j4978k31J9599J6729q693q981J2857j5588j4888L028J5313J2367R341
16426A8587Kk0143j135K804k559P282P088K667N753j338k452o522k477q566m314
16411e323n180n225o004J4507J2782o573n564J2167q850m705Q319P779K736r993
16397H73q442k284J1080L563l169m293l491N807M566k41o058l687j0671k590J2745
16382f292j919o584L689m250O79M84Q17q776p232J5112J4727K982R90n273r94
16367a840L967j1861J952J0559p20o672l930Q071M497j175n901j633j270J0745
16353D789Q948m88p431o129j0621r676j048L259J0936J701o227p99n641j1908
16339c0335L094J0104N436Q49K1753m087J369j0668o790J721O330m250k87O477
$$ y = [-7288, -22266, -22497, -2898, 13831, 5138, -3843, 9014, -6574, -21462, -18434, -3121, 9246, 18587, 18589, -1554, -2689, 115, -2444, 4838, 11926, 14593, 20346, 19008, 16556, 10034, 7557, -1009, -5323, -10503, -15728, -21732, -7225, 5557, -1016, -6580, 5587, -3263, -7968, 351, 8130, 10866, 873, -7569, -9853, 1227, 4790, 1621, -2672, -6163, -356, 4210, 3969, -2089, -5776, -16447, -19037, -6292, -8211, -14795, -11106, -15356, -14677, -14193, -13376, -22152, -29384, -14272, 455, 3437, 4427, -846, -1840, 2127, -9734, -7782, 2777, 2057, -4615, -8545, -474, 4023, 2848, -3053, -4686, -5956, 4789, 13737, 13249, 5818, -311, -10932, -20608, -21656, -18397, -7461, -5760, -11987, -12786, -18427, -30335, -27241, -17137, -11701, -10852, 10901, 6814, 8183, -2485, -9275, -7554, -1224, -5474, -5761, 716]
16325G16O380k266q999j3271m409N984K2272Q354o779j6233j2298M199N588j2300
16311b3062N519O000M419O682M362j1606M094L296j823r995J990J4438k811N891
16297G394m358j6013N632Q30M296j5218q704n662K966J4841P627J1602J2127p453
16283I907j0825m78n680m078n769n864k456m45K955J7639J4207O40k0577n961
16269a6785M99R147O383J215P947P863m107P804r724r275o257l573L079N555m216
16254d445K405J2777o34j2229k1003o985J0973j460O374J1281P150q955j4748
16241a9499n121P084O070K191j1137j0094k073k269J510R285J3852J1655n987
16228d533l909k32l426l319m409j62l347O07J9096l933q651l841Q32k631n698
$$ y = [716, 7096, 4830, -4169, -17440, -21849, -15865, 6407, 14761, 7982, -8251, -20549, -16350, -10762, -23062, -17543, -11543, -7124, -442, 3920, -7686, -3592, -296, -2119, -12114, -10124, 4314, 1503, 7394, 3036, -12977, -7345, -6515, -2219, -17437, -26141, -31803, -28837, -13996, -6369, 5233, 17360, 9907, -918, -1396, -7076, -11154, -16923, -22787, -25243, -25688, -22733, -5094, 9113, 9753, -10824, -16785, -16286, -7139, -756, 459, 8406, 16269, 12162, 19966, 10242, 967, -5290, -8863, -5784, -229, -4445, -2040, 10737, 10103, -2126, -23129, -30114, -19141, -20601, -14227, -2946, 4204, -4751, -19499, -24620, -17536, -11466, -9275, -20412, -30506, -32579, -34848, -33338, -24053, -10201, 1454, -4533, -8442, -8674, -12100, -15419, -19828, -19990, -23337, -22730, -3634, -7567, -16218, -20059, -19227, -21858, -27556]
16213b7556J5719J3613n42l01j848N144J787k4158l327J1420k334N954K069j1611
16199a5971o082J1151P977L583k79k98L92n032m537M524K502n481m911M533N340
16184b589o692o841J742J3396J1929p522j3515R933J0669r517k299Q713M533p866
16170D074j1303L646k923J49J706J9042j2993j0406l296J0032N444L498J950J1756
16156B0376N09j8231q523j3032q228J1345J1136R842M826l2715j7923J1895J1252
16143a7471J2323L278j653P766q131k6440k907J8183R688J1753q180j851R318
16130E676M327j4738j4000n95j1539M46K876J534J8310J4999o562m828k973q169
16116a5236q101K529K810o757m640L586K216J4598k175o494o984m449P130J1974
$$ y = [-27556, -11837, 1776, 1234, 933, -915, 4229, 6016, -18142, -21469, -10049, -12383, -6429, -4360, -15971, -22053, -10902, -2925, 658, 379, 81, 473, -4559, -9096, -4572, -2070, -7551, -12462, -7929, -2589, -9281, -16122, -14380, -984, 10945, 3423, -10092, -159, 10510, 993, -1306, 7407, 11940, 4074, -7229, -3583, -6506, -6357, -4651, 14391, 1398, -9008, -12304, -2272, 3172, 6670, 8620, 20376, 20885, 2654, -5869, -18901, -27129, -15784, -4648, 5194, 10020, -22695, -40618, -28723, -17471, -5148, -1870, -3523, 4243, -3888, -30328, -33235, -15052, -5364, 6389, -1791, -3642, 5676, 10003, -4735, -18735, -19330, -30869, -30423, -27547, -26013, -7703, 7296, 734, -4094, -7067, -15236, -23337, -20808, -17998, -24755, -29395, -25809, -23593, -8995, -11170, -17664, -24648, -29097, -21967, -9993]
16102i993k65m916O876l463K679J8955L724j2195m540r643R000K96M47k900r78
16087f916q373J0710n411j093r024Q757J858k901l784R722j04N110q00J0655j2152
16072c746j040P29J487q491J510K823J822J1278J5740o078j5514o55o875M264
16058b746k612n770l66P583J3103m240j2012k641K230m142R922N052j12o409p039
16043a0199j3988O326J8906l797m822j216J301M332M935K58j0277N172J626J398
16029d5M16j3436j4174J2248K2693l237j7694o489j265P042J0372q35K323p186
16015i267m747j0548N382N037P921N852j9314p97J2596J3881P700j0852j7934
16002a5090j1327k3R153R218N296R761p281m531l956L177Q070j0772j964L017
$$ y = [-9993, -10258, -15174, -8298, -11761, -9082, 9873, 13597, 1402, -3138, -12781, -3781, -3485, -3038, -5938, -6916, -15289, -4579, -9990, -11083, -20107, -11350, -9492, -12393, -16177, -6455, -6559, -1449, -2249, 8406, -3746, -4786, -4057, -2570, -11061, -9551, -6728, -4906, 6372, 22112, 16034, 520, -135, -7010, -2746, -5358, -11128, -11494, -3911, 9192, 4952, -7060, -9701, -7471, -11613, -1691, 3361, 3249, -3160, -10199, -24187, -17861, 1045, -2752, -7574, -8790, -7489, -3157, 1778, 2036, -8241, -3069, -1443, -45, 371, -13065, -27239, -14991, 7702, 4465, -13229, -19718, -20983, -13941, -3569, -4404, -2081, -9267, -14014, -24562, -19180, -14143, -6222, -370, -19684, -20481, -7885, 5996, 13696, 2844, -15090, -26417, -26440, -17287, -8069, -2773, 6988, -293, -4824, -8780, -5603, 2467, -8305, -10269, -7252]
15988g252j617j0070L619J1646K93o995J361l082K6827R160j8966j6565L774j2264
15974b0131K434Q732J2160J0218q543j3263N091J4514j0717J657k050j8647j3320
15961c1865P611j653K480j4388J253K0553Q725m918j426J033m492j21j0864J268
15947b6804K088N547N074n93O154P887J294j4082k532l661Q510M415r794N231
15933a1266J1092R103R547r905j110l444k453j2728l455Q26K110J3520k975p257
15919h395j193O349K351p770N332R300p171J412J0165K362P249p762r664N827
15905H392j820J092q73j4778j6329J7060J2288J4824K440j7646q333r487p673
15892b0843J686M168j722J4946R043r766l044n397j014L820L578k616O555M161
$$ y = [-7252, -8869, -18939, -15320, -3674, -3381, -10376, -9015, -12097, 14730, 23890, 4924, -11641, -7867, -20131, -17697, -8965, 3195, 13413, 4870, -8393, -3302, 11212, 495, 2152, 102, -18545, -31865, -24254, -25907, -23427, -37815, -36562, -16009, -7284, -12202, -13628, -12595, -17087, -17208, -28072, -26804, -24716, -19169, -14095, -14688, -8534, -647, 647, -13435, -15967, -19628, -11118, -6703, -16497, -11266, -174, 8929, 18476, 8571, 7461, 4017, 1564, -11164, -14619, -13793, -11683, 1837, -1138, -8395, -9588, -3239, -888, -8658, -3326, 5974, -1197, 215, 10380, 12742, 19991, 12229, 2565, 8392, 6572, 7664, 6791, -7987, -24316, -7256, 5032, 19856, 22296, 4650, -3683, -13170, -20843, -19157, -14989, -16711, -1765, 7278, -2488, -5532, -10929, -11943, -8123, -4545, -7161, -606, 3555]
15878C555M689p517n800J411J6114p05o668l00r351j4437l036J0645K05M453J494
15863e248l118N919m612j3629j8076J3066K0924O449m596q975R33j593J4200K80
15849A924p637p040K681Q089k192m565N41r351r995J753o25J0835K0307j5577
15835a0852r637K908q879K973Q753P138o09J5295j151q577j157j3073M62O623
15821i783J7563P017l618k140l336J18l299j3153K09M109j765K785k436Q892J4129
15806A5292p267J245n80j680j147N559j3161N790J5170n897j4605k618L981p87
15792g05R88j1603j6135l368J464m241K111J8283J7086n518j7677J1443K0932
15779A3060j5161j1285J4242M024q508r550K047P395p346q85P931P775o94K527
$$ y = [3555, 8244, 727, -5073, -3662, 12452, 11747, 5079, 4779, -4572, -19009, -22045, -11400, -11195, -6742, -5248, -8366, -2447, -7059, -20688, -38764, -25698, -4774, 1675, -2921, -11896, -10963, -12556, 1644, 1924, -5713, -12753, -10072, -1983, -4175, -8740, -8199, -17550, -27545, -25792, -26417, -15582, 4725, -10852, -20489, -17581, -26460, -23487, -14734, -7596, -8205, 7090, 5939, -2638, -3795, -16868, -16406, -9783, 7780, 14797, 11179, 9039, 5703, 5821, 2522, -10631, -10422, -6313, -8078, -5293, -7729, 1163, 15292, 8025, 9270, 8690, 7010, 5863, 11422, -1739, 4051, 19221, 13324, -1281, -3899, 82, -705, 283, -11320, -27455, -30823, -29359, -33600, -31489, -13206, 3880, -1638, -19315, -7872, 13060, -2101, -13386, 856, 4880, -3628, -13178, -11131, -3736, -11082, -11967, -4036, 3739, 3045, 5572]
15765E572N156m707K720N244m885k03J1013l825j7810n360P652O621m085J156
15751D259j6033L40l546j4184k778L590j724J2344O679o123j229J2792O253p859
15737g219j3133j0546j734J4522L162p11n905q53M341N521j2179o21J7991O544
15723h20J263p147j384Q024l268o088L104k17J2250J0778j0528m804R302j4836
15709d371m475p773k4462n92J6513Q822j842l350n688J5669N904j1677j331J2980
15695e673J8416L078j5693l519n866R345j30j1964K881p665l625M236J2074J691
15681b414K732k668q679J8452N526k041j2580J0168J1739j3329j5501r247q510
15668b6352J490M865J1607M169r156J246Q886J5766J065J230M770k93r719K99
$$ y = [5572, 10728, 6021, 8741, 13985, 9100, 8897, 19910, 16085, -1725, -7085, 567, 7188, 3103, 4259, -11774, -11434, -14980, -29164, -31942, -28352, -30076, -17732, -11053, -17176, -18405, -5613, 640, -7219, -20352, -30898, -32632, -18110, -14948, -15659, -21564, -22417, -18076, -12555, -24734, -25355, -7364, -820, 443, -6704, -8088, -64, -3332, -9420, -6316, -6533, 5717, 16495, 5967, 1163, 10465, -4371, -8846, -16619, -41081, -41673, -25160, -16338, -18180, -21530, -27218, -11549, -5645, -17322, -18653, -5673, 12743, 15821, 128, -3391, -9257, 88, -42, -12006, -9125, -16790, -20415, -16179, -4105, -2414, 318, -2350, -11029, 7423, 12949, 10908, -1672, 8496, 20235, 6906, -8595, -17842, -26352, -24862, -19997, -8390, -4221, -13377, -12131, -3245, 12521, 13586, 14816, 19586, 19293, 9574, 9873]
15654I873j4888j0252o303R818Q041N321J184q426l719K32Q534n08J0349K764
15640A2020p770m523q559O194J8429K467n821j6275L63l79o894j1273l113N55
15626b4579O807J5052J4633o238j5767k0880J2171J8312R362m556m965m06J536
15613D82N192j204l793j9211q39J8222q013p293J4854J1788j213m940o175o779
15599h922j0497J8386R384j3838j0291j0973j722K0212J1698O021r290j6155L94
15586a5593J4829k429l870O47o049j944n767r979J1894J9482K235L592R9p659
15572e12q087J206j5814l869J438o48q183m499P769J599J0184J1770o449K529
15558a1566N97N628J072O964q140j2756J3938j760j0043r641m686J1396K604j2632
$$ y = [9873, -5015, -15267, -21570, -11752, -3711, 1610, 2794, -5632, -9351, -9119, -585, -1093, 9256, 12020, 4250, -273, -8832, -2638, 15791, 18258, 12437, -3838, -3475, -3854, -10748, -22021, -25134, -24579, -17772, -2720, 11913, 5675, -10092, -30972, -18801, -489, 8873, 4317, -648, -1054, 482, 5674, 4470, 677, -18534, -19373, -1151, -9164, -16457, -1603, 10185, 8972, 4032, -2143, -8922, -19419, -1033, 8351, -5487, -15778, -26751, -28473, -8261, 3437, 9458, 168, -15987, -15593, -764, -3193, -7063, -6416, -12465, -14409, -20176, -30155, -18261, 1221, 3456, 7048, 7147, -512, -8599, -7393, -23207, -27076, -25638, -26286, -34469, -38968, -31199, -29600, -19416, -7646, -14095, -11566, -10969, -5341, -4269, 2695, -5445, -18201, -4263, -6023, -16066, -25707, -30393, -18997, -16393, -29025]
15544b9025k769J7499L741m120l043R77M17J2952P65r401Q886J4059J6954O502
15530C4394j532q663j7573k943J1370J921M83j9005j8558M747j948j730N036K497
15516a1504M739k791K723j0366J050k1J0535J1478j556j1558j739j262O523N68
15502c181Q802m984q993p882j1105K858J196k691L294J2830J6030O123o457j4443
15488h603k223l53k87l52M013R077N457m144r68K65j0508m24J6581j4565q174
15473a5208J3504J0697r103j1149r53O394j0451n056J0289k134K880J6754J306
15460G770K35j2496o276j0298j177P862M418m84K218O812n913k16M016p809K243
15445i095J4012r259m194O669l6j934j210J6599m460j6737r930l083P779J2652
$$ y = [-29025, -31794, -14295, -10554, -14674, -17717, -16740, -16323, -3371, -2606, -12007, -3121, 10938, 27892, 34394, 32862, 24199, 6626, 3683, 15053, 16974, 17457, -1548, -20106, -15359, -17307, -19037, -14001, -11504, -6765, -9556, -6833, -17199, -16149, -16170, -5635, 5843, 4287, -7271, -9010, -10272, -3749, -3181, 5621, 637, -8356, -16238, -27343, -24485, -23289, -25980, -22686, -9856, 6174, 12297, 5840, -8603, -10826, -11179, -11466, -11818, -7805, 1272, 6729, 2585, 1617, 1882, -8626, -9050, 7531, -7034, -15208, -1704, 8993, -110, -11259, -12212, -5818, -16269, -21325, -11036, -13170, -10290, 6464, 7770, 8005, -4491, -10767, -21065, -22242, -14380, -9962, -10446, -8228, -1416, -7329, -7545, -3529, -11338, -9095, 4917, -4342, -8536, -1867, -1903, -3837, -5047, 11552, 7092, -9645, -19575, -22658, -14879, -2227]
15431b227R105Q010N208n707j9284p3j469O390O807j1896j4845O599M380P690
15417a312m81l716O465J4436o092j1978q847j062p078m224P322Q909O615k99p175
15402h517J1615J5825J0718j513j7728j2179J1656m016j2200k402M903K987L32
15389e19k183j5524k530j558J0366n842J3386K930j845l034j0699q947M343J9441
15375b215J1943L195m297kp875O563L209K414L011k302k0320k432R828j191k119
15360b590J147l579j735n006J085m623M778j3858q764j69J1980J1142P502o129
15346h819r03J0824o436j2142L607J1394p121R415R231J0264P952j6930j5215
15333d879j981p767j2168O145J5667J1718j3617o142k799q92N36J565L713o803
$$ y = [-2227, 6878, 14888, 20096, 14389, -4895, -4968, -6437, -47, 6760, -5136, -19981, -13382, -9002, -1312, -1793, -5509, 956, 15392, 9300, -2678, -11525, -12587, -19665, -23889, -16567, -7658, -1043, -1342, -8517, 3098, 18923, 29641, 28128, 10400, -1779, 9877, 5861, -6339, -8741, -3838, -851, -519, -2702, -18226, -20756, -22314, -11948, -17790, -4404, -1474, -3319, -6353, -17052, -25999, -21656, -2215, 9728, 12923, 8626, 8624, 749, 7312, 10521, 12935, 15946, 13644, -6676, -9108, 720, -471, -2590, -1443, -5022, -6757, -11763, -10678, -15301, -10523, -24381, -33145, -33314, -21334, -10192, -2690, -8819, -9722, 1102, -5334, -17476, -13869, -2475, -9596, -181, 9050, 19314, 27266, 10336, -4879, -6860, -14627, -26795, -20650, -4983, 6735, -6882, -13024, -15823, -16715, -16179, -14614, -10901, -17704]
15319a7704L54J2262P726k0483Q03J9738l697M423K650j0788n850R877N555p524
15305b658r410n264j928J026Q549O40l282k656J6194l234j7745L053J0392P343
15291A020J561J2296n242m210P352M373O578J0872q356j9122j6553j026J8040
15278G583j933n555j0047J0004k243J691K706k544o793k132J628j147L983L129
15264a670J490P432R619j574J173P790k480O58j934j840M241r979n219J5519j2977
15249A0249k0609q505o725J897O880J2818N809q1l284p037N560R310N018m254
15235G046o829n200O30P416O652k556m934l212m099l731K792j91l69m409k593
15220a3587k3M531o147o583p602k696J4375K0554l937q736p683l697R232K833
$$ y = [-17704, -17350, -5088, 2638, -17845, -17042, 2696, -1001, 3422, 6072, -4716, -10566, -689, 4866, -2658, -12068, -17332, -19260, -18234, -9685, -9045, -12327, -14983, 1211, -2023, -19768, -16715, -6323, 1020, 2581, 14877, 9635, 5425, 12777, 17150, 23728, 34600, 26244, 7122, -9431, -10457, 7583, 5650, 95, -9952, 52, -2191, -500, 2206, -338, -7131, -9263, -7635, -8782, -4799, -1670, -180, 7252, 16871, 15297, 16470, 24260, 21780, 22438, 20504, 18664, 22905, 12926, 7707, 23226, 10249, -10360, -18865, -25590, -23693, -16813, -3995, 1814, 1733, -1551, -8588, -3028, 6282, 11300, 7046, 217, -4983, -4353, 3063, 9715, 7159, 2225, -987, -5086, -8817, -6025, -6216, -6585, -10994, -13587, -13610, -9079, -15226, -21809, -29411, -32107, -17732, 2822, -1115, -9851, -17534, -21231, -11999, -9166]
15206i166L477j159o152p304J4041O338L873M006K420J4302P876o524j3830m447
15192G751J577l530O04j0574j3434J0061q633L930J8286M73o781J0001q368j4536
15178a3173P990J3804N45m483N257L224m801M571j312j775p942N09J5735O841
15164B4990M379r167m177Q164n10j6331M851J1053j1748j2857p476K460J4289
15151G920N067J1196j908l440n87j1625j7295o166j359J1005l230J1720J6996
15138A8294M15l330M145p035K035j479O01J275M985j1859n799n782K438m648L733
15123b011n322J2812m588p156J660o886m166o454k163L617o203J4849O995L817
15109a199j53O04l279n984r978k171J1771J5135J2067M767j1119r379q538P384
$$ y = [-9166, -5689, -6848, -13000, -20304, -6263, 75, 3948, 7954, 10374, 24676, 32552, 26028, 12198, 7751, 9328, 5798, 6402, -4172, -17606, -7545, -16178, -12248, 6038, 6511, -270, 9731, 1363, -13173, -5183, 8621, 9166, 4683, 9940, 13164, 8363, 12934, 11622, 9847, 1905, 2414, 18149, 24990, 29369, 20202, 16025, 24189, 23679, 7348, 12199, 23252, 11504, -1353, -8829, -6369, 7920, 12987, 24183, 22275, 18835, 18248, 6623, -10672, -16838, -18197, -7192, -10422, 1298, 18294, 18709, 15379, 19524, 12489, 14524, 13045, 13646, 14921, 19906, 8047, 2248, -3534, -1096, -5744, -2011, -7333, 5479, 891, -6265, -4605, -11491, -15657, -22111, -24274, -20657, -26860, -12011, -5016, -1199, -1352, -748, -4027, -10011, -19989, -22160, -10389, 4746, 16813, 21580, 10461, 1082, -7456, -72]
15095g2L299q192J3110M613j5900j823J934J1073R425m274M307j0925j4577j536
15081i538j189L159M940J5129J917k067j9621o134M757j08k158J0255J813O91
15067A846n995O693N319l67k833M950J0621N565j1441j0507K123O898j230J320
15053A2962j0522n985O818P81k200l332O726J2206P725p088j2481L338K336R170
15039B0454n327j4308m546l147j1592o574j94O011K215m41N497l744o247n206
15025b7149k015J2614J4417K649j1817n033r20J1503j061O333l102l60O186L46
15011B591R186K876L973k744j5940j5858k537K307N640j989q960K188J8263J949
14997I45j527O104K084J024n475j5982l654J024J073l744n027K052J7468J3857
$$ y = [-72, 3227, -4965, 8145, 12758, -3142, -4965, -3031, 8042, 17467, 13193, 17500, 6575, -8002, -9538, -10727, -7568, -2628, 12501, 14418, 12351, -7270, -13404, -8647, -8755, -10913, -658, 1155, 1846, -4149, 2544, 7863, 7496, 4663, 9613, 20234, 25799, 14358, 3851, 5974, 12872, 11642, 12962, 2440, -3545, 3273, 4054, 1854, -1478, 5248, 17454, 25179, 18091, 5610, 8948, 11284, 20454, 15127, 819, -3727, -6874, -18466, -25040, -25234, -19223, -17008, -17449, -11952, -15696, -21943, -27149, -29164, -16550, -2133, 516, -11301, -16334, -17254, -5751, -6812, -479, -3581, -3941, 2245, 2591, 11777, 14653, 18626, 15882, -58, -15916, -18453, -16146, -10506, -12495, -21455, -19267, -1004, 945, -582, 5522, 7606, 8630, 3155, -12827, -16481, -15457, -14384, -18128, -23155, -21103, -3635, 10222]
14983A0222l524O985o459M61k009q547r34k963l183R068P922J5804Q50q778j5205
14968b90m184j3489J614J4845m595q780o12L578N179j1219m574J4730J5223J0258
14954A7684j2161P88N963m296j5234K2658J6686n048j2933n896p517J876O218
14941H788n979n247j2951M191N784J0411j7112j0910J540L474K0948J2171l948
14928A1160l336n12j2697o723o952M896J089p807P007J6958J76k693l040l283
14914e757P547R140o581k0475N927Q167m675n818j317J0679K810N974l942j3109
14900a1430m713L956J2833o476j2388k215J0337J0571J398P773N967P592j790
14887B1415j0267O170l006q521J957j2495K817p962o29k874K743O981K4302j0201
$$ y = [10222, 6698, 13683, 7224, 7685, 5676, -2871, -3805, -6768, -9951, -883, 7039, 22843, 23693, 14915, -290, -4474, -17963, -16349, -1504, -6099, -14879, -15491, -11913, -6734, -17953, -22527, -7797, 7426, 17684, 5523, 6311, 12274, 7978, -7256, 15402, 32088, 27040, 14107, 8211, 694, 2570, 8788, 2809, -2438, -15389, -11198, -5414, 4997, -12115, -23025, -21485, -18011, 2937, 15108, 11160, 7824, 7312, -5385, -12108, -19060, -14164, -13075, -20882, -13875, 3083, 3259, 566, -2474, -5757, 1790, 10930, 4349, -16126, -10199, -2032, -6707, -12525, -13842, -3163, -353, 5621, 1679, -11430, -16143, -12187, 646, -5830, -18218, -20433, -10096, 475, 1873, 9646, 15613, 23205, 21415, 11148, 17318, 14312, 5791, 7748, -4747, -1930, -9892, -10521, -13395, -10652, -3671, 20631, 10430]
14873A0430m22L806o28L36j247M718l658O121l490l436j562p887q495m961l035
14858a3410Q576J7749J2448l184k1056k098O611m460m937L970o58J328l155P577
14844E301J7038l405j021L277l482m8R06r193m620O466N975l403j2421Q953j3611
14829c288J307K581K700j1911l471R100n08k069K5737J6634J3020j565k1619r327
14815A7321Q013J2647j961N160N312O537J5673J7881J1713J6179K4778L0988M5190
14802B15431M1591L9171M4242N3401O3350Q6926J53819K54324M09356O38703R23235
14791B923549J063924Q90652N31741K35657J36445l1658m14188q03555r18389
14782C614178p83258n63238l76734k48402j93748j54348j05503p9902o9243o5061
$$ y = [10430, 10008, 13814, 13186, 13522, 12275, 16993, 13335, 19456, 15966, 12530, 10968, 3081, -5414, -10375, -13410, -4834, 12915, 25363, 22179, 1123, -975, 5636, 1176, -3761, 209, -449, 879, -2276, 5301, 22339, 18934, 17913, 21190, 17708, 17660, 18566, 9373, 4753, 11219, 17194, 13791, 1370, 10323, -3288, -1981, 600, 3300, -8611, -12082, -2982, -3490, -5559, 20178, 36812, 49832, 48267, 26648, 17321, 25334, 37981, 36020, 41180, 46492, 53029, 68702, 86583, 98296, 114475, 139253, 170241, 215431, 257022, 296193, 340435, 393836, 457186, 544112, 697931, 952255, 1361611, 2000314, 2923549, 3987473, 4878125, 5409866, 5645523, 5781968, 5750310, 5336122, 4532567, 3614178, 2830920, 2267682, 1890948, 1642546, 1448798, 1294450, 1188947, 1109045, 1039802, 974741]
14772I74741n3987n8385o1950n6450n7049l6469k3694k0227k5095j1088k1795
14761E48552k6464j1520k5896j6583k1321q172r026L778q962k0120k180j6582
14749C85504j2000J716j3909r358k482j0430k6743o046J055R012r013j5661p132
14736B84513J898q520j1960M217n659j8891p666M57N463N553r725j7172m456k513
14722B15539j785j0219p429J5112J0239k2237j7756K268P503M216O281j1708k0390
14709A69634j8705m080L635J0566R723j7078j2698k571k60M524L732M714M501
14696A55637q238j0572O304J173j9075j2125k888k736m591R172J5490j134j3493
14683A12924j5397q23M175N524j8490j4234m0K682N76k480k77M09J4661K158Q787
$$ y = [974741, 920754, 862369, 800419, 743969, 686920, 650451, 626757, 606530, 581435, 570347, 548552, 522088, 510568, 484672, 468089, 446768, 438596, 429570, 433348, 424386, 404266, 402086, 385504, 373504, 375220, 361311, 351953, 349471, 339041, 312298, 306252, 307307, 316319, 307306, 291645, 284513, 286411, 277891, 265931, 270148, 264489, 245598, 237932, 238389, 243852, 249405, 239680, 222508, 218052, 215539, 213754, 203535, 196106, 211218, 221457, 199220, 181464, 183732, 191235, 195451, 201732, 190024, 169634, 150929, 146849, 150484, 161050, 170773, 153695, 140997, 138426, 138166, 142690, 146422, 151136, 155637, 147399, 136827, 143131, 144304, 125229, 113104, 110216, 107480, 102889, 112061, 127551, 126417, 112924, 97527, 96704, 100879, 106403, 87913, 73679, 73639, 76321, 76897, 74417, 74140, 74549, 89210, 91368, 100155]
14668A00155l454k7346n192M300l908j5783N031l061K2382K0563n583k5235j1581
14655E1288j0319J617p22J4145L014o747J802K724Q997L898l11j7821q399j6320
14641B6846j339Q26J1729J2934J566j4209j727O51o029M351J1001L855Q162O750
14627F5367o488L181N094j992j0931p292j3733k755q01m223R410Q27j2821m915
14613A7928L352J1940K4501l615k7068M676N013J957l297o565P187L414p321p356
14599B4746L705q380N809N56o392o802p628N586K004o447J6650O89r58K624J3852
14584C9614M591j841L087m182j1468j5625r631l205L113M155j425M971P334K499
14570B1987n3k447M174Q466q905j6073r36R723J7257n812j9613r864J2428K21
$$ y = [100155, 96701, 69355, 64163, 68463, 64555, 48772, 53803, 50742, 73124, 93687, 88104, 62869, 51288, 40969, 42586, 41864, 56009, 59023, 52276, 54078, 56802, 65799, 69697, 69386, 51565, 43166, 26846, 25507, 26333, 38062, 50996, 52562, 38353, 36626, 37277, 31248, 35599, 46600, 50455, 58617, 65367, 58879, 62060, 67154, 65162, 54231, 46939, 33206, 30451, 29650, 25427, 34837, 35664, 22843, 17928, 21280, 33220, 57721, 54106, 27038, 31714, 36727, 38684, 35387, 28822, 36009, 39423, 32102, 24746, 28451, 20071, 25880, 26436, 20044, 13242, 5614, 11200, 13204, 6757, 23407, 24096, 23138, 25762, 39614, 44205, 42364, 45451, 41269, 29801, 14176, 4545, 1340, 4453, 8608, 7183, 12154, 19488, 21987, 21934, 19487, 23661, 32127, 23222, 7149, 6213, 15936, 33193, 27381, 7768, -2096, 10332, 10553]
14556A0553p738L31J3917m41K287l3m890p956M54j840q015r708j6088l424k977
14541c5568J4084R154N252q665j249J1614O331K241Q156L691k395k723q211p902
14527f190m842L376J3151J1624n011P44p464P991M642j387m908l08J667k071L52
14512A1366j162j1615p253J2243R507R67P769k599k3317q423k03N35J7594j602
14498C807J580n680P377L049o493p731j640J317r70q575L035O34J454K696p522
14483a3662M56K0321j57N684k8j249q65j3236j8296J0332o024j0560R333n693
14469b3644L000J1187P026j569r625L779o957j1259J365J0616K804k277O7L213
14455a2274L509N202r022m23J2026j748K87K029q246l41J5019k073O936J4215
$$ y = [10553, 2815, 3146, 17063, 16622, 18909, 18876, 13986, 6030, 6484, 4644, -3371, -13079, -29167, -32591, -35568, -21484, -12330, -7078, -15743, -16992, -5378, 953, 3194, 11350, 15041, 12646, 9923, 1712, -6190, -11032, -7656, 5495, 17119, 12108, 12852, 5388, 13379, 18021, 16634, 11726, 11418, 13085, 11014, 11366, 10204, -1411, -8664, 3579, 13086, 14053, 21822, 19223, -4094, -12517, -12720, -12185, 5409, 3807, 5387, -293, 7084, 10133, 3640, -4091, -5731, -4414, -5384, -13959, -10924, -10290, -8836, -6140, -13662, -13206, 7115, 6958, 12642, 12614, 11365, 10500, -2736, -21032, -10700, -16724, -27284, -17951, -23644, -20644, -9457, -2431, -4000, -13625, -9846, -16803, -28062, -26697, -16081, -13277, -15554, -15487, -12274, -8765, -3563, -12585, -13008, -982, -2730, -2443, -414, -8660, -9001, 6018, 3945, 10881, 25096]
14441B5096j5320k0476j2097O11P159J1414k995J260J1450P387Q410o220j2500
14428C179j1874l664K498m560N071r804J1173J6161l806j1576R881K025N382j971
14414H115J662l553k694j6441j5389J0390O425k2567l087O797J0356P781Q852
14401c353N085l505j2734j070J1888j954Q708o472k0355n760L794J6072J1560
14388A904j7893j0953m03M406J3162K921R332P15q08o147l236j3896k667L069
14374b0494J1423R760q263k082j416Q054q42K954j9227j3561N388M665J2552Q113
14360b976N697J596l574j2289r365O753r60R467Q010l319q611r454j237J113R869
14345i280j638j5214j440n218J2854P157l990m811K55J4465J0288l644k945l564
$$ y = [25096, 9776, -10700, -22797, -22186, -15027, -3613, -6608, -5348, 6102, 13489, 21899, 15679, 3179, -8695, -12359, -9861, -14421, -9350, -19154, -7981, 8180, 4374, -7202, 2679, 4704, 10086, 8115, 9777, 6224, 3530, -12911, -28300, -17910, -11485, -34052, -37139, -30342, -19986, -12205, -3353, 1732, -1773, -14507, -15577, -3689, -5643, 3065, -3407, -23762, -29522, -25728, -9656, 1904, -15989, -26942, -27345, -22939, -9777, -6856, 2476, 3191, 2383, -3764, -7000, -20896, -23563, -20494, -9071, 689, -7574, -9656, -11072, -3018, -3860, -906, -20133, -33694, -28306, -23641, -11089, -2976, 2721, 4317, 743, -11546, -20911, -14158, -15118, -5651, 2359, -960, -9571, -19025, -20262, -19149, -9280, -10918, -26132, -27572, -32790, -19936, -12779, -16769, -21580, -21325, -6860, 3428, -216, -3161, -6725]
14331f725L99m081P451M584Q107r725p421Q807L795r14j7158L131k310q9Q331
14316c818Q525k699r87J416Q086K2100J0298m528J620o34k3713q121q968k290
14302c713J0561K926j0075r39m083k041k677o392J2474R731m550q296N760Q505
14288G191M121k514j1892j0635J8380J3179j0523j0935p947R051l189M142K309
14275G38K423r098m635M202M900K748K348k694O446k718o630L095J1715Q242j611
14260A9471p35n019m579J0260Q768m396j5256l670O53j8911k1447k57J0715J1355
14246a3048M315J0100M204N908k940k597p446J301J3195m955j4760p784J2685
14233a822J9800N378j7822q388p541M640L790n318K466J2470J3221L884l857M474
$$ y = [-6725, -6326, -10407, -2956, 1628, 9735, 10, -7411, 1396, 5191, 4277, -12881, -9750, -12060, -12149, -3818, 4707, 2008, 1021, 2437, 10523, 32623, 42921, 38393, 40013, 39379, 15666, 7545, -1423, -3713, 6848, 9774, -301, -1240, -5323, -7364, -10041, -16433, -3959, 5772, 1222, -7074, -1314, 7191, 11312, 8798, -3094, -13729, 4651, 17830, 7307, -3628, -11575, -2524, -5713, -1571, 738, 3161, -5937, -10572, -6370, -1470, 1278, 3626, 932, 7378, 4660, -1970, 1125, 12840, 21082, 19471, 18736, 13717, 9138, 19398, 28166, 23770, 8514, 4844, 5497, -13414, -34861, -35118, -24403, -13048, -8733, 1367, 5571, 11479, 8539, 5942, -1504, -203, 12992, 8037, -6723, -14507, -1822, 17978, 23356, 5534, -2854, -10395, -5755, -1965, -7283, -4817, 7653, 20874, 24758, 20901, 25375]
14219B5375k77j3625j3014o378k976M75O950J5100l356m910l462j1261Q522Q931
14205F094J2148R573J3187k1757j1983J0218K305j9005l487R219P19n956o290
14192e015R174n255r680j825r36j6587j254L988M389p0o30J1513M941N013n125
14177g359n734k441j469o18o067Q082J8157k701j1554J722j533m029l734j384
14163b0662j431j018J1606n75p673J9729J8408r859m182l423p103J4915r14j4797
14149f979m171J1481j7836j4655o51P749R098L221M510r070J2479J926m372q537
14135a5807J3556l093l604j308j3589j2900m624J9510K0926O216l872j0039K325
14122f303j3360j637n931J316K1164J3780M816p745o225J1076K083n660j2303
$$ y = [25375, 25098, 11473, -1541, -7919, -10895, -10420, -3470, 11630, 8274, 3364, -98, -11359, -2837, 6094, 18242, 27815, 41002, 19245, 7262, 17480, 19785, 780, -2707, 6512, 7231, 1275, -5015, 4159, -1096, -10776, -12601, -13537, -30124, -31378, -27390, -23001, -23071, -23701, -12188, -7247, -2234, -7359, -13093, -15534, -17003, -17621, -23688, -15606, 2551, -150, -11704, -9982, -11515, -15544, -19278, -20662, -22093, -23111, -11505, -12080, -19753, -24, 18384, 8525, 4343, 920, -6183, 8732, 7818, -6979, -11150, 331, -17505, -32160, -32811, -25062, -15964, -12743, -8233, -17303, -4824, -2898, -7270, -15807, -2251, -5344, -8948, -10256, -23845, -36745, -41369, -21859, -933, 5283, 1411, -8628, -6303, -19663, -21300, -27231, -25915, -4751, 9029, 13845, 6100, -125, 10951, 13034, 7374, -4929]
14109d929k1067m891N121L163R696k86j1706k41R660j394R006J2775q922Q763
14095D748p797K596k335k376m671j8025L042Q040j2514j0227M690N651P316l755
14081b5617R730O210M231N115k949N075P337o673k103J971m385j1633j7471P629
14067b3533N194Q915L747M309M072Q587Q091Q970K67j2952k1523r284L557Q407
14053c176m546J444J1781M834o340J0359p054o6k100m239Q187l374p1q968n517
14038h846p607M25L340o069J0542O930q03j8082K078K285J1168p410L799J1177
14024B927k026n8k16l837q598k198N008P76q282R919q750L867N057J084O495J852
14008C020l351k032K312p284L449n056Q832L508l984j0729J7K166J1303n635j0865
$$ y = [-4929, -25996, -30887, -25766, -22603, -12907, -13193, -24899, -25140, -15480, -16874, -7868, 4907, -4015, 4748, -3049, -453, -2788, -5164, -9835, -27860, -24818, -16778, -29292, -39519, -34829, -29178, -21862, -25617, -15887, -9677, -5446, -331, -3280, 1795, 9132, 2459, 356, 2327, -2058, -13691, -31162, -23533, -18339, -9424, -5677, -1368, 2704, 11291, 19382, 28352, 28619, 15667, -5856, -15140, -11583, -3176, -7722, -6278, 5503, 10337, 3997, 14356, 7302, 7236, 5136, 897, 9084, 5710, 5639, -3329, -8846, -16453, -16028, -12688, -18757, -8215, -1285, -2088, -20170, -18092, -15807, -4639, -12049, -8250, 2927, 901, 843, 627, -3210, -11808, -14006, -8998, -8222, -16504, -6585, -15335, -11468, -6411, -5327, 1168, 3020, -331, -2363, -51, -7335, -3886, -8942, -110, 3398, -586, -11315, -11298, -9132, 2171, -3464, -14329]
13993a4329q113J0976J266l113K225q18n013L904J1924J3494M103Q8L765M382
13979B4741j1629R1L413q931l106J794q139p709k377j2622k863M357J1166J7874
13965F060r741j0776k57K924K288j3363M558k569K679J1101k902j0386r387J1617
13951a8154J0020k062j0093L327J1624P145q626M112J1992r934m45j5661j2224
13938b8979J0847P319n679q736R912n895j2036P717K0039J1358m926j4228N89
13925a2698n60k633q290j3495o848O652K423Q1M526N48j141J5868M406O145K173
13910b843k505O258j2979q7L905q115n491K42J1474L246N265l393R985O205n251
13895E916J27q27p954j696L443j072J5078Q540k61r60m483q820j008N222p329
$$ y = [-14329, -22442, -11466, -10200, -13313, -11088, -11906, -16919, -13015, -1091, 12403, 16506, 16594, 20359, 24741, 13112, 13203, 16616, 7685, 4579, 6373, -1766, -9475, -11852, -24474, -27337, -22980, -11814, 6060, -3681, -14457, -14714, -11790, -9502, -22865, -18307, -20876, -18197, -7096, -9998, -20384, -29771, -18154, -8134, -10196, -20289, -16962, -5338, 1807, -6819, -2707, 9285, -649, -1094, -16755, -28979, -18132, -10813, -16492, -25228, -15316, -21211, -33247, -25530, -5491, 5867, 941, -13287, -12698, -13258, -15891, -24181, -37676, -44524, -37872, -35449, -35368, -30842, -30294, -31435, -15567, -11161, -5016, -2843, -5348, 910, -12069, -12156, -8251, -16366, -21857, -21615, -10141, -6895, -1630, -5023, 4962, 11167, 5916, 6043, 5216, -2738, -4434, -991, -2063, 13015, 21555, 21294, 20334, 15851, 7031, 6023, 11245, 3916]
13880C916j0780k1002p836J6142R678M926p67l545P67j5402r698j07J9693J1641
13866b374p37j1867k550R800J885N214r500j6861K7747K9977L198k2492j9072
13853g632k26J5773P885m576j3741j3964j2818L598J1181Q714M664M606j05J74
13839C533M031q058r180L134j634m241p92J782K15Q040l70K706j201N24q554j6342
13823b6407M63M31j0162J2123K217O159J6097k108P74o72k433O898N391O153o756
13808H168j7788j7865L266J228J2448K5718K4501J4492j1907o206r569k2217P210
13795A1479N932l873j0425j655K469o979K125O540K33j3731n265J670M809j3926
13781b0597n626J028K230L466Q313P49N486J6595J3253j2465j4350n02L106r058
$$ y = [3916, -6864, -27866, -35702, -19560, -9882, -4956, -5723, -9268, -8501, -23903, -33601, -33708, -14015, -2374, -3111, -14978, -17528, -7728, -5843, -629, -10129, -26990, 757, 30734, 33932, 11440, -7632, -7858, 7915, 15800, 11224, -2517, -16481, -29299, -25701, -14520, -5806, -1142, 3464, 3359, 3533, 7564, -494, -9674, -6540, -8174, -12415, -13207, -11425, -11210, -3170, -3540, -834, -2035, -1511, -10065, -26407, -25944, -25513, -35675, -23552, -21335, -15176, 921, -1187, -413, -1085, -3518, 3380, 8771, 14924, 8168, -9620, -27485, -24219, -22991, -10543, 15175, 39676, 54168, 42261, 36055, 26486, 4269, 11479, 17411, 13538, 3113, 1458, 3927, -3052, -927, 5613, 5846, -7885, -13150, -11480, -6671, -20597, -26223, -25195, -22965, -19499, -11186, -10437, -4951, 11644, 24897, 12432, -1918, -2420, 686, -8372]
13767h372j2074K818l374R267P111j211p485j0177K807J341L56l816J0131K1214
13753H536m658q761m474j2111m383k991M428J0479R670k404M144K971L384N018
13739H848R12L948n276L084n426j247L735j2686m949n80k301O553K69M888k30
13724d58r530R765%J442l378l06K802N876r569p927M611o857K941J396J894J0896
13708C598N684m934R408o093L301P681q205q252r352J676J1139K839r656n628
13694f794K893K942r037k4402P807J1532J2131J4850J1939m321j8355q166r672
13681a6653Q344J2658p63j2468m048j1749q787N491P793M024l344m099J5747K0165
13667A2311n14j3567J14M823j3574k917R602K807J570M257n0j1170j5828M726
$$ y = [-8372, -20446, -17628, -21002, -11735, -4624, -5835, -13320, -23497, -20690, -19349, -18993, -22809, -12678, 8536, 3878, -4883, -9357, -21468, -25851, -28842, -24414, -13935, -4265, -6669, -2525, 446, 3830, 8848, 9760, 13708, 8432, 11516, 6090, 4843, 8578, -4108, -9057, -9637, -11938, -5385, -5116, -228, -458, -9988, -223, -223, 1219, -2159, -2465, 337, 6213, -3356, -11283, -6672, -13529, -10588, -9192, -7298, 3598, 9282, 4348, 13756, 7663, 10964, 18645, 10440, 2188, -7164, -5488, 5651, 8490, -1166, -6794, -3901, -959, -9996, -34398, -26591, -15059, -2928, 11922, 23861, 19540, 1185, -6981, -16653, -8309, 4349, 3586, -8882, -12930, -24679, -33466, -27975, -20182, -16158, -19502, -23601, -7854, 12311, 11797, -1770, -1656, 3167, -10407, -13324, -3722, -915, 655, 4912, 4862, -6308, -22136, -17410]
13653a7410J8300J7346j5289j8609o144O960J1833p630k133J2822k070j835J654
13640b205M702R655o401j0563Q950K55j2765l567Q715P631j0313J548n297O143
13626c512R807Q75q831j1457l674R907Q069M719l448p824j0260J0465J2031q408
13612a541q272j347O046k046j0911K737J4403k687L547M180k1512j946M162j0428
13598b5615n742K927r138j7528O599J7965J1964J223L254l922m317p36N035J788
13584a6243Q987q54R166K281J13j087j0483p877m964N415M60J769P062N467N439
13569D651j284q936n786p95N236N358o221R260j72M794j897k516O983M132j5857
13554c050K122J072k100j6194m27J3233k980O048j1972o034J5212J3091p346p806
$$ y = [-17410, 890, 18236, 2947, -15662, -21806, -14846, -3013, -10643, -12776, 46, -2024, -3859, -2205, 2497, 12152, 5751, -4812, 4138, 4393, -8372, -11939, -3224, 4407, -5906, -4358, -9655, -3512, 6295, 7170, -1661, -13118, -16792, -6885, 1184, 5903, 2455, -5369, -15629, -5164, 6867, -1541, -9813, -11160, -5114, -7160, -18071, -15334, -931, -3618, -71, 4109, -17403, -19349, -15187, -25615, -31357, -28430, -37568, -55096, -48497, -30532, -18568, -17345, -14091, -18013, -22330, -23066, -18031, -16243, -7256, -8110, 1056, 3337, 3450, 2363, -8120, -15997, -20961, -15546, -15086, -13317, -6255, -788, 4651, 3367, -5569, -11355, -12150, -6914, -1556, -7777, 1483, 1311, 6105, 4208, 1692, 8675, 12807, -3050, -928, 144, -1956, -18150, -18577, -5344, -8324, -2276, -14248, -20282, -5070, 8021, 675, -7131]
13540g131j667j490l915M56P972J2391O150N635j0176L031k261q950m012r500
13526a3467L364J5418L82j1153N426J2814R566m928j3208K973j2992j90Q503o276
13512c768j2270o574l358M959K0929P404j1006j0226Q573j1518p567N161R030
13499a0231J4404L101o530l424q471q057J1602J0360j1965n784o067K716Q421
13486i925P023l557j9664P529J627M627J2840J4312q09j6291j0679n871N880P357
13472e601R759j107j4083o901P211J5020J3973k632j6476j2345r506M141j55l482
13458b2184l212k834L020L737M459r42Q645J764n983j5374m781N397o04m053L434
13443b9511Q527J5988j124k541m699L558J2296l448L60m206N545o908j8425l893
$$ y = [-7131, -8798, -10288, -14203, -13747, -5775, 6616, 12766, 18401, 8225, 11256, 8995, 45, -3967, -13467, -10103, 5315, 5697, -5456, -30, 12784, 22350, 17422, 4214, 7187, -5805, -5995, 2508, -3768, -16038, -22612, -25970, -21011, -82, 7322, -3684, -13910, -5337, -16855, -24422, -19261, -10231, 4173, 7274, 744, -2680, -11151, -19208, -7606, 2754, -9211, -14995, -21062, -18346, -9925, -2902, -6459, -26123, -18594, -16967, -12340, 500, 14812, 14003, -2288, -12967, -18838, -12958, -5601, 4158, 3051, -11032, -17933, -10722, 4298, 18271, 15639, -837, -13182, -22688, -18547, -18702, -22184, -25396, -28230, -25210, -21473, -17014, -17956, -9311, -7547, -13530, -28904, -33685, -28288, -28892, -32945, -29511, -20984, -4996, -6120, -8661, -13360, -9802, 2494, -954, -594, -4800, 745, -6163, -24588, -28481]
13429b8481k067k527o976q247K1251K5625R879k673j6111j5114K724O477K670
13416a3570J1779j692O081P274l533j0122r577N841Q789r21p950j327m584J7905
13402D393m339j9659j501m68k112p50k755K243Q661P206q812J3060L049N138J963
13387E317j7068n2L449N440m204O402K392Q813l688j2021j4614r71J5126Q151
13373B472j561l160j5182N106M413J235L110M743j458j0639o106j5029n658J1762
13359b5952P916P959J4136m24o420l772m131p241O0P915M419l173m92k612m853
13344a6665O242K377Q71P684j3665l071n579N070J6280j534j8077M952j061J1535
13330d641J6886P407k093K615N641j6323q197q426r364K966L570J2690j0939L325
$$ y = [-28481, -30548, -33075, -40051, -48298, -27047, -1422, 8457, 5784, -10327, -25441, -22717, -16240, -13570, -1791, -3483, 2598, 9872, 6339, -3783, -13360, -7519, 1270, 349, -7601, -8928, -13512, 4393, 54, -19605, -21106, -21574, -23686, -24436, -27191, -24948, -16287, -9081, -17893, -4833, -1784, 3354, 5317, -11751, -11803, -8354, -2914, -7118, -716, 1676, 10489, 6801, -5220, -19834, -20805, -5679, 2472, 911, -2249, -17431, -12325, -7912, -6677, -3567, 1176, -282, -10921, -17027, -32056, -37714, -25952, -18036, -10077, 4059, 3635, -2785, -6557, -10688, -17929, -17869, -9954, -5535, -8708, -9200, -11812, -16665, -10423, -8046, -7175, 509, -13156, -16227, -21806, -16736, -456, -1990, -20067, -15115, -16176, -4641, 12245, 19652, 17559, 20174, 25815, 9492, 1295, -7131, -16495, -13529, -9959, 2731, -8208, -4883]
13316d883R13O29L193L667O537N50n249l845j0418n342m936J5664Q967R039j021
13301A3465j0510Q92M616K209P738o281o712n561k428K0071R775o019j1221p906
13287B128j3595p881p779R109J2654J8654R856q182j7876Q780M262M788l582r300
13273B036j2911p106J2931J1085J606Q452r780o870j5335k238J1160J3791j6521
13260i700K157p307J0118J5663l423j3138n683K36J714q860n302J6997J624j1139
13246a6043m218J2067K0578j4738j0366J638J109k64k283j134M205J747N117Q572
13232E987M454o159p349P341o163J4535J931j307k051p926r429k480r014J588
13218a6042O699K65n672m547p403l651Q709J7149n634J270k183r834n217J3706
$$ y = [-4883, -3970, -3341, -148, 3519, 10056, 10606, 5357, 1512, -8906, -14248, -19184, -3520, 5447, 14486, 13465, 2955, 3847, 8463, 10672, 18410, 12129, 5417, -144, -2572, 17499, 27274, 21255, 10034, 2128, -11467, -19348, -27127, -18018, -5364, 13290, 23146, 14964, -2912, 5868, 10130, 14918, 11336, 2036, -10875, -17981, -5050, 6035, 7641, 16093, 6313, -557, -15892, -18130, -6970, 6821, -9700, -7543, -14850, -4732, 10931, 7508, -5630, -11313, -11077, -9363, -18223, -23525, -6528, -4904, -16043, -20261, -8194, 12384, -2354, -12720, -11082, -9973, -10237, -12520, -13654, -9449, -7702, -2585, 5987, 10441, 4282, -3067, 4274, -1889, 12646, 14577, 13270, 11219, 3293, -6136, -8616, -17630, -16042, -9343, -9078, -14750, -19297, -26700, -30351, -21642, -4493, -10127, -8857, -11040, -20874, -26091, -12385]
13204a2385K4446p082j2882j6750R950J6788P771j1568j7018m423M792j061p774
13191b7196J839J0848l853q017M653J6568J0667J1061m475j5707Q751N827P50
13178A1716j5511p234J049l007r886l873R674M775K866O882p154j157J5812o215
13164a263j8172j311K5021J0871j4020j1897q380l628L390N379Q389j1182J987
13151a4816m256j2959r357j1129R580K5752R571M415n187P351J0641J4404l651
13138B0359l8492j1363J5912J0508J1158o218j5702L065N446j834Q142J036p361
13125e344q55K075R855L007j2756o539k027Q060L584N886P037j730n383L579J125
13110I574J884K337K455Q334o687k274j1997j4083n689j0431j284J2370J4354
$$ y = [-12385, 12061, 4979, -7903, -24653, -14703, 2085, 9856, -1712, -18730, -23153, -18361, -19422, -27196, -25357, -14509, -18362, -26379, -21726, -5158, 5509, 16570, 12095, -3612, 5139, 10966, 11716, -3795, -11029, -9980, -12987, -22873, -26746, -17072, -12297, -9431, -2549, -9703, -10860, 4952, -1263, -19435, -20746, 4275, 15146, 1126, -10771, -19151, -22779, -19389, -14010, -5621, -16803, -14816, -19072, -32031, -41388, -52517, -42937, -17185, -7614, -3199, -8386, -1035, 9606, 24010, 20359, -18133, -29496, -13584, -3076, 8082, 1864, -13838, -10773, -5327, -7161, 981, 2017, -5344, -6199, -4124, 5731, 8738, -4018, -10557, -12584, -4524, -940, 4946, 11983, 10253, 4870, 8449, 9574, 11458, 13795, 16250, 24584, 17897, 15623, 3626, -10457, -16146, -26577, -27861, -15491, -1137]
13097a137k174q508N312K667o090M980L146K559j731j348l081K989J815O491j480
13082D410O133r161r667q195Q456P236O659K72J0654j551n545m194n52p997q076
13067a1118p586M240L279R901k388O85j480l842J701J2926O222j0618j237j0016
13053i331m233J748M40m547M437k399l584k606j696j45J6019o194Q552k92n039
13038h870J1760n403M369J58J902M019L645r357q270L483l646l598m106K147R258
13023b509N833M46J963n466j1235J1871k621k0152j1387R021N260K030J0180J0591
13009C825R278j4067j668n081n996N743r009j3448m531K728L132J6935Q535r20
12995d544j1271q568k058J798J8659K1026j0013j3310Q103N555Q526j776j5337
$$ y = [-1137, -3311, -11819, -6507, -3840, -9930, -4950, -1804, 755, -976, -2324, -5405, -2416, -601, 5890, 4410, 10543, 1382, -8285, -16480, -8024, -788, 5871, 6143, 16797, 15246, 9701, 5507, 4955, -3042, -11118, -18704, -14464, -11185, -1284, -3672, -2987, -4467, -8309, -6608, 6318, 12540, 1922, 685, -9331, -13564, -11816, -11376, -15923, -11486, -13885, -17469, -20075, -21771, -21916, -5897, -12091, -3539, -3831, -8870, 2890, -2513, 1856, 2014, 3916, 7935, 11580, 2223, -6047, -2564, -6210, -9808, -13914, -11767, -2509, 3324, 3770, 5733, 267, -10968, 903, -1718, -21870, -33257, -24236, -18976, -16946, -6766, 3825, 13103, -964, -2632, -7713, -13709, -7966, -16975, -30423, -34954, -32226, -29094, -12159, -3624, -4544, -15815, -24383, -26441, -24643, -5984, 15042, 5029, -8281, -178, 5377, 13903, 12127, -3210]
12982c210q054M978O904J012O489p032j2512L811J3663j1189o457O77k498P444
12968e974R674j2108j6654N132J7891N829j3606k1110q892J7387Q961O479N159
12955a832Q322m359q686j5414L922J286J535P275J3117L625j0813j4517N945l806
12941a4400j5246O017J5580j496J9401j091K78r400k791M235l335J4206R98j598
12927A1358m287N85j4443j0267N756p799J3810n244P38j561P070o67n168r192
12913a9311R925K1730l174o005o273K526m790J062j5086n405k612L464j772K2455
12899c266K270o598L091j594r533j4298n645Q993K1950P34q139J623J0066m221
12885d567m865Q858P368k321j7140O034J618j1096O958N220R540j780q059j212
$$ y = [-3210, -11264, -6286, 618, 1630, 8119, 1087, -11425, -7614, 6049, -5140, -11597, -10920, -13418, -5974, 3700, -8408, -25062, -19930, -2039, 3790, -9816, -30926, -39818, -22431, -13470, -6991, -1832, 6490, 2131, -6555, -21969, -18047, -16761, -15226, -7951, 5166, 8791, -2022, -16539, -10594, -14400, -29646, -23629, -8049, -9545, 9856, 8765, 9043, -357, -3148, 1087, -2248, 11958, 12956, 11358, 7071, 7656, -6787, -17054, -11298, -19097, -5287, -10531, -9793, -11354, -4284, -4951, -10119, -19311, -9386, 12344, 9170, 3165, -3108, -582, -5372, -4310, -19396, -24801, -27413, -23949, -25721, -3266, -996, -7594, -4503, -6097, -15630, -29928, -35573, -26580, -4630, -3896, -12035, -10412, -346, -4567, -9432, -574, 6794, 4473, -12667, -6633, -5015, -16111, -9153, -3933, 5607, 3827, -4232, -5444]
12871e444r868j3221J792J0185L910M01J3142m759r017J1215O399M560q013K972
12857D254k755l340K998o673L641J9862M325n87j2215k4159m620K935P788K67
12843h279m197l426n46J3720M066N867J14K325j7041L626l854m865K5032P53j2378
12828I17j0220j4797J520L5452k359J634m322j0065j3965J2931M667j1994j110
12815a1711j1262O893M289O184Q962q972j3164n224N674k936Q447P81q61R20J2698
12800G18J1656L394q470j517j23m393m200k578m838M451K414K094O524J633M252
12785A1017n496K680K685K347p118j7721j2060Q91J3276P788Q768r93k957j1454
12771h347J357j864J0462K848P235m803j7814j4368N637J1382m815n014j0619
$$ y = [-5444, -15312, -28533, -26741, -16556, -12646, -12245, 897, -3862, -12879, -1664, 4735, 9295, 1282, 4254, 1499, -1841, 1157, -5516, -1875, 17987, 22312, 21725, 9510, -14649, -19269, -16334, -8546, -8279, -12476, -15902, -16448, -2728, 1338, 7205, 7319, 9644, -7397, -3771, -7625, -12490, 12542, 13295, 917, -9303, -24100, -22580, 12872, 10513, 12147, 7825, -2240, -16205, -3274, 1393, -10601, -11711, -22973, -16080, -11791, -5607, 3355, -5617, -18781, -24005, -18331, -21267, -12820, -12039, -12900, -11980, 718, 12374, 15768, 7298, 5781, 5658, 1265, -2935, -5513, -10351, -5900, -3486, -1392, 5132, 6765, 11017, 5521, 8201, 10886, 13233, 6115, -11606, -23666, -22775, -9499, -1711, 7057, 6064, 3107, -8347, -6990, -8854, 1608, 4456, 11691, 6888, -10926, -25294, -19657, -8275, -13090, -18104, -28723]
12758b8723j656J9078M49J354l57p860q527k109J1243J106n547J2551N275p550
12744a1273N733J4573j1063q600j2634J1086Q032J3680J981j795j2522j0091j402
12731a4295j7405l302M509R525J107j0821o929J9569P352r056j0689R511O618
12718a4306K220K980j372O974J382K524n136j0444l726Q619N892j61q97k083J144
12703f390L264J360K234N98J2599J8786J5476K880R527r424j6331p372o448K150
12689B2909k764j0230m445Q82M81o448l084l654j3054r76n416J2144J2274p717
12675i098q16j793J2896l760j51P531P52r057n163K619K260l889r900k260J0842
12660h987J4301j4726j2057J248M540K398L324q544K104K027k189p547m141l18
$$ y = [-28723, -30379, -11301, -10852, -9498, -9855, -17715, -26242, -28351, -17108, -16002, -21549, -8998, -3723, -11273, -5540, 9033, -2030, -10630, -23264, -12178, -4146, 9534, 11515, 9720, -2802, -12893, -14295, -31700, -35002, -30493, -20968, -19861, -30682, -37611, -18042, -10690, -19746, -30435, -20924, -14306, -12086, -9106, -10478, -3504, -2122, 402, -4734, -15178, -18904, -10285, -4393, -4554, -5451, -7534, -6390, -3126, -1766, 468, 1066, 13665, 32451, 47927, 50807, 60334, 50910, 34579, 27207, 20759, 22909, 20145, 9915, 5470, 6352, 6833, 385, -2699, -6353, -19407, -20383, -25799, -13655, -1381, -9098, -9914, -11707, 1189, -2571, -2722, 4809, 5561, -3496, -8659, -6040, -3780, -7669, -17569, -19829, -8987, 5314, -9412, -21469, -20221, -15681, -13283, -9959, -18503, -16399, -14372, -16561, -24108, -28249, -28567]
12646b8567J1130J6226J696l69m490r035R635L348q523R118K0178J626j511p247
12632A3215r110o428l270P904q045p033J4548r822j6823Q168n460J1399L491o506
12618a3772L22J0721M331k017j0625J151m473K639o550m997L769O619j615o51
12604a5148l886j3738J0456J9007J1887k181j1056l11l108n021O282j599R760
12591A344J3565L22q947n249J629j1451O994l51l308q271R28m02k415M328l14
12576a1598J8385J2533j4457k0558j0987k266n387J2586M796m326L698J0286j830
12563i125Q5O254O218r646p076J060Q00P020Q574r033Q865n441l491o53N838n000
12547d751j6831N991O238m672O940l102M495K0732L516j0305n825o746K573r835
$$ y = [-28567, -17437, -1211, 485, 116, -4374, -13409, -3774, -426, -8949, 169, 20347, 21973, 20462, 13215, 4105, -2323, -5593, 2311, -5734, -12767, 1781, -8041, -24864, -16696, -22156, -10757, -7266, -13772, -13450, -2729, 1602, -415, -11040, -9889, -14362, -11723, -18273, -23270, -19501, -12882, -14497, -15148, -19034, -32772, -22316, -3309, 8578, 6397, -4659, -4970, -8078, -13099, -6817, -8416, 1344, 14909, 15231, 6284, 1035, 2664, -8787, -1793, -2144, -5452, -13723, -12795, -13197, -15612, -11284, -11598, 6787, 19320, 4863, -15695, -26682, -28948, -34335, -21749, -16953, -21279, -17581, -7295, -9125, -9040, -2786, 3432, -6214, -13290, -12230, -11430, -4410, 4164, -4869, 3996, -1445, -4936, -5589, 249, -4751, -21582, -15591, -9353, -14025, -7085, -10187, -5692, 15040, 18556, 8251, 2426, -4320, -1747, -11582]
12533a1582J2582K2737L257j2332p483K504j2828n389M928M880n019O670P774
12520A0699j6129m290J0109j764N821j6571q539Q059J7787J7232J5499n938k858
12507B9117j0144j0298o672L990m985J666l719j3427O037J9015J3812n934j2395
12494F063p166j16j061j1655M760j819J0873L298J870o505j1061j3500N7J065
12480b4897J64P187J530k96N608j2016m454K0261K2923O031j583l002p23p627
12466I106k1201k999M101J0459O600j479q503j5539K579L881j681Q104J428K035
12452c109J7854J4794j4196k8434k6l161J96P49R025P062n79R640J6293j492j3897
12437A0719m609M360n692J240N449K265j025j1451k368O596K309j30m767J035
$$ y = [-11582, 1000, 23737, 26994, 14662, 7179, 9683, -3145, -8534, -3606, 1274, -3745, 2925, 10699, -5430, -9720, 389, -1375, 4446, -12125, -20664, -12605, 5182, 22414, 37913, 31975, 29117, 18973, 8675, 2003, 5993, 1008, 2674, -1045, -14472, -8435, 10580, 24392, 18458, 6063, -1103, -1219, -2280, -13935, -9175, -10994, -121, 3177, 5047, -1458, -12519, -26019, -25962, -24897, -24733, -17546, -16016, -16312, -10704, -22720, -27174, -6913, 16010, 22041, 20458, 17456, 16733, 9106, -12095, -15094, -10993, -534, 6066, 4587, -3916, -19455, -16876, -12995, -14676, -6572, -5144, -3109, 14745, 29539, 15343, -13091, -13117, -16278, -16082, -15333, -6308, 754, 175, 9815, 26108, 24616, 10719, 6110, 10470, 4778, 6018, 11467, 13732, 12707, 1256, -1112, 5484, 7793, 7663, 2896, 3931]
12423C931p050j768j351P897n194l564J3848J7804r375m363Q024m951n002l176
12409E710N126K076K161m608K424j468M831k849l278j3237j2564J5552J8499K255
12395B0630k2491l683l269K2810N262j2991l41J1254p575j0007O087M941j0175
12382D52O60P971k658p178j0302R1P364p488P886N516j5777o814R472j403j1719
12367b3927j6095J8906J5333r323q195L450J4042R66q355m923L017L585k427q950
12353b2896r43P895J4740J1164j2954o663j111J2755j706L641Q427K672r560j251
12339D210k843J45q870j7160p197K4689K3445J423p893j1046J705j8354l963n834
12325b7543N427J031m436J3635R175j330P96m688j78m100Q469j778n688n267P296
$$ y = [3931, -3119, -4887, -6238, 1659, -3535, -7099, 6749, 24553, 15178, 10815, 18839, 13888, 8886, 5710, 10836, 12912, 15073, 10465, 12889, 11421, 16252, 13403, 10125, -3112, -15676, -124, 18375, 20630, -1861, -5544, -8813, 13997, 19259, 6268, 5927, 17181, 9606, -401, 5686, 10627, 452, 1112, 9083, 6425, -753, -11055, -10964, -3600, -11088, -3202, 2314, -13463, -20277, -10805, -12208, -23927, -40022, -21116, -5783, -15106, -23301, -19851, -5809, -4843, -13198, -18121, -15104, -11519, -13946, -22896, -23839, -15944, -1204, 9960, -2994, -9657, -10768, 1987, 281, 3922, 12349, 15021, 5461, 4210, 1367, 1512, -7358, -24518, -31715, -7026, 16419, 17842, 9949, -1097, 608, -17746, -21709, -27543, -22116, -21085, -25521, -11886, -2711, -4041, -3245, -7933, -8111, -12211, -3742, -5520, -11208, -16475, -9179]
12310i179k359N232k172K85P906O194k895o112k459j0175o987n584p805j62p622
12295d3894Q849Q941L686J082N642k868P697J5328j12j3141j1697L134Q52J1232
12281e269J7606K930l0o471j6833o497P30l976j1310P917J0159J2196P610J910
12267A0672r277r381q898r86j843m043j475J3253P610O37m261p311K376J7812
12253D885J9525q789j97k9634k0446K199o29m793m754P987P671j5283Q016L055
12239c1187J0184K9081N2r192k364M90q956p138P211J7673J1761J1194J0237o833
12225C2213q135j2899q32K280j0829m901l291P918M530m686O003L074j8941r359
12211a7855P459J3901j265l223N30K308M22m83j7919p663k431J1690J389R586
$$ y = [-9179, -11538, -6306, -8478, -8193, -287, 5907, 3012, -3100, -5559, -15734, -22721, -28305, -36110, -36272, -43894, -35045, -26104, -22418, -21336, -15694, -18562, -10865, 4463, 4351, -8790, -20487, -17353, -16501, -5269, 12337, 15267, 15237, 8766, -8067, -14564, -13834, -17810, -29120, -21203, -11044, 1152, 8762, 10672, 1395, -7986, -16884, -17870, -19713, -23756, -25231, -11978, -4368, -3731, -7992, -15303, -12927, 4885, 24410, 15621, 15424, -14210, -34656, -32457, -33086, -37879, -42633, -34646, -26975, -42258, -34242, -31187, -21003, 8078, 8130, -1062, -3426, -2936, -11892, -19030, -11819, 5854, 17615, 28809, 39046, 32213, 24078, 11179, 10347, 12627, 1798, -3103, -6394, 1524, 6054, 1368, 7371, 10445, -8496, -17855, -10396, 3505, 2240, -983, -453, 1855, 2277, 1794, -16125, -23788, -26219, -14529, -13140, -3554]
12197c554l755m2l922K964K2017J678p509p616j29r326P265o719j7220Q17J0337
12182a4714K3788L563N814p874j6435j0491l369N056R05q790N760R876o64j591
12168i166J009N08L356J1918p369n610j248k971R000R328P228J2584n867J977
12154B4677p824j1922P922J082q210K188j6566k171O799j06j0814P800J3572n314
12140A113j1884j418j5r11Q141J0432p955N328J3745j075j2966K019j2036q891
12126a6373l515J455L517J2521n236j3094P068P156Q226J7511N775k3438j2923
12113a1350J4941N004m630k615j5485j7232J175P602R691J0766M525K327n516
12100g97K349p039m773J3089q921N125R467j071J4403m62M181p893k4178n238
$$ y = [-3554, -7309, -7351, -11273, -8309, 13708, 15386, 7877, 261, 132, -9194, -1929, -8648, -25868, -25051, -14714, 9074, 12637, 18451, 10577, -5858, -16349, -19718, -14662, -13757, -22547, -16787, -6911, -7575, -9166, -8157, -7649, -4293, 7625, 256, -5354, -6602, -9573, -573, 8755, 15983, 28567, 22700, 24677, 16853, 4931, 12853, 13935, 5725, 7913, -8653, -10824, -4025, -4131, -14945, -7145, 6427, 1113, -10771, -12189, -12204, -13115, -4974, 5458, -2497, 2831, 16576, 15501, 2535, 4554, -7482, -16373, -19888, -18433, -14916, -2395, -7631, -20725, -13657, -6501, 1725, 19236, 25011, 1573, -11350, 3591, 8595, 3965, 1350, -14135, -31367, -30192, -22590, -12899, -2133, 2392, 4719, -797, 1552, -5487, -10260, 2829, -6092, -967, 8500, 7429, 21832, 21370, 25551, 17658, -6520, -11758]
12086a1758M740j4586k800M804N247O288k723J0527L947J2161q050k852p307P775
12072E413K3553q826m084k975O963P486l468O233O04j8594p163N465P093j7490
12058B10J107N002J3190J1446l914q500o512j5362j1268j451Q515l032K1637M274
12044A5342o670Q698j681o535q973R56j2288M553J5405k485j3307R26L879l149
12030e329P640O270o631J935Q356j2722q954L6K2604J0792j0633j6674j1044r905
12016b4259J7730J7481o149j9625m352K796j407l341l331j2116M654j455P850
12003b5524J5465M869J31N731m356l088P809K704j5221j2142P367J1867p755L063
11989i080p985j693L58n635K990R442J411L650J2020o698m038k765m272K165q276
$$ y = [-11758, -7018, -21604, -24404, -19600, -14353, -8065, -10788, -261, 3686, 15847, 7797, 4945, -2362, 5413, 28966, 20140, 16056, 13081, 20044, 27530, 24062, 30295, 30899, 12305, 5142, 10607, 17700, 210, 1317, 6319, 19509, 30955, 27041, 18541, 12029, -3333, -14601, -16052, -7537, -10569, 11068, 15342, 8672, 17370, 15689, 9154, 181, 1137, -11151, -6598, 8807, 6322, -6985, -6059, -2180, -5329, 2311, 8581, 1950, 3885, 12241, -481, -9435, -9399, 13205, 23997, 13364, -3310, -14354, -24259, -6529, 10952, 4803, -14822, -19174, -16378, -17785, -21126, -24457, -36573, -31919, -33374, -25524, -10059, -5190, -5059, 672, -3684, -6772, 1037, 3741, -11480, -23622, -16255, -4388, -12143, -9080, -17065, -18758, -18400, -24035, -21045, -11603, -10192, -6542, 5478, -1220, -5258, -8023, -12295, -10130, -18406]
11974a8406J899J4005M381N774L736o478j129N939q487o324j618q881M903J3980
11960C294J86L35q277q313m629Q754N814o134m78l700J447J1450n551m159p429
11945a7390p672R007L573l490m892m234N968O03J3559K04K385j713k074q326J63
11930a4329p83O464J5940K00j0973J5760M460M362o226l38P316K959r195j3438
11916B179l57J6854p994j0427K797J6190l268m424J5975k946n490j9053j2639
11903a2603k894o190P253R936J6909P987r222q014p394q383J16O858J3403J1179
11889A8941m112r678j3370j276R297k467j1103m422q493J0826K5756J0020k871
11876A7048O301n382j0768j1753L840J2169J901J4956N028k5068n734m2j972q954
$$ y = [-18406, -16507, -2502, 1879, 7653, 11389, 4911, 3782, 9721, 1234, -5090, -6708, -15589, -10686, 3294, 3480, 3815, -4462, -12775, -17404, -8650, -2836, -8970, -9448, -13148, -11701, -251, -5802, -9961, -17390, -25062, -16055, -12482, -15972, -20864, -25098, -19130, -18527, -4968, -4764, -2379, -4092, -6166, -14492, -14329, -15112, -8648, 7292, 7492, -3481, 12279, 16739, 21101, 14875, 14537, 21853, 24812, 15617, 2179, 1822, 18676, 10682, 255, 3052, 19242, 15974, 11550, 27525, 24579, 19089, 36, -12603, -15497, -21687, -14434, -4498, 12411, 20398, 11176, 3162, -4232, -12615, -12499, -5641, 7762, 18941, 14829, 5151, -8219, -9495, -198, -2665, -13768, -18190, -26683, -15857, 9899, 19919, 17048, 23349, 17967, 7199, -4554, -714, 11455, 13356, 28312, 33340, 8272, 2538, 2496, 524, -8430]
11862h430L933L315J342l622q942J0929k132r740q485K419J3875J2028J3134l529
11848A6095j3146j2028o01N948j320K553K60k042p188k463p606L241q255O528
11834b0024J406K1915j984j8363K213O674M892l744L104k017r097K366o971k702
11820b2332j219j1814K126J914L197P898L329k131J2278n978P586O241R542J8920
11806B9557o050j5962o299J946o930o037J729R09K032m23r61k653j1852p0L596
11791a7468l968p050J5697J7506N052j5729l405R461M618R065J065o951O216R363
11777B3472m572k423K763j7182L176N749q433k176J1954M479q638M418N158l999
11763A3746p935J1834J0j3116L280J113P120N436q833k132K769P906k478n788
$$ y = [-8430, -4497, -1182, 160, -3462, -12404, -1475, -3607, -13347, -21832, -19413, -5538, 6490, 19624, 16095, 2949, -9079, -9680, -3732, -5052, -2499, -2239, -4281, -11469, -13932, -21538, -18297, -26552, -20024, -18618, 3297, 1313, -17050, -14837, -8163, -3271, -7015, -3911, -5928, -15025, -12659, -19630, -22332, -23551, -35365, -33239, -31325, -28128, -20230, -16901, -19032, -6754, -12732, -5146, 1095, 10637, 29557, 23507, 7545, 1246, 3192, -3738, -9775, -8046, -7137, -5105, -5528, -6489, -9142, -20994, -21064, -17468, -21436, -28486, -12789, 4717, 9769, -5960, -9365, 96, 4714, 13779, 14844, 7893, 14109, 23472, 18900, 16477, 19240, 2058, 5234, 10983, 2550, 374, 12328, 16807, 8169, 12587, 17745, 13746, 5811, 17645, 17655, 4539, 7819, 8932, 16052, 21488, 12655, 10523, 13292, 21198, 18720, 12932]
11749A2932m379n141N43l375l940N480K017j269m288j2865r315N043P081N962
11735e514o637L364J7758J9339j4809J57j2917m320r87R926P281O127q295k468
11721H005J5624n057J256p033J767O319n36l234j6042Q005J2030m116n984K802
11707A3806o163j0854K780J0781k4787o677J3745N419J8478N280r897m868j122
11694E921q71o022m311M618J0020n899j4794q456O49q850k78J3537N660L475N721
11679A20P046K887j3098l764J2707J2134j066n427r448R79m784j157R266L368
11665I763j1398P834R87j2410q062Q228Q379j4643j2487p017m049O099J3605J5323
11651A52J8284O29r773j6858k1198m09J0612l54Q710J302N626m272n688Q364J5017
$$ y = [12932, 8553, 3412, 3955, 580, -3360, 2120, 4137, 2868, -1420, -14285, -23600, -18557, -11476, -5514, -12151, -8787, 8971, 28310, 13501, 13658, 741, -3579, -4566, 5360, 12641, 18768, 10473, 8005, 23629, 18572, 19828, 12795, 14562, 20881, 20345, 17111, 1069, 9074, 21104, 16988, 11004, 13806, 7643, -3211, -431, 10350, -14437, -21114, -7369, -1950, 16528, 21808, 11911, 7043, 5921, 5050, -972, -5283, -665, 9355, 3456, -11338, -19794, -19145, -27995, -28273, -14736, -9076, -5601, 120, 7166, 10053, -3045, -6809, 5898, 18032, 16966, 11539, 2091, 3070, -1714, -2871, 6395, 9763, -1635, 6199, 7186, -5224, -13286, -5058, 3321, -11322, -23809, -30826, -34875, -28776, -15171, 152, 18436, 19065, 9292, -7566, -28764, -29173, -18561, -18915, -10205, -8903, -3277, -7549, -13237, -4873, 10144]
11636A0144N571o944j82j6827Q653L156l210O871m538k818o687Q098m743M966
11622A510l8L936r82j71o744M086J0732N327K425q652p691j0466J4219q19J782
11607H454J057L162l886L686K540o863j1582K648m85j0444l152K493L979M72J4357
11592F436O383l904l033p327j372k190N096O487P928N241q018j1965p923M42P362
11577c57n168J3146K8864k080K804j3320q061j9771L094J1037J9814L699p883
11564B5818l685m039j0956k812R388o765P708P075J962j9453q596Q525J2539k74
11550A6435p417j0951j5151o199J23P993J2894J019j014P185R250q108q439k5595
11536b7975m932K761J5807L276N677k741l458L605k932M302K046O369N975l030
$$ y = [10144, 15715, 8771, 8589, -8238, 415, 3571, 361, 7232, 2694, -124, -6811, 1287, -3456, 1510, 1472, 5408, 4426, 4255, -2489, 1597, 12329, 17656, 20081, 11429, 3738, -6728, 7491, 6672, 8454, 9511, 12673, 8787, 12473, 15013, 8150, -3432, -784, -1269, -11713, -14865, -12372, -8393, -7921, 6436, 12819, 8915, 5882, -1445, -2817, -5007, 89, 6576, 14504, 19745, 11727, -238, -8161, -7719, -357, -5525, 7621, 36485, 34405, 37209, 23889, 15828, -3943, -849, 10188, 30002, 33701, 25818, 22133, 18094, 7138, 4326, 13714, 6949, 14657, 21732, 23694, 4241, -4355, 4170, 16709, 16435, 9018, -1933, -17084, -23283, -23160, -15167, -2273, -1254, -2268, 4917, 14167, 6059, -2380, -27975, -32907, -30146, -14339, -11063, -5386, -8127, -11585, -7980, -10912, -6610, -4564, 1805, 7780, 4750]
11522D750R002j776R026p493j996j318J1536M968r681k254R023M251j3455k285
11508A2298k0047j145P154N116p920l789J0919R515Q612J998j0893j6574l347
11495h103J1003q107k967L218L05K627r385j438M310l128J3308J8363L076p686
11481A5396j7308j0245q720N821R862J6269N104K102M633p028j1967j8418l525
11468a8024P691j541l016J8546R268j539k442j5675j204k960n221J6115J7575
11455A7573r524O448K0889o710j0850M959k848r923J466J0306m724K186p774j9903
11441h429j6116O032J0707M487j626j271J344n453J4423J312j0655J7254l128
11428H881l385J0090q918m580j299m256l097L642O443J780J6594J5294K338j6330
$$ y = [4750, 13752, 11976, 21002, 13509, 11513, 10195, 21731, 26699, 17018, 14764, 23787, 28038, 14583, 12298, -7749, -8894, -1740, 3376, -4544, -8333, 2586, 12101, 20713, 22711, 11818, -4756, -8103, 2900, -5207, -8174, -4956, -4651, -2024, -11409, -12847, -8537, -11665, 1643, 20006, 23082, 15396, -1912, -12157, -20877, -15056, -5194, 11075, 16179, 18281, 22914, 15886, 3919, -14499, -18024, -10333, -11874, -14890, 3656, 12924, 11385, 8943, -6732, -7936, -10896, -16117, -2, 17573, 8049, 14497, 35386, 28676, 17826, 22785, 19937, 10014, 11480, 21786, 17062, 19248, 11474, -8429, -24545, -18513, -7806, -3319, -4945, -6216, -4872, -10325, 4098, 5410, -5245, 12009, 8881, 5496, 15586, 6668, 2088, 789, -3467, -6564, -2922, 3521, 5301, 21895, 37189, 39527, 23197]
11414B3197j9762j0022j327j592j2674j3413J3220K7407m424j0171o494j512j1363
11401b8930K0404R346p356p470Q015P962J0312m704M400P396l567j2261m540R157
11387H164j513R96k343l184M007P686p240o597m510L834O79r327R644K143Q268
11372A0707J3845L820l663j1209k135O220N311q541N817J47J445p252J2944J2326
11358C9782j2727j2492M069K2488J3540J3949L2732O0868O9406R7216Q3216J7129
11346D29176o9175q8397p3631m0154j5721o063j5242k3650p923p619o506q978
11334F6117m624n98r956l1q72j7419j946r214J0579O785N87O898O17k300k911
11319D1712k1926l411O882J6173o84n366N6Q640j732L790r354q009l942M93n408
$$ y = [23197, 3435, -6587, -7914, -9506, -22180, -35593, -22373, 5034, 610, -9561, -16055, -17567, -28930, -8526, 820, -6536, -14006, -5991, 1971, 12283, 7579, 11979, 19375, 15808, 3547, -993, 8164, 6651, 7647, 5304, 2120, 6127, 13813, 6573, -24, -4534, -700, -21, -9348, 296, 2439, 10707, 24552, 28372, 24709, 13500, 11365, 17585, 22896, 14355, 20172, 20319, 21764, 14512, 27456, 39782, 27055, 14563, 18632, 41120, 54660, 68609, 101341, 162209, 231615, 328831, 412047, 429176, 360001, 271604, 197973, 157819, 142098, 136035, 120793, 97143, 89220, 81601, 75095, 66117, 61493, 60895, 50939, 50908, 50036, 32617, 30671, 21457, 32036, 38821, 39408, 46306, 46923, 44623, 41712, 19786, 16375, 23257, 39430, 38746, 33380, 33436, 42076, 40344, 44134, 34780, 26771, 22829, 23322, 17914]
11304A7914o811M271Q34k624K881M533j6029j1669Q489J7778N367J44j1932l20
11290A2826K1142K637q86q117J7608Q473p789m833k51j1893j9265n510K3379P362
11276C4883o513M474k072j0263j033J086J668K886N941j582N41q618q98k059l733
11261A4708J3733K3509R143J489Q148j0630n014r446r594q807k029M693o572J0352
11247C3683L117p98l910m55J2039N611M022J130k915k462q172J5460J6202J6625
11233H9177K4363M4341M1517M5241L6182J8695L807m062k5874m6977m6822k2698
11221A56890l1422r258r666k1437j1695o729J0907L605q453k280q247K558p411
11208E7362j0167p527j4642o238Q408L758l051n629J0305J5278n624O9L98N624
$$ y = [17914, 11103, 15374, 16208, 13584, 16465, 20998, 4969, -6700, 1789, 19567, 24934, 25078, 13146, 12826, 33968, 36605, 35719, 27602, 45210, 53683, 45894, 41061, 40810, 28917, 9652, 4142, 27521, 34883, 28370, 32844, 30772, 20509, 19476, 20562, 22230, 25116, 31057, 29475, 30016, 21398, 20500, 18441, 14708, 28441, 51950, 61093, 62582, 70730, 60100, 55086, 45640, 36046, 27239, 25210, 29903, 23331, 33683, 36800, 36002, 32092, 31637, 43676, 49287, 53309, 54439, 51524, 49062, 40890, 56350, 72552, 89177, 113540, 157881, 199398, 244639, 280821, 299516, 303323, 299261, 273387, 226410, 179588, 156890, 125468, 116210, 106544, 85107, 73412, 66683, 77590, 81195, 72742, 70462, 62215, 64773, 57362, 47195, 39668, 25026, 18788, 27196, 30954, 27903, 22274, 32579, 47857, 42233, 42302, 42700, 48324]
11194D8324N959p114M061p505m617Q07j3135n595J1646L44j820J72M029R877k917
11179D2516q626J305J173k575j1072Q798k105m241J1359L462J3117j0086j7472
11166B5553L416p61n988J490O39j23q994K384m53o040p129J6800j06l354O162
11151B3496L351N314J970l213p618P052J3312m654j2025l103n585R499K2215K2329
11137G2340Q012r138j1229N26K748K233j1629j4430N924n111n950J279o263m710
11123B4602l389K915m340J0979j2612j384Q387m091J068P468q000k575p434j3716
11109b122j2919O115Q911J0525p75Q161Q030L89P328m768k0624o675J108L975
11095F659K872J117M235N595l811j4590O108Q327j2013j0519J497J4141M865J3200
$$ y = [48324, 54283, 47169, 51230, 43725, 39108, 39915, 26780, 21185, 32831, 33175, 31355, 31527, 35556, 45433, 42516, 33890, 35195, 36368, 33793, 22721, 31519, 29414, 25173, 36532, 39994, 53111, 43025, 25553, 28969, 28208, 22220, 23710, 24349, 24226, 15232, 17616, 17163, 11123, 3994, 20794, 20688, 17334, 23496, 26847, 32161, 34131, 30918, 23300, 30352, 43664, 39010, 26985, 23882, 18297, 27796, 50011, 72340, 80352, 71214, 59985, 60511, 63259, 65492, 53863, 39433, 45357, 40246, 34296, 35575, 29312, 24602, 21213, 24128, 19788, 30767, 18155, 16771, 25158, 21067, 22135, 29603, 21603, 19028, 11594, -2122, -15041, -8926, -15, 10510, 9735, 17896, 25926, 26315, 33643, 28875, 8251, 1576, 2684, 6659, 9531, 10648, 14883, 20478, 16667, 2077, 8185, 16512, 4499, -6020, -4523, 9618, 14483, 27683]
11081B7683N474l471j7317M940O330L062P005r248j1423o354j1401K173J5402
11068A2855Q586R379o571J1010k037k0449o871L889J5483K5983j1340l568j444
11055C4905k3741k6558K338K2776J2150N360K770m231k864j0235n470j2162o021
11042a0983K270J7312J5984R149r735J2404o280j0158Q257k38R47j4838k658O881
11028A8314P193K3689J4461m220j3644L477k55P724j1402o608R688o838p465j0197
11014B3917r18P97j9152j1655R033o809k489L1047J7464J6233n374j7899o048
11001B8147r39j130q1J787l802m212Q606J0335j3373k2921o22J7680R909j940
10987B7444r873k281K015n158J7006J6049Q125o279l317J0595j6766L443j0744
$$ y = [27683, 33157, 29686, 12369, 17309, 23639, 26701, 33706, 24458, 13035, 6681, -4720, -2547, 12855, 21441, 30820, 24249, 35259, 33222, 12773, 5902, 9791, 25274, 51257, 39917, 36349, 34905, 11164, -15394, -13056, 9720, 21870, 27230, 30000, 25769, 22905, 12670, 7200, -4962, -10983, -8713, 8599, 24583, 33732, 23997, 36401, 30121, 19963, 28220, 27982, 28929, 14091, 11433, 18314, 25507, 49196, 63657, 59437, 45793, 49270, 49015, 56739, 45337, 38729, 48417, 41579, 34114, 23917, 22999, 23796, 4644, -7011, 2022, -4787, -7276, 23771, 41235, 57468, 52094, 34195, 28147, 27208, 26078, 25997, 27784, 23982, 19770, 28376, 38711, 25338, 2417, 1795, 19475, 29384, 27444, 17571, 15290, 17305, 12147, 29153, 45202, 53327, 47048, 43731, 54326, 37560, 41003, 30259]
10974C0259j4301l84P325l550m009P716O973J0488R216o993j1845M780O547M145
10960D6367J3652j223j4358J278J928k5837M08r440N149J8529J0375j798n296
10947C9734k200N627L645K284K085p494K550J2096q163j876J8258J6852k650j4068
10933F6680r829j500M620j536J1551m94j7376n95K097O900p893M246o05n128K677
10918E3815L689N30m769j148L380L364j782N166J4604k380j2371K371Q349K345
10904G5163m036l340k126M507N445Q346n878J0268K4289N107k0969j8489j3695
10891F4592r662L469J356J889j7288r930M395l148J2343M521J28l158O039n777
10877D9769J1923P64k055k762l530l582M928P682j59J3300N935j7557o244O60
$$ y = [30259, 15958, 15574, 22899, 19349, 15340, 23056, 30029, 40517, 49733, 42740, 30895, 35675, 42222, 46367, 60019, 58796, 44438, 45716, 47644, 21807, 22215, 12775, 17924, 36453, 46828, 45030, 39734, 37534, 43161, 46806, 49090, 51175, 43681, 46231, 58327, 50164, 48288, 66546, 83398, 80748, 66680, 56851, 55351, 59971, 58435, 69986, 69492, 52116, 51521, 53618, 60518, 52625, 56871, 56266, 51138, 53815, 57504, 58034, 53265, 52117, 55497, 58861, 57079, 62245, 76849, 74469, 62098, 64469, 72818, 75163, 71127, 67787, 65661, 70168, 75613, 83959, 78081, 88349, 112638, 117745, 96776, 78287, 64592, 54930, 58399, 59755, 61644, 44356, 34426, 38821, 35673, 48016, 52537, 52665, 49507, 55546, 49769, 61692, 62456, 60401, 57639, 54109, 50527, 55455, 63137, 62978, 76278, 82213, 64656, 58412, 59072]
10863E9072j133l882M511J8331P309j0266j9466M747K0461O272j0623r765j0376
10850E5192O45P618k555j1828L116n284n943M99j0485R689Q338J1929l841j9556
10836C7534R588R485o032j3699J440J1771P364L973k758M011L202J7323R231j1735
10822H0698j1912j1011N508N234J0144p113j4651n06K2488J5060j156j4976r080
10809F8727q369m949P051m216J0259J4351r8j0785M079K433o197p758K153L054
10795F9735M151N897J2053p148j4316j2944R24M645l41P388J894J9544o226k7169
10781E8087j66M536q522p275l338L470J0815K1182J6032j3459j9519L680O689
10768G2212M43n039J1050O708J0353R025j3448j4708o41k981L094J0309J4755
$$ y = [59072, 57939, 54057, 58568, 76899, 84208, 73942, 54476, 59223, 79684, 85956, 75333, 65568, 55192, 55837, 63455, 60900, 49072, 52188, 46904, 40961, 41460, 30975, 40664, 49002, 60931, 57090, 37534, 47122, 56607, 50575, 36876, 38316, 50087, 57451, 61424, 58666, 62677, 65879, 83202, 92433, 80698, 68786, 57775, 63283, 68517, 78661, 71548, 56897, 56391, 78879, 93939, 92783, 77807, 68727, 60358, 55409, 62460, 58244, 68503, 82854, 82756, 71971, 76050, 78483, 72286, 64528, 66681, 69735, 73886, 79783, 91836, 84688, 70372, 57428, 58352, 62997, 62656, 70044, 71938, 91482, 85256, 58087, 57921, 62457, 53935, 46660, 43322, 46792, 57607, 78789, 94821, 81362, 61843, 65523, 72212, 72655, 67616, 78666, 85374, 95727, 104752, 91304, 76596, 75955, 72974, 76068, 86377, 101132]
10755A01132m592r35P977j0299o014M814j7590j4062K571q439P521n576j4803
10742D1705J1020K540J812k986j374N343m632r044q883M987J0654j736k419k186
10728D4801N434J329P925J4573Q945J4530K372J8228M650o996p611N116K08L80
10714A13884l07r324q275r272K389n84J0006N556j3228n455J1768m099J40m79
10700I2720P679K177Q217J536j5530K663N528K669j376j5414p509q283l026P42
10686G2793K446r195J0180J6677M899J1388O661J6354J1636K415J9533J6492K0262
10673B02541P765R347J2014K8961K0410K2041K5107M2497P8656J06928J72929
10662G29196K80304M41757N19204L48515J79110K09282Q1886n2134R1561J25707
$$ y = [101132, 96540, 95605, 103582, 93283, 87269, 92083, 74493, 60431, 63002, 54563, 62084, 56508, 41705, 52725, 55265, 57077, 54091, 52717, 58060, 53428, 44384, 35501, 40488, 51142, 49406, 46987, 44801, 50235, 51564, 59489, 74062, 83007, 97537, 99909, 118137, 122787, 115791, 108180, 113296, 113504, 113884, 113577, 104253, 95978, 86706, 89095, 88511, 98517, 104073, 90845, 85390, 97158, 93059, 93199, 92720, 100399, 102576, 110793, 112329, 96799, 99462, 104990, 107659, 106283, 90869, 83360, 75077, 72051, 72793, 75239, 66044, 76224, 92901, 97800, 109188, 115849, 132203, 143839, 146254, 165787, 182279, 202541, 210306, 219653, 231667, 260628, 281038, 303079, 328186, 370683, 449339, 556267, 729196, 1009500, 1451257, 1970461, 2318976, 2498086, 2707368, 2789254, 2737120, 2828681, 2954388]
10652B954388p0783q5278j66132m50743m71738l15769k24216j59402r9692o9538
10642H41097n8090m4796m1839k9998k0095j5220l1309k6738l7835j3699j1231
10631E10247j2567k1190k2081k1313k8285j2198l681L458j0774k1466o68k25j3217
10618C46040j4181J906l866j2715m738o962j4236q694L180P567j1995j9256p613
10605B54437j27n619Q258J5543M270J617j3166q365j5760j04n630p812N667R959
10591B43168j57mK120o852M582m797M925J092j0960o745j0040k522k98l201m568
10576B05743L951J5038M91l933P504N835j088l160q016J576R282N485k580m050
10562B32078l912j9366j7636P521Q537J691M126M579j2766m499J4567k088o746
$$ y = [2954388, 2883605, 2798327, 2632195, 2181452, 1709714, 1393945, 1169729, 1010327, 910635, 841097, 783007, 738211, 696372, 666374, 646279, 631059, 599750, 573012, 535177, 521478, 510247, 497680, 476490, 454409, 433096, 404811, 392613, 388932, 392390, 381616, 360150, 359482, 359257, 346040, 331859, 333765, 329899, 317184, 312446, 305484, 291248, 282554, 285734, 293301, 281306, 262050, 254437, 254310, 248691, 256949, 272492, 276762, 278379, 265213, 256848, 241088, 240984, 235354, 227542, 233209, 243168, 243011, 243007, 245127, 238275, 242857, 238060, 242985, 244077, 233117, 226372, 216332, 213810, 213512, 210311, 205743, 209694, 224732, 225223, 221290, 228794, 234629, 233541, 230381, 222365, 223941, 233223, 238708, 236128, 232078, 228166, 208800, 191164, 198685, 207222, 208913, 213039, 217618, 204852, 200353, 214920, 212832, 206086]
10549B06086m25l232j8236j5932J55k050r132k2068j5625j722j730j5230j0200
10536I0659J0711J1528j0439o314J0828J8504N037j3501L290r684q595N875J5085
10523A22984J4732n542P36J2854L411J2712J3337N728J3646M6090N1662L1392
10511C23742K5089N6077M1916l5253L0277O5735m0511j2001N0691k9749k9847
10500D46166K6987m5521o7916k7212j1196j2797l343r467k1730m915J1024n873
10488B74207j5394j0530L807J4838M733O624N420R859o457j2704k0629q818K165
10475B47121Q881P700J567Q080r239j2526j6336k943P439o049J921k686j7058
10462B15872q686p582P76j5651k6118j5428p230k1489j42P050O653l480l0085
$$ y = [206086, 205661, 202429, 184193, 168261, 168416, 166366, 157234, 135166, 119541, 117819, 116089, 100859, 90659, 101370, 112898, 102459, 96145, 106973, 125477, 130514, 117013, 120303, 110619, 102024, 107899, 122984, 137716, 132174, 132910, 145764, 149175, 161887, 175224, 180952, 194598, 240688, 292350, 323742, 348831, 404908, 446824, 411571, 441848, 507583, 467072, 455071, 505762, 476013, 446166, 473153, 427632, 359716, 332504, 321308, 308511, 305168, 295701, 273971, 269056, 280080, 274207, 258813, 248283, 252090, 266928, 271661, 278285, 283705, 293564, 287107, 274403, 253774, 244956, 247121, 256002, 263702, 265269, 273349, 264110, 251584, 235248, 232305, 239744, 233695, 235616, 232930, 215872, 207186, 199604, 200380, 184729, 158611, 143183, 135953, 114464, 114322, 121372, 128025, 124545, 94460]
10449I4460r467Q556J0080L4704K3520O021L1351L670j2415R38n844K609K9240
10436B17423L8997J4217m188k708j3975P105K5924M318R065R245j446l280N536
10423C06233M473P297J8669J7579J509K662j1421J0220J1729J9231J2485p431
10411C93235q206j3726q737J1088j2922j7161O309m776k4101j2259J1531j1944
10399C08331j3668L7465J3615p866L888Q34J2670K1371L7063L9735K6929K2642
10387E03009L0426M9445M7671J8651K4261l523K3765Q740j9900M634j109j7644
10375F68426l1160m3205p7430l0616l048r938L643K089o470j4764l67N083J9454
10362D81697K3467J6267j1476p959J0945M820J3890K0456J8263L3499J2018l804
$$ y = [94460, 84993, 93549, 103629, 138333, 161853, 167874, 199225, 202895, 190480, 191418, 185574, 188183, 217423, 256420, 270637, 266449, 263741, 249766, 256871, 282795, 287113, 296178, 305423, 303977, 300697, 306233, 310706, 318003, 336672, 354251, 355760, 358422, 347001, 357221, 368950, 388181, 400666, 393235, 385029, 371303, 362566, 373654, 360732, 343571, 349880, 345104, 321003, 308744, 320275, 308331, 294663, 332128, 345743, 337877, 341765, 342599, 355269, 376640, 413703, 453438, 480367, 503009, 533435, 582880, 630551, 649202, 673463, 669940, 693705, 702445, 682545, 687179, 686070, 668426, 637266, 594061, 516631, 486015, 482967, 473029, 476672, 478761, 472291, 457527, 457160, 462243, 481697, 505164, 521431, 509955, 501996, 512941, 517761, 531651, 552107, 570370, 603869, 615887, 612083]
10350F12083L711Q717K1317J8028R383Q451J0254O774K2998J6630K2723M2929
10338H03998L9395J7775K1309M7728L5974M5645M4126M2856L1255M533J926J3972
10326A150492K7638J8745K2007L4639J9752J1187r318k1650J7756M7366M1102
10315A359716M3450M9276O0354P3494O8416P1837P2563O5949P1692N8377N6889
10304B052013M1353L8160N1466M6634N0374P1730O7171M0042M4205P1944R0566
10293B665658J20127J60653J75647J64778K07663K28921K46648K61817K71840
10284D503752L19531L84727M33429N41120O95539R01545J272820J577949J537535
10275A2167947J452108J496184J639406J887196K124770K291595K579254L024340
$$ y = [612083, 615794, 624511, 645828, 663856, 673239, 681690, 691944, 698718, 721716, 738346, 761069, 803998, 843393, 861168, 882477, 930205, 966179, 1011824, 1055950, 1098806, 1130061, 1134594, 1136520, 1150492, 1178130, 1196875, 1218882, 1253521, 1273273, 1284460, 1275142, 1253492, 1271248, 1318614, 1359716, 1403166, 1452442, 1512796, 1586290, 1654706, 1726543, 1799106, 1865055, 1936747, 1995124, 2052013, 2093366, 2131526, 2182992, 2229626, 2280000, 2351730, 2418901, 2458943, 2503148, 2575092, 2665658, 2785785, 2946438, 3122085, 3286863, 3494526, 3723447, 3970095, 4231912, 4503752, 4823283, 5208010, 5641439, 6182559, 6878098, 7779643, 9052463, 10630412, 12167947, 13620055, 15116239, 16755645, 18642841, 20767611, 23059206, 25638460, 28662800]
10267B8662800L459830M384365O080738Q744042J3095548K0643253L3474385N4520869
10259A73065830Q2642866R6355288O2173191K5304054L0818751R347098j1382113
10252D68324965J8614846K4072439j1000584j3751919k7195818p7291311q4009314
10245B97763304n9086407l9681536k8285196k0493719j4839303j1072337q392813
10238A15911993o520176n425723m909872m597595m340293m287183m089948l638076
10230G8103127l402026l459683l280766l126676l005808k635634k286073j989357
10222E4917104j728242j565371j444678j322657j241465j162313j117272j099853
10214D4235253j055811j021695j035983j017216r86514r40842r10578q58969p88991
$$ y = [28662800, 32122630, 36506995, 42587733, 51331775, 64427323, 85070576, 118544961, 173065830, 255708696, 352063984, 414237175, 439541229, 470359980, 479707078, 468324965, 486939811, 511012250, 500011666, 486259747, 459063929, 381772618, 297763304, 238676897, 198995361, 170710165, 150216446, 135377143, 124304806, 115911993, 109391817, 103966094, 99056222, 94458627, 90118334, 85831151, 81741203, 78103127, 74701101, 71241418, 67960652, 64833976, 61828168, 59192534, 56906461, 54917104, 53188862, 51623491, 50178813, 48856156, 47614691, 46452378, 45335106, 44235253, 43179442, 42157747, 41121764, 40104548, 39118034, 38177192, 37266614, 36407645, 35618654]
10205C5618654p62029p35578p00879p02652o72865o23790n94671o20157n96319
10196B9609714n62100n47866n45638n29517n47963n36064n01227m97590n01052
10187B4840697m77292m67113m73362m55799m37421m27195m08553l98286l86430
10178B0909246l91071m01610l76794l61879l50309l24183l02498k98074k97315
10169A7805513k87092k72179k52966k54178k75664k74291k68782k54982k76364
10160A5389015k65115k60513k36142k27856k21716j91310j41432p0971K0006N3029
10150A3846995j08602l57089l46190k22579j00063J0320n2914l24454m23055l53707
10140A1568662l00330k50842k07134j81172j49153j41961j25132j22194j24887
$$ y = [35618654, 34856625, 34121047, 33420168, 32717516, 32044651, 31420861, 30826190, 30206033, 29609714, 29047614, 28499748, 27954110, 27424593, 26876630, 26340566, 25839339, 25341749, 24840697, 24363405, 23896292, 23422930, 22967131, 22529710, 22102515, 21693962, 21295676, 20909246, 20518175, 20116565, 19739771, 19377892, 19027583, 18703400, 18400902, 18102828, 17805513, 17518421, 17246242, 16993276, 16739098, 16463434, 16189143, 15920361, 15665379, 15389015, 15123900, 14863387, 14627245, 14399389, 14177673, 13986363, 13844931, 13773960, 13793966, 13846995, 13738393, 13381304, 13035114, 12812535, 12712472, 12722792, 12669878, 12345424, 11922369, 11568662, 11268332, 11017490, 10810356, 10629184, 10480031, 10338070, 10212938, 10090744, 9965857]
10131I965857j13808j20097j32525j29849j28036j23444j18068j19330j19102
10122H861598j28443j23418j37025r2551j0879O1772J54907L59922O56183J050982
10112A0653048J187948P69896K90386J8405l19505k55219K49770M55080N6924
10103A3106733l16881o67662j166340j207851r10288o42055m57232l63349k94722
10094G080353k50926j93692j68874j31194j34560j60672j45101j31528j23814
10085E639992j37188j22615j07522j23461j10822j02929q1565p0226o9423p0512
10075D643729q0811q4502o4256o2197p5889o0142l1948m3298n4864n8294n5958
10064C971570q8563p1708m8208o8026m9000k5930l2790n8117m5068n3466n5443
$$ y = [9965857, 9852049, 9731952, 9599427, 9469578, 9341542, 9218098, 9100030, 8980700, 8861598, 8733155, 8609737, 8472712, 8380161, 8369282, 8431054, 8585961, 8945883, 9602066, 10653048, 11840996, 12610892, 12901278, 12919683, 12600178, 12344959, 12594729, 13049809, 13106733, 12789852, 12122190, 10955850, 9747999, 8837711, 8195656, 7738424, 7375075, 7080353, 6829427, 6635735, 6466861, 6335667, 6201107, 6040435, 5895334, 5763806, 5639992, 5502804, 5380189, 5272667, 5149206, 5038384, 4935455, 4853890, 4783664, 4714241, 4643729, 4562918, 4478416, 4414160, 4351963, 4276074, 4215932, 4183984, 4140686, 4085822, 4027528, 3971570, 3883007, 3811299, 3763091, 3695065, 3646065, 3620135, 3587345, 3529228, 3484160, 3430694, 3375251]
10053C375251n3372m7111l2250l4826m5947m2312p5411p1838m7291o2017m2696
10042B820180m3833n7118n5080l4158k8626l5954m1304m2762l3544l8106l5606
10031B374089k7766l0849m6400n1332l5620k1723k9776k5917k7214k7765k8999
10020B020728l7280j3255l0327k2622k5428l1458k3911j3880k2244j9056j3599
10009A767668l2085k5156m959j0930m088n752j8320k5664j2802j7336j3359k2329
9997A574888q796j7520l9527k6548k6428k1284k1006l3709k2764N334l872k146
9985A356622q142k0347k2534n64j3579j5547j2297p219n941j6384k0823r871j8682
9972A184692j1899j6909q536j0120j4153k6394k8064k0080k543r519k1406k5015
$$ y = [3375251, 3321879, 3274768, 3242518, 3207692, 3161745, 3119433, 3044022, 2972184, 2924893, 2862876, 2820180, 2776347, 2719229, 2664149, 2629991, 2601365, 2565411, 2524107, 2481345, 2447801, 2409695, 2374089, 2346323, 2315474, 2269074, 2217742, 2182122, 2160399, 2130623, 2104706, 2077492, 2049727, 2020728, 1983448, 1970193, 1939866, 1917244, 1891816, 1860358, 1836447, 1822567, 1800323, 1781267, 1767668, 1735583, 1710427, 1705468, 1694538, 1690450, 1684698, 1666378, 1640714, 1627912, 1610576, 1597217, 1574888, 1566092, 1548572, 1509045, 1482497, 1456069, 1434785, 1413779, 1380070, 1357306, 1362640, 1358768, 1356622, 1348480, 1328133, 1305599, 1305035, 1291456, 1275909, 1263612, 1256393, 1250452, 1234068, 1213245, 1203374, 1184692, 1172793, 1155884, 1147348, 1137228, 1123075, 1096681, 1068617, 1048537, 1045994, 1036475, 1015069, 990054]
9960I90054r102j9955k0180k0135j7786k5567j5702n450j2228j4062j3943r446
9948H06498m581l3826j5444m566N259K638q697j6780Q180j5148j5491k556j2156
9935F93330j2811j3503k139O181k679j4462j7122k607j2033j9032m234r513K012
9922E91388o623n662J2777M721j0950j0634r635j290j886j1628j5206M589j1558
9909E28403j1329m052l616J1142j408N72j0703k6461k2864M629J263r065J8075
9896D74586K188r08k258n748Q153M3j672K230o820L569J7086K5871L5737M65n952
9881E46570n820K0380J9517K8030M5690N7194R3768J46283J74667K10120K65018
9870A601417L50512N43027Q93184J554352K574327L442136K709150k02490k676626
$$ y = [990054, 980952, 960997, 940817, 920682, 902896, 877329, 861627, 856177, 843949, 829887, 815944, 806498, 801917, 768091, 752647, 748081, 753340, 755978, 747281, 730501, 738681, 723533, 708042, 705486, 693330, 680519, 667016, 664877, 671058, 668379, 653917, 636795, 634188, 622155, 603123, 598889, 589376, 591388, 584765, 579103, 591880, 596601, 585651, 575017, 565382, 564092, 562206, 550578, 535372, 539961, 528403, 517074, 513022, 509406, 520548, 519140, 519712, 509009, 482548, 459684, 464313, 465576, 456511, 474586, 476774, 475866, 473608, 467860, 476013, 476056, 474384, 476614, 469794, 473363, 490449, 516320, 552057, 552522, 546570, 540750, 561130, 580647, 608677, 654367, 711561, 805329, 951612, 1126279, 1336399, 1601417, 1951929, 2494956, 3388140, 4942492, 7516819, 10958955, 13668105, 13465615, 10788989]
9861A0788989k809718j931814j251568q48264n81360l88016k19008r3239L6575
9852B702577K25383M11301M10654J92293J09760J00490p0209n7375J06937J0837
9842D142648j35797j22857l48029n52745m59379l24772k26586j56970j23644q4298
9832A607571o2809m9430o1839n6381o4360k8093k2438m3855l7487l1518k5581
9821A123780l1748l1317j6428k5566l7510j6086k0249k8126j3194k7528l2104
9810H43924j5919j7898l1352k4512r19j3718p673j4519k4748j3573k233l261r256
9797F64343q770r086j9274j4863j8750j4731j1557j5563k2929k6019L508J3999
9785E20308L922k989l24N400K8811Q784l481j8995l753l940j5501k0276j3750
$$ y = [10788989, 7979271, 6047457, 4795889, 3947625, 3366265, 2978249, 2759241, 2666002, 2702577, 2927960, 3339261, 3749915, 3942208, 4051968, 4152458, 4082249, 4024874, 4131811, 4142648, 4006851, 3883994, 3535965, 2983220, 2523841, 2199069, 1972483, 1815513, 1691869, 1607571, 1544762, 1495332, 1433493, 1377112, 1312752, 1284659, 1262221, 1218366, 1180879, 1149361, 1123780, 1092032, 1060715, 1044287, 1018721, 981211, 965125, 944876, 916750, 903556, 876028, 843924, 828005, 810107, 778755, 754243, 753324, 739606, 731933, 717414, 692666, 679093, 676860, 673599, 664343, 655573, 646487, 627213, 612350, 593600, 578869, 567312, 551749, 528820, 502801, 506309, 520308, 524230, 521241, 520917, 526317, 555128, 563912, 560431, 541436, 537683, 533743, 518242, 497966, 484216]
9772D84216k8308q578j2187j0105j441P441q270j6371J136j0407j4070j8656J1321
9759C75721q644j1055j8491j3964p73M599M99j1002M62j2623r805J020J552p277
9745B90219n424K086L596L481P670j930j2997j5502k1631l484K930k388j1234
9732B35392J7098K298k3755p156K660j4608r183J0898P057N902m101L027l3j1982
9718B13514j1744q941L045R28j1679j0245Q923J8101P306m196Q964l916q401J095
9704B02754j834k912j0720l743q167L448O911l236j8362N009j1198j028l750j3698
9690A39474L859o809k0246j885Q498N783N46q343j2655K92R64l386j8903O720
9676I3909J8497R349j1110J0198J2956K637j0227r602J914J6728L198k1433m389
$$ y = [484216, 455908, 447330, 435143, 425038, 423597, 431038, 422768, 406397, 407533, 397126, 383056, 364400, 375721, 367077, 356022, 337531, 323567, 322794, 327393, 327892, 316890, 317352, 304729, 294924, 295944, 297496, 290219, 284795, 286881, 290477, 293958, 301628, 299698, 286701, 271199, 249568, 246084, 249014, 246626, 235392, 252490, 254788, 231033, 223877, 226537, 211929, 202746, 213644, 220701, 226603, 222502, 225529, 225496, 213514, 201770, 192829, 195874, 196802, 185123, 174878, 183801, 201902, 209208, 205012, 213976, 210060, 201659, 202754, 200920, 198008, 187288, 183545, 175378, 178826, 185737, 182501, 164139, 169148, 157950, 156922, 153172, 139474, 143333, 136524, 116278, 114393, 122891, 128674, 129220, 120877, 108222, 108514, 109478, 106092, 87189, 93909, 112406, 121755, 110645, 120843, 133799, 136436, 126209, 116607, 118521, 135249, 138447, 117014, 112625]
9663A12625j4480l512k882k122l133j2362N716j333L583n921k110k764M918K455
9649G8678J389r561k870K740N60l42J692K936L701j2978r609m995j245R634J621
9634F1351N97m021l80j2664L128J5831k092l891p251P76K026Q61k622q796N436
9619D8289P302M596L914j2129o397K586K361k151l7r748l272J0202l47O157P313
9604E8639j4695j016m50J3086M71k574N517M842L778p68J589q865j5887J35Q080
9589E1882N555m187M128N326J320n767L447j4099j0761r422J678J887N332L568
9575C9887n064p756J4017K3744O659j3944k251N093j4593p106l991N791J0521
9562E1007k1463Q912J5868M642r132k780K340k0207l577J0934J7080Q88o144n922
$$ y = [112625, 98145, 94633, 91751, 89629, 86496, 74134, 79850, 78517, 82100, 76179, 74069, 71305, 76223, 78678, 80067, 70506, 67636, 70376, 70936, 70594, 72286, 75222, 78923, 65945, 56336, 51341, 50096, 59730, 61351, 61948, 57927, 57547, 44883, 48011, 63842, 61750, 57859, 50608, 51384, 53410, 54271, 51649, 42853, 48289, 55591, 60187, 64101, 51972, 45575, 48161, 50522, 48371, 48334, 38586, 35314, 45516, 45169, 51326, 58639, 43944, 42928, 42478, 55564, 56035, 53461, 58978, 63820, 67598, 66830, 68419, 59554, 43667, 43802, 51882, 57437, 53250, 57378, 62704, 64024, 58257, 61704, 47605, 36844, 27422, 29100, 30987, 36319, 39887, 34823, 27067, 41084, 64828, 71487, 57543, 55292, 60385, 45792, 38686, 34695, 40486, 51007, 29544, 38456, 54324, 58966, 49834, 47054, 49394, 29187, 25610, 36544, 53624, 54512, 48368, 42446]
9548D2446j2500J2801J3220p688j1922j2586J41P38n729R315j0439M672M138L63
9534B6970p01R547K599P663K990Q044K515R74q91j1469k4759o361O049J2432K60
9519C5862o544j207o368n094O544J6318N353m177n47j975r1j619j618n388o076
9504B3373J2M408O396o832q087K88N984P41N94J322J228L47N696j0778j6741n002
9488B949J2153R750P401O6n081N0m63j3743r144J4354K2234j339o360p880r058
9473A5889R504O913o143r20n903n945k438L02J357Q305M920N426J4674M25L140
9458D9506k424K821K2569R761J0806O283J1841J2097k221j5572j1023K362J346
9445I8152j062j0118j629N44j0397K723M493J3765K357M111J2153J3772L5061
$$ y = [42446, 29946, 42747, 55967, 48279, 36357, 23771, 23912, 24650, 18921, 28236, 17797, 22469, 26607, 26970, 26269, 35816, 38415, 46078, 49068, 57112, 59627, 60601, 59710, 48241, 23482, 17121, 23170, 35602, 35862, 29318, 28111, 21743, 16649, 23193, 39511, 44864, 40687, 40140, 38165, 38074, 36455, 34837, 29449, 23373, 23385, 27793, 34189, 27357, 19270, 19558, 25542, 26283, 26877, 28199, 29427, 29774, 35470, 24692, 7951, 2949, 15102, 24852, 32253, 32319, 27238, 27288, 26825, 13082, 3938, 18292, 40526, 39187, 32827, 24947, 15889, 25393, 32306, 26163, 25243, 19340, 13395, 10957, 11259, 12616, 20921, 25841, 31267, 45941, 46366, 49506, 47082, 49903, 72472, 82233, 93039, 99322, 111163, 123260, 121039, 105467, 94444, 96806, 98152, 97090, 86972, 85343, 85887, 75490, 78213, 82706, 96471, 98828, 102939, 115092, 128864, 163925]
9432A63925K7970K5662L0493M1624M5878P2333J32236J66656K31529L80287O57652
9421A976245J158403J873401K301454J098225j404377j998949j344993q47090
9413B812319n70300m04679k84629j95195j53591j24955r4891n6810l5040m6448
9403H45781n3329n1970m4826k8866k3576l6640l3895k3154j2435l842k4631k2871
9391D85746k5420k7840j4704o865j8370j3259P025p230o75k3308k0905o354J0316
9378C38157K351k3196j6564j4485j402m542l093j7214r248L210M121m514j330
9365B52251o91Q995j1087o344j1806j602K0425P824j6155J98r284k2725j5139
9352A94860l499p24j1153j5945L798n398p237N530O536j677O832P479j5072k3094
$$ y = [163925, 191895, 217557, 248050, 289674, 335552, 407885, 540121, 706777, 938306, 1318593, 1976245, 3134648, 5008049, 7309503, 8407728, 7003351, 5004402, 3659409, 2812319, 2242019, 1837340, 1552711, 1357516, 1203925, 1078970, 984079, 927269, 892229, 845781, 792452, 740482, 695656, 666790, 643214, 606574, 572679, 549525, 537090, 533248, 508617, 485746, 460326, 432486, 417782, 410917, 392547, 379288, 386313, 379083, 378408, 355100, 334195, 327841, 338157, 340508, 317312, 300748, 286263, 284861, 280319, 277226, 260012, 250764, 253974, 258095, 253581, 252251, 251560, 260555, 249468, 243124, 231318, 229716, 250141, 257965, 241810, 242008, 232724, 209999, 194860, 191361, 190637, 179484, 163539, 167337, 161939, 154702, 160232, 166768, 165091, 171923, 179402, 164330, 141236]
9338A41236p185M171q660j1594J1797K9059Q005r361r035o55r047Q149j0840j3406
9324A22634r402J945J0653N641k942q117k846m550p101m705m843j2803j111O841
9310H9294J8543Q339j3346R03j0123L102J428M526l051j1460m293P01m334k7214
9296E3015k1502J4437J1911Q539o085O45M663J5720K754k496p676k417j306j6990
9282E3212r638J6355P406K825L530j3883k4480J307J2060J290j1625k632M506
9269D0233P039J550J73K504k195R89J011q55j156q60n051K871n987j1234q479
9254B0553M924J2482r835P944K8570J0209j5712j2030q524k520k62Q580n734l550
9240C5095n512k348m478J3823K78k472j1936r270L410O296J663o746J1170K2843
$$ y = [141236, 134051, 138222, 129562, 117968, 129765, 158824, 166829, 157468, 148433, 147778, 138731, 146880, 136040, 122634, 113232, 115177, 125830, 131471, 128529, 120412, 117566, 113016, 105915, 101210, 96367, 83564, 82453, 89294, 107837, 116176, 102830, 103733, 93610, 96712, 98140, 102666, 99615, 88155, 83862, 84563, 80229, 53015, 31513, 45950, 57861, 66400, 60315, 60960, 65623, 81343, 84097, 81601, 73925, 71508, 70202, 53212, 43574, 59929, 67335, 70160, 73690, 59807, 35327, 36634, 48694, 49984, 38359, 35727, 40233, 47272, 48822, 48995, 51499, 49304, 50293, 51304, 50449, 49293, 48433, 43382, 46253, 40266, 29032, 20553, 25477, 37959, 28124, 36068, 64638, 74847, 59135, 47105, 38581, 36061, 35799, 44379, 38645, 35095, 29583, 27235, 22757, 36580, 36858, 34386, 22450, 13180, 16590, 22886, 24549, 17803, 28973, 51816]
9226E1816m67j3879K780O393j243o746o248J0282o458o586p1j1558m489N372J8999
9211C7897N896j3447L279q276q592J258K5235j56j4522N065P335J4215j647p254
9197D6286j3407j2329j4237n167l370K677L376o167L618k800j8893j132K0306
9184a239L914M861J084J162K16M508J4898J6745L84k932n852j6136L034N23j4255
9169A0915j1955P078P000J0324l299j8966M967J926J512J517j134K663N8P101
9155A9707m608K571L722M205j338j2697K140r70j152L496J1949j778O661m054
9141B7854q720j1503l266J495q785j4569R527j041l437J2356J6015J2030j3397
9128A4559o955Q842p750O124R506p215n847q173L233M890K019O072M12K322q827
$$ y = [51816, 51349, 37470, 40250, 46643, 45400, 38654, 32406, 42688, 36230, 29644, 29573, 18015, 13526, 18898, 37897, 43793, 30346, 33625, 25349, 16757, 18015, 43250, 43094, 28572, 33637, 40972, 55187, 53540, 46286, 32879, 20550, 6313, 1146, -2224, 453, 3829, -2338, 1280, -1520, -20413, -21545, -1239, 2675, 7536, 8620, 9782, 9998, 14506, 29404, 46149, 46533, 43601, 37749, 21613, 24647, 25170, 10915, -1040, 6038, 13038, 23362, 20063, 1097, 6064, 7990, 9502, 11019, 9885, 12548, 12606, 19707, 15099, 17670, 21392, 25597, 24259, 11562, 13702, 12732, 11580, 15076, 27025, 25247, 31908, 27854, 19134, 7631, 4365, 5860, -2925, -17494, -7967, -9008, -12445, -89, 15926, 27956, 14559, 7604, 16446, 8696, 14820, 24326, 17111, 11264, 3091, 6324, 11214, 13233, 19305, 19717, 22039, 13212]
9113A3212R84J1454p429j0775O08j416O652r393k0647j0166K1973Q617j241l727
9099a294m039k061j32j694o033m991K4670J4560l536O737J212j8284j4916m682
9085a4483P293K8204L04k4810m237L186J0504P000J371K321k831K40J459j2625
9071B896M940m64p535l744n503N691M245J9717J936k386O518m391j4583n66R575
9056A6346n657j1320j0697J5431P621P675J7856o02k1207j3658P443J0719J4605
9043C4555m561R75p505l945k965p681j1099o545N054r221n018n829K61P254M282
9028a1988P773J0988L912L933j591J440J2311r9J897L927j5144m016O479o368
9014A3454O568J1154j992o849j1308k6791M537L492R149J915m666J002r856n991
$$ y = [13212, 14196, 25650, 18221, 7446, 8054, 6638, 13290, 3897, -16750, -26916, -4943, 3674, 2433, -1294, -5333, -7394, -7526, -9220, -15253, -20244, 4426, 18986, 15450, 22187, 23399, 5115, -9801, -14483, -7190, 21014, 21318, -3492, -7729, -4543, 5961, 12961, 14332, 16653, 13822, 14062, 15521, 2896, 7836, 7372, -163, -3907, -9410, -3719, 526, 20243, 22179, 19793, 26311, 21920, 7337, 6771, 16346, 10689, -631, -11328, 4103, 11724, 19399, 37255, 36653, 15446, 1788, 9231, 19950, 34555, 29994, 30969, 23464, 19519, 16554, 8873, -2226, -8771, -3717, -12938, -17956, -23785, -23524, -16270, -11988, -4215, 6773, 10685, 14618, 13027, 14467, 26778, 26679, 28576, 32503, 17359, 13343, 19822, 13454, 20022, 31176, 29184, 22335, 11027, -15764, -11227, -7735, 1414, 3329, -1337, -335, -10191, -16182]
9000a6182L835R813O358q161m87K557l570l076J9851L879j1952n527r96J5182
8986A1524Q176J6586P281p529L918o760j7334k0049n300O753K1490K396l632J1299
8972B8819n800r555R199k080J821r401P5o207k652O60J932R88k056N811n166j5033
8956h645J161J3540L333K998j116J5707l98j877k704p528K310J0702j3569r517
8942D397J645j048j2420L634j221n834l752J1805M013N767n777r651Q153Q745
8928H456L279n629o466l383o33j8821j0601J446P798J8396J404j1265r407R73
8914b4453Q315O6R479N284L693K628j2575n069J502Q127J1684K92q265k917j0668
8899a2877k13q5J5320J8552M122j4056l560p523j1952O8J4536K2814j2179p309
$$ y = [-16182, -12347, -2534, 3824, -4337, -4824, -2267, -5837, -8913, 10938, 14817, 2865, -2662, -3658, 11524, 19700, 36286, 43567, 36038, 39956, 33196, 15862, -4187, -9487, -2734, 18756, 21152, 17520, 28819, 23019, 13464, 22663, 20583, 22404, 13003, 13078, 6871, 4219, 4879, 6811, 7799, 5743, 11554, 6388, -8645, -7484, 6056, 9389, 12387, 11271, 26978, 26580, 24703, 21999, 14471, 16781, 27483, 13914, 4397, 6042, 4994, -7426, -3792, -5013, -10847, -14599, -2794, 1219, 6986, 1209, -8442, -289, 8456, 11735, 6106, -360, -3743, -4376, -23197, -33798, -32352, -24554, -6158, -4754, -16019, -25426, -24453, -16138, -16072, -6593, -1309, 2384, 5012, -7563, -12632, -11130, -3003, 8681, 8973, 708, -2209, -12877, -13090, -13175, 2145, 20697, 24819, 10763, 7203, -320, -12272, -12204, 2332, 25146, 12967, 5658]
8885E658j5500M279J2435K057q656N532p616j0682N137R265L854m352J632K2862
8871B5905J2021k8084k2221O058K5598l545Q26k63k744Q261R808j9512l0926R312
8857i506k284K1558J1822Q412P118O820r902j5368j1640k771J247J5003P96p807
8843A3498l334K05j1027N651l283M080r970j183n02J61L629j0063k560K364j837
8828a4171L217J5718j581N428k148k523o383J435J0133q055p616J1359l968J569
8814B414J6806o11q520K392j0220l798K3443J1921k330o668n983m37M613k419
8800B0603k2460j0723O856L539m226J4041Q974j952J806n13M458M994m569q549
8786A2279k265Q057J557L355m853o423r124N270M380j089n773j049j383M621q886
$$ y = [5658, -9842, -5563, 6872, 8929, 273, 5805, -1811, -12493, -7356, 1909, 5763, 1411, 3043, 25905, 37926, 9842, -12379, -6321, 19277, 15732, 16558, 16295, 13551, 21812, 31620, 12108, -18818, -9506, -11790, 9768, 21590, 30002, 37120, 43940, 34038, 18670, 7030, 4259, 5506, 20509, 21305, 13498, 10164, 10369, -658, 4993, 1710, 5790, -4180, -5363, -5865, -5704, -2075, -12138, -14698, -12334, -14171, -10954, 4764, 3183, 8611, 6463, 3940, -2443, -1008, 9125, 1070, -6546, 4813, 845, 2414, 19220, 18609, 10089, 12481, 2261, -1537, 21906, 33827, 31497, 24829, 18846, 18409, 23022, 20603, -1857, -12580, -5724, -2185, -6411, 7630, 16604, 14652, 16458, 15945, 20403, 25397, 20828, 12279, 10014, 18071, 19628, 22983, 18130, 11707, 2583, 7853, 12233, 11144, 5371, 4322, 2939, 7560, -1326]
8771a326N044K891o099n508J2046K746j2027m880j315r242l36K653j050J0638
8757e765M403J286K0543j83j079l700j2292q10J1423L254q52K020O696J4765j6229
8742B3480k3075K851k639J647o828m279P015J063P672O4J0825j150m477K296K0279
8727C4744l396j3000j3927K0235J3894K618q472m223p641j5703j1883J4352J0982
8714A8580R074n296j134R515M805r175k573j1836j6484k380J640K417J797L065
8700B015K967L99J23k943n613P93M206N966k508N594k589K926J050M871j0472
8685F785J842r691O287J3455P72m854j0327k628M487P515r366o514p170P142P362
8670E097O922J162L67m425P326R25R15J907j2510k2267P123J0639k431L200J1115
$$ y = [-1326, 3718, 6609, 510, -4998, 7048, 9794, -2233, -7113, -8428, -17670, -18006, -15353, -16403, -5765, -1362, -76, 20467, 20284, 19205, 15505, 3213, 2403, 13826, 17080, 16228, 18248, 24944, 39709, 23480, 405, 3256, 617, 2264, -4564, -8843, -1828, -765, 6907, 6971, 17796, 16646, 12169, 14465, 34744, 31348, 18348, 4421, 24656, 38550, 41168, 32696, 28473, 20832, 5129, -6754, 7598, 18580, 27654, 22358, 21224, 30739, 35544, 26369, 23796, 11960, -4524, -6904, -5264, -2847, -1050, 2015, 4982, 5381, 5504, 2561, -3052, -2259, 1947, 7913, 5405, 10999, 8410, 11336, 12386, 17257, 6785, 8627, -1064, 5223, 18678, 19450, 14596, 4269, 1641, 6128, 13643, 4277, -2237, -9407, -2265, 5097, 12019, 13181, 13548, 9123, 16449, 17374, 18289, 20196, 7686, -14581, -7458, 3181, 750, 3950, 15065]
8655A5065l768r634o405Q097K0111j1398j7233j944n71K071N21p843K447J333
8641i151P088n07P39P528n852l508K3954P483J168j6j1909j169J136N784P959
8626C0727j92k383j2879j2913l058J3135R736J1575M584R560P751N873p286j8680
8612C5550M296J0615K5649J7643J7296L2599O2355R1583Q1635L698o4072p5731
8600B43116n1552l0128k0258j6508n939j3804k070j741k0523k7486l872J1175
8588F0410j512n333l920o378M131J1473Q817k231j2171j190j080P606L594P97
8574F3013j0754j275j413j675J2705M551J5861J6710N121l739j242P462j5128
8561I0197j9218m665N591j0973j3600l627O05Q012k405p351r499j691N166J801
$$ y = [15065, 11297, 1663, -4742, 3355, 23466, 12068, -5165, -7109, -7680, -5609, -5088, -12931, -10484, -9151, -2063, -2570, -1831, 5697, -155, -3663, 20291, 27774, 28942, 28926, 17017, 15848, 16984, 22768, 30727, 30535, 28152, 15273, 2360, -698, 12437, 22173, 33748, 38332, 47892, 55643, 61516, 54230, 35550, 39846, 50461, 76110, 93753, 111049, 143648, 206003, 297586, 379221, 382919, 318847, 243116, 191564, 161436, 141178, 124670, 118731, 104927, 102857, 101116, 80593, 53107, 49235, 60410, 58898, 53565, 49645, 43267, 47398, 58871, 67688, 65457, 53286, 52096, 51016, 58622, 62216, 63013, 52259, 50984, 49571, 47896, 60601, 65152, 81013, 97723, 102844, 99105, 97863, 105325, 90197, 70979, 66314, 71905, 60932, 47332, 43705, 44310, 52322, 49917, 42566, 33067, 31376, 36542, 38343]
8547C8343j567m457m579P431J0380M712n174j9936p78m121J492M636r159r401
8533G822M119K1012J3605j3474k2972m632p060k927O849o449P143J060n622k549
8519d075o488Q281J3470J3729j2034j2684M647j639n504P031K3479J931J209J4332
8505D5685k460j2281J21j0414j0210R11J1555R762r580n530Q342L35L177m828
8491B4585j4125J892L827P77l251O784n608k72P359m135j1161l211q603j6145
8477b1287j969j310n65Q259J6906O888l64o747k096J0089j210m806L7N756O506
8462A4087n852n64L975r579M626L747J619j0640k454p755L229Q266J0354P110
8448B0169r670Q48K0052Q881r853k373p343m312J691l277l090p125n550j249o127
$$ y = [38343, 36776, 32319, 27740, 35171, 45551, 50263, 45089, 25153, 24375, 20254, 21746, 26382, 17223, 7822, 11941, 32953, 46558, 33084, 10112, 5480, -1580, -4507, 2342, -4107, 3036, 4096, -1526, -4075, -10563, -2282, 11188, 24917, 12883, 199, 4846, 3207, -2297, 4734, 28213, 30144, 31353, 45685, 43225, 30944, 31065, 20651, 10441, 11352, 22907, 32669, 23089, 17559, 25901, 26236, 29413, 24585, 10460, 12352, 16179, 16956, 13705, 20489, 14881, 14609, 21968, 17833, 6672, 3461, -5142, -21287, -23256, -24566, -25131, -16872, 34, 6922, 6558, -189, -2285, 7804, 6594, 1788, 1825, 7581, 14087, 8235, 7671, 11646, 2067, 6693, 10440, 12059, 1419, -1035, -8790, -5561, 2705, 13059, 20169, 10499, 11347, 31399, 40280, 30427, 28054, 20711, 16399, 18090, 14813, 11723, 4598, -952, -2201, -8328]
8433h328L005L841R419J3004j409m841r232j0276P548P892O751J3915j8330k783
8419A0176N039l691o057k562k1841m397J3519J2851J2166L951n212k2628q218
8406a6904J7860Q385L478R18m924o969L690J22n447J368k872O14l425n758j4127
8391b3991r201O976L001L562L221P989J8055P576L995l42n687R405l399J0761
8377C1921k0066j0649N36K809j1917j1979N295O115J4739o736l59J2993J2436
8364B5138K880q055n488k239k4849r881K389R254N034o339J3986N811o161J334
8350B814M611n298K72J0980P959p976j4950n28N204o260R824J9591j457o632k386
8335A5768Q849K699l532j4095n370k888Q733j4018j0984Q230N964m981M888j209
$$ y = [-8328, -5323, -1482, 7937, 20941, 19532, 14691, 5459, -4817, 2731, 10623, 17374, 31289, 12959, 10176, 15215, 11524, 5467, 2905, -18936, -23333, -9814, 3037, 15203, 19154, 13942, -8686, -16904, 956, 9341, 12819, 13737, 8813, 1844, 5534, 5656, 209, 1577, -1295, -681, -4106, -9864, -23991, -33192, -26216, -23215, -19653, -16432, -8443, 9612, 17188, 21183, 20841, 15154, 24559, 21160, 31921, 11855, 1206, 1742, 4551, -7366, -19345, -14050, -7935, 6804, 68, -291, 12702, 25138, 28018, 19963, 14475, 12236, -12613, -22494, -20105, -10851, -5817, -12156, 1830, 7641, 1480, 2814, 7425, 2127, 2399, 13379, 21338, 13362, -1588, -2116, 3088, -3172, 6652, 26243, 24786, 18154, 15768, 24617, 27316, 23784, 9689, 4319, 1431, 10164, -3854, -14838, -6608, -644, -5625, -737, -1946]
8321a946m908Q710j067O029o04j0924N959J0285o879n810N762r02N700J601j2505
8306a499r9P97n19L29R351M276p743O358j0114j1337M853O213j694j978L073Q242
8290H509j067J797r513Q068J1061n965K790J0507l964j977J378M941n23q902p975
8275I165o933j5529O660O299J228R781l407r726l681K882J3596l802K230O360
8261A5123M78K384k745j7479K993Q191L154q194k598N08j6774j5629O524K8169
8247D105Q558k0611r162J097M343p585o598K069P685J222N662J1676J4959o99
8233A6721r646p466M443M198k8583m921R888P090K598m984j0477m671j6L702J1341
8218a0783J1314J5789P81k338k640J279m138O296O133k257p922k537Q553L435
$$ y = [-1946, -6854, 1856, 789, 6818, 6214, -4710, 1249, 11534, 4655, -1155, 4607, 3705, 9405, 11006, -1499, -1598, -801, -1320, -991, 8360, 12636, 4893, 11251, 1137, -10200, -5347, 866, -828, -2806, 267, 8509, 7442, 9239, -274, 7794, 18855, 12890, 15680, 26187, 22223, 20246, 21624, 26565, 26042, 17140, 9165, 2232, -13297, -6637, -338, 890, 10671, 7264, -2462, -6143, -3261, 10335, 6533, 8763, 15123, 15601, 17985, 15240, -2239, 754, 8945, 12099, 3905, 1307, 1815, -14959, -30588, -24064, 4105, 12663, -7948, -17110, -16013, -11670, -19255, -25853, -23784, -16099, -14877, -9215, 2461, 17420, 16721, 7075, -391, 4052, 8250, -20333, -25254, -15366, -8276, -5678, -10662, -21139, -25810, -25826, -22124, -10783, 531, 16320, 17101, 14763, 12123, 13402, 9264, 15560, 21693, 19436, 11514, 8977, 17530, 20965]
8204B0965Q495O347k5285r931K998m199Q25J18R986L00r951o932K214K5025R697
8189C0672j4480l222l654J586q831m38l707m708L208J8500L002p848j6345K542
8175c723J6342K074J339N136n076j4485j0806l69J1180R681K953J563k723m698
8161H388M043M25l953K785l32O828n641k237l714J210P202q784j3864J1137J2655
8146A6148n033j0271j419Q566J1808j3783j1390k924J928R123J7929p330l273
8133A0079j0665p073l461P41J0762j2534j0106J0633R344Q14k493O394J0601j001
8119A2035k790R48j3195j0540j497j512K716N317M111j340k761j821L502M436
8105b391n49M599o871j5160J0800J5405o341R171l918k378N32J4228J5566j3801
$$ y = [20965, 29460, 35807, 10522, 591, 3589, -610, 215, 333, 10319, 10619, 668, -6264, -4050, 20975, 30672, 16192, 12970, 9316, 10902, 2071, 1633, -2074, -6782, -3574, 14926, 17928, 10080, -6265, -3723, 12619, 14693, 16032, 21168, 16092, 1607, -9199, -9568, 1612, 11293, 14246, 15809, 13086, 8388, 12431, 12856, 8903, 11688, 11356, 18184, 12543, 10306, 6592, 7802, 15004, 6220, -7644, 3493, 16148, 11115, 844, -575, 7991, 19799, 6016, -5374, -8298, -6370, 2753, 20682, 13352, 10079, -586, -7659, -11120, -10379, 383, -12151, -22257, -11624, -2280, -1466, -3959, 2435, 13036, 12035, 9245, 10193, -3002, -13542, -15039, -16551, -13835, -8518, -4407, -5747, -8508, -10329, -6827, -2391, -2940, 1659, -5212, -20372, -9572, 5833, -508, 8663, 4745, 2367, 2899, 17127, 32693, 18892]
8091A8892o751r356j084j1058p223K1435K3289R682J229k487p378p011j1782k337
8077H060L032K113J0571j2330J0213Q364q559o740L679p170k655q73r269j8013
8063a9577n06M720J2356O575r660L481L208M118R808M037j2048k164K153P61N396
8048A2658N583q080Q389P524Q6j519R700j1438q245P65Q975R336j1819J573P689
8033C1177R17m422p270k463m47L703o847J188J1938Q255M934L26L105j0136o231
8018B7727o531j1457q923j1973P131O946P80P4L249L720j316q692N759K352r931
8003a085m412j343j0211J0888N349J1791j759m766L998Q232M836R35j5996N236
7989A1693P580n74J2311k903N87Q139r350M554j280O253k199m20O274J926Q81
$$ y = [18892, 12141, 2785, 1701, -9357, -16580, 4855, 28144, 37826, 39055, 36568, 29190, 22179, 10397, 8060, 11092, 13205, 23776, 11446, 21659, 30023, 21464, 14724, 18403, 11233, 8578, 7705, -1564, -19577, -20083, -15363, -3007, 3568, -6092, -2611, 597, 4715, 14523, 18560, 6512, 4348, 6501, 7262, 12658, 18241, 10161, 18550, 26074, 26160, 24641, 34341, 22903, 14658, 15423, 24398, 33734, 21915, 23488, 31177, 32094, 27672, 20402, 17939, 17492, 21195, 14348, 15536, 27474, 35729, 40663, 40989, 44094, 33958, 27727, 21196, 9739, 816, -11157, -4026, 2920, 3700, 3774, 7023, 10743, 9427, 735, 6494, 8846, -1085, -5497, -6840, -17051, -6163, -814, 10977, 9218, 4452, 8450, 16682, 21518, 22453, 6457, 11693, 19273, 18699, 31010, 28107, 28694, 36833, 27483, 32037, 30757, 37010, 34811, 34391, 40665, 42591, 43472]
7974D3472o457o045j38O57K314j780r236k1543j3036J9869J6987o977J79R279
7960B7545j1090N768Q787o808k0215j2332J3042L958r763J144J2895P0j0142k711
7946A48L596J6468M438Q576K808o616j4998o372K221J4537N411n730l551o244
7932A4692p290j0929P206J4292J8520j2229m578j1112L349K141N158M907N635
7919B9762j1588p257J1589k448O968l270j2280j087m640m142P855J687J446j0956
7905A639j604L484P826J0657j349r797O189J0810N71j7347K610R022J3048m974
7891C0785j1953k2204m459J4766o503J1347R319j161Q153o72k683q030J880o977
7877A1608o498Q221O675r467j5731J6627J8882j1356J179M696q641K330J3266
$$ y = [43472, 37015, 30970, 30832, 31489, 33803, 32023, 22787, 1244, -11792, 8077, 25064, 18087, 18266, 27545, 16455, 22223, 31010, 24202, 3987, -8345, 4697, 8655, -1108, 36, 12931, 13001, 2859, 148, 3744, 20212, 24650, 33226, 36034, 29418, 14420, 8048, 10269, 24806, 30217, 24487, 20936, 14692, 7402, -3527, 3679, 17971, 36491, 24262, 19684, 8572, 11921, 14062, 19220, 24127, 29762, 18174, 10917, 22506, 20058, 27026, 23756, 11476, 10389, 5749, 1607, 9462, 11149, 12595, 1639, 35, 3519, 11345, 22002, 20653, 10856, 17045, 27855, 28426, 11079, 13689, 22711, 35759, 30785, 18832, -3372, -7831, 6935, 432, 11779, 21098, 19937, 28090, 27418, 24735, 16705, 18585, 11608, 5110, 13331, 20006, 10539, -5192, 11435, 30317, 18961, 20140, 24836, 16195, 18525, 31791]
7864C1791K962j4409P769O804j33m765r760j0094K863N649R917J590r606l332
7850A7246P007m374n229n84J719R133mL476n385P65r911Q099J0063p740k0820
7835C461n763l391O12p60K385j2917p025K5598K3817q368p389M55m58j2458O055
7820C854J2931p049o799j3836r786N953M862N814K97J1309M495J7732J0604k1627
7806A8754k0411k558J0127k538j3104N356J4939Q676r977p689q371M491o14Q392
7792E473J2468l473k4176N988P465J9385j554r858Q670n29K781J206P300q393
7778B2753j5946l778J439j3020o818K905J4102J0343j0273q273j4055j219J1174
7765a0666J0482o652o060K300J2175q969j80R365j352J113P912P594p252p074
$$ y = [31791, 34753, 20344, 28113, 34917, 34784, 30019, 20259, 10165, 13028, 18677, 28594, 30184, 20578, 17246, 24253, 19879, 14650, 14066, 15785, 24918, 24914, 28390, 23005, 23770, 13859, 21958, 32021, 24281, 3461, -2302, -5693, -5081, -5841, -3456, -16373, -23398, 2200, 26017, 17649, 10260, 10715, 10257, -2201, 3854, 16785, 9736, 2937, -10899, -20685, -14732, -9870, -4056, -3759, 7550, 12045, 29777, 40381, 18754, -1657, -4215, 5912, 3374, -9730, -4374, 10565, 19241, 9264, 1575, -6796, -2305, -2919, 5473, 17941, 14468, -9708, -3720, 3745, 23130, 21576, 11718, 20388, 19859, 22640, 23846, 31146, 22753, 6807, 3029, 4468, -8552, -15370, -12465, 1637, 11980, 1707, -6566, -20621, -21840, -10666, -184, -6836, -12896, -10596, 1579, -7390, -7570, 1795, 443, 1556, 9468, 17062, 9810, 2736]
7751B736m072K534J487M397l637l596m105Q827K612m481l276j0975J6457P884
7737A2792j0808r934k879k215J2903K579r320J6916R275r033j8393r170P642M585
7723e060k015l557p237P773J1927J0820l419J3337J826j2727j1846j374J370l049
7709c231J2859J3324r399l129m76k315N714j673N95j817L659j1683n291J3554
7695A0691j693l136L547o226m941O499q148L336P265p487N313l732j1277O783
7681c206R234K718m534q965j859M65o526J7928J0016j0098k338K681j007j097
7667C412J091Q540L027p242L540k554k0220n308O88k151o617q178L778J7334O280
7652d580J325q871J584J204J2363q460K742L55J111l777J951P761M362j486p605
$$ y = [2736, -1336, 1198, 2685, 7082, 3445, -151, -4256, 4571, 7183, 2702, -574, -11549, 4908, 12792, 1984, -7950, -10829, -13044, -141, 2438, -6882, 10034, 19309, 10276, -8117, -17287, -9645, -5060, -7075, -10632, -17869, -10096, 1831, 12651, 9232, 22569, 24395, 11668, -178, -1552, -182, -3231, 9628, 22952, 13553, 10424, 9948, 7633, 13347, 11674, 12269, 10452, 14111, 2428, -2863, 10691, 8998, 5862, 9409, 3183, -1758, 4741, -3407, -71, 7194, -293, 5020, 1288, -9989, -3206, 6028, 8746, 4212, -4753, -6612, -6147, -12673, 5255, 15271, 5173, 2835, 5516, 4509, 3412, 4503, 13043, 16070, 8828, 12368, 9814, -10406, -15714, -15026, -17177, -23794, -31972, -28194, -10860, -4580, -3255, -12126, -10542, -9338, 3025, -5435, -2693, -2338, -1227, -5004, -3053, 4708, 9070, 7584, -21]
7637b1k922P775l404J0047K4754Q223j3071k5223j9833p567o320J539R73P172
7623a7878K622m419R491J7469j97R661r683o445m096J3488o092k552q551j776
7609h958O943N414J0010n088j349j549p558k536q081J3930N603n687j5043N439
7595h510P771L704l948m663l028l016m530P739L844K580n871j3422O098P704J0963
7580C415k328k093j1547j2947J1427J4197k015n787l327n605M841J178J726N741
7566c124P093N395K424P161k686m718K637J671j0505j842N918n880j1102l725
7552a1283j2072m654j676J4233J696J799J9436O139p704j4101k397J0212j5635
7539a6007j8472N952J0696k150O204L111J1425K097q988M564J330P659Q062o232
$$ y = [-21, -2943, 4832, 1428, 11475, 36229, 44452, 31381, 6158, -13675, -21242, -27562, -26023, -25050, -17878, -15256, -19675, -10184, 7285, 7088, 16749, 7066, 621, -3475, 10013, 3921, 1369, -7182, -8958, -2015, 3399, 13409, 8321, 6972, 5423, -2135, -4671, -12752, 1178, 6781, 1094, -13949, -8510, -739, 2965, -983, -5646, -8674, -11690, -16220, -8481, -4637, -2057, -7928, -21350, -15252, -7548, 3415, 1087, -1006, -12553, -25500, -14073, 124, -1891, -7678, -11005, -16610, -11769, -10591, -8865, -3124, 3969, 9364, 11788, 18949, 16263, 11545, 14182, 15853, 5348, 3506, 9424, 3544, -7558, -11283, -23355, -28009, -29685, -15452, -13756, -11957, 7479, 13618, 5914, -8187, -10584, -372, -16007, -34479, -28527, -17831, -19981, -13777, -10666, 759, 2856, -6132, -1568, -238, 7421, 15483, 9251]
7525I251n724j0382N35J019n901j3025J5980J6290l823r697l400O5R250R163l964
7510E637Q967J700R228P12j5065j3191k1716o798J8057J1861P502j139M286J4670
7496B4711j508p62n567j5155j9099J493L773M970n618m079Q392O634K328l45L678
7481C846L512o784o327q16Q767r546q051Q82m546l806J2215N811J0575L959p062
7466B629M851j0004l749o40q258m469K27R610J5622M372q755j9569m877J580R340
7451a2090K10L4K542l758l269j6090j1206P029P788J855N464L992P110J334q244
7436a7299j6346K368L894J2260J2392L067j451M898k777m312j2736J1759P392
7423C109K486m879r963n629J2360N832N911n852k3714K738N12r13P388J537Q688
$$ y = [9251, 3527, -6855, -6320, -5301, -11202, -24227, -8247, 8043, 4220, -5477, -8877, -8812, 438, 9601, 5637, 14604, 16304, 25532, 26244, 11179, -2012, -23728, -30526, -12469, -608, 6894, 5755, 10041, 24711, 23203, 22441, 16874, 1719, -17380, -15887, -12114, -7144, -12762, -16841, -8449, -1815, 513, 168, 3846, 7358, 574, -5753, -6569, 2198, -7348, -15399, -14517, -19063, -22869, -10654, -4843, 5732, 9691, 2629, 7480, -2524, -6273, -6913, -15171, -19640, -19413, -9803, 5819, 10191, 1436, -18133, -23010, -21430, -12090, -11880, -11846, -9304, -13062, -16331, -32421, -43627, -36598, -28810, -26955, -21491, -17499, -10389, -9055, -17299, -33645, -31277, -27383, -15123, -2731, 336, -1115, 3783, 1006, -3306, -16042, -4283, 3109, 5595, 716, -9247, -14876, -2516, 3316, 9227, 3375, -20339, -17601, -17089, -18002, -10614, -9077, -389]
7408c89m90q919l555K314J5252M468j149j2129r791J458M681N199N004J2515q641
7393E828j1606m477P404L569p772k809l928O695K2640J1765M55j2139Q82o826
7379I681m986p18k547Q433o491l576N668o778K999M876o185r704N227O600K831
7364E330l541j3693J0194M752K040j2816j8923N714R212J8127l10j3840r462K1494
7350D278P293l845j6461K238k619P51k470k456N816j0790k262R210Q961l334J373
7335d317n582l395J2129J887L177K381K88p475j3267l259R808J0135j1289p380
7321a6159K098j561m61P996p243k34L587k023m117L532O273J2978K068k0741l490
7306a7497j946q165j672J0577o825J929Q176j2494N934J2136J0083N719k837j7293
$$ y = [-389, -879, -9798, -13353, -11039, 4213, 8681, 7532, -4597, -14388, -12930, -8249, -3050, 1954, 14469, 5828, -5778, -10255, -2851, 718, -7054, -9863, -13791, -7096, 15544, 27309, 27764, 15625, 16507, 9681, 4695, 3977, 1430, 9863, 3372, -204, 5464, -1314, 1685, 6561, 376, -9328, -4101, 2499, 5330, 1789, -11904, -1710, 3042, 5082, -7734, -26657, -20943, -11731, 6396, 6086, -7754, -17216, 4278, 11571, 7726, -8735, -6497, -9116, -8365, -10835, -13291, -7475, -18265, -20527, -11317, -2356, -5690, -4317, -9899, -13294, -1165, 722, 3899, 6280, 6568, -907, -14174, -17433, -7625, 2510, -8779, -16159, -14061, -15622, -16083, -8087, -15330, -15564, -11977, -14000, -18117, -14585, -8312, 4666, 6734, -14007, -17497, -19443, -27608, -29280, -18703, -25528, -23599, -15423, -27917, -21983, -9847, 236, 5955, 3118, -14175]
7292a4175M067N931p036K431O818q007k704p533P548j275J521Q085K08j609O30
7277e100J162R602j4482m695J820L055k406j0293o314M079Q645J3645O512j953
7263C277m459k339K014n62P20j875M728J6158P599j5662n117j0234n356o251n329
7248b2688k297R525k312Q702N910m276l811J572K214J0213P840J0629p510n198
7234H513J585o612K555Q749p768J254k231L185L739j3796k65J810n564K952L492
7219A598j0107Q335J1761p518p395o081N871m026M507L043k076J240m141R33J5362
7204A1306o193k1302q861m265J4480J3636J3392L93J66l550j4014J098L774l57
7190b97n3j2215N482j889q167j4343J361J0695R582K009m072K162M208M897j22
$$ y = [-14175, -10108, -4177, -11213, -8782, -1964, -9971, -12675, -20208, -12660, -13935, -12414, -4329, -4121, -5730, -5100, -3938, 5664, -8818, -13513, -11693, -8638, -11044, -21337, -27651, -23572, -14927, -1282, 5230, 3277, -1182, -3521, -1507, -2069, -1349, -3224, 1504, 17662, 25261, 9599, 4482, -5752, -11108, -17359, -22688, -24985, -15460, -17772, -9070, -3160, -7436, -11247, -9675, -7461, 2752, 10592, 21221, 13711, 8513, 10098, 3486, 6041, 14790, 7022, 8276, 6045, 9230, 12969, -827, -1092, 718, -4846, -1894, 1598, -8509, -174, 11587, 4069, -3326, -9407, -3536, -7562, -3055, -12, -2088, -848, -4989, -4056, 11306, 5113, -16189, -25050, -29315, -14835, -1199, 12193, 12586, 12752, 9202, -4812, -3714, 60, -297, -350, -12565, -7083, -8972, -17139, -31482, -30121, -19426, -9844, -7835, -11907, -9745, -5537, -640, -762]
7175g62m720m406L001j2228k159P567P170K476k164K793J1702p758j4018o566
7161b0072J2090j535j2267J3255Q128r672J7164P992p611R040m249r893K87r563
7147f906k088k974k699L678N106q513P721K477R460o670j9696O596l046j1432
7133b8986J3665J3068n111q323R540o26J5905J0356p916j4220P283j404j0643
7120g412O287Q300O445r902m65j2512m562m277m341M293Q756J1064j1703j6595
7106b6624k733L962J474J0288N938o38N985P955j783K168j7344r512P274r850
7092b3440P255J3363Q587J0652N299L322J141p006n884l502L233k2263N20P332
7078a391J6853k710j5783n584j2168p280N118Q453R61o660K560J9265J8925k553
$$ y = [-762, -5482, -9888, -6887, -19115, -21274, -13707, -6537, -4061, -6225, -3432, 8270, 512, -13506, -20072, -7982, -9517, -21784, -8529, -401, -10073, 7091, 15083, 7472, 16512, 12263, 2370, 2657, -6906, -8994, -11968, -14667, -10989, -5883, -14396, -6675, -4198, 5262, -1408, -21104, -14508, -17554, -28986, -15321, -2253, -7364, -15687, -6147, -6773, 9132, 19488, 11572, -2648, 4635, 3231, -7412, -1125, 7175, 13620, 3718, 3253, -9259, -13821, -18098, -22439, -18146, -9390, 1674, -10029, -26624, -29357, -25395, -23921, -13633, -7695, -8333, -2348, 5607, 3824, 5992, -11352, -20864, -13590, -23440, -16185, -2822, 5765, 16417, 21716, 25038, 26179, 19173, 13289, 9787, 13020, -9243, -8723, -1391, 15462, 12752, -3031, -8615, -20783, -28063, -22945, -14492, -13531, -20191, -17631, 1634, 20559, 18006]
7064A8006n502j0665l804M978j625J297K0012J0693j1029L448j5391p197P564
7051A0785j5102p367R248j2395n749L703R111P897r280l595L553r206L609J7031
7037B243J4034p399p044M85J1748r830j9144n193P811M844K209k162j650k220
7023a1268m500J2153L349n22R702M693n146N069q30m500j41qq196j1323M796l607
7007a0279J447N853L338j1660j3431q206j830J6138m082R872K6114R45o991j3367
6993f139j0494O38k941P06J1854J9475Q372M006n549m604k027J4355m64q436J597
6978B0349q486j2327m194M958M574j1719k57J6026k697j6952J0289K0469K547
6965B2580k4574j3912o4m132P147M969J267J560J285j2400q324J1367J4142M235
$$ y = [18006, 12504, 1839, -1965, 3013, 1388, 2685, 22697, 33390, 22361, 25809, 10418, 3221, 10785, -4317, -11684, -2436, -14831, -20580, -16877, -7766, 131, -9149, -12744, -9191, -18397, -14788, 2243, 16277, 8878, 1834, 2319, 14067, 4237, -14907, -20100, -12289, -7445, -5236, -7398, -9048, -11268, -15768, -3615, -266, -788, 8914, 13607, 8461, 13530, 12700, 8200, 8059, 8051, -145, -11468, -6672, -10279, -8832, -2979, 359, -11301, -24732, -32938, -34768, -18630, -22712, -12840, 13274, 14219, 7228, -6139, -16633, -15995, -18936, -18230, -6376, 13099, 21471, 25477, 19928, 15324, 13297, 27652, 27188, 18752, 20349, 11863, -464, -4658, 300, 4874, -6845, -7102, 8924, 6227, -10725, -436, 20033, 22580, -1994, -15906, -15970, -20102, -12955, -7986, -6719, -5159, -3874, -16274, -24598, -13231, 911, 5146]
6951E146n637q285q262l814J3704N853j982n990J533m753j1612N86M256N902j254
6936a4609p103M306J9332J1738r740k685m943M94K461p736R57L092O585j7111
6922a4962O730J2528K0780J5836k0187j1739N516J3468r442o909k0498j0297Q339
6909a0837M743P306L523j718j4568l836J5636n8j753L494O00j582k696L19m184
6894e611Q557l197o540P634K076j4793l496J6236j083n182M627L15o053j4814
6880b1324m800K1601N902r735j5180j109K880q14O771q77K796J8330J2269P423
6866B4133J187o109j1774P980R865j1731k3802r301J107P443j2298m057L394J7741
6852f222J1925m048J089r321N028O180m313j2064j4752L255k112k574J6754K0031
$$ y = [5146, -491, -8776, -17038, -20852, -7148, -1295, -3277, -9267, -7734, -12487, -24099, -23513, -19257, -13355, -14609, -21712, -17406, 1926, 13664, 3924, 1239, -3704, -3210, -749, -8485, -7528, -4436, 2149, -14962, -8232, 4296, 25076, 40912, 20725, 8986, 14502, 27970, 18528, 11619, -8879, -19176, -10837, -6094, 1212, 4735, 3017, -11551, -15387, 249, 191, -1562, 1932, 2532, 950, -1746, -1427, -5611, 2946, -251, -6791, 843, 2919, -11874, -15370, 866, -217, -5399, -772, -457, -6510, -21324, -26124, -4523, 1379, -8356, -23536, -24645, -21765, -22579, -15808, -16685, -13889, 4441, 16710, 24133, 25320, 19211, 7437, 15417, 25282, 13551, -10251, -19552, -18445, -11002, -23300, -27357, -23963, -6222, 5703, 1655, 2744, -6577, -1549, 4631, 318, -11746, -26498, -23243, -25355, -27929, -11175, 8856]
6838H856m047m091j0415K905n31L920q266L269J4469l910n275j3348l811J784
6824a8491j43J2108j422p691l031J9497K3763L520n662p00n933j89M433n320j5492
6809g53j7977J691J2356J2421o537p348R372p140L386L428N305p947j0919j6142
6795b6804j2262J2350J3319J8680R222P423p070o422K496o578j52p943o233K1465
6781A1491K1689l485p952p080p551m566m779n445n859l507R563O51o595l305J8053
6766A323J6747M168o356K666J1128k291j219r688o898J2745l380m887J429q786
6752F701j9838O242M004K85N544p440K069L67R53j941q182j1693q04J0474J7152
6737C893M515m112m904K1184J0141j9874k1931k0367J299M941J3194J8123J2602
$$ y = [8856, 4809, 718, -9697, -6792, -7323, -3403, -11669, -8400, 6069, 2159, -3116, -16464, -20275, -18491, -18634, -6526, -7948, -15639, -18670, 827, 24590, 28110, 22448, 21748, 15815, 15626, 20059, 14739, -753, -18730, -17039, -4683, 7738, 1201, -6147, 3225, -3915, -529, 2899, 8204, 257, -10662, -26804, -39066, -26716, -13397, 5283, 14505, 21928, 14858, 8436, 10932, 4354, 4202, -3741, -9974, 11491, 33180, 29695, 21743, 14663, 7112, 2546, -2233, -7678, -13537, -17044, -7481, -6830, -13425, -16730, 1323, 18070, 22238, 15882, 18548, 29676, 27385, 26166, 16478, 9580, 22325, 18945, 14058, 15487, 6701, -13137, -6895, -2891, -2606, 2938, -4502, -2433, -2066, -1113, -3054, -11236, -22929, -23733, -13259, 3893, 8408, 4296, -608, 20576, 30717, 10843, -11088, -31455, -30156, -25215, -12021, 6102, 18704]
6724A8704j2412r151l593k226J1733J3666l078p775n55M435R0M512P138O103K656
6709C0247k485J2066J4745j1062k8166q182Q68N263j1181k688N217R741P664j5899
6695F148j836N20Q963M47j2170o642J3932k484L488P464j137o120l105j2035q196
6680a2763k29L476J3146O469j3698o997O914K00j747P589J3616j6202j0402K416
6666h212j528P203J4188Q781k103o219J0058k122j3077n863M033k2799r804J1355
6652a6109M939J2259N12J7624r155q151q396r737Q722R523O212O731n882n389
6638C703k272O142k302q005l348o473J0780O740r02O78j744p688r076N902l416
6623a1281O237K169q428Q37l663J0921N402j0606m554j029R09L692k259P020P619
$$ y = [18704, 6292, -2859, -6452, -8678, 3055, 16721, 13643, 5868, 5313, 9748, 9838, 14350, 21488, 27591, 30247, 27762, 39828, 54573, 43511, 15345, 7163, 8031, 13294, 2113, -575, 4642, 14383, 22047, 6148, 4312, 4832, 13795, 14242, 2072, -4570, 9362, 6878, 10366, 17830, 16693, 10573, 7468, -4567, -12763, -12992, -9516, 3630, 10099, -3599, -10596, -3682, -3482, -5229, 2360, 15976, -226, -10628, -8212, -9740, -2537, 11651, 20432, 18329, 12110, 22168, 20046, 6969, 1106, 5139, -17660, -27464, -16109, -11170, 1089, 1601, 19225, 10070, 1919, -6477, -16214, -7492, 2031, 8243, 14974, 9092, 3703, 1431, 7573, 5271, -2734, -6082, -12555, -1775, 4965, 4063, 4741, 2997, -4691, -13767, -7865, -11281, -5044, -2875, -11303, -10466, -14129, -3208, 2194, -8412, -12966, -13995, -13086, -9394, -11653, -4633, 2986]
6608B986n920j4614n450J1902K587J2052N879l6P209J1679l051O086j7795n461
6594H053o831j4122R135J6846l820j0124m60K074j92p686J662Q284O904K035j0164
6579A594k882J1531K563q217l965R044M883J713k1910j6497J6085J409K779j0521
6565a2391N070l708L070J2644J00p217j4508J0212j823k602k197L027R553l089
6551c859m449o455J1980K0536J0872n742r240j5662r305m02k66N76K191M957M991
6536G23j2855L133J6789N306L725j0664j4751q118J3218o497Q718J0833o549N689
6522H700m61N892p77k31k126J3883j70l795j7470n972J590J1475P744n59L500
6507B1223M334o678p970q08j8895l211J2519J043M722K027O731j148j1817j3426
$$ y = [2986, -2934, -17548, -22998, -11096, -8509, 3543, 9422, 9386, 16595, 28274, 25223, 31309, 13514, 8053, 1222, -12900, -3765, 13081, 9261, -863, -1323, 751, 559, -7127, -5465, 2819, 9723, 11758, 1594, -1288, 10243, 12806, 4589, 624, 9668, 14551, 16264, -5646, -22143, -6058, -4649, -1870, -12391, -7321, -11029, -7959, 4685, 4785, -2432, -16940, -6728, -8551, -11153, -13350, -10323, -770, -3859, -8308, -14763, -2783, 17753, 28625, 22883, 13643, -2019, -11324, -11726, -11992, -11416, -9225, -4268, 723, -12132, -8999, 7790, 13096, 16821, 6157, -8594, -16712, -3494, -9991, -1273, 9560, 3011, 8700, 8239, 14131, 13354, 13123, 10997, 24880, 24710, 20915, 3445, -2527, -937, 10538, 18282, 17723, 21223, 25557, 18879, 10909, 10101, -8794, -12005, 514, 1557, 6279, 8306, 15037, 13889, 2072, -11354]
6493a1354J6846J1328m666m277j17K093O67M760N48j0529q772j3887K254k315
6479a7421j040J437J3722P015n959l364L812k128j9799n153N345J1140J2721l5
6465B93p590m125m89O890k688R97O270k429R417o576j08j6350M462J0527k626
6450d125Q003N19k369p550r163K551m369M734m140q512K093J2857q93R18J6934
6435G488q119j4996J004M243K280P748K552Q08K757O222o009k0270p98J8100P322
6420A0332m745l594m76J028O36r639J33l439p057N652k068j3257M640J6960M87
6405d407J2360J987j0000J8126J2497r409k860o384J0696K920j9050j5297p32
6392i553O763r349Q460J4398N570j0666j0586J42o63k772P790K950n089j5212
$$ y = [-11354, 5492, 16820, 12154, 7877, 7760, 9853, 10520, 15280, 15828, 5299, -3473, -17360, -15106, -17421, -18461, -17024, -3302, 3713, -2246, -5610, -1798, -3926, -23725, -28878, -23533, -12393, 328, 293, -7297, -11422, -11911, -5021, -7709, -6712, -442, -2871, 6546, -30, -138, -16488, -12026, -1499, -4125, 3878, 4397, 2028, -5522, -14685, -12134, -16503, -11769, -15909, -24421, -22328, -9471, -10364, -9446, 7488, -631, -15627, -14623, -10380, -8100, -352, 2200, 3008, 5765, 11987, 5978, -14292, -15090, 3010, 10332, 5587, 1993, 1517, 2545, 3181, -6458, -6325, -9764, -16821, -11169, -13237, -26494, -21854, -4894, -4407, 7953, 9940, -60, 18066, 30563, 21154, 18294, 11910, 22606, 25526, 6476, -8821, -9553, -2790, -12139, -3679, 10719, 16289, 5623, -4963, -4821, -5484, -8256, -466, 2484, -2605, -17817]
6378a7817M959J0722j205O265o828p790k571j8589J373Q383J7049P043L588J016
6364E598o869j3668J191J2951k75K237p011P866N593j3574q300Q484n690J65M830
6349f472l034m036K285R961K481r88j1330O306J4264K2986l726k2636O080j1388
6335G53K916M212Q35r78j0115k159q031j04k033l701R100j106j84L921l770r068
6319a9512l383J0480P083K827L2J0585J193N410M080k482j4862p982J4377J4618
6305B2464L196k2670K282J4250Q541r245k0798n324Q735j347J1299M923p003n388
6291C915L868J84K367q02M763P251l636j6830j5618n580J752M609R182k261O266
6276e70m013j3151K293P672m371K1026J1977m883n127p223k145r282n602J957
$$ y = [-17817, -12858, -2136, -3341, 2924, -3904, -11694, -14265, -32854, -31481, -23098, -6049, 994, 4582, 5598, -1271, -14939, -13748, -797, -1072, 1165, -5846, 2020, 7613, -5961, -14261, -5777, -11467, -11302, -6472, -9506, -13542, -11257, -1296, 1185, 197, -11133, -4827, 9437, 32423, 28697, 6061, 12141, 753, 3669, 7881, 8716, 7738, -2377, -4536, -12567, -12671, -14704, -18405, -9305, -10411, -10595, -6674, -10444, -19512, -22895, -12415, -5332, -2505, -2473, 8112, 9305, 14715, 18795, 16313, 1451, -6531, 7846, 22464, 25660, 2990, 5272, 19522, 28063, 18818, -1980, -7304, 1431, 84, 11383, 16306, 9303, 3915, 7783, 7967, 10334, 9532, 14295, 21546, 17910, 1080, -14538, -20118, -18366, -13757, -4575, -6836, -570, -4583, -17734, -15441, -7769, -12140, 8886, 20863, 15980, 10853, 3630, 1485, -7797, -13399, -11442]
6262a1442J2431J1661R747p521l657j077o183j0937Q506N705O205n98q442j1079
6248f681M4j142m164J4109o14k2435r997J3169r455j965l080l56j844R837K4226
6233c48l709k3695K563J7487p12j217N47J208L654L44L680K189R802N120p159
6218I754p979j174o839o121j0671p408J160J7042O180p832N517L230N771r292
6204h662r677k200K874K899J2098R406j4867j0404K0836Q912m6Q179M032l50m765
6189A8265N403q846n212j7600n386o563K046P338L999O239n356o824N81J4805
6175B889Q127P32k5724j2522o355L469j469l416J2901J3754J687M618l185N461
6161I67L028K050j5905k34L090O362N923j1528K051O113L624r346j8151N326n40
$$ y = [-11442, 989, 12650, 22397, 14876, 11219, 10142, 3959, -6978, 1528, 7233, 13438, 12840, 4398, -6681, -6637, -7779, -11943, 2166, 1552, -20883, -30880, -17711, -27166, -29131, -32211, -32567, -34411, -24574, -348, -4057, -27752, -25189, -7702, -8414, -9631, -9084, -7876, -4222, -3878, -198, 1991, 11793, 16913, 9754, 1775, 601, -6238, -12359, -23030, -30438, -29278, -12236, -6056, -13888, -8371, -5141, 630, -8662, -18339, -20539, -17665, -14766, -2668, 6738, -8129, -18533, 2303, 11215, 11169, 19348, 23380, 23030, 18265, 23668, 14822, 9610, -7990, -13376, -19939, -17893, -10555, -6556, -317, -5673, -12497, -11916, 2889, 11016, 11748, -13976, -26498, -32853, -29384, -30853, -34269, -21368, -7614, -5927, -1309, -4494, 967, 3995, 6045, -9860, -10094, -7004, -642, 5281, -6247, -4196, 1917, 5541, -3805, -21956, -16630, -17170]
6146a7170l888K995J1519J2766q050q357j2980o953J4802K0227j0268N627Q901
6133I171n998j947P899J760j866p468n404L70K315M017L799m52n011l070k162
6118d047J333L022K110m653m039L559J452j4985r834J0000J5388O685J3211j0492
6104H710n972l459l541O25n402q468L828K2379J2229l048j3859r771K411K371
6090i67L948p074j2875J158P987K319j426n845J1766p769o321n443k1289l666
6076d5497k153J4299O867J0571l671k971N984q468n523J6448R745p784j0493O502
6062a6144J3711K4377n389q071j0324q127j1495n040J5050J1502j1068J729J6935
6049G646l493m918n269M79O140j287L709P325Q890P304q325j4643j5258N502K481
$$ y = [-17170, -21058, -18063, -6544, 6222, -1828, -10185, -23165, -30118, -15316, 4911, -5357, 270, 9171, 3173, 1226, 9125, 10885, 9019, 1551, -3853, -3483, -1168, 2849, 6648, 6196, 1185, -1885, -4047, -2714, 308, 2418, -2235, -6274, -2715, -1263, -16248, -26082, -16082, -694, 5991, 19202, 8710, 2738, -721, -4262, -3637, -9039, -17507, -13679, 8700, 20929, 17881, 4022, -5749, -3338, -967, 2981, -4093, -16968, -15810, -7823, -5504, -6930, -12775, -1009, -8778, -15099, -20542, -41831, -45497, -47650, -33351, -26484, -15913, -19584, -22555, -16571, -25039, -30562, -14114, -4369, -12153, -22646, -16144, -2433, 21944, 16555, 8484, -1840, -9967, -21462, -26502, -11452, 50, -11018, -9289, 7646, 4153, -765, -6034, -5555, 585, -702, 3007, 10332, 19222, 26526, 18201, 3558, -11700, -6198, -3717]
6034c717P998M853O080k223j8113O244j710k2679m883R476P28O405l472J8762
6020C749O601l286P743J5947m239q824n045l216j318j157K442O427l958m859p260
6005b53J644N17K173O720r062j5143q855O72L716l884L213n094j1846N468K0229
5990i785J3380o295j5968M379l641M995j661P195O648M139k481q598m609J0247
5976b055P318M073m947J5446l494j812k557r379m131n553N662q436J908Q350J127
5961A520K87l979l932M119J0521K143q392P074P569j3026N038J085m505J4312
5947A9834K527n468j0635j3688m804P483L041k101J7057k647J470K386p808r143
5933b496p867M231R477J020L420K566n356o232J486J3712J541m577j2245q063
$$ y = [-3717, 4281, 9134, 15214, 12991, -5122, 1122, -588, -23267, -28150, -18674, -17946, -11541, -15013, 3749, 10350, 7064, 14807, 30754, 26515, 17691, 12646, 9430, 8112, 6955, 9397, 15824, 11866, 7007, -253, 1391, 1908, 4081, 10801, 1739, -13404, -22259, -21587, -17871, -21755, -18542, -23636, -35482, -30014, -9785, 3595, -2700, -18668, -14289, -17930, -12935, -14596, -7401, -753, 3386, 905, -7693, -12302, -2055, 5263, 9336, 4389, 19835, 16341, 14529, 11972, 2593, -1538, -7091, -1429, -9865, -7957, 393, 1520, 1807, -2172, -6104, -1985, 8536, 10679, 2287, 9361, 16930, 3904, 8942, 10027, 5522, 19834, 22361, 16893, 6258, -7430, -12234, -4751, -1710, -3811, 13246, 10599, 12069, 14455, 6647, -2496, -10363, -6132, 3345, 4365, 7785, 10351, 4995, -1237, 249, 13961, 15502, 10925, -1320, -9383]
5919i383J5988p965n180O04p450M175J635o555N089R327p480o632P901R974o860
5904b812Q253O098J354m081o263k612L10j3107q725k897J5148K022l476p891Q293
5889a0386m71n654L468J3654m195j5070q708o19J6996J1220q351l32k471j4150
5875b5069k809J6725j731o855N49K2142O776M369r976R820m647k7641R69J2802
5861d576P979j977l549J2968k975p838K596j458o731n25p836k694P204j274M87
5846a0199m619M83K96k465J1954J4839q008l720P114J804j1871k5K2380J714q860
5831A0817J0034j0902r313l997p849P99M820j702p685J505O958l669j298K272
5817i210K378j2199K121J5895J346k392N57R540J0901o223j6075J86K975Q85P203
$$ y = [-9383, 6605, -1360, -6540, -5936, -13386, -9211, -7576, -14131, -9042, 285, -7195, -13827, -5926, 4048, -2812, 5441, 11539, 12893, 8812, 2549, -63, 247, -12860, -21585, -24482, -9334, -7312, -10788, -18679, -10386, -10857, -16511, -13043, 611, -3584, -18654, -27362, -27981, -10985, 235, -8116, -8448, -10919, -25069, -27878, -11153, -12884, -19739, -19190, 2952, 9728, 14097, 4121, 13941, 9294, -18347, -17378, -4576, 3403, 1426, -2123, 10845, 7870, 32, 2628, 1170, -5561, -6086, -13922, -16616, -9412, -10686, -10199, -14818, -14335, -14039, -16504, -4550, 10289, 2281, -1439, 5675, 7479, -4392, -4417, 17963, 19677, 10817, 20851, 9949, 636, -3361, -11210, -10411, -5591, -7293, -14978, -13473, -6515, -10184, -11482, -9210, -6832, -19031, -16910, -1015, 331, -2061, -1504, 8036, 18937, 12714, -3361, -3175, -200, 685, 7888]
5802G888q329P05J686j2793j2631J408J733J360j435P117J5784n130j927Q289
5788C725k857j2030q090L700K2313O265L544O846J4735r313k3934j4022m724K523
5774a1319K797q27P130P142R34J5269R150j9636k0139j3025L831P022J0478P824
5760F631o291j2629o724o108J7522K1561m023l50J635j055n106L461J82o343P692
5745A0055K65l752p177k537M732M277j423M526J3711o346q888j6408j1170J823
5731a8312j918P19M985j820K651J0578J0520q064M067m455O855J0397q956j2839
5717e592n351M530J1494J0107L858m295p253Q649j36J807j2563l564n843q422
5703a2574R464L361n234j853j637R177N105r012l498N583M0M575P73j2290m809
$$ y = [7888, -441, 264, 1950, -10843, -23474, -22066, -20333, -18973, -20408, -13291, 2493, -2637, -4564, 3725, 868, -11162, -19252, -15552, 6761, 13026, 16570, 23416, 38151, 28838, 4904, -9118, -13842, -11319, -8522, -9349, -2219, 4923, 5857, 21126, 30276, 10640, -9499, -22524, -18693, -11671, -1193, 6631, 340, -12289, -19013, -25121, -7599, 13962, 9939, 9589, 11224, 10169, 5063, 8524, 8706, 2363, 10055, 10320, 6568, -609, -3146, 1586, 5863, 4440, 8966, 22677, 16331, 7443, -8965, -20135, -18312, -20230, -19511, -14526, -16346, -13695, -3117, 7403, -661, 3406, -1049, 5806, 16203, 7247, -5592, -10943, -6413, 5081, 15188, 19046, 14751, 7498, 16147, 16011, 17818, 5255, 1691, -4152, -12574, -3110, 251, -4983, -6836, -8473, 704, 5809, -3203, -6701, -1118, -1078, 3497, 4270, -8020, -12829]
5688a2829K1640j509p443j9655J330O005j927J4757K999j1055J7064l387o484
5675d94K3054L614m387m623o77l997j1J557q84k47P430O325p458o914K218J0657
5659B5163R08j1742J462o432k599J393M178j012k393k3022m695P185j459J4699
5645A634r02r055k523R172l63l844O863N76J134j1032n716p804o232P564J6617
5630c911q70n623m344O315n500L014p923m618J666P944J5261l477k875j1991L557
5615a3375L970K253N857M233Q352Q351m522r934j3507n975K16Q232P770j47M883
5600F657J24j8329m129j034J079N159P366j84j1824n103J156J133J531J1274J2618
5585G494M881O521j371j0106j2311M561k623N369O351r394R127Q801j1978j3480
$$ y = [-12829, 8811, 7302, -141, -19796, -18466, -12461, -14388, 369, 3368, -7687, 9377, 5990, -494, 22560, 26174, 21787, 17164, 16487, 12490, 12479, 14036, 13152, 12905, 20335, 26660, 19202, 12288, 14506, 25163, 26071, 14329, 15791, 9359, 6760, 8153, 12331, 11319, 8926, -14096, -18791, -11606, -13065, 1634, 732, -8323, -10846, -1674, -2037, -5881, 982, 1558, 2692, -8340, -14056, -21860, -28092, -20528, -3911, -4781, -10404, -14748, -8433, -13933, -10919, -18842, -23460, -21794, -13850, 1411, -2066, -4941, -16932, -13375, -9405, -7152, -1295, 2938, 11290, 19641, 15119, 5185, -8322, -14297, -14081, -5849, 1921, 1774, 6657, 6781, -11548, -15677, -16711, -15632, -10473, -3107, -3291, -15115, -20218, -19062, -17929, -16398, -5124, 7494, 12375, 18896, 17525, 7419, -4892, -331, -2954, 2415, 8766, -628, 8499, 17300, 5322, -8158]
5571h158L309J6232O277q804m755j456r145j509L769n636M101N731M566K226J653
5556H401j2619k279J6891M687j0441j0314j0985l656J5570J2237O025Q360l131
5543A8746j1725q885O66N551j67j769p162K313m731r008K835M569l50J0969J5815
5528A7667K258j4334N66l737j3363p854J2163m289J135L946j884o561P47J6822
5514C282n226N093k59L453l644q069N600O147M357O13m255M824k763o652r414
5499f913N876M695o058P346R277q663p21K784l536L008q206q086p827l15N245
5484a2094k29R040N904j1796o610r386Q083K654O012R11r663J000J1570N260R998
5469A0654J3421J5q723j403Q208j7587l646o65r623Q81J0394P728K691j3724p225
$$ y = [-8158, -4849, 11383, 17660, 8856, 4101, 2645, -6500, -8009, -4240, -9876, -5775, -44, 4522, 6748, 8401, -4218, -6497, 10394, 15081, 4640, -5674, -16659, -20315, -4745, 7492, 13517, 21877, 18746, 7021, -1864, -1198, 4353, 4186, 2417, -4745, -2432, -7163, -16171, -13336, -8767, -9117, 1852, 17667, 19925, 5591, 6157, 2420, -10943, -18797, -6634, -10923, -9788, -5842, -7726, -14287, -13540, 3282, -1944, 3149, 2890, 6343, 2699, -5370, 230, 6377, 10734, 11347, 7092, 11916, 9153, 2501, -6913, -1037, 3658, -2400, 4946, 14223, 5560, 4839, 7623, 4087, 7095, -1111, -9197, -17024, -17339, -12094, -12323, -3283, 2621, -9175, -15785, -25171, -17088, -14434, -8422, -7511, -17174, -16174, -4604, 656, 10654, 24075, 24090, 15367, 13964, 22172, 4585, 939, 274, -9349, -8468, 1926, 9654, 12345, -1379, -8604]
5454h604k157K811l775q853M328J0565J899J741l361J2139M765q590j5163O483
5440e772P479p821J1976J5235n03j3228l943j3346p989q234k557j100J3963P454
5426h386k044P65l476j1474K21Q090J2239P259O183K040R12j9036L151K547j211
5411b220M719J777L777j2535p000O539K586j1562j0085R635L801Q64j108J476
5397i336q873K819q334K923M614j0327o537j270J0404J0059l873J848j367O182
5383a1068M912M601l85j124j323R761j032J025J299K940m294M727J0373p482r720
5368C210n005J415N159j8730J1411K784R703J2441P479K945j5443n589J1048j1437
5354A1391j39p611l505N199M180j2832j68l814r65p642O235J4577l924l566m367
$$ y = [-8604, -10761, -7950, -11725, -20578, -16250, -5685, -3786, -2045, -5406, 6733, 11498, 2908, -12255, -5772, 1707, -6114, 5862, 21097, 20594, 7366, 3423, -9923, -17912, -26146, -28703, -29803, -15840, -8386, -10430, -9665, -13141, -24615, -24394, -16304, -4065, 3194, 9377, 11417, 12329, -6707, -3556, -1009, -2220, 2499, 4276, 8053, -4482, -11482, -4943, -2357, -13919, -24004, -14369, -10568, -9704, -10812, -9336, -18209, -15390, -23724, -20801, -16187, -26514, -33051, -34321, -23917, -13858, -17731, -15883, -17250, -11068, -6156, -1555, -1940, -3064, -4387, 5374, 4342, 5367, 6666, 9606, 5312, 10039, 20412, 12930, 3210, -1795, -380, 4779, -13951, -2540, 244, 9947, 22388, 29867, 32812, 17369, 11780, 22828, 11391, 11252, 3641, 136, 5335, 9515, -3317, -3485, -7299, -8264, -15906, -9671, 4906, 982, -2584, -6951]
5339f951j2061m906P340O533j647R887m469l756K816N545q35O296j3148l720R438
5324c638M849N2l45n865j0649k472J2533J3971O081k219m307Q17p026J068M350
5309G200Q508P363n210n593k0325K537J3051R394K362o374k7238n015J8484O733
5295E877j2850r135j0867l076L389j357k787k616J0226J3196K126J299M294K036
5281b45J981l757k871O605L729p80j4267l392k00j328J9593K3739O19N856j0303
5266B4979j6016q314k256J366j3609n225j054k429J3587P518j584o401J173Q297
5252C2Q452j17P342M23p43j0128j9739Q11J3525P944m635m662K12M695r421k0196
5236b6205K339J9040q570K649N811n44R736K325j9911j4807K2853J0172p96O403
$$ y = [-6951, -19012, -23918, -16578, -10045, -11692, -1805, -6274, -10030, -7214, -1669, -2504, 3792, -9356, -13076, -3638, 1211, 1263, 918, -4947, -15596, -18068, -5535, 8436, 14517, 12298, 7991, 8808, 1782, 2850, 7200, 15708, 23071, 17861, 12268, -8057, -5520, 7531, 16925, 19287, 12913, -14325, -19340, -856, 5877, -6973, -16108, -26975, -30051, -26662, -28019, -30806, -33422, -23196, -10000, -7874, -6575, -2281, -245, 1736, -2021, -4892, 1713, 5442, 4662, -9605, -12997, -13197, -14525, 5068, 28807, 29426, 35282, 24979, 8963, 649, -1607, -241, -13850, -19075, -20129, -22558, -8971, -1453, -3037, -9438, -8265, 32, 8484, 8367, 15709, 16132, 15389, 5261, -14478, -13667, -142, 7802, 3167, -1495, -1283, 3412, -6009, -26205, -23866, -4826, -13396, -10747, -4936, -5480, 4256, 6581, -13330, -28137, -5284, 4888, 4092, 10495]
5222A0495K601j6384k093K059o683j3870L391j616J2264K469O863Q19j0711j0625
5208b1021J6982k301O151M487k523r031J0963k699R494m058J397Q758o773j7844
5194h018j7943p794K4441J6985L996j4435q303J7098J2114Q9L366K119k844j96
5180B0675j5560J746J0357r915o48m494j6421k1256K061M222L575j0840n676J5765
5166b6409J1007M486J526j136N25K206P11o469J68R046L010j1194J7968P029l613
5151H861j0718j0114l214K479j767l04J3058O792L427R655L078j6045q590P053
5137C651m419n112K219L481R176n942Q759J1069j2539n874J230R739J0998n326
5123B1110q404j5863R450o611j1821J089k680Q498Q481r937N400K237k839J8398
$$ y = [10495, 13096, -3288, -5381, -3322, -10005, -23875, -20484, -22100, -9836, -7367, -504, 315, -10396, -21021, -4039, -6340, -189, 4298, 1775, -7256, 3707, 1008, 10502, 6444, 7841, 16599, 9826, -8018, -25961, -33755, -9314, 7671, 11667, -2768, -11071, 6027, 18141, 18230, 21596, 23715, 20871, 20675, 5115, 6861, 17218, 7303, 6655, 2161, -14260, -35516, -33455, -29233, -25658, -36498, -42174, -26409, -15402, -10916, -9390, -10526, -10001, -7795, -7084, -13553, -13385, -4339, -1329, -12523, 5445, 12474, 8861, -1857, -11971, -15185, -12706, -14473, -14777, -1719, 5073, 8500, 18155, 21233, 5188, -3402, 3651, -768, -5880, -3661, -180, 8996, 3054, 11813, 22882, 10343, 4469, 5699, 15438, 26436, 21110, 12706, -3157, 6293, -318, -12139, -11050, -13730, -5232, 3249, -6688, -1288, 949, -1890, 16508]
5109A6508R512P920q273k3250j1322l988J4573l331o47j0776r867q876L545O99
5095b7573R121K613P805M795p201O363J5075o20J544n187l584j6135P853P980
5081B849j0308J809J2948P490Q599M765j4481n279o78J877j308o286j459j3O121
5066F646J526j1838p102L218R380o728J508P392O083o961m747Q024J3433j0898
5052H936j1233j0148k587J1012J745l246p590q198j5948K1715N817l940r63p667
5038b2295M233k502Q200J5159O301L435p624j3885j2461q34J04O661j380j2450
5024b9338O004J8668R196l720m561j607p003j4811o968M813M080o42N607J1284
5010h998P096k869j5547k4P129r896o831j262J3145J7013p703n59q305M342j329
$$ y = [16508, 26020, 33940, 25667, 2417, -8905, -12893, 1680, -1651, -2298, -13074, -22941, -31817, -28272, -27573, -18452, -15839, -8034, -3239, -10440, -4077, 10998, 10378, 11922, 6735, 3151, -12984, -5131, 2849, -7459, -5650, 7298, 14788, 23387, 28152, 13671, 8392, 7714, 9591, 8283, 1997, 538, 525, 6646, 8172, -3666, -10768, -7550, 1830, -4898, -3390, 4002, 10085, 3124, -1623, 6401, 19834, 8936, -2297, -12445, -15032, -4020, -2275, -5521, -13111, -21309, -37257, -15542, -9725, -13665, -14628, -22295, -18062, -20564, -12364, 2795, 9096, 12531, 4907, -8978, -21439, -22273, -22169, -15508, -16888, -29338, -23334, -4666, 4530, 810, -3751, -5358, -12361, -27172, -34140, -29327, -25247, -25889, -20282, -8998, -1902, -4771, -20318, -20342, -13213, -23109, -29940, -31202, -18057, -1044, -8747, -9306, -17611, -13269, -14598]
4995a4598N655J1577L082j3726R538J0375n999l43k1383j954L315n620M411L458
4981a2212R956M531r222J354j470J851N83r909l107K97M035Q721L156m61q785
4966a0682k50N860k86k897n442J0369J3618m430j0233j242J1264n339O666p779
4952h03J948L482J0711j7833J552l818j6119L685q224J3766J3391M426q44q643
4938c323k810k548M336J41O275J1101j1269j2343q837k502P68q509K932J3378
4924a3210o094n802Q234L514Q556r379k0171J5590J3887J162j0357j186o595O200
4910a5651L121Q297o964j181O5l938m043J2692Q504j0066P382l521Q681J2833
4896A6211n93j5134N916Q405J115o96j6617p449j0516q416P926J811j321L296
$$ y = [-14598, -8943, 2634, 5716, -8010, 1528, 11903, 5904, 5561, -15822, -17776, -14461, -20081, -15670, -12212, -2256, 2275, -6947, -5593, -7063, -5212, -4629, -14538, -17645, -17348, -13313, -4592, -1436, -1897, -10682, -10932, -5072, -5358, -8255, -13697, -3328, 10290, 5860, -4373, -5615, 5649, 310, 6976, -803, 1145, 4627, 15338, -2495, -943, -4761, -20880, -17195, -25419, -11653, 1738, 6164, 5320, -3323, -6133, -8681, -4345, -4204, 2071, 13172, 1903, -10440, -19277, -21779, -21011, -29520, -26588, -13210, -19304, -25106, -16872, -13358, -4802, -14181, -34352, -18762, -4875, -3713, -14070, -15256, -21851, -15651, -12530, -4233, -11197, -12378, -12313, -16251, -20294, -7602, 902, -9164, -1782, -5303, 3378, 16211, 15618, 484, 6400, 14805, 15920, 15224, -1393, -8842, -19358, -27774, -19848, -18037, -19358, -16062]
4882a6062m818j436J9001m433K309J2057l450k0651l877k878O679n56J6888P461
4868F234j1658j659O532M233m552r168J905p537o72Q27O395l122j1948q145J6671
4853a5664K9260m580r846q505j0117K005J936J2171O996j0709l606M387R791k0254
4839a6735l252K1154O79k0931K894J1800J6010K744r993n484j4590J0899j750
4826f555j7350P891J3528J3935p920o35M531L027J575o723k727j663j3711P426
4812e371R592k014m426N010r057j3341L393o614O068P416J418k912R881M542J2173
4797A5758q38q334R490k102J770m163j5401j6430j6382J7649K1160M033q352R82
4783a160n481J3574J0996j0013o231r841l343P633O243M686J645Q313J3586j1816
$$ y = [-16062, -20880, -22316, -3315, -7748, -5439, 6618, 3168, -17483, -21360, -24238, -17559, -18115, -1227, 6234, -5424, -7083, -551, 3682, -870, -10038, -8133, -15670, -16342, -15515, -9120, -12242, -24190, -32335, -15664, 13596, 9016, -830, -9335, -19452, -17447, -15511, -3340, 3656, -7053, -10659, -6272, 3519, -16735, -19987, 1167, 1846, -19085, -16191, -4391, 11619, 14363, 4370, -1114, -15704, -4805, -6555, -23905, -16014, -2486, 11449, 3529, 2894, 7425, 10452, 12027, 5304, 2577, 914, -12797, -5371, 4221, 2207, -2219, 2791, -6266, -19607, -16214, -22828, -16760, -9344, -7926, -10838, -957, 3585, 15758, 14920, 6586, 16076, 13974, 15744, 11581, -3820, -20250, -36632, -18983, 2177, 6210, -2142, -1160, -6641, 6933, 17929, 7916, 1685, -8156, -11499, -3866, 2377, 7063, 8708, 17021, 30607, 18791]
4769A8791j2053p696j9755K587N908J4286J1504j474n945J960L769r125J1606
4756A4363J7583p758j5420j1790p901P402k696j4376J6527J0127K738p503l300
4743b004J5159J2974p677M513o643o598J0290N340p938K575j3449j1717N8l978
4729i095J258L466J3194j580p866j5472l252J5568P078J785Q822R152Q655J61
4715C1874j0139o075J964j666O41l601k0204n01J8031Q02k018l173J89j051n7
4700E016l784o74J411j3409k2303k774J1944L242L062O92N502N998q257l610L209
4685a4735M203O297L670K811j4113l924O826Q749M992N102j3414k050J7172J465
4671A3051o389p641M575j131j7032j6490N055J4817J2212q07p71k531K428m825
$$ y = [18791, 6738, -958, -20713, -18126, -12218, 2068, 13572, 12098, 6153, 8113, 11882, 2757, 14363, 31946, 24188, 8768, -3022, -10923, -3521, -6217, -20593, -4066, 6061, 8799, 1296, -2004, 13155, 26129, 18452, 22965, 16322, 9724, 20014, 25354, 17416, 19991, 6542, -5175, -5117, -9095, -7837, -4371, 8823, 7243, -623, -16095, -19347, -3779, 3299, 5084, 13906, 23058, 31713, 31874, 21735, 15660, 17624, 15958, 16599, 12998, -7206, -7707, 10324, 11126, 9108, 5935, 6124, 5073, 5016, 1232, 558, 1969, -11440, -33743, -36517, -24573, -21331, -18269, -17577, -12075, -6077, -14334, -17944, -14735, -10532, -4235, -565, 2246, -11867, -15791, -8965, -216, 4776, 9878, -3536, -5586, 11586, 13051, 6662, -979, 3596, 2465, -14567, -31057, -26002, -11185, 1027, 220, -551, -3082, -654, -5479]
4657e479p626P150M327n797L397M696j931K113J454K037o02l37m038j2987k416
4642a6039K846J1613J2184N825o972J3954k50k1310j160J0113q905L930j217L79
4628D991n642L690n190K52j414q80N633q934l40q319r302j689R633r526l438Q637
4612b1838J5420M747l656K357o118r011l006o739j3301p510Q892L395J2684l296
4598b6980K772J2818O290J0555p346l887R792P204k158j7176j215m910J2273M404
4584B436q690r102l886K973J1140K36J867j0426j5959N570J3084o895o044P027
4570a6669R52J659K574J0482o368r689J8828M404j2887O092K45l982p440j66O252
4555e713O456j536r336P661J1233L315l799j6132j6778n63J4193j113P46J584
$$ y = [-5479, -13105, -5955, -1628, -7425, -4028, 668, -1263, 850, 2304, 4341, 3739, 3402, -636, -13623, -16039, -13193, -1580, 10604, 16429, 9457, 23411, 23161, 1851, 691, 10804, 1899, 5829, 4612, 4991, -651, 3039, -2151, -1899, -3313, -4193, 1440, -7494, -7834, -16153, -25455, -27144, -17511, -27037, -30475, -21838, -6418, -1671, -5327, -2970, -9088, -18099, -21105, -27844, -41145, -48655, -39763, -36368, -23684, -26980, -24208, -11390, -5100, 5455, -1891, -5778, 4014, 11218, 9060, -8116, -9331, -14241, -1968, 2436, -6254, -15356, -19242, -16269, -5129, -4893, -3026, -13452, -29411, -23841, -10757, -17652, -23696, -16669, -15717, -14058, -11484, -1002, -7370, -17059, 1769, 6173, -6714, -622, -377, -4359, -11799, -11965, -5713, 743, -793, -10129, -2468, 8765, 12080, 8281, -7851, -24629, -25192, -10999, -12112, -11366, -9782]
4541i782K928J2734L124O717q875J89q07l883O231M082J262Q160j059j985j2173
4526F863p534l625j274J534r779j7975O350M611J5079J0153K428L55k99Q671N56
4511A6114j2650j9180N387M453N669P747r869n020J7015J972K242k373m114r22
4497F471o283n75j5910L333K0135L7j0344J8314j1258j6433r17J4222N257j383
4483D666j7416j0492K205J747m559J0840J0614J964N686q420o874r344J7419J2094
4469A0130j0178j6154j7561Q211k70k793j0950P480J5531Q094J053J3305m856
4456A042j2804j571K272Q461l102K204o685M910K555L930K062p790m465K699p635
4441a3917J283J7393R06o485j345Q588k767l831n348J984N746J3073p212r415
$$ y = [-9782, -6854, 5880, 9004, 15721, 6846, 7035, 6228, 2345, 8576, 12658, 13920, 22080, 21021, 19036, 6863, -671, -4296, -5570, -4036, -13815, -31790, -25440, -20829, -5750, 4403, 6831, 7186, 6887, 15558, 16114, 3464, -15716, -10329, -5876, -207, 7540, -2329, -7349, 9666, 11638, 13880, 11507, 7393, 6471, 188, -387, -16297, -12964, 7171, 7208, -3136, 15178, 3920, -12513, -13430, 792, 6049, 4666, -12750, -23242, -21037, -19290, -23849, -13009, -2395, -431, 5255, -3165, -10039, -19383, -1964, 10130, -48, -16202, -33763, -25552, -25822, -28615, -39565, -32085, -16554, -8460, -7407, 5898, 1042, -11762, -13333, -11061, -2600, -5702, -3498, -10183, -5273, -2718, 1212, 3274, -4516, -8981, -6282, -13917, -12634, 4759, 5665, -820, -2165, 6423, 3656, -175, -5523, -3539, 2207, 15280, 8068, -1347]
4427a347k51q963q635j3675J277M754K0572r70k0242N85Q271K1221J4115j1488
4413E224n408Q251o99n838J423m291m094p302Q9O456P806N618l230N143J773K637
4397A3558j3624j0061j0044J0389j235m659J3261o478l915n543q434j0647n865
4384d3297M706J2824J0049j512R761Q096P275p294K999m814L567K35K971P87j584
4369D769j2589P004O06o618Q471k623m956J2966k641p940j2102O398J0535Q157
4355I437J752n960j736K899j1005j625k395l669Q507O826o736j203N299n39j960
4340b108R386p130r222j2259K760K572O733M900J876J7586O101j9565k5805p983
4326c2158J1147K880L40P12k442R698Q511k285j3861J101K930L040K704j008n450
$$ y = [-1347, -1598, -10561, -19196, -32871, -31594, -26840, -6268, -7238, -27480, -26895, -18624, 2597, 16712, 5224, -184, 8067, 7368, 1530, 2953, -1338, -5432, -12734, -12645, -6189, 1617, 7235, 4005, 9148, 10921, 13558, -66, -10127, -20171, -9782, -11017, -15676, -2415, -8893, -12808, -18351, -26785, -37432, -43297, -38591, -25767, -15718, -17230, -7469, 627, 7902, 608, 3607, -1207, 2360, 2595, 5566, 6353, 4769, -7820, -816, -210, -6828, 1643, -980, -5936, 7030, 4389, -3551, -15653, -9255, 1280, 9437, 11189, 5229, 3493, 6392, -4613, -6238, -8633, -12302, -3795, 3031, -3705, -4908, 391, -148, -2108, 7278, 148, -9074, -21333, -18573, -16001, -9268, -4368, -2492, 15094, 21195, 1630, -24175, -32158, -21011, -18131, -17791, -17079, -19521, -9823, -1312, -3597, -17458, -16357, -13427, -10387, -7683, -8691, -14141]
4311a4141m206j3434J2994K320J0717J4515P839K114j2684j0064J4548Q920j0024
4298I414r927j1693j200m698R96K994m963L250n09J068M258q42q613n374N203
4283b0636K225J2084N835p675j2968O617J3345r736j6453K77L817J4753l255k96
4269a2066J6241M214k0501j8249K864Q547J9571P534l52j240p726j0862R449P636
4255E060J0434n919m721n758o971J3980K1567o395j3812j8190J2018O411m769
4242B935n597J3919m63p736P66q025J1872J3439J662n89j2546J64J3843n574j9197
4227a127n725M616L356M462L7j1037K440m664j1832j0158O099O213J4926J0040
4213G646j1190j183J5251N331K474q685m510j4485q392Q294j148m982N992P963
$$ y = [-14141, -18347, -31781, -18787, -16467, -5750, 8765, 16604, 18718, 6034, -4030, 10518, 19438, 9414, -513, -12206, -13406, -18104, -17108, -14114, -19077, -15827, -16336, -15268, -11010, -11852, -20465, -25839, -20636, -18411, -6327, -492, -8167, -21135, -14518, -1173, -10909, -27362, -27085, -23268, -8515, -11770, -12066, 4175, 8389, -12112, -30361, -27497, -18950, 621, 8155, 7803, 6563, -1163, -12025, -2576, 5060, 15494, 9575, 4854, -904, -7875, 6105, 27672, 21277, 7465, -10725, 1293, 7704, 2935, -2662, 11257, 10794, 3058, 3824, -4201, 7671, 21110, 22772, 22183, 9637, 9801, 23644, 18070, -1127, -6852, -2236, 1120, 5582, 5619, -5418, -2978, -7642, -19474, -29632, -23533, -17320, -2394, 7646, -3544, -4727, 10524, 15855, 18329, 9644, 5134, -9351, -17743, -9449, -10597, -15579, -9587, -1624]
4199a624L698L58m764j2082j28N535K565j18k511R899M482K779j8917l440l841
4184a8109K87P239M175J2694m638L377K128o621j3695J928M994J5601N15M242
4170A4117M432p371L604r859k253M572n615o020r176P900J6818J0247j3921r785
4156b310R168J5343j295o531k0121l571J3893M504L008p843R852P768q37J585
4142B2613j213j2912j9340M075K072l167m344j3511J2502J4285J2349O480k0606
4129g17r542J3248P128l472Q223J161Q89j4537N287M100J533o485K369N875m754
4114A0306r142N757j2292j3138N16L276L063l078Q279l50N922o511k32q833J0614
4099e843L86p814n960p55J794O805Q05N244j9415L545l16R603J0932L945j1825
$$ y = [-1624, 2074, 2432, -2332, -14414, -14542, -9007, -6442, -6560, -9071, 828, 5310, 8089, -10828, -14268, -18109, -17822, -10583, -6408, 6286, 1648, 5025, 7153, 532, -13163, -11235, -6241, 9360, 9875, 14117, 18549, 11178, 14782, 4923, 2670, 7242, 1627, -4393, -13569, -5669, 11149, 21396, 7475, -2310, 6858, 22201, 20906, 14375, -5746, -9317, 4576, 9080, 12088, 4245, 14097, 21865, 21028, 22613, 21400, 8488, -10852, -6777, -4705, -7872, -12216, -25727, -13225, 1060, 13409, 19889, -717, -10259, 2989, 10117, 6645, 14868, 16029, 16918, 2381, 7668, 11768, 13301, 6816, 9185, 15060, 10306, 1164, 6921, -5371, -18509, -17993, -14717, -11654, -14732, -6453, -6803, -881, -7392, -7624, -16457, -5843, -5457, -13271, -19231, -19986, -18192, -11387, -10582, -5338, -24753, -21208, -21524, -11921, -989, 2956, -8869]
4084h869J760q136r068J8037P675M465m34k959o3j55j445j3694O234J611J217
4069c824J052r307q51P252L697J248K960J954Q643K651j3267J910q511r595M628
4054i360J2227J000K668J2158L538j730j3485j5197l156k764L438k097Q364M551
4040A55P276m282j1140K889P589O541n102p236j3571r27J5544n190O144J0113
4026H803k912K824N115l379p931Q47r613j7377J7504R522o042l118l479O959R925
4011G648J055j0931P086N826P284l252j2728j0289P224K094Q569M270p080j189
3997E587M386L215r429N89J0689K348o582o049j1761j0174L079K130L907J0213
3983B148O76o044k410P866J3831l998j4519o19q50P236j594N771R23k584N290
$$ y = [-8869, -7109, -15245, -24313, -6276, 1399, 5864, 5430, 2471, 2408, 2253, 808, -12886, -6652, -5041, -3824, -2772, -12079, -12930, -5678, -1981, -733, 2227, 4181, 12824, 15475, 2208, 4118, -4393, -13988, -9360, 2867, 3867, 6535, 18693, 22231, 20501, 7016, -8181, -11337, -14101, -10663, -12760, -4396, 155, 7431, 3149, -7991, -5102, 2487, 9028, 3926, -3310, -16881, -17808, -2264, -7454, -1310, 8803, 5891, 8715, 13830, 10451, 2520, 3367, -6246, -23623, -6119, 3403, -2639, -5757, -9236, -2277, 7648, 8703, -2228, 4858, 10684, 17968, 14716, 1988, -8301, -1077, 1017, 9586, 13856, 6776, 5587, 9973, 13188, 3759, 4348, 15037, 17385, 10803, 4754, -7007, -17181, -14102, -11972, -8065, 2148, 2824, -3220, -5630, 2236, 16067, 12069, -2450, -3069, -3919, 3317, 1723, 7494, 8417, 5833, 11123]
3968A1123O088m002j0437r561m311R565K29j3030M713J5622j645L597m271l040
3954F40j113L051p743j1157p835O182J0362r864r106M861r50J1347J3153N916
3940G744K487J042j1625M277n44r421q449M701l134j190K047J3403O997K3963
3926C2298J1615j2511j6418o868R908j499j3300J833j1512j4635N865K3281J355
3913I412j0556j4705K348n673O919n833j28K1664J0498J880N070j3569j4112j1211
3899a7996J2409j468J6k916J0733n751n30l355o606P265O600m475l035M76R601
3884I68P891J437j810j3366K54l919r70n205k409j0029M041N037J4248n096j071
3869i999J3292R604J705L520r042o686K882J378K415l014M222j299q704L133q221
$$ y = [11123, 17211, 13209, 2772, -6789, -11100, -1535, -1306, -14336, -9623, 5999, 4354, 7951, 3680, 640, -473, 2578, -5165, -16322, -24157, -17975, -7613, -17477, -26583, -21722, -22672, -11325, 1828, 7744, 10231, 11273, -352, 3925, 3381, -6040, -14489, -9788, -12922, -14112, -12065, 1338, 8335, 32298, 43913, 31402, 14984, 8116, 18024, 16525, 3225, 5058, -6454, -21089, -15224, 8057, 9412, -1144, -15849, -13501, -19174, -12255, -18088, -18216, 3448, 13946, 15826, 20896, 7327, -6785, -17996, -5587, -7055, -7039, -9955, 778, -4973, -5503, -8858, -15464, -8199, -1599, -6074, -9109, -8633, 968, 8859, 10296, 8486, -4880, -4626, -8545, -9515, -14720, -17129, -27158, -23117, -18080, -3832, -8928, -9999, 3293, 12897, 14602, 18122, 9080, 2394, 5276, 6654, 9069, 6055, 10277, 8978, 274, 3407, -4814]
3854d814n920M945k473j0536r011M412J4805P496O94M373m773j4924j2926Q74
3840b7778O271R430R560J784L663O885r854r729m722J6846O643j5757j6221R926
3826a3053O051q95K690j736J1284J0297j3133j8520j9192P021J7144l835l582
3813a9459N74M331R807j0107L567J4921r544q539J2679M159k905n528p244j803
3799a5091Q922j394l382j0700J952j523J6708Q24k558O937J0459L407L448L804
$$ y = [-4814, -10734, -5789, -8262, -18798, -27809, -23397, -8592, -1096, -402, 3971, -802, -15726, -28652, -27778, -21507, -12077, -2517, -733, 2930, 9815, -39, -9768, -14490, 2356, 8999, -6758, -22979, -13053, -7002, -7897, -5207, -6943, 4341, 14638, 1505, -17015, -36207, -29186, -12042, -15877, -19459, -18885, -14554, -4747, -14854, -11287, 3634, -5910, -14449, -1770, 2389, -516, -6044, -13288, -15091, -6169, -7563, -10945, -21645, -19693, -21216, -4508, -3684, -6242, 695, 11154, 14561, 18009, 21813]
$$ [...]
##END NTUPLES=NMR SPECTRUM
##END=
