##TITLE=Analysis number 319653
Compound Code cc 30646
Book Reference 486/12
Project Code adrs
Chemist Name simons
##JCAMPDX= 6.0         $$ Bruker NMR JCAMP-DX V2.0
##DATA TYPE= NMR SPECTRUM
##DATA CLASS= NTUPLES
##ORIGIN= Bruker BioSpin GmbH
##OWNER= nmr
$$ XWIN-NMR		Version 3.5
$$ Tue May 23 12:43:14 2006 GMT Daylight Time (UT+1h)  MAYBRIDGE\nmr@NMR_250MHZ
##.OBSERVE FREQUENCY= 250.131544655141
##.OBSERVE NUCLEUS= ^1H
##.ACQUISITION MODE= SIMULTANEOUS (DQD)
##.ACQUISITION SCHEME= undefined
##.AVERAGES= 16
##.DIGITISER RES= 18
##SPECTROMETER/DATA SYSTEM= dpx250
##.PULSE SEQUENCE= zg30
##.SOLVENT NAME= CDCl3
##.SHIFT REFERENCE= (INTERNAL, CDCl3, 0, 16.522)
##AUDIT TRAIL= $$ (NUMBER, WHEN, WHO, WHERE, WHAT)
$$ ##TITLE= Audit trail, XWIN-NMR		Version 3.5
$$ ##JCAMPDX= 5.01
$$ ##ORIGIN= Bruker BioSpin GmbH
$$ ##OWNER= nmr
$$ C:\u/data/dgb/nmr/ADRS/5010/pdata/1/auditp.txt
$$ ##AUDIT TRAIL=  $$ (NUMBER, WHEN, WHO, WHERE, WHAT)
(   1,<2006-05-23 12:42:35.30 +100>,<MAYBRIDGE\nmr>,<NMR_250MHZ>,
      <created by zg, POWCHK disabled, PULCHK disabled
       configuration hash MD5:
       84 BC 41 DB A1 6E 1D 46 DA 25 12 A5 C1 ED C5 3A
       data hash MD5: 64K
       DE 58 58 22 0A 2C 21 B2 66 F2 69 5F 30 2C 07 0F>)
(   2,<2006-05-23 12:42:54.15 +100>,<MAYBRIDGE\nmr>,<NMR_250MHZ>,
      <Start of raw data processing
       ef LB = 0.3 FT_mod = 6 PKNL = 1 SI = 32K 
       data hash MD5: 32K
       77 C7 5C DC 29 40 14 8C 74 60 8F 76 A4 0A 42 27>)
(   3,<2006-05-23 12:42:58.77 +100>,<MAYBRIDGE\nmr>,<NMR_250MHZ>,
      <apk 
       data hash MD5: 32K
       05 67 31 29 B9 72 35 76 1E D5 3D 69 A5 62 12 64>)
(   4,<2006-05-23 12:43:00.63 +100>,<MAYBRIDGE\nmr>,<NMR_250MHZ>,
      <abs ABSG = 5 
       data hash MD5: 32K
       23 BA E8 BC 4D 4A F7 78 A4 72 A0 DF B8 93 7D DA>)
$$ ##END=
$$ 
$$ hash MD5
$$ 4E 7F 00 0B B7 31 04 0D 2C 75 A0 EC 96 CC 8D 43
##$RELAX= 
##$RELAX= 
##$RELAX= 
##$RELAX= 
##$RELAX= 
##$RELAX= 
##$RELAX= 
$$ Bruker specific parameters
$$ --------------------------
##$DU= <C:\u>
##$EXPNO= 5010
##$NAME= <ADRS>
##$PROCNO= 1
##$TYPE= <nmr>
##$USER= <dgb>
##$AMP= (0..31)
100 100 100 100 100 100 100 100 100 100 100 100 100 100 100 100 100 100 
100 100 100 100 100 100 100 100 100 100 100 100 100 100 
##$AQSEQ= 0
##$AQ_mod= 3
##$AUNM= <au_zg>
##$AUTOPOS= <32 >
##$BF1= 250.13
##$BF2= 250.13
##$BF3= 250.13
##$BF4= 250.13
##$BF5= 500.13
##$BF6= 500.13
##$BF7= 500.13
##$BF8= 500.13
##$BYTORDA= 1
##$CFDGTYP= 0
##$CFRGTYP= 5
##$CHEMSTR= <none>
##$CNST= (0..31)
1 1 145 1 1 1 1 1 1 1 1 1 1 1 1 1 1 1 1 1 1 1 1 1 1 1 1 1 1 1 1 1 
##$CPDPRG= <>
##$CPDPRG1= <>
##$CPDPRG2= <>
##$CPDPRG3= <>
##$CPDPRG4= <mlev>
##$CPDPRG5= <mlev>
##$CPDPRG6= <mlev>
##$CPDPRG7= <mlev>
##$CPDPRG8= <mlev>
##$CPDPRGB= <>
##$CPDPRGT= <>
##$D= (0..31)
0 1 0 0 0 0 0 0 0 0.06 0 0 0 0 0 0 0.0002 0 0 0 0 0 0 0 0 0 0 0 0 0 0 
0 
##$DATE= 1148384553
##$DBL= (0..7)
120 120 120 120 120 120 120 120 
##$DBP= (0..7)
150 150 150 150 150 150 150 150 
##$DBP07= 0
##$DBPNAM0= <>
##$DBPNAM1= <>
$$ [...]
##$SUBNAM7= <"">
##$SUBNAM8= <"">
##$SUBNAM9= <"">
##$SW= 20.6930455092707
##$SWIBOX= (0..15)
0 0 3 0 0 0 0 0 0 0 0 0 0 0 0 0 
##$SW_h= 5175.983436853
##$TD= 65536
##$TD0= 1
##$TE= 294.16
##$TE2= 300
##$TE3= 300
##$TEG= 300
##$TL= (0..7)
0 120 120 120 120 120 120 120 
##$TP= (0..7)
150 150 150 150 150 150 150 150 
##$TP07= 0
##$TPNAME0= <>
##$TPNAME1= <>
##$TPNAME2= <>
##$TPNAME3= <>
##$TPNAME4= <>
##$TPNAME5= <>
##$TPNAME6= <>
##$TPNAME7= <>
##$TPOAL= (0..7)
0.5 0.5 0.5 0.5 0.5 0.5 0.5 0.5 
##$TPOFFS= (0..7)
0 0 0 0 0 0 0 0 
##$TUNHIN= 0
##$TUNHOUT= 0
##$TUNXOUT= 0
##$USERA1= <user>
##$USERA2= <user>
##$USERA3= <user>
##$USERA4= <user>
##$USERA5= <user>
##$V9= 5
##$VALIST= <valist>
##$VCLIST= <CCCCCCCCCCCCCCC>
##$VD= 0
##$VDLIST= <DDDDDDDDDDDDDDD>
##$VPLIST= <PPPPPPPPPPPPPPP>
##$VTLIST= <TTTTTTTTTTTTTTT>
##$WBST= 1024
##$WBSW= 4
##$XGAIN= (0..3)
0 0 0 0 
##$XL= 0
##$YL= 0
##$YMAX_a= 755052
##$YMIN_a= -865759
##$ZGOPTNS= <>
##$ZL1= 120
##$ZL2= 120
##$ZL3= 120
##$ZL4= 120
##$ABSF1= 16.522
##$ABSF2= -4.171173
##$ABSG= 5
##$ABSL= 3
##$ALPHA= 0
##$AQORDER= 0
##$ASSFAC= 0
##$ASSFACI= 0
##$ASSFACX= 0
##$ASSWID= 0
##$AUNMP= <proc_1d>
##$AZFE= 0.1
##$AZFW= 0.1
##$BCFW= 0
##$BC_mod= 0
##$BYTORDP= 0
##$COROFFS= 0
##$CY= 12.5
##$DATMOD= 1
##$DC= 0
##$DFILT= <>
##$DTYPP= 0
##$F1P= 14.0000005364418
##$F2P= -0.99999901652339
##$FCOR= 0.5
##$FTSIZE= 32768
##$FT_mod= 6
##$GAMMA= 0
##$GB= 0
##$INTBC= 1
##$INTSCL= 1
##$ISEN= 128
##$LB= 0.3
##$LEV0= 0
##$LPBIN= 0
##$MAXI= 10000
##$MC2= 0
##$MEAN= 0
##$ME_mod= 0
##$MI= 0
##$NCOEF= 0
##$NC_proc= -2
##$NLEV= 6
##$NOISF1= 0
##$NOISF2= 0
##$NSP= 0
##$NTH_PI= 0
##$NZP= 0
##$OFFSET= 16.522
##$PC= 1
##$PHC0= 170.1808
##$PHC1= 5.080259
##$PH_mod= 1
##$PKNL= yes
##$PPARMOD= 0
##$PSCAL= 4
##$PSIGN= 0
##$REVERSE= no
##$SF= 250.13
##$SI= 32768
##$SIGF1= 0
##$SIGF2= 0
##$SINO= 400
##$SIOLD= 32768
##$SREGLST= <1H.CDCl3>
##$SSB= 0
##$STSI= 32768
##$STSR= 0
##$SW_p= 5175.98343685301
##$SYMM= 0
##$S_DEV= 0
##$TDeff= 65536
##$TDoff= 0
##$TI= <Analysis number 999999
Compound Code 99
Book Reference 9
Project Code 9>
##$TILT= no
##$TM1= 0
##$TM2= 0
##$TOPLEV= 0
##$USERP1= <user>
##$USERP2= <user>
##$USERP3= <user>
##$USERP4= <user>
##$USERP5= <user>
##$WDW= 1
##$XDIM= 32768
##$YMAX_p= 334264316
##$YMIN_p= -115161
$$ End of Bruker specific parameters
$$ ---------------------------------
##NTUPLES= NMR SPECTRUM
##VAR_NAME=  FREQUENCY,     SPECTRUM/REAL,   SPECTRUM/IMAG
##SYMBOL=    X,             R,               I
##VAR_TYPE=  INDEPENDENT,   DEPENDENT,       DEPENDENT
##VAR_FORM=  AFFN,          ASDF,            ASDF
##VAR_DIM=   32768,         32768,           32768
##UNITS=     HZ,            ARBITRARY UNITS, ARBITRARY UNITS
##FACTOR=    0.157963299565203, 1,           1
##FIRST=     4132.6476996994, 0,             0
##LAST=      -1043.33573715361, 0,           0
##MIN=       -1043.33573715361, -115161,     0
##MAX=       4132.6476996994, 334264316,     0
$$ Real data points
##PAGE= N=1
##DATA TABLE= (X++(R..R)), XYDATA
$$ [...]
17170H69570k5618l5749k0332k2226k4983k2963r289q711j4049j7876j5537j3056
17158F39181k0875j5257j1496r449o289m447k245j963j1871o430o561j6010j1167
17145E15121p557q444j1170r218p849j1156j6827j2903j2904p970n780j6859j1465
17132C75019m684l815k1087j1893o498q213j0507o830m501q717j2958q331j4149
17119B52836o650m845m502j0584r614k233k051K233n107q490o190m869m275k621
17105A83038m24k302o473n355n386N0p502j4333j048L225K491K673q950q24o22
17090A38258l177o934J92r162l518k582K346L60J264k387j1524k553M93L094N27
17075A04697q169j3805m054L215M010L652M690p267q827k891K237q12J986Q065
$$ y = [869570, 843952, 808203, 787871, 765645, 740662, 717699, 708410, 699699, 685650, 667774, 652237, 639181, 618306, 603049, 591553, 582104, 575815, 571368, 569123, 567160, 555289, 548859, 542298, 526288, 515121, 507564, 499120, 487950, 478732, 470883, 459727, 442900, 429997, 417093, 409123, 403343, 386484, 375019, 370335, 366520, 345433, 333540, 327042, 318829, 308322, 301492, 296991, 288274, 275316, 266985, 252836, 246186, 241341, 236839, 226255, 216641, 214408, 212357, 214590, 209483, 200993, 194803, 189934, 185659, 183038, 182614, 180312, 173839, 168484, 163098, 163148, 155646, 141313, 140265, 143490, 145981, 148654, 139704, 138880, 138258, 135081, 128147, 128339, 119177, 115659, 113077, 115423, 115783, 117047, 114660, 103136, 100583, 101076, 104170, 104697, 96528, 82723, 78669, 81884, 85894, 89546, 94236, 86969, 78142, 75251, 77488, 76676, 78662, 86727]
17061H6727m865k249l849m49O002J722N220N170j649n017J533j113k960l159J148
17046H2212P625K606j1515j1121L911l980L283J964J554l217j62J650J331L377
17032G9518j995l181q691k018J751n102o311L148L863N594j842k794j318R3j815
17017E8900N0J165l608m036L365O096L242j064k029j1316m080J735l897q53L143
17002D6813Q28M657L19K813k231j766p888J13j545J156K421j687J907j39o54k40
16986D4877R04m422j591K333m347k013k028j523m114o648L716M370j450p943l857
16971A6264K362O275K108J104K542L722n163m439L087J133L45k47J026J32K517
16956C2768l702l204j548l173k423n401K497N134j74K672J552k230N095N060o643
$$ y = [86727, 81862, 79613, 75764, 75315, 81317, 83039, 88259, 93429, 91780, 86763, 88296, 87183, 84223, 81064, 82212, 89837, 92443, 80928, 69807, 73718, 69738, 73021, 74985, 76539, 73322, 73160, 74810, 76141, 79518, 77523, 74342, 65651, 63633, 65384, 60282, 53971, 57119, 60982, 66576, 64734, 61940, 60622, 60715, 58900, 58950, 60115, 56507, 52471, 55836, 61932, 65174, 64110, 62081, 50765, 46685, 48420, 44523, 43670, 46813, 47641, 52298, 52617, 55430, 53199, 51433, 43545, 43658, 42113, 43269, 45690, 44003, 45910, 45771, 45117, 44877, 45781, 41359, 39768, 42101, 37754, 35741, 33713, 32190, 28076, 21428, 25144, 29514, 28064, 20121, 16264, 18626, 24901, 27009, 28113, 30655, 34377, 29214, 24775, 27862, 28995, 29340, 29093, 30119, 30251, 32768, 29066, 25862, 24314, 21141, 18718, 13317, 15814, 20948, 20774, 23446, 24998, 22768, 27863, 32923, 26280]
16941B6280j396M289N67n247K250J503j905J778Q684L41n889m281r291p209O109
16926A6583K045o204n0p06m440N510M180m398O384O203q88j1960j1174J147l177
16911i45j888L311Q778M610o071J442J581P41m846K305M291J521k772o742j2378
16896g062N362Q684P60K337P621j546L518n396n925j560l997o67O357J2024N45
16881B1055k258K633M036K816r963k644K545l784m653R87L412K463J013K179J773
16866B1610j562j575o347J536M573o795l438N529j954n096n948N55J693n99J523
16851C705r274J545K090k321J215P705O605j1387r400N48Q141J182j53m500M092
16836b07O032L8N906M122J916j798m887l771j398m414j293k020N009N084L46q361
$$ y = [26280, 24884, 29173, 29740, 24493, 26743, 28246, 26341, 28119, 36803, 37144, 31255, 26974, 17683, 10474, 16583, 18628, 12424, 12374, 11668, 7228, 12738, 16918, 12520, 18904, 25107, 24219, 12259, 1085, 2232, -945, -2833, 478, 9256, 13866, 7795, 9237, 10818, 11559, 6713, 9018, 13309, 14830, 12058, 5316, -7062, -1700, 6984, 7744, 10081, 17702, 16156, 19674, 14278, 8353, 6793, 2796, 2129, 8486, 20510, 21055, 18797, 21430, 25466, 28282, 18319, 15675, 18220, 14436, 9783, 10770, 14182, 16645, 17658, 19837, 21610, 20048, 18473, 12126, 13662, 18235, 11440, 8002, 13531, 11577, 6481, 533, 1088, 2781, 2182, 3705, -5569, -4024, -1934, -4255, -3040, 4665, 11270, -117, -9517, -8969, -828, 354, 201, -4299, -207, 5825, 5863, 11769, 15891, 17807, 16009, 11122, 7351, 5953, 1539, 246, -1774, 3235, 8319, 8665, 304]
16820C04q596K328P571P006P45K83n907q190k05k336J77N445N534O034p52o664
16804B777k006o274L046P533L908k675K173L14m785n59m573j294K450k451k19
16789b635L530O329O98L089J456L508Jk097K822O489l896o063J762k098O011K522
16773B1428K763k648N232Q303N293N951R548J4472J8612J8311K0809J9079K3796
16760A70949K3716K9830M1489M8926M3894L6837K1627P922L967O761J9117L3987
16748D89022K5741R29k3095k1686l0896k9692j9089j7102j2243j7274k3960l7205
16736B83450m2408l7708k0645j9132j7363q942q262j0234q022j0231q532J22j261
16723I0832o795m174k475n915p631j0728L902l233j867n552n660m428M09j138
$$ y = [304, -8292, -5964, 1607, 8613, 9358, 9641, 3734, -4456, -4661, -6997, -6820, -1375, 4159, 10193, 9441, 2777, 771, -5503, -2457, 5076, 8984, 6309, 8482, 8796, 4011, 3452, -1121, -2415, 35, -2416, -2635, 895, 7224, 7922, 11011, 12467, 15975, 15976, 13879, 16701, 23190, 19294, 13231, 14993, 12895, 18906, 21428, 24191, 21543, 26775, 35078, 40371, 46322, 55870, 70342, 88954, 107265, 128074, 147153, 170949, 194665, 224495, 265984, 314910, 358804, 395641, 417268, 425190, 429157, 435918, 455035, 489022, 514763, 515692, 492597, 470911, 440015, 410323, 391234, 374132, 361889, 344615, 320655, 283450, 241042, 203334, 182689, 163557, 146194, 137252, 128990, 118756, 110734, 100503, 91971, 92093, 90832, 84037, 79863, 77388, 71473, 63842, 53114, 57016, 53783, 51916, 46364, 40704, 36276, 36685, 35547]
16709C5547j903j719L10j137j97l737o537l292O880L900q65q30m15J341n893j237
16693B0216O623M3m168K680r75j41q348l249n079O91n998N425N879l310j272O297
16677A5314j762l664m896L511M486K96K452l058m867J912n04o867k987K064J447
16662B877Q442J5207Kj1162p058k136o281O48K589j569J805J399n262k309K656
16647a52M338m181L926L273l274m488l267o643L448M039K120L139q05l367r88
16632b882M939J0678K124k499k990l969o445J0421M990o0k301n112m725k873J1128
16617A0424O309n137q857j704O108m776K445M072k479l347k742j59M452n9k976
16602A574n359n634M375J876R658N712m653k0M536M560L389m237o569n434M343
$$ y = [35547, 33644, 31925, 32235, 31098, 30901, 27164, 20627, 17335, 24215, 28115, 27250, 26420, 26005, 27346, 21453, 20216, 26839, 26882, 22714, 25394, 24419, 24278, 15930, 12681, 7602, 8293, 2295, 7720, 13599, 10289, 9017, 15314, 13552, 9888, 4992, 8503, 12989, 13285, 15737, 12679, 7812, 9724, 9220, 2353, -634, 1430, 2877, 11319, 26526, 26528, 15366, 8308, 6172, -109, 539, 3128, 1559, 3364, 4763, -499, -2808, -152, 4186, 5, 3931, 7204, 3930, -558, -3825, -10468, -7020, -2981, -861, 2278, 1473, -1894, -2882, 2057, 12735, 14859, 12360, 9370, 5401, -1044, 9377, 14367, 14307, 12006, 6894, 2169, -704, 10424, 16733, 11596, 2739, 1035, 7143, 2367, 4812, 8884, 6405, 3058, 316, 157, 4609, 4550, 1574, -3785, -9419, -5044, -3168, 6490, 12202, 7549, 7529, 12065, 16625, 20014, 15777, 9208, 3774, 8117]
16587H117o60j2686n043N055m84l948N359N610O34j162k493k845k027L39O71O373
16571H10K725J551k029l335L441L307k918o186o345j772M212K929l746L335j800
16556e821k63O005N52j309n369l490l423l21J1793k70j377r1n580J964J519N09
16540d972N873J697j0260r33O797J525n495K524J660J378J013m622q209J498J0741
16525B15m584m014k861J927Q694L535l629k949M373L453K917K994o040p662J015
16510b616J134K912N102l572j713K527K089j2141J058R338L091p33q150p037l977
16495a2688K70M736K414j548J174M254L219j25k04k393M529M925J528m121j050
16480D920k011l086r76l542M473M110n662K142J797k541l490o137l503K371L012
$$ y = [8117, 7457, -5229, -10272, -5217, -5701, -9649, -4290, 1320, 1954, 792, -1701, -4546, -6573, -6234, -5563, 810, 3535, 5086, 3057, -278, 3163, 6470, 3552, -2634, -8979, -10751, -6539, -3610, -7356, -4021, -5821, -6084, -79, 473, -836, -6205, -9695, -13118, -13439, -1646, -1916, -3293, -3384, -8964, -7000, -5481, -4972, 901, 2598, -7662, -8595, -1798, -273, -5768, -3244, -1584, -206, 807, -3815, -12024, -10526, 215, -4369, -8383, -11244, -9317, -623, 2912, -717, -3666, 707, 4160, 7077, 10071, 4031, -3631, -2616, -1482, 1430, 6532, 2960, 1247, 3774, 5863, -6278, -5220, 4118, 7209, 6476, -1674, -8711, -12688, -12418, -7682, -5268, -6816, -5642, -1388, 1831, 1706, 1502, -891, 3638, 8563, 10091, 5970, 4920, 2909, -177, -1153, -4695, -222, 3888, -1774, 368, 2165, -376, -3866, -10003, -13506, -11135, -8123]
16465h123n19o91l564M800O530m27J130K369K895m031n296m716L581R302O484
16450I724K480l241L317o621m144p405k189k135K352M921j743J374P049K551Q40
16435G130m962j2418m59L153J305N599m648l188L098j307J96L718L193k776K032
16420c34m030l44K148N77J060J473o899m263l826L559N785N899l102l28j194M302
16404D83o348m249L442O317K074j718o335K410O780j24j130j729K995R34k60K138
16388E680m359r307k752L909N833l985l100N305O107K633m17n362q973L738O796
16373A746K454j254j565p362K734R074L275k528k543P678m485Q46j470l749l423
16358e72K019j668n809Q51m070J996k840Q73J184J28J590m40J620K174N562J054
$$ y = [-8123, -8642, -9333, -12897, -8097, -1567, -1994, -864, 1505, 4400, 369, -4927, -9643, -6062, 3240, 9724, 12204, 8963, 12280, 5659, 1515, -5890, -8079, -10214, -7862, -2941, -4684, -3310, 3739, 6290, 7130, 2168, -10250, -10709, -7556, -6251, -652, -5300, -8488, -5390, -6697, -6501, -2783, 410, -2366, -334, -4364, -4708, -2560, -1983, -923, 550, -6349, -10612, -14438, -10879, -5094, 805, -2297, -2625, -3819, 483, -5865, -10114, -6672, -355, 1719, 1, -6334, -3924, 2856, 2732, 1602, -127, 2868, 3802, 3542, 5680, 1321, -7986, -10738, -6829, -996, -4981, -8081, -2776, 3331, 5964, 5547, 185, -8788, -5050, 1746, 4200, 2946, 1381, -5981, -3247, 5827, 9102, 6574, 4031, 11709, 7224, 8070, 6600, 2851, -572, 1447, -221, -6030, -5179, -9249, -7253, -10093, -9220, -8036, -7908, -6318, -6758, -5138, -2964, 2598, 3652]
16342C652l244L576l105l157M542K3q950l75J676j747M208L168L932m255k445
16327b501K702j724l998M81M926M194m150k968l997Q175Q97j224k418m948m26
16312f979Q48k217J620q5l357m253p07m70K063L596J316Q04J796k894j462M711
16296e670K904k921n332J604O506P711J334o103N41k155n677M322Q980J245o868
16281D21j3043J206P742K495j173j612M087o757n671O910N365O19l292Q49o31
16266b485m783Q07J379O89J192M991o93m515k000Q09j312N658M111j337J347L839
16250G697l139k838l063L665M353R25k789m060k40l48p770n250N623P651J070
16235A487o481q664P86N917N066K543l930J557M313J12J0515J191o198j0849j473
$$ y = [3652, 408, 3984, 879, -2278, 2264, 2287, -6663, -7038, -5362, -7109, -2901, 267, 4199, -56, -2501, 201, -1523, -5521, -5040, -114, 4080, -70, -3038, -7035, 1140, 2037, 813, -1605, -6553, -6979, -6131, -8348, -6728, -6813, -10170, -14423, -15130, -15600, -13537, -9941, -8625, -7821, -6025, -8919, -10381, -5670, -2766, -5687, -11019, -9415, -2909, 4802, 6136, 33, 574, -1581, -7258, -2936, 6044, 7289, 421, -12622, -11416, -3674, -1179, -2352, -3964, 123, -6634, -12305, -5395, -30, 589, -2703, -1854, -2485, -7268, -6461, -5082, -4393, -3201, 1790, 1097, -3418, -5418, -4609, -5921, -263, 3848, 2511, 3858, 7697, 4558, 1720, -1343, 2322, 6675, 7600, 4811, 751, 511, 163, -7607, -12857, -7234, 417, 1487, -4994, -13658, -12872, -6955, -1889, 654, -3276, -1719, 2594, 2706, 13221, 14412, 8214, -2635, -4108]
16220d108J756k571l129m813M131Q282n90k131M099m23K137l192k886L034L022
16205B618K576j907J848N28J252l689k373J238M539j065l071K823l357M185p629
16190a484j0802j042J955M542K478j321K081M752n309Q23p31k619o18P047n85
16175h33j282J366j158p110j766o81M004j954m346k665Q279L983M263m096k597
16160f593N273j383L274L808M451k590l177l439q978n679L024P53l541m665J1828
16145g634P800o723n898K986N859M55q279k198Q405l108M575J182j535k119n894
16130a2126n67N96j05J672k925J987K101o169Q305l81n864l475M521N106m63k11
16114g998J427q14J572R040P43J116N975K12r050l393q17j017J675J23o78m460
$$ y = [-4108, -2352, -4923, -8052, -12865, -8734, -452, -1042, -3173, 926, 503, 2640, -552, -3438, -404, 2618, 5194, 3287, 5135, 5663, 6915, 3226, 853, 2091, 6630, 5565, 2494, 5317, 1960, 6145, -1484, -12286, -13328, -11373, -6831, -4353, -5674, -3593, 1159, -4150, -3327, -4058, -6677, -7295, -248, -833, -2115, -749, -1907, -9017, -10783, -11464, -7460, -9414, -13760, -16425, -8146, -4163, 100, -3996, -6593, -1320, -2703, 571, 4379, 8830, 6240, 3063, -376, -9354, -15033, -12009, -11256, -14797, -19462, -7634, 166, -6557, -12455, -9469, -3610, -3155, -11434, -13632, -5227, -8335, -3760, -2578, -4113, -6232, -12126, -12693, -12097, -12202, -10530, -13455, -11468, -9367, -15536, -7231, -7612, -13476, -16951, -12430, -7324, -7787, -7998, -6571, -7385, -5813, 3227, 3970, 5086, 11061, 11273, 2223, -1170, -1987, -3004, -1329, -1206, -1884, -6344]
16098f344k022j813P974N238Q658q190k346N477M117k664o549q691n846K14Q872
16083c915K752n573P654M40m422l055m558L147M85o424o05N111M641j511r28j038
16067g799N375L579J887l321l315J370Q543m485Q31N797N87O361j377p144k222
16052D667o315j49J002j533K991M169N128L001p896r338M714N263j521k515o315
16037d647k862J270K106O480l313o020J780K187k555r155N329M282l06N73R310
16022D459n446q084K515M900k150K059Q220L63m600J514J0820K622m392k737n402
16007D661j307m576p700R63O74N29J239L724O185J466o044l379P41j367n894j452
15991a1537R103K735q926p906j3K531K578N372J018j951J647k573m241J36k926
$$ y = [-6344, -8366, -10179, -2205, 3033, 11691, 3501, 1155, 6632, 10749, 8085, 1536, -7155, -13001, -12787, -3915, -1163, -6736, 918, 1358, -3064, -6119, -10677, -7530, -7045, -13469, -14074, -8963, -4322, -5833, -6761, -7799, -2424, 1155, 3042, -279, -3594, -2224, 6319, 1834, 2665, 8462, 9049, 15410, 14033, 6889, 4667, -1648, -1797, -795, -2328, 663, 4832, 9960, 12961, 5065, -4273, 441, 5704, 4183, 1668, -4647, -7509, -6239, -4133, 2347, -966, -6986, -5206, -3019, -5574, -14729, -9400, -5118, -5424, -4851, 4459, -987, -9071, -6556, -1656, -3806, -1747, 6473, 6836, 2236, 3750, 14570, 17192, 12800, 10063, 4661, 3354, -1222, -8922, -7959, -7285, -6756, -5517, -1793, 4392, 5858, -186, -3565, -2824, -4191, -10085, -11537, -2434, 301, -8625, -16531, -16544, -14013, -11435, -6063, -5045, -6996, -5349, -7922, -12163, -12027, -14953]
15976a4953N527l300K164J0562N647M7j832J891l168o944J421l265L814K805R
15961D25M402m79j954k917q455m943L98J561k576j430q68l09O177J689l395j729
15945a4403J956l81J364Q620m858k195k977p409J45P005P428j921L511P320j775
15930A430m286p628M61L240M093K796K105L882K667q37j135J0218o622o682k864
15915H38L933N191k073J270l580K577k386q134O5k708Q02P502L674r250k087k5
15899d391j699K455J559l263L379j711J468q192l824M257j326L012M15N755N437
15884C331M523k282p435k954K492k222J488O145J338r433j4452L396N872L157
15870g036N534o545m549n561l212O861L529M622l974O20N691r03q253m582Q298
$$ y = [-14953, -9426, -12726, -10562, 0, 5647, 5694, 3862, 5753, 2585, -4359, -2938, -6203, -2389, 416, 425, 4827, 4348, 2394, -523, -8978, -13921, -13523, -11962, -14538, -15968, -16836, -17145, -10968, -9279, -12674, -14403, -12447, -12828, -11464, -2844, -7702, -9897, -12874, -20283, -20138, -13133, -5705, -7626, -4115, 3205, 1430, -2856, -10484, -10023, -6783, -2690, 106, 2211, 6093, 8760, 7923, 6788, 17006, 10384, 3702, 838, 4771, 9962, 7889, 9159, 5579, 8156, 5770, -2364, -2299, -5007, -4205, 3297, 6971, -2279, -4366, -4391, -6090, -3635, -2076, -5339, -1960, -3671, -2203, -10395, -14219, -9962, -11288, -8276, -7861, -2106, 3331, 7854, 5572, -1863, -4817, -2325, -4547, -3059, 3086, 4424, -5009, -19461, -16065, -10193, -7036, -1502, -8047, -12596, -18157, -21369, -14508, -10979, -6357, -10331, -9711, -4020, -4923, -13176, -17758, -9460]
15855i460J822K083m750o719L182L962N143Q465K730o209n508J908p969M208J1227
15840D115O570p533n589l175l42m051m223N453P819R215k470p457N063k662n082
15825d349j530k237q65k006n960m860K081P574J729m344k693R152L965m030Q170
15810b03J131l189o119q879l942K909L025P29j509P461M455J968j026l382k080
15795h651R03m1J176j030M519J256k539K349o21M625J250L40J049n202o268o76
15779g561L633N205M888P52n586m269o22J464l381J449L930r309m522L725k413
15764a2617M495J1311k237r419r742Q436Q673J549j150m38n376k63N814l20l373
15749d657L120Q82l492l166N119M249m921p120j338M472K400N213J740j63m345
$$ y = [-9460, -7638, -5555, -10305, -17024, -13842, -9880, -4737, 3728, 6458, 249, -5259, -3351, -11320, -7112, 4115, 10685, 3152, -2437, -5612, -5954, -10005, -14228, -8775, -956, 8259, 5789, -1668, 3395, 733, -4349, -5879, -8116, -8981, -10987, -16947, -21807, -19726, -12152, -10423, -14767, -17460, -8308, -4343, -8373, -203, 928, -2261, -8380, -17259, -21201, -18292, -15267, -14538, -16047, -8586, -4131, -2163, -3189, -6571, -8651, -7748, -7789, -6613, -7643, -3124, -1868, -4407, -2058, -2679, 1946, 3196, 3536, 4585, -617, -6885, -7561, -3928, 1277, 6165, 6917, 1331, -2938, -3560, -2096, -5477, -4028, -98, -9407, -13929, -10204, -12617, -8122, 3189, 952, -8467, -18209, -9773, -1100, 449, -701, -1139, -6515, -6778, -964, -1284, -4657, -1537, -655, -4147, -7313, -2194, 2055, -2866, -9986, -11324, -6852, -4452, 761, 2501, 2338, -2007]
15734b007k591K589L62K457m897M104L882k567l059K90J571j02m173Q09L347o34
15718f19l130J080K967O34l732p149n754k52N597K810k179K342P4P42L240n71
15702c900k031r97r79L704r048j702l000L659P119N208K934k893J003M09p269
15687g783J711K807L68L8o29o493M831k038L67L207L347pJ367m820j734P084j703
15670h0l904L947J047m891r560k531k95j4P915N242N011M38o615J382K555k030
15654b383m16l63L354m670n32N841rk02K269m391j1586J83Q495N233M199l211
15638A811k590J661j176l893l326J13Q627Q061j223j569j407l429q190k050N56
15623h024q585J867l525P812P184J605k70J756j550k462k189J17M887M945j352
$$ y = [-2007, -4598, -2009, -1647, 810, -4087, 17, 3899, 1332, -1727, -1437, 134, 32, -4141, -3332, 15, -619, -3749, -2669, 298, 932, -2800, -9949, -15703, -15955, -10358, -7548, -9727, -7385, -7311, -6569, -3329, -3900, -5931, -6928, -7907, -4203, -13251, -14953, -17953, -14294, -7175, -1967, 967, -1926, -923, -514, -7783, -6072, -3265, -2897, -2859, -3488, -9981, -5150, -7188, -6821, -3614, -267, -274, 1093, -3727, -5461, 1623, -80, -3984, -37, 1010, -3881, -13441, -15972, -16267, -16281, -8366, -3124, 1887, 2325, -4290, -2908, -353, -2383, -2799, -3162, 192, -4478, -5010, 831, 822, 620, 2889, -1502, -13088, -12905, -4410, 823, 5022, 1811, -779, 882, -294, -4187, -7513, -7400, 1227, 9288, 8065, 6496, 5089, 1660, -6530, -8580, -8024, -16609, -14742, -18267, -10455, -3271, -1666, -1936, -180, -1730, -4192, -6381, -6264, -1377, 3568, 2216]
15608B216l922O751k41j003K800J698J806o16K635j513k849m234n22n54K061n22
15592C991j669l597j205k724K7r20P14l73k802o051J141R231J1373M337J957k872
15576A0558l737o895o217l163K76J1531K994n340m834k989n322L754M458l409
15562h335j253q35r11J640L006M105j755n448K792L6qL059O515o13J31l453l655
15545d982l218K603M102k554L1j271j480k045N169L95m924l091p61L512P73N819
15529a922N028m000m328q70m142K379K022K788l157m651m332L980P404M538o923
15514f186r94n29K017m563k091j150k381J732J404P909m139M0j380j470o515J0163
15498h133R564p800n029R81O134P136k886r024k424N552K899L474r136k412O955
$$ y = [2216, -1706, 5045, 4804, 3801, 6601, 8299, 10105, 9489, 12124, 10611, 7762, 3528, 3006, 2452, 4513, 3991, 2322, -1275, -2480, -5204, -5177, -6097, -5383, -5756, -8558, -14609, -13468, -4237, 7136, 11473, 13430, 10558, 6821, -74, -6291, -9454, -9178, 2353, 5347, 7, -4827, -7816, -13138, -9384, -4926, -8335, -9588, -10423, -11334, -9694, -6688, -2583, -4338, -9786, -6994, -6958, -6966, -3907, 2608, 1995, 2126, -1327, -4982, -8200, -5597, -1495, -4049, -4018, -5289, -6769, -8814, -3645, -3250, -8174, -11265, -12026, -8514, -7741, -1922, 3106, -894, -5222, -6092, -10234, -7855, -5833, -3045, -6202, -10853, -15185, -11205, -3801, 737, -6186, -7180, -7709, -5692, -10255, -12346, -13496, -15877, -14145, -12741, -4832, -8971, -8931, -10311, -11781, -18296, -8133, 1431, -6369, -11398, -10417, -4283, 2853, -33, -9057, -11481, -5929, -3030, 444, -8692, -11104, -4149]
15483d149M264j199R19K928k356n851L551M564N44j683K920K5p998o819N663n123
15467i800m701n81N503m337m327K315O397L453R601J998j390J671k291m047j159
15452a695r19Q66L297J048l255N954M217R155L129O959J3470R372O721O761K916
15437F7996k821n114L288j959j7579j4548r805k542Q79o808k667j924K548l677
15423E267K593L4r779k495M036P448L235j764q096q58O681l919k336J824M603
15408F474m964p067j92P69K966N42M509j203j394J958r700k044Q098K120K781
15393C653M68m334n854l838K775j55K470k727K48N007L22L417j05k915P282K253
15377G967l701R5j348j817l436J721k543N777L838J258L793K103o583k392q873
$$ y = [-4149, 115, -1084, -165, 2763, 407, -5444, -1893, 2671, 3215, 1532, 4452, 4477, -3521, -10340, -4677, -9800, -14501, -15082, -9579, -13916, -18243, -15928, -9531, -6078, 3523, 5521, 4131, 5802, 3511, -536, -1695, -2614, -1748, 1549, 2597, -658, 5296, 9513, 18668, 21797, 28756, 42226, 51598, 58319, 65080, 67996, 65175, 60061, 63349, 61390, 43811, 29263, 19458, 16916, 17795, 10987, 8320, 6396, 8944, 5267, 7860, 7894, -1885, -4380, -344, 7104, 10339, 8575, 479, -379, 6302, 2383, 47, 1871, 6474, 1510, -5557, -5749, -4980, -2014, -1472, 3037, 1834, 440, 2398, -7302, -9346, -1248, 872, 3653, 4121, -213, -6067, -9905, -7130, -7285, -4815, -7542, -7294, -2287, -1965, 1452, 1347, -1568, 5714, 7967, 4266, 4361, 3013, 1196, -2240, -519, -3062, 2715, 6553, 7811, 11604, 13707, 7124, 4732, -4141]
15362d141q55N874L912m118j936J625J54K017N335q37m585q28L84O777L162n411
15346F529n232K06K27L705n585L606j383k914l856J989K626k031j0049K954J731
15331g477O229n04k972j331j446n766l81Q47J358R064J488k226q641k096O228
15316g626q05M416j368L114k061j012J014M226m708R170J1163J941q085l391r251
15301c263r580k091M082N052K51N592m620p800J583O49k899M141J942j105K108
15286e958m38P69j777l267L231K448l70n667K507M963o23o787K654L991Q815J674
15270F165l953l526K104p254n025N354r841P971Q316j720j873K941O040k2k64
15255E413Q68K75l304r72l8k059n39L167O996k90p356N999k080n843J565M580
$$ y = [-4141, -4996, 878, 4790, 672, -1264, 361, 515, 2532, 7867, 7030, 2445, 1617, 2001, 8778, 11940, 6529, 1297, 1503, 1730, 5435, -150, 3456, 2073, -841, -4697, -2708, -82, -2113, -12162, -9208, -7477, -1248, -1752, -4724, -6055, -7501, -13267, -13648, -12801, -11443, -2379, -891, -3117, -11758, -13854, -7626, -8431, -4015, -5383, -2269, -4330, -5342, -4328, -102, -4810, 4360, 15523, 17464, 9379, 5988, -3263, -12843, -14934, -10852, -5800, -5549, 43, -4577, -12377, -10794, -10145, -13044, -8903, -6961, -8066, -5958, -6396, -5627, -7404, -10671, -7440, -4992, -5362, -11029, -8522, -3559, -4182, -10969, -8315, -4324, 4491, 6165, 2212, -1314, 790, -6464, -11489, -6135, -15976, -8005, 311, -1409, -3282, -341, 5699, 5677, 5413, 6281, 6556, 3252, 2280, 2242, 183, -356, 2811, 9807, 9517, 2161, 8160, 6080, 237, 1802, 6382]
15239F382l595N54L672n0k233Q011K38m493k403j712p9q77j035R81k207m338K341
15222h43L891K461n22p004o154L177n3j730K533K199m500l742J390M154l47j489
15206f579K766l91k452o367L81J844J456l5P290J1106m963j0239j980L2j040O967
15190b204m002L725L045Q77L124l519l372k010k771O392l056n26Q76q888o805
15175a9114j83M213J1819K250n981K29K986J483k951L436j149n428n50L526J862
15160c552j817P213P658K402r957m803K792M039L249L087L267K601q019r587M936
15145C509l965n82l671j529k339n566j408J618n544N620L709J463P736l899l543
15130h391L093M26j14M393L042j748j0227l308R63N602K468Q11L505L336m510
$$ y = [6382, 2787, 3341, 7013, 6963, 4730, 12741, 12979, 8486, 6083, 4371, 4292, 3415, 2380, 3361, 1154, -3184, -843, 3048, 5509, 4987, -2017, -8171, -4994, -5047, -6777, -4244, -2045, -6545, -10287, -8897, -4743, -5090, -6579, -3813, -4204, -6656, -13023, -12642, -10798, -9342, -9377, -2087, 9019, 4056, -6183, -8163, -8131, -9171, -2204, -6206, -2481, 564, 1441, 4565, 1046, -2326, -4336, -7107, -715, -3771, -4297, -3421, -12309, -19114, -19297, -15084, -3265, -1015, -6996, -6767, -3781, -2298, -5249, -1813, -2962, -8390, -8940, -5414, -3552, -5369, 1844, 9502, 11904, 1947, -2856, -64, 3975, 7224, 10311, 13578, 16179, 8160, -1427, 3509, -456, -1038, -4709, -6238, -8577, -14143, -15551, -13933, -19477, -13857, -10148, -8685, -949, -4848, -8391, -5298, -4872, -4986, -593, 2449, 701, -9526, -12834, -11871, -6269, -3801, -2990, 515, 3851, -659]
15115f59p119k219k223j896m737q37N947P479L058m439l023M619j018N88J012
15100e467J879l317q60L979o255j836O853N690K355n632m349j299K043R247M694
15085G725j630j1764o840m884P935O768m621j377k235K363j833p19J974o94l254
15070a3086Q451L946m512k398L163j292J30M400J654L161j027J621m095J933j583
15055D66n115j128l251K96K515M422M659l315p527m325j665L325n318J90O425
15040i346L572r240J372N148o03j426N839m605j019l94N210O7r43K891M480O94
15024A697k436k167p092n70l764L765L366l678J37N002M731M92j73O551n415j0642
15008a0196k65K774j070j491J580J989Q517r99p951m862N263M144k236l750n296
$$ y = [-659, -7778, -9997, -12220, -14116, -18853, -19690, -13743, -6264, -3206, -7645, -10668, -6049, -7067, -6479, -5467, -3588, -6905, -7765, -3786, -10041, -11877, -5024, 666, 3021, -2611, -6960, -8259, -6216, 3031, 7725, 6095, -5669, -12509, -17393, -9458, -2690, -7311, -8688, -10923, -8560, -10393, -11112, -9138, -9832, -13086, -4635, -689, -5201, -7599, -4436, -5728, -5598, -1198, 456, 3617, 2590, 4211, 116, 2049, 466, -4649, -5777, -9028, -8732, -6217, -1795, 2864, -451, -7978, -12303, -13968, -10643, -15961, -15771, -9346, -5774, -15014, -13642, -8494, -9097, -10523, -4684, -9289, -10308, -10702, -5492, -5425, -6368, -3477, 1003, 1697, -739, -2906, -9998, -10568, -14332, -10567, -7201, -10879, -10742, -5740, -1009, -517, -690, 5861, 446, -10196, -10461, -7687, -8757, -10248, -8668, -6679, 1838, 839, -7112, -11974, -6711, -2567, -4803, -8553, -13849]
14993a3849O00J225K791P318k016k633Q522K011r116K433Q501J007K405L48n698
14978C849m025o65K646P936J308j349o906j0659o92J673o774N88Q247O251m212
14963b784L641K671J986m184q124k710P376k63m351k486j898Q538L384j2142K698
14948h648J2906m778L253j896k583m877j465l679j69K607K653M453j64o630k907
14933a1924M654O331L691L988m204m94l558m643n800k466M1N552Q120L743k341
14918F90k289L995m001n639O80q20r470N932R313N602l520k942n29K49o488P47
14902h490P941R297N93m468p158K346k341k291J199k432k914k09P9O954k725q43
14886e462J78l70m10j354k52k038o648P631M501n88j068n882j286N413Q252O455
$$ y = [-13849, -13249, -12024, -9233, -1915, -3931, -6564, 1958, 3969, -5147, -2714, 5787, 6794, 9199, 9547, 3849, -176, -841, 1805, 9741, 11049, 9700, 2794, -7865, -8557, -6884, -13658, -13070, -4823, 1428, -2784, 857, 3528, 5514, 1330, -6794, -9504, -2128, -2391, -6742, -9228, -11126, -2588, 796, -11346, -8648, 4258, -520, 2733, 837, -1746, -6623, -8088, -11767, -11936, -9329, -6676, -2223, -2387, -9017, -11924, -7270, -939, 2752, 6740, 2536, 2042, -1516, -6159, -11959, -14425, -14384, -8832, -712, 3031, 690, -1599, 2396, -1605, -7244, -6564, -7384, -16854, -10922, -1609, 3993, 473, -2469, -2998, -2749, -9237, -8490, -549, 8748, 9341, 4873, -2285, 61, -2280, -4571, -3372, -5804, -8718, -8927, -8848, -1894, -4619, -5462, -5284, -5654, -6064, -7418, -7670, -9708, -16356, -8725, -4224, -4812, -5880, -11762, -13048, -7635, 617, 7072]
14870G072J615R12j628k912n416l537j331n609K614N131J278N447J566k255o128
14855c181n699l32J331N7J773O017M039n780j101N184m413q881o416M711L544
14840i147k88m420m034P06J647N355R464O798l579J054K697K479n928j729n266
14825d191n338k419k313K169M161n47l077O8M679j95O867P793j933k850O51l51
14809C174j42J841m935m282K219p998m77O284M245J46n647n954Q35J504N534j440
14793e093K203m997o54k000k854k280J014L797K064O051O41k576k332m617q18
14778a2451L199P983M029j91j009n083o545M390P2r062J612J935o930j843Q044
14763a1850R561L265L70L425R49L986L218m139j1969k185M058j410p671k444J080
$$ y = [7072, 8687, 9599, 7971, 5059, -357, -3894, -5225, -10834, -8220, -3089, -1811, 3636, 5202, 2947, -3181, -8880, -9212, -7881, -7824, -6051, -34, 4005, -1775, -2876, 2308, -2105, -10986, -17402, -12691, -9147, -9435, -13855, -17889, -17183, -15536, -10181, -717, 6081, 2502, 3556, 6253, 8732, 2804, 1075, -4191, -9529, -11948, -14261, -12092, -7931, -8478, -11555, -11487, -6808, -7003, -136, 7657, 5724, 2874, 3525, 3174, 3032, 4873, -62, -4344, -2125, -10123, -10600, -4316, -71, 75, -5572, -11526, -10691, -9187, -3653, -5093, -2890, -7887, -8541, -10541, -13395, -15675, -14661, -10864, -8800, -2749, -2108, -4684, -7016, -11633, -12451, -9252, -1269, 2760, 2569, 1560, -3523, -10068, -5678, -5606, -14668, -13056, -11121, -18051, -19894, -11850, -2289, 976, 1346, 4771, 5720, 9706, 12924, 8785, -3184, -5369, -1311, -2721, -10392, -12836, -11756]
14748a1756l407O25L144K948j505j282O930l159M742K514K004J376j789q254l503
14733a0372n005n778m45J0267m216j101l058k188j7M586N423L817l640o011r75
14718a8713L748r01j612R581L621j923l213k279q496n488L388J440M335O801J728
14703g983M62K576M315m458L990L050j325r554j396O792O588L391O38K067p77
14688H376r677j929k173q082k991N581k306P094N136M199K690l992q353j794L564
14673d657O335j044N559m72r649m658R44J583o617L130J0920L0k041r65J604N424
14657E426m406q744N52l296n321K641L831K153j211k840M249J195Q11j750J188
14642e522O018j258J198j62k769J767m249k047M814J773N984l624p101N049L841
$$ y = [-11756, -15163, -14538, -11394, -8446, -9951, -11233, -4303, -7462, -2720, -206, 1798, 3174, 1385, -6869, -10372, -15377, -21155, -21600, -11333, -15549, -16650, -19708, -21896, -21913, -17327, -11904, -8087, -11727, -17738, -18713, -14965, -15866, -17478, -7897, -4276, -6199, -9412, -11691, -20187, -25675, -22287, -20847, -16512, -9711, -7983, -7521, -4945, -630, -5088, -1098, 1952, 627, -8927, -10323, -3531, 3057, 6448, 7086, 9153, 8376, -1301, -3230, -5403, -13485, -16476, -10895, -13201, -6107, -971, 3228, 5918, 1926, -6427, -8221, -4657, 1678, 634, 6193, 5721, -3928, -8586, -7642, -6059, -12676, -9546, 1374, 1404, -637, -1602, 2, 5426, 1020, -7724, -7172, -10468, -15789, -13148, -9317, -7164, -8375, -11215, -6966, -5771, -4960, -6710, -5522, 496, -762, 436, 274, -2495, -728, -4977, -7024, -2210, -437, 5547, 1923, -5178, -129, 3712]
14627C712m499J990N297n706l427j0828o452l789Q466j260k731k615Q06R589M784
14612f663o76m39r58j997N65N331J963m752K397M721k964m830q00O284j250o101
14596a0169J225L550J03l420k305r10O571k446L20j628l382p91l570M15J2164
14581d273K461l01K566J485n233m062q999J548N536j634M202J0873J155q207l542
14566f425L892L007o937r540l415J16N704P095k673J859L693k221J238N882O029
14551G304j139k496k755K38j723Q456m904j1126L512M819k566k032J086j852k534
14536g712M559K102M663l674q256L467L055q42l105J17k19K958M197l957l100
14521e747N11P5N781p96O105N052n320o828o98j004J199k343n098N281j232m087
$$ y = [3712, -787, 1203, 6500, 794, -2633, -13461, -19913, -23702, -15236, -16496, -19227, -21842, -21036, -11447, -6663, -7339, -7778, -8736, -10733, -10168, -4837, -2874, -7626, -5229, -508, -3472, -8302, -9102, -2818, -4068, -10169, -8944, -5394, -5291, -8711, -11016, -11926, -5355, -7801, -7481, -9109, -12491, -13282, -16852, -16437, -4273, -1812, -2113, 453, 1938, -3295, -7357, -16356, -14808, -9272, -10906, -6704, 4169, 5324, -2883, -6425, -2533, 474, -6463, -16003, -19418, -19302, -13598, -6503, -9176, -7317, -3624, -5845, -4607, 1275, 7304, 6165, 3669, 914, 1152, -571, 7885, 2981, -8145, -4633, 186, -2380, -4412, -3326, -5178, -7712, -3153, -1051, 3612, -62, -8318, -4851, -1796, -2638, -5743, -5626, -5845, -2887, 1310, -2647, -5747, -5236, -5161, 620, -176, 5929, 10981, 5661, -1167, -1865, -2869, -1670, -4013, -9111, -3830, -5062, -9149]
14505i149m586l473k307O091O640L830l51J149N676K029n73k496n696J489K010
14490B83k247o167o098N285r06J861k639J573L769J031m649L372l366l944n88
14475a3430j184j233n751R196Q348j802L65L514n950j287O608q760l942M281j184
14460a2211J485j595k089O37O886K251n293k39P183j508n160P53O218P455K835
14445G608n974n123p08m375P082j857k958k085J0822L336j597k433K372K065K31
14430F406n037k608K763P998O450m456j1399O18J276m601p506J282R086N48N69
14415A389o14j258m588m9M261J221j679j330j729m428j192j742O908L777O139
14400E086m959l793J518j84M69L228L96o87j047j931p362q70M434K071j758k565
$$ y = [-9149, -13735, -17208, -19515, -13424, -6784, -2954, -3305, -2156, 3520, 5549, 4976, 2480, -3216, -1727, 283, -1964, -8131, -14229, -8944, -9850, -7989, -10628, -9055, -5286, -4255, -8904, -5532, -8898, -12842, -13430, -14614, -15847, -21598, -12402, -4054, -5856, -5491, -1977, -7927, -9214, -2606, -11366, -15308, -11027, -12211, -10726, -12321, -14410, -13773, -6887, -4636, -9929, -10168, -2985, -4493, -9653, -8900, -2682, 4773, 7608, 1634, -3489, -4197, -8572, -1490, -3347, -6305, -8390, 2432, 5768, 4171, 1738, 4110, 6175, 6406, 1369, -1239, 1524, 9522, 15972, 11516, 117, 735, 2011, -2590, -10096, -8814, 272, 820, 1389, 775, -483, -5071, -5120, -859, 362, -1317, -2647, -4376, -8804, -9996, -11738, -4830, -1053, 5086, 127, -3666, -2148, -2332, -1863, 1365, 1761, 1074, 27, -1904, -9266, -10136, -5702, -3631, -5389, -7954]
14384g954Q642N058n413j388Q68m622k999j236m766j970L664N487m166l797J127
14369a3465J829M157K325N380L841j832n779l883k707K837n440q77K028N488M295
14354a803m87P18n420J920o6j156M423K536p241r297n080J384P198R010j976k403
14338g740R20J997L273n780k490j574N40Q284j968l789n308m214o507K474L868
14323a8014M250k139J264N589k066j783O37P870L808K526k79k019n759n658K80
14308a1493Q36N727k532J702N35J56j905M7J222k25m017J167L725Q148l48k087
14292F58n349M507R729J048q204n541o298L843J309r18Q53L244k941k405m076
14277a0541k435L398k002r527o46O985k971J161Q48N958J979R363K428m868j628
$$ y = [-7954, 688, 5746, 333, -1055, -187, -4809, -7808, -9044, -13810, -15780, -12116, -6629, -10795, -14592, -13465, -11636, -7479, -5154, 226, 4067, 2235, -3544, -7427, -10134, -7297, -12737, -13614, -11586, -6098, -1803, -2290, -1572, -6992, -5072, -5138, -6294, -1871, 665, -6576, -15873, -20953, -19569, -12371, -3361, -5337, -7740, -6820, -4823, -1550, -7330, -9820, -11394, -10854, -2570, -4538, -8327, -13635, -17849, -24356, -21882, -18014, -13764, -15903, -14639, -9050, -11116, -12899, -12262, -4392, -584, 1942, 1663, -356, -6115, -11773, -11493, -10657, -4930, -7462, -5760, -5225, -5069, -6974, -6927, -5705, -5930, -9947, -8780, -5055, 3093, 2745, 658, -4691, -184, 9545, 10593, 2389, -3152, -9450, -5607, -4298, -5216, -4363, -1119, -4060, -6465, -10541, -12976, -9578, -11580, -21107, -21753, -14768, -17739, -16578, -15730, -9772, -7793, 1570, 3998, -870, -2498]
14262b498L613L28n802j422o2j348L37P552o24k828m53m678o519K756P876M957
14246A185Q264L920k395K10J219o199q893l021j63l712M730L014l81L96J757n191
14230e260J151KO532n710K946L839k731j935P41j626P298P89j443k661N429M161
14214A1522q427r467m208L772k889l481J1068R196J18j007J92l762j549n189l556
14199g667j698k864M172M216M784l634O73L388l824K795R87l987o720m348j066
14184a4793J293M108R030N876n417l730J324J234n323r59R619L816n712j870m472
14169e976o9N961N66K286m153n386M484P868j1655o285m454L926P192P306j251
14154C60J611k716o296J658L992k468k932N463K504P377j611n591n744k605N438
$$ y = [-2498, 1115, 1443, -4359, -5781, -5843, -7191, -6854, 698, 74, -2754, -3207, -7885, -14404, -11648, -3772, 1185, 9449, 13369, 10974, 11184, 12403, 6204, -2689, -5710, -5873, -9585, -4855, -1841, -2222, -1826, -69, -5260, -4109, -4107, 2425, -3285, -339, 3500, 769, -1166, -425, -2051, 5247, 6036, 4593, 1932, 7361, 11522, 3095, -6372, -10580, -6808, -9697, -13178, -2110, 7086, 7204, 6197, 6389, 2627, 1078, -4111, -7667, -9365, -12229, -8057, -3841, 943, -2691, -2018, 1370, -2454, 341, 1328, -2659, -9379, -13727, -14793, -13500, -9392, -362, 5514, 97, -3633, -2309, -1075, -6398, -7357, 2262, 6078, 366, -1504, -5976, -6045, -84, 482, 2768, -1385, -6771, -2287, 5581, -6074, -12359, -16813, -12887, -5695, 1611, 360, 1971, -745, -7041, -5383, -1391, -3859, -6791, -1328, 1176, 8553, 6942, 1351, -4393, -6998, -1560]
14139a560K018m476k572k307O842J3617J443j1128j798j108O419R694P84o75J61
14124A5354m246m111M933Q384L369l209J2407M980p5L630L121L471N636J8121
14110G1765K0199K1020M3838O4395J06321J48143J68967J58483J25554Q0558J6743
14099A025986j7067j2019J159l6614j27898j90680j76693j16774o4745m0838l1464
14088B12353k8760j5997o309o574r516o748j5406j5884r082k224o453k894J28
14075H6634k134q062q612m921j697J304k555j844n846m155M199P13q171j508q14
14060D2531m42j378p527o258O425L764K941j319q64L691L02k064o880l761m202
14045B4959m822j626R812J331q677m916j30l799K408J1086M026J71P178j0224
$$ y = [-1560, 458, -4018, -6590, -8897, -2055, 11562, 13005, 1877, 79, -1029, 5390, 15084, 15868, 15193, 15354, 11108, 6997, 11930, 20314, 23683, 20474, 32881, 37861, 37786, 41416, 44537, 48008, 53644, 71765, 91964, 112984, 156822, 221217, 327538, 475681, 644648, 803131, 928685, 1009243, 1025986, 1008919, 996900, 998059, 961445, 833547, 642867, 466174, 349400, 284655, 243817, 212353, 183593, 167596, 161287, 154713, 145197, 138449, 123043, 107159, 98077, 95853, 89400, 86506, 86634, 84500, 76438, 67826, 62905, 61208, 62512, 59957, 58113, 52267, 48112, 52311, 53024, 44853, 43345, 42531, 42089, 40711, 33184, 26926, 33351, 37115, 40056, 38737, 37873, 41564, 41866, 39802, 32922, 29161, 24959, 20137, 18511, 28323, 29654, 20977, 16061, 15931, 12132, 14540, 25626, 29652, 29823, 37001, 26777]
14031B6777j1666m732j346j820Q534R07l094k480N31l052k432M924o814j104P007
14016A0140k543M48j573L83M056k070J374K964K581r112N07K470K986j07j99o195
14000F110j1102j073Q230k802L277M393N07l589l944L774l654n943J093L273M461
13985C011K004m672l015l896J103M813M280N002k13l227l148l795R47k803K697
13970i12K226m214N56L68L560j818L730r79N25k123l358M595P346k838q861J69
13954b028M57n274l062q507p416Q333O971m31K229j275k809M042R250O388m602
13939B266m488N324m082L00M924M574p054l57l2k372l261l884k711L468k27p29
13923h341K109j395M515M55j450l29M500K070J373J64m501J282J901n266n336
$$ y = [26777, 15111, 10379, 9033, 7213, 15747, 16654, 13560, 11080, 11611, 8559, 6127, 11051, 4237, 3133, 10140, 7597, 8045, 6472, 6855, 10911, 8841, 10215, 13179, 15760, 6648, 7155, 9625, 12611, 12504, 12305, 6110, -4992, -6065, 2165, -637, 2640, 7033, 7540, 3951, 7, 3781, 127, -5816, -4723, -1450, 3011, 5015, 343, -2672, -6568, -5465, -652, 3628, 8630, 8417, 5190, 2042, -1753, -806, -3609, -912, 1314, -2900, -2344, -1976, 1584, -234, 3496, 2517, 3042, 919, -2439, 2156, 9502, 6664, -2197, -2028, -1571, -6845, -9907, -18414, -25830, -17497, -10526, -10957, -8728, -10003, -12812, -8770, 480, 6868, 2266, -2222, 3102, -980, -680, 4244, 8818, 1764, 1407, 1375, -997, -4258, -8142, -10853, -7385, -7612, -8341, -6232, -7627, -3112, -2657, -4107, -4436, 64, 2134, 3507, 3671, -830, 452, 2353, -2913, -8249]
13908h249O059M793l517j940k075J923j096j846k369K402l066p916L379J747Q206
13893c565M846l028O97p020K254M183q61j324J514M013N024J949m667k185L953
13878E783k092p486L608j363j121j0052k383M272r2M797Q804K218j604l661J472
13863A100j957k383N080q20M037L681n040n360q52j1K11L355K08o007l921p62
13847i441l75M196J331l196j039N003R488m3l602m267M105L580m188L470m11L262
13831G873R165m165p293J331n023p977m365L903N087j916J264N838Q041n81L51
13816A1533J067J973q127l542l246M88K750l260k220m980n139N874K957P731J665
13801E524M381l461q068j483p51Q37J543j74j063k676K172K835m236J106N160
$$ y = [-8249, -2190, 2603, -914, -2854, -4929, -3006, -4102, -5948, -8317, -5915, -8981, -16897, -13518, -11771, -3565, 1281, -1747, -1050, -8070, -5816, -1633, -2494, -3818, -2304, 1709, 6733, 8682, 4015, 1830, 5783, 3691, -3795, -187, -1550, -2671, -12723, -15106, -10834, -10926, -6129, 2675, 4893, 3289, -372, 1100, -857, -3240, 1840, 1020, 5057, 8738, 3698, -1662, -2514, -2525, -2314, 1041, 1249, -4758, -8679, -9441, -9816, -5620, -4289, -7485, -8524, -3521, 5967, 5924, 2322, -1945, 2160, 5740, 1552, 5022, 4611, 7873, 17038, 12873, 5580, 6911, 1888, -6089, -10454, -6551, -1464, -3380, -2116, 3722, 11763, 11182, 11533, 12600, 14573, 6446, 2904, -342, 146, 2896, -364, -2584, -7564, -12703, -6829, -3872, 3859, 5524, 9905, 6444, -1624, -3107, -3858, -3021, -1478, -1652, -2715, -5391, -3219, -384, -4620, -3514, 1646]
13786A646k618L769J794m837l451n728j205P158O582M350j968m870k149N241J1784
13771A5498p52j1463j1638j713M462m634j606O030O934q17J902L374o507j474
13757b404K421j975K011m15J227m254M20k416j224O036j461K217n420M96N979
13742A238L13j426n661o553J034J444J631r03Q40J840m342J904L311l102K515
13727e917N066m539j148R46j125K652N258j576M869m55K968J243p896k655K689
13712C80n036r897J441R96k390M087K577m65k013K784M029K879n157N518O706
13697F439j237p810K810L653K706k607j286p650n588q34J351M120M210l161j742
13682f626L263M673n09o507p593J793O591M482k503J725M708L903l339J541j1560
$$ y = [1646, -972, 2797, 4591, -246, -3697, -9425, -10630, -3472, 3110, 7460, 5492, 622, -1527, 3714, 15498, 14746, 3283, -8355, -10068, -5606, -10240, -11846, -5816, 1118, 301, 2203, 5577, -930, -2404, 17, -1958, 53, -362, 865, -3389, -2969, -5385, -6609, -573, -2034, 183, -5237, -4741, 1238, 1551, 125, -5536, -12089, -11055, -9611, -7980, -8883, -8043, -6203, -10545, -8641, -5330, -8432, -5917, -851, -5390, -6538, -5592, -6717, -4065, 1193, -383, 4486, 4031, 6999, 8242, 346, -2309, 380, -4656, -14553, -13112, -12116, -14506, -10419, -7842, -8307, -10320, -7536, -3507, -628, -5785, -267, 6439, 5202, -2608, 202, 3855, 6561, 3954, 2668, -4982, -10570, -11404, -10053, -5933, -1723, -4884, -6626, -3363, 1310, 801, -5706, -13299, -11506, -4915, -433, -2936, -1211, 3497, 7400, 4061, 5602, -5958]
13667e958n202J2713P700r625j4534J537N792O247L899O70k69J166N737j259o396
13652B218k541O290j667k559oj618L167j887j195J719M962L207n314m55k880l299
13636a858L283n420l578Q58P981M727j540j048M868l28p806l462q00O634n425
13621b914O46M746m2o546q83J507M792n700l245J501M259Q586k047j2675m25M8
13605h392M802j042K431j083r47l799J580j36n034k147L858M289M412K355L337
13590D484k793k542r37K086j384N59q084L31l610K639R369l92j609L28j392M229
13574A282L925J923r58K203j1730K516n46o722J994m890J312J998L039N433l925
13559c146n196J540O167k034K346M219K868J301o923j362N043K336j461O859n422
$$ y = [-5958, -11160, 1553, 9253, -372, -14906, -13369, -7577, -1330, 2569, 3239, 2970, 4136, 9873, 8614, 2218, -323, 5967, 4300, 1741, 1735, 117, 3284, 1397, 202, 1921, 6883, 10090, 4776, 4321, 1441, -1858, 1425, -3995, -7573, -6715, 1266, 5993, 4453, 3405, 8273, 7945, 139, -3323, -4123, 2511, -2914, -2268, 2478, 2436, -4110, -4993, -3486, 1306, -4394, -7639, -6138, -1879, 6707, 4660, -8015, -8440, -8392, -3590, -4632, -2201, -3284, -4231, -8030, -6450, -6586, -11620, -13767, -9909, -5620, -1208, 1147, 4484, 1691, -851, -1788, 298, -1086, -527, -8611, -8280, -11890, -9251, 118, -274, -1883, -1555, -2947, 1282, 5207, 7130, 6172, 8375, -3355, -839, -1385, -8107, -6113, -11003, -9691, -7693, -4654, 779, -3146, -8342, -6802, -635, -2669, -323, 3896, 6764, 8065, 1142, -220, 4823, 7159, 5698, 12557, 7135]
13544G135j1209N08M101l670n568M120N9L041N644o070l376K774k331j079O640
13529G19j38R64L336L950O743j921l616m499N334k164m087K150L897K27R42O92
13513A2529R3n043m529n921k084k519L344N45j056O793N836r498o598L504Q186
13498C582l000m448J124m77m472L708K646K760l955K26M129M246k019o253n459
13483g662R30N384k538n555P535O768m28M837n503m041J057L986k078K911q08
13468D795k594j693j505K567r83j427k748j315k613J256K624l51j253k983M206
13453d017o00N651j008k370R90lk876K361M319q493o142M573R074K920p582j568
13437d771K772l754k725M850O260k101p57N659m532k395K894m171m698O45N07
$$ y = [7135, -4074, -3566, 535, -3135, -8703, -4583, -4524, -1483, 4161, -1909, -5285, -2511, -4842, -5921, 719, 581, 1545, 4881, 8831, 15574, 13653, 10037, 5538, 10872, 8708, 4621, 6771, 10668, 10895, 11837, 12529, 12622, 7579, 3050, -2871, -4955, -7474, -4130, -3585, -4641, 2152, 7988, -1510, -8108, -4604, 3582, 582, -3866, -2742, -3219, -7691, -3983, -1337, 1423, -2532, -2306, 1823, 6069, 4050, -2203, -7662, -6732, -1348, -3886, -9441, -1906, 4862, 4434, 9271, 3768, -273, 784, 4770, 2692, 5603, 4795, 2201, 508, -997, 1570, 587, -840, -3588, -4903, -7516, -6260, -3636, -3987, -5240, -8223, -4017, -4617, 1034, 26, -2344, -1354, -1357, -4233, -1872, 2447, -6046, -12188, -7615, 1459, 4379, -3203, -4771, -1999, -5753, -8478, -3628, 2632, 531, -226, 5433, 901, -1494, 1400, -2771, -7469, -6824, -6317]
13422f317L336o32j849k215M713K282j705M672j494m88N019k781k509n180K715
13407b433Q863L928m95L318k643L575P295k350p468J061L702o452j523L769P511
13392A9658j694j1292j675K965K633J901j466M929l520l547O497K890k359k244
13378A3676M759P290m388p629p533O374K177l405j217L376R08K495J278k232P29
13363A6658J734K771m168M115k022j0014p619k743R345R732m911j608j794l89
13349I087M337K095O973n55k582n036l060q94K370R77M472J48k040Q47J038K576
13333B0753l198m834j0571O20K053K397K07k027o78J316m037k313M370o45k412
13318A001M669Q235P36P69q625r399K836J453L171M077o47N128J436M343M828
$$ y = [-6317, -2981, -3613, -5462, -7677, -2964, -682, -2387, 2285, 791, 303, 5322, 2541, 32, -5148, -2433, 6430, 10358, 9863, 13181, 10538, 14113, 21408, 19058, 11590, 12651, 16353, 9901, 8378, 12147, 19658, 17964, 6672, 4997, 7962, 10595, 12496, 11030, 15959, 12439, 8892, 15389, 18279, 15920, 13676, 18435, 25725, 21337, 13708, 6175, 12549, 14726, 11321, 10104, 13480, 14388, 16883, 18161, 15929, 16658, 18392, 21163, 16995, 21110, 19088, 9074, 1455, -1288, 8057, 17789, 12878, 11270, 9476, 9087, 13424, 15519, 22492, 21937, 19355, 14319, 11259, 10365, 12735, 13712, 18184, 18332, 16292, 17139, 18177, 20753, 17555, 12721, 2150, 2770, 4823, 7220, 7427, 5400, 4722, 6038, 2001, -312, 4058, 3413, 1001, 5670, 13905, 14641, 15410, 6785, -2614, 222, 1675, 4846, 8923, 8276, 13404, 14840, 19183, 24011]
13303B4011R37n286l83j067O903n745o032o625P36l246M366K63N170l358J486
13288A2130l828j191L318n048K561L559K408j154L634R962m431p895Q68M894l624
13273A6163p128N905N736K275K244r683j24n513k082J0403P680l9K84j298l665
13258B1158k35j14j2723m747L324O185J092N66m603k817K102K394K821L485k13
13243A7675n521n425M433O703l795n857M287N167k920j837k204M49L269J5410
13229B9834P941o826j2667l060n409Q81N755J960M299Q707J189q237j346L858
13215B6879n399j892J519q152L028m73j2289k221N165R275K406k10k852r58K854
13200A6680q26m87O609O258L314M960Q290M325p38R367Q301O230L196N749J5854
$$ y = [24011, 24948, 19662, 19279, 18212, 25115, 19370, 13338, 6713, 7449, 4203, 8569, 8832, 14002, 10644, 12130, 8302, 7111, 10429, 5381, 7942, 11501, 13909, 12755, 16389, 26351, 21920, 14025, 14893, 19787, 16163, 9035, 14940, 20676, 22951, 25195, 15512, 15388, 9875, 7793, 18196, 25876, 25837, 26121, 24823, 21158, 20923, 20809, 8086, 3339, 6663, 12848, 13940, 14506, 9903, 7086, 9188, 11582, 14403, 17888, 17675, 12154, 6729, 11162, 17865, 14070, 8213, 12500, 17667, 14747, 12910, 10706, 11155, 14424, 29834, 37775, 30949, 18282, 15222, 9813, 10694, 16449, 18409, 22708, 31415, 32604, 24367, 23021, 26879, 21480, 19588, 21107, 12955, 15983, 15510, 3221, 1000, 6165, 15440, 17846, 17636, 14784, 13826, 16680, 15854, 15367, 21976, 28234, 31548, 36508, 44798, 49123, 48385, 57752, 66053, 72283, 75479, 81228, 97082]
13185I7082J1484K0090M8014O1128P9465J11679J13265J01021P5950L5253P835
13174G62266m27q08j1896m9793r0217j09254j04731q6133n7196l8217k6718j2901
13162A73975j731r948k0720j9448j316k597p692l420j4222j1275o889K660J505
13149G8882k476M45O28n353p15N538N738M155r379j0849p827o409N353Q539L214
13134F9484p078q373L115k480n627p191o46Q40L671J877M386l163j793m378L959
13119D6603j226r97k463on452J085j52k290k87o109l586N023K903j826R80m53
13103C1747j611M433P446K797l278j239l611l868o573O14L88K400l300k632M559
13088B8272p314M520J226J666N302j140n431M478P116l882r592n701P309m216
$$ y = [97082, 108566, 128656, 176670, 237798, 317263, 428942, 542207, 643228, 719178, 754431, 762266, 761839, 761031, 749135, 699342, 609125, 499871, 395140, 309007, 251811, 213594, 186876, 173975, 172244, 162296, 141576, 122128, 120812, 118215, 110523, 107103, 92881, 81606, 74717, 77377, 78882, 76406, 76851, 77479, 72126, 71411, 76949, 82687, 86842, 77463, 66614, 58787, 52378, 57731, 66270, 69484, 62406, 54033, 57148, 54668, 49041, 41850, 41204, 42044, 45715, 47592, 51978, 48815, 47022, 42644, 46603, 45377, 44380, 41917, 41911, 36459, 37544, 37392, 35102, 34815, 28706, 25120, 30143, 33046, 31220, 32200, 31747, 30136, 34569, 42015, 44812, 41534, 40295, 36684, 32816, 26243, 26857, 27245, 29645, 26345, 23713, 28272, 20958, 25478, 26704, 28370, 33672, 32532, 27101, 31579, 38695, 34813, 25221, 19520, 26829, 22613]
13074B2613j388M411l63p290L669k184m143N172M620K024k578r147q010m046o914
13059c554n795M011N718P213l173N326n771j423L523P810L604P348M199M795J213
13044C5044J241m68r198l780m34J187J741l38N881L415P38O032n408K46l228l342
13028B9329o011n400Q24R799L499J058l808l062P797p26j873J1119R661O552L449
13013F2207O713J3259N637M017K418Q518O288n21O625M801O677n390j883m415
12999A14951j336N319L200n291j2691j0521r650o454n637k899k558P8N931M450
12985G6892l526p349o231K755P061L467K295l267p39R47P035J39q203j309L515
12970G3482m644j790m000l766j897Q420J55r88Q36L733k516p48J268P455R838
$$ y = [22613, 21225, 25636, 25273, 17983, 21652, 19468, 15325, 20497, 25117, 27141, 24563, 15416, 7406, 3360, -3554, -9349, -5338, 380, 7593, 4420, 9746, 3975, 2552, 6075, 13885, 17489, 24837, 29036, 33831, 35044, 36285, 35817, 26619, 22839, 22405, 23592, 25333, 24995, 30876, 34291, 35029, 41061, 35653, 35899, 32671, 29329, 23318, 17918, 18742, 28541, 32040, 33098, 29290, 26228, 34025, 33299, 31426, 42545, 52206, 58758, 62207, 68920, 82179, 87816, 91833, 94251, 102769, 109057, 108536, 115161, 119962, 126639, 121249, 119366, 114951, 113615, 118934, 122134, 116843, 104152, 93631, 83981, 77527, 71890, 68991, 66433, 66511, 72442, 76892, 73366, 66017, 59786, 62541, 69602, 73069, 75364, 72097, 71358, 72305, 79340, 79479, 71276, 69967, 73482, 68838, 67048, 63048, 59282, 57385, 65805, 65960, 64972, 65808, 69541, 67025, 66277, 67545, 75000, 84838]
12955H4838L160j267J190L141J760j161m988O357P771M918R615P635M334n78Q390
12940A35115O346N134j085l208l908j1308j0215j4187k0492j3718o807j1060r533
12927D1074M458l444J830O14Q23N943L253J74j059K928J228k49p64K976j484n122
12911E3179M49J490l27M600P301r34J094o313P860P913R194L822O372M253n67
12896I9386K974M375M802J0473M002k365j724q796q4O293p3N97N840R282R882
12881A44864N633O983J4268N255Q797P161k535m073J419l488o081n081o764l27
12867A66031J554k158O473J2600J4364P868N638R901N236j086k334k572j08J0239
12853B31646N550R024L461M537K78m854N363Q052k057l877P134l998p193N268
$$ y = [84838, 87998, 86731, 87921, 91062, 92822, 91661, 86673, 93030, 100801, 105719, 115334, 122969, 127303, 126725, 135115, 141461, 146595, 145510, 142302, 138394, 127086, 116871, 102684, 82192, 68474, 61667, 50607, 41074, 45532, 42088, 43918, 44532, 45355, 51298, 54551, 54725, 53666, 56594, 57822, 57573, 56809, 59785, 58301, 53179, 53628, 55118, 54791, 59391, 66692, 65758, 66852, 60539, 68399, 76312, 85506, 89328, 95700, 99953, 99386, 102360, 106735, 111537, 122010, 126012, 123647, 121923, 113127, 113043, 119336, 119263, 119860, 125700, 134982, 144864, 150497, 157480, 171748, 177003, 185800, 192961, 190426, 186353, 187772, 184284, 178203, 173122, 166358, 166031, 167585, 165427, 171900, 184500, 198864, 206732, 212370, 222271, 227507, 226421, 224087, 221515, 221407, 231646, 237196, 246220, 249681, 254218, 254496, 249642, 255005, 263057, 261000, 257123, 264257, 260259, 253066, 258334]
12839B58334Q800O354q99K958q00l800k079j828q424r242N828P204n269M071M459
12824B65667J1078O847J3437J4468J4574Q397J145O059L876K509J3016J8304J6432
12811C95809J8025K6475J8557J6336K0512J3428M826M570L980p690p405j3249
12799D94174k466N517J8887K9580L0257L1924M0660M9770N0459O1525P7922Q1281
12787I69490P9561R1350J11348J33357J40616J37501J19488J08187Q5029O0654
12777B036581P9886J15581J44440J71485K01277K46768L06802L99886N21486O47744
12767D871936P49896Q20989Q76002R21616J019869J253570J690253K368879L371856
12758A7944866M982435P660369J1765275J6765102K0650049K1357443J8682574
$$ y = [258334, 267134, 273488, 272589, 275547, 274747, 270947, 268868, 267040, 258616, 249374, 255202, 262406, 257137, 261208, 265667, 276745, 283592, 297029, 311497, 326071, 334468, 335613, 341672, 345548, 348057, 361073, 379377, 395809, 413834, 440309, 458866, 475202, 495714, 509142, 513968, 518538, 522518, 514828, 507423, 494174, 491708, 497225, 516112, 545692, 575949, 607873, 648533, 698303, 748762, 810287, 888209, 969490, 1049051, 1140401, 1251749, 1385106, 1525722, 1663223, 1782711, 1890898, 1975927, 2036581, 2116467, 2232048, 2376488, 2547973, 2749250, 2996018, 3302820, 3702706, 4224192, 4871936, 5621832, 6442821, 7318823, 8240439, 9260308, 10513878, 12204131, 14573010, 17944866, 22927301, 30587670, 42352945, 59118047, 79768096, 101125539, 119808113]
12751A19808113J3275892N924850n9726j385405j7554p63004o498081j5733509
12743A14551576k2194099k1403480j5888972j0379514o694956m545947l280945
12736C0163663k496673k013894j694520j485666j329690j230406j165714j142438
12728A7604662j102470j025990r16123q11183p28537o69395o14407n58433m99992
12719A0678132m51739m21614m00106l64798l35459l08458k83705k62915k41302
12710G608036k25587k20711k16629k02433j88403j74779j73671j70682j71414
12701E863727j68291j59931j51930j44164j55900j57824j53259j50453j39963
12692D482012j42299j32496j21109j13377j06326j07570j02607r6697r4013r4306
$$ y = [119808113, 133084005, 139008855, 138949129, 137563724, 137546170, 136783166, 130285085, 114551576, 92357477, 70953997, 55065025, 44685511, 37990555, 33444608, 30163663, 27666990, 25653096, 23958576, 22472910, 21143220, 19912814, 18747100, 17604662, 16502192, 15476202, 14560079, 13748896, 13020359, 12350964, 11736557, 11178124, 10678132, 10226393, 9804779, 9404673, 9039875, 8704416, 8395958, 8112253, 7849338, 7608036, 7382449, 7161738, 6945109, 6742676, 6554273, 6379494, 6205823, 6035141, 5863727, 5695436, 5535505, 5383575, 5239411, 5083511, 4925687, 4772428, 4621975, 4482012, 4339713, 4207217, 4086108, 3972731, 3866405, 3758835, 3656228, 3559531, 3465518, 3371212]
12682C371212q8147r1644r7011r5252q5875q0002q5415q4698o7936o6957o5736
12671B462539o4431n2302n2218o0883o2896o2483n5180n8800o0881o1278n5019
12660A816168n5306m9153m3026m1533l4237m6743m9001m1484l3435l7955l7892
12649A346403l3713m1806m1379l2653k9297k8013k1191k7482l1206k3118j8497
12638A018048j8497j7513k1495k0624j1140n645m317j0902k382L829K949P352
12626I19663M364l518j5696k3956j9644j6322k6581l8701l4290k5182k2086k6696
12614F71355k4641k0722j2784o409j8523j6106j3266k8626k3056k0882k1788j5163
12602D49389j5874j1735j4773j4181j0046k3521j1871l438m057j3300p933r12
$$ y = [3371212, 3283065, 3191421, 3094410, 2999158, 2913283, 2833281, 2747866, 2663168, 2595232, 2528275, 2462539, 2398108, 2345806, 2293588, 2232705, 2169809, 2107326, 2052146, 1993346, 1932465, 1871187, 1816168, 1760862, 1711709, 1668683, 1627150, 1592913, 1546170, 1497169, 1455685, 1422250, 1384295, 1346403, 1312690, 1270884, 1229505, 1196852, 1167555, 1139542, 1118351, 1090869, 1059663, 1036545, 1018048, 999551, 982038, 960543, 939919, 928779, 923134, 918817, 907915, 905533, 909362, 912311, 919663, 924027, 920509, 904813, 880857, 861213, 844891, 818310, 779609, 745319, 720137, 698051, 671355, 646714, 625992, 613208, 606799, 588276, 572170, 558904, 530278, 507222, 486340, 464552, 449389, 433515, 421780, 407007, 392826, 382780, 359259, 347388, 343950, 339893, 326593, 318660, 317748]
12590C17748j1279j4585j2265j0103j1351r801j4705j6433m236j0980k945n237
12578A93828j221O002j528m469j355M312N969j153m472j491m974j4525j1128q507
12564A55288j5356k4119j6059j3680m077n22n895r547n371M880J6724J0017L893
12551I6176K240l06M54P775J207o126o800M316K491L351K65M631N752J871N318
12536A22615k245n197l637L047R78k080L505k012k668m360o021j897n289p833
12522H6906N354O864j400p404m130L581M079K381n031o757k966J608o598J461
12508G7948n892N072O72o040L240j592o880q98J461N04J480L094M526Q580L386
12493H8661p141q837l180O815k978l463k825m867M131J1408j71r80m129M291L224
$$ y = [317748, 306469, 291884, 279619, 269516, 258165, 248364, 233659, 217226, 212990, 202010, 199065, 193828, 192607, 198609, 197081, 192612, 191257, 195569, 201538, 200385, 195913, 194422, 189448, 174923, 163795, 155288, 139932, 115813, 99754, 86074, 81997, 81475, 75580, 66033, 60662, 65542, 82266, 92283, 96176, 98416, 98110, 98564, 106339, 107546, 101420, 94620, 98936, 101427, 104778, 105043, 109674, 115426, 117297, 122615, 120370, 115173, 111536, 114583, 115561, 113481, 116986, 114974, 112306, 107946, 101925, 100028, 94739, 86906, 92260, 99124, 97724, 90320, 86190, 89771, 93850, 96231, 91200, 84443, 81477, 83085, 76487, 77948, 72056, 77128, 77800, 71760, 75000, 73408, 66528, 65630, 67091, 67595, 69075, 72169, 76695, 85275, 88661, 81520, 72683, 69503, 76318, 73340, 69877, 67052, 62185, 66316, 77724, 77553, 76573, 72444, 76735, 79959]
12478G9959K725Q603l883m764M356m578k750K228j726o347O68J995j373J728p638
12463F9203o083n96j319m777k686K488l753n069J362L39J037p342R71k937r519
12448C1319o295N532J1541J771K576N2L503P155j808n868j155p58R94q253r996
12433C0310K297M592n05j572q199k542J93P442K028l724k82N583J016P62j1173
12418B6226k561M036K515l406j2054o076J095N283K811m844o043R492k289j448
12404A2737k1j366o105O957L814N41K055o509n219k984K799O055M017j641M579
12389A9709J944j965n866L297N161M786L366k021k114j0021p840p005M70n64p91
12374E46N567J2179l12m489l374J989O257K760k975j767J929P83P19J0830o71
$$ y = [79959, 82684, 91287, 87404, 82640, 86996, 82418, 79668, 81896, 80170, 73823, 74491, 76486, 75113, 76841, 69203, 63120, 62524, 61205, 56428, 53742, 56230, 52477, 47408, 48770, 49109, 50146, 42804, 43775, 40838, 31319, 25024, 30556, 42097, 43868, 46444, 46496, 49999, 57154, 55346, 49478, 48323, 47565, 48559, 40306, 30310, 32607, 37199, 36694, 35122, 26923, 24381, 24574, 32016, 34044, 30320, 30038, 35621, 36637, 37399, 26226, 23665, 27701, 30216, 26810, 14756, 8680, 9775, 15058, 17869, 13025, 6982, 16474, 14185, 12737, 12716, 11350, 5245, 12202, 16016, 16557, 18612, 12103, 6884, 3900, 6699, 12754, 16771, 15130, 19709, 21653, 19688, 13822, 17119, 22280, 27066, 30432, 28411, 26297, 16276, 8436, 1431, 1901, 1337, 546, 6113, 18292, 17980, 13491, 10117, 12106, 18363, 21123, 18148, 16381, 18310, 19093, 19812, 30642, 29971]
12359B9971k768n361L689J3614Q427N78j0774r502q137l57Q335P201k911k04M264
12344C6065n06j370N4l206l985j78l486j910J2718K418K694O168N939J0519R428
12329G1362N391J1319J8382K0600K8434N7395P9293J01736J18239J07009R2065
12318G11225N4446J3803p175j357m32l0367o5532j04021j18834j02902p0708m7048
12306B31098k8154j5775j4960r070j0903j0764j2292k579m894o454o093m457l615
12293A01088p308m483p778o199k50k059q452m404J330o574J684M415p00o104k024
12278E2182j910P079J0892J0654J306L391J5269K3365K2753M3260M5501N7122
12266B90864O4108N3969M0506J9780O093j230j1827k6347l7095m5326n3827m9530
$$ y = [29971, 27203, 21842, 25531, 39145, 47572, 48150, 37376, 27874, 19737, 19380, 27715, 34916, 32005, 31801, 36065, 35559, 34189, 34243, 31037, 27052, 26874, 23388, 21478, 34196, 36614, 39308, 45476, 51415, 61934, 71362, 76753, 88072, 106454, 127054, 155488, 212883, 292176, 393912, 512151, 619160, 711225, 765671, 779474, 772299, 770942, 770510, 740143, 674611, 570590, 451756, 348854, 278146, 231098, 202944, 187169, 172209, 163139, 152236, 141472, 129180, 126601, 121707, 115253, 109160, 104703, 101088, 93780, 89297, 81519, 75320, 75070, 73011, 64559, 60155, 61485, 54911, 56595, 61010, 60310, 54206, 52182, 50272, 57351, 68243, 78897, 80203, 83594, 98863, 122228, 144981, 188241, 233742, 290864, 354972, 408941, 449447, 469227, 475320, 474090, 462263, 435916, 398821, 353495, 299668, 250138]
12254B50138m1912l7663j7962j788j3732j0537j2943j3131q106o149m662j3578
12242F7975j1267N080J882m070n760j0855l269J326j891L54m108q271K468L457
12228C3051L294n060l211L277j132j1340q209n707p52P484Q140O397M651n62j549
12213B8772j783K261p32p850o396K837J806j610l841M316k155K863N965n43n829
12198A8081m506l669k941L616P820j677J602j876k911m091J880q69l930K092K866
12183A1487P448N160K480j95o570k726l180O03K863n617k651K358j392K251n844
12168F475m977l049M051M679m020L18K853k832k117J674k619k529R760J792r63
12153H496L54p181L376j294O282K410k143N793J528m216j107n426l958m201j657
$$ y = [250138, 208226, 170563, 152601, 150813, 137081, 126544, 113601, 100470, 92364, 86215, 81553, 67975, 56708, 61788, 63670, 59600, 53840, 42985, 39716, 41042, 39151, 39505, 35397, 27126, 29594, 33051, 36345, 31285, 28074, 31351, 30219, 18879, 10670, 4963, 4211, 11695, 19835, 26232, 30883, 30321, 28772, 26989, 29250, 28518, 20668, 14272, 17109, 18915, 17305, 13464, 17780, 15625, 18488, 24453, 23910, 18081, 13575, 9906, 6965, 10581, 18401, 16724, 18326, 16450, 13539, 9448, 11328, 10459, 6529, 8621, 11487, 18935, 24095, 26575, 26380, 19810, 17084, 13904, 14507, 17370, 11753, 9102, 11460, 10068, 12319, 6475, 1498, -1551, 2500, 7179, 3159, 3477, 6330, 3498, 1381, 3055, 436, -2093, 7667, 9459, 8496, 8850, 1669, 5045, 3751, 10033, 12443, 10300, 16093, 17621, 13405, 12298, 6872, 2914, -1287, -2944]
12138b944P842J1034j510m441j311m361j063j514n92Q546J332o210J373M126K106
12123A2413J986m196K143K182l062J5K197m248K376n21k617l950N317q58l747
12108E430N570k453o93M187M202K326J663m71l010q20N185O807R525J2209J7119
12093F6776K5418J8769J3155O178j655p399j1875j0994p259M720J3617K3746K2836
12080A56033N525r270k0813k6829k2937k0277q495k938j4722o387o966m82J490
12067B2932j625P128L937m035K488J426k036k220J633n277l346j967j282k680
12053A5076J775J243o293Q21J207L2k320j088j292l356l433J281k953Q46O310
12038G856K184M887n534l112m781m477P682K733J64j609J603K061k160J900O04
$$ y = [-2944, 4898, 15932, 14422, 9981, 8670, 4309, 3246, 1732, 1140, 9686, 11018, 4808, 6181, 10307, 12413, 14399, 10203, 12346, 14528, 11466, 11481, 13678, 9430, 11806, 11285, 8668, 4718, 10035, 9177, 5430, 11000, 8547, 7854, 12041, 16243, 18569, 20232, 19761, 16751, 15931, 21116, 27923, 37448, 49657, 66776, 92194, 110963, 124118, 130296, 128641, 121242, 109367, 98373, 91114, 95834, 109451, 133197, 156033, 161558, 152288, 131475, 104646, 81709, 61432, 52937, 49999, 35277, 28890, 21924, 21442, 22932, 21307, 28435, 32372, 28337, 30825, 32251, 30215, 27995, 29628, 24351, 21005, 19038, 17756, 15076, 16851, 18094, 11801, 12622, 13829, 13861, 11541, 10453, 9161, 5805, 2372, 3653, 700, 1546, 7856, 10040, 14927, 9393, 6281, 1500, -2977, 4705, 7438, 7602, 5993, 7596, 9657, 7497, 9397, 10001]
12023A0001j756o218n950m255m567R987N878R27n451L70O346p995l624J433K521
12008b353J947j34l203p429L394r07J396M150K865N428l726j75L712j812l069
11993H4l426L316K153l332p88J057J824P265M845J314J255n470m765J808N460
11978A2600j027m78NN616k036p733p254P92J239M160m062p839q66k643L307K893
11962c326l486l096N246O233L405N241l347J814j052k353Q04P711j328L450p223
11947H693j749r85K860N122l156j903L991L117M781K161Q98Q603L324k78O312
11932D1791J3208J1396K0241L5158O2488J00986J29377J02624O7884J8624r1002
11921E12775j62667j26785p1583l6526j4290l546j1166q488r884p499k097r904
$$ y = [10001, 8245, 2027, -3923, -8178, -12745, -2758, 3120, 4047, -1404, -1034, 5312, -2683, -6307, -4874, -2353, -406, -540, -3743, -11172, -7778, -8685, -7289, -3139, -274, 5154, 1428, 1253, 4965, 3153, 84, -3342, -26, 2127, -1205, -1993, -936, 888, 8153, 12998, 14312, 15567, 10097, 5332, 7140, 12600, 11573, 11095, 11100, 16716, 14680, 6947, -307, 485, 1724, 5884, 1822, -6017, -6883, -9526, -6219, -3326, -6812, -9908, -4662, 1571, 4976, 10217, 6870, 8684, 7632, 5279, 6083, 13794, 12466, 15916, 8693, 6944, 5959, 8819, 13941, 10785, 8882, 12873, 15990, 20771, 22932, 23830, 32433, 35757, 35479, 41791, 54999, 66395, 86636, 121794, 184282, 285268, 414645, 517269, 585153, 603777, 512775, 350108, 223323, 151740, 115214, 100924, 97378, 86212, 77724, 67840, 60341, 58244, 48340]
11909D8340j279o430l550N192j464l698l195m010K195J767k463k969l434l20q22
11894B3860o901M037L936J096j816j105j987n470P212K883l727o815m742O707
11880A7168N092J58j0086o516n706K022O532n97n219J840l66n258p43r86j173
11865c838K372o528l812L12P315O324N077P672K337n143l418m090r35L708L729
11850A1082J196K43J662j040m564p091K820O586J552n057J19k890k99K689J052
11835H060l237p98O471n52o007l618j422p34J805M200L722L106j213l832m573
11820A378o235j421O876O150n41L030j332k564j448j482J699k689q157L994M637
11805A895O75o006L570M17L868R49L874j0986l121J141L648O144q3l007k461M74
$$ y = [48340, 47061, 40631, 37081, 42273, 40809, 37111, 33916, 29906, 32101, 33868, 31405, 28436, 25002, 24682, 23860, 16959, 20996, 24932, 26028, 24212, 23107, 21120, 15650, 22862, 25745, 22018, 15203, 10461, 17168, 22260, 22418, 12332, 5816, 110, 2132, 8664, 8067, 2848, 4688, 4322, -936, -1679, -2665, -3838, -1466, -7994, -11806, -11494, -4179, 2145, 7222, 14894, 17231, 12088, 8670, 4580, 3645, 7353, 11082, 12278, 12521, 14183, 13143, 8579, 1488, 4308, 10894, 12446, 7389, 7508, 4618, 4319, 7008, 8060, 4823, 4025, 10496, 9944, 3937, 319, -1103, -1837, -32, 4168, 7890, 10996, 9783, 5951, 1378, -4857, -6278, 598, 6748, 6207, 9237, 7905, 5341, 3893, 2411, 4110, 1421, -6736, -2742, 1895, 2570, -3436, 134, 551, 4419, 5368, 9242, -1744, -4865, -3724, -76, 6068, 5985, 2978, 517, 991]
11789I91K148L77P62k747p082L322Q90j975m451j755P839J0395r79k223K225p53
11773F984l009K171K179m068L98M879l3Q31J483j714m078j872k220m830l88J364
11757a923J462J456k879K166O672k044k752K980n279k944L459n46N125k9k520
11742B404n102j161M488K223m615n802j789O154k68q136k079J5600Q188l033K734
11727I806J136k856L3l608L33L989k192k917k196L335P146k023l108m341j49J747
11711D135p79m493j175L053n166j647N610M295k14P686o671n191q19l735N409
11696B98L512J628L750K944L760p054j2940rM436k738J173j756K456m21j83N397
11680D253j30l02M17J152l245q580J244N622L492j540l59L81N09L205p712P87
$$ y = [991, 3139, 3516, 4278, 1531, -5551, -2229, -1339, -3314, -7765, -9520, -1681, 8714, 7735, 5512, 7737, 6984, 3975, 6146, 8325, 4257, 4655, 9534, 9501, 10332, 11815, 10101, 6023, 4151, 1931, -2899, -3287, -1923, -461, 995, -1884, 282, 6954, 4910, 2158, 5138, -141, -3085, 374, -172, 4953, 4924, 2404, -2698, -3859, 629, 2852, -1763, -7565, -9354, -3200, -3468, -11604, -13683, 1917, 10105, 7072, 9806, 10942, 8086, 8119, 4511, 4844, 8833, 6641, 3724, 1528, 4863, 12009, 9986, 6878, 2537, 2388, 4135, 3356, -1137, -2312, 741, -4425, -6072, -462, 3833, 3619, 11305, 4634, -557, -1376, -5111, 298, 3810, 5438, 9188, 12132, 15892, 8838, -4102, -4111, 325, -2413, -1240, -2996, -540, -961, -1144, 4253, 4123, 3821, 4238, 5390, 2145, -6435, -5191, 431, 3923, 2383, 2024, 2405, 2914, 6119, -1593, -806]
11664h06n887j609O137M246m062K966J249P869J06o626J321K601j81l694J095
11649D725J25l91L638N91p488J450j642N434K592k613l082L043O943l413J238
11634A1150k849n455J347N55J494J657o684J152p73m78K744k550p963o96R349
11619B000J073k107l680k150K022N755M408M847J026n275k588p355l080p34K720
11604c118J014k49k629K553O470l034j737l715m771k274K861R657P038L920m592
11589G394l129M953o500o079R857K083j565k007p694m123J894K021L631N685P084
11574A3505o368m684R51J593j420l201N452M824L184k043q550L01M468L442J660
11559A3114j792r057o033K104R58M090J57l186L600K669k84m677k952l343p525
$$ y = [-806, -6693, -8302, -2165, 2081, -1981, 985, 2234, 10103, 10209, 3583, 4904, 7505, 7324, 3630, 4725, 4850, 4459, 8097, 8688, 1200, 2650, 1008, 6442, 9034, 6421, 3339, 6382, 13325, 9912, 11150, 8301, 2846, 4193, 4748, 6242, 7899, 1215, 2367, 1594, 1116, 3860, 1310, -6653, -7349, 2000, 3073, 966, -2714, -4864, -2842, 2913, 7321, 12168, 13194, 7919, 5331, -2024, -5104, -5838, -3118, -2104, -2353, -4982, -2429, 4041, 1007, -730, -4445, -9216, -11490, -8629, 1028, 8066, 11986, 7394, 4265, 9218, 2718, -3361, 6496, 8579, 7014, 5007, -2687, -6810, -4916, -2895, 736, 6421, 13505, 7137, 2453, 3404, 4997, 3577, 376, 5828, 10652, 13836, 11793, 3243, 3544, 8012, 11454, 13114, 11322, 2265, -3768, -1664, -706, 3384, 3541, 355, 3955, 6624, 6340, 1663, -1289, -4632, -12157]
11544a2157k35L834L965N25m585l886R175N229o884m031O139P326K579k173n330
11529e09k511j570j156L36l698k420J857K308K941l787J617N527J659K155o82
11514B067k385K843Q27Q68L77L55k502J722j260K147N39l007n024L189O335l763
11498C328J897p95m136L465N736k480N99l001L163L982k435j683l957l622m620
11483d559n18P12o1M740K604n430l330K418Q759K710j289P100m189o909K050P752
11467A2560k160j122N026J1049j292m768m086k614j33l758J49j26k978O00k13
11452F134R61j994N131q60j481k634M261j597Q283K2q052p289k135k320O95N797
11436B922M394J655M878K317j875m309j899K696L767L618J623n5N46n515M671
$$ y = [-12157, -12392, -8558, -4593, -4068, -8653, -12539, -3364, 1865, -5019, -9050, -2911, 4415, 6994, 4821, -509, -3020, -4590, -5746, -5410, -9108, -11528, -9671, -7363, -4422, -8209, -6592, -1065, 594, 2749, 2067, -318, 2525, 3352, 4220, 4597, 4952, 2450, 4172, 2912, 5059, 5598, 2591, -2433, 756, 7091, 3328, 5225, 4430, 294, 3759, 9495, 7015, 7614, 4613, 7776, 11758, 9323, 7640, 3683, 61, -4559, -5077, -4365, -4426, 314, 2918, -2512, -5842, -3424, 5335, 8045, 6756, 13856, 9667, 2758, 4808, 12560, 10400, 9278, 14304, 25353, 24061, 19293, 15207, 12593, 12460, 8702, 8851, 8725, 5747, 6347, 6134, 7095, 5101, 10232, 9372, 7891, 5257, 9518, 7921, 16204, 16226, 8174, 885, -1250, -3570, -2875, 2922, 7316, 8971, 13849, 16166, 14291, 9982, 8083, 10779, 14546, 18164, 19787, 19732, 20278, 14763, 19434]
11421A9434o265p956K762l553k233K112m21j654K466P36K329p451m128L890J089
11406A157k314N738k322q623q9L536O862L769o853l173L722P10k137J058L034
11391D075m00O299N99K742l033n936k867m190J068J891J522K636R23J174K410
11376H913O372m476q444j776j613K555Q400J849J535J573J589l966n371J506l331
11361E315j794j697R98L590L341P552K92q750r659J518M780J776k129j601P062
11346A0594k615o191j153j041L424K644K462k575o140R258J436m232n295L35k613
11331a702j156L156N079J382L252J585M838m641k183M008j248l429m666L197M746
11316A2218N340l35m285J174k42k775L777M72m476j736j024m819o13M100K573
$$ y = [19434, 13169, 5213, 7975, 4422, 2189, 4301, 3880, 2226, 4692, 5428, 7757, 306, -3822, 68, 1157, -1157, 4581, 2259, -6364, -6453, -2917, 3945, 7714, 861, -2312, 1410, 2120, -17, 1041, 4075, 3675, 9974, 10573, 13315, 10282, 4346, 1479, -2711, -1643, 248, 1770, 4406, 5329, 6503, 8913, 15285, 10809, 2365, 589, -1024, 1531, 9931, 11780, 13315, 14888, 16477, 12511, 7140, 8646, 5315, 3521, 1824, 2822, 6412, 9753, 17305, 17597, 8847, -812, 706, 5486, 7262, 5133, 3532, 10594, 7979, 1788, 635, -406, 3018, 5662, 8124, 5549, -591, 8667, 10103, 5871, 576, 911, -1702, -2858, 298, 5377, 6759, 10011, 11596, 16434, 11793, 9610, 13618, 12370, 8941, 4275, 7472, 12218, 17558, 17223, 12938, 14112, 13870, 11095, 14872, 15344, 10868, 9132, 8108, 3289, 2676, 6776, 9349]
11301I349o302O658K969J522Q383k052n382M02J938j523K506q67L208p799J425
11286A4435L058n191l432l108k392K427k526J34J187O480K876K208k745l231l926
11271F254l742m218P399M848k455N41N953Q229m95j287J234p478p14n591j630
11256F848J225M097m088J089k93J490k553j680l677L946O84K887j324L746Q792
11241B1189K853k006n351n844n72M038l298k370J825n67J895N604O07o788J905
11226A3120N329J862K444j890m446n935M517k14N522N331k329q622l040l378J984
11211A0255P529L644M245O639Q410J046j1756j4525k947N501J678j503m049R0
11197A4257L198P88K507O037J353m375k741L013j909q71L33n49j0160L443J1018
$$ y = [9349, 3047, 9705, 12674, 14196, 22579, 20527, 15145, 15547, 17485, 15962, 18468, 17601, 20809, 13010, 14435, 17493, 12302, 8870, 5762, 3370, 5797, 3271, 3405, 4592, 11072, 13948, 16156, 13411, 10180, 6254, 2512, -1706, 5693, 10541, 8086, 8627, 14580, 22809, 22314, 21027, 22261, 14783, 14069, 8478, 6848, 8073, 12170, 8082, 9171, 8878, 10368, 7815, 6135, 2458, 6404, 7088, 9975, 8651, 12397, 21189, 24042, 22036, 16685, 10841, 10269, 14307, 11009, 8639, 10464, 9897, 11792, 17396, 18003, 11215, 13120, 18449, 20311, 22755, 20865, 16419, 10484, 15001, 14787, 20309, 25640, 23311, 14689, 11649, 8271, 10255, 17784, 21428, 25673, 32312, 40722, 41768, 30012, 15487, 12540, 18041, 19719, 18216, 14167, 14257, 17455, 18243, 20750, 26787, 28140, 23765, 21024, 24037, 22128, 21257, 21590, 21041, 10881, 14324, 25342]
11182B5342L660l99j855M299j217l753j643R257O142l845j404p436o162j999M294
11167B3281J017k45P79q127J393O106j271K585M002M751K869J10k580k107l383
11152B9180L098J710j68l639J95K448k154K99J614J918j213o398k202j730J713
11137B4671N971K397j020O559k688p339n658N02L301N712J886l522m787k042R208
11122C3151J765K877m31K717L891m343l778r159L193N101R54J081J635l415k408
11107C2831r507J799O497O24J468N278q31L890N332N741N560o849q241j554m120
11092C7918K559M623m134k742k950J400j131R03k194k456M770J1128n831p893
11078C3970M1J1522M972p701n353k776k111P02k702k9j617j229L041P32O200r75
$$ y = [25342, 29002, 28603, 26748, 31047, 29830, 26077, 24434, 33691, 39833, 35988, 34584, 27148, 20986, 18987, 23281, 24298, 24053, 24832, 16705, 18098, 24204, 22933, 25518, 29520, 34271, 37140, 37250, 34670, 32563, 29180, 32278, 33988, 33820, 30181, 30376, 32824, 30670, 30969, 32583, 34501, 33288, 26890, 24688, 22958, 24671, 30642, 33039, 32019, 38578, 35890, 28551, 22893, 23395, 26696, 32408, 34294, 30772, 25985, 23943, 33151, 34916, 37793, 37362, 40079, 43970, 39627, 35849, 26690, 29883, 34984, 35938, 37019, 38654, 35239, 32831, 23324, 25123, 31620, 32244, 33712, 38990, 38159, 42049, 47381, 53122, 58682, 51833, 43592, 42038, 37918, 40477, 45100, 40966, 38224, 35274, 36674, 35543, 36446, 34252, 31796, 36566, 47694, 41863, 33970, 34011, 45533, 50505, 42804, 37451, 34675, 32564, 33266, 30564, 30535, 28918, 27689, 30730, 31462, 37662, 36687]
11062C6687J371n486L17M201P59o40j049L812k871L790R69L096o090p557l544
11047B7765M017K951K073l892o673O825J4325K955k993J854R50P143L121j397
11033E9024r49M538M74r177q689N481N909J72k074J36J885K983p973o230q473
11018C7037r747K644M164l45j0437j732P905J426N843M023l485j988L602J029
11004C9939o96n21L858K4L246J373k678j31L54K795P970l134l931L098j608n953
10988D4005j174j32O849Q490K760P212J110n241j2394r280j0392m677l606j224
10974B2306N225J190P073M016K385P57M024j119o743L029N335O108Q11J317P902
10959F3616J847O027N707N32L239j487O747l489k580J2018J6148L587N286J6900
$$ y = [36687, 38058, 32572, 32889, 37090, 37849, 37209, 36160, 39972, 37101, 40891, 41860, 44956, 38866, 31309, 27765, 31782, 34733, 36806, 32914, 26241, 33066, 47391, 50346, 47353, 49207, 50157, 57300, 60421, 59024, 58075, 62613, 63087, 53910, 45221, 50702, 56611, 56783, 54709, 54845, 56730, 59713, 51740, 45510, 37037, 27290, 29934, 34098, 33753, 23316, 21584, 29489, 30915, 36758, 40781, 37296, 35308, 38910, 39939, 39243, 38722, 42580, 42604, 45850, 47223, 44545, 44414, 44768, 47563, 55533, 52399, 48468, 51566, 49958, 44005, 42831, 42699, 49548, 58038, 60798, 68010, 69120, 63879, 51485, 42205, 31813, 27136, 23530, 22306, 27531, 28721, 35794, 39810, 42195, 42952, 46976, 45857, 39114, 42143, 47478, 53586, 54397, 55714, 63616, 65463, 71490, 77197, 77729, 80968, 79481, 86228, 82739, 80159, 92177, 108325, 111912, 117198, 134098]
10945A34098K6390L0129M4472O5906J14580J88011K78310L43074L10433K06595
10935A741998P2457j65938l74918l61649k35474j44724r3307n6187m7200l4789
10925C00269k8018j8582j3014j0411k0027j9734j1759q158N195K790n134p571
10913A65846o85r068j1682J126Q291M954K390j116k0307k1034j2738j1853q872
10900H5252n29K653N229L045l058R186L007J669j159l83o068L188O85q372n416
10885H8929l656l284n141k208l118K32J558J2850O686p079j2915l697N71K097
10871G1825k152P26L742L798J386K491J427J46n743j31j109J471l191o363m346
10856F3977K754l174r042p250P842J0619N848J963J016q8k654p92m656q458k902
$$ y = [134098, 160488, 190617, 235089, 300995, 415575, 603586, 881896, 1224970, 1535403, 1741998, 1814455, 1648517, 1273599, 911950, 676476, 531752, 438445, 382258, 335058, 300269, 272251, 253669, 240655, 230244, 210217, 190483, 178724, 170566, 175761, 178551, 173417, 165846, 165161, 156093, 144411, 145537, 153828, 158782, 161172, 160056, 139749, 118715, 105977, 94124, 85252, 84723, 87376, 92605, 95650, 92592, 101778, 104785, 106454, 105295, 104912, 98844, 102032, 102717, 94345, 88929, 85273, 81989, 76848, 74640, 71522, 71754, 73312, 86162, 92848, 85769, 72854, 69157, 69728, 71825, 69673, 70399, 74141, 77939, 79325, 81816, 83243, 83389, 77646, 77515, 76406, 77877, 74686, 68323, 63977, 66731, 63557, 54515, 47265, 55107, 65726, 71574, 73537, 74553, 74465, 71811, 71019, 66363, 57905, 55003]
10841E5003k484k291N596P422j780l365q87k654o785R64N408n565k918r656j8207
10826A7801j7889j8399j1437P965K0851K8324J9179J6340Q294J1494N859k47j3594
10813G4541q697o551n183j0321L512P181N064L111N194L401k06J618K008p11o759
10798F7202j386n90k982r560m661J547J0433L038J64n134N508Q130Q793J5560
10784I6062J3273R234J6952J5215J7125P240m35J377J980J0076K0187K4676J7244
10771B50206J0889m861K899O608j4216l6695k8874j1435j392o72O56o643m361
10758A62109n634j1038j6322j0315j542J223p10L84P006J0077M616M900J814M533
10744A51101P029P763k122k194l477J33M176n530q603n959k710n099Q80k145j788
$$ y = [55003, 52519, 50228, 55824, 63246, 61466, 58101, 57214, 54560, 47775, 48739, 54147, 48582, 45664, 36008, 17801, -88, -18487, -29924, -21959, -1108, 27216, 46395, 62735, 71029, 82523, 88382, 88135, 74541, 65844, 59293, 54110, 43789, 47301, 54482, 59546, 62657, 67851, 71252, 71046, 72664, 74672, 73961, 67202, 65816, 65226, 62244, 52684, 48023, 49570, 60003, 63041, 63205, 58071, 63579, 71709, 80502, 96062, 109335, 118569, 135521, 150736, 167861, 175101, 174666, 176043, 178023, 188099, 208286, 232962, 250206, 261095, 256234, 259133, 265741, 251525, 214830, 185956, 174521, 173129, 172457, 173113, 166470, 162109, 156475, 145437, 129115, 118800, 117258, 118481, 117771, 118155, 125161, 135238, 139854, 144754, 146568, 151101, 158130, 165893, 163771, 161577, 158100, 158233, 162409, 156879, 148276, 142317, 139607, 134508, 135388, 133243, 131455]
10729A31455M959J1352J0456P227K10J3n090j204K00q90P621J2417J1452O59j4286
10714A76551n077J1698J7611K9343L4921L5252K3202M17k166j1954l3739m2721
10702B33338l3663k0841k0747k0527j6242j9655m542n135R59P387J0603K114O636
10689A19685J0168J7363R490o653k557m492j5228r321l10R342J051J341j2076
10676A17803n588J005Q113L132L272J529J0680K1404K6909K2441J2679J1219J0472
10663B45070J932j2233r621o929l896l69M131Q593Q510R982J2480N685N423j547
10649B67211R061J1883J4398J5893K6487L9673L7322Rm4050m5783l4131k9004
10637B68969r552J4471K0902K3426K3501K0047J1949O942K9j953M275J1093R911
$$ y = [131455, 136414, 147766, 158222, 165449, 165659, 165672, 160582, 159378, 159578, 158688, 166309, 178726, 190178, 190837, 176551, 171474, 183172, 200783, 230126, 265047, 300299, 323501, 323918, 321752, 309798, 276059, 233338, 199675, 178834, 158087, 137560, 121318, 101663, 97121, 91986, 92945, 100332, 110935, 113049, 119685, 129853, 147216, 156706, 150053, 147496, 143004, 127776, 118455, 118145, 127487, 128538, 129879, 117803, 112215, 113220, 121333, 124465, 127737, 129266, 139946, 161350, 188259, 210700, 223379, 234598, 245070, 247002, 234769, 225148, 218219, 214323, 213954, 218085, 226678, 235188, 245170, 257650, 263335, 268758, 267211, 276272, 288155, 302553, 318446, 344933, 384606, 421928, 421937, 377887, 332104, 297973, 268969, 259417, 273888, 294790, 318216, 341717, 361764, 373713, 380655, 380684, 378731, 383006, 394099, 404010]
10624D04010Q834J0175k750n079M975K065j674J3065J0036J5009R917m314j5430
10611D48839j1981j0723j592N900J5245K2869K1509K2158J5993K979k082j6409
10599E12705k1540j7408j4245j4592j271J2796J3175K1941K5849K7873L4948K1421
10587F01652O520j577m361j7744j5806l051J2500K6717N1695P1048P3460O6022
10575H67075M1075Q200p424j4772j6655j2536j971o782p898n696p880k03L9588
10562H74121O5991Q4465J01593J02034J03695R7192R3890R9326J07500J01546
10552A831353J12406J26589J38881J65531J58007J50371J74666J93433K25789
10543C277026K64561L18581L88622M56552N44140O39892O99312P15998P06503
$$ y = [404010, 412844, 423019, 420269, 415190, 420165, 422230, 420556, 433621, 443657, 458666, 468583, 464269, 448839, 436858, 426135, 424543, 430443, 445688, 468557, 490066, 512224, 528217, 531196, 529114, 512705, 491165, 473757, 459512, 444920, 443649, 456445, 469620, 491561, 517410, 545283, 580231, 601652, 608172, 606595, 602234, 584490, 568684, 565633, 578133, 604850, 656545, 727593, 801053, 867075, 908150, 916350, 908926, 894154, 877499, 864963, 862992, 856210, 848312, 842616, 834736, 834533, 874121, 940112, 1024577, 1126170, 1228204, 1331899, 1429091, 1522981, 1622307, 1729807, 1831353, 1943759, 2070348, 2209229, 2374760, 2532767, 2683138, 2857804, 3051237, 3277026, 3541587, 3860168, 4248790, 4705342, 5249482, 5889374, 6588686, 7304684, 8011187]
10534H011187O88784O22750O73013R59274J394420J889326K475296L243809M335215
10525B4293074N997723Q722318J3307284K1071900L3889062N1007197O2747431
10518B21035989N6556437L9528786J7143104k4912222o8362875p0942021m7727984
10511A22319214k8452426j7734026j1914907q529667o351503m856093l874765
10504D0605827l260996k747694k143048j536727j161751j034234j060301j213383
10496B6447693j461733j583646j480186j288115j119336r91989r03005q47949
10488A6771734p99264p26045o44094n56928m80933m48248m25228m04613l84231
10479A1902150l77039l62915l48856l15468k92444k81215k60917k41152k24748
$$ y = [8011187, 8699971, 9322721, 9995734, 10955008, 12349428, 14238754, 16714050, 19957859, 24293074, 30290797, 39013115, 52320399, 73392299, 107281361, 158288558, 221035989, 277592426, 317121212, 334264316, 309352094, 240989219, 170047198, 122319214, 93866788, 76132762, 64217855, 55688188, 49336685, 44480592, 40605827, 37344831, 34597137, 32454089, 30917362, 29755611, 28721377, 27661076, 26447693, 24985960, 23402314, 21922128, 20634013, 19514677, 18522688, 17619683, 16771734, 15972470, 15246425, 14602331, 14045403, 13564470, 13116222, 12690994, 12286381, 11902150, 11525111, 11162196, 10813340, 10497872, 10205428, 9924213, 9663296, 9422144, 9197396]
10470I197396k19918k31154k59156k70845k67420k53251k16311k08513k16781
10461G054047k34873k36278k26146k11778j87757j59296j28049j12588j09687
10452E447595j29552j45513j56163j67917j72956j68259j53298j27184j01955
10443D124798j02428r9317q2369p3875q6250j01979r8767r8173j10318j11730
10433C159592r9158r4271q3136q3487q1725o4372o0353n7244n5538n9517o0154
10422B360637o2296o4294o3984o2505n9146n6402m5049m0230m5406n6930n5467
10411A748928m3754m2421l0964l0164k9717l2705l4375l2506l1234l6658j8091
10400A386339q656q946R429Q228K1253K3181J8799K2413L3048K7940q816o0856
$$ y = [9197396, 8977478, 8746324, 8487168, 8216323, 7948903, 7695652, 7479341, 7270828, 7054047, 6819174, 6582896, 6356750, 6144972, 5957215, 5797919, 5669870, 5557282, 5447595, 5318043, 5172530, 5016367, 4848450, 4675494, 4507235, 4353937, 4226753, 4124798, 4022370, 3923053, 3840684, 3766809, 3680559, 3578580, 3479813, 3381640, 3271322, 3159592, 3060434, 2966163, 2883027, 2799540, 2717815, 2653443, 2593090, 2535846, 2480308, 2420791, 2360637, 2298341, 2234047, 2170063, 2107558, 2048412, 1992010, 1946961, 1906731, 1861325, 1804395, 1748928, 1705174, 1662753, 1631789, 1601625, 1571908, 1539203, 1504828, 1472322, 1441088, 1404430, 1386339, 1377683, 1368737, 1378166, 1386394, 1407647, 1430828, 1449627, 1472040, 1505088, 1533028, 1524212, 1463356]
10388A463356q1045p1022o1091o8721n7442p948J0178p6q912j2070k2471k3804
10376A058932l6834k7843k4773l3413l6567n3590n4684m3056l6262k9124j7292
10365F65494j6948j8332j5724j4472m004p465j3617k0666k0435j2013j0188j0648
10353E00982r442j4591j1482L24j0850j6952j8678j5532n919q78O799J1901K493
10340D18175J06M751K330j053n463r618k7441k9719k2063k3982k6937j9464k9296
10327B30326l8695l1149l824L4006L5137L8856L7719L2784K1063R414K930o638
10315C61929o246O781J0906R105o41j3395k2398k1787j7417j5596j5924q903R2
10302B66506q94k824J321N354l275k2583j6586m693n55o919n62P328K411j675
$$ y = [1463356, 1382311, 1311289, 1250198, 1181477, 1124035, 1116087, 1126265, 1126189, 1117277, 1105207, 1082736, 1058932, 1022098, 994255, 969482, 936069, 899502, 845912, 791228, 748172, 711910, 682786, 665494, 648546, 630214, 614490, 600018, 596014, 588549, 574932, 554266, 533831, 521818, 511630, 500982, 491540, 476949, 465467, 465791, 454941, 437989, 419311, 403779, 397860, 396982, 403781, 415682, 418175, 418281, 423032, 425362, 424309, 418846, 409228, 381787, 352068, 330005, 306023, 279086, 259622, 230326, 191631, 160482, 156658, 190664, 225801, 264657, 302376, 335160, 356223, 365637, 368567, 361929, 355683, 362464, 373370, 382475, 381834, 368439, 346041, 324254, 306837, 291241, 275317, 266414, 266506, 265612, 262788, 264109, 269463, 266188, 243605, 227019, 222326, 221771, 214852, 214290, 221618, 224029, 222354]
10288B22354p133k848n888L375J3053J3157M458O057N176M614k344M484J369M023
10274B63907J097N864Q859K239Q894J6927J3454N25K329J215j0011N9J3467j182
10260C27643L799K856m054K685L488J4454J4677J3587O410J759q001M052P746
10247C91101J7272J8371j538k662m126r749j0310l542k605K237P771P541M907
10234D14668O23J4525L810q06K567R103J3851M516L556j804M559m222j5122n383
10220D44441J531P523n10j404Q809J3263K4426K0640L4858L0760K3995K5365K6567
10207F60264K4662K2723N3874R6254J66167K72446L48736L73260L08447J74072
10197B500905l7003k66206l88898l48705k38770j42812q0729m7829k8356q658
$$ y = [222354, 215221, 212373, 206485, 209860, 222913, 236070, 240528, 246585, 251761, 256375, 254031, 258515, 259884, 263907, 265004, 270868, 279727, 281966, 290860, 307787, 321241, 321766, 324095, 325310, 315299, 315358, 328825, 327643, 331442, 334298, 330244, 332929, 336417, 350871, 365548, 379135, 385545, 387304, 379303, 383355, 391101, 408373, 426744, 425206, 422544, 418418, 408669, 398359, 394817, 392212, 394449, 402220, 409761, 414668, 415291, 429816, 433626, 432820, 435387, 444490, 458341, 462857, 466413, 464609, 469168, 464946, 449824, 444441, 445972, 453495, 452985, 451581, 460390, 473653, 498079, 518719, 553577, 584337, 608332, 633697, 660264, 684926, 707649, 761523, 857777, 1023944, 1296390, 1645126, 2018386, 2326833, 2500905, 2463902, 2197696, 1808798, 1460093, 1221323, 1078511, 997782, 949953, 921597, 912939]
10187I12939J617R526J4533K2481K7426L1221L4962L3139J7134P040j2738k2563
10175A076717j9253j1130j6882j2319J2812J5873J5491K9473M0377N7650P3671
10164A262480Q5260Q9017J03118J14416J15946J24849J37366J42540J63808J86268
10154B525068J86517K12540K53836L20115L92412M78669N45444N93420O06866
10145F114887N70071N45255N97948O94522Q50171J047419J206326J386355J708102
10136A4721056K269398L211469M831379P471624J1775373J8063656K4571753K8291802
10128A15207510K9139801K5125777J2984082J056475k786819l787969p32225O622530
10120A82829162P854587k710955j5772000k3835687k9647946k8304686k0016957
$$ y = [912939, 914556, 924082, 938615, 961096, 988522, 1019743, 1054705, 1087844, 1104978, 1112018, 1099280, 1076717, 1057464, 1046334, 1029452, 1017133, 1029945, 1045818, 1061309, 1090782, 1131159, 1188809, 1262480, 1347740, 1436757, 1539875, 1654291, 1770237, 1895086, 2032452, 2174992, 2338800, 2525068, 2711585, 2924125, 3177961, 3498076, 3890488, 4369157, 4914601, 5508021, 6114887, 6684958, 7230213, 7828161, 8522683, 9372854, 10420273, 11626599, 13012954, 14721056, 16990454, 20201923, 25033302, 32504926, 44280299, 62343955, 86915708, 115207510, 144347311, 169473088, 182457170, 183513645, 180726826, 176938857, 176206632, 182829162, 190683749, 187972794, 172200794, 148365107, 118717161, 90412475, 70395518]
10113G0395518j2468260q004713n480102l942544k977019k366269j991574j806779
10105C1358258j724633j616622j440735j281731j144220j064011j078309j127005
10097B0880992j106341r99703q11997n97117m38704m02121m52051n92433q06117
10088A4674408q69513p41454n80336m87125m22578l78830l47441l21559l00241
10079A0225331k90772k79839k55648k33734k11746k00367k04218k16347k58046
10070H074614k73036k47512k12688j86820j88408j97207k26187k38282k27185
10061F077289k04634j86280j77950j49725j45973j51443j49584j46786j41275
10052D623639j38905j31297j25003j21225j11969j15635j08055r2500r3447q9140
$$ y = [70395518, 57927258, 49922545, 44442443, 40499899, 37522880, 35156611, 33165037, 31358258, 29633625, 28017003, 26576268, 25294537, 24150317, 23086306, 22007997, 20880992, 19774651, 18774948, 17962951, 17365834, 16927130, 16525009, 16072958, 15480525, 14674408, 13804895, 13063441, 12483105, 11995980, 11573402, 11194572, 10847131, 10525572, 10225331, 9934559, 9654720, 9399072, 9165338, 8953592, 8753225, 8549007, 8332660, 8074614, 7801578, 7554066, 7341378, 7154558, 6966150, 6768943, 6542756, 6304474, 6077289, 5872655, 5686375, 5508425, 5358700, 5212727, 5061284, 4911700, 4764914, 4623639, 4484734, 4353437, 4228434, 4107209, 3995240, 3879605, 3771550, 3679050, 3585603, 3496463]
10042C496463q4384q6927q6876q3988q0810r3989r5840q0274q2540q0796p2692
10031B567347p3009o6226o4957n9611o1497n7378o2797n6496n5757m8860m3370
10020A917389m8308m7674m3720l8077m2016m6597m0982l7254l7070l1202k7424
10009A477065k6461j9690r857n356o304j410Q646K362p741p250j0980k5357m1744
9996A325923l8136k6235k1107l0473l5131l8245m4982m9951l7026l9307l7608
9985I27722k4029j6162j5820k0228l1001l3863l7855k7371k2365j5255k6724k3427
9973F33622k4006k5706k1677j0131m058j1188j3085k1112k0449r812o067j4368
9961D51963j3363j8863k2788j4774j0211j0537j660l287j1064n297K685o110l900
$$ y = [3496463, 3412079, 3325152, 3238276, 3154288, 3073478, 2979489, 2883649, 2803375, 2720835, 2640039, 2567347, 2494338, 2428112, 2363155, 2303544, 2242047, 2184669, 2121872, 2065376, 2009619, 1960759, 1917389, 1869081, 1821407, 1777687, 1739610, 1697594, 1650997, 1610015, 1572761, 1535691, 1504489, 1477065, 1450604, 1430914, 1421057, 1415701, 1409397, 1407987, 1416633, 1418995, 1411254, 1404004, 1393024, 1367667, 1325923, 1287787, 1261552, 1240445, 1209972, 1174841, 1136596, 1091614, 1041663, 1004637, 965330, 927722, 903693, 887531, 871711, 851483, 820482, 786619, 748764, 721393, 699028, 683773, 657049, 633622, 609616, 583910, 562233, 552102, 548044, 536856, 523771, 502659, 482210, 472398, 466331, 451963, 438600, 419737, 396949, 382175, 371964, 361427, 359767, 356480, 345416, 340119, 342804, 336694, 332794]
9948C32794k281k609j2525j0482o44l980o710j2991j3258k5827l4608k8331j6982
9935A61566o412j5530q737L497j569m333p559J716N938Q861J4526R147K475M006
9921A67592j003r066l946o565j979M754K103M354N059P503q211q100L579K831
9907A58905L853N454k461k450r94o545o824j893k155n204n72L630p33l432Q743
9892A47322J412J754O102K192j951n466K046q64L703P58N74l99k939j2194n791
9877A36259L213p936p722j632L562K551m685M344l56K78k896L695J805j932j0522
9862A18026p773m72M219n780J023Q675L247q51n564l410j69J1842P048L400k497
9847A30964Q61k187k475O10k423j519r968p135p610n920K838l084L404k478o542
$$ y = [332794, 330513, 327904, 315379, 304897, 304253, 300273, 293563, 280572, 267314, 241487, 206879, 178548, 161566, 155154, 139624, 130887, 134384, 132815, 128482, 120923, 122639, 128577, 137438, 151964, 161111, 163586, 167592, 166589, 157523, 153577, 147012, 145033, 149787, 151890, 156244, 161303, 168806, 160595, 152495, 156074, 158905, 162758, 168212, 165751, 163301, 162307, 155762, 148938, 147045, 144890, 139686, 139114, 142744, 142011, 138579, 147322, 148734, 150488, 156590, 158782, 156831, 151365, 153411, 152547, 156250, 157008, 157582, 157183, 154244, 142050, 136259, 139472, 131536, 123814, 122182, 125744, 128295, 123610, 127954, 127598, 127876, 124980, 128675, 130480, 128548, 118026, 110253, 109781, 114000, 108220, 109243, 117918, 121165, 120314, 114750, 111340, 111171, 123013, 130061, 133461, 130964, 131825, 129638, 127163, 127773, 125350, 123831, 113863, 106728, 99118, 93198, 96036, 92952, 96356, 93878, 87336]
9832H7336J274j158p669m105p999j2380k591K337J0007O603O451O752K150j194
9818H5814m802J431n421o510Q183J1350P372k874L410o442j2031j3677j0613n62
9804E4628Q333N48l097K587J171n802M95K364p721l877J737o114l806K09j020
9789D0635j801j017K269N199J66q171o722m706J77n844N905q68K448j539j677
9774B4454J0500J627m144l73J482j060M143R325O840q26r618r20J1535n02r090
9759D3373J064m418l859p39J1407M582P77M64n405k110L020J670J993o85L457
9744E4591M103L349K876J942J0240K46N980J0879O234k964J0324M608M785J7726
9730A34919L0215K7069M3639O8342R8495J29973J56689J61515J42037O4520M985
$$ y = [87336, 88610, 87452, 79783, 75678, 67679, 55299, 52708, 55045, 65052, 71655, 78106, 84858, 87008, 85814, 81012, 82443, 77022, 70512, 78695, 90045, 97417, 94543, 97953, 91511, 79480, 65803, 55190, 54628, 62961, 63509, 60412, 62999, 64170, 58368, 58863, 61227, 53506, 49629, 51366, 45252, 41446, 41655, 40635, 38834, 37817, 40086, 45285, 45451, 37280, 30558, 25852, 26029, 20185, 26090, 25222, 27670, 26131, 24454, 34954, 36581, 32437, 32064, 33546, 32486, 36629, 45954, 52794, 51968, 42350, 41430, 52965, 52463, 43373, 44437, 40019, 36160, 35421, 46828, 51410, 52187, 52651, 47246, 45136, 48156, 49826, 51819, 51134, 54591, 58694, 62043, 64919, 66861, 77101, 77347, 83327, 94206, 100440, 97476, 107800, 112408, 117193, 134919, 165134, 192203, 235842, 304184, 402679, 532652, 689341, 850856, 992893, 1057413, 1062398]
9719A062398r444j9099o579L5008L1709l4721r9214j38811j69410j41280r7114
9708D13443o4231m4148k8561k4822r717m373q623j4040j4152j2781j0462l190
9696A74343N212l178r850r894o538o845p144q5r310k138m54n407r471j1501p736
9681I0004l76O764K905o019o447m759k63M669L739l672k514j396J401m181P98
9666H0653O210k291p458j995n877n291j456n460j246j371L535J090q596n831p27
9651D3889K970K763k635k24p979j984L661k617n929j17Q47J2734J75l873n831
9636C5850m607k459K723M715J55j458m105J350J0045N523m217m038l495O481O817
9621D9280j360q621l795k49K676m162n610l844o420j0416n519O396N105O334N15
$$ y = [1062398, 1052954, 1033855, 1027276, 1062284, 1093993, 1059272, 960058, 821247, 651837, 510557, 413443, 349212, 305064, 276503, 251681, 241964, 237591, 228968, 214928, 200776, 187995, 177533, 174343, 179555, 176377, 166527, 156633, 150095, 143250, 136106, 136021, 126711, 124573, 124119, 118712, 109241, 97740, 90004, 89628, 96392, 99297, 93278, 86831, 82072, 81809, 86478, 90217, 86545, 84031, 82635, 84036, 79855, 80653, 86863, 84572, 77114, 75119, 69242, 63951, 62495, 57035, 55789, 54418, 57953, 59043, 50447, 44616, 43889, 46859, 49622, 46987, 46763, 38784, 36800, 40461, 37844, 31915, 31798, 32645, 45379, 45554, 41681, 35850, 31243, 28784, 31507, 36222, 36377, 34919, 30814, 32164, 42209, 47732, 43515, 39477, 35982, 42463, 49280, 47920, 39299, 35504, 35255, 37931, 33769, 28159, 24315, 17895, 7479, 1960, 8356, 13461, 19795, 20310]
9606B0310o368l267P112L126L468K050M00N16J46j874O75O575N018m438m533J437
9590C0353P131M460n063m463q56P59n48J899K780o140P90M397L268p24k034o453
9574B9556l461l195m2M314O65n67l310P60l011K664N467P08n569l263j713K212
9558B2215J866r46J395o82Q0K25O664j841p016m847k624J066L591J168m456M716
9542B0574J952N11O1k54k784N96k807R54j454l15M16q0P905K514l410k271k621
9525A9487M588j973n417o678N880k854n232m15P066R02l241M348J674r60Q257
9510B5432O137m369q945m52L944L628j838K114k872L566q84o464p173J600n808
9495G616k589O177K494J894J638MN183M566p265q758O40O976J421n515J330J0525
$$ y = [20310, 13942, 10675, 17787, 20913, 24381, 26431, 26831, 27347, 27493, 25619, 26294, 32869, 37887, 33449, 28916, 30353, 37484, 41944, 36881, 32418, 31562, 32321, 31773, 33672, 36452, 30312, 31102, 35499, 38767, 38043, 36009, 29556, 26095, 22900, 22858, 27172, 27837, 27270, 23960, 24720, 21709, 24373, 29840, 30548, 24979, 21716, 20003, 22215, 24081, 23135, 24530, 23848, 23928, 24153, 30817, 28976, 21960, 17113, 14489, 15555, 19146, 20314, 15858, 20574, 22526, 23037, 23098, 22844, 20060, 20656, 17849, 18803, 17349, 17034, 17450, 17370, 25275, 27789, 24379, 22108, 19487, 24075, 22102, 16685, 10007, 15887, 13033, 7801, 7386, 14452, 15354, 12113, 16461, 18135, 17175, 25432, 31569, 27200, 18255, 17803, 21747, 25375, 23537, 25651, 22779, 26345, 25461, 18997, 11824, 13424, 7616, 5027, 11204, 13698, 15592, 17230, 17234, 22417, 26983, 19718, 10960, 11600, 18576, 19997, 14482, 15812, 26337]
9479B6337M990m212P06m589r62J775m072K18L671K915L27l750o841j257J70J973
9463A7399J330m918K127R25K451M545O400N463P110n600l244J163l614q49K43
9448C0931m562m511K465L101J752J258K385n962j237J818K66n529k97k08Q513
9433C0183K072k746l559L080P017k502j935J982J615p52j2386m475L478O958O861
9418C4891o45K427k955o009K571k385m245o004N287M836l796q924m550O437N062
9403B1998N774M739N510k433p409j811J662L080O42K45R07k8k494K738L009o525
9387B9604N934O005k449l467P77J603K100L034l293m626q06J518M93N053p312
9372C4168J598O861O059k947q022K353K585j832K402m786o123n85R56J618j118
$$ y = [26337, 31327, 27115, 27821, 23232, 22270, 24045, 19973, 20191, 23862, 26777, 27104, 23354, 16513, 15256, 15426, 17399, 18729, 13811, 15938, 16863, 19314, 23859, 30259, 35722, 42832, 37232, 33988, 35151, 31537, 30688, 30931, 26369, 21858, 24323, 27424, 29176, 30434, 32819, 26857, 25620, 27438, 27704, 22175, 21878, 21670, 30183, 32255, 29509, 25950, 29030, 36047, 33545, 31610, 33592, 35207, 34455, 22069, 17594, 21072, 28030, 34891, 34246, 36673, 33718, 27709, 30280, 27895, 23650, 17646, 22933, 27769, 23973, 15049, 10499, 16936, 21998, 27772, 32511, 38021, 35588, 28179, 26368, 28030, 31110, 31752, 31997, 32904, 32876, 30382, 33120, 36129, 29604, 35538, 41543, 39094, 35627, 36404, 38007, 40107, 43141, 39848, 35222, 34416, 35934, 36427, 41480, 34168, 35766, 42627, 48686, 45739, 37717, 40070, 42655, 40823, 43225, 38439, 32316, 31731, 32687, 34305, 33187]
9357C3187j1502j81M539L130K876K863K806Q361O793M395m405q481l303k976L408
9342D1510j1639n486O64N664P739J607k409L092L424l115K378j800k586k105k258
9327C4680N356Q246K521k07j465j428J702m984l548M122o113l280L794j765l180
9312C4451P505K213l893k135M483Q41o4n265k364J89k288K697O033P386J452k899
9296D8342j591m334m28n1J0685o767m406l144n460m258K592J0489J084l865M492
9281D3380l995K918P36L10M874J0092o75r025j450K85K340J296J878q05M133J2579
9265F8871M383l840n388k045p213n011l950m945K268L609L060j611l067J661O611
9250E3393J571J147L604k270n683O531J32m929K161k559l323q75n785l228k972
$$ y = [33187, 21685, 21504, 26043, 29173, 32049, 34912, 37718, 46079, 52872, 57267, 52862, 44381, 41078, 38102, 41510, 29871, 24385, 25049, 30713, 38452, 40059, 37650, 40742, 44166, 41051, 43429, 41629, 39043, 36938, 34680, 40036, 48282, 50803, 50596, 49131, 47703, 49405, 44421, 40873, 44995, 38882, 35602, 39396, 37631, 34451, 41956, 44169, 40276, 38141, 42624, 43465, 43401, 38136, 35772, 35961, 33673, 36370, 42403, 49789, 51241, 48342, 46751, 42417, 41989, 41938, 52623, 45856, 41450, 38306, 32846, 28588, 31180, 41669, 42753, 38888, 43380, 39385, 42303, 43039, 43349, 48223, 58315, 57640, 48615, 47165, 47450, 49790, 51086, 52964, 52159, 56292, 68871, 73254, 69414, 64026, 61981, 54768, 49757, 45807, 40862, 43130, 46739, 49799, 48188, 45121, 46782, 53393, 54964, 56111, 59715, 57445, 51762, 58293, 58425, 53496, 55657, 53098, 49775, 48900, 43115, 39887, 36915]
9235C6915l591J000K902J197J836N332J2540m125r553o098j279K186J630N108
9221D6000J532J617N93K657r03n872M201L085N582Q05n761k050m101K498Q414
9206E8297m427p788j796N808Q591m853m60R92R67o16n344M131L956m200o198L786
9190E0846K704o86l306j507K085n63k200M797P440j040o080m292M648O413k489
9175E6770J642M396P521L617r44n567o950N689K686L410L1m839O93M638M846p91
9159G6848j461m948k520o65l661K427M158k625R826n88j2770m175L573J3609M817
9144H1845n888m419Q270K742j631j542J750n682p969n959n307J809Q605P689m921
9129F9392R32Q697K966o152p3K230n424m636K682m442k328J53n209l612R584N607
$$ y = [36915, 33324, 34324, 37226, 38423, 40259, 45591, 58131, 54006, 44453, 38355, 37076, 39262, 40892, 46000, 47532, 49149, 49742, 52399, 51496, 45624, 49825, 52910, 58492, 59297, 53536, 51486, 47385, 49883, 58297, 53870, 46082, 44286, 50094, 58685, 53832, 53372, 54364, 55331, 54715, 49371, 53502, 57458, 53258, 47060, 50846, 53550, 52864, 49558, 48051, 50136, 49573, 47373, 52170, 59610, 58570, 52490, 48198, 52846, 59259, 56770, 58412, 62808, 70329, 73946, 73002, 67435, 60485, 66174, 68860, 72270, 72301, 67462, 68155, 72793, 77639, 76848, 75387, 70439, 67919, 67254, 63593, 66020, 70178, 67553, 77379, 76791, 64021, 59846, 63419, 77028, 81845, 75957, 71538, 79808, 82550, 80919, 79377, 81127, 75445, 67476, 61517, 56210, 58019, 66624, 74313, 69392, 70324, 79021, 81987, 75835, 75762, 77992, 72568, 67932, 70614, 66172, 63844, 63997, 58788, 55176, 64760, 70367]
9113G0367N0l263p68M505N317J784o741J683J460M561M245j0633j819j303M37
9098F9882N754p55j854M636L31l16K043K007J134J299m270j743k72K77Q79Q499
9082H7531q926k972P074K824j892j40M624M929n251J89n926Q904O669K333l712
9067I6258k665L095l289J207J845l22n304N065L009k428k521P5J2222N816J399
9052A13462J527J908l584k943N164p14q034m449j288r18j974m647k011r68M345
9037I4876N424M269q42q63j693k984M585O848M277O100l710n825k753L706P946
9022A19361M991J14p82l989k388J565J1616K377Q0J114q51j0085m261j212k173
9007A15477K706L041j47K10l186n5L718K03L253J356j168N690R488K235J887P761
$$ y = [70367, 70417, 67154, 66386, 70891, 76208, 77992, 71251, 72934, 74394, 78955, 83200, 72567, 70748, 69445, 69882, 75636, 74881, 73027, 77663, 77994, 77678, 79721, 81728, 82862, 84161, 79891, 78148, 77876, 78153, 79032, 87531, 78605, 75633, 82707, 85531, 83639, 83499, 88123, 93052, 87801, 87990, 82064, 90968, 97637, 99970, 96258, 93593, 96688, 93399, 94606, 96451, 96129, 90825, 95890, 98899, 96471, 93950, 94025, 106247, 112063, 113462, 114989, 116897, 113313, 110370, 115534, 114820, 106786, 102337, 101049, 100131, 98157, 93510, 91499, 90531, 94876, 100300, 104569, 103727, 102864, 101171, 98187, 102772, 109620, 113897, 119997, 116287, 110462, 107709, 111415, 119361, 124352, 124466, 123684, 119695, 117307, 118872, 130488, 132865, 132945, 134059, 133208, 123123, 118862, 117650, 115477, 118183, 121224, 121077, 121287, 118101, 118046, 121764, 121967, 125220, 126576, 125408, 131098, 140586, 142821, 144708, 152469]
8991A52469K604l395j019j460o138R51N359o274j618J2939K290o441j626j717
8977A46924N12l39n356j694Q639J382M615N610O95l818J415N75n452j167l056
8962A49485M065P475K140J605M794j182J120P313M300N670N06m439K300L416j238
8947A87330o076k853M575K032m44K779K502L151J128J078L616j689j848J975k322
8932A94934j218L910J0032M778N203o164k945K723K557j836L346N412O971L709
8918B31412O179L750q972N787M844K352p159m037J525M463j439Q084O573P593
8904B60955j99J928K794M236m84R53M812n1l868P96R42K645K942Q140P059Q093
8888C01693j662l254N021o66j71m10K109O332N038l244k008N533J945k548K892
$$ y = [152469, 155073, 151678, 150659, 149199, 143061, 144012, 149371, 143097, 141479, 154418, 156708, 150267, 148641, 146924, 147436, 147097, 141741, 140047, 148686, 150068, 154683, 160293, 160988, 157170, 158585, 159160, 153708, 152541, 149485, 153550, 161025, 163165, 164770, 169564, 168382, 169502, 176815, 181115, 186785, 187291, 182852, 185152, 188568, 187330, 181254, 178401, 182976, 185008, 184564, 187343, 189845, 192996, 194124, 195202, 198818, 197129, 195281, 197256, 194934, 193716, 197626, 207658, 212436, 217639, 211475, 208530, 211253, 213810, 211974, 215320, 220732, 227703, 231412, 237591, 241341, 232369, 238156, 243000, 245352, 238193, 234156, 235681, 240144, 238705, 246789, 253362, 260955, 260756, 262684, 265478, 269714, 269230, 270183, 274995, 274944, 271076, 271872, 272814, 275459, 278401, 286541, 293600, 301693, 300031, 296777, 301798, 301132, 300961, 300551, 302660, 308992, 314030, 310786, 308778, 314311, 316256, 313708, 316600]
8873C16600P738O750k502M134J1547M62R75J0040M230M415P824o50k525M154M315
8858C77507Q858M161M689l40m967M2O378O663R543N076N388J014n659O786P032
8843D32171j448M553R916K11O734o05K536L852O993Q724R333M717M902J3608J2880
8828E19077J1035l766l319R647Q291N300J729R813J2032N341K022L476J2592R291
8814F02561J2875J0002Q535J0302Q932J9K32P479J5534J8721J1001R030M284N573
8800G25080J5343K233N771J4353J7840Q583R342J7496J4110N764J0991J1884J9802
8787H78592J5528J134Q251J0890J4529K2397J9323K0186J6609J8474K1945J7802
8775A065660J1618J1755J8554J0556J5301K3082J0514K4658L7825K4486J9626
$$ y = [316600, 324338, 331088, 328586, 332720, 344267, 344729, 345704, 355744, 359974, 364389, 372213, 371563, 369038, 373192, 377507, 386365, 390526, 395215, 394875, 389908, 389950, 396328, 402991, 412534, 417610, 422998, 424012, 418353, 425139, 432171, 430723, 435276, 445192, 445403, 452137, 451532, 454068, 457920, 464913, 473637, 482970, 487687, 492589, 506197, 519077, 530112, 526346, 523027, 532674, 540965, 546265, 547994, 557807, 569839, 575180, 577202, 580678, 593270, 602561, 615436, 625438, 633973, 644275, 653207, 653226, 653458, 660937, 676471, 695192, 706193, 715223, 719507, 725080, 740423, 742656, 748427, 762780, 780620, 789203, 798545, 816041, 830151, 835915, 846906, 858790, 878592, 894120, 895254, 903505, 914395, 928924, 951321, 970644, 990830, 1007439, 1025913, 1047858, 1065660, 1077278, 1089033, 1107587, 1118143, 1133444, 1156526, 1167040, 1191698, 1229523, 1254009, 1273635]
8764A273635K5892J9775K5004K3925K1575K6433L1581K6200K3374L1320L3588
8753A562302L0091L2516L1917L5203L8389M6908L6537L1229L5942M5181M8203
8742A974418M9330M1065L2684M6256N5607N2483N9654N6496N2101O0364O7905
8731B548363P2573O8078O3769O8801P7585Q2971Q0681Q1722Q6724Q9954Q8596
8720C409817R5404R1481J02754J13719J13977J24774J27018J28415J34774J40232
8710D582365J46111J53005J54108J57804J63005J75605J79446J79268J98413K01316
8700F290446K13320K17480K20979K28886K32906K46494K55273K57150K61261K66761
8690H690956K73636K78282K77397K83324K87322K85488K84525K81109K76455K72465
$$ y = [1273635, 1299527, 1319302, 1344306, 1368231, 1389806, 1416239, 1447820, 1474020, 1497394, 1528714, 1562302, 1592393, 1624909, 1656826, 1692029, 1730418, 1777326, 1813863, 1845092, 1881034, 1926215, 1974418, 2023748, 2064813, 2097497, 2143753, 2199360, 2251843, 2311497, 2367993, 2420094, 2480458, 2548363, 2620936, 2689014, 2752783, 2821584, 2899169, 2982140, 3062821, 3144543, 3231267, 3321221, 3409817, 3505221, 3596702, 3699456, 3813175, 3927152, 4051926, 4178944, 4307359, 4442133, 4582365, 4728476, 4881481, 5035589, 5193393, 5356398, 5532003, 5711449, 5890717, 6089130, 6290446, 6503766, 6721246, 6942225, 7171111, 7404017, 7650511, 7905784, 8162934, 8424195, 8690956, 8964592, 9242874, 9520271, 9803595, 10090917, 10376405, 10660930, 10942039, 11218494, 11490959]
8680A1490959K54973K52918K50766K28139K18414J92664J72050J57102J27440
8671A3345425R9936P4514N2368L0524L577k2658m5865p9546q9756j05473j39751
8660A3123295j58575j70363j74773j95519k01602k12403k20916k32443k37482
8651A1319219k35059k32855k41561k42861k36934k39731k40131k32272k21709
8642I196106k23007k24598k16401k07173k06297k00197j92100j88999j86754j86208
8632G164372j81414j69367j69320j61329j56730j49705j48847j46474j41680j38014
8622E601492j18813j27242j24946j34238j22649j14216j13329j04935r7407r7456
8612D446261r8609r5906r3500q7804r1105q3410q1003q0458q1551p5509p3509
$$ y = [11490959, 11745932, 11998850, 12249616, 12477755, 12696169, 12888833, 13060883, 13217985, 13345425, 13445361, 13519875, 13572243, 13602767, 13606344, 13583686, 13537821, 13458275, 13368519, 13263046, 13123295, 12964720, 12794357, 12619584, 12424065, 12222463, 12010060, 11789144, 11556701, 11319219, 11084160, 10851305, 10609744, 10366883, 10129949, 9890218, 9650087, 9417815, 9196106, 8973099, 8748501, 8532100, 8324927, 8118630, 7918433, 7726333, 7537334, 7350580, 7164372, 6982958, 6813591, 6644271, 6482942, 6326212, 6176507, 6027660, 5881186, 5739506, 5601492, 5482679, 5355437, 5230491, 5096253, 4973604, 4859388, 4746059, 4641124, 4543717, 4446261, 4347652, 4251746, 4158246, 4070442, 3979337, 3895927, 3814924, 3734466, 3652915, 3577406, 3503897]
8601C503897p9922p1655o6008p0244p1037o8033o2394o5550n3342o0361n7381
8590B777970n9832n3139o1466m4734m3329m4651m5083m6837m7541m8460m0034
8579B242864l2698m5611m8545l5810l3237l4856m0084l5349l5967l3987k8224
8568A838496l3493m1097l2043k8496m0040l2919k6621k5835k1028k1691l1251
8557A503982k9252j5875k0168k5524k1205k5885k3302j3798k7660k0812j2961
8546A267540k1815j5773j5751k0649k7154l0505k0932j5166j7157j6337j5114
8535A051187j1095j4880j7878j8000j7811k2052j2074r672j3672j2470p250m476
8523H89857j3454j7221j2721j9733j5483o436n715j5635j6299r447r434j8058
$$ y = [3503897, 3423975, 3352320, 3286312, 3216068, 3145031, 3076998, 3014604, 2949054, 2895712, 2835351, 2777970, 2718138, 2664999, 2603533, 2558799, 2515470, 2470819, 2425736, 2378899, 2331358, 2282898, 2242864, 2210166, 2164555, 2116010, 2080200, 2046963, 2012107, 1972023, 1936674, 1900707, 1866720, 1838496, 1805003, 1763906, 1731863, 1703367, 1663327, 1630408, 1603787, 1577952, 1556924, 1535233, 1503982, 1474730, 1458855, 1438687, 1413163, 1391958, 1366073, 1342771, 1328973, 1301313, 1280501, 1267540, 1245725, 1229952, 1214201, 1193552, 1166398, 1135893, 1114961, 1099795, 1082638, 1066301, 1051187, 1040092, 1025212, 1007334, 989334, 971523, 949471, 937397, 927725, 914053, 901583, 894333, 889857, 876403, 859182, 846461, 826728, 811245, 804809, 799094, 783459, 767160, 757713, 748279, 730221]
8511G30221q717n057j1053j1552j6450j7099j1418o840l775p455r384j0139j6542
8498E94740q873j401p336o277m977n332p455q232o828m592m454o248p527n068
8484E10140n268o955p587m789n479p155j4378j4490O61l159k189k343p393r846
8470D19770k072J546m322k192l786k460q173M08m415q395o627l563j465m779k501
8455C66974j0165q736k562k057k107o114l514r125o11j432l702k700q78J742k934
8440C12079j029k228o774j3267n98k60j716n079l118N017j376o59M91M60o871
8425B75072m544k53k025n705L737J077p22j807q347n671L58n448J161j42n92o517
8409B39632o821p350q350R232R232l791m384m084r21J826m17p206M41J402p873
$$ y = [730221, 721504, 716447, 705394, 693842, 677392, 660293, 648875, 642035, 638260, 630805, 621421, 611282, 594740, 585867, 584466, 577130, 570853, 565876, 560544, 553089, 544857, 538029, 533437, 528983, 522735, 515208, 510140, 504872, 497917, 490330, 485541, 480062, 472907, 458529, 444039, 444700, 441541, 439352, 437009, 429616, 419770, 417698, 419244, 414922, 412730, 408944, 406484, 398311, 398719, 394304, 385909, 379282, 375719, 374254, 369475, 366974, 356809, 348073, 345511, 343454, 341347, 335233, 331719, 322594, 321983, 320551, 316849, 314149, 313271, 315013, 312079, 311050, 308822, 302048, 288781, 288183, 287923, 286207, 281128, 278010, 283027, 281651, 280992, 281483, 281943, 275072, 270528, 270275, 268250, 262545, 266282, 267359, 266637, 264830, 256483, 250812, 251170, 245722, 246883, 246741, 246149, 239632, 232811, 225461, 217111, 226343, 235575, 231784, 227400, 223316, 222395, 224221, 223804, 216598, 217039, 218441, 210568]
8394B10568k251l398m586j643n80p01k374P684J370N528k881m756j0075m623J575
8379A88857L544L088k502m274k343o974j603m191p5n32J147m269k125R01k152
8364A66497r26L17l463m36n85k47j861m448n161m821N624R107J471j4102r832
8349A37134j958O383q157k552J705K517l12o780n082M396Q287J551o568m747m144
8334A21673j243P474k727l699P34P984L35m53k896o033n126J610P8j178j382R65
8318A16116j509k732J68m301r88k407m305J764M42l375l08N779Q519j101j96Q968
8302A20534N804J174j0624r650o679r456J850R863n649j144j468K829O479N259
8288A09122L803K337J388L40l677j471J854n51m540l253j5703p521k73P730N549
$$ y = [210568, 208317, 204919, 200333, 198690, 198110, 197409, 195035, 202719, 204089, 209617, 206736, 201980, 191905, 187282, 188857, 192401, 195489, 192987, 188713, 186370, 179396, 177793, 173602, 173527, 172995, 174142, 169873, 167748, 168649, 166497, 165571, 165888, 162425, 161989, 161404, 161157, 159296, 154848, 149687, 144866, 150490, 159597, 161068, 146966, 137134, 135176, 141559, 133402, 130850, 132555, 135072, 134760, 127980, 122898, 127294, 135581, 137132, 130564, 125817, 121673, 120430, 127904, 125177, 121478, 122212, 130196, 130531, 130078, 127182, 121149, 116023, 117633, 117711, 116533, 115151, 116116, 114607, 111875, 112043, 107742, 106754, 104347, 100042, 101806, 102248, 98873, 98565, 104344, 112863, 111762, 111566, 120534, 126338, 127512, 116888, 107238, 100559, 91103, 92953, 102816, 97167, 96023, 94555, 97384, 103863, 109122, 112925, 115262, 116650, 116990, 113313, 111842, 113696, 113145, 108605, 105352, 89649, 82128, 81855, 89585, 95134]
8273I5134q25n03j573K064L527m184l064J020M51Q87P09k833m985k859J692L94
8257H5052J100j075l40Q5J904L358j492j1638r25N388k259N16K920O751q97o448
8241H2000j156k377m637L421M131m584L733J653J61m756m409Q61j0143p49Q030
8226G1179N573L693j899m166j670J074K678L294k481J973p229q831k484k759O683
8211F4628P047j590m428O440j919k705J956J026k10j0654l391M639J472m212m424
8196E3675L368k526K409M010L382m585J155j392q187j554K291n190J516mOL499
8180E1873J966M950m226k854K335m175j49j473M255M16l111o43J594j534j946
8165D7278K551L965j195q780l476o891l31p466l47K384LP093Q201J497P67L961
$$ y = [95134, 94309, 93806, 92233, 94297, 97824, 93640, 90576, 91596, 92047, 92934, 93643, 90810, 85825, 82966, 84658, 85052, 86152, 85077, 84737, 84822, 86726, 90084, 88592, 76954, 76029, 81417, 79158, 79674, 82594, 89345, 88448, 82000, 80844, 78467, 73830, 77251, 81382, 76798, 80531, 82184, 82345, 77589, 73180, 74041, 63898, 63149, 71179, 76752, 80445, 78546, 74380, 72710, 73784, 76462, 79756, 77275, 79248, 72019, 63188, 60704, 57945, 64628, 71675, 70085, 65657, 72097, 70178, 67473, 69429, 70455, 70245, 59591, 56200, 60839, 62311, 58099, 53675, 57043, 54517, 56926, 60936, 64318, 59733, 60888, 59496, 51309, 49755, 52046, 46856, 48372, 48368, 48374, 51873, 53839, 58789, 54563, 51709, 54044, 49869, 49720, 48247, 52502, 52918, 49807, 49164, 50758, 49224, 47278, 49829, 53794, 52599, 43819, 40343, 33452, 33121, 25655, 25308, 27692, 27695, 34788, 42989, 44486, 45253, 49214]
8149D9214K578J090m095j298l590O878L498N84n88r609m66L631m981q680O77K230
8133C7073k893j111N661Q970N585m675j357n030j967k000J918M408J788N264L458
8118E5092j536o480j852L958O46o324n526k732j056L45k041K676O043l755K81
8103C7739J303K538n047p72k010L397P383r39l216l931M403k775r07M493K50o175
8087C5734J103m732k039M079m641j876O020K297j400J948j850j547J597L038j946
8072C5785J78J5N230J892L14k377k943j664O30M688p66o946N313K8m464p01k232
8055C1980N191O988n342j2903p991K511N812M440O391p6k242j299l349L58L018
8040C3487j306l491M37n81O603M635N42p14J139m774p807J483K474L653k903N168
$$ y = [49214, 51792, 52882, 48787, 47489, 43899, 50777, 54275, 54859, 54271, 44662, 44196, 47827, 42846, 34166, 34843, 37073, 34180, 33069, 38730, 47700, 53285, 48610, 47253, 42223, 40256, 38256, 40174, 44582, 46370, 51634, 55092, 53556, 47076, 45224, 49182, 49828, 43504, 37978, 35246, 34190, 34535, 32494, 35170, 41213, 37458, 37739, 39042, 41580, 36533, 35761, 33751, 37148, 44531, 43592, 40376, 36445, 40848, 38073, 37166, 41659, 41909, 35734, 36837, 32105, 30066, 34145, 29504, 27628, 33648, 35945, 34545, 36493, 34643, 33096, 34693, 37731, 35785, 35963, 35978, 41208, 43100, 43414, 41037, 38094, 36430, 37060, 41748, 40982, 34036, 39349, 39377, 34913, 34212, 31980, 37171, 44159, 38817, 25914, 17923, 20434, 26246, 30686, 37077, 37001, 34759, 33460, 30111, 30469, 33487, 32181, 28690, 29127, 28546, 35149, 39784, 40326, 39612, 40751, 35977, 28170, 29653, 32127, 35780, 32877, 38045]
8024C8045N136M126P375o151j0520k76n727J164K938m992j0586N825N226J773
8010C3356j45L359J564P70j784r70m605m367m03J240M643J502R8k184m310K936
7994C0700k655K369j621o296Q242L190l374k7k462K950K094k701j105k351o136
7979B0817J87J0575Q14J546O897M106n299j449N032K369j045r037o126P047L019
7964C9453Q138j550n081K794k21r80l452l823J457l854L423L762l658K45k082
7949C4571L094n349j570J852m413K813j235m354l395N758Q42n815m766Q514J1190
7934C7737o295r182j946J035L064L235k707M656k511K868L989K109O73k471m011
7919C0243o03J651l429N84N163p795r318L367O897l21p99j223l61M659L352j966
$$ y = [38045, 43181, 47307, 54682, 48531, 38011, 37735, 32008, 33172, 36110, 31118, 20532, 26357, 31583, 33356, 33211, 36570, 38134, 38904, 37120, 36150, 31545, 27178, 26775, 28015, 32658, 34160, 34258, 32074, 27764, 30700, 28045, 30414, 28793, 22497, 30739, 33929, 30555, 30528, 28066, 31016, 33110, 30409, 29304, 26953, 20817, 21004, 31579, 32393, 33939, 40836, 44942, 39643, 38194, 43226, 45595, 44550, 35513, 29387, 36434, 39453, 47591, 46041, 40960, 43754, 43533, 42553, 39101, 35278, 36735, 32881, 36304, 40066, 36408, 36653, 34571, 37665, 32316, 30746, 32598, 28185, 30998, 29763, 25409, 22014, 27772, 28614, 22799, 18033, 26547, 37737, 31442, 22260, 20314, 21349, 24413, 27648, 24941, 29597, 27086, 29954, 33943, 36052, 36725, 34254, 30243, 29640, 31291, 27862, 28446, 33609, 25814, 16496, 19863, 26760, 26439, 25640, 24417, 24056, 28715, 32067, 30101]
7903C0101p382q49j636O061K999M869N731l959m691j4320k375J2117M068M752
7889C5486r644j0400l854K953n12L412J0235l179n952j140m641M844L209j654
7875A9163l227q93M497l384K803L046M4k571o77O399n807j1257K609P870M510
7860B3125N58l780K209M907p241n127N416K727l202m38m842k580P242j500n52
7845A6922O78O90k884j845L332o193m593R939K770p028p511j95N495N49r597n810
7829e281J1986M726J526M41K784n206k618k933o958M845Q223K655K122n105Q59
7814A2066K142L338j364r730J052K811p51j276K902k073L275l99p781j769J438
7799C881M912J455l270J785n557L89J1049N913M3j800k16m526n169p788Q602P747
$$ y = [30101, 22719, 21870, 20234, 26295, 29294, 34163, 39894, 35935, 31244, 16924, 14549, 26666, 30734, 35486, 25842, 15442, 11588, 14541, 14029, 17441, 27676, 24497, 18545, 17405, 12764, 17608, 20817, 19163, 15936, 15043, 19540, 16156, 18959, 22005, 22049, 19478, 18801, 25200, 19393, 8136, 10745, 18615, 23125, 23683, 19903, 22112, 27019, 19778, 14651, 20067, 22794, 19592, 19154, 14312, 11732, 18974, 17474, 16922, 17600, 18290, 15406, 13561, 16893, 10700, 6107, 16046, 18816, 11788, 4277, 4082, 9577, 10126, 529, -5281, 6705, 11431, 12957, 13398, 16182, 10976, 8358, 5425, -1533, 3312, 11535, 14190, 16312, 11207, 12066, 14208, 17546, 16182, 6452, 7504, 10315, 9564, 8288, 11190, 9117, 12392, 11993, 4212, 2443, 3881, 8793, 10248, 6978, 8763, 3206, 3595, 14644, 20557, 20600, 18800, 18584, 14058, 8889, 1101, 9703, 17450]
7783A7450k024j371J965j832j868j582j544k338K732P812k424n984J19o22r56
7768G533j896K703N436m507J446k496j570p816j628O123P234l752J217L559L763
7753A5349j749O99K518K435M983l443l171M285K98o620n619p216J57N492K995
7738A1393M705L278l582n95o037J2k228l83O361M817K302r586k426m16k084K354
7722G885O971j610o130K081j204K355k92k278l20J027K602l15L35l963n135n197
7706c188K865P279N729k945O911J152j425o407n540q79P532L49J028J319O259
7691B0039j715j763l175m790j553J336P134K513n918j552l843L245M475N193j0787
7676H839j1850o30j228J459N59m716J589M309L303j333j932L2N775J797k207o06
$$ y = [17450, 15426, 14055, 16020, 14188, 12320, 10738, 9194, 6856, 9588, 17400, 14976, 8992, 9111, 8489, 7533, 5637, 8340, 13776, 9269, 10715, 8219, 6649, -1167, -2795, 3328, 10562, 6810, 8027, 11586, 15349, 13600, 14299, 16817, 19252, 24235, 20792, 17621, 21906, 22204, 15584, 9965, 2749, 2906, 8398, 11393, 16098, 19376, 15794, 15199, 9162, 9174, 6946, 6563, 12924, 17741, 20043, 10457, 8031, 7615, 5531, 7885, 14856, 13246, 7116, 9197, 7993, 10348, 10056, 7778, 7458, 8485, 11087, 10772, 11107, 7144, 2009, -3188, -323, 6956, 12685, 9740, 16651, 17803, 16378, 9971, 4431, 3552, 11084, 11433, 12461, 13780, 20039, 18324, 16561, 13386, 8596, 7043, 8379, 15513, 18026, 12108, 10556, 6713, 9958, 14433, 19626, 8839, -3011, -3641, -4869, -3410, -2851, -7567, -5978, -1669, 1634, 301, -1631, -1599, 4176, 5973, 3766, 3160]
7660C160J308k234O38R9j0982k502K463K660j489K55l974N761J2297j265R05k63
7644F837l605n36m214J568R36O809N391J088m42L298l615p775l959m206J13O211
7628C899P646j761K971L542K147m215p079q12L70q82J132K70M687Q52m530p000
7612A237J503l634M119N771o246m156p19L262j517M72K753j055R37K854N084q170
7596B495o165P856R766j225o7M946J153p025l983o692n578K682m39j978K659O664
7580E069j916J523N446J604N013J4M441N922m583L123p498p376q28j117k084N076
7564A1829J444k286K531j0087k051L896J1271N442k394l340k863r910o686K206
7550i98K54K683K477J634l068m154N06K96K07j585j155n005Q12J216J374K130
$$ y = [3160, 4468, 2234, 2872, 2971, -8011, -10513, -8050, -5390, -6879, -6624, -10598, -4837, 7460, 6195, 7100, 6837, 3232, 2696, -1518, 50, 986, 7795, 13186, 14274, 13832, 17130, 13515, 5740, 1781, -2425, -2312, 3899, 11545, 9784, 12755, 16297, 18444, 14229, 7150, 6338, 6708, 5826, 6958, 7228, 11915, 12767, 8237, 1237, 2740, -894, 3225, 8996, 2750, -1406, -2125, 1137, -380, 92, 2845, 1790, 2727, 5581, 10665, 2495, -3670, 4186, 13952, 12727, 12660, 17606, 18759, 11734, 7751, 1059, -4519, -1837, -2276, -4254, -1595, 5069, 3153, 4676, 10122, 11726, 16739, 16753, 21194, 27116, 22533, 25656, 18158, 10782, 9954, 8837, 6753, 11829, 13273, 10987, 13518, 3431, 1380, 5276, 16547, 21989, 19595, 16255, 13392, 3482, -3204, -998, -744, 1939, 4416, 6050, 2982, -1172, -666, -370, -163, -1748, -2903, -7908, -7096, -5880, -4506, -2376]
7534b376k027L724P364O770p14m818M255m437k86j98L089Q55m026O015j429m005
7518G756K060o15k509m253J562N032k155Q38k952Q53P464K91k073J703m926r415
7502a339l394k389J061J258j192R77R82k824j394J625J584L092J718L869K482
7487F116k96L834O560k847j974L998p168n278j21j354k595P401M900k662j622
7472F892j957K891M577m416o329k131j792k558k958P329M837J89o765l372k73
7457e836j073N558R715K64K284n235k827l168L569m132L217K795O71l656l994
7442a848M660J16P56l572L70l515o829k22P69M074R432j989p561N383K267l433
7426a142j940L24p705p660j44J4250Q182l419q667k750M704M801P485J015j255
$$ y = [-2376, -4403, -679, 6685, 13455, 12741, 7923, 12178, 7741, 7455, 7257, 10346, 11201, 7175, 13190, 11761, 7756, 9816, 9201, 6692, 2439, 4001, 9033, 6878, 7716, 4764, 5617, 13081, 13372, 11299, 13002, 8076, -1339, -4733, -7122, -6061, -4803, -5995, -5018, -4036, -6860, -8254, -6629, -5045, -1953, -235, 3634, 6116, 5820, 9654, 16214, 13367, 11393, 15391, 8223, 2945, 2824, 1470, -1125, 6276, 11176, 8514, 6892, 4935, 7826, 12403, 7987, 1658, -473, -2265, -4823, -7781, -452, 4385, 4574, -2191, -5563, -5836, -6909, -1351, 8364, 8628, 10912, 5677, 2850, -318, 3251, -881, 2336, 5131, 5802, 2146, -1848, 2812, 2928, 3684, 112, 482, -3033, -9862, -10084, -9315, -5241, 4191, 2202, -5359, 24, 2291, -1142, -3082, -2758, -10463, -18123, -18267, -4017, 4165, 746, -7921, -10671, -5967, -1166, 6319, 7334, 6079]
7411F079j215n312J435o022l157K930N44l907M712K620j755n546R367J3030O89
7396A4492P14J645M975o836o025k905M136N026k928o102j450M333k115l783k60
7381B917q36P375Q4l970k241l988L430j16q794k850j841O894P515k929m138r77
7365d465J601L715J037J48k033M735N909k220J541P31l352j622l891q14M106K364
7349G490P296J114m528n063o713N782l60K50o105K43M941o467o777L357P197J652
7333C309M57O04L557p703m911N520j416k316N911L360N139L655o821p660O574
7318G259M200m149J320K763o299m416l101P080J291j944m549j966K343J293o33
7303D92k89M045L487j377L213k3K200k800k074m638K160K360n516k952n38K257
$$ y = [6079, 4864, -448, 987, -5035, -8192, -5262, -4718, -8625, -3913, -1293, -3048, -8594, 773, 13803, 14492, 15206, 16851, 21826, 14990, 8965, 6060, 10196, 15222, 12294, 6192, 4742, 9075, 6960, 3177, 2917, 2081, 9456, 9540, 5570, 3329, -659, 2771, 2655, -6139, -8989, -10830, -3936, 3579, 650, -3488, -4465, -2864, 851, 1888, 2036, 3, 4738, 10647, 8427, 9968, 10699, 7347, 5725, 1834, 1020, 5126, 7490, 14786, 15900, 11372, 6309, -404, 5378, 5018, 5268, -837, -594, 4347, -2120, -8897, -5540, 1657, 3309, 3766, 4370, 7927, 224, -4687, 833, -583, -2899, 3012, 6372, 11511, 15166, 8345, 685, 7259, 11459, 7310, 8630, 11393, 5094, 678, -2423, 4657, 5948, 4004, -545, -2511, -168, 1125, 492, 203, 4248, 7735, 6358, 9571, 9548, 11748, 8948, 6874, 2236, 4396, 6756, 1240, -1712, -2250, 7]
7287Gl383l946L03J0006L079n045o553j672J370j831J571L414J445k108j00O69
7271b774J931J291J805N923M58J326l667n929k339P00L696O376P417o318j1940
7256b044n337j824K235K486q14P576K97r693O078L797K172K231k366o353O983
7241E424P6m66k543m692m446l411O470J168M173j945K650q222j93P149M371K948
7225H511K524o259o252j609J970J184J930j451J254o580j222O945P678K125K097
7210A2845O9j387R18l947q16k437M899l987m725K463M176j686j860n474q75J441
7194c83l120p120l870l306L705J529m89L937k531L267P91J626K918m215J138J529
7178d594J909R152l96j368k549j472L795K684n476n447R28Q50M122j246N552M229
$$ y = [7, -3376, -7322, -7019, 2987, 6066, 1021, -5532, -7204, -5834, -7665, -6094, -2680, -1235, -3343, -3443, -2774, -843, 448, 2253, 8176, 8634, 9960, 6293, 364, -1975, -1275, 2421, 8797, 16214, 9896, -2044, -7381, -9205, -6970, -4484, -5298, 2278, 2575, -7118, -1040, 2757, 4929, 7160, 4794, -1559, 5424, 5500, 5034, 2491, -2201, -6647, -10058, -3588, -2420, 1753, -192, 2458, -5764, -5957, 1192, 5563, 8511, 11035, 4776, -1476, -3085, -1115, 69, 1999, 548, 1802, -4778, -6000, 945, 8623, 10748, 12845, 12914, 11527, 12445, 8498, 7682, 5245, 10144, 6157, 1432, 3895, 8071, 6385, 4525, -949, -1824, -383, -3503, -10623, -14493, -17799, -14094, -12565, -13054, -9117, -11648, -8381, -7590, -5964, -3046, -7261, -6123, -4594, -2685, 6467, 6071, 4703, 2154, 682, 4477, 7161, 1685, -3762, -2834, -1984, 2138, 892, 6444, 10673]
7162A0673J64J684O98k392n508k91l90J061L691j796J403p53o613j761m94K716
7146B092M720n27l711k481J229R99M984J368j15p21J555q209j89R409K57m980
7130E680J102l498p581J089M921O9n162j067K448P576j595j628N46j194m098R26
7114a466P852K470k069K644j332o651l867m04K934L220l991l747m257j112K807
7099f969L610K270K469q17L825L136n332j949J906L046p54P90l666l98j651J117
7083F33K179p080j441J5337M120m771J475o754J85p36p49P648J270m010r760k064
7067d518O746M644k840n812n64m473O14O828M440N277Q60k649m118m450l154M805
7051A636l366m383O042O904j835l273n327j066N134K007j989j294l648k021m657
$$ y = [10673, 10837, 12521, 13219, 10827, 5319, 5028, 4638, 5699, 9390, 7594, 8997, 8244, 1631, -130, -624, 2092, 6812, 6285, 2574, 93, 1322, 2321, 7305, 8673, 8558, 7837, 9392, 1183, 994, 10403, 10660, 5680, 6782, 3284, -4297, -3208, 1713, 1782, -3380, -4447, -1999, 5577, 3982, 2354, 2900, 1706, -2392, -1466, 6386, 8856, 6787, 9431, 8099, 1448, -2419, -2823, 111, 3331, -660, -4407, -8664, -9776, -6969, -3359, -1089, 1380, 563, 4388, 7524, 2192, 243, 2149, 5195, 4441, 5231, 1565, 1167, -484, 633, 2812, -4268, -5709, 9628, 13748, 8977, 10452, 3698, 3883, 3147, 2398, 10046, 11316, 7306, -2454, -4518, 2228, 6872, 4032, -1780, -2344, -6817, -6203, 625, 5065, 10342, 11202, 8553, 4435, -15, -3169, 1636, -1730, -6113, -71, 6833, 4998, 1725, -3602, -4668, 466, 2473, 484, -810, -4458, -6479, -11136]
7036a1136K208K113l836j340Q125K153k957m773l86P625l051l105O773M46O08
7021e33O472n171j984M742m434J030L958L706N779m216n447k397j652n383r82
7006f512M290R61L134M052j361k260m932Q15O96m329k667O82L392J794m042l23
6990f610M081P336Q494K117p782q033n165j21m963jl125M273P235K465o984l931
6974a0714J0572M58o019n797p984m435N126N681k944J337J1055J625P71q763k430
6959a2461K662Q613N940k379M995l397k336l566p48j244Q568O299J294m654k649
6944D937n935K866K731J02J274L880n490n563L448l186k347J265J231L750M375
6929G338n127p346o323k268M194Q943K873J2179Q430j2451l829o233n293l898
$$ y = [-11136, -8928, -6815, -10651, -11991, -3866, -1713, -4670, -9443, -9829, -2204, -5255, -8360, -1587, -1141, -533, 5939, 768, -1216, 3526, -908, 122, 4080, 7786, 13565, 9349, 3902, 1505, -147, -5530, -6512, -2222, -1261, 1873, 5925, 4564, 2304, -2628, -1813, -1117, -5446, -8113, -7431, -4039, -2245, -6287, -6610, -2529, 4807, 13301, 15418, 7636, -397, -5562, -5683, -10646, -10647, -13772, -9499, -2264, 201, -6783, -10714, -142, 316, -5703, -11500, -19484, -23919, -18793, -13112, -16056, -14719, -3664, -2039, -1268, -10031, -12461, -9799, -1186, 4754, 2375, 7370, 3973, 1637, -1929, -2677, -3921, 4647, 10946, 12240, 7586, 4937, -998, 1868, 4599, 4701, 5975, 9855, 4365, -1198, 2250, -936, -3283, -2018, -787, 2963, 7338, 2211, -5135, -11458, -13726, -9532, -589, 2284, 14463, 22893, 10442, 6613, 380, -4913, -8811]
6915h811L203O494J286k131L101n812p330j882m55J497R128m932q548L250J040
6900a0902N669o1J779K673L129q87k294m304l917j327l244j000J848R868J145
6885a825P238L085k416j987K168K300o39O22n579n921K841P19j118P89L377o938
6869c284m756N122L01n466n066K278K742K125M009k561k866R88m797l72L724O522
6853a357Q836J746n408J207L410J271r54l062q547n524m604j80K282M898k078
6838h064p205L990N426M181L170L023j633J174j292p30k700j871M399N719k444
6823E143l168p32R53N0j356n25k571j624l56o26L525K944L68k629l015k058l046
6806h723n3m544N040J3472M642j3859m092l186J275O498N143k168L666Q273J340
$$ y = [-8811, -5608, 886, 2172, 41, 3142, -2670, -10000, -11882, -12337, -10840, -1712, -6644, -15192, -11942, -10902, -5233, -5294, -3515, -842, 2287, 1400, -894, -5198, -9115, -10442, -13686, -14686, -12838, -2970, -1825, 5413, 8498, 6082, 4095, 6263, 8563, 7924, 8546, 2967, -2954, -113, 606, -512, 277, 3654, -3284, -8040, -2918, -2617, -8083, -13149, -10871, -8129, -6004, -1995, -4556, -7422, -6434, -11231, -11603, -7879, -1357, 7479, 9225, 3817, 5024, 8434, 9705, 8751, 5689, -2858, -8382, -12986, -13166, -10884, -5986, -8064, -15269, -11279, -5853, -1672, 1498, 4521, 2888, 4062, 2770, 2040, -660, -2531, 1868, 7587, 5143, 1975, 1243, 2196, 2246, 890, 365, -2206, -3830, -4186, -4812, -1287, 1657, 2025, -604, -3619, -5677, -8723, -8776, -13320, -8280, 5192, 9834, -4025, -8117, -11303, -10028, -3530, 1613, -555, 3111, 11384, 12724]
6791A2724q11p88j48N06m781m905q22L600l787N889N075m206l512q671M992J405
6775A760K65N118n196k883L747J675K044m611m843k352P0L104M800L238q642j707
6759d413k062m984O298Q31J666K439L607j334L68j197l264N980l72m040k557N239
6743B205J612n08o290p530K330J381J0332M339r31j679k464j516j17L5K604k143
6727A660N319L193K469n175k077n491K012Q028K458k597m933j199M177l386p451
6712b993K838Q719K047m143m726n032L891J3284j792r469p277L531N149L706r811
6697b078q852l463N170O732N21M477L540J65o134j0106L587O797N086K056J16
6682G614j651n357k709j621K328j202k247N061j311m186l488K44L85L607L815
$$ y = [12724, 11913, 11125, 10977, 11483, 6702, 1797, 975, 4575, 788, 6677, 11752, 7546, 4034, -4637, 355, 1760, 2025, 7143, 1947, -936, 2811, 4486, 6530, 1919, -2924, -5276, -5206, -2102, 2698, 5936, -2706, -4413, -6475, -11459, -5161, -4330, -2664, -225, 3382, 2048, 2416, 1219, -2045, 3935, 3563, -477, -3034, 2205, 3817, 3309, -2981, -10511, -8181, -6800, 3532, 7871, 6940, 5261, 2797, 1281, 1164, 1199, 3803, 1660, 6979, 10172, 12641, 7466, 5389, -102, 1910, 9938, 12396, 9799, 4866, 3667, 7844, 4458, -2993, -155, 8564, 10611, 6468, 1742, -3290, 601, 13885, 12093, 2624, -4653, -1122, 4027, 7733, -2078, -10930, -14393, -9223, -2491, -1970, 2507, 6047, 6212, 78, -10028, -6441, 356, 5442, 7498, 7614, 5963, 606, -2103, -3724, -1396, -2598, -4845, 216, -1095, -5281, -8769, -8525, -8140, -4533, -718]
6667g18k363p4M073O750k022n131q42J601r22j367N002L222n290P11m917r88m407
6650g682O72Q596O424o926p097l299J335N9l130j71J759J66K606P353K06m550
6634c679p035q101M056l216K043N946M071Q77k974k399K931K523M401N52N308
6619E304O787k972m038Qm281l599M692Q71k267j636k358O85K926N07l741Q87O701
6602D476p86j337m743J608N25j863l646l883J546O435q44J138m31o09N22O010
6586D118j440j574l124l558J916N654K006N135O07J732p90m470M304k31j350O33
6570I568n849p75l987q58L394k821k87o26L99K628J863k759K397J910O92k604
6554B285j318J061K330P241l307j4484O71j356L236K601K484l740n655K098L781
$$ y = [-718, -3081, -3155, 918, 7668, 5646, 515, -327, 1274, 352, -1015, 3987, 7209, 1919, 2630, -2287, -3275, -7682, -7010, 1586, 8010, 1084, -6013, -9312, -7977, -7918, -11048, -11219, -9460, -9294, -6688, 665, 871, -3679, -10714, -18815, -14759, -17975, -15932, -9986, -5915, -5038, -8012, -10411, -7480, -4957, -556, -4, 5304, 12091, 9119, 5081, 5089, 808, -2791, 1901, 2772, 505, -1131, -3489, -2804, 122, 629, -3112, -2225, 4476, 3690, 2353, -2390, -782, -257, -2120, -5766, -9649, -8103, -1668, -2512, -1374, -1805, -2414, -1892, 4118, 2678, 1104, -2020, -5578, -3662, 1992, 3998, 9133, 9740, 11472, 10682, 6212, 10516, 10285, 8935, 9568, 3719, 2944, -1043, -1901, 1493, -1328, -1615, -2241, -1842, 786, 2649, -110, 2287, 4197, 4889, 2285, 967, 2028, 4358, 11599, 8292, -6192, -5521, -6877, -3641, -1040, 1444, -2296, -7951, -5853, -2072]
6539b072O144J648j880k217p98M01L500m120j0046k500k849l227J0735Q544K061
6524C324K538r55L16j540L367q7j090l374K18O231p185l165j0067n291l499K809
6508a7450J1975R002k043l465m130j95P073k950m75p281l703M0q8P429K422K06
6492c633q51N90J39m856L681j911M499L58p095k656P327O647M008p525o043l254
6476a0575N183P263n252m539k283M574O247j749l72m49J090p05j193m984M300
6461c444Q429o569m13J62k313r547L274J6909j927k584K96j0597p350O258J326
6446h090N191J07l317j457k962n88N163L355N205M38m960n479N078L118n226K227
6430b197K345J309R58R00k431n161n484J365L288J085J616n549j883j183O811
$$ y = [-2072, 4072, 5720, 3840, 1623, 825, 1226, 4726, 606, -9440, -11940, -14789, -18016, -7281, 1263, 3324, 5862, 4907, 5223, 3683, 7050, 6963, 5873, 2499, 2717, 8948, 1763, -1402, -11469, -16760, -20259, -17450, -5475, 3527, 1484, -1981, -6111, -6306, 767, -2183, -2658, -9939, -13642, -13602, -13690, -6261, -3839, -3633, -4484, -3894, -3755, -8611, -4930, -6841, -2342, -1984, -9079, -11735, -4408, 2239, 6247, -1278, -7321, -10575, -5392, 1871, -3381, -7920, -10203, -5629, 618, -1131, -1503, -1952, -862, -1567, -2760, -7744, -3444, 4985, -1584, -1997, -1835, -4148, -13695, -10421, 6488, 4561, 1977, 2273, -8324, -15674, -9416, -8090, -2899, -2792, -6109, -7566, -10528, -11116, -5953, -2598, 2607, 3045, -1915, -7394, -2316, 802, -4424, -2197, 148, 1457, 2415, 3315, 884, -4277, -9761, -8396, -5108, -4023, -2407, -7956, -9839, -11022, -4211]
6415d211O329K440K853m062r139l671K382M91M778K492O10L032l222m452m031
6400g381N015P131P787l045k850p599r313j897o24J1q98j839M529N291N010k218
6384b890L638k602j957p778n275O32K826M367L554Q344N883k235l908k97n217
6369b915P59J020l306k897Q79k95N156K13l02J727J421r5L067n153n543k2P242
6352I56j767K317N184K359n706n037l26j949P31j276Q18m9q28n89M36L817p76
6335a685j137k826k081K914O35K16j378k79k332n336k702J797Q07j888J624N378
6319h273O375j070N287L340j1919p052J315P381P690k783n851l484p509R32J898
6304a3723K096k554J800N768k184m151j940l316J131k934K478M962j643M081O353
$$ y = [-4211, 2118, 4558, 7411, 3349, -5790, -9461, -7079, -6588, -1810, 682, 1292, 4324, 1102, -3350, -7381, -2366, 4765, 12552, 9507, 6657, -942, -10255, -12152, -12776, -12765, -13663, -15502, -10973, -5682, -672, -2890, 748, -1854, -3811, -11589, -16864, -16232, -13406, -9039, -5485, 2859, 8742, 6507, 2599, 2302, -2915, -2156, -1136, -4442, -7339, -6460, -6755, -1599, -1386, -1688, 39, 1460, 1365, 4432, -721, -6264, -6286, 956, -811, 1506, 6690, 9049, 3343, -1694, -2020, -3969, -3238, -4514, -3696, -3745, -4573, -5162, -4726, -909, -1685, -2822, -5648, -7729, -4815, -4180, -3964, -5342, -5621, -7953, -13289, -15991, -14194, -13387, -15275, -13651, -8273, -1898, -2968, 2319, 5659, -6260, -13312, -11997, -4616, 3074, 291, -5560, -9044, -16553, -15621, -13723, -11627, -14181, -12381, -6613, -8797, -12948, -14888, -18204, -17073, -20007, -17529, -12567, -14210, -10129, -3776]
6289c776J880o32L399j961J107k093L447n918m48j917J912L663j366l574L469
6274b808M642o478l233N32J042O769L888K309N61l968J894p91K558r93n480j111
6258f67O59L431l427r453J99L306L258k59Q234k053M426J7j680o40l387p705M55
6241e286M752l071J917N367J741k440p65K54k422l418L622j366m233K470O019
6226C141o135l487m825J366P331L047L17n492J577O760P664J034k847k821n000
6211A630J820Q117p666o789j114L02O267m38n964J350R242r20K667k114n657J163
6195A896l898L081l881j1007Q44O935O889j0426J403O412m5N488k618j0151l016
6180a2094O486p423K116k2j71P4N91J522O370K554k457M145j143K633L162J228
$$ y = [-3776, -1896, -2528, 871, -1090, 17, -2076, 1371, -4547, -4995, -6912, -5000, -1337, -2703, -6277, -2808, 1834, -4644, -7877, -7345, -6303, 466, 4354, 6663, 7224, 3256, 5150, 4359, 6917, 5924, 444, -667, -8, 3423, -4, -9457, -9258, -5952, -2694, -2953, 5281, 3228, 7654, 7671, 5991, 5351, 1964, -5741, -5286, -534, -3605, -1688, 3679, 5420, 2980, 2215, 2469, 47, -3371, 251, -1115, -5348, -2878, 3141, -2994, -6481, -11306, -9940, -2609, 438, 755, -4737, -3160, 3600, 11264, 12298, 9451, 6630, 1630, 3450, 11567, 3901, -2888, -4002, -3700, 2567, 2129, -3835, -2485, 6757, 5837, 8504, 6390, 733, 1896, -2002, 1079, -2802, -13809, -12965, -6030, 859, -9567, -8164, -1752, -1797, 3691, 1073, -9078, -12094, -5608, -13031, -10915, -10937, -11108, -11034, -10443, -8921, -2551, 3, -2454, 1691, 548, 3181, 6343, 7571]
6164G571j629m471Q10l617j0130j695J592P334K790l197L365o30j497J9l000k585
6148h970J450k36k129M070J05k101K926K405o90j23m071l374k525J0997P422j575
6132C581Q00j702l720p912o089J379R96O845N138L291J467r18j667J322M4L904
6116F759o447p813k299j908L05J560N388k538k558N58K376K717j376l195K788
6101e683m210k385M95N740N642m094j885K582l66J316k47O65O654K320n393Q07
6085A958O088k907J544m296p87R081J359n615k57l549r57j980m768J300M612J131
6069A957O89j237K94P85L256J024p719k214K046M76J101N88k653J416m072q71
6053e134K406k169m111k561K68L887P671L695K329q013n542K647N356k611l469
$$ y = [7571, 5942, 1471, 2281, -1336, -11466, -13161, -11569, -4235, -1445, -4642, -1277, -1907, -3404, -3385, -6385, -8970, -7520, -7756, -9885, -5815, -5710, -7811, -4885, -2480, -3170, -3293, -7364, -10738, -13263, -2266, 5156, 3581, 4381, 2679, -1041, -8953, -15042, -13663, -12667, -5822, -684, 2607, 4074, 3156, 1489, 2811, 2855, 6759, 312, -7501, -9800, -11708, -11403, -9843, -4455, -6993, -9551, -8993, -6617, -3900, -5276, -8471, -5683, -9893, -12278, -11783, -6043, -401, -4495, -6380, -3798, -4164, -2848, -3095, -2430, 4224, 6544, 1151, 1958, 8046, 5139, 6683, 2387, 1600, 10681, 12040, 6425, 6168, 2619, 1662, -318, -5086, -3786, 826, 1957, 2646, 1409, 1703, 2488, 5744, 6768, -951, -3165, -1119, -643, 458, 1046, -1607, -191, -4263, -5134, -2728, -4897, -9008, -11569, -11301, -7414, 257, 3952, 6281, -1732, -7274, -4627, 729, -1882, -5351]
6038e351J277j577O103L694j567n237k895n063K76O041O252j945M8O030P75k547
6022D314l425j765k073j013J326J691L41k46p20o73l032k94N368L727j981m325
6006b780l978J051N457M042l956q454l878J985l323m840M441J673m580N20M342
5991a2278O028M092q22l155j283Q849K597m215m864n684l537P312L137M224n12
5976a11R31Q50J114N800K617j0012q889q776L582N914q2j501O55m47m794L126
5960a0023Q391m89K722p93j191K283J0441J804q251n584m962p6L338L344l551
5945b597p889j820k22L59N891J3471k136m346K141L624L036K669m606m692q75
5930B008M17M03L755l586L598Q85j013L132k251m862L186K525K481J80k761k766
$$ y = [-5351, -4074, -5651, 452, 4146, 2579, -2658, -5553, -10616, -10340, -4299, 1953, 8, 56, 6086, 6861, 4314, 889, -876, -2949, -3962, -2636, -945, -604, -850, -1570, -2243, -5275, -5569, -201, 3526, 1545, -2780, -6758, -5707, -250, 3792, -164, -8618, -12496, -10511, -13834, -18674, -14233, -12560, -17140, -16620, -12278, -6250, -2158, -2980, -6135, -7418, 1431, 4028, -187, -5051, -10735, -14272, -6960, -3823, 401, -111, 820, 1670, 2784, 8584, 11201, 1189, -7700, -16476, -12894, -6980, -7062, -8563, -7908, -8355, -13149, -10023, -1632, -2121, 601, -192, -1383, 900, 11341, 13145, 4894, -690, -5652, -5728, -2390, 954, -2597, -10486, -12306, -12528, -12169, -6278, 7193, 5057, 711, 2852, 6476, 9512, 12181, 7575, 2883, 2008, 2425, 2828, 6583, 2997, 6595, 7480, 6467, 9599, 7348, 2486, 5672, 8197, 10678, 10858, 8097, 5331]
5914E331o563p610N498K966Q68j052q234j0135j699P068J0202J571j608O861O955
5899A0419p707m743J007L90p85L059o504K359k911n098P035Nk533M283j022o308
5883i054k917M615k661M863M945j246k850K400J275l475o980M661J91n149N806
5868e576J2283m08j863m083l032m058j44q31O336Q7m79p769r157M938O047O773
5852i36R119o759J015j701J998L711n144j407O34K137M654M876k037j5160j81
5837e181O66N51k03K485M364n686p918N467o55k941N310K413n8K795o037J972
5821b656J324k313P430K382j380l392l043l654j416J280j104K979j39k665O443
5806G6P438J45m329j276j1386n339M905K372M832J745m589K080j2240j59P099
$$ y = [5331, -1232, -8842, -3344, -378, 490, -562, -8796, -18931, -20630, -13562, -3360, -1789, -3397, 3464, 10419, 2712, -2031, -1024, -634, -1419, 1640, -4864, -2505, -5416, -10514, -3479, -3474, -6007, -1724, -2746, -9054, -11971, -7356, -10017, -5154, -209, -1455, -4305, -1905, -630, -4105, -11085, -6424, -6233, -11382, -5576, 6707, 6299, 4436, 353, -2679, -6737, -6881, -7712, -1376, -1289, -1768, -9537, -18694, -13756, -7709, -936, 8183, 1424, 2439, 738, 2736, 6447, 1303, -104, 530, 2667, 7321, 12197, 10160, -5000, -5181, -4515, -3964, -4167, -1682, 2682, -3004, -10922, -5455, -6110, -9051, -3741, -1328, -1386, 1409, -4628, -2656, -1332, -3645, 3785, 6167, 4787, 1395, -1648, -5302, -6718, -5438, -6542, -3563, -3702, -6367, 76, 7514, 7659, 3330, 2054, -9332, -14671, -9766, -7394, -2562, -817, -5406, -3326, -15566, -15725, -8626]
5791h626K852m371J850N872Q045N847M671q734l608Q00o092p885k452P130K34
5776d467l477K795N573J524m622L835L580O534m348j2540m6l299Q68n001n79K693
5760a0977Q92Q85j497k219P50P393J023K685L356j3n331m39J747r61L628N940
5744F862o363p38N80j248J419m97O42p58K763p998p082J668M011m480L966P418
5728A65J717P13l688k225N4M029o18m12P24K531o019k228J783j042L295N015k782
5711A012r905q980K807L72j189L237P05L06j797N971R365j562L970k215m976k796
5695e675l270l717O568J0526l345Q26q06m694j372K082J575K074K877k476M782
5680E955l504j0458o173k06L886n61N706N795l609R2J606K103o972l58N667j72
$$ y = [-8626, -5774, -10145, -8295, -2423, 5622, 11469, 16140, 7406, 3798, 4598, -1494, -9379, -11831, -4701, -4467, -7944, -5149, 424, 1948, -2674, 1161, 4741, 11275, 6927, -5613, -5659, -8958, -8090, -13091, -13670, -10977, -10085, -9200, -10697, -12916, -12166, -4773, -3750, -1065, 2291, 2278, -3053, -3492, -1745, -2706, 922, 6862, 499, -239, 341, -907, 512, 15, 657, -101, 2662, -5336, -12418, -10750, -6739, -11219, -7253, 165, 1882, 2595, -1093, -3318, -3264, 765, 147, -265, 459, 2990, -3029, -5257, -3474, -4516, -1221, 3794, 1012, -8893, -17873, -15066, -14694, -15883, -12646, -11941, -11635, -13432, -7461, 1904, 342, 4312, 2097, -2879, -5675, -8945, -12662, -6094, 4432, 1087, 1913, 1107, -3587, -4959, -2877, -1302, 772, 3649, 1173, 5955, 2451, -8007, -14180, -14386, -10500, -11061, -5355, 440, -3169, -3077, -1471, 632, -6340, -6698, -1031, -1203]
5664a203j272m523p327j148L741J94k075j940L313Q132J1174j231m93L914K966
5649A2222o530L46l229M275K632l324p137l909J645j492l011Q028l51Q76j062
5634b1o481n398L651l183k052n450N889N083Q105Q89n087n10k805j584J648P162
5618a44J514K100p510q26L016j619m138l264j480M538N712O324O945r18k243j1686
5602c679k897L161k251q44Q904M570k825m689P11N258k627n603p102N180L639
5587a094K84m595m986k576O466Q280n33o243n217p24N703M351K033l586m624j197
5571h258R545O296P1n727j55M190J018k790k705l560L417O595N052l699j876j945
5555E469m60k436n711q971J451P673J088k571k248O861O95K429l441j529L24M278
$$ y = [-1203, -2475, -6998, -14325, -15473, -11732, -11538, -13613, -15553, -12240, -4108, 7066, 5835, 5342, 9256, 12222, 5692, 6038, 2809, 7084, 9716, 6392, -745, -4654, -3009, -4501, -7512, 516, 165, 1041, -21, -6502, -11900, -8249, -11432, -13484, -18934, -13045, -7962, 143, 1032, -4055, -4565, -7370, -8954, -7306, -144, 1370, 3470, -4040, -4866, -1850, -3469, -7607, -10871, -12351, -7813, -2101, 4223, 11168, 10250, 8007, -3679, -6576, -3415, -5666, -6510, 2394, 6964, 4139, -550, 161, 5419, 2792, -2811, -9913, -4733, -1094, -810, -5405, -10391, -12967, -6501, 1779, 1246, -4997, -10214, -10938, -5235, -884, 1149, -2437, -7061, -8258, 1287, 7583, 7654, 1927, 1772, 5962, 6980, 4190, 1485, -2075, 1342, 7937, 12989, 9290, 7414, 5469, 5009, 2573, -3138, -12109, -10658, -2985, -1897, -4468, -6716, 145, 840, 3269, -172, -1701, -1377, 2901]
5539B901J808k047m634K831l181k462J362l755l56n84O01O01L667j990l950q326
5523a7514k573N606J4151O909k328p647k988k868q78m140m669K328k861n26K673
5508a7325P391J1928J370M6o329m77l833K566L631K842m083K392o554L764n121
5493g792k918J72K836N973R893L519j783r48m858o591j453k419n340L444M086
5478d179N959L667J543L2o32K489k019j74o024M318o885o452J888j893M955R629
5462F222m849r947M838M340J309M979n123k126k828j954k501M206J608j253p406
5447a0485J30N136K122L441Q671L22l190m102p100j662K345m987o898M925L624
5432g708P807J3184L050j2199r067j2568J808O038l209J817j711Q67K750Q691
$$ y = [2901, 4709, 2662, -1972, 859, -2322, -4784, -3422, -7177, -7533, -8117, -7516, -6915, -3248, -5238, -9188, -17514, -20087, -14481, -330, 6579, 4251, -3396, -6384, -9252, -10130, -14270, -18939, -16611, -19472, -19998, -17325, -9934, 1994, 3364, 3410, -2919, -3396, -7229, -4663, -1032, 1810, -2273, 119, -6435, -2671, -7792, -10710, -10538, -7702, -1729, 8164, 11683, 9900, 8952, 4094, -2497, -3950, -6369, -11709, -8265, -4179, 1780, 5447, 6990, 7022, 6390, 8879, 6860, 6686, 662, 4980, -1905, -8357, -6469, -8362, -3407, 6222, 1373, -8574, -3736, 604, 1913, 6892, 1769, -357, -3185, -5139, -7640, -3434, -1826, -3079, -10485, -10355, -5219, -3097, 344, 9015, 9337, 6147, 2045, -5055, -6717, -4372, -9359, -16257, -11332, -7708, 99, 13283, 16333, 4134, -4933, -17501, -15693, -9655, -12864, -11047, -12758, -11891, -9141, -450]
5418d50M838P498k480k091j078n859J832J639P641o433r529j884k350m852J361
5403a2197L190P1k621N54K555N508N89o650J825J070m756k866m41Q065N196k87
5387a195j911m842R19L942J83j838k13k187J605O373j776m684P452j600o201L518
5371b455p27L77J239K953N631k153p021j556Q48J281J293m04P587p09k339L590
5355G435J846m640q388r47L23L430j036l036k883M017j937q385L31k405J189P77
5339a4309k93m600j574N319k704L292J250L245L205K293K391J141N14O304J876
5324G350O52n518j840K745J970K280M20j486k333K13J740k018q455l743j029J192
5308g860K854K319J108k083P60O952q2m302q71j694n411q04O551P494l550o01
$$ y = [-450, 4388, 11886, 9406, 7315, 6237, 378, 2210, 3849, 11490, 5057, -4472, -6356, -8706, -13558, -12197, -9007, -8936, -11557, -11003, -8448, -2940, -2351, -9001, -7176, -6106, -10862, -13728, -14169, -6104, -908, -1195, -3106, -7948, -7029, -3087, -2904, -4742, -4955, -7142, -5537, 836, -940, -5624, 1828, 228, -5973, -2455, -3182, -2805, -1566, 1387, 7018, 4865, -2156, -3712, -2864, -1583, -290, -694, 6893, 6184, 3845, 7435, 9281, 4641, -3747, -4694, -4371, -941, -1977, -5013, -7896, -3879, -5816, -14201, -13870, -16275, -15086, -14309, -14602, -19202, -20776, -15457, -18161, -14869, -13619, -10374, -7169, -4876, -2485, -1344, -830, 5474, 7350, 8002, 2484, 644, 3389, 5359, 7639, 8059, 6573, 4240, 4453, 6193, 4175, -4280, -8023, -9052, -7860, -5006, -2687, -1579, -3662, -2902, 4050, 3968, -334, -1205, -2899, -8310, -9114, -2563, 4931, 1381, 780]
5292G80M79k774K156l115j884n91J113P32k68n615N23J3178M887r215k433L299
5276A252j340j1J914l4N010j476o71J939n704j01L870j290K156j056j348L03n25
5259B888M010r01J132L893l347k127l623J733L465j2095q251j430K755m624P37
5244a5785J866N003Q293P375p4k719n96J296N75k290K585r723n972n941n27J796
5228a4838P079L02M018r71k32P377P57j989J636P8o381q16m628o676l509M201
5212a4592j836m74J0001K096J834n36J907J741k990l540P258J349m108n38n209
5197g637k271m99j421M72R742n30p978N157r97N48n17L310J0805m866r629J256
5181e055K171L914n4J46l085J158k069j83j791k116m357N003M585K471l750n462
$$ y = [780, 1259, -1515, 641, -2474, -4358, -4949, -3836, -3104, -3372, -8987, -8464, 4714, 9601, 386, -2047, 1252, -88, -99, 1815, 1781, 6791, 5315, 4644, 6583, 879, 778, 4648, 3358, 5514, 4458, 3110, 3413, 2888, 6898, 5997, 7129, 11022, 7675, 5548, 1925, 3658, 7123, -4972, -13223, -14653, -11898, -16522, -15785, -13919, -8916, -623, 6752, 6678, 3959, 3363, 4659, 5234, 2944, 5529, -4194, -10166, -16107, -16634, -14838, -7759, -7457, -3439, -4410, -4642, 2735, 3492, 1503, 3139, 3217, -3164, -3980, -8608, -15284, -18793, -14592, -16428, -16902, -6901, -4805, -2971, -3507, -1600, 141, -2849, -6389, 869, 2218, -1890, -2428, -7637, -9908, -10407, -11828, -11356, -1614, -2144, -10122, -4965, -5962, -5414, -5931, -2621, 8184, 3318, -6311, -5055, -2884, 1030, 976, 1122, -1963, -805, -2874, -3057, -4848, -6964, -11321, -6318, -1733, 738, -3012, -8474]
5165h474M307P066j905p406k908M922K780l84J0758L149j4172m931p51O994m601
5150e556m130l944O198J1483N362P363k501r471n813k368M986K648r04j392j93
5135A768p01J43n915l686J566J0870Q066j694k823r991L976N026j996q62J882
5120E629k193L47j911K598L951l305m884L762k215J213R51k157r379L484P365
5105C256p149n225J401O035J397l516L168O858k475n268p342j200J656p186o41
5090a6231J2564O803m156J104J804M636k164l663o63m659J320j817N348j79n693
5075e646N340j808r695j671Q61N200k801M704K326k848K929N148N247l570J540
5060E256K4m711p372j230M223Q1N040K473p203q024K88M593J81K771M065R38j130
$$ y = [-8474, -4167, 2899, 994, -6412, -9320, -4398, -1618, -2002, 8756, 11905, -2267, -7198, -7949, -955, -5556, -9686, -13630, -7432, 4051, 9413, 16776, 14275, 4804, -1009, -3377, 1609, 4257, 3353, 1961, 1768, 1067, 1210, -4705, -8391, -6825, 4045, 12111, 10417, 7594, -2397, 1579, 6605, 4609, 3747, 5629, 3436, 3783, 1872, 4470, 8421, 5116, 232, 3994, 1779, 2992, 3943, 1786, -7593, -4109, 3256, -3893, -9118, -7717, -1682, -285, -3801, -633, 6225, 3750, -1518, -8860, -10060, -8404, -15590, -16231, -3667, 3136, -1020, 84, 1888, 6524, 4360, 697, 34, -4625, -3305, -5122, 226, 47, -5646, -306, -2114, -11809, -13480, -12619, -7419, -10220, -5516, -3190, -6038, -3109, 2039, 7286, 3716, 5256, 5280, 569, -6803, -8033, -3810, -3729, 1311, 3784, -3419, -11443, -11155, -6562, -6381, -3610, 455, 1393, 263]
5043B63j372O274k946k04O26p161j0261M560Q346k835k360M180Q671O251m79p858
5027C695r357l659O011M569m99l83M45p883k386J184N596Q974P434m153m560m314
5011G14K184N825Q12m013n112m63r669J098n860n43M667m2l583Q39Q828J794P15
4994a809j256J364o85j323j704L473O03R74K522R18k612n050m474k339O15J934
4978h849L788M65r17Q358J634k332J740P74M74J805K333j582l858n996k211J306
4962c068r82O377k972l856m16l426K415k529J265M839j47k044l168J798P146K810
4946D042q11l012J707N949r66J143n648J514k929m111M713l706R37J808J715l450
4930a105o803l838n4R1R364M113j032n090j658N720O165m313r27K706Q400p86
$$ y = [263, -1109, 5165, 2219, 2015, 2641, -4520, -14781, -10221, -1875, -4710, -7070, -2890, 5781, 12032, 11553, 3695, -5662, -9321, -3310, 1259, 760, 377, 822, -7061, -9447, -8263, -2667, 6307, 13741, 9588, 5028, 714, 2898, 8723, 9535, 5522, 410, -53, -9722, -8624, -14484, -15027, -10360, -10402, -13985, -13146, -4318, -2524, -1809, -3065, -1701, -2386, -3709, -5413, -1940, -1337, -363, 2159, 3077, 465, -4585, -9059, -11398, -10783, -8849, -5061, -4596, -5513, 2845, 4479, 2147, 3887, 4661, 5135, 6940, 9273, 7691, 3833, -2163, -4374, -3068, -4050, 2327, -645, -4501, -4917, -8343, -5928, -8457, -7192, -2353, -2500, -4544, -7712, -5914, 1232, 4042, 3231, 219, 1926, 7875, 6909, 8052, 2404, 3918, 989, -3122, 1591, -2115, -1178, 630, 2345, -1105, -7908, -11746, -11800, -11709, -2345, 1768, 736, -4354, -6012, -292, 5873, 1560, 633, 3339, 11739, 10953]
4914A0953m394j1164Q28O315Q20N71j640j839l593M77k834L47J995l774j513j683
4898a0128P933O325K11j376n68N55k873K441K395Q30l99l370j01m758j0451m75
4882a3809J018j743J268K836K768K627j079l176J038j074O468L641j059P689L065
4867A0478q04m575P26O71N80N10K723m707o138O36k188n937J622q261M092J0963
4851C91o00l575Q82K786J148k20L891o287k043n56l533k769Q55O230j950n776
4835a1126L777J0216j412j3605j717j97N790M848M277M601l502r98o00k641L468
4820A179L828m17J083m128k047l101j152j04K046j913k142j525o03M346m092P69
4804g973R853R135L629o849o487j830o696m328J697L778N087j078l516m186O292
$$ y = [10953, 6559, -4605, -3777, 2538, 3358, 3929, 2289, 450, -3143, -2666, -5500, -5153, -3158, -6932, -8445, -10128, -2195, 4130, 4341, 2965, 2397, 2952, 79, 2520, 4915, 5745, 5346, 1976, 1875, -2883, -13334, -13809, -12791, -14534, -13266, -10430, -7662, -5035, -6114, -9290, -8252, -9326, -2858, 783, -276, 7413, 10478, 9674, 5099, 5825, 6496, 7076, 7586, 10309, 5602, -536, 100, -2088, -8025, -6403, -14664, -10572, 391, -209, -3784, -2902, -116, 1032, 812, 4703, -1584, -3627, -4183, -7716, -10485, -9630, -3400, -5350, -11126, -7349, 2867, 1455, -12150, -13867, -14064, -8274, -3426, 851, 5452, 1950, 952, 352, -2289, 1179, 5007, 4590, 5673, 1545, -502, -3603, -4755, -4859, -2813, -4726, -6868, -8393, -8996, -4650, -8742, -7973, 1880, 11015, 14644, 7795, 1308, -522, -7218, -11546, -9849, -6071, -984, -2062, -5578, -9764, -3472]
4789c472J8l211l806K724k52j279J0880l163J677N039k383l660j863J680n275
4774f346J203K868m274J875O584m92q664r09M644K383J613j296M892l266l212
4759b397l057m557K466P727L037k045L624o74j833J321l583n314O046J178K045
4744C984j314n084K395N67o53k457q688n547j805Q089J476L235J564k002o543
4729a2783J0170P312l916j263K02O163M069J698p847r932N43L518n91o51M989
4714A681o25j929o446k321M454K787N42k839N92N16m499J4M362J32j825M661l44
4697a087m139L029J926n40k706k65l06J532R71n100P10j16m917R478J0271j93
4681H548K62o364l294l219p035j425L762N95J755q17o22J995N004P721R60l506
$$ y = [-3472, -3454, -6665, -10471, -7747, -7999, -9278, 1602, -1561, 116, 5155, 2772, -888, -2751, -1071, -6346, -5143, -2275, -6549, -4674, 1910, 1418, -7246, -8155, -3511, -1128, 485, -811, 4081, 815, -2397, -5454, -10011, -7545, 182, 3219, 1174, 4798, 4124, 2291, 3612, 29, -5285, 761, 1939, 3984, 2670, -2414, -19, 548, -105, -2562, -11250, -16797, -18602, -10513, -9037, -5802, -4238, -6240, -12783, -2613, 4699, 783, -480, -278, 5885, 9954, 11652, 3805, -6127, -5584, -2066, -2657, -3308, 1681, 1056, -873, -7319, -9640, -5186, -2399, -1857, -4696, -4104, -3588, -8087, -8073, -3711, -3579, -5404, -743, -1087, -5226, -2197, -271, -811, -3517, -3782, -4088, -2556, -1585, -6685, -5975, -6091, -11008, -1530, 8741, 8548, 8810, 2446, -848, -4067, -11102, -12527, -8765, -8170, -6415, -7232, -7854, -5859, -855, 6866, 7826, 4320]
4665D320j110j06q83k612K84K079O33m011l44K893Q645j88o070o676k789L821
4649b114M300L006n222m288K432O101R23o482L421J253m97j095r526n382J820
4634a1350M447J114L166P949J260k876L57l497l420j2616L666J305n006J499N468
4619h534P644K166N816Q300K31q836r215L91L628k606K372O621m01M03p410J129
4603A699k355k924j329J0326L374j185L8j827K052p101r889m423l610O953K149
4588h052M346L853L386K223n09m944o299M383K920m969q10m99J963K352k235L819
4572I28N943Q991L296q41j385n077r51K807K309j143j581n973l843N77l24j312
4556B421j267K191m437M77J179m987O61p51J896l796K584p405O572O731j309L208
$$ y = [4320, 3210, 3104, 2221, -391, -107, 1972, 2605, -1406, -1750, 1143, 9788, 9600, 3530, -3146, -5935, -2114, 2186, 5192, -30, -4318, -1886, 4215, 5138, -1344, 2077, 3330, 2833, 1738, -7788, -13170, -11350, -6903, -5789, -2623, 5326, 6586, 3710, 4067, 570, -2850, -15466, -11800, -10495, -15501, -14002, -8534, -890, 1276, 7092, 15392, 15623, 6787, -2428, -2037, 1591, -1015, 1357, 7978, 7577, 7980, 570, 1699, -656, -3580, -4909, 5417, 8791, 7606, 7644, 5817, 7869, 768, -9121, -13544, -17154, -10201, -8052, -3706, 147, 3533, 5756, 5247, 303, -5996, -1613, 1307, -3662, -4472, -4971, -3008, -656, -2891, 928, 6871, 15862, 19158, 18317, 16932, 11855, 10904, 13711, 16020, 14877, 13296, 7323, 3480, 4057, 3733, 2421, 1154, 3345, -1092, -615, 564, -4423, -3762, -4513, -2617, -6413, -3829, -11234, -4662, 2069, 760, 3968]
4540C968l264l971N72r97q29j867J602Q249k188j890K914M427P14m684n940k322
4524e506q34r6N966K18q457j113P595K797L515m268k850K983l125j840M756L508
4508C249k473J320m05r927o446j893n11M413Q184K37l279L01r98P634K935m886
4492b545j182O137p99J18p564l380K206m210j063Q452M334K293J381n482j056
4477b360J268j402J237k482K756m274L388Q44M337m029m028m736O52M784M70j032
4461d607r92k286q09K874P403J420l156N2o784o252N566K703k73K891Q09k371
4445c812Q979k501k939P313M271j408j970q82k837p008l503l07K999n012j491
4430a0108Q300J573j583j560O445k464j0089J662K79q282J666N736l644n235O144
$$ y = [3968, 704, -3267, -2695, -3692, -4521, -6388, -4786, 3463, 1275, -615, 2299, 6726, 7440, 2756, -3184, -5506, -6340, -6436, -470, -252, -8709, -9822, -2227, 570, 4085, -183, -3033, -50, -3175, -5015, -259, 3249, 776, 2096, 1691, -8236, -14682, -16575, -17086, -12673, -4489, -4252, -7531, -7230, -8228, -594, 2341, -2545, -3727, 2410, 1611, 1729, -5835, -9215, -7009, -11219, -12282, -3830, 504, 2797, 4178, -1304, -2360, -1092, -2494, -1257, -3739, -983, -5257, -1869, -1025, 3312, -717, -4745, -9481, -8829, -4045, -3575, -4607, -5599, -7885, -8694, -5820, 1583, 3003, -153, -101, -6885, -13137, -7571, -4868, -5141, -2250, -1441, -3812, 5167, 2666, -273, 7040, 11311, 9903, 7933, 7051, 4214, -2794, -6297, -6604, -3605, -8617, -10108, -1808, -235, -1818, -3378, 3067, 603, -9486, -7824, -7545, -15827, -14161, -8425, -12069, -17304, -11160]
4415a1160J0556L793l273m223L192J248l248l089k742J732Q918K706L330o407
4401A333m256q509m84L714J267k512m293N813L185l643l816K183L004J917o948
4386a2045k35J635M434N963M141M971r641m977M171K243o71K002J68j773j755
4371a369P687r002o891P228O627q332M440L710K558q599j618L648l486j122L225
4356a296n975p150L155L689L410j131M527L875J068o338l243l797m553K672J079
4341a0008K486L651L083P263J875k48p462m455j473L371k053m082k226M76K265
4326g537k719P9J762J271Q749L577o000o035Q78n9P18J607M735q80k160O388K315
4309F689o612o06M001J009K43m918m392m860J20J309J5L486o64J84m47p777P48
$$ y = [-11160, -604, 3189, -84, -4307, -1115, 133, -3115, -6204, -8946, -7214, 1704, 4410, 7740, 1333, -2923, -11432, -11916, -8202, -6935, -9447, -13740, -7927, -4742, -8385, -12201, -10018, -7014, -5097, -12045, -12280, -10645, -6211, -248, 3893, 8864, -777, -5754, -1583, 660, -11, 1991, 2159, 386, -1369, 6318, -2684, -9575, -2347, 4280, -4052, 388, 4098, 6656, -1943, -3561, 87, -3399, -4521, -1296, -7271, -14421, -11266, -7577, -4167, -5298, -771, 3104, 4172, -2166, -5409, -9206, -13759, -11087, -10008, -7522, -3871, -788, 6475, 8350, 8102, 640, -3815, -5288, -1917, -3970, -8052, -10278, -9802, -7537, -10256, -10177, -8415, -7144, 1605, 5182, -818, -6853, -5975, -6034, -5316, -3709, 1026, 146, -2014, 4374, 6689, 77, -529, 3472, 4481, 4724, -194, -4586, -9446, -9326, -8017, -8002, -4516, -5180, -4996, -5443, -13220, -12472]
4292a2472N83k148O339J329P31p548K239P070j947m373J033K941M090Q220k63
4277E824n363l23l22j051o898K838M99R85K322O253K062n738j820J151Q003o67
4261G755n15l048L37n181k072K376J30K310k303L0k35n414j252K165M171L43j511
4244a914k735o079J261J252n969P47l204L986k499N233J316K929O833L019n405
4229a229j516m381o702o563M618l92N940L571L499R939l918N25r459L084N119
4214B135j297n52p3p25m218l446P47K383M344L06n350j029k436L42J946J756K255
4197b912j744M08K857k404K654O883J641K572L086o501q04L149o44m615l586n731
4181e691k802M020M759m424M037M802l880q616l999J969n14J284M301K156L987
$$ y = [-12472, -11889, -14037, -7698, -6369, -5638, -13186, -10947, -3877, -5824, -10197, -9164, -6223, -2133, 6087, 5824, 461, 138, -184, -1235, -8133, -5295, -4796, -3811, -1489, 4764, 6826, 1088, -732, 419, 8422, 7755, 7240, 4192, 4529, -652, -2724, -348, -218, 2092, -211, -181, -416, -5830, -7082, -4917, -746, -403, -1914, -4649, -10728, -9467, -8215, -14184, -13437, -16641, -12655, -15154, -9921, -8605, -5676, 1157, 4176, -1229, -2745, -7126, -13828, -20391, -15773, -16165, -10225, -6654, -3155, 6784, 2866, 3391, -6068, -2984, 2135, 838, 286, 213, -512, -4730, -8176, -7429, -5046, -702, -396, -5746, -6775, -9211, -8869, -6923, -5167, -2912, -4656, -4248, -1391, -3795, -1141, 5742, 7383, 9955, 13041, 6540, 5736, 8885, 8241, 3626, 40, -5691, -8493, -4473, 286, -4138, -101, 4701, 821, -7795, -11794, -9825, -10339, -9055, -4754, -2598, 1389]
4166A389M273r895q026O661M37k521P056m835k87J879J778J783P58l540m142k223
4150i455P792L994L404k90r019j133J306O337m899M76M465M364J45n589k216m930
4134e248J720O96j312J785J593J197j063p01n577o109m443K658N136k005L242
4119h431Q089L64m293m130N952M072K72l600m976k764l385k613L712L051J06P91
4103g783L802K057L60L181N375J891J547M03p660p748p756L889O675k018K790
4088i95j490j702p49J224P559L809l502o338l279m019l065K502k255N4J066L524
4072g656Q634K729k724K608o448q370l326NK658R15J751J591j097k795M461K358
4056d706R62m805K262j421j904K190k961M28N944J0l155M376j293m921L498M575
$$ y = [1389, 5662, -4233, -12259, -5598, -5161, -7682, -626, -5461, -5748, -3869, -2091, -308, 450, -3090, -7232, -9455, -1663, 2331, 5735, 5445, -3574, -4707, -3401, 2936, -1963, -1487, 2978, 7342, 7487, 1898, -318, -5248, -3528, -2832, -4144, -2359, -766, 431, -632, -1333, -6910, -13019, -17462, -14804, -9668, -11673, -8431, -342, 22, -4271, -8401, -2449, 1623, 1895, -1705, -6681, -9445, -12830, -15443, -11731, -8680, -8574, -7783, -3981, -1924, -1564, 1617, 6992, 8883, 10430, 10833, 3173, -4575, -12331, -8442, -1767, -3785, -995, -2485, -4187, -4936, -3712, 3847, 7656, 4154, -2184, -5463, -9482, -12547, -10045, -12300, -12246, -11180, -7656, 978, 3707, 983, 3591, -2857, -11227, -14553, -14548, -11890, -10975, -9224, -7633, -8730, -11525, -7064, -4706, -3744, -8549, -6287, -7708, -9612, -7422, -10383, -9955, -4011, -4001, -7156, -2780, -4073, -8994, -5496, -921]
4040i21R18m939n965j647L674k370Q54O481O746M66o987l97M205r055r62K780
4024g119J357J777K536L081M36m676K186L55L820n760K755O160k244n375L237
4009B526K830k147n130j249L44K584J546j742J597n16J66m988n849j33L851j196
3993g506j140O91p31J533L773K258L68k225r35J395k231L056n568r808L253R331
3977d486P503Q52j955j630J947m834o115p06J347J773K969Q799P319j919j437
3962I427k640j888n578J428o39n18k996p78l189K2Q953J431j34P745l50j0222
3946G4j738L493l996o804n019P4M629M199L72j933p712m845Q267P825o83o518
3930a0315Q036N650K316M550l515J75r16q074J070L167k648k510M418M729L81
$$ y = [-921, -3, -4942, -10907, -12554, -8880, -11250, -10396, -3915, 2831, 3297, -3690, -4087, 118, -8937, -9899, -7119, -5762, -3985, -1449, 1632, 2068, -2608, -422, -67, 3753, -2007, 748, 6908, 4664, -711, 2526, 5356, 3209, -1921, -3170, -2826, -242, 1304, -438, 1159, 643, 809, -4179, -10028, -10161, -6310, -7506, -8646, -7955, -8686, -7153, -3380, -1122, -754, -2979, -3914, -2519, -4750, -1694, -7262, -17070, -13817, -4486, 3017, 3869, 1914, 284, 2231, -2603, -8718, -9424, -8077, -6304, -3335, 5464, 12783, 10864, 9427, 6787, 4899, -679, 749, 110, -408, -3404, -4182, -7371, -7349, 1604, 3035, 2901, 10646, 10296, 74, -1664, 1829, -2167, -8971, -13990, -13916, -9287, -5088, -4716, -6649, -14361, -19206, -10939, -3114, -3797, -10315, -2279, 3371, 5687, 10237, 6722, 6897, 5981, -2093, -1023, 2144, -504, -3014, 1404, 6133, 6514]
3915F514m503j1069L065K298L192L22n831l328J519M9J351o811j148O491J1158
3900C269n89L135o776j062L869n03q2k479K38Q84L764k847L375J646r01J054k930
3883C065m398k55J425p023n337K920P945m60m634l311N160J157L239m14j258N316
3867C137j736K23K585l899l31k234r442l726J791K230m910j467O629J475K744
3852f931K992J197j671K003J12n037k599L399n658K056l285P665R130l787m133
3837d547J87R374K393K810p037p71J145N82p676k304J319J955k940J81L033L11
$$ y = [6514, 2011, -9058, -5993, -3695, -503, -181, -6012, -9340, -7821, -7772, -6421, -13232, -14380, -7889, 3269, 2680, 5815, -961, -2023, 1846, 1343, 1261, -1218, -980, -96, 3668, 821, 4196, 5842, 4941, 5995, 3065, -1333, -1588, -163, -7186, -12523, -9603, -1658, -2118, -6752, -10063, -4903, -3746, -507, -921, -2179, 3137, 1401, 1624, 4209, 310, -21, -2255, -11697, -15423, -13632, -11402, -16312, -17779, -11150, -9675, -6931, -3939, -2742, -4413, -2410, -2298, -7335, -9934, -6535, -12193, -10137, -13422, -5757, 3373, -414, -4547, -4360, 5014, 7407, 10217, 3180, 2409, 3554, 4136, -3540, -5844, -4525, -2570, -5510, -5329, -2296, -1985]
$$ [...]
##END NTUPLES=NMR SPECTRUM
##END=
