##TITLE=Analysis number 315131
Compound Code cc 31004
Book Reference 440/96
Project Code adrs
Chemist Name craigr
##JCAMPDX= 6.0         $$ Bruker NMR JCAMP-DX V2.0
##DATA TYPE= NMR SPECTRUM
##DATA CLASS= NTUPLES
##ORIGIN= Bruker BioSpin GmbH
##OWNER= NMR
$$ XWIN-NMR		Version 3.5
$$ Tue Nov  8 12:22:19 2005 GMT Standard Time (UT+0h)  MAYBRIDGE\NMR@NMR_250MHZ
##.OBSERVE FREQUENCY= 250.131544655141
##.OBSERVE NUCLEUS= ^1H
##.ACQUISITION MODE= SIMULTANEOUS (DQD)
##.ACQUISITION SCHEME= undefined
##.AVERAGES= 16
##.DIGITISER RES= 18
##SPECTROMETER/DATA SYSTEM= dpx250
##.PULSE SEQUENCE= zg30
##.SOLVENT NAME= CDCl3
##.SHIFT REFERENCE= (INTERNAL, CDCl3, 0, 16.4664)
##AUDIT TRAIL= $$ (NUMBER, WHEN, WHO, WHERE, WHAT)
$$ ##TITLE= Audit trail, XWIN-NMR		Version 3.5
$$ ##JCAMPDX= 5.01
$$ ##ORIGIN= Bruker BioSpin GmbH
$$ ##OWNER= NMR
$$ C:\u/data/dgb/nmr/ADRS/12030/pdata/1/auditp.txt
$$ ##AUDIT TRAIL=  $$ (NUMBER, WHEN, WHO, WHERE, WHAT)
(   1,<2005-11-08 12:21:47.03 +000>,<MAYBRIDGE\NMR>,<NMR_250MHZ>,
      <created by zg, POWCHK disabled, PULCHK disabled
       configuration hash MD5:
       62 19 C7 07 E1 42 D1 B7 37 6C 3D D0 77 39 F9 E6
       data hash MD5: 64K
       D9 CE 9F 10 8B D3 C1 CA E0 32 2C F5 9B 5F 5C AE>)
(   2,<2005-11-08 12:22:02.36 +000>,<MAYBRIDGE\NMR>,<NMR_250MHZ>,
      <Start of raw data processing
       ef LB = 0.3 FT_mod = 6 PKNL = 1 SI = 32K 
       data hash MD5: 32K
       16 F9 D1 B1 12 FF 8C CC D1 C7 D5 26 0E 32 19 0F>)
(   3,<2005-11-08 12:22:04.60 +000>,<MAYBRIDGE\NMR>,<NMR_250MHZ>,
      <apk 
       data hash MD5: 32K
       14 31 71 98 AC 4D A9 6C 02 8F A8 2C A6 C6 50 99>)
(   4,<2005-11-08 12:22:05.66 +000>,<MAYBRIDGE\NMR>,<NMR_250MHZ>,
      <abs ABSG = 5 
       data hash MD5: 32K
       D0 55 DC E4 FB 94 62 B5 B4 33 44 81 F3 2C A8 3F>)
$$ ##END=
$$ 
$$ hash MD5
$$ B0 B7 80 DC A1 09 65 38 00 9D FE B6 63 CF 44 77
##$RELAX= 
##$RELAX= 
##$RELAX= 
##$RELAX= 
##$RELAX= 
##$RELAX= 
##$RELAX= 
$$ Bruker specific parameters
$$ --------------------------
##$DU= <C:\u>
##$EXPNO= 12030
##$NAME= <ADRS>
##$PROCNO= 1
##$TYPE= <nmr>
##$USER= <dgb>
##$AMP= (0..31)
100 100 100 100 100 100 100 100 100 100 100 100 100 100 100 100 100 100 
100 100 100 100 100 100 100 100 100 100 100 100 100 100 
##$AQSEQ= 0
##$AQ_mod= 3
##$AUNM= <au_zg>
##$AUTOPOS= <19 >
##$BF1= 250.13
##$BF2= 250.13
##$BF3= 250.13
##$BF4= 250.13
##$BF5= 500.13
##$BF6= 500.13
##$BF7= 500.13
##$BF8= 500.13
##$BYTORDA= 1
##$CFDGTYP= 0
##$CFRGTYP= 5
##$CHEMSTR= <none>
##$CNST= (0..31)
1 1 145 1 1 1 1 1 1 1 1 1 1 1 1 1 1 1 1 1 1 1 1 1 1 1 1 1 1 1 1 1 
##$CPDPRG= <>
##$CPDPRG1= <>
##$CPDPRG2= <>
##$CPDPRG3= <>
##$CPDPRG4= <mlev>
##$CPDPRG5= <mlev>
##$CPDPRG6= <mlev>
##$CPDPRG7= <mlev>
##$CPDPRG8= <mlev>
##$CPDPRGB= <>
##$CPDPRGT= <>
##$D= (0..31)
0 1 0 0 0 0 0 0 0 0.06 0 0 0 0 0 0 0.0002 0 0 0 0 0 0 0 0 0 0 0 0 0 0 
0 
##$DATE= 1131452505
##$DBL= (0..7)
120 120 120 120 120 120 120 120 
##$DBP= (0..7)
150 150 150 150 150 150 150 150 
##$DBP07= 0
##$DBPNAM0= <>
##$DBPNAM1= <>
$$ [...]
##$SUBNAM7= <"">
##$SUBNAM8= <"">
##$SUBNAM9= <"">
##$SW= 20.6930455092707
##$SWIBOX= (0..15)
0 0 3 0 0 0 0 0 0 0 0 0 0 0 0 0 
##$SW_h= 5175.983436853
##$TD= 65536
##$TD0= 1
##$TE= 295.16
##$TE2= 300
##$TE3= 300
##$TEG= 300
##$TL= (0..7)
0 120 120 120 120 120 120 120 
##$TP= (0..7)
150 150 150 150 150 150 150 150 
##$TP07= 0
##$TPNAME0= <>
##$TPNAME1= <>
##$TPNAME2= <>
##$TPNAME3= <>
##$TPNAME4= <>
##$TPNAME5= <>
##$TPNAME6= <>
##$TPNAME7= <>
##$TPOAL= (0..7)
0.5 0.5 0.5 0.5 0.5 0.5 0.5 0.5 
##$TPOFFS= (0..7)
0 0 0 0 0 0 0 0 
##$TUNHIN= 0
##$TUNHOUT= 0
##$TUNXOUT= 0
##$USERA1= <user>
##$USERA2= <user>
##$USERA3= <user>
##$USERA4= <user>
##$USERA5= <user>
##$V9= 5
##$VALIST= <valist>
##$VCLIST= <CCCCCCCCCCCCCCC>
##$VD= 0
##$VDLIST= <DDDDDDDDDDDDDDD>
##$VPLIST= <PPPPPPPPPPPPPPP>
##$VTLIST= <TTTTTTTTTTTTTTT>
##$WBST= 1024
##$WBSW= 4
##$XGAIN= (0..3)
0 0 0 0 
##$XL= 0
##$YL= 0
##$YMAX_a= 414788
##$YMIN_a= -357441
##$ZGOPTNS= <>
##$ZL1= 120
##$ZL2= 120
##$ZL3= 120
##$ZL4= 120
##$ABSF1= 16.46644
##$ABSF2= -4.226732
##$ABSG= 5
##$ABSL= 3
##$ALPHA= 0
##$AQORDER= 0
##$ASSFAC= 0
##$ASSFACI= 0
##$ASSFACX= 0
##$ASSWID= 0
##$AUNMP= <proc_1d>
##$AZFE= 0.1
##$AZFW= 0.1
##$BCFW= 0
##$BC_mod= 0
##$BYTORDP= 0
##$COROFFS= 0
##$CY= 12.5
##$DATMOD= 1
##$DC= 0
##$DFILT= <>
##$DTYPP= 0
##$F1P= 14.0000005364418
##$F2P= -0.99999901652339
##$FCOR= 0.5
##$FTSIZE= 32768
##$FT_mod= 6
##$GAMMA= 0
##$GB= 0
##$INTBC= 1
##$INTSCL= 1
##$ISEN= 128
##$LB= 0.3
##$LEV0= 0
##$LPBIN= 0
##$MAXI= 10000
##$MC2= 0
##$MEAN= 0
##$ME_mod= 0
##$MI= 0
##$NCOEF= 0
##$NC_proc= -2
##$NLEV= 6
##$NOISF1= 0
##$NOISF2= 0
##$NSP= 0
##$NTH_PI= 0
##$NZP= 0
##$OFFSET= 16.46644
##$PC= 1
##$PHC0= 74.78093
##$PHC1= 6.834797
##$PH_mod= 1
##$PKNL= yes
##$PPARMOD= 0
##$PSCAL= 4
##$PSIGN= 0
##$REVERSE= no
##$SF= 250.130013895759
##$SI= 32768
##$SIGF1= 0
##$SIGF2= 0
##$SINO= 400
##$SIOLD= 32768
##$SREGLST= <1H.CDCl3>
##$SSB= 0
##$STSI= 32768
##$STSR= 0
##$SW_p= 5175.98343685301
##$SYMM= 0
##$S_DEV= 0
##$TDeff= 65536
##$TDoff= 0
##$TI= <Analysis number 999999
Compound Code 99
Book Reference 9
Project Code 9>
##$TILT= no
##$TM1= 0
##$TM2= 0
##$TOPLEV= 0
##$USERP1= <user>
##$USERP2= <user>
##$USERP3= <user>
##$USERP4= <user>
##$USERP5= <user>
##$WDW= 1
##$XDIM= 32768
##$YMAX_p= 321803000
##$YMIN_p= -28142
$$ End of Bruker specific parameters
$$ ---------------------------------
##NTUPLES= NMR SPECTRUM
##VAR_NAME=  FREQUENCY,     SPECTRUM/REAL,   SPECTRUM/IMAG
##SYMBOL=    X,             R,               I
##VAR_TYPE=  INDEPENDENT,   DEPENDENT,       DEPENDENT
##VAR_FORM=  AFFN,          ASDF,            ASDF
##VAR_DIM=   32768,         32768,           32768
##UNITS=     HZ,            ARBITRARY UNITS, ARBITRARY UNITS
##FACTOR=    0.157963299565203, 1,           1
##FIRST=     4118.75091624121, 0,            0
##LAST=      -1057.2325206118, 0,            0
##MIN=       -1057.2325206118, -28142,       0
##MAX=       4118.75091624121, 321803000,    0
$$ Real data points
##PAGE= N=1
##DATA TABLE= (X++(R..R)), XYDATA
$$ [...]
15152i591N856N219L90p539l087J295O599L280n87k98k665o197K994J893k249
15137d687O535K65n301o859O4M156N326K342m593R93M907J618p673k409k098k277
15121i691K801j36j24R54J403K937m94k629j041N944N355p109l894l225k378N243
15105f084O193P728P76p073K053O50o358q20l030q963k582Q964J837k806j0277
15090a9792j119K427m403k67M807N549m303k329N134M045m588k854J434j393K189
15075a5463J1089L940k50k608L070n054N2J604m993m156k770m02O12M15L708K854
15059h352K410K056l151m13l380M435j76l783P248N230K73q751o872k533K365
15044a3394K781J931l069j840O759K214J540l105j939N973J270K720j913j1819
$$ plain form
15152 -9591 -3735 1484 1874 -5665 -8752 -7457 -858 2422 1835 1537 -1128 -7325 -4331 -2438 -4687
15137 -4687 1848 2113 -3188 -10047 -9983 -5827 -501 1841 -2752 -1759 3148 4766 -2907 -5316 -7414 -9691
15121 -9691 -6890 -7026 -7150 -6196 -4793 -1856 -2350 -4979 -6020 -76 5279 -1830 -5724 -8949 -11327 -6084
15105 -6084 109 7837 8613 1540 3593 4243 -2115 -2935 -5965 -14928 -17510 -8546 -6709 -9515 -19792
15090 -19792 -20911 -18484 -22887 -23154 -18347 -12798 -17101 -19430 -14296 -10251 -14839 -17693 -16259 -17652 -15463
15075 -15463 -4374 -434 -684 -3292 -222 -5276 -5224 -3620 -8613 -12769 -15539 -15941 -15329 -14914 -11206 -8352
15059 -8352 -5942 -3886 -7037 -7450 -10830 -6395 -6571 -10354 -3106 2124 2397 -6354 -13226 -15759 -13394
15044 -13394 -10613 -8682 -11751 -13591 -6832 -4618 -3078 -6183 -8122 -2149 -879 1841 -72 -11891
15030a1891j368K176M375N293n438k589j924J541M156j777k098K199N780j389
15016b954R68j850k67K909J213M44k163n872M627R80p195J611J11J983l807q193
15000a7455j928N205P23j404K42L211k769J400N986P480J463L691j300j38O648
14985A1055N951O690K2439L7169L547k3066j0765n791j0381j9160j4242l132n803
14972e489o691N061K290l614l541O40O990j350r64J457L701M02m622k814q111
14957a6655M49L203M158O974J338n1R63K147L563j064m939K101k356J746n226
14942c649Q09M722J949q53L253K358o3l398Jj976K391O04M448k224j626p53l955
14925B038N153J1593J4010k821l678j2769n349K230r07m242r363m981P288K991
$$ plain form
15030 -11891 -13259 -11083 -6708 -1415 -6853 -9442 -11366 -9825 -5669 -7446 -9544 -7345 -1565 -2954
15016 -2954 -1986 -3836 -4103 -1194 19 463 -1700 -7572 -2945 -1965 -9160 -7549 -7438 -5455 -9262 -17455
15000 -17455 -19383 -14178 -13455 -14859 -14617 -11406 -14175 -12775 -6789 691 2154 5845 4545 4407 11055
14985 11055 17006 23696 46135 83304 86851 63785 53020 47229 36848 17688 3446 314 -5489
14972 -5489 -12180 -7119 -4829 -8443 -11984 -11344 -4354 -5704 -6668 -5211 -1510 -1108 -5730 -8544 -16655
14957 -16655 -16206 -13003 -8845 -1871 -533 -584 379 2526 6089 5025 86 2187 -169 1577 -3649
14942 -3649 -2840 1882 3831 2978 6231 8589 8526 5128 5129 3153 5544 6148 10596 8372 6746 5993 2038
14925 2038 7191 18784 32794 29973 26295 13526 8177 10407 9500 5258 -4105 -9086 -1798 1193
14911A193j207j140K464J175J07j0102M354K71n171m337R67k644m32l2M687J3718
14895C871k134p145P865M328r788k328K912j919n872m178L968L122O74K337m245
14880h532J265N200J796K00L89Q4L121j83o78m701j590m9j9O845k065o866l287
14863i070J266O358k390J594j259K038r96N22l184N399L79N287O913n437j975
14848E445q072l662O663l604m007O674N836n259j027L467k391n13n402l622K735
14833f739R44K058J362l108l639J64j773N48P61M536O178J981k209O33M559j457
14817D799j229l276j477k542j746M095L807m862K533K703k278l531q088l637M940
14802i789o38M60Q341L980o854n301Q19N684L983K875n231m227o297J952N270
$$ plain form
14911 1193 -14 -1154 1310 2485 2592 -7510 -3156 -2885 -8056 -12393 -11426 -14070 -14502 -14534 -9847 3871
14895 3871 1737 -5408 2457 6785 -3003 -5331 -2419 -4338 -10210 -14388 -10420 -7298 -6624 -4287 -8532
14880 -8532 -7267 -2067 -271 -71 318 402 3523 3340 2662 -2039 -3629 -3678 -3697 3148 1083 -5783 -9070
14863 -9070 -7804 -1446 -3836 -2242 -3501 -1463 -2459 -1937 -5121 278 657 5944 12857 7420 5445
14848 5445 -2627 -6289 374 -3230 -7237 -563 5273 14 -1013 2454 63 -450 -5852 -9474 -6739
14833 -6739 -5795 -3737 -2375 -5483 -9122 -8958 -10731 -10183 -9422 -4886 1292 3273 1064 1697 6256 4799
14817 4799 3570 294 -1183 -3725 -5471 -1376 2431 -2431 102 2805 527 -3004 -11092 -14729 -9789
14802 -9789 -10427 -9967 -1626 2354 -4500 -9801 -8982 -3298 685 3560 -1671 -5898 -12195 -10243 -4973
14787d973N396j075l515p960J460J1040J0083J987J03O85N920J2331l196Q25N955
14772C5066K1026K7245M1938O0124M3552K8981J5959J5906J6744L58k7722m4808
14760B34369m1694k9669k8031l7622l1890k1155l801j0165p959l630k801m728
14748A1224r872n499m290K157k368m067o92M945N841O878j477p68m669n250l491
14733a1398p461O243M640N50O78j54k816l288j523N240O305Q62l753J721J130
14718c024J52k95l495J784k643m747J844O312J719K999n28K599n958j131Q973
14703D561J239k126J273m43m820q007N91l77k636O060N046J967j530j002m517
14688d721j621K319M956k968l672o614k2L271q72o255K277Q28O96L680M755l687
$$ plain form
14787 -4973 423 -652 -4167 -12127 -10667 373 10456 12443 12546 13231 19151 31482 28286 29111 35066
14772 35066 56092 83337 125275 185399 228951 257932 273891 289797 306541 306899 279177 234369
14760 234369 192675 163006 134975 97353 65463 44308 40507 30342 22383 18753 15952 11224
14748 11224 1352 -4147 -8437 -6280 -8648 -12715 -13407 -8462 -2621 4257 2780 2012 -2657 -7907 -11398
14733 -11398 -18859 -12616 -7976 -7426 -6748 -6902 -9718 -13006 -14529 -9289 -2984 -2122 -5875 -4154 -3024
14718 -3024 -2872 -3167 -6662 -4878 -7521 -12268 -10424 -4112 -2393 606 78 2677 -3281 -4412 4561
14703 4561 5800 3674 4947 4504 -316 -8323 -7732 -8109 -10745 -4685 361 2328 798 -204 -4721
14688 -4721 -6342 -4023 933 -2035 -5707 -12321 -12343 -9072 -9944 -16199 -13922 -13094 -12398 -8718 -3963 -7650
14672g650k694l345m95M143L643l916k494Q271Q168K185j251n329N895n61J111
14657E681o950P90J080n984m148k451p429j292K489K135N272L647J88M889l665
14642e748p788q70L311N024N657K14k063j0966l471L038L152K187N251m684j0086
14627a7842N050M604l387N82M694J258j433J212j030o08p959o931J153M811N567
14612a0259K153M392j554n89K191k095J185l966l120n234P27O827K626M834N12
14597a370l772O11p94m926J60l636Q59Q85J680m99O152j217n700K845L532N251
14581F1R481J006j1835k245K165p3o16r52K72k603l465o037n70O961J729n81l480
14564a0782k451P69J12L942j818k268M056N018K329k69P37J67J803J201j669j412
$$ plain form
14672 -7650 -10344 -13689 -14184 -10041 -6398 -10314 -12808 -4537 3631 5816 4565 -764 5131 4570 5681
14657 5681 -1269 -479 601 -5383 -9531 -11982 -19411 -20703 -18214 -16079 -10807 -7160 -6972 -2083 -5748
14642 -5748 -13536 -14406 -11095 -6071 -414 -200 -2263 -13229 -16700 -13662 -10510 -8323 -3072 -7756 -17842
14627 -17842 -12792 -8188 -11575 -10993 -6299 -5041 -6474 -5262 -6292 -6900 -14859 -21790 -20637 -15826 -10259
14612 -10259 -8106 -3714 -5268 -5857 -3666 -5761 -4576 -8542 -11662 -16896 -16169 -9342 -6716 -1882 -1370
14597 -1370 -5142 -4531 -5325 -10251 -10091 -13727 -12868 -11983 -10303 -10802 -4650 -5867 -11567 -8722 -5190 61
14581 61 9542 10548 -1287 -3532 -1367 -1440 -2056 -3008 -2736 -5339 -8804 -14841 -15411 -8450 -6721 -7302 -10782
14564 -10782 -13233 -12464 -12352 -8410 -10228 -12496 -8440 -3422 -1093 -1362 -625 -458 1345 2546 877 -535
14548e35o402l355K453P477j380j0208j3636Q49J1265R588l958j516n746m666
14534a9770K271P121r20p5j907L473K082J50J628k616j15J525k063l314K03L987
14518h340q38O807M366j218k647N783M490j1182p980k105P844K475J359k820J0894
14503F888o2j831J530j813o718L817J879l559J76M641k505k685j362n411n108
14488a2123P316J971m338j383P48O867l979r66N160L333P78p30r473p659j692
14473a6170N047p57n524j866O514Q672N236P036P14k763L083o183j808p330L092
14458c007m45m037M517L029j351m710j175k752J484K448L452K179j116J628j139
14443i95k711n253j959l511k268L327L690k77k129K191P70m35m30Q63L500M144
$$ plain form
14548 -535 -6937 -10292 -7839 -362 -1742 -11950 -25586 -24737 -13472 -3884 -7842 -9358 -15104 -19770
14534 -19770 -17499 -10378 -11298 -11373 -13280 -9807 -7725 -7575 -5947 -8563 -8678 -7153 -9216 -12530 -12327 -8340
14518 -8340 -9178 -2371 1995 777 -1870 3913 8403 -2779 -10759 -12864 -5020 -2545 -1186 -4006 6888
14503 6888 6826 4995 6525 4712 -2006 1811 3690 131 307 4948 2443 -242 -1604 -7015 -12123
14488 -12123 -4807 -2836 -7174 -8557 -7809 -942 -4921 -5887 -727 2606 3384 2654 -6819 -14478 -16170
14473 -16170 -11123 -11880 -17404 -19270 -12756 -4084 1152 8188 8902 6139 9222 3039 1231 -6099 -3007
14458 -3007 -3452 -7489 -2972 57 -1294 -6004 -7179 -9931 -8447 -5999 -2547 -368 -1484 144 -995
14443 -995 -3706 -8959 -10918 -14429 -16697 -13370 -9680 -9957 -12086 -9895 -9125 -9560 -9990 -9127 -5627 -1483
14427a483r125m538J050P304N992M367L950m328j447l932K903R99m96M961j676
14412D501p077K83j532j1259p92O341O240K007m983l63p318n792J89K367O785
14397a0403M048k841l283p41r14P151K652M404L731L552j1549o342m927k004L51
14382a7115P954J484q855n614n996P755J0027K065l288k5M559K62r111M167P730
14367d001K894o169o587k105k060K025K076L32N054p45k314l332L77Q58K821L114
14351g762M925J389l336j235J976K292K661j519J750q88j17P36q250K039J785
14336c554k393n116j19N237L304q092J545P285Q63j861J049m010L07O345j928
14321a138m345m608l442K792Q595l212p529l199N081k905N154L402J394n520m297
$$ plain form
14427 -1483 -10608 -15146 -14096 -6792 -800 3567 7517 3189 1742 -2190 713 1712 1216 6177 4501
14412 4501 -2576 -2293 -3825 -15084 -15876 -9535 -3295 -1288 -6271 -6634 -13952 -19744 -19555 -17188 -10403
14397 -10403 -6355 -9196 -12479 -13220 -14134 -6983 -4331 73 3804 7356 -4193 -10535 -15462 -17466 -17115
14382 -17115 -9161 -7677 -16532 -22146 -28142 -20387 -10360 -8295 -11583 -11608 -7049 -6787 -15898 -11731 -4001
14367 -4001 -1107 -7276 -13863 -15968 -18028 -16003 -13927 -13595 -8541 -9286 -11600 -14932 -14555 -13697 -10876 -7762
14351 -7762 -2837 -1448 -4784 -6019 -4043 -1751 910 -609 1141 253 136 872 -7378 -5339 -3554
14336 -3554 -5947 -11063 -11182 -5945 -2641 -10733 -9188 -1903 -1040 -2901 -1852 -5862 -5555 790 -1138
14321 -1138 -5483 -10091 -13533 -10741 -2146 -5358 -12887 -16086 -11005 -13910 -8756 -5354 -3960 -9480 -13777
14306a3777L978O16j0296K330R875j679j0807Q33Q602N310n244l540r75P201l559
14291a1132k334P49o7N919K363J88n246q47o55L362O3m849j395m653p02J292Q346
14274i598M041j968l295K862K876J407M159p784j0927R79Q884k233r91M040m198
14259a1746k155M226J893j137O103O135P09l779k442j398L057k527q820L909Q297
14244C25l78r789n556L37N319O212l337j906M265J04m16Q639J748K35n114j7K124
14227B795N623m68l867l598l179k680K730P921l504m043J240p31j26m502j617
14212h006K191L694l999O038m570n958j651m252N164M374L337K058k01O363Q626
14197A3208q383j6509j244L897j455j282k924R430R003M186o417k289K802m102
$$ plain form
14306 -13777 -9799 -9183 -19479 -17149 -7274 -8953 -19760 -18927 -10325 -5015 -10259 -13799 -14774 -7573 -11132
14291 -11132 -13466 -12717 -12784 -6865 -4502 -4314 -9560 -10407 -11062 -7700 -7637 -12486 -13881 -18534 -19236 -17944 -9598
14274 -9598 -5557 -7525 -10820 -7958 -5082 -3675 484 -7300 -18227 -17248 -8364 -10597 -11588 -7548 -11746
14259 -11746 -13901 -9675 -7782 -8919 -2816 3319 4028 249 -2193 -3591 -534 -3061 -11881 -7972 325
14244 325 -53 -9842 -15398 -15061 -9742 -3530 -6867 -8773 -4508 -4404 -4820 3819 5567 5802 688 671 2795
14227 2795 8418 7950 4083 485 -2694 -5374 -2644 5277 1773 -2270 -1030 -1761 -1887 -6389 -8006
14212 -8006 -5815 -2121 -6120 -82 -4652 -10610 -12261 -16513 -11349 -6975 -3638 -1580 -1781 4582 13208
14197 13208 4825 -11684 -12928 -9031 -10486 -11768 -14692 -5262 3741 7927 1510 -779 2023 -2079
14183b079K037P3o94o989p267o177k93P897l729N24P733J339N198k471K206L012
14167C20J947k427n983p323J937N022N248J730r92j413m078m246O103P532m020
14152f43p187O81J201R863j591K395O49n103j196k51K211j687k923L349j504n816
14136g552l816p82k18l380l876j880M066K975L575J0127J395l254J753m820l936
14121i623j51n504J166K378l823J449K015K782l286M325K883p09J91m942l610
14106a4459P482J1268m832n324L521k347l98j058j498m275n09l9l859m443L710
14091a7060K939L142P519M277k363m339l378M218M050m784q505j800J388L616
14077a1080j61k25J633K278n495p366j943L803J0464M764m314j720k160N939J1645
$$ plain form
14183 -2079 -42 31 -663 -7652 -14919 -21096 -21389 -13492 -17221 -16697 -8964 -7625 -2427 -4898 -2692 320
14167 320 2267 -160 -6143 -13466 -11529 -6507 -1259 471 -521 -1934 -6012 -10258 -4155 3377 -643
14152 -643 -7830 -7149 -5948 3915 2324 4719 5368 265 -931 -1182 1029 -658 -3581 -232 -1736 -7552
14136 -7552 -11368 -12150 -12368 -15748 -19624 -21504 -17438 -14463 -10888 -761 634 -2620 -867 -5687 -9623
14121 -9623 -9774 -15278 -14112 -11734 -15557 -14108 -12093 -9311 -12597 -8272 -5389 -6098 -5907 -10849 -14459
14106 -14459 -6977 4291 -541 -5865 -2344 -4691 -5089 -6147 -7645 -11920 -12429 -12468 -16327 -20770 -17060
14091 -17060 -14121 -10979 -3460 817 -1546 -5885 -9263 -5045 -995 -5779 -14284 -16084 -14696 -11080
14077 -11080 -11241 -11466 -9833 -7555 -13050 -20416 -22359 -18556 -8092 -3328 -7642 -9362 -11522 -5583 6062
14062F062l817j1089p513n968J049K333O074O837O759L439l053r860p71j051k43
14047a0812L630O911J176m074J485L24L972K894j653j1102J150R941n784l800
14033e742J172K349M113k964l181N767J778L361n058j0072j238M858j104o993
14019a2954k753K873K16k96j872P273M113m209o51L650L885M401k717j2161j965
14004a3167O504P4M783P37l033o723j31J011k964N256N231J892J039o145j493
13989g129M65k68l590N012K52r71L730j481j0268O91K734J308J437l45k910N36
13973a0797L095M838m434k29Q22l354R897M763q795k22K528k242N046k54l972
13958c310j304l146J67Q840M049O92k311m589p134n370j217K348N370J229M068
$$ plain form
14062 6062 2245 -8844 -16357 -22325 -21276 -18943 -12869 -6032 727 4166 1113 -8747 -9518 -10569 -10812
14047 -10812 -7182 -271 905 -3169 -1684 -1360 2612 5506 3853 -7249 -6099 3842 -1942 -5742
14033 -5742 -4570 -2221 1892 -1072 -4253 1514 3292 6653 1595 -8477 -9715 -4857 -5961 -12954
14019 -12954 -15707 -12834 -12618 -12914 -14786 -7513 -3400 -7609 -8260 -4610 -725 3676 959 -11202 -13167
14004 -13167 -6663 -6589 -1806 -1069 -4102 -10825 -10956 -9945 -12909 -7653 -2422 -530 509 -5636 -7129
13989 -7129 -6664 -6932 -10522 -5510 -5258 -6229 -2499 -3980 -14248 -13557 -10823 -9515 -8078 -8423 -11333 -10797
13973 -10797 -7702 -2864 -7298 -7527 -6705 -10059 -162 4601 -4194 -4416 -1888 -4130 916 662 -3310
13958 -3310 -4614 -7760 -7593 1247 5296 5988 3677 -912 -8046 -13416 -14633 -12285 -6915 -5686 -1618
13943a618K153l638j112m475j608l65r85J029P59L158K633J59P506J568k365j734
13927A065o029n921m726P130R509L447k615p83k057k211J182l527K711r11j307
13912e043n613L057R663J30m554o054k670O162L450N063l809l7m658l579J0990
13897B498M789k691On5n951l554r34N130l556k9K094l431k84J335M40M168O148
13880F123L752k91L049J748J274l136l454p278n960P52K069J851j200J284k745
13865b162n481L412n364n311j307k586J024M772Q031J436M154L068P50l92l131
13850I13K072J80o657m760J174j581O414K272J337N65n643L81K208Q988Q13j1510
13834b834l562M871L466M423M62j776K296l857l601k026O11l69K940J268j66L243
$$ plain form
13943 -1618 535 -3103 -4215 -8690 -10298 -10663 -11648 -10619 -9860 -6702 -4069 -3910 3596 5164 2799 1065
13927 1065 -4964 -10885 -15611 -8481 1028 4475 1860 1077 -980 -3191 -2009 -5536 -2825 -3736 -5043
13912 -5043 -10656 -7599 2064 2194 -2360 -8414 -11084 -4922 -1472 3591 -218 -255 -4913 -8492 2498
13897 2498 7287 4596 4602 4547 -1404 -4958 -5892 -762 -4318 -4347 -2253 -5684 -5968 -4633 -4193 -25 6123
13880 6123 9875 9584 12633 14381 15655 12519 9065 1787 -4173 -3421 -1352 499 -701 583 -2162
13865 -2162 -7643 -4231 -9595 -14906 -16213 -18799 -17775 -13003 -4972 -3536 618 3686 4436 4044 913
13850 913 2985 3165 -3492 -8252 -7078 -8659 -2245 27 1364 1929 -3714 -3333 -1125 7863 8676 -2834
13834 -2834 -6396 -1525 1941 6364 6826 5050 7346 3489 -112 -2138 -1527 -1896 1044 2312 2146 5389
13818E389m264J816K133K715K042k438M550R27o208o151j117k67n876N752P060
13803F063Q447j524n969k163m074J528N768l37N330N847k333o662j468Q548M012
13788B1013k576K613O605L372J400l479l592J601m333l137Q03M859L13J927J184
13773B8573J88l804k380q322k945P164J2104K059m354j660m479O00k615j650N383
13758B3862O600j061l853j704N947K713J519m586r69M614L184q157j795N01j254
13743B5561K994K133M95K904m683q12J73j640N66j104K744M737P876m057K122
13728D0009n324n992K607k680j445m221j403n58L914K497j857K586J13n79p450
13713B0217l630L488K559k691J301j383M946P732K125j996l356N957O490K194
$$ plain form
13818 5389 1125 2941 5074 7789 9831 7393 11943 12870 6662 511 -606 -873 -6749 -997 6063
13803 6063 14510 12986 7017 4854 780 2308 8076 7739 13069 18916 16583 9921 8453 17001 21013
13788 21013 18437 21050 27655 31027 32427 28948 25356 26957 22624 19487 20290 25149 25462 27389 28573
13773 28573 28761 24957 22577 14255 11310 18474 30578 32637 28283 26623 22144 22744 20129 18479 23862
13758 23862 30462 29401 25548 23844 29791 32504 34023 29437 28468 33082 36266 28109 26314 26815 25561
13743 25561 28555 30688 31183 34087 29404 28592 28765 27125 27691 26587 29331 34068 41944 37887 40009
13728 40009 34685 28693 31300 28620 27175 22954 21551 20993 24907 27404 25547 28133 28246 27667 20217
13713 20217 16587 20075 22634 19943 21244 19861 24807 32539 34664 32668 29312 35269 41759 43953
13699D3953q784r35P101j140l723O933J665j1125o784J938k669L14J275N108P725
13684D0852L347j666o016k704K848J246L230o203p76K791K267Q27m981K491L917
13669D1470r31K204j221K533m135k585j960J637j237K899J173J279P42M121n202
13654D0787q681R03J194L255N266L285J345M64j146l507j236m589r18P15L677
13639D0814K16n024l251O492M305n492q254K819Q790m182l329N929N049q38m866
13624C9178m703k509o63p101J521M887M06J330J443K26j205R199O738q401l514
13609C6832R243R649M155p08L759L256j215n620m175l714m584j790j838J952M522
13594D9724j491k261j522J99J86L8R80N84L052o101L39O731j395L02Q483O360
$$ plain form
13699 43953 35169 34234 41335 40195 36472 43405 45070 33945 27161 29099 26430 26744 28019 33127 40852
13684 40852 44199 42533 36517 33813 36661 37907 41137 34934 34158 36949 39216 40043 35062 37553 41470
13669 41470 40539 42743 41522 44055 39920 37335 35375 37012 35775 38674 39847 41126 41868 45989 40787
13654 40787 32106 33009 34203 37458 42724 46009 47354 47818 46672 43165 41929 37340 36422 37137 40814
13639 40814 41030 36006 32755 39247 43552 38060 29806 32625 41415 37233 33904 39833 44882 44044 39178
13624 39178 34475 31966 31303 24202 25723 30610 31016 32346 33789 34015 32810 42009 48747 40346 36832
13609 36832 46075 55724 59879 59171 62930 66186 64971 59351 55176 51462 46878 45088 43250 45202 49724
13594 49724 48233 45972 44450 44649 44835 44873 45853 46437 49489 43388 43727 50458 49063 49365 57848 64208
13578F4208j232J285o601P80k906l514m014K031J0777N539M049n090l254n160
13564E6898n042L579O697R049N766m004l048l839J069J000k938K607O405J736
13550G5935m712k765k040j359K273M593o08J773M947j277l884J816P234M415M721
13535I1062m410j86p742m767J0167Q140j53K437J686M923J805j1636p426L570
13521H7470L897K046O452O252l881j544J621K954J693l48m05k176J987N61K563
13506A09142M191L666m02J362m17O47M845m091m705k511k091L699L046J438N427
13491A23246K634K817Q467M760P28p7o925k137K542N905J3357P209o243m737N852
13476A57398L535J500L806k148K317O559k740J983M884N986N424L320N740l087
$$ plain form
13578 64208 62976 64261 57660 58440 55534 52020 48006 50037 60814 66353 70402 65312 62058 56898
13564 56898 51856 55435 62132 71181 76947 72943 69895 66056 67125 68125 65187 67794 74199 75935
13550 75935 71223 68458 66418 65059 67332 71925 71317 73090 78037 76760 72876 74692 81926 86341 91062
13535 91062 86652 86466 78724 73957 84124 92264 92111 94548 96234 101157 102962 91326 83900 87470
13521 87470 91367 93413 99865 106117 102236 100692 102313 105267 106960 106612 106207 104031 106018 106579 109142
13506 109142 113333 116999 116597 117959 117542 118189 123034 118943 114238 111727 109636 113335 116381 117819 123246
13491 123246 125880 128697 137164 141924 142652 142575 135650 133513 136055 141960 155317 162526 156283 151546 157398
13476 157398 160933 162433 166239 164091 166408 172967 170227 172210 177094 183080 188504 191824 197564 194477
13462A94477j851l48n296m52M564N595l862l75M443L557Q211Q480R663J0914J608
13447B39328K595J528K229K176P405N227M888q72P283P475O579N539N247O902
13433C03529N49m606Q932R385J0324Q472Q092m144L378N460N913R690Q162J1121
13419C84257R068j252M867J2683J6203J1433O069J0273N782O315N504J4379J1584
13406D97165J0940P110P283J5523J6928J2570R677J1271R283J0252K3397K4113
13394F55512J3171J1014J7301J7646J7774J9174K1954J8633J7982K6346K8769
13383H65276K5629J5018J9786K7519K4514K9919K9130L1298L4642L9024L6826
13372A178581L9438L6091M1396M2434L7915M1147M7001M0881M4926M9577N6395
$$ plain form
13462 194477 192626 192278 186982 186530 191094 196689 192827 192452 196895 200452 208663 217143 226806 237720 239328
13447 239328 241923 243451 245680 247856 255261 260488 265376 264504 271787 279262 285841 291380 296627 303529
13433 303529 304078 299472 308404 317789 328113 336585 344677 340533 343911 349371 355284 364974 373136 384257
13419 384257 393325 392073 396940 409623 425826 437259 443328 453601 459383 465698 471202 485581 497165
13406 497165 508105 515215 522498 538021 554949 567519 577196 588467 597750 608002 631399 655512
13394 655512 668683 679697 696998 714644 732418 751592 773546 792179 810161 836507 865276
13383 865276 890905 905923 925709 953228 977742 1007661 1036791 1068089 1102731 1141755 1178581
13372 1178581 1218019 1254110 1295506 1337940 1375855 1417002 1464003 1504884 1549810 1599387 1655782
13361A655782N7296N8013N4531N7514N4961O2505N6427N8613O6177P0267O7936
13350B320022O2735O9120P6418P2531O7529O7007O5542P0552P0409O3059O2054
13339C066978O9803O7785P0131O5797O2517O3822O0965N4994N4849N5386N1557
13328C744584M5739N0274M8529M7371L1647L5459L3701K6860K8500K6874J7955
13317D137493J6822J5709J2322M239o46O84L136K404n532j1325r367j0361j7829
13304D137749j6389j8844j7129k0480k4987k3907k9017l5162l0572k5417l2638
13293C863207k8379l1173k9456k6829k7452k4272k5477k6907j9270k4249l0826
13282C568917k2230j2102j6706j2557p837j2540k858r6o957j457R823K2664J8725
$$ plain form
13361 1655782 1713078 1771091 1825622 1883136 1938097 2000602 2057029 2115642 2181819 2252086 2320022
13350 2320022 2382757 2451877 2528295 2600826 2668355 2735362 2800904 2871456 2941865 3004924 3066978
13339 3066978 3136781 3204566 3274697 3340494 3403011 3466833 3527798 3582792 3637641 3693027 3744584
13328 3744584 3790323 3840597 3889126 3936497 3968144 4003603 4037304 4064164 4092664 4119538 4137493
13317 4137493 4154315 4170024 4182346 4186585 4185939 4186623 4189759 4192163 4186631 4175306 4165939 4155578 4137749
13304 4137749 4121360 4102516 4085387 4064907 4039920 4016013 3986996 3951834 3921262 3895845 3863207
13293 3863207 3834828 3803655 3774199 3747370 3719918 3695646 3670169 3643262 3623992 3599743 3568917
13282 3568917 3546687 3534585 3517879 3505322 3497485 3484945 3482087 3481991 3475034 3473577 3483400 3506064 3524789
13269C524789K2602K0390K1765J6069K2087L6899L3105K8667K9566L9517M5460
13258C840916L7133L3051L6257L8291L8964M2619M2358L3537K8355L6221M2395
13247D250097K4980K8189K8359K3549K2687K4205J9564R533J9217K6968R779J1389
13235D498516M864J420J602r625q916o624j5479k1761k7473k5447k5971l6051
13223D329055k8655m0242m8897m2793n1429n2661n5014o0942n6581n9683n7941
13212C774217n4255n8490o5526o3357p3052p7706p0944p0287o8222o5648p5522
13201C031208p1549p4984p1215p4075p1502p2530p3664o7968o9144o8955p1563
13190B244059o5077n8536n9337n5589n3489n7769n6447n1086n2151m4635m6091
$$ plain form
13269 3524789 3547391 3567781 3589546 3605615 3627702 3664601 3697706 3726373 3755939 3795456 3840916
13258 3840916 3878049 3911100 3947357 3985648 4024612 4067231 4109589 4143126 4171481 4207702 4250097
13247 4250097 4275077 4303266 4331625 4355174 4377861 4402066 4421630 4431163 4450380 4477348 4487127 4498516
13235 4498516 4503380 4504800 4506402 4496777 4487861 4481237 4465758 4443997 4416524 4391077 4365106 4329055
13223 4329055 4300400 4260158 4211261 4168468 4117039 4064378 4009364 3948422 3891841 3832158 3774217
13212 3774217 3719962 3661472 3595946 3532589 3459537 3381831 3310887 3240600 3172378 3106730 3031208
13201 3031208 2959659 2884675 2813460 2739385 2667883 2595353 2521689 2453721 2384577 2315622 2244059
13190 2244059 2178982 2120446 2061109 2005520 1952031 1894262 1837815 1786729 1734578 1689943 1643852
13179A643852n6463m8721l2395k8615l1729l9019m2062m2942m0581l3125l4176
13168A214024l2078k8558k9710k7776k3267k9533l0183k5436k2254k6053k3818
13157I15358j9398k0582j9483j7828k1005j8591j4299k0100j3241j6128j1798
13146G22905j1910j8051j4418o623n211j3691k2041j6671j0702o773m91q994r412
13133E77917K681J0817J4132J0652Q268o476j9240k3181k1035k1066j5384j6045
13121E02040k0182j9522j5706r096j2700o581r93m9k994q255k534m260j1737o345
13107C81086J306k849j2472o254J736n575m997l993j966o643M914k475q171n517
13093C28130j404k071m283J3598M443O46J2990K0863K2647J9965k151j7455j9456
$$ plain form
13179 1643852 1587389 1538668 1506273 1477658 1445929 1406910 1364848 1321906 1281325 1248200 1214024
13168 1214024 1181946 1153388 1123678 1095902 1072635 1043102 1012919 987483 965229 939176 915358
13157 915358 895960 875378 855895 838067 817062 798471 784172 764072 750831 734703 722905
13146 722905 710995 692944 678526 671903 666692 653001 630960 614289 603587 596814 596323 587329 577917
13133 577917 580598 591415 605547 616199 624467 617991 598751 575570 554535 533469 518085 502040
13121 502040 481858 462336 446630 437534 424834 418253 417260 417211 414217 405962 403428 399168 387431 381086
13107 381086 382392 379543 367071 360817 362553 356978 351981 347988 346022 339379 344293 341818 333647 328130
13093 328130 326726 324655 320372 333970 338413 339059 352049 372912 395559 415524 413373 395918 376462
13080C76462k2915j7645j7116j4338j1372j7890r254k693n41M004L081l130o368
13067B60285J869n261r023k891m76j838n374n896l733k101q88L677K965N148n288
13052B31175p155n850n253n378m119k798k018L207L692L760k44L742L570K842
13038B19173O595j777m175n242p038n505m498m952r698q304M582L661m298J483
13024A80007k230l214n444k832j690o849q432p101l199K279L052l463K431M640
13010A47955k70j775L536K439M85m360j146m518j634M759l293K616m977O31Q477
12995A48925L285j620q701l853O319L712r780n002j233l121j20K017M37n871k679
12980A22715M013l773r344k8P310K261r864l661N923j795K502j448j85j165K558
$$ plain form
13080 376462 353547 335902 318786 304448 293076 275186 265932 263239 262698 266702 269783 266653 260285
13067 260285 262154 256893 247870 244979 244503 242665 237291 231395 227662 225561 224673 228350 231315 236463 231175
13052 231175 224020 218170 212917 207539 203420 200622 198604 201811 205503 209263 209019 212761 216331 219173
13038 219173 225768 223991 219816 214574 207536 202031 197533 192581 182883 174579 179161 182822 178524 180007
13024 180007 177777 174563 169119 166287 164597 157748 149316 142215 139016 141295 144347 140884 143315 147955
13010 147955 147685 145910 149446 151885 152370 148010 146864 142346 140712 145471 142178 144794 139817 140448 148925
12995 148925 152210 150590 141889 138036 144355 148067 138287 133285 132052 128931 128811 130828 131265 125394 122715
12980 122715 126728 122955 113611 113583 120893 123154 113290 109629 115552 113757 116259 114811 114626 113461 116019
12965A16019J914l858l476J004P139K802N135m033j6296k507J726k724l952n670
12951I3223l437J327O20l305K304J1914L706r054l370n148n220L902L898j21N205
12936I6444k058M89n384o01K411j466o969l047R15J646O639l626k420n985K74
12921G7262M015L801j124L956M141K157r20n004k628n64k021p130p513m30P662
12906G5660K733k182k023N692K24p768J91K077M414p99o236n7k40J138l628K80
12890F9476O038o782r975M947P108J308j646l069n788o756L56O836J720L847M055
12875G1675n097M691N982J570J681m693n177j9Q44p975n316O640L421J670j452
12860F8445p402o621O138N923k056K429l108J004k944K954R798l117n382Q9k769
$$ plain form
12965 116019 117933 114075 110599 111603 118742 121544 126679 122646 106350 103843 105569 102845 98893 93223
12951 93223 89786 91113 91733 88428 90732 102646 106352 97298 93928 88780 83560 87462 91360 91239 96444
12936 96444 94386 94875 89491 88890 91301 89835 82866 79819 80734 82380 89019 85393 82973 76988 77262
12921 77262 81277 85078 83954 87910 92051 94208 93288 88284 85656 85092 83071 75941 68428 67998 75660
12906 75660 78393 76211 74188 79880 80104 72336 72527 74604 79018 78219 71983 71926 71686 72824 69196 69476
12890 69476 75514 68732 58757 63704 70812 72120 70474 67405 61617 54861 55217 62053 63773 67620 71675
12875 71675 66578 71269 77251 78821 80502 75809 70632 70613 71457 63482 58166 64806 68227 69897 68445
12860 68445 61043 54422 60560 66483 64427 66856 63748 64752 61808 64762 74560 71443 66061 66150 63381
12845F3381j0720m268P722J951m81k859o30j57l362j089R363q11m864p045j595
12830D4536K924M024m263M744j396K581J0308l322j3933m056O057P896o28j916
12816E3556J28j166o961n791n264O177J663l277K700o18j899k926k806N283M648
12801D3447R36K563P093J729k242p271l598j503Q248M207K083K910J73l358M71
12786E5888m779q92n42l630j850J034j04J724j135Q44j648n228j748l817m018
12771C0099J896J789K307j095P52r3k717P419N474m653p118M87R675N473J673
12756E1368l269o451j562o622n942K67J512J090L611q304k754l18L35N855m022
12741B4794n910j822J0168K967p799j2864Q471K07q6K459J472L162j407L69J101
$$ plain form
12845 63381 52661 48393 56115 58066 57585 54726 54096 53939 50577 49488 58851 58040 53176 46131 44536
12830 44536 47460 51484 47221 51965 50569 53150 63458 60136 46203 42147 48204 56100 55472 53556
12816 53556 53684 52518 45557 39766 34502 40679 42342 39065 41765 41147 39248 36322 33516 38799 43447
12801 43447 44383 46946 54039 55768 53526 46255 42657 41154 49402 53609 55692 58602 58775 55417 55888
12786 55888 51109 50217 49675 46045 44195 45229 45125 46849 45714 46558 44910 39682 37934 34117 30099
12771 30099 31995 33784 36091 34996 35748 35655 32938 40357 45831 41178 34060 34547 44222 49695 51368
12756 51368 48099 41648 40086 33464 27522 27789 29301 30391 34002 25698 22944 22626 22961 28816 24794
12741 24794 18884 17062 27230 30197 22398 9534 18005 18212 18126 20585 22057 25219 23812 24181 25282
12726B5282j893Q3j829L6K832K575j421o582l657l710q472m269M281R236O625
12711A9117j000j1P000k884q896q571L170J021r38M47m123J618J0058n437o014
12696D557M634R11m035K166q82j839M481N481M136O55N58l593k207o36M114q85
12680A7616j2952k015K703J917l93M870n441k296K471j021J222O656M879q870
12666I346l501J736j043k525j075N392L338l225r95j324K93O454k169k589l459
12651D654M656K492r4o349n337l036o646M335L297K43N395K930P30l422M888K40
12635H976J259r17K333o499l976Q20L040k0M186o34N00K048k788O88o415o768
12619d167j614M945K464K598J397M156J604K384L63o293k33k037l697m502n676
$$ plain form
12726 25282 23389 23472 21643 21679 24511 27086 25665 19083 15426 11716 3244 -1025 3256 12492 19117
12711 19117 18117 18106 25106 22222 13326 4755 7925 8946 8008 8455 4332 5950 16008 10571 4557
12696 4557 9191 10102 6067 8233 7351 5512 9993 15474 19610 20265 20823 17230 15023 14387 18501 17616
12680 17616 4664 2649 5352 7269 6876 11746 6305 4009 6480 5459 6681 13337 18216 9346
12666 9346 5845 7581 6538 4013 2938 8330 11668 8443 7448 6124 6417 12871 10702 8113 4654
12651 4654 9310 11802 11708 5359 22 -3014 -9660 -5325 -2028 -1785 3610 6540 7270 3848 8736 8976
12635 8976 10235 9318 11651 5152 1176 1996 5036 5016 9202 8568 9068 11116 8328 9016 2601 -4167
12619 -4167 -5781 -836 1628 4226 5623 9779 11383 13767 14130 7837 7604 5567 1870 -2632 -8308
12604h308N287K88l40n39P386N14L621j961M69M998K429r155k433j76K630K16
12588D926o102M316q87L566J634j219m180P68K113L011k651L97j339M918N071
12573A4342M63L971J93J007q075K423j502q743L454Q80n702m576j40M046j754
12558B87q30R7R51K751J652j001M303k186l509k823j8j16j572n07J548J421l983
12541c535K165M074j642J19M95K375K464r90Q331M131j28m311m726R29p106j0438
12525g793N021P419M172j232q34P300J1412K774J056k442m313O440K079j074L014
12510C2999L576n373J403m330l715j3895l598j311O169L849r83n884n018M099
12496G988K714L361L67j448M292k22p501N292M134L113L841L154K755N581l192
$$ plain form
12604 -8308 -3021 -2733 -3073 -3612 3774 4288 7909 5948 6417 11415 13844 4689 2256 2080 4710 4926
12588 4926 -1176 3140 2253 5819 7453 6234 2054 2822 4935 7946 5295 5692 4353 9271 14342
12573 14342 14805 18776 18969 19976 11901 14324 12822 4079 7533 8413 2711 -1865 -2005 2041 287
12558 287 -543 -446 505 3256 4908 3907 8210 6024 2515 -308 -326 -442 -2014 -2521 -973 448 -3535
12541 -3535 -1370 2704 1062 1181 1676 4051 6515 5525 13856 17987 17859 13548 8822 9751 2645 -7793
12525 -7793 -2772 4647 8819 7587 6753 14053 25465 28239 29295 26853 22540 28980 31059 29985 32999
12510 32999 36575 31202 32605 28275 24560 10665 7067 5756 11925 15774 14791 8907 3889 7988
12496 7988 10702 14063 14430 12982 17274 17052 9551 14843 18977 22090 25931 29085 31840 37421 34229
12481C4229O090P768p281l251m204K921K543J0326P527j306l064L493K889n111
12467E3569n72r283o963p487J893J792M086K107l778N45R69K950k234J538N79
12452C9711k093q436r71k388L79j672n537m688L701R967N648O811k186J00N143
12437D3489L409K531K228J124N706J727r34m850Q9R37l797j464m899r784n167
12422C0345n344k967J161k098l251m174m585Q933R231j845k572N597L558L969
12408C5958n872j718m342j728K516M919p90K619p16m940j482j531q504J660O84
12393A6733o103L817J532K374L672O291L963q55q31J11K56p860K58r97m104Q014
12377B6271l395n055p56J0481J0018N48Q76J927K500L532J545N62p288m198O29
$$ plain form
12481 34229 40319 48087 40806 37555 33351 36272 38815 49141 56668 55362 52298 55791 58680 53569
12467 53569 52997 43714 36751 29264 31157 32949 37035 39142 35364 35909 36878 39828 37594 39132 39711
12452 39711 37618 29182 28211 25823 26202 24530 18993 14305 18006 27973 33621 40432 38246 38346 43489
12437 43489 46898 49429 51657 52781 58487 60214 59280 54430 54519 55456 51659 50195 45296 35512 30345
12422 30345 25001 22034 23195 21097 17846 13672 9087 18020 27251 25406 22834 28431 31989 35958
12408 35958 30086 28368 24026 22298 24814 29733 28943 31562 30846 25906 24424 22893 14389 16049 16733
12393 16733 10630 14447 15979 18353 22025 28316 32279 31424 30593 30704 30960 23100 23358 22361 18257 26271
12377 26271 22876 17821 17065 27546 37564 38112 38988 40915 43415 46947 48492 49054 41766 37568 38197
12362C8197r50L0j241m879q081l149J41p207k128l822N581O554M309k024j253
12347B0078J94J0214Q318m875K362L324k801l840j873k319M540J60l427N33K322
12332C2910k662j764K15J79O105K894J073N584k725K66k442j259n068l376M433
12317C4363r218r654M153O977J699m971r189n2l688J891J812k693K365P651N785
12302B7231J423P27J207L610n002m580J536P30O607k810n616j55j825j1310o452
12287E321j76k412p471L400P550J214L711j837q984l576j844k314P87O302K925
12272B596J336J0079n637p802L724j228j619J066J909l314k236J771k257J732
12258A20r765K219L670j837J047m429P637l352m198M54O598m243l959K224Q60
$$ plain form
12362 38197 37247 37277 36036 31157 23076 19927 20068 12861 10733 6911 12492 19046 23355 21331 20078
12347 20078 20272 30486 38804 33929 36291 39615 36814 32974 31101 28782 33322 33482 30055 30588 32910
12332 32910 30248 28484 28699 28878 34983 37877 38950 44534 41809 42075 39633 38374 33306 29930 34363
12317 34363 25145 15491 19644 26621 28320 23349 14160 14108 10420 12311 14123 11430 13795 21446 27231
12302 27231 28654 29381 30588 34198 29196 24616 26152 26882 33489 30679 25063 24908 23083 11773 5321
12287 5321 5145 2733 -4738 -1338 6212 7426 11137 9300 316 -3260 -5104 -7418 -6631 -329 2596
12272 2596 3932 14011 8374 572 4296 3068 1449 2515 4424 1110 -1126 645 -1612 120
12258 120 -9645 -7426 -3756 -5593 -4546 -8975 -1338 -4690 -8888 -8434 -1836 -6079 -10038 -7814 -6954
12243f954M58m840j025J738J0633R02n150K616R435J740K194j225p667j2302j998
12228a1445M542l961l287O278J0757M050L516n28o759m654j688K968K509j377
12214I21l662k304J109K652K421o155m152n560N241K421n544L212O941l410k242
12199h111M289P435n124o135j715n722l340Q482M301M216L264l288J179r91L264
12184B004N15k076J56J3477J273q896o693N859J002J465K966O401P976Q900L626
12169C7955l337N295N179L987m219o659M271J932j1244p015n5j917n255k292l414
12154A3212k168O217J1050r480j1485j73o61m805j950L974L599N701O234Q791
12140B8056K373P808O059R100R520N905L950J027Q46K712j559k396r70p894o958
$$ plain form
12243 -6954 -6496 -11336 -12361 -10623 10 912 -4238 -1622 7813 9553 11747 10522 2855 -9447 -11445
12228 -11445 -6903 -10864 -14151 -7873 2884 6934 10450 9922 3163 -1491 -3179 -211 2298 921
12214 921 -2741 -5045 -3936 -1284 1137 -5018 -9170 -14730 -9489 -7068 -12612 -9400 -2459 -5869 -8111
12199 -8111 -3822 3613 -1511 -7646 -9361 -15083 -18423 -9941 -5640 -1424 1840 -1448 -269 -1260 2004
12184 2004 2519 443 599 14076 15349 6453 -240 5619 6621 8086 11052 17453 25429 34329 37955
12169 37955 34618 39913 45092 49079 44860 38201 42472 44404 33160 26145 26090 24173 18918 16626 13212
12154 13212 11044 17261 28311 18831 7346 7173 6512 1707 -243 3731 7330 13031 19265 28056
12140 28056 30429 38237 44296 53396 62916 68821 72771 73798 74644 77356 75797 73401 72431 64537 57579
12125E7579l320p104k425K964m524o750l303k237m443o344k191L612r09j831p66
12110A8008r146l093n77L866J5532n17n472m629J328O153L078M636M952N085Q824
12095D8028N314N614L540J462k759m885k486l061m872l239o585o326m21k441l672
12080B3211j781k985o676p234j232k978j784N20N83J047M071Q190j90K566j676
12065A3652p66L044N74q15P46P35m76j2193l838J863j75l02J203n9k80J999M406
12048I318k072j1099l20P882J573l692K247r33K469L328L184m098l315N86L332
12033H390J809M886j795n848M83N927o229o398K622p34J451k795n248l777L930
12018c326J206K89P049L254K516K737P254p905o999O094k97L798L982J93o632
$$ plain form
12125 57579 54259 47155 44730 47694 43170 36420 33117 30880 26437 20093 17902 21514 20605 18774 18008
12110 18008 8862 5769 5192 9058 24590 24073 18601 13972 15300 21453 24531 29167 34119 39204 48028
12095 48028 53342 58956 62496 63958 61199 56314 53828 50767 45895 42656 36071 29745 29324 26883 23211
12080 23211 21430 18445 11769 4535 3303 325 -1459 -939 -356 691 4762 12952 12762 15328 13652
12065 13652 12886 15930 16504 15689 16435 17170 16694 4501 663 2526 2351 2049 3252 3193 2913 4912 9318
12048 9318 7246 -3853 -4173 3709 5282 1590 3837 2904 5373 8701 11885 7787 4472 5058 8390
12033 8390 10199 15085 13290 7442 7925 13852 7623 1225 3847 3113 4564 1769 -3479 -7256 -3326
12018 -3326 -2120 -1831 5218 8472 10988 13725 20979 13074 6075 12169 11872 15670 19652 19845 13213
12003A3213J117L354J584N409m066Q142J2641J6360K0095K7803K9387K6867J6273
11990A78179J6712J631o956m403n398j5232j7062j4288k2598k0193j0029j4343
11978F6020j4805j2679j5540j0978J116L724N023n137o628n956k448j537N36m04
11964C07N364n481j0190J259R572M638m131k629k07P050K583J561P49J112P713
11949A9270O032L378K636k246l693l169J041m117l920n21n793o488m006L782O809
11934H995K873j1484N611P740K232m403j797L862M188J640N937J0123L196K039
11920D0752k572j216J373k390o179m019K631k997o837k015m40J736j899N028m489
11905A6467n477M684N494J0888J1246j302k368M245k653n273q339n257Q00J260
$$ plain form
12003 13213 14330 17684 19268 24677 20611 28753 41394 57754 77849 105652 135039 161906 178179
11990 178179 194891 196522 189566 185163 179765 164533 147471 133183 110585 90392 80363 66020
11978 66020 51215 38536 22996 12018 13134 16858 21881 16744 10116 4160 1712 175 711 307
11964 307 5671 190 -10000 -8741 831 5469 1338 -1291 -1498 5552 8135 9696 10445 11557 19270
11949 19270 25302 28680 31316 29070 25377 22208 23249 19132 15212 14691 8898 2410 -1596 2186 8995
11934 8995 11868 384 5995 13735 15967 11564 9767 13629 17817 19457 25394 35517 38713 40752
11920 40752 38180 36964 38337 35947 29768 25749 28380 25383 18546 16531 16091 17827 15928 20956 16467
11905 16467 10990 15674 21168 32056 43302 42000 39632 43877 41224 35951 27612 22355 23155 24415
11891B4415J044o362J963L986k61N41m696m013M71j723L484J0574R742J4835K689
11876E6689o395l383m405l806L378j357l58J72p933p586j723L655P314J1869N290
11861E1421m217p186L125R631R181J191k845n347j215o467j974K770r28m812o782
11846C5546k802L761Q941L57l953l666O832N169k507j261K887J0686N298J812
11832F7100o048n306k704k632M59K980Q30l66m675n2N66n188o138M356o653k778
11816C3751J0823J0896N000Q991R855O465j412J532K043l772o33O715N919M634
11802A00807j631J212J5902O638J4046K4015R989P493K5318L4316K9121M4461
11790C11687M9571P0883J03911J24325J47468J76218J88603J71954J38513P8359
$$ plain form
11891 24415 25459 19097 21060 25046 24785 25326 20630 16617 17088 15365 18849 29423 39165 54000 56689
11876 56689 50294 46911 42506 38700 42078 40721 40363 40535 32602 25016 23293 26948 34262 46131 51421
11861 51421 47204 40018 43143 52774 61955 63146 60301 54954 53739 47272 45298 48068 47140 42328 35546
11846 35546 32744 36505 45446 45803 41850 38184 45016 50185 47678 46417 49304 59990 65288 67100
11832 67100 61052 55746 53042 50410 50869 53849 54679 54313 49638 49586 50152 44964 38826 43182 36529 33751
11816 33751 44574 55470 60470 69461 79316 85781 84369 85901 87944 84172 83539 90254 96173 100807
11802 100807 99176 100388 116290 122928 136974 160989 170978 178471 203789 238105 267226 311687
11790 311687 361258 432141 536052 660377 807845 984063 1172666 1344620 1483133 1561492
11780A561492P679n4041r8789j33081j32770j30917j16075q7814o6033l5861j9113
11769F94677P431K6722M2326P6347J18384J59705K16094K86964L55432L90143
11759B374225L68725K88365J56980M487j45648k49929l06328l30603l27632k79177
11749A553465k41591j97916j44711r9585p3727m3040k3445K241L1741N7673Q6095
11738I07200J31454J69854J95975K01614J60842R6384O982p1040j35415j63925
11728A499925j71309j73151j54815j23176r8088o5208l4664r186P887K4688M0611
11717G43514O3969R2373J41867J95391K64018L49131M16889M50920M03733K89211
11707C411016J29260m6449j84481k72139l20502l23136l03126k58115j99513j35377
$$ plain form
11780 1561492 1569171 1515130 1416341 1283260 1150490 1019573 903498 815684 749651 713790 694677
11769 694677 702108 728830 771156 847503 965887 1125592 1341686 1628650 1984082 2374225
11759 2374225 2742950 3031315 3188295 3192782 3047134 2797205 2490877 2160274 1832642 1553465
11749 1553465 1311874 1113958 969247 869662 795935 752895 729450 731691 763432 821105 907200
11738 907200 1038654 1208508 1404483 1606097 1766939 1863323 1870305 1799265 1663850 1499925
11728 1499925 1328616 1155465 1000650 877474 779386 714178 679514 670328 678215 702903 743514
11717 743514 807483 899856 1041723 1237114 1501132 1850263 2267152 2718072 3121805 3411016
11707 3411016 3540276 3493827 3309346 3037207 2716705 2393569 2090443 1832328 1632815 1497438
11697A497438p6357k8627J1566O7169J18882J75568K63654L68781N04739O61865
11687C564678Q10360Q77374Q09330N89587K65099r8066l97500n98572p07439p36356
11677D378495o93913o08404n06087l94196k82428k00220j28985p6816k7787J4242
11667A473901O7864J32366J96725K78044L54635L94519L74911K81903J34750l3120
11657C656498j90780k98951l60990l81452l70543l32458k78713k24864j66299
11648A051448j22167q6657n6426m4766j9824n351L1001N7807R8804J49647J97728
11637A251244K38527K52018K20729J39174L7681n7380j40251j80474j98589j93554
11627A369125j76525j43005j08812q3621m1279p256J9207M4077P0372J02752J45272
$$ plain form
11697 1497438 1421081 1392454 1404020 1471189 1590071 1765639 2029293 2398074 2902813 3564678
11687 3564678 4375038 5252412 6061742 6651329 6916428 6818362 6420862 5822290 5114851 4378495
11677 4378495 3684582 3076178 2570091 2175895 1893467 1693247 1564262 1487446 1459659 1473901
11667 1473901 1541765 1674131 1870856 2148900 2503535 2898054 3272965 3554868 3689618 3656498
11657 3656498 3465718 3166767 2805777 2424325 2053782 1721324 1442611 1217747 1051448
11648 1051448 929281 842624 786198 741432 721608 716257 747258 805065 903869 1053516 1251244
11637 1251244 1489771 1741789 1962518 2101692 2139373 2081993 1941742 1761268 1562679 1369125
11627 1369125 1192600 1049595 940783 857162 815883 808627 827834 871911 942283 1045035 1190307
11616A190307K09989K92339L81980M43390M60049M15879K75341Q2065r7054k38173
11606C416112l39283m00978l89598l58094l08653k59990j99216j43761r4016n9894
11596H62629l9625q865J5194M5597Q1869J14926J62125J87070J85415J65900J27454
11585A899689M7006m3673j10321j68237j96100k02360j92526j69783j45146j27660
11575E90889r4093p0456n4664m0278l5447l2236k5873j3773j3739k0574j0819
11564A78937n167o223o111l847j1092j846k786j2349o775L495m136J039o311j2561
11550A04267l800m753k840o544n274j913k104K686l496j0254q780k244j280R0
11536E3761O536P708M853R512K092n249r97n231M058J760J358m120J83K486L76
$$ plain form
11616 1190307 1400296 1692635 2074615 2518005 2978054 3393933 3669274 3751339 3654285 3416112
11606 3416112 3076829 2675851 2286253 1928159 1619506 1359516 1160300 1016539 922523 862629
11596 862629 823004 814139 829333 874930 956799 1071725 1233850 1420920 1606335 1772235 1899689
11585 1899689 1946695 1903022 1792701 1624464 1428364 1226004 1033478 863695 718549 590889
11575 590889 496796 426340 371676 331398 295951 263715 237842 224069 210330 189756 178937
11564 178937 173770 167547 161436 157589 146497 144651 141865 129516 122741 126236 122100 123139 116828 104267
11550 104267 100467 95714 92874 86330 81056 79143 77039 79725 76229 65975 57195 54951 53671 53761
11536 53761 60297 68005 72858 82370 84462 79213 78216 72985 77043 78803 80161 76041 76224 78710 79086
11521G9086R10m804o042R9L213J660J2m371p15L640K576N234L946R40j32o95L71
11504H4928j984j774j741K799Q49j553r625j2765q185p125K653R913L885j981
11490E8294M110l696p709l914P43M478j049N42j582L669l047O87k194M408K469
11475E6209m211o263K573m737J972K492J473k086n50N002r09j296L21p828k907
11460C9255k736j973K805L412n170Q098J2951O962J439n57r651o230k645o291
11446C9669m876O77N265K946J025M6J43K543k003L737L604m541K31K793Q635j020
11430E8874j130o737o383k081N677N810n41j099o564Q94L887j4n756L178Q13J454
11414E0282p534K159M325m251l291j949J710j107K780k349K882L566Q335m139
$$ plain form
11521 79086 79996 75192 69150 69249 72462 74122 74134 69763 69048 72688 75264 80498 84444 85384 85252 84557 84928
11504 84928 82944 81170 79429 82228 83077 81524 71899 59134 50949 43824 46477 56390 60275 58294
11490 58294 62404 58708 50999 47085 47828 52306 51257 51799 50217 53886 50839 51526 49332 53740 56209
11475 56209 51998 45735 48308 43571 45543 48035 49508 47422 46872 51874 50965 49669 49990 42162 39255
11460 39255 36519 34546 37351 40763 35593 43691 56642 63604 65043 64486 54835 48605 45960 39669
11446 39669 34793 35470 40735 43681 44706 44752 44895 47438 45435 49172 52776 48235 48466 51259 59894 58874
11430 58874 57744 51007 44624 42543 48220 54030 53489 52390 45826 46720 50607 50593 44837 48015 48828 50282
11414 50282 42748 44907 49232 44981 41690 39741 41451 40344 43124 40775 43657 47223 55558 51419
11400E1419K399L305P253j827m565n64n19J446O059k086J102N581J384K709l797
11385F9299k37o33l442L819m71L781J493K535J376O81k497k189J885P334M548
11370H7282j364L914J423J107L40q41M734K628k824L581L102J608Q143J754j789
11355A12798M176P368L345j608m176k050L270N131N918J2143M79p0k659k24p59
11340A43082O697M326n58o02m590K998Q905O500J0955N389M558k891k461O322
11326A88630R567M865J701K053J0149P334p69O46L55M941N068N275O868M569O517
11311B57769N252J3726J0371J668P464P069O095O841J0115J2171K0705K7567J5602
11298D02415P171P711J3917J9732J3167P301K1807K1295K1685K0447K0751L1365
$$ plain form
11400 51419 53818 57123 64376 62549 57984 57420 56901 58347 64406 62320 63422 69003 70387 73096 69299
11385 69299 69062 68429 64987 68806 68335 72116 73609 76144 77520 78201 75704 73515 75400 82734 87282
11370 87282 85918 89832 91255 92362 92702 91861 96595 99223 96399 99980 103082 104690 112833 114587 112798
11355 112798 116974 124342 127687 126079 121903 119853 123123 128254 134172 146315 146794 146724 144065 143841 143082
11340 143082 149779 154105 153547 152945 148355 151353 160258 166758 177713 183102 187660 184769 182308 188630
11326 188630 198197 203062 204763 206816 216965 224299 223530 224176 224531 229472 234540 239815 246683 251252 257769
11311 257769 263021 276747 287118 288786 296250 303319 309414 316255 326370 338541 359246 386813 402415
11298 402415 409586 417297 431214 450946 464113 471414 493221 514516 536201 556648 577399 608764
11286F08764K8949K4136K8720L3670M2695M4092M6397M6026M5183N3929N8145
11275A060706O8079O6568P2399Q3145Q1903Q7312R4075R1145R9218J07013J22824
11264B034387J23843J31719J33964J22040J26802J33966J31402J18885J07989
11255C164997R8859Q3891P1121N7958M8189M6381L0841K6855K9767K5708K0489
11244C705056K0147J4317J4000l5j1486j5810k9059m1423n5676p3964q4828r7558
11232C343681j10830j15649j14873j19922j10593j09798j01491j01998j01009
11223B357518r7882q6999p6981p0275o1978n7821m5228l7609l1748k4454j6403
11212A750140j0694j5980j0868J1197M660J4515K9467L0331L5510M4939N2074
$$ plain form
11286 608764 637713 661849 690569 724239 766934 811026 857423 903449 948632 1002561 1060706
11275 1060706 1128785 1195353 1267752 1350897 1432800 1520112 1614187 1705332 1804550 1911563 2034387
11264 2034387 2158230 2289949 2423913 2545953 2672755 2806721 2938123 3057008 3164997
11255 3164997 3263856 3347747 3418868 3476826 3525015 3571396 3602237 3629092 3658859 3684567 3705056
11244 3705056 3725203 3739520 3753520 3753485 3741999 3726189 3697130 3655707 3600031 3526067 3441239 3343681
11232 3343681 3232851 3117202 3002329 2882407 2771814 2662016 2560525 2458527 2357518
11223 2357518 2259636 2172637 2095656 2025381 1963403 1905582 1860354 1822745 1790997 1766543 1750140
11212 1750140 1739446 1723466 1712598 1723795 1728455 1742970 1772437 1802768 1838278 1883217 1935291
11201A935291N3953O2980O6488Q0528Q9356Q6778J03087J20250J26792J29122
11191B854625J42576J59479J80039J87028J92843K01712K10024K12851K22332
11182D563509K24130K21116K15358K02042J93525J78314J66800J57478J55825
11173F278097J37154J21196J16543J06350Q3240O6283N4718M1601K4167R861j4843
11162G024367l1392n2028o7127q6663r7959j16986j26726j40862j53850j66001
11152E984773j76147j83145j92867k03902k05292k12041k17628k13529k13601
11143D166621k10512j92052j88652j83731j74866j57882j48499j48085j20910
11134B641432j17449j07274r4981q6043p8567o4665o0270n8088o0532m0273k4643
$$ plain form
11201 1935291 1989244 2052224 2118712 2199240 2288596 2375374 2478461 2598711 2725503 2854625
11191 2854625 2997201 3156680 3336719 3523747 3716590 3918302 4128326 4341177 4563509
11182 4563509 4787639 5008755 5224113 5426155 5619680 5797994 5964794 6122272 6278097
11173 6278097 6415251 6536447 6652990 6759340 6842580 6908863 6963581 7005182 7029349 7039210 7024367
11162 7024367 6992975 6940947 6873820 6787157 6689198 6572212 6445486 6304624 6150774 5984773
11152 5984773 5808626 5625481 5432614 5228712 5023420 4811379 4593751 4380222 4166621
11143 4166621 3956109 3764057 3575405 3391674 3216808 3058926 2910427 2762342 2641432
11134 2641432 2523983 2416709 2321728 2235685 2157118 2092453 2032183 1974095 1913563 1873290 1848647
11123A848647k2110j8549k1549j7377j4149n562P627K1736J9555K4682L6117L7096
11111A896164M4944M3676O2618P2278Q1478R7893R5483R5623R3985J00395J09306
11100B793843J17785J14318J22960J15624J03059R8284R0526Q2463O4100M9548
11090C752510L9304K2571J5275L390l773r352p468j6291k2426j8799j8833k9743
11078C706365l1973l9706m8409o4320p5160q5781j07302j16342j12919j27561
11068B896892j33576j39209j38672j39496j28709j21144j19921j14906j01912
11059A759347r4711r5843r0532p2927p2617p0818o8293o2688n0248m9805m7423
11048I83442m6372m1967l7510l3435l2475k8551l4278l7720l0319k2349k1820
$$ plain form
11123 1848647 1826537 1807988 1786439 1769062 1754913 1749351 1756978 1778714 1798269 1822951 1859068 1896164
11111 1896164 1941108 1984784 2047402 2119680 2201158 2299051 2394534 2490157 2584142 2684537 2793843
11100 2793843 2911628 3025946 3148906 3264530 3367589 3465873 3556399 3638862 3702962 3752510
11090 3752510 3791814 3814385 3829660 3833050 3829277 3819925 3812457 3796166 3773740 3754941 3736108 3706365
11078 3706365 3674392 3634686 3586277 3521957 3446797 3361016 3253714 3137372 3024453 2896892
11068 2896892 2763316 2624107 2485435 2345939 2217230 2096086 1976165 1861259 1759347
11059 1759347 1664636 1568793 1478261 1405334 1332717 1261899 1193606 1130918 1080670 1030865 983442
11048 983442 937070 895103 857593 824158 791683 763132 728854 691134 660815 638466 616646
11037F16646k1877k3540j2826j0184j8050j9025q879q928r512p601p900r615n069
11024D53640j1871j6660j4066r188j1096j2557o708p005r577j6895j4399r176
11012C14442r115l104o40k547r668j2729j0113j885l923j271n503o581n736q142
10998B33485n95l195q820l207n122l622j1923r987k956p93k520L551K237o748
10984A79785K63j960k069p521p97J662K455n419M559K602l607p662q766p413k247
10969A43865mJ570K738m198n375m329j399N370M292P516J165p038l502p945Q71
10954A33597L412K381j988o873m199J509j464j259k21j708m009J931l174O655
10940A24590k225j1953n122n58r01Q295m01O26j1378l179n0K507J257K600n41
$$ plain form
11037 616646 594769 571229 558403 548219 530169 511144 502265 493337 483825 476224 468324 458709 453640
11024 453640 441769 425109 411043 401855 390759 378202 371494 364489 354912 338017 323618 314442
11012 314442 305327 302223 301583 299036 289368 276639 266526 264641 260718 259447 253944 247363 241627 233485
10998 233485 232890 229695 220875 217668 212546 208924 197001 187014 184058 183265 180745 184296 186533 179785
10984 179785 180048 178088 176019 168498 167701 169363 171818 166399 170958 173560 169953 162291 153525 146112 143865
10969 143865 143861 145431 148169 143971 138596 134267 132868 138238 142530 150046 151211 144173 140671 132726 133597
10954 133597 137009 139390 137402 130529 126330 127839 126375 125116 124895 123187 119178 121109 117935 124590
10940 124590 122365 110412 105290 104732 103831 112126 111725 112351 100973 97794 97744 100251 101508 104108 103567
10925A03567K296l175o571p098K997l637k35L680O422L047r401n988p7L20J875
10910H8022N802n214l097m487n229L218J026k313k648K510k340p576k181K957
10896F8450j837K653m175J951K906k350j694k990J115L523J259N134m265k242
10882F7438m763O189l47l756L797J777L026j933k979N081P741j871m772k62J656
10867G6022J428O829J367L012l968o330m248k026R30L570L610r78m314n53M882
10852G9233j44k103k778K33o498K490m96K942J019N755L77o208o343l953J076
10837F4602m60l726k214L166j108j98J952j644p041L132j437M336O982R633k577
10822G3398J243p70M682l418k769l050L460O67p890j099J748n00j062m84K621
$$ plain form
10925 103567 105863 102688 96117 89019 92016 88379 88144 91824 98246 101293 91892 85904 85827 86147 88022
10910 88022 93824 88610 85513 81026 75797 79015 80041 77728 75080 77590 75250 67674 65493 68450
10896 68450 66613 69266 65091 67042 69948 67598 65904 62914 64029 67552 68811 73945 69680 67438
10882 67438 62675 68864 68517 64761 68558 70335 73361 71428 68449 73530 81271 79400 74628 74366 76022
10867 76022 77450 84279 85646 88658 84690 78360 74112 72086 73016 76586 80196 79218 74904 74351 79233
10852 79233 79089 76986 74208 74441 67943 70433 69937 72879 73898 79653 80030 73822 67479 63526 64602
10837 64602 64142 60416 58202 61368 60260 60062 62014 60370 53329 56461 55024 59360 66342 75975 73398
10822 73398 74641 73871 78553 75135 72366 69316 72776 73443 65553 64454 66202 65702 64640 64156 66777
10807F6777o54N55k401l125K170M137j255l161j925p976n171K826J0133M913K423
10792F8266K90m572J852L896n172j0726K385N286m411k672m697J506L728J0624
10778F5583L124k54m179M842M161r772p410n911l456k208O615N057M246L457k606
10763F1289m772j644K017M175j882p613j825N361k690K004R286k744P267K931
10749G1160o124M52K461n78m468j215K136m080k761K840J636P534K948j261L902
10734G4582P33p345l29Q729l486o909m391N832L253j337j252o131j800J93m852
10719E5490K587P674M21l588n393j0579r732Q47K24j195O533q38M194K163J957
10704E0765l121n477k760K218k17k754m263o75k250M787k59m057p51K088r739
$$ plain form
10807 66777 66123 66678 64277 61152 63322 67459 66204 63043 61118 53142 47971 50797 60930 65843 68266
10792 68266 68556 63984 65836 69732 64560 53834 56219 61505 57094 54422 49725 51231 54959 65583
10778 65583 68707 68453 64274 69116 73277 63505 56095 50184 46728 44520 51135 56192 60438 63895 61289
10763 61289 56517 54873 56890 61065 59183 51570 49745 55106 52416 54420 63706 60962 68229 71160
10749 71160 65036 65488 67949 67371 62903 61688 63824 59744 56983 59823 61459 68993 71941 70680 74582
10734 74582 75315 67970 67641 76370 72884 65975 61584 67416 70669 69332 68080 61949 60149 60342 55490
10719 55490 58077 65751 66172 62584 57191 46612 36880 37727 37951 36756 43289 42451 46645 48808 50765
10704 50765 47644 42167 39407 41625 41408 38654 34391 33716 31466 36253 35994 31937 31186 33274 23535
10689B3535Q83N83k92O39j679K779o462j1170n666J0337M190J904J405N018q17
10674B5187M456M263k532k52J61J53L73K262L745J303r611q459l303O050P413
10659C1209k789m471K836K342O612L662l986l202l927m098J022M628J342k146
10645B9034n073M829P340n096o262j622N829l513r34J511M400j1m851l351n14
10630B1716K388J106K133j301l395J94m526Q611M681n268o084n059O121P89o898
10615A5208L760K475l148J89r42m96O497n080o794o488j034M719P108K874k90
10600A8558J378K414L925m017j427n19k419O513K842o167n043n073o641j856j530
10585I38j439L975O794j372j634l200J509n925m866Q501P948n486k820O095k387
$$ plain form
10689 23535 24418 25001 24709 25348 23669 26448 19986 8816 3150 13487 17677 19581 20986 26004 25187
10674 25187 29643 33906 31374 31122 31283 31436 31809 34071 37816 39119 29508 21049 17746 23796 31209
10659 31209 28420 23949 26785 29127 35739 39401 35415 32213 28286 24188 25210 29838 31180 29034
10645 29034 23961 28790 36130 31034 24772 23150 28979 25466 24532 26043 30443 30432 25581 22230 21716
10630 21716 24104 25210 27343 26042 22647 22841 18315 26926 31607 26339 20255 15196 21317 22106 15208
10615 15208 18968 21443 18295 18484 17542 17046 23543 18463 11669 5181 4147 8866 15974 18848 18558
10600 18558 19936 22350 26275 22258 20831 20312 17893 24406 27248 21081 16038 10965 4324 2468 938
10585 938 -501 3474 10268 8896 7262 4062 5571 -354 -5220 3281 11229 5743 2923 9018 6631
10570F631j956K787j623n928K501j308r53K127k407r70L657j716P93j632J184
10555A187k843K34R157m522p1m422m888K636Q32K700K521J217J161m161M365q251
10539c148l254l71q88M791J502l932j857J20K660L786J210J088k065o91k05N621
10523D367j095k672O566m005l882r320K040R854j183L908m68p536J859o89r672
10508a1928N43J1719R681L45r27m619k02M99K427J016L959q668p15M117M710M430
10492A6387J106J1455J511l024k316m246M378R884l794p812L153M481r672j1384
10478A0107o690K654k017J217k342n469L723Q815J505J152L955Q01j363J500j371
10463A6177k810n1K888L009j203m1O038k61K631Q259O559J0500L263j069K850
$$ plain form
10570 6631 4675 7462 5839 -89 2412 1104 151 2278 -129 -1099 2558 842 1635 3 1187
10555 1187 -1656 -1422 7735 3213 3142 -1280 -6168 -3532 -2700 0 2521 3738 4899 738 5103 -3148
10539 -3148 -6402 -6773 -7661 -2870 -1368 -5300 -7157 -7037 -4377 -591 619 1707 -358 -1049 -1254 4367
10523 4367 3272 600 7166 3161 -721 -10041 -8001 1853 670 4578 4110 -3426 -1567 -2256 -11928
10508 -11928 -11385 334 10015 10360 9433 4814 4612 5111 7538 8554 12513 3845 3130 7247 11957 16387
10492 16387 17493 28948 30459 27435 25119 20873 25251 35135 31341 23529 26682 31163 21491 10107
10478 10107 3417 6071 4054 5271 2929 -2540 1183 9998 11503 12655 16610 17411 16048 17548 16177
10463 16177 13367 13316 16204 19213 18010 17969 24007 23746 26377 34636 41195 51695 54958 53889 56739
10448E6739L862L641l358p211p060m905n164m991l348M100K997l294J759p510
10434B6257l319L961k989K1k305P262L218l67k406j032K488P461L774l03o025
10419C5696K381O894K551J303K904O543J715m257M634J523m012l062j337K443
10405E5919n423j1452q527J191j774m29k09n29k542q694j332P91J974N35M55l712
10389A6242n0J42K638K441P16O44p23k639J796j445j108k574j0833j0377j405
10374f535M52k694R285l019O32j145Q30R809M288K937l986q735J31L673K188K60
10358H371K561L746K591j143j800K150L543k965l491O110J1197J0256N828l93
10344D6561l232k390o265p309M208L251M192M729M350r76l625l011m995j264R71
$$ plain form
10448 56739 60601 64242 60884 53673 46613 41708 36544 31553 28205 32305 35302 32008 33767 26257
10434 26257 22938 26899 23910 23931 21626 28888 32106 31739 29333 28301 30789 38250 42024 41721 35696
10419 35696 38077 44971 47522 48825 51729 58272 59987 55730 60364 61887 57875 54813 53476 55919
10405 55919 50496 39044 30517 31708 29934 29505 29296 28767 26225 17531 16199 16990 18964 19499 19954 16242
10389 16242 16192 16334 18972 21413 22129 22773 22050 19411 21207 19762 18654 16080 5247 -5130 -6535
10374 -6535 -6083 -8777 508 -2511 -1879 -3024 -2194 7615 11903 14840 10854 2119 2250 5923 8111 8371
10358 8371 10932 14678 17269 16126 14326 16476 20019 17054 13563 19673 30870 41126 46954 46561
10344 46561 43329 40939 34674 27365 31573 34824 39016 43745 48095 47119 43494 40483 35488 34224 35195
10329C5195J006q069L870O880l522o002q01k829j90l86k392L01Q280K473l887
10314B9927J670K791J000j434k763N95k981j593m712m54l554J442Q050o2m514
10299B3408j0113l954j444j389L566o20j206K648O293O26n571r513K491K838L972
10284A2032l292k197P5n630m860J1982N730L186O243p707p434j199p016p411q348
10269a5846j52M338N998L996j399L115J752k585M867N456n06p05p246n924L49
10254d492j386k044N802K924l338j0728j010O219Q304N032K647l052n93p394m092
10239g201L198r25L343m01k663O199K940L174J689l214l515j584j868l382L477
10224g33N256j166J282J413n107L14L778O039J525l685k137K189m382l837L976
$$ plain form
10329 35195 36201 28132 32002 38882 35360 29358 28557 25728 25538 25152 22760 23061 31341 33814 29927
10314 29927 31597 34388 35388 33954 31191 31786 28805 27212 22500 22046 18492 19934 27984 27922 23408
10299 23408 13295 9341 7897 6508 10074 9454 8248 10896 17189 17815 12244 2731 5222 8060 12032
10284 12032 8740 6543 6618 988 -3872 8110 13840 17026 23269 15562 8128 6929 -87 -7498 -15846
10269 -15846 -15998 -11660 -5662 -1666 -3065 50 1802 -783 4084 9540 9034 8329 1083 -4841 -4492
10254 -4492 -5878 -7922 -2120 804 -2534 -13262 -14272 -8053 251 5283 7930 4878 4285 -3109 -7201
10239 -7201 -4003 -4928 -1585 -1986 -4649 1550 4490 7664 9353 6139 2624 1040 -828 -4210 -733
10224 -733 4523 3357 4639 6052 945 1259 5037 11076 12601 8916 6779 8968 4586 749 4725
10209D725R86o521m896M003O689l345k273k328O64L749Q374N321J794J205K295
10194B0442j062K27K745O30o18O56J0225K169l139O598O96L52L330o896p297l935
10178B5123o68j504j0660m204N250L152j159l740j420k176Q94K787L688M997n45
10163A9815M7r6L061M762K229l179K141Q194J544P333p64k947l182p668M676m671
10147C1295o99l398q403j873j098j987O06k475J86k00J00j406L352J135j162r18
10131A3055k45l487o32m985o202Q217N786j098L740N630K789r33K260J830o915
10116A8810O86R134M148K046j005o48L937R915P759O797K237K070N792O159J905
10101G9742r01K504l816j754O581K025L30L982l35o03m401j010n35o201l45j264
$$ plain form
10209 4725 5711 -810 -5706 -1703 4986 1641 -632 -2960 -2296 1453 9827 15148 16942 18147 20442
10194 20442 19380 19607 22352 22982 22364 23020 33245 35414 32275 38873 39569 39921 43251 36355 29058 25123
10178 25123 24455 22951 12291 8087 13337 16489 15330 11590 10170 7994 8888 11675 15363 20360 19815
10163 19815 19862 19766 22827 27589 29818 26639 28780 36974 38518 45851 45087 42140 38958 31290 35966 31295
10147 31295 30596 27198 18795 16922 15824 13837 14443 11968 12154 11954 12054 10648 14000 15135 13973 13055
10131 13055 12810 9323 8691 3706 -2496 5721 11507 10409 14149 19779 22568 21635 23895 25725 18810
10116 18810 19496 28630 32778 34824 33819 33171 37108 47023 54782 61579 63816 65886 71678 77837 79742
10101 79742 78841 81345 77529 75775 82356 84381 84711 88693 88358 87755 83354 82344 81809 75608 75263 73999
10085G3999L278O109L845j444m768L875Q609Q844L536K666K432L540J979P882
10071A24382L581N260J1318N024j132j274Q445J4255Q834P87J795P437R465J5164
10057B13341J2553J4990J9383K2779L3395L6822M0668M9476O9479Q6591J06092
10046G05569J15981J34452J47602J45229J41612J19755J04879J03541R8577R0513
10036A907710R6052J14082J31366J50947J59649J48612J38771J32813J44003J78700
10026C302705K31643K75403K82320K66550K56255K43546K03331J67005J11759
10017E340517P7723O1045Q1907J03729J21171R7711M5613N110k7943l8820l1354
10006E836409k8432k3873k0046j1155L256M5615N4111M2620J7132l086l635j3120
$$ plain form
10085 73999 77277 83386 87231 85787 81019 84894 93503 102347 105883 108549 110981 114521 116500 124382
10071 124382 127963 133223 144541 149565 148433 147159 155604 169859 178693 179480 181275 188712 198177 213341
10057 213341 225894 240884 260267 283046 316441 353263 393931 443407 512886 599477 705569
10046 705569 821550 956002 1103604 1248833 1390445 1510200 1615079 1718620 1817197 1907710
10036 1907710 2003762 2117844 2249210 2400157 2559806 2708418 2847189 2980002 3124005 3302705
10026 3302705 3534348 3809751 4092071 4358621 4614876 4858422 5061753 5228758 5340517
10017 5340517 5418240 5479285 5561192 5664921 5786092 5883803 5929416 5934526 5906583 5867763 5836409
10006 5836409 5807977 5784104 5764058 5752903 5756159 5801774 5855885 5898505 5915637 5912551 5908916 5895796
9994E895796l1085o3124r9731j10026j15136j26031j38005j74662k28411k48261
9984D561324k54468k27277k03389j84555j70435j78685j86233j73743j59061j45707
9974B677771j30667j04962p2620k8606N601J2823J2191l551j6912j4422J1586
9963B348232M9309R3133J19189R7973O8825M6145L0462K9040L4435N2466Q6728
9952C055937J27607J77986K07732K26040K34481K15974K06777K15253K64983L15060
9942E247830L47161L46401L49229L54066L87949M10124K97175J44922Q7237O9268
9932H041362N2716K9125P570j022l0661q7571q9481o2021l8024k9089l0476l1036
9920G731392q008K7546O4450M5461L439n5120j00763j12731j03582p7564o4968
$$ plain form
9994 5895796 5864711 5801587 5701856 5591830 5476694 5350663 5212658 5037996 4809585 4561324
9984 4561324 4306856 4079579 3876190 3691635 3521200 3342515 3156282 2982539 2823478 2677771
9974 2677771 2547104 2442142 2369522 2340916 2346517 2359340 2371531 2367980 2351068 2336646 2348232
9963 2348232 2397541 2490674 2609863 2707836 2776661 2822806 2853268 2882308 2916743 2969209 3055937
9952 3055937 3183544 3361530 3569262 3795302 4029783 4245757 4452534 4667787 4932770 5247830
9942 5247830 5594991 5941392 6290621 6644687 7032636 7442760 7739935 7884857 7972094 8041362
9932 8041362 8094078 8123203 8130773 8129751 8099090 8011519 7922038 7860017 7821993 7792904 7762428 7731392
9920 7731392 7723384 7750930 7815380 7860841 7864280 7809160 7708397 7595666 7492084 7414520 7349552
9909G349552q8273j01934j34043j60582j94769k44194l12873l68439l77003l35061
9899E032381k81907k59618k46510k37669k20549k14197k14921j91733j64530j39158
9889B861589j24192j06963j05367j16986j31057j56033j81553j79737j74793j72555
9879A412353j70243j47029j26924j08887r2066q1144n7054n1284m2484l5904l5837
9868D63497k4187j6696j9544k0670k4094j2414n603j4246j0661j4923n231m853
9856B90375j0241o439o047o776o224M32p83o938j1561r542l457K283K756O322
9842B34160j803o422m3l526K043l172n183O518P220o071o882o597o290l122L495
9827B04325O329K7165M9425Q0090J29953J35184M3111m6635p6800n8591o7030
$$ plain form
9909 7349552 7261279 7159345 7025302 6864720 6669951 6425757 6112884 5744445 5367442 5032381
9899 5032381 4750474 4490856 4244346 4006677 3786128 3571931 3357010 3165277 3000747 2861589
9889 2861589 2737397 2630434 2525067 2408081 2277024 2120991 1939438 1759701 1584908 1412353
9879 1412353 1242110 1095081 968157 859270 767204 686060 629006 577722 535238 499334 463497
9868 463497 439310 422614 403070 382400 358306 345892 340289 326043 315382 300459 295228 290375
9856 290375 280134 273695 267648 260872 254648 255080 254297 247359 235798 226256 222799 225082 227838 234160
9842 234160 232357 225935 225892 222366 224409 221237 216054 222572 229792 223721 216839 210242 203952 200830 204325
9827 204325 210654 237819 287244 367334 497287 632471 675582 628947 552147 493556 426526
9816D26526p1964o0110m7128l8911k2430j4258j1092p403q684p823q256n807l056
9803A19604n769r293o067J475p95r476m875L393K68l304j0046r310L017J435L044
9788G3301j518o514k33O684k377k908p740o071q181J544J220Q450K357o8j331
9773E6615k239K218m0K211Q130K297M696L099J211l277k718M926j27k798j128
9758G3076k869j512m402O55J310K411p432q299l128j1043j004N716K135j1136
9744C4478q43L047O52k758l429J72Q635n229M31J4873O100k478k785j597K035
9729E1304l037j0137l142l237o569m110k083O254j73P680O452k70r213p379l249
9714A9091M946M725m182o597j804k803j595r70Q205j515J51k861n281L620L602
$$ plain form
9816 426526 354562 294452 247324 208413 185983 171725 160633 153230 144546 136723 128467 122660 119604
9803 119604 113835 104542 98475 99950 99155 89679 84804 88197 88465 85161 75115 65805 68822 70257 73301
9788 73301 71783 65269 65036 71720 69343 66435 58695 52624 44443 45987 47207 55657 58014 57946 56615
9773 56615 54376 56594 56554 58765 66895 69192 73888 76987 78198 74921 72203 77129 77002 74204 73076
9758 73076 70207 68695 64293 64948 66258 68669 61237 52938 49810 38767 37763 43479 45614 34478
9744 34478 33635 36682 37334 34576 31147 31319 39954 34725 35156 50029 56129 53651 50866 49269 51304
9729 51304 48267 38130 34988 31751 25182 21072 18989 25243 25070 32750 39202 38932 29719 22340 19091
9714 19091 24037 28762 24580 17983 16179 13376 11781 10811 19016 17501 17652 14791 9510 13130 16732
9699A6732L231J277K814M490J566j048l880K567M157L437N381m40q57N07n339
9684C4595J609j844m357o00J0097J56r589q297Q69m921k02J106K822P398l048
9669B5794n900J426L660J865J560o800j305L134M692K701N433j425M62J272M023
9654D0592j447q936k744k600R583J1205K802l228n743k722L276J470L659k49%
9639D4918j816m124n29N079M923M8j350n765j1282o128J298N013O781O688L385
9624D7139K454M16O978L425J382J727O09N032M175L350j247M198L980J1310P599
9609A02527M331N47J1339K992m443K497o50L389K898Q87N637L130J637l169n17
9594A33032N793o206N071P001O68o205j914L93K795j874l881j178J49M041P943
$$ plain form
9699 16732 19963 21240 24054 28544 30110 29062 25182 27749 31906 35343 40724 40284 39427 39934 34595
9684 34595 36204 34360 30003 29403 39500 39656 30067 21770 22639 17718 17516 18622 21444 28842 25794
9669 25794 19894 21320 24980 26845 28405 21605 20300 23434 28126 30827 36260 34835 35297 36569 40592
9654 40592 39145 30209 27465 24865 34448 45653 48455 45227 39484 36762 40038 41508 45167 44918 44918
9639 44918 43102 38978 38449 43528 48451 48499 47149 41384 30102 23974 25272 30285 37066 43754 47139
9624 47139 49593 50009 56987 60412 61794 63521 64130 69162 73337 76687 75440 79638 83618 94928 102527
9609 102527 106858 107405 118744 121736 117293 119790 119140 122529 125427 126314 131951 135081 136718 133549 133032
9594 133032 138825 132619 137690 144691 145359 139154 137240 137633 140428 138554 134673 133495 133644 137685 145628
9579A45628J50p891k477p120k940j774l379k98j234l860k737l504l206Q082r105
9564A04335k565M415k222L617L70j138J484Q334J827O94Q525Q813j831n816p479
9549A21363L448J3232Nk52J022J0336O216J643L40J0791P272L200K951J2377J9461
9534B13405K2254K3553J7593J2772J4393K4251K8438L3442L5214L2518M2800M8317
9522E48950O2595P0310Q7661J10440J31693J69956K19762K74870L26504L83585
9512B386326M16868L87979K74515J37127N153j10675j87346k46665k72721k75801
9502B514760k69144k36518k03571j60691j33813j05973o9353m2635r742K4772
9492A308092N0983P9760J13035J56611K05619K49181L07029L49776L70506L12777
$$ plain form
9579 145628 145778 137887 135410 128290 125350 123576 120197 119899 118665 114805 112068 108564 105358 113440 104335
9564 104335 101770 106185 103963 107580 107950 106812 108296 116630 118457 119151 127676 136489 134658 128842 121363
9549 121363 124811 138043 138048 137796 138818 149154 155370 157013 157353 168144 175416 178616 181567 193944 213405
9534 213405 235659 259212 276805 289577 303970 328221 356659 390101 425315 457833 500633 548950
9522 548950 611545 681855 769516 879956 1011649 1181605 1401367 1676237 2002741 2386326
9512 2386326 2803194 3191173 3465688 3602815 3607968 3497293 3309947 3063282 2790561 2514760
9502 2514760 2245616 2009098 1805527 1644836 1511023 1405050 1335697 1293062 1283320 1308092
9492 1308092 1359075 1438835 1551870 1708481 1914100 2163281 2470310 2820086 3190592 3503369
9482C503369J69464j361j26484k03115k42089k74427k80967k66310k53651k30865
9472A793564k04831j71250j51914j38529j09347q3727o2275n4251n0051k9147
9462G38242j8953k0076k0029p618K40J0699J4762K2257L1747K9338L3967N3939
9450H68515O6598Q1729J05942J25343J48566J80726K32000K87037L54692M36302
9440B887450N17497O05223O74989O98351O72060N70295L72633J58237k6780j47600
9430F982355j90801j77980j47049j23100j43536k26050l16526l77746l96718l77018
9420D505831l38560k82858k07354j09127q022R6731K03370L07021M21975N52304
9410E141311O46346O50938N64126M13055K25647J1721j71794k84914l44504l57110
$$ plain form
9482 3503369 3672833 3671472 3544988 3341873 3099784 2825357 2544390 2278080 2024429 1793564
9472 1793564 1588733 1417483 1265569 1127040 1017693 933966 871691 817440 767389 738242
9462 738242 719289 699213 679184 671566 671806 682505 697267 719524 751271 780609 814576 868515
9450 868515 935113 1016842 1122784 1248127 1396693 1577419 1809419 2096456 2451148 2887450
9440 2887450 3404947 4010170 4685159 5383510 6055570 6625865 6998498 7156735 7129955 6982355
9430 6982355 6791554 6613574 6466525 6343425 6199889 5973839 5657313 5279567 4882849 4505831
9420 4505831 4167271 3884413 3677059 3567932 3559910 3656641 3860011 4167032 4589007 5141311
9410 5141311 5787657 6438595 7002721 7415776 7641423 7653144 7481350 7196436 6851932 6494822
9400F494822l43395l21891l25398l78123m26410m43368m32062m23300l91162l60119
9390B649594l20619k78133k26091j84950j50433j16162q6740p1984n6700m5084
9380A112698l4429k4677j2812p23O903K1280L8374N0374O0007Q2559R8081J29439
9368A527074J60177K04340K39036K79756L40601M15764M80566N02708M53066L66042
9358D969130L09970L01252L53574M77415O89282J025465J479304J522360K73366
9349A1401118p93143q63195p58543p90730r80409j079985r51769o93489m63476
9340D026379k87704j58063m0522Q7387K05492L15831L96060M17398L46812K29029
9330E538099J22775O9259O1291R0387J41590J74744J49779N1345o4292j85132
$$ plain form
9400 6494822 6151427 5829536 5504138 5126015 4699605 4256237 3824175 3400875 3009713 2649594
9390 2649594 2328975 2050842 1824751 1639801 1489368 1373206 1286466 1214482 1157782 1112698
9380 1112698 1078269 1053592 1040780 1040057 1046960 1068240 1106614 1156988 1216995 1299554 1397635 1527074
9368 1527074 1687251 1891591 2130627 2410383 2750984 3166748 3647314 4150022 4603088 4969130
9358 4969130 5279100 5580352 5933926 6411341 7100623 8126088 9605392 11127752 11401118
9349 11401118 10607975 9744780 8986237 8195507 7215098 6135113 5183344 4489855 4026379
9340 4026379 3738675 3580612 3540090 3627477 3832969 4148800 4544860 4962258 5309070 5538099
9330 5538099 5660874 5730133 5791424 5881811 6023401 6198145 6347924 6399269 6334977 6149845
9320F149845k80792l52050m14298m24682m09906l93352l70812l47159l22385k94358
9310B540051k74673k53664k22269j96044j79798j45141j24213j06711r1241p1710
9300H74587n9686l8428l1729k7321k0307j1514j0268n219l731J0337K0621K7143
9288G24485L8948M7073O5361Q9248R9510J16827J29930J43650J56932J81893K17333
9277B011190K36521K16074J26708Q314r3360j52352j86143k02860k08282j98088
9267A557722j81318j55542j17919q7925o0397l9317k0120Q3J2000M2917O5529
9256A015713Q1604J02891J29565J57007J70544J93138J98716J88776J40461L8864
9246B417279o4851j52264k01841k22118k27706k22655k01485j80633j45952j13159
$$ plain form
9320 6149845 5869053 5517003 5102705 4678023 4268117 3874765 3503953 3156794 2834409 2540051
9310 2540051 2265378 2011714 1789445 1593401 1413603 1268462 1144249 1037538 946297 874587
9300 874587 814901 776473 744744 717423 697116 685602 675334 670115 666384 676721 697342 724485
9288 724485 763433 810506 875867 965115 1064625 1181452 1311382 1455032 1611964 1793857 2011190
9277 2011190 2247711 2463785 2590493 2598807 2505447 2353095 2166952 1964092 1755810 1557722
9267 1557722 1376404 1220862 1102943 1015018 954621 915304 895184 895267 907267 950184 1015713
9256 1015713 1097317 1200208 1329773 1486780 1657324 1850462 2049178 2237954 2378415 2417279
9246 2417279 2352428 2200164 1998323 1776205 1548499 1325844 1124359 943726 797774 684615
9236F84615q5163p5070n7158n3093m5191l9610l4376k9878k5502k1465j2541m024
9224B01544J731r225p784k136J527O705L258j3017n184M180L16j0356j6021r311
9210A46227m300r61j252k305J364N773l387M26J687l651k538K990k054n010j0858
9195A22151l580N770J011j528j120j373P599m148n211o773p958r212Q47j190K60
9180I5545L013M33L159J4230J2485L888J6854J1600J6688J7316J7153Q47n630
9167B07581j6441m185l810p953j6184k6611k4830j5147nO50j114p869p187o519
9153G0376j0475m327m030j6864j0938l859K593M429L916M708J0562J968J713m046
9139D5726j823j439K985J2302J4280J0386P318J1936L082p979n631m652M084J250
$$ plain form
9236 684615 599452 524382 467224 414131 368940 329330 294954 265076 239574 218109 205568 201544
9224 201544 203275 194050 186266 184130 185657 192362 195620 182603 177419 181599 181915 171559 155538 146227
9210 146227 141927 140966 139714 137409 138773 144546 141159 141585 143272 139621 137083 140073 138019 133009 122151
9195 122151 118571 124341 125352 123824 122704 121331 128930 124782 119571 112798 104840 95628 96475 95285 95545
9180 95545 98558 98991 102150 116380 128865 132753 149607 161207 177895 195211 212364 213211 207581
9167 207581 191140 186955 183145 175192 159008 132397 107567 92420 92415 93065 91951 84082 76895 70376
9153 70376 59901 55574 51544 34680 23742 19883 22476 26905 30821 35529 46091 48059 49772 45726
9139 45726 43903 42464 45449 57751 72031 82417 89735 101671 104753 96774 91143 86491 90575 91825
9125I1825L495P246N510j735n327p199k540J6867J7182J3888J9495K4027K6009
9112B08743K4331K7881J9966Q939q26j2233l7479m0939k6814k0646k2269k3687
9100A04967k1640q822m570p611N739J3344O481O089N872J3798J6122J6208O519
9087A52496n405r472o091l229k239n084q675j282L410k666o530J0091L1257L7754
9073A84335K7911J1705j2149k4737j6500j0263m462k420q864j006R578J1966k380
9060A62714j834l18M610m042l843j996m626q092j933R365O950j680k226R9j1648
9045A41500j7264k4296k2655j8702o142L011o146k2820j9372R227K3689J4882
9033E4912J2785K1518J9538J0272N883Q398K0388K0621K5497J5589J3764K495
$$ plain form
9125 91825 95320 102566 108076 106341 101014 93815 91275 108142 125324 139212 158707 182734 208743
9112 208743 233074 260955 280921 289860 289034 276801 239322 198383 171569 150923 128654 104967
9100 104967 83327 74505 69935 62324 68063 81407 87888 93977 99849 113647 129769 145977 152496
9087 152496 147091 137619 131528 128299 126060 120976 112301 111019 114429 111763 105233 115324 146581 184335
9073 184335 212246 223951 211802 187065 170565 160302 155840 153420 144556 143550 153128 165094 162714
9060 162714 160880 160562 165172 161130 157287 155291 150665 142573 140640 150005 156955 155275 153049 153148 141500
9045 141500 124236 99940 77285 58583 52441 55452 49306 26486 7114 16341 40030 54912
9033 54912 67697 89215 108753 119025 124908 133306 153694 174315 199812 215401 229165 231660
9021B31660q477r929k168jJ1279L084L763J0921K740O317R756J5434J7112K1385
9007C12876J9699J7492J7529K3103K2673J8597K2933K5314J3579P667J8498L3616
8995E53576N1264N3377M4184J8398n822j4116k0136r713p188n035j1967l256J7205
8982F60771R479Q96j1301l750J2428J1763N701K160M112J6744K3041K2998M1993
8969G97035O0824O4316N7824N5219N3282N1290O4469O9836O1103N9379N6181O5161
8957A515919Q8226J16125J33200J53410J74822K10745K91203L45147K77977K06218
8947C512992K28381K75714K72417K26052K38994L17244M14621N23857O30268P37395
8937G377935Q32649R56747J131207J362109J653658K009927K442883K922629L222171
$$ plain form
9021 231660 223183 213254 211086 211085 222364 225448 229211 240132 242872 249189 258945 274379 291491 312876
9007 312876 332575 350067 367596 390699 413372 431969 454902 480216 493795 501462 519960 553576
8995 553576 604840 658217 702401 720799 714977 700861 680725 671012 663824 658789 646822 643566 660771
8982 660771 670250 671146 659845 656095 668523 680286 685987 688147 692259 709003 732044 755042 797035
8969 797035 857859 922175 979999 1035218 1088500 1139790 1204259 1274095 1335198 1394577 1450758 1515919
8957 1515919 1604145 1720270 1853470 2006880 2181702 2392447 2683650 3028797 3306774 3512992
8947 3512992 3741373 4017087 4289504 4515556 4754550 5071794 5486415 6010272 6640540 7377935
8937 7377935 8210584 9167331 10298538 11660647 13314305 15324232 17767115 20689744 23911915
8928B3911915L111115L160210M008841N541893P727765J1218543J7029658K6600452
8920A02310392M1810804O2422843P3484364M1774597j4640942l6513971l1324794
8913B39323293l0164590l7245659l9804712l3716512k4177562j6257992j1150166
8906D6806100p869586n617787m161268l470703l189240k820074k371373k014517
8898A5291552j729951j426792j005868n72731m41402o53072o69762m61242l50030
8889G980702l16319k67892l82810n09558m38669l56876l90580m32193m08230l44678
8879D132897k82923k38484k14554k13978j92365j71887j49925j25050j13873j04796
8869B325062j02005q2944o1126l4198m679J0873k523j0978l6794o8388p4049q1844
$$ plain form
8928 23911915 27023030 30183240 34192081 39733974 47461739 58680282 75709940 102310392
8920 102310392 144121196 206544039 280028403 321803000 307162058 270648087 239323293
8913 239323293 209158703 171913044 132108332 98391820 74214258 57956266 46806100
8906 46806100 38936514 33318727 29157459 25686756 22497516 19677442 17306069 15291552
8898 15291552 13561601 12134809 11128941 10556210 10114808 9461736 8791974 8330732 7980702
8889 7980702 7664383 7396491 7013681 6504123 6065454 5708578 5317998 4885805 4477575 4132897
8879 4132897 3849974 3611490 3396936 3182958 2990593 2818706 2668781 2543731 2429858 2325062
8869 2325062 2223057 2140113 2078987 2044789 2040110 2050983 2048460 2037482 2000688 1932300 1858251 1776407
8857A776407q5422p3350p5276p8855o9453n8432n8020m9050l9696m3457l6858
8846A108538k8913l1121l1400l3129k5998j9378j9951j1505j0832j0830L476m465
8834H84492k1905l3811k9884l4142l6234k0102j7698j5456j3931j7095j0680N503
8822F39057M007n70n98n450j0535L514j027q516n039j6284j7247j5282j7914l782
8808E44334R94J351q394o0P816O977J5141J3106J0428P241j088k983Q989J9346
8794F23198L0046L4716K0108J9067L226j6851l1023l8482n0448m9844m2286k1870
8782D79557k0072k1712j8720j7659j3350j3192j6238j0613j1656j1310K232P503
8770C34770m925l859K705Q048J2748m611j9855j9256j2759R250K4354J8783M180
$$ plain form
8857 1776407 1690985 1617635 1542359 1463504 1394051 1335619 1277599 1228549 1188853 1145396 1108538
8846 1108538 1079625 1048504 1017104 983975 957977 938599 918648 907143 896311 885481 888957 884492
8834 884492 862587 828776 798892 764750 728516 708414 690716 675260 661329 644234 633554 639057
8822 639057 643064 642494 641896 636446 625911 629425 628398 619882 614843 598559 581312 566030 548116 544334
8808 544334 545328 546679 538285 538225 546041 553018 568159 581265 591693 598934 597846 594863 603852 623198
8794 623198 653244 687960 708068 727135 730361 713510 682487 644005 593557 543713 501427 479557
8782 479557 459485 437773 419053 401394 388044 374852 358614 348001 336345 325035 327267 334770
8770 334770 329845 325986 328691 336739 349487 344876 325021 305765 293006 302256 326610 345393 349573
8757C49573j4697J628N452k996q281j2989j0615q692r096l977j2543q226j374
8744B63167J680Q82M92j549k796j56K578J568J0065L680o824j0337p625n199p704
8729B41922j5663m8182m6579k1797k3734j9352n367Q211J5904J0769J3759K2118
8717A32009K4758K9574K4888P691P225O483K075j1672k936P394O373J4457J5459
8704B63778K3847J9356K2857M1209K5357K365j3588j4126l312r474l1176l3692
8692B93401k2910p624m832m3l393L355O671N843n14m561q836m283j0271j8866
8678B23137n508j485k081j929N97j450k220K954L913M724L076K271P777M980k648
8663B36108J793m468n917k072j0021p739o484m268l188k347M326Q835l77q482
$$ plain form
8757 349573 334876 336504 341956 338960 330679 317690 307075 298383 289287 285310 272767 264541 263167
8744 263167 264847 265729 266221 264672 261876 261720 264298 265866 275931 279611 272787 262450 254825 249626 241922
8729 241922 226259 178077 131498 109701 85967 66615 61248 69459 85363 96132 109891 132009
8717 132009 156767 186341 211229 218920 226145 232628 234703 223031 220095 227489 233862 248319 263778
8704 263778 287625 306981 329838 371047 396404 398769 385181 371055 367743 358269 327093 293401
8692 293401 270491 262867 258035 257992 254599 257954 264625 270468 269954 265393 256557 252274 242003 223137
8678 223137 217629 216144 214063 212134 212731 211281 209061 212015 215928 220652 223728 225999 233776 238756 236108
8663 236108 237901 233433 227516 225444 215423 207684 201200 196932 193744 191397 195723 204558 204181 195699
8649A95699q499L813m069j1539j3448l168K311j472j749M066J935K243j187r496
8635A55440l530m767o260j613J053n374k505Q059J154Q491J5053J4367K4869L6724
8621B41161M0493L92k2040k4983k1602j5690l984k027j050p026N36M000O638J1254
8607B06072L869k27K564j279j092O797m242r165j0657l144J339k135q46L754Q04
8592A92412L82P286L433O923N067O42L652K080K930j396j131J8545K9963K2906
8578B93694M6733Q2824Q6873J0124l6620j7609n808k6549l1843l0575k1001p122
8566C43121k653j3349q172j4690j5704k0190k0565j1763j1492j2354p073j2783
8554A92333q094l125R43m700J880k555m612m663p138J621O191k53R54N734N093
$$ plain form
8649 195699 187200 191013 186944 175405 161957 158789 161100 159628 157879 161945 163880 166123 164936 155440
8635 155440 151910 147143 140883 139270 140323 134949 132444 140503 141657 150148 165201 179568 204437 241161
8621 241161 281654 282046 260006 235023 213421 197731 193747 191720 190670 183644 184180 188180 194818 206072
8607 206072 209941 209714 212278 210999 209907 216704 212462 203297 192640 189496 190835 188700 187854 191608 192412
8592 192412 192794 200080 203513 210436 215503 216145 219797 221877 224807 223411 222280 240825 270788 293694
8578 293694 340427 423251 510124 520248 483628 466019 460211 433662 401819 371244 350243 343121
8566 343121 340468 327119 318947 304257 288553 268363 247798 236035 224543 212189 205116 192333
8554 192333 184239 181114 182057 177357 179237 176682 172070 167407 160269 161890 168081 167828 168782 174516 179609
8539A79609k225l875J228O551J5962J2641J8837L8239L9906J9857p605l911K021
8526C17235J0261K1054K1427K5861L6258O3079P9351R0246J04776J11886J20470
8515A001904J05268Q4286N3423R170k3748m9649p8576r8647j11019j07615j06429
8504F78368r7542p7953p2035n7846n1401l5882l0768k4730j2890j0617j2562j2124
8492A82018j0327q138r048m202K59L221p508j941R45l978l950l127M977J0757
8478A49958l773j978o221o733l214k229J278k091J802j572l864O02K925k12k491
8463A22187j509o433p471L490o85l329l170k74J111o136O915O567J356l794L350
8448A12175l967j733N119N103O132L90o077q198M814M353r594p87L829r89j445
$$ plain form
8539 179609 177384 173509 174737 181288 197250 209891 228728 266967 306873 326730 319125 315214 317235
8526 317235 327496 348550 369977 395838 432096 495175 574526 664772 769548 881434 1001904
8515 1001904 1107172 1191458 1244881 1254051 1230303 1180654 1102078 1003431 892412 784797 678368
8504 678368 580826 502873 430838 372992 321591 285709 254941 230211 217321 206704 194142 182018
8492 182018 171691 163553 154505 150303 150562 153783 146275 144334 145279 141301 137351 134224 139201 149958
8478 149958 146185 144207 137986 131253 128039 125810 127088 124997 126799 125227 121363 121965 124890 124678 122187
8463 122187 120678 114245 106774 110264 109579 106250 103080 102806 103917 97781 104696 111263 112619 108825 112175
8448 112175 108208 106475 111594 116697 122829 123219 117142 108944 113758 118111 108517 107730 111559 110570 109125
8433A09125n059j778l585j0056n565J535j780O301J0494R814J53p419k992K405
8419A01593M375M87m286o137m843J172J361L576M533l164K479j136l403q436l210
8404H4961l065l831k874N71k000k596K00j0446K82J0187M929L317n66R09o788
8389G3190L176k334m385j401L040N145j522L360M591L025j923L458r02j161Q73
8374H6230o42l329l12m458o117P659l117o765j36L271Q18L120K2m422M623L720
8358H0165j873K35j828k919j383M711J826n88n356O663O062O701L699n800n025
8343H5290j509o99j629L880q14L758k287l454L08n117n899m990j542L471O217
8328G4984O051j7K033p713p371n368k438M00l413m456P094k040M88J404l219J176
$$ plain form
8433 109125 104066 102288 98703 88647 83082 84617 82837 89138 99632 109446 109599 102180 99188 101593
8419 101593 105968 106455 102169 96032 91189 92361 93722 97298 101831 98667 101146 100010 96607 88171 84961
8404 84961 81896 78065 75191 75762 73762 71166 71366 60920 61202 71389 76318 79635 79069 79978 73190
8389 73190 76366 74032 69647 68246 71286 76431 74909 78269 82860 85885 83962 87420 86518 85357 86230
8374 86230 85588 82259 81947 77489 71372 79031 75914 69149 69013 72284 73102 76222 76244 71822 76445 80165
8358 80165 78292 78527 76699 73780 72397 77108 78934 78346 72990 79653 85715 92416 96115 90315 85290
8343 85290 83781 83082 81453 85333 84519 88277 85990 82536 82844 77727 71828 66838 65296 68767 74984
8328 74984 81035 81018 83051 75338 67967 62599 60161 60561 57148 52692 59786 57746 58234 59638 56419 57595
8312E7595K448J29k334N910P43J839L347o472m640l503j947k210n830L730o8L950
8296E2687J0983j687L577J255m723K55k494l706n09j704L836P565M731o504m291
8281E9271N183L143j62m694J119j733m93K486N361J595j983n261l857k172o253
8266E1550O307O564L423o57J798J590j812l943L434R570q833n985L28l476r27
8251E8931l889l624j481Q64K254N633J128J10J940J157J0J930m487o791l993L285
8235E2977m398o208j343P10J879O256N367L910L774J480J056m387k664J376j548
8220E8237N149j376q536j291M113n05K375j0372n203P024L101K629M493J289k195
8205E8932o32k547j545M02j255L943N565L654o834q482j170l023N940K301l366
$$ plain form
8312 57595 60043 60172 57838 63748 64491 66330 69677 63205 58565 55062 53115 50905 45075 48805 48737 52687
8296 52687 63670 61983 65560 66815 62092 62347 59853 56147 55638 53934 57770 65335 70066 63562 59271
8281 59271 64454 67597 67435 62741 63860 62127 61634 64120 69481 71076 69093 63832 59975 57803 51550
8266 51550 57857 64421 67844 67187 68985 70575 68763 64820 68254 77824 68991 63006 63334 59858 58931
8251 58931 55042 51418 49937 50801 53055 58688 59816 59926 61866 63023 63033 64963 60476 53685 49692 52977
8235 52977 48579 42371 41028 41738 43617 49873 55240 59150 62924 64404 65460 61073 58409 59785 58237
8220 58237 63386 62010 53474 52183 56296 55791 58166 47794 42591 49615 52716 55345 59838 61127 58932
8205 58932 58300 55753 54208 54610 53355 57298 62863 66517 59683 51201 50031 47008 52948 55249 51883
8190E1883J529j164j057j033m669J120k410K032L198n754L372Q261O769n893j874
8175E4310K060l636l469n39o221j863N88l742n710J803Q561L647O92M968M347
8160E5796m270J505L708o839k84n564j2660L343J0586m55m932k694O578J713M89
8145D6020O892k706m505K166l415Q39K825L192n195m973J0294K996k736L243k260
8130E2677M772R459P89m910K460k05j077k358j875r756j262j183p482k20P006
8115D6835L897o930K129P784l066O00L298n503n768k258j297k127j342O0N991
8100D2303O428K078J739o625j558K173k46o51M270K608k385P198N862O241M496
8085G3931m914m095L707L952o059k910m35K560p158m477L252O7j736L597L642
$$ plain form
8190 51883 53412 52248 51191 50158 45489 46609 44199 46231 49429 43675 47047 55308 62077 56184 54310
8175 54310 56370 52734 49265 48726 42505 40642 41230 37488 31778 33581 42142 45789 46481 51449 55796
8160 55796 51526 53031 56739 49900 49616 44052 31392 34735 45321 44866 39934 37240 43818 45531 46020
8145 46020 52912 50206 45701 47867 44452 45291 48116 51308 46113 41140 51434 54430 51694 54937 52677
8130 52677 57449 66908 67697 62787 65247 65042 63965 61607 59732 49976 48714 47531 40049 39829 46835
8115 46835 50732 43802 45931 53715 50649 51249 54547 49044 43276 41018 39721 37594 36252 36312 42303
8100 42303 48731 50809 52548 45923 44365 46538 46292 45641 49911 52519 50134 57332 63194 69435 73931
8085 73931 69017 64922 68629 72581 66522 63612 63177 65737 58579 54102 57354 57421 55685 59282 62924
8070F2924j373m288j0677n009M812P806J640l941K197L628l405m976l906j089
8056D4343Q035k865l484J050k062K752m551j824l18j915M318J23L96O432J1614
8041F2044R246J185R64J0718N580O0m227k341p86k977n524o453N710J664p726
8026F7137q005l002M468N835N204j067o366q706o06L170k026r10j989J948P172
8011F2257l1k235o26o20k230n286K783K971K048M023n776O200j631q644L05L868
7995E7376M040K959Q875L190N99l868L955K03m538J778l633n174l524M894k730
7980F4402m11Q502N663L086J823j527n366N572M428L357L5l413l405j977j422
7965G9347k991r821r182K673L366l556k73J585M62K775rq38p642n354M546J1164
$$ plain form
8070 62924 61551 57263 46586 41577 46389 54195 55835 51894 54091 57719 54314 49338 45432 44343
8056 44343 52378 49513 46029 47079 45017 47769 43218 41394 41076 39161 43479 43602 43998 50430 62044
8041 62044 71290 72475 73439 84157 89737 89797 85570 83229 82443 79466 73942 67489 73199 74863 67137
8026 67137 59132 56130 60598 66433 71637 70570 64204 55498 54892 58062 56036 55126 53137 55085 62257
8011 62257 62226 59991 59365 58745 56515 51229 54012 56983 59031 63054 57278 63478 61847 53203 53508 57376
7995 57376 61416 64375 73250 76440 77039 73171 77126 77329 72791 74569 70936 65762 62238 67132 64402
7980 64402 63991 72493 78156 81242 83065 81538 76172 81744 86172 89529 89564 86151 82746 80769 79347
7965 79347 76356 66535 57353 60026 63392 59836 59563 61148 61610 64385 64376 63538 55896 50542 55088 66252
7949F6252J033q834n363k916l487N128N733K084l470K814O69K315k819K698K633
7934F4470Q276N524N532K317j989n401j039J812K135k713o230N19K446l340m863
7919F7456m15m812m40k748q476q722J882M238j930J939M76l718p107N702j28k431
7903D0766K397N797Q36n403J838O769N324m718q164L873N68j45K847J752l335
7888E1002m183J676N017R891Q30r854j369j743n163j303j748l753m72L345L093
7873D5266k006K623O41j066K915m977r636j106K236m875J452j781l429k398N221
7858B9080J0561L409m701O71r62l057J862p81O25m958j87O198J608k124l522p458
7842B6264K743j589K182K887l507m314j911J114M725O633m261q158n37N364o76
$$ plain form
7949 66252 67285 58451 53088 50172 46685 51813 57546 59630 56160 58974 59643 61958 59139 61837 64470
7934 64470 72746 78270 83802 86119 84130 78729 77690 79502 81637 78924 72694 73213 75659 72319 67456
7919 67456 67041 62229 61789 59041 50565 41843 43725 47963 46033 47972 48448 44730 37623 43325 43197 40766
7903 40766 43163 48960 49796 44393 46231 53000 58324 53606 45442 49315 49883 49738 52585 54337 51002
7888 51002 46819 48495 53512 63403 64233 54379 53010 51267 46104 44801 43053 39300 38828 42173 45266
7873 45266 43260 45883 46524 45458 48373 43396 33760 32654 34890 30015 31467 29686 26257 23859 29080
7858 29080 39641 43050 38349 39020 38058 35001 36863 36082 36707 31749 31562 37760 39368 37244 33722 26264
7842 26264 29007 27418 29600 32487 28980 24666 22755 23869 28594 35227 30966 22808 22271 27635 26959
7827B6959K856o080o006J796J239m636m413K14O584K268m601q44O365L641Q044
7812C3386L65n495l638j096j47O20K731n155L063K36j567M742j4169r76R965k420
7796B0445j190J510P81k066l952n44J260L800q49N033M033n404m572J586L877
7781B3748K78K787K818k060k15l894r004m724n354N107J0479K9k3m067m334M690
7765A6261P607N988K463n887j0565M10R66k451l004L540j928K529K948r5q778
7750A0004O817Q685M874l553j266k828P4K743l37l627J615n60n982j391O642j127
7734B0783J682L676P400o415o501q064N246K744q989l299k24J376L251k873L498
7719A3291M677P823M68m384J56k264K347k736k864K86p840o850L701O621L232
$$ plain form
7827 26959 29815 23735 17729 19525 20764 16128 11715 11929 18513 20781 16180 15336 21701 25342 33386
7812 33386 33751 28256 24618 23522 23375 23995 26726 21571 24634 24870 23303 28045 13876 12900 22865 20445
7796 20445 19255 20765 21546 19480 15528 14984 16244 20044 19195 24228 28261 22857 18285 19871 23748
7781 23748 24026 26813 29631 27571 27356 23462 14458 9734 4380 9487 19966 19995 19972 15905 11571 16261
7765 16261 23868 29856 32319 26432 15867 16277 17243 14792 11788 15328 13400 15929 18877 18782 10004
7750 10004 16821 25506 30380 26827 25561 22733 22807 25550 25213 21586 23201 22641 16659 15268 21910 20783
7734 20783 22465 26141 33541 27126 20625 12561 17807 20551 11562 8263 8039 9415 12666 9793 13291
7719 13291 17968 25791 26259 21875 22031 19767 22114 19378 16514 16800 8960 2110 5811 12432 15664
7704A5664K554k02p222j404P654j527o295K47M968P066o1o548j418o22k225j631
7688H998L413m006k495J163P07L61N855J024L34P04J514J839l172N75L256L067
7672B3137n471j406O29Q799j603l386K55k216n258N607k086r820m44L446j13k772
7656G298Q006R98r8K809R08O5k407K229J980o628L89P596o314k681L672O351M964
7639B9137j45p523j760o279q982K352R864M761p424j435L611n108J253j295m548
7624F479M672K370K049l059M470L902m98J489j493M778M14n223r221l364O56K484
7608A0905M347j714K890J160k364l25o288L923L00j878l80k362l006k307R83M953
7592H837L759R50j401o31m805O599M854j974m630L008L680K475m487j903j698
$$ plain form
7704 15664 18218 18016 10794 9390 17044 15517 9222 9469 14437 21503 21442 14894 13476 12854 10629 8998
7688 8998 12411 8405 5910 7073 7780 8141 13996 15020 15354 16058 17572 19411 16239 16814 20070 23137
7672 23137 17666 16260 16889 25688 24085 20699 20954 18738 13480 19087 17001 7181 6737 10183 10070 7298
7656 7298 15304 16302 16204 19013 19921 19986 17579 19808 21788 15160 15549 23145 16831 14150 17822 24173 29137
7639 29137 28992 21469 19709 13430 4448 6800 16664 21425 14001 12566 16177 11069 12322 11027 6479
7624 6479 11151 13521 15570 12511 16981 20883 20385 21874 20381 25159 25573 20350 11129 7765 8421 10905
7608 10905 15252 13538 16428 17588 15224 14899 8611 12534 12834 10956 10576 8214 5208 2901 3884 8837
7592 8837 12596 13546 12145 11514 6709 13308 18162 16188 11558 14566 18246 20721 16234 14331 12633
7577A2633k503l885M489P900L439K400J063j485j316m096k061l380P67k702m095
7562G168K267K409R11k952m387K014K588K590J477j68o69R6l009N323L842l305
7546A6195L125J232K473k022k452o40m487r73j736j208N198M845K714K422k252
7531B2434j877l055m513J05p87M354k62j866l998n522K746Q975J786p309j684
7516I527k739O675K257M414J082N15l94n666N92L847l14k308M040J55m65j945
7500A9273q28K367q10j774J330l460l770M707M754m924k864Q98j863p35K573K553
7484A7427K340n652K157L015N38L578L83k656l649j179N917P71R48k312o486n255
7468I885N190n866p522N260J2310Q389P95o21J27m431j540n527j828J371k758
$$ plain form
7577 12633 10130 6245 10734 18634 22073 24473 25536 24051 22735 18639 16578 13198 13965 11263 7168
7562 7168 9435 11844 12755 9803 5416 7430 10018 12608 14085 13917 13248 13344 10335 15658 19500 16195
7546 16195 19320 20552 23025 21003 18551 17911 13424 12451 10715 9507 14705 19550 22264 24686 22434
7531 22434 20557 17502 12989 13094 12307 16661 16399 14533 10535 5013 7759 16734 18520 11211 9527
7516 9527 6788 13463 15720 20134 21216 21731 21337 15671 16263 20110 19796 17488 21528 21683 21218 19273
7500 19273 18445 20812 20002 18228 19558 16098 12328 17035 21789 16865 14001 14899 13036 12301 14874 17427
7484 17427 19767 14115 16272 19287 19825 23403 23786 21130 17481 16302 22219 22990 23938 21626 15140 9885
7468 9885 15075 9209 1687 6947 19257 27646 28441 27820 27947 23516 21976 16449 14621 15992 13234
7453A3234L935j170L304L380l684R49J054K30J313L902O65o832m551m598m340
7438F791r09n82J111P0J079R05m284O917R278L297n844m014J233K145k109J563
7422A6647L356O539J259j616K036Q87l392p238p903J699j259J502j019L062J216
7407A5776j615J272M138M047o032m530L416O135n583j993q86J974J63l742L984
7392A6524M698J410N227k871K191N106j925r114k592k663N443j634K798J17j911
7377B0804j714l853l076j086M028L761p949L905J870L586j653p11m939l848j53
7362H972j913o43M830P084k420N466m493n786l569J042N787J818n797k97K047
7347A2128K340n793l32l50J657L97K300K620o918K126N650R07P50M635q74k335
$$ plain form
7453 13234 17169 15999 19303 22683 18999 19948 21002 21232 22545 26447 27112 20280 15729 11131 6791
7438 6791 5882 5300 6411 6481 7560 8465 4181 11098 20376 23673 17829 13815 15048 17193 15084 16647
7422 16647 20003 26542 27801 26185 28221 29108 25716 18478 10575 12274 11015 12517 11498 14560 15776
7407 15776 14161 15433 19571 23618 17586 13056 16472 22607 17024 15031 14145 16119 16282 12540 16524
7392 16524 21222 22632 27859 24988 27179 32285 30360 21246 18654 15991 21434 19800 22598 22715 20804
7377 20804 19090 15237 12161 11075 15103 18864 10915 14820 16690 20276 18623 17912 12973 9125 8972
7362 8972 7059 6416 11246 18330 15910 21376 16883 11097 7528 8570 14357 16175 10378 10081 12128
7347 12128 14468 8675 8343 7993 9650 10047 12347 14967 8049 10175 15825 16732 17482 22117 21243 18908
7331A8908j384q072o621L124K412N553M525l554k97O25L219j672l75l512k511
7316A0368j748j037p07J085M863l238K368J725K205J471K303J011j446J7N651
7301B4891n416q933o558N579J538k599k52l13L099K87o01J185N257k533j310k533
7285A0788M376j651l614k616O103M751j384o121l904r84J305l302j180M592K311
7270I470o604J8j22M33l127q28N17J34M221Q567P841L038q800K432k10n019J455
7253A3416m077k171Q110K987q508l961N504J267K54n258k865K158M01N286N613
7238A8156o71m732o696m76J0127L943n695m780N1l7O92P43k945k096J431M236
7222A1251M707K99K024M508j0652n354P70l6q030j0207J656K794K358K908Q516
$$ plain form
7331 18908 17524 9452 2831 5955 8367 13920 18445 14891 14594 15219 18438 16766 16391 12879 10368
7316 10368 8620 7583 6876 7961 12824 9586 11954 13679 15884 17355 19658 20669 19223 19240 24891
7301 24891 19475 10542 3984 9563 11101 8502 8250 7937 11036 11323 10722 11907 17164 14631 13321 10788
7285 10788 15164 13513 9899 7283 13386 18137 16753 10632 6728 5744 7049 3747 2567 7159 9470
7270 9470 2866 2884 2762 3195 68 -760 -243 -109 4112 12679 20520 23558 14758 17190 16980 11961 13416
7253 13416 9339 7168 15278 18265 9757 5796 11300 12567 12821 7563 4698 6856 7257 12543 18156
7238 18156 17485 12753 6057 5581 15708 19651 13956 9176 9227 9190 9882 10625 7680 5584 7015 11251
7222 11251 15958 16257 18281 22789 12137 6783 7553 7517 -513 -10720 -9064 -6270 -3912 -1004 7512
7207G512R376j077n743r900q978K96M770J296L129J790M69N493l227l487L100
7192D819L122J035L975l892k983J825N650J149n838p572N994L907k249J718J097
7177A1757r617n739n77P929N711p40r21L042K108N32K395K84k046n627J446j88
7161I749k104j947p128k64M602N739o689l55M080L243j487l041J426J193k661
7146D356M226J082J978m43Q35K249P420j37k226l744k059O079n020q99L169j933
7130A4933l295m349j22o98k751M067J702L513J893K857j907k716l3P629M278n145
7114A9856m80k636o959K311J058l929N29k54O562o5n98p229j655M413l568N167
7098A2523K35k343r64j613o483m753K717K962j528K777O088J563l155n504O67
$$ plain form
7207 7512 16888 15811 10068 168 -8810 -8514 -3744 -2448 681 2471 2940 8433 5206 1719 4819
7192 4819 7941 8976 12951 9059 6076 7901 13551 14700 8862 1290 7284 11191 8942 10660 11757
7177 11757 2140 -3599 -4176 3753 9464 8724 7803 10845 12953 13485 15880 16164 14118 8491 9937 9749
7161 9749 7645 5698 -1430 -1694 2908 8647 1958 1603 5683 8926 7439 4398 5824 7017 4356
7146 4356 8582 9664 11642 11199 12034 14283 21703 21566 19340 15596 13537 19616 14596 13697 16866 14933
7130 14933 11638 7289 7167 6469 3718 7785 9487 13000 14893 17750 15843 13127 13094 20723 25001 19856
7114 19856 19376 16740 9781 12092 13150 9221 9750 9496 16058 15993 15395 8166 6511 10924 7356 12523
7098 12523 12758 10415 9451 7838 1355 -3398 -681 2281 753 3530 9618 11181 8026 2522 3189
7083C189M680l508m248p75J369J824P620M319m365R81o758L723k958j911j179
7068B003M185J697P149J280l037O109K848j103K968J392j300m602r384K058o288
7053E975O747O461M234J537o116m559M8l781o33M419K629K3J766k721k312M174
7037A7891J298M340r403n473l286k528M15K179k542j283P523J071j604n06q706
7022f14N825R701M105l664j0366m586r4M043O6k8n924l219M465J492K721M2o383
7005b418j283Q781O292j1647N86O922O111J650o61q97J811J462m274K509m347
6990A0597n927N84M760j341Q30M589n50m911n554Q402K728n172n17N499l793m099
6974F125j594K894K793m148J644N608O732L467j606o595r490l867K51k32j637
$$ plain form
7083 3189 7869 4361 113 -662 707 2531 10151 14470 10105 11086 4328 8051 5093 3182 2003
7068 2003 6188 7885 15034 16314 13277 19386 22234 21131 24099 25491 24191 19589 10205 12263 5975
7053 5975 12722 19183 23417 24954 18838 14279 14327 10546 9913 14332 16961 16984 18750 16029 13717 17891
7037 17891 19189 23529 14126 8653 5367 2839 3254 5433 2891 1608 9131 10202 8598 8092 -614
7022 -614 5211 14912 19017 15353 4987 401 307 4350 4416 4388 -1536 -4755 -290 1202 3923 3965 -2418
7005 -2418 -3701 5080 11372 -275 311 7233 13344 14994 14333 13436 15247 16709 12435 14944 10597
6990 10597 4670 5254 10014 8673 9503 14092 13542 8631 3077 11479 14207 9035 8518 14017 10224 6125
6974 6125 4531 7425 10218 6070 7714 13322 20054 23521 21915 15320 5830 1963 2214 1982 345
6959C45K892K21m838k744M649j69J794O93J356M148l511K588L640J865K38J433
6943A4600j814O76N49L861M28o337J002L047Qk123m860l8m229M02R522O371q571
6926A2494j1167L30L575J062N50J478n36J86J639j302R00K8J633O98k618m602
6910D348k064r04j459j905R433J505m477l163O60q04J428J508L220L252o384o092
6894a898K166N063k420J45R8N74M812O601Q18M391j027p365n208P084M184l307
6878A4711p973l410j059K327l245j145J70K232J379O922N404J603l094j980J064
6863A3906j458L472k722q400L119M751m842l541n71J568R08q99k514M606L43m322
6847C404o220o936L790P873N038J604K085m027k394j295M796k523L213J0473J461
$$ plain form
6959 345 3237 3458 -1380 -4124 525 356 2150 2843 4199 8347 4836 7424 11064 12929 13167 14600
6943 14600 12786 13462 14011 17872 18300 11963 12965 16012 16020 13897 9037 8999 4770 5172 14694 21065 12494
6926 12494 1327 1657 5232 6294 6844 8322 7786 7972 9611 8309 9209 9237 10870 11568 8950 4348
6910 4348 2284 1380 -79 -1984 7449 8954 4477 1314 1974 1170 2598 4106 7326 10578 4194 -1898
6894 -1898 268 5331 2911 3056 3154 3728 8540 15141 15959 20350 19323 11958 6750 13834 18018 14711
6878 14711 6738 3328 2269 4596 1351 206 376 2608 3987 10909 16313 17916 14822 12842 13906
6863 13906 12448 15920 13198 4798 7917 12668 7826 4285 3714 5282 6190 5291 2777 7383 7726 3404
6847 3404 -2816 -9752 -5962 1911 6949 8553 10638 6611 4217 2922 7718 5195 8408 18881 20342
6832B0342R20p359n565o85J63L564m071o914l399m471O827J858k57o530l257N68
6816h266l387J1690O630k35l833L413k591N622q27k857J160L998J0884L927O420
6801C1748R667R615o98j0481p870Q61q985j2222j224J495j0459n294L142l026
6787c731Q881N951k370k778O456P467m434J312N683j51k307l278P97j143O85n325
6771A1715l119J204j959N252k472q261j056Q470M812M587L029J069m587p57M26
6756A8353n5N366L325l176m02L406k340l05K037M769P501P59K05k954m920o061
6740B5508m24N483R261K463n226k481J102Q573J2260L65Q195N372l827M381P431
6725G8436J1226J0227J5516K0625K7629J9586J5571J7440J4712M251j1139j4370
$$ plain form
6832 20342 21262 13903 8338 7653 7816 11380 7309 395 -3004 -7475 -648 1210 953 -5577 -8834 -8266
6816 -8266 -11653 37 6667 6432 2599 6012 3421 9043 8216 5359 6519 10517 21401 25328 31748
6801 31748 41415 51030 50332 39851 31981 32842 23857 11635 10411 11906 1447 -3847 -705 -3731
6787 -3731 5150 11101 8731 5953 12409 19876 15442 16754 22437 22286 19979 16701 17498 16355 17040 11715
6771 11715 8596 9800 7841 13093 10621 2360 1304 9774 14586 19173 22202 23271 18684 17927 18353
6756 18353 18298 23664 26989 23813 23411 26817 24477 24172 26209 30978 38479 39238 39443 36489 31569 25508
6740 25508 25084 30567 39828 42291 37065 34584 35686 44259 56519 56884 65079 70451 66624 71005 78436
6725 78436 89662 99889 115405 136030 163659 183245 198816 216256 230968 235219 224080 209710
6713B09710j3393j0036j3618p127K537J5420J8588J8287K1960K1679M2615N8383
6701C65005Q1301J18390J72268K42330L61371N21511P21360P56058K54948l88321
6691C206221m82395l69560l72859m46728m30319l31137k13402j33411r1600o9211
6681B65599m5256l1483l0475j9928j1954j775l047p269M240J4873J2579P572p665
6668A46011j5422j1117j3012k3623j7297j3402r080n13O630k126o16N595J0287
6655F2315L943n156j3044o291j737P82j597j2027l965K478l660K350M049l940
6641B4500p884j712O210l45j580j956L740N254m22j497o535n402m67j164K630
6626A3370K987q91k759L715n8J515K937K657p350l379J515L880K2r099J45n130
$$ plain form
6713 209710 196317 186281 172663 165536 168073 183493 202081 220368 242328 264007 306622 365005
6701 365005 446306 564696 736964 979294 1340665 1862176 2583536 3339594 3594542 3206221
6691 3206221 2723826 2354266 1981407 1534679 1104360 773223 559821 426410 334810 265599
6681 265599 220343 188860 158385 138457 126503 124728 121681 114412 118652 133525 146104 153676 146011
6668 146011 130589 119472 106460 82837 65540 52138 43058 42545 49175 47049 46433 52028 62315
6655 62315 66258 61102 48058 41767 40030 40812 39215 27188 23223 25701 22041 24391 28440 24500
6641 24500 16616 14904 21114 20769 19189 17233 20973 26227 25805 24308 17773 12371 11904 10740 13370
6626 13370 16357 15466 12707 16422 16364 17879 20816 23473 16123 12744 14259 18139 18161 9062 9207 4077
6610D077n682K33O424M098J371K775K028o266l833J965N210j687m850l269l044
6595d50M10Q049N6j1012K239N633J85k981M37L497p606J266K912j096L059N258
6579I856n64l545l117J227N094N185J323M742J132J313l888k219m781J824L52
6564A3934l753n360l640O267N430J912k611l22L964K099m353j2114j054o42K966
6549B723L725K421N09k675R69o797m316n7M717J987k916m308J828K25R251L780
6533A1066n444N31J122j69r13J499r20Q33l759k130M147M947p509m451M084M734
6517G668L023k669o475k230N733R88l227o497M076P14j831N142j04K909P87m068
6501C939k971K442J556K664J603LN973m155j069j76j37l979m39O114m981l703
$$ plain form
6610 4077 -1605 -1372 5052 9150 10521 13296 15324 9058 5225 7190 12400 10713 5863 2594 -450
6595 -450 -40 8009 8065 -2947 -708 4925 5110 2129 2566 6063 -1543 -277 2635 1539 4598 9856
6579 9856 9292 5747 2630 3857 8951 14136 15459 20201 21333 22646 18758 16539 11758 13582 13934
6564 13934 10181 4821 1181 7448 12878 14790 12179 11857 15821 17920 13567 1453 399 -243 2723
6549 2723 6448 8869 9378 6703 7672 875 -3441 -3498 1219 3206 290 -4018 -2190 -1965 7286 11066
6533 11066 5622 6153 7275 7106 6193 7692 6772 7605 3846 1716 5863 10810 3301 -1150 2934 7668
6517 7668 10691 8022 1547 -683 5050 6038 2811 -3686 390 1104 -727 4415 4311 7220 8007 3939
6501 3939 968 3410 4966 7630 9233 9236 15209 11054 9985 9809 9672 5693 5254 11368 6387 2684
6485B684J340m489l061N44j314k00L452O888K357k219m856O18L340J412j579N742
6469A0659L597J582m31k825k989l630n552m164M060L392J452M393k94o799o9M858
6453G240J474k461k768k162M311O060j431M05J391n1L051j921J246K264j001j3105
6437B542n095K271k728O324Q612o47J035o079r329J543J0414P369K436o906o738
6422E024j249m689j656P150l44L524K571j685l409K28n50l950k328k504k141l19
6406f327j33L844n80K719Q64k537o895N43Q175P252J213L87M270o46j222r93k915
6389G019k464k772m284j373j824L564K078J046M103j373j398m20K232K361r92
6374E503j153J362l757l533J354k71O95L083O93K828n72L031M225k108k444K265
$$ plain form
6485 2684 4024 -465 -3526 -2982 -4296 -4496 -1044 5844 8201 5982 1126 1744 5084 6496 4917 10659
6469 10659 14256 15838 15407 12582 9593 5963 411 -3753 307 3699 5151 9544 9250 2451 2382 7240
6453 7240 8714 6253 3485 1323 5634 11694 10263 10668 12059 12008 15059 13138 14384 16648 15647 2542
6437 2542 -2553 -282 -3010 3314 11926 11279 12314 6235 -3094 -1551 8863 16232 18668 11762 5024
6422 5024 3775 -914 -2570 4580 4236 7760 10331 8646 5237 5465 4915 965 -1363 -3867 -6008 -6327
6406 -6327 -6460 -2616 -3196 -477 387 -2150 -9045 -8502 -327 6925 8138 8525 12795 12149 10927 9934 7019
6389 7019 4555 1783 -2501 -3874 -5698 -2134 -56 990 5093 3720 2322 1902 4134 6495 5503
6374 5503 4350 5712 1955 -1578 -224 -495 200 3283 3976 6804 6232 9263 13488 11380 8936 11201
6358A1201L870j124m606j723m640n050J240N003L101O138K828l293l634j70J92
6343I333K867J428o429n391Q833J703J811q63o374m555m667L191n39Q96n82J97
6327H59q4J626j794m376J411R235P635J799l281K701N776m27K070K35N089r416
6311A9058p298j676K059K904n85k172r942j0257m75j14k041m70K153K724P149
6296A017O670j001N568l057k737o098o349P712o371k8P245j476n458M003P767
6281G407q69m794K510K589J962M22n043j580l256p53m716J033N36j573K455J121
6265b549o116K749K949K571M626j165j959j653l638M985J033k81k290k269O941
6250C934K567j512J536j603l735M005N044N651M709n104m284L514m182r83J794
$$ plain form
6358 11201 15071 13947 9341 7618 2978 -2072 -832 4171 7272 13410 16238 12945 9311 9141 9333
6343 9333 12200 13628 7199 1808 10641 12344 14155 13292 6918 2363 -2304 887 348 1244 662 859
6327 859 775 2401 607 -3769 -2358 6877 14512 16311 13030 15731 21507 21080 23150 23385 28474 19058
6311 19058 11760 10084 12143 15047 14462 12290 2348 -7909 -8384 -8498 -10539 -11009 -8856 -6132 1017
6296 1017 7687 6686 12254 9197 6460 362 -5987 1725 -4646 -4674 2571 1095 -4363 -360 7407
6281 7407 6538 1744 4254 6843 8805 9227 4184 2604 -652 -1405 -6121 -5088 -4552 -6125 -3670 -2549
6265 -2549 -8665 -5916 -2967 -396 4230 3065 1106 -547 -4185 800 1833 1552 -738 -3007 3934
6250 3934 6501 4989 6525 4922 1187 5192 10236 15887 20596 15492 11208 14722 10540 9557 11351
6235A1351o474l016Q98o5l421j845j583L845M507K480k463J713N98oM701J261
6219A2481k90l637j727k791J83K695p277K164K284L101m181m078l716l83j479
6204f651J409J466K891M799k704m899J872Q185N482K353J38L35m841j191j817
6189F827m510k381p91J356R076L954l196j125k104O4o39m752O497k749k606K836
6173E757L902m677N39N117m329K916L3o429N401J518L202n83k92n11L162m121
6157A0605j606P286j0370p377n151j515n06q65L587k657r55M087O942k71r56p040
6141f762m052R346Q528K679k705q895J615L316q71L178R656K267l211q1K464m539
6125A1933M118m416o949j73L982m941j943Q030o184n085L183q81j409j349O034
$$ plain form
6235 11351 4877 1861 2759 2694 -727 -2572 -4155 -310 4197 6677 4214 5927 6525 6519 11220 12481
6219 12481 12191 8554 6827 4036 4219 6914 -363 1801 4085 7186 3005 -1073 -4789 -5172 -6651
6204 -6651 -5242 -3776 -885 3914 1210 -3689 -1817 6368 11850 14203 14341 14676 9835 8644 6827
6189 6827 2317 -64 -855 501 9577 13531 10335 9210 7106 7170 6531 1779 8276 5527 2921 5757
6173 5757 9659 4982 5521 10638 6309 9225 9258 2829 8230 9748 12950 12367 12075 11564 14726 10605
6157 10605 8999 16285 5915 -1462 -6613 -8128 -8634 -9499 -5912 -8569 -9524 -5437 1505 1234 278 -6762
6141 -6762 -10814 -1468 7060 9739 7034 -1861 -246 3070 2199 5377 15033 17300 14089 14008 16472 11933
6125 11933 16051 11635 4686 4513 8495 3554 1611 9641 3457 -1628 1555 674 -735 -2084 3950
6110C950P601N560m272n76L490p636l963J437J772L134j159l984l070k126O881
6095G039M780p786p146n337M825O839K82p97P75k246q19J852P014l474j296J680
6079F185O16K08N888q08r392o078l694J998j604J234M988J343l394L501l08l128
6063b445k090j299J51j175M89K910n49J779j065O088j789J27l543r7P88j607j352
6046d679j128R7l583Q06N831K497O132K562j117l813L446N818N294m923j1726
6031A514p423n343j132Q715K360n82N904l154o279j415R18K653k60o91o802J00
6015a0917P708R48j028K166O491l971p543J217q78K610N716L541j644o653m074
6000f311r28L564m060N807N744J346j803R456l58r32o553m091l06n188O73j2n74
$$ plain form
6110 3950 11551 17111 12839 12263 15753 8117 4154 5591 7363 10497 9338 5354 2284 158 7039
6095 7039 11819 4033 -3113 -8450 -3625 3214 3496 2699 3474 1228 409 2261 9275 5801 4505 6185
6079 6185 6801 7009 12897 12089 2697 -3381 -7075 -5077 -6681 -5447 -459 884 -2510 991 683 -2445
6063 -2445 -4535 -5834 -5683 -6858 -6369 -3459 -4008 -2229 -3294 2794 1005 1132 -2411 -2508 -1720 -3327 -4679
6046 -4679 -5807 -5710 -9293 -8487 -2656 -159 5973 8535 7418 3605 7051 12869 18163 13240 1514
6031 1514 -5909 -11252 -12384 -3669 -1309 -1891 4013 859 -5420 -6835 -5917 -3264 -3524 -4215 -11017 -10917
6015 -10917 -3209 -2261 -3289 -1123 5368 1397 -6146 -4929 -5807 -3197 2519 6060 4416 -2237 -6311
6000 -6311 -7239 -3675 -7735 -1928 3816 5162 3359 12815 12457 11525 4972 881 575 -4613 -3940 -3952 -4526
5983d526J284j151J35k698r58N632R716n093l566o98L466k372q444K750L134J073
5967b316N31M355L895m703p821J0605J633j584l641K365o267j82K340N68L320
5952C098N353K885L644q140j415N917L07n19J636q138m219k98q018r72J99j470
5936a0150j722J885K667O93J240k004o37K509k582l262N454L30j890R71M223M154
5920A879m120l842k594N39K469K713K049k976j131R0K942K965n930j168R00Q01
5904d414N660J549k446M419K844p382k299K354O151j1666p93Q808Q742M669k84
5889A5912l050o268k195o576L517L721L342n308r959k258J576j844m23N489L157
5874a167O720o63L133L79L27j151n08k412j473p39r35m428O905K394k072L314
$$ plain form
5983 -4526 -3242 -4393 -4258 -6956 -7914 -2282 7434 2341 -1225 -1923 1543 -829 -9273 -6523 -3389 -2316
5967 -2316 -1785 2570 6465 1762 -6059 4546 6179 4595 954 3319 -2948 -3130 -790 -222 3098
5952 3098 8451 11336 14980 6840 5425 11342 11649 11130 12766 4628 409 111 -7907 -8879 -8680 -10150
5936 -10150 -11872 -9987 -7320 -6627 -5387 -7391 -8028 -5519 -8101 -11363 -5909 -5579 -7469 -6498 -2275 1879
5920 1879 -2241 -6083 -8677 -8138 -5669 -2956 -907 -3883 -5014 -4924 -1982 983 -4947 -6115 -5215 -4414
5904 -4414 1246 2795 349 4768 7612 230 -2069 285 6436 -5230 -6023 2785 11527 16196 15912
5889 15912 12862 6594 4399 -2177 1340 5061 8403 3095 -6864 -9122 -7546 -9390 -9813 -4324 -1167
5874 -1167 5553 4890 8023 8402 8729 7578 7070 4658 3185 2446 1511 -2917 3988 6382 4310 7624
5858G624N789l750J384L656j902L418o591m337N751o006L367O009n41m501k604
5843F766J082q158k467J903L605J341L008M648p140l870L120j938J718j989q731
5828g102K521O387N204k409l702O193Q410k300k994o117k685L934j255l267o991
5813f173L769Q452O028m143p606q387M511Q487N540N828k507m244q865n262J0044
5798E472L664J375K053l734n486j634K878j655L446Q74j957k223L071l792j0422
5783h070K055J1554l221n563k17J64J251L532P639M805n599j675k623k083R92
5768B941J834L135L560k163k92J760m576p216J434K310K612O042J249m667k309
5753E654O008o287l971R98J137j698K097M450N17l751o74m785l785l123M183O639
$$ plain form
5858 7624 13413 9663 11047 14703 12801 16219 9628 5291 11042 5036 8403 14412 13871 9370 6766
5843 6766 7848 -310 -2777 -874 2731 4072 7080 11728 4588 718 3838 1900 3618 1629 -7102
5828 -7102 -4581 1806 7010 4601 899 7092 15502 13202 10208 4091 1406 5340 4085 818 -6173
5813 -6173 -2404 6048 12076 7933 327 -8060 -3549 4938 10478 16306 13799 9555 690 -4572 5472
5798 5472 9136 10511 12564 8830 3344 1710 4588 2933 6379 7253 5296 3073 6144 2352 -8070
5783 -8070 -6015 5539 2318 -3245 -3462 -3298 -2047 1485 9124 13929 8330 6655 4032 1949 2941
5768 2941 4775 7910 11470 9307 9015 10775 6199 -1017 417 2727 5339 11381 12630 7963 5654
5753 5654 11662 5375 1404 2402 3539 1841 3938 8388 8905 5154 4480 -305 -4090 -7213 -3030 3609
5737C609J416n131o15p170l837M011M235R12O95J869M020j798n134m465l770L456
5721g697L290l660M227N737J641J864J450j921l098n01j791m949o34N729K576
5706B263o297l088K816L590k76j793n41J603l08M673J928m489J835N632K438k67
5690I719k150j0485O29J612J819N732K784n913j615k424j949J426Q302m143k961
5675C83k769j348N224p96m517O757J89l224N2k487L628M590O51o580K987O679
5659I419j472K474l367r413m906Q150J127j678K270j705j645K315k103o689J530
5644e693k035k971m329m492J568O123J432l41P226M760j588j803j953M920N807
5629F631L112o082O24P278k122q174l280N103l72P677M76q587o133p39K932J497
$$ plain form
5737 3609 5025 -106 -721 -7891 -11728 -7717 -3482 -2570 -1875 -6 4014 2216 -2918 -7383 -11153 -7697
5721 -7697 -4407 -8067 -3840 1897 3538 5402 6852 4931 1833 1332 -459 -5408 -6042 -313 2263
5706 2263 -4034 -7122 -4306 -716 -992 -2785 -3326 -1723 -2031 2642 4570 81 1916 7548 9986 9719
5690 9719 7569 -2916 -2287 -675 1144 6876 9660 3747 2132 -292 -2241 -815 7487 3344 383
5675 383 -2386 -3734 1490 694 -3823 2934 3123 -101 -49 -2536 1092 5682 6333 -247 2740 9419
5659 9419 7947 10421 7054 -2359 -7265 885 2012 334 2604 899 -746 1569 -534 -7223 -5693
5644 -5693 -7728 -10699 -15028 -19520 -17952 -11829 -10397 -10738 -3512 1248 -340 -2143 -4096 824 6631
5629 6631 9743 3661 4285 11563 9441 1267 -2013 3090 2718 10395 10871 2284 -3849 -4588 -1656 -159
5613a59k860m682Q37p05k921L529J552L689P244J301k223p508k834K580P682O121
5597A0643m942n078J246k780m395j365K801k986L867k270j567K117K627k811k047
5582f940j527K232P569k942q431J063k6J0491O083L643O48n812n405R29O461l53
5566G683n556j645LL903o241k647m370k247L724o49K829L454Q384J882n262J759
5550E004K887k165j161l916K840L350m832o806l663J675J823J486Q336J3273R83
5535A9114j1287r777k394o506L851N439l18P198N306q06j1220r618l816M653P88
5520i393J14M308n720j027Q615M587l439L369J042l792M365m323k010j394k486
5505g184P27Q51K01J0774j130l066k540l466K647R628k013K023J252l486n844
$$ plain form
5613 -159 -3019 -7701 -6864 -7569 -10490 -6961 -5409 -1720 5524 6825 4602 -2906 -5740 -3160 4522 10643
5597 10643 5701 623 1869 -911 -5306 -6671 -3870 -6856 -2989 -5259 -6826 -4709 -2082 -4893 -6940
5582 -6940 -8467 -6235 1334 -1608 -10039 -8976 -9002 1489 7572 11215 11863 6051 646 1575 8036 7683
5566 7683 2127 482 485 4388 -1853 -4500 -8870 -11117 -7393 -8042 -5213 -1759 6625 8507 3245 5004
5550 5004 7891 5726 4565 649 3489 6839 2007 -4799 -8462 -6787 -4964 -3478 4858 18131 19114
5535 19114 7827 -1950 -4344 -10850 -6999 -1560 -1878 5320 10626 9820 -1400 -11018 -14834 -10181 -9393
5520 -9393 -9279 -4971 -10691 -11718 -3103 1484 -1955 1414 2456 -1336 3029 -1294 -3304 -4698 -7184
5505 -7184 -6457 -5606 -5405 5369 4239 1173 -1367 -4833 -2186 7442 5429 7452 8704 5218 -626
5490f26m957J848L572O338j166M08j957J675j3008p515J402K689J0457M013L64
5475C537K345r23o591o202M624j701n790m47O310M300M284l409K001K96j314J357
5459B677n538J957K495j47m184K002j975o554K667M170l978p86o27P058K090N879
5443G206o781l956n373o33P272l131m287J037N255q491o380J807l960q25O850
5428a4390M002l582N756P698O166K25o602j269o00M434R36L350K414q41l945l657
5412I5j561j600j347j598n10R04n295k908K557L688P01k722l07j172K417j800
5396a0458l292Q915N027L436n651n823M705p62l220J0024J72J015O587m459j0078
5381c862m439L412K946k724j211P97l423P249P660K192K11m599l735l756M578
$$ plain form
5490 -626 -5583 -3735 -163 6175 5009 5417 3460 5135 -7873 -15388 -13986 -11297 -840 3173 3537
5475 3537 5882 4959 -1632 -7834 -3210 -4911 -10701 -11148 -4838 -538 3746 337 2338 2634 1320 2677
5459 2677 -2861 -904 1591 1444 -2740 -738 -2713 -9267 -6600 -2430 -6408 -7194 -7821 -763 1327 7206
5443 7206 425 -3531 -8904 -9537 -2265 -5396 -9683 -8646 -3391 -11882 -18262 -16455 -20415 -21240 -14390
5428 -14390 -10388 -13970 -8214 -516 5650 5875 -727 -1996 -2596 1838 2774 6124 8538 7697 3752 95
5412 95 -1466 -3066 -4413 -6011 -6521 -5617 -10912 -13820 -11263 -7575 -6874 -9596 -9903 -11075 -8658 -10458
5396 -10458 -13750 -4835 192 3628 -2023 -7846 -3141 -3903 -7123 2901 3073 4088 10675 6216 -3862
5381 -3862 -8301 -4889 -1943 -4667 -5878 -5081 -8504 -1255 6405 8597 8808 4209 474 -3282 1296
5366A296m131o82M495n201l329O580K608K576k570n207l295j66N111J094l058
5351c879K298k205p582j063K08J776j480N953M344k466o583k66k514L110P628
5336b721L254j40k477k991N118L08l563m934k765O373P32m487N223K205l249k737
5320f851O10l411J783P609j867K63l91j3585l396L705L765P275N89k382M193R946
5304G855M228q380q035N82o122K506L649L145P625O944L149j289q659l880l537
5289b19J210l826J671N74P60M220K24o13p175J695J749K772j324m59M957Q33m360
5272B689P78Q714k135q941l735L19K313M242K494L864k007l787K845k763r013
5257d123r63M995K508J036m267J609L653J659P47L466j0407m31M838O59l86m430
$$ plain form
5366 1296 -2835 -3517 978 -4223 -7552 -972 1636 4212 1642 -3565 -6860 -7026 -1915 -821 -3879
5351 -3879 -1581 -3786 -11368 -12431 -12223 -10447 -11927 -5974 -1630 -4096 -10679 -10945 -13459 -10349 -2721
5336 -2721 533 393 -2084 -5075 43 351 -3212 -8146 -10911 -4538 -3806 -8293 -3070 -865 -4114 -6851
5320 -6851 -6241 -9652 -7869 -260 -2127 -1864 -2255 -15840 -19236 -15531 -11766 -4491 -3902 -6284 -2091 7855
5304 7855 12083 3703 -4332 -3750 -9872 -7366 -3717 -572 7053 13997 17146 15857 7198 3318 -219
5289 -219 991 -2835 -1164 -590 170 4390 4614 4001 -3174 -1479 270 3042 1718 1259 6216 7049 2689
5272 2689 3467 12181 10046 1105 -2630 -2311 2 4244 6738 10602 8595 4808 7653 4890 -4123
5257 -4123 -5086 -91 2417 3453 -814 795 4448 6107 6854 10320 -87 -518 4320 4979 4593 163
5241A63L228M813l683k574j203j809J012L268p301k295m231K993L183K077J385
5226i74P92K695K665J536N326J410l868O86J876N624L351q770r153l262l177n239
5210h482K299K033J575N664j236l725j256L508j332l543l868k842K926N535P099
5195D355O49k167n705o246J785M430l696j235J734K25K855l526n962O231P704
5180A431M539l857j186m000J110K381m238M31N809j924J536J225K90K7m090p713
5164h229K625L735K597P955k171l259k229N268J059m105l134j59j836J725L562
5149C404l513k669P722N868L345q224m787l911N560J2349O65j1568n345L803Q85
5134C584k737l986o95N201M31k253j44j288j695K969M710k323j620j025L036j891
$$ plain form
5241 163 3391 8204 4521 1947 744 -1065 -53 3215 -4086 -6381 -10612 -7619 -4436 -2359 -974
5226 -974 -182 2513 5178 6714 12040 13450 9582 10268 12144 17768 21119 12349 3196 -66 -3243 -8482
5210 -8482 -6183 -4150 -2575 3089 1853 -1872 -3128 380 -952 -4495 -8363 -11205 -8279 -2744 4355
5195 4355 5004 2837 -2868 -9114 -7329 -2899 -6595 -7830 -6096 -5871 -3016 -6542 -12504 -6273 1431
5180 1431 5970 2113 927 -3073 -1963 418 -3820 -3389 2420 496 2032 3257 3547 3574 -516 -8229
5164 -8229 -5604 -1869 728 8683 6512 3253 1024 6292 7351 3246 112 -47 -1883 -158 3404
5149 3404 -109 -2778 4944 10812 14157 5933 1146 -2765 2795 15144 15809 4241 -1104 2699 3584
5134 3584 847 -3139 -3834 1367 1798 -455 -599 -1887 -3582 -613 4097 1774 154 -871 2165 274
5118B74j488j338m210Q958M339J137m455k015m707j540j118o023j248p37m046
5103a8217K61Q75J527P333p35Q017K080l915L796O372o069o155Q567M373k702
5088E408l417M894J098l303j628m795o135J522Q69k185k488J31R45M77L868P890
5072C151m184j526J756M10l477P03J617R09k388m357j975L417l70K586j521K258
5056b991J753l255j33J828k112N526m63J683L95P707m17J036L5l465p030k535
5040b438j734N350r88o3K636N71n440m91N336K455l450k803J56N091L185o699
5024F74q414L659K870J328l994O48P621J09J693l616k520j864K392m617M1R291
5008E301M510k440q48p495j389K1k674L967j330k303j293n89M973O961M468N909
$$ plain form
5118 274 -1214 -2552 -6762 2196 6535 7672 3217 1202 -3505 -5045 -6163 -12186 -13434 -14171 -18217
5103 -18217 -17956 -17081 -15554 -8221 -8956 -939 1141 -2774 1022 7394 1325 -4830 3737 8110 5408
5088 5408 1991 6885 7983 4680 3052 -1743 -7878 -6356 -5487 -7672 -10160 -10029 -9084 -8607 -4739 3151
5072 3151 -1033 -2559 -803 -393 -3870 -3167 -1550 -641 -3029 -7386 -9361 -5944 -6314 -3728 -5249 -2991
5056 -2991 -1238 -4493 -4626 -2798 -4910 616 153 1836 2231 9938 9521 10557 10592 7127 97 -2438
5040 -2438 -4172 1178 190 127 2763 3334 -2106 -2597 2739 5194 1744 -1059 -903 4188 7373 674
5024 674 -7740 -4081 -1211 117 -3877 -3229 4392 4501 6194 2578 58 -1806 586 -4031 -3990 5301
5008 5301 9811 7371 6523 -972 -2361 -2340 -5014 -1047 -2377 -4680 -5973 -6562 -1589 5372 9840 15749
4992A5749j012m775n68M732R10k675n6p620q632q855Q200J1087N899k186q432
4977A766l760l702M219O105l295K46L579l890k79m592k940M732O16j062j581k109
4961e947j911M343J095r7L374L756l914r2o50M56M291M460n279k671O142k823
4945D533l677K104q95L851N522m936n873J547j518p298p325m860N228N095M818
4930c684q8K554n004n246K059L571P83M157K632L399l514n353k854K441P07l956
4914g396j308J697K221O274k16j2062j956N130j379j705L811m297K261J202l017
4899a0740M168J0693J042K74p639N152J478m576K811L795j84K506o285j0154j631
4884i290L867p06j1995l616Q909N005j557M818N948O17p10m339o19L883L507L818
$$ plain form
4992 15749 14737 9962 9394 14126 15036 12361 12305 4685 -3947 -12802 -4602 6485 12384 10198 1766
4977 1766 -1994 -5696 -1477 4628 1333 1579 5158 1268 989 -3603 -6543 -1811 -1195 -2257 -3838 -5947
4961 -5947 -7858 -3515 -2420 -2517 857 4613 699 607 -43 413 4704 9164 3885 1214 7356 4533
4945 4533 856 2960 2065 5916 11438 6502 629 2176 658 -6640 -13965 -18825 -13597 -8502 -3684
4930 -3684 -3772 -1218 -6222 -11468 -9409 -5838 -5055 -898 1734 5133 1619 -3734 -6588 -4147 -3440 -7396
4914 -7396 -8704 -7007 -4786 1488 1272 -10790 -12746 -7616 -8995 -10700 -6889 -11186 -8925 -7723 -10740
4899 -10740 -6572 4121 5163 5437 -2202 2950 4428 -148 2663 6458 6274 8780 2495 -7659 -9290
4884 -9290 -5423 -6129 -18124 -21740 -12831 -7826 -9383 -4565 1383 2000 1290 -3049 -3668 215 3722 7540
4868G540l918k520K122P7L428n727r841j686O143K925J082n77J163l438l149K44
4852f132r26M029J871J070J817k509N60K379M867j39O65k712j0171M173N966j069
4836C739N827k997o386m394o38k380l314L235K963R044J041p431p010J705K199
4821d797k183M578L243l311L277K107L946K970J15q592r705j50q95m630j461K742
4805a2746P647J929l01J206N425J593j158j496l292p573j886J958O225J989J531
4790A051k848l884l203K720r81j389O656l408k613Q567o858p629l820J2073J1170
4775E604J741p054n071l921J101J0902N626J143p127n381j524r4k821O46J452
4760d778J384J443K73p604p571J064N444J0796K99l318J35K619m847o082K728
$$ plain form
4868 7540 3622 1102 3224 3301 6729 1002 -8839 -10525 -4382 -1457 -375 -952 211 -3227 -6376 -6132
4852 -6132 -7058 -3029 -1158 -88 1729 -780 -220 2159 7026 6887 7552 4840 -5331 -1158 4808 3739
4836 3739 9566 6569 183 -4211 -4849 -7229 -10543 -7308 -4345 4699 5740 -1691 -8701 -6996 -4797
4821 -4797 -6980 -2402 841 -2470 807 2914 6860 9830 9945 1353 -8352 -8502 -9397 -14027 -15488 -12746
4805 -12746 -5099 -3170 -3471 -2265 3160 4753 3595 2099 -1193 -8766 -10652 -8694 -2469 -480 1051
4790 1051 -1797 -5681 -8884 -6164 -7145 -8534 -1878 -5286 -7899 668 -6190 -13819 -17639 -5566 5604
4775 5604 7345 291 -4780 -8701 -7600 3302 8928 10071 2944 -2437 -3961 -4055 -6876 -6230 -4778
4760 -4778 -3394 -1951 -1678 -9282 -16853 -15789 -10345 451 750 -2568 -2433 186 -4661 -10743 -8015
4745h015K785l598J101N267K126j590l765n198J871J574k759k7L991K658L333
4730b46L05K410k631J124L104j197o318m153K473J04k046j476K380j230l129l527
4714a4053q63m265K425J1337J923j798o552L911M981L977M453m671j163M504k647
4699A499j767l389k031j581j285N514L932l482Q873J537m676m263o054o826K660
4684a1339L386N780Q774K636l946K954n678j6496q221N175J0037O603m439j634
4670f408N518L557j157n954m081N079P832K481O22o44k435K62r077m546l426m509
4654a6886K441K957N516k88M573L038J326J030n440k212q44J325l124n52o8J43
4638g065K395J92r56Q1N247J826O93j239n814m725R618K288K890n367r27M629
$$ plain form
4745 -8015 -5230 -8828 -7727 -2460 -334 -1924 -5689 -10887 -9016 -7442 -10201 -10228 -6237 -3579 -246
4730 -246 59 2469 -162 962 4066 2869 -3449 -7602 -5129 -5025 -7071 -8547 -6167 -7397 -10526 -14053
4714 -14053 -14916 -19181 -16756 -5419 -3496 -5294 -11846 -7935 -2954 1023 5476 805 -358 4146 1499
4699 1499 -268 -3657 -5688 -7269 -8554 -3040 892 -2590 6283 7820 3144 -1119 -7173 -13999 -11339
4684 -11339 -7953 -2173 6601 9237 5291 8245 2567 -13929 -22150 -16975 -6938 -335 -4774 -6408
4670 -6408 -890 2667 1510 -4444 -8525 -3446 4386 6867 7489 6845 4410 4672 -4405 -8951 -12377 -16886
4654 -16886 -14445 -11488 -5972 -6260 -1687 1351 2677 3707 -1733 -3945 -4789 -3464 -6588 -7140 -7208 -7065
4638 -7065 -4670 -4478 -5434 -5353 -106 1720 2413 1174 -4640 -9365 253 2541 5431 64 -863 3766
4622C766J1200o198n148p183o038O78N513K386j408J103L786M821l502k755m344
4607c323O135k24l240q56m67J683l515p583J173N620j8l079L70L532L605j453
4591a640J181l374R67K135p7K731k397k759q70l411O253N18L653J289k128K786
4575D857J532l761n079l010P615N931l8r944J244M714r35J090n273o27J836k111
4559a959o420P292M256j741o539J5J677L939Q53l17n26k418K647n70O6N0o48Q290
4541G947M947k238J109k274j0463k987l009q51K201L789m442J694K583J415L744
4526C165n20j63L275j764k244n059J808J090p03j479j068o16k634J928N3j476
4510f407j696L238M372P296k800p892L743O34p621n638k251L898J963O497M724
$$ plain form
4622 3766 14966 8768 3620 -3563 -9601 -8923 -3410 -1024 -2432 -1329 2457 7278 3776 1021 -3323
4607 -3323 2812 2588 -652 -1508 -1975 -292 -3807 -11390 -10217 -4597 -4615 -7694 -7324 -3792 -187 -1640
4591 -1640 -459 -3833 -2866 -731 -808 1923 -474 -3233 -4103 -7514 -1261 -743 2910 4199 2071 4857
4575 4857 6389 2628 -2451 -5461 2154 8085 8047 -1897 -653 4061 3126 4216 -1057 -1684 152 -1959
4559 -1959 -8379 -1087 3169 1428 -5111 -5096 -3419 520 1373 1056 530 -1888 759 189 255 305 -343 7947
4541 7947 12894 10656 11765 9491 -972 -3959 -6968 -7819 -5618 -1829 -6271 -4577 -1994 -579 3165
4526 3165 2645 2482 5757 3993 1749 -3310 -1502 -412 -1115 -2594 -3662 -4278 -6912 -4984 -4931 -6407
4510 -6407 -8103 -4865 -493 6803 4003 -3889 -146 488 -7133 -12771 -15022 -11124 -9161 -2664 2060
4495B060m471l536P738o64o676K487J794m814K390M550j338l298RL136p94J842
4479D15j118j854L642L785m135K861j326m962J673O509L268n495q816j500K865
4464d188o419k3M599L719L103k05K98j41K305m88n421m470k94o62N366P170j873
4447B376L003K001k733k758p207M100P896J475m495n444j653M91m374K21K912
4432d189j68K559K114N44O352j987m463j0881j955O727O93K034l665p545j862
4417a5692M191R015L288O509J277n820j2560K904J974O138J022O11j436m498M23
4402b654k277j280L807M392l935n014l221J173L760M758k982j091l118l347J443
4387i586J2307K112k449k765n165l401O192M357m587k233k857m276M246K702J608
$$ plain form
4495 2060 -2411 -5947 1791 1127 -5549 -3062 -1268 -6082 -3692 858 -480 -3778 -3769 -633 -1427 415
4479 415 -703 -2557 1085 4870 735 3596 2270 -2692 -1019 5490 8758 3263 -5553 -7053 -4188
4464 -4188 -10607 -10630 -6031 -2312 791 586 884 743 3048 2560 -2861 -7331 -7625 -8287 -2921 4249 2376
4447 2376 5379 7380 4647 1889 -5318 -1218 6678 8153 3658 -1786 -3439 -2948 -7322 -7101 -4189
4432 -4189 -4357 -1798 316 860 7212 5225 762 -10119 -12074 -5347 -4654 -2620 -6285 -13830 -15692
4417 -15692 -11501 -2486 802 7311 8588 2768 -9792 -6888 -4914 1224 2246 2857 1421 -3077 -2654
4402 -2654 -4931 -6211 -2404 1988 -1947 -6961 -10182 -9009 -5249 -491 -3473 -4564 -7682 -11029 -9586
4387 -9586 2721 4833 2384 -381 -5546 -8947 -2755 1602 -2985 -5218 -8075 -12351 -8105 -5403 -3795
4372c795K329M187m668r658k088O645P781K24n370l605K812j191p8O993k181j671
4356c334n030l312l628m058J233O25J2999J027r94n71m852J383M738m800m234
4341a2808J544P705J978n073l933L191O909K988p462m189l19K187N501m29J611
4326e99P122j461o760q639j982r77J421O435K795q913k039J062K953K708Q07K19
4310e848J293P467k483M39j533J025j1o10n79m446k209j275N104P403l01k448
4294I88o186k291O54Q417q49k309j553j944n582j185n882o249J606Q557M544P025
4278b239J482r746J992J176K792K128n75o05j791J292p141n459Q98N0j779j213
4262a8738L935M870J889O659P593n943L14K021K16O180o81p313m771k886n46k099
$$ plain form
4372 -3795 -1466 2721 -1947 -11605 -13693 -7048 733 957 -4413 -8018 -5206 -6397 -6475 518 -1663 -3334
4356 -3334 -8364 -11676 -15304 -19362 -18129 -17504 -4505 -3478 -4472 -5043 -9895 -8512 -3774 -8574 -12808
4341 -12808 -11264 -3559 -1581 -6654 -10587 -7396 -487 2501 -4961 -9150 -9469 -7282 -1781 -2210 -599
4326 -599 6523 5062 -1698 -10337 -12319 -13296 -11875 -5440 -2645 -11558 -13597 -12535 -9582 -6874 -6067 -5848
4310 -5848 -4555 2912 429 868 -665 360 349 -261 -840 -5286 -7495 -8770 -3666 3737 3436 988
4294 988 -5198 -7489 -6835 1582 733 -1576 -3129 -5073 -10655 -11840 -17722 -23971 -22365 -13808 -9264 -2239
4278 -2239 -757 -10503 -8511 -7335 -4543 -2415 -2990 -3595 -5386 -4094 -11235 -16694 -15796 -15746 -17525 -18738
4262 -18738 -14803 -9933 -8044 -1385 6208 265 579 2600 2816 8996 8315 1002 -3769 -6655 -7201 -9300
4246i300l994N52K019J438k554J511M629J981o636P29P559J716k026Km753j253
4230h380j010J014J906l034m05O890P901L178O98o80L80M481K85j2311j1740K420
4214h407N013j6l216m446k980k481N195N059O149j746K331O55m557M188o69J599
4198A671l529k229K826K637j699m092j434q82m154j519K457P146O898J219J216
4183F532p484k518N69K555L36K668m57m53k108k395L292k042m488n265N871R686
4167D299L085j759K37l353n569r10L942n919K692J1626J1R09p111m206k040k475
4151f541N271K18M57O65J766l339p27L043m063P23j800n934Q61L276K816L64M800
4134A856k652L63k530p817q161l255M318O133M27K650M68N870N401N989r629p965
$$ plain form
4246 -9300 -13294 -12742 -10723 -9285 -11839 -10328 -5699 -3718 -10354 -9625 -2066 -350 -2376 -2374 -7127 -8380
4230 -8380 -9390 -8376 -6470 -9504 -9909 -3019 4882 8060 8758 8078 8458 12939 13224 913 -10827 -8407
4214 -8407 -3394 -3410 -6626 -11072 -14052 -16533 -11338 -6279 -130 -1876 455 1110 -3447 741 72 1671
4198 1671 -1858 -4087 -1261 1376 -323 -4415 -5849 -6731 -10885 -12404 -9947 -2801 4097 5316 6532
4183 6532 -952 -3470 -2901 -346 -10 2658 2201 1748 -360 -2755 537 -1505 -5993 -11258 -5387 4299
4167 4299 7384 5625 5862 2509 -3060 -3970 -28 -5947 -3255 8371 8382 9291 2180 -2026 -4066 -6541
4151 -6541 -1270 -1052 -595 70 1836 -1503 -2230 813 -3250 -2527 -4327 -10261 -9400 -6124 -3308 -2944 1856
4134 1856 -796 -433 -2963 -10780 -18941 -22196 -17878 -11745 -11318 -8668 -8200 -2330 3071 9060 -569 -8534
4118h534n159m61K537L235P97J726K349o075N600O799K454l43m728j555N624j847
4102B419o164n91k830O69k544L382N762N878m57j1237l037J1979q83k7o824p082
4086a1587K299P280o40N883M090q247n977K435K570j93O33M081O428k907p651
4071a503p157J775N364L344J471l355k659j791R408o613q532j378N416o62O873
4056AR116Q49k036o616m441m653l962n38J1334M731n717j128P226l51q065j774
4040f024M058M312J664O99k615l500j725O299N088k016j766n705k871O23n89n79
4024d647N89R524L963k0M363K618l114j1576q040L848j5K050J09q2J802k017l987
4007d632J169L52j406q328j253N787j276J885Q82M480p07k842l61J174j987j1265
$$ plain form
4118 -8534 -13693 -14154 -11617 -8382 -7585 -5859 -3510 -9585 -3985 2814 5268 4925 197 -1358 4266 2419
4102 2419 -3745 -4336 -7166 -6497 -9041 -5659 103 5981 5524 -5713 -8750 3229 2346 2319 -4505 -11587
4086 -11587 -9288 -2008 -2648 3235 7325 -922 -6899 -4464 -1894 -2087 -1454 2627 9055 6148 -1503
4071 -1503 -8660 -6885 -1521 1823 3294 -61 -2720 -4511 4897 -1716 -10248 -11626 -6210 -6872 1
4056 1 9117 9966 7930 1314 -3127 -7780 -11742 -12280 -946 3785 -1932 -3060 4166 3815 -4250 -6024
4040 -6024 -1966 2346 4010 4709 2094 -1406 -3131 3168 8256 6240 4474 -1231 -4102 -3479 -4068 -4647
4024 -4647 -4058 5466 9429 9409 13772 16390 13276 1700 -6340 -2492 -2507 -457 -348 -430 1372 -645 -4632
4007 -4632 -3463 -3111 -4517 -12845 -14098 -8311 -9587 -7702 -6820 -2340 -3047 -5889 -6250 -5076 -7063 -18328
3991a8328j10O21O929O173O293P394j601m100l247K770j41j1358r422M702J13
3976a3312K371M106J598j73k101l857M976j28K528M144k300j468j016L274j972
3961c330j1874J043M104O359m730L854k932j0434J286L354P081Q68M652n532n878
3946a2109O20M497J541k968o62l434j347J736J231K61Q787P02o10p075l686J814
3930a0702Q44l485M769J354L305J573J55m728O487L839o568R86p497L745M941
3915i82q80k450K577l747M05o798P80Q671L818k812j140J691o031N364j477J666
3899a345M455m570n611K53L448N152m43q066L820k536j410J672J767n97K139m678
3883f550K869k059k491K920K327j568k314l010N874L846p307k447R793J0833M744
$$ plain form
3991 -18328 -18438 -17817 -10888 -4715 1578 8972 7371 3271 24 2794 2653 -8705 -18127 -13425 -13312
3976 -13312 -10941 -6835 -5237 -5410 -7511 -11368 -6392 -6520 -3992 152 -2148 -3616 -4632 -1358 -3330
3961 -3330 -15204 -14161 -10057 -3698 -8428 -4574 -7506 -17940 -16654 -13300 -6219 -5351 -699 -6231 -12109
3946 -12109 -11489 -6992 -5451 -8419 -9081 -12515 -13862 -12126 -10895 -10634 -1847 -1145 -1755 -8830 -12516 -10702
3930 -10702 -9858 -13343 -8574 -7220 -3915 -2342 -2187 -6915 -428 3411 -3157 -2171 -9668 -5923 -982
3915 -982 -1862 -4312 -1735 -5482 -5077 -11875 -11095 -2424 1394 -1418 -2558 -867 -6898 -1534 -3011 -1345
3899 -1345 3110 -1460 -7071 -6818 -3370 1782 1339 -6727 -2907 -5443 -6853 -5181 -3414 -4011 -1872 -6550
3883 -6550 -3681 -5740 -8231 -5311 -2984 -4552 -6866 -9876 -4002 -156 -7463 -9910 -117 10716 15460
3868A5460k814l561o744k905K83M475k717n781o071k7k954k40Q740n32p34L141
3852b981o70P915M032P49k463p79P55K461k246K956k797l608l33r04L432j346
3836D173l350j899Q539L540q151k346j821o464O85P006q372n199O21O008O447
3821e83K3k949k617M377M329l264K040Q98l298R02j24l501m812n12M676j248M214
3804a449M70K181O413j496l601q192j198N225j776M15L690r6J066L963l192j327
3788A096l248L617J797l439L02K950L736o263k647J268N505K393n441k911m004
3773e289l229k777J996J117K882k049n897K585P164J090K337M460O152m89o798
3758C255k794K825N14M758n16l404l886L270N340m714j254J005m668n2N558J053
$$ plain form
3868 15460 12646 9085 2341 -564 -281 4194 1477 -4304 -10375 -10402 -13356 -13596 -4856 -5388 -6122 -2981
3852 -2981 -3651 4264 8296 9045 6582 5803 6558 9019 6773 9729 6932 3324 2991 2087 5519 4173
3836 4173 823 -1076 7463 11003 2852 506 -1315 -7779 -7094 -88 -8460 -13659 -13038 -7030 -583
3821 -583 -560 -3509 -6126 -1749 2580 -684 1356 2254 -1044 -142 -266 -3767 -8579 -9091 -4415 -5663 -1449
3804 -1449 -979 1202 7615 6119 2518 -5674 -6872 -1647 -3423 -3008 682 586 1652 5615 2423 1096
3788 1096 -2152 1465 3262 -177 125 3075 6811 548 -2099 -831 4674 7067 1626 -1285 -5289
3773 -5289 -8518 -11295 -9299 -8182 -5300 -7349 -13246 -10661 -3497 -2407 -70 4390 10542 10053 3255
3758 3255 461 3286 3800 8558 8042 4638 752 4022 9362 4648 3394 4399 -269 -321 5237 6290
3742F290q63o713K428M387k86l086k820L274O19P91L806l023p789l587L4M124
3726b414k20K252j40p929j241K956j675j301r58J168O149k240K607j299k309J141
3710e453j00K105L370M177m824J391J387M021K334l386p59p60n85m337K058J634
3694B273K636K014n582l952o388M0J648j861n74M736j5l203p92M838k66J69n381
3677i660K37k215O027Q50K990N805J652j0112n663J917N605m486k737J152M108
3662d530k372L993O825J049r411k435P385m257j980j937K697Q914m705q878j0298
3647a9940L90K463M62P993O321j264n853K55O37k373j830L493L996Q34o343m159
3631a4918R431k233p368k37O21N139J1371l118q413J324M979m390k151n486j321
$$ plain form
3742 6290 5427 -1286 1142 5529 5243 2157 -663 2611 3230 4021 7827 4804 -2985 -6572 -6538 -2414
3726 -2414 -2634 -382 -522 -8451 -9692 -6736 -8411 -9712 -10670 -9502 -3353 -5593 -2986 -4285 -6594 -5453
3710 -5453 -5553 -3448 -78 4099 -725 666 2053 6074 8408 5022 4263 3503 2918 -1419 639 2273
3694 2273 4909 6923 1341 -2611 -8999 -8959 -7311 -9172 -9746 -5010 -5025 -8228 -9020 -4182 -4448 -4279 -9660
3677 -9660 -9423 -11638 -5611 -4761 -1771 4034 5686 -4426 -10089 -8172 -2567 -7053 -9790 -8638 -4530
3662 -4530 -6902 -2909 3916 4965 -4446 -6881 504 -3753 -5733 -7670 -4973 3941 -764 -9642 -19940
3647 -19940 -19550 -17087 -16625 -8632 -2311 -3575 -9428 -9173 -8536 -10909 -12739 -9246 -5250 -4416 -10759 -14918
3631 -14918 -5487 -7720 -15088 -15325 -14704 -9565 1806 -1312 -9725 -8401 -3422 -7812 -9963 -15449 -16770
3616a6770K164L183K527L61m97R24l542n046L790O185Q648l2j921l283O30K210
3600d69m326p762K522J0505k08q724N626K989L661j411o075l56l316k988M057
3585f275O913R098J360m10p548n605l908M446M410J49P22O84m517m884k200J398
3569f167M753Q80n875l974M859J0109k18j281j722m966N426j068m356j549j4J954
3553c209l8o180J310R22N599K664P617K036m136k773J916j449n805O50m009l643
3537h528L262K504N21j379j37K109M811N860q760j0795Q62M80l071O87N032r63
3521g505j677R07K302R707J165K95n133l125m86m25J108N47O40m837m10J2482
3505E555L067K759n970p697m55M388M164K412m19j742o203j278K859l004k554
$$ plain form
3616 -16770 -14606 -11423 -8896 -8535 -9032 -8108 -11650 -16696 -12906 -6721 1927 1895 -26 -3309 -2679 -469
3600 -469 -4795 -12557 -10035 470 262 -8462 -2836 153 3814 2403 -3672 -4028 -7344 -10332 -6275
3585 -6275 638 9736 11096 10686 3138 -2467 -6375 -1929 2481 2630 3352 4036 -481 -5365 -7565 -6167
3569 -6167 -1414 -534 -6409 -10383 -5524 4585 4367 3086 1364 -3602 1824 756 -3600 -5149 -5163 -3209
3553 -3209 -3247 -9427 -8117 -7195 -1596 1068 8685 10721 6585 3812 5728 4279 -1526 -876 -4885 -8528
3537 -8528 -5266 -2762 -2241 -3620 -3757 -1648 3163 9023 263 -10532 -9670 -9190 -12261 -11574 -6542 -7505
3521 -7505 -9182 -8275 -5973 3734 4899 5194 61 -3064 -3550 -3975 -2867 -2320 -1680 -6517 -6927 5555
3505 5555 8622 11381 5411 -2286 -2741 1647 5811 8223 7804 6062 -141 -1419 1440 -1564 -4118
3490d118J842K184Q62j978m777j531L262j856m149L46m071k312L500J883P322
3475c591M020K597p186L861R44m159j618m848j207K236K696N80K685m436N182
3460b244J860p517m225Q620l046o529K077j282J578l79J23N562l20J770P707N800
3444I555J546l08k624n622p467m332m078M879L020l55n678L402N763l279j255
3429f833n128j768M924P377N308n983j112m374P85o277l883P83M173J0861K776
3414A629m276n355k828q23P787l611r280P769R674p31K866M24K60k040k268j979
3398b782k943O0J212m449M024P564P923j925q060m612p37O589N967k046j359l554
3382H72O5K681l589p583j140M457j264K707j175K20m813k885K043l227O193N650
$$ plain form
3490 -4118 -2276 -92 770 -1208 -5985 -7516 -4254 -6110 -10259 -9913 -13984 -16296 -12796 -10913 -3591
3475 -3591 429 3026 -4160 -299 645 -3514 -5132 -9980 -11187 -8951 -6255 -5675 -2990 -7426 -2244
3460 -2244 -384 -7901 -12126 -3506 -6552 -13081 -11004 -12286 -10708 -11087 -10964 -5402 -5722 -3952 3755 9555
3444 9555 11101 10793 8169 2547 -4920 -9252 -13330 -8451 -5431 -5786 -11464 -8062 -2299 -5578 -6833
3429 -6833 -11961 -13729 -8805 -1428 3880 -2103 -3215 -7589 -6804 -13081 -16964 -16181 -12008 -1147 1629
3414 1629 -2647 -8002 -10830 -11653 -3866 -7477 -16757 -8988 686 -45 2821 3245 3505 1465 -803 -2782
3398 -2782 -5725 -5665 -4453 -8902 -4878 2686 10609 8684 624 -3988 -4725 1864 7831 5785 4426 872
3382 872 937 3618 29 -7554 -8694 -4237 -5501 -2794 -3969 -3749 -8562 -11447 -9404 -12631 -6438 -788
3366g88m773K042L448L192j820k817L518K811M795p39p750l926p34r768m174O570
3350a0913R715K929m071J432j70l326P114L387n982l565l587J68q80J783L549
3335b417j732o859k519M363J601Q62l030K692L931K45m620L636J222m124p482
3320a4231L94P069O329m064k496K810J404J725O21m98K402L661k298l346m442
3305d960l654o07N971l832k529j034n92N871m067N60M026j984J323M174L009J879
3289C554m641l91k686j94K645N661j912l266J277O468k68m493N353J932j0831
3274a792n150M345N356k718j612M9L445K062n14l246J554K390j890M12N324R69
3258H984k731K99k987k553M374m507M22K47k822l971j165m988N764J253J773L465
$$ plain form
3366 -788 -5561 -3519 -71 3121 1301 -1516 2002 4813 9608 8869 1119 -2807 -3541 -13309 -17483 -10913
3350 -10913 -1198 1731 -2340 -908 -1078 -4404 2710 6097 115 -3450 -7037 -6869 -7749 -5966 -2417
3335 -2417 -4149 -11008 -13527 -9164 -7563 -6701 -9731 -7039 -3108 -2863 -7483 -3847 -2625 -6749 -14231
3320 -14231 -13837 -6768 -439 -4503 -6999 -4189 -2785 -1060 -439 -937 1465 5126 2828 -518 -4960
3305 -4960 -8614 -9221 -3250 -7082 -9611 -10645 -11237 -5366 -9433 -8873 -4847 -6831 -5508 -1334 1675 3554
3289 3554 -1087 -1478 -4164 -4358 -1713 3948 2036 -1230 47 6515 6247 1754 7107 9039 -1792
3274 -1792 -6942 -2597 2759 41 -1571 -1522 1923 3985 3471 225 1779 4169 2279 2691 8015 8984
3258 8984 6253 6552 3565 1012 5386 879 1301 1548 -1274 -5245 -6410 -11398 -5634 -4381 -2608 857
3242H57m549M781K867m196j137L58n225K54M528J492P062Q21n88l730Q40l581
3226H54l7N026J911m141k504K974M039J163J505l407o460J027j465l732o375j982
3210a1604j942K724O359j077N1K318j528l493K082k45m78K948K227o96K638k534
3194b250o721O786K915R3O503J497o941k138J78j92j968n362J577L219J877L490
3178B563J158l481j375m977k061L144L242P243m332k245n55J122Q778j204j826
3163E194L520J25k623o666o603k628j904J525L595O68k862L231k646m24J753L615
3147c130j189K815J819j180l449k528k266n238J268M446K693Q50J472K213J654
3132B50j059L776L451Q03k710J518N42m122q340j0361n085O017J378j230L538
$$ plain form
3242 857 -3692 1089 3956 -240 -1377 -1019 -6244 -5990 -1462 30 7092 7913 7325 3595 4435 854
3226 854 817 5843 7754 3613 1109 4083 8122 9285 10790 7383 923 1950 485 -3247 -9622 -11604
3210 -11604 -13546 -10822 -4463 -5540 -5489 -3171 -4699 -8192 -6110 -6355 -6833 -3885 -1658 -2354 284 -2250
3194 -2250 -8971 -2185 730 823 7326 8823 1882 -256 -78 -270 -2238 -7600 -6023 -2804 -927 2563
3178 2563 3721 240 -1135 -6112 -8173 -5029 -1787 5456 1124 -1121 -1676 -554 8224 7020 5194
3163 5194 8714 8839 6216 -450 -7053 -9681 -11585 -10060 -6465 -5797 -8659 -5428 -8074 -8498 -6745 -3130
3147 -3130 -4319 -1504 315 -865 -4314 -6842 -9108 -14346 -13078 -8632 -5939 -5089 -3617 -1404 250
3132 250 -809 2967 6418 7221 4511 6029 6571 2449 -5891 -16252 -21337 -15320 -13942 -15172 -11634
3117a1634J4647M836J936j208k898L024k921K135j058o372l451K966j435k573
3103d006l714M998L01M917k390o66N955M107l461j818M72r57q40J3J751l96O50
3086D916m73m924k025P927M736k650l406m883m927k291k001J168M979J240k60
3071b874N1L027j59k518m316M471R26K07j381n155L016N647p095L89K762p126
3055a0128J662M876L011m010O08r09L8j124l626M458P304k300J14k394m024l442
3039i886K813j423L924N837j625o31p42M226m929K582k287k084N566M205L61J479
3023G386k864m911K273L185q205m611O080k504R43j86J160J487J951N90j641K053
3007B186J594j811K465L716J475r120m205M564N75m695l070L447J001P205p125
$$ plain form
3117 -11634 3013 7849 9785 8577 5679 8703 5782 7917 6859 487 -2964 2 -1433 -4006
3103 -4006 -7720 -2722 -2421 2496 106 -560 5395 9502 6041 4223 4695 3738 2898 2911 4662 4266 4916
3086 4916 4443 -481 -2506 5421 10157 7507 4101 -782 -5709 -8000 -10001 -8833 -3854 -2614 -2874
3071 -2874 -2823 204 45 -2473 -6789 -2318 -1392 -1185 -2566 -7721 -4705 942 -6153 -5764 -3002 -10128
3055 -10128 -8466 -3590 -579 -4589 -3981 -4890 -4852 -5976 -9602 -5144 2160 -140 -26 -2420 -6444 -9886
3039 -9886 -7073 -8496 -4572 1265 -360 -991 -1733 2493 -2436 146 -2141 -4225 1341 5546 5907 7386
3023 7386 4522 -389 1884 5069 -3136 -7747 -1667 -4171 -3228 -3414 -2254 -767 1184 1774 133 2186
3007 2186 3780 1969 4434 8150 9625 505 -3700 864 1439 -3256 -6326 -2879 -1878 5327 -1798
2992a798k919J149P843K473R66R7m363K037k168l068m267j680o00R43o74J73p209
2975a3065M2P618P01k679j611O518J991K105n41q709m387M478L890O205M189m728
2959B017p246k219p05M87l563l70P45L192k242N951J73M509M497j987n5q850l584
2942i250N545Q39K160j265o05O00M052l374q364m895L442q05m582M392K536l278
2926a2852J481K518L05J618M941o09j491j52M719P20j343K792P296m956o571o705
2910h289K490M286K512J836m140L40l15K16m402l106j395N77M452J500L670j770
2894a538l465j339k025j142M772M683O49J8k003K560m340K151j194j465k682K661
2878c699L090k169L066O201p061j181k567k815J136j043R231L284o63r02m11l635
$$ plain form
2992 -1798 -4717 -3568 4275 6748 7714 7811 3448 5485 3317 249 -4018 -5698 -6298 -5355 -6029 -5856 -13065
2975 -13065 -13023 -5405 -4704 -7383 -8994 -2476 -485 1620 1079 -7630 -12017 -7539 -3649 2556 6745 2017
2959 2017 -5229 -7448 -8153 -7666 -11229 -11599 -10854 -7662 -9904 -3953 -3780 729 5226 3239 3184 -5666 -9250
2942 -9250 -3705 -2866 -706 -1971 -2576 -1976 2076 -1298 -9662 -14557 -11115 -11920 -16502 -12110 -9574 -12852
2926 -12852 -11371 -8853 -8548 -6930 -1989 -2598 -4089 -4241 478 1198 -145 2647 9943 4987 -1584 -8289
2910 -8289 -5799 -1513 999 2835 -1305 -965 -1280 -1064 -5466 -8572 -9967 -9390 -4938 -3438 232 -1538
2894 -1538 -5003 -6342 -8367 -9509 -4737 -54 595 613 -1390 1170 -3170 -1019 -2213 -3678 -6360 -3699
2878 -3699 -609 -2778 288 6489 -572 -1753 -4320 -7135 -5999 -7042 2189 5473 4810 3908 3497 -138
2862a38m681l252J033K666k354q10K774M938k333Q89p934m349J0206l783R1M811
2846b226n085j249J809P009O324k647k083k04J795k824m842O13L539J1288o177
2831E040j899Q36Qj2p550N17N7K287K868k609j344K580k08J985m7J875Q20L748
2813H952l254l520m069O27l430J427l311m536O068L288q25j845K532K81j384K290
2797g09o3m062m659R81K401L323o73M524q492l972N434J412j384J283r80m051
2781i687k518Q12l402Q08N351n192o748j240k670L835L789L881Q058J463m287
2766g747l173l9M68M65o154N381Q912N868k042p899l303m652K811L622N148N06
2750a828N999r75p147l381J071k238K012O731K871O094J212o242K537l64j51l721
$$ plain form
2862 -138 -4819 -8071 -7038 -4372 -6726 -7536 -4762 176 -2157 -1268 -9202 -13551 -3345 -7128 -7037 -2226
2846 -2226 -7311 -8560 -6751 258 6582 3935 1852 1648 3443 619 -4223 -3610 -71 11217 5040
2831 5040 3141 3977 3985 3973 -3577 -3060 -3003 -716 2152 -457 -1801 779 571 2556 2509 4384 5204 8952
2813 8952 5698 2178 -1891 -1264 -4694 -3267 -6578 -11114 -5046 -1758 -2583 -4428 -1896 -1615 -2999 -709
2797 -709 -772 -4834 -9493 -8512 -6111 -2788 -3461 1063 -7429 -11401 -5967 -4555 -5939 -4656 -5636 -9687
2781 -9687 -12205 -11393 -14795 -13987 -8636 -13828 -20576 -21816 -24486 -20651 -16862 -12981 -4923 -3460 -7747
2766 -7747 -10920 -10959 -10491 -10026 -16180 -10799 -1887 3981 1939 -5960 -9263 -13915 -11104 -7482 -2334 -1828
2750 -1828 4171 3196 -3951 -7332 -6261 -8499 -6487 244 3115 9209 10421 4179 6716 6352 6201 2480
2734B480k266K188K752k004l279j274N30r29P47K924n67l60N487m900j654Qo31
2717g48L077l87K209m398m476J786mj0792q79P522L137l324J42N34l014n036p24
2700a5375L120L524M139Q725N816k169n636j774j086N936K643q45n637o68P561
2685H274Q77n140j532j868J12n779M227P476M72O24m557K500L443P033j86m861
2669A1115k877l959k778r376l642P901o142m527L472M473J544q92l710n38K605
2654g331R064M165o9k394l711P78J786p465O517N626m293j185Q87n24J1J535l178
2637B19m082j0052k286P752M536O139R412j2698j3560Q79K304k572Q44J986J38
2622a1041M355N579L244p90l347K150l108n681M410P094M636j327k83l707J907
$$ plain form
2734 2480 214 2402 5154 3150 -129 -1403 -873 -1802 -1055 1869 1302 942 6429 1529 -125 -117 -748
2717 -748 2329 1942 4151 -247 -4723 -2937 -2941 -13733 -14612 -7090 -3953 -7277 -7135 -6601 -9615 -14651 -15375
2700 -15375 -12255 -8731 -4592 4133 9949 7780 2144 370 -716 5220 7863 7018 1381 713 8274
2685 8274 9151 4011 2479 611 723 -5056 -829 6647 7119 7743 3186 5686 9129 16162 15976 11115
2669 11115 8238 4279 1501 -7875 -11517 -3616 -9758 -14285 -10813 -6340 -4796 -5688 -9398 -9936 -7331
2654 -7331 1733 5898 5829 3435 -276 502 2288 -5177 1340 6966 2673 1488 2375 1851 1862 3397 219
2637 219 -3863 -13915 -16201 -8449 -3913 2226 11638 -1060 -14620 -13741 -11437 -14009 -13165 -11179 -11041
2622 -11041 -6686 -1107 2137 1347 -2000 150 -2958 -8639 -4229 2865 7501 6174 5891 2184 4091
2607D091p7k849l24m428M583J336r68m036p457J000Q792P230p569l738N448p91
2591B43L70N784L605n292k348m425k253m025j335P613q50M173N087J309q22j150
2575E684m103K860n14l270J975O187j953m405k01m722m880o855l364o73L312L243
2559a1679N176j205l085k686O85k128N716R898p15q007K766M280J54k241M041
2544I70j805m445K614J396j565j155O011N896q59k63n740N7M390l329l926N7K943
2527A247k144L989j917j0588M0L096Q824L970N80k21n36n14j387M121j791k665
2511D104k07K152k411R66q70q804m273R576M359L965n441j1119j352m123J754
2496a1724R77k179k415p055J561J0499K925J905N165J279q57L514Q623j709p34
$$ plain form
2607 4091 4014 1165 841 -3587 996 2332 1364 -2672 -10129 -9129 -337 6893 -676 -4414 1034 243
2591 243 613 6397 10002 4710 2362 -2063 -4316 -8341 -9676 -2063 -2913 1260 6347 7656 6834 5684
2575 5684 1581 4441 3927 657 2632 8819 6866 2461 2260 -2462 -7342 -14197 -17561 -18234 -14922 -11679
2559 -11679 -6503 -7708 -10793 -13479 -12794 -14922 -9206 692 -23 -8030 -5264 -984 -830 -3071 970
2544 970 -835 -5280 -2666 -1270 -2835 -3990 2021 7917 7058 6795 1055 1112 5502 2173 -1753 -1696 1247
2527 1247 -897 3092 1175 -9413 -9373 -6277 2547 6517 7097 6876 6340 5826 4439 8560 6769 4104
2511 4104 3897 6049 3638 4604 3734 -5070 -9343 233 4592 8557 3116 -8003 -9355 -13478 -11724
2496 -11724 -10747 -12926 -15341 -22396 -20835 -10336 -7411 -5506 -341 938 81 3595 12218 10509 9775
2481I775k413m436q73K840L480J371K751n176o041J552k221l676K30M568j73j014
2465E44o253m450j985l938K267J0447l087J083K989K618P254n80j822J212q13
2450E486q309j639O812j888Q39O113M132m122o170k025k784q34l963m799J750
2435a1401K509K685N886j44p119k389L442l609j527N143O186M704k753n348L618
2420a17n566q54O453K236k087o07l671o868N429L248l939j532j397M799N457q178
2404g194m861L285K575R93N078J071l33K658n58l445N23J045m616l464J222L415
2388b606N906j1720O632K974J411J376k354n404N452n378L146K031M387j571m086
2373A96p764m779K980M680M829j267L082M751k131n037K973j693n13k345Q147
$$ plain form
2481 9775 7362 2926 2053 4893 8373 9744 12495 7319 1278 2830 609 -3067 -2837 1731 1558 544
2465 544 -5709 -10159 -12144 -16082 -13815 -3368 -6455 -5372 -2383 235 7489 6909 5087 6299 5486
2450 5486 -2823 -4462 2350 462 1301 7414 11546 7424 1254 -771 -3555 -4389 -8352 -13151 -11401
2435 -11401 -8892 -6207 -321 -465 -7584 -9973 -6531 -10140 -11667 -6524 -338 4366 1613 -3735 -117
2420 -117 -5683 -6537 -84 2152 65 -542 -4213 -11081 -5652 -2404 -6343 -7875 -9272 -4473 984 -7194
2404 -7194 -12055 -8770 -6195 -5202 -124 947 614 3272 2714 -731 -208 837 -3779 -7243 -6021 -2606
2388 -2606 3300 -8420 -1788 1186 2597 3973 1619 -3785 1667 -3711 -565 1466 5853 4282 196
2373 196 -7568 -12347 -9367 -4687 142 -1125 1957 6708 4577 -460 2513 820 307 -2038 6109
2358F109M308p099l842j416m79k126Q02M188L260O641J364l554j865o674r80Q71
2342d92j389l537Q76k058N774O35N029P38L711k652m880K373p463n778O453R973
2326G313k495o841j965O175L277j71J411K882m025p36k276J403K501n068j70P614
2310H829m656m792J269Q31j464M038L11n378L548M367K448l315J167l226q671
2295d694L123P800l483K051k579o632m340l127j006j141K789Q558n978j1297J514
2280a8442O116M753J219l067k088O50n588R33N62j574P247Q669M777m103n054
2265d990m02j343L413O431l696p617r57L772J813j244L430J687j26M220n700K730
2249A421N154l42j28q825n832M051N550j59p90k410m830p59O175K165K231K368
$$ plain form
2358 6109 10417 3318 -524 -1940 -2419 -4545 -3743 445 3705 10346 11710 8156 6291 -383 -1363 -492
2342 -492 -1881 -5418 -4542 -6600 -826 -191 4838 5576 9287 6635 1755 4128 -3335 -9113 -2660 7313
2326 7313 4818 -2023 -3988 2187 5464 5293 6704 9586 5561 4825 2549 3952 6453 1385 1215 8829
2310 8829 4173 -619 650 1481 17 4055 4366 -1012 2536 6903 9351 6036 7203 3977 -4694
2295 -4694 -1571 6229 2746 4797 2218 -4414 -8754 -11881 -12887 -14028 -11239 -2681 -8659 -19956 -18442
2280 -18442 -12326 -7573 -6354 -9421 -11509 -10859 -16447 -15514 -14952 -16526 -9279 -610 4167 64 -4990
2265 -4990 -5392 -6735 -3322 3109 -587 -8204 -9161 -5389 -3576 -4820 -1390 297 171 4391 -1309 1421
2249 1421 6575 6233 6105 -2720 -8552 -4501 1049 890 100 -2310 -7140 -7899 -1724 441 2672 5040
2233E040p270J379J255m301q37J747K693K00m660n701L051M779J0574q84O54k970
2217D749j595j286m279j534N644K504q815j742K465J787L013r38l449l450l158
2202a0084N398R032K771j287m657j402J180K659j560m469P76k683k642K207k563
2187g324Q20K266N680j352q376M117K992J987k260K339M385k424J563J026j333
2172D106J041k076K307K025p986o300J274k841K542M411M644m72m604l082N451
2157D40Q426M695J332m989l365L091l681q248L935P859m253n244J654k967L468
2142B153m347o881N64Q059K207J316m065P821R53j1426l037K586L205o208p199
2127a4299L202J062n42N485R620L904j638r098p732M528l0M838l692p58q387n057
$$ plain form
2233 5040 -2230 -851 404 -3897 -4734 -2987 -294 -94 -4754 -10455 -7404 -2625 7949 7065 7719 4749
2217 4749 3154 1868 -2411 -3945 1699 4203 -4612 -6354 -3889 -2102 911 -27 -3476 -6926 -10084
2202 -10084 -4686 4346 7117 5830 1173 -229 951 3610 2050 -2419 -1643 -4326 -6968 -4761 -7324
2187 -7324 -6504 -4238 1442 90 -8286 -4169 -1177 810 -1450 889 5274 2850 4413 5439 4106
2172 4106 5147 3071 5378 7403 -583 -6883 -5609 -8450 -5908 -1497 3147 2675 -1929 -5011 440
2157 440 8866 13561 14893 9904 6539 9630 5949 -2299 1636 9495 5242 -2 1652 -1315 2153
2142 2153 -2194 -9075 -8511 -452 1755 3071 -994 6827 7780 -3646 -6683 -4097 -892 -7100 -14299
2127 -14299 -11097 -10035 -10577 -5092 4528 8432 6794 -2304 -10036 -5508 -5538 -700 -4392 -5150 -13537 -18594
2111a8594L958N599J337l524p306J51M559l088M681M444l021L328P840M137M766
2096I267m880o305O17l856l81N396K869m575m932r07J797J967J200m009P733L590
2080D591k956K056o70k299l879k359J753L220L466J904k49L312j640P50J679J081
2064I760l139n272j111K652p54J660M39K727k450L30o830m653n93K18L740o137
2048i413N578R046K283J731J314l161J255m638n293K740k274j116J163k90K177
2033A102K959j742n376m379j57O681m320j630N474N874j666l346p715m57O545
2018b153M946O17J260j247P970P99l211n552n614m156N218m289j031l07O548l570
2002c772k407L951M107O98K880k796k125l049N54O450r09J490n665m520j313K048
$$ plain form
2111 -18594 -14636 -9037 -7700 -11224 -18530 -18379 -13820 -16908 -12227 -7783 -10804 -7476 364 4501 9267
2096 9267 4387 -1918 -1301 -5157 -5538 -142 2727 -1848 -6780 -7687 -5890 -3923 -2723 -6732 1001 4591
2080 4591 1635 3691 3021 722 -3157 -5516 -3763 -543 2923 4827 4578 7890 6250 7000 8679 9760
2064 9760 6621 1349 238 2890 2136 3796 4235 6962 4512 4842 -1988 -6641 -7234 -7016 -3276 -9413
2048 -9413 -3835 5211 7494 9225 10539 7378 8633 3995 -1298 1442 -832 -1948 -785 -1075 1102
2033 1102 4061 2319 -3057 -7436 -7593 -912 -5232 -6862 -1388 4486 2820 -526 -8241 -8698 -2153
2018 -2153 2793 3410 4670 3423 11393 12192 8981 3429 -2185 -6341 -1123 -5412 -6443 -6750 -202 -3772
2002 -3772 -6179 -2228 1879 2577 5457 2661 536 -2513 -1959 4491 3582 5072 -593 -5113 -6426 -4378
1986d378Q913j731K64l478k084l714r10M703O502L160l615k46l202M69K477J966
1970E096J606J278r03l61o729q54L364M736n734n074l593P451L793l499k650N33
1954a540l107N899o711l780N941K224k352Q07K425J535p631l650P633R891r35
1939F649o009P653K515q131k777J763l4k307l491P730P259j213k581j42n176k823
1923a115M221N270K900o099q972M903J55m716k539K800R68l112k890N39K255J1
$$ plain form
1986 -4378 4535 2804 3068 -410 -2494 -6208 -7118 -2415 4087 7247 3632 3386 184 653 3130 5096
1970 5096 6702 7980 7077 6716 -13 -867 2497 7233 1499 -3575 -7168 283 4076 577 -2073 -1540
1954 -1540 -4647 1252 -5459 -9239 -3298 -1074 -3426 -2619 -194 1341 -6290 -9940 -2307 7584 6649
1939 6649 640 8293 10808 2677 -100 1663 1629 -678 -4169 3561 10820 9607 7026 6884 1708 -1115
1923 -1115 3106 8376 11276 5177 -3795 1108 1263 -3453 -5992 -3192 -2224 -5336 -8226 -7687 -5432 -5421
$$ [...]
##END NTUPLES=NMR SPECTRUM
##END=
