##TITLE=Analysis number 314297
Compound Code cc 31023
Book Reference 397/63/1
Project Code qc-cat
Chemist Name brucer
##JCAMPDX= 6.0         $$ Bruker NMR JCAMP-DX V2.0
##DATA TYPE= NMR SPECTRUM
##DATA CLASS= NTUPLES
##ORIGIN= Bruker BioSpin GmbH
##OWNER= NMR
$$ XWIN-NMR		Version 3.5
$$ Wed Oct 12 16:34:31 2005 GMT Daylight Time (UT+1h)  MAYBRIDGE\NMR@NMR_250MHZ
##.OBSERVE FREQUENCY= 250.131544655141
##.OBSERVE NUCLEUS= ^1H
##.ACQUISITION MODE= SIMULTANEOUS (DQD)
##.ACQUISITION SCHEME= undefined
##.AVERAGES= 16
##.DIGITISER RES= 18
##SPECTROMETER/DATA SYSTEM= dpx250
##.PULSE SEQUENCE= zg30
##.SOLVENT NAME= CDCl3
##.SHIFT REFERENCE= (INTERNAL, CDCl3, 0, 16.522)
##AUDIT TRAIL= $$ (NUMBER, WHEN, WHO, WHERE, WHAT)
$$ ##TITLE= Audit trail, XWIN-NMR		Version 3.5
$$ ##JCAMPDX= 5.01
$$ ##ORIGIN= Bruker BioSpin GmbH
$$ ##OWNER= NMR
$$ C:\u/data/dgb/nmr/ADRS/10760/pdata/1/auditp.txt
$$ ##AUDIT TRAIL=  $$ (NUMBER, WHEN, WHO, WHERE, WHAT)
(   1,<2005-10-12 16:34:11.80 +100>,<MAYBRIDGE\NMR>,<NMR_250MHZ>,
      <created by zg, POWCHK disabled, PULCHK disabled
       configuration hash MD5:
       62 19 C7 07 E1 42 D1 B7 37 6C 3D D0 77 39 F9 E6
       data hash MD5: 64K
       27 DC 8C 93 09 F2 EA 6D 58 59 E2 94 88 D3 E3 2B>)
(   2,<2005-10-12 16:34:24.69 +100>,<MAYBRIDGE\NMR>,<NMR_250MHZ>,
      <Start of raw data processing
       ef LB = 0.3 FT_mod = 6 PKNL = 1 SI = 32K 
       data hash MD5: 32K
       83 EE 02 B3 47 F0 29 3B 68 8B 17 C7 5E FD 5C 9A>)
(   3,<2005-10-12 16:34:26.53 +100>,<MAYBRIDGE\NMR>,<NMR_250MHZ>,
      <apk 
       data hash MD5: 32K
       B1 7F 53 38 B6 A6 B4 29 E2 D9 CA 32 6B 01 70 6B>)
(   4,<2005-10-12 16:34:27.19 +100>,<MAYBRIDGE\NMR>,<NMR_250MHZ>,
      <abs ABSG = 5 
       data hash MD5: 32K
       EA 7E C9 15 A5 26 4C B2 88 85 A4 35 E3 74 3B F2>)
$$ ##END=
$$ 
$$ hash MD5
$$ 89 AA 49 18 0B 69 D2 73 4A 24 F4 74 58 97 34 40
##$RELAX= 
##$RELAX= 
##$RELAX= 
##$RELAX= 
##$RELAX= 
##$RELAX= 
##$RELAX= 
$$ Bruker specific parameters
$$ --------------------------
##$DU= <C:\u>
##$EXPNO= 10760
##$NAME= <ADRS>
##$PROCNO= 1
##$TYPE= <nmr>
##$USER= <dgb>
##$AMP= (0..31)
100 100 100 100 100 100 100 100 100 100 100 100 100 100 100 100 100 100 
100 100 100 100 100 100 100 100 100 100 100 100 100 100 
##$AQSEQ= 0
##$AQ_mod= 3
##$AUNM= <au_zg>
##$AUTOPOS= <43 >
##$BF1= 250.13
##$BF2= 250.13
##$BF3= 250.13
##$BF4= 250.13
##$BF5= 500.13
##$BF6= 500.13
##$BF7= 500.13
##$BF8= 500.13
##$BYTORDA= 1
##$CFDGTYP= 0
##$CFRGTYP= 5
##$CHEMSTR= <none>
##$CNST= (0..31)
1 1 145 1 1 1 1 1 1 1 1 1 1 1 1 1 1 1 1 1 1 1 1 1 1 1 1 1 1 1 1 1 
##$CPDPRG= <>
##$CPDPRG1= <>
##$CPDPRG2= <>
##$CPDPRG3= <>
##$CPDPRG4= <mlev>
##$CPDPRG5= <mlev>
##$CPDPRG6= <mlev>
##$CPDPRG7= <mlev>
##$CPDPRG8= <mlev>
##$CPDPRGB= <>
##$CPDPRGT= <>
##$D= (0..31)
0 1 0 0 0 0 0 0 0 0.06 0 0 0 0 0 0 0.0002 0 0 0 0 0 0 0 0 0 0 0 0 0 0 
0 
##$DATE= 1129131250
##$DBL= (0..7)
120 120 120 120 120 120 120 120 
##$DBP= (0..7)
150 150 150 150 150 150 150 150 
##$DBP07= 0
##$DBPNAM0= <>
##$DBPNAM1= <>
$$ [...]
##$SUBNAM7= <"">
##$SUBNAM8= <"">
##$SUBNAM9= <"">
##$SW= 20.6930455092707
##$SWIBOX= (0..15)
0 0 3 0 0 0 0 0 0 0 0 0 0 0 0 0 
##$SW_h= 5175.983436853
##$TD= 65536
##$TD0= 1
##$TE= 295.16
##$TE2= 300
##$TE3= 300
##$TEG= 300
##$TL= (0..7)
0 120 120 120 120 120 120 120 
##$TP= (0..7)
150 150 150 150 150 150 150 150 
##$TP07= 0
##$TPNAME0= <>
##$TPNAME1= <>
##$TPNAME2= <>
##$TPNAME3= <>
##$TPNAME4= <>
##$TPNAME5= <>
##$TPNAME6= <>
##$TPNAME7= <>
##$TPOAL= (0..7)
0.5 0.5 0.5 0.5 0.5 0.5 0.5 0.5 
##$TPOFFS= (0..7)
0 0 0 0 0 0 0 0 
##$TUNHIN= 0
##$TUNHOUT= 0
##$TUNXOUT= 0
##$USERA1= <user>
##$USERA2= <user>
##$USERA3= <user>
##$USERA4= <user>
##$USERA5= <user>
##$V9= 5
##$VALIST= <valist>
##$VCLIST= <CCCCCCCCCCCCCCC>
##$VD= 0
##$VDLIST= <DDDDDDDDDDDDDDD>
##$VPLIST= <PPPPPPPPPPPPPPP>
##$VTLIST= <TTTTTTTTTTTTTTT>
##$WBST= 1024
##$WBSW= 4
##$XGAIN= (0..3)
0 0 0 0 
##$XL= 0
##$YL= 0
##$YMAX_a= 543409
##$YMIN_a= -888845
##$ZGOPTNS= <>
##$ZL1= 120
##$ZL2= 120
##$ZL3= 120
##$ZL4= 120
##$ABSF1= 16.522
##$ABSF2= -4.171173
##$ABSG= 5
##$ABSL= 3
##$ALPHA= 0
##$AQORDER= 0
##$ASSFAC= 0
##$ASSFACI= 0
##$ASSFACX= 0
##$ASSWID= 0
##$AUNMP= <proc_1d>
##$AZFE= 0.1
##$AZFW= 0.1
##$BCFW= 0
##$BC_mod= 0
##$BYTORDP= 0
##$COROFFS= 0
##$CY= 12.5
##$DATMOD= 1
##$DC= 0
##$DFILT= <>
##$DTYPP= 0
##$F1P= 14.0000005364418
##$F2P= -0.99999901652339
##$FCOR= 0.5
##$FTSIZE= 32768
##$FT_mod= 6
##$GAMMA= 0
##$GB= 0
##$INTBC= 1
##$INTSCL= 1
##$ISEN= 128
##$LB= 0.3
##$LEV0= 0
##$LPBIN= 0
##$MAXI= 10000
##$MC2= 0
##$MEAN= 0
##$ME_mod= 0
##$MI= 0
##$NCOEF= 0
##$NC_proc= -2
##$NLEV= 6
##$NOISF1= 0
##$NOISF2= 0
##$NSP= 0
##$NTH_PI= 0
##$NZP= 0
##$OFFSET= 16.522
##$PC= 1
##$PHC0= -66.58252
##$PHC1= 2.064612
##$PH_mod= 1
##$PKNL= yes
##$PPARMOD= 0
##$PSCAL= 4
##$PSIGN= 0
##$REVERSE= no
##$SF= 250.13
##$SI= 32768
##$SIGF1= 0
##$SIGF2= 0
##$SINO= 400
##$SIOLD= 32768
##$SREGLST= <1H.CDCl3>
##$SSB= 0
##$STSI= 32768
##$STSR= 0
##$SW_p= 5175.98343685301
##$SYMM= 0
##$S_DEV= 0
##$TDeff= 65536
##$TDoff= 0
##$TI= <Analysis number 999999
Compound Code 99
Book Reference 9
Project Code 9>
##$TILT= no
##$TM1= 0
##$TM2= 0
##$TOPLEV= 0
##$USERP1= <user>
##$USERP2= <user>
##$USERP3= <user>
##$USERP4= <user>
##$USERP5= <user>
##$WDW= 1
##$XDIM= 32768
##$YMAX_p= 396715021
##$YMIN_p= -37163
$$ End of Bruker specific parameters
$$ ---------------------------------
##NTUPLES= NMR SPECTRUM
##VAR_NAME=  FREQUENCY,     SPECTRUM/REAL,   SPECTRUM/IMAG
##SYMBOL=    X,             R,               I
##VAR_TYPE=  INDEPENDENT,   DEPENDENT,       DEPENDENT
##VAR_FORM=  AFFN,          ASDF,            ASDF
##VAR_DIM=   32768,         32768,           32768
##UNITS=     HZ,            ARBITRARY UNITS, ARBITRARY UNITS
##FACTOR=    0.157963299565203, 1,           1
##FIRST=     4132.6476996994, 0,             0
##LAST=      -1043.33573715361, 0,           0
##MIN=       -1043.33573715361, -37163,      0
##MAX=       4132.6476996994, 396715021,     0
$$ Real data points
##PAGE= N=1
##DATA TABLE= (X++(R..R)), XYDATA
$$ [...]
14878e984R16l14m084J784N997L655n290k244M735k143n169o248J53M549M71K536
14862f680M54N286O815J120o257m140k125k106m669L70L421N007J631J288L902
14847C317k89j418q30j065J724k659M978O385j53l663j58n502k664K299r09q41
14831a448N583K397k262o916Q2Q061Q991l868k273k130n027l527j258r45l58j831
14815f729j565M479l352l24L745K317l607k465K099L119L28n846K813L322o21
14800b287P2r20l568r10M682j549K606O864k820q676m615K377J693k678l54n152
14784a5235o912L710J3400m94Q0k166r134m802M740M499K903P288M409M326P887
14769A4499k498n232J619l69p539l104l771M34J675M255P136J616m47l497p17
$$ plain form
14878 -5984 -5068 -5382 -9466 -7682 -1685 1970 -3320 -5564 -829 -2972 -8141 -14389 -14236 -9687 -9216 -6680
14862 -6680 -6226 -940 5875 6995 738 -3402 -5527 -7633 -12302 -11932 -8511 -3504 -1873 -585 3317
14847 3317 3028 1610 780 -285 1439 -1220 3758 10143 9990 6327 6169 667 -1997 302 -607 -1448
14831 -1448 4135 6532 4270 -2646 -2564 5497 14488 10620 8347 6217 1190 -2337 -3595 -4540 -4898 -6729
14815 -6729 -8294 -3815 -7167 -7491 -3746 -1429 -5036 -7501 -5402 -2283 -1955 -7801 -4988 -1666 -2287
14800 -2287 -2215 -3135 -6703 -7613 -2931 -4480 -1874 4990 2170 -6506 -11121 -8744 -7051 -9729 -10083 -15235
14784 -15235 -22147 -18437 -5037 -5531 -5451 -7617 -16751 -21553 -16813 -12314 -9411 -2123 2286 6612 14499
14769 14499 12001 6769 8388 8019 480 -2624 -6395 -5961 -4286 -31 7105 8721 8274 4777 4060
14754D060M630o02l067j049o361k899K107K883L338l11l506p519n240K161J962
14739i413j530P289M978m623o35o888j290l83L912M833j354j0833q99R011J681
14724f144k15L482n110k229K429M549L460l893j292L375M436K492l196k775J265
14709F34N586M590j620j309k479q774j572O125j767q512J520k577p85M057J15
14694f768n764M086LM88n49K898L491l860p07M40K166J930n48L26M798k873P5
14677c68L143j754k117r335K577M775L872l404M85r39k207n340O306O745m996
14662b557p193J451j427J500l446m914K768P339O940l990l667J138L020m146m673
14647a1857M461N1q5P455o06o338J838K18M372N465K015L91K374K397o000q132
$$ plain form
14754 4060 8690 8088 5021 3972 -2389 -5288 -3181 -298 3040 2729 -777 -8296 -13536 -11375 -9413
14739 -9413 -10943 -3654 1324 -3299 -3934 -10822 -12112 -12495 -8583 -3750 -5104 -15937 -16836 -7825 -6144
14724 -6144 -6359 -2877 -7987 -10216 -7787 -3238 222 -3671 -4963 -1588 2848 5340 2144 -631 634
14709 634 6220 10810 9190 7881 5402 -3372 -4944 1181 -586 -9098 -7578 -10155 -10940 -6883 -6768
14694 -6768 -12532 -8446 -8443 -7955 -8504 -5606 -2115 -5975 -6682 -6242 -4076 -2146 -2694 -2368 2430 -443 -368
14677 -368 2775 1021 -1096 -10431 -7854 -3079 793 -2611 -2126 -3065 -5272 -10612 -4306 2439 -2557
14662 -2557 -9750 -8299 -9726 -8226 -11672 -16586 -13818 -6479 461 -3529 -7196 -6058 -3038 -7184 -11857
14647 -11857 -7396 -7345 -7430 25 -581 -6919 -5081 -4863 -491 4974 6989 7380 9754 12151 6151 -1981
14631a981m813K187j221J143Q973K225m579n035j347l111K546m849j211J325J372
14616h376r2J624j753K648M064j135n451M304Q21q009k281K337L938j942K973
14601f330K522r491j2114j018M545M480l659k690M225O469n330l237O878J4944
14587A94K827k263n840m525O499K477l581k263M712K663K25n869P21K670m439
14572e792N48q70p260n76j24N680J637K406J67o124J703M635k275J978N888k012
14556c91O60J245l41k620j618K689l82K050J286l285m236q148K639k194l916L162
14540a3400P434L989K18J465L174j1416k741J700n03K403n764l759O917K666l677
14525a1294j211J85j04R29K950O07n885j628K058R257N836L980j087q640p581
$$ plain form
14631 -1981 -6794 -4607 -5828 -4685 4288 6513 1934 -3101 -4448 -7559 -5013 -9862 -11073 -9748 -8376
14616 -8376 -8468 -6844 -8597 -5949 -1885 -3020 -8471 -4167 -3346 -11355 -13636 -11299 -7361 -9303 -6330
14601 -6330 -3808 -13299 -25413 -26431 -21886 -17406 -21065 -23755 -19530 -13061 -18391 -21628 -14750 194
14587 194 3021 758 -5082 -9607 -3108 -631 -4212 -6475 -1763 900 1125 -4744 -4023 -1353 -5792
14572 -5792 -5244 -6114 -13374 -13950 -14074 -8394 -6757 -4351 -4184 -10308 -8605 -3970 -6245 -4267 1621 -391
14556 -391 269 1514 1173 -1447 -3065 -376 -758 1292 2578 -707 -4943 -13091 -10452 -12646 -16562 -13400
14540 -13400 -5966 -1977 -1759 -294 2880 -8536 -11277 -9577 -10080 -7677 -13441 -17200 -10283 -7617 -11294
14525 -11294 -12505 -12320 -12424 -11495 -8545 -7938 -13823 -15451 -13393 -4136 1700 5680 4593 -4047 -11628
14510a1628K266P363k67l216o813k857P442P775m225j697m84j153J955K672J658
14495a209J730k750r449J40R806M341m14j839m978n049L372k931j1890P675L863
14480i582M806L421K697l399K459k178p283m913L448O625L132J277q77P392j19
14465F906l763K662j745o718j0024p47L460R58L057n67M070j270J010J181l557
14450e087k569N013N840M139L117J663n146q895j919M780M134n487m505j095k240
14435h257K93k301J521O286m11l803p193o432M308O100O509K684n66N11m162J679
14419c234P59M608r085k594Q809K822l835O23L924O667n109o430q91m409o941
14404a4316N526Q704o22m436k685O158l660J164L771j785j730k883O111P507r26
$$ plain form
14510 -11628 -9362 -1999 -2266 -5482 -12295 -15152 -7710 65 -4160 -5857 -6341 -7494 -5539 -2867 -1209
14495 -1209 521 -2229 -11678 -11538 -1732 2609 2195 356 -4622 -9671 -6299 -9230 -21120 -13445 -9582
14480 -9582 -4776 -1355 1342 -2057 402 -1776 -9059 -13972 -10524 -3899 -767 510 -367 7025 6906
14465 6906 3143 5805 4060 -2658 -12682 -13429 -9969 -9011 -5954 -6521 -2451 -3721 -2711 -1530 -5087
14450 -5087 -7656 -2643 3197 7336 10453 12116 6970 -1925 -3844 936 5070 -417 -4922 -6017 -8257
14435 -8257 -7964 -10265 -8744 -2458 -2869 -6672 -13865 -20297 -15989 -9889 -3380 -696 -1262 -751 -4913 -3234
14419 -3234 -2475 2133 -6952 -9546 -737 2085 -1750 -1127 2797 9464 4355 -2075 -2966 -7375 -14316
14404 -14316 -8790 -86 -708 -5144 -7829 -1671 -5331 -4167 -396 -2181 -3911 -6794 -683 6824 5898
14389E898n450k738l636J095p98O041p19m732j382R69r70N703r5m233K542J698
14373h07o507R05J763O67p035K44J852L007J523l545J18M318O758L355j2393p821
14357a3598k069K602J366K003N074n17N343K01m046j177J09P73K227M988l098
14342A81q472l017R30K997Q08L632J312J866l874k524p73J936J234J728k024j360
14326e420M577L773M794r25o858k305k530k106m931L108k251M06L639J935n838
14311a0932N454N577p187R52j324r39J465O395m817n139O498J16K657J706P85
14296A267k117K178l691m254K628n607k811N476Q757L989j610l655j59q808j664
14281a0081J0331l25r366m718J779N149O02K969m990k788j976J0218K433j614
$$ plain form
14389 5898 448 -2290 -5926 -4831 -5629 412 -307 -5039 -6421 -5452 -6422 -719 -814 -5047 -2505 -807
14373 -807 -7314 -6409 -4646 -3979 -11014 -10770 -8918 -5911 -4388 -7933 -7815 -3497 3261 6616 -5777 -13598
14357 -13598 -15667 -13065 -11699 -9696 -4622 -5139 204 405 -3641 -4818 -4709 -3936 -1709 3279 181
14342 181 -8291 -11308 -10378 -7381 -6573 -2941 -1629 237 -3637 -6161 -6934 -4998 -3764 -2036 -4060 -5420
14326 -5420 -843 2930 7724 6799 -59 -2364 -4894 -7000 -11931 -8823 -11074 -10668 -7029 -5094 -10932
14311 -10932 -5478 99 -7088 -6136 -7460 -8399 -6934 -539 -5356 -10495 -3997 -3881 -1224 482 1267
14296 1267 -850 1328 -2363 -6617 -3989 -9596 -12407 -6931 1826 5815 4205 550 391 -8417 -10081
14281 -10081 250 -75 -9441 -14159 -12380 -7231 -6629 -3660 -8650 -11438 -13414 -3196 -763 -2377
14267b377J03L179k151l982o60K350o526j641O082p885n299J0132N015j240J373
14252c527N689n33p952j977K354k796j0720J615N617J259O652L600L766O861o054
14237C854r823r136J213J177l000n116k00M697J588P140N18k81O953L967j994
14222A557l156N972l290j519J670M350l801o547j812L842N857p927n462m29N193
14207e502j780O925L191l981n599k831n748q544L461P283L288m607l578L668Q469
14192e885J526L093oj465n37n757l915j721k24K860O329K216M27J473L080M030
14176E524n551J693l289j273o53M614K803k677o485n986j930J0079R125K215q23
14161G386k373J096p615M147K339o449q233L98J315J675J315J162l169M645q92
$$ plain form
14267 -2377 -2274 905 -1246 -5228 -5888 -3538 -10064 -11705 -5623 -13508 -18807 -8675 -3660 -4900 -3527
14252 -3527 2162 1629 -6323 -8300 -5946 -8742 -19462 -17847 -12230 -10971 -4319 -719 3047 9908 3854
14237 3854 -5969 -15105 -13892 -12715 -15715 -20831 -21031 -16334 -14746 -7606 -7088 -7369 -416 3551 1557
14222 1557 -1599 4373 1083 -436 1234 5584 1783 -4764 -6576 -2734 3123 -4804 -10266 -10695 -5502
14207 -5502 -7282 -357 2834 -1147 -6746 -9577 -15325 -23869 -20408 -13125 -9837 -14444 -18022 -14354 -5885
14192 -5885 -4359 -1266 -1272 -2737 -3274 -9031 -12946 -14667 -14891 -12031 -5702 -3486 -3059 -1586 1494 5524
14176 5524 -27 1666 -1623 -2896 -3549 1065 3868 1191 -5294 -11280 -13210 -3131 5994 8209 7386
14161 7386 5013 6109 -1506 2641 4980 -1469 -9702 -9304 -7989 -6314 -4999 -3837 -7006 -2361 -3253
14146c253l489m428Q663J490O41m968n722J896M189r74j55L118R81k527M130R955
14130I547k923l787k657n97P273k643k419q204k076N164M404R913J570K096k023
14115A2638J84j455n865p299p056N448N753P992K145j215K545L458l487L413M190
14100B1389k9M239N682L785J0532N164j182n551p118K372j772o727n98k22j376
14085B8588n357l01o566K289P210l462o665J439J76k910l56L724K656m674k021
14070A3770l971j591K183K114M567k350n906N321M714P204R570K39j194L694R836
14055D8200P308K1342K4733K7455L7548J8223j7581k1595j3495j9834k5781j5012
14043G1511n291q80r865j1843n957K86J48J812j0119j96K267p914L82j96n228
$$ plain form
14146 -3253 -6742 -11170 -2507 -1017 -376 -5344 -11066 -9170 -4981 -5955 -6110 -2992 -2011 -4538 -408 9547
14130 9547 6624 2837 180 -417 6856 4213 1794 -6410 -8486 -3322 1082 10995 12565 14661 12638
14115 12638 12822 11367 5502 -1797 -8853 -3405 2348 10340 12485 11270 13815 17273 13786 17199 21389
14100 21389 21360 25599 31281 35066 45598 50762 49580 44029 36911 39283 37511 30784 30186 29964 28588
14085 28588 23231 22930 16364 18653 25863 22401 15736 17175 17351 14441 14085 17809 20465 15791 13770
14070 13770 9799 8208 10391 12505 17072 14722 8816 14137 18851 26055 35625 35864 34670 38364 48200
14055 48200 55508 76850 101583 129038 166586 184809 167228 145633 132138 112304 86523 71511
14043 71511 66220 65340 55475 43632 37675 37961 38109 39921 29802 29606 31873 23959 24341 24145 18917
14028A8917Q5P493K939k637P048l137j0810m992K506j371m301J374P031Q364P091
14013C5600L849K82M939R503K1153K6155L0716L1748J8274j0221k7383k5344j1495
14000A07776j5799j5838j6362m528r02m016L53K426p948j0769m028R02L891L4
13986C5192l279m009K489k1m21K760n431l005j774k209k419q449j554K56K031
13971A0157Q487L089n454J620J0550N083J807M169M070J4844Q202p806n981l900
13957D8937o240r730Q40N576k551k163p026j072L174L6J289K017j1031k788O446
13942B5714K25l42m591J374P299l161o188l72m99m545j334j120j503o580n762
13927a385J826J204L716L856J1098k205L72r4k705l417L384J172l299l749k071
$$ plain form
14028 18917 19002 26495 29434 26797 33845 30708 19898 14906 17412 16041 11740 13114 20145 28509 35600
14013 35600 39449 39731 44670 54173 75326 101481 132197 163945 182219 171998 144615 119271 107776
14000 107776 91977 76139 59777 55249 54347 50331 50684 53110 45162 34393 30365 31267 35158 35192
13986 35192 31913 27904 30393 30372 29951 32711 27280 24275 22501 20292 17873 9424 7870 8126 10157
13971 10157 18644 21733 16279 17899 28449 33532 35339 39508 43578 58422 66624 58818 52837 48937
13957 48937 42697 32967 33807 39383 36832 34669 27643 26571 29745 29781 31070 33087 22056 19268 25714
13942 25714 25939 25597 21006 22380 29679 26518 20330 19958 19459 14914 13580 12460 10957 4377 -1385
13927 -1385 441 1645 5361 9217 20315 18110 18482 18388 15683 12266 15650 16822 13523 9774 7703
13912G703N72P03J911O19k740J849k60J345r057L841N52J45j844J023M63k288
13896D537L119j618j97k306k474k002L005M398Q029j277m261K825L304J0264R151
13881C4497m050n745J741n422J595J844l043N38L455j765j830N98k036l498M690
13866B1569J32o566k50N492J435N209K57R18L55k100o44J672j528Q92K149J055
13850C0047m751o569m397o96M789J2249P970L648K26r64J585L263J918j724J177
13835D7771l820r970K316R114n477j958M45J233N250l818p843K343M792n541K280
13820C7117n183j0517q47N777N170k061K444L008L701r70O896P036m940K178k479
13805D6330N481J1300M675r100l032o61M61N942N683l878k382n566l157o34P64
$$ plain form
13912 7703 8275 8978 10889 11508 8768 10617 10357 11702 2645 6486 7038 7183 5339 6362 6825 4537
13896 4537 7656 6038 5841 3535 1061 -941 2064 6462 14491 13214 8953 11778 15082 25346 34497
13881 34497 30447 24702 26443 21021 22616 24460 21417 21955 25410 23645 21815 22413 20377 16879 21569
13866 21569 21701 15135 14885 20377 21812 27021 27278 28196 28551 26451 25807 27479 25951 26843 28992 30047
13850 30047 25296 18727 14330 13634 18423 30672 38642 42290 42516 41552 43137 46400 48318 46594 47771
13835 47771 43951 33981 36297 45411 39934 37976 38421 39654 44904 41086 33243 35586 40378 34837 37117
13820 37117 31934 21417 20570 26347 31517 29456 31900 34908 38609 37639 44535 51571 46631 48809 46330
13805 46330 51811 63111 67786 58686 55654 54993 55454 61396 67079 63201 60819 55253 52096 51462 52226
13790E2226J445r39K478J155L218q716o68K243L152K53J0634L58j486r531l405
13775E2417K853l391k326k626N824J78L154o89J246o64l844k158Q242O273L096
13760F7585j406k593K714M021Q016M802q41o454l009P005J093J606j932k41M941
13745H5307K421n588j1367M575O143K552j894p00K742N731K968J95P3l249k125
13730H7784j561l051k076j629k672j740K78P714M047K017l196k399j482K980m515
13715H0499n792N91J0446P059N173K624j641j0059l611Q670J225o186J018M058
13701I4074k702O82M318P797J1858R624L287p841k152P053O206k548O091P522
13687A43269k730k887P60N722P269K106M822N143J538k258O485J649R75K466L166
$$ plain form
13790 52226 53671 52732 55210 56365 59583 50867 50199 52442 55594 55847 66481 66839 65353 55822 52417
13775 52417 55270 51879 49553 46927 52751 52929 56083 55394 56640 55976 52132 49974 58216 64489 67585
13760 67585 66179 63586 66300 70321 78337 83139 82298 75844 72835 79840 80933 82539 80607 80366 85307
13745 85307 87728 82140 70773 75348 81491 84043 82149 81449 84191 89922 92890 93085 93158 89909 87784
13730 87784 86223 83172 81096 79467 76795 75055 75333 83047 87094 89111 85915 83516 82034 85014 80499
13715 80499 74707 75298 85744 92803 97976 100600 98959 88900 85289 93959 95184 88998 90016 94074
13701 94074 91372 92054 96372 104169 116027 125651 128938 121097 118945 125998 132204 129656 135747 143269
13687 143269 140539 137652 138412 144134 151403 153509 158331 163474 165012 162754 169239 170888 171863 174329 177495
13672A77495Q272N726K513N401R034Q976J0496J1130O380J3484P641R470K358
13659B78376P426M774R322J2759J9185K3346J9327K5992K4469K3020K5288L9581
13647E12865N7210O2503P3987R3920J20845J45120J69034K08773K67926L46563
13637B058746M68587O86268J024030J540851K181785K388790J274869o60463j718796
13628I244667j618631j244039r66748p75096o11205m70248l54343k69643k05963
13619B728751j62499j22495r0298o9164r3523j18817j17377r4885p4493n9952
13609A725248m2766l3109j8680l895J7252L3549M9541P6505J22773J79134K56362
13598B361914L38573M14221M84366N84854P48792R89186J352745J948936K927375
$$ plain form
13672 177495 185767 191493 194006 199407 208441 217417 227913 239043 245423 258907 266548 276018 278376
13659 278376 285802 290576 299898 312657 331842 355188 374515 400507 424976 447996 473284 512865
13647 512865 570075 632578 706565 800485 921330 1066450 1235484 1444257 1712183 2058746
13637 2058746 2527333 3213601 4237631 5778482 7960267 10349057 11623926 10963463 9244667
13628 9244667 7626036 6381997 5415249 4640153 4028948 3558700 3204357 2934714 2728751
13619 2728751 2566252 2443757 2353459 2284295 2190772 2071955 1954578 1859693 1785200 1725248
13609 1725248 1682482 1649373 1630693 1626798 1644050 1677599 1727140 1803645 1926418 2105552 2361914
13598 2361914 2700487 3114708 3599074 4183928 4932720 5921906 7274651 9223587 12150962
13589A2150962M519483O763928Q254702N351992j822731o211353n663640m107158
13581A9236185l130975k504376j963226j501452j131754q63299o82520n43239
13573F915344m14139l14726k70174k93740l67591l99657l76498l37836l03105
13564C837878k56819k23301j88994j30176r1520o8435m2922j9382M0412J11693
13554B968434K00591L01472L79566M52363N43998O96545R48664J315525J885601
13545I692759K822469M361594O584251Q323902N973551j183050o234722n998987
13537B4341767m366112l293490k623933k070114j577871j187179r14726p31986
13529G576356n95446m66505l53066k88921l00591l72626m26782m14989l73746
$$ plain form
13589 12150962 16670445 23434373 31689075 37041067 35218336 29006983 23343343 19236185
13581 19236185 16105210 13600834 11637608 10136156 9004402 8141103 7458583 6915344
13573 6915344 6501205 6186479 5916305 5622565 5254974 4855317 4478819 4140983 3837878
13564 3837878 3581059 3357758 3168764 3038588 2947068 2878633 2835711 2816329 2856741 2968434
13554 2968434 3169025 3470497 3850063 4302426 4846424 5542969 6491633 7807158 9692759
13545 9692759 12515228 16876822 23461073 31784975 37758526 36575476 30340754 24341767
13537 24341767 19975655 16682165 14058232 11988118 10410247 9223068 8308342 7576356
13529 7576356 6980910 6514405 6161339 5872418 5571827 5199201 4772419 4357430 3983684
13520C983684l32346l08587k65843k20296j85559j52298j30035j18685j01380
13511B168655o9043l4282R554N5598R5261J26015J55506K00875K85790M09858
13501C403787O11082R07677J379081K049213K496135J779212k05629j748830j901457
13492H770271j495256j132711r04097p12377n52443m28434l28638k66605k18971
13483B730739j77529j42994j16215j16522j28033j36882j42487j28901j16350
13474A524826j20983j01369q0380o5731n7638n8457o0388m4653l9887l3241k6389
13463H35710k0400j6450j5814j7316j8951j5944j3771j3830j1818j5326j3679
13452F62411m470j2801k3712j1251r169r844k914l099j1554m814Q439J187j0624
$$ plain form
13520 3983684 3651338 3342751 3076908 2856612 2671053 2518755 2388720 2270035 2168655
13511 2168655 2099612 2065330 2074884 2130482 2225743 2351758 2507264 2708139 2993929 3403787
13501 3403787 4014869 4922546 6301627 8350840 10846975 12626187 12420558 10671728 8770271
13492 8770271 7275015 6142304 5238207 4525830 3973387 3544953 3216315 2949710 2730739
13483 2730739 2553210 2410216 2294001 2177479 2049446 1912564 1770077 1641176 1524826
13474 1524826 1403843 1302474 1222094 1156363 1098725 1040268 979880 935227 895340 862099 835710
13463 835710 815310 798860 783046 765730 746779 730835 717064 703234 691416 676090 662411
13452 662411 657941 645140 621428 610177 601008 591164 588250 585151 573597 568783 577222 578409 567785
13439E67785L57O805O857M731L882r49J359J3499J0000R110J0230k780L557P755
13425F42198P767M241Q53L274K399N367R067Q634O172O715R182O012J0327J1936
13411G34144J5182J3917P696R083L814M831N637P819O918O270N299J1684J0716
13398H43010J1834J2668K0227J1997O217Q993R677J5532R615J6042J6265K0797
13386A002874K1935K7389K3174J1484J4760K1051K2095K4175K2892K4621K4761
13375A241211K3636K6891L2224K9729K8188L6118L4011L5171L0853K8052L4938
13364A581022L6817L1495L5313L2978M3345L5921M3137M5394N1723M9853N3705
13353B040703M7768M2837N8349N6199M8699N3444N8768N8050O6539O3787O9567
$$ plain form
13439 567785 568142 574947 581804 586535 590417 589468 590827 604326 614326 623436 633666 630886 634443 642198
13425 642198 649965 654206 655059 658333 660732 666099 675166 683800 689972 696687 705869 711881 722208 734144
13411 734144 749326 763243 770939 780022 783836 788667 794304 802123 809041 815311 820610 832294 843010
13398 843010 854844 867512 887739 899736 905953 914946 924623 940155 949770 965812 982077 1002874
13386 1002874 1024809 1052198 1075372 1086856 1101616 1122667 1144762 1168937 1191829 1216450 1241211
13375 1241211 1264847 1291738 1323962 1353691 1381879 1417997 1452008 1487179 1518032 1546084 1581022
13364 1581022 1617839 1649334 1684647 1717625 1760970 1796891 1840028 1885422 1937145 1986998 2040703
13353 2040703 2088471 2131308 2189657 2245856 2294555 2347999 2406767 2464817 2531356 2595143 2664710
13342B664710P5028P0022O8784P2147P8852Q4705Q2213Q8956Q6322Q0879Q4881
13331C537499Q6947Q5888Q2531Q6078R0933R6667R5126Q9020Q2596Q0277P8776
13320D492338Q1097Q1000O8345O3469P2588P7571P8755O6067P6015O8748O1114
13309E287107N6382N8618O3035N4233N2581M1667L5714L4174L4870L4408K6182
13298E778971K5408K7428K3159J1314J0274K0393P517J5857J2393M383P499j144
13286E943452j4032j3670r954r603j1300j5521j0730j5688l6294l4375l3462k5932
13274E712891k5007l2357l1542l3269k7720k6391k3931k3087k5915k1662k3093
13263E418917j8946j0841r760j1847r338m186p931n724O548M247O569J4500J3652
$$ plain form
13342 2664710 2739738 2809760 2878544 2950691 3029543 3114248 3196461 3285417 3371739 3452618 3537499
13331 3537499 3624446 3710334 3792865 3878943 3969876 4066543 4161669 4250689 4333285 4413562 4492338
13320 4492338 4573435 4654435 4722780 4786249 4858837 4936408 5015163 5081230 5157245 5225993 5287107
13309 5287107 5343489 5402107 5465142 5519375 5571956 5613623 5649337 5683511 5718381 5752789 5778971
13298 5778971 5804379 5831807 5854966 5866280 5876554 5896947 5904464 5920321 5932714 5937097 5944596 5943452
13286 5943452 5929420 5915750 5905796 5896193 5884893 5869372 5858642 5842954 5806660 5772285 5738823 5712891
13274 5712891 5687884 5655527 5623985 5590716 5562996 5536605 5512674 5489587 5463672 5442010 5418917
13263 5418917 5399971 5389130 5379370 5367523 5358185 5353999 5346068 5340344 5346892 5351139 5357708 5372208 5385860
13250E385860J3250J6153K4294K3899L1575L0908K5033L2173L9295L2220L2985
13239E687645K6835K9446M2238N0668M3375L6337K6760K4309K9583L5906K7049
13228F060151L1071L0805K5470K1793K2540K2394J7482J7111P842N574P601M223
13216F274057K092l392p573j4608k2421j5285j4445k4445k7047k7506l7013m8133
13204F034281m4252m7243n8054n1379n2385n5703o2067o0245o9026p0995p3982
13193E388950p1081p1486p9577p7064q6240r3727q8027q2917q2575r1001r0613
13182D474642q5625q2733q8965q7626r1466r1633q8568q9651p9339p4627p8099
13171C536310p9091q5427q1695p6334p6467p1147o3450o7850o6710n8384o1339
$$ plain form
13250 5385860 5399110 5415263 5439557 5463456 5495031 5525939 5550972 5583145 5622440 5654660 5687645
13239 5687645 5714480 5743926 5786164 5836832 5880207 5916544 5943304 5967613 5997196 6033102 6060151
13228 6060151 6091222 6122027 6147497 6169290 6191830 6214224 6231706 6248817 6256659 6262233 6269834 6274057
13216 6274057 6276149 6272757 6265184 6250576 6228155 6212870 6198425 6173980 6146933 6119427 6082414 6034281
13204 6034281 5990029 5942786 5884732 5833353 5780968 5725265 5663198 5602953 5533927 5462932 5388950
13193 5388950 5317869 5246383 5166806 5089742 5003502 4909775 4821748 4738831 4656256 4565255 4474642
13182 4474642 4389017 4306284 4217319 4129693 4038227 3946594 3858026 3768375 3689036 3614409 3536310
13171 3536310 3457219 3371792 3290097 3213763 3137296 3066149 3002699 2934849 2868139 2809755 2748416
13160B748416n2136n4730n7949o4151o6227o1121n7534n4885n5864n9594n9629
13149B104596n7175m8126m0471m0930m1374l4675l5480m0521l8316l6049l8278
13138A653201l6727l4972l6725l0437l0418k5200k5441k9989k7164j9736k2637
13127A333755j8092j3630k4793j8242j3479n928j89j2834j4485n788n405R22J0399
13114A212211K1479N964k9142m1043m0168k4710k7334k6656k1216j8733k0434
13103I90218j5214j4744j9603j8016j6507j5847j7490r877n302o827j0064j5585
13091H25142o700q184o875r452j1650m337p917r050j5080p369p045m10m453j0763
13077G15857k787j323k099M163P280M210J3542J8491K5380J3185j2727k4359k7486
$$ plain form
13160 2748416 2696280 2641550 2583601 2519450 2453223 2392102 2334568 2279683 2223819 2164225 2104596
13149 2104596 2047421 1999295 1958824 1917894 1876520 1841845 1806365 1765844 1727528 1691479 1653201
13138 1653201 1616474 1581502 1544777 1514340 1483922 1458722 1433281 1403292 1376128 1356392 1333755
13127 1333755 1315663 1302033 1277240 1258998 1245519 1239591 1239402 1226568 1212083 1206295 1200890 1201812 1212211
13114 1212211 1233690 1239654 1210512 1169469 1129301 1104591 1077257 1050601 1029385 1010652 990218
13103 990218 975004 960260 940657 922641 906134 890287 872797 862920 857618 850791 840727 825142
13091 825142 818442 810258 803383 793931 782281 777944 770027 760977 745897 738528 731483 731073 726620 715857
13077 715857 713070 711747 709648 713811 721091 725301 738843 757334 782714 795899 783172 758813 731327
13064G31327l1311k9333k1863j8157j1917j6797j8568p578m731q586o322j0824
13052E45340j2681j1109j5842p368l590o687k644k601j729k613o350j2555j2293
13039D47278r167m348L318j560r947m381k107J78k449R66J241m031o116m534N82
13024D04923P519N866l327p524j5828j3249j6158p689l303k091p071o310l573
13011C32185k781j511n092q087p092j797K723j995L274L177q50J2271J5006m642
12997C34789k0299r471k668p011m217l034n538p719q957r354l244o305l861m762
12983B38349O547J102p77n889o253m331n450k345N496m234j1995o53M855k512
12969B11910k404m468r277l976m45L175O71M35N233l696p086K157K525J0691J9776
$$ plain form
13064 731327 700016 670683 648820 630663 618746 601949 583381 575803 571072 562486 556164 545340
13052 545340 532659 521550 505708 498340 494750 488063 485419 482818 481089 478476 472126 459571 447278
13039 447278 438111 433763 437081 435521 425574 421193 419086 419264 416815 417781 419022 414991 408875 404341 404923
13024 404923 412442 418308 414981 407457 391629 378380 362222 354533 351230 349139 342068 335758 332185
13011 332185 329404 327893 322801 314714 307622 305825 308548 306553 309827 313004 312154 324425 339431 334789
12997 334789 314490 305019 302351 295340 291123 288089 282551 274832 265875 256521 253277 246972 243111 238349
12983 238349 244896 245998 245221 239332 233079 228748 223298 220953 226449 222215 210220 209567 214422 211910
12969 211910 209506 205038 195761 191785 191340 194515 195186 195621 200854 197158 190072 192229 194754 205445 225221
12954B25221R321o817k0661j5998j430P77N79k713k927k168j438q343l911K284
12940A71776o339j881K814K403l123l774J086k440L081M917L33o137q610m985
12926A49121J974m89k810l772K004m94k132J644N82K82J07K417j986m364K430
12911A44514K388Q36O97j453k496m319n206k089J463K18J620L693J236j1373n114
12896A24615O86L375J182o01L660L569P14l274m260O983K21o646j0850K408J908
12881A23690j424M970R82j0711k968j430Q158M693k153O9L82O5k605n59l670O536
12865A24025O361P97R88j384m702n326j997M55m304M096M401n236j554O796k191
12850A21225l128M293L174l463J576k262O610J34k680l475o054m309k97l809J285
$$ plain form
12954 225221 234542 227725 207064 191066 189636 190413 190992 188279 185352 183184 181746 173403 169492 171776
12940 171776 165437 163556 166370 168773 165650 161876 162962 160522 163603 168520 168853 162716 154106 149121
12926 149121 151095 150606 147796 144024 146028 145534 143402 145046 145628 145910 146017 148434 146448 142084 144514
12911 144514 146902 147738 148435 146982 144486 140167 134961 132872 134335 134553 136173 139866 141102 129729 124615
12896 124615 125301 128676 129858 129257 132917 136486 137200 133926 129666 136649 136870 130224 119374 121782 123690
12881 123690 122266 127236 128218 117507 114539 113109 121267 125960 123807 123876 124258 124323 121718 121159 117489 124025
12865 124025 130386 131183 132171 130787 126085 120759 118762 119217 114913 119009 123410 118174 116620 123416 121225
12850 121225 118097 122390 125564 122101 123677 121415 128025 128159 125479 122004 115950 111641 111344 107535 108820
12835A08820l855m565L351k59j2765k203P017J406M427r03M725M203m962K87k19
12820A04505l038J958O297J5074J7284J7390Q164j3131j6485j2212p235m391r571
12807A04609n518J977L324o906o284l448L665L165K9j297l121O96R91k50k017
12792H9615K133K797p086l092j77L562K463K065J13l797O298o08J846K92n099
12777I1325l846O93N758M615o05k451k094n405j546r06J247l204J773n42k667
12762H2145q780L137O218L279r92N740k348q747L066L254J009k936o815k540K99
12747G4989M70J375j539n886k584N28M682K822L230L586k194q680q073j316L129
12732F4539P58k262J040K481P91r127o794M47j28J018J473J90P9n377l266J554
$$ plain form
12835 108820 104965 100400 103751 103492 90727 88524 95541 96947 101374 100471 105196 109399 104437 104724 104505
12820 104505 101467 103425 109722 124796 142080 159470 167634 154503 138018 125806 118571 114180 104609
12807 104609 99091 101068 104392 97486 91202 87754 91419 94584 94613 93316 90195 90891 91882 91632 89615
12792 89615 91748 94545 87459 84367 84190 87752 90215 92280 92393 88596 94894 94286 96132 96424 91325
12777 91325 87479 88172 93930 98545 97940 95489 93395 87990 86444 85538 86785 83581 85354 84812 82145
12762 82145 73365 76502 82720 85999 85007 90747 88399 79652 82718 85972 86981 84045 77230 74690 74989
12747 74989 75459 76834 75295 69409 66825 67353 72035 74857 78087 81673 79479 70799 62726 61410 64539
12732 64539 65297 63035 64075 66556 67347 58220 51426 51873 51745 52763 54236 54426 54505 49128 45862 47416
12716D7416L928q54K772j299J698J7l99N91m998p505m07P646J412n046l273O277
12700D7976N711j202j956M146j016J636L564N698k641l204k744K030L199K097
12686F3294k222K087j446n300o319M382Q613J314N354l575J25J411O540K614l86
12671G6486M132k719J9p1k546J645l92j0098p375r790J073R420J1242l946j0749
12656E6331m364Q808J854r13m19J150m18m914J73M38m22n949n074m559J458k925
12640D0255k299k330K641m427j528N12K671K531l10P50m339j608J26M440Q163
12625D5248o911j1420N660J2766M28l794M2K242k787K975J116M042m752l443k038
12610C9374j602M080O427M109R45M300N782k532K667n099n016K130n967k069n762
$$ plain form
12716 47416 51344 50490 53262 51963 53661 53678 53279 53870 48872 41367 40960 48606 50018 44972 41699 47976
12700 47976 53687 52485 50529 54675 53659 55295 58859 64557 61916 58712 55968 57998 61197 63294
12686 63294 61072 63159 61713 56413 50094 54476 63089 64403 69757 66182 66307 67718 74258 76872 76486
12671 76486 80618 77899 77918 77847 75301 76946 76554 66456 59081 49291 50364 59784 71026 67080 56331
12656 56331 51967 60775 62629 61716 61297 62447 62029 57115 57288 57726 57304 51355 46281 41722 43180 40255
12640 40255 37956 35626 38267 33840 32312 32824 35495 38026 37716 38466 34127 32519 32645 37085 45248
12625 45248 38337 26917 32577 45343 45771 41977 42019 44261 41474 44449 45565 49607 44855 41412 39374
12610 39374 37772 41852 48279 52388 53333 57633 63415 60883 63550 58451 53435 55565 49598 47529 41767
12595D1767K593m839q384J693O494N043k604j446k212k005N56O216R359L419K706
12580E8356m066o430k346J0216L197k210Q15k810q463j0399L128K019m539k237
12566C4231M526M336J876j063p76n4j694O31L331K845J068L276J860K532n507
12551E1418l175J206k389j09m682k23p283n936j729Q98j028n81O189Q800l303
12536C8073J800J726k125k37K63k232j855j297K054K423r702l310N87N812P965
12521C9945L448r6m050l810P983J525n570o110M87M41L781l052P534l019o241
12506C3196P94L582k925k343O311J827q78j004k47r216k350L344l974l214k634
12491B0269Q93K222N031L39m832J714j649J654r48J080K283J049m41J826Q59O78
$$ plain form
12595 41767 44360 39521 31137 32830 39324 44367 41763 40317 38105 36100 36656 42872 52231 55650 58356
12580 58356 54290 47860 45514 55730 58927 56717 57532 54722 46259 35860 38988 41007 36468 34231
12566 34231 38757 43093 44969 43906 43130 43076 41382 42013 45344 48189 49257 52533 54393 56925 51418
12551 51418 48243 49449 47060 46951 42269 42046 34763 28827 27098 27996 26968 26387 32576 41376 38073
12536 38073 39873 41599 39474 39237 39500 37268 35413 34116 36170 38593 28891 25581 26168 31980 39945
12521 39945 43393 43297 39247 35437 43420 44945 39375 33265 33752 34193 37974 34922 42456 39437 33196
12506 33196 33990 37572 34647 32304 38615 40442 39564 38560 38313 29097 26747 30091 26117 22903 20269
12491 20269 21162 23384 28415 28754 23922 25636 23987 25641 24693 25773 28056 29105 28664 30490 31349 32027
12475C2027j564J099K436K250k717k205l502M595Q489R45o913r34k408l695K253
12460C0156N804j061l364k37j219Q30J604Q819p12n574R22L347K796K208J048
12445D5367L428k267n58K696N048J824k438k25j777L515R05l774n556j393l438
12430D1357J813o847k2R999N327j503m213P743P82r5J370o297j66O041J409k029
12414E4669N029P757j0582l321o385m846L127L593j5J617l73l199J258J021k616
12399D6734j386P46O638j146K178M904L725p81l270O040m39n102n853o410j446
12384D5132J162L396K409O29l748l115p94J266R569k01j956Q436K076J077k582
12369F2756k476j80N590Q262P482j482k818M32o769j380O518J69K702L660m84
$$ plain form
12475 32027 30463 31562 33998 36248 33531 31326 27824 32419 40908 41853 34940 34006 31598 27903 30156
12460 30156 35960 34899 31535 31298 30079 30909 32513 41332 40620 35046 35968 39315 42111 44319 45367
12445 45367 48795 46528 45970 48666 53714 55538 53100 52875 51098 54613 55518 51744 46188 44795 41357
12430 41357 43170 36323 36301 46300 51627 50124 45911 53654 54436 54341 55711 49414 49248 55289 56698 54669
12414 54669 59698 67455 56873 53552 47167 42321 45448 49041 49026 50643 50270 47071 48329 49350 46734
12399 46734 45348 46094 52732 51586 53764 58668 62393 61612 58342 64382 63943 58841 52988 46578 45132
12384 45132 46294 49690 52099 52728 48980 45865 45071 46337 55906 55705 53749 62185 64261 65338 62756
12369 62756 60280 60100 65690 73952 81434 79952 77134 77566 70797 69417 75935 76104 78806 82466 81982
12354H1982M5n89R196J2442L950K422l801K161J350o885n520p777J995m661O1
12339H6371Q01l27M030K942k095k781j76L141p05N144J821L02K725J929k898R351
12323A09575J2807N67k266L8K672R46J811N540L510L033k367r298q423L097L770
12308A25012R965J423L610R63q689o313N59m931p086L277j529r966q15n439q277
12293I1764j580K972K72J036p66K040J0225Q105L457J585P713L042K615M372L298
12278A40150q866j627p567k550k656m288l852M866j558l333J624J159l323j774
12264A06405k141l944m971N33p553l599Q752j959q616L34p938m792M593K408l558
12249G3954m591J738P88K661n884p169j145O559O452n7l810L069K529P359n269
$$ plain form
12354 81982 82027 81438 90634 103076 107026 109448 105647 107808 109158 102273 96753 88976 90971 86310 86371
12339 86371 87172 86845 90875 93817 91722 88941 88765 91906 91201 96345 98166 98468 101193 103122 100224 109575
12323 109575 122382 122949 120683 120721 123393 124339 126150 131690 135200 138233 135866 126568 118145 121242 125012
12308 125012 134977 136400 140010 140973 132284 125971 126530 121599 114513 117790 116261 106295 105480 100041 91764
12293 91764 90184 93156 93428 94464 93698 95738 105963 114068 117525 119110 126823 129865 132480 136852 140150
12278 140150 131284 129657 122090 119540 116884 112596 108744 113610 112052 108719 110343 111502 108179 106405
12264 106405 104264 100320 95349 95882 88329 84730 93482 91523 82907 83241 75303 70511 75104 77512 73954
12249 73954 69363 71101 71889 74550 68666 61497 60352 66911 73363 73306 69496 72565 75094 82453 77184
12234G7184k300J090m471J273P746N643N703p883m506m315K2O000r07k787j771
12219G5721o464k441j086j839J818J1518J732J641P950K416r222M758P012J315
12205I4829L469K429l551j0606m961l029o85L155J451M411M024J001O16O8o591
12190H6030k265j113J000K759l068o375K429K654j451m302k038j079m137j109
12176F7935j944o315Q3M355K934O859l773o180k865l0J0277M003P984j229p86
12161H1308Q152J594l334n895K474o3n704k014r97j920L070o007j166l312L569
12146F9755K301K378m182M430j28j479l093k288O188R146P509L437P944Q894J168
12131A11980K863j627K221o82q520k179m406r433q640m007o267l987j806P390
$$ plain form
12234 77184 74884 75974 71503 72776 80522 86165 91868 83985 79479 75164 75186 81186 80279 77492 75721
12219 75721 69257 66816 65730 63891 65709 77227 78959 80600 88550 90966 81744 86502 93514 94829
12205 94829 98298 100727 97176 86570 81609 78580 77895 81050 82501 86912 90936 91937 92553 92621 86030
12190 86030 83765 82652 83652 86411 83343 76968 79397 82051 80600 76298 74260 73181 69044 67935
12176 67935 65991 59676 59759 64114 67048 73907 70134 63954 61089 61059 71336 75339 83323 82094 81308
12161 81308 89460 91054 87720 81825 84299 84236 78532 76518 75521 73601 76671 70664 69498 66186 69755
12146 69755 72056 74434 70252 74682 74554 73075 69982 67694 73882 83028 90537 93974 101918 110812 111980
12131 111980 114843 113216 115437 114755 106235 104056 99650 90217 81577 77570 71303 67316 65510 72900
12117G2900K740P387L997K379r33N39n743Q04M287k096N95n935J645K413m226
12102H0753K045l239o193J860K670l372l178j552l046n143M578P066M779M492
12088H2520m411n897P48K406O344j926m185n65P079Q217K777k183j0893l761M602
12073H0872O322k68m064n996r701m573L208R509N1N14lN08J994P120J0408l976
12057I1925n820L870N862n309m438K465K508J486k753M136j662l552n34J805k038
12042H7951R747l197k892J697n029K569L759m502N87K766p71j097m352m054j0385
12027G2797j631p04k016j322K215L124P522M432L864J440l913n958Q62l365M583
12012H1930q42k869n820m053N935L717N998L665j2549j4845O188M929R442J734
$$ plain form
12117 72900 75640 83027 87024 89403 88470 89009 83266 84070 88357 86261 86856 80921 82566 84979 80753
12102 80753 82798 79559 73366 75226 77896 74524 71346 69794 66748 61605 66183 73249 78028 82520
12088 82520 78109 72212 72960 75366 81710 79784 75599 75034 82113 90330 93107 90924 80031 76270 80872
12073 80872 87194 86926 82862 76866 67165 62592 65800 75309 75360 75874 75871 76379 78373 85493 95901 91925
12057 91925 86105 89975 95837 90528 86090 88555 91063 92549 89796 93932 92270 88718 88184 89989 87951
12042 87951 97698 94501 91609 93306 88277 90846 94605 90103 90690 93456 92685 91588 87236 83182 72797
12027 72797 71166 70462 68446 67124 69339 72463 79985 84417 88281 89721 85808 79850 80712 77347 81930
12012 81930 81088 78219 72399 68346 74281 77998 83996 87661 75112 60267 66455 71384 80826 82560
11998H2560r99k433n477L47M960o478q37j516J840O300r42k340k876m551l475
11983F4083n861P228L124k397k092m810K246n774j636M04L491Q308L63j468r49
11968F4260l096O561L293J30L625L089L825M156q71m886l272j2742k547K803N445
11953F9773O573l270O80l056O803Q045K291M070q693k33M976K972L141M642j0155
11938H8559n283J3000Q796j90P99J553M76J950k280K838k084K999l514j1829p409
11923H8381l671n357R310O275j717n183R60L618q277l567o449n283P880P573Q957
11908I3450M416M837M51Q185j509j914l551q207k415m411k036p252p769j161K145
11893G3259O198M798k674M714L416j658n503K088J0264J1738M862O140P0l287
$$ plain form
11998 82560 81561 79128 73651 73998 78958 72480 71643 70127 71967 78267 77325 74985 72109 67558 64083
11983 64083 58222 65450 68574 66177 64085 59275 61521 55747 54111 54515 58006 66314 66677 65209 64260
11968 64260 61164 67725 71018 71148 74773 77862 81687 85843 84972 80086 76814 64072 61525 64328 69773
11953 69773 76346 73076 73756 70700 77503 85548 87839 91909 83216 82983 87959 90931 94072 98714 88559
11938 88559 83276 96276 105072 104882 105681 107234 107710 109660 107380 110218 108134 111133 107619 95790 88381
11923 88381 84710 79353 88663 94938 93221 88038 88998 92616 84339 80772 74323 69040 76920 84493 93450
11908 93450 97866 102703 103154 111339 109830 107916 104365 96158 93743 89332 87296 80044 72275 71114 73259
11893 73259 79457 84255 81581 86295 89711 88053 82550 84638 94902 106640 111502 117642 117712 114425
11879A14425o88K641q933o706l164j0661n989M242L564J471R44O300L271L790
11865A04507J382M789P490P121P592R435O812N432J513r0J291J370N262l490K824
11850A63240N452L271P274R083L098O889J3781J5358J0963J3912J9370J0250K2680
11837C04621J8831K4340M0850N3145O7753O9771Q7325J18566J52648J80332J99632
11826A317814J93641J68277J21118O2631q280n7440r9608j17963j11484q3815
11816A384891p3961n8484m1044j9261J2950L5013O2689R4821J21976J69290K31299
11805A920179K89407L42704L88661L86862L25292K02011M8440j06743k28821k93917
11795C274075l15299l04277k68520k18468j77993j50216j05411p5646n8254k6923
$$ plain form
11879 114425 113737 116378 107445 100739 97575 86914 80925 85167 88731 90202 91146 97446 100717 104507
11865 104507 105889 110678 118168 125289 132881 142316 149128 154560 156073 155983 157274 158644 163906 160416 163240
11850 163240 168692 171963 179237 188320 191418 198307 212088 227446 238409 252321 271691 281941 304621
11837 304621 323452 347792 388642 441787 509540 579311 666636 785202 937850 1118182 1317814
11826 1317814 1511455 1679732 1800850 1863481 1855201 1797761 1698153 1580190 1468706 1384891
11816 1384891 1310930 1252446 1211402 1192141 1205091 1240104 1302793 1397614 1519590 1688880 1920179
11805 1920179 2209586 2552290 2940951 3327813 3653105 3855116 3903556 3796813 3567992 3274075
11795 3274075 2958776 2654499 2385979 2167511 1989518 1839302 1733891 1658245 1599991 1573068
11785A573068k542K4801M8345R0153J23004J55640J80470J72119J31971O5570
11775B562599j8100j03167j59052j86677j86682j74595j47161j25797r4462o5333
11765A301573m8642l4467j2365J1603K6426M7407O7209R9797J25721J74754K25876
11754A984892L02957L85197M30926M39082L95477K80748J10546o3186k06077k86647
11744C773915l02839k81460k43379j98154j45100q5334k7804J5567O5445J28426
11734B699283J96997K67422L52809M83598O20083P57211Q51309Q59220P24868
11725G812800M54007J03454k52250n31497o86254p27083o76036n93632m90149
11716D413360m05403l27434k35008j60226j11182o0448o80M4282R3973J55028
$$ plain form
11785 1573068 1570526 1595327 1643672 1733825 1856829 2012469 2192939 2365058 2497029 2562599
11775 2562599 2544499 2441332 2282280 2095603 1908921 1734326 1587165 1461368 1366906 1301573
11765 1301573 1252931 1218464 1206099 1217702 1244128 1291535 1358744 1458541 1584262 1759016 1984892
11754 1984892 2287849 2673046 3103972 3543054 3938531 4219279 4329825 4266639 4060562 3773915
11744 3773915 3471076 3189616 2946237 2748083 2602983 2517649 2489845 2505412 2570857 2699283
11734 2699283 2896280 3163702 3516511 4000109 4620192 5377403 6228712 7087932 7812800
11725 7812800 8266807 8370261 8118011 7586514 6900260 6173177 5497141 4903509 4413360
11716 4413360 4007957 3680523 3445515 3285289 3174107 3113659 3112979 3157261 3251234 3406262
11706C406262K25633K92418L33504L25201K48119J10914n4096k12729l34938l97930
11696C942358m07227l75932l33751k88552k42576j91596j47993j14371r8251p9794
11686A662315m9491l4316k1503p802R156L6674P6536J17568J72867K20416K25670
11675B408090K10245J46550M5200p1867j47391j91740k04943j93820j66281j26836
11665A707207r1523o5562k8449M92K3654O0933R6558J41361J87547K50639L21682
11654B604539L88689M44235M55547L79592K40768M9485j29765k76175l67532l94726
11644C394657l70062l23339k68612k28290j68335j24127r0851n2021l0564k781
11634A735675K4790L7310O7586J04365J38640J49021J40975J08389N1096l6265
$$ plain form
11706 3406262 3631895 3924313 4257817 4583018 4831137 4942051 4887955 4675226 4340288 3942358
11696 3942358 3535131 3159199 2825448 2536896 2294320 2102724 1954731 1840360 1742109 1662315
11686 1662315 1612824 1578508 1557005 1549203 1558359 1595033 1671569 1789137 1962004 2182420 2408090
11675 2408090 2618335 2764885 2810085 2738218 2590827 2399087 2194144 2000324 1834043 1707207
11665 1707207 1615684 1550122 1521673 1522165 1545819 1606752 1703310 1844671 2032218 2282857 2604539
11654 2604539 2993228 3437463 3893010 4272602 4513370 4562855 4433090 4156915 3789383 3394657
11644 3394657 3024595 2701256 2432644 2204354 2036019 1911892 1821041 1769020 1738456 1735675
11634 1735675 1760465 1797775 1865361 1969726 2108366 2257387 2398362 2506751 2557847 2521582
11624B521582j10851j70762k04890k01779j87865j71612j52808j26789j05179
11615A089047r7618q5779o0044m8203m8510n2203m0199l6902l4540l7018l3360
11604E14671l5337l1064k4881k2928j8315j0839j6397j8683j8607j1802p921j0626
11592B87271j3067j0117o347j1811p945o280P50j0315j3667k091J942o464k793
11579A99066p330k205N44R41l511l960P57j296O8M440l736n986k736o259p18n822
11563A62257j586K628L407L348k175m895n066l932q01N125Q003n36j905j446n337
11548A57089m861m570q22N753L155L288N79L45l341p583J268K575l948j0549m296
11533A34082j42j753j982L272Q508M029N542K648k323j864l683K674m787N557
$$ plain form
11624 2521582 2410731 2239969 2035079 1833300 1645435 1473823 1321015 1194226 1089047
11615 1089047 991429 905650 845606 797403 748893 696690 656491 619589 585049 548031 514671
11604 514671 479334 448270 423389 400461 382146 371307 354910 336227 317620 305818 297897 287271
11592 287271 274204 264087 257740 245929 237984 231704 232454 222139 208472 206381 208323 201859 199066
11579 199066 191736 189531 190075 191016 187505 183545 184302 183006 183074 187514 183778 177792 175056 168797 168079 162257
11563 162257 160671 163299 166706 170054 167879 162984 157918 153986 153185 158310 166313 165777 163872 162426 157089
11548 157089 152228 147658 146836 152589 155744 159032 159611 159956 156615 149032 150300 152875 148927 138378 134082
11533 134082 133940 132187 130205 133477 141985 146014 151556 154204 151881 150017 146334 149008 144221 149778
11519A49778N574P181m196p995R933P220m053J129n099l931N580J63L334k945
11505A61673j090m46J076M523j147L6L8n444k868l75K907N05m179n861j270l975
11489A44103l961r394n15O425l457P108l377p745J89p613j837M077Q774j042q717
11474A23018p859j354J554k747n802m640K76K145Q340J462R6l249k348j042L302
11459A11152J252L252l594J315k329m599n265q504p15J792P440J026J34N47J353
11444A04257o888l566K866N117M901L942J800j165l585k505O633N557l816k93
11430A13255O714K017K57n001J510m65n727M248l303m866L821L158J826P30p172
11415A11002K040N798j200l254k635L60l995l657q81K139p01n786J868J854n679
$$ plain form
11519 149778 155352 162533 158337 150342 160275 167495 163442 164571 159472 155541 161121 161284 164618 161673
11505 161673 160583 160137 161213 165736 164589 164625 164663 159219 156351 155976 158883 159388 155209 149348 148078 144103
11489 144103 140142 130748 130233 136658 133201 140309 136932 129187 129376 121763 119926 124003 132777 131735 123018
11474 123018 115159 113805 115359 112612 106810 102170 102446 104591 112931 114393 114489 111240 108892 107850 111152
11459 111152 112404 115656 112062 113377 111048 106449 101184 92680 91965 93757 101197 102223 102357 102904 104257
11444 104257 97369 93803 96669 101786 106687 110629 112429 111264 107679 105174 111807 117364 113548 113255
11430 113255 119969 121986 122243 117242 118752 118287 112560 116808 113505 108639 112460 115618 117444 118174 111002
11415 111002 113042 118840 117640 114386 111751 112111 108116 104459 103578 105717 105016 99230 101098 102952 97273
11400I7273L776M185K685l162n887K498M451K322J609N404L369J2894K030k343
11386A31104m915j178n534q222o825o129j610J094k388k618L847J648P24K242
11372A01240Q88m374r50Q985P671k206j937o659J456L465J274J25l936j369j039
11357A02634l233j695k37Q672Q177K386l632o028M002N207l428o493n406P169
11343A08095J0536j124M847N108K966M420k06P276K573J106l076r823k620K026
11329A32104K012k270K452L446r4k548k911J86J1419J455N873Q242N181O655M761
11314A75963M238j465l258k694j0072o369R273M628p06l543J821M140m295K962
11300A70623K803L883N620M245N596O48K59k381j793M880P3L080N563J1498J687
$$ plain form
11400 97273 101049 105234 107919 104757 98870 101368 105819 108141 109750 115154 118523 131417 133447 131104
11386 131104 126189 125011 119477 111255 104430 98301 96691 97785 95397 92779 96626 98274 98998 101240
11372 101240 102128 97754 96804 105789 113460 111254 109317 102658 104114 107579 108853 108978 105042 103673 102634
11357 102634 99401 97706 97469 106141 114318 116704 113072 107044 111046 116253 112825 106332 100926 108095
11343 108095 118631 117507 122354 127462 130428 134848 134642 141918 144491 145597 142521 132698 130078 132104
11329 132104 134116 131846 134298 137744 137650 135102 132191 132377 143796 145251 151124 159366 164547 171202 175963
11314 175963 180201 178736 175478 172784 162712 156343 165616 170244 169538 165995 167816 171956 167661 170623
11300 170623 173426 177309 182929 187174 192770 193418 193677 191296 189503 194383 194456 197536 203099 214597 216284
11285B16284n010l510j937N85J610P769R005M446r24K005Q511J2351N88O369L046
11270B61188N170J1699J5327J5143J5701K1274K3316L0806K7716L6929N4934O9356
11258E88559J00984J58141K72680M22134M86317L51988J69919O8747j15487l46124
11248B157858l87635k97199k11786j50480j10033q7827o7570m4039k9137j2207
11238G59945j2897j0626j3982k1389j7587j6268j5286j9811k2694j0771n396m661
11226E88577p167r049N874O621j461J1041Q326R243M347O591J1792J5002J6935
11213F66672J6559P800K1858J5333J2447K4982J5070K3134L4699L2334K4211K5419
11201I20518K7121L8533M0683M3619M1792L9389M4722N0768N7176O0439N8919
$$ plain form
11285 216284 211274 207764 205827 206412 208022 215791 224796 229242 228318 230323 238834 251185 251773 258142 261188
11270 261188 266358 278057 293384 308527 324228 345502 368818 399624 427340 464269 519203 588559
11258 588559 689543 847684 1120364 1542498 2028815 2380803 2550722 2619469 2503982 2157858
11248 2157858 1770223 1473024 1261238 1110758 1000725 912898 845328 801289 772152 759945
11238 759945 747048 736422 722440 701051 683464 667196 651910 632099 609405 598634 593238 588577
11226 588577 581410 572361 578235 584856 583395 594436 602762 612005 616352 622943 634735 649737 666672
11213 666672 683231 691031 712889 728222 740669 765651 780721 803855 838554 870888 895099 920518
11201 920518 947639 986172 1026855 1070474 1112266 1151655 1196377 1247145 1304321 1364760 1423679
11190A423679O3916P0715P0383P8080Q8291R0598J00258J01023J08653J16588
11180B312184J19841J35680J42651J43151J40294J47008J52374J57554J55629
11171C606366J56497J48618J33441J31029J26688J12672R7668R7236R4070Q3297
11161D787582O5671O0284O2139N9274M3068L5440L4262L0230K0314L291j4283
11150E187272k3012m1436m5316n3511n9721p7282q3596q4946q2187q4423p6100
11139D475742o4184m2044J5889J02421K50675L57359K35022j2361o0508N1334
11129E309345j7229k87453m42930l66725k57769j87106j40552j09700p6817m5395
11119C377669k8901j7843m993J5007K4253K0128K4737M0816N9516O6548P8180
$$ plain form
11190 1423679 1487595 1558310 1628693 1706773 1795064 1885662 1985920 2086943 2195596 2312184
11180 2312184 2432025 2567705 2710356 2853507 2993801 3140809 3293183 3450737 3606366
11171 3606366 3762863 3911481 4044922 4175951 4302639 4415311 4512979 4610215 4704285 4787582
11161 4787582 4853253 4913537 4975676 5034950 5078018 5113458 5147720 5177950 5198264 5201555 5187272
11150 5187272 5164260 5122824 5077508 5023997 4964276 4886994 4803398 4718452 4636265 4551842 4475742
11139 4475742 4411558 4369514 4385403 4487824 4738499 5095858 5330880 5318519 5258011 5309345
11129 5309345 5292116 5004663 4561733 4195008 3937239 3750133 3609581 3499881 3423064 3377669
11119 3377669 3348768 3330925 3325932 3340939 3365192 3385320 3410057 3450873 3510389 3576937 3655117
11108C655117Q8712J01568J16278J33262J50093J64092J78419J86665J97017K15994
11098E187217K26365K47139K49651K53745K54952K48944K47899K52807K48837
11089G417556K40860K24659K12713J99257J86156J77181J66691J47271J29994
11080I102338J08386J01484P4587O4025M4469J7996J290r932l4999n2547p3218
11069I343879q8353j16393j38839j50095j69201j81356j95923k13868k23956k30710
11059G635185k37462k41648k50572k47497k40505k38283k36983k23030k13222
11050E505983k08663k00753j95369j80779j64479j60937j48111j34730j30916
11041C981246j28433j12514j01990r1471q7375o5983p1363o5421n1395n0880m4134
$$ plain form
11108 3655117 3743829 3845397 3961675 4094937 4245030 4409122 4587541 4774206 4971223 5187217
11098 5187217 5413582 5660721 5910372 6164117 6419069 6668013 6915912 7168719 7417556
11089 7417556 7658416 7883075 8095788 8295045 8481201 8658382 8825073 8972344 9102338
11080 9102338 9210724 9312208 9386795 9450820 9495289 9513285 9514575 9504643 9469644 9417097 9343879
11069 9343879 9255526 9139133 9000294 8850199 8680998 8499642 8303719 8089851 7865895 7635185
11059 7635185 7397723 7156075 6905503 6658006 6417501 6179218 5942235 5719205 5505983
11050 5505983 5297320 5096567 4901198 4720419 4555940 4395003 4246892 4112162 3981246
11041 3981246 3852813 3740299 3638309 3546838 3459463 3393480 3322117 3256696 3205301 3154421 3110287
11030C110287l2403j9565j7503J571J0754J0856J8379L6322M1402M6707N7074
11019C263881O9210Q1345Q8912R7635R9668J12521J22282J28658J27190J29251
11009D320553J29006J16114J11584J09869R3048Q5021Q6515O2871N1924M9859
10999E216364L5123K4635J9248O226M260Q185j0275k0533l2776k8678l8538m6028
10987E137213o7450q1751q8694j06214j18545j20930j32260j30797j40659j57593
10977C992320j51381j43272j41550j36215j36028j32782j29770j29864j30228
10968B761230j21517j05402j01443r7712r9536r1972q3793q1016p5750p0587p3968
10957A758534p2468o2335o4091o2217n5855m3642l4992m7781m8840m6164l3061
$$ plain form
11030 3110287 3077884 3058319 3040816 3042387 3053141 3063997 3082376 3118698 3160100 3206807 3263881
11019 3263881 3333091 3414436 3503348 3600983 3700651 3813172 3935454 4064112 4191302 4320553
11009 4320553 4449559 4565673 4677257 4787126 4880174 4965195 5051710 5114581 5166505 5216364
10999 5216364 5251487 5276122 5295370 5301596 5305856 5314041 5303766 5283233 5250457 5221779 5183241 5137213
10987 5137213 5069763 4988012 4899318 4793104 4674559 4553629 4421369 4290572 4149913 3992320
10977 3992320 3840939 3697667 3556117 3419902 3283874 3151092 3021322 2891458 2761230
10968 2761230 2639713 2534311 2432868 2335156 2235620 2143648 2059855 1978839 1903089 1832502 1758534
10957 1758534 1686066 1623731 1559640 1497423 1441568 1397926 1362934 1315153 1266313 1220149 1187088
10946A187088l5825k6167l0339k9553k5643k4835k8614k8527k4269j6398j9638
10935H97280k7388k2553j8121j7416j5817j8347j5730j5212j3099j2429j2331
10924G08837j7093j6610j7570k1532q777q568p109m732j2689q572j2123j1913
10912E61549p396l546n492k0463q666l236o218r739j3519j3756j2849r300l923
10899D43446J923j0156j0309p955m64N825o914j0871j1928p144l189K05j186Q91
10885C82174q389j0509j6874o845q115M99O55l273l489p189n954J872K950J617
10871C19130r88j1207r173l680l10m826j210K724n539J765p174l051L527K925
10857B82913r54p025q978J47M03o18k825k3j0248J220j341q476r052j211k628
$$ plain form
10946 1187088 1151263 1125096 1094757 1065204 1039561 1014726 986112 957585 933316 916918 897280
10935 897280 869892 847339 829218 811802 795985 777638 761908 746696 733597 721168 708837
10924 708837 691744 675134 657564 636032 627255 618687 611578 606846 594157 585585 573462 561549
10912 561549 554153 550607 545115 524652 515986 512750 506532 496793 483274 469518 456669 447369 443446
10899 443446 445369 435213 424904 416949 416485 422310 415396 404525 392597 385453 382264 382469 381283 382174
10885 382174 373785 363276 346402 339557 331442 331941 332596 329323 325834 318645 312691 314563 317513 319130
10871 319130 318142 306935 297762 294082 293772 288946 287736 290460 284921 286686 279512 276461 279988 282913
10857 282913 281959 274934 265956 266103 266506 265888 263063 263040 252792 254012 252671 244195 235143 233932 231304
10842B31304k997J129k0p936m461l934q411n965m570K064j896M232K628k373n718
10827A93076o404k283n739L277M013n660j2548n678J918L866q61K781l072l27
10813A66359M941N137m137l992j711o989j1063n502q75r72N36m87m7p147n438
10798A28613K76k218o876J159m396l873K545K33L494n30o502j566M782K740J206
10783A19087J456m397j717K451o593j847L727N981j256o697m487L989j718o266
10769A01713k112l807J712K758L978L780j0540o662L203L190Q468J577j487r354
10755I6417k770L300K584J469k213L254O603j250J030k33l632o505K55J080k29
10740I9160l825r336K500O185O608l309p374o086K628j186K307m717P31j748N569
$$ plain form
10842 231304 228307 229436 229416 221480 217019 213085 204674 198709 194139 196203 194307 198539 201167 198794 193076
10827 193076 186672 184389 178650 181927 185940 180280 167732 162054 163972 167838 166977 169758 166686 166359
10813 166359 171300 176437 172300 168308 166597 159608 148545 143043 142168 141196 141732 141245 141198 134051 128613
10798 128613 128889 126671 119795 120954 116558 112685 115230 115463 118957 118427 111925 110359 115141 117881 119087
10783 119087 120543 116146 114429 116880 110287 108440 112167 118148 116892 110195 105708 109697 107979 101713
10769 101713 99601 95794 97506 100264 104242 108022 97482 90820 94023 97213 105681 107258 105771 96417
10755 96417 93647 96947 99531 101000 98787 102041 108644 107394 108424 108191 104559 98054 98309 99389 99160
10740 99160 95335 85999 88499 94684 101292 97983 90609 84523 87151 85965 88272 83555 84286 82538 88107
10725H8107Q974j623n738j097l28j291m405j856n934K499n09M356P745M097J825
10710I4822j5776q107p24j922m05O968N859R50l377m90m046j851K983N781k87
10695H0378m645P357Q94J00J0982l572p222m970L128n352m876K707K037o813J959
10680G2092J993k935O656M091M956K581l166l996J373m863j688K856r93k28J905
10665H0634J837L336J3044l254r681o94j490K51J795m213k625R52Q493J1958O880
10650A07223j185n333P96n221k332K648r9K525q03K483k379j076M544k99j3307
10635H8185m931j523O183P614l52m430n449k183K940K951Q596j730j1858p406
10621G6607N1l264k164k287j622M910k697q722J686O110k762m318j954l484n616
$$ plain form
10725 88107 97081 95458 89720 88623 88295 87004 82599 80743 74809 77308 76799 81155 88900 92997 94822
10710 94822 79046 70939 70215 68293 67888 74856 80715 81665 78288 77798 73752 71901 74884 80665 80378
10695 80378 75733 83090 83984 84084 95066 91494 84272 79302 82430 77078 72202 74909 76946 70133 72092
10680 72092 74085 71150 77806 81897 86853 89434 86268 82272 83645 78782 77094 79950 78957 78729 80634
10665 80634 82471 85807 98851 95597 85916 85222 83732 83983 85778 81565 78940 79892 88385 100343 107223
10650 107223 106038 100705 101501 96280 93948 96596 96497 99022 98219 100702 98323 97247 101791 101492 88185
10635 88185 83254 81731 87914 95528 95176 90746 85297 83114 86054 89005 97601 95871 84013 76607
10621 76607 76658 73394 71230 68943 67321 72231 69534 60812 62498 68608 65846 61528 59574 56090 50474
10606E0474J550P162L836q03k338N343J062j136L490j863n620J319J290K63J225
10591F5254J490N253K356m080M57o82K449j026k017n853r47N004m564J264O31
10576F4989l437j450M413r19o30O776P75M185O227l442l902k248L056J578k135
10561G3836K43P913M591m194n947R8l506l067M647O357K521l835L633j289m113
10546G7888q235o528j721R62L841m204m228l864M945K261m542L719O551j027N285
10531G1103M751l17k926L11j16L850l150L844J653o336n213l143j504n042k340
10516E5425M042L43m578M046J52j350K274L031j394o530K046n262J267N402m098
10501E4816L945J0m927J482P067M49M337k539K304J268l733n41j784O631r74l40
$$ plain form
10606 50474 52024 59186 63022 62219 59881 65224 66286 65150 68640 66777 61157 62476 63766 64029 65254
10591 65254 66744 71997 74353 70273 70730 70048 72497 71471 69454 63601 62654 67658 63094 64358 64989
10576 64989 61552 60102 64515 63596 62966 69742 70517 74702 80929 77487 73585 71337 74393 75971 73836
10561 73836 74079 81992 86583 82389 76442 76540 73034 69967 74614 80971 83492 79657 83290 82001 77888
10546 77888 69653 63125 61404 62366 66207 62003 57775 53911 58856 61117 56575 60294 66845 65818 71103
10531 71103 75854 75537 72611 72922 72806 76656 73506 77350 79003 72667 67454 64311 62807 57765 55425
10516 55425 59467 59810 55232 59278 59430 58080 60354 63385 61991 55461 57507 52245 53512 58914 54816
10501 54816 58761 58771 53844 55326 62393 62842 67179 64640 66944 68212 64479 63938 62154 68785 67811 67471
10485F7471k361K169L470o667R55L151L659n53L042k82K996R920R04m042p065
10470G6767l55M790M087n810M06R72l534o761m326q34l52P533P695N507l986J995
10454H3794J580j764k657O29n11K521M803L392O1m941qQ99j537k215q626J512
10438G6932J6181Q259n047p619l664M535O665m64m773P142J586K08o4K445J966
10423A04288J710l259J051l022R19K103J164m366P457J159R373J459l364O965
10409A23637k974n320M475N126O182J270k579O807L648Q36Q005j079l097J77P575
10394A52689J2452l491k459k513M692P176R271M507j0902m041M746R030K931N640
10380A89728L682r41O804K174n739p227J879J799m549K889K535L027q287J023
$$ plain form
10485 67471 65110 67279 70749 64082 65037 68188 71847 71294 74336 74054 77050 86970 87874 83832 76767
10470 76767 76412 81202 85289 79479 79885 80857 77323 70562 66236 65402 65050 72583 80278 85785 81799 83794
10454 83794 85374 83610 80953 81582 81071 83592 88395 91787 91848 86907 86899 87798 86261 84046 75420 76932
10438 76932 93113 101372 96325 88706 85042 89577 96242 95778 91005 98147 99733 99941 99877 102322 104288
10423 104288 105998 102739 103790 100768 101687 103790 104954 100588 108045 109204 118577 120036 116672 123637
10409 123637 120663 115343 119818 124944 131126 132396 129817 136624 140272 141108 149113 148034 144937 145114 152689
10394 152689 165141 161650 159191 156678 161370 168546 177817 182324 171422 167381 172127 181157 184088 189728
10380 189728 193410 192469 199273 201447 195708 188481 190360 192159 187610 190499 193034 196061 187774 188797
10366A88797J046l294k923J661O065J176l188J462L40k889m457K132j743n460
10352A78725k537K604l515L69O981K633J527n244n940o590M239k13k073k692k637
10337A65637N478O521M772J657m413N759K472J203j14n447o667J936P171j416
10323A84549j871R080k772k544M855O238j930q686k375L50O226j100p058M770
10309A87732N407M004O642O316J505Q003J148P62J306q205n608l710k167O64P64
10294B04563m409m720k742N431n489r136j914O34J592j382l493N821r11m356J044
10279A80533o481p015k151J50K713Q373K19m593r122j0873k35J753p078n054L468
10264A44607M725o619j594k975k785O23P465J726l116j677Q632O427P47q034j372
$$ plain form
10366 188797 189843 186549 183626 185287 191352 192528 189340 190802 191142 188253 183796 185928 184185 178725
10352 178725 176188 178792 175277 175646 182627 185260 186787 181543 175603 169013 173252 173039 170966 168274 165637
10337 165637 171115 177636 182408 184065 179652 185411 187883 189086 188972 183525 176858 178794 185965 184549
10323 184549 182678 191758 188986 186442 191297 197535 195605 186919 184544 184894 191120 190020 182962 187732
10309 187732 193139 197143 203785 210101 211606 219609 220757 221519 222825 214620 209012 205302 203135 203799 204563
10294 204563 200154 195434 192692 198123 192634 183498 181584 182218 183810 182428 178935 184756 183845 179489 180533
10279 180533 174052 167037 164886 165036 167749 176122 176341 171748 162626 151753 151518 153271 146193 141139 144607
10264 144607 149332 142713 141119 138144 135359 135982 143447 145173 142057 140380 149012 155439 156186 148152 146780
10249A46780J400O87k804k100K221L907k662j0996l666R35K967N553K117M141
10235A48480O526K817K616J990L032P004N040k360j0055k30l181J367k510j0095
10221A50441j107L28j683l020r36j478K339J895n405J782J311J080l940J889N758
10206A49254n254j50L504j789N79K754K638j0582j2476k286j751M091n403k314
10192A20815P801O664L0j0194j570K703J635J32q0K66M351K616p11l128l219L958
10176A32069L877k391r178r110q84p254j093r75O240Q183l950l882j540P952L33
10161A18397j097M815N216J844J508q079k523K863K863Q316N241J140p596o614
10147A26294q060L101j984l831R560N396q337n510M594L761Q79K15j642J253q84
$$ plain form
10249 146780 148180 148867 146063 143963 146184 150091 147429 136433 132767 133702 136669 142222 144339 148480
10235 148480 155006 157823 160439 162429 165461 172465 177505 175145 165090 164860 161679 163046 160536 150441
10221 150441 149334 149662 147979 144959 144023 142545 144884 146779 141374 143156 144467 145547 141607 143496 149254
10206 149254 144000 143850 147354 145565 146144 148898 151536 140954 128478 126192 124441 128532 123129 120815
10192 120815 128616 135280 135310 125116 123546 126249 127884 128016 127936 128202 132553 135169 134458 131330 128111 132069
10176 132069 135946 133555 124377 115267 114383 107129 106036 105061 111301 119484 115534 111652 110112 118064 118397
10161 118397 117300 122115 127331 129175 130683 122604 120081 122944 125807 134123 139364 140504 132908 126294
10147 126294 118234 121335 119351 115520 125080 130476 122139 116629 121223 124984 125863 126078 124436 125689 124805
10132A24805J199L705J063n797m255R23O60K739N56l590m344L292q1p76M679m418
10116A20360l933L932L062O821J952J407J440J195j73R788l203l614M879j369
10102A42544r81J101j813J399K883q27n558O66J884o00J964J06q655j609O960
10087A39464Q013O625q38m230q878q30K142M712k17P8O654M143N714k986l621
10072A55945J948k76K858o903m099N955J0173P713k450l795O228j487r307o997
10058A55506M452L092O933K226k691J922L857k264L319M918K967j197l591K342
10044A81791Q664N803J0744R271j252J923M119J1467Q657J947J653J2160P325
10031B64272J3350R700J2806M395J1273J9086J5514J5279J0880J5028J9140J6787
$$ plain form
10132 124805 126004 129709 130772 124975 120720 121643 122303 125042 125598 122008 117664 120956 120875 120099 124778 120360
10116 120360 116427 120359 123421 130242 132194 133601 135041 136236 136063 145851 142648 139034 143913 142544
10102 142544 141563 142664 140851 142250 145133 144306 138748 139414 141298 140698 142662 142768 134113 132504 139464
10087 139464 147477 154102 153264 149034 140156 139326 141468 146180 145963 146041 152695 156838 162552 159566 155945
10072 155945 157893 157617 160475 153572 149473 155428 165601 173314 170864 167069 173297 171810 162503 155506
10058 155506 159958 163050 169983 172209 169518 171440 175297 173033 176352 181270 184237 183040 179449 181791
10044 181791 190455 196258 207002 216273 215021 216944 221063 232530 241187 243134 244787 256947 264272
10031 264272 277622 287322 300128 304523 315796 334882 350396 365675 376555 391583 410723 427510
10019D27510K7844L1336L3867L7529L9085N5671N8359P0631R3787J03698J15736
10008A095053J41829J60171J73018J84268J78500J63120J48149J39883J40960
9999B524951J38334J44278J63849J91757K15245K28477K40556K42481K48189K52516
9989D590633K75470L19088L59962L62046L37842K98188K70139K41752K01927J59544
9979G416591J18708J15733J43403J86978K11785J94183J37051O9698K1818M137
9969H620085J6624K9454L3226J6230J1506L0683N3274N8728K7939P60j2706j8276
9957H867527l6079p2427j17024j61170j75128j66707j48047j59397k04118k56179
9947G371251k88858k81557k64809k59644k54191k57606k72227k75874k57149k23753
$$ plain form
10019 427510 455354 486690 520557 558086 597171 652842 711201 781832 875619 979317 1095053
10008 1095053 1236882 1397053 1570071 1754339 1932839 2095959 2244108 2383991 2524951
9999 2524951 2663285 2807563 2971412 3163169 3378414 3606891 3847447 4089928 4338117 4590633
9989 4590633 4866103 5185191 5545153 5907199 6245041 6543229 6813368 7055120 7257047 7416591
9979 7416591 7535299 7651032 7794435 7981413 8193198 8387381 8524432 8594130 8615948 8620085
9969 8620085 8636709 8666163 8699389 8715619 8727125 8757808 8811082 8869810 8897749 8898509 8885803 8867527
9957 8867527 8831448 8759021 8641997 8480827 8305699 8138992 7990945 7831548 7627430 7371251
9947 7371251 7082393 6800836 6536027 6276383 6022192 5764586 5492359 5216485 4959336 4735583
9937D735583j96680j57835j27284r0303n3881l6480n1777p2245r1182r6918p7488
9926C683510l2752M1870R8552J32799J29922Q6173L5760N954K2561M6305Q6668
9915D337322J45091J86917K27636K78556L16934L20715L23865L22042L23454L64818
9905G147350M01471L94786L55326L00685K56041K44926K74044L06345L05909K77852
9895A0264735K20715J78919J55681J35178J04330N4159J4979j552J2519L0809
9885A1170472M0530L6114L5736M9314P0890N8886l33q0594j53762j77538j58002
9874A0891713j07441o2233o7862j09459j60511k07654k51109k85856l43235l99302
9864H897051m16681m05481l77911l54050l48822l47912l42221l33540l14764k76988
$$ plain form
9937 4735583 4538903 4381068 4253784 4163481 4109600 4073120 4021343 3949098 3857916 3760998 3683510
9926 3683510 3650758 3692628 3791180 3923979 4053901 4140074 4175834 4181788 4204349 4250654 4337322
9915 4337322 4482413 4669330 4896966 5175522 5492456 5813171 6137036 6459078 6782532 7147350
9905 7147350 7548821 7943607 8298933 8599618 8855659 9100585 9374629 9680974 9986883 10264735
9895 10264735 10485450 10664369 10820050 10955228 11059558 11113717 11128696 11127144 11139663 11170472
9885 11170472 11211002 11247116 11282852 11332166 11403056 11461942 11461609 11381015 11227253 11049715 10891713
9874 10891713 10784272 10722039 10654177 10544718 10384207 10176553 9925444 9639588 9296353 8897051
9864 8897051 8480370 8074889 7696978 7342928 6994106 6646194 6303973 5970433 5655669 5378681
9854E378681k44129k27652k03504k01295k06230k11373k30042k54003k70241k71682
9844C058530k60182k36581k21059j94472j78310j51951j34001j25143j18317r9727
9834A338787r7892q3561p3399p2305n4856n3944m6628m9225m1515l5836l4056
9823F95570l2333l1554l0226k4225l3011k1790j6593j1438k0359j5849j4553j6577
9811D27062j1975o853q208m329r537n069P66M325m80n658q407r689j6932m770
9797C40246m962k896p358J546K797j461K136p457p436n602p097m424p010k966
9783B88056p543p449q06j402j800k114p774n778j756j203m210j622J481o26k869
9768B42585J580j982R61J159J870N376k491j949o466l418P78p046o948K89J3876
$$ plain form
9854 5378681 5134552 4906900 4703396 4502101 4295871 4084498 3854456 3600453 3330212 3058530
9844 3058530 2798348 2561767 2340708 2146236 1967926 1815975 1681974 1556831 1438514 1338787
9834 1338787 1240895 1157334 1083935 1011630 956774 902830 856202 806977 765462 729626 695570
9823 695570 663237 631683 601457 577232 544221 522431 505838 494400 474041 458192 443639 427062
9811 427062 415087 408234 400026 395697 386160 381091 381857 386182 385702 380044 371637 361948 345016 340246
9797 340246 335284 332388 325030 326576 329373 327912 330048 322591 315155 309553 302456 298032 291022 288056
9783 288056 280513 273064 272258 270856 269056 266942 259168 253390 251634 250431 246221 244599 246080 245454 242585
9768 242585 244165 242183 243144 244303 246173 251549 249058 247109 240643 237225 238003 230957 224009 224298 238174
9753B38174L736R05N672L823Q269J4743l418n797L170L602M770k590p183j493
9739B66383l845m170j810J78o31m21m706J44L388j970k216Q044o246J573K621
9724B56316n135L859L648J75M562N992J499K652j994l783p673M80K31O190M862
9709B71881m942q519q666j192O633M744j946m182J513r01n545m718K945J502j606
9694B47001k620o089o282J0546N959J511l841K784K57k049l706j393N989Q78N191
9679B54136J1147P666N562L998L404O412O365J674L180J3823r16P86K673K62P16
9664C20888M36q18j801Q55N28J527L232M723N306m983r27l692Q16O089m98j483
9648C30198M5N879P18M497L866K924O373J0813J3250O304K464K129m461j401M393
$$ plain form
9753 238174 241910 242815 248487 252310 260579 275322 271904 266107 269277 272879 277649 275059 267876 266383
9739 266383 262538 258368 256558 256736 256105 255684 250978 251122 254510 252540 250324 258368 252122 253695 256316
9724 256316 251181 255040 258688 258863 263425 269417 270916 273568 271574 267791 260118 260598 260829 267019 271881
9709 271881 266939 258420 249754 248562 255195 259939 257993 253811 255324 254423 248878 244160 247105 248607 247001
9694 247001 244381 238292 232010 242556 248515 250026 246185 248969 249226 247177 243471 242078 248067 248945 254136
9679 254136 265283 272949 278511 282509 285913 292325 298690 300364 303544 317367 316451 317237 319910 320172 320888
9664 320888 321324 320506 318705 319560 320088 321615 324847 329570 334876 329893 328966 325274 326090 332179 331681 330198
9648 330198 330243 336122 336840 341337 345203 348127 354500 365313 378563 384867 387331 389460 384999 383598 387991
9633C87991O57q429m36L064Q152n357j227r58k223N415J3629P614J778L341l706
9618D09305Q55j963P294n626k867J557J323k628L343J0578M543N748K428l874
9604D30016O20N128P855J0108N926L361M026O341M837O290O320M870M464N371
9590E05533J483K440j352N69L899Q453L120Q83J67L25k061p46P708R493M825Q419
9574E53158Q621P748J2804J0459m70J724l749P50P495Q210K393l105k485O986
9560F10539Q490N786M78O759J959k877P88M699o464j594J726O174o086k791M478
9545F32064L628l488J16N61m714k38L168k668J850K08k428j121M564M699n633
9530F30568j2308r017l233o328n069L337p520l914l107p205o667J702j758l6k11
$$ plain form
9633 387991 388648 380219 379783 382847 390999 385642 384415 383457 381234 386649 400278 407892 409670 413011 409305
9618 409305 410160 408197 415491 409865 406998 408555 409878 407250 410593 421171 425714 431462 433890 430016
9604 430016 430636 435764 443619 453727 459653 463014 467040 473381 478218 484508 490828 495698 500162 505533
9590 505533 507016 509456 508104 508673 512572 521025 524145 525028 525195 525520 523459 522713 530421 539914 544739 553158
9574 553158 561779 569527 582331 592790 592320 594044 590295 591045 598540 606750 609143 606038 603553 610539
9560 610539 619029 624815 625293 632052 634011 631134 631922 636621 630157 628563 630289 636463 630377 627586 632064
9545 632064 635692 632204 632320 632881 628167 627929 631097 628429 630279 630487 628059 626938 631502 636201 630568
9530 630568 618260 609243 606010 599682 594613 597950 590430 586516 583409 576204 569537 571239 569481 569445 569234
9515E69234L34k012o635j914j675n443m067q765m036o863r82M010J273k234o678
9500E23547q70N80J322O739P966P604N427M350L390J0385K956M812J286j133M389
9485E82750j039k217j083k624l691j06J739l951q788k839l485k994J2741J6126
9471E80539N266N743J0573P944M950P080M038l480k15k101J698l543J402m564
9457F15330l709Q34m582M409P201P838J0117J3699J5193J3969M862L384J2451
9444G00996Q893J2188J3201J0739J2315J3034J5842K0397K6517L1871N0988N3661
9432I70642N4208O1628P3902Q8004J09566J38367J65967J97960K37238K80200
9422B377682L12089L41354L59979L36617K66695J57036M0214n5202j27816j72513
$$ plain form
9515 569234 569568 567556 560921 559007 557332 551889 547822 539057 535021 528158 527176 531186 532459 530225 523547
9500 523547 522677 523257 524579 531318 539284 546888 552315 556665 560055 570440 573396 578208 579494 578361 582750
9485 582750 581711 579494 578411 575787 572096 571990 573729 569778 560990 558151 554666 551672 564413 580539
9471 580539 585805 591548 602121 610065 615015 622095 626133 622653 622438 620337 622035 618492 619894 615330
9457 615330 611621 612455 607873 612282 619483 627321 637438 651137 666330 680299 685161 688545 700996
9444 700996 709889 722077 735278 746017 758332 771366 787208 807605 834122 865993 916981 970642
9432 970642 1024850 1086478 1160380 1248384 1357950 1496317 1662284 1860244 2097482 2377682
9422 2377682 2689771 3031125 3391104 3727721 3994416 4151452 4191666 4136464 4008648 3836135
9412C836135j97691j99918j95294j86002j59229j43615j14339q0108n8944m0308
9402B460687j4294K0152N2167P7058J14449J48368J79109K11905K51940K85923
9392C787464L02726K72721J80028N3501o8663j60405k14608k28536k25644k19481
9382C479103k08782j97278j99596j93319j71531j44322j22816j00960r0358q2885
9372A967256p1559n1628n3518m8637m8999m1894l1315j8902m852N051J6305K0716
9360A638024L8119N2991N5244P5091J03034J23513J52095J84291K17217K71049
9350B910668L23378L93571M67818N42632O06119O65401P07428P04304O32213M99270
9340H452802L33236J63808L7079k3038l7728n4775j07579k00235l07148l81667
$$ plain form
9412 3836135 3638444 3438526 3243232 3057230 2898001 2754386 2640047 2559939 2500995 2460687
9402 2460687 2446393 2466545 2518712 2595770 2710219 2858587 3037696 3249601 3501541 3787464
9392 3787464 4090190 4362911 4542939 4596440 4527777 4367372 4152764 3924228 3698584 3479103
9382 3479103 3270321 3073043 2873447 2680128 2508597 2364275 2241459 2140499 2050141 1967256
9372 1967256 1895697 1844069 1790551 1741914 1692915 1651021 1619706 1600804 1595952 1601003 1617308 1638024
9360 1638024 1676143 1729134 1784378 1859469 1962503 2086016 2238111 2422402 2639619 2910668
9350 2910668 3234046 3627617 4095435 4638067 5244186 5909587 6617015 7321319 7953532 8452802
9340 8452802 8786038 8949846 8986925 8963887 8926159 8871384 8763805 8563570 8256422 7874755
9330G874755m13965l94519l38214k75360k08084j34326m7494L3164J05629J89133
9320F390719K79878L75315M70929N49513N89938N78754M84341L11905J13026q2448
9310A0061870k08560k68916k95557l07870l44099l99388m61853m90903m91328
9301F793396m61838m09404l59666k94477k49999k07728j58133j09614p6734o5728
9291D400075n7236p0927r1708j12097j33770j51338j68165j66757j56708j30845
9281C160524j04335q0219m5759O95L2376N3442R3876J33571J78737K26980K78151
9270C928039L34932L94266M47410M90125M83849M34257L65203L24035K97274L13771
9260G813161L15350K94484K04739M6946j33170k76440l90134m33407m30794m02862
$$ plain form
9330 7874755 7460790 7066271 6728057 6452697 6244613 6110287 6062793 6095957 6201586 6390719
9320 6390719 6670597 7045912 7516841 8066354 8656292 9235046 9719387 10031292 10144318 10061870
9310 10061870 9853310 9584394 9288837 8980967 8636868 8237480 7775627 7284724 6793396
9301 6793396 6331558 5922154 5562488 5268011 5018012 4810284 4652151 4542537 4465803 4400075
9291 4400075 4342839 4271912 4180204 4068107 3934337 3782999 3614834 3448077 3291369 3160524
9281 3160524 3056189 2975970 2930211 2930906 2963282 3016724 3110600 3244171 3422908 3649888 3928039
9270 3928039 4262971 4657237 5104647 5594772 6078621 6512878 6878081 7202116 7499390 7813161
9260 7813161 8128511 8422995 8627734 8674680 8541510 8265070 7874936 7441529 7010735 6607873
9250F607873l54262k95163k25455j54496q6361j7142O2309J36159K26683L07606
9240F207751L68315M11625M01965L23972K26166J35615Q8513Q3550J02110P9824
9230H429406p403j39219k84041l83193m45676m95919n23164n27258m94511m35284
9220D693738l81209l41356l02231k53804k25786k10535j88655j69256j54680j47933
9210B318293j41762j30039j14295j06489q6677p1477o1939n7596n2161m7680m0775
9199A407403l8307l0775p813R414J5812L7114N8536Q1641J07528J28587J37347
9188A906487J56615J55428J73560K05143K28138K53203K65737K27531J14110o3727
9178C622225j98867k31690k21657k00738j85052j69059j50741j14444q8767q2803
$$ plain form
9250 6607873 6253611 5958448 5732993 5578497 5492136 5474994 5537303 5673462 5900145 6207751
9240 6207751 6576066 6987691 7389656 7713628 7939794 8075409 8163922 8247472 8349582 8429406
9230 8429406 8422003 8282784 7998743 7615550 7169874 6673955 6150791 5623533 5129022 4693738
9220 4693738 4312529 3971173 3668942 3415138 3189352 2978817 2790162 2620906 2466226 2318293
9210 2318293 2176531 2046492 1932197 1825708 1739031 1667554 1605615 1548019 1495858 1448178 1407403
9199 1407403 1369096 1338321 1330508 1339922 1355734 1392848 1451384 1533025 1640553 1769140 1906487
9188 1906487 2063102 2218530 2392090 2597233 2825371 3078574 3344311 3571842 3685952 3622225
9178 3622225 3423358 3191668 2970011 2769273 2584221 2415162 2264421 2149977 2061210 1978407
9168A978407n5278k3443m732K0180M0713N0315O2371Q8950J11515J34070J60335
9157B563403J71500J76510J62249J11303M7793l5637j06461j69794k05660k13745
9147B501461k13285j97604j64318j35764j07658j05215r6457p2125n6125m8012
9137A304898l5828k4216l7092o6616p7557q4532n9161m3463m6456m1844l6642
9126G51491k7940k8970k0172n022j1822n545q495j2493q365j1496q421o89r255
9113E92806j6780j7193j2141j0584j5435j1644q798n875j209r65R749N899K001
9100E09831o58M336l36p789j0207j6702j3413j3980n736M56N212R725j687j2305
9086D46747r621j2429j4751l9752o0402m8825k4744j7486m308O471J6003R535
$$ plain form
9168 1978407 1923129 1899686 1894954 1915134 1955847 2006162 2068533 2157483 2268998 2403068 2563403
9157 2563403 2734903 2911413 3073662 3184965 3232758 3197121 3090660 2920866 2715206 2501461
9147 2501461 2288176 2090572 1926254 1790490 1682832 1577617 1481160 1409035 1352910 1304898
9137 1304898 1269070 1244854 1207762 1141146 1063589 979057 919896 876433 829977 788133 751491
9126 751491 723551 694581 674409 669387 657565 652020 643525 631032 622667 611171 602750 602061 592806
9113 592806 576026 558833 546692 536108 520673 509029 500231 494356 493147 492182 501931 507830 509831
9100 509831 509173 513509 513173 505384 495177 478475 465062 451082 445346 445802 451014 460739 459052 446747
9086 446747 437126 424697 409946 370194 309792 260967 236223 218737 214429 220900 236903 246438
9074B46438j497r838j8348o703m25J620J174K869O021N210J1148J0093J327l734
9060B45355m719L794L701L013m868j0662n238n510j0194j4171J722J7596L7076
9047B56895M8127L6719N726j4180k435N967J1036Q160O48m371k177O166K6046
9034C82327K1612J1247J1620P547J4083J3472O220K135m261n516P534J8207J9400
9021E05627J4898J1237J7797K9982P054j9050l2716j7634j3101j920m11J1718
9009E13481K4590J9932R008J8522M6810M6995K7551K1501K1595K1920L0857K9884
8997H32646L3975K4264J7127K0482J9951J1050P041M535j969o974j5402k1176
8985I25550j6682j3912l810O15l258j3835j9463o693J4164K4152J7905O682L255
$$ plain form
9074 246438 244941 235103 216755 210052 209627 211247 212421 215290 221311 226521 237669 247762 249089 245355
9060 245355 240636 244430 248131 251144 246276 235614 230376 224866 214672 200501 202223 219819 256895
9047 256895 305022 341741 347467 333287 330852 336819 347855 356015 356663 352292 350115 356281 382327
9034 382327 403939 415186 426806 434353 448436 461908 468128 470263 466002 460486 468020 486227 505627
9021 505627 520525 531762 549559 579541 586595 567545 534829 517195 504094 502174 501763 513481
9009 513481 538071 558003 567011 585533 632343 679338 706889 728390 749985 771905 802762 832646
8997 832646 866621 890885 908012 928494 948445 959495 966536 971071 969102 962128 946726 925550
8985 925550 908868 894956 891146 891761 888503 874668 855205 848512 862676 886828 904733 911415 914670
8972I14670j613J136K4626M0375M3578M1217L9354L8053K4934R580Q234J1348
8960A195492K5779M1167M2401L8504M0157K9811K1824J6928L5044M7732L6431
8949A571270L3404L9393L7312N4552O7572P4007R3860J08260R4201R0644J06391
8938B370866J24289J40253J41150J23374J12302J19537J23824J34602J42182J78218
8928C710597K29350K70535L06978L30799L40312L23882K98437K99560L21495L74197
8918F806142N14237O99055Q15124P97402O95947O71287P80553R72212J217293
8909A3969252J476968J788835K166227K672915L353141M078793M579108M896956
8901C8982195N644975P251123R712808J3151545J8114416K5606963L7371695N5013057
$$ plain form
8972 914670 913057 914193 938819 979194 1022772 1063989 1103343 1141396 1166330 1175910 1184144 1195492
8960 1195492 1221271 1262438 1304839 1343343 1383500 1413311 1435135 1452063 1487107 1534839 1571270
8949 1571270 1604674 1644067 1681379 1735931 1803503 1877510 1971370 2079630 2173831 2264475 2370866
8938 2370866 2495155 2635408 2776558 2899932 3012234 3131771 3255595 3390197 3532379 3710597
8928 3710597 3939947 4210482 4517460 4848259 5188571 5512453 5810890 6110450 6431945 6806142
8918 6806142 7320379 8019434 8834558 9631960 10327907 10999194 11779747 12751959 13969252
8909 13969252 15446220 17235055 19401282 22074197 25427338 29506131 34085239 38982195
8901 38982195 44627170 51878293 61591101 74742646 92857062 118464025 155835720 210848777
8893B10848777P5011848P6868654L3985742k9468358n9493801n3973272m1824310
8886B11955280l3298501k7157947k1836877j7092456j3062605r799671p181890
8879H2525333n061384l492679k707282k708719l507271m675839n224314m963646
8871E0184199m318714l590073k906134k604727k851916l023629k805087k559450
8863B5524469k355041k109506j847201j624596j434790j245369j049713q99699
8855A2958554q01098p42387p03607o80510o45136o09150n63064n14218m84498
8846G214886m41188l76276l21077k69594k08492j32721m6490M0889J21324J62813
8836E744074K06577L00162M69280O73034R54297J380853K019407L078406M911426
$$ plain form
8893 210848777 285860625 362729279 396715021 367246663 307752862 253779590 211955280
8886 211955280 178656779 151498832 129661955 112569499 99506894 89707223 82525333
8879 82525333 77463949 73971270 71263988 68555269 65047998 60372159 55147845 50184199
8871 50184199 45865485 42275412 39369278 36764551 33912635 30889006 28083919 25524469
8863 25524469 23169428 21059922 19212721 17588125 16153335 14907966 13858253 12958554
8855 12958554 12157456 11415069 10711462 10030952 9385816 8776666 8213602 7699384 7214886
8846 7214886 6773698 6397422 6076345 5806751 5598259 5465538 5419048 5459937 5581261 5744074
8836 5744074 5950651 6250813 6720093 7393127 8347424 9728277 11747684 14826090 19737516
8827A9737516P508163Q905146M892367k895775o712850n808416m254085l298269
8819A8073797k661072k110958j623295j221030r14955o81949m82498l21800k14604
8810G841636k05271k97365l95984m27234l90777l29186k84267k59328k38705j86639
8800D826880j22873p3989k3359J9456P6196J72581L19097M46116N15504O08526
8790F764135P98673J068027J403282J927805K700151L859879N849623R499590
8782C3871165J5564228K0508959J2147265o845430j5311771j2282023q634407
8775C9017986o599329n278076m153757l183770k388037j785819j345282r62877
8767A3321039o44073m22731l39034n05538p74686q81532q56283p72512o79713
$$ plain form
8827 19737516 27245679 36150825 41043192 38147417 31434567 25626151 21372066 18073797
8819 18073797 15412725 13301767 11678472 10457442 9542487 8860538 8378040 8056240 7841636
8810 7841636 7636365 7339000 6943016 6515782 6125005 5795819 5511552 5252224 5013519 4826880
8800 4826880 4704007 4630018 4606659 4626115 4702311 4874892 5193989 5640105 6155609 6764135
8790 6764135 7562808 8630835 10034117 11961922 14662073 18521952 24371575 33871165
8782 33871165 49435393 69944352 82091617 75246187 59934416 47652393 39017986
8775 39017986 32418657 27140581 22986824 19803054 17415017 15629198 14283916 13321039
8767 13321039 12676966 12254235 11915201 11409663 10634977 9753445 8897162 8124650 7444937
8758G444937o09465n54948m65436l71593k92547k43674k04159j48599p1048N486
8748D488954Q7624J70044K53942L48382M81699O54463Q97951J269243J822773
8739A0475075K734754M294232O648178Q503504N859810j558479o406477o044020
8731B4506577m417767l351467k662294k118423j645766j257579r41965p14807
8723G396509n43582l82163k59882k04707k54573l71702m25931m13407l65908l30646
8713C844008l25264l12088k64509k14842j87970j66458j49523j20505j17300j11343
8703A874206r4080r5369q8757r3399r6712q6477q0821p5270n9073n3132m0322
8692A010794l1628l2380l3533m8147m5478m3626m0795l8057l1046k6774j9404
$$ plain form
8758 7444937 6835472 6280524 5815088 5443495 5150948 4907274 4703115 4554516 4483468 4488954
8748 4488954 4576578 4746622 5000564 5348946 5830645 6485108 7383059 8652302 10475075
8739 10475075 13209829 17504061 24152239 32655743 38515553 36957074 30550597 24506577
8731 24506577 20088810 16737343 14075049 11956626 10310860 9053281 8111316 7396509
8723 7396509 6852927 6470764 6210882 6006175 5751602 5379900 4953969 4540562 4174654 3844008
8713 3844008 3518744 3206656 2942147 2727305 2539335 2372877 2223354 2102849 1985549 1874206
8703 1874206 1780126 1684757 1596000 1502601 1405889 1319412 1238591 1163321 1104248 1051116 1010794
8692 1010794 979166 946786 913253 865106 819628 776002 735207 697150 666104 639330 619926
8681F19926r852j0560j1284r247o007m410q726m717j1440j0131J5730K0001N827
8668E75110n892J649j338r196m118j450J6928L3158K5108l974m951K696r799j8520
8654E95411j3723o481k537K784J5151J2512J6937J3672j1313j9943l3523l0328
8642E38619j9221r334j6106n186M192J0074J1248K247j1660j7437j6588j6860
8630D53988k5739j5954k232m099q02L286J9541L0880J7695M374l193o931P930
8617D78744J1323P227J1394M022j685n749j7507j3643r061p417J53N88p677O53
8603D51365j397k144k870o336K120n11q911m73P976Q38P045J3802Q337j631j4810
8588D52400j2205j1523j290K456p300j8615k0954j8220j0350O9O714m519j2575
$$ plain form
8681 619926 610074 599514 588230 578983 572976 568566 559840 555123 543683 533552 549282 569283 575110
8668 575110 569218 570867 569529 560333 556215 554765 571693 604851 629959 625985 621034 623730 613931 595411
8654 595411 581688 575207 572670 575454 590605 603117 620054 633726 622413 602470 568947 538619
8642 538619 519398 510064 493958 488772 492964 503038 514286 516533 504873 487436 470848 453988
8630 453988 428249 412295 410063 405964 405162 408448 427989 458869 476564 480938 477745 470814 478744
8617 478744 490067 497294 508688 512710 511025 505276 487769 474126 465065 457648 457801 458389 450712 451365
8603 451365 449968 447824 444954 438618 440738 440227 431316 430843 438819 439657 446702 460504 468841 467210 452400
8588 452400 440195 428672 427382 429838 422538 403923 382969 364749 354399 354468 361182 356663 344088
8575C44088r814j5160j9281j4375j0096j0903k691n822J287k319k599j356o535
8562B44424k491K368r714o869M295p39l407p351J750K85L270O838M121k465q864
8547B25451k756k205p843l380N59n530p556k380M997R040O35J0869N639l224j0631
8532B11685l429l745p52o302n082k431M594N520L150o486o542J222m339m992p354
8517A74717p505k589R85M193O123J0531Q124P381l057j651Q653J0538Q478J3317
8503B38238J3151J3070K0037L5548M0538M5912O0383P3582Q8973J03474J21026
8492H53932J37823J38639J30941J16042Q2680L6993M841l9770q0927j09834j13284
8481A158076j11438j04604r6470q4851o3414n3364n0243l7574l0391k5533l2506
$$ plain form
8575 344088 334274 319114 299833 285458 275362 264459 261768 255946 257233 254914 252315 250959 244424
8562 244424 241933 244301 234587 227718 232013 231274 227867 220516 222266 222551 225821 232659 236780 234315 225451
8547 225451 222695 220490 212647 209267 209826 204296 196740 194360 199357 208397 209032 219901 225540 222316 211685
8532 211685 208256 204511 203759 197457 192375 189944 194538 200058 203208 196722 190180 191402 187063 182071 174717
8517 174717 167212 164623 165608 169801 175924 186455 194579 201960 198903 197252 205905 216443 224921 238238
8503 238238 251389 264459 284496 320044 360582 406494 466877 540459 629432 732906 853932
8492 853932 991755 1130394 1261335 1377377 1460057 1497050 1501891 1462121 1381194 1271360 1158076
8481 1158076 1046638 942034 845564 760713 697299 643935 593692 556118 525727 500194 467688
8470D67688l5551k4965j6545j9529k6497j7580j5194l1274j8923j7764j9089j4158
8458B10619j5470k0616j7185l120n190j3446q621r748j3958o701J230R48K030
8445A00772q091M239K483p849K629L985j95j083k501m678m283Q201J750K541K21
8430I8141j103O27P120J3888N034K395L686K2506L2283L4152L4873R38k1530k2809
8416B10201k6174k1673j6996k2083q270p099j1651n93n466o424r185o904j27l843
8402F3713j774P962n95k724K512O178P557p547j2165k300J926r585j208J304Q479
8387F1733M194J403M154N774R243J9861K1461K5387K1030L7871O3094Q9302P9813
8374D44320o717p0255o8937m7648l9885l0760k2977k6473j4938j3288n983j474
$$ plain form
8470 467688 432137 407172 390627 371098 344601 327021 311827 280553 261630 243866 224777 210619
8458 210619 195149 174533 157348 154228 149038 135592 126971 117223 103265 96564 97794 98742 100772
8445 100772 92681 96920 99403 91554 94183 98168 97973 96890 94389 89711 85428 93629 95379 97920 98141
8430 98141 97038 97665 104785 118673 123707 126102 129788 152294 184577 218729 253602 254540 233010 210201
8416 210201 184027 162354 145358 123275 115005 107906 96255 95662 90196 83772 74587 67683 67556 63713
8402 63713 61939 69901 69306 66582 69094 75272 82829 75282 63117 60817 62743 53158 51950 53254 61733
8387 61733 65927 67330 71484 77258 86501 106362 127823 153210 174240 212111 275205 364507 444320
8374 444320 437603 367348 298411 250763 210878 180118 157141 130668 115730 102442 96459 94985
8362I4985l659m777k739n04K676j0278n509k889m93P72M53o490N732J658p838
8347F1100k658k44j664R5M718K044O85L167o658J042K017O852J5071J7684K1391
8332A24642J8956L6092L2488O759j6051k6567l0119j5769j2882j2692o545j1059
8320H7253j2562j0018o26k55k753L54l42l493l288K97j807l809o872o464n709
8305B9906l849p50l932k057m644N70J214o46L832R655P295n275n64k683o674o487
8289A4911K064J220l793j022o2J439P948L556m546j75N459N293N889r770j1418
8274A6993K745J837k529J638n78K333j889J16K17L28N102k863m547J470m53k539
8258A7381k029k158O055O228N59J80m740q021m240N231J652J548l402N63l676
$$ plain form
8362 94985 91326 86549 83810 83306 85982 75704 70195 67306 66813 67585 68038 61548 67280 68938 61100
8347 61100 58442 58198 56534 56629 61347 63391 64076 67243 60585 61627 63644 70496 85567 103251 124642
8332 124642 143598 179690 212178 218937 202886 176319 146200 130431 117549 104857 98312 87253
8320 87253 74691 64673 64047 63792 61039 61393 61051 57558 54270 54567 52760 48951 42079 35615 29906
8305 29906 26057 25307 21375 19318 14674 15244 16458 15812 19644 29299 36594 31319 30755 28072 21398 14911
8289 14911 16975 18195 14402 13380 13318 14757 22705 26261 21715 21540 26999 32292 38181 28411 16993
8274 16993 19738 21575 19046 20684 20106 22439 20550 20666 20883 21211 26313 23450 18903 20373 19920 17381
8258 17381 15352 13194 19249 25477 26036 26216 21476 13455 9215 14446 16098 17646 14244 14807 11131
8243A1131k488j983m982m312N545M542l119J449r02m408J416l956K984K704l384
8228B37J961M563J483l899n35O424O867l150M12J593j174n667R100J529j351p66
8212A7627m969o681J707O10l636l104l101M453K41M166N840Q14q71O25o62j379
8196A1680o372j716L241K410l788m30L299l991o747O50L995Q693O445J758o39
8181A8488l232l472k013K743j010n695J474Q159Q626k161O631k166o840j42R5
8166A9485k366j574k564j883m05J593j952Q769m285O388K578l752m998n492p6
8151I466J619j639m74k575k628q535O374J0903J394m374l041N968J318p801p753
8136a778J193O472N46j983k192p109j246N723M223N993J417j831j937J288M823
$$ plain form
8243 11131 8643 6660 1678 -2634 2911 7453 4334 5783 4881 473 1889 -2067 917 3621 237
8228 237 2198 6761 8244 4345 3810 10234 17101 13951 14363 15956 14782 9115 18215 19744 18393 17627
8212 17627 12658 5977 7684 8294 4658 1554 -1547 2906 3147 7313 13153 13967 13096 13721 13059 11680
8196 11680 5308 3592 6833 9243 5455 5025 8324 4333 -2414 -1764 2231 10924 17369 19127 18488
8181 18488 15256 11784 9771 12514 11504 5809 7283 15442 24068 21907 28538 26372 19532 19390 19485
8166 19485 17119 15545 12981 11098 10693 12286 10334 19103 14818 21206 23784 20032 15034 9542 9466
8151 9466 11085 9446 8972 6397 3769 -4766 1608 12511 13905 9531 6490 12458 13776 5975 -1778
8136 -1778 -585 5887 6433 4450 2258 -4851 -6097 -374 3849 9842 11259 9428 7491 8779 13602
8121A3602L145r070q866M481J975l392L713r69J622k928l679K737L845L260N425
8106A4901K820K259n205k741P27J901L269n409r618k164O336K950m051l186O653
8091I442J563j605M798m487j414k02q84k978K242N430k136q091Q2O35k640K190
8075A945O732M696L534K269n009P45l621k931L790n827m574K270O685N66J363
8060A2633N9M552O108l845l00O91k623n453m313o015N954M984K021P64J496p106
8044I607p518j277O172l066k837N541O738j675k786Q191K008m920q885n524l569
8029c800M10K21L370J736L160o400n453P030O883J233q87J055q14j613j542k629
8013A960R326N751M633J018p011k867k589M059L861j215k886j04l794l715O432
$$ plain form
8121 13602 16747 7677 -1189 3292 5267 1875 5588 4619 6241 3313 -366 2371 6216 9476 14901
8106 14901 17721 19980 14775 12034 12761 14662 17931 12522 2904 740 7076 10026 5975 2789 9442
8091 9442 11005 9400 14198 9711 8297 8095 7211 4233 6475 11905 9769 1678 1760 2395 -245 1945
8075 1945 8677 13373 16907 19176 14167 14912 11291 8360 12150 6323 1749 4019 10704 11270 12633
8060 12633 12692 17244 23352 19507 19207 19898 17275 11822 7509 1494 7448 12432 14453 15217 16713 9607
8044 9607 2089 812 6984 3918 1081 6622 13360 11685 8899 17090 19098 14178 5293 -231 -3800
8029 -3800 -3390 -3169 201 1937 5097 -1303 -6756 274 7157 8390 7503 8558 7744 6131 4589 1960
8013 1960 11286 17037 21670 22688 15677 12810 10221 14280 18141 16926 14040 13936 10142 6427 12859
7998A2859M892N000l558l035k598m869J536L070k46r13k414p35l576K882K175
7983A0470L93j972n349P720k338j0547j336K128j642p31K513K546K933j531m867
7968a610m728P371J0665M5o94J475J497l057m523L761K068m480J7O102m54M49
7952A3904m924l788N053K299l554n695O231N855o560p86L354l574m632J478Q77
7937E538k962K501N665o920j82J998n430L335R771k618j788m145l927J065J1416
7922A3317M518r88k710j350l333M332K134o427p03Q432Q76m920L234L237o187
7907A3462o360J699O266N670j37o26K760n04m110o129L1N527p419l402l864m173
7891a309n840m764L071N899j94j863Q1J442l125L83L336M021L942K659P69K506
$$ plain form
7998 12859 17751 22751 19193 16158 13560 8691 10227 13297 13051 12138 9724 8989 5413 8295 10470
7983 10470 10863 8891 3542 11262 8924 -1623 -2959 -831 -2473 -3204 -691 1855 4788 3257 -1610
7968 -1610 -6338 1033 11698 11743 11049 12524 14021 10964 6441 10202 12270 7790 7807 13909 13455 13904
7952 13904 8980 5192 10245 12544 8990 3295 9526 15381 8821 8035 11389 7815 3183 4661 5538
7937 5538 2576 5077 10742 3822 3640 5638 208 3543 13314 10696 8908 4763 836 1901 13317
7922 13317 17835 16847 14137 12787 9454 13786 15920 9493 8790 17222 18098 13178 16412 19649 13462
7907 13462 7102 8801 15067 20737 20600 19974 22734 22230 18120 11991 12022 17549 10130 6728 2864 -1309
7891 -1309 -7149 -11913 -8842 -2943 -3137 -5000 -4919 -3477 -6602 -6219 -2883 1138 5080 7739 8508 11014
7875A1014O733R75q871q105p259M187J3094M851j3312p231Q896P186p73L04n019
7860F670q135p34M645j054N289J868o442r355k827R684N825Q72l708o191L793
7845B00J15k112N55O362L202k714m005j641j881l37K437l90N036P13k642J979
7829D877R18q352j196J53j858J322j943j740K279L210r26n518m044M886M51J5757
7813H276Q739n186j0036m037J215M532J712j364L261j265n785L696M504j959j414
7798D889j718l86n160k341M562O655J027K220q27p579m375k318j377J183j386
7783f931J85O03n16m594N270N223J491J79L44J109O298N115n972r773K358J278
7767A667Q12N197O8m83m66J894m424q484L85l684o225M044L840k001j847O429
$$ plain form
7875 11014 17747 18722 9851 1746 -5513 -1326 11768 16619 3307 -3924 4972 12158 11385 11689 6670
7860 6670 -1465 -2199 2446 1392 6681 8549 2107 -7248 -10075 -391 5434 6306 2598 -3593 200
7845 200 315 -1797 -1242 5120 8322 5608 1603 -38 -1919 -2256 181 -209 4827 5540 2898 4877
7829 4877 5795 -2557 -3753 -3600 -5458 -4136 -6079 -7819 -5540 -2330 -3256 -8774 -12818 -7932 -7481 8276
7813 8276 17015 11829 1793 -2244 -1029 3503 5215 3851 7112 5847 62 3758 8262 6303 4889
7798 4889 3171 2785 -2375 -4716 -154 6501 7528 9748 8921 1342 -3033 -5351 -6728 -5545 -6931
7783 -6931 -6746 -6143 -6659 -11253 -5983 -760 731 910 1254 2363 8661 13776 7804 -1969 389 1667
7767 1667 2479 7676 7744 7261 6795 8689 4265 -4219 -3834 -7518 -13743 -9699 -5859 -7860 -9707 -3278
7751c278J681k588J418n63l13J257k503L815K446R42N477K033n522J061M695N297
7735A5355m096j1609m894L152R88m013J68Q597J166l61p096m781l829O276R365
7720D388L977L314K189q822j0171P201o00q76m562o35n839q57k691L384K520K77
7704g803P562P925k656m406j401j864K81o516K907Q121J057L027n447m169k90
7689c672M619L108r40k252L515j685l291J036L574k874o04N616R98N041p382m262
7673E45o512k791J0270k08Q49o020l433L258j603J163J656L676j000m986M42m410
7657i104M665M011k146j924P872K649K40J829J946n808K377M329m609K224m374
7642D177n350L156k553K258L152L789q193r668j576R11l187R48M004L072M61m788
$$ plain form
7751 -3278 -1597 -4185 -2767 -3330 -3643 -2386 -4889 -1074 1372 2314 7791 9824 4302 5363 10058 15355
7735 15355 11259 -350 -5244 -2092 -1104 -5117 -4949 3648 4814 4453 -2643 -7424 -11253 -4977 4388
7720 4388 8365 11679 13868 5046 -5125 2076 1476 600 -3962 -4597 -10436 -11293 -13984 -10600 -8080 -7803
7704 -7803 -241 7684 5028 622 -779 -2643 -2362 -8878 -5971 2150 3207 6234 787 -3382 -3672
7689 -3672 947 4055 3115 863 4378 2693 -598 438 4012 1138 534 6150 7148 12189 4807 545
7673 545 -5967 -8758 1512 1304 2153 -3867 -7300 -4042 -5645 -4482 -2826 850 -150 -5136 -4694 -9104
7657 -9104 -4439 -428 -2574 -4498 3374 6023 6263 8092 10038 4230 6607 10936 6327 8551 4177
7642 4177 -1173 1983 -570 1688 4840 8629 436 -9232 -10808 -9897 -13084 -12136 -8132 -5060 -4599 -9387
7626i387O313j422L041M073O567l656m892J123k428J631M646k389K11l481r56
7611a006p654N74N506r11J856K978p824j355P67J998P515M056m630o074n088N2
7595i240K518L637M318K515L546P022n283r008m030k15N139P360l91l477j907
7580B504l07P95J957j176k115p96l209k554K213L280j747k504k897l958K342J429
7564f743l16R11J33N58j85L009P123R95K688K253j476Q86j1191p732L945R442
7548D300q87m478m733P76q72J530r98J463N3J882k033J977O244n454J098O892
7532F760M700n633m644k130J136k654J825N61Q68N133l243j889K324l068N96L593
7516D235M907j717m365M85j048q04m416k8o38k196M278L835n884n5K497n076J352
$$ plain form
7626 -9387 -3074 -4496 -1455 2618 9185 5529 637 1760 -668 963 5609 3220 3431 -50 -1006
7611 -1006 -8660 -8086 -2580 -3491 -1635 1343 -6481 -7836 -7069 -5071 2444 6500 1870 -4204 -9292 -9240
7595 -9240 -6722 -3085 1233 3748 7294 14316 9033 25 -4005 -4220 919 8279 7888 4411 2504
7580 2504 2197 2992 4949 3773 1658 862 -2347 -4901 -2688 592 -1155 -3659 -6556 -10514 -8172 -6743
7564 -6743 -7059 -6148 -6015 -5457 -5642 -2633 4490 5485 8173 10426 8950 9836 -1355 -9087 -5142 4300
7548 4300 3413 -1065 -5798 -5022 -5894 -4364 -5362 -3899 -3846 -1964 -3997 -2020 4224 -1230 -132 6760
7532 6760 11460 5827 1183 -947 189 -2465 -640 -79 789 5922 2679 790 3114 46 642 4235
7516 4235 9142 7425 3060 3545 2497 1693 -2723 -2751 -3389 -5585 -1307 2528 -3356 -3411 -914 -5990 -4638
7499d638L865l112K367K030k846L645l616L380J061l95m365j944k263n335j927
7484a4093J926N872L582k753L923J238P702N771P30J339p985q640j720m087O45
7469f550P485O52o650j688N612L367L966L015m890k446M095q34m174M30r09j005
7453e24k448m643k40O56N17J959N47o41Q55N423O722k37q323j180O565J539p023
7436d76p41M248J623O50J7l945n992k598l878M055J3032J809n159n128n285L912
7420c856j973k104m214n23L046K999K921J981m407j257o46K050k790j06P58J176
7404f945M95k003L807J328L02M859L949J941l037p868j1974k536O112Q43j801
7389a2528J027L795N245m274p72M03M215L248O650k806n537n783O535P677j225
$$ plain form
7499 -4638 -773 -3885 -1518 512 -2334 1311 -2305 1075 2136 1741 -2624 -4568 -6831 -12166 -14093
7484 -14093 -12167 -6295 -2713 -5466 -1543 -305 7397 13168 13898 15237 7252 -1388 -3108 -7195 -6550
7469 -6550 935 1587 -5063 -6751 -1139 2228 6194 9209 4319 1873 5968 5134 960 1390 481 -524
7453 -524 -2972 -7615 -7855 -7199 -6682 -4723 -4176 -4817 -3962 1461 8183 7946 -377 -1557 5008 6547 -476
7436 -476 -1217 3031 4654 5304 5321 1376 -4616 -7214 -11092 -7037 5995 7804 2645 -2483 -7768 -3856
7420 -3856 -5829 -7933 -12147 -12670 -9624 -6625 -3704 -1723 -6130 -7387 -8033 -5983 -8773 -8879 -8121 -6945
7404 -6945 -6450 -8453 -4646 -3318 -3016 1843 5792 7733 4696 -3172 -15146 -17682 -11570 -10727 -12528
7389 -12528 -11501 -7706 -2461 -6735 -7507 -7104 -2889 359 7009 4203 -1334 -7117 -582 7095 5870
7374E870j518l528K058K675j530n398M161M139R49k613k426j972n954p032J539
7359a0580N973O79n264l184P115r49J463K810M513K681k881P562j995p561m8k652
7343b318l574q15J214M513j786l863l946Q74R52j524r81j652j315K680P61J358
7327i422M144K052K981j276n686L404Q390K828q367q451k702j599k809K963L265
7312a0285J739J159l410O589L983k014j924k040l000J406Q24o877J591N717J712
7297d830k20k638k573J125N786K096O46p76j931L083M182j618l384l438p146p706
7281a9342K817M370P406J187l958O02L822M590L994o44m7o41j674p278q19O254
7265F39k76j162L628n871j900j848L80k856j859N258L879M937O349k538p252r31
$$ plain form
7374 5870 4352 824 2882 5557 4027 -1371 2790 6929 7878 5265 2839 867 -5087 -12119 -10580
7359 -10580 -4607 -3928 -9192 -12376 -5261 -6210 -4747 -1937 2576 5257 2376 9938 7943 382 334 -2318
7343 -2318 -5892 -6707 -5493 -980 -2766 -6629 -10575 -9701 -8749 -10273 -11254 -12906 -14221 -11541 -10780 -9422
7327 -9422 -5278 -3226 -245 -1521 -7207 -3803 4587 7415 -952 -9403 -12105 -13704 -16513 -13550 -10285
7312 -10285 -8546 -7387 -10797 -4208 -225 -2239 -4163 -6203 -9203 -7797 -6973 -13850 -12259 -6542 -4830
7297 -4830 -5050 -7688 -10261 -9136 -3350 -1254 -608 -1384 -3315 -232 3950 2332 -1052 -4490 -11636 -19342
7281 -19342 -16525 -12155 -4749 -3562 -7520 -6918 -3096 1494 5488 4844 4797 4156 2482 -4796 -5615 639
7265 639 363 -799 2829 -3042 -4942 -6790 -6410 -9266 -11125 -5867 -1988 2949 9298 6760 -492 -1423
7249a423k000k210j877j715J904M898M690J479n494m92J174j675m293q67M723
7234c178J976P15m086n963l785K799L757M328J347l61N520M650l476n919n679
7219g355o42j610N181J3130J126l878j194k788M571k270n174j822M424l743p871
7204i915l243L225K121m010k891L6k352J018q230K068M842M152M976N246J804
7189a153j633N116O57j665k875L6M269N264n943K18O088P06p287M366m057o521
7173d414k806L251L238J807n491K070k216K280j250l583M079K622J784L58n738
7158d009J91J041p07L67k358o398J901m955k297J0746J565N010j455j070K673
7143B45m685r085J397J2988m034l562N79r918n04Q274L311p211k399l626K863
$$ plain form
7249 -1423 -3423 -5633 -7510 -9225 -7321 -2423 2267 3746 -1748 -2240 -1066 -2741 -7034 -7901 -3178
7234 -3178 -1202 -487 -4573 -10536 -14321 -11522 -7765 -3437 -2090 -2451 3069 7719 4243 -1676 -7355
7219 -7355 -7997 -9607 -4426 8704 9830 5952 4758 1970 6541 4271 -903 -2725 1699 -2044 -9915
7204 -9915 -13158 -9933 -7812 -11822 -14713 -14677 -17029 -16011 -24241 -22173 -17331 -13179 -8203 -2957 -1153
7189 -1153 -2786 2330 2987 1322 -1553 -1517 2752 8016 2073 2291 8379 9085 1798 6164 2107 -4414
7173 -4414 -7220 -3969 -731 1076 -4415 -2345 -4561 -2281 -3531 -7114 -3035 -413 1371 1729 -4009
7158 -4009 -3818 -2777 -3484 -3117 -5475 -11873 -9972 -14927 -17224 -6478 -4913 97 -1358 -2428 245
7143 245 -4440 -13525 -12128 860 -3174 -6736 -6157 -16075 -16579 -8305 -4994 -12205 -14604 -18230 -15367
7128a5367R356Lj320m98Q990L761m953k010L566j570K582m254o431j735n202P481
7112g601J1205K737J714k92j0224k200k044K84K582N321L728l647k994P153K511
7097H233o897k693j903O162n137j0798M168Q183J252j325k25J273j162j279M008
7082A860j251k455J100J16k260q595k908L657K624L436R415k095k405l051r032
7067a1844n886O24O962J71m196j196j107L592O119L10L874rK317r07N814M653
7051I291l071k924k198O6L86r19j069L256j20o042p849p46N100K168n686j827
7035a2184K542L232p663N852P105p684l246Q106O056N818J348k379m364r024m578
7020a1063l027Q626P591Q724l794l668O272k353j021k778k880l210o064K23J018
$$ plain form
7128 -15367 -6011 -6008 -7328 -7826 1164 4925 -28 -2038 1528 -42 2540 -1714 -8145 -9880 -15082 -7601
7112 -7601 3604 6341 8055 7763 -2461 -4661 -6705 -6421 -3839 1482 5210 1563 -1431 5722 8233
7097 8233 1336 -1357 -3260 2902 -2235 -13033 -8865 -682 570 -755 -980 293 -869 -2148 1860
7082 1860 609 -1846 -746 -630 -2890 -11485 -14393 -10736 -8112 -4676 4739 2644 239 -2812 -11844
7067 -11844 -17730 -17106 -10144 -9973 -14169 -15365 -16472 -12880 -6761 -6451 -2577 -2586 -269 -1176 4638 9291
7051 9291 6220 3296 1098 1164 1550 631 -438 2818 2698 -3344 -11193 -11939 -6839 -4671 -10357 -12184
7035 -12184 -9642 -6410 -14073 -8221 -1116 -8800 -12046 -3940 2116 7934 9282 6903 2539 -6485 -11063
7020 -11063 -14090 -5464 2127 10851 7057 3389 9661 7308 6287 3509 629 -2581 -8645 -8422 -7404
7005g404J760O085J013m253N63J578n245j846M188N987o18p83J70k21K682k094
6989A562K555l56m008J967K013m012n223l140L767N508K183K782n56M430L230
6974A2702q766p337l081R453K217J656j0606p983L111N406K687q82k715P13J217
6959b208J627N423M701n595n642N382l430p941K300N80M264M973L75K597L583
6944A0989l857m011m133p892j317P433m5M851j795J258N849N944J5p560m90L825
6928I064l177j838p156J326L452j0253o712j520J508J329Q436r54M135J188K484
6913A312K327l408r46l259k044M868L493L004J351k102p404l738J232k650P329
6898f35k399q469m459l62M414M157J501l719k538l761J165N224K788K065Q4L042
$$ plain form
7005 -7404 -5644 441 1454 -2799 -2236 -658 -5903 -7749 -3561 2426 1808 1025 1195 974 3656 1562
6989 1562 4117 3761 -247 1720 3733 -279 -5502 -8642 -4875 633 2816 5598 5042 9472 12702
6974 12702 3936 -3401 -6482 2971 5188 6844 -3762 -11745 -8634 -3228 -541 -1423 -4138 -3425 -2208
6959 -2208 -581 4842 9543 3948 -1694 3688 258 -7683 -5383 -4803 -539 4434 4809 7406 10989
6944 10989 7132 3121 -1012 -8904 -10221 -2788 -2833 2018 223 1481 7330 13274 13289 5729 5239 9064
6928 9064 5887 4049 -3107 -1781 1671 -8582 -15294 -16814 -15306 -13977 -5541 -6495 -2360 -1172 1312
6913 1312 3639 231 -715 -3974 -6018 -1150 2343 5347 6698 4596 -2808 -6546 -5314 -7964 -635
6898 -635 -3034 -11503 -15962 -16324 -11910 -7753 -6252 -9971 -12509 -16270 -15105 -9881 -7093 -5028 -4944 -1902
6882a902N447k360k365J298J644k133l925K274L117M113l662j571O422K016k666
6867E747m75L122q056j318K509K211j1333l74P501n325l087n91O024L679P03N049
6851E986j589m223l612o020n328M911J946o917L286L084p76N438N455M693l159
6836C175j0594m281N695m043K860L291P73q15L098l014m905L671Q073N078k377
6821E685n80n794p630J492Q683L358L870j832j351q499p109m497j729L764N100
6806g069k233N078O712M788k700p088n029r36M961n404k738J506K50m178l24R730
6790d674K373j476M266P30K616J963L387j488J221r14J121p862k62p42l207J857
6774a091k485k267n99P756k516l217R5L56L679K357K434j0488k722q86M520m38
$$ plain form
6882 -1902 3545 1185 -1180 118 1762 -371 -4296 -2022 1095 5208 1546 -25 6397 8413 5747
6867 5747 5272 8394 338 -980 1529 3740 -7593 -7967 -466 -5791 -8878 -9469 -3445 234 937 5986
6851 5986 4397 174 -3438 -9458 -14786 -9875 -7929 -14846 -11560 -8476 -9252 -3814 1641 6334 3175
6836 3175 -7419 -11700 -6005 -10048 -7188 -3897 -3124 -3939 -841 -3855 -8760 -5089 2984 8062 5685
6821 5685 5105 -689 -8319 -6827 1856 5214 9084 7252 5901 -2598 -9707 -14204 -15933 -12169 -7069
6806 -7069 -9302 -4224 2488 7276 4576 -2512 -7541 -8477 -3516 -8920 -11658 -10152 -9902 -14080 -14404 -4674
6790 -4674 -2301 -3777 489 1219 3835 5798 9185 7697 8918 8004 9125 1263 1001 259 -2948 -1091
6774 -1091 -3576 -5843 -6442 1314 -1202 -4419 -4324 -3968 -289 2068 4502 -5986 -8708 -9594 -5074 -5512
6758e512K486K013Q187k904q636k805P397j059L560Q37m286K456M72o12j2639
6743a1045K432N237k926k627N537O329n5L917n942j007o377L9M234o25j551q01
6727e231J247j735l13L190q577m845j047M033Q551Q659M165J745l238n745L753
6712D612j31k246j391m063k224L942J2992o86K98j303k188k869n455q38j18K94
6696a374L09J669j542J848P594l142m985P36Q859O056K977L362k392o43N274J5600
6680D0206J3625J2905K8287K5684R660j9028k4347j9881j2938n824m543p220n508
6667C1078p931m716j062n278k439N38L333j968l847j983L015L058J156j900j736
6652I318N774K310J151k574l921q373k856K026j133K553l748K286J731p485k820
$$ plain form
6758 -5512 -3026 -1013 7174 4270 -4366 -7171 226 -833 2727 3564 -722 1734 2206 1594 -11045
6743 -11045 -8613 -3376 -6302 -8929 -3392 2937 2882 6799 857 -150 -6527 -6488 -2254 -2879 -4430 -5231
6727 -5231 -3984 -5719 -6032 -2842 -11419 -16264 -17311 -13278 -4727 3932 8097 9842 6604 859 4612
6712 4612 4481 2235 844 -3219 -5443 -1501 11491 10805 11103 9800 7612 4743 -712 -1550 -1668 -1374
6696 -1374 -1065 604 -938 910 8504 5362 377 1113 9972 16028 19005 22367 19975 19332 24606 40206
6680 40206 53831 66736 95023 120707 130367 111339 86992 67111 54173 48349 43806 36586 31078
6667 31078 23147 18431 17369 12091 9652 10190 13523 11555 7708 5725 8740 11798 12954 11054 9318
6652 9318 15092 17402 18553 15979 12058 3685 829 2855 1722 4275 527 2813 4544 -2941 -5761
6637e761l44N781K520m256p87L693O52J49p54p520j556Q60j558p55O70K970N921
6620g5j726K174J0414M725q265j1349M494L068L216q997k504o11Q206j607k577
6605a414J188J886l335n647K138q24j225l534N19L879K19J093L918n01m567N96
6589e611L154M950P44M941M254l560r071k279o987m643K642P744L882k360j489
6574c689J079R51J814k527m430N450j099j167J602o861J825K42j232j958J942
6559h058O861J91j219m645R56K534P572l113l760J226j279J095N973j318Q11Q83
6543D710J295j360l071k620j858N562L680k954l126P28l609j459J549N763p61
6528B469m897l050L793o942m049L210R102J442j537j433j121J42l127L48L908
$$ plain form
6637 -5761 -6105 -324 2196 -2060 -2847 846 1498 1647 893 -6627 -8183 -7323 -8881 -9636 -8966 -5996 -75
6620 -75 -1801 373 10787 15512 7247 -4102 392 3460 6676 -2321 -4825 -5436 2770 1163 -1414
6605 -1414 -226 1660 -1675 -7322 -5184 -6008 -7233 -10767 -10248 -6369 -6150 -5057 -1139 -1640 -6207 -5611
6589 -5611 -2457 2493 3237 8178 12432 8872 -199 -2478 -9465 -14108 -11466 -3722 160 -2200 -3689
6574 -3689 -2610 -1659 155 -2372 -6802 -1352 -2451 -3618 -2016 -8877 -7052 -6810 -8042 -10000 -8058
6559 -8058 -1197 -1006 -2225 -6870 -5914 -3380 4192 1079 -2681 -1455 -2734 -1639 4334 3016 3827 4710
6543 4710 6005 4645 1574 -1046 -2904 2658 6338 3384 258 986 -2623 -4082 -2533 3230 2469
6528 2469 -2428 -5478 -1685 -8627 -12676 -9466 -364 1078 -459 -1892 -3013 -2871 -5998 -5650 -1742
6513a742l31N28O01P90k135L505L69m752J166J41Q51L091n41n81j663o673k82
6496g658P888J33r27q62m659k621J658P553N213K537p05r443m288Q811K294J094
6480F018Q31P47M242J141r132j0857P181O121r7l285j26L47p575J539K50J817
6464h38Q09l15J848J372M082k61o716m788R68k333J857j19J532l434K510J189
6448b637q795L70M807O770P411j1039l368L49K583J402k00P72J144n92R0j17K62
6431g88J957J851M258K043m300j0465k79O065K904l890l527k8J332J01L722o29
6415C27k277n994k543M200M786K452k204j69l821O280M134p82j0947l964M35o25
6399a0712l517N732N490O54p434j1416o5N963M292M23O92O618p50J489K576K926
$$ plain form
6513 -1742 -2073 -1545 -944 -154 -2289 1216 1585 -3167 -2001 -1860 -1009 2082 1541 960 -703 -7376 -7658
6496 -7658 230 363 -564 -1426 -6085 -8706 -7048 505 5718 8255 7550 -1893 -6181 2630 4924 6018
6480 6018 6849 7596 11838 12979 3847 -7010 171 6292 6195 2910 2784 3131 -4444 -2905 -2655 -838
6464 -838 -29 -344 1504 2876 6958 6697 -19 -4807 -3839 -6172 -4315 -4434 -2902 -6336 -3826 -2637
6448 -2637 -11432 -11062 -6255 515 7926 -3113 -6481 -6132 -3549 -2147 -2347 -1575 -431 -1023 -933 -1050 -788
6431 -788 1169 3020 7278 9321 5021 -5444 -5723 342 3246 -644 -4171 -4199 -2867 -2766 956 327
6415 327 -1950 -7944 -10487 -6287 -1501 951 -1253 -1422 -5243 1037 5171 4389 -6558 -10522 -10087 -10712
6399 -10712 -14229 -8497 -3007 -2353 -9787 -21203 -21268 -15305 -11013 -10590 -9898 -3280 -4030 -2541 35 2961
6383B961l929n156K018n96J545m085R170M163k126M340P976m647m815k241q267
6368c689K349n45K142P919M421j884m949m481o457M809l695m737L652m50j406
6353g001M36L699j522o24m040l575N766J395N361K529k436L26k985j838j05M384
6337b30M52J924J969k679k800R24M328M189m844l818J064n254N238J905k31j89
6321A948l01K934K446k634q327L556L785l984l942L434L921k048p664p08O238
6306a346J798n09q62l230k77M332O447m419j055K515k314M266o670j326M875k381
6290a56l469k576O164M008l233o854M33M638L559j887l846K136j204l544Q27P277
6274B273N047L003l750q104j824N145l28K183j521O68k980l401m84j278L013l216
$$ plain form
6383 2961 -968 -6124 -4106 -4702 -3157 -7242 1928 6091 3965 8305 16281 11634 6819 4578 -3689
6368 -3689 -1340 -1885 257 8176 12597 10713 5764 1283 -5174 -365 -4060 -8797 -5145 -5595 -7001
6353 -7001 -6565 -2866 -4388 -5012 -9052 -12627 -6861 -5466 -105 2424 -12 314 -2671 -4509 -4614 -230
6337 -230 222 2146 4115 1436 -1364 -440 3888 8077 3233 -585 479 -4775 463 2368 2137 1948
6321 1948 1647 4581 7027 4393 -3934 -378 3407 -577 -4519 -1085 2836 788 -6876 -7584 -1346
6306 -1346 452 -57 -919 -4149 -4426 -94 6353 1934 879 3394 1080 5346 -1324 -2650 2225 -156
6290 -156 -3625 -6201 -37 3971 738 -6116 -5683 -1045 2514 627 -3219 -1083 -2287 -5831 -5004 2273
6274 2273 7320 10323 6573 -1531 -3355 1790 1462 3645 2124 2792 -188 -3589 -4073 -5351 -2338 -5554
6258e554p95M82K049J49j119M760O715r007n73m71o5r09O602l04n076o495l16
6241i927K925q22j847m657P83J625J746m92l537R91M664K401l938J316K529J611
6225d629K685k601n88R78k66m12O72N450P352m91n150J189J428O97l561j169J307
6208B891K53l884N239q77O1l055o895k76J1087o67r084k208J711M948L477l857
6192a136K718j924KK993j703N201K006m143Q71Rm536n662j00k53J003J375R35
6175b344P71m425l880K83L435J433l466K72O271M367k691j775K463O74J030j851
6159E67q72L987l650k342L782M787M725R583n319j0029k228n77j259j410r02M444
6143C287L104j395l477o296k842O006K945N52l324L538M763j132l591r297J42
$$ plain form
6258 -5554 -6349 -5867 -3818 -3669 -4788 -28 6687 -2320 -2893 -3364 -3429 -4338 2264 1960 -3116 -9611 -9927
6241 -9927 -7002 -7824 -9671 -14328 -13545 -11920 -10174 -10666 -14203 -13212 -8548 -6147 -10085 -8769 -6240 -4629
6225 -4629 -1944 -4545 -5133 -4155 -4421 -4833 -4161 1289 8641 8150 3000 4189 5617 6314 2753 1584 2891
6208 2891 3144 -740 4499 3622 3683 628 -6267 -6543 4544 3877 -5207 -7415 -5704 -756 2721 -1136
6192 -1136 1582 -342 -340 2653 950 6151 8157 4014 4885 4894 358 -5304 -5404 -5657 -4654 -3279 -2344
6175 -2344 -1573 -5998 -9878 -9595 -6160 -4727 -8193 -7921 -1650 2717 26 -1749 714 1388 2418 567
6159 567 -305 3682 32 -2310 1472 6259 10984 20567 15248 5219 2991 2414 1155 -255 -1157 3287
6143 3287 6391 4996 1519 -4777 -7619 -1613 1332 1884 -1440 2098 6861 5729 2138 -7159 -7017
6128g017M885M095l26l736m887o85j84K017n635o71R748N266n665o982L788N928
6112f1M534L523k102l506J054j977l512r62L429k364L37j092m053j111O870j228
6096b221K376k89l155M291J4249J043j1350k984o163l068k896L157J0031R070
6082A2091L071q613k347l498m034k421N788J025k375L131j19J093k9l804m701
6067e742k224M43j479P786N337m697l98k05O7R09j849j0926m814J0394N579M173
6051B354M791L740j753p444J417j47q42r21np794l303P672M292m766K074K148
6035A513m145K361J898r2j975O147M404j013R68J71j594k635j1860j831P531j134
6019a286j489J503N709K794m586K742J897l169M055j597n538l132J399p60N347
$$ plain form
6128 -7017 -2132 1963 1637 -2099 -6986 -7671 -7855 -5838 -11473 -12144 -2396 2870 -2795 -9777 -5989 -61
6112 -61 4473 7996 5894 2388 3442 1465 -2047 -3009 420 -1944 -1607 -2699 -6752 -7863 -993 -2221
6096 -2221 155 -134 -3289 1002 15251 16294 4944 1960 -4203 -7271 -10167 -7010 3021 12091
6082 12091 15162 6549 4202 704 -3330 -5751 37 1062 -1313 1818 1699 2792 2763 -1041 -5742
6067 -5742 -7966 -7523 -9002 -1216 4121 -576 -974 -1179 -1112 -203 -2052 -12978 -17792 -7398 -1819 2354
6051 2354 7145 10885 9132 1688 3105 2958 2116 1195 1190 -6604 -9907 -2235 2057 -2709 -635 1513
6035 1513 -2632 -271 1627 1535 -440 5707 10111 9098 10066 10237 8643 6008 -5852 -7683 -152 -1286
6019 -1286 -2775 -1272 4437 7231 2645 5387 7284 4115 8170 6573 1035 -2097 -698 -1458 3889
6004C889M86l151k703j366j934o94K64L922J792m555k541L113M598o69j74M30
5988G07K421k854p873m35K677m067n37o05n595O778Q122J096L280j236m059O191
5972D011N526m699k070O531j565m872o135J524K896J229N193K091l570q253l624
5957e787l224l694R942o40m408l627k61Q740P005r04o310J5k63j947k269M54l748
5940a0926N528K08L63K652K655K12P86N707K293j716Q0j31l844p650l153M736
5924b200L657q66n694J303O012N72N213N74L360n858r455m861L224P99J351O73
5908b196l519k461J147P081K103r81M006p422o422k085R431J0894J501j1022o40
5893e85J704L046J686m785j922J170k990k231l908K083K901K378j073n482L100
$$ plain form
6004 3889 4375 1224 -1479 -2845 -4779 -5473 -5209 -1287 505 -4050 -6591 -3478 1120 451 277 707
5988 707 3128 274 -7599 -8034 -5357 -9424 -9961 -10566 -16161 -9383 -1261 -165 3115 1879 -2180 4011
5972 4011 9537 4838 2768 9299 7734 2862 -3273 -1749 1147 2376 7569 9660 6090 -2163 -5787
5957 -5787 -9011 -12705 -2763 -3403 -7811 -11438 -11699 -2959 4046 3142 -3168 -3153 -3416 -5363 -7632 -7178 -10926
5940 -10926 -5398 -5190 -4827 -2175 480 692 1478 7185 9478 7762 7842 7711 3867 -3783 -6936 -2200
5924 -2200 1457 591 -5103 -3800 2212 2784 7997 8571 11931 6073 -3382 -8243 -5019 -4220 -2869 -2196
5908 -2196 -5715 -8176 -7029 52 2155 1174 5180 -2242 -8664 -10749 -1318 9576 11077 55 -585
5893 -585 1119 4165 5851 1066 -856 314 -2676 -4907 -8815 -6732 -3831 -1453 -2526 -8008 -4908
5878d908n593J836L553j461o886M835R393P059J999q536n849p076m65K819R38
5863h342l56k46M164N824K692P8K921k976P65k38j2486n443N737N441L254O481
5847G270R21p537n382j993l579k274N00j592Q846J1289N835q50K441n790n794
5832B311o997J13J442K715o263q114k567N587R215N532j118m578j646P687J455
5817D774m825q381k880L928K021J302l112K404J269N53M211M971J542n347k942
5802e12j068N79q15q568j106j128L13N209k624j48N442N049j117J379o21M116
5786D380J966l15k233M48L93k317n27M509l061L35l04q889k589k006P8Q095j965
5769d002j101r88L015R01K914o714O416M799l337m12j366k181l182k911K695l309
$$ plain form
5878 -4908 -10501 -8665 -5112 -6573 -13459 -8624 769 7828 9827 1291 -4558 -11634 -12099 -9280 -8342
5863 -8342 -8698 -8944 -4780 1044 3736 3814 6735 3759 4524 4286 -8200 -13643 -7906 -2465 789 7270
5847 7270 8191 654 -4728 -6721 -10300 -12574 -12074 -13666 -4820 6469 12304 11454 13895 8105 2311
5832 2311 -4686 -4573 -3131 -416 -6679 -14793 -17360 -11773 -2558 2974 1856 -2722 -4368 3319 4774
5817 4774 -51 -8432 -11312 -7384 -5363 -4061 -7173 -4769 -3500 -2947 1264 6235 7777 2430 -512
5802 -512 -1580 -1001 -1816 -10384 -11490 -12618 -12305 -7096 -9720 -9868 -4426 623 -494 885 264 4380
5786 4380 6346 6031 3798 4246 4639 2322 1795 6304 3243 3578 3274 -5615 -8204 -10210 -10132 -2037 -4002
5769 -4002 -5103 -6091 -3076 -2175 739 -5975 441 5240 1903 1491 125 -2056 -5238 -8149 -5454 -8763
5753h763J0273J211j813N63K406o030J479M9m930m17k812L273K821O013r64n594
5737c235O681l935m046L877M234p367j711m20J412j464r6L109j382K099K042K027
5721A825o637m815M696N132n24o215m972j241O016M297m461l820M292J285k671
5706g813K68O408L434L414r73r91l078J317j798j893N005O09k224K477r52N305
5690H515q038m692m353l840L873R81L811P186n860p374l88K344Q094K230n299
5675b810k730k608l927K769Q930Q593M098n913j1102n08O266o35l918j421O45
5660d271Q52l457J916k666K050O24k231k414l89L603N680j682q105o926L190Q739
5644e487n457m98q67J686N412M367K333k159l003m965K102R9m957j632O357L997
$$ plain form
5753 -8763 1510 2721 908 1471 3877 -2153 -674 -625 -5555 -5972 -8784 -5511 -2690 3323 2359 -3235
5737 -3235 3446 -489 -4535 -658 3576 -3791 -5502 -5922 -4510 -5974 -6070 -2961 -4343 -2244 -202 1825
5721 1825 -4812 -9627 -4931 201 -323 -6538 -11510 -12751 -6735 -2438 -6899 -10719 -6427 -5142 -7813
5706 -7813 -7545 -1137 2297 5711 4738 3747 669 1986 188 -1705 3300 3909 1685 4162 3210 8515
5690 8515 477 -4215 -8568 -12408 -8535 -7554 -3743 3443 -2417 -9791 -10179 -7835 259 2489 -2810
5675 -2810 -5540 -8148 -12075 -9306 -376 8217 12315 6402 -4700 -5208 1058 423 -3495 -4916 -4271
5660 -4271 -3419 -6876 -4960 -7626 -5576 -4952 -7183 -9597 -9986 -6383 -703 -2385 -10490 -17416 -14226 -5487
5644 -5487 -10944 -11442 -12309 -10623 -5211 -844 1489 -670 -3673 -8638 -6536 -6437 -11394 -13026 -6669 -2672
5628b672N37j439r67K633n598N41J1479R828k38K5n880r375J383k307j176n151
5612h377r421O108O617K929K967J325k109K063M699o396o674K010L397l815L387
5597a290M415m237o703K564L620j282N608Q87m369O30L427O479P02n479l117l753
5581a898j613l44k015k174M538R796O24p72q78O35n079m045p97k382O07K151M129
5564D83J073J316m240j490m8l332K910R520k603m995N73j98k684n259Q544L665
5548C235O734J409p878j3401l369J4866L440k581j524J179j610m101O324o92q325
5533f294j412J622M726N14n042m258O670M155k259L724l009j186N833J660j809
5518C635M309p873r699J935M865K208J410o22j434O05k322l584l070J906O188
$$ plain form
5628 -2672 -2135 -3574 -4541 -1908 -7506 -6965 4514 14342 14104 14129 8249 -1126 257 -2050 -3226 -8377
5612 -8377 -17798 -11690 -5073 -2144 823 2148 39 2102 6801 405 -6269 -4259 -862 -4677 -1290
5597 -1290 3125 -1112 -7815 -5251 -1631 -2913 2695 3582 -787 -157 3270 9749 10451 4972 1855 -1898
5581 -1898 -3511 -3855 -5870 -8044 -3506 6290 6914 6142 5264 5899 820 -3225 -4022 -6404 -5797 -3646 483
5564 483 1556 2872 -1368 -2858 -2906 -6238 -3328 6192 3589 -1406 -833 -1031 -3715 -8974 -430 3235
5548 3235 9969 11378 3500 -9901 -13270 1596 5036 2455 931 2110 500 -3601 2723 2031 -6294
5533 -6294 -7706 -6084 -1358 -844 -5886 -10144 -3474 681 -1578 2146 -863 -2049 3784 5444 3635
5518 3635 7944 71 -9628 -7693 -2828 -620 790 168 -1266 -661 -2983 -6567 -9637 -7731 -1543
5503a543p753p020J792J249l43L038k21j638r55j188O327N12N431R350k077k356
5487B605o149o738M258P866q2Q868M031q120q735k643K375M68M507J699j0110
5472e900j80O359J17l784L950m04n229J335n59J570k229O218l590j814m313k02
5456h655J725r09l6J741J139K802L028m326O170k237J157n037L53K267K822Q751
5440A0755p211l297J137j394j819Q970L757Q027k520l082q078n745l229j427m8
5425e204L374J860l251j352K980m409J1502Q207n607j0030o36M20J782J649r51
5410C34R79l393K476m351o828K021J898l197O0j857K555J072J737N175q56m180
5394f355K479n69P34Q781L11m521m792Q178K757n08k283j1392k101p99M150K482
$$ plain form
5503 -1543 -9296 -16316 -14524 -13275 -13618 -10580 -10801 -12439 -13394 -14582 -8255 -7743 -2312 7038 4961 2605
5487 2605 -3544 -10282 -6024 1842 1760 10628 14659 6539 -2196 -4839 -2464 -1996 2511 4210 -5900
5472 -5900 -6080 279 396 -3388 562 158 -5071 -3736 -4295 -2725 -4954 1264 -2326 -4140 -8453 -8655
5456 -8655 -6930 -7839 -7875 -6134 -4995 -2193 835 -3491 2679 442 1599 -3438 -3085 -818 2004 10755
5440 10755 3544 247 1384 -10 -1829 7141 10898 18925 16405 13323 5245 -500 -3729 -5156 -5204
5425 -5204 -1830 30 -3221 -4573 -1593 -6002 5500 13707 8100 -1930 -2566 -2146 -364 1285 334
5410 334 1313 -2080 396 -3955 -10783 -8762 -6864 -10061 -10001 -11858 -9303 -8231 -6494 -1319 -2175 -6355
5394 -6355 -3876 -4445 -3711 5070 5381 860 -3932 4246 7003 6495 4212 -7180 -9281 -10080 -5930 -3448
5378c448l531j433n366K718M233M697K721P25N608n9n996o56R15n489J621m917
5362g657k163K900L323L876p35q917J472O671J0356K451k067k797j889k924m167
5347b267J716J460m751n801L54J473m030M547m442J985N110L968k136q53J819
5332a848m148m451O084J1212K656n377p257Q70M562K208N67J324n008l586J311
5317h81l608j184K567l362J117j807k344j57j337L349L425K778L788q70m799K495
5301h30L583L1o799p432k7L907k40l74l27K525p09o51j298k383O57Q357L032l508
5283b486j622m53m62M988j801J979M431Q373o372j1756q750N044O261J865J517
5268G56q419Q64j673j76k687M334K784m497L039M595K161R407J919j998r273K814
$$ plain form
5378 -3448 -6979 -8412 -13778 -11060 -6827 -2130 591 1316 6924 6865 869 213 1128 -4361 -2740 -7657
5362 -7657 -9820 -6920 -3597 279 -456 -9373 -7901 -1230 9126 11577 9510 6713 4824 1900 -2267
5347 -2267 -551 909 -3842 -9643 -9289 -7816 -11846 -7299 -11741 -9756 -4646 -678 -2814 -3667 -1848
5332 -1848 -5996 -10447 -4363 6849 9505 4128 -3129 -2259 2303 4511 5078 6402 1394 -2192 -881
5317 -881 -4489 -5673 -3106 -6468 -5351 -7158 -9502 -9659 -10996 -7647 -4222 -1444 2344 1474 -3325 -830
5301 -830 2753 2784 -4015 -11447 -11474 -7567 -7807 -8181 -8508 -5983 -6692 -7343 -8641 -11024 -10367 -2010 1022 -2486
5283 -2486 -4108 -4561 -5023 -35 -1836 143 4574 12947 6575 -5181 -13931 -8887 -2626 -761 756
5268 756 -7663 -6799 -8472 -8648 -11335 -7001 -4217 -8714 -5675 -1080 1081 10488 12407 10409 1136 3950
5252C950O179o521J74q19k158r83J272M104M456n854k252n714j034N178J1928
5237A1906N352p664j2517n673L739R053O387n688o022K012j867m65L874O83m296
5222a186j656j189M679M902K415k895r128l941n138j29K165N285O020k909l572
5207f277O1q40m642k067O692M166O389l42N73k605o174p127L248J467o74K041
5191f111K07o24m143j359j032O082k070l449M952K463j307o74L362N602n185m468
5175g754N276M022K739l671o715p562j436K530L358K652j815o85j29m727L558
5160a0359J3634N597r458K30L349n951L08j151N974m28n062n544k980o078P612
5145a0307J0573M400o511K062M687o80k43j874n503k082J656q93N272k445L378
$$ plain form
5252 3950 10129 3608 3782 2963 805 -178 1094 5198 9654 3800 1548 -4166 -5200 -22 11906
5237 11906 17258 9594 -2923 -8596 -4857 4196 10583 4895 -1127 885 -982 -1447 2427 3110 -1186
5222 -1186 -2842 -4031 648 5550 7965 5070 -4058 -7999 -13137 -13266 -11101 -5816 204 -2705 -6277
5207 -6277 -6216 -7056 -11698 -13765 -7073 -2907 3482 3140 3713 1108 -5066 -12193 -8945 -7478 -8152 -6111
5191 -6111 -5904 -6528 -10671 -12030 -13062 -6980 -9050 -12499 -7547 -5084 -6391 -7065 -3703 1899 -3286 -7754
5175 -7754 -2478 1544 4283 612 -6103 -13665 -15101 -12571 -9213 -6561 -8376 -9061 -9190 -13917 -10359
5160 -10359 3275 8872 -586 -356 2993 -2958 -2650 -3801 2173 1745 -3317 -8861 -11841 -17919 -10307
5145 -10307 266 4666 -1845 217 4904 4224 3981 2107 -3396 -5478 -3822 -4715 557 -1888 1490
5130A490k554j273K080L389k726K21j711J060L582m558n894K352o31k395k809
5115a0377k482M922M523O95Q75l357j020M426O783j637j1511k097K926j646M917
5100d060o16k054l15m559o55O732k084Q178J190J770J459p303O78J362Q42m376
5084c811o114O61M547p749l620K800Q665P141j946l408O295N169O22J36J701l193
5068G896n546k917J136l573j681q35J694k197M489j199M601K834j713p878K334
5053b555O202q496l678pN081l517k52N62J047L435l728m190L822P96j177K828
5037c827k649J107m11l8j1K830l352m630O990J335l265m751P313j620M921J494
5021A436L308L576P5j274o83k627P186n309r643L012K514l187m721P410K759N037
$$ plain form
5130 1490 -1064 -2337 -257 3132 406 627 -1084 -24 3558 -1000 -6894 -4542 -5173 -7568 -10377
5115 -10377 -12859 -7937 -3414 -2719 -1844 -5201 -6221 -1795 4988 3351 -8160 -10257 -7331 -8977 -4060
5100 -4060 -4676 -6730 -7045 -11604 -12259 -5527 -7611 567 1757 3527 4986 -2317 -1639 -277 565 -3811
5084 -3811 -9925 -9264 -4717 -12466 -16086 -13286 -4621 2520 574 -2834 3461 8630 9252 9388 11089 7896
5068 7896 2350 -567 569 -3004 -4685 -5520 -3826 -6023 -1534 -2733 1868 4702 2989 -4889 -2555
5053 -2555 3647 -4849 -8527 -8534 -3453 -6970 -7222 -6660 -5613 -2178 -5906 -10096 -6274 -5478 -6655 -3827
5037 -3827 -6476 -5369 -5780 -5818 -5829 -2999 -6351 -10981 -3991 -2656 -5921 -10672 -3359 -4979 -58 1436
5021 1436 4744 8320 8395 7121 6438 3811 10997 5688 -3955 -943 1571 -1616 -6337 1073 3832 8869
5005H869l411o731n0J411m469q641L984P074m705M955L863N416j109l330r70m142
4989a986J600p136J893J3874j417k933q972m019j748k13m429l723J90L360R114
4974f545m482q919K536J1042K325K69J0313R006o320r996j827j728O15j9l041
4959f771l071K213N262j720l18k78k735O73j070k601k615p93N594M710L73l447
4943f594j566k983N201K539M868r96N007L817j197J241R9Q67j227n894q176M490
4927e04J387J681o096k39o128N701L664k205r71o145k396K623K262N297O599l172
4911A358n501k643n342l747N29m433r439J1774P904O267J901q98j915n73J414
4896c344P1L67J214L771J241K69J0011j423m199l462m738o182K688P565M34l125
$$ plain form
5005 8869 5458 -1273 -1323 88 -4381 -13022 -9038 -1964 -6669 -1714 2149 7565 6456 3126 2156 -1986
4989 -1986 -386 -7522 -5629 8245 6828 3895 -5077 -9096 -10844 -11057 -15486 -19209 -19019 -15659 -6545
4974 -6545 -11027 -19946 -17410 -6368 -4043 -3774 6539 15545 9225 -771 -2598 -4326 -3711 -3730 -6771
4959 -6771 -9842 -7629 -2367 -4087 -4405 -4683 -7418 -6745 -7815 -10416 -13031 -13824 -8230 -3520 -3147 -6594
4943 -6594 -8160 -11143 -5942 -3403 1465 469 5476 9293 8096 9337 9436 10303 9076 3182 -4994 -504
4927 -504 883 2564 -3532 -3771 -9899 -4198 -534 -2739 -3710 -9855 -12251 -9628 -7366 -2069 4530 1358
4911 1358 -4143 -6786 -12128 -15875 -15346 -19779 -29218 -17444 -9540 -3273 -1372 -2270 -4185 -4758 -3344
4896 -3344 -3273 -2906 -1692 2079 3320 3589 13600 12177 7978 4516 -222 -6404 -3716 3849 4283 1158
4880A158J808p15m760o296N559L417j980O86J644R08L15P40P25m21J79J256N306
4863I529k280J833N420l668J172J017q55m138m614K711J666k195j360q49o460
4848c071j343j3799o097M193P627N808N567J148o288j704P155J169l877J442m379
4833f449m744J950M378j918k551K88L156o098M424M882j837k368K591O177j890
4818ip933m708n75L30J33O690N967J717L640l820m063k062o393l178Q928N316
4802b0m93L857J65J050n134n506L984p855J830L978K581N463o287n167L06n558
4786a2806j553o57K552O636M771n23J477k846L96L88L006l834q09M798M219m444
4770G71m10M7J28M294K418l553r638l53M651L004l748N754M816J321n429j649
$$ plain form
4880 1158 2966 2251 -2509 -8805 -3246 171 -1809 -1123 521 1429 1744 2484 3209 2788 2967 4223 9529
4863 9529 7249 9082 14502 10834 12006 13023 12168 8030 3416 6127 7793 5598 4238 3389 -3071
4848 -3071 -4414 -18213 -24310 -20117 -12490 -6682 -1115 33 -6255 -7959 -804 365 -3512 -2070 -6449
4833 -6449 -11193 -9243 -4865 -6783 -9334 -9046 -5890 -11988 -7564 -2682 -4519 -6887 -4296 1881 -9
4818 -9 -7942 -12650 -13225 -12895 -12762 -6072 -105 1612 5252 1432 -2631 -4693 -11086 -14264 -5336 -20
4802 -20 -513 3344 3509 4559 -575 -6081 -2097 -9952 -8122 -4144 -1563 3900 -2387 -7554 -7248 -12806
4786 -12806 -14359 -15016 -12464 -5828 -1057 -1580 -103 -2949 -2553 -2165 841 -2993 -3802 996 5215 771
4770 771 361 408 536 4830 7248 3695 -5943 -6296 -1645 1359 -2389 3365 8181 9502 4073 2424
4754B424J647q83n401l458L494j82j375m186j162L209N270N411j869n29K857J059
4738F326n34j722K308R54n675j959r07J865m700p651k514Q080L895n985n846n98
4722a4663J824L501N853O778L741K504P186J357o285p578m385m591k588R266k651
4707g31n078M603J819m371l221M248N867L474L325m175k228m513j554k679m40
4692e654L624O252m681K262O014j173o066J30r57k724k496N24N084k770k803O35
4676d799k184K29L613n756L092P415n59k646J764l579M109M976m870o39L136k471
4660H31p875M051l27Q238M424j619r81l949r25O71O114K810q667p745K778K690
4644E19L944J777J399n532Q42k231n336q99k806j616R034m663K998N636k999Q42
$$ plain form
4754 2424 4071 3188 -2213 -5671 -2177 -2359 -3734 -7920 -9082 -5873 -603 4808 2939 2410 5267 6326
4738 6326 5792 4070 6378 7332 1657 -302 -1209 656 -4044 -11695 -14209 -6129 -2234 -8219 -14065 -14663
4722 -14663 -12839 -9338 -3485 3293 7034 9538 16724 18081 11796 4218 -167 -4758 -7346 1920 -731
4707 -731 -5809 -1206 613 -3758 -6979 -2731 3136 6610 9935 5760 3532 -981 -2535 -5214 -5654
4692 -5654 -2030 4222 -459 1803 7817 6644 578 708 -249 -2973 -5469 -4945 139 -2631 -5434 -4799
4676 -4799 -6983 -6754 -3141 -8897 -5805 1610 1051 -1595 169 -3410 699 5675 805 166 3302 831
4660 831 -7044 -2993 -3320 4918 9342 7723 6742 2793 1868 2539 8653 11463 2796 -4949 -2171 519
4644 519 4463 6240 7639 2107 2949 718 -4618 -5517 -8323 -9939 -905 -5568 -2570 3066 67 909
4628I09j292n454j312L266N253M41K330j0529p536J592O605K664J130K06J847
4613A20j66N111k264J481j647M236k119m005K970P798J017m200n18R305p96j22
4597A6201k941k890n007j553n331N62N670M80L293R13N95l465l807r637j786L964
4581d739N478L392j17l360J104M070j558l86k512j562M334l5m507n969J827J1275
4565F735O595r890q963L730K722j884o324j094O524J640l177r25m953J1321l52
4550A705k025m655o715m93J147J009K967N47J1866M940m448q094q43k414N977
4535D71P06r50k457M488r23l003J342j13K608r433m472J084R61j979K375L215
4519f080O305j2k719R31N185K517j206J829J000j521l270K225J216L924r427k137
$$ plain form
4628 909 -383 -5837 -7149 -3883 1370 1811 4141 -6388 -13924 -12332 -5727 -3063 -1933 -1727 120
4613 120 -46 5065 2801 4282 2635 6871 4752 747 3717 11515 12532 8332 7814 17119 16323 16201
4597 16201 13260 10370 5363 3810 -1521 -959 4711 5191 8484 9397 9992 6527 2720 -6917 -8703 -4739
4581 -4739 739 4131 4014 654 1758 5828 4270 3884 1372 -190 4144 4109 -398 -6367 -4540 6735
4565 6735 13330 3440 -5523 -1793 929 -955 -7279 -8373 -1849 -209 -3386 -4311 -9264 2057 1705
4550 1705 -320 -4975 -11690 -12183 -11036 -10027 -7060 -6513 5353 10293 5845 -2249 -3092 -5506 471
4535 471 1177 227 -2230 2258 1335 -1668 -326 -439 2169 -7264 -11736 -10652 -9691 -11670 -9295 -6080
4519 -6080 225 213 -2506 -1575 3610 6127 4921 6750 7750 6229 2959 5184 6400 10324 897 -1240
4503a240p77l374J333m15l337J33L275j181k917j758p50J100q02O490P481k956
4487C05j653L750M23j010p216J4N97l994p783o171L077J6020N417L591j007k695
4471A665k185n319j303R392J2072N089m324o352K129L511j643m201N78j287K51
4456H073K095J836k889j0157l394M513J723K938j227k840m26L773p122k91M042
4441F47L31j409m202k884Q296K219l948l134K886J806k383j960j53k468N49M627
4425a180k929l40Q26K665j337N063J506j354J0310k5l56k233r059N38J695l808
4409a8k917L211j814k44J373q2K019l941k347%l323l911K561J4839O209o942l701
4392I72j273l69K8n405k918j0391J671O117K924K566j307L055m766j194J0101
$$ plain form
4503 -1240 -2017 -5391 -4058 -4473 -7810 -7677 -4402 -5583 -8500 -10258 -11008 -9908 -10710 -4220 3261 305
4487 305 -1348 2402 2825 1815 -5401 -5387 -4790 -8784 -16567 -22738 -19661 -3641 1776 5367 4360 1665
4471 1665 -520 -5839 -7142 2250 14322 19411 15087 8735 10864 14375 12732 8531 9109 7822 8073
4456 8073 10168 12004 9115 -1042 -4436 77 1800 4738 3511 671 245 4018 -3104 -3395 647
4441 647 978 -431 -4633 -7517 779 2998 -950 -4084 -1198 608 -1775 -3735 -3888 -6356 -5807 -1180
4425 -1180 -4109 -4449 -3623 -958 -2295 2768 4274 2920 13230 13205 12849 10616 1557 2095 3790 -18
4409 -18 -2935 276 -1538 -1782 -409 -491 1528 -2413 -4760 -4760 -8083 -11994 -9433 5406 11615 4673 972
4392 972 -301 -670 -642 -6047 -8965 -19356 -17685 -11568 -8644 -6078 -7385 -4330 -9096 -10290 -189
4377a89K987j838n080l297O211N16m779m333N819O035j204K542k096j534j397
4362a637L425l183m658m325M580O787K303p181J634M472l132j417R340N69l594
4347C983l797l902r23m311m240L106J0360M967L931k809p081n70P475J912J717
4332I818J384M943l89o764p077Q046O518R94o428l008J882N3j2004l846Q69j260
4316f269N608j608K082O693J206p827n187l97m142R65K753m85j591j982n826Q57
4300a5150R823O06n053L155p36l631j82j203J1027O008J544n76K35l522K568M746
4284I659M474o131p243j785J218j351N56r59o192L506J637Q97J541l323L138O540
4268F182J92j19J671k661o574o5M746L285r497L496O347k405n075m489N003N571
$$ plain form
4377 -189 2798 960 -4120 -7417 -1206 -690 -5469 -9802 -3983 2052 848 3390 1294 -240 -1637
4362 -1637 1788 -1395 -6053 -10378 -5798 989 3292 -3889 -2255 2217 -915 -2332 7008 7577 3983
4347 3983 186 -3716 -4639 -8950 -13190 -10084 276 5243 9174 6365 -716 -1286 6189 8101 9818
4332 9818 11202 16145 15756 8992 1915 9961 16479 17473 11045 8037 9919 9972 -2032 -5878 -5009 -6269
4316 -6269 -661 -2269 -187 6506 7712 -115 -5302 -5699 -9841 -8876 -6123 -6608 -8199 -10181 -16007 -15150
4300 -15150 -5327 -4721 -9774 -6619 -7355 -10986 -11168 -12371 -1344 4664 6208 5632 5867 2345 4913 9659
4284 9659 14133 8002 759 -1026 192 -1159 -603 -1562 -7754 -4248 -2611 -1714 -173 -3496 -358 6182
4268 6182 6374 6255 7926 5265 -1309 -1374 3372 6657 -2840 656 7003 4598 -477 -4966 37 5608
4252E608k477l836k96J927p401N563l027N119J431M436Q592L293n384j0996o116
4237c564J347J930k037M944Q907l449l950j708P023K227m894r586j959L532Q80
4222c57J194J215k991m633M55q72m142l627P634r77L29L965M910K285L90M36j824
4205C390K929m170n057n026j389m63M436J1821N489j431n986m421O85l329o662
4190i184j462P302N536L14m904l043l254M14P725L875l414J053N563K029K469
4175A1019L632m936j0767k451K478J444M245k813q196l094L073J860N597M343
4161E434k163j013m182N774J330k247j914l93N055J065m742k179M057P602R76
4146A2460j2345p70L504k197k572n186Q65P744L415M329j700J651q97j0808n69
$$ plain form
4252 5608 3131 -705 -1001 926 -6475 -912 -3939 1180 2611 7047 15639 18932 13548 2552 -3564
4237 -3564 -2217 -287 -2324 2620 11527 8078 4128 2420 9443 11670 6776 -2810 -4769 -1237 -357
4222 -357 837 2052 -939 -5572 -5117 -5989 -10131 -13758 -6124 -7101 -6772 -2807 2103 4388 4778 5214 3390
4205 3390 6319 2149 -2908 -7934 -9323 -9786 -5350 6471 11960 10529 4543 122 807 -2522 -9184
4190 -9184 -10646 -3344 2192 2506 -2398 -5441 -8695 -8281 -556 3319 -95 958 6521 8550 11019
4175 11019 14651 9715 -1052 -3503 -1025 419 4664 1851 -6345 -9439 -6366 -4506 1091 5434
4161 5434 3271 2258 -1924 3850 5180 2933 1019 626 5681 6746 2004 -175 3882 11484 12460
4146 12460 115 -655 2849 652 -1920 -7106 -6241 1503 4918 9247 7547 9198 8301 -2507 -3076
4131c076N431L611m611m227N383N536k68J043r32l202j30l860M6p450P10N507
4115d89l650k259K986M76L496L376O21K76j018l474p352k249m423L614L882j369
4099g556L664M348N806J386m955n535r92J536l426K546M20O066R172k121o732
4084C627m508l095l602K470L854n03j335K777L754p054j495P77L997L129j503
4069A290m279k063K561J502l630k802o74r04M305P282k176l524j274j162k394
4054g942J0391K514r67K0K122j033k770L38o881q204J576K326Q178L596j668n893
4038d297q04O856l830k103j040L686M210r705n246M440m303k154p51P670M819
4023b552m913o03N493L391M02J916l96m816P6k200O3j543O702N575N661o25q963
$$ plain form
4131 -3076 2355 5966 1355 -2872 2511 8047 7779 8822 7890 4688 4558 698 744 -6706 -5996 -489
4115 -489 -4139 -6398 -3412 -2936 560 3936 4557 4833 3815 341 -7011 -9260 -13683 -10069 -6187 -7556
4099 -7556 -3892 456 6262 7648 2693 -2842 -3834 -2298 -5724 -3178 -2758 3308 12480 10359 3627
4084 3627 -881 -3976 -7578 -5108 -1254 -1757 -3092 -315 3439 -3615 -5110 -4333 -336 2793 1290
4069 1290 -2989 -5052 -2491 -989 -4619 -7421 -8095 -8999 -4694 2588 412 -3112 -4386 -5548 -7942
4054 -7942 2449 4963 3996 4016 6138 5105 2335 2673 -4208 -12412 -10836 -8510 -332 3264 1596 -4297
4038 -4297 -5101 1755 -2075 -4178 -5218 -1532 2678 -7027 -12273 -7833 -12136 -14290 -15041 -7371 -2552
4023 -2552 -7465 -8068 -2575 816 1218 3134 2738 -2078 -2002 -4202 -4139 -5682 1020 6595 12256 11631 2668
4006B668Q97k679n592M213Q099N99L13k497m034K753o983j2L626N25L595J623
3990G114K678l136j395o01n315o60O280k448m017l657k466J926R847l944J716
3975A922M372L577r79q032l896L275L76p90j894n58j719l838K603N035N266k661
3959B059o235j43j385k76J050k563J71P13O116N800k442m91K068l042k63j968
3943h31j328J727K13o07l404j881Q45j094L826J573k73p898l538m12J0251J450
3927a381M774j74J898m74L777M8Q93J815n226q362p087M424L014J970J488J55
3911A552j0p39k521m558l631l702K870n22P103M162o707l435o57J048l022Q98
3895a1871K424O940R656L797j963k205m776J363M177k806J461K381o078l396k852
$$ plain form
4006 2668 3565 886 -4706 -493 7606 8205 8518 6021 1987 4740 -2243 -2255 1371 1896 5491 7114
3990 7114 9792 6656 5261 4660 -655 -1315 4965 2517 -1500 -5157 -7623 -5697 4150 206 1922
3975 1922 6294 9871 8892 860 -3036 239 615 -175 -2069 -2627 -4346 -8184 -5581 -546 4720 2059
3959 2059 -4176 -4319 -5704 -5980 -4930 -7493 -7322 -6609 -493 5307 2865 2374 4442 1400 1137 -831
3943 -831 -2159 -432 -219 -826 -4230 -6111 -5266 -6360 -2534 -961 -1234 -9132 -12670 -13082 -2831 -1381
3927 -1381 3393 3219 5117 4643 8420 8468 9361 11176 5950 -2412 -9499 -5075 -2061 -91 1397 1552
3911 1552 1542 803 -1718 -6276 -9907 -13609 -10739 -11261 -4158 4 -6703 -10138 -10795 -9747 -12769 -11871
3895 -11871 -9447 -2507 7149 10946 8983 6778 2002 3365 7542 4736 6197 8578 2500 -896 -3748
3880c748l465m022k583P903P552m345r97J1214N658l206m731n817l058J084K989
3865D28Q73L49l441l674K435J345M942o38p01M905K671o994j1152L499R214K400
3849F461j073n540m592P01Q896Q125K343m92m280n342j265J072Q37n69o08j5p19
3832C940p66J927K614j780p357o128Q020L743o67l719m807r6N136k144K381L937
3816D234n582o313m107L649O189R61q32k331L220P26k917o411N561J525R9L352
3800A023k046n736L4k570K045k600j7o97j433O58j147M690N716O568m497r74Q014
3783G031k888m063K148K907K328m946k638o03J683N797o58m051o1L579J832j781
3767E616J958L611j743m497L646o76l974J794l058J018k63p681N325J682Q25k403
$$ plain form
3880 -3748 -7213 -11235 -13818 -5915 1637 -2708 -3705 7509 13167 9961 5230 -587 -3645 -2561 428
3865 428 1301 1650 -1791 -5465 -3030 -1685 3257 2619 1918 6823 9494 2500 -8652 -5153 4061 6461
3849 6461 5388 -152 -4744 -4043 4853 12978 15321 14829 10549 5207 3942 5014 5851 5282 4674 4659 3940
3832 3940 3174 5101 7715 5935 -1422 -7550 470 4213 3546 -173 -4980 -5076 60 -2084 297 4234
3816 4234 -1348 -7661 -11768 -8119 -1930 -969 -1801 -4132 -912 -186 -3103 -9514 -3953 -2428 -2329 1023
3800 1023 -1023 -6759 -6725 -9295 -7250 -9850 -9867 -10564 -11997 -11339 -12486 -7796 -2080 4488 -9 -983 7031
3783 7031 4143 80 2228 5135 7463 2517 -121 -724 959 6756 6098 2047 1986 5565 7397 5616
3767 5616 7574 11185 9442 4945 8591 7915 3941 5735 2677 3695 3432 -4249 1076 2758 3583 1180
3751A180J685p392l147J03n51J978N848j803J066P29j399K101K737P675K762l829
3735I743q785j474M714j33J878m451q9R77J836J279K503K941m736k982N711l828
3719E104o790l744M489M251j903k450m122m98J606l70l84J922N157M772n166m919
3703c045k136k013M80N070K909O711J940k368o985p07O39p93n49J935l172R03
3687a181N175k698J441J909p176j2479K399J3392K454l952o425m528m397Q934
3673g132j555k681R190L995k494k419L711n35n493M32J546M408j87k819k730j06
3657d869O545k610K153J803m778j086M732K597J227j764N52l24Q62K23J288j262
3641E289o3l049o412M649J973q481J85L6M661N97l549K161L087J64k331l60r80
$$ plain form
3751 1180 2865 -4527 -7674 -7571 -8122 -6144 -296 -2099 -1033 -304 -1703 398 3135 10810 13572 9743
3735 9743 958 -516 4198 4065 5943 1492 1403 2380 4216 5495 7998 10939 6203 3221 8932 5104
3719 5104 -1686 -5430 -941 3310 1407 -1043 -5165 -5663 -4057 -4427 -4811 -2889 2268 7040 1874 -3045
3703 -3045 -5181 -7194 -6714 -1644 1265 7976 9916 7548 563 -144 495 -298 -847 1088 -2084 -1181
3687 -1181 3994 1296 2737 4646 -2530 -15009 -12610 782 3236 -716 -7141 -11669 -16066 -7132
3673 -7132 -8687 -11368 -2178 1817 -677 -3096 615 80 -5413 -4981 -3435 973 786 -2033 -4763 -4869
3657 -4869 1676 -934 1219 3022 -1756 -2842 1890 4487 5714 3950 4502 4178 5040 5263 6551 5289
3641 5289 5226 2177 -4235 414 2387 -6094 -5909 -5873 -1212 -615 -4164 -2003 1084 1248 -1083 -1443 -2423
3624b423l908K922j540M892R593q27l410j664M056J260L59q452N21k789k472R23
3608b959K042l97O294q56l930n479J644l235O563L073l080N06L480M815l648q549
3592c716O032k382l516m03k802l838O132L180l578K010m953R06J2235k30k909
3577B168j393M763R65r59K262J1j079o034q80K504K838q49l520k553j634N05q77
3560c762k479k937K401R445O571k426n85n905o454M5M495k647K690J51n39n357
3544g293K309N57J117L308k534M797k570L294M110p416n885M828P534p72K13l525
3528B072j867P752P73p241l249m97K406P595j821q464k622l804J364L489N731
3513A617O509M633J611N540M92m099m747l201J314P99Rm590o162m367N031L237
$$ plain form
3624 -2423 -6331 -3409 -4949 -57 9536 8709 5299 3635 7691 8951 9310 858 1379 -1410 -3882 -2959
3608 -2959 -917 -1314 4980 4124 194 -5285 -3641 -6876 -313 2760 -320 186 3666 8481 4833 -3716
3592 -3716 2316 -66 -3582 -3985 -6787 -10625 -4493 -1313 -4891 -2881 -7834 -6928 5307 5077 2168
3577 2168 775 5538 6503 5544 7806 7817 6738 704 -176 2328 5166 4317 797 -1756 -3390 -2885 -3762
3560 -3762 -6241 -9178 -6777 2668 9239 6813 6228 323 -6131 -6086 -1591 -4238 -1548 -1397 -1936 -7293
3544 -7293 -4984 -4427 -3310 -2 -2536 2261 -309 2985 7095 -321 -6206 -1378 6156 5384 5597 2072
3528 2072 205 7957 8730 1489 -1760 -2257 149 7744 5923 -2541 -5163 -8967 -7603 -4114 1617
3513 1617 8126 12759 14370 19910 20402 16303 11556 8355 9669 10468 10477 5887 -275 -4642 389 3626
3497C626k915j863J516j208q74k928K313M09l462p098j158L978N383P989K981
3482F689M215k013j097r05R743n51m632p226k145j450m261M232K518k09M300o32
3466F576n052l431L023N587p679j0172J464L095k159J86o191L111Q078O586K655
3451E677M97r8j802j1994m052L099J2568J0710p366n587J2098k356n627k351l823
3436d07o15l755J010q508j236M496L282L068K161K797l41M691J258p002K917q72
3420B944L037l041K419K356o387N052L113k315m28r25j898q63l815K501N104q
3404F846p124M362L56j0413m685K614q78O05M690k643m494M730N105K397J265
3389B733p86j356k205M35k156L426l431q67k427o838K628N818L246M68L318L324
$$ plain form
3497 3626 711 -1152 364 -844 -1718 -4646 -2333 -1924 -5386 -12484 -13642 -9664 -4281 3708 6689
3482 6689 10904 8891 7794 6889 16632 16081 11449 4223 2078 628 -3633 599 3117 2908 7208 6576
3466 6576 1524 -1907 1116 6703 -976 -11148 -9684 -6589 -8748 -8562 -14753 -11642 -3564 3022 5677
3451 5677 6174 6076 4274 -7720 -11772 -8673 3895 14605 7239 1652 13750 11394 5767 3416 -407
3436 -407 -1022 -4777 -3767 -12275 -13511 -9015 -5733 -2665 -504 2293 1952 6643 7901 899 3816 2944
3420 2944 5981 2940 5359 7715 1328 6380 9493 7178 6750 5825 3927 3064 -751 1750 6854 6846
3404 6846 -278 4084 4440 -5973 -10658 -8044 -8922 -8317 -3627 -6270 -10764 -6034 -929 1468 2733
3389 2733 1947 591 -1614 -1179 -3335 91 -3340 -4207 -6634 -13472 -10844 -5026 -1780 -1312 2006 5330
3373E330m922j202k12r118j047M601N196N278k686m674K865q76N765n43j582O039
3357H212J73j722n896J701J998j597L64N6j40k788M785J715j444j1004o426m31
3341a2444L609q28P089N032m95j280n787m768m718M229N274K630N992N435l432
3326E538p390n74n950j001M238O020N600Q97J72l426m384l838n270k101J093L705
3310f671K042L070O885L720j16L858J082p005m921o923p017k798M969K623K563
3295d639k081J469P105k546l930j223J978n75k02k904K725R521M34r329q674j073
3279a3944R587o28O260o90p77j21M215L025O165k78q226k135O13k232K419N035
3263H288j299m638n241k418N697k658k903j941M034O116P08k774O83r4n615K915
$$ plain form
3373 5330 408 -794 -1006 -10124 -11171 -6570 -1374 3904 1218 -3456 -591 -1467 4298 3755 2173 8212
3357 8212 8385 6663 767 2468 4466 2869 3233 3289 3149 361 5146 6861 5417 -5587 -12013 -12444
3341 -12444 -8835 -9663 -2574 2458 1963 683 -5104 -9872 -14590 -10361 -5087 -2457 3535 8970 5538
3326 5538 -1852 -2426 -8376 -9377 -5139 881 6481 7378 7550 4124 -260 -4098 -9368 -11469 -10376 -6671
3310 -6671 -4629 -1559 5326 9046 8930 12788 13870 6865 1944 -4979 -11996 -14794 -9825 -7202 -4639
3295 -4639 -6720 -5251 1854 -692 -4622 -5845 -3867 -4442 -4644 -7548 -4823 4698 5132 -4197 -12871 -13944
3279 -13944 -4357 -4985 1275 585 -192 -313 3902 6927 13092 12814 4588 2453 3066 834 3253 8288
3263 8288 6989 2351 -2890 -5308 389 -2269 -5172 -7113 -3079 3037 3745 971 1654 1560 -4055 -1140
3247a140L273L432o09q072m28L76j003j470n194O810L867O84j68J544l966r68
3231c032K141M483m900M201O174m463j0679q062q51M927K129N613L169o209r91
3216f350J586K06j535M31L852K951k228m335p34J1512j547j804N31J478R56J253
3200F223j086Q547m817k150J587j539N143P511o107o607k709j112J286k496m199
3185b525j471K927M046l626J278N182l51l354L005l185j1462m62O272K845O746
3170E865k18k952j916M76l47L81l345o83K745N332K014o23o312m838O1M405K397
3153B442k245m522K982O481P176k819l054n53L296p336p77J36L468l369p737L243
3137c188M45m894N063R023j197j577K50k28K457p22J082o451m148j139k11M937
$$ plain form
3247 -1140 2133 5565 4956 -3116 -3544 -3168 -4171 -5641 -10835 -4025 -158 526 358 1902 -2064 -3032
3231 -3032 -891 3592 -1308 2893 9067 4604 -6075 -14137 -14988 -10061 -7932 -2319 850 -5359 -6350
3216 -6350 -4764 -4558 -6093 -5662 -1810 1141 -1087 -5422 -6156 5356 3809 2005 2536 4014 4970 6223
3200 6223 5137 13684 8867 6717 8304 6765 11908 19419 13312 6705 3996 2884 4170 1674 -2525
3185 -2525 -3996 -1069 2977 -649 629 5811 5460 2106 5111 1926 -9536 -9998 -3726 -881 5865
3170 5865 5647 2695 779 1255 908 1289 -2056 -2739 6 5338 7352 6729 417 -4421 -4360 45 2442
3153 2442 197 -4325 -1343 5138 12314 9495 6441 5888 9184 1848 1071 1207 4675 1306 -6431 -3188
3137 -3188 -2743 -7637 -2574 6449 5252 3675 3925 3697 6154 5432 6514 63 -4085 -5224 -5435 -498
3121d98M462M382k849r91k735o903q66L243N26j265L91J297N90J830p036j369
3105g791J707l190j461P791L060N31K731L175j450k422k556O02J133M916j128
3090E648J566N107P99j564l15K321p078r443J4K333j054N458J740j507j392l816
3074a183P919J0395m577m567N675L927k025j140n314m04K498n563L851j966p909
3059c83j476l76J428L844p57p28R269J133o609m427r71L870k441o463P376M262
3043F551l121n606m258k586k116o63j065M877K931J133Q166O369M793j02L25j0919
3027D709l393k209l280K488J542N61M23m090L91n13K215k299M11K270m46m463
3011e683P031p7o064n059O626N753j489M407k439j109J31q07P55L8O329j075P77
$$ plain form
3121 -498 3964 8346 5497 4506 1771 -5132 -5998 -2755 -2229 -3494 -3103 -1806 -1216 614 -6422 -7791
3105 -7791 -6084 -9274 -10735 -2944 116 647 3378 6553 5103 2681 125 727 1860 6776 5648
3090 5648 7214 12321 13120 11556 11241 13562 6484 -2959 -2945 -612 -1666 3792 5532 4025 2633 -1183
3074 -1183 6736 17131 12554 7987 13662 17589 15564 14424 9110 8706 11204 5641 9492 7526 -383
3059 -383 -1859 -2235 -807 3037 2280 1552 10821 11954 5345 918 -53 3817 1376 -5087 2289 6551
3043 6551 3430 -2176 -6434 -9020 -11136 -11799 -12864 -7987 -5056 -3923 4243 10612 15405 15303 15628 4709
3027 4709 1316 -893 -4173 -1685 -143 418 841 -3249 -2858 -3371 -1156 -3455 -3044 -774 -1220 -5683
3011 -5683 1348 1271 -4793 -9852 -3226 2527 1038 5445 3006 1897 2028 1221 1976 2014 8343 7268 8045
2994H045K13l969N47L948n593j1051j649k75o71L216O196l424k776P220O81l753
2978c095N725K908L110k477o065R72O022L371n683n076k00N27O740K820L668l537
2962I730p850l540M769M596N88K741K68k396m023P498j061n097j301l431P33j443
2946G81k37N426L146j529q104m3l113j625J117J308j92P963P251p008p962j590
2930d411j113N236O224J88p045j376P332j87l68k153K079K158J257j441q038k193
2914c851J0003P06L822l301l520l63L845k989l160J125M055J110m199k033J869
2899C119J437J058L52m71j123j258n708K522J209M952j345p035k542J823J266
2884a744L4O887M543n621k76q03K408j314l419Q92L804m445n044L335P370M431
$$ plain form
2994 8045 8258 4289 4836 8784 3191 -7860 -9509 -9784 -10455 -7239 -1043 -4467 -7243 -23 658 -3095
2978 -3095 2630 5538 8648 6171 106 1078 7100 10471 4788 -288 -488 39 6779 9599 13267 9730
2962 9730 1880 -1660 3109 7705 8293 11034 11302 8906 4883 12381 11320 6223 4922 1491 2224 781
2946 781 544 5970 9116 7587 -517 -560 -3673 -5298 -4181 -2873 -3065 4898 12149 5141 -2821 -4411
2930 -4411 -5524 -288 5936 6124 -921 -2297 5035 4848 4480 2327 4406 6564 7821 6380 -1658 -3851
2914 -3851 6152 6858 10680 7379 3859 3496 7341 4352 1192 2317 6372 7482 3283 1250 3119
2899 3119 4556 5614 5966 5495 4372 3114 -2594 -72 1137 6089 4744 -2291 -4833 -3010 -1744
2884 -1744 -1710 5177 9720 4099 3823 3020 5428 4114 695 1587 5391 946 -4098 -763 6607 11038
2868A1038m587n762l913N161J230m554o903N483P958o99j706J876M005P304m802
2853A1129m410r748l554L382L610L306n185j691L739N090R95j00O51j232J551
2838G533Q11J397L996p31q355q489o19K721K964J145l770M41j753k535M297k011
2822b958L30k312R10m82m497n55O88N938L88j364O363N835p72o893K51j253j319
2805a702Q245K52o256o21J556j837J478P049k768K890o58l48K355l533Q370J760
2789A6232l235m421l792J434k560J364J504k679n453q40M339K07o100k918K905
2774d013o23P780k628J668Q83M433N3q529k010j17j417L750K878M63K925P573
2758A3069j659o449l11l79L873o92o459k018l370J826L251M42p504L71P262j158
$$ plain form
2868 11038 6451 689 -3224 1937 3167 -1387 -8290 -2807 5151 4452 2746 4622 8627 15931 11129
2853 11129 6719 -3029 -6583 -3201 409 3715 -1470 -3161 578 5668 6663 6563 7214 5982 7533
2838 7533 8344 9741 13737 13006 4651 -3838 -4457 -1736 1228 2373 -1397 -956 -2709 -5244 -947 -2958
2822 -2958 -2628 -4940 -4030 -4512 -9009 -9564 -8876 -2938 -2550 -3914 2449 8284 7512 619 870 -383 -1702
2805 -1702 6543 6795 539 -82 1474 -363 1115 8164 5396 8286 7628 7280 9635 6102 14472 16232
2789 16232 12997 8576 4784 6218 3658 5022 6526 3847 -1606 -2446 1893 2100 -4000 -6918 -4013
2774 -4013 -4636 3144 516 2184 3067 7500 7553 -976 -2986 -3103 -4520 -770 2108 2571 5496 13069
2758 13069 11410 4961 4650 4271 8144 7452 993 -1025 -4395 -2569 682 1124 -6380 -6009 1253 95
2742I5o034M155N59j804L196j795m461L081M041j155j677q591j335K325o232n46
2726a6178O593P584L878M70k980j824R506J871j790L821L271k798q54J127m179
2711G518n07j306J076O01m74K879m858m373L935K001L011J670j825k260m461P971
2695A0598J656k842l890l186j6261j150J2980K722j948j824j201J28P721K61L242
2680G006p21j865N12K604L532j1617q032m14k954K460L578J35p424q570L409Q561
2664i800M321r19M914m20o390J038J086q24m609J418J1571J0410l087l099l112
2649B498l616k827k572J973N415K002M133L017k871l38m524n87M245r53l470k409
2633h84p282L744K25j908K286J5253L305n989k533k678r76K502l86r655o758L60
$$ plain form
2742 95 -5939 -1784 -1225 -3029 167 -1628 -6089 -3008 1033 -122 -1799 -10390 -11725 -9400 -15632 -16178
2726 -16178 -9585 -2001 1877 2347 -633 -2457 7049 8920 7130 10951 14222 11424 10570 11697 7518
2711 7518 7011 5705 6781 7382 6908 9787 4929 556 4491 6492 9503 11173 9348 7088 2627 10598
2695 10598 12254 9412 5522 2336 -13925 -15075 -2095 627 -1321 -3145 -4346 -4218 3503 3764 7006
2680 7006 6285 4420 4932 7536 11068 -549 -8581 -8995 -11949 -9489 -5911 -5776 -13200 -21770 -18361 -9800
2664 -9800 -5479 -6398 -1484 -1904 -8294 -7256 -6170 -6994 -11603 -10185 1386 11796 8709 5610 2498
2649 2498 -1118 -3945 -6517 -4544 871 2873 7006 10023 7152 6814 2290 1703 5948 4995 1525 -884
2633 -884 -8166 -4422 -4197 -6105 -3819 11434 14739 8750 6217 3539 2563 5065 4679 -4976 -11734 -11374
2617a1374P339o367O462R14K701P46k254n175K719p83L832J813L212K834k666
2602C953q633N54K057K85M188M470K679K655K54L146k99l001o957n200o22j998
2586b469K356p88K294K146l34l128l056M573L836Q14j93m820j87j028J91p56N774
2569E225j176n185L57N126l595p633Q33J012K04K60R31N56j03n815J300O401Q5
2552a217j439k781K095j777r49K408L26M786o798m710N962K222q241j794J129
2537a0778L488M1Q85K459J73j290J77J244L316N140j863J670K476P43P54j1231
2521b596o88K586L110N913L884%j0221k384m196R968j129m57j29j026K541j495
2505C681l591n233p186M937L226m663l442M611K23l949R83O472M590m609k420
$$ plain form
2617 -11374 -4035 -10402 -3940 -3026 -325 421 -1833 -7008 -4289 -5072 -1240 573 3785 6619 3953
2602 3953 -4680 -4126 -2069 -1784 2404 6874 9553 12208 12462 15608 15309 12308 5351 151 -471 -2469
2586 -2469 -113 -901 1393 3539 3205 77 -2979 1594 5430 6244 6051 1231 1044 16 207 -549 5225
2569 5225 4049 -1136 -779 4347 752 -6881 -6048 -5036 -4832 -4572 -3641 -3085 -3188 -9003 -7703 -1302 -1217
2552 -1217 -2656 -5437 -3342 -5119 -6068 -3660 -3334 1452 -5346 -10056 -4094 -1872 -10113 -11907 -10778
2537 -10778 -7290 -7249 -6364 -3905 -3732 -5022 -4845 -3601 -285 4855 2992 4662 7138 7881 8635 -2596
2521 -2596 -3284 -698 2412 8325 12209 12209 1988 -396 -4592 5376 4247 3790 3661 2635 5176 3681
2505 3681 90 -5143 -12329 -7392 -4166 -8829 -12271 -7660 -7437 -11386 -10403 -3931 659 -3950 -6370
2490f370n70l690M519N097M005q24r13K511K610J664K579l228o202J856M035P91
2474G870K164K989k723L43o260p076l714k670M052K719k532O667P581Q781j333
2459A6858j3507j0136j267P326M791O962j310J82j0303o835M428L986k380R6N037
2444C928j340J572L751K06M627j28p949o08j220l275l528K370o97n063j425J733
2428g046L180j731L477L576N245K226m207m396m199L348l16j072R13J092L751
2413C841L401r05O71J690l451k248m138R14J886K519m28k894j660K499k093l437
2397c833m694n029k036m512O877Q769l419l08J405O472l97j2115k014P747M350
2382b737j464O24K537P32k1L383L492L92K012p364m439k136O815Q142k657l897
$$ plain form
2490 -6370 -6940 -10630 -6111 -1014 2991 2167 1254 3765 6375 8039 10618 7390 1188 3044 7079 7870
2474 7870 10034 13023 10300 10643 4383 -2693 -6407 -9077 -5025 -2306 -4838 1829 9410 18191 16858
2459 16858 3351 -6785 -8052 -726 4065 11027 9717 9899 -404 -7239 -2811 1175 -1205 -1109 3928
2444 3928 2588 4160 7911 8117 12744 12616 4667 4059 2839 -436 -3964 -1594 -2291 -7354 -8779 -7046
2428 -7046 -3866 -5597 -2120 1456 6701 8927 4720 324 -3875 -527 -843 -1915 -1002 90 3841
2413 3841 7242 6337 7008 8698 5247 2999 -1139 -225 1661 4180 3752 858 -802 1697 -396 -3833
2397 -3833 -8527 -13556 -15592 -20104 -13227 -4458 -7877 -8185 -6780 -308 -705 -12820 -14834 -7087 -2737
2382 -2737 -4201 -3577 -1040 -308 -329 3054 6546 6938 8950 1586 -2853 -4989 1826 9968 7311 3414
2366C414j0874p0N891P016l462l056L818L696K383l500J185j049p84q22J223J77
2350E186j213K481j889p207k657K660O987m39j604m098J308N659K966p1K081L500
2334A3650l002n300k842j008n106P79l696j104L285Q293M559q184j1668j834L371
2319i807m672n42j626R664P134L43K149j671K227J234R06P346k621n414m683k414
2303b447O23K924N533m73o294Q44m395j498j074P382L619n473R30O44k403L110
2287A552K068L318R33j121J467J756j309n78o72N950l593K340n39K814o182o759
2271A445j808j436R33M230K227J0558M547n094o923l753q219j472J355q64K41
2256d033L387Q866o05K545j82l976N79K926p572j125j740M185J752O391j013p406
$$ plain form
2366 3414 -7460 -7530 -1639 5377 1915 -1141 2677 6373 8756 5256 6441 5392 4608 3786 5009 5186
2350 5186 3973 6454 4565 -2642 -5299 -2639 4348 3909 2305 -1793 -485 5174 8140 8069 10150 13650
2334 13650 10648 5348 2506 1498 -3608 -2829 -6525 -7629 -4344 3949 8508 324 -11344 -13178 -9807
2319 -9807 -14479 -15021 -16647 -6983 151 494 2643 972 3199 4433 5339 12685 10064 4650 -33 -2447
2303 -2447 -1824 1100 6633 6160 -134 710 -3685 -5183 -6257 1125 4744 -729 201 845 -1558 1552
2287 1552 3620 6938 7871 6750 8217 9973 8664 8086 7414 13364 9771 12111 11572 14386 8204 1445
2271 1445 -363 -1799 -866 3364 5591 16149 20696 15602 8679 4926 -3293 -4765 -3410 -4274 -4033
2256 -4033 -646 8220 7615 10160 9978 6002 6581 9507 1935 810 -930 3255 5007 11398 10385 2979
2240B979m044N093N990o912J480m015O06P54J917o39n296r186j268Q732M469N134
2224E794K349o729L24J365q446r636Q09O09N741Q847N342J266j37q98o802j514
2208a716M326J138K83r02p708q336j403R675Q831Q553j24j0060l237R19M3J757
2192B039O457m969j339n505j996N469m78K811K643M61k993L543J736j501l204
2177C174K531K796M487k465N32p681o21M770m711j364k917r93K145K274K862m844
2161b5k001N083J50k071k960l643O551n864n631n38L351M019J901K150M088K273
2145F833k990k2J636L072K740n967P99P86k484P98l506N12J360N982l737l006
2129B806j129K831j179m638k338P0o49j224O05M835J0981J125j1265l013N756
$$ plain form
2240 2979 -1065 4028 10018 3106 4586 571 1177 1931 3848 3209 -2087 -11273 -12541 -3809 660 5794
2224 5794 8143 1414 1738 3103 -5343 -14979 -14170 -13561 -7820 1027 6369 7635 7498 6600 -202 -1716
2208 -1716 2610 3748 4031 3129 -4579 -12915 -14318 -4643 4188 12741 12617 2557 -680 239 282 2039
2192 2039 8496 3527 2188 -3317 -5313 156 -322 2489 5132 5593 2600 6143 7879 6378 3174
2177 3174 5705 8501 12988 10523 11055 3374 2753 7523 2812 1448 -1469 -2462 -317 1957 4819 -25
2161 -25 -2026 3057 3207 1136 -1824 -5467 1084 -4780 -10411 -10949 -7598 -3579 -1678 472 4560 6833
2145 6833 3843 3821 5457 8529 11269 5302 6101 6887 4403 5201 1695 2207 3567 9549 5812 2806
2129 2806 1677 4508 3329 -1309 -3647 -3577 -4226 -5450 -4845 -10 10971 12096 831 -2182 3574
2114C574L000k646l816K656J0095O24p653j730N112m431J161M093k171p051j2494
2099a1677Q28P900K074K010K009M703m791j983M379k356O977N482o542j2457j513
2084d957j404K922l796k488l362O67Q174O264j286n779L202O336j781j435q50
2069D27J269J275k925O460n332p558k575k058K503P640j212O13o571j417j407
2054a0868j213Q127J0136K854j70j379k75M17M869N736n682o816m122k207j278
2039a871m05P115P652l377k351q790l501N589J462M708k967k767J095n482L908
2024A8O638J219k160J079J226r52K789k578j486j498l248k820j468K430O390r27
2008D652Q710L576j122K709L306l818j848L038m027r012m409k613l72N217J055
$$ plain form
2114 3574 6574 3928 112 2768 12863 13487 5834 4104 9216 4785 5946 10039 7868 817 -11677
2099 -11677 -10849 -2949 -875 1135 3144 7847 3056 1073 5452 3096 10073 15555 9013 -3444 -4957
2084 -4957 -6361 -3439 -7235 -9723 -13085 -12418 -4244 2020 734 -5045 -1843 4493 2712 1277 427
2069 427 1696 2971 46 6506 1174 -6384 -8959 -11017 -8514 -874 -2086 -1473 -8044 -9461 -10868
2054 -10868 -12081 -3954 6182 9036 8866 7487 7212 7629 12498 18234 12552 5736 1614 -593 -1871
2039 -1871 -2276 4839 12491 9114 6763 -2027 -5528 61 1523 6231 3264 497 1592 -3890 18
2024 18 6656 7875 5715 6794 8020 7068 9857 7279 5793 4295 1047 -1773 -3241 -811 5579 4652
2008 4652 13362 16938 15816 18525 21831 18013 16165 19203 15176 6164 1755 -858 -1230 3987 5042
1993E042K228O166m35r254j119M554P98j099N734n910k970j719J899J95l109k481
1977a480L504j151k301K227O067j785l400K147q314l252L337M421L901j552r36
1962A433L216K566k738o44j746m670N005N937j661j528k085n112J073m75P98N558
$$ plain form
1993 5042 7270 13436 13001 3747 2628 7182 7980 6881 12615 6705 3735 2016 3915 4110 1001 -1480
1977 -1480 2024 873 -1428 799 6866 5081 1681 3828 -4486 -7738 -4401 20 3921 2369 1433
1962 1433 4649 7215 4477 3833 2087 -2583 2422 8359 6698 5170 3085 -2027 -954 -1429 -631 4927
$$ [...]
##END NTUPLES=NMR SPECTRUM
##END=
