##TITLE=Analysis number 315497
Compound Code cc 31046
Book Reference 440/110
Project Code adrs
Chemist Name craigr
##JCAMPDX= 6.0         $$ Bruker NMR JCAMP-DX V2.0
##DATA TYPE= NMR SPECTRUM
##DATA CLASS= NTUPLES
##ORIGIN= Bruker BioSpin GmbH
##OWNER= NMR
$$ XWIN-NMR		Version 3.5
$$ Tue Nov 22 09:31:15 2005 GMT Standard Time (UT+0h)  MAYBRIDGE\NMR@NMR_250MHZ
##.OBSERVE FREQUENCY= 250.131544655141
##.OBSERVE NUCLEUS= ^1H
##.ACQUISITION MODE= SIMULTANEOUS (DQD)
##.ACQUISITION SCHEME= undefined
##.AVERAGES= 16
##.DIGITISER RES= 18
##SPECTROMETER/DATA SYSTEM= dpx250
##.PULSE SEQUENCE= zg30
##.SOLVENT NAME= CDCl3
##.SHIFT REFERENCE= (INTERNAL, CDCl3, 0, 16.522)
##AUDIT TRAIL= $$ (NUMBER, WHEN, WHO, WHERE, WHAT)
$$ ##TITLE= Audit trail, XWIN-NMR		Version 3.5
$$ ##JCAMPDX= 5.01
$$ ##ORIGIN= Bruker BioSpin GmbH
$$ ##OWNER= NMR
$$ C:\u/data/dgb/nmr/ADRS/12760/pdata/1/auditp.txt
$$ ##AUDIT TRAIL=  $$ (NUMBER, WHEN, WHO, WHERE, WHAT)
(   1,<2005-11-22 09:30:53.90 +000>,<MAYBRIDGE\NMR>,<NMR_250MHZ>,
      <created by zg, POWCHK disabled, PULCHK disabled
       configuration hash MD5:
       62 19 C7 07 E1 42 D1 B7 37 6C 3D D0 77 39 F9 E6
       data hash MD5: 64K
       EB 77 8F BD 79 04 2E 07 9F D3 B2 25 83 5A 01 C1>)
(   2,<2005-11-22 09:31:05.87 +000>,<MAYBRIDGE\NMR>,<NMR_250MHZ>,
      <Start of raw data processing
       ef LB = 0.3 FT_mod = 6 PKNL = 1 SI = 32K 
       data hash MD5: 32K
       79 51 7F 06 3A 93 36 B5 BE 9B B7 64 56 8B B7 53>)
(   3,<2005-11-22 09:31:07.84 +000>,<MAYBRIDGE\NMR>,<NMR_250MHZ>,
      <apk 
       data hash MD5: 32K
       1F 15 C6 8D 0D 6C 93 A8 08 29 91 E8 30 7F E1 3C>)
(   4,<2005-11-22 09:31:08.64 +000>,<MAYBRIDGE\NMR>,<NMR_250MHZ>,
      <abs ABSG = 5 
       data hash MD5: 32K
       20 9C 7A 21 00 3D CD 43 E1 F7 3E B9 5B 5D 70 91>)
$$ ##END=
$$ 
$$ hash MD5
$$ D5 6B CC 81 A7 69 DE 31 92 EB DB 6E 32 C4 4B E8
##$RELAX= 
##$RELAX= 
##$RELAX= 
##$RELAX= 
##$RELAX= 
##$RELAX= 
##$RELAX= 
$$ Bruker specific parameters
$$ --------------------------
##$DU= <C:\u>
##$EXPNO= 12760
##$NAME= <ADRS>
##$PROCNO= 1
##$TYPE= <nmr>
##$USER= <dgb>
##$AMP= (0..31)
100 100 100 100 100 100 100 100 100 100 100 100 100 100 100 100 100 100 
100 100 100 100 100 100 100 100 100 100 100 100 100 100 
##$AQSEQ= 0
##$AQ_mod= 3
##$AUNM= <au_zg>
##$AUTOPOS= <5 >
##$BF1= 250.13
##$BF2= 250.13
##$BF3= 250.13
##$BF4= 250.13
##$BF5= 500.13
##$BF6= 500.13
##$BF7= 500.13
##$BF8= 500.13
##$BYTORDA= 1
##$CFDGTYP= 0
##$CFRGTYP= 5
##$CHEMSTR= <none>
##$CNST= (0..31)
1 1 145 1 1 1 1 1 1 1 1 1 1 1 1 1 1 1 1 1 1 1 1 1 1 1 1 1 1 1 1 1 
##$CPDPRG= <>
##$CPDPRG1= <>
##$CPDPRG2= <>
##$CPDPRG3= <>
##$CPDPRG4= <mlev>
##$CPDPRG5= <mlev>
##$CPDPRG6= <mlev>
##$CPDPRG7= <mlev>
##$CPDPRG8= <mlev>
##$CPDPRGB= <>
##$CPDPRGT= <>
##$D= (0..31)
0 1 0 0 0 0 0 0 0 0.06 0 0 0 0 0 0 0.0002 0 0 0 0 0 0 0 0 0 0 0 0 0 0 
0 
##$DATE= 1132651851
##$DBL= (0..7)
120 120 120 120 120 120 120 120 
##$DBP= (0..7)
150 150 150 150 150 150 150 150 
##$DBP07= 0
##$DBPNAM0= <>
##$DBPNAM1= <>
$$ [...]
##$SUBNAM7= <"">
##$SUBNAM8= <"">
##$SUBNAM9= <"">
##$SW= 20.6930455092707
##$SWIBOX= (0..15)
0 0 3 0 0 0 0 0 0 0 0 0 0 0 0 0 
##$SW_h= 5175.983436853
##$TD= 65536
##$TD0= 1
##$TE= 294.16
##$TE2= 300
##$TE3= 300
##$TEG= 300
##$TL= (0..7)
0 120 120 120 120 120 120 120 
##$TP= (0..7)
150 150 150 150 150 150 150 150 
##$TP07= 0
##$TPNAME0= <>
##$TPNAME1= <>
##$TPNAME2= <>
##$TPNAME3= <>
##$TPNAME4= <>
##$TPNAME5= <>
##$TPNAME6= <>
##$TPNAME7= <>
##$TPOAL= (0..7)
0.5 0.5 0.5 0.5 0.5 0.5 0.5 0.5 
##$TPOFFS= (0..7)
0 0 0 0 0 0 0 0 
##$TUNHIN= 0
##$TUNHOUT= 0
##$TUNXOUT= 0
##$USERA1= <user>
##$USERA2= <user>
##$USERA3= <user>
##$USERA4= <user>
##$USERA5= <user>
##$V9= 5
##$VALIST= <valist>
##$VCLIST= <CCCCCCCCCCCCCCC>
##$VD= 0
##$VDLIST= <DDDDDDDDDDDDDDD>
##$VPLIST= <PPPPPPPPPPPPPPP>
##$VTLIST= <TTTTTTTTTTTTTTT>
##$WBST= 1024
##$WBSW= 4
##$XGAIN= (0..3)
0 0 0 0 
##$XL= 0
##$YL= 0
##$YMAX_a= 538224
##$YMIN_a= -381579
##$ZGOPTNS= <>
##$ZL1= 120
##$ZL2= 120
##$ZL3= 120
##$ZL4= 120
##$ABSF1= 16.522
##$ABSF2= -4.171173
##$ABSG= 5
##$ABSL= 3
##$ALPHA= 0
##$AQORDER= 0
##$ASSFAC= 0
##$ASSFACI= 0
##$ASSFACX= 0
##$ASSWID= 0
##$AUNMP= <proc_1d>
##$AZFE= 0.1
##$AZFW= 0.1
##$BCFW= 0
##$BC_mod= 0
##$BYTORDP= 0
##$COROFFS= 0
##$CY= 12.5
##$DATMOD= 1
##$DC= 0
##$DFILT= <>
##$DTYPP= 0
##$F1P= 14.0000005364418
##$F2P= -0.99999901652339
##$FCOR= 0.5
##$FTSIZE= 32768
##$FT_mod= 6
##$GAMMA= 0
##$GB= 0
##$INTBC= 1
##$INTSCL= 1
##$ISEN= 128
##$LB= 0.3
##$LEV0= 0
##$LPBIN= 0
##$MAXI= 10000
##$MC2= 0
##$MEAN= 0
##$ME_mod= 0
##$MI= 0
##$NCOEF= 0
##$NC_proc= -2
##$NLEV= 6
##$NOISF1= 0
##$NOISF2= 0
##$NSP= 0
##$NTH_PI= 0
##$NZP= 0
##$OFFSET= 16.522
##$PC= 1
##$PHC0= 85.86693
##$PHC1= 0.178003
##$PH_mod= 1
##$PKNL= yes
##$PPARMOD= 0
##$PSCAL= 4
##$PSIGN= 0
##$REVERSE= no
##$SF= 250.13
##$SI= 32768
##$SIGF1= 0
##$SIGF2= 0
##$SINO= 400
##$SIOLD= 32768
##$SREGLST= <1H.CDCl3>
##$SSB= 0
##$STSI= 32768
##$STSR= 0
##$SW_p= 5175.98343685301
##$SYMM= 0
##$S_DEV= 0
##$TDeff= 65536
##$TDoff= 0
##$TI= <Analysis number 999999
Compound Code 99
Book Reference 9
Project Code 9>
##$TILT= no
##$TM1= 0
##$TM2= 0
##$TOPLEV= 0
##$USERP1= <user>
##$USERP2= <user>
##$USERP3= <user>
##$USERP4= <user>
##$USERP5= <user>
##$WDW= 1
##$XDIM= 32768
##$YMAX_p= 274679935
##$YMIN_p= -45780
$$ End of Bruker specific parameters
$$ ---------------------------------
##NTUPLES= NMR SPECTRUM
##VAR_NAME=  FREQUENCY,     SPECTRUM/REAL,   SPECTRUM/IMAG
##SYMBOL=    X,             R,               I
##VAR_TYPE=  INDEPENDENT,   DEPENDENT,       DEPENDENT
##VAR_FORM=  AFFN,          ASDF,            ASDF
##VAR_DIM=   32768,         32768,           32768
##UNITS=     HZ,            ARBITRARY UNITS, ARBITRARY UNITS
##FACTOR=    0.157963299565203, 1,           1
##FIRST=     4132.6476996994, 0,             0
##LAST=      -1043.33573715361, 0,           0
##MIN=       -1043.33573715361, -45780,      0
##MAX=       4132.6476996994, 274679935,     0
$$ Real data points
##PAGE= N=1
##DATA TABLE= (X++(R..R)), XYDATA
$$ [...]
$$ plain form
14884 -13257 -12199 -14440 -10845 -9118 -12687 -11954 -15077 -15061 -5272 -10007 -9869 1274 3480 860 -2839
14869 -2839 -3604 2979 11753 20559 7266 4105 -1046 -453 -9747 -10036 -3168 -3839 1574 8872 546
14854 546 795 -2188 -2145 -2109 -3758 1501 4358 -87 -1752 -792 -2671 901 -8819 -13575 978 844
14838 844 -6962 -5209 -10935 -15190 -17534 -14862 -4891 3646 3950 1875 4234 -476 -1832 5076 11144
14823 11144 14699 7886 5358 -1218 3926 3189 -2065 -9770 721 3789 -1945 -2336 -4327 -3408 -1290
14808 -1290 2279 6338 -5269 -7529 -8483 -8614 -4049 -3656 -1901 3242 271 -6019 -16881 -10819 -7774
14793 -7774 -8684 -4998 -8543 -14968 -20121 -19777 -8000 1899 -2701 765 -1042 327 -9396 -14251 -12228
14778 -12228 -15151 -11723 -8780 -10892 -15508 -6829 12507 18882 9993 3583 -1112 3179 4081 8785
$$ packed form
14884a3257J058k241L595J727l569P33l123J6R789m735J38J1143K206k620l699
14869b839p65O583Q774Q806j3293l161n151N93r294k89O868o71N413P298q326
14854E46K49k983M3L6j649N259K857m445j665R60j879L572r720m756J4553j34
14838H44p806J753n726m255k344K672R971Q537L04k075K359m710j356O908O068
14823A1144L555o813k528o576N144p37n254p705J0491L068n734l91j991R19K118
14808a290L569M059j1607k260r54j31M565L93J755N143k971o290j0862O062L045
14793g774r10L686l545o425n153L44J1777R899m600L466j807J369r723m855K023
14778a2228k923L428K943k112m616Q679J9336O375q889o410m695M291R02M704
$$ plain form
14764 8785 7186 3791 -1838 -2059 -2881 -1523 -5734 -23661 -25581 -15593 -2134 -2689 -10819 -15403 -22814
14749 -22814 -11574 -5673 -6722 -9192 -4173 -2119 -1182 3576 -16 4492 5994 1036 -6617 -12015
14735 -12015 -13867 -12574 -20089 -18392 -6918 -9658 -10109 -6413 -13366 -12860 -5870 -8003 -5035 -4704 -4270
14720 -4270 -12881 -12289 -10231 -8073 3673 -8676 -10912 -10835 -13824 -7858 -4175 -8976 -5759 -3967 -7167
14705 -7167 -7043 1021 4444 -5689 -14424 -18934 -5366 -1590 -5056 -6410 -5291 -10341 -10753 -712
14691 -712 891 8351 1162 -489 1925 2519 -3094 -6267 -11901 -8253 -13458 -22258 -13511 -13651 -6835
14676 -6835 140 -3443 -8045 -5262 -8800 -13769 -17594 -14732 -6937 -2232 5940 5224 6891 -581 -6408
14661 -6408 -8836 -4416 -15534 -24862 -20366 -10539 -6124 -12757 -9423 -8423 -6955 -11306 -12014 -11563 -8090
$$ packed form
14764H785j599l395n629k21q22J358m211j7927j920R988J3459n55q130m584p411
14749b2814J1240N901j049k470N019K054R37M758l592M508J502m958p653n398
14735a2015j852J293p515J697J1474k740m51L696o953N06O990k133K968L31M34
14720d270q611N92K058K158J1746j2349k236P7k989N966L683m801L217J792l200
14705g167J24Q064L423j0133q735m510J3568L776l466j354J119n050m12J0041
14691g12J603P460p189j651K414N94n613l173n634L648n205q800Q747j40O816
14676f835O975l583m602K783l538m969l825K862P795M705Q172p16J667p472n827
14661f408k428M420j1118r328M496R827M415o633L334J000J468m351p08M51L473
$$ plain form
14646 -8090 -10200 -7050 -12860 -12346 2243 5337 4894 6250 9520 7960 4046 -3230 -8994 -9153 717
14631 717 636 -7097 -17368 -14368 -5889 -6885 -15790 -9466 2143 5188 2538 -2475 1413 3760 7030
14616 7030 13695 15108 12412 -2935 -7062 -11880 -13407 -7686 -7758 -15354 -17483 -14062 -9484 -11142 -15608
14601 -15608 -13219 -12971 -19059 -10894 -3741 207 -9318 -7367 -6911 -11028 -18770 -16365 2330 835 376
14586 376 -10885 -14614 -14550 -13778 -3783 6326 690 -10040 -12077 -19179 -13121 -965 -7362 -8013 -6784
14571 -6784 549 5411 5442 4309 1916 -1490 -655 5826 17256 16328 5754 7227 -1335 -3543 2441
14556 2441 6884 6027 5638 7649 7664 1787 2825 -2482 1552 6167 7727 3097 5057 2549 403 -2207
14540 -2207 -3800 -1946 -5581 -5040 -2030 -9382 -11828 -11043 -3576 -2305 -3399 -7126 -5013 -8455 -10512
$$ packed form
14646h090k110L150n810N14J4589L094m43J356L270j560l914p276n764j59R870
14631G17q1p733j0271L000Q479r96q905O324J1609L045k650n013L888K347L270
14616G030O665J413k696j5347m127m818j527N721p2p596k129L421M578j658m466
14601a5608K389K48o088Q165P153L948r525J951M56m117p742K405J8695j495m59
14586C76j1261l729O4P72R995J0109n636j0730k037p102O058J2156o397o51J229
14571f784P333M862L1j133k393l406Q35O481J1430r28j0574J473q562k208N984
14556B441M443q57l89K011J5n877J038n307M034M615J560m630J960k508k146k610
14540b207j593J854l635N41L010p352k446P85P467J271j094l727K113l442k057
$$ plain form
14525 -10512 -11610 -9488 -13161 -10247 -1269 -8295 -10939 -3902 -8520 -18922 -19990 -17509 -13851 -4506
14511 -4506 7356 911 -8342 -4581 -6965 -11740 -1429 -1433 -11029 -10301 -5766 -14616 -25546 -19849 -8274
14496 -8274 -9663 -13198 -4464 440 -3461 -13115 -16105 -15820 -10585 -8462 -17462 -29474 -18507 -11875
14482 -11875 -10335 -6785 -9395 -5108 1934 1000 -1782 -3935 5544 15658 13381 688 -2437 3733
14468 3733 -1288 -11880 -13633 -12699 -2875 -3636 -7506 -14182 -12286 -5654 -10724 -20098 -37438 -34985 -31754
14453 -31754 -21391 -16992 -23191 -25423 -18367 -18672 -25052 -22653 -16472 -15469 -13086 -9823 -9003 -10376 -14730
14438 -14730 -14686 -12174 -5781 5962 5924 608 -12721 -10203 -9677 -4726 -6460 -4492 -12151 -15248 -14948
14423 -14948 -8929 -7368 -9019 -14975 -14247 -14475 -10363 -7168 -4072 -12668 -10984 -5984 3265 6723 4672
$$ packed form
14525a0512j098K122l673K914Q978p026k644P037m618j0402j068K481L658R345
14511d506J1862o445r253L761k384m775J0311mr596P28M535q850j0930N697J1575
14496h274j389l535Q734M904l901r654k990K85N235K123r000j2012J0967O632
14482a1875J540L550k610M287P042r34k782k153R479J0114k277j2693l125O170
14468C733n021j0592j753R34R824p61l870o676J896O632n070r374j7340K453L231
14453c1754J0363M399o199k232P056l05o380K399O181J003K383L263Q20j373m354
14438a4730M4K512O393J1743l8n316j3329K518N26M951j734J968p659l097L00
14423a4948O019J561j651n956P28k28M112L195L096q596J684N000R249L458k051
$$ plain form
14408 4672 2767 3250 4330 -175 2952 7002 -150 738 -4947 2496 776 2547 528 -10492 -27518
14393 -27518 -30147 -28378 -24930 -12465 -9503 -7733 -9224 -15510 -14824 -7021 -3480 1226 1394 4530 11829
14378 11829 8908 6095 -2443 -3146 -13282 -19236 -15667 -8719 -6028 -7154 -4421 4475 -280 -8994
14364 -8994 -11494 -2459 2214 -2299 -5138 -10057 -2447 2789 -3042 -12567 -17440 -23579 -24122 -15310 -11910
14349 -11910 -9205 -14294 -11784 -7130 -7641 4246 6393 897 1234 -4961 -11246 -16378 -7996 -5287 -4344
14334 -4344 -10726 -9163 965 7389 7026 -7881 -10805 -9993 -13903 -16749 -12773 -686 5542 1591
14320 1591 2261 -7028 -23002 -27877 -24905 -14575 -11100 -18101 -16071 -9760 -2694 -5357 -9263 -10760
14306 -10760 -5762 -3121 -2811 -7647 -7732 -489 5979 3411 -1398 -513 3857 -949 1312 1805 -2598 -5369
$$ packed form
14408D672j905M83J080m505L127M050p152Q88n685P443j720J771k019j1020j7026
14393b7518k629J769L448J2465K962J770j491o286O86P803L541M706J68L136P299
14378A1829k921k813q538p03j0136n954L569O948K691j126K733Q896m755q714
14364h994k500R035M673m513k839m919P610N236n831r525m873o139n43Q812L400
14349a1910K705n089K510M654n11J1887K147n496L37o195o285n132Q382K709R43
14334d344o382J563J0128O424l63j4907k924Q12l910k846L976J2087O228l951
14320A591O70r289j5974m875K972J0330L475p001K030O311P066k663l906j497
14306a0760M998K641L10m836q5P243O468k568m809Q85M370m806K261M93m403k771
$$ plain form
14290 -5369 -13150 -12616 -15853 -13795 -16199 -9272 -893 -4713 -11132 -7588 -6220 -21461 -22408 -27172 -28008
14275 -28008 -23508 -9234 -16639 -25302 -31095 -28117 -23845 -3107 11212 1243 -13892 -11589 -14143
14262 -14143 -18940 -17965 -13041 -8004 -14043 -14500 -19135 -18725 -15709 -20425 -17403 -11251 -6177 6126 15909
14247 15909 5886 4053 5320 4554 -9501 -22737 -32236 -28415 -24616 -9389 11683 14951 2942
14234 2942 -4560 -3329 -7533 -11776 -8325 -6841 -10170 -14694 -18863 -9624 -6128 -2123 6032 -8167
14220 -8167 -10033 -4370 -4357 -10110 -12764 -8353 -5937 -7723 -10967 -7773 1207 -365 -3844 1913 9518
14205 9518 1346 -14497 -15273 -19978 -17253 -11999 -14260 -13723 -1452 7562 378 -10376 -9513 -10402 -1832
14190 -1832 15694 6665 63 -2639 -11262 -16060 -11497 3604 3919 -3357 -7736 -4939 -1539 -4848
$$ packed form
14290e369p781N34l237K058k404O927Q379l820o419L544J368j5241r47m764q36
14275b8008M500J4274p405q663n793K978M272K0738J4319r969j5135K303k554
14262a4143m797R75M924N037o039m57m635M10L016m716L022O152N074J2303R783
14247A5909j0023j833J267p66j4055j3236r499L821L799J5227K1072L268j2009
14234B942p502J231m204m243L451J484l329m524m169R239L496M005Q155j4199
14220h167j866N663J3n753k654M411K416j786l244L194Q980j572l479N757P605
14205I518q172j5843p76m705K725N254k261N37J2271R014p184j0754Q63q89Q570
14190a832J7526r029o602k702q623m798M563J5101L15p276m379K797L400l309
$$ plain form
14176 -4848 -10481 -14645 -22462 -32913 -26228 -19866 -12419 -13597 -6852 -4872 -802 2126 -2554 -4190
14162 -4190 -1822 -2316 -331 -371 -603 -7111 -12700 -2049 6914 -3205 -5315 886 1482 979 4929 3216
14146 3216 10511 5546 -1318 -19078 -23798 -13526 -6850 -4119 1289 -2317 -352 -9013 -3392 -6556
14132 -6556 -3415 -4575 -6164 -6658 -11829 -13230 -20092 -21394 -13642 -8003 -10842 -5708 -6388 -5283 1874
14117 1874 10016 12442 7091 3295 3951 -9139 -8888 -10351 -3558 17894 18021 15421 27565 30729 27633
14102 27633 27212 35187 50426 82163 117817 164561 209162 233535 237140 236974 249107 259868 267534
14089 267534 259152 240640 206274 174128 140165 107534 75901 45517 34012 30795 38411 39194
14077 39194 31608 25029 20340 18445 19217 15764 18119 26096 29829 29633 29584 27383 23103 18995 13733
$$ packed form
14176d848n633m164p817j0451O685O362P447j178O745J980M070K928m680j636
14162d190K368m94J985m0k32o508n589J0651Q963j0119k110O201N96n03L950j713
14146C216P295m965o864j7760m720J0272O676K731N408l606J965q661N621l164
14132f556L141j160j589m94n171j401o862j302P752N639k839N134o80J105P157
14117A874Q142K426n351l796O56j3090K51j463O793K1452J27k600J2144L164l096
14102B7633m21P975J5239L1737L5654M6744M4601K4373L605j66J2133J0761P666
14089B67534q382j8512l4366l2146l3963l2631l1633l0384j1505l217P616P83
14077C9194p586o579m689j895P72l453K355P977L733j96m9k201m280m108n262
$$ plain form
14062 13733 6760 10978 14759 8767 5624 4231 1307 67 -3195 -2942 -1518 -2016 -2260 4168 4837
14047 4837 2365 1674 914 -4585 -11027 -6350 4962 2909 3854 -743 -5837 -7282 -11310 3496 -1118
14032 -1118 -7919 -11106 -2413 -3551 -12561 -10147 -10048 -5943 -7226 -11286 -9501 -13695 -15104 -11972 -838
14017 -838 1181 4943 -5922 -15669 -23083 -19909 -13626 -470 986 -8520 -8449 -4126 4232 6003 -2483
14002 -2483 -8119 -9775 -4350 -11178 -9711 -5309 -2954 -3244 -2637 -8079 -8868 -6796 496 -1213 6042
13987 6042 7826 4090 -5943 -6390 -234 1914 823 -1604 5525 4146 2718 -373 -389 -723 4424
13972 4424 6338 8862 4116 -4343 -1384 -4507 -6436 -7796 -14941 -20030 -24712 -22022 -20763 -22566 -17970
13957 -17970 -8033 -1513 -3148 -721 -9438 -6010 -7199 -13654 -8503 -6904 -11174 -18177 -17884 -9813 -2331
$$ packed form
14062A3733o973M218L781n992l143j393k924j240l262K53J424m98k44O428O69
14047D837k472o91p60n499o442M677J1312k053R45m597n094j445m028J4806m614
14032a118o801l187Q693j138r010K414R9M105j283m060J785m194j409L132J1134
14017h38K019L762j0865r747p414L174O283J3156J456r506P1M323Q358J771q486
14002b483n636j656N425o828J467M402K355k90O07n442p89K072P292j709P255
13987F042J784l736j0033m47O156K148j091k427P129j379j428l091j6l34N147
13972D424J914K524m746q459K959l123j929j360p145n089m682K690J259j803M596
13957a7970R937O520j635K427q717L428j189o455N151J599m270p003K93Q071P482
$$ plain form
13942 -2331 -3066 -734 -6534 -3875 3131 9731 3333 1274 1566 861 1990 -3649 -9146 -14735 -20645
13927 -20645 -14887 -12520 -10797 -4276 -6270 -15677 -11535 -4170 -1937 -8152 -11095 -6533 -5365 5794
13913 5794 12369 1893 -4739 -2953 -2213 -8717 -5655 595 -4737 -10652 -9738 -17172 -20128 -17639 -12616
13898 -12616 -11058 -8319 -1498 7971 7839 -5063 -16201 -18787 -10243 -146 3672 1729 12705 17534
13884 17534 10035 4571 4967 -1115 -3285 -15068 -16111 -8879 -10565 -12581 -5180 -2693 945 107 10625
13869 10625 9091 4616 4184 5445 514 1866 1237 -3219 -6694 -8687 -1627 -9235 -18783 -5420 8179
13854 8179 6780 3471 -3676 -5838 4050 7430 -557 -4999 -4833 -3867 3026 3639 -6208 296 5472
13839 5472 11724 1274 -7580 -8290 -13708 -24961 -25990 -15553 -6750 -2319 -1573 -5775 -17784 -13714
$$ packed form
13942b331p35K332n800K659P006O600o398k059K92p05J129n639n497n589n910
13927b0645N758K367J723O521j994r407M142P365K233o215k943M562J168J1159
13913E794O575j0476o632J786P40o504L062O250n332n915R14p434k956K489N023
13898a2616J558K739O821R469j32j2902j1138k586Q544J0097L818j943J0976M829
13884A7534p499n464L96o082k170j1783j043P232j686k016P401K487L638q38J0518
13869A0625j534m475m32J261m931J352o29m456l475j993P060p608r548J3363J3599
13854H179j399l309p147k162R888L380p987m442J66R66O893O13r847O504N176
13839E472O252j0450q854p10n418j1253j029J0437Q803M431P46m202j2009M070
$$ plain form
13825 -13714 -4272 3286 5152 8764 1940 12094 18385 4552 -10168 -6527 5472 9481 3262
13812 3262 -2414 -1033 1434 -5905 -8491 -140 15607 20254 18593 10591 -4803 -10208 -1242 -2571
13798 -2571 -4452 -11439 -19168 -10202 915 1726 9094 4998 6693 1451 5130 6180 12476 16251 12905
13783 12905 4151 -216 4991 3059 1783 -11604 -11294 2641 18055 24269 14053 15530 19783 23428
13769 23428 20093 20600 17528 8052 948 -2846 -4386 -1514 4919 9495 13949 13268 14918 22906 28671
13754 28671 23351 15095 14638 22163 25820 23874 27157 21874 29177 42398 38226 29747 27234 16067
13740 16067 10699 23598 24591 21913 21379 30420 36205 30755 31775 24888 23938 30081 32214 27250 21117
13725 21117 13197 15256 21865 17008 14988 23196 31620 31274 31724 28955 30987 29575 23997 22296 17513
$$ packed form
13825a3714R442P558J866L612o824J0154O291j3833j4720L641J1999M009o219
13812C262n676J381K467p339k586Q351J5747M647j661q002j5394n405Q966j329
13798b571j881o987p729Q966J1117Q11P368m096J695n242L679J050O296L775l346
13783A2905q754m367N207j932j276j3387L10J3935J5414O214j0216J477M253L645
13769B3428l335N07l072r476p104l794j540K872O433M576M454o81J650P988N765
13754B8671n320q256m57P525L657j946L283n283P303J3221m172q479k513j1167
13740A6067n368J2899R93k678n34R041N785n450J020o887r50O143K133m964o133
13725B1117p920K059O609m857k020Q208Q424l46M50k769K032j412n578j701m783
$$ plain form
13710 17513 18840 16855 15949 14297 8071 5961 11899 17825 31592 37620 34694 40073 40323 40223 35725
13695 35725 34540 31057 27984 20312 19799 20002 22511 17994 21988 23752 31012 37794 48035 39093 30170
13680 30170 35261 38454 40302 38697 43194 49348 56965 61110 53446 47562 45687 34533 22314 16656
13666 16656 13916 17941 23867 27118 28986 36885 32787 34373 35628 33892 33241 41973 36999 36329 28342
13651 28342 24946 28455 34765 38140 25334 14773 16949 16859 25344 24769 21531 25304 24502 16439 24188
13636 24188 35198 40659 41070 40263 49362 49216 43099 49307 50746 57608 56815 48984 48437 39012 34492
13621 34492 36598 34761 40021 40191 34048 31150 29747 27919 20645 20613 22357 27457 35663 40640 44074
13606 44074 32186 33264 40399 37055 31857 21162 16705 23553 30155 28338 17811 20750 39076
$$ packed form
13710A7513J327j985r06j652o226k110N938N926J3767O028k926N379K50j00m498
13695C5725j185l483l073p672n13K03K509m517L994J764P260O782J0241q942q923
13680C0170N091L193J848j605M497O154P617M145p664n884j875j1154j2219n658
13666A6656k740M025N926L251J868P899m098J586J255j736o51Q732m974o70p987
13651B8342l396L509O310L375j2806j0561K176r0Q485n75l238L773q02q063P749
13636B4188J1010N461M11q07R099j46o117O208J439O862p93p831n47r425m520
13621C4492K106j837N260J70o143k898j403j828p274l2J744N100Q206M977L434
13606D4074j1888J078P135l344n198j0695m457O848O602j817j0527K939J8326
$$ plain form
13593 39076 41844 36428 33473 22961 25445 28050 21250 12951 24696 29521 27894 29729 30829 37122
13579 37122 40287 36261 35890 36958 33829 34155 35644 40031 39239 37966 38730 47370 58767 60993 51921
13564 51921 45106 40629 41969 38873 40169 44951 47635 47446 51322 52008 46628 46407 50623 56097 56064 53898
13548 53898 48820 42921 37600 45723 49698 43812 42274 47839 49673 47637 52086 52058 48824 50442 54003
13533 54003 51934 57112 52092 42016 38810 45044 47498 52392 63890 62228 55787 47267 49200 58679
13519 58679 57120 64598 64469 55598 45825 46656 57143 65689 73951 68982 60241 55543 57470 59419 61383
13504 61383 73666 67401 69899 78539 76374 71130 55256 43317 45588 55986 68827 80567 80047
13491 80047 82370 74375 74627 81224 86369 97542 99739 105340 94807 95709 91580 101385 113401 104090
$$ packed form
13593C9076K768n416k955j0512K484K605o800q299J1745M825j627J835J100O293
13579C7122L165m026l71J068l129L26J489M387p92j273P64Q640J1397K226r072
13564E1921o815m477J340l096J296M782K684j89L876O86n380k21M216N474l3k166
13548E3898n078n899n321Q123L975n886j538N565J834k036M449k8l234J618L561
13533E4003k069N178n020j0076l206O234K454M894J1498j662o441q520J933R479
13519E8679j559P478j29q871r773Q31J0487Q546Q262m969q741m698J927J949J964
13504F1383J2283o265K498Q640k165n244j5874j1939K271J0398J2841J1740n20
13491H0047K323p995K52O597N145J1173K197N601j0533R02m129R805J2016r311
$$ plain form
13477 104090 99269 94311 96207 106424 108021 103822 106836 108463 114062 113342 118438 118912 116402 116035 112754
13462 112754 112820 119438 119327 113194 119409 122605 122927 131756 128514 120676 120056 122470 125713 129174 144166
13447 144166 144655 154126 159320 155161 150790 154254 162191 164339 165337 169973 179282 176333 171021 175188 173171
13432 173171 173168 175843 175127 183650 187904 193402 193921 190763 184098 194061 211194 218470 214797 214278 216694
13417 216694 225006 230760 241268 247703 238509 243309 248129 254059 250414 253504 256772 269427 270852 260838
13403 260838 261616 269564 283977 288244 295780 306790 307141 315053 326258 319620 312818 326963 340338
13390 340338 346639 350974 346646 348065 358931 371423 380419 392262 396526 399985 420978 442541 451951
13377 451951 450866 439622 451732 468650 476369 484659 489438 492009 514962 532875 547768 551942 558108
$$ packed form
13477A04090m821m958J896J0217J597m199L014J627N599p20N096M74k510l67l281
13462A12754O6O618j11o133O215L196L22Q829l242p838o20K414L243L461J4992
13447A44166M89R471N194m159m371L464P937K148R98M636R309k949n312M167k017
13432A73171lK675p16Q523M254N498N19l158o665R963J7133P276l673n19K416
13417B16694Q312N754J0508O435r194M800M820N930l645L090L268J2655J425j0014
13403B60838P78P948J4413M267P536J1010L51P912J1205o638o802J4145J3375
13390C40338O301M335m328J419J0866J2492Q996J1843M264L459K0993K1563R410
13377D51951j085j1244J2110J6918P719Q290M779K571K2953J7913J4893M174O166
$$ plain form
13364 558108 569110 589998 599720 610468 620845 635282 650494 657822 675238 683972 693708 716398
13352 716398 746165 759374 765582 783819 808327 829625 844865 858052 874309 896817 928437 955920
13340 955920 982269 1002556 1027898 1052353 1083623 1109690 1138729 1167077 1191649 1229544 1259627
13329 1259627 1291133 1325705 1351593 1393579 1430030 1468072 1518137 1555070 1588494 1634302 1686191
13318 1686191 1737275 1790693 1836806 1881152 1941552 1987965 2035907 2083840 2132009 2181049 2237986
13307 2237986 2300497 2355433 2408712 2458497 2505469 2557382 2617484 2660849 2716229 2771199 2823232
13296 2823232 2884244 2927110 2958898 3004912 3053470 3095707 3134052 3183543 3225652 3271460 3302287
13285 3302287 3337977 3373959 3416446 3453835 3472638 3485755 3504138 3522065 3545513 3572037 3598736
$$ packed form
13364E58108J1002K0888R722J0748J0377J4437J5212P328J7416Q734R736K2690
13352G16398K9767J3209O208J8237K4508K1298J5240J3187J6257K2508L1620K7483
13340I55920K6349K0287K5342K4455L1270K6067K9039K8348K4572L7895L0083
13329A259627L1506L4572K5888M1986L6451L8042N0065L6933L3424M5808N1889
13318A686191N1084N3418M6113M4346O0400M6413M7942M7933M8169M9040N6937
13307B237986O2511N4936N3279M9785M6972N1913O0102M3365N5380N4970N2033
13296B823232O1012M2866L1788M6014M8558M2237L8345M9491M2109M5808L0827
13285C302287L5690L5982M2487L7389J8803J3117J8383J7927K3448K6524K6699
$$ plain form
13274 3598736 3620915 3624941 3627931 3637248 3642984 3646435 3645013 3640179 3639629 3636343 3633670 3635091 3629790 3616924
13260 3616924 3608681 3600882 3588259 3568968 3553431 3542340 3523298 3508564 3496273 3480870 3467625 3457125
13248 3457125 3443981 3432953 3411624 3398047 3383607 3368676 3359661 3346232 3340061 3335590 3333697 3335004
13236 3335004 3329931 3330318 3325404 3327696 3335632 3328904 3336442 3352335 3356928 3371902 3385506 3397213 3410238
13223 3410238 3420863 3431471 3444258 3466917 3493400 3518596 3541577 3566923 3578623 3603780 3627881
13212 3627881 3662644 3678205 3700942 3721194 3734513 3746864 3760401 3779370 3789760 3804347 3822900
13201 3822900 3840243 3851694 3850943 3849379 3859361 3868446 3871615 3872393 3867627 3861298 3854070 3850314 3830950 3812303
13187 3812303 3802946 3796526 3773489 3747652 3733134 3708909 3671137 3632513 3587923 3545357 3510735 3477118
$$ packed form
13274C598736K2179M026K990R317N736L451j422m834n50l286k673J421n301j2866
13260C616924q243p799j2623j9291j5537j1091j9042j4734j2291j5403j3245j0500
13248C457125j3144j1028k1329j3577j4440j4931r015j3429o171m471j893J307
13236C335004n073L87m914K292P936o728P538J5893M593J4974J3604J1707J3025
13223C410238J0625J0608J2787K2659K6483K5196K2981K5346J1700K5157K4101
13212C627881L4763J5561K2737K0252J3319J2351J3537J8969J0390J4587J8553
13201C822900J7343J1451p51j564R982R085L169P78m766o329p228l756j9364j8647
13187C812303r357o420k3037k5837j4518k4225l7772l8624m4590m2566l4622l3617
$$ plain form
13175 3477118 3439716 3393203 3347194 3299987 3247630 3199470 3152359 3103799 3047904 3000835 2951815
13164 2951815 2893804 2839603 2778529 2722882 2668399 2612991 2550357 2493154 2445840 2400241 2353353
13153 2353353 2287620 2230068 2176881 2115895 2058546 2014944 1972218 1932206 1879580 1827713 1790938
13142 1790938 1755486 1715864 1672677 1617738 1573265 1534189 1499985 1469069 1423783 1385201 1355918
13131 1355918 1327427 1292414 1254876 1228152 1209071 1182586 1151383 1130965 1115115 1085101 1052711
13120 1052711 1028015 1007923 982989 953343 925183 903621 889613 872093 856850 841046 823787
13109 823787 810960 803012 791486 780000 764794 754710 753073 750495 767409 781778 799590 824305
13097 824305 824708 818284 828483 838707 841085 835549 803785 758628 721185 680897 641549 620970
$$ packed form
13175C477118l7402m6513m6009m7207n2357m8160m7111m8560n5895m7069m9020
13164B951815n8011n4201o1074n5647n4483n5408o2634n7203m7314m5599m6888
13153B353353o5733n7552n3187o0986n7349m3602m2726m0012n2626n1867l6775
13142A790938l5452l9622m3187n4939m4473l9076l4204l0916m5286l8582k9283
13131A355918k8491l5013l7538k6724j9081k6485l1203k0418j5850l0014l2390
13120A052711k4696k0092k4934k9646k8160k1562j4008j7520j5243j5804j7259
13109H23787j2827p948j1526j1486j5206j0084j637k578J6914J4369J7812K4715
13097H24305M03o424J0199J0224K378n536l1764m5157l7443m0288l9348k0579
$$ plain form
13085 620970 597765 574128 547005 530248 515080 504676 489843 484656 483986 480031 462971 446102
13073 446102 433704 422839 416495 404010 397166 403985 399912 397025 394174 388458 384282 375336 370035
13060 370035 363193 353823 348806 348053 344380 335348 329129 320529 319560 320229 316854 305881 302612 307475 301045
13045 301045 291465 279326 275375 277308 277470 276777 279499 284847 284406 280901 280043 269197 268546 257050 240588
13030 240588 245003 250085 257801 249522 238103 230009 225915 219641 209822 210513 211530 212186 213234 214199 209527
13015 209527 211599 210754 204220 194937 189320 187434 194793 201630 195452 190985 180675 177616 175020 175473
13001 175473 174522 167138 159446 161953 163603 160396 165648 166965 168195 172062 164441 151573 146459 152485
12987 152485 154298 162216 163400 159618 163721 162801 159123 157250 162737 162030 158444 154998 153259 147175 151617
$$ packed form
13085F20970k3205k3637k7123j6757j5168j0404j4833n187o70l955j7060j6869
13073D46102j2398j0865o344j2485o844O819m073k887k851n716m176q946n301
13060C70035o842r370n017p53l673r032o219q600r69O69l375j0973l269M863o430
13045C01045r580j2139l951J933J62o93K722N348m41l505q58j0846o51j1496j6462
13030B40588M415N082P716q279j1419q094m094o274r819O91J017O56J048R65m672
13015B09527K072q45o534r283n617j886P359O837o178m467j0310l059k596M53
13001A75473r51p384p692K507J650l207N252J317J230L867p621j2868n114O026
12987A52485J813P918J184l782M103r20l678j873N487p07l586l446j739o084M442
$$ plain form
12972 151617 144735 138288 131694 122436 119279 122950 129589 136274 139132 128460 121885 121271 120686 126210
12958 126210 127703 127027 118718 113978 118990 118963 121318 120888 122285 125974 121120 119945 120203 116672 109177
12943 109177 109799 111832 115768 119408 118844 113509 113615 118563 118231 114944 109638 110834 108344 103055 107283
12928 107283 111084 114439 117303 119766 118511 119420 114545 118446 120091 121694 126036 125898 127966 123833 110448
12913 110448 95030 79558 78013 88602 94275 84077 86310 93546 97197 98866 104801 99145 95776
12900 95776 99260 92061 92635 98838 97478 94733 97105 101083 95414 88211 85974 87267 93585 101183 105215
12885 105215 107119 101393 104389 96893 88130 79595 81336 82535 75896 74027 76332 78612 86021 84713
12871 84713 77478 76965 64632 58648 64786 60286 57191 50140 65433 77121 76415 81298 91699 95816
$$ packed form
12972A51617o882o447o594r258l157L671O639O685K858j0672o575o14n85N524
12958A26210J493o76q309m740N012k7K355m30J397L689m854j175K58l531p495
12943A09177O22K033L936L640n64n335J06M948l32l287n306J196k490n289M228
12928A07283L801L355K864K463j255R09m875L901J645J603M342j38K068m133j3385
12913A10448j5418j5472j545J0589N673j0198K233P236L651J669N935n656l369
12900I5776L484p199N74O203j360k745K372L978n669p203k237J293O318P598M032
12885A05215J904n726K996p496q763q535J741J199o639j869K305K280P409j308
12871H4713p235n13j2333n984O138m500l095p051J5293J1688p06M883J0401M117
$$ plain form
12857 95816 97590 86368 84750 89093 90196 94700 100789 103949 103294 97489 96085 87319 81364 83656
12843 83656 88865 77532 83382 93587 97798 97342 92483 93489 94322 98143 101307 94579 94797 95732 90405
12828 90405 93116 93555 85236 91312 88810 77892 70595 75445 80437 82545 74745 67007 67025 64060 52359
12813 52359 54138 68492 70830 75309 71393 66127 62965 71453 77864 70015 76686 84416 86594 86355
12799 86355 100484 103887 103934 105782 111172 119050 122221 127539 119185 109622 108055 112960 103571 96118 90896
12784 90896 85905 82124 89322 87971 82911 83920 81852 88330 94278 97644 107004 113578 115893 115852 113021
12769 113021 104855 102940 92892 99329 109563 109425 108309 102003 96440 97027 96902 95966 102440 105115 105928
12754 105928 100212 99612 99472 95811 98783 114489 120191 115153 115069 111782 106629 114670 131839 133894 121389
$$ packed form
12857I5816J774j1222j618M343J103M504O089L160o55n805j404q766n955K292
12843H3656N209j1333N850J0205M211m56m859J006Q33L821L164o728K18R35n327
12828I0405K711M39q319O076k502j0918p297M850M992K108p800p738J8k965j1701
12813E2359J779J4354K338M479l916n266l162Q488O411p849O671P730K178k39
12799H6355J4129L403M7J848N390P878L171N318q354r563j567M905r389p453n222
12784I0896m991l781P198j351n060J009k068O478N948L366R360O574K315m1k831
12769A13021q166j915j0048O437J0234j38j116o306n563N87j25r36O474K675Q13
12754A05928n716o00j40l661K972J5706N702n038q4l287n153Q041J7169K055j2505
$$ plain form
12739 121389 116869 130080 135325 141717 146711 148146 147643 156508 159224 165234 166900 173319 182267 181987
12725 181987 188601 198218 202974 208528 206535 201065 199384 199742 198871 217497 236967 251241 260543 278726
12711 278726 298755 314146 332504 355315 370550 380058 386116 406934 436363 474481 516754 560639
12699 560639 606945 656257 712589 776903 856515 963062 1073266 1191691 1333830 1507592
12689 1507592 1710463 1935486 2189093 2463119 2744612 3068376 3452254 3928605 4543202
12680 4543202 5358429 6490080 8175666 10810046 14990524 21184440 28697845 35112931
12672 35112931 38824537 40817864 42921965 45457471 46688133 45024665 41004665 36046740
12664 36046740 30810724 25193151 19610195 14987712 11683016 9449027 7908174 6813475
$$ packed form
12739A21389m520J3211N245O392M994J435n03Q865K716O010J666O419Q948k80
12725A81987O614R617M756N554j993n470j681L58q71J8626J9470J4274R302J8183
12711B78726K0029J5391J8358K2811J5235R508O058K0818K9429L8118M2273M3885
12699E60639M6306M9312N6332O4314P9612J06547J10204J18425J42139J73762
12689A507592K02871K25023K53607K74026K81493L23764L83878M76351O14597
12680D543202Q15227J131651J685586K634380M180478O193916P513405O415086
12672C5112931L711606J993327K104101K535506J230662j663468m020000m957925
12664C6046740n236016n617573n582956m622483l304696k233989j540853j094699
$$ plain form
12656 6813475 6007694 5378210 4850951 4378741 3952256 3579620 3243037 2923632 2636422
12647 2636422 2381601 2160734 1961422 1802016 1666742 1543451 1430081 1331793 1244881 1164011
12637 1164011 1090381 1010333 941044 890276 839307 791211 750687 712345 673014 646819 615564
12626 615564 582358 559394 530762 511133 494693 467654 445550 424959 402398 382828 365450
12615 365450 347623 326237 306443 293915 290176 288455 270839 259899 256786 250615 244999 239272 234702
12602 234702 218819 212141 214992 212097 203770 191866 189101 185150 191623 196757 198520 199147 196660 190645
12588 190645 186188 180363 177454 179934 183182 193108 199632 202532 207142 214663 229894 246879 262513
12575 262513 278789 307641 355626 405148 461075 528340 611354 694061 770476 830416 875241
$$ packed form
12656F813475q05781o29484n27259m72210m26485l72636l36583l19405k87210
12647B636422k54821k20867j99312j59406j35274j23291j13370r8288q6912q0870
12637A164011p3630q0048o9289n0768n0969m8096m0524l8342l9331k6195l1255
12626F15564l3206k2964k8632j9629j6440k7039k2104k0591k2561j9570j7378
12615C65450j7827k1386j9794j2528l739j721j7616j0940l113o171n616n727m570
12602B34702j5883o678K851k895q327j1904k765l951O473N134J763O27k487o015
12588A90645m457n825k909K480L248R926O524K900M610P521J5231J6985J5634
12575B62513J6276K8852M7985M9522N5927O7265Q3014Q2707P6415N9940M4825
$$ plain form
12564 875241 911645 941736 945536 925621 889978 839041 762095 683074 606242 533617 459952 406832
12552 406832 364348 320467 286819 252992 225303 202513 188617 163669 157468 163034 152625 150702
12540 150702 143628 135240 133681 122263 117765 119714 113440 108672 104768 101747 104166 111042 114944 106982
12526 106982 96828 101311 103548 100751 92304 75671 74442 86568 88539 82793 73468 67275 69001
12513 69001 74856 72037 68176 71108 71917 59202 65593 63622 61440 67329 66858 63701 65425 69628 60217
12498 60217 46510 47335 61243 63199 55378 48733 45283 44838 44400 42809 37676 30252 22410 26630 34935
12483 34935 36007 39776 35799 29524 30006 31885 38554 47486 51470 39080 35050 43868 47722 53756
12469 53756 55978 64503 70350 63318 60339 66372 67562 60614 54961 60330 65892 61627 58136 59697
$$ packed form
12564H75241L6404L0091L800j9915l5643n0937p6946p9021p6832p2625p3665n3120
12552D06832m2484m3881l3648l3827k7689k2790j3896k4948o201N566j0409j923
12540A50702p074q388j559j1418m498J949o274m768l904l021K419O876L902p962
12526A06982j0154M483K237k797q447j6633j229J2126J971n746r325o193J726
12513F9001N855k819l861K932Q09j2715O391j971k182N889m71l157J724M203r411
12498F0217j3707Q25J3908J956p821o645l450m45m38j591n133p424p842M220Q305
12483C4935J072L769l977o275M82J879O669Q932L984j2390m030Q818L854O034
12469E3756K222Q525N847p032k979O033J190o948n653N369N562m265l491J561
$$ plain form
12455 59697 64228 68130 67951 68593 77143 84406 76209 70208 56301 48613 43471 37310 41184 39355 40274
12440 40274 40129 36980 37484 35417 41911 44944 51347 60530 60629 54765 50227 45497 37792 38208 42059 40607
12424 40607 39245 43835 49550 48785 38357 38035 45125 52227 51475 41007 35512 37293 39993 36015 30200
12409 30200 22628 14358 10144 16521 27359 25273 17280 13244 17474 28122 36894 40250 47499 59744
12395 59744 53673 44691 37442 33313 23572 21581 27463 38917 45625 45466 52109 42488 38288 40634
12381 40634 43840 37349 36697 28338 30393 33644 33718 31441 24878 21806 27403 32535 33814 40059 54242
12366 54242 66305 66902 60612 64499 69383 65869 58504 52949 44451 41766 38162 37445 40064 43098 42645
12351 42645 35626 33975 37601 38249 38737 40965 37600 36389 32404 25609 26536 38324 41397 45007 36576
$$ packed form
12455E9697M531L902j79O42Q550P263q197o001j3907p688n142o161L874j829R19
12440D0274j45l149N04k067O494L033O403R183R9n864m538m730p705M16L851j452
12424D0607j362M590N715p65j0428l22P090P102p52j0468n495J781K700l978n815
12409C0200p572q270m214O377J0838k086p993m036M230J0648Q772L356P249J2245
12395E9744o071q982p249m129r741j991N882J1454O708j59O643r621m200K346
12381D0634L206o491o52q359K055L251P4k277o563l072N597N132J279O245J4183
12366E4242J2063N97o290L887M884l514p365n555q498k685l604p17K619L034m53
12351D2645p019j651L626O48M88K228l365j211l985o795R27J1788L073L610q431
$$ plain form
12336 36576 31667 30894 31634 27575 26232 10545 -3877 16668 34264 30098 16347 13350 20874 18462
12322 18462 22177 24047 32352 35774 27912 26671 27852 28761 24166 25269 26499 20819 20062 15276 21289
12307 21289 27246 26168 24527 23271 38461 46691 41363 37109 36288 33878 32586 30555 33987 40710
12293 40710 32415 34923 50743 50178 33780 31177 26428 29289 24284 23968 26268 30976 34823 32478
12279 32478 24749 24903 30648 28233 26823 27538 23084 17693 19060 17832 23593 19170 12981 20638 31525
12264 31525 26706 21042 20233 30026 30184 23392 26644 31548 29679 33797 33519 25998 26939 25717 31069
12249 31069 37200 43286 57333 70110 88375 122412 168071 203464 226404 231665 230034 231877 242713
12236 242713 238264 221083 204285 187356 157765 131143 104760 82778 72778 59996 56061 59434
$$ packed form
12336C6576m909p73P40m059j343j5687j4422K0545J7596m166j3751k997P524k412
12322A8462L715J870Q305L422p862j241J181R09m595J103J230n680p57m786O013
12307B1289N957j078j641j256J5190Q230n328m254q21k410j292k031L432O723
12293D0710q295K508J5820n65j6398k603m749K861n005l16K300M708L847k345
12279C2478p729J54N745k415j410P15m454n391J367j228N761m423o189P657J0887
12264C1525m819n664q09R793J58o792L252M904j869M118k78p521R41j222N352
12249C1069O131O086J4047J2777J8265L4037M5659L5393K2940N261j631J843J0836
12236B42713m449j7181j6798j6929k9591k6622k6383k1982j0000j2782l935L373
$$ plain form
12224 59434 62570 70514 76109 85365 94427 102697 101461 110137 115826 114338 112661 113813 101326 86687
12210 86687 74239 60095 48560 42701 35655 32853 34704 34694 34117 34201 34862 43476 43165 32798 22600
12195 22600 18928 22522 19654 18008 20120 29061 41099 44068 38932 28866 26766 35126 45786 43562
12181 43562 39620 30800 21272 20204 29667 34881 25670 22226 17510 19278 15035 5353 6768 12783
12167 12783 12996 20285 17921 14995 18332 9829 6093 1266 -609 12613 9895 5622 6801 11052
12153 11052 17280 19713 19148 12275 8496 6902 7568 10369 10268 7008 4865 7031 15930 23147 11752
12138 11752 813 358 4681 5295 6067 4828 -3196 8340 18087 17707 18693 15372 13220 18103 15170
12123 15170 11408 10273 8883 9105 6767 2856 -1239 5907 18569 18845 23282 22231 21366 23466 26620
$$ packed form
12224E9434L136P944N595R256R062Q270j236Q676N689j488j677J152j2487j4639
12210H6687j2448j4144j1535n859p046k802J851j0n77Q4O61Q614l11j0367j0198
12195B2600l672L594k868j646K112Q941J2038K969n136j0066k100Q360J0660k224
12181D3562l942q820r528j068R463N214r211l444m716J768m243r682J415O015
12167A2783K13P289k364k926L337q503l736m827j875J3222k718m273J179M251
12153A1052O228K433n65o873l779j594O66K801j01l260k143K166Q899P217j1395
12138A1752j0939m55M323O14P72j239q024J1536R747l80R86l321k152M883k933
12123A5170l762j135j390K22k338l911m095P146J2662K76M437j051q65K100L154
$$ plain form
12108 26620 22407 11190 15537 18491 17266 20496 21969 8607 10218 15007 22966 27852 22793 8250
12094 8250 4916 11013 10959 11555 12697 11236 15111 19484 23305 26773 36635 39272 43524 42387 40447
12079 40447 36008 24358 20002 11784 -1261 -5355 -5341 -1764 218 -1944 21 4585 10145 7229
12065 7229 8561 17393 11645 12996 15844 20685 21180 11910 6821 11734 9645 11901 18169 14111 4569
12050 4569 3618 7101 12366 16272 8036 11068 5891 2622 4840 5106 7219 14382 27963 21987 13769
12035 13769 13847 11622 14199 19904 18187 16300 24044 32688 36615 26909 26711 27715 24610 22779 23804
12020 23804 20346 22894 30831 38880 31041 27956 11807 7020 13239 23001 28039 26219 15366 17410
12006 17410 17393 6874 9347 13562 16754 17404 16508 23689 37548 36710 25853 22919 25856 27455 23878
$$ packed form
12108B6620m213j1217M347K954j225L230J473j3362J611M789P959M886n059j4543
12094H250l334O097n4N96J142j461L875M373L821L468R862K637M252j137j940
12079D0447m439j1650m356q218j3045m094J4L577J982k162J965M564N560k916
12065G229J332Q832n748J351K848M841M95r270n089M913k089K256O268m058r542
12050D569r51L483N265L906q236L032n177l269K218K66K113P163J3581n976q218
12035A3769P8k225K577N705j717j887P744Q644L927r706j98J004l105j831J025
12020B3804l458K548P937Q049p839l085j6149m787O219R762N038j820j0853K044
12006A7410j7j0519K473M215L192O50q96P181J3859q38j0857k934K937J599l577
$$ plain form
11991 23878 17902 14600 11388 13682 16506 14799 12771 12250 15431 19064 27101 25658 31635 27371 23177
11976 23177 19742 21078 32456 33315 26083 26304 27632 14166 14074 12857 10882 8263 4666 7903 22310
11961 22310 30960 32794 35553 41953 36763 26289 26702 31619 35130 34648 32481 31212 28511 31028 44180
11946 44180 51462 51089 45597 31335 23322 20904 24548 22731 26695 33216 36863 30769 27022 20972
11932 20972 24530 22676 19188 22615 19307 29151 32901 32536 29076 21398 27045 31106 35975 26480 9237
11917 9237 4682 12284 19983 16623 3951 3770 7303 9190 7144 7496 8663 11595 12523 18826 21247
11902 21247 10434 2813 8933 17516 20054 23879 19327 17033 15372 17819 28076 25157 27572 29241
11888 29241 31982 30447 26943 38433 42824 40196 33457 26332 26855 19113 18978 22870 25263 36904
$$ packed form
11991B3878n976l302l212K294K824j707k028n21L181L633Q037j443N977m264m194
11976B3177l435J336J1378Q59p232K21J328j3466r2j217j975k619l597L237J4407
11961B2310Q650J834K759O400n190j0474M13M917L511m82k167j269k701K517J3152
11946D4180P282l73n492j4262q013k418L644j817L964O521L647o094l747o050
11932B0972L558j854l488L427l308R844L750l65l460p678N647M061M869r495j7243
11917I237m555P602P699l360j2672j81L533J887k046L52J167K932R28O303K421
11902B1247j0813p621O120Q583K538L825m552k294j661K447J0257k919K415J669
11888B9241K741j535l504J1490M391k628o739p125N23p742j35L892K393J1641
$$ plain form
11874 36904 40765 32246 31088 35769 29572 30077 36016 31873 32347 34149 33439 23745 23969 30783 30864 36562
11858 36562 39313 33383 38905 44009 37513 37965 36426 26594 29463 31137 30857 31643 33953 30700 34350
11843 34350 35951 36168 37426 30487 29712 20694 22798 25710 20359 18606 28698 35119 28410 26694 35658
11828 35658 37439 34952 37308 40488 36071 37598 52701 52671 55573 50387 37601 38587 35352 29180 36347
11813 36347 40185 47972 56829 58371 56553 53944 50734 42771 32252 33315 39143 33670 30058 36554
11799 36554 35386 39031 35341 24775 20193 27194 26031 24822 15556 20664 21380 9574 10041 24744
11785 24744 23334 26374 30003 34679 35159 29609 22112 20218 21918 17014 20592 26031 22380 26716 43676
11770 43676 52022 48665 39077 29334 30249 31762 33833 43179 46519 44892 41089 28630 30008 32898
$$ packed form
11874C6904L861q519j158M681o197N05N939m143M74J802p10r694K24O814Q1N698
11858C6562K751n930N522N104o496M52j539r832K869J674k80P86K310l253L650
11843C4350J601K17J258o939p75r018K104K912n351j753J0092O421o709j716Q964
11828C5658J781k487K356L180m417J527J5103l0K902n186j2786R86l235o172P167
11813C6347L838P787Q857J542j818k609l210p963j0519J063N828n473l612O496
11799C6554j168L645l690j0566m582P001j163j209r266N108P16j1806M67J4703
11785B4744j410L040L629M676M80n550p497j894J700m904L578N439l651M336J6960
11770D3676Q346l357r588r743R15J513K071R346L340j627l803j2459J378K890
$$ plain form
11756 32898 34844 43272 50055 53448 57785 59217 65340 68535 61531 56337 41517 40885 52002 62772
11742 62772 60047 58275 64559 63386 52500 46793 51637 65724 64866 62248 61011 63436 64637 55993
11728 55993 48687 46053 42318 50714 53105 58925 51530 39096 36551 38388 29405 28428 42963 46527
11714 46527 48455 50024 55831 66350 64376 50772 53832 58491 53361 50805 51490 48475 48583 50386
11700 50386 51385 51044 47407 46533 55606 64722 58312 47354 50479 52845 46938 34928 40825 51639
11686 51639 63071 62955 59579 62587 69768 78910 79346 80198 74674 76518 86473 77004 84408 94413 97075
11671 97075 96270 91177 92637 98843 100987 111105 121277 116809 117540 126042 134580 141913 154078 162477
11657 162477 183136 195258 209752 237683 266365 298269 348364 415217 498239 593122 717823
$$ packed form
11756C2898J946Q428O783L393M337J432O123L195p004n194j4820o32J1117J0770
11742F2772k725j772O284j173j0886n707M844J4087q58k618j237K425J201q644
11728E5993p306k634l735Q396K391N820p395j2434k545J837q983r77J4535L564
11714D6527J928J569N807J0519j974j3604L060M659n130k556O85l015J08J803
11700E0386R99l41l637q74R073R116o410j0958L125K366n907j2010N897J0814
11686E1639J1432j16l376L008P181R142M36Q52n524J844R955r469P404J0005K662
11671I7075q05n093J460O206K144J0118J0172m468P31Q502Q538P333J2165Q399
11657A62477K0659J2122J4494K7931K8682L1904N0095O6853Q3022R4883J24701
$$ plain form
11646 717823 863674 1013544 1153935 1270221 1332946 1359584 1329382 1259950 1171026 1058920
11636 1058920 949194 853915 778487 728611 704622 690614 702108 733332 777719 847376 947378
11625 947378 1080364 1268781 1513966 1793500 2101435 2409890 2660986 2797528 2802414 2690365
11615 2690365 2493256 2241186 1964541 1697331 1459406 1256162 1100358 977839 895588 840995
11605 840995 814198 810262 823186 852609 899335 974915 1083692 1226132 1378037 1525575 1646366
11594 1646366 1711393 1707012 1636493 1521263 1376162 1220788 1069290 942988 851977 775597
11584 775597 719211 692098 689157 694146 716233 748488 803954 889840 1009213 1171767 1378482
11573 1378482 1653628 1987262 2350431 2692957 2951324 3099883 3112863 3002611 2805528 2548251
$$ packed form
11646G17823J45851J49870J40391J16286O2725K6638l0202o9432q8924j12106
11636A058920j09726r5279p5428m9876k3989j4008J1494L1224M4387O9657J00002
11625I47378J32986J88417K45185K79534L07935L08455K51096J36542M886j12049
11615B690365j97109k52070k76645k67210k37925k03244j55804j22519q2251n4593
11605H40995k6797l936J2924K9423M6726P5580J08777J42440J51905J47538J20791
11594A646366O5027m381p0519j15230j45101j55374j51498j26302r1011p6380
11584G75597n6386k7113k941M989K2087L2255N5466Q5886J19373J62554K06715
11573A378482K75146L33634L63169L42526K58367J48559J2980j10252j97083k57277
$$ plain form
11563 2548251 2272833 2006272 1780869 1615132 1511273 1447027 1422614 1445503 1508864 1612851
11553 1612851 1766520 2002312 2322196 2752407 3293894 3944655 4646050 5303036 5800733
11544 5800733 6052986 6029713 5753925 5276523 4682630 4052516 3456714 2950028 2545172 2235829
11534 2235829 2004801 1855689 1762789 1722871 1728180 1777701 1884465 2047753 2280423 2574822
11524 2574822 2912619 3257645 3552473 3740368 3802585 3714275 3484807 3168469 2801496 2427752
11514 2427752 2077236 1774498 1529458 1340548 1188255 1076966 1001518 936381 891344 853702
11504 853702 832897 842147 875297 937364 1041339 1187280 1372158 1569105 1748479 1888267
11494 1888267 1950725 1933235 1857416 1719634 1545690 1360903 1191059 1058849 960812 893241
$$ packed form
11563B548251k75418k66561k25403j65737j03859o4246k4413K2889O3361J03987
11553A612851J53669K35792L19884M30211N41487O50761P01395O56986M97697
11544E800733K52253k3273k75788m77402n93893o30114n95802n06686m04856l09343
11534B235829k31028j49112r2900l9918N309M9521J06764J63288K32670K94399
11524B574822L37797L45026K94828J87895O2217q8310k29468l16338l66973l73744
11514B427752l50516l02738k45040j88910j52293j11289p5448o5137m5037l7642
11504H53702k0805R250L3150O2067J03975J45941J84878J96947J79374J39788
11494A888267O2458j7490p5819j37782j73944j84787j69844j32210r8037o7571
$$ plain form
11484 893241 857148 848379 858761 888007 950679 1039301 1164831 1341759 1577426 1874597 2223248
11473 2223248 2599670 2945243 3188101 3290893 3262310 3092951 2818694 2492781 2146807 1820370
11463 1820370 1538175 1316808 1147181 1028850 946208 885741 855620 851004 866923 902728 959318
11452 959318 1047942 1167727 1317042 1464754 1588601 1673236 1714600 1680519 1573078 1425702
11442 1425702 1254974 1087581 928633 793345 689930 586270 504383 454856 411897 364620
11432 364620 336957 319073 292578 266658 244107 221937 205051 192884 189312 185053 185560 172590
11420 172590 159823 146324 135509 133794 138411 132894 124195 109491 101324 99608 96818 91245 89915
11407 89915 97334 96412 92067 78927 83467 90592 90846 86246 84010 86716 89255 83818 75888 67562 58866
$$ packed form
11484H93241l6093q769J0382K9246O2672Q8622J25530J76928K35667K97171L48651
11473B223248L76422L45573K42858J02792k8583j69359k74257l25913l45974l26437
11463A820370k82195k21367j69627j18331q2642o0467l0121m616J5919L5805N6590
11452I59318Q8624J19785J49315J47712J23847Q4635M1364l4081j07441j47376
11442A425702j70728j67393j58948j35288j03415j03660q1887m9527m2959m7277
11432C64620k7663j7884k6495k5920k2551k2170j6886j2167l572m259N07j2970
11420A72590j2767j3499j0815j715M617n517q699j4704q167j716k790n573j330
11407H9915P419r22m345j3140M540P125K54m600k236K706K539n437p930q326q696
$$ plain form
11392 58866 62309 82114 87826 80308 82941 75909 69474 66379 65869 77621 85650 79141 66850 68985
11378 68985 80716 93190 96483 104978 96993 89929 85787 86938 91660 90501 84034 82451 78086 69429
11364 69429 65864 81331 88190 81797 78745 72572 76352 78290 71152 78106 79213 84144 89645 88232
11350 88232 93696 101795 95881 99267 105258 104747 100401 97426 91271 88081 85147 85574 93957 94433 94622
11335 94622 92220 88178 96448 97447 97780 98681 106890 111953 108371 109622 118282 126343 124121 124011 119585
11320 119585 120240 127096 128077 128343 133127 131802 136151 140037 134095 134108 137479 148274 157556 156821 150309
11305 150309 144168 144163 152224 148156 152415 157216 167595 166380 177349 174000 164137 165881 174051 177377
11291 177377 181210 186716 188120 182912 170486 174703 184317 181629 182560 189333 196478 210849 220230 231896
$$ packed form
11392E8866L443J9805N712p518K633p032o435l095n10J1752Q029o509j2291K135
11378F8985J1731J2474L293Q495p985p064m142J151M722j159o467j583m365q657
11364F9429l565J5467O859o393l052o173L780J938p138O954J107M931N501j413
11350H8232N464Q099n914L386N991n11m346k975o155l190k934M27Q383M76J89
11335I4622k402m042Q270R99L33R01Q209N063l582J251Q660Q061k222j10m426
11320A19585O55O856R81K66M784j325M349L886n942J3L371J0795R282p35o512
11305A50309o141nQ061m068M259M801J0379j215J0969l349r863J744Q170L326
11291A77377L833N506J404n208j2426M217R614k688R31O773P145J4371R381J1666
$$ plain form
11277 231896 245658 254732 274001 292073 299895 292631 294075 288165 287578 293530 297364 303069 308643 316111
11263 316111 320001 325915 334027 338402 350545 368372 373128 374956 391568 409759 433168 434219 435983
11250 435983 455230 476900 494904 508030 518134 528257 541099 563210 591162 611164 633019
11239 633019 655808 677765 714756 747101 781916 809472 848125 894070 948858 997432 1041573
11228 1041573 1090175 1142967 1206999 1278041 1350485 1424743 1500156 1570788 1661846 1765092 1861786
11217 1861786 1965948 2066614 2176947 2274200 2375200 2478202 2582689 2678499 2764918 2849506
11207 2849506 2922977 2983627 3036719 3085834 3121848 3164463 3200720 3227572 3261086 3288141 3307369
11196 3307369 3327212 3343676 3343142 3343018 3332081 3304364 3275599 3247148 3203793 3141487 3068219 2988705
$$ packed form
11277B31896J3762R074J9269J8072P822p264J444n910n87N952L834N705N574P468
11263C16111L890N914Q112M375J2143J7827M756J828J6612J8191K3409J051J764
11250D35983J9247K1670J8004J3126J0104J0123J2842K2111K7952K0002K1855
11239F33019K2789K1957L6991L2345L4815K7556L8653M5945N4788M8574M4141
11228A041573M8602N2792O4032P1042P2444P4258P5413P0632R1058J03246R6694
11217A861786J04162J00666J10333R7253J01000J03002J04487R5810Q6419Q4588
11207B849506P3471O0650N3092M9115L6014M2615L6257K6852L3514K7055J9228
11196C307369J9843J6464n34j24j0937k7717k8765k8451m3355o2306p3268p9514
$$ plain form
11184 2988705 2915290 2841850 2755650 2661919 2576171 2492538 2418688 2350716 2277827 2212288 2147004
11173 2147004 2077952 2023736 1980301 1937364 1896752 1864315 1838309 1824524 1816814 1810246 1808319 1814260
11161 1814260 1840210 1857630 1871371 1884465 1909785 1949147 1982372 2014618 2057876 2105322 2162226
11150 2162226 2228628 2305490 2398109 2489246 2585554 2687604 2811257 2945854 3088893 3237041
11140 3237041 3391337 3558262 3730713 3898945 4071645 4245583 4420987 4593085 4747819
11131 4747819 4907376 5079278 5221827 5364871 5495448 5609794 5721623 5821779 5910361 5980143
11121 5980143 6039139 6088143 6135360 6162705 6176863 6188017 6172543 6145682 6102324 6047317 5979006
11110 5979006 5890348 5794812 5696537 5592821 5475839 5338664 5196245 5036413 4867189 4705744
$$ packed form
11184B988705p3415p3440q6200r3731q5748q3633p3850o7972p2889o5539o5284
11173B147004o9052n4216m3435m2937m0612l2437k6006j3785p710o568j927N941
11161A814260K5950J7420J3741J3094K5320L9362L3225L2246M3258M7446N6904
11150B162226O6402P6862R2619R1137R6308J02050J23653J34597J43039J48148
11140C237041J54296J66925J72451J68232J72700J73938J75404J72098J54734
11131D747819J59557J71902J42549J43044J30577J14346J11829J00156Q8582O9782
11121E980143N8996M9004M7217K7345J4158J1154j5474k6861m3358n5007o8311
11110E979006q8658r5536r8275j03716j16982j37175j42419j59832j69224j61445
$$ plain form
11100 4705744 4546925 4374171 4194220 4016007 3848598 3684882 3521370 3368866 3228898
11091 3228898 3097422 2981944 2857984 2741218 2632326 2525513 2427908 2357026 2281777 2205520
11081 2205520 2133648 2069740 2009691 1972082 1938763 1901697 1868571 1847328 1822838 1808632 1806822
11070 1806822 1810917 1806642 1821109 1832077 1848726 1879553 1912745 1945465 1989783 2043038 2093495 2151897
11058 2151897 2219454 2293596 2366276 2450821 2540060 2623232 2696535 2778307 2869296 2946852 3018943
11047 3018943 3097748 3161121 3227724 3281768 3321074 3346236 3355208 3370313 3373658 3370150 3371599 3362250
11035 3362250 3344115 3329214 3311155 3282566 3245016 3208984 3161910 3105372 3047316 2984749 2911634
11024 2911634 2833008 2743680 2648892 2552028 2449967 2351628 2249715 2143026 2031865 1930452
$$ packed form
11100D705744j58819j72754j79951j78213j67409j63716j63512j52504j39968
11091C228898j31476j15478j23960j16766j08892j06813r7605p0882p5249p6257
11081B205520p1872o3908o0049l7609l3319l7066l3126k1243k4490j4206j810
11070A806822M095m275J4467J0968J6649L0827L3192L2720M4318N3255N0457N8402
11058B151897O7557P4142P2680Q4545Q9239Q3172P3303Q1772R0989P7556P2091
11047C018943P8805O3373O6603N4044L9306K5162Q972J5105L345l508J449r349
11035C362250j8135j4901j8059k8589l7550l6032m7074n6538n8056o2567p3115
11024B911634p8626q9328r4788r6864j02061r8339j01913j06689j11161j01413
$$ plain form
11014 1930452 1853804 1771673 1684450 1596261 1519298 1440635 1363090 1295221 1235630 1180029 1131181
11003 1131181 1083062 1036275 989931 958213 916722 876343 838150 795759 760505 742599 710572
10992 710572 685637 660666 635093 615185 599196 578249 551218 533244 516452 507772 505613 491791
10980 491791 482879 473794 451812 429435 410382 406652 392223 368087 355041 346478 337525 342102 337974
10967 337974 319489 303309 296995 291032 283782 276670 263302 271295 285377 285327 279502 269582 263276 255029
10953 255029 256201 261630 254420 239499 229747 220073 221228 221528 219141 216881 213533 209386 216716 215803
10939 215803 211291 214101 222011 232971 241011 257108 284087 315085 371987 455110 565530 652220
10927 652220 670617 641497 593809 527477 447254 370624 310174 276529 254253 236409 220714
$$ packed form
11014A930452p6648q2131q7223q8189p6963p8663p7545o7869n9591n5601m8848
11003A131181m8119m6787m6344l1718m1491m0379l8193m2391l5254j7906l2027
10992G10572k4935k4971k5573j9908j5989k0947k7031j7974j6792q680k159j3822
10980D91791q912r085k1982k2377j9053l730j4429k4136j3046q563q953M577m128
10967C37974j8485j6180o314n963p250p112j3368P993J4082n0n825r920o306q247
10953B55029J172N429p210j4921r752r674J155L00k387k260l348m147P330r13
10939B15803m512K810P910J0960Q040J6097K6979L0998N6902Q3123J10420Q6690
10927F52220J8397k9120m7688o6332q0223p6630o0450l3645k2276j7844j5695
$$ plain form
10916 220714 208085 198719 186418 178703 167883 160190 153589 152764 156121 153357 152238 146071 132916
10903 132916 122390 120022 127199 139652 139579 134698 137407 142375 133288 126877 128258 123527 122607 120476
10889 120476 119538 116236 111564 114611 117974 117646 115297 112090 108079 108603 110514 102850 103042 101600 92089
10874 92089 97871 108832 105028 99077 103783 103771 110278 110810 107405 108553 102317 93334 88915 91566 106806
10859 106806 112315 107648 100133 97380 96119 86709 90226 98604 93672 90282 96591 100878 99300 101344
10845 101344 98686 94758 87831 92031 88217 89838 92967 83796 84205 101365 101506 98242 90647 80600
10831 80600 83374 90804 93988 92846 91329 86741 84310 85649 83809 81152 79420 70575 55549 52437
10817 52437 50667 53634 57035 60826 62672 62820 52658 46014 44822 47469 56584 56629 56669 50716 50752 50397
$$ packed form
10916B20714j2629r366j2301p715j0820p693o601q25L357k764j119o167j3155
10903A32916j0526k368P177J2453p3m881K709M968r087o411J381m731r20k131
10889A20476r38l302m672L047L363l28k349l207m011N24J911p664J92j442r511
10874I2089N782J0961l804n951M706j2O507N32l405J148o236q983m419K651J5240
10859A06806N509m667p515k753j261r410L517Q378m932l390O309M287j578K044
10845A01344k658l928o927M200l814J621L129r171M09J7160J41l264p595j0047
10831H0600K774P430L184j142j517m588k431J339j840k657j732q845j5026l112
10817E2437j770K967L401L791J846J48j0162o644j192K647R115M5M0n953L6l55
$$ plain form
10801 50397 55587 63268 63662 72910 79271 78509 77940 83276 78538 65394 62551 70120 76566 74533 77901
10786 77901 84867 84685 79457 76707 80783 76456 75046 75212 82156 86924 85640 90906 92796 92536 93025
10771 93025 91451 86062 86966 89249 88504 88199 94853 104540 107877 110325 105163 104140 111230 107206 89088
10756 89088 78407 75250 69086 68990 66799 55950 49442 58364 69530 68303 63029 56674 46538 50533
10742 50533 61364 72540 71895 68889 71701 73947 77014 73340 71447 66096 51773 53654 62076 60942
10728 60942 53370 52594 44043 40923 49573 51531 41455 43264 55423 61262 58676 53183 51118 51064 46649
10713 46649 41350 39456 47102 54199 54324 48981 43490 44065 50509 52971 53423 58182 63793 75949 79405
10698 79405 87158 111898 133234 159287 160777 135063 114782 115791 115569 108345 95280 89482 90483
$$ packed form
10801E0397N190P681L94R248O361p62n69N336m738j3144k843P569O446k033L368
10786G7901O966j82n228k750M076m327j410J66O944M768j284N266J890k60M89
10771I3025j574n389R04K283p45l05O654R687L337K448n162j023P090m024j8118
10756H9088j0681l157o164r6k191j0849o508Q922J1166j227n274o355j0136L995
10742E0533J0831J1176o45l006K812K246L067l674j893n351j4323J881Q422j134
10728F0942p572p76q551l120Q650J958j0076J809J2159N839k586n493k065n4m415
10713D6649n299j894P646P097J25n343n491N75O444K462M52M759N611J2156L456
10698G9405P753K4740K1336K6053J490k5714k0281J009k22p224j3065n798J001
$$ plain form
10685 90483 91422 84770 83726 85264 94815 102587 107514 118609 111134 100213 104723 109070 109810 103384
10671 103384 100364 100898 105080 108108 103767 101812 100975 90539 85641 84993 93768 98520 99205 94968 88980
10656 88980 80648 71369 73110 72747 69961 72446 82458 98746 110003 106201 99320 92591 85672 89712
10642 89712 87901 94298 107334 112014 113193 130429 148135 162281 178423 192652 201893 204280 191369
10629 191369 193307 203064 189493 155044 138048 128592 113028 103216 95775 99352 105700 110673 111244
10616 111244 115695 124962 137370 143691 156217 158492 161435 169487 167188 168438 182269 178939 174129
10603 174129 168683 169951 184195 193391 189904 186227 192069 195044 195779 194495 196347 183514 173448 164165
10589 164165 166612 163558 155893 156744 161869 164334 162677 168722 167218 177679 191898 204179 216125
$$ packed form
10685I0483R39o652j044J538R551P772M927J1095p475j0921M510M347P40o426
10671A03384l020N34M182L028m341j955q37j0436m898o48Q775M752O85m237n988
10656H8980q332r279J741l63k786K485J0012J6288J1257l802o881o729o919M040
10642H9712j811O397J3036M680J179J7236J7706J4146J6142J4229R241K387j2911
10629A91369J938R757j3571l4449j6996r456j5564r812p441L577O348M973N71
10616A11244M451R267J2408O321J2526K275K943Q052k299J250J3831l330m810
10603A74129n446J268J4244R196l487l677N842K975P35j284J852j2833j0066r283
10589A64165K447l054p665Q51N125K465j657O045j504J0461J4219J2281J1946
$$ plain form
10576 216125 216397 205693 207181 210037 212570 220791 229681 241611 247453 258086 269529 271070 272732
10563 272732 273346 268748 267538 276416 281209 298883 311049 318435 324327 344388 367631 395427 426025
10550 426025 451220 477586 504041 527212 558379 573848 593671 625389 649384 677209 698112
10539 698112 729673 782595 854642 927905 1018397 1123632 1239055 1372211 1548113 1735792
10529 1735792 1943670 2186705 2443653 2681803 2872623 3072287 3317752 3615650 3997883
10520 3997883 4485027 5136414 6001028 7175252 8783860 11024680 14296891 19337761 27438883
10511 27438883 40772327 61272606 84875824 99326143 99989043 92480142 82006331
10504 82006331 68420626 51923521 37167882 26799979 20177684 15894205 12976932
$$ packed form
10576B16125K72j0704J488K856K533Q221Q890J1930N842J0633J1443J541J662
10563B72732O14m598j210Q878M793J7674J2166P386N892K0061K3243K7796L0598
10550D26025K5195K6366K6455K3171L1167J5469J9823L1718K3995K7825K0903
10539F98112L1561N2922P2047P3263R0492J05235J15423J33156J75902J87679
10529A735792K07878K43035K56948K38150J90820J99664K45465K97898L82233
10520C997883M87144O51387Q64614J174224J608608K240820L272211N040870Q101122
10511B7438883J3333444K0500279K3603218J4450319O62900p508901j0473811
10504H2006331j3585705j6497105j4755639j0367903o622295m283479k917273
$$ plain form
10497 12976932 10888742 9332162 8144926 7219301 6503525 5949515 5499970 5104056 4684611
10488 4684611 4264201 3871414 3495122 3147885 2850675 2607467 2401127 2223697 2080507
10479 2080507 1954203 1840665 1739372 1634611 1530477 1438443 1351100 1270016 1189140 1114592
10469 1114592 1040601 977747 931444 885926 843900 809245 770455 734417 714295 682860 648724
10458 648724 613054 567255 520565 488447 473635 456306 440722 416106 386673 375905 360816
10447 360816 345122 332806 324112 314878 307833 292760 279431 262578 251750 240317 232552 225161
10435 225161 211205 205562 216396 215974 205164 205746 212353 208045 206609 205692 201569 189818 175280 167303
10421 167303 159862 157350 148134 149557 149155 147096 142854 142214 138798 139342 127358 118719 108957 107808 112367
$$ packed form
10497A2976932k088190j556580j187236r25625p15776n54010m49545l95914m19445
10488D684611m20410l92787l76292l47237k97210k43208k06340j77430j43190
10479B080507j26304j13538j01293j04761j04134r2034q7343q1084q0876p4548
10469A114592p3991o2854m6303m5518m2026l4655l8790l6038k0122l1435l4136
10458F48724l5670m5799m6690l2118j4812j7329j5584k4616k9433j0768j5089
10447C60816j5694j2316q694r234p045j5073j3329j6853j0828j1433p765p391
10435B25161j3956n643J0834m22j0810N82O607m308j436r17m123j1751j4538p977
10421A67303p441k512r216J423m02k059m242o40l416N44j1984q639r762j149M559
$$ plain form
10406 112367 110425 110020 107681 107050 107425 111098 112053 107242 108093 112686 121529 131014 129478 128249 132901
10391 132901 122581 109069 101291 99460 92840 95383 89092 82797 80311 81210 75854 73428 83698 80997
10377 80997 76606 92615 97232 93229 89084 99139 102984 104338 112618 104204 96778 98991 104855 99789
10363 99789 110439 113217 110942 118614 109458 109528 108590 108494 118948 116495 103230 88099 75241 75822 76157
10348 76157 68703 70752 61503 60977 76046 89592 87176 90611 97816 97222 93054 79482 76659 82389
10334 82389 87700 85183 86485 94561 105430 105678 104923 97650 98678 89684 76620 65665 64553 55941
10320 55941 60419 69601 68604 73277 87765 114382 138928 159242 173845 183851 188047 186142 190428
10307 190428 198202 197530 206871 228802 238604 252084 274162 305937 327146 362936 406496 448864
$$ packed form
10406A12367j942m05k339o31L75L673R55m811Q51M593Q843R485j536j229M652
10391A32901j0320j3512p778j831o620K543o291o295k486Q99n356k426J0270k701
10377H0997m391J6009M617m003m145J0055L845J354Q280q414p426K213N864n066
10363I9789J0650K778k275P672r156P0r38r6J0454k453j3265j5131j2858N81L35
10348G6157p454K049r249n26J5069J3546k416L435P205n94m168j3572k823N730
10334H2389N311k517J302Q076J0869K48p55p273J028q994j3064j0955j112q612
10320E5941M478R182r97M673J4488K6617K4546K0314J4603J0006M196j905M286
10307A90428P774o72R341K1931R802J3480K2078L1775K1209L5790M3560M2368
$$ plain form
10295 448864 526621 637834 788773 974574 1205807 1447857 1668546 1811362 1865510 1806680
10285 1806680 1667283 1480605 1273214 1059255 866999 718572 601880 517036 448054 383223
10275 383223 341331 318650 305101 288827 267846 267203 252113 243522 232823 213375 197869 188161
10263 188161 178009 166871 169846 179006 171215 166893 160488 152366 153801 147686 151533 157761 156251 142631
10249 142631 131573 129726 130725 129640 135978 140248 138242 125141 114876 106888 106093 114677 113989 106617
10235 106617 119548 131395 123829 119602 122378 120237 120320 107614 107846 109369 101712 96194 98348 100206
10221 100206 109310 126673 129027 139472 169676 202560 244465 299306 359410 401367 408743 383252
10209 383252 348139 303648 253137 211777 181697 169152 151755 128552 111526 106204 123081 123811
$$ packed form
10295D48864P7757J11213J50939J85801K31233K42050K20689J42816N4148n8830
10285A806680j39397j86678k07391k13959j92256j48427j16692q4844o8982o4831
10275C83223m1892k2681j3549j6274k0981o43j5090q591j0699j9448j5506r708
10263A88161j0152j1138K975R160p791m322o405q122J435o115L847O228j510j3620
10249A42631j1058j847R99j085O338M270k006j3101j0265p988p95Q584o88p372
10235A06617J2931J1847p566m227K776k141Q3j2706K32J523p657n518K154J858
10221A00206R104J7363K354J0445L0204L2884M1905N4841O0104M1957P376k5491
10209C83252l5113m4491n0511m1360l0080j2545j7397k3203j7026n322J6877P30
$$ plain form
10197 123811 109327 102875 101438 93620 85709 85342 88327 89421 85072 87615 101701 108190 104802 94722
10183 94722 90512 90591 86817 82893 70963 66980 69184 67888 69371 72350 69344 64699 64676 65000 61694
10168 61694 60912 66726 64105 54891 51662 55743 51901 53266 62387 61772 67545 69436 66988 66983 64417 57401
10152 57401 52576 56408 53909 51755 53389 49014 44675 44025 53624 52477 59202 55670 54508 50792 43702
10137 43702 43341 50623 61136 61369 68894 78056 79483 74442 69223 69889 57807 48499 44930 45713 48014
10122 48014 59620 63869 75217 77486 71231 75261 68035 67596 62264 66961 64982 64699 61297 56438
10108 56438 63318 70449 76581 73583 70901 70298 71204 81231 91360 95281 93742 97094 97170 99188 101309
10093 101309 103325 102870 99524 107022 118553 142923 167451 209872 275649 366712 488679 563679
$$ packed form
10197A23811j4484o452j437p818p911l67K985J094m349K543J4086O489l388j0080
10183I4722m210P9l774l924j1930l983K204j296J483K979l006m645k3L24l306
10168F1694p82N814k621r214l229M081l842J365R121o15N773J891k448nk566p016
10152E7401m825L832k499k154J634m375m339o50R599j147O725l532j162l716p090
10137D3702l61P282J0513K33P525R162J427n041n219O66j2082r308l569P83K301
10122D8014J1606M249J1348K269o255M030p226m39n332M697j979k83l402m859
10108E6438O880P131O132k998k682o03R06J0027J0129L921j539L352P6K018K121
10093A01309K016m55l346P498J1531K4370K4528M2421O5777R1063J21967P5000
$$ plain form
10081 563679 572522 545044 511363 448893 366225 291983 232094 195918 177391 163463 152333 133083
10069 133083 116412 108867 104318 97084 92546 90449 91260 92214 93533 91804 90070 82232 69144 61812
10055 61812 65288 68765 70146 73641 80169 78588 81259 76821 86459 92671 90702 93589 96217 101325
10041 101325 98255 99971 92921 91508 105521 108783 110556 111075 109688 113998 113778 116744 116128 110699 117391
10026 117391 132630 131114 129856 128488 127530 124752 124419 128202 143874 145501 139075 135515 132095 132109 135689
10011 135689 138700 143543 152098 146973 140354 146461 152474 144975 149749 157868 159733 164152 171338 182961
9997 182961 187795 189623 195982 194983 196185 200492 209955 216927 215170 219654 237153 248812 259535 264246
9983 264246 273316 278525 280427 288707 308043 322339 328074 341997 363404 389266 420360 445953 470402
$$ packed form
10081E63679Q843k7478l3681o2470q2668p4242n9889l6176j8527j3928j1130j9250
10069A33083j6671p545m549p234m538k097Q11R54J319j729j734p838j3088p332
10055F1812L476L477J381L495O528j581K671m438R638O212j969K887K628N108
10041A01325l070J716p050j413J4013L262J773N19j387M310k20K966o16n429O692
10026A17391J5239j516j258j368r58k778l33L783J5672J627o426l560l420J4L580
10011A35689L011M843Q555n125o619O107O013p499M774Q119J865M419P186J1623
9997A82961M834J828O359r99J202M307R463O972j757M484J7499J1659J0723M711
9983B64246R070N209J902Q280J9336J4296N735J3923K1407K5862L1094K5593K4449
$$ plain form
9970 470402 508441 565304 621245 692854 784199 881494 984592 1105532 1228686 1343313 1463254
9959 1463254 1582097 1682664 1776104 1874935 1961090 2048654 2163800 2294146 2427954 2560034
9949 2560034 2695209 2833902 2983134 3144307 3324122 3535477 3759365 3984144 4192618 4403966
9939 4403966 4597395 4746621 4871010 4976850 5064436 5153818 5238946 5324246 5403304 5461876 5495268
9928 5495268 5518050 5512339 5483733 5451728 5437390 5438769 5453518 5476940 5501923 5525262 5561325 5580668
9916 5580668 5585969 5588531 5574368 5545077 5498744 5426684 5324762 5215564 5098949 4980382 4836105
9905 4836105 4668102 4479784 4289573 4088617 3904821 3746197 3601747 3453074 3302321 3158708
9895 3158708 3009886 2892326 2787817 2693108 2619635 2572407 2555042 2551092 2543331 2524409 2496404
$$ packed form
9970D70402L8039N6863N5941P1609R1345R7295J03098J20940J23154J14627J19941
9959A463254J18843J00567R3440R8831Q6155Q7564J15146J30346J33808J32080
9949B560034J35175J38693J49232J61173J79815K11355K23888K24779K08474K11348
9939D403966J93429J49226J24389J05840Q7586Q9382Q5128Q5300P9058N8572L3392
9928E495268K2782n711k8606l2005j4338J379J4749K3422K4983K3339L6063J9343
9916E580668N301K562j4163k9291m6333p2060j01922j09198j16615j18567j44277
9905D836105j68003j88318j90211k00956j83796j58624j44450j48673j50753j43613
9895C158708j48822j17560j04509r4709p3473m7228j7365l950p761j8922k8005
$$ plain form
9884 2496404 2478019 2470818 2502923 2561275 2630031 2713285 2795412 2868742 2930432 2972342 3014647 3068027
9872 3068027 3144948 3249196 3377411 3539398 3718114 3906201 4103857 4297880 4492433 4705241
9862 4705241 4935281 5184007 5439090 5693728 5931452 6155314 6375740 6577821 6772958 6941807
9852 6941807 7081187 7199951 7311246 7404239 7460968 7495344 7506635 7491235 7469789 7453149 7434541
9841 7434541 7419637 7419557 7444799 7479087 7511751 7530900 7537691 7530307 7487759 7424303 7361310 7303601
9829 7303601 7244973 7165129 7076687 6980212 6860119 6705425 6494857 6249555 5984260 5701169
9819 5701169 5428395 5182820 4954536 4750618 4558520 4371681 4198637 4036299 3883936 3749822
9809 3749822 3644727 3537891 3442428 3359417 3271678 3175464 3071730 2970775 2857504 2742909
$$ packed form
9884B496404j8385p201L2105N8352O8756Q3254Q2127P3330O1690M1910M2305N3380
9872C068027P6921J04248J28215J61987J78716J88087J97656J94023J94553K12808
9862D705241K30040K48726K55083K54638K37724K23862K20426K02081J95137J68849
9852F941807J39380J18764J11295R2993N6729L4376J1291j5400k1446j6640j8608
9841G434541j4904q0K5242L4288L2664J9149O791p384m2548o3456o2993n7709
9829G303601n8628p9844q8442r6475j20093j54694k10568k45302k65295k83091
9819E701169k72774k45575k28284k03918j92098j86839j73044j62338j52363j34114
9809C749822j05095j06836r5463q3011q7739r6214j03734j00955j13271j14595
$$ plain form
9799 2742909 2637038 2532254 2437541 2364129 2322505 2308167 2300964 2303983 2312433 2341786 2380374 2424032
9787 2424032 2474054 2535214 2611806 2695615 2788287 2887688 3002264 3124653 3260319 3412971 3572600
9776 3572600 3746825 3932578 4122683 4335912 4561109 4799424 5033148 5273932 5516690 5766224
9766 5766224 6013035 6262989 6509995 6746796 6960100 7138011 7295951 7426670 7513741 7563509
9756 7563509 7578546 7537016 7443248 7323243 7173749 6994105 6784851 6563115 6333744 6097330
9746 6097330 5850911 5603591 5351990 5104616 4869275 4635331 4405499 4187012 3984493 3793042
9736 3793042 3616544 3440161 3275248 3121566 2972609 2840810 2707385 2579795 2466352 2357634
9726 2357634 2250023 2144385 2048381 1969071 1893321 1819390 1757535 1687286 1614479 1552236 1479411
$$ packed form
9799B742909j05871j04784r4713p3412m1624j4338p203L019Q450K9353L8588M3658
9787B424032N0022O1160P6592Q3809R2672R9401J14576J22389J35666J52652J59629
9776C572600J74225J85753J90105K13229K25197K38315K33724K40784K42758K49534
9766E766224K46811K49954K47006K36801K13304J77911J57940J30719Q7071M9768
9756G563509J5037m1530r3768j20005j49494j79644k09254k21736k29371k36414
9746F097330k46419k47320k51601k47374k35341k33944k29832k18487k02519j91451
9736C793042j76498j76383j64913j53682j48957j31799j33425j27590j13443j08718
9726B357634j07611j05638r6004p9310p5750p3931o1855p0249p2807o2243p2825
$$ plain form
9715 1479411 1426871 1372324 1305615 1261774 1222457 1176975 1127615 1081191 1041913 1002307 971667
9704 971667 938080 919712 903207 872146 833809 807437 783252 762410 748398 725978 705882 689064
9692 689064 668719 650227 636580 629251 621961 611497 600890 580677 558810 544987 538749 521963
9680 521963 514667 506855 496887 493386 485636 476701 456406 440193 431616 416403 412286 408956 409453 401766
9666 401766 392634 385482 376858 371677 371183 344905 334163 334390 339289 334392 325346 315217 315141 312741 305718
9651 305718 305910 302403 308367 300795 285748 280371 283035 286974 285616 273846 266933 264730 261992 258700
9637 258700 251602 239200 233051 237464 228501 225277 223731 216812 219693 225337 218481 211186 204555 197661
9623 197661 191251 184631 188737 196530 207381 212678 212346 203293 181794 174906 168615 172350 175613 170426
$$ packed form
9715A479411n2540n4547o6709m3841l9317m5482m9360m6424l9278l9606l0640
9704I71667l3587j8368j6505l1061l8337k6372k4185k0842j4012k2420k0096j6818
9692F89064k0345j8492j3647p329p290j0464j0607k0213k1867j3823o238j6786
9680E21963p296p812r968l501p750q935k0295j6213q577j5213m117l330M97p687
9666D01766r132p152q624n181m94k6278j0742K27M899m897r046j0129p6k400p023
9651C05718J92l507N964p572j5047n377K664L939j358j1770o913k203k738l292
9637B58700p098j2402o149M413q963l224j546o919K881N644o856p295o631o894
9623A97661o410o620M106P793J0851N297l32r053k1499o888o291L735L263n187
$$ plain form
9609 170426 175449 179247 177062 170431 160099 155012 158460 163746 167697 177109 166913 163994 162508 173216
9595 173216 172813 172054 169367 160448 152809 149221 154485 157387 157355 152733 143740 141825 142919 149530 138758
9580 138758 130930 144407 144006 136361 140274 139534 142905 134907 125879 124758 137537 144845 142954 141672
9566 141672 137718 138482 138005 139315 132432 135600 135383 128724 121381 122452 119650 115917 128346 138043 134654
9551 134654 126088 116656 108172 117646 130085 132947 133707 143732 152090 142194 138572 134929 136848 131055
9537 131055 133948 143154 150652 155319 156155 166153 171377 174708 181759 176337 174296 173643 173780 176506 189968
9522 189968 189902 186933 187498 182963 187019 191764 194507 196949 196943 192534 195591 200505 202401 205008 214857 214270
9506 214270 207472 200535 205354 202715 207683 213526 207916 206343 206060 206733 205892 189767 182160 179248 182376
$$ packed form
9609A70426N023L798k185o631j0332n087L448N286L951R412j0196k919j486J0708
9595A73216m03p59k687q919p639l588N264K902l2m622q993j915J094O611j0772
9580A38758p828J3477m01p645L913p40L371p998r028j121J2779P308j891j282
9566A41672l954P64m77J310o883L168k17o659p343J071k802l733J2429R697l389
9551A34654q566r432q484R474J2439K862P60J0025Q358r896l622l643J919n793
9537A31055K893R206P498M667Q36R998N224L331P051n422k041o53J37K726J3462
9522A89968o6k969N65m535M056M745K743K442om409L057M914J896K607R849n87
9506B14270o798o937M819k639M968N843n610j573k83O73q41j6125p607k912L128
$$ plain form
9491 182376 186848 182487 162543 152843 157226 161052 153347 147356 145753 157856 166182 165783 172555 170281
9477 170281 166077 167842 166009 163516 174887 186432 182511 164046 153801 154250 152460 155294 166703
9464 166703 175858 183522 185197 188069 196769 202115 204080 213360 225617 245242 257060 267334 284963
9451 284963 304388 324632 334658 351627 370886 383936 408671 442423 478100 519898 561585 604548
9439 604548 649216 717797 801395 903555 1022666 1149151 1308329 1505967 1740429 1994074
9429 1994074 2260923 2516066 2732662 2877059 2925220 2898076 2801317 2653312 2476196 2292878
9419 2292878 2120971 1951778 1799800 1678108 1581825 1510282 1463551 1432022 1424719 1442187 1481724
9408 1481724 1536431 1604490 1718566 1866585 2039209 2244516 2469245 2700461 2911074 3059455
$$ packed form
9491A82376M472m361j9944r700M383L826p705n991j603J2103Q326l99O772k274
9477A70281m204J765j833k493J1371J1545l921j8465j0245M49j790K834J1409
9464A66703R155P664J675K872Q700N346J965R280J2257J9625J1818J0274J7629
9451B84963J9425K0244J0026J6969J9259J3050K4735L3752L5677M1798M1687M2963
9439F04548M4668O8581Q3598J02160J19111J26485J59178J97638K34462K53645
9429A994074K66849K55143K16596J44397M8161k7144r6759j48005j77116j83318
9419B292878j71907j69193j51978j21692r6283p1543m6731l1529p303J7468L9537
9408A481724N4707O8059J14076J48019J72624K05307K24729K31216K10613J48381
$$ plain form
9398 3059455 3114420 3084019 2974745 2805239 2592772 2381681 2176884 1982913 1811136 1652772
9388 1652772 1510905 1383398 1282758 1205748 1139181 1075324 1015551 975731 938968 915294 900614
9377 900614 892276 881418 880470 885575 884878 891711 917722 943460 976147 1028283 1093341 1152362 1225066
9364 1225066 1324278 1447537 1590325 1774722 1993687 2257395 2557923 2922679 3348390 3819922
9354 3819922 4309943 4795635 5237424 5596107 5849127 5977133 5992611 5943263 5856015 5747940
9344 5747940 5626108 5512805 5351095 5158856 4927180 4668911 4410815 4172281 3973444 3821338
9334 3821338 3737655 3734036 3790605 3901392 4098630 4376371 4713917 5124113 5557568 5978320
9324 5978320 6347698 6610158 6759000 6785733 6719414 6585051 6411144 6229353 6060497 5888046
$$ packed form
9398C059455N4965l0401j09274j69506k12467k11091k04797j93971j71777j58364
9388A652772j41867j27507j00640p7010o6567o3857n9773l9820l6763k3674j4680
9377I00614q338j0858r48N105o97O833K6011K5738L2687N2136O5058N9021P2704
9364A225066R9212J23259J42788J84397K18965K63708L00528L64756M25711M71532
9354C819922M90021M85692M41789L58683K53020J28006J5478m9348q7248j08075
9344E747940j21832j13303j61710j92239k31676k58269k58096k38534j98837j52106
9334C821338q3683l619N6569J10787J97238K77741L37546M10196M33455M20752
9324E978320L69378K62460J48842K6733o6319j34363j73907j81791j68856j72451
$$ plain form
9314 5888046 5693643 5451935 5168758 4860774 4527173 4185565 3838946 3495016 3158762 2862582
9304 2862582 2600084 2366617 2173007 2001138 1856118 1738900 1647499 1564446 1497297 1446830
9294 1446830 1418161 1391117 1374480 1366829 1377346 1399736 1439311 1496066 1575176 1668350 1789002
9283 1789002 1938443 2122488 2342680 2596254 2896178 3226011 3545048 3856654 4114651 4330772
9273 4330772 4525389 4715613 4898348 5086637 5271491 5417265 5490348 5467769 5346791 5134080
9263 5134080 4854239 4541407 4226598 3929641 3677941 3476512 3331946 3253018 3237800 3290154
9253 3290154 3399403 3576459 3809887 4091016 4376438 4614362 4793294 4914232 4989467 5043866
9243 5043866 5093736 5153036 5203382 5214382 5142059 4990002 4762784 4454718 4092966 3715419
$$ packed form
9314E888046j94403k41708k83177l07984l33601l41608l46619l43930l36254k96180
9304B862582k62498k33467j93610j71869j45020j17218r1401q3053o7149n0467
9294A446830k8669k7044j6637p651J0517K2390L9575N6755P9110R3174J20652
9283A789002J49441J84045K20192K53574K99924L29833L19037L11606K57997K16121
9273D330772J94617J90224J82735J88289J84854J45774P3083k2579j20978k12711
9263E134080k79841l12832l14809k96957k51700k01429j44566p8928j5218N2354
9253C290154J09249J77056K33428K81129K85422K37924J78932J20938P5235N4399
9243E043866M9870N9300N0346J1000p2323j52057k27218l08066l61752l77547
$$ plain form
9233 3715419 3332579 2966383 2629717 2352575 2109468 1896745 1716751 1570910 1446007 1331972
9223 1331972 1236341 1138580 1047506 972409 916372 855948 805895 763381 729408 709340 687530
9212 687530 652286 642086 647412 643660 651939 666012 687356 713925 753892 799249 849349 915282
9200 915282 989137 1077502 1185389 1304930 1431839 1569920 1724343 1878264 2002176 2076098
9190 2076098 2093377 2056544 1960189 1831553 1686939 1539016 1390342 1267874 1172557 1091459
9180 1091459 1031929 994342 977078 958078 951576 971583 1015428 1074506 1148816 1239083 1341515
9169 1341515 1465507 1605875 1741885 1865569 1981680 2039389 2032488 1973313 1863669 1721236
9159 1721236 1545985 1368207 1193456 1042107 913438 801128 708987 644866 594392 561056
$$ packed form
9233C715419l82840l66196l36666k77142k43107k12723j79994j45841j24903j14035
9223A331972r5631r7761r1074p5097n6037o0424n0053m2514l3973k0068k1810
9212F87530l5244j0200N326l752Q279J4073K1344K6569L9967M5357N0100O5933
9200I15282P3855Q8365J07887J19541J26909J38081J54423J53921J23912P3922
9190B076098J7279l6833r6355j28636j44614j47923j48674j22468r5317q1098
9180A091459n9530l7587j7264j9000o502K0007M3845N9078P4310R0267J02432
9169A341515J23992J40368J36010J23684J16111N7709o901n9175j09644j42433
9159A721236j75251j77778j74751j51349j28669j12310r2141o4121n0474l3336
$$ plain form
9149 561056 531576 496252 459473 432969 416290 399069 376877 359489 339514 314375 288779 261687
9137 261687 257734 238904 223881 210057 204201 200201 189216 185343 193156 196071 188603 184538 193795
9124 193795 191784 177408 166168 159910 141939 133424 130908 122375 119236 118078 112522 99085 83582
9111 83582 83015 97357 106181 117885 134062 146371 177353 224539 258644 285087 318010 326324 303694
9098 303694 280726 258903 240071 214972 197337 198969 192872 186294 182947 186298 191100 204092 201581
9085 201581 206060 216570 222169 231401 240155 242418 241708 233005 228729 231633 232328 234717 237250 243665 240253
9070 240253 235478 230676 231638 231541 215290 186093 173290 162345 153186 142078 141177 159690 172136 180773
9056 180773 193982 202489 219976 221647 216754 220522 229452 238447 253023 271506 280609 283510 298786
$$ packed form
9149E61056k9480l5324l6779k6504j6679j7221k2192j7388j9975k5139k5596k7092
9137B61687l953j8830j5023j3824n856m000j0985l873P813K915p468m065R257
9124A93795k011j4376j1240o258j7971q515k516q533l139j158n556j3437j5503
9111H3582n67J4342Q824J1704J6177J2309L0982M7186L4105K6443L2923Q314k2630
9098C03694k2968k1823j8832k5099j7635J632o097o578l347L351M802J2992k511
9085B01581M479J0510N599R232Q754K263p10q703m276K904O95K389K533O415l412
9070B40253m775m802R62r7j6251k9197j2803j0945r159j1108r01J8513J2446Q637
9056A80773J3209Q507J7487J671m893L768Q930Q995J4576J8483R103K901J5276
$$ plain form
9043 298786 324301 355789 382985 405862 452924 488792 484362 480386 472620 442228 412466 384554
9031 384554 361091 342728 319719 306513 294441 294589 295211 298475 306732 317316 339481 359810 366291
9018 366291 374347 384840 401002 410073 417946 420997 425931 434502 433156 433579 442610 444614 438983 433254
9004 433254 442522 450596 460237 469973 475767 478170 486229 480290 478140 480131 476434 482796 500435 517543
8990 517543 530164 556416 588721 618398 646760 660031 690370 712541 722615 753408 766217 776055
8978 776055 794747 818310 845312 868068 895317 924046 954301 982938 1014414 1051054 1074248 1102230
8966 1102230 1121627 1138369 1159845 1193132 1221793 1252567 1295279 1349132 1415061 1497975 1591533
8955 1591533 1699444 1815206 1936781 2039512 2137358 2248307 2365758 2476123 2602367 2758849
$$ packed form
9043B98786K5515L1488K7196K2877M7062L5868m430l976p766l0392k9762k7912
9031C84554k3463j8363k3009j3206j2072J48O22L264Q257J0584K2165K0329O481
9018C66291Q056J0493J6162R071P873L051M934Q571j346M23R031K004n631n729
9004D33254R268Q074R641R736N794K403Q059n939k150J991l697O362J7639J7108
8990E17543J2621K6252L2305K9677K8362J3271L0339K2171J0074L0793J2809R838
8978G76055J8692K3563K7002K2756K7249K8729L0255K8637L1476L6640K3194K7982
8966A102230J9397J6742K1476L3287K8661L0774M2712N3853O5929Q2914R3558
8955A591533J07911J15762J21575J02731R7846J10949J17451J10365J26244J56482
$$ plain form
8945 2758849 2936684 3144301 3401353 3717145 4080976 4479938 4903548 5350822 5834834 6344579
8935 6344579 6899684 7524568 8252381 9130672 10226556 11606353 13323458 15381075 17781561
8926 17781561 20444977 23350097 26672223 30640659 35643700 42403950 52171610 67039320
8918 67039320 90379087 126981111 179697216 237086439 271792809 274679935 257507707
8911 257507707 231223023 196273670 154113932 115410577 86643404 67117231 54009934
8904 54009934 44989896 38592664 33915279 30342443 27376088 24745650 22368279 20210137
8896 20210137 18233153 16428185 14843742 13478697 12311468 11278471 10372733 9595730
8888 9595730 8932737 8352792 7807882 7260767 6745543 6262308 5799889 5381229 4999675 4642417
$$ packed form
8945B758849J77835K07617K57052L15792L63831L98962M23610M47274M84012N09745
8935F344579N55105O24884P27813Q78291J095884J379797J717105K057617K400486
8926A7781561K663416K905120L322126L968436N003041O760250R767660J4867710
8918F7039320K3339767L6602024N2716105N7389223L4706370K887126j7172228
8911B57507707k6284684l4949353m2159738l8703355k8767173j9526173j3107297
8904E4009934r020038o397232m677385l572836k966355k630438k377371k158142
8896B0210137j976984j804968j584443j365045j167229j032997r05738p77003
8888I595730o62993n79945n44910n47115n15224m83235m62419m18660l81554l57258
$$ plain form
8878 4642417 4321590 4026253 3751194 3504267 3305134 3143101 2980245 2831147 2708911 2585018
8868 2585018 2476264 2366996 2261245 2153042 2046294 1943596 1844781 1764975 1684109 1601197
8858 1601197 1520427 1438232 1362736 1295922 1245894 1204913 1174334 1140238 1118029 1091983 1061869
8847 1061869 1031890 1009608 987644 956207 923348 906898 890165 877651 867435 859838 837160 810911
8835 810911 786986 757659 726763 702285 681597 648840 608457 578968 564310 545994 533461 517909
8823 517909 503553 480462 449923 442801 431840 410433 390250 366892 346918 337774 326483 315275
8811 315275 316592 319241 321120 329680 334323 336243 347815 358946 363122 373797 367527 359609 351066 350552
8797 350552 340246 318853 293971 264013 241541 223763 210847 195256 186095 178517 182160 187943
$$ packed form
8878D642417l20827k95337k75059k46927j99133j62033j62856j49098j22236j23893
8868B585018j08754j09268j05751j08203j06748j02698r8815p9806q0866q2912
8858A601197q0770q2195p5496o6814n0028m0981l0579l4096k2209k6046l0114
8847A061869k9979k2282k1964l1437l2859j6450j6733j2514j0216p597k2678k6249
8835H10911k3925k9327l0896k4478k0688l2757m0383k9489j4658j8316j2533j5552
8823E17909j4356k3091l0539p122j0961k1407k0183k3358j9974r144j1291j1208
8811C15275J317K649J879Q560M643J920J1572J1131M176J0675o270p918q543n14
8797C50552j0306k1393k4882k9958k2472j7778j2916j5591r161p578L643N783
$$ plain form
8785 187943 191195 204683 223674 241448 240269 235755 235176 232498 220931 210592 205597 196064 197524
8772 197524 207463 204199 200659 200716 220564 224262 222075 225739 227245 215876 200983 185286 163057 142951
8758 142951 128559 123602 115628 110533 95416 99484 101108 96516 94904 96934 95471 88990 95063 92268
8744 92268 86853 89635 97911 91607 77740 83176 91492 98364 99142 96907 81698 78681 69765 57640
8730 57640 49081 23468 -4663 -27854 -42819 -45780 -17727 19782 61407 108767 155154 181380
8718 181380 189080 193286 203277 210608 217239 218577 214984 221496 226101 241338 244096 243379 229494 210414
8704 210414 197580 176233 158455 148482 139290 144410 141133 135289 132942 142187 145626 140388 127562
8691 127562 116977 113783 111922 110605 110073 111563 99478 103197 107195 100865 116423 129071 126787 127278
$$ packed form
8785A87943L252J3488J8991J7774j179m514n79k678j1567j0339m995r533J460
8772A97524R939l264l540N7J9848L698k187L664J506j1369j4893j5697k2229k0106
8758A42951j4392m957p974n095j5117M068J624m592j612K030j463o481O073k795
8744I2268n415K782Q276o304j3867N436Q316O872P78k235j5209l017q916j2125
8730E7640q559k5613k8131k3191j4965k961K8053L7509M1625M7360M6387K6226
8718A81380P700M206R991P331O631J338l593O512M605J5237K758p17j3885j9080
8704B10414j2834k1347j7778r973r192N120l277n844k347R245L439n238j2826
8691A27562j0585l194j861j317n32J490j2085L719L998o330J5558J2648k284M91
$$ plain form
8677 127278 139930 149892 158726 163995 159682 155766 154055 152878 146813 150751 154914 141283 131415 130059
8663 130059 130997 136067 128881 132402 131339 121668 114482 108272 104528 107845 112882 105293 100972 101053 96254
8648 96254 80638 86524 81469 82686 87404 86586 84416 82544 98836 113843 112689 101909 87968 85775
8634 85775 91861 95236 98892 93519 88791 96208 98295 99518 96291 97655 100484 105040 114005 119654 128268
8619 128268 134645 131990 136175 141067 147423 149726 142537 140978 144207 134160 136110 144140 140082 129709
8605 129709 127144 117701 97535 90340 81326 73851 71508 82194 94305 98310 106447 113156 100148
8592 100148 89151 80256 69153 58328 53886 56786 56239 58816 56359 51692 53276 53823 58710 69890
8578 69890 73396 77944 80953 86352 91846 97739 99147 85150 88927 85014 82078 76255 75053 71590
$$ packed form
8677A27278J2652R962Q834N269m313l916j711j177o065L938M163j3631r868j356
8663A30059R38N070p186L521j063r671p186o210l744L317N037p589m321Q1m799
8648I6254j5616N886n055J217M718q18k170j872J6292J5007j154j0780j3941k193
8634H5775O086L375L656n373m728P417K087J223l227J364K829M556Q965N649Q614
8619A28268O377k655M185M892O356K303p189j559L229j0047J950Q030m058j0373
8605A29709k565r443k0166p195r014p475k343J0686J2111M005Q137O709j3008
8592A00148j0997q895j1103j0825m442K900n47K577k457m667J584N47M887J1180
8578F9890L506M548L009N399N494N893J408j3997L777l913k936n823j202l463
$$ plain form
8564 71590 63813 58318 68447 68333 73171 72755 69098 63607 64812 69879 72464 66538 68053 75311 69915
8549 69915 64878 48173 54751 64364 75097 75749 71060 67201 62787 68735 76264 83028 81448 76260
8535 76260 76528 76689 71997 74001 77830 86434 95563 108165 113601 118892 134896 145490 162480 179844
8521 179844 202145 248697 293884 346156 425447 516133 619004 711826 816006 910332 982901
8510 982901 1040248 1054950 1041552 985190 913626 827146 728823 627739 532977 457135 385535
8499 385535 325883 289960 243381 212536 193513 174828 168615 145094 130323 118630 110385 107947
8487 107947 108311 98120 98126 96904 93229 88294 85660 93810 85721 72475 64500 63253 65715 64681 76483
8472 76483 68987 57151 44092 35762 44622 46591 49923 48319 51555 50893 44404 46489 59680 59200
$$ packed form
8564G1590p777n495J0129j14M838m16l657n491J205N067K585n926J515P258n396
8549F9915n037j6705O578R613J0733O52m689l859m414N948P529O764j580n188
8535G6260K68J61m692K004L829Q604R129J2602N436N291J6004J0594J6990J7364
8521A79844K2301M6552M5187N2272P9291R0686J02871R2822J04180R4326P2569
8510I82901N7347J4702j3398n6362p1564q6480r8323j01084r4762p5842p1600
8499C85535n9652l5923m6579l0845j9023j8685o213k3521j4771j1693q245k438
8487A07947L64j0191Oj222l675m935k634Q150q089j3246p975j247K462j034J1802
8472G6483p496j1836j3059q330Q860J969L332j604L236o62o489K085J3191m80
$$ plain form
8458 59200 47977 38519 36479 34519 35195 32375 24414 23470 30806 39251 34278 27636 23754 22323 24042
8443 24042 24267 29535 32169 36143 42457 51662 55440 59716 57358 54131 52797 45410 49401 57946 56938
8428 56938 51665 40001 48561 56958 66670 67378 66029 69629 61139 62050 64327 51912 39480 44375
8414 44375 50066 54545 56550 52769 43788 39808 40417 40187 43515 52771 57927 44489 36213 31169 34933
8399 34933 31918 35646 40467 41352 37337 27980 26274 39290 47789 46423 41880 41289 34910 35593 29159
8384 29159 30184 42237 47049 45777 36058 16213 10326 8857 14723 24197 23951 30781 23316 21130
8370 21130 27771 33617 37483 28008 26273 29478 38453 43720 39626 37436 41389 29800 26033 28780
8356 28780 35330 40953 45738 41191 33957 26784 34343 39980 32342 37465 45657 48031 49540 46764 37228
$$ packed form
8458E9200j1223r458k040j960O76k820p961r44P336Q445m973o642l882j431J719
8443B4042K25N268K634L974O314R205L778M276k358l227j334p387L991Q545j008
8428E6938n273j1664Q560Q397R712P08j349L600q490R11K277j2415j2432M895
8414D4375N691M479K005l781q981l980O09k30L328R256N156j3438q276n044L764
8399C4933l015L728M821Q85m015r357j706J3016Q499j366m543n91o379O83o434
8384B9159J025J2053M812j272r719j9845n887j469N866R474k46O830p465k186
8370B1130O641N846L866r475j735L205Q975N267m094k190L953j1589l767K747
8356B8780O550N623M785m547p234p173P559N637p638N123Q192K374J509k776r536
$$ plain form
8341 37228 39070 43221 45842 46185 48956 48728 52351 62275 71166 80704 88882 92516 78517 71301 65802
8326 65802 52645 49716 47795 44785 40307 38748 35501 30072 33700 38178 38746 32369 30427 35325 31077
8311 31077 22786 18916 31203 45924 40638 27922 12750 20717 25166 9957 15871 14826 14133 16064
8297 16064 24574 29467 31121 30613 36791 41294 46182 51849 40430 50973 52896 49562 37598 25849
8283 25849 15645 12573 15931 10235 12222 18171 21719 28783 33492 34327 26387 29502 22615 26151 27963
8268 27963 24444 18856 19774 18098 23312 22226 21242 23134 19829 20134 16518 7412 12359 10576 8570
8253 8570 7532 5678 4106 7806 12421 24558 30223 34755 32931 30395 23061 19080 16389 11256 9311
8238 9311 7461 3605 9769 16998 21671 18844 8854 4962 5031 9192 9002 -291 -1775 -762 5562 16893
$$ packed form
8341C7228J842M151K621L43K771k28L623R924Q891R538Q178L634j3999p216n499
8326F5802j3157k929j921l010m478j559l247n429L628M478N68o377j942M898m248
8311C1077q291l870J2287J4721n286j2716j5172P967M449j5209N914j045o93J931
8297A6064Q510M893J654n08O178M503M888N667j1419J0543J923l334j1964j1749
8283B5849j0204l072L358n696J987N949L548P064M709Q35p940L115o887L536J812
8268B7963l519n588R18j676N214j086r84J892l305L05l616r106M947j783k006
8253H570j038j854j572L700M615J2137N665M532j824k536p334l981k691n133j945
8238I311j850l856O164P229M673k827r990l892O9M161j90r293j484J013O324J1331
$$ plain form
8222 16893 18416 17581 13008 4581 3409 -5351 -1379 14294 18011 19892 11953 15088 25027 23601 26640
8207 26640 22930 22124 21660 18791 8135 -1897 -7319 2217 7116 4315 4349 9289 16844 13117 15383
8192 15383 12639 4253 7646 2011 316 682 -5055 -3579 -1740 3603 4446 12949 17290 15864 23697
8177 23697 19683 5542 -643 -848 -993 4555 13569 16830 4910 840 -580 5775 9410 9481 4264
8162 4264 5970 9414 13423 13472 12978 20339 22609 17618 11921 15493 15256 11352 8700 11278 9941 19420
8146 19420 17844 11903 8414 15230 20708 17113 14015 7107 2889 -1096 -547 2745 12421 17128 15249
8131 15249 13077 15989 12151 2356 260 -156 3524 -1314 5900 12453 11358 2978 -705 4724 9024
8116 9024 6491 13616 14357 7122 17348 24486 28321 27429 20092 17451 18167 14326 14654 19630 18669 22586
$$ packed form
8222A6893J523q35m573q427j172q760L972J5673L717J881p939L135R939j426L039
8207B6640l710q06m64k869j0656j0032n422R536M899k801L4M940P555l727K266
8192A5383k744q386L393n635j695L66n737J476J839N343Q43Q503M341j426P833
8177B3697m014j4141o185k05j45N548R014L261j1920m070j420O355L635P1n217
8162D264J706L444M009M9m94P361K270m991n697L572k37l904k652K578j337R479
8146A9420j576n941l489O816N478l595l098o908m218l985N49L292R676M707j879
8131A5249k172K912l838r795k096m16L680m838P214O553j095q380l683N429M300
8116I024k533P125P41p235J0226P138L835q92p337k641P16l841L28M976r61L917
$$ plain form
8100 22586 20775 11350 22248 24744 16413 14473 14622 21042 19246 13171 10784 11441 6931 11620 14696
8085 14696 21650 14162 11845 13354 19818 27939 35676 30086 33424 38506 23138 23642 28354 31216 30799
8070 30799 33918 34280 31265 30191 24464 21622 31208 35137 39763 39699 32369 27338 28659 26843 24492
8055 24492 31354 26231 21723 31426 35016 30937 21531 20739 22418 24397 27225 22848 26066 27695 27305
8040 27305 28747 24861 19668 20605 19064 25231 30466 32912 26207 26874 24110 18978 16706 15033 21754
8025 21754 14467 15989 23268 27468 18704 14522 20387 21609 27047 27760 26254 29659 33442 32187 19759
8010 19759 13280 14598 26067 34164 32409 25754 22223 31894 40411 33153 26462 20831 17279 21967
7996 21967 23755 22519 23075 25151 16236 6410 8169 16505 20621 21770 17212 21391 19391 17931 14538
$$ packed form
8100B2586j811r425J0898K496q331j940J49O420j796o075k387O57m510M689L076
8085A4696O954p488k317J509O464Q121P737n590L338N082j5368N04M712K862m17
8070C0799L119L62l015j074n727k842R586L929M626o4p330n031J321j816k351
8055B4492O862n123m508R703L590m079r406p92J679J979K828m377L218J629l90
8040B7305J442l886n193R37j541O167N235K446o705O67k764n132k272j673O721
8025B1754p287J522P279M200q764m182N865J222N438P13j506L405L783j255j2428
8010A9759o479J318J1469Q097j755o655l531R671Q517p258o691n631l552M688
7996B1967J788j236N56K076q915r826J759Q336M116J149m558M179k000j460l393
$$ plain form
7981 14538 24068 15540 5580 -1457 13658 15599 14156 18537 6230 3123 5123 15397 22648 20284
7967 20284 5978 6375 3456 -1676 171 -186 7468 16643 25162 18114 12900 10714 5766 19679 33554
7952 33554 34441 35030 28148 24569 20509 19291 12838 6674 844 2661 10004 18376 17665 9608 11092
7937 11092 13077 16110 17176 23469 32694 21909 13972 16021 18164 24468 37662 42552 34993 27239
7923 27239 29732 35296 25157 15048 8576 8001 13956 16568 20145 24945 29441 28763 16710 13324
7909 13324 18520 10672 6794 6143 9543 5170 106 5935 8745 10385 14573 16144 15337 10682 4839
7894 4839 9513 15516 25206 29408 21624 18600 15133 19596 21325 18467 16762 13201 1832 -6908 -10903
7879 -10903 -4561 -3288 -2261 1530 7436 6389 4844 3910 14005 22755 25070 27646 18300 10615 11586
$$ packed form
7981A4538R530q528r960p037J5115J941j443M381j2307l107K000J0274P251k364
7967B0284j4306L97k919n132J847l57P654R175Q519p048n214k186m948J3913J3875
7952C3554Q87N89o882l579m060j218o453o164n830J817P343Q372p11q057J484
7937A1092J985L033J066O293R225j0785p937K049K143O304J3194M890p559p754
7923B7239K493N564j0139j0109o472n75N955K612L577M800M496o78j2053l386
7909A3324N196p848l878o51L400m373n064N829K810J640M188J571q07m655n843
7894D839M674O003R690M202p784l024l467M463J729k858j705l561j1369q740l995
7879a0903O342J273J027L791N906j047j545r34J0095Q750K315K576r346p685R71
$$ plain form
7864 11586 10711 19713 24781 17234 14740 6318 3018 10020 10728 11118 9081 4709 6222 9879 4754
7849 4754 1668 1490 -9809 -12127 3256 3351 -1099 -5367 -11520 -19578 -10190 -4851 -8263 -10947 -12829
7834 -12829 -12185 -1627 4879 15747 16760 10827 1148 301 -6732 -4259 4922 15161 14709 7117 6149
7819 6149 9213 8895 8737 1026 6404 6238 5144 6550 -2833 -6698 2043 1388 823 -1383 1231 11583
7803 11583 12917 3187 -3168 3081 5803 -2968 115 -7339 -10279 656 1826 10542 11331 4078 2124
7788 2124 12199 17808 9977 5139 10500 9091 3402 3780 8895 17839 27534 26932 29437 20527 8948
7773 8948 950 1768 3898 12175 17420 19189 7480 3910 -1520 -4922 -5844 -4571 3488 3710 -9558
7758 -9558 -5031 1415 5061 -7296 -5518 -691 649 4316 1473 2243 2105 2766 7593 15477 14707 10444
$$ packed form
7864A1586q75R002N068p547k494q422l300P002P08L90k037m372J513L657n125
7849D754l086j78j1299k318J5383R5m450m268o153q058R388N339l412k684j882
7834a2829O44J0558O506J0868J013n933r679q47p033K473R181J0239m52p592r68
7819F149L064l18j58p711N378j66j094J406r383l865Q741o55n65k206K614J0352
7803A1583J334r730o355O249K722q771L083p454k940J0935J170Q716P89p253j954
7788B124J0075N609p831m838N361j409n689L78N115Q944R695o02K505q910j1579
7773H948p998Q18K130Q277N245J769j1709l570n430l402r22J273Q059K22j3268
7758i558M527O446L646j2357J778M827J340L667k843P70j38O61M827P884p70m263
$$ plain form
7742 10444 4852 2309 4322 6788 338 -4109 -643 -1442 9780 3200 -6579 -9649 -10895 -10402 -8424
7727 -8424 -6088 5787 10240 3968 3688 -1545 -1784 2848 7381 478 -11835 -11861 464 1232 5143
7712 5143 11983 12264 -28 -11086 -6938 -11 -1571 485 -5976 -7136 -12403 -15354 -5140 4354
7698 4354 3874 4885 5104 3345 927 2878 2035 7068 10945 12330 7904 14800 15979 22723 25005 4563
7682 4563 632 -2973 -9508 -3124 -1583 -4173 -4994 -894 8001 5086 -11335 -11751 -8726 -8208 -11783
7667 -11783 -9914 -7469 -770 8078 13567 10175 5443 3384 -4830 -6640 -4455 1674 9209 11220 14467
7652 14467 14079 11312 3613 4920 172 2877 4725 3907 2837 -642 -3266 5344 10673 8738 6863
7637 6863 4426 4497 8090 -197 7207 11073 4284 381 -1878 4338 6758 8838 11364 9461 9288 9350
$$ packed form
7742A0444n592k543K013K466o450m447L466p99J1222o580r779l070j246M93J978
7727h424K336J1875M453o272k80n233k39M632M533o903j2313k6J2325P68L911
7712E143O840K81j2292j1058M148O927j560K056o461j160n267k951J0214R494
7698D354m80J011K19j759k418J951q43N033L877J385m426O896J179O744K282k0442
7682D563l931l605o535O384J541k590q21M100Q895k915j6421m16L025N18l575
7667a1783J869K445O699Q848N489l392m732k059q214j810K185O129P535K011L247
7652A4467l88k767p699J307m748K705J848q18j070l479k624Q610N329j935j875
7637F863k437P1L593q287P404L866o789l903k259O216K420K080K526j903j73O2
$$ plain form
7621 9350 752 -5106 9826 15363 6153 2745 -112 -1931 -2751 250 4856 7001 11323 11382 7650
7606 7650 -6334 -1196 -5243 -4307 -825 4303 -1271 -2811 -8358 -10193 3376 21288 19200 14305
7592 14305 5997 -2146 -3461 -7480 -10332 -19276 -24178 -16364 -9418 -233 4677 -2765 -738 -536 554
7577 554 8663 11943 10261 11991 9244 4728 5329 838 -7184 -3761 -4262 -2900 7694 10779 2732
7562 2732 9254 14478 15044 9664 3972 3222 -7465 -12308 -13759 -13585 -6775 -3093 -4721 -2610 -1693 -5000
7546 -5000 -3757 -3047 -409 -1646 -6786 -760 4837 5942 6449 -843 -4738 2065 4054 2461 -11417
7531 -11417 -25085 -22147 -11958 -5907 70 -2236 -4369 -6178 -8929 -9703 -3714 -170 11846 22926
7517 22926 26129 20773 14827 9901 -4224 -18727 -18337 -18122 -15318 -14297 -14881 -4855 -765 7852 13156
$$ packed form
7621I350q598n858J4932N537r210l408k857j819q20L001M606K145M322N9l732
7606G650j3984N138m047R36L482N128n574j540n547j835J3569J7912k088m895
7592A4305q308q143j315m019k852q944m902P814O946R185M910p442K027K02J090
7577E54Q109L280j682J730k747m516O01m491q022L423n01J362J0594L085q047
7562B732O522N224N66n380n692p50j0687m843j451J74O810L682j628K111R17l307
7546e000J243P10K638j237n140O026N597J105N07p292l895O803J989j593j3878
7531a1417j3668K938J0189O051N977k306k133j809k751p74N989L544J2016J1080
7517B2926L203n356n946m926j4125j4503L90K15K804J021n84J0026M090Q617N304
$$ plain form
7502 13156 12294 12212 6709 -6162 -12131 -10836 -7575 -5494 -644 -2445 -7936 -6911 -10343 -14998 -17559
7487 -17559 -3943 6312 8389 5724 -2194 921 10806 12268 -2266 -7190 -5155 2275 9362 5598
7473 5598 -2444 -6095 -5199 -9460 -7823 -11905 -14976 -15959 -7285 2025 -1794 -3642 -11280 -16448 -6251
7458 -6251 4890 10797 10878 11014 14328 15676 1895 1898 6145 4540 -4608 -20602 -18758 -9463 -3751 4616
7442 4616 430 -3979 -4732 -6556 -3669 3635 -2926 -4575 217 -4054 -2039 1099 2876 781 -1574
7427 -1574 2192 7565 1911 891 -9707 -10432 -720 2636 3206 -12409 -8257 2817 1764 14407
7413 14407 22671 11681 350 -11863 -14189 21 6960 -8584 -17788 -9401 -12107 -16035 -8305
7400 -8305 -3276 4903 7187 -7156 -14169 -5021 -3137 -7292 -8029 -13743 -18671 -18611 -6916 1433 -1699
$$ packed form
7502A3156q62q2n503j2871n969J295L261K081M850j801n491J025l432m655k561
7487a7559J3616J0255K077k665p918L115R885J462j4534m924K035P430P087l764
7473E598q042l651Q96m261J637m082l071r83Q674R310l819j848p638n168J0197
7458f251J1141N907Q1J36L314J348j3781LM247j605r148j5994J844R295N712Q367
7442D616m186m409p53j824K887P304o561j649M792m271K015L138J777k095k355
7427a574L766N373n654j020j0598p25R712L356N70j5615M152J1074j053J2643
7413A4407Q264j0990j1331j2213k326J4210O939j5544r204Q387k706l928P730
7400h305N029Q179K284j4343p013R148J884m155p37n714m928O0J1695Q349l132
$$ plain form
7385 -1699 -6439 -10278 -6673 -6155 2634 4964 12084 23630 22171 17417 17619 12038 9574 8016 8068 153
7369 153 -6977 4885 12234 10180 7541 6082 -5195 3669 11127 8079 1760 -9311 -14822 -13589
7355 -13589 -10502 -7320 -3988 -6667 6398 14420 18401 17007 18143 2158 3086 3344 -4428 -4198 544
7340 544 2522 885 4930 11133 23089 24456 10783 -10042 -12513 -4353 -4345 -3425 500 440 -6033 -11322
7324 -11322 -3033 21712 29541 27047 32125 39813 33536 13086 708 -5704 -9494 -8355 51 -385
7310 -385 343 -3469 -2355 -3872 948 -1685 -10408 -10225 -14167 -22113 -10545 -1532 -7035 -11399 -10266
7295 -10266 828 8887 8804 6294 15923 11879 7913 -393 -5325 -9213 -12101 -17346 -11700 -5564 5329
7280 5329 1223 -2514 -5407 -8806 -13843 -10099 2990 6173 -7758 -11493 -10170 -11660 -4093 -2929
$$ packed form
7385a699m740l839L605N18Q789K330P120J1546j459m754K02n581k464j558N2p915
7369A53p130J1862P349k054k639j459j1277Q864P458l048o319j1071n511J233
7355a3589L087L182L332k679J3065Q022L981j394J136j5985R28K58p772K30M742
7340E44J978j637M045O203J1956J367j3673k0825k471Q160QR20L925o0o473n289
7324a1322Q289K4745P829k494N078P688o277k0450j2378o412l790J139Q406m36
7310c85P28l812J114j517M820k633q723J83l942p946J1568R013n503m364J133
7295a0266J1094Q059q3k510R629m044l966q306m932l888k888n245N646O136J0893
7280E329m106l737k893l399n037L744J3089L183j3931l735J323j490P567J164
$$ plain form
7266 -2929 -9849 -14820 -3163 -1855 -12090 -3618 -6034 -18838 -15488 -6384 -1056 3544 3253 -1567
7252 -1567 -2 -192 -8346 -7129 -8785 -6170 -382 2353 6957 8394 9034 5991 -1096 5790 9494
7237 9494 13514 16637 9901 6899 6657 8705 4464 2774 7173 4086 1762 5627 5301 3797 3534 6950
7221 6950 4259 -3575 163 -7039 -4428 7960 14758 14029 11763 993 636 2630 -598 -5122 -1976
7206 -1976 3381 2467 4018 -4239 -389 -4305 -6365 -3114 -6805 -2333 -9564 -16108 -16026 -8871 -930 3122
7190 3122 3091 7853 14542 6227 323 -2270 1604 -81 -8433 -10451 -5708 7461 3537 -9714 -9018
7175 -9018 3718 3756 357 1668 -3618 -6865 2682 9084 -6194 -7633 -2293 -1859 -10538 -8278 12350
7160 12350 16319 6945 5612 6682 7621 4564 8405 -2216 -8517 -8517 -1528 1505 -2317 -3330 -6259
$$ packed form
7266b929o920m971J1657J308j0235Q472k416j2804L350R104N328M600k91m820
7252a567J565j90q154J217j656K615N788K735M604J437O40l043p087O886L704
7237I494M020L123o736l002k42K048m241j690M399l087k324L865l26j504k63L416
7221F950k691p834L738p202K611J2388O798p29k266j0770l57J994l228m524L146
7206a976N357r14J551q257L850l916k060L251l691M472p231o544Q2P155P941M052
7190C122l1M762O689q315n904k593L874j685q352k018M743J3169l924j3251O96
7175i018J2736L8l399J311n286l247R547O402j5278j439N340M34q679K260K0628
7160A2350L969r374j333J070R39l057L841j0621o301%O989L033l822j013k929
$$ plain form
7145 -6259 -8216 -4349 2242 3924 6268 633 -6063 -10743 -3967 -5202 -5753 -4658 -1517 1693 -1165
7130 -1165 -13995 -20941 -24479 -24653 -11249 -1623 0 -6285 -8088 -5058 -5278 -2652 -3158 -8162 -19046
7115 -19046 -25361 -12695 -7504 -3354 1123 -460 5544 -4767 -17339 -15548 -4159 -6132 -10557 -16866
7101 -16866 -17797 -15626 -13581 -21182 -14171 -9257 2601 15336 13673 3228 -6274 1491 5151 8028
7087 8028 4634 -5493 -9764 -10782 -2138 -6408 -12157 -16414 -13904 -12177 -11566 -3437 -3113 19 -5966
7072 -5966 -11221 -2728 5369 8178 9057 9554 5824 3574 9383 10008 12973 12005 -2643 -10405 -10071 -11589
7056 -11589 -9868 -567 3496 142 4547 4352 -1189 -10777 -8384 -5401 -5031 -6201 990 3186 -1194
7041 -1194 -11824 -8469 -2815 3786 6724 -5005 -14488 -10689 -3359 2360 -2440 121 -30 4663 -984
$$ packed form
7145f259j957L867O591J682K344n635o696m680O776j235n51J095L141L210k858
7130a165j2830o946l538j74J3404R626J623o285j803L030k20K626n06n004j0884
7115a9046o315J2666N191M150M477j583O004j0311j2572J791J1389j973m425o309
7101a6866r31K171K045p601P011M914J1858J2735j663j0445r502P765L660K877
7087H028l394j0127m271j018Q644m270n749m257K510J727O11Q129L24L132n985
7072e966n255Q493Q097K809Q79M97l730k250N809O25K965r68j4648p762L34j518
7056a1589J721R301M063l354M405j95n541r588K393K983L70j170P191K196m380
7041a194j0630L355N654O601K938j1729r483L799P330N719m800K561j51M693n647
$$ plain form
7026 -984 -4849 3925 7376 1189 -4181 -5859 -14050 -6210 6326 5705 5714 5488 -1256 -1225 -395 -11603 -7542
7009 -7542 9055 8484 -542 -6656 566 7066 12550 9605 11978 15893 11995 -1740 -5632 -3766 -7657
6994 -7657 -6815 -5108 -1791 266 -3782 -9296 -13279 -12488 -2363 3299 8881 12478 13694 18760 27129
6979 27129 20112 4565 -1644 411 -3964 4051 8263 -1674 1627 4933 7775 7464 5460 18 -11680
6964 -11680 -10438 -9329 -3318 2575 -1897 -6498 -8806 -16812 -14850 -4856 -2328 -5435 -6852 -3196 2756
6949 2756 -4199 -10081 -12875 -7164 -4415 -4615 -10449 -3917 1621 -2969 -14463 -18203 -21906 -26411 -19768
6934 -19768 -5926 -150 441 221 165 -8993 -2757 1734 -5616 -2429 342 1242 2504 6868 1830 322
6918 322 5857 10248 12639 10291 8890 1649 377 -732 9362 14815 9545 364 -14934 -17810 -11798
$$ packed form
7026i84l865Q774L451o187n370j678q191P840J2536o21Rk26o744L1Q30j1208M061
7009g542J6597n71r026o114P222O500N484k945K373L915l898j3735l892J866l891
6994g657Q42J707L317K057m048n514l983P91J0125N662N582L597J216N066Q369
6979B7129p017j5547o209K055m375Q015M212r937L301L306K842l11k004n442j1698
6964a1680J242J109O011N893m472m601k308q006J962R994K528l107j417L656N952
6949B756o955n882k794N711K749k00n834O532N538m590j1494l740l703m505O643
6934a9768J3842N776N91k20n6r158O236M491p350L187K771R00J262M364n038j508
6918C22N535M391K391k348j401p241j272j109J0094N453n270r181j5298k876O012
$$ plain form
6903 -11798 -17592 -12095 2142 -7432 -10274 -11249 -15157 -10869 -9585 -10610 -14458 -11899 -129 10421
6889 10421 10846 9940 13389 9210 -3306 -4465 -3589 -5658 -4002 -15086 -11132 -4665 -3924 -12311 -8395
6874 -8395 -14009 -17596 -21931 -16114 -9196 -8 9915 13602 7061 13911 18839 18511 6984 750 1899
6859 1899 11467 18111 7718 1847 2170 7648 6732 5205 9279 -4962 -10486 -19683 -17194 -9579 4108
6844 4108 4333 4689 7881 13423 15917 20919 17293 5940 -6444 -8427 -3620 -5265 -8091 -4727 -3836
6829 -3836 -6599 -4304 146 -392 1911 -1412 -2148 -2205 2879 -4181 -13728 -14399 -4345 770 1031 969 6682
6812 6682 4572 2291 -11053 -17927 -23667 -13021 2609 3684 2290 1242 -3055 7003 7640 720
6798 720 -10157 -3730 -283 4232 -8411 -6329 -8219 -4008 -2957 -7073 2850 5104 490 2240 -6712
$$ packed form
6903a1798n794N497J4237r574k842r75l908M288J284j025l848K559J1770J0550
6889A0421M25r06L449m179j2516j159Q76k069J656j1084L954O467P41q387L916
6874h395n614l587m335N817O918R188R923L687o541O850M928l28j1527o234J149
6859A899R568O644j0393n871L23N478r16j527M074j4241n524r197K489P615J3687
6844D108K25L56L192N542K494N002l626j1353j2384j983M807j645k826L364Q91
6829c836k763K295M450n38K303l323p36n7N084p060r547o71J0054N115K61o2N713
6812F682k110k281j3344o874n740J0646J5630J075j394j048m297J0058O37o920
6798G20j0877O427L447M515j2643K082j890M211J051m116R923K254m614J750q952
$$ plain form
6783 -6712 -11236 -4587 6983 4794 1032 -345 -6405 -10035 -8945 -5364 -7063 -3408 -1222 -4813 1878
6768 1878 2132 199 -13363 -13041 -2144 4072 7370 1375 -17092 -15633 -713 -2744 7662 6793
6754 6793 8742 15648 8644 4964 1109 -210 9917 7747 3512 1950 6616 2282 5810 5452 1752
6739 1752 375 -6083 -11500 -10695 -16621 -17737 -5956 15051 20001 9327 11179 15300 12897 8978
6725 8978 3491 -1815 -4235 -9642 -418 12785 14559 12593 14866 18274 19846 9086 3662 -1461
6711 -1461 2558 -6403 832 14312 15033 8218 24556 35594 33908 34460 41306 49184 54678 55617 54768
6696 54768 42741 33113 24855 19682 7891 3079 6397 3354 -9366 -5801 -254 -717 4261 4243 3553
6681 3553 9077 5371 705 5324 17899 22104 6631 3535 -79 -550 -5985 -13264 -12876 -8904 -6559
$$ packed form
6783f712m524O649J1570k189l762j377o060l630J090L581j699L655K186l591O691
6768A878K54j933j3562L22J0897O216L298n995j8467J459J4920k031J0406q69
6754F793J949O906p004l680l855j319J0127k170m235j562M666m334L528l58l700
6739A752j377o458n417Q05n926j116J1781K1007M950j0674J852M121k403l919
6725H978n487n306k420n407R224J3203J774j966K273L408J572j0760n424n123
6711a461M019q961P235J3480P21o815J6338J1038j686N52O846P878N494R39q49
6696E4768j2027r628q258n173j1791m812L318l043j2720L565N547m63M978j8o90
6681C553N524l706m666M619J2575M205j5473l096l614m71n435p279L88L972K345
$$ plain form
6666 -6559 -2972 -4689 -952 -486 -7133 -8800 -7067 -6293 -4796 -7281 -10871 -14468 -15513 -21811 -25439
6651 -25439 -23663 -12441 -8876 -3245 232 -5317 -4885 -7168 -13236 -7786 -10591 -10950 -9389 -9179 -7586
6636 -7586 -1790 8798 15916 6725 -1473 2197 6227 3629 4237 5955 6715 6670 -3471 -4030 -1411 2413
6620 2413 16447 18379 2614 -7093 3132 8701 7231 3277 5314 -772 5717 6632 -1291 -4263
6606 -4263 -1988 3124 1236 -7252 -8118 -10518 -10837 -22006 -28712 -20574 -15702 -12092 -6776 -150 3101
6591 3101 7743 7806 2059 -254 4282 7788 -5926 -20364 -11413 -11864 -18026 -23335 -20636 -14005 -11447
6576 -11447 -9701 -11660 -7490 -4353 2442 2139 7406 12937 7804 -515 -10083 -19807 -11993 2605 6751
6561 6751 1254 4726 4865 -6074 -12084 -10579 -11515 -8743 -6991 -9471 -7822 -15473 -21062 -17467 -15468
$$ packed form
6666f559L587j717L737M66o647j667J733P74J497k485l590l597j045o298l628
6651b5439J776J1222L565N631L477n549M32k283o068N450k805l59J561K10J593
6636g586N796J0588P118r191q198L670M030k598O08J718P60m5j0141n59K619L824
6620B413J4034J932j5765r707J0225N569j470l954K037o086O489R15p923k972
6606d263K275N112j888q488q66k400l19j1169o706Q138M872L610N316O626L251
6591C101M642O3n747k313M536L506j3714j4438Q951m51o162n309K699O631K558
6576a1447J746j959M170L137O795l03N267N531n133q319r568r724P814J4598M146
6561F751n497L472J39j0939o010J505r36K772J752k480J649p651n589L595J999
$$ plain form
6546 -15468 -12329 -11552 488 3127 3327 -3649 -6093 85 10235 12370 12501 16314 8128 -3088 1434
6531 1434 2947 2628 3765 3793 -4804 -7975 1072 570 1153 -2076 -5442 -11010 -17585 -16915 -23621 -29684
6515 -29684 -30831 -29032 -21735 -16833 -14685 -11875 -15507 -13772 -14448 -16916 -18534 -13295 -9623 -9885 -8689
6500 -8689 -9525 -11596 -6674 -807 -91 4183 619 -1272 -3528 -4608 -432 954 -2851 -6135 -11174
6485 -11174 -11830 -17060 -13788 -5465 1960 8676 15411 7715 2927 5644 -1465 -8000 -6742 -8337 -4225
6470 -4225 -3494 -8798 -715 12092 2591 -13721 -6709 -7156 -5896 -8687 -3858 -6545 -2312 552 2065
6455 2065 -7043 -6179 -12714 -13424 -5215 452 1184 -2198 -1999 -3877 -4748 -504 878 846 -191 -7952 -2811
6438 -2811 -2612 -2329 6937 303 2397 -5132 -10163 -511 3005 -4510 -339 1514 -8302 -8358 -8450 -3755
$$ packed form
6546a5468L139P77J2040K639K00o976k444O178J0150K135J31L813q186j1216M522
6531A434J513l19J137K8q597l171R047n02N83l229l366n568o575O70o706o063
6515b9684j147J799P297M902K148K810l632J735o76k468j618N239L672k62J196
6500h689q36k071M922N867P16M274l564j891k256j080M176J386l805l284n039
6485a1174o56n230L272Q323P425O716O735p696m788K717p109o535J258j595M112
6470d225P31n304Q083J2807r501j6312P012m47J260k791M829k687M233K864J513
6455B065r108Q64o535p10Q209N667P32l382J99j878q71M244J382l2j037p761N141
6438b811J99K83R266o634K094p529n031R652L516p515M171J853r816n6r2M695
$$ plain form
6422 -3755 1169 -2857 -11809 -12415 -17725 -18221 -12123 -14576 -10008 1162 10284 6382 213 5729 8817
6407 8817 4953 -6923 -2591 11639 18709 14158 9766 5853 8889 2713 -8069 -2966 -3871 -12034
6393 -12034 -13520 -14231 -15911 -15578 -12366 -13998 -11797 -9979 -6658 -6777 -11444 -12748 -7106 2903 -1021
6378 -1021 -13306 -13085 -11132 -3940 -436 -7787 -9214 -2463 -1430 -14161 -23852 -9216 17376 14955
6364 14955 4567 4560 -1144 -4007 -349 -782 -7039 684 1664 2120 92 -1665 1010 7089 9333 4981
6348 4981 -3967 -11516 -5800 -3837 -1281 -9797 -12388 -16409 -4285 11266 2520 -3303 -7065 694
6334 694 5474 -8290 -16714 -5143 -956 -1441 -6522 -16051 -18217 -11749 -5243 -2323 3833 -6382 -328
6319 -328 8190 7610 9704 7553 3371 -1110 3823 6297 4632 7346 -605 -4337 835 -438 -1832
$$ packed form
6422c755M924m026q952o06n310m96O098k453M568J1170R122l902o169N516L088
6407H817l864j1876M332J4230P070m551m392l913L036o176j0782N103r05q163
6393a2034j486p11j680L33L212j632K201J818L321j19m667j304N642J0009l924
6378a021j2285K21J953P192L504p351j427O751J033j2731r691J4636K6592k421
6364A4955j0388pn704k863L658m33o257P723R80M56k028j757K675O079K244m352
6348D981q948p549N716J963K556q516k591m021J2124J5551q746n823l762P759
6334F94M780j3764q424J1571M187m85n081r529k166O468O506K920O156j0215O054
6319c28Q518n80K094k151m182m481M933K474j665K714p951l732N172j273j394
$$ plain form
6304 -1832 11920 13028 4338 2333 -10592 -10910 -12113 -13950 -11273 -9218 -9920 -6124 1241 6851 -108
6289 -108 -3383 -6911 -4163 7907 5881 -19 979 -5901 -7479 -11861 -7508 7605 14174 17327 14055
6274 14055 9380 319 5840 8926 6551 -5818 -15926 -24909 -34215 -31386 -28748 -13400 442 646
6260 646 -12347 -17095 -12910 -13086 -10984 -10497 4261 14121 7229 -456 1410 340 457 2593 -1866
6245 -1866 -3934 6793 14628 18135 18072 18488 16384 4964 32 -4092 -4886 -4278 -2393 -1703 -5480 -4188
6229 -4188 -906 -4900 -5410 1053 8087 9281 1197 597 10068 10787 15325 16498 870 -2853 -2578 -8279
6213 -8279 -8836 -6564 -8496 -10501 -12374 -13348 -8487 -14467 -11907 -11272 -14085 -17144 -20341 -22700 -14267 -2769
6197 -2769 -6823 -3891 1450 8024 12813 7186 6034 7686 10180 11351 2090 -1819 -1303 1360 534
$$ packed form
6304a832J3752J108q690k005j2925l18j203j837K677K055p02L796P365N610o959
6289a08l275l528K748J2070k026n900R98o880j578m382M353J5113O569L153l272
6274A4055m675r061N521L086k375j2369j0108q983r306K829K638J5348J3842K04
6260F46j2993m748M185j76K102M87J4758R860o892p685J866j070J17K136m459
6245a866k068J0727P835L507o3M16k104j1420m932m124p94O08J885O90l777J292
6229d188L282l994n10O463P034J194q084o00R471P19M538J173j5628l723K75n701
6213h279n57K272j932k005j873r74M861n980K560O35k813l059l197k359Q433J1498
6197b769m054K932N341O574M789n627j152J652K494J171r261l909N16K663q26
$$ plain form
6182 534 -9053 -8928 -9615 -14989 -19183 -13558 -3266 -393 -5504 -10954 -14920 -11460 -5189 -8252 -17732
6167 -17732 -21625 -20686 -23830 -15635 -2779 -5159 -2237 -8371 -8361 -1001 -547 -1515 -2484 -3404 5302 7042
6151 7042 1357 34 1055 -4373 -6846 -12154 -20370 -21616 -12474 -6810 -1930 -10366 -11909 -2255 2722
6136 2722 13459 8713 14464 23313 22960 11854 -3910 -7797 -6218 -6308 -4440 7474 15037 13804 17405
6121 17405 17813 12923 17784 7768 1744 4080 4255 -1265 -2198 -851 -1008 -2648 -10599 -12393 -3089
6106 -3089 -2234 -7960 -10198 -4468 2493 -787 -3772 -5501 -11708 -7858 -7694 -7319 481 -3501 2182 12738
6090 12738 4536 3102 10900 17939 19220 10717 14707 20687 9932 -3631 -14896 -16325 -7224 -3861
6076 -3861 2595 8443 986 -5192 4912 17830 12324 10885 11732 13886 11838 3931 -1831 -1693 -5252
$$ packed form
6182E34r587J25o87n374m194N625J0292K873n111n450l966L460O271l063r480
6167a7732l893R39l144Q195J2856k380K922o134J0P360M54r68r69r20Q706J740
6151G042n685j323J021n428k473n308q216j246R142N664M880q436j543R654M977
6136B722J0737m746N751Q849l53j1106j5764l887J579r0J868J1914P563j233L601
6121A7405M08m890M861j0016o024K336J75n520r33J347j57j640p951j794R304
6106c089Q55n726k238N730O961l280k985j729o207L850J64L75P800l982N683J0556
6090A2738q202j434P798P039J281q503L990N980j0755j3563j1265j429R101L363
6076c861O456N848p457o178J0104J2918n506j439Q47K154k048p907n762J38l559
$$ plain form
6061 -5252 -10963 -13041 -4472 -8317 -11831 -8827 -12197 -15175 -6976 -4617 -5302 -614 -8136 -1006 10933
6046 10933 6787 -5505 -11509 -9280 7870 15100 11721 3397 7490 16229 21882 17401 14376 14043
6032 14043 12942 6443 -3966 -1265 -1629 -2729 -3417 -3175 -7198 -3497 -4153 -496 -3464 -11636 -13261
6017 -13261 -17255 -14820 -5140 -3664 -1140 3813 4352 636 1620 -3764 -4010 -3922 1654 13915 11071 7
6001 7 -3301 4040 5497 6205 -3553 -12410 -7502 -13405 -8359 1655 3329 3318 -7961 -8955 -1382 403
5985 403 3691 114 -9033 -14015 -2154 8746 3194 3689 9333 15495 4292 4518 10535 8000 3807
5970 3807 3380 2658 -2227 -3332 -4504 -2873 2513 7345 1272 -8913 -9554 -11047 -2529 -1425 2369
5955 2369 5072 3329 -7432 -18714 -11760 -6231 -6047 -5686 -8946 -7081 -9215 -14267 -12288 -18943 -13899
$$ packed form
6061e252n711k078Q569l845l514L004l370k978Q199K359o85M688p522P130J1939
6046A0933m146j2292o004K229J7150P230l379q324M093Q739N653m481l025l33
6032A4043j101o499j0409K701l64j100o88K42m023L701o56L657k968q172j625
6017a3261l994K435R680J476K524M953N39l716R84n384k46Q8N576J2261k844j1064
6001Gl308P341J457P08r758q857M908n903N046J0014J674j1j1279r94P573J785
5985D03L288l577r147m982J1861J0900n552M95N644O162j1203K26O017k535m193
5970C807m27p22m885j105j172J631N386M832o073j0185o41j493Q518J104L794
5955B369K703j743j0761j1282O954N529J84L61l260J865k134n052J979o655N044
$$ plain form
5940 -13899 -103 6648 441 4371 1990 -1994 -1324 -7719 -11852 -6597 -6672 -3450 3615 7312 -4368
5925 -4368 -13948 -6051 -3207 -1478 6769 5892 -8263 -12396 -4019 -1816 -7177 -9150 -12997 -9611 -5779
5910 -5779 -6975 -3889 -2309 -11329 -15763 -17943 -18257 -8154 387 7095 11241 9364 4451 5343 -3211
5895 -3211 -10554 -1054 6747 9441 194 1635 4006 -7468 -11116 -10352 -2587 -5544 -11285 -4165 6173
5880 6173 18104 18810 9459 2391 7996 13864 16304 13235 -4103 -3678 7270 -207 -2863 -3629 301
5865 301 11200 3454 2229 -736 1607 -2743 -13005 -15085 -13949 -6434 -13572 -11822 -8370 -7113 -10097
5850 -10097 -8863 3781 903 -3472 288 -4192 -17767 -15851 -17173 -25369 -20757 -15962 -11394 -9003
5836 -9003 -10424 -18205 -7486 1219 -1691 -2553 -10168 -3613 -11043 -11416 -11242 -14070 -7245 1290 5994
$$ packed form
5940a3899J3796O751o207L930k381l984O70o395m133N255p5L222P065L697j1680
5925d368r580P897K844J729Q247q77j4155m133Q377K203n361j973l847L386L832
5910e779j196L086J580r020m434k180l14J0103Q541O708M146j877m913Q92q554
5895c211p343R500P801K694r247J441K371j1474l648P64P765k957n741P120J0338
5880F173J1931P06r351p068N605N868K440l069j7338M25J0948p477k656p66L930
5865C01J0899p746j225k965K343m350j0262k080J136P515p138J750L452J257k984
5850a0097J234J2644k878m375L760m480j3575J916j322q196M612M795M568K391
5836i003j421p781J0719Q705k910q62p615O555p430l73J74k828O825Q535M704
$$ plain form
5821 5994 606 -13425 -21228 -19557 -18798 -19343 -2996 3330 3619 -4424 -7759 -2684 -3873 -11604 -8960
5806 -8960 -9861 -14884 -19677 -10278 -6123 -5175 -6520 47 293 869 -1953 -5512 2229 12492 8010 10394
5790 10394 14775 16082 11157 4785 -8816 -12871 -6929 5664 3946 -4780 -8862 -9346 -10473 -5778
5776 -5778 254 266 -6698 -1741 318 -2068 -4420 -14463 -18481 -10567 -11351 -10226 -7821 -4532 1778
5761 1778 4382 7121 3013 -2668 -11722 -2296 4775 6316 10901 6938 5033 1028 822 -5600 -15910
5746 -15910 -14292 -15652 -9078 -11087 -4874 8882 6209 4539 -5976 -8533 -3564 2505 9844 14884
5732 14884 22237 14872 8855 9856 9249 4705 -11291 -14236 -18090 -13316 -3820 1181 -1615 -5316 -8023
5717 -8023 -9843 -114 -1691 4508 6004 1585 6927 17910 17768 1 1970 15284 6140 -7920
$$ packed form
5821E994n388j4031p803J671P59n45J6347O326K89q043l335N075j189p731K644
5806h960r01n023m793R399M155R48j345O567K46N76k822l559P741J0263m482K384
5790A0394M381J307m925o372j3601m055N942J2593j718q726m082m84j127M695
5776e778O032J2o964M957K059k386k352j0043m018P914p84J125K405L289O310
5761A778K604K739m108n681r054R426P071J541M585l963j905m005k06o422j0310
5746a5910J618j360O574k009O213J3756k673j670j0515k557M969O069P339N040
5732A4884P353p365o017J001o07m544j5996k945l854M774R496N001k796l701k707
5717h023j820R729j577O199J496m419N342J0983j42j7767J969J3314r144j4060
$$ plain form
5703 -7920 -1342 437 8336 15018 17428 11880 7918 -6748 -328 5070 12527 15565 5606 -7969
5689 -7969 -8688 -11422 -7417 -7259 5126 13212 9501 19150 23507 9935 4148 6628 -1716 -4515 194
5674 194 -1765 -9975 -11695 -7041 -4698 -12864 -11837 -8785 -11478 -12195 -20841 -17037 -12287 -2784 -488
5659 -488 -15661 -13922 -8297 -3005 -2083 -3013 609 -166 -7338 -4019 1008 5228 1122 819 1012 3558
5643 3558 8104 14208 16321 4721 -2750 -5687 -10357 1914 4917 2090 1110 7220 -6046 -7317
5629 -7317 958 2450 -4161 2979 4256 5160 7733 9080 6864 2329 13873 14830 14359 13862 9868 4098
5613 4098 3550 4466 -3365 -10785 -7493 -9096 -4378 5092 6204 -5100 -17983 -12444 -485 1337 -1736
5598 -1736 -6382 495 4028 5584 483 1144 -5305 -8302 -11060 -18797 -10904 -2596 -6536 -3847 938
$$ packed form
5703g920O578J779P899O682K410n548l962j4666O420N398P457L038r959j3575
5689g969p19k734M005J58J2385Q086l711R649M357j3572n787K480q344k799M709
5674A94j959q210j720M654K343q166J027L052k693p17q646L804M750R503K296
5659d88j5173J739N625N292R22r30L622p75p172L319N027M220m106l03J93K546
5643C558M546O104K113j1600p471k937m670J2271L003k827r80O110j3266j271
5629g317Q275J492o611P140J277R04K573J347k216m535J1544R57m71m97l994n770
5613D098n48R16p831p420L292j603M718R470J112j1304j2883N539J1959J822l073
5598a736m646O877L533J556n101O61o449k997k758p737P893Q308l940K689M785
$$ plain form
5583 938 6366 -4017 -6512 -14576 -8286 -8229 -5531 -4927 -5316 -6562 -8900 -7863 -8396 -4128 1059 -913
5567 -913 -3543 -10163 -17597 -12978 -10575 -10763 -16864 -10944 -11674 -13798 -19815 -19826 -26676 -15990 -7714 -11368
5551 -11368 -11067 -18263 -19562 -18603 -14939 -9250 -6339 -13650 -19246 -23685 -15028 -8702 -9452 -6382 -6543 -6306
5535 -6306 3556 2273 -1800 -6465 -6210 -6943 -2618 14567 11993 -1257 -6326 -5665 -14048 -17328 -5965
5520 -5965 2358 9066 13674 774 -2837 3328 3156 2719 -4088 -13141 -11803 -3836 5886 9237 2992
5505 2992 -824 -1019 -3462 -13584 -6323 -6375 -8457 -8520 -7012 -12573 -14078 -21544 -28850 -31335 -31415 -20377
5489 -20377 -8728 -622 2980 8442 16642 11554 2186 -15881 -9027 4630 -802 -5678 -7768 -3441
5475 -3441 -94 -3866 -10366 -13032 -16683 -11254 -13946 -6247 -10752 -11287 -6599 -306 3347 7810 15448
$$ packed form
5583I38N428j0383k495q064O290N7K698O04l89j246k338J037n33M268N187j972
5567i13k630o620p434M619K403j88o101N920p30k124o017j1o850J0686Q276l654
5551a1368L01p196j299R59L664N689K911p311n596m439Q657O326p50L070j61K37
5535f306R862j283m073m665K55p33M325J7185k574j3250n069O61q383l280J1363
5520e965Q323O708M608j2900l611O165j72m37o807r053J338P967R722L351o245
5505B992l816j95k443j0122P261n2k082o3J508n561j505p466p306k485q0J1038
5489b0377J1649Q106L602N462Q200n088r368j8067O854J3657n432m876k090M327
5475c441L347l772o500k666l651N429k692P699m505n35M688O293L653M463P638
$$ plain form
5460 15448 11026 4596 2393 1143 -974 -4682 -14662 -13448 -12888 -7282 -6940 -11786 -4496 1713 4386
5445 4386 2267 -228 -7415 -15439 -18495 -21000 -17235 -1228 2257 -3919 -7458 -3530 4886 14113 5562
5430 5562 -6199 -13594 -7035 -5870 -5666 -7386 -3970 -4775 -580 8929 7654 7383 1210 -16287 -23633
5415 -23633 -11342 -14648 -13819 -20572 -25816 -18781 -3751 -5563 5568 9679 -2869 -11557 -12088 -11858
5401 -11858 -11160 -7979 -2410 -2735 1315 2668 -5549 -22612 -16196 -6746 -8465 4161 11701 7936 3102
5386 3102 3376 3766 10724 12493 8025 1710 -281 2878 4617 4777 -4923 -5834 208 7460 4591 322
5370 322 -7596 -10750 -2916 3263 6951 18523 18554 21396 16388 16721 9668 -9772 -8468 -1887 -1820 -6734
5354 -6734 -2320 -67 2870 5957 5368 94 1584 2063 14 2082 1669 2296 2230 -2672 3323 8394
$$ packed form
5460A5448m422o430k203j250k117l708r980J214N60N606L42m846P290O209K673
5445D386k119k495p187q024l056k505L765J6007L485o176l539L928Q416R227q551
5430E562j1761p395O559J165K04j720L416q05M195R509j275k71o173j7497p346
5415b3633J2291l306Q29o753n244P035J5030j812J1131M111j2548q688n31K30
5401a1858O98L181N569l25M050J353q217j7063O416R450j719J2626P540l765m834
5386C102K74L90O958J769m468o315j991L159J739J60r700r11O042P252k869m269
5370C22p918l154P834O179L688J1572L1K842n008L33p053j9440J304O581O7m914
5354f734M414K253K937L087n89n274J490M79k049K068m13O27o6m902N995N071
$$ plain form
5338 8394 -3518 -2334 1852 -2045 -3999 -411 4953 -6807 -14558 -14061 -10343 -6425 -7478 -15589 -11497
5323 -11497 -6950 2309 7268 7054 1025 -4943 -12043 -11167 -867 2268 5047 -38 -6244 -9786 -11610
5308 -11610 -10145 -11152 -15968 -16090 -9823 2333 -389 -10456 -19527 -12230 -2559 6046 2794 -5781
5294 -5781 -19302 -11582 -152 2505 -2176 -8102 -6837 -7068 -2337 -13599 -23027 -17055 -4000 2414
5280 2414 6316 4542 -6586 -4147 -4241 -2142 -3144 3620 8555 6012 3259 495 -2825 -4231 -1829
5265 -1829 -4514 -1899 -1206 240 1958 445 -930 4069 5727 7755 11763 4234 -6966 -8356 -7709
5250 -7709 -1412 703 -8863 -10398 -3668 -4639 -10678 -15731 -14966 -13286 -18163 -11461 -3789 -14397 -16384
5235 -16384 -20340 -19573 -18832 -12276 -14001 -20108 -23451 -26030 -17900 -5048 1360 15427 16841 16153 10755
$$ packed form
5338H394j1912J184M186l897j954L588N364j1760p751M97L718L918j053q111M092
5323a1497M547R259M959k14o029n968p100Q76J0300L135K779n085o206l542j824
5308a1610J465j007m816j22O267J2156k722j0067r071P297R671Q605l252q575
5294e781j3521P720J1430K657m681n926J265k31M731j1262r428N972J3055O414
5280B414L902j774j1128K439r4K099j002O764M935k543k753k764l320j406K402
5265a829k685K615O93J446J718j513j375M999J658K028M008p529j1200j390O47
5250g709O297K115r566j535O730r71o039n053P65J680m877O702P672j0608j987
5235a6384l956P67P41O556j725o107l343k579Q130J2852O408J4067J414o88n398
$$ plain form
5220 10755 -2511 -5371 2143 406 -3035 1711 -1289 -1356 -3056 -7906 -4696 -6497 -8672 -9900 -4847
5205 -4847 -2102 -11467 -20254 -20811 -12165 -10 3739 -4401 -11330 -11061 -7853 -8275 -11327 -8399 -5012
5190 -5012 3091 2813 -1873 -5665 -5479 -3816 -5502 -9635 -10861 -10108 2602 1036 3469 4783 706
5175 706 3655 10269 2413 -4500 -7755 -11771 -7262 2636 -1405 -62 4870 9048 8405 1700 4807
5160 4807 10400 10340 -628 -9861 -7447 886 10117 9828 92 -4713 711 3643 3960 8242 10340 416
5144 416 -9343 -9668 -2444 -2864 -2213 -6219 -11108 -8675 -3601 -3517 -9877 -3492 5060 -3016 -8715 -17688
5128 -17688 -19033 -15687 -9386 -3806 4423 -4229 -11153 -15601 -12420 -14000 -14884 -13122 -15606 -20077 -12888
5113 -12888 -6800 -7646 -4323 -1670 765 -1365 -1837 2239 513 -5354 -3453 -6779 -4805 253 -4356
$$ packed form
5220A0755j3266k860P514j737l441M746l000o7j700m850L210j801k175j228N053
5205d847K745r365q787n57Q646J2155L749q140o929K69L208m22l052K928L387
5190e012Q103k78m686l792J86J663j686m133j226P53J2710j566K433J314m077
5175G06K949O614p856o913l255m016M509R898m041J343M932M178o43o705L107
5160D807N593o0j0968r233K414Q333R231k89r736m805N424K932L17M282K098r924
5144D16r759l25P224m20O51m006m889K433N074Q4o360O385Q552q076n699q973
5128a7688j345L346O301N580Q229q652o924m448L181j580q84J762k484m471P189
5113a2888O088q46L323K653K435k130m72M076j726n867J901l326J974N058m609
$$ plain form
5098 -4356 -4583 -4451 -3464 1885 -1074 108 12095 12329 13510 16537 7851 6783 3805 -6257 -8096
5083 -8096 -7302 -8674 -9309 -6465 -7153 -13719 -2961 6683 1463 -3937 3780 8973 6276 2560 7053
5068 7053 -4626 -7421 -8968 -13171 -13290 -13465 -15847 -21373 -16278 -6909 -4175 -2629 -5230 -1151 -8112
5053 -8112 -1227 5560 5379 5808 1300 -6678 -7976 -6753 -2669 1476 -4038 -5873 -10326 -14874 -17496
5038 -17496 -6058 -759 -11666 -12639 -10019 -12297 -8293 -12480 -14647 -14661 -7487 -15390 -9977 -4493 -2472
5023 -2472 -8812 -6861 -3057 -5806 -7968 1123 1771 -249 -4224 2588 11073 12471 11434 19394 13816
5008 13816 -3846 -3497 3013 -2734 -8227 1238 13183 9390 1461 -935 4767 11621 7357 5786
4994 5786 250 -2272 -4177 -3251 -10761 -10441 -7271 3255 7744 927 -2511 -2466 3199 7147 11062 9885
$$ packed form
5098d356k27J32R87N349k959J182J1987K34J181L027q686j068k978j0062j839
5083h096P94j372o35K844o88o566J0758R644n220n400P717N193k697l716M493
5068G053j1679k795j547m203j19j75k382n526N095R369K734J546k601M079o961
5053h112O885O787j81M29m508p978j298J223M084M145n514j835m453m548k622
5038a7496J1438N299j0907r73K620k278M004m187k167j4P174p903N413N484K021
5023b472o340J951L804k749k162R091O48k020l975O812Q485J398j037P960n578
5008A3816j7662L49O510n747n493R465J1945l793p929k396N702O854m264j571
4994E786n536k522j905R26p510L20L170J0526M489o817l438M5N665L948L915j177
$$ plain form
4978 9885 -1 -3199 -5010 -785 1588 1297 -1255 -609 -4721 -11088 -17447 -23135 -17392 -7408 4191
4963 4191 5842 1470 -1770 -17140 -8947 1057 -972 -1072 -6291 -15129 -9270 -9724 -21850 -19789 -20841
4948 -20841 -15065 -3446 -2940 -8285 -6183 -10960 -13142 -19670 -12605 -1812 -803 -150 -4 3606 14977
4933 14977 6696 -3278 -4802 1793 1958 -1679 -917 1851 -6719 -5860 -11741 -16189 -5426 -9261 -10648
4918 -10648 -14759 -23022 -22526 -16234 -8537 -1084 -5427 -7462 -14600 -15049 -25256 -22632 -15290 -18042 -20957
4903 -20957 -9275 1777 -7002 -2193 887 2654 1309 50 111 3402 -1242 -7637 -2967 -1236 -46
4888 -46 -4035 6932 15342 8996 -6646 -5517 -8635 -10454 -4481 -3068 -4732 -348 -158 -9522 -4918
4873 -4918 -9371 -11485 5104 8807 2231 -3170 -6992 -16516 -21305 -20731 -6886 4931 6122 3172
$$ packed form
4978I885r886l198j811M225K373k91k552O46m112o367o359n688N743R984J1599
4963D191J651m372l240j5370Q193J0004k029j00n219q838N859m54j2126K061j052
4948b0841N776J1619N06n345K102m777k182o528P065J0793J009O53J46L610J1371
4933A4977q281r974j524O595J65l637P62K768q570Q59n881m448J0763l835j387
4918a0648m111q263M96O292P697P453m343k035p138m49j0207K624P342k752k915
4903b0957J1682J1052q779M809L080J767j345j259O1L291m644o395M670J731J190
4888d6l989J0967Q410o346j5642J129l118j819N973J413j664M384J90r364M604
4873d918m453k114J6589L703o576n401l822r524m789N74J3845J1817J191k950
$$ plain form
4859 3172 -2132 -283 1507 5179 1923 -5214 -1494 1715 -4878 -10385 -13499 -8589 1979 3539 -247
4844 -247 -7959 -7976 -3967 1475 -3245 -10984 -17995 -19640 -16979 -15837 -10934 -6744 -2677 7864 339
4829 339 -8890 -8817 -3611 2557 -6492 -10851 71 -6180 -10587 -9098 -1436 9121 3468 -9724 -13653
4814 -13653 1806 3634 4071 6835 5117 5130 2898 2153 -5947 -14194 -9080 -1241 1638 -6307 -5838 -11110
4798 -11110 -14144 -18817 -12653 -8938 -3423 -5180 -2871 -10942 -18291 -18749 -14626 -13618 -11118 -9324 1862
4783 1862 4571 28 -3486 -2369 -7586 -6996 -6533 -11435 -7287 4459 -392 -3258 5975 2209 6389
4768 6389 356 -17255 -24346 -19256 -4242 -14239 -9249 -5607 -11477 -12519 -6889 -7821 -13336 -9467 -11758
4753 -11758 -10755 -15861 -11994 -7193 -7522 -13304 -14224 -14644 -10638 -18099 -27900 -24313 -14222 -7691 -7987
$$ packed form
4859C172n304J849J790L672l256p137L720L209o593n507l114M910J0568J560l786
4844b47p712j7M009N442m720p739p011j645K661J142M903M190M067J0541p525
4829C39r229P3N206O168r049m359J0922o251m407J489P662J0557n653j3192l929
4814a3653J5459J828M37K764j718J3k232p45q100q247N114P839K879p945M69n272
4798a1110l034m673O164L715N515j757K309q071p349m58M123J008K500J794J1186
4783A862K709m543l514J117n217N90M63m902M148J1746m851k866R233l766M180
4768F389o033j7611p091N090J5014r997M990L642n870j042N630r32n515L869k291
4753a1758J003n106L867M801l29n782r20m20M006p461r801L587J0091O531k96
$$ plain form
4738 -7987 -8449 -6424 -11985 -16177 -6184 -2534 -4730 -4497 -2235 7459 6170 5919 1942 -1346 475 4081
4722 4081 -2239 -2974 -6515 -6145 -1568 691 -35 -13785 -18174 -11784 -7992 -3353 -8119 -19606 -18090
4707 -18090 -9723 -5422 -10774 -15821 -8870 3038 -11161 -15331 -5749 -4581 -8291 -3295 -2087 -1607
4693 -1607 3569 6460 5889 15050 13587 8290 3227 -3723 -1396 5185 14183 9650 7447 10131 1789
4678 1789 2496 3913 3273 6167 2136 3168 6180 4662 9581 14672 10021 8055 9785 12706 16560
4663 16560 1320 1668 229 -3275 -6534 -4504 -7866 -6719 -3379 -5341 -2360 272 -167 -10192 -13158
4648 -13158 -428 -976 -3142 5061 12461 4729 -9103 -12069 -8747 -7784 -7357 -8405 -2985 12693 14595
4633 14595 8121 1562 319 2262 -714 -3013 -2845 1631 1362 -5009 -6800 -9707 -5778 -5510 -9344
$$ packed form
4738g987m62K025n561m192R993L650k196K33K262R694j289k51l977l288J821L606
4722D081o320p35l541L70M577K259p26j3750m389O390L792M639m766j1487J516
4707a8090Q367M301n352n047O951J1908j4199m170R582J168l710M996J208M80
4693a607N176K891n71R161j463n297n063o950K327O581Q998m533k203K684q342
4678A789P07J417o40K894m031J032L012j518M919N091m651j966J730K921L854
4663A6560j5240L48j439l504l259K030l362J147L340j962K981K632m39j0025k966
4648a3158J2730n48k166Q203P400p732j3832k966L322R63M27j048N420J5678J902
4633A4595o474o559j243J943k976k299J68M476k69o371j791k907L929K68l834
$$ plain form
4618 -9344 -14782 -14882 -17814 -11025 -4717 -453 -7780 -6461 -9746 -5984 377 3245 -1272 -9048 -5761
4603 -5761 794 407 -1998 -3685 -4146 -7615 -8020 -3364 -8567 -9831 -18313 -22299 -9716 -4797 1364
4588 1364 1535 -4640 -6092 -515 -4882 -10083 -15279 -14733 -12035 -7537 -16208 -12353 -7027 -8044 -7958 -8624
4572 -8624 -7180 2332 8232 10797 3938 2665 3292 2442 1738 -2524 -1021 8323 6791 461 -3810 -3223
4556 -3223 -4489 3660 -4677 -14150 -10097 -4875 -884 3777 3369 530 2694 10350 3756 -1181 58
4541 58 2002 -1928 -4999 -4493 -11079 -22028 -11688 -925 -3282 -5650 -6389 -3887 -9500 -10283 -9744 -7996
4525 -7996 -10880 -9633 -311 2252 6032 -306 -1944 4187 3455 -1869 -2080 2310 11609 9558 -1701
4510 -1701 -7406 1818 -856 -74 6930 13019 19705 29430 20994 10552 -2115 -6785 -6549 2089 2869
$$ packed form
4618i344n438j00k932O789O308M264p327J319l285L762O361K868m517p776L287
4603e761O555l87k405j687m61l469m05M656n203j264q482l986J2583M919O161
4588A364J71o175j452N577m367n201n196N46K698M498q671L855N326j017Q6o66
4572h624J444R512N900K565o859j273O27q50p04m262J503R344j532o330m271N87
4556c223j266Q149q337r473M053N222L991M661m08k839K164P656o594m937J239
4541E8J944l930l071N06o586j0949J0340J0763k357k368p39K502n613p83N39J748
4525g996k884J247R322K563L780o338j638O131p32n324k11M390R299k051j1259
4510a701n705R224k674P82P004O089O686R725q436j0442j2667m670K36Q638P80
$$ plain form
4495 2869 -267 3255 3818 -6512 -13418 -6612 4021 12162 4451 -9665 -10281 -13845 -18632 -16863 -11112
4480 -11112 -6922 2683 2457 -2851 1665 9204 3258 1682 -152 5866 10772 5427 6407 1441 -2800
4465 -2800 -4136 -4963 4711 8955 14826 14445 10885 -2283 -10775 -15600 -7809 -4155 -6913 -4662 1747
4450 1747 7244 7111 9390 12281 4978 4786 3576 -3883 -5370 1015 1728 5385 2850 5505 -801 -4141
4434 -4141 3637 6135 7245 4097 -5025 -1853 5276 -4911 -8364 1274 6489 7458 3179 -5772 -11834
4419 -11834 -15566 -13792 -5919 6331 4684 2764 -4829 -1663 -2216 799 1624 2941 1771 2265 6742
4404 6742 1853 -4531 -3885 -4755 -9124 -8656 -12446 -8757 -7759 -10965 -8588 -10392 -11634 -8168 -7415 -11531
4388 -11531 -16236 -18920 -29193 -25999 -33479 -36128 -29503 -20399 -6779 -3137 -2435 -9837 -6710 -3818
$$ packed form
4495B869l136L522N63j0330o906O806J0633Q141p711j4116o16l564m787J769N751
4480a1112M190R605k26n308M516P539n946j576j834O018M906n345R80m966m241
4465b800j336q27R674M244N871l81l560j3168q492m825P791L654k758K251O409
4450A747N497j33K279K891p303j92j210p459j487O385P13L657k535K655o306l340
4434d141P778K498J110l148r122L172P129j0187l453R638N215R69m279q951o062
4419a1834l732J774P873J2250j647j920p593L166n53L015Q25J317j170M94M477
4404F742m889o384O46q70m369M68l790L689R98l206K377j804j242L466P53m116
4388a1531m705k684j0273L194p480k649O625R104J3620L642P02p402L127K892
$$ plain form
4374 -3818 -112 -5135 -11070 -898 6580 7795 4411 4528 3767 2778 -1050 3980 6734 1856 -3061
4359 -3061 -5069 677 -1985 4272 4972 10348 6155 3314 1051 2893 -3485 -3935 -6505 -4657 869
4344 869 2167 1122 11694 7800 2140 -2298 -2236 686 5997 -3140 -14274 -10915 4546 10784 10991
4329 10991 4834 9618 3045 -1301 -9315 -7317 6226 3680 -6062 1294 10691 9357 7032 5214
4315 5214 -726 -7605 -10234 -13512 -3857 6928 6338 -81 -11515 -10987 -10585 -8376 -8243 -14197 -3977
4300 -3977 1326 4116 3119 2191 4252 -2873 -6258 -1093 -2585 -5603 -2285 -4511 -8001 -5843 -11210
4285 -11210 -2517 7638 265 -1065 -3878 -5538 -7284 -3877 -12850 -19628 -14230 -5190 -5839 -15179 -11648
4270 -11648 808 11029 10490 7685 29 2690 8242 3695 -637 -9007 -9713 44 8691 7597 9231
$$ packed form
4374c818L706n023n935J0172P478J215l384J17p61r89l828N030K754m878m917
4359c061k008N746k662O257P00N376m193k841k263J842o378m50k570J848N526
4344H69J298j045J0572l894n660m438O2K922N311r137j1134L359J5461O238K07
4329A0991o157M784o573m346q014J998J3543k546r742P356R397j334k325j818
4315E214n940o879k629l278R655J0785n90o419j1434N28M02K209J33n954J0220
4300c977N303K790r97r28K061p125l385N165j492l018L318k226l490K158n367
4285a1210Q693J0155p373j330k813j660j746L407q973o778N398R040o49r340L531
4270a1648J2456J0221n39k805p656K661N552m547m332q370p06R757Q647j094J634
$$ plain form
4255 9231 -1966 -9358 -3882 -4498 -16752 -15707 -13292 -3440 310 2833 2494 2062 -2835 -5603 848
4240 848 5158 9813 5988 6726 -1690 209 311 2066 -1525 -912 4053 -998 -2989 -7167 -7147 -3941
4224 -3941 -1157 1973 10272 12550 -5549 -10081 -3087 -3385 -3060 -4941 -3169 3175 11982 9962 10959
4209 10959 13156 4319 -2634 -7445 2090 2271 -3845 365 -2044 -2545 -8454 -7500 -7011 -1612 -649 -2931
4193 -2931 -6396 -6694 -4427 -4413 -5026 -7975 -3975 -3663 -4243 -4735 -14614 -14770 -13766 -13209 -5304 5524 14992
4176 14992 16526 10078 4274 -4461 -10008 -9357 -12700 -1194 10621 8706 3496 6197 11256 17225
4162 17225 8128 -2482 -2699 -838 77 -1629 -8457 -13515 -12391 -21002 -10228 -704 -2979 -7381 -7271
4147 -7271 -15560 -15352 -9587 -8485 -14234 -18514 -15753 -14505 -8304 -7321 7062 15575 13919 5322 -3677
$$ packed form
4255I231j1197p392N476o16j2254J045K415R852L750K523l39m32m897k768O451
4240H48M310M655l825P38q416J899J02J755l591O13M965n051j991m178K0L206
4224c941K784L130Q299K278j8099m532O994k98L25j881J772O344Q807k020R97
4209A0959K197q837o953m811R535J81o116M210k409n01n909R54M89N399R63k282
4193b931l465k98K267J4o13k949M000L12n80m92r879j56J004N57P905J0828R468
4176A4992J534o448n804q735n547O51l343J1506J1815j915n210K701N059N969
4162A7225r097j0610k17J861R15j706o828n058J124q611J0774R524k275m402J10
4147g271q289K08N765J102n749m280K761J248O201R83J4383Q513j656q597q999
$$ plain form
4132 -3677 -9695 -13492 -15983 -12866 -9932 -7867 -7311 -12611 -8147 -489 -374 -3623 -10557 -708 1131
4117 1131 -3705 -268 -3349 -3399 -3334 -6879 -5013 1148 5355 4373 6213 8344 6100 7553 5436 330
4101 330 699 -8881 -17098 -11375 -5266 -2522 -12290 -7631 -5831 -2295 3085 -7896 -8201 -397 -4469
4086 -4469 -8643 -10102 -8209 -8149 -2180 4536 13437 8704 5250 9642 9252 4622 4295 7921 14547 8351
4070 8351 8392 7854 15911 15832 12353 8731 12026 4029 8345 5241 -1352 -8805 -11975 -7067 3432 -448
4054 -448 1425 2271 5195 7363 4997 -744 -6974 -7368 -4779 -10303 -8384 -13188 -14859 -18086 -21399 -20435
4038 -20435 -15797 -982 -301 -1374 -1612 -622 -4023 -9424 -8614 -8416 -14512 -17631 -12281 -6502 -4802 -10282
4022 -10282 -8419 2749 2611 -9969 -10840 -11208 -4290 -3676 -6435 -8964 -4763 3010 6383 11379 10787
$$ packed form
4132c677o018l797k491L117K934K065N56n300M464P658J15l249o934R849J839
4117A131m836L437l081n0O5l545J866O161M207r82J840K131k244J453k117n106
4101C30L69r580q217N723O109K744r768M659J800L536N380j0981l05P804m072
4086d469m174j459J893O0N969O716Q901m733l454M392l90m630l27L626O626o196
4070H351M1n38Q057p9l479l622L295p997M316l104o593p453l170M908J0499l880
4054d48J873Q46K924K168k366n741o230l94K589n524J919m804j671l227l313R64
4038b0435M638J4815O81j073k38R90l401n401Q10J98o096l119N350N779J700n480
4022a0282J863J1168j38j2580q71l68O918O14k759k529M201P773L373M996n92
$$ plain form
4007 10787 1070 -13419 -17692 -12727 -9664 -9513 -11204 -3164 -1411 -7395 -12451 -8217 -3244 -5570 -17448
3992 -17448 -19007 -20791 -15092 -10026 -1200 -58 -680 -7107 -10136 -10030 -7303 -12002 -6546 -6726 -761
3977 -761 -6442 -8268 563 5780 -1735 -1935 -6349 -7801 -4612 2209 -374 -79 8640 8775 2343 -3631
3961 -3631 -8257 -10423 -9618 1940 6818 -2553 -882 -611 -11398 -15363 -14368 -22951 -20164 -8777 4846
3946 4846 6250 -5053 -13563 -19282 -16565 -12452 -5164 -3023 -11496 -17808 -12972 -12986 -11943 -11476 -2148
3931 -2148 9047 912 -488 -1051 -7199 -4578 2175 3947 2427 2618 13002 10102 16386 18115 19911
3916 19911 16960 2882 -407 1536 6531 3472 4851 14448 16803 6240 124 -8624 -15533 -28788
3902 -28788 -23802 -13018 -11918 -1756 -605 -3672 -9567 -22791 -21358 -16779 -16836 -13063 -8754 -266
$$ packed form
4007A0787r717j4489m273M965L063J51j691Q040J753n984n056M234M973k326j1878
3992a7448j559j784N699N066Q826J142o22o427l029J06K727m699N456j80N965
3977g61n681j826Q831N217p515k00m414j452L189O821k583K95Q719J35o432n974
3961c631m626k166Q05J1558M878r371J671K71j0787l965R95q583K787J1387J3623
3946D846J404j1303q510n719K717M113P288K141q473o312M836j4J043M67R328
3931b148J1195q135j400n63o148K621O753J772j520J91J0384k900O284J729J796
3916A9911k951j4078l289J943M995l059J379R597K355j0563o116q748o909j3255
3902b8788M986J0784J100J0162J151l067n895j3224J433M579n7L773M309Q488
$$ plain form
3888 -266 -7327 -17049 -17119 -16407 -12574 -11815 -10476 -10148 -10340 -11985 -6497 -11656 -12784 -6165 4147 -1250
3872 -1250 -7639 -12560 -8423 -9285 -9942 -3454 -629 5817 4565 -4715 -7262 -5327 -1905 -3226 -5718
3857 -5718 -6548 -6135 -13740 -18001 -20126 -16086 -8936 -3420 -3461 -4800 -766 -73 -4865 -3005 -2531 2006
3841 2006 13285 12150 15791 10616 -1107 4684 3346 426 2915 -3411 -4856 -3135 -1354 328
3827 328 4008 -672 -7702 -8943 -6518 -13312 -7316 8704 15139 4836 1742 5607 11044 8755 4768
3812 4768 9588 8071 2751 -2772 -6271 -9108 -5446 -3023 -2484 -2186 1194 112 2242 7044 9127
3797 9127 9440 -3942 -3924 472 -608 9721 8265 -3878 -11079 -8040 -7396 11979 8818 1376 2769
3782 2769 8511 1439 -7378 -10974 -11098 -6923 -2728 3971 19907 21493 7978 -7547 -8930 -9981
$$ packed form
3888b66p061r722p0P12L833P59J339L28j92j645N488n159j128O619J0312n397
3872a250o389m921M137q62o57O488K825O446j252r280k547J935L422j321k492
3857e718q30M13p605m261k125M040P150N516m1j339M034O93m792J860M74M537
3841B006J1279j135L641n175j1723N791j338k920K489o326j445J721J781J682
3827C28L680m680p030j241K425o794N996J6020O435j0303l094L865N437k289l987
3812D768M820j517n320n523l499k837L662K423N39K98L380j082K130M802K083
3797I127L13j3382J8M396j080J0329j456j2143p201L039O44J9375l161p442J393
3782B769N742p072q817l596j24M175M195O699J5936J586j3515j5525j383j051
$$ plain form
3768 -9981 -4207 -261 -4311 -9096 -11721 -9272 -14565 -15511 -11437 -11753 -10956 -8540 -4444 -6117 -10707 -2329
3752 -2329 6382 3491 -12006 -17878 -9898 -5872 -135 1387 1144 910 6112 11167 1497 -9156 -8205
3737 -8205 -8361 -5492 -2638 -4977 -11654 -7794 -2731 -6049 -2336 -1119 2796 -154 -783 -3452 -6743
3722 -6743 -7097 -6462 -821 -5026 -6092 -9221 -4440 -5066 -6109 -7645 -10079 -11428 -7923 -9687 -1831 -330
3706 -330 -10627 -10078 -12314 -8973 -10915 -7778 -4231 -5967 2069 7852 4621 10504 2412 -5913 -8501
3691 -8501 -4012 432 2327 129 967 3300 5205 9906 15485 20319 18782 13515 1725 -3511 -7638
3676 -7638 -3351 -36 1911 205 -1506 -1623 14441 10290 2228 3725 -5991 -13391 -7841 -1002 -2773
3661 -2773 -13959 -20471 -15775 -7998 -6281 -9867 -12453 -2663 6669 10244 -1475 -6383 1697 10315
$$ packed form
3768i981N774L946m050m785k625K449n293r46M074l16P97K416M096j673m590Q378
3752b329Q711k891j5497n872P980M026N737J522k43k34N202N055r670j0653R51
3737h205j56K869K854k339o677L860N063l318L713J217L915k950o29k669l291
3722f743l54O35N641m205j066l129M781o26j043j536k434j349L505j764P856J501
3706c30j0297N49k236L341j942L137L547j736Q036N783l231N883q092q325k588
3691h501M489M444J895k198Q38K333J905M701N579M834j537n267j1790n236m127
3676g638M287L315J947j706j711j17J6064m151q062J497r716p400N550O839j771
3661b773j1186o512M696P777J717l586k586R790R332L575j1719m908Q080Q618
$$ plain form
3647 10315 -2728 -6623 5441 9112 9474 17843 19046 10408 3084 -1053 -3582 3668 -1433 -12565
3633 -12565 -11297 -7888 -5819 1887 9888 5915 6354 8968 4235 3038 -5646 -7077 -9067 -4809 -1694
3618 -1694 -2865 -264 2563 7281 14607 15995 10561 701 -4410 -6373 -12342 -8500 -438 4949 10317
3603 10317 -2610 -13626 -13407 -14509 -14082 -3194 -1176 -3506 -7184 -18838 -27755 -23162 -7726 2162
3589 2162 5496 3524 -6353 -2311 2529 7219 6737 -2081 -6978 -10377 -11094 -5782 -2349 -3130 7222
3574 7222 4122 2614 -8750 -13876 -14493 -7223 -11111 -10592 -7954 -9667 -1726 -1000 -173 4951 -1182 -6825
3558 -6825 632 1119 -6561 -14077 -10393 -8114 -9325 -1317 6718 13025 10841 112 -2423 1700 8115
3543 8115 11921 12297 6342 -304 -2840 -4819 -1992 -1547 -595 6007 5038 5169 12346 10225 -225 6657
$$ packed form
3647A0315j3043l895J2064L671L62Q369J203q638p324m137k529P250n101j1132
3633a2565J268L409K069P706Q001l973M39K614m733j197q684j431j990M258L115
3618a694j171K601K827M718P326J388n434r860n111j963n969L842Q062N387N368
3603A0317j2927j1016K19j102M27J0888K018k330l678j1654q917M593J5436R888
3589B162L334j972r877M042M840M690m82q818m897l399p17N312L433p81J0352
3574G222l100j508j1364n126o17P270l888N19K638j713P941P26Q27N124o133n643
3558f825P457M87p680p516L684K279j211Q008Q035O307k184j0729k535M123O415
3543H115L806L76n955o646k536j979K827M45R52O602r69J31P177k121j0450O882
$$ plain form
3527 6657 5653 2533 915 -877 -4110 -3459 -6576 -13575 -16222 -6949 -1835 -405 -7825 -8532 -10563
3512 -10563 5521 10628 7995 5846 -4459 -4319 4578 9467 8841 9460 1606 -333 4341 2663 1087
3497 1087 -2938 -12642 -3894 -8050 -3529 4607 -6847 -15697 -16923 -3748 -2768 8686 12890 17676
3483 17676 6855 -6440 -4113 -3227 -4149 2280 7863 1820 -7134 -1924 -1707 -3929 -2868 9397 13557
3468 13557 4391 -6333 -14930 -8697 -2719 96 153 9253 1882 -6088 -8067 -9102 -2101 95 6736
3453 6736 12599 9035 3789 -8489 -6486 3943 1220 324 470 978 -8196 -15541 -12204 -11233 -5783
3438 -5783 -5444 -890 -2 -2366 -1218 -7356 -10690 -1268 7362 4607 1557 2449 -12540 -15816 -4202
3423 -4202 5007 6865 5521 -2837 -8226 -4749 -4367 -10443 -16450 -16647 -9698 -4941 -1206 -5828 -44
$$ packed form
3527F657j004l120j618j792l233O51l117o999k647R273N114J430p420p07k031
3512a0563J6084N107k633k149j0305J40Q897M889o26O19p854j939M674j678j576
3497A087m025r704Q748m156M521Q136j1454q850j226J3175R80J1454M204M786
3483A7676j0821j3295K327Q86r22O429N583o043q954N210K17k222J061J2265M160
3468A3557r166j0724q597O233N978K815N7R100p371p970j979j035P001K196O641
3453F736N863l564n246j2278K003J0429k723q96J46N08r174p345L337R71N450
3438e783L39M554Q88k364J148o138l334R422Q630k755l050Q92j4989l276J1614
3423d202R209J858j344q358n389L477L82o076o007j97O949M757L735m622N784
$$ plain form
3408 -44 7393 18519 23498 17328 605 -10447 -10416 -7116 -13085 -20781 -36458 -28374 -16152 -10316 -4772
3393 -4772 7622 7869 -1826 -2169 -2657 -2945 -2173 -258 5606 9938 4105 -4345 2257 3520 -2893 -7253
3377 -7253 -4194 -1826 -9652 -7429 -14668 -14562 -7919 -2698 1432 2397 9554 10085 280 6597 11431 8061
3361 8061 2603 -3779 -1328 -3068 -11066 -3983 -3624 -5354 -7574 -5462 7142 8592 7197 4517 2774
3346 2774 3669 123 3471 856 -1326 9028 17070 8887 -3356 -1686 -2078 5794 -1152 -12049 -10686
3331 -10686 -3037 2722 223 6629 15376 8813 5335 47 -5271 -6719 -4435 3398 -166 -4000 4791
3316 4791 12904 5364 -8550 -10713 -1745 -1215 -2615 26 499 -8381 -9600 -2884 -787 -4966 -4471
3301 -4471 -9555 -8090 -6427 -10281 -3868 1913 -5205 2475 308 3350 11204 10314 2554 4812 5648
$$ packed form
3408d4P437J1126M979o170j6723j1052L1L300n969p696j5677Q084J2222N836N544
3393d772J2394K47r695l43m88k88P72J915N864M332n833q450O602J263o413m360
3377g253L059K368p826K223p239J06O643N221M130R65P157N31r805O317M834l370
3361H061n458o382K451j740p998P083L59j730k220K112J2604J450j395k680j743
3346B774Q95l546L348k615k182J0354Q042q183j2243J670l92P872o946j0897J363
3331a0686P649N759k499O406Q747o563l478n288n318j448K284P833l564l834Q791
3316D791Q113p540j3914k163Q968N30j400K641M73q880j219O716K097m179M95
3301d471n084J465J663l854O413N781p118P680k167L042P854q90p760K258Q36
$$ plain form
3286 5648 -718 753 -7436 -10928 -9598 -11277 -10007 -3514 5974 15217 6605 -318 1750 -9371 -7522
3271 -7522 6326 5989 5144 14495 3355 -343 1862 12866 13488 9799 11885 6292 -1079 -1406 3439
3256 3439 4444 4852 2252 3217 1909 2065 1835 -1065 1631 -2889 -3036 -3062 -676 2492 4515 -2905 -10608
3239 -10608 -5480 -3893 -13614 -18360 -13348 -6920 -217 6152 4635 -843 1929 2898 7342 17881 11607
3224 11607 9871 7205 7242 7774 3245 1908 9718 13714 16365 11230 -5950 -6384 -6139 -4978 -7397 -5561
3208 -5561 2706 16288 17459 8341 427 -6039 -1386 3131 -243 -2439 4020 -1842 2954 8618 6786
3193 6786 11541 9852 2924 -1941 706 -583 -6836 5241 2155 -5681 -7026 -2558 -9756 -5030 -7358
3178 -7358 -1135 4548 6546 15033 6668 -1105 -2094 -2669 -2025 -3667 -2898 -2255 5606 5420 -8105 -10195
$$ packed form
3286E648o366J471q189l492J330j679J270O493R488R243q612o923K068j1121J849
3271g522J3848l37q45R351j1140l698K205J1004O22l689K086n593p371l27M845
3256C439J005M08k600R65j308J56k30k900K696m520j47k6K386L168K023p420p703
3239a0608N128J587r721m746N012O428O703O369j517n478K772R69M444J0539o274
3224A1607j736k666L7N32m529j337P810L996K651n135j7180m34K45J161k419J836
3208e561Q267J3582J171r118p914o466M653M517l374k196O459n862M796N664j832
3193F786M755j689o928m865K647j289o253J2077l086p836j345M468p198M726k328
3178g358O223N683J998Q487q365p773r89n75O44j642P69O43P861j86j3525k090
$$ plain form
3162 -10195 -3871 763 2476 4238 10595 12752 9820 -3368 -5999 -9633 -14056 -8662 -1959 3269
3148 3269 13731 5691 -9883 -10990 -8383 -9563 -15917 -4104 3664 -3355 -5443 -719 3333 -1399
3134 -1399 -4472 -3775 1652 3318 -4550 82 2348 4293 1556 -1316 -1996 -7771 -11564 -11473 -9658 -5496
3118 -5496 -4833 -6717 3723 8687 2909 -736 1726 7791 4756 -5996 -5823 -3905 -8841 -12428 -3186
3103 -3186 2074 -2926 -7067 -1159 2786 -2723 -593 -2243 -1766 -363 2485 4135 9107 12850 9868
3088 9868 7344 8587 7985 -1244 -7636 -5947 -2121 -2261 -13 -18 -2464 -5982 -5518 -487 4860 6997
3072 6997 8560 8495 6766 12994 19106 14075 10982 4548 -308 -4033 -5229 -594 -725 -2944 -9408 -7897
3056 -7897 -11368 1266 1516 2498 533 7982 496 2114 5660 5853 6576 7955 4995 -1221 -5668 -9868
$$ packed form
3162a0195O324M634J713J762O357K157k932j3188k631l634m423N394O703N228
3148C269J0462q040j5574j107K607j180o354J1813P768p019k088M724M052m732
3134a399l073O97N427J666p868M632K266J945k737k872o80n775l793R1J815M162
3118e496O63j884J0440M964n778l645K462O065l035j0752J73J918m936l587R242
3103c186N260n000m141N908L945n509K130j650M77J403K848J650M972L743k982
3088I868k524J243o02r229o392J689L826j40K248nk446l518M64N031N347K137
3072F997J563o5j729O228O112n031l093o434m856l725j196M635j31k219o464J511
3056g897l471J2634K50R82j965P449p486J618L546J93P23J379k960o216m447m200
$$ plain form
3040 -9868 -6859 -6156 -11730 -5154 2354 1837 1137 11077 12299 4501 1246 -16 8888 7051 -3942
3025 -3942 -3727 1691 8034 7028 -1270 -5268 2554 9711 4541 -1933 7384 14882 16265 13144 3247
3010 3247 -4594 -6171 -5066 -5729 -1107 6632 -7691 -17042 -19420 -23239 -24689 -24373 -21098 -20538 -9421
2995 -9421 356 -647 -566 7186 13497 22918 23333 9328 2315 -4042 2659 5560 1064 -1745 -8884
2980 -8884 -3728 -2787 -4221 -638 1670 -8070 -4876 -5109 -7056 -12778 -9055 4817 6226 -2659 -8098
2965 -8098 456 2427 -1379 1820 14089 11904 -1288 -3986 8538 7783 2041 -306 -6368 -10503
2951 -10503 -18632 -10595 -362 4518 1773 -2250 -7170 -5002 11051 16008 -1103 -4224 -580 903
2937 903 6483 570 4990 9886 15361 10766 6408 5566 9483 13137 6868 -1007 -7373 -4799 3851
$$ packed form
3040i868L009P03n574O576P508n17p00R940J222p798l255j262Q904j837j0993
3025c942K15N418O343j006q298l998P822P157n170o474R317P498J383l121r897
3010C247p841j577J105o63M622P739j4323r351k378l819j450L16L275N60J1117
2995i421R777j003Q1P752O311R421M15j4005p013o357O701K901m496k809p139
2980h884N156R41j434L583K308r740L194k33j947n722L723J3872J409q885n439
2965h098Q554J971l806L199J2269k185j3192k698J2524p55n742k347o062m135
2951a0503q129Q037J0233M880k745m023m920K168J6053M957j7111l121L644J483
2937I03N580n913M420M896N475m595m358q42L917L654o269p875o366K574Q650
$$ plain form
2922 3851 1186 8612 12376 14497 15357 19217 24378 24202 17483 12106 8904 7627 2481 -1255 -2484
2907 -2484 2499 -2928 -10483 -5514 -2181 -1813 -1570 370 617 -5383 -555 -6003 -5656 -11160 -14987 -5957
2891 -5957 2607 6840 9422 13634 14262 14547 1835 -2026 6054 2590 -12808 -12121 3790 10344 9805
2876 9805 -6407 -14038 -6763 806 -1124 5239 1811 -3171 -6775 -5630 -688 -3562 -4820 6019
2862 6019 12771 7205 1302 2306 6848 11221 14207 3515 2210 -8575 -7236 -5619 -6003 2933 1411
2847 1411 -1035 -3084 347 -9230 -11093 -1723 2184 1871 5626 1440 3679 12343 9634 -2578 -274
2832 -274 -4484 -10747 -5774 -2689 -8683 -14815 -17761 -6952 1059 -23 6236 9688 6958 5816 1748
2817 1748 4186 3769 -2462 -6062 287 6253 -3338 -7360 2728 17199 19766 13475 -390 -16882
$$ packed form
2922C851k665P426L764K121Q60L860N161j76o719n377l202j277n146l736j229
2907b484M983n427p555M969L333L68K43J940K47o000M828n448L47n504l827R030
2891e957Q564M233K582M212O28K85j2712l861Q080l464j5398O87J5911O554n39
2876I805j6212p631P275P569j930O363l428m982l604J145M942k874j258J0839
2862F019O752n566n903J004M542M373K986j0692j305j0785J339J617l84Q936j522
2847A411k446k049L431r577j863R370L907l13L755m186K239Q664k709j2212K304
2832b74m210o263M973L085n994o132k946J0809Q011j082O259L452k730j142m068
2817A748K438m17o231l600O349N966r591m022J0088J4471K567o291j3865j6492
$$ plain form
2803 -16882 -23593 -13544 -3013 -482 3798 7422 3339 -70 790 3239 3768 3498 -2109 5446 14691
2788 14691 13327 3355 -1904 -5573 -7938 -2011 -2390 6120 11458 7123 3212 3814 503 1937 4270
2773 4270 6 -6706 -11336 -2774 6134 2238 -13651 -18324 -16780 -1451 4512 2046 5960 7877
2759 7877 8712 10891 5279 -1214 -7019 -11172 -5686 378 3859 10684 9595 8056 8410 10747 18369
2744 18369 17594 9553 877 -1048 -4343 -4731 -12016 -6147 -3169 2381 2651 -4385 -1965 -988 -1223 1456
2728 1456 4999 9943 11563 -4672 -10484 -11051 -7726 -7223 -11161 -12188 -8285 -1531 -774 3248 5409
2713 5409 9211 7132 2585 -374 9480 15415 14237 7717 3084 337 3899 8498 3427 -473 3552
2698 3552 1952 -1023 -1160 -2908 -4384 -2998 -3610 -14897 -22152 -11900 8542 13494 7887 -7647
$$ packed form
2803a6882o711J0049J0531K531M280L624m083l409Q60K449N29k70n607P555R245
2788A4691j364r972n259l669k365N927l79Q510N338m335l911O02l311J434K333
2773D270m264o712m630Q562Q908l896j5889m673J544J5329N963k466L914J917
2759G877Q35K179n612o493n805m153N486O064L481O825j089j539L54K337P622
2744A8369p75q041q676j925l295l88p285N869K978N550K70p036K420R77k35K679
2728A456L543M944J620j6235n812n67L325N03l938j027L903O754P57M022K161
2713E409L802k079m547k959R854N935j178o520m633k747L562M599n071l900M025
2698C552j600k975j37j748j476J386o12j1287p255J0252K0442M952n607j5534
$$ plain form
2684 -7647 -13833 -4379 -1293 -10220 -4184 -3214 792 -5245 -15633 -12850 -3910 4379 6441 15525 14299
2669 14299 13771 13916 11252 13799 10679 5115 6436 6730 6516 2968 461 -2902 -11317 -13742 -1987
2654 -1987 13991 19513 1830 -7374 -14160 -8023 -5497 -1832 12907 19229 12426 4609 6754 9546
2640 9546 9692 14688 17410 4712 -130 8513 18474 20794 20682 10005 4792 2671 14459 18410 17368
2625 17368 8434 14871 18910 15192 4119 7568 9988 1937 1677 3931 -3221 -8096 -6946 -6658 -836
2610 -836 -6987 -8828 9205 10294 -3127 -18369 -24310 -17618 -14678 -12510 -14797 -18440 -9720 -3447
2596 -3447 -10613 -10708 -827 -6942 -2380 -6871 -4958 -7370 -10977 -19213 -22972 -8814 -841 -5983 -6234
2581 -6234 -986 7475 10918 13631 3485 -4114 -2266 301 710 8487 14045 9538 3650 861 6573
$$ packed form
2684g647o186R454L086q927O036R70M006o037j0388K783Q940Q289K062R084j226
2669A4299n28J45k664K547l120n564J321K94k14l548k507l363q415k425J1755
2654a987J5978N522j7683r204o786O137K526L665J4739O322o803p817K145K792
2640I546J46M996K722j2698m842Q643R961K320j12j0677n213k121J1788L951j042
2625A7368q934O437M039l718j1073L449K420q051k60K254p152m875J150K88N822
2610h36o151j841J8033J089j3421j5242n941O692K940K168k287l643Q720O273
2596c447p166r5R881o115M562m491J913k412l607q236l759J4158P973n142k51
2581f234N248Q461L443K713j0146p599J848K567M09P777N558m507n888k789N712
$$ plain form
2566 6573 9140 1501 2100 5535 8052 13338 10799 7085 5965 3669 2004 1836 1263 4361 17578
2551 17578 10869 2163 -1362 -7758 -8276 -2720 5343 5488 -4135 -4165 1563 -11462 -16878 -9629 -9115 -12887
2535 -12887 -22710 -21761 -9229 -9959 -18175 -11568 447 5759 2918 7473 9218 3793 4227 2845 -4604
2520 -4604 -469 -1558 -3264 -4961 -20851 -20120 -15714 -8638 -5209 -2324 -5574 -4713 -6157 -3998 -7023
2505 -7023 -3750 2952 -1767 -6265 -2856 7538 15326 17243 12088 6120 4289 8050 6604 1753 -636
2490 -636 -5097 -969 13642 15331 6028 2256 8866 8543 9039 8245 6061 -1592 -93 5289 2563 3923
2474 3923 -3170 -5182 -2886 721 3385 -420 -879 -5977 -12065 -6655 -6575 545 9383 15697 4760
2459 4760 2183 6053 9174 2038 -4039 5769 15923 20493 17013 15237 5549 7267 5823 5705 3772
$$ packed form
2566F573K567p639N99L435K517N286k539l714j120k296j665j68n73L098J3217
2551A7578o709q706l525o396n18N556Q063J45r623l0N728j3025n416P249N14l772
2535a2887r823R49J2532p30q216O607J2015N312k841M555J745n425M34j382p449
2520d604M135j089j706j697j5890P31M406P076L429K885l250Q61j444K159l025
2505g023L273O702m719m498L409J0394P788J917n155n968j831L761j446m851k389
2490f36m461M128J4611J689r303l772O610l23M96p94k184p653J499N382k726J360
2474C923p093k012K296L607K664l805m59n098o088N410Q0P120Q838O314j0937
2459D760k577L870L121p136o077R808J0154M570l480j776r688J718j444j18j933
$$ plain form
2444 3772 1906 -2846 1150 -3190 -8373 -3245 264 -3574 61 5560 2161 4077 9058 8039 4025
2429 4025 -3566 -13124 -22430 -11549 -8128 -9194 2970 4688 5139 3193 -3408 -1815 -8200 2714
2415 2714 4288 2423 10566 5927 -3039 -15226 -13736 -17327 -14226 -20589 -21628 -12574 -3777 2696 3181
2400 3181 -2889 -2918 2304 12607 8004 2537 1636 4030 10103 10495 4723 354 228 -2136 -4126 -8311
2384 -8311 -9299 978 10193 7876 -1405 -8399 -10680 -14321 1987 11019 3703 -3213 -4134 794 1865
2369 1865 872 -3845 -7683 -9058 -9260 -2389 8247 7655 10951 4067 -520 3909 5767 -9581 -12125
2354 -12125 -15576 -16716 -15484 -9530 -5928 910 7686 6766 3256 -3129 -10633 -7469 -163 -1857 -1757
2339 -1757 3241 6298 1586 671 -4250 -12493 -6778 2759 9180 9711 5833 2229 133 -287 2319 151
$$ packed form
2444C772j866m752L996m340n183N128L509l838L635N499l399J916M981j019m014
2429D025p591r558r306J0881L421j066J2164J718M51j946o601J593o385J0914
2415B714J574j865Q143m639q966j2187J490l591L101o363j039R054Q797O473M85
2400C181o070k9N222J0303m603n467r01K394O073L92n772m369j26k364j990m185
2384h311r88J0277R215k317r281o994k281l641J6308R032p316o916r21M928J071
2369A865r93m717l838j375k02O871J0636n92L296o884m587M429J858j5348k544
2354a2125l451j140J232N954L602O838O776r20l510o385p504L164P306j694J00
2339a757M998L057m712r15m921q243N715R537O421N31l878l604k096m20K606k168
$$ plain form
2323 151 -10036 -7668 -9039 -3457 -1100 -7695 -6674 -2161 3244 16161 9824 2747 5017 9255 4438
2308 4438 1072 4290 -803 -5147 -10619 -19628 -18312 -7779 -2567 -7964 -12835 -11058 -8903 -934 175
2293 175 -2996 -3402 -6300 -13267 -23650 -18086 -9659 -9660 -17427 -8171 5363 1045 1955 2940 4531 11509
2277 11509 17741 13706 6680 2359 -10542 -11108 105 11034 13842 6967 7303 857 -7353 -6506 1529
2262 1529 7752 10616 2194 8404 12763 -2462 -6992 2167 12076 13758 11596 11332 12105 5418 4815
2247 4815 8786 1008 -6734 -15079 -28112 -21241 1748 10700 10523 966 -7272 -7541 -234 2357 4440
2232 4440 -266 -2535 -2196 -6460 -6409 -461 -5495 -9250 -5037 -2599 -8155 -10159 -9049 -6852 -6374 -14298
2216 -14298 -1263 8261 2829 -222 6662 9026 13445 13150 10549 13289 12880 8962 16531 16968 915
$$ packed form
2323A51j0187K368j371N582K357o595J021M513N405J2917o337p077K270M238m817
2308D438l366L218n093m344n472r009J316J0533N212n397m871J777K155P969J109
2293A75l171m06k898o967j0383N564Q427jp767R256J3534m318R10R85J591O978
2277A1509O232m035p026m321j2901n66J1213J0929K808o875L36o446q210Q47Q035
2262A529O223K864q422O210M359j5225m530R159R909J682k162k64P73o687o03
2247D815L971p778p742q345j3033O871K2989Q952j77r557q238k69P307K591K083
2232D440m706k269L39m264N1N948n034l755M213K438n556k004J110K197M78p924
2216a4298J3035R524n432l051O884K364M419k95k601K740m09l918P569M37j6053
$$ plain form
2201 915 64 3732 12706 9298 2333 -1531 -1875 -1161 4143 2388 4045 3748 -9326 -24037 -27624 -14850
2185 -14850 -5030 -11808 -19073 -9444 -7716 -12471 -13688 -10614 -1452 718 3034 1515 -3408 3658 3452
2170 3452 -374 14030 11474 9189 5949 2978 2312 -1998 -1525 -3905 -11480 -8578 -3503 -1053 470
2155 470 4343 1645 -10052 -6996 -214 6653 7439 5548 3197 4908 11257 8724 15251 23106 20107
2140 20107 17154 9304 8476 13444 9928 4091 -6537 -9345 -16771 -16496 -11481 -7533 -5082 -328 4988
2125 4988 8616 4917 -4042 -10426 -6842 3164 8880 6438 5920 6627 130 -1559 -482 1839 1329
2110 1329 2701 8414 3644 5443 6555 7156 18707 23661 8372 2999 403 -5571 -6985 -7060 -8177
2095 -8177 -2676 12207 12881 5120 -3276 -9318 -1870 -2969 3653 -3019 -3906 -4228 -14901 -15148 -13808
$$ packed form
2201I15q51L668Q974l408o965l864l44P14N304j755J657k97j3074j4711l587J2774
2185a4850R820o778p265R629J728m755j217L074R162K170K316j519m923P066k06
2170C452l826J4404k556k285l240k971o66m310M73k380p575K902N075K450J523
2155D70L873k698j1697L056O782O867P86j891k351J711O349k533O527P855k999
2140B0107k953p850q28M968l516n837j0628k808p426K75N015L948K451M754N316
2125D988L628l699q959o384L584J0006N716k442n18P07o497j689J077K321n10
2110A329J372N713m770J799J112O01J1551M954j5289n373k596n974j414p5j117
2095h177N501J4883O74p761q396o042P448j099O622o672q87l22j0673k47J340
$$ plain form
2080 -13808 -11496 -8678 -14251 -10513 -8006 -13644 -10998 698 -1332 -2 -7577 -9204 -1686 1013
$$ packed form
2080a3808K312K818n573L738K507n638K646J1696k030J330p575j627P518K699
$$ [...]
##END NTUPLES=NMR SPECTRUM
##END=
