##TITLE=Analysis number 314224
Compound Code cc 31504
Book Reference 461/2
Project Code qc-cat
Chemist Name toml
##JCAMPDX= 6.0         $$ Bruker NMR JCAMP-DX V2.0
##DATA TYPE= NMR SPECTRUM
##DATA CLASS= NTUPLES
##ORIGIN= Bruker BioSpin GmbH
##OWNER= NMR
$$ XWIN-NMR		Version 3.5
$$ Tue Oct 11 09:59:17 2005 GMT Daylight Time (UT+1h)  MAYBRIDGE\NMR@NMR_250MHZ
##.OBSERVE FREQUENCY= 250.131544655141
##.OBSERVE NUCLEUS= ^1H
##.ACQUISITION MODE= SIMULTANEOUS (DQD)
##.ACQUISITION SCHEME= undefined
##.AVERAGES= 16
##.DIGITISER RES= 18
##SPECTROMETER/DATA SYSTEM= dpx250
##.PULSE SEQUENCE= zg30
##.SOLVENT NAME= CDCl3
##.SHIFT REFERENCE= (INTERNAL, CDCl3, 0, 16.4581)
##AUDIT TRAIL= $$ (NUMBER, WHEN, WHO, WHERE, WHAT)
$$ ##TITLE= Audit trail, XWIN-NMR		Version 3.5
$$ ##JCAMPDX= 5.01
$$ ##ORIGIN= Bruker BioSpin GmbH
$$ ##OWNER= NMR
$$ C:\u/data/dgb/nmr/ADRS/10680/pdata/1/auditp.txt
$$ ##AUDIT TRAIL=  $$ (NUMBER, WHEN, WHO, WHERE, WHAT)
(   1,<2005-10-11 09:58:48.71 +100>,<MAYBRIDGE\NMR>,<NMR_250MHZ>,
      <created by zg, POWCHK disabled, PULCHK disabled
       configuration hash MD5:
       62 19 C7 07 E1 42 D1 B7 37 6C 3D D0 77 39 F9 E6
       data hash MD5: 64K
       5C 4C C3 9A E5 2A D3 3B E6 82 FE E3 69 E9 D0 81>)
(   2,<2005-10-11 09:59:05.60 +100>,<MAYBRIDGE\NMR>,<NMR_250MHZ>,
      <Start of raw data processing
       ef LB = 0.3 FT_mod = 6 PKNL = 1 SI = 32K 
       data hash MD5: 32K
       49 60 A3 3D 5D 49 CC 5C 54 FE BB D4 91 FD D3 05>)
(   3,<2005-10-11 09:59:07.21 +100>,<MAYBRIDGE\NMR>,<NMR_250MHZ>,
      <apk 
       data hash MD5: 32K
       C0 3B DB FA 91 37 72 CE DB 40 01 D4 1C 0D 3F 17>)
(   4,<2005-10-11 09:59:07.88 +100>,<MAYBRIDGE\NMR>,<NMR_250MHZ>,
      <abs ABSG = 5 
       data hash MD5: 32K
       50 F7 C8 DA FA 4E 48 F4 11 F8 AF 4A 2C BC DA 73>)
$$ ##END=
$$ 
$$ hash MD5
$$ 65 B4 85 16 7E FC C2 4F 70 0E 98 8E 8A 03 EB 0E
##$RELAX= 
##$RELAX= 
##$RELAX= 
##$RELAX= 
##$RELAX= 
##$RELAX= 
##$RELAX= 
$$ Bruker specific parameters
$$ --------------------------
##$DU= <C:\u>
##$EXPNO= 10680
##$NAME= <ADRS>
##$PROCNO= 1
##$TYPE= <nmr>
##$USER= <dgb>
##$AMP= (0..31)
100 100 100 100 100 100 100 100 100 100 100 100 100 100 100 100 100 100 
100 100 100 100 100 100 100 100 100 100 100 100 100 100 
##$AQSEQ= 0
##$AQ_mod= 3
##$AUNM= <au_zg>
##$AUTOPOS= <1 >
##$BF1= 250.13
##$BF2= 250.13
##$BF3= 250.13
##$BF4= 250.13
##$BF5= 500.13
##$BF6= 500.13
##$BF7= 500.13
##$BF8= 500.13
##$BYTORDA= 1
##$CFDGTYP= 0
##$CFRGTYP= 5
##$CHEMSTR= <none>
##$CNST= (0..31)
1 1 145 1 1 1 1 1 1 1 1 1 1 1 1 1 1 1 1 1 1 1 1 1 1 1 1 1 1 1 1 1 
##$CPDPRG= <>
##$CPDPRG1= <>
##$CPDPRG2= <>
##$CPDPRG3= <>
##$CPDPRG4= <mlev>
##$CPDPRG5= <mlev>
##$CPDPRG6= <mlev>
##$CPDPRG7= <mlev>
##$CPDPRG8= <mlev>
##$CPDPRGB= <>
##$CPDPRGT= <>
##$D= (0..31)
0 1 0 0 0 0 0 0 0 0.06 0 0 0 0 0 0 0.0002 0 0 0 0 0 0 0 0 0 0 0 0 0 0 
0 
##$DATE= 1129021127
##$DBL= (0..7)
120 120 120 120 120 120 120 120 
##$DBP= (0..7)
150 150 150 150 150 150 150 150 
##$DBP07= 0
##$DBPNAM0= <>
##$DBPNAM1= <>
$$ [...]
##$SUBNAM7= <"">
##$SUBNAM8= <"">
##$SUBNAM9= <"">
##$SW= 20.6930455092707
##$SWIBOX= (0..15)
0 0 3 0 0 0 0 0 0 0 0 0 0 0 0 0 
##$SW_h= 5175.983436853
##$TD= 65536
##$TD0= 1
##$TE= 294.16
##$TE2= 300
##$TE3= 300
##$TEG= 300
##$TL= (0..7)
0 120 120 120 120 120 120 120 
##$TP= (0..7)
150 150 150 150 150 150 150 150 
##$TP07= 0
##$TPNAME0= <>
##$TPNAME1= <>
##$TPNAME2= <>
##$TPNAME3= <>
##$TPNAME4= <>
##$TPNAME5= <>
##$TPNAME6= <>
##$TPNAME7= <>
##$TPOAL= (0..7)
0.5 0.5 0.5 0.5 0.5 0.5 0.5 0.5 
##$TPOFFS= (0..7)
0 0 0 0 0 0 0 0 
##$TUNHIN= 0
##$TUNHOUT= 0
##$TUNXOUT= 0
##$USERA1= <user>
##$USERA2= <user>
##$USERA3= <user>
##$USERA4= <user>
##$USERA5= <user>
##$V9= 5
##$VALIST= <valist>
##$VCLIST= <CCCCCCCCCCCCCCC>
##$VD= 0
##$VDLIST= <DDDDDDDDDDDDDDD>
##$VPLIST= <PPPPPPPPPPPPPPP>
##$VTLIST= <TTTTTTTTTTTTTTT>
##$WBST= 1024
##$WBSW= 4
##$XGAIN= (0..3)
0 0 0 0 
##$XL= 0
##$YL= 0
##$YMAX_a= 335941
##$YMIN_a= -227967
##$ZGOPTNS= <>
##$ZL1= 120
##$ZL2= 120
##$ZL3= 120
##$ZL4= 120
##$ABSF1= 16.4581
##$ABSF2= -4.235073
##$ABSG= 5
##$ABSL= 3
##$ALPHA= 0
##$AQORDER= 0
##$ASSFAC= 0
##$ASSFACI= 0
##$ASSFACX= 0
##$ASSWID= 0
##$AUNMP= <proc_1d>
##$AZFE= 0.1
##$AZFW= 0.1
##$BCFW= 0
##$BC_mod= 0
##$BYTORDP= 0
##$COROFFS= 0
##$CY= 12.5
##$DATMOD= 1
##$DC= 0
##$DFILT= <>
##$DTYPP= 0
##$F1P= 14.0000005364418
##$F2P= -0.99999901652339
##$FCOR= 0.5
##$FTSIZE= 32768
##$FT_mod= 6
##$GAMMA= 0
##$GB= 0
##$INTBC= 1
##$INTSCL= 1
##$ISEN= 128
##$LB= 0.3
##$LEV0= 0
##$LPBIN= 0
##$MAXI= 10000
##$MC2= 0
##$MEAN= 0
##$ME_mod= 0
##$MI= 0
##$NCOEF= 0
##$NC_proc= -4
##$NLEV= 6
##$NOISF1= 0
##$NOISF2= 0
##$NSP= 0
##$NTH_PI= 0
##$NZP= 0
##$OFFSET= 16.4581
##$PC= 1
##$PHC0= -62.46394
##$PHC1= 3.567417
##$PH_mod= 1
##$PKNL= yes
##$PPARMOD= 0
##$PSCAL= 4
##$PSIGN= 0
##$REVERSE= no
##$SF= 250.130015983156
##$SI= 32768
##$SIGF1= 0
##$SIGF2= 0
##$SINO= 400
##$SIOLD= 32768
##$SREGLST= <1H.CDCl3>
##$SSB= 0
##$STSI= 32768
##$STSR= 0
##$SW_p= 5175.98343685301
##$SYMM= 0
##$S_DEV= 0
##$TDeff= 65536
##$TDoff= 0
##$TI= <Analysis number 999999
Compound Code 99
Book Reference 9
Project Code 9>
##$TILT= no
##$TM1= 0
##$TM2= 0
##$TOPLEV= 0
##$USERP1= <user>
##$USERP2= <user>
##$USERP3= <user>
##$USERP4= <user>
##$USERP5= <user>
##$WDW= 1
##$XDIM= 32768
##$YMAX_p= 373391407
##$YMIN_p= -467089
$$ End of Bruker specific parameters
$$ ---------------------------------
##NTUPLES= NMR SPECTRUM
##VAR_NAME=  FREQUENCY,     SPECTRUM/REAL,   SPECTRUM/IMAG
##SYMBOL=    X,             R,               I
##VAR_TYPE=  INDEPENDENT,   DEPENDENT,       DEPENDENT
##VAR_FORM=  AFFN,          ASDF,            ASDF
##VAR_DIM=   32768,         32768,           32768
##UNITS=     HZ,            ARBITRARY UNITS, ARBITRARY UNITS
##FACTOR=    0.157963299565203, 1,           1
##FIRST=     4116.66465727844, 0,            0
##LAST=      -1059.31877957457, 0,           0
##MIN=       -1059.31877957457, -467089,     0
##MAX=       4116.66465727844, 373391407,    0
$$ Real data points
##PAGE= N=1
##DATA TABLE= (X++(R..R)), XYDATA
$$ [...]
32450 -180766 -62444 25413 -15125 51725 70889 14462 -26367 -186622 -256461 -177060 -125679
32439 -125679 -191224 -205890 -154389 3865 33022 -19147 -63345 -35415 -62460 -61582 -122347 -58046
32427 -58046 -24969 -83163 -103483 -121665 -21997 7896 -23007 -73295 -157230 -115161 -46345 65775
32415 65775 102024 42934 -14124 -66244 -185707 -158004 -151508 -83855 -105496 -77189 -32096 38047
32403 38047 61934 92835 74780 9303 -47733 -82712 -81802 -103220 -124428 -54714 13860 135097
32391 135097 166487 231978 173276 156333 149067 23513 -62787 -40494 87534 39449 -80414
32380 -80414 -162943 -169815 -159077 -138476 -149189 -249685 -176174 -93183 -19666 -129551 -99295
32369 -99295 -148723 -272545 -181754 -72256 65625 94259 159455 136653 -84332 -30696 18420
32358 18420 86589 45844 -124507 -59575 85850 148805 187539 99630 -28577 15038 -46338
32347 -46338 -95357 -47456 38022 31638 144132 28956 -49468 -60322 -130206 -78368 -22143
32336 -22143 -7100 42193 -45775 -114009 -105010 -43026 -72417 -4242 21758 22213 24049 88371
32324 88371 126984 193107 92964 12458 -43281 27125 118666 52308 32361 -44417 -96456
32313 -96456 3136 74767 80257 58165 -87458 -149604 -175416 -184612 -63269 -747 6304 93924
32301 93924 165937 234039 164457 174610 167917 158507 138502 100596 76860 -2930 73538 112723
32289 112723 74137 -64014 -87999 -12607 68316 43476 9776 90867 118035 33200 -75369
32278 -75369 -96854 -13835 88461 124066 114992 67542 13234 123909 162320 202870 165163
32267 165163 145735 170547 -9463 -65346 -142998 -198904 -119654 -78025 49620 133079 152312
32256 152312 144938 155340 72633 45711 -65680 -1638 98962 62415 -53295 2898 63861
32245 63861 10537 -9569 73126 54894 30289 -55442 -56052 -37015 43549 69172 -22230 -49328
32233 -49328 -29975 -60440 -64191 9909 -70351 -152017 -135932 -86299 -80621 67625 113445 41773
32221 41773 -6658 -70496 -12363 87029 32558 -69673 -34258 126342 109316 -57017 52743
32210 52743 135837 132872 55155 19502 21427 59320 -26191 -51830 -20811 1916 -27756 -44150
32198 -44150 -70087 -42629 49710 80414 132888 132586 37522 -101025 -75044 -120323 -206431 -309302
32186 -309302 -183461 -62384 -29669 54971 50412 85341 92739 -38715 7860 78522 177775
32175 177775 143755 137080 88020 88169 280518 294252 242274 183701 105163 71451 113335 27322
32163 27322 -11049 -23754 -126188 -20876 -27980 -29629 15364 101934 144313 118225 106135 51430
32151 51430 2986 12994 -43610 -77652 -27954 -47914 -109768 -138836 -121234 -156168 -172816 -161440
32139 -161440 -125436 -80277 32100 -7082 -106919 -63867 -27030 34080 57087 -8301 -6904
32128 -6904 58146 123269 153968 183501 104034 85551 145175 170207 96474 -26051 -78703 -24620
32116 -24620 -70585 -146633 -185507 -198107 -83598 -55294 -53495 -22341 25291 -35370 -57901 -149496
32104 -149496 -199765 -148207 -18132 26901 7776 -26808 -8114 1109 17525 49962 60500
32093 60500 88851 -25970 -11969 92750 84357 69274 -23025 -7148 -63736 -176029 -171036
32082 -171036 -37307 156057 278243 264929 262915 128819 66361 119979 13445 -23391 -24060
32071 -24060 11651 11255 -21575 49783 225515 34039 -122233 -73327 -11340 109890 55119
32060 55119 -36322 1425 79978 131303 93587 69862 15844 -141394 -173961 -146242 -24615
32049 -24615 55918 -51443 -124392 -98896 -118675 -37295 77628 37353 -80772 -173864 -181043
32038 -181043 -56635 -41324 -155884 -96841 -25126 6594 -4110 -104646 -104165 -117772 13567
32027 13567 88908 78937 18296 109317 102768 20939 27286 -36472 14469 36443 34513 -52821
32015 -52821 23881 -16819 -53666 -94425 -17278 -49385 -21096 27191 153737 170254 136628
32004 136628 79500 26654 -13586 -96090 -112333 -44201 -44692 -88295 33371 95071 24855 -602
31992 -602 -29045 23985 124875 203125 181812 168219 209054 135682 22333 90563 145314 103490
31980 103490 35116 -68237 -159649 -193621 -167535 39810 55206 76261 100854 143979 133366
31969 133366 99765 92653 51398 -46752 -80036 -54135 -33936 -49005 -24781 -139418 -155022
31958 -155022 -30118 186522 165437 137117 125009 25266 -43359 23476 80787 43285 -36549
31947 -36549 -86358 -182092 -91020 40841 -1985 28328 54092 94684 -11062 3224 52370
31936 52370 32128 39379 69897 56862 8829 -91672 -32968 65697 142426 80964 -81593
31925 -81593 -95905 -6312 165253 115474 -9399 -74210 -74081 -66166 -26153 75375 -29933
31914 -29933 16477 -28925 -34486 55663 95111 100071 30973 17815 53102 60116 46706 120559
31902 120559 90865 -51456 -61544 -17146 4547 11306 10296 15832 -52612 -76654 -86468 48632
31890 48632 103821 -12197 -99881 -144211 -176899 -140757 -120405 -127471 -139136 -125978 -54978 7936
31878 7936 51979 116702 83261 98445 106628 66975 -22759 -96863 -161594 -225133 -169709 -68853
31866 -68853 -15160 -114110 -160199 -46751 1636 -65246 -64 16843 -12113 -77791 -35442
31855 -35442 -53428 -19507 45392 56330 124143 118585 69367 114516 207057 204054 28898 -110972
31843 -110972 -217556 -222725 -261611 -131535 -56231 -50023 -40471 -63115 -130170 -260120 -287843
31832 -287843 -199985 -147692 -102541 -164155 -140846 -133755 -85287 -110754 -124661 -100022 -86679 -161427
31820 -161427 -141553 -98614 -1607 -49891 19105 6338 -7955 -149201 -184844 -208564 -226449
31809 -226449 -126061 -68358 -32833 13767 134135 179304 107392 110242 175414 157308 -71584
31798 -71584 -133092 -128958 54808 27666 -7989 31028 48478 -25187 -231057 -279629 -194842
31787 -194842 -194193 -132581 19619 70565 83661 -29232 -58838 -57368 -57981 -74348 -19759 63850
31775 63850 85265 46778 -13768 -24392 -145725 -67912 -54674 -71117 22246 -28718 -140103
31764 -140103 -205795 -168169 -58299 62482 64965 115209 165818 212879 -11516 -205084 -120199
31753 -120199 -74428 -93820 -110790 -164951 -141671 -78487 303 -97596 -179584 -223378 -215668 -118030
31741 -118030 -42304 -45283 -115694 -47962 -66745 -83516 81260 196280 65349 114643 84214
31730 84214 51285 -16386 -64443 7083 50453 31807 -16760 6961 -87363 -142554 -133779 -274253
31718 -274253 -253189 -122856 -127895 -136281 -17389 163222 123912 -33396 47655 107538 -19717
31707 -19717 -44168 18734 26233 109305 273839 346013 251742 158274 151682 181245 175722 129086
31695 129086 83744 48539 84069 73214 74341 131402 236427 243838 180368 126427 61722 -12608
31683 -12608 -93217 -124256 -72610 -20212 73921 139639 81705 83489 -5526 -113584 -97185 -12197
31671 -12197 44898 -19534 -54350 18002 135211 85074 -7713 -72110 54165 109198 139428
31660 139428 120463 49063 -66511 -78766 -41582 16675 70635 -6134 66130 130978 66606
31649 66606 -1159 71968 96845 18553 -19174 -74618 -63603 -90383 -43817 112128 157414
31638 157414 71312 56531 107619 44083 -65541 -13596 -70935 -47236 -7096 -47506 -110547
31627 -110547 -43108 -120683 -118089 -127393 -178436 -169309 -136375 -120331 10186 127187 111901 48597
31615 48597 50093 80587 -3927 -72595 -9642 -14285 -22907 -9857 -17544 -1557 -46648 14788
31603 14788 204818 130507 -8132 -170743 -204808 -169654 -128268 -62331 -67692 -28355 -13149
31592 -13149 -9033 -77421 -110740 -78691 -97953 -14691 35558 148625 85126 2231 71811 113414
31580 113414 180165 50105 10076 64422 120579 126671 105203 -318 -14065 98257 135742
31569 135742 30164 -32218 -59051 2240 34833 36552 44513 27789 52855 12421 -4188 63488
31557 63488 14619 -65471 -196778 -246892 -271921 -210612 -189769 -100308 -149957 -95774 -68536
31546 -68536 2636 -79982 -44934 66809 71850 56781 31487 -48604 10961 84877 75188 -10799
31534 -10799 -61153 -78247 -35525 -55246 -71129 -137166 -108777 -163170 -132993 -10797 -57468
31523 -57468 -133570 -178705 -125603 -123606 -68450 -115544 -256469 -95356 20667 10580 42395
31512 42395 48761 47626 57090 70554 97417 -72311 -68646 -148556 -149848 -75403 -14342 -2122
31500 -2122 -6004 36771 63416 48430 183552 144369 -46546 -133815 -35264 -25138 -3873 99857
31488 99857 13531 -57281 -98043 -156801 -182060 -111862 -131019 -133198 -75357 -162034 -154132 -97671
31476 -97671 -106950 14787 93444 83718 140777 209658 222664 215125 195251 196159 186724 221175 199291
31463 199291 146727 171706 160580 99957 166672 158477 111937 88438 61851 45265 15876 107086
31451 107086 87877 94792 78141 65341 135496 83828 -14973 -38852 -63028 -9343 78956 128979
31439 128979 79696 2976 -94562 -186545 -159860 -17342 113530 68372 30917 69834 74612
31428 74612 -1865 -24809 81917 153799 243673 118278 34041 141038 89931 76658 36607
31417 36607 -6264 3952 -3525 -12710 -59711 25214 198785 240778 4975 -149382 -161537
31406 -161537 -133028 -53789 49144 14129 -41842 -11047 11600 -33624 -49800 -29347 8295
31395 8295 62777 123236 131646 99858 48421 -77566 -111761 -131640 -147241 -79335 19754 -21412
31383 -21412 -48305 -103185 -106906 -105980 -111951 -59277 -31691 101848 239991 194698 36968 -80897
31371 -80897 -211951 -171643 -102383 -13282 -62890 -147166 -90176 -4305 44112 95550 9176
31360 9176 -43846 -47393 1271 86094 -17906 -31467 -16055 -26312 99053 56755 8175 100944
31348 100944 135622 10746 21216 31966 -169390 -174966 -81189 -34688 -54907 649 -52053
31337 -52053 -6841 -10269 -8766 52468 106650 6956 -6087 -19928 -77129 -123010 -86713 -42180
31325 -42180 -7720 22096 -33962 -6750 11510 -38408 -101578 -7685 41178 71542 78362 16237
31313 16237 13072 -30735 12729 65948 -131 -151739 -246956 -297699 -266601 -93117 -47388
31302 -47388 -90053 -33879 -75097 -19018 19601 20424 121921 157035 96386 123966 236950 151485
31290 151485 34097 80766 140079 119868 38963 70209 56375 9434 209673 405395 291733
31279 291733 194147 172793 81427 28589 136747 158048 55372 55615 81691 34055 -52988
31268 -52988 -48335 -41446 -11502 70099 194922 110356 86593 63379 99331 99162 -9080 52089
31256 52089 216422 207401 265270 200465 162502 52823 41701 83608 32663 3620 77032
31245 77032 51853 -14333 -55077 -95159 -103401 -109879 -169434 -235673 -188480 -162941 -10199 22742
31233 22742 -102051 -8346 16625 -40975 -85464 -65814 -149968 -195297 -157612 -114625 -81722
31222 -81722 -103231 -29952 12539 -35952 -60664 -113010 -69329 29076 2773 15939 -31246 5130
31210 5130 93517 148215 187390 162367 81223 50009 26110 82975 140166 55277 24646 38242
31198 38242 -51716 -44986 -517 3946 -79579 -14301 6108 109175 140431 162325 70375 -4310
31186 -4310 -41346 -22594 -109140 -130654 -47224 -36418 -114312 -103275 -67297 47434 167588
31175 167588 164580 132284 96062 42043 44681 3047 53607 17256 -166181 -308884 -269122
31164 -269122 -169350 -133706 -114839 -4538 81976 29749 45822 252615 365758 237773 39309
31153 39309 19568 122625 170064 182225 67803 -23450 -13236 -3243 -41998 9956 100791
31142 100791 183150 101032 99820 -12949 -167886 -177688 -4181 84135 82652 20514 -3862
31131 -3862 32579 -96951 -54301 5832 -36174 -22260 22423 -167400 -126968 -10535 20999
31120 20999 -42232 -149311 -112278 -63807 -104161 -134146 -88694 -108150 25388 151659 124926
31109 124926 -2369 -2943 69918 -26280 -46894 -88050 -23252 92408 98075 26508 -20944 -31338
31097 -31338 -45902 -40861 -48378 75619 156005 142277 72263 84737 179365 149912 144701 114359
31085 114359 -28349 -74456 -5874 38617 119631 217092 224174 191126 97022 21254 -44115
31074 -44115 -72907 57063 177394 124559 56365 24169 -87458 -84118 -39279 6090 75382
31063 75382 100331 71412 78579 86133 3343 5362 -70357 -82064 -34917 -79672 -32228 67327
31051 67327 5769 -31174 -100015 -159562 -265230 -305671 -239691 -232690 -229941 -107076 -84170 -120032
31039 -120032 -119075 -146864 -41344 -39560 -31759 -131951 -233936 -107406 33631 103447 115235
31028 115235 -4843 50381 -31027 -78471 -176553 -269237 -275282 -90279 88612 173687 191432
31017 191432 177223 74738 59987 13125 -49139 -36703 -17258 27346 -52177 -34136 11501
31006 11501 -16830 -33650 -52711 -85014 -98835 -7718 -39384 -174325 -75225 -54156 -141535
30995 -141535 -110216 -181684 -195437 -1341 100567 14331 -105344 -150263 -215037 -149790 -166259
30984 -166259 -185692 -84201 109500 176520 129991 64080 48705 132536 198952 169862 33654
30973 33654 -100213 -111975 -132081 -142573 -132051 -147511 -99616 -119275 -139609 -62535 -41136
30962 -41136 50140 161239 114510 18783 56676 137568 191845 139216 78996 138001 98185
30951 98185 627 19000 -13004 -28274 1274 -135955 -123722 -31231 36185 79467 -17368
30940 -17368 -72642 58618 88154 30900 -30479 -120338 -8947 67143 18387 33209 93260
30929 93260 201112 114714 -783 51804 178110 205091 -419 -153550 -180856 -23946
30919 -23946 -54628 17121 -22944 -566 -98377 -194646 -131131 -81779 -115784 -137026 -159634 -124243
30907 -124243 -101361 -70962 -19866 -40945 5562 -61376 -16733 7808 -8035 -60752 31050
30896 31050 24977 -44115 -28742 50854 4242 -37917 -109775 -68956 18333 -27544 -80738 -55466
30884 -55466 -13645 17703 -1123 -42475 -111073 -166915 -102907 -14138 -29530 -15354 40692 -11680
30872 -11680 -82511 52995 145235 69869 61261 123806 174886 145628 201602 234652 251587 205071
30860 205071 96600 28182 -32196 -34321 -61476 -35138 -98579 -138571 -121175 -132703 -96003
30849 -96003 -29380 83449 124386 -2400 -1308 6894 -48366 -108322 -150382 -152326 23521 9920
30837 9920 -70966 -126491 -3015 70848 35791 53700 182791 136860 68268 31879 112458
30826 112458 66801 -142262 -91745 16800 63781 122055 115827 74554 117104 122451 96806
30815 96806 115909 198270 146127 123101 88028 116336 -17734 -66391 -49149 -116177 -116156 -62915
30803 -62915 -29532 -159767 -133752 -61202 -51639 -101968 -163771 -194064 -115297 -64966 41853
30792 41853 151599 182790 162897 73112 -67256 -149032 -126209 -164269 -139269 -266345 -227018
30781 -227018 -184304 -196579 -138815 -105942 28794 171768 221346 197411 128478 139323 119472
30770 119472 -40732 42720 79820 156401 206982 149122 79011 4612 -41367 -3771 -80180
30759 -80180 -49073 85086 131544 206015 258919 186816 107496 146268 70537 39467 -3385
30748 -3385 171045 283442 239276 -28833 31345 12470 -2793 48360 40783 -61147 -104409
30737 -104409 -56396 -18883 27022 88135 177850 183658 187643 107923 186246 134610 106765 45413
30725 45413 -524 36419 -14679 18752 -81394 -119545 -101779 -63746 -69343 2419 55823 111901
30713 111901 174897 54286 7337 21230 -50246 16022 -41670 -85849 -165630 -140032 -167982
30702 -167982 -102980 857 70560 90522 22843 23174 -2543 -3304 119934 186864 95382 93705
30690 93705 43155 118174 107625 -99992 -87854 31381 -5945 29174 129681 139228 84350
30679 84350 -9724 7291 58337 45624 21321 9044 -57702 -96693 -17296 27419 9321 44026
30667 44026 39546 68207 108194 144822 133125 85068 17776 27047 -55432 -53386 -18939 -22076
30655 -22076 -108070 -93198 -46471 39436 -43561 -191187 -216048 -52294 59656 138462 42827
30644 42827 -116728 -132928 -109322 -134344 -87617 -57177 -82637 -175071 -216277 -191604 -95010
30633 -95010 -138059 -146638 -218366 -233989 -16368 92248 -28451 -253040 -259524 -151762 -124688
30622 -124688 -54548 -33822 -83976 -137338 -88852 -68706 -105794 -102858 -79059 29745 20469 -140497
30610 -140497 -145682 -61562 -19731 111603 -4874 -154659 -200344 -178465 -209867 -267209 -262140
30599 -262140 -262024 -194693 -228814 -52177 -4325 -115013 -74259 -158721 -152788 -120 94075
30588 94075 125800 91470 90473 94542 89667 21778 -4549 72252 178846 125368 10659 35471
30576 35471 79451 179544 140802 238166 300286 159100 84739 165104 80408 -22881 -6431
30565 -6431 75374 -7431 -94500 -186540 -131933 -79019 -52813 -18989 -65670 -141764 -102786 -148149
30553 -148149 -242675 -175527 -171743 -122470 -12809 82193 123974 172562 36352 -111817 -68321
30542 -68321 19822 -21089 -145691 -94277 -104827 -118704 16561 -19002 -116797 14488 67290
30531 67290 12742 -3369 -7309 51381 -37362 -78463 -4940 120410 170770 83012 38200 27614
30519 27614 71274 166369 100487 106578 87024 -2781 62647 134468 60571 -19085 -56891 -13265
30507 -13265 41368 90212 131701 100242 78103 137612 229257 106652 24985 54299 48436 26247
30495 26247 -27088 -26403 -54139 12455 96302 75709 -40973 42026 156224 109089 -13848
30484 -13848 15649 128606 174196 173891 134515 156955 128111 39859 -6528 -123807 -150944 -11111
30472 -11111 39142 60549 -129715 -133704 -133796 -113987 -159610 -147003 -61178 -97823 -131924 -183317
30460 -183317 -167300 -149249 -153231 -55954 17637 -34455 -76489 -19014 105038 148107 161482
30449 161482 171868 -52834 25593 91691 -4891 21882 -13825 -60835 -22913 67819 103340
30438 103340 -13232 17052 40527 4362 30560 35407 25082 29625 -35326 94411 114492
30427 114492 127403 178871 150799 43877 37362 177550 197138 48592 -7864 13882 65560
30416 65560 73789 26707 -27807 -121339 -66681 -36009 30571 209466 247917 204364 124489 63811
30404 63811 70925 147236 208054 172236 176019 235227 169026 146989 18021 -30264 -44473 -79858
30392 -79858 -72862 -39506 69581 227066 188414 134330 72535 44564 120837 155233 198641
30381 198641 151498 41404 50354 107067 27008 9334 8370 -34693 -90852 -96822 -88159 -2376
30369 -2376 -58588 -16684 75216 140606 152183 74000 58547 122867 210931 86476 31051 -85960
30357 -85960 -80014 2006 31603 30733 91761 186139 198730 204996 168319 204806 147573 96829
30345 96829 114003 41427 -56197 59149 103008 85445 96192 -16587 -100618 -116055 -127290
30334 -127290 -67010 -20316 -80279 -28082 36890 -29457 -93051 -112944 -17647 32392 15608
30323 15608 16850 61907 -2144 -93809 -65463 27591 19077 -14313 34719 -72767 -161821 -169682
30311 -169682 -132485 -71702 -63285 45123 73616 90429 108522 23226 -97293 -127859 -172431
30300 -172431 -141923 -162949 -39389 -10707 91013 165327 54498 6537 79128 152399 98403
30289 98403 144725 131531 -3367 -125290 -107269 -97165 -43503 77766 111228 92800 17735
30278 17735 131118 8079 -140732 -124657 -39980 -79419 -101350 -47248 -71421 -48575 -25486
30267 -25486 -62154 -118274 -76201 -69803 -103763 20370 73982 155022 154997 64105 50211 3137
30255 3137 80143 172779 167061 134305 135393 43846 73066 174899 98346 3887 25202 74521
30243 74521 175427 6548 8929 59887 182166 266549 136721 -15823 -52080 -55635 10865
30232 10865 113229 55840 37942 -6373 37821 122154 62327 27290 128597 181689 153838
30221 153838 134465 158302 109130 48262 53879 1266 72259 101684 145959 148779 34604 120765
30209 120765 181429 167732 198311 142146 48128 51819 -42251 -131691 -218366 -132520 -5320
30198 -5320 -78808 -116157 -83447 -227424 -206569 -247645 -210149 -143348 -171020 -269016 -111985
30187 -111985 -41227 -4362 100598 120063 714 -72262 -32885 13739 142340 238717 98624
30176 98624 -19764 -19426 12662 6124 -10379 28757 69003 28634 110078 263538 355167 188725
30164 188725 69730 65225 99033 -9539 5183 133001 247465 188899 70003 -34471
30154 -34471 -20011 -15503 -15969 -106813 -153302 -110390 -52369 132053 269249 205019 8143 -194153
30142 -194153 -129180 -111286 -1028 -70764 -57197 20007 19951 -19193 22995 103458 167844 157475
30130 157475 39553 58243 101132 141230 126757 101723 104936 158229 183161 196617 208277
30119 208277 141797 45265 -35143 -101753 -74838 -9086 23555 -113989 -78934 -20219 20266
30108 20266 -77626 -109128 4348 56722 53111 163205 198511 183129 199132 195707 88189
30097 88189 -6736 17872 -1315 56419 146894 139101 4060 11599 -94910 -70572 60873
30086 60873 33683 -18552 20621 120620 202316 217843 116514 30015 71959 58054 78683
30075 78683 47871 116274 138986 129938 -5556 -48890 -96756 -67337 -58138 -135338 -86549 101820
30063 101820 33145 -138323 -4853 58530 -21832 -27430 5396 -25321 -84993 -100744 -38773
30052 -38773 -42197 -63373 -60404 -82789 -70919 -49299 -22074 235829 315545 172975 198618 233993
30040 233993 181064 -40793 -112043 -159897 -174006 -96974 -27760 -13905 -138407 -208480 -205156
30029 -205156 -199444 -252475 -256948 -96911 17021 122289 65936 11108 -54216 -64192 2038
30018 2038 95235 99017 90880 -2321 -31276 -18069 -109087 -68456 -12121 -6706 82293 142705
30006 142705 6588 -32379 14608 -12135 -46088 -45646 76559 116237 39063 -30779 7177
29995 7177 20977 83208 196929 81498 27946 -58456 50911 153035 190529 71368 -26454
29984 -26454 39564 17011 -90801 -60371 64338 -51784 -137720 -138291 -165184 -79808 -8393
29973 -8393 20942 66319 -58472 -126990 -31711 108023 165665 158265 232837 270564 105845
29962 105845 30389 84561 12572 -170745 -154932 -76541 -107124 -190629 -168241 -169372 -89824
29951 -89824 -43715 1694 -14540 -53048 21576 -64420 17366 19165 17870 74700 160194 127213
29939 127213 -104963 -111687 -67337 -31054 -32392 48595 99915 158773 208591 59861 -42578
29928 -42578 27666 94703 115813 190700 188529 101003 101273 15612 -47359 8542 -28378 -91967
29916 -91967 -92327 -37719 14953 70176 154875 73419 5541 8598 -43105 -123227 -133899 -91817
29904 -91817 29119 51944 105688 57984 37063 62087 89825 77849 52214 -26009 -4409
29893 -4409 73785 100972 72896 89292 126415 -338 -45835 42604 36930 -17405 -134383 -93050
29881 -93050 -84736 -138591 -143110 -177397 -204044 -212552 -164215 -184292 -71055 -50191 -102770 -117512
29869 -117512 -92279 -20653 -25348 -86610 -127058 -114687 -22082 64419 58074 88151 75369 130532
29857 130532 113739 171237 242449 197758 70122 -23424 -82246 -106755 -170567 -98686 -146419
29846 -146419 -61674 44543 63999 140478 145457 15738 -112065 -86498 -62361 -52693 -205861
29835 -205861 -387590 -369398 -325470 -268123 -227641 -199079 -161742 -137899 -225004 -355711 -256201
29824 -256201 -107567 -67415 -26196 -63161 19337 99497 204688 106325 121250 166393 124538
29813 124538 33995 -86272 -34770 -72991 -139446 -109240 1707 14711 -93920 -56670 22886
29802 22886 63272 54714 29772 -23367 -67160 -100777 -176907 -145517 -48688 11121 87887 29894
29790 29894 31362 44608 78559 73524 112865 -26436 -73252 22684 74583 74237 37976 30471
29778 30471 49032 -115719 -97243 -73771 -89795 -78109 -113558 -110245 -63200 -108012 -90814 -61930
29766 -61930 -122795 -125899 59520 -18770 -152661 -91877 -56951 62976 63502 -30981 -86489 -81299
29754 -81299 15416 122241 -95680 -164344 -84401 -89950 -11952 77431 107632 129781 146389
29743 146389 159822 147389 78447 85126 114999 179238 293765 328192 221276 87791 114257
29732 114257 96146 -87055 -30530 136831 84845 -7913 -100967 -175893 -122485 -153942 8951
29721 8951 147336 125076 187058 39769 -7208 35575 -74457 -55435 -94321 -247551 -282218
29710 -282218 -202989 -92206 20847 86684 139379 113487 -6274 -68040 -35401 -149012 -165587
29699 -165587 -138908 -178386 -134624 -74868 -55754 -124326 -242648 -249156 -132962 -115343 -58389
29688 -58389 -34994 48430 112490 -45594 -66472 -38405 130029 248908 205634 244798 126818
29677 126818 43784 113066 108675 -45843 -100192 -37118 42411 58909 147811 65563 -78780
29666 -78780 -82789 26085 -49061 -188757 -99429 -31070 78252 50758 -67078 -63909 486
29655 486 18936 -23107 -116298 -179614 -231486 -284533 -78520 -9254 2927 -51659 -196201 -207868
29643 -207868 -36945 -12409 77305 175559 140756 35793 -31483 -42283 -61054 -29813 18228
29632 18228 -8835 3267 -54273 -161550 -119126 -31737 62403 27827 -43642 -77306 32264
29621 32264 54817 2144 -6230 -32911 -29152 9145 -553 -74873 -62903 -50066 -63081 -69159
29609 -69159 -65182 8469 100418 34831 -50294 -59969 -93348 34135 -5391 80804 139078 109031
29597 109031 130158 52580 3369 37302 -53519 -64178 -36560 41234 49854 66034 103635 87262
29585 87262 -23428 -63764 -1982 -15640 -44637 -78758 -33099 -71722 -91775 -20094 138655
29574 138655 215425 223626 193067 19488 -74478 -97731 -110281 -20388 39631 61507 -7967
29563 -7967 -82471 5791 7010 -25938 -13150 -5374 -88595 -160745 -245856 -252554 -124068 36843
29551 36843 51919 6989 38563 121688 181188 124493 43653 -8265 -100293 -63914 -48999 28425
29539 28425 29897 54193 -52407 -145043 -59552 43476 110922 79992 128812 89315 107889
29528 107889 100272 -22494 -4858 15354 -16947 -153758 -198911 -67406 -12317 -7283 -141688
29517 -141688 -139459 -64959 -96368 -62021 -84467 -69026 103505 60237 -104440 -168857 -163308
29506 -163308 -66497 8182 70188 20404 -83991 -53247 23746 154447 170829 151364 26381
29495 26381 6159 129406 137121 -59642 -52392 19090 -36643 -158261 -125818 -128979 -106272 -139277
29483 -139277 -56626 -50717 -85171 -60184 -89536 -158798 -75486 -347 75974 70852 -13103 -139389
29471 -139389 -138049 -171565 -283056 -233607 -183377 -122906 68315 153442 199651 142055 -74208
29460 -74208 -154150 -91421 -50141 22072 -19690 -18387 53130 142970 182185 131037 56872 -14918
29448 -14918 -100799 -67361 29850 20186 -17741 -77910 -102735 3227 40051 -59676 -77461 -172300
29436 -172300 -193909 -196359 -106966 76761 170637 48375 -125974 -159066 -85837 -99102 -89848
29425 -89848 -21089 31191 -6545 8542 50151 75692 51359 17084 59051 139301 170087 108085
29413 108085 17437 -35184 2756 -12702 23688 75992 271794 302257 134112 40233 -3555
29402 -3555 66461 3939 33035 102996 89827 118237 125819 149792 104527 30896 39474 48129
29390 48129 44108 126695 182397 84266 34712 113506 117327 166124 222341 231230 212163 75598
29378 75598 -110246 -123833 -44546 -46598 -30335 -91833 -33997 119962 78310 120921 168163
29367 168163 109429 85384 112137 182828 202755 125505 158286 199851 164445 171098 60207
29356 60207 -57461 -2183 -12685 105836 147415 89494 8740 -79909 -82836 -4056 48337
29345 48337 76162 136133 184286 183316 128057 9294 21080 -58761 -178513 -184623 -112798 -57752
29333 -57752 -9970 24046 132022 91302 83671 62301 80807 147307 142925 132770 175073 139074
29321 139074 66572 71654 124486 145060 175459 46413 5830 -12461 -84011 -99005 -11662
29310 -11662 -4769 14360 -28143 -162354 -122181 -96896 -125281 -123500 -112119 5406 30199 72729
29298 72729 3859 3478 -50537 -124320 -139808 -88136 -21240 34542 44923 -59610 -214284 -60373
29286 -60373 55479 -67388 -60481 -50174 -25270 -13862 -44627 -88959 25417 184463 218860
29275 218860 225002 183899 34262 43429 30982 -23175 -54201 26811 64412 101479 56174 -7839
29263 -7839 -59009 24334 2829 -48282 -27154 28542 31782 -1917 -90774 -65758 -63614 -103620
29251 -103620 18310 93809 218816 95471 4121 65014 100778 5939 111176 100158 36787
29240 36787 35935 -13428 47697 -17673 -158952 -167474 -132775 -81683 -51547 -1229 -5373 402
29228 402 65422 97990 137388 125449 13006 -96583 -52615 -40834 87543 148167 138981 138455
29216 138455 -51187 -119894 -106363 -103396 -197879 -259302 -221155 -161169 -108094 -120544 -54026
29205 -54026 58777 163292 134086 38501 34233 85940 20315 -61343 -46092 11434 54094
29194 54094 118092 18886 6121 32271 -20315 -111995 -93072 -155120 -138011 -16192 16301
29183 16301 147544 254108 157806 59908 81557 17164 -8931 -6509 -17027 -100201 -63613
29172 -63613 76595 181197 82838 98368 12725 73480 104815 -61302 -72007 -20047 100514
29161 100514 211975 263070 123171 -28638 -93935 -72146 -6534 -22036 -98094 -92038 11663
29150 11663 13013 55782 69550 97679 2399 18314 115033 71204 83248 89234 95101 -23693
29138 -23693 -149053 -39203 53821 92657 6637 -92534 -148429 -156090 -158974 -141995 -157415 -83288
29126 -83288 -3397 -25778 77594 81078 149934 128805 81973 13513 -22982 -84077 -118245 -66637
29114 -66637 25875 -71819 -187283 -111801 -77104 -63705 -63710 -40254 -142170 -62498 18278 41233
29102 41233 53996 -50988 -78000 -133230 -37620 -11070 -92235 -89913 -1597 1733 31619 200461
29090 200461 261901 214480 69772 -75331 -111182 -169411 -157629 -37190 80962 84888 102636
29079 102636 91072 51676 188738 216631 92722 105829 59426 -25817 77405 103451 123909
29068 123909 72215 -22381 -5814 884 -37999 -134 25426 -77611 -24206 42317 -10939
29057 -10939 7703 -55053 16776 82275 186778 240784 253307 288700 132288 -38471 3049
29046 3049 67900 95152 3647 32760 1116 -71292 90217 183018 194419 168781 21242
29035 21242 -105845 -130495 -58994 -28502 155924 212247 139605 111002 125586 117254 93399
29024 93399 7222 22033 66959 39709 -32149 -50556 -125379 -106119 -69935 -97049 -65790 -5031
29012 -5031 50070 15107 -122443 -149616 -87639 -108369 -134368 -65312 -7433 45824 34299 -17185
29000 -17185 47589 77824 51487 19381 52174 112034 16665 -79476 -179885 -62689 61152
28989 61152 39232 -54788 -29152 135291 131103 68086 1410 56319 5623 31652 52113 78892
28977 78892 145463 238487 180966 75763 -53510 -10373 122615 156825 115192 45511 -37608
28966 -37608 -169668 -188550 -309723 -332160 -207264 -189161 -174961 -115180 -75951 -101436 -113500
28955 -113500 -202713 -32967 46319 54067 110771 158721 129143 68896 101889 69788 74955 59609
28943 59609 98824 188424 242170 162309 46619 -56718 -124635 -79912 -109120 -119340 -80478
28932 -80478 30316 115171 177213 233187 123813 72682 101985 34518 -10332 6577 16612
28921 16612 -46159 4212 125747 92641 70335 53530 45865 -34117 37889 90546 -19957
28910 -19957 45152 167265 301038 246184 138569 -21493 -90105 -70615 -65303 -64481 -163108
28899 -163108 -262059 -203232 -86018 7034 -17211 89247 79873 17376 -68657 -32872 -8587
28888 -8587 -38338 84306 148431 187749 213888 42224 -96814 -116573 -93903 -46998 123590
28877 123590 130289 55739 -12515 -128686 -139905 -119956 -92387 -80789 85922 106153 58248
28866 58248 67626 96973 -56721 -195588 -200204 -77990 77123 123726 142746 128672 101453
28855 101453 -6962 -43642 37055 98295 100509 41734 19598 -19520 35416 14386 -20672
28844 -20672 5047 73335 134722 86703 50781 16947 21310 -4134 -128492 -122698 -3328 44071
28832 44071 28271 -3207 -25439 28189 85015 79342 81202 -55628 -181614 -214668 -205601 -107250
28820 -107250 -36789 123534 118387 -60048 -2751 60937 92635 31782 -36324 -58212 -185265
28809 -185265 -220015 -99167 -128115 -70674 -124144 -201610 -116300 -27003 -68883 -2255 67921
28798 67921 141636 116098 -26644 -61572 30449 167351 238761 162914 138036 113616 124795
28787 124795 33842 -97383 -87807 26019 -6223 -69536 -77449 -25903 42537 123740 79959
28776 79959 33271 85345 84964 151579 26164 -12823 56221 67048 46968 -69844 -127958 -87031
28764 -87031 -140354 -53895 11195 64838 -17719 -187729 -196088 -136163 -68737 -92021 -55690 8048
28752 8048 78468 179265 97328 115473 136975 222681 262016 159642 5015 -35461 -100711
28741 -100711 -121840 -126626 -134980 -74757 50589 19436 5023 40438 32436 17655 -98857 -147078
28729 -147078 -21238 22734 -124266 -78668 58483 105227 110760 45265 -48435 11903 43076
28718 43076 94292 31372 84031 25374 54254 70577 54940 2267 -44304 12757 126646
28707 126646 65139 -6472 -88755 -122774 -62977 -4256 -22450 -43299 5500 -12284 -49182
28696 -49182 32586 15385 -79361 -88501 -79202 -164148 -178575 -189987 -59700 87126 142196 75000
28684 75000 40221 26975 89723 128767 23098 -22375 -20094 -35117 16560 170408 153721
28673 153721 42671 81510 124321 125554 36324 2209 99724 65452 26009 67829 -6764
28662 -6764 -190794 -259832 -176008 -46548 -93977 -199222 -169150 -158591 -169556 -165076 -153892
28651 -153892 -178228 -72880 -22858 56962 99441 79656 -8716 -52501 -92259 -133192 -110813
28640 -110813 -71507 523 -58460 -93562 -80136 -31838 91296 79216 108585 36266 -153321
28629 -153321 -44368 42926 -12962 -162311 -200968 -131783 -91641 -206613 -157834 -8248 22128
28618 22128 78907 127639 93728 49304 9247 9750 32980 52437 88227 13512 -86893 -147313
28606 -147313 -114933 -146762 -29950 552 -9328 58864 224054 197596 122700 108272 146722
28595 146722 74310 35452 -66257 -128388 -146195 -98581 -23506 6536 -44443 -112390 -145214
28584 -145214 -128151 -100826 -46778 -99272 -89878 -182 67953 106656 73200 99696 89224 86272
28572 86272 38089 24831 51996 29035 -8325 -15156 48504 93382 80629 125257 139020 91616
28560 91616 56957 37476 -88390 -59064 -4911 9200 -40985 -153601 -26791 87663 139854
28549 139854 156976 180838 225158 186617 102514 93612 147453 108168 50341 35501 60480 -26734
28537 -26734 -52314 -18149 -95759 -185073 -113289 -137960 -180608 -146430 -44980 80182 203606
28526 203606 212497 16279 -46093 74413 110785 107074 -46832 86473 111998 105342 110049
28515 110049 -24596 -153040 -57586 45327 31298 112113 30684 41466 131466 153980 118245
28504 118245 -238 21655 83281 181738 207800 164853 160321 194374 61666 67278 35575
28493 35575 14353 44458 38118 -10839 -90774 -168959 -127210 -123474 -147991 -126911 -67809 6491
28481 6491 -57125 -108066 24055 -49829 -72934 -57316 -46130 -9130 44120 -12516 41759 4050
28469 4050 -13509 83343 31165 36622 37523 -59958 -116869 -167679 -106808 -50297 50180 55797
28457 55797 42123 74707 36544 -129975 -175100 -149366 -100695 -70725 -104538 -74765 45898
28446 45898 88324 73252 57492 42623 -40255 -88860 -184801 -227879 -63120 -10366 -193390
28435 -193390 -327498 -270998 -191416 -168174 -91422 71566 169731 35805 128936 185751 92751
28424 92751 49744 128331 123194 62933 -7853 13736 10329 103863 262391 280473 259367 207646
28412 207646 142277 48736 12914 62414 -37233 -34435 35990 -107015 -271820 -349874 -158366
28401 -158366 -12005 -4210 -7176 -32532 -143221 -188783 -83979 -12548 -80021 -22914 100458
28390 100458 105141 60360 26595 32988 -3260 74789 75378 83842 -66177 -316628 -154815 74025
28378 74025 48426 340 -37886 -71872 -104947 -212702 -178727 -41832 -73952 -153785 -182060
28367 -182060 -84999 -122790 -207404 -263356 -103034 -5186 6315 75422 71471 -33388 -102919
28356 -102919 -76658 -62102 -17299 61016 122188 169517 33072 -96481 -60931 -32694 -6881
28345 -6881 42090 160241 136996 127012 -46767 -237819 -248432 -187390 -133890 -97547 13262
28334 13262 40820 -2691 -82079 -75643 92743 157320 165383 239318 288082 349250 293247 218703
28322 218703 79005 5372 52180 41165 51462 100600 139340 50583 -105399 -223565 -226629
28311 -226629 -211557 -271453 -185314 -45249 62767 11374 5415 -30284 -45511 -66537 -45195
28300 -45195 -6957 -63051 -173208 -184502 -83429 -45220 -50172 -130548 -30438 84757 70771
28289 70771 28085 79696 163480 76923 23428 60691 136645 132735 3284 -125048 -218441
28278 -218441 -191365 -93562 -148744 -151783 -169519 -235762 -201596 -311783 -278758 -174190 -60255
28267 -60255 2644 73763 78897 110787 103776 41984 48128 50275 -30117 1913 18244 59728
28255 59728 70198 60827 156537 156459 61489 -54592 -42633 4509 -42936 -73737 -112386 -56792
28243 -56792 -41567 39020 112743 123389 32593 -21061 23579 46206 133486 127766 -34442 -72141
28231 -72141 -95672 15188 167185 200566 182974 190946 42858 -7928 -70936 -47838 -14381
28220 -14381 59592 128436 75143 84567 89775 101551 38899 71836 65075 20769 103408 167068
28208 167068 136231 62072 16794 50222 82813 146166 127856 123424 75507 -46409 -64779
28197 -64779 -59576 -97247 -208880 -117381 66944 160175 275329 235129 124582 101202 -24
28186 -24 -76580 -25202 12985 27597 95757 5414 -14035 7880 75710 83484 -35504 -62782
28174 -62782 1221 1221 -74334 -98960 -25611 -42247 -121914 -220132 -207770 -40000 -34427 -129066
28162 -129066 -86198 -73435 -95119 -63493 -84315 -201691 -230827 -242180 -102312 107010 189066
28151 189066 118386 2615 25380 -24477 15831 -50658 24752 90553 -10438 -98055 -60144
28140 -60144 -14996 41319 78365 110356 109553 49773 168004 197353 165896 63561 -15070 11488
28128 11488 -1707 -59182 -90352 -173563 -247049 -157106 -69795 -62009 -56298 -96187 -86373 -52210
28116 -52210 97220 -162425 -234000 -153437 -91491 -12480 -63933 -160902 -191747 -154628 -66179
28105 -66179 -34430 -70929 -14110 -108700 -128496 -17982 -865 -104225 -221303 -240487 -195243
28094 -195243 -68352 -51055 -131956 -139647 29619 192289 117157 88564 119928 160383 128766
28083 128766 30820 -8865 -37616 6737 61381 177414 200394 199376 142206 144504 73732 8991
28071 8991 -23139 86680 149297 102876 -22570 55580 36988 -33507 29510 82234 88639 10021
28059 10021 -77260 36544 58285 -49676 -96753 -28711 -13482 32859 -8041 14070 83801
28048 83801 47536 53217 2412 -22756 -41909 -89187 -69100 -64486 -127876 -149204 -110131 8548
28036 8548 117092 100013 53604 94415 168762 222560 161750 55462 60449 13517 10629 95840
28024 95840 123917 149013 146478 187873 105334 121041 246868 366590 391646 225161 152150
28013 152150 2890 -36996 3683 -1456 -48521 -79372 -3666 -40117 -7495 61140 62417 152279
28001 152279 167535 178001 204973 98733 46928 -95434 -186791 -92776 -137286 -76952 -25602
27990 -25602 -1777 85546 -1696 -130805 -92026 -28491 60883 -24092 -86556 -153270 -97052
27979 -97052 -77596 -167243 -170624 -207742 -202282 -127975 -38313 -90687 -176495 -215615 -251452 -284283
27967 -284283 -212236 -143534 -223151 -227211 -151539 -118712 -9305 77394 44344 -24428 -164089
27956 -164089 -182531 -84756 -2480 119001 146579 101567 24882 19406 -55836 -108525 -129205
27945 -129205 -168738 -167718 -140013 -42660 -100935 -172467 -58597 -51448 -151498 -229606 -179006
27934 -179006 -135633 -67171 -84029 -4098 -70545 -120466 -116334 -91803 -129618 -101399 -60988 -145540
27922 -145540 -290359 -278092 -144399 -71698 -114597 -85899 -26566 12403 6702 -21055 69701
27911 69701 106277 39722 -100774 -229100 -211395 -49117 -16743 -190420 -255966 -150945 -30374
27900 -30374 -67522 23015 -58845 -6124 64169 14444 -143381 -157940 -89150 -49048 -37227
27889 -37227 -14051 -15213 -171297 -249805 -164833 -177596 -276674 -206677 -32940 -64648 -101048
27878 -101048 -121103 26360 7199 4418 4195 37179 16390 -67332 -85358 52827 113048 37088
27866 37088 179526 263474 266254 210361 134815 114622 138067 223003 175402 61519 81550
27855 81550 101121 98714 41276 -28644 -5606 -38030 -51002 -116982 -150724 -73330 -40370 -95426
27843 -95426 -186685 -259174 -240585 -136006 -69247 -42433 -83692 -125754 -95413 -85775 -60467 -19152
27831 -19152 -23811 -66654 5661 -9131 -20563 47656 47594 -2334 20764 27963 -99147 17958
27819 17958 176580 105208 45754 66249 98502 69186 -35990 -128706 -101564 -29816 -96976
27808 -96976 -177465 -192404 -182857 -250748 -293104 -224667 -160764 -55155 65092 98945 -33888
27797 -33888 -58531 -65111 32719 34779 27376 58505 60264 18293 4995 -90348 -102988 -160828
27785 -160828 -134776 -103101 -56420 -142370 -164314 -41762 -3962 28599 67204 76822 187410
27774 187410 256782 217839 172459 232148 126230 92036 120284 44242 -46237 -68298 60867
27763 60867 91670 164771 209672 127646 96374 26618 82832 48294 -59069 5506 159735
27752 159735 119231 137025 46433 -84944 -178167 -52222 136394 19116 38564 122238 117790
27741 117790 83715 -42652 -152302 -65893 32002 -19370 -103575 -75083 21022 -60431 -62588
27730 -62588 -2334 -11301 18118 58128 61253 9967 -60282 -62011 -59415 -151020 -92400 -5687
27718 -5687 -34978 -7491 37565 -2619 -40615 -39811 -22242 86983 149908 86623 179864 161550
27706 161550 -32820 -138618 -104136 -148881 -46378 84205 142461 112675 99902 60901 78670
27695 78670 70361 142631 154103 130245 149647 56551 68687 208285 225493 114841 -35959
27684 -35959 -120350 -81624 -50296 6421 -14478 -10852 -40509 -134345 -26439 -115617 -175127 -201729
27672 -201729 -85990 -20025 6741 -20284 -65590 -391 -61727 52837 -36614 -213431 -112213
27661 -112213 -55794 7651 88975 120879 26150 -75724 -87488 -15574 -97433 -201307 -182891
27650 -182891 -60109 6296 -58760 8201 155316 250523 224261 125530 113892 64959 92789
27639 92789 -52754 -24677 -42247 21371 129337 99562 26744 -792 45708 111429 164432
27628 164432 100510 42583 -67093 -109804 -26821 48117 116685 167300 155954 183750 106843
27617 106843 77803 149973 81715 -31687 50087 8391 -7487 44114 80499 67866 152914
27606 152914 113485 83924 -37687 -62966 3655 -19949 -40475 -47807 -48056 34338 166399 188028
27594 188028 209928 65002 -7693 111136 121113 199008 239155 275369 256360 154556 149906
27583 149906 128885 -6998 -135427 -167822 -136384 -162294 -108033 -21354 63227 165066 134333
27572 134333 7132 51660 94467 -7735 -80822 -86659 -52147 -17992 -84813 -138814 -157243
27561 -157243 -81234 -88911 -269977 -270078 -287027 -224003 -146721 -43007 -71511 -118409 -125134 -81161
27549 -81161 -13619 86853 108992 -37657 -94143 -84776 -138889 -104445 -11300 177071 210250
27538 210250 117814 -12885 80295 111319 91543 48828 7960 -42918 58793 63504 -22892
27527 -22892 -55043 68886 85441 16879 77594 193462 176704 187613 83252 48581 46213
27516 46213 -10981 -13881 -29546 -114612 -56331 -124292 -105873 -62001 48936 52202 97951 76934
27504 76934 -61929 -136532 -167509 -213811 -236359 -117046 -105869 -204288 -162529 13730 85586
27493 85586 105538 38122 22351 14800 56745 -72040 -115388 -138375 -61304 -77679 20994 90639
27481 90639 32932 10654 -107895 -236010 -232018 -208832 -147007 -98789 -100003 -26059 -37639 -4655
27469 -4655 37694 27813 32876 76400 79510 57775 131395 106848 -22062 -35975 -90338 -111731
27457 -111731 -134308 -211134 -232198 -236003 -96048 -147328 -160910 -22490 56536 68654 -74753
27446 -74753 -51525 -42035 -56098 -26613 -71640 -129487 -234585 -282459 -243559 -285284 -204413 -151355
27434 -151355 -94357 62336 69017 -6201 -13390 -42683 -90706 -21139 119423 150625 98251
27423 98251 162464 95828 -13153 -53255 -132471 -61063 58922 47384 78803 174455 139579
27412 139579 75396 90811 113738 172173 245644 288733 146601 115550 145999 30761 -54128
27401 -54128 -43673 -31293 -54682 -91981 -21169 11416 -69623 -4351 97921 73333 55432
27390 55432 59256 105646 86254 9932 -84609 -131149 -160490 -174617 -144525 -154336 -103081 -12088
27378 -12088 79096 144633 176995 39154 -8013 46145 76700 -13053 60603 109669 75230
27367 75230 4492 125367 193222 60546 4730 -81106 -90659 -23503 31115 -39475 -20139
27356 -20139 29657 -31776 -118841 -206006 -156869 -106251 -35436 49929 61205 -35558 -18145 123095
27344 123095 230726 128178 118520 72598 47107 -17045 -57652 -11226 29516 -45178 -53933
27333 -53933 -71902 -150084 -149715 -168286 -134864 -108238 -95137 -42759 -4242 57225 60700 158163
27321 158163 82094 -97519 -236618 -217038 -217774 -128247 2650 56258 -34977 -141251 -89013
27310 -89013 70254 93230 207218 118717 33803 57419 95311 -10845 4293 21567 -4637
27299 -4637 36060 -86482 -93853 -85321 -67489 -2247 -23897 -31781 -1576 73331 57537 30975
27287 30975 77592 142462 154632 52561 -10810 38380 51499 -17349 -105414 -136905 -69246
27276 -69246 -44776 -34162 -9877 -2329 27630 -17987 -110558 -180701 -118003 -72979 -121129 -95130
27264 -95130 79488 87880 81819 193988 117876 128218 94972 104157 137540 105676 -10744 -43806
27252 -43806 -155801 -212850 -111782 -141158 -120875 33481 34496 19059 45814 13636 -36132
27241 -36132 -32013 42311 117577 -11794 -77285 -118919 -65065 4748 44800 35665 -3248 6412
27229 6412 -4367 3657 -76443 -114619 -28096 -53812 -44358 2688 42209 -61230 -165061 -33712
27217 -33712 -82327 -74834 27926 -15432 -78264 -63466 -39025 -57408 -83098 12594 68946 24798
27205 24798 -92404 -149285 -87375 -74897 -169580 -137377 -93354 -142225 -113472 68147 79318
27194 79318 -24562 -3193 56472 -27245 -5429 2905 11789 -73063 -97976 -215458 -259798 -140555
27182 -140555 -111916 -234636 -186937 -214502 -219422 -98743 98581 178818 132678 104053 118969
27171 118969 123399 96399 113192 72877 -52989 -208068 -259206 -182158 -143166 -84558 -50717
27160 -50717 -43724 -18754 19369 46047 21285 15444 -30684 -106819 -129266 -173240 -134041 -118797
27148 -118797 -30554 -58138 -111651 -87640 -47023 -102001 -59266 -40127 -108516 -144701 -123574
27137 -123574 -72311 -55684 -63466 -29054 30133 -4965 -37056 -67623 -69188 -84374 -92551 -105606
27125 -105606 -212295 -299507 -272917 -147730 -59588 -115294 -185607 -99879 -106336 -123541 -121086
27114 -121086 -133846 -35713 55538 128442 38164 -72091 -136106 -113379 -74237 -132716 -181205
27103 -181205 -189168 -139308 -131679 -106828 -170567 -152161 -103420 5905 66277 -21054 -182199
27092 -182199 -118603 73737 87563 66894 -18205 -91449 -39017 10092 -81665 -75029 9419
27081 9419 78359 110295 218949 85687 5401 23080 -67686 -32971 -33700 -13781 61036 92471
27069 92471 139455 149210 53699 61450 41051 7513 -80808 -68685 91823 154111 132053 133671
27057 133671 4101 -128643 -29494 117648 92955 185954 265495 124574 -26355 -17295 11556
27046 11556 24102 22320 62186 3578 42750 91976 144607 146956 182340 212177 190710 162540
27034 162540 185409 136776 62887 25405 17192 -5154 -55528 -24263 104200 132601 34724
27023 34724 -86879 -129900 -129153 -83462 -8910 70719 76978 -40435 -143082 -99123 -11131 24636
27011 24636 46031 -19426 -127495 -129315 16783 95443 2960 -57196 -822 -13841 44503
27000 44503 -27054 -61001 -65464 -136467 -95423 -168956 -173416 48693 126348 107798 -31173 -188569
26988 -188569 -93849 9612 65058 2634 -85771 82902 169099 142247 160037 97560 121238
26977 121238 275899 286244 197771 79892 109802 130453 89263 -34271 -62214 -168907 -153410
26966 -153410 2468 59708 122052 193179 146101 53860 -26216 5937 60968 153898 197256
26955 197256 161022 113066 96549 137483 92058 -1817 -127913 -17859 202369 120792 100265
26944 100265 112148 174610 230425 205880 161848 54995 -63337 -31748 -33518 38058 46442
26933 46442 140710 140279 77408 -1503 80919 76053 -22228 -99920 -49244 23371 70269 -2387
26921 -2387 -101748 21630 104145 203721 128260 80917 217158 411212 364634 174238 95461
26910 95461 23688 12718 12488 -7865 -100677 -157701 -176796 -233825 -332721 -387116 -211560 -120831
26898 -120831 -160734 -175391 -81887 -144376 -105122 -73575 -120950 -157528 -71827 34037 -24861
26887 -24861 -62063 -44705 60890 157446 146228 62395 58903 70009 85729 79396 -67588 -223635
26875 -223635 -113001 55836 34872 30636 -13394 -116006 -116487 -40359 -46442 -115853 -103666 -99856
26863 -99856 58774 88444 -35331 -142816 -182110 -188681 -66158 87830 55982 18443 -49495
26852 -49495 -10478 42596 70969 89856 117485 104635 71582 45453 -50893 -96107 -17391 33308
26840 33308 19657 -68134 -23833 -45958 -59178 -90185 -148131 -182432 -101479 -115781 -154259 -132053
26828 -132053 -37751 81067 63739 10395 76065 51540 -19915 -66934 -88261 -68463 -48176
26817 -48176 -6823 -33591 -79759 23507 22658 -32896 8958 15373 34893 -74963 -21372 -29179
26805 -29179 -111088 -36966 97373 185841 229535 126205 5519 24444 -72694 -72881 -85915
26794 -85915 -36051 118606 141238 69469 -67043 -167625 -163162 -93261 -87021 -96585 -122937 -202245
26782 -202245 -96861 -10729 -116588 -178675 -52218 -12772 -17723 56006 101496 -24431 -75407
26771 -75407 -70079 -59185 -33132 -14575 -135695 -169508 -141136 -223140 -108762 -56899 -106810
26760 -106810 -219825 -237532 -226598 -258391 -296091 -242013 -151314 -21189 118759 39776 -154112
26749 -154112 -240789 -163819 -20648 -20688 -118046 -150537 -81367 -77553 -57913 21371 -69799 -205736
26737 -205736 -228324 -242033 -271980 -161451 -81562 -145006 -212836 -187913 -124808 -128166 -56599
26726 -56599 7723 -66239 -182315 -176742 -220722 -246198 -104465 -20069 -16152 49839 169143
26715 169143 175147 108311 129347 54130 -45693 -74805 3187 13353 -113145 -132307 -46673
26704 -46673 109942 244313 193067 118922 153519 206978 224449 138068 162165 73399 -26352
26693 -26352 129534 172247 128501 107927 80319 75726 113136 64466 44455 -26580 1607 -53482
26681 -53482 -107725 -6117 -51823 -49672 -110975 -276064 -361281 -349816 -179272 57704 164181
26670 164181 107069 -53227 -111728 -83597 -36736 -28633 58865 15395 116874 86389 177266
26659 177266 326224 230071 106433 89757 140385 172986 6377 -112730 -79728 -58696 27657
26648 27657 114267 143574 80085 28343 49403 136207 150051 112986 -5104 -94666 -155265
26637 -155265 -191733 -103219 -21823 6204 -32855 -46479 -33587 -87213 -67105 142295 116951
26626 116951 -17329 -53387 -135434 -79234 11819 97214 115069 107122 83663 61376 15655
26615 15655 44807 -34169 69618 179289 213906 185797 152496 37386 -22145 -125818 -20185
26604 -20185 65386 2393 107463 182482 46043 -46146 -112275 -88751 -80986 83728 139530
26593 139530 34001 -21140 46134 102820 82691 1418 -125435 -126223 -43087 48724 15910
26582 15910 -13759 -47089 -141909 32640 179288 111838 60935 71502 -3460 -55951 -51966
26571 -51966 -33955 6636 -98725 -209626 -196685 -27880 11482 15285 105644 218580 276470
26560 276470 270383 126276 174678 98811 80088 10844 -14548 -49166 -2713 -87667 -32606
26549 -32606 28398 135442 264254 285366 208433 111413 41958 -73378 -89576 -6130 18711
26538 18711 -80997 -131480 -118185 -25088 6754 108575 150799 192397 191638 145441 93325 35872
26526 35872 79717 160172 134584 -9790 -126133 -49763 46467 -33569 -12596 101676 201389
26515 201389 237811 261479 236295 212215 223690 185713 33580 15861 69879 87679 244181
26504 244181 264858 142060 -119071 -166596 -131221 -109971 -57680 -120676 -205928 -194687 -139583
26493 -139583 -56639 -6094 -45781 -96504 -95933 -74064 -223002 -265089 -199795 -122172 -24016 113096
26481 113096 89734 -28318 66031 82704 120210 119769 167308 169169 139252 -405 -33105 14400
26469 14400 213178 267103 208489 123852 210622 149943 44982 -61824 -21069 -40402 -20206
26458 -20206 -11295 -87656 -99809 -11349 21577 -28184 -39920 -43260 -59085 -35135 -91486 -228993
26446 -228993 -91947 81287 26643 63986 9132 -78339 -52251 11072 118177 178659 104402
26435 104402 103987 10558 -105051 -116001 50648 134566 161414 70434 106087 79924 5439
26424 5439 -1678 53941 80316 53743 35645 -76244 -61486 -96199 -25331 40980 14857 -59796
26412 -59796 -72125 -113699 9026 90613 25581 80600 32974 7486 -14575 -62936 -25851
26401 -25851 -48216 -31002 -22730 -91859 -101497 -64125 -133205 -193784 -277189 -355405 -194050 -98118
26389 -98118 -125831 -147547 -139642 -51218 -37395 -86615 -131724 -102010 -97318 -109421 -57658 55711
26377 55711 121845 29072 -58162 -99388 -111604 -161941 -171515 -136570 -87037 -154514 -185044 -268921
26365 -268921 -248801 -66183 -112279 -210569 -261475 -137951 8853 -113706 -204786 -71183
26355 -71183 55801 65119 -49362 -91888 -99722 -63261 -106149 -61019 -30501 57391 132346 90884
26343 90884 135664 -29178 -107892 -89375 -97809 42257 106369 76921 -13555 -65937 -106380
26332 -106380 -51196 -146515 -60626 20887 91611 145467 131919 161936 90425 108698 -25398
26321 -25398 -144290 -119811 -82026 13266 111623 126918 54546 -10248 -25005 -30756 -24148 -1397
26309 -1397 4239 -27603 16071 -10056 -41321 -33624 59547 18027 -37908 -61121 -151407 -60141
26297 -60141 -22411 -103983 -144108 -106325 -51176 -57039 -57188 -27290 -80669 -92632 -87878 1590
26285 1590 26273 72642 -117711 -144174 13051 106561 133224 97023 40110 -114025 -126380
26274 -126380 -25519 -89594 -125862 -135803 -59949 69331 33385 125632 80879 93573 62154
26263 62154 -51735 -42506 -8535 -97853 -70945 54649 186014 96599 40876 99394 20631
26252 20631 10150 10538 42418 94880 162844 132543 71757 66117 89825 47568 46740 24692 -22550
26239 -22550 -47904 -131929 -146430 -202902 -141201 -63104 69769 69396 157636 179593 109184 -26591
26227 -26591 -76433 43295 21416 -22934 3404 -68211 -91259 -101565 42411 23779 91253
26216 91253 100524 190488 67684 20940 19162 44073 36048 -49183 -117268 -28501 87018 6932
26204 6932 -77573 -165665 -157908 -177226 -97414 -113117 -116585 -40996 63338 -65668 -97913 -116397
26192 -116397 -52756 -3261 -14753 -127404 -280962 -247848 -123889 -58434 -52596 -21713 -21125
26181 -21125 67514 93826 60846 -16269 -45461 -199020 -47912 120435 175233 51400 45701
26170 45701 39313 23576 70947 5654 -64173 -76578 -183644 -157952 -90924 -28525 -178748
26159 -178748 -127092 -15353 -61491 -57755 2434 -25924 -51664 -18751 37049 -5533 -52144
26148 -52144 -70434 3384 52767 13928 13714 1329 -69236 -8807 18878 -25195 -103969 -108849
26136 -108849 -68880 32322 47866 148784 151387 249277 269954 253010 164936 59700 64945
26125 64945 173878 186852 163225 134783 19631 -55334 84450 163065 143169 151627 186519
26114 186519 153169 74947 54699 86355 -5577 -53554 50926 136719 -6670 -135191 -99737
26103 -99737 -50353 -77611 -55379 30458 -68607 -154168 -221538 -155262 -145965 -57040 -24119 34184
26091 34184 100246 116996 108749 25047 -24012 -83737 -72631 42081 51982 -63167 -125488 -157863
26079 -157863 -293534 -292030 -191396 -81048 -47164 29404 68296 -810 35665 88513 65874
26068 65874 -10842 -41260 -41499 -51688 -125389 -111098 -86920 11672 -82598 -117286 -78291 -76051
26056 -76051 -496 30369 52191 -5677 92958 101202 78005 -17759 78303 237111 282282 272233
26044 272233 250231 222003 101773 34393 38013 165308 273181 262634 224860 176270 90989
26033 90989 43027 88812 100556 151819 28996 -78801 -39490 -112266 75102 157520 -4553
26022 -4553 -181619 -172503 -174902 -47290 -7698 119265 118155 18580 18 16701 69845 -64645
26010 -64645 -160609 -185933 -33851 113208 153573 106213 92038 24771 -42539 -21190 -36302
25999 -36302 -164996 -234237 -60424 -90376 -190632 -81304 -52253 -91394 -98229 -68866 -57829
25988 -57829 -17200 22625 20067 -65744 -162264 -185533 -83484 -12294 -3357 -51595 -65549 24923
25976 24923 33117 9165 34305 -16928 -38647 -18213 10840 74221 157632 205592 173156 147210
25964 147210 120942 41198 33274 66017 -84933 -115057 -178233 -209014 -130339 -111764 -152756
25953 -152756 -28318 90665 201903 178395 111992 54408 56452 39955 53092 -10681 -26697
25942 -26697 -81004 -180695 -131565 -17539 -7306 -38562 -35375 -69683 -58900 -39980 -84698 -211743
25930 -211743 -132506 -36883 -15632 39880 -19369 122771 144342 22597 -25920 -69999 -68290
25919 -68290 -160625 -161765 32379 41084 -115040 -35011 -46523 -11464 -28233 -62027 11078 -18884
25907 -18884 -28082 -43693 -176411 -294718 -197524 -163358 -172634 -244958 -281976 -168427 -102634
25896 -102634 -159236 -209157 -222081 -193627 -110321 -21060 -20363 -111749 -73456 -85532 21745 137738
25884 137738 121825 72514 -6374 -64445 -164115 -111421 -27051 71168 94394 30218 -26078
25873 -26078 -11533 -80818 -52295 -31889 -10788 -37708 8177 85359 122761 47864 69321 101042
25861 101042 100510 43976 60023 3480 -83812 -208721 -256577 -228584 -47385 6374 -62827
25850 -62827 -79106 -78927 -130952 -116629 -116979 -139599 -90360 -75132 286 -43003 53898 185122
25838 185122 187033 142006 23638 -99760 -47010 -95842 -98318 -71293 -111403 -159884 -74200
25827 -74200 -196628 -117847 22936 96402 145778 61161 -17511 -16216 25670 58363 34990
25816 34990 45960 92278 119007 154334 199874 205145 75059 -14588 -19699 -39065 -17087 -83997
25804 -83997 -157161 -138487 -177441 -207479 -125844 -102700 -124133 -136570 -172097 -100186 -37311 -10547
25792 -10547 17334 16057 29515 -17238 77831 100309 45850 -31983 -138621 -115817 -56680 -12649
25780 -12649 -48018 -93500 -148664 -204278 -226115 -193409 -191448 -206015 -159381 -52079 -81926 -161215
25768 -161215 -149511 -260739 -244126 -153300 -148017 -30484 53603 38499 -98879 -170835 -175703
25757 -175703 -110139 -132930 -190840 -159628 -105873 82954 143299 120517 179776 264948 322955
25746 322955 395716 194020 57147 27048 119097 106403 41999 -16136 -72916 -65571 -114090
25735 -114090 -83289 -56829 32211 116907 51840 -34405 -90805 -68866 -128901 -160373 -13773
25724 -13773 98238 137651 127344 126799 209403 121018 -6137 -130053 -86462 21394 90122
25713 90122 151671 38361 -51137 -40614 165803 169694 153451 121210 47612 20381 18663 58010
25701 58010 77608 44233 77105 6347 -3075 -52771 -60841 11975 15641 -106678 -124046 -68340
25689 -68340 59316 137562 118866 26512 -88090 -42264 -4813 17075 88248 68079 110149
25678 110149 83420 77215 50825 85067 141839 128973 97074 -44801 -156359 -205263 -60106
25667 -60106 10467 -98275 -98601 -115565 -145449 -142628 -98613 -55946 -123777 -182229 -172915 -93348
25655 -93348 -139606 -197931 -158444 -125102 -47362 -13919 -73831 -160708 -177297 -164282 -158780 -121529
25643 -121529 -151583 -13406 131944 91597 26765 12794 57538 34798 -66654 -19341 23112
25632 23112 12516 71784 68975 -21977 -59352 -24157 -14487 54649 65753 -96979 -106667 27662
25620 27662 62610 -92730 -101871 -187830 -260505 -197841 -112393 17171 31291 -31534 -126115
25609 -126115 -193456 -282056 -184147 -137776 -143182 -120582 75461 103762 15355 16880 -76522 -150967
25597 -150967 -164564 -130245 -36118 59650 -51943 -96475 -6891 -40487 -160735 -173653 -161946
25586 -161946 -131584 -20250 124844 196983 140541 206950 218165 83645 67255 56588 -20779
25575 -20779 -41804 4942 90033 11650 -6056 -25642 -25808 -40978 -81511 -55029 -71244 -46636
25563 -46636 1612 -49013 -11095 31492 -44728 9818 105504 152426 109718 2328 -17755
25552 -17755 -132220 -190364 -217979 -191904 -228109 -105392 -49756 -123244 -88632 -98436 -157469
25541 -157469 -187750 -191690 -78520 11050 117224 159246 170939 266853 246421 118030 104872
25530 104872 -32393 -132183 -46527 118130 227789 254137 169286 -2718 -57799 -13967 -25310
25519 -25310 55785 94511 120536 41372 -21325 -99312 -46700 18549 86668 219707 174106
25508 174106 124657 88895 13205 24383 -67535 10152 37993 59988 -19150 64685 158367
25497 158367 163059 92300 31639 -67441 20513 110103 114528 -241 -37725 48137 -64099
25486 -64099 -67674 -39289 6690 -55338 -63204 -92241 -75967 23292 57519 32036 -21240 -17012
25474 -17012 -37005 -92478 -177012 -50228 31162 10859 57843 176892 204638 255570 202494
25463 202494 175051 71281 -40533 -104964 -2758 23314 -91647 10063 124175 31795
25453 31795 10691 70022 5782 -90498 -184621 -174077 -90218 -35692 -84330 -3344 94139 119624
25441 119624 -25628 -48356 -97440 35120 29887 11806 26169 -117956 -116510 -124287 -118089 -131257
25429 -131257 -127773 -29713 -3203 -96738 -72899 101764 198456 187131 94766 -17234 -131285
25418 -131285 -225569 -246182 -166342 -159281 -156193 -152502 -164065 -218005 -35166 71810 -37016
25407 -37016 -51840 -45296 -35145 -52610 -69578 -60741 -107866 -125162 22507 63375 4516 -12521
25395 -12521 -15789 -47458 -45836 -64123 -78375 -152159 -74653 41970 12973 54714 17033 -141717
25383 -141717 -174570 -221012 -177871 -53216 -18842 -236849 -220765 -105981 -163907 -67629 1351
25372 1351 -85211 -105280 -72694 19907 72806 28062 -22617 -16690 41135 -36424 -109396 -226743
25360 -226743 -191279 -88395 30612 86090 -99959 -66010 -24585 -116550 -50090 -47319 -42083
25349 -42083 40102 94653 19833 -133348 -136523 -82045 -175197 -227670 -165488 -22130 123331
25338 123331 198071 118063 95973 193715 314219 289250 142639 103368 11358 -91343 -58915
25327 -58915 -135324 -203073 -159607 -35493 -162137 -196226 -126652 -49788 1500 24181 70219
25316 70219 60586 143955 96544 34402 -28583 -123424 -64310 14021 -25404 -128348 -20171
25305 -20171 -31674 -117803 -151270 -22563 113428 10462 -70733 -540 121202 123047 128434
25294 128434 -4350 -47749 101127 225086 155177 71909 -37915 -53398 -47700 54691 105486
25283 105486 21287 -89038 -95547 -76453 3299 -26860 -11562 408 -88345 -134869 -18960
25272 -18960 57761 22364 18295 61985 -14880 -54477 43320 1296 -20059 -97919 -83985 -16403
25260 -16403 -144414 -252498 -114241 -50308 101699 109323 239977 269516 349183 333166 254759
25249 254759 140349 162178 124998 68723 32779 9091 35439 74832 -18025 -2516 48884
25238 48884 80592 104754 7251 -150657 -40537 79721 17006 56091 170641 36363 -109838
25227 -109838 -69201 154076 199263 127553 -115756 -182291 -69535 79648 111535 98596 122830
25216 122830 156198 208569 163447 182360 80230 -259 59624 113643 46796 -16320 -27082
25205 -27082 49998 61703 57225 -2638 18220 -5148 63822 60593 138378 93055 -94730 -106653
25193 -106653 71849 183797 162405 162892 150122 91291 44920 -87468 -178887 -211106 -152943
25182 -152943 -191246 -248449 -188167 15894 132403 194149 205410 151004 85823 130395 127320
25171 127320 25059 -4942 35512 59754 -8959 998 40213 -26419 -139017 -143355 -92918
25160 -92918 -106224 -28612 -38345 -55671 -104261 -63672 68859 131218 146008 179302 -8327
25149 -8327 -87629 -26023 83799 -8385 -109604 -106073 -76063 88711 178520 53420 -64892
25138 -64892 -237818 -286999 -169311 -98058 -113533 -59566 16273 89755 154749 203000 172707
25127 172707 135794 87002 110162 30805 46022 57631 126462 146761 150452 55647 69748 46026
25115 46026 -27804 -50509 -82905 -51209 -35407 43535 151395 158339 141901 1992 -59636
25104 -59636 -84947 -70039 -129520 -74525 -90973 -65012 43449 -32414 -22653 -169994 -199741
25093 -199741 -175149 -186074 -253999 -172507 -76872 -76313 -5247 -45065 47159 140036 127995 102946
25081 102946 14547 -52875 -69622 -99886 -131776 -100610 83070 74919 -27230 -61659 149237
25070 149237 214325 280085 264886 285950 233197 133363 164089 164050 130795 143262 132253 146694
25058 146694 150346 101746 3790 -28869 -29164 103689 24828 584 97736 182097 153256 11855
25046 11855 -62818 41209 56471 120593 47267 37403 -31787 788 10230 -48611 -113555 -107311
25034 -107311 -38092 -2159 92876 178803 185603 90754 19337 186672 285306 201727 63403
25023 63403 -162230 -302061 -194153 -93451 -162409 -120285 94934 70903 49569 84765 -98879
25012 -98879 -184515 -144975 -216932 -232319 -127453 -106082 -77635 -146992 -223810 -139150 -66502
25001 -66502 -100036 -80499 105121 129414 90771 -163065 -305314 -166726 -117506 -9198 12577
24990 12577 47022 74792 137360 195805 108460 117482 68061 -73176 -139872 -54860 38240 70224
24978 70224 966 -30601 28226 9967 -55988 -104218 -95216 -156101 -176057 -135797 -23097 87861
24966 87861 168137 50719 -50097 -121831 -47539 4668 6456 -36978 -35539 -160128 -161023 -56215
24954 -56215 100184 163238 -39540 -63110 -62702 11575 8953 -144368 -141683 -98021 -105055 -92881
24942 -92881 -94693 -38650 -92668 -117885 -226719 -278261 -161526 -202278 -111758 -49382 -24589
24931 -24589 -43629 -61085 -136213 -102216 -56645 -71180 -75369 -29004 78250 193029 77438
24920 77438 -32888 -30165 -3822 -44201 -23519 28865 14882 135526 197066 118748 2270
24909 2270 -123192 -200069 -169915 -52366 -3890 13205 4602 73018 122329 136350 86214 24473
24897 24473 22517 -4073 -68080 -32442 28450 -44108 -82175 -37759 -71269 -141707 -181692 -153857
24885 -153857 -135165 -111604 -20888 -137167 -170290 -53806 -1849 15712 -10077 -5251 -110359
24874 -110359 -223123 -251591 -307097 -138848 46832 47624 26537 189738 281552 300577 281626
24863 281626 88965 -74086 -108237 -79054 -20728 -45559 -75087 6797 63235 133972 120138
24852 120138 116990 41003 -68062 -82703 -165868 -125213 -104717 -101658 -39880 -128517 -82247 11332
24840 11332 75756 152322 131781 107478 130616 105253 1018 -86218 -81248 -43022 9087 111010
24828 111010 21075 -31358 142772 102556 16075 23312 -4942 -108215 -313420 -337201 -232166
24817 -232166 -126256 -106799 64309 -29791 29067 80215 53973 52656 102434 115157 181050
24806 181050 178681 213076 181382 143843 72528 67973 152923 105100 -29392 10685 30485 107757
24794 107757 183011 124166 111977 157929 268310 136980 38432 -42825 -132445 -41154 -32322
24783 -32322 -32620 -133383 -143042 -168538 -96503 -101090 -65710 25018 58572 182246 165469 55324
24771 55324 16953 75413 127822 132267 159267 52314 -81726 -41438 -11110 -43262 -111116
24760 -111116 9216 21474 25710 -121166 -199567 -151550 -64560 160344 109639 -32672 3434
24749 3434 78735 104913 91296 -122045 -199170 -145055 -24892 81237 59752 25203 53006
24738 53006 35847 -4941 -33569 82772 51110 40814 107732 100431 20668 12271 87280 -14888
24726 -14888 -11478 -31626 92274 83172 7351 -24813 -38429 65966 62783 83090 97318 -44496
24714 -44496 -106771 -79901 19525 43948 23578 -77439 -117396 -2354 -43881 -101170 -158035
24703 -158035 -208224 -187528 -258239 -209235 -206689 -193966 -173923 -162228 -105737 -38050 35599 -87002
24691 -87002 -121275 -125113 -81022 -83786 -91265 -7961 31218 104243 171721 174911 168245 295365
24679 295365 258719 63229 -80806 -35684 60876 95106 71868 -14523 24788 103666 205477
24668 205477 130621 5701 -115703 -105737 -48720 -103219 -125633 -62807 33463 -69521 -77716
24657 -77716 -59288 -25344 -4178 48114 85081 100005 78872 58911 46903 114807 58098 88579
24645 88579 181097 185552 71317 -163270 -187095 -173597 -91846 153086 199967 221870 290377
24634 290377 165540 -71674 -38115 -4378 -4227 54716 41192 88118 -88769 -154852 -57992
24623 -57992 48296 138551 75848 167524 52904 -5859 34729 66425 147762 154760 119571
24612 119571 92108 49928 -63345 -95465 -45964 -25989 -61102 -188398 -157540 -52633 52979
24601 52979 90811 105314 79928 105785 21229 104129 159186 121326 35981 -15347 -82303 -46007
24589 -46007 64018 74863 -160543 -102233 -38686 -23117 38450 18860 27088 164393 223763
24578 223763 62070 -91280 -105142 -95691 -184814 -220631 -149479 -74640 -54007 -159867 -197663
24567 -197663 -43448 37707 14473 -17680 -28038 -98133 -175838 -162396 -68753 -39252 57370
24556 57370 77782 65251 -64228 -156027 -208588 -113118 -22405 -47624 -10589 85154 71395
24545 71395 75861 125723 102247 6923 -44202 -98727 -150545 -113582 80159 116922 107337 55417
24533 55417 18964 -41295 -62223 44498 137322 96627 101244 75624 30619 -56517 -27738 -31477
24521 -31477 -27202 35324 -43655 -167065 -139658 -20720 69743 89098 -41640 -148616 -140050
24510 -140050 -125129 -162345 -169229 -85470 6398 27508 -48389 -37844 63820 201839 134469
24499 134469 -58192 -232502 -242759 -175456 -151481 -22821 -44551 40666 141337 3284
24489 3284 -49635 -101640 -138799 -143151 -147104 -40836 -23865 -5755 175027 23554 -120863
24478 -120863 -210801 -66053 52135 -22344 34895 129744 144382 169443 105784 -126142 -216936
24467 -216936 -144313 -138754 -240872 -147098 -133158 -158345 -72220 43503 177428 107509 14242
24456 14242 -26671 -2322 -22763 -90489 -139676 -173342 14185 174226 154587 185871 198994
24445 198994 130988 198979 173350 19999 23733 19818 -67852 -17611 34394 2335 -2324 164376
24433 164376 99613 -90654 -179645 -114511 -23147 52922 123945 162988 66991 14204 26195
24422 26195 -41438 -5236 11364 29520 9932 104949 66964 -49418 15289 79419 35301
24411 35301 27543 -73470 -76632 21637 -10761 10184 12695 -20362 37229 93002 -58728 -24724
24399 -24724 -18065 -121659 -107511 7701 25207 -30350 -49943 -23598 103465 62058 -19036
24388 -19036 -114751 -144406 -189764 -149322 -61572 -67201 -87818 -99273 -46150 -53942 -38837 -4500
24376 -4500 72363 -10587 -26115 -34087 10997 -77947 -115490 -74562 -57747 -109638 -127214 -60103
24364 -60103 13208 -109317 -235928 -128603 -120149 -153591 -192468 -52902 61836 -18898 110057
24353 110057 167309 168742 174801 143062 69487 81220 18756 -62170 -3729 -53569 51073 -5983
24341 -5983 24010 72516 90317 48674 100913 122706 132529 116357 67540 1809 26643 108707
24329 108707 123127 61182 24714 -4011 -150118 -106712 -94650 -145878 -161548 -176147 -124733
24318 -124733 -220825 -289437 -86521 -101330 -107035 -56951 -70975 -3137 132370 139787 46149
24307 46149 -106548 -186642 -131844 -52574 8792 96121 126447 73955 -33523 96295 184931
24296 184931 126897 149283 95521 55608 42186 70192 66743 54168 45351 101263 78875 173812
24284 173812 183743 -17226 -74412 -49957 -18796 -68072 29981 61517 -59247 -75093 -68935
24273 -68935 -8396 91160 146876 153629 80200 -9690 -64596 -124330 -81617 -61051 42013 160476
24261 160476 71853 -69805 -81203 -23414 -36014 -12743 116618 158981 71588 -93054 -154725
24250 -154725 -59733 -29396 -88691 13610 63697 -49312 -153000 -119512 -77995 -46701 -4253
24239 -4253 111599 163532 114335 154386 5685 -78947 124077 198289 165462 80985 21093
24228 21093 64819 81017 60102 16523 -34170 -453 -17788 -22196 -42379 -180115 -211880 -217404
24216 -217404 -216989 -202435 -168275 -79967 -66221 -61028 35517 117653 129944 27740 19010 -65443
24204 -65443 -197151 -139171 5764 -43495 -29072 -734 3781 117298 146999 146974 79868 80906
24192 80906 79091 96565 178527 247932 303144 259289 173223 130051 90229 38093 23039 84258
24180 84258 14626 34521 19667 -28487 -134109 20081 206942 248979 158028 73917 -44432
24169 -44432 -71462 -24911 34118 40572 105039 184349 175796 142743 70422 25062 -48236 -60306
24157 -60306 -41412 -47028 9592 73129 42491 126933 37598 -85560 -65772 -5314 73216 107130
24145 107130 92332 -38798 -48770 -27609 7492 60276 45939 40214 -9032 -11979 -34883 -89351
24133 -89351 -64237 -68282 -52200 6674 43217 36098 8650 -112574 -122970 50499 -21723 -189287
24121 -189287 -171508 -22818 -56072 3438 -7969 -96307 -92264 -68274 4203 66764 135298
24110 135298 17813 -99517 -122152 -138866 -129467 -81082 -74718 -103062 -46467 -7104 96730
24099 96730 -18174 -164206 -162964 -92283 23449 66296 79832 204696 170953 122258 141030
24088 141030 217072 176658 110844 70209 -92503 -32117 74802 125105 92875 -86698 -187437
24077 -187437 -106581 -108469 4927 173601 140041 77776 55547 -79462 -27436 90679 53018
24066 53018 34048 41748 145006 133331 208096 58849 -129157 -147477 -49493 -75080 -131722
24055 -131722 -234777 -117143 -26536 -33027 12511 41832 17359 3160 34729 18382 80272
24044 80272 70927 -8397 -22144 9527 -59864 -44177 -8769 5016 -38950 -142961 -168693 -240068
24032 -240068 -247204 -235458 -126569 -122161 -144010 18260 27958 129301 268552 118765 73107
24021 73107 -50701 -113758 -83260 -126266 -198683 -52159 9078 23233 46633 161494 132384
24010 132384 50040 -62586 -111198 -141721 -85552 58730 49866 -5714 77638 213404 90380
23999 90380 53631 25079 118685 65823 -68448 -83191 -52914 76906 195348 113926 98932
23988 98932 17016 -44453 11780 -52841 -122984 -73551 -23127 11125 -6104 53163 -22354 -107034
23976 -107034 -112020 -69947 141483 256284 190458 132737 -80085 -247217 -199914 -35909 32541
23965 32541 8320 -53792 -65713 -18279 81539 102308 154142 83652 -68794 -219705 -199479
23954 -199479 -173518 -98788 -63923 -3801 -6194 -58352 16718 -52770 -69183 77784 257787
23943 257787 217127 128355 93464 125368 168942 134819 26277 -65356 -107906 -114346 -81852
23932 -81852 -4622 -104397 -123198 -100933 12337 -39436 -50844 -20088 85847 74065 107802
23921 107802 78645 192634 215484 133792 16266 -32201 -49759 112262 141975 175962 223063
23910 223063 109743 84397 68580 34683 5440 -5237 -5331 31222 46101 -95475 -78703 -87282
23898 -87282 -42904 -52891 39112 71796 38533 47261 -36699 9704 127657 146917 193156 119039
23886 119039 -7388 -94000 -100700 -51704 -32490 -46293 52672 41454 9330 9492 42083 -78866
23874 -78866 -92971 -77730 -143689 -221560 -117650 5396 122305 130712 29859 56412 14941
23863 14941 98666 103820 140771 147693 68829 -88635 -147110 -155096 -136182 -72746 -41583 -99108
23851 -99108 -220906 -218459 -176919 -228159 -219515 -132395 38869 31764 -120231 -140876 -164732 -115513
23839 -115513 -2518 45564 48997 29154 83557 53275 30885 57058 -9757 -84798 -82458 -69055
23827 -69055 29829 -45498 -118377 -92255 -42564 64541 106036 22432 75262 79958 35279 -16113
23815 -16113 55600 83221 -70953 -22664 2587 16251 -67044 -70257 -160589 -115564 -68998 -98902
23803 -98902 -16290 21190 -11048 7595 -494 40604 73710 -41800 -150005 -191573 -126938
23792 -126938 -170538 -158665 -46356 16086 -31364 -99532 -49062 -15478 -35254 16157 -2327
23781 -2327 -45437 -158826 -246058 -241705 -197194 -159475 -77770 -91263 -102213 1227 -100441
23770 -100441 -78430 -95896 -8391 51748 12872 19903 87334 135502 92163 31942 -97079
23759 -97079 -108384 -103807 -91739 -71514 -113320 -180570 -169320 -202443 -155501 -5226 11812 -41163
23747 -41163 18194 35840 95165 33147 -48177 -142056 -146803 -38691 49835 58301 -3612 9107
23735 9107 70226 152695 93533 710 -14072 -5318 29847 92029 129143 61738 88547 -20702
23723 -20702 -38158 -102424 -81375 -125100 17113 73320 128887 190467 264626 218803 140013
23712 140013 64974 -16420 172947 317263 183060 128164 128727 82003 102881 112693 31996
23701 31996 110479 53742 83144 195095 185358 99594 304 -5590 114757 164769 133153 75865
23689 75865 5618 71756 156253 71573 -50240 -705 -67610 -96166 -128491 -11880 53479
23678 53479 123130 39526 -45354 -6308 -52798 -118365 -56922 -26360 -54298 -30989 -30279 -39696
23666 -39696 -164350 -232312 -155994 -145358 17166 84553 127717 106777 84140 33232 -10646
23655 -10646 -47299 -47903 -15763 27446 -22938 -1469 78274 18659 -102453 -43535 114499 87161
23643 87161 -28628 -50866 -24108 23344 100857 85915 72698 78777 143562 -28106 -172127
23632 -172127 -173965 -121532 -153656 -63089 6733 -782 -186779 -227619 -126220 83372 26222
23621 26222 53587 95906 64741 50131 99698 1654 -38219 -53514 -93310 -104184 -137486 -38525
23609 -38525 -15631 24150 4337 -5297 13515 27118 14382 13356 95481 97848 99043 150737
23597 150737 79442 -52116 -132718 -118551 -60955 -24463 339 49897 63170 98576 86079
23586 86079 78020 709 -40246 87476 34408 -144556 -215542 -309050 -282386 -171193 -112315
23575 -112315 -73101 -208433 -154045 -178181 -192269 -126725 -102431 -13664 91454 127051 35974
23564 35974 -83333 -132432 -105652 -52782 -80689 -159537 -34518 17856 6349 -27502 -15237
23553 -15237 54212 8311 -45604 -64342 -155213 -76089 22844 -32811 -28284 13977 86248 97745
23541 97745 124823 25063 66778 47650 -119816 -93798 -18231 -66437 -141532 -125437 -119659 -95890
23529 -95890 -76435 -96038 -91626 -37297 -20795 -70698 -109658 -192705 -192470 -131437 -51299 -13732
23517 -13732 30194 74079 25363 45700 5960 -52936 -4807 69178 21138 -49360 -107735 -86670
23505 -86670 -24586 -20586 -35933 -137536 -74888 80543 72145 -78709 -188823 -207035 -186331
23494 -186331 -145977 -22660 23801 -3297 -12379 23637 42967 94380 196037 148682 2990
23483 2990 -56950 -25001 -54167 -76579 -66986 6853 49256 83685 107309 57718 10312 6385
23471 6385 63725 88364 119657 129693 107085 3949 -60077 -80842 -46914 -26637 -47958 -38759
23459 -38759 33618 100809 180832 82690 47722 38401 18316 35603 79183 142067 50030 -62126
23447 -62126 -32826 -8262 -3301 -19035 -51570 -128786 -228657 -164052 -87426 -42784 -23291 -4235
23435 -4235 109722 135323 75701 146419 132110 201721 157419 72327 -95 -99934 -93175 -60689
23423 -60689 -66239 -17488 -66204 -54066 -157820 -125844 -16981 -56175 -104017 9758 88869
23412 88869 -41460 -214180 -116037 -71458 -87010 -34883 10432 77618 161620 101479 39961
23401 39961 -17240 28901 106768 217883 298807 207423 130133 229246 414290 408436 295252
23390 295252 287822 430847 414028 343898 339700 299167 281994 235492 210604 299885 535851
23379 535851 735079 766329 917180 1001738 1072803 1420984 1833294 1818397 1361419 921277
23369 921277 575903 464168 333028 293870 271731 345764 313959 203414 267750 240257 131534
23358 131534 130572 227127 151815 75854 74496 161034 204812 188167 136303 -26664 -11713 29318
23346 29318 80897 123069 15393 -124578 -178282 -117496 -84559 -131049 -116507 -95484 -114804
23335 -114804 -22979 -130533 -274808 -266485 -217510 -155416 -48007 59219 50157 -11121 -100606
23324 -100606 -84256 1118 67995 22751 27289 78899 171869 199800 85345 100789 77121
23313 77121 2046 165502 174474 55615 52732 -21372 -118928 -28054 82685 173684 60860
23302 60860 127680 183674 225434 162945 81612 72069 96943 116705 67213 99790 80919 -64500
23290 -64500 -76668 1845 85275 83878 14636 100821 185535 136314 117251 -6981 -66028 -83411
23278 -83411 -171148 -117164 -113171 88589 163884 57447 100509 176423 68388 104593 131446
23267 131446 70734 38168 89259 65550 31354 14652 80286 24603 -13486 52526 71229
23256 71229 165695 153413 162130 186756 -22319 -144211 -152261 -1183 -39886 -47907 -23685 -26368
23244 -26368 -36761 -36815 -117978 -149105 -56268 -21135 13327 47409 108206 115797 74019 -37838
23232 -37838 -203447 -242632 -228988 -318114 -236317 -191676 -121741 10743 43121 -41805 -35007
23221 -35007 -12699 82906 71971 77581 38891 145292 248327 153326 153339 263103 329112 262952
23209 262952 136837 51597 56345 64559 147460 192050 142674 55085 63464 111851 44324 44784
23197 44784 34114 -25341 -98920 -57763 -18388 45016 28684 22960 15103 28136 34126 84693
23185 84693 183955 204031 102575 113394 276001 293211 275044 215063 290231 432068 420958
23174 420958 269048 127482 137087 180569 110336 102451 170634 284287 321546 260971 273057
23163 273057 279619 169687 123491 73167 140855 73484 4642 98982 78278 -41608 -51635
23152 -51635 -17133 2451 -1370 30693 143888 104883 -34443 -66726 -44647 65378 211844
23141 211844 305632 299333 269818 231103 52035 42254 64058 62420 28778 -48754 -49647 12921
23129 12921 120306 74434 -16281 36403 31516 -9318 -58209 -122248 -14136 -39296 -76882
23118 -76882 -143055 -93393 -1859 35243 -15271 -5359 -3166 -25448 21493 139598 182959 103919
23106 103919 117792 30600 -19267 -60400 -148228 -106416 -41145 110686 69379 -11825 -44590
23095 -44590 -37361 21614 90730 53949 51684 48806 28973 9801 -19752 12212 47572 -19705
23083 -19705 -93795 -82386 -30470 3382 40576 51123 -26501 -40084 -67371 -63184 -10404 64264
23071 64264 92050 79695 36639 97298 101934 85084 228245 309926 224746 202284 143881 -14158
23059 -14158 -115086 3735 151989 153135 261952 214919 161923 237672 208268 245745 290665
23048 290665 216093 118146 187869 259829 367947 301631 278255 246734 351163 329604 190011
23037 190011 95950 115972 108179 116146 35938 124740 198124 95512 -40204 -20451 71101
23026 71101 12324 -140829 -234527 -160080 -87984 -17372 18438 -138189 -95954 -94039 -63196
23015 -63196 11448 -67843 -161601 -126592 -43133 -34538 -55499 -158226 -149074 -57174 -22015 32350
23003 32350 103725 -3442 -100274 -63702 21789 38418 61949 210648 219618 219753 230566 174851
22991 174851 111887 134322 293589 227724 171060 210896 293341 292777 174690 206927 205580 75581
22979 75581 -26701 8012 63667 254681 309434 249204 178151 28033 43324 99639 140077
22968 140077 105722 41784 45588 90182 161619 129914 186869 215510 169851 88249 -87588
22957 -87588 31229 153115 225756 124450 82484 148172 207551 217845 321504 354743 313119
22946 313119 200256 142089 232984 355305 302195 287335 255320 207736 299732 203212 127581
22935 127581 160949 260056 293498 246418 296813 274093 240506 174024 223710 255378 397809
22924 397809 430757 520999 396662 525250 708989 722062 666132 717816 742708 728694 871164
22913 871164 1015366 1205104 1432411 1830097 2130491 2340092 2695404 2625557 1985461 1450783
22903 1450783 1145279 960025 995556 993657 884483 759884 823018 871339 822823 793425 803898
22892 803898 771607 851727 986561 977209 862376 913019 810726 682893 602346 536689 601941
22881 601941 589967 543499 688966 773711 691357 673002 680406 717710 734505 689677 645817
22870 645817 577570 606823 743383 839154 994404 1047262 1079438 1130509 1195398 1181887 1180374
22859 1180374 1178792 1189683 1240564 1254415 1217168 1161735 1240863 1307921 1435116 1575156 1672623
22848 1672623 1857889 2017749 1953518 2101418 2182327 2298598 2398057 2532376 2675751 2839065
22838 2839065 3148205 3421144 3657743 3878677 4100042 4553127 4952008 5405776 5917421
22829 5917421 6437207 6977319 7621012 8300894 9087434 9925725 10727634 11683952 12913491
22820 12913491 14287312 15617146 17113725 18838901 20722680 22754262 24969596 27335868
22812 27335868 30165802 33349543 37142315 41773433 47120450 53594332 61808824 72116029
22804 72116029 85642798 103761682 128925442 162792591 202145399 243126747 297088431
22797 297088431 364935502 373391407 284594549 189192334 133240116 102482821 84120608
22790 84120608 72339004 64140549 58302043 54038123 50973472 48902566 47647749 45811250
22782 45811250 42365176 37903624 33619553 29926124 26660937 23701097 21105394 18906052
22774 18906052 17129366 15494572 14069545 12746103 11541941 10455380 9525625 8777485
22766 8777485 8107631 7420890 6880034 6327941 5814233 5398050 5020173 4625011 4320525
22757 4320525 4065463 3827133 3450030 3181273 2926443 2736008 2419511 2141472 1908369
22748 1908369 1899744 1812300 1604174 1391869 1295578 1144131 1034234 813901 761105 759129 644229
22737 644229 550301 638545 658159 533916 484148 573335 599494 633546 695554 826762 819291
22726 819291 801869 770758 822093 812386 773669 779148 752505 760767 713253 749596 624689 580206
22714 580206 598278 608518 680574 658063 570432 573990 620672 691975 605915 406521 360487
22703 360487 210347 254777 412177 395577 419583 474435 403318 385902 493099 551994 562169
22692 562169 569498 730716 896165 1061716 1270363 1545903 1773487 2002342 1921192 1403485
22682 1403485 988689 838931 696746 665350 636461 543922 543327 561118 551947 461231 456254
22671 456254 540658 520393 570996 595836 391056 292578 230664 324361 321204 310873 326532
22660 326532 263691 248749 225630 233582 277570 335370 304643 349334 424588 313238 238097
22649 238097 128343 212452 347418 338922 330101 358000 349931 218079 170872 193797 304378
22638 304378 409162 377804 281372 202722 281250 224885 202809 359031 403293 451076 368970
22627 368970 294756 248114 86123 45031 104209 58773 -130427 -109686 -13563 -1188 -48395
22616 -48395 -66578 -61217 -97702 7136 -40352 -81991 -124889 -65877 10931 193788 191715 140846
22604 140846 189555 283005 248359 229382 206972 198651 185391 199267 162120 70166 -7063 -3909
22592 -3909 154853 237633 348865 246356 202905 148654 113423 128429 166635 74053 58477
22581 58477 115892 24060 -1465 -27091 -66580 3759 96836 94300 10192 14380 96867 104590
22569 104590 81987 225397 238793 269932 304387 248847 92703 38000 75432 98421 42649
22558 42649 88719 -26750 -77074 -68302 -113318 -66343 65685 23655 15445 19085 -2935 -4530
22546 -4530 -108360 -159984 -6820 122383 183853 19406 -33463 46748 4761 24281 111585
22535 111585 135184 91630 -41749 -64574 8617 29325 668 32196 111410 78872 26885
22524 26885 114464 258781 270890 167703 45118 45309 124323 222407 248000 301454 156083
22513 156083 84838 115965 100703 87572 104361 51230 90359 83376 12522 -178939 -138475
22502 -138475 -56410 11205 -7125 25937 141343 40841 -58771 -66980 62557 99815 134727
22491 134727 156718 142821 -15495 -90062 -104491 -44 -11685 -9881 -2942 121340 211772
22480 211772 299862 314536 228182 73859 206360 236338 172394 59939 -8116 28021 134332
22469 134332 142913 54043 34206 163843 150072 84267 -10687 -118438 -38182 36503 12423
22458 12423 32250 -28263 -108021 8217 23703 -17409 32563 6064 -70053 -50982 -124968
22447 -124968 -20404 -53899 -56356 31766 42837 -46609 -47088 -39466 -22712 56960 116795 -51168
22435 -51168 -208111 -181874 -316592 -336217 -161092 -52717 -145095 -60085 104234 128198 21124
22424 21124 -121499 -99655 -19732 -17243 -87286 -52341 57876 -58822 -134686 -166741 -106036
22413 -106036 -102209 -152632 -179589 -161268 -163681 -108712 -82827 -22549 -11739 -24594 -143892 -99842
22401 -99842 -49389 -48452 -76181 -114636 -175725 -181341 -180716 -137579 -64086 -24297 19795 143360
22389 143360 184002 54297 -18375 -48173 -160282 -158971 -164311 -134959 -156007 -134944 -239873
22378 -239873 -108481 61620 105925 82554 67085 78546 233385 224156 107740 117922 33558
22367 33558 -11856 30955 -61082 -63158 104513 135517 -7623 -130055 -56751 -41961 -81008
22356 -81008 -70793 17907 203613 236798 106189 21060 -89831 -64604 3122 -47952 -120508
22345 -120508 -91306 -85407 -63186 39766 -92713 -134812 -38021 16246 16732 -119569 -57770
22334 -57770 17162 -20773 35911 22616 -89739 -128386 -20377 22163 -90605 -122295 -109518
22323 -109518 -185338 -268220 -289091 -201025 -107787 -42266 -41452 -43313 -127846 -16254 67712 -4324
22311 -4324 52578 48015 -32510 -92823 -104799 -143928 -248664 -263556 -267004 -198062 -153278 -166836
22299 -166836 -285914 -298817 -276644 -229134 -98664 -79267 -138407 -93790 -67873 -60040 -34753
22288 -34753 -97098 -58268 20481 126127 77690 31961 143965 126548 90111 63522 88889
22277 88889 138841 43670 -27092 -98511 -212200 -201366 -106388 49330 41739 55272 -74096
22266 -74096 -124711 -75030 74171 109838 176242 219081 277643 267517 176887 115661 117012 136592
22254 136592 61396 62650 87819 23273 47161 68011 11908 37821 118928 185076 99918 55695
22242 55695 103351 135586 121302 165201 202934 247882 173705 241633 293377 279632 244436 231221
22230 231221 292692 366558 333272 304210 394401 368349 197124 156200 200196 281130 246158
22219 246158 262379 373745 501411 679608 925413 1087655 1246503 1616700 1871198 1490280
22209 1490280 963419 746968 648450 405403 363518 388422 311972 324210 331889 233621 208485
22198 208485 229820 282490 181711 26036 81348 154882 148045 93775 47491 150024 234303
22187 234303 175960 36004 38439 -36477 -29569 71557 198424 140209 -35259 -38692 -24452
22176 -24452 -65561 -42730 -37257 -70519 -169151 -140082 -12922 -1147 27597 139620 116345
22165 116345 62302 28829 -124192 -138520 -32663 17518 36181 36105 107646 196076 174827 159445
22153 159445 141462 176047 185397 36402 -5103 106041 77430 97694 111208 167601 89597
22142 89597 49025 25749 45671 -4580 -28165 23434 70234 40647 47273 114614 40408 29153
22130 29153 89369 144725 132325 77984 117919 43426 -79760 -133755 -62273 -104212 -79920
22119 -79920 18472 -32091 -35039 -7865 -107852 -143180 -10807 57979 18850 36339 15274 -2498
22107 -2498 -17915 -50607 -23623 4299 23551 2266 -2700 36655 91231 104072 115651 80037
22095 80037 -42294 -118001 -68890 42878 -41379 -209716 -128001 19985 91045 27802 37810
22084 37810 33138 101846 87392 84364 -44776 -9145 -20610 -51005 57335 176794 69151
22073 69151 46632 92268 42339 23518 126825 96757 35383 -59499 -69569 -59545 -59347 -123312
22061 -123312 -85329 35042 -22487 8903 8250 -116911 -108734 -57335 -132891 -51125 -32106 -93495
22049 -93495 -6691 -50658 -51317 -78990 -110121 -61030 33194 31579 37339 69159 35084 74120
22037 74120 88612 -31516 -83519 -137229 -145195 -86740 -191114 -170382 -25732 -35648 -25169
22026 -25169 7898 2166 -521 5511 12038 3678 40366 9242 -4228 64886 -10159 -90373 -141447
22013 -141447 -155673 -210769 -234571 -152647 -71789 45015 88812 -67541 -54226 -26790 76593
22002 76593 110737 14192 39234 -45680 7848 73004 66761 30436 -100927 -58745 -8508 -43199
21990 -43199 -69652 -77879 -115536 -110703 -116353 -135194 -65835 21339 -7474 -5665 -36567 8414
21978 8414 57238 42345 48661 114609 184493 106264 41715 93736 107564 660 100364 113575
21966 113575 57866 -10966 -52897 -121177 8810 99780 46961 26707 -3036 -66041 -104338
21955 -104338 -115740 -16136 -114 -83227 -97209 -47820 70670 74521 -33640 -103870 -173344
21944 -173344 -289645 -118816 -17087 -72378 -197074 -206682 -165905 -31047 12902 30529 -6678
21933 -6678 98454 -19215 -189060 -219133 -288506 -227336 -153008 -67212 76714 -66342 -11396
21922 -11396 -25721 -51453 -8892 -76584 -113162 -82106 -34795 18674 102970 25094 -11656 -9882
21910 -9882 -25709 7995 10425 -3736 -27108 -15231 38746 -51309 -50036 -4708 8055 33441
21898 33441 24624 -67515 -142475 -187686 -54111 -17964 -28764 -174351 -104548 -61353 -20538
21887 -20538 -71589 -59049 -85155 -144685 -51823 -109631 -50507 21044 -18972 -11687 37789 21847
21875 21847 48782 57332 81924 74329 169239 116537 1856 -47846 -49847 -149648 -202460 -113038
21863 -113038 5382 119235 140188 -19541 -4779 18580 37888 55704 -21219 -65151 -159473
21852 -159473 -265005 -331909 -261270 -180933 -193174 -226266 -227595 -192636 -99210 -21859 -3323
21841 -3323 -55336 36671 42701 -57655 -80063 -95001 -149321 -114205 -127368 -134008 -74211 5163
21829 5163 103658 64331 -18676 70577 106823 55030 86412 152683 223347 84015 -76734
21818 -76734 -49013 15804 62897 96527 23634 73929 63919 61078 81155 133128 80205 -36299
21806 -36299 -88384 -41915 13905 30855 51290 78577 159403 30973 -117625 -111826 -27769
21795 -27769 -6816 -49134 -59527 179607 306940 212602 107774 109728 146852 81397 227505
21784 227505 195403 117845 114481 136996 61005 10906 122923 211849 211669 114006 -18073 -114412
21772 -114412 -180655 -93092 -140214 -124822 -26827 72972 60293 36970 42151 37878 56724 22365
21760 22365 -63496 -157545 -80660 -20987 44042 -13882 -46618 -89208 -98080 -53414 10974 86350
21748 86350 3634 -34997 68653 107877 122410 20293 -2035 -1339 -17581 58713 61838 35150
21736 35150 -8432 -44361 -27665 -102207 -52406 16596 66182 155357 39674 14770 4671
21725 4671 -58867 -100501 -97342 -23890 -88237 -155346 -169402 -210675 -72082 80209 54039 48089
21713 48089 -1255 -37092 -14702 33114 92669 181697 147405 61488 14899 -5524 -8780 -88112
21701 -88112 -98396 -46079 -141987 -130021 -122356 -54596 94007 114062 165942 136371 131718 146787
21689 146787 92431 65659 82097 86946 64965 97890 67235 -71435 -127425 -192055 -193194 -106693
21677 -106693 -53940 54632 140714 100770 56180 -28112 -32126 22465 8426 2621 -1244 -31189
21665 -31189 5684 25931 5190 -138726 -189728 -99302 -53133 -30013 -131862 -113787 -28183
21654 -28183 59872 147853 59492 -134633 -141131 -132071 -71339 -39863 74005 241131 195352
21643 195352 157436 276774 151789 -60345 -103579 -234427 -258098 -140575 -76472 -150800
21633 -150800 -174462 -121140 56899 158642 53351 -50868 -46642 -28686 -44469 -74124 -137299
21622 -137299 -139095 -101058 -160872 -232938 -216257 -39030 -71191 -72508 82486 261910 191514
21611 191514 192308 310516 346937 260335 242032 174836 35606 148450 109032 48533 -31735
21600 -31735 -100298 -128983 -158801 -80325 -69929 -135470 -59690 38954 -11842 -108228 -158935 -103913
21588 -103913 14168 -93921 -200007 -213106 -194197 -102825 -88348 -138550 -78903 -76253 -96247
21577 -96247 -7322 -35834 -78584 -1118 13679 50781 6838 -157318 -191830 -140360 -51748
21566 -51748 30731 47616 60759 74065 107852 195388 85225 69908 130867 117032 50810
21555 50810 -95062 -88420 -122087 -34811 -70569 -91297 -39870 49496 44392 -115326 -201387 -88894
21543 -88894 -133206 -109014 -125645 -33350 29839 148212 231063 249053 93504 20251 32193
21532 32193 -69780 -113617 -98492 -48641 -23189 31753 -92718 -50950 -55536 -164648 -185321
21521 -185321 -92773 -59202 -98724 -6904 30066 49018 8436 -83957 -104493 -10920 -34537
21510 -34537 2105 -15710 -87772 -142708 55862 147862 141235 144222 -52003 -142981 -83504 8187
21498 8187 43335 -29949 56699 121428 57833 128662 68386 11140 88109 112759 123706 130374
21486 130374 190814 131411 -64998 -147744 -62318 68383 118960 156698 83680 130146 29888
21475 29888 -108988 -146860 -157344 -74682 -80814 -17765 -18500 -49415 -51104 -42767 -27259 -58095
21463 -58095 -39299 -67416 -146362 -137302 -138371 -99239 -17721 -49140 21759 121420 101797 33358
21451 33358 28666 11994 136766 131348 67572 -21163 -7076 -31105 59467 45814 -62899 -197654
21439 -197654 -274750 -276437 -245137 -130012 -65098 13570 32640 43494 -35804 -43263 81808
21428 81808 70418 85841 93560 117146 44118 -45936 -20804 -6653 -3106 7312 21491 85117
21416 85117 49967 -37262 -78134 -25875 45356 -9940 144077 155584 106968 196138 81915
21405 81915 -109986 -187674 -168776 -66698 -40391 17322 114874 129165 115266 30119 -80566
21394 -80566 -101612 -134001 -172142 -113455 63971 179231 171475 158677 46857 -40582 -48490
21383 -48490 -78191 -82608 60786 9198 6531 47667 137575 168706 126694 72091 83693 141193
21371 141193 208183 257016 235318 220802 176358 53230 -22246 41282 -63009 -50338 32936
21360 32936 -445 -67877 -11721 82411 87987 -9618 52400 177797 211748 91226 6242
21349 6242 -59692 -45244 -41583 20603 67375 -70584 -62397 -113098 -136597 -3178 158589 138087
21337 138087 147390 52687 -52771 -143674 -220173 -236852 -164181 20583 8156 2804 15153
21326 15153 -21426 -64729 -52486 -116158 -79260 -33185 15272 -27006 -10548 722 14575 97608
21314 97608 21534 -52291 25329 96159 144359 168004 123502 151726 193887 190635 140551 87721
21302 87721 93038 134044 3422 -101541 -115937 92385 166580 11925 -34026 -68443 -105626
21291 -105626 -37620 34854 12298 -73899 -97974 -130979 -83865 6579 89880 70587 9818
21280 9818 -14796 -47214 -62039 49335 125099 140787 121652 31728 -46757 -216420 -235636
21269 -235636 -139616 -179034 -98361 -25865 90079 39023 13207 23949 -34793 -3795 -29269
21258 -29269 -72029 -46053 -98375 -33730 -47524 -137292 -199565 -136371 -151688 -154515 -134817 51152
21246 51152 130272 54268 164486 152082 146937 188943 241563 65036 -125150 -209502 -172264
21235 -172264 -85134 -56762 108990 169622 170533 188005 141625 41398 61200 -7023 -68127
21224 -68127 -85230 10087 120747 151098 156439 101604 128088 89670 -35785 -131569 -123863 -75796
21212 -75796 -91360 -96907 -76429 -84669 -37896 1639 64684 150445 161691 130702 28027 91212
21200 91212 125554 81159 14433 -44622 18015 -68938 -93705 -75421 -140911 -117162 17825
21189 17825 -47700 14248 39080 -14443 -66939 -129355 1284 46241 57636 110266 36160
21178 36160 -79000 -47850 -41766 -36764 17092 4735 3312 -11312 -5356 129823 168661 -16197
21166 -16197 -139270 -123513 -58733 -42102 -50074 -142282 -203567 -155435 -178215 10778 98022
21155 98022 107022 107106 95480 -27670 -115263 -121464 -118668 -148433 56259 30911 -3804 36640
21143 36640 -95802 -117288 -46678 -88565 27608 60112 83339 44482 -35947 -31331 -21584 -11501
21131 -11501 39459 -24853 -104183 -134140 -119957 -72757 61344 126317 131924 159782 188781 235736
21119 235736 281466 364141 278882 294994 200547 247229 388103 377551 475103 770469 1009460
21108 1009460 1110396 1147993 1102636 1036076 878581 612692 499228 553597 640541 525623
21098 525623 453914 627391 656468 630805 541726 596887 761383 887578 775078 571230
21088 571230 442716 473530 563547 513780 351917 254935 182488 94212 31220 105273 161967
21077 161967 128160 159828 169561 124949 150792 170957 99297 118418 132928 207666 91343
21066 91343 11312 -37964 -171418 -112475 2928 -72377 -122529 -101137 -46738 -69534 -99618
21055 -99618 -71134 -18918 82705 54559 43576 67428 30078 54583 84607 -20181 5110
21044 5110 73920 107533 154134 189734 154410 139348 87066 120037 171786 98555 -46799 -42864
21032 -42864 -77229 -45304 31697 152768 138966 1706 -123554 -95853 -92134 -81373 -14772
21021 -14772 74924 133812 235325 202695 120270 153542 229187 230088 220956 323675 254602 230284
21009 230284 254571 203933 162718 129318 -965 -98749 -40110 -46350 -30822 55075 51640 -46657
20997 -46657 20426 141383 110834 44806 64732 15907 -5840 -96265 -34660 30154 22347 -63488
20985 -63488 15445 88857 -33997 -269786 -284790 -154919 8253 124956 101859 84183 127750
20974 127750 151902 127528 165972 31201 -218159 -208018 -59277 -19866 59945 56619 49621
20963 49621 52484 88241 215705 209161 85421 96212 75113 -23541 50586 121309 965
20952 965 -41981 -27577 18426 52450 49203 14642 69400 87782 2382 48079 20097 22185
20940 22185 64229 124850 167031 207930 171785 133549 72291 72060 75480 74761 69397 159163 264496
20927 264496 273203 273827 193059 166809 213466 276000 198485 231800 126566 142611 174604 176731
20915 176731 254185 324345 468275 562860 565215 548076 608154 615443 662916 854431 823249
20904 823249 836347 833248 904705 923792 864269 742759 654146 589159 578123 651532 655647 665209
20892 665209 605468 696604 860802 942375 920487 863937 822032 705114 696961 506490 307158
20881 307158 139529 274466 314914 299363 281693 261315 293428 189387 163321 244002 290603
20870 290603 325927 217233 117329 96358 189312 268090 279828 247362 125752 164863 258241
20859 258241 171829 82012 208052 39835 -88059 37294 251287 300353 179334 110937
20849 110937 -70591 -172133 -47197 174147 259104 228418 201816 150027 182915 204223 159496
20838 159496 172643 206415 249860 308966 164702 30538 -6302 -24038 -16007 -113357 -1330
20827 -1330 8135 -43937 -110783 -155843 -112186 -43075 26145 17472 -15282 60845 190654 185114
20815 185114 80803 122225 128909 106463 -43938 -84241 61099 -711 25995 39934 26961
20804 26961 -69875 -69472 -12023 -30752 17304 171545 12391 -43692 90645 113705 100380
20793 100380 12524 152453 218133 240996 214394 86851 77712 192206 147869 247027 368759
20782 368759 304660 314668 230043 237198 217369 222715 110319 123312 206494 132334 78018 220446
20770 220446 259703 340399 337503 301833 203403 277181 256904 71875 65427 55115 102005 138761
20758 138761 42677 126454 265837 264386 223535 114647 118513 172460 98418 181264 215812
20747 215812 167353 144727 44938 74176 39121 76920 180834 167240 174742 78030 125400
20736 125400 233815 211811 164914 128448 124425 86827 -13545 8113 115002 131812 192763
20725 192763 224002 191395 231750 276124 125584 71327 123688 91368 14259 74840 159351
20714 159351 92632 104575 153412 156978 160168 151212 194557 123943 136992 138898 106949 144774
20702 144774 98653 43735 95324 77586 70419 181430 215474 120006 78333 24161 174763
20691 174763 387345 448251 336232 379631 434148 383281 292826 276653 308801 304712 272080
20680 272080 390642 382894 255932 191158 138543 165663 198350 223774 311937 300189 334173
20669 334173 317888 390446 368636 364337 285596 394312 452626 403837 398164 398597 372036 357100
20657 357100 315175 324291 486348 571829 578209 601344 523759 566121 597736 640646 617711 689455
20645 689455 665977 571299 428653 413541 495855 564129 598956 679443 694548 653779 745520
20634 745520 813457 836746 820522 811577 833952 844145 864876 873242 778686 754246 863738 970573
20622 970573 867973 827038 810922 907283 918040 814737 717232 669509 682231 727400 772780
20611 772780 746010 756471 773674 740556 775424 755076 921704 968020 824731 770230 861090
20600 861090 973666 1022171 1016099 1005233 1036034 1107200 1223802 1296133 1305630 1388682 1364536
20589 1364536 1257210 1252685 1300397 1400921 1532136 1587267 1588215 1708304 1865952 2010068 2160069
20578 2160069 2228113 2229890 2271282 2358281 2570152 2842817 3030589 3151984 3248975 3411438
20568 3411438 3721025 4055771 4355778 4714580 5213511 5692408 6055993 6276668 6382419
20559 6382419 6507515 6756829 6989005 7379391 7670840 8027861 8546620 9371779 10272335
20550 10272335 11199057 12264418 13436043 14534999 15385308 16225557 17292506 18591151
20542 18591151 20222946 21988368 23806984 26147569 29068705 32621411 36876836 42179734
20534 42179734 48675557 56845186 67351520 80432878 95869962 112616614 131078819
20527 131078819 150932046 161793924 150767094 125658811 103799970 90569548 84275086
20520 84275086 82827170 85239161 91216945 101072909 114405440 129901151 147214225 166828344
20512 166828344 181778977 175185347 145271796 111571657 86821942 70528691 59494278
20505 59494278 51670785 45704552 41203884 37771992 35304495 33268945 31605803 29786704
20497 29786704 27620563 25264828 23032834 20983237 19172774 17675408 16373505 15178314
20489 15178314 14019713 12965683 11968408 10994516 9974275 9158305 8537553 7928640 7379740
20480 7379740 7154351 6809623 6472628 6545712 6384891 5947067 5559574 5288471 4952091 4472147
20470 4472147 4032657 3655828 3312599 3054318 2803553 2698633 2482287 2176183 1966804
20461 1966804 1976109 1909808 1839723 1777512 1736751 1742347 1706181 1690139 1654246 1614201 1576183 1529903
20449 1529903 1434813 1370744 1359764 1396329 1266638 1270425 1328273 1278438 1249218 1364683 1337454
20438 1337454 1290165 1137668 1090726 1163776 1110441 1038914 982901 1008698 1109837 1089384 1012319
20427 1012319 1059127 1059446 1002962 1090082 1146264 1072765 1012526 880301 810468 727159 844461
20416 844461 994894 999625 1027256 1059945 1013355 1099098 1135614 1045338 1076379 1038002 996469
20405 996469 1005860 878738 929647 954273 1038124 1040332 987692 988195 1004346 941545 946806 913347
20393 913347 1015688 1167864 1174560 1149358 1154442 1139666 1148804 1261558 1388263 1502211 1631831
20382 1631831 1614081 1647689 1607652 1611817 1684399 1704021 1738488 1801385 1943015 2036212 2150643
20371 2150643 2211767 2283705 2234066 2202530 2377427 2574662 2644689 2850721 3063303 3223190
20361 3223190 3473332 3776447 4021476 4393072 4783909 5220350 5553024 5896061 6198516
20352 6198516 6533419 6802259 6915483 6997918 7298243 7700124 8082781 8643182 9408383 10335592
20342 10335592 11217484 12167165 13111066 14121210 15239571 16320799 17447492 18723634
20334 18723634 20125767 21787945 23830606 26126965 28725360 32078413 36254962 41327258
20326 41327258 47365151 54718760 64094761 76068137 91166422 108489184 127162689
20319 127162689 147703442 168578948 177552456 162415336 133942894 109871926 94793861
20312 94793861 86757394 83778530 84747842 89237099 97325497 108354442 121353761 135870416
20304 135870416 151843761 162483360 153942553 127244588 98907404 78080090 63877681
20297 63877681 54054358 46956933 41670291 37711588 34748141 32504337 30748131 28993945
20289 28993945 27152572 25173485 23122364 20947666 19143578 17742254 16474286 15297505
20281 15297505 14304088 13288477 12219384 11199123 10200234 9264834 8402609 7725292 7057964
20272 7057964 6508776 6207007 5888980 5818332 5730261 5672541 5633586 5410096 5003362 4449996
20262 4449996 3996275 3656959 3278220 2850011 2651858 2560137 2315885 2101586 2058813 1970402
20252 1970402 1760631 1639356 1496552 1391706 1236915 1302960 1334009 1231043 1109920 1147906
20242 1147906 1236672 1248886 1200214 996692 873577 773500 737199 797750 801912 838446 817172
20231 817172 819906 776747 792387 769313 790977 786186 784983 802151 690612 700897 707251 695672
20219 695672 633614 655942 707554 648587 509772 457743 477525 463360 331050 260312 182035
20208 182035 207245 354370 389233 306075 303402 376983 383148 366783 476518 469039 349486
20197 349486 297035 304245 331909 283162 330961 306628 395834 471167 366297 344232 289116
20186 289116 313909 312357 274017 190402 206202 252642 321131 425566 402384 376889 323236
20175 323236 368798 363567 302038 309368 478544 281383 91943 35114 119410 140068 161404
20164 161404 254315 321006 418063 329199 191813 192802 283767 298718 331397 399355 537179
20153 537179 520040 498693 517381 526347 560407 527009 541567 724805 820790 808240 959818
20142 959818 1158900 1444474 1701776 2023432 2039984 1713995 1376543 1029672 789470 679128
20132 679128 602205 486974 460409 525650 546775 575624 511841 467127 442942 356284 296492
20121 296492 324869 337897 238230 234910 227028 217602 226558 166798 182591 167898 148628 81304
20109 81304 163261 224429 235679 274757 263927 208779 72990 -57818 100526 239929 271809
20098 271809 289779 213757 84345 122804 106479 52273 88177 138530 226472 264232 281248
20087 281248 183065 152267 89164 75813 70871 71779 128579 187740 174086 154218 194651 246747
20075 246747 436092 465538 286213 224083 160950 114388 167465 184565 162578 232356 231508
20064 231508 286701 258273 118313 162820 178060 97377 583 -32700 -54274 -11431 55373
20053 55373 142164 73641 -10541 66971 105921 24290 19724 97906 196524 220369 239839 208868
20041 208868 121867 43228 64164 -16547 -20818 -1447 96928 122350 -18997 61154 -15195
20030 -15195 -963 5877 69930 88480 76343 35815 67675 151432 163722 65953 -56766 -150983
20018 -150983 -131522 -7076 104951 53168 110215 69498 54157 55229 84450 19300 36938
20007 36938 -39511 -47045 -91990 -177454 -144922 -89751 40614 -29048 -72363 29686 8546
19996 8546 30763 -62408 -170838 -105637 -32267 -60901 -162178 -155918 -111730 -71924 -57141 -44195
19984 -44195 -19202 -59553 -84110 -4930 -34441 18222 56641 44790 -10962 6826 -28153 19155
19972 19155 106660 55241 24125 -33388 -51550 3770 -4791 14857 82559 -23155 26179 185532
19960 185532 197228 76951 70612 237932 266568 290033 93480 84635 164961 194220 184539
19949 184539 210210 92540 152030 363876 375026 381279 534796 546747 595768 638037 787052
19938 787052 932820 926782 727063 571437 553662 431649 324535 339014 387426 529562
19928 529562 692477 600691 576130 682596 821314 870133 776054 585016 434365 414216
19918 414216 457208 385337 375753 287607 234387 163305 180123 306793 297681 265476 291818 280600
19906 280600 210736 106416 -63700 -50568 -38796 108618 106703 174623 40362 -13146 -58322
19895 -58322 53250 7859 -70879 59107 60105 25839 101908 243259 345914 390390 270135
19884 270135 102786 48207 -52255 17752 127671 145179 9991 -17175 -3808 28480 201633
19873 201633 157539 93500 12506 -12755 13941 51758 16086 149375 183683 180800 229471
19862 229471 269667 236159 252979 381721 402756 401592 418987 402673 392312 348210 285209
19851 285209 250616 247732 272343 344165 343919 218099 313702 445625 412556 305704 193402
19840 193402 234182 263439 332681 345420 339240 255448 201691 149683 158248 131140 83543 101740
19828 101740 187517 271131 321585 161149 85514 63735 14950 -93736 -69427 -49465 -473
19817 -473 49766 103068 157533 196852 178397 110331 66064 -29076 -172570 -197769 -23062 170519
19805 170519 243272 200437 172376 108520 -15182 61243 112263 -5531 4198 116124 93769
19794 93769 80848 14217 -42374 121521 142175 154647 87472 12222 53404 169815 163136
19783 163136 163980 187694 229551 125095 152707 199877 249843 345014 310453 318232 293734 318756
19771 318756 285702 201760 263393 322230 332368 243146 146929 -2612 -129307 -73930 7830
19760 7830 131757 171855 158904 136196 222921 252396 218900 253930 222798 302859 284203 265352
19748 265352 260866 283871 384142 529352 541274 537102 441416 380263 407712 447223 475011
19737 475011 562516 606937 658444 633701 641366 741191 802411 804156 816191 924782 969168 926411
19725 926411 971529 955708 862829 698423 486742 499125 439647 538349 819705 976897 1102550
19714 1102550 1266213 1315001 1262396 1296222 1176145 973790 829951 909427 896615 769962
19704 769962 793027 848239 821510 863782 859374 752953 676804 653078 703101 692937 702452 689555
19692 689555 679824 628713 601541 689062 671487 769477 826733 789731 724496 632904 604861 607089
19680 607089 514458 446372 525892 626150 663148 536786 545657 730291 603872 513059 573216
19669 573216 588662 611756 624354 619824 490159 516631 669472 949495 1099526 1036556 1122115
19658 1122115 1095015 992954 1036713 1151493 1271017 1388765 1357977 1256657 1284695 1383953
19648 1383953 1378742 1414768 1465710 1548507 1679202 1836514 2107977 2332918 2231099 2379163
19638 2379163 2624681 2634647 2692660 2858780 2931949 3138661 3294868 3470746 3635325 4015985
19628 4015985 4461539 4896476 5298227 5876716 6450015 6957996 7524472 8217677 9125240
19619 9125240 10016992 11025947 11953909 12591470 13260184 14061631 15222919 16576393 18249963
19610 18249963 20162111 22305445 24651135 27378860 30440417 33886495 37217823 40431926
19602 40431926 43980772 48542971 54520545 62425237 72442050 85716779 103432014 127233350
19594 127233350 158223606 194709243 235581181 286365371 338142790 344983986 283576828
19587 283576828 199664897 139441349 105380480 85876424 73737601 65806836 60180249
19580 60180249 55858720 52707715 50494834 49100358 47475890 44580379 40603908 36442465
19572 36442465 32428007 28655173 25202727 22261014 19907205 18165106 16736594 15457341
19564 15457341 14261556 13428574 12612431 11604507 10309960 8986764 7955486 7209312
19556 7209312 6681697 6056153 5635126 5386526 5108444 4680702 4346244 4044655 3770965
19547 3770965 3548845 3370956 2971919 2617355 2282896 2051147 1789173 1670804 1598961 1360532
19537 1360532 1188589 1175775 1055689 1006114 1053243 998360 920838 911110 752830 703482 662343
19526 662343 484832 393908 330226 449012 467842 615211 613489 554862 543063 508947 596072
19515 596072 814831 807817 682306 564758 547327 542518 651524 627369 568426 569666 456488
19504 456488 301586 211333 256269 406747 365302 306054 321437 260893 295658 342295 344201
19493 344201 263208 239367 181335 204613 183817 118418 54228 137424 154269 59473 -96162
19482 -96162 -72073 79370 228056 280150 198916 120951 35451 97685 213648 272154 285382
19471 285382 284390 218677 169660 295635 267373 228710 231679 260045 270591 401572 395844 406905
19459 406905 303489 262180 178248 73146 -36893 77456 -1171 -120232 -162655 -128218
19449 -128218 114894 320779 211083 107829 66688 50878 129443 242868 288792 287474 336024
19438 336024 294728 204395 93284 19787 54447 92957 95341 187518 314529 272249 236121
19427 236121 229522 199709 120946 92142 16450 -60859 -32044 53170 80380 -32084 17857
19416 17857 148101 165597 150129 27509 38787 112768 175756 270708 262705 73240 110590
19405 110590 112209 7194 26386 77269 70919 31284 59565 -50494 -164731 -105536 26611
19394 26611 -58849 -145919 -218391 -167345 -33454 -12372 -23983 30374 13868 26769 110703
19383 110703 100827 126116 7642 -43294 -100687 -172087 -155451 42254 93938 -95575 -182436
19372 -182436 -131153 -101284 -95265 -46127 38793 92222 181114 163608 137388 152579 165620 47717
19360 47717 48467 56981 83839 -6289 41382 94834 154599 122916 82204 42695 60080 34296
19348 34296 -66201 -101086 -100127 -55744 -48782 67374 148957 247109 240301 117554 114483 84991
19336 84991 168892 154178 27163 26955 97538 76082 37491 62349 -6636 -41429 -15438 -49333
19324 -49333 -80984 -150845 -234832 -273887 -131992 44340 169585 211813 152154 20559 89661
19313 89661 -3787 -69313 -27463 34272 4236 -55428 -94929 -70587 -186813 -176265 -109009
19302 -109009 -93174 -118969 -110032 -114828 -156277 -202521 -160539 -163400 -145142 -50432 -22883 105004
19290 105004 96940 12509 -88293 -59363 -79647 -180948 -142422 20232 153386 169335 85359
19279 85359 121512 136787 217760 264160 186880 76109 -5179 17328 135093 9381 -77356
19268 -77356 -124370 -95413 34972 -64488 -70299 -47874 -94623 -128120 -150184 -35420 113474
19257 113474 159152 5610 -59673 20406 25903 -17386 18402 13196 -15019 -90085 -240539
19246 -240539 -245149 -123255 -117052 -220666 -275570 -228211 -24154 80544 148221 94706 -99876
19235 -99876 -218454 -140522 -25853 36536 -6245 10727 8837 3982 6485 -56646 -45456 117014
19223 117014 149447 -5202 -58834 155 47317 19199 -84834 -110387 -106975 -172444 -133934
19212 -133934 -126535 -96055 -125449 -109506 -2162 99139 21909 30744 161199 188235 142538
19201 142538 174218 109311 55552 41193 -19975 -79046 -81782 -46719 -22238 94530 152953
19190 152953 139695 137675 66758 44024 75357 45989 57958 55975 141 -92157 -172563 -158027
19178 -158027 -5445 87950 158626 127895 -26578 -47563 -44147 -11576 81454 140778 68275
19167 68275 41622 -47096 -130935 -60248 60063 30150 -6837 -65122 -105147 -105195 -29467 -108820
19155 -108820 -63552 32864 36604 150892 140455 48197 -97274 -35798 25381 8834 10917
19144 10917 -62997 -9418 73395 50687 542 75 11875 23836 -69502 -201273 -322745 -160601
19132 -160601 5502 -33027 -152258 -163608 -92792 -7325 -1599 -12781 -85579 -148758 -48764
19121 -48764 -29653 -111052 20053 85882 -53957 -91397 -76167 -90540 -87772 -68665 -5137
19110 -5137 195812 154498 140018 208606 114201 54063 32840 91340 89208 9868 -82987 -75834
19098 -75834 -13152 -116036 -112120 -157066 -58838 6055 -70585 -178689 -137531 -36314 43014
19087 43014 118691 81937 187747 350303 242595 101119 50271 21014 66574 134889 149382
19076 149382 -7126 -62057 -124470 -166065 -143541 -71700 -53217 -73880 -13922 98972 170356
19065 170356 246363 259287 164811 86860 78676 62104 47710 -57645 17893 69850 141666
19054 141666 253445 329680 425243 338600 196122 201159 136516 244572 309380 329031 436429
19043 436429 501831 567576 574910 693695 824607 920148 1102990 1438502 1689063 1695531 1483600
19032 1483600 1057887 719188 590297 556145 476258 433589 364038 313905 324864 305816 308214
19021 308214 358058 371534 284443 223914 144847 57168 -86385 -27879 72679 15223 -332
19010 -332 28824 -65145 -117739 10661 76083 19570 -74903 -107010 8742 108786 100708 118685
18998 118685 139284 77841 -69369 -134817 -40795 -42934 -45199 -149645 -126066 -39923 15193
18987 15193 28527 75289 73594 6407 7428 -102405 -125605 -11802 -65675 -129121 -56464 93925
18975 93925 126157 -24118 26750 129968 47013 -14605 -35492 -52787 -24752 -117470 -96926
18964 -96926 -77005 -108490 -68465 117388 -15300 -74479 -53831 -24334 -15040 -42499 -16327
18953 -16327 -2985 33284 60162 61193 30703 98302 41683 45456 12001 89093 178935 207290
18941 207290 230252 158220 192404 140560 -3131 -80567 -102843 -70033 -79569 -114339 -72662
18930 -72662 -54937 -94319 36653 118725 69661 50386 -67714 -59214 19055 88056 49496
18919 49496 -68416 -133506 -69143 8779 -56850 -56201 -54210 -75410 -59372 -13672 -24284 -143509
18907 -143509 -197365 -135167 -163884 -63760 6196 -45301 -62368 -148246 -115290 -101234 -141136
18896 -141136 -175222 -141457 -61492 -6113 51914 97949 -5683 -129769 -47377 1473 35488
18885 35488 108175 200418 175124 107328 137718 32836 -3022 58935 2252 -28431 -37203 -40194
18873 -40194 -55200 -123361 -81770 -93561 -8210 41990 4307 -17664 35802 26554 17199 18255
18861 18255 46675 4998 38419 208388 230147 232170 166241 14867 -107809 -30110 57450
18850 57450 103571 113848 109288 86151 41100 42490 114043 76113 98308 -12748 -7702 16216
18838 16216 -23084 -121490 -98017 -77439 -154612 -152953 -89138 5598 118816 86924 232646
18827 232646 169908 186928 137272 83125 -78652 -158401 -89094 13129 -9591 -94211 -120664
18816 -120664 -75684 -92575 -17669 14550 67329 -35169 -24912 39274 -27791 -134137 -138116
18805 -138116 -152701 -157462 -99196 -145736 -48996 -83187 -112150 -64025 74798 82570 98683 237384
18793 237384 217822 27052 -16442 45326 57475 -19225 -64642 32123 112199 18295 80466
18782 80466 167107 152162 161993 245957 277373 239171 135361 109213 166211 75254 58201 117755
18770 117755 87763 58180 154562 260024 473548 543616 581819 653080 734465 798800 701653
18759 701653 492203 453498 429083 408014 407668 378224 217216 103701 118321 83198 89063
18748 89063 129556 21592 178021 317390 259328 258594 149888 127309 133255 205166 308390
18737 308390 267968 275350 152840 70903 67936 -12131 -40043 73738 86659 154540 139345
18726 139345 112108 100945 6884 -28198 -123544 -114315 -114684 -115404 -112588 -164049 -63049 -23925
18714 -23925 -18665 -60408 73447 169250 161011 61750 -45248 -121452 -141015 -43319 -41947 -79733
18702 -79733 49292 191467 190333 94725 62061 71497 123029 147906 33526 24429 -9053 -8339
18690 -8339 20626 48547 108614 6042 -128718 -128926 -16162 140328 133438 178156 160857 44294
18678 44294 -158517 -195796 -48264 18363 23660 113414 228854 175672 8177 -71992 -71422
18667 -71422 -35262 -64912 49652 132415 218228 135420 -94085 -229957 -125856 -42881 23434
18656 23434 -64144 39915 50364 22335 54136 5059 -57012 46396 95973 16203 -68949
18645 -68949 -50014 -117752 -135214 -106755 -183382 -242444 -221875 -241583 -196087 -165295 -191681 -145518
18633 -145518 -76069 -57756 -58846 -35942 -79275 -194009 -198444 -76515 11086 10379 -100065 -48322
18621 -48322 -67376 7767 -8901 -23494 -53389 -64305 -44594 -174734 -150299 9283 5536
18610 5536 -31763 -95500 -66546 24228 82781 120157 15692 -128781 -202810 -193241 -203687 -168721
18598 -168721 -170359 -166112 -63322 -37413 -125360 -124984 -50057 71392 49664 34969 56328 -66631
18586 -66631 -168041 -139784 60859 50939 -21288 -65056 -62280 -8195 2600 99038 12146 -34676
18574 -34676 15007 4278 -16777 -17944 26583 18165 75401 28962 -19581 -50171 -128189 -184502
18562 -184502 -113584 -53885 -152459 -64233 25480 1949 17028 46439 49778 -7811 26792 164418
18550 164418 80017 -29153 1464 61663 226931 246607 214689 180870 194024 247950 266976
18539 266976 248442 305193 292840 144521 168133 270189 391265 334779 115918 16727 21469
18528 21469 193312 261226 286931 244819 208682 151689 185057 74886 -1722 23528 42458
18517 42458 -4817 63874 115323 161792 115022 92586 46117 54387 145785 212752 337505 149245
18505 149245 -4595 -123149 -63826 155199 237457 187189 188373 113367 -15922 -102127 -25866
18494 -25866 135606 195446 147104 105248 140833 -1074 -14622 2833 -26412 -59252 -123325
18483 -123325 -112107 -137883 -146085 -77360 -34297 -33802 -71082 -30946 -72161 -93317 -88972 -27565
18471 -27565 20099 -819 29221 19910 21509 -21155 73493 88595 41396 -15046 -17672 73330
18459 73330 79643 166032 181714 48966 -21488 -51386 -12894 42805 129873 84780 40727 9162
18447 9162 113154 86421 60470 -43048 -202892 -27825 131213 41189 -40581 26557 132183
18436 132183 175680 213510 279884 198000 290444 394960 365516 158469 6782 64203 165218
18425 165218 185756 84524 47443 103611 82345 36675 5442 31837 84753 56558 65915
18414 65915 86848 85016 199218 128109 73026 38805 -57409 -96720 -15868 91940 188139
18403 188139 162505 77341 62793 89702 137597 106053 148578 177286 137530 80476 -15141
18392 -15141 -45934 32772 35198 -63427 3120 -15372 -31203 -36658 2575 10565 20291 7647
18380 7647 -158848 -217499 -249778 -177113 -133525 -73028 -82439 -101153 -80122 -22082 27146 81685
18368 81685 137460 163287 152696 111099 46908 97402 108253 58635 -530 39768 141724
18357 141724 242379 253227 239199 134859 -8052 -123182 -105254 -96003 -125563 -96605 38709
18346 38709 144253 43702 -56326 34505 76990 80008 130598 73915 64902 33488 -17824
18335 -17824 -6170 -93875 -138749 -104672 -47675 -32136 -30759 -69701 65238 137464 115949 137283
18323 137283 73706 90446 78323 -24375 -47844 3702 36272 150347 206661 239662 108015
18312 108015 44194 -10103 16426 149198 114629 98374 38435 53471 20262 131126 144736
18301 144736 9392 -105583 -123147 -57555 9256 -21670 -53838 -56439 -132525 -139294 -146759 -108207
18289 -108207 -66974 24867 8652 68610 66448 40985 -18375 82132 157432 74005 -22402
18278 -22402 84822 139343 97979 188162 164969 58147 36518 -166527 -191202 -38820 133037
18267 133037 142796 82882 52874 -7632 3545 -20014 -31343 -28100 88107 195489 200388 164259
18255 164259 234819 219565 213299 276519 318306 254333 97369 20145 150411 104531 132219
18244 132219 222948 202261 208895 140914 79976 118695 177564 251106 279253 200649 136963 190503
18232 190503 260409 270602 323284 202785 175904 177362 231747 224305 171274 212619 243856 246015
18220 246015 147598 84731 218687 140028 68394 127222 204132 154911 204783 313371 420911
18209 420911 404551 369266 369986 320823 274185 331799 342916 356884 411959 472643 504459 390321
18197 390321 350162 371053 334467 390587 328705 337278 286020 268260 311894 292810 238602 183566
18185 183566 153785 196117 224133 243815 213607 205553 129676 154336 178579 290519 378492
18174 378492 361528 423456 425227 450241 566503 517677 506106 577863 590016 541546 475795
18163 475795 479309 580967 588548 660148 758267 747838 700556 674044 777152 876948 911169
18152 911169 839755 818765 882338 959751 1005658 1086058 1274949 1402479 1457988 1389945 1426187
18141 1426187 1441274 1600207 1886911 2095786 2316957 2555284 2766934 3010244 3118163 3351037
18131 3351037 3616144 3911543 4225459 4641111 5053326 5547054 6002834 6510740 7151470
18122 7151470 7912375 8785262 9623870 10511372 11427869 12551782 13981824 15670825 17709005
18113 17709005 20216514 23353141 27173068 32136669 38678149 48052701 60746475 75560864
18105 75560864 89977761 108953401 136912162 142088648 102496924 67011858 47777349
18098 47777349 37050464 30611905 26385800 23285331 21088826 19632640 18595973 17948622
18090 17948622 17488050 16932938 15516200 13798046 12223075 10834941 9546488 8437780
18082 8437780 7546505 6726622 6050895 5444844 4879202 4397640 3939750 3493927 3187584
18073 3187584 3051208 2931171 2654903 2417480 2132547 1884166 1742672 1686931 1517157 1395612
18063 1395612 1346250 1327672 1300613 1118111 985730 824324 712733 619011 540371 502342
18053 502342 477646 564411 502047 382659 352026 262221 193824 274714 218572 150797 50721
18042 50721 57222 124358 262814 369775 463880 508259 496436 315361 200705 114544 76325
18031 76325 116748 262381 223512 137098 100607 15693 78354 90799 56323 153601 206528
18020 206528 230591 212756 86029 -1082 88497 81248 179684 230984 176098 40307 -42954
18009 -42954 39336 156692 167852 88235 21275 -25795 -68612 -142522 -121006 -2523 67759
17998 67759 72884 111777 219367 215077 179990 141947 109639 132912 95168 23020 -12464 -20675
17986 -20675 -43624 -53052 29314 91934 119583 383957 489177 467576 361520 287865 266806
17975 266806 191666 86557 -10206 29071 94131 100640 49602 116330 120836 20103 -20349
17964 -20349 -47090 -124276 -85061 -10854 24050 -41858 14713 76629 97738 115269 104376 48016
17952 48016 35853 18521 -49219 -79722 36327 64969 83481 128629 87037 109008 134701
17941 134701 183450 149068 32338 42774 38523 46131 60348 77482 -37503 -66782 39368
17930 39368 141938 204406 136849 21347 -52676 -31236 -49859 -20685 122122 228869 309748
17919 309748 262656 148403 -47294 -155913 -229872 -185537 -29485 24133 5761 -112853
17909 -112853 -102478 -30767 -43104 31853 41001 29251 63753 -16772 -48492 -30641 -39843 -5314
17897 -5314 96158 94442 110513 95776 -11471 -28211 -43603 -23183 7343 -56934 -86916 -116443
17885 -116443 -78486 -56933 -130568 -173217 -251036 -191978 -135146 -192584 -277981 -207402 -74565
17874 -74565 -14486 -53966 -85075 -182042 -160490 -100684 -114935 -147957 -145759 4506 74699 154976
17862 154976 200379 230043 153730 94879 91189 133171 73339 74167 50953 105962 153950 57793
17850 57793 -78066 37262 147734 153644 139997 199911 310812 290954 209287 119245 58450
17839 58450 151951 231400 297490 188117 70355 9957 -1783 91475 17976 -181726 -208432
17828 -208432 -167916 -84060 -35109 -111714 -186400 -97216 -138213 -44336 23709 -29565 1199
17817 1199 40410 -23616 -29614 -175033 -246789 -198752 15422 145390 74354 20152 87226
17806 87226 88005 124930 84563 69620 19168 24356 -143559 -242463 -221884 -75402 -78089 -230835
17794 -230835 -221588 -140540 -36208 25987 -52321 -90682 -79616 -77413 -118538 -141451 -55161 49091
17782 49091 -26884 -13387 -116131 -157087 -178820 -153561 -234981 -42070 104087 71308 46807
17771 46807 -103007 -243450 -261322 -236096 -229137 -215874 -242097 -132726 -28561 -117224 -129082
17760 -129082 -64674 31522 94370 15923 -72768 -77561 -82705 -39210 -27480 -66168 1274 141945
17748 141945 145467 -2830 -42758 19183 31543 -41216 -72895 -35449 -2946 -22671 -90447
17737 -90447 -186757 -258035 -13105 75968 -99352 -126374 -209222 -176215 -139242 -125783 -80220
17726 -80220 -15481 13839 -20908 158273 228208 120661 78948 8397 -169311 -281412 -207066
17715 -207066 -230090 -232550 -180651 -37674 52768 -30491 -88519 -63323 -17306 -84552 -9123
17704 -9123 -13426 61305 126814 58941 60020 103886 97595 155685 138179 49297 11413 124814
17692 124814 176857 97862 38450 -34032 -45718 -55652 -82000 -39481 -39228 -138316 -151955 26486
17680 26486 79625 121612 79983 -7664 -72635 -26381 79286 80084 -31351 -1149 -6204 50387
17668 50387 -9869 46683 30590 -26967 -13047 -83152 -112166 -78820 -10216 -51980 -79696 -45890
17656 -45890 -75173 24261 58118 -50800 31897 6832 13524 120891 116426 43014 158037
17645 158037 177147 103813 56746 69605 77167 57352 -4730 -43698 -79136 -41598 59836
17634 59836 180529 82379 19456 93546 11274 -69421 -136844 -137246 -89298 54549 99385 35967
17622 35967 -34579 -48486 -87708 -70910 -158262 -229537 -232173 -115010 -94733 -56042 11713 -14543
17610 -14543 -79783 7300 -29250 -9869 -32846 -52723 -37781 27120 170219 191278 -47306
17599 -47306 -169254 -77107 -34023 -52477 -74261 -65027 -114982 -109097 -207099 -286408 -414998 -467089
17587 -467089 -332788 -82228 41267 -24587 -21595 112107 180471 197094 161492 132146 14180
17576 14180 -79844 -64252 85215 98991 -8677 -40018 -42822 -179954 -223057 -215595 -200314
17565 -200314 -234421 -229150 -193103 -68942 -161400 -207873 -161884 -135683 -131224 -186895 -39873
17554 -39873 56412 83043 67644 178212 105543 -3788 -141610 -81841 -93163 -56835 15105
17543 15105 88054 96005 -59600 -189121 -224436 -175476 -70385 -135556 -167993 -24923 -41564
17532 -41564 -15622 45450 168318 155147 -17955 -125377 -69807 -13806 -65726 11231 -16916
17521 -16916 -128924 -54145 -110562 -88726 -50963 -83967 -99974 -63394 -22845 2457 -95206
17510 -95206 -34646 -3111 -39732 -6408 25741 -70314 -169319 -173589 -91991 711 -2937 -17978
17498 -17978 -184790 -67784 68216 98769 119667 111943 73656 89057 165273 148538 96192
17487 96192 100602 223192 210802 207374 160633 43932 -109545 -114287 -87599 -189539 -179754 -185310
17475 -185310 -311858 -353102 -254523 -121115 -84863 -27493 -3007 41754 -229 -44505 -114143
17464 -114143 -163564 -152361 -175941 -82164 28659 54695 -15519 -143933 64378 -9357 -88903
17453 -88903 -79914 -67627 14958 91131 103245 27324 62956 160680 231806 299997 363867 413882
17441 413882 402881 354606 448014 587735 752404 805887 609675 393950 214572 57946
17431 57946 -791 70894 164247 113783 -45766 -75404 -25012 -107253 -175785 -139289 -73135
17420 -73135 -65420 26760 85036 82426 74747 67705 80117 38275 70502 94325 152854 129653
17408 129653 101715 90031 -14240 -18645 21497 79541 90728 91305 143457 18933 -83215
17397 -83215 -60869 39971 103717 59094 -17937 -98503 -98348 -161524 -252866 -243011 -159433 -146225
17385 -146225 -226733 -187724 -53515 18190 18129 71119 3742 65689 43403 -57121 -13322 59052
17373 59052 23013 -102582 -200708 -182291 -159576 -184579 -160371 -73276 -18984 -44764 -68379
17362 -68379 -150171 -218239 -35521 69759 -104581 -183719 -124706 -70044 -10309 18418 176592
17351 176592 244358 155967 86442 24645 -54580 1609 44267 -4969 -114869 -85365 -109383
17340 -109383 -136130 -95694 -32797 -3561 -8869 -9201 -8326 -39294 -12328 -45916 -74222 -102294
17328 -102294 -137850 -211803 -303443 -200610 -77028 -63336 -63734 -140913 -79231 22529 72268
17317 72268 -16845 -60046 -4683 -59619 -138101 -201160 -48608 64515 80293 172360 296994
17306 296994 198738 168604 211550 210814 188164 77048 38674 80933 53016 -19923 -57405 -99694
17294 -99694 -193257 -196552 -102938 -93570 -32048 -54889 -100666 -18323 -27098 3568 -129875 -299000
17282 -299000 -312652 -104058 143271 176947 160581 94057 31444 10329 -75811 -29287 38863
17271 38863 80401 62313 15789 -66032 -104057 -92278 -89266 -147310 -77999 -21274 -45518 6504
17259 6504 36257 77394 70424 128946 14897 -67431 -65709 -20437 13947 28224 13309 24139
17247 24139 -75139 -125370 -134156 -104315 -125603 -113019 -173101 -135237 -39750 39107 -50210 -77859
17235 -77859 -10879 -62826 -100167 -126008 -207243 -96560 35774 21287 -118639 -242137 -185228
17224 -185228 -191469 -349117 -300327 -176315 -79509 -72382 -102010 -164330 -188128 -218280 -254729
17213 -254729 -158382 -152898 -106050 -72367 -79407 -105785 -103844 -36595 -58959 -26533 66159 69200
17201 69200 89302 57930 -39899 -158786 -211049 -238144 -156920 -147323 -119829 -74585 -121845 -35942
17189 -35942 18575 59085 -16498 -132970 -187740 -51294 19253 -56002 -109441 -75188 -22149
17178 -22149 36687 87296 58300 -7109 -96636 -175883 -235223 -271935 -194171 -64100 -52190
17167 -52190 -174035 -115005 -36784 56173 -15483 -49940 -23736 7782 15568 -79504 -72770 -13408
17155 -13408 58197 -17847 32612 13273 -21651 -50588 -29484 -46544 -114197 -98142 -37113 -50501
17143 -50501 -58262 -97882 -115676 -88667 -134635 -160993 -22801 21408 -33172 -181631 -232194
17132 -232194 -267644 -259277 -188505 -167215 -220048 -254755 -111616 11596 30060 -66537 -53616
17121 -53616 -132695 -136875 -72354 -54522 -84267 -51864 61501 124183 49654 -149206 -88435
17110 -88435 4684 -27779 -100559 -167558 -273911 -315685 -311122 -267385 -134870 -53457 -150085
17099 -150085 -103925 45981 131382 169671 74391 -35730 -53778 -33411 12752 169745 184463
17088 184463 121194 54327 42804 -75519 -29234 26112 50598 21725 28710 121166 235477
17077 235477 180813 62265 -44881 -74449 -73434 -53637 -68947 -47547 -118632 -190903 -132054
17066 -132054 -241688 -209694 -98929 -10912 153528 122312 115098 159829 254354 199446 125173
17055 125173 -2965 -88034 -66496 -67825 -34012 -116867 -180573 -210707 -189868 -149848 -162867
17044 -162867 -78410 -55829 -179964 -188630 -63095 -137879 -145400 -8334 -33050 66374 121850
17033 121850 124858 113516 61406 3122 -34882 -51566 -2236 104504 49035 93978 117198
17022 117198 36101 -63512 -57379 -7630 -16053 -36801 192 97227 172263 189393 69774 -38939
17010 -38939 -104688 -212466 -174128 -196981 -227185 -172686 -105915 -67337 -54674 -50746 -35526 23613
16998 23613 -34918 -119258 -136111 30478 101814 116284 -510 -76022 -128595 -94978 41055
16987 41055 154482 37209 -21593 -26530 -28675 3536 -55096 -59618 -39977 55087 136201 152465
16975 152465 53753 111832 58978 -27453 -15771 35190 34347 -9585 -62023 -123204 46337 189648
16963 189648 151033 131760 194197 162072 113109 108100 56266 76615 200053 122349 1036
16952 1036 -23666 25861 74113 38338 -39657 -31160 -38614 -139538 -172292 -103551 -77595 -11924
16940 -11924 38612 -31259 8972 145503 166690 159509 143788 205140 205136 145143 -646 -55823
16928 -55823 10181 -133736 -107929 -143428 -87897 -41018 -159366 -270051 -99160 4268 15244
16917 15244 33478 29225 -134958 -237839 -152445 -75645 -15588 -72488 -84648 -109091 -93983
16906 -93983 13806 -47217 -171031 -200504 -209937 -35164 75117 138990 174141 125994 -36549
16895 -36549 -201778 -123933 50475 142458 239425 210230 133656 22478 -34841 113509 211555
16884 211555 210430 81618 -84989 -120256 -12173 -69585 -114475 -154930 -193979 -76310 4171
16873 4171 -29247 -68388 -76328 -50642 -122113 -172354 -102704 35770 71609 166550 216142 172121
16861 172121 131403 127332 149224 118092 91727 44648 68634 196568 219997 128034 154448
16850 154448 288727 183333 32216 -8660 54853 96378 -28021 -29205 -75909 -91880 -81173
16839 -81173 -3157 100203 104526 36377 35540 50491 86592 -6810 -23440 34918 233717 214860
16827 214860 186111 142762 181042 140743 93269 -29303 -129159 -106236 -159578 -90319 -18610
16816 -18610 -88764 -13287 20162 -17855 -84150 -196980 -181607 -153776 -146752 -234150 -137711 -72283
16804 -72283 1305 -65146 -126178 -219702 -238783 -118425 -53510 -157588 -161089 -88149 -26243
16793 -26243 -77854 -70670 -4506 77228 -88196 -182691 -92979 32399 42637 3662 16664
16782 16664 48397 -72649 -112293 -58321 -107089 -76126 -91617 -126314 -109909 -64794 60402
16771 60402 128543 65545 11682 25271 88054 176337 14245 -164811 -146489 -162266 -88020
16760 -88020 35513 4884 -44021 -75361 -10832 122675 117281 50561 -24719 -84610 -48146
16749 -48146 -109454 -151487 -181940 -174002 -86085 -19307 -63833 -8 130035 146874 78312 -27296
16737 -27296 -172166 -129334 -67814 -43596 -81979 -90666 -90415 -39758 -24515 11854 97815 62124
16725 62124 5122 20167 11400 76270 73266 3508 -16014 14776 -10614 -79900 -108576 -77015
16713 -77015 -29081 -34006 -60941 -88148 -215057 -274927 -263392 -209788 -160067 -152720 -5408 -30443
16701 -30443 -121180 -114250 -100161 -5806 141264 87725 44975 131396 106700 29794 -113289
16690 -113289 -19610 121738 160283 111225 5576 -105424 -75954 6515 50141 101921 113040
16679 113040 13610 -29036 -30069 -155358 -230797 -174728 -87641 -62320 -25199 33143 -3770
16668 -3770 -60072 -129908 -173138 -199119 -123303 -56865 -15259 -31239 -49792 -143780 -33138 45937
16656 45937 156026 180836 112180 44883 16380 17521 54235 55302 41285 95583 -8200 -100573
16644 -100573 -141779 -66376 -5949 68660 39215 74607 -17189 -124876 -152386 -109866 -72274
16633 -72274 -153323 -261553 -317404 -123380 -6206 -12711 -26579 -76666 -130489 -140084 -152657
16622 -152657 -86603 294 19047 -137861 -87154 -99421 -119523 -18191 72113 29363 -25812
16611 -25812 -116803 -84155 -36141 33807 -118678 -229583 -164682 -113782 -55755 77822 93125
16600 93125 -942 5059 33804 88846 115226 66378 20080 -4440 -62915 -115148 42366 158971
16588 158971 158031 76217 108930 77164 -93061 -160923 -142919 -65426 -46164 -141135 -164085 -99773
16576 -99773 -85654 -83257 -50781 -97140 -135560 -222455 -275899 -149541 -17530 175221 219347
16565 219347 170344 92379 92370 2108 -68567 -175092 -210634 -278212 -215284 -221401 -190960 -59652
16553 -59652 -122949 -101257 -116569 -210366 -272573 -229953 -128443 -155211 -156585 -231878 -279310 -91509
16541 -91509 168224 178506 118293 140762 125022 141146 2407 -101019 -31950 -44650 -41486
16530 -41486 -72215 -25715 -3624 92439 89942 171663 198553 124589 21022 -56711 99233
16519 99233 275518 266991 186833 -33907 -57774 -45416 -23005 -65904 -40370 -11576 4144
16508 4144 54176 -5679 -64751 -86382 -109912 -182186 -242612 -221943 -180177 -96442 -117651 -75508
16496 -75508 43192 97141 30693 -70097 -52803 -113794 -77270 54751 155523 146133 18007
16485 18007 14445 -59403 -55284 -36118 -69143 -135482 -158545 -138488 -75559 15546 -40544 -12165
16473 -12165 -9601 1772 -173323 -219224 -158819 -112641 24261 -34986 -101188 -119651 -137825
16462 -137825 -46687 51320 49124 -25170 18830 136310 171783 111697 5270 69755 93029
16451 93029 26111 -36962 -53491 63248 175156 206329 163073 17406 -41042 47731 -117491
16440 -117491 -204252 -115742 -73798 72611 190996 194354 80729 4890 26430 -22192 -24571
16429 -24571 71841 153241 138431 8068 -40687 -73067 -92937 -72102 31325 39855 46089 42715
16417 42715 32374 32989 16857 5563 20935 57017 -68262 -56168 1348 5761 2875 9443
16405 9443 -501 -100388 -87961 18926 15001 27979 -1442 -38418 31816 2907 -123835 -69209
16393 -69209 20191 -47943 -113940 -90396 -48505 87973 41299 69020 162903 140518 82474
16382 82474 11556 86814 191678 224651 70983 86283 -10091 -71124 -52234 -16651 76983
16371 76983 119879 -48216 -191662 -141849 -23904 -37097 13550 60160 135103 181917 188844
16360 188844 -38473 -137510 -194350 -241844 -179444 -172507 -97470 -137965 -181748 -189878 -158605 -132219
16348 -132219 -69292 129714 203234 262331 270499 146779 -21952 -60048 -105304 -29329 -84362
16337 -84362 -61305 -36561 -93760 -163832 -186759 -246015 -341424 -282207 -226000 -27633 91107
16326 91107 147373 139349 41509 8952 62547 46673 -8675 -5609 67977 73809 60057 22898
16314 22898 -30557 -8763 42174 122783 204585 169455 58678 74753 -4614 11629 40937
16303 40937 107812 123212 109661 90600 -20437 -33763 -50737 -154193 -177114 -121379 -62253
16292 -62253 -63794 26998 -4930 -52118 -55907 91329 85094 32967 158932 189152 81492 56548
16280 56548 -20320 -29651 65040 154615 130582 74868 -21429 -139981 -113015 -136067 -175372 -169942
16268 -169942 -191212 -112525 -2788 25101 34170 -15157 37945 214765 220852 108855 -50557
16257 -50557 8665 59432 21470 68159 119624 82536 51193 35843 42490 -56371 -55385 47498
16245 47498 154362 43359 -43578 29197 -46925 5671 33528 32742 -63934 -185757 -230572
16234 -230572 -232458 -185583 -139020 -234654 -162623 -105384 -90721 -102155 -68694 -37856 -82286 -162914
16222 -162914 -215674 -149683 -116462 -87653 -18225 47030 22982 -57701 -79433 -183725 -194908
16211 -194908 -354601 -227822 -55385 -103284 -194593 -168685 -81788 -24475 -31881 -23375 28633
16200 28633 -45054 -33275 126100 203404 172080 141358 126766 12648 -93978 -173799 -79467
16189 -79467 -136969 -120172 -215953 -233432 -232584 -233254 -181996 -190757 -204905 -204428 -202119 -177579 -97809
16176 -97809 -8634 28758 11547 157557 92660 26134 19487 -30738 18040 36254 -99496
16165 -99496 -221545 -253283 -198715 -161061 -76722 76888 -6004 -57332 -113245 -117517 -249360
16154 -249360 -266738 -224761 -111148 -99551 -137150 -203698 -323052 -262249 -202172 -124354 -38760
16143 -38760 87627 109639 34472 11495 1732 67650 70978 104383 33935 2348 -36081 -124044
16131 -124044 -124242 -147531 -172504 -188788 -174000 -175682 -206782 -208813 -79797 38996 81894 -45395
16119 -45395 -80588 -121129 -15171 -71202 -188271 -184747 -35941 129108 196133 92980 -48793
16108 -48793 -173222 -188067 -68572 -24926 -28941 -113062 -138109 -194895 -219014 -314548 -369877
16097 -369877 -246442 -155905 -119955 -120628 -139747 -118024 -192444 -154817 -141476 -82910 -93414 -106520
16085 -106520 -60329 60723 33350 35160 43527 -81903 -58960 8439 23336 45516 48210 -46614
16073 -46614 -52999 -130202 -160078 -219779 -268696 -234579 -177333 11116 101830 -14049 -125615
16062 -125615 -173554 -137617 -91848 -81033 -26214 -197016 -149534 1545 55285 207564 75709
16051 75709 -193348 -242553 -85677 -131104 -110121 44874 56338 12257 -104756 -76474 -22662
16040 -22662 7896 52557 2135 -31068 69029 76676 75446 95907 33300 63760 -7977 -77918
16028 -77918 -100795 6786 70495 -106200 -74528 -38213 2855 13233 -53124 -89570 -116948
16017 -116948 -180753 -138552 -127376 -143129 -138183 -20255 74473 65954 -6671 20840 -57621 -17779
16005 -17779 132146 149875 49139 32628 -82320 -106569 -93467 -40599 -92285 -40918 -40753
15994 -40753 -57138 -164707 -100092 27252 -60368 -118974 3443 53326 -95837 -13873 63051
15983 63051 33178 3453 59637 61886 13184 -20896 -43982 24339 59093 89794 63731 27995
15971 27995 136957 159585 260485 213102 10638 -86744 -34463 47975 74430 68004 55492
15960 55492 -20593 -92793 -13084 42744 131730 19000 -81873 -99841 -71961 88776 204335
15949 204335 209283 51461 41780 25553 86502 2055 -72564 -53962 -32206 -106832 -210607
15938 -210607 -178091 -93789 -136705 -187560 -149067 -81669 -123955 -13443 -25512 44325 -11743
15927 -11743 -7263 44524 -12723 52648 141480 41817 -35545 -54911 14428 -96202 -245957
15916 -245957 -188294 -42190 -17921 -57717 -61817 -38529 42467 123568 122945 22504 -55762 -94657
15904 -94657 -125198 -35195 40423 -17047 -135084 -32817 95219 102545 101366 85405 3574
15893 3574 -79933 -156366 -210364 -168917 -18743 35233 38779 -73954 -78811 -31760 -43235 -123182
15881 -123182 -35367 -46479 -172935 -86373 8675 22353 130926 64958 3100 -4849 -75244
15870 -75244 -37765 -88288 -203455 -219093 -89577 -9472 -48536 -2226 95488 178107 156849
15859 156849 216008 138480 150549 153332 92026 107708 142326 95613 -56901 48514 110794
15848 110794 34753 17941 107982 136277 -52075 -151094 -73329 -55196 -186068 -248245 -136731
15837 -136731 43765 72029 -23341 -51105 -19736 -110200 -181233 -29067 128509 64219 48976
15826 48976 -84867 -182643 -123983 -7341 53615 67902 -60825 -89942 -49590 -27535 -127429
15815 -127429 -109193 -64976 24705 -35476 -130404 -147108 -108928 -47105 -73791 48470 124973
15804 124973 46159 17907 3063 -49915 -889 -25098 -118166 -198122 -59464 -24269 -54020
15793 -54020 -133927 -122916 -159758 -53944 50789 -36292 -46867 -54964 -18611 21527 86769
15782 86769 83573 209830 180680 89787 25898 -129068 -64089 95148 96704 95672 -91551
15771 -91551 -136626 -104058 -132890 -165986 -171769 -104164 -118112 -101154 -155529 -89929 -106654 -134514
15759 -134514 -13757 -72956 -57066 6041 -4232 55911 12295 37460 -51646 -59551 -55696 -116273
15747 -116273 -214668 -145185 5689 45448 -21967 4255 28163 66356 61046 13331 -81221
15736 -81221 -155602 -234974 -238632 -140340 -29477 -137723 -281958 -191504 -38677 -90967 -92079
15725 -92079 -69697 -99765 -139297 -88962 25739 23501 -74738 -87703 -15419 -2137 32899 127134
15713 127134 94871 -9196 -54088 51578 -60745 -163084 -106748 -29941 42585 48744 60559
15702 60559 8941 12499 11083 -116255 -96309 -56777 846 90457 60273 -65743 -7132 7247
15690 7247 -108407 -24915 76437 24878 109160 263886 189918 63052 59622 23042 8771
15679 8771 65657 36674 39540 104646 58162 8113 79492 156307 152349 50960 -13544 -6922
15667 -6922 11771 77518 60380 107023 84964 84738 160868 128630 7073 60238 166883 171234
15655 171234 154897 16514 41943 91755 146287 215188 210557 143859 57361 11596 79905
15644 79905 88193 58361 -50870 -91831 -152415 -124734 -230219 -212680 -92653 -57433 -72881
15633 -72881 115914 177306 91478 93112 56098 74973 -28041 -97272 -37849 -52976 -20392
15622 -20392 149825 179085 109741 163441 90832 -126914 -225895 -145321 4637 25146 -79836
15611 -79836 -68363 -69603 -81853 -90249 -182758 -244362 -234646 -185253 -180684 -208685 -252423 -238620
15599 -238620 -177643 -62407 -22674 -105801 -5760 100210 86105 46145 -69563 -20385 27883
15588 27883 44671 141096 136004 152217 54429 15527 -44114 -178300 -170780 -126278 -81498 -22215
15576 -22215 -16837 35438 67684 -65187 -243562 -224533 -146920 -20540 12968 -72626 -164710
15565 -164710 -56157 21738 38862 -28942 -81244 -85793 -136723 -122739 -36319 5326 37529
15554 37529 -5325 -76563 -2718 15049 72035 212869 191870 -24415 -47730 11943 87300
15543 87300 109666 76659 13220 -113036 -258686 -258031 -123467 -109841 -148924 -185121 -123297
15532 -123297 -136494 -177641 -217143 -176515 -286931 -346875 -281974 -127248 -28918 48654 178515
15521 178515 222086 146822 87270 41402 -80590 -222299 -109139 -165465 -68262 -167691 -123500
15510 -123500 -54280 -3659 57035 -5665 -149937 -246742 -235782 -220810 -121396 -69480 -143913
15499 -143913 -76859 56867 15475 -146066 -94208 -127654 -85924 27369 -9455 -90911 -47232
15488 -47232 42291 70004 196969 222159 170143 243956 178686 100590 59355 -45147 -192630
15477 -192630 -183272 -75521 32790 -27351 -69520 -178490 -178879 -134652 -178115 -15293 -53023
15466 -53023 -132326 -99851 -139648 -83690 -26586 -77681 -136293 -119446 -32010 76602 90732
15455 90732 50115 -3514 -60155 -42866 -85263 -98127 -3145 230921 124927 -61211 -27492
15444 -27492 35083 -56797 -166320 -126997 -55835 -29586 -66973 -118168 -82370 -60701 -74723
15433 -74723 -33302 102355 57174 -110932 -163480 -108495 -133108 -168948 -181300 -77672 13933
15422 13933 16291 8192 30424 135650 130937 -41553 -144982 -90869 -33114 47116 -69489
15411 -69489 -144333 -127304 -83684 66445 76806 -31312 -153637 -166079 -169764 32340 102400
15400 102400 59111 21158 105146 149835 142452 152275 182968 57645 -20683 -59001 -146996 -134838
15388 -134838 -53080 -50925 -113396 -32424 -2948 1159 -8774 -134691 -258631 -298733 -295311 -247419
15376 -247419 -74685 -23971 -146492 -225486 -255644 -212771 -154981 -87010 48400 99389 79794
15365 79794 113525 191685 154896 80382 108604 167610 89957 19240 101248 84054 21022 24954
15353 24954 143670 82262 78618 64962 65888 26325 -4763 -37551 -92875 -175369 -160063 -136903
15341 -136903 -82467 -99255 -110789 -61550 -82580 9627 8969 -136003 -203821 -159802 -73587 -81711
15329 -81711 -126702 -90646 -37478 76820 139708 100873 59770 137418 263680 269016 245422
15318 245422 95045 26182 129825 125572 16260 -68770 -72372 -106559 -136991 -31492 23139
15307 23139 70195 1492 -63106 -44106 -49489 57917 112075 28956 2956 -23538 -20892 7001
15295 7001 25289 36763 5803 -52331 -24665 -71381 -60252 -62434 -202775 -126437 -17173 -53190
15283 -53190 -91231 -121127 -156258 -144431 -80687 -67020 -34935 -84536 -58821 6849 26695 -81854
15271 -81854 -90294 -121240 -160662 -177367 -54655 168611 232810 174427 103517 115176 85349
15260 85349 124030 -46833 -225775 -212407 -294241 -182686 -46575 -20077 719 22186 68723
15249 68723 88356 41501 -23123 -38261 4338 23318 -8752 -4931 29099 7011 33007 147958
15237 147958 182858 140026 107471 37121 16045 -60794 -152770 -109078 -166318 -194327 -159243
15226 -159243 -79319 -122318 -199453 -135196 -82838 -54215 9102 -79987 -141136 -188697 -168078
15215 -168078 -207389 -186714 -140415 -131906 -132971 -38448 75376 154728 125869 86758 -129216
15204 -129216 -233837 -141448 2044 20869 -71010 -21106 -81070 -129333 -130790 -185942 -218177
15193 -218177 -212997 -164498 -9525 139937 151749 81722 69453 67215 74498 82429 94815 61233
15181 61233 134472 83597 104381 149258 101349 15337 -54228 -78121 12214 83442 125753 83159
15169 83159 71121 25112 93690 12053 86669 105941 -40627 -176746 -160211 -173139 -223413
15158 -223413 -276097 -233734 -241465 -223581 -109801 -89107 -101191 -131763 -156282 -164591 -71223 -37803
15146 -37803 -61983 -158345 -136570 -121608 -56428 -23981 31125 -55535 -53006 -92194 -140055 -153133
15134 -153133 -172903 -133477 -45961 26041 15486 -51572 -32758 24532 115274 38416 27781
15123 27781 148154 156495 114018 87103 -27954 -10628 50759 62070 -47203 -67453 -203041
15112 -203041 -249411 -122312 24038 -6383 -61647 -117551 -142863 -129985 -189798 -163112 -71071
15101 -71071 99199 282698 292315 325905 159995 -56757 -41612 18382 47945 4510 -2986
15090 -2986 140314 166716 -24921 -44927 66247 79512 156113 186587 258608 322671 234928
15079 234928 217053 138499 -118936 -132875 -93921 -90273 -58795 -31713 4544 -59191 4764
15068 4764 -58058 -187104 -190854 -144418 -83626 -89731 -30766 -25704 -41452 13852 -14627 80249
15056 80249 215925 221472 65483 -177922 -290873 -222536 -139158 -166222 -141325 -117521 -82760
15045 -82760 -87328 -82955 -38680 -24318 26563 -9244 -91140 -23552 133582 106585 -119173 -195692
15033 -195692 -78615 42603 74450 258760 361611 247359 42311 -4390 6783 133047
15023 133047 251398 277043 214239 46360 -61085 44725 139574 140236 174719 378656 470831
15012 470831 474672 461059 463951 287422 227249 357205 448812 588556 515571 503661 713393
15001 713393 816198 983890 1228010 1631051 1975106 2292713 2808271 3324761 3076699 2104481
14991 2104481 1317752 975447 882536 708754 535352 522722 493382 470560 474171 399510 378757
14980 378757 342016 377805 216400 36035 31735 130267 240313 380906 473201 380672 289103
14969 289103 143690 268506 213367 216250 185668 237721 112676 51312 11951 79601 92755
14958 92755 165993 94476 127770 171294 75038 171657 242694 109365 41776 4774 -26995
14947 -26995 -4612 82755 -72915 -168263 -33333 51806 5139 -4995 71962 67414 21158
14936 21158 89320 55960 79668 145661 169895 81721 -88421 -167770 -95466 -27217 156688
14925 156688 144996 -50317 989 -36429 -34486 7826 -33525 -72661 95096 59567 -25104
14914 -25104 -73362 -117115 3171 -97614 -232971 -289412 -176672 -37514 -32358 4987 -65264
14903 -65264 -5291 10334 49075 51791 -58137 -82564 -63115 -12349 54044 101155 69827 484
14891 484 70169 26751 -95929 -177419 -250202 -231335 -247470 -245547 -244269 -170256 -148099 -2730
14879 -2730 102055 185791 163903 91057 48649 -46432 -88225 -45274 8273 -5588 -3832 -41886
14867 -41886 -86535 -151501 -183208 -166659 -86030 100356 119818 142986 298729 242669 37496
14856 37496 -106394 -167995 -60017 -125629 -219329 -144592 -81179 -149838 -81130 -85173 -13539
14845 -13539 -44625 -194348 -93926 -67412 -138231 -150887 -194620 -136853 -59882 48159 116655
14834 116655 62793 22666 -143407 -258734 -257021 -168724 -173962 -125666 -86189 -30701 36420
14823 36420 47793 -19119 93526 151677 74545 81409 220798 225056 29340 -7105 72240
14812 72240 -1853 -126381 -130500 -64443 -149774 -186776 -148465 -26104 65758 36950 115341
14801 115341 143403 207316 217629 59291 -7255 15013 -17127 -23743 85738 37545 -70576
14790 -70576 -79696 -47479 -10304 -53880 -43228 45733 12350 -144618 -260270 -232623 -132814
14779 -132814 -14398 16632 -82151 -101776 -139988 -114834 -52709 -99181 -128655 -61137 -97709
14768 -97709 -53777 -81593 -163384 -150667 -27488 36612 -17378 47842 96372 136772 58564
14757 58564 33084 152434 56200 21018 54627 -2279 19520 7152 -53285 -154755 -115789
14746 -115789 -36496 54346 817 -105346 -134651 -100720 -149325 -154399 -67554 14074 9936 59688
14734 59688 17134 22189 44056 117497 214415 152055 9814 48996 49706 -64216 -79726 5168
14722 5168 19358 809 1940 64750 133930 106989 29168 4797 143388 207266 275490 247370
14710 247370 127014 117628 125768 55243 42841 102473 -40363 -26421 43899 125021 186969
14699 186969 150164 52349 125704 182590 161613 185286 293181 206431 114404 60873 -37541
14688 -37541 -141772 -173743 -194457 -117270 -133329 -108532 -54832 -29395 -106225 -112928 -139240 -207608
14676 -207608 -201981 -143505 -46309 1214 -95795 -36923 47137 170413 250211 144005 19995
14665 19995 17261 25111 41550 136504 46565 -81626 12857 113678 190268 299403 269308
14654 269308 214893 219465 226777 220111 153376 123336 134369 157676 113664 132354 128814 130961
14642 130961 85077 212829 338778 445712 424175 318200 83847 -172249 -163903 -68585
14632 -68585 -60493 -124515 -91343 -6299 -29121 -52500 -15643 -98375 -93232 132247 86274 -38292
14620 -38292 -69167 -108685 -83474 -90575 31543 148605 206041 228437 200413 188076 29767
14609 29767 -81126 7684 44239 84275 218910 178349 176144 91066 -3340 -42541 -80028
14598 -80028 -138815 -185591 -177338 -163687 -81410 127795 86260 -67800 -122908 -4835 35648
14587 35648 2260 -67146 -74621 -76239 -84668 -52800 -14703 -122078 -187902 -119349 -103692 -33732
14575 -33732 14067 1507 20625 -30735 11932 129621 197068 233165 314227 253102 217863
14564 217863 182207 189949 151972 103625 -72789 37237 186094 262254 277627 248846 183541
14553 183541 147051 141878 118870 53151 -110819 -250174 -316926 -246455 -201321 -44200 27595
14542 27595 -74564 -133865 -86458 -43842 -78160 -136344 -151930 -201223 -242848 -302254 -246097
14531 -246097 -108250 -41766 38167 45383 -9046 -55429 -148913 -247382 -160364 -87037 -43105
14520 -43105 -42161 43810 -89886 -200018 -203902 -127944 -5129 30456 1243 -31653 -64697 -59292
14508 -59292 -42002 93220 138657 197809 158003 159982 80588 -12380 -68674 66136 124340
14497 124340 91779 57067 -11198 -101275 -141345 -75007 59684 26902 -25186 -83939 -99503
14486 -99503 -105502 -29851 -88827 -102014 -30540 27530 33605 116836 186563 113524 129724 133295
14474 133295 80856 48415 -21267 -87171 -25343 103381 83204 -11845 -18912 147048 109004
14463 109004 132893 128101 50767 55322 52793 -155657 -219784 -54105 -70090 -33875 -68032 -24187
14451 -24187 39778 140033 145284 179875 168644 72705 83923 72347 34811 44416 -53533 -188146
14439 -188146 -211210 -81372 -61243 7097 111471 101699 34500 52689 -14876 -164620 -136113
14428 -136113 -7795 -113373 25854 242575 248576 70075 56536 113517 234051 58229
14418 58229 -50806 -86247 -118482 -75301 -27696 -59496 -117250 -167838 -86842 43104 118852
14407 118852 85294 82079 72323 17688 19508 -126119 -145603 -135085 -75361 -150496 -177813 -119514
14395 -119514 -252797 -295942 -214248 -202329 -278875 -310173 -190158 -10801 -17058 -22512 -33894
14384 -33894 -41368 -61903 -64257 -119932 -199027 -327095 -314462 -174205 -78892 -162635 -161604 -172158
14372 -172158 -34614 14236 -45175 -110123 -69715 -79578 -35369 9516 -40391 -67777 -9509
14361 -9509 126591 150692 157894 110287 149416 194752 128016 148193 95790 48545 3929 43881
14349 43881 196635 223576 202318 75346 -26912 -50595 -91669 -52902 124828 180131 65024
14338 65024 64717 69572 55625 26652 43748 -30042 -91040 -157047 -302261 -328332 -203673 -73830
14326 -73830 -3885 -87444 -125761 -81509 -42133 118858 227224 202294 136146 76934 13958
14315 13958 -46109 -87229 -135774 -187014 -111479 -63726 -90637 -100842 11377 60540 28013
14304 28013 20773 33248 61296 23538 -133852 -245443 -199868 -125651 -147938 -188929 -147405
14293 -147405 -14446 8600 -175344 -216226 -154673 -85723 -19553 -173568 -215004 -222728 -160310
14282 -160310 -69422 -4719 65048 65485 39817 53386 8631 54376 -23956 -120359 -180420 -185587
14270 -185587 -239100 -142924 -43030 -81759 -43604 -39068 -42534 -14362 -47800 -35047 -33634 -200910
14258 -200910 -191172 -132518 -150369 -99221 -2047 59720 82924 -78920 -92251 -10920 -33175
14247 -33175 -61401 12037 37098 45600 22733 16491 -32980 -87924 -162431 -234326 -183675 -98183
14235 -98183 -11614 -11510 -61179 -17686 -12522 -18381 -94890 -97167 -86061 -53871 -107550 -121622 -33799
14222 -33799 -23531 39264 107596 15460 -51009 -113133 -52895 24410 59220 140834 56513 -20165
14210 -20165 -48293 -15025 49691 175906 184803 72385 77303 59244 11683 -83714 -132362 -201130
14198 -201130 -185763 -74536 16933 36660 69018 140870 135052 135351 71565 34245 -53148 -40131
14186 -40131 22832 60074 76123 41237 88523 95646 63424 48894 -232 24997 68053 -8383
14174 -8383 -94387 -61264 -22095 -138471 -181110 -60749 -95682 -49909 18448 58676 122684
14163 122684 317805 369981 211239 10177 -65763 -681 -12519 -3313 104047 55308 -66672
14152 -66672 -66127 -25792 63147 192637 137998 -3123 46118 22039 99108 286710 294586 222386
14140 222386 90381 -79960 -73707 -35709 -24407 112223 229878 159750 126691 115812 56083
14129 56083 51032 -23224 -45733 -28076 -138498 -106705 -93190 -29120 41851 -2772 47491 6337
14117 6337 57626 -9950 -42711 -65282 -41370 -107419 8141 -22345 -81393 -174420 -111868 42315
14105 42315 40768 35660 -26043 -15672 14299 -48072 -122862 -50226 -4191 -89534 -130693 -38482
14093 -38482 3429 -138781 -120401 -13032 83529 58218 46357 -5436 2923 125824 52228
14082 52228 27217 -38626 -79767 -53413 -125949 -199020 -201076 -180921 -164919 -170287 -111807 -72510
14070 -72510 -123531 -94645 -174076 -143458 -243263 -176892 -131029 -143828 -86128 -4288 47012 -111190
14058 -111190 -176130 -244225 -212038 -163976 -184485 -135420 -168553 -116301 -48209 23289 24183 -13463
14046 -13463 75333 96324 867 18327 120996 93953 -26676 -73973 -103800 -114591 -79643
14035 -79643 -31930 -35051 -2768 -45226 -116666 -69533 23708 92722 194363 176894 195568 242499
14023 242499 263722 261611 214005 111660 26 -19641 -4533 17396 38468 102297 159091
14012 159091 103419 77576 46313 87016 131884 62100 106902 112147 -43224 -125950 -136264
14001 -136264 -104849 -63096 64809 51134 96813 107699 157187 149830 84420 15348 13092 -41495
13989 -41495 -90497 -44769 96465 102270 -73805 -62888 -2593 -3328 13295 28153 107334 71596
13977 71596 -31910 -119884 -57778 146755 115649 120158 129145 -21395 -80106 -69079 30672
13966 30672 88540 95743 115494 203818 5305 -77627 -119560 -127788 -86690 -3984 -54815 -69922
13954 -69922 -56438 21193 -11323 -76464 -94748 -125785 -58280 28449 -9816 -10290 -3121 -75669
13942 -75669 -85993 -212318 -115691 -17646 86826 135694 -91201 -253121 -153225 -25183 -87053
13931 -87053 -44788 19728 63344 33738 -93941 -60813 -102746 -57939 -72349 -39979 -7945
13920 -7945 57847 44230 63051 106922 66655 -7562 -170710 -124822 -31677 127418 99901
13909 99901 -121121 -196916 -106456 2405 10198 16521 -13022 41746 46124 18224 -99648 -155149
13897 -155149 -163738 -123612 -114113 -6421 -19015 -40736 -35508 -21363 7416 -32282 -164225 -266682
13885 -266682 -253904 -132186 -17846 -66601 -113404 -116915 41015 93850 43001 72004 78724
13874 78724 -7190 -73038 -90806 -133130 -48888 -1153 -41589 -110653 -66587 -7283 7940 102500
13862 102500 61026 35017 60940 53414 -2284 -692 -22854 -122504 -85156 -88549 81899 85987
13850 85987 -18391 5538 46174 -60815 -178775 -196610 -185212 -126293 -132246 -88448 -13438
13839 -13438 26163 -12393 61870 106111 132810 121082 110674 -1545 -92687 -41883 115481
13828 115481 164453 74088 -104544 -161634 -151220 13464 74947 62419 74011 47749 -100189
13817 -100189 -142045 -65724 -10440 -48200 3781 -75686 -51617 97207 199495 90487 -33896
13806 -33896 -88044 -81865 20694 183596 161472 134759 218245 261360 197343 111927 118084 228265
13794 228265 335565 348501 383831 335209 248011 311965 473979 449523 292413 331673 312457
13783 312457 124641 18265 27982 44001 120312 221468 156879 75784 105343 82297 134076
13772 134076 -25667 -5686 -19239 -40362 -16295 -41143 -106078 -31642 141352 226959 210086
13761 210086 218388 291351 203423 96489 141049 134797 244739 189623 170485 215576 288726
13750 288726 256146 302185 298910 257581 291933 296794 247283 289157 372754 439062 334872 267112
13738 267112 164042 170853 215095 78266 48365 84313 122822 65895 -27299 -81003 -54230
13727 -54230 -95497 -102764 15893 29373 -78980 -46805 46278 91145 199342 218729 197826
13716 197826 112271 180110 299289 314141 213137 103992 62064 191027 30307 -97471
13706 -97471 -23079 98521 95229 59066 68101 99201 -140113 -159605 -32427 48811 110248
13695 110248 130368 66680 -108196 -90270 -26536 112497 115716 113618 81055 61783 79546
13684 79546 98642 93674 45286 41575 75223 134451 142086 31304 32676 129612 194973 140960
13672 140960 43846 84382 -33310 -59116 -113936 -92695 -107920 -40992 -28419 22703 100876
13661 100876 79276 24129 -6253 14905 36569 -32904 -125383 -83293 -54833 43666 36074 62379
13649 62379 123926 20432 -33453 4 -9225 -7810 139540 207478 189958 165633 123650 105623
13637 105623 123894 153680 149548 127400 72199 67787 152101 21502 -34439 -88940 17814
13626 17814 84046 76857 23909 80881 121117 136878 112250 83651 -15519 -54242 -120267 -9000
13614 -9000 125644 113894 182155 70234 31543 -77674 -12234 98960 26830 101022 166863
13603 166863 202967 102955 -52986 -92947 11164 73094 60705 -7161 6222 106882 94528
13592 94528 73884 112323 80075 56291 19774 52768 94321 48945 -1694 -37587 -27840 -26819
13580 -26819 -81684 -227407 -219086 -215169 -260124 -350778 -240564 -94604 -98590 -144014 -205768 -123246
13568 -123246 -6254 116034 176333 191126 52210 -41656 34425 88705 1499 12700 -79846
13557 -79846 -83659 -158231 -93871 -4304 60449 20232 -84707 -116281 49138 -8912 -137399
13546 -137399 -65847 -53550 9783 45420 -34654 -44144 -15441 60552 70996 25072 7384 -30555
13534 -30555 -53961 -11369 63125 80149 599 10119 -81244 -35512 95706 258742 164099
13523 164099 96116 -33515 -191339 -103891 -37035 -103609 97192 188930 96731 202760 299076
13512 299076 252246 148441 140017 66126 6330 51421 63699 55211 5987 -21638 -11932 -58950
13500 -58950 -47145 30786 95005 123177 221699 229672 75371 43690 -17932 -32319 62251 -30368
13488 -30368 -27125 -14541 -16873 -6109 -73859 -132895 -15331 -10157 -58129 -113960 -28247 -46797
13476 -46797 -90443 -28167 6195 -23530 -134319 -101882 -47844 -78731 -138319 -190600 -66770
13465 -66770 20760 -93021 -12941 86968 51342 -45984 -58445 3702 58604 80616 -27170
13454 -27170 -689 79714 -73746 -184497 -53770 -127122 -8503 92356 138232 106078 79041
13443 79041 103686 193605 103161 51919 -3068 -137518 -158276 -61991 12325 -30841 -129401
13432 -129401 -121920 -101522 -120789 -82922 -48502 55681 135762 130563 270520 181504 63528
13421 63528 123362 152423 158663 57273 -45317 -12139 17022 96241 48308 -71573 -3103
13410 -3103 80131 186274 -16524 -162560 -166203 -125200 -66480 -59324 -82818 -3415 -104684
13399 -104684 -245493 -208452 -74858 115447 208176 176533 86928 -27868 31262 -123143
13389 -123143 -167392 -11123 45414 84476 113026 154434 209912 207336 165411 74647 -43870
13378 -43870 25522 81609 119281 130715 112909 75704 84937 110495 70229 89779 75692 62421
13366 62421 115038 154617 50906 -12645 -88520 -41505 -39130 -20983 -7194 -25297 3788 23710
13354 23710 -1600 14556 44857 -8346 -24816 61071 -11199 -92013 -38798 30885 113935 63580
13342 63580 48416 -86669 -142889 -99428 -21163 -21887 -49744 -77057 -86652 -62626 -17788 29674
13330 29674 -103115 -148259 -61081 47667 130019 60659 44749 63701 53281 29245 45529
13319 45529 -76443 -80086 -42571 28224 13010 -3286 34155 58105 42705 146597 110471
$$ [...]
##END NTUPLES=NMR SPECTRUM
##END=
