##TITLE=Analysis number 319452
Compound Code cc 31904
Project Code adrs
Chemist Name durham
##JCAMPDX= 6.0         $$ Bruker NMR JCAMP-DX V2.0
##DATA TYPE= NMR SPECTRUM
##DATA CLASS= NTUPLES
##ORIGIN= Bruker BioSpin GmbH
##OWNER= nmr
$$ XWIN-NMR		Version 3.5
$$ Tue May 16 09:13:11 2006 GMT Daylight Time (UT+1h)  MAYBRIDGE\nmr@NMR_250MHZ
##.OBSERVE FREQUENCY= 250.131544655141
##.OBSERVE NUCLEUS= ^1H
##.ACQUISITION MODE= SIMULTANEOUS (DQD)
##.ACQUISITION SCHEME= undefined
##.AVERAGES= 16
##.DIGITISER RES= 18
##SPECTROMETER/DATA SYSTEM= dpx250
##.PULSE SEQUENCE= zg30
##.SOLVENT NAME= CDCl3
##.SHIFT REFERENCE= (INTERNAL, CDCl3, 0, 16.522)
##AUDIT TRAIL= $$ (NUMBER, WHEN, WHO, WHERE, WHAT)
$$ ##TITLE= Audit trail, XWIN-NMR		Version 3.5
$$ ##JCAMPDX= 5.01
$$ ##ORIGIN= Bruker BioSpin GmbH
$$ ##OWNER= nmr
$$ C:\u/data/dgb/nmr/ADRS/4350/pdata/1/auditp.txt
$$ ##AUDIT TRAIL=  $$ (NUMBER, WHEN, WHO, WHERE, WHAT)
(   1,<2006-05-16 09:12:51.89 +100>,<MAYBRIDGE\nmr>,<NMR_250MHZ>,
      <created by zg, POWCHK disabled, PULCHK disabled
       configuration hash MD5:
       84 BC 41 DB A1 6E 1D 46 DA 25 12 A5 C1 ED C5 3A
       data hash MD5: 64K
       CD 6E 4F 93 81 85 E5 E8 D4 F8 E1 83 5B DC 36 07>)
(   2,<2006-05-16 09:13:02.92 +100>,<MAYBRIDGE\nmr>,<NMR_250MHZ>,
      <Start of raw data processing
       ef LB = 0.3 FT_mod = 6 PKNL = 1 SI = 32K 
       data hash MD5: 32K
       68 E0 43 18 83 4A 8A E5 3B D3 5A 24 6F 20 2B 4D>)
(   3,<2006-05-16 09:13:04.50 +100>,<MAYBRIDGE\nmr>,<NMR_250MHZ>,
      <apk 
       data hash MD5: 32K
       8F 14 36 8D 7B AF E3 8E B8 2F DB 49 86 7E 65 38>)
(   4,<2006-05-16 09:13:05.25 +100>,<MAYBRIDGE\nmr>,<NMR_250MHZ>,
      <abs ABSG = 5 
       data hash MD5: 32K
       69 1C 40 55 16 98 D1 52 FD 55 FA F8 A9 2A 0E F4>)
$$ ##END=
$$ 
$$ hash MD5
$$ C1 B5 2F 52 4C DE 8F 9E C2 BC 98 AD D5 8B 63 7D
##$RELAX= 
##$RELAX= 
##$RELAX= 
##$RELAX= 
##$RELAX= 
##$RELAX= 
##$RELAX= 
$$ Bruker specific parameters
$$ --------------------------
##$DU= <C:\u>
##$EXPNO= 4350
##$NAME= <ADRS>
##$PROCNO= 1
##$TYPE= <nmr>
##$USER= <dgb>
##$AMP= (0..31)
100 100 100 100 100 100 100 100 100 100 100 100 100 100 100 100 100 100 
100 100 100 100 100 100 100 100 100 100 100 100 100 100 
##$AQSEQ= 0
##$AQ_mod= 3
##$AUNM= <au_zg>
##$AUTOPOS= <6 >
##$BF1= 250.13
##$BF2= 250.13
##$BF3= 250.13
##$BF4= 250.13
##$BF5= 500.13
##$BF6= 500.13
##$BF7= 500.13
##$BF8= 500.13
##$BYTORDA= 1
##$CFDGTYP= 0
##$CFRGTYP= 5
##$CHEMSTR= <none>
##$CNST= (0..31)
1 1 145 1 1 1 1 1 1 1 1 1 1 1 1 1 1 1 1 1 1 1 1 1 1 1 1 1 1 1 1 1 
##$CPDPRG= <>
##$CPDPRG1= <>
##$CPDPRG2= <>
##$CPDPRG3= <>
##$CPDPRG4= <mlev>
##$CPDPRG5= <mlev>
##$CPDPRG6= <mlev>
##$CPDPRG7= <mlev>
##$CPDPRG8= <mlev>
##$CPDPRGB= <>
##$CPDPRGT= <>
##$D= (0..31)
0 1 0 0 0 0 0 0 0 0.06 0 0 0 0 0 0 0.0002 0 0 0 0 0 0 0 0 0 0 0 0 0 0 
0 
##$DATE= 1147767171
##$DBL= (0..7)
120 120 120 120 120 120 120 120 
##$DBP= (0..7)
150 150 150 150 150 150 150 150 
##$DBP07= 0
##$DBPNAM0= <>
##$DBPNAM1= <>
##$DBPNAM2= <>
$$ [...]
##$SUBNAM7= <"">
##$SUBNAM8= <"">
##$SUBNAM9= <"">
##$SW= 20.6930455092707
##$SWIBOX= (0..15)
0 0 3 0 0 0 0 0 0 0 0 0 0 0 0 0 
##$SW_h= 5175.983436853
##$TD= 65536
##$TD0= 1
##$TE= 295.16
##$TE2= 300
##$TE3= 300
##$TEG= 300
##$TL= (0..7)
0 120 120 120 120 120 120 120 
##$TP= (0..7)
150 150 150 150 150 150 150 150 
##$TP07= 0
##$TPNAME0= <>
##$TPNAME1= <>
##$TPNAME2= <>
##$TPNAME3= <>
##$TPNAME4= <>
##$TPNAME5= <>
##$TPNAME6= <>
##$TPNAME7= <>
##$TPOAL= (0..7)
0.5 0.5 0.5 0.5 0.5 0.5 0.5 0.5 
##$TPOFFS= (0..7)
0 0 0 0 0 0 0 0 
##$TUNHIN= 0
##$TUNHOUT= 0
##$TUNXOUT= 0
##$USERA1= <user>
##$USERA2= <user>
##$USERA3= <user>
##$USERA4= <user>
##$USERA5= <user>
##$V9= 5
##$VALIST= <valist>
##$VCLIST= <CCCCCCCCCCCCCCC>
##$VD= 0
##$VDLIST= <DDDDDDDDDDDDDDD>
##$VPLIST= <PPPPPPPPPPPPPPP>
##$VTLIST= <TTTTTTTTTTTTTTT>
##$WBST= 1024
##$WBSW= 4
##$XGAIN= (0..3)
0 0 0 0 
##$XL= 0
##$YL= 0
##$YMAX_a= 467495
##$YMIN_a= -460937
##$ZGOPTNS= <>
##$ZL1= 120
##$ZL2= 120
##$ZL3= 120
##$ZL4= 120
##$ABSF1= 16.522
##$ABSF2= -4.171173
##$ABSG= 5
##$ABSL= 3
##$ALPHA= 0
##$AQORDER= 0
##$ASSFAC= 0
##$ASSFACI= 0
##$ASSFACX= 0
##$ASSWID= 0
##$AUNMP= <proc_1d>
##$AZFE= 0.1
##$AZFW= 0.1
##$BCFW= 0
##$BC_mod= 0
##$BYTORDP= 0
##$COROFFS= 0
##$CY= 12.5
##$DATMOD= 1
##$DC= 0
##$DFILT= <>
##$DTYPP= 0
##$F1P= 14.0000005364418
##$F2P= -0.99999901652339
##$FCOR= 0.5
##$FTSIZE= 32768
##$FT_mod= 6
##$GAMMA= 0
##$GB= 0
##$INTBC= 1
##$INTSCL= 1
##$ISEN= 128
##$LB= 0.3
##$LEV0= 0
##$LPBIN= 0
##$MAXI= 10000
##$MC2= 0
##$MEAN= 0
##$ME_mod= 0
##$MI= 0
##$NCOEF= 0
##$NC_proc= -2
##$NLEV= 6
##$NOISF1= 0
##$NOISF2= 0
##$NSP= 0
##$NTH_PI= 0
##$NZP= 0
##$OFFSET= 16.522
##$PC= 1
##$PHC0= 169.1376
##$PHC1= 2.946967
##$PH_mod= 1
##$PKNL= yes
##$PPARMOD= 0
##$PSCAL= 4
##$PSIGN= 0
##$REVERSE= no
##$SF= 250.13
##$SI= 32768
##$SIGF1= 0
##$SIGF2= 0
##$SINO= 400
##$SIOLD= 32768
##$SREGLST= <1H.CDCl3>
##$SSB= 0
##$STSI= 32768
##$STSR= 0
##$SW_p= 5175.98343685301
##$SYMM= 0
##$S_DEV= 0
##$TDeff= 65536
##$TDoff= 0
##$TI= <Analysis number 999999
Compound Code 99
Book Reference 9
Project Code 9>
##$TILT= no
##$TM1= 0
##$TM2= 0
##$TOPLEV= 0
##$USERP1= <user>
##$USERP2= <user>
##$USERP3= <user>
##$USERP4= <user>
##$USERP5= <user>
##$WDW= 1
##$XDIM= 32768
##$YMAX_p= 316370800
##$YMIN_p= -69924
$$ End of Bruker specific parameters
$$ ---------------------------------
##NTUPLES= NMR SPECTRUM
##VAR_NAME=  FREQUENCY,     SPECTRUM/REAL,   SPECTRUM/IMAG
##SYMBOL=    X,             R,               I
##VAR_TYPE=  INDEPENDENT,   DEPENDENT,       DEPENDENT
##VAR_FORM=  AFFN,          ASDF,            ASDF
##VAR_DIM=   32768,         32768,           32768
##UNITS=     HZ,            ARBITRARY UNITS, ARBITRARY UNITS
##FACTOR=    0.157963299565203, 1,           1
##FIRST=     4132.6476996994, 0,             0
##LAST=      -1043.33573715361, 0,           0
##MIN=       -1043.33573715361, -69924,      0
##MAX=       4132.6476996994, 316370800,     0
$$ Real data points
##PAGE= N=1
##DATA TABLE= (X++(R..R)), XYDATA
$$ [...]
15341G511j0533N367L274o011j2069O257J4022Q493j8411r138p366Q170N748J3671
$$ 7511 -3022 2345 5619 -392 -12461 -6204 7818 16311 -2100 -11238 -18604 -10434 -4686 8985
15327H985j632q809j3865l420J2092M346J6209L733J325j2271o291J3161J4715
$$ 8985 7353 -1456 -15321 -18741 -6649 -2303 13906 17639 18964 6693 402 13563 28278
15314B8278o499j1366q8m082m036K671K294n724j2698p903M307K7649j538k953
$$ 28278 21779 10413 10325 6243 2207 4878 7172 1448 -11250 -19153 -14846 12803 11265 8312
15300H312m419J0346p663O492J6038p490j3714k021J7375r58q134k383M917K889
$$ 8312 3893 14239 6576 13068 29106 21616 7902 5881 23256 22298 14164 11781 16698 19587
15286A9587K344o376l61q046L473R214J004j0477L403j2614o137O187J6140R691
$$ 19587 21931 15555 15194 7148 10621 19835 20839 10362 13765 1151 -4986 1201 17341 27032
15272B7032j1918J0187l118o321L424k9267o167Q754Q877o192J545M993k81j793
$$ 27032 15114 25301 22183 15862 19286 -9981 -16148 -7394 1483 -4709 -3164 1829 1548 -245
15258b45Q39L656R413N114j7428q472P337P089r662M490j3077j7098J1726J4878
$$ -245 594 4250 13663 18777 1349 -7123 214 7303 -2359 2131 -10946 -28044 -16318 -1440
15244a440M613J2922Q633j278q258j5303k0664M153k81J3601P439M18m562j3600
$$ -1440 3173 16095 24728 23450 15192 -111 -20775 -16622 -16903 -3302 4137 4555 -7 -13607
15230a3607j7231l310Q055M547J6323J0959q133l046P632K084L802J039M031n196
$$ -13607 -30838 -34148 -26093 -21546 -5223 5736 -2397 -5443 2189 4273 8075 9114 13145 7949
15216G949q031j926N714J7990K3536m644r022p455k3452M697J6649K923l437K989
$$ 7949 -82 -2008 3706 21696 45232 40588 31566 24111 659 5356 22005 24928 21491 24480
15202B4480j5m024q978J7812J6823j1076j7382J6033L6586K1717J7887q445j6648
$$ 24480 24465 20441 11463 29275 46098 35022 17640 33673 70259 91976 109863 101418 84770
15189H4770j8776j1385j2443k8666O677P266p589j4418J5489R026q73l551O169
$$ 84770 65994 54609 42166 13500 20177 27443 19854 5436 20925 29951 29078 25527 31696
15176C1696R565k223p430j0934J057k645l528k3593O686N301P834K255N874N083
$$ 31696 41261 39038 31608 20674 21731 19086 15558 -8035 -1349 3952 11786 14041 19915 24998
15162B4998j1962j0264J0405r80n356J2054j7005j37m193J9477L841j1777o064
$$ 24998 13036 2772 13177 12197 6841 18895 1890 1753 -2440 17037 20878 9101 3037
15149C037o766p24m910K155o94q13Q958K0376J2647J504j119p491j2612j1160
$$ 3037 -3729 -4453 -9363 -7208 -7902 -8715 243 20619 33266 34770 33651 26160 13548 2388
15135B388R849k943n625p70j2758q851M994O498J471q214K608J245O965p12P487
$$ 2388 12237 9294 3669 2899 -9859 -18710 -13716 -7218 -5747 -13961 -11353 -10108 -3143 -3855 3632
15120C632O505o169l01j0875k403j7636Q270K8093J8154M209N268j2892k6042
$$ 3632 10137 3968 3667 -7208 -9611 -27247 -18977 9116 27270 31479 36747 23855 -2187
15107b187Q71J1147j5323J207m870J100J9808K127j0773q508p368j1136L385L6304
$$ -2187 -1316 9831 -5492 -4285 -9155 -8055 11753 13880 3107 -5401 -12769 -23905 -20520 15784
15093A5784J2397k2243j0416q183K0010K766n227M884o111j7712J8374p52p59
$$ 15784 28181 5938 -4478 -12661 7349 10115 4888 9772 3661 -14051 4323 3571 2812
15080B812R774N488j1398M286R567K066p634K309o627N502L4p584p99l419R319
$$ 2812 12586 18074 6676 10962 20529 22595 14961 17270 10643 16145 16179 8595 7796 4377 13696
15065A3696o962o208Q333r782j0160o608O335N766O851J6019J8633r125k7439
$$ 13696 6734 526 8859 -923 -11083 -17691 -11356 -5590 1261 17280 35913 26788 -651
15052f51k6226n419J4804K5264R904J6105J3224k0659j0110j3832p302n685o156
$$ -651 -26877 -32296 -17492 7772 17676 33781 47005 26346 16236 2404 -4898 -10583 -16739
15039a6739o555L975J9933J539o673j3090P179J4930o931l518k1479n597J5671
$$ -16739 -23294 -19319 614 2153 -4520 -17610 -10431 4499 -2432 -5950 -27429 -33026 -17355
15026a7355K5296r60j1910q480r853P00J5346J2326j1678k465P520J4128J4100
$$ -17355 7941 6981 -4929 -13409 -23262 -22562 -7216 5110 -6568 -9033 -1513 12615 26715
15013B6715J418j0836j6767q615l755J0488l009J0795r830k3810j2210J4759K7649
$$ 26715 28133 17297 530 -8085 -11840 -1352 -4361 6434 -3396 -27206 -39416 -24657 2992
15000B992L497n403R05m586j1830j303j1092m470Q085J880j2928k778Q317O081
$$ 2992 6489 1086 1991 -2595 -14425 -15728 -26820 -31290 -23205 -21325 -34253 -37031 -28714 -22633
14986b2633N43J574O432J7025J831q588J5467r239j8820j573J0716p650J132n372
$$ -22633 -22090 -20516 -14084 2941 4772 -3816 11651 2412 -16408 -17981 -7265 -14915 -13783 -19155
14972a9155l869N037L050R279k34l744Q106o222n983j553M187m722J188L4907
$$ -19155 -23024 -17987 -14937 -5658 -5892 -9636 -1530 -7752 -13735 -15288 -11101 -15823 -14635 20272
14958B0272m260p48J3914l858j1810k3251j5768j3623K1224J9743J6418n102k015
$$ 20272 16012 15264 29178 25320 13510 -9741 -25509 -39132 -17908 1835 18253 13151 11136
14945A1136m140j1434J0703J1715N144J135M091P26n831m115j9995j5064j046
$$ 11136 6996 -4438 6265 17980 23124 24259 28350 29076 23245 19130 -865 -15929 -16975
14932a6975J292J2025L146O889O007j1681j1525j0395k706j5038J360J0177K5904
$$ -16975 -15683 -3658 -512 6377 12384 703 -10822 -21217 -23923 -38961 -37601 -27424 -1520
14919a520J2778J3210m535j6346M163J3018j6844k7496K919J6305o234p330l975
$$ -1520 11258 24468 19933 3587 7750 20768 3924 -23572 -20653 -4348 -10582 -17912 -21887
14906b1887k3296L735J9329K8090o597j3954Q392K587j0635k7073J2105J1461
$$ -21887 -45183 -41448 -22119 5971 -626 -14580 -6188 -3601 -14236 -41309 -29204 -17743
14894a7743J0179J0486p159l784q5P046O819Q068o455j1195M15l858J4258r297
$$ -17743 -7564 2922 -4237 -8021 -8106 -1060 5759 13827 7372 -3823 -3408 -7266 6992 -2305
14880b305n675p501J6114L771k2352r316K1153K833L796P062j8882j2767p703
$$ -2305 -7980 -15481 633 4404 -17948 -27264 -6111 -3278 518 7580 -11302 -24069 -31772
14867c1772J160Q523R703l448J5565M291k6176j4109k888l32J549k884Q902K8256
$$ -31772 -30612 -22089 -12386 -15834 -269 4022 -22154 -36263 -39151 -39483 -37934 -40818 -31916 -3660
14853c660Q225j861J0097J0256n594o109p377o520J8450N740o439k651r985l418
$$ -3660 4565 2704 12801 23057 17463 11354 3977 -2543 15907 21647 15208 12557 2572 -846
14839h46J842Q344P327L846n171j3307n858K3022q551j8813M067J5719j3600J5774
$$ -846 996 9340 16667 20513 15342 2035 -3823 19199 10648 -8165 -4098 11621 -1979 13795
14825A3795K11R463o633j3986l805L85J2815k742n490Q667n974k4937m320K2619
$$ 13795 14006 23469 16836 2850 -955 -570 12245 9503 4013 12680 6706 -18231 -22551 68
14811F8J3509L701j9710j5615o56L862J1024L416J364l087k195R060J4288J022
$$ 68 13577 17278 -2432 -18047 -18703 -14841 -3817 -401 963 -2124 -4319 4741 19029 20051
14797B0051j0099j9505o632J575R068j008k1005j3723J1470K6368J2192j6150
$$ 20051 9952 -9553 -16185 -14610 -5542 -6550 -27555 -41278 -29808 -3440 8752 -7398
14785g398q438J2862J4765j2857j2633K80M971Q939J7882j2251j3324L206J638
$$ -7398 -15836 -2974 11791 -1066 -13699 -13419 -8448 491 18373 6122 -7202 -3996 -2358
14772b358l658K2185J4297M575J9567L905j9048J3027j255p697o162j8703j0518
$$ -2358 -6016 16169 30466 35041 54608 58513 39465 52492 51237 43540 37378 18675 8157
14759H157l729J0306o742p513r362r844p430O070o545O113R16N33O589N386Q68
$$ 8157 4428 14734 7992 479 -8883 -18727 -26157 -20087 -26632 -20519 -19603 -19070 -12481 -7095 -6227
14744f227O378q728m329J1544K912L398l784K38l237m617r487n295l010J2360
$$ -6227 151 -8577 -12906 -1362 1550 4948 1164 1402 -1835 -6452 -15939 -21234 -24244 -11884
14730a1884j6946j708J6462Q610M112k4457N977K3678J086K911N51l252r605Q47
$$ -11884 -28830 -30538 -14076 -5466 -1354 -25811 -19834 3844 4930 7841 8392 5140 -4465 -3618
14716c618Q169m68m925j2529J2573j0746l0047J4523J5664m065M121M573M859
$$ -3618 4551 4083 -842 -13371 -798 -11544 -41591 -27068 -11404 -15469 -11348 -6775 -1916
14703a916j575K292j3069q014j3692K834L652J0099p55n287j701J844J2396J0023
$$ -1916 -3491 -1199 -14268 -22282 -35974 -33140 -29488 -19389 -20144 -25431 -27132 -25288 -12892 -2869
14689b869M862m465R019J8779j7035p863p982j765J5043M446j787J1846J2437
$$ -2869 1993 -2472 6547 25326 8291 428 -7554 -9319 5724 10170 8383 20229 32666
14676C2666j028j0110j1042o969M326O084J3177r398J877J5688k5o713j6477k1655
$$ 32666 31638 21528 10486 3517 7843 13927 27104 17706 19583 35271 35246 28533 12056 -9599
14662i599k4968L512q36k069J426P993J1527o6l751K2296R376J0164o672k7363
$$ -9599 -34567 -31055 -31891 -33960 -32534 -24541 -13014 -13080 -16831 5465 14841 25005 18333 -9030
14648i030j6497j566M236M235J121n072j307L341P722L675l612P362Q471R490
$$ -9030 -25527 -27093 -22857 -18622 -17501 -22573 -23880 -20539 -12817 -9142 -12754 -5392 3079 12569
14634A2569N938l508P59M704r428J3912J8801j985k4274j6236o152N81n044j2832
$$ 12569 18507 14999 15758 20462 11034 24946 43747 41762 17488 1252 -4900 -4319 -9363 -22195
14620b2195M92M986N555q939p156n543J8965J9624J2211j880K716n244j6471j3193
$$ -22195 -21703 -16717 -11162 -20101 -27257 -32800 -13835 5789 18000 16120 18836 13592 -2879 -16072
14606a6072J6180J9444j343O41q577M359j7j1894o696l980M181O804R642n780
$$ -16072 108 19552 18209 18850 10273 14632 14615 2721 -3975 -7955 -3774 3030 12672 6892
14592F892j7146r796k240J9264L64M621M619l698j5350p853M324r056J4170N619
$$ 6892 -10254 -20050 -22290 -3026 -2662 1959 6578 2880 -12470 -20323 -15999 -25055 -10885 -5266
14578e266j2079J926L299R710j5762k0716P832J5526J0664J2839M117l330J2565
$$ -5266 -17345 -15419 -12120 -2410 -18172 -38888 -31056 -15530 -4866 7973 12090 8760 21325
14565B1325k1783j5898P9J4802K419R798P051k734k5l255o247J2074m840L18j049
$$ 21325 -458 -16356 -16277 -1475 944 10742 17793 15059 15034 11779 5532 17606 12766 13084 12035
14550A2035o471J5261j4444p966J1821k3294o611m074J0433J0072K164Q318J3819
$$ 12035 5564 20825 6381 -1585 10236 -13058 -19669 -23743 -13310 -3238 -1074 7244 21063
14537B1063Q591J1784L728k1702q023l139r415n600J199P512p572J904N047j7095
$$ 21063 29654 41438 45166 23464 15441 12302 2887 -2713 -1514 5998 -1574 330 5377 -11718
14523a1718j577J1605o993k5050n598l351N618K6307P727K0853M891J519k981
$$ -11718 -13295 -1690 -8683 -33733 -39331 -42682 -37064 -10757 -3030 17823 22714 24233 21252
14510B1252m503l0516j6043L1761k260j4265N9J4069N494l176J0006N645l2032
$$ 21252 16749 -13767 -29810 1951 -309 -14574 -14515 -446 5048 1872 11878 17523 -14509
14497a4509k8968N00K4795J3956M744P003j4218p352r897N328J243K876K416L264
$$ -14509 -43477 -42977 -18182 -4226 518 7521 -6697 -14049 -23946 -18618 -17375 -14499 -12083 -8819
14483h819M32j1772k227P397K560L152L980O254P200Q61M746Q054L976O069N627
$$ -8819 -8387 -20159 -22386 -14989 -12429 -9277 -5297 957 8157 9018 13764 21818 25794 31863 37490
14468C7490r665k4373j4931n184r583J1Q430J3556o235j2060K412n072J0817J9978
$$ 37490 27825 3452 -11479 -16663 -26246 -26235 -17805 -4249 -10484 -22544 -20132 -25204 -14387 5591
14454E591J4542k520q550j3548N762J0434J2550j158j5441j7863O779P71j1263
$$ 5591 20133 17613 9063 -4485 1277 11711 24261 23103 7662 -10201 -3422 -2651 -13914
14441a3914n913j2026K6450J5879l438k8662j9039J4279K3158N378k1858O617
$$ -13914 -19827 -31853 -5403 10476 7038 -21624 -40663 -26384 -3226 2152 -19706 -13089
14429a3089N222l474j5902O142o758J5984O396j4869j2602J8058J1837k471n163
$$ -13089 -7867 -11341 -27243 -21101 -27859 -11875 -5479 -20348 -32950 -14892 -3055 -5526 -10689
14416a0689j0097P515O940J7431j5063P663J1949j4452j5673j0948q943K641J0471
$$ -10689 -20786 -13271 -6331 11100 -3963 3700 15649 1197 -14476 -25424 -34367 -31726 -21255
14403b1255J8172k945j73j28n406M402l467l244q690l004J792J1056J3007l049
$$ -21255 -3083 -6028 -6201 -6329 -11735 -7333 -10800 -14044 -22734 -25738 -23946 -12890 117 -2932
14389b932j1388M518L449J9100l153j1727k702p81m667Q227J1653K429l492o208
$$ -2932 -14320 -9802 -6353 12747 9594 -2133 -4835 -5616 -10283 -2056 9597 12026 8534 2326
14375B326K053O099j3535J548J6216J4607k1213r991J065j5080R710J1778m508
$$ 2326 4379 10478 -3057 -1509 14707 29314 8101 -1890 -825 -15905 -6195 5583 1075
14362A075k2900L147o54K774L895Q734J1465j5674q929j2315Q046O984o970J7058
$$ 1075 -21825 -18678 -19332 -16558 -12663 -3929 7536 -8138 -17067 -29382 -21336 -14352 -21322 -4264
14348d264m906j5852O102l977P281j5314o052N555L361J2236L028p033J3124j693
$$ -4264 -9170 -25022 -18920 -22897 -15616 -30930 -36982 -31427 -28066 -15830 -12802 -19835 -6711 -8404
14334h404l281k506j729J0096l686j950p033P018J433J2391O422j2937j3100p985
$$ -8404 -11685 -14191 -15920 -5824 -9510 -11460 -18493 -11475 -10042 2349 8771 -4166 -17266 -25251
14320b5251M978o850K462Q669R280j4361k285J5067P311n52k3108J3774J3483
$$ -25251 -20273 -27123 -24661 -15992 -6712 -21073 -23358 -8291 -980 -1532 -24640 -10866 2617
14307B617J522j3443j303L140J2351J0777k845k507p697j1026k981k848L257J0242
$$ 2617 4139 -9304 -10607 -7467 4884 15661 12816 10309 2612 -8414 -11395 -14243 -10986 -744
14293g44n761J012J1346P72p307l240p009j8373n250P183J2475J8291J5544q648
$$ -744 -6505 -5493 5853 6625 -682 -3922 -10931 -29304 -34554 -27371 -14896 3395 18939 10291
14279A0291k6925m147M015o279n126J0137n002Q245J8101o658k6191o833P726
$$ 10291 -16634 -20781 -16766 -23045 -28171 -18034 -23036 -14791 3310 -3348 -29539 -36372 -28646
14266b8646J573J7280J1487m916p827Q64o592j886K1808J2437K381r118J759q902
$$ -28646 -27073 -9793 1694 -3222 -11049 -10185 -16777 -18663 3145 15582 17963 8845 10604 1702
14252A702j8291j2792j1302J8092K5845o388j0321M097o969K691k133J670m738
$$ 1702 -16589 -29381 -40683 -22591 3254 -3134 -13455 -9358 -16327 -13636 -15769 -14099 -18837
14239a8837K613k2728J1179J9442Q75j772j6208J5287J8475Q560j2524j9179J1564
$$ -18837 -16224 -38952 -27773 -8331 -7456 -9228 -25436 -10149 8326 16886 4362 -14817 -3253
14226c253L4887l469k6723j4053k070q370k1384J6648L1493J7607o327J3472K495
$$ -3253 31634 28165 1442 -12611 -14681 -23051 -44435 -27787 3706 21313 14986 28458 30953
14213C0953j8931j3236r638L235j721j1221J1271J6223j3640L108J0379J132k631
$$ 30953 12022 -1214 -10852 -7617 -9338 -20559 -9288 6935 -6705 -3597 6782 7914 5283
14200E283q495N312J2844j4589j7709j0215J1828L376n267m536L245K748R820
$$ 5283 -3212 2100 14944 355 -17354 -27569 -15741 -12365 -17632 -22168 -18923 -16175 -6355
14187f355p831o519J4115p700j254P53k167J6635K002j07P315N90m64K1176J6538
$$ -6355 -14186 -20705 -6590 -14290 -15544 -14791 -16958 -323 1679 1572 8887 9477 9013 30189 46727
14172D6727K961j5847n842J0376j0796p656Q793J7016m408k660j3009k4364R707
$$ 46727 49688 33841 27999 38375 27579 19923 28716 45732 41324 38664 25655 1291 10998
14159A0998L813j0980j0699p708R240O548K712J148j6481l895K1399j4913k1442
$$ 10998 14811 3831 -6868 -14576 -5336 1212 3924 5072 -11409 -15304 6095 -8818 -30260
14146c0260l985J4909l446N313P95K432J1732M733q472m531Q527J6811P42r057
$$ -30260 -34245 -19336 -22782 -17469 -16674 -14242 -2510 2223 -6249 -10780 -2253 14558 15300 6243
14132F243k0076N661J3340q108o684p596n479J6513J4419k0584k6057k618J5081
$$ 6243 -13833 -8172 5168 -2940 -9624 -17220 -22699 -6186 8233 -12351 -38408 -41026 -25945
14119b5945J6975m495l381j347J0119j882o8m521j3299j2362J0379L553J5933
$$ -25945 -8970 -13465 -16846 -18193 -8074 -9956 -10024 -14545 -27844 -40206 -29827 -26274 -10341
14106a0341L1730P648o819n959j4429j7426o386L554j708P628Q725n535l19J7087
$$ -10341 21389 29037 22218 16259 1830 -15596 -21982 -18428 -20136 -12508 -3783 -9318 -9637 7450
14092G450q672k1610N460N408L831N628o042l194O287m813n573J6912o496j9813
$$ 7450 -1222 -22832 -17372 -11964 -8133 -2505 -8547 -11741 -5454 -10267 -15840 1072 -5424 -25237
14078b5237J750j0878K3303K0954k224j3364q407Q009k0600m66j455J0338R276
$$ -25237 -23487 -34365 -11062 9892 7668 -5696 -14103 -6094 -26694 -27160 -28615 -18277 -9001
14065i001J0544J24j6679j0537N100J1887j0558j3719J5973J3812K0690n458j4141
$$ -9001 1543 1667 -15012 -25549 -20449 -8562 -19120 -32839 -16866 -3054 17636 12178 -1963
14052a963r4R474k489N060m526j3763J664j2137n296J6854J3216M0382L2836P44
$$ -1963 -2057 7417 4928 9988 5462 -8301 -6637 -18774 -24070 -7216 6000 46382 79218 79962
14038G9962M130K8861j4096k5161m6015j7126j5141j3921K8589J2381q75m063
$$ 79962 84092 112953 98857 73696 27681 10555 -4586 -18507 10082 22463 21588 17525
14026A7525L455J2267o162n708m694j5564p078M941q185R645J9377o897P424L466
$$ 17525 20980 33247 27085 21377 16683 1119 -5959 -1018 -9203 442 19819 12922 20346 23812
14012B3812J3425k2930j0624L803k34q58J354P042k5273p853L616J0435j6124
$$ 23812 37237 14307 3683 7486 7252 6394 7748 14790 -10483 -18336 -14720 -4285 -20409
13999b0409j084N797J5294R642j1864j5909j9R681L49L059O858K804l907j0429
$$ -20409 -21493 -15696 -402 9240 -2624 -18533 -18552 -8871 -8522 -5463 1395 4199 292 -10137
13985a0137j357P846J1770p361K0839j7415J911j97K96j82Q30j2728r742J9771
$$ -10137 -11494 -3648 8122 761 21600 4185 6096 5899 6195 6013 6843 -5885 -15627 4144
13971D144O654k379M17R325l027j2067j492R86j067M672j6261l335m07J5036m306
$$ 4144 10798 8419 8836 18161 15134 3067 1575 2561 1494 6166 -10095 -13430 -13837 1199 -3107
13956c107m560j1991k890J0887J0722l204J0816Q633M632j2130P355M016M37j3976
$$ -3107 -7667 -19658 -22548 -11661 -939 -4143 6673 15306 19938 7808 15163 19179 19616 5640
13942E640j1230r033n933J2809K4093j0100k7676k220Q384J1145j0189q60J0466
$$ 5640 -5590 -14623 -20556 -7747 16346 6246 -21430 -23650 -15266 -4121 -14310 -15170 -4704
13929d704M822j4063m541Q892J7142j995q396M461j6319M408R404J0657p374k4241
$$ -4704 118 -13945 -18486 -9594 7548 5553 -2843 1618 -14701 -10293 -889 9768 2394 -21847
13915b1847M033K3158j24n133J18N204K0174N006n511R028p089p040p730J167
$$ -21847 -17814 5344 5220 87 205 5409 25583 30589 25078 34106 27017 19977 12247 13414
13901A3414J2277j106j7073j9316q328K124N473P944J0962N50p78q962q957J258
$$ 13414 25691 24585 7512 -11804 -20132 -18008 -12535 -4591 6371 6921 6143 -2819 -11776 -10518
13887a0518k448K389J0359l903j381l478J39k580k433R390N670O802j21k467N767
$$ -10518 -12966 -10577 -218 -4121 -5502 -8980 -8841 -11421 -13854 -4464 1206 8008 7887 5420 11187
13872A1187P82L741k451o241R474J334L792P033n336o191j4050j2553K257l871
$$ 11187 11969 15710 13259 7018 16492 17826 21618 28651 23315 17124 3074 -9479 -7222 -11093
13858a1093O643P744O732o908Q37r710j3441J815J0349j0260j4440m801K4226
$$ -11093 -4450 3294 10026 3118 3955 -5755 -19196 -17381 -7032 -17292 -31732 -36533 -12307
13845a2307J3850r242j4520M004J4013J2772L441l706j055N704p09l385j5009
$$ -12307 1543 -7699 -22219 -18215 -4202 8570 12011 8305 7250 12954 12245 8860 -6149
13832f149p407J3512N88J8756K256m019q00q993n818m875J95Q609n806L422M685
$$ -6149 -13556 -44 544 19300 21556 17537 16737 7744 1926 -2949 -2754 5855 49 3471 8156
13817H156j3826k889J084j3208L852J1320O68O119Q986p464q797J1496m36l953
$$ 8156 -5670 -8559 -7475 -20683 -16831 -5511 -4843 1276 10262 2798 -5999 5497 5061 1108
13803A108k2497j3545J3123K3159J6208j3294k2908J0296J0671q502n123J0113
$$ 1108 -21389 -34934 -21811 1348 17556 4262 -18646 -8350 2321 -6181 -11304 -1191
13791a191J3732j7731N161n774j3510O668M301R798L498K940q402p361j321L85
$$ -1191 12541 -5190 -29 -5803 -19313 -12645 -8344 1454 4952 7892 -510 -7871 -9192 -8807
13777h807N299M024n493K108n229l405O217n107J091M670K985P87n094K665p029
$$ -8807 -3508 516 -4977 -2869 -8098 -11503 -5286 -10393 -9302 -4632 -1647 -860 -5954 -3289 -10318
13762a0318J3181q592j3349j2567j1169P312m86j8881q905m367J8559Q160O461
$$ -10318 2863 -5729 -19078 -31645 -42814 -35502 -35988 -54869 -63774 -68141 -49582 -41422 -34961
13749c4961J2620J1406R929p189Q274J2359P982O390j5204N077K0265J235n249
$$ -34961 -22341 -10935 -1006 -8195 79 12438 20420 26810 11606 16683 36948 38183 32934
13736C2934r522j0689r274j726j141n260j7447R781J895j0766n431J6688m618
$$ 32934 23412 12723 3449 1723 582 -4678 -22125 -12344 -10449 -21215 -26646 -9958 -14576
13723a4576q260j0002K0951P918q28Q072J512O012J5508l523j9429j0118k165
$$ -14576 -22836 -32838 -11887 -3969 -4797 3275 4787 10799 26307 22784 3355 -6763 -8928
13710h928Q060j0729k2496l196J4914J1679K0206J0962J1315m307n594j1110p721
$$ -8928 -868 -11597 -34093 -37289 -22375 -10696 9510 20472 31787 27480 21886 10776 3055
13697C055M361j0917L57J9824J0254l601o04k153j0714p40L713J713k536k1315
$$ 3055 7416 -3501 -3144 16680 26934 23333 22729 20576 9862 9122 12835 14548 12012 -9303
13683i303j1605J000p551n312J1647j324N662j202m155k836j2923M929K1259J8425
$$ -9303 -20908 -19908 -27459 -32771 -21124 -22448 -16786 -17988 -22143 -24979 -37902 -32973 -11714 6711
13669F711J6490O909r700p197m345j6541J1001r662l905M726J6252j1199m815
$$ 6711 23201 30110 20410 13213 8868 -7673 3328 -6334 -10239 -5513 10739 -460 -5275
13656e275j1095j1390j4958J6014J6795J7005J95j8288O205p660J1250j0048j1494
$$ -5275 -16370 -27760 -42718 -26704 -9909 7096 7291 -10997 -4792 -12452 -1202 -11250 -22744
13643b2744Q089M10J8682Q967j482J8390p30k264m204l797l047j5652K27O534
$$ -22744 -14655 -14245 4437 13404 11922 30312 29582 27318 23114 19317 16270 618 845 7379
13629G379M155P794k727j6039j1583K679R002O688k6J0172p536j0745m31l542
$$ 7379 11534 19328 16601 562 -11021 -8342 660 7348 7322 17494 9958 -787 -1218 -4760
13615d760L529O025r28j1385L208Q292J1482Q847k7036k4461n023p40K480R602
$$ -4760 -1231 4794 3866 -7519 -4311 3981 15463 24310 -2726 -27187 -32210 -32950 -30470 -20868
13601b0868J5031r214l634J60l206L603J2626K0971l689R594p966j9760j4434
$$ -20868 -5837 -15051 -18685 -18525 -21731 -18128 -5502 15469 11780 21374 13408 -6352 -20786
13588b0786O311L950K715M240o590j3555J8203r541j618J9924o014j278L934O923
$$ -20786 -14475 -10525 -7810 -3570 -10160 -23715 -5512 -15053 -16671 3253 -2761 -4039 -105 6818
13574F818j8773O300j515J4736o216r442J8509l730P78o673J319o096j6985N345
$$ 6818 -11955 -5655 -7170 7566 1350 -8092 10417 6687 7465 792 2111 -3985 -20970 -15625
13560a5625n529J0118K3145J2806p99j4325j0637m336J3016j8147o414J1044o039
$$ -15625 -21154 -11036 12109 24915 24116 9791 -846 -5182 7834 -10313 -16727 -5683 -11722
13547a1722k762O336n386n200j2296K7586L847M787J6721O819j8882q289J5677
$$ -11722 -14484 -8148 -13534 -18734 -31030 -3444 403 5190 21911 28730 9848 1559 17236
13534A7236j7349j0468J1510J2858J4078J3991l3016j6994j5502Q861J9633N130
$$ 17236 -113 -10581 929 13787 27865 41856 8840 -8154 -23656 -14795 4838 9968
13522I968k819m179J0172P358l235j5740q145n446N375J0099j23Q735m128N267
$$ 9968 7149 2970 13142 20500 17265 1525 -6620 -12066 -6691 3408 3285 12020 7892 13159
13508A3159j0967j2868J5537J8890N835j3296k5266j031K9P570M586Q274J0739
$$ 13159 2192 -10676 4861 23751 29586 16290 -8976 -10007 -9978 -2408 2178 10452 21191
13495B1191P122J2508K2449L270L0940N5506L7478K5129J5148l195k3492j5271
$$ 21191 28313 40821 63270 66540 97480 152986 190464 215593 230741 227546 204054 188783
13483A88783j6702l5700k8410q763p828j5163n573K34k086j6822k3062K692o488
$$ 188783 172081 136381 107971 99208 91380 76217 70644 70878 68792 51970 28908 31600 25112
13470B5112o530O477r736p904J3130J3908K254L743L572K050j3509R092j5299
$$ 25112 18582 25059 15323 7419 20549 34457 36711 40454 44026 46076 32567 41659 26360
13457B6360L914n057q82q858Q136L022o749r868P32J0P321L273o018n163j2453
$$ 26360 30274 25217 24335 15477 23613 26635 19886 10018 10750 10760 18081 21354 15336 10173 -2280
13442b280N634K466J395q579J3371j4842p972N321n064o627P100Q674Q78J5169
$$ -2280 3354 5820 7215 -1364 12007 -2835 -10807 -5486 -10550 -17177 -10077 -1403 -525 14644
13428A4644L118o24q274j2778L818p053o159n277J8385J1549J726o814K165j0951
$$ 14644 17762 17138 8864 -3914 -96 -7149 -13308 -18585 -200 11349 13075 6261 8426 -2525
13414b525M866R072J0357j4077n244N560j020L129N370j542m712j0706n313n200
$$ -2525 2341 11413 21770 7693 2449 8009 6989 10118 15488 13946 9234 -1472 -6785 -11985
13400a1985o428P289J2626J06N190R536M596O28j9368o326j1051j223J426J0774
$$ -11985 -18413 -11124 1502 1608 6798 16334 20930 21558 2190 -4136 -15187 -16410 -14984 -4210
13386d210L132j8545P960K1095J0616j3164l2773j3938J3237P080n40R169O174
$$ -4210 -1078 -19623 -11663 9432 20048 6884 -25889 -39827 -26590 -19510 -20050 -10881 -4707
13373d707M63j2904P29R126J0013j9071J9106K1206m722j7620Q038J0640J3406
$$ -4707 -4244 -17148 -16419 -7293 2720 -16351 2755 23961 19239 1619 9657 20297 33703
13360C3703k6781j2962M739j1862N814j346O708j2651m098O119J406m14j741k0358
$$ 33703 6922 -6040 -1301 -13163 -7349 -8695 -1987 -14638 -18736 -12617 -11211 -11625 -13366 -33724
13346c3724k1032P361m883J749J8590J1700J645J8271L1150q706r939r426j6848
$$ -33724 -54756 -47395 -52278 -50529 -31939 -20239 -18594 -323 30827 22121 12182 2756 -14092
13333a4092N02J1174k783j4323p407m507j393j812J3753N02q86P43J0428J0522
$$ -14092 -13590 -2416 -5199 -19522 -26929 -31436 -32829 -34641 -20888 -20386 -21272 -20529 -10101 421
13319D21o584k028L515p870j1174r81J1597L948J6287N936j3858P580P359J2852
$$ 421 -6163 -8191 -4676 -12546 -23720 -24701 -13104 -9156 7131 13067 -791 6789 14148 27000
13305B7000O972N338k81N663j1402q664o692J0761L229l503k3660j1770q107K704
$$ 27000 33972 39310 39029 44692 33290 24626 17934 28695 31924 28421 4761 -7009 -15116 -12412
13291a2412J0295J2637q669K1701J0414N538r231k963n54j5690l755P912q24j4740
$$ -12412 -2117 10520 1851 23552 33966 39504 30273 27310 26756 11066 7311 15223 14399 -341
13277c41O599r685K7978J948q548n161n525J813R848J2517K5646J1667j0448k8272
$$ -341 6258 -3427 24551 26499 17951 12790 7265 9078 18926 31443 57089 68756 58308 30036
13263C0036r62n903q322Q381M91m007o829k037L065l823P871J4941j505n613L02
$$ 30036 29074 23171 14849 23230 23721 19714 12885 10848 13913 10090 17961 32902 31397 25784 26086
13248B6086j1035j9465J980P481K888p971k8958m424O734Q016Q804O544k451P537
$$ 26086 15051 -4414 -2434 5047 7935 -36 -28994 -33418 -26684 -18668 -9864 -3320 -5771 1766
13234A766n893m682n099o313j2117M473N995P177J7485Q810J7840Q052k572j5813
$$ 1766 -4127 -8809 -13908 -20221 -32338 -27865 -21870 -14693 2792 11602 29442 37494 34922 19109
13220A9109m263K427j930m161m131L199j0158j2982j1657K91L261J7945m13P787
$$ 19109 14846 17273 15343 11182 7051 10250 92 -12890 -24547 -24256 -20995 -3050 -3463 4324
13206D324J2846K629j6593M013J7332M346k2529p644J237J5017k641o131M052
$$ 4324 17170 19799 3206 7219 24551 28897 6368 -1276 -39 14978 12337 6206 10258
13193A0258J2397K64j615j3967K377J4820P04k3458n108R346J306Q442N867L602
$$ 10258 22655 22919 21304 7337 9714 24534 25238 1780 -3328 6018 7324 15766 21633 25235
13179B5235P961j0956J94m926o952k095N497J7276J2113q225M987n740q123o340
$$ 25235 33196 22240 22434 17508 10556 8461 13958 31234 43347 35122 40109 34369 26246 19906
13165A9906L891j6160k778m658j1919j1615J9530J2583n245k26j104l064J4301
$$ 19906 23797 7637 4859 201 -11718 -23333 -3803 8780 3535 3309 2205 -859 13442
13152A3442J434o539P031J1167M250j2961R350l992Q887M167j1569K481m27j1902
$$ 13442 14876 8337 15368 26535 30785 17824 27174 23182 32069 36236 24667 27148 26721 14819
13138A4819n846J1847R11k316Q334j378j7788j4935m447p017j3507p210J496N284
$$ 14819 8973 20820 21731 19415 27749 26371 8583 -6352 -10799 -17816 -31323 -38533 -37037 -31753
13124c1753J1034J3678K6551J716j2436R357P469m126R847k962j533j199M898
$$ -31753 -20719 -7041 19510 21226 8790 18147 25616 21490 31337 28375 26842 25643 30541
13111C0541m218r577p537K051Q932o07n470n935K1328J5493K3355M395l76j0173
$$ 30541 26323 16746 9209 11260 20192 19585 14115 8180 29508 45001 68356 72751 72375 62202
13097F2202J988k1797j8694J684k275l501j4240K124M569Q643M34k041k353r180
$$ 62202 64190 42393 23699 25383 23108 19607 5367 7491 12060 20703 21137 19096 16743 7563
13083G563k62R450m969J597N973l812r618j989L472l970r929j0303O634o856J2930
$$ 7563 7301 16751 11782 13379 19352 15540 5922 3933 7405 3435 -6494 -16797 -10163 -17019 -4089
13068d089M163J983p071J5973M844R89j1340j3992M567J9355j1837j3907K381
$$ -4089 74 2057 -5014 10959 15803 16792 5452 -8540 -3973 15382 3545 -10362 -7981
13055g981J470p267J0701P606q29J510j2611q63k745J047K309O650o564Q937k794
$$ -7981 -6511 -13778 -3077 4529 3700 5210 -7401 -8264 -11009 -9962 -7653 -1003 -7567 1370 -1424
13040a424j2907n176o941q504p435P832K3702J7457k8605k4684J0755J2006J1451
$$ -1424 -14331 -19507 -26448 -34952 -42387 -34555 -10853 6604 -22001 -46685 -35930 -23924 -12473
13027a2473k92R57p449R3R070l926J5312K7945j1098j7897K0944q02j3644j0964
$$ -12473 -12765 -11808 -19257 -19164 -10094 -14020 1292 29237 18139 242 21186 20384 6740 -4224
13013d224L67K937J2951J4337Q90k026l400J0155k0499k0025P210o157j7873K225
$$ -4224 -3857 -920 12031 26368 27258 25232 21832 31987 11488 -8537 -1327 -7484 -25357 -23132
12999b3132K5484J554J073j5515r561L65L10m033N743N102j1547j2105j5426J4875
$$ -23132 2352 3906 4979 -10536 -20097 -19732 -19422 -23455 -17712 -12610 -24157 -36262 -51688 -36813
12985c6813J6786J4209K277L475r0j2681j1731P479J0178J0311p161l18j955n415
$$ -36813 -20027 -5818 -3541 -66 -156 -12837 -24568 -17089 -6911 3400 -3761 -4079 -6034 -11449
12971a1449q925k567p566l156J936K6598N36J7179N889j4914m958l422J1667L288
$$ -11449 -20374 -22941 -30507 -33663 -31727 -5129 -4593 12586 18475 3561 -1397 -4819 6848 10136
12957A0136o992P981j843p229K824N458m530J0550j8297m488J131k535j8569k05
$$ 10136 3144 11125 9282 2053 4877 10335 5805 16355 -1942 -6430 -5299 -7834 -26403 -26608
12943b6608j198n213N035J162M997J0000K3694N249r268R465j1334j3158m979
$$ -26608 -27806 -33019 -27984 -26822 -21825 -11825 11869 17118 7850 17315 5981 -7177 -12156
12930a2156O988o131r639L0409N898m175J05L338p709j6912r622J7143K1192L3300
$$ -12156 -5168 -11299 -20938 9471 15369 11194 11299 14637 6928 -9984 -19606 -2463 18729 52029
12916E2029j8084l1009l53j3209l124q757K541R067k896Q15K604J6659J9552r681
$$ 52029 33945 2936 2583 -10626 -13750 -22507 -19966 -10899 -13795 -12980 -10376 6283 25835 16154
12902A6154j2646j669K0539O351j8774j4911j0429k423R200L455Q394J2951P830
$$ 16154 3508 1839 22378 28729 9955 -4956 -15385 -17808 -8608 -5153 3241 16192 24022
12889B4022l873K615l216j1819J678P867K892n937p914k7394J057R010J553N22
$$ 24022 20149 22764 19548 7729 9407 17274 20166 14229 6315 -21079 -20022 -11012 -9459 -8937
12875h937P397K295K5095R572r644j263J09j574K017j51l762m377j7659j4986
$$ -8937 -1540 755 25850 35422 25778 24515 24624 23050 25067 24916 21154 16777 -882 -15868
12861a5868J684l572j923L965J1139j410j90Q677J919m960j8246O013m689K0491
$$ -15868 -14184 -17756 -19679 -15714 -4575 -5985 -6175 2502 4421 -539 -18785 -12772 -17461 3030
12847C030j531j7078L675j1197j0629J0008K0839J4251P893m737J2644J064j2424
$$ 3030 1499 -15579 -11904 -23101 -33730 -23722 -2883 11368 19261 14524 27168 28232 15808
12834A5808N478L552k695j8307n772K247j0773o431J7891L5810m735j5785K0256
$$ 15808 21286 24838 22143 3836 -1936 311 -10462 -16893 998 36808 32073 16288 36544
12821C6544K0500J6773M4483N9705O2842M8333L5129O901l3730m0799l9870m0483
$$ 36544 57044 73817 118300 178005 240847 289180 324309 331210 297480 256681 216811 176328
12809A76328k3321j3915q951k0479j4108l294k5537p287K1735r301n887N170l148
$$ 176328 153007 139092 130141 109662 95554 92260 66723 59436 81171 71870 65983 71153 68005
12796F8005Q858j446m418j6018k1736o033R501q398k207N627J0647K5653K2384
$$ 68005 76863 75417 70999 54981 33245 27212 36713 28315 26108 31735 42382 68035 90419
12783I0419N793n87K98k7402j6744j0587l603l185M904L832k1620j3543K0351
$$ 90419 96212 95625 95923 68521 51777 41190 37587 34402 39306 43138 21518 7975 28326
12770B8326J2899n153Q405R160o758l314j5256k913m297j628P970j5403J0139
$$ 28326 41225 36072 44477 53637 46879 43565 28309 25396 21099 19471 27441 12038 22177
12757B2177K78j2319P038J4394j0363j3881L910N94J91m796j0788M259j6959r346
$$ 22177 22455 10136 17174 31568 21205 7324 11234 11828 12019 7223 -3565 694 -16265 -25611
12743b5611J3629J2840m084o19L4260m978j6946R01o463m334K1493k2285j062
$$ -25611 -11982 858 -3226 -3845 30415 25437 8491 9392 2929 -1405 20088 -2197 -3259
12730c259J2671q578r085j1386p000P141P895J3342n155r116k664o954K9194Q079
$$ -3259 9412 834 -8251 -19637 -26637 -19496 -11601 1741 -3414 -12530 -15194 -22148 7046 15125
12716A5125o73k3504j8222N705n27K910J8115J3845k520J260o291k856K3093n686
$$ 15125 14452 -9052 -27274 -21569 -22096 -19186 -1071 12774 10254 11514 5223 2367 25460 19774
12702A9774M213j0291j3070j114J5107P332j9161K124J1222j3636Q040n765k712
$$ 19774 23987 13696 626 -488 14619 21951 2790 4914 16136 2500 10540 4775 2063
12689B063K331Q111j3067l997j1814N171O273J5536K1883O629k1120o111n289
$$ 2063 4394 12505 -562 -4559 -16373 -11202 -4929 10607 32490 39119 17999 11888 6599
12676F599j408M141p42J358L730J1334O721L135O946J719o625k496l560j139K4063
$$ 6599 5191 9332 8590 9948 13678 25012 31733 34868 41814 43533 36908 34412 30852 29713 53776
12661E3776R771R483L9633M6140M5124O6383O3990Q0974J05044R3198R9854L6116
$$ 53776 63547 73030 112663 158803 203927 270310 334300 415274 520318 613516 713370 749486
12649G49486l7399m8866o2991r9179r3061r3088o4175k8189l4538j9307j1203
$$ 749486 712087 663221 600230 501051 407990 314902 250727 222538 188000 168693 157490
12638A57490j8355R78r296j3146j3148j3804j9264j8496R849P820J895Q005J7148
$$ 157490 139135 140113 130817 117671 104523 90719 71455 52959 62808 70628 72523 80528 97676
12625I7676p10j4179k5675o884j1547K569Q575K188j7598j0559K4175J6726k0828
$$ 97676 96966 82787 57112 50228 38681 41250 49825 52013 34415 23856 48031 64757 43929
12612D3929j7244L823R228O780l342l46j8296j2084R348j308j0104L385q054J736
$$ 43929 26685 30508 39736 46516 43174 42828 24532 12448 21796 20488 10384 13769 5715 7451
12598G451L10r239K456J9791J8557j2335j9093L550K797M007o09j5066j0080P102
$$ 7451 7761 -1478 978 20769 39326 26991 7898 11448 14245 18252 17643 2577 -7503 -401
12584d01j4900j2977J4245J7732K853j5925L178k81N007K731J0750M680J1079
$$ -401 -15301 -28278 -14033 3699 6552 -9373 -6195 -6476 -1469 1262 12012 16692 27771
12571B7771j179o028L708J73q438j2925J2071j7481r975K886K2549m744k87Q070
$$ 27771 26592 20564 24272 24445 16007 3082 15153 -2328 -12303 -9417 13132 8388 8101 16171
12557A6171j4753K308j7026Q727o957j028M510J2559J5142M520p041j9531M514
$$ 16171 1418 3726 -13300 -4573 -11530 -12558 -8048 4511 19653 24173 17132 -2399 2115
12544B115J2398j657K170k321m042m126J4925m435j2184J2092j536m819K235J1177
$$ 2115 14513 12856 15026 12705 8663 4537 19462 15027 2843 14935 13399 8580 10815 21992
12530B1992P702R757o512k8726j6824k748M113M829J1975R210K651k67l020j205
$$ 21992 29694 39451 32939 4213 -12611 -15359 -11246 -6417 5558 14768 17419 17152 14132 12927
12516A2927k73J978R30O603n828r400m558o270j1277P320L381J0065n346n763
$$ 12927 12654 14632 15562 22165 16337 6937 2379 -3891 -15168 -7848 -4467 5598 252 -5511
12502e511n062p790o191R458P037J3338j2155j5957n38k9J3416j051j286r119
$$ -5511 -10573 -18363 -24554 -15096 -8059 5279 -6876 -22833 -23371 -23400 -9984 -11035 -12321 -21440
12488b1440J3410K5596o475j8079K875m110j6825r157Q460J1632O683O895K988
$$ -21440 -8030 17566 11091 -6988 -4113 -8223 -25048 -34205 -25745 -14113 -7430 -535 2453
12475B453J193j4938L695o88J0939J968j2830P98J644K6394J0000p550j9584p404
$$ 2453 3646 -11292 -7597 -8285 2654 4622 -8208 -7410 -5766 20628 30628 23078 3494 -3910
12461c910j7066o415P806J1885J755r63J5395K762p238K14k078J2248q893j6103
$$ -3910 -20976 -27391 -19585 -7700 -5945 -6908 8487 11249 4011 4225 2147 14395 5502 -10601
12447a0601j6926k116K0833L734j0884k089o429K0415P627o737J1617j369j4782
$$ -10601 -27527 -29643 -8810 -5076 -15960 -18049 -24478 -4063 3564 -3173 8444 7075 -7707
12434g707J988M897j116K405r03m195p233n614J3395K351N134k318M014l89n042
$$ -7707 -5719 -822 -1938 467 -436 -4631 -11864 -17478 -4083 -1732 3402 1084 5098 4709 -333
12419c33p684m312QQ077J768N322O173k0472R579P165j2266l162K087k137Q842
$$ -333 -8017 -12329 -12321 -4244 -2476 2846 9019 -11453 -1874 5291 -6975 -10137 -8050 -10187 -1345
12404a345N501J342j3045j3235J1635K1375P01N930M369P112j1514o047N456L769
$$ -1345 4156 5498 -7547 -20782 -9147 12228 12929 18859 23228 30340 18826 12779 18235 22004
12390B2004J1665Q356j8307j5180J3943K3725K363r850k2256n757Q348o047r801
$$ 22004 33669 42025 23718 8538 22481 46206 48569 38719 16463 10706 19054 13007 3206
12377C206k522l762k698J1505r69j189R186R745J5755l758j4801k1185Q272J2667
$$ 3206 684 -3078 -5776 5729 4760 3571 12757 22502 38257 34499 19698 -1487 6785 19452
12363A9452j925j7422L423j445j732q704p775P383l837M557Q071P855J5978M335
$$ 19452 17527 105 3528 2083 351 -8353 -16128 -8745 -12582 -8025 46 7901 23879 28214
12349B8214R075r308k0889l357Q430N024r276J469k1748n579J8770R435o764K02
$$ 28214 37289 27981 7092 3735 12165 17189 7913 9382 -12366 -17945 825 10260 3496 3698
12335C698k510n688K382Q763j0134K619L588j775L018P682m735j5616J1919L937
$$ 3698 1188 -4500 -2118 6645 -3489 -870 2718 943 3961 11643 6908 -8708 3211 7148
12321G148k0978k5160Q927l464Q662K7913J2889K005j5768j7852j3532Q032K5296
$$ 7148 -13830 -38990 -30063 -33527 -24865 3048 15937 17942 2174 -15678 -29210 -21178 4118
12308D118k086j3517P97Q848j2086j0339l233O355q097o96o382k100L148J2701
$$ 4118 2032 -11485 -10688 -1840 -13926 -24265 -27498 -21143 -29240 -29936 -36318 -38418 -35270 -22569
12294b2569O179Q026l914P10r941j61M238q1N105l607J118k085Q523J7821j331
$$ -22569 -16390 -8364 -12278 -11568 -21509 -21670 -17432 -17513 -12408 -16015 -14897 -16982 -8459 9362 8031
12279H031p976O612J598L370m197k5827J0819P273o022j723m208Q147J0705K885
$$ 8031 55 6667 8265 11635 7438 -18389 -7570 -297 -6319 -8042 -12250 -4103 6602 9487
12265I487n529p155M19R813r252j1517R66j0745k648P699Q753M246j4065N199
$$ 9487 3958 -3197 -2778 7035 -2217 -13734 -12768 -23513 -26161 -18462 -9709 -5463 -19528 -14329
12251a4329J1865M212j029Q71R045R993l224r305r785L874J1362m676j7077p986
$$ -14329 -2464 1748 719 1590 10635 20628 17404 8099 -1686 2188 13550 8874 -8203 -16189
12237a6189P875m60j3981K123J3043J995M868j0879N79o951r633M30O131K0459
$$ -16189 -8314 -8774 -22755 -20632 -7589 -5594 -726 -11605 -11026 -17977 -27610 -27180 -21049 -590
12223e90R662P551N031j0627n967p879n379J2539J4556k045j349j4323j4139j154
$$ -590 9072 16623 21654 11027 5060 -2819 -8198 4341 18897 16852 15503 1180 -12959 -14113
12209a4113Q378L053m149P589P151j7920j4860J0391l927j2663Q601R997K9887
$$ -14113 -5735 -2682 -6831 758 7909 -10011 -24871 -14480 -18407 -31070 -22469 -12472 17415
12196A7415J672l344p231N991j2471L731m146k2957q247K1691J1242N511j3477
$$ 17415 19087 15743 8512 14503 2032 5763 1617 -21340 -29587 -7896 3346 8857 -4620
12183d620q236J0942Q295l593j3520p41j769N961K429j061J398L383O065O657
$$ -4620 -12856 -1914 6381 2788 -10732 -11473 -13242 -7281 -4852 -5913 -4515 -1132 4933 11590
12169A1590m880k274J578k4683J352K3656R88j995k754j7055l519l466K566J0853
$$ 11590 6710 4436 6014 -18669 -17317 6339 7327 5332 2578 -14477 -17996 -21462 -18896 -8043
12155h043r117m111J847K1488K6856K52k3817j3107Q220J022K685J794O77K219
$$ -8043 -17160 -21271 -19424 2064 28920 29172 5355 -7752 468 1490 4175 5969 6646 8865
12141H865k515j4823N038J769j4426j060M283K853k241k5383J477P140K5281J2077
$$ 8865 6350 -8473 -3435 -1666 -16092 -17152 -12869 -10016 -12257 -37640 -36163 -29023 -3742 8335
12127H335M436n495o011J562k05N684o390k263N949j0768n025K2066J9124j4834
$$ 8335 12771 7276 1265 2827 2622 8306 1916 -347 5602 -5166 -10191 11875 30999 16165
12113A6165l401O19o168j1638N360N052J1375o841l960J9942J7261r789l384m097
$$ 16165 12764 13383 7215 -4423 937 5989 17364 10523 6563 26505 43766 33977 30593 26496
12099B6496j4547k0100m66J2119R238K0427m735j4107n645j0291j8296j0834J9397
$$ 26496 11949 -8151 -8617 3502 12740 33167 28432 14325 8680 -1611 -19907 -30741 -11344
12086a1344Q024J4922n71j4717n722j7786k694J6073P151J675O208J5390j3152
$$ -11344 -3320 11602 11031 -3686 -9408 -27194 -29888 -13815 -6664 -4989 1219 16609 3457
12073C457k1852K3021J5296j3179p475j5533m848K494M479k344n692R092J0384
$$ 3457 -18395 4626 19922 6743 -732 -16265 -21113 -18619 -14140 -16484 -22176 -13084 -2700
12060b700N79j123N16j7001j3544l747J8511J5950P791j6508l379k654J5391L870
$$ -2700 -2121 -3244 -2728 -19729 -33273 -37020 -18509 -2559 5232 -11276 -14655 -17309 -1918 1952
12046A952l804Q670j8398M372k069n829j0548J3425J3528l812j5682L238K0641
$$ 1952 -1852 6818 -11580 -7208 -9277 -15106 -25654 -12229 1299 -2513 -18195 -14957 5684
12033E684m027n115J1866j42r44r103j3991Q200L071j0945j2662K553L730O393
$$ 5684 1657 -3458 8408 8266 7322 -1781 -15772 -7572 -4501 -15446 -28108 -25555 -21825 -15432
12019a5432j3531J1795R879n500j1730J1810J0158M088n148k0998J6113J3347
$$ -15432 -28963 -17168 -7289 -12789 -24519 -12709 -2551 1537 -3611 -24609 -8496 4851
12007D851J6652M830j8521r433P398N239q295p070L352J2857J168p466j1835K056
$$ 4851 21503 26333 7812 -1621 5777 11016 2721 -4349 -997 11860 13028 5562 -6273 -4217
11993d217l715Q646N643R629j6697k4116j1074k911L177J1136J9679J3605k225
$$ -4217 -7932 714 6357 15986 -711 -24827 -35901 -38812 -35635 -24499 -4820 8785 6560
11980F560R995J0637l300r537l329p799k538j7556J596J2700k923R177K0803j1693
$$ 6560 16555 27192 23892 14355 11026 3227 689 -16867 -15271 -2571 -5494 3683 24486 12793
11966A2793o417J2313m00k1917j0681K0971J3836O994j1852N503J8762M5125K1112
$$ 12793 6376 18689 18289 -3628 -14309 6662 20498 27492 15640 21143 39905 85030 106142
11953A06142M954J0365L8716k538l4665j836J3694j1240j4926j4749m470j8935
$$ 106142 111096 121461 160177 157639 122974 121138 134832 123592 108666 93917 89447 70512
11941G0512k0212j6250L468N836p538p90P83m388o437J4758J8524k864j7786j248
$$ 70512 50300 34050 37518 43354 35816 35026 35809 31421 24984 39742 58266 55402 37616 36368
11927C6368J354O546m791j4819J4441L235j8520j5477K562J1724K1746K7401J1919
$$ 36368 37722 44268 39477 24658 39099 42334 23814 8337 10899 22623 44369 71770 83689
11914H3689L820J6892L0203N68j7855N25K623n41J2167J4348J1315J4895J5115
$$ 83689 87509 104401 134604 135172 117317 117842 120465 119924 132091 146439 157754 172649 187764
11901A87764J4580k4824l7096n883L958J6373j4676j6830n178o126J1422L227
$$ 187764 202344 177520 140424 134541 138499 154872 140196 123366 118188 112062 123484 126711
11889A26711o372j8800p873K516j3700k0403m335J8941J2179j5381o922J774n564
$$ 126711 120339 101539 93666 96182 82482 62079 57744 76685 88864 73483 66561 68335 62771
11876F2771p173k209j984j3216k36J4529l583M335j2338k4245N380K1468O182
$$ 62771 55598 53389 51405 38189 37953 52482 48899 53234 40896 16651 22031 43499 49681
11863D9681k921J4011j2839n140M0014K4033J7291J0389J5536L3670K5031o40
$$ 49681 46760 60771 47932 42792 82806 106839 124130 134519 150055 183725 208756 208116
11851B08116j6288j818j3460l5823j9389k0215j4965p299m644j2681j151j449
$$ 208116 191828 190010 176550 140727 121338 101123 86158 78859 74215 61534 60383 58934
11839E8934j4309k514J3704p563J6006N490O251k0499L199q223j0010M981j25
$$ 58934 44625 42111 55815 48252 64258 69748 75999 55500 58699 50476 40466 45447 45322
11826D5322j2n35k1054j0645K0861k10j6001J0010K16q797r786J436M510J8497
$$ 45322 45310 44775 23721 13076 33937 33727 17726 27736 27952 19155 9369 10805 15315 33812
11812C3812n291j5482j4098J452p473j3345L396K1221P356j865j5274J3762J1602
$$ 33812 28521 13039 -1059 393 -7080 -20425 -17029 4192 11548 9683 -5591 8171 19773
11799A9773k953j6304q850Q525k922q837j0454J1878m042P401k25P844P685K827
$$ 19773 16820 516 -8334 191 -2731 -11568 -22022 -10144 -14186 -6785 -7010 834 8519 11346
11785A1346J0661j6912n991J3158J6316M081j5918j6046j4774J8193K17Q73J2112
$$ 11346 22007 5095 -896 12262 28578 32659 16741 695 -14079 4114 4331 5204 17316
11772A7316L294p346L949J1071R469j0582j6906m829o728j3194m12K616p160m284
$$ 17316 20610 13264 17213 28284 37753 27171 10265 5436 -1292 -14486 -14898 -12282 -19442 -23726
11758b3726r99l21K7293J656j4698j1149m702J9807Q94L487M451P034p702j1471
$$ -23726 -24725 -25046 2247 3903 -10795 -21944 -26646 -6839 -5945 -2458 1993 9027 1325 -10146
11744a0146J996J2819K4498k924j7612l038L341k188m394M291j0160j8779M54
$$ -10146 -8150 4669 29167 26243 8631 5593 8934 6746 2352 6643 -3517 -22296 -21842
11731b1842m30J9432L1140J1008r805j7937j6057J0744m065j4179p773n547k999
$$ -21842 -22272 -2840 28300 39308 29503 11566 -4491 6253 2188 -11991 -19764 -25311 -28310
11718b8310q39N645O310J1948J898j0019M495r91q19J7670P712J1025P122n648
$$ -28310 -29149 -23504 -17194 -5246 -3348 -13367 -8872 -9863 -10682 6988 14700 25725 32847 27199
11704B7199j1528m337M111j5244j2789O696p143k338q51J637j8738J4589K0907
$$ 27199 15671 11334 15445 201 -12588 -5892 -13035 -15373 -16224 -14587 -33325 -18736 2171
11691B171j3268k1882L503R108J4731k803n190J4600n957j3019n57k636J3277
$$ 2171 -11097 -32979 -29476 -20368 -5637 -8440 -13630 970 -4987 -18006 -18563 -21199 -7922
11678g922J1275O310r220j7155R674N335r082Q25O677m975k634J4951J0563j1857
$$ -7922 3353 9663 443 -16712 -7038 -1703 -10785 -9960 -3283 -8258 -10892 4059 14622 2765
11664B765r792k529j7220R209J4781j6750m762K1047Q827j316J7141N585k5351
$$ 2765 -7027 -9556 -26776 -17567 -2786 -19536 -24298 -3251 5576 4260 21401 26986 1635
11651A635l709Q156j3098r107Q521J0878j7934j3112P619P898n72j272J6710P381
$$ 1635 -2074 6082 -7016 -16123 -7602 3276 -14658 -27770 -20151 -12253 -12825 -14097 2613 9994
11637I994k0142J0015J4320n512M224J4265q862k7761k486J5393o870n38J5144
$$ 9994 -10148 -133 14187 8675 12899 27164 18302 -9459 -11945 3448 -3422 -3960 11184
11624A1184J4536r322k9455O255J0476K278m670j0258j3107R53J952R146M675
$$ 11184 25720 16398 -13057 -6802 3674 5952 1282 -8976 -22083 -21130 -19178 -10032 -5357
11611e357r258P401R774N651j4877n02n000j3482L698K1522J1106O832p299j589
$$ -5357 -14615 -7214 2560 8211 -6666 -7168 -12168 -25650 -21952 -430 10676 17508 10209 8620
11597H620M45j3708l154J643K0758q024p187q956l995O371K84n329M651Q530k0274
$$ 8620 9065 -4643 -7797 -6154 14604 6580 -607 -9563 -13558 -7187 -6903 -12232 -7581 949 -19325
11582a9325j8778R903J4993n335o396K2419J277k0482J0181K0189K1976l425l9965
$$ -19325 -38103 -28200 -13207 -18542 -24938 -2519 -1242 -21724 -11543 8646 30622 27197 -12768
11569a2768n911K0396q105q116k610J0837j0322P304K7973J504R210O12K646j5160
$$ -12768 -18679 1717 -6388 -14504 -17114 -6277 -16599 -9295 18678 20182 29392 30004 32650 17490
11555A7490j4143J2026J2403l6922N871M225j0297p310J4299J0179J55P376o608
$$ 17490 3347 15373 27776 -9146 -3275 950 -9347 -16657 -2358 7821 7976 15352 8744
11542H744J100J224N312k508o053Q13n606j0345J438J1990o241J4422J3657j9011
$$ 8744 9844 11068 16380 13872 7819 8632 3026 -7319 -5881 6109 -132 14290 27947 8936
11528H936l8269Q011R561K584R349N996l883p293J4380J1964n127J3470o607o598
$$ 8936 -29333 -21322 -11761 -9177 172 6168 2285 -5008 9372 21336 16209 29679 23072 16474
11514A6474J881j2595j107N765K319j8737L10L145O348j170N985j2591l497n464
$$ 16474 18355 5760 4653 10418 12737 -6000 -5690 -2545 3803 2633 8618 -3973 -7470 -12934
11500a2934q379L657M934n081P0K8328m520k279J4073m004l892q533j8641r36
$$ -12934 -21313 -17656 -12722 -17803 -17733 10595 6075 3796 17869 13865 9973 1440 -17201 -18137
11486a8137J1385J0776J3623j2208k9989L446J922J3096J3986J1593J206m756
$$ -18137 -6752 4024 17647 5439 -24550 -21104 -19182 -6086 7900 19493 20699 15943
11474A5943j834q490L737J7145J0316M659j6619o827n011J2825M746p970o538
$$ 15943 14109 5619 9356 26501 36817 41476 24857 18030 13019 25844 30590 22620 16082
11461A6082r084K4990J3036l625l93j7672J9118K4985K6435K8995N8612Q7358
$$ 16082 6998 31988 45024 41399 41006 23334 42452 67437 93872 122867 181479 268837
11449B68837J04674J18686R3223J1679p4143r6054q3175p4912o5836l5643k5075
$$ 268837 373511 492197 585420 597099 522956 426902 343727 268815 202979 167336 142261
11438A42261k6220j7844k1856L06J751l476J569l600m792lp783k2730O079K6419
$$ 142261 116041 98197 76341 76647 78398 74922 76491 72891 68099 68096 60313 37583 43662 70081
11424G0081M409r18j4360Q335J6053j0849n500j6891j5196J5234Q982j7569j4300
$$ 70081 74490 73572 59212 67547 83600 72751 67251 50360 35164 50398 59380 41811 27511
11411B7511l264Q893J8021p795K686j1208p782J0529J6331R096L237j0314l0407
$$ 27511 24247 33140 51161 43366 46052 34844 27062 37591 53922 63018 66255 55941 25534
11398B5534j114J297P397J1340L415L316K263j3497L514J9048Q42j6040o940j5430
$$ 25534 24420 25717 33114 44454 47869 51185 53448 39951 43465 62513 63355 47315 40375 24945
11384B4945j8993J3575J0809j524J530m48K005L246M209p393K917j3319J8021
$$ 24945 5952 19527 30336 28812 30342 29894 31899 35145 39354 31961 34878 21559 39580
11371C9580J8730M107k7981o142O625K844m086n449j658n719p588J1970o171n445
$$ 39580 58310 62417 34436 28294 34919 37763 33677 28228 26570 20851 13263 25233 19062 13617
11357A3617p990j8719P307J1306j6662j6784M884J8797l228p238K557M54m19O300
$$ 13617 5627 -13092 -5785 5521 -11141 -27925 -23041 -4244 -7472 -14710 -12153 -11699 -12118 -5818
11343e818P926K3107J3193J8883K3667l371k6735j47J537j1679j8832n414K6884
$$ -5818 2108 25215 38408 57291 80958 77587 50852 50705 52242 40563 21731 16317 43201
11330D3201j549k2046j996J4204o905j7244K188J7493N833J3562P556M830n258
$$ 43201 41652 19606 17610 31814 24909 7665 9853 27346 33179 46741 54297 59127 53869
11317E3869J591n644n583j8140N019j544n523l313P272J5298o216J3799R650K753
$$ 53869 55460 49816 44233 26093 31112 29568 24045 20732 28004 43302 37086 50885 60535 63288
11303F3288j0968j1002r522m060j098M524l196j4061m626J627K5144R365J840
$$ 63288 52320 41318 31796 27736 26638 31162 27966 13905 9279 10906 36050 45415 47255
11290D7255Q971J3120J0260n18n770q916q778j7971p017J2549r922n876K826P897
$$ 47255 56226 69346 79606 79088 73318 64402 55624 37653 30636 43185 33263 27387 30213 38110
11276C8110J5894m049j3657r215K762Q202J7274k943j7309K033J0144L969M44
$$ 38110 54004 49955 36298 27083 29845 38047 55321 52378 35069 37102 47246 51215 51659
11263E1659k2958J887O533p164n913P886Q228m917j5386m136Q938J4342R612j4949
$$ 51659 28701 30588 37121 29957 24044 31930 40158 35241 19855 15719 24657 38999 48611 33662
11249C3662j2969L725k2410N197J5712j175m713K5433K1685Q832r762p619L505
$$ 33662 20693 24418 2008 7205 22917 21742 17029 42462 64147 72979 63217 55598 59103
11236E9103N240k7352l2850k230p188p866J5619Q487J2154J2348J718j5576k190
$$ 59103 64343 36991 4141 1911 -5277 -13143 2476 10963 23117 35465 37183 21607 19417
11223A9417q885j1515n511Q819P519m343J5104P119j3371j3446L148K4746J3875
$$ 19417 10532 -983 -6494 2325 9844 5501 20605 27724 14353 907 4055 28801 42676
11210D2676j0648j6514j8571J87J5690K2693R482j4188Q386q54o256j0376L275
$$ 42676 32028 15514 -3057 -2870 12820 35513 44995 30807 39193 38339 32083 21707 24982
11197B4982J3800r735j1424j1560j6088K2701Q466Q54J7183J3269j0260j1708
$$ 24982 38782 29047 17623 6063 -10025 12676 21142 21996 39179 52448 42188 30480
11185C0480L336m269J0129J6947P247R40q694r713p602o93j6272M005J2908j595
$$ 30480 33816 29547 39676 56623 63870 64810 56116 46403 38801 38108 21836 25841 38749 37154
11171C7154r129k778J4732J171K3367K6174m062m983l204K4006K9398L1891O97
$$ 37154 28025 25247 39979 41150 64517 90691 86629 81646 78442 102448 131846 163737 164434
11158A64434Q15P820P127l070k357k0330J3685K0511O788l86L654r313j5970l0756
$$ 164434 165249 173069 180196 177126 174769 154439 168124 188635 195423 195037 198691 189378 173408 142652
11144A42652l4438j1659L264M293P082k623Q828o016j3190N64k525P120J2105
$$ 142652 108214 96555 99819 104112 111194 108571 117399 111383 98193 98757 96232 103352 115457
11131A15457K1847l43J6908o54O970m541j5402n146R241j5278j8345O804J7877
$$ 115457 137304 136961 153869 153215 160185 155644 140242 135096 144337 129059 110714 117518 135395
11118A35395r448J0090L4491J1165J8282R817J6504K0492O1078P1530L6644L9572
$$ 135395 125947 136037 170528 181693 199975 209792 226296 246788 307866 379396 416040 455612
11106D55612Q122r974k8508k4982m0077l4583k8965m537k593O218L2003N2000
$$ 455612 463734 453760 425252 400270 360193 325610 296645 292108 289515 295733 327736 379736
11094C79736M9876M7299M0775L0044J2513n775k3093j4626K162J1497J8733L223
$$ 379736 429612 476911 517686 547730 560243 554468 531375 516749 518911 530408 549141 552364
11082E52364j529K7918N590J2133O730l809j3034j0348J1375K1544N629o402J2456
$$ 552364 550835 578753 584343 596476 603206 599397 586363 576015 587390 608934 614563 608161 620617
11069F20617J8090J062J6645M5309N8241O6685N9410P8108P3768Q8038J12625
$$ 620617 638707 639769 656414 701723 759964 826649 886059 964167 1037935 1125973 1238598
11058A238598J65949J87734J87946J89362J50433J09263N9087R2768J58599K48811
$$ 1238598 1404547 1592281 1780227 1969589 2120022 2229285 2288372 2381140 2539739 2788550
11048B788550L97377N52500P12761Q26708R78163J180566J544350K234130L550190
$$ 2788550 3185927 3738427 4451188 5277896 6256059 7436625 8980975 11215105 14765295
11039A4765295N948101J0015142J5697908K0776121K1557698J6103226N274085
$$ 14765295 20713396 30728538 46426446 67202567 88760265 104863491 110137576
11032A10137576p842058j7681943k0074496j6501935j1453718p449588m850422
$$ 110137576 102295518 84613575 64539079 48037144 36583426 29133838 24283416
11025B4283416l278369k321467j749322j387076j133706q98005p14753n83844
$$ 24283416 21005047 18683580 16934258 15547182 14413476 13515471 12800718 12216874
11017A2216874n35916n18166m98578m31648l83219l29721l21631l55653l84831
$$ 12216874 11680958 11162792 10664214 10232566 9849347 9519626 9197995 8842342 8457511
11008H457511m00044l45595k85428k43291k15536k01265j69886j79235k08773
$$ 8457511 8057467 7711872 7426444 7183153 6967617 6766352 6596466 6417231 6208458
10999F208458j98273j78426j79140j43032j14187j08641j30529j53487j25146
$$ 6208458 6010185 5831759 5652619 5509587 5395400 5286759 5156230 5002743 4877597
10990D877597j15605j03935j04834j00243p9395p0810p6470j02354r7925p7357
$$ 4877597 4761992 4658057 4553223 4452980 4373585 4302775 4226305 4123951 4026026 3948669
10980C948669o8911p3083q3720p0561p1320n1969n9125p9522r7125p8972q9258
$$ 3948669 3879758 3806675 3722955 3652394 3581074 3529105 3469980 3390458 3293333 3214361 3125103
10969C125103o9993n0004o3144o3828n5955n6699p0285o2811n4888o0697o3510
$$ 3125103 3055110 3005106 2941962 2878134 2822179 2765480 2695195 2632384 2577496 2516799 2453289
10958B453289n7732k8169l7548m1528m8711k6816j5527k854K341N419L5880N6712
$$ 2453289 2395557 2367388 2329840 2288312 2239601 2212785 2197258 2194404 2196745 2202164 2238044 2294756
10946B294756Q0141N2378o072p6311j15827j37026j30707p8611n6056l2471l4535
$$ 2294756 2374897 2427275 2421203 2344892 2229065 2092039 1961332 1882721 1826665 1794194 1759659
10935A759659k4230l3558p116l471j8368k2480m5342l9460l7824m3772m1726m3404
$$ 1759659 1735429 1701871 1694755 1691284 1672916 1650436 1605094 1565634 1527810 1484038 1442312 1398908
10923A398908l1032k0471k6748j7052j7736k7384k7597k9080l3733j279k6249
$$ 1398908 1367876 1347405 1320657 1303605 1285869 1258485 1230888 1201808 1168075 1166796 1140547
10912A140547n5449m8164k5476r936j4997j3400j7569r178j1624k5903k3255n530
$$ 1140547 1085098 1036934 1011458 1001522 986525 973125 955556 946378 934754 908851 885596 880066
10900H80066j6853k1032j3569j3292j5912m637j4816l98J365j0264j5721m589
$$ 880066 863213 842181 828612 815320 799408 794771 779955 779557 780922 770658 754937 750348
10888G50348k4022j2821j4945J2341k239k9424J2904J0683p648o829j3191j5362
$$ 750348 726326 713505 698560 710901 708662 679238 692142 702825 695177 688348 675157 659795
10876F59795n286j3100k1059r536j4024m094p858j033j3643j2430j8364j6557
$$ 659795 654509 641409 620350 610814 596790 592696 584838 583805 570162 557732 539368 522811
10864E22811j5274j8505q301K1067J3252j5509O886j736m276J438M460q393j5409
$$ 522811 507537 489032 480731 501798 515050 499541 506427 504691 500415 501853 506313 497920 482511
10851D82511j1089O045J455J4018J715R42J9088l039k9550m5066l4236j887K3151
$$ 482511 471422 477467 478922 492940 494655 495597 514685 511646 482096 437030 402794 400907 424058
10838D24058L8164K2219R638J9493J5533J2754k5666k4393k5362l7748l261L006
$$ 424058 462222 484441 494079 513572 529105 541859 516193 491800 466438 428690 425429 428435
10826D28435n368j3112j4056k0615k9760j4600K477O791J1895O776J6118J2846
$$ 428435 423067 409955 395899 375284 345524 330924 333401 340192 352087 358863 374981 387827
10814C87827J840R939N215J1071Q970j557j9047q677j5944J213P941m202j4028
$$ 387827 389667 399606 404821 415892 424862 423305 404258 395581 379637 380850 388791 384589 370561
10801C70561p818m231j1589p663p286L348K277J2733J47L21m495K087J946o75
$$ 370561 362743 358512 346923 339260 331974 335322 337599 350332 350479 350800 346305 348392 350338 349663
10787C49663k48j2728j2580O828K811K930J2194K7438L0269K8766m669k9053k9426
$$ 349663 349415 336687 324107 330935 333746 336676 348870 376308 406577 435343 430674 401621 372195
10774C72195k9739k3317p36J7189K1079J3826j1019K872K5938M369k1897k0594
$$ 372195 342456 319139 318403 335592 356671 370497 359478 362350 388288 392657 370760 350166
10762C50166j4275K1257O2900R2788J17700J97807K62086K44145J39591j2257
$$ 350166 335891 357148 420048 512836 630536 828343 1090429 1334574 1474165 1461908
10752A461908j65903k42457k20332j55290j01315o0768m3857l8317k3394l00k607
$$ 1461908 1296005 1053548 833216 677926 576611 515843 471986 433669 410275 409975 407368
10741D07368j0224l0756o245j2535j7005k2195j1790j4269P315p999k330p889
$$ 407368 397144 366388 360143 347608 330603 308408 296618 282349 289664 281665 279335 271446
10729B71446k723K944L293M436M333L049K493L654j4979r945p449j1052j6574
$$ 271446 268723 271667 274960 279396 283729 286778 289271 292925 277946 268001 260552 249500 232926
10716B32926o874Q875L624O953J9142m657K039K0020p815Q742J6288r768R337
$$ 232926 226052 234927 238551 245504 264646 259989 262028 282048 274233 282975 299263 289495 298832
10703B98832L7342M0834J4255j6976l2607m6004m0394r944N81q472j4706k4775
$$ 298832 336174 377008 391263 374287 341680 295676 255282 245338 245919 237447 222741 197966
10691A97966r022J4149m15P158k873q644j8014m569o2r523j4117j2053J2183R090
$$ 197966 188944 203093 202678 209836 206963 198319 180305 175736 175674 166151 152034 139981 152164 161254
10677A61254j8909J951J721o900l690j3214J1839N584J9466L3240K4659J6625
$$ 161254 142345 144296 146017 139117 135427 122213 134052 139636 159102 192342 217001 233626
10665B33626K1891J4734p982k7365k9662J510r808n621J7023J4888n025r314m0461
$$ 233626 255517 270251 262269 234904 205242 206752 196944 191323 208346 223234 218209 208895 168434
10652A68434j8160Q956r252j9466R35J3002O656R291n059j2522J3698J8639j2238
$$ 168434 150274 159230 149978 130512 131447 144449 151105 160396 155337 142815 156513 175152 162914
10639A62914q040p00J5120J9579L8246M1732L4819M0845M3357K1342j1580j9312
$$ 162914 154874 154174 169294 188873 227119 268851 303670 344515 387872 409214 397634 378322
10627C78322l2679o5879l3458j0670m160J2071K1310L8676N5215O9307P1918J01220
$$ 378322 345643 279764 246306 235636 231476 243547 264857 303533 358748 428055 499973 601193
10615F01193J05936M5379l1110o3483j00007r5139m7829l4359j7669j7910k5140
$$ 601193 707129 752508 721398 657915 557908 462769 414940 380581 362912 345002 319862
10604C19862j5840j2581N464J3665J5580j2881P024J2979M7112L6131K2648K2593
$$ 319862 304022 291441 296905 310570 326150 313269 320293 333272 380384 416515 439163 461756
10592D61756j842j5190o62J0837O0621J08539J36079J13932O5384j1685q9352
$$ 461756 459914 444724 444062 454899 515520 624059 760138 874070 939454 927769 838417
10581H38417q8129k7910M0528O7271R0431P6369N128k0282q5057j05460o2789
$$ 838417 750288 722378 762906 830177 920608 996977 1002105 981823 896766 791306 728517
10570G28517k4310J4602M1209O2721P9856Q7098J06315J58878J93008K20914J77739
$$ 728517 704207 718809 760018 822739 902595 989693 1096008 1254886 1447894 1668808 1846547
10559A846547J07252M9524P549J9728P9745J94720K75295L78677N12931O53848
$$ 1846547 1953799 2003323 2010872 2030600 2110345 2305065 2580360 2959037 3471968 4125816
10549D125816Q50461J132657J555233K207025L318255N390445R181266J5118704
$$ 4125816 4976277 6108934 7664167 9871192 13189447 18579892 27761158 42879862
10541D2879862K1310957K3187887J8087314P125371p136105j8708212k1544409
$$ 42879862 64190819 87378706 105466020 112591391 105455286 86747074 65202665
10534F5202665j7314568j1682764p464199m827336l268093k372189j817046j402774
$$ 65202665 47888097 36205333 28741134 23913798 20645705 18273516 16456470 15053696
10526A5053696j103481q46018o50833n46994m82857n08188n02732m58200l96704
$$ 15053696 13950215 13104197 12453364 11906370 11423513 10915325 10412593 9954393 9557689
10517I557689l28118k94404k95788l62756m02581l69321l30938k84302k27547
$$ 9557689 9229571 8935167 8639379 8276623 7874042 7504721 7173783 6889481 6661934
10508F661934j95914j77305j77703j77926j81232j76007j87794j67160j36043
$$ 6661934 6466020 6288715 6111012 5933086 5751854 5575847 5388053 5220893 5084850
10499E084850j09573q9957q6416r6252j18197j54304j56588j14237o8341o4235
$$ 5084850 4975277 4885320 4798904 4702652 4584455 4430151 4273563 4159326 4090985 4026750
10489D026750n8968l1740l1268o017N3226J09312J16831Q9257o038j34003k46801
$$ 4026750 3967782 3936042 3904774 3898757 3951983 4061295 4178126 4267383 4261345 4127342 3880541
10478C880541k60531k17510j58213j24871j03024q8121p3527p8884n9797n3129
$$ 3880541 3620010 3402500 3244287 3119416 3016392 2928271 2854744 2775860 2716063 2662934
10468B662934o3296p7043o7818l3489m2269m6616l7310k8927j8249j4356O751
$$ 2662934 2599638 2522595 2454777 2421288 2379019 2332403 2295093 2266166 2247917 2233561 2240312
10457B240312L556j8426l6371n0013o3739n0413l0176m0602m0014m2023k1375
$$ 2240312 2243868 2225442 2189071 2139058 2075319 2024906 1994730 1954128 1914114 1872091 1850716
10446A850716L306K5395P1100J35937K41151L84064N15950N91382M65900J74843
$$ 1850716 1854022 1879417 1950517 2086454 2327605 2711669 3227619 3819001 4284901 4459744
10436D459744j34353l93792m65351l41481j88632j24767j03151r4531j32678j63882
$$ 4459744 4325391 3931599 3466248 3124767 2936135 2811368 2708217 2613686 2481008 2317126
10426B317126j22836r3847m9385k8078l6334l5163m9434m5388o0200r5663j00343
$$ 2317126 2194290 2100443 2051058 2022980 1986646 1951483 1902049 1856661 1796461 1700798 1600455
10415A600455r5675p0072o1733k4923j9898k2328k1267k3742k4279l7365j7676
$$ 1600455 1504780 1434708 1372975 1348052 1328154 1305826 1284559 1260817 1236538 1199173 1181497
10404A181497l1003l3347k1723j8075r707j5566l3581k8340N882J3835L047K3972
$$ 1181497 1150494 1117147 1095424 1077349 1067642 1052076 1018495 990155 996037 1009872 1012919 1036891
10392A036891N9749R6589J15972Q2851P7753Q4649O7233M6196k744q8532j24315
$$ 1036891 1096640 1193229 1309201 1392052 1469805 1554454 1621687 1667883 1665139 1576607 1452292
10381A452292j51701j57721j14330p7963m2683m0953k7141j4150K4844J8005K6768
$$ 1452292 1300591 1142870 1028540 950577 907894 866941 839800 825650 850494 868499 895267
10370H95267K7487q776l0192n8839m7895k1044j9114j3877j5643j9621l0734k0825
$$ 895267 922754 913978 883786 824947 777052 756008 736894 723017 707374 687753 657019 636194
10358F36194Q143j0854j9619k7992k4021j7642p617K1628L099l5164k1060k786
$$ 636194 644337 633483 613864 585872 561851 544209 536592 558220 561319 526155 505095 502309
10346E02309n180j5055p676J909l535n055n747k948J2803J842k1609k0579j5172
$$ 502309 497129 482074 474398 476307 472772 467717 461970 459022 471825 473667 452058 431479 416307
10333D16307o851Q3J082N140k0314j1017J2283j0227k0457j2112L644p103m980
$$ 416307 409456 409539 410621 415761 395447 384430 396713 386486 366029 353917 357561 350458 345478
10320C45478P60L434J869Q465o368J36J6739q033p745j9391j8611j3012q324l913
$$ 345478 346238 349672 351541 360006 353638 353774 370513 362480 354735 335344 316733 303721 295397 291484
10306B91484J207n868r745j1949Q76J1339r940J6401J221j7259n094n100k31j6835
$$ 291484 292691 286823 277078 265129 266005 277344 267404 283805 285026 267767 262673 257573 257342 240507
10292B40507j4145q314J2921J8147P636J6994O145j7345J215k0397l355k533j1171
$$ 240507 226362 218048 230969 249116 256752 273746 279891 262546 263761 243364 240009 237476 226305
10279B26305j4016J150L094N151K805J9407L0141J9791r952R437m748k2195J0299
$$ 226305 212289 213439 216533 221684 224489 243896 274037 293828 283876 293313 288565 266370 276669
10266B76669j021k273n151M118J386j0023m973r07O753o451O5M385j0061n80K141
$$ 276669 275648 273375 268224 272342 273728 263705 258732 257825 264578 258127 258192 262577 252516 251936 254077
10251B54077P320m000j5252j5293r471j0093P696o901r777j6738k707J5310J1744
$$ 254077 261397 257397 242145 226852 217381 207288 214984 208083 198306 181568 178861 194171 205915
10238B05915N126P156K381j772j5294o240k634m972J8576J3736M179R449J464
$$ 205915 211041 218197 220578 218806 203512 197272 194638 189666 208242 221978 226157 235606 237070
10225B37070k356j368l539J3903o570L405J1443J3353q354n476K36L197j7170
$$ 237070 234714 233346 229807 243710 237140 240545 251988 265341 256987 251511 251747 254944 237774
10212B37774j4500j2588K978J636J3596K281j8443r950j0431Q59m338n502m879
$$ 237774 223274 210686 213664 215300 228896 231177 212734 202784 192353 193212 188874 183372 178493
10199A78493J852M783m185m174L028k853j4023O583K518K355J167k0129J2375
$$ 178493 180345 185128 180943 176769 179797 176944 162921 169504 172022 174377 175544 155415 167790
10186A67790K5090K599q131J388j1259j0201P983Q499m408J831L626j144J1412
$$ 167790 192880 195479 187348 188736 177477 167276 175259 183758 179350 181181 184807 183663 195075
10173A95075J249p932M837k2111j2247Q102J8722R954j3320K751p149Q282m275
$$ 195075 196324 188392 193229 171118 158871 166973 185695 195649 182329 185080 177931 186213 181938
10160A81938n312q457j4029j5742J6650n751j1125J6164Q457n982j9959k3562
$$ 181938 176626 168169 154140 138398 155048 149297 138172 154336 162793 156811 136852 113290
10148A13290p927M31M802L073R404j8751m377J4891J6871o829M482K2009R932
$$ 113290 105363 105794 110596 113669 123073 104322 99945 114836 131707 124878 129360 151369 161301
10135A61301J0725m699L3299O5683O2235Q7019R8062J17628O4180l027p6497j02187
$$ 161301 172026 167327 200626 266309 328544 415563 513625 631253 695433 692406 615909 513722
10123E13722r2323o6374m2989l6764j4985k495k523l4541k8263k889p751J9065
$$ 513722 421399 355025 312036 275272 260287 257792 255269 220728 192465 189576 181825 200890
10111B00890k441j2558j8740J0816M017j3404K539N126p9p725j3070l744O210
$$ 200890 198449 185891 167151 177967 181984 168580 171119 176245 176166 168441 155371 151627 157837
10098A57837j0258j5970n679Q717J417j0437J3763P449M243j1212r904j5139k336
$$ 157837 147579 131609 125930 134647 136064 125627 139390 146839 151082 139870 129966 114827 112491
10085A12491j2977o165J0690J8548J4374J0129L560J623l39P135L353R06j0075
$$ 112491 99514 93349 104039 122587 136961 147090 150650 152273 151934 159069 162422 163328 153253
10072A53253k9568k3116m58j2487L537Q67K7634k896j2352J9738Q111q417M529
$$ 153253 123685 100569 100111 87624 91161 92028 119662 116766 104414 124152 132263 123846 128375
10059A28375J5575j8767k3223j1251j0199n094J0155Q132L537j3667k546J6522
$$ 128375 143950 125183 101960 90709 80510 75416 85571 93703 97240 83573 81027 97549
10047I7549K901J6192J5560q136j8830K041J6765P338n307P659m199N961J3366
$$ 97549 100450 116642 132202 124066 105236 107277 124042 131380 126073 133732 129533 135494 148860
10034A48860K2327o503j2480Q95J818n093j9874k502J307N90j7212P013J8959
$$ 148860 171187 164684 152204 153099 154917 149824 129950 127448 128755 129345 112133 119146 138105
10021A38105k996r806J2128q242n04p259j2702p596j830J9588J7177m685R402
$$ 138105 135109 125303 137431 129189 128685 121426 108724 101128 99298 118886 136063 131378 140780
10008A40780J3579r4j7937l516N047Q904l498J2796p080j0658J2653J1046k059
$$ 140780 154359 154265 136328 132812 137859 146763 143265 156061 148981 138323 150976 162022 159963
9995A59963L907K744j3618N09Q293l607J1958R185q534q637J4754M446j375q935
$$ 159963 163870 166614 152996 153505 161798 158191 170149 179334 170800 162163 176917 181363 179988 171053
9981A71053J502p886Q658J9676O74j6341j286K2449L022J1966K0550K0356O875
$$ 171053 172555 164669 173327 193003 193677 177336 176050 198499 201521 213487 234037 254393 261268
9968B61268L5630P4780J27152R9474O8225M393q9574r7891o9692n3671k3131j5543
$$ 261268 296898 371678 498830 598304 666529 670922 581348 483457 413765 360094 336963 321420
9956C21420r519J1605j2582j8142j2089j4359q541q097o421j5414K582J4982R015
$$ 321420 311901 323506 310924 292782 280693 266334 257793 249696 243275 227861 230443 245425 254440
9943B54440o094j0149J044J3380J1776j6240k0798j5068R69J7295J5417k447K851
$$ 254440 248346 238197 239241 252621 264397 248157 227359 212291 213260 230555 245972 243525 246376
9930B46376O323j0109k514J4160R655j4610l0779j2524j8463N012J491o793K15
$$ 246376 252699 242590 240076 254236 263891 249281 218502 205978 187515 192527 194018 187225 187440
9917A87440J2854r302R309N130m745R91N440J6941L712r11O951j2300p998j6962
$$ 187440 200294 190992 200301 205431 200686 201677 207117 224058 227770 226859 233810 221510 213512 196550
9903A96550N584N93j3757j2568l727J0463J7940n09j1013r264j859M846M434j742
$$ 196550 202134 202727 188970 176402 172675 183138 201078 200569 189556 180292 178433 183279 187713 185971
9889A85971R072k909r441j1893l700M361j498j6944P26P50k2169j4040J5161J4930
$$ 185971 195043 192134 182693 170800 167100 171461 169963 153019 153745 154495 132326 118286 133447 148377
9875A48377P434J4359j7735k2764n064K893K1118N824j0415j7307j220N546K574
$$ 148377 155811 170170 152435 129671 124607 127500 148618 154442 144027 126720 125500 131046 133620
9862A33620p750L9N291j2989m751k607j1084J2720J2044j1645L845J7973N07R196
$$ 133620 125870 125909 131200 118211 113460 110853 99769 112489 124533 112888 116733 134706 135213 144409
9848A44409L145M354p562J3367K1226J4545N1386M7541M4071P8284N4561n406
$$ 144409 147554 151908 144346 157713 178939 193484 244870 292411 336482 414766 469327 463921
9836D63921o0581p1740q1290o5612k9757o913R972R922j0236P837P686M078p980
$$ 463921 403340 331600 250310 184698 154941 148028 158000 167922 157686 165523 173209 177287 169307
9823A69307j1680j5688L30N920P301m408r044J4086m949m65o398j0217p268k46
$$ 169307 157627 141939 142269 148189 155490 151082 142038 156124 151175 150710 144312 134095 126827 126581
9809A26581j417Q066K1011j233j3050N996K1449k770j3334j1868R684m505r629
$$ 126581 125164 133230 154241 153008 139958 145954 167403 164633 151299 139431 149115 144610 134981
9796A34981J0716Q086j1590J4429J159L22o51p982j1075O026l607j56K926J1524
$$ 134981 145697 153783 142193 156622 157781 158103 157452 149470 138395 144421 140814 140658 143584 155108
9782A55108k9593l801L1004J4711J2708j3472m286q604p254J129n116j0502Q253
$$ 155108 125515 121714 152718 167429 180137 166665 162379 153775 146521 147650 142534 132032 140285
9769A40285M634o558Q737M602N370m193K0069J2608j7703p342j3206j1112n224
$$ 140285 144919 138361 147098 151700 157070 152877 172946 185554 167851 160509 147303 136191 130967
9756A30967n648J8248L2161Q408L007L675Q437o471L380J6925j138m811k4011
$$ 130967 125319 143567 175728 184136 187143 190818 199255 192784 196164 213089 211951 207140 183129
9743A83129j5345o315k533j2731j5095J6791M512Q011q29k598K1693Q241j5196
$$ 183129 167784 161469 158936 146205 131110 147901 152413 160424 159595 156997 178690 186931 171735
9730A71735j8193o692R553L517j7081j2366P491J0533R274J0010m952N077J012
$$ 171735 153542 146850 156403 159920 142839 130473 137964 148497 157771 167781 162829 167906 168918
9717A68918M724j6461K326r216k0293j2777J1704N601p49R313J9109J121L084
$$ 168918 173642 157181 159507 150291 129998 117221 128925 134526 133777 143090 162199 163320 166404
9704A66404Q029q266k3689l4233Q311J1706M464K0747J3359j5874r25J3338J0263
$$ 166404 174433 166167 142478 108245 116556 128262 132726 153473 166832 150958 150033 163371 173634
9691A73634k959m261k199r087o740L141p205k2089j8377K932J1064J5306Q615
$$ 173634 170675 166414 164215 155128 148388 151529 144324 122235 103858 106790 117854 133160 141775
9678A41775M111J394L09M111Q762p896q648Q688o059K7641j734j4421j1467J075
$$ 141775 145886 147280 147589 151700 160462 152566 143918 152606 146547 174188 172454 158033 146566 147641
9664A47641J6319P037k0890r750M45j382L259K0783J44l717J3872K3818K2562
$$ 147641 163960 170997 150107 140357 140802 139420 142679 163462 163606 159889 173761 197579 220141
9651B20141L9908J6281K3285K9132M2426N9790Q3933J05056J06283R1918R8234
$$ 220141 260049 276330 299615 328747 371173 430963 514896 619952 726235 818153 916387
9640I16387J05491P3861L5535j5168m0693o0121q1124r4957p5207p7660q7857
$$ 916387 1021878 1095739 1131274 1116106 1075413 1015292 934168 839211 764004 686344 598487
9629E98487p3787n1361l5646l0675l9031k0879k7280l0965o171j738O275j8607
$$ 598487 524700 473339 437693 407018 367987 347108 319828 288863 282692 280954 287229 268622
9617B68622k0237r172q470j536k6087l5758q419N926J1650J6915K1j2442J0306
$$ 268622 248385 239213 230743 229207 203120 167362 158943 164869 176519 193434 193455 181013 191319
9604A91319N264K369K963r232M409k1284k3898j6684j0321j0721k801N305J6128
$$ 191319 196583 198952 201915 192683 197092 175808 151910 135226 124905 114184 111383 116688 132816
9591A32816J5914o089J3475l174k85p355k1585M941L619n403J805J2129k80O703
$$ 132816 148730 142641 156116 152942 152657 145302 123717 128658 132277 126874 128679 140808 140528 147231
9577A47231L078l748j0355J1784J2623o501k489j6109J734m06o479p88N462j53
$$ 147231 150309 146561 136206 147990 160613 154112 151623 135514 137248 136842 130363 129575 135037 134884
9563A34884j1840j0835K24j5924j1087J5848J496j9377J041M402K867j2419Q083
$$ 134884 123044 112209 112433 96509 85422 101270 102766 83389 84430 88832 91699 79280 87363
9550H7363l384j6236J271K4095L5557K346k279q967o98O434k1470j7796j7607
$$ 87363 83979 67743 69014 93109 128666 131012 128733 119766 119068 125502 104032 86236 68629
9537F8629j817K559J5923J2941R813J8742j416j3737m261j2202m715J982M456
$$ 68629 66812 69371 85294 98235 108048 126790 125374 111637 107376 95174 90459 92441 96897
9524I6897K509J4737J6801N448k4460l3639p301J8120J9518Q050j6460j687J252
$$ 96897 99406 114143 130944 136392 111932 78293 70992 89112 108630 116680 100220 98533 99785
9511I9785O673K3531K1632J413k4656j6768J869n683k884k0327k454J5747K83
$$ 99785 106458 129989 151621 153034 128378 111610 113479 107796 104912 84585 82131 97878 98161
9498I8161j2116J4981K8684L9567L3378K6177J7783P722L568k3397l4191k9379
$$ 98161 86045 101026 129710 169277 202655 228832 246615 254337 257905 234508 200317 170938
9486A70938M144n232K002m056N450j0480j7781J2347j2091n695K447J257j1611
$$ 170938 175082 169850 171852 167796 173246 162766 144985 157332 145241 139546 141993 143250 131639
9473A31639j9416J2252J1629K2564P699j8576j0134l3773l2007l862r689r761
$$ 131639 112223 124475 136104 158668 166367 147791 137657 103884 71877 68015 58326 48565
9461D8565j5162P52J9397K3921K6645J6458j3582q651j6032j39P011j0103k562
$$ 48565 33403 34155 53552 77473 104118 120576 106994 98343 82311 82172 89183 79080 76518
9448G6518J0047K933J1526N564n046j513L278r204j4217l0435m493m541p769L0733
$$ 76518 86565 89498 101024 106588 101542 100029 103307 94103 79886 49451 44958 40417 32648 63381
9434F3381K8689k1751j2449K0484Q361J2342l18j0839k1415m97J4877j970k3244
$$ 63381 92070 70319 57870 78354 86715 99057 98739 87900 66485 65988 80865 78895 55651
9421E5651o242r593k4519L569K0421M530m614L959J6538J0290J4626J9940K1276
$$ 55651 49409 39816 15297 18866 39287 43817 39203 43162 59700 69990 84616 104556 125832
9408A25832J1175M40j0604n085j2069o86M429j2672k0410J2854J9228j8245O230
$$ 125832 137007 137447 126843 121758 109689 109003 113432 100760 80350 93204 112432 94187 100417
9395A00417P264J709K4355J3699Q448m275n20P22N364Q808K4768J9023j1816o377
$$ 100417 107681 109390 133745 147444 155892 151617 151097 151819 157183 165991 190759 209782 197966 191589
9381A91589j8523k5082j240J4630O472j1436j4958j167o26O951M415K8257J3289
$$ 191589 173066 147984 146744 161374 167846 156410 141452 140285 139659 146610 151025 179282 192571
9368A92571K5555K6508P0491Q3323Q4857M5503l325q0796p9778l3597j3204n47
$$ 192571 218126 244634 315125 398448 483305 528808 525483 444687 364909 331312 318108 317561
9356C17561r734j1272J3828J4298M237p877j7452J002j2504j2997j0053n098j6670
$$ 317561 307827 296555 310383 324681 328918 321041 303589 304591 292087 279090 269037 263939 247269
9343B47269j3267j0J7925O928J1297J2412o045k506J936K3434L1167J7695R608
$$ 247269 234002 233992 251917 258845 270142 282554 276509 274003 275939 299373 330540 348235 357843
9330C57843K944o239m037r190l005k6215k1960k355K0199K3427K6159M1337N2968
$$ 357843 360787 354548 350511 341321 338316 312101 290141 287786 307985 331412 357571 398908 451876
9317D51876K1581J6485J6765K906L0042K7332J6099j806o177k374J2180J0718
$$ 451876 473457 489942 506707 509613 539655 566987 583086 581280 575103 572729 584909 595627
9305E95627K8402P356J5792J1985k974K727l131j8507J4370K8511M5926M5607
$$ 595627 624029 631385 647177 659162 656188 658915 655784 637277 651647 680158 726084 771691
9293G71691L6200K0079K9044M1745M3693K7652N4456Q1499N0714M6340M0390L8472
$$ 771691 807891 827970 857014 898759 942452 970104 1024560 1106059 1156773 1203113 1243503 1281975
9281A281975L2866M2088L0523N1937P3719O5781N6086L8232M3743M0708O9468
$$ 1281975 1314841 1356929 1387452 1439389 1513108 1578889 1634975 1673207 1716950 1757658 1827126
9270A827126J15245J55183K10367K32716K73490K93121L01492L17410L47054M10783
$$ 1827126 1942371 2097554 2307921 2540637 2814127 3107248 3408740 3726150 4073204 4483987
9260D483987M93555N63690O78145Q61477J060043J259838J411446J583780J751567
$$ 4483987 4977542 5541232 6219377 7080854 8140897 9400735 10812181 12395961 14147528
9251A4147528J900896K035655K255339K681889L533576N118074P751665J2052031
$$ 14147528 16048424 18084079 20339418 23021307 26554883 31672957 39424622 51476653
9243E1476653J9291535L1606841M9700239O4683684N9431700L6159259M020889
$$ 51476653 70768188 102375029 152075268 216758952 276190652 312349911 316370800
9236C16370800l8468137o0840332n3837499l8292879k5542932j7032637j1658261
$$ 316370800 277902663 217062331 163224832 124931953 99389021 82356384 70698123
9229G0698123q234658n975833m412338l288962k628340k220983k032169k109319
$$ 70698123 62463465 56487632 52075294 48786332 46157992 43937009 41904840 39795521
9221C9795521k227895k236828k118009j931242j704171j470896j275070j134430
$$ 39795521 37567626 35330798 33212789 31281547 29577376 28106480 26831410 25696980
9213B5696980r83964q72906p53052o46966n60726m83966m68587m60652m55691
$$ 25696980 24713016 23840110 23087058 22440092 21879366 21395400 20926813 20466161 20010470
9204B0010470m87990n38143n78623o52985o55064o05689n50857n07983m65541
$$ 20010470 19522480 18984337 18405714 17752729 17097665 16491976 15941119 15433136 14967595
9195A4967595m18044m01203l32789l00397k82301k53849k35470k12651j91337
$$ 14967595 14549551 14148348 13815559 13515162 13232861 12979012 12743542 12530891 12339554
9186A2339554j87035j88417j80104j38041j50728j24574j77423k74579l37302
$$ 12339554 12152519 11964102 11783998 11645957 11495229 11370655 11193232 10918653 10581351
9177A0581351l19199k84445k69341k43132j86375j76245j77025j98770k13693
$$ 10581351 10262152 9977707 9708366 9465234 9278859 9102614 8925589 8726819 8513126
9168H513126j97926j83749j83333j59218j52327j51730j64545j58870j64919j48837
$$ 8513126 8315200 8131451 7948118 7788900 7636573 7484843 7320298 7161428 6996509 6847672
9158F847672j30840j15264r7834j05735j04745j27378j21054j05439j32448j41815
$$ 6847672 6716832 6601568 6503734 6397999 6293254 6165876 6044822 5939383 5806935 5665120
9148E665120j17139j04700j14029j15604j14075q6293o5078q5721p0380o3286
$$ 5665120 5547981 5443281 5329252 5213648 5099573 5013280 4948202 4862481 4792101 4728815
9138D728815p6423p9668q8148p1810p5932p8825p3378r1817r7572o1810p9367
$$ 4728815 4652392 4572724 4484576 4412766 4336834 4258009 4184631 4092814 3995242 3933432 3854065
9127C854065r0968q9460p8810o1762p5427o7346o6557o4251o2768n9210l4709
$$ 3854065 3763097 3673637 3594827 3533065 3457638 3390292 3323735 3259484 3196716 3137506 3102797
9116C102797o5202q6324o9322n4478n0841j8962j2725j7925l8301l2967o8525
$$ 3102797 3037595 2951271 2881949 2827471 2776630 2757668 2744943 2727018 2688717 2655750 2587225
9105B587225n4367m4512m8387n0683l9097n0372m5190m7257l4507n9122n3415
$$ 2587225 2532858 2488346 2439959 2389276 2350179 2299807 2254617 2207360 2172853 2113731 2060316
9094B060316l6202n2025o6809k9817k3217k3521k7133j0616j5498l0263r348k2025
$$ 2060316 2024114 1972089 1905280 1875463 1852246 1828725 1801592 1790976 1775478 1745215 1735867 1713842
9082A713842l4096k3347j8707k3336l9489k2031Q943m5043m7287j9049n568j1655
$$ 1713842 1679746 1656399 1637692 1614356 1574867 1552836 1561779 1516736 1469449 1450400 1444832 1433177
9070A433177j8730k5677k6808l2666k3074l5304j311Q008l321j6644j236Q219
$$ 1433177 1414447 1388770 1361962 1329296 1306222 1270918 1269607 1277615 1274294 1257650 1256414 1264633
9058A264633p150j8849k1028k9078k8472k2291r951q48l693O47k7745k6903q853
$$ 1264633 1257483 1238634 1217606 1188528 1160056 1137765 1127814 1126966 1123273 1123920 1096175 1069272 1060419
9045A060419j4823R042Q018P45k650n764k288R53r268j7598k8698j9329j1589
$$ 1060419 1045596 1054638 1062656 1063401 1060751 1054987 1052699 1053652 1044384 1026786 998088 978759 967170
9032I67170j9962p151J6133P667J0485j9880l3199n552o856n950j1727p119p698
$$ 967170 947208 940057 956190 963857 974342 954462 921263 915711 908855 902905 891178 884059 876361
9019H76361l3996j5621O788P112J0824r489k9444m2087j0795P923l7111l1353
$$ 876361 842365 826744 833532 840644 851468 841979 812535 770448 759653 767576 730465 699112
9007F99112m2595o511J2340J5679J2814j2256m041j7174r836j896o398k8349k5427
$$ 699112 656517 650006 662346 678025 690839 678583 674542 657368 647532 645636 639238 610889 585462
8994E85462L18J1296j471j2393O562J3348J1817m502o207l6128j4372K810r545
$$ 585462 585780 597076 595605 583212 589774 603122 614939 610437 604230 568102 553730 556540 546995
8981E46995j6500k0469K1161R405j378j1208k480j497J6450L4399K6800N045J0076
$$ 546995 530495 510026 531187 540592 539214 528006 525526 524029 540479 574878 601678 606723 616799
8968F16799K1192J9500J9225K3207K3198L3230O2806Q9270J05045J26649J74619
$$ 616799 637991 657491 676716 699923 723121 756351 819157 908427 1013472 1140121 1314740
8957A314740K04915K53827L19944M53268N34244M24644J92868j60388n35968n94906
$$ 1314740 1519655 1773482 2093426 2546694 3080938 3505582 3698450 3538062 3002094 2407188
8947B407188m51247k94569k03429j55499j23113q4608n7788m3641m4892l1356
$$ 2407188 1955941 1661372 1457943 1302444 1179331 1094723 1036935 993294 948402 917046
8937I17046k0440j3415k3726n5440n7854m3906l1623k8639r898J0383K234k1788
$$ 917046 896606 883191 859465 804025 746171 702265 670642 642003 632105 642488 644722 622934
8925F22934k7555j9168k5657k1615j459j197l66p218j7461j5813k04j5973j2783
$$ 622934 595379 576211 550554 528939 527480 526283 525917 518699 501238 485425 485221 469248 456465
8912D56465K007o904j5059m936M175L686j3934J689k597j769k7947j6655j3768
$$ 456465 458472 451568 436509 431573 435748 439434 425500 427189 424592 422823 394876 378221 364453
8899C64453j4545j0240p456J1326J0567J2771k518j0088j1936k5594r241k534
$$ 364453 349908 339668 332212 343538 354105 366876 364358 354270 342334 316740 307499 304965
8887C04965j2783J6046q20j4766J683j807n91p157n476R542l890j1739k591o734
$$ 304965 292182 308228 307408 292642 294325 292518 291927 284770 279294 288836 284946 273207 270616 263882
8873B63882j1376J2891R887j5837j1370m998k819J7796P214l1259m608J0627O111
$$ 263882 252506 265397 275284 259447 248077 243079 240260 258056 265270 234011 229403 240030 246141
8860B46141q3J6579Q77j6436j6956M452O464j6175J0858K2131L1361r60l427k149
$$ 246141 246058 262637 263514 247078 230122 234574 241038 224863 235721 257852 289213 288253 284826 282677
8846B82677J7594J6308P323J4926M8389N9112N4989P9384J01690J01796J17565
$$ 282677 300271 316579 323902 338828 387217 446329 501318 580702 682392 784188 901753
8835I01753J23786J12338P3482K6397J6280k0184p8279p6157p4092j05600j16394
$$ 901753 1025539 1137877 1211359 1237756 1254036 1233852 1155573 1079416 1005324 899724 783330
8824G83330q1178n1794p3280n9958l3044l8549l6413k7600j8195j5285O12k250
$$ 783330 702152 650358 577078 517120 484076 445527 409114 381514 363319 348034 348646 346396
8812C46396j0280l3839K60J349j0675q104K373k045k5299j3667J0410J2218q82
$$ 346396 336116 302277 302537 303886 293211 285107 287480 285435 260136 246469 256879 269097 268215
8799B68215K678M625j4088N337M309q935l863J005r228k727r259o316L30j2715
$$ 268215 270893 275518 261430 266767 271076 262141 258278 259283 250055 247328 238069 231753 232083 219368
8785B19368k6020o985P021N977j1570j5432J9757P511N178O722j5285j8924K709
$$ 219368 193348 186363 193384 199361 187791 172359 192116 199627 204805 211527 196242 177318 180027
8772A80027N436j1536o148r010M080J2452K345Q543K732j2352J1636R370k05n837
$$ 180027 185463 173927 167779 158769 162849 175301 177646 186189 188921 176569 188205 197575 197370 191533
8758A91533k082J828j729p519j547N807p157j2624l785J8134L933J230J3228k1004
$$ 191533 189451 191279 189550 182031 180484 186291 179134 166510 162725 180859 184792 186022 199250 178246
8744A78246O965N51r600K051o469p59l875j9958l853J9348K0088j0342q250J3569
$$ 178246 185211 185762 176162 178213 171744 170985 167110 147152 143299 162647 182735 172393 164143 177712
8730A77712j7928r268j0728n439j724o853K1531J0510j387Q65L717L973k487J197
$$ 177712 159784 150516 139788 134349 132625 125772 147303 157813 156426 157291 161008 164981 162494 163691
8716A63691n817j1968j7641Q947J7693J8795O556j8674j059J4387R337M740k760
$$ 163691 157874 145906 128265 137212 154905 173700 180256 161582 160523 174910 184247 188987 186227
8703A86227J2091J0402L777L684J112R774K573j277j2804l684j556j6771j3464
$$ 186227 198318 208720 212497 216181 217293 227067 229640 228363 215559 211875 210319 193548 180084
8690A80084J3590K0548j458O89n209j9210Q160K128m735j7127Q13L865K284J2229
$$ 180084 193674 214222 212764 213453 208244 189034 197194 199322 194587 177460 178273 182138 184422 196651
8676A96651n397j1478j3801K326Q743Q929n61r906J608P169j0252J1860p479L212
$$ 196651 191254 179776 165975 168301 177044 185973 185412 175506 177114 184283 174031 185891 178412 181624
8662A81624R75R701J6960Q090m798j213r262j5548J8695K348j0388r689j4439
$$ 181624 182599 192300 209260 217350 212552 211339 202077 186529 205224 207572 197184 187495 173056
8649A73056j0411J4311m610q825j576O719J4121K4338L156K2725K5431J9062K1150
$$ 173056 162645 176956 172346 163521 161945 168664 182785 207123 210279 233004 258435 277497 298647
8636B98647Q59q144p362j3583j206L4485N6730M6881N6314P0531P4157N8394N9351
$$ 298647 299506 291362 284000 270417 269211 303696 360426 407307 463621 534152 608309 666703 726054
8623G26054L5050M601m7465q4158r7154q0207o0434k8717j2054p596j9711j0457
$$ 726054 761104 765705 718240 634082 536928 456721 396287 367570 355516 347920 328209 317752
8611C17752k446Q191k978M280J4118J7511J077K582L010k237l709J2177K4122
$$ 317752 315306 323497 320519 324799 338917 356428 357505 360087 363097 360860 357151 369328 393450
8598C93450J7845J5607L7305M9580M9350O8196N1766L8807Q458r678K3333L1011
$$ 393450 411295 426902 464207 513787 563137 631333 683099 721906 730364 720686 744019 775030
8586G75030L6844J3541j1887k0521l6014m2570m8652m1227m0632n6547m4027l7439
$$ 775030 811874 825415 813528 793007 756993 714423 665771 624544 583912 527365 483338 445899
8574D45899j1654j4459k5786q579l0477j0680q633j2119j899j1045k3932q742
$$ 445899 434245 419786 394000 385421 354944 344264 335631 323512 321613 310568 286636 277894
8562B77894l223j53R419j5243Q549N286l4012p681Q049K3850l470m719J2250K1680
$$ 277894 274671 274518 283937 268694 277243 282529 248517 240836 248885 272735 269265 264546 276796 298476
8548B98476L5179K3206L289n637K8056N4521R6641R4789Q5883M0855n5073j12063
$$ 298476 333655 356861 360150 354513 382569 437090 533731 628520 714403 755258 700185 588122
8536E88122j01282q8154o3279m5773k1272r160j8301j423J0428J3624j0594j9497
$$ 588122 486840 398686 335407 289634 268362 259202 240901 239478 249906 263530 252936 233439
8524B33439m4P04j0218K719J6431m597k2547j5809Q283j1557j6308L796K1541
$$ 233439 233395 234099 223881 226600 243031 238434 215887 200078 208361 196804 180496 184292 205833
8511B05833Q294n406j7901n114j5335j6272j1973M292r94r681N638K7546j3651
$$ 205833 214127 208721 190820 185706 170371 154099 142126 146418 145424 135743 141381 168927 155276
8498A55276J904l573k0207Q122N472R88j0835J1432P510L653o023k625j0724m869
$$ 155276 157180 153607 133400 141522 146994 147982 137147 148579 156089 159742 153719 151094 140370 135501
8484A35501j6803J0924l855p509O681j433L273Q67p577j3370k473j452N189J2187
$$ 135501 118698 129622 125767 118258 124939 123506 126779 127646 120069 106699 104226 102774 107963 120150
8470A20150N590l864j0673m953K218P858j0358l550k560j4572n933K1584J160
$$ 120150 125740 121876 111203 106250 108468 116326 105968 102418 99858 85286 79353 100937 102097
8457A02097N305J4697P95k441n654j0111J748k3263Q521J5045L525j194k339j5422
$$ 102097 107402 122099 122894 120453 114799 104688 106436 83173 91694 106739 110264 109070 106731 91309
8443I1309k323p839k346M598L4757J1073j1210j4879J644j59r747L231l253K923
$$ 91309 88986 81147 78801 83399 118156 129229 118019 103140 104784 104625 94878 98109 94856 97779
8429I7779P840l377Q110K650j3863J388L892r349l0241r06J8522J2093k0948O444
$$ 97779 105619 102242 110352 113002 99139 100527 104419 95070 64829 63923 82445 94538 73590 80034
8415H0034J8191q431k1754k038l20K830m044K546l370N150Q495R036O346l557
$$ 80034 98225 89794 68040 66002 65682 68512 64468 67014 63644 68794 77289 86325 92671 89114
8401H9114j2502j1870J0072K187j3093R60j6851j276K623K107j3230M080J2151
$$ 89114 76612 64742 74814 77001 63908 64868 48017 46741 49364 51471 38241 42321 54472
8388E4472M761k89o198j550J2423N20p217l981J2411J0565K515j107j0172P804
$$ 54472 59233 58944 52746 51196 63619 64139 56922 52941 65352 75917 78432 77325 67153 74957
8374G4957l102r959m4N845j8884K81q775k712j7403K296J5252J9573N883L710
$$ 74957 71855 61896 61852 67697 48813 49094 40319 37607 20204 22500 37752 57325 63208 66918
8360F6918J352j424j083j508q842J1028J2800N510lJ1783l72j6864P445J246j7170
$$ 66918 68270 66846 65763 64255 55413 66441 79241 84751 84748 96531 96159 79295 86740 87986 70816
8345G0816l521J2574N223L130R399j725l876j5052k1751k728K075l676J4111O777
$$ 70816 67295 79869 85092 88222 97621 95896 92020 76968 55217 52489 54564 50888 64999 71776
8331G1776p264J5260j0302j3440M765q84J5523J3262l399j7421j716j503N145
$$ 71776 64512 79772 69470 56030 60795 59911 75434 88696 85297 67876 66160 64657 69802
8318F9802J9507Q511j1000K08l094j4772l24O03o547j937j4068J874J2882O752
$$ 69802 89309 97820 86820 87028 83934 69162 68838 69441 62894 60957 46889 48763 61645 68397
8304F8397q014j0283o593R580O416J0742K0840K415m530q319j6284J415j2457
$$ 68397 60383 50100 43507 53087 59503 70245 91085 93500 88970 80651 64367 65782 53325
8291E3325k9843q523J2856m868m204J157K870J5387k938l955n584L087j1379k145
$$ 53325 23482 14959 27815 22947 18743 19900 22770 38157 35219 31264 25680 28767 17388 15243
8277A5243Q724r78J320J1208M2J6290K2909j1960k2148P822Q288M415p854j6619
$$ 15243 23967 22989 24309 35517 35559 51849 74758 62798 40650 48472 56760 61175 53321 36702
8263C6702J130J3833J2061j1112j0183k82L005Q972K527N283k216j608j7174k5633
$$ 36702 37832 51665 63726 52614 42431 42149 45154 54126 56653 61936 59720 58112 40938 15305
8249A5305K6571J0321N266l39N423Q920j6593m363L018O940J0440j438q405m459
$$ 15305 41876 52197 57463 57124 62547 71467 54874 50511 53529 60469 70909 69471 61066 56607
8235E6607p007j9036R254Q770K793N810j007r171M165n697J151k4778j2396j0696
$$ 56607 49600 30564 39818 48588 51381 57191 56184 47013 51178 45481 46632 21854 9458 -1238
8221a238N051J3506P023P208J0289J6836j4396N181L1365j2707k2158j9871j4834
$$ -1238 3813 17319 24342 31550 41839 58675 44279 49460 80825 68118 45960 26089 11255
8208A1255K2174P699L952l37n688L737J0475O538n671j2963K907M651j8214k3534
$$ 11255 33429 41128 45080 44743 39055 42792 53267 59805 54134 41171 44078 48729 30515 6981
8194F981k090K4669K958o817J2152K2515P623k0606j6086R190J483L86M769R991
$$ 6981 4891 29560 32518 25701 37853 60368 67991 47385 31299 40489 41972 42358 47127 57118
8180E7118l794J709o648q803P64N047J5106k404m538m198m132j5885l73J7512
$$ 57118 53324 55033 48385 39582 40346 45393 60499 58095 53557 49359 45227 29342 28969 46481
8166D6481l846K228q486k3435M489P661M359k554K475r490J5457J7286P83j663
$$ 46481 42635 44863 36377 12942 17431 25092 29451 26897 29372 19882 35339 52625 53408 51745
8152E1745M792Q239j103P165n378j081n296P529j771r032k082l364j7670N228
$$ 51745 56537 64776 63673 70838 65460 64379 59083 66612 64841 55809 53727 50363 32693 37921
8138C7921J7913L461l549K966M855n543o800n956l750j417Q048L797j1671J0543
$$ 37921 55834 59295 55746 58712 63567 58024 51224 45268 41518 40101 48149 51946 40275 50818
8124E0818L703m643O590M10p588k367j0717n529J1183K1782L763r959k4817q867
$$ 50818 54521 49878 56468 56878 49290 46923 36206 30677 41860 63642 67405 57446 32629 23762
8110B3762L963m02L986Q892J5952m675j0551O768J6397J2377j2197O039J1967
$$ 23762 27725 27323 31309 40201 56153 51478 40927 47695 64092 76469 64272 70311 82278
8097H2278l103k082j6271l342M058p571j8940R285J4395j6379p551n894M991J2985
$$ 82278 79175 77093 60822 57480 61538 53967 35027 44312 58707 42328 34777 28883 33874 46859
8083D6859J8268J1367n324r125j9961k764J6451J4048q308k1214k607l151K0878
$$ 46859 65127 76494 71170 62045 42084 39320 55771 69819 61511 40297 37690 34539 55417
8070E5417m66q37L311O053K491J8363J5604K5N353R924k2428q446P896J9046J6738
$$ 55417 54951 54114 57425 63478 65969 84332 99936 99961 105314 115238 92810 84364 92260 111306 128044
8055A28044J9928K0903l638q082M674k243j6207j2958K06r523k3552n720M051
$$ 128044 147972 168875 165237 157155 161829 159586 143379 130421 130627 121104 97552 91832 95883
8042I5883n086p141k265O622J457O86o491m435M210J7397l573q811q102R18J7514
$$ 95883 90797 83656 81391 88013 89470 90156 83665 79230 83440 100837 97264 88453 80351 81269 98783
8027I8783J7048J3628P020R747K120k8377r363L910K4352P821J9285P077J6613
$$ 98783 115831 129459 136479 146226 148346 119969 110606 114516 138868 146689 165974 173051 189664
8014A89664O101k5044m453J1287J9942Q695N800o15k656j7968r223j6730k862
$$ 189664 195765 170721 166268 177555 197497 206192 211992 211377 208721 190753 181530 164800 161938
8001A61938L397P726p906q339Q469J2562K8273J031p591K0501K6812J3467J3481
$$ 161938 165335 173061 165155 156816 165285 177847 206120 207151 199560 220061 246873 260340 273821
7988B73821N634k2878j4453L827m564k1118j5957n293J171J880R455q105j6982
$$ 273821 279455 256577 242124 245951 241387 220269 204312 199019 200190 202070 211525 203420 186438
7975A86438j1472k4181J0086k212j7655l579K6859O075k8706L081J180K232j0353
$$ 186438 174966 150785 160871 158659 141004 137425 164284 170359 141653 144734 145914 148146 137793
7962A37793n733m774J237K45R604P930q59n074q915J4486K3202O571j3659K0461
$$ 137793 132060 127286 128523 128768 138372 146302 145443 140369 131454 145940 169142 175713 162054 182515
7948A82515L4743K965N821N084r792J19k2972j3413P968J3352J2745L220j0098
$$ 182515 217258 220223 226044 231128 221336 221455 198483 185070 193038 206390 219135 222355 212257
7935B12257k0830l6092k016K3582j9811j7388o301j6029N173m204J4370J2662
$$ 212257 191427 155335 153319 176901 157090 139702 133401 117372 122545 118341 132711 145373
7923A45373n395q774r252k203M323J2385m780k1284J1180R40J160o773M776K1021
$$ 145373 139978 131204 121952 119749 124072 136457 131677 110393 121573 122513 123673 116900 121676 142697
7909A42697P723K321r405m661R941J2743k069r64j0734r188L286o003m110j1390
$$ 142697 150420 152741 143336 138675 148616 161359 159290 158326 147592 138404 141690 135687 131577 120187
7895A20187q674k1413j3634J1336p234j315J0304O520K675k751j407j2060k3314
$$ 120187 111513 90100 76466 87802 80568 79253 89557 96077 98752 96001 94594 82534 59220
7882E9220j2808j2794q76R811Q167J2126J579m973L731L476p430L424j2491L057
$$ 59220 46412 33618 32742 42553 50720 62846 64425 59452 63183 66659 59229 62653 50162 53219
7868E3219R172j3953j636R731J2714L518j4745N828N631k460j5422k0901N492
$$ 53219 62391 48438 46802 56533 69247 72765 58020 63848 69479 67019 51597 30696 36188
7855C6188r02r219k510R282P997j1662J624P581j5137j3406M350N570J3188J1481
$$ 36188 35286 26067 23557 32839 40836 29174 30798 38379 23242 9836 14186 19756 32944 44425
7841D4425k578N205j685J282l264J3167j1899j0495J216K2519J462q88L288o074
$$ 44425 41847 47052 45367 46649 43385 56552 44653 34158 35374 57893 59355 58467 61755 55681
7827E5681j3130j512L0j9257R770Q17J2019M449n080J343o140q415N752j4432
$$ 55681 42551 41039 41069 21812 31582 32399 44418 48867 43787 45130 38990 30575 36327 21895
7813B1895R649L3057o930j5076k4300Q74K4172q364p587R391J2256k794j1063
$$ 21895 31544 64601 57671 42595 18295 19169 43341 34977 27390 36781 49037 46243 35180
7800C5180l1834P266R328J3078o94K209l610j2728l459J5052K7133Q951j2875
$$ 35180 3346 10612 19940 33018 32324 34533 30923 18195 14736 29788 56921 65872 52997
7787E2997j5050L905k0915q13J0364J051r059l590j9047M277J7843k452R960K636
$$ 52997 37947 41852 20937 20124 30488 31539 22480 18890 -157 4120 21963 19511 29471 32107
7773C2107r286j3001Q578J9419j2693j3375j6078J3172P433J5064L68k2280r327
$$ 32107 22821 9820 18398 37817 25124 11749 -4329 8843 16276 31340 31708 9428 101
7760A01K8381J1961P177J107j1365J752J28n02J0252M445M569p904j3946l3252
$$ 101 28482 40443 47620 48727 37362 39114 39242 38740 48992 53437 58006 50102 36156 2904
7746B904l020K2295L067j1026o029J797K110q844M640k953Q212N861p298m475
$$ 2904 -116 22179 25246 14220 8191 9988 12098 3254 7894 4941 13153 19014 11716 7241
7732G241J569J0295J7077K5473r75j7441J490J968J5865n552k5077r922n981j2497
$$ 7241 8810 19105 36182 61655 60680 43239 44729 46697 62562 57010 31933 22011 16030 3533
7718C533R719O93P094Q648j6965p674k076k3117n22J3230L705k7209n120J3490
$$ 3533 13252 13945 21039 29687 12722 5048 2972 -20145 -20667 -7437 -3732 -30941 -36061 -22571
7704b2571J7928K4364M886Q398j3303m398J16p746l332n302J2149j0521q889K202
$$ -22571 -4643 19721 24607 33005 19702 15304 15420 7674 4342 -960 11189 668 -8221 -6019
7690f019n893P204J0315J0681Q781L1399J4049j6888k2272J1216n764q08k8839
$$ -6019 -11912 -4708 5607 16288 25069 56468 70517 53629 31357 42573 36809 36001 7162
7677G162j2548Q201P937O287O261j313O168L689O50m486k6318l3262k1421J5682
$$ 7162 -5386 2815 10752 17039 23300 21987 28155 31844 32494 28008 1690 -31572 -52993 -37311
7663c7311J7122J0101L466J3943l077M179n915k1150K948o319J1711J319P388
$$ -37311 -20189 -10088 -6622 7321 4244 8423 2508 -18642 -15694 -22013 -10302 -8983 -1595
7650a595k558k778q518J1131J7293j0813o189r824j1756o018J6678L610k54M217
$$ -1595 -4153 -6931 -15449 -4318 12975 2162 -4027 -13851 -25607 -31625 -14947 -11337 -11591 -7374
7636g374J1814Q941q958r767J766J1532m982R331M006n563m512k906j4013Q792
$$ -7374 4440 13381 4423 -5344 -3578 7954 2972 12303 16309 10746 6234 3328 -10685 -1893
7622a893R954M957O231M648j1918P221j0119r461n252Q777K367j3171k878q27
$$ -1893 8061 13018 19249 23897 11979 19200 9081 -380 -5632 3145 5512 -7659 -10537 -11364
7608a1364m367P350O244K436L003M760l510J198n008o864M588K28J0188J5119
$$ -11364 -15731 -8381 -2137 299 3302 8062 4552 5750 742 -6122 -1534 -1306 8882 24001
7594B4001n510j3005J0768R487l163l237j4577J0360K294o481K777j0682J159
$$ 24001 18491 5486 16254 25741 22578 19341 4764 15124 17418 10937 13714 3032 4191
7581D191N99l892l306P917L570q42j6383j9853Q292K0763L4716O139j1276J918
$$ 4191 4790 898 -2408 5509 9079 8237 -8146 -27999 -19707 1056 35772 41911 30635 32553
7567C2553j1875m084J7740n47j3062o874M28j985j9332k510J5731J5098j3564
$$ 32553 20678 16594 34334 33787 20725 13851 14279 12294 -7038 -9548 6183 21281 7717
7554G717j946l440Q371L0836Q449j3165j5119j5973m886o535K961J9798K85j4585
$$ 7717 5771 2331 10702 41538 49987 36822 21703 5730 844 -5691 -2730 17068 17353 2768
7540B768M378n155o436N877R82R155k515k635N457n803m724j0581M389J2227K2076
$$ 2768 7146 1991 -4445 1432 2414 11569 9054 6419 11876 6073 1349 -9232 -4843 7384 29460
7525B9460O282j3046r704J7198l948j1755J8354n221j370k1521n204m491j8721
$$ 29460 35742 22696 12992 30190 26242 14487 32841 27620 26250 4729 -475 -4966 -23687
7512b3687J2544l99R292K2972r68l1280j2098R465J8244p234J0151N476L32n37
$$ -23687 -11143 -11542 -2250 20722 19754 -11526 -23624 -14159 4085 -3149 7002 12478 12810 12273
7498A2273n97K3244K3139q874o405P406M544P397j1192m095p67j8279n616N012
$$ 12273 11676 34920 58059 49185 42780 50186 54730 62127 50935 46840 46073 27794 22178 27190
7484B7190o138p705N669l466j0465J1298M979q573l760j1577m18j833m729n793
$$ 27190 21052 13347 19016 15550 5085 16383 21362 12789 9029 -2548 -2966 -4799 -9528 -15321
7470a5321r014K359K2051L665K910j1296j0193J0638j496K0992K811k5971J4520
$$ -15321 -24335 -21976 75 3740 6650 -4646 -14839 -4201 -5697 15295 18106 -7865 6655
7457F655k168j562o520O558N253m565p64j0305n594n178n8K985m919j073L2191
$$ 6655 4487 2925 -3595 2963 8216 3651 2887 -7418 -13012 -18190 -18248 -15263 -20182 -21255 10936
7442A0936J5983n429n831n520J0388J4180q055J881m539j9272j103o134o052l904
$$ 10936 26919 21490 15659 10139 20527 34707 26652 28533 23994 4722 3619 -2515 -8567 -12471
7428a2471l128J3808J0804J739J2532p626M52m36j024J527j23k097q213k8505
$$ -12471 -15599 -1791 9013 10752 23284 15658 16110 15674 14650 16177 16054 13957 5744 -22761
7414b2761j67K1326K1046J1515P989j6641m827j2075r500J851k5j389R421K6K953
$$ -22761 -22928 -1602 19444 30959 38948 22307 17480 5405 -4095 -2244 -2269 -3658 5763 5789 8742
7399H742K3276n019j4654p305j2018J5636p950o374j0432L033O652P787R783R31
$$ 8742 32018 26999 12345 5040 -6978 8658 708 -5666 -16098 -13065 -6413 1374 11157 12088
7385A2088N319K857K40M804j489k3583j5171Q081J0987J0639N105j6025j0027
$$ 12088 17407 20264 20504 25308 23819 236 -14935 -6854 4133 14772 19877 3852 -6175
7372f175m223J7231K0370N492j0671J335R483j2029j3806P900j882Q622L689L594
$$ -6175 -10398 6833 27203 32695 22024 23359 32842 20813 7007 14907 13025 21647 25336 28930
7358B8930J907q89j2181k2818Q723K5987K52j3928n281o025j739J2117J2387j1073
$$ 28930 30837 29948 17767 -5051 3672 29659 29911 15983 10702 4677 2938 15055 27442 16369
7344A6369o432o364j8847J186J7980J0406O942p473j1734j2961o145Q312J1067
$$ 16369 9937 3573 -15274 -14088 3892 14298 21240 13767 2033 -10928 -17073 -8761 2306
7331B306J5616j0654o711J001k0893L428K3470J1288l291J347j3168j4063j5277
$$ 2306 17922 7268 557 1558 -19335 -15907 7563 18851 15560 16907 3739 -10324 -25601
7318b5601r940M630K3691M92l756l019N803J0873R139r179l770j4354j603J0968
$$ -25601 -35541 -30911 -7220 -6728 -10484 -13503 -7700 3173 12312 3133 -637 -14991 -16594 -5626
7304e626p806r04J1770R117M530k4938K12p867p783r97J5526J7887J2309J2146
$$ -5626 -13432 -14336 -2566 6551 11081 -13857 -13645 -21512 -29295 -30292 -14766 3121 15430 27576
7290B7576l990k0568n246J0376J1375R798p722j23j3910j2140j781l301J4731
$$ 27576 23586 3018 -2228 8148 19523 29321 21599 21476 7566 -4574 -6355 -9656 5075
7277E075N340o940j321J5481n088j02P223q820j7754o159N253M896j3853n604
$$ 5075 10415 3475 2154 17635 12547 12445 19668 10848 -6906 -13065 -7812 -2916 -16769 -22373
7263b2373n844J0204J2627L093p124j0585J504J8028O416n841K425J6221j0037
$$ -22373 -28217 -18013 -5386 -2293 -9417 -20002 -18498 -470 5946 105 2530 18751 8714
7250H714j5385l895l608j295O806P597J3782J0147o546j2890n257j1649K0228
$$ 8714 -6671 -10566 -14174 -15469 -8663 -1066 12716 22863 16317 3427 -1830 -13479 6749
7237F749J9363J0022n333p909M402J7297L112q316j2058o733q54p144q024k297
$$ 6749 26112 36134 30801 22892 27294 44591 47703 39387 27329 20596 19742 12598 4574 2277
7223B277p210m044L264O318J502j892m422j2072q382J6340Q349J1299K426K745
$$ 2277 -4933 -8977 -5713 605 2107 215 -4207 -16279 -24661 -8321 28 11327 13753 16498
7209A6498q038j6858N234Q185p144p066M420P908R688m948j917P594J2583r74
$$ 16498 8460 -8398 -3164 5021 -2123 -9189 -4769 3139 12827 7879 5962 13556 26139 25165
7195B5165l446o790M736K966N73o820n656j1329L607L936N977M982k2446P695
$$ 25165 21719 14929 19665 22631 23204 16384 10728 -601 3006 6942 12919 17901 -4545 3150
7181C150R744R421J0759r904j6975m49j4439n577J3438J1605j81j922Q645n265
$$ 3150 12894 22315 33074 23170 6195 5746 -8693 -14270 -832 10773 10592 8670 17315 12050
7167A2050o855p585P482N663l238n181J1886J8705q633J2720j9107j4351J144
$$ 12050 5195 -2390 5092 10755 7517 2336 14222 32927 24294 37014 17907 3556 4700
7154D700J1017O84P277N544M252j5749j4727P962M592k63L664P525r033k977k24
$$ 4700 15717 16401 23678 29222 33474 17725 2998 10960 15552 15289 18953 26478 17445 14468 14244
7139A4244O75K441P781j8074j4440l261R957M830o727J614J4010L294l05p207
$$ 14244 14919 17360 25141 7067 -7373 -10634 -677 4153 -2574 -960 13050 16344 16039 8832
7125H832L081k1144j6896j3278K258J8534j132R353J1223O435n506J6997N727
$$ 8832 11913 -9231 -26127 -39405 -37147 -18613 -19745 -10392 831 7266 1760 18757 24484
7112B4484k3262l551J6201L719k7258j4216L2122J4931O82l166j4577m155J5353
$$ 24484 1222 -2329 13872 17591 -9667 -23883 8239 23170 23852 20686 6109 1954 17307
7099A7307R241o256l967m499j451q945o062J8599J4291j1701j1999O794R247r835
$$ 17307 26548 20292 16325 11826 10375 1430 -4632 13967 28258 16557 4558 11352 20599 10764
7085A0764o42p634O538K612l105k257q369J2923K0217j2452j030J0154j1615M098
$$ 10764 10122 2488 9026 11638 8533 6276 -2093 10830 31047 18595 17565 27719 16104 20202
7071B0202P449o937j2426j5423j3507r86o755J4068q19R32K713lM227k659j62
$$ 20202 27651 20714 8288 -7135 -20642 -21628 -28383 -14315 -15134 -14202 -11489 -11492 -7265 -9924 -10086
7056a0086J8497J3101p351k317j0556l68k625l16j0114j3928n159Q125J2186J890
$$ -10086 8411 21512 14161 11844 1288 920 -1705 -2021 -12135 -26063 -31222 -23097 -10911 -9021
7042i021K0453P874L660J212j747j3802j3641O311n628L566K366J4732k237k3235
$$ -9021 11432 19306 22966 24178 22431 8629 -5012 1299 -4329 -763 1603 16335 14098 -9137
7028i137j1995J0034J3122N715Q824J0315k434r453r943p713q751n23m772o532
$$ -9137 -21132 -11098 2024 7739 16563 26878 24444 14991 5048 -2665 -11416 -11939 -16711 -23243
7014b3243M941O141M886n308J4559J1007P364j6911M135Q230m981l487N610l944
$$ -23243 -18302 -12161 -7275 -12583 1976 12983 20347 3436 7571 15801 10820 7333 12943 8999
7000H999p527J0986l177j7739p123Q777N929K213R412j837j0584J070N8m745J2757
$$ 8999 1472 12458 9281 -8458 -15581 -6804 -875 1338 10750 8913 -1671 -601 -543 -5288 7469
6985G469j511k063j1787J785K9260N916k4801r972K1629Q856j7615j1648j875
$$ 7469 5958 3895 -7892 -6107 23153 29069 4268 -5704 15925 24781 7166 -4482 -6357
6972f357M496q789k328Q246K945J386j8994J663J3251J4721Q011l491j1495k032
$$ -6357 -1861 -10650 -12978 -4732 -1787 -401 -19395 -17732 -4481 10240 18251 14760 3265 1233
6958A233K506j3642l592l116J0549j887J6530K2578K478o431m678j3566K0020
$$ 1233 3739 -9903 -13495 -16611 -6062 -7949 8581 31159 33637 27206 22528 8962 28982
6945B8982K6035Q713k4751k4109p218M145K629p99j2361R40o520R383q002o311
$$ 28982 55017 63730 38979 14870 7652 11797 14426 13627 1266 2206 -4314 5069 -2933 -9244
6931i244l887p584j0296K2166L0949J0342k7575j5072n367J864q090j270J6372
$$ -9244 -13131 -20715 -31011 -8845 22104 32446 4871 -10201 -15568 -13704 -21794 -23064 -6692
6918f692Q868K3068j2524j3811J3065J1366N7j1692k370O939O155o065j2651k3781
$$ -6692 2176 25244 12720 -1091 11974 23340 23397 11705 9335 16274 22429 16364 3713 -20068
6904b0068r583J3909L10m729R365l760n92N045M554l514r08o66n827K993Q484
$$ -20068 -29651 -15742 -15432 -20161 -10796 -14556 -15148 -10103 -5549 -9063 -9971 -10637 -16464 -13471 -4987
6889d987O933r375j7947l01n407J8248J5882M604j0204j5734j3630J0474R667
$$ -4987 1946 -7429 -25376 -25677 -31084 -12836 3046 7650 -2554 -18288 -31918 -21444 -11777
6876a1777P364j0427m456o240J9703J7722J725J656O031J295Q028j4034j0867
$$ -11777 -4413 -14840 -19296 -25536 -5833 11889 13614 15270 21301 22596 30624 16590 5723
6863E723J0223J3494j5614K807L72j3108j4076L527P84R526M4j049k0507j1023
$$ 5723 15946 29440 13826 16633 17005 3897 -10179 -6652 -5868 3658 3702 2653 -17854 -28877
6849b8877N045R823L632J3654o93J4447J03P57J6790j0520R797q808j4150j4928
$$ -28877 -23832 -14009 -10377 3277 2584 17031 17134 17891 34681 24161 33958 25150 11000 -3928
6835c928K443P828O144J8036j4147K122J097L336P09r874l137j96K260Q825j4416
$$ -3928 -1485 6343 12487 30523 16376 18498 19595 22931 23640 13766 10629 10433 12693 21518 7102
6820G102K613k783m099O301J5767p086r623j708O322J7017j0288j3453j010j998
$$ 7102 9715 6932 2833 9134 24901 17815 8192 6484 12806 29823 19535 6082 5072 3074
6806C074m19m573N81J6995q069j5025M28J7668k893p929J1077R102l578j4400
$$ 3074 2655 -1918 -1337 15658 7589 -7436 -7008 10660 7767 -162 10915 20017 16439 2039
6792B039l863r745j2757p227J468K1085K1407k1595r80J6960J2612l887k186N080
$$ 2039 -1824 -11569 -24326 -31553 -30085 -9000 12407 -9188 -10168 6792 19404 15517 13331 18411
6778A8411n53J8167l171j9211o036j1882j3426N39M198L3994K5360j6367k7265
$$ 18411 17858 36025 32854 13643 7607 -4275 -17701 -17162 -12964 21030 46390 30023 2758
6765B758P881M799q58q202K21n331r803O356L064l424J2879o18r372l570j0278
$$ 2758 10639 15438 14580 6378 6599 1268 -8535 -2179 885 -2539 10340 9722 350 -3220 -13498
6750a3498p414J0428J3162M860m078J1953L802R78k155r353r844k027J2430J041
$$ -13498 -20912 -10484 2678 7538 3460 15413 19215 20193 18038 8685 -1159 -3186 9244 10285
6736A0285j0579J767j0735Q63O813j2758L605L6290l327r461M049j3805j6345
$$ 10285 -294 1473 -9262 -8399 -1586 -14344 -10739 25551 22224 12763 16812 3007 -13338
6723a3338J5021J0969j6444r832J761L499L660N30O114l553k360l833J0807J776
$$ -13338 1683 12652 -3792 -13624 -11863 -8364 -4704 -4174 1940 -1613 -3973 -7806 3001 4777
6709D777j083N740J1379N939o511k5596q389J1205J8698j6899J1743K1177n325
$$ 4777 3694 9434 20813 26752 20241 -5355 -13744 -2539 16159 -740 11003 32180 26855
6696B6855j4538l056R590M506n55k0923o486N513N462O714M492j6983q04J2060
$$ 26855 12317 9261 18851 23357 22802 1879 -4607 906 6368 13082 17574 591 -213 11847
6682A1847M18j168M6M0k026K0879P94k2716j3144J261q031j0134K24M422J2272
$$ 11847 12265 11097 11143 11183 9157 30036 30830 8114 -5030 -3769 -11800 -21934 -21710 -17288 -5016
6667e016m314k597J8800P73L963P75j230J110k968O032j1910K138K0522j0184
$$ -5016 -9330 -11927 6873 7646 11609 12384 11154 12264 9296 15328 3418 5556 26078 15894
6653A5894r018k3029R143K802N022M881N263j378o110r995j766o535N351R262
$$ 15894 6876 -16153 -7010 -4208 814 5695 10958 9580 3470 -6525 -8291 -14826 -9475 -213
6639b13K605M139k5524p676J5108j260Q348J2085k988j4676J710L523O359J4122
$$ -213 2392 6531 -18993 -26669 -11561 -12821 -4473 7612 4624 -10052 -8342 -4819 1540 15662
6625A5662J4493Q266k0659j1442m823j2900m778n696n058j0420J0762J1362J3914
$$ 15662 30155 38421 17762 6320 1497 -11403 -16181 -21877 -26935 -37355 -26593 -15231 -1317
6612a317j903J240J1055L005o28N132j4660j2712k315r001l035J2822J3408J67
$$ -1317 -3220 -1980 9075 12080 11452 16584 1924 -10788 -13103 -22104 -25139 -12317 1091 1258
6598A258j2287o680k273J8586M886n106L216J3281O833P045q753j3528M119o062
$$ 1258 -11029 -17709 -19982 -1396 3490 -1616 1600 14881 21714 28759 20006 6478 10597 4535
6584D535n693n778J691J7937O778n79q152J2412n703n879n133j4907P306O926
$$ 4535 -1158 -6936 -5245 12692 19470 18891 10739 23151 17448 11569 6436 -8471 -1165 5761
6570E761R994j6l5128j7203K2006K1728j9839n128N659J2032o190k0750j9710
$$ 5761 15755 15739 -19389 -36592 -14586 7142 -12697 -17825 -12166 -134 -6324 -27074 -46784
6557d6784L42k477J6342K1699J2417q384O053l537q219P804M700J408R696R923
$$ -46784 -46442 -48919 -32577 -10878 1539 -6845 -792 -4329 -12548 -4744 -44 1364 11060 20983
6543B0983m897r517q560j4932L691J0147p379K168m377Q576m072J115P37R170
$$ 20983 16086 6569 -1991 -16923 -13232 -3085 -10464 -8296 -12673 -4097 -8169 -7054 -6317 2853
6529B853N616j4798j5508R317R856j5752O241O767O353J433R244j3228k540J0238
$$ 2853 8469 -6329 -21837 -12520 -2664 -18416 -12175 -5408 945 2378 11622 -1606 -4146 6092
6515F092n003j2360j2170J6546J4904K1204O66j1758j9448j3802j5039J2874j600
$$ 6092 1089 -11271 -23441 -6895 8009 29213 29879 18121 -1327 -15129 -30168 -17294 -18894
6502a8894m998K2111J0952n542q688j3078J889K067Q436o136k805M726m344J978
$$ -18894 -23892 -1781 9171 3629 -5059 -18137 -16248 -14181 -5745 -11881 -14686 -9960 -14304 -12326
6488a2326j696o343O841J7074J7101q654k1944j028n693M204J482P154n848k2082
$$ -12326 -14022 -20365 -13524 3550 20651 11997 -9947 -10975 -16668 -12464 -10982 -3828 -9676 -31758
6474c1758J725J4979j31M361o388p185q768m678P417K1013N812j1237r16j292
$$ -31758 -30033 -15054 -15185 -10824 -17212 -24397 -33165 -37843 -30426 -9413 -3601 -14838 -15754 -17046
6460a7046j6629J6599N193j155j502r287j0541m373O048K0078R630j696J003j1085
$$ -17046 -33675 -17076 -11883 -13038 -14540 -23827 -34368 -38741 -32693 -12615 -2985 -4681 -3678 -14763
6446a4763r642K272J6998P378R087j2508o294j620J2172J1771j6540j9916J9170
$$ -14763 -24405 -22133 -5135 2243 11330 -1178 -7472 -9092 3080 14851 -1689 -21605 -2435
6433b435l81j3351j4439J6654K8202k303j4573j2251J9770p710k8720O104J9756
$$ -2435 -2816 -16167 -30606 -13952 14250 11947 -2626 -14877 4893 -2817 -31537 -25433 -5677
6420e677l217j4674R39O440j294o91P825M735K4102l05p43o41q392K801J8179
$$ -5677 -8894 -23568 -22629 -16189 -17483 -18174 -10349 -5614 18488 18183 17440 16799 8407 11208 29387
6405B9387o23j5290l900J201j0541N777l445j054p203Q430m760m309m528m303
$$ 29387 28764 13474 9574 10775 234 6011 2566 1512 -5691 2739 -2021 -6330 -10858 -15161
6391a5161Q636k573O235O246n555k6404j252L3611P748M558J801P738j1061j0149
$$ -15161 -6525 -9098 -2863 3383 -2172 -28576 -29828 3783 11531 16089 17890 25628 14567 4418
6377D418O229m866j4355J116O369N251J6630q580j6869N239Q486j875p155j219
$$ 4418 10647 5781 -8574 -7458 -1089 4162 20792 12212 -4657 582 9068 7193 38 -1181
6363a181j432P811M182L431q853j720j3737K716l437L067o14K2767J5887r205
$$ -1181 -2613 5198 9380 12811 3958 2238 -11499 -8783 -12220 -9153 -9767 13000 28887 19682
6349A9682o827q082J134j7860p330N817r02L27M483J9267l257O853J6925m856
$$ 19682 12855 4773 5907 -11953 -19283 -13466 -14368 -14041 -9558 9709 6452 13305 30230 25374
6335B5374J126j0439r758J1906K6555j782j3064J1488K652k1117j8147j615p897
$$ 25374 26500 16061 6303 18209 44764 42982 29918 41406 44058 22941 4794 3179 -4718
6322d718m957Q450j6216j154K544J1606P476P258P01Q830J9359o213q429L254
$$ -4718 -9675 -1225 -17441 -18595 -16051 -4445 3031 10289 10990 19820 39179 32966 24537 27791
6308B7791r607j7875j2513R184J2759Q130J8492j242j7103L213o932p449n831
$$ 27791 18184 309 -12204 -3020 9739 17869 36361 35119 18016 21229 14297 6848 1017
6295A017n714P842p888k379M120O710J5186j0018l120j3543K770J1121J0556K317
$$ 1017 -4697 3145 -4743 -7122 -3002 3708 18894 8876 5756 -7787 -5017 6104 16660 18977
6281A8977K90j5637j649K1088J2867J732j4564k1701q997P47J5113L379k2642
$$ 18977 19267 3630 1981 23069 35936 37668 23104 1403 -7594 -6847 8266 11645 -10997
6268a0997j0727q57N699M606r308j0033j2087J7998N168N715R416J0411J2738
$$ -10997 -21724 -22581 -16882 -12276 -21584 -31617 -43704 -25706 -20538 -14823 -5407 5004 17742
6255A7742L558j506j541j7790o677r417J2035J5058k894M93R019j0019m746j0929
$$ 17742 21300 19794 18253 463 -6214 -15631 -3596 11462 8568 9061 18080 8061 3315 -7614
6241g614M889K2883J9199L502K202j6808j0753j5985K838Q018J232J3337Q00l0313
$$ -7614 -2725 20158 39357 42859 45061 28253 17500 1515 4353 12371 13603 26940 27740 -2573
6227b573j5175P626J2985J0692R775j7507L40k525n833l113r344K2398Q193j2827
$$ -2573 -17748 -10122 2863 13555 23330 5823 6163 3638 -2195 -5308 -14652 7746 15939 3112
6213C112L744k337Q052Q453j3351j2878j30N552P324m440M544O400q513n957p162
$$ 3112 6856 4519 12571 21024 7673 -5205 -5335 217 7541 3101 7645 14045 5532 -425 -7587
6198g587m363J6735J4135l58o661o052q765n400J1468k367M072J2691j1761p406
$$ -7587 -11950 4785 18920 18562 11901 5849 -2916 -8316 3152 785 4857 17548 5787 -1619
6184a619m277k638Q016j9172k4909J1666K2140J8882M455m753k635m162J7328
$$ -1619 -5896 -8534 -518 -19690 -44599 -32933 -10793 8089 12544 7791 5156 994 18322
6171A8322P946m443p898R039J032j6919p513j8105j5311o86K6082R273k280Q249
$$ 18322 26268 21825 13927 22966 23998 7079 -434 -18539 -33850 -34536 -8454 819 -1461 6788
6157F788J0905q028k094m055R684pq610m047o948N983k421O583J4400j4956j7057
$$ 6788 17693 9665 7571 3516 13200 13193 4583 536 -6412 -429 -2850 3733 18133 3177 -13880
6142a3880J4334K825r67N424l044J0024R305k1654j6035J0349l82j296k401j0228
$$ -13880 454 3279 2312 7736 4692 14716 24021 2367 -13668 -3319 -3701 -4997 -7398 -17626
6128a7626l196P747K0007J8326k4904j5916k754J1754J0260J7310j4608n086R608
$$ -17626 -20822 -13075 6932 25258 354 -15562 -18316 -6562 3698 21008 6400 1314 10922
6115A0922m460j3341J221O937j1765j0027o351M170J6947K576j818K618J0013
$$ 10922 6462 -6879 -5658 1279 -10486 -20513 -26864 -22694 -5747 -3171 -4989 -2371 7642
6102G642J6623q800j323j0333P201J4059o609Q131k102n98q610l239r115P142
$$ 7642 24265 15465 14142 3809 11010 25069 18460 26591 24489 23891 15281 12042 2927 10069
6088A0069M966j0495j0441q93K571J6010m130j2398r588J1523K0082J4884K953
$$ 10069 15035 4540 -5901 -6794 -4223 11787 7657 -4741 -14329 -2806 17276 32160 35113
6075C5113j2668j5527K080J3351J1810j6996j4557l720m684o694L615O470P165
$$ 35113 22445 6918 8998 22349 34159 17163 2606 -1114 -5798 -12492 -8877 -2407 4758
6062D758p372R337R419N298j2832j4832j998l480j2318R722l819L891K3986r803
$$ 4758 -2614 6723 16142 21440 8608 -6224 -8222 -11702 -24020 -14298 -18117 -14226 9760 -43
6048d3K092R517j960j9918J244J2105J0807j248j8985j4251l789J3351K4248N290
$$ -43 2049 11566 9606 -10312 -9068 3037 13844 12596 -6389 -20640 -24429 -11078 13170 18460
6034A8460j915J4349J6750j0177j3068q311n559P59r401o490P101k249j844O263
$$ 18460 16545 30894 47644 37467 24399 16088 10529 11288 1887 -4603 2498 249 -1595 4668
6020D668O03J580j4327Q667N113P110m147O123k596m011O208P764n015J1390m634
$$ 4668 5271 6851 -7476 1191 6304 13414 9267 15390 12794 8783 14991 22755 17740 29130 24496
6005B4496k4805j4611l569m101j3652N999M107J5685J8962l229l989m404k372
$$ 24496 -309 -14920 -18489 -22590 -36242 -30243 -26136 -10451 8511 5282 1293 -3111 -5483
5992e483q351M171M724j0744J3492O950R71p79R98p329j1951R831R418L828m980
$$ -5483 -13834 -9663 -4939 -15683 -2191 4759 5730 4951 5949 -1380 -13331 -3500 5918 9746 4766
5977D766j0251p032J8371l527O288p328j8443n838N471j54J7183N415J3399K340
$$ 4766 -5485 -12517 5854 2327 8615 1287 -17156 -22994 -17523 -17677 -494 4921 18320 20660
5963B0660j7766L725O798j1597N193m950p876j5306p33M075R866m027j787r829
$$ 20660 2894 6619 13417 1820 7013 2063 -5813 -21119 -21852 -17777 -7911 -11938 -13725 -23554
5949b3554k420K1321P148J3057j279r210j9258K733k047J3324L914j3723m417
$$ -23554 -25974 -4653 2495 15552 14273 5063 -14195 -11462 -13509 -185 3729 -9994 -14411
5936a4411k535n354K4693J4150p21k282j471J0917o682J327K492j6419m992l641
$$ -14411 -16946 -22300 2393 16543 15822 13540 12069 22986 16304 17631 20123 3704 -1288 -4929
5922d929j138M796P513Q835Q571n10p350M724O80J503p746m512n889p634j5536
$$ -4929 -6067 -1271 6242 15077 23648 23138 15788 20512 21192 22695 14949 10437 4548 -3086 -18622
5907a8622r353R824J2338j0309o134J1133R820K4566O910k2321k0573p784J5792
$$ -18622 -27975 -18151 -5813 -16122 -22256 -11123 -1303 23263 30173 7852 -12721 -20505 -4713
5894d713R71j7232K853N699p10m001J393j228M523J9329J7729N775m609j8545
$$ -4713 -3742 -20974 -18121 -12422 -13132 -17133 -15740 -16968 -12445 6884 24613 30388 25779 7234
5880G234j3877L162J4302L989M595J7061P909k383j9209k1507q535J0877J2917
$$ 7234 -6643 -3481 10821 14810 19405 36466 44375 41992 22783 1276 -7259 3618 16535
5867A6535K124l273j1110P737n016j1781k1976n156P893O720O712J6243O018k392
$$ 16535 18659 15386 4276 12013 6997 -4784 -26760 -31916 -24023 -17303 -10591 5652 11670 9278
5853I278O75N811j1791p040J2071m614j9761J515Q219J3469J1199j0076l05O243
$$ 9278 9953 15764 3973 -3067 9004 4390 -15371 -13856 -5637 7832 19031 8955 8650 14893
5839A4893j253j9823j1137N420l90J186J7118k3538j3718L142P198j262P687J1071
$$ 14893 13640 -6183 -17320 -11900 -12290 -11104 6014 -17524 -31242 -28100 -20902 -22164 -14477 -3406
5825c406R285j1133J8083n484k9566k8435J1486J8177J1110K547j534R276J3594
$$ -3406 5879 -5254 12829 7345 -22221 -50656 -39170 -20993 -9883 -7336 -8870 406 14000
5812A4000m933k545J0562q436j0076O277q71j630j53m698Q704J0166j224o60P205
$$ 14000 9067 6522 17084 8648 -1428 4849 3978 2348 2195 -2503 6201 16367 15143 14483 21688
5797B1688l93j8523L816J6669P387k6182o486L657j6369r563J6356K4845o500
$$ 21688 21295 2772 6588 23257 30644 4462 -2024 1633 -14736 -24299 -7943 16902 10402
5784A0402k0486j0781J3683l991R174O585Q615Q844K69j684j7851K519l685p948
$$ 10402 -10084 -20865 -7182 -11173 -1999 4586 13201 22045 22314 20630 2779 5298 1613 -6335
5770f335J892J3635n428j6461m96l493n042J6162l765J2617m452j5736L101J2515
$$ -6335 -4443 9192 3764 -12697 -13193 -16686 -21728 -5566 -9331 3286 -1166 -16902 -13801 -1286
5756a286p046J2011N595L530P157j6413k5335j0279J4459J5418J0438J8757P532
$$ -1286 -8332 3679 9274 12804 19961 3548 -21787 -32066 -17607 -2189 8249 27006 34538
5743C4538j0971q479j0980j2446m057J471k071o78K1641J191N505l076j3767m315
$$ 34538 23567 15088 4108 -8338 -12395 -10924 -12995 -13673 7968 9159 14664 11588 -2179 -6494
5729f494R264j5963p038L978K4913k362l903O968p065o552k419P084k143j2676
$$ -6494 2770 -13193 -20231 -16253 8660 6298 2395 9363 2298 -4254 -6673 411 -1732 -14408
5715a4408j820J6687n146J166O898n966j460k612J5084m673q942l432N567Q867
$$ -14408 -16228 459 -4687 -3521 3377 -2589 -4049 -6661 8423 3750 -5192 -8624 -3057 5810
5701E810j3579n521L733o338j4287O722r352Q71K0366K2619r104J1774J3517l335
$$ 5810 -7769 -13290 -9557 -15895 -30182 -23460 -32812 -31941 -11575 11044 1940 13714 27231 23896
5687B3896N51l389J1887L214J450q340k2817q983N511J971N998P199r512j0738
$$ 23896 24447 21058 32945 36159 37609 29269 6452 -2531 2980 4951 10949 18148 8636 -2102
5673b102j3652J1113J4954K597J146M927q221r851N813q402N056J0369p107j3285
$$ -2102 -15754 -4641 10313 12910 14056 18983 10762 911 6724 -1678 3378 13747 6640 -6645
5659f645n998K372J2970J785j871j3565l206J3347J3932L192k8808k0011K679
$$ -6645 -12643 -10271 2699 4484 2613 -10952 -14158 -811 13121 16313 -12495 -32506 -29827
5646b9827N072J0227N781k683M771j150N335R051j429j2893k886j559p461l48
$$ -29827 -24755 -14528 -8747 -11430 -6659 -7809 -2474 6577 5148 -7745 -10631 -12190 -19651 -19999
5632a9999K3108l66n888Q541K150n27j48R795J5104k501j5128j5360r531l178
$$ -19999 3109 2743 -3145 5396 7546 7019 6871 16666 31770 29269 14141 -1219 -10750 -13928
5618a3928O975P625j0629J9375J7797j6893j1394n979k990M382J6222K1681J230
$$ -13928 -6953 672 -9957 9418 27215 10322 -1072 -7051 -10041 -5659 10563 32244 33474
5605C3474k4628K650K4280L405k5178l258n538p958O799q161M844p069J28p712
$$ 33474 8846 11496 35776 39181 14003 10745 5207 -2751 4048 -4113 731 -6338 -6210 -13922
5591a3922J1338J3042J92L128m811N00P292q864k621n616j0737j282m131j7002
$$ -13922 -2584 10458 10650 13778 8967 9467 16759 7895 5274 -342 -11079 -12361 -16492 -33494
5577c3494M382J2045J9534K24p387K99O37j5911J4590J2292J2348j4307j8378
$$ -33494 -29112 -17067 2467 2691 -4696 -4397 -3760 -19671 -5081 7211 19559 5252 -13126
5564a3126J0446n171O071k403m584Q224Q196Q191m122J0881P988j700n011k4353
$$ -13126 -2680 -7851 -1780 -4183 -8767 -543 7653 15844 11722 22603 30591 28891 23880 -473
5550d73R67Q724r465N872p758o391l920n894p901M752N24N096J1423j1310k6927
$$ -473 494 9218 -247 5625 -2133 -8524 -12444 -18338 -26239 -21487 -20963 -15867 -4444 -15754 -42681
5535d2681q863K0098J2427J5029L8500j1221j4562m01J1901P292N039r728j2940
$$ -42681 -51544 -31446 -19019 -3990 34510 23289 8727 8326 20227 27519 32558 22830 9890
5522I890j9448r912M484L349R27r437p607N824R16J6070J559m981M100j961J5392
$$ 9890 -9558 -19470 -14986 -11637 -10710 -20147 -27754 -21930 -21014 -4944 -3385 -8366 -4266 -6227 9165
5507I165J5997j047j3859j6331J047N663J1927k435K022p67j2251K31j1471j0906
$$ 9165 25162 24115 10256 -6075 -5028 635 12562 10127 12149 11382 -869 -638 -12109 -23015
5493b3015j4494M413R623R151J0535J4038m464q30r157j0576O879m354r184o70
$$ -23015 -37509 -33096 -23473 -14322 -3787 10251 5787 4957 -4200 -14776 -7897 -12251 -21435 -22105
5479b2105J2318J5983J452K672L102R704L628k0160k281Q584k5882l350q672L625
$$ -22105 -9787 6196 7648 10320 13422 23126 26754 6594 4313 12897 -12985 -16335 -25007 -21382
5465b1382J4413j949m287m743J9938K401k174k0013k384J3799J5718k654k3169
$$ -21382 -6969 -8918 -13205 -17948 1990 4391 2217 -17796 -20180 -6381 9337 6683 -16486
5452a6486Q043Q728o008N968q295J1720M87k569J3926n531n095J3190j1543j1940
$$ -16486 -8443 285 -5723 245 -8050 3670 4157 1588 15514 9983 4888 18078 6535 -5405
5438e405J1948j1421j5700J633O547J929o22K83Q750J648M067P256j693r494q194
$$ -5405 6543 -4878 -20578 -18945 -12398 -10469 -11091 -10808 -2058 -410 3657 10913 9220 -274 -8468
5423h468P034J3225N316K421j3773j2232J012k2586n360L426M717M965J9185P753
$$ -8468 -1434 11791 17107 19528 5755 -6477 -5465 -28051 -33411 -29985 -25268 -20303 -1118 6635
5409F635o203O157J6060j0267l349m949m062J9701K8421M66l5162k8004J1219
$$ 6635 432 6589 22649 12382 9033 4084 22 19723 48144 48610 13448 -14556 -3337
5396c337J4363j1321l112l316Q504q240k1986j9569K4251R435R93k758O404J157
$$ -3337 11026 -295 -3407 -6723 1781 -6459 -28445 -48014 -23763 -14328 -13335 -16093 -9689 -8532
5382h532n769j951N806O347K3574k668j2836p804j34j651k0365r842R441J0916
$$ -8532 -14301 -16252 -10446 -4099 19475 16807 3971 -3833 -3967 -5618 -25983 -35825 -26384 -15468
5368a5468K7695L256j0719K019j770j8372j0053j1777M642J8861J1809O427M234
$$ -15468 12227 15483 4764 6783 5013 -13359 -23412 -35189 -30547 -11686 123 6550 10784
5355A0784j0951j023M602J0780j7631p279l345Q640N413j401K598j3464N88l074
$$ 10784 -167 -1190 3412 14192 -3439 -10718 -14063 -5423 -10 -1411 1187 -12277 -11689 -14763
5341a4763j2664J4422J9205k369J0928p189j6250q423k70J8984K2993r6k6235
$$ -14763 -27427 -13005 6200 3831 14759 7570 -8680 -17103 -17373 1611 24604 24508 -1727
5328a727j3232M601P66Q142K5902q749j1171k271j4595P950j2040j0150j71j1320
$$ -1727 -14959 -10358 -9592 -1450 24452 15703 4532 2261 -12334 -4384 -16424 -26574 -26745 -38065
5314c8065p147J2462R047J2350J3323J1425O750q650j1926K2911k321j1100m707
$$ -38065 -45212 -32750 -23703 -11353 1970 13395 20145 11495 -431 22480 20159 9059 4352
5301D352n170k331N190j2594j368l343K537Q587l83J1415r17j0614J1946J5186
$$ 4352 -818 -3149 2041 -10553 -11921 -15264 -12727 -4140 -4523 6892 5975 -4639 7307 22493
5287B2493L090j2190l088m423j0506M629N522J5926r32j942j1568j3887J1843
$$ 22493 25583 13393 10305 5882 -4624 5 5527 21453 20521 18579 7011 -6876 4967
5274D967J4527n451j4570p008k397m308L008J4167L690r7j1448J4633M304R686
$$ 4967 19494 14043 -527 -7535 -9932 -14240 -11232 2935 6625 6528 -4920 9713 14017 23703
5260B3703M071n151j1905Q432L52N812n400P861j8073j9180k510M182Q859m40
$$ 23703 27774 22623 10718 19150 19502 25314 19914 27775 9702 -9478 -11988 -7806 1053 613
5246F13q973j3977q702q161J5020J1989J6734r189l777k646R839M964M410j278
$$ 613 -8360 -22337 -31039 -39200 -24180 -12191 4543 -4646 -8423 -11069 -1230 3734 8144 6866
5232F866q5r745J0012J369k2109R705J5429M846q292o199K126k0005j433P172
$$ 6866 6781 -2964 7048 8417 -13692 -3987 11442 16288 7996 1797 3923 -16082 -17515 -10343
5218a0343K3827Q423j1258q018n873K884o325J5785r000j3861Q322j326K846j3712
$$ -10343 13484 21907 10649 2631 -3242 -358 -6683 9102 102 -13759 -5437 -6763 -3917 -17629
5204a7629j5589Q737J0475J9867K8859L237k3265j8419J0617K0152l3n993k3531
$$ -17629 -33218 -24481 -14006 5861 34720 37957 14692 -3727 6890 27042 27009 21016 -2515
5191b515n649Q344p49R082k519J0893J1296j2474j7981j9865j5169K4442K09q819
$$ -2515 -8164 180 -569 8513 5994 16887 28183 15709 -2272 -22137 -37306 -12864 -12655 -21474
5177b1474k632K1537J149q958k568J1549q682k556m466j738J0903n864k24j226
$$ -21474 -24106 -2569 -1420 -10378 -12946 -1397 -10079 -12635 -17101 -18839 -7936 -13800 -14024 -15250
5163a5250K6991J0999j2806r792k034n918j9697j4487R773J7466p267l77L834
$$ -15250 11741 22740 9934 142 -1892 -7810 -27507 -41994 -32221 -14755 -22022 -22399 -18565
5150a8565J2645P273o82j591K993J0928r769p529m384K007O028j6255j5619l691
$$ -18565 -5920 1353 671 -920 2073 13001 3232 -4297 -8681 -6674 -646 -16901 -32520 -36211
5136c6211J1432K5358J5460Q47j1710k1592q006J4565J2090j2703O584K369r64
$$ -36211 -24779 579 16039 16886 5176 -16416 -24422 -9857 2233 -10470 -3886 -1517 -2481
5123b481P841l946J0794J0877k5479l7160J6126J7270J3070j1032n737l109n376
$$ -2481 5360 1414 12208 23085 -2394 -39554 -23428 -6158 6912 -4120 -9857 -12966 -18342
5110a8342j580K7026k580k4776J1500o185P130R018m065J857j0162j2776K627
$$ -18342 -19922 7104 4524 -20252 -8752 -14937 -7807 1211 -2854 -997 -11159 -23935 -21308
5097b1308R556J0781J5230N066k1833k272l977J1869J3957k005m851O293p417
$$ -21308 -11752 -971 14259 19325 -2508 -4780 -8757 3112 17069 15064 10213 16506 9089
5084I089m516M644p228k2961o087M470K523m567P7q335J0454m896K1222K0176
$$ 9089 4573 9217 1989 -20972 -27059 -22589 -20066 -24633 -24556 -32891 -22437 -27333 -6111 14065
5070A4065q258j2194K0630J553q844k718q17J7421O830j9083k8740o38J4698J383
$$ 14065 5807 -6387 14243 15796 6952 4234 3417 20838 27668 8585 -20155 -20793 -6095 -4712
5056d712n997r747k920J7864k82j326N261o445l30l412J033N856P187J0404j4385
$$ -4712 -10709 -20456 -23376 -5512 -5794 -7120 -1859 -8304 -8634 -12046 -11013 -5157 2030 12434 -1951
5041a951p837K5574J3518L64j8856j1246J0667l209J0811K725J3222P526k4083
$$ -1951 -9788 15786 29304 29668 10812 -434 10233 7024 17835 20560 33782 41308 17225
5028A7225k0173J6154M568k0762m738j7196l454K9357P837o917j2174q703q203
$$ 17225 -2948 13206 17774 -2988 -7726 -24922 -28376 981 8818 1901 -10273 -18976 -27179
5015b7179L861J1362M329p929N033K6115J7358j2495k2405O75P872J3699J3467
$$ -27179 -23318 -11956 -7627 -15556 -10523 15592 32950 20455 -1950 -1275 6597 20296 33763
5002C3763q02N424j7231q762N381n108j6806j1241J1760l339k847o168J8646j217
$$ 33763 32961 38385 21154 12392 17773 12665 -4141 -15382 -3622 -6961 -9808 -15976 2670 1453
4988A453J369K1182N312j3683k530j502J509j8221j5924n545J0734R316j6719
$$ 1453 2822 24004 29316 15633 13103 11601 13110 -5111 -21035 -26580 -15846 -6530 -23249
4975b3249q053O375j0135N396K3697J5909P66k628L7O709j611j1261l209n870
$$ -23249 -31302 -24927 -35062 -29666 -5969 9940 10706 8078 8115 14824 13213 1952 -1257 -7127
4961g127q731R24Q703J8025K916j2655q97J44j1639k4308n051J4942J8352M120
$$ -7127 -15858 -14934 -6231 11794 14710 2055 1158 1302 -10337 -34645 -39696 -24754 -6402 -2282
4947b282M602J683q907k963M889M684j4162l187J1799N044R540K338M787r858
$$ -2282 2320 4003 -4904 -7867 -2978 1706 -12456 -15643 -3844 1200 10740 13078 17865 8007
4933H007j1814M032l018n852J057M999N955l786J020R078J6767J3041q250r120
$$ 8007 -3807 225 -2793 -8645 -7588 -2589 3366 -420 600 9678 26445 39486 31236 22116
4919B2116m389j3450p926k698j4445j0264n849J4652K0442l537j2722j1325J9189
$$ 22116 17727 4277 -3649 -6347 -20792 -31056 -36905 -22253 -1811 -5348 -18070 -29395 -10206
4906a0206l582Q214R730j2083O608J3112o902j1928J0031p301o055M571o245o434
$$ -10206 -13788 -5574 4156 -7927 -1319 11793 4891 -7037 2994 -4307 -10362 -5791 -12036 -18470
4892a8470R858J9790N931j0782j7442l738J9493J0881L375k2865k827J2969J1001
$$ -18470 -8612 11178 17109 6327 -11115 -14853 4640 15521 18896 -3969 -6796 6173 17174
4879A7174l784k058m424o953p4J5776P37o423m480j3723j1929j569J7245O909
$$ 17174 13390 11332 6908 -45 -119 15657 16394 9971 5491 -8232 -20161 -21730 -4485 2424
4865B424N741j556j1286j1792K347K6755J7564K245N267m808k7705k1239J0762
$$ 2424 8165 6609 -4677 -16469 -14122 12633 30197 32442 37709 32901 5196 -16043 -5281
4852e281N166q02L584r569O573m877k65j3872n817J7271R294K924J867J79O196
$$ -5281 -115 -917 2667 -6902 -329 -5206 -5471 -19343 -25160 -7889 1405 4329 6196 6375 12571
4837A2571j6987n234L177q927j2652R220K327J6578j139O520m173j6331j613M863
$$ 12571 -4416 -9650 -6473 -15400 -28052 -18832 -16505 73 -1066 5454 1281 -15050 -16663 -11800
4823a1800J734J0171J5394j2479j8561O336O692O0L549M385Q45j653P196N283
$$ -11800 -10066 105 15499 3020 -15541 -9205 -2513 -2453 1096 5481 6326 4673 11869 17152
4809A7152J0515o669j3621M18m267j6374j6509k601J4474K2484J3998r305j3280
$$ 17152 27667 20998 7377 7795 3528 -12846 -29355 -31956 -17482 5002 19000 9695 -3585
4796c585p65Q401L069Q198r14q160r822p537J104J0567L486O656K524m900pJ0656
$$ -3585 -4350 4051 7120 15318 14404 6244 -3578 -11115 -10011 556 4042 10698 13222 8322 8315 18971
4780A8971j1844n322J5193J221J451J061j978j8453p302K2596r76j0294O978Q462
$$ 18971 7127 1805 16998 18219 19670 20731 18753 300 -7002 15594 14618 4324 11302 19764
4766A9764j0957j6721j747P520p037j337N713O725O97P428N88l682j9869J0088
$$ 19764 8807 -7914 -9661 -2141 -9178 -10515 -4802 1923 2620 10048 10636 6954 -12915 -2827
4752b827J8600J4696P881n961j6771j2985J7863O162r530p865j6711j7673K986
$$ -2827 15773 30469 38350 32389 15618 2633 20496 26658 17128 9263 -7448 -25121 -22135
4739b2135J770r709J897J2568N40j0483R974K0761J8881p39j3669P755j4758k1203
$$ -22135 -20365 -30074 -28177 -15609 -15069 -25552 -15578 5183 24064 23325 9656 17411 2653 -18550
4725a8550m728J224K755J2536P143j4688L632M162N316O718k289K50R840J0513
$$ -18550 -23278 -22054 -19299 -6763 380 -14308 -10676 -6514 -1198 5520 3231 3481 13321 23834
4711B3834l36l627o491j0962J1421j906j5571M009l424M798j551J4921P767k1165
$$ 23834 23498 19871 13380 2418 13839 11933 -3638 371 -3053 1745 194 15115 22882 1717
4697A717l475R777o345k5342N775J3714J4444q682j1998k315L761N587j687P95
$$ 1717 -1758 8019 1674 -23668 -17893 -4179 10265 1583 -10415 -12730 -8969 -3382 -5069 -4274
4683d274L376Q616L355j506L609O568k1786j8424J7916Q906j891j094K710J7283
$$ -4274 -898 7718 11073 9567 13176 19744 -2042 -20466 -2550 6356 4465 3371 6081 23364
4669B3364K269K092M34p205q739J3943p814o933r628k0702M424Q614m888p730
$$ 23364 25633 27725 28159 20954 12215 26158 18344 11411 1783 -18919 -14495 -5881 -10769 -18499
4655a8499k0116p078R454P513P294Q833l678M639O940J928q255p199K2816q87
$$ -18499 -38615 -45693 -36239 -28726 -21432 -12599 -16277 -11638 -4698 -2770 -11025 -18224 4592 3705
4641C705j2852j868M563J6338l433O878j1767K0839l613k0112k848J6287n948
$$ 3705 -9147 -11015 -6452 9886 6453 13331 1564 22403 18790 -1322 -4170 12117 6169
4628F169j8434m035Q275J0826K79M958N711Q017N004q728j0227n572j0388j85
$$ 6169 -12265 -16300 -8025 2801 3080 8038 13749 21766 26770 18042 7815 2243 -8145 -8330
4614h330K2284K391j7965P990R44j6301K0864Q651k4333j8167K2584J0589j2341
$$ -8330 13954 16345 -1620 6370 7314 -8987 11877 20528 -3805 -21972 612 11201 -1140
4601a140j2945P163J2763P083L469r740k0924k0269J824n594K0480J6113K0647
$$ -1140 -14085 -6922 5841 12924 16393 6653 -14271 -34540 -32716 -38310 -17830 -1717 18930
4588A8930J2725l876K134j2065o801J159m923m1l139K490Q999R518m888k0089
$$ 18930 31655 27779 29913 17848 11047 12206 7283 7242 4103 6593 15592 25110 20222 133
4574A33n833j82l865j0601J7261k924o418n963J772R774m602l916K7584l584k0584
$$ 133 -5700 -5882 -9747 -20348 -3087 -6011 -12429 -18392 -16620 -6846 -11448 -15364 12220 8636 -11948
4559a1948l667K163J0128J0969J1836j6593k763J1748k117O22P135q56q030r279
$$ -11948 -15615 -13452 -3324 7645 19481 2888 125 11873 9756 10378 17513 16657 8627 -652
4545f52r471R985l384k07m380P100J1090k546r214J6N780o938r572k384m892K633
$$ -652 -10123 -138 -3522 -3729 -8109 -1009 10081 7535 -1679 -1663 4117 -2821 -12393 -14777 -19669 -17036
4529a7036K0393Q674j0109K0743J6532o562J1934j1848j329P563r580j2414m531
$$ -17036 3357 12031 1922 22665 39197 32635 44569 32721 31392 38955 29375 16961 12430
4516A2430p588q775j9934o927n034J398j3489K171J7282J1249J1600R55k57q514
$$ 12430 4842 -3933 -23867 -30794 -35828 -34430 -47919 -45748 -28466 -17217 -5617 -4662 -4919 -13433
4502a3433PL547N573K454n81K851J0283p40O988L195j3615j5195J4716O52Q35
$$ -13433 -13426 -9879 -4306 -1852 -2433 418 10701 9961 16949 20144 6529 -8666 6050 6702 7537
4487G537j2269K615j0455j194M257n465k559o959j989l324R19K729O446J965K0970
$$ 7537 -4732 -2117 -12572 -13766 -9509 -14974 -17533 -24492 -26481 -29805 -28886 -26157 -19711 -17746 3224
4472C224J3686O896o917N232o834j6675k0745k426n465k126J9161K5913J918k4927
$$ 3224 16910 23806 16889 22121 15287 -1388 -22133 -24559 -30024 -32150 -12989 12924 14842 -10085
4458a0085K589J6953K326k1479r514j1806J1251N969k666J5197O47K357J0500
$$ -10085 -7496 9457 11783 -9696 -19210 -31016 -19765 -13796 -16462 -1265 -618 1739 12239
4445A2239N119j1729R525N76L590J603k191J05O052P889r111M09L024m374j4333
$$ 12239 17358 5629 15154 15730 19320 20923 18732 18837 24889 32778 23667 24076 27100 22726 8393
4430H393j4054j9364p245K545J2599o045l851J5303M757l484K848N43k554j4400
$$ 8393 -5661 -25025 -32270 -29725 -17126 -23171 -27022 -11719 -6962 -10446 -7598 -7055 -9609 -24009
4416b4009J6561J0950N67p679N811K6997j5281n613Q328l225J859J400r485K115
$$ -24009 -7448 3502 4069 -3610 2201 29198 13917 8304 16632 13407 15266 16666 7181 9296
4402I296m727o386j5416j4409J5220m435O954J4166r00P21O918M278o265R9R703
$$ 9296 4569 -1817 -17233 -31642 -16422 -20857 -13903 263 -637 84 7002 11280 5015 5114 14817
4387A4817o105J4717O920l63j3347j6204j1257j6958q060M174K1971j542q047
$$ 14817 8712 23429 30349 29986 16639 435 -10822 -27780 -35840 -31666 -9695 -11237 -19284
4374a9284M278J2310J775j0306M64J3612N944O842j0682k173j553m857O129J2481
$$ -19284 -15006 -2696 -921 -11227 -10763 2849 8793 15635 4953 2780 1227 -3630 2499 14980
4360A4980j635k472j2411k2150j1146J4268J6244K852r482j35O849K1571M720
$$ 14980 13345 10873 -1538 -23688 -34834 -20566 -4322 -1470 -10952 -11087 -4238 17333 22053
4347B2053N26O94p260j0863r510q869M241K3925P186m69j1312j380l040n250p139
$$ 22053 22579 23273 16013 5150 -4360 -13229 -8988 14937 22123 21654 10342 8962 5922 672 -6467
4332f467r235J636P062Q089O571j405j7314N53J4801J0955J2174P297j958r042
$$ -6467 -15702 -14066 -7004 1085 7656 6251 -11063 -10510 4291 15246 27420 34717 32759 23717
4318B3717J1675Q371k2233k1311J1208O035j0778l882M62n221q911J5308J2588
$$ 23717 35392 43763 21530 219 11427 17462 6684 2802 3264 -1957 -10868 4440 17028
4305A7028m036k4974r182K7364J7963j095k1360p635K083J0073r638j0512k824
$$ 17028 12992 -11982 -21164 6200 24163 23068 1708 -5927 -3844 6229 -3409 -13921 -16745
4292a6745n239K478J6974J322K68j842j483j5886Q099O816j3852J78K9173L736
$$ -16745 -21984 -19506 -2532 -1210 -942 -2784 -4267 -20153 -12054 -5238 -19090 -18912 10261 13997
4278A3997j3907K793J3861O821j3769o571J2128j6252j6629m352M712M93N068
$$ 13997 90 2883 16744 23565 9796 3225 15353 -899 -17528 -21880 -17168 -16675 -11607
4265a1607J8885k2342L176J1781J3958P884j2796o111p419j3281q732p713r7O963
$$ -11607 7278 -15064 -11888 -107 13851 21735 8939 2828 -4591 -17872 -26604 -34317 -34414 -27451
4251b7451l945M992R259K76K66J1686m935n388o397N818J1075k1651q655J7349
$$ -27451 -31396 -26404 -17145 -16869 -16603 -4917 -9852 -15240 -21637 -15819 -4744 -26395 -35050 -17701
4237a7701Q509j0361P945j872j5168j036J6795L699M019P72p153Q055J994J5624
$$ -17701 -9192 -19553 -11608 -13480 -28648 -29684 -12889 -9190 -5171 -4399 -11552 -3497 -1503 14121
4223A4121M602M031M241j2611p136r214N633K794o189p436J5104K180j2031K718
$$ 14121 18723 22754 26995 14384 7248 -1966 3667 6461 272 -7164 7940 10120 -1911 807
4209H07k3261j5842P314P587J444P827K933L778Q640r521m855K152n071J6948
$$ 807 -22454 -38296 -30982 -23395 -21951 -14124 -11191 -7413 1227 -8294 -13149 -10997 -16068 880
4195H80J7432P994p941j7339j3038J1766J240Q398K523M849p654j5025J3794r408
$$ 880 18312 26306 18365 1026 -12012 -246 994 9392 11915 16764 9110 -5915 7879 -1529
4181a529j6703R709p779j314Q841J8197K2968m116j7249O97r928J1591O636p983
$$ -1529 -18232 -8523 -16302 -17616 -8775 9422 32390 28274 11025 11722 1794 13385 20021 12038
4167A2038q72Q056n751K524L905J4720j0781o345J626L098k793j7350j1377R143
$$ 12038 11166 19222 13471 15995 19900 34620 23839 17494 19120 22218 19425 2075 -9302 -159
4153a59J2102j421j3979Q642L246J7620j3173q438j3649L591R273O309j3146k1720
$$ -159 11943 10522 -3457 5185 8431 26051 12878 4440 -9209 -5618 3655 9964 -3182 -24902
4139b4902K75L572R283l473J463o288r378K968m966Q334J9725J2781q583j0704
$$ -24902 -24627 -21055 -11772 -15245 -13782 -20070 -29448 -26480 -31446 -23112 -3387 9394 811 -9893
4125i893q565L694o360N078K531K43n221j092j876J5142P717Q86o05k4386k884
$$ -9893 -18458 -14764 -21124 -16046 -13515 -13272 -18493 -19585 -21461 -6319 1398 2284 1679 -22707 -25591
4110b5591O039Q491J1206J1556J2205O663k7025l3857k356n520J1944J3400L747
$$ -25591 -19552 -11061 145 11701 23906 30569 3544 -30313 -32669 -38189 -26245 -12845 -9098
4097i098j2827J5139J1921N362j9217N660n207o750R557K762r984M403N543R410
$$ -9098 -21925 -6786 5135 10497 -8720 -3060 -8267 -15017 -5460 -2698 -12682 -8279 -2736 6674
4083F674J4505J829r388l685j4634j4011K646j423j278J1165J0931m444n516j6123
$$ 6674 21179 23008 13620 9935 -4699 -18710 -16064 -17487 -18765 -7600 3331 -1113 -6629 -22752
4069b2752K0697K7201O037N84k0653K369J5568n903m765j0359k601j502J86o297
$$ -22752 -2055 25146 31183 31767 11114 13483 29051 23148 18383 8024 5423 3921 4107 -2190
4055b190m247J3028o812l977j1026k235n367Q448R522J0904j786L158J1995l39
$$ -2190 -6437 6591 -221 -4198 -15224 -17459 -22826 -14378 -4856 6048 4262 7420 19415 19076
4041A9076j0791q026k697j8j3959J4968J7796J1141o731n388j8848j4403l047
$$ 19076 8285 259 -2438 -2456 -16415 -1447 16349 27490 20759 15371 -3477 -17880 -20927
4028b0927J0628J5058o865o714j3328k665l84J4906R698k076O409l285q811M872
$$ -20927 -10299 4759 -2106 -8820 -22148 -24813 -25197 -10291 -593 -2669 3740 455 -8356 -3484
4014c484Q561o587K496n943j4595J4987K1032j1749J0429K206k3659j4865n954
$$ -3484 5077 -1510 986 -4957 -19552 -4565 16467 4718 15147 17353 -6306 -21171 -27125
4001b7125p766J1747K1072J425o455o056J883j069L800J8077J7837j4458j0006
$$ -27125 -34891 -23144 -2072 -647 -7102 -13158 -11275 -12344 -8544 9533 27370 12912 2906
3988B906j9343M508k103J5555R062j1487j4969P505O983L51l161K093J8401J1096
$$ 2906 -16437 -11929 -14032 1523 10585 -902 -15871 -8366 -1383 -1032 -4193 -2100 16301 27397
3974B7397m244k9698j2966J879j4940P499N907M504r595N558K2352j1991k5040
$$ 27397 23153 -6545 -19511 -17632 -32572 -25073 -19166 -14662 -24257 -18699 3653 -8338 -33378
3961c3378Q094K8273O28p63l338m060M822J3485N960n772j423j3937k103q723
$$ -33378 -25284 2989 3617 2854 -484 -4544 278 13763 19723 13951 12528 -1409 -3512 -12235
3947a2235p337n477J0440j0579J1691M115j5126K192J0943J4860O381j1930j4979
$$ -12235 -19572 -25049 -14609 -25188 -13497 -9382 -24508 -22316 -11373 3487 9868 -2062 -17041
3934a7041j2496n555O960o219L689M162Q251J3761o356q210N455r112O443J1671
$$ -17041 -29537 -35092 -28132 -34351 -30662 -26500 -18249 -4488 -10844 -19054 -13599 -22711 -16268 -4597
3920d597Q916P873k2709l296J7765q222j2563j959K2619J704q243j4616p25l69
$$ -4597 4319 12192 -10517 -13813 3952 -4270 -16833 -18792 3827 5531 -2712 -17328 -18053 -18422
3906a8422J0380K1360j1433p986o468J4076j6610R974J2217q661J1404J1560j6971
$$ -18422 -8042 13318 1885 -6101 -12569 1507 -15103 -5129 7088 -1573 9831 21391 4420
3893D420k3855j2851K396J8710J2770J1046J3627j3861m220Q885q183n640P471
$$ 4420 -19435 -32286 -29890 -11180 1590 12636 26263 12402 8182 17067 8884 3244 10715
3880A0715J7999j6057j0611k123l726o620P8J6802J0980k4417j0664P013k434
$$ 10715 28714 12657 2046 -77 -3803 -10423 -10345 6457 17437 -6980 -17644 -10631 -13065
3867a3065J3876M643l781J1423J131P695j7723j4970l491P027J200O472N337j998
$$ -13065 811 5454 1673 13096 14227 21922 4199 -10771 -14262 -7235 -6035 437 5774 3776
3853C776J6713q955k2628r405J664M492q328O242M701K393o898J8315K860N759
$$ 3776 20489 11534 -11094 -20499 -18835 -14343 -22671 -16429 -11728 -9335 -16233 2082 4942 10701
3839A0701K566j2003K871o574j2588p42p571L870Q23K1309J7528p995j0479J1056
$$ 10701 13267 1264 4135 -2439 -15027 -15769 -23340 -19470 -18647 2662 20190 12195 1716 12772
3825A2772J0067L755P816l675k0496k2027Q408Q860M274P036J4555n327j0137
$$ 12772 22839 26594 34410 30735 10239 -11788 -3380 5480 9754 16790 31345 26018 15881
3812A5881q949j028l006m09O37N319j955k8492N901K802P9K601M230l172P237
$$ 15881 6932 5904 2898 2489 3126 8445 6490 -22002 -16101 -13299 -13220 -10619 -6389 -9561 -2324
3797b324k864k201k230K165J6310R705j8169k01n347p872J1976l622l145l473
$$ -2324 -5188 -7389 -9619 -7454 8856 18561 392 191 -5156 -13028 -1052 -4674 -7819 -11292
3783a1292j239r807j0810L866J0806J1143M381j4368M714m72J2320j5256j3125
$$ -11292 -12531 -22338 -33148 -29282 -18476 -7333 -2952 -17320 -12606 -13078 -758 -16014 -29139
3770b9139l609K589K0552K2011q868j2660p442p665J1093R60k14R098L782J91
$$ -29139 -32748 -30159 -9607 12404 3536 -9124 -16566 -24231 -13138 -12178 -12392 -3294 488 679
3756F79r716n10m282M068M042j4563M345J4746j5432q076P294J2644k004l178
$$ 679 -9037 -9547 -13829 -9761 -5719 -20282 -15937 -1191 -16623 -24699 -17405 -4761 -6765 -9943
3742i943j524J1394r12Q543K16p081j543J900P829m638k2296q440p345M273K0138
$$ -9943 -11467 -73 -985 7558 7774 693 -850 1050 8879 4241 -18055 -26495 -33840 -29567 -9429
3727i429n437L550K1811r487k3131j3156P936J6596R334p143R92M484p380K7345
$$ -9429 -14866 -11316 10495 1008 -22123 -35279 -27343 -10747 -1413 -8556 -7564 -3080 -10460 16885
3713A6885K7038q521p067j793O227L799j3099j2444N019O10r262o572J588N04
$$ 16885 43923 35402 28335 26542 32769 36568 23469 11025 16044 16654 7392 820 2408 2912
3699B912j0838k281M006J1981Q097j339L42j2402j0749Q674L655J251M143J4052
$$ 2912 -7926 -10207 -6201 5780 13877 12538 12880 478 -10271 -1597 2058 3309 7452 21504
3685B1504M997r822J2729m956M921Q278l441p874j2477j3858j1609P257K1457
$$ 21504 26501 16679 29408 24452 29373 37651 34210 26336 13859 1 -11608 -4351 17106
3672A7106l037j0628j589L157l066P950j2026n888m80K56j2204l196J063K138
$$ 17106 14069 3441 1852 5009 1943 9893 -2133 -8021 -8501 -8245 -20449 -23645 -22582 -20444
3658b0444J3325m084n59J3468j7099k114N989n284j6293j749k781l103Q674R024
$$ -20444 -7119 -11203 -11762 1706 -15393 -17507 -11518 -16802 -33095 -34844 -37625 -40728 -32054 -23030
3644b3030O607M51J3601j2221j0431L021K2651N795J0529l557j6173k993O457
$$ -23030 -16423 -15972 -2371 -14592 -25023 -22002 649 6444 16973 13416 -2757 -5750 707
3631G07J459o336N024J9689r371r36m19j1194j5417p418J3170J580r34J439K5197
$$ 707 2166 -4170 854 20543 11172 10236 9817 -1377 -16794 -24212 -11042 -9462 -10396 -8957 16240
3616A6240m325j316j6343Q758J2644o99r624O436M46j7802J0294J3969J7064j1169
$$ 16240 11915 10599 -5744 3014 15658 14959 5335 11771 12217 -5585 4709 18678 35742 24573
3602B4573q055M49j5180j6470k4944j1700K45J3530J2241j190O573p781q099j3655
$$ 24573 16518 16967 1787 -14683 -39627 -51327 -51082 -37552 -25311 -26501 -19928 -27709 -35808 -49463
3588d9463K5234K6891n73Q642R68L302k1326j8692N100J9261J420R627N65o79
$$ -49463 -24229 2662 2089 10731 11699 15001 -6325 -25017 -19917 -656 764 10391 10956 10277
3574A0277j2695K944q101m182P724j557K226j962j5150l537J289P058M452j0173
$$ 10277 -2418 526 -7575 -11757 -4033 -5590 -3364 -5326 -20476 -24013 -22724 -15666 -11214 -21387
3560b1387p799r127R939J7806J0795p694R283K2476m412j5393m668J030q069K3001
$$ -21387 -29186 -38313 -28374 -10568 227 -7467 1816 24292 19880 4487 -181 849 -7220 15781
3546A5781K985o037J0654k891j4696K457Q180L76o380o163l302p244m16L226J565
$$ 15781 18766 12729 23383 20492 5796 8253 16433 16809 10429 4266 964 -6280 -6696 -3470 -1905
3531a905j6818q072J2170K0580j331p212k272L297n505O942k210K634j3151p817
$$ -1905 -18723 -26795 -14625 5955 4624 -2588 -4860 -1563 -7068 -126 -2336 298 -12853 -20670
3517b0670J2576n325J711K2455l141k821o405j3746Q124J3346r633P574p750J3029
$$ -20670 -8094 -13419 -11708 10747 7606 4785 -1620 -15366 -7242 6104 -3529 4045 -3705 9324
3503I324J3926q416m088j2327j150m025j1677j6189J2806Q867l205R781J6054
$$ 9324 23250 14834 10746 -1581 -2731 -6756 -18433 -34622 -21816 -12949 -16154 -6373 9681
3490I681j1783j7975o048j7885j3798L884J6678J2105J3289J4419K5713o515j157
$$ 9681 -2102 -20077 -26125 -44010 -57808 -53924 -37246 -25141 -11852 2567 28280 21765 20608
3477B0608J18q535Q44o190j3738K127Q386J0463J5003J3943j094j6080n503k756
$$ 20608 20726 12191 13035 6845 -6893 -4766 3620 14083 29086 43029 41935 25855 20352 17596
3463A7596j2269o159J1529o241O83m055Q093J1223j643Q673N030J519j3989k1641
$$ 17596 5327 -832 10697 4456 5139 1084 9177 20400 18757 27430 32460 33979 19990 -1651
3449a651Q446K4599k224q955l3672k1211J3061J7031P474M439m212l003p652J6552
$$ -1651 6795 31394 29170 20215 -13457 -34668 -21607 -4576 2898 7337 3125 122 -7530 9022
3435I022J428J282m073R320j15K409n570j1643j5342o824J2404m567j6348O722
$$ 9022 10450 11732 7659 16979 16864 19273 13703 2060 -13282 -20106 -7702 -12269 -28617 -21895
3421b1895P025Q511j5748k2956M322J5225k947m631Q589M958P359L247r978j257
$$ -21895 -14870 -6359 -22107 -45063 -40741 -25516 -28463 -33094 -24505 -19547 -12188 -8941 -18919 -20176
3407b0176K3899L3065k627k0113o098k670j559O703r776o733K455n3K48J1329
$$ -20176 3723 36788 34161 14048 7950 5280 3721 10424 648 -6085 -3630 -3683 -3435 7894
3393G894J263M160J2757j1815k1927K85J373O526o56j177M335J2487P295j3591
$$ 7894 9157 13317 26074 14259 -7668 -7383 -6010 516 -140 -1317 3018 15505 22800 9209
3379I209n716R939j9705j0162j9106j0486K0038K9987l382R9q893l123O239k583
$$ 9209 3493 13432 -6273 -16435 -35541 -46027 -25989 3998 616 715 -8178 -11301 -5062 -7645
3365g645r279k222Q113J7871r217j5620j0188J7194K5056n840J4258o798j4350
$$ -7645 -16924 -19146 -11033 6838 -2379 -17999 -28187 -10993 14063 8223 22481 15683 1333
3352A333j1263r125O315K4532J2990n890k97j0820k700k765j427N343J818j8666
$$ 1333 -9930 -19055 -12740 11792 24782 18892 18595 7775 5075 2310 883 6226 8044 -10622
3338a0622q755J6981K4372J2943n981O530k2027q205J9816j693m294j9127l216
$$ -10622 -19377 -2396 21976 34919 28938 35468 13441 5236 25052 23359 19065 -62 -3278
3325c278P213P990J7896n390j2313K08j0114j987m903O076J0113J6497l610k5706
$$ -3278 3935 11925 29821 24431 12118 12326 2212 225 -4678 1398 11511 28008 24398 -1308
3311a308k4523J2586O333J66N445k191N520M485p041j6477p236r248N587J4632
$$ -1308 -25831 -13245 -6912 -6746 -1301 -3492 2028 6513 -528 -17005 -24241 -33489 -27902 -13270
3297a3270K1777R331J4453N095j5769m701k168q191l460J7087M613l421n980j4394
$$ -13270 8507 17838 32291 37386 21617 16916 14748 6557 3097 20184 24797 21376 15396 1002
3283A002o694Q376J6283j7472j7155K2219M006m521o948n656J008Q04J4257J1874
$$ 1002 -5692 2684 18967 1495 -15660 6559 10565 6044 -904 -6560 -5552 -4748 9509 21383
3269B1383m090j7916j1502Q610k668M784O788j0291O44K2268J604j5407m730K0087
$$ 21383 17293 -623 -12125 -3515 -6183 -1399 5389 -4902 -4258 18010 19614 4207 -523 19564
3255A9564K054o524l870j1440j721q592K593j608p916o949j9240p915K466K2384
$$ 19564 21618 15094 11224 -216 -1937 -10529 -7936 -9544 -17460 -24409 -43649 -51564 -49098 -26714
3241b6714K2569K5706j0911p315m313J2774j2387j2388p77J6330J2295J731p755
$$ -26714 -4145 21561 10650 3335 -978 11796 -591 -12979 -13756 2574 14869 16600 8845
3228H845q058L490O315j1639k617R098l383j7433l476L136o829J0521j3649j0696
$$ 8845 787 4277 10592 -1047 -3664 5434 2051 -15382 -18858 -15722 -22551 -12030 -25679 -36375
3214c6375l314j280Q224R797J314M237m832L044O137O686Q780J8846J2088j4489
$$ -36375 -39689 -40969 -32745 -22948 -21634 -17397 -22229 -19185 -13048 -6362 2418 21264 33352 18863
3200A8863j3045J0565Q627p310m361j1985J012R651j6988J3731L1313o993j6152
$$ 18863 5818 16383 25010 17700 13339 1354 2366 12017 -4971 8760 40073 33080 16928
3187A6928p659L580o882j5259L227L0094J452k4395r066K688o252O05L821r668
$$ 16928 9269 12849 5967 -9292 -6065 24029 25481 1086 -7980 -5292 -11544 -10939 -7118 -16786
3173a6786j438j0321l250J3703k54l270R639J998J114m328J979J522m711Q924
$$ -16786 -18224 -28545 -31795 -18092 -18346 -21616 -11977 -9979 -8865 -13193 -11214 -9692 -14403 -5479
3159e479m323q028r72K862p391j6264N487J8495Q813p196J190q155P772K7884
$$ -5479 -9802 -17830 -18802 -15940 -23331 -39595 -34108 -15613 -6800 -13996 -12806 -20961 -13189 14695
3145A4695J7681r284j9399k088K541r156J435j9543J3084K5374R96q084j2333
$$ 14695 32376 23092 3693 1605 4146 -5010 -3575 -23118 -10034 15340 16336 8252 -4081
3132d081j4495L374J8867R717m302j2162J1204L732n979j8490j4824M591J4632
$$ -4081 -18576 -15202 3665 13382 9080 -3082 8122 11854 5875 -12615 -27439 -22848 -8216
3119h216r93j4536j162J3488J9286M242j563j1698k038q096O875n905j978p382
$$ -8216 -9209 -23745 -24907 -11419 7867 12109 10546 -1152 -3190 -11286 -4411 -10316 -12294 -19676
3105a9676O451J4597J0530n849R025k312N990J441J1564j0049K292o401j6489
$$ -19676 -13225 1372 11902 6053 15078 12766 18756 20197 31761 21712 24004 17603 1114
3092A114j1569Q524J3222M599j356J856p232N870N495J016J043J243M323L988
$$ 1114 -10455 -1931 11291 15890 14534 16390 9158 15028 20523 21539 22582 23825 28148 32136
3078C2136p421m644n088L161J9875j289j3716K345q830p220L820j0323o724N24
$$ 32136 24715 20071 14983 18144 38019 36730 23014 25359 16529 9309 13129 2806 -3918 -3394
3064c394m028P254j0525j3339k87L262q450L629K37N230J2423k297j232m02j2920
$$ -3394 -7422 -168 -10693 -24032 -24319 -21057 -29507 -25878 -25641 -20411 -7988 -10285 -11517 -11919 -24839
3049b4839L436R476K6606L889l3745j3212r23n435p446J9396J4083Q857j779N541
$$ -24839 -21403 -11927 14679 18568 -15177 -28389 -29312 -34747 -42193 -22797 -8714 143 -1636 3905
3035C905j710j0071n64L773R282L529l102n003N077J053j813p507q965O546L0848
$$ 3905 2195 -7876 -8440 -4667 4615 8144 5042 39 5116 6169 4356 -3151 -12116 -5570 25278
3020B5278R415j6340j9512m671K666L140k8016R783J495J38o100M548J1582L2159
$$ 25278 34693 18353 -1159 -5830 -3164 -24 -28040 -18257 -16762 -16624 -22724 -18176 -6594 25565
3006B5565L458j9575o84Q668j1614j2101l174P672J0298k2067j1742P250k796
$$ 25565 29023 9448 8764 17432 5818 -6283 -9457 -1785 8513 -13554 -25296 -18046 -20842
2993b0842r436N330j265l179j49J5890J473p656Q967J2213k930k2125l33P442
$$ -20842 -30278 -24948 -26213 -29392 -29541 -13651 -12178 -19834 -10867 1346 -1584 -23709 -24042 -16600
2979a6600J4651N174o301j1399n497J1615j396J605Q756J6542q579j3623l444
$$ -16600 -1949 3225 -3076 -14475 -19972 -8357 -9753 -8148 608 17150 8571 -5052 -8496
2966h496l326j479Q500P468j7396r617L994K618K810P150K253J3712j647p63j2013
$$ -8496 -11822 -13301 -4801 2667 -14729 -24346 -20352 -17734 -14924 -7774 -5521 8191 6544 5781 -6232
2951f232M558J0312j3555r446J4587J4752K572J1355L383j7317r044j7165j3185
$$ -6232 -1674 8638 -4917 -14363 224 14976 17548 28903 32286 14969 5925 -11240 -24425
2938b4425J021O526k547K1198J2938q250k1791m102j999K793Q62k1564J0901K7322
$$ -24425 -23404 -16878 -19425 1773 14711 6461 -15330 -19432 -21431 -18638 -17776 -39340 -28439 -1117
2924a117l682q192L30P565m048L635J01j2709K329L598J3816J1625K696N359l509
$$ -1117 -4799 -12991 -12661 -5096 -9144 -5509 -5408 -18117 -15788 -12190 1626 13251 15947 21306 17797
2909A7797j0228p668o040K1409J1971o234k170N800R223M458j4422j8593L388
$$ 17797 7569 -99 -6139 15270 27241 21007 18837 24637 33860 38318 23896 5303 8691
2896H691J1674m593j3869P644M683n075P578K656l670r353O996k5952k2545M297
$$ 8691 20365 15772 1903 9547 14230 9155 16733 19389 15719 6366 13362 -12590 -35135 -30838
2882c0838R29M502K765J6692R090K3738j4105p932n64k0573k2062O683J2524j1404
$$ -30838 -29909 -25407 -22642 -5950 3140 26878 12773 4841 4277 -16296 -38358 -31675 -19151 -30555
$$ [...]
##END NTUPLES=NMR SPECTRUM
##END=
