##TITLE=Analysis number 315335
Compound Code cc 31911
Book Reference 441/173
Project Code adrs
Chemist Name colinb
##JCAMPDX= 6.0         $$ Bruker NMR JCAMP-DX V2.0
##DATA TYPE= NMR SPECTRUM
##DATA CLASS= NTUPLES
##ORIGIN= Bruker BioSpin GmbH
##OWNER= NMR
$$ XWIN-NMR		Version 3.5
$$ Tue Nov 15 11:31:19 2005 GMT Standard Time (UT+0h)  MAYBRIDGE\NMR@NMR_250MHZ
##.OBSERVE FREQUENCY= 250.131544655141
##.OBSERVE NUCLEUS= ^1H
##.ACQUISITION MODE= SIMULTANEOUS (DQD)
##.ACQUISITION SCHEME= undefined
##.AVERAGES= 16
##.DIGITISER RES= 18
##SPECTROMETER/DATA SYSTEM= dpx250
##.PULSE SEQUENCE= zg30
##.SOLVENT NAME= CDCl3
##.SHIFT REFERENCE= (INTERNAL, CDCl3, 0, 16.4569)
##AUDIT TRAIL= $$ (NUMBER, WHEN, WHO, WHERE, WHAT)
$$ ##TITLE= Audit trail, XWIN-NMR		Version 3.5
$$ ##JCAMPDX= 5.01
$$ ##ORIGIN= Bruker BioSpin GmbH
$$ ##OWNER= NMR
$$ C:\u/data/dgb/nmr/ADRS/12400/pdata/1/auditp.txt
$$ ##AUDIT TRAIL=  $$ (NUMBER, WHEN, WHO, WHERE, WHAT)
(   1,<2005-11-15 11:30:49.34 +000>,<MAYBRIDGE\NMR>,<NMR_250MHZ>,
      <created by zg, POWCHK disabled, PULCHK disabled
       configuration hash MD5:
       62 19 C7 07 E1 42 D1 B7 37 6C 3D D0 77 39 F9 E6
       data hash MD5: 64K
       4B C5 EA 8C C6 06 83 09 53 52 71 BB 56 C2 F1 DE>)
(   2,<2005-11-15 11:31:05.65 +000>,<MAYBRIDGE\NMR>,<NMR_250MHZ>,
      <Start of raw data processing
       ef LB = 0.3 FT_mod = 6 PKNL = 1 SI = 32K 
       data hash MD5: 32K
       AD 4F E6 DC 2C DC 2F 69 CD 75 64 37 53 0F D5 AF>)
(   3,<2005-11-15 11:31:08.21 +000>,<MAYBRIDGE\NMR>,<NMR_250MHZ>,
      <apk 
       data hash MD5: 32K
       10 00 EE DD 4E 9C 44 59 10 F5 48 79 CE C2 81 9F>)
(   4,<2005-11-15 11:31:08.96 +000>,<MAYBRIDGE\NMR>,<NMR_250MHZ>,
      <abs ABSG = 5 
       data hash MD5: 32K
       BD EE D7 2C 64 A7 7A 80 93 CB E9 30 E5 5F 84 9E>)
$$ ##END=
$$ 
$$ hash MD5
$$ D6 96 C9 EB 46 AA 1E D3 D8 C4 F9 42 CF 95 3B A8
##$RELAX= 
##$RELAX= 
##$RELAX= 
##$RELAX= 
##$RELAX= 
##$RELAX= 
##$RELAX= 
$$ Bruker specific parameters
$$ --------------------------
##$DU= <C:\u>
##$EXPNO= 12400
##$NAME= <ADRS>
##$PROCNO= 1
##$TYPE= <nmr>
##$USER= <dgb>
##$AMP= (0..31)
100 100 100 100 100 100 100 100 100 100 100 100 100 100 100 100 100 100 
100 100 100 100 100 100 100 100 100 100 100 100 100 100 
##$AQSEQ= 0
##$AQ_mod= 3
##$AUNM= <au_zg>
##$AUTOPOS= <23 >
##$BF1= 250.13
##$BF2= 250.13
##$BF3= 250.13
##$BF4= 250.13
##$BF5= 500.13
##$BF6= 500.13
##$BF7= 500.13
##$BF8= 500.13
##$BYTORDA= 1
##$CFDGTYP= 0
##$CFRGTYP= 5
##$CHEMSTR= <none>
##$CNST= (0..31)
1 1 145 1 1 1 1 1 1 1 1 1 1 1 1 1 1 1 1 1 1 1 1 1 1 1 1 1 1 1 1 1 
##$CPDPRG= <>
##$CPDPRG1= <>
##$CPDPRG2= <>
##$CPDPRG3= <>
##$CPDPRG4= <mlev>
##$CPDPRG5= <mlev>
##$CPDPRG6= <mlev>
##$CPDPRG7= <mlev>
##$CPDPRG8= <mlev>
##$CPDPRGB= <>
##$CPDPRGT= <>
##$D= (0..31)
0 1 0 0 0 0 0 0 0 0.06 0 0 0 0 0 0 0.0002 0 0 0 0 0 0 0 0 0 0 0 0 0 0 
0 
##$DATE= 1132054247
##$DBL= (0..7)
120 120 120 120 120 120 120 120 
##$DBP= (0..7)
150 150 150 150 150 150 150 150 
##$DBP07= 0
##$DBPNAM0= <>
##$DBPNAM1= <>
$$ [...]
##$SUBNAM7= <"">
##$SUBNAM8= <"">
##$SUBNAM9= <"">
##$SW= 20.6930455092707
##$SWIBOX= (0..15)
0 0 3 0 0 0 0 0 0 0 0 0 0 0 0 0 
##$SW_h= 5175.983436853
##$TD= 65536
##$TD0= 1
##$TE= 295.16
##$TE2= 300
##$TE3= 300
##$TEG= 300
##$TL= (0..7)
0 120 120 120 120 120 120 120 
##$TP= (0..7)
150 150 150 150 150 150 150 150 
##$TP07= 0
##$TPNAME0= <>
##$TPNAME1= <>
##$TPNAME2= <>
##$TPNAME3= <>
##$TPNAME4= <>
##$TPNAME5= <>
##$TPNAME6= <>
##$TPNAME7= <>
##$TPOAL= (0..7)
0.5 0.5 0.5 0.5 0.5 0.5 0.5 0.5 
##$TPOFFS= (0..7)
0 0 0 0 0 0 0 0 
##$TUNHIN= 0
##$TUNHOUT= 0
##$TUNXOUT= 0
##$USERA1= <user>
##$USERA2= <user>
##$USERA3= <user>
##$USERA4= <user>
##$USERA5= <user>
##$V9= 5
##$VALIST= <valist>
##$VCLIST= <CCCCCCCCCCCCCCC>
##$VD= 0
##$VDLIST= <DDDDDDDDDDDDDDD>
##$VPLIST= <PPPPPPPPPPPPPPP>
##$VTLIST= <TTTTTTTTTTTTTTT>
##$WBST= 1024
##$WBSW= 4
##$XGAIN= (0..3)
0 0 0 0 
##$XL= 0
##$YL= 0
##$YMAX_a= 598064
##$YMIN_a= -589215
##$ZGOPTNS= <>
##$ZL1= 120
##$ZL2= 120
##$ZL3= 120
##$ZL4= 120
##$ABSF1= 16.45692
##$ABSF2= -4.236252
##$ABSG= 5
##$ABSL= 3
##$ALPHA= 0
##$AQORDER= 0
##$ASSFAC= 0
##$ASSFACI= 0
##$ASSFACX= 0
##$ASSWID= 0
##$AUNMP= <proc_1d>
##$AZFE= 0.1
##$AZFW= 0.1
##$BCFW= 0
##$BC_mod= 0
##$BYTORDP= 0
##$COROFFS= 0
##$CY= 12.5
##$DATMOD= 1
##$DC= 0
##$DFILT= <>
##$DTYPP= 0
##$F1P= 14.0000005364418
##$F2P= -0.99999901652339
##$FCOR= 0.5
##$FTSIZE= 32768
##$FT_mod= 6
##$GAMMA= 0
##$GB= 0
##$INTBC= 1
##$INTSCL= 1
##$ISEN= 128
##$LB= 0.3
##$LEV0= 0
##$LPBIN= 0
##$MAXI= 10000
##$MC2= 0
##$MEAN= 0
##$ME_mod= 0
##$MI= 0
##$NCOEF= 0
##$NC_proc= -2
##$NLEV= 6
##$NOISF1= 0
##$NOISF2= 0
##$NSP= 0
##$NTH_PI= 0
##$NZP= 0
##$OFFSET= 16.45692
##$PC= 1
##$PHC0= 92.76439
##$PHC1= -15.09767
##$PH_mod= 1
##$PKNL= yes
##$PPARMOD= 0
##$PSCAL= 4
##$PSIGN= 0
##$REVERSE= no
##$SF= 250.130016275934
##$SI= 32768
##$SIGF1= 0
##$SIGF2= 0
##$SINO= 400
##$SIOLD= 32768
##$SREGLST= <1H.CDCl3>
##$SSB= 0
##$STSI= 32768
##$STSR= 0
##$SW_p= 5175.98343685301
##$SYMM= 0
##$S_DEV= 0
##$TDeff= 65536
##$TDoff= 0
##$TI= <Analysis number 999999
Compound Code 99
Book Reference 9
Project Code 9>
##$TILT= no
##$TM1= 0
##$TM2= 0
##$TOPLEV= 0
##$USERP1= <user>
##$USERP2= <user>
##$USERP3= <user>
##$USERP4= <user>
##$USERP5= <user>
##$WDW= 1
##$XDIM= 32768
##$YMAX_p= 543574658
##$YMIN_p= -143915
$$ End of Bruker specific parameters
$$ ---------------------------------
##NTUPLES= NMR SPECTRUM
##VAR_NAME=  FREQUENCY,     SPECTRUM/REAL,   SPECTRUM/IMAG
##SYMBOL=    X,             R,               I
##VAR_TYPE=  INDEPENDENT,   DEPENDENT,       DEPENDENT
##VAR_FORM=  AFFN,          ASDF,            ASDF
##VAR_DIM=   32768,         32768,           32768
##UNITS=     HZ,            ARBITRARY UNITS, ARBITRARY UNITS
##FACTOR=    0.157963299565203, 1,           1
##FIRST=     4116.36982347767, 0,            0
##LAST=      -1059.61361337534, 0,           0
##MIN=       -1059.61361337534, -143915,     0
##MAX=       4116.36982347767, 543574658,    0
$$ Real data points
##PAGE= N=1
##DATA TABLE= (X++(R..R)), XYDATA
$$ [...]
15471A3771m552q760n330M840P36p778m426p405O59j1715N669J5380R197J0199
15457A0485o864m731o02k448O329m715m56Q402L52m406L32q498M178m055m763
15442a1460J0158J5594j0529j134j1053N032j270Q29J7538p316j2531j0637K773
15429a4006J3450Q10P291j0349m009J0816J7982J2679l118j3308q351K1557M84
15416C1928k469N052k822q089j1254j28R611J515j2038q241n875J4410m433M517
15402A1684J1568k6027j0728R327l225M327J5840j817N40K187j960n027n818r571
15388h700M408J3165q805o517P533Q780J8334m457L591q765j4323j0102n499j1421
15374b2778J026N174N854k12m942Q672K287J4179J7840o179j5430K73R255r810
$$ y = [13771, 9219, 459, -4871, -31, 705, -7073, -11499, -18904, -18245, -29960, -24291, -8911, 286, 10485, 3621, -1110, -1712, -4160, 2169, -2546, -3002, 5400, 5752, 1346, 1678, -6820, -2642, -6697, -11460, -1302, 14292, 3763, 2629, -8424, -3392, -4662, -3833, 13705, 6389, -6142, -16779, -14006, -556, 254, 7545, -2804, -6813, 4003, 21985, 34664, 31546, 18238, 9887, 31444, 31928, 29459, 34511, 31689, 23600, 12346, 12218, 21829, 23344, 11306, 3065, -2810, 11600, 7167, 11684, 23252, -2775, -13503, -4176, -7401, -3074, 12766, 10949, 11489, 13676, 11716, 6689, 871, -8700, -4292, 8873, 68, -6449, 1084, 9864, 28198, 23741, 27332, 18567, 4244, -5858, -11357, -22778, -21752, -16578, -10724, -10936, -15878, -7206, -4919, 9260, 27100, 20921, 5491, 5764, 15019, 5209]
15360E209p818k349P596P69j0501m357l623l293m387R711J0277j768j3438J5138
15346b834J7474q911j5214Q397j565q835j447O483Q789j2973J8711J0068p415
15333A0728m308n087n437P83O857K0118R034r781j1571r076j0712N244J0523J0315
15319A7630Q579J5759m800j4919j6534j6710o869K081K68o033n90N658J7023j2414
15305a1871n359M895O703N123j8119r527L836K4984J0552j1882m724R073J677
15292E361O191j950m025j3520j4278K796P391O438M863Q82M190k193q505j1811
15278a8170m131M014J9405J7097o788l0571K483K674l575M510J3587J2608r32
15265A2211K568R837k223j6706m841P059P393j0042o730R046L136k2885J0823
$$ y = [5209, -2609, -4958, 2638, 3407, -7094, -11451, -15074, -18367, -22754, -13043, -2766, -4534, -17972, -2834, 14640, 5729, -9485, -1088, -2653, -11488, -12935, -6452, 2337, -10636, 8075, 18143, 10728, 6420, 1333, -4104, -3321, 3536, 23654, 32688, 22907, 11336, 2260, -8452, -3208, 7315, 17630, 26209, 41968, 37168, 22249, 5715, -10995, -17864, -15783, -15515, -21548, -22138, -16480, 543, -11871, -17230, -12335, -5632, -509, -18628, -28155, -24319, 665, 11217, -665, -5389, 3684, 5361, 11552, 9602, 5577, -7943, -22221, -19425, -12034, -5596, -733, 149, 4339, 2146, -6359, -18170, -22301, -18287, 1118, 18215, 11427, -19144, -16661, -13987, -17562, -13052, 535, 13143, 12211, 14779, 24616, 22393, 5687, 846, 7905, 15298, 5256, -1474, 7572, 10708, -12177, -1354]
15252a354J7539j4596j5427J6865M334J217j49J885r664r629q972k865Q096O609
15238f111J253Q161J982j5660n321J5669Q719j0799K978J0424J0616M619j8890
15225G640l607J222N523j322j235n617j3795J582Q996K13N820j1527J0027k257
15211A663N716L862o054l881Q156O366N034l397o336j0364N59J8987R81j7999
15197C293j0127o592m91n007J5087N607r549q304l34M490J5575K692J2825j0459
15183H706r006J895O504l594j101l185j040P26o123q42P574j066K73O326J1178
15168A7225o888O687j3336n254J4425k315l638m712o012n755n797m567M216N02
15154a5219k90K911M962P138J2014Q625l19j1884m589j0332j604k054J1060n368
$$ y = [-1354, 16185, 1589, -13838, 3027, 7361, 8578, 8429, 10314, 650, -8979, -17951, -20816, -12720, -6111, -4858, 3303, 5285, -10375, -15696, -27, 8692, -2107, 871, 11295, 21911, 26530, 7640, 4033, 5255, 10778, 9456, 8221, 2604, -11191, -9609, -613, -400, 5420, -6107, 3920, 1663, 7379, 11241, 5187, 1306, 9462, 15828, 20862, 17465, 11129, 765, 1324, 20311, 21292, 3293, -6834, -13426, -13917, -18924, -3837, 1770, -7779, -16083, -16417, -11927, 3648, 6340, 19165, 8706, -300, 1595, 8099, 4505, 3404, 219, -821, -95, -6218, -7060, 514, -552, -279, 6047, 17225, 10337, 17024, 3688, -1566, 12859, 10544, 6906, 2194, -3818, -9573, -15370, -19937, -15721, -15219, -15509, -12598, -7636, -498, 11516, 20141, 19822, 7938, 3349, -6983, -8587, -10641, 419, -4949]
15140d949m046P023K755R36J053n538r015m772Q800N675K779J714l420N224M085
15125H304J0995q67r462k627J1524L437K765j739L405n677j0705k656M6N560j6722
15110d419n658j342n524J3679L315m229K463k031q295j317O175N960p46m85J757
15095f97n239K564p729m519O845J1448J4944K500n318j9312K570p8O733J0256
15081A4968K971k679r446K84J0553j1288p990R773J5854j1690Q006l028J59k282
15067A4165j1379k930o139R445k182j0195r37l568L696p50n437j608J9896K777
15053D854J2056O458j2301q168n319l916N202n673p122J6979m949J934J5267J3739
15039B9041R568o21j7119j1841L488l907L43J2613j018k7353j1791j4810L114
$$ y = [-4949, -8995, -1972, 783, 1719, 2772, -2766, -11781, -16553, -7753, -2078, 701, 2415, -1005, 4219, 8304, 19299, 18432, 8970, 6343, 17867, 21304, 24069, 22330, 25735, 20058, 9353, 6697, 6743, 12303, -4419, -10077, -11419, -16943, -3264, 51, -4178, -1715, -3746, -12041, -13358, -7183, -1223, -1969, -2454, -697, -5936, -3372, -11101, -15620, -8775, 2673, 17617, 20117, 14799, -4513, -1943, -2021, 4712, 14968, 17939, 15260, 5814, 6098, 16651, 5363, -2627, 7146, 23000, 11310, 19316, 16288, 16447, 14165, 2786, -144, -6283, 3162, 980, -9215, -10152, -13720, -10024, -10774, -16211, -17819, 2077, 4854, 16910, 23368, 11067, 2899, -2420, -6336, -1134, -6807, -13929, 3050, -1899, 35, 15302, 29041, 38609, 37988, 20869, 9028, 12516, 8609, 8952, 21565, 20547, -6806, -18597, -33407, -30293]
15026c0293J5202Q983N477p992r780P064Q775J567J3629O763r184J1787K450j0488
15012A3960o189J0909J038J6028L591j3169j6939N96r324p829J3179O289j714
14999A0426o724q856q420N228j954j0502O596O132j428J9190J1402R645n09j1339
14985A8887j9026r977M942K213M374j0834p729K633J4487p36q594j0534P110K402
14971a0382k220q586j394J98J4913J9450J0478j8682j9891j0374P961N412p063
14958b0180J2554k322O424r934m396q906M34q234J4742J1934J3726K143N955j3826
14944A14p737J27r788J71j431m570l450Q577N938R927P438P026q696r417M79L329
14928a963K0745j3070j9461k946K405L646j169J8635K134R697O264K965K848j1040
$$ y = [-30293, -15091, -6108, -631, -8623, -18403, -11339, -2564, -997, 12632, 19395, 10211, 21998, 24448, 13960, 7771, 18680, 19718, 35746, 39337, 26168, 9229, 9825, 501, -7328, 5851, 12140, 10426, 3702, -5154, -13574, -8346, -10300, -20802, -14206, -8074, -9502, 9688, 21090, 30735, 30226, 18887, -139, -10116, -5174, -2961, 1413, -9421, -17150, -14517, -30, -766, -9360, -19894, -12784, -10382, -12602, -21188, -22582, -22384, -7471, 11979, 22457, 3775, -16116, -26490, -18529, -13117, -20180, -7626, -9948, -3524, -13458, -17854, -26760, -26326, -34560, -19818, -7884, 5842, 7985, 13940, 114, -7623, -7496, -17284, -17113, -18544, -23114, -26564, -17987, -12049, -2122, 5316, 12342, 3646, -5771, -5292, -1963, 18782, 5712, -13749, -16695, -14290, -10644, -11813, 6822, 8956, 18653, 24917, 27882, 30730, 19690]
14914A9690J450o888k1208j1001J9144R476n961o630L690l56l355N091M309p611
14900a60j5642j072P510P760J0667k385j811L299k1020j1845N180K065j0416P063
14886b0807K345j376J0587N899M557n864J09L874M630K476j0665j2750N544Q897
14872b544O718o042n866J3616K003l385N970K623j5194j6237l792J436O333k22
14858a4583M511Q773p488M049J4520L375q15J806Q611j7391k0122j4220o103J397
14844c3680J8589J3432J269k919J5259J1108r177q582j9986j5700J1453j935J594
14831a9275K8451R459n849k0117n77n394K825J3097M007m34m547j278r004Q749
14817A13J4446J775j5940j0579M775J3473J1330q541j7579q64k202j596m76R056
$$ y = [19690, 21140, 14252, -6956, -17957, 1187, 10663, 4702, -1928, 1762, 1406, -1949, 3142, 7451, -160, -15802, -16874, -9364, -1604, 9063, 6678, 4867, 8166, -12854, -24699, -19519, -17454, -27870, -20807, -18462, -19838, -9251, -3352, 1205, -4659, -4550, -676, 3954, 6430, -4235, -16985, -11441, -2544, 4174, -1868, -7734, 5882, 7885, 4500, 10470, 13093, -2101, -18338, -22130, -20694, -14361, -14583, -10072, -1299, -8787, -4738, 9782, 13157, 12342, 14148, 22759, 5368, -14754, -28974, -35077, -33680, -15091, -1659, -390, -3309, 11950, 23058, 13881, 5299, -14687, -30387, -18934, -20869, -19275, 9176, 18635, 12786, -7331, -7908, -13302, -10477, 2620, 6627, 6193, 1646, 368, -8636, 113, 14559, 16334, 394, -10185, -5410, 8063, 19393, 10852, -6727, -7591, -9793, -11389, -11865, -2809]
14803b809J919N073N774n149K514J4109q660k0196P972J843j7288k566J8180J7963
14789A8679j2855p885N954k917j4704o031J1182M205K805j1476m646R11o832J1174
14775a2436k714J064J972O821N445k258q461l936p39L842J065j4457J5568p52
14761i976r106O185N15k538N919L737O543r654n917M245O263J4538j197P834O884
14746B4275k441N204o057m208j4834j2697J0648P446n322N59j0308m74J4315q402
14732b296m300k350J2212O417M81J1408P648L527J005j2947l703Q656J437q053
14718A9142r195j3729m850O961J0346n817j1008j0107r90J4887N630k302n003
14705f035O047k274o593K982J789k1688N312R596N156J03p673o51q761q424l09
$$ y = [-2809, -890, 4183, 9957, 4808, 7322, 21431, 12771, -7425, 547, 2390, -14898, -17464, 716, 18679, 5824, -2061, 3893, 976, -13728, -19759, -8577, -4372, -1567, -13043, -17689, -16778, -23610, -12436, -15150, -14086, -12114, -5293, 152, -2106, -10567, -14503, -15242, -11400, -10335, -24792, -9224, -9976, -19082, -12897, -12382, -14920, -9001, -5264, 1279, -8375, -14292, -10047, -3784, 10754, 9557, 17391, 24275, 21834, 27038, 20981, 16773, 1939, -10758, -110, 7336, 2014, 2573, -7735, -8209, 6106, -2296, -6596, -8946, 3266, 9683, 10164, 21572, 29220, 32747, 33752, 20805, 17102, 25758, 27195, 19142, 9947, -3782, -8632, -1671, 8675, 2858, -8150, -18257, -19247, -4360, 1270, -1032, -6035, 12, -2262, -8855, -5873, -4084, -25772, -20460, -10864, -5708, -5605, -13278, -13929, -22690, -31114, -31423]
14690c1423O849R700O286P483J0300J1790m569j8642K402J6707k803j3376L84
14677A088R285j914K886q282n57K318M401m326L198q932l628l865R224J3095o716
14662G275j2441q028J1777K2792n061p496r457j7336J1901P569O23j0576j0673
14649a9131j2902M929P986P372p43N869j049J813J603q123q78j51Q895L499P639
14634F628N414J3829q170q526M764q20Q15k681j5640j4772k697J1574L343j9260
14620b6199n315R397J216N114K0761J966l106O599P11j2052o151Q112q256L971
14606c232k216O75R005Q938q726q754j993M37J4806l098m492j503k671l970n952
14591a2746l303K81m414n686n251L939J4200Q67M671j327J6257K0177J41j7158
$$ y = [-31423, -24574, -14874, -8588, -1105, 9195, 20985, 16416, -2226, 176, 16883, 14080, 704, 1088, 10373, 8459, 11345, 3063, 2506, 4824, 9225, 4899, 8097, -835, -4463, -8328, 896, 13991, 7275, -5166, -13194, -1417, 21375, 16314, 8818, -639, -17975, -6074, 1495, 2118, -8458, -19131, -32033, -27104, -19118, -11746, -12489, -6620, -7669, -5856, -4253, -12376, -13254, -13405, -4510, -1011, 6628, 12042, 25871, 17701, 9175, 13939, 13119, 13934, 11253, -4387, -19159, -21856, -10282, -6939, -26199, -31514, -22117, -20901, -15787, 4974, 6940, 3834, 10433, 11144, -908, -7059, 1053, -7203, -3232, -5448, -4773, 4232, 13170, 4444, -4310, -6303, -5866, 8940, 5842, 1350, -153, -2824, -6794, -12746, -16049, -15768, -20182, -25868, -31119, -27180, -12980, -12113, -7442, -8769, 7488, 27665, 27806, 10648]
14577A0648j4949j105J5206o27n722j568j700J908K702J3076k48q536j2038L987
14563A034N434j0767m207Q793J1473j0509k0969R046R069J4077R922l402j8082
14550I12o209Q395j558K968m94m917J7881J5164M61l69K280J2884J3158m421o245
14535D9890j4499k2514o615k470K516m290m292o263J792N977j295O598n230j4557
14521a5252r768J1476J1354J4347q031j0546o322r313J2897J1529O048p998N11
14508I32J3404q175j0810n578l485J828J308K2447J0956l733j8618j2973o841
14495a9338p443K084O307l592O443J0584K3688J0144j808j2059o795q574j2220
14482a2579l656R391L191K726K0989L115j334k2635k263J0308k843J1667J931
$$ y = [10648, -4301, -5406, 9800, 9173, 3451, 1883, 183, 2091, 4793, 17869, 17621, 9085, -2953, 1034, 6468, -4299, -8506, 287, 11760, 1251, -19718, -10672, -1603, 12474, 22396, 18994, 912, -5297, 3098, 1540, 4508, 4014, -903, 16978, 32142, 32603, 32234, 34514, 47398, 60556, 56135, 49890, 35391, 12877, 6262, 3792, 6308, 2018, -2274, -8537, -6745, -768, -2063, 4535, -695, -15252, -25020, -13544, -2190, 12157, 4126, -6420, -12742, -22055, -9158, 2371, 8419, 421, 932, 14336, 6161, -4649, -10227, -13712, -11884, -10576, 11871, 22827, 19094, 476, -12497, -19338, -26781, -24697, -18390, -21982, -15539, -4955, 18733, 28877, 27069, 15010, 8215, -359, -12579, -16235, -6844, -3653, -927, 20062, 23177, 21843, -792, -3055, 7253, 4410, 16077, 18008]
14469A8008j726J426n065k784O476m565r236P81k302j917J5317R193O04j522j3193
14454I495j808M196l677j5932M814l010r272l734R848M062J0049j1171j4090n117
14440b5347J1184j794J922J6211l819k833j1096R960P413L252J543m649o58K545
14426C834p695j0235J6601K0119j944j0305o731O029P473q932m232N076O518n976
14412I600j8227l983L638q65P16j3027N495O847l78J4378O148j1870j1196j154
14398a3878J5638M927P262J1044k0923j1193k928j2304L188O022J3245n521q643
14385a4064J732l933R526O530k242Q622q259j4768j644J2947Q787o254J115j0444
14371a2349l78P657K6763l760q267J0836k772j2357n439o809M894K991k687J2259
$$ y = [18008, 16282, 17708, 12643, 9859, 16335, 11770, 2534, 3315, 1013, -904, 14413, 23606, 24210, 22688, 9495, 7687, 11883, 8206, -7726, -2912, -5922, -15194, -18928, -9080, -5018, 5031, -6140, -20230, -25347, -14163, -15957, -14035, 2176, -1643, -4476, -15572, -5612, 1801, 5053, 6596, 1947, 1289, 3834, -3861, -14096, 2505, 22624, 20680, 10375, 3644, 9673, 17146, 8214, 3982, 9058, 15576, 9600, -8627, -12610, -8972, -9837, -9121, -22148, -16653, -9806, -10184, 4194, 10342, -1528, -12724, -13878, 1760, 6687, 13949, 24993, 4070, -7123, -10051, -22355, -19167, -13145, 100, -5421, -14064, -12332, -16265, -6739, -209, -2451, 6171, -2088, -16856, -18500, -5553, 3234, -3020, -1905, -12349, -12727, -5070, 21693, 17933, 9666, 20502, 17730, 5373, -66, -6875, -1981, 1010, -1677, 10582]
14357A0582R235m776R24K663K537o540k004O697l641j2066p63m522l689J9525
14343A4162R147k894j7100p700O605P641j998p855J904n799q086J284M345P00
14329e644o871O183K654J3063Q423k0175j706j1813R75J2861m37M93M78p127L380
14314e263k587n34N239O759k655k276J1909L476j940N324q444j6755m043m797
14300a6587J1155J8143j0211j1119M825K709N362r764l503K076J194j050r640
14287a6410K6174J6264j2772j2422j1969k624Q23P97J4673k587K834L177R748
14274A5706j5637m451P528J0700l084J278k611Q6j753o640p721k92q30O60K0799
14259A3738K659p536r229O283j05l464J010P255N408M844j3019k376K290N303
$$ y = [10582, 19817, 15041, 15965, 18628, 21165, 14625, 12621, 19318, 15677, 3611, 2848, -1674, -5363, 14162, 23309, 20415, 3315, -4385, 2220, 9861, 7863, 8, 1912, -3887, -11973, -10689, -6344, -5644, -12515, -6332, -3678, 9385, 17808, -2367, -4073, -15886, -14911, -2050, -2487, -1994, -1516, -8643, -5263, -7850, -8384, -3145, 3614, 959, -1317, 10592, 14068, 12128, 17452, 9008, -7747, -11790, -16587, -5432, 12711, 2500, -8619, -3794, -1085, 4277, -5487, -8990, -6914, -5720, -6770, -16410, 9764, 26028, 13256, 834, -11135, -13759, -12936, -12139, 2534, -53, 2781, 5958, 15706, 69, -4382, 3146, 13846, 10762, 12040, 9429, 9515, 7762, 1122, -6599, -6891, -7721, -7061, 13738, 16397, 8861, -368, 5915, 5810, 2346, 3356, 10611, 16019, 20863, 7844, 5468, 7758, 13061]
14245A3061L079Q346J4481K316j7010j1312j4859L57P174k587J434J1392o245
14232I627k1986j8249J2073J8811l844l697J0759J202o309J682J0342Q888N057
14219B4356p552n479R295j8142l361J4340L466k976j0017k0862J057J8752L489
14206F366M634j035n866M844M396r033l235Q173Q77k572M966K2291O389p171j1014
14191B3010j254j3716m172j6910r992K151Q013o202p305J377J4316K0781J1073
14178B1170J616j9416q186N17r442N665j020J2341M355J1014O11o724j1504j206
14164b09J507p770N587J5554K909m717m818j6113M437L038K938J433P99r838o713
14149a1976j295n653l738O335P324N689J569m037m906K810R689r236l618P05R183
$$ y = [13061, 16140, 24486, 38967, 41283, 24273, 12961, -1898, -1541, 5633, 3046, 4480, 15872, 9627, -12359, -30608, -18535, 276, -3568, -7265, 3494, 4696, -1613, 69, 10411, 19299, 24356, 16804, 11325, 20620, 2478, -883, 13457, 16923, 13947, 3930, -16932, -15875, 2877, 6366, 11000, 9965, 4099, 8943, 13339, 4306, 1071, 9244, 10121, 7549, 12515, 34806, 41195, 34024, 23010, 21756, 8040, 3868, -13042, -23034, -20883, -12870, -19072, -26377, -25000, -10684, 10097, 21170, 22786, 3370, -4816, -4299, -13741, -8076, -9096, 3245, 7600, 18614, 19225, 12501, 997, -209, 1298, -6472, -885, 14669, 17578, 12861, 8043, -8070, -3633, -595, 2343, 3776, 4575, -5263, -11976, -13271, -18924, -22662, -16327, -9003, -3314, -1745, -5782, -10688, -7878, 1811, -7425, -11043, -10338, -1155]
14134a155p663m327J4163o465j064p267N531K4069J0844q650J515O033q627j5740
14120A197j8659R839J2828o391M213M258K165l399J3812J4432n062r613o401j0584
14106B635m217l937P77N429J0381J2508m960r558j4512m020L269o068J895J163
14092i215p898K510J2154M448Q078r093j6370M87K583L770Q248N643n740J2904
14078A2509J760m237l674K937N324J152m782K958K583L554P33m409r031q227j014
14063a864n259J734j2050Q40M485N18N576j1983M059J0563J5180j805j4139j5614
14049a9759J4486J8262j443k298j872K484p712j3480J0180P388l657q945J1158
14036D792L575K172n035o950N15M687N6K668J528M88J5364j801p49o471r819l3865
$$ y = [-1155, -8818, -13145, 1018, -5447, -6511, -13778, -8247, 15822, 26666, 18016, 19531, 25564, 16937, 1197, -17462, -7623, 5205, -1186, 3027, 7285, 9450, 6051, 19863, 34295, 29233, 19620, 13219, 2635, -1582, -5519, -4742, 687, 11068, 23576, 18616, 9058, -5454, -9474, -6205, -12273, -10378, -9215, -17113, -14603, -2449, 1999, 10077, 984, -15386, -14899, -12316, -8546, -298, 5345, -395, 12509, 14269, 10032, 6358, 9295, 14619, 15771, 10989, 13947, 16530, 20084, 20817, 16408, 7377, -850, -1864, -7123, -5389, -17439, -16599, -12114, -11596, -6020, -18003, -13944, -3381, 11799, 9994, -4145, -19759, -5273, 12989, 11546, 9248, 7376, 9860, 2148, -11332, -1152, 6236, 2579, -6366, 4792, 8367, 10539, 5504, -1446, -931, 3756, 3812, 6480, 8008, 8496, 23860, 22059, 21310, 14839, 5020, -28845]
14020b8845m657J0984J3939J9936k251r52j9935L127J1500q181r944J798R370
14007d111J181l365m23o905q736J2963M606j4888Q69J0792J525J512Q821K710
13993F551j3430k014o232n630m009J5676Q208k521N259J0796O902j7367j9997
13980a7808p588k541R350R008N259Q874P424j2674M819j635r163O262R867O836
13966A6290Q344L936N802J293p481k1715j0416n488j5120J823L963K5314P287
13953A3832j2195m353j690q124n517J1294Q772o564L448L311P129l856m415J0784
13939A1856R082r195M380j534p548j9785K276J0578K354K55o208K615R576n404
13925C298j8697j065k124J1545K833n8o790M514l431p497j5530Q16J3199J9310
$$ y = [-28845, -33502, -22518, -8579, 11357, 9106, 8154, -11781, -8654, 2846, -5335, -15279, -13481, -4111, -2930, -6295, -6718, -13623, -22359, -9396, -4790, -19678, -18809, -8017, -6492, -4980, 3841, 6551, -6879, -8893, -15125, -20755, -24764, -9088, -880, -3401, 1858, 12654, 19556, 2189, -17808, -25396, -27937, -18587, -9579, -4320, 4554, 11978, -696, 4123, 2488, -6675, -413, 9454, 16290, 24634, 28570, 34372, 35665, 28184, 6469, -3947, -9435, -24555, -22732, -18769, 6545, 13832, 1637, -2716, -4406, -12530, -18047, -6753, 2019, -4545, -1097, 2214, 9343, 5487, 1072, 11856, 20938, 11743, 16123, 14589, 7041, -12744, -10468, 110, 2464, 2719, -3489, -874, 8702, 3298, -15399, -16464, -18588, -7043, -4210, -4268, -11058, -6544, -9975, -17472, -33002, -32186, -18987, 323]
13911C23m907l776K360M015O544M519k4510j3440J2700O964J9777K1055J251j624
13897C1251j1023k5836j081Q017P208J0228j871j3457r262k030o102K737o298
13884a7519P573P642J3417j6156j9139P893J6512K488P610r390R090o227O620
13871A0414m020K694q225j8935j4754q32l874O202J8119K1209O983r523j6602
13858a1144n937K417k549j4515J176N922Q21P689Q970j97r571J0775n60j0244
13844a6947q924R741N230K699M914l114j2805m827J1250j329O411K86j626j0250
13830a9291m95J4991L537M65o079R26N694N508J3902j737k5361q413R051M761
13816b541kL476N791k569M949J1331k909r222n276j5049p680N886J4128j4753
$$ y = [323, -4584, -8360, -6000, -1985, 4559, 9078, -15432, -28872, -16172, -9208, 10569, 31624, 32875, 31251, 20228, -5608, -6689, 1328, 8536, 18764, 16893, 3436, -5826, -7856, -13958, -11221, -17519, -9946, -2304, 11113, -5043, -24182, -16289, 223, 2711, 10321, 931, 10021, 3794, 10414, 6394, 9088, 863, -18072, -32826, -33658, -37532, -31330, -13211, 7998, 14981, 5458, -11144, -17081, -14664, -17213, -31728, -30552, -24630, -23809, -16120, -7150, -7347, -16918, -6143, -6703, -16947, -25871, -16130, -10900, -8201, -3287, -6401, -19206, -24033, -12783, -14112, -7701, -7415, -9041, -19291, -19786, -4795, -1258, -793, -6872, -5946, -252, 5256, 19158, 17421, -7940, -16353, -7302, -2541, -2543, 933, 6724, 4155, 9104, 20435, 17526, 8304, 3028, -12021, -19701, -13815, 313, -14440]
13802a4440j2126O526L848M003K1874J2556M704k080j3655q046R150L847m973
13789A1188N133J031j598l051R087k458k3403q829l59L28r876j098r92J5965J8501
13774I569m139l903r955o18L372L36K285R318J0809j7836k0792K85J198N078K040
13759a2953M291Q612k418n248P157N341m480o229j696o918J3153P232P347j690
13745A1501r496l361M499J2195k215J7759J725j8277j9058o048J88j0397m1L71
13731b0655k02J6127j2143J974P954J5248N734P473l121j7078l665J6538L428
13718A7612j4662l286J4929J2910J858j315J786j555j0005j7425N600J0434m134
13705A2747j0026P956J6113R55m985J554K004N046j687k233m842k1884n196J4298
$$ y = [-14440, -26566, -20040, -16192, -12189, 9685, 22241, 26945, 24865, 11210, 3164, 12314, 16161, 11188, 16321, 17352, 15754, 12703, 21790, 19332, -4071, -12900, -13259, -12931, -22807, -23905, -24897, -8932, 9569, 5430, 1527, -8428, -9046, -5674, -5338, -3053, 6265, 17074, -762, -21554, -21269, -20071, -14993, -12953, -8662, -50, -2468, -7716, -559, 4782, 302, -5927, -7623, -14541, -1388, 5844, 13191, 11501, 2005, -1356, 3143, 15338, 13123, 30882, 32607, 14330, -4728, -10776, -10588, -20985, -21026, -20655, -20857, -4730, -16873, -14899, -6945, 8303, 14037, 21510, 18389, 1311, -2354, 14184, 17612, 2950, -336, 14593, 27503, 29361, 28046, 29832, 28277, 18272, 847, 6447, 16881, 12747, 2721, 10677, 26790, 27745, 22760, 24314, 26318, 31364, 29677, 27444, 22602, 718, -4478, 9820]
13691I820L746J1348j306K555n197j2561k00p756o146R389k642r387J3851J5568
13677B1082j631k7353p551M468P425J6554O572n454N83J1930L843k20l673r245
13663A7330M692l604j0589l049m508J753m468m770J1104l661m734L818J8455j098
13649A6671m314j0567J036j1144p378O710L429r467j3862m809J6741R336r157
13636a6775R73m145p119J1182k78J669N57o961Q639P344K420M085M866l112l914
13621e69j7109P694O066P40j5431J704J726K557N204M958K730r43k112n283j0574
13606a8642m778R731M210J5667N046M711k05J573k1027k403Q795r096J79K88j0773
13591a6724O063J2777O447n745L901k276L677k820m369m224j7492k300N30k077
$$ y = [9820, 13566, 24914, 23608, 26163, 20966, 8405, 8205, 449, -5697, 3692, 1050, -8337, 5514, 21082, 19451, -7902, -15453, -10985, -3560, 12994, 19566, 14112, 14695, 26625, 30468, 30248, 26575, 17330, 22022, 18418, 7829, 4780, 272, 2025, -2443, -7213, 3891, 230, -4504, -686, 17769, 16671, 12357, 1790, 2826, -8318, -15696, -8986, -5557, -15024, -28886, -33695, -16954, -7618, -16775, -15802, -19947, -27066, -15884, -16162, -14493, -13936, -20897, -12258, -4914, -2494, 1591, 6457, 3345, -569, -17678, -9984, -3918, -3178, -18609, -16905, -15179, -12622, -7418, -2460, 270, -673, -2785, -8068, -18642, -23420, -13689, -9479, 6188, 11234, 15945, 15740, 17313, -3714, -6117, 2678, -6418, -6239, -5951, -16724, -10661, 2116, 8563, 2818, 6719, 4443, 8120, 5300, 931, -3293, -20785, -23085, -22555, -24632]
13577b4632P249J0886M578q118j220K0234n44q727p401M875L839L834J1573n171
13563A1255l29O871j3920j5668O289k661Q341P614K21M13M817o210l280k0568
13549a6815R28O215n475m729J0813J478m583q115J789J9886P809j364J640J2110
13535B1587M429m553j8206l183J202m058j471Q222J308o538q594Q89o808Q101
13521g673J0260P46j5218R394O61J0610J414r995k89m298K77M686K856l872l323
13506c764R130J9029p199j4648j398j915N630q657J0939j797M641k670q138n667
13492f484J3542K755q474o221p928P043j0924L791M381K0252p469k5530l086r58
13478b5310m550M394J3614k243k829K845O270r100j0721R006j844Q705J3657O155
$$ y = [-24632, -17383, -6497, -1919, -10037, -11257, 8977, 8433, -294, -7695, -2820, 1019, 4853, 16426, 11255, 10926, 17797, 3877, -11791, -5502, -8163, 178, 7792, 8013, 8426, 13243, 7033, 3753, -16815, -15887, -9672, -15147, -19876, -9063, -7585, -12168, -20283, -18494, 1392, 9201, 7837, 9477, 21587, 26016, 21463, 3257, 74, 1276, -2782, -4253, 3969, 5277, -1261, -9855, -8966, -15774, -7673, 2587, 3333, -11885, -2491, -1830, 8780, 10194, 199, -90, -4388, -4111, 575, 3431, -441, -3764, 5366, 24395, 17196, 2548, 1150, -765, 4865, -3792, 7147, 5350, 9991, 7321, -817, -6484, 7058, 9813, 1339, -4882, -12810, -5767, -16691, -12900, -8519, 11733, 4264, -21266, -24352, -25310, -29860, -25466, -11852, -14095, -16924, -14079, -7809, -16909, -27630, -18624, -20468, -11763, 1894, 8049]
13464H049n507l098N517n220m509J026R379Q390p436j147j6802j2963J895N306
13450a7120R111Lm058L276J4136j6301l481J559l167j307R567P455M30l496R092
13435E699O542J738o978j8546q178m117p307J1160n237J4075J1780K137K177J338
13421F283o440J37j0767P966j589k415J1240N869q471J031q876O07J2291K907
13407I773k084J827R238j1427K166k522P43m38j0130k1031j0610J3475J7100l12
13393d232n436K975J528p715M782R034k831k0818N539J1703k917N402n259j4858
13379b3103l485R510K905N111O328J728j688M676M837J0532M686J264o132q368
13365H801Q754j288n198j0050P243P864l421Q51m678l889m849J935J0980k541
$$ y = [8049, 2542, -556, 4961, -259, -4768, -3742, 5637, 14027, 6591, 5444, -11358, -24321, -22426, -17120, -8009, -8006, -12064, -8788, 5348, -10953, -14434, -12875, -16042, -17349, -7782, -327, 103, -3393, 5699, 12241, 13979, 7001, -11545, -19723, -23840, -31147, -19987, -25224, -11149, 631, 2768, 4945, 6283, -157, -20, -10787, -2821, -4410, -6825, 4415, 10284, 1813, 2844, -6032, -5425, 6866, 9773, 7689, 9516, 18754, 7327, 9493, 6971, 7714, 7276, -2854, -23885, -34495, -21020, -3920, -4232, -9668, -6693, -5165, -12880, -8098, 936, -1895, -22713, -17174, -5471, -8388, -2986, -8245, -23103, -26588, -17078, -14173, -9062, -2734, -1006, -2694, 1982, 6819, 17351, 22037, 23301, 17169, 8801, 17555, 16267, 11069, 1019, 8262, 16126, 12705, 13556, 8878, 4989, 140, 2075, 13055, 10514]
13351A0514j4693q681m320J206j727p236j3147P404J8804K1192L427R83l383k422
13337G921J3288l97k1466j7511o362J7257J2467m394O942O321j023j0079j0998
13324h034J63J2602N509j3998M454O702q735K484P8R376k364q045O120r244k061
13309d993n569r807Q595J0349N072j135K35j401q019j5311L111J5034L313J0215
13295I689m805j8393k622n497m915l144J0873J1540P077K7826J3649j868l249
13282C6161j4339k9460j2831p817K0529J8646l627O011K0746J4457j2813j4016
13270B1647m046k1458j5746J2967M847k2240m824J6623O85L075n203m292n293
13257b3258K5961J2326j852Q389P94j7614J554j036o553m466K450O08q014p984
$$ y = [10514, -4179, -12860, -17180, -15974, -17701, -24937, -38084, -30680, -11876, 9316, 12743, 13726, 10343, 7921, 21209, 20812, -654, -18165, -24527, -7270, 5197, 803, 7745, 14066, 13043, 2964, -8034, -7871, 4731, 10240, -3758, 696, 7398, -1337, 1147, 1225, 10601, 8237, 192, 6312, -2932, -4993, -10562, -20369, -11774, -1425, 3647, 2512, 2747, 1346, -6673, -21984, -18873, -3839, -526, 9689, 4884, -13509, -16131, -21628, -26543, -29687, -18814, -7274, -197, 27629, 41278, 39410, 36161, 21822, -7638, -20469, -28286, -7757, 10889, 7262, 13273, 34019, 48476, 35663, 21647, 17601, -3857, -19603, -6636, -1789, -24029, -28853, -12230, -11545, -8470, -13673, -17965, -23258, 2703, 15029, 13177, 21566, 22360, 4746, 6300, 5264, -1289, -5755, -3305, -2697, -10711, -18695]
13243a8695r154K726Q850P401K536J2097o91P440Q925O775j0693r393r615j0853
13229a2344J060J0034j231k88J793j880r325M814K762N260N053o864m204K678
13215b682o740L796N224N819K964j873Q396k3116q089J623M771N524J3313P579
13201A6509j953j3170k825o752M679P709J183Q629O816M710j741k2809j2210P58
13187a0467l623q816J0449L253j0699j0372n284K763K2950J1575M633m456j1128
13174i222J4530P489j0277j4783J0604Q077Q945J1962M066j0979j1853r648N80
13161e09J5797o975j1968r634J1525J834l646p123n593J2311J4164O410K468M814
13147B3875Q093L70l408n88R495r753n957j0775p021l436n983j1879m200O869
$$ y = [-18695, -27849, -25123, -16273, -8872, -6336, 5761, 5070, 12510, 21435, 28210, 17517, 8124, -1491, -12344, -11284, -1250, -2481, -2769, -976, -2856, -12181, -7367, -4605, 655, 5708, -1156, -5360, -2682, -9422, -5626, -402, 5417, 8381, 6508, 14904, -8212, -16301, -14678, -9907, -4383, 8930, 16509, 14556, 1386, -1439, -8191, -3512, 4197, 5380, 14009, 20825, 25535, 23794, 985, -11225, -10467, -14090, -22906, -12457, -9204, -19903, -30275, -35559, -32796, -9846, 1729, 6362, 1906, -9222, 5308, 12797, 2520, -12263, -1659, 6418, 15363, 27325, 31391, 20412, 8559, -1089, -509, 15288, 8313, -3655, -13289, -1764, 70, -3576, -10699, -16292, -3981, 10183, 16593, 19061, 23875, 31968, 32338, 28930, 28342, 37837, 28084, 22127, 11352, 4331, 895, -5088, -16967, -21167, -14298]
13133a4298O896M668R837p12k0995K48J3946j1348j2776q60J5022k752p087L790
13119a6421J5750J6513M9q056m740P698J2044j250p070j701o848j4619N855J5125
13105A2329R597J0094j7034k537k582j1361j176J2555k238r60n423O618M830J950
13091A4662j5706J470K1048J2886O668j2938j5702j2116j2349P393J4519r692
13079A43j571j845p716M140K689m789j1335R362N774J5854K421O30m486L944j4911
13064a696m907M253L208j372J2552n568j317j4184j7032l583K876Q413M479n296
13050a9174L246J33J1625J1845j163n196k272L220Q258k008m864n365m844P940
13036A381M445J1536M362o268j425m7j1158j9284j4862J4854P228O668O700o243
$$ y = [-14298, -7402, -2734, 7103, 6391, -14604, -14356, -410, -11758, -24534, -25394, -10372, -13124, -20211, -16421, -671, 15842, 15891, 7835, 3095, 10793, 22837, 21587, 14517, 12816, 5968, -8651, -2796, 12329, 21926, 32020, 14986, 12449, 9867, -1494, -2670, 9885, 7647, 6687, 1264, 7882, 12712, 14662, -1044, 426, 21474, 34360, 41028, 28090, 12388, 272, -12077, -4684, 9835, 143, -1428, -3273, -10989, -6849, -4160, -8949, -20284, -10922, -5148, 10706, 13127, 13757, 9271, 13215, -1696, -6603, -2350, 858, -514, 12038, 6470, 5153, -9031, -26063, -29646, -26770, -18357, -13878, -19174, -15928, -15795, -4170, 7675, 6512, 1316, -956, 2264, 10522, 8514, 3650, -1715, -6559, 1381, 5826, 17362, 21724, 15456, 14031, 13984, 2826, -16458, -31320, -16466, -9238, -2570, 4130, -2113]
13022b113j0637m436R220J0134j384P315J676J12n1R188m626L883j1793N018J6201
13007B7707j7486r170J0668J2082O30k0245j1084J5309J1139j125j3550o191M864
12994C548r7n357N644j312J879M169j5561R60K822K353P378M605q733M688M680
12979A1666m461k197L198r886l692P213J2653N385j9350k5060k084K2898J2100
12966H383l695l586L596m392r008n715J3279q469p740n949Q185O063q91r405l401
12951b2745J4860K73j0257Q38j0816m170J1166L264J5103J2868P60j66M479N639
12937B1096k677j4008p499k132j880P674J2501k779j309j2112q871J0530O627
12924E161J096N357j525r755p362N477n125j888q734M53j5817N782J6205J549
$$ y = [-2113, -12750, -17186, -7966, 2168, 784, 8099, 9775, 9887, 9836, 19024, 14398, 18281, 6488, 11506, 27707, 10221, 1051, 11719, 23801, 24431, 4186, -6898, 8411, 19550, 18425, 4875, -1316, 3548, 3451, -1906, 3738, 2426, 4305, 8474, -7087, -6127, -3305, -952, 6426, 11031, 2298, 6986, 11666, 7205, 5008, 8206, -1680, -5372, 1841, 14494, 19879, 529, -24531, -26615, -3717, 8383, 4688, 1102, 4698, 306, -8702, -14417, -1138, -9607, -17347, -23296, -15111, -9048, -9939, -19344, -22745, -7885, -7612, -17869, -17031, -27847, -32017, -20851, -17587, -2484, 10384, 11144, 10978, 15457, 21096, 18419, 4411, -3088, -5220, -7100, 574, 13075, 10296, 8987, -3125, -11996, -1466, 5161, 6257, 11614, 10089, 334, -7028, -1551, -6676, -8564, -17298, -16845, -32662, -26880, -10675, -9126]
12910i126j0208k193Kj2092k176P680J7133Q734j7731j8800J2399J0624q801J6888
12896g667m13k67m203j0460m19J6468q87K04J1289J0295o58j2624m623K758n938
12881g145q398L463J5324J842n424L681L800M264j7094j4774O066J0345N505N823
12867G278j961R433L916m434L996M11n848P853j787r604j4578O858L245o846o981
12852i049q799K122P657P097M478j0557n864k03P199Q792R964o797K36j0351k3259
12837b7334k2737L24J6519N630J3926O541K86J0730N490K782o946P199r355n248
12823b193p118l282J439j3641k246J2448J0754p842j1987K0823L671J204j2025
12810i995K212N441m153l202P247J4027J0923o346M929j1512j2219j754j214j1254
$$ y = [-9126, -19334, -21527, -21525, -33617, -35793, -28113, -10980, -2246, -19977, -38777, -26378, -15754, -24555, -7667, -8080, -8347, -12550, -23010, -23429, -6961, -7848, -7644, 3645, 13940, 13282, 658, -3965, -1207, -7145, -15543, -12080, 3244, 5086, -338, 3343, 7143, 11407, -5687, -20461, -14395, -4050, 1455, 7278, 5317, 14750, 18666, 14232, 18228, 18639, 12791, 20644, 18857, 9253, -5325, 1533, 4778, -2068, -9049, -17848, -15726, -8069, -972, 3506, -7051, -12915, -13118, -5919, 2873, 12837, 6040, 6276, -4075, -27334, -50071, -49747, -33228, -27598, -13672, -7131, -6845, 3885, 9375, 12157, 5211, 12410, 3055, -2193, -9311, -12593, -11154, -24795, -27041, -14593, -3839, -11681, -23668, -2845, 826, 2030, -9995, -7783, -2342, -6495, -9697, -2450, 11577, 22500, 16154, 21083, 9571, -2648, -4402, -5616, -16870]
12796a6870j615K018l211P318K713Q923j1368j074J7582j5040j3775J6536P325
12783e38O821j030q473n610K208m760P720m415j2149N490O176l80o148K533m717
12768a7272m862J8644O342J3359m181m884o542j0837O198N426m170j1328J8260
12755D153n825J996R842p441j0383M952p39Q564q475J527l506r20r311n617N707
12740a5476l907j1573l505Q425R552K7283K8173M52l3939j2930p337L53L685q498
12726a9242J889q319J1965K098p952O764J6469Q800j1773n236m395Q07J7294N034
12712A4203n06J990k961j5289j6093r862n561j1058R292K2378J3432P792j1448
12699c691p217J808r867j244J3369J0492P169j0667l780k248p274K322O776L670
$$ y = [-16870, -18485, -16467, -19678, -12360, -9647, -724, -12092, -13166, 4416, -10624, -24399, -7863, -538, 6283, 5253, -3220, -8830, -6622, -11382, -3662, -8077, -20226, -14736, -8560, -8940, -15088, -12555, -17272, -22134, -3490, 2852, 16211, 12030, 7146, 604, -10233, -4035, 1391, -2779, -14107, 4153, -1672, 324, 10166, 2725, -7658, -2706, -3445, 5119, -3356, -1829, -5335, -6255, -15566, -21183, -15476, -19383, -30956, -34461, -26036, -16484, 10799, 38972, 39424, 5485, -7445, -14782, -14429, -10744, -19242, -17353, -25672, -13707, -11609, -19561, -12797, 3672, 12472, 699, -4537, -8932, -8125, 9169, 14203, 13697, 15687, 12726, -2563, -18656, -28518, -34079, -45137, -35845, -13467, -35, 7757, -3691, -10908, -9100, -18967, -20211, -6842, 3650, 10819, 152, -3628, -5876, -13150, -10828, -4052, -382]
12685c82J1453r983j5102j1855N743Q866l546M950J0237J4283q731k4963j4174
12672c3204J561K1307L542L250m20j1020R628Q150r270L14m594o895m754J3460
12658h945L066j2548K218J4640k929J703J2106k438K306M574j4278o911l539p057
12644a8032Q590J5076J4533q744l493o565n661J08o618r88m593K538J4471r89
12630c67N433K941q900j4461l998l622J0191L224j3709K863P240J228l953K244
12616a3646l592o919O62k142N768M917k221K703o06o207l997P46J154L120L0K452
12600a7778o24J2760J1942m471O457l643L463R64P874k215m224k932J83N746R222
12585B2724n301j3637R838J989j5458j6723M862N852p995j0024Q626p484o46J6439
$$ y = [-382, 11071, 1088, -14014, -25869, -20126, -11260, -14806, -9856, 381, 14664, 5933, -19030, -33204, -31643, -10336, -6794, -3544, -3964, -14984, -5356, 2794, -6476, -6162, -10756, -17651, -22405, -8945, -5879, -18427, -16209, -1569, -4498, -2795, 9311, 6873, 9179, 13753, -525, -7436, -10975, -18032, -9442, 5634, 20167, 11423, 7930, 1365, -4296, -4188, -10806, -11794, -16387, -13849, 622, -367, 5066, 8007, -893, -15354, -19352, -22974, -12783, -9559, -23268, -20405, -13165, -11937, -15890, -13646, -17238, -24157, -23495, -25637, -19869, -14952, -17173, -14470, -15076, -21283, -25280, -24534, -23380, -20260, -20230, -17778, -18402, -5642, 6300, 1829, 8286, 4643, 8106, 9070, 16944, 14729, 10505, 7573, 7756, 13502, 22724, 17423, 3786, 13624, 15613, 155, -16568, -11706, -5854, -13849, -23873, -15247, -22731, -23377, -6938]
12571f938J7233Q37k215o799q515l529P91j363L569Q157P956j1959j1094M52o32
12556a4049M493L279n327Q374N749J0170R897j1703j3707j235M473m263n917p910
12542a7676q811M848Q043m234l631J0860OQ650j395k957J964j2571O191J3737
12528C024O257q071r965r221P269m95L04k391R503k77j4452O799m99L177m018
12513a3056K611K442k716n987K13Q687J2905Q305m481K218p376M505n643K512
12499E139q211j3290J1783J6904j581o380J333q794o950P22R862p751L340N638
12485A764m139R721j018l615j3404j6704J0061P470q838J8883J0742r38N551Q150
12471B3686j514m438r050k123m374r373q44J8266K538m393j1282j0055l203J3175
$$ y = [-6938, 10295, 11132, 8917, 2118, -6397, -9926, -9135, -10498, -6929, 1228, 9184, -2775, -13869, -13417, -14049, -9556, -6277, -11604, -3230, 2519, 12689, 22586, 10883, -2824, -4059, 414, -3849, -9766, -17676, -26487, -21639, -13596, -17830, -21461, -10601, -10595, -1945, -3340, -6297, -4333, -16904, -10713, 3024, 9281, 1210, -8755, -17976, -10707, -11202, -10898, -13289, -3786, -4063, -18515, -11716, -12215, -9038, -13056, -10445, -8003, -10719, -16706, -16493, -7806, 5099, 13404, 8923, 11141, 3765, 8270, 2627, 5139, -3072, -16362, -4579, 12325, 10744, 4364, 5697, -3097, -10047, -9325, 537, -7214, -3874, 1764, -2375, 7346, 6328, 2713, -10691, -27395, -17334, -9864, -18702, 181, 10923, 9985, 15536, 23686, 22172, 17734, 8684, 6561, 2187, -7186, -8030, 10236, 12774, 8381, -2901, -12956, -16159, -2984]
12457b984J2017q015o563j6033R381K105n159K38p587m50j318K505P366L986N191
12442e320k8j364l605k254P146k652J091R590J722l156O356o487q779P800K523
12427B583j777k165M57n622R515k076j2573l233l078J3144J9126P294j2887k921
12413E787k3824l995M345J3356Q529R850N060r176q430n573q300p219l131j374
12399b4095J1001J4454R560p763N515l97q179k809J0019M23P08o545j4822q26
12385a3756O160J2670O488P633K822j5268j7419k5767O514O599M668M218M65j893
12371a5866R679J1341p30j4619K189J5105j5286n413m037Q515J097m068j3159
12358b5252L049K63L562K901r896J316r031M247J8105K5151L333k746n348k0754
$$ y = [-2984, 9033, 1018, -5545, -21578, -12197, -10092, -15251, -15013, -22600, -23050, -24368, -21863, -14497, -10511, -5320, -5348, -6712, -10317, -12571, -5425, -8077, -6986, 2604, 4326, 1170, 7526, 1039, -7740, 60, 2583, 806, -1359, -902, -6524, 2991, 915, -11658, -14891, -17969, -4825, 14301, 21595, 8708, 5787, -18037, -22032, -17687, -4331, 4198, 14048, 19108, 9932, 1502, -4071, -12371, -19590, -22721, -24095, -13094, 1360, 10920, 3157, 8672, 8275, 96, -2713, 7306, 7729, 8437, 1892, -12930, -13756, -7596, 5074, 11562, 19195, 22017, 6749, -10670, -36437, -29923, -23324, -18656, -14438, -13973, -15866, -6187, 5154, 4424, -10195, -8006, 7099, -8187, -13600, -17637, -9122, -8025, -12093, -25252, -22203, -21940, -18378, -15477, -25373, -24057, -33088, -28841, -10736, 14415, 17748, 15002, 9654, -11100]
12344a1100r363J1646R774P16q117N383Q415Q43m496j6279n038n496J2122l591
12330a4581P347J3110L242j1810K369j4326q282N642N863R28P444K407O899j6250
12316i998j4777p65R253J5625P615j5670Q489J6546n522N238M12l696l1001k221
12302b0472J0579M957Q892R031M90o220N478m281j6076k493q343j1572J1229J7581
12288a220J0166M46p545o103l915m732L43R846j198p663J6644J0311j1662j1157
12274g439o68L764L349R94p152m838P243p874q815Q959n485l929J3612K267J5780
12259I768P099j1921j1673o660K953J6314J1700n057k1716q352K803J3715Q902
12246G875J0270R75j2852j824l536K90M864p932n896j0039l710K4515k920p283
$$ y = [-11100, -20463, -8817, 957, 1673, -6444, -1061, 7354, 8197, 3701, -12578, -17616, -23112, -10990, -14581, -7234, 5876, 9118, -2692, -323, -14649, -22931, -17289, -11426, -10498, -3054, -647, 6252, -9998, -24775, -25540, -16287, -662, 6953, -8717, -228, 16318, 10796, 16034, 16446, 12750, -18251, -20472, -9893, -4936, 3956, 12987, 13477, 7257, 12735, 8454, -7622, -10115, -18458, -30030, -18801, -1220, 8946, 9392, 1847, -4256, -8171, -12903, -12560, -2714, -3912, -11575, 5069, 15380, 3718, -7439, -8107, -4343, -994, 0, -7152, -11990, -4747, -12621, -21436, -12477, -17962, -21891, -8279, -6012, 9768, 16867, 4946, -6727, -13387, -10434, 5880, 17580, 12523, -9193, -17545, -14742, -1027, 7875, 18145, 19120, 6268, 4444, 908, 1198, 6062, -1870, -7766, -17805, -21515, 3000, 80, -7203]
12232g203N670n113j971n286L124p744J1834L245p020O53R741O019p99p964r415
12217a2229Q630l504j775R778K023J0338l536n963K752p225n122M491J1614J5341
12203B5613N966j4191p145m626n758o756R333O6M440J0362r585k1225m08N134
12189h780P698K3115J5599k4616j6972q791l319J1025l142n47J0380K9363m24
12176C0589q659j4821q745q171J2715J3909r614k198j1562K129l71r117Q963O784
12162A831R189L549K0974j3183j3959r948j1965k443Q422J2558q355q715K889
12149i156J0392P686K547K551m385n632Q920K506L63j662o281j3722O756R020
12135I903m84m942J351Q967K44q989r856j2203m794k800M790J0419O893J2384
$$ y = [-7203, -1533, -6646, -8617, -13903, -10779, -18523, -6689, -3444, -10464, -9811, -70, 5949, 5150, -2814, -12229, -3599, -7103, -8878, 900, 2923, 13261, 9725, 3762, 6514, -711, -5833, -1342, 10272, 25613, 31579, 17388, 10243, 5617, -141, -6897, 2436, 2502, 6942, 17304, 7719, -13506, -13914, -8780, -1082, 22033, 37632, 13016, -3956, -12747, -16066, -5041, -8183, -8730, 1650, 31013, 30589, 21930, 7109, -1636, -9807, 2908, 16817, 7203, 5005, -6557, -4428, -4799, -13916, -4953, 1831, 11020, 14569, 35543, 22360, 8401, -1547, -13512, -15955, -7533, 5025, -3330, -12045, -9156, 1236, 8922, 11469, 14020, 9635, 4003, 12923, 15429, 15792, 14130, 7849, -5873, 883, 9903, 9419, 4477, 5828, 14795, 15039, 6050, -3806, -16009, -20803, -23603, -18813, -8394, -1501, 10883]
12121A0883J146p713j5113j1993m469P387J7808Q247J6884j2913j0288n227l084
12108h445o448K4936Q889j0025j8400j1650k737J4176m058j3873J3349P636Q891
12095B241p207P540J5223J7135j6302k3416j1514J3005R147P8j449k0810p055
12082b3384J5397j4001q809O874N480J7963Q327p890p249n688J1362M730N84N357
12068I053l98j9944j999J4654r496R92M526o299p155J9129l85j0116n638l732
12054a6808m234L75J298J910J3537O986Q738q570p808O344R241k054j4004q615
12040a3664O478P722j6117j1020n254N853K5527k464N685r588l720q537Q369J870
12026h860q547N130K462N670R137j554q527L253J7658J1273P09j2570q934P791
$$ y = [10883, 12029, 4316, -10797, -22790, -27259, -19872, -2064, 6183, 23067, 10154, -134, -5361, -8445, -14893, 10043, 18932, 8907, -9493, -21143, -23880, -9704, -13762, -27635, -14286, -6650, 2241, -4966, 2574, 17797, 34932, 18630, -4786, -16300, -3295, 5852, 5930, 4481, -16329, -23384, -7987, -21988, -30797, -23923, -18443, -480, 7847, -43, -7292, -12980, -1618, 3112, 3696, 9053, 8655, -11289, -13288, 1366, -8130, -7138, -2612, -8911, -16066, 3063, 2678, -7438, -13076, -16808, -21042, -20667, -19369, -17459, -3922, 3064, 11802, 3232, -4576, 1768, 11009, 8955, -5049, -13664, -7186, 536, -15581, -26601, -31855, -26002, -475, -2939, 2746, -6842, -10562, -19099, -10730, -8860, -17407, -12277, -9815, -4145, 4992, 3438, -5089, -1836, 15822, 27095, 27804, 15234, 6300, 14091]
12012A4091q352p815o696M350q313j63J0492n412J0717J909q246l720l925P5J2293
11997A285J9047K243J962l452m88j0100k536J0235p593j8541O227m166j1865o734
11983b4476j1077l622J9291m683j37k515M556J8126j980L276n068q909N831O587
11969d800l181j4480p527O52R578J3744M992L049l188o488M29n999j2302l294
11955b8815j556k344J6232J9320r37m910j1204J5940J1930N01O256M049j5525
11942H937j7283q618o705J4788J3802m250m275m531p544l188J0630L671m312K253
11928f625K2943L238j2223j5230p005L076J7329L97j7944k4522Q495J2482Q641
11915f948J0075J5751l193j7468O298J970K3522l18j696N275m6j7138r919P010
$$ y = [14091, 5739, -2076, -8772, -4422, -12735, -12898, -2406, -7818, 2899, 4808, -3438, -7158, -11083, -11008, 1285, 20332, 22575, 24537, 21085, 20597, 10497, 7961, 18196, 10603, -7938, -1711, -5877, -17742, -24476, -35553, -39175, -19884, -24567, -24704, -27219, -22663, -4537, -6517, -3241, -8309, -17218, -11387, -4800, -7981, -22461, -29988, -29336, -19758, -6014, -1022, 2027, -1161, -7649, -7220, -13219, -25521, -28815, -30371, -32715, -16483, 2837, 1900, -3010, -14214, 1726, 13656, 14157, 20413, 24462, 8937, -8346, -16964, -23669, -8881, 4921, 671, -3604, -8135, -15679, -18867, -8237, -4566, -8878, -6625, 16318, 19556, 7333, -7897, -14902, -11826, 5503, 5900, -12044, -36566, -28071, -15589, -6948, 3127, 18878, 15685, -1783, 4515, 6485, 30007, 29689, 27993, 33268, 33222, 16084, 6165, 13175]
11901A3175p363p753P096J469j209J4065r30j3234m395o690K1810j258k4501n133
11887a4851R229O196P127K013K397P980N193p9j4324k195o832p28p861J2127K481
11872G873r55j0641J868p737m726M424O617K35l088l265Q531J3605n26r444j997
11857G74q39n073Q346K770j6353L305n914r693l780J0721J6617J231K06m141O53
11842a170J136l379l811K643O029J0220O934k749J485j653p474k2253j9099J0782
11828b2359O935k3056q248J7987R346J52Q946o912j683m192j3321m56J564K4799
11814a0498J7182r002j0065n028M615P397j944o799J4355R387K68k795O031k213
11800A0891J523m875l564j0833j9851Q63O821J8235n73L024O886o849j542J2009
$$ y = [13175, 5812, -1941, 5155, 6624, 5415, 19480, 18550, 5316, 921, -5769, 16041, 14783, -9718, -14851, -5622, 574, 7701, 9714, 12111, 20091, 25284, 25205, 10881, 8686, 1854, 1126, -6735, 5392, 7873, 6918, -3723, -1855, -9592, -14318, -9894, -3277, -3042, -6130, -9395, -864, 12741, 12215, 2771, 774, -65, -5138, 3208, 5978, -10375, -7070, -12984, -22677, -26457, -15736, 881, 2112, 2318, -1823, -1170, -34, -3413, -7224, -4581, 1448, 11668, 18602, 15853, 17338, 15685, 8211, -14042, -33141, -22359, -15424, -38480, -46728, -28741, -19395, -19243, -10297, -17209, -18892, -23084, -36405, -36861, -35297, -10498, 6684, -2318, -12383, -17411, -12796, -5399, -7343, -14142, 213, 9600, 9868, 7073, 13104, 10891, 12414, 7539, 3975, -6858, -26709, -25846, -19025, -790, -1363, 1661, 8547, 1698, 156, 12165]
11786A2165p801p760J6720K310Q94j1346l044M589L854q116r376k518j706J622
11772i513R811L878j959J8980k932m04N516j4912j3775k20J0917J6136J815j3651
11758I687j6093l120M645r639J2908R130n762N854j2625k1230q773J0135R045
11745a5838J9035n433p958r230M718R30n298k03P063k028n999K0293J7823j6365
11731A510j1460J1031O098q595j3097j1008M806Q954l82J287J0975J0281r312
11718A088k5470j3962L801K3000J9102N135n204r546j0033j2359Q521J3084J383
11705a460q076p547q672n118R858J4828J331l606p936j0964l587J426J0934j782
11691b0371J3746M560J3650K75j5574j1113r863L930N398J832j3630r571R380
$$ y = [12165, 4364, -3396, 13324, 15634, 16528, 5182, 2138, 6727, 10581, 2465, -6911, -9429, -11135, -9513, 298, 4176, 2217, 21197, 18265, 17861, 23377, 8465, -5310, -5530, 5387, 21523, 23338, 9687, -6406, -9526, -4881, -14520, -1612, 7518, 1756, 7610, -5015, -26245, -35018, -24883, -15838, 3197, -2236, -10194, -19424, -14706, -13776, -19074, -19277, -12214, -14242, -20241, 52, 17875, 1510, -9950, 1081, 7179, -1416, -14513, -25521, -20715, -11761, -12143, -10856, 119, 10400, 1088, -24382, -38344, -34543, -11543, 7559, 12694, 7490, -2056, -12089, -24448, -15927, -2843, -1460, -9536, -17083, -25755, -30873, -21015, -6187, -4856, -8462, -16398, -27362, -30949, -29523, -18589, -20371, -6625, -2065, 11585, 11860, -3714, -14827, -24690, -20760, -15362, -13530, -27160, -36731, -27351]
11678b7351P188l600r207J4206m649o464O056Q846M226r24K0137K2716j0254k0553
11664C73j2346J1188R544L380r77j0472n1p273r65j896m442m549M219O770J2211
11649D714J1633M741r522j6309R8L666j704l4L453k2645N55N568l213k368n297
11634b6664R997J1443O288K0368L855m096j8195k708p060M74J475o068L748K390
11620d753l160j409K51k823n185j651m50m672J1767L187k576q719R459K2392J5924
11605B7582K1882J348m054p423j5641M702p623r483K341o051j1454r32L281K920
11591A395j782r055R938R185j363n514M740n608Q645P447j4706j5760j2415m624
11577b9477n21J0296O904J0379q35r611J5263L877n940m494n302J8824L312j5018
$$ y = [-27351, -20163, -23763, -32970, -18764, -23413, -29877, -23821, -14975, -10749, -11673, 8464, 31180, 20926, 373, -11973, -785, 8759, 12139, 11162, 690, 639, -6634, -7599, -9495, -13937, -18486, -14267, -7497, 4714, 16347, 21088, 11566, -4743, -4645, -979, -2683, -2717, 736, -21909, -21354, -15786, -18999, -21367, -26664, -16667, -5224, 1064, 21432, 25287, 21191, 2996, 288, -6772, -6298, -4823, -10891, -7143, -4753, -7913, -9322, -9071, -11894, -17079, -18730, -19180, -23852, -12085, -8898, -11474, -20193, -10734, 11658, 27582, 49464, 50812, 46758, 39335, 23694, 28396, 20773, 11290, 13631, 7580, -3874, -4806, -1525, 1395, -387, -9442, 496, 9681, 8318, 2804, 7544, 1936, 10581, 18028, 3322, -12438, -24853, -29477, -29998, -19702, -12798, -2419, -3254, -12865, 2398, 6275, 335, -4159, -9461, 9363, 12675, -2343]
11563b343k5917P264R913K655o144J8098k445l956m806o6k629n879q208l112R165
11548a8410J258j2927Q694M742J0122K0986k996n273k019q95L723o334M415o33
11534D453j3798p251J2990m303k670P38n879O511l212J5785J963r320l864l92
11520h249L787R775j1652j2236m032j408k218J4907R139j0255N904l594R545J2875
11506A2288k697j0025O228P211j0458r945Q103L068Q9P32k3689k201R813m489
11492a5972j190m885j0474P322J1048R057N195o297k2658N360N933K0496m238
11479a303ll399j948j791p098r48J8987n45J830l920m967R509k0238j409Q173
11464i070J3981j658j348l08o519k572k992K822p283O872J1912K636o949o993
$$ y = [-2343, -28260, -20996, -11083, -8428, -14572, 3526, 1081, -2875, -7681, -7747, -10376, -16255, -24463, -27575, -18410, -17152, -30079, -21385, -16643, -6521, 14465, 11469, 6196, 4177, 3282, 7005, 671, 5086, 4453, -9345, -16596, -3606, -7909, -10579, -9841, -15720, -9209, -12421, 3364, 5327, -3993, -7857, -8249, -4462, 5313, -6339, -18575, -22607, -24015, -26233, -11326, -2187, -12442, -6538, -10132, -587, 12288, 9591, -434, 5794, 13005, 2547, -7398, 705, 3773, 3862, 4594, -19095, -21296, -11483, -15972, -17162, -22047, -32521, -25199, -14151, -5094, 101, -6196, -28854, -23494, -17561, 2935, -1303, -1306, -4705, -6653, -8444, -15542, -16490, 2497, 1952, 3782, -138, -5105, 4404, -15834, -17243, -9070, 4911, 3253, 1905, 1597, -4922, -7494, -10486, -7664, -14947, -8075, 3837, 6473, -476, -7469]
11450g469M838M809j5071J594P157M314m320O9L769K326j8945l816K1912R497
11436A0664r950L552k922o637p659J988n143J294L039R597M128l23L334k569j087
11421A306m306j803J1164m527k972j2996n094J8859P853j3598j1257J2307n014
11408a0078o626Q156J824K661J1636L309j3547M022p836n619N311K0256j2205
11395A264Q042K1116j0046j1343q347j255j2004o48o24N513Q481L265L060P998
11381A4472l204J340J046o362q361J2089K763p505k411m376Q869J6445L844j6946
11367A1703j1810l616J993J158N210j0455r552J707N780N161J296J3003O941P179
11353B5698O927L322j1217n893J700j0797r616j288M625O917L863j3860j8504
$$ y = [-7469, -2631, 2178, -12893, -11299, -4142, 172, -4148, -4079, -310, 2016, -16929, -20745, 1167, 10664, 714, 4266, 1344, -5293, -12952, -10964, -16107, -14813, -11774, -2177, 1951, 1628, 4962, 2393, 1306, -3000, -4803, 6361, 1834, -1138, -14134, -19228, -369, 7484, -6114, -17371, -5064, -10078, -16704, -8548, -6724, -4063, 7573, 10882, -2665, 1357, -6479, -12098, -6787, 13469, 1264, 9306, 30422, 20376, 9033, 686, -569, -12573, -13221, -13845, -8332, 149, 3414, 6474, 14472, 11268, 12608, 13654, 7292, -1069, 11020, 13783, 6278, 3867, -509, 8360, 24805, 28649, 11703, -107, -3723, -1730, -572, 4638, -5817, -15369, -13662, -7882, -2721, -1425, 11578, 18519, 25698, 32625, 35947, 24730, 18837, 20537, 9740, 124, -1164, 3461, 10378, 14241, 381, -18123]
11340a8123n250N594J3157O044Q684j326j3128J606n896o346k924k356L491L064
11326a3709j3836Q660N428R771M251K344J0747J5331j0644o549k366r0j612l666
11312D060j683j7406j8753L005J2495M081j1566J0023J8610j3093N41J1854N317
11299G485l509k389j2923m746r179k192o14J1973M251k3942o311O068N066J1797
11285a9165J4302o225q523R906O456N281r94J0324j409j3574k5599J2361J3700
11272c159J0062J0739k26j794J1126p353o515j0247P691j1101j3700L875l78J2667
11258A687J0593J3316k749o34j1411p462k327l069j2881j1080P143O701l035Q974
11244f234J6781r621k557J721r24o581r999o899J5854O837N55J0220m902l127
$$ y = [-18123, -23373, -17779, -4622, 1422, 10106, 8780, -4348, -2742, -8638, -14984, -17908, -20264, -16773, -13709, -27545, -18885, -13457, -3686, 565, 2909, 13656, 28987, 18343, 11794, 9428, 9338, 7726, 4060, 2377, -15029, -33782, -30777, -18282, -14201, -25767, -15744, 2866, -10227, -9686, 2168, 7485, 3976, 1587, -11336, -16082, -25261, -27453, -28067, -16094, -11843, -35785, -42096, -36028, -30962, -19165, -4863, -11088, -19611, -9705, -3249, 2032, 1038, 11362, 9953, -3621, -29220, -16859, -3159, 6903, 17642, 17416, 15622, 26748, 19395, 12880, 2633, 10324, -777, -14477, -10602, -10980, 1687, 12280, 25596, 22847, 22213, 10802, 3340, 1013, -2056, -14937, -26017, -18874, -12173, -15208, -6234, 10547, 926, -1631, 90, -834, -7415, -17414, -24313, -8459, -1622, -1067, 9153, 4251, 1124]
11230A124R801J4118N085p371L234R989j9804k9199j0459P275J1352N121J831
11217B097r815r529J6721L397k636j4969n044K610Q60J2362n98Q21j610j8126
11203b3459j0008J3634N522p98M246O832k2835p336J0358O485J2801O327l024
11190a255j880l222m840l033j7849r102J8595J6875O45k611j3656J140N727J8219
11176C753l352L130P226j466j1132J3710J939j5561J105j4804N51l654Q919O491
11162c145k1992j0818R868K2449J2627q029j103o053m442J4313Q771k855k969
11149F622n141j1381j0609L151M890J4739j024j0528P875J0158k1388N114P162
11136c60j0317K73l612J334R98j478j839J9804J9283j0733n604R879J7030J5150
$$ y = [1124, 10925, 25043, 30128, 22757, 25991, 35980, 16176, -13023, -23482, -16207, -4855, 266, 2097, -7718, -17247, -526, 2871, 235, -14734, -19778, -17168, -16308, -3946, -4544, -3723, -5333, -23459, -33467, -19833, -14311, -15109, -10863, -4031, -26866, -34202, -23844, -17359, -4558, 1769, -1255, -3135, -6357, -11197, -14230, -32079, -41181, -22586, -5711, -5066, -7677, -21333, -20193, -14466, 3753, 401, 3531, 10757, 9291, -1841, 11869, 13808, -1753, -648, -15452, -14901, -18555, -9636, -3145, -25137, -35955, -26087, -3638, 8989, 960, -143, -6196, -10638, 3675, 12446, 9591, 6622, 1481, -9900, -20509, -17358, -12468, 2271, 1247, -9281, -1406, 8752, -12636, -7522, -360, -10677, -10404, -14016, -12682, -11684, -13162, -15001, 4803, 24086, 13353, 7749, 17628, 34658, 49808]
11122D9808j4615r911j5998j2208p979J751J3397l29j456j309J3425q697j2817
11109f938K409J0543Q023k167j5718l434M33J2698L929k509K320m881j8560J5954
11095B102m603J1400j415j4308M030Q786K034q301j7212r282j884J4877M829o190
11081a5137J5703L494m948j2344J5095j202o358J944J0816R711J4523M609j443
11068C4463M33J91p529O271J2111N627M445K634J1503K2255J4389L5462O8250
11055B10505R6012J41709K11157K02208J20325k3127r1899j05730r4602r3855
11045E72703j04364j06509r7480q3266n1096l3571k0545k0577m520j195j4021
11034C5559l358J986N583o226j634O221j2825p566r242q927J0047Q752J5953R97
$$ y = [49808, 35193, 25282, 9284, -2924, -10903, -9152, 4245, 3916, 2460, 1151, 14576, 5879, -6938, -4529, 6014, 14037, 11870, -3848, -7282, -6849, 5849, 9778, 7269, 9589, 4708, -13852, 2102, -2501, 8899, 7484, -6824, -2794, 5992, 8026, -275, -17487, -26769, -28653, -13776, -8947, -15137, 566, 4060, -888, -13232, 1863, 661, -5697, -3753, 7063, 16774, 31297, 35906, 34463, 34896, 35087, 27558, 33829, 45940, 51567, 56012, 58646, 70149, 92404, 106793, 142255, 210505, 306517, 448226, 659383, 861591, 981916, 958789, 866890, 761160, 666558, 572703, 468339, 361830, 264350, 181084, 129988, 96417, 75872, 55295, 50775, 49580, 35559, 32201, 34187, 39770, 33544, 31910, 38131, 25306, 17740, 8498, -429, 9618, 18370, 34323, 35320]
11020C5320k533j0856k0451M119j297M579K356J3086P119Q794k274k3999L62K930
11006A7255J847O586N38q072n264J3660J0526k729k3718n455K440j685M3J4920
10992B0892j5715j5151n07Q232K0530o099J63K74l886M404j911J768k42p479R591
10977A4864j3512n625R541M896j0554l882K313j1501n719L342p07M78J0827l749
10963h988J78m005J070L081N873K483O734p743j3439n003o854J2980K220m839
10949a6252j0438K03q858q587j3538q831L986r25K1779K8549o192J5499o836r676
10935b0117N471J6425l881L710k85k773J393q613O768j3903q353n81j0841J5664
10921a9916J1890L642J2239J7907o032j1292j5269L349Q781P57J417R175r258
$$ y = [35320, 32787, 21931, 1480, 5599, 4302, 8881, 11237, 24323, 31442, 40236, 37962, 13963, 14325, 17255, 19102, 25688, 26226, 18154, 12890, 26550, 37076, 34347, 10629, 5174, 7614, 5929, 5972, 20892, 5177, -9974, -10481, -2249, 18281, 12182, 12345, 12619, 8733, 13137, 11226, 12994, 12752, 5273, 14864, 1352, -4273, 5268, 10164, -390, -4272, -1959, -13460, -19179, -15837, -16544, -16066, -5239, -8988, -8810, -12815, -11745, -8664, -2791, -308, 6426, -1317, -14756, -19759, -26613, -13633, -11413, -16252, -26690, -26487, -35345, -43932, -57470, -66301, -62315, -63240, -41461, -12912, -19104, -3605, -10441, -20117, -14646, 1779, -2102, 1608, 1323, -1450, -57, -8670, -1902, -15805, -24158, -24739, -35580, -19916, -8026, -4384, 7855, 25762, 19730, 8438, -6831, -3482, 5299, 6056, 7473, 16648, 7390]
10908G390m502j5700r594Q541K034K535J4916J2292J1367N758J2425o428k890
10895C8144K0782K6246J2897M43k0178L628R881j7678j2744k3573q682p175n20
10882B1471M983p108l294o580j7019J783n271j6983N240J2151N757R32o517Q757
10868a698l149o719J0942m530o772J3416P313j7134M212J3875J1759j826p386
10855A2303N112M897j1700J505P213j2630q826O887J1215M015j269r568k443J0524
10841A7235L635r70O327J4870Q469q74k6950k5361j4431q836j3087N320L1937
10828b716L6354K9425K2687J2056P425J7231J0744P577K5624M4411N7653J15067
10816C83538K25637L70000M04554O022k61964j92114n2464k8150j41816j90709
$$ y = [7390, 2888, -12812, -22406, -13865, -11831, -9296, 5620, 17912, 29279, 35037, 47462, 41034, 38144, 58926, 85172, 98069, 98512, 78334, 81962, 91843, 74165, 61421, 37848, 29166, 21991, 21471, 26454, 19346, 16052, 9472, -7547, -5764, -11035, -28018, -22778, -10627, -4870, -3938, -10455, -1698, -4847, -11566, -624, -5154, -11926, 1490, 8803, -8331, -4119, 9756, 21515, 19689, 12303, 17415, 22312, 10612, 12117, 19330, 6700, -2126, 4761, 15976, 19991, 18722, 9154, 6711, 17235, 20870, 19900, 26227, 41097, 49566, 48692, 21742, -3619, -18050, -26886, -39973, -34653, -2716, 33638, 63063, 85750, 97806, 105231, 122462, 133206, 140783, 166407, 210818, 268471, 383538, 609175, 979175, 1383729, 1389751, 1127787, 935673, 883209, 855059, 713243, 522534]
10806E22534j66839r9964m3340l6442j3437j4016K96M073q532k4369m7969o6280
10794E715m5224k5113M534J572O438K182K185K3199K2201O31o828J878J2903K466
10780H739O833o63j1907n302N113q53Q686J0124Q568p58J8047J5660Q10j2527
10766E0570j0200o796j3805j059R197n038j781O961J2104M247n600N930m594J1799
10752E1935k850M045J019K59L570r398L859J0475k748j3253K471R293p241O90
10738E2126o65m409r42p12J771L372N96N385R393K2948K463K1350K3853J6683
10724A53212K5911K9868K5885N1498J09063J72432K43837K43773J32522l729r5330
10713A088942j18040j12544j14706j32238j41923j05374n5890m0451j7633k830
$$ y = [522534, 355695, 255731, 212391, 175949, 162512, 148496, 148792, 152865, 144333, 119964, 71995, 5715, -39509, -64622, -60088, -58516, -52078, -49896, -47711, -24512, -2311, -1680, -8508, -6630, 6273, 8739, 15572, 14909, 3002, -2300, 2813, 1960, 10646, 20770, 29338, 28580, 46627, 62287, 63097, 50570, 40370, 33574, 19769, 18710, 27907, 22869, 21088, 28049, 40153, 44400, 38800, 44730, 40136, 51935, 49085, 53130, 54149, 54408, 57978, 48580, 52439, 62914, 60166, 46913, 49384, 58677, 51436, 52126, 51461, 47052, 46110, 45398, 47169, 50541, 51137, 56522, 65915, 88863, 91326, 112676, 136529, 153212, 179123, 208991, 234876, 286374, 395437, 567869, 811706, 1055479, 1188001, 1184272, 1088942, 970902, 858358, 743652, 611414, 469491, 364117, 308227, 267776, 250143, 247313]
10703B47313j0525J915r026j08J0282J6355M570j2894K056J0295K866j2707K3894
10690B74286J5046J8809L2156L7819K9423L1159L1377L2508L4222L1895J2352
10679E81052J8583J2398L2718M9678L8254L6499M7100O2297Q2497R7150R1293
10668A149519J06517J08597J25667J79383K71906L68216L82173L18365K70232
10659C280575L19642M57328N98325O38316O26427O75003Q05746R97648J204158
10650I603168J487914J984843K778662M029738O023227R354479J5157574K4653249
10642G5072854L6440726M1597990K8514536M110104j5683008j9345929j5893947
10635A34813326j6201603k0451845k3043554k0718905j5335098j0232130o715555
$$ y = [247313, 236788, 238703, 229677, 229569, 239851, 256206, 260776, 247882, 249938, 260233, 263099, 250392, 274286, 289332, 308141, 340297, 378116, 407539, 438698, 470075, 502583, 536805, 568700, 581052, 599635, 612033, 644751, 694429, 732683, 769182, 816282, 878579, 961076, 1058226, 1149519, 1256036, 1364633, 1490300, 1669683, 1941589, 2309805, 2691978, 3010343, 3280575, 3600217, 4057545, 4655870, 5294186, 5920613, 6595616, 7401362, 8399010, 9603168, 11091082, 13075925, 15854587, 19884325, 25907552, 35262031, 50419605, 75072854, 111513580, 153111570, 181626106, 185736210, 170053202, 150707273, 134813326, 118611723, 98159878, 75116324, 54397419, 39062321, 28830191, 22114636]
10628B2114636m532927l103892k166132j576105j224512j082953r65109p70303
10620F692703n46752l52439k51235k20575k68340k79579k30631k18272k79832
10611D045048l68847m00200l56489l04426k82944k60542k28887j80467j50017
10602A512229j19717r7852q5740p1259o8435p1738p8435p0335l7718j8828l1205
10591G60967j6776n834Q70j2166j5233k1207k3215l6983k9263k5619j6779j3911
10579E44851j9516j2942j6560k373P81j2496j7075M214Q097P302O570k0501k1215
10566D49137k3146j828J20j4061p210j0474j9967p828j5439j3252p438j066p884
10553C19664j9078J1485J1223j822J7456J1640j4817r179j4890j5418m730j6429
$$ y = [22114636, 17581709, 14477817, 12311685, 10735580, 9511068, 8428115, 7463006, 6692703, 6145951, 5793512, 5542277, 5321702, 5053362, 4773783, 4543152, 4324880, 4045048, 3676201, 3276001, 2919512, 2615086, 2332142, 2071600, 1842713, 1662246, 1512229, 1392512, 1294660, 1208920, 1137661, 1069226, 997488, 919053, 848718, 811000, 792172, 760967, 744191, 738357, 739227, 727061, 711828, 690621, 667406, 630423, 601160, 575541, 558762, 544851, 525335, 512393, 495833, 493460, 494241, 481745, 464670, 468884, 476981, 484283, 490853, 470352, 449137, 425991, 424163, 424283, 410222, 403012, 392538, 372571, 364743, 349304, 336052, 328614, 327548, 319664, 300586, 312071, 323294, 321472, 338928, 350568, 335751, 326572, 311682, 296264, 291534, 275105]
10541B75105n396O562k2093j4922M428K053j2976j077L93J8758K1521O621J057
10528B80034j6101k3544j9145k9500p887R983J3712J6438N413P725L8502N6073
10516C31703N2043L4008P227r467n73K5534K7459l400j9799l6046m5074l6164
10504C27451j9053j3370j9536o697j3067k349k0233k2955l5518k0228K1929J2234
10492A88608J4705O279O202R112K1831J6217L893k0601l6932l7962l0530j5000
10480A25822j1964k3245m292j2853j8886M681M714m944K666O886P903K428n255
10467G3661L743J1689K0507J7841K2560J6134j1266k4829k3154o726J553n067
10455I6646q042j0097J1975J1723M333J8400L5855R39j2329k739J7573J4586j1204
$$ y = [275105, 269709, 276271, 254178, 239256, 243684, 245737, 232761, 231684, 232077, 250835, 272356, 278977, 280034, 263933, 240389, 221244, 191744, 183857, 193840, 207552, 223990, 229403, 237128, 275630, 331703, 383746, 417754, 424981, 415514, 414941, 440475, 467934, 464534, 444735, 408689, 363615, 327451, 308398, 295028, 275492, 268795, 255728, 253379, 233146, 210191, 174673, 154445, 176374, 188608, 203313, 209592, 215794, 224906, 246737, 262954, 266847, 246246, 209314, 171352, 140822, 125822, 113858, 90613, 86321, 73468, 54582, 59263, 63977, 59033, 61699, 68585, 76488, 78916, 73661, 77404, 89093, 109600, 127441, 150001, 166135, 154869, 130040, 106886, 100160, 101713, 96646, 88604, 78507, 90482, 102205, 106538, 124938, 160793, 161732, 149403, 146664, 164237, 178823, 167619]
10442A67619j7126k0473o090q493j1708q207o213m63o564J354K709K3213J0075
10429A19633J567J860K536J269k969j8740j7289p427n237j4386j5616L747j643
10416D7305R439R530J7425K4331J932L288K0497m023k2880L683j5576j7225j052
10403G6674p730j2145j8868q165K248O239J5232L9873L3111J2063P946n810L512
10390A44180o694p157K4217K4137k915j2731q187p081n057M116m08j4540P76K925
10376A35581l312k680K0601J3961k267j0426k816j844R517J3399K47m8034n0601
10363G1326k9736j7758l738k471p932m748M544N724J0714K9824K9591N04o896
10350G8948k713J4381K429l536Q503j1123L115J4324K305l063P276J4667J2899
$$ y = [167619, 150493, 130020, 123930, 115437, 103729, 95522, 89309, 88846, 82282, 83636, 86345, 109558, 119633, 121200, 123060, 125596, 126865, 123896, 105156, 87867, 80440, 75203, 60817, 45201, 48948, 47305, 56744, 66274, 83699, 108030, 109962, 113250, 133747, 129724, 106844, 110527, 94951, 77726, 76674, 68944, 56799, 37931, 29766, 32014, 38253, 53485, 93358, 126469, 138532, 146478, 140668, 144180, 137486, 130329, 154546, 178683, 175768, 163037, 154850, 147769, 142712, 146828, 146420, 131880, 132656, 135581, 132269, 129589, 150190, 164151, 161884, 151458, 148642, 146798, 156315, 169714, 169961, 121927, 71326, 41590, 23832, 20094, 17623, 9691, 4943, 9487, 15211, 25925, 55749, 85340, 85844, 78948, 76235, 90616, 93045, 89509, 98012, 86889, 90004, 104328, 106633, 103570, 110846, 125513, 138412]
10337A38412m43J4820J4220o200j8233k4983l339J2063j1679j3062j5284J0931
10325I7223N869K1952J3465j8828k6222j9893R968J3015Q292J1858n07N837q463
10312A13566n215m053l180k073J7578p44q794q292P897J0065q063j0471m993J4048
10298A07276K0628J721j5429M53L193k61Q378M057o741O553P238n768k872J7208
10284A45634J0843K979m628o010K75M905J2822Q659k276M631J5040J9600K2343
10271B34817J0009L218k487J0883J4752J4991J8135J0910Q831p560k041Q233L3607
10258C56298K3727L0218K3748K9417J8673N4591M4732M0273M1389K7695K4016
10247G14777N887L600L1803L7384N1238O1821N6566N3650P1764Q3121J03559J27353
$$ y = [138412, 137969, 152789, 167009, 160809, 142576, 117593, 114254, 126317, 114638, 101576, 86292, 97223, 103092, 125044, 138509, 119681, 93459, 73566, 83534, 96549, 104841, 116699, 116192, 122029, 113566, 108351, 104298, 101118, 99045, 116623, 115879, 107085, 98793, 106690, 116755, 108692, 98221, 93228, 107276, 127904, 129625, 114196, 114649, 117842, 117581, 125959, 130016, 123275, 129828, 137066, 131298, 128426, 145634, 156477, 159456, 154828, 148818, 149093, 153998, 166820, 175479, 173203, 177834, 192874, 212474, 234817, 244826, 248044, 245557, 256440, 271192, 286183, 304318, 315228, 324059, 316499, 314458, 322691, 356298, 380025, 410243, 433991, 463408, 482081, 536672, 581404, 621677, 663066, 690761, 714777, 720664, 724264, 756067, 793451, 844689, 906510, 963076, 1016726, 1088490, 1171611, 1275170, 1402523]
10235A402523J27636J48160K15815L08086M02988M06947L52453K86770L26093
10226C977471M97014O96605Q78623J022338J129631J162174J204863J344527J671806
10217A3585052K264639L188069M671362P257053J1826300J9707342L1266736M1314856
10209A35081409L7319146J5582378r050597j9886117j7711636j5453366j8438106
10202A07443111k2441501k2306859j7735717j2106454p805912n096255l526721
10195A6423692k643016k078022j679333j330905j059956q53384o13143l27710
10187E838223q4119J9093j17145l23986m48056m50758l93576l61089l82959m32499
10177B863129l95071k95958k11366j68971j35275r1765m5256j4021l8310m1071
$$ y = [1402523, 1530159, 1678319, 1894134, 2202220, 2605208, 3012155, 3364608, 3651378, 3977471, 4474485, 5171090, 6049713, 7072051, 8201682, 9363856, 10568719, 11913246, 13585052, 15849691, 19037760, 23709122, 30966175, 42792475, 62499817, 93766553, 135081409, 172400555, 187982933, 178932336, 159046219, 141334583, 125881217, 107443111, 85001610, 62694751, 44959034, 32852580, 25046668, 19950413, 16423692, 13780676, 11702654, 10023321, 8692416, 7632460, 6779076, 6165933, 5838223, 5754104, 5773197, 5656052, 5332066, 4884010, 4433252, 4039676, 3678587, 3295628, 2863129, 2468058, 2172100, 1960734, 1791763, 1656488, 1564723, 1519467, 1505446, 1467136, 1426065]
10167A426065o8789r0293j00781o8881q0501p9674p2227o8598l9825k0474k1611
10156G14411l131j4479m4475k9421q723l246j6561k0915j7932k9325k6218k5408
10144D74577m981N50Q525j6185j4535p953K425j9064o352m180q929n243m558j6601
10130C77496j7900j7320M017P114L126q502j781n165j2934J025k636j0011m208
10117C12321q826p378J144r695J0181N170j1391p557o174q35j2927J609O05j1193
10103B55054q189p871q881o37j290k0550r274N695L173p348k615P530m562j0226
10089A90009J2022J4101K156R534P420J9489J6197M971J580j3152k0993j1575
10077B31759q210j8753k0331O001O311L049n270k737K439n773k905l728j3504
$$ y = [1426065, 1357276, 1266983, 1166202, 1097321, 1016820, 937146, 864919, 796321, 756496, 736022, 714411, 711280, 696801, 652326, 622905, 614182, 610936, 594375, 573460, 555528, 526203, 499985, 474577, 469596, 470146, 478671, 462486, 447951, 439998, 442423, 423359, 417007, 412827, 403898, 398655, 394097, 377496, 359596, 342276, 346293, 353407, 356533, 348031, 346250, 341085, 328151, 329176, 326540, 316529, 312321, 303495, 296117, 297261, 287566, 297747, 302917, 291526, 283969, 277795, 276960, 264033, 265642, 266247, 255054, 246865, 238994, 230113, 229476, 228186, 207636, 198362, 204057, 207230, 199882, 197267, 204797, 200235, 190009, 202031, 216132, 218288, 227822, 235242, 254731, 270928, 275899, 277479, 264327, 243334, 231759, 223549, 204796, 184465, 190466, 196777, 199826, 194556, 191819, 194258, 188485, 185580, 181852, 168348]
10064A68348k4900J1516K4257J8786R087J0498k503P231K0054J9346p480m2651
10052B11589k5184j8986m0816l1807k2921M455o10r285o423P728J7624J4663R404
10039A09431j3338p908l616j3916o070j571p086k924Q896o09O449j3509j3251
10026D0978J074N173n466N0l378k066J1084K4444K0534K4581J7189Q948N989J7057
10012A66191k1621k7799j4950l059R4j5422j2504J3627J835J7397N149j9128P311
9999I7121J3369j5816j0309J1120J1989r249R95k56j3690r808q414j1699K748
9986E8101Q383K784J0921J0134K481K0234L447j0102m406k698J456P395M820p201
9972A05749o961j3640j7681m134j0934J0174N203Q726J1758J6380J7542O468L668
$$ y = [168348, 143448, 154964, 179221, 198007, 207094, 217592, 215089, 222320, 242374, 261720, 254240, 211589, 186405, 167419, 126603, 94796, 71875, 76330, 75720, 66435, 60012, 67740, 85364, 100027, 109431, 96093, 88185, 84569, 70653, 64583, 63012, 55926, 53002, 61898, 61289, 67738, 54229, 40978, 42052, 47225, 41759, 41809, 38431, 36365, 47449, 71893, 92427, 117008, 134197, 143145, 149134, 166191, 144570, 116771, 101821, 98762, 98856, 83434, 70930, 84557, 86392, 103789, 108938, 89810, 97121, 110490, 94674, 84365, 95485, 107474, 98225, 99220, 98964, 85274, 75466, 67052, 55353, 58101, 66484, 69268, 80189, 90323, 92804, 113038, 116485, 106383, 101977, 99279, 100735, 108130, 112950, 105749, 98788, 85148, 67467, 63333, 52399, 62573, 67776, 76502, 88260, 104640, 122182, 128650, 132318]
9959A32318m984n550o531k5312j2291K866R441L231J1702j085j8745n986J7772
9946I6846J3960L213k237m061m636j383J4355L673j7079p759j2962j3283J4052
9933H2699k373q009L528j1300m486P791j040O020M220P314J0056n379m292p518
9919G7231J192J0304Q35n338n992M614L263O4J682j4150l653m637L809M284K1887
9904I5395J2948J7224L957K707J638o888J486m958k1219j5830L220q284q121N883
9890G9158k974j4811J8497J6943Q840r478k6086j0486J6107J2855R699p475m112
9877H6677k376j7264n95k358j5362Q915R971P789j5966r997Q814Q53J106N087
9863F5294J820O327j5928p691L298O255j4667M788R167P744J1635O219N705n386
$$ y = [132318, 127334, 121784, 115253, 89941, 77650, 80516, 89957, 93188, 104890, 103805, 85060, 79074, 96846, 110806, 114019, 111782, 107721, 103085, 101702, 116057, 119730, 102651, 94892, 81930, 68647, 82699, 80326, 72317, 75845, 64545, 60059, 67850, 66810, 72830, 77050, 84364, 94420, 89041, 84749, 77231, 78423, 88727, 89562, 84224, 78232, 82846, 86109, 86173, 87855, 73705, 70052, 65415, 69224, 73508, 95395, 108343, 125567, 129524, 132231, 133869, 126981, 128467, 123509, 102290, 86460, 89680, 81396, 73275, 79158, 76184, 61373, 79870, 96813, 105653, 96175, 70089, 59603, 75710, 88565, 98264, 90789, 86677, 84301, 67037, 66442, 64084, 48722, 57637, 67608, 75397, 59431, 49434, 58248, 59101, 60207, 65294, 67114, 73441, 57513, 49822, 53120, 59375, 44708, 49496, 58663, 66407, 78042, 84261, 89966, 84580]
9849H4580r51N364m003J1416J0603o797P410N2121K2962J7738L789j1766k5633
9836A66833j7302J649o596k1197o956n283M054o362K657j1368j4879o624L276
9823H1902n722j1811J341M130R057P210J153Q269r7j1771J2302J2455o374R690
9809A11734K2653J1291J8924J1523K9956N7002P2793R7295J63247K15782K05977
9798A018177P1768m6258j09351r8190q1501j05430j13173j07012r9167p2873m7468
9787B09522j3994j3039l0208j4890o332O007r444k1199j4591q198l005L625J2035
9774I6289j029q660n196J0454J2894M106k943j0406K109j3146p123Q01P903j1495
9760G4558j5615J8984J6863P39r708j2874Q164O437L023n923N048j1634j8870
$$ y = [84580, 83629, 88993, 84990, 96406, 107009, 100212, 107622, 159743, 182705, 200443, 204232, 192466, 166833, 149531, 151180, 144584, 123387, 116431, 111148, 115202, 108840, 111497, 100129, 85250, 78626, 81902, 76180, 64369, 65710, 69840, 78897, 86107, 87260, 95529, 95432, 83661, 95963, 108418, 102044, 111734, 134387, 145678, 164602, 176125, 206081, 263083, 335876, 433171, 596418, 812200, 1018177, 1089945, 1043687, 934336, 836146, 754645, 649215, 536042, 429030, 329863, 256990, 209522, 195528, 182489, 152281, 137391, 131059, 137066, 127622, 106423, 91832, 83634, 80629, 84254, 96289, 95260, 86600, 81404, 91858, 104752, 108858, 105915, 95509, 97618, 84472, 77349, 78150, 86053, 74558, 58943, 77927, 94790, 95529, 85821, 72947, 81111, 87548, 90571, 84648, 89696, 78062, 59192]
9747E9192J756J3422J910Q075q184n784J1511m293j6745p802L60M376J2109j0730
9733E9173j2248J2034J4079N981p932M340J0468Q108L065j2637l375R078n182
9720H4952j3405M514l728K520N093m263J426m239O610P839n237m907k752p649
9706F6774R413J9322K22r641l636K948p751N151N815O00k90r40l150O176L93r71
9690I0435l582N52Q134j557j0097K063m835P913J4216p687j8768J5862O591J8377
9676A17617J868p62n772j0920j030J2323M709p3J1968P110r500J3634K893j2359
9662A31706j8421k68j1369n127o489j0354Q103R385Q027q223q007j5327l620n166
9648F4850q561J4343K042L699Q950L125k105q517j9385p256J5080O575o889k022
$$ y = [59192, 60948, 74370, 76280, 84355, 76171, 70387, 81898, 77605, 60860, 53058, 53418, 57794, 69903, 59173, 46925, 58959, 73038, 79019, 71087, 75427, 85895, 94003, 97068, 84431, 81056, 90134, 84952, 71547, 76061, 72333, 74853, 79946, 75683, 77109, 72870, 79480, 87319, 82082, 77175, 74423, 66774, 76187, 95509, 95731, 86090, 82454, 85402, 77651, 82802, 88617, 89217, 88927, 87987, 84837, 91013, 91406, 90435, 86853, 87405, 95539, 93982, 83885, 85948, 81113, 89026, 103242, 95555, 76787, 92649, 99240, 117617, 119485, 118723, 112951, 102031, 101001, 113324, 118033, 117960, 129928, 137038, 127538, 141172, 144065, 131706, 113285, 113017, 101648, 96521, 90032, 79678, 87781, 97166, 105193, 96970, 88963, 73636, 70016, 64850, 56289, 70632, 72674, 76373, 85323, 88448, 86343, 77826, 58441, 51185, 66265, 72840, 65951, 63929]
9634F3929R158q551R330K2161j621q890J0748n008M8N323J7162J9173L497O271
9620A42730L558J974J9611K0813J3164J8798K8551K4784J9726M3146M7927N8831
9608D43613P8469Q8670R4118J26620J77140K03107J95163J90341J75959J23101
9598A896301P4009K9209n3642r6899j34165j82286j85259j78097j66968j47248
9588H54955j41766j12817r7858p7301n5592m3558j2693r756j4119k4638l8736
9577B26121n0010m177l7j8716n923P563M579j1118j9756q471p075j0882j0973
9564I1125m591N409J4444m067n646m218N214l391n441n44j7151N86O042R912J9139
9549A06822M051j2122J799J0871l429j5295Q082P911n443m368j3751J3347Q153
$$ y = [63929, 73087, 64536, 73866, 96027, 94406, 85516, 96264, 91256, 91304, 96627, 113789, 132962, 136459, 142730, 146288, 148262, 167873, 188686, 201850, 220648, 249199, 273983, 293709, 336855, 384782, 443613, 522082, 610752, 704870, 831490, 1008630, 1211737, 1406900, 1597241, 1773200, 1896301, 1970310, 1999519, 1945877, 1848978, 1714813, 1532527, 1347268, 1169171, 1002203, 854955, 713189, 600372, 502514, 425213, 369621, 326063, 313370, 303614, 289495, 264857, 226121, 176111, 171934, 171897, 153181, 147258, 154821, 159400, 148282, 128526, 120055, 112980, 102098, 91125, 86534, 91943, 106387, 102320, 96674, 92456, 97670, 94279, 88838, 88294, 71143, 71729, 77771, 87683, 106822, 110873, 98751, 100550, 111421, 107992, 92697, 100779, 108690, 103247, 98879, 85128, 98475, 106628]
9536A06628K562o861m651n97N774M280J071N608l861l894j4106o923J0843J5560
9522A11433J0679j1827j031J4060l758k5127j1213J0504K2098K757k9430m3380
9510D5765p112J8247n150l0230n0393l4853j029J4391R082J2712R763K4296K1023
9497B6512K2490K4210P927N713Q58N157N68m351r86m307O225J1525R769q170m171
9482I8969O707J1816r523j1612j41p026j150R677R196J6021Q761K3939O491m187
9468A57938j3266j726j1438j1970k1279m19J0812K3055L0801L3156n182l816L1543
9455B18209O3875Q2258P8478J3235l9235j2401J2870k8067n0185k0740j9762l5852
9443B62683k3052j8868l3457k4541k260q914j999J2674M070j251q887j4958r879
$$ y = [106628, 109190, 102329, 97678, 97081, 102855, 107135, 108206, 113814, 109953, 106059, 91953, 85030, 95873, 111433, 122112, 110285, 109254, 123314, 119556, 94429, 83216, 93720, 115818, 118575, 89145, 45765, 38653, 56900, 51750, 21520, -28873, -63726, -64755, -50364, -41282, -28570, -18807, 5489, 26512, 49002, 73212, 81139, 86852, 87710, 92867, 93435, 89084, 88098, 83791, 90016, 101541, 111310, 103140, 98969, 105676, 117492, 107969, 96357, 96216, 89190, 88040, 97717, 106913, 122934, 131695, 155634, 162125, 157938, 144672, 142946, 131508, 119538, 98259, 97840, 108652, 131707, 162508, 195664, 190482, 186666, 218209, 282084, 364342, 442820, 456055, 416820, 404419, 417289, 389222, 339037, 318297, 298535, 262683, 239631, 220763, 187306, 162765, 160505, 151591, 149592, 162266, 166336, 165085, 156198, 141240, 131361]
9430A31361J0459j2258p708L298j2938r998n169J1528J3565K3496K1857J5493
9418A82986J0806P750n491j4557J1464n048k3735l286J4266j0261r641L334J6639
9405A75226R025P712p906O486k57J0606n067P696M108k0970k0775j9212k2932
9392A23740m7136n4011l4364J3557O3600Q3897O0938M4768K7566J9837J4867P218
9380C24477P860K3387J2591k574L09J3747q992q707p742J5715R008m801j2244
9367C62034n145M0374L4222J2417J125k710j2588L013L309K0374p69l1457j09736
9354C14463j49335p6054k3953k0986l4707l6913K104M7333N5760N9489N8382L1318
9342B26901P113J0769N741M20J2097P396K675M860J6404L4955M2409L8060K6610
$$ y = [131361, 141820, 129562, 121854, 125152, 112214, 102216, 97047, 108575, 122140, 145636, 167493, 182986, 193792, 201542, 196051, 181494, 192958, 187910, 164175, 160889, 175155, 164894, 155253, 158587, 175226, 184251, 191963, 184057, 190543, 190286, 200892, 195825, 203521, 207629, 186659, 165884, 146672, 123740, 76604, 22593, -11771, 1786, 65386, 149283, 210221, 254989, 282555, 302392, 317259, 324477, 332337, 355724, 368315, 365741, 366050, 379797, 370805, 362098, 354356, 370071, 379079, 374278, 362034, 356889, 397263, 431485, 443902, 445027, 442317, 429729, 432742, 436051, 456425, 455656, 424199, 314463, 165128, 89074, 65121, 44135, 9428, -27485, -25381, 21952, 77712, 137201, 195583, 226901, 234014, 244783, 250524, 250944, 263041, 270437, 273112, 277972, 294376, 329331, 371740, 409800, 436410]
9329D36410j2436j482J435k4314n255l115m386L014K411m390n316k0869M202M3337
9315D09246M7234K6854O879j0785J7645l497k632J580J12P504j5547k9933J03
9302D54763K0962J8464K2064J5341M365l0602j7940n739L680R717J5950J8303
9290E29328J5260J4060J6874J7796L5288L1791P719K6305J8623J5254J1519P751
9278G47568J0831J0963J1242K9411J6691J1187P144q46K093K4230M3562K1452
9266I35528M0753P0267M5503M3216N6348M1843K1441N0725R5145Q7867O1742L6599
9254A586977J7833K7361M4054O5976O9815Q0849J17598J26767J51578J72714J79719
9243B641241J72878J64506J66196J66844J82921J75333J93632K55324L36205M20327
$$ y = [436410, 423974, 422492, 423927, 399613, 394358, 391243, 386857, 389871, 392282, 387892, 382576, 361707, 365909, 409246, 456480, 483334, 490213, 479428, 497073, 493576, 490944, 492524, 492636, 500140, 484593, 454660, 454763, 475725, 494189, 516253, 531594, 535959, 505357, 487417, 481678, 485358, 495075, 511025, 529328, 544588, 558648, 575522, 593318, 628606, 660397, 668116, 694421, 713044, 728298, 739817, 747568, 758399, 769362, 780604, 810015, 826706, 837893, 845037, 844191, 846284, 870514, 914076, 935528, 976281, 1046548, 1092051, 1135267, 1191615, 1233458, 1254899, 1305624, 1400769, 1488636, 1550378, 1586977, 1604810, 1632171, 1676225, 1742201, 1812016, 1892865, 2010463, 2137230, 2288808, 2461522, 2641241, 2814119, 2978625, 3144821, 3311665, 3494586, 3669919, 3863551, 4118875, 4455080, 4875407]
9233D875407N76896P49317R89124J295465J452249J117368M22196q3563j81072
9224A1213387j17118j33099n2724J54838M48085Q15506J147393J494911J977016
9215A6948195K606278L232441L824931M415632M991841N077286N112184O283769
9207E2492557Q687195J2085734J7022708K5037173L8730015O1583978R6217091
9200C11856451J29660097J02058110o954316o7435890n4710703l3379579l5742319
9193C45351851n7808647o9817998n9187699m0967521k7042158j8157290j2379009
9186E9991529q619500o608181n850291n215031m383865l644727l158674k790519
9178A9720741k407878k021274j703791j498152j340187j138441r65485q17764
$$ y = [4875407, 5452303, 6201620, 7190744, 8486209, 9938458, 11055826, 11478022, 11394459, 11213387, 11096269, 10963170, 10910446, 11065284, 11513369, 12328875, 13476268, 14971179, 16948195, 19554473, 22786914, 26611845, 31027477, 36019318, 41096604, 46208788, 52492557, 61179752, 73265486, 90288194, 115325367, 154055382, 215639360, 311856451, 441516548, 543574658, 536620342, 469184452, 414473749, 381094170, 345351851, 287543204, 217725206, 158537507, 117569986, 90527828, 72370538, 59991529, 51372029, 44763848, 38913557, 33698526, 29314661, 25669934, 22511260, 19720741, 17312863, 15291589, 13587798, 12089646, 10749459, 9611018, 8645533, 7827769]
9170G827769p07257o10657n16119m77706m45441l42087l07318k75544k58094k54476
9160C633070k51719k31419j81738j63818j97641k06776j47533r9636o6780q5069
9150B000941m7587l6173m5005m7212l9591l7201n2878q6815o5926o1923m4695
9139A435935l8546o4162o9386m1362j3146j3991q947m528l0245l1989j4509j557
9127A103567j3797j7605m1864k6755r940l5730m6512l4740j9837k8208l2136k6639
9115G69804j4898k3106k2467l5450j2610n984m080K399M116j4559p230Q008m325
9102F39618l0330k7042l0604k1405j229N953p608k6927k5494j8916j021J204q924
9089D47275j6913o434k0185k5739l559r836n566K2106M2321J5386l68J1660L7400
$$ y = [7827769, 7120512, 6509855, 5993736, 5516030, 5070589, 4728502, 4421184, 4145640, 3887546, 3633070, 3381351, 3149932, 2968194, 2804376, 2606735, 2399959, 2252426, 2152790, 2086010, 2000941, 1953354, 1917181, 1872176, 1824964, 1785373, 1748172, 1695294, 1608479, 1542553, 1480630, 1435935, 1397389, 1333227, 1263841, 1222479, 1209333, 1195342, 1186395, 1181867, 1151622, 1119633, 1105124, 1103567, 1089770, 1072165, 1030301, 1003546, 993606, 957876, 911364, 876624, 856787, 828579, 796443, 769804, 754906, 731800, 709333, 673883, 661273, 655289, 651209, 653608, 657724, 643165, 635935, 643943, 639618, 609288, 582246, 551642, 530237, 529008, 534961, 527353, 500426, 474932, 456016, 454995, 456199, 447275, 430362, 423928, 403743, 378004, 374445, 364609, 359043, 381149, 423470, 438856, 438488, 450148, 487548]
9076D87548O0880L0106J0606O115j5226m3607l3001j8511o265j4983l0283m3124
9064C90255l0816j5142q181K0453J5406K351l428j9945j7065j5235j8374j3304
9052B86975K9453L9665M1082K4048K9172M1257O6658N0985l8147j30051j27228
9041C13869q5886l4730k4127m5871o2893n4278k8357J7658J0246j2348n508K017
9029a0208J170R839K690j7112K498j2390j9486n297J8761J5858Q583k1221j4170
9016d0485j2257M200J0396K4805K861N772L8490Q7726Q4515L9004J2289K1676
9004B78992L5850j9913p0028m4893k6450k2783k3452p009K224J4272K9794K6187
8992A72791K3402K9255K0162p230j7975j7545p898l977j5081k8650j8619q446
$$ y = [487548, 548428, 578534, 589140, 595255, 580029, 536422, 503421, 484910, 478645, 463662, 433379, 390255, 359439, 344297, 336116, 356569, 371975, 374326, 370898, 350953, 333888, 318653, 300279, 286975, 316428, 356093, 397175, 421223, 450395, 491652, 558310, 609295, 571148, 441097, 313869, 227983, 193253, 169126, 123255, 60362, 6084, -22273, -4615, 5631, -6717, -12225, -10208, -9038, 801, 3491, -13621, -11123, -23513, -42999, -48296, -29535, -13677, -5094, -26315, -40485, -52742, -48542, -38146, -13341, -10480, -4708, 33782, 121508, 206023, 245027, 257316, 278992, 314842, 294929, 224901, 180008, 153558, 130775, 107323, 100314, 102538, 116810, 146604, 172791, 196193, 225448, 245610, 238380, 220405, 202860, 194962, 190985, 175904, 147254, 128635, 120189]
8980A20189k0216j5678n779m15K0430R645q364J1941O980M314J7042O703j0315
8967A36477M468p647o298k205j308p183M703J7402O555j628n50k571l947l625
8953A32643n794K207J2110P031P405L505J2165J5261L2585M8525O9841J08721
8941D46205R7379m097o4783m0048j3998k0601m1984o4877n5187k9575l0727k2694
8929A55013l482L874j0906k5378j5252l183J222Q347j0161p412L707L456M333
8916A04178N969L233j3687p333m339M066R280O71p936m96N70L257r172j660r089
8901G7512L119J777m295J0251J5531L2716M6577K9320J5266k4715m5924m139K0944
8888A73940J3932j6320o741k8935j5887o968j2732l467k260P305J1113k214q443
$$ y = [120189, 99973, 84295, 78516, 78101, 98531, 108176, 99812, 111753, 118733, 123047, 140089, 146792, 136477, 140945, 133298, 127000, 124795, 123487, 116304, 121007, 138409, 144964, 143336, 142786, 140215, 136268, 132643, 126849, 129056, 141166, 148197, 155602, 159107, 171272, 186533, 219118, 267643, 337484, 446205, 543584, 539487, 474704, 434656, 420658, 400057, 358073, 293196, 238009, 208434, 177707, 155013, 151531, 155405, 144499, 119121, 103869, 100686, 101908, 110255, 100094, 92682, 96389, 99845, 104178, 110147, 113380, 99693, 92360, 88021, 92087, 101367, 102038, 94102, 93606, 94176, 97433, 88261, 86601, 77512, 80631, 82408, 78113, 88364, 103895, 136611, 183188, 212508, 227774, 203059, 157135, 152996, 173940, 187872, 171552, 164811, 135876, 119989, 113021, 100289, 96822, 94562, 101867, 112980, 110766, 102323]
8875A02323k958J4617J1891K0736N0051N8492P5176J23628J92413K63022J88089
8864A097480l0632j40135j25544o3429n7101j16003j33919j03919o7324j9191
8854B40283l6156k8015j5972j1062j3718k3821k1318n249j041l139j76J76p582
8841G3210j0989o399r990J3039o565m552J7928K155j2144j2312P64N945N130K930
8827E8150K352R91R583O501J240j0750j6634m058q31J816J1492k193J075J4175
8813G2909K2609J9715M990l822K2356K4707L1518K8870L5121N2222O9562R4354
8801D75111R7524J27480J56911J89414K08568J97976J81784J53215J04809O5274
8791A958066j2836p5222r8581j38966j78241j90980j85300j75416j40318j39429
$$ y = [102323, 99365, 113982, 125873, 146609, 196660, 255152, 330328, 453956, 646369, 909391, 1097480, 1066848, 926713, 801169, 737740, 680639, 564636, 430717, 326798, 259474, 240283, 204127, 176112, 160140, 149078, 135360, 111539, 90221, 84972, 83931, 80792, 80616, 80792, 73210, 62221, 55822, 45832, 58871, 52306, 47754, 65682, 67837, 55693, 43381, 44145, 50090, 55220, 58150, 60502, 61493, 71076, 77577, 78817, 68067, 51433, 47375, 46544, 48360, 59852, 57659, 58734, 72909, 95518, 115233, 120223, 116401, 138757, 163464, 194982, 223852, 258973, 311195, 380757, 475111, 572635, 700115, 857026, 1046440, 1255008, 1452984, 1634768, 1787983, 1892792, 1958066, 1945230, 1870008, 1771427, 1632461, 1454220, 1263240, 1077940, 902524, 762206, 622777]
8781F22777j26308q5585o5517n8002n4911l6863j5281j4745j2809j4962k2045
8770A15749J208j9385j3678j2360j3414j1359k922k982k670J0507J6242J9028
8758H3964K2956N875j3033k7614j2268l731j0759N725N784l138p847j8942j9121
8745G851M702J4911N454O492j2599k367R255R908j270n473j2433j4016j8796m88
8731h869J896k658K450J9578j0178j6633r761m000M721M367R703J1359J6783K3976
8717D2734j708j483J2945k740j1936j9885o522j041p19r982k5507J874K1503K0041
8703A7574O877o000m213p95p89K590p609K000J7008J2347J945j0160m111o806
8689A9858m28o187o750p175Q806J0602M60P127N808j4603j2664O856O802M335
$$ y = [622777, 496469, 410884, 345367, 287365, 232454, 195591, 180310, 165565, 152756, 137794, 115749, 116957, 97572, 83894, 71534, 58120, 46761, 43839, 40857, 38187, 48694, 64936, 83964, 106920, 112795, 99762, 72148, 59880, 56149, 45390, 51115, 56899, 53761, 45914, 26972, 7851, 12553, 27464, 32918, 39410, 26811, 24444, 33699, 43607, 42337, 36864, 24431, 10415, -8381, -8869, -6973, -9631, -7181, 12397, 2219, -14414, -24175, -28175, -23454, -19087, -9384, 1975, 18758, 42734, 41026, 39543, 52488, 49748, 37812, 17927, 11405, 10364, 9645, -337, -25844, -23970, -2467, 17574, 24451, 18451, 14238, 13443, 12654, 15244, 7635, 9635, 26643, 38990, 40935, 30775, 26664, 19858, 19430, 13243, 6493, -682, 8124, 18726, 19186, 26313, 32121, 17518, 4854, 11710, 18512, 22847]
8675B2847J0279p131j7000p916l077r386J8643O409j2435l42J2251O051M944q296
8661A5841J631k063P173J700l471j933n450J676j279P234J7992J1013l011j1550
8647C5503j0146K4108p039j0143n959r048P7J2159J3548J2527j0760n565r54N071
8633D3379J529l432q723M080K303j2693j217j8060J0494J695n428j6568O499J114
8619D972r541r713M68Q052M626p31L693J5609l09p485P42J8727K243l023k8609
8604b79J537J8320O40K321J2768M53J2139N868J7909J8772J5612M34M976P993
8590A19463M763q159o978l933k18j194Q905J181K184p769Q736p38j3171j1936
8576I1136m77j3823k1674k3871J135P035j1459M74J931j5528k0425j2631P316
$$ y = [22847, 33126, 25995, 8995, 1079, -1998, -11384, 7259, 13668, 1233, 891, 13142, 19193, 24137, 15841, 17472, 15409, 22582, 24282, 20811, 18878, 13428, 15104, 13825, 21059, 39051, 50064, 47053, 35503, 25357, 49465, 42426, 32283, 26324, 17276, 17353, 29512, 43060, 55587, 44827, 39262, 38308, 43379, 44908, 41476, 32753, 36833, 39136, 26443, 25226, 7166, 17660, 19355, 13927, -2641, 3858, 4972, -4569, -14282, -13814, -5762, -1136, -1867, 1826, 17435, 17126, 9641, 10383, 29110, 31353, 28330, -279, 1258, 19578, 20218, 22539, 35307, 35760, 47899, 53767, 71676, 90448, 106060, 106494, 111470, 119463, 124226, 116067, 109089, 105156, 104938, 103744, 112649, 113830, 116014, 108245, 116981, 116243, 103072, 91136, 90659, 76836, 55162, 31291, 32426, 39461, 28002, 28476, 30407, 14879, -5546, -18177, -10861]
8563a0861P878O544N44P156M286k803J5056Q820J374j5602j2121q56L465R183
8549B2063L917J5504J811q519M089j0023o10Q95j3704j3144R128J8607q11P746
8535C6949j122r581Q419P072r076q489j8701n968N022j958R087M788o841k699
8521F902p147o460K0043J6500k1095J529J5663J662k2509j3897M783O768P24k36
8507C230o238J125P564j753M002j1480l776L20J0899l434k2307J6240J4655l229
8493E818J851O172p406M055J365k485k4524O087K135n335n925Q205P414R560J3635
8478B0622J0030M22J804j2627o956l722N78R450O961J2272k753k180l504m88l806
8463B6103J001j3804j0856P68P213p275r500J584p082L30O290L171J2053R571
$$ y = [-10861, -2983, 3561, 4105, 11261, 15547, 12744, 27800, 36620, 37994, 22392, 10271, 9415, 12880, 22063, 25980, 41484, 43295, 34776, 38865, 28842, 28232, 29127, 15423, 2279, 11407, 30014, 29203, 36949, 35827, 26246, 34665, 41737, 32661, 24172, 5471, -497, 4525, 2567, 11654, 16442, 9601, 6902, -245, -6705, 13338, 29838, 8743, 10272, 25935, 27597, 5088, -8809, -4026, 2742, 3466, 3230, -3008, -1883, 5681, 3928, 7930, -3550, -7326, -7006, 3893, 459, -21848, -5608, 9047, 5818, 7669, 13841, 6435, 10490, 11855, 9370, -15154, -9067, -6932, -12267, -18192, -9987, -2573, 6987, 20622, 30652, 31074, 32878, 20251, 13295, 9573, 10151, 19601, 26562, 38834, 36081, 33901, 30397, 29909, 26103, 27104, 13300, 2444, 3212, 10425, 3150, -6350, -4766, -11848, -11518, -5228, -2057, 9996, 19567]
8449A9567Q734m990j3161R75K0090p366j1440M619m816j2387q938P70J3702m582
8435G77M244N228N71q257J2435J285M320J2598j4866j4371p918L338K640l241
8421a217K084J3162P806q191p202K711j4002j9490p036j6130N163K5528J8701
8408A887j741j4638q006R986J7463q550j3094J2738p084L732N227J869L805O321
8394I915N938m771k1442j7340N158O605p016P783J9530K07j5345j14J3038K871
8380E017L33J0249O517k8589q336M042R809L454o534j4634R315J0465p633k985
8366i510J2328J4464k0440J079K9966N582k169M17J358k766j0575q590m981O69
8352F832J00K61p598k191j8083r863J7418J3935L159p72J044R124j705l609r448
$$ y = [19567, 28301, 23311, 10150, 11125, 31215, 23849, 12409, 17028, 12212, -175, -9113, -8343, 5359, 777, 5021, 10249, 10820, 2563, 14998, 16283, 20603, 33201, 18335, 3964, -3954, -616, 2024, -1217, 867, 14029, 21835, 13644, 6442, 9153, -4849, -24339, -31375, -47505, -42342, -16814, 1887, 146, -14492, -22498, -12512, 4951, -3599, -16693, -3955, -11039, -7307, -2080, -211, 3594, 9915, 15853, 11082, -10360, -27700, -22542, -15937, -22953, -15170, 4360, 4567, -10778, -10892, 2146, 5017, 5350, 15599, 22116, -6473, -14809, -10767, -958, 2496, -4038, -18672, -9357, 1108, -6525, -9510, 2818, 17282, -3158, -2079, 27887, 33469, 31300, 31717, 33075, 30309, 19734, 11144, 6163, 6832, 6932, 7193, -405, -2596, -20679, -30542, -13124, 811, 3970, 3198, 4242, 13366, 11661, 8052, -1396]
8337a396n750j3449J1994J2992P96j9030j8133P673J6182J7475P128j2435j4902
8324a0855M22Q097j51j2344o686R044N046J2156J176q290m283K436j730N931Q152
8309H121j5115p872r89Q745J301M421k138J1646J1880Q3j3767R099K0020l60k3648
8294A1427k5068L673M876O04o417P436p063q517N255K916k608J1964K022J1126
8280A1626m944n489k893K054p336o391k14L422R390J0975k869k860k431R64j887
8265A117R324L868R792m337j4036j1310L22M386J7868Q184j0041j5484j0329m822
8251a5498J256N863L560P376J249N676Q545j0347M528Q388M236j1258k1122j0618
8237a8166k109J2804L508J784K561k533P426m682J290O819K89j0103M167p530
$$ y = [-1396, -7146, -20595, -8601, 4391, 5187, -13843, -31976, -24303, -8121, 9354, 16482, 4047, -10855, -10433, -2336, -2487, -14831, -21517, -12473, -7427, 4729, 5905, -2385, -6668, -4232, -5962, -31, 8121, -6994, -14866, -15855, -7110, -5809, -1388, -3526, 8120, 20000, 20083, 6316, 15415, 35435, 35075, 11427, -13641, -9968, -5092, -4488, -10905, -3469, -10532, -19049, -13794, -10878, -13486, -1522, 500, 11626, 6682, 1193, -1700, 354, -6982, -13373, -13587, -10165, -775, 10200, 7331, 4471, 2040, 3004, 1117, 10441, 14309, 24101, 19764, 5728, -5582, -5260, -874, 16994, 25178, 15137, -347, -10676, -15498, -14242, -8379, -4819, 2557, 3806, 9482, 18027, 7680, 12208, 20596, 24832, 13574, -7548, -18166, -20275, -7471, -3963, -2179, 382, -2151, 5275, 593, 1883, 8702, 8991, -1112, 3055, -4475]
8223d475K744k124m533K207J137O057M174p518m529K460J6118j705j8326n22Q286
8208e49J0875M187n189j8047j6536L947K0117j096n996J0050P47N88O869q799
8194A168j8914j2262K0557L8263K3621p6k2291j0230j7297p62J1553L452R785
8181B6567J732j2508k3483p320J2902l78Q281J0411r284p589N323M082P319l103
8167A2952k0753p500o597n581J6813K2806P782o436k400M567j42p538k834J0160
8153A5299p959j6729o832L686Q722K393j2707o563P685M089J5054M296j8213p400
8139a5179m00l745K68R53O841Q432J3657L114j1119O839k315M105l88O169l216
8124A4016r777j2247Q396j0976J032J2959l866N646J8743L610j7066j4526J268
$$ y = [-4475, -1731, -3855, -8388, -6181, -5044, 1013, 5187, -2331, -6860, -4400, 11718, 10013, -8313, -8835, -549, 10326, 14513, 9324, -8723, -25259, -21312, -1195, -2291, -8287, 1763, 2510, 3098, 9967, 1168, -17746, -30008, -9451, 28812, 52433, 52357, 30066, 19836, 2539, 1777, 13330, 16782, 26567, 28299, 15791, -7692, -15012, -2110, -2488, 5793, 16204, 6920, -669, 4654, 8736, 16055, 12952, -7801, -15301, -21898, -27479, -10666, 12140, 19922, 13486, 11086, 15653, 15511, 7973, 5139, 15299, 7340, -9389, -16221, -12535, -3813, -1420, -14127, -20690, -13005, -8916, 6138, 10434, -7779, -15179, -15579, -19324, -19056, -18103, -11262, -2830, 10827, 13941, 2822, 9661, 7346, 11451, 11063, 17232, 14016, 4239, -8008, 388, -10588, -9556, 3403, -463, 5183, 23926, 27536, 10470, -4056, -2788]
8111b788P372l181J3820J1193J4634m36j7505j8265M86Q06q15N990j922P091P658
8096B4138q516j1360j887l04k846o017l578m135M616n865o138N236K3249J2417
8082A9010p769j1024j4691l862K1451R33q208J0037Q769J1279J1789j8386q543
8069A0785O60l653J2398J6654L250r862k2951j3451r190J932J7002n611J49L549
8055A661K8032J1034l017J1229j3728l826j0082r591o800j556J5370J2633J795
8042C3154k3154j0491R68Q314J4917M035j858j6756l10j2180o627O816J5789N922
8028A8539j4310J3500J0680j7672J5841M582j3243Q482L425k469K342L404J2344
8015D5445L385K020n891m377j67m054j7269n375P827P139o324k099L744K226j712
$$ y = [-2788, 4584, 1403, 15223, 26416, 41050, 40614, 23109, 4844, 5330, 6136, 5321, 11311, 9389, 16480, 24138, 15622, 4262, 2375, 2071, -775, -6792, -10370, -14505, -9889, -15754, -21892, -16656, 6593, 19010, 11241, 217, -14474, -18336, 3115, 4048, -4160, 5877, 14646, 25925, 37714, 19328, 10785, 11445, 7792, 20190, 36844, 40094, 30232, 7281, -6170, -15360, -13428, 3574, -2037, -1888, 1661, 29693, 40727, 37710, 48939, 35211, 31385, 21303, 11712, 4912, 3356, 18726, 31359, 33154, 10000, -491, 477, 8791, 23708, 27743, 25885, 9129, 8819, -3361, -9988, -3172, 12617, 18539, 4229, 17729, 28409, 10737, 26578, 31160, 17917, 26399, 29824, 27355, 29697, 33101, 45445, 48830, 50850, 44959, 40582, 40415, 36361, 19092, 13717, 21544, 28683, 22359, 20260, 24004, 26230, 24518]
8000B4518q123J0192J6148j528k204N584P485k221m630o321j2962m380K952R597
7986C4107O078k057j9352o518M582q27L51R523k823O334k966m053O905j0659J2249
7971C0874r577j1036J3735N136j3458j2506j272l740J4061J442j5533p015r309
7958a8198N756Q765J7059O051O938P242J6135r350j6024m504j0887J061J5289
7945B5333r926j2076l620K947J7714J2140j694j2970n710J65k5468k765j335P208
7931a0057J2553P190O875k628J503R692K627j0009j1390L510O200M656k088j3413
7917E221k8733k28L941M379J4508J7059j414j6894j062J8470M842q13O939j3423
7903A2792k0657L577N738Q790l99M172J672q542J29P594J2784j535r970k508p705
$$ y = [24518, 16395, 26587, 42735, 41207, 39003, 44587, 52072, 49851, 45221, 38900, 25938, 21558, 24510, 34107, 40185, 38128, 18776, 12258, 16840, 16013, 16364, 25887, 23064, 29398, 26432, 22379, 29284, 18625, 30874, 21297, 10261, 23996, 29132, 15674, 3168, 1896, -1844, 12217, 13659, -1874, -8889, -18198, -12442, -3677, 13382, 19433, 26371, 33613, 49748, 40398, 24374, 19870, 8983, 10044, 25333, 15407, 3331, -289, 2658, 20372, 32512, 30818, 17848, 12138, 12303, -13165, -15930, -17265, -10057, 2496, 9686, 16561, 13933, 15436, 25128, 27755, 17746, 6356, 9866, 16066, 20722, 18634, 5221, -23512, -23740, -19799, -15420, -912, 16147, 14733, -2161, -3223, 15247, 20089, 19276, 26215, 12792, -7865, -4288, 1450, 10240, 9841, 14013, 15685, 7143, 7272, 14866, 27650, 26115, 16145, 13637, 5932]
7888E932j0466L560M050P809q269l146J159J433J3410K728J969j4469r693q685
7874a2678P391J0966Q758N161r38j1490o595j8669N573P540J3834n521O257P181
7860A6770p922L431l526j1333k593R704k65L956q408p260J0750o00P799J2035
7846B2538J740j8436j4492J0282k939j0474N431o749L41J1008L460K547k119L23
7832B461o033j343k56J2206p022j0105R244l326j1596l639N878P923J9624J6295
7818C0311K582j2077k84p625n920j7909j1870J174J8698l095q842m382p398J5757
7804a0880q159j4864L744J5158O033n470J4009Q459k2691k5134q623J3302J9750
7791a5366P365R820M85n059r614R109J5448l966j1711j3124p318R939J1408P460
$$ y = [5932, -4534, -974, 3076, 10885, 2616, -530, 629, 2062, 15472, 18200, 20169, 5700, -3993, -12678, -5287, 5679, 14437, 19598, 18660, 7170, 575, -18094, -12521, -4981, 8853, 3332, 9589, 16770, 8848, 12279, 8753, -2580, -5173, 4531, 4266, 8222, -186, -7446, 3304, 2704, 10503, 22538, 24278, 5842, -8650, 1632, -1307, -11781, -6350, -13099, -12758, -1750, 1710, 4257, 2138, 2461, -3572, -4915, -5171, 7035, 13, -10092, -848, -4174, -15770, -19409, -13531, -5608, 14016, 30311, 32893, 20816, 20532, 12907, 6987, -10922, -22792, -21618, -2920, -6015, -14857, -19239, -26637, -10880, -19039, -33903, -30159, -15001, -8968, -14438, -429, 8030, -14661, -39795, -48418, -35116, -15366, -8001, 1819, 2304, -2755, -12369, -3260, 12188, 8222, -3489, -16613, -23931, -13992, -2584, 4876]
7777D876n231r726J3686Q11k232N363j449l343P630O253q878j1395O28j0485j1537
7762b5029l20K3436L1302K1320j109n701l2171q659K1132J12k3208m519k201j3777
7748a9392l859N53L986J186L224J4022J4974J363j2758k787j703l149n752m636
7734a4728l989L175L114J059K582n597j834L879J5125J9485j089q781J2942O590
7720C1933q937l771l249K207j7177j3982r5R767J8082k091j0040p328o81J6375
7706A1013P157o158J992n747o67j1851K793k279n59q004Q043J7973q640k3253
7692a8187k136J6369J1027p09K914J496p548p135O654R469n709r228l025J7327
7678A1579J1976k772j6003j8630k315Q695M433q855p411N236J5551n42m507r616
$$ y = [4876, -355, -10081, 3605, 4416, 2184, 7547, 6098, 2755, 10385, 16638, 7760, -3635, -3007, -13492, -25029, -25349, -1913, 29389, 50709, 49600, 43899, 11728, 3069, 24201, 24313, 1105, -3414, -5615, -19392, -23251, -22698, -18712, -17526, -14302, -280, 14694, 16057, 3299, 512, -1191, -4340, -10092, -14728, -18717, -15542, -12428, -11369, -8787, -14384, -16218, -12339, 2786, 22271, 21182, 12401, 25343, 31933, 22996, 19225, 15976, 18183, 1006, -12976, -13071, -3304, 14778, 12687, 2647, -4681, -5362, 11013, 18170, 12012, 14004, 8257, 7590, -4261, -1468, -3747, -4306, -12310, -4267, 13706, 5066, -18187, -20323, -3954, 7073, 6364, 9278, 10774, 3226, -3909, 2745, 12214, 6505, -2723, -5748, 11579, 23555, 20783, 4780, -13850, -16165, -7470, -3037, -11892, -19303, -14067, 1484, 942, -3565, -13181]
7664a3181J993P112n612l971R17q125m683J2320K343M31K219J174P485p513k3264
7649c0355m5J0873J0103L444m82L370J8794j4061m956P050J5913n538j3214j6140
7635a5244o7K5807J6891L800l2202j2024j2078j0022L963J1543M617N957J3272
7622D213J1476p650l737J1209O29k152j6758q984J673Q324Q884R33P977m915P830
7607A8952J665j0315l2203M585R98L831K951P752J2127N222j1287r733o965J2343
7593g7J0799q027K164m515j7801j5324N020j802J482L095P161n159l17j633m277
7578b9211J6389J613l722L594K435q815K854J3105K864J884o576m587p173j326
7564a6672r583Q790m789l80L923K1827k139j1753J2128Q828L520q037j9732O937
$$ y = [-13181, -11188, -4076, -9688, -13659, -12742, -20867, -25550, -13230, -10887, -10456, -8237, -7063, 422, -7091, -30355, -30400, -19527, -9424, -5980, -6462, -3092, 15702, 1641, -3315, 3735, 19648, 14110, 896, -15244, -15311, 10496, 27387, 31187, -1015, -13039, -25117, -35139, -31176, -19633, -15016, -9059, 4213, 15689, 8039, 4302, 15511, 16140, 13988, -2770, -11754, -10081, -1757, 7127, 8060, 16037, 11122, 18952, 20617, 10302, -21901, -17316, -16318, -12487, -9536, -1784, 10343, 15565, 4278, -5455, -12420, -77, 10722, 2695, 4859, 344, -17457, -32781, -27761, -29563, -28081, -24986, -17825, -22984, -23301, -24934, -29211, -12822, -11209, -14931, -11337, -8902, -17717, -14863, -1758, 1106, 2990, -3586, -8173, -15346, -16672, -26255, -17465, -22254, -22634, -18711, 3116, 977, -10776, 1352, 10180, 13700, 5663, -14069, -7132]
7550g132J9183J305K942n637m480j1931k6306J4065o58N14L0456N043j2239k301
7536B824q944p434r464K020Q277J1856N478o440r130R289N396j0242j6469N411
7522a7572J3773Q811j0038J041J3640J217r635j201J1904j288L88j4632j4897
7509a8489L180o814J829J2705j2615j523J6425N373k143p719Q862p802N742J7062
7495A4073J8203r774o658j4126l811n349j0553j925o518j1111p167j5934n205
7482f5855K5318K3044o97o943J2801o611j636J1907J39m445o17K0851q753q249
7468i746M149N923r616L633J1993m046O878J2400j1511j0352Q756j4007p141Q115
7454d572k136J9640J5496k2245j8299j375J0476J451o794l055J442J1512R060
$$ y = [-7132, 12051, 13356, 16298, 10661, 6181, -5750, -32056, -17991, -18649, -18135, 12321, 17364, 5125, 2824, -6120, -13554, -23018, -20998, -12721, -865, 4613, -1827, -10957, -1668, 3728, -6514, -22983, -17572, -3799, 5012, -5026, -3985, 9655, 10872, 1237, 36, 11940, 10652, 11040, -3592, -18489, -15309, -22123, -20294, -7589, -20204, -21727, -5302, 71, -2072, -9791, -929, -8731, -2989, 14073, 32276, 22502, 15844, 1718, -2093, -7442, -17995, -19920, -26438, -37549, -44716, -60650, -65855, -40537, -17493, -18190, -25133, -12332, -18943, -20579, -8672, -8533, -12978, -13595, 7256, -1497, -9746, -5597, 326, -9290, -5657, 6336, 2290, 9168, 21568, 10057, -295, 8461, -5546, -12687, -4572, -6708, 12932, 28428, 6183, -12116, -13491, -3015, -1564, -8358, -11413, -9971, 1541, 10601]
7441A0601m697q510k953r592m160M022J0502q158P362J0087N462j151o723l596
7427a504q520M754n833J37J1360N232p418L338k401R977m904j3154o803q402J2984
7412a1157O768O613n180M646O638N123M008L558k995j5252r171n462p999o752
7398b6614p769K9006J6045j6364M672P811n140r473j4994l25J9810K293L388j0153
7384g807Q34N10Q757n237j5705K083J5215J3014K915k595n681P423k250O499J5641
7369C3616o848j8953j2416K526R193K67K184R8o783L517Q47M274J79o417j235
7354D049j6423K565P455J974N95j5391n332L279O458r41J7842N318j9824j3997
7340b2373l487O056P0o021l061R121L688K959J2J178P559J0341J0168k1198q466
$$ y = [10601, 5904, -2606, -5559, -15151, -19311, -15289, -4787, -12945, -5583, 4504, 9966, 8815, 2092, -1504, -10024, -5270, -11103, -10966, 394, 5626, -1792, 1546, -855, 9122, 4218, -8936, -15739, -24141, -11157, -4389, 2224, -2956, 1690, 8328, 13451, 17459, 21017, 18022, 2770, -6401, -11863, -19862, -26614, -34383, -5377, 10668, -5696, -1024, 6787, 1647, -7826, -22820, -23145, -3335, -1042, 2346, -7807, -6973, -6463, 2294, -2943, -18648, -16565, -1350, 11664, 14579, 11984, 6303, 13726, 11476, 17975, 33616, 26768, 7815, -4601, -2075, 7118, 7385, 9569, 9667, 2884, 6401, 7248, 11522, 11701, 5284, 4049, -12374, -9809, -2354, -380, 215, -15176, -20508, -17229, -10771, -11712, 6130, 11448, -8376, -22373, -25860, -19804, -19734, -25755, -28816, -19695, -16007, -13048, -13036, -11858, -4299, 6042, 16210, -4988, -13454]
7325a3454m304Q726K642j721m083j6217j434J347J2650M824j0541p66n344j0494
7311c8169J0360L198j941j594J077j290q342K524J7019K349M409J3789N313l656
7297E046o687M227M29J846o426k432J547N813J0278J625R752p213o107j6921Q998
7282C775J2023J163n430k5752Q671L815K660J844n826P382j0403j88k799O274
7268b791K665Q074o297j019p336k45n267l038J2665K0248j770l239M994J2611
7254C0255n505r834j8702Po723J551o378J6578J2177Q404J751J633j0502j3384
7240A328o790k200J4788K228L457K693K319j5972k249J0343r92r157j0773r28
7226a1905J8495K708m660j2519k1969j3736J9263K9676M233j9346M714K0449R739
$$ y = [-13454, -17758, -9032, -6390, -8111, -12194, -28411, -29845, -28498, -15848, -11024, -21565, -22331, -27675, -38169, -27809, -24611, -26552, -28146, -27069, -28359, -36701, -34177, -17158, -14809, -10400, 3389, 8702, 5046, -1641, 2586, 3015, 4861, -1565, -3997, -2450, 3363, 13641, 15266, 25018, 17805, 11698, -5223, 3775, 15798, 16961, 11531, -14221, -5550, -1735, 925, 2769, -3057, 4325, -6078, -6266, -9065, -2791, -126, 7948, 1651, 632, -6704, -6949, -12216, -15254, -2589, 17659, 15889, 12650, 17644, 30255, 24750, 14916, -3786, -3779, -10502, -8951, -15329, 1249, 13426, 21830, 23581, 25214, 14712, 1328, -5462, -7662, 7126, 9354, 12811, 15504, 17823, 1851, -398, 9945, 8953, -204, -10977, -11905, 6590, 9298, 4638, -7881, -29850, -43586, -24323, 5353, 9586, -9760, -5046, 15403, 25142]
7213B5142n349j7587p005J331K432K900j332R54m330o892J439k781R363o594l890
7198a2199o428j351J2664K0126J1176o899r531j1758R49P618r397J5083J4959
7185B5012q601n954p033r298K425m275P06J2627q474p876J942L966O287N939m10
7170F983k275q385o217o723R228M264O925M89j6972l2022O578J8033J6265L622
7156b07N087m718p963R348k184j5275J974J3852K657j0305j255N885N58P66J2008
7141A0228L135j713l286K287o596j8259q217M142J6952r476j1821l20j209j2157
7127c6310Q45J196J0876J2507j691k69R177L511j827n839J142o167l401Q806l862
7112a1306N026N076q981r58k833k31j095J0299k659p5O137J1223J877j5005r193
$$ y = [25142, 19793, 2206, -4799, -3468, -1036, 1864, 532, 1486, -2844, -9736, -8297, -11078, -1715, -8309, -12199, -18627, -19978, -7314, 12812, 23988, 17089, 7558, -4200, -3251, 4367, -5030, 10053, 25012, 16411, 10457, 3424, -5874, -3449, -7724, -7018, 5609, -2865, -10741, -8799, -4833, 1454, 7393, 6983, 4708, -3677, -9894, -16617, -7389, -3125, 3800, 4289, -12683, -44705, -38127, -20094, -3829, -207, 4880, 162, -7801, 1547, -637, -15912, -13938, -86, 2571, -7734, -8989, -3104, -2546, -1780, 10228, 13363, 11650, 8364, 10651, 4055, -14204, -22421, -18279, -1327, -10803, -22624, -22944, -24153, -36310, -35465, -34269, -23393, -10886, -12577, -12846, -3669, -158, -1985, -7824, -6682, -12849, -16250, -7444, -11306, -6280, -1204, -10185, -11143, -13976, -14207, -15302, -5003, -7662, -7737, -1600, 9623, 11500, -3505, -12698]
7097a2698J0153J7229o61k726P871o737j8098M508k300k5510J498Q029L590P012
7083h840L039q263q385Q350J0182j645O316J3714J2252R121k782j7719q066Q100
7069A5374j0271j7095n00J553o13R51l482R785n68n84J7528R605n280j0645L846
7054I604m640q220O621n872M049O489J3719j038j5037k58J342J5374L422K88m296
7039B1547q354j1136l948J012m94L423p238j6304r684J0714J4626K3837p58j4675
7025B568j7983N579L816J8143L819j2302r199k2016M979J9122J2444m494p483
7012c007k726K293m04m316J1423J79J37j0951n475l417k93M52l405L317J2312
6997c881J4506m992j0943j8358R4R349j903J3903k542j5097n215J3678J6004p63
$$ y = [-12698, -2545, 14684, 14023, 11297, 19168, 12431, -5667, -1159, -3459, -28969, -27471, -19442, -15852, -8840, -5801, -14064, -22449, -14099, -3917, -5562, 754, 14468, 26720, 35841, 33059, 15340, 7274, 15374, 5103, -11992, -12492, -10939, -11552, -10601, -14083, -4298, -4866, -5450, 12078, 21683, 16403, 5758, 9604, 4964, -3256, 3365, -2507, 1542, 8031, 21750, 20712, 5675, 5417, 6759, 22133, 25555, 25843, 21547, 13193, 2057, -1891, -879, -1373, 2050, -5188, -21492, -31176, -20462, -5836, 18001, 17243, 2568, -15415, -9836, -6020, 12123, 15942, 3640, -5559, -27575, -22596, -3474, 8970, 4476, -3007, -5733, -3440, -3844, -8160, 3263, 3442, 3579, -7372, -12847, -16264, -16557, -16105, -19510, -16193, -3881, 10625, 5633, -5310, -23668, -23574, -14225, -16128, -2225, -4767, -19864, -25079, -11401, 4603, 3840]
6983C840j7950k906J0877J4699K2313J2351M101k0419l4236j4544l54J8719q922
6970a2431n514P449J0512k416O397J0340L890j0846k644n9l283l027N35j3910
6956a5007j1098Q384Q782P954r84r580j245J0293j875j0016K164J001l338l020
6942a7585N861R161k056J294P508M797P87m000J611K774J7886j1156j7167K605
6928B320p991K567l956j2382l593J3339J0105q093J606O151k600N405P446q702
6914A622k080M220p014q978k273M886J1397L366M808l688j318J794k0315o839
6900b0412M607m447l569J2583j2816m300M712L163N776M872k871j9705o008J5623
6886b2792J7913K2247K050o095n607L602q578j6511M65l198J2377O21N299q16
$$ y = [3840, -14110, -17016, -6139, 8560, 30873, 43224, 47325, 26906, -7330, -21874, -22228, -3509, -12431, -17945, -10496, 16, -2400, 3997, 14337, 18227, 7381, 4737, 4678, 1395, -1632, -1097, -15007, -26105, -17721, -8939, -985, -1969, -11549, -12794, -2501, -4376, -14392, -12228, -11227, -14565, -17585, -11724, -2563, -4619, -3325, 4183, 8980, 9767, 5767, 7378, 10152, 28038, 16882, -285, 2320, -5671, -3104, -7060, -19442, -23035, -9696, 409, -7684, -6078, 73, -2527, 2878, 10324, 1622, -458, 3762, -3252, -12230, -14503, -9617, 1780, 5146, 9954, 6266, 4948, 6742, -13573, -20412, -15805, -20252, -23821, -11238, -24054, -28354, -23642, -20479, -14703, -9831, -12702, -32407, -38415, -22792, -4879, 17368, 19418, 13323, 7716, 11318, 2740, -13771, -13306, -16504, -4127, -3506, 1793, 977]
6872I77j73Q07m403Q992O974j4729j898L0O803j943n131M148l149J0911k414r
6856E793j918J1093j5734p893J0789J574k013N764Q716r427j146n984l373P68
6842b991L184j853R182q885r330L532L309j3335K50J0520L439L977J1266j0867
6828A398q301J921J0866r224j1267K5964K351j4461p089R200O510L859j0904j1624
6814a0801P589N137o868M360m372O25O630j086j0392K422j302R038N529j823k0768
6799a6082j4308J3647J1766K466n066k051Q589J4734m541r639K661q519M597m05
6785b151O405K580n462q66J89M278j6447n960J8074J4729M769o639j6936K922
6771e15q256J078l814O428K157N777L075j1744J345N23k3J873l488n968j3072
$$ y = [977, 804, 1611, -2792, 6200, 13174, -1555, -3453, -3423, 3380, 1437, -3694, 454, -2695, 8216, 5802, 5793, 3875, 14968, -766, -8659, 2130, 3704, 1691, 7455, 16171, 6744, 5598, -386, -3759, -2991, 193, -1660, 7522, -1363, -10693, -7161, -3852, -17187, -16937, -6417, -2978, 999, 12265, 1398, -6903, -4982, 5884, -3340, -14607, 11357, 13708, -753, -7842, 1358, 7868, 11727, 823, -10801, -3212, 1925, -4943, -583, -4955, -4330, 2300, 1214, -9178, -6756, -8058, 980, 6509, 4686, -16082, -30390, -16743, -4977, -2511, -7577, -9628, -1039, 13695, 9154, -485, 2176, -6343, -1746, -2151, 4254, 6834, 1372, 506, 695, 4973, -11474, -17434, 640, 15369, 20138, 13499, -3437, -515, -8771, -7693, -11507, -5079, -2922, 2855, 5930, -5814, -4469, -3946, -3969, -2096, -5584, -11552, -24624]
6756b4624J5521k99j517P827O312r241q430j0704j0096J9083M525L852n252qm303
6741a7354P314J0094m398r865K229J4118J1716J9388M005P08j2449j8326j6529
6728i349j1460J0457n644L454Q522J3383J2745p029j0483R297J0231O2p032l862
6714A3292J046M346J5548L2721M2595M2942J1939k4368j4021j1555j7520j8035
6702G8930j8372j4499k2511o794L093L959K423N337l803l840L587l44k966j1288
6688A2912n723n825n652L909Q104j672o174o588j254N128O024N830m043K201P707
6673A4884N187M125j8703l614k260q692L622j732Q074m004j7955j039J3149K250
6659f708J914M107L939n868J2768l267j2862o910M98J8265J4976o633q770O884
$$ y = [-24624, -9103, -9402, -10919, -3092, 3220, -6021, -14451, -25155, -35251, -16168, -11643, -7791, -13043, -13051, -17354, -10040, 54, -4344, -14209, -11980, 2138, 13854, 33242, 37247, 37955, 25506, 7180, -9349, -20809, -10352, -15996, -12542, -4020, 9363, 22108, 15079, 4596, 13893, 24124, 24186, 17154, 13292, 14338, 18684, 34232, 66953, 109548, 152490, 164429, 140061, 126040, 114485, 96965, 78930, 60558, 46059, 23548, 16754, 19847, 23806, 26229, 31566, 27763, 23923, 27510, 27166, 24200, 12912, 7189, 1364, -4288, -379, 7725, 6053, -121, -6709, -7963, -2835, 3189, 9019, 4976, 7177, 14884, 20071, 24196, 5493, 1879, -381, -9073, -5451, -7183, 891, -3113, -21068, -22107, -8958, -6708, -4794, -687, 3252, -2616, 10152, 6885, -5977, -12887, -12389, 5876, 20852, 14219, 5449, 12333]
6645A2333J1659R81j2483j6851N660k491j517J1347M748m975k086j1227q700J7727
6631D125O880j002j3245L804J0826p604l017p951j3706j356J2544O267N827N38
6617B930M441m224j7964o202R943J1751j981p488J0769J127r930o747J4657P451
6603H533j107n916o467j3002L95p075q262r758O290O313J7798J9537m70K468r166
6588A11l391j8378M862m646J925M401m951R943R95N876M067J4881K450k360j4619
6573A166N179q730o271r548m507p507n275J4358J0445P207Q398o264j3035L637
6559a0747J475Q703k880K803J1566O27j2564J1530J314L731j128j0057K035o107
6545C01m783n917j9945o706K011Q633J1962o26o044p828K192n134O068J1377m847
$$ y = [12333, 23992, 24973, 12490, -4361, 1299, -1192, -2709, 8638, 13386, 8411, 6325, -4902, -13602, 4125, 11005, 10003, -3242, 562, 11388, 3784, 767, -7184, -20890, -22246, -9702, -3435, 2392, 2930, 7371, 3147, -14817, -21019, -11076, 675, -1306, -8794, 1975, 3102, -6828, -13575, 1082, 8533, 7426, 1510, -4957, -17959, -17564, -24639, -32901, -42659, -36369, -30056, -12258, 7279, 6809, 9277, 111, -3280, -21658, -16796, -21442, -19517, -15116, -20067, -10124, -9129, -3253, 814, 15695, 18145, 15785, 1166, 6345, -2385, -8656, -18204, -22711, -30218, -35493, -21135, -10690, -3483, 4915, -1349, -14384, -10747, -9272, -569, -3449, -646, 10920, 11547, -1017, 10513, 11827, 15558, 14430, 4373, 6408, 301, -4482, -10399, -30344, -37050, -35039, -26406, -14444, -15070, -21114, -28942, -26750, -31884, -25816, -14439, -19286]
6530a9286M039P128J222J1617J743Q65P780P860j2088J6695J8358O515j8518k2429
6516A1501o454j0356p032O818J2030j6484R320K6962l90r445q388m049k763n688
6502d418K5072Q082k5596r681J1062M170m439L088O252M723p298P371M592j6137
6488F843k728j3441j415k788r913M248j687j3362O018N104N837j053j4615O083
6474b6869N014R830k202l313J2463k617j1890K849O796l523l144J090k836M884
6460a3468K821l800J4276O306p379j6530M919l966J08n869O467L859j4346J4117
6446a2485J9501l588j0939P919o570j238n468J1687Q474P571L468n129j3918j3595
6432a4310J10J3029R146J0302l722m845p922j8052p385M826M096l429M910P892
$$ y = [-19286, -15247, -8119, -6897, 4720, 6463, 7328, 15108, 22968, 10880, 27575, 45933, 52448, 33930, 11501, 5047, -5309, -12341, -5523, 6507, -9977, -657, 26305, 25915, 16470, 8082, 4033, 1270, -4418, 20654, 28736, 3140, -6541, 4521, 8691, 4252, 7340, 13592, 18315, 11017, 18388, 22980, 6843, 4115, -9326, -10741, -13529, -23442, -19194, -20881, -34243, -28225, -23121, -17284, -18337, -32952, -26869, -21855, -12025, -14227, -17540, -5077, -7694, -19584, -16735, -9939, -13462, -16606, -15516, -18352, -13468, -10647, -14447, -171, 6135, -1244, -17774, -12855, -16821, -16713, -22582, -16115, -12256, -26602, -12485, 7016, 3428, -7511, 408, -6162, -7400, -12868, -1181, 7293, 14864, 18332, 13203, -715, -14310, -14200, -1171, 7975, 18277, 14555, 9710, 1788, -16264, -23649, -18823, -14727, -18156, -13246, -5354]
6418e354Q210L891j1324j481J1532J2113Q32n374l072O801j5391n622j4332O143
6404a2428R024J997O043l063k358q715J4793n699n034Q50j5057l851J0562J0619
6390b317J1118P588n561J27m627N147r766j1378Q876K723J972J2308l274o112
6376F824L600j687j4152j804O948L163j3123L19J5779m380n79R32k715J75R125
6361H425J3642j223j2728j1639J984P558J0616j0110p912J0056j2734l08O634
6348B261j4325N468J385J0424P150j866n001Q703k200K002n461m219K532J7474
6334B4327j637p097Q80K452J4267p272k6239k2501L908R725k093j2105P428J2537
6320c420Q930k21J746j5014J12l411j494O186R996J0476Q929q539j2065j0005
$$ y = [-5354, 2856, 6747, -4577, -6058, 5474, 17587, 18419, 13045, 9973, 16774, 1383, -4239, -18571, -12428, -3404, -1407, 4636, 1573, -785, -9500, 5293, -406, -5440, -4590, -19647, -23498, -12936, -2317, 8801, 16389, 10828, 10955, 6328, 11475, 1709, -9669, -793, 1930, 3902, 16210, 12936, 6824, 10424, 8737, -5415, -7219, -271, 2892, -10231, -9912, 5867, 1487, 908, 1840, -875, -700, 8425, 22067, 20844, 8116, -3523, -1539, 6019, 16635, 6525, -1387, 8669, -4065, -4373, 2261, -12064, -6596, -5211, 5213, 12363, 10497, 5496, 14199, 11999, 14001, 8540, 4321, 6853, 24327, 22690, 15593, 16473, 18925, 33192, 25920, -319, -22820, -18912, -9187, -11280, -23385, -15957, -3420, 5510, 5289, 7035, -7979, -7867, -11278, -12772, -6586, 3410, 13886, 22815, 14276, 2211, -7794]
6306g794p746j3904j768J210N545Q047P440O223J3045J0919n313k1115K130j5205
6292a8286n900Q105R860j496K2519O410K211K024j8459j2353J1498O363J081M715
6278A8292m449q344p940J0418l423j7469o916k855N891r452J5613J6802J0041
6265A6209k741j2535K841N765j577Q47M316J0178O179l830r568o75J231j5084
6251A556j2031K63J0917k773n79P36K466O364N701m081k0347p861K841N508N744
6236e576J3355Q111K005o849o221K755j3481k879j3387J2142P811J637Q857N596
6222A3876j0284j6101n284J2539l57p768J4851J1902J5851n895k2462l632M168
6209A404o159J780J626k013J5046p305R047J4903r403o911j2708n549O957k775
$$ y = [-7794, -15540, -29444, -31212, -30002, -24457, -16410, -8970, -2747, 10298, 21217, 15904, -5211, -3081, -18286, -24186, -16081, -6221, -7717, 14802, 21212, 23423, 25447, 6988, -5365, 6133, 12496, 13577, 18292, 13843, 5499, -2441, 7977, 4554, -12915, -19831, -22686, -16795, -26247, -10634, 6168, 16209, 13468, 933, 3774, 9539, 7962, 8809, 13125, 23303, 29482, 25652, 16084, 15409, 16640, 1556, -10475, -10212, 705, -2068, -2647, -1911, 555, 6919, 12620, 8539, -11808, -19669, -16828, -11320, -5576, 7779, 15890, 17895, 11046, 4825, 7580, -5901, -8780, -22167, -10025, -2214, -577, 8280, 13876, 3592, -12509, -17793, -5254, -5611, -13379, 1472, 13374, 29225, 23330, 868, -2764, 1404, -4755, -2975, -1349, -3362, 11684, 4379, 13426, 28329, 18926, 12015, -693, -6242, 715, -2060]
6195b060J6647l253P900P49j2957j3577J934j3709l782K04K297m680J2570K3477
6181A1760J0839n502j2747o573P894R580l620P687q23j0689k0829j3278j2539
6168c8840J4411n819J4660J4010J282K128N551j800K914M563p369j09o114q148
6154h680q63j7188j0744N513O908M404Q614J0426J0569J0225K721J1042j2014
6141B0933j736j0075N540O273P236o897j3544j0481L355J0558q19l352J628J1430
6127B0049n243L844l085k912P270O560n75n863j2970j4639j418R491k916j1985
6113a4392J757O486n409j7124N077J4194J0721k12n768J6794l132o324n157k4658
6099b7147k795J4798J2251P980o517r295o331O687P004j1343j7754J1476R994
$$ y = [-2060, 14587, 11334, 19234, 19983, 7026, -6551, -4617, -18326, -22108, -21904, -19607, -24287, -11717, 11760, 22599, 17097, 4350, -2223, 5671, 15251, 11631, 19318, 18495, 7806, -13023, -26301, -38840, -24429, -30248, -15588, -1578, -296, 1832, 7383, 5583, 8497, 13060, 5691, 5582, -532, -8680, -9543, -26731, -37475, -31962, -25054, -20650, -12036, -1610, 8959, 19184, 21905, 32947, 20933, 19197, 9122, 14662, 20935, 28171, 21274, 7730, -2751, 604, 11162, 10343, 6991, 8619, 20049, 14806, 18650, 15565, 12653, 19923, 26483, 25908, 20045, 7075, -7564, -8982, 509, -2407, -14392, -12635, -6149, -11558, -28682, -23605, -9411, 1310, 1098, -4670, 12124, 8992, 2668, -2489, -27147, -29942, -15144, -2893, 5087, -1430, -10725, -17056, -10369, -3365, -14708, -32462, -20986, -10992]
6086a0992J84j6930K172L889J3686R413o967j9801k50J7767K0324r454j0339R311
6072B013J765j1646O249O217R645l367r088q605p425r063N390O431r144K802P671
6057a0155J3410J247r397O172J6795o322o882j684j0766N12n359P249J786l24
6043c718j2148j783j522r645p64N867l172n061O513P112M227R908N759M941O799
6028A3313j969K862k063j1833j4526N118j048N217P058P743N99r29k307Q418l896
6013A1757o283p725q329M3P475k054p825M195q271P694K5192J5875O911j3844
5999B4811q149m150o967j9641J1309k956l395m971P839l477l098k890q191m931
5985b8857K3384J2713L162p010j0617q72j0789J3250J0031m834q507Q657O873
$$ y = [-10992, -10808, -27738, -25566, -21677, -7991, 1422, -5545, -25346, -25596, -7829, 12495, 3041, -7298, 2013, 3778, -7868, -1619, 4598, 14243, 10876, 1788, -6817, -14242, -23305, -17915, -11484, -20628, -17826, -10155, 3255, 4502, -4895, 1277, 18072, 11750, 4868, 3184, -7582, -7070, -12429, -5180, -3394, -3718, -15866, -17649, -19171, -28816, -29580, -23713, -26885, -31946, -25433, -18321, -14094, -4186, 1573, 6514, 13313, 11344, 14206, 12143, 310, -14216, -9098, -10146, -4929, 2129, 9872, 10471, 9542, 7235, 15653, 11757, 5474, -2251, -10580, -10537, -3062, -5116, -12941, -8746, -17017, -9323, 15869, 31744, 38655, 24811, 16662, 12512, 5545, -14096, -2787, -5743, -9138, -14109, -6270, -9747, -12845, -15735, -23926, -28857, -5473, 7240, 10402, 3392, -7225, -8097, -18886, -5636, 4395, -439, -8946, -289, 6584]
5972F584J578J829m348q089q778N237J9297M0l480k403j7482j6029P489J7141
5958a414K155P112J6612k2817q554M698J0062M261q641j0915p46J3325J7913M767
5944B7818n419n983q617j8209n047O512N813R33J3059m802j2267O568O869K856
5930A0084j0059j5879L610K6645R498N280r536k0666M230k667J124m700q545L73
5916a1208R363l788P33J0178L300q474j0795R574J9229p979l935j0511P486J4460
5902A7633N625n776j8169j5685M107k920R392N82j7735J8829J9431o703J739N424
5888A5774r697N109L30q161O481J367j3489n67j7901n864P721J8387J7930n160
5874A2260j1473N95p915K916k19r558n613n936J4546J9778r792N395N206r775
$$ y = [6584, 8162, 9991, 5643, -2446, -11224, -5987, 13310, 13350, 9870, 7467, -10015, -26044, -18555, -1414, 741, 7853, 24465, 1648, -6906, -2208, 7854, 12115, 3474, -7441, -8187, 5138, 23051, 27818, 22399, 16416, 7799, -10410, -15457, -8945, -3132, -2199, 10860, 6058, -6209, 359, 7228, 10084, 25, -15854, -12244, 14401, 23899, 29179, 19643, -1023, 3207, 540, 1664, -3036, -11581, -11208, -1845, -5633, -4900, 5278, 8578, 104, -10691, -1117, 18112, 10133, 6198, -4313, 3173, 17633, 23258, 17482, -687, -16372, -12265, -15185, -5793, -5211, -22946, -4117, 15314, 8611, 10350, 15774, 6077, 11186, 11516, 3355, 9836, 11203, -2286, -2853, -20754, -26618, -18897, -510, 17420, 12260, 787, 1382, -6533, -3617, -3836, -13394, -19007, -24943, -10397, 9381, -411, 4984, 10190, 415]
5860D15k94M687O200J3169M039L276m19o970k364q010m36k425j2485j4743J13
5845a6247M724n532n46J577J0248J2577R933j1532k816k896p08Q677P625n716
5831I368q870n419r316P250J6415P500j5464n581m627k127J716J706M868n363
5817g944N60j0151L505q545j1557R737L4920J1761r275j6683O606k22m326J3911
5803A2297K006Q615m455j5102Q268J248k2132n601L078R05j390P039K14j1361
5789a6371J628j2487J291J5219J7232Q767n722k1768K741Q355r13K24L823m971
5775b952Q753k777k23K555J773P346L014k956l827n721M225O815m744j3795j1997
5760a4511Q160Q91J854M560M021N848m945Q042o692n725J491j2341K404Q734J3847
$$ y = [415, 121, 4808, 11008, 24177, 28216, 31492, 31073, 24103, 21739, 13729, 13293, 10868, -1617, -16360, -16247, -11523, -17055, -17601, -16024, -5776, 6801, 16734, 5202, 2386, -510, -1218, 7459, 15084, 9368, 498, -4921, -14237, -6987, 9428, 16928, 1464, -4117, -8744, -10871, -9155, -7449, -2581, -7944, -7384, -17535, -14030, -22575, -34132, -24395, 10525, 22286, 13011, -3672, 2934, 2712, -1614, 12297, 14303, 22918, 18463, 3361, 11629, 12877, -9255, -14856, -11778, -10873, -12263, -5224, -5010, -16371, -14743, -27230, -25939, -10720, 6512, 15279, 9557, -12211, -9470, -1115, -2028, -1804, 2019, -2952, 5801, 3024, 2801, 5356, 7129, 14475, 17489, 14533, 10706, 4985, 9210, 16025, 11281, -2514, -14511, -6351, -5460, -3606, 954, 4975, 10823, 5878, 13920, 7228, 1503, 2994, -9347, -6943, 1791, 15638]
5745A5638r682r373q160L508L524Q734k913j1720k0075R635N361K704J6030K50
5731C461p321L10j0830l881O511J7334M084j0546M47J8130K596m173P322j370
5717B2074o974p428m146n194J0737N860j5546j828Q864o227p020J2954m028j1446
5703i348j3190J2836J0883J296p167j6195j0911R004n91L009P478K912o408J0136
5689f256p126q747P791N931N271N137l644j0928M080K081j8288r273O631K839
5675b4501J8006J235p438n37k51j679J0884J56o320p341Q030O417L135N231J0420
5660A5447l18K030n986L346P258K905O316m324k0477o929j780m992Q442L541m810
5645c31M415P4j1571l219J4781N851K15k8262p361k083Q080O823J6392N940m416
$$ y = [15638, 5956, -3417, -11577, -8069, -4545, 4189, 1276, -10444, -30519, -20884, -15523, -12819, 3211, 3461, -3860, -3550, -14380, -18261, -11750, 5584, 9668, -878, -431, 17699, 20295, 16122, 23444, 22074, 15100, 7672, 3526, -1668, 9069, 14929, -617, -2445, 6419, 192, -6828, 6126, 2098, -9348, -22538, -9702, 1181, 2477, -4690, -20885, -31796, -22792, -23383, -20374, -12896, -9984, -16392, -6256, -13382, -22129, -14338, -8407, -3136, 2001, -1643, -12571, -8491, -6410, -24698, -33971, -27340, -24501, -6495, -5260, -12698, -13235, -13486, -15165, -4281, -4125, -10445, -17786, -9756, -3339, -204, 5027, 15447, 15129, 17159, 11173, 14519, 21777, 24682, 30998, 26674, 6197, -732, -2512, -7504, 938, 4479, -331, 4084, 4158, -7413, -10632, 4149, 10000, 10215, -18047, -25408, -27491, -19411, -12588, 3804, 9744, 5328]
5630E328n998q448K732K634j0119L24J2942R403J001j0443r630k1132M464P418
5616a9524M972M454r150J0473N668M466k437r413k534R312j867L251N629j9909
5602a6609q396L664m214J818J3038J6049j4682p427J138J8336J2350j1143m457
5589e35J6457L348q210j0304k884n72n123p88j7516L693K0252J5316M993q326
5575I801q173n414o054l571m959j555R618J3647k541j308L092J0799P328m058
5561A6652k3169q017J1349M897j295J6035L700l510j2780j6206J3212J3494Q281
5548B2643n815p636M689l322k03j0602j4214P447J7302Q479q427q588J0199J2561
5534B4513q446l776j9j7278j0598R052M269J0083P778m668n082N175j1279m886
$$ y = [5328, -670, -9118, -6386, -3752, -13871, -13547, -605, 8798, 9799, -644, -10274, -31406, -26942, -19524, -14552, -10098, -19248, -8775, -3107, 1359, -1078, -10491, -13025, -3713, -5580, -2329, 3300, -16609, -25005, -21341, -25555, -23737, -10699, 5350, -9332, -16759, -15621, 2715, 15065, 3922, -535, 15922, 19270, 11060, 756, -2128, -2700, -7823, -8611, -26127, -22434, -2182, 13134, 18127, 9801, 1628, -3786, -9840, -13411, -18370, -19925, -10307, 3340, 799, -509, 2583, 13382, 20710, 16652, -6517, -14534, -3185, 1712, 417, 16452, 20152, 16642, 3862, -12344, 868, 14362, 22643, 16828, 9192, 13881, 10559, 10356, -246, -14460, -7013, 10289, 18768, 10341, 1753, 11952, 24513, 16067, 12291, 12272, -5006, -15604, -6552, -2283, 7800, 15578, 10910, 5828, 11003, -276, -5162]
5520e162L756p68n42j0L995J0536Q437j791j3919p033r002j685O819m570l90R405
5504a924j195n995J2865j834K531N442L534J2249M58k1423k571j0931m908J41
5490a3561R588K525O502O133J566l407J1210l607r491j2138j2032Q769Q449P02
5476A208P266M523o610j3406l107J4490k643j8139j2374L253J2494J6050m65N734
5462H274J4573M113m206n196K641j0953o015L059K985p306O785P416J172n230
5448A2112R306L546j1775j4546m832J8316P536p781r655j755m405l995J0080P718
5434I870n994M078R106N775k195k192j0038O983K398K903j391m036J153o914l611
5419E895M106M184P762k60j1255n296m746j3169Q528J8549L831o15m317K138J5886
$$ y = [-5162, -1406, -2174, -2716, -2726, 1269, 11805, 20242, 18451, 4532, -2501, -11503, -13188, -6369, -10939, -11329, -1924, -3119, -9114, 3751, 1917, 4448, 9890, 13424, 25673, 26131, 4708, 2137, -8794, -13702, -13561, -3973, -1448, 5054, 11187, 12753, 9346, 20556, 16949, 7458, -4680, -16712, -7943, 506, 1208, 8474, 12997, 6387, -7019, -10126, 4364, 1721, -16418, -28792, -25539, -13045, 3005, 2540, 8274, 22847, 26960, 22754, 17558, 20199, 9246, 3231, 6290, 9275, 1969, 8754, 16170, 17342, 12112, 21418, 24964, 13189, -1357, -6189, 12127, 19663, 11882, 2227, 472, -3933, -7928, 2152, 9870, 3876, 7954, 17060, 22835, 20640, 18448, 8410, 15393, 17791, 20694, 19303, 15267, 16420, 9506, 5895, 10001, 14185, 21947, 21687, 10432, 5136, 390, -12779, -4251, 14298, 18129, 17514, 13197, 15335, 31221]
5404C1221j347r794j2268q480n713J7180R476J802o473r020L275o106p033o75
5390c955J359l834N823J3044P83j543J0454K804j1090m032q272J1425J1156j4435
5376I687j5348m073j440k182n520L060J8858M909k5616L470J5652j319j5843M313
5362a1392n995N455l53m639J157l334J26M992O703k560n519k300k145K0981J1778
5347A2955p014j4043j2166l537N901j2986j655L836L278j156O410M880N509K178
5333g610L743J1680p173j188j323n546O232j099J1174n159L068m514L574l836
5319B023j92k845P103M378J1939M625r414j4818O2L267M214O743Q670Q366j247
5304C2874j2641j3732n703k049O144l21j1229j0635o136j836K0309p654R07R153
$$ y = [31221, 29874, 20080, 7812, -668, -6381, 10799, 20275, 22077, 15604, 6584, 9859, 3753, -3280, -3955, -2596, -6430, -607, 12437, 13220, 11677, 22131, 24935, 13845, 9813, 1541, 12966, 24122, 9687, -5661, -9734, -11174, -13356, -18876, -15816, 3042, 7951, -17665, -14195, 1457, 138, -15705, -11392, -17387, -11932, -12285, -16924, -15767, -19101, -18975, -13983, -7280, -9840, -15359, -17659, -19804, 1177, 12955, 5941, -8102, -20268, -23805, -17904, -30890, -32545, -28709, -25431, -26587, -20177, -15297, -9788, -7610, -3867, 7813, 640, -548, -1871, -7417, -1185, -2284, 8890, 3731, 6799, 2285, 5859, 2023, 1831, -1014, 6089, 10467, 22406, 27031, 17617, 2799, 2861, 6128, 10342, 17085, 25755, 34121, 32874, 20233, 6501, 798, -1251, 4893, 4572, -6657, -17292, -23428, -25264, -4955, -12609, -11702, -2549]
5290b549N771R634j67q413r974j2334N90Q354J1534R905P243M781K357N368M911
5275C7011k1820l082n536j776R283j661j4093k809r950j2601L962q99J5376J0675
5261B080R205M676M304Q818j1367k5105j364O745n497j0789J72k385K3497N009
5247G999o772k857J0170P76K357o052k699J628M166L166j4448P117J3635j3159
5233E027j885Q53j704j2981J461Q443r265k853m05j0093p679J3548J0067j695
5219i161q941J7831J4020o751k0066N378J8670r606p243n881o739K813R010j5027
5205b1693l198Q353J3239j659M433J858P225P292p186O650q932p087Q793k381
5191E707k790m906K411j5097m27J9534J2468O359Q94j0014j4633j4853k235k511
$$ y = [-2549, 3222, 12856, 12689, 4276, -5698, -18032, -17442, -9088, 2446, 12351, 19594, 24375, 26732, 32100, 37011, 15191, 12109, 6573, 4797, 14080, 12419, -1674, -4483, -14433, -27034, -23072, -23971, -8595, 2080, 11285, 15961, 20265, 29083, 17716, -7389, -8753, -2008, -7505, -18294, -18122, -20507, 2990, 7999, 1227, -1630, 8540, 9316, 11673, 5621, 2922, 4550, 8716, 11882, -2566, 4551, 18186, 5027, 3142, 3995, 2291, -10690, -9229, -786, -10051, -12904, -13309, -23402, -31081, -17533, -7466, -9161, -18102, -271, 13749, 6998, -13068, -7690, 10980, 1374, -5869, -11750, -18489, -15676, -6666, -21693, -24891, -16538, -3299, -4958, -525, 1333, 8558, 15850, 8664, 15314, 6382, -705, 8088, 5707, 2917, -1989, 422, -14675, -15102, 4432, 16900, 23259, 24153, 14139, -494, -15347, -17582, -20093]
5177b0093N837J2438N479J576j2427o92Q333k27j466J409N340P204J485n654P110
5162A5652j1730j6846o90R037J2933N516q880N62n448j1655k954N107J0823p340
5148e913R46J1773m865j0054m634R337p975p133M526P295J011o060O203k570R472
5133A359K0289m398r561n828P371n69j627r114r865J2746J8792J913j622K558
5119B2444p892j0306k0191q56N574m660Q442O362j1376j2324j3513J1796M894
5106b1606J4306J6279J0647j1264j072j583Q787r474j7330M23N176j1981r213
5093b7905m727L526N039J952J0008J8004J850j1841o95M135P93J0584J5569r086
5079A7206j9093q036r718k94J0566J2948O507r959n839M188K411Q918j5716l720
$$ y = [-20093, -14256, -1818, 3661, 5237, -7190, -7882, 451, 224, -1242, 167, 5507, 12711, 14196, 8542, 15652, 3922, -12924, -13614, -4577, 8356, 13872, 4992, 5554, 106, -11549, -14503, -9396, 1427, -5913, -4967, 6806, 1941, -8113, -12747, -3410, -11385, -18518, -13992, -6697, -5686, -11746, -5543, -8113, 1359, 21648, 17250, 7689, 1861, 9232, 8663, 7036, -2078, -11943, 803, 19595, 21508, 19886, 22444, 14552, 4246, -15945, -16801, -11227, -15887, -7445, -1083, -12459, -24783, -38296, -26500, -21606, -7300, 8979, 19626, 8362, 7290, 5707, 14494, 5020, -12310, -11887, -6711, -18692, -27905, -32632, -29106, -24067, -22115, -12107, 5897, 7747, -4094, -4789, -654, 139, 10723, 26292, 17206, -1887, -9923, -19641, -19935, -9369, 3579, 10086, 127, -5712, -1524, 887, 9805, -5911, -9631]
5065i631P007j1701l083k332k214J573M006N04m262o190J0065Q594M78L407O072
5050B293k24j2777J3318N435M15J410k5672j022K599m636Q305K278O399J958P467
5035G546k432O752p81N593J642r247m400M12j229n419N145l533n814L934l913
5020e744j6598Q402l298l249J2866M667j5686j194J7557o160j5728O897L7182
5007A9914K3517j2746j5675n141J060Q151r455j1649M526J1254P68r908j6053
4994a1437R266R474J1223k139k0919j320J420n308o611m883N471R741N824k108
4980b306n827K893M579M186k96J1850J3561p32j3842j6404l085j5096J859L581
4966a5079l289L529K6958R624r385J594m636j5629j0986P170Q299J6857n968p916
$$ y = [-9631, -2624, -14325, -17408, -19740, -21954, -20381, -16375, -15871, -20133, -26323, -16258, -7664, -7186, -3779, 2293, 2069, -10708, 2610, 8045, 8460, 9870, -15802, -16824, -14225, -18861, -10556, -8278, -1879, 79, 7546, 5114, 11866, 11085, 16678, 18320, 9073, 4673, 5085, 3856, -1563, 3582, 49, -5765, -1831, -5744, -22342, -13940, -17238, -20487, -7621, -2954, -18640, -19834, -2277, -8437, -24165, -17268, 19914, 43431, 30685, 15010, 9869, 10929, 19080, 9625, -2024, 2502, 13756, 14524, 4616, -11437, -2171, 7303, 18526, 16387, -4532, -5852, -4432, -9740, -16351, -21234, -15763, -6022, -198, -2306, -8133, -5240, -661, 3525, 3229, 15079, 28640, 27908, 14066, -2338, -5423, -20519, -18660, -15079, -18368, -14839, 12119, 21743, 12358, 13952, 9316, -6313, -17299, -10129, -1830, 15027, 9059, 1143]
4952A143l212q453j3261O037J1434N274k892p041j2602J3999L277M258J5452J0510
4938B3923p978L25j5411n334J137J490l186l468q664J2294J2656k808j7853O632
4924f245J6270J8685j01j8970o390P241o60p939M231l005l160N293M053R389k245
4909A6447M475k135j1042q139O33L768J86K667j4259L379j646j9848J4199J6446
4895E131j0831j6577m576J6742L75m572J5643p035R12K290q320k228k39L02j0216
4880b3199l252K0230M429N500J133n634M463J5360J09j187p104j2582j605Q767
4866E428M971J0777L54j5267K258l087N125O013o74J2566L91k1601j4845P360
4852b31Q860N746p93q320n209M980m179j0220j8753j1329N635J0604P174O986
$$ y = [1143, -2069, -10522, -23783, -17746, -6312, -1038, -3930, -10971, -23573, -9574, -6297, -2039, 13413, 23923, 15945, 16270, 859, -4475, -3338, -1848, -5034, -8502, -17166, -4872, 7784, 4976, -12877, -6245, 10025, 28710, 28609, 9639, 3249, 10490, 9830, 1891, 6122, 3117, -43, 5250, 9303, 18692, 16447, 20922, 18787, 7745, -394, 239, 4007, 4193, 6860, -7399, -4020, -5666, -25514, -11315, 5131, -5700, -22277, -26853, -10111, -9736, -14308, 1335, -5700, -4788, -2498, -10818, -13046, -13285, -12983, -23199, -26451, -6221, -1792, 3708, 4841, -793, 3670, 19030, 19139, 17952, 10848, -1734, -3339, 5428, 10399, 21176, 21530, 6263, 8521, 5434, 10559, 16572, 15898, 28464, 28855, 7254, -7591, -231, 8629, 14375, 13582, 5262, 53, 5033, 854, -9366, -28119, -39448, -33813, -23209, -16035, -9049]
4838i049N252o150J0116J1916m750k002O329o160R89Q068K621k734l345N673j2953
4823C821p172J1367o619j6385n562L766j072Q29K870l613j448J7744O379l705
4809A200j1777m725l243J90O957J800N553p963j384q261M252J219j075R600P901
4794B44J1530J1276j348r42l665l097k898r211j807J0895n376J516J265m809p063
4779c490q535J1866M874j6482k0817r109J8129J6121Q448l818L266L051p904j6299
4765b0699p701r443J598R053K5079J9025m125j1587L357r588o045n64m301R477
4751f464n430Q610L560N28r678k258J2341J1163m137q372n794J2549q749j9134
4737b1265r176R802J5101l34k392n844r36j786J3001M954k607k1170j868J7908
$$ y = [-9049, -3797, -9947, 169, 12085, 7335, 5333, 11662, 5502, 6491, 14559, 17180, 14446, 11101, 16774, 3821, -3351, 8016, 1397, -14988, -20550, -16784, -17856, -17027, -14157, -17770, -19218, -1474, 4905, 1200, -10577, -15302, -18545, -18355, -11398, -9598, -4045, -12008, -13392, -21653, -17401, -16182, -17257, -7657, 244, 11774, 23050, 21702, 20760, 17095, 13998, 11100, 1889, 82, 10977, 5601, 7117, 8382, 3573, -3490, -12025, -159, 4715, -11767, -32584, -41693, -23564, -7443, 1005, -2813, 453, 3504, -4400, -20699, -28400, -37843, -36245, -27192, -2113, 16912, 12787, 1200, 4557, -5031, -11076, -11640, -15941, -6464, -11894, -3284, 276, 804, -8874, -11132, 1209, 12372, 8235, -137, -5931, 6618, -2131, -21265, -30441, -20639, -5538, -5872, -8264, -14108, -15044, -16830, -3829, 1125, -1482, -22652, -24520, -6612]
4723f612R367J106P905J292q359r062L545k617n394P817P995j3979l12O028l66
4708a646p00j925L704j413P30O944Q276q414r280j1276R432K725r684q245j221
4693b1993o792O654J29R097M139J3525O228j6206j147P735m618J1277L767q224
4679C571j055K803N542m107j6450j4024p607P813n38o988k324P557M153n205k960
4664b9819l488m522J0900J9824N034o838l967N272l085o842k502p309J4702J1867
4650g73o962Q659j2815P210M421l382j0060q891o171j08P300J1364M27Q247j0907
4635a2441q139n34L246P275R131J3815Q768j8946q931m271J8548J8498l051O106
4621B9074j3391k2103j3041J2098j527M316j855j4026o0J1340r868j192m510N398
$$ y = [-6612, 2755, 3861, 11766, 13058, 4699, -4363, -818, -3435, -8829, -1012, 6983, -6996, -7308, -1280, -1646, -2346, -4271, -567, -1980, -1250, 5694, 13970, 5556, -3724, -15000, -5568, -2843, -12527, -20772, -21993, -28785, -22131, -22002, -12905, -8766, 4759, 10987, -5219, -6366, 1369, -3249, 8028, 11795, 3571, 2516, 5319, 10861, 6754, -9696, -23720, -31327, -23514, -24052, -31040, -33364, -25807, -21654, -26859, -29819, -33307, -37829, -26929, -7105, -2071, -8909, -12876, -7604, -10689, -17531, -20033, -27342, -12640, -773, -7735, 924, -11891, -4681, -260, -3642, -13702, -22593, -28764, -28872, -21572, -10208, -9781, -1534, -12441, -20580, -21114, -17868, -10593, -1462, 12353, 21121, 2175, -6756, -11027, 7521, 26019, 22968, 29074, 15683, -6420, -19461, -7363, -8890, -4574, -6429, -20455, -20515, -9175, -19043, -20235, -24745, -19347]
4607a9347J6293Q208K309M973j1619q381j1334o51R344L260J3908L366P412m380
4593A3361m204j4956O949L967J2017l930j6298o3j5676J494J5176q586o540n426
4579b2715Q188J7065K879R342M839p198n516q304M092j3119J1242O337l557J0137
4565A3712M648k4370J5826J3176L521n217q776k224r486j7825L164J1793J3044
4552A0986K930p422o247R82q620k782k96M207L471q693q897j4356L216O269J6707
4537h545K2809Q379k3519j5107R775J2487M722N064r616j1791P851M973l175N387
4523I694Q475K694j0901m967J9114j1661n98n12k0396P270P613Q338m181j1171
4509a189M199r599q657J2811J452O530n781j440K554q821N876o90j1866R047J7485
$$ y = [-19347, -3054, 5154, 7463, 12436, 817, -7564, -18898, -19549, -10205, -6945, 6963, 10329, 17741, 13361, 9157, -5799, 1150, 5117, 17134, 13204, -3094, -3157, -18833, -17339, -2163, -10749, -17289, -22715, -14527, 2538, 5417, 14759, 19598, 12400, 6884, -1420, 2672, -10447, 795, 7132, 3575, 13712, 18360, -6010, 9816, 22992, 26513, 21296, 12520, 10296, 810, -17015, -13851, -2058, 10986, 13916, 6494, 247, 1229, -7391, -10173, -10469, -6262, -2791, -11484, -20381, -34737, -31521, -25252, -8545, 14264, 22643, -876, -15983, -6208, 6279, 11001, 16065, 6449, -5342, 2509, 7482, 4307, 9694, 18169, 20863, 9962, 4995, 24109, 12448, 11850, 11338, -9058, -1788, 5825, 14163, 9982, -1189, 3010, -6589, -15246, -2435, -983, 5547, -234, -1674, 880, -7941, -2065, -2755, -14621, -5574, 11911]
4494A1911P445r111k1846j5234q568J008P008J0216O267J1192J55m305J3398J1400
4480B0936p828p460J4864q265j7032q304J2106o059n013J397l892J4927K0753
4467B1130k125j6052n290M547L343J1305j5553n60O923o134j0981k595J5463J3405
4453A6826l166j9019j1924R929J3581K321j2339j829j859N317N774j2155J5452
4440F909K0891k3035J761J5162k771q846J3707k177k793Q267q53n576q289o304
4426F053K702J821J215J0537q296q622p983k828o099M662M744L344j846k646j8355
4411b1597m416J6074J6581p670m674k1034k358P477J4634n408j1395p704P350
4398b4140K1078j1356l769K0458l491q735L385J7660K628j8946L773q131q525
$$ y = [11911, 19356, 10245, -11601, -26835, -35403, -34395, -27387, -17171, -10904, 288, 443, -3862, 9536, 20936, 13108, 5648, 20512, 12247, -4785, -13089, -983, -7042, -12055, -10658, -14550, 377, 21130, 19005, 2953, -2337, 2210, 5553, 16858, 1305, 745, 7668, 1534, -9447, -12042, 3421, 16826, 13660, -5359, -17283, -7354, 6227, 8548, -3791, -5620, -7479, -2162, 3612, -8543, 6909, 27800, 4765, 6526, 21688, 18917, 10071, 23778, 21601, 18808, 27075, 26222, 20646, 12357, 6053, 8755, 10576, 11791, 22328, 14032, 5410, -2573, -5401, -11500, -6838, -2094, 1250, -596, -3242, -21597, -26013, -9939, 6642, -1028, -5702, -26736, -29094, -21617, -6983, -12391, -23786, -31490, -24140, -3062, -14418, -18187, 2271, -1220, -9955, -6570, 11090, 13718, -5228, -1455, -9586, -18111]
4385a8111K537K590o085J0915k46M084k565J7132j593N901K090N319q050n821
4371H097O478n18j0446r216m659K2769P652K573o205k4738j7115j5254L550J7744
4357a9288J6546Q014K58J0718l959q909J1666J754j0872q49j351r806O044J4697
4343A4663j2412k08r030j1343J2067K4250k713l874J3907J8909j5174j8377j8957
4330h292k738M412j24j0572M598R049N667P953J897p595j285k21n608l65O899
4315C675m570r889q479K091P381K463J0973q604O78N441J53l485n940Q375r881
4300i618n160K366n535l841J845J9766J5816j37J1308j0863j2896r782l864N384
4286e211l258l029N739J3911N110n945j3119j4713O313j3817j842K1277q666q473
$$ y = [-18111, -15574, -12984, -19069, -8154, -8400, -4316, -6881, 10251, 8658, 14559, 16649, 21968, 13918, 8097, 14575, 14057, 3611, -5605, -10264, 12505, 20157, 22730, 16525, -8213, -25328, -40582, -37032, -19288, -2742, 5272, 5530, 16248, 12289, 3380, 15046, 16800, 5928, 5079, 3728, -6078, -34, 14663, 2251, 2043, -6987, -18330, -6263, 17987, 15274, 11400, 25307, 44216, 29042, 10665, -8292, -11030, -6618, -6742, -17314, -12716, -3667, 2000, 9953, 11850, 4255, 2970, 2749, -2859, -3224, 3675, -895, -10784, -19263, -17172, -9791, -7328, 3645, -4959, -4281, 1160, 1313, -2172, -8112, 263, -9618, -14778, -12412, -17947, -21788, -19943, -177, 15639, 15502, 26810, 15947, 3051, -6731, -10595, -5211, -8469, -11498, -5759, 8152, 13262, 7317, -5802, -20515, -14202, -28019, -29861, -8584, -17250, -25723]
4272b5723L359J7352J1264p242J284Q044L229j9553o009N502l743N744R61o296
4258a1827J899j884J299j138J5722K374M958j4941l169N235o751j3935J417O489
4244a4252J9972l876j0339jl174o717N130J6518N807j2106K711M803K279J2079
4230A8834J0548j6949p401q935o246J1048M419n68J4680j4103j7391j1466r049
4217c2579K672J4235J3914l232K319m959K54Q134K403J0864Q060n775K141J1000
4203B9451q598l907l789m377j0775N726l760j857M930N050O47p218M586P179K57
4188A3545K264R113O019n511j6237N243k547Q27k275k162K262M324N421o873k3759
4173a0346l676j358J636J127K2867M984p931j7395j016R857N669N001j339L365
$$ y = [-25723, -22364, -5012, 6252, -990, 294, 8338, 11567, -7986, -13995, -8493, -12236, -6492, -5531, -11827, -9928, -11812, -10513, -11651, 4071, 6445, 11403, -3538, -6707, -1472, -8223, -22158, -20741, -14252, 5720, 1844, -8495, -8496, -11670, -18387, -13257, 3261, 9068, -3038, -327, 4476, 6755, 18834, 29382, 12433, 5032, -3903, -10149, 899, 5318, 4750, 19430, 5327, -12064, -23530, -32579, -29907, -15672, -1758, -4990, -2671, -7630, -7376, 758, 3161, 14025, 22085, 16310, 18451, 29451, 20853, 16946, 13157, 8780, -1995, 3731, -29, -1886, 3044, 8094, 8741, 1523, 6109, 13288, 13545, 15809, 24922, 30941, 25430, 9193, 14436, 11889, 12716, 10441, 8279, 10541, 14865, 20286, 13413, -10346, -14022, -15380, -13744, -12617, 10250, 15234, 7303, -10092, -11108, -1251, 4418, 9419, 8080, 11445]
4159A1445q703N632J78j0096K597R351j1647k666j7863p354r511M948O105J4200
4145a3384J1923j8938j2304K0008K4331J3183j3630j4748k929K973n323j4345
4133b3183N206J9562Q088q866j5771K027K0435K1895j2671r365l967m790j302
4120b702j2587K559L929L624L937m297l623j2092R611J1389J0136k843l951R580
4106A2670j4784J685Q986M906j96P840j6092L49J919o425p945J432J2279M315
4092A0939M651o455o416k2221j3012J4187Q037J6407K0727q789n841j6091M254
4079C77k070o557k2645n182J0265O221J3883q591k930J5457j6237q281N548O251
4065a4491R054J0050M810o112m851j1866n638k235k96L541m687p202M298L479
$$ y = [11445, 2742, 8374, 8552, -1544, 1053, 10404, -1243, -3909, -21772, -29126, -38637, -33689, -27584, -13384, -1461, -20399, -32703, -12695, 11636, 24819, 11189, -3559, -6488, -3515, -8838, -23183, -17977, 1585, 9673, 807, -14964, -12937, 7498, 29393, 16722, 7357, 3390, -1400, -2702, -15289, -12730, -8801, -5177, -1240, -5537, -9160, -21252, -11641, -252, 9884, 7041, 3090, 12670, -2114, -429, 8557, 13463, 13267, 21107, 5015, 5364, 7283, 858, -7087, -5655, 6624, 10939, 15590, 9135, 2719, -19502, -32514, -18327, -10290, 6117, 26844, 18055, 12214, -3877, 377, -1693, -8250, -30895, -36077, -25812, -19591, -5708, -14299, -17229, -1772, -18009, -26290, -20742, -14491, -5437, 4613, 9423, 3311, -1540, -13406, -19044, -21279, -21575, -18034, -22721, -29923, -25625, -22146]
4051b2146q95P922N966L778p540j0535P926n642R717Q868m102n029j0685p652
4037c0049O128J2272R679J3962n507n338n892l688P47N321L30J1514l42m241K0721
4022B5617J7004p210j3160j4828m743j3380j397K828K1227q884k162q317j0098
4009a7503q69o299J0892K0180r28k4638O511J1244n699p21P474p68n016m115J3696
3994C441O935p028P438L088l309j6777j5542o145j0988J3400n9m845Q155J0197
3980a2039J9833J6507j4185p426l123J1651l464p790m562P998K992J0004K377
3967A8773j7769j581Q864R311r544j5173p43j762q920j38P344J6092J324P435
3953A3513r197m201J3098q459m198M721N887J1732q766j5427Q36N273lo641O36
$$ y = [-22146, -23041, -15119, -9153, -5375, -12915, -23450, -15524, -21166, -11449, -2581, -6683, -11712, -22397, -30049, -23921, -11649, -1970, 11992, 6485, 1147, -4745, -8433, -7686, -2365, -2035, 9479, 9137, 4896, 25617, 42621, 35411, 22251, 7423, 2680, -10700, -12097, -9269, 11958, 3074, 912, -7405, -17503, -18372, -24671, -13779, 6401, 5473, -19165, -12654, -1410, -7109, -7830, -356, -1124, -6140, -10255, 3441, 10376, 3348, 10786, 13874, 10565, -6212, -21754, -27899, -38887, -25487, -25546, -30391, -22236, -12039, 7794, 24301, 10116, 2690, -433, 11218, 7754, -36, -4598, 3400, 6392, 16396, 18773, 1004, -577, 8287, 17598, 8054, -7119, -7862, -9624, -18544, -18682, -11338, 4754, 6078, 13513, 4316, 115, 13213, 4754, 556, 5277, 11164, 22896, 14130, -1297, -461, 4812, 4809, -1832, -1196]
3938a196n512O706r695q327N777L803N172L38p420j3496L366R495P635l032j3895
3923b0281K098K5102j5516l363l717J0789J3349K1511P200k0690m542p932m121
3910a13J187o608j4850L00k956l5J6154J8855O455k971n07L86L90m559n322k693
3894C113j5845k825L669n611j1525N518j2181q64J3469o0j5754j3941M166J7925
3880c0746J3017K2523j0018n633J0086N962n749n49K303J1466Q711k756p08j4967
3866B942l401q284j3053l248M921P213L26M040P648N763l515k1164l234J5359
3852g687J4096p697j3255n128J4135Q802r712l512p850J4777J7428m561j3951
3839d115m10J571P403j0346K096P25j6219p604K029Q966J2222J343n706l868M633
$$ y = [-1196, -6708, -2, -9697, -18024, -12247, -8444, -3272, -2934, -10354, -23850, -20484, -10989, -3354, -6386, -20281, -18183, 6919, -8597, -11960, -15677, -4888, 8461, 29972, 37172, 16482, 11940, 4008, -113, 1074, -5534, -20384, -20084, -23040, -23075, -6921, 11934, 18389, 15418, 14911, 15297, 15687, 11128, 5806, 3113, -12732, -15557, -11888, -17499, -29024, -23506, -35687, -36551, -23082, -23142, -38896, -52837, -48671, -30746, -17729, 4794, -5224, -10857, -771, 5191, -558, -1107, 1196, 12662, 21373, 18617, 17909, 2942, -459, -8743, -21796, -25044, -20123, -12910, -12584, -8544, -896, 4867, 1352, -19812, -23046, -7687, 6409, -1288, -14543, -19671, -5536, 3266, -6446, -9958, -17808, -3031, 14397, 9836, -4115, -4525, -2954, 4449, -5897, -3801, -3076, -19295, -26899, -24870, -15904, -3682, -2339, -8045, -11913, -7280]
3824g280j2105k454P340J854q118J0733Q271r00K133p76j2124j725p30j081n469
3809b2431R061K054J3407L236o088M263R900j440o80j2876m408N956o075p801
3795a3922J3520N352n091p68K97j8489j8696j982J0273L624J1152J6098J781J3309
3781A6458J3443p941j2472r536r151L39N193J2879k092j5548p019Q554R29j1O369
3766C94R571L8r092J1011J2831j1015j2528J1585P357k25j1880r155j331k459
3752d898L616J428j75K383kr616K783k196p57n862l769j1323J2266J1405L697
3737a020J2224n585m502Q42n676P889o083k7N210M483J487Q089Q995j7067j8061
3722h802M684P997K279K787p522m55p415m783J179K241q58K341O299r884J0898
$$ y = [-7280, -19385, -21839, -14499, -12645, -20763, -10030, -1759, -2659, -526, -1302, -13426, -15151, -15881, -16962, -22431, -13370, -11316, 2091, 5327, -761, 3502, 13402, 11962, 11282, -1594, -6002, -46, -6121, -13922, -402, 4950, -141, -909, -612, -19101, -37797, -39779, -29506, -25882, -14730, 1368, 3149, 16458, 29901, 21960, 9488, -48, -9199, -8860, -3667, 9212, 7120, -8428, -15447, -6893, -5964, -5975, 394, 9965, 10003, 911, 11922, 24753, 13738, 1210, 12795, 20152, 19927, 8047, -1108, -2439, -4898, -1282, 146, -29, 2354, 2352, -7264, -4481, -6677, -7434, -13296, -17065, -28388, -16122, -4717, -1020, 11204, 5619, 1117, 1959, -3717, 4172, -1911, -1938, 3272, 7755, 9242, 17331, 26326, 9259, -8802, -4118, 3879, 6158, 8945, 1423, 968, -6447, -11230, -10051, -7810, -8668, -6327, -28, -9912, 986]
3707I86K1840p245j8314P95J187j0609k932n615r49o789M237j162q609J9059J203
3692a2917L669n70k45p7R417j2694m637P852K261O618J0015Q946K355q840j2246
3677a093o771o300Q968Q534r605j6326J6483J0917K660p521j1432K5984n68k881
3663A1049o182M858j3016n742N539L109n867j963L392Q752p664q716O05N206K2679
3648A6039Q787j0211r651m901p172j1331k061N597n797j134R786J5384O296q192
3634A439K493J8117R041j1004l920j2057o71Q071k833k685j848k575J062k142
3620D88q703p97K6887L16r811j811p322l225j4071j1509Q265J0503N754p431k253
3605a4720K775k727r654O794J6105M771n488J0467P277o522j6413j071J1044J0981
$$ y = [986, 22826, 15581, -2733, -1938, -751, -11360, -14292, -19907, -20856, -27645, -23408, -24570, -33179, -14120, -12917, -9248, -9818, -10063, -10140, -723, -13417, -18054, -10202, -7941, -1323, 8692, 17638, 19993, 11153, -1093, -7864, -14164, -5196, 3338, -6267, -22593, -6110, 4807, 7467, -54, -11486, 14498, 13930, 11049, 4867, 9725, -3291, -9033, -3494, -385, -6252, -8215, -4823, 3929, -3735, -12451, -11846, -6640, 16039, 24826, 14615, 4964, 63, -7109, -18440, -20501, -14904, -20701, -21835, -12049, 3335, 9631, 1439, 3932, 22049, 31090, 20086, 16166, 4109, 3438, 11509, 8676, 5991, 4143, 1568, 2630, 488, -8215, -9012, 17875, 18191, 8380, 6569, -753, -3978, -18049, -29558, -21293, -10790, -5036, -12467, -14720, -11945, -14672, -24326, -17532, -1427, 3344, -2144, 8323, 15600, 9078, -7335, -8406, 2638, 13619]
3591A3619Q577N42l866N320M705k5466r715n691J2576k134q581p635q368J9588
3577f529O619k079j341k720o503R992l991j3047M539L812R574m826J1278O555
3563A1333r964j3576P676J1613p955M391K150J1197J621o024j7673J0205J3439
3550A8433n212o249P545M959J10j1004o816P983k605j8477j6546k028k53J6373
3536a3787j281K279m468l679J1552J7521l36j4806j7156n049M813m635J2107J76
3522a6749N344j670m869o550R41P289J844J196J367L244o579j4832O701J4657
3508h666l359J1082J6129q582j5050j1620l050L590L32K091p58N55J1688J0442
3494D824P14L455j785R769P145r810o336m975P245l71p087O757M940j1184k821
$$ y = [13619, 22196, 22738, 18872, 24192, 28897, 3431, -6284, -11975, 601, -1533, -10114, -17749, -26117, -6529, 90, -1989, -3330, -6050, -12553, -2561, -6552, -19599, -15060, -11248, -1674, -6500, 4778, 11333, 1369, -12207, -4531, 7082, -873, 3518, 5668, 16865, 18486, 12462, -5211, 4994, 18433, 13221, 6972, 14517, 19476, 19586, 8582, 1766, 9749, 7144, -11333, -27879, -29907, -30160, -13787, -15068, -12789, -17257, -20936, -9384, 8137, 7801, -7005, -24161, -29210, -24397, -29032, -16925, -16749, -11405, -13075, -17944, -24494, -23553, -16264, -14420, -13224, -11857, -8613, -15192, -30024, -23323, -8666, -12025, -943, 15186, 6604, -8446, -20066, -23116, -19526, -19194, -17103, -17861, -17306, -5618, 4824, 5538, 8993, 7208, 16977, 24122, 14312, 7976, 3001, 10246, 9875, 2788, 9545, 14485, 3301, 480]
3479D80J1679O313J803q792K303J4847r737k0053j3534m190L37Q046N274O991
3465A767R655P19L363J891q234j0889j2143K963K0714N985m655q386k218J8966
3451A9498J8654M06l527r227j3378j0923k593q81j385R583j825m393Q463J900
3437A0372j50o20j314P364O833K403q105j2858j7429j674Q720N153k628r437R833
3422c537J0470j0031j4489J617L904q360j7674K510L694K0888J1430n419j064
3409f061J878K640N353l693j4332Q268j930r227K908J185Q638J2382J9282m204
3395B3087j8355j5409p935Q269J9394K351r396j8208p372m610p04J1116R000P978
3381g94O657N52o216j22K417J0793j6556l620M800m703o509j4063J0908P618J2440
$$ y = [480, 12159, 18472, 20275, 11483, 13786, 28633, 18896, -1157, -14691, -18881, -18544, -10498, -5224, 1767, 11422, 12141, 15504, 17395, 9161, -1728, -13871, -10908, 9806, 15791, 11136, 2750, 532, 19498, 38152, 38558, 35031, 25804, 12426, 1503, -1090, -1971, -3356, 6227, 4402, 9, 8472, 10372, 10222, 9602, 8288, 15652, 22485, 24888, 16783, 3925, -13504, -15178, -6458, -1305, -3933, -13370, -3537, 6933, -3098, -17587, -15970, -12066, -20426, -38100, -35590, -31896, -11008, 422, -4997, -6061, -4183, -1543, 3810, 117, -14215, -5947, -7877, -17104, -14196, -13011, -4373, 8009, 27291, 23087, 4732, -10677, -18612, -10343, 9051, 11402, 2006, -16202, -23574, -28184, -28888, -17772, -8772, -794, 5863, 6415, 199, 77, 2494, 13287, -3269, -6889, -2089, -6792, -13301, -27364, -16456, -8838, 3602]
3366C602M818p282L107N567k2001q710J6802N163R850L480J477j3989o808J4161
3352I237L142K5008N91j8580j611j0071p61L768N002k683J6760j440j4465k098
3338A1799R54j2133j275J1531P928n791J349J475k8397L257O992L306Q652l010
3324F637l954K0153Q346p555j45j9688m725J3394k551j4177r455Q719J5139J994
3310A2132r841q306J301p46R276M375N22o713l110Q972K528j3065K449J3581k887
3295A0468J488P486J4473j5041j7403l166R743J3741j1610j2977P020J2288J090
3282A7600n771k293M743O804j095j4078p091O733J298K35p957n36p312n290R602
3267d408Q500R191Q391L829j5172j0752q130R468J0505l748p177q810j4935J2323
$$ y = [3602, 8420, 1138, 4245, 9812, -12189, -20899, -4097, 1066, 10916, 14396, 15873, 1884, -4924, 9237, 12379, 37387, 37978, 19398, 17787, 7716, 6955, 10723, 15725, 13042, 29802, 28362, 13897, 11799, 12753, 620, -655, 10876, 18804, 13013, 14362, 15837, -12560, -9303, -2311, 995, 9647, 6637, 2683, 22836, 31182, 23627, 23482, 3794, -931, 12463, 9912, -4265, -13720, -5001, 10138, 12132, 2291, -6015, -4714, -5460, 3816, 8191, 8713, 2000, -1110, 7862, 10390, -2675, -226, 13355, 10468, 11956, 19442, 33915, 18874, 1471, -1695, 8048, 21789, 10179, -2798, 4222, 16510, 17600, 11829, 9536, 14279, 21083, 19988, 5910, -1181, 5552, 6850, 7085, -872, -1408, -8720, -14010, -4408, 4092, 13283, 21674, 25503, 10331, -421, -8551, 917, 11422, 7674, 497, -8313, -23248, -10925]
3253a0925J443l869R99O818K94j503J2379M972P027l948j5733p022q303k997r98
3238b1366n144J1007J2862j4366j6044J3622J4417n158j1215J1834J9468o09M272
3225A3580o100r216J0319N717r356r900N44M601M807n077n489k389p550N532K052
3210g925n693N472L330j4277j0799O874J0882O983n67j716J4044N956M378K339
3196A9281J3176n78J267K84o168o463j9502M256J613j6322P577j0496l897k789
3182a8761M777N547r472q895p210P578J4689O063j0257j445j645m860Q47R052
3168a3992p27j2816j1519J6813L443r628M013J4451n168r61J2364J091m647J961
3154e322J6647K307q506M224o565Q065q03r813l467P953N126k431q645m975N002
$$ y = [-10925, -9482, -13351, -12352, -5534, -5240, -6743, 5636, 10608, 17635, 13687, -2046, -9068, -17371, -20368, -21366, -26510, -15503, -2641, -17007, -33051, -19429, -5012, -10170, -21385, -9551, 9917, 9308, 13580, 7480, -1736, 8583, 14300, 4944, -4956, -4412, 189, 4996, -81, -5570, -7959, -15509, -9977, -7925, -13618, -8146, -4816, -19093, -29892, -23018, -12136, -5153, -5720, -7436, 6608, 12564, 16942, 19281, 32457, 31879, 33146, 33430, 27262, 20799, 1297, 5553, 7166, -9156, -1579, -12075, -15972, -18761, -13984, -8437, -17909, -26804, -34014, -26436, -11747, -5684, -15941, -17386, -19031, -23891, -23044, -13992, -14719, -27535, -39054, -22241, -18798, -28426, -24413, -9962, -15130, -16091, -3727, -2636, -7283, -5322, 11325, 13632, 5126, 9350, 2785, 10850, 10047, 234, -3233, 4720, 9846, 7415, -1230, -6205, -1203]
3139a203j736L039L183j4532m113K0197q303j1367N047M275P718m910j3702j8253
3125c4660Q312J6578K2152L507j6597O352j117J6914J0234J344n464r511m452
3112A3592n124L165n545j8969l858k978j221P987J0846j02N081N368O754m109
3098A0887r588Q543l624Q70O69J955j3554J413Q012M10L95l165l844Q561J9285
3083B7225Q038l909j0218j3238o882K762p96K135N33k483q084j048N613j951J76
3068b127J0036r661p929n233p034R109O409J6174L80j2852m946j415l067R12M525
3053f719J331J8799n678j1713n982N095O162J2741l91q193o058j5754J1874J4322
3039I836n592K001o215J1921J6006p197o846k841m029r866k904j214j2578q762
$$ y = [-1203, -2939, 100, 3283, -11249, -15362, 4835, -3468, -14835, -9788, -5513, 2205, -2705, -16407, -34660, -26348, -9770, 12382, 15889, -708, 5644, 4527, 21441, 31675, 33019, 27555, 18044, 13592, 8468, 11633, 6088, -12881, -16739, -19717, -20938, -12951, -2105, -2207, 2874, 8242, 14996, 10887, 1299, 9842, 6218, 7088, 7757, 9712, -3842, -2429, 5583, 5993, 6388, 3223, -621, 7940, 27225, 35263, 31354, 21136, 7898, 1016, 3778, 2982, 5117, 5650, 3167, -4917, -5965, -352, -2303, -2127, 7909, -1752, -9681, -14914, -21948, -12839, -6430, 9744, 10124, -2728, -7674, -9089, -12156, -11244, -6719, -5388, 13411, 7733, -3980, -9962, -4867, 1295, 14036, 13645, 5452, -606, -16360, -4486, 9836, 4244, 6245, 30, 11951, 27957, 20760, 13914, 11073, 7044, -2822, -5726, -6940, -19518, -28280]
3025b8280J0472R631J1621J26r771j1161K247k834P849N193p572p418M984J2653
3011b260p98J1238O431m336k383M348m462q795m813J6604n36O43l388j4104n859
2996a2470l232J8606Q027l565j4513p986J0126J8465Q602J1982j3612k7833k331
2983i734J830N938K434Q587o735q408M058m868K913R368q136N714J8815N566k956
2968B4386p325O80J6692j9992m985K7225P208k3759l589j4671N260m066j4534
2955a1470J7582l185j8055j4442l345J2203N412J3301J9458Q726n982j4883n874
2942e54J0123m153j6065j1513R631Q490o806k94l067j2207r025N493J9234M977
2928e736j181P860J6995n744j9131p754J3789O754k986J1321O320J5992j747k4216
$$ y = [-28280, -17808, -8177, 3444, 3570, -6201, -17362, -15115, -17949, -10100, -4907, -12479, -19897, -14913, -2260, -3058, 8180, 14611, 10275, 7892, 12240, 7778, -1017, -5830, 10774, 10238, 10881, 7493, -6611, -12470, -15702, 2904, 10931, 7366, -7147, -15133, -5007, 13458, 22060, 34042, 20430, -7403, -9734, -7904, -1966, 468, 9055, 2320, -6088, -2030, -6898, -3985, 5383, -2753, 2961, 21776, 27342, 24386, 17061, 17741, 34433, 14441, 9456, 36681, 43889, 20130, 16541, 1870, 7130, 3064, -11470, 6112, 2927, -15128, -29570, -32915, -20712, -15300, -1999, 17459, 26185, 20203, 5320, -554, 9569, 5416, -10649, -22162, -12531, -4041, -10847, -11141, -14208, -26415, -35440, -29947, -10713, -5736, -6917, 943, 17938, 12194, -6937, -14691, -902, 5852, 2866, 14187, 20507, 36499, 34752, 10536]
2914A0536j8804P773J4579k630n478Q789o443j1609J1302k772k0473k126L91o501
2900b3466Q97Q949L724M000o525J595J6736k554q505n264r590Q524J075m061k365
2885a6830J663M838L877J313m369J210O573J901L024K945j1078L34m857N935K4717
2870B1196J079j777q623j2071M490R501n49j1343R693J943J0698j266r28j5417
2856F626j0669M9P75j216K6275p002q580J7322n950j7054m026P958l6O768K626
2841A3866m811n828J820k136p914r675J2232J814q717O519J2170R477q068q590
2827B159k26j5292j973P535m987R490r491J4598m69j9933l320J0434Q812N918
2813C255P646l46j0037n052n015N841J4230n006p818p654m884l18j7948p748J8496
$$ y = [10536, -8268, -495, 14084, 11454, 5976, 14765, 8322, -3287, 8015, 5243, -15230, -17356, -16965, -23466, -22569, -13620, -9896, -5896, -12421, -10826, 5910, 3356, -5149, -10413, -20003, -11479, -10404, -14465, -16830, -15167, -10329, -6452, -5139, -9508, -8298, -1725, 176, 3200, 6145, -4933, -4599, -9456, -3521, 21196, 22275, 20498, 11875, -196, 4294, 13795, 13246, 1903, 11596, 13539, 24237, 22971, 22043, 6626, -4043, -3994, -3219, -4435, 21840, 14838, 6258, 23580, 17630, 576, -3450, 4508, 4472, 11240, 13866, 9055, 3227, 5047, 2911, -5003, -14678, -2446, -632, -9349, -2830, 9340, 18817, 10749, 2159, 1933, -13359, -15332, -7797, -12784, -3294, -12785, 1813, 1344, -18589, -21909, -11475, -2663, 3255, 10901, 10555, 518, -4534, -9549, -3708, 10522, 5516, -2302, -9956, -14840, -15158, -33106, -40854, -22358]
2798b2358n244K288Q927N377R918o086p562O064J2305L555K443J4490o746j8726
2784a355Q825K9666J316j4547l336j1405j6323J3767R03J6656M955r833j9196
2771I3k444J259J9198L576j7207k77p29J5698K102j898J0698j4195j8678k06N395
2756B385R94j271L862n970k5676K958J902J451J0158N000J4779J929k221L332
2742A3612j6612m058m730M459J5299k641j502M086J6354Q801j4062J0027j3457
2729A5576j8099J646K879j182j6136r67M668N895O434m189k1220k02L017J9700
2715b180R056P69j81j2577J998r720p821L168M465O435J0624O380J742r594o888
2700d324J100K383l155L258m368p650J030m457L584j73J850P979J0294R493r954
$$ y = [-22358, -27602, -25314, -16387, -11010, -1092, -7178, -14740, -8676, 3629, 7184, 9627, 24117, 17371, -1355, 7470, 37136, 38452, 23905, 20569, 9164, -7159, 6608, 7511, 24167, 29122, 19289, 93, -2351, -1092, 18106, 21682, 4475, 4198, 3469, 19167, 21269, 19371, 30069, 15874, -2804, -3010, 2385, 3379, 2108, 5970, 0, -25676, -22718, -20816, -19365, -9207, -4207, 10572, 12501, 10280, 13612, -3000, -7058, -11788, -7329, 7970, 5329, 3827, 7913, 24267, 33068, 19006, 29033, 15576, -2523, -877, 2002, 820, -15316, -16283, -11615, -5720, 714, -3475, -24695, -24897, -21880, -2180, 6876, 7645, 7464, -5113, -3115, -12835, -20656, -17488, -13023, -6588, 4036, 10416, 12158, 2564, -4324, -3224, -841, -3996, -738, -5106, -12756, -11726, -16183, -12599, -12772, -10922, -2943, 7351, 16844, 6890]
2685F890o08J3388J922j5817k0053j2382J8156K1054P033j7345R385o26k907J961
2671A0051j183j0292j3407j2655p096O048J3092K2218P272j2682J417l974p988
2658i179j482M11J3783r547k0760j382M918J890J1816L885L262J292j1032p609
2644a9734O937N903M060K882J028j519r883k522J323l9k758M184j333k736O828
$$ y = [6890, 6282, 19670, 21592, 5775, -14278, -26660, -8504, 12550, 19583, 2238, 11623, 10997, 8090, 10051, 8868, -1424, -14831, -27486, -34582, -28534, -15442, 6776, 14048, 1366, 2783, -1191, -9179, -10661, -10250, 3533, -6014, -26774, -28156, -23238, -21348, -9532, -5647, -2385, -1093, -12125, -19734, -12797, -6894, -2834, 48, 1076, -443, -10326, -12848, -11525, -11564, -14322, -10138, -11471, -14207, -7379]
$$ [...]
##END NTUPLES=NMR SPECTRUM
##END=
