##TITLE=Analysis number 319753
Compound Code cc 33113
Book Reference 483/20
Project Code adrs
Chemist Name mattw
##JCAMPDX= 6.0         $$ Bruker NMR JCAMP-DX V2.0
##DATA TYPE= NMR SPECTRUM
##DATA CLASS= NTUPLES
##ORIGIN= Bruker BioSpin GmbH
##OWNER= nmr
$$ XWIN-NMR		Version 3.5
$$ Thu May 25 13:07:24 2006 GMT Daylight Time (UT+1h)  MAYBRIDGE\nmr@NMR_250MHZ
##.OBSERVE FREQUENCY= 250.131544655141
##.OBSERVE NUCLEUS= ^1H
##.ACQUISITION MODE= SIMULTANEOUS (DQD)
##.ACQUISITION SCHEME= undefined
##.AVERAGES= 16
##.DIGITISER RES= 18
##SPECTROMETER/DATA SYSTEM= dpx250
##.PULSE SEQUENCE= zg30
##.SOLVENT NAME= CDCl3
##.SHIFT REFERENCE= (INTERNAL, CDCl3, 0, 16.522)
##AUDIT TRAIL= $$ (NUMBER, WHEN, WHO, WHERE, WHAT)
$$ ##TITLE= Audit trail, XWIN-NMR		Version 3.5
$$ ##JCAMPDX= 5.01
$$ ##ORIGIN= Bruker BioSpin GmbH
$$ ##OWNER= nmr
$$ C:\u/data/dgb/nmr/ADRS/5160/pdata/1/auditp.txt
$$ ##AUDIT TRAIL=  $$ (NUMBER, WHEN, WHO, WHERE, WHAT)
(   1,<2006-05-25 13:06:57.63 +100>,<MAYBRIDGE\nmr>,<NMR_250MHZ>,
      <created by zg, POWCHK disabled, PULCHK disabled
       configuration hash MD5:
       84 BC 41 DB A1 6E 1D 46 DA 25 12 A5 C1 ED C5 3A
       data hash MD5: 64K
       05 75 1A EF B4 95 AB FA 78 91 0D FD CB 6B B7 5B>)
(   2,<2006-05-25 13:07:13.99 +100>,<MAYBRIDGE\nmr>,<NMR_250MHZ>,
      <Start of raw data processing
       ef LB = 0.3 FT_mod = 6 PKNL = 1 SI = 32K 
       data hash MD5: 32K
       81 C4 B4 A9 51 50 A9 A9 C7 A4 AF 11 25 47 0C 50>)
(   3,<2006-05-25 13:07:15.63 +100>,<MAYBRIDGE\nmr>,<NMR_250MHZ>,
      <apk 
       data hash MD5: 32K
       65 16 6A CF 1D B2 05 6E 2C 3A A1 68 E6 B2 B0 0E>)
(   4,<2006-05-25 13:07:16.36 +100>,<MAYBRIDGE\nmr>,<NMR_250MHZ>,
      <abs ABSG = 5 
       data hash MD5: 32K
       38 E4 58 E9 5B D8 A7 98 47 91 5B 33 61 9A E7 3A>)
$$ ##END=
$$ 
$$ hash MD5
$$ 42 AF 03 6B 4B CA 5D 84 55 18 25 32 40 97 28 CD
##$RELAX= 
##$RELAX= 
##$RELAX= 
##$RELAX= 
##$RELAX= 
##$RELAX= 
##$RELAX= 
$$ Bruker specific parameters
$$ --------------------------
##$DU= <C:\u>
##$EXPNO= 5160
##$NAME= <ADRS>
##$PROCNO= 1
##$TYPE= <nmr>
##$USER= <dgb>
##$AMP= (0..31)
100 100 100 100 100 100 100 100 100 100 100 100 100 100 100 100 100 100 
100 100 100 100 100 100 100 100 100 100 100 100 100 100 
##$AQSEQ= 0
##$AQ_mod= 3
##$AUNM= <au_zg>
##$AUTOPOS= <54 >
##$BF1= 250.13
##$BF2= 250.13
##$BF3= 250.13
##$BF4= 250.13
##$BF5= 500.13
##$BF6= 500.13
##$BF7= 500.13
##$BF8= 500.13
##$BYTORDA= 1
##$CFDGTYP= 0
##$CFRGTYP= 5
##$CHEMSTR= <none>
##$CNST= (0..31)
1 1 145 1 1 1 1 1 1 1 1 1 1 1 1 1 1 1 1 1 1 1 1 1 1 1 1 1 1 1 1 1 
##$CPDPRG= <>
##$CPDPRG1= <>
##$CPDPRG2= <>
##$CPDPRG3= <>
##$CPDPRG4= <mlev>
##$CPDPRG5= <mlev>
##$CPDPRG6= <mlev>
##$CPDPRG7= <mlev>
##$CPDPRG8= <mlev>
##$CPDPRGB= <>
##$CPDPRGT= <>
##$D= (0..31)
0 1 0 0 0 0 0 0 0 0.06 0 0 0 0 0 0 0.0002 0 0 0 0 0 0 0 0 0 0 0 0 0 0 
0 
##$DATE= 1148558816
##$DBL= (0..7)
120 120 120 120 120 120 120 120 
##$DBP= (0..7)
150 150 150 150 150 150 150 150 
##$DBP07= 0
##$DBPNAM0= <>
##$DBPNAM1= <>
$$ [...]
##$SUBNAM7= <"">
##$SUBNAM8= <"">
##$SUBNAM9= <"">
##$SW= 20.6930455092707
##$SWIBOX= (0..15)
0 0 3 0 0 0 0 0 0 0 0 0 0 0 0 0 
##$SW_h= 5175.983436853
##$TD= 65536
##$TD0= 1
##$TE= 295.16
##$TE2= 300
##$TE3= 300
##$TEG= 300
##$TL= (0..7)
0 120 120 120 120 120 120 120 
##$TP= (0..7)
150 150 150 150 150 150 150 150 
##$TP07= 0
##$TPNAME0= <>
##$TPNAME1= <>
##$TPNAME2= <>
##$TPNAME3= <>
##$TPNAME4= <>
##$TPNAME5= <>
##$TPNAME6= <>
##$TPNAME7= <>
##$TPOAL= (0..7)
0.5 0.5 0.5 0.5 0.5 0.5 0.5 0.5 
##$TPOFFS= (0..7)
0 0 0 0 0 0 0 0 
##$TUNHIN= 0
##$TUNHOUT= 0
##$TUNXOUT= 0
##$USERA1= <user>
##$USERA2= <user>
##$USERA3= <user>
##$USERA4= <user>
##$USERA5= <user>
##$V9= 5
##$VALIST= <valist>
##$VCLIST= <CCCCCCCCCCCCCCC>
##$VD= 0
##$VDLIST= <DDDDDDDDDDDDDDD>
##$VPLIST= <PPPPPPPPPPPPPPP>
##$VTLIST= <TTTTTTTTTTTTTTT>
##$WBST= 1024
##$WBSW= 4
##$XGAIN= (0..3)
0 0 0 0 
##$XL= 0
##$YL= 0
##$YMAX_a= 219339
##$YMIN_a= -279375
##$ZGOPTNS= <>
##$ZL1= 120
##$ZL2= 120
##$ZL3= 120
##$ZL4= 120
##$ABSF1= 16.522
##$ABSF2= -4.171173
##$ABSG= 5
##$ABSL= 3
##$ALPHA= 0
##$AQORDER= 0
##$ASSFAC= 0
##$ASSFACI= 0
##$ASSFACX= 0
##$ASSWID= 0
##$AUNMP= <proc_1d>
##$AZFE= 0.1
##$AZFW= 0.1
##$BCFW= 0
##$BC_mod= 0
##$BYTORDP= 0
##$COROFFS= 0
##$CY= 12.5
##$DATMOD= 1
##$DC= 0
##$DFILT= <>
##$DTYPP= 0
##$F1P= 14.0000005364418
##$F2P= -0.99999901652339
##$FCOR= 0.5
##$FTSIZE= 32768
##$FT_mod= 6
##$GAMMA= 0
##$GB= 0
##$INTBC= 1
##$INTSCL= 1
##$ISEN= 128
##$LB= 0.3
##$LEV0= 0
##$LPBIN= 0
##$MAXI= 10000
##$MC2= 0
##$MEAN= 0
##$ME_mod= 0
##$MI= 0
##$NCOEF= 0
##$NC_proc= -5
##$NLEV= 6
##$NOISF1= 0
##$NOISF2= 0
##$NSP= 0
##$NTH_PI= 0
##$NZP= 0
##$OFFSET= 16.522
##$PC= 1
##$PHC0= 179.5043
##$PHC1= 0.5029294
##$PH_mod= 1
##$PKNL= yes
##$PPARMOD= 0
##$PSCAL= 4
##$PSIGN= 0
##$REVERSE= no
##$SF= 250.13
##$SI= 32768
##$SIGF1= 0
##$SIGF2= 0
##$SINO= 400
##$SIOLD= 32768
##$SREGLST= <1H.CDCl3>
##$SSB= 0
##$STSI= 32768
##$STSR= 0
##$SW_p= 5175.98343685301
##$SYMM= 0
##$S_DEV= 0
##$TDeff= 65536
##$TDoff= 0
##$TI= <Analysis number 999999
Compound Code 99
Book Reference 9
Project Code 9>
##$TILT= no
##$TM1= 0
##$TM2= 0
##$TOPLEV= 0
##$USERP1= <user>
##$USERP2= <user>
##$USERP3= <user>
##$USERP4= <user>
##$USERP5= <user>
##$WDW= 1
##$XDIM= 32768
##$YMAX_p= 307111795
##$YMIN_p= -1044789
$$ End of Bruker specific parameters
$$ ---------------------------------
##NTUPLES= NMR SPECTRUM
##VAR_NAME=  FREQUENCY,     SPECTRUM/REAL,   SPECTRUM/IMAG
##SYMBOL=    X,             R,               I
##VAR_TYPE=  INDEPENDENT,   DEPENDENT,       DEPENDENT
##VAR_FORM=  AFFN,          ASDF,            ASDF
##VAR_DIM=   32768,         32768,           32768
##UNITS=     HZ,            ARBITRARY UNITS, ARBITRARY UNITS
##FACTOR=    0.157963299565203, 1,           1
##FIRST=     4132.6476996994, 0,             0
##LAST=      -1043.33573715361, 0,           0
##MIN=       -1043.33573715361, -1044789,    0
##MAX=       4132.6476996994, 307111795,     0
$$ Real data points
##PAGE= N=1
##DATA TABLE= (X++(R..R)), XYDATA
$$ [...]
17829E392055j90248k57704K28968k51607O5856l51909n09562l26100r4687M9144
$$ 5392055 5201807 4944103 5173071 4921464 4987320 4635411 4125849 3799749 3705062 3754206
17819C754206r9192j89112p4672O5189P8382j49601l39244j81481o4908k70545
$$ 3754206 3655014 3465902 3391230 3456419 3534801 3385200 3045956 2864475 2799567 2529022
17809B529022q0203k710j46451J2632J20836j82334l24268j13980K46987K94407
$$ 2529022 2448819 2446109 2299658 2312290 2433126 2250792 1926524 1812544 2059531 2353938
17799B353938K0434k81841n7036k14602k05090J80820M6082j61740j26930K22101
$$ 2353938 2374372 2092531 2035495 1820893 1615803 1796623 1842705 1680965 1554035 1776136
17789A776136L0865j37438j71155l6048Q8015j61292j79479j4332o4189K70748
$$ 1776136 1807001 1669563 1498408 1462360 1550375 1389083 1209604 1195272 1131083 1401831
17779A401831K93736J96464k18686L1997Q4840J69128l00109k00099J41462l6570
$$ 1401831 1695567 1892031 1673345 1705342 1790182 1959310 1659201 1459102 1600564 1563994
17769A563994K43521L87425k77108l48680l38531k45441r9899j74773J18569J22654
$$ 1563994 1807515 2194940 1917832 1569152 1230621 985180 885281 710508 829077 951731
17759I51731J51106K2676J42836q2978r7908K6625k93239j95911J68190R2183
$$ 951731 1102837 1125513 1268349 1185371 1087463 1114088 820849 624938 793128 885311
17749H85311q8398k06543O4884j76868n21233O7453K30784L53130N0846l48637
$$ 885311 796913 590370 655254 478386 -42847 24606 255390 608520 659366 310729
17739C10729M1697K46696O071j18823L47424k5787K9163j00136M3435j58760j68842
$$ 310729 352426 599122 605193 486370 833794 808007 837170 737034 780469 621709 452867
17728D52867K3816J67136N8955j37013m5256J77692K64326l1938j29540r9730
$$ 452867 476683 643819 702774 565761 520505 698197 962523 930585 801045 701315
17718G01315L9526j57897j63005M2266l22328m7778l10959k0J17227M02627j73415
$$ 701315 740841 582944 419939 462205 139877 92099 -218860 -218880 -101653 300974 127559
17707A27559k69325K13507O4106O1522J52843J5864L4280M0487k6593K24928J85897
$$ 127559 -141766 71741 135847 197369 350212 366076 400356 440843 414250 639178 825075
17696H25075j71175l70285Q1885J90139m8765M3434N6371k01497r8975q7856j66593
$$ 825075 653900 283615 365500 555639 506874 550308 606679 405182 306207 218351 51758
17685E1758L08864K63245n7937j98475M6330k60362o6529J3706J2978m5921l1506
$$ 51758 360622 623867 565930 367455 413785 153423 86894 100600 113578 67657 36151
17674C6151O5604J21431p1358J31719Q1471q1628r7175k28328J98127J64750j07310
$$ 36151 101755 223186 151828 283547 365018 283390 186215 -42113 156014 320764 213454
17663B13454j23776j29029K06583K3613P2571q954J24348n7867k07543m981L5496
$$ 213454 89678 -39351 167232 190845 263416 254462 378810 320943 113400 108419 143915
17652A43915n6988j6456J81119J13211j1079r4678j69514J40949J31368J68647
$$ 143915 86927 70471 251590 364801 353722 259044 89530 230479 361847 530494
17642E30494j67116k45331J9866n8834o1524J2548r6914L87000R9036K9887K23701
$$ 530494 363378 118047 137913 79079 17555 30103 -66811 320189 419225 449112 672813
17631F72813J63864K21465k53387j22302r0249j53170L407O3426k10079p7440
$$ 672813 836677 1058142 804755 682453 592204 439034 442441 505867 295788 218348
17621B18348j1572l281Q4786O2517J8886k25542o7588K31548P4267m6766k17482
$$ 218348 206776 203495 288281 350798 369684 144142 76554 308102 382369 335603 118121
17610A18121K29950J83374j14477r5961K00126j84981j13731j52517n3067k84423
$$ 118121 348071 531445 416968 321007 521133 336152 222421 69904 16837 -267586
17600b67586m9383J46879r8748M25k3299K27725L99665J14132k9404j78059j09974
$$ -267586 -316969 -170090 -268838 -268413 -291712 -63987 335678 449810 420406 242347 132373
17589A32373j07269m9600Q9632K89861L21641j73297n24209j55314M5873K18616
$$ 132373 25104 -24496 65136 354997 676638 503341 -20868 -176182 -130309 88307
17579H8307M6126L39621K57428k7035k23189j04111k70609m9422P5744j4704J13078
$$ 88307 134433 474054 731482 704447 481258 377147 106538 57116 132860 118156 231234
17568B31234j90126j38533J93561P6738l17253q9311K01024J83586K10123L34890
$$ 231234 41108 -97425 96136 172874 -144379 -233690 -32666 150920 361043 695933
17558F95933j83789m42821o234k2832o573k3458K54611k01521J55626j53800l40264
$$ 695933 512144 69323 63089 40257 33684 10226 264837 63316 218942 65142 -275122
17547b75122P9225L67151J7518q6759K4420l4671r0689r6446Q4038J41224n553
$$ -275122 -195897 171254 188772 102013 126433 91762 1073 -95373 -11335 129889 124336
17536A24336j05293l2974j91643k05632K7891L22910K36705q7118P7592k2709
$$ 124336 19043 -13931 -205574 -411206 -383315 -60405 176300 89182 166774 144065
17526A44065m2669J02173m6543j701j50824P2803O155R505M395J83139j97561
$$ 144065 101396 203569 157026 155325 4501 77304 83459 92964 97359 280498 82937
17515H2937j37840K72945M5603k005q4105P2731J15472J53304k93328k5131J90102
$$ 82937 -54903 218042 263645 261640 177535 250266 365738 519042 225714 200583 390685
17504C90685r2474p6909q3483j44365j88163K73006K62371m8137j26586j02433
$$ 390685 298211 221302 137819 -6546 -194709 78297 340668 292531 165945 63512
17494F3512K29089J39372k27481J06191k10912j918K29422K8422k89970j41369
$$ 63512 292601 431973 204492 310683 99771 97853 327275 355697 65727 -75642
17484g5642K76429l5042N8415j15794j33930R0679L54089j33071j74305R9030
$$ -75642 200787 165745 224160 108366 -25564 65115 419204 286133 111828 210858
17474B10858n4024K10960K03159j56577L3706L6417n1043j01574k37946j20342
$$ 210858 156834 367794 570953 414376 448082 484499 433456 331882 93936 -26406
17464b6406M41573K75175m34556J304J71601J82387q892j83353l56517l65754
$$ -26406 415167 690342 255786 257090 428691 611078 602186 418833 62316 -303438
17454c03438j28108m5202k3648N4363n5079J44452J66774J91428k1397R2155L26032
$$ -303438 -431546 -476748 -500396 -446033 -501112 -356660 -189886 1542 -19855 72300 398332
17443C98332K27275K90662J19045M63515M29512J49231j67555m81495k54722l09356
$$ 398332 625607 916269 1035314 1498829 1928341 2077572 1910017 1428522 1173800 864444
17433H64444q9908k0297k37703n6471k9381l24077j1751P9223J13599J84777J2583
$$ 864444 774536 754239 516536 460065 430684 106607 94856 174079 287678 472455 485038
17422D85038j38921m98894J38112K74013K27506N1549j31998m01300j79395P1249
$$ 485038 346117 -152777 -14665 259348 486854 538403 406405 5105 -174290 -103041
17412a03041K90453M66126K87418m5337j70615j81954m34517l2282P10j6801j74766
$$ -103041 187412 653538 940956 895619 725004 543050 108533 76251 76961 60160 -114606
17401a14606j41248J14172K7328r4554k6855j19041j86317r0003J93964J80872
$$ -114606 -255854 -141682 -114354 -208908 -235763 -354804 -541121 -631124 -437160 -256288
17391b56288J37703P7040J00416J44412O3080k07084j58761j12872j46379j16573
$$ -256288 -118585 -41545 58871 203283 266363 59279 -99482 -212354 -358733 -475306
17381d75306P086N9884j45345K47456K81990m9065K42139L50696J1081m63934
$$ -475306 -468220 -408336 -553681 -306225 -24235 -73300 168839 519535 530616 66682
17371F6682O0663J37805M1603r6697R8668L06750J4934j10321J69269K36041l22758
$$ 66682 127345 265150 306753 210056 308724 615474 630408 520087 689356 925397 602639
17360F02639k94793K6477j65782l9952r6545L94791l9752J5055L02527O9886k88651
$$ 602639 307846 334323 168541 128589 32044 426835 387083 402138 704665 774551 485900
17349D85900l63095n9820Q5167J82583m9033O54O9426o9108q2426n30224J07884
$$ 485900 122805 62985 148152 330735 281702 282356 351782 282674 200248 -329976 -222092
17338b22092M03633j8484J03418N3388J12463N6841J47739N0274j41675j6442
$$ -222092 181541 163057 266475 319863 432326 489167 636906 687180 545505 529063
17328E29063N613n9178J03841L5920L3505j86686p4310P059j68771l03734l25122
$$ 529063 534676 475498 579339 615259 648764 462078 387768 394827 226056 -77678 -402800
17317d02800J04476R4408J34245k39372p2329L4989K15999K52725r0993n9520
$$ -402800 -298324 -203916 -69671 -309043 -381372 -346383 -130384 122341 31348 -28172
17307b8172K17314J4160n1443k7197J42683n8345k30533O498J59726R5845r4800
$$ -28172 189142 203302 151859 124662 267345 209000 -21533 -15035 144691 240536 145736
17296A45736P4406L2482J24795J29761j16774k1566k46951J54055J4682n4298
$$ 145736 220142 252624 377419 507180 390406 368840 121889 275944 290626 236328
17286B36328j10724o8081r7179J37723M7017K55744j4536l14563j54444j19765
$$ 236328 125604 57523 -39656 98067 145084 400828 386292 71729 -82715 -202480
17276b02480O6289K03715J54020J27670k32627o3624J70852Q5558J15188p1237
$$ -202480 -136191 67524 221544 349214 116587 52963 223815 309373 424561 353324
17266C53324m06381k92017o510J97431Q4209K3204j8384j1456m3524J30456P1793
$$ 353324 -53057 -345074 -351584 -154153 -69944 -46740 -65124 -76580 -120104 10352 82145
17255H2145j93538j89846n8622L10003K15905o3641l81210k7272J49595K35184
$$ 82145 -111393 -301239 -359861 -49858 166047 102406 -278804 -306076 -156481 78703
17245G8703L24099J93348k46530R1767J72503j36747j8522k96091l13334k09018
$$ 78703 402802 596150 349620 441387 613890 477143 458621 162530 -150804 -359822
17235c59822J94042m8034j4231q8879R1051J27484K82256n310L578j78609P1832
$$ -359822 -165780 -213814 -228045 -316924 -225873 -98389 183867 178557 182135 3526 75358
17224G5358n906p3968J10009K51132m9903m1121k22681k18247J85675K36002k1922
$$ 75358 69452 -4516 105493 356625 306722 265601 42920 -175327 10348 246350 224428
17213B24428n5747m6777K23885l3023J64998O6485m17951K8900l9930r1191J85648
$$ 224428 168681 121904 345789 312766 477764 544249 126298 155198 115268 24077 209725
17202B09725j37738j07081q9322K24620J61538K15689k77012j33487q4647J32633
$$ 209725 71987 -35094 -124416 100204 261742 477431 200419 66932 -17715 114918
17192A14918J01998N8335m9385j02189k48236K61606K13454N2722j38919l57693
$$ 114918 216916 275251 225866 123677 -124559 137047 350501 403223 264304 -93389
17182i3389l8194K71361J07078J87072k6932j05263J6786K45272l02963l26332
$$ -93389 -131583 139778 246856 433928 406996 301733 318519 563791 260828 -65504
17172f5504l33191k349J18188J3107J69953J92749O3752O9601j28429j24740M8199
$$ -65504 -398695 -401044 -282856 -269749 -99796 92953 156705 226306 97877 -26863 21336
17161B1336O1931r8690j73959k4972m2589K094k5563l2456J84811o8165J26074
$$ 21336 83267 -15423 -189382 -214354 -256943 -254849 -280412 -312868 -128057 -196222 -70148
17150g0148R4219j63906q5141q951j63135N725L09251L74749J3401J65942J59153
$$ -70148 24071 -139835 -224976 -233927 -397062 -391337 -82086 292663 306064 472006 631159
17139F31159k65033m64937m8053N4326K13607L6789O9227l16643l44374L00773
$$ 631159 366126 -98811 -146864 -92538 121069 157858 227085 -89558 -433932 -133159
17129a33159O1012o749K02790j33504K1717J43988q2345j0004K58980R8266J35093
$$ -133159 -72147 -78896 123894 -9610 12107 156095 73750 63746 322726 420992 556085
17118E56085k42718j53710l245k19711Q5139L8222J3602l8241j29679j25881j42318
$$ 556085 313367 159657 156412 -63299 21840 60062 73664 35423 -94256 -220137 -362455
17107c62455K38197L2757J61700Q8882O598R5791N901j06610q2392j80710J01557
$$ -362455 -124258 -91501 70199 159081 165679 261470 267371 160761 78369 -102341 -784
17096g84j14668J11969l5970J03548M0693J5235J28928j72820j29521k04603j03640
$$ -784 -115452 -3483 -39453 64095 104788 120023 248951 76131 -53390 -257993 -361633
17085c61633J98149K84907p0202l7118N5242k3743q9901K93032K53884l5392l22378
$$ -361633 -163484 121423 51221 14103 69345 45602 -44299 248733 502617 467225 144847
17074A44847j29307k55154k23397M55573J3323p2563K36035j06552K7162J88166
$$ 144847 15540 -239614 -463011 -7438 5885 -66678 169357 62805 89967 278133
17064B78133j87600o1077K10078M5599J73340L07840q2837k67759K6425k10340
$$ 278133 90533 29456 239534 285133 458473 766313 683476 415717 442142 231802
17054B31802k5282r6475m41905m226J61589L45683j02428m691N1313n9954k4342
$$ 231802 206520 110045 -331860 -336086 -174497 171186 68758 64067 115380 55426 31084
17043C1084j38871n6493P6141L1213K53280J67399M4944k97884l61454k51851
$$ 31084 -107787 -164280 -88139 -56926 196354 363753 408697 110813 -250641 -502492
17033e02492Q1683Q5918K18468K65505k2756k17982P771k9679k94696j22828K06496
$$ -502492 -420809 -334891 -116423 149082 126326 -91656 -83885 -113564 -408260 -531088 -324592
17022c24592L10113O5072k34177j64039q6958K91821L36493J47384r2120j27212
$$ -324592 -14479 50593 -183584 -347623 -434581 -142760 193733 341117 248997 121785
17012A21785R9499K71187l15952l68925L0455J39865L31598K59799l25135m19981
$$ 121785 221284 492471 176519 -192406 -161951 -22086 309512 569311 244176 -175805
17002a75805k05378j50345K08088L05338L7443J37672o8278J23916R8367K68959
$$ -175805 -381183 -531528 -323440 -18102 19341 157013 88735 212651 311018 579977
16992E79977q6182k41338O6572l6340k45003k50205j08851R3884K34279J65801
$$ 579977 493795 252457 319029 282689 37686 -212519 -321370 -227486 6793 172594
16982A72594M8989j53342J83025k63012k2702J7529p765J63338o246j21859K59201
$$ 172594 221583 68241 251266 -11746 -34448 -16919 -24684 138654 132408 10549 269750
16971B69750N4027m22889k26708M6756N0606K83173J90462q2588j81848n1516
$$ 269750 323777 -99112 -325820 -279064 -228458 54715 245177 162589 -19259 -70775
16961g0775Q9051j66488j13764J10288K38468J03387P3006R4079j10881j00760
$$ -70775 18276 -148212 -261976 -151688 86780 190167 263173 357252 246371 145611
16951A45611L1728O1877j07721j06564q8115P2784l7310l0507L36087M9362k88168
$$ 145611 177339 239216 131495 24931 -63184 9600 -27710 -58217 277870 327232 39064
16940C9064l3705r5974M482J30706J82562M61772R0022r3722k67904k37267J8335
$$ 39064 5359 -90615 -86133 44573 227135 688907 778929 685207 417303 180036 198371
16929A98371Q58j30271Q7479J55104r780P9792L7307k30373k90925k04725o2948
$$ 198371 199229 68958 156437 311541 301761 381553 418860 188487 -102438 -307163 -370111
16918c70111K76942J65320J49580O2972p3760m632j52088k55056j5245j82235
$$ -370111 -93169 72151 221731 284703 210943 206311 54223 -200833 -216078 -398313
16908c98313M4872K22230J5674J17521M78662K68121j73508l08536l48559n8075
$$ -398313 -353441 -131211 -115537 1984 480646 748767 575259 266723 -81836 -139911
16898a39911q0147k6384J14257L9661k0745K13201J38914j28745k2402j60686
$$ -139911 -220058 -246442 -132185 -92524 -113269 99932 238846 110101 87699 -72987
16888g2987j93390N1727m2189J04415K5821m7291J06320L5549K45484J41734m16552
$$ -72987 -266377 -214650 -256839 -152424 -126603 -173894 -67574 -32025 213459 355193 -61359
16877f1359m01975k4372M54910K16547K93437k55250k31658l314Q6240J40418
$$ -61359 -463334 -487706 -32796 183751 477188 221938 -9720 -13034 73206 213624
16867B13624o1342l19111r0625o753Q3519J91032O156J58281J47211K42465M4911
$$ 213624 152282 -166829 -257454 -264207 -180688 10344 16500 174781 321992 564457 609368
16856F09368l13742l08458N3068o0721p782r5030o9362K97643j00309k18877K57738
$$ 609368 295626 -12832 40236 -20485 -28267 -123297 -192659 104984 4675 -214202 43536
16845D3536m1551R8923R0073N5824N8013Q83p4250l35879l49218O4640j10666
$$ 43536 1985 100908 190981 246805 304818 305701 231451 -104428 -453646 -389006 -499672
16834d99672J45511K90533M1003J3574L6539n7637J97131K18823r0437j77027
$$ -499672 -354161 -63628 -22625 -9051 27488 -30149 166982 385805 295368 118341
16824A18341k9764L11694K26966k23743q6399l7268j07490k24630r2425K85090
$$ 118341 88577 400271 627237 403494 317095 279827 172337 -52293 -144718 140372
16814A40372K35451L9476j45409j6164j66845n3247j01361k51965J55248L46429
$$ 140372 375823 415299 269890 253726 86881 33634 -67727 -319692 -164444 181985
16804A81985J15486n795o5607k60855j50323q132J17752K51334j72088k28772
$$ 181985 297471 291676 226069 -34786 -185109 -193241 -75489 175845 3757 -225015
16794b25015J41717P7137L0498O264O9905j9037O7984j10479j3495R7104O7617
$$ -225015 -83298 -6161 24337 30601 100506 81469 149453 38974 25479 122583 190200
16783A90200j29845n0056n3508j01545k15417m7793J94057j18442j58161K85434
$$ 190200 60355 10299 -43209 -144754 -360171 -407964 -213907 -332349 -490510 -205076
16773b05076J28526N480j40675P1018K36857r2049J91128J2511p658J28725m9923
$$ -205076 -76550 -71070 -211745 -140727 96130 4081 195209 207720 200062 328787 278864
16762B78864j777r8210r703Q4633j68654l01409J71117J50047R4407O7510l8521
$$ 278864 277087 178877 169174 253807 85153 -216256 -45139 104908 199315 266825 228304
16751B28304j88779l13980j93258J44602M43154L91263k2823N8488q6884J04315
$$ 228304 39525 -274455 -467713 -323111 120043 511306 488483 546971 460087 564402
16741E64402j04166l97786j13834J14999K6003k04885j65962j7766J63071J47113
$$ 564402 460236 62450 -51384 63615 89618 -115267 -281229 -298995 -135924 11189
16731A1189K57165q1188m9438J00219k71700j82393l61030j58663K28712M85429
$$ 11189 268354 187166 137728 237947 -33753 -216146 -577176 -735839 -507127 -21698
16721b1698L63953r5121o2458o5605O3133j37638p866L26246k19586j17188M1017
$$ -21698 342255 247134 184676 119071 182204 44566 36700 362946 143360 26172 67189
16710F7189L38196k560J71922j79636k64207K8174J46308N2888r4799j4162n2584
$$ 67189 405385 402825 574747 395111 130904 159078 305386 358274 263475 249313 196729
16699A96729k78082m76104o9701K67859L48185N2000q471o1240O2523J85481o2397
$$ 196729 -81353 -557457 -627158 -359299 -11114 40886 32415 -28825 33698 219179 156782
16688A56782j98763p6157j03565j95391k5675j26288Q3093N6673K31152K78991
$$ 156782 -41981 -118138 -221703 -417094 -442769 -569057 -485964 -429291 -198139 80852
16678H0852k13026k01429Q0238M13079o6548k56707P940L85554J70424L2330J15882
$$ 80852 -132174 -333603 -253365 159714 93166 -163541 -155601 229953 400377 432707 548589
16667E48589o0078r1754N4021p3217k06837j01719j48434Q9907j08872k18963
$$ 548589 488511 396757 450778 377561 170724 69005 -79429 10478 -98394 -317357
16657c17357J36670j02233K0630N8306K29422J67274j06989p6987K60191L51057
$$ -317357 -180687 -282920 -262290 -203984 25438 192712 85723 8736 268927 619984
16647F19984p1873m5769k30319j6282k84509j54940J24423J72696R17K6207k50773
$$ 619984 548111 502342 272023 255741 -28768 -183708 -59285 113411 114328 140535 -110238
16636a10238K4028P7514L74415N5039j46357k06873n2101J62618K1477j75249
$$ -110238 -86210 -8696 365719 420758 274401 67528 15427 178045 199522 24273
16626B4273O6286L5778J77232o407k27860J2581j40286j03717J93095j72930l43793
$$ 24273 90559 126337 303569 297162 69302 81883 -58403 -162120 30975 -141955 -485748
16615d85748j87810K26267K24127J18282K1800Q4896J22658q9887l1379K06803
$$ -485748 -673558 -447291 -223164 -104882 -83082 1814 124472 34585 3206 210009
16605B10009k20819L6212Q2304j44466l9258r9726j53526p3549R1537K43970l3061
$$ 210009 -10810 25402 107706 -36760 -76018 -175744 -329270 -402819 -311282 -67312 -100373
16594a00373J47297O1988j47646l5160k4200L47813K10254R2436k47348p4796
$$ -100373 46924 108912 -38734 -73894 -98094 249719 459973 552409 305061 230265
16584B30265j03853j61389K0681J85583k72942j60609J50983n1101O0950n270
$$ 230265 126412 -34977 -14296 171287 -101655 -262264 -111281 -162382 -101432 -106702
16574a06702k1872J61172N8385k51522J62081J12759j42070n0030R1771J86257
$$ -106702 -128574 32598 90983 -160539 1542 114301 -27769 -77799 13972 200229
16564B00229n7888k99986j55232K67812L3197k5738J75956k29700K66188J41769
$$ 200229 142341 -157645 -312877 -45065 -11868 -37606 138350 -91350 174838 316607
16554C16607j67144P3631Q6155J94100j91124l43850m4962Q8787K36670j71587
$$ 316607 149463 223094 309249 503349 312225 -31625 -76587 12200 248870 77283
16544G7283j29880J03604n1411K25953Q5324j49008N4891Q4962k2732r0149j72318
$$ 77283 -52597 51007 -404 225549 310873 161865 216756 301718 278986 188837 16519
16533A6519j33775j1143n3348j14724o3155J7863j22087K30254J82068n2440j6071
$$ 16519 -117256 -128399 -181747 -296471 -359626 -341763 -463850 -233596 -51528 -103968 -120039
16522a20039q623J53619K4006R5872J42356q1411j82771m47636j66981K04071
$$ -120039 -128662 24957 48963 144835 287191 205780 23009 -424627 -591608 -387537
16512c87537R1453J35867R9461j06916r3414L0931J34358Q6760r5006K02095M4775
$$ -387537 -296084 -160217 -60756 -167672 -261086 -230155 -95797 -9037 -104043 98052 142827
16501A42827j09322l07036q8590K43328J00418o1525k74499Q0352M6459J24870
$$ 142827 33505 -273531 -362121 -118793 -18375 -79900 -354399 -274047 -227588 -102718
16491a02718N68143J34638j89940j09101p9562j19902l3912J58723J2867q5830
$$ -102718 465425 600063 410123 301022 221460 101558 67646 226369 239236 153406
16481A53406j04224K30005l6292O2410q5830p5001J7912k7409Q0124Q0067k0098
$$ 153406 49182 279187 242895 305305 219475 144474 162386 134977 215101 295168 275070
16470B75070k05788l07347j6910J38402r9205P496L20630o1060j91021j19403
$$ 275070 69282 -238065 -254975 -116573 -215778 -208282 112348 51288 -139733 -259136
16460b59136p9107N6378j25603J81703L47767J25661j05335m04058j28339k12125
$$ -259136 -338243 -281865 -407468 -225765 122002 247663 142328 -261730 -390069 -602194
16450f02194J4073L52977L70403q5032l6684j01129j19116r5479r3019o9450K41120
$$ -602194 -588121 -235144 135259 50227 13543 -87586 -206702 -302181 -395200 -464650 -223530
16439b23530M63313o0923j44775R4357l06581j70703N5446P7574J40989q442O6526
$$ -223530 239783 178860 34085 128442 -178139 -348842 -293396 -215822 -74833 -83275 -16749
16428a6749p6838q5153k2713O8906K32926j26936l03814K15012K13131r5161o6263
$$ -16749 -93587 -178740 -201453 -132547 100379 -26557 -330371 -115359 97772 2611 -63652
16417f3652M1324j12578J19023P7819k7311K41448J4431l1118k92242k02526j7989
$$ -63652 -22328 -134906 -15883 61936 34625 276073 290504 259386 -32856 -235382 -253371
16406b53371K66615k12529o4853L32128L43308j32956l94632j72817O1257j44328
$$ -253371 13244 -199285 -264138 67990 411298 278342 -116290 -289107 -227850 -372178
16396c72178l4697O724n9800J27939K25875J8078k33173j9026p2609J17345R0968
$$ -372178 -406875 -400151 -459951 -332012 -106137 -88059 -321232 -340258 -412867 -295522 -204554
16385b04554r5829k3634l9953O4290K34812K34220K9805R655J76737o464l11819
$$ -204554 -300383 -324017 -363970 -299680 -64868 169352 199157 208812 385549 379085 67266
16374F7266N3660k5522K3588O0771L0231M6796r4233o5969K3300j85144p3791
$$ 67266 120926 95404 118992 179763 209994 256790 162557 96588 119888 -65256 -139047
16363a39047k00455J47151M22997j2644j30270j91618k14415J48487J38729L03007
$$ -139047 -339502 -192351 230646 218002 87732 -103886 -318301 -169814 -31085 271922
16353B71922j94146k67318J27663N7198k03515J91592J93310j11095j5450l70912
$$ 271922 77776 -189542 -61879 -4681 -208196 -16604 176706 65611 50161 -320751
16343c20751K04607M45625K38242n0866k02297n46465l31238M1013j17436k37783
$$ -320751 -116144 329481 567723 516857 314560 -231905 -563143 -522130 -639566 -877349
16333h77349j09407L75311K06657K56403O9002n7150J7032J70577o6111j49876
$$ -877349 -986756 -611445 -404788 -148385 -79383 -136533 -119501 51076 -15035 -164911
16323a64911l5104L59707J16526J28185m0428k69885j73120j50353L24018K68790
$$ -164911 -200015 159692 276218 404403 363975 94090 -79030 -229383 94635 363425
16313C63425r5116j7235J20809N4996M7441j12880k25946k19743K21420J08724
$$ 363425 268309 251074 371883 426879 474320 361440 135494 -84249 137171 245895
16303B45895j74069P8008l1866L5670j2510q8572j6247M461k033J80143J40123
$$ 245895 71826 149834 117968 153638 141128 52556 36309 40770 38737 218880 359003
16292C59003L8892p9637k02113M1725J17918j15701l52119j11945l4411k7850
$$ 359003 397895 318258 116145 157870 275788 160087 -192032 -303977 -338388 -366238
16282c66238l29448j14118K03439N44683L15811m2244k4301J54363o684k18504
$$ -366238 -695686 -809804 -606365 -61682 254129 211885 187584 341947 335263 116759
16272A16759O9211O6743j48718m7295K9423o9270q6410P1356J06281o7207P476
$$ 116759 185970 252713 103995 56700 86123 16853 -69557 1799 108080 40873 48349
16261D8349N4942q3267J71444j68252k93224j02339K6161l4351p2688O4310J32806
$$ 48349 103291 20024 191468 23216 -270008 -372347 -346186 -380537 -453225 -388915 -256109
16250b56109Q9915J37583K41195L8666k1655p2077K28227J48003j20066l5169
$$ -256109 -166194 -28611 212584 251250 229595 157518 385745 533748 413682 378513
16240C78513N1703j6032k17744r2091k77116r8720L6633j92498J24705K25651
$$ 378513 430216 414184 196440 104349 -172767 -271487 -234854 -427352 -302647 -76996
16230g6996O6185k26807o4796p2866k05573m6963l2624L18348L46499K03080l52
$$ -76996 -10811 -237618 -302414 -375280 -580853 -627816 -660440 -342092 4407 207487 207135
16219B07135j55359J1152L5270N1297K35371j13376k40822k55240J32214J66657
$$ 207135 51776 62928 98198 149495 384866 271490 30668 -224572 -92358 74299
16209G4299k11496l80898k37092J01343K06998J46968j0366K96136R3899Q8551
$$ 74299 -137197 -518095 -755187 -653844 -446846 -299878 -310244 -14108 79791 168342
16199A68342N2705l2289k8196J6010L24724j78896k47437l5715Q7484j41978N5320
$$ 168342 221047 188758 160562 176572 501296 322400 74963 39248 126732 -15246 40074
16188D0074L62198O0256j94500k7456J0843M1295j24170J28313J30333K2819j32608
$$ 40074 402272 462528 268028 240572 251415 292710 168540 296853 427186 450005 317397
16177C17397k44380P267K222j26496L19955K64237o4815m9041j01721r3256k12900
$$ 317397 73017 80284 82506 -43990 275965 540202 475387 426346 324625 231369 18469
16166A8469j60506J41580J38228K3979Q4234q3196l86452l30300N869P6698J13375
$$ 18469 -142037 -457 137771 161750 245984 162788 -223664 -553964 -548095 -471397 -358022
16155c58022Q8312M01568K54759k13950l28962P8247K37527K18336k77534k2656
$$ -358022 -269710 131858 386617 172667 -156295 -78048 159479 377815 100281 77625
16145G7625j17364O334N5951J27692K51339j67317j30639Q2735P5849k83941N2673
$$ 77625 -39739 -33405 22546 150238 401577 234260 103621 186356 262205 -21736 30937
16134C0937J63819k82563k07703M6974K51296J43009o3795L53677p2731j64338
$$ 30937 194756 -87807 -295510 -248536 2760 145769 81974 435651 362920 198582
16124A98582N612n4437l3939K42290k07326J22356N920k67530j71238j10212j59711
$$ 198582 204194 149757 115818 358108 150782 273138 279058 11528 -159710 -269922 -429633
16113d29633j21406M39291K09564q772K86510j901l64248k30003N1423M6045k76791
$$ -429633 -551039 -111748 97816 89044 375554 373653 9405 -220598 -169175 -123130 -399921
16102c99921J14067K17204K36538n8257J06274J99882j21885j3948j38759o1320
$$ -399921 -285854 -68650 167888 109631 215905 415787 293902 279954 141195 79875
16092G9875o7214P8377J02931j20201L11846L11397k69379n72553k71009N3233
$$ 79875 12661 91038 193969 73768 385614 697011 427632 -144921 -415930 -362697
16082c62697j6123L83786J40147j94944J02016Q6129j414J39111J16099N9463
$$ -362697 -378820 4966 145113 -49831 52185 138314 136900 276011 392110 451573
16072D51573k65735j13173P1030n557J65910m33092j11892L40809k9213o0504
$$ 451573 185838 72665 143695 138138 304048 -129044 -240936 99873 70660 10156
16062A0156J74874J94799k24639J32661k53397J1284J20098L5412j11499m01496
$$ 10156 185030 379829 155190 287851 34454 45738 165836 201248 89749 -311747
16052c11747j70304M49448J76037r4647K01076P1759j76665j11039J62805J02139
$$ -311747 -482051 -32603 143434 48787 249863 321622 144957 33918 196723 298862
16042B98862j29588J6024O0662O1447q760k58724m35382M0649J78642O7257j21431
$$ 298862 169274 185298 245960 307407 298647 39923 -395459 -354810 -176168 -108911 -230342
16031b30342j78266J93587R5554o9826M22416Q9070l19K0351n5872m8880N0941
$$ -230342 -408608 -215021 -119467 -189293 233123 322193 321874 342225 286353 237473 288414
16020B88414P9401p0142j26315L10607M9959J05213M5433j97539j04763R2234
$$ 288414 367815 297673 171358 481965 531924 637137 682570 485031 380268 472502
16010D72502P838j3804j58407O9741J3488j4117l04152k4205J05831N7093R1086
$$ 472502 480340 466536 308129 377870 391358 377241 73089 48884 154715 211808 302894
15999C02894m588J74810J16089k85977j02761M1626l5681j17932k28707j18442
$$ 302894 298306 473116 589205 303228 200467 242093 206412 88480 -140227 -258669
15989b58669m6845K68447K57486j08539k13331O3363q3360J00729O169j7736N8925
$$ -258669 -305514 -37067 220419 111880 -101451 -38088 -121448 -20719 -14550 -32286 26639
15978B6639J2153o505K6269j30362O4134O1338p2315l12646O5006K31148J29437
$$ 26639 38792 32287 58556 -71806 -7672 53666 -18649 -331295 -266289 -35141 94296
15967I4296N4153k99171l4058j2609j54116L5169L01099J97395j12982j17381
$$ 94296 148449 -150722 -184780 -197389 -351505 -316336 -15237 182158 69176 -48205
15957d8205k02267J33281j64093j41098J36330J25259j11821K7136o4732L21218
$$ -48205 -250472 -117191 -281284 -422382 -286052 -160793 -272614 -245478 -310210 11008
15947A1008K91565m1317J50832q3253j46141k3221r517k0299R5850P9618l41424
$$ 11008 302573 261256 412088 328835 182694 159473 149956 129657 225507 305125 -36299
15936c6299M39J55489J68710k20187j44958k56249j07593K10278K8657k8860J99072
$$ -36299 -35860 119629 288339 68152 -76806 -333055 -440648 -230370 -201713 -230573 -31501
15925c1501P2886l3013l1813M395j26349k12040R0680Q2139k09181J58970o9811
$$ -31501 41385 8372 -23441 -19046 -145395 -357435 -266755 -184616 -393797 -234827 -304638
15914c04638q9966P7427K20517K7254Q1100k2552j91383l20J8661J02419J61369
$$ -304638 -394604 -317177 -96660 -69406 11694 -10858 -202241 -202561 -183900 -81481 79888
15903G9888k2569k15821j44032n8436m2793R0124j02592j8013j688J23529K23252
$$ 79888 57319 -158502 -302534 -360970 -403763 -313639 -416231 -434244 -435932 -312403 -89151
15892h9151J46089J36153J44784l0460k96020r7776o5282k09725J84087L14238
$$ -89151 56938 193091 337875 307415 11395 -86381 -151663 -361388 -177301 136937
15882A36937k64958o6182q9918j29619J0620L84696P7504k67918k56642N4862
$$ 136937 -128021 -194203 -284121 -413740 -403120 -18424 59080 -208838 -465480 -410618
15872d10618K03965L3855J01645J43916K12668k29605q7756J10682O2892J35523
$$ -410618 -206653 -172798 -71153 72763 285431 55826 -31930 78752 141644 277167
15862B77167L6965O8228n5698n2551m376k64962l84658O3385J11874K86968k24456
$$ 277167 314132 382360 326662 274111 269735 4773 -379885 -316500 -204626 82342 -142114
15851a42114L93964J72144K20617j65965j91107P4439j46721m4913k59624m1962
$$ -142114 251850 423994 644611 478646 287539 361978 215257 170344 -89280 -131242
15841a31242l9069r8046k866L5345M3874j10429J07850R8332j1053J6938J76613
$$ -131242 -170311 -268357 -271223 -235878 -192004 -302433 -194583 -96251 -107304 -90366 86247
15830H6247m3220o9300J05906j1336j38652q8460j74937k7533L45480L16350J13803
$$ 86247 43027 -26273 79633 68297 -70355 -158815 -333752 -361285 -15805 300545 414348
15819D14348j23906j39810P792j54543j95809j51631N8478J88088j22804k23390
$$ 414348 290442 150632 158424 3881 -191928 -343559 -285081 -96993 -219797 -443187
15809d43187N8600j04181j12767K11565R5935k24188R0089J12481K21404J64274
$$ -443187 -384587 -488768 -601535 -389970 -294035 -518223 -428134 -315653 -94249 70025
15799G0025K02440P8695L4206N4605N807j33859k44449j19844J2138j41099J8983
$$ 70025 272465 351160 385366 439971 445778 311919 67470 -52374 -40236 -181335 -162352
15788a62352j1039q1394R7864k8270P8048K23029l2596j13316j79727J08472Q9875
$$ -162352 -173391 -254785 -156921 -185191 -107143 115886 83290 -30026 -209753 -101281 -11406
15777a1406K45898K1548N9924j01218r8509n9141p6695j50245J02292r8715j8639
$$ -11406 234492 256040 315964 214746 116237 57096 -19599 -169844 -67552 -166267 -184906
15766a84906k9627M3272o450R3065J96508O9058j69015P291K61030n733k59928
$$ -184906 -214533 -171261 -177711 -84646 111862 180920 11905 19196 280226 274493 14565
15755A4565q1932j1087l7100K57856J58311o2137J9723o8681k19046R6856J54032
$$ 14565 -67367 -78454 -115554 142302 300613 238476 258199 189518 -29528 67328 221360
15744B21360j565k19819o951R6159P657q8619j83701L69322J78942j71580k59253
$$ 221360 219795 -24 -6975 89184 96841 8222 -175479 193843 372785 201205 -58048
15733e8048P4260J99711n0753m1393j21092j58553l4516K2015j34799k5473q7200
$$ -58048 16212 215923 165170 123777 2685 -155868 -190384 -168369 -303168 -328641 -415841
15722d15841P2844R4913K49685m3032j51730O2216L77873n1490k16394k34720
$$ -415841 -342997 -248084 1601 -41431 -193161 -130945 246928 195438 -20956 -255676
15712b55676q3394L41107o3241k18584M8597p8981j00273j35998n2266K55425
$$ -255676 -339070 2037 -61204 -279788 -231191 -310172 -410445 -546443 -598709 -343284
15702c43284j99015O7981K51984Q1589N8189J50481p8068o3035j03203L204r940
$$ -343284 -542299 -474318 -222334 -140745 -82556 67925 -10143 -73178 -176381 -173177 -183117
15691a83117j24443o5903J13270K10181L43558K1917l27307j4227o4287j92979
$$ -183117 -307560 -373463 -260193 -50012 293546 315463 -11844 -26071 -90358 -283337
15681b83337q6093J15654J08436J46085K16640L24322P1262k98645k82897P5801
$$ -283337 -369430 -253776 -145340 745 217385 541707 612969 314324 31427 107228
15671A07228r2164k5623J93529L9145J8757l07890O3562R7850J2636k39076k39895
$$ 107228 15064 -10559 182970 222115 240872 -67018 -3456 94394 107030 -132046 -371941
15660c71941j36746O2804K10329Q1906j97716k00378J97727L01793J47735J44307
$$ -371941 -508687 -445883 -235554 -153648 -351364 -551742 -354015 -52222 95513 239820
15650B39820m7556R4780p3071j13700K84805j63623j85250K22896m1024O1797
$$ 239820 192264 287044 213973 100273 385078 221455 36205 259101 218077 279874
15640B79874j88019q7438k92737j58194J54747K50962p6296j91192j36023K0209
$$ 279874 91855 4417 -288320 -446514 -291767 -40805 -117101 -308293 -444316 -424107
15630d24107K96451K18143j21275j64198k40998k0274N04673O9239j50379K53737
$$ -424107 -127656 90487 -30788 -194986 -435984 -456258 48415 117654 -32725 221012
15620B21012k17266l58129K9302K78007K53470k00059P9021j92003j3339L65386
$$ 221012 3746 -354383 -325081 -47074 206396 6337 85358 -106645 -119984 245402
15610B45402J00826k68229m49514k16541M73799M47681j7280k33877l16909J49942
$$ 245402 346228 77999 -371515 -588056 -114257 333424 316144 82267 -234642 -84700
15600h4700M08097J34843l56073j62704J66923m15215J03291K69992k06081q5073
$$ -84700 323397 458240 102167 -60537 106386 -308829 -205538 64454 -141627 -226700
15590b26700j52736K23768j06559J43058K05768J62078j04843J4654J21311j02937
$$ -226700 -379436 -155668 -262227 -119169 86599 248677 143834 158488 279799 176862
15580A76862n0435k47073k34596J6147K99337K89742J62798l13918k30802j57805
$$ 176862 126427 -120646 -355242 -339095 -39758 249984 412782 98864 -131938 -289743
15570b89743J46619J67798j24245j17909J6301l1843J36608M25450K8520l60254
$$ -289743 -143124 24674 -99571 -217480 -201179 -233022 -96414 329036 357556 -2698
15560b698J54746k19503q1197K05087j99019J47917J33876l68011m0550l9746
$$ -2698 152048 -67455 -148652 56435 -142584 5333 139209 -228802 -269352 -309098
15550c09098J8895Q742p0891J27657K21037K0065k2729K56143n3796j1856j46924
$$ -309098 -290203 -281461 -352352 -224695 -3658 16407 -6322 249821 196025 184169 37245
15539C7245q2342J48608J46381k04882k11976p581J53683K30191K6412o400p1302
$$ 37245 -45097 103511 249892 45010 -166966 -174547 -20864 209327 235739 229339 158037
15528A58037O5325j61861j56265P2605J47253K11755j42518j41285n2333n9671
$$ 158037 223362 61501 -94764 -22159 125094 336849 194331 53046 713 -58958
15518e8958R5030J67554M5385m6020k5203j03003N4366j75357j26042R733J27043
$$ -58958 36072 203626 249011 202991 177788 74785 129151 -46206 -172248 -162515 -35472
15507c5472K36891J92926k3045k21978J11591j07408J27774o4708l66148r6632
$$ -35472 201419 394345 371300 149322 260913 153505 281279 216571 -149577 -246209
15497b46209O9797L37167m4470o7212Q0756J54308j11918j89652K15798J29584
$$ -246209 -176412 160755 116285 49073 129829 284137 172219 -17433 198365 327949
15487C27949j17534m3838j89226j67423P4089K02915N0488N3637r9395K9405j83756
$$ 327949 210415 166577 -22649 -190072 -115983 86932 137420 191057 91662 121067 -62689
15476f2689N7935K20815k17657k57462J0294m6979m8115J44321P1315J63829o330
$$ -62689 -4754 216061 -1596 -259058 -248764 -295743 -343858 -199537 -128222 35607 29277
15465B9277j19506K89682p4618k07045L381k23467k5979K24633J17258J69863
$$ 29277 -90229 199453 124835 -82210 -78829 -302296 -328275 -103642 13616 183479
15455A83479r344K22261j49997k08705j35909J05356K57963k48689j86864J31505
$$ 183479 174135 396396 246399 37694 -98215 7141 265104 16415 -170449 -38944
15445c8944l5665J07097n7084n1858O1136J33920J37784p4642j29515j22870j74143
$$ -38944 -74609 32488 -24596 -76454 -15318 118602 256386 181744 52229 -70641 -244784
15434b44784J98733o2026J8218n688J62442K68467j21557m4832j97327P2299O0764
$$ -244784 -46051 -108077 -89859 -95547 66895 335362 213805 168973 -28354 43945 104709
15423A04709j33714p6074J31167l866m31840j96490K27852J63624J16189o8349
$$ 104709 -29005 -105079 26088 22222 -409618 -606108 -378256 -214632 -98443 -166792
15413a66792J17487M0811j16674o4389n336K93379J36233J05019j10796j86401
$$ -166792 -49305 -8494 -125168 -189557 -194893 98486 234719 339738 228942 42541
15403D2541M6866J02962n00282p7974K30798l1705r2772j74147n6139o4267J54540
$$ 42541 89407 192369 -307913 -385887 -155089 -186794 -279566 -453713 -509852 -574119 -419579
15392d19579K57400Q8635J25775J41556j26083k84925p0749j3036j08378k9138
$$ -419579 -162179 -73544 52231 193787 67704 -217221 -287970 -301006 -409384 -438522
15382d38522K80271J62333J41382r7830k13796l4576J99796L01089Q4434l79343
$$ -438522 -158251 4082 145464 47634 -166162 -200738 -942 300147 384581 5238
15372E238k34439j2869J2674N3818k31258k58818j13402j21493J80436J89346
$$ 5238 -229201 -242070 -229396 -175578 -406836 -665654 -779056 -900549 -720113 -530767
15362e30767J41208J9265O1078K3745J04341L0310J39966j90034k73976L59172
$$ -530767 -389559 -370294 -309216 -285471 -181130 -150820 -10854 -200888 -474864 -115692
15352a15692r3287m42251N1046K0427q0291k5674O3486L13783j04896j58185L38839
$$ -115692 -208979 -651230 -600184 -579757 -660048 -685722 -622236 -308453 -413349 -571534 -232695
15341b32695J95544R3760J75028j66393j65452l34560r8501O7847K64918k0660
$$ -232695 -37151 56609 231637 65244 -100208 -434768 -533269 -465422 -200504 -221164
15331b21164n9967J733j33197k18909J89510K68477L33122K60054N7829J4140
$$ -221164 -281131 -279398 -412595 -631504 -441994 -173517 159605 419659 477488 491628
15321D91628p8523m6344r2520m3661n2836j13577K0747O0635j12890m2572K00772
$$ 491628 413105 366761 274241 230580 177744 64167 84914 145549 32659 -9913 190859
15310A90859j96820j21762J45519k1189M9509O9064m46414j36182K49581K03919
$$ 190859 -5961 -127723 17796 -3393 46116 115180 -331234 -467416 -217835 -13916
15300a3916L39805K41060l19957l95574N9546k62J59301J91741K8572J7323L65296
$$ -13916 325889 566949 246992 -148582 -89036 -89298 70003 261744 290316 307639 672935
15289F72935J0874j67218k88310n5677j79286l38986j32916j72913J12837L83373
$$ 672935 683809 516591 228281 172604 -6682 -345668 -478584 -651497 -538660 -155287
15279a55287r2301p6593J14391K14285J52655K030k47493Q0675J74607J63443
$$ -155287 -247588 -324181 -209790 4495 157150 159180 -88313 -7638 166969 330412
15269C30412M0505k62900k46787n6136M0318J91242J03145j1744k24369l53730
$$ 330412 370917 108017 -138770 -194906 -154588 36654 139799 128055 -96314 -450044
15259d50044J3885K28120j54311K78675J05635J463J37096L7459n0847j88003
$$ -450044 -436159 -208039 -362350 -83675 21960 23423 160519 197978 147131 -40872
15249d0872j34894J7909k85105J08450J80910n5693J68208j7363k22247k1083
$$ -40872 -175766 -157857 -442962 -334512 -153602 -209295 -41087 -58450 -280697 -301780
15239c01780Q5162J41624N9695M3233J28322K8284J82553j6429k5291L60547k50587
$$ -301780 -216618 -74994 -15299 27934 156256 184540 367093 350664 325373 685920 435333
15228D35333j63691k01589m2615J34021j4328k38829L2489J3601J77211q9781
$$ 435333 271642 70053 27438 161459 147131 -91698 -59209 -45608 131603 41822
15218D1822r5935j4388l15934J01742N1061k12228j9166K84826P8660Q1977O951
$$ 41822 -54113 -68501 -384435 -282693 -231632 -443860 -463026 -178200 -99540 -17563 -10612
15207a0612r2178o6457K10918J8543k87837K3858J76165L62686m1814j83858o1068
$$ -10612 -102790 -169247 41671 60214 -227623 -203765 -27600 335086 293272 109414 48346
15196D8346Q6780J64569R460k94533k35338L8824Q3217K58493Q0986p4184j77015
$$ 48346 135126 299695 309155 14622 -220716 -181892 -98675 159818 240804 166620 -10395
15185a0395q7887j70682p7237K03164J45084k57067K3486k9773J7668K97170k25304
$$ -10395 -98282 -268964 -346201 -143037 2047 -255020 -231534 -261307 -243639 53531 -171773
15174a71773M158K27478r3340j35654J77144J80888J82832K39491j60249k12178
$$ -171773 -167615 59863 -33477 -169131 8013 188901 371733 611224 450975 238797
15164B38797j80734j49908j7257j64097q3080j6440K74269P0448K9022K5284k3399
$$ 238797 58063 -91845 -109102 -273199 -356279 -372719 -98450 -28002 1020 26304 2905
15153B905K5352J36849j53816n3252J48923k60422k21060J26469R5220k04440
$$ 2905 28257 165106 11290 -41962 106961 -153461 -374521 -248052 -152832 -357272
15143c57272M1674L23347l3993r4424l6064K87381Q9217j42664k08740K17313
$$ -357272 -315598 7749 -26244 -120668 -156732 130649 219866 77202 -131538 85775
15133H5775J93437l34302P0036o6123j97880J04994l0204M1029j55097J457L3467
$$ 85775 279212 -55090 14946 -51177 -249057 -144063 -174267 -133238 -288335 -286878 -253411
15122b53411k07167j16337L71022R6108M7362K88645N1640j53426k69267L3368
$$ -253411 -460578 -576915 -205893 -109785 -62423 226222 277862 124436 -144831 -111463
15112a11463N2106J31967K7986Q9560J70567j14148j18693J63302q9444j86655
$$ -111463 -59357 72610 100596 190156 360723 246575 127882 291184 201740 15085
15102A5085Q6674P0074k24020O7958J97794L45641k32603l44866l09708j68518
$$ 15085 101759 171833 -52187 15771 213565 559206 326603 -18263 -327971 -496489
15092d96489n3979P5829l535J62979k1983K42184q5653j85325j06175O1658j09954
$$ -496489 -550468 -474639 -478174 -315195 -337178 -94994 -180647 -365972 -472147 -410489 -520443
15081e20443k65391K92427J25136j6264K26028R9814J34114K22132q0573j84345
$$ -520443 -785834 -493407 -368271 -384535 -158507 -58693 75421 297553 216980 32635
15071C2635j27240J78622j65653o6667k2175J18446j9719K08762K76741j11123
$$ 32635 -94605 84017 -81636 -148303 -170478 -52032 -71751 137011 413752 302629
15061C02629k39823J33817j9640R5993L6850K1218j62544k25754j61626p5156
$$ 302629 62806 196623 176983 272976 309826 331044 168500 -57254 -218880 -294036
15051b94036j33736M03846M75963K23864j949m68464m48876L5200J30409q4309
$$ -294036 -427772 -23926 452037 675901 673952 205488 -243388 -208188 -77779 -162088
15041a62088j59334q7525J8680K25344J42015j26226l00752O0080j31128J53532
$$ -162088 -321422 -408947 -390267 -164923 -22908 -149134 -449886 -389806 -520934 -367402
15031c67402Q7417J87472J53966J95856l94823m73530K64783M66862l33710n96977
$$ -367402 -279985 -92513 61453 257309 -137514 -611044 -346261 120601 -213109 -810086
15021h10086k5654L81480J94886J95734O2504J64751L2581j36237j96540n4262
$$ -810086 -835740 -454260 -259374 -63640 -1136 163615 196196 59959 -136581 -190843
15011a90843J9116J51724M7705l949j28778K0408N7169k24035j61094K40685J84727
$$ -190843 -171727 -20003 27702 23753 -105025 -84617 -27448 -251483 -412577 -171892 12835
15000A2835O3396o8282j0999K17471K73005k67398j50671K79719r774l54996k61932
$$ 12835 76231 7949 -3050 214421 487426 220028 69357 349076 339302 -15694 -277626
14989b77626J67892o6634m16721K73491K25593K432k44211r3826q3035K72513
$$ -277626 -109734 -176368 -593089 -319598 -94005 -91573 -335784 -429610 -512645 -240132
14979b40132L31867J17501j47610l3858O9427L6673Q2158L9574L1360m0461j54830
$$ -240132 91735 209236 61626 27768 97195 133868 216026 255600 286960 246499 91669
14968I1669l50083O4118j58617J33712J60378R1970J92506j39106j31856J97325
$$ 91669 -258414 -194296 -352913 -219201 -58823 33147 225653 86547 -45309 152016
14958A52016l43116j10832J53743L49743J09836p8770k98526j92325j28551q011
$$ 152016 -191100 -301932 -148189 201554 311390 232620 -65906 -258231 -386782 -394793
14948c94793n8900Q2004L55130J08927J975N0136k24315j19765L75657R6920m3455
$$ -394793 -453693 -371689 -16559 92368 94343 144479 -79836 -199601 176056 272976 229521
14937B29521j9569j73462r206k54797q925O205M3667L0749K8589Q2131l12693
$$ 229521 209952 36490 27284 -227513 -236438 -230233 -186566 -155817 -127228 -45097 -357790
14926c57790N8660J36703n9646O9435l5934L2211M356J5803L02388R7029q149
$$ -357790 -299130 -162427 -222073 -152638 -188572 -156361 -152005 -136202 166186 263215 255066
14915B55066k9294M5114J71918J41383m2230l4360j57011m12517l21822R2846
$$ 255066 225772 270886 442804 584187 541957 507597 350586 -61931 -383753 -290907
14905b90907L78948j63798P3650k3897L4355K5140j23249k74406J67368n8626
$$ -290907 88041 -75757 -2107 -26004 8351 33491 -89758 -364164 -196796 -255422
14895b55422j44413k25523l3944K69368L51830J19998K1078R3835j08730r8007
$$ -255422 -399835 -625358 -659302 -389934 -38104 81894 102972 196807 88077 -9930
14885i930j29843P3788N5356j50999n9333j25153j00074L78859P3357o9337K28394
$$ -9930 -139773 -65985 -10629 -161628 -220961 -346114 -446188 -67329 6028 -63309 165085
14874A65085K58232k1892k39176k02710m1189M9082N503k0175k90722o6761K38538
$$ 165085 423317 401425 162249 -40461 -81650 -32568 -27065 -47240 -337962 -404723 -166185
14863a66185L6627j56838J20198n7438L05080k1967J46931L2944k96605Q1612
$$ -166185 -129558 -286396 -166198 -223636 81444 59477 206408 239352 -57253 24359
14853B4359r071M2385J62332m90888k77063K53842K53152J60207o1918M95r5947
$$ 24359 15288 57673 220005 -270883 -547946 -294104 -40952 119255 57337 57832 -38115
14842c8115j34878J28776J15952l00578j76545K376P8329L2367L23787K09006
$$ -38115 -172993 -44217 71735 -228843 -405388 -403012 -324683 -292316 31471 240477
14832B40477k32700j18030J73195K05530J36006J14014R830j24476k2801M1778
$$ 240477 7777 -110253 62942 268472 404478 518492 528322 403846 381045 422823
14822D22823j79867l2928J92752j69188k00860r9044j11597l79203k85886L33031
$$ 422823 242956 210028 402780 233592 32732 -66312 -177909 -557112 -842998 -509967
14812e09967M05294P6225J84989K86122P6430O0636o2192J19247j71159l32232
$$ -509967 -104673 -28448 156541 442663 519093 579729 517537 636784 465625 133393
14802A33393p0438j67673j41644J62543K29883L4693K91670j38566j81481j86036
$$ 133393 62955 -104718 -246362 -83819 146064 180757 472427 333861 152380 -33656
14792c3656k21797J58381J47602p7864K6677J05960L42935m5617k66211p0255
$$ -33656 -255453 -97072 50530 -27334 -657 105303 448238 402621 136410 66155
14782F6155K74019n2560k28898r9409J67977J42058J29651M5113J79885J81760
$$ 66155 340174 287614 58716 -40693 127284 269342 398993 444106 623991 805751
14772H05751j69362j26045q8465L5991k9113k15757l46260j23510J83312R6730
$$ 805751 636389 510344 421879 457870 428757 213000 -133260 -256770 -73458 23272
14762B3272J10491K1743o3628j28338J90099L0694O8394k66149k20887n1137L17251
$$ 23272 133763 155506 91878 -36460 153639 184333 252727 -13422 -234309 -285446 31805
14751C1805M02942O5957k86072l77439m6208p6023o2497l4814j12141J18555j2161
$$ 31805 434747 500704 214632 -162807 -209015 -285038 -347535 -382349 -494490 -375935 -388096
14740c88096R1907M4209j02622J08174L34336K87275n1335Q2247k6380p7436j20122
$$ -388096 -296189 -251980 -354602 -246428 87908 375183 323848 406095 379715 302279 182157
14729A82157j54807r9329j74830j02599k58590J70463K99996J00950l3058m5650
$$ 182157 27350 -71979 -246809 -349408 -607998 -437535 -137539 -36589 -69647 -115297
14719a15297Q0979J75928J45850M4931j11549j73056J89719J97550j72322l8325
$$ -115297 -34318 141610 287460 332391 220842 47786 237505 435055 262733 224408
14709B24408j61611J3981p869p4736R8803R6992k69436k27128K89888J30928J65449
$$ 224408 62797 76778 68909 -5827 92976 189968 -79468 -306596 -16708 114220 279669
14698B79669j25015j93256j15168K75923k63022k79345Q2874P3551M2237n009
$$ 279669 154654 -38602 -153770 122153 -140869 -420214 -337340 -263789 -221552 -226561
14688b26561j54611p8592K00347M49945L22735R566n1000k74225k15564J36172
$$ -226561 -381172 -459764 -259417 190528 513263 522829 471829 197604 -17960 118212
14678A18212k88292m93576J58316L68013P7204k1374K21180l6569m07365j22592
$$ 118212 -170080 -663656 -505340 -137327 -60123 -81497 139683 103114 -304251 -426843
14668d26843p0542N8052K63052K11079J23012J48050J71589j34508j7196K5085
$$ -426843 -497385 -439333 -176281 34798 157810 305860 477449 342941 325745 350830
14658C50830m5379R4154j54570r8970M6742K00039M6520R5100n6053l95452p7641
$$ 350830 305451 399605 245035 146065 192807 392846 439366 534466 478413 82961 5320
14647E320K75699k225n9370J24207j65859j93622j4963J99077q0727j31774n1715
$$ 5320 281019 278794 219424 343631 177772 -15850 -30813 168264 87537 -44237 -95952
14636i5952l5196O6721j16592j53695l12887L25368J33417n0935N9501J38673
$$ -95952 -131148 -64427 -181019 -334714 -647601 -322233 -188816 -239751 -180250 -41577
14626d1577K50742j16960J8505p503K99035j39653j01247l94590k17499q5583
$$ -41577 209165 92205 110710 103207 402242 262589 161342 -233248 -450747 -536330
14616e36330K62881M48351Q2133j06839l4132j16803j31263M2630J21771j3498
$$ -536330 -273449 174902 257035 150196 116064 -739 -132002 -89372 32399 18901
14606A8901K6669L07428Q6680j42151k09817l79473j02644M16440J68473l16454
$$ 18901 45570 352998 439678 297527 87710 -291763 -394407 22033 190506 -125948
14596a25948j79364J61941J93883k09431j57680Q8509M8985K46650J72796k91099
$$ -125948 -305312 -143371 50512 -158919 -316599 -228090 -179105 67545 240341 -50758
14586e0758j6062J58565k79677l53239J03750L57961N1828k74479O5814L32072
$$ -50758 -66820 91745 -187932 -541171 -437421 -79460 -27632 -302111 -236297 95775
14576I5775J42451Q1864J78212J43720j15501k70022o6544j10822l21585l48731
$$ 95775 238226 320090 498302 642022 526521 256499 189955 79133 -242452 -591183
14566e91183J03536K01546R0358J50922Q7718L0065k89752k48888J82345M18900
$$ -591183 -487647 -286101 -195743 -44821 42897 72962 -216790 -465678 -283333 135567
14556A35567r3171j85468r8431L33583Q8628m02023k52528J11727L91879K91209
$$ 135567 42396 -143072 -241503 92080 180708 -221315 -473843 -362116 29763 320972
14546C20972r6106m9753k540J48147M9937p7076l90629j97016P1181R5673N1703
$$ 320972 224866 175113 172573 320720 370657 293581 -97048 -294064 -222883 -127210 -75507
14535g5507R1928j83700r0133N1436M38896K32169j94911p4542j24757J61425
$$ -75507 16421 -167279 -257412 -205976 232920 465089 270178 195636 70879 232304
14525B32304K33945j15338k43916k3882n2779K5245r0178o2499J50062K13671
$$ 232304 466249 350911 106995 83113 30334 55579 -34599 -97098 52964 266635
14515B66635j25826l09855k9691j66189J61699J64240k31211O9135O2438K38899
$$ 266635 140809 -169046 -198737 -364926 -203227 -38987 -270198 -201063 -138625 100274
14505A00274K58328M2645k3352r5492o9189M224k5544O3435j34123J85547j706
$$ 100274 358602 401247 377895 282403 213214 217438 191894 255329 121206 306753 305047
14494C05047j66077k09595j19358K47745o6502J90157n0174k02125K79558l8352
$$ 305047 138970 -70625 -189983 57762 -8740 181417 131243 -70882 208676 170324
14484A70324K1207j44609j58981n162K6656J78403L39722k53649j57596J7722
$$ 170324 191531 46922 -112059 -117221 -90565 87838 427560 173911 16315 34037
14474C4037l0668P4412K41979R8702k74584j0885j37977j88460R3472L40186m9246
$$ 34037 3369 77781 319760 418462 143878 132993 -4984 -193444 -99972 240214 190968
14463A90968n3318J27352J9207L44670K81515l38512j25093J19830j48422l65960
$$ 190968 137650 265002 284209 628879 910394 571882 446789 566619 418197 52237
14453E2237k47762K89449J87874p1465j35079q1883J34520o338O8621j02710j4074
$$ 52237 -195525 93924 281798 210333 75254 -6629 127891 121553 190174 87464 73390
14442G3390q3500k13176l3036K36813J71286j92485K06334j28457j30521r7475
$$ 73390 -10110 -223286 -256322 -19509 151777 -40708 165626 37169 -93352 -190827
14432a90827n9346M1844J54513J87782m4807q5803j58106K7557M2861K11559o5437
$$ -190827 -250173 -208329 -53816 133966 89159 3356 -154750 -127193 -84332 127227 61790
14421F1790P2976L6717j61129l27842j30960M67848J90483k6825j50794J83240
$$ 61790 134766 171483 10354 -317488 -448448 19400 209883 183058 32264 215504
14411B15504O0010m5194k97298l7755L31997j1502j26734l21523j56045L21969
$$ 215504 275514 230320 -66978 -104733 227264 215762 89028 -232495 -388540 -66571
14401f6571Q6398k56700k7998j09973j51855P0932J92765j93063n6187L26105
$$ -66571 19827 -236873 -264871 -374844 -526699 -455767 -263002 -456065 -512252 -186147
14391a86147M78293K81369j13636J0957j96919j18827J30804K0588k5749m9812
$$ -186147 292146 573515 459879 470836 273917 155090 285894 306482 280733 230921
14381B30921P1400k24026o2650k38529m0370k36248k07914J27085n7822J24271
$$ 230921 302321 78295 15645 -222884 -263254 -499502 -707416 -580331 -638153 -513882
14371e13882J20544P8972M11559m0116l30743m683j89506J06127M3166P0220M64074
$$ -513882 -393338 -314366 97193 57077 -273666 -278349 -467855 -361728 -318562 -248342 215732
14360B15732J15510q5342j37349q8834l13273l67096K15006J55633M2771j30652
$$ 215732 331242 245900 108551 19717 -293556 -660652 -445646 -290013 -247242 -377894
14350c77894J51065K17914J85624j76662P3068Q0428k51661m38507N6083J14204
$$ -377894 -226829 -8915 176709 47 73115 153543 -98118 -536625 -480542 -366338
14340c66338L79580o1357o9416j57499j86618K56541R1254l3731k42269k77942
$$ -366338 13242 -48115 -117531 -275030 -461648 -205107 -113853 -147584 -389853 -667795
14330f67795J23161L25981P4309Q929K6826j12627j18216J04070j286J18690J31302
$$ -667795 -544634 -218653 -144344 -135415 -108589 -221216 -339432 -235362 -236648 -117958 13344
14319A3344k716k4962J97084q9136j61065j05933P7992P2999m4056j80606R1891
$$ 13344 10628 -14334 182750 93614 -67451 -173384 -95392 -22393 -66449 -247055 -155164
14308a55164K60606o3665q99j41942q6794M2614J27163m6287k93892k59486K22242
$$ -155164 105442 41777 40878 -101064 -187858 -145244 -18081 -64368 -358260 -617746 -395504
14297c95504J64327J58971l9139J00401l1631Q3366q640O3896k22203k0916L5465
$$ -395504 -231177 -72206 -111345 -10944 -42575 40791 32151 96047 -126156 -147072 -111607
14286a11607j32054k7916n2679J88272K40436L2268j1930l14414l63309L16754
$$ -111607 -243661 -271577 -324256 -135984 104452 136720 124790 -189624 -552933 -236179
14276b36179J93122j10050O0954J05802J77367P3456K127k42519O9656O708K03119
$$ -236179 -43057 -153107 -92153 13649 191016 264472 266599 24080 93736 100444 303563
14265C03563j82044J42767O8875j41250l53524k58957N8945o8812q0465J00380
$$ 303563 121519 264286 333161 191911 -161613 -420570 -361625 -430437 -510902 -410522
14255d10522J44434q7495J72897L35625n7436k48799l23245N2809K64005Q4593
$$ -410522 -266088 -353583 -180686 154939 97503 -151296 -474541 -421732 -157727 -73134
14245g3134R0604m0069l2121J22088j37611Q559O8938L9980k33305j69521J61760
$$ -73134 17470 -22599 -54720 67368 -70243 -61684 7254 47234 -186071 -355592 -193832
14234a93832N67892L70786j45687j54328J11300j74838j35446R0709K18848m48562
$$ -193832 374060 744846 599159 444831 556131 381293 245847 336556 555404 106842
14224A06842j93593J26825j77378R7292j17731J7363J80657M2628k7039j14574
$$ 106842 -86751 40074 -137304 -40012 -157743 -140380 40277 82905 55866 -58708
14214e8708n4248o8535J39672N0876j5763k48115J25736R5790j12441o5942m4727
$$ -58708 -112956 -181491 -41819 9057 -6706 -254821 -129085 -33295 -145736 -211678 -256405
14203b56405m2799J01144k18451j60543J28770K23176K24252k90719M704J82678
$$ -256405 -299204 -198060 -416511 -577054 -448284 -225108 -856 -291575 -286871 -104193
14193a04193Q9524O343J50357J61711J42164R5368k71651l72956j54891j97172
$$ -104193 -14669 -8326 142031 303742 445906 541274 269623 -103333 -258224 -455396
14183d55396k3359j3737K51036J31797j10024k13417J19145J07800K33705L9977
$$ -455396 -478755 -492492 -241456 -109659 -219683 -433100 -313955 -206155 27550 67527
14173F7527o5812k68880l60024q1175K26989J61264K53278J77525L5596p651j41265
$$ 67527 1715 -267165 -627189 -708364 -481375 -320111 -66833 110692 146288 138637 -2628
14162b628J03221R580O4053K3964M9617J36291k6399l24912k25607M8786M2843
$$ -2628 100593 110173 174226 198190 247807 384098 357699 32787 -192820 -144034 -101191
14151a01191l7733Q0281p2423l59082k47605J48299J85823K01248K19251j01006
$$ -101191 -138924 -58643 -131066 -490148 -737753 -589454 -403631 -202383 16868 -84138
14141h4138j72774j60796K43004m6472J111L4638O9661q8925m4828J44800N5714
$$ -84138 -256912 -417708 -174704 -221176 -220065 -185427 -115766 -204691 -249519 -104719 -49005
14130d9005J46528J09376k6109j48115J48159J13276k96541j00434K3075j39518
$$ -49005 97523 206899 180790 32675 180834 294110 -2431 -102865 -79790 -219308
14120b19308k50357J20830J07683K407J26187k21250J38279J66090J63054j39215
$$ -219308 -469665 -348835 -241152 -238745 -112558 -333808 -195529 -29439 133615 -5600
14110e600k56047n7008m5972m0103P1791Q8828K0486J39254J09326J70548P9652
$$ -5600 -261647 -318655 -364627 -404730 -332939 -244111 -223625 -84371 24955 195503 275155
14099B75155j07246p0250K44707J19635j21483P1092J24030J97331J49340J12252
$$ 275155 167909 97659 342366 462001 340518 411610 535640 732971 882311 994563
14089I94563k52367J15231o9787j70407k97289p6230L12951j79816m8513p9927
$$ 994563 742196 857427 787640 617233 319944 243714 556665 376849 328336 248409
14079B48409r6865J95207k10229j46454j24191j61857J60042J02842J66446j66624
$$ 248409 151544 346751 136522 -9932 -134123 -295980 -135938 -33096 133350 -33274
14069c3274J09774o0938k62554q2978l9141j0711K8564k6437j17961J32441L60424
$$ -33274 76500 15562 -246992 -329970 -369111 -379822 -351258 -377695 -495656 -363215 -2791
14058b791j02004j94768r9208j50820L251j9712J34809L9890q0458L23887K62340
$$ -2791 -104795 -299563 -398771 -549591 -546340 -566052 -431243 -391353 -471811 -147924 114416
14047A14416J07899l0127n3361n6011m61087j56688Q8496J57274R2746M333K89340
$$ 114416 222315 192188 138827 82816 -378271 -534959 -446463 -289189 -196443 -192110 97230
14036I7230Q4068J10851j01307l50836M8550j7819J12224J13333L8300l03481
$$ 97230 181298 292149 190842 -159994 -111444 -129263 -17039 96294 134594 -168887
14026a68887j3036O2671k71589j4225J59360k049k71999J3357J9093L55885j06299
$$ -168887 -181923 -119252 -390841 -405066 -245706 -247755 -519754 -506397 -487304 -131419 -237718
14015b37718j44973J68998J09495n0671r4423L7849J27534J5549J21420J53511
$$ -237718 -382691 -213693 -104198 -154869 -249292 -211443 -83909 -68360 53060 206571
14005B06571k74270p6953J13027J12707L125Q1003q7275K4507J62251p1569j63053
$$ 206571 -67699 -144652 -31625 81082 84207 165210 77935 102442 264693 193124 30071
13994C0071j44330m7191N4252J93378j30325J3777k65555j44660l1280K35912
$$ 30071 -114259 -161450 -107198 86180 -44145 -30368 -295923 -440583 -471863 -235951
13984b35951K48617O3590j13033L3342J10265j42679m31966R675N1289J64957
$$ -235951 12666 76256 -36777 -3435 106830 -35849 -467815 -458140 -406851 -241894
13974b41894Q6009k4139o8631N8865K2892J05525N3291J52749k03460J30111J30231
$$ -241894 -155885 -180024 -248655 -189790 -166898 -61373 -8082 144667 -58793 71318 201549
13963B01549J9562r6995m65656J52424K58935o0353j03431k65929k97K78628J04198
$$ 201549 221111 124116 -341540 -189116 69819 9466 -93965 -359894 -360191 -81563 22635
13952B2635j29222J81905j81522j40307j72J27566J10124k07023J2507m4190p5769
$$ 22635 -106587 75318 -106204 -246511 -246683 -119117 -8993 -216016 -203509 -247699 -323468
13941c23468o6367K51837q4833l7280J36507J98368l2306j42843j42516N5576
$$ -323468 -389835 -137998 -222831 -260111 -123604 74764 42458 -100385 -242901 -187325
13931a87325J97371J04272q9969j88724K56453K86274j73118o8674j65889N5799
$$ -187325 10046 114318 24349 -164375 92078 378352 205234 136560 -29329 26470
13921B6470q0288J8922j81657m7645j94699J86924L10528M5883j07010J75515
$$ 26470 -53818 -34896 -216553 -264198 -458897 -271973 38555 84438 -22572 152943
13911A52943q0002k15398q8721j78594n2084M7355n6661j69210J63488K48236
$$ 152943 72941 -142457 -231178 -409772 -461856 -414501 -471162 -640372 -476884 -228648
13901b28648n463j33094k5262J12705J90234j4661Q8784K5211k96761n0659p8287
$$ -228648 -234111 -367205 -392467 -279762 -89528 -104189 -15405 9806 -286955 -337614 -415901
13890d15901p2795R586M853M3231L3454K97374K63121k61216k15498k06191K16910
$$ -415901 -488696 -479110 -474257 -431026 -397572 -100198 162923 -98293 -313791 -519982 -303072
13879c03072J09353K8832J36364R1946l3R6378j43623K715O2956k45013j83585
$$ -303072 -193719 -164887 -28523 63423 63390 159768 16145 18860 81816 -163197 -346782
13868c46782m1162J78170J97713O156k12635j22301P6378K98561R2927l0762l8676
$$ -346782 -387944 -209774 -12061 -5905 -218540 -340841 -264463 34098 127025 96263 57587
13857E7587J46619J62861p3783l02511P5735J36798J13377J6249n6431p0249K9009
$$ 57587 204206 367067 293284 -9227 66508 203306 316683 332932 276501 206252 235261
13846B35261j38065j11774P6045j77773k06121J16157K23596j13192p2554O0749
$$ 235261 97196 -14578 61467 -116306 -322427 -206270 17326 -95866 -168420 -107671
13836a07671N9296N2927l09760O2396M51040K05975K16471r1751j94498j56552
$$ -107671 -48375 4552 -305208 -242812 208228 414203 630674 538923 344425 187873
13826A87873l13617j46321R095J99206P9250J34136j05285j24531P271n8428P2710
$$ 187873 -125744 -272065 -262970 -63764 15486 149622 44337 -80194 -72923 -131351 -58641
13815e8641j589n9354k5101K56346J99369j14000k26785l24780o1048l7967K8646
$$ -58641 -60230 -119584 -144685 111661 311030 197030 -29755 -354535 -415583 -453550 -424904
13804d24904j2791p8720j00787J53344K90453J031j5546J38656L1222p3136m4547
$$ -424904 -437695 -516415 -617202 -463858 -173405 -172374 -187920 -49264 -18042 -91178 -135725
13793a35725l74675K21658J60413k60523n7753R5205k9091O5518K31212J10216
$$ -135725 -510400 -288742 -128329 -388852 -446605 -351400 -380491 -314973 -83761 26455
13783B6455l1683q1310J23170j93465j8807L84651J09088k14388k43604J15817
$$ 26455 -5228 -86538 36632 -156833 -175640 209011 318099 103711 -139893 -24076
13773b4076k84279L6012K48213r1404J36105K45470O4239k24018j10536K97625
$$ -24076 -308355 -272343 -24130 -115534 20571 266041 330280 106262 -4274 293351
13763B93351J17074j10950M5763J54388j6053q3356j45097j5238Q2669j53067
$$ 293351 410425 299475 345238 499626 483573 400217 255120 239882 322551 169484
13753A69484j50448Q7518o5802o6450J85935j4654q9820P9006j63921j54834n5365
$$ 169484 19036 106554 40752 -25698 160237 145583 55763 134769 -29152 -183986 -239351
13742b39351P8643K14028R6861j70355N2357L19439J63586p4276j28892J20059
$$ -239351 -160708 53320 150181 -20174 32183 351622 515208 440932 312040 432099
13732D32099n8813m57723j65624L82930M4452j5776J33090q4934j28297N6547
$$ 432099 373286 -84437 -250061 132869 177321 161545 294635 209701 81404 137951
13722A37951L80619J38345l19058j71708R4175m1269J97387n5271k05732J6684
$$ 137951 518570 656915 337857 166149 260324 219055 416442 361171 155439 172123
13712A72123o8086P5326j16363O9664j3216o6160n0163J4742K43759J1690J21416
$$ 172123 104037 179363 63000 132664 119448 53288 3125 17867 261626 273316 394732
13701C94732k3469q8441j32401J32595N925j59211k47501m4637J50711L03183
$$ 394732 371263 282822 150421 283016 288941 129730 -117771 -162408 -11697 291486
13691B91486M3431n6120j1453k67815k64803M6837j41691p0156K17068N43536
$$ 291486 334917 278797 267344 -471 -265274 -218437 -360128 -430284 -213216 330320
13681C30320J09372k76507l32151M480k17841K08257M81247N3743j02182j66998
$$ 330320 439692 163185 -168966 -164486 -382327 -174070 307177 360920 258738 91740
13671I1740L2468J13309j42j9256k32317l63304l68449j30292P8471J70059M59637
$$ 91740 124208 237517 237375 218119 -14198 -377502 -745951 -876243 -797772 -627713 -168076
13660a68076K17698J15965J96061l04536m74147j4225K69148L03792P7733J83618
$$ -168076 49622 165587 361648 57112 -417035 -431260 -162112 141680 219413 403031
13650D03031k05400M4767Q4030j72604l61272q7720N92894r4469l68814p3997
$$ 403031 197631 242398 326428 153824 -207448 -295168 297726 203257 -165557 -239554
13640b39554j34190j54432L15889R5459j11917q0695k76973J7817L15887K38947
$$ -239554 -373744 -528176 -212287 -116828 -228745 -309440 -586413 -568596 -252709 -13762
13630a3762K19889J87439k44406k99421P8141n2868R0918J97671O493k23595j05532
$$ -13762 206127 393566 149160 -150261 -72120 -124988 -34070 163601 170094 -53501 -159033
13619a59033j34734L8279K68858N5822L8141j25454k1265P1506m1316K04529j43899
$$ -159033 -293767 -255488 13370 69192 107333 -18121 -39386 32120 -9196 195333 51434
13608E1434p9176p3474O7304J99959J76888J87126m7028k74555k80192n642O7067
$$ 51434 -27742 -101216 -33912 166047 342935 530061 483033 208478 -71714 -77356 -10289
13597a0289J1299j39767J07426l10301r1347J76448J86906j77826L9795Q9022
$$ -10289 1010 -138757 -31331 -341632 -432979 -256531 -69625 -247451 -207656 -118634
13587a18634k29277J04771M18725q9458n685k032Q6780P9204J08000q8432k53603
$$ -118634 -347911 -243140 175585 86127 80442 78410 165190 244394 352394 263962 10359
13576A0359l4515r7925m034Q1254K37966K5610O2283l7056k95966J33828J16455
$$ 10359 -24156 -122081 -126115 -44861 193105 218715 280998 243942 -52024 81804 198259
13565A98259j07623L2981J17013q4289J3257k57058J00613J22162m17755k60808
$$ 198259 90636 123617 240630 156341 169598 -87460 13153 135315 -282440 -543248
13555e43248J83755J69232M5091p8460l4494M3715l47165k73881R1037M33809
$$ -543248 -359493 -190261 -145170 -223630 -258124 -214409 -561574 -835455 -744418 -310609
13545c10609K26318Q37K62874j78243l22517J22067Q5292j50322m1381K63261
$$ -310609 -84291 -83454 179420 1177 -321340 -199273 -113981 -264303 -305684 -42423
13535d2423R3170J90674k53972l94657n1312K39012K21362Q3415l28897j89424
$$ -42423 50747 241421 -12551 -407208 -458520 -219508 1854 85269 -243628 -433052
13525d33052p8999j0579J67704J08423p6186J94495L47566R9843k24384k81284
$$ -433052 -512051 -522630 -354926 -246503 -322689 -128194 219372 319215 94831 -186453
13515a86453p6902L70963Q0532j58751l26307n4114Q7884O4161m4876J7110O0955
$$ -186453 -263355 107608 188140 29389 -296918 -351032 -263148 -198987 -243863 -226753 -165798
13504a65798Q5083n6865K34833L11977r1472l51472J79740R2378o6192k06784
$$ -165798 -80715 -137580 97253 409230 317758 -33714 146026 238404 172212 -34572
13494c4572K40355K71534m767n1928k07183m20816N3539J92474j98844J17972
$$ -34572 205783 477317 472550 420622 213439 -207377 -153838 38636 -160208 -42236
13484d2236K09560L14116k27876j84793P1783j99496K58445J45779K9451j60983
$$ -42236 167324 481440 253564 68771 140554 -58942 199503 345282 374733 213750
13474B13750n7676K5212k15145n6498r1399j93428K0461J52841K2530N0501m627
$$ 213750 156074 181286 -33859 -90357 -181756 -375184 -354723 -201882 -179352 -128851 -133478
13463a33478J16094L13069j99694P8359L46812j59529n5362j49079k45370J79487
$$ -133478 -17384 295685 95991 174350 521162 361633 306271 157192 -88178 91309
13453I1309m0842o123M7970J24688j37084p2590k36444N4499N0174J0577Q5409
$$ 91309 50467 44344 92314 217002 79918 7328 -229116 -174617 -124443 -113866 -28457
13442b8457O4342K34988l6857j56392k17423j90034m6587J57949k0604J58745
$$ -28457 35885 270873 234016 77624 -139799 -329833 -376420 -218471 -239075 -80330
13432h0330o3296n546K16742J02508K41489J83215l19825l95140O3490K84671
$$ -80330 -143626 -149172 67570 170078 411567 594782 274957 -120183 -56693 227978
13422B27978q6213k2062k1432p2286j74804p3062K3845k1561Q926l1699j43552
$$ 227978 141765 119703 98271 25985 -148819 -221881 -198036 -219597 -210671 -242370 -385922
13411c85922r1026J21616L58294L8394m8285m115M2259P2736M5371k17981j59913
$$ -385922 -476948 -355332 2962 41356 -6929 -11044 31215 103951 149322 -68659 -228572
13400b28572k37582J66120N03906n9979l10825q1351M6201J04712K05207L37952
$$ -228572 -466154 -300034 203872 143893 -166932 -248283 -202082 -97370 107837 445789
13390D45789L2395l09659l52524j04121J17647J57253J00564n7037j00356J01150
$$ 445789 478184 168525 -183999 -288120 -170473 -13220 87344 30307 -70049 31101
13380C1101Q3034k13101J17346J06644k13300j94916l43034o7510J9014K11615
$$ 31101 114135 -98966 18380 125024 -88276 -283192 -626226 -693736 -674722 -463107
13370d63107J03150K83451J70864J92784q3889m03798J61740J48066l9139j749
$$ -463107 -359957 -76506 94358 287142 203253 -200545 -38805 109261 70122 68373
13360F8373o6855j59853J77160l5031j30175K62291j0496l43899M6086J77936
$$ 68373 1518 -158335 18825 -16206 -146381 115910 105414 -238485 -192399 -14463
13350a4463J55796n566J53053j18065m98152k06072q2120O2026J35240R1611J03411
$$ -14463 141333 135767 288820 170755 -327397 -533469 -615589 -553563 -418323 -326712 -223301
13339b23301o8360J94987J09870J47461j33088K32147q69k07598r9312L08276
$$ -223301 -291661 -96674 13196 160657 27569 259716 258847 51249 -48063 260213
13329B60213J8848k6725J4411J4742J60525L01430l2873l60823j24308J78701
$$ 260213 279061 252336 266747 281489 442014 743444 710571 349748 225440 404141
13319D04141K68818J54356K6945l7734j45892J32880J38146m63745k57812j08508
$$ 404141 672959 827315 854260 816526 670634 803514 941660 477915 220103 111595
13309A11595P526K79452N8305j43246q9993K4455Q5504l9183r5166J51216K81543
$$ 111595 119121 398573 456878 313632 223639 248094 333598 294415 199249 350465 632008
13298F32008K98592L4874l25906l03938j96819j54465k27311n1255j9491J7343
$$ 632008 930600 965474 639568 335630 138811 -15654 -242965 -294220 -313711 -296368
13288b96368m8442j031K00264L623l5514J89469j5407j29355J03832J61838J40043
$$ -296368 -344810 -345841 -145577 -141954 -177468 12001 -3406 -132761 -28929 132909 272952
13277B72952J32379j47779k87085O9808k42857J06595J98630J14491n3642J8519
$$ 272952 405331 257552 -29533 40275 -202582 -95987 102643 217134 163492 182011
13267A82011K41476q6461j80435k91796l12276J30025L04105J41292P1638L7498
$$ 182011 423487 337026 156591 -135205 -447481 -317456 -13351 127941 199579 237077
13257B37077k97334J15775K00046J51643J14071o3155j54491L5046j88464j77662
$$ 237077 -60257 55518 255564 407207 521278 458123 303632 338678 150214 -27448
13247b7448K83368M1290N168j75440j96656J40712L76997r6535J0935K648l04039
$$ -27448 255920 297210 302378 126938 -69718 70994 447991 351456 362391 365039 61000
13236F1000l9730J56313k53086M7590P9029j43034p250Q5920J80572K26015j93442
$$ 61000 21270 177583 -75503 -27913 51116 -91918 -99168 -13248 167324 393339 199897
13225A99897j97442k15900L13267K70270L8027L14219J02989k10716k1315l78137
$$ 199897 2455 -213445 99822 370092 408119 722338 825327 614611 593296 215159
13215B15159l44671K23563K28931N17794L71520L85705J39485j20329O0768J47344
$$ 215159 -129512 94051 322982 840776 1212296 1598001 1737486 1617157 1677925 1825269
13205A825269j92569j49545J94460K2813r0222l45721m37728l63751k14073l19240
$$ 1825269 1632700 1483155 1677615 1700428 1610206 1264485 826757 463006 248933 -70307
13195g0307p9733J85198L15284K33391n0527o6392K04751j64776j25356K6547
$$ -70307 -150040 35158 350442 583833 533306 466914 671665 506889 381533 408080
13185D08080P9493n90q1838k88317k10353J45915J12404L5041o3511J2364r8734
$$ 408080 487573 486983 405145 116828 -93525 52390 164794 199835 136324 148688 49954
13174D9954P4195n826l98760P1005J49582K47277Q1634k54721r1803J67463p3357
$$ 49954 124149 118323 -280437 -209432 -59850 187427 269061 14340 -77463 90000 16643
13163A6643l68803p0392k8227p2581K82736J95313m517l7021l0825J22526j5846
$$ 16643 -352160 -422552 -450779 -523360 -240624 -45311 -49828 -86849 -117674 4852 -10994
13152a0994o7135K24159l7653k03952J39451k8255k28243l1031P2008K59530K84456
$$ -10994 -78129 146030 108377 -95575 43876 15621 -212622 -243653 -171645 87885 372341
13141C72341J58791p7462j66267Q2675o9831l22810k66670l9111K41684L8760
$$ 372341 531132 453670 287403 370078 300247 -22563 -289233 -328344 -86660 -47900
13131d7900n494P0275j61914Q0545N0026J17237J590l57994j09850L45226R4158
$$ -47900 -53394 16881 -145033 -64488 -14462 102775 104365 -253629 -363479 -18253 75905
13120G5905l1597J24771m0129j80598p7517J00492j66233J10996l1845k17680
$$ 75905 44308 169079 128950 -51648 -129165 -28673 -194906 -83910 -115755 -333435
13110c33435K74362K04787j22751r3458N9662j25431q763J70295O4197P2647j15675
$$ -333435 -59073 145714 22963 -70495 -10833 -136264 -145027 25268 89465 162112 46437
13099D6437N6784K74685J8478l57955j58468L36P1732J40330J46250j0934J00322
$$ 46437 103221 377906 396384 38429 -120039 -119703 -47971 92359 238609 227675 327997
13088C27997K15639J10843n32023j60454K54411R8576j41489n2085P4594R4870
$$ 327997 543636 654479 122456 -37998 216413 314989 173500 121415 196009 290879
13078B90879J11626j3265n23764p0088K36197k03572k21299m926L56446K66125
$$ 290879 402505 389240 -134524 -204612 31585 -171987 -393286 -398212 -41766 224359
13068B24359J07793L9172M3372l436n9520J46685r1371L5848j03628J18068L28764
$$ 224359 332152 371324 414696 411260 351740 498425 407054 442902 339274 457342 786106
13057G86106K0468k41178N1389J52140O9357k36471k124j67389j4047j95243r8791
$$ 786106 806574 565396 616785 768925 838282 601811 599687 432298 418251 223008 124217
13046A24217j55090M0116M2278j2o6354L9230K61240K45888R0824j78667J49955
$$ 124217 -30873 9243 51521 51509 -14845 24385 285625 531513 622337 443670 593625
13035E93625j35314j22291k18773k26612j75989L93244K22374l1881q6523J48253
$$ 593625 458311 336020 117247 -109365 -285354 107890 330264 298383 211860 360113
13025C60113M41071p9127m67503P2q5248J40172k78918q081K91422O7521K6109
$$ 360113 801184 722057 254554 254626 169378 309550 30632 22551 313973 381494 407603
13014D07603k48922n9987J05217m8131J6754O431j35521O8755j71204Q7189J26284
$$ 407603 158681 98694 203911 155780 172534 178965 43444 112199 -59005 28184 154468
13003A54468J25294p0099k51938j67267l2873N2033j11980R6441n6848K3249K20956
$$ 154468 279762 209663 -42275 -209542 -242415 -190382 -302362 -205921 -262769 -239520 -18564
12992a8564K23562K19279j33950l57775j30651q4680K3570L81352K40298k4568
$$ -18564 204998 424277 290327 -67448 -198099 -282779 -259209 122143 362441 337873
12982C37873l43887J5990J39471j1745l65855j32513l9181P8497R1497K56888
$$ 337873 -6014 9976 149447 137702 -228153 -360666 -399847 -321350 -229853 27035
12972B7035J10698K04652N3667p1945l5173L06327K23528l43830m06623j77513
$$ 27035 137733 342385 396052 324107 288934 595261 818789 474959 68336 -109177
12962a09177J68925n7837k57517Q7445R2777K5108j20532N8021k576L2477K49235
$$ -109177 59748 1911 -255606 -168161 -75384 -50276 -170808 -112787 -115363 -82886 166349
12951A66349o3355l60887m101P0990J34780K99573K1893j28842k77651p2890o4205
$$ 166349 102994 -257893 -261994 -191004 -56224 243349 265242 136400 -141251 -214141 -278346
12940b78346j11599R8527J71593k7304K2697L38576j44040k85641O5495j66015
$$ -278346 -389945 -291418 -119825 -147129 -124432 214144 70104 -215537 -150042 -316057
12930c16057j25594K23004P3573j84108K10863N13327K45630Q081k16806j13615
$$ -316057 -441651 -218647 -145074 -329182 -118319 395008 640638 648719 431913 318298
12920C18298k9640n2712j82892K18338J21551p4060q6873M5040L0753Q016L08347
$$ 318298 288658 235946 53054 271392 392943 318883 232010 277050 307803 315819 624166
12909F24166J50925k46599j59013p8994r7021K77622L17641N919k97177p3067
$$ 624166 775091 528492 369479 290485 193464 471086 788727 794646 497469 424402
12899D24402n2277m3408K23118J06788J51958J23593P713Q8422j76500O5766l03234
$$ 424402 372125 328717 551835 658623 810581 934174 941887 1030309 853809 919575 616341
12888F16341k25757k21877j11774K17016j66143j6850L06496M955j8157J49011
$$ 616341 390584 168707 56933 273949 107806 90956 397452 402407 384250 533261
12878E33261j66083o7428K77715K10587M7399l36614o9428k4544J20420n67037
$$ 533261 367178 299750 577465 788052 835451 498837 429409 404865 525285 -41752
12868d1752k58207M21829J11574K46319L48203j66096k27596p531K56603p3622
$$ -41752 -299959 121870 233444 479763 827966 661870 434274 426743 683346 609724
12858F09724J92379Q3744O5128K97169m6827o2365r0207L2834j25736K65690J15125
$$ 609724 802103 885847 950975 1248144 1201317 1138952 1048745 1081579 955843 1221533 1336658
12847A336658l8080J50262j3274n0582j1931j54356j58452J42187p1624p0259
$$ 1336658 1298578 1448840 1435566 1384984 1373053 1218697 1060245 1202432 1130808 1060549
12837A060549J73160K08634J72283j15288K823L15499J42947K9390j58152j56228
$$ 1060549 1233709 1442343 1614626 1499338 1502161 1817660 1960607 1989997 1831845 1675617
12827A675617J80897J42330j81071K40019L68538K77916R5286R2321L61510J47622
$$ 1675617 1856514 1998844 1817773 2057792 2426330 2704246 2799532 2891853 3253363 3400985
12817C400985K06054J81583L28686M30327K20054q067J2988K01224Q00470O57792
$$ 3400985 3607039 3788622 4117308 4547635 4767689 4759622 4772610 4973834 5774304 6432096
12807F432096N08577N10448P44359J045686J003695J365636J906731K098365K086610
$$ 6432096 6940673 7451121 8195480 9241166 10244861 11610497 13517228 15615593 17702203
12798A7702203K251843K681433L030985L408627M501920N908791P613028J0461542
$$ 17702203 19954046 22635479 25666464 29075091 33577011 39485802 47098830 57560372
12790E7560372J4571297K0682510K7556103L4030056L8263707L7677908L1327087
$$ 57560372 72131669 92814179 120370282 154400338 192664045 230341953 261669040
12783B61669040K2304105J2806571M707649J853332K469881J301217l104401j1225511
$$ 261669040 283973145 296779716 301487365 303340697 305810578 307111795 304007394 292781883
12775B92781883k2504826l1898305l5903786l4833297k9910205k2434782j6258969
$$ 292781883 270277057 238378752 202474966 167641669 137731464 115296682 99037713
12768I9037713j1786301q951167o987847n800920m988128m097947l522267l137119
$$ 99037713 87251412 78300245 71312398 65511478 60523350 56425403 52903136 49766017
12760D9766017k637506k512666k392209k432806k154255k131074k018916j955782
$$ 49766017 47128511 44615845 42223636 39790830 37636575 35505501 33486585 31530803
12752C1530803j524691j124380j145592j095055j236106r28693q30746p43431
$$ 31530803 30006112 28881732 27736140 26641085 25404979 24476286 23645540 22902109
12744B2902109q73207p96097q96329q50890n46662n53050o27725n59488o45859
$$ 22902109 22028902 21232805 20336476 19485586 18938924 18385874 17758149 17198661 16552802
12735A6552802o46786l81907m53101j88085n9891j70917l92406o96077m98573
$$ 16552802 15906016 15524109 15071008 14882923 14823032 14652115 14259709 13563632 13065059
12726A3065059k35817k15238m10600m85521l91828m01887o34376l72456j45654
$$ 13065059 12829242 12614004 12203404 11717883 11326055 10924168 10289792 9917336 9771682
12717I771682k79967l21438p1703l35562l81882k13441l57669m51701l36508m64157
$$ 9771682 9491715 9170277 9098574 8763012 8381130 8167689 7810020 7358319 7021811 6557654
12707F557654l53142j95082m25175m52281Q9585R9782K4836m6246j56217N9663
$$ 6557654 6204512 6009430 5584255 5131974 5221559 5321341 5346177 5299931 5143714 5203377
12697E203377l02445j07453j75878o595l18983j85147m8189k773n7341l33905
$$ 5203377 4900932 4793479 4617601 4611006 4292023 4106876 4058687 4055914 3998573 3664668
12687C664668K2116J93290J13667q6424k97206j53033P4213k15772k27379J16043
$$ 3664668 3686784 3880074 3993741 3907317 3610111 3457078 3531291 3315519 3088140 3204183
12677C204183J28239j75937m4820m8953L8045l18136k66399r2315k46195N261
$$ 3204183 3332422 3156485 3111665 3062712 3100757 2782621 2516222 2423907 2177712 2182973
12667B182973p9803j88675O671j66615m40474P2657Q6423k1346J03658j08086
$$ 2182973 2103170 1914495 1921166 1754551 1314077 1386734 1473157 1451811 1555469 1447383
12657A447383K3737J7132o6956o7291j32170k140J29128L8161m45776m32841K99044
$$ 1447383 1471120 1488252 1421296 1354005 1221835 1219695 1348823 1386984 941208 508367 807411
12646H07411R9019j03081R5672J18255M8777m61989L9189J72629l42118L056o6853
$$ 807411 906430 803349 899021 1017276 1066053 604064 643253 815882 473764 476820 409967
12635D09967j56497Q2302R5952J46432P8665J33730j22135k42359l04245j15109
$$ 409967 253470 335772 431724 578156 656821 790551 668416 426057 121812 6703
12625F703J81994J69347Q1830M5986j08708N9773J19275j4253p1466J34655J52537
$$ 6703 188697 358044 439874 485860 377152 436925 556200 541947 470481 605136 757673
12614G57673Q3173p5454j52878J76214N3191p944j0411J9151n3147N8850j0409
$$ 757673 840846 765392 612514 788728 841919 833975 823564 842715 789568 848418 838009
12603H38009J06444K4044J33193R6000j64722k51408k81683o9649J35992P9763
$$ 838009 944453 968497 1101690 1197690 1032968 781560 499877 430228 566220 645983
12593F45983j03303R7602k0119l54934j72137J46564J25878J781j05635J11126
$$ 645983 542680 640282 620163 265229 93092 239656 365534 367315 261680 372806
12583C72806M7277L88413n8274l28579k40537q368J26066K87972J06099K1449
$$ 372806 420083 808496 750222 421643 181106 172738 298804 586776 692875 714324
12573G14324N00836j74181l69633j2035p397K03634l00188k19369O3014K03202
$$ 714324 1215160 1040979 671346 659311 651914 855548 555360 335991 399005 602207
12563F02207p6395j01526N1668J51584j11028Q7614J07844r0515k84635L9358
$$ 602207 525812 424286 475954 627538 516510 604124 711968 621453 336818 376176
12553C76176L4109j0142k46730K77481K89496L09392j73665J06991N9758j29660
$$ 376176 410285 400143 153413 430894 720390 1029782 856117 963108 1022866 893206
12543H93206k17044r9999j42489p6980Q7899O580J18675J69974K91258j0094j20999
$$ 893206 676162 576163 433674 356694 444593 451173 569848 739822 1031080 1020986 899987
12532H99987N2771J45601p4400l30642k35311J30330P5650j31507n3305J65588
$$ 899987 952758 1098359 1023959 693317 458006 588336 663986 532479 479174 644762
12522F44762J34682M6823j40368j32024N7416m02281k38888J14013R755K00780
$$ 644762 779444 826267 685899 553875 611291 209010 -29878 84135 93890 294670
12512B94670J00655N6192K3214n1649p8322N7136n1768m913j13878j03293J98876
$$ 294670 395325 451517 474731 423082 344760 401896 350128 345215 231337 128044 326920
12501C26920K02509J47044J26527q4012J82410j16419J33917Q2567j86693q6454
$$ 326920 529429 676473 803000 718988 901398 784979 918896 1001463 814770 728316
12491G28316J30500o5627m3106Q324J3125P1626J19576j84409J97044J21729j4387
$$ 728316 858816 793189 750083 758407 771532 843158 962734 778325 975369 1097098 1082711
12480A082711j4894J13419r4672Q3910J56408q6728M3020r6062n1903O3296k37060
$$ 1082711 1067817 1181236 1086564 1170474 1326882 1240154 1283174 1187112 1135209 1198505 961445
12469I61445n8574k33183R944M1472K999J5070q4901o8620k61681j27896n7056
$$ 961445 902871 669688 679632 721104 724103 739173 654272 585652 323971 196075 139019
12458A39019J99302L1656k05206j85467J3072L03911Q5594m3938j31675K07929
$$ 139019 338321 369977 164771 -20696 -7624 296287 381881 337943 206268 414197
12448D14197l1298K50650n4317Q8774M05834K74350K89937k590K7966r1006J4756
$$ 414197 382899 633549 579232 668006 1073840 1348190 1638127 1635537 1663503 1572497 1587253
12437A587253l02440k33455m2311l12286l44332j4711K6261K11810K9622k86953
$$ 1587253 1284813 1051358 1009047 696761 352429 337718 363979 575789 605411 318458
12427C18458m14011J33444n8839N6622K1243N27938L72535j87202n10203l47612
$$ 318458 -95553 37891 -20948 35674 56917 584855 957390 770188 259985 -87627
12417h7627R0589J29268J01589L7653m3150O2324j52915K87542Q386j035M9961
$$ -87627 2962 132230 233819 271472 228322 290646 137731 425273 433659 432624 482585
12406D82585J63710J25203p6713K00414J68236l3928n9380J06377o2489n1969
$$ 482585 646295 771498 694785 895199 1063435 1029507 970127 1076504 1014015 962046
12396I62046M2306l4638k3898j7715j37673j912K22711J69884k87376k11320k0562
$$ 962046 1004352 969714 945816 928101 790428 788516 1011227 1181111 893735 682415 661853
12385F61853j55848R5219k42322q7405J66801K55960r805k19295O5247r3622j70948
$$ 661853 506005 601224 358902 271497 438298 694258 684453 465158 530405 436783 265835
12374B65835j59230L109j10154J57505K64539j16615J84941M4139j29648q6483
$$ 265835 106605 109714 -440 157065 421604 304989 489930 534069 404421 317938
12364C17938r5922j51019j23515M8025J97280Q985l3824K51875J20916K20948
$$ 317938 222016 70997 -52518 -4493 192787 201772 167948 419823 540739 761687
12354G61687L28783M98093K26882K44572j63113l3365j33154L8862J41243Q7184
$$ 761687 1090470 1588563 1815445 2060017 1896904 1863539 1730385 1769247 1910490 1997674
12344A997674j27996n08705m33639l7193j37894j32061k18823l3565j28815P5158
$$ 1997674 1869678 1360973 927334 890141 752247 620186 401363 367798 238983 314141
12334C14141J47985k66046j99314j9095P5278K13581M2768N1170k49775q6730
$$ 314141 462126 196080 -3234 -22329 52949 266530 309298 360468 110693 23963
12324B3963l63068K7778J83050M33133J26770k0509m9221k23307J82144j27783
$$ 23963 -339105 -311327 -128277 304856 431626 411117 361896 138589 320733 192950
12314A92950L5248j8332J81849j29175M0892j8174L19886K46946l26318m69451
$$ 192950 228198 209866 391715 262540 303432 285258 605144 852090 525772 56321
12304E6321l800K76005L50110j12831L6558j68039l78528M9805J97705J37357
$$ 56321 52521 328526 678636 565805 602363 434324 55796 105601 303306 440663
12294D40663P1610m629j35014l85600k99427N5285K56803K19060J26037k0157
$$ 440663 512273 507644 372630 -12970 -312397 -257112 -309 218751 344788 324631
12284C24631L8996j11093p397J3400R5438j95976m05651J90432L74426j89330
$$ 324631 363627 252534 245137 258537 353975 157999 -247652 -57220 317206 127876
12274A27876k84951j45010J24481q7762p8401J18693K2675K60271J65424j31370
$$ 127876 -157075 -302085 -177604 -265366 -343767 -225074 -202399 57872 223296 91926
12264I1926q7798P847J38891k01358L0986P0360P1139J64828k41991j48846j30186
$$ 91926 4128 11975 150866 -50492 -19506 50854 121993 286821 44830 -104016 -234202
12253b34202k2865J88993K64202J22993K4544r7841j5166K3094j43776Q5381k36848
$$ -234202 -257067 -68074 196128 319121 343665 245824 230658 253752 109976 195357 -41491
12242d1491j5350J40292J69191k6024l2916j7299J99460j45139l66910P2429P6398
$$ -41491 -56841 83451 252642 226618 193702 176403 375863 230724 -136186 -63757 12641
12231A2641j31801L02009j85114j58547J06818o7553j71933L3242J48431K21736
$$ 12641 -119160 182849 -2265 -160812 -53994 -121547 -293480 -260238 -111807 109929
12221A09929K7000O2239J12718p8597k34571k50799l02278K40003p4488J96131
$$ 109929 136929 199168 311886 233289 -1282 -252081 -554359 -314356 -388844 -192713
12211a92713J36517J1429J70919k28765j4713J35579J19627j49177r8734jo3955
$$ -192713 -56196 -44767 126152 -102613 -117326 18253 137880 -11297 -110031 -110032 -173987
12200a73987J35064K14042J52884R1028m01758r30P3727Q8405J47471n2899j54282
$$ -173987 -38923 175119 328003 419031 17273 16343 90070 178475 325946 273047 118765
12189A18765r3127j1004J65523L2956j98603l24271J83348N8895Q0793K5534O7609
$$ 118765 25638 14634 180157 213113 14510 -309761 -126413 -67518 13275 38809 106418
12178A06418N6419j27129J11866P7481m35j3109j62603N0738K39692R286j62513
$$ 106418 162837 35708 147574 225055 224620 211511 48908 99646 339338 348624 186111
12167A86111J81138m6270n7138m8741l08132m54808L0548J80834N0930K99162
$$ 186111 367249 320979 263841 215100 -93032 -547840 -517292 -336458 -285528 13634
12157A3634L33844M663j06196j54143M9943r824j1256J83553P6275l25494l0739
$$ 13634 347478 352141 245945 91802 141745 131921 120665 304218 380493 54999 24260
12146B4260n5725P501K47284J9179o5327k2498k48356J21321K97792k1737l6472
$$ 24260 -31465 -23964 223320 242499 177172 154674 -93682 27639 325431 303694 267222
12135B67222k13043j69260r212j2213J89054L21091p9774j18236k21568q1389
$$ 267222 54179 -115081 -124293 -136506 52548 373639 293865 175629 -45939 -127328
12125a27328o3227N8194P4954J31096J65611j04116j03820K20622k1188k42092
$$ -127328 -190555 -132361 -57407 73689 239300 135184 31364 251986 230798 -11294
12115a1294N4127K78289K09976J46465j20324j73416m8207k0385J11824j12931
$$ -11294 42833 321122 531098 677563 557239 383823 335616 315231 427055 314124
12105C14124r1573j77610M3906K27753j06693N1487j02742k42403p8740j18960
$$ 314124 222551 44941 88847 316600 209907 261394 158652 -83751 -162491 -281451
12095b81451J04394L25007K54777J21912l0755j70966j71794j61996J29960J78155
$$ -281451 -177057 147950 402727 524639 493884 322918 151124 -10872 119088 297243
12085B97243j75284j50877j67488K13446o1181L3238J40782m9975m9244J29202
$$ 297243 121959 -28918 -196406 17040 -44141 -10903 129879 79904 30660 159862
12075A59862l4576J0024J29712r3450m91474k33346o1242K87187J14214J44016
$$ 159862 125286 135310 265022 171572 -319902 -553248 -614490 -327303 -213089 -69073
12065f9073j2693k39816K66201M72230j25440m19470J5334k3765L4964J82205
$$ -69073 -81766 -321582 -55381 416849 291409 -128061 -112727 -136492 -101528 80677
12055H0677p2806J07423J40802l0080m20749k47103j8150J33413J0685J06999
$$ 80677 7871 115294 256096 226016 -194733 -441836 -459986 -326573 -315888 -208889
12045b08889J34129p1256k73391p5216K6524J31271p7249k08926J87025L44493
$$ -208889 -74760 -146016 -419407 -494623 -468099 -336828 -414077 -623003 -435978 -91485
12035i1485j36464M366P8884N51786K36042r8006j09117j34467k14020l09506
$$ -91485 -227949 -223583 -144699 407087 643129 545123 436006 301539 87519 -221987
12025b21987o1724N9250O382L6715n6269k59214j53389M19806J55210M7455K16162
$$ -221987 -283711 -224461 -218079 -181364 -237633 -496847 -650236 -230430 -75220 -27765 188397
12014A88397j09435j01676j3395J93388J46957m17195j66178J9122K14207M08556
$$ 188397 78962 -22714 -36109 157279 304236 -112959 -279137 -260015 -45808 362748
12004C62748J15886k8754l84934k84174J24166l50519J90485M00470k5174o6293
$$ 362748 478634 449880 64946 -219228 -95062 -445581 -255096 145374 120200 53907
11994E3907p2915r2374K18366J6057l8729P7645l02478q7202k5003M4086L8080
$$ 53907 -19008 -111382 106984 123041 84312 161957 -140521 -227723 -252726 -208640 -170560
11983a70560r0813J61754K798j44524j8673L62741K88137L29856k84459k58394
$$ -170560 -261373 -99619 -96821 -241345 -260018 102723 390860 720716 436257 177863
11973A77863k76820K0177O9062J84948q1129n5769k7904J77350J24929J92518
$$ 177863 -98957 -78780 -9718 175230 94101 38332 10428 187778 312707 505225
11963E05225n6296J70529k14446k90505k45n8904l5673j76735j7980k25640J58334
$$ 505225 448929 619458 405012 114507 114262 55358 19685 -157050 -175030 -400670 -242336
11952b42336J33466k19695m3578J39971j6705J02294q7054j89356J89361L37062
$$ -242336 -108870 -328565 -372143 -232172 -248877 -146583 -233637 -422993 -233632 103430
11942A03430n6805j50097n5174J12555j49234j01477K9430K38960k54648k83852
$$ 103430 46625 -103472 -158646 -46091 -195325 -296802 -267372 -28412 -283060 -566912
11932e66912l4797J40061j18790M0620k8719k0486M72507j44653j44176M4561
$$ -566912 -601709 -461648 -580438 -539818 -568537 -589023 -116516 -261169 -405345 -360784
11922c60784J20152N1728k77523j51122L53809L81861M361j52113J5241J03646
$$ -360784 -240632 -188904 -466427 -617549 -263740 118121 122482 -29631 -14390 89256
11912H9256o6485j45988l4492K65226J06505j47797k32162p6699J2300k68781
$$ 89256 22771 -123217 -157709 107517 214022 66225 -165937 -242636 -230336 -499117
11902d99117K24642J57713o6606J20967K23019l8537M9279k12251o1198k3630
$$ -499117 -274475 -116762 -183368 -62401 160618 122081 171360 -40891 -102089 -125719
11892a25719p7980J80988K87026q109m565J86599k63226j31032J3031n9456n9906
$$ -125719 -203699 -22711 264315 256206 251641 438240 175014 43982 57013 -2443 -62349
11881f2349k62445J25108L66758K2142k09936K4214j1450l0685J54597N3225R5635
$$ -62349 -324794 -199686 167072 189214 -20722 3492 -7958 -38643 115954 169179 264814
11870B64814j09897m02245m54900j45643J35622J94815J32882L59809l1403n3891
$$ 264814 154917 -247328 -702228 -847871 -712249 -517434 -384552 -24743 -56146 -110037
11860a10037k75374P0764K16233K86362J05951j50376j34211j17643q4319L06773
$$ -110037 -385411 -314647 -98414 187948 293899 143523 9312 -108331 -192650 114123
11850A14123J53492k10476l0903R4290o5034J11685L6103j32720k40842L1086
$$ 114123 267615 57139 26236 120526 55492 167177 203280 70560 -170282 -139196
11840a39196J13124J29897n0204J3733J54976j42839p9816j91459J14573k0768
$$ -139196 -26072 103825 53621 67354 222330 79491 -325 -191784 -77211 -97979
11830i7979k42094n2922K84423j97484K6006J22033J56125j53912k51782Q7825
$$ -97979 -340073 -392995 -108572 -306056 -280050 -158017 -1892 -155804 -407586 -319761
11820c19761N6695l8559K00955L61306Q2501j43089o1787Q7659j47564j16151
$$ -319761 -263066 -301625 -100670 260636 343137 200048 138261 225920 78356 -37795
11810c7795j93043j31833j45047K09549L85600O3802k3290Q5353j60164j10686
$$ -37795 -230838 -362671 -507718 -298169 87431 151233 127943 213296 53132 -57554
11800e7554k10700K54382K70060k97500j82303L4738J55306l8515K8183P2024
$$ -57554 -268254 -13872 256188 -41312 -223615 -188877 -33571 -72086 -43903 28121
11790B8121p993j44532j02229j1655K55887J64652l18828j69113K35528K02928
$$ 28121 20128 -124404 -226633 -238288 17599 182251 -136577 -305690 -70162 132766
11780A32766N3647j66529j78182N5326L74870k38329k09788N5813K5690J65138
$$ 132766 186413 19884 -158298 -102972 271898 33569 -176219 -120406 -94716 70422
11770G0422k31324j82155J46685N8225k31203K10502M6141j30578O8318K48341
$$ 70422 -160902 -343057 -196372 -138147 -369350 -158848 -112707 -243285 -174967 73374
11760G3374r2251o9124J20749K1920p3064J20607J13886m4984k29250k7402m6602
$$ 73374 -18877 -88001 32748 54668 -18396 102211 216097 171113 -58137 -85539 -132141
11749a32141J01118J51492Q0719M3246N4049j55058J60379O4360k11712p825n7661
$$ -132141 -31023 120469 201188 244434 298483 143425 303804 368164 156452 148627 90966
11738I0966n4768p6082k17917Q0056l9096k15782K14732J98595l5374P105J78438
$$ 90966 36198 -39884 -257801 -177745 -216841 -432623 -217891 -19296 -54670 -47565 130873
11727A30873k8709j18300k70038l7072K39281J3888k0805J01741L78405q4320
$$ 130873 102164 -16136 -286174 -323246 -83965 -70077 -90882 10859 389264 304944
11717C04944k76448k97526R2616j19679j75561M8850M64208J76406k62891p193
$$ 304944 28496 -269030 -176414 -296093 -471654 -422804 41404 217810 -45081 -52274
11707e2274k48512r366K91257J31069j72416l99956n4575L6574J06088r239R777
$$ -52274 -300786 -310152 -18895 112174 -60242 -460198 -514773 -478199 -372111 -381350 -371573
11696c71573n1385O7123q8019j10181q3507P9757o9024K19440J18969J93589M9607
$$ -371573 -422958 -355835 -443854 -554035 -637542 -557785 -626809 -407369 -288400 -94811 -45204
11685d5204M034K91729j67470r3055L93125O8542m592l0046k08561j65764J9852
$$ -45204 -41170 250559 83089 -9966 383159 451701 447109 417063 208502 42738 62590
11674F2590l0815j29189M8134J36816J7513j35045k9436R8538K48523p5468l52936
$$ 62590 31775 -97414 -49280 87536 105049 -29996 -59432 39106 287629 212161 -140775
11663a40775l42242Q5754J95572k51856J44778J27511K15557j76022k61023J06678
$$ -140775 -483017 -397263 -201691 -453547 -308769 -181258 34299 -141723 -402746 -296068
11653b96068J8602m10865j72806J36481K28096J85730n6473K7860L26450O571
$$ -296068 -277466 -688331 -861137 -724656 -496560 -310830 -367303 -339443 -12993 -6422
11643f422R135j73654k1441J49183J3301l1407j04223r9588M2850J6288j83758
$$ -6422 2713 -170941 -192382 -43199 -29898 -61305 -165528 -265116 -222266 -205978 -389736
11632c89736Q8018M0217k20139J5268L70703K31423J25145j75523j13789m0804
$$ -389736 -301718 -261501 -481640 -466372 -95669 135754 260899 85376 -28413 -69217
11622f9217j36682M3302K32855J09128Q7628R6196l8856k30191p1373K15107m8677
$$ -69217 -205899 -162597 70258 179386 267014 363210 324354 94163 22790 237897 189220
11611A89220o8660o1773j58593L9048J42782Q3524L48895J2536l36894m9378P3022
$$ 189220 120560 58787 -99806 -60758 82024 165548 514443 526979 190085 140707 213729
11600B13729k84831j99271K26055P8146k10864O9597J11288M8574j43681j03650
$$ 213729 -71102 -270373 -44318 33828 -177036 -107439 3849 52423 -91258 -194908
11590a94908p775O7743j07362j84946L7394J11534K53792K75252N0041k63053
$$ -194908 -202683 -134940 -242302 -427248 -389854 -278320 -24528 250724 300765 37712
11580C7712n0025J24503P2821q1084J92324J4646j65769L5703j73126j05072L03559
$$ 37712 -12313 112190 185011 103927 296251 310897 145128 180831 7705 -97367 206192
11569B06192K23829p1062k56973L60173P8457k60578j15765k11945k46583j48882
$$ 206192 430021 358959 101986 462159 540616 280038 164273 -47672 -294255 -443137
11559d43137J33449N66900K590o3876r7602l9407O623j33558j91391k04077J01217
$$ -443137 -309688 257212 259802 195926 98324 58917 65540 -68018 -259409 -463486 -362269
11548c62269L43104j15411J39954M7392n275N2107J8571j33947p5798l3730J9142
$$ -362269 -19165 -134576 5378 52770 47495 99602 118173 -15774 -91572 -125302 -106160
11537a06160K17663J04919q9264n605J91949j31042r187K74974l74130o7526R4615
$$ -106160 111503 216422 127158 121553 313502 182460 173273 448247 74117 6591 101206
11526A01206Q8307r8542m9180q0124n3806j08399K65914m2014j52598j78946o7967
$$ 101206 189513 90971 41791 -38333 -92139 -200538 65376 23362 -129236 -308182 -376149
11515c76149Q640R5155j552k41865j21826M73483O5672j57402l470J25200R6901
$$ -376149 -367509 -272354 -273906 -515771 -637597 -164114 -98442 -255844 -259314 -134114 -37213
11504c7213J18054J8600J38238O2752J28172l12729k59163L1175J850j43156O743
$$ -37213 80841 99441 237679 300431 428603 115874 -143289 -112114 -110264 -253420 -246677
11493b46677J20675J14247P9337o8986K04712K46667j0080j20943m8894O2925
$$ -246677 -126002 -11755 67582 -1404 203308 449975 439895 318952 270058 332983
11483C32983l9766k55429j83592K4588J65006r2994j56828J55466J18863k10308
$$ 332983 293217 37788 -145804 -121216 43790 -49204 -206032 -50566 68297 -142011
11473a42011r4402k52869n0020J17949R1383K30267k647N4087R8029J39488j92910
$$ -142011 -236413 -489282 -539302 -421353 -329970 -99703 -102350 -48263 49766 189254 -3656
11462c656j87808J46704J34980k1929j2576p0462k4815k87929K06350N5639o251
$$ -3656 -191464 -44760 90220 68291 55715 -14747 -39562 -327491 -121141 -65502 -71753
11451g1753K2065O5604Q9179J05879P0372j34460o660M2341j11924j07645K38740
$$ -71753 -49688 15916 105095 210974 281346 146886 140226 182567 70643 -37002 201738
11440B01738L57704J310k73016k07203L7594P5348k1824p9141k8589L08847q6110
$$ 201738 559442 560752 287736 80533 118127 193475 171651 92510 63921 372768 286658
11429B86658k30349j64797r4326l6629j07032j24847j19364L2918L97699R2505
$$ 286658 56309 -108488 -202814 -239443 -346475 -471322 -590686 -557768 -160069 -67564
11419f7564n945J26147L4557p486Q244k18690j67112l7203P9987K07306k45775
$$ -67564 -73509 52638 87195 79709 87953 -130737 -297849 -335052 -255065 -47759 -293534
11408b93534J1618k4500j78798l8030M5203P5197j12946j90640O9213K0602K83746
$$ -293534 -281916 -306416 -485214 -523244 -478041 -402844 -515790 -706430 -637217 -616615 -332869
11397c32869J19231O997L29803J0232l31357j5642j8453J5797P3203J45624J63202
$$ -332869 -213638 -206641 123162 133394 -197963 -213605 -232058 -216261 -143058 2566 165768
11386A65768r1085K7811O0515N7994j53722k69240k31802J45216J34209Q0016
$$ 165768 74683 102494 163009 221003 67281 -201959 -433761 -288545 -154336 -74320
11376g4320k29968l24742K13785L40115j78244q9359J46503Q9320K56685J32963
$$ -74320 -304288 -629030 -415245 -75130 -253374 -342733 -196230 -106910 149775 282738
11366B82738k16507l53891k65093K25809J00001p8689J1786n3865l12143J21578
$$ 282738 66231 -287660 -552753 -326944 -226943 -305632 -293846 -347711 -659854 -538276
11356e38276J1746j85128L6871N98774Q9609o6479J25611l62810n4590J94126
$$ -538276 -526530 -711658 -674787 -76013 13596 -52883 72728 -290082 -344672 -150546
11346a50546L9933L8667r4406N2972J55922J67654k22624k00897K8396J18922
$$ -150546 -110613 -71946 -166352 -113380 42542 210196 -12428 -213325 -184929 -66007
11336f6007L0745r9894Q312K0009j20703J2072Q1812l01964L755M1625L3978J74359
$$ -66007 -35262 -135156 -126844 -106835 -227538 -215466 -133654 -435618 -431863 -390238 -356260 -181901
11324a81901J9702j32161m3781R4369m9428Q1285j57124J09702L01806L84889
$$ -181901 -162199 -294360 -338141 -243772 -293200 -211915 -369039 -259337 42469 427358
11314D27358l1244m68854j48653R2738R3364l77470J95077K9053q351m628K42659
$$ 427358 396114 -72740 -221393 -128655 -35291 -412761 -217684 -188631 -196982 -201610 41049
11303D1049K1617j27193k46836k57257K05141L83036K30734j81424K1898R8153
$$ 41049 62666 -64527 -311363 -568620 -363479 19557 250291 68867 90765 188918
11293A88918J9205k38255J72838L10923J07692k07144k20433k71120l25349j66038
$$ 188918 208123 -30132 142706 453629 561321 354177 133744 -137376 -462725 -628763
11283f28763J86670j64885q8915R9505R1236K76519M55112m2540K2662L5215m01541
$$ -628763 -442093 -606978 -695893 -596388 -505152 -228633 226479 183939 206601 241816 -159725
11272a59725P3111J64763K04281L10793l3372m54136k11002j00263J90086o5215
$$ -159725 -86614 78149 282430 593223 559851 105715 -105287 -205550 -15464 -80679
11262h0679p195L19492j35695k25675j7453k12079k12580O2235K913R3411J56365
$$ -80679 -87874 231618 95923 -129752 -147205 -359284 -571864 -509629 -506716 -413305 -256940
11251b56940l0493p3459N1999j9130p5046Q9400K65585M5643j59728M09240J50024
$$ -256940 -287433 -360892 -308893 -328023 -403069 -313669 -48084 -2441 -162169 247071 397095
11240C97095l18473P4198L80547k45886j44344l3168l60989m42890j86557J19837
$$ 397095 78622 152820 533367 287481 143137 109969 -251020 -693910 -880467 -760630
11230g60630M31813J37291J62574j47063m30550R4177J44257Q0884K8046p9089
$$ -760630 -328817 -191526 -28952 -176015 -606565 -512388 -368131 -287247 -259201 -338290
11220c38290N4484J79084R6622J8910j62067p6180L05878j17566K1591M3289n3404
$$ -338290 -283806 -104722 -8100 10810 -151257 -227437 78441 -39125 -17534 25755 -27649
11209b7649N3733K4590l1467N7908J72509J85535k2530l70571l07404N9082J46563
$$ -27649 26084 50674 19207 77115 249624 435159 412629 42058 -265346 -206264 -59701
11198e9701K55117J18641j28757m437n35556J4232M5998O1118j15635k87878L22650
$$ -59701 195416 314057 185300 180863 -354693 -340461 -294463 -233345 -348980 -636858 -314208
11187c14208J50412O5863K68659j3521k7405P6055j75588j94950R6253N8093k6529
$$ -314208 -163796 -97933 170726 157205 129800 205855 30267 -164683 -68430 -10337 -36866
11176c6866j31732l16369j72692J7128L9324o301j45720J64326J7573j34098J8827
$$ -36866 -168598 -484967 -657659 -640531 -601207 -607508 -753228 -588902 -571329 -705427 -686600
11165f86600Q5725Q1402L2363j7736R2327R7521j48481L34120j5032k26548l52530
$$ -686600 -600875 -519473 -487110 -504846 -412519 -314998 -463479 -129359 -144391 -370939 -723469
11154g23469N4864L69620K56874j12059J89765J86878J13259r7349k29944n7840
$$ -723469 -668605 -298985 -42111 -154170 35595 222473 335732 238383 8439 -49401
11144d9401J04786k78979l06991L67163J37196r454J8959M0526q2235K33882m4220
$$ -49401 55385 -223594 -530585 -163422 -26226 -35680 -16721 23805 -58430 175452 131232
11133A31232l09719J52402P5256Q6912K00808J38194k18432j50303l26725j32195
$$ 131232 -178487 -26085 49171 136083 336891 475085 256653 106350 -220375 -352570
11123c52570J68613J17322K74580j6625k57211J34579j87732L2661M4205K47366
$$ -352570 -183957 -66635 207945 191320 -65891 68688 -119044 -86383 -42178 205188
11113B05188k2851J19327Q7022j70347l35225J01810L43634j90921j59561k3844
$$ 205188 182337 301664 388686 218339 -116886 -15076 328558 137637 -21924 -45768
11103d5768Q9672o1147P525O4008r9796N5080l5397J8064q2551n5181N5474j7542
$$ -45768 43904 -17243 -9718 54290 -45506 9574 -25823 -7759 -90310 -145491 -90017 -107559
11091a07559k00944r9099o2783J53904K35911m0324J07875J14514j81659j69800
$$ -107559 -308503 -407602 -470385 -316481 -80570 -120894 -13019 101495 -80164 -249964
11081b49964j35878K748J1974J7110K53900L54316P7068l61700n02645O0164J12078
$$ -249964 -385842 -383094 -371120 -354010 -100110 254206 331274 -30426 -533071 -472907 -360829
11070c60829J20196q5922J9255J50557q4317n1576m2368L6920l4984M8326J9176
$$ -360829 -240633 -326555 -307300 -156743 -241060 -292636 -335004 -298084 -333068 -284742 -265566
11059b65566J73353J97863P8103j12852j58301m4187K20619Q2914j74346m4014
$$ -265566 -92213 105650 183753 70901 -87400 -131587 89032 171946 -2400 -46414
11049d6414j59979r3928Q0059p439K26712P0241j27702k3896m7766J70024K7419
$$ -46414 -206393 -300321 -220262 -227701 -989 69252 -58450 -82346 -130112 39912 67331
11038F7331R1937J00932k9614k94967j93164J88195j0948j68676k89032K18138
$$ 67331 159268 260200 230586 -64381 -257545 -69350 -80298 -248974 -538006 -319868
11028c19868K97305j67885n6861j46726j4588J66716J5004M1859J75274K29699
$$ -319868 -22563 -190448 -247309 -394035 -408623 -241907 -226903 -185044 -9770 219929
11018B19929j96399k86524j89127L9554Q1923R059l9138J46816J04272r5640o7042
$$ 219929 23530 -262994 -452121 -412567 -330644 -321585 -360723 -213907 -109635 -205275 -272317
11007b72317J16373J31956L7543q9015J32727N6118J85102r3329j01620L7400
$$ -272317 -155944 -23988 13555 -75460 57267 113385 298487 205158 103538 140938
10997A40938J52432j28157j25243m12662J71463N3750N0619Q6809j7511K71646
$$ 140938 293370 165213 39970 -372692 -201229 -147479 -96860 -10051 -27562 244084
10987B44084L63756q054k35889k41703l295K80107j32755m371r6355l7194L21176
$$ 244084 607840 599786 363897 122194 118899 399006 266251 261880 165525 128331 449507
10976D49507K06813l19668l89729J66708P1437K9172M9502J28927p8169k13040
$$ 449507 656320 336652 -53077 113631 185068 214240 263742 392669 314500 101460
10966A01460q8138J0487J6046k77905r184K48889L39877k03195k17233j17503
$$ 101460 13322 23809 39855 -238050 -247234 1655 341532 138337 -78896 -196399
10956a96399m1389k3586n182j12746L11225J90102k5286N1218k3348l6941o293
$$ -196399 -237788 -261374 -266556 -379302 -68077 122025 96739 147957 124609 87668 81375
10945H1375j35933k10936m7326N6826K27670m042o5732J17687j23047r994j67635
$$ 81375 -54558 -265494 -312820 -255994 -28324 -32366 -98098 19589 -103458 -113452 -281087
10934b81087m458o1819P603K79229R2620O6600J4667k09789K06559K32874q0315
$$ -281087 -285545 -347364 -339761 -60532 32088 98688 113355 -96434 110125 342999 262684
10923B62684j20421l77667j71950P1476K52552r5391q7136k4103j07631J58449
$$ 262684 142263 -235404 -407354 -335878 -83326 -178717 -265853 -289956 -397587 -239138
10913b39138L38750J3842K3524P3977M015k09879j32421R6233L4123j35323k5885
$$ -239138 99612 113454 136978 210955 214970 5091 -127330 -31097 3026 -132297 -158182
10902a58182p971j64085n8390j3180j81853J5212r2136P7645j10260j1892J48844
$$ -158182 -166153 -330238 -388628 -401808 -583661 -568449 -660585 -582940 -693200 -705092 -556248
10891e56248L66305J70785j74123J1621J4291R3807n1292k69736J36403N519L66422
$$ -556248 -189943 -19158 -193281 -181660 -167369 -73562 -124854 -394590 -258187 -252668 113754
10880A13754R6335l59327m865K73634r2889k74488J46768L08044J42867m16503
$$ 113754 210089 -149238 -154103 119531 26642 -247846 -101078 206966 349833 -66670
10870f6670j53746O9269J38963j2947o1264k26294r7216J30241M92365J88080
$$ -66670 -220416 -151147 -12184 -25131 -86395 -312689 -409905 -279664 212701 400781
10860D00781Q1006m03039k74096J45810J44957M3240J88745j67561J2542m86798
$$ 400781 481787 78748 -195348 -49538 95419 138659 327404 159843 172385 -314413
10850c14413O5335M5985k5304K51760J47431J90409k67285k27419J36035J36820
$$ -314413 -249078 -203093 -228397 23363 170794 361203 93918 -133501 2534 139354
10840A39354Q6372K15825p2475J81424R2706l68490k86570j52165J58015K11841
$$ 139354 225726 441551 369076 550500 643206 274716 -11854 -164019 -6004 205837
10830B05837O5347l41891j70379K21601K44835K8608k21473k30365n8227J0639
$$ 205837 271184 -70707 -241086 -19485 225350 253958 32485 -197880 -256107 -245468
10820b45468L10141J58835O5516j85248k81858k21480J11875K46514j40065J66525
$$ -245468 64673 223508 289024 103776 -178082 -399562 -287687 -41173 -181238 -14713
10810a4713j81354l05173R8368J34820J80535J3052K63856n1702j12991N0700
$$ -14713 -196067 -501240 -402872 -268052 -87517 -74465 189391 137689 24698 75398
10800G5398J88312j32875j38062r0433l02814j61104P7435L98855J42142r7921
$$ 75398 263710 130835 -7227 -97660 -400474 -561578 -484143 -85288 56854 -41067
10790d1067l10102j07713m4603J37637q6325J22184K61542O5694K66869M0775
$$ -41067 -351169 -458882 -503485 -365848 -452173 -329989 -68447 -2753 264116 304891
10780C04891l38347j26835j6760J88623J23522J98667M2681j56397j94715q777
$$ 304891 -33456 -160291 -177051 11572 135094 333761 376442 220045 25330 16553
10770A6553n9563K95877J52746J2121Q540Q5621k11518r4598m5711j80927Q599
$$ 16553 -43010 252867 405613 417734 426274 511895 300377 205779 160068 -20859 -12260
10759a2260J19277k17006j25327r7585K45876o7622J23212M6508P938l2309K96061
$$ -12260 107017 -109989 -235316 -332901 -87025 -154647 -31435 15073 23011 -9298 286763
10748B86763n3934k56808N8244n1168k21675L05971K09760k46003o9889K13686
$$ 286763 232829 -23979 34265 -16903 -238578 67393 277153 31150 -38739 174947
10738A74947k1226j29116n3034j76144J59019j5035k43555O8076J11181l5342
$$ 174947 153721 24605 -28429 -204573 -45554 -60589 -304144 -236068 -124887 -160229
10728a60229L2055k5290J33310J93556j46535k91324j48330K42955J3031J79422
$$ -160229 -128174 -153464 -20154 173402 26867 -264457 -412787 -169832 -156801 22621
10718B2621k5870j60890o8244J91310M8001j15606J35522M4897J10335L8821j67272
$$ 22621 -3249 -164139 -232383 -41073 6928 -108678 26844 71741 182076 220897 53625
10707E3625k21601P0401O7918L0763k740m4225J39650j68203j61664L8691R4156
$$ 53625 -167976 -97575 -29657 1106 -1634 -45859 93791 -74412 -236076 -197385 -103229
10696a03229J42452J43708J06273R919J35742k08580k86575M8873p2518j14031
$$ -103229 39223 182931 289204 299123 434865 226285 -60290 -11417 -83935 -197966
10686a97966J28901J15235M1897j84134K50695Q3504K15558j7111l70064J285
$$ -197966 -69065 46170 88067 -96067 154628 238132 453690 436579 66515 67800
10676F7800j09416j00506j13802p2399K40267k79457J42623K09741j88141q8756
$$ 67800 -41616 -142122 -255924 -328323 -88056 -367513 -224890 -15149 -203290 -292046
10666b92046n8684K71770k83943j4752O1811o0810L6684K06038J95765J82713
$$ -292046 -350730 -78960 -362903 -377655 -315844 -376654 -339970 -133932 61833 244546
10656B44546J94045l60018j98787L8103j51051R2783K91932n6194j83169k10366
$$ 244546 438591 78573 -120214 -82111 -233162 -140379 151553 95359 -87810 -298176
10646b98176j80112Q6936k308O3863O4266q0987m067k3343o0368J03614K899O4808
$$ -298176 -478288 -391352 -393660 -329797 -265531 -346518 -350585 -373928 -434296 -330682 -327783 -262975
10634b62975n0913r8441Q5674n9342j05559n4386R6606M4743n732n4126K60855
$$ -262975 -313888 -412329 -326655 -385997 -491556 -545942 -449336 -404593 -410325 -464451 -203596
10623b03596M5070j6888K38284K1007m10404J1169L55406K10035q9458l17954
$$ -203596 -158526 -175414 62870 83877 -326527 -315358 40048 250083 160625 -157329
10613a57329j47821K12936J39358j48623R1787J88821q5120j98842k36334J44076
$$ -157329 -305150 -92214 47144 -101479 -9692 179129 94009 -104833 -341167 -197091
10603a97091j86790o8293O09853J79459J04414J19976M1731k70905M0210P2311
$$ -197091 -383881 -452174 157679 337138 441552 561528 603259 332354 372564 444875
10593D44875j87836l3447k38445l2647p8849j6866J18337L6767j73937J5802M4036
$$ 444875 257039 223592 -14853 -47500 -126349 -143215 -24878 11889 -162048 -146246 -102210
10582a02210j83299n5964k11367K51816M99868K2366k94070N9237n3585M1064
$$ -102210 -285509 -341473 -552840 -301024 198844 221210 -72860 -13623 -67208 -26144
10572b6144J69301j0067K71589N8801m261k06464K30934q0761j97587M8648J57287
$$ -26144 143157 133090 404679 463480 459219 252755 483689 402928 205341 253989 411276
10561D11276n29601o50506j17632L11232K68113J8238J99974K71479q3042j97072
$$ 411276 -118325 -768831 -886463 -575231 -307118 -288880 -88906 182573 99531 -97541
10551i7541j58919k43690J47124K17002N7856l25121L1924K15412M82161K6391
$$ -97541 -256460 -500150 -353026 -136024 -78168 -403289 -371365 -155953 326208 352599
10541C52599m4832L1009J91833r5623o7355q9244p9625R5829L7528m23572P0551
$$ 352599 307767 338776 530609 434986 367631 278387 198762 294591 332119 -91453 -20902
10530b0902n3457J82285M7936Q7595J72135Q6837r967l07614m95753j16098J25012
$$ -20902 -74359 107926 155862 243457 415592 502429 492462 184848 -310905 -427003 -301991
10519c01991J04131m3731l3203K71242j7427l0377j23478k165r3919p1787j61788
$$ -301991 -197860 -241591 -274794 -3552 -20979 -51356 -174834 -176999 -270918 -342705 -504493
10508e04493R7665j1622o1101Q5008K76767K73965K13950K44213n0150k77301
$$ -504493 -406828 -418450 -479551 -394543 -117776 156189 370139 614352 564202 286901
10498B86901l17827k55743J74998L77540L05235m9835k56736j91760j42429L2660
$$ 286901 -30926 -286669 -111671 265869 571104 521269 264533 72773 -69656 -36996
10488c6996M1836k74018m6571m6448l5865L2151K54538J24573J05890M6810k4072
$$ -36996 4840 -269178 -315749 -362197 -398062 -365911 -111373 13200 119090 165900 141828
10477A41828j52165k30158k5526q3442K48547M2388j70240R1985J80700j55533
$$ 141828 -10337 -240495 -266021 -349463 -100916 -58528 -228768 -136783 43917 -111616
10467a11616k32192j69825O4002K74640l5500K57277J98133L67118k62961k36708
$$ -111616 -343808 -513633 -449631 -174991 -210491 46786 244919 612037 349076 112368
10457A12368k42848M5020J85196O4935L547j84461j0867L5103O6377J88740J00071
$$ 112368 -130480 -85460 99736 164671 168218 -16243 -27110 7993 74370 263110 363181
10446C63181L48445q9111l61815m21214j94097j69059K40945L06277J17034n3766
$$ 363181 711626 622515 260700 -160514 -354611 -523670 -282725 23552 140586 86820
10436H6820J01647J22883j7140l4219L3185O9821J40235N1439P0952k48037j46288
$$ 86820 188467 311350 294210 259991 293176 362997 503232 554671 625623 377586 231298
10425B31298j39214J67552R978O3898N4392J2314Q5431J84785o045l48766j41733
$$ 231298 92084 259636 269614 333512 387904 400218 485649 670434 664389 315623 173890
10414A73890k11331J24238J07981J09120K9335J24241k16751j68514n3820j28860
$$ 173890 -37441 86797 194778 303898 333233 457474 240723 72209 18389 -110471
10404a10471M3586L9370K64480J39563R8021j77631k66425j80887j22657l7341
$$ -110471 -66885 -27515 236965 376528 474549 296918 30493 -150394 -273051 -310392
10394c10392P5739m2712K38671K96962K7381j64763j40521J24530P1475K28062
$$ -310392 -234653 -277365 -38694 258268 285649 120886 -19635 104895 176370 404432
10384D04432j34379m06011k10757k0325J2578Q8545R4160P5823P6724j32067L0511
$$ 404432 270053 -135958 -346715 -367040 -354462 -265917 -171757 -95934 -19210 -151277 -120766
10373a20766K5765K97089J2986k20450k37656K77791L81218K086p9488j48365
$$ -120766 -95001 202088 215074 -5376 -243032 34759 415977 418063 338575 190210
10363A90210M380k82788j64417P1171J35436K25979L3906j46414k2681m9285o6694
$$ 190210 194590 -88198 -252615 -181444 -46008 179971 213877 67463 44782 -4503 -71197
10352g1197j85450q103J62019K58098k0710k28480k42167j01968K5905J99537
$$ -71197 -256647 -264750 -102731 155367 134657 -93823 -335990 -437958 -412053 -212516
10342b12516K44956K98242J02727k14722O7092k25446j28711l52519K26110L16247
$$ -212516 32440 330682 433409 218687 285779 60333 -68378 -420897 -194787 121460
10332A21460o6847k6325N6466p792j00833M9775p9398L8738J76760J70062m6681
$$ 121460 54613 28288 84754 76962 -23871 25904 -53494 -14756 162004 332066 285385
10321B85385q1401Q4480O8593m2251J22730m2451j46090j58862m6366K50276j58081
$$ 285385 203984 288464 357057 314806 437536 395085 248995 90133 43767 294043 135962
10310A35962k28068k6577K72766J31292j27426m3042k28420K31372J67321R0056
$$ 135962 -92106 -118683 154083 285375 157949 114907 -113513 117859 285180 375236
10300C75236m4513K44477L44038J16979J89122J96808l63048l01577R7523j16133
$$ 375236 330723 575200 919238 1036217 1225339 1422147 1059099 757522 855045 738912
10290G38912j93740k65237q067K0585l523J30196J53797Q0940j26326R4190j03427
$$ 738912 545172 279935 271868 292453 288930 419126 572923 653863 527537 621727 518300
10279E18300m4465j82725k59573P2422L6739K17039J62199p1875l38932j06555
$$ 518300 473835 291110 31537 103959 140698 357737 519936 448061 109129 2574
10269B574j15103N3227J54050o4782r9135r1872J50132K98385J9213K22535j1031
$$ 2574 -112529 -59302 94748 29966 -69169 -161041 -10909 287476 306689 529224 518193
10258E18193j69590k37978K20715N57090K17003j47778j03624k34081P3524k19511
$$ 518193 348603 110625 331340 888430 1105433 957655 854031 619950 693474 473963
10248D73963k3296r838j10408Q1189K52401j71016l49293J8419q1514k38472L20814
$$ 473963 450667 440829 330421 411610 664011 492995 143702 162121 80607 -157865 162949
10237A62949J61562l6796J00995N9348j44442J49228L4997j48533k13422j51184
$$ 162949 324511 287715 388710 448058 303616 452844 487841 339308 125886 -25298
10227b5298p6751J66354K66481O77p9534J32609k11444j38860k0764l5903N30035
$$ -25298 -102049 64305 330786 331463 251929 384538 173094 34234 13470 -22433 507602
10216E07602o8180n07162j90212J71816o9165Q8219l0990J95887O7795o0367J33632
$$ 507602 439422 -67740 -257952 -86136 -155301 -67082 -98072 97815 165610 105243 238875
10205B38875j79769L0968L231j11743j15186K13731N56676L0501l64370r0709
$$ 238875 59106 90074 93305 -18438 -133624 80107 636783 667284 302914 212205
10195B12205P0527O7610L48286j56999j26557m6683j23084K61986k3442j16444
$$ 212205 282732 350342 698628 541629 415072 368389 245305 507291 483849 367405
10185C67405j19868P4981k8441J10683K2736k21966l53127r9694K04256P0023
$$ 367405 247537 322518 294077 404760 427496 205530 -147597 -247291 -43035 26988
10175B6988j42822j65202o8295J18180J80955l8971J38203L88032j02648m05345
$$ 26988 -115834 -281036 -349331 -231151 -50196 -89167 49036 437068 334420 -70925
10165g0925k17737j41524J11874K34189K08952M93864N6682M203o092J91498p9025
$$ -70925 -288662 -430186 -318312 -84123 124829 618693 675375 679578 673486 864984 785959
10154G85959K305o0271j56784k96391n07379l36359Q145J83532K19808J46298
$$ 785959 788264 727993 571209 274818 -232561 -568920 -560775 -377243 -157435 -11137
10144a1137m7119k15080k86352K40535L53168J01092J75864k7671j40757m1861
$$ -11137 -58256 -273336 -559688 -319153 34015 135107 310971 283300 142543 100682
10134A00682K17772o462k8212p8739M31105j5541m5975j34684m4021M5531K79346
$$ 100682 318454 311992 283780 205041 636146 620605 574630 439946 395925 441456 720802
10123G20802j23777l27971k3558r7000M0499k0817J6807k1873j70548J52434J86244
$$ 720802 597025 269054 245496 148496 188995 168178 184985 163112 -7436 144998 331242
10112C31242j58086r996P8803k27610k19135J52578J74020P2810J385O4366L1845
$$ 331242 173156 163160 241963 14353 -204782 -52204 121816 194626 196011 260377 292222
10101B92222J39942j63828j26899R6676j23177r7613k958R8882j18129K88294
$$ 292222 432164 268336 141437 238113 114936 17323 14365 113247 -4882 283412
10091B83412n9621p3563J84598L50544k37902j79413j02464o3289j75154j93987
$$ 283412 223791 150228 334826 685370 447468 268055 165591 102302 -72852 -266839
10081b66839J66821l0662J54370l1283k63019j57892K76831N1474P7334J24428
$$ -266839 -100018 -130680 23690 -7593 -270612 -428504 -151673 -100199 -22865 101563
10071A01563j32352J04532L6087k43924q3462K20369q3520n5700J21194M8996
$$ 101563 -30789 73743 109830 -134094 -217556 2813 -80707 -136407 -15213 33783
10061C3783L1184j1234O7125j90323j00136K63385M2379k309N3286p0654K8113
$$ 33783 64967 53733 120858 -69465 -169601 93784 136163 133854 187140 116486 144599
10050A44599j40985j86157K02920K22597j55898Q8866J76532j81056l31900q2940
$$ 144599 3614 -182543 20377 242974 87076 175942 352474 171418 -160482 -243422
10040b43422L24934k1924N742K44053K48333o7537J52530K16446k22326m03068
$$ -243422 81512 59588 65330 309383 557716 490179 642709 859155 636829 233761
10030B33761k96819M2258J27151M1208l1215j30486K1861M3097Q4578L1734l8352
$$ 233761 -63058 -20800 106351 147559 116344 -14142 7719 50816 135394 167128 128776
10019A28776J08653P4241k94872l5629K04723K8105J40281J04511P0784k9545
$$ 128776 237429 311670 16798 -18831 185892 213997 354278 458789 529573 500028
10009E00028P6540j10411j16194o7919O3555J39971j34057k77802k16284k42263
$$ 500028 576568 466157 349963 282044 345599 485570 351513 73711 -142573 -384836
9999c84836K24782K05338J39023j19184k46076o028K40805O7422j97436J83047
$$ -384836 -160054 45284 184307 65123 -180953 -186981 53824 121246 -76190 106857
9989A06857R4299k1063R5656K710J68024j13789l98980r7809j36228O7175J70708
$$ 106857 201156 180093 275749 278459 446483 332694 -66286 -164095 -300323 -233148 -62440
9978f2440J43745o2121k13890k98576L40055L05764K00206j86956j19j64014j6296
$$ -62440 81305 19184 -194706 -493282 -153227 152537 352743 165787 165668 1654 -14642
9967a4642Q4947R9930j49530j45575J79829J65537j06607k7542O3409K25405k5383
$$ -14642 70305 170235 20705 -124870 54959 220496 113889 86347 149756 375161 349778
9956C49778Q586r0894r0479q6831N5719J56256k34223q0613j18022j43651K12740
$$ 349778 358364 267470 176991 90160 145879 302135 67912 -12701 -130723 -274374 -61634
9945f1634K20812K87171K48190M537q3273k37967o7968j41658J70643L6251J3204
$$ -61634 159178 446349 694539 699076 615803 377836 309868 168210 338853 375104 388308
9934C88308j14945r4415J40047L6693m6338K4047n9451l00064o1485N0190j64978
$$ 388308 273363 178948 318995 355688 309350 333397 273946 -26118 -87603 -37413 -202391
9923b02391k78542J27272K62174j2252P4743q7722j6575L58785Q4596l92280J17118
$$ -202391 -480933 -353661 -91487 -103739 -28996 -116718 -133293 225492 310088 -82192 34926
9912C4926M09145J3671k68104j42062k5856P619J640p190J21114j19855J01152
$$ 34926 444071 457742 189638 47576 21720 29339 30979 23789 144903 25048 126200
9901A26200K98606m588l02103j05119K50823K98582j4842k08386n6230J40469
$$ 126200 424806 420218 118115 12996 263819 562401 547559 339173 282943 423412
9891D23412q5367l26854J97539J98674Q3796k63260j42793k2000O724j0116j66805
$$ 423412 338045 11191 208730 407404 491200 227940 85147 63147 69871 59755 -107050
9880a07050j35598O0186K23096p6199j7123N443Q7860L53002L17067j73820J80439
$$ -107050 -242648 -182462 40634 -35565 -52688 -47245 40615 393617 710684 536864 717303
9869G17303n6245j0445q6886l25930n932L04798p0979j39738j72796J22119r2083
$$ 717303 661058 650613 563727 237797 231865 536663 465684 325946 153150 275269 183186
9858A83186Q3112o4021k6744K39938K42321j7166K16293J9074j84686J99320l12836
$$ 183186 266298 202277 175533 415471 657792 640626 856919 875993 691307 890627 577791
9847E77791j97627R0823M506m36621j10747L15116J96565K7027J73703J37254
$$ 577791 380164 470987 475493 38872 -71875 243241 439806 466833 640536 777790
9837G77790k6009q6514k02817j2301J14417J8332j00157k00924R5920N2334K29625
$$ 777790 751781 665267 462450 450149 564566 582898 482741 281817 377737 430071 659696
9826F59696J6675k0460j66121R248j58272j28629m50034O5566K95238p1785M5431
$$ 659696 676371 655911 489790 499038 340766 212137 -237897 -172331 122907 51122 96553
9815I6553R2228L55316K4635l9657K48641qJ00185J02503k2745k36940K9178l0800
$$ 96553 188781 544097 568732 529075 777716 777708 877893 980396 957651 720711 749889 719089
9803G19089m7448k0521j74081j32790j18742m19101q2815M2440L5654K08290J94013
$$ 719089 671641 651120 477039 344249 225507 -193594 -276409 -233969 -198315 9975 203988
9792B03988o0645K07268J46098o6583k42583k6059p2795L4399L3527N7785K3877
$$ 203988 143343 350611 496709 430126 187543 161484 88689 123088 156615 214400 238277
9781B38277o3435j21061J34202J01534J18843J80045o0536n55517k04714O7698
$$ 238277 174842 53781 187983 289517 408360 588405 527869 -27648 -232362 -164664
9771a64664K11005J37257m2478j0431K60806j28626n8647j93749k25965K3461
$$ -164664 46341 183598 141120 130689 391495 262869 204222 10473 -215492 -192031
9761a92031J28737L57516N0420j340q5198J5541q4710N1661o5912K4470j19408
$$ -192031 -63294 294222 344642 343302 258104 273645 188935 240596 174684 199154 79746
9750G9746O499Q6809J11818P0018k66157n9439J04200L77400M7554j26747O0997
$$ 79746 86245 173054 284872 354890 88733 29294 133494 510894 558448 431701 492698
9739D92698J7498J37342L23585Q0567k47216m3240j82145q2740j74707M3497J97745
$$ 492698 510196 647538 971123 1051690 804474 761234 579089 496349 321642 365139 562884
9728E62884K06435J81511N4858L44196k1443K36205N65111N80277L77841j02463
$$ 562884 769319 950830 1005688 1349884 1328441 1564646 2129757 2710034 3087875 2985412
9718B985412m99959l71925m65733k69644l81969j49635P2255N5343k73718J77305
$$ 2985412 2485453 2113528 1647795 1378151 996182 846547 918802 974145 700427 877732
9708H77732j46828q0232m2517K35191n1756k3450j74530l10230J85362K11391
$$ 877732 730904 650672 608155 843346 791590 768140 593610 283380 468742 680133
9698F80133O2234R8325L0413j43275m1990n7839k5750R1923J38295l17766k55981
$$ 680133 742367 840692 871105 727830 685840 628001 602251 694174 832469 514703 258722
9687B58722J9963J31415J08365J00164j08164j54511Q4528o2280l42681p0611
$$ 258722 278685 410100 518465 618629 510465 355954 440482 378202 35521 -35090
9677c5090Q9606P8637M84939L34037k53323j08712N9647m5908J00966j89564j27300
$$ -35090 54516 133153 618092 952129 698806 590094 649741 603833 704799 515235 387935
9666C87935j50850j2430J03903N2630L6564j69995j54182J18895K89053J22430
$$ 387935 237085 224655 328558 381188 417752 247757 93575 212470 501523 623953
9656F23953j0519j42267r805J00739j30135L0794l8964J41093L3394J1290k39090
$$ 623953 613434 471167 461362 562101 431966 462760 423796 564889 598283 609573 370483
9645C70483J79811j1138Q6966R141m5585J52620j84322m285n7552j03729J25292
$$ 370483 550294 539156 626122 635263 589678 742298 557976 553691 496139 392410 517702
9634E17702K67630K40860k14001k09449j67781l06935J3931J36966J24700J09902
$$ 517702 785332 1026192 812191 602742 434961 128026 141957 278923 403623 513525
9624E13525K88394K90678l794j91717l02938K62549M24805k1820k32322J4127
$$ 513525 801919 1092597 1088803 897086 594148 856697 1281502 1259682 1027360 1041487
9614A041487r2183k51018J3795K14229J63235n2043j9753j37160j51169Q4750
$$ 1041487 949304 698286 712081 926310 1089545 1037502 1017749 880589 729420 814170
9604H14170J27483q9365l6962J68783k41583J30129M3204J46174j00142j95219
$$ 814170 941653 852288 815326 984109 742526 872655 915859 1062033 961891 766672
9594G66672o4268K97033Q7749l2193l1851k03320k35656Q0078L1040j73231N9278
$$ 766672 702404 999437 1087186 1054993 1023142 819822 584166 664244 695284 522053 581331
9583E81331L52760L24739j35175k1518r507k22653n6709J72257k28663J1342J18326
$$ 581331 934091 1258830 1123655 1102137 1092630 869977 813268 985525 756862 768204 886530
9572H86530J78770J33041Q562l5222O7719o8192r3514j93703q7742N11681M06392
$$ 886530 1065300 1198341 1206903 1171681 1239400 1171208 1077694 883991 796249 1307930 1714322
9561A714322j27141j73005p3324M5813j5525l53516K14049J08408n0256K5871
$$ 1714322 1587181 1414176 1340852 1386665 1371140 1017624 1231673 1340081 1289825 1315696
9551A315696J07945j02539l7546J76944J16272j87588J8656j78946L7792K5082
$$ 1315696 1423641 1321102 1283556 1460500 1576772 1389184 1407840 1228894 1266686 1291768
9541A291768l18450j8620m987J21305n6782J1634K21882J70302J0117k38801m27374
$$ 1291768 973318 954698 949711 1071016 1014234 1025868 1247750 1418052 1428169 1189368 761994
9530G61994J88827L12040L61671k18512k28069k01829k29926k7252K03578n6006
$$ 761994 950821 1262861 1624532 1406020 1177951 976122 746196 718944 922522 866516
9520H66516p0889q4634j62265L53558J44552n2524J06172J67545K13633O1838
$$ 866516 795627 710993 548728 902286 1046838 994314 1100486 1268031 1481664 1543502
9510A543502j08549m1472j76292k70536J6295m8580L93761p6536L3589K39688
$$ 1543502 1434953 1393481 1217189 946653 962948 914368 1308129 1231593 1265182 1504870
9500A504870K4236k07400p8333J4405l4230J9286J85394J40317j31720M8359k52798
$$ 1504870 1529106 1321706 1243373 1257778 1223548 1242834 1428228 1568545 1436825 1485184 1232386
9489A232386j36952K76190j12831K23561P3951Q9217K21973l58928j46585J9983
$$ 1232386 1095434 1371624 1258793 1482354 1556305 1645522 1867495 1508567 1361982 1381965
9479A381965K35961L28909P4468J65259r9225k13200k14721j03261j53425J34428
$$ 1381965 1617926 1946835 2021303 2186562 2087337 1874137 1659416 1556155 1402730 1537158
9469A537158n5259k11505J72229j01876j5188J71229l7706p6530j16903P918J55342
$$ 1537158 1481899 1270394 1442623 1340747 1325559 1496788 1459082 1382552 1265649 1273567 1428909
9458A428909K0660j2622J63157K2187K26637M7230O570J2103J05434N6412j45678
$$ 1428909 1449569 1436947 1600104 1622291 1848928 1896158 1902728 1914831 2020265 2076677 1930999
9447A930999k26104M3986m2140n0721j89880M9151L61933J50193j96756j21857
$$ 1930999 1704895 1748881 1706741 1656020 1466140 1515291 1877224 2027417 1830661 1708804
9437A708804L5733j86060n4683L83864J25498j04034J42785J47555J95847l6579
$$ 1708804 1744537 1558477 1503794 1887658 2013156 1909122 2051907 2199462 2395309 2358730
9427B358730l01491k47916k14564M1162M23574K23595n1177k40869j01146r0226
$$ 2358730 2057239 1809323 1594759 1635921 2059495 2283090 2231913 1991044 1889898 1799672
9417A799672k15838K36316j24438j30786K0108n6441q7232k7703N2419l9188K97221
$$ 1799672 1583834 1820150 1695712 1564926 1585034 1528593 1441361 1413658 1466077 1426889 1724110
9406A724110K14412j18488J03431k21420j79235j07859J00599J10750J76317R585
$$ 1724110 1938522 1820034 1923465 1702045 1522810 1414951 1515550 1626300 1802617 1812202
9396A812202p2742J98866Q0754j9949J51543J5241k2500j08959J41590m7821j41781
$$ 1812202 1739460 1938326 2019080 1999131 2150674 2165915 2143415 2034456 2176046 2128225 1986444
9385A986444J08382M64541J33360Q5373j73472j00599j16181j51649J13735J38669
$$ 1986444 2094826 2559367 2692727 2778100 2604628 2504029 2387848 2236199 2349934 2488603
9375B488603r4074l98816j03452K5098j17023j15867J09611K75649j13170j92506
$$ 2488603 2394529 1995713 1892261 1917359 1800336 1684469 1794080 2069729 1956559 1764053
9365A764053q2927M5208Q4938j9647K58812K87112J74389m67821l56293P5779
$$ 1764053 1681126 1726334 1811272 1791625 2050437 2337549 2511938 2044117 1687824 1763603
9355A763603K27161k25995r7299J82353R3461Q5331K26905k2155K19579K8306
$$ 1763603 1990764 1764769 1667470 1849823 1943284 2028615 2255520 2233365 2452944 2481250
9345B481250l5180M3388o7598J97252Q622l4090R6048k1407j70086l29612j50983
$$ 2481250 2446070 2489458 2421860 2619112 2627734 2593644 2689692 2668285 2498199 2168587 2017604
9334B017604Q7618j15424K53565K09394o0896k79344J51427L6188J21563K38622
$$ 2017604 2105222 1989798 2243363 2452757 2391861 2112517 2263944 2300132 2421695 2660317
9324B660317p672J32299N3126p0102k54586m1625P2934p7117L3843J06232M6238
$$ 2660317 2652645 2784944 2838070 2767968 2513382 2471757 2544691 2467574 2501417 2607649 2653887
9313B653887j6233l9148J28949j21356N0551N824J74635M02301J42893J7190p8998
$$ 2653887 2637654 2598506 2727455 2606099 2656650 2662474 2837109 3239410 3382303 3399493 3320495
9302C320495k56307j18193K3706j01171K3242j3898j1102Q0383M5520Q9335n2549
$$ 3320495 3064188 2945995 2969701 2868530 2891772 2877874 2866772 2947155 2992675 3082010 3029461
9291C029461l50944j5406r737M0174K34162K85928r8534j89314Q6628j56764J9921
$$ 3029461 2678517 2663111 2653374 2693548 2927710 3213638 3115104 2925790 3012418 2855654 2875575
9280B875575N935K87343K48006R611O1409J8739J0143M9706K93998j56035K6204
$$ 2875575 2881510 3168853 3416859 3426470 3487879 3506618 3516761 3566467 3860465 3704430 3730634
9269C730634J35485j12539k22028j61779j39539J21368L43336K86981J4047j42130
$$ 3730634 3866119 3753580 3531552 3369773 3230234 3351602 3694938 3981919 3995966 3853836
9259C853836N2303m17861K0530J57395P5918q4907j80399J91419J59556K1394
$$ 3853836 3906139 3488278 3508808 3666203 3742121 3657214 3476815 3668234 3827790 3849184
9249C849184J08429R8773J19184o5051j33305J16844J02206j45139j526j46848
$$ 3849184 3957613 4056386 4175570 4110519 3977214 4094058 4196264 4051125 4049599 3902751
9239C902751K98073K4831K95227P906p3300j30369q2858J57247O3037J7679Q8231
$$ 3902751 4200824 4225655 4520882 4528788 4455488 4325119 4242261 4399508 4462545 4480224 4568455
9228D568455o7444j25411K33458q8798j54400j24733K8167k8414J49965K64030
$$ 4568455 4501011 4375600 4609058 4520260 4365860 4241127 4269294 4240880 4390845 4654875
9218D654875p3107j1572M3261J7472P0045J12362N6839j23110j85476m5087J97738
$$ 4654875 4581768 4570196 4613457 4630929 4700974 4813336 4870175 4747065 4561589 4516502 4714240
9207D714240Q4699k1540J64036N0273j70963J15080L52682P9703M8663O5340l32767
$$ 4714240 4798939 4777399 4941435 4991708 4820745 4935825 5288507 5368210 5416873 5482213 5149446
9196E149446j19327J82041J68811r709J3214J23491j39386j65322J89783P8263
$$ 5149446 5030119 5212160 5380971 5371262 5384476 5507967 5368581 5203259 5393042 5471305
9186E471305J9410Q7458N4595J12662L0495Q341j40195j53609l3863J27905P9464
$$ 5471305 5490715 5578173 5632768 5745430 5775925 5784266 5644071 5490462 5456599 5584504 5663968
9175E663968q328J72631K38598j88061j73164K60146L0518K274r6830J99981L4446
$$ 5663968 5655640 5828271 6066869 5878808 5705644 5965790 5996308 5998582 5901752 6101733 6136179
9164F136179k31971j69698J6448L61326K97631K05379R2209Q619j64850l2945
$$ 6136179 5904208 5734510 5750958 6112284 6409915 6615294 6707503 6716122 6551272 6518327
9154F518327J18929P1963p8667k49763k5301J59313M81453L00156J02437j29845
$$ 6518327 6637256 6709219 6630552 6380789 6355488 6514801 6996254 7296410 7398847 7269002
9144G269002k13996P3595J21839k8549j84823J10703K65530j2010Q1749K33365
$$ 7269002 7055006 7128601 7250440 7221891 7037068 7147771 7413301 7401291 7483040 7716405
9134G716405K26813q8549J33423p8070K12987K48417j98729j88614k48844L44622
$$ 7716405 7943218 7854669 7988092 7910022 8123009 8371426 8172697 7984083 7735239 8079861
9124H079861K34197j70118O7851K49139K91739J46994J5344J20134R4292l2122
$$ 8079861 8314058 8143940 8211791 8460930 8752669 8899663 8915007 9035141 9129433 9097311
9114I097311Q7259J73289r0342K5409J22635k63444M9861Q1667J15134J69962
$$ 9097311 9184570 9357859 9267517 9292926 9415561 9152117 9201978 9283645 9398779 9568741
9104I568741j0883J42340j59106J35081K36596L51434j3617P2778K65231n5056
$$ 9568741 9557858 9700198 9541092 9676173 9912769 10264203 10250586 10323364 10588595 10533539
9094A0533539M8806J51856K99008K20557O7815n5728m7149K7096k2768K6646J35214
$$ 10533539 10582345 10734201 11033209 11253766 11321581 11265853 11218704 11245800 11223032 11249678 11384892
9083A1384892N8894K27453J08691K33486J23535l4264J26760j09672n519J21012
$$ 11384892 11443786 11671239 11779930 12013416 12136951 12102687 12229447 12119775 12114256 12235268
9073A2235268M41163l0042M3284K15153j83286k48577O58953M48446j95796j04427
$$ 12235268 12676431 12646389 12689673 12904826 12721540 12472963 13131916 13580362 13384566 13280139
9063A3280139K61030q4191n8961K71050L13967J77786q3092P78J89059J4169j73596
$$ 13280139 13541169 13456978 13398017 13669067 13983034 14160820 14077728 14078506 14267565 14281734 14108138
9052A4108138K33798M82333M24614Q3850K12187Q604R0758J13567J29346K42503
$$ 14108138 14341936 14824269 15248883 15332733 15544920 15553524 15644282 15757849 15887195 16129698
9042A6129698K37080J42237j3052j12507J13412R8263Q9250K92594M62123K80090
$$ 16129698 16366778 16509015 16495963 16383456 16496868 16595131 16684381 16976975 17439098 17719188
9032A7719188K55319j47122J21099L00673M20419K43954J391j7768q9241L52331
$$ 17719188 17974507 17827385 17948484 18249157 18669576 18913530 18914921 18897153 18807912 19160243
9022A9160243J79326J89127J59560q0944K08714L93901L38602M597J46330J30850
$$ 19160243 19339569 19528696 19688256 19607312 19816026 20209927 20548529 20553126 20699456 20830306
9012B0830306O2558q1573K19732N37480M55930k07681k5653P4294m103K47515
$$ 20830306 20892864 20811291 21031023 21568503 22024433 21816752 21791099 21865393 21861290 22108805
9002B2108805M26672O37770Q3145R72M44903K94546J76993L15532L14057O0234
$$ 22108805 22535477 23173247 23256392 23257364 23702267 23996813 24173806 24489338 24803395 24863629
8992B4863629L2995L29890K02449l3420j00290J32622K49730O7271M34513K65038
$$ 24863629 24896624 25226514 25428963 25395543 25295253 25427875 25677605 25744876 26179389 26444427
8982B6444427k7672K67718K15465J48691L99510K37648K10185J48292L5826O9269
$$ 26444427 26416755 26684473 26899938 27048629 27448139 27685787 27895972 28044264 28080090 28149359
8972B8149359J69915K07804Q6575J50786K1499J74241K65803K70712O8504J09952
$$ 28149359 28319274 28527078 28613653 28764439 28785938 28960179 29225982 29496694 29565198 29675150
8962B9675150r9026Q4526K10956J66968p9161J1614K87792L67078K363P1222q2325
$$ 29675150 29576124 29660650 29871606 30038574 29959413 29971027 30258819 30625897 30628260 30699482 30617157
8951C0617157P249K41309K41951M05617K34991O5035j05700j11239j11683j13036
$$ 30617157 30624406 30865715 31107666 31513283 31748274 31813309 31707609 31596370 31484687 31371651
8941C1371651l0375K31629m8049K95180J76694J8331M009J6029J22289J91278
$$ 31371651 31341276 31572905 31524856 31820036 31996730 32015061 32019070 32035099 32157388 32348666
8931C2348666l4202n06805k65264O6932J0908J258j6040K0820N4997j86745l38574
$$ 32348666 32314464 31807659 31542395 31609327 31620235 31621493 31605453 31626273 31681270 31494525 31155951
8920C1155951p3885j77555o49957k89043l9232J44622J31445L5960k73161o1920
$$ 31155951 31082066 30904511 30254554 29965511 29926279 30070901 30202346 30238306 29965145 29903225
8910B9903225j69348K0558j6509m65609l93783r71P0131r8191m915m03349m19994
$$ 29903225 29733877 29754435 29737926 29272317 28878534 28877563 28947694 28849503 28844588 28441239 28021245
8899B8021245k97200j84493k89476l13884r6090M0075k6238j08133n04509j96031
$$ 28021245 27724045 27539552 27250076 26936192 26840102 26880177 26853939 26745806 26241297 26045266
8889B6045266k81505l06077k42280k29962j19250k9883j01174m97362j98910k29614
$$ 26045266 25763761 25457684 25215404 24985442 24866192 24836309 24735135 24237773 24038863 23809249
8879B3809249j98851m24058l74923m08106j82415l6727j35978j72029l31408j06681
$$ 23809249 23610398 23186340 22811417 22403311 22220896 22184169 22048191 21876162 21544754 21438073
8869B1438073r8811l8657k97604o10165l86285j95889j41939q7440k8812K5287
$$ 21438073 21339262 21300605 21003001 20392836 20006551 19810662 19668723 19581283 19552471 19577758
8859A9577758m1681l59155j56408K0991k81710l30735m19311m59046l9610K43439
$$ 19577758 19536077 19176922 19020514 19041505 18759795 18429060 18009749 17550703 17511093 17754532
8849A7754532j44084l12498l42774p0913j31912m14732l62976r0696K6517q2730
$$ 17754532 17610448 17297950 16955176 16884263 16752351 16337619 15974643 15883947 15910464 15827734
8839A5827734j69016k78798k66491j43832J22747j21935l58382j87273j68124
$$ 15827734 15658718 15379920 15113429 14969597 15092344 14970409 14612027 14424754 14256630
8830A4256630r9863j98550l52988k88700k18254P5541k8703j20468P922J00117
$$ 14256630 14156767 13958217 13605229 13316529 13098275 13173816 13145113 13024645 13032567 13132684
8820A3132684K878k84039k89578j11825j35632l43342m76599n6683J09094K51856
$$ 13132684 13135562 12851523 12561945 12450120 12314488 11971146 11494547 11437864 11546958 11798814
8810A1798814J55466k90736k23464p4712J98973J59273k28631l22041l80219l86196
$$ 11798814 11954280 11663544 11440080 11365368 11564341 11723614 11494983 11172942 10792723 10406527
8800A0406527o9050n5840k98929k79500J06962J31659m2179n84288j64049m3319
$$ 10406527 10337477 10281637 9982708 9703208 9810170 9941829 9899650 9315362 9151313 9107994
8790I107994j01146k83403J35029j56768n05668k14140J11321M3115N2325k46454
$$ 9107994 9006848 8723445 8858474 8701706 8196038 7981898 8093219 8136334 8188659 7942205
8780G942205r8822m8726k0082M0414J84205n8041k64040j27845k36415O2144J87597
$$ 7942205 7843383 7794657 7774575 7814989 7999194 7941153 7677113 7549268 7312853 7374997 7562594
8769G562594p084j79765l06842m2106j9945j2337j18627j58686j2393j64432k64801
$$ 7562594 7555510 7375745 7068903 7026797 7006852 6994515 6875888 6717202 6704809 6540377 6275576
8758F275576j4858J1509j05243o9301J48651r7362J28147J005N2668k18751k95671
$$ 6275576 6260718 6272227 6166984 6097683 6246334 6148972 6277119 6278124 6330792 6112041 5816370
8747E816370j15798P43r1084j00137j52563L0184J12473q0869P5938n0596N2886
$$ 5816370 5700572 5701315 5610231 5510094 5357531 5387715 5500188 5419319 5495257 5444661 5497547
8736E497547j22409P648K59975j82039m13411n6025j82614l02871L29848J17190
$$ 5497547 5375138 5382786 5642761 5460722 5047311 4991286 4808672 4505801 4835649 4952839
8726D952839k17219p0779j74470Q649J96449K06174j54867k88524q8057K4431
$$ 4952839 4735620 4664841 4490371 4499020 4695469 4901643 4746776 4458252 4370195 4394626
8716D394626o9436l68043M8068K91382J91187q994k43263j69483l6758M6782p8353
$$ 4394626 4325190 3957147 4005215 4296597 4487784 4478790 4235527 4066044 4029286 4076068 3997715
8705C997715j15000p3479k39193J2813J22409J4460N8307L3735o0927J65203l47084
$$ 3997715 3882715 3809236 3570043 3582856 3705265 3719725 3778032 3811767 3750840 3916043 3568959
8694C568959j88505K00765K33931n8206l79741r8081P6943J84573l0250j79845
$$ 3568959 3380454 3581219 3815150 3756944 3377203 3279122 3356065 3540638 3510388 3330543
8684C330543j52824n7097k74414j27400K36288J06074O4610J0731j7609J65437
$$ 3330543 3177719 3120622 2846208 2718808 2955096 3061170 3125780 3136511 3118902 3284339
8674C284339n4691k07709k05446L20714R1695o2959j3044K9117j84433L8642p0428
$$ 3284339 3229648 3021939 2816493 3137207 3228902 3165943 3152899 3182016 2997583 3036225 2965797
8663B965797r4545J02639j55589j86251j46654k07296J62325l141J36121J9805
$$ 2965797 2871252 2973891 2818302 2632051 2485397 2278101 2440426 2437285 2573406 2593211
8653B593211J5652j44263l37573Q1334l1096J27041j10395n1218K14279p9043
$$ 2593211 2608863 2464600 2127027 2208361 2177265 2304306 2193911 2142693 2356972 2277929
8643B277929j54636K10126J69016k13293P8294K27175J81906M68417p4178k26764
$$ 2277929 2123293 2333419 2502435 2289142 2367436 2594611 2776517 3244934 3170756 2943992
8633B943992q6995j51219r1908j69699K67096n010n4232m12679k35440O4089K13858
$$ 2943992 2856997 2705778 2613870 2444171 2711267 2706257 2652025 2239346 2003906 2067995 2281853
8622B281853P5674q5367P1336j36478k39909j634L34863J80781J61856M641p0034
$$ 2281853 2357527 2272160 2343496 2207018 1967109 1965475 2300338 2481119 2642975 2647616 2577582
8611B577582p9632O4135L6396j67855n1467j53921l3887J81523j067j85798K75606
$$ 2577582 2497950 2562085 2598481 2430626 2379159 2225238 2191351 2372874 2371807 2186009 2461615
8600B461615J79461J32525l67446j08182J07777L02331K14903j82565j37040J54755
$$ 2461615 2641076 2773601 2406155 2297973 2405750 2708081 2922984 2740419 2603379 2758134
8590B758134J62077O7261M80681K88333j8409j46917k18318k38804k45458j73312
$$ 2758134 2920211 2987472 3468153 3756486 3738077 3591160 3372842 3134038 2888580 2715268
8580B715268J58174K59750j1702m73864k63894K72206l41422m28905J37826q5469
$$ 2715268 2873442 3133192 3121490 2647626 2383732 2655938 2314516 1885611 2023437 1937968
8570A937968j1303r648r6455j21244P0197K84179j32542l6675J67814J9141l80733
$$ 1937968 1926665 1917017 1820562 1699318 1769515 2053694 1921152 1884477 2052291 2071432 1690699
8559A690699r593J29674O1257m4116J41765K01666N0078j71650k91872k57400
$$ 1690699 1681106 1810780 1872037 1827921 1969686 2171352 2221430 2049780 1757908 1500508
8549A500508J99043j34069j46473j61607j15233J58790n1180J22491R1578J44787
$$ 1500508 1699551 1565482 1419009 1257402 1142169 1300959 1249779 1372270 1463848 1608635
8539A608635k44728m51701J10296K54937K26421J34889j3103K093j67153n4439
$$ 1608635 1363907 912206 1022502 1277439 1503860 1638749 1625646 1627739 1460586 1406147
8529A406147J13653n0990k610k48558o8090k61885K34886L93118K31279j4680
$$ 1406147 1519800 1468810 1466200 1217642 1149552 887667 1122553 1515671 1746950 1732270
8519A732270l6847r9369k33477l25339j40934K7300R3719p0761O2212j88288m8079
$$ 1732270 1695423 1596054 1362577 1037238 896304 923604 1017323 946562 1008774 820486 772407
8508G72407K0594p7153K40752R706q0550m9465L235q1100J69358K54867j9432
$$ 772407 793001 715848 956600 966306 885756 836291 839526 758426 927784 1182651 1163219
8497A163219k66597J08038K57241k1668K31370k92987k26230k67613l07963K50325
$$ 1163219 896622 1004660 1261901 1240233 1471603 1178616 952386 684773 376810 627135
8487F27135K45524k06780o3726j01490J96691q0650K34651M05812k50212K5104
$$ 627135 872659 665879 602153 500663 697354 616704 851355 1257167 1006955 1032059
8477A032059J94306q1268l11501j08936k9168j00111K25032K37884M4293o1101
$$ 1032059 1226365 1145097 833596 724660 695492 595381 820413 1058297 1102590 1041489
8467A041489j89046M6034J90291O0675q9699n413k12951k17479M8196K15180J40485
$$ 1041489 852443 898477 1088768 1149443 1059744 1054331 841380 623901 672097 887277 1027762
8456A027762P4647j02175J12824J4592J5751K3798l82989k84261O4171r5363L84820
$$ 1027762 1102409 1000234 1113058 1127650 1143401 1167199 784210 499949 564120 468757 853577
8445H53577R9689j52471j59537k5292K2974j07448L02243M4165j1589p8866l7438
$$ 853577 953266 800795 641258 615966 638940 531492 833735 877900 866311 787445 750007
8434G50007J86516O6515R6263o5468l94228k56898K43166j19875k78675k03741
$$ 750007 936523 1003038 1099301 1033833 639605 382707 625873 505998 227323 23582
8424B3582K47712K28083K66135M3545n6523K0166K04706J49574j67305j82331
$$ 23582 271294 499377 765512 809057 752534 772700 977406 1126980 959675 777344
8414G77344J9106K97158O7661L7531m8440k00396l45709k289Q9996j60174k24459
$$ 777344 796450 1093608 1161269 1198800 1150360 949964 604255 601966 691962 531788 307329
8403C07329j3909Q1243L6146N3038J94292K8616j71816j04262j5081k781J08671
$$ 307329 293420 374663 410809 463847 658139 686755 514939 410677 395596 392815 501486
8392E01486J25104O7014k44150j61941R0799o327P7406J23Q4903M0208L1705l40128
$$ 501486 626590 693604 449454 287513 378312 371985 449391 449514 534417 574625 606330 266202
8380B66202l2875j20332N4312M5118m6147J3921k4101L6449j70281j15388J99646
$$ 266202 233327 112995 167307 212425 166278 180199 156098 192547 22266 -93122 106524
8369A06524J64166P5608k16454m8129K93604R5543J8553P5072k300l689J05547
$$ 106524 270690 346298 129844 81715 375319 470862 489415 564487 562187 558498 664045
8358F64045l9236l12377j23897L33080J39670k09156l9038J97649p1186k26175
$$ 664045 624809 312432 188535 521615 661285 452129 413091 610740 539554 313379
8348C13379k62305L0972L53789r5490n5291j38865j74523K25010K73490J18277
$$ 313379 51074 82046 435835 340345 285054 146189 -28334 196676 470166 588443
8338E88443j32952P230R1832j03242l2368R0102k1665J34871P7620r4115L56112
$$ 588443 455491 462721 554553 451311 418943 509045 487380 622251 699871 605756 961868
8327I61868j14103l26281j27020j48135k70914k18543K47174K9193R7072J46136
$$ 961868 847765 521484 394464 246329 -24585 -243128 4046 33239 130311 276447
8317B76447J45438j78735j04993P1479k3078o4206J33803K21341j40135j77598
$$ 276447 421885 243150 138157 209636 186558 122352 256155 477496 337361 159763
8307A59763M3974j6271n4893J17998K56940Q3345l8892k29844j62108M3134L12981
$$ 159763 203737 187466 132573 250571 507511 590856 551964 322120 160012 203146 516127
8296E16127J65814N7722k2733j65175l5252k63637J9631J65056R9926j11332J58104
$$ 516127 681941 739663 716930 551755 516503 252866 272497 437553 537479 426147 584251
8285E84251q5609l43198N6601J23031J17093R2997K3894k27758R589J05544J67510
$$ 584251 498642 155444 212045 335076 452169 545166 569060 341302 350891 456435 623945
8274F23945j18371k64408K7009j8449J99375J03977k03332j55709j82200J45251
$$ 623945 505574 241166 268175 249726 449101 553078 349746 194037 11837 157088
8264A57088L21962j27165l75056p7323J76717L65054J67571m4199j18231l32316
$$ 157088 479050 351885 -23171 -100494 76223 441277 608848 564649 446418 114102
8254A14102P38J0667L0865j58335r6510K29170Q7923Q3430o3847M8377N3767L0339
$$ 114102 114840 125507 156372 -1963 -98473 130697 218620 302050 238203 286580 340347 370686
8242C70686k24661J58355j66365j00126J59729L51514j97438o843J41913R9868
$$ 370686 146025 304380 138015 37889 197618 549132 351694 344851 486764 586632
8232E86632R4003J83473j37559j50209m7066k07521k38274o0555R0003R9923K79973
$$ 586632 680635 864108 726549 576340 529274 321753 83479 22924 112927 212850 492823
8221D92823n2169Q3515p461j36442J15173R4694j26832m4707q5779K13443R6931
$$ 492823 440654 524169 516708 380266 495439 590133 463301 418594 332815 546258 643189
8210F43189j07134r6701j53526j82104L939L94841j54860k50138k68779R5403
$$ 643189 536055 439354 285828 103724 107663 502504 347644 97506 -171273 -75870
8200g5870K84262K22596J75290M5299j35591n8015J57801M154l5693O1034R7790
$$ -75870 208392 430988 606278 651577 515986 457971 615772 619926 584233 645267 743057
8189G43057j35986k50550k67768j14250J96899J49895l8085N6566J52479J24408
$$ 743057 607071 356521 88753 -25497 171402 321297 283212 339778 492257 616665
8179F16665p1939J02046j60590J8574j34239k20023j60575l88430l0702M0075
$$ 616665 544726 646772 486182 504756 370517 150494 -10081 -398511 -429213 -389138
8169c89138K28430j16578j31030n3425K01596K27740L42560N8251k78503j15794
$$ -389138 -160708 -277286 -408316 -461741 -260145 -32405 310155 368406 89903 -25891
8159b5891j07752O0836J15420j5881m32684K42014M62397j06481q5008j31999
$$ -25891 -133643 -72807 42613 26732 -405952 -163938 298459 191978 106970 -25029
8149b5029L8039n9384n0766j22809O556j30711J03781K55654N1045l929J26852
$$ -25029 13010 -46374 -97140 -219949 -213393 -344104 -240323 15331 66376 62447 189299
8138A89299J77498k16795j80624K2171J54254J3693L1751j11858J19353O2428
$$ 189299 366797 150002 -30622 -8451 145803 159496 191247 79389 198742 261170
8128B61170o504j74418m0606N985q0194k21584K77232M9280J66381J18314k6647
$$ 261170 254666 80248 39642 45627 -34567 -256151 21081 70361 236742 355056 328409
8117C28409J56156K16832k64322J21006n5929m11657k069J06224K69860R7779
$$ 328409 484565 701397 437075 558081 502152 90495 88426 194650 464510 562289
8107E62289l45180j38840k04980n3951L48630L74776M8370j16068l2752j46813
$$ 562289 217109 78269 -126711 -180662 167968 542744 591114 475046 442294 295481
8097B95481O2757o1530j32470Q1668j20989q5443K72082K42756k6218K7656Q9018
$$ 295481 358238 296708 164238 245906 124917 39474 311556 554312 528094 555750 644768
8086F44768k95014l08266L7896L61930L42906q3171k62709n61450J02881M02978
$$ 644768 349754 41488 79384 441314 784220 701049 438340 -123110 -20229 382749
8076C82749K39473J94384o276k49829j68670L9857J59452n8561J30368L7880m03144
$$ 382749 622222 816606 810330 560501 391831 431688 591140 532579 662947 700827 297683
8065B97683j37518R7751J29357J20453o3718j61519l0512K18151L05578R8747
$$ 297683 160165 257916 387273 507726 444008 282489 251977 470128 775706 874453
8055H74453Q4100o7386m61462j67611j70825j70728k3078J06543K87546J64079
$$ 874453 958553 891167 429705 262094 91269 -79459 -102537 4006 291552 455631
8045D55631k9156j30318k68367L14401J44488m9351j26299K30326L96537J49144
$$ 455631 426475 296157 27790 342191 486679 437328 311029 541355 937892 1087036
8035A087036M6530j06254k38036j61191K0753k11818p4884j22660M7170J53263
$$ 1087036 1133566 1027312 789276 628085 648838 437020 362136 239476 286646 439909
8025D39909l5964L004k6159M1341j776k35110J7371q3757q5152L01644K5649K38861
$$ 439909 403945 406949 380790 422131 420355 185245 202616 118859 33707 335351 361000 599861
8013E99861k96255j36590K55774K6748k85806k06627K3183K41052L26803Q0965
$$ 599861 303606 167016 422790 449538 163732 -42895 -19712 221340 548143 629108
8003F29108M2538k91921n7203l7079K91421l1678l01582j53034J59728o3837K01527
$$ 629108 671646 379725 322522 285443 576864 545186 243604 90570 250298 186461 387988
7992C87988J0857K98660J08801j10653k70987n1947L99678J09748k43441l69974
$$ 387988 398845 697505 806306 695653 424666 372719 772397 882145 638704 268730
7982B68730K63563K36291J13570J92880p6855n3050j16840j75715o0173m8538
$$ 268730 532293 768584 882154 1075034 998179 945129 828289 652574 592401 543863
7972E43863J40110K36907O9764k62815Q4310K65062k55320j43377K13894k7054
$$ 543863 683973 920880 990644 727829 812139 1077201 821881 678504 892398 865344
7962H65344l16615K28940Q1693K26519K592o7784j86759k13214k57337L61407
$$ 865344 548729 777669 859362 1085881 1088473 1020689 833930 620716 363379 724786
7952G24786N93440J44333J04961m1783j86301p5622j67840j28516l6236L24984
$$ 724786 1318226 1462559 1567520 1525737 1339436 1263814 1095974 967458 931222 1256206
7942A256206J06005n1672j11898k42340K42L0441r8243M6645K48443N7685n3476
$$ 1256206 1362211 1310539 1198641 956301 956543 986984 888741 935386 1183829 1241514 1188038
7931A188038n4558q6709K09062Q7293Q1104r8732j76108k5129K94092K19254J10618
$$ 1188038 1133480 1046771 1255833 1343126 1424230 1325498 1149390 1124261 1418353 1637607 1748225
7920A748225k45369k68246j10623l1714J20607Q0077L7548j22225k66768k8437
$$ 1748225 1502856 1234610 1123987 1092273 1212880 1292957 1330505 1208280 941512 913075
7910I13075K90376K41511Q68l39066p1349N0259J645j34037j17306j73897n0358
$$ 913075 1203451 1444962 1445830 1106764 1035415 1085674 1087319 953282 835976 662079 611721
7899F11721L31313L89947N9198j88106J49264R2104j85813l31904m9759J49551
$$ 611721 943034 1332981 1392179 1204073 1353337 1445441 1259628 927724 877965 1027516
7889A027516Q5740k45039J83098J62013q59j3111j20514L7095L07465k002k27917
$$ 1027516 1113256 868217 1051315 1213328 1212469 1199358 1078844 1115939 1423404 1421402 1193485
7878A193485j07041j83247J29046K27095k87257M2804J06132J3303m9693k58216
$$ 1193485 1086444 903197 1032243 1259338 972081 1014885 1121017 1134320 1084627 826411
7868H26411l0765k0914J10652j57141k42845p2314P2010K13217l6922j7824q8239
$$ 826411 795646 774732 885384 728243 485398 413084 485094 698311 661389 643565 555326
7857E55326j05567m5163j61712N2705n7212m0640J49266J19437J23978L15870
$$ 555326 449759 404596 242884 295589 238377 197737 347003 466440 590418 906288
7847I06288l9524j71347j51581j39185J1842J69820k25989k32244M8356J00399
$$ 906288 866764 695417 543836 404651 416493 586313 360324 128080 176436 276835
7837B76835K58746k33569k25638M10399K16251j39575j87684K18569j866k48199
$$ 276835 535581 302012 76374 486773 703024 563449 375765 594334 592468 344269
7827C44269O8646p1305j0532L8841l63220L2221k35297j69683Q5139P130k75883
$$ 344269 412915 341610 331078 369919 6699 38920 -196377 -366060 -280921 -273791 -549674
7816e49674L10546l4439k14466K07231L65177L7219j8288r3236R8033J6666J976
$$ -549674 -239128 -273567 -488033 -280802 84375 121594 103306 10070 108103 124769 126745
7805A26745j95865K8106L00130k02914k92369l48618K12804J72681J49379j25551
$$ 126745 -69120 -41014 259116 56202 -236167 -584785 -371981 -199300 -49921 -175472
7795a75472j03144J51299L28823L61803j26426q3882M4575J01395o7765J05537
$$ -175472 -278616 -127317 201506 563309 436883 353001 397576 498971 431206 536743
7785E36743J82962j43140j23543j45986k0517J40559k03495k19588P5080J30638
$$ 536743 719705 576565 453022 307036 286519 427078 223583 3995 79075 209713
7775B09713n4527l22548k11711j23757l7373K29684K92791m733P9454J13917K65109
$$ 209713 155186 -167362 -379073 -502830 -540203 -310519 -17728 -22461 56993 170910 436019
7764D36019m7571j28705m2415m9676j40535J06832j04722k09644j73794q1204
$$ 436019 388448 259743 217328 167652 27117 133949 29227 -180417 -354211 -435415
7754d35415j40086J97205J81983j610j74216J86431J02337M7031J03552r464L15380
$$ -435415 -575501 -378296 -196313 -197923 -372139 -185708 -83371 -36340 67212 57748 373128
7743C73128J20202j908j01666j5827L8306j32902p6834J53390p506j2058j02795
$$ 373128 493330 491422 389756 373929 412235 279333 202499 355889 348383 336325 233530
7732B33530j45381k0942Q7769j3312n8893r0482k72398J61965l524M5381j40826
$$ 233530 88149 67207 154976 141664 82771 -7711 -280109 -118144 -121668 -76287 -217113
7721b17113j21615K84375L6370J67523L5421K1847k2409n0944l88714k0026Q8322
$$ -217113 -338728 -54353 -17983 149540 184961 206808 184399 133455 -255259 -275285 -186963
$$ [...]
##END NTUPLES=NMR SPECTRUM
##END=
