##TITLE=Analysis number 316016
Compound Code cc 33146
Book Reference 414/146/3
Project Code adrs
Chemist Name mattw
##JCAMPDX= 6.0         $$ Bruker NMR JCAMP-DX V2.0
##DATA TYPE= NMR SPECTRUM
##DATA CLASS= NTUPLES
##ORIGIN= Bruker BioSpin GmbH
##OWNER= NMR
$$ XWIN-NMR		Version 3.5
$$ Tue Dec 13 14:24:51 2005 GMT Standard Time (UT+0h)  MAYBRIDGE\NMR@NMR_250MHZ
##.OBSERVE FREQUENCY= 250.131544655141
##.OBSERVE NUCLEUS= ^1H
##.ACQUISITION MODE= SIMULTANEOUS (DQD)
##.ACQUISITION SCHEME= undefined
##.AVERAGES= 16
##.DIGITISER RES= 18
##SPECTROMETER/DATA SYSTEM= dpx250
##.PULSE SEQUENCE= zg30
##.SOLVENT NAME= CDCl3
##.SHIFT REFERENCE= (INTERNAL, CDCl3, 0, 16.466)
##AUDIT TRAIL= $$ (NUMBER, WHEN, WHO, WHERE, WHAT)
$$ ##TITLE= Audit trail, XWIN-NMR		Version 3.5
$$ ##JCAMPDX= 5.01
$$ ##ORIGIN= Bruker BioSpin GmbH
$$ ##OWNER= NMR
$$ C:\u/data/dgb/nmr/ADRS/13800/pdata/1/auditp.txt
$$ ##AUDIT TRAIL=  $$ (NUMBER, WHEN, WHO, WHERE, WHAT)
(   1,<2005-12-13 14:24:08.69 +000>,<MAYBRIDGE\NMR>,<NMR_250MHZ>,
      <created by zg, POWCHK disabled, PULCHK disabled
       configuration hash MD5:
       62 19 C7 07 E1 42 D1 B7 37 6C 3D D0 77 39 F9 E6
       data hash MD5: 64K
       F5 7D D4 59 F5 29 23 DF A5 08 20 9E 57 B0 81 5E>)
(   2,<2005-12-13 14:24:28.56 +000>,<MAYBRIDGE\NMR>,<NMR_250MHZ>,
      <Start of raw data processing
       ef LB = 0.3 FT_mod = 6 PKNL = 1 SI = 32K 
       data hash MD5: 32K
       DD 3C 75 63 7E 69 F6 E9 38 BD C0 FC 94 BE 33 03>)
(   3,<2005-12-13 14:24:30.74 +000>,<MAYBRIDGE\NMR>,<NMR_250MHZ>,
      <apk 
       data hash MD5: 32K
       20 54 DD B7 95 F6 EB 70 D4 68 DB A6 45 D7 4F AE>)
(   4,<2005-12-13 14:24:31.75 +000>,<MAYBRIDGE\NMR>,<NMR_250MHZ>,
      <abs ABSG = 5 
       data hash MD5: 32K
       E1 4F 45 2F 73 7E DE FD 7F B4 BF 25 F2 AA DB 9B>)
$$ ##END=
$$ 
$$ hash MD5
$$ 0B 7E 20 FC AC 7D EB 85 1E A6 26 CA 92 B9 A5 D1
##$RELAX= 
##$RELAX= 
##$RELAX= 
##$RELAX= 
##$RELAX= 
##$RELAX= 
##$RELAX= 
$$ Bruker specific parameters
$$ --------------------------
##$DU= <C:\u>
##$EXPNO= 13800
##$NAME= <ADRS>
##$PROCNO= 1
##$TYPE= <nmr>
##$USER= <dgb>
##$AMP= (0..31)
100 100 100 100 100 100 100 100 100 100 100 100 100 100 100 100 100 100 
100 100 100 100 100 100 100 100 100 100 100 100 100 100 
##$AQSEQ= 0
##$AQ_mod= 3
##$AUNM= <au_zg>
##$AUTOPOS= <45 >
##$BF1= 250.13
##$BF2= 250.13
##$BF3= 250.13
##$BF4= 250.13
##$BF5= 500.13
##$BF6= 500.13
##$BF7= 500.13
##$BF8= 500.13
##$BYTORDA= 1
##$CFDGTYP= 0
##$CFRGTYP= 5
##$CHEMSTR= <none>
##$CNST= (0..31)
1 1 145 1 1 1 1 1 1 1 1 1 1 1 1 1 1 1 1 1 1 1 1 1 1 1 1 1 1 1 1 1 
##$CPDPRG= <>
##$CPDPRG1= <>
##$CPDPRG2= <>
##$CPDPRG3= <>
##$CPDPRG4= <mlev>
##$CPDPRG5= <mlev>
##$CPDPRG6= <mlev>
##$CPDPRG7= <mlev>
##$CPDPRG8= <mlev>
##$CPDPRGB= <>
##$CPDPRGT= <>
##$D= (0..31)
0 1 0 0 0 0 0 0 0 0.06 0 0 0 0 0 0 0.0002 0 0 0 0 0 0 0 0 0 0 0 0 0 0 
0 
##$DATE= 1134483847
##$DBL= (0..7)
120 120 120 120 120 120 120 120 
##$DBP= (0..7)
150 150 150 150 150 150 150 150 
##$DBP07= 0
##$DBPNAM0= <>
##$DBPNAM1= <>
$$ [...]
##$SUBNAM7= <"">
##$SUBNAM8= <"">
##$SUBNAM9= <"">
##$SW= 20.6930455092707
##$SWIBOX= (0..15)
0 0 3 0 0 0 0 0 0 0 0 0 0 0 0 0 
##$SW_h= 5175.983436853
##$TD= 65536
##$TD0= 1
##$TE= 294.16
##$TE2= 300
##$TE3= 300
##$TEG= 300
##$TL= (0..7)
0 120 120 120 120 120 120 120 
##$TP= (0..7)
150 150 150 150 150 150 150 150 
##$TP07= 0
##$TPNAME0= <>
##$TPNAME1= <>
##$TPNAME2= <>
##$TPNAME3= <>
##$TPNAME4= <>
##$TPNAME5= <>
##$TPNAME6= <>
##$TPNAME7= <>
##$TPOAL= (0..7)
0.5 0.5 0.5 0.5 0.5 0.5 0.5 0.5 
##$TPOFFS= (0..7)
0 0 0 0 0 0 0 0 
##$TUNHIN= 0
##$TUNHOUT= 0
##$TUNXOUT= 0
##$USERA1= <user>
##$USERA2= <user>
##$USERA3= <user>
##$USERA4= <user>
##$USERA5= <user>
##$V9= 5
##$VALIST= <valist>
##$VCLIST= <CCCCCCCCCCCCCCC>
##$VD= 0
##$VDLIST= <DDDDDDDDDDDDDDD>
##$VPLIST= <PPPPPPPPPPPPPPP>
##$VTLIST= <TTTTTTTTTTTTTTT>
##$WBST= 1024
##$WBSW= 4
##$XGAIN= (0..3)
0 0 0 0 
##$XL= 0
##$YL= 0
##$YMAX_a= 599916
##$YMIN_a= -420356
##$ZGOPTNS= <>
##$ZL1= 120
##$ZL2= 120
##$ZL3= 120
##$ZL4= 120
##$ABSF1= 16.46605
##$ABSF2= -4.227123
##$ABSG= 5
##$ABSL= 3
##$ALPHA= 0
##$AQORDER= 0
##$ASSFAC= 0
##$ASSFACI= 0
##$ASSFACX= 0
##$ASSWID= 0
##$AUNMP= <proc_1d>
##$AZFE= 0.1
##$AZFW= 0.1
##$BCFW= 0
##$BC_mod= 0
##$BYTORDP= 0
##$COROFFS= 0
##$CY= 12.5
##$DATMOD= 1
##$DC= 0
##$DFILT= <>
##$DTYPP= 0
##$F1P= 14.0000005364418
##$F2P= -0.99999901652339
##$FCOR= 0.5
##$FTSIZE= 32768
##$FT_mod= 6
##$GAMMA= 0
##$GB= 0
##$INTBC= 1
##$INTSCL= 1
##$ISEN= 128
##$LB= 0.3
##$LEV0= 0
##$LPBIN= 0
##$MAXI= 10000
##$MC2= 0
##$MEAN= 0
##$ME_mod= 0
##$MI= 0
##$NCOEF= 0
##$NC_proc= -2
##$NLEV= 6
##$NOISF1= 0
##$NOISF2= 0
##$NSP= 0
##$NTH_PI= 0
##$NZP= 0
##$OFFSET= 16.46605
##$PC= 1
##$PHC0= 84.31485
##$PHC1= 2.406934
##$PH_mod= 1
##$PKNL= yes
##$PPARMOD= 0
##$PSCAL= 4
##$PSIGN= 0
##$REVERSE= no
##$SF= 250.130013992632
##$SI= 32768
##$SIGF1= 0
##$SIGF2= 0
##$SINO= 400
##$SIOLD= 32768
##$SREGLST= <1H.CDCl3>
##$SSB= 0
##$STSI= 32768
##$STSR= 0
##$SW_p= 5175.98343685301
##$SYMM= 0
##$S_DEV= 0
##$TDeff= 65536
##$TDoff= 0
##$TI= <Analysis number 999999
Compound Code 99
Book Reference 9
Project Code 9>
##$TILT= no
##$TM1= 0
##$TM2= 0
##$TOPLEV= 0
##$USERP1= <user>
##$USERP2= <user>
##$USERP3= <user>
##$USERP4= <user>
##$USERP5= <user>
##$WDW= 1
##$XDIM= 32768
##$YMAX_p= 297876008
##$YMIN_p= -76782
$$ End of Bruker specific parameters
$$ ---------------------------------
##NTUPLES= NMR SPECTRUM
##VAR_NAME=  FREQUENCY,     SPECTRUM/REAL,   SPECTRUM/IMAG
##SYMBOL=    X,             R,               I
##VAR_TYPE=  INDEPENDENT,   DEPENDENT,       DEPENDENT
##VAR_FORM=  AFFN,          ASDF,            ASDF
##VAR_DIM=   32768,         32768,           32768
##UNITS=     HZ,            ARBITRARY UNITS, ARBITRARY UNITS
##FACTOR=    0.157963299565203, 1,           1
##FIRST=     4118.65311538261, 0,            0
##LAST=      -1057.3303214704, 0,            0
##MIN=       -1057.3303214704, -76782,       0
##MAX=       4118.65311538261, 297876008,    0
$$ Real data points
##PAGE= N=1
##DATA TABLE= (X++(R..R)), XYDATA
$$ [...]
21149 12891 14987 1505 -8778 -15687 -4702 -874 -231 6137 -5358 -16932 -4896 -5482 -16072
21136 -16072 -22985 -20975 -10610 -6529 -21467 -27040 -30249 -15083 -9423 -19174 -4180 948 1715 -9520
21122 -9520 -14671 4498 10579 18599 28261 25596 10927 10777 4628 6432 14681 10549 20727 23650
21108 23650 14584 7694 10456 3976 -6528 -11382 -1277 -8394 -316 5126 12855 11076 -6262 -24792
21094 -24792 -25698 -29075 -24909 -15526 2921 11005 7201 -6511 -13475 -17372 -18251 -9302 -1820 -1737 508
21079 508 4585 8195 7903 7227 5248 8682 9044 6418 -2905 -13692 -18767 -14557 -13192 -18808 -19243 -25241
21063 -25241 -12689 -6563 -14591 -15336 -17469 -14040 -23511 -20753 -19656 -14173 -4622 -1886 -1054 810 -580
21048 -580 -5839 -12851 -10283 -9281 -14317 -20258 -8155 505 6214 13479 9293 -11551 -18885 -5858
21034 -5858 -10283 -15959 -13564 -12113 -8694 -16152 -26207 -27971 -13142 -2141 3124 648 6436 -2858
21020 -2858 -2313 -9873 -17080 -6655 -1371 -709 5109 15373 25311 31116 27228 11387 3725 2413
21006 2413 6122 -2905 711 -469 10607 22236 23210 20086 18705 18380 13480 9848 11636 -8262
20992 -8262 -14320 -2454 3097 -7971 -8788 -4973 -1381 10798 14959 2399 -3712 -1691 3775 -1301
20978 -1301 0 -6611 -9704 -15126 -33000 -44775 -43420 -29495 -24987 -20501 -18538 -21321 -23411 -19355
20964 -19355 -10021 -2531 -5838 -3107 4898 3967 7069 14025 10110 -4651 -14234 -7703 501 14748
20950 14748 23320 28052 20152 15583 1080 9908 11125 13491 8411 -6163 -10641 -9005 6692 6501
20936 6501 -19894 -24205 -18893 -3495 10375 23842 10427 -10150 -19752 -11438 -3980 -10007 -21444
20923 -21444 -28751 -17310 -5925 -13466 -14546 -13560 8733 14777 19967 34562 29951 18407 18932 577
20909 577 -23115 -25138 -18612 -15407 -10298 -15898 -13916 -6191 10717 6108 1680 11494 14213 9768
20895 9768 7600 9446 -5673 -12222 -5586 -6157 -13463 -8263 -6772 4185 -1580 -11787 -8928 -10211
20881 -10211 2714 -2803 -10704 3105 9528 -3167 433 -46 -19726 -31769 -10134 -5772 -2624
20868 -2624 -8431 -7744 -3375 -3426 818 3754 -7583 -22014 -14182 -10672 -4630 -9265 -7237 208 4660
20853 4660 12632 14731 -5152 -21948 -26322 -26938 -26192 -7540 449 -721 -11509 -9996 -14053 -20242
20839 -20242 -7976 1053 9897 6613 9525 2849 -2954 -4977 4700 10501 17433 4496 526 -1830
20825 -1830 -1293 -6044 -1986 7101 129 -11480 -31644 -37756 -43083 -27319 -14811 -9535 -5671 -8428
20811 -8428 -17714 -23963 -24553 -17212 -1122 -3853 -7423 5952 10684 16284 23135 13117 8941 14106
20797 14106 15371 9715 20821 28358 15062 11320 12913 -1620 -12407 -7535 -11722 -9132 -5966
20784 -5966 -918 3023 4239 -9590 -13178 769 -4888 -10131 -2248 7949 21065 13166 4076 -235
20770 -235 -12014 -10166 2687 9249 12360 3535 6236 9980 1216 -706 1726 4519 9234 17076
20756 17076 20014 23450 29950 18193 4024 -4620 -7807 -1044 10853 -3595 -10946 -7088 -12368
20743 -12368 -1436 7399 11200 6602 12321 21725 20540 23501 15517 8241 17108 19042 12441 9563
20729 9563 3934 10491 9847 7113 -4030 -652 22307 27404 9862 -6732 -15104 2304 5578 -3093
20715 -3093 5335 8247 10359 -7696 -12657 -22468 -38905 -37638 -28773 -19820 -18872 -5928 11780 14357
20701 14357 15432 10478 10883 -2152 -8667 -18012 -21449 -9847 -13645 -17348 -17460 -27603 -26842 -24643
20687 -24643 -4140 -4252 -8402 -6608 -2165 -14153 -20783 -15656 -8815 5239 3689 -2877 -9345 -18948
20673 -18948 -22579 -18556 -13554 -8826 -6226 -6028 -1579 -3430 -10519 -26258 -13350 8950 17821 15572
20659 15572 -9839 -22360 -5774 13213 24773 30897 33430 23876 15810 16772 8758 8720 11437 1757
20645 1757 7331 6066 11074 12564 12611 3881 -7592 -3399 -14596 -35063 -24497 -838 17163 18214
20631 18214 16927 12466 -66 981 2698 5151 3076 -3403 -10970 -10694 414 -7896 -10114 -6568
20617 -6568 -5474 -461 6617 7232 7640 14411 16026 7642 9964 8733 5918 -1507 -2935 -2879 -22033
20602 -22033 -25538 -10620 -1391 -8048 -15344 -8185 2015 10021 17505 24859 14956 11894 8516 2964
20588 2964 12522 11795 -2358 -4456 -13771 -13768 -6706 5776 4562 5354 3560 -1964 6508 14422 16231
20573 16231 9975 5608 4041 5613 9911 17492 27984 28559 24622 16302 15038 7281 19143 22742
20559 22742 10085 6374 10170 6635 8007 10024 9749 12201 10829 6639 -1846 -6454 -11 -5882
20545 -5882 -9423 -8909 -4297 -3293 10321 20422 31047 34684 27767 13327 5964 5049 -4056 -19756
20531 -19756 -15133 345 6678 281 -8532 -9009 -8323 -12146 -20348 -23476 -17629 1595 14349 21832
20517 21832 25812 18895 1095 9852 22866 18436 19647 31474 38782 42077 28769 29144 28343 19160
20503 19160 24572 26278 20117 32046 23903 12696 4227 10537 11961 1525 12237 16706 14547
20490 14547 10041 6750 15233 6122 -663 1975 397 6864 187 -2307 144 5596 6617 3152
20476 3152 10957 13915 5510 3767 1797 -2366 3313 -935 -4853 4357 -5171 -10715 1082 14534
20462 14534 23002 16496 10469 -700 -9028 -10714 -1963 4277 11290 9308 12697 5406 6979 3128
20448 3128 907 -6780 -13216 -20309 -20027 -32454 -26227 -7872 -6767 -3431 -4786 4044 16676 12460
20434 12460 15064 15193 18096 20078 29079 35272 31859 23196 21272 31438 43057 41724 34294 40224
20420 40224 43156 54211 54201 43170 32898 17171 10496 2815 10894 11710 23774 16724 2868 8476
20406 8476 4916 -2828 3237 1978 6567 4016 1610 -290 9767 10177 -9728 -25492 -15126 3871
20392 3871 20873 23490 20156 17921 19516 10482 4532 4653 1314 195 9814 7699 -4749 -13259
20378 -13259 -3507 8959 3976 -8275 -3015 10954 17495 18569 12886 -5685 -12523 -7382 640
20365 640 -8375 -16445 -20866 -14146 -13151 -14540 -8508 -13432 -9543 373 16788 20022 16584 -2430 301
20350 301 7316 1434 -8727 -15224 -25245 -23935 -24294 -17232 -4654 2263 2955 1856 -4864 10254
20336 10254 21200 15016 11379 4578 -5556 -17516 -13597 -8520 -2492 -6273 -6920 -4782 -1111 6378
20322 6378 9703 -5287 -7936 -8408 -7041 -12983 -11751 -7609 6529 8576 8739 1490 -14217 -5938
20308 -5938 -3181 -7427 -10350 -1400 2731 -834 2628 4033 8990 7072 22609 16253 -711 -7053
20294 -7053 -7805 -5531 -5331 9843 16571 8863 16079 16222 10403 357 -15086 -9160 -5220 -15388
20280 -15388 -13543 -6006 -4833 -112 4585 -1453 -13252 -12673 -6283 -5019 -6642 -2109 9464 20753
20266 20753 14838 3718 -6308 -3123 190 2780 -10485 -14539 -21661 -14062 -2733 3412 -8623
20253 -8623 -8185 -9114 -4755 -6340 3696 5145 3969 -8920 -10663 -14533 -15810 -5286 -12589 -17279
20239 -17279 -24567 -15666 4235 19670 20212 12345 18812 18241 12419 3046 4464 1333 5727 10854
20225 10854 9573 561 -2225 -12005 699 554 3514 9091 26157 18639 13225 15859 20977 12233
20211 12233 1434 -7756 402 3130 -4086 -6503 -18029 -14943 -5702 -441 1392 14264 18848 8058
20197 8058 -494 1700 10765 5642 352 8715 14056 843 -5742 -1758 6228 8688 -6558 -10710
20183 -10710 -18037 -9038 6461 8189 3192 -6833 -9449 -3850 -958 1815 17160 37230 38089 19810
20169 19810 5037 5869 -1480 -15795 -16511 -19650 -17554 -12803 -7614 -927 -3011 12448 20386 6672
20155 6672 -9241 -12092 -13011 -3990 -19588 -26049 -27411 -27394 -24005 -20169 -10119 -2495 -9560 -982 15520
20140 15520 30830 28217 20759 9483 -4027 1905 8030 9837 12581 5644 -180 -14263 -16913
20127 -16913 -7669 5381 622 -3419 8460 16529 10131 127 -2108 2960 10187 14006 8226 -878
20113 -878 2393 -1074 -17454 -1469 -3706 -9988 -11205 -5003 -2581 13228 20845 8952 9886 26483
20099 26483 27479 6020 9166 10131 9875 18132 21333 28676 31212 20138 10599 4654 -1151 -16333
20085 -16333 -20149 -23380 -1913 4365 6416 14162 23560 28230 17675 8738 12769 13413 -3867 -8926
20071 -8926 -6113 15078 26353 24881 24636 6478 3308 2065 -3385 -8505 -7971 6077 6500 10974
20057 10974 8374 8150 6278 -664 1191 -9200 -12071 -1042 3583 -1574 -4855 -962 6985 15427
20043 15427 21862 27459 13903 1968 -5005 -1880 2561 -1042 -12740 -9049 2278 10374 11474
20030 11474 3178 1637 2757 -4735 4054 8342 4651 3075 -7831 -15897 -13558 -8853 10814 17346
20016 17346 5849 -14447 -14897 -1531 1083 1421 13054 19595 19126 15979 12184 -2831 -10912 -7972
20002 -7972 -11051 -6467 -6791 -10076 -6020 14553 30947 36625 26709 21300 20937 34942 45542 41214
19988 41214 45224 50615 60713 79307 74099 74428 81420 95541 104936 117760 131479 147445 155953
19975 155953 176411 204990 210258 200696 194536 184654 191480 187679 180499 170525 148625 149437 159618
19962 159618 157133 142136 114276 104044 100982 80936 62952 58356 62094 55747 53649 51340 52542
19949 52542 46194 41774 35237 21773 20678 15360 15631 23890 15533 8799 11803 11930 6972 5952 5077
19934 5077 9755 10511 -1390 2977 10876 19202 13923 7143 9148 12627 13939 10649 1412 -1678 1462
19919 1462 7303 25626 36105 25912 30648 13608 14250 28168 33770 29313 14948 3528 533
19906 533 -1239 17743 4262 -7610 4931 16965 29443 16235 7431 8092 4713 628 -10152
19893 -10152 -15418 -5635 4903 -2355 1772 27308 43296 47543 42201 40169 37140 19442 20015 14045
19879 14045 -3242 -2589 -6952 -9102 5628 22013 15056 6158 13679 25441 31146 18273 15642
19866 15642 28185 10947 -5881 2196 4526 9523 11968 3285 -7372 -7745 5824 2194 3895
19853 3895 4771 1666 4795 10344 -5355 -16698 -8450 -276 -4651 5868 12564 15261 20647 30448
19839 30448 11940 -5357 -17084 -7337 2701 13501 7391 16960 22473 24993 7915 7808 11131
19826 11131 13650 6379 3632 6777 15219 13827 10848 15673 30611 49734 59101 47578 35996
19813 35996 37737 55308 63157 81742 80808 76776 80624 72075 60563 51881 67656 79426 80252 77236
19799 77236 67448 58372 51305 49956 56243 61418 70026 68946 57057 55784 53595 57000 56366 45965
19785 45965 20116 16723 16380 -2474 -7758 5894 13592 22433 23238 11207 4125 8033 28526 41234
19771 41234 38415 28669 29934 17485 18963 15575 6960 -2158 -3822 -3785 -1319 794 -5964 -9323 -2970
19756 -2970 19882 16948 6906 -499 2516 16533 12224 8266 10483 20559 17012 20225 20389 29455
19742 29455 19706 9559 28168 30405 30956 27022 11850 6726 9495 12220 11173 6680 10473 -5042
19728 -5042 -8865 9344 29873 26371 18027 19770 26736 21761 14523 20218 27379 35214 31401 30426
19714 30426 40260 32000 16257 20568 20361 24636 27645 26057 16528 14412 17061 22356 21431 13872 25387
19699 25387 23303 9554 17689 16910 17333 21303 29898 39592 26016 4877 2091 18774 14585 9730
19685 9730 10646 5927 10118 10324 14623 23057 17227 11160 10578 16251 22679 15777 12707 25650 38892
19670 38892 35531 33373 34202 42761 37488 34206 39017 42504 45913 42963 31187 37194 45254 55114
19656 55114 66582 65300 55445 57118 52973 47405 43945 53318 45153 41093 34599 29428 29403 33568 45495
19641 45495 48201 42422 42631 33339 18336 25110 32441 34154 46159 51965 53433 40727 41048 39790
19627 39790 45686 63218 57392 46815 44870 48406 49167 56630 66357 86347 101603 103094 98854 92869
19613 92869 80131 74311 80561 91989 92073 93250 102878 95014 106607 112400 102390 88090 91551 89421
19599 89421 82001 68980 65233 70272 62236 56131 51506 51838 58383 57961 60937 56535 44809 38719
19585 38719 42075 44868 48732 55609 48665 46685 45052 34009 33441 30918 20519 17608 21162 24060
19571 24060 25618 23652 18321 15313 10278 13158 25027 28002 38143 47111 48394 38242 30680 39463
19557 39463 46661 46422 45237 49985 53818 47049 52576 77227 84116 86333 86367 89132 85962 96173 104971
19542 104971 110882 128475 152816 173369 188848 206078 222508 248551 286543 315260 326137 339389
19530 339389 357418 372342 390593 396359 400570 399180 393511 410397 418465 400436 386530 378789 375448
19517 375448 362373 339102 327225 320246 285357 255937 232712 213531 197571 178099 149773 137514
19505 137514 140603 139001 149345 146383 148974 134652 131550 137911 155330 189266 214615 232544 233736
19492 233736 247316 271684 291048 330177 368585 389996 376834 367470 373982 405632 445664 457404
19480 457404 456158 455650 468298 465865 451927 441182 430639 423957 423997 413764 387891 363837 344746
19467 344746 323051 296122 287041 299391 285149 266167 260750 248733 234767 234343 234319 233336 240064
19454 240064 256050 275257 278980 289359 296546 302192 331350 348153 368237 384653 383935 409757
19442 409757 425011 446426 481959 517859 563231 610476 655573 703286 751746 818204 917559
19431 917559 1008993 1099686 1202050 1340731 1492596 1669745 1911891 2195799 2526745 2958992
19421 2958992 3528341 4332056 5503044 7162175 9014632 10370769 11272143 12361603 14193507
19412 14193507 17352532 21563098 24415738 24987699 25139974 26067649 28131840 31080983
19404 31080983 33219519 33046482 32322251 32813779 34305116 34574431 33042208 30705610 28533610
19395 28533610 27579984 28033613 27691140 25121238 21803132 18717953 16189217 14543809
19387 14543809 13310378 11766079 10040520 8402377 6927361 5684684 4738282 4044553
19379 4044553 3536415 3135865 2799232 2506469 2253030 2045804 1855539 1688967 1534251
19370 1534251 1394265 1287084 1184954 1091968 1007177 941711 892566 819200 748214 699477 676162
19359 676162 628416 577330 539647 507305 484132 459436 429817 418174 415583 389490 369096 372076
19347 372076 389223 401631 385872 373909 379739 389093 413270 431172 424373 423207 422428 437853 464946
19334 464946 496712 491758 466237 456960 459465 460404 441875 432585 414785 413914 404242 389541 354557
19321 354557 312926 275206 247368 249532 233459 216032 194993 168878 151228 152701 145715 134913
19309 134913 130492 128222 131070 134179 130437 135316 136932 134469 136586 145349 138824 140898 162229 176802
19295 176802 186090 198884 222324 239874 275866 299647 298457 308156 328870 346414 373186 394961
19283 394961 409967 418273 417081 410490 405170 393777 388226 382563 370004 373047 364203 334178 301656
19270 301656 275549 239245 210585 190940 172864 160844 148100 124524 112109 97889 80698
19259 80698 83260 105821 100575 80824 83030 98826 104128 112599 107041 89769 85090 91273 90340 72728
19245 72728 75146 94357 106253 101601 117776 131084 130704 114669 110918 108037 101184 102490 113163
19232 113163 106693 104887 114386 129246 151504 184738 211402 248271 271778 277884 274600 263038
19220 263038 260790 258402 262601 282811 271572 247843 225194 202266 194222 171431 140112 117734
19208 117734 100654 91010 82409 69381 60452 50609 24575 24622 45377 62195 56928 49006 64086
19195 64086 68417 59126 50209 58178 45519 40548 51404 67688 78880 74876 78011 85710 89499
19182 89499 95738 89329 80245 62199 54864 55027 48987 43656 33504 38240 58289 55049 44110 40783
19168 40783 35502 36521 16038 22174 22909 24097 23700 30727 32722 33547 54863 56387 57654 62952 61271
19153 61271 56193 52532 49637 50621 55355 59476 48966 44633 56098 67181 68648 71217 73144 82038
19139 82038 95032 100262 99171 110397 133759 157790 172228 195055 227055 249691 298884 343349
19127 343349 359246 376982 387832 408807 431921 429194 411390 397580 373076 347114 339038 320947
19115 320947 299919 260364 218248 186722 162595 148159 134761 115801 100972 91640 87986 74661
19103 74661 67096 61185 42341 47577 66440 83246 83958 72384 78086 78825 63409 41504 43497
19090 43497 42478 43566 46381 48034 47784 40453 46432 44514 57385 60737 55194 55192 71939 72124 70818
19075 70818 89588 109365 122151 133158 141645 166840 166885 168424 170381 169254 161588 155882 154440 154530
19061 154530 139100 118404 99130 74705 60008 58591 59751 51642 56200 71937 92380 79510
19049 79510 64097 46793 19837 29174 32657 33135 33674 38117 24947 27028 28206 32012 37161 34382
19035 34382 39868 39640 34995 30548 36981 31057 20133 20720 36002 51234 59028 64217 61047 52645
19021 52645 46054 36109 25356 16280 32711 38415 39743 41117 48882 45358 32275 33886 45975
19008 45975 46789 35063 34100 52430 52052 42886 35331 33061 31477 49379 56258 48636 62016 73064
18994 73064 69030 53251 32762 16271 21399 18832 30864 32357 35203 30383 35365 42263 50337
18981 50337 44625 43740 46979 42190 22538 32391 44460 40761 49556 50460 63001 63167 47040 39430
18967 39430 42456 46855 38020 16073 24200 33845 35074 38208 48491 48033 51894 43355 38965 48903
18953 48903 58563 76331 92891 100215 83269 74584 69265 60466 47514 41192 39401 39234 36720 39912
18939 39912 38979 25254 20421 22193 32043 33600 31318 29472 31096 37696 39016 42964 41566 44930
18925 44930 33673 30269 22809 22129 24445 28563 24584 23040 21628 17397 17174 40602 47168 34729
18911 34729 33563 45072 54904 63438 52985 45085 44166 30810 16268 27223 24676 31571 50359
18898 50359 57401 57495 65071 73031 67137 64034 58301 64974 64744 60257 57213 57248 65784 67274 49347
18883 49347 59311 66277 62550 68329 81756 88257 84690 91680 90727 94850 83847 62779 51222 42138
18869 42138 46809 74803 92757 89055 85703 83417 81216 90328 91343 79816 63955 68798 73856
18856 73856 78392 82492 84528 70684 72001 75355 73832 79295 87268 98595 104742 94665 81301
18843 81301 82048 104004 126333 146254 144122 153474 161876 166529 181492 177275 178199 192095 218236
18830 218236 229480 238787 239227 233610 234725 234980 237169 248542 232648 214165 196415 191081 207855
18817 207855 221798 212310 198038 186367 170989 162351 171128 162583 129295 105048 106997 110808 103629
18804 103629 104551 112412 108784 96857 100780 115205 132918 135106 124167 118618 115584 109530 105417
18791 105417 111412 104861 115970 130513 143947 141843 143791 141657 128129 128470 132074 137202 151373
18778 151373 166505 170260 177599 196290 207610 205502 217455 220513 232626 225311 229646 237572 263101
18765 263101 306917 337274 313131 286375 250532 232603 209207 203055 195797 197216 181305 156815
18753 156815 153705 159113 171031 176443 176937 174477 190558 199955 208399 220326 243349 262003 301022
18740 301022 336738 383504 471677 585791 649553 642708 602553 567405 552343 571091 630772
18729 630772 711333 760960 725634 636112 555288 465095 400529 355104 329347 310144 306987 314346
18717 314346 318920 310542 292101 283128 303082 327242 348729 377615 411925 426898 424462 410229
18705 410229 407595 398908 399351 420806 451822 482158 487752 469100 458049 433657 417148 409836 412344
18692 412344 410535 406943 427411 457048 490151 541599 592521 642449 653458 672619 678223 668357
18680 668357 674709 704563 759160 812371 854731 880967 905533 958960 1019024 1082177 1141610 1196774
18668 1196774 1240332 1306108 1394391 1486792 1567194 1615700 1641567 1650605 1658490 1677180 1711926 1738829
18656 1738829 1783630 1831098 1893293 1993408 2130070 2288694 2467478 2672964 2944480 3311457
18646 3311457 3749096 4249951 4878289 5697804 6759230 8199281 10213166 13092459 17292984
18637 17292984 23342672 31278254 39282580 44049553 44366117 42011420 39310213 38041455
18629 38041455 39640535 44374507 49701247 51393989 47965985 41386821 33789721 26508757
18621 26508757 20496353 16085365 13023661 10915244 9433896 8430247 7758831 7324106
18613 7324106 7094713 7104490 7395593 8058137 9219676 10941099 13082506 15370788 17367086
18604 17367086 19142842 20928023 22823578 24581879 25611193 25654043 24796746 23508964
18596 23508964 22103340 20677846 18914339 16734852 14376345 12047711 10033560 8404482
18588 8404482 7131426 6168821 5452182 4913917 4486168 4140671 3883543 3674028 3456497
18579 3456497 3233059 3031816 2871415 2737399 2612031 2513797 2424606 2329186 2229482 2131719
18569 2131719 2059834 2020545 1983610 1964101 1958728 1952065 1960394 1987490 2056640 2173792 2321983
18558 2321983 2514054 2744680 3019552 3411529 3954134 4674225 5631808 7022372 8977542
18549 8977542 11429603 14190265 16902749 19379809 21891301 24561964 27229402 29184252
18541 29184252 29940122 29557233 28588166 27572705 26644330 25429013 23491468 21082892 18542581
18532 18542581 16317730 14767486 14071047 14358678 15774224 18634134 23431960 30050373
18524 30050373 36347733 39843670 40940972 41984888 43640898 44792216 45351319 46208509
18516 46208509 46431065 44382149 41044460 38471889 36698566 34011536 29692588 24701279
18508 24701279 19915823 15719824 12419051 10082925 8469558 7298206 6406744 5712715
18500 5712715 5170485 4724880 4353498 4068364 3825800 3617971 3405153 3205875 3036893
18491 3036893 2891934 2737915 2566916 2402011 2264746 2119348 1968061 1837554 1728677
18482 1728677 1617099 1504116 1388407 1284813 1184786 1082557 975282 901624 831879 776800
18472 776800 728275 681198 661978 645920 615606 576450 548242 529015 498374 467290 433040
18461 433040 417315 404224 399573 388112 362402 342154 329519 312756 295934 284013 269863 249787
18449 249787 254832 272539 281184 279054 290909 303763 327612 359869 386048 408531 412867 417148
18437 417148 393922 369051 340004 334679 347131 356808 351452 343337 332985 336913 338815 312301 291963
18424 291963 287484 280080 262196 232016 204606 201976 196054 182123 183775 171081 169162 163771 144725
18411 144725 128362 136140 136245 130914 125951 124839 119360 119115 130107 132506 129343 136408 146217 151124
18397 151124 146670 152930 137699 127881 129678 144210 151129 149960 148971 150666 151313 150064 140756 145268
18383 145268 162989 175719 185450 181067 182402 182092 182877 176677 181155 163640 161207 164450 167100 167203
18369 167203 161124 158548 140497 146635 139027 124742 117416 94061 90791 119107 130510 131361 142142
18356 142142 140300 143644 135847 136942 135680 124825 120119 114024 105847 111514 109426 111742 113001 106528
18342 106528 102103 100329 77973 71735 77456 70900 62360 52783 54006 65590 77211 86819 87018 86557
18328 86557 87861 91610 86637 75590 67041 68672 73359 82835 90596 102681 96948 83753 77949 75966
18314 75966 76104 74168 58978 49440 55427 54893 58941 60365 43310 40985 63012 66773 37813 31787
18300 31787 27809 32083 31466 47190 49874 34513 31993 53113 66535 58802 64678 67021 45204
18287 45204 43090 32677 24084 32931 27895 22355 27466 25727 13476 7242 33741 54437 53542 44940
18273 44940 39945 40253 43853 42141 50638 46978 42145 46619 34448 29773 27514 25475 22710 29495
18259 29495 58126 55435 45729 33111 27649 42479 49043 44391 43403 42417 44918 46714 39458 42936
18245 42936 39902 42973 43966 35945 35730 44850 53727 42046 25455 25910 36249 55691 54625 49118
18231 49118 51685 45237 32880 28011 15318 23812 29954 35463 42185 43746 44816 41808 35135 29723
18217 29723 44323 47812 47921 52557 47861 48232 40937 39527 35736 37583 44781 38727 40937 37341 53085
18202 53085 46035 25663 43684 53567 47084 42868 47475 25328 15454 26975 24788 25881 38869
18189 38869 36408 29000 50958 58478 55020 57053 56820 57370 62913 67970 62502 51909 59654 65237
18175 65237 62149 62493 60555 41103 30363 27448 32599 18571 10283 25742 33195 27928 23745 39246
18161 39246 47010 33401 25704 32799 28860 29150 50477 71176 65609 55631 70915 89494 90844
18148 90844 81061 77990 75630 78759 77991 85910 89968 101244 108506 124395 122050 120996 119694 126239
18134 126239 138333 157064 159140 155561 170776 194423 233595 248554 263423 292416 321872 346360
18122 346360 387772 416114 452809 537393 625057 726771 864931 1022683 1237952 1563574
18112 1563574 2037385 2711726 3735038 5458309 8599071 14933863 23865769 24793150 20246784
18103 20246784 15990791 11451163 7361405 4784627 3383132 2574125 2060684 1707852
18095 1707852 1452559 1267243 1111074 960146 841289 748379 658273 582043 525386 483011
18085 483011 455411 440515 424785 396474 367437 341610 322892 312238 304076 309716 316389 301085
18073 301085 274252 257273 251381 236079 231916 227230 211731 198787 195688 188938 168460 154331
18061 154331 145330 139100 140314 125428 110044 102324 111512 108059 109195 113446 107315 117368 127082
18048 127082 128128 127049 124917 127367 120196 113418 124643 161734 192446 229224 290274 323031 339261
18035 339261 342871 336039 315043 300251 309001 329456 345578 346128 341416 311839 266060 245664 229861
18022 229861 224768 237987 250161 253012 246170 254011 271711 284443 288871 296775 285891 283223 288868
18009 288868 293320 265571 260370 248219 229435 217350 210830 193267 164624 154859 144193 131785
17997 131785 146994 152005 161275 177444 192319 207229 212503 239006 262438 285148 319801 361367
17985 361367 385486 405060 408280 391516 384171 391319 414386 429217 449949 490100 545166 577465
17973 577465 604206 624097 610644 586232 574330 578335 594223 600090 619619 641248 669123 703192
17961 703192 720298 747732 785421 805580 824556 840597 877803 907775 941749 956593 989780
17950 989780 1035989 1117269 1236675 1396530 1578177 1791401 2071771 2437633 2934987 3635879
17940 3635879 4693786 6348927 8858000 12255235 16229391 20166072 23040747 23928543
17932 23928543 22932003 20728789 18039233 15804561 14769744 15255304 17137792 19909304
17924 19909304 22728945 24467078 24248236 22218349 19006849 15311731 11868870 9121504
17916 9121504 7117321 5768663 4898937 4316247 3860456 3488212 3160514 2855858 2596509
17907 2596509 2391253 2238297 2136505 2047421 1984709 1921409 1838849 1754057 1661916 1580528 1500941
17896 1500941 1443536 1398312 1380133 1370580 1376459 1401167 1431006 1492773 1598033 1733777 1913886
17885 1913886 2133410 2445098 2896327 3596267 4684075 6398150 8875459 11979989 15358923
17876 15358923 18338098 19987097 19911611 18504158 16355201 14153448 12699047 12465661
17868 12465661 13476578 15463597 17890451 19898921 20518183 19459527 17146654 14105957
17860 14105957 10975802 8308478 6279707 4855641 3904799 3285551 2861200 2534574 2252565
17851 2252565 1990312 1750244 1553955 1396756 1260173 1153086 1094822 1052641 988631 914507
17841 914507 843776 756458 669994 609115 572597 545749 510553 488945 471518 432806 397047
17830 397047 379052 339265 286474 261095 258215 246290 232695 219122 201463 178893 162614 168305
17818 168305 174245 169828 156711 137551 134612 133977 136710 126334 124409 118743 115486 110456 99531
17805 99531 82724 84153 79911 56993 60625 73760 89026 92905 74570 62481 64289 54139 35592
17792 35592 25316 45587 48887 54165 61208 55502 53850 65648 61392 49028 24437 24069 36839
17779 36839 27878 46883 68245 74747 57607 48468 22671 21254 30823 46560 41264 39369 48915
17766 48915 59085 50825 38215 32000 28288 21538 27512 23663 13600 11893 9819 14052 22542 34839
17752 34839 38421 36754 35010 36446 24434 17375 4392 2059 6965 13993 12010 13084 22567 17005
17738 17005 3608 5146 11128 7511 3912 261 -3869 -2698 1818 11353 17833 -3754 -16213 -11264
17724 -11264 -265 4763 -9500 -8231 10795 19817 27641 32343 41405 46867 45868 33862 23450
17711 23450 22020 32623 32097 33740 36181 37626 28162 19514 7148 2798 -2941 -8153 1036 5341
17697 5341 2132 5763 9195 14385 12614 10335 8132 3190 3946 1792 3280 4576 1848 9464 17439
17682 17439 15748 9284 10456 13899 5325 6102 11087 13759 4725 -12590 -10851 -14039 -7245 -1111
17668 -1111 -17131 -31750 -28008 -21156 -18595 -25708 -19607 -16467 -4504 -6885 -6454 -10672 -18957 -23436
17654 -23436 -14596 -12684 -5515 -7694 1322 3340 -4092 -2205 -501 629 9009 16490 16340 13790 5895
17639 5895 2484 2550 6079 6508 8925 15648 11545 10065 -627 -7236 2396 4194 4682 10604 15784
17624 15784 10522 8110 555 -461 -3809 -12515 -24387 -20916 3907 12888 14939 12495 15072 6996
17610 6996 4088 2583 13913 6360 -3779 -7492 -8165 -16789 -28719 -22415 -21872 -23585 -25076 -16001
17596 -16001 -9016 -8582 -16568 -15746 -15846 -22773 -7891 1209 -11521 -15597 -7928 -6441 -12988 -20233 -22629
17581 -22629 -22219 -21971 -13915 -19187 -43935 -52743 -37601 -16600 -4977 -11346 -13445 -4817 6128 928
17567 928 -15655 -14165 2310 13234 826 -11998 -14432 -4504 -10192 -13327 -8978 -11916 -12088 -2193
17553 -2193 8007 7532 -9188 -23220 -15698 -12930 -1964 10468 2479 -2453 2621 9458 3443 5091
17539 5091 3539 5967 -2296 -17925 -13286 -16730 -25522 -34723 -36656 -28978 -18454 -3920 -1170 -4287
17525 -4287 -7186 -6767 -13076 -18987 -7465 -25047 -31647 -25845 -19680 -21360 -23287 -29141 -28893 -16944
17511 -16944 -10723 -25013 -30720 -28243 -24121 -6821 -8088 -9189 -2374 825 621 505 3001 7985
17497 7985 12661 38 -4117 -7254 1733 4001 6058 3360 -3299 -2165 9887 -2019 -16944 -8983
17483 -8983 -9500 -9410 -11179 -22247 -18001 -9787 -12218 -9484 638 -3851 -9728 -14992 -19433 -6016 1090
17468 1090 -1093 1540 -1269 -14622 -27643 -26718 -12356 -4310 -1960 -3405 -12288 -15039 -16712 -28160
17454 -28160 -25499 -12566 -9592 4211 16489 27252 37819 21168 14994 17052 19945 12772 29070
17441 29070 56398 104248 146834 138302 127624 99394 63918 34636 20781 33996 39226 41741
17429 41741 47480 40850 23525 22532 40087 34591 39178 32687 40583 64829 90790 122014 120515
17416 120515 118938 121836 107394 94567 87794 83126 91321 87538 93425 107107 115363 115601 103576
17403 103576 96761 74967 56425 42069 30959 21433 18061 20199 17268 16635 16065 20319 22538 27964
17389 27964 29777 23374 20816 17787 14836 6873 12751 1082 -5555 -5468 -5013 2194 -24 -1379 -3878
17374 -3878 -2316 471 8843 350 -5614 -1467 -9546 -7823 -10568 -730 15074 34281 68006 97137
17360 97137 96814 86023 97872 95649 90578 78249 67837 60878 56062 65969 97096 115229 118934
17347 118934 123481 126581 101456 74089 50048 40399 33443 24510 23775 11073 15459 15177 12077 8439
17333 8439 -4533 -4406 -2399 2374 -494 -17722 -33397 -39900 -29296 -21908 -30155 -31334 -32104 -34988
17319 -34988 -41339 -32481 -18751 -17585 -6213 8128 -11219 -16831 -14438 -19885 -17062 -19146 -16484
17306 -16484 -11540 -10275 -7903 -3824 -4755 -836 -1168 -18542 -30883 -17472 8178 17565 11334 13299
17292 13299 18133 -2553 -3595 1414 4185 -2498 -4306 -6975 1778 -1011 1627 4892 -11000 -14171
17278 -14171 793 5750 -8040 -25781 -12715 342 -2654 689 -4434 -3634 -7904 -11921 6598
17265 6598 -579 -16088 -22692 -27893 -5878 6400 -3437 -21875 -42685 -37005 -35337 -31102 -25912
17252 -25912 -29693 -36320 -43013 -47448 -43824 -40980 -35618 -37752 -36377 -38509 -29987 -22742 -25223 -21928
17238 -21928 -14509 -5501 4623 9538 -10163 -14437 -22848 -32922 -40311 -40695 -29820 -15595 -8375
17225 -8375 -12060 -9442 -16710 -23975 -27169 -20476 -8013 4200 5790 5302 12398 9937 8335 3536
17211 3536 -361 -16770 -19706 -12024 -14753 -22363 -16771 -3146 3400 5136 7189 14497 4076 -5198
17197 -5198 -3237 14518 14768 -2122 -9960 -19962 -24720 -26527 -24947 -14445 -10931 -15577 -7021 -11155
17183 -11155 -31612 -42336 -54695 -51398 -29948 -20057 -21020 -17816 -17432 -19443 -21304 -15343 -11772 -27458
17169 -27458 -27203 -34712 -30549 -23673 -15553 -25492 -26826 -14105 -1815 3691 5199 -1271 -8243 -11386
17155 -11386 -25981 -24951 -29347 -29773 -25218 -25083 -31532 -31045 -30051 -23907 -9526 -7753 -7494 -8519 -11355
17140 -11355 -15664 -8574 -4018 -8944 -18221 -22225 -14076 -1437 8192 4240 2060 -2383 -9755 -9919
17126 -9919 -5470 2465 6975 1507 -8325 -14421 -13853 -26229 -29183 -28840 -18158 -6180 -12910 -14482
17112 -14482 -20873 -30226 -19987 -13586 -15952 -21755 -29094 -29060 -18568 -12378 -16052 -23261 -30255 -19952
17098 -19952 -18576 -14606 -13076 -3727 -5786 -2009 -10740 -11186 -9509 -9979 -878 4342 10188 13885 8995
17083 8995 -4055 -4745 -3439 -14074 -23967 -21817 -24947 -21359 -25537 -28554 -7807 1527 -6614 -11929
17069 -11929 -10515 5653 18271 -8325 -12768 -4457 -17759 -23010 -16542 -16245 -17141 -28146 -16489
17056 -16489 -7172 -2552 -7118 -14223 -17973 -15099 -17624 -13836 -10180 3221 13526 2276 -15671
17043 -15671 -14977 -9671 -1434 -1050 8054 10199 10451 -1759 -19261 -15538 -7310 -8830 -32613 -35433
17029 -35433 -16812 -6323 -15997 -22121 -16131 -6528 -6932 -2486 -1987 -12839 -16129 -10410 -9325 -6844
17015 -6844 -7444 -9195 -13708 -25843 -16878 -17963 -21520 -25924 -16388 -13200 -6316 -6962 -19482 -12113 4356
17000 4356 16438 28668 18062 4074 -6613 -17474 -7289 -8242 -17771 -16566 -10705 -7899 3535
16987 3535 5189 8810 2341 -3994 -4699 -5341 -14935 -4509 7459 13804 -357 -14184 -2402 -12690
16973 -12690 -14096 -16441 -13044 -6555 -7313 -12554 -15444 -24163 -23553 -12345 -8258 -4647 -16950 -30228
16959 -30228 -29109 -11852 4626 5697 -3351 -30518 -35130 -33322 -20545 -26374 -25200 -957 14770
16946 14770 -1525 48 -6096 -16854 -16327 -2034 -540 2469 4443 -948 -10835 -12293 -10437 -8209
16932 -8209 -9476 -5420 -853 484 -11467 -14535 -10006 -12700 -18057 -13738 -12262 -17721 -30079 -27664
16918 -27664 -35038 -37734 -42200 -41706 -27851 -16257 -16904 -14424 -16923 -16632 -20808 -23952 -23776 -28016 -33482
16903 -33482 -22355 -17730 -20863 -9217 -3354 -6493 -4856 -3850 -19776 -32337 -27402 -24182 -14042
16890 -14042 478 -2880 -11764 -20722 -37882 -23944 -9449 -14983 -19470 -17413 -14553 -19743 -25014
16877 -25014 -24363 -10485 -16962 1508 2144 -15915 -31849 -25032 -12636 -2705 -6344 -18973 -9886
16864 -9886 -1337 -8054 -11408 -10193 4369 6967 17059 24910 30040 29557 10811 -5407 -13950 -8520
16850 -8520 6907 10382 -691 -576 9180 6202 1085 -15620 -24083 -19131 -17655 -1478 16189 9004
16836 9004 350 -4395 -3768 106 12641 13959 -2884 -13976 -8431 -1653 883 2107 1113 3297
16822 3297 -2266 3520 -14227 -16934 -22715 -30687 -26098 -28609 -20140 -10425 3051 11477 21002 34984
16808 34984 11469 -810 -4228 1821 -9612 -19217 -7630 -3976 -5435 -16495 -24227 -24844 -19318
16795 -19318 -19484 -22393 -29576 -26898 -17956 -4734 -7816 -18747 -23558 -20966 -18987 -16992 -16372 -18364
16781 -18364 -18193 -17381 -33030 -10800 311 -17296 -13311 -8886 -6588 5002 7632 6397 13901 11931
16767 11931 11282 14327 9680 6792 -15631 -31108 -19957 -20376 -15751 -300 -166 966 3373 -10887
16753 -10887 -3377 2969 -1654 -20777 -27126 -32833 -24837 -15441 -15662 -9483 -15140 -21266 -29260 -30083 -25345
16738 -25345 -21991 -8818 -2071 7761 6501 -6101 -10821 -15207 -19023 -24733 -27717 -24808 -29735 -26540
16724 -26540 -23775 -20566 -15026 -9955 -9968 -22526 -26287 -10163 -1327 1727 -6167 -11457 -2902 -14510
16710 -14510 -30002 -34227 -25701 -27956 -30220 -18763 -11032 -21822 -15539 -247 8088 -4858 -8590
16697 -8590 -9228 -10577 -15083 -15466 -30418 -29585 -4549 2322 7943 -956 -4403 -25846 -33022 -38130 -27370
16682 -27370 -17651 -18050 -26844 -15176 -5171 -2432 -17175 -31887 -31621 -14816 -11824 -19756 -16296 -13494
16668 -13494 -27893 -29485 -5315 -12250 -21263 -14895 -17156 -15940 -20223 -23384 -19863 -12223 -18783 -22631
16654 -22631 -12077 -5294 51 -3133 -7924 -5814 547 2543 -1054 410 9998 14828 -2213 -17514
16640 -17514 -29314 -37117 -28495 -18804 -2931 -672 -459 -6444 -16037 -20306 -21502 -18455 -25081 -33101
16626 -33101 -17855 -5476 -9808 -2443 79 1826 10994 7257 -2500 -227 378 -7495 -4673 249
16612 249 -18272 -27126 -12926 -3269 -3615 -19869 -25824 -31924 -27113 -6844 -7529 -3187 5279 4050
16598 4050 2408 3460 -6078 -13194 -8729 3135 -6221 -11518 -7038 -11460 -20474 -14391 -12014 -121
16584 -121 15811 7287 9366 4384 -13068 -20975 -30322 -31904 -20905 -9123 -7234 -5823 2678 5521
16570 5521 10370 9116 -4327 -18699 -21989 -10917 -6245 -10883 -24607 -11423 -8484 -24584 -11611
16557 -11611 -1532 -7002 -29771 -39066 -33207 -23290 -8664 -3341 -4684 -2530 -1373 1088 -1447 1175
16543 1175 -15796 -31909 -22530 -14457 -18403 -12267 5162 17135 10913 -773 -3380 -3846 -4254 -7532
16529 -7532 8335 -1855 -5428 2696 4246 -5883 -6010 -7081 5895 5108 -2057 205 -1734 -9445
16515 -9445 -11683 5639 -783 -11741 -22792 -16156 1511 8911 9037 2093 1413 -1082 1303 5894
16501 5894 1898 -5392 -3448 206 -6746 -8096 -16473 -12427 -19411 -15523 -24735 -25003 -27211 -29430 -26994
16486 -26994 -12357 2930 1936 -1862 -6764 -7257 -7991 -5570 -10297 -11290 -15534 -35958 -36696 -37366 -28164
16471 -28164 -27117 -25205 -17832 -15446 -1481 2042 -12165 -19341 -28576 -31624 -20265 -15710 -8602 -10218
16457 -10218 -6018 -2907 14346 10611 -3760 -11614 -12231 2995 15427 3284 2991 10229 7838 10437
16443 10437 6239 7284 -3539 -12753 -5631 6493 5843 3183 9232 5950 -2444 -5905 5888 4139
16429 4139 -2595 217 -1743 -8971 -12187 -15522 -5006 7846 5429 189 7756 8268 -8311 -21506
16415 -21506 -25616 -31876 -38898 -47579 -37532 -22653 -18582 -21058 -15747 -18773 -7936 -6216 3840
16402 3840 -5915 -16728 -12540 -3877 -6897 -3168 -2581 490 -455 -2909 -13758 -1329 -2218 2318 9045
16387 9045 2876 3571 14054 5041 7661 15341 9253 1119 -15662 -23590 -16400 -8873 -17266 -21724
16373 -21724 -15993 -15118 -12393 -11013 -5287 12172 9578 -13093 -19143 -4049 7455 13385 -1345
16360 -1345 -10208 -7084 -5766 -8067 -4964 1598 3272 -4519 -5397 -1685 2766 6774 -2792 -13141 -14143
16345 -14143 -18060 -25669 -22568 -8425 -4441 -126 1555 630 -7076 -1568 1824 1563 11266 1552 -15627
16330 -15627 -19915 -10221 -10007 -2461 -9581 -20916 -23944 -25230 -15493 -12396 -978 -6255 -13456 -15464
16316 -15464 666 -40 -21928 -24119 -19401 -15847 -21301 -31847 -20693 -11353 -12159 -9694 -20571 -32732
16302 -32732 -28152 -16452 -7435 -82 -5679 -4579 -98 -9147 -9502 -1960 331 -565 -3509 -11289 -18577
16287 -18577 -18522 -8642 -2603 -1690 -1429 -6473 -3117 -8767 -20234 -29241 -25078 -20555 -19901 -10657 -1278
16272 -1278 6136 9833 12563 9264 3841 -1659 -7392 -4644 180 -5719 3960 15117 18929 20713
16258 20713 18272 18478 8508 -8781 -30280 -36616 -19643 -6497 -11286 -18294 -17557 -16116 -22354 -20540
16244 -20540 -13967 -14631 -8944 -2570 -4249 -9145 -14906 -22372 -22628 -12320 -8402 -6314 -10892 -17235 -15470
16229 -15470 -5175 -4785 -4900 -4503 -6044 -11764 4900 16362 20220 21011 13771 212 433 3772 6472
16214 6472 -5910 -18173 -22878 -30673 -17699 -6357 -117 2140 22358 34693 21214 6106 4194
16201 4194 9981 5262 -5533 1671 -3891 -6599 -8490 -3867 5880 16615 18145 16722 15668 11141
16187 11141 1683 3751 7162 -2139 -3111 -1898 -9473 -16736 -8709 -7895 4383 6300 596 -4651 -12011
16172 -12011 -18798 -10210 -9910 -12196 -10460 -12379 -4470 20041 7997 -15522 -25454 -16838 -3573 2456
16158 2456 -5155 -7131 1793 -1911 -911 1364 1782 -7663 -13592 -16019 -20949 -11805 -9742 -22292 -18771
16143 -18771 -5014 -2194 -4605 -4262 -3367 -8551 -11326 4143 2017 2473 -3628 2003 -2369 -4818 -8914
16128 -8914 -11016 -11924 -8161 3531 -7187 3787 20009 6594 4766 3874 8359 -8679 -10966 -8999
16114 -8999 -13697 -16188 -13943 -13687 -16357 -16721 -22076 -25586 -16812 -9097 -16849 -16679 -18409 -3918 3974
16099 3974 1347 4179 11184 14160 -866 -13245 -6336 344 1603 13773 21155 12385 -3499 -11291
16085 -11291 -13339 -10321 -11974 -10551 -11091 -12082 -11427 -22833 -22557 -5581 6741 9462 -6086 -14990
16071 -14990 -18513 -1469 3522 8321 1463 -11521 -17407 -15871 -6677 1486 1706 -1182 -7466 -10390
16057 -10390 -17356 -12286 -2720 16224 12013 6783 -5664 -20201 -16053 -9118 -10301 -17996 -5627
16044 -5627 -14322 -8028 6173 -8693 -11236 -8389 -18451 -20044 -11984 -3486 13462 15300 -329
16031 -329 -3561 9135 16012 24645 11547 -9322 -12076 -4492 -8900 -25935 -15559 -6006 2874 3784
16017 3784 -10377 -29572 -30042 -20220 -10318 -4843 -683 -4502 5327 27961 29033 21619 13691 5579
16003 5579 5847 2698 -11421 -24593 -26793 -19513 -15202 -6637 -14582 -20744 -10719 -12905 -16390 -26190
15989 -26190 -28823 -18787 -22283 -28772 -22960 -18117 -15874 -24972 -1672 5946 9528 15417 10341 9315
15975 9315 2244 -626 -933 8518 5061 -5490 -2164 -2871 -13876 -29324 -27980 -20495 -14083 829
15961 829 1017 1394 8591 17380 11082 10226 9658 9023 554 -380 9883 10768 1872 7473 20117 22817
15945 22817 9176 -494 -10989 -11809 -4627 1540 -3973 -9010 -8144 5413 16364 7652 -16646 -18817
15931 -18817 -4387 -5245 -3895 1235 -8314 618 -1142 -541 10926 9060 -334 8797 16117 14977
15917 14977 17668 6610 -4260 658 4708 2559 4030 -1444 -9609 -21187 -19650 -27316 -21565 -18258
15903 -18258 -31230 -31089 -26184 -20675 -18534 -9999 1211 -6154 -10944 -6994 -3433 10548 12111 10212
15889 10212 -1783 4261 15523 22088 21940 -2090 -12708 -11944 -913 1117 -3491 -11168 -11559 -2149
15875 -2149 3116 12043 638 -4629 3498 10243 2272 -9732 -4762 -3986 -2289 -676 -5226 -611
15861 -611 16639 16960 -483 -11555 -17295 -22158 -20288 -17773 -14761 -5072 -2395 -2876 -981 3625 4082
15846 4082 6210 1113 -727 10282 6004 7325 9182 3403 11440 20895 21059 7117 -2948 7779
15832 7779 6264 9022 15705 18058 3514 -21016 -18710 -10567 12430 34714 21342 5073 8779
15819 8779 1066 -15980 -20400 -21288 -12855 -4389 -1067 -10552 -14190 -12182 -13002 -15164 -9493 3615 6312
15804 6312 3963 21671 35571 23846 3982 -2150 -1936 950 -6713 -8595 -8356 -11102 -12717 -5156
15790 -5156 -11223 -22487 -34020 -25847 -16113 -3925 -3368 -9757 -9988 -14303 -14357 -3074 -5012 1208 -8822
15775 -8822 -6807 -228 21789 28004 15621 16276 18008 12486 2571 -1262 4515 12816 4537 -18754
15761 -18754 -21240 -16033 -8118 -10940 -12429 -10289 -16071 -18036 -20480 -29860 -29732 -21051 -12607 8079
15747 8079 15931 14926 -5434 -20811 -22539 -19352 -11599 -20766 -28641 -21439 -21866 -27433 -14347 1534
15733 1534 6176 -942 -9621 -11618 89 1847 7406 499 -4352 265 13081 11520 1854 -15632
15719 -15632 -17051 -3049 1832 696 -47 2731 10260 3878 -17905 -15116 564 13011 9379 -2176
15705 -2176 -12142 -29521 -16916 9310 12637 13735 22165 14794 9893 11622 5186 -3650 -4845 -9857
15691 -9857 -4044 -2135 -339 1775 -5044 -8391 -4114 -9387 -34435 -36721 -26323 -18574 -12069 -3826
15677 -3826 -4558 1313 1030 -8719 -22039 -20784 -21850 -24624 -9622 4210 23953 28918 23471 -485
15663 -485 -4443 -744 -12427 -16800 -13467 -6788 0 4690 -3142 -8425 -4333 -1629 -3658 2250 7402
15648 7402 11471 5676 867 -4260 -14489 8571 15631 25151 36369 27793 35580 36219 30521 21733
15634 21733 22290 18749 26399 29482 33825 28477 12688 -5518 -755 1405 3039 5759 1313 7573
15620 7573 8658 6745 -2790 7089 20346 18778 529 4735 14198 14960 10818 12113 10397 21654
15606 21654 23775 17730 16248 24913 34383 40692 35116 39911 44841 23848 10678 3538 -5735 -9981
15592 -9981 -9179 -9328 4660 9158 -4491 6341 6688 10354 8977 16495 18761 13785 20579 7611
15578 7611 4040 13757 19648 20319 18500 29829 31340 29300 29414 29000 19215 14465 17018 18413 21695
15563 21695 20880 27513 29792 17543 11330 11090 16810 14579 6995 12285 29435 31640 29643 37331
15549 37331 43685 65043 67877 54684 43404 37521 39617 49311 48027 38027 56268 56315 54302 44976
15535 44976 38281 30459 17461 34216 55346 50175 56700 53244 42590 32272 22643 27390 33754
15522 33754 35541 39057 44839 54377 43669 32719 29849 31927 50430 54298 60343 68253 62439 58353
15508 58353 63134 56898 42011 32859 28417 25638 27501 32026 33832 38295 46144 37658 36515 30881
15494 30881 35036 36315 32652 30350 37759 48859 36255 28516 22104 23537 35710 42496 35586 28490
15480 28490 15033 20411 39680 31087 8671 -11293 3168 22522 29265 28339 23491 15131 26572
15467 26572 29653 24814 26570 27375 39191 34634 16870 -746 20619 41722 34919 18381 16396
15454 16396 2790 2776 7120 -8791 -11989 -6200 -7623 5539 7726 -1480 -6649 6527 3212 -5357
15440 -5357 -13406 -1253 7274 12203 3275 -1481 23308 36364 32749 27084 23303 24630 30019 31106
15426 31106 24146 10105 8913 10501 14318 9132 10422 8087 -4290 -6344 6722 9513 7061 938
15412 938 -9904 -6825 2249 59 -315 -2878 2909 -5662 -2725 2635 -4198 -1365 -447 -1494 -4452
15397 -4452 6510 8384 905 -9798 -14991 -11074 -4682 2668 6183 -91 -2393 -4177 -1964 -9409
15383 -9409 -12451 -12685 -4659 -190 -3163 -14636 -10306 -12063 -10157 8941 18357 13714 7568 9290
15369 9290 -5900 -19505 -4117 11878 13082 9243 20540 13920 5579 2698 9014 13032 8042
15356 8042 3054 -4473 -11896 -4755 -3053 -6560 -8522 9213 15487 29721 22835 29949 29744 21609
15342 21609 5491 9507 15221 16936 16744 21184 10508 12860 4360 10275 14657 9222 16369 15598
15328 15598 3012 -7094 4993 4459 -878 -2505 -9780 -1304 -3433 -21314 -23829 -16590 -13306 -17904
15314 -17904 -28939 -26957 -24997 -20609 -18084 -12303 -19048 -16224 2269 15824 6852 -3913 -12532
15301 -12532 -17746 -4408 -4710 -14959 -24938 -31548 -25331 -15830 -5049 -1202 7365 -4148 -10853 -7066
15287 -7066 -2009 -6675 -7236 -181 9407 16402 8676 -2140 5467 7702 12606 5462 -11744 -19327
15273 -19327 -25566 -13633 -9177 -10958 -9545 -2982 3867 8207 -4040 801 4117 3999 8050 7824
15259 7824 -2471 815 -124 -12693 -22282 -19285 -18535 -4001 5608 -6961 -8929 -12758 -15872 -11818
15245 -11818 -908 9805 11492 -15857 -17376 -8798 -19568 -24054 -20490 -20558 -17881 -15815 -21041 -7397
15231 -7397 8472 700 -11291 -18802 -5396 2699 14454 23506 22302 14056 5717 -2223 1778 6537
15217 6537 13408 5845 3091 14650 24997 7994 -5632 -10130 -11778 -10047 -2051 -2864 -11279 -16421
15203 -16421 -6721 11320 6334 -5717 -2516 -15696 -21348 -17143 -12759 -10534 -4479 -10323 -12740 -12089
15189 -12089 -10472 1822 3244 5993 -5887 2246 5927 16150 22737 21651 16237 10344 8024 3898
15175 3898 -2069 -19228 -20632 -18231 -14092 -15579 -5944 1217 -3575 -4584 -7654 -3296 8240 15096
15161 15096 6916 1773 4615 10286 5587 -5836 -4924 -1452 9128 17946 7562 1348 2995 7278
15147 7278 -10092 -10459 1975 8030 14589 3619 -12054 -9555 6685 4680 3642 8934 3043 -11263
15133 -11263 -7132 -16037 -21385 -2823 -1920 1434 11554 6938 6871 374 1239 12803 10989 11744 16402
15118 16402 29391 16077 -9975 -25287 -28122 -23241 -17924 -1644 3849 -10423 -16774 -29832 -25845
15105 -25845 -11851 -9235 -9201 -13229 -18393 -15768 -13696 -20257 -28955 -27736 -17515 -20330 -36146 -33249
15091 -33249 -18457 -3727 10441 17964 10700 10315 1971 14858 11413 21829 32974 14367 1130
15078 1130 -1570 12502 20387 21442 10054 6039 1536 3930 12636 28873 35656 35637 25602 11148
15064 11148 2099 15849 7653 3619 1528 3525 4165 3568 -9255 -4814 -6179 -25109 -24899 -14799
15050 -14799 -1621 2780 -7502 2362 1073 3639 5763 2371 3536 3324 200 -7342 -11845 -2870
15036 -2870 838 4041 13476 4067 -3125 16015 27024 26619 33429 22163 9575 -5248 -5801 743
15022 743 -1303 10044 17716 16844 11452 -3816 -1983 14855 20450 19762 9237 -5341 -6534 -2919
15008 -2919 6744 -4172 -12734 -3846 18716 22865 7362 -3465 -10137 -15493 -16358 -30472 -22436 -22016
14994 -22016 -19294 -26282 -28812 -16276 -2506 5172 19865 13374 12266 10639 -10993 -23840 -22187
14981 -22187 -12578 -6128 -8034 -4203 -3370 -996 3049 -44 746 8734 6435 14227 27850 38357
14967 38357 36156 22601 22626 30572 30208 22112 13260 -1962 -8080 -1695 5858 604 -9027 -22632
14953 -22632 -26979 -17593 -9878 -10260 -616 11731 13433 6606 -6901 -14069 -11916 -18489 -16522 5175
14939 5175 18870 10734 6720 14357 11280 17508 16314 6090 -787 -8136 -4432 6253 5978 -4539
14925 -4539 -8135 -5598 -8101 -9506 -22489 -25113 -22891 -25329 -18676 -15292 -16610 -8588 -2159 -15451
14911 -15451 -21848 -12569 -2856 -2020 -12894 -16917 -7828 -12026 -23779 -26104 -28220 -26022 -24513 -19482
14897 -19482 -11935 -8899 326 2569 2651 11141 10837 -10737 -5420 8567 16938 23113 11357 15613
14883 15613 15642 -667 -6534 -13716 -12826 -4498 4369 11794 5879 7919 5653 -13456 -21351 -16481 -11349
14868 -11349 -3939 -3206 663 9372 15564 3635 -15257 -23867 -12231 2388 4911 -4672 -8007 -2412
14854 -2412 3695 -8383 -8861 -23693 -22765 -19148 -20033 -23175 -24151 -17510 -3171 -3237 -10799 -737 2630
14839 2630 1780 4783 3962 -4303 5967 10861 17184 7426 -7433 -8139 -3211 -15606 -21737 -5839
14825 -5839 3955 -3332 -5796 788 -2687 -13024 -2031 6423 278 -8021 2913 7296 639 -1613
14811 -1613 -8237 -9792 -2089 -8822 -5544 12988 19894 17012 9125 13178 17678 15744 14566 -3320
14797 -3320 922 -11902 -11648 -12224 -9950 -2458 12896 9971 3119 -7087 -4012 13860 22070 18988
14783 18988 5081 -211 5009 -16 3751 15559 1192 -160 1729 9570 20936 12523 -11617
14770 -11617 -14059 -20764 -9455 14280 13646 1477 3555 -3053 -3186 -1431 3227 2595 133 -2726
14756 -2726 4483 19922 18387 21985 22451 13872 8503 -5207 -12501 -18988 -14425 -9753 -23800 -16482
14742 -16482 6574 20167 99 -13077 -17399 -13051 -6327 2782 8191 -1970 -1276 -699 -14528
14729 -14528 -7090 874 -5772 3652 8863 19201 17957 7183 -1386 -10950 -2023 -1904 -1147 5501
14715 5501 7952 8054 -571 5442 3259 -5424 -4741 -20936 -35008 -34309 -30489 -20943 -17850 -27754 -18683
14700 -18683 -16326 -22811 -7414 6785 1854 1828 -4210 -8359 -17109 -7684 1844 7492 922 -4012
14686 -4012 2246 9856 5269 -7663 1102 6959 796 254 2364 5516 23134 4891 -11462 -14806
14672 -14806 -3653 -5625 -12874 -15438 -14756 -14874 -16797 -9012 -13238 -10948 -9750 -5841 3001 577 -6288
14657 -6288 6576 5720 7250 7579 7689 10178 8786 8990 14095 2997 -12070 -19875 -13692 -6038 -8867
14642 -8867 -8347 2981 1731 3062 -333 -12605 -2338 1746 4839 9965 12601 16421 10774 10522
14628 10522 4644 5342 2615 -12187 -15050 -8806 -12448 -14733 -18665 -15573 -11118 -10682 -17690 -12259 208
14613 208 3831 512 -3684 -8069 -12141 -1233 11156 5741 -7854 -15806 -27778 -29337 -25194 -26046
14599 -26046 -25023 -20292 -21130 -24407 -1665 4377 12767 8927 -7218 -12126 -8654 746 1684 5238
14585 5238 3325 712 -3427 3640 12885 18375 15140 -1958 -6023 -8426 -10111 -16045 -11346 -8206
14571 -8206 -5348 -17449 -32864 -26861 -18089 -9176 -4454 6250 7785 664 -575 4125 3063 -186
14557 -186 -3252 5671 19796 18600 -11853 -22756 -25990 -26707 -4857 4795 1124 -1433 21910 12731
14543 12731 -4 -2112 -12718 -11203 -5592 -153 -15315 -14290 -2580 8198 17854 16447 16411 10114
14529 10114 17979 18356 26348 40875 32885 18361 2283 3254 2960 8589 6254 -2343 -6136 -13346
14515 -13346 -6012 -7210 -2157 -7524 -5953 5833 8483 -1737 -8724 -6016 3715 -2641 5635 15661
14501 15661 10383 1006 -2491 2645 14361 6538 -535 -1103 7593 22994 7497 -17745 -16762 -25177
14487 -25177 -24026 -17240 -11168 -6731 -11912 -18090 -20251 -17645 -17150 -4019 -5373 -4421 12625 22940
14473 22940 13251 12316 9465 4583 2706 1853 3027 2385 -2263 1336 8360 14750 16529 10860 3005
14458 3005 -9526 -18948 -26806 -12020 -15295 -19613 -18289 -1477 4446 8668 4713 -1345 -2625 -794
14444 -794 -3593 -9977 -4203 -2586 -10474 -17053 -13063 -9138 -2315 3590 11291 8844 3956 4031 -1856
14429 -1856 -7346 -10999 889 -3053 -10116 -11487 -7304 -5309 -5559 -11288 87 9044 13376 18383
14415 18383 20710 13130 -2580 -7868 -10215 1314 1139 998 -5360 -7636 -2551 15112 21456 19182
14401 19182 17563 5649 -2364 1211 1832 1839 -8146 -18564 -5259 14509 20157 20394 18052 6205
14387 6205 8146 3978 -5591 -437 -1488 -7403 -15051 -9849 -13954 -18298 -5280 15683 14806 6587
14373 6587 15607 16211 8383 -1934 -5476 11856 22965 20805 23386 6156 -8079 -14285 -1793
14360 -1793 -4557 -2012 -2038 -4393 -5422 -730 -6009 -5555 12550 13368 10563 19256 -2009 -9409 -10580
14345 -10580 -16013 -8412 2982 12482 12596 13782 8009 8643 -3226 -7906 -3814 1668 3819 6424
14331 6424 12649 20080 -813 -2881 -9890 -20705 -17986 -17713 -9296 -17580 -5320 -5397 -12690 -5997 -5192
14316 -5192 -9921 -5462 -9810 -701 6003 -6249 2086 5636 4431 26803 32633 8243 -15713 -17408
14302 -17408 -9561 -1252 3038 5670 -6003 -13649 1826 15239 15128 4643 6690 -10192 -8443
14289 -8443 4641 430 7 7179 15058 14187 12013 10332 12204 16866 2852 8577 10717 13873 12734
14274 12734 8112 5611 17995 10875 8039 17190 18694 11427 6824 15495 18897 4493 -8352 -17867
14260 -17867 -8824 1030 14221 12422 -10742 -19324 -20962 -13142 -10442 2977 9043 6082 2214 1105
14246 1105 1573 8915 19675 14896 11860 16398 16559 13949 2391 -7805 -2975 -1508 -1432 1030 -602
14231 -602 4047 14829 20874 25225 21997 -1476 -7355 -10641 10151 22850 32793 24035 16594 7173
14217 7173 1871 4948 24266 19333 10575 13743 29680 32508 30453 39422 28192 29797 17382 8260
14203 8260 11119 7955 -1087 -18647 -10669 -6625 -13621 -12805 5866 22994 30595 21318 16115 12658
14189 12658 10320 -9534 -20027 -14946 2497 16247 19443 7196 -4292 -9189 -5750 13110 8635
14176 8635 -6622 2724 2350 -10505 -6428 4515 14928 7807 4840 6220 211 -11279 -12504 -6094
14162 -6094 726 4297 9871 6968 10496 17015 17820 14884 7564 9783 28018 24498 3406 -3003
14148 -3003 6658 7809 827 -7534 7365 24397 27542 5728 -2284 -1083 7231 13456 9215 19551
14134 19551 21603 13751 12504 6166 -5267 2915 9507 4800 23484 23080 9111 19469 15447 8794
14120 8794 2384 11763 7698 7266 4191 5728 18807 15037 17230 22525 17856 21823 17657 18756 18601
14105 18601 16962 14093 27395 28917 40184 39133 33651 23148 21099 32453 32355 37272 35645 27577
14091 27577 33804 42906 36875 25974 23282 22115 25255 36636 50987 41265 35382 47028 56690
14078 56690 62636 75428 95760 94240 83989 89249 113229 146727 170110 220402 293113 385041
14066 385041 488230 601705 716297 792936 818134 816876 807527 815373 834888 866361 863516 796468
14054 796468 697124 565838 434846 325514 241553 191461 162392 150396 129590 113936 101094
14043 101094 81308 58223 64594 57546 57381 51498 40186 34498 37062 24072 17121 17848 8864 3109
14029 3109 8779 9015 13309 18566 6650 10434 9656 19565 24898 26058 21805 7981 12087 14038 21810
14014 21810 24265 24265 23256 23052 835 -11958 -9935 -2485 3726 7482 17129 9281 17036 17187 12004
13999 12004 10218 26404 24039 6203 -9248 -15839 -5640 -892 -17586 -17862 -8896 -1978 4297
13986 4297 14295 23943 30084 30514 24791 595 -15566 -17855 -15789 -1567 1905 1065 -2844 -676
13972 -676 9711 -6476 -8390 -15061 -13385 -5107 5674 9424 20104 6324 566 1205 -3049 -7480
13958 -7480 -10796 -117 3597 -7717 -20833 -23827 -12874 -5211 4009 -11386 -21471 -21910 -6553
13945 -6553 -1358 2283 -3090 -6399 -311 6664 7382 -3363 6532 15901 17553 21360 14549 5015 8743
13930 8743 9501 4818 4945 2350 -2366 -14332 -9074 -2479 4538 16774 22874 18556 7585 3298
13916 3298 4114 4805 8887 13620 13904 19948 23851 13529 8444 4544 18054 27651 23887 15931 8598
13901 8598 1697 -6987 12029 23147 22963 21403 15672 19843 12942 3395 -5142 -8185 -8910 -8176 -5262
13886 -5262 472 17593 21314 16117 17988 10095 4517 14036 20819 13257 -8871 -6392 1929 -1524
13872 -1524 4496 18469 35377 32154 22879 1522 -6524 -6396 -7054 -11506 6865 6715 2357 -4495
13858 -4495 9283 10040 8741 8455 28375 36512 22480 12498 26156 24197 18679 19349 20339 19842 26847
13843 26847 33371 36608 37463 10950 6286 22345 20946 9496 1987 5903 9774 22994 21884 32283
13829 32283 18175 23698 32601 25195 28584 36514 33048 27942 19301 7614 11169 20941 21194 12884
13815 12884 18750 33585 23477 14107 15479 2813 -7519 -2747 5788 22058 33462 29391 17507
13802 17507 19453 18785 16668 18240 20060 25669 26176 29338 44970 42547 43423 41985 30402 25472 25030
13787 25030 27097 19689 31886 27630 28092 23992 13929 24927 46232 48727 46659 50145 65373
13774 65373 53551 39952 42244 27283 21652 31836 32069 38511 29236 26390 31231 42228 41403 30563
13760 30563 25532 18775 2308 13469 18961 29358 25945 27951 28155 34225 33670 28808 12020 6061
13746 6061 18771 19651 18784 20835 21687 24637 37612 30664 33698 35910 25889 3825 4157 14370
13732 14370 21062 19805 12813 22252 41769 34217 39037 48708 46748 48653 40534 35657 34657 27625
13718 27625 29862 28307 26341 26234 19044 22265 27551 29304 16019 15135 23302 32021 42590 38690
13704 38690 30645 34699 37914 24908 23253 36152 37910 31201 21316 23731 14738 7680 -5683 2894
13690 2894 7832 14706 17170 20176 31073 28617 30623 15207 -2907 7372 15498 32351 33694
13677 33694 38456 26658 22750 13391 7492 13467 20384 33374 36499 29269 25975 15103 14478 16106
13663 16106 21850 36622 40301 26436 17972 22222 22514 28383 47922 54682 44895 41266 28620 21157
13649 21157 15928 8008 13633 18669 17251 16283 21008 22533 14034 6850 -655 3531 16079 18384
13635 18384 2465 6982 15822 24234 32894 37838 25947 11544 11050 18674 33075 33979 41727 45904
13621 45904 55170 47411 37552 36606 23481 10390 12562 10469 16675 9081 5471 11610 17443 26395
13607 26395 37299 39145 37757 35113 38013 29303 28759 41318 52902 39073 11932 6768 24389
13594 24389 30855 19063 9593 12315 13002 14126 9162 -8958 -3662 5258 6279 11627 16345 22095
13580 22095 11757 6554 6450 15192 15281 10422 17765 15610 28215 24074 19074 11791 5811 3504 10382
13565 10382 6837 9263 17974 30161 15171 -1378 -17048 -6169 7047 11453 9173 11793 17052
13552 17052 35113 38967 24791 9661 -4953 -9367 -7610 12090 36361 34959 31658 33697 41352
13539 41352 49519 39380 28136 13045 8636 4464 5456 2221 -837 10284 15149 25101 26889 30985
13525 30985 39938 55626 50681 22777 10311 12397 14543 7924 16115 36534 33117 27653 22625
13512 22625 31794 41064 38894 47091 50883 45217 37591 44930 43212 29348 13879 15186 24494 12596
13498 12596 14580 22771 28606 40427 45589 37169 32142 22339 25807 17216 13939 4306 5635 17274
13484 17274 462 10221 12540 25393 24775 25345 36447 40667 38321 34228 29928 20256 13712 -4498
13470 -4498 -7932 5976 15799 16884 22615 16973 11126 12395 17260 22274 26991 12505 16778 43082
13456 43082 51060 43628 41499 29579 19821 21825 27736 33592 31975 28790 26505 41005 48313 54666
13442 54666 48899 28531 20382 11565 5757 8528 15668 17035 18920 14291 21843 20683 15572 6202
13428 6202 14739 19476 20895 24809 21588 34849 27227 18994 35916 51004 36273 35741 34335 25406
13414 25406 31237 36069 30583 25557 42829 36029 29050 19924 25574 35448 28278 21936 11905 7505
13400 7505 6309 20955 30198 34044 30176 34985 36932 27337 31872 24330 13159 22363 22605 35210
13386 35210 27864 30291 31729 29492 19420 22150 33637 28925 17874 7885 6552 12747 15505 9561
13372 9561 7871 8922 6817 -2936 10502 32618 41085 38431 24151 19317 23383 22268 3177 4612
13358 4612 29419 46899 51474 52610 51497 24358 23800 28947 27501 28798 19815 12400 13409 14935
13344 14935 29288 36708 42780 38672 38484 44718 47458 50419 49741 51925 54973 50531 38333 38440 41959
13329 41959 40216 44000 39884 47161 53715 47408 43331 35910 28282 36239 27177 25611 44053 62869
13315 62869 67833 85009 113697 136486 139090 137132 146655 160435 168912 153596 138105 128072 106160
13302 106160 89023 67696 62432 77160 85552 82608 76167 71785 75964 70014 71824 83051 102624
13289 102624 106301 115954 133514 151157 168115 155109 134941 134266 133005 126008 115947 96021 66538
13276 66538 52976 54370 58615 61948 64578 59850 44821 44730 58361 58066 45524 30780 22087 12063
13262 12063 9385 15588 27263 28182 34195 35221 32451 23764 21461 25925 25949 40255 42421 43118 32156
13247 32156 22428 21620 33638 26972 33005 38157 40450 44015 47731 48560 52110 53920 51451 44334 43401
13232 43401 50200 58255 72041 103062 114942 126876 135172 138840 153441 159533 170893 169554 173576
13219 173576 173530 165051 142692 126245 108039 103648 94508 91139 90971 91826 89411 91553 89957 92659
13205 92659 87406 78061 92533 110042 124535 147756 163246 173535 170242 177944 189175 176046
13193 176046 164879 152756 127291 105884 92722 85453 75436 58600 58004 74505 72194 55082
13181 55082 44617 46074 44940 29734 21316 33936 35086 25347 25314 22319 31679 44104 58938 42211
13167 42211 32237 44806 57303 56018 42231 37547 39303 29878 33103 38730 24528 8178 29035
13154 29035 43061 30128 18441 6629 10715 15990 23694 25036 31425 30040 18291 18586 31869
13141 31869 37292 36515 40912 34502 24167 26758 10413 4860 6834 19611 32386 30453 41412
13128 41412 58786 60024 53804 52031 42871 32215 24417 29313 27789 30474 46366 45599 44713 35209
13114 35209 37281 26664 31124 38830 44085 39976 39962 42682 36698 42549 50486 44861 37647 35229 40359
13099 40359 44909 52352 56913 58901 54151 47115 51468 43308 37896 58707 65681 58743 55410 62023
13085 62023 60770 52361 56936 63110 62598 57310 55176 51594 39313 30419 31933 23045 24163 39111
13071 39111 49442 54679 51353 37780 34491 37691 29958 36968 49356 50335 49816 45082 35908 41146
13057 41146 31765 14452 21382 36555 44293 45131 46796 48480 43425 37802 30967 35451 39182 30267
13043 30267 31631 56127 62680 49689 44519 39457 37585 43650 41388 36761 40855 47932 35778 29089
13029 29089 28348 34273 41327 44829 45487 53012 48419 46467 44230 37270 41780 51892 46686 35856
13015 35856 44983 40660 35785 37233 34485 30619 29733 24811 28335 35753 49988 54608 51706 55357
13001 55357 43173 38435 35420 25040 36613 37291 42224 40052 22070 14978 26846 27825 31539 32682
12987 32682 29435 33583 41094 53631 57940 72088 80555 61288 55496 53690 40239 45216 41628
12974 41628 55229 58742 54519 51123 49517 58175 65300 54898 46909 64729 67808 54201 57776
12961 57776 53587 50467 44200 53636 63113 63429 71597 91647 103939 110231 110027 113884 118704 124952
12947 124952 144770 157515 183287 236415 303187 374206 427980 485484 522775 544494 576122
12936 576122 588475 581210 574221 558174 524249 465517 389817 314650 255366 213778 176483 137532
12924 137532 109179 95671 99342 107758 102328 107136 105222 101094 96632 101058 87279 79074 73625
12911 73625 80185 84534 86227 83375 79398 70645 75073 83220 79378 64450 62498 45623 45835 52165
12897 52165 53761 56785 61659 67510 60530 68119 74918 62658 48441 53506 59429 68833 76982 64684
12883 64684 46881 72728 79479 69175 50477 28038 26091 40568 32619 28269 40227 69210
12871 69210 79715 89604 85304 62510 49185 55457 50334 30216 36038 44666 40730 30514 24439
12858 24439 42283 62527 63411 55387 59376 63323 71396 73118 68673 56100 59029 62602 72581 77810
12844 77810 81748 78451 84110 79147 69303 82644 84515 86665 94076 95791 96713 89755 83605 80686
12830 80686 73819 67986 52028 46579 25356 17355 28977 18527 17927 26532 33539 30181 22486 24912
12816 24912 39591 41794 31602 33369 48506 62747 58763 52398 47737 52607 54799 57840 59236
12803 59236 54451 44436 45492 43841 58103 60879 49887 51114 60006 69548 65201 63594 63004 64366
12789 64366 57693 74645 92637 104779 106874 94224 90541 100523 104618 111730 113643 118816 108424
12776 108424 112187 117490 116627 125100 140709 150857 164651 181391 192450 203013 203620 178643 173675
12763 173675 175257 163834 144490 131783 127157 133525 139005 128626 108711 111839 126969 124709 125720
12750 125720 118358 108267 109235 118669 124598 131502 132132 127307 124967 121697 116012 105422 93085 79294
12736 79294 74950 79043 79265 85470 84911 78013 81863 84698 97216 100550 90194 84951 84834 88295 86788
12721 86788 88650 90523 82926 90508 103664 114748 114257 105851 112304 107540 106539 105911 119238 123945
12707 123945 101796 92487 98099 108137 119865 119128 131952 143638 147600 145199 136811 140360 135525
12694 135525 140608 140679 131906 141308 140171 152628 151447 144585 157223 162648 161467 152351 146077 151746
12680 151746 160126 141623 125201 108470 113199 126576 136262 132632 130934 124433 123988 134493 146474
12667 146474 138165 146592 162410 177854 191881 187876 188786 193835 195979 199234 194699 192086 187676 194694
12653 194694 197536 198036 203086 217105 223590 229083 253292 260610 249321 242796 236210 227450 223411 230310
12639 230310 215056 198671 184527 171944 163645 161703 177245 205000 234563 250313 281903 295000
12627 295000 287355 297999 308849 310738 309389 308195 309179 306009 280803 265823 259256 241331 241280 243105
12613 243105 231290 224573 227324 233969 253610 258484 263310 267470 280454 276120 272873 275235 287781
12600 287781 296174 305910 317930 312421 312602 313292 319150 317726 313405 336683 353563 357495 360339 354331
12586 354331 373011 388067 402878 409613 426733 446598 459977 477942 491958 520435 532261 539442
12574 539442 540169 536954 538715 548354 557367 559215 558274 569677 604014 631560 667910 696596 709273
12561 709273 724238 758458 809594 864600 907000 952127 978438 1013124 1061968 1127658 1184705
12550 1184705 1248562 1312442 1387687 1465940 1556305 1658528 1781245 1926718 2080987 2257961
12540 2257961 2471763 2730525 3060196 3458997 3915232 4451260 5051660 5689228 6377564
12531 6377564 7105750 7904852 8832597 9977595 11440679 13369380 16010788 19799417 25473421
12522 25473421 34084690 46229923 60862294 75900054 88780893 96891869 100791555
12515 100791555 102468951 103215502 103905990 104006378 100743494 92846383 81167439 66958993
12507 66958993 52714529 40546121 31126560 24309847 19615394 16419277 14159644 12466675
12499 12466675 11144486 10054674 9116660 8277875 7503522 6761599 6052037 5378527 4759997
12490 4759997 4213290 3745655 3341764 3006394 2720455 2476631 2247376 2064178 1908925
12481 1908925 1759912 1634076 1515942 1405290 1309439 1210591 1100822 1024244 961281 897141
12471 897141 852784 812172 766068 720544 680013 641638 608157 570288 546221 518387 489356
12460 489356 468663 449103 421390 387520 354000 338585 310039 283386 263398 251253 232257
12449 232257 228832 237739 223186 208742 203323 187168 179145 158450 157960 161538 142470 137658 141272
12436 141272 147536 141670 130863 121492 119211 93995 84669 91099 87734 85970 73688 69239 81472
12423 81472 88073 84220 77729 72285 80255 95115 94726 90736 83069 82668 74954 74105 89189 90133 96590
12408 96590 90100 77976 69245 84198 79306 72257 73998 67963 59327 64261 79378 97423 129197
12395 129197 144535 159839 167969 177781 169674 175581 193163 197114 196165 203985 209872 197192 177657
12382 177657 171122 154622 145470 145033 145925 148079 144786 141512 153479 168937 188740 210594 240758
12369 240758 270171 302020 314860 306308 310451 325885 342969 376290 414597 468685 506928 543346
12357 543346 591306 662159 766045 902832 1068653 1266434 1449162 1466984 1320092 1113959
12347 1113959 907309 724581 580520 469137 387073 327007 271004 228749 200608 185064
12337 185064 174947 153634 131471 125296 117615 102891 92249 87212 90299 94953 85023 76351 66402
12324 66402 83310 86170 76931 74458 82530 91187 98178 92425 85507 82297 75220 66159 53395 58783
12310 58783 64061 63461 55874 67585 87187 97163 116440 141611 144019 175609 213792 232024 244062
12297 244062 265018 250996 248398 257280 250420 232042 211190 191180 199783 201229 212389 218624 220631
12284 220631 251515 298249 344927 391147 461773 544731 633993 703471 756544 793461 808397
12273 808397 829908 845150 853028 851138 817996 762179 684871 605083 534852 490105 443758 394832
12261 394832 336393 281638 238875 215669 196169 170918 147443 122831 108406 103035 94345 93470
12249 93470 88680 85247 88218 79388 67386 66274 68813 55719 45614 41988 35836 35366 43477 42925
12235 42925 40291 37089 45201 47564 45940 29197 30784 33956 40707 43788 44500 44470 48005 47542 43211
12220 43211 47930 39692 51306 62104 85064 102363 105353 116791 149471 165280 178507 193480
12208 193480 201531 199610 176169 149121 128820 122934 110368 93407 92381 84475 81339 71600 69170
12195 69170 71761 82455 78647 85818 123110 155750 193238 244410 281530 314631 337552 326659
12183 326659 301736 275948 245589 224795 239060 283819 356700 401320 409766 388725 329994 279368
12171 279368 224209 184848 139788 97639 83004 86659 92826 75153 54361 50814 53192 27970
12159 27970 16796 19181 25337 33778 41067 38573 40523 25633 20154 21997 27483 37526 32632 31160
12145 31160 41696 37238 31095 37319 36362 15245 9769 16564 19823 16437 13436 17776 17956 9086
12131 9086 9315 -3677 -4297 6133 9659 14621 9459 6534 7585 5408 6120 3729 422 8149 18274
12116 18274 24400 36200 33897 37832 41254 40915 58947 65899 51669 65902 70334 82291 75622
12103 75622 66143 57513 60108 67682 68380 73788 98792 122562 150237 189621 252255 326799 406107
12090 406107 451100 491574 514986 527645 542750 548853 543801 531466 495762 447372 387414 316805
12078 316805 246713 191306 158347 126629 98842 96086 84568 67424 69427 69941 61838 46437
12066 46437 41594 43514 50489 49327 43467 49811 41049 17803 16538 25883 25628 17149 25780 26408 20331
12051 20331 23667 27211 20765 18345 6930 3548 -1894 -6002 6002 2959 -1240 10747 9225 1496
12037 1496 8594 21516 39553 64341 74291 68531 69061 74595 71289 50401 33174 21695 25034
12024 25034 27520 29671 26285 25362 16492 22907 17455 17008 5493 -11386 -23149 -19071 -10958 4583
12010 4583 13489 16634 19451 16909 16111 15133 4369 -5485 8690 18617 12587 5597 -268 8816 14700
11995 14700 17941 24723 39230 35255 29162 24065 28115 36452 32941 29017 30520 9886 2580 5378
11981 5378 12216 24025 34798 45417 52127 58200 78941 72404 69326 79653 87353 91335 124024
11968 124024 140994 172742 216652 267922 353333 465153 591807 698623 790993 858185 919423
11957 919423 947735 951911 922015 884090 825006 736267 629524 526546 420926 333800 262469
11946 262469 200509 167803 143938 120176 102272 95108 96534 75594 67061 78617 85385 95332
11934 95332 76858 62869 60829 57738 58859 48555 38442 36182 30658 33861 30835 23519 25434
11921 25434 37202 24270 7768 17711 24258 26610 23875 20401 17392 5110 15748 28907 29061
11908 29061 37370 25603 27336 18667 11808 9880 6933 11040 8943 -3279 -8569 3552 22961
11895 22961 34014 25118 8829 8316 14074 -790 16996 14566 5012 5357 -4691 -5849 4268
11882 4268 16766 15272 8727 -5151 958 3309 3951 11940 12151 -5657 -3285 6545 13193 12317 13038
11867 13038 9392 15071 23547 25174 18601 13465 8075 4226 9284 3479 -12180 -12426 -9360 509
11853 509 14745 25472 29265 22642 22681 32958 46761 52676 30671 17800 22338 34883 34847 36497
11839 36497 51543 48115 37549 37208 36428 38980 22519 12434 11226 14016 21702 30782 21056 7971
11825 7971 12971 23548 11891 6261 6148 13597 28091 31543 24132 12807 5799 -2626 6950 19004
11811 19004 20365 21667 25178 23678 19383 18361 11356 9578 18350 20692 22053 27026 20318 6903
11797 6903 2211 8960 14855 -2083 -8655 -348 4047 8124 -1450 -4060 -695 -1406 -10503 -20695
11783 -20695 -16197 -20236 -21244 -11159 4498 -5298 -18667 -17053 -16939 -22556 -20927 -5066 2003 7586
11769 7586 12118 9890 7343 13317 4003 -3475 -7888 1727 7812 7274 -5136 8965 10963 2388
11755 2388 4363 18234 16240 21837 20588 12968 16962 14881 7813 12300 7861 271 -3602 493
11741 493 13578 10243 10529 7345 1841 -5069 -1927 -7416 -5552 8555 17037 17408 18269 24192 22856
11726 22856 15858 21789 24286 12100 8320 -2671 -10934 -14518 -17142 -2497 -5587 -8949 -6273 -170
11712 -170 13808 2386 -4266 -5119 13443 4142 1140 9348 15782 17166 16186 12394 17219 22316 24248
11697 24248 24445 12263 2493 -5213 -7779 419 14769 12031 3509 6836 1929 3763 8032 174
11683 174 -2238 -12920 -3919 9531 12133 9351 12545 7609 6114 1762 331 4231 1231 11952
11669 11952 16157 5586 12949 19495 1195 -14200 -10040 -2407 5239 -2341 -4357 513 16065
11656 16065 17370 13600 17970 25977 32488 41351 38380 32173 12672 8875 24862 21988 22606 13906
11642 13906 431 -9727 -6860 15080 28842 28423 21143 14230 6652 -314 -4821 6236 6142 12133
11628 12133 17287 18596 13556 5259 6917 16490 10328 -1761 5638 -3125 -5973 -33 -617 2059
11614 2059 5440 4759 10977 14563 1282 -7527 -6478 692 9754 9644 14493 10088 11365 8712 5899
11599 5899 8247 5530 -7411 -14422 -10778 -20280 -18803 -7414 286 -8949 3564 14837 10281 2251
11585 2251 9940 1692 -19050 -15548 -8036 -3847 -1668 -1440 8327 20764 32752 34482 18170 15427
11571 15427 14369 15803 17849 15417 8330 7681 9042 1148 -1631 13379 17779 11050 15810 32994
11557 32994 30288 11113 -4004 2983 1137 -239 10661 21283 30495 33845 32772 21034 21871
11544 21871 28420 24604 5178 -2000 4744 21376 50415 53559 41473 30540 24469 24195 18395
11531 18395 15040 8810 2625 7898 6289 3707 12638 23683 11169 17740 35442 35221 19986 15361
11517 15361 9421 11494 -6211 -9071 210 974 11600 23267 26642 24446 22649 2822 2878 11976
11503 11976 16018 12926 9375 15155 30369 32891 20332 6927 9779 12385 3676 -4382 -3766 -5919
11489 -5919 6322 32761 22554 2277 11121 34118 42479 42890 42826 42487 32862 37176 37081 41358 39090
11474 39090 45827 40620 46476 50115 45662 57311 65808 88009 113581 123200 137195 147867 168178
11461 168178 214416 291198 370695 456502 549471 603637 610909 575501 490122 400379 318058 266381
11449 266381 226966 184675 141859 114412 101659 102555 103713 88670 92363 95390 91263 85713 76167
11436 76167 54501 55418 59866 43102 41505 41282 48851 55735 53890 48038 38204 33555 25874 18530
11422 18530 21854 29583 39683 38867 24673 31817 29546 23895 16947 22271 33569 30992 19352 9116
11408 9116 1298 22470 34310 26622 19897 19044 13353 17395 21945 30030 31443 43543 43483 36935 33060
11393 33060 25125 15678 23136 20409 20444 19067 27971 51890 49164 42096 29825 24197 21728 30077
11379 30077 40653 38146 35380 45635 29931 23034 14089 10935 24432 50280 40496 29434 20806
11366 20806 16424 28898 24980 27899 32460 20844 19215 17030 18931 20403 25422 17746 11263 4784
11352 4784 9751 14885 27992 39426 43484 39914 45541 38756 38702 41921 43020 35461 37530 37508 36991
11337 36991 24588 28511 30546 33807 22697 24083 22439 37155 29448 27061 25944 16195 15601 9044
11323 9044 6982 16353 12371 5994 14088 45697 56641 74407 91051 93134 85603 82368 89709 70779
11309 70779 35918 30091 35615 40998 44416 59496 68876 68205 55787 51056 43719 42048 44033 57647
11295 57647 60797 54983 58696 63202 45436 41219 34697 19969 23380 33058 35419 41147 34261 31304
11281 31304 32503 33874 35851 34727 41929 44242 43345 42528 43167 29920 39884 39401 23755 19867 29039
11266 29039 21072 21508 37990 53685 58024 44629 46529 67572 98515 113490 132821 134164 126115
11253 126115 118678 101845 90257 80166 67779 58259 46399 41729 47937 49423 48483 49076 44962
11240 44962 37031 42569 41488 43312 53214 47548 37133 37440 38870 42810 48894 49790 41049 32570 43674
11225 43674 48442 49229 46169 41647 43426 52322 63823 55959 46840 37080 39371 40024 49766 57772 54720
11210 54720 50106 50533 51556 44986 51448 51218 66211 70742 57325 55147 62043 66595 61037 61799 57189
11195 57189 39854 28612 32126 28990 36082 46388 49090 33795 30062 47582 51514 53770 53221
11182 53221 39472 42137 41728 33979 42236 60023 67789 58774 47682 38196 40099 41761 32856 33409
11168 33409 45564 44080 43210 42265 36707 27845 30457 42271 57797 66360 66888 58212 44086 39080
11154 39080 44285 39036 53280 69352 69578 54771 52000 36929 33741 31059 41507 72013 95000
11141 95000 111044 113448 104436 105507 104828 88282 65060 53305 52605 53633 46160 41273 41157 34158
11127 34158 26754 36839 43497 51058 54041 53871 43953 30355 52093 69627 87407 110336 128699
11114 128699 153448 140350 116677 109890 115935 97412 68679 62889 58075 54561 70333 62694 71575
11101 71575 75285 69050 47931 43904 31363 33606 33632 27214 36406 49831 47756 35066 30350 48233
11087 48233 52973 56816 68567 69294 65868 53115 59669 61630 70189 71493 72056 65215 57914 54359
11073 54359 49536 50487 33943 39720 50462 40864 37410 46145 41429 44887 50452 41247 46822 50370
11059 50370 38342 50637 61598 58423 58181 68752 71637 67042 73538 64765 57474 54364 49842 44465
11045 44465 42657 53848 67209 74066 54631 44824 52655 51810 57251 51219 53631 46977 65461 67801
11031 67801 65942 66990 68542 64901 46812 47057 47630 59348 62495 68848 71547 73490 64837 68740
11017 68740 78296 79309 75884 80096 61274 41825 48827 54987 54277 50314 37549 52873 49553 58595
11003 58595 81054 95691 99637 92900 95472 98927 118023 113751 107539 101110 104080 104995 98913 111132
10989 111132 106470 99692 96739 77985 67229 53361 36855 51436 60852 65464 63055 68548 76213
10976 76213 97613 86391 92370 91951 81754 90897 96442 90727 98841 99323 96237 92636 89121 96202
10962 96202 92162 80880 74488 73739 68293 51737 46444 60867 58834 61209 68078 72876 68167 75196
10948 75196 85978 85378 85554 74184 57879 61651 69845 73702 77541 76394 91802 103724 113050 134404
10934 134404 136805 126522 121761 128493 132726 135835 151551 160172 182500 219513 271397 337359 412429
10921 412429 536936 749345 1057176 1425842 1621548 1525087 1292803 1026613 769205 574348
10911 574348 439668 356595 288005 234259 203839 180348 154159 141192 127368 124377 122624 114054
10899 114054 115500 125066 123046 129164 117227 105710 98824 89187 86728 94689 105853 114328 118959
10886 118959 108188 102403 85256 64755 74771 89507 98312 93680 86886 75739 69200 79926
10874 79926 76807 70831 70668 74006 79500 83005 79992 70978 72179 72466 81231 85891 79839 90381 90344
10859 90344 87020 88633 92822 91960 85700 79677 80210 87097 96558 104819 104165 107736 111592 111587 105690 98118
10843 98118 102508 109316 101522 91333 91970 103649 102958 101658 93830 96455 87168 87154 87354 89802 95572
10828 95572 100338 103959 104974 102838 103696 107342 118582 120750 125072 122002 111002 110014 115551 138543
10814 138543 137997 95943 73343 73734 44933 6222 -11818 -4407 3137 10499 16478 17230 17340 31743
10800 31743 41072 52968 63155 60345 70581 79632 84764 91281 96320 96342 87218 76284 76631 78360
10786 78360 93941 90137 79377 71571 73625 70402 73963 88068 98653 94856 89856 78977 74390
10773 74390 75155 94760 103898 108570 106391 99071 105821 122594 126589 123058 123314 126355 126188 141153
10759 141153 152876 154928 163003 177858 183383 177244 182162 201112 213326 221580 228043 219462 224009
10746 224009 224871 229707 238954 221901 212567 187674 156279 141637 141261 126840 110268 98639 95908
10733 95908 101530 124753 129146 125720 133948 148150 158652 158350 152467 150718 153773 146194 122924 112341
10719 112341 106122 104923 116135 116048 124373 119417 125653 147327 135945 126383 125591 134173 140980 144895
10705 144895 138986 117193 124977 151506 173926 194827 212967 220362 211276 200012 175698 139381
10693 139381 109186 83896 87521 118668 134067 147331 175716 205404 231906 228008 221904 216904
10681 216904 205444 205262 198048 185010 183283 176980 178125 170266 170011 168349 164859 177016 179231 183539
10667 183539 184639 183637 188005 185618 174666 158822 147076 135573 130724 112307 89298 82994 76469
10654 76469 83347 112250 158607 189419 214711 222364 232315 245258 266625 289738 305491 321916
10642 321916 346316 365945 393257 403336 390975 388808 385709 375256 375087 383878 379044 371458 387467
10629 387467 423362 448998 453999 447483 445312 433430 368143 274781 198132 166674 155377 158839
10617 158839 167433 189582 226056 256161 275178 286625 296978 296663 294995 292554 312737 317161 317386
10604 317386 308307 302308 309896 325132 337547 344698 354755 354965 357598 350173 342299 344664 350047 375020
10590 375020 399786 416139 428102 454090 474903 494359 511337 520465 505431 496634 505920 518274
10578 518274 528356 536405 533021 535783 538968 548846 567319 580704 600917 626973 666879 687963
10566 687963 704660 719519 722394 719854 730270 757621 787329 818296 837500 852149 874729 895360
10554 895360 931178 966446 1009522 1046036 1086257 1135952 1239921 1389750 1552920 1730474 1895666
10543 1895666 2055395 2192685 2267316 2282151 2253902 2191232 2128796 2073236 2043899 2060473 2119172
10532 2119172 2219342 2332153 2448727 2545593 2660677 2810747 2987552 3165411 3354791 3572955
10522 3572955 3825527 4153162 4593897 5131960 5813720 6663814 7584902 8367734 9008216
10513 9008216 9641845 10437753 11582602 13187641 15337910 18095716 21647880 26418757
10505 26418757 33008140 42292655 55963047 77242495 111921587 168511836 244933195
10498 244933195 297876008 289252138 245961339 194701288 142800045 99320222 69642836
10491 69642836 51208599 39613755 31868712 26435617 22462052 19423019 16936287 14841942
10483 14841942 13140575 11860492 10964809 10253786 9470768 8605996 7743767 6931229 6200463
10474 6200463 5550450 4991058 4495159 4066279 3698841 3385878 3109154 2842163 2588817
10465 2588817 2371450 2206208 2067353 1951107 1833975 1711980 1573253 1450256 1332335
10456 1332335 1242664 1163169 1082978 1008993 943117 885590 836834 826523 827957 811829 778687
10445 778687 723290 668220 609849 561194 527847 502471 484038 440410 392791 361133 347860
10434 347860 347362 347002 343197 329205 303906 291223 276198 254945 235703 219139 213356 202040 193328
10421 193328 190462 201187 202248 181909 155570 133517 124646 117821 109768 123667 136568 167206
10409 167206 212513 249568 239133 214211 182151 173187 170078 163257 155047 137489 126331 112633
10397 112633 110738 118533 109305 96692 93925 100273 100998 80187 64548 55605 47715 47738 41766 45761
10383 45761 50500 42449 32185 52978 74660 99986 137816 185819 236132 261987 244735 224999
10371 224999 189554 122863 51469 10356 11138 15630 9905 -11345 -36772 -44728 -49521 -49409 -29635
10358 -29635 -19704 -28705 -50170 -68291 -76782 -76636 -68796 -49151 -34486 -37833 -26349 -22184 -9451
10345 -9451 -9837 5376 47422 105224 140761 151658 143166 113576 94623 85790 59512 43819 43357
10332 43357 49163 61945 75834 73785 40375 23898 12338 8814 9027 17276 20897 19028 21046
10319 21046 14612 15229 28081 24962 805 -22425 -40808 -49897 -50103 -67349 -71688 -53089 -10593
10306 -10593 40353 66455 76095 75964 70543 48986 -1547 -36603 -61606 -69601 -69518 -58336 -37660
10293 -37660 -13776 5311 16896 4629 -2496 8477 14526 -2721 10344 9777 4023 2223 9273
10280 9273 9086 11936 35268 48451 59087 53033 43355 24111 15466 8436 3645 12404 18718 11765
10266 11765 17352 17967 22815 32117 22863 10693 18995 22021 20872 22221 15104 23015 36318 45093
10252 45093 59889 69172 80525 80678 82487 85763 102008 112334 112417 122800 121484 94471 79606
10239 79606 66330 54935 62823 62306 54937 44247 48821 40616 29518 39371 48649 53534 54407 56983
10225 56983 56183 54238 57420 68704 62619 53010 50383 59940 59176 60688 69462 64791 73869 78254 76403
10210 76403 81560 79313 89486 89060 77841 78066 82777 84023 89280 111466 146541 179986 200819
10197 200819 211598 222100 235161 252871 278926 309323 334507 362822 423314 490072 537271
10186 537271 582712 649938 744472 894341 1105556 1400114 1776859 2256428 2828473 3457577
10176 3457577 4164764 4970373 5687712 5865015 5393020 4543043 3590981 2701188 1979421
10167 1979421 1473677 1141736 914269 757376 633471 555524 478320 418087 372968 346224
10157 346224 322351 297138 276232 254983 224992 200115 185277 176055 160499 137564 119155 103527
10145 103527 87855 78279 69316 63917 66995 69376 82156 86941 91218 91138 77122 66170 62727 68275
10131 68275 74159 83141 76568 56422 43397 58145 74814 99150 106803 95529 83493 95317
10119 95317 113815 118244 116913 121542 127065 117384 98256 81772 70314 56903 58097 57466 60877
10106 60877 51365 42711 62171 71945 53523 43366 44341 33931 30380 42373 56642 65896 76421
10093 76421 75599 75580 94995 103852 113126 107653 106726 113355 117828 124232 133590 148876 177239 203391
10079 203391 242802 307203 406884 551068 797058 1153908 1521920 1673719 1548971 1310706
10069 1310706 1058413 802741 606511 477308 373481 300295 244129 198762 166398 149871
10059 149871 144268 136009 125103 117846 111629 109201 105665 100866 89426 62308 52600 66007 53475
10046 53475 42590 33526 37368 41448 31001 24541 27276 26625 25659 13578 3631 -3638 -1375 -1667
10032 -1667 6917 16483 9338 1328 5334 10336 3270 -14962 -31026 -20436 -10002 -5186 -3023 -466
10018 -466 -1242 17511 31950 28739 25976 22527 34224 47503 62005 80329 106614 120031 112859
10005 112859 90120 68625 43045 16331 14799 16797 19796 3338 -1997 7461 7742 23470 16348
9992 16348 20656 29697 27215 18855 26553 33001 16914 2488 8106 18242 21155 14940 14387 13600
9978 13600 -149 -3343 -7272 -9668 -13849 1447 3195 4299 15435 38153 29125 16452 16824 17372
9964 17372 13819 1853 7900 20397 7810 6460 10219 12702 12070 6797 9170 24198 26755 11598
9950 11598 7339 11271 6325 7512 211 -9857 -2696 9526 7018 4504 6552 -12308 -10137 -9633
9936 -9633 1660 12520 12751 2235 18405 22508 21416 11178 11378 15427 4386 9019 6492 10298
9922 10298 12902 14589 10802 16957 9953 3468 22614 31581 17947 18323 11862 11918 15848 2411 3264
9907 3264 967 10017 9968 -4884 -9049 6502 9244 28616 32742 33294 30324 29282 19378 25181 31336
9892 31336 22416 6576 11772 29993 16018 16942 31053 30374 21094 32031 27566 21941 21452 14647
9878 14647 17486 21881 29971 59294 65796 54584 37266 37374 40740 35205 27854 32172 43724 47271
9864 47271 48911 56703 72324 100354 116370 146564 198943 285784 400372 520013 539099 473113
9852 473113 387549 300801 218875 161998 131388 94282 71236 55546 49268 58693 63561 61093
9840 61093 52345 40483 40925 21951 23085 27368 33088 30692 33786 44039 47171 43671 38883 37194
9826 37194 28969 33908 50403 75182 80017 92604 118354 119817 99094 78013 64166 55249 41878
9813 41878 43689 34792 24059 20179 30181 36909 46753 35680 32178 35502 37893 46629 55931 42812
9799 42812 42727 47562 55655 51433 37116 33832 28110 24492 15986 42297 58135 57707 50272 36358
9785 36358 38235 33092 35376 28052 34382 35800 25153 24663 40432 59016 63152 40920 17112 26917
9771 26917 31467 29454 44563 48042 50043 45356 48102 45855 41526 31365 19275 15414 19542 24099
9757 24099 30425 52512 64061 63463 47836 45742 53769 59208 68409 85155 90152 81206 73408 61926
9743 61926 55593 52999 49994 53817 54058 65702 66333 55972 51649 48594 49560 55509 48411 38507 31377
9728 31377 26228 25775 27241 33644 37713 35623 53125 59700 53915 60781 63543 54978 35329 36000 49059
9713 49059 52111 49051 44869 33465 38168 54525 66108 63557 71619 74458 57841 40029 40089 50013
9699 50013 64913 60187 51023 52465 53234 57215 50575 37132 34077 20776 14648 19069 28463 29372
9685 29372 28650 31992 33890 39397 32278 32975 35266 39822 37075 33069 44256 55601 73435 76294
9671 76294 52961 49076 43860 49131 42743 52359 48251 41268 34774 19874 21997 34765 34279 28286
9657 28286 26296 20997 33669 53247 81743 77001 58636 46090 42599 45179 44749 54918 67934
9644 67934 61309 59068 61146 61937 58800 44939 38362 40991 56687 58587 54015 52694 47267 51466
9630 51466 52259 50267 54786 62722 51929 50085 49762 50035 40195 28055 38492 39925 31403 34702 41876
9615 41876 60269 49587 42468 40508 31404 38101 32958 35823 50391 50478 51503 47484 48951 43992
9601 43992 40943 46326 45005 50931 53575 46429 41005 28648 31314 33269 36423 30316 30386 39365 41465
9586 41465 42976 52962 52274 52774 52255 58686 64315 63623 45966 51894 63199 53137 51680 66875 74038
9571 74038 62806 59219 43324 38171 47973 47549 48973 53758 57813 68418 71705 57865 57262 59273
9557 59273 65009 82553 78293 65630 55821 50337 61704 70538 73756 84807 75591 52960 51083
9544 51083 44213 37722 34446 33998 44866 50284 50825 38413 44150 50761 50942 60689 63238 61800 55464
9529 55464 43898 50769 65454 62447 70963 65802 62955 69883 62086 65891 69847 66814 65737 63292
9515 63292 53463 38035 40629 31220 29586 36377 40448 46957 43932 49850 57116 62859 50827 55402
9501 55402 75593 68538 67236 58141 48045 59861 70330 58293 47320 55970 60468 46974 63574
9488 63574 75264 74607 77441 70654 67197 62997 66437 58858 44889 53204 61203 73970 65348 57445
9474 57445 69996 61696 50596 47263 60506 59231 51074 62665 62685 69267 76459 68842 55695 58802
9460 58802 64191 67556 66581 69249 60251 61250 64019 54476 48703 57058 62623 61065 66300 82387 97605
9445 97605 98223 91424 85940 92089 95705 92835 92277 96202 93883 99869 106216 113848 118725 122129 110881
9430 110881 82424 82632 95363 101147 95456 92221 91761 98170 107092 105775 104367 100047 96846 92475
9416 92475 99937 93805 72869 61126 75365 79617 76927 70271 65974 73100 81562 89787 86412 75572
9402 75572 69729 70710 78906 85580 89208 86764 86361 95648 98314 87300 81723 69275 61169 82302
9388 82302 84883 76324 69937 70783 74921 71275 83408 88825 90230 80704 59587 65602 67236 67063 81660
9373 81660 90436 90161 86507 90218 100433 106241 103601 98484 108120 106461 107595 120061 122811 130115
9359 130115 120327 100613 86953 82611 89982 77935 81212 101991 112218 111937 125550 115393 102441
9346 102441 101419 112272 118049 121525 115410 127894 134212 122877 118172 120296 123189 128811 128420 128427 117568
9331 117568 100538 102875 120725 142815 145709 156021 162770 154842 136656 131754 128426 128777 137371
9318 137371 128825 120553 130990 138692 136505 128008 124178 118788 109998 107057 123745 138769 141259 132790
9304 132790 121322 121033 114961 117613 127195 121264 122949 136370 147681 142017 136483 147112 155636 160887
9290 160887 150810 144244 139361 140687 141714 156922 165885 171826 174240 171486 153760 157695 167511 161064
9276 161064 159675 145321 143741 151378 162727 170191 168085 167661 172897 169987 176090 176344 174748 173148
9262 173148 161299 161190 173897 183798 181080 177183 180440 186343 191227 179862 179849 188826 196798 198715
9248 198715 194003 196010 209666 215292 209247 215928 220040 218009 223038 215287 217108 210762 202203 199106
9234 199106 218053 234994 240429 239609 240568 230845 227281 223764 216939 207271 206203 211509 220936 246736
9220 246736 245552 221517 221026 220700 220786 218731 222145 236055 246641 242540 230178 231071 230169 233220 240264
9205 240264 244376 253059 257244 256940 252091 250685 253003 243709 236719 243217 241085 248467 268856 284628
9191 284628 286044 292232 283885 284153 296069 294381 291829 296017 286258 275104 289136 304734 306986 301745
9177 301745 314379 319953 320247 314074 310286 324455 325740 341512 350185 353320 346285 336205 341869 354071
9163 354071 360716 361416 346144 342536 346933 344978 346154 361851 374614 378819 373865 383838 388450 393996
9149 393996 399158 388931 386729 402811 409132 398370 387716 384722 396963 412197 416478 407422 412629
9136 412629 412387 412645 419326 430295 448362 457216 454592 451521 459904 473404 469833 474199 481301 487155
9122 487155 488280 487234 486357 496863 502609 518884 536983 543387 543757 542185 544044 543877 544891 550935
9108 550935 555338 563342 574341 586546 591044 593544 605306 608195 601263 604171 623373 641633 646924
9095 646924 649236 656633 683441 681776 682110 682759 693613 714531 714916 716515 723317 739139 758135 765845
9081 765845 764223 766407 775190 786843 802050 800768 811971 834214 848760 853739 840988 850290 868069
9068 868069 889383 894597 907982 918879 914768 922194 926316 959916 972579 978364 995158 1018098 1050003
9055 1050003 1068724 1087874 1108688 1130100 1130811 1144084 1167355 1193257 1216588 1229007 1264686 1291435
9043 1291435 1298634 1322422 1351756 1378836 1399675 1414545 1437011 1463612 1481118 1516750 1557746 1591310
9031 1591310 1621395 1643057 1679891 1707393 1727204 1752116 1800253 1840895 1865662 1898117 1934964
9020 1934964 1967295 2008819 2050434 2082053 2128259 2179740 2224197 2261050 2302016 2365848 2418184
9009 2418184 2467979 2524069 2584152 2640966 2704438 2766790 2830145 2900133 2969743 3035832 3107363
8998 3107363 3186431 3265778 3341296 3430610 3521908 3604235 3685507 3760302 3848609 3946386 4042907
8987 4042907 4151910 4263667 4369828 4473665 4576865 4691420 4810829 4927261 5059789 5187130
8977 5187130 5326236 5451674 5569743 5712187 5856058 5992742 6129967 6273780 6411029 6543027
8967 6543027 6682259 6825906 6958628 7097471 7240109 7370054 7497348 7623617 7758409 7869027
8957 7869027 7979717 8084974 8180709 8284783 8376172 8442563 8509845 8556158 8597381 8637817 8665240
8946 8665240 8668363 8672616 8666563 8654324 8641302 8589306 8530347 8474730 8410913 8326722 8230936 8137889
8934 8137889 8043018 7940929 7828469 7717123 7611744 7491121 7331109 7186196 7039117 6891029
8924 6891029 6759886 6615479 6466561 6310654 6173984 6040253 5899976 5757569 5622805 5503271
8914 5503271 5377388 5254518 5113871 4986449 4853600 4733720 4618473 4494065 4368322 4257751
8904 4257751 4176229 4098206 3981443 3863031 3756731 3659595 3569490 3480753 3403564 3312365 3233964
8893 3233964 3156651 3077725 3010489 2953745 2877881 2790774 2731527 2670468 2605198 2544550 2491963
8882 2491963 2450992 2397874 2340086 2272333 2212434 2158677 2106949 2060581 2025649 1991246 1944069
8871 1944069 1903796 1865823 1832155 1788811 1743633 1702421 1663553 1638174 1605322 1571609 1543979
8860 1543979 1528703 1486281 1460174 1432468 1404987 1378816 1358868 1330917 1308364 1286585 1270647
8849 1270647 1242897 1209919 1184535 1149137 1126361 1106568 1088277 1070326 1064805 1069523 1057044 1033383
8837 1033383 1017133 1008902 1007319 994119 966768 940326 910853 888257 873849 870029 861314 862394
8825 862394 860917 842072 820527 805054 800781 789270 780920 769524 763781 753819 735601 738903 735910
8812 735910 712175 702073 686899 670440 644226 633975 627554 632199 635775 614968 586721 587400 582182
8799 582182 578954 579544 576011 569433 553695 537525 528458 529472 530817 514494 502344 509250 506282 497768
8785 497768 502423 496038 497917 478290 459514 457635 463185 455002 458348 459636 458336 455234 454929 445130
8771 445130 444900 433115 427824 431025 451959 456297 431381 400879 392821 388335 385645 388178 392714 385778
8757 385778 372171 354086 359992 357135 348271 358325 351639 345253 340210 337816 340932 330318 323562
8744 323562 334956 340855 351123 347506 334527 332464 312064 307729 304777 304107 310659 317981 318642 319230
8730 319230 325820 330912 321355 310729 305858 315529 304721 298147 311178 315289 304435 293023 285337
8717 285337 290720 305362 311628 295534 284000 284462 289285 277066 269880 279645 277395 272869 277097 287168
8703 287168 289085 292404 299176 296261 277368 273443 279299 282813 282753 280358 283095 275089 271401 264408 269676
8688 269676 271886 280156 293132 290330 280773 278356 269650 262861 264653 268618 267254 256532 255289 261043
8674 261043 260910 257837 256351 259157 251566 252365 266134 274538 269921 278401 276808 277743 291576 295080 299254
8659 299254 294528 289093 281240 271294 273805 266303 281609 293796 294719 294181 289722 280805 274798 291578
8645 291578 300165 307356 312404 301381 299203 298603 303676 303466 305312 306651 296624 284821 290255 294825
8631 294825 291902 290563 283451 283023 289034 301762 314709 323861 327757 306452 298239 302466 312573 314351
8617 314351 320121 311496 310133 313286 313913 310171 302000 302947 304163 302052 294571 311247 321727 328399
8603 328399 326758 341055 349024 345825 349293 354951 366762 380850 393449 413376 442785 449306 460030
8590 460030 472908 467587 479358 500602 542387 571122 592917 616539 634109 662883 695798 727697
8578 727697 774894 807000 836246 871407 931005 987732 1054857 1102662 1162425 1245994 1340296 1410318
8566 1410318 1464165 1478110 1427031 1350498 1253894 1143542 1036173 933684 839294 761065 691156
8555 691156 616546 546827 490345 458721 443098 422423 386749 338465 321568 321901 310526 300180
8543 300180 302663 293814 286423 285637 273425 268419 243248 226955 216776 209293 210281 219965 219983 222930
8529 222930 229825 225293 229845 222403 211629 208783 197169 183265 164190 158681 148224 131108 124729
8516 124729 142757 157545 166183 174171 180488 176829 166677 148645 144099 134737 124114 124816 130871
8503 130871 131390 132646 134141 124168 136314 145792 151423 154200 136333 129762 128595 132076 121588 101417
8489 101417 99895 110563 130904 139408 138830 142934 145265 139854 148580 146474 147477 155256 143757 138059
8475 138059 137956 140355 138386 111758 107205 104550 105614 112813 101472 79984 83912 89140 80791 58475
8461 58475 67278 70373 64312 63172 76143 74273 64097 67041 70365 75309 70784 70445 83430 86649
8447 86649 77040 79491 93406 113804 109304 97451 86370 88522 76259 70618 79106 73838 59316
8434 59316 61482 73799 77269 85665 74007 71441 85619 88881 82613 77384 76025 82679 79193 65667
8420 65667 53813 55513 71549 73232 72681 55988 56177 64677 66371 60234 58031 67261 69823 67457
8406 67457 63283 53023 57753 60061 53523 60912 61546 44901 51616 53488 51789 55127 56526 56110 52031
8391 52031 57155 67740 62271 56943 55026 61957 59884 60475 73366 75522 69449 65416 67749 67075 63751
8376 63751 56098 42203 31268 27587 36261 40925 43762 32009 32113 36882 33153 37864 48953 64382
8362 64382 72765 62418 48234 45232 58328 62034 56237 61585 53305 54626 63173 63033 62173 54595
8348 54595 50270 40395 49893 70514 62332 58901 54109 46131 35549 37432 44268 47821 43652 38148
8334 38148 43228 48677 39819 26913 37482 39700 46828 56225 57003 53644 65723 60445 59891 65869
8320 65869 64601 45551 41579 47223 44497 43876 58881 69195 77792 90988 72776 62824 59658 51651
8306 51651 50801 61585 58347 67279 56376 53724 53237 36104 31261 34804 38142 42966 51478 51212 54806
8291 54806 48138 46036 67986 78782 67601 65573 57947 43206 35595 16577 11432 25766 48488
8278 48488 67185 73857 70034 55611 53117 60348 62977 58772 72099 73631 66657 61095 70510 69118
8264 69118 56012 41752 29268 26743 30972 40341 58113 50676 47060 31516 26783 34055 31034
8251 31034 28071 24347 28821 24804 25913 41092 47381 56455 57648 74188 74822 53632 48236 41497
8237 41497 42117 43973 39427 36017 22036 35417 30744 26265 28716 40510 39240 26802 18753 13659
8223 13659 18302 33657 36594 37490 31716 30055 29946 37656 54062 70226 76712 67454 55984 34211
8209 34211 28474 19442 19654 7244 9035 8861 26128 29815 18442 16583 46426 58079 41500 22221
8195 22221 24961 36500 31075 13806 238 588 3375 7481 16212 20003 23282 27399 19390 12309
8181 12309 -3054 -7066 1718 9725 17095 33183 24306 20904 19438 10866 15606 17048 13862 17169
8167 17169 17826 21062 30282 24512 26520 27973 21313 20187 19334 20863 36936 31893 31418 33263 37489
8152 37489 25055 17916 19117 10723 656 -9806 -7776 6190 23206 35246 37892 43232 26815
8139 26815 17079 13095 13395 23581 21962 27359 30974 27690 17055 11889 13733 18519 12596 17120
8125 17120 20762 22397 27288 34207 38242 38468 42957 35441 35243 44841 36642 20526 22162 31434 29553
8110 29553 30186 23427 29044 26860 29830 30133 13824 2208 8657 16722 20355 24732 24602 22416 11633
8095 11633 7338 14067 8494 10030 22418 28676 27034 24530 30600 35845 41327 43954 44224 39794 38836
8080 38836 37899 40881 34368 44854 49102 40086 35583 36167 36568 47791 48572 54826 62431 61367 50445
8065 50445 56677 42053 23354 23004 32605 49094 44870 31033 38573 50306 52330 48743 49749 54133
8051 54133 61132 54588 51382 56080 65141 59935 53028 53264 55585 67432 78559 69327 57479 53077
8037 53077 49592 68579 79617 82323 93017 92901 89660 97632 85531 79579 89502 96728 116656 123699
8023 123699 127242 126058 137828 150365 155447 144065 131777 126340 134007 151104 155879 149781 160327
8010 160327 171862 174410 161893 155033 153667 150867 132423 132205 135988 144863 147430 155979 161762 160476
7996 160476 159409 154846 142813 128328 128502 159423 176023 173877 167174 163180 162938 154473 153409 162756
7982 162756 170140 169681 171019 173240 173785 176178 209629 247654 266273 289912 302536 312834 305673
7969 305673 278588 259488 233508 196784 180360 169301 168944 166033 151486 140937 131764 131253 136104
7956 136104 139386 137706 134827 117077 103508 101017 101384 113342 119589 125125 127449 123129 119832 116191
7942 116191 112020 105343 125136 143210 128662 121178 129325 142419 148335 154813 164289 177754 176757
7929 176757 173154 162540 165207 162846 158406 156406 154264 152867 153702 148028 134278 120749 111160 110129
7915 110129 109165 109646 105291 91146 78676 67443 62386 66320 75669 76758 76691 78674 87260 77253
7901 77253 76527 72276 71954 76394 69466 73144 83436 89539 100456 93816 88544 80421 72426 67054 70765
7886 70765 68904 68080 68738 66408 60693 57735 56667 51387 46192 53720 60011 50673 63873 74382 71690
7871 71690 69300 67265 49879 40322 47780 39921 45003 56318 57020 50110 33719 23787 26768 20384
7857 20384 26739 33643 39384 46678 44212 41663 40432 39931 38630 34543 27555 38777 47595 34358
7843 34358 46168 38755 28950 31840 35969 26776 9222 1785 10521 25823 18895 15431 22345 21577
7829 21577 24551 29774 30719 26345 19825 6845 -101 4041 2896 11461 22325 27301 30245 32669
7815 32669 27773 30712 39528 34079 20761 7932 -1086 7000 8945 18474 22247 8211 -633 -1076
7801 -1076 11421 22713 41738 40687 40882 48042 40131 42607 49030 29165 21712 19366 2996 2300
7787 2300 -1318 -32 6259 2586 1161 -1867 -2414 12490 21985 12975 2388 -2474 5779 -575 445
7772 445 7409 5487 9921 13075 32404 38640 15785 8913 13141 15100 25421 24218 18634 16089
7758 16089 15129 9624 11096 6227 16354 17016 -400 -9376 4417 4611 -2043 6520 -6340 1217
7744 1217 12493 10973 16760 16846 24016 19363 13919 7763 4976 11345 25198 13272 24014 27078
7730 27078 27272 39630 22163 -27 10710 26906 28720 33387 24326 -3456 -6055 -3744 -9284
7717 -9284 -8968 -8951 -1100 235 1517 4077 4542 1860 -1007 -1264 -10761 -5274 -9528 -11897 -13315 1063
7701 1063 16572 29795 21051 10548 8244 367 -7063 9938 9601 16645 20248 14252 7927 1006
7687 1006 -4506 -15220 -19427 -5594 7887 5598 -930 -17850 -10189 16817 25185 24596 -1521 -7759
7673 -7759 269 -554 -6826 -13324 -350 11435 12798 -8013 -18496 -25862 -17962 -11956 -1408 345
7659 345 1793 -1549 -5206 -6826 -16303 -17184 -15339 -7048 10257 10943 7560 2167 13379 5230 -11116
7644 -11116 -14471 4678 6762 968 -2920 -4006 -3356 -220 -10973 -9867 -4514 -20378 -25409 -14956
7630 -14956 -16892 -8279 -8305 -5065 -7921 -14528 -1625 -8130 -20964 -9426 -1269 -3763 -9342 -13819
7616 -13819 -20463 -20703 -18214 -27704 -12445 4660 2572 -6691 -22419 -14752 -6548 -2809 -7296 -11704
7602 -11704 -1632 2117 -1387 -11060 -6224 2521 3521 2195 2715 -9655 -11443 -9435 -9900 -8470 -5087
7587 -5087 -5966 -8068 7723 -193 -10198 -5410 -15886 -19643 -23583 -21757 -14947 231 -4052 -1644
7573 -1644 -5320 -8757 -7331 -4631 9114 -1040 -14450 -25944 -14049 -6946 -9434 -9407 -7467 -572
7559 -572 -5238 -3417 1589 -3673 -6654 -5967 -987 7739 9991 -176 -14770 -22683 -6823 -15135 -9250
7544 -9250 -3 3506 -16241 -35272 -32418 -23256 -14814 -19237 -7182 4595 11261 3743 12261 26691
7530 26691 28159 18355 355 11382 23790 11965 10359 15777 18092 34193 38282 23196 -3249
7517 -3249 -14117 -11047 -8068 -341 5037 7208 5786 18959 30170 23249 4245 -5696 -1590 -5196
7503 -5196 -2176 2969 2704 4032 -4248 -16131 -16110 -4749 6275 7584 2907 6438 -757 -4226 -3168
7488 -3168 1828 4432 2310 1484 -3444 -7397 -18091 -14557 -12063 -4329 -235 -5438 -13054 -10951 -10086
7473 -10086 -10395 -3072 5194 7613 4661 894 -3893 3690 14311 1267 -16075 -23838 -19093 -7016
7459 -7016 9927 -467 -10970 -10830 -12933 -15311 -15274 -15896 -24332 -22389 -18588 -13522 -12910 -16438 -22566
7444 -22566 -35376 -28300 -29862 -39103 -40526 -33584 -18434 -12244 -19635 -24810 -25913 -21875 -20060 -14088
7430 -14088 -8573 2707 -2193 -15023 -14761 3606 21285 22936 6325 -469 3890 5709 4322 9958
7416 9958 838 -11443 -10470 -5118 4836 -4041 -19109 -22891 -20656 -23969 -26136 -10863 -3120 -5312
7402 -5312 6681 14860 315 -6330 -12706 -1678 2960 -2920 -13828 -13906 -4618 -5391 -10025 -2336 5954
7387 5954 6910 -4867 -6737 -17615 -6836 -5689 -12737 -12673 -17328 -21860 -21377 -30737 -22572 -12124 -15746
7372 -15746 -4254 13589 13606 18848 8807 4467 7533 15130 17202 2399 -3138 -14870 -29066 -29706
7358 -29706 -29925 -13187 -7703 -8001 -7747 -218 16501 14998 25132 23980 4072 -2745 102 -5623
7344 -5623 -8228 -12249 -14463 -4546 6706 -661 -9668 9571 9912 -4241 -4912 -991 -8699 -22409
7330 -22409 -3858 790 1363 9611 15007 -666 -6161 -17889 -5399 8320 1384 -12570 -17959
7317 -17959 -16362 -21940 -36682 -45695 -53298 -44363 -31757 -34719 -22567 -8559 -15252 -17972 -17022 -16829
7303 -16829 -6360 6297 15422 629 -15958 -23375 -40095 -31159 -24644 -12834 -15706 -24393 -15886
7290 -15886 1631 2289 -125 -4337 -785 9166 1444 -5459 -15983 1200 6812 13216 12280 -935
7276 -935 -16052 -24236 -10226 1718 6045 1039 -19540 -14581 -3919 -1623 -11028 -19090 -19076 -14393
7262 -14393 -7686 -10327 1949 15948 23990 18896 19979 16311 15357 17024 11468 3293 600 905 -12393
7247 -12393 -9323 1404 8569 5164 2645 -4531 -15033 -3653 -8729 -16791 -10893 -6441 -6375 -9318
7233 -9318 -5319 -9208 -1490 -4434 -5139 616 3060 4904 1525 5177 3447 -4243 4893 -3572 -3167
7218 -3167 -5696 -18894 -26811 -32123 -24747 -16592 -9205 -20317 -22464 -16326 -17863 -30782 -32284 -18546
7204 -18546 -8227 -16437 -19312 -11405 -12191 -8491 -3205 -7092 -4272 -4161 -6844 2076 -2740 -10056 -11896
7189 -11896 -12582 -12392 -16934 -30798 -27852 -24620 -11062 -15333 -18989 -13471 -12846 -3786 -4056 -7728 6459
7174 6459 2280 2478 -3009 -2659 11745 15959 12027 25225 24449 22547 17391 2278 -4196 -1007 -13001
7159 -13001 -17225 -15352 -17021 -14853 -12862 -9820 -3485 -3530 -13542 -13540 -18410 -14823 -16315 -20975 -12262 -14403
7143 -14403 -2191 -2903 -14205 -24699 -30926 -18875 -8749 -6091 -5343 -6603 -765 11625 13821 3614
7129 3614 -2533 7153 9278 3572 2919 21859 23152 6530 -6267 -17097 -16420 -12333 -8228 -15286
7115 -15286 -17717 -11261 -17671 -19530 -16087 -22012 -20275 -18599 -6632 1112 -4955 -16504 -17749 -4713
7101 -4713 -7470 974 -4358 -16021 -14271 -25150 -27229 -13973 -10622 -3057 1642 -8731 -8909 -3960
7087 -3960 3756 -9804 -11455 -11810 -11577 -5002 -7206 -22995 -22942 -8755 -2058 821 5110 17886 6736
7072 6736 -1018 -7467 -20142 -18035 -28629 -22410 -21174 -19953 -12359 -8688 -11725 -13415 -13449 422 4552
7057 4552 -9660 -18119 -32449 -26473 -17418 -7969 -7934 -9268 -13901 -9741 5182 -1188 -11246 -13949
7043 -13949 -11104 -7717 -4169 -11626 -28337 -23909 -7281 10269 3128 -3200 4938 8085 746 -3108
7029 -3108 3310 3470 -3679 -1652 6345 8684 6975 12682 19619 23341 19934 11429 3966 10190 7101
7014 7101 1108 -14800 -13915 -3335 3946 114 -10326 -18079 -12521 -111 -7036 923 2111 3994
7000 3994 -1552 359 -1590 2815 -5405 -14623 -14359 -3057 14186 4993 -10538 -21048 -22451 -23036
6986 -23036 2278 8960 20434 28813 26017 22735 17636 34865 41205 36999 12254 -8517 -13280
6973 -13280 -16915 -7752 -4191 -7760 -6703 9336 22417 27765 97 -2900 5593 4800 5031 10532
6959 10532 6581 -1235 -18160 -18681 -12216 -10348 -3862 -2329 -21770 -27131 -18789 -13452 -21639 -19809
6945 -19809 -3616 -628 -7455 -7605 -1970 -1183 -5181 -9415 -4212 -2939 -2089 -3621 -8076 -17273 -25478
6930 -25478 -35843 -35796 -24819 -9043 2834 515 -1365 -6439 -14680 -11841 -1048 9044 17229 16776
6916 16776 18428 10358 8782 2528 -14312 -25155 -14394 -8091 -9227 -5670 -74 -92 -11109 -5185
6902 -5185 -2856 -5936 -4903 -1370 1065 -1028 962 12605 25913 27866 4023 -8680 -15315 -24375
6888 -24375 -32975 -27991 -21482 -31088 -21981 -19695 2552 13516 -4623 -21563 -20008 -2245 -851
6875 -851 6441 5889 7712 12224 -4321 -8715 -8693 -7153 -3044 -3085 -5623 -7883 -9222 -16521 -14098 -5386
6859 -5386 -3146 -8584 -10412 -7161 498 -11865 -28950 -27384 -14661 -15417 -18219 -18098 -11524 -11426 -11814
6844 -11814 3205 2239 -316 7878 2511 -2098 2313 6981 -12120 -27075 -33639 -28774 -26256 -11571
6830 -11571 12798 7571 3010 7792 1234 2965 -9340 -13853 -10057 -7490 8292 13309 9096 3866
6816 3866 7569 7854 7581 3181 -273 -8856 -20330 -25570 -22895 -8912 2459 -2526 -7197 -7205 4113
6801 4113 6442 -3200 -8981 -15496 1363 15156 10737 -1368 17020 25489 -4815 -17346 -9315
6788 -9315 -12011 2505 11197 8396 9586 3878 290 319 6404 12814 26966 29671 13363 -1309
6774 -1309 -15945 -19289 -14670 -17404 -19398 -7190 8592 18218 17051 15058 19330 9391 -9018 -22878
6760 -22878 -21666 -7398 5270 6194 4357 -852 3389 3685 7396 7046 2603 -8420 -14359 -1687
6746 -1687 10054 11310 6167 -6392 -6492 -1113 3966 15158 14100 10830 3615 -474 10604 17100
6732 17100 9313 -426 -2608 21145 11881 -6379 -1220 -9141 -11751 2311 -806 -2441 -7942 -4008
6718 -4008 -2616 4801 -891 4012 8393 18055 26148 17492 16619 20488 17837 22127 24269 17970 10650
6703 10650 16344 21994 15839 8559 10908 40884 62700 99395 144226 165119 159345 121186 88994
6690 88994 67888 37103 15361 2225 4272 9214 1447 2774 -895 -5804 -3938 -8770 -20114
6677 -20114 -18303 -11268 -2849 -8297 -10362 -8190 1992 -4240 -6833 76 -1596 6351 12690 10835
6663 10835 2228 -1998 -7937 -10545 -27314 -35174 -34531 -16416 -2671 3125 58 -10459 -1644 -1226
6649 -1226 -13136 -25449 -29630 -17503 -2100 2453 -1704 -19822 -17840 -13323 -14508 -13071 -9129 -14631
6635 -14631 -9622 -13027 6842 12076 1596 -5960 -17472 -16900 -11622 -24033 -30723 -29206 -14491 -2713
6621 -2713 9550 9346 8570 4794 -15473 -17527 -19129 -16162 -17271 -5289 1918 3052 -3275 -14309
6607 -14309 -13726 -14765 -14839 -8179 -3559 3432 8355 -828 -12507 -13829 -10983 -9190 -27823 -42590 -29701
6592 -29701 -11149 -9154 -15321 -17368 -25203 -18131 -15756 -21996 -19558 -16732 -12303 -20206 -26423 -12844
6578 -12844 1503 -9060 -12912 -19711 -19820 -16833 118 15459 12015 2168 -542 1454 1122 5173
6564 5173 15737 6537 -11969 -12648 -15600 -17281 -30093 -39832 -28188 -7628 10792 12404 4473 7038
6550 7038 6680 -4258 -2185 3851 -11268 -4286 6143 -1826 -24287 -19828 -8497 -6300 -7114 -10181
6536 -10181 -6544 -1014 11016 -5223 -4539 4079 -5203 -7744 -290 -1303 -7829 -11866 -3610 -8319
6522 -8319 -17640 -25477 -36430 -31478 -17050 -9257 -12335 -14310 10374 21869 21566 16348 4165 6506
6508 6506 12604 14947 10965 1117 -4981 -20557 -20236 -14182 -5254 3553 -5897 -16249 -17741 -27105 -25662
6493 -25662 -24278 -16989 -9874 -18134 -22888 -17084 -18563 -11138 -5001 -13793 -12853 -18169 -3767 8939
6479 8939 14936 27189 17880 9774 -868 -1297 464 -9581 -16446 -6170 380 9580 6755 -3904
6465 -3904 -8514 -6921 -10457 -9031 -7945 -16539 -19903 -32849 -34468 -22159 -13971 -3799 3364 -416
6451 -416 -8783 -11982 -13320 -8472 7172 4701 6546 26352 22423 3776 -5238 3507 5427 -3480
6437 -3480 -255 1663 5146 12392 6529 2096 1210 -7319 -7625 2927 -2934 -14424 -16582 -10186 -9600
6422 -9600 -19715 -23187 -20250 -9073 -6078 -13715 -17088 -23433 -22187 -29416 -25345 -10084 6872 21867
6408 21867 15770 8594 -8306 -4202 4815 -7367 -20835 -9872 11755 19385 4984 -743 1442
6395 1442 3050 -12597 -11013 -3195 2308 -7120 -1911 -8809 -9565 -3836 1264 5419 310 9345 19006
6380 19006 25893 28556 25936 11600 -5255 139 -3412 -9454 -752 7170 15214 17618 13322 4556
6366 4556 10722 11359 17083 23790 29340 22211 20416 14878 8306 13173 -43 -3164 2939 2983 710
6351 710 -14589 -21960 -11564 266 6313 3208 -1846 -903 -5619 -12871 8653 14229 1240 -11003
6337 -11003 -7270 -5006 -4748 3370 -13728 -26999 -25115 -15204 -6454 420 4265 2371 -245 -1936
6323 -1936 6294 12455 -1097 -17174 -6496 -5986 -9466 -9432 -3036 -2302 -2937 -1801 -5624 2989 6745
6308 6745 6631 12453 4379 1974 10664 3800 2853 6198 1512 9626 4918 3299 4896 5039 -3930 -3646
6292 -3646 801 -900 -9348 -11469 -634 -10967 -7724 -6801 -13836 -12255 -15369 -6348 2739 -11148
6278 -11148 -26099 -23049 -25322 -18441 -12483 -21418 -30695 -28590 -24858 -19922 -13793 -20787 -24005 -23140 -9732
6263 -9732 -19186 -14832 -16844 -26794 -25017 -22791 -22936 -13838 -15468 -17149 -15540 -3245 1843 -3393 -11853
6248 -11853 -28623 -26705 -23965 -28439 -17464 -2553 -1013 -7005 -16311 -20200 -1315 9848 -9136
6235 -9136 -14482 -1156 -2881 2535 -9985 -9763 -14237 -8781 -3425 -1590 -1047 -9626 -12123 -24687 -12567
6220 -12567 -13928 -17042 -17085 -12423 -7347 -7393 -884 -14901 -13215 -10469 -11675 -18140 -26526 -7703 13384
6205 13384 16564 5830 431 -3649 -396 -2028 -935 -3441 1289 2463 -4750 -15472 -24132 -15855
6191 -15855 -5051 -6872 857 -948 -2395 8473 10699 -4568 -11252 -6571 -6669 -20672 -18730 -17136
6177 -17136 -17976 -12857 -7630 -8732 -14820 -14640 -10866 -8797 -9014 6671 17555 2579 -10666 -20749
6163 -20749 -16395 -19341 -19089 -20158 -4693 -2525 -11990 -8777 -11126 -18690 -6176 14666 11071 -7664
6149 -7664 -28081 -37170 -37586 -24477 -5058 12373 14178 9881 13485 9835 -4029 -1595 -281 -3752
6135 -3752 -12279 -7394 -3505 6412 10177 16100 22098 17884 24638 34444 31140 3108 -19795 -11270
6121 -11270 -5019 -3242 2844 -5783 -10518 8551 11580 -11637 -16977 -10226 -9253 -9714 1355 13710
6107 13710 10938 -3160 -3570 10560 11246 5143 1972 8444 252 -4114 -510 -528 -4372 -7391 -9593
6092 -9593 -6263 -5879 -17640 -22429 -19968 -17280 -7541 2219 14487 25906 19274 10290 16420 25535
6078 25535 19124 -1645 -14752 -12348 -1234 -1782 5224 215 -14887 -18746 -13153 -12901 -26461 -30770
6064 -30770 -16383 -3924 4019 4042 9238 528 -9670 -11287 -5592 -15302 -18153 -13237 -22120 -29147
6050 -29147 -21899 -20485 -19124 -26101 -28324 -22615 -10849 -10694 -13432 -14964 -17289 -17520 -17995 -18119 -22691
6035 -22691 -20393 -26155 -31093 -15613 12407 8425 -14321 -14817 -4234 8987 -940 -16084 -20785
6022 -20785 -10726 -12805 -16751 -10821 -7267 -3844 3183 5301 -6317 -15596 -15616 -19113 -23530 -15692 -11342
6007 -11342 -7163 -976 -7754 -14241 2705 3259 -481 -5741 -6647 -21069 -27221 -26250 -12545 -14409 -11044
5992 -11044 -12024 -7863 6126 4766 -13320 -29491 -22064 -7460 -8159 -13646 -18165 -14790 -7667 -6805
5978 -6805 -9195 -13566 -23640 -17830 -6041 2654 15891 18664 1956 -8214 -13129 -9824 10478
5965 10478 23239 16620 15163 -4919 -20218 -11000 -8862 -11152 -6261 -3731 -34165 -24868 -7039
5952 -7039 2253 7265 -3249 -7636 -12615 -9318 -7868 -6115 -6150 -3544 -11711 -16568 -1383 3824 -3036
5937 -3036 4613 -1724 -8847 -10522 -7020 3778 -1850 -11901 -2714 -20193 -31806 -23861 -11128 -6709
5923 -6709 -20676 -26595 -17328 -6108 -8515 -11484 -16219 -17049 -10923 -14852 -24306 -29179 -25937 -16176 -5216
5908 -5216 -6791 -3071 -1152 8953 14556 21732 18186 4279 -10688 -10599 -2431 -2206 -645 -10080 -15736
5893 -15736 -8003 2065 -5122 -18097 -6851 -11577 -17226 -14014 -11465 -9759 -15095 -19237 -10129 870
5879 870 6905 13615 13411 16689 18643 2741 -11281 -23810 -10957 -8627 -15262 -11426 -6348 -3717
5865 -3717 -8410 -16170 -23051 -23083 -32067 -28675 -16780 -11089 -10302 -19734 -24784 -12588 -4770 -13170 -21968
5850 -21968 -21230 -8095 678 -490 -4516 1239 -280 -6076 -9096 -11828 -11761 -18708 -16576 -26810 -25648
5835 -25648 -21004 -17689 2788 17102 6948 1154 10324 1338 -3731 -1785 3393 4352 7928 10773
5821 10773 10683 14205 15464 10269 2118 -1731 -1720 8229 8906 -4916 638 763 925 745 8299 9139 16470
5804 16470 5267 3734 11808 5378 193 -4014 9727 16062 9844 1853 -12277 -17257 -3692 763
5790 763 -19477 -32393 -24094 -5265 -12637 -25408 -20710 -7282 3452 9988 2944 -5387 -9230 -16046
5776 -16046 -14649 -21147 -13669 1806 2022 -645 -7060 -9884 -16114 -19451 -19331 -17911 -14150 -22558 -30631
5761 -30631 -26522 -26813 -25094 -32313 -25083 -2295 13609 8916 10340 9818 5201 7336 2117 -1087 -4471
5746 -4471 -6862 -3505 1284 466 4773 121 1574 1674 5267 3832 8857 3751 -9215 -2525 4998
5731 4998 -6996 -6634 -1099 2183 2317 -4234 -4214 5090 7753 -170 -2527 -16535 -13166 -7200 -6379 -2369
5715 -2369 5583 -1861 -9306 -8772 -2475 2306 -1890 -18183 -24371 -21974 -17102 -16903 -16628 -11278 -9500
5700 -9500 13 -10315 -7735 -7069 2561 5508 -447 -7857 4074 4183 1382 -3733 -6962 14109 21577
5685 21577 -12679 -36640 -39465 -44312 -33712 -6038 10738 14817 -2928 -6454 -3560 -7787 -8611
5672 -8611 -12994 -15087 -13689 -5490 -14666 -7537 13067 19315 8905 -4237 -21885 -15902 -13132 -9267
5658 -9267 -4825 -10068 -12843 -20436 -25624 -26709 -27940 -29674 -30624 -27345 -10332 -6451 3708 10575 20302
5643 20302 14408 -626 4528 11904 9667 3337 -13357 -12805 -11946 6849 29198 14465 -8552 -16107
5629 -16107 -3308 7326 15712 2399 -6241 -6040 5562 -3309 -19047 -24561 -13455 -10113 -17682
5616 -17682 -24474 -35661 -45334 -52361 -36814 -14720 -4058 381 522 -6937 3688 5047 3978 3218
5602 3218 -1328 -3871 -1875 1074 5263 925 2739 14458 11552 5466 8045 661 6900 4015 -5870
5587 -5870 -1930 3828 -13056 -8880 -10642 -22609 -21882 -27067 -11987 -16233 -9685 7778 -688 -3933
5573 -3933 -2411 -596 -3332 -5310 7183 7164 -611 1397 8178 829 -10249 -2934 717 1188 1351
5558 1351 7651 -57 -12080 -10704 -19760 -17373 -4714 10621 17958 15256 -5245 -16763 -15143 -9498
5544 -9498 -16038 -12448 -16139 -6967 -4466 -3842 -4789 1904 -9076 -15045 -130 15277 16146 -3111 -14722
5529 -14722 -30156 -16043 16735 18161 6172 -8339 -3717 -2249 -12147 -7134 255 3715 8021
5516 8021 12071 14363 19471 7152 223 11986 16571 17550 22210 31635 24181 7946 -5447 -6016
5502 -6016 5247 10729 8068 14603 22803 19825 7379 11130 -1112 -7933 -5083 -1869 -5193 -2230
5488 -2230 6723 -756 -9915 -12818 -11724 -9211 -4567 11959 12966 5073 -12739 -9773 -4841 43
5474 43 1256 -2908 -12800 -7157 -7811 1941 3684 -1175 -19773 -31546 -14716 -573 13084 24273
5460 24273 25026 16931 5854 6018 15417 2975 725 11809 8537 7318 11456 11331 14893 16578 12388
5445 12388 18609 14402 2987 -2041 -5875 -8524 6717 -1479 -13784 -15906 -12875 -9747 -22906 -35390
5431 -35390 -20783 -12226 -567 -3563 -15899 -11576 141 6401 -835 8023 14491 20123 23292 18766
5417 18766 14464 12454 -1387 5352 8027 -3971 -11154 -23007 -19694 -27687 -21227 -9778 -736 3968
5403 3968 12919 10801 -2208 -7214 4587 10402 13748 7371 -1653 -4154 -1148 12369 14368 -3102
5389 -3102 -15492 -7436 786 -929 -4864 -18433 -27811 -25280 -15087 -5735 6344 15290 19901 14554
5375 14554 18581 5702 3615 -445 -13529 -33541 -53198 -50444 -43831 -18311 -7262 -5479 -6182
5362 -6182 6079 8827 -1947 460 -1672 -6177 -16879 -16471 -10597 -8593 3311 10079 5706 1008
5348 1008 -6323 -12400 -9460 -12320 -15839 -16544 -11896 -751 -3123 -12266 -12232 -3306 -10483 -5122 7461
5333 7461 7473 -1203 14058 28554 33149 23040 21932 10379 -2468 -644 14175 25393 20708 11097
5319 11097 5681 12796 5169 2837 4713 3455 -8792 -2816 2418 -4245 -9506 2359 3099 10533
5305 10533 16279 565 3751 11331 7213 3704 -3032 -7513 1881 16322 21783 27173 25777 13485
5291 13485 -11185 -14206 -2869 -5109 -9732 -18990 -27111 -34404 -29828 -32447 -29722 -27859 -24317 -15869
5277 -15869 -4059 5452 18973 1992 -4751 -14486 -16398 -1159 1131 -9501 -26079 -13261 9833
5264 9833 1758 -5519 -9472 -6235 -10186 -21844 -20341 -8160 -4914 -4383 -385 -3090 -2664 -4217 -285
5249 -285 1975 -1417 7144 4282 -6900 -6385 -8297 -11569 -9214 -6938 -6438 -9620 -14841 -7470 184
5234 184 2796 -10972 -13443 -14996 -22855 -15638 -16844 -17114 2667 10680 -1140 -9327 -5045 -7784 -14715
5219 -14715 -13333 -23685 -34509 -28008 -8795 1328 3662 -297 1428 -17227 -28484 -24756 -14710
5206 -14710 -10663 -589 -6975 -18493 -19804 -14452 -5789 8798 12081 5501 768 12055 22993
5193 22993 24567 6493 -6271 -13892 -7846 -4860 -6915 -10838 -11529 -13971 -13080 -1040 -12386 -19739
5179 -19739 -18322 -12981 -6745 -12839 -19744 -11569 -4644 -3175 -7409 -7560 -4298 2343 8322 3265 230
5164 230 -5019 -4437 2147 -10050 -10369 -3339 4934 -6580 -15271 -2937 -10 9917 14378 5504 9805
5149 9805 11813 -439 -2079 -10314 -25522 -24557 -18763 -5039 -142 8043 -720 -10145 -10345 -9182 -10100
5134 -10100 -15187 -20918 -16123 -10966 -3710 7747 8363 11285 -85 -18164 -14997 -14155 -9331 -1439
5120 -1439 2025 -2433 -4860 -11535 -17719 -2581 -3041 -16038 -7964 1040 -13092 -20257 -19604 -15529 -1941
5105 -1941 -8739 -12891 -18784 -23032 -14917 -10455 -16256 -9483 -10818 -14677 -4279 932 -660 -9518 -5649
5090 -5649 6064 12568 10822 9650 4578 7126 -4218 -12963 1262 6318 6337 -7875 -13102 -2767
5076 -2767 -17109 -12012 -6010 -4815 5919 8025 7821 8338 -4048 -23177 -23724 -6488 4982 24835
5062 24835 26071 6861 2746 -3852 -8897 7359 7183 -5778 -6810 -17230 -3700 2681 -8581
5049 -8581 -17118 -16915 -7568 34 -12437 -11833 -9152 -13269 -12737 -14022 -9873 -6415 -3331 139 6075
5034 6075 284 -1456 -10375 -10416 -1551 14344 14821 -1881 -10588 -13902 -13965 -8282 2914 11994 5237
5019 5237 1468 -8125 -15077 -15669 -13659 -17918 -24592 -17699 5303 15001 11796 -4934 -21486 -21246 -12416
5004 -12416 2328 9749 12116 5990 5618 6200 1136 5132 19758 24004 2855 -5328 -801 1059
4990 1059 5309 17448 19754 17300 15015 16046 12510 18545 30471 24019 14157 6784 3870 10135
4976 10135 -408 -12590 -27956 -13218 2598 6341 10283 -1694 -10558 1263 12903 3663 6184
4963 6184 15671 30063 31125 15027 9329 11838 14716 5812 8817 1250 -3489 -7140 -12190 -13839
4949 -13839 -15417 -18162 -11357 -14653 -9733 3363 5265 3035 -14695 -24464 -24677 -13744 249 2290
4935 2290 9359 23192 16377 12493 3746 16499 20186 17324 6814 2193 890 -1717 2713 3046
4921 3046 -3371 64 5255 7847 -7607 -8311 -3767 -8618 -12391 -1412 8454 -1728 -16717 -11693
4907 -11693 -15939 -23049 -29094 -32818 -28926 -27399 -36500 -35678 -33968 -35068 -35168 -25308 -19963 -13846 -19553
4892 -19553 -28320 -13477 259 1143 9914 14769 6796 1444 -6062 -10524 -10526 -13256 -10957 1080 10280
4877 10280 4732 1329 3838 4746 -791 363 -2997 -3256 -7523 -14085 -4214 3003 -3431 -7775 -11620
4862 -11620 -5585 897 1179 3882 3873 1095 -5125 -2741 -7763 -6343 -2694 -8351 -15461 -23150 -35542
4847 -35542 -9747 15443 24396 27799 15796 2435 -14120 -12388 -8783 -1239 3450 9086 2844
4834 2844 -9287 -11413 -14822 -16947 -24612 -23556 -4828 958 6035 5642 -10611 -21887 -5959 2363
4820 2363 -3439 -2158 -10992 -5384 1231 -2720 -5217 -7650 -14050 -9156 -649 -272 5691 10821 -2914
4805 -2914 -2911 -8000 -10762 -15753 -17825 -4382 11947 10475 -3711 5157 9380 9345 18338 21910 31533
4790 31533 15415 -11183 -13737 -9142 8338 13920 16260 27887 16992 -8097 -3027 5682 10779
4777 10779 15244 7749 -6574 -12100 -18903 -19112 -10687 -11491 -18155 -19591 -21260 -24395 -12960 -1830
4763 -1830 -1809 7427 8297 2590 14152 21173 11351 522 4083 16053 13954 15348 21890 19942 16614
4748 16614 12889 29017 43595 40736 27150 26328 6644 -13409 -2137 -6348 -8336 -2750 345
4735 345 -12393 -8765 6731 12535 8234 758 923 -9808 -24685 -30194 -32998 -24004 -25651 -13174
4721 -13174 -2467 -7098 -10762 -9776 -12762 -16861 -21001 -18421 -23003 -18890 -2789 10455 13730 6832
4707 6832 11793 19978 14334 2256 5368 11143 21626 26490 17620 14421 3142 579 3352 6877
4693 6877 15113 17879 12395 -3478 -5695 -5096 -16426 -21810 -14981 -8892 -5072 -11080 -1661 1938 10087
4678 10087 8681 16914 18593 11775 -1261 7725 17316 16690 12209 11643 15430 15569 27263 23437 14559
4663 14559 9777 13290 18941 5176 4128 6176 1926 9128 6744 1170 5654 5183 -12921 1288
4649 1288 13820 10391 -3614 -4200 7462 6885 11184 8681 9296 -948 -7974 6057 -4127 -6288
4635 -6288 -1168 5935 7017 1827 -7300 -10478 -9227 338 3738 3530 -2513 -15218 -20300 -6333 -244
4620 -244 -8863 -12156 -7035 -3428 -389 -10630 -20409 -28869 -29316 -28039 -31025 -10604 2728 -3869 -5925
4605 -5925 -8685 -5282 -644 349 -4028 2682 4848 -375 -6394 -9304 4384 13606 18782 9939 -2418
4590 -2418 -430 12355 3079 -207 -1206 -4436 -567 7509 13493 13939 -2033 -8377 4170 19914
4576 19914 25327 27204 18379 5970 -2005 -1293 -1357 195 -1566 -10741 -7033 -13911 -20020 -20256 -17257
4561 -17257 -8729 -9442 -9773 -8075 -9876 -4180 -2070 -2906 3478 27856 32716 19642 14789 14409 14364 1198
4545 1198 -8857 -9908 -3936 -8395 -18139 -14492 -7971 -22665 -23734 -9614 4692 7563 1312 -5567
4531 -5567 2230 -11525 -5192 -3356 -7786 -2883 2425 8740 9910 4781 7332 10366 20988 26058
4517 26058 18580 16310 9737 11719 308 -9043 -6172 15481 13754 -2822 -15827 -17185 72
4504 72 7787 1154 -528 -5536 -17776 -18288 -15642 -9418 -9759 -14672 -7893 4093 14637 27710 15463
4489 15463 16399 18114 24281 18605 13836 12993 14471 9504 8376 5325 -4940 -7885 11494 24907
4475 24907 16514 12396 3863 -7222 -19772 -26028 -18220 -3790 -117 -4482 -18381 -14257 -18081 -21174
4461 -21174 -5431 -3698 -6595 -60 -4762 5172 -5513 -6973 1251 1705 -5628 -11499 -14738 -16662
4447 -16662 -20312 -27085 -12235 908 -694 -11244 -20727 -17577 -15999 -11298 2221 6088 385 -4419
4433 -4419 -20574 -30791 -22677 -12313 -3209 -2267 5780 5666 -1892 -3530 -5081 1003 2597 -8020
4419 -8020 -9008 -6731 -4015 -11103 -16473 -4317 -8987 -12674 -7613 2979 828 -574 -4047 810 6205
4404 6205 2664 -18658 -28859 -15538 -1885 6348 -1447 -455 -1706 2307 -11004 -26939 -8636
4391 -8636 11469 3826 -2963 -1160 6021 6864 12575 8628 -72 -10261 -22042 -10957 4493 21445
4377 21445 41722 37869 23155 7670 5141 7669 2528 -4634 2242 13773 29250 16014 6942
4364 6942 5574 8742 10523 15294 19018 14347 5879 7753 17139 15679 9613 6503 17024 27789
4350 27789 16370 -8686 -6259 -9852 -8507 -14115 -11381 -3790 -7380 -25105 -22898 -13854 -13612 -13154
4336 -13154 -7361 -7460 -350 9434 4863 -4376 -5582 -10094 -5483 7133 13071 16640 11661 6981 -89
4321 -89 17301 30699 40063 40525 20227 10514 14148 7250 1507 -3085 -7898 -10263 -9245 -20209 -29665
4306 -29665 -21776 -23196 -12054 -8303 -644 274 -6139 -9168 -17758 -22735 -21119 -1931 5668 10574
4292 10574 6796 -115 8333 -8083 -8264 -6942 1063 6261 5939 -267 -1502 -5010 -16971 -23938 -18920
4277 -18920 -6091 10089 4837 7616 6617 8904 -463 198 3883 -3608 -5696 614 3722 5665 6114
4262 6114 -5335 -8399 -5712 8388 22870 18294 9757 887 -4921 -15226 -1397 8275 5052 147
4248 147 -4723 -3984 8681 11853 2572 -4592 -5807 6187 9738 13506 13748 3131 -3501 -4214 12887
4233 12887 18493 7371 386 -5107 -16140 -5878 6635 -3202 -2829 4705 9138 11358 -2533 -3760
4219 -3760 -5350 -10619 -9280 -16649 -21183 -10563 -6374 -7412 -9030 -2345 5317 2770 8157 12665 6173
4204 6173 -165 2740 10827 12653 -3087 -8879 -13820 -14621 -1936 3257 -14778 -12908 -10920 -15298
4190 -15298 -13691 -24174 -26746 -18267 -4656 6712 5340 6438 10173 3466 -4437 -3933 -3414 7154
4176 7154 14065 15537 18356 22546 18956 14938 4860 -8280 -10482 2681 7297 9761 15413 5441
4162 5441 -8344 -1959 10344 11607 7940 7815 -13532 -16139 -3367 -7435 -17390 11390 17743 15820
4148 15820 1004 -2764 12183 11574 3824 2030 9029 19395 9631 193 -9245 -10602 -1043 9103
4134 9103 9919 8176 6606 7050 5965 5858 -2656 -10026 -12010 -9366 -6235 -13614 2381 14617 2927
4119 2927 8361 7707 8354 18575 9300 -1819 -13210 -14682 -7677 10971 12233 4718 465 4904
4105 4904 3241 5392 5624 2007 403 -1610 -10210 -4471 -1080 -5456 -15532 -16900 -13979 -5890 1295
4090 1295 -2144 151 3732 -885 -1812 2427 10314 21834 23506 5331 13315 25026 19749 4382
4076 4382 -8103 -5180 -10049 -5952 -826 -11659 -16904 8919 4143 320 3358 3699 1618 3867
4062 3867 37 1633 -7898 -1675 -6984 -15108 -8905 7191 20325 21809 5252 -8419 -8585 -8313
4048 -8313 -411 -3397 4135 6128 10104 6391 -6773 -19850 -16453 -794 7583 -2227 -1383 -18077
4034 -18077 -30028 -32172 -33428 -27867 -17635 -8860 -129 7918 10496 2146 -1482 2680 10380 14538
4020 14538 21762 18064 17645 13505 9010 5213 12106 -602 -5493 -4385 -2182 1437 3186 20489
4006 20489 22935 21479 23297 11674 3538 -9537 -17796 -19555 -19083 -12562 -3374 2161 -6815 -7180 12122
3991 12122 10691 6119 7378 13696 16241 5160 -13635 -15455 -11056 -5948 7923 3871 5803 9302
3977 9302 -921 5662 7166 -4662 -3 -6285 1634 18233 19330 19303 15746 13466 13239 8874 3856
3962 3856 8148 7809 13627 9553 -6776 -16612 -21722 -15741 -4240 3942 11625 12273 3891 9455 16796
3947 16796 10814 16888 14862 886 3628 11954 -4643 -12321 -8764 -8747 -13020 -18731 -27942 -12247
3933 -12247 2402 6130 5149 23272 26179 17894 4536 6182 8178 797 -10458 -9911 -1070 188
3919 188 4282 16776 9299 12733 18064 13995 1632 -12586 -8274 -17724 -8514 -4341 7557 10775
3905 10775 3570 8112 13088 13685 3833 7142 19338 17599 -29 -10331 -13545 -9124 1918 -418
3891 -418 -3102 -464 -14430 -1390 -13244 -21742 -16166 -10374 -20994 -20688 -13542 -1759 12635 13210
3877 13210 887 -8212 -8100 -7698 13962 11262 5985 7775 1195 -3215 6107 13425 12876 16096 17324
3862 17324 21703 26652 28164 23084 23206 24446 11186 -2883 4557 25439 25849 19826 13930 6459
3848 6459 5004 -1074 443 -2524 -1071 3958 1121 -11763 -29952 -29400 -30634 -17848 -5086 6172
3834 6172 9852 15601 9245 -5601 -10402 -16167 -6346 13864 12389 8034 -9533 -30276 -32330 -29332
3820 -29332 -43828 -36303 -16904 -5393 5161 6199 9054 7107 9371 -477 -5478 -2481 10359
3807 10359 -1551 -12692 -10980 -7224 -9601 -4608 -6227 -8306 -4253 3733 13860 15793 12655 7167
3793 7167 9047 6732 -8267 -14579 -9742 -4148 6378 -6349 -8646 -9670 -5586 -3573 -6915 -3219
3779 -3219 -7146 -12932 -2854 7671 3158 -1524 -7318 -1187 3504 -341 -7677 -19921 -23807 -5117
3765 -5117 15577 13595 12776 -6127 -6105 13604 13953 10616 2990 -8264 -11223 2042 8377 9439 -2012
3750 -2012 -7926 -9035 -4213 8869 7729 3108 4653 -8352 -17050 -6457 -8435 -3462 18112 24451
3736 24451 16315 10528 5603 -5424 -8016 7104 15540 19169 19043 9847 5322 11280 12911 -2168
3722 -2168 -6464 -6660 -13888 -3670 3326 3228 -1004 -1153 -2657 8032 8688 24275 29719 17125 11322
3707 11322 16165 14820 10739 8379 10995 14162 20568 18083 3244 6271 2479 584 4076 -4519
3693 -4519 -6074 834 7367 4109 -1837 510 5035 1148 2286 17743 18487 17745 10396 -6928 -10164
3678 -10164 -10057 -20400 -15991 -12531 -6654 1439 3070 5733 12260 3033 -4548 1295 -4309 -8863 -1654
3663 -1654 8039 3178 2345 -2734 -4431 -8886 -28490 -22685 -14229 -7021 2783 -1564 -15803 -20784 -29789
3648 -29789 -31234 -29572 -23612 -19784 -11435 -11199 -12606 -14698 -18385 -21935 -12684 -11860 -16309 -17343 -19820
3633 -19820 -12231 -2213 -4656 -14213 -13952 -19032 -7722 -5140 4495 10504 5669 12487 25426 32879
3619 32879 20880 21298 19799 12299 13907 23804 19894 12367 3940 6755 9993 -362 -8537 683
3605 683 -366 -4405 -3068 -5442 -10753 -3465 10001 9411 3389 4416 15827 16367 5232 -3548 -1044
3590 -1044 7590 6148 10768 22212 29314 11535 -9413 -18881 -31997 -31475 -24622 -28377 -26361 -9377
3576 -9377 -17790 -16145 -15027 -909 7356 -584 -7673 -6694 9721 14388 10748 7270 1184 4427 11107
3561 11107 14749 1705 5677 12615 21544 19942 14468 1339 -12778 -7939 -925 4384 6371 -1021
3547 -1021 -4638 -9779 -3586 -4069 -9053 -11566 -9821 1221 9487 18230 17341 10812 8567 12571 15934
3532 15934 14687 7930 13818 8791 3254 -3095 2144 3729 1876 9907 20251 13418 -6609 -14242
3518 -14242 -5031 -1291 5198 12585 14938 3088 -6890 9568 24903 9875 -33 8214 11922 10731
3504 10731 6672 11938 13682 4316 -6092 -10747 -5438 -1459 5092 7368 3019 3240 8363 4037 -2485
3489 -2485 3556 2926 -916 5 -12477 -13316 -136 -11419 -14031 -7339 -4038 -3006 11685 16256 11404
3474 11404 4357 6128 4608 9923 15420 24530 16896 17347 15404 16497 17799 18575 11844 12495 4831
3459 4831 -7482 -13891 -7313 396 -4796 -7563 -5694 -2299 -13124 -14037 -9591 860 15997 27799
3445 27799 22415 26857 39879 25652 12324 -4886 -5995 -87 -4535 -6120 7710 13812 16272
3432 16272 30493 17583 -3737 -2210 -2227 -6119 1560 15292 26618 29356 23015 24209 22911 26683
3418 26683 27171 25106 27162 18357 11347 6246 -5475 -6578 704 -5277 -3897 1148 405 667 12659
3403 12659 13798 7225 -7886 -69 -8304 -7175 -12734 -15422 -14496 -11277 -4575 58 2067 145 -7465
3388 -7465 -7036 -6102 4911 809 1906 10395 9946 -2329 -3524 -7191 -10023 -17219 -18586 -5589 -2149
3373 -2149 -706 5886 10349 8236 4446 1441 5109 4583 -1733 12531 20059 6712 2530 2904 5330
3358 5330 14000 23443 6072 -9792 5903 13310 13585 703 -16469 -10087 4545 7063 4288 15459
3344 15459 28021 24114 23666 33008 34599 26531 33547 24707 14492 9285 8650 16114 8374 -5993
3330 -5993 -5035 -10922 -16679 -26752 -28740 -20819 3045 17318 3758 441 6511 16857 19652 -1237
3316 -1237 -25349 -22704 -11327 -5980 -2884 -14262 -12831 -9344 -5005 7834 8334 10349 10189 7675
3302 7675 4504 11307 14509 20685 9620 8133 16764 23415 13944 7619 -578 1152 12835 11054
3288 11054 4210 -2327 6892 14611 20930 14078 17544 13865 9588 1214 -4941 -9689 -13806 -12779 -37
3273 -37 12001 29471 26364 13874 8789 -712 -8870 -7760 -11405 -15586 -11418 -18757 -17145 -749
3259 -749 -7373 -6426 -2633 14283 11478 6553 -2050 -7142 -1070 -7289 -11026 -5410 -8715 -7525 -11087
3244 -11087 -3688 1607 -9498 318 7487 20557 17437 9068 12252 15602 13627 -8143 -13383 -15134
3230 -15134 -14174 -14961 -6370 5930 2393 4739 4251 11205 -663 -14173 -16372 -19373 -6182 2056
3216 2056 10836 10700 5221 9103 7484 13639 13556 10261 4505 17788 24930 11975 8283 8255 1217 2412
3200 2412 -4512 -6627 -6567 -18387 -22439 -21044 -7610 -3296 4357 15234 15624 4341 -4635 -18441
3186 -18441 -14108 -1602 8482 1058 3042 -2274 -8399 -111 1965 3919 15330 15898 10920 11132
3172 11132 4233 2933 -4811 -8567 5114 -8452 -5024 10546 19432 19320 5299 7038 -2504 -14815
3158 -14815 -18954 -23630 -25041 -15356 -8558 -7166 -1169 7549 7296 9734 14563 17937 4390 -13194
3144 -13194 -20711 -13301 -4108 -4342 -8608 -1168 4946 5677 10478 4144 -7047 -5923 681 6416 2023
3129 2023 -4770 4123 1714 4003 19473 5239 12124 19391 17551 19513 1438 -1060 -4726 -7134
3115 -7134 401 -10247 -4500 -4938 -5685 -8417 -25659 -22021 -18370 -6246 2231 7801 1952 -923 11589
3100 11589 12911 5511 9429 5337 -4042 -19286 -23048 -10747 1738 2552 -9039 -11697 -5416 4193
3086 4193 -460 -1798 -4781 8553 8513 2118 -1689 -7110 -10932 -13162 -9072 5131 15394 -972
3072 -972 -16952 -23565 -12832 -6583 -17138 -21748 -9872 6154 15585 13610 9766 7708 13375 9262
3058 9262 -5788 -6293 599 -2336 -16320 -14594 -26761 -33749 -37165 -46848 -40654 -27079 -9972 2508
3044 2508 2738 -227 -10106 -6914 -4871 -9803 -15219 -3739 4888 8459 7201 -6002 -4745 448 191
3029 191 3957 5711 -3827 -610 902 3095 -17284 -15352 -6622 8546 23395 19123 11143 2004
3015 2004 -7001 -14322 -16561 -16729 -3250 -1022 -9454 -16886 -24264 -28214 -12525 -2001 248 -1506
3001 -1506 -4096 1111 -1224 -5523 -9216 -6456 2789 13931 8596 6012 10023 19278 20945 20882 3992
2986 3992 -14908 -9227 -8664 -11087 -1757 7274 11413 -3288 -11487 1490 12360 22046 22964 1291
2972 1291 -6346 -2083 5288 731 -4108 -13632 -6825 5816 3447 -1057 -6028 1447 1005 -1715 -2009
2957 -2009 8509 10934 9768 2792 -395 -5655 -16189 -11780 -14591 2459 6444 -749 -9693 -17195
2943 -17195 -20132 -15262 -13554 -14920 -7298 -9434 -9172 -7630 2484 1990 19762 33009 31600 22411
2929 22411 23544 18394 17456 13967 4475 -1934 -7466 -314 10166 12747 11387 2800 -12035 -8202
2915 -8202 -9386 -9734 -10859 -19299 -18777 -16722 -28038 -28353 -26938 -24408 -25310 -22612 -12777 -4013 5153 7445
2899 7445 2436 2457 467 1859 9977 3877 -527 12890 5918 -3392 -2051 -5923 2211 9910 8809
2884 8809 5255 4474 10148 12478 5227 11063 7059 -6151 -15949 -27970 -30865 -16928 -12860 -12080 -17345
2869 -17345 -18605 -15105 -6479 -3241 -3370 -4264 -14166 -170 10618 4953 725 10180 15553 11889 8194
2854 8194 -1760 -3669 -5785 -25705 -27381 -10718 6551 13581 1111 -9583 -15005 -15146 -9230 -3156
2840 -3156 -7665 -8194 -11580 -14170 -5721 -6088 6210 10814 9813 7466 12540 8321 12215 24667 24443
2825 24443 25583 17037 -4191 -14184 -9307 2192 17721 27097 16976 4914 -4092 -9792 -15054
2812 -15054 -26981 -21495 -9496 6090 10982 13002 8288 3896 6675 5494 -3400 -3595 -2245 6300
2798 6300 10808 1261 -927 -1968 -7346 -2086 12247 14659 4499 -8098 950 -12674 -12352 -9717
2784 -9717 -11991 -20019 -13717 5324 7051 12810 25195 31226 20783 18798 6773 -4501 4194 19624
2770 19624 26453 16697 4915 -4142 -8488 -5821 -2685 2715 3346 -2378 10903 2315 -6459 10061
2756 10061 10509 1298 -370 12611 7936 5185 17172 22324 11763 9029 6654 8812 4634 13223
2742 13223 12787 -530 7307 18495 20670 23330 24925 18924 17664 13916 16055 14313 20468 27701
2728 27701 22798 4749 4110 14044 6993 6790 154 -8211 -11469 -9808 -3516 -1447 -4181 -17032 -26510
2713 -26510 -10384 1531 5869 61 -286 -3568 2792 -6261 -13285 -22048 -19961 -7397 -15265 -18468
2699 -18468 -999 1185 -2110 3504 2818 -4095 -2054 -8306 -9712 6375 12888 21687 12975 -4871
2685 -4871 -12978 -16894 -2543 -1593 -6958 -5813 -5187 -9959 -9661 7542 15494 15769 11627 2652 -8756
2670 -8756 -11052 -4091 -997 2997 9713 123 -6431 -2048 -5526 7212 12862 16685 22480 12154
2656 12154 13068 8916 -8423 -8052 -11666 -14642 -15587 -14432 -11671 -25867 -28472 -15143 -13974 -17566 -23541
2641 -23541 -17623 -22422 -11132 291 8164 16271 15395 10072 14277 13874 13818 11609 6914 8706 4982
2626 4982 6299 13361 27241 30269 28922 18492 1814 968 -8945 -13127 -8562 -3376 -11521 -15506
2612 -15506 -15896 -19016 -7527 2155 9914 21804 39195 33325 16825 -2307 -18266 -10525 1315
2599 1315 15464 22042 5604 -2527 4508 18134 5562 517 9083 13653 -4615 -11733 -7235 -10193
2585 -10193 -28287 -9878 -2235 -10150 -1565 -5177 -4935 6756 16010 10540 -4867 -12191 -6451 1006
2571 1006 -2887 -3107 1827 16480 15436 22657 15841 8652 9911 -9603 -12282 -3247 -11041 -10086 6294
2556 6294 -1917 -3328 -5470 -7973 2348 2342 6023 12181 9093 2135 2057 5680 -1218 3541 10202 11107
2540 11107 12254 9790 7139 -3210 -13134 -16814 -12475 -3826 -11669 -18490 -19825 -6112 12324 12496
2526 12496 9836 3420 -8604 2366 19874 24857 23931 14701 831 -3562 -23740 -22298 -16576 -13891
2512 -13891 -1640 4095 -6029 -12310 -10899 7761 21781 20844 15025 15142 2807 1776 3270 617
2498 617 3636 8960 -4382 -1488 -3033 -2140 -4929 5658 -3933 -6384 6760 1803 3859 9273 11989
2483 11989 8418 -14148 -20980 -12673 -2383 11390 25592 21246 15113 7711 4823 11048 223
2470 223 -12500 -7496 -6866 -9062 -21450 -24921 -19548 -15715 -1158 9172 8406 -4364 -17419 -8727
2456 -8727 -14184 -15464 -14257 -15628 4682 5609 -4858 -13986 -13687 -14911 -11415 -12741 -6444 271 8393
2441 8393 8472 425 -680 -8458 -12651 -15171 -15058 -19577 -16427 342 13123 -1922 -9926 6274 5387
2426 5387 7529 -1656 -10887 -4956 31 -6853 1602 5276 8119 11099 2383 5263 4296 -300 7503
2411 7503 15049 26118 22553 4638 2133 5311 10873 10178 378 -1682 -515 -8405 -8115 -13453 -10628
2396 -10628 -15557 -9330 804 -2738 12108 19147 18927 25885 14244 -5893 -10666 -11768 -8101 -11287
2382 -11287 -13576 -20532 -16198 -7619 18 10676 10815 -311 3307 752 4245 15840 26171 29926
2368 29926 19440 3566 -3463 3545 18531 15092 12372 19393 4925 3280 -6239 -16807 -9484
2355 -9484 3801 19344 14535 15578 15333 9355 176 -1255 849 7200 22560 12722 9139 9873 -4010
2340 -4010 -1085 -496 11048 5602 -7641 8989 12459 1707 12892 20868 20080 17516 8055 22669
2326 22669 25089 28472 21472 34424 36869 40356 31143 23739 21659 10319 12032 8884 5162 -4592
2312 -4592 -3295 9586 16852 10075 -716 -15906 -11408 18337 20687 8909 4379 -2038 -10648 -24527
2298 -24527 -16754 -158 10263 15572 8126 -950 5347 3245 -3646 -3564 -3830 8634 15109 1775
2284 1775 4415 5679 18837 23350 11887 7135 -2734 -3812 3914 6488 3609 82 261 12337
2270 12337 -313 -1476 7862 7512 6249 5632 6622 14381 22162 16355 -10847 -20858 -18614 -20148 -4570
2255 -4570 147 -10075 -6864 1715 7614 5639 8161 5018 4570 7919 1546 -20425 -26804 -8856
2241 -8856 7321 2241 3826 -3574 5293 6768 11654 13657 17723 21260 21990 5408 -90 4003 4446
2226 4446 13114 7256 6010 17584 28203 28841 23224 14507 5626 1910 13470 10257 3407 -1692
2212 -1692 -4334 -12442 -11622 -4000 9517 10681 2030 2873 3877 3128 -6711 -3457 5223 -2456 8333
2197 8333 32064 38278 38485 33212 34693 38195 37831 37578 26822 17173 18997 23246 28382 29892 17037
2182 17037 25831 26042 25402 20407 17326 7886 4522 5469 17274 8194 -11414 -13677 -11398 4257 21815
2167 21815 15393 11050 15266 9156 -10816 -23867 -13721 -3238 -8796 -13796 -11742 -4766 5548
2154 5548 13483 21889 26249 17856 18980 15290 8482 4983 6074 3528 5233 9392 10218 9216 1745
2139 1745 -4640 -9775 1855 12617 12298 19650 23130 17221 16922 21895 27520 33379 41849 35576 18613
2124 18613 5070 -5997 -12291 -7823 -12680 -5519 11404 16378 5905 -4204 -1230 2102 -4048
2111 -4048 -9899 -8121 -5082 -9754 -2569 -700 2906 11533 13426 10124 6336 -4638 3869 13088 16116
2096 16116 10992 -1273 -9215 -17976 -18257 -11014 21 6084 13799 31523 49958 25598 5004
2083 5004 20108 20248 8637 16470 24842 18029 9607 -2830 -5634 -10536 -8975 -12794 -3393 6668
2069 6668 13818 21344 22970 14380 -4548 -9531 -4005 962 -8 -5548 -2023 -924 -8472 -7481 -8157
2054 -8157 -10873 -17658 -12934 -19272 -21830 -10448 -5686 -12151 -19821 -14339 -11509 -7917 1115 6624 -5518
2039 -5518 -10908 -10987 -7626 -5086 910 -3394 -10547 1989 15228 18430 24820 -2701 -17771 -6226
2025 -6226 1444 3928 -1578 -3928 2453 -13274 -16605 -9101 -13737 -10861 -9885 -4297 3884 3818 -551
2010 -551 -8645 -14167 -6558 6418 16468 19745 17072 17634 14465 11946 4409 7692 20612 21659 11660
1995 11660 11561 13746 21617 16152 22050 18046 14958 15242 14222 27655 19354 -6741 -1680 8341 10449
1980 10449 6331 -676 -5686 -11941 -23327 -21010 -13725 -17927 -13130 -2555 -6150 -1150 -7188 -17107
1966 -17107 -22593 -15646 -14774 -18207 -7499 7244 -2889 -13119 -2311 -364 -8581 -13479 2447
1953 2447 7083 6529 3447 2790 7725 3133 -4527 7692 9073 9921 -8062 -19423 -3512 2480 -3146
1938 -3146 -5439 1096 11130 24403 25990 22285 7206 6554 9719 26063 21854 2515 1403 -6389
1924 -6389 -10325 -8638 -3876 -1463 9918 6766 19491 14974 -6400 313 9574 5455 -5331 -13091
1910 -13091 -2926 6885 -1310 -8838 -7370 1879 -2393 -2902 -5228 -16895 -12636 13327 24268 13676
1896 13676 -4729 -15978 -7443 -775 -2848 2057 6278 -975 742 10100 3731 -9355 -2164 -4670
1882 -4670 -3342 -12634 -15812 -17773 -18157 -20261 -10225 -1465 12219 8105 1470 -1124 4125 2577 -7065
1867 -7065 -9383 -3151 2774 7824 6699 5900 3888 -18083 -23757 -8743 2215 1717 12768 25856
1853 25856 19392 4261 7605 5555 -2334 -15243 -18395 -15693 -20818 -18688 -19283 -12488 -8081 -12322
1839 -12322 -5972 -28 -4244 -4825 -1228 2899 -1467 757 7908 5470 5075 -4756 -9948 -11700 -12087
1824 -12087 -8493 -15973 -26564 -17242 -8567 4589 3988 -6611 -5838 4294 -4601 -7035 -18074 -13383
1810 -13383 -9694 -11913 -1705 1188 8950 6168 3798 8394 6939 -4762 -8860 561 4144 2679
1796 2679 -681 -7497 -14646 -3830 3061 9992 16240 8389 -2616 -1993 1620 -334 -2675 -2887 -3278
1781 -3278 17652 16382 1024 4970 1018 6543 456 -9383 -18456 -14999 206 4401 4902 -4655
1767 -4655 -10672 -10722 -12396 -1336 -2260 -3278 8018 11494 3211 -9311 -13107 -9788 -6886 -2532 6783
1752 6783 1237 -8022 -8404 -2201 9005 3816 14022 15963 10498 13303 11565 6955 14771 6962 10115
1737 10115 18996 4212 4689 22417 17469 6196 -4427 -9830 -2002 4907 6004 3013 -10150 -4044
1723 -4044 -5985 -9428 -13697 -10873 -3847 -4826 -9637 -18100 -9602 3336 8979 4881 -10053 -24450
1709 -24450 -21141 -24548 -10073 6208 7964 -7899 -12552 -10520 -17266 -22727 -10738 -7250 -25926
1696 -25926 -33734 -27559 -10695 4075 3757 -5829 -10194 2630 16113 5306 -2922 564 3249 25555
1682 25555 37238 38526 37309 33618 27417 17537 6353 -13732 -12460 -2938 -10777 -16387 -10314 -7510
1668 -7510 -3934 6626 7515 6121 2844 -635 -1044 -5176 -10282 -20721 -22098 -11038 -14708 721
1654 721 6037 -11629 -24445 -23515 -19097 -14614 -5222 4772 4295 -5882 8683 10611 4098 -4088 -8703
1639 -8703 6860 12007 3016 -953 6437 12606 13143 2172 1216 -4487 -5354 358 139 -5944 2003
1624 2003 -1619 -1047 5250 16096 18310 -3387 -17173 -7370 -1377 -3320 -8988 -7027 7772 16251
1610 16251 8328 9751 -3155 -16438 -24649 -19833 2148 7857 -636 -9388 -8929 -11748 -4133 7059
1596 7059 19875 17843 6137 14740 17759 17688 27427 12252 5555 -1180 -2144 -2607 -2750 -9375 -7264
1581 -7264 -6920 -4408 -928 331 -2558 9774 3958 -11282 -6636 3779 -12 -6720 4382 7423
1567 7423 4661 -1059 -2812 1567 7811 9578 2048 -2482 3930 12062 20124 19334 26336 6558 -2602
1552 -2602 -1600 -6399 -3845 3250 -3241 -1323 6911 -8139 -9783 -3711 -903 -10565 -10342 -1842 -5
1537 -5 -6723 -8774 -1020 4068 1642 -4679 -18242 -27014 -22242 -6652 4784 8803 24934 20880 12711
1522 12711 6155 1481 -6704 -20886 -19943 -1736 10937 9811 5599 1392 7770 10739 4523 751
1508 751 973 -10611 -19840 -16046 7144 21545 14926 6304 10847 6881 7412 19646 14260 18384 23558
1493 23558 10089 -3545 8319 23248 27775 25760 18012 9633 5529 9359 15533 11517 8700 9492
1479 9492 16427 8787 -3508 9255 18758 22497 18945 25367 18084 2023 2576 -11500 -13343 -7766
1465 -7766 -5814 -6358 -2422 -6612 -11069 -6597 -2700 11540 12837 7530 6664 5449 -10436 -7738 -6058
1450 -6058 -330 -8969 -7985 -5859 -6902 -7675 -4920 5933 11097 12600 15505 20526 20734 5074 2049
1435 2049 6320 -3754 -2162 5312 3796 1610 9809 16148 18018 16908 5284 9610 19473 15667
1421 15667 7614 -2387 -18595 -19723 -16823 -16844 -5436 4563 -582 -3248 -7893 -2818 1512 2403 4576
1406 4576 -1729 780 5920 -2480 -8736 -9532 -15190 -12491 -11658 -8919 -11878 -1263 15316 22312 24776
1391 24776 16022 6077 -13369 -29950 -15361 -8071 -434 -9249 -19985 -15674 -14115 -7935 -5061 9043
1377 9043 6597 -6751 -8128 -3931 -10238 -10520 -347 13163 28070 19974 11847 4822 -94 -2377
1363 -2377 2395 1410 -9677 -12311 4974 11747 3903 -4105 -18488 -14519 -3471 6440 530 -416
1349 -416 4233 -6382 -8936 -12327 -10582 -6410 -14603 -10842 -9136 -6030 -7465 -7969 2185 6812 12396
1334 12396 26954 23436 21800 20926 -2192 -8731 -10228 -9245 -2714 -2232 -507 6138 20863 17925 10244
1319 10244 -311 4643 20909 15631 460 -5565 -2130 5527 8140 16103 14601 298 -11370
1306 -11370 -1313 -8090 1289 3408 475 1220 -667 -12008 -6452 -17189 -7403 2841 693 -3152
1292 -3152 -1853 11990 9206 7829 9318 4696 -6903 7341 22576 9458 -791 -3469 -9623
1279 -9623 194 -5767 -14542 -4505 13002 27713 23895 18785 14508 12637 7665 3891 12414 7608
1265 7608 8946 8685 -4449 -10211 -7585 -6873 -3466 652 10729 7342 -1958 -4164 -3104 -5845 -11502
1250 -11502 5928 20576 16049 3052 2296 5970 8297 17051 18108 21532 14763 1069 -6007 3566
1236 3566 19184 27171 27203 24169 12700 -1595 -1675 2099 -3654 -14089 -12656 1933 6663 8058 -2764
1221 -2764 8214 22081 16934 3340 -7062 -1461 9194 3488 605 5691 887 -10514 -51
1208 -51 2105 3621 7693 19647 19896 16154 3126 11237 -4080 -24633 -25793 -34904 -32848 -17815
1194 -17815 -11529 1410 8303 11108 6434 -6155 -24562 -26986 -15337 -7063 -4951 5697 -115
1181 -115 -14024 -20378 774 8178 3046 6656 11611 13453 15147 15309 5250 -9437 -8265 12127
1167 12127 12105 -571 2076 9726 1327 6380 5437 3635 3198 -2186 -2574 -3425 -7399 6468 537 -833
1151 -833 371 -6508 2398 -9813 -11064 -3990 -5678 -7650 6250 5500 -261 1608 3249 5681 1417
1136 1417 -12891 -18131 -10209 -5637 -10464 -13010 -9409 -4919 -6699 -10297 -12682 -4825 -207 -4919 3117
1121 3117 3747 -13574 -11303 363 11325 13396 14385 16342 9539 8550 7089 -3850 -7726 4323
1107 4323 7400 1456 -6697 -6559 -15321 -16851 -11454 -8697 -15 -2625 -10768 1591 819 -11264 3157
1092 3157 10763 -3793 -6454 -9537 -19076 -14193 -8274 3620 6838 -3416 9355 19865 18415 8996
1078 8996 -2213 -3983 1098 -13020 1712 13374 -1609 -4129 -14039 -25289 -22504 -6410 -834
1065 -834 -10524 -13428 -10245 -1844 -5076 -6838 -17223 -20700 -14740 -15005 735 -403 -2437 12542 13693
1050 13693 21920 15160 17455 16261 19859 9113 -10008 -21385 -19638 -14399 -6794 -4128 3955 7238
1036 7238 -3843 -16009 -6376 6227 7633 16951 27467 7957 13568 29919 16258 21513 14455
1023 14455 5954 7128 22571 26673 21831 19955 25310 19059 13279 14471 6737 555 -1384 -2787
1009 -2787 1851 -12608 -25590 -19059 -559 -1568 -6062 -15795 -16072 -19469 -17408 -4294 1704 6970
995 6970 4992 2833 12722 2392 104 2287 -9619 -14240 -8426 -7872 -9117 3850 -4239 -18307
981 -18307 -6869 476 8947 -5663 -14683 -8768 -7365 -4769 -12058 -7573 9652 12168 11319 11755 10527
966 10527 1033 -3105 -3232 -11575 -7557 1054 7230 3742 -4280 -13989 -20057 -26686 -30521 -27459 -27915
951 -27915 -19694 -761 -1121 8586 27486 23457 23355 20113 9034 -9874 10132 7343 3968 -4005
937 -4005 -19888 -25643 -21199 -26665 -24144 1611 2046 3906 14135 1849 2955 8842 7685 10452
923 10452 3713 -2181 -7934 -5131 -8819 -541 3714 3325 9570 12400 6942 3686 12995 11791 7113
908 7113 3457 2835 -813 -3523 -3019 -19205 -26653 -25381 -25209 -10629 2092 8928 2142 16180 22828
893 22828 31169 22674 12940 16862 4076 -20662 -23539 -6610 3691 8029 20199 11318 -6920
880 -6920 -12511 15132 24767 4505 8736 11661 6406 -554 2683 11166 3912 -4062 2319 9861 16149
865 16149 3501 -14110 -9478 -5829 -235 2416 9579 13382 12634 5640 6861 2737 6429 13433 14325
850 14325 8013 5286 6848 1274 -4307 327 10163 2612 -7215 -11971 -14111 -11137 -9023 -12257 -17243
835 -17243 -20118 -9995 -6629 -13300 -7050 -2442 6168 9628 -5591 -8118 -2705 272 1546 7900
821 7900 4980 10765 14976 6599 -4063 1971 -5740 -9485 -13475 -5665 -5294 924 -9614 -3408 9171
806 9171 3354 -2050 -2639 -5816 -9629 -14358 -21178 -6230 4386 11376 7512 9730 -1542 -3951 -15413
791 -15413 -21334 -20384 -11669 -9446 -7561 -2678 -3191 -8772 -4720 -18138 -22612 -13137 -11465 -6331 -13604
776 -13604 -7134 -2704 3912 272 -12769 -13148 1568 13391 1624 -1396 -2779 -3126 -971 5933
762 5933 7645 -6962 -2845 13698 15679 7206 6136 4448 1186 318 -1690 -8838 -2175 1526 -1197
747 -1197 -1140 3693 -4808 -1839 6576 8958 7172 1133 -10218 -6032 -6680 -11190 -20917 -25040 -20339 -18436
731 -18436 -13616 -11102 -8363 -3203 -2392 -4613 -6508 -14828 -20423 -23427 -26937 -21584 -38045 -28943 -19464
716 -19464 -26239 -20823 -20560 -20785 -13839 -193 1728 8909 3034 6634 15714 19032 16861 6687 9850
701 9850 16432 11587 -7749 -8875 -8554 -14039 -21104 -16806 -8355 -9521 -12616 -11446 -6719 -10007 -16889
686 -16889 -16744 -14280 -9858 -8086 -23970 -29475 -24192 -2262 -1207 -7646 -1548 -10906 -14388 -5721 2790
671 2790 -3257 4378 22299 17565 6544 1206 9773 15850 13320 4073 -938 -7375 -12688 356
657 356 12281 5127 -607 -12149 -12682 4282 12937 3808 5499 8803 3278 7085 10959 4843 -6643
642 -6643 -13874 -14988 -11820 921 -6631 -6545 5982 14054 27612 28570 21545 8367 20797 18791 4517
627 4517 -8828 -1349 1897 3609 3002 -17395 -8767 -5768 -8449 8103 15696 15253 9531 -1602 -10498
612 -10498 -8007 -4244 -60 307 -11328 -10674 320 8754 5253 5865 -12134 -205 -2087 -6900 936
597 936 -464 387 2189 -4908 -7744 -6647 -13522 -14025 -934 978 -6807 -13276 -12116 -7433 -1502 639
581 639 4191 -8383 -7081 -9650 -25355 -28076 -17924 -8619 -1737 993 -11597 -14656 -24401 -15533
567 -15533 -13870 -13364 -20026 -22059 -25230 -20693 -13461 -12480 -20200 -22531 -23603 -7021 -4367 -4534 -9041
552 -9041 -643 1071 6609 6186 10161 7002 2516 -10588 -4425 -1118 -10661 -17798 -12953 -2797 -1494
537 -1494 -15200 -25621 -37342 -22850 -6660 3824 2004 17723 12968 -6125 -4845 -11092 -4103
524 -4103 2224 -10463 -18838 -22138 -26089 -26110 -18696 -9442 2443 -7407 -3433 -5547 -14518 2334 11964
509 11964 8205 11221 -2292 -13960 -11495 -19526 -2940 12049 20013 12991 2184 -8603 4096
496 4096 5525 6352 1677 -3160 -1609 -13007 -17136 -18215 -25521 -8263 -5172 -16135 -31911 -28859
482 -28859 -21456 -18857 -28490 -40063 -41983 -30079 -14125 -8094 -9972 -16240 -17043 -11942 -4287 -4318 -8269
467 -8269 -7759 2991 -4361 -32673 -35826 -25294 -19510 -7738 -3316 -354 3353 11394 -473 -8037
453 -8037 -8850 1278 9773 2127 -13038 -12206 -10270 -4687 2215 -6932 -9981 -6144 -3444 -5921 -2017
438 -2017 -3665 -6744 -11772 -4989 -2793 -9200 -27017 -27034 -11137 -2249 -9190 -20653 -6233 -4219 4415
423 4415 -760 3884 3045 -6868 -11693 -10668 -6004 -3221 -4448 -7295 -7737 -14736 -19428 -8649 -303
408 -303 -5574 7178 12856 1265 -4637 7507 16395 19103 23979 29733 28426 16706 6290 9225
394 9225 -443 -4733 5926 4439 2029 3960 4751 6862 9861 10654 12888 9842 6551 13007 22069
379 22069 8967 -1073 -6196 -11542 -14793 -9188 -9035 -604 11624 9280 9903 -7 -5086 -10515 -18091
364 -18091 -6356 3976 -7322 5279 18224 10888 -9634 -20594 -21770 -18097 -8909 -13877 -8193
351 -8193 -1991 3031 6233 11873 -757 -4634 -8533 -9638 -4013 1308 10688 15508 6730 5354 -1919
336 -1919 -15114 -14194 -8254 -450 5398 2769 2247 14781 18352 9866 9060 -1595 -15553 -14267 -21034
321 -21034 -20934 -19322 -16790 -12580 -18760 -6910 -5869 -14228 -29452 -23540 -3822 -1065 -9424 -9141 723
306 723 8135 4918 -536 -647 7462 12810 -2943 -19553 -22574 -17284 -16628 -5820 -8657 -11272 -18071
291 -18071 -36164 -32457 -20304 -10038 2656 4518 4740 -2276 -14907 -24904 -12588 -7579 -17830
278 -17830 -24531 -10387 -2191 -2119 -6020 -19544 -20107 -25954 -22536 -21202 -11566 -9785 -4029 14583 18580
263 18580 11614 -2337 -6530 -4348 -1468 -5923 -2769 1148 3634 2023 39 -12105 -24280 -22378
249 -22378 -16238 -10498 -14410 -14210 -4259 -12348 -6665 -632 -1857 3334 12551 4198 -1091 -8478 -12339
234 -12339 -23635 -20698 -16789 -16663 -16085 -20906 -39627 -38924 -36891 -37167 -28679 -18599 -13432 -3535 -1706
219 -1706 -12818 -21450 -24093 -20275 -5483 6791 1 2496 3428 1067 868 -3918 1603 9516 5612
204 5612 4374 1983 6552 11834 10007 -2394 -12111 -5475 10371 2913 -17622 -18396 -8670 -1095 6418
189 6418 8121 1224 -6025 -17305 -16342 -16248 -17267 -6446 -8435 -549 10511 11999 9169 14722 8801
174 8801 -2290 -7135 -8993 -17610 -10541 -4800 -4903 -13586 -13822 -11594 -3407 -8369 -11107 -17911 -18277 -10447
158 -10447 3045 2981 -5547 -11449 -14153 -11036 -4190 -4093 166 -2011 2042 12757 15946 6824 -5670
143 -5670 -10671 -11720 -12979 -11373 -21761 -18197 -19030 -17431 -12426 -9065 -3213 -7849 -8412 -14719 -25807
128 -25807 -24793 -22797 -11328 -9139 -11866 -1 -4422 -17231 -15817 -13999 -5568 5850 5822 -3346
114 -3346 -4256 4125 8544 5982 -17940 -20558 -8140 -6810 -13982 -21619 -16576 -8515 -8366 -3294 -1104
99 -1104 1742 867 -5429 -20559 -14477 -12183 -4039 -7752 -21111 -21788 -10647 -1145 -3884 -10531 -10771
84 -10771 3653 5782 4875 9049 12293 10397 8810 4822 13625 16358 11879 -2700 -38 1610 -1022
69 -1022 -9264 -11577 -5934 -8176 -10257 -9351 -2224 3339 5986 -2361 -17022 -17124 -10630 -3135 -3074 -9114
53 -9114 -22512 -19426 -7610 -6125 -2874 -5957 797 5763 1491 701 -1463 -5196 -2188 5388 181
38 181 -8326 -10633 -5250 -6789 -10117 -11623 -5882 -8917 -11436 -7701 -8808 -1411 3290 1251 3433 -3704
22 -3704 -3242 -1481 -16693 -30248 -28095 -31939 -26054 -17186 -18012 -18972 -4268 860 -5982 -10918 -7942
7 -7942 -656 -749 -5935 -3602 -1141 -11213 -8183
0 -8183
$$ Imaginary data points
##PAGE= N=2
##DATA TABLE= (X++(I..I)), XYDATA
32767 43584 38001 36153 38284 57775 58887 60032 66600 61039 50776 49355 56949 54827 55271 57401
32753 57401 58372 54896 50324 44302 48450 50908 48537 57380 61501 61494 62269 69585 67395 60717 66212 64349
32737 64349 67590 58030 55251 59534 64883 68724 67078 71841 69368 61423 56447 58808 54701 59501
32723 59501 63751 65077 68886 70955 72768 76693 74499 74889 71392 72785 77225 77816 76456 77800 73227
32708 73227 68804 71942 77857 81644 77239 79503 88738 96298 93593 87931 100645 102707 94678 84963
32694 84963 81548 79597 87191 91084 92612 85136 92735 101278 105990 99745 103909 116946 120586 113579
32680 113579 109994 109093 103830 97664 92845 96410 99545 91944 94097 103401 102154 96761 91188 92273
32666 92273 93258 98366 101637 98411 92273 102142 102826 91856 92945 94512 101331 110732 117464 124785 117165
32651 117165 107330 102585 107534 110852 101277 90558 98303 104793 106793 113305 116997 121639 130134 125079
32637 125079 118914 111187 103665 100245 104375 110278 111147 116198 116402 123677 115448 103809 100356 109115
32623 109115 113714 118659 116179 116560 113050 111085 110499 114265 124751 133306 132546 136716 137432 140477 143259
32608 143259 139539 136011 129876 127957 136801 145280 142003 142028 137417 135729 127056 120010 120766 122352 130577
32593 130577 131170 132409 141309 146006 148439 140550 146733 155848 151613 145427 144901 141778 145877 157338
32579 157338 152989 158458 160360 152334 144952 147119 157893 166879 167116 154332 144690 144606 148098 146517
32565 146517 154552 157278 154095 140314 139470 141278 134844 129995 136001 149773 154991 148584 152394 150633
32551 150633 153757 167690 165770 164057 170345 176561 173303 176086 168665 166176 170220 167076 182687 179277
32537 179277 170053 177992 176164 163336 155141 157107 156106 162275 176226 185410 189287 177382 170915
32524 170915 172324 168524 157016 145738 141837 150170 162425 164464 162741 165476 171582 177058 174814
32511 174814 177032 160764 161165 162673 167393 169947 171924 175938 176265 168951 174812 183724 189614 193387
32497 193387 197046 189251 174533 179251 194603 188790 180686 185214 182105 177754 179004 192967 195958
32484 195958 198901 191448 178906 184389 188840 191923 191451 185033 180870 175488 172569 184860 187473 191722
32470 191722 187418 183406 175757 173581 171724 176754 183634 178772 176227 178997 179242 181053 183360 180242
32456 180242 179196 179781 184142 187526 193977 204900 194024 196510 202432 204520 201050 195658 193500 195829
32442 195829 193024 195750 198825 190672 187584 204507 215231 227976 213044 197055 193255 186548 188963
32429 188963 192532 184201 187057 193280 196744 197202 199568 198997 209014 204659 196436 201029 216647 222049
32415 222049 219146 208179 199715 195030 203109 206838 217398 210760 198378 187342 195008 197649 187051
32402 187051 186336 189524 177105 170341 174721 168835 180706 201131 209038 202266 180165 182515 193278
32389 193278 196940 208443 218877 218562 214258 231336 249854 237863 231039 218829 214924 204079 197371
32376 197371 197389 206102 207134 202891 201633 186014 177462 178633 201806 205239 212600 217899 216466 201378
32362 201378 185984 190350 192363 200522 198463 196226 207224 207008 216456 218867 213449 210927 209239 209840
32348 209840 205340 198557 196487 184116 177422 188337 195800 199217 217361 224212 231933 230637 235274
32335 235274 233509 229403 236458 236950 233560 221089 213711 219168 217263 215478 229591 223653 211391 207666
32321 207666 210323 218681 211835 187725 183115 194270 201000 191555 199470 209699 214189 228447 217972
32308 217972 201251 188865 187212 207759 207298 201231 206235 205376 205736 202186 200345 200560 217054 216687
32294 216687 209267 221965 224343 213688 202148 202949 217774 225697 221587 216674 229159 233051 226807
32281 226807 224776 228064 219345 210688 224625 231734 233182 221629 222785 217124 211029 208431 211081 210232
32267 210232 216705 217490 210647 216230 203217 195505 198093 202509 217609 222314 210537 196174 198266
32254 198266 207023 209454 213669 221906 222199 210377 211217 211672 211765 204341 210192 210565 211323 231506 230102
32239 230102 225923 219617 217806 222146 231439 224198 230235 241476 233714 223125 225386 220131 217999 228768
32225 228768 228251 215949 227815 219049 208043 214060 217679 223268 228444 218953 217018 209932 224151
32212 224151 213162 202132 218060 225227 230125 231919 237129 220799 203466 203885 213783 212776 224628
32199 224628 219738 221273 221609 210492 204534 200688 214609 223000 233062 235916 230220 215346 209584
32186 209584 217305 235415 239737 242007 232176 229590 230228 219126 211476 214982 219869 227126 239386 239917
32172 239917 228097 219962 224786 220104 221914 233269 230606 223708 221740 222612 222148 228856 234516 223569
32158 223569 211057 212988 233947 246902 236680 224578 205871 187019 193461 207253 213960 211033
32146 211033 214518 218919 213156 204324 207307 210966 212973 212273 207571 209335 203517 211075 210269 219021 230452
32131 230452 229697 227636 215157 217964 219523 217432 223660 233867 230676 232764 243909 241209 247809 248445
32117 248445 235597 227541 214828 212120 225063 228936 220875 216530 220036 216114 219355 238693 226856
$$ [...]
##END NTUPLES=NMR SPECTRUM
##END=
