##TITLE=Analysis number 315499
Compound Code cc 33513
Book Reference 378/188/4
Project Code adrs
Chemist Name benw
##JCAMPDX= 6.0         $$ Bruker NMR JCAMP-DX V2.0
##DATA TYPE= NMR SPECTRUM
##DATA CLASS= NTUPLES
##ORIGIN= Bruker BioSpin GmbH
##OWNER= NMR
$$ XWIN-NMR		Version 3.5
$$ Tue Nov 22 09:49:57 2005 GMT Standard Time (UT+0h)  MAYBRIDGE\NMR@NMR_250MHZ
##.OBSERVE FREQUENCY= 250.131544655141
##.OBSERVE NUCLEUS= ^1H
##.ACQUISITION MODE= SIMULTANEOUS (DQD)
##.ACQUISITION SCHEME= undefined
##.AVERAGES= 16
##.DIGITISER RES= 18
##SPECTROMETER/DATA SYSTEM= dpx250
##.PULSE SEQUENCE= zg30
##.SOLVENT NAME= CDCl3
##.SHIFT REFERENCE= (INTERNAL, CDCl3, 0, 16.522)
##AUDIT TRAIL= $$ (NUMBER, WHEN, WHO, WHERE, WHAT)
$$ ##TITLE= Audit trail, XWIN-NMR		Version 3.5
$$ ##JCAMPDX= 5.01
$$ ##ORIGIN= Bruker BioSpin GmbH
$$ ##OWNER= NMR
$$ C:\u/data/dgb/nmr/ADRS/12780/pdata/1/auditp.txt
$$ ##AUDIT TRAIL=  $$ (NUMBER, WHEN, WHO, WHERE, WHAT)
(   1,<2005-11-22 09:49:10.21 +000>,<MAYBRIDGE\NMR>,<NMR_250MHZ>,
      <created by zg, POWCHK disabled, PULCHK disabled
       configuration hash MD5:
       62 19 C7 07 E1 42 D1 B7 37 6C 3D D0 77 39 F9 E6
       data hash MD5: 64K
       1F 4B 8F A2 21 08 46 57 53 80 CF 49 7C C2 35 5D>)
(   2,<2005-11-22 09:49:32.17 +000>,<MAYBRIDGE\NMR>,<NMR_250MHZ>,
      <Start of raw data processing
       ef LB = 0.3 FT_mod = 6 PKNL = 1 SI = 32K 
       data hash MD5: 32K
       50 27 FD 27 F8 8C 4A E3 6A 8B 3E AB E9 9E 66 33>)
(   3,<2005-11-22 09:49:37.35 +000>,<MAYBRIDGE\NMR>,<NMR_250MHZ>,
      <apk 
       data hash MD5: 32K
       AF AE 89 B8 DE EA F4 FF B4 F0 FA B6 BF C0 9A 90>)
(   4,<2005-11-22 09:49:38.93 +000>,<MAYBRIDGE\NMR>,<NMR_250MHZ>,
      <abs ABSG = 5 
       data hash MD5: 32K
       F7 1F BD 04 26 F5 72 B9 7B BA 66 75 11 EC A3 32>)
$$ ##END=
$$ 
$$ hash MD5
$$ 01 BD 3A 38 37 CE 12 93 D0 17 4E 91 AB 96 CD 98
##$RELAX= 
##$RELAX= 
##$RELAX= 
##$RELAX= 
##$RELAX= 
##$RELAX= 
##$RELAX= 
$$ Bruker specific parameters
$$ --------------------------
##$DU= <C:\u>
##$EXPNO= 12780
##$NAME= <ADRS>
##$PROCNO= 1
##$TYPE= <nmr>
##$USER= <dgb>
##$AMP= (0..31)
100 100 100 100 100 100 100 100 100 100 100 100 100 100 100 100 100 100 
100 100 100 100 100 100 100 100 100 100 100 100 100 100 
##$AQSEQ= 0
##$AQ_mod= 3
##$AUNM= <au_zg>
##$AUTOPOS= <7 >
##$BF1= 250.13
##$BF2= 250.13
##$BF3= 250.13
##$BF4= 250.13
##$BF5= 500.13
##$BF6= 500.13
##$BF7= 500.13
##$BF8= 500.13
##$BYTORDA= 1
##$CFDGTYP= 0
##$CFRGTYP= 5
##$CHEMSTR= <none>
##$CNST= (0..31)
1 1 145 1 1 1 1 1 1 1 1 1 1 1 1 1 1 1 1 1 1 1 1 1 1 1 1 1 1 1 1 1 
##$CPDPRG= <>
##$CPDPRG1= <>
##$CPDPRG2= <>
##$CPDPRG3= <>
##$CPDPRG4= <mlev>
##$CPDPRG5= <mlev>
##$CPDPRG6= <mlev>
##$CPDPRG7= <mlev>
##$CPDPRG8= <mlev>
##$CPDPRGB= <>
##$CPDPRGT= <>
##$D= (0..31)
0 1 0 0 0 0 0 0 0 0.06 0 0 0 0 0 0 0.0002 0 0 0 0 0 0 0 0 0 0 0 0 0 0 
0 
##$DATE= 1132652948
##$DBL= (0..7)
120 120 120 120 120 120 120 120 
##$DBP= (0..7)
150 150 150 150 150 150 150 150 
##$DBP07= 0
##$DBPNAM0= <>
##$DBPNAM1= <>
$$ [...]
##$SUBNAM7= <"">
##$SUBNAM8= <"">
##$SUBNAM9= <"">
##$SW= 20.6930455092707
##$SWIBOX= (0..15)
0 0 3 0 0 0 0 0 0 0 0 0 0 0 0 0 
##$SW_h= 5175.983436853
##$TD= 65536
##$TD0= 1
##$TE= 294.16
##$TE2= 300
##$TE3= 300
##$TEG= 300
##$TL= (0..7)
0 120 120 120 120 120 120 120 
##$TP= (0..7)
150 150 150 150 150 150 150 150 
##$TP07= 0
##$TPNAME0= <>
##$TPNAME1= <>
##$TPNAME2= <>
##$TPNAME3= <>
##$TPNAME4= <>
##$TPNAME5= <>
##$TPNAME6= <>
##$TPNAME7= <>
##$TPOAL= (0..7)
0.5 0.5 0.5 0.5 0.5 0.5 0.5 0.5 
##$TPOFFS= (0..7)
0 0 0 0 0 0 0 0 
##$TUNHIN= 0
##$TUNHOUT= 0
##$TUNXOUT= 0
##$USERA1= <user>
##$USERA2= <user>
##$USERA3= <user>
##$USERA4= <user>
##$USERA5= <user>
##$V9= 5
##$VALIST= <valist>
##$VCLIST= <CCCCCCCCCCCCCCC>
##$VD= 0
##$VDLIST= <DDDDDDDDDDDDDDD>
##$VPLIST= <PPPPPPPPPPPPPPP>
##$VTLIST= <TTTTTTTTTTTTTTT>
##$WBST= 1024
##$WBSW= 4
##$XGAIN= (0..3)
0 0 0 0 
##$XL= 0
##$YL= 0
##$YMAX_a= 493865
##$YMIN_a= -473418
##$ZGOPTNS= <>
##$ZL1= 120
##$ZL2= 120
##$ZL3= 120
##$ZL4= 120
##$ABSF1= 16.522
##$ABSF2= -4.171173
##$ABSG= 5
##$ABSL= 3
##$ALPHA= 0
##$AQORDER= 0
##$ASSFAC= 0
##$ASSFACI= 0
##$ASSFACX= 0
##$ASSWID= 0
##$AUNMP= <proc_1d>
##$AZFE= 0.1
##$AZFW= 0.1
##$BCFW= 0
##$BC_mod= 0
##$BYTORDP= 0
##$COROFFS= 0
##$CY= 12.5
##$DATMOD= 1
##$DC= 0
##$DFILT= <>
##$DTYPP= 0
##$F1P= 14.0000005364418
##$F2P= -0.99999901652339
##$FCOR= 0.5
##$FTSIZE= 32768
##$FT_mod= 6
##$GAMMA= 0
##$GB= 0
##$INTBC= 1
##$INTSCL= 1
##$ISEN= 128
##$LB= 0.3
##$LEV0= 0
##$LPBIN= 0
##$MAXI= 10000
##$MC2= 0
##$MEAN= 0
##$ME_mod= 0
##$MI= 0
##$NCOEF= 0
##$NC_proc= -4
##$NLEV= 6
##$NOISF1= 0
##$NOISF2= 0
##$NSP= 0
##$NTH_PI= 0
##$NZP= 0
##$OFFSET= 16.522
##$PC= 1
##$PHC0= 81.94051
##$PHC1= 6.149533
##$PH_mod= 1
##$PKNL= yes
##$PPARMOD= 0
##$PSCAL= 4
##$PSIGN= 0
##$REVERSE= no
##$SF= 250.13
##$SI= 32768
##$SIGF1= 0
##$SIGF2= 0
##$SINO= 400
##$SIOLD= 32768
##$SREGLST= <1H.CDCl3>
##$SSB= 0
##$STSI= 32768
##$STSR= 0
##$SW_p= 5175.98343685301
##$SYMM= 0
##$S_DEV= 0
##$TDeff= 65536
##$TDoff= 0
##$TI= <Analysis number 999999
Compound Code 99
Book Reference 9
Project Code 9>
##$TILT= no
##$TM1= 0
##$TM2= 0
##$TOPLEV= 0
##$USERP1= <user>
##$USERP2= <user>
##$USERP3= <user>
##$USERP4= <user>
##$USERP5= <user>
##$WDW= 1
##$XDIM= 32768
##$YMAX_p= 493066236
##$YMIN_p= -364006
$$ End of Bruker specific parameters
$$ ---------------------------------
##NTUPLES= NMR SPECTRUM
##VAR_NAME=  FREQUENCY,     SPECTRUM/REAL,   SPECTRUM/IMAG
##SYMBOL=    X,             R,               I
##VAR_TYPE=  INDEPENDENT,   DEPENDENT,       DEPENDENT
##VAR_FORM=  AFFN,          ASDF,            ASDF
##VAR_DIM=   32768,         32768,           32768
##UNITS=     HZ,            ARBITRARY UNITS, ARBITRARY UNITS
##FACTOR=    0.157963299565203, 1,           1
##FIRST=     4132.6476996994, 0,             0
##LAST=      -1043.33573715361, 0,           0
##MIN=       -1043.33573715361, -364006,     0
##MAX=       4132.6476996994, 493066236,     0
$$ Real data points
##PAGE= N=1
##DATA TABLE= (X++(R..R)), XYDATA
$$ [...]
$$ plain form
18656 411746 361561 302648 270837 297762 307575 250454 214276 219862 199905 180993 273332 314548
18644 314548 349124 349897 288806 260957 300173 366059 391618 481383 586276 711441 861030
18633 861030 975816 1146828 1242499 1278248 1251026 1123628 1034483 974183 902232 875833 879856
18622 879856 1004851 1075082 1149592 1238414 1365927 1338328 1198658 1030966 874535 734502
18612 734502 591051 516350 467517 382843 346230 354167 382973 389886 360629 376391 413423 317182
18600 317182 253140 172025 151265 186224 208233 230195 220977 225550 244329 254740 258652 240732
18588 240732 190303 207830 223615 286626 317917 278289 267852 304150 286137 257836 222346
18577 222346 211982 207730 229278 201460 164090 173178 168094 126615 138903 207742 271149 286267
$$ packed form
18656D11746n0185n8913l1811K6925R813n7121l6178N586j9957j8912R2339M1216
18644C14548L4576P73o1091k7849L9216O5886K5559Q9765J04893J25165J49589
18633H61030J14786J71012R5671L5749k7222j27398q9145o0300p1951k6399M023
18622H79856J24995P0231P4510Q8822J27513k7599j39670j67692j56431j40033
18612G34502j43451p4701m8833q4674l6613P937K8806O913k9257J5762L7032r6241
18600C17182o4042q1115k0760L4959K2009K1962r218M573J8779J0411L912j7920
18588B40732n0429J7527J5785O3011L1291l9628j0437L6298j8013k8301l5490
18577B22346j0364m252K1548k7818l7370R088n084m1479J2288O8839O3407J5118
$$ plain form
18565 286267 279246 257539 248899 312158 347225 348709 320907 237975 217551 271800 291365 267945
18553 267945 228288 240088 332107 357116 387064 348570 284464 298960 357066 403875 406179 311528
18541 311528 269882 260281 272576 318614 291917 218153 172894 172964 255732 300504 322718 352314
18529 352314 412941 504011 490579 462479 462584 505044 548603 550375 572422 565534 531029 527230
18517 527230 523529 484497 462113 486239 475676 442708 385473 396817 426660 448065 454455 472241
18505 472241 485813 518142 530901 469960 427615 445001 499525 516445 471535 459725 472273
18494 472273 471528 512087 543699 541227 604691 599292 651898 634736 635760 647663 601701 543710
18482 543710 542631 581669 587884 640381 730060 796207 808197 889633 948410 987408 1047005 1069049
$$ packed form
18565B86267p021k1707q640O3259L5067J484k7802q2932k0424N4249J9565k3420
18553B67945l9657J1800R2019K5009K9948l8494o4106J4496N8106M6809K304r4651
18541C11528m1646r601J2295M6038k6697p3764m5259P0Q2768M4772K2214K9596
18529C52314O0627R1070j3432k8100J05M2460M3559J772K2047o888l4505l799
18517E27230l701l9032k2384K4126j0563l2968n7235J1344K9843K1405O390J7786
18505D72241J3572L2329J2759o0941m2345J7386N4524J6920m4910j1810J2548
18494D72273p45M0559L1612k472O3464n399N2606j7162J024J1903m5962n7991
18482E43710j079L9038O215N2497Q9679O6147J1990Q1436N8777L8998N9597K2044
$$ plain form
18470 1069049 1083207 1109397 1181981 1284214 1328631 1351092 1438542 1544638 1662489 1774370
18460 1774370 1945972 2138422 2284088 2333153 2408326 2615899 2697964 2618370 2615349 2661737 2694955
18449 2694955 2821884 3092986 3469393 3867753 4259869 4620732 5011324 5514431 6001214
18440 6001214 6480141 7167156 8129027 9416215 11144008 13473372 16141795 19396372 23858012
18431 23858012 30039357 39192503 53910888 74251465 90510027 100001881 110385656
18424 110385656 115629741 106195164 92123555 79991167 68698918 60659536 59757118 67337833
18416 67337833 82373728 95152519 101318496 108146790 110855280 99194300 82294728
18409 82294728 67060404 51944325 38266440 28856562 22975577 19145095 16428684 14403079
$$ packed form
18470A069049J4158K6190P2584J02233M4417K2461Q7450J06096J17851J11881
18460A774370J71602J92450J45666M9065P5173K07573Q2065p9594l021M6388L3218
18449B694955J26929K71102L76407L98360L92116L60863L90592N03107M86783
18440F001214M78927O87015R61871J287188J727793K329364K668423L254577M461640
18431B3858012O181345R153146J4718385K0340577J6258562R491854J0383775
18424A10385656N244085r434577j4071609j2132388j1292249q039382r02418P580715
18416F7337833J5035895J2778791O165977O828294K708490j1660980j6899572
18409H2294728j5234324j5116079j3677885r409878n880985l830482k716411k025605
$$ plain form
18401 14403079 12815835 11563756 10541065 9833952 9302223 8918451 8616407 8396950 8238047
18392 8238047 8103644 7918095 7829518 7826039 7871298 7914706 8126098 8538275 9133001 9935906
18382 9935906 11056667 12546210 14458407 16759432 19808644 24203761 30680040 41058209
18374 41058209 56354249 69959453 77465083 85153869 90754727 84977390 73919425 64276749
18366 64276749 55410252 48433479 46625260 51316504 62349743 73186219 78291841 83373992
18358 83373992 87013880 79504758 66138680 53981159 42042752 30739160 22764340
18351 22764340 17764843 14518969 12254893 10604806 9275883 8228986 7457017 6880112
18343 6880112 6434398 6032489 5778908 5598670 5305626 4934495 4569469 4240490 3920227
$$ packed form
18401A4403079j587244j252079j022691p07113n31729l83772l02044k19457j58903
18392H238047j34403j85549q8577l479M5259M3408K11392M12177N94726Q02905
18382I935906J120761J489543J912197K301025L049212M395117O476279J0378169
18374D1058209J5296040J3605204P505630P688786N600858n777337j1057965r642676
18366F4276749q866497o976773j808219M691244J1033239J0836476N105622N082151
18358H3373992L639888p509122j3366078j2157521j1938407j1303592p974820
18351B2764340m999497l245874k264076j650087j328923j046897p71969n76905
18343F880112m45714m01909k53581j80238k93044l71131l65026l28979l20263
$$ plain form
18334 3920227 3693633 3559867 3385828 3299105 3280080 3229126 3178332 3147720 3092420 3053472 3038453
18323 3038453 3172955 3554291 4106009 4736040 5301063 5838346 6452088 7127084 7821631
18314 7821631 8584160 9235090 9682321 9913379 9897988 9572762 9133316 8432225 7620827 6922300
18304 6922300 6210044 5424243 4629284 3914242 3278986 2865132 2508853 2183388 1969644
18295 1969644 1821378 1763771 1797926 1877517 1796582 1746080 1756982 1764413 1716721 1586137 1491861
18284 1491861 1456627 1488342 1489277 1515779 1546518 1534784 1491078 1572361 1639830 1638038 1573291 1578351
18272 1578351 1555767 1517640 1493759 1550735 1587955 1601999 1644035 1721488 1822071 1897784 1991584
18261 1991584 2137518 2305181 2451929 2666964 2832547 2951834 3116336 3235039 3435572
$$ packed form
18334C920227k26594j33766j74039q6723j9025n0954n0794l0612n5300l8948j5019
18323C038453J34502L81336N51718O30031N65023N37283O13742O74996O94547
18314G821631P62529O50930M47231K31058j5391l25226m39446p01091q11398o98527
18304F922300p12256p85801p94959p15042o35256m13854l56279l25465k13744
18295A969644j48266n7607L4155P9591q0935n0502J0902P431m7692j30584r4276
18284A491861l5234L1715R35K6502L0739j1734m3706Q1283O7469j792o4747N060
18272A578351k2584l8127k3881N6976L7220J4044M2036P7453J00583P5713R3800
18261A991584J45934J67663J46748K15035J65583J19287J64502J18703K00533
$$ plain form
18252 3435572 3599523 3695932 3837749 3989580 4188436 4479344 4805429 5168967 5550859 5879392
18242 5879392 6163007 6441287 6805761 7256465 7924543 8702816 9609546 10718287 12044846
18233 12044846 13622307 15520117 17953186 21161070 25697751 32228771 42016872 56352086
18225 56352086 73795470 90403669 104936114 118896278 130917863 140845482 154200229
18218 154200229 173659553 190848612 201243370 209655687 213204953 204675857 188650281
18211 188650281 174979273 162118788 147842598 135581773 125235320 111871924 94703072
18204 94703072 77565473 62148703 48623809 38022987 30548829 25486199 22013585
18197 22013585 19457032 17324937 15581680 14123919 12871704 11768670 10827280 10081785
$$ packed form
18252C435572J63951R6409J41817J51831J98856K90908L26085L63538L81892L28533
18242E879392K83615K78280L64474M50704O68078P78273R06730J108741J326559
18233A2044846J577461J897810K433069L207884M536681O531020R788101J4335214
18225E6352086J7443384J6608199J4532445J3960164J2021585R927619J3354747
18218A54200229J9459324J7189059J0394758Q412317L549266q529096j6025576
18211A88650281j3671008j2860485j4276190j2260825j0346453j3363396j7168852
18204I4703072j7137599j5416770j3524894j0600822p474158n062630l472614
18197B2013585k556553k132095j743257j457761j252215j103034r41390p45495
$$ plain form
18189 10081785 9398410 8724774 8148953 7608328 7069684 6539800 6024747 5545072 5096972
18180 5096972 4651598 4312831 4031647 3780804 3485058 3157056 2906698 2713051 2493541
18171 2493541 2340828 2203805 2135203 2066573 1920941 1794454 1711908 1699962 1656039 1641269
18161 1641269 1635158 1576418 1621622 1646661 1606728 1534676 1476864 1477741 1500568 1417052 1385671 1373222
18149 1373222 1309519 1238814 1246122 1221519 1205360 1200807 1178954 1193276 1196659 1200866 1187204 1156926
18137 1156926 1101354 1181683 1218879 1193474 1150938 1230807 1341190 1364148 1424586 1496397 1526457
18126 1526457 1572301 1711754 1846932 1945935 2124709 2400875 2757939 3147492 3585224 4082739
18116 4082739 4734134 5536124 6547070 7790393 9545411 12218198 16410165 23034975
$$ packed form
18189A0081785o83375o73636n75821n40625n38644n29884n15053m79675m48100
18180E096972m45374l38767k81184k50843k95746l28002k50358j93647k19510
18171B493541j52713j37023o8602o8630j45632j26487q2546j1946m3923j4770
18161A641269o111n8740M5204K5039l9933p2052n7812Q77K2827q3516l1381j2449
18149A373222o3703p0705P308k4603j6159m553k1853J4322L383M207j3662l0278
18137A156926n5572Q0329L7196k5405m2536P9869J10383K2958O0438P1811L0060
18126A526457M5844J39453J35178R9003J78774K76166L57064L89553M37732M97515
18116D082739O51395Q01990J010946J243323J755018K672787M191967O624810
$$ plain form
18108 23034975 34234488 54469995 85864319 102568851 94760603 82519573 68278548
18101 68278548 47651920 30602323 20917387 15410635 11989436 9663102 7976978 6656767
18093 6656767 5627338 4854171 4293299 3954073 3584845 3278144 3065323 2910738 2712936
18084 2712936 2490897 2342678 2175120 1996276 1819095 1684497 1545723 1347944 1220925
18075 1220925 1132890 1079732 1124481 1103601 991775 842294 728009 675028 652866 648654 611599
18064 611599 593005 564931 526166 524646 497499 461818 509027 550730 517972 492515 472758 429817
18052 429817 373578 384965 417808 395119 315398 336539 317592 314334 284614 300572 339295 328342
18040 328342 315669 306593 288126 273415 257233 273142 238497 221952 255913 165119 131660 201582
$$ packed form
18108B3034975J1199513K0235507L1394324J6704532p808248j2241030j4241025
18101F8278548k0626628j7049597r684936n506752l421199k326334j686124j320211
18093F656767j029429p73167n60872l39226l69228l06701k12821j54585j97802
18084B712936k22039j48219j67558j78844j77181j34598j38774j97779j27019
18075A220925q8035n3158M4749k0880j11826j49481j14285n2981k2162m212l7055
18064F11599j8594k8074l8765j520k7147l5681M7209M1703l2758k5457j9757m2941
18052D29817n6239J1387L2843k2689p9721K1141j8947l258k9720J5958L8723j0953
18040C28342j2673r076j8467j4711j6182J5909l4645j6545L3961r0794l3459O9922
$$ plain form
18028 201582 267334 248254 188197 185439 174200 151634 135589 165262 192089 168553 96290 93438
18016 93438 145016 188923 214164 244084 231627 212453 238993 219013 206044 184220 185984 236272
18004 236272 224434 146148 109309 154568 181705 182310 205366 270175 325805 301588 367364 481545
17992 481545 509435 478081 380924 351682 351268 317659 270705 217710 251129 292131 317477 270763
17980 270763 157082 145104 137256 187316 206864 167311 116674 86152 31096 75174 137532
17969 137532 121863 125502 163203 154863 169740 119167 152438 233791 243707 181646 160887 197302
17957 197302 162610 128851 162172 147634 101946 111742 199811 248607 205064 108244 80342 107548
17945 107548 93605 85042 75914 110054 154917 241090 294747 309032 383787 376266 350497 360640
$$ packed form
18028B01582O5752j9080o0057k758j1239k2566j6045K9673K6827k3536p2263k852
18016I3438N1578M3907K5241K9920j2457j9174K6540j9980j2969k1824J764N0288
18004B36272j1838p8286l6839M5259K7137O05K3056O4809N5630k4217O5776J14181
17992D81545K7890l1354r7157k9242m14l3609m6954n2995L3419M1002K5346m6714
17980B70763j13681j1978p848N0060J9548l9553n0637l0522n5056M4078O2358
17969A37532j5669L639L7701q340J4877n0573L3271Q1353R916o2061k0759L6415
17957A97302l4692l3759L3321j4538m5688R796Q8069M8796m3543r6820k7902K7206
17945A07548j3943q563r128L4140M4863Q6173N3657J4285P4755p521k5769J0143
$$ plain form
17933 360640 281535 235397 234951 252697 250332 247447 286481 294392 218692 187274 174081 179352 153057
17920 153057 123867 125455 50978 -8589 -28024 -8714 -552 -20983 -16614 -24931 -52286 -96339
17908 -96339 -65434 -63417 -89883 -94448 -83585 -95974 -82173 4995 13045 62408 181116 289724
17896 289724 406998 485617 544431 526940 506828 443096 395873 406507 380995 354338 322947
17885 322947 366544 483111 560105 589534 588005 639322 574633 482755 390830 323260 238986
17874 238986 198323 223960 268704 235384 119467 57305 101638 130936 120778 102077 128681
17863 128681 106693 112754 94591 89275 96368 207841 209022 136990 172553 231010 238111 217608
17851 217608 177128 95061 124791 135866 110491 101321 144229 235420 361206 485902 479171
$$ packed form
17933C60640p9105m6138m46J7746k365k885L9034P911p5700l1418j3193N271k6295
17920A53057k9190J588p4477n9567j9435J9310Q162k0431M369q317k7355m4053
17908i6339L0905K017k6466m565J0863j2389J3801Q7168Q050M9363J18708J08608
17896B89724J17274P8619N8814j7491k0112o3732m7223J0634k5512k6657l1391
17885C22947M3597J16567P6994K9429j529N1317o4689r1878r1925o7570q4274
17874B38986m0663K5637M4744l3320j15917o2162M4333K9298j0158j8701K6604
17863A28681k1988O061j8163n316P093J11473J181p2032L5563N8457P101k0503
17851B17608m0480q2067K9730J1075k5375r170M2908R1191J25786J24696o731
$$ plain form
17840 479171 515045 590538 530463 477661 379279 331126 262689 234198 346926 420514 419715 458757
17828 458757 452475 482377 469047 426042 396594 270224 207931 190574 191581 169107 141937 146834
17816 146834 181621 170111 146135 117739 112533 141672 142366 138610 112431 90121 48933 57307
17804 57307 94582 108116 93885 41243 23017 74411 174353 128125 63752 46671 67321 53039
17792 53039 60402 71039 33630 52416 115511 158712 200418 254667 331365 386042 387468 328430
17780 328430 312051 235165 286506 278961 290729 337585 323416 308214 233530 184249 187351 174957
17768 174957 196214 157272 148122 101004 47958 6909 -7695 -22626 -35186 -3853 42223 44415
17756 44415 25514 -18194 38700 -10109 -52783 49581 79716 55815 83420 89904 105665 110358
$$ packed form
17840D79171L5874P5493o0075n2802r8382m8153o8437k8491J12728P3588p99L9042
17828D58757o282K9902j3330m3005k9448j26370o2293j7357J007k2474k7170M897
17816A46834L4787j1510k3976k8396n206K9139O94l756k6179k2310m1188Q374
17804E7307L7275J3534j4231n2642j8226N1394R9942m6228o4373j7081K0650j4282
17792E3039P363J0637l7409J8786O3095M3201M1706N4249P6698N4677J426n9038
17780C28430j6379p6886N1341p545J1768M6856j4169j5202p4684m9281L102j2394
17768A74957K1257l8942r150m7118n3046m1049j4604j4931j2560L1333M6076K192
17756D4415j8901m3708N6894m8809m2674J02364L0135k3901K7605O484J5761M693
$$ plain form
17744 110358 135872 191425 178812 103008 -8698 21797 71313 81558 91175 69298 55060
17733 55060 59761 40227 86447 167972 161667 100069 55506 71520 40539 -15211 -45965 36744
17721 36744 63442 27002 55563 44545 -12791 -4314 56262 88863 16479 -28236 -12152 12602
17709 12602 -8498 11837 23101 -68132 -2054 57265 104292 48994 13862 -18309 19699 69126
17697 69126 39353 10825 2037 -10370 38175 62278 89384 107028 138057 135009 118425 87341
17685 87341 25850 34216 27200 -16287 -69970 -107484 -108692 -101248 -58611 -21128 -1758 57836
17673 57836 70071 25350 87188 114488 116230 51369 -8963 -2151 -2388 -14314 3363 1088 51687
17660 51687 69012 87909 63140 94193 132930 124620 42826 24361 67426 136739 164457 219397
$$ packed form
17744A10358K5514N5553j2613p5804j11706L0495M9516J0245R617k1877j4238
17733E5060M701j9534M6220Q1525o305o1598m4563J6014l0981n5750l0754Q2709
17721C6744K6698l6440K8561j1018n7336Q477O0576L2601p2384m4715J6084K4754
17709A2602k1100K0335J1264r1233O6078N9319M7027n5298l5132l2171L8008M9427
17697F9126k9773k8528q788j2407M8545K4103K7106J7644L1029l048j6584l1084
17685H7341o1491Q366p016m3487n3683l7514j208P444M2637L7483J9370N9594
17673E7836J2235m4721O1838K7300J742o4861o0332O812k37j1926J7677k275N0599
17660E1687J7325J8897k4769L1053L8737q310q1794j8465M3065O9313K7718N4940
$$ plain form
17648 219397 208505 166032 118336 131201 230693 356079 456379 611531 677602 664578 655285
17637 655285 703242 832479 953933 1046130 1113185 1193058 1165922 1062313 987711 920128 814389
17626 814389 709263 638044 562559 474183 392742 328210 234470 194762 114727 76323 102092
17615 102092 100391 54703 67108 105195 70692 40717 -28171 -34562 24276 36307 45807 49152
17603 49152 28676 59952 52505 8055 28012 53566 70068 92801 97476 84792 91463 80755
17591 80755 51604 76852 120586 103286 -18465 -88648 -25411 45021 36643 42506 28785 -10997
17579 -10997 -32792 -6070 17783 18824 71023 22383 -15391 -17237 -69334 -55006 -52593 -100678
17567 -100678 -146849 -126778 -93299 -48545 -36329 -73719 -55579 -44330 -77911 -63609 -61519 -59723
$$ packed form
17648B19397j0892m2473m7696J2865R9492J25386J00300J55152O6071j3024r293
17637F55285M7957J29237J21454R2197O7055P9873k7136j03609p4602o7583j05739
17626H14389j05126p1219p5485q8376q1441o4532r3740l9708q0035l8404K5769
17615A02092j701m5688J2405L8087l4503k9975o8888o391N8838J2031R500L345
17603D9152k0476L1276p447m4450J9957K5554J6502K2733M675j2684O671j0708
17591H0755k9151K5248M3734j7300j21751p0183O3237P0432q378N863j3721l9782
17579a0997k1795K6722K3853J041N2199m8640l7774j846n2097J4328K413m8085
17567a00678m6171K0071L3479M4754J2216l7390J8140J1249l3581J4302K090J796
$$ plain form
17555 -59723 -39003 -79617 -192314 -187150 -136838 -28681 -8435 -4521 -4619 -4173 2264 -57459 -56058
17542 -56058 -4694 -42159 9062 29352 15695 -59594 -92918 -45135 -20451 -7004 27680 50573
17530 50573 62556 37222 -5404 47340 56476 34312 19291 18305 -40005 -74493 -68529 -35780
17518 -35780 -35462 31660 63654 50454 -4687 -16214 -76350 -95758 -84545 -78529 -31298 -15262
17506 -15262 22273 10935 19096 -3715 -63794 16614 118592 103131 38102 -22432 -17620 -19545
17494 -19545 -4364 30491 -14984 -44601 -437 -23653 -37977 -24111 28048 77944 65847 7243
17482 7243 -24753 -12737 17636 18496 53340 29584 33441 82553 68451 49414 66296 61103 29958
17469 29958 -23957 17398 33726 10998 -14443 10059 -15734 -5178 36323 -11173 -38442 11526
$$ packed form
17555e9723K0720m0614j12697N164N0312J08157K0246L914r8M46O437n9723J401
17542e6058N1364l7465N1221K0290j3657p5289l3324M7783K4684J3447L4684K2893
17530E0573J1983k5334m2626N2744R136k2164j5021r86n8310l4488N964L2749
17518c5780L18O7122L1994j3200n5141j1527o0136j9408J1213O016M7231J6036
17506a5262L7535j1338Q161k2811o0079Q0408J01978j5461o5029o0534M812j925
17494a9545J5181L4855m5475k9617M4164k3216j4324J3866N2159M9896j2097n8604
17482G243l1996J2016L0373Q60L4844k3756L857M9112j4102j9037J6882n193l1145
17469B9958n3915M1355J6328k2728k5441K4502k5793J0556M1501m7496k7269M9968
$$ plain form
17457 11526 47375 -18895 -50825 10712 85275 102083 66464 -24945 -78245 -87976 -59146 -39526
17445 -39526 13186 11771 3175 70079 171751 323691 422110 377991 288985 211999 220131 176868
17433 176868 159472 81078 24899 30771 45520 46090 42876 -54470 -45910 26312 42924 38181 81754
17420 81754 49637 12426 -28456 -12187 17185 -6151 -73206 11451 45308 66928 80731 85536
17408 85536 82724 33846 -5344 15621 15007 4249 -19289 -31951 -13950 64910 95805 75632
17396 75632 69458 19665 13592 39091 88515 94409 92194 22971 -22573 -5403 -33315 -83861
17384 -83861 -89498 -5783 4278 7823 12403 40417 63477 21866 2749 31781 66359 59836
17372 59836 24190 25302 29349 42534 60016 67212 44606 34149 75558 107928 59752 -13939
$$ packed form
17457A1526L5849o6270l1930O1537P4563J6808l5619r1409n3300r731K8830J9620
17445c9526N2712j415q596O6904J01672J51940R8419m4119q9006p6986Q132m3263
17433A76868j7396p8394n6179N872J4749N70l214r7346Q560P2222J6612m743M3573
17420H1754l2117l7211m0882J6269K9372k3336o7055Q4657L3857K1620J3803M805
17408H5536k812m8878l9190K0965o14j0758k3538j2662J8001P8860L0895k0173
17396G5632o174m9793o073K5499M9424N894k215o9223m5544J7170k7912n0546
17384h3861n637Q3715J0061L545M580K8014K3060m1611j9117K9032L4578o523
17372E9836l5646J112M047J3185J7482P196k2606j0457M1409L2370m8176p3691
$$ plain form
17360 -13939 -39772 -40552 -1788 37746 11057 -5917 28444 -14037 -9329 -51854 -59702 -69604 -73004
17347 -73004 -82976 -67787 -24672 34926 34347 20340 -14056 -16727 -3818 -19599 -35958 -48145
17335 -48145 -30039 -29462 -62085 -67804 -27059 10346 -15920 -13456 -7508 -726 18787 53212 92355
17322 92355 91441 31753 -9124 -32833 -66320 -62612 -63858 -37222 -44154 -8693 17617 5696 -35711
17309 -35711 -82255 -64345 -15050 7826 -26282 -17186 40563 43661 60949 35480 -2705 -19632
17297 -19632 4719 7344 23698 63311 96524 38593 -46144 -45458 -41177 -63033 -10849 66196
17285 66196 81969 20896 38944 13925 46919 45846 3486 34354 92481 67105 9606 -57253
17273 -57253 -119904 -111068 -85880 -41755 16604 104518 112351 52151 -10456 32241 17765 1259
$$ packed form
17360a3939k5833p80L8764L9534k6689j6974L4361m2481M708m2525p848r902l400
17347g3004r972J5189M3115N9598n79j4007l4396k671J2909j5781j6359j2187
17335d8145J8106N77l2623n719M0745L7405k6266K464N948O782J9513L4425L9143
17322I2355r14n9688m0877k3709l3487L708j246K6636o932L5461K6310j1921m1407
17309c5711m6544J7910M9295K2876l4108R096N7749L098J7288k5469l8185j6927
17297a9632K4351K625J6354L9613L3213n7931q4737O86M281k1856N2184P7045
17285F6196J5773o1073J8048k5019L2994j073m2360L0868N8127k5376n7499o6859
17273e7253o2651Q836K5188M4125N8359Q7914P833o0200o2607M2697j4476j6506
$$ plain form
17261 1259 57285 95141 51457 22341 41930 57512 114954 129010 141845 53821 -9674 -28076
17249 -28076 -15430 5452 -108 69197 58328 34643 52143 39330 4244 12863 1434 -8990
17237 -8990 -90461 -79626 -53668 -44653 -40576 -66930 -27041 8119 -29211 -24262 14456 46169
17225 46169 37753 -32180 797 40266 -21043 -72109 -83365 -68342 -66155 -29716 -43378 -10109
17213 -10109 65531 68798 36080 43093 23236 33284 2702 17432 35209 14890 -30553 -22838
17201 -22838 -39875 -4500 38458 30653 -7892 -49111 -117063 -96557 -82464 -69078 -97529 -53619
17189 -53619 -16348 -11550 19019 -9752 12394 32946 51117 10349 33041 21712 30246 -15383
17177 -15383 -101117 -71722 -13766 50355 76232 123952 93374 76371 88665 97898 78965 70025
$$ packed form
17261A259N6026L7856m3684k9116J9589J5582N7442J4056J2835q8024o3495j8402
17249b8076J2646K0882n560O9305j0869k3685J7500j2813l5086Q619j1429j0424
17237h990q1471J0835K5958R015M077k6354L9889L5160l7330M949L8718L1713
17225D6169q416o9933L2977L9469o1309n1066j1256J5023K187L6439j3662L3269
17213a0109P5640L267l2718P013j9857J0048l0582J4730J7777k0319m5443P715
17201b2838j7037L5375M2958p805l8545m1219o7952K0506J4093J3386k8451M3910
17189e3619L7271M798L0569k8771K2146K0552J8171m0768K2692j1329Q534m5629
17177a5383q5734K9395N7956O4121K5877M7720l0578j7003J2294R233j8933q940
$$ plain form
17165 70025 58906 4904 -87095 -76409 -96827 -102376 -86659 -81422 -21871 15213 7372 5100
17153 5100 -7197 -20700 -45648 -49276 1318 11251 42594 26615 39255 898 -64620 -81457
17141 -81457 2812 25254 44289 72043 -41092 -68572 -31781 9839 -73730 -70621 -38083 -52037
17129 -52037 -62337 -85663 -89384 -99872 -82144 -27418 -10639 8867 -16924 -49730 -103255 -52179
17117 -52179 -26724 -80852 -89174 -55305 -54969 -113499 -130957 -58909 5484 60947 -11937 -69278
17105 -69278 -79754 -47833 -6576 -47566 -68441 -26075 40754 94636 95480 71222 28705 -19413
17093 -19413 -7186 23547 4825 -3974 7471 -8840 -30547 -37703 -55625 -62000 462 -22403
17081 -22403 -22727 5085 7805 -13733 -35861 -86672 -141918 -114920 -126625 -128533 -151876 -183774
$$ packed form
17165G0025j1119n4002r1999J0686k0418n549J5717N237N9551L7084p841k272
17153E100j2297j3503k4948l628N0594R933L1343j5979J2640l8357o5518j6837
17141h1457Q4269K2442J9035K7754j13135k7480L6791M1620q3569L109L2538j3954
17129e2037j0300k3326l721j0488J7728N4726J6779J9506k5791l2806n3525N1076
17117e2179K5455n4128q322L3869L36n8530j7458P2048O4393N5463p2884n7341
17105f9278j0476L1921M1257m0990k0875M2366O6829N3882Q44k4258m2517m8118
17093a9413J2227L0733j8722q799J1445j6311k1707p156j7922o375O2462k2865
17081b2403l24K7812K720k1538k2128n0811n5246K6998j1705j908k3343l1898
$$ plain form
17069 -183774 -259735 -211478 -92406 -15140 11218 -12447 -24757 25587 1221 -31954 -47218
17058 -47218 -27179 -36486 -39423 -66833 16454 71474 43369 2588 -31124 -23401 -22702 -45337 -58299
17045 -58299 -31445 38785 -41527 -69900 -58448 -28430 455 21610 -23078 35868 65334 81820
17033 81820 22500 -41887 -51310 -13134 -21684 -41686 -96920 -91923 -76484 -22406 7277 -16586
17021 -16586 -15351 -29657 -51610 -18834 12314 -46860 -32072 -55135 -48246 -21380 -70146 -64922
17009 -64922 8823 42227 37726 86469 30268 -20092 -11108 2674 -9098 -21872 -59585 -48437
16997 -48437 4077 13738 48597 61560 51992 -10517 9435 28491 85685 27155 -50841 -48872
16985 -48872 -10260 -2799 -24473 -66406 -75755 -92084 -55389 -56587 -44612 -28502 -39248 -65782
$$ packed form
17069a83774p5961M8257J19072P7266K6358k3665j2310N0344k4366l3175j5264
17058d7218K0039r307k937k7410Q3287N5020k8105m0781l3712P723O99k2635j2962
17045e8299K6854P0230q0312k8373J1452L0018K8885K1155m4688N8946K9466J6486
17033H1820n9320o4387r423L8176q550k0002n5234M997J5439N4078K9683k3863
17021a6586J235j4306k1953L2776L1148n9174J4788k3063O889K6866m8766N224
17009f4922P3745L3404m501M8743n6201n0360Q984J3782j1772j2774l7713J1148
16997d8437N2514R661L4859J2963r568o2509J9952J9056N7194n8530p7996J969
16985d8872L8612P461k1674m1933r349j6329L6695j198J1975J6110j0746k6534
$$ plain form
16973 -65782 -4192 20480 -30463 -13201 26352 24711 -32553 -32564 -55354 -54330 -42188 -30338 5180
16960 5180 43035 41009 7279 33123 8309 -59817 -75080 -23791 37356 57331 53630 43536
16948 43536 10833 27600 -2721 31725 19933 208 -18225 35708 80991 67490 62417 24024
16936 24024 31283 -20314 -53764 -30322 -15995 57122 131294 95662 55541 25867 25860 18668 1493
16923 1493 -27151 -23565 11616 25744 -25598 -61787 -59972 -29922 15875 25133 8175 67000
16911 67000 44931 31483 -19268 -13465 -31155 -12898 -10715 -50989 -85840 -87014 -47546 -1487
16899 -1487 -59218 -115888 -99768 -14338 28709 47754 92853 76621 38117 10947 1634 -9154
16887 -9154 -95234 -138881 -120702 -88038 -111165 -136200 -78734 -33267 -10305 4651 -29077 -91040
$$ packed form
16973f5782O1590K4672n0943J7262L9553j641n7264j1k2790J024J2142J1850L5518
16960E180L7855k026l3730K5844k4814o8126j5263N1289O1147J9975l701j0094
16948D3536l2703J6767l0321L4446j1792j9725j8433N3933M5283j3501n073l8393
16936B4024P259n1597l3450K3442J4327P3117P4172l5632m0121k9674pp192j7175
16923A493k8644L586L5181J4128n1342l6189J815L0050M5797R258j6958N8825
16911F7000k2069j3448n0751N803j7690J8257K183m0274l4851j174L9468M6059
16899a487n7731n6670J6120Q5430M3047J9045M5099j6232l8504k7170r313j0788
16887i154q6080m3647J8179L2664k3127k5035N7466M5467K2962J4956l3728o1963
$$ plain form
16875 -91040 -42316 -21913 -13314 -37695 -59906 -32850 -4201 -12961 -39151 -54540 -28821 -5550
16863 -5550 44731 52392 56044 51904 13335 -30001 -45314 18562 73241 94303 71773 113695
16851 113695 100052 -9700 -26837 -48064 -24803 -6633 21987 12321 -10505 -10050 -13041 -35548
16839 -35548 -20115 1538 29015 13274 -36062 -40382 4503 10737 14563 -28166 -9771 -12827
16827 -12827 -16122 -33834 -23429 39641 26764 29212 -9737 -25558 -53403 -98008 -113077 -138468
16815 -138468 -97109 -109784 -107570 -43774 -50619 -13213 29591 33912 8251 31273 -48101 -66053
16803 -66053 -94602 -95178 -66525 -69514 -97471 -110599 -134014 -34699 5463 -16513 -54501 1034
16791 1034 29065 49377 20897 -11657 -78424 -73895 -21630 35708 55472 25475 -15906 -56167
$$ packed form
16875i1040M8724K0403Q599k4381k2211K7056K8649q760k6190j5389K5719K3271
16863e550N0281P661L652m140l8569m3336j5313O3876N4679K1062k2530M1922
16851A13695j3643j09752j7137k1227K3261J8170K8620r666k2826M55k991k2507
16839c5548J5433K1653K7477j5741m9336m320M4885O234L826m2729J8395l056
16827a2827l295j7712J0405O3070j2877K448l8949j5821k7845m4605j5069k5391
16815a38468M1359j2675K214O3796o845L7406M2804M321k5661K3022p9374j7952
16803f6053k8549n76K8653k989k7957j3128k3415R9315M0162k1976l7988N5535
16791A034K8031K0312k8480l2554o6767M529N2265N7338J9764k9997m1381m0261
$$ plain form
16779 -56167 -67617 -29321 22980 19780 22033 18537 -32492 -10057 34620 -6385 18913 11764
16767 11764 11311 65967 33097 26033 88479 81534 35510 1676 47751 56590 830 -53251 -28137
16754 -28137 8567 86261 76925 -11822 -67246 7825 51195 35611 22504 4506 -71686 -144466
16742 -144466 -65939 -23420 -37158 -75361 -120761 -79042 -47822 -40922 -38158 21623 36246 1686
16730 1686 49502 73960 25832 40627 51545 73283 97259 55491 -2516 74494 95505 39819
16718 39819 -13932 -80463 -70436 -4019 -75454 -65265 -43459 -45780 -44953 3834 28151 9879
16706 9879 -9698 13812 1737 -58263 -73479 -96711 -90111 -50443 -103081 -83598 -21638 16297
16694 16297 79820 52750 5114 -52440 -28302 24829 82165 76131 26403 -21810 -22647 -34095
$$ packed form
16779e6167j1450L8296N2301l200K253l496n1029K2435M4677m1005K5298p149
16767A1764m53N4656l2870p064O2446o945m6024l3834M6075Q839n5760n4081K5114
16754b8137L6704P7694r336q8747n5424P5071M3370j5584j3107j7998p6192p2780
16742a44466P8527M2519j3738l8203m5400M1719L1220O900K764N9781J4623l4560
16730A686M7816K4458m8128J4795J0918K1738K3976m1768n8007P7010K1011n5686
16718C9819n3751o6531J0027O6417p1435J0189K1806k321Q27M8787K4317j8272
16706I879j9577K3510j2075o0000j5216k3232O600L9668n2638J9483O1960L7935
16694A6297O3523k7070m7636n7554K4138N3131N7336o034m9728m8213q37j1448
$$ plain form
16682 -34095 -26887 -13338 5650 2225 -3935 -37378 -65696 -48167 -87831 -127474 -89336 -31677
16670 -31677 -72777 -127217 -144796 -71693 -21297 -18597 -12923 -1566 25220 70064 115490 63064
16658 63064 46092 37913 12744 -34650 -81606 -52865 -18690 -44228 -88230 -56606 7111 -23555
16646 -23555 -29413 8113 32900 -6817 -84223 -100050 -70201 -77810 -92426 -56804 -55813 -79197
16634 -79197 -59296 -75148 -81578 -42196 -43589 -59927 -42087 32404 77617 22402 -1008 -20282
16622 -20282 -19863 -15430 -13442 -7342 3774 10053 27216 64230 98533 135398 163752 140735 54278
16609 54278 5311 -10753 -20999 -51711 -55264 42131 64086 55092 79532 79477 315 -76129 -105812
16596 -105812 -37899 34001 23400 38243 -935 -73148 -146539 -128108 -48861 3514 -7213
$$ packed form
16682c4095P208J3549J8988l425o160l3443k8318J7529l9664l9643L8138N7659
16670c1677m1100n4440j7579P3103N0396K700N674J1357K6786M4844M5426n2426
16658F3064j6972q179k5169m7394m6956K8741L4175k5538m4002L1624O3717l0666
16646b3555n858L7526K4787l9717p7406j5827K9849p609j4616L5622R91k3384
16634g9197J9901j5852o430L9382j393j6338J7840P4491M5213n5215k3410j9274
16622b0282M19M433J988O100J1116O279J7163L7014L4303L6865K8354k3017q6457
16609E4278m8967j6064j0246l0712l553R7395K1955q994K4440n5p9162p6444k9683
16596a05812O7913P1900j0601J4843l9178p2213p3391J8431P9247N2375j0727
$$ plain form
16585 -7213 28306 49689 25565 -23031 -25166 -26823 10076 8195 5385 -6083 -31182 85697
16573 85697 122511 111234 57230 14253 -10938 5099 37286 44763 -8576 -92858 -48356 -29859
16561 -29859 -28932 -13140 -25069 6880 29547 -54657 -106079 -101016 -96130 -101899 -126497 -91643 -53867
16548 -53867 -79271 -56550 -90046 -147173 -136489 -55237 12030 -34948 -84916 -50494 -69455 -97469
16536 -97469 -75275 -86906 -106133 -54774 -17405 2346 59625 21855 73669 100597 93470 24882
16524 24882 -13754 -65546 -41637 -48023 -61988 -64180 -71302 -96065 -148953 -122743 -59814 -34200
16512 -34200 -6590 -75605 -62333 -53849 -97439 -92518 -77746 -73008 -23425 -10861 30716 77082
16500 77082 75052 51713 45012 -20748 -29811 29597 37063 60495 37621 2898 -29954 -8895
$$ packed form
16585g213L5519K1383k4124m8596k135j657L6899j881k810j1468k5099J16879
16573H5697L6814j1277n4004m2977k5191J6037L2187P477n3339q4282M4502J8497
16561b9859R27J5792j1929L1949K2667q4204n1422N063M886n769k4598L4854L7776
16548e3867k5404K2721l3496n7127J0684Q1252O7267m6978m9968L4422j8961k8014
16536i7469K2194j1631j9227N1359L7369J9751N7279l7770N1814K6928p127o8588
16524B4882l8636n1792K3909o386j3965k192p122k4763n2888K6210O2929K5614
16512c4200K7610o9015J3272Q484m3590M921J4772M738M9583J2564M1577M6366
16500G7082k030k3339o701o5760r063N9408P466K3432k2874l4723l2852K1059
$$ plain form
16488 -8895 -29247 6060 87720 109565 60810 27177 -16337 1646 -12996 -99014 -139237 -134147
16476 -134147 -128948 -85359 -36309 -77931 -84375 -79519 -99056 -110554 -119426 -77962 -86015 -110986
16464 -110986 -118371 -43112 8691 -29352 -30994 -23696 -12128 26179 74505 54012 5187 -42298
16452 -42298 -72531 -99599 -38147 210 30351 4476 40897 25524 -54505 -93767 -139939 -93763
16440 -93763 -72749 -75701 -54869 -85000 -155311 -156188 -87557 -71426 -101789 -122360 -98217 -107160
16428 -107160 -60563 -1848 20492 27179 14698 48371 11090 54485 90804 109869 77276 21880
16416 21880 28081 -11068 -32777 -38416 -54342 -3874 -8108 -36602 -77349 -93706 -121470 -76592
16404 -76592 -11495 22441 -19022 -60435 -36361 -8304 -9107 -81383 -55114 -58116 -25831 -33652
$$ packed form
16488h895k0352L5307Q1660K1845m8755l3633m3514J7983j4642q6018m0223N090
16476a34147N199M3589M9050m1622o444M856j9537j1498q872M1464q053k4971
16464a10986p385P5259N1803l8043j642P298J1568L8307M8326k0493m8825m7485
16452d2298l0233k7068O1452L8357L0141k5875L6421j5373q0029l9262m6172M6176
16440i3763K1014k952K0832l0131p0311q77O8631J6131l0363k0571K4143q943
16428a07160M6597N8715K2340O687j2481L3673l7281M3395L6319J9065l2593n5396
16416B1880O201l9149k1709n639j5926N0468m234k8494m0747j6357k7764M4878
16404g6592O5097L3936m1463m1413K4074K8057q03p2276K6269l002L2285p821
$$ plain form
16392 -33652 -35372 -16353 -45847 -100091 -155730 -135500 -87677 -40043 17119 6668 -62257 -65112
16380 -65112 8938 90349 48480 23040 -1665 -38180 -66555 -8846 -3785 -31661 -36004 -21673
16368 -21673 -26581 -478 -22136 -72570 -81232 -127035 -111823 -58117 -25429 9120 -44147 -119371
16356 -119371 -122075 -94089 -40703 -9027 26932 49169 10110 34972 16838 95999 89084 15695
16344 15695 -25970 16973 52970 66143 9371 -46328 -62668 -100187 -42532 1092 6525 -43927
16332 -43927 -105385 -155106 -146465 -89504 -12300 -38107 -55108 -64564 -71499 -105701 -92237 -27939
16320 -27939 -790 -2544 -2953 -18849 -62234 -87220 -85908 -57088 14991 12962 7537 9056 -48002
16307 -48002 -48114 24824 34602 40963 22827 43028 2437 -36102 -49088 -91460 -88206 -34227 -3390
$$ packed form
16392c3652j720J9019k9494n4244n5639K0230M7823M7634N7162j0451o8925k855
16380f5112P4050Q1411m1869k5440k4705l6515k8375N7709N061k7876m343J4331
16368b1673m908K6103k1658n0434q662m5803J5212N3706L2688L4549n3267p5224
16356a19371k704K7986N3386L1676L5959K2237l9059K4862j8134P9161o915p3389
16344A5695m1665M2943L5997J3173n6772n5699j6340l7519N7655M3624N433n0452
16332d3927o1458m9721Q641N6961P7204k5807j7001r456o935l4202J3464O4298
16320b7939K7149j754m09j5896m3385k4986J312K8820P2079k029n425J519n7058
16307d8002j12P2938R778O361j8136K0201m0591l8539j2986m2372L254N3979L0837
$$ plain form
16294 -3390 3788 -9506 -31748 -46090 -70543 -34896 -17382 9221 6278 -21735 -13483 13845
16282 13845 -18223 -11475 -11377 -40012 -111468 -119739 -58916 -28863 -20203 -27286 -107756 -113388 -29383
16269 -29383 17127 25528 52820 47328 69868 189 -94454 -69324 4053 -6588 -65758 -77458
16257 -77458 -44566 -59768 -61197 -47395 -62900 -71234 -73589 -94587 -99300 -80263 8697 62153
16245 62153 98990 62398 46113 12077 -30406 -62296 -120894 -152191 -116700 -74058 -37490 14678
16233 14678 4984 -8362 12431 -10776 63045 125160 85513 79115 54638 87932 59302 40459
16221 40459 -8026 -21424 -18066 11502 -1909 -13000 9178 16214 52326 113538 92548 41181
16209 41181 29501 8556 31268 4736 -12059 6954 -15856 -6294 47096 65589 104340 85476
$$ packed form
16294c390P178j3294k2242j4342k4453L5647J7514K6603k943k8013Q252K7328
16282A3845l2068O748R8k8635p1456q271O0823L0053Q660p083q0470n632Q4005
16269b9383M6510Q401K7292n492K2540o9679r4643K5130P3377j0641n9170j1700
16257g7458L2892j5202j429J3802j5505q334k355k0998m713J9037Q8960N3456
16245F2153L6837l6592j6285l4036m2483l1890n8598l1297L5491M2642L6568N2168
16233A4678r694j3346K0793k3207P3821O2115l9647o398k4477L3294k8630j8843
16221D0459m8485j3398L358K9568j3411j1091K2178P036L6112O1212k0990n1367
16209D1181j1680k0945K2712k6532j6795J9013k2810R562N3390J8493L8751j8864
$$ plain form
16197 85476 41501 17525 -35609 -81454 -57193 -2559 28358 48858 21245 -49497 -12464 24978
16185 24978 98154 121042 90645 68727 27297 -24363 -14051 -27389 -53449 -11806 62017 132384
16173 132384 165390 118275 83771 100539 63863 67838 82415 105810 88382 5999 -72404 -49854
16161 -49854 -59346 -34239 7159 -29474 -54646 -81540 -90244 -55268 -33486 -35254 14892 29430
16149 29430 1625 -56936 -38747 46086 31131 -11718 -22200 -56538 -43675 9036 -16855 -61448
16137 -61448 -71193 -43795 -33804 11907 -3484 -29253 -53834 -86504 -45515 16809 32584 -11358
16125 -11358 -53304 -47685 -36230 -20678 -32842 23643 20153 1017 -25705 42372 77492 59587
16113 59587 65636 52108 24552 -12704 -4693 -33245 -30817 -11988 -34179 -53390 -63806 -13746
$$ packed form
16197H5476m3975k3976n3134m5845K4261N4634L0917K0500k7613p0742L7033L7442
16185B4978P3176K2888l0397k1918m1430n1660J0312j3338k6060M1643P3823P0367
16173A32384L3006m7115l4504J6768l6676L975J4577K3395j7428q2383p8403K2550
16161d9854r492K5107M1398l6633k5172k6894q704L4976K1782j768N0146J4538
16149B9430k7805n8561J8189Q4833j4955m2849j0482l4338J2863N2711k5891m4593
16137f1448r745K7398R991M5711j5391k5769k4581l2670M0989O2324J5775m3942
16125a1358m1946N619J1455J5552j2164N6485l490j9136k6722O8077L5120j7905
16113E9587O049j3528k7556l7256Q011k8552K428J8829k2191j9211j0416N0060
$$ plain form
16101 -13746 53513 76941 49483 -25368 15660 23336 25482 40499 1603 -54482 -22306 -13192
16089 -13192 25310 5343 -54431 4045 15375 20518 28235 17419 83816 36313 46528 84136
16077 84136 76525 34705 47909 54890 68507 79741 35560 -18808 -23647 5715 23499 20392
16065 20392 36851 50299 20767 -38638 -34023 -53578 -62334 -18579 -10119 -46432 -71246 -81701
16053 -81701 -125652 -91405 -65874 -41069 -8607 -20982 5569 40658 90944 99696 35290 -11250
16041 -11250 32538 64777 73476 61191 45323 37997 31862 23684 -38367 -1986 23060 24871 -42939
16028 -42939 -57543 -29501 -25179 -87550 -101077 -144658 -124011 -53688 -49577 -34293 -29687 11500
16016 11500 -10199 -5355 -38980 -8153 -17063 -17801 -1698 -27794 -53055 -97338 -133958 -72172
$$ packed form
16101a3746O7259K3428k7458p4851M1028P676K146J5017l8896n6085L2176R114
16089a3192L8502j9967n9774N8476J1330N143P717j0816O6397m7503J0215L7608
16077H4136p611m1820J3204O981J3617J1234m4181n4368m839K9362J7784l107
16065B0392J6459J3448k9532n9405M615j9555q756M3755Q460l6313k4814j0455
16053h1701m3951L4247K5531K4805L2462j2375K6551L5089N0286Q752o4406m6540
16041a1250M3788L2239Q699j2285j5868p326o135q178o2051L6381K5046J811o7810
16028d2939j4604K8042M322o2371j3527m3581K0647P0323M111J5284M606M1187
16016A1500k1699M844l3625L0827q910p38J6103k6096k5261m4283l6620O1786
$$ plain form
16004 -72172 -21980 53012 77511 33547 -38196 -82224 -38258 4417 20275 14191 37112 33403
15992 33403 22406 33881 38959 -47011 -83874 -43319 32428 -8759 -37474 -33826 -66867 -67103
15980 -67103 -22774 28041 17781 -21094 -35632 -11375 -22648 -113351 -141983 -85319 -66309 -26018
15968 -26018 -66574 -75791 11119 59833 44075 60385 61232 -17044 -81428 -91043 -66219 -28476
15956 -28476 -53422 -58142 25595 25554 -31393 -53655 -13609 33165 109301 120073 132030 140145 105516
15943 105516 59371 23005 -29787 -121497 -115578 -53427 12986 24211 82534 13437 -4841 -27128
15931 -27128 -39826 -20245 -7367 57593 101377 24198 4613 32167 22928 -35289 -77429 -32445
15919 -32445 10136 -11189 -35041 -146 25069 10267 -25089 -41308 -14719 -14963 -64658 -65252
$$ packed form
16004g2172N0192P4992K4499m3964p1743m4028M3966M2675J5858o084K2921l709
15992C3403j0997J1475N078q5970l6863M0555P5747m1187k8715L648l3041k36
15980f7103M4329N0815j0260l8875j4538K4257j1273r0703k8632N6664J9010M0291
15968b6018m0556r217Q6910M8714j5758J6310Q47p8276o4384r615K4824L7743
15956b8476k4946m720Q3737m1n6947k2262M0046M6774P6136J0772J1957Q115l4629
15943A05516m6145l6366n2792r1710N919O2151O6413J1225N8323o9097j8278k2287
15931b7128j2698J9581J2878O4960M3784p7179j9585K7554r239n8217m2140M4984
15919c2445M2581k1325k3852L4895K5215j4802l5356j6219K6589k44m9695n94
$$ plain form
15907 -65252 -75784 -58523 -65481 -99342 -123576 -79940 -65139 -34112 10220 5235 -38048 -92523
15895 -92523 -81694 -73448 -107480 -76419 -43111 -75460 -18879 20211 -32611 -47186 -45719 -37496
15883 -37496 -69117 -58036 -9174 -18316 -37332 1741 -6712 -7477 -51853 -89314 -101007 -96099 -73826
15870 -73826 -42664 -42165 2168 31249 66456 9021 4169 13696 52956 65479 43855 12249
15858 12249 10487 24926 -8766 -17738 8869 -5136 -46814 -55232 -16904 20139 56234 91517
15846 91517 145031 108362 38616 9910 -52798 11339 7670 -28263 -61608 -69134 -22515 -29727
15834 -29727 -25529 27153 48099 60507 59388 90708 129493 96629 79059 9020 -69688 -73673
15822 -73673 -52023 -26964 -27933 40213 105006 30372 -41870 -15907 -25245 -44332 -28075 7484
$$ packed form
15907f5252j0532J7261o958l3861k4234M3636J4801L1027M4332m985m3283n4475
15895i2523J0829Q246l4032L1061L3308l2349N6581L9090n2822j4575J467Q223
15883c7496l1621J1081M8862r142j9016L9073q453p65m4376l7461j1693M908K2273
15870g3826L1162M99M4333K9081L5207n7435m852R527L9260J2523k1624l1606
15858A2249j762J4439l3692q972K6607j4005m1678q418L8328L7043L6095L5283
15846I1517N3514l6669o9746k8706o2708O4137l669l5933l3345p526M6619p212
15834b9727M198N2682K0946J2408j119L1320L8785l2864j7570p0039p8708l985
15822g3673K1650K5059r69O8146O4793p4634p2242K5963r338j9087J6257L5559
$$ plain form
15810 7484 40057 8315 -8530 -41798 7082 6726 15732 12912 19396 60586 68510 64437 35866
15797 35866 -40 24697 46918 68399 99761 112620 49338 -22608 -16017 23167 36458 4721
15785 4721 -10360 3725 19210 -5159 -35138 -40688 -74739 -98256 -123919 -98298 -2076 19320
15773 19320 -1740 2170 -43850 -138129 -121967 -83577 -126639 -125174 -61682 -13404 -50106 -53689
15761 -53689 -86441 -101588 -86109 21600 70610 57773 22886 8721 4467 4899 49196 126452
15749 126452 164619 148619 82829 78508 110838 89422 23003 9732 6440 -36280 -18488 -27046
15737 -27046 19005 -14540 -27317 -63850 -82755 -67041 -17325 -49340 -103446 -48904 -80036 -107185
15725 -107185 -66894 -41884 -1565 4506 -6752 -52485 -80194 2056 48457 40574 40152 -8002
$$ packed form
15810G484L2573l1742j6845l3268M8880l56R006k820O484M1190P924m073k8571
15797C5866l5906K4737K2221K1481L1362J2859o3282p1946O591L9184J3291l1737
15785D721j5081J4085J5485k4369k9979n550l4051k3517k5663K5621R6222K1396
15773A9320k1060L910m6020r4279J6162L8390m3062J465O3492M8278l6702l583
15761e3689l2752j5147J5479J07709M9010j2837l4887j4165m254M32M4297P7256
15749A26452L8167j6000o5790m321L2330k1416o6419j3271l292m2720J7792q558
15737b7046M6051l3545j2777l6533j8905J5714M9716l2015n4106N4542l1132k7149
15725a07185M0291K5010M0319O071j1258m5733k7709Q2250M6401p883m22m8154
$$ plain form
15713 -8002 -17177 30583 85054 107233 114331 102925 25030 -90022 -104288 -15224 61563 53326
15701 53326 -5951 10631 87080 82486 48862 31940 27350 40246 22966 52893 16522 -32788
15689 -32788 -17957 -38816 -98641 -38380 -18014 -41739 -36482 -62515 -55122 -1190 24261 43926
15677 43926 21303 8552 25079 50323 22514 -12289 -59770 -65194 -28382 -4601 33923 61253
15665 61253 24335 -20220 7521 70277 114195 37638 -26884 -60629 -56108 -2975 -49344 -24898
15653 -24898 -44697 -26657 -22975 -55979 -60622 -58488 -97174 -60852 -69586 -86821 -73390 -32678
15641 -32678 17659 58258 46462 20220 -63828 -153510 -166422 -75682 -91821 -85357 -57862 -67052
15629 -67052 -1788 60384 67209 56069 106735 91570 56886 12452 -41593 -54397 -47257 -11206
$$ packed form
15713h002r175M7760N4471K2179P098j1406p7895j15052j4266Q9064P6787q237
15701E3326n9277J6582P6449m594l3624j6922m590J2896j7280K9927l6371m9310
15689c2788J4831k0859n9825O0261K0366k3725N257k6033P393N3932K5451J9665
15677D3926k2623j2751J6527K5244k7809l4803m7481n424L6812K3781L8524K7330
15665F1253l6918m4555K7741O2756M3918p6557o4522l3745M521N3133m6369K4446
15653b4898j9799J8040L682l3004m643K134l8686L6322q734j7235J3431M0712
15641c2678N0337M0599j1796k6242q4048q9682j2912R0740j6139O464K7495r190
15629f7052O5264O2172O825j1140N0666j5165l4684m4434n4045j2804P140L6051
$$ plain form
15617 -11206 -88 1761 28249 24687 -10538 -39363 -74234 -54099 -29976 28046 652 14640
15605 14640 22713 15885 15117 13161 52376 -33566 -105566 -133208 -102264 -98605 -65352 -50613 -60135
15592 -60135 -45962 -60137 -55805 -51058 -31018 -2762 -28831 -41905 -39463 15741 27573 -17205
15580 -17205 16215 60342 51675 38871 48543 21120 -12472 -13563 4217 26587 37718 47713
15568 47713 27760 5687 13539 -46401 -37763 2409 -13585 -36931 -93952 -106149 -114160 -113155
15556 -113155 -96929 -75184 -59000 -23294 -48797 -8800 18383 -59851 -134143 -68630 -27520
15545 -27520 -20396 -48733 -107582 -75553 -45445 -51083 -22547 -3501 -51890 -100784 -91124 -81952
15533 -81952 -36314 2151 35341 80254 58162 -1689 -1341 -30933 -32079 -43125 -69604 -56075
$$ packed form
15617a1206J1118J849K6488l562l5225k8825l4871K0135K4123N8022k7394J3988
15605A4640Q073o828p68j956L9215q5942p2000k7642L0944L659L3253J4739r522
15592f0135J4173j4175M332M747K0040K8256k6069j3074K442N5204J1832m4778
15580a7205L3420M4127q667j2804R672k7423l3592j091J7780K2370J1131R995
15568D7713j9953k2073P852n9940Q638M0172j5994k3346n7021j2197q011J005
15556a13155J6226K1745J6184L5706k5503L9997K7183p8234p4292O5513M1110
15545b7520P124k8337n8849L2029L0108n638K8536J9046m8389m8894R660R172
15533h1952M5638L8465L3190M4913k2092n9851L48k9592j146j1046k6479J3529
$$ plain form
15521 -56075 -61862 -31287 -71237 -69394 20093 16177 -17266 -70429 -72989 -15950 6145 51695
15509 51695 35099 13961 1861 -52313 521 21447 -651 -20847 -83594 -108128 -92755 -44658
15497 -44658 -13153 5568 4410 -7075 -29356 -27034 -23683 -27148 -36170 -83815 -132755 -139615 -136982
15484 -136982 -148577 -88820 -65234 -27960 -20290 -8569 -31490 -97104 -108685 -70861 -105106 -97363
15472 -97363 -23550 56107 75344 51166 18927 35055 45024 28316 -25769 -42223 26015 61610
15460 61610 23760 -46049 -48809 -51956 3587 -568 2154 22196 23297 -25685 -26046 8404 3740
15447 3740 27599 54057 21189 -40457 -11511 19800 -10417 -16755 -34999 17253 10862 36595
15435 36595 46323 34274 80257 89758 53937 18076 18703 -19439 -36937 -80851 -43653 4695
$$ packed form
15521e6075n787L0575l9950J843Q9487l916l3443n3163k560N7039K2095M5550
15509E1695j6596k1138j2100n4174N2834K0926k2098k0196o2747k4534J5373M8097
15497d4658L1505J8721j158j1485k2281K322L351l465r022m7645m8940o860K633
15484a36982j1595N9757K3586L7274P670J1721k2921o5614j1581L7824l4245P743
15472i7363P3813P9657J9237k4178l2239J6128R969j6708n4085j6454O8238L5595
15460F1610l7850o9809k760l147N5543m155K722K0042J101m8982l61L4450m664
15447C740K3859K6458l2868o1646K8946L1311l0217o338j8244N2252o391K5733
15435C6595R728j2049M5983R501l5821l5861O27l8142j7498m3914L7198M8348
$$ plain form
15423 4695 1178 28522 33981 46652 134466 95512 12131 -17072 -33576 -21660 20813 -5698
15411 -5698 38694 23615 23365 87729 108809 62141 -23296 -27055 35421 106262 101371 55043 -35240
15398 -35240 -38419 -9975 -44398 -100156 -172973 -185295 -145171 -160379 -135497 -41262 1042 -24346
15386 -24346 -48351 -3674 43100 56985 48486 8361 7563 -5226 -26631 10767 6914 -32845
15374 -32845 -20107 42813 45861 47980 33829 -24983 -100551 -129753 -143701 -141459 -112121 -61992
15362 -61992 -8879 -18219 25861 4501 -5582 -70987 -125491 -182525 -207534 -104177 -125144 -140031
15350 -140031 -67122 -31732 -45216 -27695 -21037 -35095 -65693 -75846 -100718 -79535 -38622 25362
15338 25362 11594 16070 -612 -49626 -113 43286 44033 35148 33431 -11857 -56286 -43044 -1148
$$ packed form
15423D695l517K7344N459J2671Q7814l8954q3381k9203j6504J1916M2473k6511
15411e698M4392j5079k50O4364K1080m6668q5437l759O2476P0841m891m6328r0283
15398c5240l179K8444l4423n5758p2817j2322M0124j5208K4882R4235M2304k5388
15386b4346k4005M4677M6774J3885q499m0125p98j2789k1405L7398l853l9759
15374c2845J2738O2920L048K119j4151n8812p5568k9202j3948K242K9338N0129
15362f1992N3113r340M4080k1360j0083o5405n4504n7034k5009J03357k0967j4887
15350a40031P2909L5390j3484J7521O658j4058l0598j0153k4872K1183M0913O3984
15338B5362j3768M476j6682m9014M9513M3399P47q885j717m5288m4429J3242M1896
$$ plain form
15325 -1148 -13824 -40975 -17257 30505 -13944 -40874 5245 41461 6404 20823 -33252 -49642
15313 -49642 -27623 -54567 -120266 -97289 -44794 -55410 -28135 -16472 1319 -37181 -71852 -90581
15301 -90581 -20959 -33317 -42337 9297 28483 -754 -64909 -54209 -40093 -15681 -26050 -62602
15289 -62602 -22444 -41096 -76090 -97549 -76059 -77029 -65198 -23535 -24702 -67952 -65169 -42835
15277 -42835 -62688 -51078 -67135 -54721 -26250 13581 57937 87396 37466 43941 14288 -42584
15265 -42584 -90498 -94107 -60994 -12046 47827 68884 32829 -11460 -10906 47215 77256 -27158
15253 -27158 -88303 -128530 -90297 -87283 -36791 -11773 3369 46423 39259 63414 83227 125406
15241 125406 84026 13606 -3329 -1254 15801 47097 42268 68178 37055 -853 -36837 -25648
$$ packed form
15325a148j2676k7151K3718M7762m4449k6930M6119L6216l5057J4419n4075j6390
15313d9642K2019k6944o5699K2977N2495j0616K7275J1663J7791l8500l4671j8729
15301i0581O9622j2358r020N1634J9186k9237o4155J0700J4116K4412j0369l6552
15289f2602M0158j8652l4994k1459K1490r70J1831M1663j167m3250K783K2334
15277d2835j9853J1610j6057J2414K8471L9831M4356K9459m9930O475k9653n6872
15265d2584m7914l609L3113M8948N9873K1057l6055m4289N54N8121L0041j04414
15253b7158o1145m0227L8233L014N0492K5018J5142M3054p164K4155J9813M2179
15241A25406m1380p0420j6935K075J7055L1296m829K5910l1123l7908l5984J1189
$$ plain form
15229 -25648 20835 33090 -46685 -112367 -120293 -58147 -49169 809 22801 -1074 -971 -9331 -32280
15216 -32280 -35311 -36507 -58770 -32367 -6404 21828 18355 16170 40983 6839 302 -13617 -15634
15203 -15634 37394 80056 28210 -13886 45928 82248 73838 97590 95172 21612 16147 62521
15191 62521 80641 42094 -34140 -29037 52289 93419 110072 102400 73815 79803 76575 65258
15179 65258 62448 58311 2728 -17642 -42858 -73025 -85486 -83257 -74071 -145043 -159350 -108791
15167 -108791 -108108 -125318 -85480 -57975 -47063 -82209 -34212 -85 -28400 -39803 9961 10610
15155 10610 -54395 -99672 -77597 -33691 -55047 -59931 -73934 -66650 -24549 -46816 -123082 -106993
15143 -106993 -143902 -152169 -126031 -82545 -18219 31677 21106 39270 80812 58744 -20606 -52541
$$ packed form
15229b5648M6483J2255p9775o5682p926O2146Q978M9978K1992k3875J03q360k2949
15216c2280l031j196k2263K6403K5963K8232l473k185K4813l4144o537j3919k017
15203a5634N3028M2662n1846m2096N9814L6320q410K3752k418p3560n465M6374
15191F2521J8120l8547p6234N103Q1326M1130J6653p672k8585N988l228j1317
15179F5258k810m137n5583k0370k5216l0167j2461K229R186p0972j4307N0559
15167a08791O83j7210L9838K7505J0912l5146M7997L4127k8315j1403M9764O49
15155A0610o5005m5277K2075M3906k1356m884j4003P284M2101k2267p6266J6089
15143a06993l6909q267K6138M3486O4326M9896j0571J8164M1542k2068p9350l1935
$$ plain form
15131 -52541 -34909 -48637 -35608 -36140 -25322 -14128 -75064 -84881 -77660 -30034 20202 34706
15119 34706 41826 35364 2948 45644 19851 -43360 -113907 -152025 -93480 -79310 -76525 -58108
15107 -58108 -76915 -87528 -65938 -15274 24209 -33205 -17541 27756 -22894 -16920 -14814 -12463
15095 -12463 -8833 -47387 -26722 -24130 -50619 -68997 -22431 -13468 -42403 4087 22539 18386
15083 18386 -19596 -8588 45081 28746 19798 21643 -29838 -15341 -14687 43858 46112 -23407 -27792
15070 -27792 -40258 7785 1380 40670 9568 -4301 3616 -2357 -23317 -46340 -25732 -27036
15058 -27036 -20503 -39879 -64696 -64239 -70961 -16700 -2007 -23049 -7260 12056 -15938 -40040
15046 -40040 -39968 -14496 -50974 -83633 -44464 -76117 -82955 -73663 -57634 -37162 2734 58660 33336
$$ packed form
15131e2541J7632j3728J3029n32J0818J1194o0936r817P221M7626N0236J4504
15119C4706P120o462l2416M2696k5793o3211p0547l8118N8545J4170K785J8417
15107e8108j8807j0613K1590N0664L9483n7414J5664M5297n0650N974K106K351
15095a2463L630l8554K0665K592k6489j8378M6566Q963k8935M6490J8452m153
15083A8386l7982J1008N3669j6335q948J845n1481J4497O54N8545K254o9519m385
15070b7792j2466M8043o405L9290l1102j3869P917n973k0960k3023K0608j304
15058b7036O533j9376k4817M57o722N4261J4693k1042J5789J9316k7994k4102
15046d0040P2K5472l6478l2659L9169l1653o838R292J6029K0472L9896N5926k5324
$$ plain form
15033 33336 58313 43591 72342 71319 18584 8802 22448 -16866 4909 26842 20754 -43900
15021 -43900 -4449 85263 53458 2073 25447 38908 -39640 18308 130264 37598 -46107
15010 -46107 -2844 5304 -4831 -47347 -84638 -163920 -129936 -59448 -46943 -60040 -61145 -59771
14998 -59771 -42787 -12962 -33464 -31048 27097 -17885 -33838 -23694 12991 38772 62282 114405
14986 114405 129161 44980 12912 -11946 24154 50572 39021 -2216 -3402 -31786 -54343 -39502
14974 -39502 -12652 28016 78817 96571 44256 32692 29152 62654 71800 70162 54607 80887
14962 80887 87243 54570 43747 11339 35632 31858 12985 -48198 -126697 -157813 -95473 -86302
14950 -86302 -58626 -15822 -394 31014 53359 67847 48008 6199 -32918 -41808 11350 37121
$$ packed form
15033C3336K4977j4722K8751j023n2735r782J3646l9314K1775K1933o088o4654
15021d3900L9451Q9712l1805n1385K3374J3461p8548N7948J11956r2666q3705
15010d6107M3263Q148j0135m2516l7291p9282L3984P0488J2505j3097j105J374
14998e9771J6984K9825k0502K416N8145m4982j5953J0144L6685K5781K3510N2123
14986A14405J4756q4181l2068k4858L6100K6418j1551m1237j186k8384k2557J4841
14974c9502K6850M0668N0801J7754n2315j1564l540L3502R146j638j5555K6280
14962H0887O356l2673j0823l2408K4293l774j8873o1183p8499l1116O2340R171
14950h6302K7676M2804J5428L1408K2345J4488j9839m1809l9117q890N3158K5771
$$ plain form
14938 37121 81074 113203 73104 79227 82901 99031 54565 95602 42998 -59195 -103441 -49694
14926 -49694 -8733 -14743 2877 80579 74339 33828 -1331 -15330 -72833 -69146 -79827 -139475
14914 -139475 -98592 -75115 -16838 -8414 -21615 -38694 -56501 -30668 -62733 -43495 -54610 -89330
14902 -89330 -130295 -93768 -13095 47910 84240 46256 -25972 -98988 -120076 -88122 -79192 -40754
14890 -40754 -90208 -89737 -37517 -29939 -65918 -55941 -41350 -54898 -42564 16508 59748 46297
14878 46297 36721 122599 113819 67429 18168 -33364 -64362 -32402 5406 -35335 -40398 8796
14866 8796 37138 30184 21294 2947 -76332 -109309 -122334 -64311 -69864 -56268 -67735 -72581 -87287
14853 -87287 -66862 -62037 -35982 -60886 -51457 -56066 -71628 -45157 27085 19829 -38087 -54322
$$ packed form
14938C7121M3953L2129m0099O123L674J6130m4466M1037n2604j02193m4246N3747
14926d9694M0961o010J7620P7702o240m0511l5159j3999n7503L687j0681n9648
14914a39475M0883K3477N8277Q424j3201j7079j7807K5833l2065J9238j1115l4720
14902h9330m0965L6527Q0673O1005L6330l7984p2228p3016k1088L1954Q930L8438
14890d0754m9454M71N2220P578l5979R977J4591j3548J2334N9072M3240j3451
14878D6297r576Q5878q780m6390m9261n1532l0998L1960L7808m0741n063M9194
14866H796K8342o954q890j8347p9279l2977j3025N8023n553J3596j1467m846j4706
14853h7287K0425M825K6055k4904R429m609j5562K6471P2242p256n7916j6235
$$ plain form
14841 -54322 -41689 -27853 -16855 -21743 50410 64790 -17397 -33825 -18057 21288 5335 -45797
14829 -45797 -64168 -64293 -39608 -36315 -117135 -121002 -78175 -55518 -36598 -41247 -63882 -51377 -78673
14816 -78673 -114759 -59156 -3336 -23642 -46675 -36391 -44079 -38625 -22117 -81421 -115551 -41879
14804 -41879 4959 53573 130323 92466 11249 -17900 -47574 -39983 -52372 -57098 -55493 -43779
14792 -43779 20495 14885 33928 33577 -12788 -62364 10017 27325 6650 -12740 -22620 -56870
14780 -56870 -68395 -75720 -81687 -25594 40023 34522 51632 48062 35155 27219 34014 17801 33651
14767 33651 22844 -33434 -14772 -29709 -6197 37557 56826 38851 -4662 24270 -2033 27686
14755 27686 41758 31378 -4871 -57548 -82188 -29637 -59357 -78474 -15066 -27755 8756 62637
$$ packed form
14841e4322J2633J3836J0998m888P2153J4380q2187j6428J5768L9345j5953n1132
14829d5797j8371j25K4685L293q0820l867M2827K2657J8920m649k2635J2505k7296
14816g8673l6086N5603N5820k0306k3033J0284p688N454J6508n9304l4130P3672
14804d1879M6838M8614P6750l7857q1217k9149k9674P591j2389m726J605J1714
14792d3779O4274n610J9043l51m6365m9576P2381J7308k0675j9390r880l4250
14780e6870j1525p325n967N6093O5617n501J7110l570j2907p936O795j6213J5850
14767C3651j0807n6278J8662j4937K3512M3754J9269j7975m3513K8932k6303K9719
14755B7686J4072j0380l6249n2677k4640N2551k9720j9117O3408j2689L6511N3881
$$ plain form
14743 62637 55446 -27603 -18025 -5971 25476 8374 16734 22446 58487 44445 8721 -44708
14731 -44708 -56972 -78107 -28281 -3919 49069 78253 34210 -40588 -136416 -151309 -71598 -45163
14719 -45163 -35663 -79550 -55362 -57020 -31798 -22815 -55019 -23721 -29690 -3292 12206 -11141
14707 -11141 -26184 1913 -5955 -11803 -5550 -9341 -17371 54384 115986 177772 165213 134861 153190
14694 153190 139234 102025 69257 78428 82226 65070 35367 57330 13431 20540 35507 29831
14682 29831 2177 -30032 -49395 -62104 -82516 -98569 -72751 -88166 -57340 -44169 -116718 -106004
14670 -106004 -88754 -84004 -72206 -49354 -72063 -77472 -77295 -61958 -72440 -41121 -26468 22294
14658 22294 35617 18034 26842 -12221 9672 10608 -47951 -69681 -63493 -67340 -28063 17527 2014
$$ packed form
14743F2637p191q3049R578J2054L1447j7102Q360N712L6041j4042l5724n3429
14731d4708j2264k1135M9826K4362N2988K9184m4043p4798r5828j4893P9711K6435
14719d5163R500m3887K4188j658K5222Q983l2204L1298n969K6398J5498k3347
14707a1141j5043K8097p868n848O253l791q030P1755O1602O1786j2559l0352J8329
14694A53190j3956l7209l2768R171L798j7156k9703K1963m3899P109J4967n676
14682B9831k7654l2209j9363j2709k0412j6053K5818j5415L0826J3171p2549J0714
14670a06004J7250M750J1798K2852k2709n409J77J5337j0482L1319J4653M8762
14658B2294J3323j7583Q808l9063K1893R36n8559k1730O188l847L9277M5590j5513
$$ plain form
14645 2014 -61578 -66126 -83828 -69062 -97567 -86468 -125453 -93849 -21602 -36074 -49382 -75164
14633 -75164 -98821 -145751 -138495 -42932 198 16786 2614 -26342 10710 26446 -5565 82
14621 82 -7441 12475 66661 68068 32865 32322 4953 -74743 -91581 -25028 -10933 -49191 2660
14608 2660 23998 61217 24273 6215 54561 83462 87654 95946 110754 29270 14146 32757
14596 32757 -41917 -54635 -50242 -76850 -131209 -145767 -113063 -66943 -42375 -37403 -9673 5697
14584 5697 8335 11042 -51141 -33000 -36432 -51826 -28408 10508 16695 -25756 -35444 -11260 28986
14571 28986 70104 69976 43678 50929 104110 45870 -10316 -37518 -33858 -47374 -40849 994 -7046
14558 -7046 19782 -21080 -30656 -38756 -82191 -122376 -158076 -137721 -67316 -107587 -118585 -78454
$$ packed form
14645B014o3592m548j7702J4766k8505J1099l8985L1604P2247j4472j3308k5782
14633g5164k3657m6930P256R5563M3130J6588j4172k8956L7052J5736l2011N647
14621H2p523J9916N4186J407l5203n43k7369p9696j6838O6553J4095l8258N1851
14608B660K1338L7219l6944j8058M8346K8901M192Q292J4808q1484j5124J8611
14596C2757p4674j2718M393k6608n4359j4558L2704M6120K4568M972K7730J5370
14584E697K638K707o2183J8141l432j5394K3418L8916O187m2451r688K4184M0246
14571B8986M1118j28k6298P251N3181n8240n6186k7202L660j3516O525M1843q040
14558g046K6828m0862r576q100m3435m0185l5700K0355P0405m0271j0998M0131
$$ plain form
14546 -78454 19397 77569 102338 52863 19553 -27825 -60040 -94884 -126748 -110015 -128088 -89191
14534 -89191 -55930 -27196 -85588 -77583 -18592 -4983 1660 44881 23811 80762 76379 48543
14522 48543 -355 -17623 -44927 -9169 -10742 -19806 22457 31240 25806 -12826 -19512 -24609 -52015
14509 -52015 -48670 -31751 -27369 -61581 -63185 -44765 -42173 -55495 -34322 21657 16246 73992 96124
14496 96124 45746 17381 -5449 8743 74742 91057 75409 22032 -13901 3547 63518 31147
14484 31147 -76011 -82875 -51283 -10880 33118 125080 104455 80387 73928 51353 65092 90389
14472 90389 103037 25520 18883 -2432 -43578 -63989 -21932 -37847 -52019 -26961 -33485 43561
14460 43561 83950 93139 108655 62334 29926 11958 -33901 -25216 766 26141 23072 -23471
$$ packed form
14546g8454R7851N8172K4769m9475l3310m7378l2215l4844l1864J6733j8073L8897
14534h9191L3261K8734n8392Q005N8991J3609O643M3221k1070N6951m383k7836
14522D8543m8898j7268k7304L5758j573r064M2263Q783n434l8632o686n097k7406
14509e2015L345J6919M382l4212j604J8420K592j3322K1173N5979n411N7746K2132
14496I6124n0378k8365k2830J4192O5999J6315j5648n3377l5933J7448N9971l2371
14484C1147j07158o864L1592M0403M3998R1962k0625k4068o459k2575J3739K5297
14472I0389J2648p7517o637k1315m1146k0411M2057j5915j4172K5058o524P7046
14460D3561M0389R189J5516m6321l2408j7968m5859Q685K5982K5375l069m6543
$$ plain form
14448 -23471 19989 10104 -32254 17400 29582 -4427 -10800 -33274 -27651 -14482 -41960 7229
14436 7229 43955 -30251 -7600 35321 21761 -411 19462 48877 40851 39662 25088 16600
14424 16600 -36289 -57503 -108516 -135423 -74855 -31851 -92742 -107396 -60977 9542 29287 16806
14412 16806 11249 2680 49257 76563 93599 32236 14922 22201 51168 84752 103519 76705
14400 76705 34530 -5571 18834 17964 25760 -15646 -44512 -70915 -25397 -8778 -21637 -35633
14388 -35633 -48740 8565 41989 86516 132321 106736 101705 72019 63047 9930 43054 94682
14376 94682 125106 98480 59488 1059 -4555 -27177 -44407 10260 133378 184485 141106 156323
14364 156323 189383 197141 183859 170904 203840 226440 172594 153954 109397 130151 126858 141595
$$ packed form
14448b3471M3460r885m2358M9654J2182l4009o373k2474N623J3169k7478M9189
14436G229L6726p4206K2651M2921j3560k2172J9873K9415q026j189j4574q488
14424A6600n2889k1214n1013k6907O0568M3004o0891j4654M6419P0519J9745j2481
14412A6806n557q569M6577K7306J7036o1363j7314P279K8967L3584J8767k6814
14400G6705m2175m0101K4405q70P796m1406k8866k6403M5518J6619j2859j3996
14388c5633j3107N7305L3424M4527M5805k5585n031k9686q972n3117L3124N1628
14376I4682L0424k6626l8992n8429n614k2622j7230N4667J23118N1107m3379J5217
14364A56323L3060P758j3282j2955L2936K2600n3846j8640m4557K0754l293J4737
$$ plain form
14352 141595 175391 183467 223814 313068 351323 337438 359608 344960 402544 424638 477967 557329
14340 557329 668342 789126 855659 1010817 1209065 1419985 1526534 1676917 1950436 2270781
14330 2270781 2674916 3322617 4329230 5845712 8338694 12151412 15908260 17161857
14322 17161857 16775273 16196012 15801169 16414900 18010322 17889191 16029423 13736975 11037045
14313 11037045 8081379 5730041 4305654 3371835 2769043 2388501 2123318 1933639 1723449
14304 1723449 1541482 1352390 1214335 1054240 896391 779039 675633 591115 573850 555624
14294 555624 517651 480664 443273 392345 307378 293116 296193 341186 336104 316643 235933 296773
14282 296773 288060 187606 126782 100408 76603 72266 41080 -2584 23463 66953 89545 59080
$$ packed form
14352A41595L3796Q076M0347Q9254L8255j3885K2170j4648N7584K2094N3329P9362
14340E57329J11013J20784O6533J55158J98248K10920J06549J50383K73519L20345
14330B270781M04135O47701J006613J516482K492982L812718L756848J253597
14322A7161857l86584n79261l94843O13731J595422j21131j859768k292448k699930
14313A1037045k955666k351338j424387r33819o02792l80542k65183j89679k10190
14304A723449j81967j89092j38055j60095j57849j17352j03406q4518j7265j8226
14294E55624l7973l6987l7391n0928q4967j4262L077M4993n082j9461q0710O0840
14282B96773q713j00454o0824k6374k3805m337l1186m3664K6047M3490K2592l0465
$$ plain form
14270 59080 83729 130451 130149 135441 156465 120671 64145 92509 75153 82974 54669 66525
14258 66525 91196 99165 48516 22052 26137 49607 48487 61479 53947 37963 83549 115136
14246 115136 48022 48869 73716 63530 53782 39616 -20661 -37269 -61959 -76311 -50761 -36708
14234 -36708 -17889 23308 -32680 -82249 -53211 -34678 -1976 59253 50127 17327 -32946 53258
14222 53258 113675 118685 125127 120235 114665 133145 120308 15825 -38430 -62062 -74284 -42538
14210 -42538 -39424 24231 39155 48207 57964 43385 69429 104859 123495 148368 153221 111275
14198 111275 38097 4498 -44644 -69521 -68903 -53212 -49130 -71971 -54021 -33366 15902 34056
14186 34056 11678 15471 -21263 -151 26435 34920 81642 50254 -3692 7294 -7519 -31774
$$ packed form
14270E9080K4649M6722l02N292K1024l5794n6526K8364j7356P821k8305J1856
14258F6525K4671P969n0649k6464M085K3470j120J2992p532j5984M5586L1587
14246A15136o7114Q47K4847j0186r748j4166o0277j6608k4690j4352K5550J4053
14234c6708J8819M1197n5988m9569K9038J8533L2702O1229r126l2800n0273Q6204
14222E3258O0417N010O442m892n570J8480j2837j04483n4255k3632j2222L1746
14210d2538L114O3655J4924R052R757j4579K6044L5430J8636K4873M853m1946
14198A11275p3178l3599m9142k4877O18J5691M082k2841J7950K0655M9268J8154
14186C4056k2378L793l6734K1112K6586Q485M6722l1388n3946J0986j4813k4255
$$ plain form
14174 -31774 -37197 6670 37043 -14467 -62847 -67340 6082 40751 72625 70179 55001 -15237
14162 -15237 -49014 -39157 -11616 -12867 2030 19486 37828 35030 34667 33756 -3589 -31527 -56861
14149 -56861 -63567 -64935 20914 72244 33641 -367 -14287 -366 -13770 -7050 -3614 6012 -17406
14136 -17406 -35375 -9727 8413 22163 -6495 12571 37714 52101 26460 53287 58129 17142
14124 17142 18949 82426 128710 150093 127651 84000 -13615 -9281 48673 77252 107339 60331
14112 60331 44808 63649 35769 39503 69899 47519 -15535 3838 17597 18367 -12638 5647
14100 5647 23209 40206 61336 86499 62493 94785 134057 121176 17813 343 94941 119980
14088 119980 60071 55000 103248 119586 112335 48601 54315 80761 96768 97281 77685 74452 86855
$$ packed form
14174c1774n423M3867L0373n1510m8380m493P3422L4669L1874k446j5178p0238
14162a5237l3777R857K7541j251J4897J7456J8342k798l63r11l7345k7938k5334
14149e6861o706j368Q5849N1330l8603l4008j3920J3921j3404O720L436R626k3418
14136a7406j7969K5648J8140J3750k8658J9066K5143J4387k5641K6827M842m0987
14124A7142J807O3477M6284K1383k2442m3651r7615M334N7954K8579L0087m7008
14112F0331j5523J8841k7880L734L0396k2380o3054J9373J3759P70l1005J8285
14100E647J7562J6997K1130K5163k4006L2292L9272j2881j03363j7470R4598K5039
14088A19980n9909n071M8248J6338p251o3734N714K6446J6007N13j9596l233J2403
$$ plain form
14075 86855 19357 41046 88458 96133 28269 -78587 -21344 57532 134770 182629 119740 107493
14063 107493 122449 145631 131351 58436 63581 65794 115050 118655 63933 38710 55712 122405
14051 122405 156363 170645 127893 186766 222325 259211 235033 212393 182675 193925 199904 177123
14039 177123 173028 153519 87437 74058 78103 76691 15902 33508 69825 121384 121065 64169
14027 64169 15983 25141 47848 61179 55480 55758 70250 54492 59560 67297 89400 82891 100328
14014 100328 125016 140061 140213 149005 180906 216724 190871 159770 117678 121920 122754 151758 183847
14001 183847 151552 106928 54755 11883 43318 18761 9737 -22527 12661 14274 33638 14608
13989 14608 -26459 24676 124108 138854 81374 -10022 -31821 -203 49786 14605 -40458 12374
$$ packed form
14075H6855o7498K1689M7412P675o7864j06856N7243P8876P7238M7859o2889j2247
14063A07493J4956K3182j4280p2915N145K213M9256L605n4722k5223J7002O6693
14051A22405L3958J4282m2752N8873L5559L6886k4178k2640k9718J1250N979k2781
14039A77123m095j9509o6082j3379M045j412o0789J7606L6317N1559l19n6896
14027F4169m8186R158K2707J3331n699K78J4492j5758N068P737K2103o509J7437
14014A00328K4688J5045J52Q792L1901L5818k5853l1101m2092M242Q34K9004L2089
14001A83847l2295m4624n2173m2872L1435k4557r024l2264L5188J613J9364j9030
13989A4608m1067N1135R9432J4746n7480r1396k1799L1618M9989l5181n5063N2832
$$ plain form
13977 12374 9171 48263 59424 16464 -23210 61546 71776 37949 39148 57229 89727 60815
13965 60815 90795 97004 94536 101639 171809 119913 106190 100165 99568 127501 142662 123039 104157
13952 104157 62169 81821 11719 -29035 -8097 11995 31482 42758 9473 -13210 38633
13941 38633 65110 45558 43605 45761 65670 35375 15658 48339 80371 37203 -5892 -8876
13929 -8876 -80393 -91661 -50429 25580 98846 120538 122326 82971 53736 14829 -15872 28412
13917 28412 52271 72247 86364 98093 103879 100436 97364 93458 23271 -2239 49492 61982
13905 61982 20650 27229 -6492 -51618 -6593 59776 113854 109325 95595 56549 24374 2312
13893 2312 60827 25979 37452 29712 42927 96109 73103 -3930 -7670 34484 57245 17940
$$ packed form
13977A2374l203L9092J1161m2960l9674Q4756J0230l3827J199J8081L2498k8912
13965F0815K9980O209k468P103P0170n1896j3723o025n97K7933J5161j9623j8882
13952A04157m1988J9652p0102m0754K0938K0092J9487J1276l3285k2683N1843
13941C8633K6477j9552j953K156J9909l0295j9717L2681L2032m3168m3095k984
13929h876p1517j1268M1232P6009P3266K1692J788l9355k9235l8907l0701M4284
13917B8412K3859J9976J4117J1729N786l443l072l906p0187k5510N1731J2490
13905F1982m1332O579l3721m5126M5025O6369N4078m529j3730l9046l2175k2062
13893B312N8515l4848J1473p740J3215N3182k3006p7033l740M2154K2761l9305
$$ plain form
13881 17940 9763 76628 100619 35942 13660 47676 98106 76048 586 6718 292 23799
13869 23799 83196 112800 99693 84521 91941 78434 94000 74370 68601 61183 56548 103285
13857 103285 75819 30661 57254 91077 75622 34310 -68167 -79723 -40374 12604 97068
13846 97068 99058 95592 8197 11150 37880 70297 91679 83225 109026 17717 26983 91336 82886
13833 82886 22918 63890 74444 98071 85552 42453 19662 43105 70624 37636 25208 -3327
13821 -3327 -39497 -48292 8777 88170 42056 -3776 -9224 35867 34161 25870 64413 -173 5855
13808 5855 -17084 -3972 -10122 12388 -12623 -60958 -49054 -23375 -46108 -53411 -35622 -29131
13796 -29131 4778 40111 28673 50581 6068 -45733 -33257 -29423 -52471 -50619 -24966 39352
$$ packed form
13881A7940q177O6865K3991o4677k2282L4016N0430k2058p5462O132o426K3507
13869B3799N9397K9604j3107j5172P420j3507J5566j9630n769p418m635M6737
13857A03285k7466m5158K6593L3823j5455m1312j02477j1556L9349N2978Q4464
13846I7068J990l466q7395K953K6730L2417K1382q454K5801r1309R266O4353q450
13833H2886n9968M0972J0554K3627j2519m3099k2791K3443K7519l2988j2428k8535
13821c327l6170q795N7069P9393m6114m5832n448M5091j706q291L8543o4586O028
13808E855k2939J3112o150K2510k5011m8335J1904K5679k2733p303J7789O491
13796b9131L3909L5333j1438K1908m4513n1801J2476L834k3048J852K5653O4318
$$ plain form
13784 39352 -38477 -15506 62052 16002 95852 160422 94615 20213 26650 58998 48363 49067
13772 49067 71197 6530 -33999 -17524 38558 7578 -34285 -25936 -48883 13492 4827 23953
13760 23953 -4683 -5726 43005 76820 43070 38377 44277 31506 -21066 -13215 -76543 -127478
13748 -127478 -90204 -19975 27400 42850 37281 -42122 -98645 -40850 -22788 -77296 -146571 -98791
13736 -98791 -58405 -72822 -110482 -86008 -48196 -18582 70109 133553 107983 100952 143802 117835
13724 117835 114904 83338 14802 -8807 -48569 -44468 699 43065 69131 70428 35928 7239
13712 7239 22778 -59791 -111795 -69513 15297 79301 65933 16635 -56475 -64510 -99094 -97655
13700 -97655 -627 58771 -47567 -86427 -77413 -77593 -53188 8009 17478 -16825 21148 89333
$$ packed form
13784C9352p7829K2971P7558m6050P9850O4570o5807p4402O437L2348j0635P04
13772D9067K2130o4667m0529J6475N6082l0980m1863Q349k2947O2375q665J9126
13760B3953k8636j043M8731L3815l3750m693N900j2771n2572P851o3328n0935
13748a27478L7274P0229M7375J5450n569p9403n6523N7795J8062n4508o9275M7780
13736i8791M0386j4417l7660K4474L7812K9614Q8691O3444k5570p031M2850k5967
13724A17835k931l1566o8536k3609l9762M101M5167M2366K6066J297l4500k8689
13712G239J5539q2569n2004M2282Q4810O4004j3368m9298p3110q035l4584J439
13700i7655R7028N9398j06338l8860R014j80K4405O1197R469l4303L7973O8185
$$ plain form
13688 89333 102777 92374 61457 61653 -43446 -64287 12122 82924 51059 14974 -48109 18836
13676 18836 67505 79350 74659 26446 -25878 -22069 28982 43174 15745 -34337 -18107 -6111
13664 -6111 -13626 50298 13885 -33339 20368 43457 71033 52494 32544 40616 -1826 18729
13652 18729 33004 -18597 -3360 -2140 40232 79356 36687 -27209 -22840 -41357 -71163 -66284
13640 -66284 -25833 80477 107244 62647 20969 -19672 -18410 -32193 1630 1220 -13471 -2225
13628 -2225 9360 60330 114488 125550 91464 36099 5831 -12384 -1876 22657 48811 73875
13616 73875 52828 -4520 -12269 -60125 -49697 -26801 21532 27010 55871 59245 12183 51021
13604 51021 101543 63602 35783 59341 14353 -22367 -52573 -18476 36434 84256 54975 23302
$$ packed form
13688H9333J3444j0403l0917J96j05099k0841P6409P0802l1865l6085o3083O6945
13676A8836M8669J1845m691m8213n2324L809N1051J4192k7429n0082J6230J1996
13664f111p515O3924l6413m7224N3707K3089K7576j8539j9950Q072m2442K0555
13652A8729J4275n1601J5237J220M2372L9124m2669o3896M369j8517k9806M879
13640f6284M0451J06310K6767m4597m1678m0641J262j3783L3823m10j4691J1246
13628b225J1585N0970N4158J1062l4086n5365l0268j8215J0508K4533K6154K5064
13616G3875k1047n7348p749m7856J0428K2896M8333N478K8861L374m7062L8838
13604E1021N0522l7941k7819K3558m4988l6720l0206L4097N4910M7822k9281l1673
$$ plain form
13592 23302 29209 20430 7613 -19340 -53583 -84509 -54281 -34714 -13611 -26595 -48306 -61768
13580 -61768 -66774 -38482 -30310 42736 63666 80093 76434 72500 60429 -28781 -12856 57828
13568 57828 67187 79393 100545 82806 70502 40728 43219 42164 10872 62905 85720 82233
13556 82233 42504 29216 41314 42555 69191 -200 -80701 -53879 -3469 30223 3778 -35925
13544 -35925 16767 52240 92460 127361 163377 87051 2429 31776 43024 52424 -9426 446
13532 446 44398 75673 120146 132169 131327 96303 133252 167928 151131 183397 242488 192455
13520 192455 187587 141665 142372 153663 176982 223435 316552 388378 462272 542121 612840 768360
13508 768360 1054742 1509822 2045983 2442403 2526689 2452677 2374327 2235035 2176310 2358361
$$ packed form
13592B3302N907q779j2817k6953l4243l0926L0228J9567K1103j2984k1711j3462
13580f1768n006K8292Q172P3046K0930J6427l659l934j2071q9210J5925P0684
13568E7828R359J2206K1152j7739j2304k9774K491j055l1292N2033K2815l487
13556H2233l9729j3288J2098J241K6636o9391q0501K6822N0410L3692k6445l9703
13544c5925N2692L5473M0220L4901L6016p6326q4622K9347J1248R400o1850R872
13532D46M3952L1275M4473J2023q42l5024L6949L4676j6797L2266N9091n0033
13520A92455m868m5922P07J1291K3319M6453R3117P1826P3894P9849P0719J55520
13508G68360K86382M55080N36161L96420Q4286p4012p8350j39292n8725J82051
$$ plain form
13498 2358361 2618414 2666235 2428597 2039079 1572143 1129256 863050 669218 477669 393654
13488 393654 333347 297974 249301 214793 195967 163601 149374 128083 164122 181095 165319
13477 165319 127171 44322 24901 83639 128955 164976 244625 225831 177097 112632 105895 110966
13465 110966 171286 225581 206409 197978 198199 188917 174158 162952 80525 111359 148272 105937
13453 105937 46744 -12584 9709 73819 98371 101834 103417 128061 89397 36995 -29842 -34997
13441 -34997 11255 63949 68241 64750 110279 90077 13657 25740 31389 81906 115335 132316
13429 132316 164125 201269 172828 127438 115525 136412 131968 111161 78450 97219 76287 17578
13417 17578 13264 -4548 24285 53968 28759 6325 -26978 -23658 6311 -27435 -24878 8083
$$ packed form
13498B358361K60053M7821k37638l89518m66936m42887k66206j93832j91549q4015
13488C93654o0307l5373m8673l4508j8826l2366j4227k1291L6039J6973j5776
13477A65319l8148q2849j9421N8738M5316L6021P9649j8794m8734o4465o737N071
13465A10966O0320N4295j9172q431K21r282j4759j1206q2427L0834L6913m2335
13453A05937n9193n9328K2293O4110K4552L463J583K4644l8664n2402o6837n155
13441c4997M6252N2694M292l491M5529k0202p6420J2083N649N0517L3429J6981
13429A32316L1809L7144k8441m5390j1913K0887m444k0807l2711J8769k0932n8709
13417A7578m314j7812K8833K9683k5209k2434l3303L320K9969l3746K557L2961
$$ plain form
13405 8083 41876 49889 72647 112693 117840 132197 144884 144110 145339 101475 127277 188556 257262
13392 257262 368599 470064 519169 485758 475551 500549 535056 520096 551140 525499 415378
13381 415378 392249 364561 387340 422947 415885 379761 341689 254634 207416 204252 188350 203419
13369 203419 163932 99670 123550 126251 136500 108858 67755 61679 90616 106767 159282 155688
13357 155688 143090 156600 106496 87638 85148 73278 45129 36771 18367 78336 89830 51052
13345 51052 38715 23593 72900 94542 119887 81777 43425 140882 211248 293533 284910 267333
13333 267333 272511 301175 381032 373043 345426 305913 269468 243881 277522 315840 270646 243993
13321 243993 167420 77971 96587 131158 175880 146169 112344 67446 61647 45475 73589 118171
$$ packed form
13405H083L3793Q013K2758M0046N147J4357J2687p74J229m3864K5802O1279O8706
13392B57262J11337J01465M9105l3411j0207K4998L4507j4960L1044k5641j10121
13381D15378k3129k7688K2779L5607p062l6124l8072q7055m7218l164j5902J5069
13369B03419l9487o4262K3880K701J0249k7642m1103o076K8937J6151N2515l594
13357A55688j2598J3510n0104j8858k490j1870k8149q358j8404N9969J1494l8778
13345E1052j2337j5122M9307K1642K5345l8110l8352R7457P0366Q2285q623j7577
13333B67333N178K8664P9857p989k7617l9513l6445k5587L3641L8318m5194k6653
13321B43993p6573q9449J8616L4571M4722k9711l3825m4898n799j6172K8114M4582
$$ plain form
13309 118171 187396 235838 220455 167012 150830 164253 207493 179596 183936 173454 169012 116471
13297 116471 71074 83955 92422 130948 138263 165945 132114 111462 165023 213662 151183 147337
13285 147337 220204 228654 182995 215512 188305 173674 155672 103952 80054 100194 118918 138176
13273 138176 92496 95664 159251 166654 155220 168551 195780 255208 226700 206913 252289 285761
13261 285761 253119 195966 195901 177590 191278 192397 227640 229411 255441 251300 180962 147949 124441
13248 124441 110695 136348 146546 143775 153222 178577 187259 144111 136952 162327 111928 95698
13236 95698 121707 184905 236294 260582 217358 190919 227636 262341 272510 256004 311340 344472
13224 344472 363899 410499 501322 465724 407027 353430 315586 295202 302340 360261 405988 421977
$$ packed form
13309A18171O9225M8442j5383n3443j6182J3423M3240k7897M340j0482m442n2541
13297A16471m5397J2881Q467L8526P315K7682l3831k0652N3561M8639o2479l846
13285A47337P2867Q450m5659L2517k7207j4631j8002n1720k3898K0140J8724J9258
13273A38176m5680L168O3587P403j1434J3331K7229N9428k8508j9787M5376L3472
13261B85761l2642n7153o5j8311J3688J119L5243J771K6030m141p0338l3013k3508
13248A24441j3746K5653J0198k771R447K5355Q682m3148p159K5375n0399j6230
13236I5698K6009O3198N1389K4288m3224k6439L6717L4705J0169j6506N5336L3132
13224C44472J9427M6600R0823l5598n8697n3597l7844k0384P138N7921M5727J5989
$$ plain form
13212 421977 405615 450630 469129 510216 528394 573235 663781 773621 817756 765296 709918
13201 709918 745463 763374 778511 821896 824904 667344 531114 531923 511647 519194 513349 507336
13189 507336 546293 573141 599575 636881 652992 628784 666113 730759 800283 828842 780607
13178 780607 792787 828972 845598 810435 786824 747522 720754 735257 693754 715799 692041
13167 692041 799195 962580 1147773 1341765 1500467 1579912 1595826 1551207 1576541 1614005
13157 1614005 1715095 1750350 1789598 1717776 1609545 1550736 1570638 1609156 1594447 1565467 1461472
13146 1461472 1357184 1387023 1406681 1403335 1371890 1455374 1536258 1595352 1619183 1654029 1777950
13135 1777950 1939113 1985402 2005603 2085722 2148908 2187311 2274790 2413914 2501379 2646112 2751966
$$ packed form
13212D21977j6362M5015J8499M1087J8178M4841R0546J09840M4135n2460n5378
13201G09918L5545J7911J5137M3385L008j57560j36230Q09k0276P547n845o013
13189E07336L8957K6848K6434L7306J6111k4208L7329O4646O9524K8559m8235
13178G80607J2180L6185J6626l5163k3611l9302k6768J4503m1503K2045k3758
13167F92041J07154J63385J85193J93992J58702P9445J5914m4619K5334L7464
13157A614005J01090L5255L9248p1822j08231n8809J9902L8518j4709k8980j03995
13146A461472j04288K9839J9658l346l1445Q3484Q0884N9094K3831L4846J23921
13135A777950J61163M6289K0201Q0119O3186L8403Q7479J39124Q7465J44733J05854
$$ plain form
13124 2751966 2950080 3195742 3287107 3348258 3509576 3693719 3900428 4206682 4444019 4629678
13114 4629678 4802568 5010834 5233266 5546013 5926210 6358569 6775403 7083683 7467629
13105 7467629 8043931 8714128 9475824 10266296 11208644 12397134 13945964 16017279 18438156
13096 18438156 20947583 23422218 25907752 28771866 32287890 36848181 42751565 49699180
13088 49699180 57649837 67637311 81575331 102030807 132837645 181074470 257226512
13081 257226512 363841480 455423580 477023900 457947524 430531038 399555465 390051524
13074 390051524 430593015 489331855 493066236 447106337 385576281 309948035 228217458
13067 228217458 165041690 124321630 98779798 82277654 70607036 61134717 53268945
$$ packed form
13124B751966J98114K45662R1365O1151J61318J84143K06709L06254K37337J85659
13114D629678J72890K08266K22432L12747L80197M32359M16834L08280L83946
13105G467629N76302O70197P61696P90472R42348J188490J548830K071315K420877
13096A8438156K509427K474635K485534K864114L516024M560291N903384O947615
13088D9699180P950657R987474J3938020K0455476L0806838M8236825P6152042
13081B57226512J06614968R1582100K1600320j9076376k7416486l0975573r503941
13074C90051524M0541491N8738840L734381m5959899o1530056p5628246q1730577
13067B28217458o3175768m0720060k5541832j6502144j1670618r472319p865772
$$ plain form
13060 53268945 46730566 41285450 37101616 34231443 32081294 29801054 27241038 24731026
13052 24731026 22286590 19875450 17754701 16045899 14592159 13292658 12156025 11245415
13044 11245415 10346653 9578634 8966695 8318650 7748629 7290698 6823269 6340536 5908069
13035 5908069 5584094 5242050 4991431 4765121 4515987 4272274 4082109 3881498 3734927
13026 3734927 3642739 3473610 3331300 3162374 3017436 2901381 2852433 2779065 2679451 2570251
13016 2570251 2455061 2299736 2182626 2121698 2055851 1932225 1832173 1868991 1883976 1777822
13006 1777822 1701687 1671113 1587903 1469817 1352594 1255570 1209449 1194655 1136410 1055903 1034358
12995 1034358 995005 928537 934854 963972 987551 965578 984929 992022 909383 893009 937333 900297
$$ packed form
13060E3268945o538379n445116m183834k870173k150149k280240k560016k510012
13052B4731026k444436k411140k120749j708802j453740j299501j136633r10610
13044A1245415q98762p68019o11939o48045n70021m57931m67429m82733m32467
13035E908069l23975l42044k50619k26310k49134k43713j90165k00611j46571
13026C734927r2188j69129j42310j68926j44938j16055m8948p3368r9614j09200
13016B570251j15190j55325j17110o0928o5847j23626j00052L6818J4985j06154
13006A777822p6135l0574q3210j18086j17223r7024m6121j4794n8245q0507k1545
12995A034358l9353o6468O317K9118K3579k1973J9351P093q2639j6374M4324l7036
$$ plain form
12983 900297 851609 843910 859645 769876 765152 807599 829120 762767 687345 689748 653352 615125
12971 615125 575050 587994 619433 654922 636925 676862 724807 738710 715997 661829 628001
12960 628001 634721 694292 772396 797656 731808 674449 653185 624789 627403 633045 642004 616355
12948 616355 523382 486044 466374 468955 415867 448473 543949 542721 462358 475892 492525 455049
12936 455049 466874 445876 424438 392861 390545 352178 327948 334550 306433 264122 252703 236661
12924 236661 249177 280894 330228 389006 407969 373290 371919 413881 464038 466883 431616 417055
12912 417055 394696 348416 324942 334126 337409 336071 339149 338360 292808 247614 245462 158151 46063
12899 46063 79635 140304 150211 122754 106512 119775 162906 137289 163131 172665 128527 87883
$$ packed form
12983I00297m8688p699J5735q9769m724M2447K1521o6353p5422K403l6396l8227
12971F15125m0075J2944L1439L5489j7997L9937M7945J3903k2713n4168l3828
12960F28001O720N9571P8104K5260o5848n7359k1264k8396K614N642Q959k5649
12948F16355r2973l7338j9670K581n3088L2606R5476j228q0363J3534J6633l7476
12936D55049J1825k0998k1438l1577k316l8367k4230O602k8117m2311j1419j6042
12924B36661J2516L1717M9334N8778J8963l4679j371M1962N0157K845l5267j4561
12912D17055k2359m6280k3474R184L283j338L078p89m5552m5194k152q7311j12088
12899D6063L3572O0669R907k7457j6242J3263M3131k5617K5842R534m4138m0644
$$ plain form
12887 87883 120474 149003 102804 111710 128085 178106 214747 188026 174063 194171 242627 274634
12875 274634 291875 314937 321497 290916 267319 308451 279167 210404 149098 105006 97272 126258
12863 126258 139958 151659 106121 137240 217304 247069 228929 172603 166685 159659 124007 95353
12851 95353 121922 150384 167630 258626 299659 317533 243700 177931 114584 101648 70525 71332
12839 71332 88078 139426 170975 151951 156730 150851 125777 86646 113393 95810 101150 127278
12827 127278 129440 156419 179093 197712 163371 190517 215045 271755 240872 167983 169266 182921
12815 182921 231508 237076 227438 159785 98151 23621 23824 6031 8947 69778 73803 75390 30079
12802 30079 31676 55961 85889 93879 93213 105074 138601 159448 128499 77600 101091 93128 55451
$$ packed form
12887H7883L2591K8529m6199Q906J6375N0021L6641k6721j3963K0108M8456L2007
12875B74634J7241K3062O560l0581k3597M1132k9284o8763o1306m4092p734K8986
12863A26258J3700J1701m5538L1119Q0064K9765j8140n6326n918p026l5652k8654
12851I5353K6569K8462J7246R0996M1033J7874p3833o5769o3347j2936l1123Q07
12839G1332J6746N1348L1549j9024M779n879k5074l9131K6747j7583N340K6128
12827A27278K162K6979K2674J8619l4341K7146K4528N6710l0883p2889J283J3655
12815A82921M8587N568r638o7653o1634p4530K03j7793K916O0831M025J587m5311
12802C0079J597K4285K9928P990o66J1861L3527K0847l0949n0899K3491p963l7677
$$ plain form
12789 55451 107781 169759 154823 111285 128399 73976 87969 123503 111976 70078 -31483
12778 -31483 -2085 -73724 -128427 -177032 -218814 -209304 -210177 -245447 -288454 -341116 -343843 -345180 -364006
12765 -364006 -357765 -332994 -303268 -314018 -265110 -262596 -224079 -131728 -90176 -57316 -37259 -52081
12753 -52081 -52672 6176 15277 14659 56850 59607 29660 62519 24074 17335 44326 2222 -6821
12740 -6821 -10926 -43830 -36174 35475 -24808 -50438 -8413 30708 60458 73893 107391 129844
12728 129844 65368 20473 49035 135050 111694 32609 -2777 26627 38281 62751 94117
12717 94117 101726 64545 -2577 -27920 -31005 -30625 -6185 -5192 -26956 -13476 12130 60143 83376
12704 83376 21089 4291 38339 39251 54853 55738 47728 58487 46882 68353 70269 -26731 15370
$$ packed form
12789E5451N2330O1978j4936m3538J7114n4423J3993L5534j1527m1898j01561
12778c1483K9398p1639n4703m8605m1782R510q73l5270m3007n2662k727j337j8826
12765c64006O241K4771K9726j0750M8908K514L8517R2351M1552L2860K0057j4822
12753e2081n91N8848R101o18M2191K757k9947L2859l8445o739K6991m2104r043
12740f821m105l2904P656P1649o0283k5630M2025L9121K9750J3435L3498K2453
12728A29844o4476m4895K8562Q6015k3356p9085l5386K9404J1654K4470L1366
12717I4117P609l7181o7122k5343l085L80K4440R93k1764J3480K5606M8013K3233
12704H3376o2287j6798L4048R12J5602Q85q010J0759j1605K1471J916r7000M2101
$$ plain form
12691 15370 90635 157856 141170 86078 105562 76350 47262 60988 100974 150528 153682 121753
12679 121753 97862 101821 51812 1147 14980 24928 67074 89903 119037 115577 104668 191903
12667 191903 241972 290151 327406 265178 152096 130081 139703 142522 185953 274531 358186 384870
12655 384870 458078 598022 744714 934012 1211356 1719432 2255369 2522006 2507375 2352733
12645 2352733 2194950 2095710 2162686 2457943 2632450 2481916 2171552 1720152 1318355 981736
12635 981736 744259 601159 540874 451828 439295 334770 238572 210036 219427 208092 190788
12624 190788 226935 226106 187778 161188 160348 107258 100518 122306 129000 151443 97900 19533 25134
12611 25134 45762 56049 101546 144549 157666 106952 20380 61673 66405 25476 6594 -26884
$$ packed form
12691A5370P5265O7221j6686n5092J9484k9212k9088J3726L9986M9554L154l1929
12679A21753k3891L959n0009n0665J3833R948M2146K2829K9134l460j0909Q7235
12667A91903N0069M8179L7255o2228j13082k2015R622K819M3431Q8578Q3655K6684
12655C84870P3208J39944J46692J89298K77344N08076N35937K66637j4631j54642
12645B352733j57783r9240O6976K95257J74507j50534l10364m51400m01797l36619
12635I81736k37477j43100o0285q9046j2533j04525r6198k8536R391j1335j7304
12624A90788L6147q29l8328k6590q40n3090o740K1788O694K2443n3543p8367N601
12611B5134K0628J0287M5497M3003J3117n0714q6572M1293M732m0929j8882l3478
$$ plain form
12599 -26884 539 88798 139999 86766 -24628 -13853 40440 -8781 -48870 -57161 -12180 -25855
12587 -25855 -618 34460 11739 -13193 -26685 -14511 12605 19358 43406 38225 61528 132385
12575 132385 116936 34100 -2011 22908 44941 21081 11704 -66 30663 59879 50248 29235
12563 29235 -23551 -66849 -19693 -60532 -62108 -33359 -63878 -21853 11665 22736 21162 12213
12551 12213 14241 31244 30437 26201 53837 48212 36042 -967 -14776 -35031 -43722 -40039 -11102
12538 -11102 -693 -1703 36118 81393 -12514 -83954 -55730 40315 91314 58118 -4613 -26333
12526 -26333 -49308 -54104 -109541 -108393 -32111 -10010 -27716 -31621 576 -19480 -44889 -15355
12514 -15355 11880 15696 50441 16651 21544 18713 23755 2070 -41241 -28207 23084 37062
$$ packed form
12599b6884K7423Q8259N1201n3233j11394J0775N4293m9221m0089q291M4981j3675
12587b5855K5237L5078k2721k4932j3492J2174K7116O753K4048n181K3303P0857
12575A32385j5449q2836l6111K4919K2033k3860r377j1770L0729K9216r631k1013
12563B9235n2786m3298M7156m0839j576K8749l0519M2025L3518J1071j574q949
12551A2213K028J7003q07m236K7636n625j2170l7009j3809k0255q691L683K8937
12538a1102J0409j010L7821M5275r3907p1440K8224R6045N0999l3196o2731k1720
12526b6333k2975m796n5437J148P6282K2101j7706l905L2197k0056k5409K9534
12514a5355K7235L816L4745l3790M893k831N042k1685m3311J3034N1291J3978
$$ plain form
12502 37062 26321 27325 40590 29650 50080 88326 62420 66624 95942 113264 70006 26493
12490 26493 -13865 -38519 -47264 15002 52819 108340 94321 50007 494 -30959 -16794 69388
12478 69388 81320 63700 14255 -3205 53790 97304 117522 60468 33073 37855 28834 13750
12466 13750 -22803 -11861 11441 72437 94757 61426 40850 -36953 -120476 -131591 -63126 31487
12454 31487 22743 -52432 -122224 -82775 -23081 22397 71049 80950 117914 93611 71991 67591
12442 67591 66092 32528 -8936 -21385 10390 -19820 -25413 -14458 -16438 -10904 16820 42242
12430 42242 12344 36204 83736 67402 88260 113662 83387 44198 171 -3893 58018 29384
12418 29384 14731 10917 -23588 -45714 -85145 -122250 -95058 -123035 -102902 -56252 10015 18439
$$ packed form
12502C7062j0741J004J3265j0940K0430L8246k5906M204K9318J7322m3258m3513
12490B6493m0358k4654q745O2266L7817N5521j4019m4314m9513l1453J4165Q6182
12478F9388J1932j7620m9445j7460N6995M3514K0218n7054k7395M782r021j5084
12466A3750l6553J0942K3302O0996K2320l3331k0576p7803q3523j1115O8465R4613
12454C1487q744p5175o9792L9449N9694M5478M8652R901L6964k4303k1620m400
12442F7591j499l3564m1464j2449L1775l0210n593J0955j980N534K7724K5422
12430D2242k9898K3860M7532j6334K0858K5402l0275l9189m4027m064O1911k8634
12418B9384j4653l814l4505k2126l9431l7105K7192k7977K0133M6650O6267Q424
$$ plain form
12406 18439 32743 21570 7810 41179 41060 44432 23914 2041 26908 3495 -6793 -26629
12394 -26629 -45593 16456 13204 -12796 -14369 -38197 -12158 111237 65126 832 25971 -23943
12382 -23943 11399 80408 72122 60157 39635 45409 100677 137288 144950 141650 140357 95182 74493
12369 74493 34570 -45238 -79450 -17096 74546 112209 79621 46719 53571 83049 85648 52733
12357 52733 2897 -19173 -39613 22540 24547 2702 28726 26455 49060 48573 69384 49711
12345 49711 23435 10843 47390 62877 -15417 33328 76769 60177 48736 20522 3112 3235
12333 3235 5341 57183 50976 10361 -27100 -36722 47387 56164 13684 12493 66266 2773 -8029
12320 -8029 22210 72984 69869 39652 26878 16183 -22546 -14897 -4627 -8301 13489 -396
$$ packed form
12406A8439J4304j1173j3760L3369j19L372k0518k1873K4867k3413j0288j9836
12394b6629j8964O2049l252k6000j573k3828K6039J23395m6111o4294K5139m9914
12382b3943L5342O9009q286j1965k0522N774N5268L6611P662l300j293m5175k0689
12369G4493l9923p9808l4212O2354R1642L7663l2588l2902O852K9478K599l2915
12357E2733m9836k2070k0440O2153K007k1845K6024k271K2605m87K0811j9673
12345D9711k6276j2592L6547J5487p8294M8745M3441j6592j1441k8214j7410J23
12333C235K106N1842o207m0615l7461r622Q4109Q777m2480j191N3773o3493j0802
12320h029L0239N0774l115l0217j2774j0695l8729P649J0270l674K1790j3885
$$ plain form
12308 -396 27689 57431 83759 94114 132429 174772 244418 356610 437741 411963 330744 355468
12296 355468 353169 346686 345771 337041 272845 199277 127351 147565 135978 71970 93853 130091
12284 130091 165059 172218 106612 41154 66875 106588 129068 67800 8722 -5285 16326 -6951
12272 -6951 8302 -13064 -4789 -18516 -21350 -26096 -47302 -27465 -6039 46177 52674 4545 24149
12259 24149 31574 -22240 -32531 -44579 18318 20785 -53762 -49906 -55124 -28765 -31799 -40079 -26875
12246 -26875 -40125 8722 53005 27793 -8371 -30968 -19296 -309 246 15361 -36449 -32736
12234 -32736 18951 22355 31668 30860 32271 77966 59179 83025 99356 114784 74186 71768 49963
12221 49963 -2354 -23020 12915 32603 12049 -26694 -37386 -23238 19369 27007 2106 38017
$$ packed form
12308c96K8085K9742K6328J0355L8315M2343O9646J12192Q1131k5778q1219K4724
12296C55468k299o483r15q730o4196p3568p1926K0214j1587o4008K1883L6238
12284A30091L4968P159o5606o5458K5721L9713K2480o1268n9078j4007K1611k3277
12272f951J5253k1366Q275j3727k834m746k1206J9837K1426N2216O497m8129J9604
12259B4149P425n3814j0291j2048O2897K467p4547L856n218K6359l034q280J3204
12246b6875j3250M8847M4283k5212l6164k2597J1672J8987N55J5115n1810L713
12234c2736N1687L404R313q08J411M5695j8787K3846J6331J5428m0598k418k1805
12221D9963n2317k0666L5935J9688k0554l8743j0692J4148M2607P638k4901L5911
$$ plain form
12209 38017 53492 97923 73995 -9303 -2985 32190 77440 123971 111284 100302 121065 82771
12197 82771 31709 11242 26403 -10789 -17691 -7632 -3968 33430 18591 724 -7414 10302
12185 10302 2003 -73421 -80352 -56953 -26500 -11246 -75721 -114955 -92684 -4385 30349 -2121
12173 -2121 -30448 -24297 -67945 -105217 -59553 55295 108845 41819 14088 -8326 -36143 -20953
12161 -20953 -4819 -51899 -60016 -69042 -118015 -119743 -128203 -51541 798 37034 2941 -33144
12149 -33144 -34779 -54112 -50263 -39471 -73375 -84333 -57514 4200 18269 -2406 -12545 20685
12137 20685 17962 -14859 -83503 -111489 -68725 -41013 -65536 -50335 -71807 -119070 -74652 -87353
12125 -87353 -65488 -13732 44978 74227 83215 19299 -37805 -83046 -49162 -51826 -79610 -85173
$$ packed form
12209C8017J5475M4431k3928q3298O318L5175M5250M6531j2687j0982K0763l8294
12197H2771n1062k0467J5161l7192o902J0059L664L7398j4839j7867q138J7716
12185A0302q299p5424o931K3399L0453J5254o4475l9234K2271Q8299L4734l2470
12173b121k8327O151m3648l7272M5664J14848N3550o7026k7731k2414k7817J5190
12161b0953J6134m7080q117r026m8973j728q460P6662N2339L6236l4093l6085
12149c3144j635j9333L849J0792l3904j0958K6819O1714J4069k0675j0139L3230
12137B0685k723l2821o8644k7986M2764K7712k4523J5201k1472m7263M4418j2701
12125h7353K1865N1756N8710K9249Q988o3916n7104m5241L3884k664k7784n563
$$ plain form
12113 -85173 -44520 -65893 -116709 -93054 -92435 -139757 -121169 -49409 -30987 -35334 -78926 -118060
12101 -118060 -112197 -70045 -58997 -77278 -37160 10653 -13489 -86974 -109662 -44878 6404 -36256
12089 -36256 -52196 -52379 -86853 -73272 -95652 -70878 -4860 85149 37121 -34949 -95782 -75280
12077 -75280 -81719 -100381 -38399 -39662 -52740 -48273 -102293 -115870 7365 83467 31470 44240
12065 44240 73555 61899 90469 106279 78152 79406 55655 22378 -30954 -65936 -69632 -22193
12053 -22193 35658 1342 -35199 -23091 5709 10792 5550 9485 4592 -5122 -47098 -86241 -74687
12040 -74687 -85638 -63791 -41627 -70247 -27925 44812 59336 55305 34026 -25565 21827 12597
12028 12597 -52164 -71610 -81179 -61979 10243 55035 49892 19693 -68281 7244 61195 66363
$$ packed form
12113h5173M0653k1373n0816K3655O19m7322J8588P1760J8422m347m3592l9134
12101a18060N863M2152J1048j8281M0118M7813k4142p3485k2688O4784N1282m2660
12089c6256j5940j83l4474J3581k2380K4774O6018R0009m8028p2070o0833K0502
12077g5280o439j8662O1982j263j3078M467n4020j3577J23235P6102n1997J2770
12065D4240K9315j1656K8570J5810k8127J254k3751l3277n3332l4982l696M7439
12053b2193N7851l4316l6541J2108K8800N083n242L935m893r714m1976l9143J1554
12040g4687j0951K1847K2164k8620M2322P2737J4524m031k1279n9591M7392r230
12028A2597o4761j9446r569J9200P2222M4792n143l0199q7974P5525N3951N168
$$ plain form
12016 66363 -25256 -80900 -68596 -96252 -43343 -22445 -43722 -66466 -11060 475 14486 -25513
12004 -25513 -75736 -61163 -89860 -152381 -182678 -148762 -118833 -100514 -80112 -88754 -112321 -174812
11992 -174812 -191030 -141009 -61258 -61461 -72334 10031 9661 -41264 -18335 41066 89236 86686
11980 86686 89056 43557 44267 -873 43067 106820 110778 49530 55881 58104 55557 42121 19227
11967 19227 8110 7860 14845 -32358 -38218 -55758 -72733 -46305 -61860 -14404 10308 26295
11955 26295 11207 -19282 -7513 -14843 -79068 -105760 -87774 -55718 -48608 -11517 944 1052
11943 1052 50325 20 -18315 -14270 -62543 -62680 -50046 -47794 -42041 -18643 14821 -24081 -39499
11930 -39499 -16845 44211 70967 116132 72263 7656 -41736 -66155 -67863 -46358 -29154 -60443
$$ packed form
12016F6363r1619n5644J2304k7656N2909K0898k1277k2744N5406J1535J4011l9999
12004b5513n0223J4573k8697o2521l0297L3916K9929J8319K0402q642k3567o2491
11992a74812j6218N0021P9751k03j0873Q2365l70n0925K2929N9401M8170k550
11980H6686K370m5499P10m5140M3940O3753L958o1248O351K223k547j3436k2894
11967A9227j1117k50O985m7203n860j7540j6975K6428j5555M7456K4712J5987
11955B6295j5088l0489J1769p330o4225k6692J7986L2056P110L7091J2461J08
11943A052M9273n0305j8335M045m8273j37J2634K252N753K3398L3464l8902j5418
11930c9499K2654O1056K6756M5165m3869o4607m9392k4419j708K1505J7204l1289
$$ plain form
11918 -60443 -72081 -61467 -60536 -107839 -46577 -60045 -28835 -13016 149 -68785 -56394 -13426
11906 -13426 13260 19489 -5195 -26605 -22629 -7575 13983 -14900 -23371 29813 24584 7141
11894 7141 19078 9227 -26342 -71145 -44790 -22181 12166 -49620 -51362 -20885 -81062 -74924
11882 -74924 16945 19496 12601 3382 -27827 -63480 -58307 -46120 -14923 -19840 -19850 -75458 -83856
11869 -83856 -43914 18875 37292 -4760 -38914 -47087 -61394 -32929 -54663 -7591 63540 42272
11857 42272 18060 -7719 12771 -65192 -72221 -55881 -97816 -117282 -168369 -156168 -89760 -73692
11845 -73692 -38608 -53535 -56597 -42226 -63920 -45007 -31968 -68548 -41917 -74212 -52420 -11506
11833 -11506 -19444 -11066 -36534 -27766 -41499 -37988 -70437 -60028 -93137 -127647 -97644 -62269
$$ packed form
11918f0443j1638J0614R31m7303O1262j3468L1210J5819J3165o8934J2391M2968
11906a3426K6686O229k4684k1410L976J5054K1558k8883q471N3184n229j7443
11894G141J1937r851l5569m4803K6355K2609L4347o1786j742L0477o0177O138
11882g4924R1869K551o895r219l1209l5653N173J2187L1197m917j0n5608q398
11869h3856L9942O2789J8417m2052l4154q173j4307K8465k1734M7072P1131k1268
11857D2272k4212k5779K0490p7963p029J6340m1935j9466n1087J2201O6408J6068
11845g3692L5084j4927l062J4371k1694J8913J3039l6580K6631l2295K1792M0914
11833a1506p938Q378k5468Q768j3733L511l2449J0409l3109l4510L0003L5375
$$ plain form
11821 -62269 -93191 -121263 -73844 -36943 18705 57654 10483 -18823 -45553 -52497 -58197 -99114
11809 -99114 -83975 -13234 -23988 -64246 -76157 -147474 -159759 -109216 -61967 -59526 -122893 -149511
11797 -149511 -99928 -45205 -71975 -69233 -25896 -32464 -91191 -49250 20535 8453 5479 -8469
11785 -8469 -61934 -52700 -5242 -17727 24619 55979 67740 52449 -745 39054 38096 34889 38572
11772 38572 44467 54845 74965 68116 35620 19274 3660 -66741 -126739 -100689 -50351 -67651
11760 -67651 -67244 -14412 -32262 -52360 -86242 -111211 -43714 4058 7906 35379 44411 -20913
11748 -20913 -55583 -56014 -66586 -96274 -7542 -2657 -71445 -70347 -32456 -20574 -130 -200 -23220
11735 -23220 -68313 -115673 -93131 -62163 -84862 -62210 -50860 -45685 47253 85232 96888 112705
$$ packed form
11821f2269l0922k8072M7419L6901N5648L8949m7171k9306k6730o944n700m0917
11809i9114J5139P0741j0754m0258j1911p1317j2285N0543M7249K441o3367k6618
11797a49511M9583N4723k6770K742M3337o568n8727M1941O9785j2082k974j3948
11785h469n3465R234M7458j2485M2346L1360J1761j5291n3194L9799r58l207L683
11772C8572N895J0378K0120o849l2496j6346j5614p0401n9998K6050N0338j7300
11760f7651M07N2832j7850k0098l3882k4969O7497M7772L848K7473R032o5324
11748b0913l4670m31j0572k9688Q8732M885o8788J098L7891J1882K0444p0k3020
11735b3220m5093m7360K2542L0968k2699K2652J1350N175R2938L7979J1656J5817
$$ plain form
11723 112705 68714 80188 122108 106869 83518 67270 45622 23810 2059 -9143 -42999
11712 -42999 -3696 52638 47057 71722 -54864 -178522 -132898 -62003 -69696 -18154 135062
11701 135062 152272 121683 79939 22225 -91461 -119227 -54833 21594 35368 42671 44980 17963
11689 17963 41147 22346 11528 11575 19002 -47788 -75015 -41740 -5364 -5242 -38199 -44058 -22574
11676 -22574 -5924 47827 95537 100140 59272 -4935 -40615 -9772 34833 -49125 -89041 -64355
11664 -64355 -19288 -53708 -99037 -72385 -54665 -87208 -108642 -101267 -48548 -23006 6349 -4875
11652 -4875 35643 51513 -3967 -8732 -29755 -58448 -52473 -88801 -88785 -93476 -103436 -82852 -60638
11639 -60638 -18363 35608 37313 43429 32827 -985 11734 8416 -49085 -39609 -13788 29617
$$ packed form
11723A12705m3991J1474M1920j5239k3351j6248k1648k1812k1751j1202l3856
11712d2999L9303N6334n581K4665j26586j23658M5624P0895p693N1542J53216
11701A35062J7210l0589m1744n7714j13686k7766O4394P6427J3774P303K309k7017
11689A7963K3184j8801j0818M7P427o6790k7227L3275L6376J22l2957n859K1484
11676b2574J6650N3751M7710M603m0868o4207l5680L0843M4605q3958l9916K4686
11664f4355M5067l4420m5329K6652J7720l2543k1434P375N2719K5542K9355j1224
11652d875M0518J5870n5480m765k1023k8693N975l6328J6m691r960K0584K2214
11639f0638M2275N3971J705O116j0602l3812J2719l318n7501R476K5821M3405
$$ plain form
11627 29617 74429 55620 34508 1114 -49569 -12462 28647 -13616 1961 51034 51961 23229
11615 23229 93138 116375 23925 -39353 1282 50242 35303 45642 24729 21332 -29334 -71234
11603 -71234 -87885 -103440 -133329 -126853 -80794 -89803 -110166 -123619 -110756 -93710 -102050 -160540
11591 -160540 -160851 -138860 -62890 -52612 1729 19161 12203 12278 7706 29618 72226 39250 13278
11578 13278 -5204 32696 94425 24475 -74003 -63768 -44419 -42001 -84273 -82390 -45399 -91204
11566 -91204 -38126 36424 40310 -28722 -60534 -29201 -15793 -39047 -45384 -72833 -92154 -142635
11554 -142635 -112988 -40289 6193 -14639 -2570 922 10364 35697 42634 28705 2329 -19560
11542 -19560 -25074 -27339 -6926 28587 46613 88856 95404 67062 78043 65801 -21347 -273
$$ packed form
11627B9617M4812j8809k1112l3394n0683L7107M1109m2263J5577M9073R27k8732
11615B3229O9909K3237r2450o3278M0635M8960j4939J0339k0913l397n0666m1900
11603g1234j6651j5555k9889O476M6059r009k0363j3453J2863J7046q340n8490
11591a60540l11K1991P5970J0278N4341J7432o958P5m572K1912M2608l2976k5972
11578A3278j8482L7900O1729o9950r8478J0235J9349K418m2272J883L6991m5805
11566i1204N3078P4550L886o9032l1812L1333J3408k3254o337k7449j9321n0481
11554a42635K9647P2699M6482k0832J2069L492R442K5333O937j3929k6376k1889
11542a9560n514k265K0413L5513J8026M2243O548k8342J0981j2242q7148K1074
$$ plain form
11530 -273 69641 6485 -91455 -73509 -28896 -27915 15017 33146 -32328 6087 17934 -57895
11518 -57895 -135294 -128181 -114421 -85706 -55929 -44265 -5621 -72690 -128955 -100413 -112573 -133382
11506 -133382 -114653 -46117 -5413 23173 42930 16061 42596 8674 49485 80752 63769
11495 63769 1441 -29974 -21082 32529 42100 -1077 -39877 -46476 -17950 -32423 -51232 -73963
11483 -73963 -73391 -63949 -32610 -48637 -83563 -36636 -56382 -88888 -140373 -117979 -7938 49825
11471 49825 31567 -16996 -49190 -21118 20698 25127 27164 35209 54129 18666 81246 107180
11459 107180 -10677 -90704 -87390 -70067 -90792 -45870 -19475 -22161 -31019 -41860 -66365 -70877
11447 -70877 -52052 6884 11284 -14863 -6930 40995 78351 99847 39204 -9363 68428 83180
$$ packed form
11530b73O9914o3156r7940J7946M4613R81M2932J8129o5474L8415J1847p5829
11518e7895p7399P113J3760K8715K9777J1664L8644o7069n6265K8542j2160k0809
11506a33382J8729O8536M0704K8586J9757k6869K6535l3922M0811L1267j6983
11495F3769o2328l1415Q892N3611R571m3177l8800o599K8526j4473j8809k2731
11483g3963N72R442L1339j6027l4926M6927j9746l2506n1485K2394J10041N7763
11471D9825j8258m8563l2194K8072M1816M429K037Q045J8920l5463O2580K5934
11459A07180j17857q0027L314J7323k0725M4922K6395k686q858j0841k4505m512
11447g0877J8825N8936M400k6147P933M7925L7356K1496o0643m8567P7791J4752
$$ plain form
11435 83180 79896 32651 5783 65996 161865 219733 169720 82466 47630 43736 32599 -1881
11423 -1881 -103345 -73387 -6649 7448 39324 73501 47662 32047 -28809 -44960 -18437 8229
11411 8229 39750 24003 19190 60174 91193 65921 18311 1929 11472 -4758 -21707 -25595
11399 -25595 -13202 42619 28682 44249 24790 -10962 -37175 35587 53994 33459 24056 -4896
11387 -4896 -49591 -86383 -55921 -40692 -59179 -38868 -63054 -44843 -62509 -61866 -7386 60657
11375 60657 103402 105112 149952 165730 99074 20069 20519 -15013 -55882 -3491 -3564 -17296 -75605
11362 -75605 -88189 -49427 -7853 8936 -1189 -67639 -118437 -77214 -58342 -84565 -92311 -98621
11350 -98621 -80617 -88559 -82632 -71777 -28873 -41834 -47960 -49870 -53656 -61594 -28113 -29226 -41487
$$ packed form
11435H3180l284m7245k6868O0213R5869N7868n0013q7254l4836l894j1137l4480
11423a881j01464K9958O6738J4097L1876L4177k5839j5615o0856j6151K6523K6666
11411H229L1521j5747m813M0984L1019k5272m7610j6382R543j6230j6949l888
11399b5595J2393N5821j3937J5567j9459l5752k6213P2762J8407k0535r403k8952
11387d896m4695l6792L0462J5229j8487K0311k4186J8211j7666O43N4480O8043
11375F0657M2745J710M4840J5778o6656p9005M50l5532m0869N2391p3j3732n8309
11362g5605j2584L8762M1574J6789j0125o6450n0798M1223J8872k6223p746o310
11350i8621J8004p942N927J0855M2904j2961o126j910l786p938L3481j113j2261
$$ plain form
11337 -41487 -71718 -86314 -85413 -52654 -17678 -16193 -52028 -47150 -36804 -31911 -58201 -72993 -73483
11324 -73483 -5027 30542 23507 -4001 -8417 -21997 -19416 -50612 -108326 -90750 -113848 -144071
11312 -144071 -79991 -26519 -80489 -98315 -93676 -71400 -76264 -70771 -61530 224 -17853 -53536
11300 -53536 -79145 -68589 -87737 -78330 -31553 23219 -13496 -48708 -49477 -29744 -3009 -10495
11288 -10495 -10348 32936 70069 37292 14074 -3713 43276 53042 42534 62663 42824 28435
11276 28435 10519 31889 63053 95196 76245 91490 101635 38023 5953 37978 31261 5500
11264 5500 -10861 -22876 -81540 -80494 -3803 19349 38368 60263 34897 -20110 6460 41863
11252 41863 23270 39147 128854 149780 93531 80183 67535 67691 92106 61845 11668 -13890
$$ packed form
11337d1487l0231j4596R01L2759L4976J485l5835M878J0346M893k6290j4792m90
11324g3483O8456L5569p035k7508m416j3580K581l1196n7714J7576k3098l0223
11312a44071O4080N3472n3970j7826M639K2276m864N493R241O1754j8077l5683
11300e3536k5609J0556j9148R407M6777N4772l6715l5212p69J9733K6735p486
11288a0495J47M3284L7133l2777k3218j7787M6989R766j0508K0129j9839j4389
11276B8435j7916K1370L1164L2143j8951J5245J0145o3612l2070L2025o717k5761
11264E500j6361j2015n8664J046P6691K3152J9019K1895k5366n5007K6570L5403
11252D1863j8593J5877Q9707K0926n6249j3348j2648J56K4415l0261n0177k5558
$$ plain form
11240 -13890 956 25576 47373 34369 18838 50806 46448 45121 95715 150142 104146 5719
11228 5719 14323 53448 59643 70499 37503 -21086 -7260 -5621 -29373 21317 -27650 -45026
11216 -45026 -30 70607 103286 89419 144959 142025 114380 134673 192460 184127 146450 132380
11204 132380 128654 97234 75686 43192 47208 -28502 -90257 -111665 -19271 4536 -18511 -56329
11192 -56329 -142 58161 127531 144852 128857 112500 56959 64425 127971 177628 119001 73513
11180 73513 41174 -11656 7313 -30383 -13214 43922 103033 102131 70047 55474 48746 33806
11168 33806 -7810 53110 64202 -17210 -13303 40441 109510 116602 128721 113676 131341 114204
11156 114204 89703 58043 29566 13462 34552 8547 -25588 -13509 -17596 -1863 -22657 -38413
$$ packed form
11240a3890J4846K4620K1797j3004j5531L1968m358j327N0594N4427m5996r8427
11228E719Q604L9125O195J0856l2996n8589J3826J639k3752N0690m8967j7376
11216d5026M4996P0637L2679j3867N5540k934k7645K0293N7787q333l7677j4070
11204A32380l726l1420k1548l2494M016p5710o1755k1408R2394K3807k3047l7818
11192e6329N6187N8303O9370J7321j5995j6357n5541P466O3546M9657n8627m5488
11180G3513l2339n2830J8969l7696J7169N7136N9111r02l2084j4573o728j4940
11168C3806m1616O0920J1092q1412L907N3744O9069P092J2119j5045J7665j7137
11156A14204k4501l1660k8477j6104K1090k6005l4135J2079m087J5733k0794j5756
$$ plain form
11144 -38413 3693 17276 16005 26438 42505 48785 57899 23592 3974 -61638 -100760 -75708
11132 -75708 -11895 -13794 -74324 -117189 -61105 -9499 -9267 -52668 -67197 -66974 -77169 -87175 -83989
11119 -83989 -128842 -189314 -172608 -91809 -71042 -8773 48025 31187 -38386 -66988 -50694 -28923
11107 -28923 -28239 -33971 -23136 -74151 -84774 -70804 -49638 -23245 -3014 -24733 -28874 4004
11095 4004 13967 34616 62031 66810 67285 10249 -8647 1144 -21465 -49124 -57845 -31799 21229
11082 21229 41468 65856 29192 -24624 -5477 72003 72836 77378 76106 113596 88621 -5076
11070 -5076 -1146 14631 -10486 27450 63558 35226 -8951 -42863 -64249 -56370 -79796 -88578
11058 -88578 -86975 -56961 -1674 40871 41176 -28184 -100348 -135494 -87282 -14901 -19532 -358
$$ packed form
11144c8413M2106J3583j271J0433J6067O280R114l4307j9618o5612l9122K5052
11132g5708O3813j899o0530m2865N6084N1606K32m3401j4529K23j0195j0006L186
11119h3989m4853o0472J6706Q0799K0767O2269N6798j6838o9573k8602J6294K1771
11107b8923O84n732J0835n1015j0623J3970K1166K6393K0231k1719m141L2878
11095D004R963K0649K7415M779M75n7036j8896R791k2609k7659q721K6046N3028
11082B1229K0239K4388l6664n3816J9147P7480Q33M542j272L7490k4975r3697
11070e076L930J5777k5117L7936L6108k8332m4177l3912k1386P879k3426q782
11058h8578J603L0014N5287M2545L05o9360p2164l5146M8212P2381m631J9174
$$ plain form
11046 -358 -38253 -86094 -63485 -58424 -32638 13180 -60352 -128756 -55736 -36077 -45564 -40654 -56022
11033 -56022 -56654 -53775 -42633 23241 11953 19986 2176 -28841 -17915 16989 76792 59531
11021 59531 58712 90538 122801 93796 8812 25561 24119 -24600 -17558 -22656 10189 40837 10148
11008 10148 -25065 35639 66743 71874 33538 57643 21751 -27627 -16697 -20156 -56655 -59646
10996 -59646 35381 58049 16900 -40443 -44887 32942 49354 46755 3297 -2164 38849 97038
10984 97038 180282 148189 65 -58599 -45987 -16392 -30970 -104865 -107689 -111221 -120263 -56304
10972 -56304 -50374 -95648 -121693 -103649 -9176 -29747 -54414 -50313 -72684 -133721 -152311 -46939
10960 -46939 35638 8078 -34177 -37419 -6934 12716 34156 33853 -32547 -5018 13145 -30542
$$ packed form
11046c58l7895m7841K2609N061K5786M5818p3532o8404P3020J9659r487M910j5368
11033e6022o32K879J1142O5874j1288Q033j7810l1017J0926L4904N9803j7261
11021E9531q19L1826L2263k9005q4984J6749j442m8719P042n098L2845L0648l0689
11008A0148l5213O0704L1104N131l8336K4105l5892m9378J0930l459l6499k991
10996e9646R5027K2668m1149n7343m444P7829J6412k599m3458n461M1013N8189
10984I7038Q3244l2093j48124n8664J2612K9595j4578p3895k824l532r042O3959
10972e6304N930m5274k6045J8044R4473k0571k4667M101k2371o1037j8590J05372
10960d6939Q2577k7560m2255l242L0485J9650K1440l03o6400K7529J8163m3687
$$ plain form
10948 -30542 -92779 -124987 -157143 -119694 -25024 27708 53639 28982 397 37528 50306 15287
10936 15287 6640 3134 -8543 24384 53509 64095 160022 175776 101898 57177 68092 99839
10924 99839 74566 102028 105820 96861 167289 198950 196185 142079 68601 113813 122844 58034
10912 58034 5433 -36227 -56638 -8191 2888 -26854 -15221 -43142 -60470 -57334 -58255 -30690
10900 -30690 60474 112775 198860 212943 149243 133129 163950 129462 64296 88432 125415 100433
10888 100433 78635 58455 8599 12818 86471 80778 151110 175776 119092 105058 120406 145709
10876 145709 107395 64891 20186 62293 67560 125487 102244 81116 75184 60949 12351 4919
10864 4919 -10907 -13235 23484 73828 35779 25086 73699 69235 7390 -19 39227 24838
$$ packed form
10948c0542o2237l2208l2156L7449R4670N2732K5931k4657k8585L7131J2778l5019
10936A5287q647l506j1677L2927K9125J0586R5927J5754p3878m4721J0915L1747
10924I9839k5273K7462L792q959P0428L1661k765n4106p3478M5212R031o4810
10912E8034n2601m1660k0411M8447J1079k9742J1633k7921j7328L136r21K7565
10900c0690R1164N2301Q6085J4083o3700j6114L0821l4488o5166K4136L6983k4982
10888A00433k1798k0180m9856M219P3653n693P0332K4666n6684j4034J5348K5303
10876A45709l8314m2504m4705M2107N267N7927k3243k1128n932j4235m8598p432
10864D919j5826k328L6719N0344l8049j0693M8613m464o1845p409L9246j4389
$$ plain form
10852 24838 41030 70400 88990 146932 128986 56920 36089 42150 56636 42223 74227 126399
10840 126399 144419 127270 106831 83469 89593 129559 142767 70339 60053 80830 80552 69354
10828 69354 60360 12464 26287 54884 34853 6252 2658 -71777 -76891 -34530 -43094 -81172
10816 -81172 -71576 -97087 -66253 -41493 -12265 -12662 3947 340 -50480 -46702 9811 44174 33121
10803 33121 -46623 -24626 4268 30214 44478 51337 44668 32560 -18365 -42548 -70741 -101537
10791 -101537 -145520 -95954 -67327 -31287 37417 28051 -30240 -35310 -35429 -62511 -8398 22811
10779 22811 48876 78382 28114 6305 -44806 -58532 -62860 -38989 -26190 -29865 -33850 -84081
10767 -84081 -94894 -53019 -23250 -101065 -115764 -108982 -132282 -94192 -85287 -106898 -138160 -117904
$$ packed form
10852B4838J6192K9370J8590N7942j7946p2066k0831O061J4486j4413L2004N2172
10840A26399J8020j7149k0439k3362O124L9966J3208p2428j0286K0777k78j1198
10828F9354q994m7896J3823K8597k0031k8601l594p4435n114M2361q564l8078
10816h1172R596k5511L0834K4760K9228l97J6609l607n0820L778N6513L4363j1053
10803C3121p9744K1997K8894K5946J4264O859o669j2108n0925k4183k8193l0796
10791a01537m3983M9566K8627L6040O8704r366n8291n070j19k7082N4113L1209
10779B2811K6065K9506n0268k1809n1111j3726m328K3871J2799l675l985n0231
10767h4081j0813M1875K9769p7815j4699O782k3300L8090Q905k1611l1262K0256
$$ plain form
10755 -117904 -81462 -68136 -68341 -17352 -6817 -22283 -5255 14483 42051 -17067 -29869 18558
10743 18558 56655 74009 27803 10684 46334 67824 4642 -62348 -92744 -75055 -29945 14928
10731 14928 -2949 -13274 42998 57583 -30816 -130510 -118459 -71045 -41349 -65443 -69628 -43785
10719 -43785 -8426 43627 16433 18678 57925 48287 -35152 -73656 -65903 -78879 -110059 -144548
10707 -144548 -123028 -75755 -37275 -48843 -5658 27267 54223 46349 39026 62050 38383 34211
10695 34211 45288 -30043 -25138 -47949 -74291 -82804 -102709 -66393 -42651 33161 90695 39069
10683 39069 -75058 -80332 -102017 -107393 -50981 -41881 -27978 8419 36245 39093 -47187 -107451
10671 -107451 -122463 -94580 -28803 -8969 6019 -4816 -33701 12107 7537 -13363 -38830 -53729
$$ packed form
10755a17904L6442J3326k05N0989J0535j5466J7028J9738K7568n9118j2802M8427
10743A8558L8097J7354m6206j7119L5650K1490o3182o6990l0396J7689M5110M4873
10731A4928j7877j0325N6272J4585q8399r9694J2051M7414K9696k4094m185K5843
10719d3785L5359N2053k7194K245L9247r638q3439l8504P753j2976l1180l4489
10707a44548K1520M7273L8480j1568M3185L2925K6956p874p323K3024k3667m172
10695C4211J1077p5331M905k2811k6342q513j9905L6316K3742P5812N7534n1626
10683C9069j14127n274k1685n376N6412R100J3903L6397K7826K848q6280o0264
10671a07451j5012K7883O5777J9834J4988j0835k8885M5808m570k0900k5467j4899
$$ plain form
10659 -53729 2959 53546 7792 -22761 -973 42930 -13547 -55757 -134521 -116720 -61341 -27709
10647 -27709 -82042 -76667 -71361 -34070 -30395 -89603 -67505 -70873 -54852 -3763 -6009 -17561 -24282
10634 -24282 8851 -21077 -67028 -103434 -36611 32300 21875 3078 25981 62108 61723 86779
10622 86779 85977 64252 59903 40479 39538 45846 71065 64176 63644 96818 67264 82604 43606
10609 43606 -6016 49919 81341 45424 29371 48610 80659 30531 16979 64727 74159 284
10597 284 -20983 -53496 -88094 -113002 -42163 45285 36149 -48853 -44898 20205 57987 1793
10585 1793 -68649 -26866 -17256 -6546 -52349 -112524 -93205 -39608 -70812 -97548 -106748 -95850
10573 -95850 -40288 13785 17178 34218 31085 -6401 -52862 -70850 -84269 -56717 -443 44336
$$ packed form
10659e3729N6688N0587m5754l0553K1788M3903n6477m2210p8764J7801N5379L3632
10647b7709n4333N375N306L7291L675n9208K2098l368J6021N1089k246j1552o721
10634b4282L3133k9928m5951l6406O6823O8911j0425j8797K2903L6127l85K5056
10622H6779q02k1725m349j9424r41O308K5219o889n32L3174k9554J5340l8998
10609D3606m9622N5935L1422l5917j6053J9239L2049n0128j3552M7748R432p3875
10597B84k1267l2513l4598k4908P0839Q7448r136q5002L955O5103L7782n6194
10585A793p0442M1783R610J0710m5803o0175J9319N3597l1204k6736r200J0898
10573i5850N5562N4073L393J7040l133l7486m6461j7988j3419K7552N6274M4779
$$ plain form
10561 44336 43919 28204 -21752 6603 -23245 7575 29646 28953 28160 49084 81334 75610 60045
10548 60045 10675 -6880 15000 63159 79478 26371 -3323 -22190 -46643 -68251 -77095 -14011
10536 -14011 79673 110729 124815 166575 183987 165122 82190 -18757 15127 55355 86420
10525 86420 32198 -21548 4220 37047 34095 5819 30600 35509 10475 -1370 6066 -36633
10513 -36633 -83383 -56634 -98450 -56002 -7139 -39867 2419 75954 74296 40542 -202 7872
10501 7872 -12391 -48773 -52228 -30374 12589 -17819 -70070 -84103 -78399 -31288 29393 -8019
10489 -8019 -5727 15134 -51 -72599 -58566 15750 40215 -39555 -58157 -41488 18822 30698
10477 30698 -25077 -64795 -92811 -96858 -62878 -14905 9490 -57837 -116001 -146296 -109078 -99034
$$ packed form
10561D4336m17j5715m9956K8355k9848L0820K2071o93p93K0924L2250n724j5565
10548F0045m9370j7555K1880M8159J6319n3107k9694j8867k4453k1608q844O3084
10536a4011R3684L1056J4086M1760J7412j8865q2932j00947L3884M0228L1065
10525H6420n4222n3746K5768L2827k952k8276K4781M909k5034j1845P436m2699
10513c6633m6750K6749m1816M2448M8863l2728M2286P3535j658l3754m0744Q074
10501G872k0263l6382l455K1854M2963l0408n2251j4033N704M7111O0681l7412
10489h019K292K0861j5185p2548J4033P4316K4465p9770j8602J6669O0310J1876
10477C0698n5775l9718k8016m047L3980M7973K4395o7327n8164l0295L7218J0044
$$ plain form
10465 -99034 -83420 -89851 -103959 -92285 -57575 -88145 -72786 -79604 -119031 -86977 -72395 -50153
10453 -50153 -5778 -4943 -82430 -147134 -130841 -69891 -58969 -58122 -100416 -104430 -82418 -50501 -55124
10440 -55124 -26182 29911 -48768 -90454 -88217 -85861 -65658 -59644 -33521 -30412 -61426 -70823 -79469
10427 -79469 -47337 -69894 -97189 -39590 -46975 -119161 -78199 -62908 -32719 7747 66835 23925
10415 23925 -7529 49096 102338 112185 95511 56203 86430 57984 -44384 -66734 -41663 -47524
10403 -47524 -37621 -26044 5960 -8409 -14904 -59190 -54174 21894 25044 -11801 32146 41680 -16274
10390 -16274 -42405 -60307 -61071 -66829 -92345 -109236 -71702 -98003 -68837 -43362 -64002 -40827
10378 -40827 -32726 4993 30397 -16372 -43671 -4622 25912 113584 151463 143749 131280 80585
$$ packed form
10465i9034J5614o431j4108J1674L4710l0570J5359o818l9427L2054J4582K2242
10453e0153M4375Q35p7487o4704J6293O0950J0922Q47m2294m014K2012L1917m623
10440e5124K8942N6093p8679m1686K237K356K0203O014K6123L109l1014r397q646
10427g9469L2132k2557k7295N7599p385p2186M0962J5291L0189M0466N9088m2910
10415B3925l1454N6625N3242R847j6674l9308L0227k8446j02368k2350K5071n861
10403d7524R903J1577L2004j4369o495m4286N016P6068L150l6845M3947R534n7954
10390a6274k6131j7902p64n758k5516j6891L7534k6301K9166K5475k0640K3175
10378d0827Q101L7719K5404m6769k7299L9049L0534Q7672L7879p714j2469n0695
$$ plain form
10366 80585 47243 28350 15151 10989 26757 -8301 -43232 -98952 -82958 -15675 -4637 -3718
10354 -3718 -2514 1248 31685 45600 23924 -30594 -51460 -40481 -19948 7712 3011 3971 16904
10341 16904 61458 112183 89618 61473 7246 -18067 7792 93839 96037 70443 43784 86378
10329 86378 49570 2271 -7859 6383 3742 28707 4418 -28048 34106 49021 4900 28661
10317 28661 49051 53519 69300 14143 -60606 -39686 36744 70146 24234 -47337 -42356 -57937
10305 -57937 -26718 9312 15389 -12612 -2068 14252 -10718 -19129 23583 45790 60978 38694
10293 38694 18490 23316 41344 54052 99012 124019 94705 72223 60199 53335 39236 52601
10281 52601 -6610 -11256 8827 13222 -24166 -20076 2884 57241 55030 21891 -48595 -64171
$$ packed form
10366H0585l3342j8893j3199m162J5768l5058l4931n5720J5994O7283J1038R19
10354c718J204L762L0437J3915k1676n4518k0866J0979K0533K7660m701R60J2933
10341A6904M4554N0725k2565k8145n4227k5313K5859Q6047K198k5594k6659M2594
10329H6378l6808m7299j0130J4242k641K4965k4289l2466O2154J4915m4121K3761
10317B8661K0390M468J5781n5157p4749K0920P6430L3402m5912p1571M981j5581
10305e7937L1219L6030O077k8001J0544J6320k4970q411M2712K2207J5188k2284
10293C8694k0204M826J8028J2708M4960K5007k9314k2482j2024o864j4099J3365
10281E2601n9211m646K0083M395l7388M090K2960N4357k211l3139p0486j5576
$$ plain form
10269 -64171 -53737 -18273 18963 23838 -35726 -3197 -17890 -85799 -77611 -17668 32191 32669
10257 32669 45985 95018 74387 40586 44692 121756 112334 102138 117804 101673 75043 115053
10245 115053 133711 72393 74001 79585 65220 85386 49549 38781 71638 75955 14892 15866
10233 15866 7251 16391 -8712 21351 27473 24975 87187 129337 84659 66640 148091 193519
10221 193519 163132 103547 89696 115802 135558 149290 225440 319745 383670 564050 732905
10210 732905 941094 1278467 1549470 1676881 1597922 1424744 1185582 901903 652008 470579
10200 470579 418310 304639 234640 156424 94386 73164 47990 76761 105177 67019 91954
10189 91954 31753 24283 44263 86981 59514 52104 63310 52704 59587 56838 62889 56677 62342
$$ packed form
10269f4171J0434L5464L7236M875n9564L2529j4693o7909Q188N9943M9859M78
10257C2669J3316M9033k0631l3801M106P7064r422j0196J5666j6131k6630M0010
10245A15053J8658o1318J608N584j4365K0166l5837j0768L2857M317o1063R74
10233A5866q615R140k5103L0063O122k498O2212M2150m4678j8019Q1451M5428
10221A93519l0387n9585j3851K6106J9756J3732P6150R4305O3925J80380J68855
10210G32905K08189L37373K71003J27411p8959j73178k39162k83679k49895j81429
10200D70579n2269j13671o9999p8216o2038k1222k5174K8771K8416l8158K4935
10189I1954o0201p470J9980M2718k7467p410J1206j0606O883k749O051o212N665
$$ plain form
10176 62342 115149 106924 29855 -13332 13881 53437 11830 23787 49062 74146 88213 117869
10164 117869 52068 45000 45909 81284 42288 24587 37190 39422 -2670 33780 72334 105416
10152 105416 141233 77376 37686 59243 83038 70495 47678 89341 121373 135405 118262
10141 118262 122878 127959 118896 99364 128593 201093 193397 137842 149965 116003 71028 86935
10129 86935 61503 -5693 38473 55614 35896 20623 45998 82283 96164 64775 22971 -47983
10117 -47983 -75347 -46371 -68794 -62668 -75233 -61126 -126801 -160862 -138779 -90087 -40114 -21990
10105 -21990 -14716 -378 32180 103640 140483 162417 136328 57240 23388 25990 -25478 -84999
10093 -84999 -82899 -102277 -42011 -15422 4224 15312 34746 102215 98753 68209 41442 5781
$$ packed form
10176F2342N2807q225p7069m3187K7213L9556m1607J1957K5275K5084J4067K9656
10164A17869o5801p068R09L5375l8996j7701J2603K232m2092L6450L8554L3082
10152A05416L5817o3857l9690K1557K3795j2543k2817M1663L2032J4032j7143
10141A18262M616N081r063j9532K9229P2500p696n5555J2123l3962m4975J5907
10129H6935k5432o7196M4166J7141j9718j5273K5375L6285J3881l1389m1804p0954
10117d7983k7364K8976k2423O126j2565J4107o5675l4061K2083M8692M9973J8124
10105b1990P274J4338L2558P1460L6843K1934k6089p9088l3852K602n1468n9521
10093h4999K100j9378O0266K6589J9646J1088J9434O7469l462l0544k6767l5661
$$ plain form
10081 5781 -11167 -32204 -67901 -67540 -27726 20653 25708 -10252 -50366 -11865 38457 61980
10069 61980 39638 31340 38090 -4680 6921 -43923 -75852 -33348 -20562 -22689 -982 -939 16311
10056 16311 7189 17586 8127 4841 28006 15270 57535 89090 41774 24528 65338 42617
10044 42617 -39799 -10984 20230 39680 92027 104752 130535 80262 101808 106207 70092 20197
10032 20197 -1698 21616 46076 82229 23475 -15295 -50283 -21892 22503 25074 5196 -26946
10020 -26946 21290 9828 5378 -13649 -44869 -37616 -8001 -31177 -4232 15048 69294 128663
10008 128663 128236 87864 25147 -8333 -40845 -12181 15946 62592 28693 -2293 -50149 -113702
9996 -113702 -100969 -38242 20788 26962 -21069 -39469 -42003 -20168 5333 13594 -8213 72591
$$ packed form
10081E781j6948k1037l5697L61L9814M8379N055l5960m0114L8501N0322K3523
10069F1980k2342q298O750m2770J1601n0844l1929M2504J2786k127K1707M3J7250
10056A6311r122J0397r459l286K3165j2736M2265L1555m7316j7246M0810k2721
10044D2617q2416K8815L1214J9450N2347J2725K5783n0273K1546M399l6115m9895
10032B0197k1895K3314K4460L6153n8754l8770l4988K8391M4395K571j9878l2142
10020b6946M8236j1462m450j9027l1220P253K9615k3176K6945J9280N4246N9369
10008A28663m27m0372o2717l3480l2512K8664K8127M6646l3899l0986m7856o3553
9996a13702J2733O2727N9030O174m8031j8400k534K1835K5501Q261k1807Q0804
$$ plain form
9984 72591 80758 48227 50510 6402 22419 81752 64852 64962 100714 57293 43348 42653 61859
9971 61859 98251 58140 44195 62300 75916 29102 1647 -17465 51031 40823 43603 47325
9959 47325 13369 46780 100979 45261 -18870 -15583 95868 146455 44086 31884 93977 104883
9947 104883 58599 -1090 -1383 15862 57996 32096 -12037 7180 24301 25053 2541 -18918
9935 -18918 -45700 7906 107988 108916 94705 66650 30681 5340 8283 12067 -5765 15065
9923 15065 4632 4236 -2035 -84226 -101874 -39961 30519 132200 101985 50953 22809 -42071
9911 -42071 -33059 -48426 -9293 27182 14467 -17596 -8012 35899 63199 58916 22283 -6702
9899 -6702 61976 148970 134389 84584 51871 24986 66397 92411 26013 -6797 5060 56776
$$ packed form
9984G2591Q167l2531K283m4108J6017N9333j6900J10L5752m3421j3945o95J9206
9971F1859L6392m0111j3945J8105J3616m6814k7455j9112O8496j0208K780L722
9959D7325l3956L3411N4199n5718o4131L287J11451N0587j02369j2202O2093J0906
9947A04883m6284n9689k93J7245M2134k5900m4133J9217J7121P52k2512k1459
9935a8918k6782N3606J00082R28j4211k8055l5969k5341K943L784j7832K0830
9923A5065j0433l96o271q2191j7648O1913P0480J01681l0215n1032k8144o4880
9911d2071R012j5367L9133L6475j2715l2063R584M3911K7300m283l6633k8985
9899f702O8678Q6994j4581m9805l2713k6885M1411K6014o6398l2810J1857N1716
$$ plain form
9887 56776 71145 60408 67144 99704 132897 129846 124796 96561 69739 34161 55348 41916
9875 41916 45788 89304 135047 115060 103481 85916 49964 57580 19870 -79549 -157235 -136793
9863 -136793 -17904 54577 39070 -5085 48451 44533 99669 114749 110815 59077 107838 67588
9851 67588 88802 165493 205671 194847 155515 151410 179158 216598 216493 213249 245705 283163 377021
9838 377021 436339 476283 518988 477475 462921 444221 364967 380647 350635 332991 366129 395615
9826 395615 445527 534329 586375 613621 622700 598921 502187 376171 290310 229655 193926 78614
9814 78614 20885 41888 83067 63291 57295 119511 90602 54449 33620 -21067 3122 60818
9802 60818 50071 23347 56832 86818 107255 137115 173666 178971 201339 175953 82673 60066
$$ packed form
9887E6776J4369j0737O736L2560L3193l051n050k8235k6822l5578K1187j3432
9875D1916L872M3516M5743j9987j1579j7565l5952P616l7710r9419p7686K0442
9863a36793J18889P2481j5507m4155N3536l918N5136J5080l934n1738M8761m0250
9851F7588K1214P6691M0178j0824l9332m105K7748L7440j05l244L2456L7458R3858
9838C77021N9318L9944M2705m1513j4554j8700p9254J5680l0012j7644L3138K9486
9826C95615M9912Q8802N2046K7246R079k3779r6734j26016q5861o0655l5729j15312
9814G8614n7729K1003M1179j9776n996O2216k8909l6153k0829n4687K4189N7696
9802F0818j0747k6724L3485K9986K0437K9860L6551N305K2368k5386r3280k2607
$$ plain form
9790 60066 85052 58991 73264 134577 143258 143033 126178 137319 104951 101163 36911 -57362 -8203
9777 -8203 -97 64382 154142 112823 70986 84113 95045 103046 98683 63190 32016 39073 28774
9764 28774 13785 -10370 -60566 -54207 21748 25610 16822 55660 131621 85200 47082 117941
9752 117941 119357 100088 143613 153863 139031 117015 131565 163362 144185 129407 77603 81520
9740 81520 125968 112015 47135 7224 76203 136951 49317 44707 126558 140674 128740 106014
9728 106014 68530 57140 67753 65121 -17394 -49437 -18542 22944 33343 1900 15026 79805
9716 79805 139763 115872 75714 28797 88755 156864 150417 147880 193862 291292 370268 415140
9704 415140 520910 703069 1006806 1373871 1626285 1593496 1432775 1216522 1024956 743847
$$ packed form
9790F0066K4986k6061J4273O1313Q681k25j6855J1141l2368l788o4252r4273M9159
9777h203Q106O4479Q9760m1319m1837J3127J0932Q001m363l5493l1174P057j0299
9764B8774j4989k4155n0196O359P5955L862q788L8838P5961m6421l8118P0859
9752A17941J416j9269M3525J0250j4832k2016J4550L1797j9177j4778n1804L917
9740H1520M4448j3953o4880l9911O8979O0748q7634m610Q1851J4116j1934k2726
9728A06014l7484j1390J0613k632q2515l2043L0895M1486J0399l1443J3126O4779
9716G9805N9958k3891m0158m6917N9958O8109o447k537M5982R7430P8976M4872
9704D15140J05770J82159L03737L67065K52414l2789j60721k16253j91566k81109
$$ plain form
9694 743847 539672 421513 301933 227110 131596 80692 121561 115960 89543 139597 133866
9683 133866 91078 79787 111427 106926 115758 114112 113424 119128 146613 132229 131550 167893 141518
9670 141518 68775 52360 101645 159775 178555 142042 21196 42684 35157 71885 98357 92998
9658 92998 94593 113133 91304 122232 183509 210083 221608 269450 301954 310270 306170 257473
9646 257473 196498 179726 206775 174016 125434 121748 165518 151869 96002 84044 99333 99462
9634 99462 33177 13298 56930 51615 31081 86657 137201 129323 101790 51175 14700 15920
9622 15920 -19932 1789 34879 56818 35795 35206 -8546 -40785 -53783 -17600 9391 17678
9610 17678 54302 110038 135651 126545 81168 69676 81620 68429 79936 129888 204120 255971
$$ packed form
9694G43847k04175j18159j19580p4823r5514n0904M0869n601k6417N0054n731
9683A33866m2788j1291L1640m501Q832j646o88N704K7485j4384o79L6343k6375
9670A41518p2743j6415M9285N8130J8780l6513j20846K1488p527L6728K6472n359
9658I2998J595J8540k1829L0928O1277K6574J1525M7842L2504Q316m100m8697
9646B57473o0975j6772K7049l2759m8582l686M3770j3649n5867j1958J5289J29
9634I9462o6285j9879M3632n315k0534N5576N0544p878k7533n0615l6475J220
9622A5920l5852K1721L3090K1939k1023n89m3752l2239j2998L6183K6991Q287
9610A7678L6624N5736K5613r106m5377j1492J1944j3191J1507M9952P4232N1851
$$ plain form
9598 255971 145546 51475 42267 56255 123068 111803 68636 30543 59027 127490 152383 184533
9586 184533 186725 176274 152657 116364 134384 115100 111964 87997 102527 43890 73468 96401
9574 96401 134727 112520 45568 38030 -6978 -41451 -44687 20740 -44863 -17682 92629 84450
9562 84450 54138 -8061 -38227 19560 68634 33574 36578 79882 92145 62706 50714 50742 87314
9549 87314 161866 135576 141579 165078 177037 171342 142654 136065 145398 140614 91117 89064 165595
9536 165595 237329 218703 166414 132418 119845 137769 135249 86689 46390 52791 99669 162297
9524 162297 200800 234951 206370 157996 127137 120613 90159 56876 80615 107628 140970 194343
9512 194343 173616 90820 78232 76433 114854 119604 106698 74343 94079 140819 177575 116424
$$ packed form
9598B55971j10425r4071r208J3988O6813j1265m3167l8093K8484O8463K4893L2150
9586A84533K192j0451k3617l6293J8020j9284l136k3967J4530n8637K9578K2933
9574I6401L8326k2207o6952p538m5008l4473l236O5427o5603K7181J10311q179
9562H4450l0312o2199l0166N7787M9074l5060L004M3304J2263k9439j1992K8L6572
9549H7314P4552k6290O003K3499J1959n695k8688o589R333m784m9497k053P6531
9536A65595P1734j8626n2289l3996j2573J7924k520m8560m0299O401M6878O2628
9524A62297L8503L4151k8581m8374l0859o524l0454l3283K3739K7013L3342N3373
9512A94343k0727q2796j2588j799L8421M750j2906l2355J9736M6740L6756o1151
$$ plain form
9500 116424 33755 47711 124301 144329 149135 200850 179834 177245 196305 142515 162389 125629
9488 125629 99749 166480 232173 270967 294778 216926 199868 187522 185443 199268 208644 204060
9476 204060 211917 209125 207438 221053 148585 144785 130488 81338 148414 209231 161333 184567
9464 184567 195298 189232 200760 181675 234454 224827 159724 146551 149635 214128 242233 227506
9452 227506 189040 188582 188150 161436 157533 132605 105053 132429 221803 256028 229184 248072 228804
9439 228804 172714 208952 229187 213317 264730 288685 265339 233581 194309 228746 230174 204242
9427 204242 177128 228147 206413 187791 224695 281301 322282 313982 299954 290636 257754 229832
9415 229832 211818 195731 206947 247378 272084 306829 310655 272924 251082 227488 233714 194938
$$ packed form
9500A16424q2669J3956P6590K0028M806N1715k1016k589J9060n3790J9874l6760
9488A25629k5880O6731O5693L8794K3811p7852j7058j2346k079J3825R376m584
9476B04060P857k792j687J3615p2468l800j4297m9150O7076O0817m7898K3234
9464A84567J0731o066J1528j9085N2779r627o5103j3173L084O4493K8105j4727
9452B27506l8466m58m32k6714l903k4928k7552K7376Q9374L4225k6844J8888j9268
9439B28804n6090L6238K0235j5870N1413K3955k3346l1758l9272L4437J428k5932
9427B04242k7114N1019k1734j8622L6904N6606M0981q300j4028r318l2882k7922
9415B29832j8014j6087J1216M0431K4706L4745L826l7731k1842k3594O226l8776
$$ plain form
9403 194938 242400 348221 405118 439816 444985 441854 463069 417030 340211 341732 324448 315613
9391 315613 240956 214165 251850 296709 308962 276147 322493 353628 353243 268448 246240 287603
9379 287603 285846 255020 295769 304533 351636 386609 329865 254746 252674 274378 326160 356053
9367 356053 364626 359604 311396 315646 293290 331015 371716 351595 317476 347218 328657 299627
9355 299627 281378 303748 288229 335156 415854 429918 408502 375143 392416 396065 412389 383833
9343 383833 397268 431547 434048 418609 395008 378081 344426 325714 399488 439186 441433 406930
9331 406930 296264 232515 214835 272703 360011 386809 356912 369079 355256 314984 297799
9320 297799 361621 388959 471767 525791 550464 548758 521998 508181 507577 514756 531244 527657 523912
$$ packed form
9403A94938M7462J05821N6897L4698N169l131K1215m6039p6819J521j7284q835
9391C15613p4657k6791L7685M4859J2253l2815M6346L1135l85q4795k2208M1363
9379B87603j757l0826M0749Q764M7103L4973n6744p5119k072K1704N1782K9893
9367C56053Q573n022m8208M250k2356L7725M0701k0121l4119K9742j8561k9030
9355B99627j8249K2370j5519M6927Q0698J4064k1416l3359J7273L649J6324k8556
9343C83833J3435L4279K501j5439k3601j6927l3655j8712P3774L9698K247l4503
9331D06930j10666o3749j7680N7868Q7308K6798k9897J2167j3823m0272j7185
9320B97799O3822K7338Q2808N4024K4673j706k6760j3817o04P179J6488l587l745
$$ plain form
9307 523912 521988 525224 536497 558212 563004 656209 611444 591943 616024 574790 619743 670582
9295 670582 656199 611717 605697 686230 744226 760813 741898 719188 683446 690992 694387 740325
9283 740325 784434 743233 679335 624452 566761 606385 648462 586933 576228 535221 472623 481509
9271 481509 565602 618430 627535 611434 629630 591920 529584 560631 591580 574533 576037 618089
9259 618089 600455 618921 686043 681827 723344 691285 717652 722569 708054 687201 685123 625324
9247 625324 669747 726605 775456 855672 847407 801342 769756 727962 664203 674778 782162 816039
9235 816039 826164 889211 896303 869741 811718 830646 873754 789808 715432 705170 772108 761622
9223 761622 723149 768010 832840 852713 802789 754861 783824 711819 732119 798019 850747 896674
$$ packed form
9307E23912j924L236J1273K1715M792R3205m4765j9501K4081m1234M4953N0839
9295F70582j4383m4482o020Q0533N7996J6587j8915k2710l5742P546L395M5938
9283G40325M4109m1201o3898n4883n7691L9624M2077o1529j0705m1007o2598Q886
9271D81509Q4093N2828R105j6101J8196l7710o2336L1047L0949j7047J504M2052
9259F18089j7634J8466O7122m216M1517l2059K6367M917j4515k0853k078n9799
9247F25324M4423N6858M8851Q0216q265m6065l1586m1794o3759J0575J07384L3877
9235H16039J0125O3047P092k6562n8023J8928M3108q3946p4376j0262O6938j0486
9223G61622l8473M4861O4830J9873m9924m7928K8963p2005K0300O5900N2728M5927
$$ plain form
9211 896674 900625 877296 921127 938044 872808 909320 973454 971708 957338 961740 990362 1005973
9199 1005973 978477 975297 994096 950693 935956 939714 940523 954534 1007935 1064211 1052692 1059916
9187 1059916 1013244 991933 1022356 1045882 1066115 1110383 1098496 1056218 1041242 1017842 961868
9176 961868 990566 1040647 1070976 1110873 1146255 1179434 1181492 1211988 1283772 1319549 1245390 1262334
9164 1262334 1250300 1260735 1300088 1379572 1306344 1288455 1334127 1329146 1344633 1360945 1385109 1345763
9152 1345763 1397153 1382190 1406116 1488355 1529972 1597724 1603540 1586074 1606677 1628917 1603302 1594467
9140 1594467 1662353 1702614 1741796 1769866 1815614 1842685 1802656 1789613 1843196 1881977 1908715
9129 1908715 1910668 1903964 1953836 2051756 2126944 2151538 2171308 2207290 2180689 2209814 2262533 2328135
$$ packed form
9211H96674L951k3329M3831J6917o5236L6512O4134j746j4370M402K8622J5611
9199A005973k7496l180J8799m3403j4737L758Q09J4011N3401N6276j1519P224
9187A059916m6672k1311L0423K3526K0233M4268j1887m2278j4976k3400n5974
9176I61868K8698N0081L0329L9897L5382L3179K058L0496P1784L5777p4159J6944
9164A262334j2034J0435L9353P9484p3228j7889M5672m981J5487J6312K4164l9346
9152A345763N1390j4963K3926Q2239M1617O7752N816j7466K0603K2240k5615q835
9140A594467O7886M0261L9182K8070M5748K7071m0029j3043N3583L8781K6738
9129A908715J953o704M9872R7920P5188K4594J9770L5982k6601K9125N2719O5602
$$ plain form
9117 2328135 2384307 2441488 2508925 2560878 2620534 2611129 2588709 2595704 2662360 2701588 2771950 2789023
9105 2789023 2793969 2794691 2762726 2834023 2869246 2952705 3020319 3076807 3157576 3194945 3224985 3277516
9093 3277516 3386269 3479926 3508831 3554516 3545847 3623809 3718232 3756832 3752877 3832058 3924195 4026055
9081 4026055 4100872 4189639 4257996 4334759 4425428 4508025 4616978 4780905 4876017 5000013 5120978
9070 5120978 5204350 5290952 5378310 5492075 5647562 5758464 5864727 6037484 6226345 6372077
9060 6372077 6538455 6704552 6886890 7065743 7199954 7381735 7566596 7743065 7974264 8193046
9050 8193046 8443366 8712356 9022698 9252335 9560492 9926519 10238316 10573676 10894911 11208855
9040 11208855 11597024 12027034 12461292 12939988 13389776 13866846 14402772 14944579 15578916
$$ packed form
9117B328135N6172N7181O7437N1953N9656r405k2420O995O6656L9228P0362J7073
9105B789023M946P22l1965P1297L5223Q3459O7614N6488Q0769L7369L0040N2531
9093C277516J08753R3657K8905M5685q669P7962R4423L8600l955P9181R2137J01860
9081D026055P4817Q8767O8357P6763R0669Q2597J08953J63927R5112J23996J20965
9070E120978Q3372Q6602Q7358J13765J55487J10902J06263J72757J88861J45732
9060F372077J66378J66097J82338J78853J34211J81781J84861J76469K31199K18782
9050H193046K50320K68990L10342K29637L08157L66027L11797L35360L21235L13944
9040A1208855L88169M30010M34258M78696M49788M77070N35926N41807O34337
$$ plain form
9031 15578916 16268565 16957175 17672480 18357026 19103396 19931963 20880287 21817338 22837803
9022 22837803 23981336 25224327 26446089 27781569 29232820 30794519 32440484 34265608
9014 34265608 36242325 38330875 40575027 43062895 45789398 48728580 51947724 55439536
9006 55439536 59244314 63464315 68068126 73110727 78592971 84619680 91134929 98195444
8998 98195444 105939410 114272742 123176910 132654482 142588629 152903627 163500866 174080048
8990 174080048 184278410 193731932 202083941 208935194 213826128 216598784 217064212 215222002
8982 215222002 211166056 205093781 197380048 188489003 178758350 168591289 158332632 148171276
8974 148171276 138290147 128911322 120015049 111658943 103846461 96631452 90031920 83928200
$$ packed form
9031A5578916O89649O88610P15305O84546P46370Q28567R48324R37051J020465
9022B2837803J143533J242991J221762J335480J451251J561699J645965J825124
9014C4265608J976717K088550K244152K487868K726503K939182L219144L491812
9006E5439536L804778M220001M603811N042601N482244O026709O515249P060515
8998I8195444P743966Q333332Q904168R477572R934147J0314998J0597239J0579182
8990A74080048J0198362R453522Q352009O851253M890934K772656M65428j842210
8982B15222002m055946o072275p713733q891045r730653j0167061j0258657j0161356
8974A48171276r881129r378825q896273q356106p812482p215009o599532o103720
$$ plain form
8966 83928200 78319919 73159911 68420376 64081007 60082911 56385124 52946964 49872775
8958 49872775 47004033 44326773 41833865 39541727 37442369 35488374 33628082 31908614
8950 31908614 30337581 28864051 27440369 26120581 24909868 23797162 22760083 21756168
8942 21756168 20781907 19835118 18907308 18205031 17548455 16889507 16239230 15592389 14981536
8933 14981536 14407944 13896805 13365824 12866081 12409024 11999803 11683222 11354629 10949245
8924 10949245 10593962 10322488 10001432 9647503 9317199 9033701 8795397 8556349 8308266
8915 8308266 8077547 7841215 7661935 7477777 7249093 6987617 6795994 6696997 6538750 6375410
8905 6375410 6236678 6069968 5916626 5773619 5650330 5486188 5368143 5330016 5223502 5080403
$$ packed form
8966H3928200n608281n160008m739535m339369l998096l697787l438160l074189
8958D9872775k868742k677260k492908k292138k099358j953995j860292j719468
8950C1908614j571033j473530j423682j319788j210713j112706j037079j003915
8942B1756168r74261r46789r27810p02277o56576o58948o50277o46841o10853
8933A4981536n73592n11139n30981m99743m57057m09221l16581l28593m05384
8924A0949245l55283k71474l21056l53929l30304k83498k38304k39048k48083
8915H308266k30719k36332j79280j84158k28684k61476j91623r8997j58247j63340
8905F375410j38732j66710j53342j43007j23289j64142j18045l8127j06514j43099
$$ plain form
8895 5080403 5026109 4882047 4733426 4654795 4565731 4403646 4242438 4124955 4037831 3970717
8885 3970717 3958518 3937098 3743770 3604912 3551422 3516709 3492472 3503952 3477786 3372867 3292560
8874 3292560 3225202 3223459 3180347 3113687 3041630 3034544 2975290 2923226 2911734 2919832 2864944 2788784
8862 2788784 2725279 2684701 2640609 2576107 2503972 2478860 2456093 2396353 2368944 2369146 2291816 2250295
8850 2250295 2241040 2163665 2126635 2108033 2078015 2057334 1969691 1930120 1925034 1905307 1883084 1915061
8838 1915061 1851704 1805351 1793014 1781149 1788051 1828265 1765749 1749340 1749549 1703137 1706361 1706860 1668058
8825 1668058 1644531 1633001 1617511 1587304 1557381 1531150 1545351 1525446 1500787 1507172 1488617 1425092
8813 1425092 1376440 1346435 1344252 1312557 1282149 1255780 1187708 1203146 1252454 1305552 1311503 1308675
$$ packed form
8895E080403n4294j44062j48621p8631q9064j62085j61208j17483q7124o7114
8885C970717j2199k1420j93328j38858n3490l4713k4237J1480k6166j04919q0307
8874C292560o7358j743m3112o6660p2057p086n9254n2064j1492Q098n4888p6160
8862B788784o3505m0578m4092o4502p2135k5112k2767n9740k7409K02p7330m1521
8850B250295r255p7375l7030j8602l0018k0681q7643l9571n086j9727k2223L1977
8838A915061o3357m6353j2337j1865O902M0214o2516j6409K09m6412L224M99l8802
8825A668058k3527j1530j5490l0207k9923k6231J4201j9905k4659O385j8555o3525
8813A425092m8652l0005k183l1695l0408k6369o8072J5438M9308N3098N951k828
$$ plain form
8801 1308675 1304547 1291743 1225325 1104469 1045879 1031845 1000855 984400 1046643 1097124 1096158 1090811
8789 1090811 1123029 1133279 1088840 1067855 1039786 993524 950025 980098 992803 1018505 1055294
8778 1055294 1088040 1085724 1085093 1074461 1005092 989818 953327 892580 910688 927123 956225 979866
8766 979866 954119 931585 928560 915942 835277 846116 842813 834892 842061 847778 846870 831873 826628
8753 826628 846511 891130 843646 800194 793973 802986 798211 781196 796078 789605 720748 702415
8741 702415 702583 678400 650549 619913 569220 636009 669437 692304 643200 627168 641685 648756
8729 648756 658163 641876 692615 802706 757384 685003 679623 674856 654138 605421 596148 600361
8717 600361 592342 568633 539621 571293 537749 519441 540592 526013 540408 552465 489508 468529
$$ packed form
8801A308675m128j2804o6418j20856n8590j4034l0990j6455O2243N0481r66n347
8789A090811L2218J0250m4439k0985k8069m6262m3499L0073J2705K5702L6789
8778A055294L2746k316o31j0632o9369j5274l6491o0747J8108J6435K9102K3641
8766I79866k5747k2534l025j2618q0665J0839l303p921P169N717r08j4997n245
8753H26628J9883M4619m7484m3452o221R013m775j7015J4882o473o8857j8333
8741G02415J68k4183k7851l0636n0693O6789L3428K2867m9104j6032J4517P071
8729F48756R407j6287N0739J10091m5322p2381n380m767k0718m8717r273M213
8717F00361q019k3709k9012L1672l3544j8308K1151j4579J4395J2057o2957k0979
$$ plain form
8705 468529 488054 493131 539447 510725 491813 512255 632072 649456 549720 509869 539024 536013
8693 536013 511469 483302 424077 383542 338014 382072 399915 392418 417330 409618 391444 355458
8681 355458 351012 332064 336686 348910 385873 369584 348883 262944 271317 297065 346139 356589
8669 356589 334384 335409 384928 347657 299047 241125 310435 313526 351922 341612 325053 298834
8657 298834 313798 327324 388902 427824 435516 431971 394270 375574 394414 452111 443762 517895
8645 517895 549894 467588 455050 395313 380624 441975 403739 381251 381776 402365 406869 357942
8633 357942 354316 419693 417993 388267 375282 383874 442531 485041 492296 437766 374960 360393
8621 360393 387417 450312 463802 450815 441365 433460 470221 472989 471802 491604 477667 475170 452944
$$ packed form
8705D68529J9525N077M6316k8722j8912K0442J19817J7384r9736l9851K9155l011
8693E36013k4544k8167n9225m0535m5528M4058J7843p497K4912p712j8174l5986
8681C55458m446j8948M622J2224L6963j6289k0701q5939Q373K5748M9074J0450
8669C56589k2205J025M9519l7271m8610n7922O9310L091L8396j0310j6559k6219
8657B98834J4964J3526O1578L8922P692l545l7701j8696J8840N7697q349P4133
8645E17895L1999q2306j2538n9737j4689O1351l8236k2488N25K0589M504m8927
8633C57942l626O5377j700k9726j2985Q592N8657M2510P255n4530o2806j4567
8621C60393K7024O2895J3490j2987r450p905L6761K768j187J9802j3937k497k2226
$$ plain form
8608 452944 444800 559800 563505 498552 405610 405220 416376 461582 510477 551199 590484 614744
8596 614744 654842 690163 741168 803281 825271 780314 821362 876739 824011 723510 678390
8585 678390 630991 588138 486692 483515 473747 457824 493157 478552 457596 421623 326151 275899
8573 275899 256692 286983 303846 305110 287167 249169 231654 249282 311023 403351 388226 316187
8561 316187 255474 272418 309795 307153 326553 275911 181230 176167 191058 168014 188789 194245
8549 194245 209061 223920 223632 253370 252413 279059 288212 298617 262241 244170 268959 232757 188176
8536 188176 176583 169505 244521 293566 242636 208664 265118 256199 270352 280585 247295 262354
8524 262354 197973 195272 208081 199525 250886 262692 212211 214013 145870 160853 178732 158175
$$ packed form
8608D52944q144J15000L705o4953r2942l90J1156M5206M8895M0722L9285K4260
8596F14744M0098L5321N1005O2113K1990m4957M1048N5377n2728j00501m5120
8585F78390m7399m2853j01446l177r768j5923L5333j4605k0956l5973r5472n0252
8573B75899j9207L0291J6863J264j7943l7998j7515J7628O1741R2328j5125p2039
8561C16187o0713J6944L7377k642J9400n0642r4681n063J4891k3044K0775N456
8549A94245J4816J4859k88K9738r57K6646R153J0405l6376j8071K4789l6202m4581
8536A88176j1593p078P5016M9045n0930l3972N6454q919J4153J0233l3290J5059
8524B62354o4381k701J2809q556N1361J1806n0481J802o8143J4983J7879k0557
$$ plain form
8512 158175 143303 216377 249768 291869 252124 196709 248458 245362 190232 159996 159898 230933
8500 230933 278945 258999 241128 281322 258978 269932 262203 232315 227989 213082 135745 107267
8488 107267 166199 197148 196663 170302 185750 184666 155751 103622 103500 88307 126122 153647 89338
8475 89338 87445 143801 187226 151791 137922 131985 123129 160402 210226 168674 201657 190936
8463 190936 171081 172598 129049 145682 200083 173795 95779 86388 88948 68222 107028 112671
8451 112671 144552 180542 131451 98313 136843 71646 116122 218239 259470 222491 230769 217572
8439 217572 155532 102536 68896 53937 85216 87895 118523 137182 151545 132182 145284 165537
8427 165537 178415 133919 83522 108202 100629 115214 122547 133478 182561 194886 158325 134782
$$ packed form
8512A58175j4872P3074L3391M2101l9745n5415N1749l096n5130l0236r8P1035
8500B30933M8012j9946j7871M0194k2344J0954p729k9888m326j4907p7337k8478
8488A07267N8932L0949m85k6361J5448j084k8915n2129j22j5193L7815K7525o4309
8475H9338j893N6356M3425l5435j3869n937q856L7273M9824m1552L2983j0721
8463A90936j9855J517m3549J6633N4401k6288p8016r391K560k0726L8806N643
8451A12671L1881L5990m9091l3138L8530o5197M4476J02117M1231l6979Q278j3197
8439B17572o2040n2996l3640j4959L1279K679L0628J8659J4363j9363J3102K0253
8427A65537J2878m4496n0397K4680p573J4585P333J0931M9083J2325l6561k3543
$$ plain form
8415 134782 175089 183120 158942 156215 122397 74915 98031 96273 42474 14872 40589 103642
8403 103642 107165 103036 119542 168388 200648 124201 65156 45888 53302 110895 130590 138208
8391 138208 166450 139605 149387 122477 139717 101062 98271 104709 47894 2210 26558 54336
8379 54336 137611 183076 152147 116195 139826 142127 148528 197588 208222 136389 102536 98091
8367 98091 70532 43532 103879 120549 135997 105200 2383 -3825 -8687 76342 131707 154366
8355 154366 175184 136837 93656 106454 93344 93767 96691 65732 106984 118352 103499 154419
8343 154419 149496 95942 69035 105151 67269 10696 -6129 33186 92276 52535 21063 24521
8331 24521 61177 31014 75528 88884 36478 2873 9329 1081 71300 49674 24116 104304
$$ packed form
8415A34782M0307Q031k4178k727l3818m7482K3116j758n3799k7602K5717O3053
8403A03642L523m129J6506M8846L2260p6447n9045j9268P414N7593J9695P618
8391A38208K8242k6845R782k6910J7240l8655k791O438n6815m5684K4348K7778
8379E4336Q3275M5465l0929l5952K3631K301O401M9060J0634p1833l3853m445
8367I8091k7559k7000O0347J6670J5448l0797j02817o208m862Q5029N5365K2659
8355A54366K0818l8347m3181J2798j3110M23K924l0959M1252J1368j4853N0920
8343A54419m923n3554k6907L6116l7882n6573j6825L9315N9090l9741l1472L458
8331B4521L6656l0163M4514J3356n2406l3605O456q248P0219k1626k5558Q0188
$$ plain form
8319 104304 113559 141720 164999 140721 56194 70225 89193 139112 103259 65398 98916 149639
8307 149639 209916 171349 158638 126802 91510 85247 91718 67115 19296 1411 35042 108548
8295 108548 170905 166032 107317 148177 116391 50466 33521 53375 82540 37297 44939 77279
8283 77279 80067 62844 27802 -34331 -20191 -79144 -89394 -7375 41713 12117 -9972 39837
8271 39837 63488 76571 49331 77588 108945 125868 130656 69088 48649 69767 35068 18941
8259 18941 78046 134615 165099 162452 147209 132362 142924 157609 105211 66727 29139 55131
8247 55131 122386 116037 54479 45569 101086 119160 153503 130850 93209 75031 79535 24267
8235 24267 -33306 -9360 41990 65644 55149 86370 145082 135950 109295 127473 75455 117764
$$ packed form
8319A04304R255K8161K3279k4278q4527J4031J8968M9919l5853l7861L3518N0723
8307A49639O0277l8567j2711l1836l5292o263O471k4603m7819j7885L3631P3506
8295A08548O2357m873n8715M0860l1786o5925j6945J9854K9165m5243P642L2340
8283G7279K788j7223l5042o2133J4140n8953j0250Q2019M9088k9596k2089M9809
8271C9837K3651J3083k7240K8257L1357J6923M788o1568k0439K1118l4699j6127
8259A8941N9105N6569L0484k647j5243j4847J0562J4685n2398l8484l7588K5992
8247E5131O7255o349o1558q910N5517J8074L4343k2653l7641j8178M504n5268
8235B4267n7573K3946N1350K3654j0495L1221N8712r132k6655J8178n2018M2309
$$ plain form
8223 117764 140750 123059 93249 74122 93109 53042 49477 84511 80134 66796 42552 75483
8211 75483 65085 19672 10099 68011 92630 53092 -57723 -43538 -5264 4581 36260 35579
8199 35579 91063 122446 69379 49827 75346 59652 25529 29685 39231 22644 19283 84913
8187 84913 61623 52356 51898 28592 40326 14445 17624 46908 29701 29056 43212 17274 21902
8174 21902 20235 97383 92213 42811 34506 21555 62542 59008 81789 129286 139405 160682 111711
8161 111711 69355 88282 86591 78514 48548 5845 8326 45462 32373 44017 56379 39855
8149 39855 60611 -1379 -34068 -53681 -78030 -45131 63880 47409 -35074 -62831 -919 74961
8137 74961 63784 40929 35801 41707 67297 69238 59278 60255 13191 34627 60322 42291 73058
$$ packed form
8223A17764K2986j7691k9810j9127J8987m0067l565L5034m377j3338k4244L2931
8211G5483j0398m5413r573N7912K4619l9538j10815J4185L8274R845L1679o81
8199C5579N5484L1383n3067j9552K5519j5694l4123M156R546j6587l361O5630
8187H4913k3290r267m58k3306J1734k5881L179K9284j7207o45J4156k5938M628
8174B1902j667P7148n170m9402q305j2951M0987l534K2781M7497J0119K1277m8971
8161A11711m2356J8927j691q077k9966m2703K481L7136j3089J1644J2362j6524
8149C9855K0756o1990l2689j9613k4349L2899J09011j6471q2483k7757O1912P5880
8137G4961j1177k2855n128N906K5590J941r960R77m7064K1436K5695j8031L0767
$$ plain form
8124 73058 83226 135807 181577 175078 155802 78525 24960 15050 44937 19099 49797 35631
8112 35631 21601 70637 16336 10416 16045 36865 -17749 -43592 -61345 -9626 118359 168184
8100 168184 144426 143433 72788 50356 33256 -23921 -29443 -66969 -41528 -13282 -35422 75495
8088 75495 127583 134712 143053 120644 57072 -12179 12571 8302 4052 -2213 -25932 -77159 -53760
8075 -53760 24492 14541 3160 17073 51071 63990 101774 144870 91841 90322 91061 75868 68608
8062 68608 62535 53079 17168 -1132 70463 135954 158535 83990 63791 54469 84551 70470
8050 70470 53493 87076 86936 49104 82552 132855 149222 132113 103916 125525 132921 151628
8038 151628 208925 229186 108351 25413 31225 65020 58890 88057 105687 107071 96615 83664
$$ packed form
8124G3058J0168N2581M5770o499j9276p7277n3565r910K9887k5838L0698j4166
8112C5631j4030M9036n4301n920N629K0820n4614k5843j7753N1719J27985M9825
8100A68184k3758r93p0645k2432j7100n7177n522l7526K5441K8246k2140J10917
8088G5495N2088P129Q341k2409o3572o9251K4750m269m250o265k3719n1227K3399
8075e3760P8252r951j1381J3913L3998J2919L7784M3096n3029j519P39j5193p260
8062F8608o073r456l5911j8300P1595O5491K2581p4545k0199r322L0082j4081
8050G0470j6977L3583j40l7832L3448N0303J6367j7109k8197K1609P396J8707
8038A51628N7297K0261j20835q2938N812L3795o130K9167J7630J384j0456j2951
$$ plain form
8026 83664 86508 55232 71972 25997 1169 53536 135375 141493 97192 127593 136720 114154
8014 114154 81230 68048 52212 51629 66269 124719 160342 161321 206958 241322 223224 162840
8002 162840 200216 271798 273538 221881 144571 110137 89765 100058 130345 139909 168935 72079
7990 72079 53650 82891 116754 108435 117165 123590 15634 33149 88445 87367 57093 51450 10921
7977 10921 13942 12379 40294 91508 107300 92735 32584 72235 104012 135500 168992 174758
7965 174758 171147 131688 89890 130250 211878 256126 206896 198099 185927 131546 145626 118647
7953 118647 112670 110828 85454 69205 120332 153726 195136 202772 165800 129300 56833 -43928
7941 -43928 -16621 29195 92845 86741 71956 120031 121393 144307 77334 38194 92325 62411
$$ packed form
8026H3664K844l1276J6740m5975k4828N2367Q1839O118m4301L0401R127k2566
8014A14154l2924j3182j5836n83J4640N8450L5623R79M5637L4364j8098o0384
8002A62840L7376P1582J740n1657p7310l4434k0372J0293L0287R564K9026r6856
7990G2079j8429K9241L3863q319Q730O425j07956J7515N5296j078l0274n643m0529
7977A0921L021j563K7915N1214J5792j4565o0151L9651L1777L1488L3492N766
7965A74758l611l9459m1798M0360Q1628M4248m9230q797j2172n4381J4080k6979
7953A18647n977j842k5374j6249N1127L3394M1410P636l6972l6500p2467j00761
7941d3928K7307M5816O3650o104j4785M8075J362K2914o6973l9140N4131k9914
$$ plain form
7929 62411 40195 50070 63134 38912 64369 129595 54933 -14200 -27960 -11097 4099 -11443
7917 -11443 -8189 58901 97103 107674 33109 -5522 74082 53355 139138 138002 149895 129249
7905 129249 62349 41644 21622 40533 25690 45377 119871 194049 159160 95719 74637 66380
7893 66380 83600 103211 101900 43034 28224 -34830 -45243 -1199 34201 13494 -55064 -79282
7881 -79282 -40452 25117 108872 109435 79425 94559 84331 71753 76390 69777 49598 73513 51051
7868 51051 4341 17528 26087 19719 25354 44516 53165 45197 28561 -5602 24494 33096 7238
7855 7238 -25685 -19122 9758 43087 80294 8886 -12640 23777 -24949 -51681 -18435 -91
7843 -91 39767 73412 57469 87276 79470 50237 27083 46056 100681 163886 162438 136558 150333
$$ packed form
7929F2411k2216R875J3064k4222K5457O5226p4662o9133j3760J6863J5196j5542
7917a1443L254O7090L8202J0571p4565l8631P9604k0727Q5783j136J1893k0646
7905A29249o6900k0705k0022J8911j4843J9687P4494P4178l4889o3441k1082q257
7893F6380J7220J9611j311n8866j4810o3054j0413M4044L5400k0707o8558k4218
7881g9282L8830O5569Q3755N63l0010J5134j0228j2578M637o613k0179K3915k2462
7868E1051m6710J3187Q559o368N635J9162Q649p968j6636l4163L0096Q602k5858
7855G238l2923O563K8880L3329L7207p1408k1526L6417m8726k6732L3246J8344
7843i1L9858L3645j5943K9807p806k9233k3154J8973N4625O3205j448k5880J3775
$$ plain form
7830 150333 139766 72550 21532 84966 120773 104280 66549 15180 44323 81877 115623 144505
7818 144505 153121 148482 52030 17476 -7734 36076 94590 76475 14255 -21754 -2476 49742
7806 49742 1756 4324 33339 57219 34906 22177 78585 94969 35065 46553 37920 80938
7794 80938 123044 151291 100259 57786 60035 72517 27253 39801 -329 -5373 29999 77904
7782 77904 72966 50614 46159 67339 73179 111427 40395 -62413 -19222 2999 -23864 -5438
7770 -5438 -13825 -85103 -31552 10005 41749 64868 69934 41271 55202 44762 28468 30514 12925
7757 12925 -23599 -41448 51820 57312 78298 80492 66453 14788 46429 88905 87646 88127 49615
7744 49615 60108 17010 -23683 -23846 5207 51362 78144 30170 -54957 25353 98998 94587
$$ packed form
7830A50333j0567o7216n1018O3434L5807j6493l7731n1369K9143L7554L3746K8882
7818A44505Q616m639r6452l4554k5210M3810N8514j8115o2220l6009J9278N2218
7806D9742m7986K568K9015K3880k2313j2729N6408J6384n9904J1488q633M3018
7794H0938M2106K8247n1032m2473K249J2482m5264J2548m0130n044L5372M7905
7782G7904m938k2352m455K1180N840L8248p1032j02808M3191K2221k6863J8426
7770e438q387p1278N3551M1557L1744K3119N066k8663J3931j0440j6294K046j7589
7757A2925l6524j7849R3268N492K0986K194j4039n1665L1641M2476j259M81l8512
7744D9615J0493m3098m0693j63K9053M6155K6782m7974q5127Q0310P3645m411
$$ plain form
7732 94587 40938 44541 45091 33929 12435 39507 78356 39194 -48833 -100557 -109673 -131634 -106987
7719 -106987 24396 62358 -31747 -59465 -48128 -40479 -86645 -46915 -4238 -21214 -54715 -40894
7707 -40894 5849 4206 16740 -14930 -89519 -104469 -64928 -96040 -112208 -57228 -14508 54087
7695 54087 62778 16447 11840 41648 6283 -67533 -77703 -104311 -57576 -3122 -20188 -28577
7683 -28577 -70394 -42459 -32874 -39510 -30117 -41744 -79165 -109277 -106444 -75304 3626 10933 -14544
7670 -14544 -55320 -56373 -55645 -40309 22722 72030 86783 35730 -6325 -35185 -108251 -102044 -92255
7657 -92255 -40779 -73234 -17473 83716 114044 151974 159645 106692 44023 28171 -2456 -20680
7645 -20680 -28580 -63227 -98389 -71378 -66095 -61412 -7199 -57243 -77167 -8709 -17790 -26222 -39885
$$ packed form
7732I4587n3649L603N50j1162k1494K7072L8849l9162q8027n1724r116k1961K4647
7719a06987J31383L7962r4105k7718J1337P649m6166L9730M2677j6976l3501J3821
7707d0894M6743j643J2534l1670p4589j4950L9541l1112j6168N4980M2720O8595
7695E4087Q691m6331m607K9808l5365p3816j0170k6608M6735N4454j7066q389
7683b8577m1817K7935R585o636R393j1627l7421l0112K833L1140P8930P307k5477
7670a4544m0776j053P28J5336O3031M9308J4753n1053m2055k8860p3066O207R789
7657i2255N1476l2455N5761J01189L0328L7930P671n2953o2669j5852l0627j8224
7645b0680p900l4647l5162K7011N283M683N4213n0044j9924O8458r081q432j3663
$$ plain form
7632 -39885 -85373 -81111 -66344 -100567 -163287 -158587 -118301 -145158 -193197 -162832 -168414 -168272 -147549
7619 -147549 -116311 -62724 -32363 -38409 1605 -25948 -25093 -39487 -62437 -30965 -42559 -75612
7607 -75612 -78735 -64962 -27534 4862 45064 43804 -6187 -39849 -45742 -47938 -83869 -76315 -80907
7594 -80907 -74905 26201 54490 86374 74141 49819 3591 -29548 20575 54197 31352 86342
7582 86342 18057 5767 -30284 -43570 -8502 48023 -548 -8759 -16201 -25839 -15489 25746
7570 25746 44021 37988 24788 -16704 -11946 -36776 -70716 -88387 -65124 -73195 -10767 55390
7558 55390 106671 36124 1044 2334 10455 -8375 64116 128324 166641 138502 43415 -19432
7546 -19432 -17987 2156 6360 18489 64913 37878 -9463 -9889 3353 58940 47240 34838 20117
$$ packed form
7632c9885m5488M262J4767l4223o2720M700M0286k6857m8039L0365n582J42K0723
7619a47549L1238N3587L0361o046M0014k7553Q55j4394k2950L1472j1594l3053
7607g5612l123J3773L7428L2396M0202j260m9991l3662n893k196l5931P554m592
7594h0907O002J01106K8289L1884j2233k4322m6228l3139N0123L3622k2845N4990
7582H6342o8285j2290l6051j3286L5068N6525m8571q211p442r638J0350M1235
7570B5746J8275o033j3200m1492M758k4830l3940j7671K3263q071O2428O6157
7558E5390N1281p0547l5080J290Q121j8830P2491O4208L8317k8139r5087o2847
7546a9432J445K0143M204J2129M6424k7035m7341m26J3242N5587j1700j2402j4721
$$ plain form
7533 20117 -19078 -104252 -94951 -48609 32732 84201 72928 52645 107525 69200 12698 -28050
7521 -28050 -8258 19724 -19950 -21837 -342 65310 69311 34933 -3194 -17904 -7811 37666
7509 37666 43557 29676 -74009 -106360 -85648 -31422 -89294 -84813 -33291 9548 -3079 2337
7497 2337 10999 9590 -14607 -35930 -30782 17809 68383 90690 63878 31931 10238 -5805 -30242
7484 -30242 -5369 -7111 -31510 -31217 -13945 -7303 -37228 -33611 -47399 -97056 -114426 -69343 -65955
7471 -65955 -43424 -49929 -52724 -108325 -77098 -57179 -28676 -36301 -23209 12635 11054 -14656 -47590
7458 -47590 -6270 63166 70477 28612 -5037 -15590 1949 -79285 -78863 -31432 -17761 -60408
7446 -60408 -70909 -61804 -19506 -17630 -24656 -14400 18307 23917 6803 -24824 -51804 -81645 -42415
$$ packed form
7533B0117l9195q5174R301M6342Q1341N1469j1273k0283N4880l8325n6502m0748
7521b8050J9792K7982l9674j887K1495O5652M001l4378l8127j4710J0093M5477
7509C7666N891j3881j03685l2351K0712N4226n7872M481N1522M2839j2627N416
7497B337Q662j409k4197k1323N148M8591N0574K2307k6812l1947k1693j6043k4437
7484c0242K4873j742k4399K93J7272O642k9925L617j3788m9657j7370M5083L388
7471f5955K2531o505k795n5601L1227J9919K8503p625J3092L5844j581k5710l2934
7458d7590M1320O9436P311m1865l3649j0553J7539q1234M22M7431J3671m2647
7446f0408j0501R105M2298J876p026J0256L2707N610j7114l1627k6980k9841L9230
$$ plain form
7433 -42415 21082 -6279 -60732 -49722 82081 121851 108355 73851 57132 16102 -15843 830
7421 830 -7191 9078 37339 26273 -5260 -54931 -60237 12626 -2462 7902 79380 32110 -3008
7408 -3008 -32975 -110353 -108815 -125300 -128686 -61223 -46562 -107454 -108241 -78041 -56072 -66481 -62801
7395 -62801 -49184 -92442 -84315 -79825 -80342 36222 62992 24845 23194 -11279 -47256 -37651 -72174
7382 -72174 -59872 -64886 -53381 -9207 29008 -7486 -24328 -10654 -15253 -1374 -28055 -46822
$$ packed form
7433d2415O3497k7361n4453J1010J31803L9770j3496l4504j6719m1030l1945J6673
7421H30q021J6269K8261j1066l1533m9671n306P2863j5088J0364P1478m7270l5118
7408c008k9967p7378J538j6485l386O7463J4661o0892p87L0200K1969j0409L680
7395f2801J3617m3258Q127M490n17J16564K6770l8147j651l4473l5977R605l4523
7382g2174J2302n014J1505M4174L8215l6494j6842J3674m599J3879k6681j8767
$$ [...]
##END NTUPLES=NMR SPECTRUM
##END=
