##TITLE=Analysis number 315467
Compound Code cc 34402
Book Reference 440/102
Project Code adrs
Chemist Name craigr
##JCAMPDX= 6.0         $$ Bruker NMR JCAMP-DX V2.0
##DATA TYPE= NMR SPECTRUM
##DATA CLASS= NTUPLES
##ORIGIN= Bruker BioSpin GmbH
##OWNER= NMR
$$ XWIN-NMR		Version 3.5
$$ Mon Nov 21 09:24:47 2005 GMT Standard Time (UT+0h)  MAYBRIDGE\NMR@NMR_250MHZ
##.OBSERVE FREQUENCY= 250.131544655141
##.OBSERVE NUCLEUS= ^1H
##.ACQUISITION MODE= SIMULTANEOUS (DQD)
##.ACQUISITION SCHEME= undefined
##.AVERAGES= 16
##.DIGITISER RES= 18
##SPECTROMETER/DATA SYSTEM= dpx250
##.PULSE SEQUENCE= zg30
##.SOLVENT NAME= CDCl3
##.SHIFT REFERENCE= (INTERNAL, CDCl3, 0, 16.522)
##AUDIT TRAIL= $$ (NUMBER, WHEN, WHO, WHERE, WHAT)
$$ ##TITLE= Audit trail, XWIN-NMR		Version 3.5
$$ ##JCAMPDX= 5.01
$$ ##ORIGIN= Bruker BioSpin GmbH
$$ ##OWNER= NMR
$$ C:\u/data/dgb/nmr/ADRS/12690/pdata/1/auditp.txt
$$ ##AUDIT TRAIL=  $$ (NUMBER, WHEN, WHO, WHERE, WHAT)
(   1,<2005-11-21 09:24:26.07 +000>,<MAYBRIDGE\NMR>,<NMR_250MHZ>,
      <created by zg, POWCHK disabled, PULCHK disabled
       configuration hash MD5:
       62 19 C7 07 E1 42 D1 B7 37 6C 3D D0 77 39 F9 E6
       data hash MD5: 64K
       32 AA EC 57 27 F3 7E 3A FD 4B 23 03 5D DA 21 41>)
(   2,<2005-11-21 09:24:37.71 +000>,<MAYBRIDGE\NMR>,<NMR_250MHZ>,
      <Start of raw data processing
       ef LB = 0.3 FT_mod = 6 PKNL = 1 SI = 32K 
       data hash MD5: 32K
       C3 49 8A 2E AD 1E 6A F3 8F AC E2 F3 96 67 32 AF>)
(   3,<2005-11-21 09:24:39.57 +000>,<MAYBRIDGE\NMR>,<NMR_250MHZ>,
      <apk 
       data hash MD5: 32K
       E6 6E 1A E6 12 3E BC 42 2D 4B ED 37 DE C6 6D C7>)
(   4,<2005-11-21 09:24:40.60 +000>,<MAYBRIDGE\NMR>,<NMR_250MHZ>,
      <abs ABSG = 5 
       data hash MD5: 32K
       6B EE 4E 67 DD 81 FC A7 63 BF 5C 7F 23 A6 5D 8C>)
$$ ##END=
$$ 
$$ hash MD5
$$ 95 46 D6 78 6A 16 D0 96 A2 9C 1F A6 8F E8 FF FA
##$RELAX= 
##$RELAX= 
##$RELAX= 
##$RELAX= 
##$RELAX= 
##$RELAX= 
##$RELAX= 
$$ Bruker specific parameters
$$ --------------------------
##$DU= <C:\u>
##$EXPNO= 12690
##$NAME= <ADRS>
##$PROCNO= 1
##$TYPE= <nmr>
##$USER= <dgb>
##$AMP= (0..31)
100 100 100 100 100 100 100 100 100 100 100 100 100 100 100 100 100 100 
100 100 100 100 100 100 100 100 100 100 100 100 100 100 
##$AQSEQ= 0
##$AQ_mod= 3
##$AUNM= <au_zg>
##$AUTOPOS= <5 >
##$BF1= 250.13
##$BF2= 250.13
##$BF3= 250.13
##$BF4= 250.13
##$BF5= 500.13
##$BF6= 500.13
##$BF7= 500.13
##$BF8= 500.13
##$BYTORDA= 1
##$CFDGTYP= 0
##$CFRGTYP= 5
##$CHEMSTR= <none>
##$CNST= (0..31)
1 1 145 1 1 1 1 1 1 1 1 1 1 1 1 1 1 1 1 1 1 1 1 1 1 1 1 1 1 1 1 1 
##$CPDPRG= <>
##$CPDPRG1= <>
##$CPDPRG2= <>
##$CPDPRG3= <>
##$CPDPRG4= <mlev>
##$CPDPRG5= <mlev>
##$CPDPRG6= <mlev>
##$CPDPRG7= <mlev>
##$CPDPRG8= <mlev>
##$CPDPRGB= <>
##$CPDPRGT= <>
##$D= (0..31)
0 1 0 0 0 0 0 0 0 0.06 0 0 0 0 0 0 0.0002 0 0 0 0 0 0 0 0 0 0 0 0 0 0 
0 
##$DATE= 1132565064
##$DBL= (0..7)
120 120 120 120 120 120 120 120 
##$DBP= (0..7)
150 150 150 150 150 150 150 150 
##$DBP07= 0
##$DBPNAM0= <>
##$DBPNAM1= <>
$$ [...]
##$SUBNAM7= <"">
##$SUBNAM8= <"">
##$SUBNAM9= <"">
##$SW= 20.6930455092707
##$SWIBOX= (0..15)
0 0 3 0 0 0 0 0 0 0 0 0 0 0 0 0 
##$SW_h= 5175.983436853
##$TD= 65536
##$TD0= 1
##$TE= 294.16
##$TE2= 300
##$TE3= 300
##$TEG= 300
##$TL= (0..7)
0 120 120 120 120 120 120 120 
##$TP= (0..7)
150 150 150 150 150 150 150 150 
##$TP07= 0
##$TPNAME0= <>
##$TPNAME1= <>
##$TPNAME2= <>
##$TPNAME3= <>
##$TPNAME4= <>
##$TPNAME5= <>
##$TPNAME6= <>
##$TPNAME7= <>
##$TPOAL= (0..7)
0.5 0.5 0.5 0.5 0.5 0.5 0.5 0.5 
##$TPOFFS= (0..7)
0 0 0 0 0 0 0 0 
##$TUNHIN= 0
##$TUNHOUT= 0
##$TUNXOUT= 0
##$USERA1= <user>
##$USERA2= <user>
##$USERA3= <user>
##$USERA4= <user>
##$USERA5= <user>
##$V9= 5
##$VALIST= <valist>
##$VCLIST= <CCCCCCCCCCCCCCC>
##$VD= 0
##$VDLIST= <DDDDDDDDDDDDDDD>
##$VPLIST= <PPPPPPPPPPPPPPP>
##$VTLIST= <TTTTTTTTTTTTTTT>
##$WBST= 1024
##$WBSW= 4
##$XGAIN= (0..3)
0 0 0 0 
##$XL= 0
##$YL= 0
##$YMAX_a= 317132
##$YMIN_a= -358911
##$ZGOPTNS= <>
##$ZL1= 120
##$ZL2= 120
##$ZL3= 120
##$ZL4= 120
##$ABSF1= 16.522
##$ABSF2= -4.171173
##$ABSG= 5
##$ABSL= 3
##$ALPHA= 0
##$AQORDER= 0
##$ASSFAC= 0
##$ASSFACI= 0
##$ASSFACX= 0
##$ASSWID= 0
##$AUNMP= <proc_1d>
##$AZFE= 0.1
##$AZFW= 0.1
##$BCFW= 0
##$BC_mod= 0
##$BYTORDP= 0
##$COROFFS= 0
##$CY= 12.5
##$DATMOD= 1
##$DC= 0
##$DFILT= <>
##$DTYPP= 0
##$F1P= 14.0000005364418
##$F2P= -0.99999901652339
##$FCOR= 0.5
##$FTSIZE= 32768
##$FT_mod= 6
##$GAMMA= 0
##$GB= 0
##$INTBC= 1
##$INTSCL= 1
##$ISEN= 128
##$LB= 0.3
##$LEV0= 0
##$LPBIN= 0
##$MAXI= 10000
##$MC2= 0
##$MEAN= 0
##$ME_mod= 0
##$MI= 0
##$NCOEF= 0
##$NC_proc= -5
##$NLEV= 6
##$NOISF1= 0
##$NOISF2= 0
##$NSP= 0
##$NTH_PI= 0
##$NZP= 0
##$OFFSET= 16.522
##$PC= 1
##$PHC0= 82.66814
##$PHC1= 16.84855
##$PH_mod= 1
##$PKNL= yes
##$PPARMOD= 0
##$PSCAL= 4
##$PSIGN= 0
##$REVERSE= no
##$SF= 250.13
##$SI= 32768
##$SIGF1= 0
##$SIGF2= 0
##$SINO= 400
##$SIOLD= 32768
##$SREGLST= <1H.CDCl3>
##$SSB= 0
##$STSI= 32768
##$STSR= 0
##$SW_p= 5175.98343685301
##$SYMM= 0
##$S_DEV= 0
##$TDeff= 65536
##$TDoff= 0
##$TI= <Analysis number 999999
Compound Code 99
Book Reference 9
Project Code 9>
##$TILT= no
##$TM1= 0
##$TM2= 0
##$TOPLEV= 0
##$USERP1= <user>
##$USERP2= <user>
##$USERP3= <user>
##$USERP4= <user>
##$USERP5= <user>
##$WDW= 1
##$XDIM= 32768
##$YMAX_p= 532047913
##$YMIN_p= -1089370
$$ End of Bruker specific parameters
$$ ---------------------------------
##NTUPLES= NMR SPECTRUM
##VAR_NAME=  FREQUENCY,     SPECTRUM/REAL,   SPECTRUM/IMAG
##SYMBOL=    X,             R,               I
##VAR_TYPE=  INDEPENDENT,   DEPENDENT,       DEPENDENT
##VAR_FORM=  AFFN,          ASDF,            ASDF
##VAR_DIM=   32768,         32768,           32768
##UNITS=     HZ,            ARBITRARY UNITS, ARBITRARY UNITS
##FACTOR=    0.157963299565203, 1,           1
##FIRST=     4132.6476996994, 0,             0
##LAST=      -1043.33573715361, 0,           0
##MIN=       -1043.33573715361, -1089370,    0
##MAX=       4132.6476996994, 532047913,     0
$$ Real data points
##PAGE= N=1
##DATA TABLE= (X++(R..R)), XYDATA
$$ [...]
24570a20144j47960J03228J81645P2j44768l9611Q1388r0986p3381m5055R0027
$$ -120144 -268104 -164876 16769 16841 -127927 -167538 -86150 -177136 -250517 -295572 -205545
24559b05545K98533j40927p4157j5887J08952J6990j28086L4572L48746j04415
$$ -205545 92988 -47939 -122096 -137983 -29031 -12041 -140127 -105555 243191 138776
24549A38776p7144R1420O734N8690K33711M5371j47732J85105l2304q0810P0869
$$ 138776 61632 153052 159786 218476 452187 497558 349826 534931 502627 421817 492686
24538D92686k39301j32589J8050Q4442o2860j89766R2784K67355q4646q6151Q4477
$$ 492686 253385 120796 138846 223288 160428 -29338 63446 330801 246155 160004 244481
24527B44481p0299o6807O1124m7576O0470j67496j04362J26771K03022K20053
$$ 244481 174182 107375 168499 120923 181393 13897 -90465 36306 239328 459381
24517D59381n3192l04905L4282N7377p1125m4858q6065J80041K04851j19926k10454
$$ 459381 406189 101284 135566 192943 121818 76960 -9105 170936 375787 255861 45407
24506D5407j9536R7848P1319j54235j03552j64850m063K46146J05415j15458q0189
$$ 45407 25871 123719 195038 40803 -62749 -227599 -231662 14484 119899 4441 -75748
24495g5748J0794J67826K37543j89887R318j5064Q6668k13072j37140R940O4606
$$ -75748 -64954 102872 340415 150528 159846 144782 231450 18378 -118762 -108822 -44216
24484d4216q0536j0762O448j84961P6094M63984K47453r5935j35769J74991J69185
$$ -44216 -124752 -135514 -129066 -314027 -237933 226051 473504 377569 241800 416791 585976
24473E85976P6252k30964o1427j91431R5250J52011n5575Q2437r847k40368k9029
$$ 585976 662228 431264 369837 178406 273656 425667 370092 452529 442682 202314 173285
24462A73285L8489j41799J9688J15616J34497L2956J7970r3251k12550j70866
$$ 173285 211774 69975 89663 205279 339776 372732 390702 297451 84901 -85965
24452h5965j73815j07633J55743P9210M0053K15539J96282p669k13509j40241
$$ -85965 -259780 -367413 -211670 -132460 -92407 123132 319414 311745 98236 -42005
24442d2005l5632o3953j07426M6622P2802M9036O3937R3735l2236j6916N6209
$$ -42005 -77637 -141590 -249016 -202394 -129592 -80556 -16619 77116 44880 27964 84173
24431H4173k3676L5284J08982k4413k29689k17939J7914o1639R7456J99368J21188
$$ 84173 60497 95781 204763 180350 -49339 -267278 -249364 -311003 -213547 -14179 107009
24420A07009j07809P2672J18380j35304j97044p0157J16555J3836K7454j13965
$$ 107009 -800 71872 190252 54948 -142096 -212253 -95698 -81862 -54408 -168373
24410a68373j50171R8286J36067J38321K00537j40847m39552M7817K05009j96305
$$ -168373 -318544 -220258 -84191 54130 254667 113820 -325732 -277915 -72906 -269211
24400b69211N3367K14199o5173p8514j05327J53079J35328j37570O1628j1736
$$ -269211 -215844 -1645 -66818 -145332 -250659 -97580 37748 -99822 -38194 -49930
24390d9930n1804k30318j49781P5262P1591j06015j87996Q3450L79126K36719
$$ -49930 -101734 -332052 -481833 -406571 -334980 -440995 -628991 -545541 -166415 70304
24380G0304j43125m4136q4772K68289J63047j60983j80419K7758J53339M2254
$$ 70304 -72821 -116957 -201729 66560 229607 68624 -111795 -84037 69302 111556
24370A11556j05396k6512J67942K3641l20447K4903j0800q0257Q7709K908O9205
$$ 111556 6160 -20352 147590 171231 -149216 -124313 -135113 -215370 -127661 -124753 -55548
24359e5548K61955Q4956q3293j3316l9882J3577q4001Q6295O9683j26062j30497
$$ -55548 206407 291363 208070 194754 154872 168449 84448 170743 240426 114364 -16133
24348a6133l9715J18618O4508n7999k3086j33461m1479l4008L2647k11418k77428
$$ -16133 -55848 62770 127278 69279 46193 -87268 -128747 -162755 -130108 -341526 -618954
24337f18954M2891K19355P9972l9609N6816k2569m0737j5516L8345L68317k21971
$$ -618954 -576063 -356708 -276736 -316345 -259529 -282098 -322835 -338351 -300006 68311 -153660
24326a53660j53515p6722k26959Q5209k7216M1324j3447o7305K80949J35215l4190
$$ -153660 -307175 -383897 -610856 -525647 -552863 -511539 -524986 -592291 -311342 -176127 -210317
24315b10317j88696R1886K44528M8180J54739L8605p1453n6043K10912M6386n6534
$$ -210317 -399013 -307127 -62599 -14419 140320 178925 107472 51429 262341 308727 252193
24304B52193p8259n906k88517R5599r7484j72213j59152L40944J11198M2816K45882
$$ 252193 173934 168028 -120489 -24890 -122374 -294587 -453739 -112795 -1597 41219 287101
24293B87101J1119Q9861k8035o1057j01404j62095l2215K06270J06475K6442l0155
$$ 287101 298220 388081 360046 298989 197585 35490 3275 209545 316020 342462 312307
24282C12307j56021l39172k64311j9018J6577K9429J32330J88927L5062n0544
$$ 312307 156286 -182886 -447197 -466215 -449638 -420209 -287879 -98952 -63890 -114434
24272a14434k89430k66081K02763J11833K94498J41560K461J42517O9824O8250
$$ -114434 -403864 -669945 -467182 -355349 -60851 80709 83170 225687 295511 363761
24262C63761m24661o6312J23015J47938J60456p2045o8707j6573n1573J24139
$$ 363761 -60900 -127212 -4197 143741 304197 232152 163445 146872 95299 219438
24252B19438l81486k58123K26314J65349q0244j61750N3616N1265J61182M639
$$ 219438 -162048 -420171 -193857 -28508 -108752 -270502 -216886 -165621 -4439 200
24242B00J01342r0980j56499j17290J3007j439J41428J91514j8389r4050o0824
$$ 200 101542 10562 -145937 -263227 -250220 -251659 -110231 81283 62894 -31156 -91980
24231i1980N6508m6843N2673M371O5476p1134j0054k52056n1192j18404j67697
$$ -91980 -35472 -82315 -29642 -25271 40205 -30929 -40983 -293039 -344231 -462635 -630332
24220f30332J8245M20294L01005L5253q989o8825J85476j03534K9290k9264j32894
$$ -630332 -612087 -191793 109212 144465 135476 66651 252127 148593 177883 148619 15725
24209A5725P798r8859J25475J13557K51217j61726l34608j01611o4393L13618
$$ 15725 23523 -75336 50139 163696 414913 253187 -81421 -183032 -247425 66193
24199F6193j11890k3935Q07k0515J49813M6436P1839j19513o7682k5472q382l4378
$$ 66193 -45697 -69632 -68825 -89340 60473 106909 178748 59235 -8447 -33919 -42301 -76679
24187g6679m4867j04429j74054L9311N3613J49684J15084M7055j44189M1735j7769
$$ -76679 -121546 -225975 -400029 -360718 -307105 -157421 -42337 4718 -139471 -97736 -115505
24176a15505M8002M0201J83056j22967k20619p74J91398J85552j34572J073l02678
$$ -115505 -67503 -27302 155754 32787 -187832 -188606 2792 188344 53772 54845 -247833
24165b47833m7969k3143j41194M0758m5141R6803K47037J55268j3332l5520P9485
$$ -247833 -295802 -318945 -460139 -419381 -464522 -367719 -120682 34586 21254 -14266 65219
24154F5219k7990J97982J18982j9991M1279j79286j47542q663j5113l00717p6920
$$ 65219 37229 235211 354193 334202 375481 196195 48653 39990 24877 -275840 -352760
24143c52760K15229j12621q2948Q6995o3268L02423J26923j9454r2486q4163J47055
$$ -352760 -137531 -250152 -333100 -246105 -309373 -6950 119973 100519 8033 -76130 70925
24132G0925r7602k3102j12930P6517K34451l914r6433O2583N1398n6567J27561
$$ 70925 -26677 -49779 -162709 -86192 148259 144345 47912 110495 161893 105326 232887
24121B32887J63070J55947j49399k35246k24391j72103N7572O7674J20011K08610
$$ 232887 395957 551904 402505 167259 -57132 -229235 -171663 -103989 16022 224632
24111B24632j04962n31953q7702J81559J85029K21036j66646j18361j29548k4214
$$ 224632 119670 -412283 -499985 -318426 -133397 87639 -79007 -197368 -326916 -351130
24101c51130J06790J40028j59448j40470m11441m2467L49764M33540K63875r8022
$$ -351130 -244340 -104312 -263760 -404230 -815671 -858138 -508374 -74834 189041 91019
24091I1019k26249m9322r9680k9935r218J80942k5665L6203J5721j53770N3358
$$ 91019 -135230 -184552 -284232 -314167 -323385 -142443 -168108 -131905 -116184 -269954 -216596
24080b16596J21899r9002L0141J0384J50204n0890k43058o2815J38349L0573j05639
$$ -216596 -94697 -193699 -163558 -153174 -2970 -53860 -296918 -359733 -221384 -190811 -296450
24069b96450J98809j72136o0977J2188k5037K00158p4811o3214M0475o6335K22146
$$ -296450 -97641 -269777 -330754 -318566 -343603 -143445 -218256 -281470 -240995 -307330 -85184
24058h5184K3911l6087l7111J00485K55397P2377o6350L1509n1008P3742k89012
$$ -85184 -61273 -97360 -134471 -33986 221411 293788 227438 258947 207939 281681 -7331
24047g331r1736N715R1046K5267l9630r8696p2111r1338J26726M57765j84071
$$ -7331 -99067 -93352 -2306 22961 -16669 -115365 -187476 -278814 -152088 305677 121606
24036A21606k69448j18023k91762l012L18082K74231J17195k20511n9532J39103
$$ 121606 -147842 -265865 -557627 -560639 -242557 31674 148869 -71642 -131174 7929
24026G929P6282n5378k50074O4052L70175N9547P4994j38346k71971j56160j4396
$$ 7929 84211 28833 -221241 -157189 212986 272533 347527 209181 -62790 -218950 -233346
24015b33346J57554J8774r1541r4712P770n0505j3140k5051r0892k840J28927
$$ -233346 -75792 -57018 -148559 -243271 -235501 -286006 -299146 -324197 -415089 -417929 -289002
24004b89002J00860L8091R4369r8579p8743L8492J366J26321K23893j41579p5172
$$ -289002 -188142 -150051 -55682 -154261 -233004 -194512 -193146 -66825 157068 15489 -59683
23993e9683O4795j4063q4502p4822j55913j1540k7454k7710M913m3204R5025j35729
$$ -59683 5112 -8951 -93453 -168275 -324188 -335728 -363182 -390892 -385979 -429183 -334158 -469887
23981d69887K1907K21259R4514J2711j4518m0052m8916J64535J07095j22871j07771
$$ -469887 -447980 -226721 -132207 -119496 -134014 -174066 -222982 -58447 48648 -74223 -181994
23970a81994R2202k0230o6810k40553J24534J70939O3444p4904k22741K20285
$$ -181994 -89792 -110022 -176832 -417385 -292851 -121912 -58468 -133372 -356113 -135828
23960a35828K22900j43387j8062L08544K876q8835K9535j57013k52005N3301K44188
$$ -135828 87072 -56315 -74377 234167 237043 148208 177743 20730 -231275 -177974 66214
23949F6214j42629J03519r9845Q4564N2850o1942j24172k84120N8769J97834J02458
$$ 66214 -76415 27104 -72741 11823 64673 2731 -121441 -405561 -346792 -148958 -46500
23938d6500J04809O405n5360J04861l2673J71354M8598m11116k75370L69595K21570
$$ -46500 58309 64714 9354 114215 81542 252896 301494 -109622 -384992 -15397 206173
23927B06173m0343j96241j03310r4105J37611n8881J5017n1305m423J80412Q8460
$$ 206173 165830 -30411 -133721 -227826 -90215 -149096 -134079 -185384 -189807 -9395 79065
23916G9065j14984J6637Q2057M2709p240j70574j30207O974J22113Q6241K66346
$$ 79065 -35919 -19282 62775 105484 98244 -72330 -202537 -195563 -73450 12791 279137
23905B79137l18119m88266r1297J97532O0941Q7484J31277j22992j75214O9981
$$ 279137 -38982 -527248 -618545 -421013 -360072 -272588 -141311 -264303 -439517 -369536
23895c69536J99807L3102j20892j36668L7922J5292L2825J26801L14159J26789
$$ -369536 -169729 -136627 -257519 -394187 -356265 -340973 -308148 -181347 132812 259601
23885B59601j5814K72577j39448j46841K20320J61551j93155l49161l60306J64158
$$ 259601 243787 516364 376916 230075 450395 611946 418791 69630 -290676 -126518
23875a26518J32643L59759J17033j51147j99381l58614L6473R4799K19837J89711
$$ -126518 6125 365884 482917 331770 132389 -226225 -189752 -94953 124884 314595
23865C14595n9660Q6016k49154j12304K38806K03445J51098r6387j95371j14357
$$ 314595 254935 340951 91797 -20507 218299 421744 572842 476455 281084 166727
23855A66727r7178Q4703J64810j68267j40362L9537P846j40747j87046N4327j9830
$$ 166727 69549 154252 319062 150795 10433 49970 57816 -82931 -269977 -215650 -235480
23844b35480n8057M0091O9159o1884P8539J26533l1647k23336K23398N7933k10712
$$ -235480 -293537 -253446 -184287 -246171 -167632 -41099 -72746 -296082 -72684 -14751 -225463
23833b25463r4243K58569J55045J29438p3013j73073j8224j07667n1440J51680
$$ -225463 -319706 -61137 93908 223346 150333 -22740 -40964 -148631 -200071 -48391
23823d8391Q2573k38321J6215K0326J54705M9945j3805Q4645M7716k02105j73290
$$ -48391 34182 -204139 -187924 -167598 -12893 37052 23247 107892 155608 -46497 -219787
23812b19787p3216p4559K10984J49414N4589n2616j3359j5682J69780l1252k46676
$$ -219787 -293003 -367562 -156578 -7164 47425 -5191 -18550 -34232 135548 104296 -142380
23801a42380k4004O2668M2706L8003J23229K39058R2830p3670j94385J01018l08244
$$ -142380 -166384 -103716 -61010 -23007 100222 339280 432110 358440 164055 265073 -43171
23790d3171J6350r5410J21258J28351p4643k41164K29665K11120r604j20593P0493
$$ -43171 -26821 -122231 -973 127378 52735 -188429 41236 252356 242752 122159 192652
23779A92652j84869k11032O141J56574l5788J9037j99431J02461l9901K6274k15222
$$ 192652 7783 -203249 -197108 -40534 -76322 -57285 -256716 -154255 -194156 -167882 -383104
23768c83104j40730J67676K16230K488K5989K26377j31682j70266O3310P5656
$$ -383104 -523834 -356158 -139928 -137440 -111451 114926 -16756 -187022 -123712 -48056
23758d8056r2881J46469J85818j15663j98801k24744J20764K3609r985L488J0237
$$ -48056 -140937 5532 191350 75687 -123114 -347858 -227094 -203485 -213470 -209982 -199745
23747a99745L80488K11535J910k05580k66367j39742R5375q6657k6504J83060
$$ -199745 180743 392278 394188 188608 -77759 -217501 -122126 -208783 -235287 -52227
23737e2227M4000j86713K49292K22947K16103j11479k16651j17599j68501j7691
$$ -52227 -8227 -194940 54352 277299 493402 381923 165272 47673 -120828 -138519
23727a38519M1077K93958j36057k59331Q8505J78284n7007j75573j36321J49709
$$ -138519 -97442 196516 60459 -198872 -110367 67917 10910 -164663 -300984 -151275
23717a51275J07756l7828J26737j4741j16492N1266M7450L4132N5226J91794j7613
$$ -151275 -43519 -81347 45390 30649 -85843 -34577 12873 47005 102231 294025 276412
23706B76412k44236r9098q978J55706M5134J36152k40301k58048J12060J00219
$$ 276412 32176 -66922 -75900 79806 124940 261092 20791 -237257 -125197 -24978
23696b4978J37164k07080j90668J13446K42274j7123j19268J9131j50110p4079
$$ -24978 112186 -94894 -285562 -172116 70158 53035 -66233 -47102 -197212 -271291
23686b71291q280J42902N4626l15753J3467l2870j20138J61147K41939R8095J4560
$$ -271291 -279571 -136669 -82043 -397796 -384329 -417199 -537337 -376190 -134251 -36156 -21596
23675b1596j50117J08414J49092J08459K6905k63827j49744N6974J94817J66690
$$ -21596 -171713 -63299 85793 194252 221157 -42670 -192414 -135440 59377 226067
23665B26067L7041K1993K2563q1709j21701J93879O2449k77483k14107j1156n7952
$$ 226067 263108 285101 307664 225955 104254 298133 360582 83099 -131008 -142164 -200116
23654b00116j87455P4825P8962J11483J06009J60486L8534Q3075p2168l46912
$$ -200116 -387571 -312746 -233784 -122301 -16292 144194 182728 265803 193635 -153277
23644a53277k30195j57510K08774L87982O6970o0400k16771L506O1189k9167J80359
$$ -153277 -383472 -540982 -332208 55774 122744 62344 -154427 -150921 -89732 -118899 61460
23633F1460N3156M466j28984M2411K18736k01263n3997J79499J09401j69676J41324
$$ 61460 114616 119082 -9902 32509 251245 49982 -4015 175484 284885 115209 256533
23622B56533R2509J22621k90556M404q1896n5383J4043J28901R8519j05206l755
$$ 256533 349042 471663 181107 185511 103615 48232 62275 191176 289695 184489 180734
23611A80734r0041l88407j19398J20443O0033K057K5333P2382p5135l1979L3099
$$ 180734 90693 -297714 -417112 -296669 -236636 -234579 -209246 -136864 -211999 -243978 -210879
23600b10879j22665q9121J56499J39508N4529q3895j80427J10729L65108J33556
$$ -210879 -333544 -422665 -266166 -126658 -72129 -156024 -336451 -225722 139386 272942
23590B72942j4039p5191j02140n4846j61774j40524k0463j3943K0514L0914J27092
$$ 272942 258903 183712 81572 26726 -135048 -275572 -296035 -309978 -289464 -258550 -131458
23579a31458L6701j54613r2811M7899K2058L01484K87851j91651N317J73272N9463
$$ -131458 -94757 -249370 -342181 -294282 -272224 29260 317111 125460 130777 304049 363512
23568C63512o3242j99850O112J58659j98407j05653m5008j36249K07199r6178
$$ 363512 300270 100420 106532 265191 66784 -38869 -83877 -220126 -12927 -109105
23558a09105K5076K18448j69838R808L7616j74805R3328J97906K42820j0664l0506
$$ -109105 -84029 134419 -35419 -25611 12005 -162800 -69472 128434 371254 360590 330084
23547C30084j25109l0009j67880J309K3564p4432q5002M3359K96316J00618j37746
$$ 330084 204975 174966 7086 8395 31959 -42473 -127475 -84116 212200 312818 175072
23536A75072O3784j65407j11646J3740J99070J99067m5656m2729J49959K0302
$$ 175072 238856 73449 -38197 -24457 174613 373680 328024 285295 435254 455556
23526D55556M2450K14892p3512k94045q4284J88165J41300q4443p2474o5053l05774
$$ 455556 498006 712898 639386 345341 261057 449222 590522 506079 433605 368552 62778
23515F2778j16654K15170L8776O4469r7228j67896p7893j00214R6214J90700J69653
$$ 62778 -53876 161294 200070 264539 167311 -585 -78478 -178692 -82478 108222 277875
23504B77875k35960j38076l9331j8664J37409k8551p687N2084P2811J96130l78131
$$ 277875 41915 -96161 -135492 -154156 -16747 -45298 -52985 -901 71910 268040 -110091
23493a10091j90289L70401j5113J36097j01307j56915j37400J70400P9548M6280
$$ -110091 -300380 70021 54908 191005 89698 -67217 -204617 -34217 45331 91611
23483I1611j45984j10030J23662J09087o8785P4825J59711K7029k30118j77486
$$ 91611 -54373 -164403 -40741 68346 -439 74386 234097 261126 31008 -146478
23473a46478L7985O975j1025k08509J44190J48514K20426J3104j38395k18699
$$ -146478 -108493 -101518 -112543 -321052 -176862 -28348 192078 205182 66787 -151912
23463a51912k7477J88827M03149k71308r5783k8837l8780K4576J33466K06772
$$ -151912 -179389 9438 412587 141279 45496 16659 -22121 2455 135921 342693
23453C42693n9116k11092j61011k048J54412K7744R492Q1942L6289J63736q641
$$ 342693 283577 72485 -88526 -90574 63838 91582 101074 183016 219305 383041 374400
23442C74400L5459M9663j58476k56454j06057k038r8930L3541K56324r7965J87123
$$ 374400 409859 459522 301046 44592 -61465 -63503 -162433 -128892 127432 29467 216590
23431B16590n942k87274K02826P3411j7172q3232O278p7200N6319m973J43967
$$ 216590 210648 -76626 126200 199611 182439 99207 105485 28285 84604 79631 223598
23420B23598J01114Q8452L1131j83858l6359o0470Q7792K0092j71407k11666k25244
$$ 223598 324712 413164 444295 260437 224078 163608 251400 271492 100085 -111581 -336825
23409c36825l6495K37260J46071j03326R2526O912m5287n4319j23947M0036J38838
$$ -336825 -373320 -136060 10011 -93315 -789 6123 -39164 -93483 -217430 -177394 -38556
23398c8556m8951N3309K89472J58253j54456J8896J334j89725o9445r4651n7478
$$ -38556 -87507 -34198 255274 413527 259071 277967 279301 89576 20131 -74520 -131998
23387a31998k14921j87J64062P8578P7279n2834R5618L16506K91490J41894k62575
$$ -131998 -346919 -347106 -183044 -104466 -27187 -80021 15597 332103 623593 765487 502912
23376E02912l19519l09729m4647J15109K71572J53494j11578l23441L2765Q1952
$$ 502912 183393 -126336 -170983 -55874 215698 369192 257614 -65827 -33062 48890
23366D8890n8757k1932n8594K079O1879p7044k27428k03270P485L26602O4877
$$ 48890 -9867 -31799 -90393 -88314 -26435 -103479 -330907 -534177 -526692 -200090 -135213
23355a35213P4612J32025j42557n055o8682J77617o0079p7432J91514K13107J49971
$$ -135213 -60601 71424 -71133 -76188 -144870 32747 -27332 -104764 86750 299857 449828
23344D49828L1478J49682J0696k35555q8374q6166k13292l6056o0927K48194o9831
$$ 449828 481306 630988 641684 406129 317755 231589 18297 -17759 -78686 169508 99677
23333I9677j45018p370j86214N2834K40908J32179j0842K2925j80422o7469J499
$$ 99677 -45341 -52711 -238925 -186091 54817 186996 176154 199079 18657 -48812 -47313
23322d7313R0034J29221O675r3681m5127o7461n6601j13886k09066m14445J06282
$$ -47313 42721 171942 178617 84936 39809 -27652 -84253 -198139 -407205 -821650 -715368
23311g15368J21942J24355K04284J12299q5730K53117J16925R2749l3043k3470
$$ -715368 -593426 -469071 -264787 -152488 -238218 14899 131824 224573 191530 168060
23301A68060N6284n7646l22516r2855r9011k738m4585o9566Q7513J32020m748
$$ 168060 224344 166698 -155818 -248673 -347684 -350422 -395007 -464573 -377060 -245040 -249788
23290b49788k3494J61025J56878o1556K29953j07307l49043k3674K18512K3544
$$ -249788 -273282 -112257 44621 -16935 213018 105711 -243332 -267006 -48494 -24950
23280b4950J16903J12440k34423j31525o3633l8646M24775k1748n8215K67927
$$ -24950 91953 204393 -30030 -161555 -225188 -263834 160941 139193 80978 348905
23270C48905r9959m33256l09556J4210l1431N0986J98531R3317j92310m03J28814
$$ 348905 248946 -184310 -493866 -479656 -511087 -460101 -261570 -168253 -360563 -360966 -232152
23259b32152J92540J11015j69892q0245R5908N0009P6213k6444j98389j92771
$$ -232152 -39612 71403 -98489 -178734 -82826 -32817 43396 16952 -181437 -374208
23249c74208m8706m210j8153J44569j30914L2505K59552K31472o1616l6236R1529
$$ -374208 -422914 -427124 -445277 -300708 -431622 -399117 -139565 91907 30291 -5945 85584
23238H5584q8217J06995N5262p0424l8381j12905O5847J06816j26525J59791n5203
$$ 85584 -2633 104362 159624 89200 50819 -62086 3761 110577 -15948 143843 88640
23227H8640j04206M0699L9404r269l80594k22087J81896J32056Q4579j03594k21298
$$ 88640 -15566 25133 64537 55268 -325326 -547413 -365517 -233461 -148882 -252476 -473774
23216d73774k59298J07561J5830K04033J09593p1072p0927k3752Q3489J46540
$$ -473774 -733072 -625511 -609681 -405648 -296055 -367127 -438054 -461806 -378317 -231777
23206b31777J5506J1492R7261m7243j29877R7268O8498r1594j11833r9971k093
$$ -231777 -216271 -204779 -107518 -154761 -284638 -187370 -118872 -210466 -322299 -422270 -424363
23195d24363O8929j07315k07822J07517J93492K19258J46552O7387r3034j10085
$$ -424363 -355434 -462749 -670571 -563054 -369562 -150304 -3752 63635 -29399 -139484
23185a39484j11098j77432L7772K30061J80894k81k6445L5994L8701k08089r0701
$$ -139484 -250582 -428014 -390242 -160181 20713 20432 -6013 29981 68682 -139407 -230108
23174b30108k3875N8028j11508j7630J44273K58505Q2890k27842j90561J06965
$$ -230108 -253983 -195955 -307463 -325093 -180820 77685 160575 -67267 -257828 -150863
23164a50863Q9049j78145j34076J65407o2784j00752L52468Q5427j83537R8601
$$ -150863 -61814 -239959 -374035 -208628 -271412 -372164 -19696 65731 -117806 -19205
23154a9205J62897m9684k04603K3030j44946j4605O8143j36030m9613r057P2903
$$ -19205 143692 94008 -110595 -87565 -232511 -247116 -178973 -315003 -364616 -373673 -300770
23143c00770J1044j52253L2471R2261O7089L5615J5164o5363j39158K516J36521
$$ -300770 -289726 -441979 -409508 -317247 -250158 -214543 -199379 -264742 -403900 -401384 -264863
23132b64863J35877J06001l6458p7209j1106P6833J43265K34102k96651j24664
$$ -264863 -128986 -22985 -59443 -136652 -147758 -70925 72340 306442 9791 -114873
23122a14873j9474r0754J12022J35200Q9960o9841q7437j21707j65960J24534
$$ -114873 -134347 -225101 -113079 22121 112081 42240 -45197 -166904 -332864 -208330
23112b08330J58833j36754k8087j6097J77363k85174m8129K1356l5354k344J41315
$$ -208330 -49497 -186251 -214338 -230435 -53072 -338246 -386375 -365019 -400373 -402717 -261402
23101b61402M12672O1686p2628j17663j04346J07478j70086m2469Q3877J22106
$$ -261402 151270 212956 140328 22665 -81681 25797 -144289 -186758 -102881 19225
23091A9225j44216j36724O92j26071J45459k5725J03406P7151R297J52945K635
$$ 19225 -124991 -261715 -261023 -387094 -241635 -267360 -163954 -86803 -77506 75439 78074
23080G8074j58082J07475J52234J61145k28093M1137J55453p3627q3530r2620
$$ 78074 -80008 27467 179701 340846 112753 153890 309343 235716 152186 59566
23070E9566J71607p2780J36844j32418k73340O5082R1037j91332P2103O9011j16720
$$ 59566 231173 158393 295237 162819 -110521 -45439 45598 -145734 -73631 -4620 -121340
23059a21340j56827k9827J05767K41968J5019N2193m4946o1878m7422j12906J36647
$$ -121340 -278167 -307994 -202227 39741 54760 106953 62007 129 -47293 -160199 -23552
23048b3552M3762j03390n2065j72217k6290N6667r4480J36372K36233J18572j78625
$$ -23552 20210 -83180 -135245 -307462 -333752 -277085 -371565 -235193 1040 119612 -59013
23037e9013l7104q4525J01431J48027r5957k18061K71660R554r3473P0399J04570
$$ -59013 -96117 -180642 -79211 68816 -27141 -245202 26458 36012 -57461 12938 117508
23026A17508J21678j06728p1110j7269r9403J2372N9006N2155J51049l4840j23197
$$ 117508 239186 132458 61348 44079 -55324 -42952 16054 68209 219258 184418 61221
23015F1221K7904J85430j1991M7868k98260k08627m6779J34130J20963K87961
$$ 61221 89125 274555 262564 310432 12172 -196455 -243234 -109104 11859 299820
23005B99820K9261j73828n9947j75219j15635N9238r1638P3114P7615J39864p9864
$$ 299820 329081 155253 95306 -79913 -195548 -136310 -227948 -154834 -77219 62645 -17219
22994a7219j54J68079K46287M3497k08608q2519O1639J6696J55069j33920j61820
$$ -17219 -17373 150706 396993 440490 231882 149363 211002 227698 382767 248847 87027
22983H7027k27972J0214j55841m2998J08057O8626j19291j59240K0828L17512
$$ 87027 -140945 -130731 -286572 -329570 -221513 -152887 -272178 -431418 -410590 -93078
22973i3078K24611M4864K9935j64169j55085j4420j0970Q9886J33920n5859m9835
$$ -93078 131533 176397 206332 42163 -112922 -127342 -138312 -48426 85494 29635 -20200
22962b0200K05522k03371k8947l05085q8110k8056j48325m4072J50754K28759
$$ -20200 185322 -18049 -46996 -352081 -440191 -468247 -616572 -660644 -509890 -281131
22952b81131K6498R2514K0568k3573j18791j5970O4433j57520q2165J65372J87762
$$ -281131 -254633 -162119 -141551 -165124 -283915 -299885 -235452 -392972 -475137 -309765 -122003
22941a22003N8232M5624K9189j40456j25041j67012J5455l053J04693L21933J19508
$$ -122003 -63771 -18147 11042 -129414 -254455 -421467 -406012 -409065 -304372 17561 137069
22930A37069q1380o7031j4207k21383k4817K01611R6507j1966J22581P7474J65733
$$ 137069 55689 -11342 -25549 -246932 -271749 -70138 26369 14403 136984 214458 380191
22919C80191j79773k47753Q2808L1548n000k32104k77387L50709K72384l4144
$$ 380191 200418 -47335 35473 67021 62021 -170083 -447470 -96761 175623 141479
22909A41479p8945r479Q9708j37575k37255p5264o2753k5085o7265J55104J02414
$$ 141479 62534 53055 142763 5188 -232067 -307331 -370084 -395169 -462434 -307330 -204916
22898b04916n5237J6991o3565l44146J46842J80921J42859O2262J74195p1622
$$ -204916 -260153 -243162 -306727 -650873 -504031 -323110 -180251 -117989 56206 -15416
22888a5416N9376J01165M5397k46447N6974J17725j80689J5186n0921J4978R2730
$$ -15416 43960 145125 190522 -55925 1049 118774 -61915 -46729 -97650 -82672 10058
22877A0058J1253N727j78560j48171K48392j77409k40212J805J05813M7405M0688
$$ 10058 21311 27038 -151522 -299693 -51301 -228710 -468922 -467117 -361304 -313899 -273211
22866b73211q5163j50239O9015p2930J58713J65771r325M5500J26186m1611L2253
$$ -273211 -358374 -508613 -439598 -512528 -353815 -188044 -197369 -151869 -25683 -67294 -35041
22855c5041N0355j8055n7330J3597o8160R6533r7723r9600o085K09384J64624
$$ -35041 15314 -2741 -60071 -46474 -114634 -18101 -115824 -215424 -221509 -12125 152499
22844A52499r0289O2700J18251j99493l58292q0474l923l0527j33221J82648L43788
$$ 152499 62210 124910 243161 43668 -314624 -395098 -399021 -429548 -562769 -380121 -36333
22833c6333N916J02427R4137r6252l19029j91934P8598N1496L46810J1407j69818
$$ -36333 -30417 72010 166147 69895 -249134 -441068 -362470 -310974 35836 47243 -122575
22822a22575O3005q3323p9380J08123J7924J26694n0839j36617q7281J37748M677
$$ -122575 -59570 -142893 -222273 -114150 -96226 30468 -20371 -156988 -244269 -106521 -101844
22811a01844j916p4508k38881L0507P998N2788J90703J97064J94214M5369j21700
$$ -101844 -103760 -178268 -417149 -386642 -378644 -325856 -135153 61911 256125 301494 179794
22800A79794k82333k01872Q5168l2992j31702p8502L8326J93473J88116K63074
$$ 179794 -102539 -304411 -219243 -252235 -383937 -462439 -424113 -230640 -42524 220550
22790B20550J12448J12846k4707j56136j68065j0356J33082k89624J3108M3588
$$ 220550 332998 445844 421137 265001 96936 86580 219662 -69962 -56854 -13266
22780a3266N5633J28450j46487n5606o8566J95290N1898k43417k41748J28461
$$ -13266 42367 170817 24330 -31276 -99842 95448 147346 -96071 -337819 -209358
22770b09358k9289J52338K6070J3200L74897k5875l4222n2468n8573m6439m8589
$$ -209358 -238647 -86309 -60239 -47039 327858 301983 267761 215293 156720 110281 61692
22759F1692J50908J84292J34429r9553n98184R2485K30318J2685J16927j80579
$$ 61692 212600 396892 531321 431768 -166416 -73931 156387 169072 285999 105420
22749A05420j0127Q6631l37172j18751J62300K14720k1536j55747J6378Q051j38092
$$ 105420 95293 181924 -155248 -273999 -111699 103021 81485 -74262 -57884 -49833 -187925
22738a87925o4149O2390K39453N5743k2617o409j8835j36642n2724m4406j99368
$$ -187925 -252074 -189684 49769 105512 82895 76486 57651 -78991 -131715 -176121 -375489
22727c75489J24675K38602J36426K1690j37567j51265J08571R1600j92337j91840
$$ -375489 -250814 -12212 124214 145904 8337 -142928 -34357 57243 -135094 -326934
22717c26934l2400J98477J00137p459K48036r6684j22243j8326K0763k1302j07396
$$ -326934 -359334 -160857 -60720 -68179 179857 83173 -39070 -57396 -36633 -57935 -165331
22706a65331Q6189R8130r5656k4914N3572k5679o6306j0924J44703J35484k92080
$$ -165331 -79142 18988 -76668 -101582 -48010 -73689 -139995 -150919 -6216 129268 -162812
22695a62812j72918J57350o7917J91310K23207n2823j16549L6687O7846L6575
$$ -162812 -335730 -178380 -246297 -54987 168220 115397 -1152 35535 103381 139956
22685A39956J09943J27237n6509K5820j82068j87649N0859K11480J97897j08023
$$ 139956 249899 377136 320627 346447 164379 -23270 27589 239069 436966 328943
22675C28943l8604p9155J0799j31824j17230p5537Q5104o88j30067J20752k6885
$$ 328943 290339 211184 221983 90159 -27071 -102608 -17504 -18192 -148259 -27507 -54392
22664e4392M7551l8911j14235L0039k0318K38868N8924n2597O8943n2212J36715
$$ -54392 -6841 -45752 -159987 -129948 -150266 88602 147526 94929 163872 111660 248375
22653B48375R4878r9780k03393j03152J99803P5352j4499O2150k49854l15920
$$ 248375 343253 243473 40080 -63072 136731 212083 197584 259734 9880 -306040
22643c06040L5393N2239o6066J78246k4390N9698J00989J2459j6253M2746M780
$$ -306040 -270647 -218408 -284474 -106228 -130618 -70920 30069 42528 26275 69021 73801
22632G3801l52408N136j30319m173N729p664J20519J28832J19893j0492k0298
$$ 73801 -278607 -273471 -403790 -407963 -402234 -409898 -289379 -160547 -40654 -51146 -71444
22621g1444p0178n0078K08675l752k57151j43782K68709K34977j43455j80270
$$ -71444 -141622 -191700 16975 13223 -243928 -387710 -119001 115976 -27479 -207749
22611b07749Q46N1993j12351J16047K33696J83073M1341J45459l14912k50370
$$ -207749 -206903 -154910 -267261 -151214 82482 265555 306896 452355 137443 -112927
22601a12927J04515n4014k14628m7012k6122L4933J62703J41224k37619J43447
$$ -112927 -8412 -62426 -277054 -324066 -350188 -315255 -152552 -11328 -248947 -105500
22591a05500J21862M0969j91779l28058K4638M35049K18126j23861o9553N6130
$$ -105500 16362 57331 -134448 -462506 -437868 -2819 215307 91446 21893 78023
22581G8023j36910k46601O1601K51851j09251k99433n028M6346l1748J74232p6561
$$ 78023 -58887 -305488 -243887 7964 -101287 -400720 -405748 -359402 -391150 -216918 -293479
22570b93479o813Q5722J62240J40199m9854M1122j18838j18020L17125J85093
$$ -293479 -300292 -214570 -52330 87869 38015 79137 -39701 -157721 159404 344497
22560C44497J38349J9094J5482r408k55783k73323J77140N2669j94368m06007
$$ 344497 482846 501940 517422 508014 252231 -21092 156048 208717 14349 -391658
22550c91658k72073J58353l7430l4778J09010J97900J57795n9960l6112l0598
$$ -391658 -663731 -505378 -542808 -577586 -468576 -270676 -112881 -172841 -208953 -239551
22540b39551j94099j09605J74869J80001l5161R70o0633Q0878J84660O5771j00288
$$ -239551 -433650 -543255 -368386 -188385 -223546 -222576 -283209 -202331 -17671 48100 -52188
22529e2188j77101k5200k503O7988J99530M5651o4963j59019M9587K74871J85595
$$ -52188 -229289 -254489 -256992 -189004 10526 56177 -8786 -167805 -118218 156653 342248
22518C42248q8142L7676o3469M5113L0693j03710l82346k2891J50427K62290P4199
$$ 342248 254106 291782 228313 273426 304119 200409 -181937 -204828 -54401 207889 282088
22507B82088m929K1395K456o4268o1174J37960j60072j31712j25299L5265J31610
$$ 282088 277159 298554 301010 236742 175568 313528 153456 21744 -103555 -68290 63320
22496F3320r3362m4802n7975K1054l5900m350M4233J27267m6618j19636p1185
$$ 63320 -30042 -74844 -132819 -111765 -147665 -152015 -107782 19485 -27133 -146769 -217954
22485b17954q033J8633k27818K44737n819k6520K8420J18939J58827n5334R5607
$$ -217954 -225987 -207354 -435172 -190435 -196254 -222774 -194354 -75415 83412 28078 123685
22474A23685k38603l45238J3337K17504J64090J3948M152q0205k5510J57418P6720
$$ 123685 -114918 -460156 -446819 -229315 -65225 -51277 -47125 -127330 -152840 4578 81298
22463H1298r5548j45513k0510K28898J2310r5974P345o3067r5589K81373J01050
$$ 81298 -14250 -159763 -180273 48625 60935 -35039 -27694 -90761 -186350 95023 196073
22452A96073k12686p7809j3500J89880L04320M7316j57169j03372m0782k91509
$$ 196073 -16613 -94422 -107922 81958 386278 433594 276425 173053 132271 -159238
22442a59238j57434Q694J4962r1251J86045P245j23793O3930J97616l1061J6263
$$ -159238 -316672 -307978 -293016 -384267 -198222 -190977 -314770 -250840 -53224 -84285 -68022
22431f8022P8006j60509l4234J34241J73067j7920J23812J10363k71611p6011
$$ -68022 9984 -150525 -184759 -50518 122549 104629 228441 338804 67193 -8818
22421h818p0203j12184J83604J52612M089m0721q4040o5121r6787k13085J26988
$$ -8818 -79021 -191205 -7601 145011 149100 108379 24339 -40782 -137569 -350654 -223666
22410b23666l1313J1364J24641j10602K61548J24679L3066j89337j50660k6975
$$ -223666 -254979 -243615 -118974 -229576 31972 156651 189717 380 -150280 -177255
22400a77255m7100R1842J03419o6169l9413O0178M2754Q3325p4256j66335J02346
$$ -177255 -224355 -132513 -29094 -95263 -134676 -74498 -31744 51581 -22675 -189010 -86664
22389h6664K03014j00886j58829k04132K39256j62575r8443J74890J11611m5794
$$ -86664 116350 15464 -143365 -347497 -108241 -270816 -369259 -194369 -82758 -128552
22379a28552j78680J28017J88972o5297p5220n9957j26549k4930N27858J94373
$$ -128552 -307232 -179215 9757 -55540 -130760 -190717 -317266 -342196 185662 380035
22369C80035j80206j39957M5017j80389j73807J40525n8955j26593L4779J72612
$$ 380035 199829 59872 104889 -75500 -249307 -108782 -167737 -294330 -259551 -86939
22359h6939k321j31284l4955j16261O5093j01155J6149K0651K89063L71605K36328
$$ -86939 -89260 -220544 -255499 -371760 -306667 -407822 -391673 -371022 -81959 289646 525974
22348E25974q3068k18576j53689j81146j09141J89709J32703m360j99709J78951
$$ 525974 442906 224330 70641 -110505 -219646 -29937 102766 98406 -101303 77648
22338G7648K34917M2304k89283R5103l6988j80874J87658m6267k172J31135J38665
$$ 77648 312565 354869 65586 160689 123701 -57173 130485 84218 82046 213181 351846
22327C51846R5080j97832k25224j48559j18512K45066j10039J22857J50157k1066
$$ 351846 446926 249094 23870 -124689 -243201 1865 -108174 14683 164840 143774
22317A43774J2592k65846k75073J56708K66295r219j17541k02004k88188m9742
$$ 143774 156366 -109480 -384553 -227845 38450 29231 -88310 -290314 -578502 -628244
22307f28244Q6310L46322J67867K6237k42585j48131n7416K56127J44708J30198
$$ -628244 -541934 -195612 -27745 -1508 -244093 -392224 -449640 -193513 -48805 81393
22297H1393o2275P4986r949l4383K34469J79160l09594o3283p2779j72497K43842
$$ 81393 19118 94104 84155 49772 284241 463401 153807 90524 17745 -154752 89090
22286H9090K17129J39371p8529k45082q6776J67482p551j41771j3429Q4545N4999
$$ 89090 306219 445590 367061 121979 35203 202685 195134 53363 39934 124479 179478
22275A79478k24592j49955j6932J87848P0191p2862r007j31106N467p9680j05892
$$ 179478 -45114 -195069 -212001 -24153 46038 -26824 -35831 -166937 -161470 -241150 -347042
22264c47042k3583L1595J66457J45888n2209L5417L12395M8368j73328r0210k76043
$$ -347042 -370625 -339030 -172573 -26685 -78894 -43477 268918 317286 143958 53748 -222295
22253b22295N030j15729m02381j26007K46313L58073J74542p260P4165m6861r8363
$$ -222295 -217265 -332994 -735375 -861382 -615069 -256996 -82454 -89714 -15549 -62410 -160773
22242a60773r3300K41431O8448M8735q3708J972J70570j84405j54027n105J02659
$$ -160773 -254073 -12642 55806 104541 20833 22805 193375 8970 -145057 -150162 -47503
22231d7503J9698j1125o7470J789N2478K05998Q141l1527M5635j37727m6594P3951
$$ -47503 -27805 -38930 -106400 -104611 -52133 153865 162006 130479 176114 38387 -8207 65744
22219F5744j17633K53075L26667J15938l4188j66802r573r2998j93552R149j9280
$$ 65744 -51889 201186 527853 643791 609603 442801 433228 340230 146678 155827 136547
22208A36547l5379J60096M9409p171n4908k76918N489j3184j68465o5841Q9998
$$ 136547 101168 261264 310673 303502 248594 -28324 -22835 -36019 -204484 -270325 -180327
22197a80327M9528P3143O4889l5070l51724r8531K05879N4947K33586J67277L4193
$$ -180327 -130799 -57656 7233 -27837 -379561 -478092 -272213 -217266 16320 183597 217790
22186B17790J43887q6786r9654r8998J25411J91105j63894j79708k35083m2103
$$ 217790 361677 274891 175237 76239 201650 392755 228861 49153 -185930 -228033
22176b28033o156j06084J81942J37865j45580J71344J43850q8294k38107J60779
$$ -228033 -234189 -340273 -158331 -20466 -166046 5298 149148 60854 -177253 -16474
22166a6474K42089j1164k7947K1991r8243L8534j2788m8487r8236P0821r0541
$$ -16474 225615 214451 186504 208495 110252 148786 135998 87511 -10725 60096 -30445
22155c0445k49995n6739R4751K35211J42105r8828J5762j83303K12777J48142
$$ -30445 -280440 -337179 -242428 -7217 134888 36060 51822 -131481 81296 229438
22145B29438j22412j95091n3344J69954J42516j31828j52915n5577J25757K56088
$$ 229438 107026 -88065 -141409 28545 171061 39233 -113682 -169259 -43502 212586
22135B12586P5213N5984j73874j21021j38925k33009M5865L8033Q3925J14329
$$ 212586 287799 343783 169909 48888 -90037 -323046 -277181 -239148 -155223 -40894
22125d0894J95581J33765k25222l21647J00676j44312Q2314P2555q0926o9126
$$ -40894 154687 288452 63230 -258417 -157741 -302053 -219739 -147184 -228110 -297236
22115b97236J748L6457o1671j12364J35581J13575L2758J1922J16641N1542j57903
$$ -297236 -295488 -259031 -320702 -433066 -297485 -183910 -151152 -139230 -22589 28953 -128950
22104a28950o7506J23298J86284k08393j69221j14627J50714L05963K27093r4550
$$ -128950 -196456 -73158 113126 -95267 -264488 -379115 -228401 77562 304655 210105
22094B10105j63327k6793m9755J01096M354J8844k0373j58226R5056j8445K8204
$$ 210105 46778 19985 -29770 71326 75680 94524 74151 -84075 10981 -7464 20740
22083B0740J13096o4144k75585N7993P0130k9877O9891M2790j92729j78144P3500
$$ 20740 133836 69692 -205893 -147900 -77770 -107647 -37756 5034 -187695 -365839 -292339
22072b92339L86153K40117j22958k63761r1264J78832J06653K39814J01096k40201
$$ -292339 93814 333931 210973 -52788 -144052 34780 141433 381247 482343 242142
22062B42142r3716j07117j47230k37378q8352J11334M9550P7131K40798n6268
$$ 242142 148426 41309 -105921 -343299 -431651 -320317 -270767 -193636 47162 -9106
22052i106N591J71211J1970J00590r4389k45077j65314k52696O176L54363K34296
$$ -9106 -3515 167696 179666 280256 185867 -59210 -224524 -477220 -471044 -116681 117615
22041A17615k36405O0007K84092j47243k81511o1533O3087r1924o0140R0708M8533
$$ 117615 -118790 -58783 225309 78066 -203445 -264978 -201891 -293815 -353955 -263247 -214714
22030b14714Q582k4171q8665K79745Q9588k61150j40643J92089P09j2936J39045
$$ -214714 -206132 -230303 -318968 -39223 50365 -210785 -351428 -159339 -158630 -171566 -32521
22019c2521J12442j93077P8431o9094M8190j30799N6612L44342K02507m1783K4906
$$ -32521 79921 -113156 -34725 -103819 -55629 -186428 -129816 214526 417033 375250 400156
22008D00156N7883r4356j13288k533K5717k21092m3653r3059p0315N6179p3775
$$ 400156 458039 363683 250395 247862 273579 52487 8834 -84225 -154540 -98361 -172136
21997a72136p1567O5319P4399j00327k24726N4355J20084J43163K08915l1810
$$ -172136 -243703 -178384 -103985 -204312 -429038 -374683 -254599 -111436 97479 65669
21987F5669j2143L538q051k07053j41101j968M53629M9989j89509K09703J03168
$$ 65669 53526 57064 49013 -158040 -299141 -301109 152520 202509 13000 222703 325871
21976C25871j96947L7292J15447j55822k48074M6204K21650j6193j39412l6826
$$ 325871 128924 166216 281663 125841 -122233 -76029 145621 129428 -9984 -46810
21966d6810j5767M3332j18374j2132P4527J44792J3826n7310J40506M5203J13523
$$ -46810 -62577 -19245 -137619 -149751 -75224 69568 83394 26084 166590 211793 325316
21955C25316k51177r1829j34260j50304j3960j74422M34244J7805l265j4479j67154
$$ 325316 74139 -17690 -151950 -302254 -316214 -490636 -56392 -38587 -41852 -56331 -223485
21944b23485O5154L63661J31851j66733o7651k28006k27749j78610K15334k8076
$$ -223485 -158331 205330 337181 170448 102797 -125209 -352958 -531568 -316234 -344310
21934c44310J9025J11620L13223J41113Q7146M1516j46720K1998Q3350J0887p4769
$$ -344310 -325285 -213665 99558 240671 327817 369333 222613 244611 327961 338848 264079
21923B64079p1120r227j3799k5646m6854P4951j49381Q774r0819J44616J81481
$$ 264079 192959 183732 169933 144287 97433 172384 23003 31777 -59042 85574 267055
21912B67055j92735k19008J03708J33230J02085j02971l4564K30913j7141k35766
$$ 267055 74320 -144688 -40980 92250 194335 91364 56800 287713 270572 34806
21902C4806l44746k887l7484P5914P2861P0017K9748J9638Q024J1752j92183m7554
$$ 34806 -309940 -312827 -350311 -274397 -201536 -131519 -101771 -82133 -74109 -62357 -254540 -302094
21890c02094K9751J64794K20039J73717m29694j07039k2548n9656K9150L33963
$$ -302094 -272343 -107549 112490 286207 -143487 -250526 -273074 -332730 -303580 30383
21880C0383j90618j28040j69152o4252P6255K8279K21763K04115o1006m4173J77811
$$ 30383 -160235 -288275 -457427 -521679 -445424 -417145 -195382 8733 -52273 -96446 81365
21869H1365j01008j27369J38400J35137j80925J74287l1104K7747j81251K44L6301
$$ 81365 -19643 -147012 -8612 126525 -54400 119887 88783 116530 -64721 -64477 -28176
21858b8176J411K06044l8044P5602p1947k67652n7393M292p0462j19376o7169
$$ -28176 -26765 179279 141235 216837 144890 -122762 -180155 -175863 -246325 -365701 -432870
21847d32870K26131O515l3750R9834Q9356j19069K10956K89686M15349l34124
$$ -432870 -206739 -200224 -233974 -134140 -44784 -163853 47103 336789 752138 418014
21837D18014o09246j26059q3031J4365J86037J26986o4714M1169L1578J18450
$$ 418014 -191232 -317291 -400322 -385957 -199920 -72934 -137648 -96479 -64901 53549
21827E3549j99171m1199R3111J15359k28123l8683L9269J001P6018J76245J08086
$$ 53549 -145622 -186821 -93710 21649 -206474 -245157 -205888 -204887 -128869 47376 155462
21816A55462j18368k11965L0640k9476m4154J36437J32220J52109j44353j75656
$$ 155462 37094 -174871 -144231 -173707 -217861 -81424 50796 202905 58552 -117104
21806a17104k45535J33314J88480Q2942J08324j36741J13004k23928M2101j52322
$$ -117104 -362639 -229325 -40845 42097 150421 13680 126684 -97244 -55143 -207465
21796b07465j96414k0670r0588L2487J22491k9337O2983j9239r158j1063M1666
$$ -207465 -403879 -424549 -515137 -482650 -360159 -389496 -326513 -345752 -354910 -365973 -324307
21785c24307J92452J1847n5443m6801J64528K75517l83286n3938J39022j15868
$$ -324307 -131855 -120008 -175451 -222252 -57724 217793 -165493 -219431 -80409 -196277
21775a96277K8366J40566M07158K0062l73104k92183K8458P903J61663P3773k61941
$$ -196277 -167911 -27345 379813 399875 26771 -265412 -236954 -229051 -67388 6385 -255556
21764b55556j63387J92052Q0110O8271J86021j29332k03175m4863M3220J14122
$$ -255556 -418943 -226891 -146781 -78510 107511 -21821 -224996 -269859 -226639 -112517
21754a12517J29199P8806P3847J11418J91992l23147j68616O4353J65229n4295
$$ -112517 16682 95488 169335 280753 472745 149598 -19018 45335 210564 156269
21744A56269O0891J76025J37165P4803l37967k17132l8861j0466l3794K14378
$$ 156269 217160 393185 530350 605153 267186 50054 11193 727 -33067 181311
21734A81311L7642j67208k05802M7759N6139j17385n6255K56458R8322k0411K3038
$$ 181311 218953 51745 -154057 -106298 -50159 -167544 -223799 32659 130981 110570 133608
21723A33608l39333j95563o8391L04949l3241k47658R89j35872k16827J12807
$$ 133608 -205725 -401288 -469679 -164730 -197971 -445629 -444640 -580512 -797339 -684532
21713f84532J32477m4179k4821J99796J98019O2377K25609j54957r0627L91996
$$ -684532 -552055 -596234 -621055 -421259 -223240 -160863 64746 -90211 -180838 211158
21703B11158L2361k49913j08190J12444P0529Q0061M9055l2123j33580m0349j25561
$$ 211158 243519 -6394 -114584 -2140 68389 148450 197505 165382 31802 -8547 -134108
21692a34108J81269J83808j0385J00358k66952j00795l4592P056j9961J28706
$$ -134108 47161 230969 220584 320942 53990 -46805 -81397 -74341 -94302 34404
21682C4404O206K0198Q0147L7012j55787j22032j52219J46913J76501l2931l9088
$$ 34404 40610 60808 140955 177967 22180 -99852 -252071 -105158 71343 38412 -676
21671f76J13072p4526K2906j33756j15266j73448m6988J375j56986m7216m086
$$ -676 112396 37870 60776 -72980 -188246 -361694 -408682 -407307 -564293 -611509 -615595
21660f15595K24125K23305O1811Q2180J11114J2230r6536J07877j73868j40416
$$ -615595 -391470 -168165 -106354 -24174 86940 99170 2634 110511 -63357 -203773
21650b03773p3368N3163n3295J68298R0317K96781J47367j61384j29406j40391
$$ -203773 -277141 -223978 -277273 -108975 -18658 278123 425490 264106 134700 -5691
21640e691j52502J82028J27378q164J01026M2179l31353j79263m09490n5839K61077
$$ -5691 -158193 23835 151213 143049 244075 286254 -45099 -224362 -633852 -689691 -428614
21629d28614K66806M24536L31683j19827l14846K3836k12550k02226O6069J39323
$$ -428614 -161808 262728 594411 474584 159738 183574 -28976 -231202 -165133 -25810
21619b5810R3250R0810L295j20979j63676R4656J60488j20986k47074k96485L45467
$$ -25810 67440 158250 161545 40566 -123110 -28454 132034 11048 -236026 -532511 -187044
21608a87044L99773L2760m700k2906L0620J92584j08356j87408j38681J63809
$$ -187044 212729 245489 240789 217883 248503 441087 332731 145323 6642 170451
21598A70451M7630L8485k60385q8609j56799j71153k28643Q7888L70098K7834
$$ 170451 218081 256566 -3819 -92428 -249227 -420380 -649023 -561135 -191037 -163203
21588a63203K62985K47873P1879j27935j67911l4239R4618J07706j25298k50914
$$ -163203 99782 347655 419534 291599 123688 89449 184067 291773 166475 -84439
21578h4439p6463J04307K03647J74997n5083k53701j73768j0669K23272m3689
$$ -84439 -160902 -56595 147052 322049 266966 13265 -160503 -171172 52100 8411
21568H411j01009K65407M2583J42470J63045q959M4984m0398m18931o2763J18166
$$ 8411 -92598 172809 215392 357862 520907 511948 556932 516534 97603 34840 153006
21557A53006P955j87203L2193O3521r4532j23666n3934L2906j21667l79751p0987
$$ 153006 160961 -26242 5951 69472 -25060 -148726 -202660 -169754 -291421 -671172 -742159
21546g42159L41085P7368M7252J08247J99779L11239K38195o0730j18655l69745
$$ -742159 -401074 -323706 -276454 -168207 31572 342811 581006 520276 401621 31876
21536C1876j19781m9898N9558L2642m8944J41683k17404p3018P1626J97395o4327
$$ 31876 -87905 -137803 -78245 -45603 -94547 47136 -170268 -243286 -171660 25735 -38592
21525c8592O3395j8500p1832J3324N9898Q3053n0812M5479J40374m9031j92752
$$ -38592 24803 6303 -65529 -52205 7693 90746 39934 85413 225787 176756 -15996
21514a5996p3820j62708J29243J64491j15881k18572k47853K8029J8781L30238
$$ -15996 -89816 -252524 -123281 41210 -74671 -293243 -541096 -513067 -494286 -164048
21504a64048K83695l4296j70867k33577m4316r2683Q7124J79018J24863K15080
$$ -164048 119647 85351 -85516 -319093 -363409 -456092 -368968 -189950 -65087 149993
21494A49993J4473l34604n448J11779Q3972K0938n4041o338m6929J08891k7361
$$ 149993 164466 -170138 -175586 -63807 20165 41103 -12938 -19276 -66205 42686 15325
21483A5325J00961K9537k01523j14565K3167O7466o3329k92481p9088K25360K52845
$$ 15325 116286 145823 -55700 -170265 -147098 -79632 -142961 -435442 -514530 -289170 -36325
21472c6325K13050o6056p6146o2523J35345K33081k29943k64750J52751K10103
$$ -36325 176725 110669 34523 -28000 107345 340426 110483 -154267 -1516 208587
21462B08587p8052P3962j08236k9847k00265j23162o6843M1731q2042q1505n823
$$ 208587 130535 204497 96261 66414 -133851 -257013 -323856 -282125 -364167 -445672 -451495
21451d51495L2785m1827K24438P667r0014J97529M27485K71454j37242k29304
$$ -451495 -418710 -460537 -236099 -228432 -318446 -120917 306568 578022 440780 211476
21441B11476p6906k14625j13480J50905j49392K2358K34680m0250K54856J43219
$$ 211476 134570 -80055 -193535 -42630 -192022 -169664 65016 24766 279622 422841
21431D22841L5898p7187k86842j32577j4485K9561J35776j1834J17340o9518J01253
$$ 422841 458739 381552 94710 -37867 -52352 -22791 112985 101151 218491 148973 250226
21420B50226J4101r6664O3975j5709o6873j10771j84426k16121J38400M4357j38204
$$ 250226 264327 167663 231638 215929 149056 38285 -146141 -362262 -223862 -179505 -317709
21409c17709P2139J30478N0079j06918J54040O1295p9779J0777L31895J76157
$$ -317709 -245570 -115092 -65013 -171931 -17891 43404 -36375 -25598 306297 482454
21399D82454k27047k46845j18667L5183j49986J40038K24288N5736m7188j72166
$$ 482454 255407 8562 -110105 -74922 -224908 -84870 139418 195154 147966 -24200
21389b4200j76077L7935N1749k9226k3110J58757N9503l2689l5995P3535j18175
$$ -24200 -200277 -162342 -110593 -139819 -162929 -4172 55331 22642 -13353 60182 -57993
21378e7993r7513r6009J36065J70078J12393o0150O2135q6005j13215K80885P8116
$$ -57993 -155506 -251515 -115450 54628 167021 106871 169006 83001 -30214 250671 328787
21367C28787L165l3013q4835k86372j2829Q0171J70383J56359q7942j92595n247
$$ 328787 331952 298939 214104 -72268 -85097 -4926 165457 321816 233874 41279 36032
21356C6032M6110K3358k7474R6725r1347N4921J30201Q2635r2328j84895J1351
$$ 36032 82142 105500 78026 174751 83404 138325 268526 351161 258833 73938 85289
21345H5289k41613J15189J55751k81353q1191K47772K17209K7789J3174O7218
$$ 85289 -156324 -41135 114616 -166737 -247928 -156 217053 244842 258016 325234
21335C25234J10226p8883L597j03666K8982J42343j84470k66723l9715J43123
$$ 325234 435460 356577 360174 256508 285490 427833 243363 -23360 -63075 80048
21325H0048r0993J8660j6785L416J68834J3364j97065j9599P5530q6180J06628
$$ 80048 -10945 7715 -9070 -5654 163180 176544 -20521 -40120 35410 -50770 55858
21314E5858N3703k61555m1538J78666j31334k90664O2901O6794J18861K70196
$$ 55858 109561 -151994 -193532 -14866 -146200 -436864 -373963 -307169 -188308 81888
21304H1888m8701J1390l6327j44159Q5791J50693J2801j2357J01897K07137O374
$$ 81888 33187 44577 8250 -135909 -50118 100575 113376 101019 202916 410053 416427
21293D16427P689j06114k43809j79866J5219q6149N9302J09153J767m4146M4760
$$ 416427 424116 318002 74193 -105673 -90454 -176603 -117301 -8148 -6381 -50527 -5767
21282e767p040K71431Q2633o0620j01226K23942k27444l8096p0074k41819j07006
$$ -5767 -12807 258624 341257 280637 179411 403353 175909 137813 67739 -174080 -281086
21271b81086J46039M7286J30510k9251j18991j31285j42126J75562n662R199n7113
$$ -281086 -135047 -87761 42749 13498 -105493 -236778 -378904 -203342 -209004 -199805 -256918
21260b56918L09780L1875j78019j91199L9039M2622P8240K3157K2783N9073k46138
$$ -256918 52862 84737 -93282 -284481 -245442 -202820 -124580 -101423 -78640 -19567 -265705
21249b65705K0644M7705n5856J34490K15422N42599J04541j57085m20559r0292
$$ -265705 -245061 -197356 -253212 -118722 96700 639299 743840 586755 166196 75904
21239G5904l16272j6477K05768J86891j02127j94010J06342J12107O7961m7648
$$ 75904 -240368 -256845 -51077 135814 33687 -160323 -53981 58126 126087 78439
21229G8439j24794M3054l3890j98378L931L2061P7889j24226K64247M4992j80528
$$ 78439 -46355 -3301 -37191 -235569 -231638 -199577 -121688 -245914 18333 63325 -117203
21218a17203m1672j55425J82503L56942J16034k11496k92231k91213o8984J20906
$$ -117203 -158875 -314300 -131797 225145 341179 129683 -162548 -453761 -522745 -401839
21208d01839K15519K72428j22375k61586L4417K06797J10092j73694p1006J9466
$$ -401839 -186320 86108 -36267 -297853 -263436 -56639 53453 -120241 -191247 -171781
21198a71781O8228J07506k9083J74178R380M589j83034N0879J01360k0096n8635
$$ -171781 -103553 3953 -25130 149048 158428 163017 -20017 30862 132222 112126 53491
21187E3491J036O6471J12602L37925J51339j10389N8509k38555j41486k26647
$$ 53491 54527 120998 233600 571525 722864 612475 670984 432429 290943 64296
21177F4296p6062J75357j51171k39684J32252J23282p7581r0738J47631j1520
$$ 64296 -11766 163591 12420 -227264 -95012 28270 -49311 -140049 7582 -3938
21167c938O3456K18364Q1545K4876j53115l8708K30602j52459o7126j856p6355
$$ -3938 59518 277882 359427 384303 231188 192480 423082 270623 203497 201641 125286
21156A25286N6656o0718l82722j46480J26207J49869J01232J77983K70799L7368
$$ 125286 181942 121224 -261498 -407978 -281771 -131902 -30670 147313 418112 455480
21146D55480k44697j71348k16315Q5133j0821r8890k1822J48934K17302o3223
$$ 455480 210783 39435 -176880 -91747 -102568 -201458 -223280 -74346 142956 79733
21136G9733q0813L5091J48197K14284K05178k06522j70973k52860k13946K55526
$$ 79733 -1080 34011 182208 396492 601670 395148 224175 -28685 -242631 12895
21126A2895n9858M8096m9996o4918k05845R0608R8779m3150j42381P5441L23153
$$ 12895 -46963 1133 -48863 -113781 -319626 -229018 -130239 -173389 -315770 -240329 82824
21115H2824K11067K35065p5176k13605j68460j24497K9558J26631j16322q9771
$$ 82824 293891 528956 453780 240175 71715 -52782 -23224 103407 -12915 -102686
21105a02686k6585m7703K8587P1640P5021J14770j1582n4896J02305k6007j6196
$$ -102686 -129271 -176974 -148387 -76747 -1726 113044 101462 46566 148871 122864 106668
21094A06668K91696l21278m61996J7605K28923Q1293J69438N9814M6465j12151
$$ 106668 398364 77086 -384910 -367305 -138382 -57089 112349 172163 218628 106477
21084A06477p7941r0580j22857j60250N5037L38804L6995O2601j00759m3143K0088
$$ 106477 28536 -62044 -184901 -345151 -290114 48690 85685 148286 47527 4384 24472
21073B4472k9126k0851m9377J71902n288J86509L1398n1764j53063k54921j61327
$$ 24472 -4654 -25505 -74882 97020 91732 278241 309639 257875 104812 -150109 -311436
21062c11436R3348K28380K68587M11338K43761l13034m58420M3866J7048J02566
$$ -311436 -218088 10292 278879 690217 933978 620944 162524 206390 223438 326004
21052C26004k7404j09902p5941m383J61602Q8078l20J35553j84794j08347q4350
$$ 326004 298600 188698 112757 108374 269976 358054 357734 493287 308493 200146 115796
21041A15796J20187J27692J56461j0788k16917j27744K1605j61269j21818N3600
$$ 115796 235983 363675 520136 509348 292431 164687 186292 25023 -96795 -43195
21031d3195N5535j05522k33636n635L47960J29604P0979J84675j13099k08603
$$ -43195 12340 -93182 -326818 -332453 15507 145111 216090 400765 287666 79063
21021G9063J9927j67449k11145j46958K26950J18682q6512K67340K2027k2301
$$ 79063 98990 -68459 -279604 -426562 -199612 -80930 -167442 99898 121925 99624
21011I9624N3713j6362o1679p9267R9500R7994k4247l6611M6672j17560K9186
$$ 99624 153337 136975 75296 -3971 95529 193523 169276 132665 179337 61777 90963
21000I0963j25549n0515J15907k1441j1394K34231q5824j44626j22989l8245M1325
$$ 90963 -34586 -85101 30806 9365 -2029 232202 146378 1752 -121237 -159482 -118157
20989a18157J46728J94096Q7011o4078j244o2922l0394l60100M5485O8432l3908
$$ -118157 28571 222667 309678 245600 244356 181434 151040 -209060 -163575 -95143 -129051
20978a29051P0638p5677k2024N4739K29402Q7234r4346J35531J12333j23495q1249
$$ -129051 -58413 -134090 -156114 -101375 128027 215261 120915 256446 368779 245284 164035
20967A64035K3816J02791O5109k03610j88067k62477K77327K55174O1465J30168
$$ 164035 187851 290642 355751 152141 -35926 -298403 -21076 234098 295563 425731
20957D25731m0295k15947p1231N6565j25694J4413j77184K4993J07797o6701k1592
$$ 425731 385436 169489 98258 154823 29129 43542 -133642 -108649 -852 -67553 -89145
20946h9145M9885O8998J47258K8422k2045K4710k25205k32638R3665J45685K78692
$$ -89145 -39260 29738 176996 205418 183373 208083 -17122 -249760 -156095 -10410 268282
20935B68282J9225j35540k00771q146J00672n0863p4269j38110K89924J11229
$$ 268282 287507 151967 -48804 -56950 43722 -7141 -81410 -219520 70404 181633
20925A81633k2070j8524k02705m389j04098K11274J47448l6507R377k1589k78423
$$ 181633 159563 141039 -61666 -66055 -170153 41121 188569 152062 161439 139850 -138573
20914a38573k07471K2579R1071J56000J94247j75687L9316o7725l0375o7341Q5682
$$ -138573 -346044 -323465 -232394 -76394 117853 -57834 -18518 -86243 -116618 -183959 -98277
20903i8277J97265L90290p645j96544j2305l64363l48050j37722K43804L25462
$$ -98277 98988 489278 481633 285089 272784 -91579 -439629 -577351 -333547 -8085
20893h085J90144j43012l261k10055k4233l944J26907K81253K08832j32664j45107
$$ -8085 182059 39047 35786 -174269 -198502 -202446 -75539 205714 414546 281882 136775
20882A36775j61157J0940l138J10652R5458r184K11846k14854j68329o4924m1790
$$ 136775 -24382 -13442 -16580 94072 189530 180346 392192 177338 9009 -55915 -97705
20871i7705R4938Q175r2884j6852J42118j76521o2585N7680k096l9613p7440J25781
$$ -97705 -2767 5408 -87476 -104328 37790 -138731 -201316 -143636 -145732 -185345 -262785 -137004
20859a37004k4644P6446K6446n905o685l0202O1407O5329Q8432p4156n84j5983
$$ -137004 -161648 -85202 -58756 -64661 -71346 -101548 -40141 25188 113620 39464 38880 22897
20847B2897k26283Q0075J56095P601n2523j2778J68815K15677k62312j09314P1392
$$ 22897 -203386 -123311 32784 40385 -12138 -24916 143899 359576 97264 -12050 59342
20836E9342N2916K8834K83983P952k41728k01896r1488M6530M3010m14P1238J34498
$$ 59342 112258 141092 425075 433027 191299 -10597 -102085 -55555 -12545 -12959 58279 192777
20824A92777R7473k9345l4830j56418l50371P5024L67386J91714j70584j22244
$$ 192777 290250 260905 226075 69657 -280714 -205690 161696 353410 182826 60582
20814F0582r1612O100m2983J36760L5692N155j09255N4072O7582J38544L6356
$$ 60582 -31030 -24930 -67913 68847 104539 109694 439 54511 122093 260637 296993
20803B96993o6385M8205j10952j30343l7012J1037o6039M6136l8366J11630q3571
$$ 296993 230608 278813 167861 37518 506 11543 -54496 -8360 -46726 64904 -18667
20792a8667j18680j62023k50925J22433L06992j7963j46375K44050J88377K7189
$$ -18667 -137347 -299370 -550295 -427862 -120870 -138833 -285208 -41158 147219 174408
20782A74408L2819M0058j17345p7324R4411Q4813n6458m7232O5098m8992q6160
$$ 174408 207227 247285 129940 52616 147027 231840 175382 128150 193248 144256 58096
20771E8096l33171k2969J08592r8014j22515l339J23356O6946K04013n1258M2154
$$ 58096 -275075 -298044 -189452 -287466 -409981 -413320 -289964 -223018 -19005 -70263 -28109
20760b8109k6911Q5915K05650J03413j90386K4675j35125R3406J07213J70653
$$ -28109 -55020 30895 236545 339958 149572 174247 39122 132528 239741 410394
20750D10394j59544m093j10575j16035m4686J75477P7928p7975n2807o9142o6651
$$ 410394 250850 246757 136182 20147 -24539 150938 228866 150891 98084 28942 -37709
20739c7709l9539o7030n0302Q036J3595J78953J06602n3675m3833M706j53475
$$ -37709 -77248 -144278 -194580 -186544 -172949 6004 112606 58931 15098 19804 -133671
20728a33671P6921K40535j91488q8923K94310n4450j38715P425J02628j53321
$$ -133671 -56750 183785 -7703 -96626 197684 143234 4519 11944 114572 -38749
20718c8749j91669K14889p9149k5948J51693Q0795k19384J45785p4924j10146
$$ -38749 -230418 -15529 -94678 -120626 31067 111862 -107522 38263 -36661 -146807
20708a46807k1721J83505M6782r7662L5567P2225j11883M2861M5922J13929p9131
$$ -146807 -168528 14977 61759 -35903 -336 71889 -39994 2867 48789 162718 83587
20697H3587k86409l12198K29244J07606L7821k1235o6262L0344r3003J00167K18504
$$ 83587 -202822 -515020 -285776 -178170 -140349 -161584 -227846 -197502 -290505 -190338 28166
20686B8166J07461l0650M5062J37460j53563l5961J88777l8917p7393j978L1239
$$ 28166 135627 104977 150039 287499 133936 97975 286752 247835 170442 168464 199703
20675A99703o0900K283k9445J5586K16351m4238k72459P3530m3387J25333p8444
$$ 199703 138803 141086 111641 127227 343578 299340 26881 100411 57024 182357 103913
20664A03913j61695M8820J311j55478L8899M02247J53313o6264l44787J59790
$$ 103913 -57782 -8962 -7651 -163129 -124230 278017 431330 365066 20279 180069
20654A80069j360k99266j85935J51666J40972j5725J55236P1488n8534p6197k79823
$$ 180069 178709 -120557 -306492 -154826 -13854 -29579 125657 197145 138611 62414 -217409
20643b17409j73943K10245J96879q4878k3132j35516R1953N3597j21926j02786
$$ -217409 -391352 -181107 15772 -69106 -92238 -227754 -135801 -82204 -204130 -306916
20633c06916J06213K72842J14255j34316O1548J7394J94498j95440j20554K53706
$$ -306916 -200703 72139 186394 52078 113626 131020 325518 130078 9524 263230
20623B63230n441j62919j7747O420K4729j15406k7031J87312J40755r1915j19543
$$ 263230 257789 94870 77123 83543 108272 -7134 -34165 153147 293902 201987 82444
20612H2444J16786J53187M243k32796m2427J95049j87233l15974J34618P1340
$$ 82444 199230 352417 356660 123864 81437 276486 89253 -226721 -92103 -20763
20602b0763p260k48993m0995r131j1068K22297K40424k3870j49178Q3809q6367
$$ -20763 -28023 -277016 -318011 -327142 -338210 -115913 124511 100641 -48537 35272 -51095
20591e1095O2620R3182J12816J77955r6590L954J41029J4271k1132p9440j72681
$$ -51095 11525 104707 217523 395478 298888 302842 443871 458142 437010 357570 184889
20580A84889j65162j36110L41909J42677n7751P3316j77785j04539j35488q5901
$$ 184889 19727 -116383 225526 368203 310452 383768 205983 101444 -34044 -119945
20570a19945J95688N3641j25774l36402K3961J22965K17817Q1578J76362O1324
$$ -119945 75743 129384 3610 -332792 -308831 -185866 31951 113529 289891 351215
20560C51215j97273m8476j72084K82387J13816j45227k92715o4169L06571J81709
$$ 351215 153942 105466 -66618 215769 329585 184358 -108357 -172526 134045 315754
20550C15754J34698K40080j54368J15718J6030l32909q5691N4312p2472k63780
$$ 315754 450452 690532 536164 651882 667912 335003 249312 303624 231152 -32628
20540c2628J85120J08622P2005j63124j36833p387m9181K9704M1580J50053p8196
$$ -32628 152492 261114 333119 169995 33162 25775 -23406 6298 47878 197931 119735
20529A19735r573M7187P1508l00157O0159j86869q83N3746K27155J37968j4526
$$ 119735 110162 157349 228857 -71300 -11141 -198010 -198893 -145147 82008 219976 205450
20518B05450J74494J2837J39932j3475k46970j77939P8763J26633k39053j40003
$$ 205450 379944 392781 532713 519238 272268 94329 173092 299725 60672 -79331
20508g9331K1700J833J00553O227O3188r0675j44790J72159J6004k5997Q7396
$$ -79331 -57631 -55798 44755 50982 114170 23495 -121295 50864 66868 40871 128267
20497A28267J2300j87421j41089l7910j4R6774j41561q468N7465o5645Q3128O9519
$$ 128267 140567 -46854 -187943 -225853 -225867 -129093 -270654 -279122 -221657 -287302 -204174 -134655
20485a34655J07652j7068j05857j94154R8167J03569O5821Q2826l94618k42434
$$ -134655 -27003 -44071 -149928 -344082 -245915 -142346 -76525 6301 -388317 -630751
20475f30751K12621M12329j2889o3188o8390K46738N5398M6728J02266M4953m8091
$$ -630751 -418130 -5801 -18690 -81878 -150268 96470 151868 198596 300862 345815 297724
20464B97724K4312k47987r2313k73058n1058K03609n2792K24237q2164l37477
$$ 297724 322036 74049 -18264 -291322 -342380 -138771 -191563 32674 -49490 -386967
20454c86967M2289P3788O5147j54925J06750L66524M5550k73414k91284M8150
$$ -386967 -344678 -270890 -205743 -360668 -253918 112606 158156 -115258 -406542 -358392
20444c58392K91984K90613L73038q4746l49417N3720K09274o9358r4473l2393
$$ -358392 -66408 224205 597243 512497 163080 216800 426074 356716 262243 229850
20434B29850j1358k8385J7429J51669J8409M7060M7189p6388l87691k21459K11998
$$ 229850 218492 190107 207536 359205 377614 424674 471863 395475 7784 -213675 -1677
20423a677J74659j72289n4919p0878j52854m435K61083J81736m0864j65536k03583
$$ -1677 172982 693 -54226 -125104 -277958 -282393 -21310 160426 119562 -45974 -249557
20412b49557R3767K96508J90774K58745j96520l47160j43058J04223k4118j80922
$$ -249557 -155790 140718 331492 590237 393717 46557 -96501 7722 -16396 -197318
20402a97318L5788L5088m4682J95275J68017k14640k20107Q5956J47505k07915
$$ -197318 -161530 -126442 -171124 24151 192168 -22472 -242579 -156623 -9118 -217033
20392b17033j1098k8022o4707J94479J95370M638n2137P1117N2072k22791L7387
$$ -217033 -228131 -256153 -320860 -126381 68989 73627 21490 92607 144679 -78112 -40725
20381d0725J58827j76669J82111K05462r2585r7488j27399J86580J99008L1423
$$ -40725 118102 -58567 123544 329006 236421 138933 11534 198114 397122 428545
20371D28545k10892K3r0274j26052l79082J27650J67642K87936M30477m7191m94839
$$ 428545 217653 217676 127402 1350 -377732 -250082 -82440 205496 635973 588782 93943
20360I3943r3838J41347k4314j18993j02888p2539j70583k346L24862K62423n7713
$$ 93943 105 141452 117138 -1855 -104743 -177282 -347865 -350211 -25349 237074 179361
20349A79361r5570j09725Q9970L6598o5115j14290k47044J36918J43272K76649
$$ 179361 83791 -25934 64036 100634 35519 -78771 -325815 -188897 -45625 231024
20339B31024j82167J07008J49668M7949j34613l0199J96679L0957q3937k55352
$$ 231024 48857 155865 305533 353482 218869 188670 385349 416306 332369 77017
20329G7017l24904L7190K81216k10005L1137L12227K77714r1411l7555k03945
$$ 77017 -247887 -210697 70519 -139486 -108349 203878 481592 390181 352626 148681
20319A48681o8069n0985J67955K2060o9248J80353q8903m6369l2461k01855k0633
$$ 148681 80612 29627 197582 219642 150394 330747 241844 195475 163014 -38841 -59474
20308e9474N3061N3240J63771J27534j62641l4313r5940J90481j7092k06269p777
$$ -59474 -6413 46827 210598 338132 175491 141178 45238 235719 218627 12358 4581
20297D581O6246M6444k12965j03621j9922J31398J56883J33520P0572r8650j17718
$$ 4581 70827 117271 -95694 -199315 -219237 -87839 69044 202564 273136 174486 56768
20286E6768n6175l4326N8558J41082J15007l93521k41184K02013K21053N6222
$$ 56768 593 -33733 24825 165907 280914 -112607 -353791 -151778 69275 125497
20276A25497k8843n749j01031j36874q8508Q4048r7591K962N1246J16768J68582
$$ 125497 96654 90905 -10126 -147000 -235508 -151460 -249051 -246089 -194843 -78075 90507
20265I0507L8534R9558P062k49433n2544N654l4868j9564K93723O8030j41227
$$ 90507 129041 228599 235661 -13772 -66316 -60662 -95530 -115094 178629 246659 105432
20254A05432m6059o6018R0338K64885j3647r8706M1043L7542P523J21428m0211
$$ 105432 59373 -6645 83693 348578 334931 236225 277268 314810 322333 443761 403550
20243D03550K53175l1922j52160k5782j94444k57037j40639L0245J64953L803
$$ 403550 656725 624803 472643 446861 252417 -4620 -145259 -115014 49939 53742
20233E3742l53904o2134J18609J74220J33611k01381j55334m6172J2408J54740
$$ 53742 -300162 -362296 -243687 -69467 64144 -137237 -292571 -338743 -326335 -171595
20223a71595N6512J32186J09651M7599j8999n0319L4631n6434J42881R4354j4436
$$ -171595 -115083 17103 126754 174353 155354 105035 139666 83232 226113 320467 306031
20212C06031j24473r2951r5583M3130P5167J24474O0646M6907R6280o8816j51081
$$ 306031 181558 88607 -6976 36154 111321 235795 296441 343348 439628 370812 219731
20201B19731J18307O1816o1560P7765n815j01139K19765k56335k65374Q0117K1013
$$ 219731 338038 399854 338294 416059 410244 309105 528870 272535 7161 87278 108291
20190A08291P0525j05782n6180q1931l5441Q9822j9281J58762q8702l1171Q3833
$$ 108291 178816 73034 16854 -65077 -100518 -10696 -29977 128785 40083 8912 92745
20179I2745K96741J40542p6116j75940k83611m7578q3306k2120j32929q7101J55021
$$ 92745 389486 530028 453912 277972 -5639 -53217 -136523 -158643 -291572 -378673 -223652
20168b23652K62839L7556j33369l4708K70258J99626j53887J7728K90719k65289
$$ -223652 39187 76743 -56626 -91334 178924 378550 224663 242391 533110 267821
20158B67821j3024k47394l61076J38740J66073L9825K10061q3120p9643O6099
$$ 267821 254797 7403 -353673 -214933 -48860 -9035 201026 117906 38263 104362
20148A04362o6305J52712L9256j99569p6289J88751J06135m8092O9570j81290
$$ 104362 38057 190769 230025 30456 -45833 142918 249053 200961 270531 89241
20138H9241K5387j69968j00587j1447M7088J09410M1476N8717k608P9686j39994
$$ 89241 114628 -55340 -155927 -167374 -120286 -10876 30600 89317 86709 166395 26401
20127B6401o7101j18409J86361l4185K06000K09898J46111p3038k82927j16934
$$ 26401 -40700 -159109 27252 -6933 199067 408965 555076 482038 199111 82177
20117H2177k97597k7174Q5701q9059Q1158M45821Q3508Q148j39611J40874K60673
$$ 82177 -215420 -242594 -156893 -245952 -164794 281027 364535 372683 233072 373946 634619
20106F34619r5744J097M8778o9037j68668L08057j16109m79718k8583O6416M795
$$ 634619 538875 539972 588750 519713 351045 659102 542993 63275 34692 101108 105903
20095A05903p9253k54426r6852L03152J90324m7052P8612m3478j89325L33431
$$ 105903 26650 -227776 -324628 -21476 168848 121796 200408 156930 -32395 301036
20085C01036J59554R6290J06464j82605l32529K5900J02706k93869l3732J6294
$$ 301036 460590 556880 663344 480739 148210 174110 276816 -17053 -50785 -34491
20075c4491r983R6333K91438m2125J97283J07837k00631j13069k9792J09636J30558
$$ -34491 -44474 51859 343297 301172 498455 606292 405661 292592 262800 372436 502994
20064E02994j15362k29460J41075J23971J15266l2092K1079o6029j14587M5379
$$ 502994 387632 158172 299247 423218 538484 506392 527471 461442 346855 392234
20054C92234j04171j1329J03628J32997j11953j59800l5617M0711J2548K41812
$$ 392234 288063 276734 380362 513359 401406 241606 205989 246700 259248 501060
20044E01060Q1583j63187J87424J41128P5813J36846J55962J67564j08399k88080
$$ 501060 582643 419456 606880 748008 823821 960667 1116629 1284193 1175794 887714
20034H87714O7666r2519k65907j30756j2006j5262J41886L07190J98390M82520
$$ 887714 955380 862861 596954 466198 454192 438930 580816 888006 1086396 1568916
20024A568916r8644j5432k3857l9106Q681M2372j43064l05079j87835j83648l81213
$$ 1568916 1470272 1454840 1430983 1391877 1400558 1442930 1299866 994787 806952 623304 242091
20013B42091j91587p3987P3946j39813n0516J61071J28619k113J23226k1485k03963
$$ 242091 50504 -23483 50463 -89350 -139866 21205 149824 147711 270937 249452 45489
20002D5489r477o5754J8668K73734O7853L8833p9216L7749J28228J03667l72J45718
$$ 45489 36012 -29742 -11074 262660 330513 369346 290130 327879 456107 559774 559402 705120
19990G05120J28032n9347j47913j35976r4801q5868J25052J53521M23744L33967
$$ 705120 833152 773805 625892 489916 395115 309247 434299 587820 1011564 1345531
19980A345531L29398r472n9423L0405r159O219J48103j47570J134k11078k49513
$$ 1345531 1674929 1665457 1606034 1636439 1627280 1633499 1781602 1634032 1635166 1424088 1174575
19969A174575N754K38073j56525n89j2628j13487j05814p9185j54852k32875J58269
$$ 1174575 1180329 1418402 1261877 1261288 1248660 1135173 1029359 950174 795322 562447 720716
19958G20716L2718j32610J232l5212p0247k13572j94894L9793N5901K11824j63533
$$ 720716 753434 620824 622056 586844 516597 303025 108131 147924 203825 415649 252116
19947B52116r2819j51721J57874J63984K10022j00433k42844o019J57125k6255
$$ 252116 159297 7576 165450 329434 539456 439023 196179 190160 347285 321030
19937C21030j84245p7640L34282J65772n0174j01969q9068J60306j29108j63572
$$ 321030 136785 59145 393427 559199 509025 407056 317988 478294 349186 185614
19927A85614L2377r5678n165k3673Q774j52292J10380J16096r0931j87291j25484
$$ 185614 217991 122313 117148 93475 102249 -50043 60337 176433 85502 -101789 -227273
19916b27273K14831K13416J79423K942k78669n2583J20306J02591J35920j48620
$$ -227273 -12442 200974 380397 383339 104670 52087 172393 274984 410904 262284
19906B62284n3153K6047P6851J32634m0428l34547o0252J86668J8180j47084p902
$$ 262284 209131 235178 312029 444663 404235 69688 9436 196104 214284 67200 59298
19895E9298o9909P4916R3088m4944j89882P7866K94074o7245l8646o4234J32140
$$ 59298 -10611 64305 157393 112449 -77433 433 294507 227262 188616 124382 256522
19884B56522K73829Q938k14979o5269O0083O4855J63652k24574j48747k5761O617
$$ 256522 530351 539289 324310 259041 319124 383979 547631 323057 174310 148549 155166
19873A55166M7592k2479j54953j35280o9041J58112J31117j1369J63889k3079
$$ 155166 202758 180279 25326 -109954 -178995 -20883 110234 98865 262754 239675
19863B39675l5624k2017j79025L319M1045R6898K14419o225l49356q1183J38538
$$ 239675 204051 182034 3009 6328 47373 144271 358690 352465 3109 -78074 60464
19852F0464P2333P8150P9714K0081K49388j48596p3675j3109k3913j25183r260
$$ 60464 132797 210947 290661 310742 560130 411534 337859 324750 300837 175654 166394
19841A66394o1957k5495K3508K55023K59640K43142l0635j16776l21034j86093
$$ 166394 104437 78942 102450 357473 617113 860255 829620 712844 391810 205717
19831B05717k4974n7934j8124J53867P2830l22730n6007K7553m4940r4836K88607
$$ 205717 180743 122809 104685 258552 331382 8652 -47355 -19802 -64742 -159578 129029
19820A29029L83903Q0819r9702j50434j46269R0035M7326R7352J39473o8041r7594
$$ 129029 512932 593751 494049 343615 197346 287381 334707 432059 571532 503491 405897
19809D05897j22709j22076j30234r81j52457M1553K08538k47984p8374J34238
$$ 405897 283188 161112 30878 29897 -122560 -81007 127531 -120453 -198827 -64589
19799f4589K1870M0905J40089J37425q6149K6995J8801j77359R998K31543J08033
$$ -64589 -42719 -1814 138275 275700 189551 216546 235347 57988 67986 299529 407562
19788D07562j22176k21178j13512j68875K4957K37572J51242r5898k76751K58277
$$ 407562 285386 64208 -49304 -218179 -193222 44350 195592 99694 -177057 81220
19778H1220R3392J78191P6653l8701m9370M9381l2668M484l50150j66062K39980
$$ 81220 174612 352803 429456 390755 341385 390766 358098 362582 12432 -153630 86350
19767H6350L23105j36048K03455J41300R6122l9408q8251J89950K62043J7366
$$ 86350 409455 273407 476862 618162 714284 674876 586625 776575 1038618 1055984
19757A055984l7960l57316j62728M3348j26961k17247J31119p2256J17338o830
$$ 1055984 1018024 660708 497980 541328 414367 197120 328239 255983 373321 366491
19747C66491k48563J22605J65885J72467K01372J14511Q152l5364k20165l06981
$$ 366491 117928 240533 406418 578885 780257 894768 902920 867556 647391 340410
19737C40410q5953J28938k03471M3260J51965M4929J50762k20957k80836R5225
$$ 340410 254457 383395 179924 223184 375149 420078 570840 349883 69047 164272
19727A64272k6919J12307L14645J90715k3222l91327M9725J20500M4098n032Q1132
$$ 164272 137353 249660 564305 755020 731798 340471 390196 510696 554794 549762 630894
19716F30894r8118p8485o95J01427P5313L1006Q6422j9448J79779l4757J55884
$$ 630894 532776 454291 453596 555023 630336 661342 747764 728316 908095 873338 1029222
19705A029222K5109l55737k74014j96031J3560j613N668J285K50908J53528J60950
$$ 1029222 1054331 698594 424580 228549 242109 240496 246164 247449 498357 651885 812835
19694H12835J50244L32835O24776N30384J39015J6874j65480j58394l70202k33736
$$ 812835 963079 1295914 1920690 2451074 2590089 2606963 2441483 2283089 1912887 1679151
19684A679151l60790k89654K01554O6380j22003k69945J11520j27672j92520R1151
$$ 1679151 1318361 1028707 1230261 1296641 1174638 904693 1016213 888541 696021 787172
19674G87172k32407q4314J09771k2695m9172n2845j87017N3704K00530M6152j47449
$$ 787172 554765 470451 580222 557527 508355 455510 268493 322197 522727 568879 421430
19663D21430j39485j79918N5773l9979K01383J36415j1289m9329j68869J15418
$$ 421430 281945 102027 157800 117821 319204 455619 444330 395001 226132 341550
19653C41550L29297p546j93544J10663q5425k9426P6076n757k2817P8880M75867
$$ 341550 670847 663301 469757 580420 494995 465569 541645 535888 513071 591951 1067818
19642A067818R0716L21477M78685L61864K29227M35663K50078l58729o40572l99815
$$ 1067818 1158534 1480011 1958696 2320560 2549787 2985450 3235528 2876799 2236227 1836412
19632A836412k12975k32797j83119n3198J65133O2180p8025j00061N6937O473
$$ 1836412 1623437 1390640 1207521 1154323 1319456 1381636 1303611 1203550 1260487 1266960
19622A266960r8277r362k20191k08537m6482j22190N5934K50164J06431n0343
$$ 1266960 1168683 1159321 939130 730593 684111 561921 617855 868019 974450 924107
19612I24107o8990L2202L5089J10263J04356k09060q5645J51734O8846N5978R6400
$$ 924107 855117 887319 922408 1032671 1137027 927967 842322 994056 1062902 1118880 1215280
19601A215280o2441J294K2911j5395q4740j25878K73867Q0567q5433o5003J01341
$$ 1215280 1152839 1154133 1177044 1161649 1076909 951031 1224898 1305465 1220032 1155029 1256370
19590A256370M4375J89642J95976k9976k40817o2790K10815K31058j74196k38482
$$ 1256370 1300745 1490387 1686363 1656387 1415570 1352780 1563595 1794653 1620457 1381975
19580A381975j19873j03288k14472k4782K49159K08787M32358J52120n299k02777
$$ 1381975 1262102 1158814 944342 919560 1168719 1377506 1809864 1961984 1956685 1753908
19570A753908j14945P732O8415r6710J43095k12725j34284K46042P5951J03465
$$ 1753908 1638963 1646695 1715110 1618400 1761495 1548770 1414486 1660528 1736479 1839944
19560A839944J36151K3518K41909K68430K30334K40027J00033N5564M8838K16208
$$ 1839944 1976095 1999613 2241522 2509952 2740286 2980313 3080346 3135910 3184748 3400956
19550C400956J52666j71013K08802J75476K31559L17555N10563M80812N38017
$$ 3400956 3553622 3382609 3591411 3766887 3998446 4316001 4826564 5307376 5845393
19541E845393L94603J039791J102050J038094O89462N35382O78177O92560O92725
$$ 5845393 6239996 7279787 8381837 9419931 10109393 10644775 11322952 12015512 12708237
19532A2708237J023962J593581K424458L062661M231075P093329J1247532J2655279
$$ 12708237 13732199 15325780 17750238 20812899 25043974 32137303 43384835 56040114
19524E6040114M696752q23343r13914J14781o5360Q75695N508444J3427678K5200539
$$ 56040114 60736866 59913523 58999609 59114390 59049030 59924725 65433169 78860847 104061386
19515A04061386M7873409Q7080343R7473087L3810713M342116Q097117m773807
$$ 104061386 151934795 239015138 336488225 370298938 374641054 382738171 377964364
19508C77964364m4265842o3725619n1400785l6351380k7899929j7551142j586500
$$ 377964364 333698522 269972903 218572118 182220738 154320809 136769667 135183167
19501A35183167J4294501J0977584p644419j5935910j5462211j6219160j9534315
$$ 135183167 149477668 160455252 152810833 136874923 121412712 105193552 85659237
19494H5659237j8739944j3584521q432724n243643l531669k673757j677400r96110
$$ 85659237 66919293 53334772 44902048 39658405 36126736 33452979 31775579 30779469
19486C0779469o98881n06891m66018r5590L95238N66384K06727N96724J207725
$$ 30779469 30080588 29573697 29107679 29012089 29407327 29973711 30180438 30777162 31984887
19477C1984887J706323K192920L539088N157997Q540741J3881656K3433716L3459560
$$ 31984887 33691210 35884130 39423218 44581215 53121956 67003612 90437328 123896888
19469A23896888K4734447M209678m752933m174492m154082n265861J706907J9218833
$$ 123896888 148631335 152841013 148088080 143913588 139759506 134493645 136200552 155419385
19461A55419385M4815609O3733219O2388995O6066363R2582013M7042329m0998178
$$ 155419385 200234994 263968213 326357208 392423571 485005584 532047913 491049735
19454D91049735p0461202o3050555n9273855p0765723o2695701l9472582j9813766
$$ 491049735 420588533 357537978 298264123 227498400 164802699 125330117 105516351
19447A05516351o636620K038450N382437k946448r856675j0752373r692530j0942669
$$ 105516351 98879731 100918181 106300618 103354170 93497495 82745122 73052592 62109923
19439F2109923j1921759r631150o610099m132319k817480k417337j799000j585396
$$ 62109923 50188164 40557014 33946915 29814596 26997116 24579779 22780779 21195383
19431B1195383j669734j762237j756308j343937j134124j173045j105650r68756
$$ 21195383 19525649 17763412 16007104 14663167 13529043 12355998 11250348 10281592
19423A0281592j162178n03401l36349l32781o27473n44470o80985m18814o33051
$$ 10281592 9119414 8616013 8279664 7946883 7319410 6774940 6093955 5675141 5042090
19414E042090m75293j85326j36879l08026l36523k99679j17561j62100n2296M8713
$$ 5042090 4566797 4381471 4244592 3936566 3600043 3300364 3182803 3020703 2968407 3017120
19404C017120L3044l12587l2391K2895o5447r7865m8580K7433j67124k722j16810
$$ 3017120 3050164 2737577 2705186 2728081 2662634 2564769 2516189 2543622 2376498 2373776 2256966
19393B256966k24363m7570O9081j44720j75096Q867J5623j51255K79004K72862
$$ 2256966 2032603 1985033 2054114 1909394 1734298 1743165 1758788 1607533 1886537 2159399
19383B159399o6670p0681j26333P56l6439l45870l23438l7260q5265j37761J0884
$$ 2159399 2092729 2022048 1895715 1896471 1860032 1514162 1190724 1153464 1068199 930438 941322
19372I41322K8386j42632j28271j18978n1835J39985j1850j2335l2391K8546j13216
$$ 941322 969708 827076 698805 579827 527992 667977 656127 643792 611401 639947 526731
19361E26731j14597J6145L1165J59729Q0668J4565R4764J19982J7880r0316q5109
$$ 526731 412134 428279 459444 619173 699841 714406 809170 929152 947032 856716 771607
19350G71607q8155j80168M1380J67432K23027J02904l10105j77505r1465P4509
$$ 771607 683452 503284 544664 712096 935123 1038027 727922 550417 458952 533461
19340E33461q2547N4275J3788o6017J72209Q327R1719L71610L48689k12125l34308
$$ 533461 450914 505189 518977 452960 625169 633496 725215 1096825 1445514 1233389 899081
19329H99081k55823L7079K64996J69955j65874J88285L72656k14692k54736j14149
$$ 899081 643258 680337 945333 1115288 949414 1137699 1510355 1295663 1040927 926778
19319I26778j45736j37904j7234R2252R405r5034k16470r4743j38845K22368O3559
$$ 926778 781042 643138 625904 718156 727561 632527 416057 321314 182469 404837 468396
19308D68396k97766j3789K41329K96669m804l66762k24026j56172K8047K1500
$$ 468396 170630 156841 398170 694839 690035 323273 99247 -56925 -28878 -7378
19298g378K08512J9093p3190j82283j54850j22143O5397K16859q1114q6405J21262
$$ -7378 201134 220227 147037 -35246 -190096 -312239 -246842 -29983 -111097 -197502 -76240
19287g6240j44219j9739L62142J11374n698J22676J7840R0296k0827j28633j331
$$ -76240 -220459 -240198 121944 233318 227620 350296 368136 458432 437605 308972 307641
19276C07641J17474k83855n3759K86629J24637K44506J8336k52955R4008N7307
$$ 307641 425115 141260 87501 374130 498767 743273 761609 508654 602662 659969
19266F59969J3768K02144o7436R3094k57086k68888l6584J33795l3258j19326
$$ 659969 673737 875881 808445 901539 644453 375565 338981 472776 439518 320192
19256C20192k7847n1360J47752m9976J9289K34589k0056Q7983J83738K15978K77985
$$ 320192 292345 240985 388737 338761 358050 592639 572583 660566 844304 1060282 1338267
19245A338267O466K71397K16148O308k58127j20486k24281k01525J74389N1982
$$ 1338267 1344733 1616130 1832278 1838586 1580459 1459973 1235692 1034167 1208556 1260538
19235A260538m6066L44562K57016M4174J51461j54784l55391m16077j8370l10039
$$ 1260538 1214472 1559034 1816050 1860224 2011685 1856901 1501510 1085433 1067063 757024
19225G57024k96244k092M0646M4163J10742j92920j89682K14668J68651K30600
$$ 757024 460780 458688 499334 543497 654239 461319 271637 486305 654956 885556
19215H85556k4060k45676l78411k16602o6053L15712J27549j86944r4286m8575
$$ 885556 861496 615820 237409 20807 -45246 270466 398015 211071 116785 68210
19205F8210j72933j52597J21004L4642M57480L03887N5236j55056j35117l0571
$$ 68210 -104723 -257320 -136316 -101674 355806 659693 714929 559873 424756 394185
19195C94185l3711K2389P7723J05906j00475o7776k2562j62953O834k01470P4316
$$ 394185 360474 382863 460586 566492 466017 398241 375679 212726 219560 18090 92406
19184I2406K76772K8794p367l0417R0748J23346o3681j84685K3827q2647j60456
$$ 92406 369178 397972 390605 360188 450936 574282 510601 325916 349743 267096 106640
19173A06640n5213R9373O7410k27973k67237J46068K66289p98p3818m4012Q9183
$$ 106640 51427 150800 218210 -9763 -277000 -130932 135357 134559 60741 16729 105912
19162A05912J75278J61400o0540J44355J94168j28669m8973j52088j5192J68791
$$ 105912 281190 442590 382050 526405 720573 591904 542931 390843 375651 544442
19152E44442l3080q393j41173k43068n2065n3249j97576k60833o7590J7210P3136
$$ 544442 511362 502969 361796 118728 66663 13414 -184162 -444995 -512585 -495375 -422239
19141d22239N3952l1982K26869J38533P0351L9728j5967j63756j24969J68877
$$ -422239 -368287 -400269 -173400 -34867 35484 75212 59245 -104511 -229480 -60603
19131f0603L68601J26359K1685k3408p8215j91549O1344J73604l2474n1457M0696
$$ -60603 307998 434357 456042 432634 354419 162870 224214 397818 365344 313887 354583
19120C54583R4275j02962J86123J67557r854r7347j81412R0901n629r331j23254
$$ 354583 448858 345896 532019 699576 689722 592375 410963 501864 496235 486904 363650
19109C63650o8870N697j2424k32234N2199J85598R8547K8376n9510J7040o8336
$$ 363650 294780 300477 288053 55819 108018 293616 392163 420539 361029 378069 309733
19098C09733j02779L3471J04643j07914O3968o3619j8577k42832j44556n734p7376
$$ 309733 206954 240425 345068 237154 301122 237503 218926 -23906 -168462 -174196 -251572
19087b51572P4756J22395J46930J03570L13886K43393r7883r2865K4091p6384
$$ -251572 -176816 -54421 92509 196079 509965 753358 655475 562610 586701 510317
19077E10317k79435o0693k4222p9508K2591j4356r2983Q3225Q9754K34388J31170
$$ 510317 230882 170189 145967 66459 89050 74694 -18289 64936 154690 389078 520248
19066E20248j34245m64519l6667J70669K19672R0998P4826Q5076q8879J50439
$$ 520248 386003 -78516 -115183 55486 275158 366156 440982 526058 437179 587618
19056E87618J39507q2843q8057j32200M9297p7066j72977K33172J13760N7388
$$ 587618 727125 644282 556225 424025 473322 396256 223279 456451 570211 627599
19046F27599M2661J99368J79419k25638r4694K17297J42780L8909J53482q4703
$$ 627599 670260 869628 1049047 823409 728715 946012 1088792 1127701 1281183 1196480
19036A196480k14810j12309J60480J69088k02936j42309R2862P5130J37138j31359
$$ 1196480 981670 869361 1029841 1198929 995993 853684 946546 1021676 1158814 1027455
19026A027455m8907j46779j07746M4891J44288O2583J9044K43473J13472j21285
$$ 1027455 978548 831769 724023 768914 913202 975785 994829 1238302 1351774 1230489
19016A230489N7914K75947O6545L8614K8419l5225K81812J97051O2712J38379
$$ 1230489 1288403 1564350 1630895 1669509 1697928 1662703 1944515 2141566 2204278 2342657
19006B342657p8069L8309P6242L17360J16448J14569p1496J74564R4337J15903
$$ 2342657 2264588 2302897 2379139 2696499 2812947 2927516 2856020 3030584 3124921 3240824
18996C240824J15911M7270N5187K0474K90217K30693L68765j88840n0052J99809
$$ 3240824 3356735 3404005 3459192 3479666 3769883 4000576 4369341 4180501 4130449 4330258
18986D330258N66707N64879P04963R74554J043811J283331J355855Q38735Q91465
$$ 4330258 4896965 5461844 6166807 7141361 8185172 9468503 10824358 11663093 12554558
18977A2554558R45817O54964P74435J083022J438784K151922L584098N640178
$$ 12554558 13500375 14155339 14929774 16012796 17451580 19603502 23187600 28827778
18969B8827778Q341205J2497680J5159068J0848534K923783j046394o46824M23139
$$ 28827778 37168983 49666663 64825731 75674265 78598048 77551654 76904830 77327969
18961G7327969J786598O305804J5457815L1272544N9396882R7131541J04361588
$$ 77327969 79114567 85420371 100878186 132150730 191547612 288679153 393040741
18954C93040741O0196212J8153498M153166j6337598n2126703p3130996o6868079
$$ 393040741 453236953 471390451 475543617 459206019 407079316 333948320 267080241
18947B67080241n1585912l8933172k5303271o408843J1363674J5983245M346575
$$ 267080241 215494329 176561157 151257886 144849043 156212717 172195962 176542537
18940A76542537q492600j3665606j6450136j9593303k0976747j8653688j4480268
$$ 176542537 168049937 154384331 137934195 118340892 97364145 78710457 64230189
18933F4230189j0411581o678385m142509k346592j259641o79648r43560q62713
$$ 64230189 53818608 47140223 42997714 40651122 39391481 38711833 37768273 36905560
18925C6905560r91475j124335j227484j415511j148944m49517M43421J339084
$$ 36905560 35914085 34789750 33562266 32146755 30997811 30548294 30991715 32330799
18917C2330799K616575M033009O622926J1126369J8550460K5820547K3980048
$$ 32330799 34947374 38980383 45603309 56729678 75280138 101100685 125080733
18910A25080733J0874641j132479m433042l724195k902640J998141J7159369L6529337
$$ 125080733 135955374 134822895 130389853 126665658 123763018 125761159 142920528 179449865
18902A79449865M4751771M2734164N1072984O3899468L6619320k0309010n1391479
$$ 179449865 224201636 266935800 318008784 381908252 418527572 398218562 346827083
18895C46827083n1763768m9774008n4348837n0917007l5974185k0398056r423628
$$ 346827083 295063315 245289307 190940470 140023463 104049278 83651222 74227594
18888G4227594n98200M618259K521285k767597n328331n572910p179788r343702
$$ 74227594 73629394 78247653 80768938 78001341 72673010 67100100 59920312 50576610
18880E0576610q701948o742950m876683m127005l090752j951323j446142j372446
$$ 50576610 41874662 35131712 30255029 26128024 23037272 21085949 19639807 18267361
18872A8267361j090025j236099j338921j586352j375522j111217j149038o49494
$$ 18267361 17177336 15941237 14602316 13015964 11640442 10529225 9380187 8730693
18864H730693n16853m57128j82387k08679n13350o25631m54315n72282m33546
$$ 8730693 8213840 7756712 7574325 7365646 6852296 6226665 5772350 5200068 4766522
18855D766522m31192j49082k49632j34202k50621j48943j94108k06766j46616
$$ 4766522 4335330 4186248 3936616 3802414 3551793 3402850 3208742 3001976 2855360
18846B855360j96726j56662o3846j65827M659J76253n0153k26429k77639j30667
$$ 2855360 2658634 2501972 2438126 2272299 2276958 2453211 2403058 2176629 1898990 1768323
18836A768323r8842j1793L67389N6645j32449j27035J46032j5439j95718k12101
$$ 1768323 1669481 1657688 2025077 2081722 1949273 1822238 1968270 1952831 1757113 1545012
18826A545012j18528n7144l07704k12020Q4870J49176P9737J21784n118l59450
$$ 1545012 1426484 1369340 1061636 849616 934486 1083662 1163399 1285183 1280065 920615
18816I20615Q5975R9278o8011n9814R7769P2980q3065J54417r5362j78246J2332
$$ 920615 1006590 1105868 1037857 978043 1075812 1148792 1065727 1220144 1124782 946536 958868
18805I58868J05805k8703M5113k5241m0043j37654j63295K2369R9014N5678k32795
$$ 958868 1064673 1035970 1081083 1055842 1015799 878145 714850 737219 836233 891911 659116
18794F59116m12227l6441j10027K26200M4252L0467K56754J53385k3057j68687
$$ 659116 246889 210448 100421 326621 370873 401340 658094 811479 788422 619735
18784F19735j89304j12343n7787K5310L87051K14428j39823J55848M1542r8555
$$ 619735 430431 318088 260301 285611 672662 887090 747267 903115 944657 846102
18774H46102k22063J19288R6350M551o3079M064L81069N77223N19734R14595N17040
$$ 846102 624039 743327 839677 844228 781149 785213 1166282 1743505 2263239 3177834 3694874
18763C694874j64793m25823l53147m01913m85680k99776j71383p6949l23583r6156
$$ 3694874 3530081 3104258 2751111 2349198 1863518 1563742 1392359 1315410 991827 895671
18753H95671M5121k6728j31048q5151k6870K98769O2703k95319L6511N5339n6085
$$ 895671 940792 914064 783016 697865 670995 969764 1032467 737148 773659 828998 772913
18742G72913j13563j09727M1940K52067q9897n4208K61140m2013m4842O1174m9716
$$ 772913 659350 549623 591563 843630 753733 699525 960665 918652 873810 934984 885268
18731H85268j17371M0000K5195j39944P4488k09088j55640j09971j96631L6212
$$ 885268 767897 807897 833092 693148 767636 558548 402908 292937 96306 132518
18721A32518K5531K2383L48861K08736j45588k78477r457O4904R5484J48985J50966
$$ 132518 158049 180432 529293 738029 592441 313964 304507 369411 464895 613880 764846
18710G64846P4665Q1782o5162J4108l7349k79159k35784J55014l058J06320l3349
$$ 764846 839511 921293 856131 870239 832890 553731 317947 472961 469903 576223 542874
18699E42874J67801j53609k44724j13129Q1699R5296j45790p2268K52984k1578
$$ 542874 710675 557066 312342 199213 280912 376208 230418 158150 411134 389556
18689C89556j98842k27469N2573K4936J91155K41363M0714o5306Q6146N873l4657
$$ 389556 190714 -36755 15818 40754 231909 473272 513986 448680 534826 540699 506042
18678E06042l7316n7419J31195l7865k26885r3508O6984K28822J46728r8232j1959
$$ 506042 468726 411307 542502 504637 277752 184244 251228 480050 626778 528546 516587
18667E16587O097m1735j04806J44981K23120L27288J97975m6719q6503M9248L37542
$$ 516587 522684 480949 376143 521124 744244 1071532 1269507 1222788 1136285 1185533 1523075
18656A523075J42450j19647k61044j89540J04355K11881J17612L10307K48779
$$ 1523075 1665525 1545878 1284834 1095294 1199649 1411530 1529142 1839449 2088228
18647B088228J34J8738L17265J38811o931M2872K53434N40764L51536n2174J18476
$$ 2088228 2088362 2107100 2424365 2563176 2556245 2599117 2852551 3393315 3744851 3692677 3811153
18636C811153j0179q098J01288M38350N26715J88345M02200O55265L97647J46058
$$ 3811153 3800974 3792876 3894164 4332514 4859229 5047574 5449774 6105039 6502686 6648744
18626F648744N51416Q58999N60340M89121O65339R98050R30365J126357J502760
$$ 6648744 7200160 8059159 8619499 9108620 9773959 10772009 11702374 12828731 14331491
18617A4331491J971918K295464K743882L568852M956505P472022J1642869J9918051
$$ 14331491 16303409 18598873 21342755 24911607 29868112 37340134 48983003 68901054
18609F8901054L4664301M8248171M1744177J9509150J0986230K2753594K6619971
$$ 68901054 103565355 151813526 193557703 213066853 224053083 246806677 273426648
18602B73426648K130361k4609254k7592142j5315536j621358J3100957K0264340
$$ 273426648 275557009 250947755 223355613 208040077 206418719 219519676 239784016
18595B39784016Q563602j859694P011916J9801259O988396k4319913m0117048
$$ 239784016 248347618 246487924 253499840 273301099 280289495 255969582 215852534
18588B15852534l5990118l1072918l2132776l0581052k3228288j4611375q897947
$$ 215852534 179862416 148789498 116656722 86075670 62847382 48236007 39338060
18581C9338060n739741l978596l248627k699692k444895k205976j648781j184921
$$ 39338060 33598319 29619723 26371096 23671404 21226509 19020533 17371752 16186831
18573A6186831j010356r54596j282878j017492o01553p49878r44299p72613l06524
$$ 16186831 15176475 14221879 12939001 11921509 11319956 10570078 9625779 8853166 8546642
18564H546642m93780q04444o66061l00023m6840j73088l98983p42834l40025j61556
$$ 8546642 8052862 7248418 6582357 6282334 6235494 6062406 5663423 4920589 4580564 4419008
18554D419008l3563J23614j66742l10334j01419J78712j42063l08485l74137l60960
$$ 4419008 4385445 4509059 4342317 4031983 3930564 4109276 3967213 3658728 3284591 2923631
18544B923631k91448j75078l11640k86387k37732m7100j81462l57130J4590j55836
$$ 2923631 2632183 2457105 2145465 1859078 1621346 1574246 1392784 1035654 1050244 894408
18534H94408l8263J15781J76979j74374n30284k35947J67354K90396J35527k88100
$$ 894408 856145 971926 1148905 974531 444247 208300 375654 666050 801577 513477
18524E13477J91025J24243k05795O7345k8808j22722j28783m3318O7j55147o7443
$$ 513477 704502 828745 622950 690295 661487 538765 409982 366664 366731 211584 144141
18513A44141K8359k9977j60848K07304O0674k85360p5585o1666O5757Q9299M428
$$ 144141 172500 142523 -18325 188979 249653 -35707 -111292 -172958 -107201 -17902 -13474
18502a3474J58358O1876j11352J02265P9075O5695o5813l71521k93614j14491
$$ -13474 144884 206760 95408 197673 276748 342443 276630 -94891 -388505 -502996
18492e02996J58050J27313K61666M64436N3194j27051j86371Q9980N7264M3597
$$ -502996 -344946 -217633 44033 508469 561663 434612 248241 338221 395485 439082
18482D39082j1498l7491j91568j80110J73876J89060q4971k273J62222J68128
$$ 439082 427584 390093 198525 18415 192291 381351 296380 294107 456329 624457
18472F24457N2993Q594p2413j46041j03078j51673M6971J02198j33062n0154j25351
$$ 624457 677450 686044 613631 467590 364512 212839 259810 362008 228946 178792 53441
18461E3441J45334K34m1661N187j52508R1765J69783j9401k22645q3813L87761
$$ 53441 198775 199009 157348 162535 10027 101792 271575 252174 29529 -54284 333477
18450C33477K20860K6040m6826P2537R8065j26986k10853j7916L91001N06294
$$ 333477 554337 580377 533551 606088 704153 577167 366314 348398 739399 1245693
18440A245693L39832P0328l27978j83730L47140K01459j02863j22211K50769L72465
$$ 1245693 1585525 1655853 1327875 1144145 1491285 1692744 1589881 1467670 1718439 2090904
18430B090904K7139k28787j15721l53686k14389k42113j54904j75295j88856j30647
$$ 2090904 2118043 1889256 1773535 1419849 1205460 963347 808443 633148 444292 313645
18420C13645K362K67675K34382J47382J29563J98372Q9433k22371m02274l25882
$$ 313645 316007 583682 818064 965446 1095009 1293381 1382814 1160443 758169 432287
18410D32287o374R1286j10152p5615M3785J50103j6947j07051j85331J16413k4737
$$ 432287 425913 517199 407047 331432 375217 525320 508373 401322 215991 332404 307667
18399C07667M0470j15274j13247K1470J54495J21743p6315m4687K23557P7062
$$ 307667 348137 232863 119616 141086 295581 417324 341009 296322 519879 596941
18389E96941P1532J29862K54115L51088K94525n8747k53941j27428o063j82520
$$ 596941 668473 798335 1052450 1403538 1698063 1639316 1385375 1257947 1251884 1069364
18379A069364J05545j88137j43462j66282K10400J4361J13249M11737L21153k1281
$$ 1069364 1174909 986772 843310 677028 887428 901789 1015038 1426775 1747928 1726647
18369A726647k90883k73159k75376k23863o6951l25744k36171N7991R7430J76795
$$ 1726647 1435764 1162605 887229 663366 596415 270671 34500 92491 189921 366716
18359C66716L6320L1969k1987j05638O9759m5955J64917J0817j33781j66757j14055
$$ 366716 403036 435005 413018 307380 377139 331184 496101 506918 373137 206380 92325
18348I2325j34527M8806J02686L9262n0378M0762J06967p3151L7538m3359K56073
$$ 92325 -42202 6604 109290 148552 98174 138936 245903 172752 210290 166931 423004
18337D23004n7709j81939m3711m4762P0255j70178k02800O0690M2872j20102m7579
$$ 423004 365295 183356 139645 94883 165138 -5040 -207840 -147150 -104278 -224380 -271959
18326b71959J71163N6325n8942J13095J20063J22941j49127J24625J12267r2153
$$ -271959 -100796 -44471 -103413 9682 129745 252686 103559 228184 340451 248298
18316B48298P849J5395n5644j43891O2886r332k65567k258J53710J85769L1184
$$ 248298 256147 271542 215898 72007 134893 125561 -140006 -142264 11446 197215 228399
18305B28399N5125j67875j97714J88791L18813J3881k44853j20143l95851k50848
$$ 228399 283524 115649 -82065 106726 425539 439420 194567 74424 -321427 -572275
18295e72275m9003J00182O8107N153J01965K39901J6223L2834q5978k18605k2159
$$ -572275 -621278 -521096 -452989 -447836 -345871 -105970 -89747 -56913 -142891 -361496 -383655
18284c83655J04912J52440K53110K22972J07837J26965j05098q5202k6637k4996
$$ -383655 -278743 -126303 126807 349779 457616 584581 479483 394281 367644 342648
18274C42648P8165j82783k7218M2596j67426j71272r1812K9835J00558Q6416j2597
$$ 342648 420813 238030 210812 253408 85982 -85290 -177102 -147267 -46709 39707 27110
18263B7110K0369k1046l06377p0715K43329o0294k89792M7272J15218K35137K24007
$$ 27110 47479 26433 -279944 -350659 -107330 -167624 -457416 -410144 -294926 -59789 164218
18252A64218j0517r4133l2205O318j26571j2410J86220p5793n7899l8103J99531
$$ 164218 153701 59568 27363 33681 -92890 -105300 80920 5127 -52772 -90875 108656
18241A08656Q947k3931K01633J92861q5254l28964q6581K37083J3030k02233o3536
$$ 108656 117603 93672 295305 488166 402912 73948 -12633 224450 237480 35247 -28289
18230b8289K4991J62792j70947N6395L1861m7057J9987j48166p1627J0537J42956
$$ -28289 -3298 159494 -11453 44942 76803 29746 49733 -98433 -170060 -159523 -16567
18219a6567J31537K08380R4245k25543k05565l8718O6534n1672o6303L0689O0922
$$ -16567 114970 323350 417595 192052 -13513 -52231 14303 -37369 -103672 -72983 -12061
18208a2061J14379n3743j99081Q7602P341L8227J03243o338K13873L7258j03222
$$ -12061 102318 48575 -150506 -62904 -55563 -17336 85907 79569 293442 330700 227478
18197B27478L1066K07940Q423k88848L2854L4481j78323k48377k7084K77259Q0214
$$ 227478 258544 466484 474907 186059 218913 253394 75071 -173306 -200390 76869 157083
18186A57083K3683J36744J70951j30365j99099r5836L8010j67791J16774J71695
$$ 157083 180766 317510 488461 358096 158997 63161 101171 -66620 50154 221849
18176B21849q2360k6679M3752j77207R5381K04392Q8269n8624m2438m0130N6683
$$ 221849 139489 112810 156562 -20645 74736 279128 367397 308773 266335 226205 282888
18165B82888j2406K0615J43735q3022q624L86072J10319p4443q7132j4885J06201
$$ 282888 270482 291097 434832 351810 343186 729258 839577 765134 678002 663117 769318
18154G69318j99517q2854r3402J27058j7573N3578R5935K26777n681o8551J56072
$$ 769318 569801 486947 393545 520603 503030 556608 652543 879320 873639 805088 961160
18143I61160M1058J12960L31101r3692j07872j86633K17123K83644q8192O4535
$$ 961160 1002218 1115178 1446279 1352587 1244715 1058082 1275205 1558849 1470657 1535192
18133A535192M08104J60371L71612M59757L89833K46542J85515L25563L24025
$$ 1535192 1943296 2103667 2475279 2935036 3324869 3571411 3756926 4082489 4406514
18124D406514L64781O04458O94043J070099J049176J101619J846859K194065K094020
$$ 4406514 4771295 5375753 6069796 7139895 8189071 9290690 11137549 13331614 15425634
18115A5425634L255581M172736N142623P198705J1009669J7693149L1975045O5053652
$$ 15425634 18681215 22853951 27996574 35195279 46204948 63898097 95873142 160926794
18107A60926794J31885994J21244835j2947065n2531790m2792126l5766579o6587418
$$ 160926794 292812788 414057623 401110558 348578768 305786642 270020063 203432645
18100B03432645p2317430m7993545k5420881j3892051q420045o036641m340351
$$ 203432645 131115215 83121670 57700789 43808738 35388693 29352052 25011701
18093B5011701k907846k369639k179223k219801j575493j158019j183920q45644
$$ 25011701 22103855 19734216 17554993 15335192 13759699 12601680 11417760 10572116
18085A0572116n06096p42413q91159o87233o18107l29853l44780m22602m63367
$$ 10572116 10066020 9323607 8432448 7745215 7127108 6797255 6452475 6029873 5566506
18076E566506l09582j97576j79261m34248k37620k56394o75629j72040k79097
$$ 5566506 5256924 5059348 4880087 4445839 4208219 3951825 3276196 3104156 2825059
18067B825059m34070o3629j17821M1759J05638K7022J81442K18978j6824k41745
$$ 2825059 2390989 2327360 2209539 2251298 2356936 2383958 2565400 2784378 2767554 2525809
18057B525809Q9819N5012N3678k67793l08160r12l0889l71048n12357k75621j01024
$$ 2525809 2615628 2670640 2724318 2456525 2148365 2147453 2116564 1745516 1233159 957538 856514
18046H56514o0126k30323O7399J07925Q9314n92j51172k32593j83622M2735j48320
$$ 856514 796388 566065 633464 741389 830703 830111 678939 446346 262724 305459 157139
18035A57139n9599j4275M2836j29771M56598L00284j24805j78288j09452l24282
$$ 157139 97540 83265 126101 -3670 452928 753212 628407 450119 340667 16385
18025A6385k52753r5520k8984J78591J47516L11791K22735j35174k03029j91244
$$ 16385 -236368 -331888 -360872 -182281 -34765 277026 499761 364587 161558 -29686
18015b9686j63450J34000P7241k4942k8582k7399K4752n5673J41148l1700k45745
$$ -29686 -193136 -59136 18105 -6837 -35419 -62818 -38066 -93739 47409 15709 -230036
18004b30036p0928K40887L01628o8237j14487K58528J05471j26990j10348n3746
$$ -230036 -300964 -60077 241551 173314 58827 317355 422826 295836 185488 131742
17994A31742J54931K22245j29419k54953J61431J08689j65911k2886j17518j19241
$$ 131742 286673 508918 379499 124546 285977 394666 228755 205869 88351 -30890
17984c0890O8548n4092j01028J27308K73159q7533j34117K1952R2879j87579J11139
$$ -30890 37658 -16434 -117462 9846 283005 195472 61355 83307 176186 -11393 99746
17973I9746J30424J29619r2342p4086j10136j24534K9041J70177J22203q9034
$$ 99746 230170 359789 267447 193361 83225 -41309 -12268 157909 280112 191078
17963A91078M0545K3478L4274L43224L37781L59758J03136J32030J41997q257
$$ 191078 231623 255101 289375 632599 970380 1330138 1433274 1565304 1707301 1699044
17953A699044j94150m33196k5096j9341J46792J43961m422R2060K13823K01569
$$ 1699044 1504894 1071698 1046602 1027261 1174053 1318014 1313592 1405652 1619475 1821044
17943A821044P8745j75704l81794l28925j40104j94582j81326k03229J7942o6085
$$ 1821044 1899789 1724085 1342291 1013366 873262 678680 497354 294125 312067 245982
17933B45982l8275m7107k2981j06087j99297L7791K22164j98677J2862J83959
$$ 245982 207707 160600 137619 31532 -167765 -129974 92190 -106487 -93625 90334
17923I0334o149K267o6955K59071Q3257K6123K21774J77109j16690L5579K4563
$$ 90334 84185 86452 19497 278568 361825 387948 609722 786831 670141 705720 730283
17912G30283k78774k26419Q0810J4706L0719j05870q4274r4906L4476j2420l1782
$$ 730283 451509 225090 305900 320606 351325 245455 161181 66275 100751 88331 56549
17901E6549N8398J61154j9537J25365n4286j30704j65671r5011j52246j35422
$$ 56549 114947 276101 256564 381929 327643 196939 31268 -63743 -215989 -351411
17891c51411q7063K61979Q1547J73680k6972J5267J17845K6970k49676N3503N4728
$$ -351411 -438474 -176495 -94948 78732 51760 67027 184872 211842 -37834 15669 70397
17880G0397P7278n5299j78889R5929J5200p0185J0288P7797j52147M7925r0747
$$ 70397 147675 92376 -86513 9416 24616 -45569 -35281 42516 -109631 -61706 -152453
17869a52453j55420M3292J45213J17935j7483k33893l71307J51362L47072O2631
$$ -152453 -307873 -264581 -119368 -1433 -18916 -252809 -624116 -472754 -125682 -63051
17859f3051J916K06115Q3712k19511n2564q6604L11080p4427j86400J8409o6425
$$ -63051 -61135 144980 228692 9181 -43383 -129987 181093 106666 -79734 -61325 -127750
17848a27750j49607k05175j76934J42191K13510j11863J78674J80125k13366J46804
$$ -127750 -277357 -482532 -659466 -517275 -303765 -415628 -236954 -56829 -270195 -123391
17838a23391J88761M5391J73246J56464k7032j45952j10793k17134j08876r4854
$$ -123391 65370 110761 284007 440471 413439 267487 156694 -60440 -169316 -264170
17828b64170q6335J55886J26536L1993j16279m04359j80540J62593K83383Q9173
$$ -264170 -350505 -194619 -68083 -36090 -152369 -556728 -737268 -574675 -291292 -202119
17818b02119q769k19852l04263K53534N06884K14869J5748n3787o7534k8613j93709
$$ -202119 -210888 -430740 -735003 -481469 25415 240284 256032 202245 134711 106098 -87611
17807h7611k13394O022K29682R490k6548j92802J6772J84513O0001k2180j2239
$$ -87611 -301005 -294983 -65301 -55811 -82359 -275161 -258389 -73876 -13875 -36055 -48294
17796d8294q454K62373k7127o3872l72528N9926O4306J32538R0059j83031j5721
$$ -48294 -56748 205625 178498 114626 -257902 -197976 -133670 -1132 88927 -94104 -109825
17785a09825K63278J46013J16057j55763j0169p8047J20380J8695j02190n075
$$ -109825 153453 299466 415523 259760 249591 171544 291924 310619 208429 203354
17775B03354j84803j25929o4954j08409J2649K32360P2631j3784L1912N4934J11368
$$ 203354 18551 -107378 -172332 -280741 -268092 -35732 36899 23115 55027 109961 221329
17764B21329m6826J46910j09176k42732N3058J83456o2385N2009m8701j11679
$$ 221329 174503 321413 212237 -30495 22563 206019 143634 195643 146942 35263
17754C5263k1690r4391j9460K5488K5256j69792o6430K70140J89855j07557p1724
$$ 35263 13573 -80818 -100278 -74790 -49534 -219326 -285756 -15616 174239 66682 -5042
17743e042k77273r6301K06353M0583N2125N3434Q778K55350J39967j55048J52138
$$ -5042 -282315 -378616 -172263 -131680 -79555 -26121 -17343 238007 377974 222926 375064
17732C75064K693m475J12767j05161j82997k04651Q4214p5791j46601j30095j25297
$$ 375064 377757 373282 486049 380888 197891 -6760 77454 1663 -144938 -275033 -400330
17721d00330J1160l8105K31493J75250K33216j29947r3862J18772J75711K392
$$ -400330 -389170 -427275 -195782 -20532 212684 82737 -11125 107647 283358 285750
17711B85750j04961Q1864R8159K3855j0385K5559l9886j15033k90556k02620j26553
$$ 285750 180789 262653 360812 384667 374282 399841 359955 244922 -45634 -248254 -374807
17700c74807k5779l3602j27484l2178J06369K09130r2729J5044L824J02312K05402
$$ -374807 -400586 -434188 -561672 -593850 -487481 -278351 -371080 -356036 -352212 -249900 -44498
17689d4498J50221J97454k35245j86900J23597l3842O2404J30421k23813o6018
$$ -44498 105723 303177 67932 -118968 4629 -29213 33191 163612 -60201 -126219
17679a26219M0259O9614r3937N5779J19406j16208Q8683J45605n0131J37569J99773
$$ -126219 -85960 -16346 -110283 -54504 64902 -51306 37377 182982 132851 270420 470193
17668D70193p4958J4165l558Q0126j46970m26358j08173J78249J50175M8979j4586
$$ 470193 395235 409400 405842 485968 338998 -87360 -195533 -17284 132891 181870 167284
17657A67284j7641M1150k0739j32145R4075j05612q2488j3557K11965j7333j87687
$$ 167284 149643 190793 170054 37909 131984 26372 -56116 -69673 142292 124959 -62728
17646f2728r8496p2982J70098J23474o4883K29732P5419j12K56813p6889j3254
$$ -62728 -161224 -234206 -64108 59366 -5517 224215 299634 299522 556335 479446 466192
17635D66192j88889j76295j92863j61469J16537J08801q6109k15667j87408O5613
$$ 466192 277303 101008 -91855 -253324 -136787 -27986 -114095 -329762 -517170 -451557
17625d51557k24151L29272K90843K49114j3910m5226N99J66640J53781P1572j17031
$$ -451557 -675708 -346436 -55593 193521 179611 134385 134984 301624 455405 526977 409946
17614D09946l66397j43708Q8861M7701M784l36105k8454J91487L51645K7867N232
$$ 409946 43549 -100159 -11298 36403 41187 -294918 -323372 -131885 219760 247627 252859
17603B52859M2015J80548Q3862k12102l6660m9956k95419J11748J64570J23735
$$ 252859 294874 475422 559284 347182 310522 260566 -34853 76895 241465 365200
17593C65200p4796R1239K81324J28444l8003j33655J90573J77767m5047j72167
$$ 365200 290404 381643 662967 791411 753408 619753 810326 988093 943046 770879
17583G70879k02133L3060K16494l8377k62181P2875R6107J352J91462R091N0319
$$ 770879 568746 601806 818300 779923 517742 590617 686724 688076 879538 888629 938948
17572I38948J37057P0298N7640J6656Q223N6582J12562N02345L97214L65046J42960
$$ 938948 1076005 1146303 1203943 1220599 1228822 1285404 1397966 1900311 2297525 2662571 2805531
17561B805531L13285N68296M76275K91188L13901L68834M17197N65264J055089
$$ 2805531 3118816 3687112 4163387 4454575 4768476 5137310 5554507 6119771 7174860
17552G174860N51087j48149j7704K64062K21896J27413M35220Q25137J264441
$$ 7174860 7725947 7577798 7560094 7824156 8046052 8173465 8608685 9433822 10698263
17543A0698263J374979K071050L192704L914072M818878O430920R587365J5991706
$$ 10698263 12073242 14144292 17336996 21251068 26069946 32500866 42088231 58079937
17535E8079937K7490980M3920751M7023761K5784178Q414054J4423893K5804731
$$ 58079937 85570917 129491668 176515429 202299607 210713661 225137554 250942285
17528B50942285J1084737k2415775l6951490l2188876k7408396k9202187k8000201
$$ 250942285 262027022 239611247 202659757 170470881 143062485 113860298 85860097
17521H5860097j9930884j1566061n757179j896987P72339L901325Q040213J5091507
$$ 85860097 65929213 54363152 48605973 46708986 47481325 51382650 59422863 74514370
17513G4514370K8721832M7804774N1309460K7489749P979094J3387618K5760140
$$ 74514370 103236202 151040976 202350436 229840185 237819279 251206897 276967037
17506B76967037Q971001k7009398m1779163l5935482l0904146l2669281l1370662
$$ 276967037 285938038 258928640 217149477 181213995 150309849 117640568 86269906
17499H6269906k3264987j4287502q666081n845623m434296l437482k433218j660511
$$ 86269906 63004919 48717417 40051336 34205713 29771417 26333935 23900717 22240206
17491B2240206j115829k52970Q08014J266826j61162j298468j736712j636185
$$ 22240206 21124377 20871407 21679421 22946247 22785085 21486617 19749905 18113720
17483A8113720j810058k117956j829115j320313n50506m58619m16917l66875n34364
$$ 18113720 16303662 14185706 12356591 11036278 10485772 10027153 9610236 9243361 8708997
17474H708997m94974o85104q82981o79896n64226n00419k89519m17726n85588
$$ 8708997 8214023 7528919 6645938 5966042 5401816 4901397 4611878 4194152 3608564
17465C608564l87062k23634k35493j32484m5084K13747k2290r9346q235j30252
$$ 3608564 3221502 2997868 2762375 2629891 2584807 2798554 2776264 2676918 2668683 2538431
17455B538431j6017j07407j80344N8203j80664k32824m2343l68736j1913M32408
$$ 2538431 2522414 2415007 2234663 2292866 2112202 1879378 1837035 1468299 1456386 1888794
17445A888794L32537L75911R7378J86721N07821P60182j92058l69833m25381l49515
$$ 1888794 2221331 2597242 2694620 2881341 3389162 4149344 3957286 3587453 3162072 2812557
17435B812557l81718l42006m46814k79066l01058j35351j0126P4001J20129L3751
$$ 2812557 2430839 2088833 1642019 1362953 1061895 926544 916418 990419 1110548 1144299
17425A144299K9738J95662K66097j24980j02554L7249M4379R0056l3579M5738
$$ 1144299 1174037 1369699 1635796 1510816 1408262 1445511 1489890 1579946 1546367 1592105
17415A592105Q7986j2858k06279j09914m9509p1289n7626O3806J61422N2373O2895
$$ 1592105 1680091 1667233 1460954 1351040 1301531 1230242 1172616 1236422 1397844 1450217 1513112
17404A513112j14582R236r9020r0517j23700N0411J20346J94637K25817K84230
$$ 1513112 1398530 1407766 1308746 1218229 1094529 1144940 1265286 1459923 1685740 1969970
17394A969970P36564O50518J499506K832720K950482K74464p77509p73097r58870
$$ 1969970 2706534 3357052 4856558 7689278 10639760 10914224 10136715 9363618 8404748
17385H404748j671852k158704j322385m63361k40188m16051j15298j82253Q3050
$$ 8404748 6732896 4574192 3251807 2788446 2548258 2132207 2016909 1834656 1917706
17376A917706k56273p8553K24684M18356K31772M02978R37270J906962K063526
$$ 1917706 1661433 1582880 1807564 2225920 2457692 2860670 3797940 5704902 7768428
17367G768428J19894o14734o26416r23042j111597j256545j082366n22419k69650
$$ 7768428 7888322 7273588 6647172 5724130 4612533 3355988 2273622 1751203 1481553
17358A481553k31650m8380l1052k41082j33179K2624l744k01894k04086J2575
$$ 1481553 1249903 1201523 1170471 929389 796210 818834 815090 613196 409110 421685
17348D21685M3280r0771J07028J33769K59498O058N3931P9887p5181j72258m7498
$$ 421685 464965 374194 481222 614991 874489 880547 934478 1014365 939184 766926 719428
17337G19428p1498L5654q4552k04882k49310q5232j5231n9506J47393J34446R6465
$$ 719428 647930 683584 599032 394150 144840 59608 44377 -15129 132264 266710 363175
17326C63175R2643J5929j470J21896J63886J37280j48434j81109l5062q4577j13176
$$ 363175 455818 471747 470277 592173 756059 893339 744905 563796 528734 444157 330981
17315C30981o2088J84558j65142j22581k50647P8400K93263J52384P1371O7358
$$ 330981 268893 453451 288309 165728 -84919 -6519 286744 439128 510499 577857
17305E77857j8736p4393o6061j52169k3403J43467k66865k06487j14643m3168
$$ 577857 559121 484728 418667 266498 243095 386562 119697 -86790 -201433 -244601
17295b44601J33860J04667N003P5322O6483J08139k44698j19878M3774M2224O0679
$$ -244601 -110741 -6074 -1071 74251 140734 248873 4175 -115703 -71929 -29705 30974
17284C0974J11682l73681m6930J40898K29264J17371l55338k16665Q3496K01150
$$ 30974 142656 -231025 -277955 -137057 92207 209578 -145760 -362425 -278929 -77779
17274g7779K7994K6794k00031j56055K43600N2356l49287k1249K49897J46546
$$ -77779 -49785 -22991 -223022 -379077 -135477 -83121 -432408 -453657 -203760 -57214
17264e7214j15804J70750K73708r3615j35269O6997Q8469J43749l2441k72166
$$ -57214 -173018 -2268 271440 177825 42556 109553 198022 341771 309330 37164
17254C7164j82537L10543J44134j30980L22281J3353j16680o486N0636o4556j31721
$$ 37164 -145373 165170 309304 178324 500605 513958 397278 390792 441428 376872 245151
17243B45151m4352N9906J46713j47212J4064J61754j26947K41362P9024k37758
$$ 245151 200799 260705 407418 260206 274270 436024 309077 550439 629463 391705
17233C91705R3514K90614n4143j95752j33689q3185l36556j40211Q7688K60616
$$ 391705 485219 775833 721690 525938 392249 309064 -27492 -167703 -80015 180601
17223A80601L23134q9223k3846P7661j35799J466o0640n1481O6400J49863k96545
$$ 180601 503735 414512 390666 468327 332528 333994 273354 221873 288273 438136 141591
17212A41591M607l0189M1807j22530n3304J78612J7418k99691r0325P2212L06775
$$ 141591 146198 116009 157816 35286 -18018 160594 178012 -121679 -212004 -139792 166983
17201A66983K41999K5568r9194L1049n8416k92884l7611L69577l796j25623k76339
$$ 166983 408982 434550 335356 366405 307989 15105 -22506 347071 343275 217652 -58687
17190e8687k69399n2739J62117l900l9181r8448o4142J5488L2703q1172j70581
$$ -58687 -328086 -380825 -218708 -222608 -261789 -360237 -424379 -408891 -376188 -457360 -627941
17179f27941l12618j48811J89183J48278J94053p856p1429j1020K2501J28634
$$ -627941 -940559 -1089370 -900187 -751909 -557856 -565712 -637141 -648161 -625660 -497026
17169d97026K150k0084J00681K26183j86199l2199Q9561K91585J70938k33078
$$ -497026 -494876 -514960 -414279 -188096 -374295 -406494 -316933 -25348 145590 -87488
17159h7488k94348l5974j46819P3368Q7252m7901m2731J35283J51814q0786r177
$$ -87488 -381836 -417810 -564629 -491261 -404009 -451910 -494641 -359358 -207544 -288330 -297507
17148b97507j74065N2845J97299m1951J05882O1327o263K41105M7452k30816L2909
$$ -297507 -471572 -418727 -221428 -263379 -157497 -96170 -102433 138672 186124 -44692 -11783
17137a1783J33904J33002m3179N1187K75799l02402j83955l6317p8075J50813
$$ -11783 122121 255123 211944 263131 538930 236528 52573 16256 -61819 88994
17127H8994K15088J50358m12997k46312M0582p3550m1654J1776j49454K220J56569
$$ 88994 304082 454440 41443 -204869 -164287 -237837 -279491 -267715 -417169 -414949 -258380
17116b58380P4028l6371Q4990R6966J44648j20301k46148K5117L9879N8649L29535
$$ -258380 -184352 -220723 -135733 -38767 105881 -14420 -260568 -235451 -195572 -136923 192612
17105A92612J45735O490J66212J2297j23977j37833j3052k28120m1424m9492K11815
$$ 192612 338347 344837 511049 523346 399369 261536 248484 20364 -21060 -70552 141263
17094A41263J33674J12662p365J3548n7686j57878k1327k32718K06254P9024N8346
$$ 141263 274937 387599 380234 393782 336096 178218 156891 -75827 130427 209451 267797
17083B67797K6049M2135P9238l9534j78680k6741n7220J54790O5807k1342l46013
$$ 267797 293846 335981 415219 375685 197005 170264 113044 267834 333641 312299 -33714
17072c3714P9690J98550L4325K09374m3806k18257j27844m6839J08350L9723p2553
$$ -33714 45976 244526 278851 488225 444419 226162 98318 51479 159829 199552 126999
17061A26999j47231j1464P0163K02802k54072j72456M71493J35276o8728J04899
$$ 126999 -20232 -31696 38467 241269 -12803 -185259 286234 421510 352782 457681
17051D57681l3176q9198Q6843K0426J04524J25110j87708j08813J62902Q5615
$$ 457681 424505 335307 422150 442576 547100 672210 484502 375689 538591 624206
17041F24206J9031L11041P9526k247k7740j77987L35431J44767K64651K96533
$$ 624206 643237 954278 1033804 1031557 1003817 825830 1161261 1306028 1570679 1867212
17031A867212K30518J51936J34277J38559q1113K18172J19179K65532K69997M66198
$$ 1867212 2097730 2249666 2383943 2522502 2441389 2659561 2778740 3044272 3314269 3780467
17021C780467N64590O62903J79044Q2477K07651K65663N06600M83468Q59897J053605
$$ 3780467 4345057 5007960 5187004 5269481 5477132 5742795 6249395 6732863 7592760 8646365
17011H646365J590151J614016J911863J955598K215541L330962N403741Q627937
$$ 8646365 10236516 11850532 13762395 15717993 17933534 21264496 26668237 35296174
17003C5296174J4615067K8332277N3729587N4344199M906360j7071146j7014405
$$ 35296174 49911241 78243518 131973105 186317304 191223664 174152518 157138113
16996A57138113j4099238k3806298k6234851j5217147j167261J3705214L6273094
$$ 157138113 143038875 119232577 92997726 77780579 76613318 90318532 126591626
16989A26591626N5808680K2126096j3971557k0062166j5192292j9317952k6718135
$$ 126591626 182400306 204526402 190554845 170492679 155300387 135982435 109264300
16982A09264300j9369776k958078J7280491M3513461M4105849K40276j8647596
$$ 109264300 89894524 86936446 104216937 147730398 191836247 192076523 173428927
16975A73428927j7506227j4653624k3277725k4861004j4478895j521253J2010721
$$ 173428927 155922700 141269076 117991351 93130347 78651452 77130199 89140920
16968H9140920L2361388N0785384J7940583j5798869k0807360j5946017k1620187
$$ 89140920 121502308 172287692 190228275 174429406 153622046 137676029 116055842
16961A16055842l0677346k6240638j6278938r180224n726973m076164l140331
$$ 116055842 85378496 59137858 42858920 33678696 27951723 23875559 20735228
16954B0735228j979254j607189j681138j619007j341689r61363j167277r54216
$$ 20735228 18755974 17148785 15467647 13848640 12506951 11545588 10378311 9424095
16946I424095k87712J42689j36216l44995n36519o13765r07570o75275j77495
$$ 9424095 9136383 9279072 9142856 8797861 8261342 7647577 6740007 6064732 5887237
16937E887237l73904n23581k21396k8322m205q0944k65803k15708n1327m12943
$$ 5887237 5513333 4989752 4768356 4740034 4735829 4654885 4389082 4173374 4122047 3709104
16927C709104l80291m82179k04736l59281k48171r6335P5607O5844l86006j66990
$$ 3709104 3328813 2846634 2641898 2282617 2034446 1938111 2013718 2079562 1693556 1526566
16917A526566Q8525Q8222Q4594j57883k01359m2680j15492m0173k30162o6575
$$ 1526566 1615091 1703313 1787907 1630024 1428665 1385985 1270493 1230320 1000158 933583
16907I33583J57447j16335k05587J21139n0906k52685j03956l354K4069m0807
$$ 933583 1091030 974695 769108 890247 839341 586656 482700 479346 503415 462608
16897D62608r7044o7051O9039J02493J09632j6631o3446r5004j7654j3390L2865
$$ 462608 365564 298513 367552 470045 579677 563046 499600 404596 386942 373552 406417
16886D06417j12226m60J40216j5627j10948j9683L03841J71989o5209j20592N2553
$$ 406417 294191 293731 433947 418320 307372 287689 591530 763519 698310 577718 630271
16875F30271J5591J06339j60759m87118J05226K42040j50076k33933K02459J83671
$$ 630271 645862 752201 591442 104324 209550 451590 301514 67581 270040 453711
16865D53711p6903J19642R7779j98515r4117J05834K2443k15884J06314J57217
$$ 453711 376808 496450 594229 395714 301597 407431 429874 213990 320304 477521
16855D77521o8618j01300L68163J77129R7557k7213M7347k81591m30880q7165
$$ 477521 408903 307603 675766 852895 950452 923239 970586 688995 258115 170950
16845A70950J49095J5828n9551K07182j04350j82100J7200R4861n5650O5325L0161
$$ 170950 320045 335873 276322 483504 379154 197054 214254 309115 253465 318790 348951
16834C48951Q4046J3479N9125l9710k62362R5305O8072J76000M9976L6082P1771
$$ 348951 432997 446476 505601 465891 203529 298834 366906 542906 592882 628964 700735
16823G00735k058L949P0865j77278j88088K0194J09175l3902j31696P2059M3150
$$ 700735 698677 702626 773491 596213 408125 428319 537494 503592 371896 443955 487105
16812D87105o2960j85613N9903K55164J27252Q4006j38392j20319J5532j30784
$$ 487105 424145 238532 298435 553599 680851 764857 626465 506146 521678 390894
16802C90894K52115J35358j16499n3413q9867M4635o5674n0087k84187l62855
$$ 390894 643009 778367 661868 608455 518588 563223 497549 447462 163275 -199580
16792a99580j31752N4687L28327K28653r4377j33669R4034J85316R983J93386
$$ -199580 -331332 -276645 51682 280335 185958 52289 146323 331639 341622 535008
16782E35008J84308r7118l80366k51990K250K30969j7124J18153n3969J0957J47917
$$ 535008 719316 622198 241832 -10158 -7908 223061 205937 324090 270121 281078 428995
16771D28995Q2614j19212K28846J10937l80952j26881J073Q0325Q346K1948j12261
$$ 428995 511609 392397 621243 732180 351228 224347 225420 305745 314091 336039 223778
16760B23778j7899j50981m7822P2761o1036j62407j40508J76565J07680j04941
$$ 223778 205879 54898 7076 79837 18801 -143606 -284114 -107549 131 -104810
16750a04810k53793j19782N8371K4379L3202K03007N7677O9452J63484J34407
$$ -104810 -358603 -478385 -420014 -395635 -362433 -159426 -101749 -32297 131187 265594
16740B65594J8712J06159k8302Q2626R7263p3374k1993j26965j41421J04509k1567
$$ 265594 284306 390465 362163 444789 542052 468678 446685 319720 178299 282808 261241
16729B61241j8533j04963j83616J39978m9368k10836n1206Q3602L27401J08553
$$ 261241 242708 137745 -45871 94107 44739 -166097 -217303 -133701 193700 302253
16719C02253j41555j36876j26875j6671m4487J29007L40169J48855k20103l80531
$$ 302253 160698 23822 -103053 -119724 -164211 -35204 304965 453820 233717 -146814
16709a46814l58312J32417N02504J31884k18390l05758O610R4608K47618K5356
$$ -146814 -505126 -372709 129795 261679 43289 -262469 -255859 -161251 86367 111723
16699A11723J23417K59353k63096j70460M2077o1430J00726J67898j08622j28915
$$ 111723 235140 494493 231397 60937 103014 41584 142310 310208 201586 72671
16689G2671L0580O1214j05796q8825L6514j6775Q7369J10604J25627p087O7938
$$ 72671 103251 164465 58669 -30156 6358 -10417 76952 187556 313183 306096 374034
16678C74034j95185r4590k27061R5896M0537J13036K95992n9409k3110n2271k48572
$$ 374034 178849 84259 -142802 -46906 -6369 106667 402659 343250 320140 267869 19297
16667A9297k36210K14552J82076p2511j27207K16059p5952o6477j63830J66556
$$ 19297 -216913 -2361 179715 107204 -20003 196056 120104 53627 -110203 56353
16657E6353L86134j26251k30676J01796L91836J61350k98581j28870r1636j53550
$$ 56353 442487 316236 85560 187356 579192 740542 441961 313091 221455 67905
16647F7905l3387J92101j43514l37236j05963P1635n4648P7203J96469K62607
$$ 67905 34518 226619 83105 -254131 -360094 -288459 -343107 -265904 -69435 193172
16637A93172l8324j15444K5313p9127m4978j6327j92910L914J33604p8029L7875
$$ 193172 154848 39404 64717 -14410 -59388 -75715 -268625 -264711 -131107 -209136 -171261
16626a71261J70515Q6629O1393j41385j74557P4193K32962j22291k5331k6322
$$ -171261 -746 85883 147276 5891 -168666 -94473 138489 16198 -9133 -35455
16616c5455J6602K7324O6407j55055k17881J07414L31789N4054j09718j65919
$$ -35455 -18853 8471 74878 -80177 -298058 -190644 141145 195199 85481 -80438
16606h0438M8639j9067j83896j37735o4217n035n3717O288K05509O794l21422
$$ -80438 -31799 -50866 -234762 -372497 -436714 -441749 -495466 -489178 -283669 -276875 -598297
16595e98297j30553K32127O7732r5962p637J20895K34396K89422P4076L4296o0581
$$ -598297 -728850 -496723 -428991 -524953 -532590 -411695 -177299 112123 186199 220495 159914
16584A59914k04896J00815J77285k3390p3263K02944r3156n017k3249p4611j30261
$$ 159914 -44982 55833 233118 209728 136465 339409 246253 241236 217987 143376 13115
16573A3115j71904j59035o4353q4649K83838J28986k20227o1906K51103K2528
$$ 13115 -158789 -317824 -382177 -466826 -182988 -54002 -274229 -336135 -85032 -62504
16563f2504O7213J95350j62527N7403J95196j56613q4631J2966Q4872k25180N3437
$$ -62504 4709 200059 37532 94935 290131 133518 48887 61853 146725 -78455 -25018
16552b5018J19328k03462j33441K46340r4727k18502j05673M6181N6624K8834
$$ -25018 94310 -109152 -242593 3747 -90980 -309482 -415155 -368974 -312350 -283516
16542b83516l9664K02665o804K0034K1710j7571j95227K03566l6759J6965P9199
$$ -283516 -323180 -120515 -127319 -107285 -85575 -103146 -298373 -94807 -131566 -114601 -35402
16531c5402P673N5897J6903J05143m17726m27968O4054L72786L39546l9707j74083
$$ -35402 -27729 28168 45071 150214 -267512 -695480 -631426 -258640 80906 41199 -132884
16520a32884j66286J71023K28715J20069k46346k82886k9206Q5816R0404r2818
$$ -132884 -299170 -128147 100568 220637 -25709 -308595 -337801 -251985 -161581 -254399
16510b54399l4370p8206o0815j10336j5043N07912K75973j45390k26192J74821
$$ -254399 -288769 -366975 -427790 -538126 -553169 -45257 230716 85326 -140866 33955
16500C3955p2531j40616k5493J23913J30843J86410K95263O9787l18523k41550
$$ 33955 -38576 -179192 -204685 -80772 50071 236481 531744 601531 283008 41458
16490D1458k3149M3859o3591R4945r1224j75832M3967J87122J19291l22739M9859
$$ 41458 18309 62168 -1423 93522 2298 -173534 -129567 57555 176846 -145893 -96034
16479i6034J05637q6515l5387J88483K68408r6266r2096N0138j31896r112k5293
$$ -96034 9603 -76912 -112299 76184 344592 248326 156230 206368 74472 65360 40067
16468D0067j01393K03775Q5781j04806j18810K37619j5932N0859m6779l1964q6372
$$ 40067 -61326 142449 228230 123424 4614 242233 226301 277160 230381 198417 112045
16457A12045r2560k07295M7627K09789J1825k16670k87865j97471J04376q5440
$$ 112045 19485 -187810 -140183 69606 81431 -135239 -423104 -620575 -516199 -601639
16447f01639J79980R6154k3722J65893K01368L15275L7964J26598M42572k20978
$$ -601639 -421659 -325505 -349227 -183334 18034 333309 371273 497871 940443 719465
16437G19465k78524k94749J15138L42372J02560l14652j68295J80095O6702j56773
$$ 719465 440941 146192 261330 603702 706262 391610 223315 403410 470112 313339
16427C13339o1147K33839K31092J6899L7005k64256j41528o1084L6621M16415
$$ 313339 252192 486031 717123 734022 771027 506771 365243 304159 340780 757195
16417G57195L14482n0157j64967r4113K85964N7043O633k38665j3861o369K98527
$$ 757195 1071677 1021520 856553 762440 1048404 1105447 1112080 873415 859554 853185 1151712
16406A151712K64394m7925k09699l5582r2653j31580o402n7022k8427k09503j91274
$$ 1151712 1416106 1368181 1158482 1122900 1030247 898667 892265 835243 806816 597313 406039
16395D06039J24793k8414j30402k09625q1703j5259j3030Q3123P5135j89204n0018
$$ 406039 530832 502418 372016 162391 80688 65429 52399 135522 210657 21453 -28565
16384b8565Q2674Q2125R4360o0204m7277n5500j50542K0471J78469j70663n9233
$$ -28565 54109 136234 230594 170390 123113 67613 -82929 -62458 116011 -54652 -113885
16373a13885J2242j32524l9369M7886K31809L31677p41k00201j13493j04844k51782
$$ -113885 -101643 -234167 -273536 -225650 6159 337836 337095 136894 23401 -81443 -333225
16362c33225j93700m1104N7214J48887K83728j69730j9731O7601o7440j3063L4225
$$ -333225 -526925 -568029 -510815 -361928 -78200 -247930 -267661 -200060 -267500 -280563 -246338
16351b46338J06968N9761k9130j9471j49145l8188K9749J92103J8637J1522k2919
$$ -246338 -139370 -79609 -108739 -128210 -277355 -315543 -285794 -93691 -75054 -63532 -86451
16340h6451Q681l10516j17804J63216J05715q7211m046J44497J00435j91079l2320
$$ -86451 -77770 -388286 -506090 -342874 -237159 -324370 -328416 -183919 -83484 -274563 -306883
16329c06883K4731L1558K4708Q2847M01788J69739j32396j35877J31286j16587
$$ -306883 -282152 -250594 -225886 -143039 258749 428488 296092 160215 291501 174914
16319A74914J77073J47622l14442k41362M7799k5092j2461M664k9523q0398R3224
$$ 174914 351987 499609 185167 -56195 -8396 -33488 -45949 -41285 -70808 -151206 -57982
16308e7982j07776j24618j33653K5141K52173L05586p8942l2908L7138l19408
$$ -57982 -165758 -290376 -424029 -398888 -146715 158871 79929 47021 84159 -235249
16298b35249j3454L68563J80202k86458j66147j08084j04696N5094L23337O5941
$$ -235249 -248703 119860 300062 13604 -152543 -260627 -365323 -310229 13108 79049
16288G9049K3623j04387k20219K117j02430q7466k090L49714K32333n780N8519
$$ 79049 102672 -1715 -221934 -219817 -322247 -409713 -411803 -62089 170244 164464 222983
16277B22983N4141j76837j37985o8646P6232l6007O4440J2655k59581k5282J83652
$$ 222983 277124 100287 -37698 -106344 -30112 -66119 -1679 10976 -248605 -273887 -90235
16266i0235L46076L89835p6912j97260n7030l16855l26591j96527J05714L4823
$$ -90235 255841 645676 568764 371504 314474 -2381 -328972 -525499 -419785 -384962
16256c84962K75296l9294m4110r2454n2344J06828p8937q5831K66251J81036n652
$$ -384962 -109666 -148960 -193070 -285524 -337868 -231040 -309977 -395808 -129557 51479 45827
16245D5827k3237j96700k0632Q3410q7370o6082K58977J66317l5542K12407p6348
$$ 45827 22590 -174110 -194742 -111332 -198702 -264784 -5807 160510 124968 337375 261027
16234B61027j66867r0842M1677L8611j8077k09764k37114m5437K05250J50903
$$ 261027 94160 3318 44995 83606 65529 -144235 -381349 -426786 -221536 -70633
16224g0633l3795k4625K9935k06422J97909K85156o472K68881m1454k35941l07452
$$ -70633 -104428 -129053 -99118 -305540 -107631 177525 171053 439934 398480 162539 -144913
16213a44913O4855J6097J47319N07J3710o3617J35107J16894o0392k24174J5406
$$ -144913 -80058 -63961 83358 83865 97575 33958 169065 285959 225567 1393 16799
16202A6799L5755n839p7049J24324j21828J0198O0976j14572O6481L09241R9090
$$ 16799 52554 46715 -30334 93990 -27838 -17640 43336 -71236 -4755 304486 403576
16191D03576o8170j54952k25215J22546L0074Q5430J2080J83391N7148m1299j43502
$$ 403576 335406 180454 -44761 77785 107859 193289 205369 388760 445908 404609 261107
16180B61107P8867j01787o1736M0164n2315j04255j40166q2418l7394N5913J47270
$$ 261107 339974 238187 176451 216615 164300 60045 -80121 -162539 -199933 -144020 3250
16169C250J30253q4301k22851k72659K954K12887Q241j52320K76007q3774j7513
$$ 3250 133503 49202 -173649 -446308 -443354 -230467 -222226 -374546 -98539 -182313 -199826
16158a99826J14412k2028j1757M693K05425N9751N9420J57202j88790k43641J34937
$$ -199826 -85414 -107442 -119199 -114506 90919 150670 210090 367292 178502 -65139 69798
16147F9798q0150k56979L905p852n6683L49514K39620j10528j49355K8360o526
$$ 69798 -10352 -267331 -263426 -271278 -327961 21553 261173 150645 1290 29650 23124
16136B3124J9848N5231j9821k15952j09128Q0445J34723K09706j361l10832k45776
$$ 23124 42972 98203 78382 -137570 -246698 -166253 -31530 178176 176815 -134017 -379793
16125c79793l6785O0960K89396J84182j80367J51908n5905J86931M52583J9969
$$ -379793 -416578 -355618 -66222 117960 -62407 89501 33596 220527 673110 693079
16115F93079m68911n9439N1632j20206j86976j0616O6566J45807J00624R5032
$$ 693079 224168 164729 216361 96155 -90821 -101437 -34871 110936 211560 306592
16105C06592m9651m3610n1734P73j79963k76153j34732L819K59306n8418P0023
$$ 306592 256941 213331 161597 162370 -17593 -293746 -428478 -424659 -165353 -223771 -153748
16094a53748o6260J286M8517j33665J03963J61238j50197l9691K05530n21j52294
$$ -153748 -220008 -218722 -170205 -303870 -199907 -38669 -188866 -228557 -23027 -23548 -175842
16083a75842K40315K6188J10601O3118k60640j05398l3781j80376n9485j24241
$$ -175842 64473 90661 201262 264380 3740 -101658 -135439 -315815 -375300 -499541
16073d99541L684n4276k06348K52297J47806k783J72894o4334m7173j51188k34540
$$ -499541 -495857 -550133 -756481 -504184 -356378 -359161 -186267 -250601 -297774 -448962 -683502
16062f83502M5510L5483J0490P5675K55114R7480O2799K2751j47522Q9944o758
$$ -683502 -637992 -602509 -592019 -516344 -261230 -163750 -100951 -78200 -225722 -135778 -142536
16051a42536j42136n6522K06868N2934J86651J74859r3176K20420k12367j27602
$$ -142536 -284672 -341194 -134326 -81392 105259 280118 186942 407362 194995 67393
16041F7393k3232l2938j56888j22220k9781K437J20572K4188j6515j88699n3793
$$ 67393 44161 11223 -145665 -267885 -297666 -295229 -174657 -150469 -166984 -355683 -409476
16030d09476O6824r5980j87826L00493L19608K7000J13965m25265J9801K78464
$$ -409476 -342652 -438632 -626458 -325965 -6357 20643 134608 -290657 -270856 7608
16020G608J28501r7776k93769K47850L3733O871p6563j67512O599J21237j57083
$$ 7608 136109 38333 -255436 -7586 26147 33018 -43545 -211057 -204458 -83221 -240304
16009b40304k09681J20087L8867j02980m626K27725J59630m6747J37702J81890
$$ -240304 -449985 -329898 -291031 -394011 -398637 -170912 -11282 -58029 79673 261563
15999B61563m8776n3218J20970m1599j65070n8255o6835k68794j16923J48198
$$ 261563 212787 159569 280539 238940 73870 15615 -51220 -320014 -436937 -288739
15989b88739P6357q5362O2451j76612k4069N409K50622J90040n8710Q3867n3691
$$ -288739 -212382 -297744 -235293 -411905 -435974 -430565 -179943 10097 -48613 35254 -18437
15978a8437j13523O0273Q7010j39766L6368M6156n0076R5718l0905M6691j81118
$$ -18437 -131960 -71687 15323 -124443 -88075 -41919 -91995 3723 -27182 19509 -161609
15967a61609j62041O6111J55163J23029K15777P9206j35254j19658J50188j21397
$$ -161609 -323650 -257539 -102376 20653 236430 315636 180382 60724 210912 89515
15957H9515q8610Q5545l3223j58520k44848l8730O9805n1576k29118J01439K28182
$$ 89515 905 86450 53227 -105293 -350141 -388871 -319066 -370642 -599760 -498321 -270139
15946b70139p2684j15038n110k46863n2703L84140R5161j67424j52166J91010
$$ -270139 -342823 -457861 -462971 -709834 -762537 -378397 -283236 -450660 -602826 -411816
15936d11816L21507O5974N5766j24934Q0216J093j72277p3313j30275J93411K15988
$$ -411816 -90309 -24335 31431 -93503 -13287 -12194 -184471 -257784 -388059 -194648 21340
15925B1340N6185R6573L095L4688J33370j62854k3753O430K22331n4435j86969
$$ 21340 77525 174098 177193 211881 345251 182397 158644 165074 387405 332970 146001
15914A46001r7636Q8631k38192k20195K83985K03739j25842o2104N7711N8177
$$ 146001 48365 136996 -101196 -321391 -37406 166333 40491 -21613 36098 94275
15904I4275J05283j01032L7877p3336J89861O1882K3846l3074j57040K0994L5442
$$ 94275 199558 98526 136403 63067 252928 314810 338656 305582 148542 169536 204978
15893B04978O2394q7529k05209j61835J2678j51191j6768O1148J35199j8452l00403
$$ 204978 267372 179843 -25366 -187201 -174523 -325714 -342482 -281334 -146135 -164587 -464990
15882d64990p7016J13437J51946K0875J43804K08226L2047J18545p3051j22556
$$ -464990 -542006 -428569 -276623 -255748 -111944 96282 128329 246874 173823 51267
15872E1267l90847j35056Q2472K11724O9213n7618K85946K88118j54131k5089
$$ 51267 -339580 -474636 -392164 -180440 -111227 -168845 117101 405219 251088 225999
15862B25999M6342J29152n0877k43170k05768o3977P0549J43440k73459m2736
$$ 225999 272341 401493 350616 107446 -98322 -162299 -91750 51690 -221769 -264505
15852b64505J28625j91936Q2911l8241J936K05848L3192l0033J36603J64169J41947
$$ -264505 -135880 -327816 -244905 -283146 -281210 -75362 -42170 -72203 64400 228569 370516
15841C70516m3234k21379n6380j72542j72281j67110m2618P0567K56403J07623
$$ 370516 327282 105903 49523 -123019 -295300 -462410 -505028 -434461 -178058 -70435
15831g0435J50311M6393j21923J22830J5903l6111k01134k17646J69491M123N6923
$$ -70435 79876 126269 4346 127176 143079 106968 -94166 -311812 -142321 -138198 -81275
15820h1275N0197L2644p9570j41931J01102j83888m8262J82042J02182j57126
$$ -81275 -31078 1566 -78004 -219935 -118833 -302721 -350983 -168941 -66759 -223885
15810b23885O7073J57459Q7412J02475j64446j48684q8959P9488K37827K0860
$$ -223885 -156812 647 88059 190534 26088 -122596 -211555 -132067 105760 126620
15800A26620K5084j95771j48475L6872J9658K13641P2152l52432j88954L2710
$$ 126620 151704 -44067 -192542 -155670 -136012 77629 149781 -202651 -391605 -358895
15790c58895L00419l1061k37183j31636L0129J98699K61666r3568k22743J84941
$$ -358895 -58476 -89537 -326720 -458356 -428227 -229528 32138 -61430 -284173 -99232
15780i9232J84440q2584O7610J61503k6150m1667J59884N1406J02851q3280j03096
$$ -99232 85208 2624 70234 231737 205587 163920 323804 375210 478061 394781 291685
15769B91685O6323k45390k6399J31772o7973l05979j82603J73097J03399l164
$$ 291685 358008 112618 86219 217991 150018 -155961 -338564 -165467 -62068 -65232
15759f5232j509p7412k16005R5356Q892R959J2240R2645j63989q9114r8488K43737
$$ -65232 -66741 -144153 -360158 -264802 -255910 -245951 -233711 -141066 -305055 -394169 -492657 -248920
15747b48920J27206m9499K63742J74148k72092k82996j30588J40508N1566r5336
$$ -248920 -121714 -171213 92529 266677 -5415 -288411 -418999 -278491 -226925 -322261
15737c22261P9796o8736K24669J39929l15153r3882K12559J93829p1313m5891
$$ -322261 -242465 -311201 -86532 53397 -261756 -355638 -143079 50750 -20563 -66454
15727f6454o3435k44449J6391J43539m7293R5343k8721P4071j90374j19480N5923
$$ -66454 -129889 -374338 -357947 -214408 -261701 -166358 -195079 -121008 -311382 -430862 -374939
15716c74939J87272J95423J12538o4587k22503J59200Q1076k06794q78J94602
$$ -374939 -187667 7756 120294 55707 -166796 -7596 73480 -133314 -134192 60410
15706F0410J57951N5984o182l5457k70681l9248j24906j68913j77998L2811K6890
$$ 60410 218361 274345 268163 232706 -37975 -77223 -202129 -371042 -549040 -516229 -489339
15695d89339Q2470j27003l1341K67205K13025J27986k52170j39255J63127J04086
$$ -489339 -406869 -533872 -565213 -298008 -84983 43003 -209167 -348422 -185295 -81209
15685h1209q9613P626J10460K93142j58052j28880Q0096j00503L794m8628K45554
$$ -81209 -170822 -163196 -52736 240406 82354 -46526 33570 -66933 -63139 -111767 133787
15674A33787J65j20470N0770o6984K71918n7758r9635P132p4142N3620m5790R2564
$$ 133787 133952 13482 64252 -2732 269186 211428 111793 118925 44783 98403 52613 145177
15662A45177J12771j77282L6722q0169j97886J47519K72485R5585r5456J5531
$$ 145177 257948 80666 117388 37219 -160667 -13148 259337 354922 259466 274997
15652B74997l2082J28016N9236j08291l62238j5722P2391L53887J62438q1021
$$ 274997 242915 370931 430167 321876 -40362 -56084 16307 370194 532632 451611
15642D51611j85267j66833L3866O1318k41607r1834l9843q2873J10977m4124q8959
$$ 451611 266344 99511 133377 194695 -46912 -138746 -178589 -261462 -150485 -194609 -283568
15631b83568j08340j55974K71192J51919k03298o0352j49837j79272J83133j21695
$$ -283568 -391908 -547882 -276690 -124771 -328069 -388421 -538258 -717530 -534397 -656092
15621f56092M5688M4325J06346J63383K0068J90832J97780K9304Q86j3435J14268
$$ -656092 -610404 -566079 -459733 -296350 -276282 -85450 112330 141634 142520 129085 243353
15610B43353n8491m98511j40996O2170p5631j55913L23848N0806k0602J19932
$$ 243353 184862 -313649 -454645 -392475 -468106 -624019 -300171 -249365 -269967 -150035
15600a50035J31099K92949P8948k77825o308J6133N2141J36799m9670J27009n9541
$$ -150035 -18936 274013 352961 75136 68828 84961 137102 273901 224231 351240 291699
15589B91699J6791o7583l87445k59598L59113K36741r488j42469M4659J90160
$$ 291699 308490 240907 -146538 -406136 -47023 189718 180230 37761 82420 272580
15579B72580j57461j69329l60957N1840K17464J78620p275M3867J82543k01843
$$ 272580 115119 -54210 -415167 -363327 -145863 32757 25482 69349 251892 50049
15569E0049j05526R1751j08780j77924n7116n7622L0649j95644l8445K14990J45995
$$ 50049 -55477 36274 -72506 -250430 -307546 -365168 -334519 -530163 -568608 -353618 -207623
15558b07623J17826J36778J09178Q3666M2709j38423k959o2692j40180q4316l2204
$$ -207623 -89797 46981 156159 239825 282534 144111 141152 78460 -61720 -146036 -178240
15547a78240J46229j1939k55020J08981J23168R115P9614j28342j68208j53223
$$ -178240 -32011 -43950 -298970 -189989 -66821 -57706 21908 -106434 -274642 -427865
15537d27865p4225O3053J75521K12697k2551j53331m8426J60036P6340J47424
$$ -427865 -502090 -439037 -263516 -50819 -73370 -226701 -275127 -115091 -38751 108673
15527A08673K71537p7090p1760k3424j69352J0506J37452J1199l7095J35312j41944
$$ 108673 380210 303120 231360 207936 38584 49090 186542 197741 160646 295958 154014
15516A54014j33148M7236j168p0453m7325M7443p8792L7732L3718q9399j93411
$$ 154014 20866 68102 66934 -3519 -50844 -3401 -82193 -44461 -10743 -100142 -293553
15505b93553j60211r7933K39454L42804O4191j62821n6766j66967r2749K25437
$$ -293553 -453764 -551697 -312243 30561 94752 -68069 -124835 -291802 -384551 -159114
15495a59114j50085r5884J80250n2929K5202K67180J08890l3018J14513q4111
$$ -159114 -309199 -405083 -224833 -277762 -252560 14620 123510 90492 205005 120894
15485A20894P4636O7264k59903L3263Q1341j00392K8384k09333k3332O3119R8584
$$ 120894 195530 262794 2891 36154 117495 17103 45487 -163846 -187178 -124059 -25475
15474b5475L8662o1304L1979L04634R9403j31938p075R1009p3558k479j58592
$$ -25475 13187 -48117 -16138 288496 387899 255961 248886 339895 266337 263858 105266
15463A05266j22274K08310J2096l10671j33846k39082r405K01312K569j76011
$$ 105266 -17008 191302 203398 -107273 -241119 -480201 -489606 -288294 -285725 -461736
15453d61736N3779o0601j3221j2977K33121L66031l0530k11431n0091o8134Q8025
$$ -461736 -407957 -468558 -481779 -494756 -261635 104396 73866 -137565 -187656 -255790 -167765
15442a67765K27139J16234k0028j16723q1010J35451n0850J38073Q5000p499j07277
$$ -167765 59374 175608 155580 38857 -42153 93298 42448 180521 265521 258022 150745
15431A50745n0219o8273J79765k11526l03632n4727L13295R2040j0140j75290
$$ 150745 100526 32253 212018 492 -303140 -357867 -44572 47468 37328 -137962
15421a37962r0172M896q9319q7626K05048M2732j03771J33916Q2295J04337l9063
$$ -137962 -228134 -223238 -312557 -400183 -195135 -152403 -256174 -122258 -39963 64374 25311
15410B5311j39218j28680K18709m3597q3257M8088K0565K01968J45921N330J14
$$ 25311 -113907 -242587 -23878 -67475 -150732 -102644 -82079 119889 265810 271140 271254
15399B71254R3617j62002n48450k43827r283J31208L88751J57693N4881j54740
$$ 271254 364871 202869 -345581 -589408 -598691 -467483 -78732 78961 133842 -20898
15389b0898m1561J08691K9408j65079J15928K33308j79532j46764n3579j33197
$$ -20898 -62459 46232 75640 -89439 26489 259797 80265 -66499 -120078 -253275
15379b53275p0185J34140J83133r8114q2530R8668J04290o0309R3797m1797j71042
$$ -253275 -323460 -189320 -6187 -104301 -186831 -88163 16127 -44182 49615 7818 -163224
15368a63224j06508P0076K41394j49787m5712J37956o6171O2313Q1253j92084
$$ -163224 -269732 -199656 41738 -108049 -153761 -15805 -81976 -19663 61590 -130494
15358a30494o1402l1163K15632p1408N5416J25766M7622k5637k7067p9166R9503
$$ -130494 -191896 -223059 -7427 -78835 -23419 102347 149969 124332 97265 18099 117602
15347A17602j00499j07836k1077O4515O9505K8326j21906N3947O7951l9592J29818
$$ 117602 17103 -90733 -111810 -47295 22210 50536 -71370 -17423 50528 10936 140754
15336A40754j7809J18421L3423J2646K19880j50047j04820o7005k37035J11961
$$ 140754 122945 241366 274789 287435 507315 357268 252448 185443 -51592 60369
15326F0369N5226K0233j97164j09444R2121j28586j62069L859J01899M399P9672
$$ 60369 115595 135828 -61336 -170780 -78659 -207245 -369314 -365455 -263556 -259157 -179485
15315a79485J01920k4613K6875m2571j07348K09645J73332N187Q449R8447K02194
$$ -179485 -77565 -102178 -75303 -117874 -225222 -15577 157755 162942 171391 269838 472032
15304D72032j31383N1367J37371j48883R7827P6353m61715j45834j37223j94301
$$ 472032 340649 392016 529387 380504 478331 554684 92969 -52865 -190088 -384389
15294c84389J67855J04349l3171k8055q3263K3147m3712J78697K18705M0153J36797
$$ -384389 -216534 -112185 -145356 -173411 -256674 -233527 -277239 -98542 120163 160316 297113
15283B97113N4132j47861j73760k1079m1680J11981L04706j13709l89976j16546
$$ 297113 351245 203384 29624 8545 -33135 78846 383552 269843 -120133 -236679
15273b36679K61329J04038j02907p689j2200K7178J22626k864R7738o0007N7835
$$ -236679 24650 128688 25781 18092 5892 33070 155696 152832 250570 190563 248398
15262B48398P6940j34996j70016j49968J9461p6762K60R627J35693P3031R0233
$$ 248398 325338 190342 20326 -129642 -110181 -186943 -186683 -177056 -41363 31668 121901
15251A21901o9715J23622j47247J31550J25364k58448P7005J01619J3829r7137
$$ 121901 52186 175808 28561 160111 285475 27027 104032 205651 219480 122343
15241A22343J12613O3570j51248l98665o9229J35584j328p9789J26604L06762
$$ 122343 234956 298526 147278 -251387 -320616 -185032 -186360 -266149 -139545 167217
15231A67217l4644M1433j09177q8303j25769j23356N9039L0434j73357j86519
$$ 167217 132573 174006 64829 -23474 -149243 -272599 -213560 -183126 -356483 -543002
15221e43002L00382L34820k6272o2005L3881M8817R273r1922J53495q7569k68463
$$ -543002 -242620 92200 65928 3923 37804 86621 95894 3972 157467 69898 -198565
15210a98565L4832J05211q0106J9229j91373n233K07784K26362K02656K8174k85236
$$ -198565 -163733 -58522 -138628 -119399 -310772 -316005 -108221 118141 320797 348971 63735
15199F3735l11235K56476J33705k62460k871J45700R619n8772L8229j60201J40091
$$ 63735 -247500 8976 142681 -119779 -122650 23050 32669 -26103 12126 -148075 -7984
15188g984l1690J7650J53411J66008j56658j22384j5968k0116J25173Q1578r6163
$$ -7984 -39674 -22024 131387 297395 140737 18353 2385 -17731 107442 189020 92857
15177I2857m1469k13618J24100J76419n0733k24324j95546j43252J16336N4641
$$ 92857 51388 -162230 -38130 138289 87556 -136768 -332314 -475566 -359230 -304589
15167c04589J49982J22161M5011N3851p2119J05611j19651K1069O9277q9885j81581
$$ -304589 -154607 -32446 12565 66416 -5703 99908 -19743 1326 70603 -19282 -200863
15156b00863J51055J1240j52364j76863P8460K36217R6366J08323k782j59403
$$ -200863 -49808 -38568 -190932 -367795 -289335 -53118 43248 151571 148789 -10614
15146a0614O3897O6809J19249k6891k17821J0915m3698j43601Q1686K19848J26942
$$ -10614 53283 120092 239341 212450 -5371 5544 -38154 -181755 -100069 119779 246721
15135B46721P4407k18878k28911p8022k2095n4560j2884J22484J76490K9119j08506
$$ 246721 321128 102250 -126661 -204683 -226778 -281338 -294222 -171738 4752 33871 -74635
15124g4635q7223P169J95711J42760o3710j05841J23016R6344p6766j61637j98296
$$ -74635 -161858 -154689 41022 183782 120072 14231 137247 233591 156825 -4812 -203108
15113b03108J01708M19163p2898k32609K7285L7304m2812k6358r5359j87228q8808
$$ -203108 -101400 317763 244865 12256 39541 76845 34033 7675 -87684 -274912 -363720
15102c63720j35753O9629K2769L659K66803L81697L8713j76001k79039r6339L1446
$$ -363720 -499473 -429844 -407075 -403416 -136613 245084 283797 107796 -171243 -267582 -236136
15091b36136K19803m2575J32922K0295k06054R7572J8539P1215j03813Q7859o2364
$$ -236136 -16333 -58908 74014 94309 -111745 -14173 4366 75581 -28232 59627 -2737
15080b737p1851o2783o0676M01148K57764J02207K27943k65409m72385p9711J19960
$$ -2737 -74588 -137371 -198047 203101 460865 563072 791015 525606 53221 -26490 93470
15069I3470J23664J66373R1696k10022j73490k66249j7214K41441P9597j12748
$$ 93470 217134 383507 475203 265181 91691 -174558 -191772 49669 129266 16518
15059A6518k75272m1615J14041J71480J96514r5303k88263L3507o7786m3577j70007
$$ 16518 -258754 -300369 -186328 -14848 181666 86363 -201900 -168393 -236179 -279756 -449763
15048d49763k3741O0365M7745p8705K04057J85286J77466j27556r0463K8876m9108
$$ -449763 -473504 -413139 -365394 -444099 -240042 -54756 122710 -4846 -95309 -66433 -115541
15037a15541o535J31857l7623j42349p5307j6285r4368Q3311J75529K6334R9512
$$ -115541 -122076 9781 -27842 -170191 -245498 -261783 -356151 -272840 -97311 -70977 28535
15026B8535l8059k39825Q8837K75369K84577k10649k67442Q7010o3311j12243
$$ 28535 -9524 -249349 -160512 114857 399434 188785 -78657 8353 -54958 -167201
15016a67201q4847j1200J20717J30851J72722R2092p0677j6647M3236J08456j3020
$$ -167201 -252048 -263248 -142531 -11680 161042 253134 182457 165810 209046 317502 304482
15005C04482M3723o8210l25014j2324m357o9180J36887N2529J29462j49647Q0749
$$ 304482 348205 279995 -45019 -57343 -61700 -130880 6007 58536 187998 38351 119100
14994A19100n0520J12821Q4833J20667R412j30835k889j45452k56666j52167k52988
$$ 119100 68580 181401 266234 386901 396313 265478 262589 117137 -139529 -291696 -544684
14983e44684J31223K72607J10149J9847j05263K09267J32819M7071k4905K7268
$$ -544684 -413461 -140854 -30705 -10858 -116121 93146 225965 273036 248131 275399
14973B75399j30928k2705N6645k5518M6459j46118j57120o435n287L719J87278
$$ 275399 144471 121766 178411 152893 199352 53234 -103886 -110321 -115608 -111889 75389
14962G5389O2809k22349l7306J3493J98501J28079k1471J27476j67082r3072k03103
$$ 75389 138198 -84151 -121457 -107964 90537 218616 197145 324621 157539 64467 -138636
14951a38636L11881J21975o9419J6273o3249l55903j84524K7256K16777L8580
$$ -138636 173245 295220 225801 242074 178825 -177078 -361602 -334346 -117569 -78989
14941g8989J06691j52814o1163N9426r9879J52147K405m4095j0372K84525P6272
$$ -78989 27702 -125112 -186275 -126849 -226728 -74581 -72176 -116271 -126643 157882 234154
14930B34154j49793j30257J87219J65291j64868r9988j85253K7891o6598J29658
$$ 234154 84361 -45896 141323 306614 141746 41758 -143495 -115604 -182202 -52544
14920e2544J10618R806p8731O5589K38660Q7184l92509l09044k33512L53714J74692
$$ -52544 58074 67880 -10851 54738 293398 380582 -11927 -320971 -554483 -200769 -26077
14909b6077j14085k80287K17722M02529J0039n3228j36444k19696j58570k22232
$$ -26077 -140162 -420449 -202727 199802 209841 156613 20169 -199527 -358097 -580329
14899e80329R1217M1950J92450K80108J92324j77648j64644K9773J8586Q6144
$$ -580329 -489112 -447162 -254712 25396 217720 40072 -124572 -94799 -76213 9931
14889I931K23303R6388k49980o7986l5661j9397L26824r6982j97013n4698N2570
$$ 9931 233234 329622 79642 11656 -24005 -43402 283422 186440 -10573 -65271 -12701
14878a2701J12163n9059l681L60651O1217k75846l92788q0300R4769J36143Q5027
$$ -12701 99462 40403 36722 397373 458590 182744 -210044 -290344 -195575 -59432 25595
14867B5595k43223j51108P6943J02534J9062J45343K0718J4266m6105j4740p8634
$$ 25595 -217628 -368736 -291793 -189259 -170197 -24854 -4136 10130 -35975 -50715 -129349
14856a29349K1185N5986L7550O4561j1694j59755N7668O7916j27421K19581n1732
$$ -129349 -108164 -52178 -14628 49933 38239 -121516 -63848 4068 -123353 96228 44496
14845D4496M9134K46806r6450m2524k13069j38550K2108J3390J72318J06224j80860
$$ 44496 93630 340436 243986 201462 -11607 -150157 -128049 -114659 57659 163883 -16977
14834a6977N4822N4497J87635J35990l333l13837j72012j17425J08974j8414j06307
$$ -16977 37845 92342 279977 415967 412634 98797 -73215 -190640 -81666 -100080 -206387
14823b06387J96911L2426l74625l2961P7034K98716K3772j47261m0331J12040
$$ -206387 -9476 22950 -351675 -384636 -307602 -8886 14886 -132375 -172706 -60666
14813f0666Q7136M3082K04894O7727j05904k27599p0490K17715o9350Q3895l4118
$$ -60666 26470 69552 274446 342173 236269 8670 -61820 155895 86545 170440 136322
14802A36322l0038J8750m1724j5743P5946j07284R5898J10357R2553j33361j63602
$$ 136322 106284 125034 83310 67567 143513 36229 132127 242484 335037 201676 38074
14791C8074o4521j18039K08658K28832k56256q9176K16449j22184j09330J18211
$$ 38074 -26447 -144486 64172 293004 36748 -52428 164021 41837 -67493 50718
14781E0718M4028J65100J70501R6993o515l39127k03900j87260J12370J72570
$$ 50718 94746 259846 430347 527340 520825 181698 -22202 -209462 -97092 75478
14771G5478O5217K88555Q4003n0526l7152p3242j05274K9850j76457r5325K3008
$$ 75478 140695 429250 513253 462727 425575 352333 247059 276909 100452 5127 28135
14760B8135K4879R7694K45477o2564m34658k04082K20263J26638q0454J65940
$$ 28135 53014 150708 396185 333621 -101037 -305119 -84856 41782 -38672 127268
14750A27268m7299j00729k49616J22240k9030j05409J11022M5579J25760m5547
$$ 127268 79969 -20760 -270376 -148136 -177166 -282575 -171553 -125974 -214 -45761
14740d5761k17173n3020J10015l1551l0740R0902m6860J83851J84269k38000j75766
$$ -45761 -262934 -315954 -205939 -237490 -268230 -177328 -224188 -40337 143932 -94068 -269834
14729b69834O5409P1485o1698J76409K29213k11633O891K74226n5240j69194k98835
$$ -269834 -204425 -132940 -194638 -18229 210984 -649 6242 280468 225228 56034 -242801
14718b42801j22404K84348J0258m8034j96752n2448R3944M1189j14650M7218J94498
$$ -242801 -365205 -80857 -70599 -118633 -315385 -367833 -273889 -232700 -347350 -300132 -105634
14707a05634j48491M9674J79013q4641k85327j34157k12069L2008M04036K00639
$$ -105634 -254125 -204451 -25438 -110079 -395406 -529563 -741632 -709624 -305588 -104949
14697a04949J66678K26661M5071k36030p6853Q6601K98283K00995K2723l81530
$$ -104949 61729 288390 333461 97431 20578 107179 405462 606457 629180 247650
14687B47650N2140O4662k58381j46056O7156n0763N0414j7595j45138j72415N3566
$$ 247650 299790 364452 106071 -39985 27171 -23592 26822 9227 -135911 -308326 -254760
14676b54760N6627p0998j25175J9038K24374K73342O2544p9807K5580j20741n3985
$$ -254760 -198133 -269131 -394306 -375268 -150894 122448 184992 105185 130765 10024 -43961
14665d3961N8115q1081r1324j31378Q6654P7053q5214j04730j18707P3799J17534
$$ -43961 14154 -66927 -158251 -289629 -202975 -125922 -211136 -315866 -434573 -360774 -243240
14654b43240J6835J11893k9238m0319l2047J0145k0153L1190O4440J21844K07696
$$ -243240 -226405 -114512 -143750 -184069 -216116 -205971 -226124 -194934 -130494 -8650 199046
14643A99046j39661j91767p7751L13673J80856k28026l04619j84026K84670J8346
$$ 199046 59385 -132382 -210133 103540 284396 56370 -248249 -432275 -147605 -129259
14633a29259P5157j46777q4257o761J82232J93680o4696l9091j30801q682R1045
$$ -129259 -54102 -200879 -285136 -291897 -109665 84015 19319 -19772 -150573 -159255 -68210
14622f8210J1593j41028k11338J9163J51480n2215J84174K00893J81177j08901
$$ -68210 -56617 -197645 -408983 -389820 -238340 -290555 -106381 94512 275689 166788
14612A66788r7080j68266J6978J9370J53236K83446J10890k11314j93562m4395
$$ 166788 69708 -98558 -81580 -62210 91026 374472 485362 274048 80486 36091
14602C6091N216k1988m444J65559J12021P100J2997j98751r2835O8737R1986J95722
$$ 36091 41307 19319 14875 180434 292455 299555 312552 113801 20966 89703 181689 377411
14590C77411m853l03948p4639J02077k6430l398J22811K7982k15397n8757N9230
$$ 377411 372558 68610 -6029 96048 69618 66220 189031 217013 1616 -57141 2089
14579B089K08129j55918j82094o7940l4351P7510Q350K63475j00467k01561L0680
$$ 2089 210218 54300 -127794 -195734 -230085 -152575 -144225 119250 18783 -182778 -152098
14568a52098J59568j91325J68534J58171k5054j84383K26230j5366p5797r3257
$$ -152098 7470 -183855 -15321 142850 117796 -66587 159643 144277 68480 -24777
14558b4777l11725J5273L2619L00791J5145l3511k10276j88069K3649J05562J47353
$$ -24777 -336502 -321229 -288610 12181 27326 -6185 -216461 -404530 -380881 -275319 -127966
14547a27966J32524J96974Q1527o5446j44676k95274o6740r0479P1484m6155J73048
$$ -127966 4558 201532 283059 217613 72937 -222337 -289077 -379556 -308072 -354227 -181179
14536a81179K37354r7001l1752j80034J13871J95517Q4370q5845m4795Q2110L7418
$$ -181179 56175 -40826 -72578 -252612 -138741 56776 141146 55301 10506 92616 130034
14525A30034j92852j34318j41076n530P7261o2934j45708o3585J14181N1009J75881
$$ 130034 -62818 -197136 -338212 -343742 -266481 -329415 -475123 -538708 -424527 -373518 -197637
14514a97637l3942P3165J32737m1278r7147j09313j3152K21691n810J00419r5956
$$ -197637 -231579 -158414 -25677 -66955 -164102 -273415 -286567 -64876 -70686 29733 -66223
14503f6223o9454J97018J7389R904N0187j40722j70058q6511P8038l5646r3474
$$ -66223 -135677 61341 78730 88634 138821 -1901 -171959 -258470 -180432 -216078 -309552
14492c09552n5627J1537Q8594L33341N9385k10660J49979J5682J12996Q5491K0977
$$ -309552 -365179 -353642 -265048 68293 127678 -82982 66997 82679 195675 281166 302143
$$ [...]
##END NTUPLES=NMR SPECTRUM
##END=
