##TITLE=Analysis number 319268
Compound Code sb 01175
Project Code adrs
Chemist Name stores
##JCAMPDX= 6.0         $$ Bruker NMR JCAMP-DX V2.0
##DATA TYPE= NMR SPECTRUM
##DATA CLASS= NTUPLES
##ORIGIN= Bruker BioSpin GmbH
##OWNER= nmr
$$ XWIN-NMR		Version 3.5
$$ Mon May  8 14:26:35 2006 GMT Daylight Time (UT+1h)  MAYBRIDGE\nmr@NMR_250MHZ
##.OBSERVE FREQUENCY= 250.131544655141
##.OBSERVE NUCLEUS= ^1H
##.ACQUISITION MODE= SIMULTANEOUS (DQD)
##.ACQUISITION SCHEME= undefined
##.AVERAGES= 16
##.DIGITISER RES= 18
##SPECTROMETER/DATA SYSTEM= dpx250
##.PULSE SEQUENCE= zg30
##.SOLVENT NAME= CDCl3
##.SHIFT REFERENCE= (INTERNAL, CDCl3, 0, 16.522)
##AUDIT TRAIL= $$ (NUMBER, WHEN, WHO, WHERE, WHAT)
$$ ##TITLE= Audit trail, XWIN-NMR		Version 3.5
$$ ##JCAMPDX= 5.01
$$ ##ORIGIN= Bruker BioSpin GmbH
$$ ##OWNER= nmr
$$ C:\u/data/dgb/nmr/ADRS/3860/pdata/1/auditp.txt
$$ ##AUDIT TRAIL=  $$ (NUMBER, WHEN, WHO, WHERE, WHAT)
(   1,<2006-05-08 14:26:07.19 +100>,<MAYBRIDGE\nmr>,<NMR_250MHZ>,
      <created by zg, POWCHK disabled, PULCHK disabled
       configuration hash MD5:
       84 BC 41 DB A1 6E 1D 46 DA 25 12 A5 C1 ED C5 3A
       data hash MD5: 64K
       4A 09 15 71 E6 88 05 19 09 02 A2 41 41 1B 8F A8>)
(   2,<2006-05-08 14:26:23.31 +100>,<MAYBRIDGE\nmr>,<NMR_250MHZ>,
      <Start of raw data processing
       ef LB = 0.3 FT_mod = 6 PKNL = 1 SI = 32K 
       data hash MD5: 32K
       00 08 8F 33 96 BC 92 BB 7A 36 A0 70 E7 0C 8B 4A>)
(   3,<2006-05-08 14:26:24.92 +100>,<MAYBRIDGE\nmr>,<NMR_250MHZ>,
      <apk 
       data hash MD5: 32K
       B3 3B AC 17 66 78 55 4E C6 00 3F 03 C9 78 9F DA>)
(   4,<2006-05-08 14:26:25.86 +100>,<MAYBRIDGE\nmr>,<NMR_250MHZ>,
      <abs ABSG = 5 
       data hash MD5: 32K
       86 A0 21 0F 0E 11 A8 39 6E 1C C0 88 65 D9 F2 34>)
$$ ##END=
$$ 
$$ hash MD5
$$ 14 36 67 35 31 67 50 FC 95 8C B2 00 17 2D 0F 1D
##$RELAX= 
##$RELAX= 
##$RELAX= 
##$RELAX= 
##$RELAX= 
##$RELAX= 
##$RELAX= 
$$ Bruker specific parameters
$$ --------------------------
##$DU= <C:\u>
##$EXPNO= 3860
##$NAME= <ADRS>
##$PROCNO= 1
##$TYPE= <nmr>
##$USER= <dgb>
##$AMP= (0..31)
100 100 100 100 100 100 100 100 100 100 100 100 100 100 100 100 100 100 
100 100 100 100 100 100 100 100 100 100 100 100 100 100 
##$AQSEQ= 0
##$AQ_mod= 3
##$AUNM= <au_zg>
##$AUTOPOS= <43 >
##$BF1= 250.13
##$BF2= 250.13
##$BF3= 250.13
##$BF4= 250.13
##$BF5= 500.13
##$BF6= 500.13
##$BF7= 500.13
##$BF8= 500.13
##$BYTORDA= 1
##$CFDGTYP= 0
##$CFRGTYP= 5
##$CHEMSTR= <none>
##$CNST= (0..31)
1 1 145 1 1 1 1 1 1 1 1 1 1 1 1 1 1 1 1 1 1 1 1 1 1 1 1 1 1 1 1 1 
##$CPDPRG= <>
##$CPDPRG1= <>
##$CPDPRG2= <>
##$CPDPRG3= <>
##$CPDPRG4= <mlev>
##$CPDPRG5= <mlev>
##$CPDPRG6= <mlev>
##$CPDPRG7= <mlev>
##$CPDPRG8= <mlev>
##$CPDPRGB= <>
##$CPDPRGT= <>
##$D= (0..31)
0 1 0 0 0 0 0 0 0 0.06 0 0 0 0 0 0 0.0002 0 0 0 0 0 0 0 0 0 0 0 0 0 0 
0 
##$DATE= 1147094765
##$DBL= (0..7)
120 120 120 120 120 120 120 120 
##$DBP= (0..7)
150 150 150 150 150 150 150 150 
##$DBP07= 0
##$DBPNAM0= <>
##$DBPNAM1= <>
##$DBPNAM2= <>
$$ [...]
##$SUBNAM7= <"">
##$SUBNAM8= <"">
##$SUBNAM9= <"">
##$SW= 20.6930455092707
##$SWIBOX= (0..15)
0 0 3 0 0 0 0 0 0 0 0 0 0 0 0 0 
##$SW_h= 5175.983436853
##$TD= 65536
##$TD0= 1
##$TE= 295.16
##$TE2= 300
##$TE3= 300
##$TEG= 300
##$TL= (0..7)
0 120 120 120 120 120 120 120 
##$TP= (0..7)
150 150 150 150 150 150 150 150 
##$TP07= 0
##$TPNAME0= <>
##$TPNAME1= <>
##$TPNAME2= <>
##$TPNAME3= <>
##$TPNAME4= <>
##$TPNAME5= <>
##$TPNAME6= <>
##$TPNAME7= <>
##$TPOAL= (0..7)
0.5 0.5 0.5 0.5 0.5 0.5 0.5 0.5 
##$TPOFFS= (0..7)
0 0 0 0 0 0 0 0 
##$TUNHIN= 0
##$TUNHOUT= 0
##$TUNXOUT= 0
##$USERA1= <user>
##$USERA2= <user>
##$USERA3= <user>
##$USERA4= <user>
##$USERA5= <user>
##$V9= 5
##$VALIST= <valist>
##$VCLIST= <CCCCCCCCCCCCCCC>
##$VD= 0
##$VDLIST= <DDDDDDDDDDDDDDD>
##$VPLIST= <PPPPPPPPPPPPPPP>
##$VTLIST= <TTTTTTTTTTTTTTT>
##$WBST= 1024
##$WBSW= 4
##$XGAIN= (0..3)
0 0 0 0 
##$XL= 0
##$YL= 0
##$YMAX_a= 480317
##$YMIN_a= -618317
##$ZGOPTNS= <>
##$ZL1= 120
##$ZL2= 120
##$ZL3= 120
##$ZL4= 120
##$ABSF1= 16.522
##$ABSF2= -4.171173
##$ABSG= 5
##$ABSL= 3
##$ALPHA= 0
##$AQORDER= 0
##$ASSFAC= 0
##$ASSFACI= 0
##$ASSFACX= 0
##$ASSWID= 0
##$AUNMP= <proc_1d>
##$AZFE= 0.1
##$AZFW= 0.1
##$BCFW= 0
##$BC_mod= 0
##$BYTORDP= 0
##$COROFFS= 0
##$CY= 12.5
##$DATMOD= 1
##$DC= 0
##$DFILT= <>
##$DTYPP= 0
##$F1P= 14.0000005364418
##$F2P= -0.99999901652339
##$FCOR= 0.5
##$FTSIZE= 32768
##$FT_mod= 6
##$GAMMA= 0
##$GB= 0
##$INTBC= 1
##$INTSCL= 1
##$ISEN= 128
##$LB= 0.3
##$LEV0= 0
##$LPBIN= 0
##$MAXI= 10000
##$MC2= 0
##$MEAN= 0
##$ME_mod= 0
##$MI= 0
##$NCOEF= 0
##$NC_proc= -3
##$NLEV= 6
##$NOISF1= 0
##$NOISF2= 0
##$NSP= 0
##$NTH_PI= 0
##$NZP= 0
##$OFFSET= 16.522
##$PC= 1
##$PHC0= 167.9249
##$PHC1= 7.923066
##$PH_mod= 1
##$PKNL= yes
##$PPARMOD= 0
##$PSCAL= 4
##$PSIGN= 0
##$REVERSE= no
##$SF= 250.13
##$SI= 32768
##$SIGF1= 0
##$SIGF2= 0
##$SINO= 400
##$SIOLD= 32768
##$SREGLST= <1H.CDCl3>
##$SSB= 0
##$STSI= 32768
##$STSR= 0
##$SW_p= 5175.98343685301
##$SYMM= 0
##$S_DEV= 0
##$TDeff= 65536
##$TDoff= 0
##$TI= <Analysis number 999999
Compound Code 99
Book Reference 9
Project Code 9>
##$TILT= no
##$TM1= 0
##$TM2= 0
##$TOPLEV= 0
##$USERP1= <user>
##$USERP2= <user>
##$USERP3= <user>
##$USERP4= <user>
##$USERP5= <user>
##$WDW= 1
##$XDIM= 32768
##$YMAX_p= 414664103
##$YMIN_p= -125792
$$ End of Bruker specific parameters
$$ ---------------------------------
##NTUPLES= NMR SPECTRUM
##VAR_NAME=  FREQUENCY,     SPECTRUM/REAL,   SPECTRUM/IMAG
##SYMBOL=    X,             R,               I
##VAR_TYPE=  INDEPENDENT,   DEPENDENT,       DEPENDENT
##VAR_FORM=  AFFN,          ASDF,            ASDF
##VAR_DIM=   32768,         32768,           32768
##UNITS=     HZ,            ARBITRARY UNITS, ARBITRARY UNITS
##FACTOR=    0.157963299565203, 1,           1
##FIRST=     4132.6476996994, 0,             0
##LAST=      -1043.33573715361, 0,           0
##MIN=       -1043.33573715361, -125792,     0
##MAX=       4132.6476996994, 414664103,     0
$$ Real data points
##PAGE= N=1
##DATA TABLE= (X++(R..R)), XYDATA
$$ [...]
$$ plain form
16451 8941 31365 4889 -1434 24194 25175 4916 823 25952 42902 35389 26876 36614 -4531
16438 -4531 -22920 -14742 -16743 -14468 14693 39363 37327 -15760 -29738 -16978 21340 29215 23038
16425 23038 -5909 -12825 -13441 6199 15229 12149 -22696 -26910 -11180 -18029 -3642 1660 -17509
16412 -17509 -23760 -33565 -9558 41447 28081 -1364 5604 3570 -3077 -19599 -23242 -16025 9116
16399 9116 19263 33972 39013 43423 8572 -33736 -41733 -15931 31533 43104 22156 -3984
16387 -3984 21274 30684 18302 34122 38730 18219 -13446 -37043 -37848 -46860 -5286 17474 40007
16374 40007 46903 37123 41498 48913 40088 23008 7718 6034 3837 -8188 -15128 -12182 14873
16361 14873 39728 25638 1069 15047 43546 20331 25451 40958 11995 19887 52656 20751
$$ packed form
16451H941K2424k6476o323K5628R81k0259m093K5129J6950p513q513R738m1145
16438d531j8389Q178k001K275K9161K4670k036n3087j3978J2760L8318P875o177
16425B3038k8947o916o16J9640R030l080l4845m214J5730o849J4387N302j9169
16412a7509o251r805K4007N1005j3366k9445O968k034o647j6522l643P217K5141
16399I116J0147J4709N041M410l4851m2308p997K5802M7464J1571k0948k6140
16387c984K5258R410j2382J5820M608k0511l1665k3597q05r012M1574K2760K2533
16374D0007O896r780M375P415q825j7080j5290j684k197j2025o940K946K7055
16361A4873K4855j4090k4569J3978K8499k3215N120J5507k8963P892L2769l1905
$$ plain form
16349 20751 -9079 -21508 13487 35177 28746 43161 69434 60059 47736 34939 19057 10741
16337 10741 9469 35408 23524 -4977 -44153 -32631 -13993 -16734 -45903 -29140 6257 10269
16325 10269 904 -33174 -36256 -33602 4119 29229 42627 47106 53931 4275 -31708 -3446 41871
16312 41871 22051 -1301 1154 -15378 -36510 -36663 -26916 -35150 -37884 -34665 -10910 1058 22707
16299 22707 48168 29372 42809 19839 -5254 -18602 -14395 -25527 -7851 3555 -4998 10929
16287 10929 -14 -40874 -67815 -47754 -6447 15763 -6199 -11860 -31038 -21742 -9728 40080
16275 40080 31611 19520 -8944 -35941 -26573 -21681 -30418 -60028 -59842 -27991 -10318 -11067 -21815
16262 -21815 -3501 19808 12054 22150 37727 24553 47654 48623 43463 49355 32761 25332 10079
$$ packed form
16349B0751k9830j2429L4995K1690o431J4415K6273r375j2323j2797j5882q316
16337A0741j272K5939j1884k8501l9176J1522J8638k741k9169J6763L5397M012
16325A0269r365l4078l082K654L7721K5110J3398M479O825m9656l5983K8262M5317
16312D1871j9820k3352K455j6532k1132j53R747q234k734L219K3755J1968K1649
16299B2707K5461j8796J3437k2970k5093j3348M207j1132J7676J1406q553J5927
16287A0929j0943m0860k6941K0061M1307K2210k1962n661j9178R296J2014M9808
16275D0080q469j2091k8464k6997R368M892q737k9610J86L1851J7673p49j0748
16262b1815J8314K3309p754J0096J5577j3174K3101R69n160N892j6594p429j5253
$$ plain form
16249 10079 4888 -7712 21431 13867 -5071 -20326 -2988 12442 -4170 4563 4658 2707 18175
16236 18175 5082 -8549 -48448 -39219 -13451 -7631 -14645 -7543 -4716 -40366 -26640 7169 18761
16223 18761 3657 -21474 -9312 5465 3976 -30085 -15772 -6003 23301 40148 30514 -6782
16211 -6782 -18438 -13822 -1014 -908 8905 -5692 -40378 -59632 -53655 -51622 -41828 -42114 -25085 921
16197 921 23704 23980 2718 17275 36027 33070 52000 59421 6915 5449 39739 32987 32008 29918
16183 29918 491 -18915 -42261 -35413 -13431 -25052 -36199 -23296 3880 36624 23628 980
16171 980 3461 -14636 -4411 15280 4353 -56662 -70888 -86435 -61301 -36391 1927 18854
16159 18854 16821 -964 -3727 -1002 6804 13231 6117 -8632 -8241 -16777 -14771 17032 -8141 -14836
$$ packed form
16249A0079n191j2600K9143p564j8938j5255J7338J5430j6612Q733R5j951J5468
16236A8175j3093j3631l9899R229K5768N820p014P102K827l5650J3726L3809J1592
16223A8761j5104k5131J2162J4777j489l4061J4313R769K9304J6847r634l7296
16211f782j1656M616J2808J06R813j4597l4686j9254N977K033R794k86J7029K6006
16197I21K2783K76k1262J4557J8752k957J8930P421n2506j466L4290o752r79k090
16183B9918k9427j9406k3346O848K1982j1621j1147J2903K7176L2744j2996k2648
16171I80K481j8097J0225J9691j0927o1015j4226j5547K5134K4910L8318J6927
16159A8854k033j7785k763K725P806O427p114j4749L91q536K006L1803k5173o695
$$ plain form
16145 -14836 -8963 -1225 -23103 -44103 -32246 -43297 -47838 -39260 -32373 -27112 -17387 1394 -24215
16132 -24215 -35724 -24785 -4216 15677 -13200 -7545 19686 22749 25297 28432 1433 -783 16064
16119 16064 33757 14022 -5249 -13542 -2774 19748 26361 48523 71300 24615 15114 15793 -24944
16106 -24944 -32569 -31071 -18521 -5544 -699 -5847 -3484 3736 -2746 -18478 -22527 -28846 -30569 -1904
16092 -1904 28520 2380 -5097 15482 7394 -3722 -13461 -8622 -6115 3867 11950 5056 -23652
16079 -23652 -44930 -27293 -13730 -5416 -367 -4531 -13543 -19332 23515 42964 23374 228 -17300
16066 -17300 -45893 -54553 -27224 -20530 -9367 -17064 -22952 -28631 -24217 -16561 -31658 -32724 -26146
16053 -26146 -43610 -51815 -27523 -35271 -53119 -64596 -42251 -23838 -20764 11182 29982 -10981
$$ packed form
16145a4836N873P738k1878k1000J1857j1051m541Q578O887N261R725J8781k5609
16132b4215j1509J0939K0569J9893k8877N655K7231L063K548L135k6999k216J6847
16119A6064J7693j9735j9271q293J0768K2522O613K2162K2777m6685r501O79m0737
16106b4944p625J498J2550J2977M845n148K363P220o482j5732m049o319j723K8665
16092a904L0424k6140p477K0579q088j1116r739M839K507R982Q083o894k8708
16079b3652k1278J7637J3563Q314N049m164r012n789M2847J9449j9590k3146j7528
16066a7300k8593q660K7329O694J1163p697n888n679M414P656j5097j066O578
16053b6146j7464q205K4292p748j7848j1477K2345J8413L074L1946J8800m0963
$$ plain form
16041 -10981 -35346 -22360 -24128 -36931 -47431 -51698 -25482 -11930 -28804 -48971 -42351 -11855
16029 -11855 -15765 -5405 37472 70603 70124 20628 15523 15965 -3991 -33804 -8633 17974 1293
16016 1293 -29065 -24479 -2422 -10561 -36071 -27520 9047 -4693 -23423 -19730 -16849 -18404 -5956
16003 -5956 -2671 1564 6502 12374 30878 29066 53726 49486 26319 5466 -21315 -47797 -41890
15990 -41890 -16948 7046 3381 -36648 -40185 -47382 -44247 -26360 -51108 -26192 3716 22593
15978 22593 -3798 -15519 -7172 -1672 6090 11900 335 -24144 -49925 -14491 7659 17531 23693
15965 23693 16374 -14660 343 9100 -5768 13166 29388 9061 25664 14937 -9809 -17858
15953 -17858 -34002 -12818 -6899 -28899 -48054 -56484 -69242 -72870 -69294 -82553 -91425 -70305 -51493
$$ packed form
16041a0981k4365J2986j768j2803j0500m267K6216J3552j6874k0167O620L0496
16029a1855l910J0360M2877L3131m79m9496n105M42j9956k9813K5171K6607j6681
16016A293l0358M586K2057q139k5510Q551L6567j3740j8730L693K881j555J2448
16003e956L285M235M938N872J8504j812K4660m240k3167k0853k6781k6482N907
15990d1890K4942K3994l665m0029l537p197L135J7887k4748K4916K9908J8877
15978B2593k6391j1721Q347N500P762N810j1565k4479k5781L5434K2150R872O162
15965B3693p319l1034J5003Q757j4868J8934J6222k0327J6603j0727k4746q049
15953a7858j6144K1184N919k2000j9155q430j2758l628L576j3259q872K1120J8812
$$ plain form
15940 -51493 -47975 -32140 -15168 9600 16365 34273 38879 32100 16027 9421 -2322 12892 32140
15927 32140 22717 15464 1087 8142 4235 -20014 -10224 -6239 -9539 -46587 -64893 -56817 -20546
15914 -20546 -17870 -8576 -24845 -40668 -30485 -24579 22201 19389 -62 19676 10402 11676 26783
15901 26783 32396 18754 9524 22228 23112 19766 -1321 -13581 -7965 15821 10831 30763 45619
15888 45619 3684 -38567 -74452 -61058 -67212 -34343 -13577 -23524 -3163 -11560 -28252 -54126
15876 -54126 -42242 -5520 -13412 -40518 -33237 -28376 -34185 -33870 -72806 -64424 -43193 -47687 -63483
15863 -63483 -46760 -66249 -73532 -69171 -72172 -70747 -57262 -43738 -15653 4455 1234 1990 11935
15850 11935 18775 -3326 -30948 -65483 -66153 -57135 -15773 2641 -21394 -9771 40833 57904
$$ packed form
15940e1493L518J5835J6972K4768O765J7908M606o779j6073o606j1743J5214J9248
15927C2140r423p253j4377P055l907k4249R790L985l300l7048j8306Q076L6271
15914b0546K676R294j6269j5823J0183N906M6780k812j9451J9738r274J274J5107
15901B6783N613j3642r230J2704Q84l346k1087j2260N616K3786m990J9932J4856
15888D5619m1935m2251l5885J3394o154L2869K0766r947K0361q397j6692k5874
15876e4126J1884L6722p892k7106P281M861n809L15l8936Q382K1231m494j5796
15863f3483J6723j9489p283M361l001J425J3485J3524K8085K0108l221P56R945
15850A1935O840k2101k7622l4535o70R018M1362J8414k4035J1623N0604J7071
$$ plain form
15838 57904 38101 33868 45314 68161 84680 60383 12461 -3101 -11128 -20830 -23210 -3280
15826 -3280 24384 21763 19697 11802 8202 -3061 -1419 23804 38269 10389 7656 -23729 -25184
15813 -25184 18575 54812 31732 -37272 -43317 -27154 -9623 1739 -1644 14208 13337 -8966
15801 -8966 -17000 -242 8363 -2242 3668 -174 7075 20442 17883 31571 20285 13154 18917
15788 18917 14948 12874 -1764 2902 -26196 -53059 -40999 -34390 -57061 -76846 -74884 -64559 -55122
15775 -55122 -29650 3315 -9038 -25209 -26183 7853 18111 2686 15441 26028 35664 28968
15763 28968 14965 -12817 -18599 -24456 -40432 -26061 -22724 -15149 16514 38675 37056 23258 39418
15750 39418 39288 358 12151 -5000 -1327 9473 15792 5211 -12309 -28640 -47690 -52970 -37072
$$ packed form
15838E7904j9803m233J1446K2847J6519k4297m7922j5562q027r702k380J9930
15826c280K7664k621k066p895l600j1263J642K5223J4465k7880k733l1385j455
15813b5184M3759L6237k3080o9004o045J6163J7531J1362l383J5852q71k2303
15801h966q034J6758Q605j0605N910l842P249J3367k559J3688j1286p131N763
15788A8917l969k074j4638M666k9098k6863J2060O609k2671j9785J962J0325R437
15775e5122K5472L2965j2353j6171r74L4036J0258j5425J2755J0587R636o696
15763B8968j4003k7782n782n857j5976J4371L337P575L1663K2161j619j3798J6160
15750C9418j30l8930J1793j7151L673J0800O319j0581j7520j6331j9050n280J5898
$$ plain form
15737 -37072 -29412 -33394 -21216 -15335 5523 -9453 14752 24601 19560 6714 -10629 -13675 -9934
15724 -9934 14017 12932 46317 46983 25845 8729 39701 58474 38345 32346 39356 25757 -11226
15711 -11226 -27737 -9962 3063 10653 -7097 -9296 3912 16379 29513 37597 60225 38026
15699 38026 15391 29101 37740 34009 26908 -265 11740 15068 4233 -23575 -38483 -37563 -30066
15686 -30066 -1366 49578 69951 61445 31611 25560 6305 12383 21685 33872 2875 -30758
15674 -30758 -31582 -31856 -70718 -78740 -71551 -60115 -48738 -32843 -33828 -6140 39656 48032 25525
15661 25525 -17320 -48841 -20051 -5690 -12961 -19976 2702 1274 -27417 -39864 -20809 -3105
15649 -3105 -1674 3621 -19625 -25134 -19852 -9811 -18070 -25964 -31743 -18852 5703 34485 36773
$$ packed form
15737c7072P660l982J2178N881K0858j4976K4205R849n041j2846j7343l046L741
15724i934K3951j085L3385O66k1138j7116L0972J8773k0129n999P010j3599l6983
15711a1226j6511J7775J3025P590j7750k199J3208J2467J3134Q084K2628k2199
15699C8026k2635J3710Q639l731p101k7173J2005L328j0835k7808j4908R20P497
15686c0066K8700N0944K0373q506k9834o051j9255O078R302J2187l0997l3633
15674c0758q24k74l8862q022P189J1436J1377J5895r85K7688M5796Q376k2507
15661B5525m2845l1521K8790J4361p271p015K2678j428k8691j2447J9055J7704
15649c105J431N295k3246n509N282J0041q259p894n779J2891K4555K8782K288
$$ plain form
15636 36773 37250 29807 40362 32396 12568 19608 35439 25469 7262 23008 21547 -33972 -33910 -27533
15622 -27533 -50807 -58236 -57982 -72167 -99824 -98495 -79206 -67097 -64284 -62653 -18851 -18684 -42069
15609 -42069 -34820 -23064 -17013 -28725 3757 -8251 -25502 -15381 -559 -285 -100 -2328 835
15596 835 -18231 -15291 -23172 -10169 -309 -142 -12345 -19582 5318 10784 28 27732 54896
15583 54896 73294 50055 -5099 -24495 -33438 -30227 -33111 4443 -466 -18037 -31532 -23557 10876
15570 10876 58075 62157 47665 27536 -14591 -29201 -32335 -18954 -25583 -8818 23830 24191 9888
15557 9888 3587 -365 6640 11147 -102 -26491 -46956 -10117 5830 2985 -20043 -38703 -57976
15544 -57976 -33192 -7634 -10504 -36814 -60059 -48381 -21995 -43377 -53562 -69033 -46606 -25694
$$ packed form
15636C6773M77p443J0555p966j9828P040J5831r970j8207J5746j461n5519O2O377
15622b7533k3274p429K54j4185k7657J329J9289J2109K813J631M3802J67k3385
15609d2069P249J1756O051j1712L2482j2008j7251J0121J4822K74J85k228L163
15596H35j9066K940p881J3003R860J67j2203p237K4900N466j0756K7704K7164
15583E4896J8398k3239n5154j9396q943L211k884L7554m909j7571j3495P975L4433
15570A0876M7199M082j4492k0129m2127j4610l134J3381o629J6765L2648L61j4303
15557I888o301l952P005M507j1249k6389k0465L6839J5947k845k3028j8660j9273
15544e7976K4784K5558k870k6310k3245J1678K6386k1382j0185j5471K2427K0912
$$ plain form
15532 -25694 -16414 -61688 -53171 -41058 -52568 -28415 9520 38688 85593 66941 35983 5510
15520 5510 1171 10279 -10044 -20808 -7465 -16065 -32085 -15354 12379 3498 4646 4677 -11916
15507 -11916 -17573 21503 11550 -8387 1203 18983 -15 -35200 -17104 309 -4825 -21046
15495 -21046 -4715 10168 22105 28357 4393 -27104 -13393 -24213 -15475 -18479 -10558 -12737 -31318
15482 -31318 -33397 -20294 1321 -13260 -21997 -28394 -48240 -31506 -4911 5499 35555 20105
15470 20105 -5206 -19674 -39519 -10842 12904 26044 43592 65210 42113 -4836 -8048 -14732
15458 -14732 -15399 -12489 6864 11913 14956 18860 18389 16040 20951 17565 -1224 -13467 -17064 -20903
15444 -20903 -28130 -4421 -12164 -22863 11532 16760 -7841 -14634 -5133 -15397 -10968 -35004 -42535
$$ packed form
15532b5694R280m5274Q517J2113j1510K4153L7935K9168M6905j8652l0958l0473
15520E510m339R108k0323j0764J3343q600j6020J6731K7733q881J148L1j6593
15507a1916n657L9076r953j9937R590J7780j8998l5185J8096J7413n134j6221
15495b1046J6331J4883J1937O252k3964l1497J3711j0820Q738l004P921k179j8581
15482c1318k079J3103K1615j4581q737o397j9846J6734K6595J0410L0056j5450
15470B0105k5311j4468j9845K8677K3746J3140J7548K1618k3097m6949l212o684
15458a4732o67K910J9353N049L043L904m71k349M911l386j8789j2243l597l839
15444b0903p227K3709p743j0699L4395N228k4601o793R501j0264M429k4036p531
$$ plain form
15431 -42535 -43437 -16510 -23251 -25970 -16216 -24488 -52006 -88753 -59360 -18262 -25875 -22355 -13020
15418 -13020 -3991 10915 34001 49734 12274 -9267 -1492 20927 14693 12166 -10196 -23555
15406 -23555 -28145 -32804 -38182 -40604 -14275 804 9073 17585 16489 1935 -10617 -24881 -16661
15393 -16661 -32579 -53428 -78558 -70115 -46040 -40099 -27525 15506 54233 52327 29023 11852
15381 11852 -8648 3489 32451 24323 45620 32550 11412 25471 43522 2482 -28110 -28457
15369 -28457 -32009 -46377 -22539 7646 10237 -20230 -48409 -64353 -54741 -40800 -13584 -12685 -28856
15356 -28856 -34715 -46833 -40059 -2800 -15378 1546 2632 -17782 -25602 -23860 -29782 -13498 -11365
15343 -11365 -11106 4472 16779 37338 24716 13879 15062 -7983 -12891 -10203 5316 10056 -4913
$$ packed form
15431d2535r02K6927o741k719R754q272k7518l6747K9393M1098p613L520R335
15418a3020R029J4906K3086J5733l7460k1541P775K2419o234k527k2362j3359
15406b3555m590m659n378k422K6329J5079Q269Q512j096j4554j2552j4264Q220
15393a6661j5918k0849k5130Q443K4075N941J2574M3031L8727j906k3304j7171
15381A1852k0500J2137K8962q128K1297j3070k1138J4059J8051m1040l0592l47
15369b8457l552j4368K3838L0185K591l0467k8179j5944R612J3941K7216Q99j6171
15356b8856n859j2118O774L7259j2578J6924J086k0414p820J742n922J6284K133
15343a1365K59J5578J2307K0559j2622j0837J183k3045m908K688J5519M740j4969
$$ plain form
15330 -4913 -23249 3274 5492 3669 24529 21845 10922 -41436 -32473 -35125 -21750 28036 26438
15317 26438 -1745 -14675 -20462 -12868 -8145 -11575 -22310 -22833 -30885 -13633 -11200 5784 33396
15304 33396 2473 -35359 -67432 -40080 -35270 -60438 -98396 -86169 -46937 -13271 -7160 -3813
15292 -3813 -36649 -54284 -31385 -26547 -11915 -9757 -34666 -12734 2624 -1749 -8420 -31633 -33887
15279 -33887 -31561 -31310 -14140 -5619 -14430 -10417 -19997 -31453 -27390 -8164 -26058 -18279 -16915 -28881
15265 -28881 -11637 -1733 39591 49155 7488 -11456 -22107 -18939 -23271 -7564 -12903 2336 -17305
15252 -17305 -36872 -42614 -39813 -51455 -66005 -82280 -68786 -67741 -36810 -25498 -38070 -29157
15240 -29157 8951 12383 -26289 -36746 -16021 -9771 -4666 3084 25059 12363 1074 13074
$$ packed form
15330d913j8336K6523K218j823K0860k684j0923n2358Q963k652J3375M9786j598
15317B6438k8183j2930n787P594M723l430j0735n23q052J7252K433J6984K7612
15304C3396l0923l7832l2073K7352M810k5168l7958J2227L9232L3666O111L347
15292c813l2836j7635K2899M838J4632K158k4909K1932J5358m373o671k3213k254
15279c3887K326K51J7170Q521q811M013r580j1456M063J9226j7894P779J364j1966
15265b8881J7244R904M1324R564m1667j8944j0651L168m332J5707n339J5239j9641
15252a7305j9567n742K801j1642j4550j6275J3494J045L0931J1312j2572Q913
15240b9157L8108L432l8672j0457K0725O250N105P750K1975j2696j1289J2000
$$ plain form
15228 13074 24319 15888 -23771 -47438 -28528 -28246 -39177 -47030 -64718 -49547 -38530 -21937
15216 -21937 9914 13634 10202 -18504 -53991 -52135 -44233 -47404 -67012 -93093 -66620 -35973 -20784
15203 -20784 -26061 -27810 -14960 -25531 -47446 -48288 -18241 3439 20956 -6057 -39031 -50215
15191 -50215 -44480 -18109 5646 8887 19082 -8252 -35860 -36565 -18417 -7141 411 11548 3173
15178 3173 -2987 14723 10256 -11647 -30188 -34893 -70726 -100710 -91256 -81589 -73237 -38971 -16667
15165 -16667 -13140 -17185 18072 5714 -29212 -50358 -29328 17581 26167 29511 5153 -25253
15153 -25253 -41227 -29372 -18557 -1562 30264 33024 24868 20648 5335 -13541 -4748 -71 11359
15140 11359 23558 -7494 -7231 16121 14957 31828 44542 9154 -24231 -59969 -31003 17338
$$ packed form
15228A3074J1245q431l9659k3667J8910K82j0931p853j7688J5171J1017J6593
15216b1937L1851L720l432k8706l5487J856P902l171j9608k6081K6473L0647J5189
15203b0784n277j749J2850j0571k1915q42L0047K1680J7517k7013l2974j1184
15191e0215N735K6371K3755L241J0195k7334k7608p05J8148J1276P552J1137q375
15178C173o160J7710m467k1903j8541m705l5833k9984R454R667Q352L4266K2304
15165a6667L527m045L5257j2358l4926k1146K1030M6909Q586L344k4358l0406
15153b5253j5974J1855J0815J6995L1826K760q156m220j5313j8876Q793M677J1430
15140A1359J2199l1052K63K3352j164J6871J2714l5388l3385l5738K8966M8341
$$ plain form
15128 17338 21127 29279 12582 -2102 -15533 30278 52712 28969 13199 12754 20308 13478 8217
15115 8217 -6321 -5649 17883 -1869 -18224 -36322 -20333 -2160 14159 18918 20966 -5314 -19109
15102 -19109 -14008 -309 -19459 -8310 -12743 1296 13189 -11228 -28900 -53011 -60221 -43720
15090 -43720 -49006 -44743 -37579 2035 15602 19173 -5928 -29401 -16172 10584 1947 8829 6542
15077 6542 2267 -7452 -36277 -28294 1312 6015 -10356 -24863 -37276 -34694 -27407 -25770 -27820
15064 -27820 -21274 -41126 -76792 -63367 -52704 -43300 -41710 -17679 -33194 -33603 -35209 -27434 -50289
15051 -50289 -66897 -69923 -42932 -36502 -21806 -8134 -15731 -22441 -30906 -26313 -3836 11054 11022
15038 11022 21943 -17614 -79904 -64738 -28911 -38517 -23671 -14613 -21272 -25557 -14358 -12455 -36175
$$ packed form
15128A7338L789Q152j6697j4684j3431M5811K2434k3743j5770m45P554o830n261
15115H217j4538O72K3532j9752j6355j8098J5989J8173J6319M759K048k6280j3795
15102a9109N101J3699j9150J1149m433J4039J1893k4417j7672k4111p210J6501
15090d3720n286M263P164L9614J3567L571k5101k3473J3229K6756q637O882k287
15077F542m275r719k8825P983K9606M703j6371j4507j2413K582P287J637k050
15064b7820O546j9852l5666J3425J0663R404J590K4031j5515m09j606P775k2855
15051e0289j6608l026K6991O430J4696J3672p597o710q465M593K2477J4890l2
15038A1022J0921l9557o2290J5166L5827r606J4846R058o659m285J1199J903k3720
$$ plain form
15025 -36175 -7137 -4071 -11066 -12099 -10904 -1099 34208 53891 90127 57308 18722 -8776 627
15012 627 5854 10212 9313 5857 -4116 36195 84075 72070 46876 63009 59731 25243 -12468
14999 -12468 -24773 -36479 -57771 -79340 -62633 -28351 -10131 33684 34150 18204 14861 -1498
14987 -1498 -15673 406 12996 27708 -20155 -6712 8088 -19061 -48816 -29302 18222 11625
14975 11625 17259 -18915 -31691 -20919 -9781 10646 1089 6718 -10551 -28705 -16209 -5328
14963 -5328 -1257 -3329 14694 32987 17774 -9330 -5830 7085 23968 -1728 -49444 -76263
14951 -76263 -90451 -73997 -19796 -1455 -2705 -6943 7773 -1793 -30438 -22099 -8953 -25820
14939 -25820 -11879 -2234 -22572 -17449 -25572 -19206 581 17349 48860 57745 50556 25876 14423
$$ packed form
15025c6175K9038L066o995j033J195R805L5307J9683L6236l2819l8586k7498R403
15012F27N227M358q99l456r973M0311M7880j2005k5194J6133l278l4488l7711
14999a2468j2305j1706k1292k1569J6707L4282J8220M3815M66j5946l343j6359
14987a498j4175J6079J2590J4712m7863J3443J4800k7149k9755J9514M7524o597
14975A1625N634l6174j2776J0772J1138K0427r557N629j7269j8154J2496J0881
14963e328M071k072J8023J8293j5213k7104L500J2915J6883k5696m7716k6819
14951g6263j4188J6454N4201J8341j250m238J4716r566k8645Q339J3146j6867
14939b5820J3941R645k0338N123q123O366J9787J6768L1511Q885p189k4680j1453
$$ plain form
14926 14423 24374 54387 32863 -12043 12950 12971 -9493 -5542 13858 -15366 -4758 18523 14997
14913 14997 15128 -20099 -63941 -47245 -18415 -21212 -59719 -55808 -34314 -14047 -17158 -10206 1632
14900 1632 -12787 -30255 -23457 -7574 977 -3894 -57782 -68416 -43394 -27131 -34880 -45324 -22980
14887 -22980 -35775 -72914 -72614 -29082 11003 -8127 -10187 -10881 -18207 -25979 -16199 -23170 -16552 121
14873 121 -24683 -12973 12359 5103 -21954 -23589 -20025 5183 22244 36216 22665 19378 22503
14860 22503 19709 -1913 -16866 -30042 -21463 -2477 -7469 9150 13799 -22779 -17246 -33848 -21132
14847 -21132 -3166 -34462 -63776 -57992 -39225 -42258 -28656 -7722 -26887 -25667 5137 8057
14835 8057 -17232 -21895 14908 44229 18465 -4570 -22127 -37765 -30457 -32826 -28922 -22000 -8516
$$ packed form
14926A4423R951L0013k1524m4906K4993K1k2464L951J9400k9224J0608K3281l526
14913A4997J31l5227m3842J6696K8830k797l8507L911K1494K0267l111O952J1838
14900A632j4419j7468O798J5883Q551m871n3888j0634K5022J6263p749j0444K2344
14887b2980j2795l7139L00M3532M0085j9130k060o94p326p772R780o971O618J6673
14873A21k4804J1710K5332p256k7057j635L564K5208J7061J3972j3551l287L125
14860B2503k794k1622j4953j3176Q579J8986m992J6619M649l6578N533j6602J2716
14847b1132J7966l1296k9314N784J8767l033J3602K0934j9165J220L0804K920
14835H057k5289m663L6803K9321k5764k3035j7557j5638P308k369L904O922J3484
$$ plain form
14822 -8516 -985 11995 18739 42326 40621 19248 41338 21598 -46160 -53719 -21759 -1844 -10827
14809 -10827 -23050 -1998 9228 10978 9691 16176 38295 29787 -1899 -16329 3601 -3198 -11110
14796 -11110 -3183 13665 -1608 -44231 -76734 -65490 -84821 -85071 -41822 -31064 -13923 12618
14784 12618 -4692 -7859 -3049 -20269 -48210 -56138 -46338 -37084 -37208 -40516 -2872 389 -3381 5814
14770 5814 7339 2732 -27040 -13393 -21837 -15539 -4856 -13212 -42346 -48739 -41848 -35430 -29292 -11792
14756 -11792 4825 27913 41423 40709 54290 67702 53745 56947 39242 12716 -10783 -3812
14744 -3812 5411 -7826 -5518 -9399 -22982 -26814 16415 12004 4731 17463 26504 7676 -3818
14731 -3818 12516 23737 -5333 546 -9849 -36316 -29725 -27372 -16730 3213 35504 32964 14395
$$ packed form
14822h516P531J2980O744K3587j705k1373K2090j9740o7758p559L1960J9915q983
14809a0827j2223K1052J1226J750j287O485K2119q508l1686j4430J9930o799p912
14796a1110P927J6848j5273m2623l2503J1244j9331k50M3249J0758J7141K6541
14784A2618j7310l167M810j7220k7941p928R800R254j24l308L7644L261l770R195
14770E814J525m607k9772J3647q444O298J0683q356k9134o393O891O418O138J7500
14756a1792J6617K3088J3510p14J3581J3412j3957L202j7705k6526k3499O971
14744c812R223j3237K308l881j3583l832M3229m411p273J2732R041j8828j1494
14731c818J6334J1221k9070N879j0395k6467O591K353J0642J9943L2291k540j8569
$$ plain form
14718 14395 17647 54718 55347 17259 36577 67189 17936 -24881 -27914 -31921 -51518 -40560 -20131
14705 -20131 -263 35819 47698 28402 -12751 -19416 -4053 4928 -9147 -19291 -18007 30697
14693 30697 75997 55367 46324 24945 31315 60605 55452 40773 46319 33669 10433 -16372
14681 -16372 -11682 24914 27627 3030 5598 -5063 -19884 -22205 -18487 -55239 -70815 -22427 22657
14668 22657 8876 -35683 -49486 -31609 -19970 -30879 -35644 -30720 -19190 1669 9312 7182
14656 7182 4016 -2589 8178 8160 -1332 -34280 -33242 -11361 7004 -15877 13279 50147 43274
14643 43274 5648 -2994 -34242 -53365 -24608 2403 3732 18365 33837 28645 -14728 -41985
14631 -41985 -20372 28169 10794 3654 -5049 -44289 -38776 -30276 -3192 -18902 -27316 -15933 -16567
$$ packed form
14718A4395L252L7071O29l8088J9318L0612m9253m2817l033m007j9597J0958K0429
14705b0131J9868L6082J1879j9296m1153o665J5363Q981j4075j0144J284M8704
14693C0697M5300k0630r043k1379O370K9290n153j4679N546j2650k3236k6805
14681a6372M690L6596K713k4597K568j0661j4821k321L718l6752j5576M8388M5084
14668B2657j3781m4559j3803J7877J1639j0909m765M924J1530K0859P643k130
14656G182l166o605J0767j8r492l2948J038K1881J8365k2881K9156L6868o873
14643D3274l7626q642l1248j9123K8757K7011J329J4633J5472n192m3373k7257
14631d1985K1613M8541j7375p140q703l9240N513Q500K7084j5710q414J1383o34
$$ plain form
14618 -16567 -17996 -15580 -10250 19640 20309 -6667 -24073 -36285 -51438 -45645 -25688 -6697 -6206
14605 -6206 -4526 -6615 -14179 -10487 46159 81835 87801 74952 47452 43682 31962 25157 -25382
14592 -25382 -38486 -34475 -20094 3081 28988 37667 -910 -37189 -60130 -59426 -59261 -45961 -57502
14579 -57502 -64609 -45704 -34251 -29592 -31055 -8671 6308 18004 17250 20856 23672 -14474 -52037
14566 -52037 -66388 -41608 -17489 469 -7647 -38104 -32245 15072 9752 6746 6140 -15868 -42539
14553 -42539 -47233 -42584 -3808 37048 29009 -7253 -23669 16729 44925 48281 34230 13821
14541 13821 20034 14332 24651 26287 57396 46533 6952 -2740 18005 34960 30277 33451 45757
14528 45757 11031 -27995 -26032 3118 24856 20474 25324 79040 73518 71609 58013 40154 25182
$$ packed form
14618a6567j429K416N330K9890O69k6976j7406j2212j5153N793J9957J8991M91
14605f206J680k089p564L692N6646L5676N966j2849k7500l770j1720o805n0539
14592b5382j3104M011J4381K3175K5907Q679l8577l6279k2941P04J65J3300j1541
14579e7502p107J8905J1453M659j463K2384J4979J1696p54L606K816l8146l7563
14566e2037j4351K4780K4119J7958q116l0457N859M7317n320l006o06k2008k6671
14553d2539m694M649L8776M0856q039l6262j6416M0398K8196L356j4051k0409
14541A3821O213n702J0319J636L1109j0863l9581r692K0745J6955m683L174J2306
14528D5757l4726l9026J963K9150K1738m382M850N3716n522j909j3596j7859j4972
$$ plain form
14515 25182 -3197 -5568 -273 -5246 -38199 -18671 -17546 -8847 127 5404 30798 39937 7279
14502 7279 -15376 -24334 -45902 -38070 -6539 -2982 -12362 -15776 -18700 5363 6556 683 10604 21931
14488 21931 54547 63846 46357 -1073 -21972 -7752 7777 9241 12742 -12467 16961 46662
14476 46662 36999 43302 29046 10974 -17060 173 2543 2929 -20841 -23326 -19519 4879 13944
14463 13944 19771 -4450 6329 17105 33758 15357 23839 35424 43368 -16722 -212 25137
14451 25137 22753 -262 -10877 -3024 -975 -24108 -37079 -40635 -58318 -112590 -76670 -46325
14439 -46325 -42121 -50680 -81595 -46251 -28730 -57336 -56843 -57085 -36334 -27642 -63983 -79654 -67180
14426 -67180 -35389 -26497 -43157 -44080 -32203 -24011 -30064 -26257 -22831 -412 -16131 -48020 -48925
$$ packed form
14515B5182k8379k371N295m973l2953J9528J125Q699Q974N277K5394R139l2658
14502G279k2655q958k1568P832L1531L557r380l414k924K4063J193n873R921J1327
14488B1931L2616R299j7489m7430k0899J4220J5529J464L501k5209K9428K9701
14476D6662r663O303j4256j8072k8034J7233K370L86k3770k485L807K4398R065
14463A3944N827k4221J0779J0776J6653j8401Q482J1585P944o0090J6510K5349
14451B5137k384k3015j0615P853K049k3133j2971l556j7683n4272L5920L0345
14439d6325M204q559l0915L5344J7521k8606M93k42K0751Q692l6341j5671J2474
14426f7180L1791Q892j6660r23J1877Q192o053L807L426K2419j5719l1889r05
$$ plain form
14413 -48925 -23037 17614 9662 -11118 -1180 663 -6184 -46016 -40041 -29480 -51357 -62912 -59384
14400 -59384 -10495 52482 55071 59825 67110 67728 59468 50225 51863 69111 43244 26118 5708
14387 5708 4086 35695 54264 39854 13035 15177 44917 2561 -6863 2169 11302 20807 -3894
14374 -3894 -22355 -17614 -25053 -9931 -9193 -14211 -4889 418 851 17203 41629 11306 -3700 -45
14360 -45 21748 19927 21669 15453 22273 24717 27695 43241 13916 -37936 -22711 2018 -599 14205
14346 14205 19123 30611 42787 53800 37814 19466 16910 22183 28130 40804 54100 41700
14334 41700 -23964 -27356 -20364 -21506 -429 44989 64389 69874 47669 21917 17226 5578 269
14321 269 38600 63042 69632 71196 65143 37652 36397 44491 38612 27746 30772 30102 49367 52670
$$ packed form
14413d8925K5888M0651p952k0780R938J843o847l9832N975J0561k1877j1555L528
14400e9384M8889O2977K589M754P285O18q260r243J638J7248k5867j7126k0410
14387E708j622L1609J8569j4410k6819K142K9740m2356r424R032R133R505k4701
14374c894j8461M741p439J5122P38n018R322N307M33J6352K4426l0323j5006L655
14360d5K1793j821J742o216O820K444K978J5546k9325n1852J5225K4729k617J4804
14346A4205M918J1488J2176J1013j5986j8348k556N273N947J2674J3296j2400
14334D1700o5664l392O992j142K1077M5418J9400N485k2205k5752m691j1648n309
14321B69L8331K4442O590J564o053k7491j255Q094n879j0866L026o70J9265L303
$$ plain form
14307 52670 40075 37869 39248 57761 60987 74678 61398 1145 -6089 -4568 42031 51886 26124
14294 26124 23282 11086 13241 -14546 -32027 -15905 -14201 29988 48447 60112 45600 21368
14282 21368 37816 58655 67587 37782 21276 26706 16931 14358 5882 16210 32084 83765 84907
14269 84907 55135 24546 14136 41011 36159 -5313 -22841 -33279 -33510 -2806 11876 16032
14257 16032 20180 2758 4297 36848 27746 24726 22371 8050 13115 30529 21869 34919 44535
14244 44535 54522 33842 21996 46015 63099 43247 15358 2057 17756 27922 40768 66151
14232 66151 63531 52912 64363 70265 36975 -1175 12089 27822 17296 14514 28477 11959
14220 11959 -2875 -1300 -14529 -17800 449 -11699 -27011 -24535 -1917 -13242 -127 27826
$$ packed form
14307E2670j2595k206J379J8513L226J3691j3280o0253p234J521M6599R855k5762
14294B6124k842j2196K155k7787j7481J6122J704M4189J8459J1665j4512k4232
14282B1368J6448K0839Q932k9805j6506N430r775k573q476J0328J5874N1681J142
14269H4907k9772l0589j0410K6875m852m1472j7528j0438k31L0704J4682M156
14257A6032M148j7422J539L2551r102l020k355j4321N065J7414q660J3050R616
14244D4535R987k0680j1846K4019J7084j9852k7889j3301J5699J0166J2846K5383
14232F6151k620j0619J1451N902l3290l8150J3264J5733j0526k782J3963j6518
14220A1959j4834J575j3229l271J8249j2148j5312K476K2618j1325J3115K7953
$$ plain form
14208 27826 44158 63776 68782 50586 11288 -5806 -485 2351 1409 -25822 -24409 11254 37720
14195 37720 24268 31990 48514 59922 67752 74979 69506 54048 12832 5081 1015 18403 50658
14182 50658 30275 -6228 11600 19908 21440 10050 16168 70539 61456 54003 62465 55942 68414
14169 68414 71103 25914 30097 20481 24731 30726 47702 73228 52590 48203 74033 95681 91907
14156 91907 66333 40723 13933 -17548 -16388 759 864 -23579 -33257 2914 7010 37571 52989
14143 52989 58352 56841 63798 45858 28377 18540 13611 8705 21260 30973 41162 30835 40306
14130 40306 14917 8634 7376 510 -1363 37159 46941 42384 25204 27298 47330 63982 69299
14117 69299 63805 55408 61680 83807 101298 98738 57531 58845 67031 29773 47084 43103 40180
$$ packed form
14208B7826J6332J9618N006j8196l9298j7094N321K836r42k7231J413L5663K6466
14195C7720j3452P722J6524J1408P830P227n473j5458m1216p751m066J7388L2255
14182E0658k0383l6503J7828Q308J532j1390O118N4371r083p453Q462o523J2472
14169F8414K689m5189M183r616M250N995J6976K5526k0638m387K5830K1648l774
14156I1907k5574k5610k6790l1481J160J7147J05k4443r678L6171M096L0561J5418
14143E2989N363j511O957j7940j7481r837m929m906J2555R713J0189j0327R471
14130D0306k5389o283j258o866j873L8522R782m557j7180K094K0032J6652N317
14117F9299n494q397O272K2127J7491k560m1207J314Q186l7258J7311l981k923
$$ plain form
14104 40180 54156 51306 43651 54778 58031 47829 26486 50662 73055 90241 89272 56295 58678
14091 58678 70535 46184 33477 22445 19688 1274 10090 7957 4187 14877 8764 25350 28868
14078 28868 38315 49603 23594 10293 25042 10331 -7582 -15799 -25102 -30522 -47170 -4642
14066 -4642 21921 313 15049 29231 38884 11473 8761 27407 8852 5135 30567 31955 8001
14053 8001 13043 36655 26858 38449 40831 62422 91396 95223 64323 57199 51445 53590 58306
14040 58306 78943 72912 71215 63061 20526 -735 15150 42989 47786 22214 19206 34976 58476
14027 58476 81697 78264 71264 80500 66322 76427 75195 96614 85348 57727 15590 23098 41500
14014 41500 75051 66699 50162 36288 53156 58475 59419 60250 72496 35980 20414 52269 72143
$$ packed form
14104D0180J3976k850p655J1127L253j0202k1343K4176K2393J7186r69l2977K383
14091E8678J1857k4351j2707j1032k757j8414Q816k133l770J0690o113J6586L518
14078B8868R447J1288k6009j3301J4749j4711j7913q217r303n420j6648M2528
14066d642K6563k1608J4736J4182R653k7411k712J8646j8555l717K5432J388k3954
14053H001N042K3612r797J1591K382K1591K8974L827l0900p124n754K145M716
14040E8306K0637o031j697q154m2535k1261J5885K7839M797k5572l008J5770K3500
14027E8476K3221l433p000R236j4178J0105j232K1419j1266k7621m2137P508J8402
14014D1500L3551q352j6537j3874J6868N319R44Q31J2246l6516j5566L1855J9874
$$ plain form
14001 72143 53927 17888 34616 51135 66143 42743 44279 59308 46668 55482 53830 53652 57990
13988 57990 51055 52423 48161 56397 55157 73734 78580 69730 83311 75710 82991 55984 59567 75941
13974 75941 60256 48216 50947 64400 53073 70810 89716 105382 73398 44074 56363 36787
13962 36787 37521 51356 83844 101725 86580 68769 64217 94288 81845 85260 74566 103570
13950 103570 123446 88546 80035 102943 79528 57454 70077 100935 120614 111887 78684 28895
13938 28895 15194 36645 20728 52914 72745 86812 81091 74446 106448 114580 102344 70100
13926 70100 46346 34871 76122 89061 57435 68561 90616 115837 80447 51620 71745 91998
13914 91998 69640 48350 41004 69855 75276 76088 99571 95552 70333 31243 15258 27270 55531
$$ packed form
14001G2143j8216l6039J6728J6519J5008k3400J536J5029j2640Q814j652j78M338
13988E7990o935J368m262Q236j240J8577M846q850J3581p601P281k7007L583J6374
13974G5941j5685j2040K731J3453j1327J7737J8906J5666l1984k9324J2289j9576
13962C6787P34J3835L2488J7881j5145j7811m552L0071j2443L415j0694K9004
13950A03570J9876l4900q511K2908k3415k2074J2623L0858J9679q727l3203m9789
13938B8895j3701K1451j5917L2186J9831J4067n721o645L2002Q132j2236l2244
13926G0100k3754j1475M1251J2939l1626J1126K2055K5221l5390k8827K0125K0253
13914I1998k2358k1290p346K8851N421Q12K3483m019k5219l9090j5985J2012K8261
$$ plain form
13901 55531 71251 74129 100583 90740 94868 100925 97522 89835 73688 72069 40454 51796 73413
13888 73413 81847 67208 73091 90857 55277 43684 48042 79894 99893 67828 55602 84353
13876 84353 115407 134490 115043 127320 136031 163783 150820 136140 107948 91555 106673 127812
13864 127812 127989 135473 124639 119320 130553 118984 113543 101741 108658 101146 102658 90722 83314
13851 83314 92001 89665 73241 73651 85495 96867 110695 110867 112394 92415 78540 66094 92542
13838 92542 127173 118884 121424 123053 129123 117742 139438 125766 61860 55776 107759 121558 105260
13825 105260 109693 136512 119124 86845 53993 69476 104073 101837 78509 102348 98095 88803
13813 88803 134477 152227 165144 165105 178881 196748 153143 139432 152164 152633 136751 99329 76632
$$ packed form
13901E5531J5720K878K6454r843M128O057l403p687j6147j619l1615J1342K1617
13888G3413Q434j4639N883J7766l5580j1593M358L1852J9999l2065j2226K8751
13876H4353L1054J9083j9447J2277Q711K7752j2963j4680k8192j6393J5118K1139
13864A27812J77P484j0834n319J1233j1569n441j1802O917p512J512j1936p408
13851H3314Q687k336j6424M10J1844J1372J3828J72J527j9979j3875j2446K6448
13838I2542L4631q289K540J629O070j1381K1696j3672o3906o084N1983J3799j6298
13825A05260M433K6819j7388l2279l2852J5483L4597k236k3328K3839m253r292
13813H8803M5674J7750J2917l9J3776J7867m3605j3711J2732M69j5882l7422k2697
$$ plain form
13800 76632 57254 57661 65971 110482 142976 141822 118888 102106 99428 121606 110755 79903 77762
13787 77762 96690 100413 109200 122213 130157 135067 165868 176038 194432 178097 158878 150857 138704
13774 138704 121153 117629 165118 169481 133602 132160 129053 119671 137561 146808 138666 121971 114959
13761 114959 142532 167716 176557 185634 167670 158670 170377 148465 117269 119452 137886 145012
13749 145012 154098 168265 170793 145000 106525 93122 113389 140671 149064 178049 187133 170604
13737 170604 181275 179220 168717 178047 170422 134538 115965 130196 158603 159632 141026 162762
13725 162762 171318 162633 159048 191513 192562 158776 148280 171525 177781 175941 184220 189731 214427
13712 214427 214676 194058 184512 180205 183565 184926 174548 158679 150208 156761 184725 179606 163245
$$ packed form
13800G6632j9378M07Q310M4511L2494j154k2934j6782k678K2178j0851l0852k141
13787G7762J8928L723Q787J3013P944M910L0801J0170J8394j6335j9219q021j2153
13774A38704j7551l524M7489M363l5879j442l107r382J7890R247q142j6695p012
13761A14959K7573K5184Q841R077j7964r000J1707k1912l1196K183J8434P126
13749A45012R086J4167K528k5793l8475j3403K0267K7282Q393K8985R084j6529
13737A70604J0671k055j0503R330p625l5884j8573J4231K8407J029j8606K1736
13725A62762Q556q685l585L2465J049l3786j0496K3245O256j840Q279N511K4696
13712B14427K49k0618r546m307L360J361j0378j5869q471O553K7964n119j6361
$$ plain form
13699 163245 155241 148062 143694 158443 174152 199847 206387 173031 168305 188717 141795 146323 149009
13686 149009 164076 174297 183091 196947 179493 177317 181071 188147 210582 247954 254402 245990 216119
13673 216119 208232 214584 218366 222865 212171 195873 193847 200444 221546 188626 151503 160423 193551
13660 193551 209004 222081 232667 231067 240172 259235 262216 263176 259214 251645 262072 271642 246174
13647 246174 218545 209231 232486 241353 257317 244876 231801 229169 241231 256646 299423 311134
13635 311134 290982 266917 269168 275915 266810 275705 286528 299451 297066 297349 283852 280965 268641
13622 268641 261801 264774 265594 267129 242203 254418 271526 290558 285072 276422 295374 284211 257274
13609 257274 236226 259597 258319 250388 272622 266536 271700 292640 305055 296264 270113 276873 287257
$$ packed form
13699A63245q004p179m368J4749J5709K5695O540l3356m726K0412m6922M528K686
13686A49009J5067J0221Q794J3856j7454k176L754P076K2435L7372O448q412k9871
13673B16119p887O352L782M499j0694j6298k026O597K1102l2920l7123Q920L3128
13660A93551J5453J3077J0586j600R105J9063K981R60l962p569J0427R570k5468
13647B46174k7629r314K3255Q867J5964j2441j3075k632J2062J5415M2777J1711
13635C11134k0152k4065K251O747r105Q895J0823J2923k385K83j3497k887j2324
13622B68641o840K973Q20J535k4926J2215J7108J9032n486q650J8952j1163k6937
13609B57274k1048K3371j278p931K2234o086N164K0940J2415q791k6151O760J0384
$$ plain form
13596 287257 279750 300387 327862 318638 302120 272284 269092 270813 266673 279535 287403 318014 345347
13583 345347 373269 372318 339592 308669 281081 318543 344262 350519 346678 319300 311827 289561
13571 289561 312667 365971 372857 327956 307055 313753 338183 348759 366788 397689 392771 397121
13559 397121 390628 381508 382593 364884 370942 384400 382540 392390 388003 408048 397844 390471 408447
13546 408447 432834 402474 400070 434195 412006 412757 408829 396054 421780 433371 442141 430823
13534 430823 423161 425649 428960 424184 412056 408836 415365 425677 442572 454963 429735 416269 427108
13521 427108 467335 509162 539925 524306 483105 472139 507016 516839 512673 490109 460351 475604
13509 475604 503203 508863 489315 502361 500726 502137 505941 503917 516752 523038 537822 567735 564403
$$ packed form
13596B87257p507K0637K7475r224j6518k9836l192J721m140J2862P868L0611K7333
13583C45347K7922r51l2726l0923k7588L7462K5719O257l841k7378p473k2266
13571B89561K3106N3304O886m4901k0901O698K4430J0576J8029L0901m918M350
13559C97121o493r120J085j7709O058J3458j860R850m387K0045j0204p373J7976
13546D08447K4387l0360k404L4125k2189P51l928j2775K5726J1591Q770j1318
13534D30823p662K488L311m776j2128l220O529J0312J6895J2391k5228j3466J0839
13521D27108M0227M1827L0763j5619m1201j0966L4877R823m166k2564k9758J5253
13509D75604K7599N660j9548J3046j635J411L804k024J2835O286J4784K9913l332
$$ plain form
13496 564403 554754 559134 548683 587805 585137 582870 585529 572162 573246 551934 546078 556896 568768
13483 568768 593642 604766 616706 624168 619537 638578 674332 700782 715212 683899 647198 648434
13471 648434 640545 650861 693661 672037 664148 679071 685590 674529 694210 748952 782818 784525
13459 784525 794878 820359 829053 835670 842296 867977 896245 942562 1003020 1064589 1091561 1142515
13447 1142515 1188424 1201775 1206393 1168958 1104232 1085072 1046283 1008557 991937 984591 929702 918893
13435 918893 951012 955094 963002 971808 979821 1016918 1014349 978390 940924 921808 966215 984087
13423 984087 970521 958097 957929 974659 1000438 1016404 1036181 1050754 1021023 1022349 1050120 1071231
13411 1071231 1065803 1063106 1073160 1103156 1107815 1118677 1138200 1159823 1205028 1186463 1160887 1161952
$$ packed form
13496E64403r649M380j0451L9122k668k267K659j3367J084k1312n856J0818J1872
13483E68768K4874J1124J1940P462m631J9041L5754K6450J4430l1313l6701J236
13471F48434p889J0316M2800k1624p889J4923O519j1061J9681N4742L3866J707
13459G84525J0353K5481Q694O617O626K5681K8268M6317O0458O1569K6972N0954
13447A142515M5909J3351M618l7435o4726j9160l8789l7726j6620p346n4889j0809
13435I18893L2119M082P908Q806Q013L7097k569l5959l7466j9116M4407J7872
13423I84087j3566j2424j68J6730K5779J5966J9777J4573k9731J326K7771K1111
13411A071231n428k697J0054K9996M659J0862J9523K1623M5205j8565k5576J065
$$ plain form
13399 1161952 1212887 1262307 1287363 1260187 1250336 1243378 1263284 1244936 1242353 1257995 1295498 1318766
13387 1318766 1353347 1350076 1325356 1308998 1327068 1370285 1388616 1389718 1399218 1408275 1405438 1431354
13375 1431354 1427830 1419623 1445849 1488268 1497836 1495462 1518826 1550293 1577495 1561825 1599224 1649590
13363 1649590 1662052 1653217 1686096 1695889 1699320 1723885 1749132 1750353 1740462 1763667 1800819 1852387
13351 1852387 1896755 1895217 1924963 1932014 1972926 2016198 2016586 2013852 2009179 2018554 2023038 2050407 2084574
13338 2084574 2116773 2154632 2190423 2217912 2242790 2283485 2308871 2347321 2367256 2395407 2428079
13327 2428079 2440617 2475006 2488416 2531158 2567475 2597544 2640957 2669740 2688309 2767152 2802180
13316 2802180 2830182 2887203 2957411 3034102 3086396 3097679 3125093 3148318 3162928 3193123 3245024
$$ packed form
13399A161952N0935M9420K5056k7176r851o958J9906j8348k583J5642L7503K3268
13387A318766L4581l271k4720j6358J8070M3217J8331J102R500R057k837K5916
13375A431354l524q207K6226M2419R568k374K3364L1467K7202j5670L7399N0366
13363A649590J2462q835L2879R793L431K4565K5247J221r891K3205L7152N1568
13351A852387M4368j538K9746P051M0912M3272L88k734m673R375M484K7369L4167
13338B084574L2199L7859L5791K7489K4878M0695K5386L8450J9935K8151L2672
13327B428079J2538L4389J3410M2742L6317L0069M3413K8783J8569P8843L5028
13316B802180K8002N7021P0208P6691N2294J1283K7414K3225J4610L0195N1901
$$ plain form
13305 3245024 3323117 3385261 3416931 3453544 3500960 3573726 3633049 3679765 3718156 3773211 3823641
13294 3823641 3859980 3911676 3974230 4053569 4139183 4221568 4351724 4424720 4455728 4498740 4562221
13283 4562221 4625483 4700934 4810287 4904689 4995247 5060179 5156980 5295586 5377926 5457300 5558229
13272 5558229 5642711 5731097 5825991 5939804 6075866 6193033 6304796 6427772 6555329 6679782
13262 6679782 6802893 6930684 7087822 7231108 7374835 7513210 7627788 7767397 7893492
13253 7893492 8051913 8268440 8444574 8615550 8801116 8990824 9182084 9365495 9590743
13244 9590743 9823838 10023532 10230689 10453689 10682244 10908962 11151745 11474484 11736240
13235 11736240 11977740 12244286 12510872 12811749 13121450 13429520 13741104 14013070 14328633
$$ packed form
13305C245024P8093O2144L1670L6613M7416P2766N9323M6716L8391N5055N0430
13294C823641L6339N1696O2554P9339Q5614Q2385J30156P2996L1008M3012O3481
13283D562221O3262P5451J09353R4402R0558O4932R6801J38606Q2340P9374J00929
13272E558229Q4482Q8386R4894J13813J36062J17167J11763J22976J27557J24453
13262F679782J23111J27791J57138J43286J43727J38375J14578J39609J26095
13253G893492J58421K16527J76134J70976J85566J89708J91260J83411K25248
13244I590743K33095J99694K07157K23000K28555K26718K42783L22739K61756
13235A1736240K41500K66546K66586L00877L09701L08070L11584K71966L15563
$$ plain form
13226 14328633 14666861 15009141 15370610 15748504 16131982 16527342 16900577 17314916 17697993
13217 17697993 18087386 18471651 18885676 19362278 19802009 20251519 20677330 21089672 21526189
13208 21526189 21977443 22442144 22890276 23334890 23788847 24268961 24730560 25147065 25587786
13199 25587786 26053259 26503318 26921733 27331333 27748241 28108231 28436802 28773503 29069964
13190 29069964 29376347 29661302 29931467 30178060 30402708 30598882 30752969 30842951 30915233 30979947
13180 30979947 31032230 31055607 31035528 30970071 30900455 30827275 30719276 30591561 30418528 30220900
13170 30220900 30032429 29789371 29530486 29279467 28997155 28670893 28331441 28013079 27684625
13161 27684625 27375558 27060200 26683621 26293159 25903155 25538934 25203180 24822815 24394975
$$ packed form
13226A4328633L38228L42280L61469L77894L83478L95360L73235M14339L83077
13217A7697993L89393L84265M14025M76602M39731M49510M25811M12342M36517
13208B1526189M51254M64701M48132M44614M53957M80114M61599M16505M40721
13199B5587786M65473M50059M18415M09600M16908L59990L28571L36701K96461
13190B9069964L06383K84955K70165K46593K24648J96174J54087Q9982P2282O4714
13180C0979947N2283K3377k0079o5457o9616p3180j07999j27715j73033j97628
13170C0220900j88471k43058k58885k51019k82312l26262l39452l18362l28454
13161B7684625l09067l15358l76579l90462l90004l64221l35754l80365m27840
$$ plain form
13152 24394975 24033305 23661778 23282605 22908007 22555558 22204792 21823909 21436080 21035155
13143 21035155 20665737 20308399 19948732 19606149 19312001 19003726 18680491 18345222 17998307
13134 17998307 17669645 17389445 17119981 16776319 16451786 16172199 15907303 15630097 15367169
13125 15367169 15109467 14860770 14612861 14346373 14058603 13810800 13588262 13392533 13167114
13116 13167114 12963694 12759586 12557057 12384332 12197190 11967864 11732301 11520269 11339469
13107 11339469 11168740 11022275 10808561 10612346 10463452 10310635 10133661 9962420 9832052
13098 9832052 9668067 9484074 9312644 9178339 9044768 8947154 8832609 8695491 8545327 8420022
13088 8420022 8274204 8156075 8048767 7936520 7806005 7701456 7601219 7519189 7380463 7278681
$$ packed form
13152B4394975l61670l71527l79173l74598l52449l50766l80883l87829m00925
13143B1035155l69418l57338l59667l42583k94148l08275l23235l35269l46915
13134A7998307l28662k80200k69464l43662l24533k79587k64896k77206k62928
13125A5367169k57702k48697k47909k66488k87770k47803k22538j95729k25419
13116A3167114k03420k04108k02529j72725j87142k29326k35563k12032j80800
13107A1339469j70729j46465k13714j96215j48894j52817j76974j71241j30368
13098I832052j63985j83993j71430j34305j33571r7614j14545j37118j50164j25305
13088H420022j45818j18129j07308j12247j30515j04549j00237q2030j38726j01782
$$ plain form
13078 7278681 7172776 7061123 6963093 6888215 6826262 6710857 6587350 6481782 6409316 6341056
13068 6341056 6253084 6155760 6045383 5986792 5874110 5773261 5715366 5672940 5597837 5511816 5403481
13057 5403481 5308670 5233793 5186935 5185777 5133487 5038775 4950336 4865429 4800332 4749508 4701591
13046 4701591 4646289 4581841 4530684 4473554 4409892 4341816 4305514 4265156 4203615 4125942 4046109
13035 4046109 4001711 3954172 3911802 3880401 3828927 3810633 3765493 3727221 3658879 3602854 3533634
13024 3533634 3478617 3442206 3430710 3430115 3372331 3325473 3298283 3230526 3184634 3154381 3124617 3150116
13012 3150116 3123731 3078006 3021935 2972536 2886943 2814363 2800820 2780112 2731260 2719828 2709377
13001 2709377 2688947 2652881 2596524 2556545 2549405 2538571 2504269 2466300 2437593 2446840 2414258 2381651
$$ packed form
13078G278681j05905j11653r8030p4878o1953j15405j23507j05568p2466o8260
13068F341056q7972r7324j10377n8591j12682j00849n7895m2426p5103q6021j08335
13057E403481r4811p4877m6858j158n2290r4712q8439q4907o5097n0824m7917
13046D701591n5302o4448n1157n7130o3662o8076l6302m0358o1541p7673p9833
13035D046109m4398m7539m2370l1401n1474j8294m5140l8272o8342n6025o9220
13024C533634n5017l6411j1496n95n7784m6858k7190o7757m5892l0253k9764K5499
13012C150116k6385m5725n6071m9399q5593p2580j3543k0708m8852j1432j0451
13001B709377k0430l6066n6357l9979p140j0834l4302l7969k8707R247l2582l2607
$$ plain form
12989 2381651 2349405 2376427 2376487 2337643 2302545 2250197 2231685 2225611 2172622 2147869 2130783 2134390
12977 2134390 2120608 2072745 2062760 2061298 2042592 2009559 1982428 1948722 1944587 1948483 1941295 1915780
12965 1915780 1906708 1893742 1871217 1838216 1803155 1795008 1770287 1728405 1708343 1721935 1721721 1703719
12953 1703719 1686895 1675922 1685300 1658587 1627353 1607509 1607903 1594376 1567960 1543879 1530855 1525662
12941 1525662 1510792 1531656 1511549 1494135 1473090 1444112 1417898 1405646 1395088 1418160 1416468
12930 1416468 1425836 1404929 1386467 1369276 1373583 1370160 1390050 1402967 1393890 1421008 1470957 1526839
12918 1526839 1574158 1600573 1610859 1621029 1601152 1552341 1461117 1367469 1351484 1312575 1251848
12907 1251848 1236248 1207499 1158864 1153605 1142883 1095286 1086075 1097603 1099112 1072569 1082704 1077351
$$ packed form
12989B381651l2246K7022O0l8844l5098n2348j8512o074n2989k4753j7086L607
12977B134390j3782m7863r985j462j8706l3033k7131l3706m135L896p188k5515
12965A915780r072j2966k2525l3001l5061q147k4721m1882k0062J3592k14j8002
12953A703719j6824j0973R378k6713l1234j9844L94j3527k6416k4081j3024n193
12941A525662j4870K0864k0107j7414k1045k8978k6214j2252j0558K3072j692
12930A416468R368k0907j8462j7191M307l423J9890J2917r077K7118M9949N5882
12918A526839M7319K6415J0286J0170j9877m8811r1224r3648j5985l8909o0727
12907A251848j5600k8749m8635n259j0722m7597r211J1528J509k6543J0135n353
$$ plain form
12895 1077351 1067930 1062770 1013070 1006741 974624 983070 984642 954751 940953 926911 927115 897683 922181
12882 922181 962375 970181 924259 870145 842773 855784 886603 882423 865420 847337 829438 811123
12870 811123 799272 782624 781314 796237 825150 843131 822242 833056 827327 782760 754855 760623
12858 760623 790607 789412 771474 766393 772586 784176 776325 785644 769217 733475 750523 767140
12846 767140 770155 772080 746727 729709 712061 699065 682314 661950 607159 632259 676281 679680
12834 679680 668256 665450 632440 631423 654399 655562 635023 605461 584321 584588 600064 592810 584406
12821 584406 576968 577497 564319 542627 557817 582258 585928 587441 554080 562553 587468 579586 545566
12808 545566 507102 516998 524677 507277 499912 499104 519826 525035 494313 506229 528932 557871 571980
$$ packed form
12895A077351r421n160m9700o329l2117Q446J572k9891j3798j4042K04k9432K4498
12882I22181M0194P806m5922n4114k7372J3011L0819m180j7003j8083j7899j8315
12870H11123j1851j6648j310J4923K8913J7981k0889J0814n729m4567k7905N768
12858G60623K9984j195j7938n081O193J1590p851R319j6427l5742J7048J6617
12846G67140L015J925k5353j7018j7648j2996j6751k0364n4791K5100M4022L399
12834F79680j1424k806l3010j017K2976J163k0539k9562k1140K67J5476p254q404
12821E84406p438N29j3178k1692J5190K4441L670J513l3361Q473K4915p882l4020
12808E45566l8464R896P679j7400p365q08K0722N209l0722J1916K2703K8939J4109
$$ plain form
12795 571980 527898 499638 477229 477642 478216 480434 491968 520907 500079 463080 442816 467115
12783 467115 499367 511148 472961 479938 477428 467610 476142 501643 505802 501156 474566 474693 449255
12770 449255 442048 447360 448769 447549 385645 377469 418427 460336 456256 432849 424913 420181 394127
12757 394127 385745 410485 415683 414040 410831 400634 410094 413435 423252 418666 401926 387575 377792
12744 377792 395692 382131 381551 363042 324214 314867 314739 308365 315588 329877 325567 339350 318644
12731 318644 280536 299658 314720 316723 306069 299606 321546 317481 315713 315264 312188 316086 289396
12718 289396 304940 322734 326171 301636 294318 282143 280944 289562 294678 318704 320612 332843 341488
12705 341488 343272 348116 310380 295783 301211 320582 348485 326432 293772 280430 282698 265492
$$ packed form
12795E71980m4082k8260k2409M13N74K218J1534K8939k0828l6999k0264K4299
12783D67115L2252J1781l8187O977k510r818Q532K5501M159m646k6590J27k5438
12770D49255p207N312J409j220o1904q176M0958M1909m080k3407p936m732k6054
12757C94127q382K4740N198j643l209j0197R460L341R817m586j6740j4351r783
12744C77792J7900j3561n80j8509l8828r347j28o374P223J4289m310J3783k0706
12731C18644l8108J9122J5062K003j0654o463K1940m065j768m49l076L898k6690
12718B89396J5544J7794L437k4535p318j2175j199Q618N116K4026J908J2231Q645
12705C41488J784M844l7736j4597N428J9371K7903k2053l2660j3342K268j7206
$$ plain form
12693 265492 252846 251501 257596 271520 315642 304125 274756 262729 237252 242215 254440 283645
12681 283645 270085 247102 263853 292674 263152 261663 296668 314741 328511 360433 373342 345015
12669 345015 308340 278432 255404 253206 243227 250862 222908 215883 226593 230429 234977 270659 276326
12656 276326 242001 231717 237929 256306 254197 274897 271497 279109 262545 269054 265239 271324 265436
12643 265436 263980 245506 236564 232382 212418 210946 212247 231687 256535 282224 274882 268566 255547
12630 255547 228232 226654 224018 208307 231888 250918 244998 217892 201319 235913 256475 253230
12618 253230 230969 161039 155450 165375 186187 222993 205770 204296 226098 227768 192844 170165
12606 170165 161584 173742 178035 184858 195298 215578 220956 226095 205147 193015 220862 226485 191189
$$ packed form
12693B65492j2646j345O095J3924M4122j1517k9369j2027k5477M963J2225K9205
12681B83645j3560k2983J6751K8821k9522j489L5005J8073J3770L1922J2909k8327
12669C45015l6675k9908k3028k198r979P635k7954p025J0710L836M548L5682N667
12656B76326l4325j0284O212J8377k109K0700l400P612j6564O509l815O085n888
12643B65436j456j8474q942m182j9964j472J301J9440K4848K5689p342o316j3019
12630B55547k7315j578k636j5711K3581J9030n920k7106j6573L4594K0562l245
12618B53230k2261o9930n589R925K0812L6806j7223j474K1802J670l4924k2679
12606A70165q581J2158M293O823J0440K0280N378N139k0948j2132K7847N623l5296
$$ plain form
12593 191189 165027 166872 167659 176418 188973 186114 167463 187431 202896 221538 191730 165175
12581 165175 173186 174126 170897 157341 108161 135308 171878 188157 157645 122160 124097 145410
12569 145410 171963 176611 156358 155155 173086 165028 163177 129039 140443 147126 154592 139076 125809
12556 125809 102430 95528 114379 121912 135486 115869 136400 155196 133500 120847 123307 97154
12544 97154 90148 111934 148927 160749 175131 162268 159139 165187 168975 170927 168693 168405 150727
12531 150727 133088 111999 115109 164898 165679 169904 174545 161951 153801 174876 180278 160212 159860
12518 159860 160317 193312 187849 184374 179043 148404 146396 139196 101085 93074 121125 132715 154250
12505 154250 137788 139301 161621 118156 88134 104886 122402 110675 89843 87612 103539 129946
$$ packed form
12593A91189k6162J845P87Q759J2555k859j8651J9968J5465J8642k9808k6555
12581A65175Q011R40l229j3556m9180K7147L6570J6279l0512l5485J937K1313
12569A45410K6553M648k0253j203J7931q058j851l4138J1404O683P466j5516j3267
12556A25809k3379o902J8851P533J3574j9617K0531J8796k1696j2653K460k6153
12544I7154p006K1786L6993J1822J4382j2863l129O048L788J952k234k88j7678
12531A50727j7639k1089L110M9789P81M225M641j2594q150K1075N402k0066l52
12518A59860M57L2995n463l475n331l0639k008p200l8111q011K8051J1590K1535
12505A54250j6462J513K2320m3465l0022J6752J7516j1727k0832k231J5927K6407
$$ plain form
12493 129946 161812 166440 154204 121206 125522 135513 116463 125816 112122 87595 119006 128523
12481 128523 117643 110752 106650 128371 150951 150983 130006 113767 127456 135111 122577 114548 127981
12468 127981 140091 135574 129316 122901 122300 117183 111103 115909 85711 73138 67680 69191 64615 77039
12454 77039 119530 142616 136638 127928 101084 114664 112665 115172 102540 98409 105967 133262 135868
12441 135868 122340 115412 71372 51450 68789 109321 97825 99828 131801 127079 135036 139086
12429 139086 129185 106560 67858 57315 101533 93778 56140 38009 24101 18281 45284 44261
12417 44261 65788 100378 107944 107236 98689 77784 64554 81325 102626 119997 126952 101036 62516
12404 62516 43918 30405 60835 64478 48621 48383 79430 100712 109811 99270 131717 136147 118078
$$ packed form
12493A29946L1866M628j2236l2998M316R991j9050R353j3694k4527L1411R517
12481A28523j0880o891m102K1721K2580L2k0977j6239J3689P655j2534q029J3433
12468A27981J2110m517o258o415o01n117o080M806l0198j2573n458J511m576J2424
12454G7039M2491K3086n978q710k6844J3580j999K507j2632m131P558K7295K606
12441A35868j3528o928m4040j9922J7339M0532j1496K003L1973m722P957M050
12429A39086r901k2625l8702j0543M4218p755l7638j8131j3908n820K7003j023
12417D4261K1527L4590P566p08q547k0905j3230J6771K1301J7371O955k5916l8520
12404F2516j8598j3513L0430L643j5857k38L1047K1282R099j0541L2447M430j8069
$$ plain form
12391 118078 126283 138544 111605 83644 74092 88097 96361 82642 80046 76130 87112 97932
12379 97932 81341 66152 79574 105147 82581 78625 82817 97577 119153 103946 72762 47024
12367 47024 30615 39928 68234 69000 61674 60416 46030 52123 90836 113591 112454 118598 113334
12354 113334 101631 79814 60780 57156 62178 69644 87370 98202 90661 81075 66988 41648
12342 41648 38778 50881 20589 9261 19618 33888 33043 58571 85621 93901 91641 95859 102322
12329 102322 116845 94036 77072 57243 81098 89217 94844 102731 89036 76589 56897 51839
12317 51839 78377 72369 54144 44028 58915 69862 102892 102425 116993 120819 110530 82575
12305 82575 68762 58489 32363 21909 20737 23850 25163 19787 49072 75218 82345 76207 84270
$$ packed form
12391A18078Q205J2261k6939k7961r552J4005Q264j3719k596l916J0982J0820
12379I7932j6591j5189J3422K5573k2566l956M192J4760K1576j5207l1184k5738
12367D7024j6409R313K8306P66p326j258j4386O093L8713K2755j137O144n264
12354A13334j1703k1817j9034l624N022P466J7726J0832p541r586j4087k5340
12342D1648k870J2103l0292j1328J0357J4270q45K5528K7050Q280k260M218O463
12329A02322J4523k2809j6964j9829K3855Q119N627P887j3695j2447j9692n058
12317E1839K6538o008j8225j0116J4887J0947L3030m67J4568L826j0289k7955
12305H2575j3813j0273k6126j0454j172L113J313n376K9285K6146P127o138Q063
$$ plain form
12292 84270 100366 114002 84622 60617 24860 33666 48184 55443 36701 15066 -20553 -23560
12280 -23560 39427 85988 86479 86670 53469 42547 43326 38776 57151 67823 41587 23336 13947
12267 13947 21696 36713 68261 85193 97115 72743 62078 74834 60975 15086 28372 40005
12255 40005 46227 56376 81626 89779 99206 97142 140421 114299 66402 19037 11248 32423 53412
12242 53412 41543 40445 40363 49647 41970 18759 5164 30776 24430 627 -4814 12163 23930
12229 23930 12829 31116 68275 78279 76332 69851 58822 52404 47210 21790 16966 47830 73727
12216 73727 51805 44695 55084 27223 -14867 -48607 -38527 15758 49096 37365 46014 57102
12204 57102 66658 52996 46675 63883 42322 41252 42028 23535 -11196 -7283 4519 47587 65791
$$ packed form
12292H4270J6096J3636k9380k4005l5757Q806J4518P259j8742k1635l5619l007
12280b3560O2987M6561M91J91l3201j0922P79m550J8375J0672k6236j8251r389
12267A3947P749J5017L1548J6932J1922k4372j0665J2756j3859m5889J3286J1633
12255D0005O222J0149K5250Q153R427k064M3279k6122m7897m7365p789K1175K0989
12242E3412j1869j098q2R284p677k3211j3595K5612o346k3803n441J6977J1767
12229B3930j1101J8287L7159J0004j947o481j1029o418n194k5420m824L0864K5897
12216G3727k1922p110J0389k7861m2090l3740J0080N4285L3338j1731Q649J1088
12204E7102R556j3662o321J7208k1561j070P76j8493l4731L913J1802M3068J8204
$$ plain form
12191 65791 64432 58559 62066 59884 35418 38877 38890 18440 13323 12491 10011 22442 7194 30041
12177 30041 45466 25334 15536 49095 76812 50550 27952 50352 52633 55237 53016 41725
12165 41725 26939 13495 31417 36950 49992 35127 18712 48331 83456 51507 45230 20619
12153 20619 4502 13265 6557 12742 24515 34629 49878 58631 67506 45056 21435 42204 34906
12140 34906 29915 20531 34380 41333 54845 52847 15933 12319 49742 84286 64162 47796 45650
12127 45650 30045 5290 -20027 8125 39207 52715 50990 48565 80891 48821 21652 8880
12115 8880 34077 41398 15710 39518 72936 86203 83385 67080 44333 27589 30508 40386 89626
12102 89626 98452 90135 82251 68257 62297 73983 43749 29800 22533 12536 -14906 -28975 -31849
$$ packed form
12191F5791j359n873L507k182k4466L459J3k0450n117q32k480J2431j5248K2847
12177C0041J5425k0132r798L3559K7717k6262k2598K2400K281K604k221j1291
12165D1725j4786j3444J7922N533J3042j4865j6415K9619L5125l1949o277k4611
12153B0619j6117Q763o708O185J1773J0114J5249Q753Q875k2450k3621K0769p298
12140C4906m991r384J3849O953J3512j998l6914l614L7423L4544k0124j6366k146
12127D5650j5605k4755k5317K8152L1082J3508j725k425L2326l2070k7169j2772
12115H880K5197P321k5688K3808L3418J3267k818j6305k2747j6744K919R878M9240
12102H9626Q826q317p884j3994n960J1686l0234j3949p267r997k7442j4069k874
$$ plain form
12089 -31849 -17247 -27996 -23734 8456 18514 34583 45016 35512 22314 29605 25981 18059 24359
12076 24359 20536 33719 43771 31692 20081 24714 17322 11831 6086 38380 70541 79048 77557
12063 77557 75515 87878 73853 54771 38429 49057 37798 11058 -16591 -5454 30702 28585
12051 28585 27965 32140 46117 27612 -10452 11744 19995 12963 19186 -12722 -13098 -313 10014
12038 10014 55215 85328 60910 37708 31608 34466 36751 14999 12660 30656 27161 28204 70049
12025 70049 65088 64265 37669 44667 48913 38756 32085 48192 54309 30483 2152 -13650 -41890
12012 -41890 -34423 -36610 -44680 -37700 -27425 -6525 -9107 4405 -6065 -36683 -19159 11922 26517
11999 26517 -1723 -10760 5269 -26338 -37857 -16057 8549 23417 14324 -6525 -1505 -22233
$$ packed form
12089c1849J4602j0749M262L2190J0058J6069J0433r504j3198P291l624p922O300
12076B4359l823J3183J0052j2079j1611M633p392n491n745L2294L2161Q507j491
12063G7557k042J2363j4025j9082j6342J0628j1259k6740k7649J1137L6156k117
12051B8585o20M175J3977j8505l8064K2196Q251p032O223l1908l76J2785J0327
12038A0014M5201L0113k4418k3202o100K858K285k1752k339J7996l495J043M1845
12025G0049m961q23k6596O998M246j0157o671J6107O117k3826k8331j5802k8240
12012d1890P467k187q070O980J0275K0900k582J3512j0470l0618J7524L1081J4595
11999B6517k8240r037J6029l1607j1519K1800K4606J4868r093k0849N020k0728
$$ plain form
11987 -22233 -3736 22402 13619 16201 8672 7663 49334 57156 18755 -36206 -50187 -32608 -12767
11974 -12767 -10939 18030 6261 3676 13942 39059 48677 43267 39939 9410 7830 -3674 -8510
11961 -8510 7475 8559 19994 36354 7869 -20641 -16537 -25238 -5784 -372 7079 31826 37429
11948 37429 47234 33617 20356 15469 19398 32053 41927 10317 11629 -19572 -55897 -47723 3068
11935 3068 15973 -2639 -20658 -27402 -19453 1942 30106 -9341 -24781 -15319 -29892 -23473 2516
11922 2516 10787 3110 -7330 -1117 30372 -3729 -5266 -13065 9883 20906 7189 18809 29643
11909 29643 18887 -4102 -4434 21162 14326 -19918 -21436 -1186 -23295 -29163 2526 18648 27755
11896 27755 45371 19202 -8413 -13089 16028 9333 -3810 13476 21724 34279 8691 33726
$$ packed form
11987b2233J8497K6138q783K582p529j009M1671P822l8401n4961j3981J7579J9841
11974a2767J828K8969j1769k585J0266K5117R618n410l328l0529j580j1504m836
11961h510J5985J084J1435J6360k8485k8510M104q701J9454N412P451K4747N603
11948C7429R805j3617j3261m887L929J2655R874l1610J312l1201l6325Q174N0791
11935C068J2905j8612j8019o744P949K1395K8164l9447j5440R462j4573O419K5989
11922B516Q271p677j0440O213L1489l4101j537p799K2948J1023j3717J1620J0834
11909B9643j0756k2989l32K5596o836l4244j518K0250k2109n868L1689J6122R107
11896B7755J7616k6169k7615m676K9117o695j3143J7286Q248J2555k5588K5035
$$ plain form
11884 33726 55590 39877 11400 -27588 -44723 -54129 -22169 -16887 -16313 -473 -2835 -10968 -4535
11871 -4535 -18717 -21562 -19771 -2136 -7982 1992 11907 3726 39801 39882 35081 31516 23377 18425
11857 18425 16460 21514 6332 -20258 7409 33303 48734 33878 1729 -2408 21006 47213
11845 47213 63854 69971 59388 73923 54593 28385 22997 20320 36662 49466 32074 25315
11833 25315 32631 33148 51040 28340 20626 43184 25921 18573 3541 -29504 -4590 -3325 -1512
11820 -1512 428 -9850 11001 5703 3283 -27159 -37053 -23364 -26748 -56127 -13959 -19620 -39309
11807 -39309 1373 13138 3196 1597 24731 32789 52024 41370 26240 21765 28632 7527 -2662
11794 -2662 -2338 14665 8642 -23016 -18947 -27680 -520 35503 8612 -43228 -52051 -36256 -13719
$$ packed form
11884C3726K1864j5713k8477l8988j7135r406L1960N282N74J5840k362q133O433
11871d535j4182k845J791J7635n846R974R915q181L6075Q1m801l565q139m952
11857A8425j965N054j5182k6590K7667K5894J5431j4856l2149m137K3414K6207
11845D7213J6641O117j0583J4535j9330k6208n388k677J6342J2804j7392o759
11833B5315P316N17J7892k2700p714K2558j7263p348j5032l3045K4914J265J813
11820a512J940j0278K0851n298k420l0442r894J3689l384k9379M2168n661j9689
11807c9309M0682J1765r942j599K3134Q058J9235j0654j5130m475O867k1105j0189
11794b662L24J7003o023l1658M069q733K7160L6023k6891n1840q823J5795K2537
$$ plain form
11781 -13719 772 12736 -70 23915 42620 36034 15847 3602 419 -7392 -11958 -26121
11769 -26121 -25709 -21844 -17772 -4202 -13292 -34297 -51372 -48339 -30211 -35718 -36414 -39677 -40122 -21332
11755 -21332 -9130 -6750 2695 28930 37698 56779 60700 27691 -9675 -10166 -21420 -46081 -44381
11742 -44381 -26978 -24759 -22100 -47009 -32744 -15384 -36626 -31171 9913 30473 5870 -14531
11730 -14531 -27907 -8831 6512 7121 15738 9909 14980 27444 37285 32540 29713 29112 16398 18804
11716 18804 54306 25526 -785 -637 4182 3635 -1921 -2750 808 87 -26335 -34274 -18168 -33601
11702 -33601 -34790 -27961 -22556 -13809 -21744 -47389 -42115 -15997 1387 -20592 -42773 -51833 -55713
11689 -55713 -43689 -51120 -42491 -54100 -71236 -59608 -22186 10255 52486 67262 45240 -1535
$$ packed form
11781a3719J4491J1964j2806K3985J8705o586k0187j2245l183p811m566j4163
11769b6121M12L865M072J3570r090k1005j7075L033J8128n507o96l263m45J8790
11755b1332J2202K380R445K6235Q768J9081L921l3009l7366m91j1254k4661J700
11742d4381J7403K219K659k4909J4265J7360k1242N455M1084K0560k4603k0401
11730a4531j3376J9076J5343O09Q617n829N071J2464R841m745k827o01j2714K406
11716A8804L5502k8780k6311J48M819n47n556q29L558p21k6422p939J6106j5433
11702c3601j189O829N405Q747p935k5645N274K6118J7384k1979k2181r060l880
11689e5713J2024p431Q629j1609j7136J1628L7422L2441M2231J4776k2022m6775
$$ plain form
11677 -1535 -19150 -24458 -41741 -28462 -37434 9190 32487 12353 -23386 -14186 -35695 -33588 2639
11664 2639 7178 -7780 -18433 -12278 30096 24424 38043 32691 15608 19416 16745 -1915 -7166
11651 -7166 14001 -10747 -26107 -11996 -1419 -4324 -33584 -24520 -16812 -15912 -29513 11107 3409
11638 3409 30083 -4784 -4512 -26563 -52011 -40058 -47623 -39736 -31791 -6786 -6778 -50293 -52750 -17606
11624 -17606 24780 48713 69676 67275 45993 11242 21775 13026 -3858 -22022 -33215 -24905
11612 -24905 -25681 -31182 -42896 -13907 22986 21763 12892 11726 5248 -19060 -6671 -1096 25247
11599 25247 -7008 -39407 -44030 -52996 -56312 -41166 -46839 -49995 -34962 -893 7080 -21287 6719
11586 6719 2250 -27678 -33126 -40061 -47588 -46978 -59912 -42725 -33374 4004 43291 46201 28549
$$ packed form
11677a535j7615n308j7283J3279q972M6624K3297k0134l5739R200k1509K107L6227
11664B639M539j4958j0653O155M2374n672J3619n352j7083L808k671j8660n251
11651g166K1167k4748j5360J4111J0577k905k9260R064P708R00j3601M0620p698
11638C409K6674l4867K72k2051k5448J1953p565P887P945K5005Qm3515k457L5144
11624a7606M2386K3933K0963k401k1282l4751J0533q749j6884j8164j1193Q310
11612b4905p76n501j1714K8989L6893j223q871j166o478k4308J2389N575K6343
11599B5247l2255l2399m623q966l316J5146n673l156J5033L4069P973k8367K8006
11586F719m469k9928n448o935p527O10j2934J7187R351L7378L9287K910j7652
$$ plain form
11573 28549 15947 7981 -41540 -51949 -48626 -46492 -31234 -17255 21061 -2948 -34708 -43754
11561 -43754 -46072 -36021 -24116 -16790 -22812 -37677 -6745 12636 25060 6988 16830 33198
11549 33198 6392 -14604 -13188 3816 -17730 -8061 -6855 -12912 -4706 3362 -26249 -27763 -20865
11536 -20865 -13204 6982 16488 22673 19782 -26618 -49272 -40360 -23683 2694 -22843 -41806 -8941
11523 -8941 7854 -35824 -46076 -37622 -39895 -3233 20459 22916 36111 57057 50808 38460 793
11510 793 -9336 -13686 -10106 -4898 -12902 -8365 -2624 12860 3616 -26869 -29135 -37966 -33920 -26391
11496 -26391 -24783 -58976 -41569 -33920 -49938 -56992 -55855 -47061 -31314 -6631 -17323 -40308 -54616
11483 -54616 -42400 -39495 -22952 -7006 -8530 -31231 -27922 -32737 -22501 -7994 -7147 9128 13806
$$ packed form
11573B8549j2602p966m9521j0409L323K134J5258J3979L8316k4009l1760r046
11561d3754k318J0051J1905P326o022j4865L0932J9381J2424j8072R842J6368
11549C3198k6806k0996J416J7004k1546R669J206o057Q206Q068k9611j514O898
11536b0865P661K0186R506O185k891m6400k2654Q912J6677K6377k5537j8963L2865
11523h941J6795m3678j0252Q454k273L6662K3692K457J3195K0946o249j2348l7667
11510G93j0129m350L580N208q004M537N741J5484r244l0485k266q831M046P529
11496b6391J608l4193J7407P649j6018p054J137Q794J5747K4683j0692k2985j4308
11483e4616J2216K905J6543J5946j524k2701L309m815J0236J4507Q47J6275M678
$$ plain form
11470 13806 7344 18613 30023 19022 10883 -28880 -56283 -53138 -16558 -24093 -9355 -3213 -379
11457 -379 18602 16421 17970 5153 -19054 -28125 -4360 -25925 -17864 -3319 22834 44298 24971
11444 24971 -27619 -53586 -30527 -32898 -26235 -12448 -14792 -18248 -16817 -14770 -10157 -8020 -20786
11431 -20786 -37612 -53786 -51592 -38680 -9950 -17104 -27242 -33408 -47051 -58375 -52553 -31461
11419 -31461 -25392 -42233 -33952 -21012 -27602 -2283 8823 1968 8069 15725 47495 42313 28911
11406 28911 23356 -6984 -34191 -52864 -71301 -42961 -46468 -34041 -26049 -28496 -20297 -43820 -45275
11393 -45275 -54222 -49268 -60470 -62953 -35899 -881 2783 12710 14877 2536 -33436 -69748 -75199
11380 -75199 -28930 -15289 -15421 -33600 -64573 -71165 -26846 -19497 -20559 -32330 -40450 -66018 -35622
$$ packed form
11470A3806o462J1269J1410j1001q139l9763k7403L145L6580p535J4738O142K834
11457c79J8981k181J549j2817k4207r071K3765k1565Q061J4545K6153K1464j9327
11444B4971n2590k5967K3059k371O663J3787k344l456J431K047M613K137j2766
11431b0786j6826j6174K194J2912K8730p154j0138o166j3643j1324N822K1092
11419c1461O069j6841Q281J2940o590K5319J1106o855O101P656L1770n182j3402
11406B8911n555l0340k7207j8673j8437K8340l507J2427P992k447Q199k3523j455
11393d5275q947M954j1202k483K7054L5018L664R927K167j2341l5972l6312n451
11380g5199M6269J3641j32j8179l0973o592M4319P349j062j1771q120k5568L0396
$$ plain form
11367 -35622 -18763 -13271 2255 -3492 -1101 -19379 -12697 -8127 -20478 -21773 -41768 -73640 -86629
11354 -86629 -39727 -13655 9121 31766 25693 8955 -14040 -63261 -57760 -54145 -55383 -38228
11342 -38228 -36459 -8648 12888 8487 3639 -7144 30353 53651 33633 -3133 -29894 -17032
11330 -17032 -1224 -8686 -16676 -15153 -20424 -39056 -57868 -41241 -16586 -50177 -55551 -32898 -23604
11317 -23604 -42521 -75078 -82587 -76322 -62894 -53022 -14435 -7889 3873 7629 -16075 -11187 -8020
11304 -8020 -11992 -24075 505 5679 -22223 -42579 -48679 -45037 -25037 395 24122 37219 27432
11291 27432 957 -29996 -38396 -36212 -40470 -41203 -43834 -43358 -37325 -7134 2429 -9512 -7986 7204
11277 7204 31466 41318 53699 35089 104 -29389 -7316 6369 -3111 4983 1682 -11522 444
$$ packed form
11367c5622J6859N492J5526n747K391j8278O682M570j2351j295j9995l1872j2989
11354h6629M6902K6072K2776K2645o073j6738k2995m9221N501L615j238J7155
11342c8228J769K7811K1536m401m848j0783L7497K3298k0018l6766k6761J2862
11330a7032J5808p462p990J523n271j8632j8812J6627K4655l3591n374K2653R294
11317b3604j8917l2557p509O265J3428R872L8587O546J1762L756k3704M888L167
11304h020l972j2083K4580N174k7902k0356o100L642K0000K5432K3727J3097r787
11291B7432k6475l0953q400K184m258p33k631M76O033L0191R563j1941J526J5190
11277G204K4262R852J2381j8610l4985k9493K2073J3685r480Q094l301j3204J1966
$$ plain form
11264 444 -6430 -13230 -2177 8385 -8564 -28374 -25990 -15812 -7663 5298 37212 54940 40007
11251 40007 3613 12396 -3166 16704 2590 -21060 -29958 -25142 -23331 -11224 -32044 -15741
11239 -15741 -6625 -12419 -34922 -66605 -92757 -67640 -40596 -33138 -39468 -17341 -7982 7926 22435
11226 22435 15094 15824 31510 29883 8445 -3403 17003 55657 50754 43890 36817 42160 29921
11213 29921 11906 2462 -7086 -21281 -24240 -29546 -17132 -7488 -13333 21723 21542 15025 -15477
11200 -15477 -34210 -11689 -23581 -32932 -21492 -17364 -11481 -6128 -19267 -38541 -48258 -31436 -1029
11187 -1029 -19537 -9151 -1928 15019 15201 7925 -13274 14076 1369 -6448 -20343 -31227 -15755
11174 -15755 10936 18170 -6145 -16882 -14795 -28955 -38856 7271 38649 9659 -9604 5636
$$ packed form
11264D44o874o800J1053J0562j6949j9810K384J0178Q149J2961L1914J7728j4933
11251D0007l6394Q783j5562J9870j4114k3650q898M816J811J2107k0820J6303
11239a5741R116n794k2503l1683k6152K5117K7044P458o330K2127R359J5908J4509
11226B2435p341P30J5686j627k1438j1848K0406L8654m903o864p073N343j2239
11213B9921j8015r444r548j4195k959n306J2414R644n845L5056j81o517l0502
11200a5477j8733K2521j1892r351J1440M128N883N353j3139j9274r717J6822L0407
11187a029j8508J0386P223J6947J82p276k1199K7350j2707p817j3895j0884J5472
11174a5755K6691P234k4315j0737K087j4160r901M6127L1378k8990j9263J5240
$$ plain form
11162 5636 17687 13053 -12754 -24422 -33223 -8279 22355 -3660 -21204 -50555 -69502 -48756
11150 -48756 -51463 -52468 -44623 -31286 -19362 -16661 10863 15590 13340 -17455 -64369 -63486 -66401
11137 -66401 -42135 -48295 -29320 -22343 -38232 -39889 -27684 -23294 -8881 -10944 -20407 -13602 1220
11124 1220 -29025 -38404 -10203 -1714 -13337 -10848 25607 38707 16680 -12883 1206 14096
11112 14096 7968 5043 -3504 -29458 -41654 -25814 -5247 -3981 -26249 -33315 -38234 -45914 -25187
11099 -25187 -25430 -10289 -16482 -42325 -40950 -18369 -9672 -31662 -44692 -28184 -17969 -6387 13090
11086 13090 18760 -7709 -33558 -23894 -23950 -29768 -7098 20925 10080 12837 4717 -20369 -28653
11073 -28653 -32834 -24862 -28028 -44437 -24414 -17873 9021 -13475 -33959 -42453 -23199 -9299 -22219
$$ packed form
11162E636J2051m634k5807j1668q801K4944L0634k6015j7544k9351j8947K0746
11150d8756k707j005P845J3337J1924K701K7524M727k250l0795m6914Q83k915
11137f6401K4266o160J8975O977j5889j657J2205M390J4413k063r463O805J4822
11124A220l0245r379K8201Q489j1623K489L6455J3100k2027k9563J4089J2890
11112A4096o128k925q547k5954j2196J5840K0567J266k2268p066m919p680K0727
11099b5187k43J5141o193k5843J375K2581Q697k1990j3030J6508J0215J1582J9477
11086A3090N670k6469k5849R664n6n818K2670K8023j0845K757q120k5086q284
11073b8653m181P972l166j6409K0023O541K6894k2496k0484q494J9254J3900j2920
$$ plain form
11060 -22219 -21905 -41190 -50159 -26618 -34716 -55654 -52426 -16732 15382 32798 42352 34570 4071
11047 4071 8693 -9476 -18992 -13247 -9207 21249 4462 -8700 18347 -3172 -10470 18831 45419
11034 45419 36012 19923 5058 -12675 -45566 -79367 -103189 -82063 -75475 -55841 -45655 -28561
11022 -28561 -44239 -34486 -23977 8486 -6554 -28075 -21181 18908 18310 12977 14938 24660 31986
11009 31986 16193 260 -40810 -41989 -30833 -27359 -22668 -16802 -6837 9216 19454 13809 16230
10996 16230 43097 44933 42181 59520 79632 52055 14177 21106 25874 37385 56069 65465 109566
10983 109566 136587 145003 168945 220545 255444 288803 353278 447286 543392 718802 959553
10972 959553 1249214 1601796 1914402 2133424 2247615 2207298 1956118 1603298 1265613 1018292
$$ packed form
11060b2219L14j9285q969K3541q098k0938L228L5694L2114J7416R554p782l0499
11047D071M622j8169r516N745M040L0456j6787j3162K7047k1519p298K9301K6588
11034D5419r407j6089j4865j7733l2891l3801k3822K1126O588J9634J0186J7094
11022b8561j5678R753J0509L2463j5040k1521O894M0089n98n333J961R722P326
11009C1986j5793j5933m1070j179J1156L474M691N866R965J6053J0238n645K421
10996A6230K6867J836k752J7339K0112k7577l7878O929M768J1511J8684R396M4101
10983A09566K7021Q416K3942N1600L4899L3359O4475R4008R6106J75410K40751
10972I59553K89661L52582L12606K19022J14191m0317k51180l52820l37685k47321
$$ plain form
10962 1018292 810039 667330 562354 484505 410060 363523 339302 355101 366847 319221 260218
10951 260218 226940 207828 233521 239982 224995 230133 207665 195408 173003 126709 127593 136015
10939 136015 125622 128039 140546 138658 140296 147843 164442 160716 126192 106385 118869 126989 85214
10926 85214 53781 47622 23977 -2406 22295 70015 72200 88179 44174 30165 51714 54047
10914 54047 60937 42275 38163 45944 68160 76589 68226 61560 91156 72819 42812 28807 31663
10901 31663 58956 55539 39377 33276 29517 19006 16437 -26892 -6540 23480 9773 -922
10889 -922 18238 16345 -27463 -39547 -13110 22796 24961 12433 -10025 5041 24519 28500 37844
10876 37844 11468 -15759 -35036 -40352 -13116 -4271 20261 39147 37824 52501 71835 38365
$$ packed form
10962A018292k08253j42709j04976p7849p4445m6537k4221J5799J1746m7626n9003
10951B60218l3278j9112K5693O461j4987N138k2468j2257k2405m6294Q84Q422
10939A36015j0393K417J2507j888J638P547J6599l726l4524j9807J2484Q120m1775
10926H5214l1433o159k3645k6383K4701M7720K185J5979m4005j4009K1549K333
10914E4047O890j8662m112P781K2216Q429q363o666K9596j8337l0007j4005K856
10901C1663K7293l417j6162o101l759j0511k569m3329K0352L0020j3707j0695
10889i22J9160j893m3808j2084K6437L5906K165j2528k2458J5066J9478L981R344
10876C7844k6376k7227j9277n316K7236Q845K4532J8886j323J4677J9334l3470
$$ plain form
10864 38365 -15556 -39481 -18620 -5047 8387 41927 23141 -7094 -19765 -97 19743 32727
10852 32727 35928 25354 46845 43544 25594 -4001 -27002 -4926 25572 43266 21024 15553
10840 15553 8537 24102 24890 1868 16231 30437 39741 44423 53836 62119 73249 86941 128426
10827 128426 191335 237063 224482 215691 215392 239368 254748 202042 184371 164729 119295 66544
10815 66544 34041 18935 17551 9927 -11541 -5893 -15152 5616 20397 21046 32957 20063 51413
10802 51413 68647 106689 118642 91617 78988 80547 79346 93862 86162 61333 54143 65808
10790 65808 92107 97751 92284 68558 24601 -3593 10216 22752 55839 79906 58171 47175
10778 47175 25173 -10617 -14471 -3120 -9575 -43638 -52357 -77038 -104706 -60716 -23532 -23801 -12083
$$ packed form
10864C8365n3921k3925K0861J3573J3434L3540j8786l0235j2671J9668J9840J2984
10852C2727L201j0574K1491l301j7950k9595k3001K2076L0498J7694k2242n471
10840A5553p016J5565P88k3022J4363J4206R304M682R413Q283J1130J3692M1485
10827A28426O2909M5728j2581q791k99K3976J5380n2706j7671j9642m5434n2751
10815F6544l2503j5106j384p624k1468N648r259K0768J4781O49J1911j2894L1350
10802E1413J7234L8042J1953k7025j2629J559j201J4516p700k4829p190J1665
10790F5808K6299N644n467k3726m3957k8194J3809J2536L3087K4067k1735j0996
10778D7175k2002l5790l854J1351o455l4063q719k4681k7668M3990L7184k69J1718
$$ plain form
10765 -12083 14577 24843 58807 100143 74891 51081 37425 47350 30182 16174 33454 48334
10753 48334 50164 72615 61294 62131 67922 60240 43988 32537 -1099 -12788 49332 60371 58320
10740 58320 69978 56136 3406 -28804 -9806 7116 -56 22742 13530 14970 11765 16284 38707
10727 38707 50444 50604 70470 56524 16725 -7216 -32380 -72025 -82023 -39307 -8698 21204
10715 21204 49384 88496 91281 66094 33997 28025 17064 17417 29875 41017 45084 42331 51034
10702 51034 45318 33079 42761 21333 -12879 -6013 9415 45083 89787 159739 222215 239747
10690 239747 190122 149697 142808 149165 151029 146202 149573 160232 178014 227871 239009 246474 246593
10677 246593 254606 309474 332447 330189 315423 282434 280714 288869 285688 271661 288130 297502 311185
$$ packed form
10765a2083K6660J0266L3964M1336k5252k3810j3656R925j7168j4008J7280J4880
10753D8334J830K2451j1321Q37N791p682j6252j1451l3636j1689O2120J1039k051
10740E8320J1658j3842n2730l2210J8998J6922p172K2798r212J440l205M519K2423
10727C8707J1737J60J9866j3946l9799k3941k5164l9645r998M2716L0609K9902
10715B1204K8180L9112K785k5187l2097n972j0961L53J2458J1142M067k753Q703
10702E1034n716j2239R682k1428l4212O866J5428L5668M4704O9952O2476J7532
10690B39747m9625m0425o889O357J864m827L371J0659J7782M9857J1138P465J19
10677B46593Q013N4868K2973k258j4766l2989j720Q155l181j4027J6469R372J3683
$$ plain form
10664 311185 327930 347836 366797 351111 351128 373484 361078 359343 343905 367173 380429 386756
10652 386756 427306 481269 531083 554544 605424 660516 667182 689386 719446 765503 795480 813454
10640 813454 841304 873101 907836 968083 1035391 1093316 1135083 1171414 1231324 1258662 1264363 1283624
10628 1283624 1318943 1324602 1317327 1300168 1290107 1326796 1352914 1384784 1437265 1474289 1521680 1611047
10616 1611047 1740671 1842650 1936105 1989975 2017046 2083528 2131111 2219919 2358184 2539655
10606 2539655 2768130 3017652 3293040 3615180 3946385 4292534 4652015 5038898 5431986
10597 5431986 5867061 6356975 6936584 7533293 8221864 8988610 9892824 10949843 12207688
10588 12207688 13663327 15274295 17026450 18991784 21221360 23858549 27169597 31474440
$$ packed form
10664C11185J6745J9906J8961j5686J7K2356j2406j735j5438K3268J3256O327
10652C86756M0550N3963M9814K3461N0880N5092O666K2204L0060M6057K9977J7974
10640H13454K7850L1797L4735O0247O7308N7925M1767L6331N9910K7338N701J9261
10628A283624L5319N659p275j7159j0061L6689K6118L1870N2481L7024M7391Q9367
10616A611047J29624J01979R3455N3870K7071O6482M7583Q8808J38265J81471
10606B539655K28475K49522K75388L22140L31205L46149L59481L86883L93088
10597E431986M35075M89914N79609N96709O88571P66746R04214J057019J257845
10588A2207688J455639J610968J752155J965334K229576K637189L311048M304843
$$ plain form
10580 31474440 37068146 44238637 53609745 66149886 83364736 107546806 141757297
10573 141757297 189141224 249178869 313112644 367553649 403366318 414664103 395050814
10566 395050814 343890879 276115550 214025386 167407871 134692970 111921406 95878879
10559 95878879 84405101 76132517 70010294 65431286 61944170 59193188 56837182 54653830
10551 54653830 52464107 50216203 47912886 45553156 43143645 40738384 38511946 36486940
10543 36486940 34655993 33077056 31696228 30483126 29359667 28289433 27254406 26276155
10535 26276155 25382527 24612300 23881710 23166116 22474974 21774562 21047022 20309030 19612976
10526 19612976 18961629 18315534 17711619 17148107 16607404 16152807 15733154 15322400 14914831
$$ packed form
10580C1474440N593706P170491R371108J2540141J7214850K4182070L4210491
10573A41757297M7383927O0037645O3933775N4441005L5812669J1297785j9613289
10566C95050814n1159935o7775329o2090164m6617515l2714901k2771564j6042527
10559I5878879j1473778q272584o122223m579008l487116k750982k356006k183352
10551E4653830k189723k247904k303317k359730k409511k405261k226438k025006
10543C6486940j830947j578937j380828j213102j123459j070234j035027r78251
10535B6276155q93628p70227p30590p15594o91142p00412p27540p37992o96054
10526A9612976o51347o46095o03915n63512n40703m54597m19653m10754m07569
$$ plain form
10517 14914831 14535048 14220090 13895190 13556156 13229383 12912040 12568230 12220162 11923380
10508 11923380 11656187 11409065 11171688 10992163 10817887 10612447 10374416 10144015 9930029
10499 9930029 9730369 9562348 9372097 9196684 9006649 8849148 8672378 8450679 8284595
10490 8284595 8135621 8016301 7854684 7679065 7533625 7399894 7241167 7074870 6875303
10481 6875303 6716877 6586815 6474259 6356404 6241723 6131024 5991714 5898763 5770445 5624812
10471 5624812 5484127 5321806 5216612 5157016 5051693 4956318 4897664 4842536 4767461 4697179
10461 4697179 4596843 4534091 4500349 4445910 4390820 4300289 4222804 4213804 4192700 4125550 4054735
10450 4054735 4015439 3985845 3953301 3941639 3923784 3917547 3875100 3829466 3782626 3671796 3529387
$$ packed form
10517A4914831l79783l14958l24900l39034l26773l17343l43810l48068k96782
10508A1923380k67193k47122k37377j79525j74276k05440k38031k30401k13986
10499I930029j99660j68021j90251j75413j90035j57501j76770k21699j66084
10490H284595j48974j19320j61617j75619j45440j33731j58727j66297j99567
10481F875303j58426j30062j12556j17855j14681j10699j39310r2951j28318j45633
10471E624812j40685j62321j05194n9596j05323r5375n8654n5128p5075p0282
10461D697179j00336o2752l3742n4439n5090r0531p7485r000k1104o7150p0815
10450D054735l9296k9594l2544j1662j7855o237m2447m5634m6840j10830j42409
$$ plain form
10439 3529387 3395655 3257985 3155677 3089033 3043777 2979278 2888868 2812249 2776519 2736477 2682632
10428 2682632 2644126 2597134 2528285 2470970 2422163 2350935 2321716 2305545 2293388 2308685 2316366
10417 2316366 2306285 2290258 2229072 2186571 2101553 2006153 1982222 1967171 1914778 1856935 1813057
10406 1813057 1787468 1784489 1772390 1796132 1771655 1714252 1691093 1662420 1617444 1585059 1562265
10395 1562265 1528563 1491178 1493188 1473528 1465447 1428103 1381799 1352413 1353046 1360345 1368270 1363087 1329350
10382 1329350 1298787 1250388 1234700 1219060 1177483 1132488 1076339 1066060 1041839 1017236 1052106
10371 1052106 1125308 1166398 1206795 1220839 1173405 1141997 1107782 1100745 1099753 1080484 1072998 1034207
10359 1034207 1015305 995461 971633 941206 953974 952725 923683 903061 878783 885080 891612 871173
$$ packed form
10439C529387j33732j37670j02308o6644m5256o4499r0410p6619l5730m0042n3845
10428B682632l8506m6992o8849n7315m8807p1228k9219j6171j2157J5297P681
10417B316366j0081j6027o1186m2501q5018r5400k3931j5051n2393n7843m3878
10406A813057k5589k979j2099K3742k4477n7403k3159k8673m4976l2385k2794
10395A562265l3702l7385K010j9660q081l7344m6304k9386O33P299P925n183l3737
10382A329350l0563m8399j5688j5640m1577m4995n6149j0279k4221k4603L4870
10371A052106P3202M1090M0397J4044m7434l1408l4215p037r92j9269p486l8791
10359A034207j8902j9844k3828l0427J2768j249k9042k0622k4278O297O532k0439
$$ plain form
10347 871173 877025 912909 933759 956706 940211 934199 928928 962719 1032446 1090199 1175597 1305930
10335 1305930 1465687 1656912 1864882 2071660 2222407 2342083 2425359 2460995 2436918 2349355
10325 2349355 2249571 2132158 1983414 1787921 1604633 1476581 1367038 1252559 1160709 1094005
10315 1094005 1039818 988745 967633 934552 919366 877153 825924 809930 799696 759070 718955
10304 718955 688625 682410 695100 676383 633286 613568 633489 616843 582370 593121 599222 561916
10292 561916 574601 592642 586478 580254 539789 508145 475711 450536 431514 459210 487607 514101
10280 514101 471065 449370 483552 532201 534146 494774 458446 451600 454529 411497 406063 400957
10268 400957 397652 403036 411441 423424 413649 403780 394287 427582 410196 380407 361023 332314 334332
$$ packed form
10347H71173N852L5884K0850K2947j6495o012n271L3791O9727N7753Q5398J30333
10335A305930J59757J91225K07970K06778J50747J19676Q3276L5636k4077q7563
10325B349355r9784j17413j48744j95493j83288j28052j09543j14479r1850o6704
10315A094005n4187n1073k1112l3081j5186m2213n1229j5994j0234m0626m0115
10304G18955l0330o215J2690j8717m3097j9718J9921j6646l4473J0751O101l7306
10292E61916J2685J8041o164o224m0465l1644l2434k5175j9022K7696K8397K6494
10280E14101m3036k1695L4182M8649J945l9372l6328o846K929m3032n434n106
10268D00957l305N384Q405J1983r775r869r493L3295j7386k9789j9384k8709K018
$$ plain form
10255 334332 337212 344863 333252 336169 350213 349745 373987 380375 354394 349689 355552 344809 283654
10242 283654 249198 268873 286838 276357 257576 215278 224426 242004 229689 266641 288609 276615
10230 276615 250188 231051 220483 216730 226674 197017 185496 242576 287149 293352 257935 212322
10218 212322 246890 258961 250566 233092 203163 181893 193162 205719 208262 201929 196090 197925
10206 197925 179465 187014 179172 211553 234706 220930 213473 178225 126692 143804 171765 194717
10194 194717 228076 244737 228266 218234 180876 160409 176676 160451 188750 206022 213416 232912
10182 232912 219860 236714 256187 271917 273659 277064 315842 370084 414268 458507 504948 601703
10170 601703 732602 867870 1095020 1404097 1755228 2063404 2261968 2333671 2242919 1954772
$$ packed form
10255C34332K880P651j1611K917J4044m68K4242O388k5981m705N863j0743o1155
10242B83654l4456J9675J7965j0481j8781m2298R148J7578j2315L6952K1968j1994
10230B76615k6427j9137j0568l753R944k9657j1521N7080M4573O203l5417m5613
10218B12322L4568J2071q395j7474k9929k1270J1269J2557K543o333n839J835
10206A97925j8460P549p842L2381K3153j3776p457l5248n1533J7112K7961K2952
10194A94717L3359J6661j6471j0032l7358k0467J6267j6225K8299J7272P394J9496
10182B32912j3052J6854J9473J5730J742L405L8778N4242M4184M4239M6441R6755
10170F01703J30899J35268K27150L09077L51131L08176J98564P1703r0752k88147
$$ plain form
10160 1954772 1584791 1258136 1008358 813374 688862 590617 512228 462609 489344 498841
10150 498841 473563 442337 430095 423645 416747 373565 366557 334495 319129 315880 287914 288838 321300
10137 321300 306617 289927 288251 273202 268656 227771 226884 263713 267048 263930 265758 255992 266657
10124 266657 261358 239706 231401 235524 237531 224424 208323 208037 206979 190961 187643 228273 229103
10111 229103 183919 179217 174564 164020 171578 213662 195006 138829 139449 147864 131426 129069 107914
10098 107914 87940 104443 105182 106257 99803 103774 117238 148510 145633 122847 114828 110341 105741
10085 105741 114798 119399 130756 133627 153728 135565 109634 103931 92798 114002 124302 122095
10073 122095 122654 94537 78404 93743 109622 115078 107811 111628 90691 63306 53414 70538 74683
$$ packed form
10160A954772l69981l26655k49778j94984j24512r8245p8389m9619K6735R497
10150D98841k5278l1226j2242o450o898m3182p008l2062j5366l249k7966R24L2462
10137C21300j4683j6690j676j5049m546m0885q87L6829L335l118J828r766J0665
10124B66657n299k1652q305M123K007j3107j6101k86j058j6018l318M0630Q30
10111B29103m5184m702m653j0544P558M2084j8656n6177O20Q415j6438k357k1155
10098A07914j9974J6503P39J075o454L971J3464L1272k877k2786q019m487m600
10085A05741R057M601J1357K871K0101j8163k5931n703j1133K1204J0300k207
10073A22095N59k8117j6133J5339J5879N456p267L817k0937k7385r892J7124M145
$$ plain form
10060 74683 78429 114789 147274 129391 93611 101653 130017 144637 115623 91772 86000 79755
10048 79755 96807 124371 123930 127001 129137 158409 169577 188274 206852 213481 203341 175394 180335
10035 180335 193501 181455 155639 154483 140931 125100 90336 57944 70126 77399 68549 82077
10023 82077 88387 88151 91457 68521 78552 67145 46815 44915 39770 65684 74775 75906 68522
10010 68522 68501 62625 61167 60276 83992 108588 91033 72683 70156 77969 73094 69405 97860 97832
9996 97832 91546 132777 116120 95295 67172 40697 44088 44226 66338 120460 124603 94259 69386
9983 69386 47895 31482 42697 71127 56487 64178 76216 94842 74625 44963 30949 19471
9971 19471 45429 85504 92134 70668 66865 46379 44397 56280 83691 86419 48698 45322 50232
$$ packed form
10060G4683L746L6360L2485j7883l5780Q042K8364J4620k9014k3851n772o245
10048G9755J7052K7564m41L071K136K9272J1168J8697J8578O629j0140k7947M941
10035A80335J3166j2046k5816j156j3552j5831l4764l2392J2182P273q850J3528
10023H2077O310k36L306k2936J0031j1407k0330j900n145K5914R091J131p384
10010F8522k1n876j458q91K3716K4596j7555j8350k527P813m875l689K8455k8
9996I7832o286M1231j6657k0825k8123k6475L391J38K2112N4122M143l0344k4873
9983F9386k1491j6413J1215K8430j4640P691J2038J8626k0217k9662j4014j1478
9971A9471K5958M0075O630k1466l803k0486j982J1883K7411K728l7721l376M910
$$ plain form
9958 50232 43341 57902 57651 66319 90658 76229 51004 67948 85282 79352 58751 59362 44314
9945 44314 44058 74564 90594 91777 81674 95988 122369 112647 84924 106710 97301 92339 111614
9932 111614 101832 72277 77745 52070 28523 14386 14279 10540 13354 22471 41153 35004 27663
9919 27663 12119 4138 37901 52806 61928 44702 47131 61192 63850 47892 32256 51243 84556
9906 84556 84746 60814 45176 40633 67499 62841 36507 27617 29647 63112 66149 55377 43409
9893 43409 45942 37699 26673 42750 58194 57040 70661 74181 87403 73780 75170 71151 70105
9880 70105 78811 71316 59692 67481 90886 75507 61537 82811 97775 79892 43239 32370
9868 32370 -11820 -8048 18600 44379 67477 88654 79865 44196 62029 88986 58623 11701
$$ packed form
9958E0232o891J4561k51Q668K4339j4429k5225J6944J7334n930k0601O11j5048
9945D4314k56L0506J6030J183j0103J4314K6381r722k7723K1786r409m962J9275
9932A11614r782k9555N468k5675k3547j4137j07l739K814R117J8682o149p341
9919B7663j5544p981L3763J4905R122j7226K429J4061K658j5958j5636J8987L3313
9906H4556J90k3932j5638m543K6866m658k6334q890K030L3465L037j0772j1968
9893D3409K533q243j1026J6077J5444j154J3621L520J3222j3623J390m019j046
9880G0105Q706p495j1624P789K3405j5379j3970K1274J4964j7883l6653j0869
9868C2370m4190L772K6648K5779K3098K1177q789l5669J7833K6957l0363m6922
$$ plain form
9856 11701 16463 58574 75236 82526 75206 83457 101755 92961 65797 70807 90055 84142 82580
9843 82580 51523 35435 18724 17251 27790 41069 37959 35296 71112 88021 87183 65984 55013
9830 55013 50962 41017 51476 40431 36680 42077 40736 30258 63514 62626 81379 78757 49333
9817 49333 26384 28503 43632 88804 84411 39581 20731 34333 24270 7233 17275 20133
9805 20133 -1326 1385 3872 38758 55501 38367 -3103 -5572 36259 58987 62969 55646 39798
9792 39798 61290 47678 13899 23441 12392 8584 15369 7227 11807 31055 49906 16057 1399
9779 1399 28342 39141 30525 16149 6887 35251 38810 40654 29384 11755 10399 11274 356
9766 356 -12166 -2048 19055 28323 51432 88455 100288 85153 55118 39440 25531 26580 60694
$$ packed form
9856A1701M762M2111J6662P290p320Q251J8298q794k7164N010J9248n913j562
9843H2580l1057j6088j6711j473J0539J3279l110k663L5816J6909q38k1199j0971
9830E5013m051r945J0459j1045l751N397j341j0478L3256q88J8753k622k9424
9817D9333k2949K119J5129M5172m393m4830j8850J3602j0063j7037J0042K858
9805B0133k1459K711K487L4886J6743j7134m1470k469M1831K2728L982p323j5848
9792C9798K1492j3612l3779R542j1049l808O785q142M580J9248J8851l3849j4658
9779A399K6943J0799q616j4376r262K8364L559J844j1270j7629j356Q75j0918
9766C56j2522J0118K1103R268K3109L7023J1833j5135l0035j5678j3909J049L4114
$$ plain form
9753 60694 42017 4203 -2258 -20135 -16968 6812 40081 44806 31410 21093 4682 4721 21994
9740 21994 67038 83156 48637 31116 47256 45987 9133 -3060 -11813 10244 60603 69287
9728 69287 24588 19874 36098 51200 53002 33333 9895 11373 -15451 -2401 44531 56312
9716 56312 69630 84212 75380 36645 30848 38010 50013 39502 51619 29799 24378 14244 12638
9703 12638 -2124 -20352 6527 5060 3147 7548 -2731 -6810 -8185 16262 4218 -6190 -6432
9690 -6432 -21579 -9360 6223 14952 -7248 -20355 -4046 -2789 29499 12959 13450 29074 24435
9677 24435 18653 25977 45444 19836 40336 62339 31683 -10817 -21185 -10863 -9833 -21968
9665 -21968 -38058 -29528 -7784 29496 80658 69309 13709 -1160 9597 40363 60195 63609
$$ packed form
9753F0694j8677l7814o461j7877L167K3780L3269M725j3396j0317j6411L9J7273
9740B1994M5044J6118l4519j7521J6140j269l6854j2193q753K2057N0359Q684
9728F9287m4699m714J6224J5102J802j9669k3438J478k6824J3050M6932J1781
9716E6312J3318J4582q832l8735n797P162J2003j0511J2117k1820n421j0134j606
9703A2638j4762j8228K6879j467j913M401j0279m079j375K4447j2044j0408k42
9690f432j5147J2219J5583Q729k2200j3107J6309J257L2288j6540M91J5624m639
9677B4435n782P324J9467k5608K0500K2003l0656m2500j0368J0322J030j2135
9665b1968j6090Q530K1744L7280N1162j1349n5600j4869J0757L0766J9832L414
$$ plain form
9653 63609 39417 18991 5897 10393 14526 773 -8326 6010 19897 18093 7244 22877 11244
9640 11244 9546 31829 27891 58689 63244 56904 53522 52494 7462 1638 16398 50119 71347
9627 71347 56538 19780 30513 44581 50797 40615 28009 27551 63509 69644 30424 34600 62832
9614 62832 74813 73895 96173 87960 57415 60755 68800 43212 28165 35867 41921 47514 50558 59720
9600 59720 73361 67907 44609 37984 43975 8609 132 10066 14669 18052 32870 45024 45629 56168
9586 56168 18272 11295 27141 48665 49985 7759 15853 30927 40300 38027 39422 21156 36332
9573 36332 33888 33055 33221 2477 -6811 7834 -5335 -27106 -22892 -16063 -17025 -5308 -7092 -9120
9559 -9120 28457 43560 27770 16132 -439 12030 25672 15651 20506 48528 59840 65293
$$ packed form
9653F3609k4192k0426j3094M496M133j3753r099J4336J3887j804j0849J5633j1633
9640A1244j698K2283l938L0798M555o340l382j028m5032n824J4760L3721K1228
9627G1347j4809l6758J0733J4068O216j0182j2606m58L5958O135l9220M176K8232
9614F2832J1981r18K2278q213l0545L340Q045k5588j5047P702O054N593L044R162
9600E9720J3641n454k3298o625N991l5366q477R934M603L383J4818J2154O05J0539
9586E6168l7896o977J5846K1524J320m2226Q094J5074R373k273J395j8266J5176
9573C6332k444q33J66l0744r288J4645j3169k1771M214O829r62J1717j784k028
9559i120L7577J5103j5790j1638j6571J2469J3642j0021M855K8022J1312N453
$$ plain form
9547 65293 67654 74417 60262 37422 41956 62064 56773 35722 20015 -27360 -17430 20836 -117
9534 -117 -5387 10197 29541 25439 15056 19663 17294 26051 48510 82122 56103 56668 72348 51970
9520 51970 15697 13404 7759 14333 37593 14050 -4679 21882 58543 44300 18504 33526
9508 33526 43304 16080 25109 48746 35674 23255 3397 26904 45538 31320 5877 425
9496 425 10364 18493 15820 17791 25258 55529 52450 19495 -332 -11518 6006 1522 -6616 -6060
9482 -6060 20327 56126 88273 89202 44418 45701 37892 19987 12605 30698 56823 63122 60595
9469 60595 63797 47741 37755 40817 24387 -12306 -16124 4021 4563 18244 47617 36333 20624
9456 20624 30804 37934 41170 23257 21031 32254 35103 19295 21392 19063 7514 43564 50646
$$ packed form
9547F5293K361O763j4155k2840M534K0108n291k1051j5707m7375R930L8266k0953
9534a17n270J5584J9344m102j0383M607k369Q757K2459L3612k6019N65J5680k0378
9520E1970l6273k293n645O574K3260k3543j8729K6561L6661j4243k5796J5022
9508C3526R778k7224R029K3637j3072j2419j9858K3507J8634j4218k5443n452
9496D25R939Q129k673J971P467L0271l079l2955j9827j1186J7524m484q138N56
9482f060K6387L5799L2147R29m4784J283p809j7905p382J8093K6125O299k527
9469F0595L202j6056r986L062j6430l6693l818K0145N42J3681K9373j1284j5709
9456B0624J0180P130L236j7913k226J1223K849j5808K097k329j1549L6050P082
$$ plain form
9443 50646 47477 28560 23547 45686 47055 49233 62332 57802 86518 86841 51835 61080 67502 72465
9429 72465 69944 62681 81403 49182 45262 64052 71547 76020 76937 65051 75476 94230 100277
9416 100277 91869 102745 90134 75024 74963 76130 95422 55490 22642 44996 75119 48522 31534
9403 31534 42133 58061 55384 40547 32377 -11761 -14637 29914 35960 50152 49155 47368 35670
9390 35670 12377 -17306 -1150 22069 52710 77001 74052 90669 81917 65313 71740 88194
9378 88194 64793 45841 62069 65107 42872 72343 80115 69549 80471 107303 110533 116871 91210
9365 91210 97137 99137 117575 134839 126436 122713 129880 144626 168857 178511 200017 219679 233274
9352 233274 252983 258809 257119 248418 254918 268027 247043 257478 302066 312763 309658 310363 328221
$$ packed form
9443E0646l169j8917n013K2139J369K178J3099m530K8716L23l5006R245O422M963
9429G2465k521p263J8722l2221l920J8790P495M473R17j1886J0425J8754O047
9416A00277q408J0876j2611j5110o1J167J9292l9932l2848K2354L0123k6597j6988
9403C1534J0599J5928k677j4837q170m4138k876M4551O046J4192r97j787j1698
9390C5670k3293k9683J6156K3219L0641K4291k949J6617q752j6604O427J6454
9378H8194k3401j8952J6228L038k2235K9471P772j0566J0922K6832L230O338k5661
9365I1210N927K000J8438J7264q403l723P167J4746K4231R654K1506J9662J3595
9352B33274J9709N826j690q701O500J3109k0984J0435M4588J0697l105P05J7858
$$ plain form
9339 328221 362845 410904 437817 450011 477654 534321 581532 635296 687629 720833 751002 801835
9327 801835 884602 994916 1093860 1239952 1383009 1554075 1758232 2020802 2333698 2638454
9317 2638454 2987627 3372649 3802753 4201656 4561618 4872762 5084001 5170022 5123936 4956781
9307 4956781 4693235 4394409 4058049 3714587 3370341 3040287 2779471 2541060 2333455 2193288
9297 2193288 2034924 1888570 1756745 1643346 1559506 1460108 1406745 1351360 1280024 1236673 1193980
9286 1193980 1133396 1054822 987194 972976 907400 872100 841288 798168 793730 758249 690815 690221
9274 690221 715090 678740 623344 600498 617890 627685 612854 588585 557409 535303 531379 501249
9262 501249 450381 428277 438997 458601 462313 458238 461108 428462 376423 386933 412070 411286 407766
$$ packed form
9339C28221L4624M8059K6913J2194K7643N6667M7211N3764N2333L3204L0169N0833
9327H01835Q2767J10314R8944J46092J43057J71066K04157K62570L12896L04756
9317B638454L49173L85022M30104L98903L59962L11144K11239Q6021m6086j67155
9307D956781k63546k98826l36360l43462l44246l30054k60816k38411k07605j40167
9297B193288j58364j46354j31825j13399q3840r9398n3363n5385p1336m3351m2693
9286A193980o0584p8574o7628j4218o5576l5300l0812m3120m438l5481o7434n94
9274F90221K4869l6350n5396k2846J7392R795j4831k4269l1176k2106l924l0130
9262E01249n0868k2104J0720J9604L712m075K870l2646n2039J0510K5137p84l520
$$ plain form
9249 407766 379872 335343 344847 328581 326366 326437 317089 297077 306588 327541 323728 327908 308135
9236 308135 268780 231864 221467 237034 258573 253770 243805 244911 217507 245265 254602 234078
9224 234078 204980 200815 201925 191816 162898 138020 141380 163733 180888 181614 206455 209472 175428
9211 175428 146759 163325 175864 185276 182511 157383 149044 140295 144392 138312 149898 164183 155831
9198 155831 133221 154775 154727 146444 126643 119649 118448 134444 135824 128069 98749 94077 73282
9185 73282 66247 64261 68051 84062 141443 130287 99314 100637 114429 114289 93615 83232 103537
9172 103537 112937 101053 88685 101473 109153 119698 123295 135011 121717 134575 134823 103191 76115
9159 76115 49666 43579 52019 76681 107616 102334 102201 85709 52244 71340 49627 19510 -3474
$$ packed form
9249D07766k7894m4529R504j6266k215P1r348k0012R511K0953l813M180j9773
9236C08135l9355l6916j0397J5567K1539m803r965J106k7404K7758R337k0524
9224B34078k9098m165J110j0109k8918k4878L360K2353J7155P26K4841L017l4044
9211A75428k8669J6566J2539R412k765k5128q339q749M097o080J1586J4285q352
9198A55831k2610K1554m8q283j9801o994j201J5996J380p755k9320m672k0795
9185G3282p035j986L790J6011N7381j1156l0973J323J3792j40k0674j0383K0305
9172A03537R400j1884j2368J2788P680J0545L597J1716j3294J2858K48l1632k7076
9159G6115k6449o087Q440K4662L0935n282j33j6492l3465J9096k1713l0117k2984
$$ plain form
9146 -3474 -4375 -2138 -25240 -13197 10805 25790 47008 27678 24978 41200 34011 34975 65280
9133 65280 88167 48209 51365 29935 24893 29855 36660 33581 57230 83746 98332 100019 62333
9120 62333 46642 68009 78645 62900 63281 49292 37373 17758 22983 7598 -430 1065 45421
9107 45421 54100 52071 47477 33026 38515 60245 64699 39924 40388 32556 41493 34082 1528 -25918
9093 -25918 -27275 9749 26376 19088 33483 17160 19323 13617 19660 37271 35933 25233 24069
9080 24069 45341 67653 62657 67336 58546 24432 -2681 11478 -1463 -2894 21037 25384 22801
9067 22801 9807 24120 24089 31820 32749 51425 77168 64538 44051 17618 24394 24647 31188 67312
9053 67312 47766 41616 32399 -3188 -85 12469 -9931 -17471 -10821 23381 38990 20292 -4677
$$ packed form
9146c474r01K237k3102J2043K4002J4985K1218j9330k700J6222p189R64L0305
9133F5280K2887l9958L156k1430n042M962O805l079K3649K6516J4586J687l7686
9120F2333j5691K1367J0636j5745L81j3989j1919j9615N225j5385q028J495M4356
9107D5421Q679k029m594j4451N489K1730M454k4775M64p832Q937p411l2554k7446
9093b5918j357L7024J6627p288J4395j6323K163n706O043J7611j338j0700j164
9080B4069K1272K2312m996M679q790l4114k7113J4159j2941j431K3931M347k583
9067B2801j2994J4313l1P731R29J8676K5743j2630k0487k6433O776K53O541L6124
9053F7312j9546o150r217l5587L103J2554k2400p540O650L4202J5609j8698k4969
$$ plain form
9040 -4677 -5589 -8666 -17291 5017 16068 25482 20188 10465 18424 8167 -13924 -2889 14690 21399
9026 21399 23438 22234 23224 38230 22253 -5816 -33241 -15874 10255 9812 5853 18888 57708
9013 57708 65595 43095 -8961 -30747 -30112 6159 31537 10653 857 24550 10217 -8817 5293
9000 5293 17223 3553 -22970 -18814 -15926 -12390 535 2187 32054 43025 26848 31980 31280
8987 31280 17448 27954 6689 7685 12647 -3119 -15155 -17379 688 6068 12583 31247 22531
8974 22531 6856 -2515 -16154 -11319 42889 39970 10128 14467 40877 22312 15282 5468 36074
8961 36074 25382 1049 -24171 -23126 -5564 -75 26469 32559 20292 15381 12107 15256 30482
8948 30482 42428 59687 71628 37804 35177 43183 59669 44800 4226 16875 15866 24505 26766
$$ packed form
9040d677r12l077q625K2308J1051R414n294r723P959j0257k2091J1035J7579O709
9026B1399K039j204R90J5006j5977k8069k7425J7367K6129m43l959J3035L8820
9013E7708P887k2500n2056k1786O35L6271K5378k0884r796K3693j4333j9034J4110
9000E293J1930j3670k6523M156K888L536J2925J652K9867J0971j6177N132p00
8987C1280j3832J0506k1265R96M962j5766j2036k224J8067N380O515J8664q716
8974B2531j5675r371j3639M835N4208k919k9842M339K6410j8565p030r814L0606
8961C6074j0692k4333k5220J045J7562N489K6544O090j2267m911l274L149J5226
8948C0482J1946J7259J1941l3824k627Q006J6486j4869m0574J2649j009Q639K261
$$ plain form
8935 26766 38309 50941 55707 41617 31531 55229 80838 67103 70400 60286 34913 30640
8923 30640 21506 20975 -6981 -10774 3389 18530 -1279 -20464 -25325 -38350 -28296 -9548 4224
8910 4224 -3136 8306 17366 6003 11814 43677 56722 41394 36485 31308 53906 39151 23084
8897 23084 30310 -4501 -36049 -19295 -12176 13105 41785 19991 -4060 18539 30262 30389 33001
8884 33001 53061 43428 42336 66974 88869 90420 36849 -773 -26293 -2728 29859 23074 2832
8871 2832 -2619 5203 28506 25493 26421 14870 -21701 -17252 -1545 -833 -11304 6899 -10851 -3173
8857 -3173 -29240 -46570 -6520 9740 15061 38541 46922 19611 4257 3033 21280 13131 27399
8844 27399 33916 21207 19528 37458 39217 44496 41190 27825 12839 2934 16802 23067 18478
$$ packed form
8935B6766J1543J2632M766j4090j0086K3698K5609j3735L297j0114k5373m273
8923C0640r134n31k7956l793J4163J5141j9809j9185m861j3025J0054J8748J3772
8910D224p360J1442R060j1363N811L1863J3045j5328m909n177K2598j4755j6067
8897B3084P226l4811l1548J6754P119K5281K8680k1794k4051K2599J1723J27K612
8884C3001K0060r633j092K4638K1895J551n3571l7622k5520K3565L2587o785k0242
8871B832n451P822K3303l013R28j1551l6571M449J5707P12j0471J8203j7750P678
8857c173k6067j7330M0050J6260N321K3480Q381k7311j5354j224J8247q149J4268
8844B7399O517j2709j679J7930J759N279l306j3365j4986r905J3868O265m589
$$ plain form
8831 18478 30836 23876 21321 33023 53864 16597 40657 83076 72712 49132 21187 -21146
8819 -21146 -19783 -8944 -23126 -13211 -13239 -2912 -38094 -41311 -18113 -2311 -10966 -29612 -7290
8806 -7290 14165 36815 24147 565 1672 19594 27494 9687 -13721 -8246 -109 -8159 15200
8793 15200 24564 13481 21704 35954 27723 28436 13282 25205 30143 29745 40160 45778 29438 945
8779 945 7705 35345 35831 12693 -9669 3878 26853 10380 -4395 -8387 -13163 -11615 -25884
8766 -25884 -34113 -11588 10449 -15690 -18455 -9661 -12133 -10791 -1280 8881 30098 12183 -2611
8753 -2611 208 -15021 -1232 11061 1886 7747 -5937 31071 70433 36330 37710 44048 22447
8740 22447 -14459 -7831 -2426 -13486 -2210 3174 -42007 -37105 -6931 7333 15654 27310 33416
$$ packed form
8831A8478J2358o960k555J1702K0841l7267K4060M2419j0364k3580k7945m2333
8819b1146J363J0839j4182R915k8J0327l5182l217K3198J5802q655j8646K2322
8806g290K1455K2650j2668k3582J107J7922P900j7807k3408N475Q137q050K3359
8793A5200R364j1083Q223J4250q231P13j5154J1923M938l98J0415N618j6340k8493
8779I45O760K7640M86k3138k2362J3547K2975j6473j4775l992m776J548j4269
8766b5884q229K2525K2037k6139k765Q794k472J342R511J0161K1217j7915j4794
8753b611K819j5229J3789J2293r175N861j3684L7008L9362l4103J380O338k1601
8740B2447l6906O628N405j1060J1276N384m5181M902L0174J4264Q321J1656O106
$$ plain form
8727 33416 28305 14478 10781 3747 -10722 -7829 -18697 -20250 18923 16634 -25843 -36674 -34619
8714 -34619 -18949 312 11952 8441 32465 34478 -11464 -4820 -2847 -8776 -5853 -43650 -35805
8701 -35805 -10838 -4273 -18037 -38993 -25715 10057 4368 -10567 19705 31852 16134 -5342
8689 -5342 -587 8688 25253 16450 -2122 -12339 -9865 -18548 2107 -2364 -7746 9827 4892 -14905
8675 -14905 7141 45733 49423 53597 42853 24028 -17268 -15619 10874 23344 1989 19734
8663 19734 32981 23264 -6623 -6694 -13730 -32454 -49304 -55424 -23079 -2352 29684 46005 28836
8650 28836 20064 5738 7465 30209 41888 39317 27084 8658 7488 10711 5294 -6854 9952
8637 9952 17845 12276 1444 16385 -9170 -13368 -15120 -2522 -3020 14757 -5116 5464 10004
$$ packed form
8727C3416n111j3827l697p034j4469K893j0868j553L9173k289m2477j0831K055
8714c4619J5670J9261J1640l511K4024K013m5942O644J973n929K923l7797P845
8701c5805K4967O565j3764k0956J3278L5772n689j4935L0272J2147j5718k1476
8689e342M755R275J6565q803j8572j0217K474q683K0655m471n382J7573m935j9797
8675a4905K2046L8592L690M174j0744j8825m1296J649K6493J2470k1355J7745
8663A9734J3247r717k9887p1p036j8724j6850o120L2345K0727L2036J6321j7169
8650B8836q772j4326J727K2744J1679k571j2233j8426j170L223n417j2148J6806
8637I952P893n569j0832J4941k5555m198j752J2598m98J7777j9873J0580M540
$$ plain form
8624 10004 -13614 -27121 -3394 -32 -31730 -28476 -9958 7078 -4000 -9748 11494 9296 -13515
8611 -13515 7097 40533 48382 39309 18270 -21837 -36395 -46700 -35400 -35780 -22760 -7826 12688
8598 12688 -2366 1503 14585 -2015 34369 68331 40206 26423 25955 37867 46042 33020 24469
8585 24469 49631 50843 17216 -10211 -28438 5679 41370 20465 3370 -9872 14689 50163
8573 50163 53238 41313 27626 37179 23805 41370 46626 25339 42417 56445 82650 77105 80699
8560 80699 98717 51010 12355 -25184 -32309 -27955 -18162 -30677 -27502 -20202 -17766 12354 34707
8547 34707 21710 20041 41201 16776 19587 42074 41549 18269 -6929 -19096 -545 35835 25253
8534 25253 -11354 8386 29057 15858 44523 44649 16773 19711 21653 22123 23356 47322 57038
$$ packed form
8624A0004k3618j3507K3727L362l1698L254J8518J7036j1078n748K1242k198k2811
8611a3515K0612L3436P849r073k1039m0107j4558j0305J1300l80J3020J4934K0514
8598A2688j5054L869J3082j6600L6384L3962k8125j3783m68J1912Q175j3022q551
8585B4469K5162J212l3627k7427j8227L4117L5691k0905j7095j3242K4561L5474
8573E0163L075j1925j3687R553j3374J7565N256k1287J7078J4028K6205n545L594
8560H0699J8018m7707l8655l7539p125M354R793j2515L175P300K436L0120K2353
8547C4707j2997j669K1160k4425K811K2487n25k3280k5198j2167J8551L6380j0582
8534B5253l6607J9740K0671j3199K8665J26k7876K938J942M70J233K3966R716
$$ plain form
8521 57038 12860 -24404 -14328 16620 20621 14695 -8506 -17103 -47888 -44584 -2213 10021 8542
8508 8542 -12265 -5899 3387 -8883 -2296 20243 -5455 -7396 12339 -8928 -2567 10104 -14471
8495 -14471 -20474 5152 5799 1575 -12279 -17213 -25533 -30087 -43119 -75079 -70471 -39598 -52190
8482 -52190 -64927 -40501 -35756 -49642 -28744 2675 30717 23893 -12204 -35726 -8228 52029
8470 52029 64070 28050 46248 64385 31740 -6605 -19056 -17886 -4145 -19058 9001 35956
8458 35956 2814 -11815 -5745 4110 17748 49584 41312 19823 18357 24338 30969 10286 18459
8445 18459 49260 75555 61337 37802 39137 31919 15025 1623 8301 -978 920 -16741 -27818
8432 -27818 -15904 -19687 -7696 -3993 -8710 -13156 -11905 -10052 -8199 4077 15107 22711 28530 14486
$$ packed form
8521E7038m4178l7264J0076L0948M001n926k3201q597l0785L304M2371J2234j479
8508H542k0807O366R286j2270O587K2539k5698j941J9735k1267O361J2671k4575
8495a4471o003K5626O47m224j3854m934q320m554j3032l1960M608L0873j2592
8482e2190j2737K4426M745j3886K0898L1419K8042o824l6097k3522K7498O0257
8470E2029J2041l6020J8198J8137l2645l8345j2451J170J3741j4913K8059K6955
8458C5956l3142j4629O070R855J3638L1836q272k1489j466N981O631k0683Q173
8445A8459L0801K6295j4218k3535J335p218j6894j3402O678r279J898j7661j1077
8432b7818J1914l783J1991L703m717m446J251J853J853J2276J1030P604N819j4044
$$ plain form
8418 14486 26025 32359 -4509 1236 25930 19895 36569 49858 26756 31612 43371 2968 15654
8405 15654 35089 25811 2803 -23336 -12022 12809 18774 13679 19778 22640 8329 -5319 17319
8392 17319 28625 42948 40528 33445 22228 15364 38533 43349 17081 16351 12987 -3443 -27159
8379 -27159 -34318 -22979 9858 1434 -27826 -42258 -11855 -4814 -5254 -9339 -1516 13115 8436
8366 8436 1447 21478 14254 2216 -27724 -36521 -19318 5639 19946 36848 22502 -2383 18253
8353 18253 40685 36762 36226 31355 -2228 -30329 -36563 -17295 7640 12183 -6337 -39735 -30133
8340 -30133 -18971 4274 -21897 -61063 -106025 -91853 -87754 -63918 -36381 -44933 -28228 1503
8328 1503 11825 11039 -16562 3586 2002 27708 50818 34457 15755 17072 45432 67991 59564
$$ packed form
8418A4486J1539O334l6868N745K4694o035J6674J3289k3102M856J1759m0403J2686
8405A5654J9435r278k3008k6139J1314K4831N965n095O099K862j4311j3648K2638
8392A7319J1306J4323k420p083j1217o864K3169M816k6268p30l364j6430k3716
8379b7159p159J1339L2837q424k9260j4432L0403P041m40m085P823J4631m679
8366H436o989K0031p224j2038k9940q797J7203K4957J4307J6902j4346k4885K0636
8353A8253K2432l923n36m871l3583k8101o234J9268K4935M543j8520l3398R602
8340c0133J1162K3245k6171l9166m4962J4172M099K3836K7537q552J6705K9731
8328A503J0322p86k7601K0148j584K5706K3110j6361j8702J317K8360K2559q427
$$ plain form
8315 59564 47107 15321 -9291 -20654 22589 17245 8169 20956 12393 19506 13571 9993 9348
8302 9348 -8238 -29618 -19359 -14779 -16830 -35824 -16819 -26865 -46061 -61075 -45470 -56743
8290 -56743 -65856 -54403 -43266 -18723 -2166 -4101 -8471 -26928 -23044 -3522 -18777 -21012 10535
8277 10535 -11196 -4035 11274 -7429 -20114 -4225 -6479 -14330 3733 -23358 -60372 -96279
8265 -96279 -96390 -62580 -15239 -12833 -18148 -30146 -52887 -41553 -11397 -2798 -8462 3937 12064
8252 12064 9995 -1277 -3850 5860 -8443 -4465 3443 8523 32321 8261 -27310 -53998 -60975
8239 -60975 -29374 2946 -2054 -4677 -1543 -3990 17875 -3009 -48981 -68933 -39465 -17432 -22843
8226 -22843 -27130 -20501 -25997 -25185 -28550 -6058 2594 -12611 -25997 -25696 7398 35149 41190 35336
$$ packed form
8315E9564j2457l1786k4612j1363M3243n344r076J2787q563P113n935l578o45
8302I348j7586k1380J0259M580k051j8994J9005j0046j9196j5014J5605j1273
8290e6743r113J1453J1137K4543J6557j935m370j8457L884J9522j5255k235L1547
8277A0535k1731P161J5309j8703j2685J5889k254p851J8063k7091l7014l5907
8265i6279j11L3810M7341K406n315j1998k2741J1334L0156Q599n664J2399Q127
8252A2064k069j1272k573R710j4303L978P908N080K3798k4060l5571k6688o977
8239f0975L1601L2320n000k623L134k447K1865k0884m5972j9952K9468K2033n411
8226b2843m287O629n496Q12l365K2492Q652j5205j3386L01L3094K7751O041n854
$$ plain form
8212 35336 42170 46184 46293 31210 -3894 -21965 10783 -9916 -18202 12132 -10802 -34526 -30377
8199 -30377 -31181 -19761 -21041 -26496 -2273 -6831 -35762 -16693 -13171 -26425 -22789 -39287 -50908
8186 -50908 -36761 -20280 -12167 -34780 -48458 -49353 -29005 -23852 -9703 2248 -16998 -12084 22641
8173 22641 18181 25044 57092 53027 41521 19781 10264 6764 -10824 -23478 -37087 -21802 -39489
8160 -39489 -36510 -10359 9916 10625 14406 31320 47147 31285 35918 33971 12212 -18650 -28700
8147 -28700 -6370 22617 -5196 -5018 -30957 -9886 5311 17372 -1656 -23009 -1708 17216
8135 17216 39693 36318 16409 4493 13135 3812 -10626 -6216 -2831 -1515 13478 9577 37853
8122 37853 11014 4264 12528 7266 12488 3123 31352 22812 -6738 -37687 -30545 393 22081
$$ packed form
8212C5336O834M014J09j5083l5104j8071L2748k0699q286L0334k2934k3724M149
8199c0377q04J1420j280n455K4223m558k8931J9069L522j3254L636j6498j1621
8186e0908J4147J6481Q113k2613j3678q95K0348N153J4149J1951j9246M914L4725
8173B2641m460O863L2048m065j1506k1740r517l500j7588j2654j3609J5285j7687
8160c9489K979K6151K0275P09L781J6914J5827j5862M633j947k1759l0862j0050
8147b8700K2330K8987k7813J78k5939K1071J5197J2061j9028k1353K1301J8924
8135A7216K2477l375j9909j1916Q642r323j4438M410L385J316J4993l901K8276
8122C7853k6839o750Q264n262N222r365K8229q540k9550l0949P142L0938K1688
$$ plain form
8109 22081 2647 4158 6889 5313 617 358 4471 -6406 -81 -24130 -46243 -36808 -22023 -27117
8095 -27117 -38114 -14994 20035 24267 21176 33996 18300 8706 -27818 -47260 -49089 -48750 -36462
8082 -36462 -55159 -52134 -24389 -4504 28238 29469 38338 37178 42585 3081 13082 25411 32979
8069 32979 43459 27490 17132 2180 -24430 -49379 -28572 -5630 -3576 -26373 -62437 -26531
8057 -26531 10711 53092 60537 26111 6107 12371 -12844 -28078 -16251 15392 37088 17308
8045 17308 42408 43318 49788 48508 40628 -3355 -21746 -21881 8858 -16358 -18363 -8621 -13894 -40776
8031 -40776 -49168 -23847 -2466 -4598 595 1413 -11472 -19528 7603 17127 22632 11992 -12032
8018 -12032 -18838 14421 34982 30859 23781 23864 25663 35714 29863 59113 72622 77505 88862 73847
$$ packed form
8109B2081j9434J511K731j576m696k59M113j0877O325k4049k2113R435J4785n094
8095b7117j0997K3120L5029M232l091J2820j5696r594l6524j9442j829L39J2288
8082c6462j8697L025K7745J9885L2742J231Q869j160N407l9504J0001J2329P568
8069C2979J0480j5969j0358j4952k6610k4949K0807K2942K054k2797l6064L5906
8057b6531L7242M2381P445l4426k0004O264k5215j5234J1827L1643K1696j9780
8045A7308K5100R10O470j280p880m3983j8391j35L0739k5216k005R742n273k6882
8031d0776q392K5321K1381k132N193Q18j2885q056K7131R524N505j0640k4024
8018a2032o806L3259K0561m123p078Q3J799J0051n851K9250J3509M883J1357j5015
$$ plain form
8004 73847 52456 23039 19134 23108 32852 47339 21641 26624 28228 11400 6069 14599 1869
7991 1869 -1440 25978 36604 21086 32320 37592 53607 47885 43294 33634 74628 82113 49734
7978 49734 43507 63108 67805 65724 23609 -21854 -9853 6067 -12618 -37615 -14441 -8791 -9149
7965 -9149 -15232 5079 15149 -19459 -44664 -41461 -33619 -55150 -32860 -5875 5695 -9377 -17958
7952 -17958 5858 19342 24515 2328 -24460 -14933 17800 38474 32271 14511 -11179 -20969 11741
7939 11741 52805 12000 -23801 -20357 -30925 -55087 -41593 -9586 6439 20177 2572 -16298
7927 -16298 5922 13785 1550 -16189 -8341 14216 9122 -41994 -78451 -66832 -48634 -29951
7915 -29951 -20023 -4493 31739 5041 27010 36887 29090 27414 38168 42985 23846 75 -28086
$$ packed form
8004G3847k1391k9417l905L974R744J4487k5698M983J604j6828n331Q530j2730
7991A869l309K7418J0626j5518J1234N272J6015n722m591r660M0994P485l2379
7978D9734o227J9601M697k081m2115m5463J2001J5920j8685k4997K3174N650l58
7965i149o083K0311J0070l4608k5205L203P842k1531K2290K6985J1570j5072q581
7952a7958K3816J3484N173k2187k6788R527L2733K0674o203j7760k5690r790L2710
7939A1741M1064m0805l5801L444j0568k4162J3494L2007J6025J3738j7605j8870
7927a6298K2220P863j2235j7739P848K2557n094n1116l6457J1619J8198J8683
7915b9951R928J5530L6232k6698K1969R877p797j676J0754M817j9139k3771k8161
$$ plain form
7902 -28086 -23681 -30110 -19386 27328 13144 -4004 15911 9320 5552 10353 5023 12592 6180
7889 6180 -14583 -4543 7605 5361 9799 9129 -26977 -1501 4698 8726 12144 -7893 -45883
7876 -45883 -13754 17208 -6990 -8603 1107 12214 -2514 -16838 -11768 28013 52719 56860 71438
7863 71438 62648 13982 3303 -8682 -19589 16628 37933 2826 1137 6797 30797 23925 38404
7850 38404 48610 35144 6253 -7035 -10886 -16863 -38981 -62488 -84390 -64612 -39716 -11438
7838 -11438 -37617 -44195 -22542 -4174 -9225 -35865 -41166 -36238 -41115 -59682 -63202 -52756 -7488
7825 -7488 18128 11304 -19427 -2225 8521 14764 21230 22180 1783 4885 -17237 -44970 -61287
7812 -61287 -45257 -43860 -10684 -3498 -3023 21479 51522 31621 -6397 -25756 -35973 -8817 46956
$$ packed form
7902b8086M405o429J0724M6714j4184j7148J9915o591l768M801n330P569o412
7889F180k0763J0040J2148k244M438o70l6106K5476O199M028L418k0037l7990
7876d5883L2129L0962k4198j613R710J1107j4728j4324N070L9781K4706M141J4578
7863G1438q790m8666j0679j1985j0907L6217K1305l5107j689N660K4000o872J4479
7850C8404J0206j3466k8891j3288l851n977k2118k3507k1902J9778K4896K8278
7838a1438k6179o578K1653J8368n051k6640n301M928m877j8567l520J0446M5268
7825g488K5616o824l0731J7202J0746O243O466R50k0397L102k2122k7733j6317
7812f1287J6030J397L3176P186M75K4502L0043j9901l8018j9359j0217K7156N5773
$$ plain form
7799 46956 29439 -6977 6029 24971 18147 15747 19644 17732 4115 -25640 -25961 -24197 -23817 -30523
7785 -30523 -50906 -47680 -16819 -3065 7038 7441 -4478 -5244 10106 8557 22080 1910 -12444
7772 -12444 -40015 -35087 -10554 9068 5485 -18473 -14224 -3433 385 -8332 -16173 -4266 -7362
7759 -7362 6795 13529 -11085 217 23062 -21985 -23981 -38881 -37870 -45075 -46055 -55513 -40357
7746 -40357 -11240 19041 29734 10322 -21750 -27564 -36372 -8597 19388 -22731 -41283 -23359
7734 -23359 8712 -4872 -9780 -32949 -36954 -15564 1371 36046 35699 38920 49563 41057 2534
7721 2534 18666 23899 -12085 -48237 -35108 -45349 -60483 -67806 -34750 12942 37680 20612
7709 20612 8404 12300 14936 -10962 -42248 -22607 -4541 -11740 -4380 -18813 -42134 -37823 -35351
$$ packed form
7799D6956j7517l6416J3006J8942o824k400L897j912j3617k9755l21J764L80o706
7785c0523k0383L226L0861J3754J0103M03j1919p66J5350j549J3523k0170j4354
7772a2444k7571M928K4533J9622l583k3958M249J0791L818q717p841J1907l096
7759g362J4157O734k4614J1302K2845m5047j996j4900J011p205r80r458J5156
7746d0357K9117L0281J0693j9412l2072n814q808K7775K7985m2119j8552J7924
7734b3359L2071j3584m908k3169m005K1390J6935L4675l47L221J0643q506l8523
7721B534J6132N233l5984l6152J3129j0241j5134p323L3056M7692K4738j7068
7709B0612j2208L896K636k5898l1286J9641J8066p199P360j4433k3321M311K472
$$ plain form
7696 -35351 -30918 -18473 -9046 -17242 25536 9027 -22963 -55118 -60970 -35668 -13093 -9683 -15751
7683 -15751 -36918 -35350 -8155 -21540 -33167 -27139 -21298 -6384 8483 19225 551 -14756
7671 -14756 2320 11925 27662 32700 40216 43917 33000 26100 16871 6233 -6494 18849 10324
7658 10324 -13814 -10203 -12705 600 19313 11257 -12 -14763 17449 12741 11006 15548 18684
7645 18684 -7947 -26023 -23070 -8629 -28625 -50690 -42326 -33680 -29561 -42883 -32000 -6198 -10335
7632 -10335 -21032 -8374 -9345 -19742 23292 53618 57561 63597 65147 40232 56953 59758 73383
7619 73383 28843 -97 9458 19035 33577 15923 -28475 -26420 10520 10727 -24307 -44257 -45705
7606 -45705 -26327 -31711 -41399 7831 36526 16206 36909 47980 20228 -9912 -3842 -3064 -42444
$$ packed form
7696c5351M433J2445R427q196M2778j6509l1990l2155n852K5302K2575L410o068
7683a5751k1167J568K7195j3385j1627O028N841J4914J4867J0742j8674j5307
7671a4756J7076R605J5737N038P516L701j0917o900r229j0638j2727K5343q525
7658A0324k4138L611k502J3305J8713q056j1269j4751L2212m708j735M542L136
7645A8684k6631j8076K953J4441j9996k2065Q364Q646M119j3322J0883K5802m137
7632a0335j0697J2658r71j0397M3034L0326L943O036J550k4915J6721K805J3625
7619G3383m4540k8940R555R577J4542j7654m4398K055L6940K07l5034j9950j448
7606d5705J9378n384r688M9230K8695k0320K0703J1071k7752l0140O070P78l9380
$$ plain form
7593 -42444 -44663 1005 -13773 -5163 1447 12279 31556 23659 23279 38751 37607 9096 -875
7580 -875 -29398 -10417 1886 4733 -8715 -32105 -25107 -24563 -11818 -13757 -19091 12649 21115 18084
7566 18084 3713 -8527 -11013 -3824 -6959 3354 8221 14376 24998 27101 6735 -9391 -38412
7553 -38412 -43749 -16642 -23344 -69996 -62780 -51643 -33675 10805 38291 11817 -13335 -43052
7541 -43052 -34878 -19573 -37947 -36508 -12485 18606 38327 31140 19086 22129 -9873 -1336 26202
7528 26202 27802 32985 35682 28272 -26366 -55058 -26217 20090 3 -17516 -9841 16046 20495
7515 20495 -6834 -28688 -48114 -19838 -19055 -20270 -10409 6539 26568 12212 -12687 -24608 -25313
7502 -25313 2352 0 589 -24668 -13820 -7098 -33841 -46511 -31496 -34827 -9999 -52054 -73707
$$ packed form
7593d2444k219M5668j4778Q610O610J0832J9277p897l80J5472j144k8511r971
7580h75k8523J8981J2303K847j3448k3390O998N44J2745j939n334L1740Q466l031
7566A8084j4371j2240k486P189l135J0313M867O155J0622K103k0366j6126k9021
7553c8412n337K7107o702m6652P216J1137J7968M4480K7486k6474k5152k9717
7541d3052Q174J5305j8374J439K4023L1091J9721p187j2054L043l2002Q537K7538
7528B6202J600N183K697p410n4638k8692K8841M6307k0087j7519P675K5887M449
7515B0495k7329k1854j9426K8276P83j215R861J6948K0029j4356k4899j1921p05
7502b5313K7665k352N89k5257J0848O722k6743j2670J5015l331K4828m2055k1653
$$ plain form
7489 -73707 -47133 -7086 -21460 -8147 9433 -1066 -31041 -34353 -31402 -36646 -18450 -5452
7477 -5452 -23921 -60893 -69963 -49254 -61019 -28208 -13037 -25727 -17863 -8501 -15581 2625 -7469
7464 -7469 -36290 -27387 -50044 -40795 -14047 4777 10090 -4507 -15749 -28059 -3767 15869 1611
7451 1611 -34947 -58918 -31356 5477 42298 42379 10470 -25254 -29718 -61199 -91449 -87908 -86748
7438 -86748 -84245 -75899 -45469 -9537 -11309 -4573 22827 -5537 -19762 -22435 -39186 -48742 -47606
7425 -47606 -32088 -26415 -51539 -62416 -50893 -50279 -12420 3697 -5493 -11623 -17050 4871 -8711
7412 -8711 -10329 -40241 -52412 -55557 -39047 -33219 -28049 -27142 -3519 6068 1388 26313 34011 12688
7398 12688 -5139 -17345 -21427 -9465 -6591 -21692 -30499 -49467 -29192 -29361 -42200 -9911 -12918
$$ packed form
7489g3707K6574M0047j4374J3313J7580j0499k9975l312K951n244J8196J2998
7477e452j8469l6972r070K0709j1765L2811J5171j2690P864R362p080J8206j0094
7464g469k8821Q903k2657R249K6748J8824N313j4597j1242j2310K4292J9636j4258
7451A611l6558k3971K7562L6833L6821Q1l1909l5724m464l1481l0250L541J160
7438h6748K503Q346L0430L5932j772O736K7400k8364j4225k673j6751r556J136
7425d7606J5518N673k5124j0877J1523O14L7859J6117r190o130n427K1921j3582
7412h711j618k9912j2171l145J6510N828N170R07K3623R587m680K4925P698k1323
7398A2688j7827j2206m082J1962K874j5101q807j8968K0275j69j2839L2289l007
$$ plain form
7385 -12918 4886 -6557 -26062 -16823 -17680 -19893 -13666 -12843 -33260 -33545 -40737 -35534 -26425 -13985
7371 -13985 502 24084 24530 469 -29549 -41455 -15642 13116 22286 5602 -95 8744 -30189
7358 -30189 -30035 -14308 -6594 -15550 -8093 6648 -8922 -3461 -12373 -63874 -78087 -56379 -14681
7345 -14681 -7457 2490 10009 -11856 12328 17670 6577 6523 7959 17942 25160 28187 44011 43036
7331 43036 14936 -1115 14982 22269 24287 9587 5884 34995 21670 1038 1215 -3033 -4191
7318 -4191 2769 -3637 18091 15455 -19884 -21629 368 -5099 -111 -6542 -12280 9789 24945 23172
7304 23172 19350 7966 -8819 -17690 -22235 -14235 -14207 -42297 -38084 -17242 -10655 -6036 -23160 9439
7290 9439 33515 40891 -750 -17423 -8234 -3824 4006 9690 -28946 -47931 -28487 -46091 -44397
$$ packed form
7385a2918J7804j1443j9505R239q57k213O227Q23k0417k85p192N203R109J2440
7371a3985J4487K3582M46k4061l0018j1906K5813K8758R170j6684n697Q839l8933
7358c0189J54J5727P714q956P457J4741j5570N461q912n1501j4213K1708M1698
7345a4681P224R947P519k1865K4184N342j1093n4J436R983P218L027J5824r75
7331D3036k8100j6051J6097P287K018j4700l703K9111j3325k0632J77m248j158
7318d191O960o406K1728k636l5339j745K1997n467M988o431n738K2069J5156j773
7304B3172l822j1384j6785q871m545Q000K8k8090M213K0842O587M619j7124L2599
7290I439K4076P376m1641j6673R189M410P830N684l8636j8985J9444j7604J694
$$ plain form
7277 -44397 -19675 -25404 -57103 -35021 -21972 -25320 -27610 -36816 -35397 -42685 -43697 -59953 -64612
7264 -64612 -60490 -68193 -43479 -24045 5253 -15665 -52403 -57784 -32402 -14515 -9097 -21872 -71642
7251 -71642 -52316 -17133 -1463 902 -5298 35420 60449 33539 -11787 -9723 -30414 -10449
7239 -10449 -16333 1572 27339 8398 -7025 -669 -13300 -16560 -32846 -41600 -31091 -32431 -26346
7226 -26346 -14303 -25043 -18640 -19861 -12091 -3720 -19843 -30775 -18052 10850 -9251 -59817 -32249
7213 -32249 -23153 -26799 -36662 -12452 -24151 -23016 13272 45523 32947 -25899 -69212 -56565 -16484
7200 -16484 -20092 -4404 -18018 -44391 -16563 11740 5814 -14932 -31759 -13996 -29547 -55506
7188 -55506 -49590 -12241 26404 53629 31645 -3562 -13357 -10769 -3522 -6039 -3027 -18014 -19635
$$ packed form
7277d4397K4722n729l1699K2082J3049l348k290r206J419p288j012j6256m659
7264f4612M122p703K4714J9434K9298k0918l6738n381K5382J7887N418j2775m9770
7251g1642J9326L5183J5670K365o200M0718K5029k6910m5326K064k0691J9965
7239a0449n884J7905K5767j8941j5423O356j2631l260j6286q754J0509j340O085
7226b6346J2043j0740O403j221P770Q371j6123j0932J2723K8902k0101n0566K7568
7213c2249R096l646r863K4210j1699J135L6288L2251j2576n8846m3313J2647M0081
7200a6484l608J5688j3614k6373K7828K8303n926k0746j6827J7763j5551k5959
7188e5506N916L7349L8645K7225k1984l5207r795K588P247k517L012j4987j621
$$ plain form
7175 -19635 -20093 -24185 -12578 3419 -979 -13774 -24374 -8634 969 17915 42194 64437 32897
7162 32897 17384 11429 14408 5386 -12128 -40857 -44140 -16892 -16041 -14010 -8811 -3451 8700 19201
7148 19201 32491 27516 12943 10191 182 5771 -3212 -9388 -15967 -21727 -3884 -19935 -44995
7135 -44995 -31040 -17272 -33172 -39875 -36414 -39054 -19812 -18407 -30173 16482 29813 36428 17366
7122 17366 11617 11219 -28277 -33840 -26791 -8181 -23872 -40808 -22882 2878 -306 5722 -22242
7109 -22242 -21572 -23774 -12898 -18472 -23683 -14313 3542 -4305 -9798 -7303 -10028 -28308 -34739 -22986
7095 -22986 -21739 -12897 -13821 -22005 -4310 30111 61606 33513 19395 36548 19786 21129 12713
7082 12713 -34200 1168 5946 -14334 -6916 -15106 -24337 -29586 -14036 -3810 -10078 -37242 -36146
$$ packed form
7175a9635m58m092J1607J5997m398j2795j0600J5740R603J6946K4279K2243l1540
7162C2897j5513n955K979r022j7514k8729l283K7248Q51K031N199N360J2151J0501
7148A9201J3290m975j4573k752j0009N589q983o176o579n760J7843j6051k5060
7135d4995J3955J3768j5900o703L461k640J9242J405j1766M6655J3331O615j9062
7122A7366n749l98l9496n563P049J8610j5691j6936J7926K5760l184O028k7964
7109b2242O70k202J0876n574n211R370J7855p847n493K495k725j8280o431J1753
7095b2986J247Q842r24q184J7695L4421L1495k8093j4118J7153j6762J343q416
7082A2713m6913L5368M778k0280P418q190r231n249J5550J0226o268k7164J096
$$ plain form
7069 -36146 -33927 -19386 23027 36781 2665 -12182 21132 4423 -28498 -33621 -23468 -13791
7057 -13791 5182 -17586 5546 23727 -17567 -28544 -3058 11965 16963 12885 -2014 -4561
7045 -4561 14620 30112 8157 -27679 -33596 -13492 10514 -14043 -48447 -39721 -45827 -39003 -14220
7032 -14220 -2048 -18656 -36837 -5267 12397 21998 37520 44534 41290 28536 8264 -38252
7020 -38252 -43524 -34388 -31661 -25465 6882 16516 32744 27921 -5556 -4182 18860 30783 34692
7007 34692 40033 12076 -5505 -12398 -34845 -5592 -7346 -31178 -10054 7689 488 -3973 -24411
6994 -24411 -14514 -6752 -21119 -23097 -18115 -25845 -38545 -41697 -18423 1964 18217 15577 -16846
6981 -16846 -39595 -38390 -33081 -31199 -21350 -5000 -13045 -1920 10679 10574 -6641 4061 26695
$$ packed form
7069c6146K219J4541M2413J3754l4116j4847L3314j6709l2921n123J0153R677
7057a3791J8973k2768K3132J8181m1294j0977K5486J5023M998m078j4899k547
7045d561J9181J5492k1955l5836n917K0104K4006k4557l4404Q726o106O824K4783
7032a4220J2172j6608j8181L1570J7664R601J5522P014l244j2754k0272m6516
7020c8252n272R136K727O196L2347R634J6228m823l3477J374K3042J1923L909
7007C4692N341k7957j7581o893k2447K9253j754k3832K1124J7743p201m461k0438
6994b4411R897P762j4367j978M982p730j2700l152K3274K0387J6253k640l2423
6981a6846k2749J205N309J882R849J6350q045J1125J2599j05j7215J0702K2634
$$ plain form
6968 26695 6452 -39353 1616 43339 34148 24165 -24929 -37018 -28378 -4983 15477 -14927
6956 -14927 -57349 -57475 -35433 -14458 21077 42537 31233 -9369 -15112 -14462 -16743 -24572 -25914
6943 -25914 -27930 -10129 18783 8022 4097 9649 16620 4723 -9033 -31122 -17547 -28594 -34352
6930 -34352 -28765 -19522 -10812 -23742 -32829 -47495 -23878 -11351 13229 21507 16293 -17194 -22878
6917 -22878 -11873 -18962 -2048 1227 -19751 -18709 -35148 -7463 -1280 -20754 -31149 -41869 -28162
6904 -28162 -14848 -1895 -17125 -1185 16654 18210 47515 45218 19772 -6384 -14724 -19822 -26887
6891 -26887 -13804 -23330 -7454 31597 29584 34638 22830 -5765 -23847 -10199 1458 7561 40300
6878 40300 43468 26906 -4384 757 500 -16319 -43011 -42193 -51336 -50731 -49785 -46226 -41688 -14260
$$ packed form
6968B6695k0243m5805M0969M1723r191r983m9094j2089Q640K3395K0460l0404
6956a4927m2422j26K2042K0975L5535K1460j1304m0602n743O50k281p829j342
6943b5914k016J7801K8912j0761l925N552O971j1897j3756k2089J3575j1047n758
6930c4352N587R243Q710j2930r087j4666K3617J2527K4580Q278n214l3487n684
6917b2878J1005p089J6914L275k0978J042j6439K7685O183j9474j0395j0720J3707
6904b8162J3314J2953j5230J5940J7839J556K9305k297k5446k6156q340n098p065
6891b6887J3083r526J5876L9051k013N054j1808k8595j8082J3648J1657O103L2739
6878D0300L168j6562l1290N141k57j6819k6692Q18r143O05R46L559M538K7428
$$ plain form
6864 -14260 -22151 -27405 -17113 -6483 12609 27482 7009 612 -7685 -18454 -897 17471 -9740
6851 -9740 -33094 -9662 15738 10383 4066 26867 7001 -7154 1453 26029 35320 9827 831
6838 831 -13866 -24884 -2429 14968 765 -22108 -11312 14616 12041 22520 29990 33362 33877
6825 33877 18007 14705 4384 -9706 -8087 -11549 11973 -3096 13127 10488 -34498 -54998 -44887
6812 -44887 -40030 -48940 -46392 -17204 1633 8210 16028 -11861 -25204 -15754 -10023 -4399 17972
6799 17972 7483 -6359 -28991 -28450 -39774 -46227 -56721 -45504 -23568 -11351 -17872 -21023 -22361
6786 -22361 -19286 31843 31046 8296 -25264 -14275 -5699 -18769 -32497 -40054 -5148 -23592 -46720
6773 -46720 -39497 -22067 -5948 -13088 -5097 -29862 -22765 -33500 -6025 5675 -25726 -17262 -9282
$$ packed form
6864a4260p891n254J0292J0630J9092J4873k0473o397q297j0769J7557J8368k7211
6851i740k3354K3432K5400n355o317K2801j9866j4155Q607K4576R291k5493q996
6838H31j4697j1018K2455J7397j4203k2873J0796K5928k575J0479P470L372N15
6825C3877j5870l302j0321j4090J619l462K3522j5069J6223k639m4986k0500J0111
6812d4887M857q910K548K9188J8837O577P818k7889j3343R450N731N624K2371
6799A7972j0489j3842k2632N41j1324o453j0494J1217K1936J2217o521l151j338
6786b2361L075N1129p97k2750l3560J0989Q576j3070j3728p557L4906j8444k3128
6773d6720P223J7430J6119p140P991k4765P097j0735K7475J1700l1401Q464P980
$$ plain form
6760 -9282 -22248 -10351 9943 5430 8739 -6322 -1495 4387 -31185 -62596 -78013 -66976 -42980
6747 -42980 -20199 -660 6689 -2758 -28971 -9612 -12521 -31214 -37562 -41712 -38194 -11772 -9530
6734 -9530 -5581 27158 12338 -12951 -41195 -57432 -73291 -60045 -51022 -21320 -30054 -52889 -63667
6721 -63667 -48447 -32902 -40387 -18057 17539 25382 16759 -15350 -24354 -29874 -32390 -19588 11321
6708 11321 10295 -31100 -33162 -5643 -4415 -15843 5841 -6611 -33924 -26394 19143 24922 8039
6695 8039 -14597 -46136 -22267 4393 1702 -21690 -32091 -32936 -33333 -44202 -39809 -59789 -86232
6682 -86232 -78651 -55471 -19521 -19980 -21578 -31161 -9067 -20637 -29276 -13876 135 17778 13533
6669 13533 3720 6029 -30076 -37022 -58030 -77660 -80491 -70734 -65890 -56072 -76669 -63608 -23009
$$ packed form
6760i282j2966J1897K0294m513L309j5061M827N882l5572l1411j5417J1037K3996
6747d2980K2781J9539P349r447k6213J9359k909j8693o348m150L518K6422K242
6734i530L949L2739j4820k5289k8244j6237j5859J3246R023K9702q734k2835j0778
6721f3667J5220J5545p485K2330L5596P843q623l2109r004n520k516J2802L0909
6708A1321j026m1395k062K7519J228j1428K1684j2452k7313P530M5537N779j6883
6695H039k2636l1539K3869K6660k691k3392j0401q45l97j0869M393j9980k6443
6682h6232P581K3180L5950m59j598r583K2094j1570q639J5400J4011J7643m245
6669A3533r813K309l6105o946k1008j9630k831R757M844R818k0597J3061M0599
$$ plain form
6656 -23009 -30735 -27727 -25207 -7835 29032 14840 4487 -5703 -38373 -45948 -55229 -64477 -48852
6643 -48852 -32714 -34166 -27049 -32164 -5325 -14218 -34466 -19474 -34047 -9842 34778 54909 17277
6630 17277 -34719 -73603 -58158 -17413 32181 15093 -3720 789 -1848 -13799 -289 19726
6618 19726 17022 28430 14157 -8258 -30911 -34891 -27801 -37647 -37682 -44114 -61315 -24185 -38985
6605 -38985 -79522 -58425 -36066 -40513 -30879 -22747 -35776 -9456 -12511 -24793 -64290 -49953 -26381
6592 -26381 -227 7585 47835 24184 -44070 -55831 -47638 -30166 -1212 -3856 -12873 -15492 -46927
6579 -46927 -61566 -58669 -45169 -26396 -3007 6821 -22199 -37621 -23730 13024 14260 3773
6567 3773 -41378 -51239 -13079 -26152 -50301 -41695 -32085 -14382 -13556 5208 11047 21487 7639
$$ packed form
6656b3009p726L008K520J7372L6867j4192j0353j0190l2670p575r281r248J5625
6643d8852J6138j452P117n115K6839q893k0248J4992j4573K4205M4620K0131l7632
6630A7277n1996l8884J5445M0745M9594j7088j8813M509k637j1951J3510K0015
6618A9726k704J1408j4273k2415k2653l980P090r846l5o432j7201L7130j4800
6605c8985m0537K1097K2359m447R634Q132j3029K6320l055j2282l9497J4337K3572
6592b6381K6154P812M0250k3651o8254j1761Q193J7472K8954k644r017k619l1435
6579d6927j4639K897J3500J8773K3389R828k9020j5422J3891L6754J236j0487
6567C773m5151r861L8160j3073k4149Q606R610J7703Q26J8764N839J0440j3848
$$ plain form
6554 7639 1392 -26792 -46282 -42752 -7198 24093 44624 17317 -11545 -22049 -12782 6925 43709
6541 43709 64851 33265 -24591 -51065 -45224 -34881 -46953 -53946 -50419 -28278 -15221 -58888
6529 -58888 -58642 -27805 -354 10818 1831 -13270 -38401 -26013 -17522 -22301 -20241 341 40282
6516 40282 45000 40759 11102 11205 22700 34626 18765 -7268 -14317 -39301 -48709 -42716 -19955
6503 -19955 -24372 -31459 -18099 -7880 11581 6343 -44799 -38208 -10250 -54329 -53887 -11335 45203
6490 45203 37670 44591 46554 40812 11435 9779 21411 38832 26029 24590 12282 14202 2679
6477 2679 -8264 -16320 -36130 -60490 -23277 20598 44237 39254 14513 15452 39310 55483 71809
6464 71809 37974 12135 29478 39002 50031 37911 28176 29036 16756 -11612 6013 13180 4344
$$ packed form
6554G639o247k8184j9490L530L5554L1291K0531k7307k8862j0504R267J9707L6784
6541D3709K1142l1586n7856k6474N841J0343j2072o993L527K2141J3057m3667
6529e8888K46L0837K7451J1172q987j5101k5131J2388Q491m779K060K0582L9941
6516D0282M718m241k9657J03J1495J1926j5861k6033p049k4984r408N993K2761
6503a9955m417p087J3360J0219J9461n238n1142O591K7958m4079M42M2552N6538
6490D5203p533O921J963n742k9377j656J1632J7421j2803j439j2308J920j1523
6477B679j0943q056j9810k4360L7213M3875K3639m983k4741R39K3858J6173J6326
6464G1809l3835k5839J7343R524J1029j2120r735Q60j2280k8368J7625P167q836
$$ plain form
6451 4344 -3913 -14599 -33047 -11553 -34913 -57314 -25686 2009 16362 -9846 -1938 -11039 -30179
6438 -30179 -54378 -71219 -96923 -83739 -72960 -63023 -9422 32739 32542 18227 6287 15351 -4747
6425 -4747 -32924 -36890 -37106 -18513 -31387 -50857 -16021 8302 -11611 -9738 -9349 9157 19455
6412 19455 16005 8211 -14255 -12795 11729 10080 -8183 5125 12761 10069 25685 8522 7767
6399 7767 19361 24602 26210 6768 2077 4785 7806 -15661 -6960 30480 21672 -7793 -34164
6386 -34164 -27831 -26492 -19136 14179 -507 942 13915 -2434 -19957 -5731 14144 3969 -11591
6373 -11591 -20823 -4820 21595 17825 -1175 -15724 -4757 264 -24748 -46148 -22468 6363
6361 6363 31805 26412 3879 -34518 -71917 -72965 -62111 -27516 9828 4149 -2316 -6203 -29653
$$ packed form
6451D344q257j0686j8448K1494k3360k2401L1628K7695J4353k6208P908r101j9140
6438c0179k4199j6841k5704J3184J0779R937N3601M2161j97j4315j1940R064k0098
6425d747k8177l966k16J8593j2874j9470L4836K4323j9913J873L89J8506J0298
6412A9455l450p794k2466J460K4524j649j8263J3308P636k692J5616j7163p55
6399G767J1594N241J608j9442m691K708L021k3467Q701L7440q808k9465k6371
6386c4164O333J339P356L3315j4686J449J2973j6349j7523J4226J9875j0175j5560
6373a1591r232J6003K6415l770j9000j4549J0967N021k5012k1400K3680K8831
6361F363K5442n393k2533l8397l7399j048J0854L4595L7344n679o465l887k3450
$$ plain form
6348 -29653 -24234 -13902 -12276 -16775 -35844 -34787 5408 -4096 -15851 -15356 -35586 -33684 -24829 -4081
6334 -4081 48469 49927 23528 4942 -16216 -25713 -26844 -21817 -10851 -28270 -26304 -41869 -47775
6321 -47775 -11721 -12015 6263 21862 20673 5366 34707 34146 19420 2435 -6175 379 8107
6308 8107 15558 -14067 -27832 -20195 -15029 -4443 -18145 -21427 -32535 -1835 24554 -20556 -34825
6295 -34825 -47375 -71567 -62718 -46885 -34361 -21472 -15253 5362 35688 54664 23144 -4695
6283 -4695 20690 8524 11840 39564 26579 20217 25083 17806 6966 -10818 -8147 9108 10724
6270 10724 -8875 -25843 -60787 -77104 -43396 -6035 -29289 -47101 -47817 -49202 -61827 -76126
6258 -76126 -48697 -14762 -22062 -23655 -13603 -31190 -37482 -27301 -38626 -39237 -47529 -41139 -45582
$$ packed form
6348b9653N419J0332J626m499j9069J057M0195r504j1755M95k0230J902Q855K0748
6334d081N2550J458k6399j8586k1158r497j131N027J0966j7419J966j5565n906
6321d7775L6054k94J8278J5599j189j5307K9341n61j4726j6985q610O554P728
6308H107P451k9625j3765P637N166J0586j3702l282j1108L0700K6389m5110j4269
6295c4825j2550k4192Q849J5833J2524J2889O219K0615L0326J8976l1520k7839
6283d695K5385j2166L316K7724j2985o362M866p277j0840j7784K671J7255J616
6270A0724j9599j6968l4944j6317L3708L7361k3254j7812p16j385j2625j4299
6258g6126K7429L3935p300j593J0052j7587o292J0181j1325o11q292O390m443
$$ plain form
6245 -45582 -70385 -50571 -43036 -22546 -16266 9336 30578 -3031 -28682 -42502 -17049 -12844
6233 -12844 -28923 -29868 -13785 4324 16931 27881 8157 -10077 -23791 -9217 -14010 -44133
6221 -44133 -56673 -74837 -54007 -41319 -22342 -29304 -44248 -35005 -35673 -30179 -43451 -33863 5775
6208 5775 3894 -5405 -8420 16075 8785 4738 -6094 -11098 -23899 -27319 -7743 16637 25761 42248
6194 42248 -245 2067 19552 1878 492 -26700 -29737 -46507 -52040 -33414 -29887 -1868 15012
6181 15012 16989 -7352 5480 7565 27538 50675 14220 -7532 -24590 -16370 -45759 -56191
6169 -56191 -36728 -5369 -14891 -3446 37300 38522 25003 20310 18832 6569 -7366 -6415 -9564
6156 -9564 -25077 -20711 -26078 -1005 46549 57047 50331 42392 16345 -4313 12943 8387 -8540
$$ packed form
6245d5582k4803J9814P535K0490O280K5602K1242l3609k5651j3820K5453M205
6233a2844j6079r45J6083J8109J2607J0950j9724j8234j3714J4574m793l0123
6221d4133j2540j8164K0830J2688J8977o962j4944R243o68N494j3272R588L9638
6208E775j881r299l015K4495p290m047j0832n004j2801l420J9576K4380R124J6487
6194D2248m2493K312J7485j7674j386k7192l037j6770n533J8626L527K8019J6880
6181A5012J977k4341J2832K085J9973K3137l6455k1752j7058Q220k9389j0432
6169e6191J9463L1359r522J1445M0746J222j3519m693j478j2263j3935R51l149
6156i564j5513M366n367K5073M7554J0498o716p939k6047k0658J7256m556j6927
$$ plain form
6143 -8540 -6093 -25709 2000 26299 20759 -3135 -10417 20141 22824 7726 -30904 -40539 -45090
6130 -45090 -43388 -38980 -25303 2546 -9755 65 14240 22337 30125 12348 -29391 -33445 -51575
6117 -51575 -85148 -62139 -8735 -3019 -8610 22791 10347 -18632 -29113 -49132 -56967 -30506
6105 -30506 11337 29722 30703 25677 14325 9039 10829 -12611 -41075 -45595 -60448 -45167 -41795
6092 -41795 -16861 -1091 -267 4467 19706 37197 53368 5685 -45309 -45888 2305 21870 46222
6079 46222 33795 32292 38605 25814 -5627 -20616 12826 24044 -15150 8691 18815 -12948
6067 -12948 -21444 -41472 -34364 -5972 -1802 -3198 -4385 -11908 -43200 -17714 -2007 -28392 -27916
6054 -27916 -8786 -11766 -47149 -27615 -6980 -5752 -22124 -1480 3056 38815 65462 32768
$$ packed form
6143h540K447j9616K7709K4299n540k3894p282L0558K683j5098l8630r635m551
6130d5090J702M408J3677K7849j2301R820J4175Q097P788j7777m1739m054j8130
6117e1575l3573K3009N3404N716n591L1401j2444k8979j0481k0019p835K6461
6105c0506M1843J8385R81n026j1352n286J790k3440k8464m520j4853J5281L372
6092d1795K4934J5770Q24M734J5239J7491J6171m7683n0994n79M8193J9565K4352
6079D6222j2427j503O313j2791l1441j4989L3442J1218l9194K3841J0124l1763
6067a2948q496k0028P108K8392M170j396j187p523l1292K5486J5707k6385M76
6054b7916J9130k980l5383J9534K0635J228j6372K0644M536L5759K6647l2694
$$ plain form
6042 32768 3830 16866 -6608 -4665 3747 3750 10333 -2294 -24574 -16643 9968 4703 -2708 -14494
6028 -14494 -4921 2498 -19443 10278 23425 16833 681 -3759 3999 8043 6987 2876 13203
6015 13203 1675 -17518 -21260 -13514 -4996 -27753 -45904 -52125 -16637 -19866 -37060 -69292 -58598
6002 -58598 -33304 8717 4236 -4364 -552 -846 -4780 5773 13729 -22626 -15137 -4295 -15425
5989 -15425 -26784 -37694 -27251 26889 31928 -3045 -33716 -18248 16717 31422 24677 45452
5977 45452 46968 16503 8881 9543 15186 27207 5064 -19148 26770 54664 51734 28671 84
5964 84 -7786 -27340 -35093 -18632 -8379 2031 -7062 23270 24775 40651 40624 18746 -69855 -74265
5950 -74265 -35065 -8778 -22402 -13613 -8166 -17438 -24744 19830 61316 47146 46137 35131 7120
$$ packed form
6042C2768k8938J3036k3474J943Q412LO583j2627k2280P931K6611n265p411j1786
6028a4494R573P419k1941K9721J3147o592j6152m440P758M044j056m111J0327
6015A3203j1528j9193l742P746Q518k2757j8151o221L5488l229j7194l2232J0694
6002e8598K5294M2021m481q600L812k94l934J0553P956l6355P489J0842j1130
5989a5425j1359j0910J0443N4140N039l4973l0671J5468L4965J4705o745K0775
5977D5452J516l0465p622O62N643J2021k2143k4212M5918K7894k930k3063k8587
5964H4p870j9554p753J6461J0253J0410r093L0332J505J5876k7k1878q8601m410
5950g4265L9200K6287j3624Q789N447r272p306M4574M1486j4170j009j1006k8011
$$ plain form
5937 7120 -9722 -19255 -2604 -15674 -20254 -6363 16669 2571 305 -35619 -27017 -6269 5245
5924 5245 -8774 -55015 -48445 -47336 -25649 -20524 258 336 5824 12922 30260 17194 -22276 -27397
5910 -27397 -25863 -6989 13179 -3595 -42920 -39884 -19146 -17850 -34526 -4469 13191 28853
5898 28853 10893 -8679 11611 -859 -2354 25818 20570 -6679 -21200 -20605 -26970 -3918 1685
5885 1685 -9079 -22100 -8891 -11848 -5250 24352 42430 38357 14663 -12390 -18598 -11885 -30151
5872 -30151 -35275 -46524 -62292 -53568 -44830 -19808 -15446 3869 -4919 -21122 -29286 -12483 -29725
5859 -29725 -39475 -2935 8295 -26363 -49895 -20754 -21792 -31122 -47506 -45201 -34880 -13039 12882
5846 12882 22789 -3749 -24117 -42538 -41959 -7386 6337 -5636 2525 23215 4487 -5027 -14896
$$ packed form
5937G120j6842r533J6651j3070m580J3891K3032j4098k266l5924Q602K0748J1514
5924E245j4019m6241O570J109K1687N125K0782P8N488P098J7338j3066l9470n121
5910b7397J534J8874K0168j6774l9325L036K0738J296j6676L0057J7660J5662
5898B8853j7960j9572K0290j2470j495K8172n248k7249j4521N95o365K3052N603
5885A685j0764j3021J3209k957O598K9602J8078m073k3694k7053o208O713j8266
5872c0151n124j1249j5768Q724Q738K5022M362J9315q788j6203q164J6803j7242
5859b9725r750L6540J1230l4658k3532K9141j038r330j6384K305J0321K1841K5921
5846A2882R907k6538k0368j8421N79L4573J3723j1973Q161K0690j8728r514r869
$$ plain form
5833 -14896 -14711 16554 30352 10978 2595 4484 28700 24833 21818 4190 8550 35563 24398
5820 24398 -5729 -14177 -18299 7711 31668 16758 -10340 -9286 -21838 -2351 -4141 -18784 -9556
5807 -9556 20631 13404 3588 -9703 -17074 -16363 -17646 8199 11694 -1617 -9344 -16477 -4837 -2489
5793 -2489 -33089 -20984 -17799 -19070 -34590 -25354 -35928 -46193 -17739 -2030 488 4263 -8086
5780 -8086 -6168 18079 -6887 -30177 -23871 -16928 -4927 -9064 -40189 -49340 -56661 -49498 -58325 -79465
5766 -79465 -55156 -28029 -16452 3130 13134 12452 13726 791 9109 3237 -8191 -39281 -41644
5753 -41644 -24500 -13997 -19556 -21761 -3612 -6937 4087 155 -13796 -28131 -49842 -49171 -58656
5740 -58656 -26651 497 1416 3597 -8739 -6749 -18320 -36995 -20382 32512 31573 15750 -7733
$$ packed form
5833a4896J85L1265J3798j9374q383J889K4216l867l015j7628M360K7013j1165
5820B4398l0127q448m122K6010K3957j4910k7098J054j2552J9487j790j4643R228
5807i556L0187p227r816j3291p371P11j283K5845L495j3311p727p133J1640K348
5793b489l0600J2105L185j271j5520R236j0574j0265K8454J5709K518L775j2349
5780h086J918K4247k4966k3290O306O943J2001m137l1125r151p321P163q827k1140
5766g9465K4309K7127J1577J9582J0004o82J274j2935Q318n872j1428l1090k363
5753d1644J7144J0503n559k205J8149l325J1024l932j3951j4335k1711O71r485
5740e8656L2005K7148R19K181j2336J990j1571j8675J6613N2894r39j5823k3483
$$ plain form
5727 -7733 -20811 -32116 -52274 -29951 13358 12669 -19208 -6935 -15 7397 20239 24601 2901
5714 2901 -22780 -32702 -12960 41622 33772 -7678 -27490 -55118 -63306 -43028 -29483 -29272 -19344
5701 -19344 -20629 -8237 -16618 -7506 8952 11952 16576 2658 2610 -8202 31639 33877 35818 21662
5687 21662 5289 27819 43557 42300 36725 -6227 -43004 -56807 -71376 -55024 -44297 -39221
5675 -39221 -23714 -34453 -47464 -15926 1944 -9022 -11613 -12699 -20850 -18851 4172 19039 12596
5662 12596 -4664 -26262 -24197 -9532 9633 35062 71050 103398 106892 53209 28149 35711
5650 35711 17405 36291 39649 -13002 -48736 -39764 -10851 -2858 3853 -5300 -26525 -31389 -38145
5637 -38145 -26922 -23629 -19567 -44778 -30124 -5645 -11284 -17365 2592 4462 7563 8572 23533
$$ packed form
5727g733j3078j1305k0158K2323M3309o89l1877J2273O920P412J2842M362k1700
5714B901k5681r922J9742N4582p850m1450j9812k7628q188K0278J3545K11R928
5701a9344j285J2392q381R112J6458L000M624j3918m8j0812L9841K238J941j4156
5687B1662j6373K2530J5738j257n575m2952l6777j3803j4569J6352J0727N076
5675c9221J5507j0739j3011L1538J7870j0966k591j086q151J999K3023J4867o443
5662A2596j7260k1598K065J4665J9165K5429L5988L2348L494n3683k5060P562
5650C5711j8306J8886L358n2651l5734Q972K8913P993O711r153k1225m864o756
5637c8145J1223L293M062k5211J4654K4479n639o081J9957J870L101J009J4961
$$ plain form
5624 23533 -13347 -47581 -51354 -14449 61685 78549 62036 6489 -38288 -43600 -31323 12140
5612 12140 18547 -1073 -16284 -38944 -41848 -26128 -13114 -4523 11826 204 -13234 -35860
5600 -35860 -25236 -27633 -26579 -11699 14127 9343 -20908 -25264 -10481 3936 19143 12581 -27300
5587 -27300 -50974 -39875 -13910 32992 26252 -9232 13956 17655 27699 34043 -507 -14020
5575 -14020 -29798 -21111 -43928 -79117 -51012 -22835 -31511 -42571 -34512 -16514 -28087 -22623 -13220
5562 -13220 -23886 -30248 3125 4981 -34922 -74163 -83582 -55435 -30500 -298 19284 25592 16062
5549 16062 19434 31248 18932 7218 2314 -18400 -40522 -58743 -70682 -84248 -70667 -39862
5537 -39862 -31143 -28300 -30938 -4584 9842 -15950 -49230 -27365 19170 20337 9332 -19488 -28310
$$ packed form
5624B3533l6880l4234l773L6905P6134J6864j6513n5547m4777n312J2277M3463
5612A2140O407j9620j5211k2660k904J5720J3014Q591J6349j1622j3438k2626
5600c5860J0624k397J054J4880K5826m784l0251m356J4783J4417J5207o562l9881
5587b7300k3674J1099K5965M6902o740l5484K3188L699J0044O344l4550j3513
5575a4020j5778Q687k2817l5189K8105K8177q676j1060Q059J7998j1573N464R403
5562a3220j0666o362L3373J856l9903l9241r419K8147K4935L0202J9582O308r530
5549A6062L372J1814j2316j1714m904k0714k2122j8221j1939j3566J3581L0805
5537c9862Q719K843k638K6354J4426k5792l3280K1865M6535J167j1005k8820q822
$$ plain form
5524 -28310 2749 1163 -4478 -30004 -40474 -17839 2503 12139 -15100 -46646 -63617 -68925 -53800
5511 -53800 -49356 -68619 -63933 -56059 -27951 2509 10777 1352 15275 -6154 -51787 -47604 -23681
5498 -23681 -45780 8072 29120 -5994 -29284 -15358 6909 433 1347 12208 25984 1125
5486 1125 -17651 -26517 -50973 -54652 -21671 9062 12419 11267 34101 41907 12514 -13027 -5872
5473 -5872 -1607 24239 -1738 -26506 -17770 -10529 -21294 -20362 -10846 23058 4965 -17049 -35177
5460 -35177 -27356 -33058 -41904 -35219 -46740 -49929 -29128 -27189 -16138 -7301 6877 -4583 -1219
5447 -1219 1021 -14136 4786 1321 25232 39793 25170 24850 33519 20360 32908 31666 16399
5434 16399 7179 -4446 -18681 -8903 -44501 -29699 -5289 -9207 -14349 -32453 -7141 7506 7031
$$ packed form
5524b8310L1059j586n641k5526j0470K2635K0342R636k7239l1546j6971n308J5125
5511e3800M444j9263M686P874K8108L0460Q268r425J3923k1429m5633M183K3923
5498b3681k2099N3852K1048l5114k3290J3926K2267o476R14J0861J3776k4859
5486A125j8776q866k4456l679L2981L0733L357j152K2834P806k9393k5541P155
5473e872M265K5846k5977k4768Q736P241j0765R32R516L3904j8093k2014j8128
5460c5177P821n702q846O685j1521l189K0801J939J1051Q837J4178j1460L364
5447a219K240j5157J8922l465K3911J4561j4623l20Q669j3159J2548j242j5267
5434A6399r220j1625j4235R778l5598J4802K4410l918n142j8104K5312J4647m75
$$ plain form
5421 7031 24061 39171 28299 31353 14606 12658 -16398 -32536 -33134 6537 9451 40338 46063
5408 46063 15093 2539 -5630 -21144 -29116 -32973 -14553 -6303 -15403 -25142 -41815 -19119 -12915
5395 -12915 -60882 -83702 -72200 -76850 -63778 -27230 -24170 -37930 -40061 -58113 -30236 -29460 -28347
5382 -28347 -1551 2627 -20668 -29881 -19001 -11620 -13995 -22354 -22712 -26268 -17126 1455 -8268 -15659
5368 -15659 -4813 -9039 6182 6487 -12945 3548 19804 24163 -2520 -15232 -2228 34620 65361
5355 65361 63117 57515 29400 22248 -4449 -28663 -32185 -15687 -10920 7587 4717 -15318 1045
5342 1045 19997 42286 71170 69761 42099 8244 3072 -6600 6480 8089 7603 37570 39991
5329 39991 27497 27186 24275 144 -12576 -4018 14037 24379 12148 29248 49561 35308 20458
$$ packed form
5421G031J7030J5110j0872L054j6747j948k9056j6138n98L9671K914L0887N725
5408D6063l0970j2554q169j5514p972l857J8420Q250r100r739j6673K2696O204
5395a2915m7967k2820J1502m650J3072L6548L060j3760k131j8052K7877P76J113
5382b8347K6796M178k3295r213J0880P381k375q359l58l556R142J8581r723p391
5368a5659J0846m226J5221L05j9432J6493J6256M359k6683j2712J3004L6848L0741
5355F5361k244n602k8115p152k6697k4214l522J6498M767J8507k870k0035J6363
5342A045J8952K2289K8884j409k7662l3855n172r672J3080J609m86K9967K421
5329C9991j2494l11k911k4131j2720Q558J8055J0342j2231J7100K0313j4253j4850
$$ plain form
5316 20458 -24186 -51767 -70416 -73386 -78151 -77349 -64319 -41140 4200 -30523 -65890 -74845 -62553
5303 -62553 -33365 -7314 11946 -10566 1476 12480 -2203 -5908 16797 22982 -16566 -20735
5291 -20735 -3354 10076 32088 50165 44301 25180 -3466 23497 14900 1429 -11924 11273
5279 11273 5504 -1248 -3600 10816 23800 33383 28837 2187 -2066 10872 11789 10245 1162 6043
5265 6043 -5016 -4372 10643 11248 5614 7421 29297 49582 26764 23138 20674 -5692 -27536 -22948
5251 -22948 -2727 -11376 -37598 -35807 -36592 -49259 -70617 -46624 -19377 -29295 -35940 -19865 3947
5238 3947 28019 -7586 -35863 -10747 -2692 -15003 -3189 2675 2076 4079 2324 6390 4087 6116
5224 6116 28904 36332 28576 51964 25449 2238 23662 23114 12604 -13226 -10738 -34702 -39320
$$ packed form
5316B0458m4644k7581j8649k970m765Q02J3030K3179M5340l4723l5367q955J2292
5303f2553K9188K6051J9260k2512J2042J1004j4683l705K2705O185l9548m169
5291b0735J7381J3430K2012J8077n864j9121k8646K6963q597j3471j3353K3197
5279A1273n769o752k352J4416J2984R583m546k6650m253J2938R17j544r083M881
5265F043j1059O44J5015O05n634J807K1876K0285k2818l626k464k6366k1844M588
5251b2948K0221q649k6222J791p85j2667k1358K3993K7247r918o645J6075K3812
5238C947K4072l5605k8277K5116Q055j2311J1814N864n99K003j755M066k303K029
5224F116K2788P428p756K3388k6515k3211K1424n48j0510k5830K488k3964m618
$$ plain form
5211 -39320 -22229 -11588 -11793 16459 -3906 -13270 -36243 -21767 13628 18679 34765 18036 5554
5198 5554 -8416 -3834 30522 50218 37813 26058 9801 10302 6257 22643 20311 1713 -4004
5185 -4004 -12558 -12468 -28954 -48015 -42933 -13795 -31441 -31708 -42062 -19649 988 -5780 -17505 -26694
5171 -26694 14802 12087 -1849 24901 52104 45562 31376 2687 1912 -10985 -22710 -14464 20643
5158 20643 19449 18469 11537 14434 9911 5097 426 -3119 10200 12490 16195 782 -12281 -2172
5144 -2172 24318 23927 17249 47650 44040 52644 42600 19123 1000 -9701 -13630 -20706 10327
5131 10327 10506 -45785 -59292 -50243 -22979 -27841 -35107 -34971 -2608 -389 -33291 -99463 -91503 -51103
5117 -51103 -32736 20447 28048 9709 -10844 -7244 -1996 -7900 1435 -12958 -4807 -6948 26302
$$ packed form
5211c9320J7091J0641k05K8252k0365r364k2973J4476L5395N051J6086j6729j2482
5198E554j3970M582L4356J9696j2405j1755j6257N01m045J6386k332j8598n717
5185d004q554R0j6486j9061N082K9138j7646k67j0354K2413K0637o768j1725r189
5171b6694M1496k715j3936K6750K7203o542j4186k8689p75j2897j1725Q246L5107
5158B0643j194r80o932K897m523m814m671l545J3319K290L705j5413j3063J0109
5144b172K6490l91o678L0401l610Q604j0044k3477j8123j0701l929p076L1033
5131A0327J79n6291j3507R049K7264m862p266J36L2363K219l2902o6172P960M0400
5117e1103J8367N3183P601j8339k0553L600N248n904R335j4393Q151k141L3250
$$ plain form
5104 26302 27464 4097 40991 72178 48933 64405 50148 25526 5525 -34787 -67110 -51051
5092 -51051 3912 24969 25174 17821 11869 22944 33448 20895 10639 2994 -6940 -8253 -21577
5079 -21577 -13133 -6342 1349 20560 5779 -10225 -19703 14071 7367 21625 51882 33382 20558
5066 20558 13083 -5190 -4605 -24097 -20157 -7218 19097 41384 18225 -15727 -16624 -33373 -34517
5053 -34517 -37215 -51485 -60335 -34552 -386 1028 -11641 -8046 -2519 18026 -2463 10007 19034
5040 19034 13845 28636 53945 53550 30923 42660 27201 37622 5640 848 -4182 -23926 -24304
5027 -24304 305 -2314 -17312 -11029 -7862 26896 70657 42513 -2149 4606 4178 -7494 -12873
5014 -12873 -20693 -5078 -29098 -7586 -16231 -6033 -8210 9052 21099 49339 28907 45535
$$ packed form
5104B6302J162k3367L6894L1187k3245J5472j4257k4622k0001m0312l2323J6059
5092e1051N4963K1057K05p353n952J1075J0504j2553j0256p645r934j313j3324
5079b1577Q444O791P691J9211j4781j6004r478L3774o704J4258L0257j8500j2824
5066B0558p475j8273N85j9492L940J2939K6315K2287k3159l3952q97j6749j144
5053c4517k698j4270q850K5783L4166J414j2669L595N527K0545k0489J2470R027
5040A9034n189J4791K5309l95k2627J1737j5459J0421l1982m792n030j9744l78
5027b4304K4609k619j4998O283L167L4758M3761k8144m4662O755m28j1672n379
5014a2873p820J5615k4020K1512q645J0198k177J7262J2047K8240k0432J6628
$$ plain form
5002 45535 17942 -23126 -65892 -62787 -13647 13070 -4537 -24008 -7600 5637 -397 -28763
4990 -28763 -34747 -40694 -35352 -28931 -8104 -9970 -3028 10420 3805 13625 -14344 -34806 -22284
4977 -22284 -13201 1442 14127 22418 29869 14039 1721 3032 5971 11660 11914 -19110 -18196 16360
4963 16360 47418 36698 45496 48242 57849 70883 35926 24867 24519 7491 -1618 -24886 -32584
4950 -32584 -9304 -19823 -10907 11409 3319 -573 -2639 -11432 4105 22748 23265 8980 21896
4937 21896 36271 23307 -10171 -17009 -29473 -8887 -25198 -23132 -8776 -6905 9979 14324 -489
4924 -489 -12243 5208 19364 -13158 -24195 231 23480 19306 13442 -387 -11443 -46967 -60949
4911 -60949 -48312 -23037 22659 57066 47509 9855 3795 15606 24553 34184 1898 11740 27623
$$ packed form
5002D5535k7593m1068m2766L105M9140K6717j7607j9471J6408J3237o034k8366
4990b8763n984n947N342O421K0827j866O942J3448o615R820k7969k0462J2522
4977b2284R083J4643J2685Q291P451j5830j2318J311K939N689K54l1024R14L4556
4963A6360L1058j0720Q798K746R607J3034l4957j1059l48j7028r109k3268p698
4950c2584K3280j0519Q916K2316q090l892k066q793J5537J8643N17j4285J2916
4937B1896J4375j2964l3478o838j2464K0586j6311K066J4356J871J6884M345j4813
4924d89j1754J7451J4156l2522j1037K4426K3249m174n864j3829j1056l5524j3982
4911f0949J2637K5275M5696L4407r557l7654o060J1811Q947R631l2286R842J5883
$$ plain form
4898 27623 10042 -30336 -31355 -16776 -15298 -26116 -13448 -504 -22012 -34594 -36332 -15556
4886 -15556 9146 6483 10668 -363 -31321 -19786 10652 3784 3974 7932 11350 -9800 -4914
4873 -4914 -12894 -45679 -39234 -6313 4332 17163 -8544 -5906 12657 16712 -5310 -30325 -38275
4860 -38275 -19162 -30323 -16001 -6303 23028 34331 -10929 5509 21178 16001 -9779 3620
4848 3620 13682 13489 -17072 -19210 -16313 -18843 -30458 -29566 -29688 -47250 -31519 -52067 -30148 -11044
4834 -11044 -7075 -14159 -35849 -45383 -22281 -16061 -9701 -31804 -45890 -28066 1519 18934 42436
4821 42436 49707 63024 53120 29069 22929 18999 16621 46588 55742 40097 25318 1363 -28577
4808 -28577 -24937 21351 29657 9748 -16793 -38186 -28818 -29953 -40072 -20248 24808 45945 43343
$$ packed form
4898B7623j7581m0378j019J4579J478j0818J2668J2944k1508j2582j738K0776
4886a5556K4702k663M185j1031l0958J1535L0438o868J90L958L418k1150M886
4873d914p980l2785O445L2921J0645J2831k5707K638J8563M055k2022k5015p950
4860c8275J9113j1161J4322R698K9331J1303m5260J6438J5669n177k5780J3399
4848C620J0062j93l0561k138K897k530j1615Q92j22j7562J5731k0548K1919J9104
4834a1044L969p084k1690r534K3102O220O360k2103j4086J7824K9585J7415K3502
4821D2436P271J3317r904k4051o140l930k378K9967R154j5645j4779k3955k9940
4808b8577L640M6288Q306j9909k6541k1393R368j135j0119J9824M5056K1137k602
$$ plain form
4795 43343 28737 33729 37251 8082 -8523 -42314 -33517 -13658 -4360 1285 -5397 -30856 -22888
4782 -22888 2054 30193 1348 -23556 -29032 -22069 -16377 8227 10746 -16836 -32875 -26995 -18486
4769 -18486 -5840 -3240 6186 -3139 -18867 -22160 -22055 -19484 -3290 11902 2802 21436 20163 -2415
4755 -2415 3069 2670 20177 41910 34721 9258 -3927 8272 -15657 -23460 -31140 -40531 -18042
4742 -18042 -7824 2173 -27596 -63732 -75348 -40268 -23287 -27653 -8879 -14625 -35434 -51869
4730 -51869 -61878 -25652 -26578 -36993 -20184 -8400 -17674 -4905 -26447 -25273 -26079 -15803 -12329
4717 -12329 -32897 -33416 -4537 21765 13020 99 -4994 -13956 -285 11551 4252 16001 17122
4704 17122 17139 20355 25666 7087 10328 -328 -6960 -31535 -45323 -32710 -9847 -1950 -14020
$$ packed form
4795D3343j4606M992L522k9169j6605l3791Q797J9859R298N645o682k5459P968
4782b2888K4942K8139k8845k4904n476O963N692K4604K519k7582j6039N880Q509
4769a8486J2646K600R426r325j5728l293J05K571J6194J5192r100J8634j273k2578
4755b415N484l99J7507K1733p189k5463j3185J2199k3929p803p680r391K2489
4742a8042J0218R997k9769l6136j1616L5080J6981m366J8774n746k0809j6435
4730e1869j0009L6226r26j0415J6809J1784r274J2769k1542J174q06J0276L474
4717a2329k0568n19K8879K6302q745j2921n093q962J3671J1836p299J1749J121
4704A7122J7L216N311j8579L241j0656o632k4575j3788J2613K2863P897j2070
$$ plain form
4691 -14020 -22821 -23762 830 17906 32039 -5747 -6501 12057 4998 -8144 4053 14592 34051
4678 34051 20915 20744 11206 -6523 -36125 -35904 -28989 -27824 -34524 -24949 -20938 -22965 -14121 -39026
4664 -39026 -11072 -373 17126 19222 8944 -12023 -19119 13999 43993 38716 32366 19162 20790
4651 20790 46224 43317 8670 2683 20202 -2338 -34584 6893 39190 41039 13528 -25308
4639 -25308 -37754 -32963 -13563 -8253 -32090 -36868 -6670 21591 1180 17846 28796 -6617
4627 -6617 -5218 -5624 12734 20694 39029 69586 70388 33985 -1680 -2513 -9429 -7442 -10126 -14154
4613 -14154 -14375 -9022 26940 5549 -16117 -32624 -34431 -39664 -45267 -47844 -53708 330 28622
4600 28622 16734 29852 46044 35466 32433 10438 746 10564 31134 49560 54292 45232 18390
$$ packed form
4691a4020q801r41K4592J7076J4133l7786p54J8558p059j3142J2197J0539J9459
4678C4051j3136j71r538j7729k9602K21O915J165o700R575M011k027Q844k4905
4664c9026K7954J0699J7499K096j0278k0967p096L3118K9994n277o350j3204J628
4651B0790K5434k907l4647n987J7519k2540l2246M1477L2297J849k7511l8836
4639b5308j2446M791J9400N310k3837m778L0198K8261k0411J6666J0950l5413
4627f617J399m06J8358P960J8335L0557Q02l6403l5665q33o916J987k684m028
4613a4154k21N353L5962k1391k1666j6507j807n233n603k577n864N4038K8292
4600B8622j1888J3118J6192j0578l033k1995r692R818K0570J8426M732r060k6842
$$ plain form
4587 18390 13227 6076 -280 -21406 -22515 -31982 -43349 -20569 30395 31973 -2063 -13390 -10213
4574 -10213 -19455 -7165 -3495 18715 21087 5977 2428 -25881 -49261 -59893 -50794 -42656 -15950
4561 -15950 -855 -1181 1973 30040 49764 42046 14497 46717 87203 82976 83941 72552 44261
4548 44261 49007 22712 8941 -18513 -4052 31829 39563 40908 45524 28344 7189 8973 -6899
4535 -6899 3858 21941 26044 18919 -17550 -30297 -5569 18217 27442 5979 -1654 -2342 -7128
$$ packed form
4587A8390n163p151o356k1126j109r467j1367K2780N0964J578l4036j1327L177
4574a0213r242J2290L670K2210K372j5110l549k8309k3380j0632R099Q138K6706
4561a5950J5095l26L154K8067J9724p718k7549L2220M0486m227R65j1389k8291
4548D4261M746k6295j3771k7454J4461L5881P734J345M616j7180k1155J784j5872
4535f899J0757J8083M103p125l6469j2747K4728K3786R225k1463p633o88m786
$$ [...]
##END NTUPLES=NMR SPECTRUM
##END=
