##TITLE=Analysis number 317401
Compound Code sb 01597
Book Reference 2
Project Code qc-cat
Chemist Name glenb
##JCAMPDX= 6.0         $$ Bruker NMR JCAMP-DX V2.0
##DATA TYPE= NMR SPECTRUM
##DATA CLASS= NTUPLES
##ORIGIN= Bruker BioSpin GmbH
##OWNER= nmr
$$ XWIN-NMR		Version 3.5
$$ Tue Feb 21 11:26:36 2006 GMT Standard Time (UT+0h)  MAYBRIDGE\nmr@NMR_250MHZ
##.OBSERVE FREQUENCY= 250.131544655141
##.OBSERVE NUCLEUS= ^1H
##.ACQUISITION MODE= SIMULTANEOUS (DQD)
##.ACQUISITION SCHEME= undefined
##.AVERAGES= 16
##.DIGITISER RES= 18
##SPECTROMETER/DATA SYSTEM= dpx250
##.PULSE SEQUENCE= zg30
##.SOLVENT NAME= CDCl3
##.SHIFT REFERENCE= (INTERNAL, CDCl3, 0, 16.522)
##AUDIT TRAIL= $$ (NUMBER, WHEN, WHO, WHERE, WHAT)
$$ ##TITLE= Audit trail, XWIN-NMR		Version 3.5
$$ ##JCAMPDX= 5.01
$$ ##ORIGIN= Bruker BioSpin GmbH
$$ ##OWNER= nmr
$$ C:\u/data/dgb/nmr/ADRS/16510/pdata/1/auditp.txt
$$ ##AUDIT TRAIL=  $$ (NUMBER, WHEN, WHO, WHERE, WHAT)
(   1,<2006-02-21 11:26:10.06 +000>,<MAYBRIDGE\nmr>,<NMR_250MHZ>,
      <created by zg, POWCHK disabled, PULCHK disabled
       configuration hash MD5:
       84 BC 41 DB A1 6E 1D 46 DA 25 12 A5 C1 ED C5 3A
       data hash MD5: 64K
       09 A6 43 EF BF DB E0 37 4E 71 7B 2C 31 97 63 22>)
(   2,<2006-02-21 11:26:23.47 +000>,<MAYBRIDGE\nmr>,<NMR_250MHZ>,
      <Start of raw data processing
       ef LB = 0.3 FT_mod = 6 PKNL = 1 SI = 32K 
       data hash MD5: 32K
       A4 AE 40 EA D4 BB 9D 5D 90 F6 11 5F DB A0 C7 18>)
(   3,<2006-02-21 11:26:25.17 +000>,<MAYBRIDGE\nmr>,<NMR_250MHZ>,
      <apk 
       data hash MD5: 32K
       28 DA 3B CD EB 60 BC C7 69 0D BC 47 40 6C 82 72>)
(   4,<2006-02-21 11:26:26.03 +000>,<MAYBRIDGE\nmr>,<NMR_250MHZ>,
      <abs ABSG = 5 
       data hash MD5: 32K
       25 B2 2A 36 B4 28 FD 3E 27 D8 CC 63 37 6F 2F 4C>)
$$ ##END=
$$ 
$$ hash MD5
$$ 0C 78 95 23 14 32 44 1C 5E 99 EE 88 5C 9A A3 F3
##$RELAX= 
##$RELAX= 
##$RELAX= 
##$RELAX= 
##$RELAX= 
##$RELAX= 
##$RELAX= 
$$ Bruker specific parameters
$$ --------------------------
##$DU= <C:\u>
##$EXPNO= 16510
##$NAME= <ADRS>
##$PROCNO= 1
##$TYPE= <nmr>
##$USER= <dgb>
##$AMP= (0..31)
100 100 100 100 100 100 100 100 100 100 100 100 100 100 100 100 100 100 
100 100 100 100 100 100 100 100 100 100 100 100 100 100 
##$AQSEQ= 0
##$AQ_mod= 3
##$AUNM= <au_zg>
##$AUTOPOS= <21 >
##$BF1= 250.13
##$BF2= 250.13
##$BF3= 250.13
##$BF4= 250.13
##$BF5= 500.13
##$BF6= 500.13
##$BF7= 500.13
##$BF8= 500.13
##$BYTORDA= 1
##$CFDGTYP= 0
##$CFRGTYP= 5
##$CHEMSTR= <none>
##$CNST= (0..31)
1 1 145 1 1 1 1 1 1 1 1 1 1 1 1 1 1 1 1 1 1 1 1 1 1 1 1 1 1 1 1 1 
##$CPDPRG= <>
##$CPDPRG1= <>
##$CPDPRG2= <>
##$CPDPRG3= <>
##$CPDPRG4= <mlev>
##$CPDPRG5= <mlev>
##$CPDPRG6= <mlev>
##$CPDPRG7= <mlev>
##$CPDPRG8= <mlev>
##$CPDPRGB= <>
##$CPDPRGT= <>
##$D= (0..31)
0 1 0 0 0 0 0 0 0 0.06 0 0 0 0 0 0 0.0002 0 0 0 0 0 0 0 0 0 0 0 0 0 0 
0 
##$DATE= 1140521168
##$DBL= (0..7)
120 120 120 120 120 120 120 120 
##$DBP= (0..7)
150 150 150 150 150 150 150 150 
##$DBP07= 0
##$DBPNAM0= <>
##$DBPNAM1= <>
$$ [...]
##$SUBNAM7= <"">
##$SUBNAM8= <"">
##$SUBNAM9= <"">
##$SW= 20.6930455092707
##$SWIBOX= (0..15)
0 0 3 0 0 0 0 0 0 0 0 0 0 0 0 0 
##$SW_h= 5175.983436853
##$TD= 65536
##$TD0= 1
##$TE= 294.16
##$TE2= 300
##$TE3= 300
##$TEG= 300
##$TL= (0..7)
0 120 120 120 120 120 120 120 
##$TP= (0..7)
150 150 150 150 150 150 150 150 
##$TP07= 0
##$TPNAME0= <>
##$TPNAME1= <>
##$TPNAME2= <>
##$TPNAME3= <>
##$TPNAME4= <>
##$TPNAME5= <>
##$TPNAME6= <>
##$TPNAME7= <>
##$TPOAL= (0..7)
0.5 0.5 0.5 0.5 0.5 0.5 0.5 0.5 
##$TPOFFS= (0..7)
0 0 0 0 0 0 0 0 
##$TUNHIN= 0
##$TUNHOUT= 0
##$TUNXOUT= 0
##$USERA1= <user>
##$USERA2= <user>
##$USERA3= <user>
##$USERA4= <user>
##$USERA5= <user>
##$V9= 5
##$VALIST= <valist>
##$VCLIST= <CCCCCCCCCCCCCCC>
##$VD= 0
##$VDLIST= <DDDDDDDDDDDDDDD>
##$VPLIST= <PPPPPPPPPPPPPPP>
##$VTLIST= <TTTTTTTTTTTTTTT>
##$WBST= 1024
##$WBSW= 4
##$XGAIN= (0..3)
0 0 0 0 
##$XL= 0
##$YL= 0
##$YMAX_a= 534644
##$YMIN_a= -596509
##$ZGOPTNS= <>
##$ZL1= 120
##$ZL2= 120
##$ZL3= 120
##$ZL4= 120
##$ABSF1= 16.522
##$ABSF2= -4.171173
##$ABSG= 5
##$ABSL= 3
##$ALPHA= 0
##$AQORDER= 0
##$ASSFAC= 0
##$ASSFACI= 0
##$ASSFACX= 0
##$ASSWID= 0
##$AUNMP= <proc_1d>
##$AZFE= 0.1
##$AZFW= 0.1
##$BCFW= 0
##$BC_mod= 0
##$BYTORDP= 0
##$COROFFS= 0
##$CY= 12.5
##$DATMOD= 1
##$DC= 0
##$DFILT= <>
##$DTYPP= 0
##$F1P= 14.0000005364418
##$F2P= -0.99999901652339
##$FCOR= 0.5
##$FTSIZE= 32768
##$FT_mod= 6
##$GAMMA= 0
##$GB= 0
##$INTBC= 1
##$INTSCL= 1
##$ISEN= 128
##$LB= 0.3
##$LEV0= 0
##$LPBIN= 0
##$MAXI= 10000
##$MC2= 0
##$MEAN= 0
##$ME_mod= 0
##$MI= 0
##$NCOEF= 0
##$NC_proc= -2
##$NLEV= 6
##$NOISF1= 0
##$NOISF2= 0
##$NSP= 0
##$NTH_PI= 0
##$NZP= 0
##$OFFSET= 16.522
##$PC= 1
##$PHC0= 242.4074
##$PHC1= 6.527755
##$PH_mod= 1
##$PKNL= yes
##$PPARMOD= 0
##$PSCAL= 4
##$PSIGN= 0
##$REVERSE= no
##$SF= 250.13
##$SI= 32768
##$SIGF1= 0
##$SIGF2= 0
##$SINO= 400
##$SIOLD= 32768
##$SREGLST= <1H.CDCl3>
##$SSB= 0
##$STSI= 32768
##$STSR= 0
##$SW_p= 5175.98343685301
##$SYMM= 0
##$S_DEV= 0
##$TDeff= 65536
##$TDoff= 0
##$TI= <Analysis number 999999
Compound Code 99
Book Reference 9
Project Code 9>
##$TILT= no
##$TM1= 0
##$TM2= 0
##$TOPLEV= 0
##$USERP1= <user>
##$USERP2= <user>
##$USERP3= <user>
##$USERP4= <user>
##$USERP5= <user>
##$WDW= 1
##$XDIM= 32768
##$YMAX_p= 504945335
##$YMIN_p= -343030
$$ End of Bruker specific parameters
$$ ---------------------------------
##NTUPLES= NMR SPECTRUM
##VAR_NAME=  FREQUENCY,     SPECTRUM/REAL,   SPECTRUM/IMAG
##SYMBOL=    X,             R,               I
##VAR_TYPE=  INDEPENDENT,   DEPENDENT,       DEPENDENT
##VAR_FORM=  AFFN,          ASDF,            ASDF
##VAR_DIM=   32768,         32768,           32768
##UNITS=     HZ,            ARBITRARY UNITS, ARBITRARY UNITS
##FACTOR=    0.157963299565203, 1,           1
##FIRST=     4132.6476996994, 0,             0
##LAST=      -1043.33573715361, 0,           0
##MIN=       -1043.33573715361, -343030,     0
##MAX=       4132.6476996994, 504945335,     0
$$ Real data points
##PAGE= N=1
##DATA TABLE= (X++(R..R)), XYDATA
$$ [...]
15937B52J115m491M311K415m04k357l29K040O920m959j2250k112P12P608p605
15922i134m654N454K89K969n668p44J1510l727j155P302Q107k839o724p191k32
15907f437k357Q96M558L403q631j282k380J1383J1413q793k363K32n830r12M147
15892b953J006j907N963L058p201m023KR94k7L825R924n059q497J518N746J109
15876C478L545j0837j0491O580J985K496j084j965P380q872l658M268n89N098
15862b666J5808j077r330j8102Q302k757l921O156j269j621l418p999j297R137
15848a4054M583K293M121j602L868M320j286m331r305P897R605O054P354n265
15834A4252j0435k023m985p094n189R282L919Q565M183m507m493J147O41k360
$$ plain form
15937 252 1367 -3124 1187 3602 3198 841 512 2552 9472 4513 -7737 -9849 -9137 -1529 -9134
15922 -9134 -13788 -8334 -8045 -5076 -10744 -11488 22 -3705 -4860 2442 10549 7710 986 -6205 -6437
15907 -6437 -8794 -7898 -3340 63 -8568 -9850 -12230 -847 10566 1773 -590 -358 -6188 -7100 -2953
15892 -2953 -1947 -3854 2109 5167 -2034 -6057 -6055 -5061 -5088 -1263 8661 3602 -4895 -3377 2369 3478
15876 3478 7023 -3814 -14305 -7725 -5740 -3244 -4328 -6293 1087 -7785 -11443 -7175 -7764 -2666
15862 -2666 13142 12065 2735 -15367 -7065 -9822 -13743 -7587 -8856 -10477 -13895 -21894 -23191 -14054
15848 -14054 -9471 -7178 -3057 -4659 -791 3529 2243 -2088 -11393 -3496 6109 12163 19517 14252
15834 14252 3817 1794 -3191 -10285 -15474 -6192 -2273 6292 10475 5968 1475 2622 3263 903
15820I03l914Q808k662j6002P057K371m052K170k491L970O433J61Qo981q391l158
15804a5770P89L477K175J864Q717l356k468R129J140K419K40q267N685l897j639
15789B38l105m874k791k786M946O759J3451R213n379p061j1197j7494l484J880
15775b1684n881O527N942K187q56M433q041J450J0789Q707L007p142J193l702
15761c071O409j524q099K205p753o32m975O620R830K650l24k787M18M32R357k817
15745E939p871N036m259j1431Q434J0177j362j1273o785r49n263J427R72L633
15731a3575N176R775R678N348K225l787j415j59p994j082M059j241p742k950O254
15716B570L497K775L160K501m737r535k989N612K876j333k193r58J923j009m78
$$ plain form
15820 903 -3011 5797 3135 -12867 -5810 -3439 -7491 -5321 -7812 -3842 2591 2752 2760 -4221 -12612 -15770
15804 -15770 -14981 -11504 -9329 -7465 1252 -2104 -4572 4557 5697 8116 8356 89 5774 1877 238
15789 238 -2867 -7741 -10532 -13318 -8372 -1613 11838 21051 15672 8611 -2586 -20080 -23564 -21684
15775 -21684 -27565 -21038 -15096 -12909 -13765 -9332 -17373 -15923 -5134 3573 6580 -562 631 -3071
15761 -3071 3338 1814 -6285 -4080 -11833 -12465 -17440 -10820 -990 1660 1336 -1451 -1033 -601 8756 5939
15745 5939 -1932 3104 -1155 -12586 -4152 6025 4663 -6610 -13395 -14344 -19607 -18180 -17208 -13575
15731 -13575 -8399 1376 11054 16402 18627 14840 13425 13266 5272 4190 8249 7008 -734 -3684 2570
15716 2570 6067 8842 12002 14503 9766 231 -2758 2854 5730 4397 2204 1246 3169 2160 1682
15701A682J504J704J781M02q434M041K625m032q838j0797Q082J1663Q308N486
15687A5177M698l764q025o155l818p175n151Q628Q464J0993L225L31o375K14J2026
15672B3293m899r383L275j174J565K21m064j8K233m071q318Q708K278m087J0069
15657A5628l131j318l920M230q055m212p781r560L47J0753K180J486o32n328r403
15642a8716M180R191k860j2116j4576J1688N735O279J1517P804L310K147J685
15629A5268o298m402N007j078m804K217l76k12r829k811R506r852l101M117o95
15614g343k939M217N33j69j831P743l126O078L782J742N225n195m863L765j047
15599F572P571J278o076m367J005n15J035j949q600N200K885L080j442l575l483
$$ plain form
15701 1682 3186 4890 6671 7073 -1361 2680 5305 1273 -7565 -18362 -10280 1383 9691 15177
15687 15177 19875 16111 8086 1931 -1887 -9062 -14213 -5585 2879 13872 17097 17428 11053 11267 23293
15672 23293 18394 9011 12286 11112 12677 12898 8834 8816 11049 6978 -1340 7368 9646 5559 15628
15657 15628 12497 11179 7259 11489 3434 -778 -8559 -18119 -17772 -7019 -4839 -3353 -3985 -9313 -18716
15642 -18716 -14536 -5345 -8205 -20321 -34897 -23209 -17474 -11195 322 8126 11436 13583 15268
15629 15268 8970 4568 9575 8497 3693 5910 5534 5322 -4507 -7318 2188 -7664 -10765 -6648 -7343
15614 -7343 -10282 -6065 -5532 -5701 -7532 211 -2915 3163 6945 8687 13912 8717 3854 7619 6572
15599 6572 14143 15421 9345 4978 5983 5468 6503 4554 -4046 1154 4039 7119 5677 2102 -1381
15584a381K238j471O250Q916q76L960j506o978L684N99k155m760Q146K328k112
15569A4882k702k152N212p598n013q348K937L72R455j218J711n034j0016l190
15555a0702m87o442j197J1793J185N4j428k940K212N185N150Q636r445j5210R434
15540d202J1079j224r70k425o508J2715M776j3350l25L186p75O312J609R96K545
15525A3439m215j49k803o528O394k098q642m954N732K65o895P661l265P918M044
15510E904j0014k233P884J726o872r364J405O574L110L153M734L533r278n993
15496e731q317p384L854N676m320q067k54L236j114J0417J4825N256K636l642
15482G071l851L788k387q375o665l279j727L855P90k886P779M911J860Q647m50
$$ plain form
15584 -1381 857 -614 5636 14552 13676 17636 16130 9152 12836 13435 11280 6520 14666 16994 14882
15569 14882 12180 10028 15240 7642 2629 -5719 -2782 -2410 7045 5827 7538 2504 -7512 -10702
15555 -10702 -11189 -17631 -18828 -7035 -5850 -5796 -7224 -10164 -7952 -2767 2383 11019 1574 -13636 -4202
15540 -4202 6877 5653 4683 2258 -4250 8465 13241 -109 -434 2752 1977 8289 9898 10894 13439
15525 13439 9224 9075 6272 -256 6138 4040 -4602 -9556 -3824 -3559 -10454 -2793 -6058 1860 5904
15510 5904 -4110 -6343 1541 3267 -3605 -12969 -11564 -4990 -1880 1273 6007 9540 262 -5731
15496 -5731 -14048 -21432 -17578 -11902 -16222 -24289 -24543 -21307 -22421 -12004 2821 8077 10713 7071
15482 7071 3220 7008 4621 -3754 -10419 -13698 -15425 -11570 -10780 -13666 -5887 -976 884 9531 9081
15467I081o314%n814k489L399J85K892K195p10l653m06O4j432j633K079j50O487
15450C781p578L659n84M207J619k859p377l581Q558Q917Q424L103m026j7412q369
15435i518m08O877L640k026K22N82J51M585K2o692k302n373L784j286j0978o105
15419b4825K296O487m90m345l25n048N469O571P200O385N65K910K286J712J0945
15404A7793P94j1205o122J262K612P235q929p566r12n238O710L101J888J675P98
15389C896j0833N174J0458M190o952l198K97O482k848o091n693J102N517k738
15375a237O545K395m03l724p265N96K543K361N24O101o33q86l166r567o702K20
15359a2298M774k421o244J1423O955k494K598o67P529j354q524j039r27J41O993
$$ plain form
15467 9081 2767 2767 -3047 -5536 -2137 -1952 940 3135 2425 -1228 -1634 -1570 -3002 -4635 -2556 -2706 3781
15450 3781 -3797 -138 -722 3485 5104 2245 -5132 -8713 -155 8762 17186 20289 16263 -1149 -9518
15435 -9518 -9926 -3049 591 -1435 -1213 -631 -480 4105 4127 -2565 -4867 -10240 -6456 -7742 -18720 -24825
15419 -24825 -22529 -16042 -16532 -20877 -21202 -26250 -20781 -14210 -7010 -625 -60 2850 5136 6848 17793
15404 17793 18587 7382 1260 2522 5134 12369 3440 -4126 -5038 -10276 -3566 -465 1423 3098 3896
15389 3896 -6937 -1763 8695 12885 5933 2735 3032 9514 6666 575 -5118 -4016 1501 -1237
15375 -1237 5308 7703 7300 3576 -3689 -3093 -550 1811 2335 8436 7803 6917 3751 -5816 -12518 -12298
15359 -12298 -7524 -9945 -16189 -4766 2189 -305 2293 1626 9155 7801 -723 -1762 -2689 -2548 4445
15344D445j0728k499M171J960q85J177k429k322J981l075O190J4741K056q310
15330F473n418m638J1308L742p542j2994l484K10K189M120r384K648J1210L553
15316A993J790k511j371K042n631J898j93K892Q987J422k663O293o916N903O721
15301B0656k725n147o702m455r876o849O6L547O786J075l420p480L803l201J393
15286a2529N866L796q677k811p58O795K222j205J665J233O46n981J069P201N728
15271D260q482l719O007k369l133M933L097j2989O5J1026Q503K330L812J702Q379
15256B3422j0987J892K02j2237l994p035L615P313q653r334j262m833J224O316
15242a4351R846P251k368l990M137K413o013o194Q259J0052m532l8K85k490o31
$$ plain form
15344 4445 -6283 -8782 -4611 -2651 -3536 -2359 -4788 -7110 -5129 -8204 -2014 12727 14783 6473
15330 6473 1055 -3583 7725 11467 3925 -9069 -12553 -12343 -10154 -6034 -15418 -12770 -1560 1993
15316 1993 3783 1272 -99 1943 -3688 -1790 -1983 909 9896 11318 8655 14948 8032 13935 20656
15301 20656 17931 12784 6082 1627 -8249 -15098 -15032 -11485 -4699 -3624 -7044 -14524 -10721 -13922 -12529
15286 -12529 -6663 -2867 -11544 -14355 -15113 -8318 -6096 -7301 -5636 -4403 -3757 -9738 -8669 -1468 4260
15271 4260 -4222 -7941 -1934 -4303 -7436 -2503 594 -12395 -12330 -1304 7199 9529 13341 15043 23422
15256 23422 12435 14327 14529 2292 -1702 -8737 -5122 2191 -6462 -15796 -17058 -21891 -20667 -14351
15242 -14351 -4505 2746 378 -3612 525 2938 -3075 -9269 -1010 9042 4510 4472 4757 2267 1636
15227A636K198K161k79o633l132l292j335Q459R34m620o976P962M958o831j300
15212f090M00r42k932j177M604M933R841l989p291n547k982K963L631L996o931
15197g513l994K479O22O88J1513K241j916j2253N124l116j367P851J275m646J687
15182a325N576O205m996n577K834K033j609m915n852L970p340k686M602n66n159
15167a4805n057P878K678P648J2124q88j0165O72L859k004p582n155L294M763
15153b740o23o862O792Q242J0322n296r343n310Q600N629p091l64L794r889q667
15138a2806o122n900J17J4641J0332N650J0827O542j2094k71K478q204m78J148
15124E860m186n203k998k501j776Q140M29j7214Q182L174j6945M634J935m53P056
$$ plain form
15227 1636 3834 5995 5716 -917 -4049 -7341 -8676 -217 717 -3903 -10879 -2917 2041 -4790 -6090
15212 -6090 -5690 -6632 -9564 -10741 -6137 -1204 8637 4648 -2643 -8190 -11172 -8209 -4578 -582 -7513
15197 -7513 -11507 -9028 -8406 -7718 3795 6036 4120 -8133 -3009 -6125 -7492 359 1634 -3012 -1325
15182 -1325 4251 10456 5460 -117 2717 4750 3141 -1774 -7626 -3656 -10996 -13682 -9080 -9646 -14805
15167 -14805 -19862 -11984 -9306 -1658 10466 9578 -587 85 3944 1940 -5642 -10797 -7503 -2740
15153 -2740 -3363 -10225 -3433 4809 15131 9835 492 -4818 3782 9411 2320 1956 5750 -4139 -12806
15138 -12806 -18928 -24828 -24711 -10070 262 5912 16739 23281 11187 10916 13394 5190 4712 5860
15124 5860 1674 -3529 -6527 -9028 -10804 -2664 -2235 -19449 -11267 -8093 -25038 -20404 -18469 -18922 -11866
15109a1866J2348p63j0939N868P552r03O647p209j030N47p504N61l876J192O164
15094c211M733l847P608M571j1988r973L973K777L108M740R43P201m208R51p649
15079b71r365N994k28n573J0370J1627q191m66K380P85Q3l985j983P317O290r75
15063A3809j4883q893k939p203J1091P385N665j1661l482k751p34Q696l90L978
15049b312M287l852L960K795j2483j2482N371N989L618M243R306P880q434l914
15035C972J248l367k210o600o552k261m300j211P576R800L995m783j7624Q670
15021a3647J4765m056q207k122O016J1006O534j066o625l54K242o385P92j912
15007c019K045l620K617L720n342L724K618l835L76J127M313K267n660l375k803
$$ plain form
15109 -11866 482 -281 -11220 -5352 2200 1297 7944 735 -295 252 -7252 -6691 -10567 -9375 -3211
15094 -3211 1522 -2325 5283 9854 -2134 -12107 -8134 -5357 -2249 2491 3434 10635 6427 7378 -271
15079 -271 -9636 -3642 -3870 -9443 927 12554 4363 3897 6277 7062 7145 3160 1177 8494 14784 13809
15063 13809 -1074 -9967 -12906 -20109 -9018 -1633 4032 -7629 -11111 -13862 -14596 -5900 -6290 -2312
15049 -2312 1975 -1877 2083 4878 -7605 -20087 -14716 -8727 -5109 -866 8440 16320 7886 3972
15035 3972 5220 1853 -357 -6957 -13509 -15770 -20070 -21281 -13705 -3905 90 -4693 -22317 -13647
15021 -13647 1118 -2938 -11145 -13267 -7251 3755 10289 9223 2598 2244 4486 -1899 -1107 -3019
15007 -3019 -974 -4594 -1977 1743 -3599 125 2743 -1092 -716 411 4724 6991 1331 -2044 -4847
14992d847q652l38R199J1304K031j8365j1916N452J834L640R638L888j2559p657
14978a7348R349P403n457n549R374N172L167n890R630p78l111k331j0134n235
14964a1738N882J0K416J2291p204j4120o389R488J0033J985Q719M508j1151j0095
14950e365Q196K955k155J28J3293R846j7192j2021q929j338N846M209J0255J848
14936I576p339L230N078p579o173M995P893K874r22k493o444j789j164j059m412
14921e728P164N575l182k482N355R8Q619n402j2636j14K212Q753K403Q619j049
14906A8205j0012q284Q23j874q378p546Q812J0328P162M653M74j1921j022j471
14892e1p280N467l158l732P081J3855m725j0117l648Q341L189n390j201q467n918
$$ plain form
14992 -4847 -13499 -13837 -4638 6666 8697 -9668 -21584 -16132 -14298 -10658 -1020 2868 -9691 -17348
14978 -17348 -7999 -596 -6053 -11602 -2228 2944 6111 221 9851 9073 5962 3631 -6503 -11738
14964 -11738 -5856 -5846 -3430 8861 1657 -12463 -18852 -9364 669 2654 11373 15881 4730 -5365
14950 -5365 2831 5786 3631 3759 17052 26898 9706 -2315 -11244 -12582 -6736 -2527 7728 9576
14936 9576 2237 5467 10545 2966 -3207 1788 9681 12555 11633 9140 2696 907 -257 -1316 -5728
14921 -5728 1436 7011 3829 1347 6702 6800 15419 10017 -2619 -2733 -521 8232 10635 19254 18205
14906 18205 8193 -91 732 -1142 -9520 -17066 -8254 2074 9236 13889 14363 2442 1420 -51
14892 -51 -7331 -1864 -5022 -8754 -1673 12182 7457 -2660 -6308 2033 5222 -168 -1369 -9836 -15754
14877a5754J4349Q092J182m162k449n090q59m974L64Q996R25n319J505k018Q78
14862d334N760q257J518K748l964p69N662p53n919j732N816J573j450M396J6n654
14846e343m750k377J6880O864P178k307n751p176K460P307p118j0783N460j208
14832f64p629Q88l678n251K887L736L758K156P381n50n742n889p778j264n722
14817b3361N410J1480Q420J158N979m270N2N633m504m673Q851p417n694n454n015
14802a3405k644j354l543J0387R645J0986J326J0307l361q549r682K192K591P326
14788A2222n6m323J034N52O124P443k674q283l018m039l927j0394o378j226N013
14773a1930M467J836O058n03M855j968j1201r057o859J0441Q426m100k64N122
$$ plain form
14877 -15754 -1405 6687 7869 3707 1258 -3832 -4691 -9665 -9301 -305 620 -4699 -3194 -5212 -4334
14862 -4334 1426 -6831 -5313 -2565 -6529 -7298 -1636 -2389 -8308 -10040 -4224 -2651 -4101 295 311 -5343
14846 -5343 -10093 -12470 4410 11274 18452 16145 10394 3218 5678 12985 5867 -4916 544 -664
14832 -664 -8293 -7405 -11083 -16334 -13447 -9711 -5953 -3797 3584 3034 -2708 -8597 -16375 -17639 -23361
14817 -23361 -17951 -6471 1949 3107 9086 4816 4868 10501 5997 1324 10175 2758 -2936 -8390 -13405
14802 -13405 -16049 -17403 -20946 -10559 -914 10072 11398 21705 18344 9795 113 2305 4896 12222
14788 12222 12166 7843 8877 9429 15553 22996 20322 12039 9021 4982 1055 -9339 -15717 -16943 -11930
14773 -11930 -7463 -5627 431 -72 4783 2815 -8386 -17443 -24302 -13861 -5435 -9535 -9799 -4677
14759d677J2802Q399l867k550l261o315m796l369J101k845P681m130q377O659
14745g545J1509P757o267n391j1277K578K936k415K953o682n876R597Q315K999
14731C191M984k960q36p287j1694m444O650J229J2409M84l062Q641q467j4309
14717a5471M30J1298J8266p435l613q203O841N628m01J187O840j0169j154M141
14703H185m907o484P028R879L97q126r708m634n166J600J1228j833j627N225j1359
14688a0302o226M874O475N661P79R049M870p386p136j813l859J832N02o899m69
14673a0048m747N125K028K877J585R703J3784k826q090q725j903M6n885J1180
14659D104O098M48l103l343Q206o5o076l838k392Q380l182L389N320m625o181
$$ plain form
14759 -4677 8125 16524 12657 10107 6846 531 -4265 -7634 -6533 -9378 -1697 -5827 -14204 -7545
14745 -7545 3964 11721 5454 63 -11214 -8636 -5700 -8115 -5162 -11844 -17720 -8123 192 3191
14731 3191 8175 5215 4379 -2908 -14602 -19046 -12396 -11167 1242 1726 -1336 7305 -1162 -15471
14717 -15471 -15041 -3743 14523 7088 3475 -4728 2113 7741 7340 8527 15367 5198 4044 8185
14703 8185 3278 -3206 3822 13701 14098 5972 -3736 -8370 -13536 -11936 -708 -2541 -4168 1057 -10302
14688 -10302 -16528 -11654 -5179 482 1261 10310 15180 7794 658 -1155 -5014 -3182 -2680 -9579 -10048
14673 -10048 -14795 -9670 -7642 -4765 -3180 6523 20307 17481 9391 666 -1237 -1191 -7076 4104
14659 4104 10202 10650 7547 4204 12410 12345 6269 2431 39 8419 5237 8626 13946 9321 3140
14644C140J360K60O618k867p355r682L904J822n114j0310L114J7473M967j564
14630E766nJ0959O834l772o689l671P32j3992r368O390L593P753k045m020k157
14615c692M471m038k837o580l106m071Q03R449k909m828p22o815p84J0484J0273
14600d902J296P326k57j381L096j994k358Q353N88n15j0250K38O189j742j1113
14585g426R190k843p185Q736O576j0405k282J345J681L89n481k210M679Q988l00
14570C452Q416L328r857n042K563R737j819m718n552o619P558p36K274n118o91
14555b824O060Q259J460m660l682N70k92q9L058l076q511L990M240k666K909l006
14539A740m422k383M484L070M866L26n430k988o811j050K569m122r009N99M580
$$ plain form
14644 3140 4500 4760 11378 8511 1156 -8526 -4622 -2800 -7914 -18224 -15110 2363 7330 5766
14630 5766 5761 16720 23554 19782 13093 9422 10154 -3838 -13206 -6816 -3223 4530 2485 -1535 -3692
14615 -3692 779 -3259 -6096 -12676 -15782 -19853 -19050 -9601 -12510 -17338 -18060 -24875 -25659 -15175 -4902
14600 -4902 -3606 3720 3463 2082 5178 3184 826 9179 9767 9252 -998 -760 5429 3687 -7426
14585 -7426 1764 -1079 -8264 472 7048 -3357 -5639 -4294 -2613 -2224 -7705 -9915 -5236 3752 3452
14570 3452 11868 15196 5339 297 2860 12597 10778 6060 508 -6111 1447 711 2985 -2133 -2824
14555 -2824 3236 11495 12955 8295 4613 5183 4891 4802 7860 4784 -3727 263 4503 1837 4746 1740
14539 1740 -2682 -5065 -581 2489 7355 7681 2251 -737 -7548 -8598 -6029 -10151 -19160 -18561 -13981
14524a3981J0193p745q612J0494J2167M420j68l365j200j156n796M103J419n47
14510B26K0k459l56o617M99P238K885J753K092m647m785j393m622n413j887M765
14494a2701J2524L095j0334j003O124m825J380P646q84N033j831j828j930n72
14480a06R86M182r769K555o73m710j400K926K586N770M751r63r732n275J0332
14465A460p41m216j31L093j927p774k152P703k496K318R565m873o642M526L169
14450H82J668L782l929N383J770l241k070m243J018q141j3361P312J2320J686
14436H36j834j463j1491K175N71J987O659M117l757n449J814k362M063J1607L810
14421A1283p209n053Q330R671j952p677j7093j7532p446N407J1489Q286l223m47
$$ plain form
14524 -13981 -3788 -11533 -20145 -9651 2516 6936 6768 3403 2203 1047 -4749 -646 773 226
14510 226 246 -2213 -2569 -9186 -8687 -1449 1436 3189 5281 634 -4151 -5544 -10166 -15579 -17466 -12701
14494 -12701 -177 2918 -7416 -8419 -2295 -7120 -5740 1906 1022 6055 4224 2396 466 -106
14480 -106 880 5062 -4707 -2152 -2825 -7535 -8935 -6009 -3423 2347 7098 6135 -3597 -8872 1460
14465 1460 719 -3497 -3628 -535 -2462 -10236 -12388 -4685 -7181 -4863 4702 -171 -6813 -2287 882
14450 882 2550 6332 2403 7786 9556 6315 4245 2 1020 -7121 -20482 -13170 -850 836
14436 836 -998 -2461 -13952 -11777 -11206 -9219 -2560 1557 -2200 -7649 -5835 -8197 -4134 7473 11283
14421 11283 4074 -979 7351 17022 15070 7393 -9700 -27232 -34678 -29271 -17782 -9496 -12719 -13166
14407a3166m45m468P222M097j411O99j409N645M109N267L816J4851J0840p918
14393B7729o539m445R25j1566q716p497j2606o800j13J1869P295P412J1083M083
14379A2114j061m342j2948o121P99j396O834M759l069n327Q048J116p22N215Q133
14364A2032k526m476k264n54m782o204L421j0022j0249J4005O359p084p871Q440
14350a1775O644R227n521o668l32K287J0049p76O506J749L985k527j5266k063
14336d481P42j149K163K317n660p163J184R851N454k551N406M938p159L92K750
14321G034q87K105l820p55K995R14L084L607r000j8125R6K2116J007o552m848
14306a029m980j712N240l623r88K775N70K120j917P98n075r31J459j693q372j1851
$$ plain form
14407 -13166 -13611 -18079 -10857 -6760 -8171 -7472 -8881 -3236 873 6140 9956 24807 35647 27729
14393 27729 21190 16745 17670 6104 -2612 -10109 -22715 -29515 -29628 -17759 -10464 -3052 8031 12114
14379 12114 11053 6711 -6237 -12358 -11559 -12955 -6121 -1362 -4431 -9758 -1710 -594 -1316 3899 12032
14364 12032 9506 5030 2766 2212 -2570 -8774 -5353 -15375 -25624 -11619 -5260 -12344 -20215 -11775
14350 -11775 -5131 4096 -1425 -8093 -8425 -6138 3911 3135 9641 11390 15375 12848 -2418 -4481
14336 -4481 -3739 -4888 -2725 -408 -6068 -13231 -12047 -2196 3258 707 6113 11051 3892 4284 7034
14321 7034 6147 8252 4432 3677 6672 7586 10670 14277 5277 -12848 -12752 9364 10371 3819 -1029
14306 -1029 -6009 -7721 -2481 -6104 -7092 -4317 -3747 -1627 -3544 -2746 -7821 -8752 -7293 -8986 -17358 -29209
14290b9209l310j677J0051K0117K119L91P134k819j5670J741J5245K788M247m341
14276F807J692K129k569M093p989j042M45n188l769r81J588j901o841N328Q077
14261a21p21k627n834j574P18K994L95M184J659k228o408o525J650Q890k897m403
14245a2848p15O733k277q0K447K563J2608J866k298o729M508q03n113j192j726
14230c056P209j809P01l631P139n211o030p243n360P247R232K110p43j812Q560
14215G303K118l661m473k781L960J0378k696L699p253j2795J0571J2282J777j4843
14201C586m982R013j31j469o147n526l157k408l623P066P098k985k437m822n239
14186a6163j0339k157J3851P447J1667r797n044R381k160J386L930q626L797R56
$$ plain form
14290 -29209 -32519 -34196 -24145 -4028 -1909 -1518 5616 2797 -12873 -11132 4113 6901 11148 6807
14276 6807 8499 10628 8059 12152 4163 3121 3566 -1622 -5391 -6372 -4784 -6685 -13526 -8198 -121
14261 -121 -842 -3469 -9303 -10877 -10159 -7165 -6770 -2586 -927 -3155 -9563 -16088 -14438 -5548 -8445 -12848
14245 -12848 -13563 -6830 -9107 -9187 -6740 -4177 8431 10297 7999 1270 5778 4975 -138 -1330 -3056
14230 -3056 4153 2344 3045 -586 6553 1342 -4688 -11931 -17291 -10044 -812 1298 555 -1257 7303
14215 7303 9421 5760 1287 -1494 2466 12844 10148 13847 6594 -6201 4370 16652 18429 3586
14201 3586 -1396 7617 7486 6017 -130 -5656 -8813 -11221 -14844 -7778 -680 -3665 -6102 -10924 -16163
14186 -16163 -26502 -28659 -14808 -7361 4306 -5491 -10535 -1154 -3314 -1928 2002 -6624 -2827 -1871
14172a871n595L803m872P039R303o616r049n927K62P651J5379K377j0325l315
14158a756M323J786n456J292O273q040j51j213M13N779l451m535r11L182o290
14143h755o025O28n793J892J0170M794K677O205Q804k913n437r658q006R5M327
14128f995K904O99j113J1510j649k689q24j104J883J058n162J237P867N839j511
14113A1950o890j0626k626M494k440Q615M063p910j481P083q200m343N703P482
14099D874J095J332J307j1558p222Q50M438L705M202q394Q76R842l665J595r22
14084B355R129P753p369m864K05O168L560j248j867o983j2719o525M365N22O638
14069h80k842P272L574m520r032j062L900J84j699K83R553L530P540L086l400
$$ plain form
14172 -1871 -7466 -3663 -8535 -1496 7807 1191 -7858 -13785 -13523 -5872 9507 11884 1559 -1756
14158 -1756 2567 4353 -1103 189 6462 -1578 -1729 -2942 -2529 3250 -201 -4736 -5647 -2465 -8755
14143 -8755 -14780 -14152 -19945 -18053 -7883 -3089 -412 5793 14597 11684 6247 -3411 -11417 -11322 -6995
14128 -6995 -4091 -3392 -4505 7005 5356 2667 1843 739 2622 3680 -1482 -245 7622 13461 11950
14113 11950 5060 -5566 -8192 -3698 -6138 2477 6540 -1370 -2851 4232 -3968 -8311 -2608 4874
14099 4874 5969 7301 8608 -2950 -10172 -9322 -4884 -1179 3023 -5371 -4495 5347 1682 3277 2355
14084 2355 11484 19237 11868 7004 7209 13377 16937 15689 13822 6839 -5880 -12405 -8040 -7518 -880
14069 -880 -3722 3550 7124 2604 -6428 -7490 -3590 -3406 -5105 -4822 4731 8261 15801 18887 15487
14054A5487j0016p737k86l177M671K045O589j060o340j0796j506K846l548m315
14040a7143l528J3476L118k019m199M076K580J571J241O716J1032J306j2048l978
14026B201L647o185o88K586l804p321L151J0904L975n535O980k68Q85L54j261
14011I621P416m851j0705l924k227n497J379R486Q583q089j2600j2832j063J9963
13997e340J860m855N368J0527o306k451J0129M352p131q751M676J32M130l931
13983B409p317J457O36J021j1485M010K30m773l421Q23M853n50P270P830m396
13968a403k270o829K358N624M266K965r66n437o449K956R140J791j2706j1914
13954a8874K079R968o162K823R609M301J907n116j1592K588K021l988J2364K489
$$ plain form
14054 15487 5471 -2266 -2552 -5729 -1058 987 7576 6516 176 -10620 -12126 -9280 -12828 -17143
14040 -17143 -20671 -7195 -4077 -6096 -10295 -6219 -3639 -2068 -827 5889 16921 18227 6179 2201
14026 2201 5848 -337 -1025 1561 -2243 -9564 -6413 4491 8466 2931 9911 9643 10528 10882 9621
14011 9621 17037 12186 1481 -2443 -4670 -10167 -8788 698 9281 1192 -11408 -24240 -25303 -5340
13997 -5340 -3480 -8335 -2967 7560 1254 -1197 8932 13284 6153 -2598 2078 2210 6340 2409
13983 2409 -4908 -3451 -2815 -1794 -13279 -9269 -9039 -13812 -17233 -16410 -11557 -12107 -4837 2993 -1403
13968 -1403 -3673 -10502 -8144 -2520 1746 4711 3745 -1692 -8141 -5185 3955 5746 -6960 -18874
13954 -18874 -16795 -6827 -12989 -10166 -557 3744 5651 535 -11057 -8469 -6448 -10436 1928 4417
13940D417o534J933j975o416o721N667J1901J1383N66o274M65m915j3187J525
13926h165R298J533p762m15J0815n679j812R706L767j1825r730L921N298O830
13912E780L108n329q920j8J1942L525l037k070n847Q899J534p474j2466l699L741
13897a0331N689L35J381P49K013M535J130l955K23n198q816M431P497n406n084
13882a0807m387N126J1324M527J3177l085m004k514n164J524J575r793j2081L453
13868a1129M853L259R6K319Q419j692R77J194j674m825r443J043N932m614p234
13853a2519j55k133Q003Q139L833j780l821q905J559N386O391k218n168L212L126
13838B950r279K286J5369O745K150l090m107j3753P14P460m244p050r508O594
$$ plain form
13940 4417 -2117 -184 -2159 -8575 -15296 -9629 2272 13655 14221 7947 8412 3497 -9690 -8165
13926 -8165 1133 2666 -5096 -5511 5304 -375 -2187 7519 11286 -539 -10269 -6348 -1050 5780
13912 5780 8888 3559 -5361 -5379 6563 10088 7051 4981 -866 8033 9567 2093 -10373 -14072 -10331
13897 -10331 -4642 -4307 -2926 -2177 -164 4371 5501 1546 1769 -3429 -12245 -7814 -317 -5723 -10807
13882 -10807 -15194 -10068 1256 5783 18960 15875 11871 9357 4193 5717 7292 -2501 -14582 -11129
13868 -11129 -6276 -3017 -2921 -602 7817 6125 7102 8296 6622 1797 -7646 -6603 -671 -5285 -12519
13853 -12519 -12674 -14807 -6804 1335 5168 3388 -433 -9338 -7779 -2393 3998 1780 -3388 -176 2950
13838 2950 -6329 -4043 11326 18071 20221 17131 13024 -729 -15 7445 3201 -3849 -13357 -6763
13824f763L128K918n390j2823p569J880R451R217M66J0196q55Q785j2N698k650
13809A5677r451k085N762O850k182l821k838K601q107q524p8k582l65l361m120
13794a6624K009Q065J1601q22p517m350M656l824J024P327N192q486k510q31R45
13779d145M357K530l422n02N852Q538q73j2770j5965k550O647K14J614R97l149
13764a2627r24j270K44J877Q034n327N362J5468k409J897l509j351K417K091n906
13749D067j805k60L304o03r165j120N98l456j041q618N540J126j657m89N993n095
13733a2681O209J2861K654O417o497p713j4901J941M563O089K587n766q66R063
13719C960O003l894k142J607n117p016M612q85k396J107k696m726O626o614K976
$$ plain form
13824 -6763 -3635 -717 -6107 -18930 -26499 -24619 -15168 -5951 -5485 4711 3856 12641 12629 18327 15677
13809 15677 6226 4141 9903 16753 14571 10750 7912 10513 2406 -6118 -6196 -8778 -9143 -12504 -16624
13794 -16624 -14615 -6550 5051 4229 -3288 -7638 -2982 -6806 -5782 1545 6737 -1749 -4259 -5090 -4145
13779 -4145 212 2742 -680 -1182 4670 13208 12335 -435 -16400 -18950 -12303 -12089 -10475 -9478 -12627
13764 -12627 -13551 -14821 -14577 -12700 -4666 -9993 -4631 10837 8428 10325 6816 5465 7882 9973 4067
13749 4067 2262 2002 5306 4703 -4462 -5582 -4984 -8440 -9481 -18099 -12559 -11433 -13090 -13579 -7586 -12681
13733 -12681 -6472 6389 9043 15460 8963 1250 -13651 -11710 -7147 -1058 1529 -4237 -5103 3960
13719 3960 9963 6069 3927 5534 417 -6599 -1987 -2872 -5268 -4161 -6857 -11583 -4957 -11571 -8595
13704h595N82M884O039j2718O60N221l539J0743J2394j3258n72L827Q05P339l910
13689I902j544o411M874l08n421j060J777K894J2559N625o495j8129j4492J60
13675a6069P794K074O177L071n180O898J0132K220q107M28m917n312n1J791K973
13660C922p780n750R053j035j0993l691L344J146J201p4j78k8L41J6893M741q368
13644B744j1862O319K018r633n636M713O671j281M145k659L450O493Q582K577
13630A6641j1071j58r43k207L448k030j931k766n291m690P818m74R55J630L535
13615B466j3289K477l69j458j299O214n925j18R726o634n536M523O735p312l096
13600a2895J3709L809L661p121o631Q32N595k061m015j3301j0015J2418J508J0744
$$ plain form
13704 -8595 -8013 -3129 2910 -9808 -9148 -3927 -7466 3277 15671 2413 1841 5668 6473 13812 9902
13689 9902 8358 1947 6821 6513 1092 32 1809 4703 17262 22887 16392 -1737 -16229 -16069
13675 -16069 -8275 -6201 -24 3047 -2133 4765 14897 17117 9010 9438 4521 -791 -842 949 3922
13660 3922 -3858 -9608 -555 -1590 -12583 -16274 -12930 -11784 -10583 -10657 -10835 -10863 -10522 6371 11112 2744
13644 2744 -9118 -2799 -781 -10414 -16050 -11337 -4666 -5947 -1802 -4461 -1011 5482 14064 16641
13630 16641 5570 5412 4469 2262 5710 3680 1749 -1017 -6308 -10998 -3180 -3654 -2699 -1069 2466
13615 2466 -10823 -8346 -8715 -10173 -11472 -5258 -11183 -11301 -1575 -8209 -13745 -9222 -2487 -9799 -12895
13600 -12895 814 4623 8284 1163 -5468 -4636 959 -1102 -5117 -18418 -28433 -16015 -14507 -3763
13586c763O883q057N092N471j085o593j916n841n371R920O66j0462J720k551p212
13571b3099J0024R769k653P0P951J618p234o208J582k040j2682k645j252M760
13557b2039J0334P286N236P487j131n112n27L460k485n355l318L494P48Q479m038
13542B519o918l477R122M156K878l869j8169J0368J2407O499M191N78k840M763
13528B2208l871k622j0403N2L369r393j0618O305k257L12N473P264M335j4116
13514c962k658L463O360N350n570o154L581l46p619o44Q550m572o221K342P634
13499d66k941M114M07N164L720O676M602L34K168l692J29n68o798q983L109k051
13483D924M87j527L565Q61o138N142n910l005J838l696M929P350m540N298J106
$$ plain form
13586 -3763 3120 -4937 155 5626 4541 -2052 -3968 -9809 -15180 -5260 -4594 -15056 -13336 -15887 -23099
13571 -23099 -13075 -3306 -5959 -5889 2062 3680 -3554 -9762 -8180 -10220 -22902 -25547 -26799 -22039
13557 -22039 -11705 -4419 817 8304 7173 2061 1534 4994 2509 -2846 -6164 -2670 -1922 6557 2519
13542 2519 -4399 -7876 1246 5402 8280 4411 -13758 -3390 9017 15516 19707 20285 17445 22208
13528 22208 18337 15715 5312 5364 8733 -660 -11278 -4973 -7230 -6918 -1445 5819 10154 -3962
13514 -3962 -6620 -3157 3203 8553 2983 -3171 410 64 -7555 -8199 351 -4221 -10442 -8100 -466
13499 -466 -3407 707 1114 6278 9998 16674 21276 21610 23778 20086 20215 19647 12849 3866 6975 4924
13483 4924 5411 3884 7449 8310 2172 7314 1404 -1601 237 -3459 1470 8820 4280 9578 10684
13468A0684q841j568J525n833k225L499J0979K582m594l218m41m659o348N057
13454c401L459j7352n417J1711N149P139P914P47J3007l866j6203j4654J762K537
13440g468Q322O610P556J207r303L97J279k269j014p111P810O471K868n975p150
13425B230M948J0261l209j2050o28K467l335o036m452j966L959P395l466q607
13411a2489m32M188m410J727P855j701Q145M117q092k024N598j430k008R832L784
13396A2660L88l44N632q536j3552l01N388K585j998j5377m304J5228J3272L058
13382A3799m144k574Q708N450J15K139O770o621j0292j435O58j881k665L216r657
13367A586q847P576l054M28O851L012n009l134K458L46O137K739o770p083L46
$$ plain form
13468 10684 1843 275 1800 -4033 -6258 -2759 8220 10802 6208 2990 2549 -2110 -8458 -3401
13454 -3401 58 -17294 -22711 -11000 -5851 1288 9202 9949 22956 19090 2887 -11767 -10005 -7468
13440 -7468 854 7464 15020 16227 6924 7321 8600 6331 5317 -1794 6016 12487 15355 9380 2230
13425 2230 7178 17439 14230 2180 1552 4019 684 -5352 -9804 -11770 -7811 -416 -3882 -12489
13411 -12489 -12921 -8733 -13143 -11416 -3561 -5262 2883 7000 -1092 -3116 2482 1052 -956 8876 12660
13396 12660 13048 12704 18336 9800 -3752 -4053 1335 3920 1922 -13455 -17759 -2531 10741 13799
13382 13799 9655 7081 15789 21239 21354 23493 30263 23642 13350 11915 12573 10692 8027 11243 1586
13367 1586 -7261 315 -2739 -2311 4540 7552 2543 -591 1867 2213 8350 11089 4319 -2764 -2418
13352b418J248q012O318l101Q721J557N951o970p970M476J568J335O875r23r755
13337a100k478P387L897L035L566l063j323N83p444n257l052N545J2784M279r492
13322G867p369R028O382l113J7p94L230n402n166m576k671l544J867j063M43L071
13306a793N711O050M573k182n248n227j638l424L368j899n633N761P021O975j460
13291A0955K573N184j422m181n672l878q861o742M986P163K307m357l109n524
13277a0578k503N715J2030q80j0734J947Q196R987n992p353r545m041N021Q236
13263d94k862L903p068l458q657k158K773R403J8161n26o305k353k11L493k477
13248A164K366P128k002M327k20q863o252M299O246j2717n694m861Q661L132O20
$$ plain form
13352 -2418 -1170 -9182 -2864 -5965 2756 4313 10264 3294 -4676 -200 1368 2703 9578 8655 -1100
13337 -1100 -3578 3809 7706 10741 14307 11244 9921 10504 3060 -2197 -5249 296 13080 17359 7867
13322 7867 498 9526 15908 12795 12812 12018 15248 9846 4680 104 -2567 -6111 -4244 -5307 -4864 -1793
13306 -1793 3918 9968 14541 12359 7111 1884 246 -3178 190 -1709 -7342 -1581 5440 12415 10955
13291 10955 13528 18712 17290 13109 7437 3559 -5302 -12044 -7058 105 2412 -1945 -5054 -10578
13277 -10578 -13081 -7366 4664 3784 -6950 -5003 3193 13180 7188 -165 -9710 -13751 -8730 -494
13263 -494 -3356 547 -6521 -9979 -18636 -20794 -18021 -8618 9543 9017 2712 359 148 3641 1164
13248 1164 3530 10658 8656 12983 12763 3900 -2352 1947 8193 -4524 -10218 -15079 -6418 -3286 -2666
13233b666n414K133O076N806M72k045o690l808N790P376K973n733K311o695j2739
13218a2853m334M399J659N776O201J103J5j2055p227Q084N797Q425j888l531P73
13203C44m329k598j712j469R9J051M617Q491o317j17r12m406O794J1000l071M259
13187A1724j883o361N865l345k827m962j1414m165j477l244P161J1229M72k360
13173e587M763j950m475L315Q196N176o575m545P031J151o210O244J516P91k218
13158F623p313L505m116l760L879J636J332P249j522p577P4k949K638M14n050
13143d937L024k966N66J0363O555l30m897M325m104o303k037p0P785m093n926
13128c045k133J2896k88n705K370K221n092l049j865l07l891M387L83P537L790
$$ plain form
13233 -2666 -8080 -5947 129 5935 6407 4362 -2328 -6136 -346 7030 10003 4270 6581 -114 -12853
13218 -12853 -17187 -12788 -11129 -5353 848 1951 1966 -10089 -17316 -9232 -3435 4990 3102 -429 344
13203 344 -3985 -6583 -8295 -9764 -9665 -8614 -3997 4494 -1823 -1940 -2852 -7258 -464 10536 7465 11724
13187 11724 9841 3480 9345 6000 3173 -1789 -13203 -17368 -18845 -22089 -14928 -3699 -3227 -5587
13173 -5587 -824 -2774 -7249 -3934 4262 9438 2863 -1682 5349 6500 290 6534 8050 8841 6623
13158 6623 -690 2815 -1301 -5061 -1182 454 1786 9035 7513 -64 10 -2939 -301 113 -4937
13143 -4937 -1913 -4879 -4313 6050 12605 12275 7378 11703 7599 1296 -741 -811 6974 2881 -3045
13128 -3045 -5178 7718 7430 1725 4095 6316 1224 -1825 -3690 -3997 -7888 -3501 -3118 4419 8209
13113H209K086P340j0835n455K867j75j092L338N541q233j874O756P248o918p367
13098A436J589L415n108o978l468J672m596l69J816M298M102J0716l872j6147
13084a1494r02P779L325o287K958M763M323j595O8O057j0712j0967m13Q384N646
13069I33P29N445O479r193r77M11k670O419O538p254n93q40K189K293l060k081
13053D768n563k22j920O400j269L422M044l229n647p742P77R47K401P356j468
13038C055j137L729N952O964p667K4K25j5512m295l832M578r54l016M730N121
13023b035K886l338J832p653o933j265J2372J1181J386k872o402l283M006k43
13009c61J1237N902P002j2659J042J134k140J094p611L399K779N617k805N035
$$ plain form
13113 8209 10295 17635 6800 1345 4212 4037 2945 6283 11824 3591 1717 8473 15721 8803 1436
13098 1436 3025 6440 1332 -5646 -9114 -7442 -12038 -12407 -10591 -6293 -2191 8525 4653 -11494
13084 -11494 -12396 -4617 -1292 -7579 -4621 142 4465 2870 2938 8995 -1717 -12684 -13097 -4713 933
13069 933 1662 7107 13586 4393 3416 3827 1157 7576 14114 6860 6267 5427 7616 9909 6849 4768
13053 4768 -795 -1017 -2937 3463 2194 5616 9660 6431 784 -6958 -6181 -5234 -2833 4523 3055
13038 3055 1918 5647 11599 18563 10896 10920 11145 -4367 -8662 -12494 -7916 -8870 -11886 -7156 -2035
13023 -2035 851 -2487 -655 -8308 -15241 -16506 -4134 7047 8433 5561 -841 -4124 -118 -361
13009 -361 10876 16778 23780 11121 12163 13297 11157 12251 4640 8039 10818 16435 13630 18665
12995A8665O158r69j3590q838o837j0111j116j661K883j557k492J398K843N648
12981i576k807J332K2352M749n580N180n42o413n094m695L169p812j554Q742N655
12966G106Q83k487J828r221j3706k500N053P016M299P877k090r801J848O892R0
12951C087n39p335K150Q604M870n116j242m668K456o198j608Q180N240r779M252
12936B354K154q564L983P76J153q75K020q351l397M052J014m995r460R838K4150
12921A5852J009j1358p54p610J0978L635J872O757L507p27j3097j9950K829n35
12907g592O628K820n11M516J17L460Q421k07l837j1128j3757k07M186l990O28
12892a0453O23M095k087o21M588K117k821k044O648N916m29m862m913J459K428
$$ plain form
12995 18665 24823 23854 10264 1426 -5411 -15522 -16638 -18299 -15416 -16973 -19465 -18067 -15224 -9576
12981 -9576 -12383 -11051 11301 16050 10470 15650 15108 8695 3601 -1094 2075 -5737 -7291 1451 7106
12966 7106 7989 5502 7330 -1891 -15597 -18097 -13044 -6028 -1729 6148 4058 -5743 -3895 2997 3087
12951 3087 2548 -4787 -2637 5967 10837 5721 4479 -189 2267 -3931 -5539 2641 7881 -1898 2354
12936 2354 4508 -4056 -73 703 1856 981 3001 -5350 -8747 -4695 -3681 -8676 -18136 -8298 15852
12921 15852 16861 5503 4749 -2861 8117 11752 13624 20381 23888 23161 10064 -9886 -7057 -7592
12907 -7592 -964 1856 1345 5861 5978 9438 17859 17652 13815 2687 -11070 -11277 -7091 -11081 -10453
12892 -10453 -9830 -5735 -7822 -8443 -3855 -1738 -4559 -6603 45 5961 5532 670 -4243 -2784 -356
12877c56O444K914k816p223k248L726L288m44J2594r314j0135R060L624r81j1694
12862c561N25K222L538M925j2693j4064K516j512l690M285M232J1490r15l342
12848f044p579J147L517J376o44n115N10n6R776l016N702j751r906j137K832J0341
12832d7l566q673Q37J0092Q914j546J612q078l29j425P153k204r8R982K615K804
12816A8043k354r255r691J673k594M228K581M972j457J514O382j662r411o669
12802c700k141j827n74M108K662J753N195J4645P28r981j952m49l522j516j963
12787A466J0089J16l479r774j0207L933j712P66J1171N391q172m570M963j897
12773a916j4394o324J1857MK291P650K316M40k604q415L672Q898j2146o293J985
$$ plain form
12877 -356 6088 9002 6186 -1037 -3285 441 3729 3285 15879 6565 -3570 5490 9114 8133 -3561
12862 -3561 -3036 -814 2724 7649 -5044 -19108 -16592 -18104 -21794 -17509 -13277 -1787 -2702 -6044
12848 -6044 -13623 -12476 -8959 -7583 -8227 -13342 -12832 -12888 -3112 -6128 -426 -2177 -12083 -13220 -10388 -47
12832 -47 -3613 -12286 -11449 -1357 7557 6011 7623 -455 -784 -2209 4944 2740 2642 12624 15239 18043
12816 18043 15689 6434 -3257 -1584 -4178 50 2631 7603 6146 7660 14042 12380 2969 -3700
12802 -3700 -5841 -7668 -8242 -4134 -1472 281 5476 20121 20849 10868 8916 8467 4945 3429 1466
12787 1466 11555 11671 8192 -1582 -11789 -7856 -9568 -8802 2369 7760 -412 -4982 -19 -1916
12773 -1916 -16310 -22634 -10777 -10773 -8482 -832 1484 1924 -680 -9095 -5423 3475 -8671 -14964 -12979
12758a2979m826M739J0383m554k148P701J046o003o260J1190J1553j395n894j714
12744H39M35L463N334M673l037K68K56o974L178K663j0204p728l98q89O818L061
12728A758J009n902L027J366p654O555J2851j372q161K076J490O88J105j150p783
12713i7K002P305J011p866j004O934P81j865r58o953J189K114N57k038K612j0157
12697f433j0089n015K570Q614j295K433L010K456J223l013q04j836K296K68N029
12682e86o384J394L108k806j947l163J220Q874k577l895K756P041O260m067J545
12667F773K550j089p970o183J423k829l084k633P693j573p456L389n87L749N88
12652g239L83Q135q8p617M489K125j536k257L125R697L682L096j3307j912j074
$$ plain form
12758 -12979 -17805 -13066 -2683 -7237 -9385 -1684 -638 -6641 -12901 -1711 9842 8447 2553 839
12744 839 1274 4737 10071 14744 11707 11975 12231 5257 8435 11098 894 -6834 -7232 -8121 -1303 1758
12728 1758 2767 -3135 -108 1258 -6396 159 13010 11638 3477 5553 7043 7731 8836 7686 -97
12713 -97 1905 9210 10221 2355 1351 8285 9066 7201 6243 -710 479 2593 3150 1112 3724 -6433
12697 -6433 -16522 -21537 -18967 -10353 -11648 -9215 -6205 -3749 -2526 -5539 -6343 -8179 -5883 -5615 -586
12682 -586 -6970 -5576 -2468 -5274 -7221 -10384 -9164 -290 -2867 -6762 -4006 3035 9295 5228 6773
12667 6773 9323 8234 264 -5919 -4496 -7325 -10409 -13042 -5349 -6922 -14378 -10989 -11576 -7827 -7239
12652 -7239 -6856 1279 1191 -6426 -1937 188 -1348 -3605 -480 9217 12899 15995 2688 776 -298
12637b98l43L743N941R211J1374n898q500q842n369m99p509p729j693K368K8k284
12621a6299O591P284J5069O05o158l173j0535j517M039J117j18m043q271L591
12607a1818l137p16Q414J5397Q281k711j1200o583n525R949P170k179O0r60m127
12592C15Q15M724l394l35o77N496l741j973L334L626j2713j352N119m060j0320
12577a5136l185Q188M391N204Q939Q530m456q864o344m896M046N20M494K247j601
12562B077n140K545K642Q8l86J43o395K323M763O513q302l442N470J660L303O56
12546H518l966j599K84m546j413l972n04J1302o298m867o618r531j226J2015p98
12531a3219J936J431J3857J0581p68k941J416j435L147p689Q338k010K40q722
$$ plain form
12637 -298 -641 3102 9043 18254 29628 23730 15230 6388 1019 520 -6989 -14718 -16411 -14043 -14015 -16299
12621 -16299 -9708 -2424 12645 13250 7092 3919 -6616 -8133 -4094 -2977 -3095 -7138 -15409 -11818
12607 -11818 -14955 -15671 -7257 8140 16421 13710 2510 -4073 -9598 351 7521 5342 5402 4442 315
12592 315 1130 5854 2460 2125 1448 6944 3203 1230 4564 8190 -4523 -5875 -756 -4816 -15136
12577 -15136 -18321 -10133 -5742 -538 8401 16931 12475 3611 -2733 -7629 -3583 -3063 1431 3678 2077
12562 2077 -3063 -518 2124 2212 1826 1969 -4426 -2103 2660 9173 871 -2571 2899 4559 7862 8518
12546 8518 4552 2953 3237 -1309 -2722 -6694 -7198 4104 -2194 -7061 -13679 -23210 -24436 -12421 -13219
12531 -13219 -11283 -9852 4005 14586 13818 10877 12293 10858 14005 6316 14654 12644 12884 4162
12517D162r264m382O13O367j425K919k100J767J948K538o23k61n147k389M903
12502c74J554Q577L803q102n038M008q030K825K848m454j561L764L585M152R167
12487A6724P553n901r820j1250n238N778K980J0458p932m486m037m074l099l546
12473a5890O242J0654J904j972l92j3993m013J1398n37o777O830J0197L074o769
12459d4j317R588J008K273k962p752K067j826J614m93m22n662o80L769K965j074
12443A052m139M257Q363M232j073o194l124P118m50q35l664m622P51m946O806
12428C532j649n854K514N610L563K126k686m958m968O161M555k500l045l573m327
12413e499p098p62Q064L195j457j628J2439j223q64j861m166Q425O336J468j751
$$ plain form
12517 4162 -5102 -9484 -8871 -2504 -3929 -1010 -3110 -1343 605 3143 2520 2259 -2888 -5277 -374
12502 -374 1180 9757 13560 5458 420 4428 -3602 -777 2071 -2383 -3944 -180 3405 7557 16724
12487 16724 24277 18376 8556 -2694 -7932 -2154 826 11284 3352 -1134 -5171 -9245 -12344 -15890
12473 -15890 -9648 1006 2910 938 546 -13447 -17460 -6062 -6599 -13376 -6546 3651 6725 -44
12459 -44 -1361 8227 9235 11508 8546 794 2861 1035 2649 2156 1734 -3928 -4608 -839 2126 1052
12443 1052 -3087 1170 9533 13765 12692 6498 3374 10492 10042 9207 5543 921 1672 -3274 3532
12428 3532 1883 -3971 -1457 4153 7716 9842 7156 2198 -2770 3391 7946 5446 2401 -1172 -5499
12413 -5499 -12597 -13359 -5295 -2100 -3557 -5185 7254 6031 5167 3306 -860 7565 13901 15369 13618
12398A3618j0146l794o29K000J067l93o414P452J0632L271l083j907P22L121J065
12383A6582j825L70j5523o332j720k594J0363J287L025P265k732K852k437P47
12369I328J059n584M10J436j66O346J039P09J181l286j364L105r358l032O154
12354G977n31r989o120J363K864J5P662j542M94K344m999m123J746n939j956J55
12338a0579m870l225J38J1871J5545N62p049o491o13k036k977j187n25L574J94
12323g668M296J63q882Q51m067k440O487J1175O928J192p843l769O531K651n280
12308C25n708j967M045L247J112L959j088m851n98l721M892m793L890M591L880
12293G215M4M693K33j3592j6547Q52R797M043L827j0057q44P464M226m089n639
$$ plain form
12398 13618 3472 -322 -951 1049 2116 1723 -4691 2761 13393 16664 13581 11674 12396 15517 16582
12383 16582 14757 15127 -396 -6728 -8448 -11042 -679 608 3633 10898 8166 11018 8581 9328
12369 9328 10387 4803 5213 6649 6483 12829 13868 14577 15758 12472 11108 14213 4855 1823 7977
12354 7977 7446 -2543 -8663 -7300 -4436 -4421 3241 1699 2193 4537 -462 -4585 -2839 -8778 -10734 -10579
12338 -10579 -15449 -18674 -18536 -6665 8880 9442 2393 -4098 -4711 -6747 -9724 -10911 -11436 -7862 -7668
12323 -7668 -3372 -3209 -12091 -11240 -15307 -17747 -11260 -85 6843 8035 192 -3577 2954 5605 325
12308 325 -5383 -7350 -3305 -58 1054 5013 3925 -926 -1524 -5245 -353 -5146 -1256 3335 7215
12293 7215 7259 11952 12185 -1407 -17954 -17102 -7305 -3262 565 -9492 -10336 -2872 1354 -2735 -8374
12278h374n693J1096R281K908m910p499m1O468m899K977j198j763j0162o70r406
12263b1885n404K389L145Q813N068N565R004n191J33P88p09K47q900j0425M202
12248a3160J2699M234N824J617r218k688J0311p407j4223K965K2026N516j5667
12235B829j4327Q474J3093M315Q7m572o42o467k736l723k349J844k838Q902o651
12220d761j1067N763M900J631m319J84N991j258k376j102K968M276O613n827l913
12205b297j36L03j897o669K03L358P640Q905R166R34p832m286p665L715q307r962
12189a4827K685J1226N418p541P92L00J71K179J2235o85K911M081P02p853j2011
12174b17o656q787O212j261j1499j419M847N023r624K015R902J156R126P17N29
$$ plain form
12278 -8374 -14067 -2971 6310 9218 4308 -3191 -3232 3236 -1663 1314 116 -1647 -11809 -12479 -21885
12263 -21885 -27289 -24900 -21755 -12942 -7874 -2309 6695 1504 1637 2425 1716 1963 -6937 -17362 -13160
12248 -13160 -461 3773 9597 11214 1996 -692 9619 2212 -12011 -9046 12980 18496 2829
12235 2829 -11498 -3024 10069 14384 14471 9899 9257 2790 54 -3669 -6018 -4174 -7012 1890 -4761
12220 -4761 -15828 -10065 -5165 -3534 -7853 -7669 -1678 -2936 -5312 -6414 -3446 830 7443 1616 -2297
12205 -2297 -2433 -2130 -4027 -10696 -10493 -7135 505 9410 18576 19510 11678 7392 -273 3442 -4865 -14827
12189 -14827 -12142 -916 4502 -3039 -2247 -1947 -1776 403 12638 11953 14864 18945 19647 11794 -217
12174 -217 -6873 -15660 -9448 -10709 -22208 -23627 -18780 -13757 -23381 -21366 -11464 -10308 -1182 -465 64
12159F4J0635P810M984n376j3854j5095N302O63n589N056O601P696O46P347J923
12144A8813j1879j1350J175k899N62L052m566k206J649K332J164q078o836N365
12130a3702O674K095k427l166J705J606l922l619J2752L611l513j113J794M339
12116C114n772k469M257k453m029j938k332j985L413k67m135j2362J892P176r240
12101b7130n288N353P245M91K641q409L20J8379M371J775n046M403M694M384p052
12086A131r89k711K810L19l447K787p555J833L493N181o24o653k629J071N831
12071a52k753j6450K403R862N888J0310m68n593J658J688L825N895M427o327j1058
12056C155j0270j361K270n404R172P750J432q8k443k428N97l913M44J344j906
$$ plain form
12159 64 10699 18509 23493 18117 4263 -10832 -5530 -4867 -10456 -5400 1201 8897 9543 16890 18813
12144 18813 6934 -4416 -3241 -6140 -5578 -2526 -7092 -9298 -7649 -5317 -4153 -12231 -19067 -13702
12130 -13702 -7028 -4933 -7360 -10526 -8821 -7215 -11137 -14756 -2004 1607 -1906 -3019 -1225 3114
12116 3114 -2658 -5127 -870 -3323 -7352 -9290 -11622 -13607 -10194 -10461 -14596 -26958 -25066 -17890 -27130
12101 -27130 -32418 -27065 -19820 -19329 -16688 -25097 -24777 -6398 -2027 -252 -5298 -895 3799 8183 1131
12086 1131 142 -2569 241 560 -2887 -100 -7655 -5822 -2329 2852 2228 -4425 -7054 -5983 -152
12071 -152 -2905 -19355 -16952 -7090 -1202 9108 8640 3047 4705 6393 10218 16113 20540 14213 3155
12056 3155 -7115 -8476 -6206 -11610 -2438 5312 6744 6656 4213 1785 2382 -1531 -1087 257 -1649
12041a649N133o744k68L749N320m270j0884J795l071j32N669Q355k400k569j412
12026c378J389m091j706J1641K205q392m715J419M976M008o122p252k31P399J3447
12011A0597m778p937j172j299p007j099k873N10K294J6400J12n594n541N440M071
11996B124l930j4118M435M823l428N469j101n070N209l397j893j252o342M39J1092
11981f940N161j0716k922O606o685N989P896R90j021J568J757P157n542j3403
11967a0105M318R249n492o459O652J671j822k400k468N79Q119J1408p743j2348
11953f841m139R892P760K787J637j7015p751N96K451J4186N837j188K310k789
11939G733m925k696M750k431k395r252p788J797O776R538P09P984M478n916M907
$$ plain form
12041 -1649 3484 -3260 -3528 221 5541 1271 -9613 -7818 -10889 -11021 -5352 3003 603 -1966 -3378
12026 -3378 -1989 -6080 -7786 3855 6060 -2332 -7047 -5628 -652 3356 -2766 -10018 -10249 -2850 10597
12011 10597 5819 -2118 -3290 -4589 -11596 -12695 -15568 -15058 -12764 3636 3748 -1846 -7387 -1947 2124
11996 2124 -1806 -15924 -11489 -6666 -10094 -4625 -5726 -10796 -5587 -8984 -10877 -12129 -18471 -18032 -6940
11981 -6940 -1779 -12495 -15417 -8811 -15496 -9507 -1611 -621 -1642 -74 1683 8840 3298 -10105
11967 -10105 -5787 3462 -2030 -8489 -1837 -166 -1988 -4388 -6856 -6277 1842 13250 5507 -6841
11953 -6841 -10980 -1088 6672 9459 11096 -5919 -13670 -13074 -10623 3563 9400 8212 10522 7733
11939 7733 2808 112 4862 2431 36 -9216 -17004 -15207 -8431 1107 1816 9800 14278 8362 13269
11924A3269j587m660N510q95r384j724l077m865k762P36m111O166Q291n830k654
11909g577N78J754K528K364m439j2112R258O489L123o04o057n155q111L006P273
11894g682P398O642j093k266m690r208j004L935L187j085O017P457m030o570o26
11879c618M219o16k472j171R489Q888p290n106O95j1739k733J3159J947r006K587
11864b767J0544M163J79L24m512k197m576k74O355j1274j2153m259J1456O297
11850b694n105k294L245j847j544p620J0173R346J1838L70K69p327R058l48j3081
11835B439j6546j883R043N346L686q211l597K485O163J770r45J706k708j1779
11821a3031J529P494J798k931l899k140m256J410m859l346P238P418N197K657
$$ plain form
11924 13269 11682 7022 12532 11637 2253 529 -2548 -7413 -10175 -9439 -13550 -7384 907 -4923 -7577
11909 -7577 -6999 -5245 -2717 -353 -4792 -16904 -7646 -1157 1966 1362 -4695 -9850 -17961 -14955 -7682
11894 -7682 -284 6358 5265 2999 -1691 -10899 -11903 -7968 -4781 -5866 151 7608 3578 -2992 -3618
11879 -3618 601 -15 -2487 -3658 5831 14719 7429 2323 3018 -8721 -11454 1705 3652 -5354 -2767
11864 -2767 7777 11940 12119 12443 7931 5734 1158 884 7239 -4035 -16188 -20447 -8991 -2694
11850 -2694 -7799 -10093 -6848 -8695 -10239 -17859 -7686 1660 13498 13868 14137 6810 15868 15520 2439
11835 2439 -14107 -15990 -6947 -1601 2085 -6126 -9723 -7238 -1075 695 -250 1456 -1252 -13031
11821 -13031 -11502 -4008 -2210 -5141 -9040 -11180 -15436 -14026 -18885 -22231 -14993 -7575 -2378 279
11807B79p07J130M619m07m299L143N200O498j458j3148j0761m129L902M712j780
11792g206k65O832M046k698M306o337j0484l106M363J1506O905q281j44L691o273
11777c145m437p619r31R606J6053m71P26n211j9868l683P680Q814l847n266J888
11762i711L369Q355P922L121j1426o322p09J863J55M44p783k155N514O366r137
11747a0134j0490J0110J6676J0571K03K14j2771M336O424k50O59k909p088n250
11733C01L667l616k620N902r663o878j992K440j129j284M948l596l753N791m921
11718a6403l792J2820J1658n068m04m323m85o559J192N745K184n976n241Q351
11704f301P583K773o890k893q681k412P058J803L971j231l364M969P607j645l118
$$ plain form
11807 279 -428 702 5321 4914 615 3758 8958 15456 13998 850 -9911 -14040 -10138 -5426 -7206
11792 -7206 -7471 -639 3407 709 5015 -1322 -11806 -14912 -10549 957 7862 -419 -563 3128 -3145
11777 -3145 -7582 -15201 -16132 -6526 9527 9056 9782 4571 -15297 -18980 -11300 -2486 -6333 -11599 -9711
11762 -9711 -6342 2013 9935 13056 1630 -4692 -5401 -3538 -3383 -2939 -10722 -12877 -7363 -997 -10134
11747 -10134 -20624 -10514 6162 16733 16936 17150 4379 8715 15139 14889 15548 12639 5551 301
11733 301 3968 352 -2268 3634 -6029 -12907 -14899 -12459 -13588 -14872 -9924 -13520 -17273 -11482 -16403
11718 -16403 -20195 -7375 4283 -785 -1189 -5512 -5997 -12556 -11364 -5619 -3435 -9411 -14652 -6301
11704 -6301 1282 4055 -2835 -5728 -14409 -16821 -9763 -7960 -3989 -5220 -8584 -3615 3992 2347 -771
11689g71k81J127R270l015k290n385K318n74L005O09l458p852N028N490O096N93
11673I910j424n937n951m522k807j279Q406n343j4643J1461J0474o44M70O827
11659D998p935p451Q390O511q821p112p088N109M30m835O274O814n481K991P89
11644f417L111M82m928o6m287n898j671Q947P089k742k788L555K113M676K190
11629C366K544j1384j355J212k952j919m011Q887J796J1522k269j104q437m794
11615h898l760N51j031Q070K097M0N722K41L076N73j1078q038l283K294O297k69
11599g396K285M686R09r39N537N404J007o428p13K604K324j831j322N158n689
11584E596k168q839j702J4938O306j584k36m671K921n896m586N8R17R346O27j4841
$$ plain form
11689 -771 -1052 75 9345 6330 4040 -1345 973 399 3404 4013 555 -7297 -2269 3221 9317 9910
11673 9910 8486 2549 -3402 -7924 -10731 -12010 -3604 -8947 -23590 -12129 -1655 -2299 -1829 4998
11659 4998 -2937 -10388 -1998 4513 -4308 -11420 -18508 -13399 -12969 -17804 -11530 -4716 -10197 -7206 -6417
11644 -6417 -3306 -2824 -7752 -7818 -12105 -18003 -19674 -10727 -3638 -6380 -9168 -5613 -3500 1176 3366
11629 3366 5910 -5474 -6829 -5617 -8569 -10488 -14499 -5612 -3816 7706 5437 4333 -4104 -8898
11615 -8898 -12658 -12107 -13138 -5068 -2971 -2931 2791 3032 6108 6681 -4397 -12435 -15718 -13424 -7127 -7396
11599 -7396 -5111 -425 484 -455 5082 10486 11493 5065 4352 6956 9280 7449 6127 11285 5596
11584 5596 3428 -5411 -7113 7825 14131 12547 12311 7640 10561 4665 79 137 1054 10400 11027 -3814
11568c814J469O209n784l994P25L626L422k828K032m724o8j4026M467L090m068
11553a4266K673P498L177L595L773N880J533m195o149j279r0j880q73p252N656
11538b199K617P29l403o957R221P290j1493k119O464J2400k471o927J93m748k541
11523c944j051p07J063n568N355J1088r725j0245J185Q761P36j708j805N197J690
11508C22K743R128k343P871q845n471k573q179R341K41j0884K085J8912Q1m218
11493H211j0448L792m07K110j355p355l331j317O660j406q73n352R542K112l283
11478b700O19J572L553j1073q635N64J053p140P567J7536m771n85q73p666k996
11463a3975J5418O506J26l811J152m344l009Q828J0348j902k935q227o232o468
$$ plain form
11568 -3814 -2345 3864 -1920 -5914 -5189 -1563 1859 -969 1063 -3661 -3729 -17755 -13288 -10198 -14266
11553 -14266 -11593 -4095 -918 2677 6450 12330 13863 9668 3519 2240 2150 270 -603 -7855 -2199
11538 -2199 418 1147 -2256 -9213 8 7298 -4195 -6314 150 12550 10079 3152 3345 -1403 -3944
11523 -3944 -4995 -5702 -4639 -10207 -4852 6236 -3489 -13734 -12549 -3788 -3052 -4760 -6565 -1368 322
11508 322 3065 12193 9850 17721 8876 3405 832 -7347 1994 2235 -8649 -6564 12348 12429 8211
11493 8211 -2237 1555 1148 3258 1903 -5452 -8783 -10100 -3440 -4846 -5719 -11071 -1529 583 -2700
11478 -2700 -2081 -509 3044 -8029 -16664 -16100 -15047 -22187 -14620 2916 -1855 -2440 -3313 -10979 -13975
11463 -13975 1443 7949 8075 4264 5416 1072 -1937 6891 17239 15337 12402 4175 -2057 -8525
11449h525K352J0973M8r540k11M777r829L765r761N147O074M610K776j163r33
11434E60q18L39n391k685M773j336j048M744L548p487k526m185j566Q08J967L881
11418f422K440J2594J422k61O522K709j2008L860O668K767j1288q971n183K03
11404d948l820P07n677l691l729M738J1180k57L291m785k64J3239O509j629p93
11389A0071n25q531K397Q619n935p99M020j531L518j011J441J972J770m106k455
11374H915P074L78J130M303p627j3796j3405o828q034N450J348J4813J761o249
11360a0767M647o597J973j945P978j888N67k224j630L205k395M259L35l041O73
11345f850L185J581R253L635j0027r104j774l28m829Q834J1954K989o485j153
$$ plain form
11449 -8525 -6173 4800 4848 -4692 -4903 -126 -9955 -6190 -15951 -10804 -4730 -120 2656 1493 560
11434 560 -258 81 -5310 -7995 -3222 -4558 -5606 -862 2686 -4801 -7327 -11512 -13078 -12270 -10303 -6422
11418 -6422 -3982 8612 10034 9773 16295 19004 6996 10856 17524 20291 9003 32 -5151 -4948
11404 -4948 -8768 -8061 -13738 -17429 -21158 -16420 -5240 -5497 -2206 -6991 -7255 5984 12493 10864 10071
11389 10071 9546 1015 3412 12031 6096 5297 9317 7786 11304 10293 11734 13706 15476 11370 8915
11374 8915 15989 16367 17497 21800 14173 377 -13028 -19856 -27890 -22440 -21092 -6279 -4518 -10767
11360 -10767 -6120 -12717 -10744 -12689 -4711 -6599 -6032 -8256 -9886 -6681 -9076 -4817 -4482 -7523 -6850
11345 -6850 -3665 -2084 7169 10804 777 -8327 -10101 -10429 -15258 -6424 5530 8519 2034 881
11331H81l907O880Q906R62j280j3611N877J641m36n891J4337Q438l631p440p995
11316C731l184K904m1n054J867o827K88J966L355n247J722j074Q767N37k792o069
11300e151m100J3231J1632r428j1270p313L617j329L916J024N772P468K75l063
11286E281K152n140K3K788j308m747P47m476o262K198m429M432P546J0569k645
11271F729o157l493O261j1900M971R333p227m244N602J759M722m339j737j0667
11257a0387j0195O982R107m594L439l948K279J1675l380k542j09l160J0595J1291
11243A7053M051q413j4284o84M231m601k835O93N22M482j757j1186Q44J1683J202
11228A001J311k487l721L22Q475m438j753J713n762N54P980j416R62q065L94N216
$$ plain form
11331 881 -3026 3854 12760 13722 12442 -1169 4708 6349 5913 22 14359 22797 19166 11726 3731
11316 3731 547 3451 3410 -1644 223 -6604 -6316 -4350 -995 -6242 -4520 -5594 3173 3710 918 -5151
11300 -5151 -9251 3980 15612 6184 -5086 -12399 -8782 -10111 -6195 -5171 601 8069 8344 5281
11286 5281 7433 2293 2316 5104 3796 -951 -204 -4680 -10942 -8744 -13173 -8741 -1195 9374 6729
11271 6729 572 -2921 3340 -8560 -3589 5744 -1483 -5727 -125 1634 6356 2017 280 -10387
11257 -10387 -20582 -13600 -4493 -9087 -5648 -9596 -7317 4358 978 -1564 -1673 -4833 5762 17053
11243 17053 21104 12691 -1593 -2277 1954 -2647 -5482 -4789 -4267 215 -1542 -12728 -11884 -201 1001
11228 1001 2312 -175 -3896 -3574 4901 463 -1290 423 -5339 -4785 3195 1779 2741 -5324 -4930 286
11212B86n79j230j928p420R404O194m695o200j395J142J978q62N167K840R70m608
11196i36K573Q236j2013o396K476j741J0224J0389N751o808q999l973o829J373
11182f673J0084M775Q993M5m134k899O343K915q549n444J0687K364P84P08k689
11167A7310k161m335j012o122l33O680r148l539N728p15j1534J29j739l212L087
11152a0916Q056L602Q494p738Q950j292o594K695k781l188q635m481Q78K448J2340
11137A838P346m690K798P802J607r542k464L264j075P400n86n522K403k371l881
11122D327N310J2109K037j5469j7006n152Q440L561O855L517K125j2093m534K049
11108c924K784j248j616M022l242n09L875K593p282J758P039O436N29k568k058
$$ plain form
11212 286 -293 -1523 -3451 -10871 -1467 4727 32 -6168 -7563 -6421 -4443 -5305 -138 2702 3672 -936
11196 -936 1637 9873 -2140 -8536 -6060 -7801 2423 12812 18563 11755 2756 -1217 -8046 -6673
11182 -6673 3411 8186 17179 17224 13090 10191 16534 19449 10900 5456 16143 18507 19291 19999 17310
11167 17310 15149 10814 9802 3680 3347 10027 879 -2660 3068 2353 -9181 -9052 -10791 -14003 -10916
11152 -10916 -2860 742 9236 1498 10448 9156 2562 5257 2476 -712 -9347 -13828 -12950 -10502 1838
11137 1838 9184 4494 7292 15094 16701 7159 4695 7959 6884 14284 13698 8176 10579 8208 4327
11122 4327 9637 21746 23783 8314 -8692 -13844 -5404 -1843 5012 8529 10654 -1439 -5973 -3924
11108 -3924 -1140 -2388 -4004 18 -3224 -3733 142 2735 -4547 -2789 4250 10686 11215 8647 6589
11093F589r221m885o009p285J1648O412l528K614K119M585n67M29p082m332J956
11078f557m20q3O200K99P369K701r251m589J0609M28j414j44p984O928m997M703
11062C798M276l478O39N71m040Q542M483k399n011J296L758q892N93J0963l62
11047A4737K249J420m824j687q697r625R291J386n470q249N531J579q100k528
11033a2987M090L201J145l135q253K1J6227R138L360j137m817m272m199m851l837
11018a0306K453j0800l781J6336R759J108m922k558j669n88p104O718P056J2707
11004A4409j449n377Q316o268j2622j1636m732K679M708O995j94Q226J194K618
10990F867l845j2191L062L761j77P982J365J732q541p180M765P084J849j05J929
$$ plain form
11093 6589 -2632 -7517 -13526 -20811 -9163 -2751 -6279 -3665 -1546 3039 2472 2901 -4181 -8513 -6557
11078 -6557 -6977 -7060 -860 -561 6808 9509 258 -4331 6278 6706 5292 5148 -2836 4092 -905 3798
11062 3798 8074 4596 5235 5806 1766 10308 14791 12392 7381 8677 12435 3543 4136 15099 14737
11047 14737 16986 18406 13582 11895 3198 -6427 2864 4250 -1220 -9469 -3938 -2359 -10459 -12987
11033 -12987 -8897 -5696 -4551 -7686 -15939 -15918 309 9447 12807 11670 6853 2581 -1618 -6469 -10306
11018 -10306 -7853 -18653 -22434 -6098 3661 4769 -153 -2711 -4380 -4968 -12072 -5354 1702 14409
11004 14409 12960 7583 15899 9631 -2991 -14627 -19359 -16680 -11972 -4977 -5171 3055 4249 6867
10990 6867 3022 -9169 -6107 -2346 -2523 5459 6824 8556 15 -7165 -2400 4684 6533 6428 8357
10975H357K995j1304m054K445N370o00r030n39l658j364O536l342j01k20o219
10960a4728Q143J1417o88o58p123j0069L32L820J780m999j333K316k063K557J914
10945i382j686RM18k963m43Q096R506l969p94j75J3288K611q765K844K175J989
10929A2759j152j3750j1933K797O945J245O496M996o239j053O328l111k279l736
10915a687M743j932p126m550K802L924J1548M390l819l433r796j6968k517J6625
10901g796N437j522n187m431L218O594J826l851L333M985k848R43j0250l103k169
10886a4821J878M64L381N182J5703J658J004p953p309K795j946J991Q947K138
10872A3112r420m73n492q038J0535L792N528o128r492j675O04N400q837o55J590
$$ plain form
10975 8357 11352 48 -4006 -1561 3809 3209 -5821 -6360 -10018 -11382 -4846 -8188 -8289 -8509 -14728
10960 -14728 -6585 4832 4144 3486 -3637 -13706 -13374 -9554 -7774 -12773 -14106 -11790 -13853 -11296 -9382
10945 -9382 -11068 -11059 -10641 -13604 -14047 -5951 3555 -414 -1208 -1383 11905 14516 5751 8595 10770 12759
10929 12759 11607 -2143 -14076 -11279 -4334 -3089 3407 8403 2164 1111 7439 4328 2049 -1687
10915 -1687 3056 1124 -6002 -10552 -7750 -3826 7722 12112 8293 4860 -4936 -21904 -24421 -7796
10901 -7796 -2359 -3881 -9068 -13499 -10281 -3687 -1861 -5712 -2379 2606 -242 701 -9549 -12652 -14821
10886 -14821 -12943 -12479 -9098 -3916 11787 13445 14449 6496 -813 1982 36 2027 10974 13112
10872 13112 3692 3219 -2273 -10311 224 4016 9544 3416 -6076 -7751 -7147 -1747 -10584 -11239 -9649
10857i649n509Q64O084N761P00K876n370J368J3695N885M174j413j6202l860P16
10842A20q33P88O643k893N727P27M310m60k94p961o658O879Q446Q411o23j5171
10826G158l692q814J4488O677j5257n411P872M678j2672m871O457n459k522K335
10812i033N094L094j300m510j226L842K727L789k41j597j3226o218J634M842O456
10797e873M426j977k956j197j2134q849N71Q804J5840P256Q066P570P8r920j1097
10782a392l352N826R601l226m285J559O866O481L619j2252o503n250j526M130
10768B96L043m37O80k358N389P69k95J320k010N353n247r170n243K086p805M662
10752h967Q655l284L649Q938N859j777r170K090N822l536j632j97k769m869k798
$$ plain form
10857 -9649 -15158 -14294 -8210 -2449 -1749 1127 -4243 -2875 10820 16705 20879 19466 3264 -596 120
10842 120 -713 75 6718 3825 9552 10279 14589 14129 13835 5874 -784 6095 14541 22952 22329 7158
10826 7158 3466 -5348 9140 15817 560 -4851 3021 7699 -4973 -9844 -3387 -8846 -11368 -9033
10812 -9033 -3939 -845 -2145 -6655 -7881 -4039 -1312 2477 2236 639 -12587 -18805 -17171 -12329 -5873
10797 -5873 -1447 -3424 -6380 -7577 -19711 -28560 -27989 -19185 -3345 3911 11977 19547 19625 9705 -1392
10782 -1392 -4744 1082 10683 7457 3172 4731 11597 18078 21697 9445 2942 -2308 -3834 296
10768 296 3339 2902 3582 1224 6613 7382 7087 8407 6397 11750 6503 -2667 -7910 -5824 -13629 -8967
10752 -8967 -312 -3596 53 8991 14850 13073 3903 5993 11815 8279 6647 6450 3681 -1188 -3986
10737c986n419j129L751j324K450J300Q47j993K278J1277L532k747l178r401P759
10722D017N845J05n871q26P49k7K509O377J216n181j4241K709J1892M078r679
10707C672K038r619k140O90k12p789l30k864M584R966Q284J908k786l045M538
10692F895p662r431M68J534M209P889K308j911l142p121M709N432n015o248J687
10677e399J2381n992j0379o567N197m101N566J6372R099m536o134j89J298l44
10663F272j1669o616M354R555k291n596O800Q740L709r120r405P6J4295j785l119
10648D200K802q974j857j0193k57O725L759M474J1432K500J751p53j0872k535
10634B202r9Q58R33L412M296k936m186M681M425K916n94j3572q015q517o147O656
$$ plain form
10737 -3986 -9405 -10534 -6783 -8107 -5657 -4357 -3510 -5503 -3225 8052 11584 8837 5659 -3742 4017
10722 4017 9862 9967 4096 3270 4019 3992 6501 12878 14094 8913 -5328 -2619 9273 13351 3672
10707 3672 5710 -3909 -6049 -5359 -5571 -13360 -13690 -16554 -11970 -2004 6280 8188 5402 2357 6895
10692 6895 -767 -10198 -9730 -8196 -3987 3902 6210 4299 1157 -5964 -1255 4177 -838 -7086 -5399
10677 -5399 6982 990 -9389 -15956 -10759 -14860 -9294 7078 16177 11641 5507 5318 6616 6272
10663 6272 -5397 -12013 -7659 1896 -395 -5991 809 9549 13258 4138 -5267 -5191 9104 7319 4200
10648 4200 7002 -1972 -3829 -14022 -14279 -7554 -3795 679 12111 14611 16362 15609 4737 2202
10634 2202 2103 2961 3894 7306 11602 8666 4480 9161 13586 16502 15908 2336 -5679 -14196 -20343 -13687
10618a3687O831M573K142Q413p2J122J625M830j2100o305p803N00j529l368q24
10603a5652K191J610N596j274M146M428J0713o108p20k81N936l318m351O730k19
10588I427k641o810N241j639j769K511r10j594n48L714N85P303J2823K382j0036
10573A8039m366o743j3346j1384j924J0470P973J990n801K088J0220q795J152
10560d27K032R821k271j75j196j371n485m226m553k74N599P304k768m426J435
10545i81L483n23K570K375k501m322P05J1838K542j4834r956R70J5204J367p698
10530B39j2307k91J1333J3210l63j0567k537j811J077J378j2415k03M956j30L863
10515d568O137J2047K781l94J285p944p513n853j304l652m627l416J224P145K159
$$ plain form
10618 -13687 -6856 -2283 -141 8272 8200 9322 10947 15777 3677 -2628 -10431 -9931 -11460 -14828 -15652
10603 -15652 -13461 -11851 -6255 -7529 -3383 1045 11758 5650 4930 4649 10585 7267 2916 9646 9427
10588 9427 6786 -24 5217 3578 1809 4320 3410 1816 1268 4982 5567 12870 25693 28075 18039
10573 18039 13673 6930 -6416 -17800 -19724 -9254 -1281 709 -5092 -3004 7216 -1579 -427
10560 -427 1605 11426 9155 8980 7784 6413 928 -3298 -7851 -8125 -2526 4778 2010 -2416 -981
10545 -981 2502 1979 4549 6924 4423 101 806 12644 15186 352 -9604 -8634 6570 7937 239
10530 239 -12068 -12359 -1026 12184 11821 1254 -1283 -3094 -2017 -639 -13054 -13257 -8301 -8431 -4568
10515 -4568 1569 13616 16397 16003 17288 9344 1831 -4022 -5326 -8978 -13605 -17021 -15797 -8652 -6493
10500f493O785L42j735J298Q279K226L170k500j867l660M471m921m217l26N044
10485E896l071N283J1387n024j0783J781L272k257r960n405K352O070m669R08
10471d220k021O996M04l552n814r908q86J6983O964j435o389o549R759L364O207
10456I903J2718j2061p936L67m855J891n820j425q582j226J1647M325l204L008
10442a250Q561L347j5Q193P110o796r218j1697lR997N63p721M152M421n537r336
10426e229k33M139q348M355l340k780l88J0889P912j650l677o024J159J826n741
10411g130K085m775K503n266j64J5576M448k275k620J29R863M354n060M329J106
10396A7103n302Q507N288r937p441p78n956j1360J420n411L636P183L040k199
$$ plain form
10500 -6493 292 634 -1101 197 8476 10702 13872 11372 9505 5845 10316 5395 1178 852 5896
10485 5896 2825 8108 19495 14471 3688 5469 8741 6484 -3476 -8881 -6529 -459 -5128 -4220
10471 -4220 -6241 755 1159 -2393 -8207 -18115 -19001 -2018 4946 3511 -2878 -9427 332 3696 9903
10456 9903 22621 10560 2624 2991 -1864 27 -5793 -7218 -15800 -17026 -5379 -1054 -4258 -1250
10442 -1250 7311 10658 10643 18836 25946 19150 9932 -1765 -1768 8229 8792 1071 5223 9644 4107 -5229
10426 -5229 -5462 -1323 -9671 -5316 -8656 -11436 -11824 -935 6977 5327 1650 -4374 -3215 -1389 -7130
10411 -7130 -5045 -9820 -7317 -12583 -12747 2829 7277 5002 2382 2511 12374 16728 11668 15997 17103
10396 17103 11801 20308 25596 15659 8218 7440 1484 -9876 -8456 -13867 -10231 -3048 -8 -2207
10382b207m729R838K021j317J462J5983K051Q25J374q633m849J313O871k361j5730
10367A912q2P216L515o02l271r75q272P374J3035O629o25r341n70O121J0697J3634
10351D6395l718j4110M37Q054J0034J489J5021J7572J9146J9616K4243L7412L5206
10338B16797K3946J3517J0499j345k1460k6633k5776k7907k7636k0886k8609l3699
10326E0808j4291p661k327O559j5006M7L168p889K527J734J599Q98N605O109q953
10311B2927o358J025K448o408J937n790r477L735J239j133m29m332L262k181Q659
10296I124O624r345m988Q197J6641j6398j6227n7P429M078Q906L613j712k622
10282A3263k739P35J128k653n560l131Q857J2885l96p067j2833j804L375L10J0128
$$ plain form
10382 -2207 -6936 2902 4923 3606 5068 21051 23102 23927 25301 16668 11819 13132 20003 17642 1912
10367 1912 1830 9046 12561 11959 8688 7713 -559 6815 19850 26479 25854 16513 15943 22064 32761 46395
10351 46395 42677 28567 29004 37058 47092 48581 63602 81174 100320 119936 144179 181591 216797
10338 216797 240743 254260 264759 263414 241954 215321 189545 161638 134002 113116 84507 50808
10326 50808 36517 28856 26529 33088 18082 18129 21297 13408 15935 17669 19268 20166 25771 31880 22927
10311 22927 16569 17594 20042 13634 15571 9781 304 4039 5278 4145 3716 -616 2646 465 9124
10296 9124 15748 6403 1415 9612 26253 9855 -6372 -6429 1000 5078 13984 17597 15885 13263
10282 13263 10524 11259 12387 9734 4174 1043 9900 22785 22389 15322 2489 685 4060 4370 14498
10267A4498p794l061P746M79k870L294o967L286M259n531n35l176K495K8j092
10252E059j528L869M154N538M755R72m851k3q388q745l89L215m030J250M416L276
10236H550l16Q266L44j659j0968J385K986n674l832o13j866O241J0242k734l68
10221I984P867k94j1148m617M873j1637o418P961O359K387Q05M04l180P699J95
10206A1240l195J531J63p250j896N054j806J572j956q50M450M943M219K45K390
10191A8854j3140o925l809o754k907O131P900O90j105J1599J2205q42n253q518
10177H126k756K610j836j0802K542K388O969K461N62m621K169K503r0p021P537
10162A0741Q061J754n887q225J067l758j511K909p793p105Q108R042N27l251K938
$$ plain form
10267 14498 6704 3643 11389 11868 8998 12292 5325 8611 12870 7339 6804 3628 6123 6151 5059
10252 5059 3531 7400 11554 17092 21847 22819 17968 17945 9557 812 423 3638 -392 858 5274 8550
10236 8550 8234 16500 16844 15185 4217 5602 8588 2914 -918 -1531 -3397 2844 13086 10352 9984
10221 9984 17851 17557 6409 1792 6665 -4972 -11390 -3429 2930 5317 6122 6526 3346 11045 11240
10206 11240 8045 9576 9739 2489 593 5647 3841 5413 3457 2607 7057 12000 16219 16464 18854
10191 18854 5714 -1211 -5020 -11774 -14681 -8550 -650 40 -1065 10534 22739 21897 16644 8126
10177 8126 5370 7980 6144 -4658 -2116 272 7241 9702 10264 5643 7812 10315 10225 3204 10741
10162 10741 18802 20556 14669 6444 7511 3753 2242 5151 -2642 -9747 -1639 7403 7930 4679 7617
10147G617R085M166j602N487j0316j6009k389O420P535J9166J332j2477l864r276
10133D875m549k76J0679O566k005j55l694P813j0653r991O274l275J234J641j187
10118C297N654K37N56q485q64O133L747m960j0298j72l182k141K591L37M743K417
10102c90j36M474K216J247j484r24m729M0p339J169k259l695O644J430l567O267
10086a036M267k367M839N004m333K711j4424q408M640N980M834J2923J0830J227
10072B6687K589L67o37J2851K4768K9102L3997K3211m37j9610l4867l2999k8754
10059C6268j767l962p210P487J138r257l791l427j13J079n591l477N550n337L387
10044A0977O904L221l49l0K092j1922O714N865k820q85p104q239N437j728P35
$$ plain form
10147 7617 16702 20868 19266 24753 14437 -1572 -3961 2459 9994 29160 30492 18015 14151 4875
10133 4875 326 50 10729 17295 15290 15135 11441 19254 8601 -1390 4884 1609 2843 4484 3297
10118 3297 8951 9188 9744 1259 395 6528 10275 5315 -4983 -5155 -8337 -10478 -7887 -7550 -2807 -390
10102 -390 -526 3948 6164 7411 5927 5003 274 314 -7025 -5856 -8115 -11810 -5166 -3736 -7303 -1036
10086 -1036 3231 864 5703 10707 6374 9085 -5339 -13747 -9107 -3127 1707 14630 25460 26687
10072 26687 29276 29643 29006 41857 66625 95727 129724 152935 152498 132888 98021 65022 36268
10059 36268 34501 30539 23329 30816 31954 22697 18906 15479 15366 16445 10854 7377 12927 7590 10977
10044 10977 17881 21102 20753 20723 22815 10893 17607 23472 20652 19767 12663 4424 9861 8133 8868
10029H868k256l700j1886N614O307K520M817n922K206R281L851Q05N625k9j2885
10014A3216p544L449j1917n0R396J4189m283j856m012q777N222P183L289M756
10000B2261j613L796o59l461o103r437Q687J4912J019p517j054J2137Q467J01
9986D1536j755l565m235K92o567j2358l093J828m08Q534k258n915J6432L19J440
9971C0227P90J343j0821m962N466m872j879j307l594j383m21k01L717j773j2877
9956b547n651K403Q090k231n366N621J2922P936j74J913K902j1144l183K68p528
9941D231N574J025M003O635m357j0593J659K043P53K936J3295j832o6k290J134
9926B4150M028J896N870l418p667j0050k191k38J774o199N66J2073m22l416R608
$$ plain form
10029 8868 6612 2912 -8974 -3360 2947 5467 10284 4362 6568 15849 19700 20505 26130 26101 13216
10014 13216 5672 9121 -2796 -2846 6550 20739 16456 14600 10588 1811 7033 14216 17505 22261
10000 22261 20648 24444 23785 20324 14221 4784 13471 28383 29402 21885 20831 32968 41435 41536
9986 41536 39781 36216 31981 32273 25706 13348 10255 12083 11675 20209 17951 12036 28468 28787 30227
9971 30227 31017 32360 21539 16577 22043 17171 15292 13985 10391 9008 8587 8386 12103 10330 -2547
9956 -2547 -8198 -5795 2295 64 -5302 319 13241 21177 21003 22916 25818 14674 11491 11759 4231
9941 4231 9805 10830 14833 21468 17111 6518 8177 10220 10973 13909 27204 25372 25306 23016 24150
9926 24150 28178 30074 35944 32526 24859 14809 12618 12380 14154 7955 8521 20594 20172 16756 26364
9911B6364q03r762n570N747O342r829m191J3212R842J4678r930k0783q231P57
9897G843R216l840j575m305M23J820J877O369K0893k965o059p795N3r010m413
9882H532L064l289J940Q072J4623j336n820o993p635J857R10k93q483L036N358
9867A3543N47k970P739K06p37Q272O838n615r019n546L327k119k886J3538n46
9852B4572O10j460m769J0713j414j7987k845M716K547O778j0858j3306M621R725
9838A1643N300N606J1436p138j2693J29O508J0103J097p184J891O451L062r276
9824B6935r399k71L705p46J975O859k157l363m689K298K344J340K525k585l682
9809B1089j1924k886k568n610k075O126J7222N371P436j794p664o240n659m407
$$ plain form
9911 26364 25561 15799 10229 15976 22318 12489 8298 21510 31352 46030 36100 15317 7086 7843
9897 7843 17059 13219 11644 7339 7762 9582 11459 17828 38721 35756 29697 21902 21955 12945 8532
9882 8532 11596 8307 10247 18319 32942 31606 25786 18793 11158 13015 13925 13632 5149 8185 13543
9867 13543 14090 11120 18859 19065 18328 26600 33438 27823 18804 13258 16585 14466 11580 25118 24572
9852 24572 25182 23722 18953 29666 28252 10265 7420 12136 14683 21461 10603 -2703 1918 11643
9838 11643 16943 22549 33985 26847 14154 14283 20791 30894 31991 24807 26698 33149 36211 26935
9824 26935 17536 17265 20970 20224 22199 29058 26901 23538 18849 21147 23491 24831 27356 24771 21089
9809 21089 9165 6279 3711 -1899 -3974 2152 19374 24745 32181 30387 22723 16483 10824 6417
9795F417K005R276R545J030p523j3293l331J0394J1020N175m537q00j367K405
9781B6416K438L56j1727K899J1357L218j1487j3775j673J40N429N657r29m383
9767A3936j1401M400N326N703l026k855j26l434O524K634M754J0136k725j1664
9753A8182Q751K7n102L492M794K944p78K087r69l775n064m218j355P057L220l118
9737B6175p898o211l769J0473J1843J387j8122o429P632k60m478P1J792Q575m013
9722A6768M313P634J0206p52l364j741l261j474K94Q866r89O629L496L217j35
9707D9707J691J182q14k342K933J0525k651K369l386j1135r280K744Q329p70l163
9692D5939p103q957K359M91K04O213j650p231n697J622J0511Q773m556q453m755
$$ plain form
9795 6417 8422 17698 27243 28273 20750 7457 4126 14520 25540 30715 26178 25378 24011 26416
9781 26416 28854 29210 17483 20382 31739 34957 23470 9695 8022 8162 13591 19248 18319 13936
9767 13936 2535 6935 12261 17964 14938 12083 11957 8523 15047 17681 22435 32571 29846 18182
9753 18182 26933 26960 21858 25350 30144 33088 32310 34397 33428 29653 24589 20371 19016 26073 29293 26175
9737 26175 18277 12066 8297 18770 30613 32000 13878 7449 15081 14821 10343 10414 12206 20781 16768
9722 16768 21081 28715 38921 38169 34805 33064 29803 28329 28623 37489 36500 43129 46625 49842 49707
9707 49707 51398 52580 51766 49424 52357 62882 60231 62600 59214 48079 38799 41543 49872 49102 45939
9692 45939 38836 29879 32238 32729 32933 39146 37496 30265 24568 26190 36701 45474 40918 32465 27710
9677B7710p938L513N361J1264J0128m772r490J159o08N286r72q03M128J750K138
9662D7854K006j104L308k408j4403j3506n261M694L805l541q738Q104J0575L589
9648C4974l168m12K703N846K418q51j0455o672m666r88K041L029L039O525O660
9633D0023K359j935K775n350N02k968k042j0809m977Q625J3041J1530J2839P650
9619G1263R935Q049N802O133p240m152n979o533k141O124l345j1106M976M331
9605G6117J387O588j03J1079O168j953j33l819J636l697R592R776O083p180j6251
9590I5290q702j87M986R003k800L842M551J174O446K238Q652J9436K5115K2095
9576A91139R836L1600L4755L7855L4063M7297Q1105J03168J20390J66836K11136
$$ plain form
9677 27710 19772 23285 28646 39910 50038 45266 35776 36935 36327 41613 40641 39838 43966 45716 47854
9662 47854 49860 48756 52064 49656 35253 21747 16486 21180 24985 21444 12706 20810 31385 34974
9648 34974 31806 31394 34097 39943 42361 41510 31055 24383 19717 18729 20770 23799 26838 33363 40023
9633 40023 42382 40447 43222 37872 38374 35406 33364 22555 17578 26203 39244 50774 63613 71263
9619 71263 81198 89247 95049 101182 93942 89790 83811 77278 75137 81261 77916 66810 71786 76117
9605 76117 77504 84092 83989 95068 101236 99283 99150 95331 96967 93270 102862 112638 118721 111541 95290
9590 95290 86588 86401 91387 100390 97590 101432 105983 107157 113603 115841 124493 143929 169044 191139
9576 191139 200975 232575 267330 305185 339248 386545 467650 570818 691208 858044 1069180
9565A069180K46633K55890K35969J77405R2698L160j06040j95386k34193k38996
9555A306320k19170j93122j65333j28391q5769o5628n2702m9756l8214l2519j8884
9544B56832k3114j3069o526k2203j6062n801J0041q996j3345n726n76k230J762
9531A50987P146P528r788k1541n352q793O4N343J933P674K639p104j0804m244
9517A15688o969K823j310m534K826m481j0036o436L443N424K061J009k740R297
9503A06065P58n060J3996O274k059r094q455n05r430j795j864j62J958j029K040
9488I1638L075K531R30J5850K009n110j476p661P059J268R9N036K727p592o894
9473A03489J317J971M879M409J0626P432R123L057K954j1534j4126j8704k0571
$$ plain form
9565 1069180 1315813 1571703 1807672 1985077 2077775 2080935 1974895 1779509 1545316 1306320
9555 1306320 1087150 894028 728695 600304 514535 448907 396205 346449 308235 275716 256832
9544 256832 233718 220649 214123 191920 175858 170057 180098 171102 157757 152031 151455 149225 150987
9531 150987 158133 165661 155873 134332 128980 120187 120251 125594 127527 135201 137840 130736 119932 115688
9517 115688 108719 111542 110232 105698 108524 104043 94007 87571 91014 96438 98499 99508 96768 106065
9503 106065 106823 101763 115759 122033 119974 110880 102425 101920 92490 90695 88831 88669 90627 89598 91638
9488 91638 94713 97244 98174 114024 116033 110923 109447 101786 108845 110113 110212 115248 117975 110383 103489
9473 103489 104806 106777 111656 116065 126691 134123 143246 146303 149257 137723 123597 104893 84322
9460H4322j6025j3424M972J2900J47r778q614q513J488o984N004L333J3655J2621
9446G5104N413J0634O620J1218k044m054r00l857j985j548J2650L622n332J1331
9432A16872J1474J3052N933K681J1692k367q871j0701j5316q060N462L608P932
9419A33391n923m258R085J3825K5757K8236K8293K9739J9367K0634J6430J2695
9407C27271L6440N1363L0619l4465o6367n8656m2776k0018r939m813o404j1589
9395A90666j0504l503K141K951K578k462J726o215p085K664K053k207K376J3460
9381A88639J3639J2440J5436R548j605K245K955n853m263R182Q640J8399J0041
9368B79443N645J2665n261n825L28m997p671k2778l1979j5972J77l100M26O822
$$ plain form
9460 84322 68297 54873 59845 72745 72892 63114 54500 45987 47475 40491 45495 48828 62483 75104
9446 75104 80517 91151 97771 108989 106945 102891 101991 98134 96149 94601 107251 110873 105541 116872
9432 116872 128346 141398 147331 150012 161704 159337 150466 139765 124449 116389 121851 125459 133391
9419 133391 127468 123210 132295 146120 171877 200113 228406 258145 277512 298146 314576 327271
9407 327271 363711 415074 445693 411228 344861 286205 243429 223411 213472 208659 202255 190666
9395 190666 180162 176659 178800 181751 184329 181867 183593 177378 170293 172957 175010 172803 175179 188639
9381 188639 202278 214718 230154 239702 238097 240342 243297 237444 233181 242363 251003 269402 279443
9368 279443 285088 297753 292492 286667 286995 281998 274327 251549 219570 203598 203775 200675 201101 207923
9354B07923K4220K0010R397K0100J0585q068m4214n3190p9656j19936j41346j11284
9342b65459o7999r572L9857O2313O2277N8693N8704M2078L5207J2784R427R191
9330D7501o22J4678K1804J6083Q086O809o03j1472M152R289L809J0255J3376J7581
9316A60726L0034K9730J9277K3332K1928J5385K1252J7293J1929j3287l7683l6367
9304B63549k5883k3348j3137o858J0922J5382J4823P910P175Q713N168K320j451
9291B65285n418L409J0980J2185J0389N421N412p141j4381M56J0990R805M571
9278C11963R45J1662L7393K0727j429k2085j8092j1248j7503j0530L749K147m293
9265C03406J1136M989Q131l897o604j356J5576K3018K4480L2825L4891J6325J2744
$$ plain form
9354 207923 232143 252153 261550 281650 292235 284167 239953 186763 107107 -12829 -154175 -265459
9342 -265459 -333458 -343030 -303173 -240860 -178583 -119890 -61186 -19108 16099 28883 38310 47501
9330 47501 46879 61557 83361 99444 107530 114339 113736 102264 106416 115705 119514 129769 143145 160726
9316 160726 190760 220490 239767 263099 285027 300412 321664 338957 350886 337599 299916 263549
9304 263549 237666 214318 201181 194323 205245 220627 235450 243360 250535 259248 264416 266736 265285
9291 265285 259867 263276 274256 286441 296830 302251 307663 300522 286141 286597 297587 307392 311963
9278 311963 312908 324570 361963 382690 381261 359176 341084 329836 312333 301803 305552 307699 303406
9265 303406 314542 319531 327662 323765 317161 315805 331381 354399 378879 411704 446595 462920 475664
9252D75664N690O743r398k359K037J6074K0151J9842L4207L5578L0743K3579L1116
9239F89667L0167J4756J4006J8383K0031K3969J6900N494J810k182j1207n212
9227H16582m492o075R544K5386K3385M4600L3943J9087J1989K4084L1476L3877
9215A063386M2809P5121R3840R3394J00268P6728O9879P0064O2557O1223P5575
9204A884844Q1803R8017J11930J00493R9438J16742J19746J30145J38690J58923
9194C040771J70009J52594J67221K02120K39939K68942L04760L13331L28895L50659
9184E539241L66471M06225M66611N54456O61991P67056Q64550R68417J099818
9175A1694836J283912J507361J797742K170587K618270L127705L729057M310283
$$ plain form
9252 475664 481354 488097 478699 476340 478377 494451 514602 534444 568651 604229 634972 658551 689667
9239 689667 719834 734590 748596 766979 787010 810979 827879 833373 835183 833001 821794 816582
9227 816582 812090 806015 815559 840945 864330 908930 942873 961960 973949 998033 1029509 1063386
9215 1063386 1106195 1181316 1275156 1368550 1468818 1545546 1615425 1685489 1748046 1809269 1884844
9204 1884844 1966647 2064664 2176594 2277087 2376525 2493267 2613013 2743158 2881848 3040771
9194 3040771 3210780 3363374 3530595 3732715 3972654 4241596 4546356 4859687 5188582 5539241
9184 5539241 5905712 6311937 6778548 7333004 7994995 8762051 9626601 10595018 11694836
9175 11694836 12978748 14486109 16283851 18454438 21072708 24200413 27929470 32239753
9167C2239753M723113N068407N771803P219701R767046J3780405J9835129K8939408
9159A27344765M2803403O2572585Q4319943R3277515P2022132K2604992l0813831
9152D74131504o9107017q4749893p7813224o0076727m2773056k9824375k0936058
9145H8851154j4813871j0564351p705382n961462n082340m733164m545812m258984
9137C1185788l818640l282458k754321k299459j923250j621276j358416j119997
9129A3007971r40322q36966p68905p11047o73504o26529n62888m99964m25004
9120F962842l70660l36229l11205l05956k83823k73441k53296k20775k13252j91188
9110D203017j95826k16051k10097j84760j71716j67493j58889j42415j41101j18937
$$ plain form
9167 32239753 36962866 42031273 47803076 55022777 64789823 78570228 98405357 127344765
9159 127344765 170148168 232720753 317040696 410318211 482340343 504945335 474131504
9152 474131504 405024487 320274594 242461370 182384643 139611587 109787212 88851154
9145 88851154 74037283 63472932 55767550 49806088 44723748 39990584 35444772 31185788
9137 31185788 27367148 24084690 21330369 19030910 17107660 15486384 14127968 13007971
9129 13007971 12067649 11230683 10461778 9750731 9077227 8450698 7887810 7387846 6962842
9120 6962842 6592182 6255953 5944748 5638792 5354969 5081528 4828232 4607457 4394205 4203017
9110 4203017 4007191 3791140 3581043 3396283 3224567 3057074 2898185 2755770 2614669 2495732
9100B495732j14213j01593q1644o6716n4770m8462l9894m7763n9592n8750o1836
9089A760499o9836p1148o4826l6350k3858l5913n4675o3627m8564l6489n6668
9078A198545o6016m8797m5230m5147k9122j8349j7226k7370l1235j7488l156n31
9066H48878k798l554J15q221j1314m571j7635l7619k9855k4214j1594o039j1304
9053F80275P70R326M292J550N754k424p935j8450j3759k8240k0626Q986J06j0587
9039F09038j4233r688k6321l6284l2504j4226n800L8655P0393Q7905N7974j3172
9027G11737o5590r2417q3384n4059k4117p345M558L095j070j78n942n834P5K026
9013C81555j7663j4019m226K486J27N537j68j1116k4873l5516l8939l7218j2977
$$ plain form
9100 2495732 2381519 2279926 2198282 2131566 2076796 2028334 1988440 1940677 1881085 1822335 1760499
9089 1760499 1690663 1619515 1554689 1518339 1494481 1458568 1403893 1340266 1291702 1255213 1198545
9078 1198545 1132529 1083732 1038502 993355 964233 945884 928658 901288 870053 852565 849409 848878
9066 848878 846080 842526 842641 834420 823106 818535 800900 763281 733426 709212 697618 691579 680275
9053 680275 681045 690371 694663 696213 701967 699543 691608 673158 659399 631159 610533 619519 619625 609038
9039 609038 594805 585117 558796 522512 490008 475782 469982 508637 579030 666935 724909 711737
9027 711737 646147 553730 470346 416287 392170 384825 389383 392478 391408 391230 385288 379454 379529 381555
9013 381555 363892 349873 345647 348133 348260 353797 353629 342513 317640 282124 243185 205967 192990
9000A92990M46L692Q933K2645J7638R6J0853J8738J9107J1924M491J8335J1663
8987C41551K012q242p875J647n571j3513o89O473J7249Q622R555J0235J7527J6233
8973C95214J8986L4192M6841N9016O7696O7323L6037k5023q2564j19777j22677
8962C75264j17610q5948o4754l4186k046R655O908J3538J8090K1541M700p895
8950A37257j2286k2192j3440j5569k8641q415j895j4120j3262o922M182n81J8162
8937B2278J9664o47J365J6o775j0250n686O270J3013P023J085O587O902Q101J5368
8922H4314R519J397o078M233R087n500j5876l122J5029L552J260O41Q644M237
8908A11337O682J0557L423N484R871K745j6016j8152k3581j5804q448L842N378
$$ plain form
9000 192990 193436 197128 206061 228706 246344 246440 257293 276031 295138 307062 311553 329888 341551
8987 341551 343563 335321 327446 329093 323522 310009 309320 315793 333042 341664 351219 361454 378981 395214
8973 395214 414200 448392 495233 554249 621945 689268 725305 700282 617718 497941 375264
8962 375264 257654 171706 106952 72766 70720 80375 87283 100821 118911 140452 145152 137257
8950 137257 124971 102779 89339 73770 45129 36714 34819 20699 7437 515 4697 4116 22278
8937 22278 41942 41295 42660 42676 35901 25651 19965 26235 39248 46271 47356 53943 60845 68946 84314
8922 84314 93833 95230 89152 93385 102472 96972 81096 77974 93003 96555 97815 98456 107100 111337
8908 111337 118019 128576 131999 137483 147354 150099 134083 115931 92350 76546 68098 71940 77318
8895G7318n570J656R881Q690M36o016o387j847p774m198O03O932K612j2448j0395
8880E3493k72j3928l348j378n431J2711J2131J205M914R835M005o086P548Q216
8866H3615P162J543k126N2N077J0256j101P358R75l504Q226j463l928p574j0849
8851I3719R95P150J0995M304j1638k9866k1169j7592j4405Q28q956N112L069R211
8837C1757O863P008K172l407N054j580j315M953J05o525j3759q442K66J3242J4704
8822E1096M476J559j0130O16O073k654n83p489K786k815O98l681j1715M248P941
8807D0426k857J0208J7801j301j2787O313M159L57J676M789o126j2337j047J34
8793D9408p369l541l266q291j014J3557J0182J0237J754n439l088j1593o344J629
$$ plain form
8895 77318 71748 73404 83285 91975 92411 86395 80008 78161 70387 66189 66792 73724 76336 63888 53493
8880 53493 53221 39293 35945 34567 29136 41847 53978 55183 60097 69932 73937 67851 75399 83615
8866 83615 90777 92320 90194 90246 95323 105579 104478 111836 112811 109307 117533 116070 112142 104568 93719
8851 93719 94714 101864 112859 117163 105525 75659 54490 36898 22493 23321 14365 19477 22546 31757
8837 31757 38620 45628 47800 44393 49447 47867 46552 51505 51610 45085 31326 22884 23150 36392 51096
8822 51096 55572 57131 47001 47617 53690 51036 50453 42964 45750 42935 43633 39952 28237 32485 40426
8807 40426 37569 47777 65578 64277 51490 57803 61962 62319 63995 68784 62658 50321 49274 49408
8793 49408 42039 38498 35232 26941 25927 39484 49666 59903 61657 56218 53130 41537 35193 36822
8779C6822M251J291P392k039R81R741R015O665N699j489O416J645P746P641R427
8764A11204R897J2599P785J3478O107L492N022J9821J4554J9872K7710L1009N9669
8751C42219Q5939R1481J25650J65251J88057K18043K45451K39125K05724J29778
8741B036718L0327q4450j58464k16584k29963k38128k14190j73596j37793j03515
8731E10362p9237n4042n2820m0439l5408l0366j8219k3938k5031j8792J083p178
8719A25975k2737k2605j9537o85J608m862m300l647k162n438n53M475P267l379
8705D9420j9670j2959k646K050N05O643J3862j0708j0705m834j091n304r628K246
8691b819o226q351L761J3441J5101R405Q696k275L575k915q12n429P414r59q91
$$ plain form
8779 36822 41073 42364 49756 47717 48698 58439 67454 74119 79818 78329 84745 86390 94136 101777 111204
8764 111204 121101 133700 141485 154963 161070 164562 169584 189405 203959 223831 251541 282550 342219
8751 342219 428158 519639 645289 810540 998597 1216640 1462091 1701216 1906940 2036718
8741 2036718 2067045 1982595 1824131 1607547 1377584 1139456 925266 751670 613877 510362
8731 510362 431125 377083 324263 283824 248416 218050 199831 175893 150862 132070 133153 125975
8719 125975 103238 80633 61096 60411 62019 57157 52857 49210 47048 41610 41057 45532 52799 49420
8705 49420 29750 16791 14145 16195 16700 23343 37205 26497 15792 10958 9867 4563 -5065 -2819
8691 -2819 -9045 -17396 -13635 -194 14907 24312 33008 30733 34308 31393 30581 25152 32566 31607 30716
8676C0716L082J047J3599J0513K178J214p738N928M648n736j2264p919N216N684
8662E0168j0636j6001n479N579R998o04O271J1906Q892p271j4645j359n030j71
8648C1618k64m704P922L976r74o022j769p763k562Q329M757l802m443r287K092
8633A7104j791K452J4171M081L289K274r534l324R244K630M094l487l488O17j1075
8618B7257Q35J024q199k643M879M157j400n144k389k714j133K948J1847n79n906
8603B2840j755M658N465o876M721O241j1112j156J4327L074k949L240M57J205
8589D2380m696q510j1518p558K617K805K066L867Q369o329k040J209j192L774
8575B5244Q286P127P08j794q645m201r974k823J0332L800n012q246j558K710M560
$$ plain form
8676 30716 33798 34845 48444 58957 61135 62349 54611 60539 65187 59451 47187 39268 44484 50168
8662 50168 39532 23531 18052 23631 33629 33025 39296 51202 60094 52823 38178 36819 31789 31618
8648 31618 31354 26650 34572 38548 37574 31552 29783 22020 19458 27787 32544 28742 24299 15012 17104
8633 17104 15313 17765 31936 36017 39306 41580 32046 28722 37966 40596 44690 41203 37715 38332 27257
8618 27257 28092 29116 20917 18274 23153 27310 25910 20766 18377 15663 14530 17478 29325 28746 22840
8603 22840 21085 25743 31208 24332 29053 35294 24182 23026 37353 40427 37478 40718 41175 42380
8589 42380 37684 29174 17656 10098 12715 15520 17586 21453 29822 23493 21453 22662 21470 25244
8575 25244 33530 40657 41365 39571 30926 26725 16751 13928 24260 28060 23048 14802 13244 15954 20514
8560B0514l967l278M194J1630k349M566j0431j0149p96L089J355J133J0196M617
8546C0324n107l374p250k882Q11K07n053O466R139L450J432L762r863r541Q866
8531B1387j635k761R936N322n219j229l639m162o053q483r881L175M370Q655O81
8516A0464J464k575r711L344Q05J519m022k751j826N572M817K980k863k419j1763
8501f965L222L089k957l603o534J402R020J1747l355Q139K24q807L252L332P98
8486A2004J604J991j713j676p400q656q41Q037J2679N295m229j730L113m961k864
8471A0653R45k683p371j495N535m54J012P233n979O144L244n636J700M043j732
8456A5159K720L422Q21n785k282p726n006J0227J2421j0559k024Q202K096p135
$$ plain form
8560 20514 16547 13269 17463 29093 26744 31310 20879 10730 9934 13023 14378 15511 25707 30324
8546 30324 25217 21843 14593 11711 12522 12729 7676 14142 23281 26731 28163 31925 22062 12521 21387
8531 21387 19752 16991 26927 32249 27030 25801 22162 18000 11947 3464 -6417 -3242 1128 9783 10464
8516 10464 11928 9353 -358 2986 3791 5310 1288 -1463 -3289 2283 7100 10080 7217 4798 -6965
8501 -6965 -3743 -654 -3611 -7214 -13748 -12346 -3326 8421 5066 13205 13429 4622 7874 11206 12004
8486 12004 13608 15599 13886 12210 4810 -3846 -4687 3350 16029 21324 17095 15365 18478 13517 10653
8471 10653 11598 8915 1544 49 5584 5130 6142 13375 7396 13540 16784 11148 12848 16891 15159
8456 15159 17879 21301 22122 16337 14055 6329 1323 11550 23971 13412 11388 19590 21686 14551
8442A4551j1351j904J802M427P894p469m897J862M340k578m978K232K898K406
8428I235J5515K246j7346J776M028k804n928l479N925l190J519J055o019j63M647
8413G017N06n449L206J145O689j0576q480M365J1225r072J586N288o008p262K638
8398c182J3555Q64k190m491K370o879k828L278m95P403P505L866m347K68p794
8383F903R82l528n339q819p485M41J746J1013O956K002M886M216k203q656m19
8368B696R275j164j1446J273J467K835J048J2361m579j3239J345K857P929j689
8354A0969J080q00K550r16n716m995l439K56k782J2016L438k506o759j1696Q575
8339g25q47j0133J1404m615L866P787K538L268n234p038J160N136l27j111J4118
$$ plain form
8442 14551 3200 1296 3098 7525 15419 7950 3053 4915 9255 6677 1699 3931 6829 9235
8428 9235 24750 26996 9650 11426 15454 12650 6722 3243 9168 5978 7497 8552 2533 2370 7017
8413 7017 7523 2074 5280 6425 13114 2538 -5942 -1577 9648 576 2162 7450 1442 -5820 -3182
8398 -3182 10373 11237 9047 4556 6926 47 -2781 497 2 7405 14910 18776 14429 14697 6903
8383 6903 7885 4357 -982 -9801 -17286 -16845 -15099 -4086 2870 4872 9758 13974 11771 3115 2696
8368 2696 11971 10807 -639 634 2101 4936 5984 18345 13766 527 1872 4729 12658 10969
8354 10969 12049 11249 13799 12883 7167 2172 -1267 -1011 -3793 8223 11661 9155 2396 -9300 -725
8339 -725 -1572 -11705 -301 -4916 -1050 6737 9275 12543 7309 271 1431 6567 6240 5129 19247
8324A9247K640l751m911J562k10o558n326P261J5291M832l793r852n117L92O135
8309A7842L815q193l723O791o336L479r141j6793l344J512P900J2482J434M284
8295A2009j061r274R8P124O827o578r495k652P787J1071k13K178p73j2074k439
8280B535R6M022j1167J267R835p089m884P762R749j064j2608n677n69J1786N083
8265I077m233l009M298j321K9n950J10l551N83O975K911J888k325k122j2503J271
8249g872R56J2593J0288r942r681M865O725O137N019j2259k092L060K95q452o883
8234g243L484k000R456L337M305n685N567M920q42p929L513j582K461o540k39
8219D983P429K47j1302Q19O63m20J901m650K134M331R54r73l080n26N28M427J3471
$$ plain form
8324 19247 21887 18136 13225 14787 14577 8019 2693 9954 25245 30077 26284 16432 11315 11707 17842
8309 17842 21657 13464 9741 16532 10196 13675 4534 -12259 -15603 -14091 -6191 6291 7725 12009
8295 12009 10948 1674 1772 8896 15723 9145 -350 -3002 4785 15856 15643 17821 17048 4974 2535
8280 2535 2631 6653 -4514 -3247 6588 -501 -5385 2377 12126 11062 -1546 -7223 -7792 3994 9077
8265 9077 4844 1835 6133 4812 4841 -1109 -999 -4550 -3967 3008 5919 7807 5482 3360 -9143 -7872
8249 -7872 -6916 5677 15965 6023 -3658 1207 7932 14069 19088 6829 4737 7797 8092 -360 -7243
8234 -7243 -3759 -5759 3697 7034 11339 5654 11221 16141 15299 7370 10883 9301 11762 5222 4983
8219 4983 12412 12659 1357 2176 2839 2419 4320 -330 1804 6135 7089 6116 3036 2510 3038 7465 20936
8202B0936K552j4900o998r013k840J5432R082j444n121j585K092J1729n37j1332
8188H053l383k419n621j0639j1503N288J0042m084N289J1555O435P84N189L997
8174A8983k532o713l129Q264j844j790j1172M497K989J602l484p141M55k777J166
8159b626L97J2990J2702m596m666J028J0148O94j0520q948p06r194L803L886P435
8144A1827n580m652O597k761n82j0744L931N362O154j3721Q76R379n118p88n144
8129d964K276N857N535K652q048o304l456p4J496M964R067K396J018j397m797
8114F221L071O112k718r421j7502n300J0578k868N599R189J88q085J2178M709
8100A1951O078r718q303J048M062N104K647j3168k388k939J873M462N337M792
$$ plain form
8202 20936 23488 8588 1590 -7423 -10263 5169 14251 12807 7686 6101 8193 19922 19385 8053
8188 8053 4670 2251 -3370 -14009 -25512 -20224 -10182 -14266 -8977 2578 9013 9797 14986 18983
8174 18983 16451 9738 6609 14873 13029 11239 67 4564 7553 9155 5671 -1470 -1015 -3792 -2626
8159 -2626 -2229 10761 23463 18867 14201 15229 25377 26071 15551 6603 5897 -3297 506 4392 11827
8144 11827 6247 1595 8192 5431 4849 -5895 -1964 3398 9552 -4169 -3293 6086 968 180 -4964
8129 -4964 -2688 3169 8704 11356 3308 -2996 -6452 -6526 -5030 -66 9001 11397 12415 11018 6221
8114 6221 9292 15404 12686 3265 -14237 -19537 -8959 -11827 -6228 2961 3149 -4936 7242 11951
8100 11951 18029 8311 8 1056 5118 10222 12869 -299 -2687 -5626 -3753 709 6046 10838
8086A0838l386N382M468j1978r568j0840P298Q438K391N983l23J135K478M557
8072A6873M047O46n90L365J229o30q783j4834m055k137K117k560L970M012l428
8057g58m253J2387N09m512j121n917l649J1975r99l760l764J261P030O461j904
8042H986j7121p25M684k420O237M060O846q889o582J1923j799n646j837P685J0970
8027A6372n276J073l529j159l882R217P40j1785j605J693J668q55k902J934R277
8012A0981k020j947k988l774o054j370O12l344R839J501M847k079Q406j887k100
7997H623p601n511N516l305J355N642k273m876P069Q944p850k258K563Q23R663
7982A6524l858r12m01N57q039n154l903m511o136J524Q025J1330M56Q068k449
$$ plain form
8086 10838 7452 12834 17302 5324 -4244 -15084 -7786 652 3043 9026 8703 9838 12316 16873
8072 16873 20920 21566 20976 24341 25570 24940 16157 1323 -2732 -4869 -2752 -5312 -1342 2670 -758
8057 -758 -5011 7376 7885 3373 2252 -3665 -7314 4661 3662 -98 -3862 -2601 4429 10890 8986
8042 8986 -8135 -8860 -4176 -6596 -359 3701 10547 1658 -4924 6999 5200 -446 -2283 5402 16372
8027 16372 11096 12169 8640 7481 3599 12816 13556 1771 166 1859 3527 2672 -230 1704 10981
8012 10981 8961 7014 4026 252 -5802 -7172 -6560 -9904 -65 1436 6283 4204 12610 10723 8623
7997 8623 1022 -4489 1027 -2278 -923 4719 2446 -2430 4639 13583 5733 3475 6038 6861 16524
7982 16524 12666 11754 11353 11910 3871 -1283 -5186 -9697 -15833 -14309 -6284 5046 5502 13570 11121
7967A1121n846o956m209N271J0429N769L031K626o957n594M95m033l820p741j486
7952g900P381J1065L950K352l404j161N469q347j715N218j415r767q182J242O221
7937A007P841P397O494k458n808m829m566l587N689l48O14J0558R156k634J467
7922B5993j0121j674m244n572o931r443R391K396q11j536J415k029O615L264m275
7907B438K654n7k367L862j942r768j259J0873O099q34m679j2438L918l60L273
7892e87M080J0452N063l153n333k01J062k150r153p85P836L396q133K52L36j2574
7876i592q236J907J1892P298N92p427o824J1984J3048j04K476j2123o756Q293
7862F428M953m779p703m323n882o458o562N099J2991J1459l105p258l754P437
$$ plain form
7967 11121 5275 -1681 -5890 -619 9810 15579 18610 21236 14279 8685 9180 5147 1327 -6414 -7900
7952 -7900 -519 10546 14496 16848 13444 12283 17752 9405 7690 12908 11493 1726 -6456 -5214 1007
7937 1007 8848 16245 22739 20281 14473 9644 5078 1491 7180 6832 7446 18004 27160 24526 25993
7922 25993 15872 14198 9954 4382 -2549 -11992 -2601 -205 -1016 -2552 -1137 -3166 3449 6713 2438
7907 2438 5092 5035 2668 6530 4588 -5180 -6439 4434 10533 9699 5020 -7418 -3500 -3860 -587
7892 -587 3493 13945 19008 15855 10522 10321 11383 9233 80 -705 7131 10527 2394 2646 2982 -9592
7876 -9592 -17828 -15921 -4029 3269 3861 -3566 -10390 1594 14642 14538 17014 4891 -1865 6428
7862 6428 11381 6602 -1101 -5424 -11306 -17764 -24326 -19227 -6236 5223 2118 -5140 -8894 -1457
7848a457K61J960O137L86o495p103Q054R84N117J4031K08l334K393Q45j0057m175
7832G755p19l920n92n018L81K345N557J0149Q04n985J513K665J67o50o952J150
7816H650k107J4453j747j706J558m170j623j0896p703j77k230N534P000Q861N128
7801A8825q504j0579j457R72J6522Q892r718j1851l112r62J965Q45R44n252q05
7786c275Q26L432L648q443p78k328r91N115P916M182J906q757m386K482K881O779
7770A0209j714O572j531j0431l532M194O788n896j541J693O276q789j6570N091
7756i181J6681N102n137j334M596p461o397r015p69J1230O847l255p89O832P97
7741H747r55j802K403L905N927j0116j3077J285P110l394L639J561J483j743n198
$$ plain form
7848 -1457 -1196 764 6901 7287 792 -6311 1743 2727 7844 21875 22083 18749 21142 21987 11930 7755
7832 7755 7036 3116 2524 -2494 -2113 232 5789 15938 16742 10757 12270 14935 15102 14452 7500 8650
7816 8650 6543 20996 19249 17543 19101 14931 13308 2412 -5291 -5468 -7698 -2164 4836 13697 18825
7801 18825 10321 -258 -1715 -743 15779 24671 14953 3102 -10 -972 993 1838 2782 -2470 -3275
7786 -3275 -2449 983 4631 -3812 -4590 -6918 -7909 -2794 5122 9304 11210 2453 -1933 549 3430 10209
7770 10209 8495 15067 13536 3105 -427 3767 10555 4659 3118 4811 11087 2298 -14272 -9181
7756 -9181 7500 12602 7465 6131 10727 3266 -3131 -12146 -12915 -1685 5162 1907 1118 7950 8747
7741 8747 7792 5990 8393 12298 18225 8109 -4968 -3683 3427 33 3672 5233 6716 4973 -225
7726b25r677m551j440N484L432J2036K495K282j29o282m176J035J236n80l119
7711b179m820L153P907M855k622l188J562n796j67O535P006n589J883L540L466
7696A5546m966j066J331k416J858N113q262q089J871j84M922j0923J771L800q324
7681h018q577J3454J3355P519r392k701j2840M987O531m741n058k817j959r47
7667a1204L289M932Q028K848l344p592l707N081M098K753J926L46k504R946o216
7652H680j0542k225K359Q03j500m170J192J3349N87K003L264J307o926r088J014
7637A07m319p178j903J266m20n551J32m97K218M54R939r043L26M931J070K004
7621f464K63M410j163K064m073J990Q099q431o260O702K812p024M935k888J699
$$ plain form
7726 -225 -9902 -14453 -15893 -10409 -6977 5059 7554 9836 9707 3425 -751 284 1520 940 -2179
7711 -2179 -6999 -3846 4061 8916 6294 3106 4668 -1128 -1295 5240 12246 6657 8540 12080 15546
7696 15546 10580 9514 10845 8429 10287 15400 7138 -951 920 736 5658 -5265 -3494 306 -8018
7681 -8018 -16595 -3141 10214 17733 8341 5640 -7200 -2213 4318 -423 -5481 -8298 -10257 -11204
7667 -11204 -7915 -2983 5045 7893 4549 -3043 -6750 -1669 2429 5182 7108 7454 4950 14896 8680
7652 8680 -1862 -4087 -1728 -925 -2425 -6595 -5403 7946 8533 10536 13800 15107 8181 -907 107
7637 107 -4212 -11390 -13293 -12027 -12447 -17998 -17866 -18363 -16145 -15691 -5752 -14795 -14469 -9538 -8468 -6464
7621 -6464 -6201 -1791 -2954 -890 -4963 -2973 5126 -3305 -9565 -2863 -51 -7075 -2140 -5028 -3329
7606c329M201k661o025p152q94j193P132Q002m943j698L614R515L126O269M799
7591A8763n558p852p027l337N630J489J0391m591j3001j499J653k51K826L54N436
7576C426r66k568K965m044J205q079m569L188K52n650J1012L747m32M388O85j371
7560C189J0938j626o422l378o749q12J1892J2291j644r205n27M70p899L433K685
7545F636o526l74q0j749q249l972K778j711p74k016R168J2099j057m929p930N081
7529c605m421N842P605q814q506J1080N632j356p806r353J2967M970Q55n970p367
7514h247m879o46J782l135J0230J598p666l804r36M887o465p573O809P289P227
7499c529N813l90m465O362j536j4575q98M967M085l958n501J028O802M788k170
$$ plain form
7606 -3329 872 -1789 -7814 -14966 -15860 -17053 -9921 -1919 -6862 -8560 -4946 4569 7695 13964 18763
7591 18763 13205 5353 -1674 -5011 619 2108 12499 7908 -5093 -6592 -4939 -5190 -2364 -2010 3426
7576 3426 2460 -108 2857 -1187 18 -8061 -12630 -9442 -9190 -14840 -3828 -81 -513 3875 4560 3189
7560 3189 14127 12501 6079 2701 -4048 -4860 7032 19323 17679 8474 7947 8417 518 3951 6636
7545 6636 110 -264 -344 -2093 -10342 -14314 -11536 -13247 -14021 -16037 -6869 5230 4173 -756 -8686 -3605
7529 -3605 -8026 -2184 5421 -3393 -11899 -819 4813 3457 -4349 -13702 -735 4235 5090 -880 -8247
7514 -8247 -13126 -13772 -11990 -15125 -4895 -3297 -10963 -14767 -15703 -10816 -17281 -24854 -18045 -10756 -3529
7499 -3529 2284 1894 -2571 3791 2255 -12320 -13218 -8251 -4166 -8124 -13625 -12597 -5795 -1007 -3177
7484c177j431j249j120J217j1457M079Q781O416p03O69K465J3457M324o213o077
7469I981j0166r954n979P914M740r911r240J0486Q429M404j0062o002J3752J4255
7455A2647o779o768o308N78q387K631K795k113M269k318l455L878N435L832P818
7440G755k349n005N226O094n062J954O93K386L412J230L221m268q871o067j6652
7425a6303J278N796L271Q730M247p38j142N779j217o077K229q162K329R985k280
7410G725o263q727k916L227R810l674j222k926k12m434J986j0712n745l07n09
7395b4899N088L832k568q767k187l967K961J3982J6207R571o079j2533m913k474
7381a6746J929J1529Q423N276q688n042m680p444M353J320k324p224Q887L620
$$ plain form
7484 -3177 -4608 -5857 -6977 -5760 -17217 -13138 -4357 2059 1356 2025 4490 17947 22271 16058 9981
7469 9981 -185 -10139 -16118 -8204 -3464 -13375 -22615 -12129 -3700 704 -9358 -15360 -1608 12647
7455 12647 5868 -900 -7208 -6630 -15017 -12386 -9591 -11704 -7435 -9753 -13208 -9330 -3895 -63 7755
7440 7755 5406 401 5627 11721 6659 8613 9306 11692 15104 16334 19555 15287 6416 349 -16303
7425 -16303 -15025 -9229 -5958 2772 7019 6281 5139 10918 9701 3624 5853 -2309 20 10005 7725
7410 7725 1462 -7265 -10181 -6954 2856 -818 -2040 -4966 -5178 -9612 -7626 -18338 -24083 -24390 -24899
7395 -24899 -19811 -15979 -18547 -27314 -29501 -33468 -30507 -16525 -318 9253 3174 -9359 -14272 -16746
7381 -16746 -14817 -3288 5135 10411 1723 -3319 -7999 -15443 -11090 -9770 -12094 -19318 -10431 -6811
7367f811Q403K792O752k477j3097j0117J288J322L739K495K221P69p441o993L39
7352a6816p60M496O534J917L563R89k02j374l905J847N894m10j0156l848O170
7337f061P136N290M430k790k875K841Q776m158p17l047m365q576n083m308k672
7322a6179P500k119k657L21K812R45m182k20O535m32r497J5360Q331j0106n371
7307h959Q897p847r234j919P061J030J579K293l46N877Q748L315L33q957m507
7292b636m787O007R619K846N494J575n202J674o206j516L405M219j1495L200R05
7277G102l863l124p742n390J2295L754J554O008J443k261p431r41M264l507l369
7262a208P763N678M7p887m001M297O92M555j495n795k797Q326J493J767j3735
$$ plain form
7367 -6811 1592 4384 11136 8659 -4438 -14555 -13267 -11945 -8206 -5711 -3490 -2721 -10162 -17155 -16816
7352 -16816 -17576 -13080 -6546 -4629 -1066 -77 -279 -1653 -5558 -3711 2183 1773 -8383 -12231 -6061
7337 -6061 1075 6365 10795 8005 5130 7971 16747 12589 11872 8825 4460 -4116 -9199 -13507 -16179
7322 -16179 -8679 -10798 -13455 -13134 -10322 -9377 -13559 -13779 -7244 -7676 -17173 -1813 6518 -3588 -8959
7307 -8959 -62 -7909 -17143 -19062 -12001 -10971 -9392 -7099 -7445 -1568 7180 10495 10828 1871 -2636
7292 -2636 -7423 -1416 8203 11049 16543 18118 12916 14590 8384 6868 10273 14492 2997 6197 7102
7277 7102 3239 115 -7627 -13017 -722 3032 4586 10594 12037 9776 2345 1404 5668 2161 -1208
7262 -1208 6555 12233 12280 4393 392 4689 5381 9936 8441 2646 -151 8175 9668 11435 -2300
7247b300k624p545k572k081N345J2719K074m013K859L672N616N166j318j4566
7233D32q590Q58K839n623M817n20k290N644k996N852j87j796j732k651J388n478
7217a0033O94Q627m903m038j997O76N142j58O582P119J1662M788o173p309m190
7202F489l385m813k281M511N367J798j2477p352k227J1528l082k027R463k148
7188f36M085Q463r56p675m033j887J2784o725j0186M693J3791j077q289j904M0
7173D88n509k086j511K925J1019N588q525n843J402J200O444k958o875o777k961
7158a3979j111K685R33l458j033k999j250O220R795K227j162Q847j855M628J845
7143A0333O64J295r25o727Q18l265j914o113j831N799N890n826l506L999N12K511
$$ plain form
7247 -2300 -4924 -12469 -15041 -17122 -11777 942 3016 -997 1862 5534 11150 16316 14998 432
7233 432 -8158 -7300 -4461 -10084 -5267 -5787 -8077 -2433 -5429 423 236 -1560 -3292 -5943 -4555 -10033
7217 -10033 -9339 -712 -5615 -9653 -11650 -10974 -5832 -5990 592 7711 19373 24161 17988 10679 6489
7202 6489 3104 -1709 -3990 521 5888 7686 -4791 -12143 -14370 -2842 -5924 -7951 1512 -636
7188 -636 3449 11912 10956 3281 -752 -2639 10145 3420 -6766 -2073 11718 10641 2352 448 488
7173 488 -5021 -7107 -8618 -5693 5326 10914 2389 -3454 -2052 -852 5592 2634 -4241 -11018 -13979
7158 -13979 -15090 -12405 -11472 -14930 -15963 -18962 -20212 -13992 -4197 -1970 -3132 5715 3860 8488 10333
7143 10333 10997 12292 11367 4640 5458 2193 279 -5834 -7665 -1866 4024 -1802 -5308 -1309 -797 1714
7127A714r1k902J062l546m128j68l327n653L608n40j3068j2937J617O384J1724
7112b0251P450O942J749l156J464Q078k161N512K16m455P191L830l689p709l746
7097b735J2325M58j500j344l263r814j404L58j0726m408n88L858J0445R472j170
7082c6l275L972Q326P241M340p313p044j0234O955J634n549K302M048K59O333
7067A1959K44j2723p129k562M447N974P002k884o863l184q887q584L481K2732
7053C023J921j403n931n887J32J289N41l386K066P58R688j14J645L890m770n256
7037a794n155p94P270k752j645O779K528O909P304M044o657q964k277j990l126
7022c20k785L126O668M16l365j58L577M378J1072l145q763k015l28l841J222M800
$$ plain form
7127 1714 1623 -1279 -217 -3763 -7891 -8059 -11386 -17039 -13431 -13971 -27039 -39976 -38359 -31975 -20251
7112 -20251 -12801 -5859 -4110 -7266 -5802 2276 115 5627 5843 1388 8579 12409 8720 1011 -2735
7097 -2735 9590 10048 8548 7204 3941 -5873 -7277 -6919 -17645 -22053 -22641 -18783 -8338 1134 -36
7082 -36 -3311 661 8987 16228 20568 13255 6211 -4023 2932 4566 -983 1319 5367 5626 11959
7067 11959 12203 -520 -7649 -10211 -5764 210 7212 4328 -2535 -5719 -14606 -23190 -19709 3023
7053 3023 4944 3541 -2390 -8277 -8145 -6856 -6315 -9701 -7635 -6877 2811 2697 4342 8232 3462 -1794
7037 -1794 -6949 -7743 -473 -3225 -4870 1909 4437 11346 18650 22694 16037 7073 4796 2806 -320
7022 -320 -3105 21 6689 7105 3740 3582 7159 11537 22609 19464 10701 8686 8358 4517 5739 10539
7006A0539R42j4736p335Q99J209O386P59K519L153q20P07J853o77J1138K008m259
6990A4285q468k0965m799K975P2R464Q910Q082O9o27n81j059N309M280N410q013
6974A4344q214n238j2842n832M558J4984J0478m440r352j427j830k315J937o72
6960e861J13K83J167R805m573M767L442p812k435P048P735Q299l375j4368j636
6945B599P9l848Q867J409p83p684k281O806O001j0715j357k728j1251j3300J0174
6930a8012J0861P830o943l667O211P825j412K227N766p85K931r736j0148j771
6916h823N222J520j115o766J309R075J1509K188q183j1715m99L943K94j754O34
6901c161J384o196m01M057M794l157n719M316N298L994l5o902l234K753L678m785
$$ plain form
7006 10539 11481 -3255 -10590 -9691 -8482 -2096 -1337 1182 4335 3515 4222 6075 5398 16536 18544 14285
6990 14285 5817 -15148 -19947 -16972 -16900 -7436 1474 9556 9625 8998 8417 7358 12667 16947 22357 14344
6974 14344 6130 892 -11950 -17782 -13224 1760 12238 7798 -1554 -2981 -4811 -7126 -5189 -5861
6960 -5861 -5748 -5465 -4298 5507 934 5701 9143 1331 -1104 5944 13679 21978 18603 4235 2599
6945 2599 2678 -1170 7697 9106 8323 639 -1642 5164 11165 450 -907 -3635 -14886 -28186 -18012
6930 -18012 -7151 679 -6264 -9931 -3720 4105 2693 4920 10686 9901 12832 3096 -7052 -8823
6916 -8823 -3601 -2081 -3196 -9962 -8653 422 11931 14119 5936 -5779 -6278 -2335 -2041 -3795 -3161
6901 -3161 -1777 -7973 -8374 -4317 477 -2680 -8399 -4083 1215 5209 5174 -1728 -4962 -2209 1469 -3316
6885c316j2646o336J076Q908L306k957m713N11O594q83m782J988p557m370N881
6870a9296J6048Q229J207L120n979O553L613k002k540m519j770o76q576K395J025
6855c168K063N902m439j0122j603O684M611p297l300J1479O146j3237l18L448
6841c151m41n53N102P271j700n731m458J294J171K198Q383j049p317q899k62K734
6825e408L900P82O358j476p67j594o764o050R09J121n19R238L264j930n877l582
6809h395L483j106M425M574K707o358j4266l195P950K03K885J0047p41p850m340
6794i977Q61K943Q58Q240L597J297k685j3830L210O556N451Q664P292L366L405
6779B9248m490j2687j0189L771K537M622m623q120j0013m77M088L362L005Q155
$$ plain form
6885 -3316 -15962 -22298 -21222 -12314 -9008 -11965 -16678 -16167 -9573 -10456 -15238 -13250 -20807 -25177 -19296
6870 -19296 -3248 4981 6188 9308 3329 9882 13495 11493 8953 4434 2664 1988 -6588 -4193 -3168
6855 -3168 -1105 4797 358 -9764 -11367 -4683 -72 -7369 -10669 810 6956 -6281 -6599 -3151
6841 -3151 -3592 -4145 957 8228 6528 797 -3661 -2367 -1196 1002 9385 8336 1019 -7880 -8142 -5408
6825 -5408 -1508 -726 5632 4156 3389 1795 -4969 -11019 -10110 -8989 -9508 -270 2994 1064 -4813 -8395
6809 -8395 -4912 -6018 -1593 2981 5688 -670 -14936 -18131 -10181 -9978 -7093 2954 2213 -5637 -9977
6794 -9977 -9116 -6173 -5315 2925 6522 7819 5134 -8696 -5486 1070 6521 15185 22477 25843 29248
6779 29248 24758 12071 1882 5653 8190 12812 8189 69 -9944 -10421 -6333 -2971 34 8189
6765H189n926n435j48k696n836J853m521K989K338J500R083n825q936k743l479
6750a9593N696K360N398l004k928J2074K211m1M607n059r517M432J490o12j204
6735c690n017m616Q510J108o104M212O642J450j1882r351L69J2405Q274j497M286
6720E099l741n674P474O228q185L2m26k067l023K155M46j3046K380J8734Q491
6705A4877r693j7565j4706P910K0760M700J329J84L12J910n094k178o708K131
6691a831L224J255N361n794m41k317P56m848l600N557O555J502O464l023j3169
6676d349L28m683K121K406M20k650O157J367O852O383o737J69L789j0303m497
6661c227j531P908K655J334J043L231p995k565K32j13n85j839n402q928O030M018
$$ plain form
6765 8189 2263 -3172 -3320 -6016 -11852 -9999 -14520 -11531 -9193 -7693 1390 -4435 -13371 -16114 -19593
6750 -19593 -13897 -11537 -6139 -9143 -12071 3 2214 2173 6780 1721 -7796 -3364 -1874 -2486 -3690
6735 -3690 -8707 -13323 -4813 -3705 -9809 -5597 1045 2495 -9387 -18738 -18369 -5964 2310 813 5099
6720 5099 1358 -4316 3158 9386 1201 1233 807 -1260 -4283 -2128 -1682 -14728 -12348 6386 14877
6705 14877 5184 -12381 -27087 -19177 1583 6283 7612 7796 8108 10018 4924 2746 -3962 -1831
6691 -1831 1393 2648 8009 2215 1774 -543 213 -4635 -8235 -2678 3877 5379 11843 8820 -4349
6676 -4349 -4021 -8704 -6583 -4177 -3757 -6407 -250 1117 7969 14352 7615 7784 11573 1270 -3227
6661 -3227 -4758 3150 5805 7139 8182 11413 3418 853 1085 972 387 -1452 -6854 -15782 -9752 -5734
6645e734j3794L22k452n342l431j895J5436J1361L940j735R506l187l316j053
6631a374j881j4397j1777O506R301N060K439L693j400l979j12O613J1672K657
6617A3021r703j4700J164Q052P365o937o609L891p676K892P633J244j935K281
6603a7J124r360o111O304R44R957K172q113r343L870pK320O071j674O613J3722
6587A8472n18j2050m210O208j323l721m782k617m472o160q081Q143O322Q387J0481
6572A0079L934m242o228L294M580k360k804p338p301l49K984Q181J837j954n534
6557c221q53O235J916N602J52o042n985m090j4629L582J2467Q17m61o515k32Q381
6541b876r366r875P12O606P993J707j137J057j747j0468m921m72J1690P609m507
$$ plain form
6645 -5734 -19528 -19206 -21658 -27000 -30431 -32326 -16890 -5529 -1589 -3324 6182 2995 -321 -1374
6631 -1374 -3255 -17652 -29429 -22923 -13622 -8562 -6123 -2430 -3830 -7809 -7921 -1308 10364 13021
6617 13021 3318 -11382 -10218 -2166 5199 -1738 -8347 -4456 -12132 -9240 -1607 -363 -2298 -17
6603 -17 1107 -8253 -14364 -8060 -7116 2841 5013 -3100 -12443 -8573 -8580 -6260 -189 -1863 4750 18472
6587 18472 17954 5904 1694 7902 6579 2858 -1924 -4541 -9013 -15173 -23254 -15111 -8789 -402 10079
6572 10079 14013 9771 3543 6837 11417 9057 6253 -1085 -8386 -8735 -5751 2430 4267 2313 -3221
6557 -3221 -4074 2161 4077 9679 9831 3789 -2196 -6286 -20915 -17333 -4866 -4049 -4510 -11025 -11257 -2876
6541 -2876 -12242 -22117 -21405 -14799 -6806 -5099 -6236 -5179 -6926 -17394 -22315 -22787 -11097 -3488 -7995
6526g995n970J0260K632M24K404l658n342M977l243l342P35L084L527K738P989
6511I220p432j0808N652K552l605J62M389n259l406m87p36l610K61O485l11O924
6495iL361p86m52N125K210L636k742m097J324m16k560j071J050M957L509p578
6479E461p722j4050j2940L343R997N343l070K621M233l568m815k534K036Q954
6465f711O262m688l979o255k235O836L902m125J86j224Q191J811o901O161P855
6450E086K857j646J920L378p090n298K141K676L863j4529o254J1328p684n995
6436a5247J1490L572m055J288R315J640l720m996q136p70k752P61L839M621N690
6421B540K912r25o352p861j605M721K283m182M830N019k239q1r103j2597L706
$$ plain form
6526 -7995 -13965 -3705 -1073 -649 1755 -1903 -7245 -2268 -5511 -8853 -8118 -5034 -1507 1231 9220
6511 9220 1788 -9020 -3368 -816 -4421 -4259 130 -5129 -8535 -9022 -9758 -13368 -13107 -6622 -6933 -9
6495 -9 3352 2566 2114 7239 9449 13085 10343 6246 7570 7154 4594 3523 4573 9530 13039 5461
6479 5461 -2261 -16311 -29251 -25908 -15911 -10568 -13638 -11017 -6784 -10352 -15167 -17701 -15665 -6711
6465 -6711 -449 -5137 -9116 -15371 -17606 -10770 -6868 -10993 -10807 -12031 -3840 -2029 -8930 -2769 5086
6450 5086 7943 6297 8217 11595 4505 -793 1348 4024 7887 -6642 -12896 -1568 -9252 -15247
6436 -15247 -3757 -185 -4240 -2952 6363 8003 4283 -713 -8849 -9619 -12371 -11610 -7771 -3150 2540
6421 2540 5452 4527 -1825 -9686 -11291 -6570 -4287 -8469 -3639 1380 -859 -940 -10043 -22640 -18934
6406a8934J4749J3608M654o378k960l823N513N989J226r083j2409j772J655M111
6392c854N71J670K822n554K99O404o779j0358Q562P640j339J219j341m006o864
6377a0908K580P861M401o086l855j665J676O176J069r021l796K57k712P481N664
6362h78j90K2l304O729J97K928K009R367j0452j8610L557K426o57M463L102O790
6346G499p686j5846n008N493K374M626j284k656J0489N849k516K322p42J173P909
6331A1996Q771K773o256k390q264l141L588M169m367m015n400n469j553Q227l3
6316a364L955Q814N698Q377Q27q747l071o041m232L252j734q972k089O091L25
6301A089l884m487l907P98O301P93L803M763M526l236m802j2710j240O686R433
$$ plain form
6406 -18934 -4185 9423 14077 7699 4739 916 6429 12418 13644 4561 -7848 -9620 -7965 -3854
6392 -3854 -3283 -1613 1209 -4345 -4046 2358 -4421 -14779 -6217 1423 84 1303 -38 -4044 -10908
6377 -10908 -8328 -467 3934 -2152 -6007 -7672 -5996 180 1249 -7772 -11568 -11311 -14023 -6542 -878
6362 -878 -1068 -1046 -4350 2379 2576 5504 7513 16880 6428 -12182 -8625 -6199 -6856 -2393 709 7499
6346 7499 -187 -16033 -21041 -15548 -13174 -8548 -9832 -12488 -1999 3850 1334 3656 2914 4087 11996
6331 11996 20767 23540 17284 14894 6630 3489 7077 11246 6879 2864 -2536 -8005 -9558 -1331 -1364
6316 -1364 2591 11405 17103 25480 26307 17560 14489 8448 4216 7468 5734 -3238 -5327 764 1089
6301 1089 -2795 -7282 -11189 -10391 -4090 -3297 506 5269 9795 6559 1757 -10953 -12193 -5507 3926
6286C926M061j899q118j1466m803L120J5611Q765o002j0811Q80or718J500K540
6271a2420p071J752R344o138j0491J610p460Q948Q679M017J767n364J1177P922
6257F272m518J536K939n293j870o49J297o592k092J837J947K284P182J283k166
6242C397n556J1433p57j1979r919k324J5R814M950k905n724k590Q103N563m648
6227c127N375J129k7L40M0N68M585r69l302l444n346l269M860k167j554J267L415
6210a626j173p319N120J3014n277p010N580K334n129l797N604N517m124o713J0597
6195E598N539o042j2755M762Q684j310O076K149L406j484j599j4379k261K62n98
6180c952r438N357M240k127l186J004P088o577m439m96K241P781O10l563o505
$$ plain form
6286 3926 7987 6088 -2030 -13496 -18299 -15179 432 9197 3195 -7616 -6736 -6742 -16460 -14960 -12420
6271 -12420 -19491 -17739 -8395 -14533 -25024 -23414 -30874 -21926 -13247 -9230 -7463 -12827 -1650 6272
6257 6272 1754 3290 6229 936 -934 -1583 -286 -6878 -8970 -7133 -5186 -2902 4280 5563 3397
6242 3397 -2159 9274 8517 -3462 -13381 -15705 -15690 -5876 -926 -3831 -9555 -12145 -4042 1521 -3127
6227 -3127 2248 3377 3350 3690 3730 4298 8883 7914 4612 1168 -4178 -7447 -2587 -4754 -6308 -5041 -1626
6210 -1626 -2799 -10118 -4998 8016 2739 -4271 1309 3643 -1486 -5283 321 5838 1714 -4999 5598
6195 5598 11137 5095 -7660 -2898 5786 4476 10552 12701 16107 14623 13024 -1355 -3616 -3354 -3952
6180 -3952 -13390 -8033 -3793 -5920 -9106 -8102 -1014 -7591 -12030 -12526 -10285 -2504 -1894 -5457 -11962
6165a1962j470j748R64K601m818O316K346L715J3596m508M44K505M120n561q651
6150b111l362q18P415O419r23j3074j898N354J679k084K195K881l19Q03l514p684
6134i041l873M287P030N431p953k42k390Q754R324J357q300K199j105k2426J350
6119a5598N764L334P773o911j950J701O223j1943r984Q13L470J257K89p03O704
6104i761M208O474k123J370m67L442k106K87R22l648m528k254Q787l409o293j607
6088a0706k763J0036J7129R00r090k668o487l667l137p199q539O497J0138m716
6074a4272q224N035Q742p51p099o929q489Q877J1504R10Q859L228l959j2972M894
6059a0646k223j013J847L604P432j715l630n772O073l782N15O519P845k337M826
$$ plain form
6165 -11962 -13432 -15180 -14216 -11615 -16433 -10117 -7771 -4056 9540 5032 5476 7981 12101 6540 -2111
6150 -2111 -5473 -6291 1124 7543 6620 -6454 -8352 -2998 -1319 -3403 -1208 1673 1354 2157 -1357 -9041
6134 -9041 -12914 -8627 -1597 3834 -4119 -4361 -6751 2003 11327 12684 4384 6583 5478 -16948 -15598
6119 -15598 -9834 -6500 1273 -5638 -7588 -5887 336 -11607 -21591 -20778 -17308 -16051 -15762 -16465 -9761
6104 -9761 -5553 921 -1202 168 -299 3143 1037 1324 2246 -1402 -5930 -8184 603 -2806 -9099 -10706
6088 -10706 -13469 -3433 13696 14596 5506 2838 -3649 -7316 -10453 -17652 -26191 -19694 -9556 -14272
6074 -14272 -22496 -17461 -8719 -9470 -16569 -23498 -31987 -23110 -11606 -10696 -1837 1391 -2568 -15540 -10646
6059 -10646 -12869 -13882 -12035 -8431 -999 -2714 -6344 -12116 -6043 -9825 -9310 -2791 5054 2717 7543
6044G543p18j463O733l882k2m013L700q010l931L566r82j230J936N762J547r251
6028b715o562M330J1289K757k180P60K950J982j369l585K559L720n446q190l619
6013c319M309P087L640p580j5462j0515O897O268L410N174O819J599o379m170
5999b222N251J0914l105r928p317o927k820j404K182j01K766J1025J4792N125
5985A8231o221j2346l60p278l008K096k532L50n324P380P811p380J0982J761j0250
5970f088L370Q525k63R409J706r269j0935p302P452m05m678P787N958k008j179
5955B080n33r615J207jr422k843K696n894M410J3511J0039M201J563K157r352
5940D204j3810l179P648N311R957k022m146P777q983j0199Q54j19R088K625l107
$$ plain form
6044 7543 6825 5362 12095 8213 8191 4178 7878 -132 -4063 -497 -1479 -2709 -773 4989 6536 -2715
6028 -2715 -9277 -4947 6342 9099 6919 7679 10629 12611 11242 7657 10216 13936 8490 300 -3319
6013 -3319 990 8077 11717 4137 -11325 -21840 -14943 -8675 -5265 -91 6728 8327 1948 -2222
5999 -2222 3029 13943 10838 910 -6407 -13334 -16154 -17558 -15376 -15477 -12711 -1686 13106 18231
5985 18231 12010 -336 -696 -7974 -10982 -8886 -11418 -11068 -16392 -9012 -1201 -8581 2401 4162 -6088
5970 -6088 -2718 5807 5544 14953 16659 7390 -3545 -10847 -3395 -3800 -8478 -691 5267 3259 2080
5955 2080 1547 -8068 -6861 -6862 -16284 -19127 -16431 -22325 -17915 -4404 5635 9836 11399 13556 4204
5940 4204 -9606 -12785 -5137 174 10131 8109 3963 11740 2757 -7442 -6588 -6707 2381 5006 1899
5925A899o377k446K115j190P481m160p824j751M322P289J861j0131R614r5o956
5910f349N999L280Q76J132j836j2668j366j115O894N334N021l382r17q128j834
5895i059N685N913P729j721o439k279m074m434k415N016N792Q156P663j5260q922
5880h649P749N717K933j590K867L937o971m529l817L265k198p692n624j159P027
5865h734O180j165J3520L741j4444j838K663M755N719j073L888k714p768j0849
5851h119K905M944N856L330k445L177o67K275q910j0960l659j39M898j091m783
5836a3388L507J285o592K586P332l885N795K369l482r261L278J360P122J061m072
5821d985L696j635M618j279o877J2106P023O42p140o979m871M811K404K387o621
$$ plain form
5925 1899 -4478 -6924 -4809 -5999 1482 -2678 -10502 -12253 -7931 -642 1219 -8912 702 607 -6349
5910 -6349 -350 2930 3806 4938 3102 -9566 -10932 -12047 -5153 181 5202 1820 903 -7225 -9059
5895 -9059 -3374 2539 10268 8547 2108 -171 -4245 -8679 -11094 -6078 -286 7870 15533 273 -8649
5880 -8649 -900 4817 7750 6160 9027 12964 5993 1464 -2353 912 -1286 -8978 -14602 -15761 -8734
5865 -8734 -2554 -3719 9801 13542 -902 -2740 -77 4678 10397 9324 13212 10498 2730 -8119
5851 -8119 -5214 -270 5586 8916 6471 9648 8981 11256 2346 -8614 -12273 -12412 -7514 -8605 -13388
5836 -13388 -9881 -8596 -15188 -12602 -5270 -9155 -3360 -991 -4473 -13734 -10456 -9096 -1974 -913 -4985
5821 -4985 -1289 -2924 1694 415 -6462 5644 12667 13309 6169 -810 -5681 -870 1534 3921 -2700
5806b700l568N474O369k54j711r435m73r36m358K687M321J855Q580m577o418J0967
5790E823O611m317o29l164K069K00Q80K800m858n565R4p416p940j523p865o623
5774c1423P110K3315J2410K905j787j4264K189L297o626J950p490l560k379L832
5760a0521M30p284N325R423O87j269K844P480o338o936P208J1164p172m609p276
5745f844k129R836N37m843o310m253k762P950L991K232Q94k336R81J1018l037
5730D925k396o840L171n497L039J718n264k453L952L517J0463o208p843k806P320
5715a202J331o071n146p481k47P139l085k591J1573j822n327L346L825n758K028
5700i488K446j280O722J370l543l406m822o216M73J314R20R626P683p531r699
$$ plain form
5806 -2700 -6268 -794 5575 5321 3610 -5825 -6298 -7234 -11592 -8905 -4584 -2729 5851 1274 -5144 5823
5790 5823 12434 8117 7488 4324 6393 6593 7473 10273 5415 -150 -56 -7472 -15412 -16935 -24800 -31423
5774 -31423 -24313 -998 11412 14317 12530 -1734 455 3752 -2874 -924 -8414 -11974 -14353 -10521
5760 -10521 -10091 -17375 -12050 -2627 -1940 -3209 -365 7115 777 -6159 1049 12213 5041 432 -6844
5745 -6844 -8973 863 1400 -3443 -9753 -14006 -16768 -8818 -4827 -2595 -1701 -4037 -3056 7962 4925
5730 4925 2529 -4311 -1140 -6637 -3598 -1880 -7144 -9597 -5645 -2128 8335 2127 -5716 -8522 -1202
5715 -1202 129 -5942 -11088 -18569 -18816 -11677 -14762 -17353 -5780 -7602 -12929 -9583 -5758 -11516 -9488
5700 -9488 -7042 -8322 -1600 -230 -3773 -7179 -12001 -18217 -17744 -16430 -15510 -5884 1799 -5732 -15431
5685a5431Q329N029M239l192N756L032J983k958j1964o925L288J864P86L294J3238
5670A0368l53j663M126L905l177J605m921p847r502K064l705k104K703L187m31
5655e745L038J949r490n976J331m72P444l128j3185l640L480N223J055L353O15
5640a4148N215l589j1600N297M388J2854Q311J979j2243j1415n281K526p044l493
5626b8243J3915J8432N20j2112j2132o339P488J6091Q386K996N191k865P666n123
5612A3871o007q489m442L44n041J78M591j0720Q549J0024q82o634r699R85L802
5597i570J68j61J0365J59n45J998K651k464q474m38l717K823k276J851m427o211
5581a8268N315J398L458k31K751K830j669M080n86m011o551N053l114m598L762
$$ plain form
5685 -15431 -7102 -2073 2166 -1026 4730 7762 9745 6787 -5177 -12102 -8814 -6950 -6164 -2870 10368
5670 10368 10015 8352 12478 16383 13206 14811 9890 2043 -7459 -5395 -9100 -11204 -8501 -5314 -5745
5655 -5745 -2707 -758 -10248 -16224 -14893 -15365 -7921 -11049 -24234 -27874 -24394 -19171 -18116 -14763 -14148
5640 -14148 -8933 -12522 -24122 -18825 -14437 -1583 6728 8707 -3536 -14951 -20232 -17706 -24750 -28243
5626 -28243 -14328 4104 4624 -7488 -19620 -25959 -18471 -2380 6006 9002 14193 11328 18994 13871
5612 13871 7864 -625 -5067 -4723 -9764 -9586 -4995 -15715 -7166 2858 1976 -4658 -14357 -13372 -9570
5597 -9570 -9402 -9563 802 961 416 2414 5065 2601 -5873 -6311 -10028 -7205 -9481 -7630 -12057 -18268
5581 -18268 -12953 -11555 -8097 -8328 -5577 -2747 -4416 -336 -922 -4933 -11484 -6431 -9545 -14143 -10381
5566a0381n21J032N486J261J684m322Q711j249l525P857M586P703p311j5321q625
5551a2935J3715p204o953L818r816K861J9303P603q314q279K047P358J825P176
5537A2205n904o576l742m747k268j0089l748L720N72J2249L901M413M420J14j8952
5522a4432p077M343J425J6203R652J420K209j0789n90N013J0588o526j1131j0718
5508a0410o20K435R11J5220J6783M44j3082j0548j029O179j267l049J43J290q64
5493B536r112o957K630J350N55J1758J790l320p947J363L941R350K233n941R56
5478E185L983o438M573m644r794K57k016J5519L178J12R89n864k729r59K6L081
5462D459r022p817J62M58O600J1504L07m655m359L44k020J552P39L921J2428k659
$$ plain form
5566 -10381 -10902 -9870 -4384 -3123 -1439 -5761 2950 1701 -1824 6033 10619 18322 11011 -4310 -12935
5551 -12935 780 -6424 -13377 -9559 -19375 -16514 2789 10392 2078 -6201 -4154 3204 5029 12205
5537 12205 6301 -275 -4017 -8764 -11032 -21121 -24869 -21149 -20577 -8328 -4427 -14 4406 4520 -14432
5522 -14432 -21509 -17166 -15741 462 10114 11534 13743 2954 2364 7377 17965 11439 308 -10410
5508 -10410 -11030 -8595 -7684 7536 24319 24763 11681 1133 104 6283 5016 1967 2110 3400 2536
5493 2536 -6576 -13533 -10903 -9553 -8998 2760 4550 1230 -6717 -5354 -1413 7937 10170 4229 5185
5478 5185 9168 2730 7303 2659 -7135 -6878 -8894 6625 9803 9915 10904 5040 2311 1352 1378 4459
5462 4459 -4563 -12380 -12218 -11760 -5160 6344 6651 1996 -2363 -2019 -4039 -2487 -1748 2173 14601 11942
5446A1942p78k788j783o189m763L952L92p059m22m63q120p938J531O230O775p592
5430a7073J3070m12j2479N87J856n783M265M960M656k9j479J0206O009r378m994
5415f018n074L74M067N207O078j203n437p670L988k334R718R012j190q407P025
5400H136J5099K173o561m629j1028q731J389M006r295o866O151K290J898Q34N208
5385G4l599l858j506L080M981R182K100n132m856n836m779J577m49m039j614Q465
5369f209N559K026L356o55l696K234J941P983j433n069j1249j009J6233J2695
5355B2707j3080j1270J29q545K694J5511q34j2365l295K53O127O815N413r274
5341I86m310K98j184L523j452k62L576q45p056l991Q060O586j75o559o889N601
$$ plain form
5446 11942 11164 8376 6593 404 -4359 -407 -15 -7074 -7496 -7959 -16079 -24017 -22486 -16256 -9481 -17073
5430 -17073 -4003 -4415 -16894 -16307 -14451 -20234 -15969 -11009 -6353 -6382 -7861 2345 8354 -1024 -6018
5415 -6018 -11092 -10718 -6651 -1444 4634 3431 -2006 -9676 -5688 -8022 1696 10708 9518 1111 8136
5400 8136 23235 25408 18847 14218 3190 -5541 -4152 -146 -9441 -16307 -10156 -7866 -5968 -5134 74
5385 74 -3525 -7383 -8889 -5809 -828 8354 10454 5322 466 -5370 -10149 -8572 -9021 -13060 -14674 -6209
5369 -6209 -650 1376 4732 4077 381 2615 4556 12539 11106 6037 -5212 -6221 10012 22707
5355 22707 9627 -1643 -1514 -10059 -7365 8146 7312 -5053 -8348 -8095 -1968 4847 10260 986
5341 986 -3324 -3026 -4210 -687 -2139 -2401 1175 330 -6726 -10717 -2657 3929 3754 -2805 -9694 -4093
5325d093n243m44P88J359L039N565m337J340o018q79p778K530J0276m50O816K970
5309E441l341O389J2068K664n162N17j3194j5533N137l44j748J0490l401M442
5295D425Q163q33j357n157l628N108L824n88m449l575l950N456r579r427j428
5280a6995L385J5573k679q91L329J341l869k432Q0m774N036k479r907K262k788
5265a5808M870Q417k300N239Q838P409j1988k696k313L383j04L79L271K609N76
5250I782p932j709M547K282j3813M413n037o007J2532l31m460l685q100J849N403
5235a0266O496K396K305N272m588j968K861J1092N375k387P61p545j4368L713
5221h51j380p906m217J925P865M114L84j922K119o657q792L913O663q552n676
$$ plain form
5325 -4093 -9336 -9780 -8992 -7633 -4594 971 -3366 -2026 -8044 -8923 -16701 -14171 -3895 -4345 2471 5441
5309 5441 2100 8489 20557 23221 18059 18576 5382 -10151 -5014 -5358 -7106 3384 -17 4425
5295 4425 12588 11755 10398 5241 1613 6721 10545 9957 5508 1933 -2017 3439 -6140 -15567 -16995
5280 -16995 -13610 1963 -716 -1607 1722 3063 -806 -3238 -3158 -7932 -2896 -5375 -15282 -13020 -15808
5265 -15808 -10938 -2521 -4821 418 9256 16665 4677 1981 -332 3051 2947 3326 6597 9206 9782
5250 9782 1850 141 4688 6970 -6843 -2430 -7467 -13474 -942 -1273 -5733 -9418 -17518 -15669 -10266
5235 -10266 -3770 -1374 931 6203 1615 -353 2508 13600 18975 16588 17349 9804 -4564 -851
5221 -851 -2231 -10137 -14354 -12429 -4564 -450 -66 -1988 131 -6526 -15318 -11405 -4742 -13294 -18970
5206a8970l331J0489R347k234K625N458l198k474k124J0710L302m773m037l42
5192D48L100M137M316n042k301m658n93L247R00p02m369K024J57J449N204j484
5176E833L664P115j296p806m512J050p205N635j01m729M281j312q674j8197K895
5161b3359R800O988Q738O348m659O74m242p380o298l578N432L292k488K171J2424
5146C863j701p062m115J5255q93j2698j584P359o667k665L587M532L893k61m799
5131c956k966q692j509n291J20L888N227Q169o88o046n196j045K56O171Q806M499
5115A747K841N892R14J732n438l302j75K954J370O391k952L053l482p137k234
5100B174O909k899o508p10p367L134M74M696p117l407O914K528K792j457k062
$$ plain form
5206 -18970 -22301 -11812 -2465 -4699 -2074 3384 186 -2288 -4412 6298 9600 4827 790 448
5192 448 3548 7685 12001 6959 4658 0 -593 2654 3554 2852 -1517 507 664 2113 7317 5833
5176 5833 9497 16612 15316 7510 2998 4048 -3157 2478 2377 -2352 1929 617 -8057 -26254 -23359
5161 -23359 -13559 -6571 2167 8515 3856 4530 288 -7092 -13390 -16968 -11536 -8244 -10732 -8561 3863
5146 3863 2162 -4900 -9015 6240 5347 -7351 -8935 -1576 -8243 -10908 -7321 -2789 1104 843 -3956
5131 -3956 -6922 -15614 -17123 -22414 -22294 -18406 -13179 -5010 -5698 -11744 -16940 -17985 -17729 -11558 -2752 1747
5115 1747 4588 10480 11394 13126 7688 4386 4211 7165 8535 14926 11974 15027 11545 4408 2174
5100 2174 9083 6184 -324 -1034 -8401 -5267 -4793 -97 -7214 -10621 -3707 -1179 1613 156 -1906
5085a906N45m088o019J991N556k823M792L218q134K505R189J2859j781n121o872
5070C911O728P798k028j4104p920R307P240Q80k817m027j918j1844j1476M310
5056a5960q4R285J2097m757j0004k550L113O773j049o51j0273p904P691M262p864
5041a7875Q861N367M469N646R370N925N142q472R74p994l265Q909p064r102j3456
5026a2565o940Q793J1499m310m23J589L6K885K666j900K523l456j785o354k425
5011a0167l340q71n483k622k896o94K688p015O538M048L066L352O537R762L002
4996E905N100m155j696L194K748j062j2384j2703P678L455m73Q12p39j143J031
4981d432J468m476j0088M782L930P389L338l412O736k910p217l581P203R452j1743
$$ plain form
5085 -1906 -1361 -5449 -11468 -9477 -3921 -6744 -1952 1266 -6868 -4363 4826 17685 15904 10783 3911
5070 3911 10639 18437 16409 2305 -5615 3692 10932 11812 8995 4968 3050 -8794 -20270 -15960
5056 -15960 -16044 -6759 5338 581 -9423 -11973 -8860 -2087 -3136 -3787 -14060 -21964 -14273 -10011 -17875
5041 -17875 -9014 -3647 822 6468 15838 21763 26905 18433 19407 11413 8148 17057 9993 891 -12565
5026 -12565 -19505 -10712 787 -3523 -3946 -2357 -2321 564 3230 1330 3853 397 -1388 -7742 -10167
5011 -10167 -13507 -14378 -19861 -22483 -25379 -26073 -23385 -30400 -23862 -19814 -16748 -13396 -6859 2903 5905
4996 5905 11005 6850 5154 8348 11096 10034 -2350 -15053 -7375 -3920 -4393 -3581 -4320 -5463 -4432
4981 -4432 -2964 -7440 -17528 -12746 -8816 -1427 1911 -1501 5235 2325 -4892 -8473 -1270 8182 -3561
4966c561q177Q16J893k067L692j1458k541J1787m754l437P174N702j044J953Q779
4951D757L802p946j3582p766J3026R25P30K722N322q083N098J5043n340M759N132
4936A8599q875N23J290j97J175j437q567p634K425n288p560M875j196q05K196
4921a0476L625Q51J241L351J1262L150R235q844j0516l331M745J1878k484J121
4907A4808m392q842l850o840l66N913R543j282o423l182L012L562L060l866q310
4892g455L44M599n6k713R873m077j1286N177J3979M277O26k980L653n391p655
4877I15o223M012N542L208P46R68P531J301n401k295J1206J237J752o407j2784
4862E308l569Q66l939o268l682N498k039k072P31K683M025N571J83Q326R13K876
$$ plain form
4966 -3561 -11738 -10922 -9029 -11096 -7404 -18862 -21403 -9616 -14370 -17807 -10633 -4931 -5975 -4022 4757
4951 4757 8559 613 -12969 -20735 -7709 -6784 -6054 -3332 1990 -6093 -995 14048 8708 13467 18599
4936 18599 9724 10247 11537 11340 12515 11078 2511 -5123 -2698 -7986 -15546 -10671 -11867 -12672 -10476
4921 -10476 -6851 -6000 -4759 -1408 9854 13004 22239 13395 2879 -452 4293 16171 13687 14808
4907 14808 10416 1574 -2276 -9116 -9482 -3569 5974 4692 -1731 -4913 -1901 1661 4721 855 -7455
4892 -7455 -7111 -2512 -2568 -5281 4592 515 -10771 -5594 8385 12662 13288 10308 13961 8570 915
4877 915 -5308 -1296 4246 7454 8200 9168 16699 18000 12599 10304 21510 22747 24499 18092 5308
4862 5308 1739 2605 -1334 -7602 -11284 -5786 -7825 -9897 -9166 -6483 -2458 3113 3296 11622 12535 15411
4846A5411N59l821j3457k360O560O382O16j7717q806K904J1707M759r13q80l900
4831b956O60J3582N656j2005k04r299r612R881O985P66m528o907j7187n393J2119
4816a8442J1390J483m477N828k444k159n818O475Q288p07N315N443n61l173m770
4801A671K854J31o595n806m69L065O607k788k37N270j123N411J509O072l772o551
4785E249l007k349l220L929n428q983J4076J3943m087m59L393j656j4332K243
4771f88m451K341P593J2472L90j313N811p648o596l533l623M810j896n916p734
4756i981M256J1032m409p712M386L203l000O176M776K645J128m375r210Q82J432
4741A229m639k316L27K298l19n332K39O277O982q11j092N652k923O397M507o863
$$ plain form
4846 15411 15970 12149 -1308 -3668 2892 9274 9890 -7827 -16633 -13729 -2022 2737 1824 944 -2956
4831 -2956 -2296 11286 16942 4937 4733 -4566 -14178 -4297 2688 3454 -1074 -7981 -25168 -30561 -18442
4816 -18442 -7052 -5569 -10046 -4218 -6662 -8821 -14639 -8164 124 -583 4732 10175 9614 6441 1671
4801 1671 4525 4656 -1939 -7745 -8214 -5149 1458 -1330 -1567 3703 2580 7991 9500 15572 11800 5249
4785 5249 2242 -107 -3327 602 -4826 -13809 267 14210 10123 9664 13057 11401 -2931 -688
4771 -688 -5139 -2798 4795 17267 17657 16344 22155 14507 7911 4378 755 5565 3669 -2247 -9981
4756 -9981 -5725 5307 898 -6814 -2428 775 -2225 3951 8727 11372 12500 8125 -1085 -203 1229
4741 1229 -3410 -5726 -5399 -3101 -3420 -8752 -8513 -2236 4746 3935 2843 8495 5572 11969 16476 9613
4725I613L309p203m099l575J163P784K766j671j189m736q165L034J1809m156n585
4710i01j0087m534N187N202n04O178J216k530P1m269k570J722l094N905J3600
4695A0592R67J808j0425r0K199n576o809l070J315j053J496J8746J601j1318l766
4680c383K920n996P22K482L441J018o135l691K014j680K947O237J64o966L357
4665b549P774Q892J322p829j121M113j125o331j0565n127P595J58Q429J894p513
4650a983J01j085r635l885J0661L276M149L252K308r52Q22l491K098l340o637
4635d341l296k209J2921M007o163j0344o206n17J1064J21l038l026L120q195N304
4620a0798J4989j13j0766k94K172L673N458l372j5919K993O249k126l622L580
$$ plain form
4725 9613 12922 5719 1620 -1955 -792 6992 9758 8087 6898 2162 -6003 -2969 8840 4684 -901
4710 -901 -10988 -15522 -10335 -5133 -5637 541 1757 -773 -702 -4971 -7541 -5819 -8913 -3008 10592
4695 10592 11559 13367 2942 2852 5051 -525 -7334 -10404 -9089 -10142 -8646 10100 11701 383 -3383
4680 -3383 -463 -6459 -5737 -3255 186 1204 -4931 -8622 -6608 -8288 -5341 896 1060 -5906 -2549
4665 -2549 5225 14117 15439 7610 6489 10602 9477 3146 -7419 -12546 -4951 -4793 3636 5530 -1983
4650 -1983 -1882 -2967 -12602 -16487 -5826 -2550 1599 4851 7159 6207 7029 3538 5636 2296 -4341
4635 -4341 -7637 -9846 3075 7082 919 -9425 -15631 -16148 -5084 -4963 -8001 -11027 -7907 -16102 -10798
4620 -10798 4191 4078 -6688 -6982 -4810 -1137 4321 949 -14970 -11977 -5728 -7854 -11476 -7896
4606g896J052J804K857j850j1735J416L337j774N308K392l648J15L236K663M171
4591A448J1171M714p923m376l562R76J891l432p521M49p628o245m541N011Q861
4576a0707l798O723j047N66K251p53n929J650P045P404J71j82J106k879L264J5171
4560B0056j134j1838o10J294q595n410O606J3563K828m862o508k827Q874Q146
4546A9583p161l335l720j2113j0535K808j845k002R6O556R301P91j0063R079M295
4531A735L028K677K990n673p930R55M397k395q782p413K294J0747K616m900L087
4516b567N043p5L78r547k067m182Q020k156j761q1J0301l025n580M412n77N141
4500A677r20P02o682j69J0160q598j2532J5123N716k864p474K014J967L098P996
$$ plain form
4606 -7896 -6844 -5040 -2183 -4033 -15768 -14352 -11015 -12789 -7481 -5089 -8737 -8622 -5386 -2723 1448
4591 1448 12619 17333 9410 5034 1472 2448 4339 907 -6614 -6165 -13793 -20038 -24579 -19568 -10707
4576 -10707 -14505 -7782 -8829 -8263 -6012 -6765 -12694 -11044 -3999 3405 3576 3394 4500 1621 4885 20056
4560 20056 18922 7084 6474 7768 -827 -6237 369 13932 16760 11898 5390 2563 11437 19583
4546 19583 12422 9087 5367 -6746 -17281 -14473 -16318 -18320 -18224 -11668 -2367 -1576 -11639 -2560 1735
4531 1735 4763 7440 10430 4757 -3173 -2218 2179 -216 -8998 -16411 -14117 -3370 -754 -5654 -2567
4516 -2567 2476 2401 2779 -6768 -8835 -13017 -4997 -7153 -8914 -8995 1306 -1719 -7299 -2887 -3464 1677
4500 1677 757 1459 -5223 -5392 4768 -3830 -16362 -1239 4477 1613 -5861 -3847 -1880 1218 9214
4485I214m590o850R97j858J781O003N47k509k8467n299Q052J3652J0613O451m570
4470C167J002K336o81j1626O109N732K708r48Q69j049p840J012q436Q03m948J713
4454a0077L091l328l34Q64L07K183l050K71l2l63k561M334Q956k610o58L318O375
4437F686k433k180m540p403p588L818O934K041P478M75r771j5021J507P509o20
4422a3108J236P606K535M442N387P564k045j1779q691L594L056J966k265k4M690
4407D164p803j5585J61Q990M422n304l465N294J4206K996j1379R604M516Q491
4393A9308q09r403o841q9l66p461k191M969l216J1411J850n054l108o00J928l761
4377c433K21L713J870J796O414j0091k702J5377N368j3399m184M485J803N774
$$ plain form
4485 9214 4624 -2226 -1229 -3087 -1306 4697 5244 2735 -25732 -31031 -22979 -9327 1286 7737 3167
4470 3167 4169 6505 5824 -5802 307 6039 8747 7799 8668 7619 -221 791 -7645 -6842 -11790 -10077
4454 -10077 -6986 -10314 -10648 -9784 -9477 -7294 -10344 -10073 -10105 -10468 -13029 -8695 261 -2349 -3007 311 6686
4437 6686 4253 2073 -2467 -9870 -17458 -13640 -6706 -4665 2813 3288 -6483 -21504 -19997 -12488 -13108
4422 -13108 -11872 -4266 -1731 2711 8098 15662 13617 1838 -6853 -3259 -203 1763 -502 -526 4164
4407 4164 -3639 -19224 -19063 -10073 -5651 -10955 -14420 -9126 5080 8076 -3303 6301 10817 19308
4393 19308 18499 9096 2255 2166 1800 -5661 -7852 -2883 -6099 5312 7162 2108 -1000 -1600 328 -3433
4377 -3433 -3212 501 2371 4167 10581 490 -2212 13165 18533 5134 950 5435 7238 13012
4363A3012K800p29m332j1681n227p02N983n22p364O369L462j92O679N662n817
4348G401p789J061K649m17K349q7J73P048J725L076N902q170j1789N957O546m97
4332A5138j0699p122q371K298L204j716j489K597l509J667L657K473k525J2263
4318G866L06o716j0185J305L147R343l416p118J355n868N735M56j24K002P208
4303E296L361K399j5688j2674J3856J0649j461k914K364k469O57J362L731l504
4289D965o779r673J313Q048J185N687J563j2836n417J1629N794p312j909r98k095
4274f835k945L725P182N819M67r14J24L574o009o291m011K92j528J4260q138j059
4258b287N111l575k343J2935q19j0376Q51o585k297N713P959m302j826O60L014
$$ plain form
4363 13012 15812 15083 10751 -930 -6157 -6859 -876 -1398 -8762 -2393 1069 877 7556 13218 7401
4348 7401 -388 673 3322 2905 5254 5167 5340 12388 14113 17189 23091 14921 3132 9089 15635 15138
4332 15138 4439 -2683 -11054 -8756 -5552 -7268 -8757 -6160 -9669 -8002 -4345 -1872 -4397 7866
4318 7866 8172 1456 -8729 -7424 -4277 5066 1650 -5468 -4113 -9981 -4246 -3790 -3914 -1912 5296
4303 5296 8657 11056 -4632 -17306 -3450 7199 5738 2824 5188 2719 3376 4738 8469 4965
4289 4965 -1814 -11487 -10174 -2126 -941 4746 6309 -6527 -11944 -315 5479 -1833 -3742 -4740 -6835
4274 -6835 -9780 -6055 1127 6946 7413 6499 6623 10197 4188 -2103 -6114 -5822 -7350 6910 -1228 -2287
4258 -2287 2824 -751 -3094 9841 9022 -1354 -503 -7088 -9385 -3672 4287 -15 -1841 -1181 1833
4243A833l408r450P145Q529O321k145o651m931o507P686J4146J3124l080j1454
4229A1158r787r22m859N28j184n430M308K380m423L641O303L157r409R72N473
4214A906k349P238r632L332P111P718k850p135o485q21j551m668J4547J440o48
4199G153m947J419N409n912q288m17J1233j734J237q418j0371j0845N381R229
4185i871l867n994J03Q046k849L923J026N918N923J489J0528m680o290Q328M137
4170A5870q73q134j0347j3793j806l750M127J3703N138k964o004L387Q768j563
4156A759k882o178p732K144L390j974P435N885k353q265j349o051k781O858J1503
4141e91Q61l412N446J6m841o029J497M506J855K108N144q73J55N387l94o921n510
$$ plain form
4243 1833 -1575 -11025 -3880 4649 10970 8825 2174 -2757 -9264 -1578 12568 25692 22612 11158
4229 11158 1371 449 -4410 -3882 -5066 -10496 -6188 -3808 -8231 -4590 1713 4870 -4539 -3567 1906
4214 1906 -443 6795 -2837 495 7606 15324 12474 5339 -1146 -1967 -3518 -8186 6361 7801 7153
4199 7153 2206 3625 9034 3122 -5166 -5583 5650 3916 5153 -3265 -13636 -24481 -19100 -9871
4185 -9871 -13738 -19732 -19629 -11583 -14432 -10509 -9483 -3565 2358 3847 14375 9695 3405 11733 15870
4170 15870 14997 6863 -3484 -17277 -19083 -22833 -18706 -5003 135 -2829 -8833 -5446 3322 1759
4156 1759 -1123 -7301 -15033 -12889 -9499 -11473 -4038 1847 -506 -8771 -10120 -16171 -18952 -12094 -591
4141 -591 270 -3142 2304 2320 -2521 -8550 -7053 -2547 -692 1416 6560 5687 5842 11229 10835 3914 -1596
4124a596r928N740Q833o866o59O826K742M436m514k048k071q901J010K598j461
4109e859O669J635M334J920p113n442n024N95M272L373K859K597j085j0875o405
4094a3549N790J0486Q636L430p321n054P98l415M432m595n146O622J547J483p952
4079c808m925p442L555L408J1582P857J099j4998j2577m538L265P269R863J845
4065A455o560j0924j0258J0490J0681P023n845k890j565R05M047P394k682k2O545
4050G794J760J01L966O886j6755o361n610l183J2826Q333l235p526r385M416M435
4035a538P192l0m089q74r462l196O636L726N035N747L233L835j931p011O374k827
4019A0820j5376j445R555P208L555R55j277q17q075j1388m248P68L539N211J907
$$ plain form
4124 -1596 -11524 -5784 3049 -3817 -4476 2350 5092 9528 5014 2966 895 -8006 -6996 -4398 -5859
4109 -5859 810 2445 6779 8699 1586 -3856 -8880 -8285 -4013 -640 2219 4816 3731 -7144 -13549
4094 -13549 -7759 2727 11363 14793 7472 2418 3216 -199 4233 -362 -5508 1114 2661 4144 -3808
4079 -3808 -8733 -16175 -12620 -9212 2370 10227 11326 -3672 -16249 -20787 -17522 -10253 -390 1455
4065 1455 -5105 -16029 -26287 -15797 -5116 1907 -3938 -6828 -8393 -7488 -3441 3953 1271 1249 7794
4050 7794 9554 9655 13621 20507 3752 -2609 -8219 -11402 1424 9757 6522 -1004 -10389 -5973 -1538
4035 -1538 5654 5624 1535 661 -8801 -11997 -5361 -1635 3400 9147 12380 16215 14284 7273 13647 10820
4019 10820 -4556 -6001 3554 10762 14317 15272 13995 13178 5103 -6285 -10533 -9765 -6226 -1015 892
4004H92o004p540N647J3657K057m823m536Q439M179L278L714l829j0891p225l58
3989c343P563N921L314K503l546j8476l580O441N166l286l661l356k184O601R726
3974E803o320L59j284m438j496N974L442l629o64m212O568N242j2290L756L179
3959a0l086K766L822M648n028q682o426L297L912k602J748k848K668N905K303
3944B387Q648j1991j3140o62k404n577l838Q861L428P093j406j1912l358Q042
3930a5829O04P705L090Q74M653M797J554j981p854o998J564J576N353n470j0588
3915a6950j35J0390P03m614j564N19O968J2818q88k961Q132j755q893j0345K901
3900e674J968r26J0198k272j228K604P895K575n019M444M135j378n799j6110l150
$$ plain form
4004 892 -5112 -12652 -7005 6652 8709 3886 -650 7789 11968 15246 18960 15131 4240 -2985 -3343
3989 -3343 4220 10141 13455 15958 12412 -6064 -9644 -3203 1963 -1323 -4984 -8340 -10524 -3923 5803
3974 5803 -517 -158 -1442 -5880 -7376 -1402 2040 -1589 -2253 -6465 103 5345 -6945 -3189 -10
3959 -10 -3096 -330 3492 8140 3112 -5570 -11996 -8699 -4787 -7389 -5641 -8489 -5821 84 2387
3944 2387 11035 -956 -14096 -14758 -17162 -22739 -26577 -17716 -14288 -7195 -8601 -20513 -23871 -15829
3930 -15829 -15225 -7520 -4430 -3556 1097 5894 7448 5467 -2387 -9385 -7821 -6245 -892 -6362 -16950
3915 -16950 -17085 -6695 -5992 -10606 -12170 -11651 -4683 8135 7247 4286 12418 10663 1770 -8575 -5674
3900 -5674 -3706 -4632 5566 3294 2066 4670 12565 15140 10121 14565 18700 17322 11523 -4587 -7737
3885g737p908l18M521M594J4164N737m312N699J113k435k669k322J124j452j147
3870F652O140j0948p738J047Q779R269n22j1687j422j755o053k954k18J753O522
3855c135j575o15K925Q893J1883p216j0345j1913J686J244m996Q729M6k902q857
3840a6148J0743p058n596L203J182K462J0281j0184m286R437R869r351m107R652
3826I9R782m399n011l067K637Q761m056j0124M36Q312N829R06L747j584q358p797
3810c887q615R978P996j04P392k280j0429k586N92L297n996O763J105p320m49
3795d543J032O800Q233m33j5885L040O713L16m922J618K998n891Q64N295n98j587
3779C050K526N486K90l433O939P062K034m195J83m410r063n866j123K121o939
$$ plain form
3885 -7737 -15645 -15963 -11442 -6848 7316 13053 8741 14440 15553 13118 10449 8127 9251 7799 6652
3870 6652 12792 1844 -5894 -4847 3932 13201 12679 992 -430 -2185 -8238 -11192 -11410 -9657 -3135
3855 -3135 -4710 -5325 -2400 6493 18376 11160 815 -11098 -9412 -8168 -13164 -4435 -4389 -7291 -16148
3840 -16148 -5405 -12463 -18059 -14856 -13674 -11212 -931 -11115 -15401 -5964 3905 -5446 -9553 99
3826 99 9881 5482 471 -2596 41 8802 4746 -5378 -4942 3370 9199 10105 13852 12268 3910 -3887
3810 -3887 -12502 -2524 5472 5368 12760 10480 51 -2535 -1943 1354 -4642 2121 3226 -4094 -4543
3795 -4543 -3511 3289 11522 11089 -4796 -1756 4957 5273 351 1969 4967 -924 -60 5235 4637 3050
3779 3050 5576 11062 11352 7919 14858 21920 23954 19759 19942 15532 6469 603 -520 1601 -5338
3764e338j528L774L557j267r540n123J824N807R875R179R166p484j5090l686P414
3749A540Q254P531n855J236l290p893l941P937m054j1568M735m61N099N122j143
3734C249m413p842n917p70J1729M284o651Q99J637J200N030n485M365P982n38
3719H759m463L107J2206m411l029M3j0925k699j928n694N380J0195K172K823r964
3704A572m346j7043q186J5393R937m785J28k833Q688J5611m798k653k159n617
3690a091K273l021o09n049Q484J2200L69j1581j4137r907l461j604J1856K817
3676a2461M106J1684J592k817m792L922m046m728k594N499N621O102L055K470
3662A2613m278p974O061R724j78j4731m548k186n874L477J369j979R41m131P712
$$ plain form
3764 -5338 -6866 -3092 465 -802 -10342 -15465 -13641 -7834 2041 11220 20386 12902 -2188 -5874 1540
3749 1540 9794 17325 11470 12706 9416 1523 -2418 5519 1465 -10103 -5368 -5829 -730 4392 3249
3734 3249 -1164 -9006 -14923 -15693 -3964 320 -6331 -5432 -3795 -2595 2435 -3050 1315 9297 8759
3719 8759 4296 7403 19609 15198 12169 12212 1287 -1412 -3340 -9034 -3654 6541 8713 11536 1572
3704 1572 -2774 -19817 -28003 -12610 -2673 -7458 -7330 -10163 -1475 14136 9338 6685 4526 -1091
3690 -1091 1182 -1839 -2448 -7497 987 13187 13556 1975 -12162 -22069 -25530 -27134 -15278 -12461
3676 -12461 -8355 3329 4921 2104 -2688 1234 -2812 -7540 -10134 -4635 986 7088 10143 12613
3662 12613 8335 361 6422 16146 15968 1237 -3311 -5497 -11371 -7894 -6525 -8504 -7563 -11694 -3982
3647c982j168l352M976k10j154m326m733N553P442L383L343m755j2812K888P613
3632a294j482o3J748l158p86O763K81J5191m865j0206k388j1381M153j663P607
3617a543k728j3668K611P639K409l874R718k006K706P507N399l752j0690K587
3603B315M528k675m259p93J736Q89p157O370L035K673K169j2282o134k31M57O160
3587c199P700n457j6296J696l145j729j994K991J5738j005j537R80l320L698k178
3572g057o794r57O703L967m885O838R631k065q019n001Q013P354K628j226p958
3557A172j352j01n623K453k849Q392L030q292m242J158m473k457n236k440J620
3542a9240J0454J1115J0783q303j0209j2953l626J5466Q528j634M035q78K868
$$ plain form
3647 -3982 -5150 -8502 -3526 -3736 -4890 -9216 -13949 -8396 -954 2429 5772 1017 -11795 -8907 -1294
3632 -1294 -2776 -2839 -1091 -4249 -5035 1728 2009 17200 12335 2129 -259 -11640 -7487 -9150 -1543
3617 -1543 -4271 -17939 -15328 -7689 -5280 -9154 564 -1442 1264 8771 14170 10418 -272 2315
3603 2315 6843 4168 -91 -884 852 1741 -5416 954 3989 6662 8831 -3451 -9585 -9816 -9359 -3199
3587 -3199 4501 -956 -17252 -15556 -18701 -20430 -22424 -19433 -3695 -4700 -6237 -5257 -8577 -4879 -7057
3572 -7057 -13851 -14808 -8105 -4138 -9023 -2185 7446 5381 -2638 -7639 374 7728 10356 9130 1172
3557 1172 -180 -281 -5904 -3451 -6300 2092 5122 -3170 -7412 -6254 -10727 -13184 -18420 -20860 -19240
3542 -19240 -8786 2329 13112 4809 -5400 -18353 -21979 -6513 2015 381 4416 3538 6406
3529F406o728q756R616L926j545J173J993L374p233k077l476R230J2310O902j0167
3514A4948o026j3318j315J813m088M778Q687O108p476m300L133q5P888K351p752
3499E346M268K602k058p927K630j778o380j122r849Q035qm542j647j163L517o221
3483a6297m99L06n246J014N773n781n298J6847J5621K708N098j1427j2680k254
3469a2115L745Q181R483P19n987p680J2604M955j822m271m437O208k54L309j8493
3454e855n796J725N240M187j809K105j4159o016R073M389q767L253J8197O467
3440A2234j1216l036l374L974m453l650J719N29Q3j412r72l15q25N78l609K943
3424a0802p398N990J1356k867r88l81p325J048J804K160K254p0m771j754L696
$$ plain form
3529 6406 -322 -9078 538 4464 2919 4092 6085 9459 2226 149 -3327 5903 18213 25115 14948
3514 14948 8922 -4396 -5711 -3898 -7986 -3208 5479 11587 4111 -189 2944 2859 10747 13098 5346
3499 5346 9614 12216 10158 2231 4861 3083 -3297 -4419 -14268 -6233 -6241 -10783 -12430 -13593 -10076 -16297
3483 -16297 -16796 -16490 -21736 -20722 -14949 -20730 -26028 -9181 6440 9148 14246 2819 -9861 -12115
3469 -12115 -8370 -189 9294 10013 4026 -3654 8950 13905 12083 7812 3375 9583 9329 12638 -5855
3454 -5855 -11651 -9926 -4686 -499 -2308 -203 -14362 -20378 -11305 -6916 -15683 -12430 5767 12234
3440 12234 1018 -2018 -5392 -1418 -5871 -9521 -7802 -7273 -7190 -8602 -9574 -9889 -10714 -10136 -13745 -10802
3424 -10802 -18200 -12210 -854 -3721 -4709 -5090 -12415 -11367 -9563 -7403 -5149 -5219 -9990 -11744 -8048
3409h048R230L305k462l698n288J051J295J606L443P275r746j0214p674L466J4332
3394b127O077o455o796j1316K449P047J1362K62j0715j2560r286J0617R395j727
3380a3773k372Q466N130j520n004q821m342O05J4860M471k300P883N838q496p066
3365f441K020J0331l349j0448j3528J191N631O542O459k916N880M80j2686J344
3351i490N616O138J188J907M643j602n179k664j075o726j2075l50k12R386M077
3336f418m638J2920J0496P425p72l071j2335r111K76L891L07O831P016j4738m788
3321f709m410M314L373L498n800n725L624L331L510L788J850M138j0757n095L731
3306c339k890l5M343N850K038O096k29j2066r4J865q426J526n814n511m804J6798
$$ plain form
3409 -8048 1182 4487 2025 -1673 -6961 -5910 -4615 -3009 434 7709 -2037 -12251 -19925 -16459 -2127
3394 -2127 3950 -2505 -9301 -20617 -18168 -11121 241 503 -10212 -22772 -32058 -21441 -12046 -13773
3380 -13773 -16145 -7679 -2549 -4069 -9073 -17894 -22236 -21631 -6771 -2300 -4600 3283 9121 625 -6441
3365 -6441 -4421 5910 2561 -7887 -21415 -20224 -14593 -8051 -1592 -4508 1372 1852 -10834 -9490
3351 -9490 -3874 2264 3452 5359 10002 8400 3221 557 -518 -7244 -19319 -19669 -19881 -10495 -6418
3336 -6418 -11056 1864 12360 19785 19013 15942 3607 -5504 -5228 -1337 -1030 5801 12817 -1921 -6709
3321 -6709 -11119 -6805 -3432 66 -5734 -11459 -7835 -4504 -994 2794 4644 8782 -1975 -7070 -3339
3306 -3339 -6229 -6264 -1921 3929 5967 12063 11834 -232 -326 1539 -6887 -5361 -11175 -16686 -21490 -4692
3290d692Q022J839J1619P908l998q929n222q065K176K063M831K582o77j804k495
3275E158R552n019k152M95m91O870n94m706J567p089K503m039M371m493l754M505
3259B684K040M881q844J618M523J965k599Q68n854K774j411J7571L251m694l181
3244A5592q241m050N472K224o30N568m243n197J1495j841n964n372K057K949J759
3229A1578K556n784k196K798p630k298M085L400Q192k999n407j193P204J521m283
3214I544k379n394j293O382K123m762q16L848q766p653J344J2962Q780n399n409
3199C112l849R990J3603o44r495m318P510N715j1339q016l445p920o505J1671
3185c930R448J245m663o61N766L59L647n726l851j0379Q590N527j984r643N730
$$ plain form
3290 -4692 3330 5169 16788 24696 20698 11769 6547 -1518 658 2721 7552 10134 9457 7653 5158
3275 5158 14710 9691 7539 8034 7543 14413 13819 9113 10680 3591 6094 2055 6426 1933 -1821 2684
3259 2684 4724 9605 761 2379 6902 8867 6268 7136 1282 4056 2645 20216 23467 18773 15592
3244 15592 7351 3301 8773 10997 10367 15935 11692 6495 17990 16149 10185 4813 6870 9819 11578
3229 11578 14134 8350 6154 8952 1322 -976 3109 6509 14701 11702 6295 5102 12306 13827 9544
3214 9544 7165 1771 478 6860 8983 4221 3405 7253 -1513 -9166 -7822 5140 13920 8521 3112
3199 3112 -737 9253 22856 22212 12717 8399 15909 21624 10285 2269 -1176 -9096 -15601 -3930
3185 -3930 5518 6763 2100 1439 7205 7564 11211 5485 1634 -8745 -155 5372 3388 -6255 -525
3170e25O517L439j913j3477o995l813l593N963R022J1888J491k098j403r666o058
3155a1221k750o607j431K671O750L986j400l713Q2K335l425K979P490P975N30
3140D251K613P835l141j1558n52Q78K71N858j376J0537J002l946m789K50l229
3125D904j2260j7697p531N488M523N023J0663M382O104J1192l597o575n513o061
3111f955j082P199N286L303J107j3728p917N24O658J1481J264L406m325k235p330
3096c344m465j025L808j967M647L622K144O220n245j5472l376Q598J0347R695
3082A4187o37n397m037L700j280l854k410J961M069j905N08j760j885L778o351
3067a313m254m819n416o244J0823J0100m757l654K815k54m230k914L710j855Q266
$$ plain form
3170 -525 5992 9431 7518 -5959 -12954 -16767 -20360 -14397 -5375 6513 8004 5906 4503 -5163 -11221
3155 -11221 -13971 -20578 -22009 -19338 -12588 -8602 -10002 -13715 -13633 -11298 -14723 -11744 -4254 3721 4251
3140 4251 6864 14699 11558 0 -552 326 597 6455 5079 15616 16618 12672 7883 8133 4904
3125 4904 -7356 -25053 -32584 -27096 -22573 -17550 -6887 -2505 3599 14791 11194 4619 -894 -6955
3111 -6955 -8037 -838 4448 7751 8858 -4870 -12787 -12263 -5605 5876 7140 10546 6221 3986 -3344
3096 -3344 -7809 -8834 -5026 -6993 -2346 1276 3420 9640 4395 -11077 -14453 -5855 4492 14187
3082 14187 13550 8153 4116 7816 6536 2682 272 2233 6302 4397 4905 3145 1260 5038 -1313
3067 -1313 -5567 -10386 -15802 -22046 -11223 -1123 -5880 -9534 -6719 -6973 -11203 -14117 -10407 -12262 -3996
3052c996j0083J45J3684J0725j74j4927r451l880q70P779L710O492J2217L977
3038A5348p924j5121k066L605j100n418P841J6715p403P329O13j0201Q06M251
3024G275N264J859p26l948n331K51j6082n434J0999P500k827m931m560N23O32
3009i536M242L719p28K409j875l853M448j1275K725J0673R969Q694j0647p941
2995A024J9N354m313q015L676N847M155N543l85N26J4401m20l942o775j1381j1757
2979f443L258Q649N53k504m338k481j941j176J0151L914M226j301o136m397q163
2964h129M205J071P144l456k002J936L517j0707l581Q78J1296j290o460K871N043
2949B336j2737l470K555M078j106Q895J1722q6j0049K048l756O64L307O25k924
$$ plain form
3052 -3996 -14079 -13934 -250 10475 10301 -4626 -14077 -17957 -18827 -11048 -7338 -846 11371 15348
3038 15348 7424 -7697 -9763 -6158 -7258 -12676 -4835 11880 4477 11806 12419 2218 3024 7275
3024 7275 12539 14398 13672 9724 4393 4644 -11438 -16872 -5873 1627 -1200 -6131 -10691 -10168 -9536
3009 -9536 -5294 -1575 -2303 106 -1769 -5622 -1174 -12449 -9724 949 10918 19612 8965 1024
2995 1024 1043 6397 2084 -5931 -2255 3592 7747 13290 12905 13431 27832 27412 23470 16695 5314 -6443
2979 -6443 -3185 5464 6017 3513 -825 -3306 -5247 -6423 3728 7642 11868 10567 4431 34 -8129
2964 -8129 -3924 -2853 4291 835 -1167 769 4286 -6421 -10002 -9124 2172 882 -5578 -2707 2336
2949 2336 -10401 -13871 -11316 -7238 -8344 551 12273 12187 2138 4186 430 1094 4401 5026 2102
2934B102m190m030N853K91k741l639P442j940J960L523l124L966J449p325o559
2919f962K425M043J434L388O241K414l81q136l577N376j3681M5P761r569K17L061
2903e901P205n535N6k248O892K352J076n385j828J908o125K528M264M388L1p885
2887d207n080p28J768M171j56l25k02M846M636m966m743r719n237Q813L985O265
2871h79j2557m303L802P161n616O755J3577l374l413O280n034n252J805K735j3349
2856a1662j133M311k337M336P550L645n703R74k776M801R975M40J676l175j2835
2841a913m876R286j225o119l928o29Q292J585L458l645N539l480K278k843o643
2826d863L065L715l251J438L747R112p94r658j3172Q223N914n535M371R197m901
$$ plain form
2934 2102 -2088 -6118 -265 26 -2715 -6354 1088 -852 1108 4631 1507 5473 6922 -403 -6962
2919 -6962 -4537 -494 940 4328 10569 12983 12602 4466 889 6265 -7416 -7371 390 -9179 -8962 -5901
2903 -5901 1304 -4231 -4175 -6423 469 2821 3897 -1488 -3316 -1408 -7533 -5005 -741 3647 3678 -4207
2887 -4207 -9287 -10015 -8247 -4076 -4232 -4557 -4759 87 4723 -243 -4986 -14705 -19942 -11129 -7144 -879
2871 -879 -13436 -17739 -13937 -6776 -12392 -5637 7940 4566 1153 7433 2399 -2853 -1048 1687 -11662
2856 -11662 -12795 -8484 -10821 -6485 1065 4710 -993 -19 -2795 2006 11981 12421 14097 10922 -1913
2841 -1913 -6789 2497 1272 -4847 -8775 -9404 -1112 473 3931 286 5825 2345 4623 1780 -4863
2826 -4863 -1798 1917 -1334 104 3851 12963 12169 2511 -10661 -2438 3476 -2059 2312 11509 6608
2811F608k379r341j668K493l155o181M079M854P31m322O682M317J724j052l405
2796a5N96j536o832l908l48N532R514M096o387j62K985j848K412M330N85p88L659
2779A1885q952o156L423p278L310O709L951J0543n211O62l391o067j36q409k429
2764g546N590q849l936J1971O378L631n069n26o401q258p147N556O699k056n176
2749a5139P820N323n413J329k869O34P309J1532J121L916m232J905L310R54j2623
2734D877j4661K198J437M452o773J055o503n562R873o064k588J0474K332N172
2720b81N308P978k765j1218k799N795J953j760n966q18r336K483k500l745m167
2705b1838K189J0530P395K384l758q40o704k446j171O313J862O12l158J5l56Q044
$$ plain form
2811 6608 4229 -5112 -6780 -4287 -7442 -13623 -9544 -4690 -3959 -8281 -1599 2718 4442 3390 -15
2796 -15 581 -955 -7787 -11695 -12043 -6511 3003 7099 712 550 3535 1687 4099 8429 9014 8226 11885
2779 11885 2933 -3223 200 -7078 -3768 2941 6892 17435 12224 12886 9495 3428 3292 -5117 -7546
2764 -7546 -1956 -10805 -14741 -2770 3608 7239 2170 1644 -4757 -13015 -20162 -14606 -7907 -9963 -15139
2749 -15139 -7319 -1996 -7409 -6080 -8949 -8315 -1006 10526 11647 15563 11331 13236 16546 17500 4877
2734 4877 -9784 -7586 -6149 -1697 -8470 -7415 -13918 -19480 -9607 -15671 -18259 -7785 -5453 -281
2720 -281 5027 13005 10240 -978 -3777 2018 3971 2211 -3755 -4573 -13909 -11426 -13926 -17671 -21838
2705 -21838 -19649 -9119 -1724 660 -3098 -3938 -10642 -13088 -14259 -7946 -6084 -5472 -8630 -8615 -8971 -927
2689i27Q734o257k125P19m932p469M641k32L189R249J0450K20m199N238j0290
2674F009p412n584p34R409L067M060k778m175p064J668Q792q918n136Q067J879
2659A150J774M854J489k776L653m309j0126m949q929K940N260O838P812q71j1800
2644g990n973N687J2868M201K302l211M70J448m747j5180l176N558O839J1483
2630A0579q908N88l863o883K928m996m899J225M935J66J0953P537p931%J0320
2615A1751k57o246j5475o431M262J850P303n415q69J569j452M015J2540n367J795
2600C573L768k644p394K778L814o685L62K646o101q17J7l875J836J0104O34j305
2584G11J679R289m78M592M987m017n049N779L821p471j0551q191m806k894M873
$$ plain form
2689 -927 7807 1550 -575 144 -4788 -12257 -7616 -7848 -4659 4590 15040 15260 11061 16299 6009
2674 6009 -1403 -6987 -7721 1688 4755 8815 6037 1862 -5202 -3534 5258 -3660 -8796 -729 1150
2659 1150 2924 7778 9267 6491 10144 5835 -4291 -9240 -18169 -15229 -9969 -3131 4681 3810 -7990
2644 -7990 -13963 -8276 4592 8793 11095 7884 8354 9802 5055 -10125 -13301 -7743 -904 10579
2630 10579 1671 2259 -1604 -8487 -5559 -10555 -15454 -14229 -9294 -9128 1825 9362 1431 1431 11751
2615 11751 11494 5248 -10227 -16658 -12396 -10546 -3243 -8658 -9527 -7958 -9410 -5395 7145 1778 3573
2600 3573 7341 4697 -2697 81 3895 -2790 -2428 218 -5883 -6700 -6683 -10558 -8722 1382 2016 711
2584 711 2390 11679 11201 15793 20780 16763 11714 17493 21314 13843 3292 -4899 -9705 -12599 -7726
2569g726M616m101m213N996L716j2963j841R752Q175J422J783o06N31O46p140
2554a953P419l229l770L257o40k902n785M81O615M405j0156j371m862K899J2339
2539B747K087q12L422M350j26r171l557L717n233J707J16p365q230M294J07J430
2523a0517Q53l208M850Q070Q982J315N552m433j1571r35J3401n071m202j114m77
2508A495M15K955j682j40K476L888M070J793n180K889j657o202J746M45n238r262
2492g189M881n232n332J0091N609l740k079o597K181K738l573j034q710M103M953
2477h930k63J707K85k95J1095J7050q841M73K008j78k297j181n038j791P984M446
2461A6234q328l506k71m584j0144j380J6666K756o967k967j81l725m902J860K866
$$ plain form
2569 -7726 -3110 -7211 -11424 -5428 -1712 -14675 -16516 -6764 1411 2833 4616 4010 4541 5187 -1953
2554 -1953 5466 2237 -1533 1724 1084 -1818 -7603 -7122 -507 3898 -6258 -7629 -12491 -9592 2747
2539 2747 4834 4022 7444 11794 11668 2497 -1060 2657 -2576 -869 -753 -8118 -16348 -12054 -11947 -10517
2523 -10517 -9664 -12872 -8022 48 9030 10345 15897 11464 -107 -1042 12359 7288 3086 1972 1495
2508 1495 1910 4865 3183 3043 5519 9407 13477 15270 10090 12979 11322 5120 6866 7311 2073 -7189
2492 -7189 -2308 -7540 -12872 -2781 2828 -912 -2991 -9588 -7407 -4669 -8242 -9276 -17986 -13883 -8930
2477 -8930 -9193 -7486 -7201 -7496 3599 20649 11808 12281 14289 14111 11814 10633 5595 3804 11788 16234
2461 16234 7906 4400 4129 -455 -10599 -11979 4687 7443 476 -2491 -2672 -6397 -11299 -9439 -6573
2446f573L424m600J356L831J682k615j331J208O723M880L717n607j083N262L38
2431A0612l087n876q492q64n536K046l757J082O801Q828l528J0398o420l023o88
2416a504O520O104p861l237N111n948k604j371J120O36n851l906J652k039l133
2401a6311L503P492K472n077Q13k661K393M668M371j701J0239K618j787L432k195
2386A2269J130K484l498j4009P06o030n276m72o81j81K350O941L486O030J1993
2371A7242l277k657n299r246j1564r790N850J0541R884J939j843l236k627K832
2357a251j0495J967L014n295q179L023m996J1551N107m367N442Q382J1955M354
2343B0212r369q302m538L974r042p934j059L650K771k551N820O660M0M26J636
$$ plain form
2446 -6573 -3149 -7749 -6393 -2562 -880 -3495 -4826 -3618 3105 7985 11702 6095 5012 10274 10612
2431 10612 7525 1649 -6843 -7707 -13243 -11197 -14954 -13872 -7071 1757 -1771 8627 2207 -816 -1504
2416 -1504 5016 11120 3259 22 5133 -815 -3419 -4790 -3670 -3034 -8885 -12791 -11139 -13178 -16311
2401 -16311 -12808 -5316 -2844 -7921 -7108 -9769 -7376 -2708 1663 -38 10201 12819 11032 14464 12269
2386 12269 13399 15883 12385 -1624 -918 -6948 -12224 -12696 -13377 -13558 -11208 -4267 -781 5249 17242
2371 17242 13965 11308 6009 -3237 -14801 -24591 -18741 -8200 1684 3623 1780 -1456 -4083 -1251
2357 -1251 -11746 -9779 -6765 -12060 -20239 -17216 -22212 -10661 -5554 -9921 -4479 3903 15858 20212
2343 20212 10843 2541 -1997 1977 -7065 -14999 -16058 -12408 -9637 -12188 -6368 292 332 758 2394
2328B394N269L481j912n023o055j2629l055J1067J1880m520p849o14J1910N714
2314A0058p705j0617j944p5M175J0174n322l140J540O74M326L991m150o182Q702
2299D505P049l554m311L490m55J977j526o040o094K703L436N172n060o905J4332
2284H719J188j6536J12J276l010J649R313O486N726r76o338P534M034N47m6j0762
2268H916o007k495K770q602r446M190N495P017J5751K833j421o862j539R8n17
$$ plain form
2328 2394 7663 11144 9232 4209 -1846 -14475 -17530 -6463 5417 897 -6952 -7566 4344 10058
2314 10058 2353 -8264 -10208 -10283 -6108 4066 -1256 -4396 -2856 -2182 2144 6135 1985 -4197 4505
2299 4505 11554 8000 3689 7179 6724 8701 7175 1135 -4959 -2256 1180 6352 1292 -5613 8719
2284 8719 9907 -6629 -6517 -5241 -8251 -6602 2711 9197 14923 13947 7609 15143 19177 19724 19678 8916
2268 8916 2909 414 3184 -5418 -14864 -10674 -5179 1838 17589 20422 19001 12139 10600 10698 10181
$$ [...]
##END NTUPLES=NMR SPECTRUM
##END=
