##TITLE=Analysis number 317173
Compound Code sb 01687
Book Reference b
Project Code adrs
Chemist Name stores
##JCAMPDX= 6.0         $$ Bruker NMR JCAMP-DX V2.0
##DATA TYPE= NMR SPECTRUM
##DATA CLASS= NTUPLES
##ORIGIN= Bruker BioSpin GmbH
##OWNER= nmr
$$ XWIN-NMR		Version 3.5
$$ Thu Feb  9 20:46:16 2006 GMT Standard Time (UT+0h)  MAYBRIDGE\nmr@NMR_250MHZ
##.OBSERVE FREQUENCY= 250.131544655141
##.OBSERVE NUCLEUS= ^1H
##.ACQUISITION MODE= SIMULTANEOUS (DQD)
##.ACQUISITION SCHEME= undefined
##.AVERAGES= 16
##.DIGITISER RES= 18
##SPECTROMETER/DATA SYSTEM= dpx250
##.PULSE SEQUENCE= zg30
##.SOLVENT NAME= DMSO
##.SHIFT REFERENCE= (INTERNAL, DMSO, 0, 16.522)
##AUDIT TRAIL= $$ (NUMBER, WHEN, WHO, WHERE, WHAT)
$$ ##TITLE= Audit trail, XWIN-NMR		Version 3.5
$$ ##JCAMPDX= 5.01
$$ ##ORIGIN= Bruker BioSpin GmbH
$$ ##OWNER= nmr
$$ C:\u/data/dgb/nmr/ADRS/15810/pdata/1/auditp.txt
$$ ##AUDIT TRAIL=  $$ (NUMBER, WHEN, WHO, WHERE, WHAT)
(   1,<2006-02-09 20:45:23.60 +000>,<MAYBRIDGE\nmr>,<NMR_250MHZ>,
      <created by zg, POWCHK disabled, PULCHK disabled
       configuration hash MD5:
       84 BC 41 DB A1 6E 1D 46 DA 25 12 A5 C1 ED C5 3A
       data hash MD5: 64K
       91 0C 43 DF 37 C3 53 E1 90 B2 35 DB 0E 72 7F 10>)
(   2,<2006-02-09 20:45:49.89 +000>,<MAYBRIDGE\nmr>,<NMR_250MHZ>,
      <Start of raw data processing
       ef LB = 0.3 FT_mod = 6 PKNL = 1 SI = 32K 
       data hash MD5: 32K
       4B 05 68 D1 37 47 2E B4 A1 79 17 A4 20 28 3A A7>)
(   3,<2006-02-09 20:45:53.80 +000>,<MAYBRIDGE\nmr>,<NMR_250MHZ>,
      <apk 
       data hash MD5: 32K
       B0 2E BD F6 6E BC 24 3F AC EC 59 D3 DB 89 68 95>)
(   4,<2006-02-09 20:45:55.25 +000>,<MAYBRIDGE\nmr>,<NMR_250MHZ>,
      <abs ABSG = 5 
       data hash MD5: 32K
       5A 8A E4 E5 3E 9A 11 38 09 0B 3E B1 AB AA 9E 57>)
$$ ##END=
$$ 
$$ hash MD5
$$ 75 EF A0 68 66 92 B6 0F BF 40 A8 C8 62 B4 B7 F3
##$RELAX= 
##$RELAX= 
##$RELAX= 
##$RELAX= 
##$RELAX= 
##$RELAX= 
##$RELAX= 
$$ Bruker specific parameters
$$ --------------------------
##$DU= <C:\u>
##$EXPNO= 15810
##$NAME= <ADRS>
##$PROCNO= 1
##$TYPE= <nmr>
##$USER= <dgb>
##$AMP= (0..31)
100 100 100 100 100 100 100 100 100 100 100 100 100 100 100 100 100 100 
100 100 100 100 100 100 100 100 100 100 100 100 100 100 
##$AQSEQ= 0
##$AQ_mod= 3
##$AUNM= <au_zg>
##$AUTOPOS= <25 >
##$BF1= 250.13
##$BF2= 250.13
##$BF3= 250.13
##$BF4= 250.13
##$BF5= 500.13
##$BF6= 500.13
##$BF7= 500.13
##$BF8= 500.13
##$BYTORDA= 1
##$CFDGTYP= 0
##$CFRGTYP= 5
##$CHEMSTR= <none>
##$CNST= (0..31)
1 1 145 1 1 1 1 1 1 1 1 1 1 1 1 1 1 1 1 1 1 1 1 1 1 1 1 1 1 1 1 1 
##$CPDPRG= <>
##$CPDPRG1= <>
##$CPDPRG2= <>
##$CPDPRG3= <>
##$CPDPRG4= <mlev>
##$CPDPRG5= <mlev>
##$CPDPRG6= <mlev>
##$CPDPRG7= <mlev>
##$CPDPRG8= <mlev>
##$CPDPRGB= <>
##$CPDPRGT= <>
##$D= (0..31)
0 1 0 0 0 0 0 0 0 0.06 0 0 0 0 0 0 0.0002 0 0 0 0 0 0 0 0 0 0 0 0 0 0 
0 
##$DATE= 1139517920
##$DBL= (0..7)
120 120 120 120 120 120 120 120 
##$DBP= (0..7)
150 150 150 150 150 150 150 150 
##$DBP07= 0
##$DBPNAM0= <>
##$DBPNAM1= <>
$$ [...]
##$SUBNAM7= <"">
##$SUBNAM8= <"">
##$SUBNAM9= <"">
##$SW= 20.6930455092707
##$SWIBOX= (0..15)
0 0 3 0 0 0 0 0 0 0 0 0 0 0 0 0 
##$SW_h= 5175.983436853
##$TD= 65536
##$TD0= 1
##$TE= 294.16
##$TE2= 300
##$TE3= 300
##$TEG= 300
##$TL= (0..7)
0 120 120 120 120 120 120 120 
##$TP= (0..7)
150 150 150 150 150 150 150 150 
##$TP07= 0
##$TPNAME0= <>
##$TPNAME1= <>
##$TPNAME2= <>
##$TPNAME3= <>
##$TPNAME4= <>
##$TPNAME5= <>
##$TPNAME6= <>
##$TPNAME7= <>
##$TPOAL= (0..7)
0.5 0.5 0.5 0.5 0.5 0.5 0.5 0.5 
##$TPOFFS= (0..7)
0 0 0 0 0 0 0 0 
##$TUNHIN= 0
##$TUNHOUT= 0
##$TUNXOUT= 0
##$USERA1= <user>
##$USERA2= <user>
##$USERA3= <user>
##$USERA4= <user>
##$USERA5= <user>
##$V9= 5
##$VALIST= <valist>
##$VCLIST= <CCCCCCCCCCCCCCC>
##$VD= 0
##$VDLIST= <DDDDDDDDDDDDDDD>
##$VPLIST= <PPPPPPPPPPPPPPP>
##$VTLIST= <TTTTTTTTTTTTTTT>
##$WBST= 1024
##$WBSW= 4
##$XGAIN= (0..3)
0 0 0 0 
##$XL= 0
##$YL= 0
##$YMAX_a= 418924
##$YMIN_a= -386030
##$ZGOPTNS= <>
##$ZL1= 120
##$ZL2= 120
##$ZL3= 120
##$ZL4= 120
##$ABSF1= 16.522
##$ABSF2= -4.171173
##$ABSG= 5
##$ABSL= 3
##$ALPHA= 0
##$AQORDER= 0
##$ASSFAC= 0
##$ASSFACI= 0
##$ASSFACX= 0
##$ASSWID= 0
##$AUNMP= <proc_1d>
##$AZFE= 0.1
##$AZFW= 0.1
##$BCFW= 0
##$BC_mod= 0
##$BYTORDP= 0
##$COROFFS= 0
##$CY= 12.5
##$DATMOD= 1
##$DC= 0
##$DFILT= <>
##$DTYPP= 0
##$F1P= 14.0000005364418
##$F2P= -0.99999901652339
##$FCOR= 0.5
##$FTSIZE= 32768
##$FT_mod= 6
##$GAMMA= 0
##$GB= 0
##$INTBC= 1
##$INTSCL= 1
##$ISEN= 128
##$LB= 0.3
##$LEV0= 0
##$LPBIN= 0
##$MAXI= 10000
##$MC2= 0
##$MEAN= 0
##$ME_mod= 0
##$MI= 0
##$NCOEF= 0
##$NC_proc= -3
##$NLEV= 6
##$NOISF1= 0
##$NOISF2= 0
##$NSP= 0
##$NTH_PI= 0
##$NZP= 0
##$OFFSET= 16.522
##$PC= 1
##$PHC0= 88.43159
##$PHC1= 6.287794
##$PH_mod= 1
##$PKNL= yes
##$PPARMOD= 0
##$PSCAL= 4
##$PSIGN= 0
##$REVERSE= no
##$SF= 250.13
##$SI= 32768
##$SIGF1= 0
##$SIGF2= 0
##$SINO= 400
##$SIOLD= 32768
##$SREGLST= <1H.DMSO>
##$SSB= 0
##$STSI= 32768
##$STSR= 0
##$SW_p= 5175.98343685301
##$SYMM= 0
##$S_DEV= 0
##$TDeff= 65536
##$TDoff= 0
##$TI= <Analysis number 999999
Compound Code 99
Book Reference 9
Project Code 9>
##$TILT= no
##$TM1= 0
##$TM2= 0
##$TOPLEV= 0
##$USERP1= <user>
##$USERP2= <user>
##$USERP3= <user>
##$USERP4= <user>
##$USERP5= <user>
##$WDW= 1
##$XDIM= 32768
##$YMAX_p= 357373583
##$YMIN_p= -248440
$$ End of Bruker specific parameters
$$ ---------------------------------
##NTUPLES= NMR SPECTRUM
##VAR_NAME=  FREQUENCY,     SPECTRUM/REAL,   SPECTRUM/IMAG
##SYMBOL=    X,             R,               I
##VAR_TYPE=  INDEPENDENT,   DEPENDENT,       DEPENDENT
##VAR_FORM=  AFFN,          ASDF,            ASDF
##VAR_DIM=   32768,         32768,           32768
##UNITS=     HZ,            ARBITRARY UNITS, ARBITRARY UNITS
##FACTOR=    0.157963299565203, 1,           1
##FIRST=     4132.6476996994, 0,             0
##LAST=      -1043.33573715361, 0,           0
##MIN=       -1043.33573715361, -248440,     0
##MAX=       4132.6476996994, 357373583,     0
$$ Real data points
##PAGE= N=1
##DATA TABLE= (X++(R..R)), XYDATA
$$ [...]
22867 -55706 -52643 -37308 -3342 850 -15519 -12502 -9463 -38988 -57514 -29734 -19026 -11875 -6379
22854 -6379 11495 -5833 -31169 -42303 -39334 -35175 -27942 -19256 -22046 -26641 -35147 -11247 8387
22841 8387 1 -21359 -53240 -38773 -38606 -59013 -44865 -27366 -30820 -11487 -3744 -2076 1875
22828 1875 3403 -8104 -10497 -17198 -20919 -17754 -33955 -57440 -63861 -46202 -47614 -36260 -22777
22815 -22777 -52776 -50227 -51965 -43340 -70861 -70725 -56481 -33812 -24128 -41498 -56715 -82871 -41865
22802 -41865 -16546 -29085 -22084 -17311 -21311 -39428 -47586 -42339 -35851 -6333 -6079 -2687 -3039 20614
22788 20614 8920 1802 7159 1579 -7137 -40763 -28140 1257 29152 19960 7265 -9459 -25048
22775 -25048 -8347 18548 27151 16807 17662 2392 208 -1419 5558 3806 8853 3880 -4478 -5449
22761 -5449 27707 22990 17763 17122 -5131 -2818 851 -5003 -8772 14455 31733 20840 -17491
22748 -17491 -17922 -14688 5974 9851 39078 56493 28418 10727 34514 36088 25192 -6880 -3821
22735 -3821 -12495 -14715 1146 10686 -10819 -6484 21776 21252 -2475 -14613 -34547 -49885 -35812
22722 -35812 -20936 -14027 -6318 -12570 -6919 -5748 -351 3752 8142 25392 9060 -2227 913
22709 913 -4629 4815 33296 21466 -6723 -2176 19756 12912 19985 49552 38653 15230 14333
22696 14333 -508 6677 -4583 -20352 -22546 -22434 -15697 -27423 -39398 -28885 -27272 -43615 -46803
22683 -46803 -18780 20356 8826 -15883 -37599 -69536 -73199 -54321 -27989 -11999 5399 -2026
22671 -2026 145 -14316 -25472 -21194 -10975 -12003 -24163 -53865 -43297 -43970 -42070 -25413 4217
22658 4217 40891 42187 28210 -10115 -14660 1442 -7311 -36775 -14255 1557 -7789 -14297 -25176
22645 -25176 -26464 -1088 34124 22782 13408 4059 -588 -3850 -18950 -33750 -51282 -29647 -13262
22632 -13262 1512 -10186 -16444 -27554 -39534 -26997 -17190 -21226 -40209 -61603 -35228 -14525
22620 -14525 -23404 -20441 -15838 -12364 -9155 -35873 -43692 -31795 -43408 -43448 -50779 -53799 -37467 -10629
22606 -10629 -3966 3393 15236 12839 755 9318 45689 56963 38587 8509 2077 -2714 -17087
22593 -17087 -25998 -41273 -47064 -34809 -50254 -36783 -26821 -52116 -34501 944 24378 23858 -10669
22580 -10669 -9036 -2965 -537 18026 8676 -4535 10581 -79 4679 -9544 -6943 10162 28644
22567 28644 14569 -17750 -33589 -26704 -8329 -1001 1616 -25514 -35946 -15490 -6461 4879
22555 4879 26225 17562 -1478 4668 -5039 -25745 -31811 -21354 -18467 -25918 -20215 -29127 -13442
22542 -13442 -17186 -6604 -1124 19451 28864 16320 35502 41780 26943 22975 27371 42129 34133
22529 34133 39242 31641 27018 3696 11261 15074 8668 -5026 -87 11734 9705 -3132 -3304 -27284
22515 -27284 -32075 -30706 -29416 -6089 12619 365 7340 18152 15820 22246 11617 -9531 6779
22502 6779 3355 -12130 -48014 -62236 -53463 -45795 -50614 -53869 -48817 -42140 -49307 -79585 -97230
22489 -97230 -79521 -47864 -22794 -24298 -9105 -8541 -18240 -22505 4052 -18247 -45748 -46880 -47942
22476 -47942 -26483 -35308 -56085 -33317 -11234 8562 9280 21538 28687 15962 4173 18869
22464 18869 9328 -5157 -27967 -38498 -38948 -14295 -9379 8370 -4264 -31787 -24267 -1583 19375
22451 19375 30960 22383 2712 -25118 -30220 -32344 -30230 -39017 -13049 11540 36207 3973 -24836
22438 -24836 8383 32523 34936 30403 2899 -18624 -19140 -20084 -18353 -17440 7850 25783 26917 12748
22424 12748 -5961 -31414 -38372 -15803 -10976 -14842 -27703 -35209 -31963 -18568 -1438 10066 40807
22411 40807 31251 23284 36196 31682 67780 80101 38298 -777 16364 31543 13791 -6393
22399 -6393 -5778 2894 -20098 -29742 -41298 -64534 -60259 -45577 -29133 -5637 -2913 -8020 -18078
22386 -18078 -47118 -41481 -35542 -6327 2698 -7029 -50609 -81659 -44025 -28185 -51472 -42591 -38026
22373 -38026 -27113 -29490 -21368 -7282 -961 -9029 -2438 -18330 -53294 -54710 -32011 -7823 25484
22360 25484 -4665 -27439 -29394 -28810 -47961 -45576 -44115 -40975 -38185 -29546 -20499 3492 18563
22347 18563 8333 6703 3527 8176 3228 10200 26069 17735 2225 4089 -27046 -57663 -51319
22334 -51319 -40229 -41541 -15696 -9623 -26100 -35297 -20058 -1616 14602 6321 10985 34413 11432
22321 11432 2340 -8142 -45800 -47854 -28701 890 6135 8696 20306 19554 19692 -506 19645
22308 19645 38453 24380 18005 14941 25275 16179 5112 -7745 -9078 -7327 -4411 -24628 -45057
22295 -45057 -42390 -30303 6931 33848 22358 4674 -9453 4821 16967 28187 577 688
22283 688 34962 30924 10310 -3464 21423 33170 55761 60777 36161 3610 -3660 -45784 -59460
22270 -59460 -47068 -35746 -4980 -37546 -64094 -91814 -84318 -62141 -54163 -64739 -41071 -22565
22258 -22565 -2433 -6816 -27821 -6602 -2915 -22079 -32597 -42189 -32805 -20201 -13867 -3291 -6973
22245 -6973 -5894 -19426 -1689 -9757 -15484 4156 -1640 -29980 -45150 -25547 -6140 17660 28735
22232 28735 -17092 -36898 -38577 -39561 -38050 -39398 -26598 -34289 -47823 -50752 -69245 -59997 -47828
22219 -47828 -43994 -20319 -2746 7800 -2280 -1496 -8866 -1905 13124 -5612 -9850 -14435 308
22206 308 4215 -1610 -9004 -2128 -993 10440 14384 10248 8209 19844 18315 4435 56 1018
22192 1018 -21423 -28356 -33158 -30808 -32821 -34132 -21937 -16141 852 -2474 3670 -13676 -3678 -12822
22178 -12822 188 6266 -3638 -29026 -40355 -23248 904 50928 29155 21534 7742 9771
22166 9771 -28563 -31013 -2975 13678 36304 2766 -22348 -27468 -33856 -24590 -26376 -13982 -3298
22153 -3298 -12754 -26626 -13831 6885 35625 33054 11005 -2534 -4720 -21477 -46879 -49284 -11611
22140 -11611 6737 4514 -13478 -15597 19633 26130 19297 -7848 -42129 -61262 -69433 -46940 -28830
22127 -28830 -6548 24867 30755 -5808 -21679 -17124 -35309 -29301 -28741 -31093 -42962 -27782 -12371
22114 -12371 -558 8935 7550 -12180 -35987 -60238 -44754 -36200 -59593 -77620 -61150 -28631
22102 -28631 -3526 -8743 -32712 -51075 -50643 -12369 18575 7077 -6881 -6079 -10549 -16364 -5759
22089 -5759 14291 30640 45173 51197 48918 34643 54054 43998 51911 64205 46688 33816
22077 33816 11008 3858 -5238 -12440 -22833 -11149 -17821 -5114 14186 22726 -1214 -27465 -34687
22064 -34687 -51254 -41008 -29898 -17255 -13562 2289 24502 29431 8714 19782 32116 13032
22052 13032 -33127 -45795 -42100 -29506 -41336 -12188 -7783 -8870 14476 11270 -8026 -9854 -4936
22039 -4936 -10699 -6705 4292 14943 23985 14362 -11701 -10626 -43175 -52873 -18797 16870 8950
22026 8950 1231 -13242 -20898 -17319 -33817 -19404 11450 17130 19355 17893 8687 3719 5577 9902
22012 9902 11006 3283 305 -2117 -8777 18172 27981 33786 14621 14231 3199 5554 36159 28980
21998 28980 6375 14474 29346 17571 8201 16411 39230 35493 26106 -7256 -51705 -62466 -42993
21985 -42993 -19150 -10626 12113 33793 26103 34054 33287 1731 -1451 17639 29890 46572 14933
21972 14933 -1192 10768 5751 -1757 -15586 -28168 -44425 -35120 -24002 -10774 -2046 4505 6591
21959 6591 5994 -25011 -62521 -58465 -61331 -67353 -37179 7093 45265 40332 9762 -37461 -22274
21946 -22274 -24614 -13438 23994 12044 -7123 21859 40063 -5987 -26467 -33473 -23233 7412
21934 7412 32308 5127 28958 49649 43440 47691 20005 3822 -5735 8842 30234 28682 32782
21921 32782 40035 42692 14987 6651 4252 -4111 966 -21296 -23591 -5808 -3946 -32250 -33763
21908 -33763 -15548 -4837 -18036 -26552 -2169 -4186 -1547 1527 20384 2075 8567 -17791 -52051
21895 -52051 -77895 -58609 -25690 -15382 -33945 -27155 -12954 -30368 -37967 2716 -3431 7564
21883 7564 14287 -500 976 -10217 -25686 -31778 -14440 -5739 -8920 -10138 -2117 14378 21302
21870 21302 22968 2711 3319 -5028 19910 14292 3343 -1574 -14869 -918 -14683 -33833 -23569
21857 -23569 12827 13538 7071 -2706 14738 22569 1814 -38252 -33833 -18791 -26925 -14598 -4073
21844 -4073 1997 11649 25573 45124 34402 7946 15366 7833 1443 -11234 -12229 -25514 -37323
21831 -37323 -35736 -41787 -3536 -12156 -21085 -2331 9210 -9151 -4492 -12147 -12584 -712 7435
21818 7435 18646 18937 -3359 13811 18188 7239 10094 15255 2527 -7375 -24692 -28303 3429
21805 3429 9813 8459 -13146 -16476 -3991 8597 31637 20078 -14298 -23099 -30706 -38169 -43566
21792 -43566 -61107 -73607 -74319 -62330 -48405 -31911 -8788 -14811 -18897 -36815 -29858 -19132 -21714
21779 -21714 2378 20948 -1190 -34077 -56095 -55931 -29027 -18949 -16825 -45498 -56494 -45477
21767 -45477 -39982 -20484 26741 15524 25355 14331 -8524 -20404 -39677 -58193 -61423 -30867
21755 -30867 10334 22889 13990 -16437 -16325 3783 -12448 -46186 -59068 -40328 7314 8119 -11551
21742 -11551 15919 32561 23237 36489 47721 5223 -10990 -2375 -11940 -19647 -12836 2657 -6687
21729 -6687 -25996 -37916 -4881 -5235 -17907 -35487 -36471 -9433 -1734 -29837 -7916 -15463 -30170
21716 -30170 -60538 -41466 -21625 13243 9174 -1141 14063 17347 23337 30488 50110 65142
21704 65142 44405 42021 33321 -4326 -38659 -26124 -1362 4540 -4147 -29704 -20071 -12888 -9620
21691 -9620 -4027 8086 15364 20334 -15257 -24754 -10543 -20705 -27772 -40824 -31297 -26818 -2110
21678 -2110 5961 6475 15758 9445 11917 -18030 -39547 -34805 -22451 -19542 -15745 -4395 9330 11740
21664 11740 13151 -455 11856 20743 -9510 -38 -2927 -13803 -7452 -31141 -37379 -13425 11571
21651 11571 27893 21252 23936 15912 15985 26284 28619 1435 -26453 -34877 -16053 -14603 216
21638 216 -13590 -24478 -5549 -13964 -16418 -15142 -15450 -31872 -34881 -53827 -48759 -4803 -8128 -3727
21624 -3727 -6274 1803 7149 -14727 -22812 10589 16722 3535 -447 16616 37667 35573 -3228
21611 -3228 -26773 -25212 -11256 4281 4689 253 2045 5114 21552 22476 -1755 -27351 -28397 4737
21597 4737 19463 -5184 -27774 -62842 -50382 -19091 10126 864 -10331 -4909 -6236 2638 -8474
21584 -8474 11394 42830 25353 -9768 -6878 3127 7410 -6017 -43682 -22647 1771 9331
21572 9331 1659 -17912 -24724 -33434 -5039 14914 10352 -5365 -33696 708 18399 16438 10997
21559 10997 10853 -1752 11720 2820 4623 -7859 -31005 -19468 11203 50750 79408 96205
21547 96205 77814 53321 40428 9251 -2407 28147 43160 39020 20522 10063 -9606 -6136
21535 -6136 -14819 -58396 -52647 -12492 -4326 -34130 -45966 -33984 -16679 -755 -4384 -37666 -47174
21522 -47174 -48668 -48786 -28221 -14140 9768 10528 16430 14853 15744 29141 30426 8979 18133 6295
21508 6295 -6226 15755 13303 2513 379 -26891 -36341 -18583 9217 -13098 -34540 -3750
21496 -3750 13965 12402 19945 -8575 -5799 27416 20980 22575 7019 -5759 -1222 21691 44448
21483 44448 55476 47252 38257 38429 44072 68013 65940 28678 -5335 11862 25803 23909 18297
21470 18297 20131 10656 41434 47979 45001 36477 -328 -17500 3782 21813 15406 -32298 -50725
21457 -50725 -36335 -11681 -5937 -1200 767 20845 12612 -6357 -16669 -16498 -25414 -32561 -28010
21444 -28010 -22322 4717 17871 22558 -11849 -32034 -27738 -24286 -44867 -39250 -37091 -27554 522
21431 522 23956 30488 23013 -3979 -21829 -42021 -41539 -22378 23108 33865 25072 31588 17473
21418 17473 11793 2630 4797 -320 -9437 -27333 -3567 1433 -23340 -7141 -961 -12166 -21450
21405 -21450 -14532 -15522 -11643 2549 -6200 -15413 -11504 -11709 -6109 -16948 -17677 -32721 -44318 -60405
21391 -60405 -44257 -29719 -21438 -38559 -47455 -46542 -11074 1245 8717 27586 5605 -20364 -24995
21378 -24995 -10807 -28325 -53572 -59143 -42589 -35105 -32730 -44956 -42397 -10941 -2643 -15614 -22594
21365 -22594 -6080 1704 -13766 -20101 -13828 -6157 -12203 -21459 -26683 -11405 13188 23170 5804
21352 5804 -30612 -25342 -26393 -32645 -10754 11097 778 -9129 987 8200 4891 23032 3008
21339 3008 8170 -4101 -17420 3040 35472 27728 21588 14858 5543 13629 32559 18115 23911
21326 23911 44680 56446 21881 10829 34630 48018 39173 24721 30346 15483 -15098 -17020
21314 -17020 -21131 7926 20539 -1050 -36811 -18837 13418 3596 -15463 1492 34270 36279
21302 36279 9499 -16544 -4355 15272 13047 5064 -5711 -14009 -12012 26099 23310 43343 52860
21289 52860 35490 21719 18396 2052 4660 993 -17007 -38773 -42782 -19892 -27734 -47463 -50451
21276 -50451 -34707 -16484 -23050 -34638 -35312 -30183 -24821 -24380 -11524 22379 32295 30626 621
21263 621 -18527 -7108 16356 9187 -3002 -26396 -22027 -28386 -27206 -15198 -4230 -8879 6464
21250 6464 20737 13474 576 -4554 6903 5002 19760 40780 40066 37229 37518 20518 -2914
21237 -2914 -11143 11468 29643 34961 61184 42202 24355 16024 11536 8836 1216 17322 24209
21224 24209 15898 -17808 -56021 -43550 -6923 -23135 -22486 -13752 162 9237 14699 7521 14729
21211 14729 17007 26812 60000 66922 33346 21548 25027 38685 49942 41308 9989 -2382 2397
21198 2397 20069 23091 74 -8094 -7694 -18037 8787 14681 33645 35428 15748 -20287 -11058
21185 -11058 -3174 10820 7280 2234 1035 -531 14837 33691 26139 26930 22596 30264 31320 52745
21171 52745 48002 -9244 -27795 -22066 -34310 -37550 -16695 9805 12474 2744 -18409 -12924 10326
21158 10326 -19454 -1832 -5145 -17240 -8449 14130 34825 31616 15505 -14331 -11835 1959
21146 1959 22538 24592 38763 37691 7242 -6808 -4762 6574 2745 -27341 -26335 -29713 -48220
21133 -48220 -34397 17950 34524 10056 15713 -17449 -33033 -20041 -4380 -2337 -2829 17978
21121 17978 56396 48516 22400 3580 7582 2539 624 -18175 -22857 -14808 -479 -1523 19286
21108 19286 18504 15670 21875 -6926 -11758 6209 -5883 -2423 12072 3905 -7121 -25350 -18413
21095 -18413 10642 40261 17439 20547 26060 32690 33689 27026 -10559 -14390 -6915 -5459 -21816
21082 -21816 -22657 -19096 -30879 -25312 -15805 -9128 -12035 -4844 -5175 -18607 -5672 -13823 -40061 -47143
21068 -47143 -32477 3922 12603 -15058 -20276 7718 9641 -3148 -33276 -50800 -66111 -43164
21056 -43164 -37383 -30188 -21373 -21730 5857 29580 51645 16200 -10338 -23537 -24533 -4007 3682
21043 3682 12425 8556 -33116 -26062 -15287 -17029 -23567 -19141 -37740 -34921 -2962 16618 17958
21030 17958 24252 48290 56248 52084 32145 20673 23409 12542 -20143 -25400 -64760 -59055 -22574
21017 -22574 -25230 -18412 -9686 -22403 -12582 1932 1953 1820 -4335 -25449 136 5114 -13571 4331
21003 4331 15647 831 -4682 -7767 -7812 -6877 1467 -18974 -30442 -32071 -40011 -6705 3762 -15405
20989 -15405 -1862 -3454 -4886 -5092 -9897 -6489 -5460 4535 -4529 -37596 -66037 -79930 -49335
20976 -49335 -26132 -20813 -27144 -27919 -30588 -35196 -43905 -52601 -56232 -67114 -65705 -30693 -7174 -5508
20962 -5508 -11271 -4049 12148 -9484 -8646 35657 29383 7559 23621 53735 68964 71487 49577
20949 49577 15469 -6459 -32849 -38484 -33826 -11138 -4695 -3922 16113 2328 -10708 10505 -5734
20936 -5734 -104 27083 33390 23355 19146 19981 12892 20887 21365 14499 20157 -1904 -26126 -17039
20922 -17039 -49915 -84597 -85189 -67681 -33948 -20671 -11590 -24061 -49574 -54140 -55494 -44829 -43145
20909 -43145 -30628 -27538 -38570 -31615 -19487 1726 11589 18317 21205 22916 28664 22705 13248
20896 13248 5085 27176 21079 19340 14694 -578 -13578 13811 6509 -9504 3306 11327 17733
20883 17733 14991 7345 -4875 -9442 -29549 -44618 -15212 -9414 -17955 -17566 -2905 4965 3821
20870 3821 31735 27392 24079 9892 9890 -5852 4089 2299 -13397 -30545 -28315 -36769 -67398 -36205
20856 -36205 -9189 -5546 -5678 -15276 -7436 36651 43767 8245 7742 6805 -13088 -40221 -53422 -23721
20842 -23721 -8153 -8735 -12027 -61967 -101396 -67677 -18331 10614 -8510 -24774 1780 -4536
20830 -4536 -25085 -51619 -20678 13139 21297 -8852 -32196 -34994 -4599 19672 2042 -25089
20818 -25089 -32848 -20958 -28142 -40462 -38620 -37553 -47537 -23782 5544 30608 29084 14425 3906
20805 3906 14269 6607 802 -11270 -24567 -10069 -24893 -45288 -22454 6641 325 -1306 5918
20792 5918 -12807 -12268 -10623 -8146 -11309 -26832 -41710 -30376 -37377 -14872 4911 4723 -14002
20779 -14002 6258 1422 -14053 -8054 -9335 -26399 -53159 -34721 -39403 -13428 7094 27439
20767 27439 19367 3803 -16230 -23389 -36314 -50486 -26819 -4619 -31489 -58300 -26287 -6747
20755 -6747 -16411 -26756 -15329 11474 17973 30954 21217 8970 15790 18345 -4065 8381 -1345
20742 -1345 -20518 -16573 -6316 -13555 3408 26038 25856 10300 -129 -6556 -1691 -1361 24658
20729 24658 32998 41460 48475 24795 -1938 -4887 13087 -1815 -16068 -1802 26204 5586
20717 5586 -20142 -10204 -595 20964 1136 -30221 -32196 -43442 -30355 -40231 -35042 -6526 -4315
20704 -4315 -6258 -14297 -23388 36 -13377 -18172 267 -2935 -22109 -45106 -50738 -56438 -51109
20691 -51109 -60936 -54815 -34079 -25529 -41228 -44423 -13741 13678 15910 8305 458 -3358 1553
20678 1553 -19424 -36629 -51173 -28546 -41714 -43256 -43633 -40999 -13400 -13950 -3983 21094 48135
20665 48135 50589 22688 4867 -16643 -38211 -9077 14771 -15287 -37025 -8672 11699 31042
20653 31042 51966 39765 18012 14136 -5881 -30600 -45393 -14643 15616 8258 15170 28127
20641 28127 19684 -6881 -4780 -7691 -10608 -25958 -2522 -11393 -25354 -32421 -47492 -52780 -63314
20628 -63314 -55834 -23714 -8398 5667 19893 40427 38611 23482 28014 5400 -46734 -59055
20616 -59055 -67195 -54278 -55844 -37874 -15770 -22857 -20272 -6105 -11798 -16768 -22975 -33609 -45759
20603 -45759 -59262 -61710 -32204 -22240 -13721 -31251 -54176 -47883 -38236 -18315 -8573 15406 15030
20590 15030 14600 -10046 -33499 -26083 -3533 -3641 -6086 -3082 -5324 -11730 -12163 -25700 -27562 -29844
20576 -29844 -17161 2327 18041 1341 -649 -2882 -11976 -58727 -73158 -43580 -39862 -38993 -36630
20563 -36630 -36243 -47984 -58283 -38962 -48534 -74734 -55825 -55992 -11639 -15506 -18117 -15679 -5251
20550 -5251 -3424 -16039 -15825 2990 11828 1266 16983 10970 -9432 -19378 -52224 -64548 -31842
20537 -31842 -6192 -12757 -10144 7294 35393 30115 33643 38502 29336 17175 -430 -16469 -23157
20524 -23157 -15243 2911 17950 9877 -22622 -49160 -25526 14967 29420 35227 -9466 -20249
20512 -20249 -10208 -17397 -39688 -38239 -28949 -24731 -19636 -14240 -20587 -34722 -31134 -7802 -195
20499 -195 13972 -3774 8862 19404 13092 32578 6436 -4588 -17139 -22421 -14406 15356 10100
20486 10100 6147 4631 3722 -8934 -15164 -17899 -3872 28986 19517 -12286 -19834 11344 7776
20473 7776 -3478 -795 1264 3048 4193 -8843 -9206 -2460 20344 -578 15320 -5652 -15424
20460 -15424 -2017 9047 9625 -13087 -29583 -35760 -27990 -4162 4590 5393 -3328 12105 9118
20447 9118 12129 14291 1514 17691 15015 -24303 -31046 -14731 -36296 -38420 -23797 -12249 -9453
20434 -9453 4443 -5210 -19337 -25851 -20968 -28812 -19228 12332 12962 -4895 -29936 -19838 1867
20421 1867 -4466 -8025 -12552 -20562 -22571 -44153 -25148 11406 21286 13112 -12964 -30864 -13648
20408 -13648 -17086 -9591 -17652 -11898 -19191 -54568 -37330 -26092 -21296 -30446 -34929 -51230 -53470
20395 -53470 -35456 -30718 -30050 -32913 -18725 -42818 -50711 -35508 -7224 -1623 29633 26965 6976
20382 6976 26154 2328 -19159 -12362 -14703 -22343 -28699 -4144 -95 -5914 -18983 -10704 -24750
20369 -24750 -19111 -5057 -13105 -14105 -2617 17214 12927 19635 25479 32080 23910 5774 -15701
20356 -15701 -8782 2337 24063 32471 -4254 -2172 25737 26683 18683 9766 16054 5991 12076
20343 12076 8060 -7264 -3463 -17712 -24897 -26996 -34909 -33640 4297 7510 -15834 -17087 20154
20330 20154 14271 1752 -511 -14634 -30502 -42694 -35564 -26584 -17007 -2928 -25548 -23659 -24484
20317 -24484 -15317 -32523 -29885 -23184 -4285 -5365 3107 16309 8749 10012 14685 2285 -12408
20304 -12408 2621 -8781 -20977 -26488 -30232 -22535 -18618 -41460 -50449 -21913 2084 -34333 -39927
20291 -39927 -23278 -26267 -32863 -42470 -8981 26993 40566 33575 18579 6362 11149 10167 -22733
20278 -22733 -17623 -9708 -23693 -22066 -26287 -29857 8710 31660 39201 -15263 -43390 -34965 -31140
20265 -31140 -26137 -44480 -48281 -47253 -23869 -13181 -29250 -30643 -21129 -14337 -22294 -11945 11064
20252 11064 30053 45120 28040 12351 -5613 -23723 -6176 -4954 -16756 -33200 -45969 -48402
20240 -48402 -35712 -30103 -38094 -51891 -76273 -55673 -36366 -54762 -53688 -27292 -26219 -9399
20228 -9399 8638 20512 26187 27723 1067 -40456 -34332 -40893 -52690 -48069 -26896 -9236 -7733
20215 -7733 -4883 -3648 23103 51404 56515 36560 30474 28469 -4021 -4008 -12032 -22042 3787 29194
20201 29194 41093 6038 -8105 13312 5373 7015 13311 25682 26107 22344 543 -5953 -12069
20188 -12069 -10567 -7038 -1730 15471 3246 -23762 -12110 -77 -2755 6561 38942 16083 2183
20175 2183 10350 20494 29938 12317 -22170 -23528 -43952 -41097 -9871 -14736 -37813 -21956 -28566
20162 -28566 -27072 -481 -12686 6491 4235 6245 -15397 -36368 -32854 -5106 15300 14226 12233
20149 12233 -5473 -8990 -2343 4961 7054 -2665 -34256 -48881 -38702 -28125 -13774 -24017 -45278
20136 -45278 -41727 -12579 20801 47423 16742 20092 42251 28114 5043 -17165 4442 24107
20124 24107 31523 34662 14859 -15794 -19154 -13950 -29454 -39912 -27745 -2646 -1001 -8761 13585
20111 13585 24395 23154 351 -15407 -34090 -7998 16083 5615 -18304 1484 12792 1657
20099 1657 -29538 -47050 -14441 16493 7013 1536 18168 18276 8140 -13299 -24753 -25474 -36010
20086 -36010 -24963 13896 31275 21489 14231 8860 2250 24031 28999 19263 20866 -464 16469
20073 16469 -4764 -20428 -13996 2174 24970 31254 37556 23219 10642 -2604 16036 35763
20061 35763 19177 -12789 4450 12488 9375 -23854 -54972 -16940 -3881 -14674 -28404 -16589
20049 -16589 -39881 -33324 -45189 -45078 -16954 -15587 -38932 -42517 -12887 -13837 -29004 -52042 -36631
20036 -36631 -42856 1049 17931 -5635 -23849 -39745 -21394 23618 30888 28754 14283 30269
20024 30269 20134 4934 -16251 -19672 -7074 -21295 -12433 -3847 -14350 -26749 -15487 -12253
20012 -12253 -13778 -1513 19635 -1043 -11637 -16134 11583 12750 9244 -9066 -42805 -35290 2634
19999 2634 6849 12044 -1069 7391 3646 -11157 -10071 -15481 -21274 -340 -4395 -33414 -36231 -7167
19985 -7167 -8783 2571 -3601 2726 2268 5719 24073 30642 21513 9031 -27723 -47474 -46315 -25749
19971 -25749 -18133 -5462 -11844 4613 1314 -6482 12466 6632 14523 11592 16367 15537 13119 -7821
19957 -7821 -31908 -71756 -67481 -15992 19490 16100 17660 20120 -9262 -8170 -1271 50470 74676
19944 74676 53385 44122 45635 19302 10756 2154 649 -8695 -30301 -28499 -44175 -56203 -62334
19931 -62334 -50180 -2680 -14767 -38452 -37266 -32112 -32557 -37973 -21587 -6520 14328 1498 -34279
19918 -34279 -39951 -25898 -6350 1104 8244 -8789 -38156 -53931 -23819 -19679 -31787 -32916 -45408
19905 -45408 -52810 -23835 -19686 -12273 -3907 -636 23625 18847 7438 23317 2584 16395 13955
19892 13955 27504 52766 40362 -275 -19843 -4123 30536 57924 44827 14896 -11683 -21475
19880 -21475 -37627 -14419 -29728 -65608 -44318 -14165 -13325 -15269 -9366 -15997 -12067 -12023 -6419 -20518
19866 -20518 -41433 -39053 -41243 -52848 -49402 -54244 -53802 -10438 4696 8562 -23731 -43023 -54266
19853 -54266 -45706 -24743 -976 -4122 -15146 -25331 -12261 -8158 2883 8948 -12737 -8802 -1787
19840 -1787 -6303 -32299 -22635 -26536 -29310 -28962 -23515 -43502 -68164 -90646 -94418 -49508 -22451
19827 -22451 -6671 -33565 -45031 -8861 6262 -7712 -25848 -14606 4445 30746 30567 20735
19815 20735 -1123 -6215 3327 13187 36648 47696 24569 14339 4382 23221 25159 14331 9551
19802 9551 19565 2421 -6101 -3368 -28630 -28984 -10591 6757 22464 21789 -6660 2228 12510
19789 12510 22261 32136 29421 22042 9264 -17039 -16956 -17681 -37704 -28064 2701 35255 50265 36004
19775 36004 26204 9971 14587 25640 17982 -2234 1246 -23033 -30879 -10768 -5724 -4694 11287
19762 11287 24310 7642 -15080 -33244 4808 14077 -16397 -47540 -51816 -63481 -84544 -85998
19750 -85998 -76162 -39170 -13013 -10318 -24240 -21499 -25376 -21606 -31640 -18095 4394 13456 -13653
19737 -13653 -13649 -17255 -7087 -17769 -39907 -11501 10524 8133 -19936 -15099 2476 -18386 -14943
19724 -14943 14510 -4944 4975 -14082 -22160 -48355 -38245 -14297 1873 20158 22120 36503
19712 36503 44219 40462 27992 33698 39146 25805 9930 -9397 -24677 -37558 -30959 -28203 -26363
19699 -26363 -29320 -17327 -20588 -33706 -60736 -41966 -24714 -32996 452 21277 3749 9935
19687 9935 46924 47434 25385 287 5749 2771 -6450 -23217 -23259 -13777 -14884 -22694 -18317 -7725
19673 -7725 -6343 7055 32859 50078 28187 5640 8882 11565 9852 -6112 -5289 -16018 -37589
19660 -37589 -50182 -36816 -18519 7141 25439 51191 56778 29117 10208 33058 20368 -21260
19648 -21260 -35333 -53773 -67248 -70074 -47830 -26974 -25955 -36653 -14544 21951 21558 11692 6918
19635 6918 6925 29282 45550 46210 66318 39389 18420 24206 51900 56966 30444 2083 47078
19622 47078 52849 56417 16958 1488 -5510 18348 14583 8863 19032 35523 38213 2609 -24947
19609 -24947 -36879 -44170 -30052 -13343 5100 17497 24210 13766 28267 10660 -5934 196
19597 196 7926 10968 -13561 -33707 -40286 -34484 -15015 -11813 8118 23474 12703 -59 806
19584 806 7064 5487 -18497 -25990 -17337 -31235 -15369 -8577 -7436 -6336 -27122 -7952 31285
19571 31285 46876 34028 -602 -9469 25309 28846 31093 29066 28006 35669 2618 -40022 -22277
19558 -22277 -5433 15906 33609 31202 8084 -2186 8437 20020 42331 49462 40949 23430
19546 23430 10737 12203 11570 11250 2634 9856 36513 57747 69739 48358 6182 -8228 19849
19533 19849 28760 14543 -5263 -1146 12226 3293 -10942 5566 16864 -7863 -13047 -20822 -44646
19520 -44646 -46849 -49398 -42559 -21645 -13594 -2077 -13595 2911 -6630 -1195 15097 323 -19766
19507 -19766 5001 8861 -19548 -40211 -21243 -9365 -11177 -295 552 -1561 -8830 -19240 -19357
19494 -19357 -13583 -9106 -11363 -13447 -1929 -4979 -27026 -20845 -23657 -19873 -35331 -26985 -9248
19481 -9248 -14114 12308 26543 8953 -3553 5333 -10570 9283 24399 20914 26384 29189 34879
19468 34879 35002 38368 41237 17950 17715 2644 -34875 -32587 -28052 -51884 -24715 384 -6272
19455 -6272 -43696 -40000 -15580 -4311 -23621 -13142 -6499 1953 8525 26102 17800 3566 38827
19442 38827 54234 52559 71998 66592 43519 8303 11160 11890 -8181 -11372 25755 32727 21786
19429 21786 11987 2506 8967 1372 -20870 -11043 3360 6025 7081 4871 19059 16445 -3929
19416 -3929 -20158 -11641 -14941 -2995 -5759 -19769 -37668 -19557 -5417 -6063 7489 3926 3404
19403 3404 -3939 -19220 -34221 -28693 -20639 -10688 -30485 -35850 357 30285 45444 24236 11006
19390 11006 -4850 -15315 -1462 25752 21343 5341 -28354 -30845 -13474 13618 22092 7872
19378 7872 -8282 -6000 -11790 25992 43094 46677 42711 39251 49879 65905 78684 64265 46736
19365 46736 33147 13492 -640 4063 13195 16291 13495 -13452 -35276 -26363 -32889 -37334 -47791
19352 -47791 -51733 -51506 -37422 -15503 -38129 -60720 -49698 -42514 -39558 -38160 -50509 -56509 -55281
19339 -55281 -42437 -25941 7817 11968 -17114 -25154 -27611 -7744 3342 12109 -6831 -14319 -19037
19326 -19037 2018 2465 4500 31944 28230 19438 13117 12024 9515 9845 32741 28369 35508 36581
19312 36581 19343 6764 -4527 5265 -12243 3837 8045 6271 18928 -1125 -7082 -15780 -27016
19299 -27016 -41812 -47576 -29576 -1509 -12710 -14147 -12329 -21219 -38213 -46969 -47538 -47771 -52859 -2794
19285 -2794 47691 18392 -2425 -7118 -7995 975 24378 12813 -15280 -12913 -8732 14158 3609
19272 3609 2756 205 -1998 -29531 -35627 -22771 -47105 -58851 -44661 -18136 3196 -16206 -24684
19259 -24684 -16435 5451 548 -24645 -9700 -2165 -6874 -677 -7906 -26263 -5303 -8437 -35776
19246 -35776 -39275 -22655 -29071 -24094 5041 9783 12397 13436 564 -10073 -4697 -10092 -18854
19233 -18854 -13533 -20296 -400 9285 -22112 -30483 -13240 8260 8282 -9241 -15832 -35888 -28129
19220 -28129 -12828 -1999 2469 15885 33265 8211 -8850 -7210 -10363 1361 1408 23214 35009
19207 35009 38960 34484 31850 23083 25336 26836 39292 31279 4284 -35241 -28830 -16222 -4116
19194 -4116 -8769 -26554 -4798 23665 4123 -21794 -21809 -11991 -4896 -1316 -14398 4159 4650 16885
19180 16885 23229 7479 18678 35088 42796 35588 25583 14517 7336 12499 7149 19409 13993
19167 13993 -17979 -28469 -23457 -2680 -6721 -12452 -12160 -6499 -37597 -36403 16980 15963 -5058
19154 -5058 7039 6344 4744 -4142 -32463 -34409 -15596 15437 14852 -3084 -10925 65 -11589
19141 -11589 -32931 -33814 -27828 -4749 20190 16118 6667 33632 26737 26809 19716 20801 41579 33562
19127 33562 -5402 -29024 -34852 -15133 12736 16225 16657 4772 -12792 -27553 -15177 -3487
19115 -3487 -7406 -3736 -4374 -31631 -28535 -3384 -12717 -32419 -23345 -13128 -1634 -2269 134 -2613
19101 -2613 -17131 -10917 -25774 -25384 -15366 14876 44281 42250 24340 24416 8348 23270 22480 36014
19087 36014 53614 52852 32494 15609 17964 -5732 -13735 -27113 -27742 -10076 11543 2648 21661
19074 21661 8176 -11100 3245 18450 -6062 -10302 -27672 -25768 4251 8566 -1392 15746
19062 15746 32775 7528 19226 25186 17106 16210 -1458 3523 31074 3265 -21007 16207 23511
19049 23511 10766 -10513 -26121 -53131 -46863 -56846 -76042 -57204 -1809 13012 -1510 27952
19037 27952 42662 30703 6115 -24198 -32781 -17937 13145 10736 1689 7078 -10627 -17419 -4675
19024 -4675 16764 17009 12941 20099 45539 45214 38769 3335 -16447 -6584 -6467 -14477 -29981 -36801
19010 -36801 -45535 -59297 -33802 -13369 -20467 -33438 -35544 -27794 -3147 9117 5880 -3718 -1630
18997 -1630 -14911 4905 19047 31541 24965 39815 8463 -36635 -15016 24999 45839 64179
18985 64179 59187 61064 52709 15024 7340 -10366 -33415 -19630 -9157 -14961 -24717 -26254 -31888
18972 -31888 -31528 -18801 -12266 -11464 -15073 -9210 -9250 -18138 -10025 8719 27213 47351 42884 43999
18958 43999 60957 64024 56996 37367 20727 7468 19069 27888 15608 19572 24003 4590 7824
18945 7824 -9892 -9357 -6799 -581 991 8383 4464 -14448 -15807 -19215 -690 30732 6232 -18234
18931 -18234 -13237 -14043 -8056 -19478 -38163 -51445 -51535 -41163 -47371 -33576 -10970 -22289 -7690
18918 -7690 25274 9860 -2575 7098 15922 11119 -3421 -23189 -21559 17475 14229 1419 25711
18905 25711 17766 25845 18235 -1916 -10438 -12118 -18412 -13329 4429 -26641 -32932 -24785 -9918
18892 -9918 3148 19245 21826 10590 27232 12550 -10100 13908 6640 1287 -12536 24135
18880 24135 45470 24865 20832 16454 13179 9485 11851 -8744 -25957 -22659 -3313 17263 -3798
18867 -3798 -20713 -18743 8535 21166 2718 3862 6747 5078 16371 45274 37781 4500 -8646
18854 -8646 -13514 14911 21416 18260 -7430 -12473 -4831 9451 -11231 -1321 33847 42530 46593
18841 46593 51565 45881 31367 32210 45662 33855 50043 54384 63317 38135 18048 21499 13915
18828 13915 28446 34586 52662 28017 17954 17737 12759 14316 -12142 -11844 8256 -3747 -22822
18815 -22822 -20854 -12257 -5172 41806 30382 13664 8564 26534 12842 2913 14872 3888 3738
18802 3738 16800 21697 12023 1169 -9117 -21249 -24456 -18038 -30117 -23520 -14043 8154 13162
18789 13162 -1989 -508 15493 4773 13263 35045 32953 36280 30183 29144 9828 11007 1901
18776 1901 -6388 -36429 -34100 -11280 14735 48321 55196 50862 34554 1917 -29682 -14198 5475
18763 5475 14598 -8057 -16944 -13795 9590 -8671 -22212 -2221 6385 6853 7352 -3319 13664
18750 13664 18065 15226 34232 30723 35266 16992 21943 3026 -3174 -9750 -9853 -14999 -19305 -27964
18736 -27964 -10068 -8299 2592 5910 -23991 -26784 -11647 -23321 -25903 -17761 -3308 -13598 -3422
18723 -3422 17443 15698 25887 20544 -2968 -6519 -1661 6727 8965 4198 21615 32221 10488
18710 10488 -10148 2153 19572 29349 41440 12519 -14877 -6175 26466 30642 28040 43169
18698 43169 28656 14664 8452 21482 12801 21439 44604 33010 8767 12224 21364 -5162 -20862
18685 -20862 -19798 -3529 11013 752 30276 28144 12530 28742 19250 28224 41408 61636
18673 61636 39248 16857 11796 7881 10527 13079 22075 14286 -8083 12238 30814 30147 37125
18660 37125 35954 29847 26974 11483 2948 16701 19523 13788 14412 10825 10760 4569 37208 63187
18646 63187 53616 65603 60875 37664 18313 22602 46253 67965 46733 28387 31632 46674
18634 46674 36221 51864 41465 22869 33777 31005 21373 10491 33971 67322 48020 6668
18622 6668 8395 21006 19842 50562 55535 57457 63808 55447 55418 45906 51318 56866 57083 75627 84359
18607 84359 84562 51068 24502 31402 28892 15025 14415 -1890 -4488 24745 28147 52989 41631
18594 41631 27519 28084 24738 5535 20263 11008 23858 54714 38122 33897 51869 25728 -284
18581 -284 468 5023 15018 17136 22630 38625 33554 32481 14288 4028 15620 32325 23391 7504
18567 7504 2326 23508 24950 23653 12769 1760 9794 12532 -9189 -26306 -27198 -21989 -27676 -31155
18553 -31155 -24113 -17195 -21927 -22557 -5550 11676 27477 30838 28543 17467 23473 42055 36995
18540 36995 30740 8310 -28972 -25117 3650 17261 23839 52389 60092 42491 23647 15736 55043
18527 55043 79008 57996 53802 49094 47553 34103 27276 23867 35926 37841 18163 43817 72651
18514 72651 49799 34281 21796 13401 6921 24233 23004 12152 7176 11506 25002 52255 35005
18501 35005 16120 18883 34264 27179 5244 -7759 2251 7398 13882 41871 45757 43952 39946
18488 39946 39371 59526 82378 79661 94408 107417 108340 79315 62126 60410 33455 41734 61975
18475 61975 72254 95896 122088 144717 158605 172568 176899 191261 199179 160509 146359 160492
18463 160492 140164 122944 106008 101086 88242 82658 97920 134072 134750 112659 95722 84561
18451 84561 101969 98649 101660 96335 54975 45844 44144 49267 53654 41588 21652 49452 73341
18438 73341 53260 35067 40799 59085 68709 72881 90406 65801 40206 53386 110220 157313
18426 157313 159796 169598 157803 144971 146040 155222 138800 119793 116457 91277 103136 114793
18414 114793 123748 148609 211875 253233 279077 277630 306464 311201 289273 281350 275976 254421
18402 254421 214310 177272 128420 104460 98005 107947 123659 148599 163993 170057 170003 165631 157088
18389 157088 114297 109716 116293 119176 95579 79494 81375 85476 82004 79573 115754 101702 63123
18376 63123 61850 45995 5135 1699 22182 10361 33110 52922 26061 38012 61373 87100
18364 87100 96073 106516 122089 117943 102360 90020 71546 82349 63989 42276 38416 65007
18352 65007 100119 105146 133138 178310 182683 202972 204698 164307 147030 124979 140202 148066
18340 148066 142345 155291 161326 147205 152082 150475 136118 130817 150506 175087 160845 121130
18328 121130 125059 146213 130161 126499 122337 103957 103969 101176 120392 151111 131458 126776 110481
18315 110481 96848 92224 88196 96573 107452 104033 114521 138574 149265 118353 109774 128865
18303 128865 161888 150618 122722 125826 155562 183770 191251 201560 207319 224600 259001 268589
18291 268589 269774 290475 314411 345732 365962 376884 398141 400041 401979 417186 445481 434551
18279 434551 439415 457761 455522 451689 463571 453766 469300 484736 501642 516626 523066 522825 518004
18266 518004 476074 447916 404408 377116 365105 358082 342266 326126 301259 296988 292785 293886
18254 293886 299133 290976 294849 260842 250794 254039 249331 252078 260690 274997 289636 285074 280084
18241 280084 276549 278954 317407 352474 381771 431481 437748 405202 389585 390052 416559 447414
18229 447414 465979 464530 437573 418922 418324 398694 358217 350085 333379 369104 399475 400517
18217 400517 422436 455503 463072 455420 443227 418977 386042 372462 351138 297207 258595 246110
18205 246110 246073 236670 202600 166168 150721 148552 170812 189871 172178 159909 161983 168659 162075
18192 162075 152896 182421 195839 209721 202768 177401 174126 178304 191258 218784 211254 179686
18180 179686 158537 165769 144180 143425 144090 151562 147048 115218 59866 35239 48679 66044 59388
18167 59388 95733 110381 114063 103854 82584 66758 61713 83834 78267 61324 54277 61407 67860
18154 67860 72709 79134 73653 86688 98502 112349 107820 96453 122041 147373 125643 111754
18142 111754 145100 115376 113969 141262 150864 140382 147269 151721 168319 193397 173932 158742
18130 158742 158860 136936 125350 137777 152857 142985 129083 114089 115056 119534 108620 96586 113862
18117 113862 123131 144594 165479 157701 122440 121233 128987 148692 140614 130410 130345 139887 149261
18104 149261 131278 104763 119136 113269 103894 115273 122118 131692 142289 146195 140787 128013 115466
18091 115466 122957 140305 133579 129452 132197 110149 121186 137536 144471 169682 184985 188940 210124
18078 210124 221601 200631 179280 190094 205925 222059 264046 248265 223449 208653 214230 224451
18066 224451 210507 202046 230313 251479 253189 252505 232329 211345 210744 217163 237915 212994 189844
18053 189844 209210 233504 248836 229052 203896 204161 193472 190358 226243 272919 282147 296627
18041 296627 287529 250005 202638 186572 200494 217943 210361 204593 209212 219400 241178 246801
18029 246801 263147 278052 284986 298962 332059 348350 323006 314211 339747 328635 296981 302599
18017 302599 287711 294603 327019 325773 328668 343887 364782 378320 398662 418806 426653 392150
18005 392150 362210 368057 383284 332433 301626 331882 326322 330724 333650 321142 352685 425218
17993 425218 468052 433603 420518 421234 437889 429236 422077 436464 427392 432706 449871 440845 458549
17980 458549 490921 494190 506750 532618 582111 606845 643024 719020 796864 865715 960020 1034866
17968 1034866 1094999 1190812 1272981 1376952 1534152 1763864 2057668 2508949 3199900 4303983
17958 4303983 5919392 7988663 10370817 12592312 13826752 13932901 13135768 11454826
17950 11454826 9542375 8001908 7030540 6700981 7020686 8091942 10095404 13191231
17942 13191231 17306496 22080554 26574731 29385061 29774592 27879591 24173483 19570514
17934 19570514 15323161 12088547 9930216 8739325 8420454 8859397 10128165 12170371
17926 12170371 14757381 17368609 19001110 19152098 18058494 15682564 12652498 9913155
17918 9913155 7689882 6098079 5046010 4375107 3940270 3657840 3477539 3363233 3288972
17909 3288972 3272922 3293832 3369998 3498858 3672117 3899951 4222254 4719366 5484599 6726788
17899 6726788 8709983 11610784 15440349 19926680 24231076 26774816 27046466 25643430
17891 25643430 22496458 18826411 15918840 14005993 13294513 13868322 15893481 19756059
17883 19756059 25741778 33893646 43611940 53016941 58910522 59647601 56011436 48369880
17875 48369880 38774997 30228910 23624282 19208135 16863723 16263932 17275182 19933881
17867 19933881 24128698 29449046 34910325 38387873 38720449 36412180 31559311 25222469
17859 25222469 19452324 14793082 11343032 9006198 7418149 6312068 5572626 5042671
17851 5042671 4645059 4360356 4150572 3983708 3915115 3885273 3874855 3877859 3933049 4057535
17841 4057535 4269006 4746945 5584738 6855729 8552733 10636378 12735677 14059904 14329336
17832 14329336 13740109 12233422 10372761 8898821 7935675 7603992 7902074 8955252 10903681
17823 10903681 13791552 17669968 22106767 26161588 29012443 29852691 28300481 25138763
17815 25138763 21169492 17150122 14067960 12197519 11497860 11880399 13219911 15497823
17807 15497823 18645887 22069123 25080569 26885774 26763237 24929032 21826836 18184973
17799 18184973 15083621 12937640 11923267 11874355 12574060 13881666 15353825 16393776
17791 16393776 16839608 16650383 15602710 14115832 12591464 11170230 10076018 9447943
17783 9447943 9276804 9572024 10232252 11139670 12300832 13505315 14484304 15483157 16700542
17774 16700542 18357759 21140782 25664378 31939195 39474263 48344435 58132462 65546206
17766 65546206 68834502 70000836 68813872 64839413 61666573 60792162 60706201 60869191 62597107
17757 62597107 65542561 68032676 70390993 73423067 76611547 77769507 76070630 73059883
17749 73059883 68623083 62276831 56586672 52755344 49572205 46595632 44373380 42433275
17741 42433275 40015690 37118360 33945825 30520585 26763717 23139666 20094058 17643665
17733 17643665 15788847 14598763 14089307 14232926 15069117 16771814 19384898 22819235
17725 22819235 27090216 32407533 37972408 42521814 46343827 50069333 52440731 53507698
17717 53507698 55377861 58451527 61747439 66708483 74221493 81325780 84646022 85386591
17709 85386591 84290158 79232459 72242038 66176184 61140576 56889510 53725003 52094906
17701 52094906 52140688 52868072 54368163 57050886 59163199 58827888 56279025 51853202 45349184
17692 45349184 38193980 31998578 27026952 23253095 20858620 19535210 18471748 17321585
17684 17321585 16166759 14757618 13117094 11676169 10561092 9759394 9383437 9502126
17676 9502126 10066211 10998248 12161722 13344037 14241970 14608011 14295394 13302775 11912558
17667 11912558 10268059 8671864 7396826 6475592 5953287 5751064 5812272 6042119 6387522
17658 6387522 6587799 6517421 6215012 5657337 4882636 4080495 3364643 2742970 2277709 1916435
17648 1916435 1636942 1452371 1328590 1205692 1105376 1025047 975213 923098 867134 795909
17638 795909 705182 669486 670301 644918 646853 617052 539451 527474 534267 526664 516503 488104
17626 488104 478353 466066 474056 459738 444758 428617 407375 433857 438855 430472 414310 385296
17614 385296 376130 373606 368904 356548 335663 325696 325163 341777 315030 275582 274637 291202 289023
17601 289023 252626 239436 242042 267871 252862 242288 235870 217853 214270 205876 196723 170456
17589 170456 151149 175418 184121 171932 193657 213493 193102 174506 152212 152357 162315 146475
17577 146475 141068 157671 162705 176694 163838 145166 145801 153401 166419 197615 199805 188881 193308
17564 193308 186043 146587 129549 137826 153392 168114 142874 142142 177984 173260 157672 148156 146470
17551 146470 137575 133390 125986 132426 131295 132401 109597 94023 77255 80432 99851 104309 99855
17538 99855 119080 119775 113645 113711 87730 75611 86280 107046 127728 120871 92572 58077 53217
17525 53217 54661 75177 103108 108887 96167 101897 123922 118427 93920 91117 102655 95582 89004
17512 89004 98617 78922 55523 22675 12168 36064 50790 33346 25930 43997 41521 33760
17500 33760 35755 21165 624 10383 -3519 -10750 18996 8545 -20722 19291 32905 28838
17488 28838 39918 23953 16168 36899 46682 33418 33085 24803 35104 34930 -908 -15378 -22103
17475 -22103 14383 16424 17915 28022 16832 15489 20574 11980 32126 37153 42271 38639 47662
17462 47662 63630 53463 66239 54561 53871 32954 22652 43452 70592 55778 34087 43614
17450 43614 50699 52310 33448 18419 1684 2216 1252 8483 7288 6379 28990 32732 39235 16260
17436 16260 14358 39683 26627 5536 16530 57631 60902 45325 37452 27786 28881 23833 26693
17423 26693 54547 88586 100204 80171 70831 92279 83327 79286 60938 47688 55994 70419
17411 70419 76518 69523 67258 105262 126522 87476 78911 86042 102030 104490 83320 52920 73992
17398 73992 66047 19408 -14680 -21939 -9657 22917 66209 72914 79235 81673 48512 80332 100212
17385 100212 79359 66202 83739 95769 81763 38870 6898 14483 27685 34042 32018 50303
17373 50303 40908 26764 26436 63706 76240 86755 81982 90405 105165 105059 122432 146193 170028
17360 170028 156935 176778 184611 190181 178178 159434 155999 147070 119327 88837 85680 123530
17348 123530 136798 176794 223831 270687 294758 285724 257250 233300 208585 169479 134203 118321
17336 118321 109973 103736 115848 110361 117132 112469 101936 107846 111563 132086 153438 124035 86650
17323 86650 62708 55441 50440 53884 66597 44690 20335 27411 42963 34229 21966 44115 68119
17310 68119 65292 42618 24196 9452 92 -7321 -17684 -15508 -471 42330 46584 85502 130679
17297 130679 134283 106004 76547 78513 57243 66741 61372 43353 26279 64568 70274 88340
17285 88340 133463 188007 204456 203250 195810 151700 113908 74294 43923 38164 19307 11250
17273 11250 39846 55997 83261 68104 59024 72836 86137 87762 97034 76189 47523 58266
17261 58266 59973 105853 108741 86566 69032 93380 104799 114712 144212 145514 178196 200177
17249 200177 220261 251310 273582 292964 293266 290793 294377 288720 262159 274492 309321 351656
17237 351656 393193 430723 463252 450706 456578 449650 421710 376708 340925 328526 288969 270153
17225 270153 255739 261313 283396 308518 324640 334045 327154 272429 198817 165716 172509 138450
17213 138450 83743 58117 52871 67603 86769 88330 65377 48622 70105 83884 87990 77721
17201 77721 77451 81021 96094 103798 131654 157581 164578 156732 177871 244551 289618 313276 363854
17188 363854 418260 442517 466156 482142 498642 511407 503539 468861 437491 393152 381450 381664
17176 381664 381424 375652 378140 397161 408197 438985 467435 468931 443015 401598 395112 360263 315704
17163 315704 273556 222395 169303 120996 95719 102424 126557 106577 97044 92133 86539 63289
17151 63289 74038 69956 50596 29999 49790 53121 53103 71565 69703 58526 38268 43749 54310
17138 54310 36014 30440 43852 37510 43615 69693 66158 41155 53547 66941 24494 -30942
17126 -30942 -38421 -38388 -24120 -12217 5070 -1309 3099 44767 65394 68025 55461 31006 2682
17113 2682 5733 4803 -7812 -34112 -24134 -33429 -21608 -22008 -35440 -17959 -19437 -37629 -62719
17100 -62719 -56498 -29629 -48739 -40864 -3515 -10720 -20794 -23383 -7129 -5659 1432 -28144 -56369
17087 -56369 -52327 -37052 -15026 22778 19872 1038 -25358 -24711 -21177 -11880 -25608 -31083 -31253
17074 -31253 -14722 -16095 14754 17116 68 3278 20170 -409 -9177 30137 38298 33940 4750
17061 4750 19696 13215 5136 3326 20392 21796 15415 33305 28480 22725 9453 -42139 -66651
17048 -66651 -23473 -27624 -30093 -12773 2258 4529 11639 866 26445 46542 32750 7276
17036 7276 21633 -6424 -25546 -18265 -10809 15011 30259 26179 8917 12351 -2005 4318 8012
17023 8012 17668 19574 -1334 -11095 3321 2348 6548 -9900 -32210 -39244 -28902 -41406 -35672
17010 -35672 -41023 -27228 -33066 -18157 -4979 -2296 13316 51641 45109 25777 27921 21748 -5542
16997 -5542 -5819 6580 8365 -10233 -40091 -43514 -39423 -22651 3208 -10026 -18982 -11120 3848
16984 3848 9932 1436 6214 22803 26255 1667 7700 35829 49102 29293 6486 9526 39072
16971 39072 35900 32093 -7342 -35010 -32128 -24760 8248 23344 28406 8052 19101 5115 -15991
16958 -15991 -16738 -10051 20516 22494 -8179 -12918 11633 46949 21507 -5073 -14388 12557 2850
16945 2850 18016 41117 53743 62236 16707 -8065 10944 17366 10506 23843 42180 40919 43609
16932 43609 42658 38525 32144 11166 33505 43927 29617 -13629 -34968 -49482 -38810 -42377 -36278
16919 -36278 -31233 -61748 -54638 -19809 -2584 -20947 -29214 -49751 -50524 -44926 -25273 -12909 13238
16906 13238 17237 -7449 -48118 -63131 -64480 -49020 -40483 -41305 -35974 -28580 -15810 15830 23040
16893 23040 5877 7539 17897 27405 39737 20890 19098 20893 5494 1906 -2123 -18453 -10727
16880 -10727 -7323 11010 6016 999 2199 8117 -101 13269 29697 2214 9564 527 909 -18630
16866 -18630 -15577 1055 -16329 -13552 6980 10759 21248 15061 14770 23993 41862 49481 36193
16853 36193 17197 35974 39095 24976 4999 15424 23333 32480 45245 30395 33659 10205
16841 10205 9883 35818 39640 13371 -12309 -29572 -8492 -3571 -18276 -10631 -17588 -26953 -20296
16828 -20296 -31181 -26259 -18062 -5903 -1774 20576 42441 17585 4332 -16476 -15217 607
16816 607 17251 26909 24862 14076 -22599 -30891 -26333 -23158 -13742 -15849 3216 -4474 -18988 -1096
16802 -1096 -11162 -16380 -14942 -11352 3426 -29 -14710 -9211 17484 33568 57675 44408 -2073
16789 -2073 -4668 6716 -17448 -17817 -59 3166 -3326 -17381 -17747 -3712 -1367 15947 24708 8057
16775 8057 -142 14243 38657 46292 38830 39591 74005 82889 42354 19426 11481 -13684 -17478
16762 -17478 -18534 -18945 -35307 -41502 -48968 -30200 1456 34704 9586 -40852 -50103 -18868 -14261
16749 -14261 -12271 -20952 -26735 -15895 -27717 -16369 -19946 3421 -28922 -42068 -19692 -23125 -9834
16736 -9834 1308 -24999 -33266 -22225 -4260 -1397 2698 1180 16449 12124 -2686 -13002 -6912
16723 -6912 -2749 5090 17418 2466 -20244 -13426 -14694 1512 -6281 1320 15304 -13429 -34276
16710 -34276 -10220 -2483 7146 -6622 -17521 -25447 -34453 -31616 -24781 -43213 -61851 -38033 -43382
16697 -43382 -61102 -60347 -27221 -29089 -42390 -49259 -9954 -1584 4281 12371 -937 -9121 3102
16684 3102 10641 12497 4407 -15400 -14114 -37182 -56588 -22025 -8239 -9865 3280 12358 24797
16671 24797 20082 9221 -36702 -45471 -43611 -33717 -21322 -30887 -15175 1994 24824 43991 27749
16658 27749 -2628 -262 26418 24322 10722 -8067 -2417 -17374 -14846 -20122 -17279 634 26796
16645 26796 32223 349 18712 26937 8750 -3536 -7398 -7616 -26496 -23721 -3217 19154 -1272
16632 -1272 -38617 -19554 -17373 -37222 -47300 -36351 -15241 -14182 -18568 -46426 -35065 -19106
16620 -19106 -37373 -19777 -25095 -38103 -32045 -50894 -42226 -42794 -43188 -39059 -19311 -45155 -54563
16607 -54563 -39916 -30838 -28416 -12834 11187 13523 12871 7333 -26134 -32409 -7857 17219 17254 18109
16593 18109 1075 -29431 -40182 -18754 -17109 -19098 -10873 -13625 -3331 10327 -8894 -43824
16581 -43824 -29911 -23346 -17497 5728 3287 5762 5414 32307 49736 46304 34184 -10227 -4415
16568 -4415 22925 25112 10868 -8587 -5808 6449 15749 12555 10365 2365 29 6401 -538 107
16554 107 14651 24597 19253 27541 38547 29693 16503 17473 5343 -5902 -2977 -19080 -62787
16541 -62787 -52345 -16192 -7405 -5347 -4759 10922 2327 -23751 -31737 -2929 30363 1520 -5268
16528 -5268 9529 8859 25433 22511 -2341 -11077 25796 39684 30050 36487 49410 34818 3561
16515 3561 27989 43102 27330 22325 -1155 -12726 -15982 -25820 -9723 19436 20687 -1785 -21799
16502 -21799 -11848 27138 24777 9409 7430 -3717 2985 26744 11585 -7477 -8263 -19611 -18392
16489 -18392 19755 41526 39135 11034 -13057 -11883 -8272 1984 914 -10129 7095 5089 -4118
16476 -4118 30 11966 5931 -7982 -15721 1608 7549 39815 34329 18398 -9710 -24088 -29495
16463 -29495 -4472 20603 -1926 -16815 -20206 -4751 -12058 -515 -6488 -9267 -10638 -6830 -4055
16450 -4055 -11999 -17744 -13329 -13214 -39202 -36289 2136 34159 28250 20759 13232 -196 -28511 -20015
16436 -20015 5396 21037 17238 13924 13118 29796 19349 -6575 -29309 -21667 -16299 -1842 -2735
16423 -2735 -38893 -46091 -53394 -63423 -14360 27187 48155 42653 25424 17559 19316 23871 2110
16410 2110 -2148 -10552 9421 28064 49942 29591 4645 -28754 -46975 -26340 -97 117 8342
16397 8342 6174 22222 2168 -10290 26816 39710 32326 23759 2096 -34384 -41875 -8242 25865
16384 25865 10988 13163 29194 26397 37554 27339 20990 36996 46487 31705 33094 29708 21132
16371 21132 16971 -13269 -18942 -18117 -27587 -14346 -34876 -55719 -43355 -55777 -74515 -48606 303
16358 303 17444 -7554 -26799 -44441 -33148 1872 -36294 -52355 -29102 3034 2324 -11534
16346 -11534 -46872 -41338 -23022 -13444 -13283 -11276 3566 4406 7594 -1084 -29941 -33985 -36964 -40501
16332 -40501 -26230 -3329 22012 39783 35118 19619 -6089 2158 25698 21148 20802 18225 15976
16319 15976 4663 20394 42476 18990 7578 471 -10863 2280 -2796 -26435 -8827 -1093
16307 -1093 -36180 -31532 -31810 -45253 -48120 -24953 -4867 1878 9606 -9243 -27192 -43800 -32109
16294 -32109 -19657 -6994 4720 -8089 -19574 -28189 3106 -1566 2497 1905 -9434 -8416 -26117
16281 -26117 -11066 -6955 288 2391 187 -12980 -35685 -19933 2087 8297 16427 4542 -17639
16268 -17639 35014 36350 6843 -18097 -20301 -17364 538 8665 37352 75383 67013 11727 1184
16255 1184 7249 14372 54244 59355 47984 27728 -3238 -39146 -35836 -27079 -5877 8884 -16688
16242 -16688 -25136 -41417 -13439 -9808 -12726 -2202 10024 6600 -3248 -7074 -29058 -34191 -24260
16229 -24260 -13024 17277 18136 24887 23214 22736 10730 -3969 -7249 -10945 -11175 -4605 -26227 -44218
16215 -44218 -26458 -3422 -1644 -19400 -25433 -44625 -44103 -27835 -5369 -11780 -20732 -46791 -58306
16202 -58306 -77619 -74610 -54851 -52134 -32262 -12380 -1874 10924 20474 23961 15689 -9147 -18650
16189 -18650 -19968 8642 31905 31654 1234 2409 13850 8862 -9819 -8219 2803 1251 16051
16176 16051 11953 -6190 -25949 -24255 -38513 -20738 -6051 -11935 600 1962 -2395 -705 -2722
16163 -2722 -7510 -6474 -5996 -3597 -12497 -29707 -50244 -73573 -95601 -100002 -91210 -84196 -95392 -83336
16149 -83336 -38654 -22772 -33003 -16161 6023 21498 25218 6833 -5044 21004 43261 27830
16137 27830 -2924 -23324 -19171 -11694 -32230 -14901 -3812 1989 7902 22601 8048 -18634
16125 -18634 -19455 -24445 -43156 -18689 -9662 -32180 -20211 -18890 -27922 -41049 -27918 -40018 -33087
16112 -33087 17218 39058 20647 10194 3976 -14941 -13917 -24967 -29814 -2336 -12398 -31328
16100 -31328 -26515 -22271 14623 30216 -3296 -20537 -21377 -6421 21225 22957 3129 -23324 -29752
16087 -29752 -13411 18710 3973 -18222 -24410 -32975 -36942 -37472 -27636 -5186 30088 45003 30470
16074 30470 20274 15911 2496 -3836 -4454 -42889 -43328 -20008 -13435 -10867 -23038 -14779 -15225 -6907
16060 -6907 -5640 -3515 -1293 3800 -5705 -15754 -19665 -36505 -32903 -13844 -25786 -11192 13289
16047 13289 -860 -11311 -20990 -4020 10927 20051 28579 31059 33176 37425 6802 780 9578
16034 9578 12682 6721 24560 16765 -10056 -6382 1886 -617 12158 -653 -8216 1830 -15729
16021 -15729 -38753 -35104 -25782 -9604 -15668 -29598 -39511 -32713 -38855 -44778 -51503 -36932 -17932
16008 -17932 -14988 -35479 -48225 -52371 -26767 -10664 -12120 -6015 15426 37942 37981 35882 2317
15995 2317 -17490 -20411 -22299 -4530 12948 -17484 -46145 -15567 -9839 -47436 -57063 -69256 -49423
15982 -49423 -57670 -46457 -27203 -10332 -1822 -30578 -52309 -41547 -30725 -9110 -3622 -8855
15970 -8855 9432 8784 -4665 -19837 -21041 -19955 -7294 -588 -19541 -19008 2701 991 -4532 11933
15956 11933 28140 35461 44627 38118 3069 -9337 -755 20465 31286 25505 -9686 -7993 23710
15943 23710 22161 -22127 -27105 -9207 3103 15284 7221 10918 12240 23432 -11740 -31297 -27611
15930 -27611 -20085 -14865 -8489 -15033 -22472 5458 21858 28819 23002 -1961 -43588 -33025 -20307
15917 -20307 -5357 3096 -16377 -24052 -51039 -50342 -23343 -4154 -11310 -5354 -10291 -5510 -8394
15904 -8394 -2587 11503 39012 30846 -24210 -31834 5355 24744 -17355 -28923 2339 8243 -9099
15891 -9099 -30895 -32761 -25965 -14729 21493 25677 13219 30565 14262 4225 -2508 -23323 -21811
15878 -21811 764 -4999 3073 12897 32274 35404 24192 8504 -7572 -6365 -9795 -1696 18390
15865 18390 -2113 -2151 -8390 -28919 -24322 -18333 -24268 10178 30139 12011 13766 20297 17323 -8723
15851 -8723 -42763 -49972 -64423 -69085 -50925 -20052 -20459 -30948 -19357 -3024 -5572 -176 6650
15838 6650 3958 5643 8782 15635 3841 -17547 -21811 -7167 112 3576 10864 -9465 -9440 7034
15824 7034 -15924 -37845 -39203 -26798 -16222 -36471 -26702 -41340 -59157 -75512 -50359 -40779
15812 -40779 -33201 -32705 -45023 -32663 -13165 -24776 -5228 11846 -7655 -1158 1829 17834 29180
15799 29180 26191 22887 4312 4007 12843 -15841 -5088 21070 17183 12710 21539 1345 2914
15786 2914 -161 -3302 6406 14257 19791 -5324 -8670 3776 8458 -20380 -29225 -31274 -36863 -45257
15772 -45257 -74600 -71002 -72008 -37933 -8071 9704 -9170 -34360 -46487 -45593 -28053 -10154
15760 -10154 -661 13304 14141 30747 22882 8740 -4712 -11002 -9702 -18038 -9295 -4421 4640 6025
15746 6025 17919 30881 35007 49751 66290 76503 142475 264753 428326 533188 528518 490028
15734 490028 377717 188752 95869 43771 31706 19720 -7697 126 15148 9562 -22231
15723 -22231 -32910 -15694 -21773 -47526 -62591 -35420 -48948 -39667 -26399 -6370 5611 -5862
15711 -5862 -28601 -3065 12269 11086 -570 14665 22661 19342 -6340 -49085 -43543 -47318 -23116
15698 -23116 12729 -3157 -30090 -11629 24704 9600 5165 7454 5588 -7926 -18713 -13061
15686 -13061 -23821 -29315 -32327 -13010 -26629 2751 37931 23296 31901 21240 -25069 -39522
15674 -39522 -34122 -34811 -19868 -1741 19219 37795 14358 26553 57508 41541 25371 1349
15662 1349 1340 11033 -8766 -17043 -3508 -1740 22384 34967 23350 11090 199 -5268 -12672 1587
15648 1587 -8190 -20876 -2710 -4763 -20091 -2437 -8072 -8952 -24874 -8885 -5803 -28325 -16217
15635 -16217 9966 11082 1745 18689 2338 -14232 4119 23893 -13709 -30972 -31969 -27554 -14685
15622 -14685 -30411 -26892 13782 21096 10251 -8746 -18125 -5515 17670 17540 -5440 -6633 -26586
15609 -26586 -32416 -22064 -10655 -10546 -1398 8398 -6176 -16602 -6024 9981 9252 2902 25780
15596 25780 25731 12273 1244 -13314 -7647 5477 6455 2217 -832 -5001 -6130 -5835 -8225 -25179
15582 -25179 -18065 -20534 -31581 -47334 -20890 2533 -1110 -5474 -3339 -29503 -30121 -17145 16334
15569 16334 -7601 -40724 -36847 -19477 -21229 -38497 -34463 -45500 -34525 -24491 -46243 -40516
15557 -40516 186 881 -3165 -856 -3835 -2882 -31941 -67030 -56863 -11986 11973 33304 13408
15544 13408 -8489 6820 4569 -14486 -16385 -30645 -44152 -30103 -5301 19625 9756 -9620
15532 -9620 -16647 -24487 -156 32846 22740 19427 14149 2019 5508 -10649 -34992 -34787 -16535
15519 -16535 -6727 26419 41717 23032 37350 32681 21682 15555 13151 -11791 -11309 -30481 -32616
15506 -32616 -31008 410 18332 5335 -6187 102 24501 34276 24410 11783 15937 23198 14936
15493 14936 25205 21989 -24011 -32842 -47076 -39153 386 28290 29828 5012 -28725 -33723 -13121
15480 -13121 -30568 -58058 -47641 -32191 -1682 666 -28947 -37020 -18077 -5650 11592 11158
15468 11158 4943 -11401 -1705 1562 -10938 -21409 -39737 -45287 -27707 -41277 -53968 -39200
15456 -39200 -11844 -17442 -8584 -19522 -3552 -22790 -22290 -12577 -50563 -55141 -54112 -39100 -23161
15443 -23161 -18174 -29876 -39352 -46493 -65407 -63966 -28429 -29289 -42525 -55708 -34816 -16291 -23672
15430 -23672 -44650 -78056 -53538 -24537 -11368 -3506 12410 22441 29463 17040 4566 -3802
15418 -3802 -17864 -7585 -3595 -12597 -16182 -27078 -51805 -60865 -68225 -87580 -57289 -33584 -31450
15405 -31450 -34979 -24744 -37169 -23648 6921 6237 -3405 -10028 -10852 835 14157 17128 -4063
15392 -4063 -26753 -32320 -42077 -20140 -6696 7032 8447 10002 -2160 -14976 7171 48155 37076
15379 37076 31257 25357 4971 3337 23889 28901 16169 -11227 -26892 1132 -6575 -29035 -8815
15366 -8815 8499 -6065 -12963 -2206 1686 -15079 -43705 -35378 -29549 -36526 -33848 -52864 -56300
15353 -56300 -40012 -25580 -15903 -13427 -34803 -20540 5311 419 -21919 -17455 -1399 -8566 -6706
15340 -6706 -29976 -21445 2948 765 -4581 -22465 -21839 -6171 5434 -24121 -61256 -47194 -51202
15327 -51202 -51562 -23757 -6163 16121 18831 13219 12682 13755 15351 12469 5164 -21853 -11473 29730
15313 29730 37456 3802 -5633 -16904 -27678 -19469 -42581 -46024 -22785 -16828 -24729 -44948 -46289
15300 -46289 -39587 -17915 11457 45179 47824 30554 18591 19126 35437 31466 19447 -4450 -1611
15287 -1611 -424 -6156 -20297 -53084 -43144 -35217 -15707 3619 4922 4834 1577 -24195 -19896 5669
15273 5669 8968 -8505 -14027 -18591 -49469 -32193 -23302 -40741 -65451 -50263 -14813 -11842 -25656
15260 -25656 -23605 17225 9180 -507 5179 26417 31244 25296 37662 39939 37071 19772 -15033
15247 -15033 -16719 -6444 15667 7901 3961 7577 21266 54280 46530 -14955 -44205 -32515 -32915
15234 -32915 -30839 5401 21904 9947 4673 -9362 -15095 4331 8041 49022 58416 41859 50754
15221 50754 46664 14410 29008 51571 -524 -20064 -21193 -18378 -648 8342 13163 -19532 -19705
15208 -19705 -9211 5290 -15741 12861 3104 8842 19535 -15993 -33886 -28584 -56076 -59916
15196 -59916 -23695 -17971 -4605 14987 -954 -6816 -2833 -580 -13072 1873 3348 6364 4396
15183 4396 -12712 14303 32250 38756 8479 -27780 -17551 -1924 16970 -806 -495 23534
15171 23534 3856 -21693 -33690 -38577 -44313 -14714 -10024 -21615 1953 10730 9258 -2021 -33207
15158 -33207 -51333 -44274 -30723 -13710 -20789 -37125 -27237 -18326 -25435 -23802 -7140 -15576 -19721
15145 -19721 -4610 4841 -14176 -19042 -5518 -2242 -1725 5092 4120 -11284 -7551 12471 -3425
15132 -3425 -3400 18544 9068 -8132 -26766 -24665 -4439 -7229 -4723 -26189 6354 14495 22479 27120
15118 27120 9481 4973 -3081 -34665 -17499 5057 12648 12185 -8452 -13132 -15605 -20445 -3335
15105 -3335 -1651 -11849 -8176 -30300 -33739 -21426 -14252 -5308 -30441 -41019 -50830 -27123 8552
15092 8552 19879 9553 -761 10935 18233 34416 35551 6542 -21465 -28288 -33402 -9352 20938
15079 20938 12941 -11827 -27117 -49824 -51330 -17871 -7737 1395 -13646 -39197 -5283 51336
15067 51336 40411 8349 -3705 5169 13713 -2222 -7683 -18970 -3212 15747 1677 -5774
15055 -5774 -4474 -2674 -8226 -17317 -18833 -1581 3904 15765 6372 4299 12552 6608 24198 20244
15041 20244 6966 919 -4796 -5010 -3917 -2206 -8552 -15755 -22483 -28127 3492 31950 35690 19971
15027 19971 16856 9520 -13124 -23374 11232 10713 4123 -4276 -16946 -32395 -27599 -16659 -6645
15014 -6645 -22103 -37428 -24867 -20177 -6120 14764 -808 -9448 7316 31019 25172 -11203
15002 -11203 -19373 1812 21102 20271 -13938 -2271 -5434 -15217 -23217 -29243 -45760 -50406 -26913
14989 -26913 -44173 -40762 -29305 -21509 -14927 -9783 1071 -12679 -7893 20876 28241 5608 -3405
14976 -3405 -31344 -63225 -91457 -91438 -70247 -43253 -12956 1879 1498 7803 20208 24897 23858
14963 23858 9690 8883 25077 30854 30410 14330 5576 -275 -9923 -21574 -25354 -12382 -11116 -31772
14949 -31772 -16133 -2214 -1040 -5875 -28689 -40727 -60424 -47661 -27820 -11881 -16624 -31420
14937 -31420 -23438 13449 13941 4524 22848 31599 32556 17608 9323 -2075 -20199 -25793 -27758 -24703
14923 -24703 -10413 -14358 -28290 -34024 -21642 -22306 -23470 -12659 -8109 22003 19282 -8683 -13256
14910 -13256 -22 -21695 -28264 -40575 -25210 -12742 -29348 -69309 -82970 -53048 -37741 -36317
14898 -36317 -37782 -32664 5056 15382 16216 27727 16499 -5235 -3682 8660 25896 32917 30363
14885 30363 11625 -779 -26885 -14480 2086 -5342 -20424 -10975 -3011 -8252 -5565 4783 12318
14872 12318 -12570 -35597 -11561 5989 14354 10324 8444 2566 11902 14895 16068 41824 51437
14859 51437 26656 -1471 -7707 2418 86 -27859 -29072 -14071 -15713 -16209 -31251 -13874 2010
14846 2010 10552 -4176 -1771 -9178 -24021 -13050 -19146 -19154 30738 30493 -11488 -19148 -13443 -23964
14832 -23964 -30610 -35619 -24686 14760 25296 5217 -14558 -4575 23547 37462 30560 27481 28869
14819 28869 12473 7100 10697 22831 19700 45050 40332 35319 22744 39240 23121 -118 18772
14806 18772 25063 23250 9359 6930 -21031 -22762 -10481 16395 5352 -26619 -15537 -12130 -27091
14793 -27091 -33387 -48144 -43194 -20418 12235 30142 25490 12692 22882 33871 34563 21807 3046
14780 3046 14305 25290 13988 19672 29018 7298 12696 6444 -11276 2502 -102 -2121 -7858
14767 -7858 -10537 -157 14375 12825 9431 22545 -1167 -13668 16151 25823 27731 28120 -6316
14754 -6316 -2634 22558 18915 12983 17617 21468 21761 24321 29678 16233 -727 19442 34247 31809
14740 31809 -14176 -44781 -28373 -35587 -39364 -6318 25060 21590 695 2652 -18576 -5192
14728 -5192 21174 14223 13859 21009 35810 45262 51460 65359 86966 119585 108076 110323 123446
14715 123446 126238 131628 156444 136644 139084 158949 146577 142336 149732 139468 105765 88348
14703 88348 85563 46310 16093 18317 42586 50929 37126 36814 6186 3595 -4978 -7954 -8971
14690 -8971 3634 7586 -4452 8119 5503 3079 11087 25222 6490 -10766 -3458 -912 -5371
14677 -5371 20192 44613 48091 33106 31615 44518 71916 63985 45394 18724 -13533 -31213
14665 -31213 -20241 -391 8941 31779 -2274 2681 15259 -5335 20260 31109 32635 26263
14653 26263 11757 -9346 -14828 1355 38957 67968 50971 -1711 -6461 23720 32183 16310
14641 16310 21793 15704 -781 1805 9429 16646 -12503 -8455 -7806 -46262 -52760 -12761 -9591 -33346
14627 -33346 -32844 -19183 -28315 2062 10761 -4877 -1372 -5173 21007 26594 44727 80204 60145
14614 60145 27834 28747 25335 30696 21524 11311 36476 12045 -31549 -46786 -48178 -36568 -1236
14601 -1236 2722 -23137 -9450 -5979 -26435 -54431 -49223 -37757 -35380 -43066 -28457 -24009 -21961
14588 -21961 -18183 -32406 -20812 -20725 -3985 14624 15653 22936 4984 -4894 -4149 -19538 -11261 -9723
14574 -9723 -12859 10133 35869 -6631 -24625 -4391 253 -8875 -17211 8526 -2124 -19108 -30932
14561 -30932 -36618 -10731 14958 -10597 -49492 -77978 -65583 -49796 -38869 -22986 -14747 -27245
14549 -27245 -32516 -36003 -20678 -6542 20496 -4339 -8972 -39258 -49282 -45406 -65457 -33623
14537 -33623 -1718 -19997 -20484 18434 -3308 -19157 -39811 -35834 2970 29435 17910 -1965
14525 -1965 16420 31188 6386 4205 -11350 -14345 -20830 -22911 -23538 -9313 -6860 13419 10889
14512 10889 20530 -349 -7185 -17498 -36526 -40626 -32075 -42733 -45360 -9020 3409 16651 12040
14499 12040 7194 9429 3285 30548 50942 45749 30936 -1345 -9055 18029 35407 23445 17904
14486 17904 -11788 -24951 -20578 -16790 11889 15393 19218 6938 13133 -3738 8801 24635 40668
14473 40668 34960 24275 8855 -15685 -34152 -43452 -4445 4651 -24421 -47377 -56681 -45832
14461 -45832 12925 43066 19852 -3538 -29474 -36656 -37709 -30706 -22700 -26896 -9463 21392 12351
14448 12351 337 -28234 -33358 -11948 -2307 12666 742 863 19149 14127 14653 10781 -13476
14435 -13476 -9034 -12204 -12953 -44066 -88770 -73997 -9636 11261 -11289 -7236 -15714 -28653 -29345
14422 -29345 -21295 -29923 -28325 -33757 -26985 -31638 -18400 -20877 -17927 7748 9146 -1427 10544
14409 10544 17219 -3577 -20089 -4854 -13852 -10707 4722 189 -5502 12623 13286 396 3514
14396 3514 10830 -7392 2380 318 -18563 -21447 -12827 9185 10586 10468 5208 -17019 -22456 9161
14382 9161 7428 6307 -13495 -10461 2594 318 -25924 -24242 -1481 2226 -10933 -30490 -12185
14369 -12185 -869 -5169 -3418 -27308 -18222 -6497 17219 -12432 -45691 -64007 -52267 -18727
14357 -18727 22554 49867 38808 12022 -8335 -12051 -10245 -6132 1686 -12313 -8625 1357 4135
14344 4135 -25852 -29799 25199 36237 28395 23674 -5581 -24050 -37112 -9439 14086 12820 -8999
14331 -8999 -11418 -2026 8074 -5755 -4290 4404 15147 27694 62246 100186 59023 24895 11678
14318 11678 8921 -9494 -20991 -16416 5656 -9748 -9318 -16456 -15088 -31046 -33119 -11394 1875
14305 1875 876 -12678 -39991 -41178 -20591 -17515 4500 7152 -3124 -19911 -31650 -42109 -22552
14292 -22552 -21460 -36695 -54585 -71773 -67390 -2517 23301 -5306 -24393 -26546 -33220 -30489 -23165
14279 -23165 3883 22379 7094 -33051 -21602 -13226 -12092 -5016 17114 22138 42917 56661
14267 56661 42230 14401 7730 15 -7917 -10136 -26691 -29204 -5637 -18 14024 9882 13665
14254 13665 -1951 -20714 7200 33129 39755 39475 41975 30961 30173 18351 11353 -11539 -27118
14241 -27118 -10326 -19322 -43532 -50140 -44805 3403 18614 17674 7784 15541 27327 36722 12054
14228 12054 2674 8156 32045 62912 56217 30165 21577 6235 11032 14775 -7838 -6561 -1006
14215 -1006 -3018 8731 -2412 4250 2865 -587 -23795 -21868 -32183 -22783 -17757 -19969 -16716 -15253
14201 -15253 -27600 -27814 -10637 2150 -10982 -34341 -20244 -7573 6892 -2604 3001 23127
14189 23127 31257 44264 38369 43075 36835 21745 -13684 -22636 -16951 -28822 -35508 -11753 37
14176 37 29281 28431 27270 31657 16990 40452 50066 41894 3800 -20253 -27607 -10097 8063 -9624
14162 -9624 -23672 -43792 -64965 -62332 -25216 -27542 -29354 -2464 26654 14908 -16323 -36554
14150 -36554 -32705 -15857 -24068 -12965 8566 24361 21893 23382 29177 19212 1500 -13727 -12727
14137 -12727 -9070 -17087 -6487 -8754 -5875 -1712 5788 -7958 -12959 -14319 -1717 -21749 -28088
14124 -28088 -23203 -23413 -40264 -38989 -22393 -15391 -16915 -11075 4207 20611 34593 20739 24258
14111 24258 10521 8404 30912 45061 14163 3087 5257 5272 12036 26836 29846 -11070 7758
14098 7758 16542 13090 12508 7802 -23382 -45246 -39192 -4795 -11267 -2323 25533 24851 48511 67295
14084 67295 70351 81032 94916 80624 43895 8734 3103 13888 47345 30256 9085 -8769
14072 -8769 -1459 14878 26739 33663 22933 9940 12003 18688 4990 -22592 -12009 26020 26535
14059 26535 -8371 -64200 -44717 -14405 -937 7250 -781 -13231 -8273 3590 2930 -9776 -8581
14046 -8581 8418 18572 13869 49458 63212 59784 54451 60437 43858 12171 6357 -3602 18128
14033 18128 12366 -3984 -19171 -40241 -25321 6340 20150 20073 775 14320 4771 1884 -3828
14020 -3828 4963 18170 -24163 -64444 -36681 -6418 13961 18530 3463 40363 69887 58852
14008 58852 37968 4111 21667 33706 14477 -13967 -13703 -17048 -15311 -23693 -25150 -13547 13106
13995 13106 -2160 -177 -4068 -22071 -10991 -166 -3103 -3535 -17252 2397 24538 17242 -10534
13982 -10534 -20510 -29799 -9535 -17497 -5521 -7436 -11777 -8954 -10551 977 -6419 -2494 -16533
13969 -16533 -48847 -26142 -294 4455 2521 34064 22554 -19708 -40837 7726 -1128 -24542
13957 -24542 -25514 -38123 -39271 -28876 -22979 5706 13734 28115 -3227 -11417 -6987 -380 11507
13944 11507 -22731 -57012 -34533 -8344 -1615 20309 19595 31959 56200 64976 42664 21070
13932 21070 15820 -12883 -36797 -40822 -28781 -5323 8043 16130 28698 22535 17356 -19889 -35373
13919 -35373 -38046 -26945 2026 -5960 -16938 -10070 -4142 6532 -6450 -31823 -37021 -32292 -19446
13906 -19446 -21075 -42451 -8376 -7395 -1875 -1254 17922 18900 22070 12763 14714 17257 30938 15026
13892 15026 11559 7547 26140 33618 27080 34542 27879 9127 24744 29711 21621 18082 37529
13879 37529 23680 10920 19742 6921 32282 42804 36553 8186 -8228 3001 -5238 -13743
13867 -13743 -20585 -23726 -17635 -35426 -31082 -26634 -3006 42858 54652 43760 25525 44610 39188
13854 39188 41829 49854 28991 4705 -13398 -11461 15017 24856 28924 25714 6774 -10332 -27394
13841 -27394 -33006 -15181 -4436 -22160 -14812 -3876 -513 15963 19575 -8370 7494 27230
13829 27230 37101 31022 44791 9505 -15906 -32905 -59350 -69897 -41572 -27041 -29230 -31213
13817 -31213 -18945 -1102 9210 -8405 -24037 -18164 -13765 -3390 -1554 -6980 5031 3764 -5180
13804 -5180 -39763 -58605 -41491 -4524 9592 21487 26526 14843 2610 -8771 -29458 -31702
13792 -31702 -14615 -14525 -33295 -2988 21093 29435 24189 8348 10810 20327 8750 7034 19357
13779 19357 22819 13194 30455 28435 21280 22025 50863 36371 9905 -29330 -41247 -28741 -826
13766 -826 -8741 166 104 17219 19571 375 -9829 -1463 7511 9370 30188 42059 59164 55463
13752 55463 41995 25584 3726 -30772 -36094 -17860 15383 14448 17535 -866 5734 5298 -4330
13739 -4330 -14211 3661 24953 18060 8464 14410 18119 30284 1743 -12709 14897 29856 9518
13726 9518 -9988 -33853 -18791 -13124 10567 22159 9725 -3248 4017 -8086 -25831 -25491 -13324
13713 -13324 -3079 -19342 -18107 -2355 -3093 -31001 -18007 7837 21462 40165 9727 9212 -4944
13700 -4944 -7159 882 -3387 -11047 -39403 -49494 -23943 -23547 -13454 -8018 8519 -2803 -7818
13687 -7818 -16998 -29658 -7920 -9757 -17423 -7366 -23016 -30697 3373 17835 22926 9778 -27913
13674 -27913 -28045 40 21879 15926 6214 -260 9063 4934 -17288 -12191 -14883 254 -12569
13661 -12569 2678 -3670 -6132 5214 -402 12870 8806 -2690 -20846 -19176 -25170 2635 5046
13648 5046 8922 909 -10582 -1490 33671 34856 3593 9807 33023 46732 21977 30011 16326
13635 16326 -3022 -2617 7396 32365 25120 12322 21515 27623 6761 17977 30236 17531 10027
13622 10027 -897 -10101 -9911 -4381 -29220 -9466 14203 22069 18843 -754 -11186 -29785 -28200
13609 -28200 -14682 4315 9056 985 22170 39547 25470 30635 30942 30491 30676 2626 23529
13596 23529 36264 21537 1949 1596 3059 22749 40752 28859 7615 15274 44967 -8
13584 -8 -26289 -17243 -7430 2903 35082 24411 24720 41548 26777 38074 30373 33407 19897 33800
13570 33800 35557 24063 34457 14440 -15818 -1176 17082 -10944 -429 13428 15929 -895
13558 -895 2012 -7054 -7054 -15335 -39475 -34542 -12299 -2845 11030 30311 62539 38462 48778 56158
13544 56158 19244 15247 22996 41455 27663 14888 25579 25778 33669 33051 20336 12198 41011
13531 41011 48395 50568 36332 3364 3253 -17964 -5723 -3373 4860 -1030 3185 8828 37669
13518 37669 50454 24106 24665 629 -22040 -13657 9627 -6128 -27362 -19229 1355 -1827 -8963
13505 -8963 -7043 3909 21302 17251 -22625 -25488 -9806 9018 28265 46593 39587 37741 14540
13492 14540 -575 8364 9199 24938 39734 29319 25379 8959 544 7042 -1054 605 9215
13479 9215 -15395 -32106 -9975 -14885 -40715 -59408 -60893 -48456 -51205 -28848 -18939 -26533 -7020
13466 -7020 -9668 -22220 -19765 -17025 -10831 -13590 6970 1973 -17543 -19812 17509 31872 49516
13453 49516 45820 46018 32676 9896 -3053 3405 27384 22432 662 -8830 -15049 -38177 -33924
13440 -33924 -7833 25196 12254 250 -3745 -4675 -31603 -58196 -14642 9425 -9096 24295
13428 24295 35167 20563 7138 3159 -11666 -7726 5089 14661 29540 31260 42452 41205 18547
13415 18547 25259 11541 5209 12371 18848 15167 30591 16960 30637 40528 53013 42841 31606
13402 31606 24332 12453 15777 14416 -7409 -16678 -11278 -3117 -8427 -35725 -24360 -17721 -6209
13389 -6209 -10605 -20190 -11641 14333 14209 12787 7994 -83 -13479 16559 26205 32850 43122 53795
13375 53795 42913 43419 44249 37055 43043 35773 3509 -14883 -35805 -22759 24506 15411 17510
13362 17510 -15413 -1280 10211 -2659 -11552 -5005 -10617 1332 15566 48115 61146 38057
13350 38057 34469 11452 -20401 -14485 -14238 -31558 1549 23717 15457 16673 6498 269 10525
13337 10525 20146 49481 39180 30485 45614 43536 -3726 -4902 -69 -5743 7055 -7853 -49576
13324 -49576 -50630 -23462 12332 33996 58977 49791 27125 9174 -9051 -31433 -17025 -15407
13312 -15407 -15147 -7701 3848 11624 865 -25380 -16732 1236 940 -660 28298 45636 32704
13299 32704 21464 -1571 4299 23521 16612 8793 15134 8405 8552 6528 19974 19824 8158 -18121
13285 -18121 -17576 -2943 -9238 6813 8948 25711 45323 44830 36888 4445 7084 15141 23910 -17396
13271 -17396 -22895 -12954 -31011 -22556 320 -2724 15634 1081 14857 36058 40674 31860 34871
13258 34871 30151 36176 57422 45057 38833 49358 43638 40006 9859 15377 37897 55636 37037
13245 37037 19947 20508 17246 29060 46167 25920 13237 -3686 -15737 -4803 4923 597 -7484
13232 -7484 -22955 -5285 12720 53294 49229 29538 16797 33683 36758 22422 8692 8603 2471
13219 2471 6174 -4932 -3440 7213 7930 9276 11736 24900 52164 76817 56981 24183 21845
13206 21845 41665 19170 28670 42955 32762 21207 2145 -8267 -6754 20923 4708 -30717
13194 -30717 -9505 1470 5785 5506 5109 -26069 -22334 -740 -6586 -21803 -41238 -28819 14796
13181 14796 48508 41862 35486 9291 -1309 -21994 -38789 -26105 -24718 -30296 -48919 -35383
13169 -35383 -16416 -8803 -8895 6653 1239 -17318 -7830 -13914 -15025 -24461 -40123 -39968 -17166 -6222
13155 -6222 26188 56090 68252 72411 53321 9088 -14138 10983 1528 18648 23382 34429
13143 34429 37590 25551 33850 39729 37803 1343 -13486 -14233 -10799 -7034 -827 7503 5216 9017
13129 9017 23190 32131 63609 57479 42896 55831 51058 33288 22350 36756 51847 36298
13117 36298 30764 34826 19317 3371 43324 65355 71119 54637 39655 58896 68228 45061
13105 45061 36467 12237 -2511 -1410 -12916 -19758 -372 25724 32290 13878 21599 13633 37436
13092 37436 7508 3117 23316 8148 -9868 5772 12555 16058 23429 10237 18233 22550 34995
13079 34995 30858 54029 32719 7354 43139 62872 65371 39864 16228 -7033 6862 18792
13067 18792 59765 57601 63140 51238 29656 7769 439 17494 13747 12100 -7801 -10172 -2616
13054 -2616 -8279 -7363 -12056 -14233 5212 30043 21073 16046 22347 12246 13545 44277 58090 70286
13040 70286 54031 20257 17653 26512 41944 56708 33696 32644 65407 48492 46038 35439
13028 35439 34971 24850 28472 16697 1175 -4881 3440 20019 18900 14568 34619 38264 34061
13015 34061 44384 53300 57972 59193 49203 26805 8034 -20601 -21195 9797 30523 11149 15037
13002 15037 -3886 9012 32574 29580 45059 37729 30031 46402 43025 50404 60076 67519 83250
12989 83250 108641 102302 75412 63177 35783 -5526 -1479 -7380 20697 33770 34461 39440 49504
12976 49504 48290 58214 34663 44267 39429 8102 -12594 -4790 18440 45117 61212 49592 31007
12963 31007 31914 63860 74380 52973 4397 -10156 28038 38557 37859 34759 21663 3220 21890
12950 21890 55433 74683 80153 99133 108224 125335 118682 72005 47570 76264 50485 35918
12938 35918 53350 81228 108513 88901 58056 43773 47044 48018 48657 33793 52113 55683 53689
12925 53689 51211 62723 87692 97281 112528 113062 75103 58072 47639 36936 11980 16980 27230
12912 27230 39636 65702 71449 75442 50713 61433 80905 95674 97467 91603 74332 56758
12900 56758 41021 46898 59217 70798 69330 43332 32767 28658 33378 31870 51263 44342 30065
12887 30065 5392 -2862 16964 14006 2831 19397 37100 32092 22745 8227 -5629 2262 20566
12874 20566 58448 51915 41219 45641 45984 70336 71596 77126 73538 70958 58745 71432 80832
12861 80832 84050 82001 70329 41575 7995 20205 35905 29613 32743 68611 72677 47049 47768
12848 47768 40968 69048 64890 70759 85212 98656 104233 112531 116006 139612 157754 147017 154866
12835 154866 161098 136120 121671 124759 121675 113950 113631 108844 158753 196505 207039 234150 270431
12822 270431 331510 387014 466317 568021 710164 852920 1013783 1187731 1367153 1538967
12812 1538967 1660018 1706218 1692530 1604812 1471275 1317452 1157813 965881 797944 653566
12802 653566 545389 467558 407392 363146 341820 317488 289232 251932 208183 202461 201864 202910
12790 202910 200578 192808 178189 165500 180757 189692 188367 176383 167234 147982 126705 156972
12778 156972 157779 132828 114396 122080 120011 120795 134288 124381 133189 125363 120491 105803 113851 132059
12764 132059 137568 126077 104288 93897 115517 128733 119758 108386 112805 124728 112858 107568
12752 107568 126974 97546 89208 53369 49115 72424 106680 98038 86720 79546 74451 75035 65239
12739 65239 51460 43744 46761 62635 84213 86091 74993 71622 95127 88830 66888 51083 66265
12726 66265 54461 61828 66111 63818 67106 106852 116227 126493 131785 127311 139904 152990 181450
12713 181450 182550 183239 165870 168577 168625 156843 163306 163353 184136 161306 127768 121619 116721 119559
12699 119559 133163 123158 115246 123811 142260 155256 147849 162024 145818 114705 103054 92212
12687 92212 103704 100305 85926 99209 114640 115773 135050 146888 145577 138237 130539 117753 121433
12674 121433 106327 110463 108510 108565 107719 140210 157511 159337 147023 147294 159440 181735 203722
12661 203722 227650 216570 240763 276658 278716 276115 278621 272969 239230 223595 214564 209285 212351
12648 212351 207199 226705 222306 171708 133089 125833 132332 153599 144689 149318 139319 169771 204284
12635 204284 199525 193519 188210 209128 209166 163764 168877 153772 143692 137842 102727 108023 109523
12622 109523 122493 133350 121012 138259 167415 161495 177240 166542 166707 183083 193167 200826
12610 200826 207273 185669 181809 198269 183080 176669 180493 181969 155912 140335 161838 171788 186984
12597 186984 189505 173386 194008 212671 200921 164113 150120 134029 129596 139330 132741 134949
12585 134949 146961 150786 153650 177704 197554 187668 192900 199511 175244 163694 184667 196191
12573 196191 184162 157489 174840 190096 159683 166721 181504 183996 182312 169332 143130 138087
12561 138087 106460 93721 90648 70971 75413 105079 94820 75982 57648 61524 104094 138129
12549 138129 163297 180285 207230 200765 222155 241529 243302 240924 256036 259408 243473 230476
12537 230476 217946 229268 226606 230372 222978 229395 259454 335131 379950 378315 381556 373110 379853
12524 379853 346788 347115 351405 357125 353952 368507 380361 357617 363452 367369 374965 385366 398573
12511 398573 408466 419826 433027 444910 441932 432976 423769 427485 444487 446527 430531 409485 383351
12498 383351 376690 377428 378014 414041 417852 451491 507790 562751 596126 632490 656188 680110 705324
12485 705324 698980 688821 687789 663112 680348 725654 742132 777178 825328 883100 911150 905342
12473 905342 918913 933215 946115 962747 972171 998000 1043600 1098105 1121703 1141079 1183925 1210906
12461 1210906 1253404 1288881 1333378 1375848 1418685 1500249 1576220 1631224 1686537 1760119 1831962
12450 1831962 1888121 1933552 1997691 2107232 2210069 2279259 2369884 2505873 2639018 2818445
12440 2818445 2998152 3172784 3389554 3639886 3949469 4356368 4843906 5458895 6145858
12431 6145858 6901399 7758374 8687668 9671684 10687654 11756664 12933522 14247639 15624785
12422 15624785 17048085 18505678 20068790 21833594 23918828 26565721 30088906 34926816
12414 34926816 41715269 51503176 65737991 86378539 114969229 150974137 192994805
12407 192994805 239623483 285105082 321454799 346509845 357373583 348298799 322790306
12400 322790306 287640845 244331966 198290367 156813955 121722139 93543762 72881190
12393 72881190 58479124 48432957 41333424 36180210 32371975 29429548 27079811 25037395
12385 25037395 23172271 21433251 19797804 18189336 16701944 15366931 14141624 13072533
12377 13072533 12114551 11238391 10391374 9582180 8845600 8135930 7482918 6880149 6336745
12368 6336745 5884711 5479291 5146024 4854800 4548043 4271638 4045175 3848872 3627178
12359 3627178 3404666 3175345 2963974 2776355 2626835 2520538 2427138 2335189 2228868 2147508
12349 2147508 2086035 2041572 2048124 2023770 2027332 2019877 1980953 1895919 1785541 1683895 1593766
12338 1593766 1482021 1390367 1294474 1185813 1125600 1084766 1032360 1008877 1003072 982557 957992
12327 957992 924377 869789 839742 802445 795585 798583 789687 797509 820467 780465 705557 684083
12315 684083 692218 672589 690389 709807 718691 714261 678131 645163 614060 596599 588418 566599
12303 566599 526180 468979 442693 456878 462054 486879 485635 459674 461592 474395 465439 473461
12291 473461 490007 483017 460122 455092 439826 421809 407152 380775 370862 401816 417387 451297
12279 451297 458606 490737 527963 540420 531714 518277 515156 487899 504675 491649 439976 413811
12267 413811 393038 364926 353692 387538 398794 405634 385566 379047 405859 425211 458410 452283
12255 452283 406609 397337 411851 435175 461597 490651 506431 507017 510499 481786 473646 464638 460606
12242 460606 433793 400999 364862 333108 304117 270879 276920 300548 323145 339650 343419 334634
12230 334634 295810 287807 290418 282429 264605 255313 254293 293007 273505 269137 278425 296154 320027
12217 320027 328713 322901 291695 294085 314405 290917 291519 288001 267504 263322 265667 258856 240987
12204 240987 231683 225901 227113 225626 240896 231276 213696 224887 240533 224774 209257 181498
12192 181498 178724 209398 222220 224837 222969 209714 226510 272598 270179 267622 280517 287254 277098
12179 277098 263151 233656 217962 233435 235097 225611 218599 206514 208486 199165 210658 234784
12167 234784 240848 237602 230537 228341 218317 225393 252537 257051 293067 313032 300468 266700 251869
12154 251869 270681 309460 312622 293942 274446 266194 286542 311152 322614 340632 338390 343430
12142 343430 348821 340465 341636 352868 371737 337357 326064 318386 312746 281933 291709 286222 292038
12129 292038 293955 281722 281693 294345 297033 292350 300877 335129 337087 309250 277775 306881 344928
12116 344928 340131 353233 355530 349529 328938 300146 287835 314941 372916 380826 370059 366207
12104 366207 357388 342586 335769 312997 321133 310351 290240 293130 314389 335924 349258 326893
12092 326893 336210 351730 353589 348214 336541 375118 393933 412701 417556 418842 445970 454291 455446
12079 455446 458763 452307 436750 419483 443121 464470 467730 476364 503706 538407 541387 551249 551417
12066 551417 546239 573677 569924 568148 589320 618781 632718 657837 656817 651176 657328 664540 681914
12053 681914 698295 722098 713100 736111 737548 738776 743808 744528 762325 776519 794687 805132 813155
12040 813155 822180 849225 878631 916098 942093 950688 946436 962716 990317 978161 995622 1043580
12028 1043580 1082361 1114612 1133587 1148538 1157720 1177001 1218565 1258134 1311412 1356408 1410800
12017 1410800 1445841 1484611 1524819 1565643 1621761 1679891 1704495 1749356 1831660 1906856 1976562
12006 1976562 2024601 2062286 2132924 2211000 2289280 2389916 2524525 2668704 2839365 3006277
11996 3006277 3221384 3483502 3737019 4017934 4267649 4452751 4573283 4652103 4658049 4627187
11986 4627187 4597204 4541125 4490893 4448931 4454006 4478035 4520585 4627798 4726779 4850897 5002308
11975 5002308 5176044 5353238 5513564 5674750 5875297 6090505 6298013 6491949 6722194
11966 6722194 6957754 7174242 7424998 7674201 7923891 8168865 8371398 8598220 8795341
11957 8795341 9001000 9211555 9404622 9603598 9772033 9918366 10032394 10130257 10211699 10267425
11947 10267425 10267230 10293426 10261831 10178134 10071915 9969946 9830432 9703288 9557970 9369404
11937 9369404 9156575 8968445 8744429 8511670 8283871 8051834 7816944 7612554 7369820
11928 7369820 7112675 6869833 6662175 6461529 6239657 6008713 5779158 5570524 5367834
11919 5367834 5168850 4992667 4832757 4678810 4507784 4351535 4206394 4074613 3927912
11910 3927912 3773645 3637282 3531903 3416267 3312199 3200946 3070499 2954183 2852592
11901 2852592 2766968 2698301 2628551 2535695 2448510 2380089 2302166 2225614 2165729 2126660 2074662
11890 2074662 1990375 1946018 1905897 1837205 1761806 1694606 1640587 1620428 1594515 1558247 1503096
11879 1503096 1448885 1420628 1408242 1364143 1305983 1269742 1250808 1208903 1199431 1190015 1161662 1155087
11867 1155087 1121561 1066686 1021984 1015771 1028563 1022861 1008941 967415 918454 883952 873346 864072
11855 864072 854348 829141 787032 779698 755323 714761 702716 713802 717247 730556 717737 705844
11843 705844 692643 660261 644900 621952 604928 601429 617987 606153 541333 535285 542345 519456
11831 519456 537328 567443 555616 547710 547716 546109 513442 487514 501758 492876 485607 479971 467996
11818 467996 480140 492933 498687 467651 471516 447206 425879 417209 419154 411232 408548 419376 422806
11805 422806 411473 388334 401278 378709 368688 370117 351290 317197 307007 309892 319682 323444
11793 323444 331964 336820 321562 317055 326858 313224 310933 302663 298750 268324 246401 252348 227484
11780 227484 249656 287172 284864 265181 256099 245191 231643 236557 242084 242672 262032 273697 244710
11767 244710 220161 202984 194677 205185 222961 213066 227753 217671 203198 185338 190775 197033
11755 197033 219153 221236 214672 226753 227395 222460 227582 216434 188700 167616 148028 122043 126526
11742 126526 134080 169435 196158 210355 216784 205050 183079 201398 209041 198216 202001 177852
11730 177852 143547 130444 134833 134906 124015 114632 127794 124575 148234 198642 205230 170917 168836
11717 168836 144651 125465 105907 114158 100578 119212 118594 98637 96363 115982 142559 138182
11705 138182 124686 123200 128000 115347 109909 96406 114436 124968 143325 134687 111018 109109
11693 109109 118224 116522 116208 116000 107067 98488 107810 109893 110463 130536 127253 124022 111787 105281
11679 105281 99537 98930 81258 71720 61189 86383 67371 68468 71381 77665 89858 90879 50971
11666 50971 54244 48397 58312 71894 83832 87601 86717 94638 100155 95676 101315 100601 101131 91005
11652 91005 88521 93712 118883 121831 105768 100814 104343 115292 120541 118072 107245 71560 62494
11639 62494 69658 63766 67915 69014 89377 68583 68679 63623 60873 65594 56943 57767 67934 78475
11625 78475 70353 57068 54059 62502 86889 100472 82557 54459 32147 28675 52198 59572 51440
11612 51440 70968 96232 88004 63077 43605 78270 86431 80363 74130 46270 42678 48654 58550
11599 58550 76531 106943 116051 95636 67105 67356 51390 66250 81652 55854 48141 56886 43570
11586 43570 41183 44380 67092 51913 51414 50032 44220 45943 39944 30606 30779 50977 53518 64076
11572 64076 84175 96414 79807 79385 93843 75093 67481 41810 32108 56377 37847 25876
11560 25876 40767 33680 25272 16895 30880 22237 20455 34064 43565 59180 74618 70697 24296
11547 24296 39918 64911 38475 8248 1403 1392 19354 28026 11458 17617 47519 88784 72757
11534 72757 48616 45193 72446 73759 65510 50523 34434 41667 62708 79366 56491 38627
11522 38627 54413 63365 73751 79064 60302 39273 27000 5894 23424 29449 29425 42062 49581
11509 49581 59915 39484 24004 9435 -5691 11626 27928 38742 42299 37796 40311 30717
11497 30717 34798 46437 50676 55229 46484 43206 30579 49848 65295 34300 22407 22724 30319
11484 30319 10970 18447 -5076 -22824 -9801 -375 -24281 -21373 -9575 13055 22261 26929 23220
11471 23220 6636 -1174 14266 -27638 -21957 -12064 6667 28200 36470 37449 20499 2034 21477
11458 21477 31440 49933 38101 37548 56514 44991 52909 44938 43985 14014 47960 60820 61937
11445 61937 46453 56079 52379 55382 64906 62358 54021 67474 77068 71871 37179 6879 -9891
11432 -9891 -4485 -13968 -2640 8914 21479 20055 16256 17954 37488 35846 24701 29319 29671 5781
11418 5781 11224 20722 16461 12818 28950 37015 30879 52862 79819 85037 72567 56004 67766
11405 67766 44870 29937 21152 13289 16751 37965 13412 14941 17442 21211 33759 45446 52864
11392 52864 44650 28703 26619 52677 74514 60081 59029 57655 49960 43974 45486 41202 53226
11379 53226 59783 59731 78499 67997 81527 70610 48855 32709 39580 55579 75070 81689 62199
11366 62199 54697 35764 10065 3903 25497 28701 1222 -8623 -10902 -16254 -16478 151 -2939
11353 -2939 9735 16611 26367 23561 54802 67659 35357 -939 9703 13874 -4660 -17034 17611
11340 17611 10906 21510 49656 40295 40568 58343 62598 59111 35722 24017 28767 31427 20502
11327 20502 19992 43992 49381 35466 46471 40982 6505 4496 31814 23972 16381 20401 9535
11314 9535 -18811 3973 34846 24780 29644 9938 -12984 -1209 -5185 21527 19520 -8182
11302 -8182 829 11333 18113 33856 54003 39366 10016 13077 12711 13457 17201 22920 27418 20531
11288 20531 19666 38221 7731 -14488 -778 21639 21582 36553 49922 25646 -5030 -12487 6140
11275 6140 7641 18999 86 -185 14806 54007 84763 78893 39159 -9797 -8903 5692 22317
11262 22317 21570 11708 -4556 16124 9230 16554 8904 -13122 -30659 -1223 6791 -13461 -35426
11249 -35426 -22453 -4801 -3182 -10550 -21262 -28399 -21938 23184 28440 21606 5641 -4863 -12792
11236 -12792 25475 16730 -289 17062 47097 60957 53745 34226 33881 28083 3817 -11022 -13688
11223 -13688 -13609 1530 17074 8769 -11069 -2909 27523 56801 55038 38338 23816 36347 66572
11210 66572 40848 19942 30061 33203 30536 45335 63517 60198 52887 47103 56347 25076 4242
11197 4242 35025 53313 22013 -15578 -49073 -58141 -44502 -30426 -709 4362 -8303 11051
11185 11051 -12804 -26425 -22645 -22685 -29127 -28501 -9637 922 22093 1757 -238 31718 43933
11172 43933 36480 36538 47198 34134 42248 49894 40645 -1495 -15350 12682 17181 15357 -24139
11159 -24139 -22258 5994 25382 719 -1141 -206 3849 -266 -9799 -23131 2886 32969 9576
11146 9576 23995 42500 32794 18329 36579 13093 -14026 -529 -432 7307 -6684 -1076 -25275
11133 -25275 -39735 -46356 -43025 -13312 25106 36338 48721 32080 14072 2702 4971 -7593
11121 -7593 -18847 -13487 -11743 -5950 3840 11424 14897 5171 -24795 -20736 -19308 -29115 -7296 7802
11107 7802 23643 29167 4960 23072 23272 -4589 -10282 10783 -4498 6172 23334 29429 55210
11094 55210 52144 45936 3596 -23493 -9470 13795 38799 56721 72492 80274 75984 77619 84583
11081 84583 67702 58571 21659 -9068 -10919 14401 35705 49971 49560 46797 47382 57159 32959
11068 32959 16039 33950 36126 38593 26561 -683 -19757 -22263 -5734 5225 11346 34226
11056 34226 30746 20265 12646 -5259 18412 15927 14733 16467 12358 2821 25146 31727 49954
11043 49954 49071 41131 43967 79265 104519 118725 121843 111382 92968 79032 82062 88151 91500
11030 91500 118018 111835 98906 128616 159803 211002 208018 199021 178684 186941 180529 168213 151517
11017 151517 152201 198084 246617 274220 301508 309141 286120 249199 222445 187366 155669 150530
11005 150530 169440 172399 166550 184821 222750 223129 213384 198207 178756 146376 120165 103222
10993 103222 119389 100104 106779 115302 123987 123167 113589 105159 75874 79506 92951 96550 78142
10980 78142 44118 51678 52811 42919 57823 53190 40390 35139 23699 25424 39460 35070 10745
10967 10745 -17418 5030 8260 -1249 4719 22949 31278 18431 -9910 -33672 -22294 -19689 7199
10954 7199 12786 -12987 16339 8773 11651 11416 4711 6537 10221 29504 20288 2526 -27843 -22190
10940 -22190 7968 34182 30504 26909 37110 34540 21302 17585 21954 23224 28281 13092 16981
10927 16981 9638 -15876 4792 18187 5872 21795 38308 54207 53243 42600 35669 2895
10915 2895 -3238 24456 36352 25864 40060 26162 -4810 9382 -5982 -26652 -36836 -19726
10903 -19726 -9329 -26948 -589 21346 12631 15330 25787 35359 21707 12873 17905 443 268
10890 268 21881 -12781 -7188 1244 -11663 -27847 -56900 -28245 -5917 -2566 1041 15022 32924
10877 32924 32695 60456 40879 30478 15107 15045 18971 17744 23059 19305 15092 -2674 -10102 5612
10863 5612 -84 9993 38835 45692 25159 1914 -2323 11039 16705 20415 35501 42542 44308
10850 44308 47637 58922 54574 49846 53295 43495 47255 54267 27676 -16554 -18028 -8515 889 21022
10836 21022 8852 20403 14746 34891 46260 56315 57764 38367 32798 56046 64115 45955
10824 45955 6393 -9472 13303 24537 -1115 -19695 -6310 -1679 2966 1379 -154 15724
10812 15724 10898 21527 34144 56145 52977 63521 50759 28892 20813 21494 30607 36944 35915
10799 35915 34358 37804 25374 27535 15980 24738 43702 61012 60680 43951 45116 40733 42012
10786 42012 34637 20097 30663 48703 39485 21812 8394 31889 63308 47420 34109 58663
10774 58663 41913 38920 36787 32175 53102 30350 26806 28903 38530 35553 37273 36418 28761 17895
10760 17895 -17658 -22795 9940 3107 -738 -9126 -8231 6687 14571 6186 7004 36484 49762 53386
10746 53386 43200 8084 8342 21441 23464 23016 24845 15133 6961 624 18270 7913 18386
10733 18386 21453 24718 30680 51283 61994 77421 70912 62674 44166 19346 23363 26829 25973
10720 25973 19884 -3309 -13007 105 21305 36090 67866 93922 73446 50220 51772 52873
10708 52873 44246 52745 71573 97330 74741 56901 67703 68945 61141 70088 77686 64551 75254
10695 75254 72401 63104 74026 105571 112326 107048 110331 106070 90225 85734 71593 52585 65596
10682 65596 96503 96885 94660 93533 95202 91944 86572 70704 47071 47426 47117 46158 69323 90659
10668 90659 97672 104809 123292 110206 74074 61521 61761 92835 130543 128371 119675 121021 135469
10655 135469 169035 172765 166829 176551 193479 207863 208222 219390 220826 219296 253709 302005 312825
10642 312825 295726 292615 303584 288627 296712 294059 291446 284719 312192 360969 412263 430325
10630 430325 466117 492185 519440 569913 628714 721984 829898 923864 1000155 1108159 1234046
10619 1234046 1359522 1488826 1658562 1900640 2245266 2670281 3279883 4171547 5385794
10610 5385794 6993417 9055258 11455069 13760913 15538682 16515294 16605328 16137061 15554566
10601 15554566 15351156 15839620 17309929 19930735 23816058 28563838 33030667 35903195
10593 35903195 36667890 35484263 32927473 30142270 28260283 27890011 29260183 32519147
10585 32519147 37560570 43559613 48674870 51103958 50357033 46829896 41456758 35866096
10577 35866096 31573754 29088584 28443613 29458921 31864587 34871598 37113042 37476802
10569 37476802 35703303 32138351 27579086 23148473 19738138 17602474 16573827 16401095
10561 16401095 16836185 17463396 17775178 17288094 15911908 13858218 11467882 9181466 7277149
10552 7277149 5848954 4744747 3943013 3343020 2886691 2546776 2280877 2050765 1847179
10543 1847179 1677926 1523110 1377748 1259959 1145811 1064898 1002563 921060 846683 788755
10533 788755 743302 670233 622724 586437 572136 531633 521453 498512 480022 438692 400030
10522 400030 401433 380046 348268 331478 304530 298939 279157 243264 212513 214604 227804 210391
10510 210391 217964 222272 215822 198349 195154 182720 158162 149745 152681 133557 116564 81250 72954
10497 72954 69440 117804 141566 112405 108317 123231 149013 163599 160160 139402 129419 127848 142343
10484 142343 145918 115309 109354 131509 101915 77221 71026 77344 81613 94033 95449 62371 46951
10471 46951 46080 40452 32347 54857 66509 70630 95457 101292 91689 81414 74850 51566 55250
10458 55250 67392 77949 113129 124682 80174 71062 82492 81650 92521 77412 52754 51412
10446 51412 35956 25280 20497 64459 91910 87370 93447 80598 73935 62741 73145 76367 94034
10433 94034 72620 72397 86184 96634 97248 75886 61334 51738 51700 56842 69871 35984 -6811
10420 -6811 26926 36628 21024 9136 1638 14347 8677 22922 32362 34114 32973 22847 23492
10407 23492 36633 30555 37539 44723 48295 59015 61128 56228 50956 49095 39500 42055 54624 62274
10393 62274 87146 51784 3099 7282 35195 44480 32337 10317 19082 50723 70059 43446
10381 43446 41659 20762 2468 -8326 27243 45098 70505 60021 71449 75365 53603 40839
10369 40839 48083 26142 24039 41123 28709 22883 11877 -38601 -56250 -35390 -24800 -37070
10357 -37070 -11504 12330 22437 29288 15866 28063 24977 19281 18236 -20765 -39961 -29284
10345 -29284 -11551 5654 22805 27938 39249 75384 80321 66560 46930 54960 61323 41961
10333 41961 18170 23700 11414 27983 44203 22321 43853 48863 46141 24587 17851 25231 31433
10320 31433 34077 59303 63943 54725 66573 83022 69712 9832 836 16234 -1943 19371
10308 19371 24351 37303 42663 28591 16596 15784 5788 -303 12951 6702 -25914 -11725 28168
10295 28168 35644 33728 13144 -6997 -27491 -39797 -55215 -39347 -40745 -35870 -37099 -31595 -36178
10282 -36178 7287 47281 39861 52075 53145 37729 16256 14715 22973 16936 37086 34727 19464
10269 19464 1772 -4206 -23526 -10601 -16532 4700 14017 18966 22945 22076 34561 34349 10086
10256 10086 21151 -5477 512 -2499 9540 -8970 -17219 2032 3756 19164 11476 26435 25021
10243 25021 15060 23916 43199 55106 63099 71424 59218 52700 23646 8151 14383 11368 -12790
10230 -12790 -22021 -762 -2529 -4163 -12590 -17404 -1814 -5420 -33050 -43235 -56256 -48717 -21236
10217 -21236 -37423 -26464 -7387 -11358 -15841 -23271 432 18556 42236 47580 30499 51616
10205 51616 56316 67052 69740 50005 19455 3880 18745 27140 38796 14585 -10394 5345
10193 5345 8860 7855 -8238 -14786 -17198 -12597 13023 23891 8354 22068 2353 -4627 -3336
10180 -3336 32476 32377 15725 42799 44770 23384 -15379 2492 41513 33859 91023 120957 126036
10167 126036 117039 121725 113437 108653 125185 141071 164478 200690 206103 202773 224720 214432 193417
10154 193417 158401 142645 126043 123492 153485 203217 262646 274948 258954 249639 224511 213515
10142 213515 203608 193021 190472 189461 210173 225088 253815 254978 244906 220689 201766 193228
10130 193228 193195 165864 144942 137312 133862 121526 97539 135226 146068 120633 100878 75505
10118 75505 68528 58175 52755 40329 30207 31944 18428 17806 2265 -4980 -17687 -24475 -22265
10105 -22265 -27760 -36018 -16678 -15995 -20453 -30933 -9793 7540 9663 2384 1067 -21245 -21488 18966
10091 18966 8272 -27009 -47659 -21873 -1013 4297 -1899 -12320 -10213 -3188 -694 17030 10409
10078 10409 -2656 -250 7947 -1676 -21823 -53506 -69194 -70205 -73690 -55207 -53622 -29117 -35728
10065 -35728 -55619 -65685 -53858 -24393 3904 5229 -21750 -5214 4495 -6444 -14889 -3839
10053 -3839 21712 14036 -15877 -10228 -14605 -25390 -41553 -30041 -5154 6631 12576 23853 36428
10040 36428 21532 12783 11232 -9893 -12300 -23426 -12183 16119 17512 33153 52208 29112
10028 29112 3456 -8365 27469 66322 58790 40525 33478 52416 52719 43290 28858 7178 -41950
10015 -41950 -27767 27955 36563 28848 1291 25175 27150 30128 16903 3966 2175 11343 7281
10002 7281 -12706 -30100 -25019 -19792 -3530 -13660 -2634 5613 -9085 -3063 -4460 6175 11573
9989 11573 9850 -2345 18837 20806 1110 1571 37821 30303 27345 30500 28963 -5210 -32870
9976 -32870 -21872 -1819 9220 15299 45582 83973 94561 75904 69989 33299 15434 18143
9964 18143 17318 34003 25172 5439 -4802 22865 48090 40997 24539 15466 47211 50388 35492
9951 35492 30439 19248 37548 59973 85684 87958 105845 108454 100497 134525 171562 186657 201227
9938 201227 214515 231801 293557 305748 273783 272832 297643 325530 375694 487797 624840 764404
9926 764404 1003316 1347320 1856798 2698857 4238915 7384210 12957655 17348822 17475414
9917 17475414 16402882 14136147 8490633 4826959 3120964 2226900 1657162 1291889 1062330
9908 1062330 868821 709545 613056 534546 474287 438116 408736 397991 381686 358254 361471
9897 361471 323415 268273 218573 168530 131829 115176 109820 102981 109074 115584 118851 124828 131001
9884 131001 117884 83729 72888 71263 70583 48242 45650 46668 12426 14593 34133 38402 48076
9871 48076 41683 32491 14761 29882 52341 72264 63748 36177 50503 62182 46674 44529 38698
9858 38698 48380 37974 12675 5730 4037 -25581 -46387 -31020 9480 -5265 -4890 15036 11347
9845 11347 10157 -1910 26066 32188 48477 42296 -336 -19615 -27266 -35075 -5932 9426 -4760
9832 -4760 -19933 -25675 7860 25979 50226 56806 47093 -2987 -30942 -14250 -1306 -8695 5204
9819 5204 2560 -18023 -42717 -31304 -6693 -25623 -21348 -40341 -63059 -35048 2417 33228
9807 33228 28092 -8449 -31524 -56264 -70346 -47132 -36843 -44714 -29324 -31250 -8151 -3997 7353
9794 7353 -5065 -34423 -28942 -15628 -26149 12751 5540 -15560 16631 29883 16386 13614 18920
9781 18920 14518 7566 2168 -13135 -10072 -391 -305 -9170 -20017 -8976 14320 21912 -194 -31390
9767 -31390 -47408 -54163 -35501 -29719 -39054 -16189 31100 47648 49170 39858 -3487 -25254 -25274
9754 -25274 -30734 -37888 -21969 -33782 -29842 -23043 -34631 -22142 -25353 -21156 -14216 -8892 -15959 -12577
9740 -12577 -2359 4214 6928 -11333 -21878 -26930 -54854 -64369 -68530 -74775 -58591 -4582 15852
9727 15852 2684 8722 35657 39161 13487 4072 7631 -14696 -20508 -14807 1580 2864 -2370
9714 -2370 -16990 -2851 -14581 -21948 -17105 33543 58918 61054 45437 27919 33243 33271 27301 4088
9700 4088 188 8406 13074 8612 13833 18614 22854 2619 -32916 -35183 -37734 -52809 -41622 -36700
9686 -36700 -30716 -16438 -22955 -15285 -13833 -26331 -9157 -5455 -7497 -11819 -27090 -38014 -15727
9673 -15727 17013 12914 11643 16157 17405 11101 -8048 -5587 5951 7211 -11013 -11226 -2320 10325
9659 10325 8855 -18665 -27599 -23058 -5219 -11109 -31755 -28167 -27883 -20005 -20610 -27782 -15121 20042
9645 20042 51375 82102 107263 107479 91297 107067 109690 83161 39611 14244 -2081 729 8758
9632 8758 15296 3882 -3297 -1361 -2805 6081 30900 9018 -6424 13657 3020 -5292 26899
9619 26899 60585 52096 40541 25399 26420 13320 -1684 -9250 -29362 -36152 -19495 -11528 7186
9606 7186 12828 30810 49631 17634 -6970 -1550 2901 4276 -18589 -13755 13111 17458 23373
9593 23373 7523 -8384 1108 36099 31489 37072 18689 -12432 -49814 -60503 -36316 -29313 -11065
9580 -11065 7020 12810 -1585 19550 37986 39696 18873 10870 26947 16625 -4496 14466
9568 14466 30955 19991 1352 -22010 162 20612 -5095 -12625 -26201 -41171 -25318 676
9556 676 5358 5503 -4255 -2888 -7652 -18946 -18510 -23474 6047 18190 24245 5725 -9717 -25147
9542 -25147 -47875 -32020 -12120 -9375 -45472 -42003 -22239 -24234 -7613 1484 -13559 6566 24313
9529 24313 26255 -204 -31788 -34690 4282 23578 15689 4714 -1694 -9991 4581 9007 37565
9516 37565 56230 65062 58517 56010 75505 88698 55534 10676 -32276 -37340 -19299 -11114 5557
9503 5557 -4672 -24576 -29130 -44161 -57022 -59997 -28686 -4768 29184 24396 6624 -26455 -52069
9490 -52069 -45515 -36346 -35431 -24440 -41898 -33360 -12307 -18625 -8313 11289 22544 23003 16392 -2873
9476 -2873 -13073 1563 40649 60907 78302 32688 11948 -9325 -3904 -11950 -12106 19554 14543
9463 14543 -867 -18177 -26374 -25492 -12449 -37005 -45309 -22555 -17570 -542 5444 -15546 -47586
9450 -47586 -47701 -45777 -4541 -6750 -15369 -14849 -18115 -8110 -1179 -17977 -22322 -5334 -19033 -24899
9436 -24899 -18304 -1033 12700 -176 -6020 -11353 -24126 14224 43740 30653 -7136 -22130
9424 -22130 1759 -22978 -34185 -7815 -32565 -16616 -1096 14292 17392 10419 3213 -19983
9412 -19983 -54719 -66653 -48172 -35034 -12225 -13440 -34141 -36787 -30558 -28097 -62901 -75645 -61044
9399 -61044 -25331 -31306 -35286 -23632 4558 -10262 -12735 12703 8821 727 7379 -5350 -22725
9386 -22725 -37338 -43476 -40701 -21235 -4814 -12180 -22168 -44342 -48860 -18678 12155 33449 38483
9373 38483 1072 -26272 -36909 -62751 -45674 -1769 3908 -12704 -11718 -4282 -14833 -7562 14746
9360 14746 17408 18718 29677 10814 8940 -9975 182 -3792 -4822 -2093 -9590 -13661 1485
9347 1485 8570 24066 24609 8074 24919 24491 29709 51967 11897 3740 -14118 4681 -987 24832
9333 24832 19473 15048 12627 24988 29914 21717 12356 5183 1853 -24653 -10000 6884 23814
9320 23814 6333 2480 1004 -558 -23776 -23409 -35533 -24776 -18430 -16929 -23437 -23102 22875 56186
9306 56186 57986 36590 19816 26233 -2048 17524 2635 -8050 -9643 8513 -1356 -16832 -12259
9293 -12259 -1123 7394 -23808 -25585 -10329 -3676 14739 44545 35199 14750 4653 19607 13623
9280 13623 -3188 6476 19683 59761 68007 34048 -3442 -37445 -31008 -12145 3473 7935 16450
9267 16450 5590 -21500 -39295 -21103 2000 7460 -3117 2457 7450 19321 25246 8061 16319
9254 16319 22045 28754 26515 12530 32370 33836 37219 7657 -11869 -3140 -12047 -8397 -3258 3513
9240 3513 27150 22470 13917 4520 -5099 -10767 5809 27270 42952 41469 44979 57075 55392 32732
9226 32732 33202 30124 42778 67353 47200 28136 18187 -9034 -32511 -22041 3905 -15118 -9319
9213 -9319 -4598 -6398 23121 25925 -8597 -33564 -39509 -34754 -13476 -26872 -26084 -9038 -189 25400
9199 25400 8772 697 -10916 -5247 13650 38675 55063 48899 40499 9981 1173 -308 2044
9186 2044 20191 48893 48693 19400 32896 43573 29002 35485 40737 19413 39976 17164 2094
9173 2094 137 -4280 -15224 -23489 -34314 8977 54071 67802 52333 25668 13955 -14988 -27167
9160 -27167 -6086 12124 6497 -7098 -7040 -3472 11464 16686 6124 9543 13021 -27022 -27381 -8402
9146 -8402 -5507 -28162 -39051 -27022 -16272 -45751 -33305 8502 -13243 -8451 3091 -6881 -7637
9133 -7637 -3199 -14262 -43269 -60732 -69163 -22847 -24019 -18375 20576 7496 -14183 -9367 4835
9120 4835 4172 14161 10201 7030 3669 -4443 -6487 -6184 -2578 -16560 -9064 -12586 -10350 -15359 -4633
9105 -4633 4178 5291 5917 4317 -34267 -49475 -24416 2129 17141 13916 -559 -13543 -2466
9092 -2466 -6744 3736 21377 27336 25041 20884 22013 2158 -10058 -12607 -17408 -4381 -8383 16825
9078 16825 42534 40337 28259 26784 24425 15596 4234 -24242 -13316 -3921 -6685 12712 29831
9065 29831 25304 33059 21328 17655 48112 65329 30796 30159 32882 36467 37999 5341 -9093
9052 -9093 7038 25622 30157 26177 30891 48514 56576 30826 18727 44191 69198 88243 78801
9039 78801 62417 50193 46224 58704 74438 54880 19891 32885 43707 49553 52256 54358 30264
9026 30264 19445 -6358 -12430 -11597 -30207 -36461 -22111 4599 32165 19318 27074 50179 80835
9013 80835 73303 46170 20076 -3250 2340 -809 -3998 -13787 -7297 3404 13208 2400 -8736
9000 -8736 -21686 -49236 -51206 -27375 8289 23129 2654 -1148 13031 5667 -18827 -22348 6294
8987 6294 22092 17002 39770 20518 -17494 -22719 -19895 2426 36728 30994 34419 40003 40723 42921
8973 42921 28441 12930 3690 27582 14498 17101 16462 6369 -1390 -119 -10235 -6186 -13510
8960 -13510 -30551 -24540 12961 14475 26848 37469 45385 28783 33070 25296 4264 12362 9946
8947 9946 -24876 -11903 5369 -9919 -25539 -46020 -67586 -49625 -33872 -44797 -51759 -32789
8935 -32789 -23708 -36623 -54257 -27046 -13256 28558 42295 45944 66847 56744 48289 32452
8923 32452 36985 17974 6603 11941 13064 10324 11766 20270 407 -39895 -28370 -11168 4525
8910 4525 -949 9314 15551 15444 4560 -12811 -17312 4251 20298 -9623 -3709 11660 3328
8897 3328 23777 25944 38283 31839 25168 26532 11417 6209 8453 23110 29297 10816 5677 -281
8883 -281 6108 6707 17596 -10978 -24905 -35499 -11146 5647 5479 -17973 -34750 -24358 -4761
8870 -4761 20297 3591 3313 6173 1372 -1718 -14480 -19899 -5923 771 13397 31096 30723 2803
8856 2803 -1492 -9576 -28896 -29353 -8086 -9009 20703 43335 41931 42972 83336 83480 52403 20302
8842 20302 12138 3000 -6168 -21443 -19955 4473 13870 20837 10049 8868 -1772 7297 24049
8829 24049 38671 31058 49625 81895 153815 198928 248083 268148 261294 219611 176101 154930
8817 154930 114553 110360 105369 46814 16554 -6173 -8470 389 -8649 -496 4908 -9683 -13628
8804 -13628 6386 7200 -30346 -38318 -20057 -25970 -20346 -13164 -7230 2565 18050 37712 46351 35388
8790 35388 7056 17090 40155 34621 19189 -12445 -24353 -15684 -15286 -7763 41543 52044 40676
8777 40676 -2517 -19167 -3738 -12052 -23469 -23949 -2327 15459 17823 6236 17636 34589 40691
8764 40691 30348 13005 -14030 -3950 -9503 -23585 -22225 -36900 -9702 15321 17525 -2233
8752 -2233 9135 18374 26246 20889 -5042 -1707 -5730 -5346 15203 7152 -10319 -6904 -2466 -5244
8738 -5244 1613 40042 50055 45611 52639 51969 38035 24466 24581 39797 71454 72513 64943 57827
8724 57827 23650 -14191 -27621 -833 13155 -5331 -15428 -2971 15723 22078 14790 13386
8712 13386 28861 44511 63403 58488 67743 41539 5811 22004 23685 -11307 -11539 19417 1675
8699 1675 -4041 3599 33982 66359 95728 129012 151576 171583 194874 190557 190006 180198 154134
8686 154134 128174 120392 81643 72402 82837 93571 85052 73279 39929 47153 71021 70832 70938
8673 70938 68208 80227 59429 62444 62876 69375 67008 54192 42648 16926 37984 83122 97516
8660 97516 99159 85576 103047 123645 150997 164337 161829 134343 99069 107110 132200 123074 122211
8647 122211 108798 113799 111618 91299 110626 116068 118328 93550 93589 104213 95300 110053 113223
8634 113223 94516 65405 84635 94889 101916 84921 83250 87746 83510 93431 76149 68484 75036
8621 75036 77248 79713 93910 95447 94908 106426 104576 126767 136161 143800 144779 155780 165652 180940
8607 180940 197105 172143 145756 137292 122921 143075 160837 178258 194533 189794 195596 240464
8595 240464 253995 277196 308143 332333 333502 331535 338213 373096 395108 420992 443840 439996
8583 439996 455481 449150 472395 471515 444914 399093 375138 373014 333018 292067 264354 294796
8571 294796 310441 267964 229494 226959 223974 230990 239946 233072 232543 250358 223293 209883 198639
8558 198639 186828 180659 161187 142725 140165 125596 126690 125053 140848 134135 106672 75098 71245
8545 71245 96259 104068 111283 111711 93109 82098 63954 46091 36668 45706 41508 37765 28759 42078
8531 42078 39729 43638 21423 12288 17339 36174 46698 54526 63945 77175 86413 54873 37927
8518 37927 14601 -10566 -8258 21981 48609 63605 73148 73269 63239 13126 9344 44078 45601
8505 45601 31144 12222 18363 14354 12594 4842 -4620 -2094 3366 15605 -17399 -14613 15177
8492 15177 36303 28602 37757 40016 41623 50017 52452 45677 26859 2605 577 -8826 -134 5998
8478 5998 -1970 -23944 -9959 -10153 -18535 -27310 -27092 -20773 12032 33866 24030 16583 16902 16199 18497
8463 18497 -3174 45017 58669 69274 58593 27342 3433 6342 38504 60661 64437 78187
8451 78187 81871 92761 103855 78972 31820 15593 7918 22044 16636 14135 23323 46224 49572
8438 49572 31082 22731 39782 80471 93951 99592 109452 100049 70434 38983 36593 39635 67330
8425 67330 56744 53234 54036 70003 80412 61681 50627 29395 39115 36190 45518 54513 55617
8412 55617 67821 75879 66839 79735 48472 27785 14625 -477 3564 1772 -13349 -3925 -13685
8399 -13685 -28407 20401 56736 57729 69292 61455 44989 57110 77132 93962 51150 21034
8387 21034 22444 10462 12201 37292 17036 11586 15646 14376 26384 5388 -6562 20575 11703
8374 11703 -2208 7166 4003 13188 -2836 -12249 -13276 8911 25348 32212 38829 38403 24422 43320
8360 43320 37943 20071 29852 -7603 -4452 933 9605 45599 49361 29227 14033 21159 40431
8347 40431 17859 20642 5933 25183 35290 31158 3381 -16617 -21048 -20595 -15262 -23503 -6496
8334 -6496 -13071 -8053 24734 -2405 -28867 -30336 -34701 -13335 -954 12717 6075 21102 -8954
8321 -8954 -16024 -27315 -21302 -22776 -37962 958 17980 4464 17096 31364 20221 20414 26919
8308 26919 19986 29852 17640 -1456 -4709 15825 10206 12654 32065 56491 41217 12179 17238
8295 17238 7354 365 1956 -1766 -4618 17861 46339 29815 1065 3274 10617 -33066 -53400
8282 -53400 -37439 -29830 -40973 -27925 -18494 3906 20540 18063 27286 47870 16449 -34370 -28392
8269 -28392 1658 12259 29660 40867 30402 11989 19086 26068 51486 64349 30054 -31727
8257 -31727 -45539 -40050 -19604 -8945 -10236 -11045 -18960 -4678 36906 54673 29197 -7974 16199
8244 16199 31076 25841 -9128 -18671 2415 -229 -3283 6639 -953 -336 -1246 -8888 17744 22043
8230 22043 13774 6528 31057 27576 -803 11993 6139 -18625 -4442 5478 -26021 -34722 -9277
8217 -9277 -18447 -6121 12923 -16572 -34888 -44456 -47959 -28395 -4756 -14665 -18911 14350 56131
8204 56131 57480 41697 44088 49947 8158 -35036 -1236 37982 46584 33666 16516 -4710 30493
8191 30493 44169 24869 -4468 -25839 -34623 -35801 -26366 -29872 -19878 3396 6785 9502 17882
8178 17882 12707 29790 895 -9722 -2769 -24952 -31141 -56233 -59066 -19040 -9471 -14585 25453
8165 25453 55580 43186 9872 10087 -4251 -24198 -33553 -7213 -1391 -11102 -12269 275 -6106
8152 -6106 -17353 -36454 -43653 -17451 -10668 -8283 15700 -11124 -30187 -25245 8842 -4254 -8515
8139 -8515 -15003 19702 26129 8040 11238 -1564 2748 52487 116550 151045 175535 175059 144096
8126 144096 89147 43367 46724 19435 -16349 -28727 -44537 -44355 -38936 -29979 -35474 -42804 -22079
8113 -22079 -16692 -29651 -22844 -5617 -12039 -22256 -24377 -30644 -26819 -7414 31281 40631 43838
8100 43838 65647 36107 25438 37118 38524 25060 39994 75857 72202 91510 117056 146788
8088 146788 159478 146480 110653 99290 80018 59952 42612 4714 -24384 -9375 10474 12706
8076 12706 -6501 8312 25820 13448 -12957 -7954 7062 1062 35795 22254 -3662 -20534
8064 -20534 -38350 -23755 -42169 -51614 -46573 -44592 -40311 -18683 -5591 -8210 5696 30765 26806
8051 26806 15021 21266 36697 31342 8180 20817 16269 4366 -23002 -13750 35241 62389 44844
8038 44844 21963 19835 30094 38044 36985 17683 18084 12944 16880 13035 13864 15838 27643 64216
8024 64216 59734 66752 57946 65930 85645 65161 65451 90612 108562 102746 91890 84184 105365
8011 105365 121973 134275 157214 162044 163851 163843 127804 133646 144561 117124 103487 119816 137261
7998 137261 143949 164297 195679 200571 168056 120837 105798 103342 111410 119732 116530 93693 81420
7985 81420 98135 111777 116501 143183 199176 210948 230325 262599 312525 373457 479584 578942
7973 578942 724115 809680 819544 781748 684779 586062 452970 334639 295879 280533 281987
7962 281987 284927 269811 227110 178512 155124 139387 128963 124959 128979 145685 138504 121493
7950 121493 117050 139973 150378 152721 130783 123817 105507 113020 132921 148286 156256 177142 220136
7937 220136 259610 272422 304882 338532 400011 474679 571426 652116 673977 634960 572621 466425
7925 466425 398200 354096 292219 262980 268525 258132 232294 185197 161617 153210 120381 115519
7913 115519 120334 125416 128244 112621 103688 110904 109203 101416 51913 12925 -3296 16956 51614
7900 51614 79698 109307 130632 124061 123007 146671 157807 148181 111340 82560 79458 95399 83256
7887 83256 63429 62858 83375 97719 124843 110855 94501 69272 61360 48582 25111 12072
7875 12072 -7192 4 21673 34196 8489 27611 47758 16669 -9282 -4421 9021 11369
7863 11369 10835 4569 19344 -11190 -8578 12224 21689 21074 6049 7015 7166 24564 22242 19158
7849 19158 25094 13493 -12056 -42221 -18427 5368 30491 23031 2591 -7286 -23095 -49135
7837 -49135 -41977 -11296 6647 15004 13987 -3068 -32234 -48458 -31322 -8855 -21194 -7434
7825 -7434 23354 29641 16560 7568 11771 -7653 6669 10670 -6841 -17450 -28892 -32027 -4741
7812 -4741 12963 23328 21496 -2455 -14544 12263 9743 9000 22500 551 -26970 -30563 -3408
7799 -3408 -6361 -11679 -19811 10636 27361 4146 6289 4704 -9504 10227 33423 25378 5216
7786 5216 1279 7835 43249 28727 868 -34162 -60860 -41456 -19632 -5530 -1633 -14653 -10829
7773 -10829 -20669 -35537 -36818 -36047 -13114 -16037 -30189 -17350 -16222 -12861 -20630 3731 20350
7760 20350 -1457 -11933 -27049 -22935 -8446 -20631 -13745 -13920 -29342 -42961 -54873 -48791 -36661
7747 -36661 -4624 25901 15772 -6021 -41469 -32377 -19132 -15508 -29663 -24732 7400 -19047
7735 -19047 -28557 -14116 978 4103 -10526 -30689 -25509 -6182 -493 -33690 -38606 -26669 -25282
7722 -25282 -26405 -27508 -3393 27479 1802 -26845 -32333 -3379 27281 27508 24416 18895 24580
7709 24580 18945 17838 28954 16880 351 -36960 -32160 -17849 -2365 13922 4149 -1504 24509
7696 24509 11610 -22266 -27995 -20293 -19112 -5178 -7468 -3791 -4978 -2497 2452 28951 20853 11542
7682 11542 3293 518 7189 -1011 -14113 -19913 -11971 1206 -4358 -12471 -11536 5838 15211 2494
7668 2494 14721 -4790 -9389 3042 -3044 -18204 -31860 -37082 -42116 -40871 -38627 -39327 -34842 -3846
7654 -3846 117 -293 30404 46734 31774 35165 19544 -2098 -16543 -11556 11763 26181 35372
7641 35372 12102 3167 -2149 -13169 -11254 2703 8859 11314 4542 -27115 -34949 -1944 37061
7628 37061 23248 -12203 -52859 -37032 -19892 -20961 -43562 -50521 -19974 20460 6568 -16936
7616 -16936 -6885 -19076 -26007 -45879 -48376 -41971 -27436 -36510 -35146 -18599 1419 -833 -1916
7603 -1916 -17612 -30688 -22333 -20205 -10696 -28945 -51730 -52605 -33268 -13753 -22579 -45591 -34757
7590 -34757 -217 16512 11145 19075 24173 30210 32891 8441 20826 20910 -8745 -12372 -32518 -12298
7576 -12298 16277 -355 -12027 -30041 -24837 -22497 -17724 -17629 -31408 -26548 -34058 -24847 -26681 -18236
7562 -18236 -7500 -12638 -20386 -22420 -40544 -27116 -30144 -14213 -385 1274 -30073 -29993 -14031
7549 -14031 -14018 -7597 -13123 -2309 12425 -7976 -32704 -41432 -43476 -49921 -59705 -16740 11002 -29821
7535 -29821 -24778 -6218 6112 -8880 -2612 -4851 -6637 -22194 -38895 -23309 -8922 -11408 344
7522 344 6137 -7965 -23918 5620 -8858 -37084 -49490 -52509 -54973 -43511 -32502 -31957 -25982
7509 -25982 7048 19164 31119 22074 28934 19422 25693 -1138 -32246 -48853 -51242 -54723 -38396
7496 -38396 -21237 13446 914 -14699 -24259 -46389 -28436 -12365 4104 15560 2632 10054
7484 10054 29354 8834 -15212 -48342 -40822 -11882 -2541 15505 11908 40235 46159 44692 21330
7471 21330 -694 -17727 -14730 -5950 8639 -261 -21500 -35810 -64348 -81637 -64858 -22309
7459 -22309 -25505 -43502 -38828 -29037 -6074 8474 15737 41987 43637 5473 4608 15233 10317
7446 10317 -15395 -7432 -22351 -19157 -6407 -32150 -60173 -29471 -30032 -32478 -7118 25986 28113
7433 28113 28833 1659 -17041 -31457 -40028 -13502 -9575 -17722 -46092 -34875 -44684 -36620 -39627
7420 -39627 -49068 -34349 -31059 -21706 -15911 -8749 -20852 -35032 -32323 -19934 -36752 -45943 -24302
7407 -24302 -17603 -3415 -2833 21928 5476 -13802 -5124 -12604 3843 -6866 -15135 -35737 -50874
7394 -50874 -58759 -56478 -40811 -17495 -16409 -37636 -59627 -47060 -48391 -45459 -54486 -43931 -66948
7381 -66948 -53535 -35685 -23946 -26949 -14818 -9855 1660 9090 -14349 -32605 -9040 5490
7369 5490 -11870 -21593 -43855 -33128 -13697 22495 1995 -21039 -39819 -31649 -46806 -60091
7357 -60091 -52200 -50139 -42849 -71861 -64023 -23666 -14177 -2097 -3489 -5995 -15331 -23685 -15311 -5347
7343 -5347 7499 -6559 -16261 -12277 -3798 -3861 17603 12095 17452 21754 31337 53782 69990 62174
7329 62174 55381 37626 20387 11320 -3008 26865 42238 40162 49546 49902 18498 -3824 14033
7316 14033 8027 618 10453 31910 43722 28381 30801 30017 2254 -11232 -46643 -29100 -10686
7303 -10686 -22628 -31780 -16994 -7934 -12923 -16222 11624 2983 -29932 -45630 -30163 -34472 -23097
7290 -23097 -21078 -44563 -52613 -38297 -10519 -26732 -40221 -21381 4840 3297 -895 -5947 -7774
7277 -7774 -14930 -5695 3122 31604 29904 34228 25121 21313 9798 11588 -2389 -5337 26618 21938
7263 21938 19404 -1753 -15357 -21926 -3174 3548 -30893 -18029 21443 28857 29780 30629 202
7250 202 -7327 -6112 -10673 -1327 -7041 -22220 -15470 -34053 -41209 -36870 -42337 -61360 -69432 -56605
7236 -56605 -42721 -58478 -73663 -56010 -29789 -3397 -137 -39407 -39360 -14060 6081 4007 -10592
7223 -10592 271 9724 10739 34408 3857 -11236 -19670 -34043 -22147 -6160 21670 1882
7211 1882 -12483 370 5969 -1572 -28376 -44443 -42143 -38249 -23651 -10187 -8462 7710 30501
7198 30501 29558 12795 -6598 -12488 -11745 -31227 -36763 -26921 -7794 10105 18487 10303 12670 -1838
7184 -1838 -13947 -5915 -4637 -5575 -17672 5858 8065 14611 21196 29663 28970 30844 52786 27226
7170 27226 -7463 -6695 -26277 -20617 -14807 -26034 -41963 -3505 18946 -6531 -20994 2559 20136
7157 20136 4834 13682 -4949 -78 -5069 14486 14880 33416 23054 26643 48717 53460 61553
7144 61553 55338 28454 28177 2914 -23933 -27435 -12362 9833 -196 -4926 -7401 -21948 -19094
7131 -19094 -3675 2767 20795 14594 -10430 -50996 -61767 -30727 -29712 -28079 -27419 -25037 -3490
7118 -3490 10669 15707 18499 740 14642 25220 8054 20347 -6037 -3670 -2719 -3309 3239 -17328
7104 -17328 -25006 -3678 -5365 -1 274 -4746 13367 1334 -4807 11757 1179 -31539 -10636
7091 -10636 31846 44967 33173 8213 -8213 -8558 21192 47135 28687 10897 -1392 13474
7079 13474 29889 47187 45929 12820 -8936 16952 2094 20943 45875 35758 30139 18727
7067 18727 3084 6022 -32551 -44209 -43573 -43681 -22999 -20130 -14236 8325 30140 34656 47152
7054 47152 48419 68941 68392 60263 35098 16427 17844 2520 -34889 -53336 -32362 8582 22357
7041 22357 18229 -4145 5784 9988 16447 15343 11261 2368 444 14462 19429 23325 16769 8524
7027 8524 -8671 -2706 -19144 -19611 -30079 -59869 -58488 -67884 -50728 -47482 -39837 -27006 -28221 -12921
7013 -12921 -1161 -284 -22223 -10233 19431 34479 41491 26118 41773 52998 37641 22792
7001 22792 27469 28646 10278 -905 -8989 -4100 1359 24651 2172 -1297 5413 -5636 23796
6988 23796 39716 17073 16173 18270 8946 -21039 -46646 -49302 -51744 -14894 31686 17582 10784
6975 10784 -10494 -25660 -19038 -13054 34318 39413 16807 1194 8765 6699 -17802 -30404 -5888
6962 -5888 -8523 -13891 1293 -15091 -19701 -21801 -7337 10025 9118 25586 20554 13165 -10537 -11971
6948 -11971 -20585 -30576 -22249 -17239 3266 -8054 -16628 -11463 7022 1379 -19209 -18781 -31307 -344
6934 -344 -2200 3004 2949 -2262 10003 22978 -2461 -19860 -6714 11489 -4848 -22238 -18290 -25527
6920 -25527 -23375 -19867 -35532 -28346 -6766 4029 -13654 2377 -3981 -2783 14410 32553 24569
6907 24569 5684 -15068 -3109 7935 25538 16025 -137 -10155 -22297 -22299 -35941 -37910 -20215
6894 -20215 -20107 -35226 -9579 -5869 -17889 -24780 -23545 -17126 -16773 -24938 -27690 -7822 -7245 -8323
6880 -8323 -19437 -21286 -18245 -20633 -54293 -57906 -31324 -10630 -28294 -23175 -253 9001 -4939
6867 -4939 -33094 -24963 -49648 -46995 -53090 -62678 -61436 -32213 -24218 -44534 -59505 -19432 -15223
6854 -15223 -11339 -125 25831 -12840 -24287 -33028 -16087 -16519 -20517 2919 29874 9807 -5733
6841 -5733 17511 26672 29379 19475 34806 34907 13005 7514 5908 22732 6970 -4569 -13433 -23395
6827 -23395 -30971 -43926 -16638 -14137 -38162 -56188 -46738 -29810 -26426 -9617 -7628 -38544 -78137
6814 -78137 -65575 -42888 -38963 -32631 -21562 -17404 -41238 -13707 11242 29645 37830 19334 7461
6801 7461 -22739 -20428 -5929 3693 -7130 -24289 -16335 -84 -14377 -36270 -44579 -64429 -39742
6788 -39742 -5747 -8119 -16872 -10991 -9578 3680 -4552 -43936 -60405 -45549 -21500 -15383 464
6775 464 940 -11802 -15901 -5608 -10891 -2035 5415 -1383 11629 4090 -20090 11380 24730 19729
6761 19729 8882 -3066 -26541 -22525 -28185 -45662 -48230 -36979 -18410 -31149 -54618 -52627 -41668
6748 -41668 -59101 -73287 -60512 -54181 -52952 -39778 -28019 4398 19420 -4239 -12129 8565
6736 8565 11577 9987 -10630 -41121 -21330 -21170 -14056 -20731 -24259 -9025 820 6521 2298 -33003
6722 -33003 -45026 -46746 -40978 -17176 -12172 -8332 -12921 -11911 -21564 -45662 -46556 -49838 -26365 -45507
6708 -45507 -61201 -65313 -61466 -82583 -74519 -47915 -36530 -38536 -20567 -17116 -32955 -49460 -35815
6695 -35815 869 -15443 -14919 -10623 -34162 -26353 -12191 -28558 -47188 -49572 -38499 -22559 -13117
6682 -13117 10535 4299 -12616 -27905 -18753 -14958 -10345 45090 37292 14342 28846 1530 -31912
6669 -31912 -806 28238 36059 46676 12150 8040 9654 -2402 -8375 -21512 -14343 -4579 -744
6656 -744 -10503 12527 27432 44011 31177 -1472 -14293 -10279 29777 30762 -4587 15194 29347
6643 29347 18076 9869 -22960 -5615 3282 -23257 -28603 -32979 -30625 -18790 -22066 -2510 -6636
6630 -6636 19459 14382 769 -244 23931 13440 -15764 3424 -444 1292 21539 -97 -26657
6617 -26657 -18620 6318 5019 -14851 15503 30787 16086 -7526 -18476 -14503 963 18920
6605 18920 294 -6187 -9099 -26355 -54443 -55491 -33292 -14650 -15581 -22297 -11720 15565 4876
6592 4876 -7074 -21813 -22596 -13372 5772 12025 -773 -14514 1959 4196 -3179 2674 12113 343
6578 343 15229 15696 17337 22841 8698 -4733 -51280 -52578 -29619 -43662 -50901 -23605 -23878 -54321
6564 -54321 -34957 -4661 -5208 25138 25584 -8981 -54025 -37983 -7990 -20654 -37960 -9046 -11660
6551 -11660 -20854 -7718 -9446 -17132 1547 -8886 -14152 -12600 1148 -1218 -38459 -57148 -50732
6538 -50732 -28500 -18259 -1279 6595 890 2755 20618 29036 13610 3626 -129 -5662 -22447
6525 -22447 -15149 -1945 3788 -353 -30874 -18160 4652 33348 22583 20721 6499 13879 8295
6512 8295 -27789 -28283 -8965 -13539 -26975 -38128 -46954 -35440 -42701 -55564 -39298 -51579 -52130
6499 -52130 -36853 -39342 -40436 -46773 -26580 -30579 -144 12713 -4581 -2748 -4488 -12341 -33734
6486 -33734 -35585 -17108 -16854 -33290 -34286 -31054 -7578 -2409 -20224 -12401 1345 6862 -9941 34719
6472 34719 35686 52434 48564 25544 -9644 -2150 25300 6544 -6430 16393 9054 -28751 -26727
6459 -26727 -25444 -41151 -22097 -8024 13225 16625 -1857 14070 18769 19140 17426 10654 -3976
6446 -3976 1910 33026 43668 45830 32696 30659 43998 4064 -27997 -7359 31399 30147 -9193
6433 -9193 -25475 -29711 -18787 -8196 -7925 -10517 -17068 -8726 9571 21182 6577 17509 11695
6420 11695 -17564 -50133 -55103 -38495 -21904 8060 -26838 -28542 -27252 -1071 -6950 -36222 -38104
6407 -38104 -43109 -48582 -49931 -45564 -35908 -34018 -61931 -78172 -45232 -13599 -11523 4600 5042 -11367
6393 -11367 -7743 19288 -2913 -25943 -33701 -42258 -47618 -19632 3030 7549 -10653 -18590 11354
6380 11354 18718 32820 24196 26530 50700 51708 20313 -6836 31127 44369 48680 16751 -19402
6367 -19402 -23442 -11138 -10801 7983 17665 -13998 -36099 -23981 -10180 3311 16485 -4127 -18004
6354 -18004 -23411 -9981 -2407 -13729 -9458 -14 25726 41403 -4017 -17342 -19301 -29057 -27427
6341 -27427 -15823 -2796 12182 25340 40819 12954 -4004 -780 4168 23356 35028 44617
6329 44617 38913 28397 1208 -46465 -39102 -51730 -57083 -41635 -47495 -45434 -45307 -48132 -19957
6316 -19957 34598 42482 18369 -1116 -22170 -29876 -48050 -35736 -2951 -8751 -32933 -54678
6304 -54678 -62484 -38246 8030 19386 33714 41889 25520 25364 24797 10540 4939 -7108 3439
6291 3439 7540 2468 -8046 -25230 -14826 13273 33391 7416 -238 -4199 -7174 -4449 -6100
6278 -6100 -27880 -36029 -43331 -33825 -23725 -19598 -27663 -28582 -31343 -22398 -11804 -188 -28063 -65856
6264 -65856 -61685 -51431 -40840 7557 27683 28755 36615 20414 -27097 -20540 -6657 -11351 -8538
6251 -8538 -20461 -22845 -19271 -11897 -15753 -25918 -19837 -18629 -8443 -26155 -18331 -30508 -52461
6238 -52461 -55888 -23837 -7130 -10654 -16951 -11652 -13508 -10060 -8290 -10909 -19555 -7430 -8980 -25021
6224 -25021 -22522 -4212 -6279 4466 5409 3245 -22620 -21867 -16172 -12478 -6622 -26317 -40999 -46782
6210 -46782 -56454 -47334 -25657 -31025 -34903 -6297 14946 17830 27645 431 -23039 -31340 -47804
6197 -47804 -26889 -14798 6280 -488 -3650 -7684 -10236 -6553 10337 24626 9898 20641 8544
6184 8544 5524 7104 -4785 19722 20004 27348 31053 20425 1504 -6396 15215 8809 -18984 -27654
6170 -27654 -12322 -4564 -22889 -42315 -19686 8359 -741 2237 -26275 -39162 -48710 -54441 -48259
6157 -48259 -44692 -23085 -4471 6623 8980 -7933 -12962 3443 -4971 4915 11728 -507 -30074
6144 -30074 -31444 -19865 -25648 -5067 6596 3697 27345 21057 12650 12054 18821 17146 2260 -22559
6130 -22559 -49396 -73349 -46142 30210 26930 13763 -5996 -2588 -6061 -9998 -9929 1577 -12934
6117 -12934 -23144 -38981 -34533 1352 7692 2805 8517 -1352 -19672 -27235 -17039 -3664 8104
6104 8104 -14315 -11972 -11156 -2631 10642 35800 23430 10473 -20077 -47112 -50500 -46543 -29959
6091 -29959 -30355 -47700 -32016 8341 35250 14778 -15131 -11451 -34583 -28540 -46270 -41468 -24407
6078 -24407 -6177 22119 40266 9642 -13941 -21855 -30658 -32006 -25667 -17661 -18586 -35423 -35040 -46290
6064 -46290 -49718 -32134 -24504 -5893 16501 19136 -32691 -55735 -70652 -87338 -85899 -60688 -45320
6051 -45320 -33721 -27097 -17008 -5101 -2803 -36280 -64018 -29459 -4732 10350 17032 28711
6039 28711 27427 18309 -13122 -25573 -15603 5960 4386 8340 16391 1293 -23391 -22610 -27758 -18714
6025 -18714 -11727 -46225 -42569 -20269 -26490 -37237 -65878 -46350 -16706 -9404 -12029 -7668 -19686
6012 -19686 -2302 -894 -11029 -14445 -11476 19693 28630 -1333 -23475 -27114 750 10174 11156
5999 11156 12201 6768 17606 12095 15868 36466 27821 18679 3849 -7978 -20743 -12041 -40410
5986 -40410 -29647 -29489 -38313 -40652 -33286 -41637 -42208 -52062 -32452 -16916 -1740 14841 5712 255
5972 255 13347 9930 16891 1474 13478 5537 -8258 -23142 -8333 -15986 -2921 42353 30471
5959 30471 26550 11221 -10209 -29292 -41050 -61971 -45497 -3441 -1014 -14047 -20255 -11090 -17603
5946 -17603 6728 13662 9497 10274 13086 11853 -943 -13247 -15321 14725 23812 2012 8003 8260
5932 8260 27158 27112 40330 63458 51356 45329 45102 14135 -17927 -32221 -14373 -24107 -30440 -21156
5918 -21156 -19081 1333 28176 18676 16282 34031 19024 -136 -3161 17093 33604 27634 27687
5905 27687 13835 10095 -5256 11599 9956 8583 10427 -601 -7134 -38774 -46347 -49498 -55895
5892 -55895 -37044 -8996 -18192 -22807 -18839 11219 -5742 -31507 -34613 -38865 -47367 -42341 -13990
5879 -13990 -10311 -10953 19218 55971 52925 25986 23641 21052 51115 52026 50487 58840 36104 9721
5865 9721 9065 -6237 -3824 7591 7869 -7046 20430 17790 31953 60264 33732 21531 16609
5852 16609 17310 9372 -676 9279 15440 -8395 -13167 -2776 3748 -29060 -49761 -44623 -28290
5839 -28290 15849 12736 -9164 -37772 -30996 -34938 -35064 -41374 -51813 -30296 -17055 -28902 -38574
5826 -38574 -42944 -54920 -51673 -60444 -27040 -4389 6502 9803 26593 9238 -6804 -9121 16685
5813 16685 24111 20565 19604 1917 17884 15950 28684 1385 -8483 -14187 -27255 -33602 -22530
5800 -22530 -39887 -36573 -24535 -6537 -11594 -35054 -37779 -13749 11039 36959 48573 25049
5788 25049 -2846 -17579 9277 32408 27484 7311 18000 21604 12372 8980 -10603 -4911 -2545
5775 -2545 4119 14481 1016 -4401 22190 25566 2825 -10122 -6713 -3248 -1445 6958 -9553
5762 -9553 -12865 9380 35117 15394 21827 31647 21930 -16949 -44379 -52693 -16765 -3528 -21772
5749 -21772 -26572 -15756 27010 46352 18836 -20627 -18046 -1612 -26904 -37211 -25576 -21489
5737 -21489 -6060 22984 14906 -6130 -13531 -75 23939 35378 23934 -18633 -43057 -57638
5725 -57638 -30535 -14870 -23724 -20983 -15994 -27369 -31736 -22546 2809 -6463 1559 10969 16634 37250
5711 37250 31304 -9240 -35176 -39228 -17993 15991 26145 16148 -2669 -25624 -13252 1496
5699 1496 5024 16517 18885 -2381 -46059 -78266 -88293 -76113 -68270 -39236 -37358 -59445 -47288
5686 -47288 -17977 -30832 -41000 -40160 -14879 -18697 -32519 -12864 -7937 -28613 671 4993 -1007
5673 -1007 -14 5405 -5476 -5358 13962 16868 16898 -448 -23564 -37146 -21611 -27874 -41630 -23232
5659 -23232 -9958 -28212 -21534 -43727 -45033 -27275 -10704 8767 6237 -3260 -6624 -3292 -6737
5646 -6737 13158 13116 11262 21283 7278 -12049 -19404 1788 -9667 -39777 -47212 -42846 -53387
5633 -53387 -12607 20621 -2078 -19246 -18520 -32200 -10062 -8208 -6097 7367 16343 -1509 -13626
5620 -13626 3958 40917 39658 34996 52763 42644 20181 -9929 -26472 -41159 -38245 -10011
5608 -10011 19439 20411 5022 -6502 -22767 -46452 -52429 -22461 -15830 -13863 3194 9104 -8183
5595 -8183 -26528 -45912 -34333 -14100 -28276 -5670 -3761 -187 16205 30840 9739 729 12021
5582 12021 5094 -14071 -18321 -30323 -40203 -28914 -16378 2607 17326 34888 34691 17011 31611
5569 31611 18497 -1122 28722 44445 26677 3241 -7311 3371 13450 11697 2683 19391
5557 19391 11820 -2423 -31542 -26468 16630 5135 -12281 -22541 -17980 -21182 -11273 25373 30326
5544 30326 876 -26957 -7512 17582 32210 32233 27298 7221 18164 -3182 11266 22850 9852
5531 9852 -7838 -1056 -15765 -25807 -24840 -34651 -12912 7258 -12037 -11705 -10644 -8586 -15 3491
5517 3491 2023 -5114 -2900 8887 5646 9103 -9426 -5460 -3771 -5324 5427 24731 44548 68290
5503 68290 85641 67799 42216 12347 -760 -4523 1806 9773 -6081 -13545 4058 -5944 14754
5490 14754 25870 19894 33206 25580 -3322 -21791 -14762 -16334 -24558 -46558 -59901 -72351 -54426
5477 -54426 -41919 -54148 -42292 -25826 -40274 -43616 -21322 -3100 -14972 -9562 -5851 -11797 -5385
5464 -5385 -8385 5673 21189 -3089 -38370 -55274 -28027 -5241 -7774 -4925 -18138 -21771 -9439
5451 -9439 -2206 8488 16789 29392 46531 38865 36970 26597 19067 16139 -20168 -58833 -41062
5438 -41062 14386 30714 -10772 -25048 -7339 5825 5931 7912 6121 3381 3541 3698 -16899 -24270
5424 -24270 -5799 -9744 9357 -14855 -25717 -24827 -35020 -33859 -2461 11343 29648 5874 -11302
5411 -11302 -4427 -10606 7295 25097 17936 -9117 21366 37619 32073 19828 16733 -4431 -1998
5398 -1998 8614 11895 1131 14550 23888 3990 -297 29988 24733 21825 49299 57241 27080
5385 27080 11422 6448 10612 12273 5083 -9230 -14838 -3273 13663 15915 11198 7271 4189 -3227
5371 -3227 -22086 -19731 -19733 -1052 -6912 -11181 -21384 -29583 -7278 7469 -1780 -2087 -1716 -2232 -19810
5356 -19810 -15802 -6720 9727 21862 16779 -19593 -37951 -21611 -20521 -33071 -17230 -40 15368
5343 15368 14939 3591 -13475 9290 -4798 -34385 -62143 -49975 -45381 -39345 -35832 -12475 2853
5330 2853 24964 26177 13099 3633 12552 16040 -14640 -27709 -27275 -43438 -23918 -16167 -2405
5317 -2405 -6967 7524 17327 22945 27441 16708 16786 5769 -22953 1657 -5158 -9933 9069 11373
5303 11373 -776 11344 2607 -25742 -6832 -7553 -3121 12633 -22320 -42580 -11888 -1159 -21402
5290 -21402 -14937 -6058 -9091 -16073 -1117 -17387 -23972 -19347 -20892 5388 15075 9639 24088 46110
5276 46110 -4137 -29864 9840 2415 -18412 -11346 -25054 -18385 -14712 -22926 -10514 170 -18055
5263 -18055 -16663 -19411 -6989 -27081 -68442 -84252 -65826 -31899 -31401 -35266 -18833 -15193 2994
5250 2994 29614 25024 -7188 -21133 -15404 482 28396 30937 8023 13671 27377 23677 -31735
5237 -31735 -35858 -22904 -37344 -43199 -59913 -83664 -39295 -18099 -18108 -50391 -79901 -75623 -50346
5224 -50346 -42153 -6027 -3813 -20572 -55812 -47691 -38046 -33319 -46236 -14423 39656 29304 16213
5211 16213 26943 -14636 -32108 -26437 -20051 -39635 -53274 -26094 -5661 -23802 -18413 13905
5199 13905 -13341 -22119 -19325 -17905 -16385 -2917 25246 4500 -32479 -25539 1730 30344 26364
5186 26364 5974 -2727 2535 -12537 -5650 24585 27342 5713 -11315 -23096 -33332 2775 31047
5173 31047 3350 -9525 -8607 -6977 16744 26007 -3685 -6788 -15469 -26664 -34902 -76236 -90685
5160 -90685 -57179 -41600 2148 14475 7479 -9487 -25409 -27488 -47128 -72118 -58445 -18659
5148 -18659 -3318 -12951 136 -23137 -34449 -1521 -17468 -4368 5220 -14216 -30572 -26984
5136 -26984 -7890 6153 -3774 -30708 -37295 -25927 -29834 -25511 -25614 -13437 -29092 -22247 -21721 -7637
5122 -7637 6469 -8509 -21606 -11843 -17038 -25841 -30502 12375 40512 28637 3706 -1934 16020
5109 16020 4793 -19257 -38905 -35505 -34565 -40119 -39568 -52869 -69310 -62537 -52001 -40740 -17988
5096 -17988 -10474 28060 21004 4132 25641 21647 4821 -20768 -25015 -7444 -12695 -26850 -25004
5083 -25004 -16690 12160 17008 -10543 -14400 -35484 -62213 -28348 -16285 -18838 4709 13316 12241
5070 12241 14060 11730 425 -19196 -23343 -34249 -28780 -10469 -10030 -24629 -519 11633 23498
5057 23498 14470 30229 53751 45138 21863 -15485 -21595 -39377 -24447 29513 35114 31457 13462
5044 13462 -11031 -12060 -11738 7426 12594 11430 24558 -9162 -37077 -14923 -11117 5086 -3514
5031 -3514 -17444 -9125 -22750 -25031 -1979 2472 5352 1045 1505 10084 5896 -14285 -28397 -28094
5017 -28094 -28828 -48339 -60147 -53269 -51137 -38357 -34161 2697 16069 21139 4324 -5069 -19366
5004 -19366 -11486 -17653 -32221 -17049 -2823 -5866 -25845 -20233 15195 38385 22557 21722 13846
4991 13846 13 -13115 1885 9405 9604 16512 675 -9602 -7126 14061 12923 -10701 -5036
4978 -5036 -26145 -40145 -15127 -748 19545 14302 16344 10769 21547 29951 24066 29556 11677
4965 11677 -12595 -14262 -10085 6464 23741 19370 5241 -10899 -13631 -1417 22447 6672 -7614
4952 -7614 -30566 -52669 -27719 -17315 4180 4447 16523 26075 2255 -9583 -6589 -16311 -30262
4939 -30262 -25870 -15749 -4296 754 12206 2097 -5681 -21431 -20126 15749 22499 -20771 -14676
4926 -14676 -837 -17526 -39855 -23088 4823 20464 43576 40503 11395 -25116 -34930 -28549
4914 -28549 -5977 15748 -4013 -7736 15502 43068 3580 -33853 -47886 -27871 -12902 -11648
4902 -11648 -13231 -19074 6779 -7777 -26363 -26623 -3982 -24054 -40859 -8937 -9542 -8895 -10568 -15897
4888 -15897 -17179 498 6265 4872 6925 5158 -9649 -16753 -936 -4204 -10872 -25398 -39915
4875 -39915 -41528 -54887 -39482 -44264 -44321 -28376 -10312 5884 20576 35592 51363 39291 28569
4862 28569 14474 7271 -19069 -40618 -46414 -44933 -56472 -53847 -45511 -16207 3299 -14207 -12297
4849 -12297 11953 20432 12594 -3154 -23665 -10891 -7658 1452 22003 37964 56378 71300 55625
4836 55625 18560 -1395 1690 -2686 -3251 -13406 -7018 8555 7371 16401 19315 51377 52941 50745
4822 50745 46218 8095 -6328 -27073 -33313 -15170 -5436 14254 40294 36622 18402 -8085 -3608
4809 -3608 2513 15587 15098 8996 -11657 -20690 -32165 -28008 -24172 -26313 -32937 -13146 -1521 -12343
4795 -12343 -18271 -25692 -23584 -6103 -10163 -5476 10342 24484 53856 40159 33024 28376 16971
4782 16971 18237 22885 48602 62599 60130 60578 40464 24820 4205 3707 -27497 -33327 -723
4769 -723 19400 49854 30621 7989 5954 3643 1128 31098 35004 39805 14158 -10881 -2872
4756 -2872 8557 1708 -9428 -20921 -17919 -50351 -69337 -43939 -30681 -20288 -17452 -13600 -46010
4743 -46010 -27915 -15115 -10293 7424 1873 15387 34301 29439 -2098 -39950 -73642 -103024
4731 -103024 -98504 -81911 -56517 -46885 -47569 -43036 -57519 -21443 -8644 8635 35292 67027 31571
4718 31571 25594 -8296 -57862 -73823 -71164 -47849 -27408 -22489 -5624 -13732 225 12816 21557
4705 21557 4512 -14733 -31199 -11881 -25816 -11233 11844 15256 30861 28126 21734 -3047
4693 -3047 -24692 -14824 -2404 -18169 -33393 -39968 -40937 -35781 -8452 -3755 -17583 -29100 -4009
4680 -4009 -2520 -13001 -12307 -15524 -17387 -27636 -29422 -42803 -27506 -362 -15979 -26224 -39456
4667 -39456 -22046 -6644 31556 39812 2619 -34360 -17989 8836 -8558 -35516 -31542 -9392
4655 -9392 2457 -2904 -9520 -7936 -26951 -47436 -43753 -58635 -61266 -40788 -22076 -22708 -39351
4642 -39351 -33086 -22467 -9250 279 16894 10790 -9140 6019 -4793 -17451 -29072 -17973
4630 -17973 -38987 -56603 -62167 -11269 -8154 -28876 -46138 -52425 -73472 -29123 -20794 -22218 4162
4617 4162 13914 3005 3462 5482 -6883 -11286 9726 -2629 -6227 9289 9145 17729 1467 -4528
4603 -4528 6445 18086 2918 -2259 14129 21495 16807 15205 21377 27044 11330 -18739 -6823
4590 -6823 -8443 -22350 -30823 -6149 -26577 -25498 3696 -9137 -28246 -30554 -726 -11378 -4180
4577 -4180 4953 7380 -1429 10819 13119 5595 -17235 -22404 -21036 -4084 3507 22092 -26394 -52306
4563 -52306 -11240 -12631 -45099 -84172 -64092 -40761 -42191 -25757 -42407 -74016 -76415 -49713
4551 -49713 -44718 -39741 -36380 -36895 -19594 -24648 -11030 37798 47591 20000 5130 17212 14291
4538 14291 -8929 -9664 8057 1555 -22943 -14447 -30806 -42016 -30891 -18294 -18401 -17708 -17037 9562
4524 9562 6423 10937 16174 35026 43073 30135 19091 31424 23826 -187 13052 21195 24986
4511 24986 37413 35622 14748 2180 -9277 -23841 -42694 -38659 -26090 -21221 835 36618
4499 36618 46798 23453 33030 11738 9266 11211 13336 -1453 -7931 -5369 23326 41672 38735
4486 38735 27776 -1367 -12063 -9629 -3370 -455 1584 1043 -2491 22830 17952 -4488 -22345
4473 -22345 -36131 -65013 -68708 -25607 -24787 -29233 -25649 -27941 -18835 -12076 -5935 40814 53686 21900
4459 21900 6990 -5753 -17321 -22314 -21333 -22498 -19215 -14717 -3601 36040 43874 218 16760
4446 16760 29709 50601 47710 18985 1606 -19238 -3941 11964 22398 29333 -2601 24479
4434 24479 49336 21073 12888 37914 51466 36089 18453 22080 -3928 -33285 -31748 -39049 -41640
4421 -41640 -54321 -49942 -40683 -29564 -6076 3748 5250 11393 12115 4441 -24612 -27127 -14222 -19710
4407 -19710 -6339 -13852 -16699 -30182 -33760 -45963 -44293 -38512 -51209 -43302 -1777 6203 -360
4394 -360 -1389 11799 3903 8290 20394 38206 23510 26279 28343 -2046 -23575 -25837 18797
4381 18797 30033 17255 20593 1851 -19870 -39018 -12915 6807 21605 24574 1524 17386
4369 17386 2787 -11128 -5709 -24737 -29246 -38533 -11341 -17937 -6597 -573 -6320 10675 22404
4356 22404 18109 21085 36376 13884 -14543 -4023 -162 -12964 -13367 -16634 -21451 -7273 15211
4343 15211 -1034 -22677 -12124 6911 2909 9752 13281 21040 26431 21192 35142 32667 -1812
4330 -1812 -52366 -61074 -34656 -2842 7989 23652 18863 16184 8760 42930 40070 25058 1226
4317 1226 -13150 -5416 1767 -6448 12411 32025 20473 13795 20480 10232 5647 15384 15174 3798
4303 3798 -2081 -6461 14441 23735 2445 3018 4675 20883 32619 34408 17293 26074 43886 14396
4289 14396 -4267 22516 22817 5861 -4265 -19708 -1029 31969 54241 31920 31142 15377 -13345
4276 -13345 -19463 -3012 -4378 294 -15660 -25068 -13153 -20986 -8499 -35 -5878 -7761 -16532 -29059
4262 -29059 -34433 -19461 -1961 -8047 -17879 -10544 8509 30293 19473 8894 7972 6890 -30376
4249 -30376 -40039 -19615 -53588 -76489 -61955 -42090 -27530 -11791 11735 25823 26854 22059
4237 22059 -19931 -36774 -32344 -28918 -31905 -10993 27920 32576 24130 -34616 -60503 -58507 -66637
4224 -66637 -65293 -80318 -85319 -80355 -48845 -35724 -18482 -8344 -8533 -8367 6281 -34064 -64386
4211 -64386 -48880 -17699 -17175 -28843 -3801 13019 24014 -15160 -31243 -4505 -22045 -34865
4199 -34865 -25576 2029 27399 35315 5419 -41865 -36724 -24829 -29737 -14107 24409 31220 23299
4186 23299 2227 15008 16151 -9855 -17182 -25933 -10936 -21155 -35113 -40338 -25919 -48301 -43199
4173 -43199 -15802 -23241 596 -1146 12423 -661 -14848 -14659 -15497 6891 45725 35999 31183
4160 31183 44494 49873 12326 7395 1555 -18599 -14059 -10659 -4416 26394 29126 11898 -16088
4147 -16088 14854 16161 17271 17259 12149 35298 23808 -23928 -28306 -6201 7932 -10082 -16344
4134 -16344 -20780 -39830 -36559 -19804 -1096 -13926 -10614 -2236 16018 21219 19125 18470 30834
4121 30834 8496 -8172 -20004 -45531 -44177 -20332 -14844 -16742 -32396 -26552 -34697 -17025 -26724
4108 -26724 -20917 -15894 -15540 2864 -25650 -16294 18285 35518 45833 25033 1285 -3212 998
4095 998 14211 -11303 -25018 -33515 -25567 -28260 -29338 -32132 -38778 -24818 -30133 -33685 -28825 -23541
4081 -23541 -21568 -40386 4434 20695 -16762 -13855 -7054 7151 10958 -25868 -32723 -33066 -11799
4068 -11799 -20276 -18569 -4803 10507 -3716 6774 13059 5288 9592 951 10315 3020 -10787
4055 -10787 -14530 -21673 -26722 8389 -743 -26769 -52708 -58086 -43806 -39463 -32603 -25984 -14686
4042 -14686 9856 21443 -2455 -7900 -18378 -8736 -23036 -50166 -44113 -39751 -52039 -49484 -40964
4029 -40964 -45475 -40134 -21335 -25258 -36935 -51026 -40533 -28442 8492 27766 23073 -6179 -56314
4016 -56314 -78254 -52669 -34998 -21366 -7525 -2592 -43054 -42015 -39844 -12970 -6973 -7766 -24444
4003 -24444 -12517 4759 2901 -13662 563 19693 29853 48723 58764 68836 72216 23399
3991 23399 18404 16299 12722 25213 29245 13926 -2214 -11910 -15563 -3360 -1011 -16712 -28602
3978 -28602 -28117 -864 3622 6441 -22027 -31474 -16675 12159 28560 31518 10919 -8963 929
3965 929 20533 24494 22425 33272 20947 3246 3831 9123 -13513 -28719 -31199 -11362 -11270 -19556
3951 -19556 -31052 -28798 -36996 -29169 -18880 -9107 10689 -8934 -19136 -31157 1623 8184 10824
3938 10824 38374 48893 39212 29521 33867 27705 17138 39011 50266 45839 33819 15479 3212
3925 3212 13005 31410 45284 21753 7890 -2997 -9988 9040 25514 3922 -15619 -18045 -7278
3912 -7278 12203 14703 -27118 -73789 -49821 -23982 -18189 11142 43285 62590 60535 80117 111192
3899 111192 125919 77684 39652 13711 -17194 -4962 -15893 -40530 -28519 -23372 -28850 -24124
3887 -24124 -18683 -18954 -18790 -24598 -28655 -53394 -39386 -634 17325 27816 33379 33141 26825 7380
3873 7380 -14478 -12430 8263 27248 47786 39466 34488 16666 -14847 4670 26954 26229 1428
3860 1428 3413 14159 11236 6912 34416 19565 -136 -2867 21555 20891 -5262 -6405 17225
3847 17225 23573 3129 14414 -14745 -38903 -12332 -4502 -12613 -90 -908 -9402 -4983 -7011
3834 -7011 -13803 -25570 -56113 -60354 -53726 -38908 -35503 3490 1194 -5699 4265 -16185 -43371
3821 -43371 -36596 -24120 -37249 -45193 -22261 -34876 -19910 -14065 -11795 -3437 -19226 3589 28046
3808 28046 829 19474 16934 9769 13641 -7763 -28225 -27656 -30693 3310 17226 -1873 -19987
3795 -19987 -32355 -17542 -4201 -11479 -3610 24533 27343 20416 22782 -4712 -6243 -19514 -13837
3782 -13837 2497 -3089 8644 -13007 -25804 -20592 -23243 -15913 -8874 -8050 7696 16909 11573 12022
3768 12022 16212 -5436 -21286 -14644 -2435 5705 -19459 -31518 -31092 -25387 -30556 -27079 -7444
3755 -7444 19018 -153 -20520 -24315 -23095 -7485 -11963 6650 20356 7214 37084 21988 -3952
3742 -3952 1066 6066 -20363 -18841 13467 7908 12459 7728 -4371 -5325 -20239 -30875 -14057 -8298
3728 -8298 -14351 -8435 -15034 -24534 241 51 -17125 -24454 -32778 -48601 -47137 -28862 -15883 -23552
3714 -23552 -39216 -30477 -24261 -36849 -25994 17050 23477 -20668 -41225 -41168 -37332 -18453 5673
3701 5673 28230 -5367 -10703 -22814 1407 21528 26852 26743 7926 5907 -6707 15000 -1642
3688 -1642 -22614 14735 12302 -6746 14 -442 9402 49642 31934 9958 15266 23060 14039 12941
3674 12941 -3977 -1823 -8535 -33674 -48126 -9363 10311 10405 10446 1712 -601 25902 59791 44616
3660 44616 -848 -6247 14272 22520 -5039 9556 -513 399 6636 -4278 -7290 -17979 -41575
3647 -41575 -48367 -47148 -42362 -7845 4259 18811 24512 -2017 -15729 5242 -4727 -15837 11045
3634 11045 6877 14975 23207 -1469 -21877 -11447 -4213 692 2459 16685 16201 23043 30006 916
3620 916 -6640 317 17295 36432 37853 37843 48487 43525 51306 30860 25050 31622 5046 -9098
3606 -9098 -29976 -15739 -11943 -4366 -15922 -20335 -20282 -1813 6960 -8675 3450 23528 3540
3593 3540 16165 20987 23467 28900 27541 21454 -15458 -14805 -9522 -1200 -16364 -23878 1283 15652
3579 15652 10949 10298 28863 24283 26073 4037 -6395 -26316 -13324 6665 -23466 -21807 -21054
3566 -21054 1953 7484 8529 13456 37697 63839 68252 26301 5759 8859 27516 9458 -34953
3553 -34953 -27885 -26707 -32227 -24969 -31505 -24300 -8697 -15873 -29661 -36370 -39542 -5074 40029 25732
3539 25732 15985 26945 11896 28220 40852 36900 29187 -3610 -17095 -5164 -18145 -27342 -4904
3526 -4904 6232 2587 -22109 -29315 -20592 -9135 6355 -20124 -25308 -21070 11024 9805 4671
3513 4671 -13433 -1062 14576 4326 -13015 -27159 -16200 -8432 13168 14666 19094 20727 7831
3500 7831 -21424 -20809 -7617 -23201 -40283 -1332 29702 16002 -4392 -6009 -17326 -41085 -35115
3487 -35115 -10176 -8565 12028 14132 21268 14433 8870 -5284 6822 2112 -123 -13291 -14683
3474 -14683 25006 34506 37060 19646 18687 4063 -6749 5701 18639 10937 6465 -8343 -29470
3461 -29470 -41007 4549 -4687 -29368 -35132 -35431 -16577 12283 -527 -11695 -3722 -3618 -16585
3448 -16585 -22118 -3024 8271 -1727 -4318 18565 20570 10031 917 12327 21465 56678 39372
3435 39372 8756 -19628 -29379 -2325 12357 1760 -8675 -20029 -36002 -20245 11899 35296
3423 35296 19624 -6445 -23048 -40250 -29893 -25704 -12474 -10558 -10997 -10454 6953 23288 28224
3410 28224 17295 24155 -7588 -20981 3874 9635 24824 21949 18271 14337 9691 28308 27027
3397 27027 6679 -7632 -32095 -35460 -2751 13128 35113 44050 37592 28344 10400 -11 7214
3384 7214 -6049 -13160 14319 43928 49955 17877 17126 26566 6741 -15702 -35336 -27861 -6386
3371 -6386 951 -16369 -19838 -3265 26084 39286 31692 10115 16095 18373 -28264 -30876 -21060
3358 -21060 -20928 -29730 -41896 -22613 -8565 -7634 7044 8304 -1727 -5379 -2974 10434 13637 4128
3344 4128 27333 19139 15508 -16712 -11663 5108 19548 20365 6053 12609 -20475 -68523 -52634
3331 -52634 -56776 -60161 -32720 -11134 -13978 -10064 3435 12696 37236 27245 9163 19534 22885
3318 22885 10695 -7541 -10110 8175 26365 30687 27553 29558 15167 -13780 -39883 -21257 -4243
3305 -4243 2839 -2681 29434 20193 6694 13770 17835 -14478 -14748 5772 6072 -11259 -8946 13271
3291 13271 29696 12534 -17804 -14974 7739 9451 -4520 -11567 -22047 -10498 6904 10840 96
3278 96 4674 8197 -20285 -35352 -35785 -15423 -17967 -5443 14182 23474 -15831 -33725 -12594 -12246
3264 -12246 -13372 -5203 32649 32066 3414 -13415 -20523 -29989 -23705 22492 35884 25031 672
3251 672 -15393 630 33122 35957 43070 38185 41665 27922 3333 -25090 -31106 -49216 -48225 -21353
3237 -21353 8732 6694 -10710 -52099 -79494 -68842 -24250 -22264 -28506 -45177 -20643 -7720
3225 -7720 -10007 1551 -4807 13695 37258 28041 -11067 -28145 -7820 -10017 -9924 -16241 -16358 -4400
3211 -4400 11072 -12745 12826 9908 -20743 -32262 -26131 -2982 -15953 -34319 8917 27654
3199 27654 -1886 -21569 -36294 -20690 -17236 -7062 10837 38510 27768 -2626 4116 16760
3187 16760 18370 22586 22690 24644 4088 8474 -733 -17085 -30107 -23293 -1063 6885 18027 21180
3173 21180 30081 34618 5263 -14295 -19888 -3736 16407 28979 30073 46704 56427 45290 11864
3160 11864 23273 24758 -16546 2502 32206 32798 9845 -14875 5699 6274 14103 8622 453
3147 453 -15899 -26093 -24993 -21817 -12758 -7407 -7443 3387 -18999 -18647 -21590 -25956 -20329 2966 8676
3132 8676 4419 13059 11070 10871 10166 6121 -13339 -3579 20607 11809 -18465 -8401 8717 10866
3118 10866 11698 13892 12819 3456 13168 36129 38522 21079 19202 50765 60708 52062 -1623 -33255
3104 -33255 -15266 8647 5370 25084 10483 19634 9828 11900 22083 24849 24221 19345 -13727
3091 -13727 -34921 -32026 -20075 2380 -11547 -20719 -29694 -43468 -49366 -62459 -44880 14559 30713
3078 30713 28382 15955 1969 -6340 -12109 -195 -6754 1041 -1110 -9028 1028 -6695 -17144
3065 -17144 -7764 -3971 -1358 9090 22258 23919 28627 22669 2685 -17731 -6782 -14777 -16960
3052 -16960 -999 8079 25901 35111 2491 -10738 -17594 -508 23553 43553 46695 28902 31016
3039 31016 39550 22435 31397 49218 18580 13818 38073 66533 66859 63586 36139 5262 -4488
3026 -4488 3621 -14737 -15798 -17171 -15980 215 1540 -1606 -26167 -24122 -3856 11335 6188 -3357
3012 -3357 -25387 -27547 -19259 -2752 8589 3565 3965 -1239 -36285 -44621 -40552 -16849 22387 43233
2998 43233 31420 -4643 -28782 -245 10581 -39163 -43780 -31337 14499 40070 39571 67510
2986 67510 74615 68494 64387 60130 59641 36331 26630 8615 11778 437 4499 2260 25170 16720
2972 16720 15916 -7658 -18498 -32139 -9780 -8299 -9993 -20882 -3025 20184 1869 -4013 2688
2959 2688 -9850 -19867 -34907 -28377 -9593 -508 29361 -2776 -14915 16497 12992 -4524 -20828
2946 -20828 -6019 -1596 -7820 2690 -6036 -15337 -42217 -64656 -35496 -3381 -11099 -20777 -485
2933 -485 23180 9685 -787 14007 7998 -12286 -23312 -38151 -16622 -8039 555 -968 -5863
2920 -5863 -20536 1376 34178 11436 -27799 -29991 -50614 -55458 -67212 -50439 -38757 -22038
2908 -22038 -13830 3424 -1119 -26848 -30366 -16607 -40409 -38436 -25189 13316 21625 -3699 -4344
2895 -4344 4075 -7526 -7510 -2565 -17576 -29649 -24681 4535 7100 4814 -14430 -13810 -9138 -7542
2881 -7542 -6128 -1440 -10777 -43281 -55105 -40133 -15076 -8722 -14404 -18641 1222 22967 16232
2868 16232 3563 -9653 -4632 -10222 -35457 -26785 -15626 -1351 -9141 -37154 -32989 -111 9273
2855 9273 9333 12335 -6880 -48001 -52463 -36093 -5605 12404 -2751 -13715 -25812 -29201 -7893
2842 -7893 2938 2539 9353 -13961 -2026 16932 57482 70545 72743 69913 15574 -7905 -3
2829 -3 18294 29812 567 -21913 -10639 -21175 -19079 5094 1013 -14276 4873 20279 13078
2816 13078 -921 10483 33687 40450 26276 -5531 -16399 -17840 -40149 -47664 -13704 -4888 -6583
2803 -6583 1721 35817 55061 10291 -16177 -14093 -43320 -40643 -8001 6861 23846 3645 13209
2790 13209 63 -1329 9359 17172 7600 2804 4242 5833 -757 -17547 -15497 -13256 9246 16319
2776 16319 -8285 3937 -452 -84 -2548 10574 25635 -1400 -18552 -30497 -9143 27949 34920
2763 34920 28432 14510 -16231 -21408 -28556 -41031 -33329 -17560 -8604 -16823 -18756 -7678 -14611
2750 -14611 -21648 16448 9021 2759 -10673 -9653 -6419 -9071 -11244 7049 -11000 -21591 -4310
2737 -4310 -21314 -17574 4455 13373 22854 38550 40117 33106 15108 19962 22803 22514 28040 49359
2723 49359 52186 31018 6430 -14042 -8635 28811 34384 42658 72999 43553 16926 3917 3455
2710 3455 31094 48295 26681 23422 2024 4222 -2247 -8492 -13522 -13572 -11143 -24006 -11162 -2343
2696 -2343 19926 34496 48910 4973 -5965 -13999 -21495 -25939 -34639 -56524 -55942 -42658 -17284
2683 -17284 38472 60756 32337 6773 -21709 -16427 -11896 -39513 -53062 -65068 -54381 -40154
2671 -40154 -34122 -21381 -35908 -48708 -50399 -23679 -4802 -7748 -7819 3441 22331 9236 7649
2658 7649 6060 7189 24802 24472 23819 20868 17306 26171 14452 -12188 -33036 -17803 -6021 1624
2644 1624 -4259 10077 24598 23334 27405 13340 19216 10007 13351 -23981 -47350 -22857 -27004
2631 -27004 -30574 -14676 -24383 -24836 -29803 -15467 -17574 -12844 -34859 -31435 -488 19284 8209
2618 8209 39381 33643 7119 -8959 -11784 -3282 20441 6559 3674 4310 -17706 -43726 -62834
2605 -62834 -37676 -11884 353 20015 42429 27750 18199 -4027 -14126 4253 7494 29424
2593 29424 30094 20110 18661 20548 6753 -13531 -2518 -15201 -27679 6579 24148 22720 -10310
2580 -10310 -26710 -16886 -28354 -11527 111 -14869 -19107 -19935 -20066 -12908 -8134 9174 32283
2567 32283 46590 47747 31985 17453 -3829 -5960 5112 1570 9249 18776 -6483 -17468 -18604
2554 -18604 -1602 -6272 -3204 4535 41889 56674 46456 28212 20818 24539 31794 30184 49832
2541 49832 73506 66358 38674 8360 -12788 -12433 -24103 -14187 -14980 3831 -8378 -25148 -30229
2528 -30229 -14080 20764 13553 9917 27101 17523 6942 18717 9337 14557 12485 30954 28125
2515 28125 6618 17320 5958 -6215 -19460 -13804 -10107 5381 4808 5511 -9904 5174 21637
2502 21637 36085 481 -25203 -5790 -29366 608 25475 3775 6212 9513 -2444 -15051
2490 -15051 -17894 -10305 -16564 -26962 -14208 -25447 -35762 -35304 -1352 4843 -7588 -24046 -20557
2477 -20557 3157 5521 -5268 -5291 -21964 -27256 -35436 -38984 -24508 27972 64267 67656 33498
2464 33498 15171 27922 26579 1904 5505 19970 7731 9807 20635 -1739 -10877 -3397 -902
2451 -902 3038 3195 -11754 11560 8075 7411 34559 11216 -500 19746 28198 39046 1556 -15878
2437 -15878 4944 19960 28496 33856 50419 43068 33955 42472 38423 40804 38214 31803 15839 1965
2423 1965 -4107 -15844 11205 30088 19948 49817 52806 49943 51580 23538 -17 -3882 -17005
2410 -17005 -6405 -9921 -30827 -41602 -9314 -1547 17733 31426 10620 10919 12467 16006 1827
2397 1827 -17379 -9634 -2382 -4245 2221 12176 29648 29569 44684 27158 12771 1384 -34051 -10019
2383 -10019 20812 16522 17581 28481 19785 5393 -11122 -6219 -18840 -9624 -10246 -14801 -21173 -21861
2369 -21861 -24113 -1980 3016 18036 16023 15018 28870 36220 41344 45225 25408 11696 -1693
2356 -1693 -165 11993 7973 8637 33431 14331 10969 31322 4357 -12519 -27653 -48150 -59855
2343 -59855 -42960 -21000 -31912 -30287 -18896 -33029 -37575 -1578 20531 4760 6256 -14358
2331 -14358 -17516 -7493 6071 -5191 -23313 -19727 16333 33102 15050 -4410 5415 9693 -11717
2318 -11717 5222 21260 31545 43373 31035 2238 21815 30983 27605 6813 -21863 -11943
2306 -11943 -6622 3177 20195 -8422 -16896 -19388 9839 19359 10922 16979 13580 1753 11118 11503
2292 11503 -7832 -23675 -22927 -34882 -35428 -4469 -5722 -12238 -14163 -17627 -40890 -38272 1289 -843
2278 -843 -22000 -37721 -35549 -32471 -4417 5499 2269 -6805 -30243 -11524 -27920 -30287 -5080
2265 -5080 -4703 -20759 -21761 -23154 -25824 -21711 -6059 -8723 18771 47155 61448 39067 29851 35502
2251 35502 35322 5395 10198 12662 8462 29167 15581 -5440 -12299 746 47925 31304 23576
2238 23576 15622 -20391 -31294 14402 40616 50500 39468 59568 53596 16657 1480 19297
2226 19297 36468 15448 -4774 7157 1933 -8123 927 263 -13340 -17766 -19154 -14231 -12124
2213 -12124 -18270 22338 30208 12373 -18861 -20749 7218 24940 6865 -37864 -24800 -8202
2201 -8202 -2407 -30562 -44006 -17633 30521 38109 2880 -10589 -37361 -54034 -30241 -10727
2189 -10727 -22908 -28466 -36523 -31222 -31853 -29923 -40914 -44809 -18469 -5688 -25178 -29260 -37587 -30203
2175 -30203 26822 60017 38597 13594 1287 8962 -832 2188 31217 21244 20891 20489 43150
2162 43150 42950 25665 9162 -4067 5671 12754 21279 31447 10491 -11479 -2510 -4873 -21193
2149 -21193 -19424 1384 26749 22350 18871 30417 58420 43899 42151 37062 7192 -9498 -31831
2136 -31831 -56841 -31387 514 17566 1040 9868 20636 27777 34612 38160 38330 50040 55476
2123 55476 54360 44240 18865 21722 19605 -14562 -42881 -35079 -11119 12035 31259 43822 14765
2110 14765 -10901 -15087 -13904 -10511 -1188 35177 56195 41321 20537 7172 9975 18135 26259
2097 26259 -9400 -4554 15544 15132 -567 -12399 -18295 3754 2368 -10803 -12309 10254 24946
2084 24946 40983 35109 24707 1729 -272 -2870 -2529 16489 24141 8117 10077 16681 -3272
2071 -3272 19406 48864 37454 22354 -5002 -23551 -6770 4009 27708 17819 3840 12810
2059 12810 9301 -28535 -18810 8401 -3919 -16480 -18323 8865 -8935 -14270 -1683 -2281 -6204
2046 -6204 4675 -7148 -3250 17102 27260 8772 9267 24882 42633 48085 54897 55696 32299
2033 32299 12809 -14032 -7929 -141 -1715 6879 8462 6636 -21959 -17569 1712 -7955 -10586 -17574
2019 -17574 -12973 -14427 -1454 -15489 -9826 -4952 -18923 3656 28500 66004 59805 42782 16787
2006 16787 -4754 -23528 -11554 30322 32276 27712 37403 27291 48492 61489 51586 18202 -4688
1993 -4688 -5192 14650 28527 15046 -3531 -6030 -5266 17397 28059 8735 -2621 -312 -14246
1980 -14246 -11159 -13990 4449 35669 40526 33120 22077 15678 20741 -659 16378 18130 23694
1967 23694 19488 8965 23486 49254 48763 64451 70060 102051 67974 33016 25659 17646 -6782
1954 -6782 -15639 -19121 -25622 -43048 -26614 -45485 -66952 -41346 -23228 -29469 -26070 -20135 -6777
1941 -6777 6583 -79 -14340 -25566 -28515 -24588 -52624 -61455 -66341 -47269 -25129 5229 -4107
1928 -4107 -27214 -34510 -22947 -807 -8802 11324 21447 45011 61374 41921 30167 20485 13191
1915 13191 53857 83391 58747 29484 17683 6489 10384 110 -12102 -17811 -8959 -751 -8110
1902 -8110 -2220 21183 54026 67488 79069 61211 47767 28460 32694 22956 -7354 -11486 9215
1889 9215 20101 21858 33291 16413 5251 12171 5761 -8339 -8527 10320 24643 42027 47803
1876 47803 35763 20278 -3807 32036 42408 16656 -23549 -27469 -22377 -4740 -9087 -6596 7789
1863 7789 7886 -15747 -27979 -28386 -8495 22805 10320 -12477 -8738 -7451 8009 21406 33784
1850 33784 68328 75276 52859 38128 43266 40240 39051 21600 5576 26247 12372 5355 34169
1837 34169 28525 4793 2270 12537 29618 36860 11312 -17112 -20906 -41130 -33725 -2421 7849
1824 7849 -26985 -33536 -12122 -33789 -21472 7873 25450 40857 39827 26183 41798 53862
1812 53862 44702 38357 35865 45299 67875 36873 15073 -2548 969 -5853 -28043 751 10862
1799 10862 -7650 -15930 -9729 1832 -10498 -22400 -28147 -4715 6534 214 1871 28246 10614
1786 10614 10466 25883 45330 39889 50458 21126 -922 -4400 -18573 -24225 -29422 3809 31734
1773 31734 34137 24653 2480 -18588 -28741 -11698 1004 13060 13512 -278 -26418 -26513 -10602
1760 -10602 -4033 -1134 -9790 -25563 -1926 13858 3822 -11298 -3413 8686 10097 -5849 24585
1747 24585 17201 -11508 -21972 5540 34240 35079 44371 26619 -4984 -10597 21970 1023 -17243
1734 -17243 -22867 -21027 -18065 -18973 -29913 -33295 -32727 -25544 2265 11043 53233 73641 70122 66329
$$ [...]
##END NTUPLES=NMR SPECTRUM
##END=
