##TITLE=Analysis number 317394
Compound Code sb 01717
Book Reference 1
Project Code qc-cat
Chemist Name glenb
##JCAMPDX= 6.0         $$ Bruker NMR JCAMP-DX V2.0
##DATA TYPE= NMR SPECTRUM
##DATA CLASS= NTUPLES
##ORIGIN= Bruker BioSpin GmbH
##OWNER= nmr
$$ XWIN-NMR		Version 3.5
$$ Tue Feb 21 10:32:01 2006 GMT Standard Time (UT+0h)  MAYBRIDGE\nmr@NMR_250MHZ
##.OBSERVE FREQUENCY= 250.131544655141
##.OBSERVE NUCLEUS= ^1H
##.ACQUISITION MODE= SIMULTANEOUS (DQD)
##.ACQUISITION SCHEME= undefined
##.AVERAGES= 16
##.DIGITISER RES= 18
##SPECTROMETER/DATA SYSTEM= dpx250
##.PULSE SEQUENCE= zg30
##.SOLVENT NAME= DMSO
##.SHIFT REFERENCE= (INTERNAL, DMSO, 0, 16.522)
##AUDIT TRAIL= $$ (NUMBER, WHEN, WHO, WHERE, WHAT)
$$ ##TITLE= Audit trail, XWIN-NMR		Version 3.5
$$ ##JCAMPDX= 5.01
$$ ##ORIGIN= Bruker BioSpin GmbH
$$ ##OWNER= nmr
$$ C:\u/data/dgb/nmr/ADRS/16440/pdata/1/auditp.txt
$$ ##AUDIT TRAIL=  $$ (NUMBER, WHEN, WHO, WHERE, WHAT)
(   1,<2006-02-21 10:31:42.37 +000>,<MAYBRIDGE\nmr>,<NMR_250MHZ>,
      <created by zg, POWCHK disabled, PULCHK disabled
       configuration hash MD5:
       84 BC 41 DB A1 6E 1D 46 DA 25 12 A5 C1 ED C5 3A
       data hash MD5: 64K
       1C 05 CD 63 23 AD 9B 8E 1A 0E 77 E4 1F AC 15 FE>)
(   2,<2006-02-21 10:31:53.17 +000>,<MAYBRIDGE\nmr>,<NMR_250MHZ>,
      <Start of raw data processing
       ef LB = 0.3 FT_mod = 6 PKNL = 1 SI = 32K 
       data hash MD5: 32K
       D8 55 01 1C 96 92 9B 16 9A 29 3B EC 1A 53 12 44>)
(   3,<2006-02-21 10:31:54.81 +000>,<MAYBRIDGE\nmr>,<NMR_250MHZ>,
      <apk 
       data hash MD5: 32K
       24 FE 29 F1 25 BE 5D C6 7F 7E 98 48 14 15 1F 3A>)
(   4,<2006-02-21 10:31:55.59 +000>,<MAYBRIDGE\nmr>,<NMR_250MHZ>,
      <abs ABSG = 5 
       data hash MD5: 32K
       51 C4 B1 86 93 FE 47 53 4F A2 C9 97 7F A8 98 E1>)
$$ ##END=
$$ 
$$ hash MD5
$$ 8A A1 E5 A3 98 67 CB FB 92 B0 FC 8F 24 5A B2 2E
##$RELAX= 
##$RELAX= 
##$RELAX= 
##$RELAX= 
##$RELAX= 
##$RELAX= 
##$RELAX= 
$$ Bruker specific parameters
$$ --------------------------
##$DU= <C:\u>
##$EXPNO= 16440
##$NAME= <ADRS>
##$PROCNO= 1
##$TYPE= <nmr>
##$USER= <dgb>
##$AMP= (0..31)
100 100 100 100 100 100 100 100 100 100 100 100 100 100 100 100 100 100 
100 100 100 100 100 100 100 100 100 100 100 100 100 100 
##$AQSEQ= 0
##$AQ_mod= 3
##$AUNM= <au_zg>
##$AUTOPOS= <14 >
##$BF1= 250.13
##$BF2= 250.13
##$BF3= 250.13
##$BF4= 250.13
##$BF5= 500.13
##$BF6= 500.13
##$BF7= 500.13
##$BF8= 500.13
##$BYTORDA= 1
##$CFDGTYP= 0
##$CFRGTYP= 5
##$CHEMSTR= <none>
##$CNST= (0..31)
1 1 145 1 1 1 1 1 1 1 1 1 1 1 1 1 1 1 1 1 1 1 1 1 1 1 1 1 1 1 1 1 
##$CPDPRG= <>
##$CPDPRG1= <>
##$CPDPRG2= <>
##$CPDPRG3= <>
##$CPDPRG4= <mlev>
##$CPDPRG5= <mlev>
##$CPDPRG6= <mlev>
##$CPDPRG7= <mlev>
##$CPDPRG8= <mlev>
##$CPDPRGB= <>
##$CPDPRGT= <>
##$D= (0..31)
0 1 0 0 0 0 0 0 0 0.06 0 0 0 0 0 0 0.0002 0 0 0 0 0 0 0 0 0 0 0 0 0 0 
0 
##$DATE= 1140517901
##$DBL= (0..7)
120 120 120 120 120 120 120 120 
##$DBP= (0..7)
150 150 150 150 150 150 150 150 
##$DBP07= 0
##$DBPNAM0= <>
##$DBPNAM1= <>
$$ [...]
##$SUBNAM7= <"">
##$SUBNAM8= <"">
##$SUBNAM9= <"">
##$SW= 20.6930455092707
##$SWIBOX= (0..15)
0 0 3 0 0 0 0 0 0 0 0 0 0 0 0 0 
##$SW_h= 5175.983436853
##$TD= 65536
##$TD0= 1
##$TE= 294.16
##$TE2= 300
##$TE3= 300
##$TEG= 300
##$TL= (0..7)
0 120 120 120 120 120 120 120 
##$TP= (0..7)
150 150 150 150 150 150 150 150 
##$TP07= 0
##$TPNAME0= <>
##$TPNAME1= <>
##$TPNAME2= <>
##$TPNAME3= <>
##$TPNAME4= <>
##$TPNAME5= <>
##$TPNAME6= <>
##$TPNAME7= <>
##$TPOAL= (0..7)
0.5 0.5 0.5 0.5 0.5 0.5 0.5 0.5 
##$TPOFFS= (0..7)
0 0 0 0 0 0 0 0 
##$TUNHIN= 0
##$TUNHOUT= 0
##$TUNXOUT= 0
##$USERA1= <user>
##$USERA2= <user>
##$USERA3= <user>
##$USERA4= <user>
##$USERA5= <user>
##$V9= 5
##$VALIST= <valist>
##$VCLIST= <CCCCCCCCCCCCCCC>
##$VD= 0
##$VDLIST= <DDDDDDDDDDDDDDD>
##$VPLIST= <PPPPPPPPPPPPPPP>
##$VTLIST= <TTTTTTTTTTTTTTT>
##$WBST= 1024
##$WBSW= 4
##$XGAIN= (0..3)
0 0 0 0 
##$XL= 0
##$YL= 0
##$YMAX_a= 294402
##$YMIN_a= -401220
##$ZGOPTNS= <>
##$ZL1= 120
##$ZL2= 120
##$ZL3= 120
##$ZL4= 120
##$ABSF1= 16.522
##$ABSF2= -4.171173
##$ABSG= 5
##$ABSL= 3
##$ALPHA= 0
##$AQORDER= 0
##$ASSFAC= 0
##$ASSFACI= 0
##$ASSFACX= 0
##$ASSWID= 0
##$AUNMP= <proc_1d>
##$AZFE= 0.1
##$AZFW= 0.1
##$BCFW= 0
##$BC_mod= 0
##$BYTORDP= 0
##$COROFFS= 0
##$CY= 12.5
##$DATMOD= 1
##$DC= 0
##$DFILT= <>
##$DTYPP= 0
##$F1P= 14.0000005364418
##$F2P= -0.99999901652339
##$FCOR= 0.5
##$FTSIZE= 32768
##$FT_mod= 6
##$GAMMA= 0
##$GB= 0
##$INTBC= 1
##$INTSCL= 1
##$ISEN= 128
##$LB= 0.3
##$LEV0= 0
##$LPBIN= 0
##$MAXI= 10000
##$MC2= 0
##$MEAN= 0
##$ME_mod= 0
##$MI= 0
##$NCOEF= 0
##$NC_proc= -4
##$NLEV= 6
##$NOISF1= 0
##$NOISF2= 0
##$NSP= 0
##$NTH_PI= 0
##$NZP= 0
##$OFFSET= 16.522
##$PC= 1
##$PHC0= 239.4786
##$PHC1= 5.050693
##$PH_mod= 1
##$PKNL= yes
##$PPARMOD= 0
##$PSCAL= 4
##$PSIGN= 0
##$REVERSE= no
##$SF= 250.13
##$SI= 32768
##$SIGF1= 0
##$SIGF2= 0
##$SINO= 400
##$SIOLD= 32768
##$SREGLST= <1H.DMSO>
##$SSB= 0
##$STSI= 32768
##$STSR= 0
##$SW_p= 5175.98343685301
##$SYMM= 0
##$S_DEV= 0
##$TDeff= 65536
##$TDoff= 0
##$TI= <Analysis number 999999
Compound Code 99
Book Reference 9
Project Code 9>
##$TILT= no
##$TM1= 0
##$TM2= 0
##$TOPLEV= 0
##$USERP1= <user>
##$USERP2= <user>
##$USERP3= <user>
##$USERP4= <user>
##$USERP5= <user>
##$WDW= 1
##$XDIM= 32768
##$YMAX_p= 321104334
##$YMIN_p= -470773
$$ End of Bruker specific parameters
$$ ---------------------------------
##NTUPLES= NMR SPECTRUM
##VAR_NAME=  FREQUENCY,     SPECTRUM/REAL,   SPECTRUM/IMAG
##SYMBOL=    X,             R,               I
##VAR_TYPE=  INDEPENDENT,   DEPENDENT,       DEPENDENT
##VAR_FORM=  AFFN,          ASDF,            ASDF
##VAR_DIM=   32768,         32768,           32768
##UNITS=     HZ,            ARBITRARY UNITS, ARBITRARY UNITS
##FACTOR=    0.157963299565203, 1,           1
##FIRST=     4132.6476996994, 0,             0
##LAST=      -1043.33573715361, 0,           0
##MIN=       -1043.33573715361, -470773,     0
##MAX=       4132.6476996994, 321104334,     0
$$ Real data points
##PAGE= N=1
##DATA TABLE= (X++(R..R)), XYDATA
$$ [...]
17517A135001J72030P4752r9302j27584n5145K5091J32543M9547Q277q1847n5198
17506A178165r7612j4861k6664j2768l1965j11246m0401j23512j66919o1790J0462
17495E00889J06744j7443J237o6251L7381J9124n1537q6945N3299M0578k5679
17484E11397q1800J1409l518J0302k9381m1290N2457n7759M457M7257l6971n4650
17472C31910J1994Q2671o7042m6457R9846J1589n4064K6738N085M5864R5435P7119
17460F20688J7567Q0392o9884m6072k8245Q152O1510J1399j55266J7127N4938
17449E72306q6968K971O1445N7123R7356m0394o1496R6542l5024j04105q989l8261
17437E12506k7791n2621m2164N1361Q2148J7207R8951n8808p9839J6963P5900
$$ plain form
17517 1135001 1307031 1381783 1282481 1154897 1099752 1124843 1257386 1306933 1315210 1233363 1178165
17506 1178165 1080553 1065692 1039028 1026260 994295 883049 842648 719136 552217 490427 500889
17495 500889 607633 590190 591427 525176 562557 581681 530144 443199 496498 537076 511397
17484 511397 429597 441006 437488 447790 418409 377119 429576 371817 376274 423531 386560 331910
17472 331910 343904 426575 359533 313076 412922 424511 370447 397185 402270 448134 543569 620688
17460 620688 638255 718647 648763 602691 574446 582598 644108 655507 500241 517368 572306
17449 572306 485338 488309 549754 606877 704233 663839 602343 698885 663861 559756 550767 512506
17437 512506 484715 432094 389930 441291 523439 540646 639597 580789 500950 517913 593813
17426E93813o9013K3819K0452m2629m2903J6123L7700P2547R0577J20954M3703
17415H65143j1239Q9051J26980R1720M2007N5535J17314K80666K79037J75719
17405B111933J34475O8948J60496K46661L29474L92800L76681L17329K65094K59640
17395D663531K93227M21814N62073Q03875J090260J626592K311634L025679M262306
17386A9060991N828240P558079Q879068Q629372P332395N673829L364914J249451
17378F7576339Q85527J982164K903027K376499Q10272o08742l060155o633952
17370F6230979r062659r596636r161856p937079o376692m819149l503821k428306
17362A3344781j802146j378464j080218p87103n95245m49009m47727l23441k68120
$$ plain form
17426 593813 524800 548619 569071 526442 483539 499662 537362 609909 700486 821440 865143
17415 865143 853904 942955 1069935 1161655 1203662 1259197 1376511 1657177 1936214 2111933
17405 2111933 2246408 2315356 2475852 2722513 3051987 3444787 3821468 4138797 4403891 4663531
17395 4663531 4956758 5378572 5940645 6744520 7834780 9461372 11773006 14798685 19060991
17386 19060991 24889231 32447310 41326378 49955750 57288145 62961974 66326888 67576339
17378 67576339 68461866 70444030 73347057 75723556 76533828 75925086 72864931 66230979
17370 66230979 57168320 47571684 38409828 30472749 24096057 19276908 15773087 13344781
17362 13344781 11542635 10164171 9083953 8296850 7701605 7252596 6804869 6481428 6213308
17353F213308l17553k44584j78185j18220K5756J05409N3198J39213K54643K39696
17343F172681K38070M30891P48718J072913J484126K087386L043344M411148N933487
17334B5622764P562095Q214465P487371O243567M328076J663026J34092J14272
17326F1369728N47203M76336j47242r35613k549448n002063o550746p023790o571477
17317C3612888n422545l999395k286239n39934J068096K788662M961935O786769
17309C6970237P091429M672809P12077k100081l144930k943301j269317Q98833
17301D0887756J942322K71203k539722m534803n497562n619734m915221l869460
17293A6124779k903996j952109j271219r69069o24034n33648l78781l83641k88233
$$ plain form
17353 6213308 5895755 5651171 5472986 5354766 5380522 5485931 5539129 5678342 5932985 6172681
17343 6172681 6410751 6841642 7590360 8663273 10147399 12234785 15278129 19689277 25622764
17334 25622764 33184859 41399324 48886695 55130262 59458338 61121364 61255456 61369728
17326 61369728 61916931 62393267 62246025 61310412 58760964 53758901 47208155 40184365 33612888
17317 33612888 28190343 24190948 21904709 21364775 22432871 25221533 30183468 36970237
17309 36970237 44061666 48734475 49446552 47346471 44201541 41258240 39988923 40887756
17301 40887756 42830078 43101281 40561559 36026756 30529194 24909460 19994239 16124779
17293 16124779 13220783 11268674 9997455 9028386 8404352 7870704 7491923 7108282 6820049
17284F820049j72771k51541k10038j73886m6694j2067m0816R1142K38722K49442
17274F491542K39435M10639N21348Q53974J156690J871060K629945L767768N554673
17265B3497074Q135787J0961001J2568822J0941902N684877j53903l524717m362930
17257F3747913k828020M81945L449188L282427j050234n989471q442601r436693
17249D3214454r296725p748651n814624m111106k902169j919070j299666r59444
17241I162999q28241o65326n38631m00001k24885k19247k38328l81980j90582
17232E475778k9761j21340j08936j79143j33203p8169L6040J04747L29251N15449
17222E810713P13410J113045J623280K511345L796847N237464N821382M380253
$$ plain form
17284 6820049 6647278 6395737 6185699 6011813 5965119 5953052 5912236 6003378 6242100 6491542
17274 6491542 6730977 7141616 7662964 8516938 9673628 11544688 14174633 17942401 23497074
17265 23497074 31632861 42593862 55162684 66104586 71789463 71635560 68110843 63747913
17257 63747913 60919893 61401838 64851026 68133453 67083219 61093748 52651147 43214454
17249 43214454 33917729 26169078 20354454 16243348 13341179 11422109 10122443 9162999
17241 9162999 8334758 7669432 7130801 6730800 6505915 6286668 6048340 5666360 5475778
17232 5475778 5446017 5324677 5215741 5036598 4903395 4825226 4861266 4966013 5295264 5810713
17222 5810713 6524123 7637168 9260448 11771793 15568640 20806104 26627486 31007739
17214C1007739J335825j107280k071934j948220r45049P41621J877269J104334
17206B9994305j041408l022312m039276m218533l921352l148899k453472j604604
17198F544449j064766p79649o69648m56508l61793k16746k17885j20822j87206
17189B469426j46370j15369q8431o2561j93347j66277j00871p2467j06084j13293
17179A304356m7943q0739q0590j5746j28820j37071r1660n2763K3117M0549O3269
17168G95959J4626j27820k5037k7117O113M7529P9393m0141K952j45728j64489
17157D16240j17408J640J23906R7270J8605j17897K8393M7666m3580l6326l4352
17146C84157n873M8761n8301o1658l317K3610l4270j07720l5738L3400R0027J08830
$$ plain form
17214 31007739 32343564 31236284 29164350 27216130 26271081 27012702 28889971 29994305
17206 29994305 28952897 25930585 21891309 17672776 13751424 10602525 8149053 6544449
17198 6544449 5479683 4700034 4030386 3573878 3212085 2995339 2777454 2656632 2469426
17189 2469426 2323056 2207687 2119256 2056695 1863348 1697071 1596200 1523733 1417649 1304356
17179 1304356 1256413 1175674 1095084 1079338 950518 813447 721787 669024 692141 732690 795959
17168 795959 810585 682765 657728 630611 636724 684253 763646 723505 726457 580729 416240
17157 416240 298832 300472 424378 521648 540253 422356 450749 498415 454835 418509 384157
17146 384157 378284 427045 368744 307086 303769 327379 293109 185389 149651 183051 273078 381908
17134C81908K394o4042M6648J9798j06917m8879m1427j17760O0775J57156o640
17123B83014o631K0841K0898J3137q6525m7000K6841n8056q2011J7386N8246m0722
17111A19418r1064M577J2859p1856p9378P0034Q2717O897o4676o7124J40762P5268
17099A38434L4395m1016j7105Q5644r5874k924J49329j3435m3160r1167J4206
17088A17327k5924j05530m6140J561J50119K7591k8511k2375q155j6373o3918
17077b0328P5983J11388J390k2103j2820P36l8030J06287L3195r8197N1281k2636
17065A66146p4122n1490L8400R06J8421O798Q5747q7032p1360N515J9372o108
17053E1193M5512Q7993q2107j36025p3801O4517J37455N5011J02117l2741j01655
$$ plain form
17134 381908 384302 320260 366908 386706 279789 230910 189483 71723 132498 289654 283014
17123 283014 276383 297224 318122 331259 244734 197734 224575 166519 84508 101894 160140 119418
17111 119418 28354 32931 45790 -26066 -105444 -35410 47307 54204 -10472 -77596 63166 138434
17099 138434 172829 131813 114708 200352 104478 101554 250883 237448 194288 103121 117327
17088 117327 91403 -14127 -60267 -58706 91413 119004 90493 68118 59963 43590 -20328
17077 -20328 55655 167043 168433 146330 133510 134246 96216 202503 235698 137501 188782 166146
17065 166146 92024 40534 78934 79840 98261 105059 190806 103774 32414 37929 57301 51193
17053 51193 96705 184698 102591 -33434 -107235 -42718 94737 149748 251865 219124 117469
17042A17469q1880m7511J6467N4165n970J1040M753O3062J995L948q8822q3581
17030c4865K8173L2439j5202K4060Q8857r3523M904J3260l0232k678J39360J5928
17018A70481o9399j13387j29429j9602J86310Q4195l9770k7252j5433j03061q9367
17007a65714K173J47931J38946N11l2482N1205K8799j850m3229r2991j220k8470
16995C609k3171k1646M5124R9809N265m0251L0563o8857l0911J43740N2208j13632
16983H1850n3820k4962j7008l5429q681K7146j17411M1032L8691K7322Q9312J04617
16971A52659l589r3231m4622j44663o7467J38498P2172N5393L0745n6785k8003
16960A1107L6206l3506m2606L0789K1094O1195l99j8113j06324L8949O4337O5465
$$ plain form
17042 117469 35589 -11922 4545 58710 52740 63780 68533 131595 133590 137538 48716 -34865
17030 -34865 -6692 25747 10545 34605 123462 29939 34843 48103 17871 15193 154553 170481
17018 170481 101082 -12305 -141734 -161336 24974 109169 69399 42147 26714 -76347 -165714
17007 -165714 -163541 -15610 123336 123847 91365 142570 171369 169519 126290 33299 32079 3609
16995 3609 -19562 -41208 3916 103725 108990 68739 99302 30445 -466 143274 195482 81850
16983 81850 28030 3068 -13940 -49369 -58050 -30904 -148315 -107283 -68592 -41270 48042 152659
16971 152659 149070 55839 11217 -133446 -200913 -62415 9757 65150 95895 39110 11107
16960 11107 47313 13807 -28799 1990 23084 84279 83880 65767 -40557 -1608 62729 128194
16948A28194m098L0468q2194o1767K1334l5449m1033r6490N9607N123J8691l0263
16936h7877P1016m143L8401M1117r054M183Q3189p9413p5233j9732j1370l552
16924e2468j10973J02239J19322L4511Q2353P8998n8860j05574l7566K1724j0169
16913F3537J8608k7236j27305l6714K0218o6638j5989Q4251J58125N3371m1844
16902H2384j33875n8537Q7371O2855J7123J19700J4623p7351m2588l6036q2723
16891d7054N5115N0443o1578r033p3237l4457Q7943R3853J18230O5767L4886Q5500
16879C66378k4744j03995j0923J3264l9604k2415L1700K1518N712K2966j02005
16868A57852p7420m0798P9716j3176p6827j1106K5458l8241L6430m4829m6110
$$ plain form
16948 128194 124096 154564 72370 10603 31937 -3512 -44545 -141035 -81428 -76305 -57614 -87877
16936 -87877 -16861 -21004 17397 58514 49460 53643 136832 57419 -17814 -37546 -48916 -52468
16924 -52468 -163441 -61202 58120 92631 174984 253982 195122 89548 51982 73706 63537
16913 63537 82145 54909 -72396 -109110 -88892 -155530 -171519 -87268 70857 124228 82384
16902 82384 -51491 -110028 -22657 40198 57321 177021 191644 114293 71705 35669 -47054
16891 -47054 8061 58504 -3074 -12107 -85344 -119801 -31858 61995 180225 245992 280878 366378
16879 366378 341634 237639 226716 239980 200376 177961 209661 231179 236891 259857 157852
16868 157852 80432 39634 119350 106174 29347 18241 43699 5458 41888 -2941 -49051
16857d9051J8100j097j6049m4272P6761j4954j18241j19M9419Q5942J8972m5405
16845c9994N8486M4221N4878O6167n9609j35016j13550J21140J01247J24672k4185
16834A98457m3757J6716Q127o6285K6350R23j19261P3255J35081J5118n1213K74
16822A93785K4576K3864j365m4307M5165m3695j19261j03656M3729R9067k382
16811A15520N4339j8502p6134j3280l3929K3657P303k306q0331l6425J55817O9993
16799A65722Q2273j659O8777m390n4574j14848J3867q1643r9058L1605N9470L0516
16787I6058q070J07q582K9293L8351p2683j0062P415j02091L7628L1604J7601
16775E6569m5158k1502M2787R552J03252j93j10912k9619R75k1973L0923Q9152
$$ plain form
16857 -49051 -30951 -32048 -48097 -92369 -15608 -30562 -148803 -148922 -99503 -13561 5411 -39994
16845 -39994 18492 62713 117591 183758 124149 -10867 -124417 -3277 97970 222642 198457
16834 198457 154700 171416 179543 113258 139608 140531 21270 94525 229606 244724 193511 193785
16822 193785 218361 242225 240860 196553 241718 198023 78762 -24894 18835 117902 115520
16811 115520 169859 151357 75223 61943 28014 51671 58974 56668 -23663 -60088 95729 165722
16799 165722 247995 246336 315113 310723 256149 141301 155168 73525 -25533 6072 65542 96058
16787 96058 87988 88095 79513 108806 147157 74474 64412 71827 -30264 7364 38968 56569
16775 56569 11411 -10091 32696 42248 145500 145307 34395 4776 5751 -16222 14701 103853
16763A03853K9376Q9122K5126M5062p7751j07352K3484J60190J3227J7825j1205
16752C10957n6786j0260L0111O7762N9847L2352L1334K0697o2477O5463j4062
16741D74938k25782j56332j12562n4481M6105K8909j4955j8815k1650n3498M9236
16730e8887k1400k6826l7852m0502N929K0665n3940q4006J10668J14599K7078
16719d4474k1849o1244N3015P0903R8883J4402p8549q0324K1220m0038k2743J41201
16707E0403R9145j6858N58o3789n6740p4253L1414J00429J31101k0352j9838p3847
16695H7373p3108l4865k3034p737O1069n1002q1047K4268n3313q2897M3508Q4040
16683a06745P4167P8202m1518q1609L1769Q3486L2205k366q2108l8121j0365J03709
$$ plain form
16763 103853 133229 222351 247477 292539 214788 107436 130920 291110 304337 322162 310957
16752 310957 254171 243911 274022 341784 401631 433983 465317 486014 423537 489000 474938
16741 474938 249156 92824 -19738 -74219 -28114 795 -14160 -32975 -54625 -108123 -58887
16730 -58887 -80287 -107113 -144965 -185467 -179538 -158873 -212813 -296819 -186151 -71552 -44474
16719 -44474 -66323 -127567 -74552 -3649 95234 109636 31087 -49237 -28017 -68055 -90798 50403
16707 50403 149548 132690 133248 69459 12719 -61534 -30120 70309 201410 181058 161220 87373
16695 87373 14265 -20600 -43634 -51371 9698 -41304 -122351 -98083 -151396 -234293 -190785 -106745
16683 -106745 -32578 45624 4106 -77503 -45734 37752 69957 67591 -14517 -52638 -63003 40706
16671D0706M9338o3097p0985q5305M5887M8492j269P5669j85959k203J47337L3480
16659C2091m9796p2819m3248m379R8259O363J9252N7120J5628k4583j7381R0619
16647A07126j28874j10899k7288k1515Q4470L4325k7214O0613m1536k1540l6055
16636a28387R0001J25339m5467j12894j33633k5634M6908J30125L9005J8948L3462
16625C7773o7909j3573J0186M4485j8593q011n2892L0474P676M9579m4135j11166
16613a36106N2423N2787n1089j6075R2909N8845j4211m7569K4077q734m8918l8554
16601h0215O9722O0739o9384j40784p570K8439R6751N3658K3638N4500K2604K6366
16589A38464J8250j0763j87756p3010O1423L0891K2163l2150j26077K3070J10244
$$ plain form
16671 40706 90044 26947 -44038 -129343 -83456 -34964 -36233 39436 -146523 -148726 -1389 32091
16659 32091 -17705 -90524 -133772 -138151 -39892 -33529 -14277 42843 58471 33888 16507 107126
16647 107126 -21748 -132647 -159935 -181450 -96980 -62655 -89869 -29256 -70792 -92332 -128387
16636 -128387 -38386 86953 41486 -71408 -205041 -230675 -183767 -53642 -14637 4311 37773
16625 37773 -30136 -43709 -33523 10962 -7631 -15642 -68534 -38060 -30384 19195 -24940 -136106
16613 -136106 -83683 -30896 -81985 -98060 -5151 53694 39483 -8086 15991 7257 -41661 -80215
16601 -80215 -10493 50246 -19138 -159922 -167492 -139053 -42302 11356 34994 89494 112098 138464
16589 138464 156714 145951 -41805 -114815 -53392 -22501 -338 -32488 -158565 -135495 -25251
16578b5251R3453K1449j65674M0987J7345l0915m7093M2917j2195J1749O5928
16567A2700R662L2545L9373O566j6519j1353m8397m7370n1713l0649J9214Q6490
16555E49J14571K6999j89862m3319q5952j0043P2368m4216j892O648j16052k693
16543b72894J39870K7022k3585o9203J6481R6269K5967k9724n2835J186K2114
16532a19332Q903n3654K5058K7599l4473n29j806O0798O4815k5413l1288P8510
16520h12q580m8881l7202l9613q5460L9785J49146K5851q607J58398R6856M2194
16508B83075j2103j0947j71894p7935J704j890m9511l7571l4588J7670p8826l8156
16496b10972J01746J52904j3191m2810P0273o277r8668j0340o5025n505J09692
$$ plain form
16578 -25251 68202 89651 -76023 -35036 -17691 -48606 -95699 -52782 -64977 -53228 12700
16567 12700 22362 54907 94280 100846 84327 72974 24577 -22793 -74506 -105155 -85941 549
16555 549 115120 142119 -47743 -91062 -177014 -187057 -114689 -158905 -160797 -154149 -270201 -272894
16543 -272894 -133024 -106002 -129587 -198790 -182309 -86040 -60073 -89797 -142632 -141446 -119332
16532 -119332 -110429 -164083 -139025 -111426 -145899 -146428 -148234 -87436 -22621 -48034 -79322 -812
16520 -812 -9392 -58273 -95475 -135088 -220548 -180763 -31617 -5766 -14373 144025 240881 283075
16508 283075 270972 260025 88131 10196 11900 10010 -39501 -77072 -111660 -93990 -172816 -210972
16496 -210972 -109226 43678 30487 -12323 57950 51673 -46995 -57335 -122360 -127865 -18173
16485a8173l7030k1751J96488N423q8723Q437K4660L2799r6122k0908l5112k4378
16473g4390K6897j3348m4198R2764L8657L4559M0814m911j39329N1302O1683j7523
16461E2977l5380l3483j6367O0805K5394j31296m8786L86L3614R1107l8892k7971
16449f7892q3080O2937K8974J4340M9225O1158J083o3581n6111j0934P0013m2875
16437c6743L2709k371J1900J11369N6383m6739j1064l5652l7083J00017K5960
16426A68686K3077n7568j36288r6871K7545L7994n0263n2759o4799l0256k7754
16415b59256O9671J42950k8376k4306M7507k3614p6688L1202L2383q4899k1518
16404a94944P3000j13191L9035P280J24954K2676o3610k6017J10214P8391O9662
$$ plain form
16485 -18173 -55203 -76954 119534 124957 36234 44671 69331 102130 6008 -14900 -50012 -74390
16473 -74390 -47493 -60841 -105039 -12275 26382 60941 101755 96844 -42485 8817 70500 52977
16461 52977 17597 -15886 -32253 28552 53946 -77350 -126136 -125750 -92136 -1029 -39921 -67892
16449 -67892 -150972 -88035 -59061 -44721 4504 65662 66745 3164 -52947 -63881 6132 -36743
16437 -36743 -4034 -6405 5495 116864 173247 126508 115444 79792 42709 142726 168686
16426 168686 191763 134195 -2093 -98964 -71419 -33425 -83688 -136447 -201246 -231502 -259256
16415 -259256 -189585 -46635 -75011 -99317 -51810 -75424 -152112 -120910 -88527 -173426 -194944
16404 -194944 -121944 -235135 -196100 -188820 -63866 -41190 -104800 -130817 -20603 57788 127450
16393A27450j2364j508o8266q4071q2653o4359q962M6659J33184J6421l8416L0429
16381f456O4066l6398n752M217o1938J0986N0233L4105R011R287L4767m2278r9904
16368c6054J05910J5497q5061R19k3187n7342O2837K1084q7958K1940L8035J39531
16356A16151P2396O974j29407l2980q3871j6677K5836O7679M9790k8219l8340
16345I332m0555l7468J6952j6779n2610J6276R8976q2421L0020R1071J41236m5582
16333A28448j52305r0231M1378O214J25942l0188l7805k8059L0052j1986n2929
16322g1469K3256J11808L9089m0204l9483l0436N3486J0362r1132p9478N1801
16311f2400m3119J7543P9446L4914j51859r6626M4428m0286O2249Q9299O1047
$$ plain form
16393 127450 115086 113578 45312 -38759 -121412 -185771 -194733 -148074 -14890 1531 -36885 -6456
16381 -6456 57610 21212 15460 19677 -42261 -31275 18958 53063 62074 71361 106128 63850 -36054
16368 -36054 69856 85353 292 1211 -21976 -79318 -16481 4603 -83355 -61415 -23380 116151
16356 116151 188547 195521 66114 33134 -50737 -67414 -41578 26101 75891 47672 9332
16345 9332 -31223 -68691 -51739 -68518 -121128 -104852 -5876 -88297 -58277 32794 174030 128448
16333 128448 -23857 -114088 -72710 -66496 59446 29258 -8547 -36606 -6554 -18540 -71469
16322 -71469 -48213 63595 102684 62480 22997 -7439 46047 56409 -34723 -114201 -62400
16311 -62400 -105519 -87976 -8530 26384 -125475 -222101 -177673 -217959 -155710 -66411 -5364
16300e364l0649q856o5477L5635N9695j504R9061o8718r0933N6312k2078J7834
16288b5042Q1318j0517o0709O531M8030N408L4663j9225p4146j46630L7452R4526
16276b8341M4686J3476q0776Q130N0763k1082o300k5430K112j01842q8218o851
16264b39673P2245N195j7297r775R6500j752P5908l8638R0567J40149p0120j18232
16252a4923N0125N7278M3782P2252p1670m7255n8264n782O8679j4416p6331K35
16240C710o781J014J3765J21477J6735j2712p8401n4527l1260K5914o2517l4201
16228i7784N9909q6705m0617J10534L2489N7115Q6341j13670J6938J40438N3856
16217B18844n2771q7661n71M1723l9111L6037P8061p7412o2589n8453j22113J3302
$$ plain form
16300 -5364 -36013 -44869 -110346 -74711 -15016 -16520 82541 13823 -77110 -20798 -42876 -25042
16288 -25042 56276 45759 -14950 -8419 39611 45019 79682 60457 -13689 -160319 -122867 -28341
16276 -28341 16345 29821 -50955 -42825 7938 -13144 -19444 -44874 -42762 -144604 -232822 -239673
16264 -239673 -167428 -162233 -179530 -189305 -92805 -94557 -18649 -57287 33280 173429 103309 -14923
16252 -14923 35202 92480 136262 208514 136844 89589 31325 25543 94222 79806 3475 3710
16240 3710 -3071 -2057 11708 133185 149920 137208 58807 4280 -26980 -1066 -63583 -97784
16228 -97784 -37875 -124580 -165197 -54663 -22174 34941 121282 7612 24550 164988 218844
16217 218844 166073 78412 77841 119564 80453 116490 194551 117139 54550 -3903 -126016 -112714
16205a12714R5717J9730o3075r1861p7238J7564O5179Q022m4794k2781J05121
16194a01130M8731J4459J25549j04294k1678J03761l7140m6649j04707r8695P5
16183b21718J05891J11272Q5399j8081l1271j4159L2052L0702m4484j6678p1386
16172e2461j368l2897k9649q640P0984N3797O237L346j36507q3240M8315J29350
16160c2733J25018j2508j8906j82009o8932O9528M8717L7463k3079j06322k4615
16149a88378M4214J08676m8174l9351j34847m3726K8698J69255l2495r7431m4530
16138b78089R7604N8344P1910J20172R6583j01061j52442Q945o5537k6720N5922
16127a14369O839q6291L093k6462M7078L5753k806J4535L6862M4563L1698n5643
$$ plain form
16205 -112714 -16997 2733 -60342 -152203 -229441 -211877 -146698 -138676 -183470 -206251 -101130
16194 -101130 -52399 -37940 87609 -16685 -38363 65398 28258 -18391 -123098 -221793 -221718
16183 -221718 -115827 -4555 80844 62763 31492 17333 49385 80087 35603 18925 -52461
16172 -52461 -53829 -86726 -116375 -125015 -54031 -234 6003 9349 -127158 -210398 -162083 -32733
16160 -32733 92285 79777 60871 -121138 -190070 -120542 -71825 -34362 -57441 -163763 -188378
16149 -188378 -144164 -35488 -83662 -123013 -257860 -301586 -272888 -103633 -136128 -233559 -278089
16138 -278089 -180485 -122141 -50231 69941 166524 65463 -86979 -78034 -143571 -170291 -114369
16127 -114369 -107530 -193821 -190728 -217190 -170112 -134359 -137165 -122630 -85768 -41205 -9507 -65150
16115f5150q0012l5588o1528J6994P3462J19976J9350p6038o7082k34r3646p452
16103b56948k9701J06036J44891r9411J4911Q255n595Q9714R2728j30087q182
16092g3389M8052o5579l3731L6087L2031N2763l1593j7105m386K7992J592K4813
16080b453l5391l0402M0375J07732l7371o5781o0751l1368L4394J29967Q2504
16069A31455l376j09j7407k891k4373J122O3210j8107k3960j20883l7487o692
16057e9498J19391J12744j08204j17927j18034p338p082l0273Q3008J13946p5049
16046i4316q5585M4078R4901j02750j7243M4609k6216L4338J09104K0736o014
16035A5642r8448M7609M2144M2696N6867J6450p1999N1938o0924p2630N649Q0010
$$ plain form
16115 -65150 -145162 -180750 -242278 -225284 -151822 -31846 -12496 -88534 -155616 -155850 -249496 -256948
16103 -256948 -286649 -180613 -35722 -135133 -120222 -111967 -117562 -27848 64880 -65207 -73389
16092 -73389 -25337 -90916 -124647 -88560 -56529 -3766 -35359 -52464 -56850 -28858 -27266 -2453
16080 -2453 -37844 -68246 -27871 79861 42490 -23291 -84042 -115410 -81016 48951 131455
16069 131455 128079 127970 110563 107672 83299 84421 147631 129524 105564 -15319 -52806 -59498
16057 -59498 59893 172637 64433 -53494 -171528 -178866 -185948 -216221 -133213 -19267 -94316
16046 -94316 -179901 -135823 -40922 -143672 -160915 -116306 -142522 -108184 920 21656 15642
16035 15642 -82806 -35197 6947 49643 106510 122960 50961 102899 41975 -30655 -25006 55004
16023E5004K9868Q2004n1404j36098j47466L9390J02528L4046j33195m2255K5394
16012a42184j1779M9731R0271K0035j01279l9652O1754N1742j1966k5880K7063
16001c2144L9469k9330L4300O7871n7324k6351l4617r6410m6439P2236M641J8332
15989h5766K5692K2140K8998m9548P3845J5782k1308n10Q773q018L8639M9870
15977I8589R508M137q6602n1609Q9037P71m1865L2736O500l7199m1811K9878l9896
15964b7826p5569l0836J10073J05923n9896M9953n965j09631o4818M6018Q2354
15953A9780O3789l0602M8254k0443j41256k9858q277q2414m8273K7068L6864P9344
15941h6024O4154L1780L5085o1365p264Q5627L8235n9171p291j13447o365J9544
$$ plain form
16023 55004 84872 166876 115472 -20626 -168092 -128702 -26174 7872 -125323 -167578 -142184
16012 -142184 -153963 -104232 -13961 6074 -95205 -134857 -73103 -21361 -33327 -59207 -32144
16001 -32144 7325 -22005 12295 80166 22842 -3509 -38126 -134536 -180975 -108739 -104098 -85766
15989 -85766 -60074 -37934 -8936 -58484 15361 31143 9835 9325 18098 10080 48719 98589
15977 98589 108097 112234 25632 -25977 63060 63831 21966 54702 61202 24003 -17808 12070 -27826
15964 -27826 -103395 -134231 -24158 81765 21869 71822 65857 -43774 -108592 -62574 19780
15953 19780 83569 52967 101221 80778 -60478 -90336 -98613 -181027 -229300 -202232 -165368 -86024
15941 -86024 -21870 9910 44995 -16370 -23634 61993 100228 41057 33766 -79681 -86046 -66502
15929f6502J5451j7473m3695M8637O5640J5889j12103K1722P040n6950L1787R063
15917h1494J26622N9973j23762p6436R3474M9079O406J3127K9107J6552q4254
15906B8394j47375K1466J134M7189l5090l7311L46l3273Q1929K9401Q2901Q0192
15894A19903l4904j49694n8150J97848J75243n0935j69399l5167K5472J01403
15884A21620j5813n7667Q6263N0144J1825j13842n8738L0035r0317k1817k1099
15873g9406n1L2331q469n6995R3388L3834K1665j7167r276k4308L3321J2688j8142
15860A3413P8319k5211R62j6909o0910m9508J10759N2570q7871R1992k370j02828
15848B408N882L4166K7458L7451J869r6969q3595L8272m2315l6102N3861k183
$$ plain form
15929 -66502 -51051 -68524 -112219 -63582 2058 17947 -94156 -72434 -65394 -122344 -90557 -81494
15917 -81494 45128 105101 -18661 -95097 -1623 47456 53862 66989 96096 112648 28394
15906 28394 -118981 -97515 -96381 -49192 -84282 -121593 -121247 -154520 -72591 -43190 39711 119903
15894 119903 84999 -64695 -122845 75003 250246 199311 29912 -5255 20217 121620
15884 121620 105807 48140 134403 184547 196372 82530 23792 53827 -36490 -58307 -79406
15873 -79406 -79457 -47126 -55595 -112590 -19202 14632 36297 19130 9854 -14454 18867 31555 13413
15860 13413 91732 66521 67483 50574 -10336 -59844 50915 103485 15614 107606 105236 2408
15848 2408 8290 42456 69914 107365 109234 12265 -71330 -33058 -75373 -111475 -57614 -59797
15836e9797R5758M6637M0268j54308o6426k5010J2320R4622P7366l3429n3763
15825b5762n0107q7599o4057p7885J39224J9929L8737P2530m8361Q00K8024O7911
15813A3384K6994l5727k6373o3153k7857l2032J01037O4050O6975K5645n4547
15802E8396l4103K1099K7257l6941j11230j32267Q4990J10419P203N6074K5230
15791G6127J2187p7561p8603J0140m6066j18172L528P2638o3660K0375L001j42989
15779c29055M3041J28799L044M9586k9561j8425j053l3846j439N4178o2469O2850
15767a34350N5605q8954j380J02744k4310m0067o906l8838k6145J3823J19616
15756f9162q949Q2408k9254J469J7291M3643N8167n6522K3906o0069N7336n3871
$$ plain form
15836 -59797 35961 82598 122866 -31442 -97868 -122878 -110558 -15936 61430 28001 -25762
15825 -25762 -75869 -163468 -227525 -305410 -166186 -146257 -107520 -34990 -83351 -82551 -54527 13384
15813 13384 40378 4651 -21722 -84875 -112732 -144764 -43727 20323 87298 112943 58396
15802 58396 24293 45392 72649 35708 -75522 -207789 -122799 -12380 -5177 50897 76127
15791 76127 88314 10753 -67850 -57710 -103776 -221948 -218420 -145782 -209442 -189067 -186066 -329055
15779 -329055 -286014 -157215 -154171 -104585 -134146 -152571 -153624 -187470 -188909 -134731 -197200 -134350
15767 -134350 -78745 -167699 -169079 -66335 -90645 -130712 -137618 -176456 -202601 -188778 -69162
15756 -69162 -78111 4297 -24957 -23488 -6197 37446 95613 39091 62997 2928 60264 6393
15744F393j81656M93J45146N2363N5160Q4959J5177j06918m7888o9124k8887l3209
15732a07991k0973m0674l7931k5914N6321k9152N6971J65357j0680q5211R3083
15721A3206Q7601q1967o9246J01764k3718K3521o77o1611L3193k2500o2640j8758
15709h1832L4705K6947K0365R4208q227k9555j60037q4319P7449P4858R7746L2582
15697I4890o0216K5505M9606L4779L0630p6235m9403j27586N3186Q1175j7950
15686C8381P560K0515o891k4876J1887m552l5135m5384k0939P7602Q1762J8113
15674A18043j02948p8451k0933M0548k6882K7190J44791J9361m4153m5380L0092
15663F1278N9904p5401o9130j4387O7918n2873r8896o9022M414J28381k1137j0727
$$ plain form
15744 6393 -175263 -174770 -29624 22739 77899 162858 178035 71117 23229 -45895 -74782 -107991
15732 -107991 -128964 -169638 -207569 -233483 -177162 -206314 -149343 16014 5334 -79877 13206
15721 13206 100807 18840 -50406 51358 27640 51161 50484 -11127 22066 -434 -63074 -81832
15709 -81832 -47127 -20180 185 94393 86166 56611 -103426 -187745 -110296 -35438 62308 94890
15697 94890 34674 60179 109785 144564 175194 98959 49556 -78030 -24844 56331 38381
15686 38381 45941 66456 59565 34689 46576 42024 6889 -38495 -59434 18168 99930 118043
15674 118043 15095 -63356 -84289 -43741 -70623 -43433 101358 120719 76566 31186 61278
15663 61278 121182 45781 -23349 -37736 30182 -22691 -121587 -190609 -186195 -57814 -78951 -89678
15651h9678O1109j827j15910N272J5004j3973K632j9399l655N3043J86891J2830
15639I2339j15807l6577P6799o766k2780j22433M91P462K7292n3867q273Q8346
15627g3774L6264K3194N7278j3924k2696o8001J13052M9523r9665j07483o9113
15616a75345R9341O1402n6192k8561O691L448R4525N6162J3216m5714J7087q0902
15604c4842k2210O5410k2608J7066P5741m916j26975j5672J15906J2096k3502
15593C5494j786m3025J0681m7494K254O1842j5275l4200r7399K8198J09686J00372
15581A09348j29075j37500j8895O7146O6629o2014j00928O2189k2311J08K910
15570a62393p1136p8311M4245J28478k5173j213J22766J09922K3444p3671o9079
$$ plain form
15651 -89678 -28569 -30396 -146306 -141034 -126030 -140003 -137371 -156770 -160425 -107382 79509 92339
15639 92339 -23468 -60045 16754 9988 -12792 -135225 -134734 -127272 -99980 -153847 -162120 -73774
15627 -73774 -37510 -14316 42962 29038 6342 -61659 51393 100916 1251 -106232 -175345
15616 -175345 -76004 -14602 -70794 -99355 -92664 -89216 5309 61471 74687 28973 46060 -34842
15604 -34842 -57052 8358 -14250 2816 78557 73641 -53334 -69006 46900 58996 35494
15593 35494 33708 -9317 1364 -46130 -43876 17966 2691 -31509 -128908 -100710 8976 109348
15581 109348 -19727 -157227 -176122 -108976 -42347 -104361 -205289 -143100 -165411 -165303 -162393
15570 -162393 -233529 -311840 -267595 -139117 -164290 -165503 -42737 67185 90629 16958 -52121
15559e2121j14570j9883N7062M5995m5587L5117R106J0576N9042o5338k2179l2959
15547a35739J921N0512J50362r16j42016j17597N3405K9877J78168m6042r3002
15536g1067p4728j6823N7961J27252M2053j38600l6127j3580m9463N058l685R2952
15524g8797O3760m024J9213K3571J2466q7895r8597M3496j0601j9033N1930J7461
15512f7050N1025r067q9426m4349j47625j6252J70644J83826N5348k0606j37476
15501g1008k4405J9453j09702k4383k7096R0678p963p1054J3728o717J12634J05813
15489b2J7581o9626Q0405J4230j14406L2569k6323k1932K1925N5413R335O7326
15477F6475M1503j8811j7759K1208j06799l2601p296j4255J3569N3573J6652k5796
$$ plain form
15559 -52121 -166691 -186574 -129512 -83517 -129104 -93987 -84881 -74305 -15263 -80601 -102780 -135739
15547 -135739 -133818 -83306 67056 66140 -75876 -193473 -140068 -110191 67977 21935 -71067
15536 -71067 -145795 -162618 -104657 22595 64648 -73952 -110079 -123659 -173122 -168064 -171749 -78797
15524 -78797 -15037 -19061 152 23723 36189 -51706 -150303 -106807 -117408 -136441 -84511 -67050
15512 -67050 -16025 -25092 -114518 -158867 -306492 -322744 -152100 31726 87074 66468 -71008
15501 -71008 -95413 -75960 -185662 -210045 -237141 -146463 -154426 -225480 -211752 -218469 -105835 -22
15489 -22 17559 -52067 28338 42568 -71838 -39269 -65592 -87524 -65599 -10186 -851 66475
15477 66475 107978 89167 71408 92616 -14183 -46784 -54080 -68335 -54766 -1193 15459 -10337
15465a0337j07034K1642J12733l0564j0710Q366p9194m2702o0222Q5478m557J9498
15453i7603p1011j2728K8531M6690L7455K706j8936m0j5402n1861P5439Q1568
15441D808p4985M6485J5623L5672N9848j938n0610n0958l5041k0622m0439J16552
15429D395P5892r1357J7651j2511K9285L2444L6244l0763o0187J3797p3090o7333
15417a25533O53l7578n0832k057J29047M8449r3829m0264R3157q84j417m619K172
15404h3535M202N1778j9742K7859j1038o9310N0101p4980J9003O5024p66l8740
15392h0144K2825L322m4079P8663Q4179o7326K1313P361J52460N690j38026j19629
15380g3391k324n397L5343J9030l0070O1026L3275j3365M1952O5645o3179l9904
$$ plain form
15465 -10337 -117371 -95729 17004 -13560 -24270 -15904 -95098 -137800 -198022 -112544 -117101 -97603
15453 -97603 -168614 -181342 -152811 -106121 -68666 -65960 -84896 -84936 -100338 -152199 -76760 4808
15441 4808 -70177 -23692 -8069 27603 87451 85513 34903 -16055 -51096 -71718 -112157 4395
15429 4395 80287 -11070 6581 -5930 23355 55799 92043 61280 1093 14890 -58200 -125533
15417 -125533 -124880 -162458 -213290 -215347 -86300 -37851 -131680 -171944 -78787 -79671 -81088 -85707 -83535
15404 -83535 -79333 -27555 -47297 -19438 -30476 -99786 -49685 -124665 -105662 -40638 -41404 -80144
15392 -80144 -57319 -53997 -98076 -19413 64766 -2560 18753 26114 178574 184264 46238 -73391
15380 -73391 -75715 -81112 -45769 -26739 -56809 4217 37492 24127 66079 131724 68545 28641
15368B8641n9784N0456p894l956j7773M153J6884j1547Q4025J9252j23140m1093
15356f1776J26012J5464k8927K0174N2120m5256q3928k0543k5822j9744n5529
15345a27755P3784l805q448k9406J98341J51972L8374m8774j21704m6979o1504
15334A4096M5164K1606j71380p4303k932K2990N1280J24723J0837p3799j9572
15323e1290k0142O1415p1971n4857n407j1450j0472L036R4132O5223M3804J1133
15311E3154o8650o6841l3010n6752o49m9029K7330M1230K3210L1049k097q7585
15299a88640l0474Q4850J20289P8813q9414O504P6499l7416L320L6047o7375o6001
15287g2998q3773J3053P8034m5414n5951J85779K4104j5944q836p9623q2575O3411
$$ plain form
15368 28641 -31143 19313 11419 7463 -10310 -6157 10727 -820 83205 102457 -20683 -61776
15356 -61776 64236 79700 50773 70947 123067 77811 -6117 -26660 -52482 -72226 -127755
15345 -127755 -53971 -57776 -66224 -95630 102711 254683 293057 244283 122579 75600 14096
15334 14096 59260 80866 -90514 -164817 -167749 -144759 -93479 31244 42081 -31718 -51290
15323 -51290 -71432 -10017 -81988 -136845 -142252 -153702 -164174 -161138 -67006 -1783 42021 53154
15311 53154 -15496 -82337 -115347 -172099 -172748 -221777 -194447 -153217 -130007 -98958 -101055 -188640
15299 -188640 -219114 -134264 -13975 64838 -24576 -18072 58427 21011 24331 60378 -6997 -72998
15287 -72998 -156771 -143718 -65684 -111098 -167049 18730 42834 26890 18054 -61569 -144144 -80733
15275h0733j3318k9541p6499O9712M7119M3198J5653J0559j29115m3710P249L5438
15263a43988R3396O4525p9267N2924k40l7815P092k453O4931O468O550k3313O5163
15250G3973K9074l3371q8517o9240l7758j7727N6682J89027j356J0556m4888j85299
15238a18844m2183L8506N1921K3906m8697j3550O920M0096K9286O7436M386J8557
15226E7740j1302L9857j00219j54358J2486R2767K9866p880m6795p1277j2393
15215a71508M2589P0829n3584p3208K8670R5699M8403n6337K9995o532n8809k9073
15203a32866J16181Q6038r3232r2105N490J2949k9229l3309M0325P6677m178q3211
15191a30470P0027P3628q5292Q9776n1469n8414o0626O5848P5531L7331l4886
$$ plain form
15275 -80733 -94051 -123592 -200091 -130379 -83260 -40062 -24409 -13850 -142965 -186675 -179426 -143988
15263 -143988 -50592 13933 -65334 -12410 -12650 -50465 -43373 -45826 19105 25573 32123 8810 73973
15250 73973 103047 69676 -18841 -88081 -125839 -143566 -86884 102143 100787 111343 66455 -118844
15238 -118844 -161027 -122521 -70600 -46694 -95391 -108941 -102021 -61925 -32639 34797 39183 57740
15226 57740 46438 86295 -13924 -168282 -155796 -63029 -33163 -41043 -87838 -159115 -171508
15215 -171508 -128919 -58090 -111674 -184882 -156212 -60513 -12110 -68447 -38452 -44984 -103793 -132866
15203 -132866 -16685 69353 -23879 -115984 -110494 -97545 -126774 -160083 -119758 -43081 -47259 -130470
15191 -130470 -60443 13185 -72107 17669 -33800 -92214 -152840 -86992 -11461 25870 -9016
15180i016K0163m6814m0780J3260Q8196M6074m7168o4060N5229N3158j51773j45230
15168b28761p7417J14670P6760j4501P7633J8469Q889J7329m4218r9228O9064
15157h1311O5822j02000p222R3639q028Q161J03609L0506j64527m0684N0840n8453
15145a09648r6900N1469J11370N5528o2557K0078m4446o8978o337n6553J88988
15134a7986k1327j53278L4994Q0333p3154L1566Q088k6510P2450L0907N5776k7761
15122e902j8637l437p6647N7904N3219R0342L6372Q7383j53731J3333l242j56319
15110g9362J1066N3871L8048j8559l6762L0679o2919o8935O2209P5627N1011k0442
15098C5532l2143j6192Q2816N7962j23916j50655J2897J2163P3029L1005p0075
$$ plain form
15180 -9016 11147 -35667 -76447 -63187 25009 71083 23915 -40145 15084 68242 -83531 -228761
15168 -228761 -306178 -191508 -114748 -129249 -51616 -33147 -24258 -6929 -51147 -150375 -81311
15157 -81311 -15489 -117489 -124711 -31072 -39100 -30939 72670 103176 -61351 -102035 -51195 -109648
15145 -109648 -206548 -155079 -43709 11819 -50738 -30660 -75106 -144084 -150421 -206974 -17986
15134 -17986 -39313 -192591 -157597 -77264 -150418 -118852 -110764 -137274 -64824 -33917 21859 -5902
15122 -5902 -24539 -27976 -104623 -46719 6500 96842 133214 220597 66866 80199 76957 -79362
15110 -79362 -68296 -14425 23623 5064 -31698 -1019 -63938 -132873 -70664 4963 55974 35532
15098 35532 3389 -12803 70013 127975 4059 -146596 -133699 -121536 -48507 -17502 -87577
15087h7577R158k1874O7674P2694P7778O7592J20239j48828q1161M8567J5323
15076A39585j04358j22286J9698N1227r0391m360p1639o5923M9557M6899Q2975
15065f9016J27820l9865r7756N9193O0652j11723m8015N2551J5621Q7734l2205
15054D991m1810R570J45046J21882L6894o1456j99319j54578j1255K0611L797
15043a25627p09k2839k3061r249P4290K2219r7705Q3969J0436p4629j4742R626
15031a68021O5241r5714R004J23232p2418o601N1093J12141O1317l8700o6969
15020b6395o5687k7227Q1077l7973J6434n5391j9088L9723k6028k6016J03254
15009d3317K6675n7343j20994r456J32878R880j14857q8748L5882L7140m6714
$$ plain form
15087 -87577 -78419 -100293 -32619 40075 117853 185445 305684 156856 75695 124262 139585
15076 139585 35227 -87059 -67361 -16134 -106525 -110885 -182524 -248447 -198890 -151991 -69016
15065 -69016 58804 18939 -78817 -19624 41028 -70695 -118710 -66159 -50538 37196 4991
15054 4991 -36819 -27249 117797 239679 276573 215117 15798 -138780 -150035 -129424 -125627
15043 -125627 -126336 -149175 -172236 -181485 -107195 -84976 -182681 -98712 -88276 -162905 -177647 -168021
15031 -168021 -102780 -198494 -189490 -66258 -138676 -145277 -94184 17957 79274 40574 -26395
15020 -26395 -92082 -119309 -38232 -76205 -59771 -115162 -134250 -94527 -120555 -146571 -43317
15009 -43317 -16642 -73985 -194979 -204435 -71557 -61677 -176534 -265282 -229400 -192260 -238974
14998b38974Q115R4737n180O033O7869M3423K2306L6694O9233q9170k2707Q4404
14986G6783K5181j6221j68744l4179k0878J0617K3232N2180k9382K9507N4552
14975B648O8547J482l2900j65618Q862p209M4253J24861L8030J928l5869j1571
14963C7444k115K4925P044N212O3987j05260r9891o3970J01832L835m3510J0218
14951f0249P0343o9284m1003o8329l5577N4685l6139J1523L1334j2244q795L8876
14939a24859q5953n1291K6853P3309J35436L3780N4090q7021L79l3519Q118L1817
14927a8861L6929k108n3921p2181MJ33007l2527n5420p1624K5119Q5193K5567
14915h23L1374N0941O267k5342l5153p6779N5279M9925q4098m4396L531j9167
$$ plain form
14998 -238974 -230859 -136122 -141302 -135269 -67400 -23977 -1671 35023 104256 15086 -7621 76783
14986 76783 101964 85743 -83001 -117180 -138058 -127441 -104209 -52029 -81411 -51904 2648
14975 2648 71195 72677 39777 -125841 -116979 -124188 -79935 44926 82956 84884 49015 37444
14963 37444 35329 60254 67298 72510 136497 31237 -68654 -132624 -30792 -26957 -70467 -60249
14951 -60249 10094 -59190 -100193 -168522 -204099 -149414 -185553 -174030 -142696 -154940 -163735 -124859
14939 -124859 -210812 -262103 -235250 -161941 -26505 7275 61365 -25656 -25277 -58796 -50678 -18861
14927 -18861 18068 15960 -37961 -110142 -110138 22869 -9658 -65078 -136702 -111583 -26390 -823
14915 -823 30551 81492 87759 62417 27264 -49515 5764 55689 -28409 -72805 -69274 -88441
14903h8441L4178J2931l5132k6310K3072P6397K933k2899J11909K1707r2963n8333
14891d0951L4604q329l8036m7732n1803J7939R7765k3196N0847j51277j0584Q5076
14879h5677l3228L9613m2837J4483J07717J19269n506j29540J0659j2399j27326
14868a44772o6005j9759Q1696o333j4931M3832k3003J2627P6693J4316r6652R754
14856a32537K2492j15072J0118L9502L5716M1808k2969O7143N8021J16181j9754
14845A00649l0183l0004l782J7548q483J239P5628l2913j85744j48882K9385P3057
14833a42485r635J29140n3894j9767N5485R978m5137n7457J08129N1407m8859
14822b3095k3752o2548L3675J46318K8481l363k9320N1293K0862j31143K0735
$$ plain form
14903 -88441 -54263 -41332 -76464 -102774 -79702 -3305 -372 -23271 88638 110345 17382 -40951
14891 -40951 -6347 -14676 -52712 -100444 -152247 -134308 -36543 -59739 -8892 -160169 -170753 -85677
14879 -85677 -118905 -79292 -122129 -107646 71 119340 113834 -15706 -5047 -17446 -144772
14868 -144772 -210777 -230536 -148840 -155173 -170104 -126272 -149275 -136648 -59955 -45639 -142291 -132537
14856 -132537 -110045 -225117 -214999 -175497 -139781 -97973 -120942 -53799 4222 120403 100649
14845 100649 70466 40462 36680 54228 45745 46984 122612 89699 -96045 -244927 -215542 -142485
14833 -142485 -152120 -22980 -76874 -96641 -41156 -31178 -76315 -133772 -25643 25764 -23095
14822 -23095 -46847 -109395 -75720 70598 99079 95716 66396 117689 138551 7408 28143
14811B8143r290K7318j11104P1830K9510L382P4829r758p1828N4064J0874q176
14799H9794o6106m6223M9273J06767M3965n843l577P318q3493j9275J5950R5066
14787A83616N0807N304j33816q8237j16577q171j6085j218m4482m2637m8570K6981
14775b33085M2573P4271L3683R2529M9939m7991J9281M8426J07398n910j37409
14764D3705p8565O5531N5803l0545R001J1148k6377M3228k7962j26308J3116K1048
14752b7177j10184J00858J32709l1241m1695L1970r8450n0251R2429k6874Q607
14741a9299L3188l332M3297k702L1753K6876o326k6687o7941j07675n6954K3740
14729a32062M8401n29M8395M3566K0879K8304n9190m7505K9159k3219L6726O0770
$$ plain form
14811 28143 18853 46171 -64933 6897 36407 39789 114618 104860 33032 87096 97970 89794
14799 89794 23688 -22535 26738 133505 177470 171627 168050 175368 91875 72600 88550 183616
14787 183616 234423 239727 105911 17674 -98903 -107074 -123159 -124377 -168859 -211496 -260066 -233085
14775 -233085 -190512 -116241 -82558 9971 59910 11919 31200 79626 187024 181114 43705
14764 43705 -34860 30671 86474 55929 64930 76078 49701 92929 64967 -61341 -48225 -27177
14752 -27177 -137361 -36503 96206 64965 23270 55240 -43210 -93461 -1032 -27906 -19299
14741 -19299 13889 10557 53854 51152 82905 109781 103455 76768 8827 -98848 -155802 -132062
14729 -132062 -83661 -84190 -35795 7771 28650 56954 -2236 -49741 -20582 -43801 -7075 53695
14717E3695m7057M820K5302P8033J03971m5805j23537p83J5808r3693j2530p669
14705d9445k0513r5281k2056P2830J21285N1733M3069L6024l7421k9823j6251
14694E4151o8876k2384J2108l1233m3462q4712j7128k31J11765J01875k3062o1078
14682g2267M0370o5438j3729K513Q5389P3434Q4665j42171j91532k8840J18376
14671a09230N6368l3573p0930J00448O9024n1285m1237M6950Q7396K2987l1266
14660D5652l1054n915J4170m8731n8384n2578O7969N5712J5060p3662n1586q3198
14648b06545Q0945J00567K7084P2028q406n3384k3243n2569J10556J8533n382
14637F0184m5142o048K8306R6230L5268q9625q2112n5759m3096j21743K3576O3327
$$ plain form
14717 53695 6638 11458 36760 114793 218764 172959 49422 48639 64447 -29246 -41776 -49445
14705 -49445 -69958 -165239 -187295 -114465 6820 58553 101622 137646 100225 70402 54151
14694 54151 -14725 -37109 -25001 -56234 -99696 -184408 -201536 -201767 -90002 11873 -11189 -72267
14682 -72267 -31897 -97335 -111064 -108551 -23162 50272 134937 -7234 -198766 -227606 -109230
14671 -109230 -52862 -86435 -157365 -56917 12107 -39178 -80415 -33465 53931 76918 45652
14660 45652 14598 8683 22853 -25878 -84262 -136840 -68871 -13159 1901 -71761 -123347 -206545
14648 -206545 -125600 -25033 2051 74079 65673 12289 -10954 -63523 47033 65566 60184
14637 60184 15042 8994 37300 133530 168798 79173 -2939 -58698 -101794 -223537 -199961 -136634
14625a36634N5135M4756q0715q9935n9867n6717M1859k3901P0736K09508R4123
14614F8348Q004L454m9931k6965k2810n5216k8435J0856M4509P5249K6319N0229
14602A03611k2705r0901j23211R8359K9461r4736Q7862J40764l5024r1745r4308
14591i2573m849P863j17271K6676R3719O6581M9608j5770L4651k3561M5529P7963
14579A48566J29737J801j30023m3345j5723j04136o8921o6065P9696J01591M80
14568C3658J2818k9010p566j65544j29144O4661j3927k5705J19946J07804K5831
14557f178o5274r740m4918J8351K3078R879L9999M4248m7509N2341M6296q1004
14545b0431r187J6768o276Q6180k3751k3020l0922j9272J0226n9823L4411O2012
$$ plain form
14625 -136634 -81499 -36743 -117458 -207393 -267260 -323977 -282118 -306019 -235283 -25775 68348
14614 68348 76352 79806 29875 2910 -19900 -75116 -103551 -92695 -48186 27063 53382 103611
14602 103611 80906 -9995 -133206 -34847 -5386 -100122 -12260 128504 93480 1735 -92573
14591 -92573 -97422 -89559 -206830 -180154 -86435 -19854 29754 13984 48635 25074 70603 148566
14579 148566 278303 280104 150081 106736 91013 -13123 -82044 -148109 -68413 33178 33658
14568 33658 46476 17466 9900 -155644 -284788 -220127 -234054 -259759 -139813 -32009 -6178
14557 -6178 -71452 -81192 -126110 -107759 -84681 -74802 -34803 9445 -38064 14277 60573 -20431
14545 -20431 -29618 -12850 -19126 67054 43303 20283 -10639 -29911 -19685 -79508 -45097 16915
14533A6915P2692P041p1746r4122O3593l281p6841o6169j1280P2943J18666Q3343
14521A11754r9592J9663O1447j47779p4396L1898L4369K7646k4820n3300K0050
14510i3060K1561q7565J05647R5624q5573j1703l0039j27762m9878J34111Q9114
14499c9523N1608j10822R3453o8749q4484N322K808J05080O0816j8628j30231
14488a33350q3910L3209O0098J40377k5967j13219n2707L4127J22928J3733p1825
14477g6506n2572m5926O6862O2059K7673j11470n0049l2815L3181R4282K4687
14466f0594l0896k1132P6373M7092j3927j3239M8298j9659L410N4604k1240J2645
14454F1735l4759k1279L3616M7414K3831L2599M7801k3733N827n0352k7279M8276
$$ plain form
14533 16915 89607 96648 24902 -69220 -5627 -8908 -85749 -151918 -163198 -90255 28411 111754
14521 111754 12162 31825 93272 -54507 -128903 -97005 -62636 -34990 -59810 -113110 -93060
14510 -93060 -71499 -159064 -53417 42207 -43366 -55069 -85108 -212870 -262748 -128637 -39523
14499 -39523 12085 -98737 -5284 -74033 -158517 -153195 -150387 -45307 15509 -3119 -133350
14488 -133350 -217260 -184051 -123953 16424 -9543 -122762 -175469 -141342 -18414 -4681 -76506
14477 -76506 -129078 -175004 -108142 -46083 -18410 -129880 -179929 -212744 -179563 -85281 -60594
14466 -60594 -91490 -112622 -36249 10843 -3084 -16323 31975 12316 15726 70330 49090 61735
14454 61735 26976 5697 39313 86727 110558 143157 190958 167225 173052 122700 95421 143697
14442A43697J5782j6547m0470n8711q8495n0254P3366Q2882J07014M9340q0342
14431A37262j03784j21977j1206J61138M5238N673q4545k9649N3598j59664L8625
14420f9291L7556q6850r5929R576P7153J29740l8895n8637l1141L3998j4076m184
14408a10980r5815O93J56957R6318o6377N4400J19678P770j29144L1751P0684
14397A35935p515K5772n000j1662q0666o6544m0210Q828j08k0290O7529J00052
14385A06121Q2131J7892j06203q3166o3116j6660M1663P5943r7118q2006Q1004
14374d3515R9568K6622O2329p6673j28391J0858J4051P656N4628k6564p6896J1147
14362f5180J7535l6714o879o4260P6097J33854k1737q4662O1448Q1679L0427p4312
$$ plain form
14442 143697 159479 142932 102462 43751 -44744 -94998 -21632 61250 168264 217604 137262
14431 137262 33478 -88499 -99705 61433 106671 112344 27799 -1850 51748 -107916 -69291
14420 -69291 -31735 -118585 -214514 -204938 -127785 1955 -36940 -95577 -126718 -92720 -106796 -110980
14408 -110980 -206795 -206102 -49145 47173 -19204 35196 154874 162644 33500 65251 135935
14397 135935 128420 154192 149192 137530 56864 -9680 -49890 -41062 -41170 -61460 6069 106121
14385 106121 188252 206144 99941 16775 -46341 -63001 -21338 54605 -42513 -124519 -43515
14374 -43515 56053 82675 145004 68331 -60060 -49202 -35151 -27495 27133 569 -76327 -65180
14362 -65180 -47645 -84359 -91238 -155498 -79401 54453 32716 -51946 9502 91181 121608 47296
14350D7296j6872O6427o7281j10719L7722P8558m1077p3028R3672Q8940n4843
14339D8795j49214n4663n0092R7200J20484M4878m9221q3801k9412K3316P9502
14328b228N3121k0621j16439k7226j3601N1049M8449K4927K7908k6915M0093N0508
14316H9025j01899m7308J31159J8010p2166l8116O6815o6847o2618n4622M2810
14305i5757P2068J6316n0438L3327j059j4736q6518l466M5463m7692j12640M6288
14293a98844J77304J28572M1626o1830j02179p4586k7341N3065Q6704J9860l0019
14282A2332n4758P1448M1578k8828p865J7072J0903j10562k8994O0805M5966j3824
14270A5273M0104Q5443p3450p3460m841J8059J64q2490m5702l3236n344O7063
$$ plain form
14350 47296 30424 96851 29570 -81149 -43427 35131 -5946 -78974 14698 103638 48795
14339 48795 -100419 -155082 -205174 -107974 12510 57388 8167 -75634 -105046 -81730 -2228
14328 -2228 50893 30272 -86167 -113393 -126994 -75945 -27496 -2569 25339 -1576 38517 89025
14316 89025 -12874 -60182 70977 88987 16821 -21295 45520 -21327 -83945 -138567 -95757
14305 -95757 -23689 -7373 -57811 -24484 -25543 -40279 -126797 -130263 -84800 -132492 -245132 -198844
14293 -198844 -21540 107032 148658 86828 -15351 -89937 -117278 -64213 22491 42351 12332
14282 12332 -42426 29022 70600 41772 33907 50979 61882 -48680 -77674 -16869 29097 15273
14270 15273 55377 140820 67370 -6090 -10931 7128 7292 -75198 -120900 -154136 -159480 -92417
14258i2417L4493n2184j0060P0723n4556q2361o5228Q4575J35032P3025K0593
14247F1635n5126L3364n1027J9280j30320m1400P3752m1979L5914J21933k8440
14236b414p5866l006J02061O6853k5442n1493k8319l570Q6459Q7108p25o4339
14224H7307J5239L6234L754j17931M350k5546P0490P7758o3639p8631o1609n9640
14212a11864O8490K6376J8375J4513J8072M3858p0732q7216l4603Q3572Q5146
14201E3987N4595M4974J4189n3224L7638j11707j61841j55420J50147R3374p1852
14190a05140N4424R8565j0306r7589m5458j3397N2989n8795M228J4746n7866m9850
14178b13449M5752J26596L6250J01470q0866N339J24686n496K7765k519n4726
$$ plain form
14258 -92417 -57924 -110108 -120168 -49445 -104001 -186362 -251590 -167015 -31983 41042 61635
14247 61635 6509 39873 -11154 8126 -122194 -163594 -89842 -131821 -95907 26026 -2414
14236 -2414 -78280 -81286 20775 87628 62186 10693 -17626 -21196 65263 152371 151646 87307
14224 87307 102546 138780 142534 24603 28953 3407 73897 151655 88016 9385 -52224 -111864
14212 -111864 -43374 -16998 1377 15890 33962 77820 7088 -80128 -114731 -31159 53987
14201 53987 108582 153556 167745 114521 152159 40452 -121389 -276809 -126662 -33288 -105140
14190 -105140 -50716 47849 37543 -60046 -105504 -118901 -65912 -124707 -120479 -105733 -163599 -213449
14178 -213449 -167697 -41101 -4851 96619 15753 21092 145778 140282 168047 165528 110802
14167A10802M6255L6022k7160j75485m9682O1840r7207p9325L6705R9319n7870
14156i5786j05155j9496O7047P1948m0913P883P3190r971J01958M4240r5265m3552
14144d3872J41401M7413m6090P7574Q35j81877j76616K1273J16785m533K0324
14133b7383J4292K0231J28154K3950q0865m2694L9407j247j25891L7507k2165
14122c6704K5241J39725L4782l5136p3192M6903k7845m8539q0691O4303J4761
14111B3608m6432N1334N5340k5311p6378l7891k5847J02654J03673J2890k1384
14100A16256m5319l1579M5409k9843o1334j1298q0663Q793O8224K0322j954N728
14088B742k2131J6965J4693Q0003K4627Q334j38286r4587p6238N6756q580m3785
$$ plain form
14167 110802 157057 193079 165919 -9566 -59248 2592 -94615 -173940 -137235 -37916 -95786
14156 -95786 -200941 -220437 -153390 -81442 -122355 -114472 -41282 -51253 50705 94945 -320 -43872
14144 -43872 97529 144942 98852 176426 177261 -4616 -181232 -159959 -43174 -47707 -27383
14133 -27383 -13091 7140 135294 159244 78379 35685 75092 73845 -52046 -14539 -36704
14122 -36704 -11463 128262 163044 127908 54716 101619 73774 25235 -55456 8847 23608
14111 23608 -22824 28510 83850 58539 -17839 -55730 -81577 21077 124750 137640 116256
14100 116256 70937 39358 84767 54924 -6410 -17708 -98371 -89578 -21354 -1032 -2986 2742
14088 2742 -19389 -2424 12269 92272 116899 125233 -13053 -107640 -183878 -127122 -135702 -179487
14076a79487O9664J64026K9971n1929k8911J06217O2364j26419k894n4095K7230
14065A5737m2296L6206P2945J4249q1282j59805P6243K7480P0441j2645n9576
14054d2303l0856P604J191l9577K8125R4336m8674j4957q8261O5390N5028Q5647
14042G2693q5733n7061o4668N8093M4049O6925M845m5433j09258L1211R6158n1319
14030c9498o305N7500K2933J5055K1974R055R7162j5103l3621K806k2887r3659
14018A5412q4291L3713Q0091o209l5694o627J3826J8906L3238J21680k8103j14027
14006D1915j3250J9782K0449K0656O1454k8958r2209K2822O5281M8560k8066j06271
13994C2165R7683M4361k9652p3467r8177q2547J832R3475M8407m5404n0749l636
$$ plain form
14076 -179487 -109823 54203 84174 32245 3334 109551 171915 45496 42602 -11493 15737
14065 15737 -26559 9647 82592 96841 15559 -144246 -68003 -40523 29918 17273 -42303
14054 -42303 -73159 -65555 -64364 -103941 -75816 18520 -30154 -45111 -133372 -67982 -12954 72693
14042 72693 -13040 -70101 -134769 -76676 -32627 34298 39143 -6290 -115548 -84337 11821 -39498
14030 -39498 -45803 11697 34630 49685 71659 80714 177876 162773 129152 131958 109071 15412
14018 15412 -68879 -35166 44925 38716 3022 -3605 10221 29127 62365 184045 155942 41915
14006 41915 28665 48447 68896 89552 151006 122048 29839 52661 117942 166502 138436 32165
13994 32165 129848 174209 144557 71090 -27087 -109634 -107802 -14327 34080 -11324 -62073 -65709
13982f5709O9693l6483n4395J9265n3350N3126K3918K9905j1737J46665P8503
13971A99401m0588j38736n4439j373M268O08J01645P0804m680m8951j63288n3476
13959a28805m1076M4203O1821L1062l1645j8690n9065J0584J51207K8965l9779
13948H782l767K2735J4996m1589J2986N9233p3722K1637N304p6689p1687O7979
13936e3802m0991m4462j5916L8182P0059k620j15462N3455J40371l0444J9318
13925A7688q4773l5087j0010L6302m231Q866l2318K4436q616L8462j8058J04384
13913C7045Q9163Q428j32003o9280l0172J35006P3525L6209L6836l3460r5549
13902E5748L0055l2833K2705P237l5738q6996J43714J25277j33521j36957K8140
$$ plain form
13982 -65709 3984 -32499 -86894 -67629 -120979 -67853 -43935 -14030 -25767 120898 199401
13971 199401 158813 20077 -34362 -35735 -31467 -30859 70786 141590 136910 87959 -75329 -128805
13959 -128805 -169881 -125678 -63857 -32795 -64440 -83130 -142195 -131611 19596 48561 8782
13948 8782 5015 27750 42746 1157 14143 73376 -346 21291 26595 -50094 -121781 -53802
13936 -53802 -94793 -139255 -155171 -116989 -46930 -49550 -165012 -111557 28814 -1630 17688
13925 17688 -67085 -102172 -112182 -75880 -80111 -71245 -103563 -79127 -87743 -49281 -67339 37045
13913 37045 126208 134636 2633 -66647 -96819 38187 111712 147921 184757 151297 55748
13902 55748 85803 52970 75675 82912 47174 -39822 103892 229169 95648 -41309 -13169
13891a3169O0561m5333J9790q6909K994R8113Q9790n7481j80462M0808J10078
13880C8780Q4285k0886m3449j64056O617J09023J05690P5006n6802m0504r9053
13869e349p6482J4556J7894k1011j3874R41J41242J30264p3094n6958O802P6990
13857A41921P671j08937j17051k8876Q3302O3404O854j20994n8806L6682L8089
13846e6741K9821M1387N0080j11395l8964K4908J7353P3135P7543l8807j6225
13835E2095p4272o1273J464N6140l3932r7796l1989J2455N3985M7420m7782q2359
13823b05844L8800K1792J20192R7104J79672N5718q6149n3809p1602j3964Q2455
13812A64365k9756q1859k2221n9733p192Q4890o2401l0088l3411j157M2417R5953
$$ plain form
13891 -13169 47392 2059 21849 -65060 -62066 36047 125837 68356 -112106 -71298 38780
13880 38780 123065 102179 58730 -105326 -98709 10314 116004 191010 134208 93704 -5349
13869 -5349 -81831 -67275 -49381 -70392 -84266 -83325 57917 188181 115087 58129 64931 141921
13857 141921 149592 40655 -76396 -105272 -21970 41434 48288 -72706 -131512 -94830 -56741
13846 -56741 -26920 14467 64547 -46848 -85812 -60904 -43551 29584 107127 68320 52095
13835 52095 -22177 -83450 -81986 -25846 -59778 -157574 -189563 -177108 -123123 -75703 -123485 -205844
13823 -205844 -167044 -145252 -25060 72044 251716 307434 221285 167476 95874 81910 164365
13812 164365 134609 52750 30529 -29204 -36396 48494 -13907 -43995 -77406 -78563 -36146 59807
13800E9807J6918j14483n7250J27470M8047j01315q324K7374j1290j9152R3025
13789F0827P6345m9850P738j1901N8333o6271K1493j6093J7869j397r0770o0954
13777e4631J5933N22J42424l016n1827k2713O986m4120q021N159k4598j2127M1481
13764h548N9992k6484k1208o4341j1004J15O072J6269J12546q7806n6684n4285
13752a35366k3834k1334M6209M4991Q7997P089M1802J1316p1253k3138r2031J1453
13740a16099Q7967l821o910m0263l6118M461Q7470K6726m5641N8658J5853K4991
13728E7274j61570j08441m8253Q1448J33019R8169o4741N1235Q0099r9551m6076
13717b7388p4725k4043P0656O1240K1677k040k6815J0118O378J8070m5493n1144
$$ plain form
13800 59807 76725 -37758 -95008 32462 80509 -20806 -29130 -1756 -13046 -32198 60827
13789 60827 137172 87322 95060 83159 141492 75221 96714 80621 98490 97093 6323 -54631
13777 -54631 -38698 -38176 104248 101232 49405 26692 33678 -10442 -18463 -13304 -37902 -50029 -8548
13764 -8548 51444 24960 3752 -60589 -71593 -71478 -65406 -49137 63409 -24397 -81081 -135366
13752 -135366 -159200 -180534 -134325 -89334 -1337 5752 47554 58870 -12383 -35521 -127552 -116099
13740 -116099 -28132 -31953 -38863 -79126 -115244 -110783 -23313 3413 -42228 16430 32283 57274
13728 57274 -104296 -212737 -260990 -179542 -46523 51646 -13095 38140 118239 18688 -27388
13717 -27388 -102113 -126156 -55500 5740 27417 25377 -1438 8680 15058 33128 -12365 -63509
13705f3509n6986o1550J6681O0894L2641P0017j8458j5152M3150N0446Q681m8399
13693A8456p8217j4211J19979k1536p827j3103M886Q4347l2832p1002P1860J17613
13681A78413o0985r2244l3855j16402n752M3822J05223N0536n5924j08617o1765
13670a57550Q4661J09086Q6885p4336J9319L796k9333j2918M3812k491m5425K6079
13658E1585K8688j2557R4597J0660m4282n3468m1995K9886L7130j27177o7827
13647i4760M0807J7463K6997J6890j3448j50192O7890J75342J06420j1262j70533
13636A1614o9586L783j6038K8021o630o1858o2413N7962Q0790L2467k4004p25
13624b6617o9094J8738O8192k6000k349o7903q1482N5477P8234J9134K497p2849
$$ plain form
13705 -63509 -120495 -182045 -165364 -104470 -71829 -1812 -20270 -35422 7728 58174 66855 18456
13693 18456 -59761 -73972 46007 24471 16644 3541 8427 92774 59942 -11060 60800 178413
13681 178413 117428 25184 -8671 -125073 -130825 -87003 18220 68756 12832 -95785 -157550
13670 -157550 -72889 36197 123082 48746 68065 71861 42528 29610 73422 70931 25506 51585
13658 51585 80273 67716 162313 172973 128691 75223 33228 63114 100244 -26933 -94760
13647 -94760 -53953 -36490 -9493 7397 -6051 -156243 -88353 86989 193409 182147 11614
13636 11614 -57972 -54189 -70227 -42206 -48836 -110694 -173107 -115145 -34355 -1888 -25892 -26617
13624 -26617 -95711 -76973 -8781 -34781 -37130 -105033 -186515 -131038 -52804 -33670 -31173 -104022
13612a04022L4307R0005Q3754r2075n8649r2175l8774M0275P7707M4041k1317
13601c6923L1588O1269l2384j00686O8362m180k5922n1035l6381N2658J33961
13590F0327Q2333o0278J9335q054l0406N0266O8573l499r0292j74957q0840j3822
13578a81314M1012L4659L0968k7020Q8300K2591q498k9239N142K5587N2865L0999
13566H6052L1134j48995j26136k2648R6857O6788m2870k6250r2670J5522Q3537
13555g9679o3956N7147o1994j7275J0811P200K7379o1703k9425N8679l0052n731
13543a88599K6904n2615k1396N325M5246M7784j4091l7091O7099j6791N0387J68206
13531H0368N9968r3904m1964K1868p1491p4373J6867J4061Q7396Q2536j6422j6602
$$ plain form
13612 -104022 -69715 20290 104044 11969 -46680 -138855 -177629 -137354 -59647 -15606 -36923
13601 -36923 -5335 55934 23550 -77136 -8774 -12954 -38876 -89911 -126292 -73634 60327
13590 60327 142660 82382 101717 93663 63257 113523 182096 178597 88305 -86652 -167492 -181314
13578 -181314 -140302 -105643 -74675 -101695 -13395 9196 698 -28541 -23399 2188 55053 86052
13566 86052 117186 -31809 -157945 -180593 -83736 -16948 -59818 -86068 -178738 -163216 -79679
13555 -79679 -143635 -86488 -148482 -165757 -154946 -147746 -120367 -182070 -211495 -152816 -182868 -188599
13543 -188599 -161695 -214310 -235706 -230381 -185135 -137351 -151442 -188533 -121434 -138225 -87838 80368
13531 80368 140336 46432 4468 26336 -45155 -119528 -102661 -88600 -1204 81332 64910 48308
13519D8308L294L6863j5861J6406m3961Q4941J03441m9645j34527m7652Q5024
13508H6631l4773k6944k1109J4933r7424J001j2969J2896p6329R9727J54711K0260
13496A20611k1605n6717K4681N5000q6813o1084k5550R1985J36307n8167L3262
13485A51910k2292n1944o5617m4806P146n767N4543p0268j0446n06O4841J1719
13473A8513M8744N2557k5535q5069j0877o520k1497j3502l7368L9714m9928m0133
13461a30901N6880J7094l5043J22957Q755K3701M8470q2877K5252o5107m6260
13450e7079k1208P601P0853r234k6599l6507k5325R6106J09308L4608M9571o3236
13438A28859j79335R877L5079J05678K8356q9221m9833Q4308K3489M149l1964
$$ plain form
13519 48308 51602 88465 72604 89010 45049 129990 233431 183786 49259 1607 86631
13508 86631 51858 24914 3805 18738 -78686 -77685 -90654 -77758 -154087 -54360 100351 120611
13496 120611 99006 42289 66970 121970 35157 -25927 -51477 40508 176815 118648 151910
13485 151910 129618 77674 12057 -32749 -25603 -31370 23173 -47095 -57541 -58047 6794 18513
13473 18513 67257 119814 94279 9210 -1667 -8187 -29684 -43186 -80554 -40840 -90768 -130901
13461 -130901 -74021 -56927 -91970 30987 39742 63443 111913 29036 54288 -10819 -57079
13450 -57079 -78287 -70686 167 -9067 -35666 -72173 -97498 -1392 107916 142524 192095 128859
13438 128859 -50476 -40599 -5520 100158 128514 39293 -10540 73768 97257 101406 69442
13427F9442o2213k3744j0067J5323N7698k2871q096p5865k2322J0305m1274k7548
13415a41232Q7651R85l3211k0234k2950P8610K8943Q3967K6437L7990K1147K3563
13403A71666j79300j07563P1004J40226N8154K0261p1594r1967Q1343P0511o5613
13392I7128o389O7657q9013l838l1319p1530q226l6657J5206j8997O2855N7974
13380C4851J734l184K7143n2184k6645K0152l3256K5650l7461q5869m710Q0187
13368e3592r1848j01235O6667L8903J9388k6901R7431J13039P2526m2145j9410
13357G2823J6949K8788j4200j50348k7518K5789J10288R9337L809l3992P8702
13346B10427J4761j15808j06562K4594j5143j000J30925J10455j04863j66831
$$ plain form
13427 69442 7229 -16515 -26582 -11259 46439 23568 15472 -60393 -82715 -72410 -113684 -141232
13415 -141232 -53581 -52596 -85807 -106041 -128991 -50381 -21438 62529 88966 126956 148103 171666
13403 171666 -7634 -115197 -44193 96033 154187 174448 102854 10887 92230 162741 97128
13392 97128 90739 158396 69383 65545 34226 -37304 -45530 -82187 -66981 -85978 -23123 34851
13380 34851 36585 33401 60544 8360 -18285 1867 -31389 -5739 -43200 -129069 -133779 -53592
13368 -53592 -145440 -246675 -180008 -141105 -121717 -148618 -51187 61852 134378 92233 72823
13357 72823 89772 118560 104360 -45988 -73506 -47717 62571 161908 165717 131725 210427
13346 210427 225188 109380 2818 27412 12269 11269 142194 252649 147786 -19045
13336a9045j9631J47553J993o448j10413N9467R0754j661p6161p8891N0056m0544
13324b971l0488L3410J07889L6006J443k5471o5432R281N3965J7955J7156o6212
13312H6531l7152m9374m6445n5061N2530J30781P2457m8321j08029N524j6479
13301a3038L9870l2544J1763K0336j6902n0690p2385J54698J38746l2405J0245
13290A57694K0363j88329l5751n786O800J2967J0954Q043K3449K8483o6039l5458
13278f2610O4526P1589k8885n8152k5520M9318J41197p5474q4048L3500k1308
13267D133O9738Q0659r0387n4303O0507K4239N3180j09218r9182L3151l2951n7354
13255a17788j5650m9321J04011L1260o7408J1913q194K2498m343P7574J20254
$$ plain form
13336 -19045 -38676 108877 110870 104422 -5991 53476 144230 142569 66408 -12483 37573 -2971
13324 -2971 -33459 -49 107840 143846 145289 119818 54386 63667 117632 135587 152743 86531
13312 86531 49379 5 -46440 -101501 -48971 81810 154267 105946 -2083 3441 -13038
13301 -13038 26832 -5712 6051 26387 9485 -41205 -113590 41108 179854 147449 157694
13290 157694 178057 -10272 -46023 -51809 -45009 -32042 -21088 -13045 10404 38887 -27152 -62610
13278 -62610 1916 73505 44620 -13532 -39052 10266 151463 75989 -8059 25441 4133
13267 4133 73871 154530 64143 9840 70347 94586 147766 38548 -60634 -27483 -60434 -117788
13255 -117788 -133438 -182759 -78748 -47488 -114896 -102983 -111177 -88679 -93022 -15448 104806
13244A04806j1209j282O1427j6110n7243o8757j8184l0001l0721o5996j18409
13233b51679k3292j4613K9879o7421K8931P7363J28131O0778l5530n1802l6870
13222a56125k91j6275j564J0226L2508J04739J87005p7489p1941J8822O2558j08332
13210a6159q3788o6401P5077O0060J0048M3306J4134o2383l5075J3375J565O0407
13198A4166M0431n8792n2182P7698l856M0598L2920L7620n83n3230n4065Q5779
13186A06504j2596m119m4392n5210p6482Q944P7188k3471j5696r8266j4644J12609
13174c9631O4862n8969o4922l9230R4937o8885N9999L4300q4815j0035J0234L763
13162i8392J02100P2264P60m6903k8093M5144q3574m3465Q8474Q4959l2229m5253
$$ plain form
13244 104806 93597 92315 153742 137632 80389 11632 -6552 -36553 -67274 -133270 -251679
13233 -251679 -274971 -289584 -259705 -327126 -298195 -220832 -92701 -31923 -67453 -119255 -156125
13222 -156125 -156416 -172691 -174255 -164029 -131521 -26782 160223 82734 10793 29615 92173 -16159
13210 -16159 -99947 -166348 -91271 -31211 -21163 22143 36277 -26106 -61181 -47806 -46241 14166
13198 14166 54597 -4195 -56377 21321 17465 58063 90983 128603 128020 74790 20725 106504
13186 106504 93908 89789 45397 -9813 -86295 -77351 -163 -23634 -39330 -137596 -152240 -39631
13174 -39631 25231 -33738 -98660 -137890 -42953 -111838 -51839 -17539 -102354 -112389 -102155 -98392
13162 -98392 3708 75972 76732 29829 1736 46880 -36694 -80159 8315 93274 61045 15792
13150A5792j8384j00434n7716Q7448P8446j7166j4644J0333J8431m5864j3608
13139e7366o1177N1484r366P9003J9531k699n0526R56P9591K3622j80531m8871
13127a56349R2658J634n6827J6679L3402J1494O6705K67k0840j3643N0865O5872
13115I1917J22879L8769l8973r2600m5978j03817n6732L1222Q2915J00380M7456
13104A77438j6704p6161o1261q11k4578J3734K9357k9681j13633K8574J22845
13093D9119K8185l8162J7419J31885O9487q0585j15070o8421j02182n3894K7833
13082a34386J32422Q6277j56574j13610P5160J47186L7989l6809K7173N0659N0599
13071A66086L7377j73562n8672J10520M1866j8712L8562j051P2032M0310k1465
$$ plain form
13150 15792 -2592 -103026 -160742 -73294 5152 -12014 -26658 -16325 2106 -43758 -57366
13139 -57366 -118543 -67059 -76425 2578 22109 19410 -31116 -30160 49431 73053 -107478 -156349
13127 -156349 -63691 -62057 -118884 -102205 -68803 -57309 9396 9663 -11177 -24820 26045 91917
13115 91917 214796 253565 214592 121992 76014 -27803 -84535 -53313 29602 129982 177438
13104 177438 160734 84573 23312 22501 -2077 11657 41014 11333 -102300 -73726 49119
13093 49119 77304 39142 56561 188446 257933 177348 62278 -6143 -108325 -162219 -134386
13082 -134386 -1964 84313 -72261 -185871 -110711 36475 74464 37655 64828 115487 166086
13071 166086 203463 29901 -28771 81749 123615 104903 143465 142414 214446 254756 233291
13060B33291j43284j4129k8074q7546m6055l7414J09010L9283m9081Q1490o951
13049E0540p8401R343J1498m7358j9136N7812M1414n8842J3314m0240r7355j4247
13037a71658l2435L4984O2139q91K7599K2242K751j29499l2575J42326J73490
13026I8473J46979j5087j02213L6887r8987k3272j4780o6257m7134q942L6501
13015e7832K4348P585l1751R622R493n169j9758m9847q4167j0886j03214J3979
13003b97597P6776l3849L0910Q1102n3319K0648Q0869l28O3237J61639J07202
12992B37290k4242j40556k3285J32866O3150p5921j38946p1049o4847R2987J6115
12981C562P2648n7578L725j4767P5771j8892n0479k2635m0446n875j0156l5267
$$ plain form
13060 233291 90007 75878 47804 -39742 -85797 -123211 -14201 25082 -23999 57491 50540
13049 50540 -27861 -18518 -7020 -54378 -73514 -15702 25712 -33130 -19816 -60056 -157411 -171658
13037 -171658 -204093 -169109 -106970 -107861 -80262 -58020 -55269 -184768 -217343 -75017 98473
13026 98473 245452 230365 128152 165039 66052 42780 28000 -38257 -85391 -94333 -57832
13015 -57832 -33484 -25899 -57650 -48028 -38535 -43704 -63462 -113309 -197476 -208362 -311576 -297597
13003 -297597 -220821 -254670 -223760 -142658 -195977 -175329 -94460 -94788 -31551 130088 237290
12992 237290 213048 72492 49207 182073 245223 169302 30356 -40693 -105540 -12553 3562
12981 3562 76210 18632 22357 7590 83361 64469 13990 -8645 -49091 -54966 -65122 -100389
12969a00389K1325L0517Q3143j1683l3915k64J13240l2130m6225j04946M761O165
12957g0401K2005K6123o1375m1353M3394R8843J0614q4896k5257p8819J1125Q5808
12945f4189J26392Q3224L4719O117O654K329o9389n1410N7348N116K066k9127
12933A09850j46193r121L7046J10565K5378n4093m7333P2686J9239p5190j5886
12922B6948L3242K7213K9603r3886P8965Q7858P645O0811P0427q8404j98143m0676
12910A603k732k3089P503p328N7359J9060K293m3846j10137l2351O2727N1417
12898a7521j1030K9645n998j8314K4786Q3109l110n9080l1829Q696J4690J4631
12886B8675P3465o297l2913K2093O6120N571M0793j58073n7220r1061q9261l2676
$$ plain form
12969 -100389 -79064 -48547 34596 22913 -11002 -11266 101974 69844 23619 -81327 -76566 -70401
12957 -70401 -48396 -22273 -83648 -125001 -81607 17236 27850 -57046 -82303 -161122 -149997 -64189
12945 -64189 62203 145427 180146 186263 192917 195246 125857 74447 131795 136911 138977 109850
12933 109850 -36343 -45464 -8418 102147 127525 73432 26099 98785 118024 42834 26948
12922 26948 60190 87403 117006 23120 102085 189943 197588 258399 328826 240422 42279 1603
12910 1603 -1129 -24218 -16715 -24043 33316 52376 54669 10823 -99314 -131665 -68938 -17521
12898 -17521 -28551 1094 -4904 -23218 1568 84677 81567 22487 -9342 -646 14044 28675
12886 28675 102140 95843 62930 85023 151143 156714 197507 39434 -17786 -108847 -198108 -230784
12874b30784J5976J18394M963J4103p9761m25J3192J3374J9709J6315K6957j3544
12862h1531J08312P200j65466l3753j15145R1988J58776N2687P64j7817j4710
12851h695j3587L4541N3121J7051j00472n0783P921P1331R0789P0929L6528k1851
12839A86823k7868M8149K8804m6104J8056K2213j5909k6119j2217m1160m0817
12828I3851q4829o847k7609R2593Q1811K8720j1752J0794J965K9171M5443p4150
12816A79161j19551l3357K5448P9453L2196K6896r3986q2208n4351j0605k2811
12805g3715j3174K723m414M5394j16309P750J15559l8820l1499R7133J29219J5854
12793A35701j11941j25583J08018K1142J7700L9782l6045m619k4746n1829Q4691
$$ plain form
12874 -230784 -214808 -96414 -91451 -77348 -157109 -157534 -144342 -130968 -111259 -94944 -67987 -81531
12862 -81531 26781 33981 -131485 -165238 -280383 -188395 -29619 23068 23832 6015 -8695
12851 -8695 -22282 12259 65380 82431 -18041 -68824 -60903 10428 101217 172146 208674 186823
12839 186823 158955 207104 235908 189804 207860 230073 214164 188045 175828 134668 93851
12828 93851 9022 2175 -25434 67159 148970 177690 165938 176732 178697 207868 253311 179161
12816 179161 59610 26253 51701 131154 163350 190246 96260 14052 -40299 -50904 -73715
12805 -73715 -86889 -84166 -88580 -43186 -159495 -151745 -36186 -75006 -106505 -9372 119847 135701
12793 135701 23760 -101823 6195 27337 45037 84819 48774 44155 19409 -32420 52271
12782E2271J6385P180j2723P4233K1426k2720q7852L0599K7186l9498O9981N9563
12770A96031q7560o7606R4272O8225q4431j16847R0896L304j12227Q11J93951
12759A78819J4452j15079l189J11261k9667J6540n2284q9105o1874P9356K8482
12748G7712J7751K8970m6950j65625L1882M5785O6803k42p9727L9283k8777o351
12736a9486p598Q4836Q024Q917j45675p0083Q0906R7056Q2944O1663Q063j01262
12724H8305o2922K1470q7217j8465O9070J8394J2898M8350l5342J3876O6273K6892
12712A61582o7840l4690O9543O0066j04757p0336R0556K4556P1905o0207n8536
12701H1842m92K3710P7630p4137L637m7900J202K3912r2729m4704Q082M2042O7710
$$ plain form
12782 52271 68656 75836 63113 137346 158772 136052 48200 78799 105985 66487 136468 196031
12770 196031 108471 40865 135137 203362 118931 2084 92980 96284 -15943 -15132 178819
12759 178819 193271 78192 75003 186264 156597 173137 120853 31748 -30126 49230 77712
12748 77712 95463 124433 77483 -88142 -56260 -10475 56328 56086 -23641 15642 -13135 -19486
12736 -19486 -27084 57752 65776 74693 -70982 -141065 -60159 36897 119841 181504 189567 88305
12724 88305 25383 46853 -40364 -58829 10241 28635 41533 89883 54541 68417 134690 161582
12712 161582 93742 59052 128595 188661 83904 13568 104124 128680 200585 140378 81842
12701 81842 81350 105060 182690 108553 112190 64290 65492 89404 -3325 -48029 -39947 2095 69805
12688F9805O0697P4850O416q2445K0382o5867J159P6192Q929q1603J1554L3606
12676A33675j11423j30107N8767O933p6258L8003L2787O0863M5880K4488J9068
12665A02676N5956J0370r723j3067o4061m6533L2898N0442J6875k1421j2434J9708
12653A21686K6033J4204q758M0779r2116j24192N0556M4039J2384J22400L3504
12642B40519j01208k7396J1146o3366L669J41512J7438j11734k2239N3764M9992
12631A92097Q2355M7535m198L9485R741m9839J25258J42461k7196Q931j07145
12620D59485r4851m2075k6238q3834m9491J5510q1396j31961J7159j02378m0022
12609a60092J76411N4420o0819r6548P8020K1195k4295m0030Q1098L5084M2636
$$ plain form
12688 69805 130502 205352 211768 129323 149705 83838 84997 161189 170118 88515 100069 133675
12676 133675 22252 -107855 -49088 -42155 -118413 -80410 -47623 13240 59120 83608 102676
12665 102676 158632 169002 159279 146212 82151 35618 68516 118958 135833 114412 101978 121686
12653 121686 147719 161923 153165 193944 101828 -22364 28192 72231 84615 207015 240519
12642 240519 139311 111915 123061 59695 63364 204876 222314 110580 88341 142105 192097
12631 192097 274452 321987 317789 357274 367015 317176 442434 584895 557699 566630 459485
12620 459485 364634 322559 296321 212487 162996 178506 97110 -34851 -17692 -120070 -160092
12609 -160092 16319 70739 9920 -86628 -8608 12587 -11708 -51738 29360 64444 107080
12598A07080J33964j10631j0516N9264L1713j9350Q962o0667j07811j0629R0437
12587A11816n3464o3565l6858K7975N2901J5964J13383Q437j9833m5090q1187
12576C0479R2592M9956P0997L3810k3880L0573N8254J6085L1304J75087J02674
12565F67931L79996N20647O14578Q02578Q44266O58129J11010m47839o63929p82164
12555B705203o90802n49061m08177k33065j81866J0982j03506p0445j71240j14888
12545A93135Q250n2482l8003P139o1113R7477R0077p8386j8805J8686N3108K5348
12533B44431q3652q2707j2719j643O1552M3990l6560r301k9411k9458O9760j4029
12521A20253n0966j00385P434K61694J63517L4432n5373q5819j14758j52789M0195
$$ plain form
12598 107080 241044 130413 119897 179161 210874 191524 200486 139819 32008 21379 111816
12587 111816 58352 -5213 -42071 -14096 38805 54769 168152 176589 156756 111666 30479
12576 30479 123071 173027 244024 277834 253954 284527 342781 358866 390170 565257 667931
12565 667931 1047927 1568574 2183152 2985730 3829996 4488125 4599135 4151296 3487367 2705203
12555 2705203 2014401 1465340 1057163 824098 642232 653214 549708 479263 308023 193135
12545 193135 201385 148903 110900 118039 56926 154403 244480 166094 147289 165975 219083 244431
12533 244431 160779 78072 65353 63710 125262 169252 132692 123391 93980 64522 134282 120253
12521 120253 69287 -31098 -23664 238030 401547 435979 380606 294787 180029 27240 67435
12510F7435K9171M343N8151L3472j7154k9467J29483J13475L2869M5257J55117
12499F22152J3237n4047K9589J13975J02220J78440J17394J20528J45117J25711
12489A514316O2604o4666j46514j01939J2785o8989j06785j73423j86428j50347
12479E90614j5238M5195j59057m5039M7205N4227J36176k3366j26682n2044l8701
12468D13290O624l0064j5348j3772n2490p1848j07513m8396J00523L379j548J1998
12456A94835j3909o2570k4907J6412j649J2223M9775m1757j4982m059K2745L8527
12444A70684J6459M3918J77047L0442j46639m7276R3239M9001j38429n56L6833
12433B84723j6207j1226r2792l1883Q1562N0600k4766M246L4226M8991J34858
$$ plain form
12510 67435 96606 100949 159100 192572 175418 145951 275434 388909 421778 467035 622152
12499 622152 635389 581342 610931 724906 827126 1005566 1122960 1243488 1388605 1514316
12489 1514316 1576920 1512254 1365740 1263801 1276586 1207597 1100812 927389 740961 590614
12479 590614 575376 620571 461514 416475 463680 517907 654083 630717 504035 451991 413290
12468 413290 419914 389850 374502 360730 308240 236392 128879 80483 181006 184385 182837 194835
12456 194835 180926 118356 93449 109861 108212 120435 170210 128453 113471 109412 132157 170684
12444 170684 187143 231061 408108 438550 291911 244635 337874 386875 248446 247890 284723
12433 284723 268516 257290 164498 132615 214177 264777 240011 244257 278483 327474 462332
12422D62332k3510m4366l1547K740p6349j21784k660J05911J47186N4648r7027
12411C75574O3250P7027j7325q6413j05751k6424o7768m6362o4142o601J2918
12400A07983J3624n9453P5196K9843n6072N0161M4943L3914P7641N2475j14639
12389B55616j47242K8217j6013k5912P6364K8995J0180l0279m2644o0498k6115
12378E0669M3085Q6231m9754q7659k1767m1703O801M7333Q3706P2115n8483r0079
12366D0495L5224L3997R661P1992K9713l2402k0208J2901J2398J01619P5271j03549
12354B67112n2205j8852m525l592j0269q4474o040N5486K4830k980O5948m6856
12342A83583m7037Q397M0685K2222J397j0244M6393O3865j5782k2104L9804P045
$$ plain form
12422 462332 438822 394456 362909 365649 289300 167516 164856 270767 417953 472601 375574
12411 375574 438824 515851 498526 412113 306362 279938 212170 165808 101666 95065 107983
12400 107983 121607 62154 137350 167193 111121 161282 206225 240139 317780 370255 255616
12389 255616 108374 136591 120578 94666 171030 200025 210205 179926 137282 76784 50669
12378 50669 93754 179985 130231 42572 20805 -20898 -14097 33236 116942 189057 130574 40495
12366 40495 75719 109716 119377 191369 221082 188680 168472 181373 193771 295390 370661 267112
12354 267112 214907 196055 191530 187938 177669 93195 87155 142641 167471 164491 230439 183583
12342 183583 136546 144943 185628 207850 209247 199003 245396 309261 293479 271375 311179 318224
12330C18224n3035L3490l2609J2303M6166n3539p2037j22864q4429J08R2816J24555
12318B09149L8254Q1101L1441L58j36197l5353l6498P304O8552M903l515k9714
12306A99785j16113p7371N9440O4579Q0638J02040J41139m5061q7954p4125m8991
12295A98006l4968J83749M4703r9560m7379J00655l5449q5343m1491j3843J1588
12284A80668L1290J38915J06307p3609L8795r5784m0298R6850J22926k6321k9066
12273D50673O8516J2295L1792p6598p5954l0954O1105J0527k0182J27368K142
12262E60730l4638R8055K4956j41285o3180n2055j05807p5589q3367Q8159K706
12251B18685K5576J01088O7118J05301L909o5580o0986o9118Q9338L7730p4786
$$ plain form
12330 318224 265189 298679 266070 278373 324539 271000 198963 76099 -8330 -8222 84594 209149
12318 209149 247403 328504 359945 360303 224106 188753 152255 159559 228111 233014 229499 199785
12306 199785 83672 6301 65741 130320 210958 312998 454137 409076 321122 246997 198006
12295 198006 163038 346787 391490 291930 244551 345206 309757 224414 182923 169080 180668
12284 180668 211958 350873 457180 383571 422366 326582 286284 383134 506060 479739 450673
12273 450673 519189 531484 563276 486678 410724 379770 440875 451402 431220 558588 560730
12262 560730 526092 624147 649103 507818 444638 392583 286776 211187 127820 215979 218685
12251 218685 244261 345349 412467 517768 521677 456097 395111 325993 415331 453061 378275
12240C78275l8363k8035k4489K7098o1503m0807P5888n0953j7862l1905k665J05041
12228B89720M65K2601k180j20493L31J71607K9205q5018R3231J39770m1822q1068
12216D16349L9836L8915m1178N3688N5100J38314J7386q4181o9388j11692K8452
12205D81601J00129R194j13699R1003j27200o4684l7987N0186R2587K1337r199
12194D93268O7854m637m9813J9270J06621N6782L374O7370O8787R9317K6064p6889
12182H77368o8775J6371m2652L7774m4946q3160J24990Q8005M5866J5233L0655
12171I96729N2523Q780p6274M5995o698m1945O1709J42757L3816r7135k8180K35843
12159A327920K81100K98118K62980L16188L22468K89986J41211J00824O5531n5090
$$ plain form
12240 378275 339912 311877 287388 314486 252983 212176 288064 237111 219249 187344 184679 289720
12228 289720 290185 312786 310606 190113 190444 362051 391256 306238 399469 539239 497417 416349
12216 416349 456185 495100 453922 507610 562710 701024 718410 634229 564841 453149 481601
12205 481601 581730 590924 477225 568228 441028 376344 338357 388543 481130 502467 493268
12194 493268 561122 556485 506672 525942 632563 689345 692719 760089 828876 928193 954257 877368
12182 877368 808593 824964 782312 820086 775140 691980 816970 904975 950841 966074 996729
12171 996729 1049252 1058032 981758 1027753 1021055 979110 1040819 1183576 1217392 1120257 1092077 1327920
12159 1327920 1609020 1907138 2170118 2486306 2808774 3098760 3239971 3340795 3406326 3351236
12149C351236k65580k56758j36903j68098k54278j25484j09747M4306m429m704
12139B069561j1380P1204J21769K7556R6194J37320J24262J27881J57255J16489
12129C038111O3637J41942J36126K06231J26600J72101K34909L23120L89998K72370
12119E105145J72817L77237M63261M69681N42267N27482P36662Q28374Q64493
12110A0087419J041544J171799J242523J320265J241418J405871J703273J910395
12102B1124507K238086K571692L005850L550769M364807N469677P064604R380754
12094E8770746J2703495J6986121K2514215K8535916L4036598L7782730L7926630
12087B49256451L3736587K5225880J2885416j109268j4587764k6032878l3474943
$$ plain form
12149 3351236 3085656 2828898 2691995 2523897 2269619 2144135 2034388 2078694 2074265 2069561
12139 2069561 2058181 2129385 2251154 2278710 2374904 2512224 2636486 2764367 2921622 3038111
12129 3038111 3101748 3243690 3379816 3586047 3712647 3884748 4119657 4442777 4832775 5105145
12119 5105145 5277962 5655199 6118460 6588141 7130408 7657890 8394552 9222926 10087419
12110 10087419 11128963 12300762 13543285 14863550 16104968 17510839 19214112 21124507
12102 21124507 23362593 25934285 28940135 32490904 36855711 42325388 49389992 58770746
12094 58770746 71474241 88460362 110974577 139510493 173547091 211329821 249256451
12087 249256451 282993038 308218918 321104334 319995066 305407302 279374424 245899481
12080B45899481l6483732l5582095l1887585k6556613k1118178j6318384j2264377
12073F5688517r256676p149807n628148m443096l740742l202514k791993k359185
12065B7116356k134690k018780j824654j653967j510382j304909j153326j242990
12057A4272658j078503j079217j050961q26207p74027p91835o69097m81610m00119
12048G121082m39722m38260l49823l21291l05195k05945k46005j80723j75000
12039D459118k66098j54272j99368n5285j25710j41952j21354l4405j74365j58299
12029C028010j15081q4341l3561n9183o0078k4098m3742p7962m8599j37j703n1418
12017B428107q9352o3529R4089J11544J06278l2714k2321j04870m785L0286m2216
$$ plain form
12080 245899481 209415749 173833654 141946069 115389456 94271278 77952894 65688517
12073 65688517 56431841 49282034 43653886 39210790 35470048 32267534 29475541 27116356
12065 27116356 24981666 22962886 21138232 19484265 17973883 16668974 15515648 14272658
12057 14272658 13194155 12114938 11063977 10237770 9463743 8671908 8002811 7521201 7121082
12048 7121082 6681360 6243100 5893277 5571986 5266791 5060846 4814841 4634118 4459118
12039 4459118 4193020 4038748 3839380 3784095 3658385 3516433 3395079 3360674 3186309 3028010
12029 3028010 2912929 2828588 2795027 2735844 2675766 2651668 2607926 2529964 2481365 2481228 2479525 2428107
12017 2428107 2338755 2275226 2369315 2480859 2587137 2554423 2532102 2427232 2422447 2452733 2410517
12006B410517k543l8467J0469L677L7962J15359L4770m26K4802k7558m1139R5255
11994B622678J6140n2758k8782r4103o4464j3613m3243m7521n9025k9578K5675
11983B231406M1857N45k0714K5305Q2587j6972M8723R8075Q6743J49410J62651
11972B889616O5873L4811Q6028R5288N1647R2764K7747m4115J22590K04308J88392
11961C814949L21458K34851K07040L50279K79113K28957K93887M29146M93943
11952F653623N60002O82565P02739N36648P21152Q74368J011249J258019J353339
11943A4353704J600832J849441K141699K599493K963289L380623M035189M871653
11935C7795923N526026O075568O570192O746416O356520N129841L361060J011266
$$ plain form
12006 2410517 2407974 2369507 2379976 2383653 2421615 2536974 2571744 2571318 2596120 2568562 2527423 2622678
11994 2622678 2638818 2586060 2557278 2463175 2398711 2385098 2341855 2294334 2235309 2205731 2231406
11983 2231406 2273263 2273808 2253094 2278399 2360986 2344014 2392737 2490812 2577555 2726965 2889616
11972 2889616 2955489 2990300 3076328 3171616 3223263 3316027 3343774 3299659 3422249 3626557 3814949
11961 3814949 4136407 4371258 4578298 4928577 5207690 5436647 5730534 6159680 6653623
11952 6653623 7213625 7896190 8598929 9135577 9856729 10731097 11742346 13000365 14353704
11943 14353704 15954536 17803977 19945676 22545169 25508458 28889081 32924270 37795923
11935 37795923 43321949 49397517 55967709 62714125 69070645 74200486 77561546 78572812
11927G8572812j339885l417174n086405o016052o419542o297717n823162n287741
11919C8885134m514801l905263l421979k864628k473454k156829j890165j685690
11911A5972325j413312j271721j029613j056101j055707p68758o11206m73481
11903H292426n06831m77683n79588m75864l96373m00273m03178k84962j98815
11894D568859l53685l19241j92976j98060k63950j11716j23445j62539q4282j50337
11884B608628j15506r2482j43618m4419l3361p9786o3533r1259L2482n5559j51403
11873A770184p8447n8823r9615j6175Q454j1688m1184j06272p9790q5308P78J01213
11861A303327o8313j73078p3410L0763J8899P2064l0815j43364j24683L5959J6024
$$ plain form
11927 78572812 77232927 73815753 68729348 62713296 56293754 49996037 44172875 38885134
11919 38885134 34370333 30465070 27043091 24178463 21705009 19548180 17658015 15972325
11911 15972325 14559013 13287292 12257679 11201578 10145871 9377113 8765907 8292426
11903 8292426 7785595 7307912 6728324 6252460 5856087 5455814 5052636 4767674 4568859
11894 4568859 4215174 3895933 3702957 3504897 3240947 3129231 3005786 2843247 2758965 2608628
11884 2608628 2493122 2400640 2257022 2212603 2179242 2099456 2035923 1944664 1977146 1921587 1770184
11873 1770184 1691737 1632914 1533299 1517124 1525578 1513890 1472706 1366434 1286644 1201336 1202114 1303327
11861 1303327 1235014 1061936 988526 1019289 1038188 1110252 1079437 936073 811390 847349 863373
11850H63373P1796r992J3126O9395l6231n1776r5666n4392o7817L7859L989n5618
11838F88046R9950K3677r896r9284j9993k5348j02492k4046P1708K2866r4023
11827E31165j15259l7499l2310l9117M2455j109J30277L5908j024J37220J3063
11816F63770j37691n4322P2833J8814j3808K7608K4701m2959q5266j17135m9393
11805C07152j0503K0244R3500O3417K8998l3802o3099k3187R7254m5693j95083
11794B39198j19456K5057J16820J67250l0762q8602m6490K1303J09115j511K4315
11783D16237m1492j22539l0785q8334j19197J94114J72022o5467p9275N5518q9056
11772B01746M776L9202m3494J5334J01537p1700j12291k4939J31424M3226K7324
$$ plain form
11850 863373 935169 925177 938303 1007698 971467 919691 824025 769633 701816 739675 743664 688046
11838 688046 787996 811673 801777 702493 682500 657152 554660 530614 602322 625188 531165
11827 531165 415906 378407 346097 306980 349435 348326 478603 514511 513487 650707 663770
11816 663770 526079 471757 544590 563404 549596 577204 601905 558946 473680 356545 307152
11805 307152 296649 316893 410393 473810 502808 469006 405907 382720 479974 434281 239198
11794 239198 119742 144799 261619 428869 398107 309505 263015 284318 393433 391922 416237
11783 416237 374745 252206 221421 133087 13890 208004 380026 314559 235284 290802 201746
11772 201746 206522 245724 202230 217564 319101 247401 135110 110171 241595 284821 312145
11761C12145m5690P268k0523M4261l4672J06432O0618o9962r2091p1753M9794
11750B45827o2251j31334O149K6617N6529M7430N3432J09529L1450r0589j03091
11739A89698n7776n8651P6292J70852J3806q0380o0891n2866N2641P9587R0389
11728C62701j31457j06066k8690j4499j6847K8457n0333K0068Q1460L2011J0362
11717A87167j9239j02067j1577Q7493J7899m06N4003J0359j37770L4517O0249
11706A80628O3181m0275l2446J319K6718L1843j46649O0130J66365l9493O043
11695B77364J15238L7609M7187M1474n7915O4113l2959M6741O8287L7317Q9266
11684G33722J24529J01701J46145J78377J09376L2686O2919N0663J3877l625r0275
$$ plain form
11761 312145 266455 273723 253200 297461 262789 369221 429839 359877 267786 196033 245827
11750 245827 183576 52242 58391 85008 141537 188967 242399 351928 383378 292789 189698
11739 189698 131922 73271 149563 320415 334221 253841 192950 140084 192725 272312 362701
11728 362701 231244 125178 96488 81989 65142 93599 43266 63334 144794 176805 187167
11717 187167 167928 65861 54284 141777 159676 159270 213273 223632 85862 120379 180628
11706 180628 243809 203534 171088 172407 199125 230968 84319 144449 310814 271321 277364
11695 277364 392602 430211 477398 518872 460957 525070 492111 538852 607139 644456 733722
11684 733722 858251 959952 1106097 1284474 1393850 1426536 1489455 1540118 1553995 1550370 1460095
11673A460095j25642j41382r1331j43735k15214j89497k8159N5744q3739j12312
11663C84828m9599n6590m975j4635n2488p9480k9513J34774M5990P8091r7303
11652B59100K1781P6488K7549o0058j21649j20296l5163O5137J26334M3834M9415
11641C32472m2882j24280l2382o9716L6425J48731j0871j01285j9622m7598j9714
11630D9278N4020N4931J6650P0438n8594N8305L8652p345k0694j17740l2897l5462
11618F9542j7914M8226K5076m1852O4318O7321N2438r8239l6748j1677M1634J8041
11606A80166L300j19930L3881M3034O0711n0734l9014q9972p660J09828O7709
11595A91319k7659r0609P1790K1689K0245l0812l6608k6663L2106L4995P34p3224
$$ plain form
11673 1460095 1334453 1193071 1101740 958005 742791 553294 525135 580879 497140 384828
11663 384828 335229 278639 273664 259029 206541 127061 97548 232322 278312 356403 259100
11652 259100 280881 357369 384918 324860 203211 82915 47752 112889 239223 283057 332472
11641 332472 289590 165310 132928 63212 99637 248368 237497 136212 116590 68992 49278
11630 49278 103298 158229 174879 245317 186723 245028 283680 276335 255641 137901 105004 69542
11618 69542 51628 99854 124930 83078 147396 214717 267155 168916 132168 120491 162125 180166
11606 180166 183466 63536 97417 140451 201162 150428 111414 21442 13782 123610 191319
11595 191319 163660 73051 144841 166530 186775 155963 119355 92692 124798 159793 160527 87303
11583H7303p8746l0758O8454m5759o9503L2403L9824j7489R6716k0365L2460J56917
11571B51457m1797M4184O2517o6823n9805L4635j05034j27624K4024M410l8576
11560a8432k3731J6750N5473P2681Q5844l6627m6588q0211J0587j5147K1120N5563
11548I7282O1521o9585k3074M3298K0103m291k1526j344r077l4353j3267K6022
11536G1709N4606j18498j04841J88L886N8305J05128K3553m9967l3703L4897q792
11524C6471m2011L0169r407j03877p5213J3905M6335r680R8310N3390o3136N5602
11512C0858k2184n3298K5675N9449q4521n3912Q4487M7873n045L763O1517Q1593
11500A76255o6193k08452j588J06709l0199p8631n3776l764R205O2807k8704M7596
$$ plain form
11583 87303 8557 -22201 46253 494 -69009 -36606 3218 -14271 82445 62080 94540 251457
11571 251457 209660 253844 316361 249538 189733 224368 119334 -8290 15734 20144 -18432
11560 -18432 -42163 -25413 30060 102741 188585 151958 105370 25159 35746 20599 41719 97282
11548 97282 158803 89218 66144 109442 129545 125254 103728 102384 93307 58954 45687 71709
11536 71709 126315 7817 -97024 -96836 -92950 -34645 70483 94036 44069 10366 45263 36471
11524 36471 -5540 24629 15222 -88655 -163868 -149963 -103628 -113308 -14998 38392 -24744 30858
11512 30858 8674 -44624 -18949 40500 -44021 -97933 -13446 34427 29382 33145 94662 176255
11500 176255 110062 -98390 -99978 6731 -23468 -102099 -155875 -159639 -150434 -87627 -116331 -68735
11488f8735M5405J0147n0024l4811Q2250O1281P6144j01721q1022k7967p5694
11477a64747k7402P3824J26431m7084N1623J6932r9460j44946N5471M0576K7054
11466i1728P2030L0772l9686K9024N6627m9437m5718K8639J08697Q8067l3883
11455A53404n763j26925r9790N566N8554l4332M1406k1192Q7684O7174j19224
11444F562r1591j07289l1020L5624J94922P4423l1173j46149p2732N9795Q0539
11433b8089J00803k1454j9673p5197O7462J18532K520J4235n3515j41219l1713
11422f7308O6210l2294l9252k0002J0721O6992J4294k6849J5741J1807O0673J344
11410F2077l3304K0539k111r0970p8878P6296L5877N066m2449r32N8974N6022
$$ plain form
11488 -68735 -23330 -13183 -63207 -98018 -15768 45513 121657 19936 -61086 -89053 -164747
11477 -164747 -192149 -118325 8106 -38978 12645 29577 -69883 -214829 -159358 -118782 -91728
11466 -91728 -19698 11074 -28612 412 57039 7602 -38116 -9477 99220 187287 153404
11455 153404 147641 20716 -79074 -73508 -14954 -49286 -7880 -29072 58612 125786 6562
11444 6562 -85029 -192318 -223338 -187714 7208 81631 50458 -95691 -168423 -108628 -28089
11433 -28089 72714 51260 31587 -43610 23852 142384 144904 159139 105624 -35595 -67308
11422 -67308 -1098 -33392 -72644 -92646 -81925 -14933 -639 -27488 -11747 60 60733 62077
11410 62077 28773 49312 47201 -43769 -122647 -46351 -10474 -5408 -47857 -48789 10185 66207
11398F6207K7417J3538p0276j28954l6565L1042J22231n7595m3205k3482K9725
11387f9917N6324J48966L5161o8495m9646L8953l5024n4004R6455Q288J6529j31628
11375h038o7467J2122O1286O8612l0298M9066Q5080j3365P698J115j9117o8979
11363G7715P1180J1922j3359M400k22262j53716L8154O1190j5880N3462K1838
11352f5356r364q92M3575j3237L3654p402O8247K1304M6040J150l8699m99o0107
11339A8414K5230r365n1679J6683K0721O4646R2978j7553Q076n9808m3420m1694
11327B3229J2090J0102j987j0515L5790o2382j20520o7394N5197M1077K7638N3619
11315d056n566n4555j138l98O3469o903o796j9801m2859J6061n0752m6488Q0497
$$ plain form
11398 66207 93624 107162 36886 -92068 -128633 -97591 24640 -32955 -76160 -99642 -69917
11387 -69917 -13593 135373 170534 102039 52393 91346 56322 2318 98773 107061 123590 -8038
11375 -8038 -75505 -63383 -2097 66515 36217 85283 170363 156998 164696 165811 146694 77715
11363 77715 148895 160817 147458 151858 -70404 -224120 -185966 -124776 -140656 -87194 -65356
11352 -65356 -74720 -75612 -32037 -45274 -11620 -19022 49225 70529 116569 117719 79020 78521 18414
11339 18414 43644 34279 -17400 -717 20004 84650 177628 160075 168151 108343 64923 23229
11327 23229 35319 45421 43434 32919 68709 6327 -114193 -181587 -126390 -85313 -57675 -4056
11315 -4056 -9622 -64177 -65315 -65713 -2244 -9147 -15943 -35744 -78603 -62542 -113294 -159782 -79285
11302g9285J67412l4008j01351M2637K2865k4510O7807K123J439J6140m8840n9395
11290b6966K0389j03319r7634R6324J38101O5640j01816J5768L1537L5506p7276
11279c746q8916M7382Q3524L704N807J3822p7196j49172n4135O344Q949L6506
11267a67127M7449P0306Q2010J17587l7909K152o6037j43645N6063O7688m333
11256B4204O309K4610k1269j02830R1149O3789n7418p8468k9931M0210Q0135K3918
11244F4408J021L7383M8537l6502l9002J63k441r0043K3811L5540o1776k9710
11232d8611N7897J03654R895m7358k5797L7254o3119K7606p3127n3897p106m9233
11220a31942p675P6359k1206m667O0397M9796O8983k2798N6729N5500n052R2450
$$ plain form
11302 -79285 88127 54119 -47232 -4595 18270 -6240 61567 63690 65129 81269 32429 -26966
11290 -26966 -6577 -109896 -207530 -111206 26895 92535 -9281 6487 38024 73530 -3746
11279 -3746 -92662 -45280 38244 41948 47755 61577 -15619 -164791 -218926 -212582 -203633 -167127
11267 -167127 -119678 -49372 32638 150225 112316 114468 48431 -95214 -39151 28537 24204
11256 24204 30513 55123 33854 -68976 22173 85962 28544 -49924 -79855 -39645 40490 64408
11244 64408 65429 102812 151349 114847 75845 76008 73567 -16476 7335 42875 -18901 -48611
11232 -48611 9286 112940 122835 75477 49680 86934 23815 51421 -21706 -75603 -82709 -131942
11220 -131942 -139617 -63258 -84464 -89131 -28734 21062 90045 67247 123976 179476 174424 266874
11208B66874o8057j35739p0713L5928L4312N7434n2223M7247j5817o944j7337
11197G4965l2893j9821l0001j7184L9158J3620O6380k7753n2886j11734p5077
11186a73226N0011Q0491o4925j1962K8732P0675J637J9939n8276p2614Q0378R1763
11174D2623o4142q128Q2272L7695J32267n1087j10123q2374j3222m5350p7197
11163a56766q0009J55597J25130K5202j032q5834J3290O2348J2048L738K6679
11152A00391K9446L0317q5073j27687L393N5303K7875Q965l9435l7856l4600o6760
11140a35721J35746N5074l2523M0543j29984J2927R4785L1808n9165K0672J06507
11129A40669l3086l5424N2494k217p0042Q0453J1927k06446j59914Q9408n184
$$ plain form
11208 266874 198817 63078 -7635 28293 62605 120039 67816 115063 99246 92302 74965
11197 74965 42072 22251 -7750 -24934 14224 27844 94224 66471 13585 -98149 -173226
11186 -173226 -123215 -42724 -107649 -119611 -90879 -20204 -18567 1372 -56904 -129518 -49140 42623
11174 42623 -21519 -29647 52625 90320 222587 171500 61377 -20997 -34219 -79569 -156766
11163 -156766 -236775 -81178 43952 69154 68122 -17712 -4422 57926 69974 73712 100391
11152 100391 129837 160154 75081 -52606 -49213 6090 33965 42930 3495 -34361 -68961 -135721
11140 -135721 25 55099 22576 63119 -66865 -53938 40847 72655 13490 34162 140669
11129 140669 107583 72159 124653 122436 52394 132847 144774 -61672 -221586 -132178 -137362
11118a37362R1441r699N4958J1244j0560O6818P8198M2683J1736l1688j15851
11107E1918R695P702l8747p4712k5426K4166J32629J47607q7901j39843k8121
11096b1033M484j2002l7256j3356j0516J3592J2912j5203M1416N1713k6106m0154
11084e1509O5238j886j1151Q557j07855l6567M7873M6089J08188p737l8721m7189
11072b6670K0108k645l2230l9178N1515L337L6226J45574J5515q8242q2361p8631
11060g7682J0117K536k8840O3784R4890M0925n4171J14498o497n6131k1810k0330
11048F1289n3254K4350J75935J9767l4322n3457J6318Q553o8666k1567Q8203O1568
11036B24717Q0741q043M6399K5753j49572j04362J0309O4762J18089M1983K01762
$$ plain form
11118 -137362 -45921 -55620 -662 10582 22 66840 145038 187721 199457 167769 51918
11107 51918 61613 69315 30568 -44144 -69570 -45404 87225 234832 146931 7088 -21033
11096 -21033 -16549 -28551 -65807 -79163 -89679 -76087 -63175 -78378 -36962 14751 -11355 -51509
11084 -51509 13729 11843 692 9249 -98606 -135173 -87300 -41211 66977 59240 20519 -26670
11072 -26670 -6562 -9207 -41437 -80615 -29100 -25763 10463 156037 171552 83310 949 -77682
11060 -77682 -67565 -65029 -93869 -30085 64805 105730 51559 166057 159560 103429 81619 61289
11048 61289 8035 32385 208320 228087 193765 140308 156626 165179 96513 74946 163149 224717
11036 224717 305458 297415 343814 369567 219995 115633 125942 190704 308793 350776 552538
11025E52538Q9356m1503j12009N3903J03820k7973K4038Q8132j48326O7572J95891
11014H45439P5393J4801j7727q3904j05260o7506J56938l6917k26100J2811K4464
11003E92432O0635K7824p0413O1219j08513j72712j16475K046L3098O5140M2058
10992D16339Q0326L3124o328M135j03528j37515P6562k2700q756M140n6276n4896
10980B24627o9959Q7437r9499n3372Q7033j6327q7281N5427r388l2413n8690N6744
10968H4339L8854m210l7428J18571N6923r1012r1213r4229J8041K9307R702N2950
10956I0595p9746P2286J6857p0726m9729K8161k080j524l237J6950N7330K0133
10944I5270n3824O139n172l8758p6408m883l4661N0783J14118j7266J9405M5668
$$ plain form
11025 552538 641894 600391 488382 542285 646105 618132 642170 730302 581976 649548 845439
11014 845439 920832 935633 917906 834002 728742 661236 818174 781257 555157 567968 592432
11003 592432 653067 680891 610478 671697 563184 390472 273997 276043 309141 374281 416339
10992 416339 496665 529789 523461 527596 424068 286553 363115 340415 331659 335799 279523 224627
10980 224627 154668 242105 142606 89234 176267 159940 72659 128086 118698 86285 27595 84339
10968 84339 123193 118983 81555 200126 257049 166037 74824 -19405 -1364 27943 37645 90595
10956 90595 10849 83135 99992 29266 -20463 7698 5618 4094 857 17807 75137 95270
10944 95270 41446 47585 42413 3655 -72753 -77636 -112297 -61514 52604 35338 54743 100411
10932A00411n009p9459m0185L46M4342L1739k2415r0702O4441J20646n7925l2453
10920C3777J5465m4337O509M9083q529J1396R5794N9626m1436j8550n4182q8057
10908A6559K8162N9959o7863K1157N7646j592K6366l7856l8030j20929j1429K9928
10896c7922Q5382k3011N2877L5327r0709k4997L3288j36750n2868j5156P9803
10885i4736M6134N2963J08031l1485n0702K3577L1297L1563m189j84M1215j17837
10873C5647j92621l233J8017Q0243J54828J4603j10205o507l455K1889O4884L5072
10861A09162m5851q995j5079q0220L2264k4365j4251r1815R771J27480N6570O9514
10849A24185P391M2868p6645k1490R293m8163j834P4213J22417O2430j24311r8278
$$ plain form
10932 100411 95402 15943 -24242 -23896 20446 52185 29770 -60932 3509 124155 66230 33777
10920 33777 49242 4905 11414 60497 51968 63364 159158 218784 177348 158798 104616 16559
10908 16559 44721 104680 36817 57974 115620 114028 140394 102538 64508 -56421 -67850 -37922
10896 -37922 47460 24449 77326 112653 21944 -3053 30235 -106515 -159383 -174539 -94736
10885 -94736 -48602 4361 112392 80907 30205 53782 85079 116642 112453 112269 153484 35647
10873 35647 -156974 -160207 -142190 -61947 92881 107484 -2721 -9228 -12683 9206 74090 109162
10861 109162 63311 54316 39237 -40983 -8719 -33084 -47335 -139150 -129379 -1899 54671 124185
10849 124185 131576 174444 97799 76309 85602 37439 35605 109818 232235 294665 170354 72076
10837G2076O5354J36993M6106l9011j39598r4343L7168m031k9816p5577j50451
10826a75130L9896J64950J48278k6813l2320K0528j15096n7318K1275q1571M1681
10815e1640j1620J4139M0097n024k0719J14377P6358J09695N2471q5298m1960
10804A90876N843J002K1218l3903K0725N6598M3047j7094q5297j06752l8465J25946
10792A83744k5716M763m2030P1916J9657n6205r109N3541O012j4950k316p9921
10780A09386q4249o3773J8927L1393K2103k6417L6815J01252j5370K9894N6439
10769B16400o4320j31843n8706O8141R5046N924j4840L3878M0893k4433p5228
10758I0912L9472M0055l7311j6123r5215n3809r3637Q5995R2646Q8511L6292j36599
$$ plain form
10837 72076 137430 274423 320529 281518 141920 47577 84745 80714 50898 -24679 -175130
10826 -175130 -135234 29716 177994 151181 118861 139389 24293 -33025 -11750 -93321 -51640
10815 -51640 -63260 -49121 -9024 -14048 -34767 79610 155968 265663 318134 232836 190876
10804 190876 196719 197721 218939 185036 205761 262359 305406 288312 203015 96263 57798 183744
10792 183744 158028 162791 120761 192677 212334 156129 147020 200561 206573 191623 189307 109386
10780 109386 25137 -38636 -19709 11684 33787 7370 44185 145437 130067 159961 216400
10769 216400 152080 20237 -38469 29672 124718 130642 115802 149680 190573 166140 90912
10758 90912 130384 170439 133128 117005 21790 -32019 -125656 -39661 52985 141496 177788 41189
10746D1189q7524N8988J3486l5535P0103N4944M1737J8506j8319o5914P933m0995
10734E8599p0815K9841J51411k0778k9120l458L3295m6084m8562k0625P6771N6542
10722A67017N8272K4583n5775n5225J9907q973k4582K264M833p5461k9731o9723
10710d2594k5375J35378N158O0684P6515M9189p9014p9571k7227O9791K6903m2301
10698A27536L5725O7507M5185J4427J0041q5802J7827l200R335o3636P916J02809
10686B85670J4926N8577N0044j520M4716J4952j36212m6672K1055j6931r7263
10675A91342J11831L4564O2718p5161n916m241J7123m6919M9510K6449k7384o1707
10663B72209P6552L4546k0045l3209L2911R2882O5891j2984M0276L9980n2604
$$ plain form
10746 41189 -46335 12653 26139 -9396 60707 115651 157388 175894 157575 91661 99594 58599
10734 58599 -12216 17625 169036 148258 119138 115680 148975 102891 54329 33704 110475 167017
10722 167017 225289 249872 194097 138872 158779 149806 125224 127488 132321 56860 27129 -42594
10710 -42594 -67969 67409 72567 133251 209766 258955 179941 100370 73143 142934 169837 127536
10698 127536 163261 230768 275953 290380 300421 214619 232446 229246 238581 174945 182861 285670
10686 285670 300596 359173 409217 407697 452413 467365 331153 284481 305536 288605 191342
10675 191342 303173 337737 400455 325294 319378 315137 332260 285341 334851 361300 333916 272209
10663 272209 348761 383307 363262 330053 362964 455846 521737 508753 549029 589009 536405
10652E36405j49935J06109J40719J01142M7992j8303P6886L04931R6320L8621
10642A280887Q7884J10811J96807n088j07825j0426q2028J7948J00381N360M4282
10631A638993K56300J67369P1660J47128J82420K75548L35096M81926M88960L43429
10621D388829L14901L81652L44804M18211N94254Q70882J342639J750581K275686
10612A2682439K913357M034875N325053O683702P801766P590268N660173K856896
10604E5548529N20688q41726j143728r3016J821127M777144Q560216J2650725
10596H1799959J5501842J4532986Q975336J558439m064667o903487p324557n252657
10588I8823194j072404M315653J0196416J5854556J9253215J6816100P339938
$$ plain form
10652 536405 386470 492579 633298 734440 782432 764129 841015 1145946 1242266 1280887
10642 1280887 1368771 1479582 1676389 1671301 1563476 1553050 1471022 1488970 1589351 1594711 1638993
10631 1638993 1895293 2062662 2134322 2281450 2463870 2739418 3074514 3556440 4045400 4388829
10621 4388829 4703730 5085382 5430186 5848397 6442651 7313533 8656172 10406753 12682439
10612 12682439 15595796 19630671 24955724 31639426 39441192 47031460 52691633 55548529
10604 55548529 56069217 55227491 54083763 53990747 55811874 60589018 69149234 81799959
10596 81799959 97301801 111834787 120810123 122368562 118303895 111400408 104075851 98823194
10588 98823194 97750790 102066443 112262859 128117415 147370630 164186730 171526668
10581A71526668l999605j1747359j5557878j5899860j3212666q428516k893145
10574I9787639K676519P342256R435299P020669K88046o940221j1654326j3434201
10566I4521680j3044321j0784107p425924m017684j114145R42678J645911N39941
10558F1264029k090591m905987o657467p439544p310140o353041m993964l712174
10550A7801121k800322k109622j740808j368609j064940q33525o49838n71249
10542F662208o52611n47170n09488m91860l76671l35867j71088k90163l13895
10533B973395k36457j15151q7394j54791j72094r1874j71908j89256j88681p5321
10523A490468L6811p646j7060l4553r5662n1198O229j25496j14671o5421j37102
$$ plain form
10581 171526668 167527063 155779704 140221826 124321966 111109300 102680784 99787639
10574 99787639 102464158 109806414 119241713 126262382 126550428 119610207 107955881 94521680
10566 94521680 81477359 70693252 63267328 59249644 58135499 59078177 60724088 61264029
10558 61264029 59173438 54267451 47609984 40170440 32860300 26507259 21513295 17801121
10550 17801121 15000799 12891177 11150369 9781760 8716820 7883295 7233457 6662208
10542 6662208 6009597 5462427 4952939 4461079 4084408 3748541 3577453 3287290 2973395
10533 2973395 2736938 2621787 2534393 2379602 2207508 2115634 1943726 1754470 1565789 1490468
10523 1490468 1527279 1519633 1502573 1468020 1372358 1321160 1327389 1201893 1087222 1021801 884699
10512H84699m4193K6138j05530K3479J56n0958j5809O9136n2039q9707K1133o263
10500F60242m7927q905p9533k3659r886j29680k6260l2654R7522M102m6189O1968
10488D19141p7601l5612J981M7458J784q7043m1628l3733O8677L0545L1957M5962
10476C71888l8363k7840K4710J3955R710j26446n2816K4489Q6776J10350o4425
10465C31988j6828l6612n185o6640o9990J31814Q2665M4202N8487m5132o603L5607
10453D37773o511M5205o6411m9016k2482r2275n21K0536p7017M8489J2784l0304
10441B20250m4252n2509J7934j5305n6343K0850K6438K6917J05895N4472M7736
10430C52083J1332m891K3281m7640k3928j5551K2061j00292M902k2541R6346M2889
$$ plain form
10512 884699 840506 866644 761114 784593 784749 733791 717982 787118 735079 645372 666505 660242
10500 660242 612315 603410 523877 500218 490332 360652 334392 301738 399260 403362 357173 419141
10488 419141 341540 305928 307909 355367 357151 270108 228480 194747 263424 293969 325926 371888
10476 371888 333525 305685 330395 344350 354060 227614 174798 199287 286063 396413 331988
10465 331988 315160 278548 273363 206723 136733 268547 351212 395414 453901 408769 402166 437773
10453 437773 431262 476467 410056 361040 338558 246283 245762 266298 189281 237770 250554 220250
10441 220250 175998 123489 141423 126118 69775 90625 117063 143980 249875 304347 352083
10430 352083 363415 358524 381805 334165 310237 294686 316747 216455 221357 198816 295162 338051
10418C38051m2826J1941l3718j6502q5086k911j1428J3224J7953p1469n1543K1213
10406H6899Q8063j0827o3103n3618n4134l5025K2067J69129j6052m8466o7139
10395A7794O1493o3450q9061j7733P5515M1529o3493l986M6232j5224o0417m333
10383g5134N2214N3975M1043m9929p2327J9278n8635J04275J0232p611m4891K4167
10371c343j05072J23348J03642o7975o4997L247L2405O195p0709J9192q210R0524
10359E8247q660j07758N8020J31654q4769m9223R8275P1323j7160r671R1088Q4181
10347C15547L481m5177l5180o0387K8315l0969N3459J70151p9144r9741o8703
10336A51652m7571m7434K0673L8669j6581q4353J3499J5909q09L176J16418L2143
$$ plain form
10418 338051 295225 307166 273448 256946 171860 168949 157521 170745 188698 117229 65686 86899
10406 86899 174962 164135 101032 47414 -6720 -41745 -19678 149451 133399 84933 17794
10395 17794 79287 15837 -73224 -90957 -15442 26087 -37406 -41392 4840 -10384 -70801 -75134
10383 -75134 -22920 31055 72098 22169 -50158 -30880 -89515 14760 24992 17381 -27510 -3343
10371 -3343 -108415 14933 118575 50600 -14397 -11150 21255 27450 -43259 -24067 -32277 58247
10359 58247 49587 -58171 -151 131503 46734 -2489 95786 167109 149949 140278 231366 315547
10347 315547 319028 273851 238671 178284 206599 175630 229089 399240 320096 220355 151652
10336 151652 104081 56647 77320 115989 99408 15055 28554 44463 43654 46830 163248 195391
10324A95391l4185L1547O0496J6337m9176k7614p0176Q896L49m1827n9665P0338
10312A00711L6978o1280J954O1733K8365J2819q9993l0632N6001n7826J4172R3663
10300A66665l3056r6504L4640j5393L86M9871r737L5446N1314Q766q780p6295
10288A07323n3542j5174J28243r710r0291j2378O2582J2703q7450n6349l9212
10277e3255O6111O7152L0443k7538m5545L4173n8572o014R1228o3578n3384K3953
10265E174L2419n1387m6699j109R8724l5471r7976N9594J21101P4331r753m1328
10253A07620p2277r8257l8995N5128J9002m6768O37L5262j8333R437k0464Q707
10241e9301J6054K4801L5360R2254k7863o8082o9292M5533O8403K0550m2663l2694
$$ plain form
10324 195391 161206 192753 253249 269586 220410 192796 122620 131516 131865 90038 30373 100711
10312 100711 137689 76409 78363 140096 168461 181280 91287 60655 116656 58830 73002 166665
10300 166665 133609 37105 71745 56352 56738 106609 96872 132318 183632 192398 183618 107323
10288 107323 53781 38607 166850 157140 66849 54471 117053 129756 42306 -14043 -53255
10277 -53255 12856 80008 110451 82913 37368 71541 12969 6955 98183 34605 -18779 5174
10265 5174 37593 -13794 -60493 -61602 37122 1651 -96325 -36731 84370 158701 148948 107620
10253 107620 35343 -62914 -101909 -46781 -27779 -74547 -73910 -38648 -56981 -47544 -68008 -59301
10241 -59301 -43247 -18446 16914 109168 81305 13223 -56069 -10536 57867 78417 35754 3060
10229C060L5044L2348R5722o7495q8860j068K5460Q4870J2124m9155q8595K2011
10217A5466n0183L3960K4210o6652O6673K0986o9185j00549k0817M2151J05641
10206A701j2518K2162O4973L7627j56968p5280J41390q415L4333p662R5350J5879
10194A52572n8121r4119j3036N1361k609j9066m8610k2899m7851L4104P8889N0130
10182F0745o0724r2773Q7582M0892o3226P9785J07279P391j07154o78J09072J34248
10170C02439m1581J46528J18149o0193n1817J1811o816m7196K3167K5641O1506
10159D81638R9027O8803Q0476k4382j3015j1118j57022o8658L2259J08064J21203
10148G17275J17191K47496Q9817j13104p275j15935o6141o426k5211o2986q1428
$$ plain form
10229 3060 38104 70452 166174 98679 9819 8751 34211 119081 131205 82050 -6545 15466
10217 15466 -34717 -757 23453 -43199 23474 44460 -24725 -125274 -146091 -103940 1701
10206 1701 -10817 11345 76318 113945 -43023 -118303 23087 14672 49005 41343 136693 152572
10194 152572 94451 332 -12704 38657 36048 16982 -31628 -54527 -102378 -68274 10615 60745
10182 60745 21 -92752 -5170 35722 -27504 52281 159560 166951 59797 59119 168191 302439
10170 302439 260858 407386 525535 465342 413525 425336 418520 371324 394491 420132 481638
10159 481638 580665 649468 729944 705562 692547 681429 524407 455749 488008 596072 717275
10148 717275 834466 1081962 1171779 1058675 1051400 935465 869324 862898 837687 774701 693273
10137F93273p879l4398N5889J12914l8390r6582k00767j9251j0679q4596o9357
10126C00177m8006L3497J3827O2384Q2499p5852n5340o370r7419q3647m9566L1743
10114A07927j9870J3475L6293l8551n6016J27984j2643j51190p1424P5132l8547
10103b7430l1087j03258J1654P7632K08844N0912p2712q3496j7311p9697R0700
10092B4751K7298L7242M5523Q6571o1450m7947l0139L8432P85O50j11694k9528
10080a9506J39543M5828n7160l1576k324M5642p9478r2097K3281k0199Q548j4593
10068e4091J12302J09726p7542r4521l3722j7632L9096m9005j9723j7339M5407
10057e7044J28248R1369o0073l3586m3893N3578p867J371K1646o9807j29480R181
$$ plain form
10137 693273 685394 650996 706885 819799 781409 684827 484060 464809 454130 369534 300177
10126 300177 252171 285668 299495 361879 444378 368526 313186 306816 209397 125750 76184 107927
10114 107927 88057 101532 137825 99274 43258 171242 158599 7409 -64015 11117 -27430
10103 -27430 -58517 -161775 -150121 -72489 136355 187267 114555 31059 13748 -65949 24751
10092 24751 52049 89291 134814 221385 159935 111988 81849 120281 121066 121716 10022 -19506
10080 -19506 120037 165865 108705 77129 74805 120447 40969 -51128 -27847 -48046 -39498 -54091
10068 -54091 58211 167937 90395 -4126 -37848 -55480 -16384 -65389 -85112 -102451 -57044
10057 -57044 71204 162573 102500 68914 25021 78599 70732 72103 93749 23942 -105538 -96357
10045i6357L9109n9247Q04O9618O9558N4616J03781j50053m5650j114p219L9256
10033A7102K6208p3332O062l5723P688M5608L5799n2246l0180Q0391K8348K1302
10021G7027j6337j9306R4233P0464k6767j32259r1057N3863O8282p35j25990j23695
10009a72277O7587J85575O2734J2067p8111J3522M1612J3033k5292N7496Q4311
9998B62257L633j7987q0159O1508J12705q0798j09071M3367m8184k0770L0479
9987A56980Q88K2943m1683K1921j854o6027k7948J05165M9283o3559m2529l9107
9975G4473r6108m7391L4426J52574O324j87559j0701J14303r3642j4668J54940
9964H6971N3040l2792j00275p1193j7866K3692P6231N3841M50L828j62210n9028
$$ plain form
10045 -96357 -57248 -116495 -115691 -46073 23485 78101 181882 31829 -13821 -14935 -22154 17102
10033 17102 43310 -30022 -23960 -59683 -51995 -6387 29412 -22834 -53014 27377 55725 77027
10021 77027 60690 41384 135617 206081 179314 47055 -44002 9861 78143 77408 -48582 -172277
10009 -172277 -104690 80885 143619 155686 77575 91097 132709 145742 120450 177946 262257
9998 262257 265890 247903 167744 229252 341957 261159 152088 195455 147271 126501 156980
9987 156980 157868 180811 139128 161049 159195 93168 65220 170385 219668 156109 113580 74473
9975 74473 -21635 -69026 -34600 117974 124298 -63261 -73962 40341 -53301 -67969 86971
9964 86971 140011 107219 6944 -64249 -82115 -58423 17808 71649 72099 75927 -86283 -145311
9952a45311L8587P7308N1362L6592r8008o5886j6217M7582P6807j2411n5092j01182
9940a65869o5355J15447R8647P3512K1479j79088l4169N6237P8922O191o2369
9929e6415j3287J21619m1800q8459n1090j468J19149J13315R762l7561O890L9033
9917A19688p6214k5579J1958j97687l7938K3555L6953M4124J3486M0525N6495
9906I366n2000J0142Q4192M4348O9205p6453j13332j4597N3407l0378n2096R1687
9894B3491L9300o5748o7094M2244N7644m6082k3157L4933l402J07931L0712q4793
9882D5979p0129Q5664N7902J0683q5328j01611k061P6645p15N5186J36073j3085
9870A95203k24444j5256O3160n898j46017m5451P5196O9625M0605l688L1121J34547
$$ plain form
9952 -145311 -106724 -29416 21946 58538 -39470 -105356 -121573 -73991 2816 -9595 -64687 -165869
9940 -165869 -231224 -115777 -17130 56382 77861 -101227 -135396 -79159 -237 5954 -56415
9929 -56415 -69702 51917 10117 -78342 -129432 -130900 -11751 101564 111326 73765 80655 119688
9917 119688 43474 17895 29853 -167834 -205772 -182217 -145264 -101140 -87654 -47129 9366
9906 9366 -42634 -32492 51700 96048 165253 88800 -24532 -39129 14278 -16100 -68196 23491
9894 23491 62791 -2957 -70051 -27807 29837 -16245 -39402 -4469 -7871 100060 130772 45979
9882 45979 -24150 61514 119416 130099 44771 -56840 -58901 17744 17029 72215 208288 195203
9870 195203 -29241 -44497 18663 12765 -133252 -178703 -103507 -33882 6723 3035 34156 168703
9858A68703q105n2136l9593j0499k4251p4508K4289o2887M9303L6204P225K210
9846A5955J312O8375N8197j9529k8723r8004m7816O7814J40471l2826j56077J3495
9834a7356Q9232r520m7153k7371j3104J4779k890J8323K7226P2216K5309p7837
9822E1854l7830R0491l6124n0163l7079r707R5420o34j9028L1443K3541J25889
9810B28073p3096q5558n6895j34258j7795K3139j0473q3123k1301P3698O1709
9799i5880J04957j9394o1129n6687J9053K3346r7616j17098O0289R8197J2635
9788a29327l7127N2693L9128N9796J2294P1092J6310j8645J1318o2675j83051
9777a68194j0503Q1705N0046P9426N5461L5045k8297j36083p0441J12351J28312
$$ plain form
9858 168703 160598 108462 68869 58370 34119 -40389 -16100 -78987 -29684 6520 13745 15955
9846 15955 17267 85642 143839 124310 95587 -2417 -50233 17581 158052 125226 -30851 -17356
9834 -17356 71876 62356 15203 -12168 -25272 -10493 -13383 4940 32166 104382 129691 51854
9822 51854 14024 104515 68391 18228 -18851 -28558 66862 66228 47200 78643 102184 228073
9810 228073 154977 69419 12524 -121734 -139529 -116390 -126863 -209986 -231287 -157589 -95880
9799 -95880 9077 -10317 -71446 -128133 -109080 -85734 -183350 -300448 -240159 -141962 -129327
9788 -129327 -166454 -113761 -74633 -14837 -2543 68549 84859 66214 77532 14857 -168194
9777 -168194 -178697 -96992 -46946 32480 87941 122986 94689 -41394 -111835 516 128828
9766A28828n8137j48894R480R8590O9049j4228q3753j8579L4167K2422Q900r3500
9754d5655j37993R5092J43463K144j48236k9201M4772n3958j293M6098Q3942r572
9742a0397n8695N7659m2501o708P8682k7856m1544k9860j8011P7746l0477q1088
9730a33050m6714R8640N0697n3797j4167N926n0848p5608L8364J34946J32606
9719H6995O0106j2255J7526j5166p2556k5719m8241j06406J4802R7761L4267N1578
9707H2692j2259M387p4502o9134J9605P1693J0810k3923J6766n7981J9628J4662
9695B444O5479R615j56844P391L4689m0220R1849L5974k440m6288k0847r9907
9683a19105r2204J12695M1337N9563L9793J4108J1713O5093m9455k19662l8894
$$ plain form
9766 128828 70691 -78203 -68723 29867 98916 84688 935 -17644 16523 38945 47845 -45655
9754 -45655 -183648 -88556 54907 57051 -91185 -120386 -75614 -129572 -130865 -84767 -825 -10397
9742 -10397 -69092 -11433 -53934 -60642 18040 -9816 -51360 -81220 -99231 -21485 -51962 -133050
9730 -133050 -179764 -81124 -30427 -84224 -98391 -92465 -143313 -218921 -180557 -45611 86995
9719 86995 147101 134846 152372 137206 64650 38931 -9310 -115716 -100914 -3153 31114 82692
9707 82692 70433 74820 318 -68816 -49211 22482 33292 9369 26135 -31846 -12218 2444
9695 2444 67923 77538 -79306 -71915 -37226 -77446 14403 50377 47937 1649 -19198 -119105
9683 -119105 -211309 -98614 -57277 2286 42079 56187 67900 132993 83538 -136124 -175018
9672a75018Q9786J10435N8838j10600o8907J9559N0833N6109q199k2269L587p3076
9660f8922J25930M5285n5839j21492j6113q724M7193J64067R9286O9400k7191
9649B52880o3613k3564K4971m3876K4542L9551O8201m3738J6819m6662q1332O8046
9637A92225Q2137j0168r2558j61215m8743P5714K5291K9157n2841j04109l515
9626f8625L9024J2062r24J12150k6615o274P7676o2296J00157J27977r1419j72910
9614C9983j05400r7908r6957J28059J51328M3885o4684k7447l100o1359K061J04340
9602A2801M0916l2785p7540q369P4930O6357K2846o7739m3062J4037M916M8224
9590E5532m7963N2758m2011l0333N6017l6296L5759Q084J4465J5490m3112k2376
$$ plain form
9672 -175018 -85232 25203 84041 -26559 -95466 -75907 -25074 31035 22836 567 4154 -68922
9660 -68922 57008 102293 46454 -75038 -91151 -99875 -52682 111385 210671 280071 252880
9649 252880 189267 165703 190674 146798 171340 210891 279092 235354 252173 205511 124179 192225
9637 192225 274362 264194 171636 10421 -38322 37392 62683 91840 38999 -65110 -68625
9626 -68625 -29601 -17539 -18463 93687 67072 60798 138474 76178 176335 304312 212893 39983
9614 39983 -65417 -163325 -260282 -132223 19105 62990 -1694 -29141 -32241 -93600 -91539 12801
9602 12801 53717 20932 -56608 -64977 9953 76310 99156 31417 -11645 2392 7308 55532
9590 55532 7569 60327 18316 -12017 44000 7704 43463 51547 66012 81502 38390 16014
9578A6014J20408j8782j6003Q1088o8466o9581J4910j2540l4140l8360r2985l3161
9566a51598K4331K9835J45345P7619m0611k5660M514L377N3995m6368o0189Q8922
9554A03512P5424Q4995j02144r3026q8549J4089M8344J0230k8914Q5855l8042
9543G1774j53997J0352K8647k5488p4091J564J02054R5375r005O0377p4975r2632
9531f0045r863l8241l1169O2732M6799M9966k5719m8184Q0464n0055J0765l5528
9519d8078o4747P4175L0171q9870o8878N5167N9415l635R1397Q69n9483Q4179
9507F0682P0077L0919O1657p8293j35080N7p63p06L5810K0737P6698L6610l948
9494A74457j27201n4410p777k0464O1157P8852j2853m8498j484J08121M2937k506
$$ plain form
9578 16014 136422 117640 101637 182725 114259 44678 59588 47048 12908 -25452 -118437 -151598
9566 -151598 -127267 -97432 47913 125532 84921 59261 63775 67152 121147 74779 14590 103512
9554 103512 178936 263931 161787 68761 -19788 -5699 42645 52875 23961 109816 71774
9543 71774 -82223 -71871 -43224 -68712 -142803 -141239 -39185 56190 47185 107562 32587 -60045
9531 -60045 -69908 -108149 -139318 -76586 -29787 20179 -5540 -53724 26740 -23315 -12550 -48078
9519 -48078 -112825 -38650 -8479 -98349 -167227 -112060 -52645 -56280 35117 35986 -23497 60682
9507 60682 130759 161678 223335 145042 9962 10019 9256 8550 44360 65097 141795 178405 174457
9494 174457 47256 -7154 -14931 -35395 25762 104614 91761 43263 41779 149900 192837 190331
9482A90331m0221p6261l4623q9307M072L9482O2493Q260j02158L5439j07124p589
9470a17206J09903P3853o1319k9433K9298P429j5647R0228N7948K300q1763n8626
9458F965k3056J900r0828j6463J0598K3112Q6606P6884j0534r476M7174J25489
9446B28371N8462k5780q7376q7897l2456k9122o4356m4717k4195R7434M9034o1703
9434b4301l9943J24140o6803l3968p1873j5699Q738J18083Q5460K5825n2413M2193
9422I9439N1849L5767m2718k624l698j5060j2212L6827n5312m9032M5844P882
9410I6952p8731j12299O9454Q5839M7224J8706Q8878n399j40482N21o0782j07391
9398i7510p3046L7902n9982k9831K8407P652K7226M0362L1553L3576J7861K2993
$$ plain form
9482 190331 150110 73849 39226 -50081 -46009 -6527 55966 64226 -37932 -2493 -109617 -117206
9470 -117206 -7303 66550 5231 -24202 5096 12525 -3122 87106 145054 147354 65591 6965
9458 6965 -16091 -14191 -105019 -121482 -110884 -87772 -1166 75718 65184 55708 102882 228371
9446 228371 286833 261053 173677 85780 53324 24202 -40154 -84871 -109066 -11632 37402 -24301
9434 -24301 -64244 59896 -6907 -40875 -112748 -128447 -119709 -1626 83834 109659 57246 99439
9422 99439 151288 187055 144337 141713 138015 122955 110743 147570 92258 43226 89070 96952
9410 96952 18221 -94078 -24624 61215 108439 127145 216023 210624 70142 70663 9881 -97510
9398 -97510 -170556 -132654 -192636 -222467 -194060 -186408 -159182 -118820 -87267 -53691 -35830 -12837
9386a2837L9535m2489j2408K1836N8818J2584N9156q8565l0186j8779M6132l9645
9374f848j17045Q1591K8694M9398j8083M8311L2332k2506q8561j24063O1982K9536
9362d5262k3044j7387N2547k2967q3230P6766P3493J00865J5013r5127j4460o7663
9350e0456K3245m2742O1429j8654j35158o8106J07533k5742N6043K467j31783
9339b21924J3423P7553L353O051o2186j4160R637L5129K8569p5575J13552J34368
9327D7790m4883q4089j12219O8611J14778r9098Q681L9576p544J9100M7950j25423
9315a26770n5546J67043N0515l6391m5413J5329L4944l4434m1605J162j2070J6529
9303f6707J0386P7445N7114o1771M7530L9334k8389l9044o2847k4138J58424p0718
$$ plain form
9386 -12837 26698 -15791 -28199 -6363 52455 65039 124195 35630 5444 -13335 32797 -6848
9374 -6848 -123893 -42302 -13608 35790 17707 66018 98350 75844 -12717 -136780 -74798 -45262
9362 -45262 -68306 -85693 -33146 -56113 -139343 -62577 10916 111781 126794 31667 17207 -50456
9350 -50456 -27211 -69953 -8524 -27178 -162336 -230442 -122909 -148651 -92608 -90141 -221924
9339 -221924 -208501 -130948 -127595 -121544 -183730 -197890 -188253 -153124 -124555 -200130 -86578 47790
9327 47790 2907 -81182 -193401 -124790 -10012 -109110 -100429 -60853 -68397 -49297 -1347 -126770
9315 -126770 -182316 -15273 35242 -1149 -46562 -31233 3711 -30723 -72328 -71166 -83236 -66707
9303 -66707 -56321 21124 78238 16467 63997 103331 74942 35898 -26949 -51087 107337 36619
9291C6619K0954R4715q9040j3618P2531j1251k481N5644Q379L6890p5999o9211
9279F4132r9L8265j3183k7213K9848J5657L1194l6518n1610k941j12158O9783
9267E157J19793q9497m7812p3615l0898L5914P8393O9886M1611m3970K0838P0058
9255A55858p3084n4758K184n5057j3547j6955n2203j8073n2256r927p713j8307
9243b13838P6872N5498J4085n4553Q9785P15L0397K5810l1466O7991Q1883n6650
9231H6529l6481j15708j6126M8752J20781J4471K616J4458O1480N3191j14811
9220A19152j16006m1477N9780p7534r5075o036l5572m9942J3840P6608Q7854J03380
9208C8972j7675O9558L2100J0013m6970J7245l6369l6532N8677o7387j1198L2522
$$ plain form
9291 36619 57573 152288 63248 49630 122161 110910 108429 164073 172452 209342 133343 64132
9279 64132 64033 102298 89115 61902 91750 107407 138601 102083 50473 47532 -64626 5157
9267 5157 124950 35453 -12359 -85974 -116872 -80958 -2565 67321 108932 64962 85800 155858
9255 155858 82774 28016 30200 -24857 -38404 -55359 -107562 -125635 -177891 -187818 -195531 -213838
9243 -213838 -136966 -81468 -67383 -121936 -32151 -31436 -1039 24771 -6695 61296 143179 86529
9231 86529 50048 -65660 -81786 -33034 87747 102218 104834 119292 180772 233963 119152
9220 119152 3146 -38331 21449 -56085 -151160 -157196 -192768 -242710 -228870 -152262 -64408 38972
9208 38972 21297 90855 122955 132968 85998 103243 66874 30342 89019 21632 10434 42956
9196D2956K3557r832n6509N9585m8184j06362k2510M9175K1728L7191K8324K5853
9184D4972r143K5863O2140p1626q9730J674n4146l9634L5968J5791N7280J1247
9172i344n7474n7744o0350O2909R5086N1666m9560K877J3208O12P0321J10085
9160A72292N2154j8398o1809j37483k8643o264L0226O83k32R758k8090L1159L059
9147A8412k8056k8526L7265j26688N1363R3643j6045k8959K9914O728q548L4130
9135C4633k255l4716m3419n891J7779n8644m6414O4767J71120n8653o4349L057
9123b2985R147K3474j9910J29941J634p0554k4769J7166N6962k0653j6626M4724
9111A07551l5806l8759j15919p4276k9456R6120N9584n6896K9551L9965K4390
$$ plain form
9196 42956 66513 56681 172 59757 11573 -94789 -117299 -68124 -46396 -9205 19119 44972
9184 44972 35829 61692 123832 52206 -37524 -35850 -89996 -129630 -93662 -77871 -20591 -9344
9172 -9344 -66818 -124562 -184912 -122003 -26917 24749 -24811 -21934 -8726 -8114 62207 172292
9160 172292 224446 206048 144239 6756 -21887 -28151 2075 2758 2526 12284 -15806 15353 18412
9147 18412 -9644 -38170 -905 -127593 -76230 17413 1368 -27591 2323 9051 503 34633
9135 34633 32378 -2338 -45757 -51648 -33869 -92513 -138927 -74160 96960 38307 -26042 -22985
9123 -22985 -13838 9636 -10274 119667 121301 50747 25978 43144 100106 79453 62827 107551
9111 107551 71745 32986 -82933 -157209 -186665 -90545 -30961 -87857 -58306 -18341 6049
9100F049L927n7610k6486k4998M5765Q9234J2723p3456J3557Q9252L7657J5665
9088A31279r5399n9517L2770N4665N3295n1067m949N8503J4674K4753K7115j11446
9076G4676k7265k5293M3912O4354j03369Q980P1251j4044m1520l3195N0183j0142
9064E8528K1932l96o0672j08170R5838Q2707k8926l3343k059Q3353q8829n2125
9052c2162p5537J19367R2958j13248J7824M7466r3942j17988q8316o7628j7823
9041c29029J11334K09074J27715P3237N5753j21241j27779j7027N4905J37405
9031A74347j09888j15537o3609J28200j1054J2253k2313J08365l2189j90494K3382
9020i8537M7869Q2110J233l5856Q049n3233r7484r3876P2964J04964J8552n5596
$$ plain form
9100 6049 9976 -47634 -74120 -99118 -53353 35881 48604 -24852 -11295 77957 115614 131279
9088 131279 35880 -23637 9133 63798 117093 66026 61077 119580 134254 159007 186122 74676
9076 74676 47411 22118 66030 130384 27015 35995 107246 93202 51682 18487 68670 58528
9064 58528 80460 80064 19392 -88778 7060 89767 60841 27498 25439 108792 19963 -32162
9052 -32162 -107699 11668 104626 -8622 9202 56668 -37274 -155262 -243578 -311206 -329029
9041 -329029 -217695 -8621 119094 192331 248084 126843 -936 -17963 36942 174347
9031 174347 64459 -51078 -114687 13513 2459 14712 -7601 100764 68575 -121919 -98537
9020 -98537 -50668 31442 32675 -3181 4868 -48365 -145849 -239725 -166761 -61797 -43245 -98841
9008i8841O552J16195L5527p5797M1698p6318l852o9536j36454M9676J22282R7390
8996H522o2987N5490L9604r9112m8535j3941K7671J01360J24499Q9068p3097j00057
8984D8485n1254J18157o038j02130j3054k6024L7741j20592n8398k0587n592J20008
8972g9278J27045L6198l3548Q0314k8627o6895P5570k5571n0013l1218k3721l1802
8960e1546m5196o742O8443L4257R1785l1860l7885J05123q54j31512m5284K9754
8948b1517J15546K91q4228M9446j0927m3337j58826K602J54016l9635l5334M4737
8936b7166N5419N8076J02071l0602o5947n5475n0419n1943Q1772k7498m2129p5431
8924a29272j9571K4578P3292j28m2830L2653M1637N7510L0334m2102p0654m204
$$ plain form
9008 -98841 -92289 23906 59433 -16364 25334 -50984 -54836 -124372 -260826 -211150 -88868 8522
8996 8522 -54465 1025 40629 -58483 -107018 -120959 -93288 8072 132571 221639 148542 48485
8984 48485 -2769 115388 109350 7220 -5834 -31858 5883 -114709 -173107 -193694 -199286 -79278
8972 -79278 47767 83965 50417 130731 102104 35209 110779 85208 35195 3977 -19744 -51546
8960 -51546 -96742 -103484 -35041 -784 91001 59141 21256 126379 125525 -5987 -51271 -21517
8948 -21517 94029 94320 10092 59538 48611 5274 -153552 -150950 3066 -36569 -71903 -27166
8936 -27166 28253 86329 188400 157798 91851 36376 -14043 -65986 15786 -11712 -53841 -129272
8924 -129272 -148843 -124265 -50973 -51101 -93931 -61278 -19641 37869 68203 26101 -44553 -48757
8912d8757R324j04843m3414N8871J39734m7399p0072j5333j9370M4161J03899
8901F801J07420k4448j15756k023J3484j8832l7213k9036K8543K0734J39672m119
8889H5227l3851r0049r9508k775K5080J1710m6874J26218k0203k7073j11297j124
8877a84519P8309L8473K3153n382m4459K0299K7384p6674m5233N4638N2229K7467
8865c4315J27599o7533l3015M3312N233Q5010m3812k1777J9776k4503m5335O4620
8853G5260K401j35097j47641R9480k0509M4009o2385M2060R7883J15508r0933
8842B0036n9332j6534J3124o5881J7736J5520k8896Q7365L9268O8164K1348r4725
8830A7193n6478m783J24998j5252J9824N6657L9027J4942j15064p5837J03765
$$ plain form
8912 -48757 -39433 -144276 -187690 -128819 10915 -36484 -106556 -121889 -141259 -97098 6801
8901 6801 114221 89773 -25983 -28006 -14522 -33354 -70567 -99603 -71060 -50326 89346 85227
8889 85227 51376 -38673 -138181 -140956 -115876 -104166 -151040 -24822 -45025 -72098 -183395 -184519
8877 -184519 -106210 -67737 -44584 -49966 -94425 -74126 -46742 -123416 -168649 -114011 -61782 -34315
8865 -34315 93284 25751 -7264 36048 41281 126291 82479 60702 80478 55975 10640 75260
8853 75260 77661 -57436 -205077 -105597 -126106 -82097 -144482 -102422 -4539 110969 20036
8842 20036 -39296 -55830 -42706 -108587 -90851 -75331 -104227 -16862 22406 90570 111918 17193
8830 17193 -39285 -44068 80930 65678 85502 142159 181186 196128 81064 5227 108992
8819A08992N1829p2384j9087n9510m1224L4112M4100J7035j6942N2127J4417m1359
8807G2106J3553l1069J0034J0414n4850p69M5539n8425p2995m7043K1149M1297
8795e1059m5560J6671J2350J7978J6899O484q166O0003N2317n9479J04453J5281
8783A38172p0517j57689J0719M9591N1813J8194o6399n6688N3507k7316k5657
8772h2270p81P5970J23541R0o2627M762r369K9413r308j56353O3633J46243o4835
8759E8109j62751j01302P527K7551J0011P7087L5902k8954M5948M2210R4q275
8747C157m205m9314l6768O2359L0714O8392J52290l5556j50351L7031M1355J3972
8735A33076j37001m2070j04281p3139M4749J02080J41753N372K2737K829k3672
$$ plain form
8819 108992 160821 88437 69350 9840 -31384 2728 46828 63863 46921 99048 113465 72106
8807 72106 85659 54590 64624 75038 20188 19419 64958 6533 -66462 -113505 -92356 -51059
8795 -51059 -96619 -79948 -67598 -49620 -32721 -26237 -34403 25600 77917 18438 122891 138172
8783 138172 67655 -90034 -79315 -29724 22089 40283 -26116 -82804 -29297 -56613 -82270
8772 -82270 -83051 -7081 116460 116550 53923 58685 49316 78729 69421 -86932 -23299 122944 58109
8759 58109 -104642 -205944 -198417 -170866 -160855 -83768 -47866 -76820 -30872 11338 11432 3157
8747 3157 -1048 -50362 -87130 -24771 5943 74335 226625 191069 40718 77749 119104 133076
8735 133076 -3925 -45995 -150276 -223415 -178666 -76586 65167 70539 93276 96105 72433
8724G2433q5121o5448J0358Q4842q5159K0898Q5709j9536K6364k6535J101M0283
8712F0189k3658n4184m4059J9200R1757k314m2474l019k1137J1132m2534j13405
8700a64506Q8902J59506O37p4580m3946j7199R0625M6018R0229j6796j13000p5884
8688b9994L9161L524j3420n1582P630p532K7537N3891O9827m2542j077o5627m9929
8675f0133O2321L8361n4088l3929K8930j9047Q3119L9374O3626l3126m3091m3090
8663B9227O0727J4953q1305q5677J0932j2460J6458k343Q5951N4479m6884n8701
8651a4643m2178J548K1849O7842N0178j1794j38280j31503J31683J46101J13646
8640A94449J29994o3661m773k5672j02851l2714o8673m912l3995p028K7712j1023
$$ plain form
8724 72433 -12688 -78136 -67778 17064 -68095 -47197 38512 18976 45340 18805 19906 60189
8712 60189 36531 -17653 -61712 -42512 49245 46931 4457 1438 -19699 -8567 -51101 -164506
8700 -164506 -75604 83902 84539 9959 -33987 -51186 39439 85457 175686 158890 45890 -29994
8688 -29994 9167 12691 -729 -52311 -44681 -52213 -24676 29215 99042 56500 55423 -10204 -60133
8675 -60133 2188 40549 -13539 -47468 -18538 -37585 45534 84908 148534 115408 72317 29227
8663 29227 89954 104907 23602 -62075 -51143 -63603 -47145 -49488 36463 90942 44058 -14643
8651 -14643 -56821 -55273 -33424 34418 84596 72802 -65478 -196981 -65298 80803 194449
8640 194449 324443 260782 256009 230337 127486 94772 26099 21187 -12808 -19836 7876 -3147
8628c147l806R015m2000n7547p327j2001J66216P6729J81l0764n932o947j21172
8615c8502M156o753Q1241o1393n1330N1919J13461R3271m4378q2693j96433m6193
8603a83627J22331K6027O8031P0675K0727r6532m7458K1250n1460M0620K0715
8592A1299O3930L7166L0772J1718p9180q3511n9001k3489N1400L5657l2111m9834
8580h5184k303M246J9061p8971L5132J03311K32M7866k1826M438N7178Q4772n8845
8567A09107j64895m8654N7550R6988o0334K074K8085Q3684j05927J1595q2965
8556g3692k3130m4259j4320R8827O9459J8521n8811m1763K1971j9505K5067O015
8544c5620m0537n4667n688O6359N9745l8315m4535Q7776J46483K7187j5681o106
$$ plain form
8628 -3147 -6953 2062 -39938 -97485 -104812 -116813 49403 126132 126313 95549 89617 82670 -38502
8615 -38502 -34346 -41099 40142 -21251 -72581 -20662 92799 186070 141692 58999 -137434 -183627
8603 -183627 -61296 -35269 32762 103437 124164 27632 -19826 1424 -50036 -9416 11299
8592 11299 75229 112395 143167 154885 75705 -7806 -66807 -90296 -38896 -3239 -35350 -85184
8580 -85184 -87487 -83241 -64180 -143151 -108019 -4708 -4476 43390 21564 26002 83180 167952 109107
8567 109107 -55788 -104442 -46892 50096 -10238 -8164 19921 103605 -2322 9273 -73692
8556 -73692 -96822 -141081 -155401 -56574 12885 31406 -27405 -69168 -47197 -66702 -41635 -35620
8544 -35620 -76157 -130824 -136512 -70153 -10408 -48723 -93258 -5482 141001 168188 152507 146401
8532A46401M7210j01874p233K5757m5592N2673j8687j17580K0398J5551n4409
8521c7385K3220Q9171N085m4483q7242p489J5553O6282m6148o5063K8906J15719
8509E6126m2483m3814l6736L5921j3130L8875M4576k270K544l9509j4285J06540
8497I2355Q0785l8955n2433K8334j11986k9143J14365m9203j24230N8339l0076
8486f1848n9778N6351N0316j2632l6700P4114K2962p7683j0200P207K1752j7110
8474d3249l5727j37208j0274J72973o5260k5772O369R057k8112j5345N8726J03514
8462a0308K8262q331q649j37409r280J6334M3680P7924r209P5013r782k6749J3623
8449C5119J4632J04676L9719n5895K4140R5863N7426L9975K2765j90407n1855
$$ plain form
8532 146401 193611 91737 84504 110261 64669 117342 98655 -18925 1473 17024 -37385
8521 -37385 -14165 75006 80091 35608 -51634 -59123 -43570 22712 -23436 -88499 -59593 56126
8509 56126 13643 -30171 -66907 -30986 -44116 -5241 39335 37065 39609 100 -14185 92355
8497 92355 173140 134185 81752 110086 -1900 -31043 83322 34119 -90111 -31772 -61848
8486 -61848 -121626 -65275 -14959 -27591 -64291 9823 32785 -44898 -55098 -47891 -26139 -43249
8474 -43249 -78976 -216184 -226458 -53485 -118745 -144517 -138148 -129091 -157203 -172548 -113822 -10308
8462 -10308 17954 9623 974 -136435 -145715 -129381 -85701 -7777 -16986 58027 48245 21496 35119
8449 35119 49751 154427 194146 138251 162391 258254 315680 355655 378420 188013 136158
8438A36158p4029q5771n682M0661k7495K0497l5007l3787m1589o7792M779J11623
8426e7434M4135L9188P8803N518r1264J8854L0106l2360o1232J3084n5111J7113
8414e0600j6948K5491k5972M7791L4409K1988q131o5711J0337k8111O1131k087
8402C587j10331P1462O7958M9785l2273p424q4038j03880j7105P344k3890M1640
8390a37165M6241j9572J24168J43806K6616j12745j15796p0423j011Q7364P2399
8379D3882J2250o3495M2308J645p5677k8188O0535Q7612K4495l5558j19130o9565
8367a18886K7061O4423P4732n2940M0755J6272m2410Q0586q889j16221k3877N4065
8355e329L9758m6342p9705k6239o040J3668n23N5718J66597P8305o8460r4725
$$ plain form
8438 136158 62129 -23642 -29324 11337 -16158 4339 -30668 -64455 -106044 -173836 -169057 -57434
8426 -57434 -13299 25889 104692 110210 18946 37800 67906 35546 -25686 -12602 -67713 -50600
8414 -50600 -67548 -42057 -68029 -20238 14171 36159 28028 -37683 -27346 -55457 5674 3587
8402 3587 -106744 -35282 32676 82461 50188 42764 -41274 -145154 -162259 -154915 -178805 -137165
8390 -137165 -90924 -110496 13672 157478 184094 71349 -44447 -114870 -115881 -28517 43882
8379 43882 56132 -7363 34945 36590 -39087 -67275 -6740 80872 105367 69809 -49321 -118886
8367 -118886 -91825 -27402 47330 -5610 35145 51417 9007 89593 80704 -35517 -59394 -5329
8355 -5329 34429 -11913 -91618 -117857 -123897 -110229 -110752 -55034 111563 189868 121408 26683
8343B6683r0531N3866k0015P4402o7123k4165P2489j04461m3861n500M4555j2735
8331i6396P2155N1011o207N763o3413l9331J20767P6720K9830l3581K4757o5647
8319G6428m3905j3292o645O1200o8701k8179k071K3134k7669O791m0678n7729
8307a21316m1269P0678r075o797p6428J1845J0106O7994J19780M3690j11857o0368
8295a03017N7754o5480n0409j0132Q8702J35224k5416K7291l1520R381j16786
8284h4408o2734R1505N3273j7434J01129N5397j13457K7808K5551m9336m2437
8273a5143L0144l8589O2164Q5653M5292o4915o858K2909m0920J8132k9894l7887
8261C0088l8327n2735l2274J02893J1424l8321l8449K2777J5297n0147n3688Q9072
$$ plain form
8343 26683 -63848 -9982 -29997 44405 -22718 -46883 25606 -78855 -122716 -128216 -83661 -96396
8331 -96396 -24241 26770 20563 26326 -37087 -76418 44349 121069 150899 117318 142075 76428
8319 76428 32523 19231 12586 73786 5085 -23094 -25165 -2031 -29700 -22909 -63587 -121316
8307 -121316 -162585 -91907 -100982 -107779 -184207 -172362 -162256 -94262 25518 69208 -42649 -103017
8295 -103017 -45263 -110743 -161152 -171284 -82582 52642 27226 54517 22997 32378 -84408
8284 -84408 -147142 -55637 -2364 -19798 81331 136728 23271 51079 76630 27294 -15143
8273 -15143 15001 -23588 38576 124229 169521 104606 97748 120657 79737 97869 67975 30088
8261 30088 -8239 -60974 -93248 9645 21069 -17252 -55701 -32924 -17627 -67774 -121462 -32390
8249c2390L3295J1975l65M004N2468j84k1592k459m7938L7042K8725n4352m1498
8236c3269o0755l3456k1561j9590J4831p69j3749m4384P2471k6401k3191J07755
8224h2068N9496J09366q337K9102L0418J8163k918p9150M6080k0039o9888L8062
8212F8287K5615p7183P6904R3356k8331o1845q4953j68378m816M0680Q6149N4302
8200A9787j8874k5767n894k5143J4204l0603o304o9449M0371J50923J66396m3919
8188A65728p0525j15636o1574O0355l5198m1171k786L4257Q2863J30372K5036
8177A71721K5090k8680m8953j42550M5358N9205L778j7765m5519P2633Q8647m8577
8165A34388j06502l4071q765J9553J5010p3591k1464j36648p3201O8094M1238
$$ plain form
8249 -32390 905 12880 12515 16519 68987 68803 47211 44752 -3186 33856 62581 8229 -33269
8236 -33269 -94024 -127480 -149041 -168631 -153800 -154569 -168318 -212702 -140231 -166632 -189823 -82068
8224 -82068 -22572 86794 78457 107559 137977 156140 153222 74072 120152 100113 30225 68287
8212 68287 93902 16719 93623 186979 158648 96803 11850 -156528 -161344 -120664 -34515 19787
8200 19787 913 -24854 -30748 -55891 -41687 -72290 -78594 -148043 -107672 43251 209647 165728
8188 165728 95203 -20433 -82007 -21652 -56850 -98021 -100807 -66550 16313 146685 171721
8177 171721 196811 168131 119178 -23372 21986 81191 84969 67204 21685 94318 182965 134388
8165 134388 27886 -6185 -14950 4603 19613 -53978 -75442 -212090 -285291 -217197 -175959
8154a75959P1633P4571Q7325J6321j17622p387q901k0784j6442m2967J27394J9258
8142F440n1325M0508M6961o805J6449m8760n2138L2234N401L962q568J940N132
8129h569n3217l8858K5190N1395Q63o9567P9853Q4782k2565j6003j16203j09229
8117a92128J30066N8406l4355O2642J83538P13Q119p6657j62280O7655p498K1022
8105E9243n7153n4672j7315j7283j25250N5405k6270m9945m270K1964J4187J19940
8093h1419J2078L4140k3302N2028l1041m025R594m3535M3506O5955q142j3072
8081A2765j274j38909o925J04650J27139n6428j35456J18979Q1596o8403n7045
8070a9311j75700q5744J12754R8960P9838n9874N7524O3572j9660K1075J18221
$$ plain form
8154 -175959 -104326 -29755 57570 73891 -43731 -51118 -60019 -80803 -97245 -140212 -12818 6440
8142 6440 -44885 -4377 42584 35779 52228 3468 -48670 -16436 -11035 -7073 -15641 -13701 -8569
8129 -8569 -61786 -100644 -75454 -24059 -23196 -92763 -12910 71872 49307 33304 -82899 -192128
8117 -192128 -62062 -3656 -38011 24631 208169 208882 217001 140344 -21936 45719 38221 59243
8105 59243 2090 -52582 -69897 -87180 -212430 -157025 -183295 -233240 -237510 -215546 -201359 -81419
8093 -81419 -69341 -35201 -58503 -6475 -37516 -41541 -31947 -75482 -31976 33979 25837 12765
8081 12765 11491 -127418 -134343 -29693 97446 41018 -94438 24541 106137 37734 -19311
8070 -19311 -195011 -280755 -168001 -69041 10797 -49077 8447 72019 52359 73434 191655
8059A91655p9806k1177K1061n3771j37399o7821l9021O7318Q8674L5895P1518
8048G7126n4405K6475k9805j383N478K5345l4490r726j08290l9913l4266l2954
8036b10808q481L1941O3843M2439R9552N4917j374p6170M695J2589p1856o1614
8024a20327L690L8652j6368q660L9880j8821K0885q9375q509R837M7072J28698
8012B6654j2273p7503M3309L2528J7762n8638P9071J15218l4257o4950M0487K1354
8000A28762r8198l5592K2520n753K9749P6240K1933r236O472M0042O3919j8217
7988B22641l1568K3354N663L639K7845p8210j65774l790j3845P9410l1282j31012
7976i2929o7365P1453Q3941P542m9784Q5988J04025O8151k8848m6181P030l374
$$ plain form
8059 191655 111849 90672 111733 57962 -79437 -147258 -186279 -118961 -30287 5608 77126
8048 77126 22721 49196 19391 18008 23486 48831 14341 4615 -103675 -143588 -177854 -210808
8036 -210808 -219289 -187348 -123505 -81066 18486 73403 72029 -4141 554 13143 -58713 -120327
8024 -120327 -116637 -77985 -94353 -103013 -63133 -81954 -61069 -150444 -158953 -149116 -102044 26654
8012 26654 14381 -63122 -19813 12715 30477 -28161 50910 166128 131871 66921 107408 128762
8000 128762 30564 -5028 17492 11739 41488 117728 139661 130425 136897 176939 240858 222641
7988 222641 191073 214427 220090 223729 251574 173364 7590 3800 -10045 69365 38083 -92929
7976 -92929 -160294 -88841 -4900 2642 -47142 38846 142871 211022 182174 135993 143023 139649
7964A39649n5879k2601L510n778K5898j4259j55461J4716J05394p1033q1696p9706
7952a97246p6839j0323J47885Q2908k7683j12618k6208J51174M9915m5313j5628
7941g9976P4811r1741j53741m8169Q6846R9025J2976J17697J05224N267M7685
7930A75904r9711p4459p0604M7651N2943R1054o8995j14572j0849L3919R3370
7919E5651l1834m7273j985k4596P4576p273l0583m2462L0793j9562k8617j6411
7907h9576Q1518M0454j0883j7611O3062N928o4498O6601J7241q3554j41788l8359
7895a71465O3875L3657J35278J9172k0632P518N5146m436r8179k0441L4540k4509
7883I524n358k007j27170j01163L08M9853Q5021J23538Q8983K7153L8103Q283
$$ plain form
7964 139649 83770 61169 64679 58901 84799 70540 -84921 -70205 35189 -35844 -117540 -197246
7952 -197246 -274085 -284408 -136523 -53615 -81298 -193916 -220124 -68950 -19035 -64348 -79976
7941 -79976 -5165 -96906 -250647 -298816 -211970 -112945 -99969 17728 122952 128219 175904
7930 175904 76193 1734 -68870 -21219 31724 122778 53783 -60789 -71638 -37719 55651
7919 55651 23817 -23456 -25441 -50037 24539 17266 -13317 -55779 -24986 -44548 -73165 -89576
7907 -89576 -8058 32396 21513 3902 66964 72892 8394 74995 92236 8682 -133106 -171465
7895 -171465 -107590 -73933 61345 80517 59885 67403 122549 118113 19934 -507 34033 9524
7883 9524 4166 2159 -125011 -226174 -225866 -176013 -90992 32546 121529 148682 186785 195068
7871A95068l1287J5340r5966j6270K6365M4601K1162j32089j40321k2345J1469
7860a24273N0157Q9185l8542j9967Q9776k9899l0057p8761r1547O1465K8489L9593
7848e4381p5826l2395k6946J03836J57425n0308o270l1319O2869K2138l9914j72452
7836a43543l8608O1814j3191k691K2010O3442K3623k9008J16276J7258m9639l6228
7824h485K0918J6255n3328P4222r536o5356Q2011L2667K5627l137o6312o1930
7812a6384m051L3067J23985M8472o1401p4539l9429r456k5764r3594K1661J67107
7800F9674K7287J5525o8706j40769R9211J138J2946R679j30832M4361J18806N9235
7788A17555k7205p6644N5317N63K9183n9746k0603P4743j34550n9907N0686l3823
$$ plain form
7871 195068 163781 179121 83155 66885 93250 137851 159013 26924 -113397 -135742 -124273
7860 -124273 -74116 15069 -23473 -43440 46336 16437 -13620 -92381 -183928 -122463 -93974 -54381
7848 -54381 -130207 -162602 -189548 -85712 71713 21405 15135 -16184 46685 68823 28909 -143543
7836 -143543 -182151 -120337 -133528 -136219 -114209 -50767 -27144 -56152 60124 77382 27743 -8485
7824 -8485 12433 28688 -24640 49582 40046 -25310 56701 89368 114995 111858 45546 -16384
7812 -16384 -20435 12632 136617 185089 123688 49149 9720 264 -25500 -119094 -97433 69674
7800 69674 96961 112486 43780 -96989 2222 3360 16306 25985 -104847 -60486 58320 117555
7788 117555 90350 13706 69023 69586 98769 39023 18420 93163 -41387 -101294 -50608 -84431
7776h4431o928J49936K058n3703j3684k2067L494J9316k2831J6914O5125r6095
7764d2896n7280R5936O9458Q2079P4648r4228m2029m8160n6020p372R7968j08321
7752c6217j05740m2333K9604p610O245m006k930R8807L0067q4462J7368R7582
7740c625P2224K7337l7521q3M2186o5471p7947m1982P2631J54039n4870j6549
7728G0369K8416n6197p245n8860o7256m1205l4917k5788J3175J14504N8131k3741
7716c0614j9246J02028N3085k9987q0106Q572J08687n360q474N6499K9015n3029
7704A31070j91570q7468J8743l3964j8337K8434l9269N8160P8083l7552p3610
7693a67280R1613R5015Q6972N8507Q163m1696l9638p3203j33172q9356J76782
$$ plain form
7776 -84431 -91359 58577 60635 6932 -6752 -28819 -25325 -6009 -28840 -11926 53199 -42896
7764 -42896 -100176 -4240 65218 147297 221945 127717 85688 37528 -18492 -25864 72104 -36217
7752 -36217 -141957 -184290 -154686 -162296 -156051 -160057 -162987 -64180 -34113 -118575 -101207 -3625
7740 -3625 68599 95936 58415 58332 100518 35047 -42900 -84882 -12251 141788 86918 70369
7728 70369 98785 42588 35343 -23517 -90773 -131978 -166895 -192683 -179508 -65004 -6873 -30614
7716 -30614 -49860 52168 105253 75266 -4840 3732 112419 107059 98585 155084 184099 131070
7704 131070 -60500 -147968 -129225 -163189 -181526 -153092 -192361 -134201 -56118 -93670 -167280
7693 -167280 -75667 19348 106320 164827 172990 131294 91656 18453 -114719 -204075 -27293
7682b7293J30241o1599j30003K8580J16625R0939k5187m2700K9223L7027P0079
7671B15932J3565q2603k5797K1109k8714p0213N085j17724Q4596R7543n1766q2114
7659b1101o9559K0044j6553M4357J10513J5563R051o5079p0504q5730o8278J1473
7647a85803Q8350J15742q5699o9898O156J05155K1449p345q2847J8458J28959
7636E2677J2548j3040L2760o9436K9661j8231l1635l485m9673N9507J01414m3448
7624E9619q1188p5596Q0772n5837M1350J38n382J6805o2679l267k1336l5327j3498
7611a55426Q0724R5528p8111n4472L5993o7228J9383Q8675k4987r3577k4469M0498
7599a37469J17379K3940k5514K0632j340l0577J1532m8091N0983l1161Q215Q8761
$$ plain form
7682 -27293 102948 41349 -88654 -60074 56551 147490 122303 79603 108826 145853 215932
7671 215932 229497 146894 121097 142206 113492 43279 48364 -69360 15236 112779 61013 -21101
7659 -21101 -90660 -70616 -87169 -42812 67701 83264 92315 27236 -43268 -128998 -197276 -185803
7647 -185803 -97453 18289 -67410 -137308 -131152 -25997 -4548 -11893 -94740 -76282 52677
7636 52677 65225 52185 84945 15509 45170 26939 -4696 -8181 -57854 1653 103067 59619
7624 59619 -21569 -97165 -16393 -72230 -30880 -30742 -36124 -19319 -81998 -85265 -106601 -141928 -155426
7611 -155426 -74702 20826 -57285 -111757 -75764 -142992 -123609 -34934 -59921 -153498 -177967 -137469
7599 -137469 -20090 3850 -21664 -1032 -2372 -32949 -21417 -69508 -18525 -49686 -41471 47290
7587D7290O2548n7978p8383j5665l8847N0281N1879N4499J34030o9932N423m318
7575A40827m0337r1909q1021o7261L5116n73j5712m1258K326J46426Q1531k1345
7563D6810m1748K5645L4300j37534M0117K6073o1032r7409q610k5008J4714J76368
7551g314L4200n9659J4976J61283J25503J41952r0122j54649p3548K5958j411
7540A17169p5290p014n3202l066Q0191Q1763J7914K6852n2626M2416K6470n2804
7528A48773L6920k8405M3095N7069k3025j29097j08821l953q7283p2493P0239
7517i6981P1834j9444q0149p196R5926O8252o8468m7791k3674r2361K3259J09065
7505f7728L7185M0144N4562P8078r4084n8640p6522J8875k1007l7951N4663M8840
$$ plain form
7587 47290 109838 51860 -26523 -42188 -81035 -30754 21125 75624 209654 139722 145145 140827
7575 140827 100490 8581 -72440 -139701 -104585 -105158 -120870 -162128 -159802 -13376 68155 46810
7563 46810 5062 30707 65007 -72527 -32410 -6337 -67369 -164778 -173388 -198396 -183682 -7314
7551 -7314 26886 -32773 -17797 143486 268989 410941 320819 166170 92622 118580 117169
7540 117169 41879 34865 -18337 -21403 58788 140551 158465 185317 132691 175107 201577 148773
7528 148773 185693 157288 200383 257452 234427 105330 -3491 -7444 -94727 -167220 -96981
7517 -96981 -25147 -44591 -124740 -131936 -36010 32242 -36226 -84017 -107691 -200052 -176793 -67728
7505 -67728 -30543 9601 64163 142241 48157 -10483 -87005 -68130 -89137 -127088 -72425 -23585
7493b3585p0429N1519N355M1637L7960n3263j4260r8608j7344O8629L9673O7740
7481C5024L9228l2356j4440k340j01598M2188j4103P08J6121K8674J0682n6565
7469d8777J1063J2247k1936K9626J8718p154M2261j6124n0607O2635K0975l7502
7457A5425K8509K8264J7684Q9577k6241o7475k0098j9680L9055L1184o6512r3906
7445d4214K9051M1407N6522J3357n8029k1987n6519p4420N470P9978n5471m9999
7433a34854l0009K5911L7784M1016q688M1031J13265n506k7092j03356N8173K4245
7421C1920P5367n7866n0627J6898R1077n7823m0509n963L3815j02840o9622O9669
7409f6504M3670J4343Q73M0213K1894j6938N0038J8221L2014K209k4972p0264
$$ plain form
7493 -23585 -94014 -42495 -37140 4497 42457 -10806 -25066 -123674 -141018 -72389 -32716 35024
7481 35024 74252 41896 27456 25116 -76482 -34294 -48397 -47689 -31568 -2894 7788 -48777
7469 -48777 -37714 -25467 -47403 -17777 941 -6213 36048 19924 -30683 31952 52927 15425
7457 15425 43934 72198 89882 179459 153218 85743 65645 45965 85020 116204 49692 -44214
7445 -44214 -15163 26244 82766 96123 38094 16107 -40412 -114832 -109362 -29384 -84855 -134854
7433 -134854 -164863 -138952 -101168 -60152 -68840 -27809 85456 79950 52858 -50498 7675 31920
7421 31920 107287 49421 -1206 15692 106769 48946 8437 2474 36289 -66551 -136173 -66504
7409 -66504 -22834 -8491 -7618 32595 54489 37551 87589 105810 137824 140033 115061 44797
7397D4797k5895m3334M923M8677j6138K684l4486j9820J1007L9198p6012j9126
7385h3525l9550M8951L4321K3795j0118j39122J15259J47233j5981r4881M1929
7374B8311j6197m2043M6443Q445J3942n120N9177R8852q4685m1727l5005n7727
7362b7334k4382J1024J924n8411k2231p2940L6670O0272O9979P3568N005k9512
7350B3632J6147O9952J1871j10504j29043J5090n2450q0476Q0968Q5022l8355
7339a08146n148L2344R7337O6620l5455n4421k4542N8662m8609o1837L1735P0637
7327A9177L9191j2765Q196j05885k0683P0729M970K0796K7464o3238j02017m2891
7315a56956L8812L5260N1833J5533Q9685m9872n1039k9181J31370P7204j00788
$$ plain form
7397 44797 18902 -24432 -19509 29168 13030 15714 -18772 -38592 -27585 11613 -64399 -83525
7385 -83525 -123075 -74124 -39803 -16008 -26126 -165248 -49989 97244 81263 -13618 28311
7374 28311 12114 -29929 16514 24959 38901 33781 92958 191810 107125 65398 30393 -27334
7362 -27334 -51716 -40692 -38768 -97179 -119410 -192350 -155680 -95408 -25429 48139 53144 23632
7350 23632 39779 109731 121602 11098 -117945 -102855 -155305 -235781 -154813 -69791 -108146
7339 -108146 -113294 -80950 16387 83007 47552 -6869 -31411 27251 -21358 -83195 -51460 19177
7327 19177 58368 45603 53799 -52086 -72769 -2040 2930 23726 51190 -12048 -114065 -156956
7315 -156956 -118144 -82884 -31051 -15518 74167 24295 -26744 -55925 75445 152649 51861
7304E1861p0363o2715l1006p439R010K6303J04337Q01P3829L104n1562l3449p9893
7291f7182Q2607M9626n369O8052M0142j34696p5949j4673p2758J30625R7282R3696
7279A91403p6258j14393P972o8337j1352O6888j8548L2559M3033n0410r3095L3080
7267e7458L9099J8330L5335M9179K0520j135n7023l5581k5502n521k5430J9709
7255b5478l8001O4304J2165O616J1449m6008r9658k6974O750p7327P5610l5348
7243a71900O5211L7578j2643j8331M3313J07198q0815k6584J5376M0572Q0063
7232G9038o4180l355r894p2263Q3085K0277o7724l5039j39874L5225R8047K3803
7220e2854L093l8827l930O3544r7636m9958k940J09184q456k2802m5961j38182
$$ plain form
7304 51861 -18502 -81217 -112223 -119662 -110652 -84349 19988 20789 94618 97722 46160 12711 -67182
7291 -67182 15425 65051 59682 127734 167876 33180 -42769 -57442 -130200 425 97707 191403
7279 191403 115145 752 8724 -59613 -70965 -4077 -22625 9934 52967 2557 -90538 -57458
7267 -57458 -18359 -29 35306 84485 105005 103870 46847 11266 -14236 -19757 -45187 -25478
7255 -25478 -63479 825 12990 19606 31055 -14953 -114611 -141585 -134835 -212162 -136552 -171900
7243 -171900 -106689 -69111 -81754 -100085 -56772 50426 -30389 -56973 -41597 -1025 79038
7232 79038 14858 11503 1609 -70654 12431 32708 -35016 -70055 -209929 -174704 -76657 -52854
7220 -52854 -49761 -88588 -92518 -28974 -126610 -176568 -179508 -70324 -78780 -101582 -147543 -285725
7208b85725J1475N5660O9113O9062R1123J560L7642N75l2475N8560m0794o7925
7196c2149l8672j4880M8482J5563l9153J1835m1396r200J2737j9175j0308k5375
7184a41691J4208k7434k7852K1099K386n4177l0510N1897O2252r622q3051J15102
7172a07393Q8475J00908Q789M7431n5067j12737R1612j3293p7263O5198o487J4985
7160D5158q1264j17818J6053Q7942O9217L5179R7772M9365j31620j01596m656
7149c6268N7966k2023J7826K3372N8922J5617j54040o7382Q8114P4790K080o1415
7137b441m1649m8861O0863O4023o8995J529K4681l932O423O166m4929n0093O579
7124i0636L9669p1361l5804R5831J3266L2160N7475n776m0845P8997k4886M847
$$ plain form
7208 -285725 -274250 -218590 -149477 -80415 10708 12268 49910 50485 18010 76570 35776 -32149
7196 -32149 -70821 -85701 -37219 -21656 -60809 -48974 -90370 -99570 -86833 -106008 -116316 -141691
7184 -141691 -127483 -154917 -182769 -161670 -159284 -213461 -243971 -192074 -129822 -139444 -222495 -107393
7172 -107393 -18918 81990 90779 138210 83143 -29594 62018 48725 -28538 36660 30173 45158
7160 45158 -36106 -153924 -137871 -49929 19288 54467 152239 201604 69984 -31612 -36268
7149 -36268 21698 -325 17501 40873 99795 115412 -38628 -106010 -17896 56894 58974 -2441
7137 -2441 -44090 -92951 -32088 31935 -37060 -35531 -10850 -14782 -8359 -2193 -47122 -97215 -90636
7124 -90636 -50967 -122328 -158132 -62301 -49035 -16875 40600 34824 -6021 72976 48090 52937
7112E2937l9889p9027n0020j8473k0921m4721L2826J5526K4104J27519o9731O5699
7100d171m4369j11726M0385N7255K0341j1161L719k5292K0969J3458K0191j5880
7088c6281j13888k3824K5411J16217J61652K5755j6765j874j32103P230j21675
7077a10145l7311N0104L5794O7862O2080j6681m3695K2164m2338o7593K9168J4355
7065c6236j11460j05416J7457O7515J03911J12340l1898j1510l9263p0246p9378
7054a84184l2600K23597J44115j3748m3240j14632j24991N6599J05468K7988o7588
7043b3216J1963n1183q4078M1263P5317J4868N553L2633N5110L4089P8366K2715
7031B13400j31659p6901k6916n7563l8538J37478k5420J3293N4043j5571N2350
$$ plain form
7112 52937 13048 -65979 -115999 -134472 -155393 -200114 -167288 -151762 -127658 -139 -69870 -4171
7100 -4171 -48540 -160266 -119881 -62626 -42285 -53446 -49727 -75019 -54050 -40592 -20401 -36281
7088 -36281 -150169 -173993 -148582 -32365 129287 155042 138277 136403 4300 11530 -110145
7077 -110145 -147456 -97352 -61558 6304 68384 51703 8008 30172 -12166 -79759 -50591 -36236
7065 -36236 -147696 -253112 -235655 -168140 -64229 48111 16213 4703 -34560 -104806 -184184
7054 -184184 -216784 6813 150928 137180 93940 -20692 -145683 -89084 16384 44372 -23216
7043 -23216 -11253 -62436 -146514 -105251 -29934 -15066 -9513 23120 78230 112319 190685 213400
7031 213400 81741 4840 -22076 -79639 -118177 19301 -6119 7174 61217 45646 97996
7020I7996o3765q3129J5522l1261J9717L4657M6392N0649J3365P172q5110j15568
7008i3363o2740J19077o2615p2628k7143J2841O009N6292M092K1742R9553J2615
6996A3732N513m6535m2923M4245J122m2974L2573M2491L1095M5393J0881j38085
6984d3472q5414k9412L1156N8416Q386j5754p764N2223o8698K4472l7988L4606
6972g9243M6235K1154j16961M9683R8068M7422o5843j21776l448J6740Q5518l4666
6960e7117r149K9002M7888q2391M4574Q648J8949l476N3112j4725k8821l7734
6948c1240J332K9781O5076J2653o8590j48285o0223K3202K02010Q5356k1887j24300
6936c5115p876p0245m3743O5894J18054L6177m9678p7434K086q4990o2934Q066
$$ plain form
7020 97996 34231 -48898 -33376 -64637 -44920 -10263 36129 86778 100143 107315 22205 -93363
7008 -93363 -156103 -37026 -99641 -172269 -199412 -186571 -180562 -124270 -120178 -98436 1117 13732
6996 13732 19245 -27290 -70213 -25968 -24846 -67820 -35247 7244 38339 83732 94613 -43472
6984 -43472 -128886 -158298 -127142 -68726 -60340 -76094 -83858 -31635 -100333 -75861 -113849 -79243
6972 -79243 -33008 -11854 -128815 -79132 18936 66358 515 -121261 -124709 -107969 -22451 -57117
6960 -57117 -66266 -37264 10624 -71767 -27193 -18545 404 -3072 50040 35315 6494 -31240
6948 -31240 -29908 -127 64949 77602 9012 -139273 -199496 -176294 25716 111072 89185 -35115
6936 -35115 -42991 -113236 -156979 -91085 26969 63146 13468 -63966 -61880 -146870 -209804 -201738
6924b01738J41047k8710l5647J31247J6308J11068N1201o4614K8092Q5039n1574
6913A81719j24041l9347J963Q5569N0186n3284l914O4570j0284j01953k5325L3215
6901E9074l4928q2603j21913l2456K8305M1110Q0033l2870N712Q9564P5943L9037
6889A14008Q688k2060J2648k1305O2807M2558k2993J3873J5314q5884j17922r1633
6877i1901K1516j1420O1488J0760K7260q357R6244j3407J4195Q1326r172j1212
6865A67320J22756k1011j9422l4160j77642j03380Q8597J12017m9284J8370m2053
6854F2108k2973j5424J9786o1002J4345J2485M2596M8782M89j03338j08948P5398
6842c5696J15593O814k9097l7699m1687J9202o6751K624L2423K0231n9810l5693
$$ plain form
6924 -201738 -60691 -89401 -125048 6199 22507 133575 184776 120162 148254 233293 181719
6913 181719 57678 18331 20294 105863 156049 102765 98851 163421 153137 51184 25859 59074
6901 59074 24146 -58457 -180370 -212826 -184521 -143411 -63378 -96248 -90536 -972 74971 114008
6889 114008 122696 100636 113284 91979 154786 197344 174351 188224 203538 117654 -268 -91901
6877 -91901 -70385 -81805 -20317 -9557 17703 9346 105590 92183 106378 187704 178532 167320
6865 167320 290076 269065 249643 215483 37841 -65539 23058 135075 85791 104161 62108
6854 62108 39135 23711 43497 -17505 -3160 9325 51921 100703 101192 -2146 -111094 -35696
6842 -35696 79897 86711 57614 19915 -21772 -2570 -69321 -66697 -34274 -14043 -73853 -109546
6830a09546L8130N5367K012k8390R279K0041q4236j8746L7261L2036j8462M4228
6818b1026N6316N0506q1848J14278J46744m3619j90102J1655q804k1488j5976
6807c364j2291l9023J09623n0795p0413k1874K792N9187k2098l5829N8924J08336
6795H3175L1656p7147r0939j1993n8051j6231R3514L5990p5410q8646j7181P1035
6783a20228J08395O3761n2612j1209k3726j53j0180j2131j5161K6462J07875J54428
6771B15521j77546j20765K3025j2838O6784O7666J1657j21372j6421l031p1944
6760a39264O2767P3747O2640M1150j36478o6217j4938Q9451J05340J7176k2681
6749G2693O5682K4010p5628r6016P5937M9825j4663j283p7384O9054O1176L1416
$$ plain form
6830 -109546 -71416 -16049 -14037 -42427 -33148 -13107 -97343 -116089 -78828 -46792 -65254 -21026
6818 -21026 35290 85796 3948 118226 264970 221351 31249 42904 34100 12612 -3364
6807 -3364 -15655 -54678 54945 4150 -66263 -88137 -85345 -26158 -48256 -84085 -25161 83175
6795 83175 114831 37684 -53255 -65248 -123299 -139530 -46016 -10026 -85436 -174082 -191263 -120228
6783 -120228 -11833 51928 -684 -11893 -35619 -35772 -45952 -58083 -73244 -46782 61093 215521
6771 215521 37975 -82790 -59765 -72603 -5819 61847 73504 -47868 -64289 -67320 -139264
6760 -139264 -76497 -2750 59890 101040 -35438 -101655 -116593 -27142 78198 95374 72693
6749 72693 138375 162385 86757 -9259 66678 116503 101840 100557 23173 92227 153403 184819
6737A84819p6493j49738j8387P6135N6814q4760J9741J00965j7771p160n3394
6726C0771K5826M6373p6112l2229l4183l5681p2116K7530J6110j4069L5177j9295
6714a01898k4688J4957N0804n2448j3389M3862m6452l8628J5605K4986n9354O5989
6702a20654J09404O1673L3170K7003j0615l5320r24j5452N38p1904Q5470k6427
6690C5962K2522j3379K945R4315L2547o4467j15956l2580l2610Q6556J9456m8116
6678a2805Q700J4024j7982L3728q3634k26m5611r8483l2621J04128J22573M8793
6666D0584l0738M1602Q4017n5228l1918L8981j05721M9104K3359j4O3294j57707
6654d0385K1248O9001Q3970K521K1836J0960n5318k5647j28431o1673q0580M3028
$$ plain form
6737 184819 108326 -41412 -59799 16336 73150 -11610 8131 109096 91325 84165 30771
6726 30771 56597 102970 26858 -5371 -39554 -75235 -147351 -119821 -103711 -117780 -82603 -101898
6714 -101898 -126586 -111629 -60825 -113273 -126662 -82800 -129252 -167880 -152275 -127289 -186643 -120654
6702 -120654 -11250 50423 83593 110596 99981 64661 63737 48285 48823 -23081 62389 35962
6690 35962 58484 45105 48050 142365 174912 110445 -5511 -38091 -70701 15855 35311 -12805
6678 -12805 -4105 9919 -8063 25665 -57969 -58195 -103806 -202289 -234910 -130782 -8209 40584
6666 40584 9846 51448 135465 80237 48319 87300 -18421 30683 54042 54028 117322 -40385
6654 -40385 -19137 49864 133834 136355 158191 169151 113833 88186 -40245 -101918 -182498 -139470
6642a39470L3322K6449K7120j0030K718j3082Q106k7523l2363r5094p6436r984
6630c06267P6818J15403L5300M1750R1537r8899l7683P3256N4781n3864o8609
6619g6477k7340l1109M6774J3426k7894J702R9812M2767p0632l4912n2057l6573
6607a52513Q5838j7904m9693O8634r1693l3527j7153J32148j5951q0519q6864
6596b59197N3080K4529J2402L746O0117O5830J29438Q5138P7871j6080m3975n0541
6584A42358l6504n6388N3705j19302j58304J21975J33636j1751j0756J6382J8649
6573I3700k8879p8394M9708J00999M6245n0157k1042n5710K5005L0069q2245m9087
6561a9788j5643J4513Q6959n7821M1315k818l924n8073p2374k7305J9385Q1226
$$ plain form
6642 -139470 -106148 -79699 -52579 -62609 -59891 -72973 -64867 -92390 -124753 -219847 -296283 -306267
6630 -306267 -229449 -114046 -78746 -36996 54541 -44358 -82041 -8785 45996 -7868 -76477
6619 -76477 -103817 -134926 -88152 -74726 -102620 -100918 -1106 41661 -28971 -63883 -115940 -152513
6607 -152513 -66675 -84579 -134272 -65638 -157331 -190858 -208011 -75863 -91814 -172333 -259197
6596 -259197 -206117 -181588 -169186 -165440 -105323 -39493 89945 175083 252954 236874 192899 142358
6584 142358 105854 49466 103171 -16131 -174435 -52460 81176 69425 58669 75051 93700
6573 93700 64821 -13573 36135 137134 183379 133222 112180 56470 81475 111544 29299 -19788
6561 -19788 -35431 -20918 66041 8220 49535 46717 42793 -15280 -87654 -114959 -95574 -14348
$$ [...]
##END NTUPLES=NMR SPECTRUM
##END=
