##TITLE=Analysis number 313888
Compound Code sb 01719
Project Code adrs
Chemist Name kinbester
##JCAMPDX= 6.0         $$ Bruker NMR JCAMP-DX V2.0
##DATA TYPE= NMR SPECTRUM
##DATA CLASS= NTUPLES
##ORIGIN= Bruker BioSpin GmbH
##OWNER= NMR
$$ XWIN-NMR		Version 3.5
$$ Tue Sep 27 09:04:58 2005 GMT Daylight Time (UT+1h)  MAYBRIDGE\NMR@NMR_250MHZ
##.OBSERVE FREQUENCY= 250.131544655141
##.OBSERVE NUCLEUS= ^1H
##.ACQUISITION MODE= SIMULTANEOUS (DQD)
##.ACQUISITION SCHEME= undefined
##.AVERAGES= 16
##.DIGITISER RES= 18
##SPECTROMETER/DATA SYSTEM= dpx250
##.PULSE SEQUENCE= zg30
##.SOLVENT NAME= CDCl3
##.SHIFT REFERENCE= (INTERNAL, CDCl3, 0, 16.522)
##AUDIT TRAIL= $$ (NUMBER, WHEN, WHO, WHERE, WHAT)
$$ ##TITLE= Audit trail, XWIN-NMR		Version 3.5
$$ ##JCAMPDX= 5.01
$$ ##ORIGIN= Bruker BioSpin GmbH
$$ ##OWNER= NMR
$$ C:\u/data/dgb/nmr/ADRS/9990/pdata/1/auditp.txt
$$ ##AUDIT TRAIL=  $$ (NUMBER, WHEN, WHO, WHERE, WHAT)
(   1,<2005-09-27 09:04:36.55 +100>,<MAYBRIDGE\NMR>,<NMR_250MHZ>,
      <created by zg, POWCHK disabled, PULCHK disabled
       configuration hash MD5:
       62 19 C7 07 E1 42 D1 B7 37 6C 3D D0 77 39 F9 E6
       data hash MD5: 64K
       FA 5F 81 36 06 3E 51 A3 24 D7 02 87 BA 84 F2 98>)
(   2,<2005-09-27 09:04:48.63 +100>,<MAYBRIDGE\NMR>,<NMR_250MHZ>,
      <Start of raw data processing
       ef LB = 0.3 FT_mod = 6 PKNL = 1 SI = 32K 
       data hash MD5: 32K
       4A 1F 33 D6 45 E2 C6 3E F8 1C D0 43 91 A7 B0 E4>)
(   3,<2005-09-27 09:04:50.72 +100>,<MAYBRIDGE\NMR>,<NMR_250MHZ>,
      <apk 
       data hash MD5: 32K
       B8 CD 0A C5 8E B0 B3 26 FC 66 66 AD 56 6C 52 22>)
(   4,<2005-09-27 09:04:51.42 +100>,<MAYBRIDGE\NMR>,<NMR_250MHZ>,
      <abs ABSG = 5 
       data hash MD5: 32K
       78 E2 BA 77 30 5D 4B B0 1D 8A 14 66 00 D1 46 D0>)
$$ ##END=
$$ 
$$ hash MD5
$$ 4F C5 51 0F 6C 6B 5B BC A0 19 83 EB C6 56 94 57
##$RELAX= 
##$RELAX= 
##$RELAX= 
##$RELAX= 
##$RELAX= 
##$RELAX= 
##$RELAX= 
$$ Bruker specific parameters
$$ --------------------------
##$DU= <C:\u>
##$EXPNO= 9990
##$NAME= <ADRS>
##$PROCNO= 1
##$TYPE= <nmr>
##$USER= <dgb>
##$AMP= (0..31)
100 100 100 100 100 100 100 100 100 100 100 100 100 100 100 100 100 100 
100 100 100 100 100 100 100 100 100 100 100 100 100 100 
##$AQSEQ= 0
##$AQ_mod= 3
##$AUNM= <au_zg>
##$AUTOPOS= <3 >
##$BF1= 250.13
##$BF2= 250.13
##$BF3= 250.13
##$BF4= 250.13
##$BF5= 500.13
##$BF6= 500.13
##$BF7= 500.13
##$BF8= 500.13
##$BYTORDA= 1
##$CFDGTYP= 0
##$CFRGTYP= 5
##$CHEMSTR= <none>
##$CNST= (0..31)
1 1 145 1 1 1 1 1 1 1 1 1 1 1 1 1 1 1 1 1 1 1 1 1 1 1 1 1 1 1 1 1 
##$CPDPRG= <>
##$CPDPRG1= <>
##$CPDPRG2= <>
##$CPDPRG3= <>
##$CPDPRG4= <mlev>
##$CPDPRG5= <mlev>
##$CPDPRG6= <mlev>
##$CPDPRG7= <mlev>
##$CPDPRG8= <mlev>
##$CPDPRGB= <>
##$CPDPRGT= <>
##$D= (0..31)
0 1 0 0 0 0 0 0 0 0.06 0 0 0 0 0 0 0.0002 0 0 0 0 0 0 0 0 0 0 0 0 0 0 
0 
##$DATE= 1127808275
##$DBL= (0..7)
120 120 120 120 120 120 120 120 
##$DBP= (0..7)
150 150 150 150 150 150 150 150 
##$DBP07= 0
##$DBPNAM0= <>
##$DBPNAM1= <>
##$DBPNAM2= <>
$$ [...]
##$SUBNAM7= <"">
##$SUBNAM8= <"">
##$SUBNAM9= <"">
##$SW= 20.6930455092707
##$SWIBOX= (0..15)
0 0 3 0 0 0 0 0 0 0 0 0 0 0 0 0 
##$SW_h= 5175.983436853
##$TD= 65536
##$TD0= 1
##$TE= 294.16
##$TE2= 300
##$TE3= 300
##$TEG= 300
##$TL= (0..7)
0 120 120 120 120 120 120 120 
##$TP= (0..7)
150 150 150 150 150 150 150 150 
##$TP07= 0
##$TPNAME0= <>
##$TPNAME1= <>
##$TPNAME2= <>
##$TPNAME3= <>
##$TPNAME4= <>
##$TPNAME5= <>
##$TPNAME6= <>
##$TPNAME7= <>
##$TPOAL= (0..7)
0.5 0.5 0.5 0.5 0.5 0.5 0.5 0.5 
##$TPOFFS= (0..7)
0 0 0 0 0 0 0 0 
##$TUNHIN= 0
##$TUNHOUT= 0
##$TUNXOUT= 0
##$USERA1= <user>
##$USERA2= <user>
##$USERA3= <user>
##$USERA4= <user>
##$USERA5= <user>
##$V9= 5
##$VALIST= <valist>
##$VCLIST= <CCCCCCCCCCCCCCC>
##$VD= 0
##$VDLIST= <DDDDDDDDDDDDDDD>
##$VPLIST= <PPPPPPPPPPPPPPP>
##$VTLIST= <TTTTTTTTTTTTTTT>
##$WBST= 1024
##$WBSW= 4
##$XGAIN= (0..3)
0 0 0 0 
##$XL= 0
##$YL= 0
##$YMAX_a= 582083
##$YMIN_a= -591430
##$ZGOPTNS= <>
##$ZL1= 120
##$ZL2= 120
##$ZL3= 120
##$ZL4= 120
##$ABSF1= 16.522
##$ABSF2= -4.171173
##$ABSG= 5
##$ABSL= 3
##$ALPHA= 0
##$AQORDER= 0
##$ASSFAC= 0
##$ASSFACI= 0
##$ASSFACX= 0
##$ASSWID= 0
##$AUNMP= <proc_1d>
##$AZFE= 0.1
##$AZFW= 0.1
##$BCFW= 0
##$BC_mod= 0
##$BYTORDP= 0
##$COROFFS= 0
##$CY= 12.5
##$DATMOD= 1
##$DC= 0
##$DFILT= <>
##$DTYPP= 0
##$F1P= 14.0000005364418
##$F2P= -0.99999901652339
##$FCOR= 0.5
##$FTSIZE= 32768
##$FT_mod= 6
##$GAMMA= 0
##$GB= 0
##$INTBC= 1
##$INTSCL= 1
##$ISEN= 128
##$LB= 0.3
##$LEV0= 0
##$LPBIN= 0
##$MAXI= 10000
##$MC2= 0
##$MEAN= 0
##$ME_mod= 0
##$MI= 0
##$NCOEF= 0
##$NC_proc= -4
##$NLEV= 6
##$NOISF1= 0
##$NOISF2= 0
##$NSP= 0
##$NTH_PI= 0
##$NZP= 0
##$OFFSET= 16.522
##$PC= 1
##$PHC0= -71.81367
##$PHC1= -8.152998
##$PH_mod= 1
##$PKNL= yes
##$PPARMOD= 0
##$PSCAL= 4
##$PSIGN= 0
##$REVERSE= no
##$SF= 250.13
##$SI= 32768
##$SIGF1= 0
##$SIGF2= 0
##$SINO= 400
##$SIOLD= 32768
##$SREGLST= <1H.CDCl3>
##$SSB= 0
##$STSI= 32768
##$STSR= 0
##$SW_p= 5175.98343685301
##$SYMM= 0
##$S_DEV= 0
##$TDeff= 65536
##$TDoff= 0
##$TI= <Analysis number 999999
Compound Code 99
Book Reference 9
Project Code 9>
##$TILT= no
##$TM1= 0
##$TM2= 0
##$TOPLEV= 0
##$USERP1= <user>
##$USERP2= <user>
##$USERP3= <user>
##$USERP4= <user>
##$USERP5= <user>
##$WDW= 1
##$XDIM= 32768
##$YMAX_p= 397839106
##$YMIN_p= -211153
$$ End of Bruker specific parameters
$$ ---------------------------------
##NTUPLES= NMR SPECTRUM
##VAR_NAME=  FREQUENCY,     SPECTRUM/REAL,   SPECTRUM/IMAG
##SYMBOL=    X,             R,               I
##VAR_TYPE=  INDEPENDENT,   DEPENDENT,       DEPENDENT
##VAR_FORM=  AFFN,          ASDF,            ASDF
##VAR_DIM=   32768,         32768,           32768
##UNITS=     HZ,            ARBITRARY UNITS, ARBITRARY UNITS
##FACTOR=    0.157963299565203, 1,           1
##FIRST=     4132.6476996994, 0,             0
##LAST=      -1043.33573715361, 0,           0
##MIN=       -1043.33573715361, -211153,     0
##MAX=       4132.6476996994, 397839106,     0
$$ Real data points
##PAGE= N=1
##DATA TABLE= (X++(R..R)), XYDATA
$$ [...]
28220 -16590 -16392 -22043 -37418 -29057 -8882 -6642 -31460 -23987 -7463 -8069 827 -13715 -37513
28207 -37513 -41372 -23747 -17941 -8190 -167 -3656 14012 11332 -2821 27240 53497 53287 54707
28194 54707 43044 2399 -31777 -56440 -65511 -61961 -35151 -16038 -24383 -21918 -22746 -28009 -6563
28181 -6563 3520 2172 8368 16681 6699 8722 26459 19789 388 -18015 -14373 700 30584
28168 30584 29921 29810 18485 15963 15618 -12217 -29866 -32406 -21539 -15273 -10490 -19531 -18527 -29558
28154 -29558 -19722 -12929 2805 -15035 -15948 -16927 -7813 11988 26595 13773 19857 20515 27128 5531
28140 5531 3551 -155 16384 48641 28777 10337 -2349 -8589 -28514 -48670 -34813 -11267
28128 -11267 -9618 -11594 -21539 -14032 15211 34332 16028 5680 39643 35483 14550 -16128 -23043
28115 -23043 26268 30090 22653 -20893 -31869 20678 20399 14211 37149 24490 -18115 -24358 8490
28102 8490 23690 22356 43109 45441 18589 -8930 -22819 -5137 -8294 -17221 8731 -7230 7098
28089 7098 30283 29397 8960 6900 25053 24947 -6843 -45192 -42518 -59859 -54210 -16052 18799
28076 18799 31203 28639 18384 10828 7668 2655 -10793 -771 14667 8820 22606 27240 17976
28063 17976 19186 6735 33934 28578 23288 39238 20946 14591 29306 30148 -8931 -34434 -9598
28050 -9598 -2275 6781 26109 34960 23355 -4577 -10790 4595 15920 25187 28603 -1361 -21619
28037 -21619 1196 2768 9336 22987 4785 3169 11728 -12730 -50956 -63146 -71396 -28465 27576
28024 27576 29108 -4595 -3576 21715 6991 -26660 -27288 -30890 -18375 -20889 -16336 10462 6129
28011 6129 -10064 -12624 -14073 -13509 -8988 6185 -1613 2222 2845 9512 17452 45312 21482 35956
27997 35956 33255 20411 -10850 -45590 -55029 -31587 -38033 -50616 -36460 -27342 -42432 -31015
27985 -31015 -11599 -1313 10484 24556 28622 7369 -6567 20688 29748 16525 6261 -17260
27973 -17260 -12970 -1315 32463 42594 39399 56811 50630 28217 24369 -8852 -25983 -22799 -31123
27960 -31123 -33635 -28634 -23915 -26346 6595 32665 319 6902 19454 5631 -5638 -11387 9654
27947 9654 12341 17371 367 -4548 21875 15095 -20829 -31909 -42763 -64984 -75356 -28965 -8673
27934 -8673 14385 23317 30518 20489 18691 20556 20703 22172 7531 4816 7077 22997 48345 44353
27920 44353 15133 -10539 -41861 -23978 234 -12348 -10409 40596 67337 49601 28381 22742
27908 22742 20445 18885 31370 18619 29032 -4176 -29846 -35071 -26458 2357 12044 9402 9341
27895 9341 20177 25119 9319 19091 40232 32118 16258 2827 22770 46678 31246 -3546
27883 -3546 -9278 -18717 -21675 9227 4007 -3959 15742 -7440 -26408 -10022 -20158 -1563 35676
27870 35676 29831 15856 -1636 -10345 -8161 17030 18578 -9099 -13731 -11075 14813 31043 -10492
27857 -10492 -9772 -6718 -5341 -7130 -7401 15452 -22146 -15911 4188 -8656 -31382 -23745 -13719
27844 -13719 10059 -777 -32777 -20783 -24195 -22495 -9094 -13330 6798 14866 5853 17166 20131
27831 20131 10229 -5350 2281 26864 27190 30189 20103 9884 6123 10465 21105 11020 14952
27818 14952 26735 48639 45488 41794 39138 24460 9167 15000 3620 -8259 1851 14003
27806 14003 31973 12638 -5797 1475 -1144 5501 26027 34166 43990 25748 5595 10770 15406
27793 15406 -19536 -12975 3064 15076 42974 17418 36043 39516 23358 15008 7001 15633 1172
27780 1172 5247 6246 -10295 -23698 -13214 -12105 -23911 -14217 5089 5949 6054 26379 31594 51315
27766 51315 48309 36939 34636 37838 11816 6765 16494 27283 32229 5364 -20731 -14764 -42473
27753 -42473 -37178 -36276 -24665 6773 36286 17169 -2698 -11582 17215 53397 58989 30487 -9383
27740 -9383 -31349 -29210 -18755 -13578 -1182 24178 53977 61275 53300 25368 13912 -7082 -29117
27727 -29117 -26891 -12212 -14715 -33890 -20094 -1634 -29372 -26223 -18156 -9342 -17035 -5427 -5663
27714 -5663 -11144 -12411 -4712 -6468 -5640 11218 -1059 -17515 -11373 -27653 -16564 19420 26503
27701 26503 26104 3494 3579 20041 29047 57767 42782 47854 47326 58649 66109 37394 -4871 -5501
27687 -5501 18364 13031 -24645 -39883 -47257 -51491 -24748 4185 23729 16766 16364 3255 -20908
27674 -20908 -24468 -7766 -3480 -6821 20505 57620 50757 42394 22789 -1387 -18949 -6575 -14548
27661 -14548 3691 9700 -4150 4391 2641 -37634 -42302 -25083 -7006 -3772 -6315 11739 25670
27648 25670 10679 18561 33894 33628 11118 -16193 -15434 10335 36717 37319 27643 1048 1700 20701
27634 20701 24653 29440 31317 14637 -5633 -7571 -12632 13379 36850 20734 1699 9411 29213
27621 29213 11312 1426 -8725 -18806 5007 -14948 -25789 2366 20708 35529 60130 55980
27609 55980 52390 48060 50452 46897 20590 20193 22012 6326 3407 -3032 8463 -2858 2077 6515
27595 6515 12577 29733 24081 4987 6678 24813 37390 28099 27473 37218 30986 19958 9808
27582 9808 10699 26554 21298 3237 -15645 -24146 -18289 -4273 2065 4041 1242 21529 21310 9237
27568 9237 17607 28517 32552 43631 45292 30472 -5272 -10199 -13983 -28524 -23400 112 -3096
27555 -3096 -23154 -21043 -25931 -53781 -44554 -18347 -13167 31285 24312 10447 -7266 -5423 3026
27542 3026 7395 18005 35740 36643 12985 -3710 -1810 12571 38425 52285 48321 37425 15516
27529 15516 344 -1859 -13154 2663 829 -10398 7570 -1657 -15620 5213 25300 -6356
27517 -6356 -1032 12647 14132 23852 12814 21573 37157 17841 30959 33684 5082 8216 11795
27504 11795 -1468 -11523 3455 -6755 -27883 11201 14206 -5919 -11260 -29616 -34716 -12186
27492 -12186 15826 17913 39723 41380 7507 112 15939 23559 25211 23622 19037 17758 4822
27479 4822 -31392 -38028 -34785 -25739 -30948 -21156 -26340 -49961 -62255 -25937 -4521 -2688 1445
27466 1445 16564 34419 28094 21948 8252 9141 -8329 2779 -3407 -16985 -9879 -21551 -24380
27453 -24380 -14056 -20493 -31402 -42013 -25133 -1716 -2997 -7503 1144 6679 47906 68758 48411
27440 48411 35840 29335 27031 28212 45319 44015 18747 24598 23789 28447 16336 -1853 -6273
27427 -6273 -13819 15066 10286 -4987 -28077 -14634 14303 32650 67440 71016 62430 48306 37997
27414 37997 19333 23281 19031 -3005 -16276 -2542 10636 31138 46453 36334 10957 -29326
27402 -29326 -29308 -16586 -10397 -31371 -55962 -12786 6344 -7871 -10828 202 -9345 -3405 -21867
27389 -21867 -28713 -8121 -10332 16042 30883 2366 3424 -26968 -44647 -5276 25912 9294
27377 9294 -20652 -14458 -1937 39153 66362 30921 9662 -1425 -27034 -28077 -22576 1152
27365 1152 32541 29815 55435 40461 22303 10775 2593 1582 12195 12497 5444 4500 4460 3439
27351 3439 -2019 -3167 -18499 -15389 7014 -6804 -11532 2997 1090 11129 18451 17353 15995
27338 15995 34257 18974 3026 3588 -29397 -54121 -30469 6201 27106 42257 38255 43215
27326 43215 39804 38192 47494 45401 26336 4823 2300 -10588 -8043 7115 6436 -13212 -872
27313 -872 -18979 -23526 -64343 -57617 -41124 -19913 -21028 -6539 -4638 -12985 -26191 -26662 -20674 -22907
27299 -22907 10361 1176 2817 736 10386 -15045 -26788 -22341 -8787 -19700 -26761 -28135 -22068
27286 -22068 -293 27231 10453 13150 14328 8096 10792 10201 35787 48110 53385 33311 -10676
27273 -10676 5889 29631 45117 44923 5285 19073 32037 14990 -1836 -7169 -21443 -24914
27261 -24914 -9956 -26319 -22381 -32490 -26882 -8127 -5583 -34188 -42592 -35596 3044 15396 20769
27248 20769 18915 23570 56051 60256 66447 48973 51699 29636 -13273 -27174 -12473 9074 11677
27235 11677 7860 8959 4883 -6886 2526 -13088 -15077 -9987 12364 41842 66798 64518 58726
27222 58726 23318 2030 -61 2508 22639 27559 7511 4765 7186 12438 22611 19855 5539
27209 5539 -6236 7011 9805 15489 12712 2321 4270 19590 17090 -6421 -8158 15924 -20083
27196 -20083 -21846 2019 16198 24206 24259 13984 4007 31230 25601 15715 22183 16186 17283 31001
27182 31001 45606 38498 16968 3034 -4328 12633 22408 43960 30237 21639 32901 47251
27170 47251 58806 57808 29345 -9090 -2807 29928 50127 38530 8900 16308 31163 19770
27158 19770 27189 31173 15581 -7714 -23145 -10733 -6535 2877 7726 3830 -66 -17919 -25172
27145 -25172 -29314 -20084 -12652 -1271 9893 23138 30566 35763 53149 52044 15580 22915 36121
27132 36121 43867 19778 9090 15605 37973 52874 49448 11766 -6572 -1333 10699 50857
27120 50857 48691 8079 -25484 -39120 -10461 -13033 -10132 4416 -23329 -20261 9265 7532 22314
27107 22314 19344 7138 -2157 -5446 17583 33219 -7708 -10232 2534 -4535 -40677 -56882 -73005
27094 -73005 -59078 -36427 -37790 -41124 -6947 9923 14607 16200 17233 7160 292 -20932 -23639
27081 -23639 -12597 17792 27410 6198 2447 16154 18483 10443 7842 2256 20095 28957 19358
27068 19358 10504 408 -18586 -23778 -27047 -21527 9410 16524 5076 -16421 -14719 -2771 -15635
27055 -15635 -9511 -31122 -20355 -1569 19607 14046 -2977 -1203 -21789 -3358 5574 -3027 1483
27042 1483 -9120 -12743 1052 2272 4828 -26965 -25920 2338 33819 19816 19514 68227 76035
27029 76035 40440 43144 16022 9853 16069 18346 32732 20173 24535 16698 6345 12642 10986
27016 10986 -13083 -24648 -3251 -9026 24617 6413 -22684 -9094 4931 11029 18998 33797
27004 33797 43823 58569 64013 -41 -27029 -17172 -14243 -20160 -22733 -1508 29564 9118 -3344
26991 -3344 -12038 -40100 -48724 -52325 -24298 -8934 -7399 -8484 2425 9999 42017 32831 24150
26978 24150 47174 53051 21719 28990 17852 8769 24100 30911 -1150 -41888 -48972 -30363 909
26965 909 -3639 -38394 -25498 14417 15428 14098 -15216 -21163 -36601 -29891 -13873 4508 13133
26952 13133 -1494 -11590 -22354 -13132 -10534 -28832 -38958 -12827 22764 39180 41999 43111
26940 43111 30176 52528 47914 20821 30361 35508 36594 30846 1779 10201 15246 16051 19315 -3461
26926 -3461 -27165 -20274 -9203 -15852 -7347 12237 37228 38989 36708 7730 5434 -614 -12273
26913 -12273 3450 12815 19035 -6721 -36684 -53850 -36764 -12360 -11633 -11680 1875 -12668 -13012
26900 -13012 -17529 -20981 -2621 -28220 -45349 -50599 -23860 -20600 -19309 -33138 -47456 -31452 -48572
26887 -48572 -48993 -36681 -10669 8683 10689 9798 16445 19059 28028 31110 10702 7681 4650 -3893
26873 -3893 18263 12855 -8292 -14674 -18141 -9815 -10702 -8941 -2405 -31169 -33517 -14855 -11846 -11341
26859 -11341 2586 -13019 -29861 -22769 -26136 -15794 -12918 -18117 5627 7236 9867 20369 59298
26846 59298 52038 41456 35416 16680 13830 27085 31784 17679 5050 3686 -17242 -29875 -11378
26833 -11378 -11778 -17168 -40497 -13987 11475 10262 32956 49864 52582 32332 -8429 -7103 -1759
26820 -1759 1114 24934 6984 -9923 21704 46168 20943 10007 -11086 1442 5233 -5911
26808 -5911 -3024 -1117 8418 25929 32237 22151 -18561 -12443 7575 6819 13852 38854 36740 41687
26794 41687 52066 9623 14635 30705 39905 29743 12558 -5725 1286 -16837 -13090 -7929 -15089
26781 -15089 -11763 -21805 -24784 -9647 17192 41917 69668 43910 13869 -2645 10820 264
26769 264 11386 35633 61635 68601 55195 18632 -10502 -10855 5629 -5499 9730 31956 25341
26756 25341 20949 33194 46233 31005 23295 26729 39064 62445 51274 31952 19499 21811
26744 21811 36581 42982 22543 822 6945 16418 -14334 -4602 30656 35863 16025 -5826 -1422
26731 -1422 -10671 6054 19145 29545 44328 46095 6240 -2139 801 -3989 11503 32490 22783
26718 22783 -9739 -24800 -9455 -10398 -9616 16232 8252 7228 34334 44355 46862 22479 -16051
26705 -16051 -44915 -33202 -10354 -18042 -14282 -19694 -37289 -52440 -33480 -23051 -9596 -7361
26693 -7361 -9477 -8535 -7544 10113 -72 14025 6719 -7561 -16642 -20005 8222 11859 4271 -11809
26679 -11809 -20239 -6474 -12586 -40221 -36764 -15465 756 7578 -2255 -6394 -14505 -4391 -783
26666 -783 18312 37057 35871 30687 9662 9645 19185 35373 50726 36284 44030 48443 36115 31493
26652 31493 45016 45277 62173 54866 12822 2866 7252 22152 47033 55469 45023 33832 59468
26639 59468 18601 18442 9257 -17450 -42384 -37501 -13880 -875 -12895 -14129 3746 11982 30059
26626 30059 31479 16139 -12114 16274 6915 510 21485 40645 47615 53059 7754 -21807 -13179
26613 -13179 14094 19140 15833 4470 -13829 -22569 -2603 27761 27507 11018 -16012 -22031 -26995
26600 -26995 -2898 14379 -20726 -18259 13503 27285 38780 38381 15053 15508 7229 -6076 464
26587 464 4092 21657 39046 55713 50090 40232 24553 -9743 -15469 -6345 -13853 -25011 -21110
26574 -21110 14911 -834 -19603 -6583 -11854 -2270 -4740 -14367 -14492 -13095 -1863 16720 215
26561 215 -14164 -12213 -1727 23993 15603 18640 32602 24795 9523 10253 20272 15384 3608
26548 3608 16905 12364 32985 9644 -13951 -40660 -57244 -49975 -63480 -42808 -34576 -19153
26536 -19153 -37145 -12576 11706 18973 36043 46008 65713 52710 29916 19453 41838 49803
26524 49803 50775 30289 32221 7865 -2244 -2035 8898 32082 35919 29382 25818 24106 14327 35040
26510 35040 5003 -24110 7966 37268 13976 1517 11857 18293 -17715 -46801 -12165 29216
26498 29216 24881 26228 9538 34492 37273 37093 38882 47937 49806 51882 65366 67409 62429 48809
26484 48809 17263 3639 -16193 -34615 -33640 -15234 6254 21045 41817 75955 62636 50661
26472 50661 63759 65265 41959 13054 666 29139 34174 36042 40900 43755 33645 5395 4192
26459 4192 -1191 -475 12290 10106 7468 -7473 -1161 21978 49304 41326 6448 -2320 11570
26446 11570 33799 36396 16722 9681 2972 -22074 -23001 -22045 -31418 -28943 -7875 3939 10571 -1589
26432 -1589 -4485 8787 46627 48914 32015 47721 51196 44614 27328 15233 12275 28563 41303
26419 41303 35127 28736 3117 -8989 1879 -6601 -5260 -6159 3860 3048 -3795 -14360 -19369 -28107
26405 -28107 -40917 -19605 8124 4351 -10163 3097 17873 27968 28774 29258 35931 7242 -7185
26392 -7185 -1739 17874 31337 34675 44433 34809 23887 24703 1234 -16771 7583 12668 4710
26379 4710 -984 -10590 3683 -7847 -2168 24586 37258 13479 21303 48114 66491 31173 31202
26366 31202 24025 -2799 6339 17025 13577 8622 7855 1037 -3424 -2827 -1028 -14276 -19958 -11994
26352 -11994 21116 24776 19558 5896 -1136 148 3136 1565 -11606 -6001 -4906 328 -3211 -2736
26338 -2736 1872 25655 12682 -11908 -43145 -43315 -53111 -48945 -36785 -34113 -38138 4033 21556
26325 21556 14651 -14648 -23793 440 -25441 -41691 -17949 -24996 -31944 -27731 -27987 -49369 -29185
26312 -29185 -2741 9974 10756 7800 8206 2886 3687 16455 16999 10885 26195 39754 63872 52051
26298 52051 27425 18621 13091 11846 2476 -3829 -10434 -12234 -10066 -3747 16015 45625 45482 41298
26284 41298 19884 33143 39855 39438 54712 55321 56353 35033 36827 55886 46301 24770 34557
26271 34557 47526 26930 11693 28477 20594 -18 -12779 -12608 2090 10845 1679 -8443 -13266
26258 -13266 33230 41586 24382 23411 15102 17841 -2679 -8677 -27426 -9591 -8308 -4111 3881
26245 3881 7087 -28519 -44877 -30802 -7640 6091 15216 -3625 -12162 -18745 4120 19483 13628
26232 13628 15523 14159 40764 43222 26497 11648 17782 22581 17175 7097 -8598 -314 8872
26219 8872 11385 32369 37993 21814 19367 13020 16748 29827 67826 103241 94747 49983 56180
26206 56180 44083 36724 24998 43867 45695 25814 29101 35939 33487 18264 9543 12121 31303
26193 31303 37967 32717 -9691 -20454 -9004 4792 -4823 1697 -9892 1841 9417 31660 33404
26180 33404 31332 41389 39686 28163 18408 1056 7770 5898 -11371 -4516 -3929 -21428 -7829
26167 -7829 4577 17602 39919 18993 16781 20215 14975 15546 8352 26653 68818 69831 61998
26154 61998 53396 68918 64975 51467 37452 42678 20861 9568 -16081 -10606 -4488 2339 16413
26141 16413 28680 33382 41312 24498 23482 -7405 -6735 -4180 -10677 -8849 -25651 -13927 35111
26128 35111 31225 16167 -13781 -19962 1466 16105 11693 7460 24641 22685 9022 14460 21230
26115 21230 6518 796 13202 8806 -8928 -3530 -12084 -39330 -14944 44329 41201 24847 20211
26102 20211 13499 21380 3916 -19859 -25904 3346 17489 35655 47893 24940 20498 -8786
26090 -8786 -24118 -35484 -17223 -3256 16604 21135 10087 1313 2483 5603 9445 33603 29574
26077 29574 51570 38988 23210 39320 40226 22289 8480 23917 21764 -898 -27985 -32093
26065 -32093 -8347 15238 2667 18603 -1965 -17099 -28227 -34746 -32495 -15316 6992 34320
26053 34320 31093 16280 12123 3678 -11615 -8610 21729 25723 24302 24055 25857 23454 35000 32436
26039 32436 38185 35724 36848 32570 33330 47110 40131 19964 41537 45474 6482 -10513 -16321
26026 -16321 -6604 2680 2344 12008 -4680 -20508 -23071 852 26976 27987 48685 21519 9353
26013 9353 9957 37449 22430 -273 -11117 4906 17322 39557 17132 19272 19134 -1699 -7694
26000 -7694 -18691 -22804 -24883 -12983 4759 -12395 -3212 15013 13399 3330 -18508 -24026 -1832
25987 -1832 -5495 -9215 9084 18903 30283 33218 22262 -304 -6098 1568 40335 62311 54579
25974 54579 34217 2536 -18541 -19379 -15083 -5887 17449 21658 36396 33596 1895 -8742 -12559
25961 -12559 14477 58765 69844 63107 39482 926 2657 2177 -2020 -163 -479 10476 9316
25948 9316 -221 -8689 -946 11916 15501 26000 3527 12 12468 21715 41393 37843 10073
25935 10073 15980 5526 -10654 -22665 -3140 -2711 -14639 -15563 -11075 -20992 -18836 4799 2298
25922 2298 25055 19028 -8629 -19186 -22556 -11249 12029 -8206 -12493 -7889 -11468 18555 17603
25909 17603 17600 4313 -12016 -30567 -26842 -24109 -25972 -13466 -1681 1007 18740 26767 42116
25896 42116 30544 20338 43197 31868 30541 8293 -20438 -5167 3709 11686 16289 14842 24083
25883 24083 24897 39185 37501 35845 35235 23708 12286 12440 16752 34564 33721 18297 13345 5281
25869 5281 10497 -12542 -39868 -25558 -16610 -1688 16027 12800 1274 -18593 -5045 23271
25857 23271 39185 27044 -14295 -4899 1344 22574 41309 45809 38248 55802 34124 31250 30549
25844 30549 9934 9889 45432 40051 46043 56627 64932 71175 57404 50467 47263 28577 6740
25831 6740 10209 46474 70217 61475 27949 30179 42675 57725 60019 36861 24649 -3388 11611
25818 11611 18710 8325 11166 1729 -292 14362 40630 52867 33436 -2010 -20583 3826
25806 3826 6793 13864 14315 5729 7424 -3361 -5047 -8009 8256 8726 20786 27083 5735 1229
25792 1229 -17028 -15888 -9361 -4780 -21332 -20908 -3344 1548 1980 838 -2029 -10230 -7865 4426
25778 4426 -19400 -24011 -8771 -4914 -24952 -1733 15635 20706 21869 9709 740 654 -913 9256
25764 9256 -9034 -24698 -24959 -24143 -13762 -3373 -12285 -25597 -18429 -13064 13268 17025 15542 6240
25750 6240 10093 20607 4693 -4805 -23954 -34969 -8412 -6992 2424 17639 -13056 -11581 302
25737 302 11482 -11889 -832 13591 4537 -2987 -10350 -1716 -9500 -13859 -11161 14511 10903 19974
25723 19974 15948 6274 18258 29290 33364 44776 43835 28005 20741 26303 9580 -9517 8422
25710 8422 13306 3870 7496 -19720 -37284 -55589 -46311 -6260 -7528 -8415 -9764 -16333 2361 15293
25696 15293 17781 23287 15751 -11963 -25594 -21888 -23186 -32988 -43494 -19045 -13687 8428 21361
25683 21361 26258 34157 12670 -13168 -23842 1095 34564 50962 1599 -27065 -1798 49377
25671 49377 44347 26240 47617 26225 -11692 -5782 1672 5811 -21589 -26638 -24891 -8277 11164
25658 11164 3397 497 25167 34408 6204 -37112 -20026 -10095 -36557 -39026 -12378 29265 5742
25645 5742 3171 17197 28246 14236 -14678 -36854 -36385 -18428 6416 11512 10658 13499 39577
25632 39577 39645 40080 48492 63117 73839 58703 57401 45605 23044 13459 19136 -9112 -5405 -1723
25618 -1723 -3478 -26372 -40694 -51388 -42812 -27009 -16435 -13384 -5224 -19387 -24154 -32865 -34181
25605 -34181 -26101 -8179 -16201 -13986 15467 15786 27708 34126 15616 36807 29729 19993 31501
25592 31501 13964 15833 29891 35627 35208 39845 39042 15128 -7548 -8779 22961 57525 41295
25579 41295 35287 33306 27969 11237 -8330 9246 27743 22568 4498 1196 16329 7552 -14443
25566 -14443 -11113 13247 22512 13139 25773 38573 -11418 -36983 -8121 34492 45461 34425
25554 34425 53916 71389 89130 74406 47148 56228 45883 22578 22163 29034 40253 23760
25542 23760 41780 53352 57991 41781 6486 -25845 -21900 -23156 -5826 20178 26691 13845
25530 13845 5351 -21370 -30271 -25794 10058 -9680 -15855 -17047 -10985 -25181 -28226 -34629 -7546
25517 -7546 11347 2564 -36846 -46200 -41491 -32041 -6847 28019 55724 74952 44376 26141 34253
25504 34253 31661 26817 15713 1468 -13314 -23188 -37462 -13555 -9165 -29135 -24604 1477 -4348
25491 -4348 -4906 7915 15379 -8967 -8616 10500 6541 -1054 -6617 -8786 -24609 -39554 -42609 -39971
25477 -39971 -31603 -17362 -10286 -23083 -18041 1470 11265 20116 46320 57814 28075 907 18395
25464 18395 8580 -9064 10904 26823 24145 18120 14208 33172 10969 9591 21331 12531 25988
25451 25988 31894 23227 -5251 -21708 -9726 5599 2528 -14234 8020 -2859 -24509 -30972
25439 -30972 -21625 10833 15588 4469 -13832 4660 717 -10361 -7225 8145 10330 16883 17440
25426 17440 13053 -4265 10286 11224 3723 -6104 -16247 -5950 6362 12583 15509 6174 52
25413 52 -3607 10 -11355 -32957 -33437 4233 16082 24058 28494 24906 10669 -2515 -10461 5993
25399 5993 -23837 -41126 -23395 -5340 -2465 -3458 -9109 -13364 -9085 6914 11797 19997 -3180
25386 -3180 -32677 -33863 -4445 21773 27873 27426 19587 4595 -14630 -31008 -31076 -20982 -11277 -37587
25372 -37587 -56949 -34875 -11523 9933 44879 26897 -25028 -24072 1120 14186 18299 21080
25360 21080 -1709 6837 23501 13848 5093 -22493 -22097 10976 23743 14957 12994 12818 12402 18282
25346 18282 7884 8520 16034 16757 3631 -15246 -30728 -39762 -2945 33006 42640 44833 58929
25333 58929 58727 29912 4873 -163 7342 20341 38217 8094 -26624 -35184 2725 15749 8599
25320 8599 5460 -1376 -13047 6316 41113 50900 60857 63872 37176 15107 17301 11808 7898
25307 7898 7320 9975 26358 -3689 -6607 -7025 -17259 -12506 5182 -24012 -49919 -61233 -56445
25294 -56445 -29015 15338 39444 13929 -6039 -25554 -38457 -20297 19603 -3376 -35307 -42763
25282 -42763 -21512 -24357 -287 21553 41840 47430 35520 34712 28784 17491 25609 3660 18842
25269 18842 30491 28966 21194 13497 8277 14155 31595 32416 23714 25126 20895 -9060 -27530 -36232
25255 -36232 -16836 -4399 15711 10248 12065 43116 38608 5201 -45843 -40628 -18354 -13579 -14789
25242 -14789 -15077 4299 -2017 -18415 -28317 -39915 -18402 -18667 -9897 -1689 13914 8726 18564 25972
25228 25972 27234 23726 906 -8096 -4019 3208 7843 21458 41449 53195 23554 10458 11350
25215 11350 5585 -6421 -2734 18447 26671 -9570 -41954 -30045 -23783 -2434 24611 53666
25203 53666 32472 3602 -17617 6362 9055 -1216 -13048 -10104 -14999 -16816 -12542 -7336 -30376
25190 -30376 -26897 24839 43595 64189 75562 68338 79597 55225 39194 28030 32736 38558
25178 38558 9121 12594 19664 13061 -6020 3502 22237 10195 -8711 14481 11642 -1105 8958
25165 8958 42989 63015 35338 4984 19216 10228 12228 21664 15832 19080 -1387 -35745 -7744
25152 -7744 18481 11132 4201 2021 8673 20780 30957 34785 25876 31205 27491 5511 1210 24572
25138 24572 8261 18971 40428 52967 54144 56167 53786 29909 6709 -6714 4371 -6409
25126 -6409 -10709 18599 26286 -21461 -30438 1489 1781 37478 33812 15360 26376 18506 14692
25113 14692 28596 29414 42875 44221 18473 -12925 -22546 6169 -872 -4744 14454 26470 25207
25100 25207 22350 39923 35911 11817 -17286 -24466 -4537 1671 -15120 -32468 -15111 13730
25088 13730 11213 -430 -9729 23830 67544 60788 43134 23264 7223 -5888 5553 15041
25076 15041 24784 7544 10993 -9557 -4663 13675 29358 18907 31360 41333 45326 17496 5263
25063 5263 -4035 -15090 -19666 -20018 -5401 -4227 -2884 -10173 -29964 -13901 -12552 -28438 -40142
25050 -40142 -21450 10697 22265 10772 2991 12533 12299 29551 16126 7048 9792 5578 -15373
25037 -15373 -11509 -16717 -17020 5591 26918 32494 28017 -6877 -23876 -26998 -24951 -27723 -43162
25024 -43162 -6322 -12932 -11827 -2812 -11589 -7213 12264 31149 19546 33105 47364 18033 2505
25011 2505 19697 23549 20495 16124 32038 63103 80164 104652 91396 50642 20954 9642
24999 9642 31280 32116 40308 29501 12751 6920 8139 45778 37618 20655 13278 22160 30229 27250
24985 27250 16994 19656 22251 34566 52430 37392 8945 -418 -19661 -3451 6715 9490
24973 9490 3673 -9385 -5707 -14699 -16082 -17166 581 1492 20894 13966 11087 -4588 -12824 -3598
24959 -3598 -24517 -41079 -32261 5292 4273 -7252 876 -16554 -55771 -84625 -51691 5184
24947 5184 7067 2904 5902 9614 37100 32269 -2642 68 1693 -10420 -4823 17054 8822 16532
24933 16532 7074 8799 13099 20894 18612 18807 16239 31109 38002 23110 2920 -738 -2461 7680
24919 7680 -1168 -26390 -48699 -39165 -6201 -9531 -33186 -45171 -33351 -18141 4153 8245 17096
24906 17096 44222 24341 28771 16523 34944 57525 73440 26564 -23297 -36567 -29341 -48468
24894 -48468 -56046 -29323 -43970 -60048 -37837 -34982 4612 45823 68792 45853 16627 9657
24882 9657 6764 -793 -4741 10327 23854 17860 21587 32011 30732 24414 8226 -17990 -22773
24869 -22773 -12306 -13408 -12881 -21827 -50385 -47478 -19152 -37854 -36354 -6856 842 -23877 -10700
24856 -10700 -7546 -13684 -13427 6153 -4801 -6605 687 -7041 -10378 -8619 28705 33948 36567 20480
24842 20480 7552 15856 29216 9409 -17931 -19872 -4561 18898 37775 41946 36077 27926 16287
24829 16287 4375 9235 -20301 -32384 -9689 10446 15993 33306 38470 43172 42223 27032 4272
24816 4272 345 -7700 -11524 17602 15662 -12897 -22313 -5793 -12218 974 8191 6368 -15211
24803 -15211 -7221 13913 5845 4966 3169 2973 7250 -5845 -18804 -35328 -17126 3483 6913
24790 6913 -1675 7443 876 3006 6852 10880 -3019 -36129 -58123 -57297 -31066 -14418 15296
24777 15296 13490 -10308 -35996 -12675 22022 29210 20796 19758 26479 11285 -23973 -6142 20077
24764 20077 17825 25857 33848 21730 11454 13740 -7955 6462 10252 15122 9667 14937 -6657
24751 -6657 502 1575 3159 16913 42534 32873 802 974 25804 27971 15742 -23673 -25421
24738 -25421 -14469 5807 17342 17007 -450 -21369 -552 1401 7414 6440 5112 11452 7622
24725 7622 11938 18417 10660 17739 37049 63137 98884 110435 78991 24418 8801 -5535 -9140
24712 -9140 -21643 -6045 -14753 -34093 -36134 -13349 -5468 1873 4824 -12334 -828 -2168 -31932
24699 -31932 -45870 -22540 25741 49436 51840 19415 -10460 -4602 -6438 -19865 -18458 -11041 -8611
24686 -8611 -2984 9100 19153 12644 269 -6945 3559 2743 14564 19056 20888 10012 14419
24673 14419 20080 33505 38110 24300 27142 5006 -17157 -975 4770 8775 19469 26087 30745
24660 30745 12572 24899 31198 17368 3121 6786 8004 -11131 18404 41048 22180 12591
24648 12591 4072 17136 9680 3395 18376 11688 -17595 -13451 -2680 8099 10553 -1615 -4812
24635 -4812 -19997 -25971 2137 -10637 -40950 -19326 -5228 174 1514 908 -9390 -15634 -17305
24622 -17305 1133 -22732 -17662 2825 21019 5807 -23962 -22593 -33414 -11251 -17961 -12930
24610 -12930 -12672 -14043 -13951 -13753 -6936 15858 26133 18333 6528 4204 -28177 -38208 -33017 -21603
24596 -21603 -6374 13876 -6811 -15934 -19465 -2273 30565 23366 1876 31882 57328 42129
24584 42129 2724 -17870 -24954 -15226 -20871 -32951 -43087 -20161 2104 -5710 -39832 -18074
24572 -18074 23621 3229 -29101 -35922 -30242 -19410 -24955 -25113 -2711 -11956 -3370 13172 19123
24559 19123 11718 28846 39229 55978 49231 -2637 -45439 -47327 -37872 -31792 -50109 -55838 -47926
24546 -47926 -45799 -43912 -34940 -34606 -15044 -9088 -20978 -14638 2248 3369 -4393 -7738 -21101 -28149
24532 -28149 6676 -9190 6697 -6000 8092 16342 17715 14521 26499 32241 14970 6700 22470
24519 22470 12104 16865 41939 38583 28316 23759 2768 -4561 6043 -329 15487 6779 3721
24506 3721 -25107 -21047 -519 -4177 -12956 -197 -4827 5588 448 367 5771 7267 21650 28549
24492 28549 26390 24715 18684 4108 -28818 -35986 -49456 -37373 -8199 17554 27237 36872 45668
24479 45668 24360 17660 -13515 -14356 9742 32320 31467 24544 32396 35188 26248 9574 26014
24466 26014 44550 35716 38398 35663 19572 13118 -7382 8266 29533 26284 27145 13177 -3368
24453 -3368 26877 17880 -4623 11496 -10018 -10852 6299 8578 -1898 -7662 -4106 13225 38245
24440 38245 19164 14429 24131 22830 9965 57752 86101 69523 39483 7947 8116 36126 16830
24427 16830 -4190 2821 -828 -29897 -50160 -13032 10924 -5745 -3290 -9809 -27011 -51737
24415 -51737 -48269 -21025 -11085 -3939 6567 11676 37028 58621 42249 13868 -7011 -517 884
24402 884 249 -14268 -31493 -15160 18543 29431 25439 2116 2199 -18456 -18472 14904 23998 9223
24388 9223 -17906 -20554 13256 12449 11412 -6398 -30050 -27654 7611 5352 7572 11634 3156 16157
24374 16157 49313 66457 29341 23251 17848 -658 -36920 -29616 -36784 -43716 -50340 -36734 -9248
24361 -9248 -18346 -22386 -33450 -48322 -29786 -8781 8914 3559 -6311 5350 3774 -25528 -28405
24348 -28405 5862 29784 8548 -22956 -16578 9411 16961 17589 -21295 -32925 -45269 -35569 -32293
24335 -32293 -33484 -39183 -48647 -42021 -34958 -20190 -23201 -2787 -9859 -23409 -34125 -2222 -2995
24322 -2995 7658 11394 39877 36634 36749 35266 36312 36083 25011 -1243 -20446 -30412 -19088 4744
24308 4744 -9180 -34743 -50354 -48737 -6043 7984 4262 -7707 -5987 2484 -1068 -14144 -4721
24295 -4721 -12669 -32308 -34012 -13145 2911 -10708 -10219 2546 2551 -14731 3048 12238 21726 28874
24281 28874 20776 -50 -1806 17007 22573 36303 58907 48042 27702 23439 15330 14822 7403
24268 7403 -25549 -49489 -44937 -16648 -5406 4806 -943 1058 9362 37917 37654 21033 -1999
24255 -1999 12766 -17183 -29745 -893 10215 2760 -26049 -25112 -23540 -43963 -33085 -18143 -17751
24242 -17751 -19447 -33525 -32869 -41195 -14878 12492 7052 76 -2135 23581 20109 21918 24970 24850
24228 24850 23656 23365 11145 19548 6184 2075 8760 24526 5975 -12821 -17923 -3650 6515
24215 6515 -514 5004 -22792 -43791 -26579 -23863 -25233 -24978 -23570 -27724 -28491 -49686 -41614 -45022
24201 -45022 -26846 -19337 -16862 -37172 -67005 -89940 -61197 -20944 -20865 2971 27251 42682 19683
24188 19683 5828 8872 -4204 -23956 -26856 5700 -9078 -20382 -6038 2824 -311 6605 6510
24175 6510 17454 1103 -12842 1403 18685 2575 -16936 -25103 3279 -4212 -21451 -33312
24163 -33312 -28356 -27757 -25998 1776 2484 2257 2427 5140 1966 -22767 -1249 12970 1864 13350
24149 13350 17928 6035 14364 26634 9985 -8416 5640 32128 20292 -13827 -37987 -39887
24137 -39887 -35513 -26497 -12935 -7453 -14074 -18882 -4008 5537 -19134 -6470 11426 24510 18914
24124 18914 5769 16805 -5596 -30102 -5805 29263 40336 27318 -5417 -3517 13283 30788
24112 30788 25847 20441 26966 49290 45981 38641 22915 2959 -8696 -3394 -32032 -40207 -36077
24099 -36077 -26459 -1059 -15641 -6926 7121 20969 2551 -8404 6286 3073 -21056 -59041
24087 -59041 -54188 -47488 -35236 -7238 -1573 18566 49034 41039 14720 7264 10203 20024 4398
24074 4398 -32231 -58536 -66330 -65785 -62820 -47315 -47156 -33178 -17672 -9033 -2351 26682 29672 35717
24060 35717 20532 2183 -6962 -557 9213 16649 11353 45303 76427 61607 23096 5098 18138
24047 18138 35629 22868 23410 14999 9530 -7985 -687 15080 19366 1276 -13028 -16428 -22017
24034 -22017 -8986 -12229 -25172 -19704 -20313 -10148 1734 1159 -13033 -21461 -27456 -20154 9114
24021 9114 21036 -2139 -17993 -18571 3173 8723 -9781 -7578 -14035 3763 23246 26096 -1165
24008 -1165 -8030 -15471 -18227 -2065 -1538 -23668 -12541 7833 25066 38649 27033 20377 -2469
23995 -2469 9703 21084 21347 9425 -31297 -3540 33616 39044 27970 8922 1510 18473 17353
23982 17353 16545 -1065 -2431 11980 11505 16155 3580 -6612 -6440 15675 23034 25004 10813 16963
23968 16963 26961 12069 16918 19702 -237 9718 26987 26313 30115 55306 50496 25658 39503
23955 39503 25323 24318 -1493 5163 14937 14475 2926 -23388 -25333 5682 21881 13422 2963
23942 2963 9664 16668 4431 4682 13329 17260 19936 14619 -10529 -39387 -32864 -23245 -42390 -47362
23928 -47362 -23562 -39043 -29627 -10206 15538 25891 -7882 -14936 -21659 -17085 5468 11798 6561
23915 6561 -10274 -8777 24559 25772 8235 -2059 -12761 2003 -10400 -23159 18876 2763
23903 2763 629 25435 6336 -2554 -1078 -29371 -29399 -5739 -18770 -23818 -22871 -23427 3229 6773
23889 6773 -7979 9303 9013 558 -13935 -15852 -5158 -10099 -11024 -384 1821 4533 -9164 -21774
23875 -21774 -8747 -3759 4887 18492 31770 25298 22400 -21770 -41079 -39421 -23589 -25711 -39209
23862 -39209 -41358 -35516 -24819 -26556 -16574 6843 949 -31955 -31226 -35678 -12578 5016 25693
23849 25693 32719 9736 6454 33197 49330 21368 10774 -21654 -1521 1030 -5470 9636
23837 9636 8269 -23349 -21649 -10912 -17847 -30264 -15614 -20453 -54348 -58450 -39558 -12078 9761
23824 9761 24912 30116 10990 -11965 -19923 -15562 -1286 5317 -1835 -15526 -19165 -29256 -15492
23811 -15492 -1452 -12036 -30871 -34089 -4117 6631 -9616 -19840 -38766 -27982 -9376 -34341
23799 -34341 -49839 -54125 -35815 -54882 -57383 -26092 7989 35492 30540 20578 8992 -26298
23787 -26298 -4443 -12827 -21088 -22881 -17178 -16708 -239 22211 21967 10793 24059 45214 44775 31227
23773 31227 23738 7393 -7239 3873 30460 13318 14751 10070 26268 28514 -1444 -11266 -13203
23760 -13203 -17941 272 -8737 -18485 -4629 3723 -1241 9874 12144 -6425 2307 15264 26416
23747 26416 42455 15680 -4581 -1771 -5356 -380 -6589 -18667 -11590 -10262 -4260 -4958 -1393 -15500
23733 -15500 -16028 -29032 -21887 -19801 -27127 3011 8568 3439 3719 16432 23686 10453 14201 3455
23719 3455 21274 11693 -10812 -25649 -32180 -33362 -42966 -23756 -9757 -18440 7420 26582 31361
23706 31361 46637 50520 22911 -183 -5155 6341 -5587 4863 11434 19095 24444 29253 45339
23693 45339 73843 59851 32840 7734 -19384 -2900 -15553 -16280 -11126 -2333 -13473 -3287
23681 -3287 -4617 2360 14571 41084 36563 -7366 -15855 8453 29323 28107 37120 64929 57905
23668 57905 38750 6959 13535 49730 30686 -1637 -26489 -33526 -28783 22923 1496 7460
23656 7460 30473 8959 -9657 1173 -6264 -19003 -37650 -29509 -35461 -32265 606 583 -25880
23643 -25880 4614 23492 16265 1698 14328 12935 8145 6891 -31107 -14931 -4618 -29798
23631 -29798 -12649 -17211 -10435 -5814 -9777 -8224 15674 6094 -4836 4719 45486 39087 7917
23618 7917 -24354 -40093 -34142 -18790 -31401 -9353 17287 -3988 -28023 -59377 -57063 -41845
23606 -41845 -50553 -40799 -10840 -20907 -27388 -14815 -10835 -19611 -17257 -31888 -50149 -55865 -44071
23593 -44071 -24738 -28820 -22686 -219 -8823 -2498 -7782 -15309 -4308 12547 9485 27767 30521
23580 30521 15872 7856 6296 3990 -18910 -31674 -71198 -66677 -67959 -42453 -6105 1505 -1216
23567 -1216 -11301 20322 32631 31916 8563 21973 44583 30214 23564 35691 47805 16517
23555 16517 2978 7300 -2325 -20195 -8866 9132 16541 19836 -9288 9391 -1049 -26798
23543 -26798 -15597 -9374 -35248 -35311 -1669 4838 -6942 -21018 -35852 -50640 -36764 -24730 -13980
23530 -13980 -26974 -30838 -19583 -5560 18045 24768 34551 27744 19785 5186 -2824 -19129 -8109
23517 -8109 -2453 -8472 -10049 -10032 -24582 -26423 -4888 1686 -3727 7538 -9969 -33725 -50372 -30444
23503 -30444 -12412 -12931 -14792 -6019 -18899 -5148 44859 47615 8048 -14837 -37946 -13797 22657
23490 22657 30886 25225 21702 5694 3273 -1749 -7022 3525 609 4737 32044 50193 22053
23477 22053 -2279 -5090 5125 13790 -19761 -36851 16195 56744 70425 66211 36701 41200
23465 41200 29022 24797 31972 18267 13346 -5366 -17898 -21842 -24563 -32522 5883 20645 -1329
23452 -1329 6752 -7149 -19869 -21908 7999 22880 -1495 3480 18261 24378 26255 28508 17788
23439 17788 10374 8385 6196 22920 31943 45793 45063 26321 3248 11187 5259 -11319 -15730
23426 -15730 -11173 -15464 -11430 -4278 841 8186 -14934 -25993 -22611 -39345 -39870 -36453 -13588 2520
23412 2520 5692 1720 19566 40038 28927 4136 2529 -11338 -11076 -14435 -7596 2532 2726 -27414
23398 -27414 -25191 -33730 -34110 -45436 -51368 -24466 6724 15188 6680 -8922 4735 20132 2144
23385 2144 -22153 -7128 12668 27841 20023 -6856 -16463 -9503 529 -3490 -13563 -22953 -48139
23372 -48139 -77417 -71187 -62032 -59590 -25006 -23739 -10341 -12224 -14013 13104 21812 -1570 -18424
23359 -18424 -29325 -47666 -26044 -38563 -43667 -42206 -54740 -58152 -64942 -52714 -47543 -42208 -33313
23346 -33313 -36586 -31443 -13240 -20841 9007 15305 32826 33552 -3725 -20024 -24239 -41554 -37652
23333 -37652 -9924 -3241 -20302 -22085 -28184 -25881 -11949 -12863 -27793 -52821 -45178 -22450 -1007
23320 -1007 26855 30968 25571 14846 7149 -8800 2203 -13862 -13283 -12595 -34679 -48180 -53567
23307 -53567 -51891 -47209 -59569 -59601 -33421 -24740 -20802 -34101 -60225 -71733 -63399 -37270 -18203
23294 -18203 -3657 -5061 -11277 -13518 -2986 9173 21426 26932 39972 41385 32070 18957 8360
23281 8360 -24686 -33184 -18083 -14811 6321 10250 9895 15196 22387 15676 12489 10009 1144 7067
23267 7067 7468 25356 8953 -16412 -19622 4169 3652 -8755 -13807 -7785 -13155 -22963 -5023 13686
23253 13686 39191 62139 57069 63254 46894 49391 31252 41846 46879 50953 41234 24079 37204
23240 37204 23988 15234 -3802 714 18927 32307 9619 -29777 -1324 7714 -14457 -6643
23228 -6643 -2535 -9484 -6624 15970 42819 24512 -8452 -641 8131 16443 6549 13492 20114 8116
23214 8116 -1595 2442 -985 -12369 -25363 -2394 16060 45345 41399 15356 16207 6719 -6262
23201 -6262 -14373 -24839 -35634 -41198 -46464 -41909 -26631 -21901 -23824 -22400 -26045 -36409 -10509
23188 -10509 3784 2924 7580 2132 12727 14428 -6054 -26634 -10704 -11155 3707 31835 15323
23175 15323 3389 -3610 -14733 -11115 -18104 -25963 -34736 -13437 9214 44941 34789 -1252 -19955
23162 -19955 -12814 20338 36196 48520 49367 24291 22805 9503 6864 27122 36675 22600 22091
23149 22091 38212 39309 26188 10966 3585 17225 14059 12539 11684 45556 39787 29545 14571
23136 14571 -13118 -25699 5689 38574 16577 -5031 20106 36523 32996 24344 16192 20897
23124 20897 25593 14794 -15149 12621 20151 19378 3090 -11702 16780 46278 33269 -1479
23112 -1479 -42805 -60523 -75309 -48798 -30023 -17993 -15701 -20994 -6915 -4371 -2215 6364 24621
23099 24621 26561 10162 15023 16046 9082 16966 14077 19844 -8090 15786 42849 41271 31678
23086 31678 21646 47545 42410 38710 30549 38495 37650 24549 3659 -3987 5560 43507 43002 26019
23072 26019 24470 16062 -3698 -21086 -10832 13640 8189 496 -1834 -14451 -20292 -20691 -28097
23059 -28097 -21432 -22260 -54433 -45135 -10633 3139 7145 -6046 4663 8910 829 8080 -14781
23046 -14781 -29459 -7445 -19903 -49443 -19090 20650 51576 57195 55136 54381 36540 22970
23034 22970 32008 -5422 -13407 8911 27900 29305 -10364 -31828 -16276 5265 -14628 -23050
23022 -23050 -23036 -14944 8859 7604 -3888 -10903 -5895 2949 4360 22059 8096 -24074 -34385
23009 -34385 -16341 -16258 -17123 -1287 5778 12430 16520 28235 26008 33148 17194 -34593 -61959 -65412
22995 -65412 -50080 -36285 -17288 5360 -9745 -21395 -26750 3544 6777 12452 6789 11155 7747
22982 7747 9928 -6507 12255 19593 -3283 -27414 -23454 -40071 -46209 -10889 6653 -3950 -11526
22969 -11526 -11910 -17433 -16000 -3618 39202 36017 5086 -11740 -25721 -20572 -21562 -28660 -37612 -45555
22955 -45555 -46535 -28828 -13595 -9267 -20494 -5764 -2758 -2517 -169 -14090 5141 20304 -6979
22942 -6979 16014 1274 -14414 -2163 20399 -366 -23233 -35200 -17896 -18657 -27775 -33040 -10417
22929 -10417 266 -51637 -66978 -17766 -13845 -29022 -24637 -1838 -17358 -19559 8582 4850
22917 4850 -14206 -33191 -29208 -12076 5588 -14462 -16424 -8377 7525 -6054 -16814 -15603 -2605
22904 -2605 -4093 -2163 -7618 -27346 -22482 -1803 -6804 -38514 -24529 -27509 -31691 -37552 -54652
22891 -54652 -57658 -51426 -48413 -61583 -59139 -40886 654 5638 -18890 -32724 -28182 2300 13076
22878 13076 -7798 -27837 -35585 -33175 4760 30922 39760 31381 33291 -10024 -44365 -36761 -10651
22865 -10651 2506 -18097 -20386 -36602 -44977 -20313 -16185 -24480 -4490 3520 17291 6052 -13683
22852 -13683 -3535 12458 415 10190 -13419 -31023 -47946 -56119 -21467 48604 75284 100692
22840 100692 78696 32507 -1426 -11584 6410 34391 37055 35805 27850 58507 29219 13565
22828 13565 14008 -8889 -15942 -8468 -20091 -16023 1259 -1294 -15821 -20804 -4761 -8335 -15220
22815 -15220 -8428 -27468 -27049 1413 -4421 -20005 -6282 -2275 -2558 -5499 -9856 -15934 -9845 -11285
22801 -11285 4101 685 4936 18036 9817 5980 -6710 -25353 -16482 3872 18294 -1441 -17135
22788 -17135 -28334 -50537 -44010 -38130 -31770 -15287 4957 10593 -372 -12626 -3723 -5510 -5535
22775 -5535 -2347 13300 7883 8519 9628 -12003 -14496 -9710 -24113 -9585 10034 -24659 2233
22762 2233 21695 21276 2088 -18062 -8243 16866 27068 8373 -21384 -12536 -6151 11787 11003
22749 11003 -26792 -48938 -43376 -9960 32538 13610 18417 20516 622 -11901 13161 42690
22737 42690 57786 42717 7146 6006 -4951 -33764 -26661 -3976 11698 40706 44172 28475
22725 28475 -9897 -26105 5978 30673 41233 29269 -11232 -28525 -9314 -19388 -6237 15775
22713 15775 23649 35669 33891 8148 23452 32890 694 -1918 -6594 -13277 -1903 37546 7121
22700 7121 17592 32781 29597 -5705 16543 24397 -8496 -27560 -5144 -11411 -35388 -30221 -33816
22687 -33816 -15086 4338 4098 8425 -11539 -41689 -51619 -14929 17272 6907 -6174 9062
22675 9062 -7057 -24321 -5927 -21375 -19929 -25500 -28732 -24781 144 46598 45794 50969 32472
22662 32472 36188 26339 8804 16636 -16602 -44729 -51860 -26007 -3953 -6713 -4840 594 -22225
22649 -22225 -13661 6886 2656 -14930 -4863 -4418 -14173 5430 25436 33824 29586 37405 44988
22636 44988 51501 23010 8647 -19971 -29344 -31496 -24833 -26761 -3040 -2314 7493 18505 -2531
22623 -2531 -12350 -47745 -43294 -30392 -16811 -39086 -50355 -30894 -10040 -13594 -16249 28355 7315
22610 7315 -28715 -53155 -66123 -40081 -23787 -5388 -37960 -43245 -34867 -32315 -13418 -1724
22598 -1724 -3972 -17160 -34176 -44937 -10208 11630 11961 19275 20403 -1630 -2411 -30314 -39248
22585 -39248 -34592 2683 9577 26876 40033 22233 2186 2574 -4701 7973 -27466 -18503 -35028
22572 -35028 -27900 -26600 -3309 27341 -5880 7683 20688 13008 -6173 -14639 -17532 -11366 -9916
22559 -9916 -30900 -20897 -12435 -25745 -18529 1448 -5798 -12926 -28034 -27930 -358 29148 27223
22546 27223 -14445 -40060 -30011 -10783 -9869 -18434 -9119 -10550 -25363 -14791 -5708 -6540 -15238
22533 -15238 -11385 909 -7949 -11203 -14521 -10995 -8315 27000 19586 15953 -13709 -13018 21446 34061
22519 34061 21420 3020 -24244 -28026 -13918 -25523 -22432 -354 -4043 -12763 -24601 -39476
22507 -39476 -42093 -56485 -24390 -19872 -17777 -31076 -32002 -27284 -26606 -34443 -41470 -49337 -48219 -32222
22493 -32222 -24989 -14816 -16254 -16159 -20466 -2504 10645 -18206 -39862 -8178 -15801 -29269 -5786
22480 -5786 2331 -27611 -22388 2720 16191 6922 22396 44130 21227 -6330 2932 14123 7402
22467 7402 -17881 -26668 -11405 11435 9297 -7952 -27949 -49126 -33258 -41760 -27933 -20498 -12221
22454 -12221 -16660 -13248 -18180 -41286 -34851 -43935 -33439 -28688 -35125 -31403 -28843 -20792 -10230 2477
22440 2477 -2164 -20904 1022 42447 60768 25622 2156 403 5051 14016 3975 13795 39880
22427 39880 58696 45750 21050 -7130 -18998 -8709 2859 -9425 -7995 26174 30497 11885
22415 11885 25626 33251 22417 7827 2385 -14416 -16598 -19354 -1240 8289 2663 310 -18057
22402 -18057 -7334 12972 26302 27204 23685 20175 1260 -8646 -15677 -11062 12403 34976 17424
22389 17424 6136 12151 -16772 -42766 -51829 -23023 -17512 -27643 -47054 -33777 -2038 16398
22377 16398 22728 19011 5671 -10388 -36119 -39460 -15253 -3393 16537 23723 467 1998 7605
22364 7605 -10409 -21842 -15591 -2848 -13449 -33092 -42718 -29967 -23023 44287 58836 11479
22352 11479 -21134 -35316 -22463 -4367 10427 12683 12404 10679 -3253 -13295 8271 12866 -10725
22339 -10725 -13653 1686 1643 -4335 -3020 16623 39145 46922 15282 4789 6525 -3756 689
22326 689 11965 -2110 -13428 2463 1853 -42563 -59541 -43804 -28907 -38382 -42936 -16947 9108
22313 9108 2972 -12937 -25111 -35381 -36649 -11353 -5823 -30313 -24919 -24375 -4133 15306 -14660
22300 -14660 -13118 -7341 -14768 -10985 8078 25995 57148 71789 57672 32812 29157 26508 22620
22287 22620 22334 -17058 -40094 -39256 -29085 -7316 -2745 -5650 -16431 -14692 -16830 -11782 -6637 -11819
22273 -11819 -6200 15939 14827 6749 -17617 -33354 -45525 -25229 -21721 -16937 376 27942 -6897
22260 -6897 -33593 -48007 -47953 -28550 8924 28543 18827 11960 -9979 -24119 -14111 4706 -1651
22247 -1651 -43430 -48093 -31164 -15670 10382 -1297 -17087 -5119 -11544 -30297 -40404 -31159
22235 -31159 3996 3286 -27137 -5663 -12939 -13425 -11561 -18251 -26341 -32895 -16877 -8354 -8495 -12007
22221 -12007 -12719 -11301 -23767 -24582 -27778 -57789 -53461 -32436 -19411 -1761 9788 15665 6516
22208 6516 -11714 -14565 -32396 -54858 -40850 -36703 -26391 -37426 -24603 -18231 -22937 -12748 -16265
22195 -16265 -22416 -27523 -42684 -24251 -2549 -4740 2617 -19891 -44187 -59703 -40947 -10162
22183 -10162 -18042 -39919 -36669 -14445 -4337 -8332 -47934 -53791 -43031 -39003 -11271 -12923 -23331
22170 -23331 -20827 -20338 -2548 28666 7675 -26831 -19664 22991 8504 -15050 6234 19655
22158 19655 32273 27685 11776 -13128 -40784 -38275 -20073 -41233 -41011 -46877 -44396 -12329 -9400
22145 -9400 -24057 -37467 -50951 -41059 -12132 -17481 3305 5658 -6893 -7791 -5333 -5881 -20157
22132 -20157 -8409 -6369 -42139 -61613 -49127 -32959 -27442 -21245 -10658 11714 328 -11416
22120 -11416 -20007 -10177 -3413 -1150 -45678 -51964 -61975 -74826 -65773 -41226 -31926 -27064 -13658
22107 -13658 -12314 -6716 4894 9083 -15569 -37007 -12022 -15238 -10387 6892 18105 -2276 -15197
22094 -15197 -20869 -21879 -19454 -28825 -36128 -36904 -43270 -48273 -6813 12163 -24315 -41804 -21574
22081 -21574 -13878 -22035 -26407 -29485 -26787 -26534 36965 39951 1981 -7417 -38364 -28677 -17468 -20833
22067 -20833 -25012 -23831 -23417 -24171 -6887 -9951 -20096 -16942 -5117 8546 28372 18822 20386 15988
22053 15988 7836 -7140 -30022 -8122 15878 5144 -10159 -16774 -19760 -42525 -27892 -3187
22041 -3187 -8399 -11934 867 -24856 -34978 -15044 -29911 -36478 -32048 -34404 -18792 2471 -5294
22028 -5294 -6971 5994 17217 -15841 -39027 -15505 7231 -3575 -32811 -32775 -19101 -48396 -53326
22015 -53326 -41297 -27021 -17582 -11795 -8356 -3381 -6500 3004 1914 2822 26134 52096 31381
22002 31381 -8826 -28326 -55917 -74683 -58686 -15714 -2320 3262 1427 9685 32176 32544 26293
21989 26293 -1654 -24523 -34645 -28143 -3747 -2742 9781 28388 25979 17822 14013 -1434 -24733
21976 -24733 -37072 -52527 -37151 -26907 -33533 -57876 -22091 -3289 -21189 -19785 -20184 -28263 -16462
21963 -16462 -2292 -5802 -9719 7754 3323 18614 19483 -7824 -31151 -34127 -46406 -39608 -7122
21950 -7122 -1285 -8065 -9353 -4677 -4969 1227 16862 23351 14885 6420 -9540 -21932 -9102 7253
21936 7253 28650 32326 8138 6571 -7089 9590 34599 23719 -17163 -36628 -19170 14145
21924 14145 14863 6277 17959 29123 13139 11986 7321 -8881 -38477 -39859 -24008 3210 10927
21911 10927 -13668 -10273 -17468 -39936 -37792 -28023 -2088 4168 -15160 -27102 -23621 -13933 -4058
21898 -4058 2602 10303 -21826 -21086 7317 -28736 -50397 -39327 -11328 -5002 27517 27285 -803
21885 -803 10374 24884 38710 25767 5849 -6433 -26366 -9529 -2796 -9413 -13151 -22815 2658
21872 2658 23757 22688 -8326 7195 16160 1579 -24851 -36375 -54451 -41005 -26709 -2950
21860 -2950 -8685 7001 23513 21161 16183 10721 -2304 5572 4233 -6827 -22074 -13939 2300
21847 2300 2608 -2037 25204 47728 50876 10533 264 9488 7622 22095 30252 10585 -10594
21834 -10594 -10077 -24376 -13481 18682 44226 25425 15357 8245 -15503 -21808 -24115 -43480 -53085
21821 -53085 -48625 -29266 -3673 -10565 -1063 8796 13690 12026 14631 27631 26309 15225 -13210
21808 -13210 -16173 -22680 -24738 -27397 -17904 -10324 -24795 -24021 7731 8754 -932 -1071 -2821 -13014
21794 -13014 -12252 -14355 3493 6942 -2452 -24710 -27352 -27847 -22859 -33266 -31387 -4543 -20701 -34764
21780 -34764 -4518 3279 5020 11221 33101 45842 12464 -25324 -3887 4504 -12532 3600
21768 3600 25949 33060 7065 -9225 -8836 -4570 -22778 -39607 -47734 -82970 -87736 -80550 -61979
21755 -61979 2427 33281 29992 21090 21011 17655 -1853 -28425 -27721 -40057 -14194 -8551 -4171 -7708
21741 -7708 -20104 -11839 -11902 -11379 -20004 -49334 -36573 -31445 -50700 -66333 -98857 -100620 -69959 -30983
21727 -30983 -16476 -24709 -26810 -23251 -41169 -36237 -25799 -28102 -11947 -4264 -13621 -17122 11479
21714 11479 15541 -1716 5405 -13292 943 23079 28602 23200 43766 33838 -124 -16097 -12713
21701 -12713 -15640 -18303 -21187 -35467 -40712 -57743 -33133 -14932 731 16310 10361 -20719 -7214
21688 -7214 -20238 -25732 -20262 10468 21207 13183 -9587 -58558 -39919 -14720 -7996 -2753 -18698
21675 -18698 -25323 -31457 -44015 -49834 -30211 -20069 -6359 -20693 -32310 -17867 9582 -9306
21663 -9306 -34855 -35096 -15965 -30448 -22500 -5825 -4518 15009 37659 25124 4639 -2326 -5508
21650 -5508 -19639 -12317 -32553 -43871 -13950 12766 -5037 -19933 -33878 -12400 -11285 -32664
21638 -32664 -22953 15780 36296 10211 98 -17631 -42535 -40558 -26601 -34286 -19404 7301
21626 7301 4805 -26602 -30878 -33967 -58349 -41561 -28239 -16363 -34825 -22011 5346 15654
21614 15654 7264 -11332 -15591 -27141 -44447 -53845 -33436 -13766 17180 -31 -13803 -42303
21602 -42303 -41439 -58393 -50828 -57177 -18192 12840 2766 -21180 -26155 -31415 -27456 -15334 -31424
21589 -31424 -55907 -46418 -62485 -45895 -37118 -33254 -29402 -44568 -63736 -47238 -15145 -3341
21577 -3341 -11700 -21131 -31589 -39961 -47872 -73370 -73046 -45399 -42405 -41705 -18387 -25444 -34831 -31219
21563 -31219 -25556 -3146 23347 2854 4595 10288 20231 9387 20765 10009 -8432 15391
21551 15391 35150 30677 15722 13197 23042 16901 12348 -1283 -11393 -2861 -6503 25077 23620
21538 23620 8864 -2259 8440 4389 -6738 6399 8482 3837 26896 15634 -1822 -33355
21526 -33355 -54197 -39092 -12872 -19785 -6122 -7258 -21174 -11544 -21523 -37623 -40787 -52719 -23946
21513 -23946 -4507 10469 -12860 -15632 -14155 -39917 -29884 -8874 -11450 -34040 -33044 -39528 -45424
21500 -45424 -68793 -66751 -50252 -52030 -26869 17915 42723 41574 50589 65976 64450 29904 21383
21487 21383 6236 15736 8963 13272 11118 -5706 -18973 -49168 -77901 -77174 -81042 -57580 -26298
21474 -26298 -15012 -5044 -15758 -23107 -16830 -23655 -25958 -5301 -23524 -43004 -32352 14183 24050
21461 24050 -3178 -10564 -2204 -8476 -15071 -10743 -1942 -26563 -52740 -16315 -6108 -10284 -455
21448 -455 21334 6980 -5150 -5026 2796 -13000 -15623 -1152 -12501 -26164 -16842 -7837 5819
21435 5819 -5100 -26890 -43509 -15335 -15581 -6627 -711 -1243 16862 19335 6424 393 541 35611
21421 35611 34498 -6583 -18132 -33778 -9064 -30410 -50366 -41972 -52844 -43445 -15524 8677
21409 8677 20848 21668 9574 25721 14446 -25985 -37948 -7472 37163 72374 60865 22828
21397 22828 17446 25116 49758 50858 13974 -10253 5729 -15834 -25357 -8936 17860 21174 6260
21384 6260 -11439 -2830 -2321 -10692 -30948 -21762 -24097 -18973 -21343 -22918 -18363 -18318 -25673 -12615 -15450
21369 -15450 -17775 -13163 -24243 -53366 -54498 -43244 -47519 -68393 -52343 -47143 -53230 -42715 -14173
21356 -14173 -8652 -21215 -31922 -22524 -29765 -15453 -7567 5603 -10957 -2968 6353 14387 12448
21343 12448 -9794 -43928 -26330 -310 -3753 -8244 6314 11781 -17009 -42689 -49427 -42145 -6973
21330 -6973 -22994 -40699 -48499 -33426 5295 28031 7034 -15854 5602 21175 18509 -14106
21318 -14106 -57509 -40408 -36735 -22041 1691 5021 -12003 -10188 -138 -8675 -20663 -8958
21306 -8958 -29908 -52234 -36217 -22911 -17991 -22128 -23090 -20780 -7826 -17141 -27437 -33318 -17958
21293 -17958 10850 14809 -1020 -29629 -50611 -25912 -52178 -51484 -27162 -29142 -30659 -34851 -27221
21280 -27221 -29950 -15844 -541 -14725 -11835 11105 14208 1370 -12357 -22977 -38073 -18828
21268 -18828 -25992 -47684 -71752 -72341 -73996 -55017 -17498 -29006 -64165 -60051 -37653 -2576 2713
21255 2713 4296 -19429 -29674 -53235 -33687 -17108 -14476 7164 14940 10452 6621 13023 -2997
21242 -2997 -10438 -34536 -51322 -56934 -21301 -18103 -23308 -7538 4840 -3638 -16038 -14919 -15081
21229 -15081 -31969 -31878 -23587 -11082 -8434 -29755 -48141 -41956 -36933 -62730 -55778 -26328 -26303 -25088
21215 -25088 -6614 -22411 -29365 -37213 -30455 -33040 -18622 -35878 -41611 -37237 -42596 -84848 -69091
21202 -69091 -61506 -62558 -35541 -18666 8660 -10973 -17162 -27006 -31553 -24354 -38666 -41706 -36612
21189 -36612 -25262 -38121 -54163 -18172 -18170 -3434 -3652 -17892 -12686 -221 -11807 -27519 -18710
21176 -18710 -25909 -45494 -37781 -37177 -54306 -36302 -10885 1054 -13693 -8106 8905 8903 -7250
21163 -7250 24579 -626 -2410 1905 -30716 -31855 -27818 -17949 -11720 4617 206 2965 9685 7854
21149 7854 14786 -6468 -26101 -38211 -37416 -15028 16303 -2019 -21756 -46096 -40894 -39215 -68871
21136 -68871 -55652 -39333 -15195 -20910 -31763 -32527 -25998 -19852 -21028 -35468 -23692 8491 8393
21123 8393 5100 -14206 -12075 -6056 -14288 -2998 40 -15858 -39612 -38938 -30231 -24467 1516 25612
21109 25612 17658 17575 13584 11353 11980 4320 6167 15415 31437 569 -4697 762 18367 13011
21095 13011 -4239 -28026 -38913 -64038 -49381 -5251 24390 24670 34886 27218 30595 15151
21083 15151 -3059 -27680 -72125 -59097 -63507 -53142 -45490 -44477 -28742 -14675 -17695 -28739
21071 -28739 -42653 -21699 -6082 -24154 -46630 -60911 -37391 -10025 -27654 -22516 -7927 -24693
21059 -24693 -28714 -8452 -15355 -21567 -16447 1953 -2898 -20814 -18887 -6637 -30217 -69697 -75475
21046 -75475 -75268 -64895 -43377 -38146 -42905 -42941 -7549 25722 13510 -1697 -9912 -14919 7338
21033 7338 6210 19355 11514 6193 -8898 -14622 -20807 -49277 -66667 -58735 -26572 -17103 -22645
21020 -22645 -12119 -22211 -18374 -8315 -14151 -35272 -65114 -47452 -42698 -41032 -6368 4919
21008 4919 -9710 -13631 -21425 -25349 -26480 -34350 -15674 -2983 -21214 -30466 -25008 -18754 -22078 -49384
20994 -49384 -32444 8023 -4888 -38374 -38959 -12550 5307 18999 -3707 -24075 2760 21944
20982 21944 -3396 -25130 -38528 -26037 -22965 -20942 -25567 -24168 6805 28903 999 -29838
20970 -29838 -26957 -23856 -17700 10763 -5638 -30885 -35020 -33111 -46311 -26839 1044 29111 29126
20957 29126 -12866 -17463 6113 -7550 -26015 -27548 -19392 -12721 -45404 -69868 -33290 -2164
20945 -2164 -9975 -27669 -24774 -26530 -11314 -20498 -47025 -63642 -43956 -29487 -42481 -6318 -778
20932 -778 -14982 -8883 -4824 -1661 -6446 -29115 -30631 -11957 -27513 -41292 -23860 -2784 -10584
20919 -10584 -21698 -22285 -39150 -62380 -75249 -75818 -60109 -57407 -42489 -43848 -40227 -43980 -66505
20906 -66505 -60153 -50928 -46904 -19436 -13799 -3499 4113 -17353 -17155 -27421 -31394 -35644 -4510
20893 -4510 -2769 -6317 -12722 -24335 -13881 22320 30472 29451 20496 2073 -1893 -20426 -22589
20880 -22589 -22259 -27159 -14637 -16232 -48198 -50336 -19498 -13017 2368 2330 14060 14423 32867 44092
20866 44092 11229 -13956 -52446 -44710 -11407 -11815 -19538 -34687 -8709 7766 16959 12669 -16562
20853 -16562 -28337 -25204 -37647 -33630 -45298 -32764 -25718 -27782 -33061 -6933 -27634 -31637 -26115
20840 -26115 -25907 -29000 -31880 -17931 -27594 -15883 3005 1704 -947 9024 8001 -14004 -12626 -2570
20826 -2570 -1986 -9211 -19840 -31019 -29059 -23191 -29596 -21856 -27199 -32304 -7951 465 6560 1850
20812 1850 -12080 -16988 -4657 -24375 -27608 -34654 -29794 -16752 1622 -9486 -25507 -21689 -6775
20799 -6775 -26301 -24877 -21228 -19243 -32355 -26810 -39975 -28084 -11912 -2110 -3583 -41418 -58330
20786 -58330 -48760 5711 24905 -3281 -35563 -48236 -63867 -49943 -48516 -44436 -19544 4887
20774 4887 11939 -19172 -41234 -34995 -10370 -15633 -24378 -28564 -40298 -36197 -39834 -33976 -24060 3102
20760 3102 12469 36481 42616 21225 -1865 -19936 -28455 -30495 -27115 -55181 -51189 -43459 -8978
20747 -8978 -12317 -19717 -15238 -27950 -52537 -53610 -32118 2015 -29239 -40194 4343 17784 22642
20734 22642 9410 -31980 -73580 -64373 -58473 -77751 -67443 -44940 -11879 -102 -12814 14771
20722 14771 33775 15514 -973 1331 8480 3578 6827 1692 3199 -732 -12771 -15014 -28004
20709 -28004 -25946 -21229 -19119 -56669 -57655 -54202 -32161 -9626 -11192 -4510 -31180 -56743 -67528
20696 -67528 -45622 -26933 -42139 -35104 8346 1884 -6726 -15453 -12788 -18447 -31319 -22458 1167
20683 1167 24906 2587 16102 -542 -29595 -9178 3786 -22991 -23383 -13072 11718 6458
20671 6458 12083 34441 30085 5604 -14889 -32088 -31639 -21585 -4220 -20657 -58095 -72924 -44002
20658 -44002 -31357 -32000 -15002 -18992 -66778 -88315 -80518 -60792 -35749 -20064 -13236 -15736 -38049
20645 -38049 -44128 -19455 -30555 -33986 -28463 -15431 -25941 -33808 -48127 -58009 -39960 -52039 -41634
20632 -41634 -29134 -30665 -23598 -43600 -37226 -21310 -32100 -44788 -33231 -44299 -22508 -9389
20620 -9389 -29912 -36924 -52750 -48129 -25448 -36587 -29393 -22697 -28146 -51945 -27346 -28816 -46445
20607 -46445 -44731 -41214 -32750 -13050 -24593 -23921 -27315 -40566 -36444 -13550 -16918 -10690 -42479
20594 -42479 -32333 -14289 -4790 -10992 -19050 -28565 -58132 -31033 -32558 -43000 -30046 -30931 -10689
20581 -10689 -16642 -38321 -66050 -56777 -48871 -25358 -7809 -8874 -25924 -44447 -19684 12094
20569 12094 1144 -12676 -46956 -22263 28809 32514 33736 35813 52202 9529 -33914 -51647
20557 -51647 -57225 -46545 -30706 -34084 -51917 -43270 -65823 -85943 -38403 -42128 -50215 -48017 -15819
20544 -15819 -8679 -43319 -41241 -22722 -14662 -18128 -25269 -16991 -10343 -42195 -69341 -43176 -17618
20531 -17618 -24322 -20754 -15647 6238 -1165 8475 -8630 -13252 -16159 -19789 -11483 -12783 10772 -18225
20517 -18225 -47117 -45392 -52251 -51600 -34443 -53420 -67266 -71175 -61785 -52582 -40793 -58461 -45283
20504 -45283 -54288 -78254 -77546 -53398 -26591 -22806 -42687 -43168 -32028 -29638 -912 13490 -25107
20491 -25107 -52770 -62045 -64825 -71426 -41456 -27883 -31059 -36775 -26682 -3287 9096 1653 -25367
20478 -25367 -12022 -2477 -3288 9306 -4544 -23367 -33369 -21424 -24862 -8834 -19968 -20669 -39263
20465 -39263 -44818 -15814 -11808 -8894 -16257 -33205 -53432 -30856 5093 -5785 -5000 1514 -789
20452 -789 -7543 -5380 6060 22794 19720 7452 -2897 3656 10571 23889 27993 57190 55203
20439 55203 36228 -1805 -10086 -13057 -30319 -37374 -63215 -40784 -31455 -21035 -19127 -31275 -54757
20426 -54757 -34502 -7792 -12412 -32744 -28856 19092 43598 20456 249 -9195 -27878 -26896 -14201
20413 -14201 -4676 6979 11502 31163 17354 33614 40253 25303 18631 17154 2780 10319 7821
20400 7821 50 -13031 -12036 -5659 -954 178 -17272 -37698 -23534 -5409 18990 -1625 2918
20387 2918 3292 4613 17004 11407 17692 -3764 7421 -10274 -13814 -3865 8468 19555 -6034
20374 -6034 -58507 -64308 -57270 -63955 -45043 -26718 -15991 -14925 -13716 -17325 -12505 9299 5434
20361 5434 -22791 -25048 -26316 -25369 -17964 -17869 -2310 17248 -6685 -30361 -34614 -30255 -21202 -10213
20347 -10213 -14698 3790 16742 4174 4475 20491 15178 26070 29760 6490 -17140 -3960 10376
20334 10376 99 4613 15431 11908 -6648 -12983 4114 -12229 -19054 -4753 6935 -21323
20322 -21323 -17173 -41065 -43055 -22665 -7970 -8562 -28104 -39500 -61259 -47361 -43177 -55534 -61784
20309 -61784 -57205 -41982 -37703 -34900 -25756 -29721 -29083 -28352 -44182 -49451 -55133 -50141 -11437 -5690
20295 -5690 -7388 -783 -9708 -1838 5673 23829 17301 -6569 -39948 -22375 15485 23332 14380
20282 14380 25062 30347 26251 40041 11992 -12391 -28788 -10807 41554 50918 30611 13804
20270 13804 -20722 -16093 3630 -12247 -7305 -16541 -33335 -32244 -6355 -14795 -20447 -8017 -12447
20257 -12447 -12697 7044 13980 25976 29811 35423 46721 51035 30889 20366 39627 34357 16446
20244 16446 20640 4205 -2985 18738 20989 4398 5088 -29307 -36784 -35076 -19267 5344 32072
20231 32072 27261 14661 11637 3253 7574 -11620 8243 7955 17653 16872 19777 11307 -6193 2892
20217 2892 29391 16463 -14893 -17041 -24164 -25098 -19326 -12090 -16222 -5220 19063 34720 28289
20204 28289 -3620 -23786 -5497 17580 10591 15640 4666 -6247 -22204 -23198 -9511 -19532
20192 -19532 -42163 -34463 -24575 -4585 -1766 11076 12573 -13633 -37231 -53807 -50876 -26399 776
20179 776 -1768 -3957 -15218 -18989 -33145 -24381 -32221 -17089 -24665 -46492 -53766 -48067 -31861 -42484
20165 -42484 -29769 -56215 -60540 -18112 10088 15973 -2969 354 -8134 2610 24176 35202
20153 35202 23487 38400 32220 22778 17794 36625 26955 17748 6694 -2363 -29179 -12468 23754
20140 23754 30842 30105 12174 16959 7786 -15548 -11775 -11081 -14256 -17453 -10448 7934 -2549 -29384
20126 -29384 -28892 -22496 -28838 -39126 -15265 -20205 -41948 -21094 22318 38502 16994 22228 9260
20113 9260 -6610 -7237 -16095 -15942 -28970 -44582 -37142 -29430 -3186 34955 29993 13692 -8172
20100 -8172 -16706 -20942 -10065 -2604 22240 56813 47308 462 -9300 11661 17585 10819 -21021
20087 -21021 -53833 -65343 -46154 -30607 -16496 -45880 -65963 -68025 -68198 -53498 -42789 -25477
20075 -25477 -10122 -918 15805 3578 1675 12684 12902 -7455 7593 11054 8738 26134 10880
20062 10880 10249 32329 15584 -18784 -24764 -17644 -7146 -26818 -13238 -18006 -5632 4950 -4045
20049 -4045 22519 5588 -6076 5674 7840 4810 1217 7929 -16938 -42716 -71813 -81588 -85099
20036 -85099 -66315 -61247 -37688 -22103 -24127 -32939 -49729 -73617 -63616 -69980 -60663 -50544 -24788
20023 -24788 -12010 2010 22170 16988 -2401 -14760 -17023 -20047 -47092 -49614 -51458 -69850 -70983
20010 -70983 -66173 -34785 -28641 -27967 -32260 -25621 -39544 -36497 -13402 24523 3453 -24872 -13174
19997 -13174 23696 26106 304 -50737 -50966 -16043 -16525 -30637 -16574 -18069 -17940 -2061 -4895
19984 -4895 13544 -15152 -28762 -23845 -10392 19544 -8477 -11034 -4122 -46916 -68078 -50188
19972 -50188 -23422 -14232 164 694 5296 -3686 4106 10812 9935 11100 -4651 -16437 -15131 -39139
19958 -39139 -28287 6282 -5096 -24634 -19838 -49347 -58277 -40453 -40795 -77379 -78408 -72589 -87179
19945 -87179 -83325 -68982 -74591 -68497 -65429 -71513 -55804 -18331 -14956 -24748 -33120 -33714 2852 -4750
19931 -4750 -12666 -1178 -320 -15182 -41048 -65257 -66389 -29804 -22545 -14648 -22281 -19330 -21891 -18422
19917 -18422 6714 -8110 -17737 -10667 -34635 -17433 8826 28058 31369 13278 10195 -13764
19905 -13764 -26417 -16723 3163 -10573 -18949 -43913 -12746 7480 22483 12492 9676 12843 14418
19892 14418 -18 3538 -2153 -30667 -44017 -42788 -7659 2023 -37603 -36101 -40290 -3896 -13422
19879 -13422 6539 23995 7515 -11264 -16714 -24408 -20394 -11754 -2971 -3537 5104 8670 -8016
19866 -8016 -24628 -30138 -32566 -29278 -3824 10938 29772 15780 15525 -174 -20639 -38666 -39263
19853 -39263 -34937 -14548 -5318 -26391 -28824 -9465 14914 -4410 -12717 -26337 -34664 -38617 -22302
19840 -22302 -22102 5861 -11120 -28813 -36523 -29354 -10310 -23713 -31922 -38320 -26481 -39194 -49683
19827 -49683 -34211 -28797 -31148 9685 15582 -1535 5907 -7988 -39245 -32934 -35627 -27098 -11746
19814 -11746 -12067 -25800 -59006 -49810 -19644 -38898 -31084 -23390 979 2246 -26820 -13437 20274
19801 20274 17421 -3471 -17379 -22592 -34555 -9040 13853 2736 -10384 -20130 -52302 -68265
19789 -68265 -55250 -42678 -17901 -7285 -22436 -28683 -11234 -6407 -19262 -18886 -3282 -7438 -1293
19776 -1293 147 -3526 21057 -4704 1384 4201 10114 26448 -8475 -29476 -5593 20037 20136
19763 20136 1304 -14922 -37203 -42551 -27082 -7605 -8227 -89 -13683 2288 -1034 -17837 -26718
19750 -26718 -33178 -23799 5277 -8255 -36296 -22478 12859 34571 63503 71526 52519 42159
19738 42159 28770 27084 6790 9116 6647 27832 31006 16686 -19798 -16980 14524 33431 11759
19725 11759 -13800 -43597 -49286 -32273 -16104 -4154 9953 19164 8991 -17786 -40801 -41720
19713 -41720 -25066 -9753 -20363 -49693 -54821 -34307 -15049 -29954 -38068 -20999 -3710 -10490
19701 -10490 -31744 -31050 -40870 -3505 28341 34178 21032 -9236 -14091 -11986 28949 34682 22505
19688 22505 10835 2099 -34069 -56095 -38930 -2202 34189 39678 8106 -10200 3915 7674
19676 7674 6225 -2088 -23728 -39679 -61998 -38067 -22048 -9330 6820 11583 8208 21340 -3994
19663 -3994 1261 7349 -290 -9124 -14560 -37770 -58857 -44605 -29207 -10893 -6808 4774 22279
19650 22279 30439 -3649 -27859 -24515 -22636 -34456 -27792 -16498 -15344 -34882 -32919 -16110 -29306
19637 -29306 -30644 -984 -207 -22608 -31481 -34883 -28045 -29361 -22077 -13193 14176 25630 3475
19624 3475 -5731 -16942 -32013 -5736 16336 25650 36468 23404 6643 -24917 -26430 -25240 -21412
19611 -21412 -29978 -10963 -3582 2569 -14123 11810 19384 13229 10259 13244 -597 14920 -700
19598 -700 -39469 -39918 -49148 -74100 -78133 -34712 -23326 -19910 -6560 3389 3256 23517 25643 34024
19584 34024 65071 52555 39026 14929 -2916 7597 13177 -16677 -16144 -6910 -3294 6533 -6096
19571 -6096 -9160 -9308 6363 46910 50564 44007 45199 53427 60008 57831 36148 38288 21940 7357
19557 7357 24311 47749 45539 3174 -37400 -30584 -5551 -10929 -26050 -16249 8540 -3154 -7004
19544 -7004 -1493 29841 43872 40807 26144 -18954 -31164 -18346 -18233 -10375 -13627 -12288 -17116
19531 -17116 -3774 -9874 -14187 -13382 -9879 -27451 -26151 -31279 -39869 -19696 6628 -5580 -12158
19518 -12158 -26528 -27158 -13081 -23063 -1165 19824 7213 -24768 -32918 -16941 -12622 -16752 4038
19505 4038 39248 46218 22484 29384 32226 40244 35205 -18936 -32519 -12653 -15023 -21262 -41994
19492 -41994 -67570 -62618 -67857 -71798 -46257 -37872 -20634 -2065 -23823 -22979 -36754 -23330 -9616
19479 -9616 93 -1507 16702 19976 11168 8839 -13103 -2831 17695 25362 11122 15587 55832
19466 55832 64809 40624 16308 14130 28960 31798 41671 28717 13464 27932 41177 47414 65142
19453 65142 69088 68104 56337 30547 17244 19559 -4903 -20328 -15058 -17137 -22591 -1898 15963
19440 15963 15265 3975 -13975 -27658 -13381 9215 -1915 -22066 -22586 -2082 19912 26808 13091
19427 13091 -408 1155 4570 4917 19551 2797 -15059 -9209 8240 -3298 -21538 -24208 -14886
19414 -14886 6455 7227 18166 14966 23858 1231 -27470 -54865 -42907 -18349 -17959 -24928 -56858
19401 -56858 -72791 -48156 -28016 -10237 -3492 6320 3130 -16169 -25570 -27177 -15404 307 -6438
19388 -6438 23989 12699 3244 8507 32713 46860 34003 38162 39589 33315 21944 -3204 -4720
19375 -4720 -1816 -2267 -15171 -13114 13633 -11440 -36399 -47242 -6724 8429 3261 3406 -572
19362 -572 2115 -12534 1281 -12968 -23632 -29441 -18935 -873 26120 17840 16561 -3803 124
19349 124 17894 42506 45778 13862 20060 34274 40303 46770 50051 52819 24583 19394 16241 3896
19335 3896 2792 -17942 -30390 -8941 31299 17436 6059 2213 -9682 -12426 -25034 -6416
19323 -6416 -21006 -22707 -29263 -33777 -36918 -42356 -34088 -18951 -7026 -6520 17739 27383 14342 26106
19309 26106 10322 1491 -4660 18245 17671 -15421 -31521 -31771 -3149 22922 22801 -10942 -37980
19296 -37980 -11417 12396 38332 38723 34857 22878 32637 41091 50694 18527 23560 33815 10043
19283 10043 -19794 -26028 -13029 -883 -14190 -33580 -21864 -34501 -26149 -7979 9686 14499
19271 14499 2765 -16620 -40324 -42195 -47970 -32362 -13051 -10263 -3786 10579 42384 20841
19259 20841 5922 14506 10076 -18065 -55053 -50652 -27525 21132 26606 18184 34413 17480 18587
19246 18587 27889 45258 21680 -15679 -17122 13407 25326 26517 26085 33626 23567 25085 45085
19233 45085 36339 10870 -18525 -24813 -56575 -61309 -20672 -14503 -18294 -11289 8443 18779 20411
19220 20411 -473 -23244 -27607 -38553 -13123 -13463 -3026 -3466 -28119 -24097 -1267 9199 11667
19207 11667 14651 19262 8966 2450 5333 1065 -10207 14411 7335 449 30131 44418 44707
19194 44707 52975 39160 11532 23695 40900 40179 36342 46504 78510 84168 57458 34867 23696
19181 23696 14047 12524 25090 31566 28422 33787 26815 7658 19671 1639 -14410 -28582 -38600
19168 -38600 -28299 -49175 -11362 26242 23611 5577 7858 811 -8634 -1719 3650 12475 3996
19155 3996 11837 18718 32408 39141 18436 7560 11160 12406 -234 -7455 -3479 13945 12640
19142 12640 8941 20770 18428 4385 41394 62726 51213 37667 30494 58341 62668 52957 21068
19129 21068 12614 3817 6282 8018 40976 70569 67524 42177 19401 4401 -3663 9338 30833
19116 30833 41820 39940 34108 27335 10143 -2880 1794 -2236 -321 -7592 -15700 -29933 -82460
19103 -82460 -86299 -72572 -47540 -32122 -15194 -12221 -17263 -13699 -7291 1859 -15316 -45207 2106
19090 2106 6009 -17152 -24482 -42452 -49720 -59685 -43450 -38844 -31610 -16987 -2761 11803 14301
19077 14301 25133 13337 21553 22177 39071 29127 16914 19225 21649 26249 7644 16051 13496
19064 13496 8803 17365 36311 27066 25202 20296 11993 39574 22397 -16070 -21485 5717 36090
19051 36090 49027 44781 33320 18197 5168 6171 13237 -4336 14777 28140 31672 16647
19039 16647 -1851 8128 22582 32104 3911 -3933 6479 19684 44613 42680 24041 41725
19027 41725 40471 14875 15752 22494 26332 33568 48274 34694 15484 7037 14673 24490 813
19014 813 -3707 5952 5707 27870 30192 46645 36674 20437 11818 2521 37041 51645 44677 33273
19000 33273 27228 31405 35806 25292 20779 25146 21889 6028 1939 7708 -6424 14625 44131
18987 44131 47708 45507 40554 67149 55082 28505 22202 58687 69643 45912 55191 50801 74733
18974 74733 83475 67873 50079 19579 18688 28846 36867 56012 57239 52407 61736 79540 45579
18961 45579 37691 45879 57570 59404 75695 63970 31535 19710 -8594 -13386 -9849 12112 31334
18948 31334 54459 85492 85224 67163 37334 30089 30164 29047 24192 21721 38634 38145 35615 33895
18934 33895 36910 63516 54743 28997 -2120 15381 4349 3376 -13890 -1617 15323 25085 20231
18921 20231 11687 9189 5517 8683 38745 36947 5351 3858 5654 -9954 1353 35764 58039
18908 58039 46804 21996 -2178 -4455 -2647 2180 15355 24958 23971 8800 4702 -6017 382
18895 382 11386 33106 61589 80132 53726 29352 7147 4637 15989 35979 39412 70038
18883 70038 73019 71430 44911 43300 53130 61337 51855 35224 57606 75563 60387 26232 6746
18870 6746 39326 41480 35786 26886 2584 5913 15122 23181 22539 13411 45568 49657 39911 27296
18856 27296 4399 5062 30117 71580 79897 72604 62725 56114 45997 56953 71759 63690 66748
18843 66748 84614 66425 46292 27787 23005 21760 17353 28013 43452 41323 51429 42569 59416
18830 59416 96394 64738 38997 46606 58248 36693 17121 15022 34390 49107 59128 49971
18818 49971 45845 29656 23745 23136 18502 -2868 -19395 -17787 -10073 -28408 -26826 -10835 -13387
18805 -13387 -33027 -886 45016 60401 74160 106714 85911 54419 56727 91594 99245 97694
18793 97694 96326 97964 84121 100512 87712 75649 54348 34580 29290 25572 28681 54278 61981
18780 61981 79436 109126 93724 86124 71315 35986 10920 8479 27733 59183 87598 109162
18768 109162 159598 234221 258845 233164 202819 164768 112804 84005 83589 89267 89130 88276 100754
18755 100754 88563 72519 65301 47926 50785 43546 33768 58989 76334 66698 46028 61907
18743 61907 60286 55188 73124 77197 63851 66627 52735 47717 26489 10694 15119 16640 69
18730 69 45826 51060 62968 59401 42267 29062 14934 16261 4515 -12746 -9405 10962 41758
18717 41758 21063 2397 6409 28750 53125 75983 104013 97534 86922 95421 128790 147465
18705 147465 137408 112894 110050 100349 87542 92923 125915 177425 231526 270566 289041 254026
18693 254026 196803 145334 97970 94017 75649 86766 115400 139496 163070 161357 137532 108306
18681 108306 90926 76537 73381 72388 66584 51518 54324 56201 39888 25051 32207 56261 59672
18668 59672 56045 50975 54081 63408 75223 70283 65871 89369 100975 115035 98776 113556 130515
18655 130515 121769 99765 71646 62262 53626 56784 41126 26689 49675 76359 83521 94371
18643 94371 93999 85130 75030 71491 82362 87870 67158 48716 45929 67936 88361 71477 54492
18630 54492 79948 92952 84309 66558 77206 100037 110430 125633 130502 135106 112305 99681
18618 99681 120568 145258 163662 169825 175306 205704 218396 212115 196982 178233 163295 140254
18606 140254 123486 97913 101568 97701 83978 89487 73496 64750 92851 70055 57461 69079
18594 69079 84055 98671 72823 33277 41087 78292 90540 89606 75650 70699 87705 86873 92427
18581 92427 83882 83385 96324 103716 108121 104278 99876 91586 111374 113611 99639 103893 82583 65914
18567 65914 67666 85199 108620 132282 146446 143353 128361 128024 128512 108301 85709 88599 78751
18554 78751 88619 106653 87671 60518 66864 63165 107821 122726 74406 68492 59381 75611 69559
18541 69559 75273 88711 74710 78587 76405 83708 124777 114591 89821 82673 84236 83318 62213
18528 62213 65468 91603 91216 91226 73496 70897 85018 103080 114541 83880 58170 63358 57435
18515 57435 93493 117098 111004 118231 117936 127778 140939 119400 114792 107136 86549 77590 91245
18502 91245 122363 137230 134225 126970 122126 122328 121955 107639 84790 96931 89207 101140 84100
18489 84100 94140 112305 117913 98537 125355 166170 208781 287434 373709 509436 749030
18478 749030 976480 1119754 1188685 1132184 988840 787636 593507 431003 352094 326536
18468 326536 295384 274060 226936 211437 197404 202721 216493 217110 194234 202319 192540 213165
18456 213165 234501 218199 179319 164886 167871 159783 147512 165455 167960 176450 195176 203132
18444 203132 199356 173714 165693 171123 176181 188037 207024 227471 249435 269822 299045 337722
18432 337722 397782 537574 728388 995876 1362295 1767265 2084771 2292917 2289367 2018352
18422 2018352 1641725 1256843 931507 699860 545849 423913 329553 264971 254296 249573
18412 249573 229430 204702 202103 210978 235445 256988 247591 230090 221125 231002 199052 179583
18400 179583 164642 161075 158688 143651 149197 150249 170864 221478 253305 229666 250979 277968
18388 277968 286095 265782 263437 257518 264260 311313 345583 359382 399438 488933 629535 831256
18376 831256 1114006 1316261 1433390 1450686 1336241 1124607 908238 706560 571902 462872
18366 462872 393715 368554 340041 335654 347679 366199 382140 384357 413474 471349 515119 577082
18354 577082 633625 669399 676064 627081 555202 489475 428776 358074 315806 303463 287069 284322
18342 284322 312309 332765 334088 340623 343383 350552 315844 273968 269595 282557 283390 274367 298335
18329 298335 351440 387708 413351 404740 404277 373925 340571 297934 280487 303027 297461 299578
18317 299578 300633 312607 340033 377404 375744 391012 397704 408190 429847 439890 448916 433938
18305 433938 452341 497572 515962 515867 504210 518331 594409 640371 649409 616722 523902 501597
18293 501597 470021 445718 436809 436159 455869 471472 458143 452327 440361 400906 385114 353997
18281 353997 335555 330105 324057 349754 324876 302865 290691 311956 366968 393744 380041 383967
18269 383967 416406 438044 465601 474655 500760 513345 528748 537955 527795 527738 553935 569734
18257 569734 563781 577466 546003 532702 551986 576231 551781 527067 467098 426253 403270 378813
18245 378813 350021 384149 418583 387825 351374 353937 378495 398781 421678 440141 450587 457433
18233 457433 489242 490004 471578 464562 443358 406804 392201 377264 402013 414066 425987 444122
18221 444122 489952 493940 497535 492118 473336 464030 474820 459808 433033 437835 435136 419328 399135
18208 399135 393511 407474 415729 424270 452818 479425 457934 451577 472594 456611 410440 365222
18196 365222 380840 411989 412555 400114 405563 435373 476459 491554 502968 505508 539858 588291
18184 588291 642294 684643 718753 717513 688756 651908 634128 614040 623952 619003 609585 658231
18172 658231 706485 728873 703249 686028 645781 593034 568479 535535 524976 526768 521860 506032
18160 506032 482640 462797 468752 476729 488593 488444 456448 436548 430741 435942 427099 405282 404480
18147 404480 395529 363610 378981 409585 455713 454930 436487 423810 431482 437734 447739 503038
18135 503038 542971 578239 630258 703377 770475 779706 769475 794438 853116 904828 965150 1025414
18123 1025414 1108511 1216468 1346188 1490492 1641616 1809481 2052688 2452786 3063432 3997807
18113 3997807 5532801 8011676 12280542 20251634 34184010 48330845 50339130 43540361
18105 43540361 33203401 22442745 14548139 9712331 6836904 5153990 4124328 3465187
18097 3465187 3043416 2758813 2561180 2401605 2244791 2047233 1838207 1671456 1502865
18088 1502865 1382380 1312278 1250676 1188807 1111098 1028058 973306 928912 870182 786927 719896
18077 719896 681891 673351 675659 694275 695583 669568 663907 636521 620039 580109 533317 537858
18065 537858 528354 512294 495503 457974 472725 488164 488939 488200 482993 493600 487727 470404 474528
18052 474528 469881 475310 498105 548089 618875 712217 807135 926135 1017991 1101629 1245828
18041 1245828 1415895 1556846 1658882 1670014 1630571 1544959 1465406 1404836 1351576 1296449 1234537
18030 1234537 1145094 1052328 995918 946665 932045 951993 989239 996951 992496 1001566 1003750 992924
18018 992924 1006048 1013529 1056621 1131357 1258401 1430919 1661045 1927109 2120934 2279144
18008 2279144 2376877 2429181 2499267 2558356 2604932 2604308 2500431 2340753 2204957 2138243 2151320
17997 2151320 2208129 2273110 2363740 2457971 2584813 2741431 2921824 3128745 3390767 3715720
17987 3715720 4149337 4707839 5344527 6163287 7249523 8741323 10845379 13934650 18611778
17978 18611778 25784887 37134269 55957455 86308634 124800726 156409051 176490672
17971 176490672 182253725 164919678 133930843 100880780 71614761 49965494 35551536
17964 35551536 26197716 20239887 16435083 14008480 12429727 11343352 10540676 9877004
17956 9877004 9295232 8853170 8505023 8207573 7888883 7489437 7027104 6550555 6134280
17947 6134280 5818685 5607270 5565397 5655126 5887429 6260176 6678656 7167125 7714733 8310663
17937 8310663 9021949 9893580 10945946 12216364 13822498 15923818 18803385 23010106
17929 23010106 29468944 39415901 54779876 79073117 118750596 181026032 260293101
17922 260293101 332795869 381687385 397839106 370134982 308351293 236475540 170473502
17915 170473502 119022103 83474430 60042153 44693473 34474111 27498433 22614857
17908 22614857 19092497 16499047 14514462 12937138 11677150 10664461 9832652 9151143
17900 9151143 8497418 7825661 7230088 6699416 6254481 5950897 5838177 5881846 6113201 6522020
17890 6522020 7018936 7519346 8002680 8397787 8734815 9078369 9491610 9943543 10478369
17881 10478369 11184962 12243763 14035689 16913582 21523363 28816253 40306493 58957885
17873 58957885 89773308 135094142 181663192 214131551 231250993 221727624 187080101
17866 187080101 144756545 104509728 72499651 50520753 36047213 26598518 20305603
17859 20305603 15901773 12719033 10369572 8600300 7338583 6366358 5625600 5019590
17851 5019590 4489285 4054284 3698374 3399915 3147653 2949130 2792348 2687783 2624877 2627507
17841 2627507 2739198 2944802 3150741 3304614 3384310 3352351 3281576 3234361 3123132 3015316
17831 3015316 2805824 2508135 2196132 1939094 1701828 1501521 1344195 1233699 1143968 1115631
17821 1115631 1091317 1065314 1048913 1045265 1035578 1002443 949095 881602 875780 895199 906073 881740
17809 881740 863392 835807 821781 844855 837140 800102 749498 734623 772878 782338 787291 799602
17797 799602 789245 832822 912408 941344 1001282 1096335 1183336 1188101 1135130 1068775 1011534 905882
17785 905882 821351 780775 750045 727035 721784 708201 698665 665915 612768 542588 457360 425652
17773 425652 421046 420243 388718 383217 374960 385158 425371 468577 485689 496237 531640 584930
17761 584930 601081 617103 615540 637314 674102 686137 695969 694275 698472 707058 693001 684744 683804
17748 683804 668857 647038 602771 583397 600814 613187 619076 649448 636688 621568 595674 550903
17736 550903 522734 536834 540329 506652 474856 452793 433166 424880 418998 413286 402011 393479
17724 393479 379104 363777 372218 391401 377419 356699 381970 413770 439155 463277 459255 463441
17712 463441 506537 521731 528472 554580 553676 515404 516598 506503 512191 527804 557513 597576
17700 597576 630001 656852 647690 635246 605408 606558 588303 532552 475789 419463 390409 364462
17688 364462 350497 354858 351521 338589 333199 313804 290675 269738 270729 312888 320639 320310 311264
17675 311264 308919 316066 317377 320347 317889 337547 338624 336535 323853 312437 316130 331124 345507
17662 345507 307841 281537 287712 291287 299447 311085 339009 343619 332804 315577 283690 265109
17650 265109 265827 266002 276126 291188 305955 312511 350348 380838 401891 429444 431916 448857 469935
17637 469935 519358 554999 572588 623207 683737 741088 753883 721219 751804 832817 943268
17626 943268 1004467 1042474 1004816 934896 921965 988502 1080335 1169038 1217582 1180841 1127956
17615 1127956 1100516 1070895 1100179 1128926 1084925 1035689 979544 903109 850127 835204 812229
17604 812229 781282 748829 691057 642579 601049 576198 544477 501599 479775 463631 432795
17593 432795 405124 397024 392986 378229 399739 419992 441477 481912 512071 526949 564951 613683
17581 613683 640579 663503 674958 686631 712978 765157 839512 876472 846071 791768 768163
17570 768163 799774 872845 951393 1014682 1036391 1057726 1087751 1172241 1341175 1527610 1646278
17559 1646278 1649039 1567891 1498579 1493543 1510374 1499386 1420015 1258518 1146559 1073419 1077980
17548 1077980 1166612 1272124 1322524 1297544 1232495 1201849 1209236 1217647 1166963 1033639 878056
17537 878056 727847 609265 532260 458692 438340 417189 384536 372481 361355 342800 343546
17526 343546 329817 302955 341667 396408 413261 432834 422978 401315 397872 422873 425522 415976
17514 415976 439482 499893 572261 691249 815845 890860 921403 904054 868803 882922 931842
17503 931842 932721 874523 812147 754925 740575 766945 865920 968718 1018824 1007656 976759 959833
17491 959833 984641 1027312 1038020 954837 823499 673972 554873 510234 485043 434571 404894
17480 404894 384281 370000 369698 371750 375410 347281 343352 328523 334004 378077 394072 415841 468488
17467 468488 549168 666065 817733 997715 1182790 1296864 1323656 1253467 1161178 1066910
17457 1066910 1011697 974377 957872 981032 994816 989180 1012626 1092050 1121765 1179287 1268302
17446 1268302 1307656 1350852 1431294 1561826 1743821 1924515 1984347 1929382 1827000 1750936
17436 1750936 1703153 1696859 1733876 1726369 1690883 1589469 1494929 1466402 1435425 1420370 1395317
17425 1395317 1339298 1264938 1237580 1194084 1186096 1172554 1186913 1196607 1212057 1287612 1482647
17414 1482647 1823701 2179982 2471246 2614653 2595539 2375599 2079574 1780781 1521933 1324732
17404 1324732 1139102 969931 827024 730208 666790 675156 746994 802372 879127 924276 923764
17393 923764 838336 755751 711870 670727 633460 611584 585393 578904 569156 574096 595176 608554
17381 608554 582569 541728 537300 563086 588798 597684 638657 648739 685221 695047 667869 666437
17369 666437 677739 730227 761177 807804 935187 1099517 1356024 1667204 1896178 2045967
17359 2045967 2056543 1932875 1752309 1550773 1405545 1274737 1187973 1164515 1167354 1136455
17349 1136455 1120450 1123969 1080650 1049753 1032969 1038130 1031602 997657 924503 843646 820482 782761
17337 782761 778247 798430 820779 845047 885632 927708 973858 993262 978487 931489 861216 782676
17325 782676 765778 784156 807978 880580 910778 884835 848852 819480 758289 737204 770701
17314 770701 774966 778941 789007 772206 781802 815236 822489 802506 794847 791410 785311 771454 776027
17301 776027 784121 785713 809928 839245 877503 888670 878828 923744 943015 938994 894166 859585
17289 859585 807404 778702 782135 805135 857639 880370 859485 847961 855611 889574 896035 862672
17277 862672 824947 816469 821977 804647 790034 767360 761066 788798 796186 782784 770188 729178
17265 729178 696084 693065 685287 701524 696706 695254 737828 771130 814138 860506 836628 822097
17253 822097 848275 832858 811191 798615 797623 817974 815556 824243 856489 922627 977302 969758
17241 969758 938547 896578 894497 923715 935698 948477 944732 942713 965441 979125 960135 938632
17229 938632 915117 880001 848185 847894 895125 915788 953194 992966 964503 914613 893183 906842
17217 906842 927475 942711 918669 908725 954270 987363 1008436 1040344 1058026 1055633 1049730 1077096
17205 1077096 1094697 1111225 1155978 1191757 1214338 1203178 1209609 1221775 1262915 1270281 1292506 1317872
17193 1317872 1332965 1372814 1403229 1423938 1463678 1500845 1532569 1545207 1523582 1513280 1491186
17182 1491186 1507412 1528528 1548351 1577854 1585969 1574211 1595378 1609331 1637788 1666789 1698585
17171 1698585 1732339 1730989 1747548 1776286 1775862 1817136 1896515 1967464 1988691 1997678 2030644 2070745
17159 2070745 2136453 2234524 2368987 2530191 2612667 2654638 2628806 2569449 2508693 2445791 2399799
17148 2399799 2433572 2494791 2518640 2525283 2570338 2699121 2823935 2936161 3014349 3121576 3249595
17137 3249595 3410360 3555444 3696337 3848868 4021561 4235512 4502229 4832552 5172670
17128 5172670 5539454 5973766 6499767 7199954 8171098 9524302 11401661 14086534 17723518
17119 17723518 21695092 24973638 27667967 30887724 36002723 44187910 54800605 64408431
17111 64408431 69387668 70590654 71718271 76694371 87998617 102636117 113394833 115805866
17103 115805866 111585422 106621226 106976722 116107745 130249844 140196262 140408582 132152488
17095 132152488 121973351 116828083 120937608 131275308 138005634 135065412 123782842
17088 123782842 110021714 99932667 97196708 99485341 98917867 92008228 80755267 68441050
17080 68441050 58489492 52527555 49460900 46451877 42445932 38105047 34198227 31531569
17072 31531569 30614977 31696495 35106570 41400224 51205799 65137313 85069827 113327728
17064 113327728 145360964 169577353 180699511 183759082 185219000 188984965 193542390
17057 193542390 192622351 186901729 182978234 183636648 187946838 197163434 216238617 244324434
17049 244324434 269749559 283443899 285923527 281065116 273916046 265750186 251733542
17042 251733542 232019459 213400829 197844340 181008044 160377005 137822477 117796016
17035 117796016 104470487 99621984 99215864 95810904 87186539 75340194 63283313 53945632
17027 53945632 48398599 45242976 41968938 37798761 33255266 29190578 26390446 25221529
17019 25221529 25784659 28222502 33104465 41841912 56581135 77549133 98347461 109568207
17011 109568207 109704571 105177560 103726075 108758067 114759913 113541044 104566228 92957725
17003 92957725 84565315 84899019 98374817 125147215 155048830 171770994 169955514 158199957
16995 158199957 148507105 147629954 149938812 143534146 125332703 100648963 75700931 55018957
16987 55018957 40071250 29973501 23287110 18874588 15915709 13870440 12393184 11309102
16979 11309102 10463122 9811162 9376007 9170128 9119876 9097717 9065325 9039471 9065187 9270012
16969 9270012 9578829 9956205 10408837 10949652 11683745 12739158 14224184 16334167 19441089
16960 19441089 24108565 30792448 39034147 47602611 56411781 65433671 75097963 87680761
16952 87680761 102880217 116998169 129429840 138605463 142686130 146827755 154377683 163907652
16944 163907652 174963608 183586410 185514332 184532793 184670366 190086862 202551087 215367429
16936 215367429 223466051 226349228 221766973 215948566 215357847 216896370 217768555 215860074
16928 215860074 205081240 188652311 173073076 160988404 153966625 149599812 142944906
16921 142944906 133627111 122074652 110679323 102969408 98098967 93626847 88735936 81281706
16913 81281706 71604232 62274073 54103638 47092971 41131120 35327820 29330514 23754574
16905 23754574 18947531 15094745 12211205 10124504 8659071 7548759 6658924 5924220
16897 5924220 5277090 4667331 4155250 3716032 3363357 3063835 2831708 2610618 2395654
16888 2395654 2204630 2061913 1958258 1881861 1780996 1681326 1576154 1490580 1453666 1429466
16878 1429466 1373519 1298584 1198774 1134524 1074953 1031233 1018087 1018385 1024709 996181 931739 886451
16866 886451 840984 827421 790332 766617 714406 639039 610737 599587 553528 546897 517088 473361
16854 473361 458708 419458 374289 371907 359219 334119 337594 323995 292643 276800 266904 259146
16842 259146 249141 247117 242650 240152 240675 220919 207266 204199 193612 140051 109221 100337 105513
16829 105513 133477 149262 135508 141987 137941 134663 122922 140613 162496 162636 163370 132442 106157
16816 106157 112196 129388 145465 144748 137350 149415 130764 107829 150887 149177 138711 119953
16804 119953 138523 157603 170351 163994 128168 110818 106113 106620 85846 59048 74711 96831
16792 96831 94909 89024 101977 55418 1055 -25872 -21709 -28670 -33714 -43847 -54210 -51293 -49189
16779 -49189 -62722 -65293 -76050 -70058 -36852 -15860 -36669 -63764 -106441 -111225 -136657 -150225
16767 -150225 -132347 -133334 -149040 -131543 -126815 -116352 -135989 -134075 -135754 -134795 -112601 -66883 -41173
16754 -41173 -51173 -66028 -61355 -46084 -74914 -77500 -39193 -471 -16770 -11951 -28988 -41827
16742 -41827 -26026 -45686 -72288 -55486 -37574 -40518 -47273 -69192 -57059 -35979 -21799 -39136
16730 -39136 -74762 -61491 -61123 -66034 -92763 -99476 -105577 -79926 -52414 -61757 -84253 -101482 -115270
16717 -115270 -83316 -101600 -127589 -128403 -133722 -145499 -156820 -138106 -94714 -90316 -92253 -119338
16705 -119338 -143016 -116656 -71043 -79979 -113349 -145260 -154370 -141288 -117060 -106172 -130730 -139045
16693 -139045 -132870 -136505 -126503 -113603 -95810 -103025 -137932 -145533 -128754 -114828 -123500 -130177 -186664
16680 -186664 -211153 -205768 -169383 -162238 -168318 -166069 -167747 -155452 -142006 -118952 -96994 -89316 -89875
16667 -89875 -137028 -145100 -151338 -182713 -182779 -209116 -197483 -175600 -156785 -143232 -145750 -137328 -141643
16654 -141643 -136283 -145023 -156478 -141592 -108239 -94814 -108384 -126285 -128371 -134796 -128077 -133393 -137129
16641 -137129 -154995 -165659 -152749 -150986 -148536 -153780 -163392 -155027 -119263 -116206 -112453 -88288 -67235
16628 -67235 -59737 -65883 -75978 -107706 -117336 -106373 -118780 -119660 -128702 -122600 -119999 -127494 -125136 -119652
16614 -119652 -101226 -88817 -80246 -86256 -79164 -91158 -90220 -105708 -116786 -100116 -99215 -90023 -70802
16601 -70802 -78562 -64579 -70417 -82965 -113838 -101552 -89933 -73316 -35081 -21298 10424 17617
16589 17617 29058 47309 75814 119141 180249 258869 316788 333234 339260 358419 410082 469499
16577 469499 531864 575235 555096 518490 492004 509662 581171 653178 692582 674073 606636
16566 606636 568136 583928 630398 731468 844979 964328 1063626 1125356 1140533 1114659 1075646
16555 1075646 1084644 1091238 1056016 948849 787556 653078 560281 506780 536241 625518 706438
16544 706438 728603 727592 705657 690004 740013 790338 752106 633317 486041 400966 366832
16533 366832 394697 393677 371584 333631 320881 355288 414907 486636 559364 562209 509927 478467
16521 478467 503111 550776 588663 609196 598170 576339 536385 540734 589757 678432 753920 884170
16509 884170 1007880 1101952 1095229 1042796 1017114 1012904 1014687 993219 906460 763831 622835
16498 622835 560460 525037 541804 612221 682043 687719 622603 575214 558127 573599 577223 533929
16486 533929 431169 316497 218228 151228 62151 15575 -18361 -45700 -41340 -47322 -41113 -58729
16474 -58729 -63960 -82027 -87868 -101202 -126331 -109074 -78941 -78337 -105855 -109570 -104861 -88945 -73294
16461 -73294 -76584 -76156 -86797 -83875 -93917 -112078 -87577 -56784 -43894 -19886 16314 46532
16449 46532 107100 176488 250321 295945 347973 406124 459370 500974 516319 534387 551651 598454
16437 598454 687318 751453 782606 793062 815001 850820 906691 979072 1064603 1137595 1140959 1086378
16425 1086378 1037598 1076792 1106283 1120487 1115523 1027437 936450 867742 810679 799975 762533
16414 762533 741379 719283 624958 536197 495656 479731 511490 502689 433501 346484 272431 240319
16402 240319 215638 183720 127647 46099 20415 -8055 -43469 -57137 -50881 -62736 -102663 -109191
16390 -109191 -86592 -67496 -52806 -49329 -85896 -100745 -77835 -69487 -58829 -72714 -80878 -104052
16378 -104052 -118772 -103168 -93204 -109905 -141852 -144491 -129773 -83578 -73508 -93762 -89902 -103001
16366 -103001 -110759 -130340 -126081 -110261 -119764 -142905 -158873 -139318 -137577 -152600 -153242 -142705 -134238
16353 -134238 -133224 -139258 -128847 -167915 -159339 -140978 -115354 -107477 -97136 -109660 -91512 -92157 -110321
16340 -110321 -101887 -90862 -111970 -107845 -102233 -90575 -126294 -128521 -100063 -81837 -86534 -115809
16328 -115809 -141451 -130279 -100508 -128761 -146719 -147577 -124213 -113919 -133417 -151922 -139712 -137637
16316 -137637 -123693 -125985 -142021 -146459 -136037 -119732 -103607 -106706 -122535 -105456 -77300 -64049
16304 -64049 -90042 -99089 -91306 -115031 -101136 -76007 -55881 -88471 -73084 -50655 -46945 -37514
16292 -37514 -17962 -1680 -14797 -150 15436 3242 -38385 -68369 -56802 -47813 -74817 -108777
16280 -108777 -107194 -108946 -96962 -70830 -71279 -70881 -90587 -95457 -83905 -76065 -72283 -73638 -68839 -82369
16266 -82369 -116054 -146567 -165407 -145527 -120373 -110884 -104732 -88689 -81607 -101323 -101902 -75531 -95128
16253 -95128 -102912 -99756 -111782 -116003 -119095 -133092 -130145 -137126 -117068 -111903 -92130 -79776 -91214
16240 -91214 -118760 -103296 -118446 -117625 -112566 -129261 -123127 -115934 -88877 -59307 -81252 -103241 -124131
16227 -124131 -117618 -106526 -90956 -92920 -103339 -126147 -125381 -114018 -112844 -110635 -103776 -97598 -105528
16214 -105528 -115744 -110328 -131026 -106409 -99620 -122703 -145315 -136901 -103522 -117990 -119913 -119747 -122762
16201 -122762 -135868 -146114 -145614 -147719 -143144 -126975 -126666 -132641 -120447 -101211 -73922 -64875 -83685
16188 -83685 -75737 -70110 -73039 -51736 -66810 -90346 -109454 -112381 -104260 -94695 -61209 -54517 -59712
16175 -59712 -72490 -65360 -60290 -82455 -55588 -50067 -57355 -70082 -88662 -92613 -90311 -97208 -103915
16162 -103915 -98450 -77036 -78311 -108522 -128586 -100572 -76587 -73509 -82977 -96199 -111837 -118539
16150 -118539 -124804 -129501 -137562 -157231 -152806 -145576 -144136 -126827 -104375 -102982 -87969 -72577 -78079
16137 -78079 -83384 -72711 -93514 -102465 -110444 -117887 -128820 -115327 -131342 -125345 -100170 -87613 -83555
16124 -83555 -74231 -84947 -91247 -88690 -61228 -43808 -52671 -97126 -107486 -141585 -154563 -141423
16112 -141423 -161683 -118039 -99660 -108578 -93461 -93612 -82741 -73537 -85509 -94831 -89921 -79842 -74103
16099 -74103 -62270 -58414 -54594 -60238 -80411 -96002 -98020 -113094 -111081 -113661 -103950 -92732 -103017
16086 -103017 -105198 -106674 -114465 -70846 -60440 -57318 -44824 -56312 -97668 -107097 -110452 -102417 -97452
16073 -97452 -93808 -93596 -98268 -91691 -78040 -86970 -115409 -128416 -97251 -70794 -51171 -34740 -62008
16060 -62008 -101778 -112542 -80900 -55724 -68974 -68034 -52871 -79838 -116173 -128003 -115347 -104237
16048 -104237 -113945 -110027 -106982 -108977 -71682 -51893 -64577 -72021 -97156 -144846 -160827 -144976
16036 -144976 -151323 -155542 -158919 -125269 -107408 -110410 -120963 -138912 -131810 -101300 -83253 -85581 -85837
16023 -85837 -97222 -107664 -116203 -136690 -114966 -92475 -71565 -94725 -96704 -105082 -102819 -110112 -88971
16010 -88971 -90824 -70789 -28535 -5988 -11282 -51452 -80258 -87780 -71541 -63438 -71664 -68572 -68186
15997 -68186 -63656 -43801 -59113 -82060 -102556 -107782 -107202 -110353 -110384 -109495 -98775 -82762 -86475 -98643
15983 -98643 -120154 -123186 -130802 -114915 -119532 -117061 -107479 -104478 -88479 -90171 -88029 -118680 -110490
15970 -110490 -81010 -72149 -71530 -68177 -99778 -87031 -63527 -71470 -108093 -100294 -73729 -63745 -78278
15957 -78278 -76777 -55770 -42859 -50089 -62231 -81186 -99039 -105549 -96490 -71174 -76770 -74543 -59881
15944 -59881 -74996 -88253 -75716 -80943 -103351 -102647 -97779 -112840 -92367 -88255 -95094 -114628 -95891
15931 -95891 -95928 -109185 -121573 -108904 -78763 -102415 -113020 -114308 -140510 -153654 -118019 -74243
15919 -74243 -86006 -111380 -124394 -127803 -108249 -117049 -113686 -100624 -71212 -68092 -76855 -73025 -79318
15906 -79318 -63081 -72131 -112923 -122557 -104598 -84127 -108058 -136394 -131311 -130078 -138895 -118095 -99491
15893 -99491 -73765 -53169 -58181 -44211 -29830 -46854 -66705 -68406 -59844 -49004 -61731 -69128
15881 -69128 -77740 -73707 -57824 -53697 -56739 -74263 -91233 -77714 -96038 -112602 -80634 -71827 -70210
15868 -70210 -57897 -55931 -78062 -79421 -78293 -91548 -104330 -113705 -104165 -104013 -110642 -100382 -84253
15855 -84253 -80704 -83680 -104498 -85986 -83422 -83530 -80621 -69163 -85534 -101517 -91242 -91812 -68207
15842 -68207 -66927 -53804 -59412 -65700 -60188 -58957 -66164 -72949 -79821 -97338 -132992 -150050 -120073
15829 -120073 -99629 -104746 -72590 -78819 -85692 -83540 -76237 -71540 -75711 -86362 -65836 -62836 -61330
15816 -61330 -49443 -59775 -69668 -79096 -95623 -85654 -82677 -70994 -80943 -90424 -108958 -114902 -102955
15803 -102955 -99322 -111674 -125759 -117924 -88313 -84751 -126652 -102424 -67568 -41000 -54953 -75896
15791 -75896 -88866 -94117 -101492 -96268 -93940 -101450 -117489 -114488 -94757 -84177 -96158 -110618 -115029
15778 -115029 -114553 -106878 -95986 -79742 -110979 -111521 -82201 -84943 -81112 -81814 -57943 -68515 -84441
15765 -84441 -93480 -74557 -56991 -52285 -56465 -61920 -84392 -73426 -68473 -84641 -78887 -59313 -49200
15752 -49200 -63877 -74378 -90031 -79414 -72461 -101261 -89363 -94307 -115480 -91646 -81328 -81910
15740 -81910 -91564 -72945 -67022 -75565 -55728 -49704 -50251 -76046 -79440 -55793 -34572 -63688 -79423
15727 -79423 -86567 -74027 -81132 -60140 -70864 -128008 -107527 -85528 -73838 -52710 -71637 -86626
15715 -86626 -79944 -50890 -31921 -26996 -46700 -46890 -61399 -82030 -75127 -77419 -74794 -85383 -91002
15702 -91002 -105160 -103003 -97710 -92345 -95973 -99466 -78108 -64973 -76487 -93457 -100434 -103323 -82680
15689 -82680 -59834 -76892 -74818 -58405 -67191 -65009 -90423 -122341 -111736 -86166 -67581 -53796
15677 -53796 -55691 -50562 -43130 -44217 -58054 -55115 -51637 -55762 -79229 -87459 -82352 -99815 -119522
15664 -119522 -127655 -96109 -119670 -98054 -75860 -53036 -64946 -82827 -64411 -64733 -78503 -62433
15652 -62433 -57611 -92456 -72872 -66252 -63414 -77029 -67849 -51692 -33090 -37538 -16567 -17568 -48240
15639 -48240 -56894 -59912 -74138 -91721 -106606 -89001 -100216 -91202 -55463 -37606 -43310 -61733
15627 -61733 -75454 -78493 -69213 -75515 -107735 -135123 -121242 -95665 -85762 -101814 -109100 -106326 -92909
15614 -92909 -87912 -94040 -94228 -90484 -74711 -63596 -40921 -64336 -89130 -75285 -73835 -51728 -55756
15601 -55756 -86886 -91960 -78018 -79868 -74921 -76687 -82766 -92608 -91182 -116370 -134341 -123092 -93678
15588 -93678 -111738 -103915 -86695 -102705 -101134 -84390 -60570 -64359 -62602 -69614 -90342 -80488 -73300
15575 -73300 -92810 -92096 -68504 -57366 -52754 -63104 -68697 -49909 -34748 -53355 -45521 -24014 -42908
15562 -42908 -58688 -60352 -81122 -94079 -78166 -40267 -40163 -54886 -25461 -15663 -34970 -32578 -18216
15549 -18216 -29969 -50166 -56325 -67409 -88399 -97841 -98244 -70848 -47245 -63260 -66084 -51295 -54612
15536 -54612 -67252 -71044 -86846 -79835 -76945 -82269 -57304 -27780 -58780 -83718 -74488 -54466 -45733
15523 -45733 -26915 -58933 -72447 -65812 -55284 -54285 -37986 -46437 -56478 -58686 -46984 -53401 -74258
15510 -74258 -84907 -91067 -90888 -75419 -68820 -62473 -57990 -55787 -47220 -50475 -84648 -88069 -94158 -109138
15496 -109138 -105743 -104555 -89800 -69516 -67575 -53317 -77631 -73205 -50490 -28226 -39556 -65613
15484 -65613 -59501 -51769 -22904 -16184 -27111 -5438 73464 153291 200699 197166 182370 116018
15472 116018 58057 15028 -12463 -6168 -26995 -24096 -12029 -59516 -75420 -86059 -97189 -101300
15460 -101300 -81276 -89715 -100207 -94396 -67150 -44152 -59570 -88248 -103920 -101101 -72350 -38574
15448 -38574 -60498 -52736 -63323 -23218 -12560 -9889 -18135 -35387 -50174 -57059 -50648 -35723 -31514
15435 -31514 -16306 -13329 -18325 286 -5867 -3215 -15889 -44704 -62951 -39453 -30259 -20883 -34710
15422 -34710 -59861 -82290 -35558 -7874 10753 21429 54255 46409 46099 63306 72196 51243
15410 51243 28417 10375 -22193 -38607 -36536 -46760 -59261 -73834 -66491 -42644 -44686 -35349
15398 -35349 -37037 -50618 -78899 -82984 -62320 -51863 -53536 -53358 -76080 -92431 -103209 -57783 -34469
15385 -34469 -41327 -52957 -62223 -49404 -50468 -59821 -58908 -54657 -61599 -73094 -54372 -44059 -24934
15372 -24934 -25044 -31984 -15097 9407 4573 -23135 -44716 -52828 -48457 -59594 -43091 -41741 -33845
15359 -33845 -45273 -68049 -102086 -103603 -75199 -46656 -28539 -42596 -59618 -72073 -92647 -106631
15347 -106631 -109128 -82920 -58202 -66538 -49003 -41400 -54700 -60430 -46458 -39212 -28128 -55347
15335 -55347 -74249 -62080 -57381 -45590 -50402 -48689 413 15160 -9623 -20576 -26223 -28883 -30909
15322 -30909 -33480 -25807 -42867 -69777 -66838 -64379 -71512 -48360 -30899 -45503 -55248 -62005 -79410
15309 -79410 -89910 -79213 -74940 -57324 -55029 -49150 -58235 -66650 -49711 -30012 -36773 -44570 -44918
15296 -44918 -56385 -67425 -44061 -59802 -65371 -42259 -38081 -39041 -14877 -17287 -53400 -66937 -57905
15283 -57905 -19169 -22350 -22252 -28585 -19420 -11274 -13182 -14355 -17224 -28683 -28673 -26994 -35083 -49889 -45898
15268 -45898 -40628 -51615 -51353 -36279 -37938 -43684 -45971 -65276 -84514 -77656 -99528 -111558 -90344
15255 -90344 -71565 -82137 -54170 -57574 -60953 -71350 -71879 -64582 -64778 -28030 -12302 -32655 -79755
15242 -79755 -95267 -77126 -58932 -46771 -55763 -80004 -82662 -76602 -88807 -95082 -69818 -23214
15230 -23214 -9817 -274 -24334 -40783 -63796 -66743 -65632 -48155 -52798 -77312 -48229 -3296
15218 -3296 25746 2111 -14146 -14109 -37104 -63226 -71462 -81376 -81177 -65493 -44699 -11693 3165
15205 3165 4015 -16367 -46836 -58313 -71306 -57970 -87117 -80986 -88412 -83769 -44877 -31280 -52984
15192 -52984 -76332 -63416 -66180 -107865 -114670 -97759 -80345 -61684 -46301 -36999 -51054 -86647
15180 -86647 -90348 -68577 -91770 -101876 -85508 -47361 -29549 -42738 -31863 -32645 -61459 -74866
15168 -74866 -68903 -58528 -83724 -98498 -93753 -71770 -62107 -49744 -42893 -62274 -63097 -67798 -77369
15155 -77369 -84989 -33005 1579 10567 -13618 -26157 -43996 -62578 -62299 -65952 -37858 -9905 -8832
15142 -8832 -23632 -39301 -22640 -3640 -17270 -44830 -52506 -57929 -63236 -59582 -73867 -40704 34265
15129 34265 13153 21104 19711 26642 6665 -19557 -3512 11602 2180 -17 -5066 -35165 -41197
15116 -41197 -52672 -65981 -56676 -59659 -58434 -48459 -32914 -33077 -21278 -31117 -35510 -35692 -52871 -45608
15102 -45608 -20516 -20289 -25513 -22334 889 -7450 -37366 -46560 -36102 -2338 793 -36085 -31896
15089 -31896 -1838 -5892 9172 20481 -10107 -23982 -17670 -10258 1112 -8100 2772 -12149
15077 -12149 -13311 -9877 -14095 -21418 -17011 -26928 -52228 -60515 -77139 -71161 -67264 -55344 -53263 -53592
15063 -53592 -48540 -19774 -14760 -25670 -7453 -2737 36 747 -2638 -46490 -51082 -32812 -24364
15050 -24364 -26746 -34021 -7009 -19287 -25459 -14874 -6148 3932 22562 10698 -17443 -6638
15038 -6638 -22431 -47697 -55267 -18175 11490 -9077 -27183 -48697 -40864 -1236 3557 -21760
15026 -21760 -41281 -45406 -32207 -67324 -72987 -45262 -22236 -27413 -15223 8990 -8218 -43273
15014 -43273 -28615 -13875 -19253 -18511 -26359 -52209 -50167 -63107 -48579 -4474 766 -25298 -24774
15001 -24774 -18317 -23402 -41245 -48637 -42253 -15764 -1587 -14072 -14988 -21666 -7162 10210 4111
14988 4111 -1875 414 -6392 -6256 16417 558 -13143 -14809 -5823 24654 29367 22166 17589 14598
14974 14598 37327 19207 20420 34667 28547 -10080 -11301 -19738 -6224 -8650 -15394 -25671 -13910
14961 -13910 -7719 -8884 -7008 16700 2168 -4197 -11761 -7270 -11493 -11251 -2120 -362 17717 -10491
14947 -10491 -40918 -39906 -5379 -26398 -51553 -73969 -52003 -40994 -26776 -17735 -43720 -32388
14935 -32388 -27974 -44420 -43539 -39543 -40735 -28855 -9622 12011 24489 31894 37529 5851 -20348
14922 -20348 -12135 -19327 2493 34421 18108 -20482 -42929 -51043 -65385 -69355 -67322 -38245 -9847
14909 -9847 -28164 -19907 8858 -16883 -16102 3140 3622 9804 20358 -4447 -28524 -11415 2892
14896 2892 37532 44241 23253 12727 4147 -13427 -17940 -10828 -33797 -51088 -47962 -60186 -62974
14883 -62974 -35190 -3834 -16311 -20185 3230 -5842 -42467 -39540 -16898 3295 4693 -406 -19975
14870 -19975 -11434 -24423 -50794 -40135 -4595 10364 2575 -2605 629 -7389 -20625 -15463 -10116
14857 -10116 -11402 12390 34344 29137 4096 -19581 -16817 262 -19216 -30346 -12104 8213
14845 8213 6054 22410 51528 56352 44175 -14106 11167 -374 -17528 -5246 14631 37916
14833 37916 92224 88727 46059 28538 -11787 -31703 -6030 4998 15171 16396 13247 14772
14821 14772 5769 5635 18862 39322 38526 40876 49971 44985 34631 31861 13117 -21828 -16089 11370
14807 11370 23897 21103 9685 6503 6471 -3372 -24274 -9571 13445 10059 -13744 -1232 -17359
14794 -17359 -5032 5541 -1327 -7378 -7418 15955 42327 51763 33858 -31 2128 -4206 -8363
14781 -8363 -41625 -21588 -9075 8064 36869 52173 1994 -11753 -20140 -22206 -26177 -13406
14769 -13406 -19063 -8544 16410 20637 32334 58036 53162 16404 6277 14232 10090 -8373 -17237
14756 -17237 -16019 -13739 -13546 23279 14702 17853 19157 10214 -371 15246 23571 16654 33663 14373
14742 14373 29522 36958 17376 9605 -15408 6675 30274 40872 43006 37809 25558 16767 303
14729 303 -18714 -18476 25214 27031 -17692 -20262 -35553 -31040 12964 8799 28717 32238 43473
14716 43473 28952 5042 20464 12985 -3494 -9193 6582 22704 20343 13196 28242 24399 3886
14703 3886 548 13353 30548 40239 22687 12550 -2620 -1088 -5561 -13042 -13941 -27179 -6809
14690 -6809 -6480 -28997 -32189 -14185 -4499 8713 28433 39679 33732 28301 34484 41639 17187
14677 17187 19578 43485 42715 39632 27524 12396 13284 42677 60265 45805 24417 17915 3245
14664 3245 -7212 -21140 1018 3921 5722 -2305 21128 59751 36248 25342 32115 35379 32846
14651 32846 30240 33567 25475 18593 5375 21969 40538 34837 43203 25590 12119 42727 65329
14638 65329 43560 40610 13143 1183 18808 23075 38354 24614 31702 36941 46664 48940 34646
14625 34646 11529 -2343 3433 21619 31539 39140 41206 19913 -2675 3221 2339 25800 59160
14612 59160 85879 81744 103839 97728 91577 100063 91582 77749 72607 71178 79620 77057 90158
14599 90158 74585 45188 49953 82443 128179 151845 142868 108687 117248 124192 110467 77764
14587 77764 74890 95683 133341 160139 103396 77477 78403 86714 110951 125050 134343 99641 89296
14574 89296 103959 104420 107034 102323 91110 79891 107598 124993 132342 131304 131745 100195 46795
14561 46795 44571 55671 58266 69007 54783 31399 44232 48518 59733 51614 60820 74019 75116
14548 75116 57763 57228 35614 18370 25752 33993 7557 6584 16717 12095 18512 31655 34933
14535 34933 41726 47291 39792 21094 21664 13355 40083 49506 55342 85087 84931 78106 83760 57871
14521 57871 37398 33370 32517 34259 57253 37955 25576 39651 42284 24716 28105 24122 41499
14508 41499 60129 77719 64559 62943 48845 20494 30145 42322 55154 42522 21136 1473
14496 1473 5067 9234 22521 12916 10889 30796 30474 5587 9769 27343 40257 24602 13983
14483 13983 5177 4563 54094 54774 38790 47959 47190 63200 88157 91797 62198 33020 28199 46912
14469 46912 81516 98295 134401 147250 136876 107576 111432 103795 89403 101354 120208 95790
14457 95790 64841 40847 56563 59559 98644 107958 96855 84590 81362 82823 82847 88057 104920
14444 104920 109658 91788 65416 60170 87580 94329 98138 112050 95474 83967 100545 133567
14432 133567 109974 87147 69573 78477 96857 102410 85138 67215 75155 72392 71448 70858 89132
14419 89132 79543 66874 59837 76788 65099 47751 45034 61121 78733 71369 72165 70111 72986
14406 72986 49557 44807 43258 24638 20625 68297 90555 89414 73069 35760 13867 29156
14394 29156 52007 57480 37146 27536 55978 101429 97645 60986 62087 54909 70846 71191 54853
14381 54853 58351 56082 59880 97056 103815 97676 106937 94746 83199 66584 55458 76833 60084
14368 60084 55905 71541 55466 85887 96587 75093 78786 79152 78325 80392 106132 82833 61608
14355 61608 43596 46721 39470 33763 36170 44658 43436 42210 48337 62988 73919 80332 78997 66439
14341 66439 53737 34673 57058 77412 96755 120635 121125 103625 85501 80645 81515 81297 87671
14328 87671 105359 102857 76923 55136 49470 68769 64225 63180 68392 81013 64786 53992 66269
14315 66269 75136 94054 105546 84524 50380 75545 75510 60720 57633 59073 71100 90105 112339
14302 112339 123474 108109 82869 72069 70355 75250 73606 85211 127473 101914 67065 75356
14290 75356 79474 81114 105908 102039 88000 69222 87485 131484 156228 159598 129905 104144
14278 104144 100414 67041 54418 45763 41124 60329 83899 84674 67544 56866 48403 61820 88144
14265 88144 77076 58825 38713 53799 89924 106437 97508 99497 86345 91126 112008 154181
14253 154181 145535 131871 131981 131147 83180 57322 46218 67162 82071 96064 89677 105336 90208
14240 90208 89775 93118 77175 64660 78360 92450 107051 130960 154901 145579 127898 125406 121909
14227 121909 103988 107188 106281 67524 46997 71368 70671 101761 113115 98874 100770 132748 126121
14214 126121 109725 92515 109323 126129 114410 103176 96566 121357 129917 122824 123873 131098
14202 131098 134854 125992 113537 90468 113802 119270 95524 102370 120216 145817 150058 144244 168583
14189 168583 156852 136023 143292 126259 116446 126341 119535 112126 89912 81369 83068 80362 104999
14176 104999 123957 120098 134731 154572 148976 124602 122595 130083 108218 107470 95192 93397 107091
14163 107091 107469 101520 100705 101394 117542 109701 93060 111899 123581 114983 121856 128478 125904 129143
14149 129143 136623 111930 86506 65026 59680 73263 79518 90879 87399 64766 54047 89573
14137 89573 117455 124506 118438 117033 114732 94377 130145 132177 116522 99228 92453 92874 118190
14124 118190 135597 164010 152746 154167 128446 140237 143744 135891 141935 136817 127123 104520 99841
14111 99841 139573 142017 99709 101984 130205 120593 96706 98925 128737 134860 127682 145282 160772
14098 160772 148933 137704 128576 140966 137459 148530 144851 108143 83018 100561 129604 163422
14086 163422 155937 135335 123850 139518 130940 141139 151918 151249 144402 143896 162235 171172 158329
14073 158329 164042 162852 173936 194512 215265 203304 164561 161054 154435 138805 157997 154256
14061 154256 160795 173126 165259 132187 129815 145704 148030 143438 121452 117781 117914 124936 123760
14048 123760 113278 129421 150116 171944 188669 177329 177940 166648 166554 155202 149699 141117 153251
14035 153251 167521 177275 187516 199411 192349 176103 178181 169064 146367 129598 132184 142084 158101
14022 158101 174646 164984 158706 174903 179561 170490 169327 165794 155686 158041 164945 179186 181196
14009 181196 177614 188780 200902 194999 187203 192996 210137 200115 166401 134367 137339 180936
13997 180936 218544 207619 176897 182831 202665 212672 194107 168256 185718 184377 183514 197691
13985 197691 212207 206090 194210 198097 202204 180497 165764 164693 186332 194494 185740 171652 171882
13972 171882 168930 168875 157786 177581 202663 212539 217422 222793 218177 204468 177661 182500 185971
13959 185971 178142 163235 141451 148947 170622 211388 207933 190920 197069 188899 197470 201076 191131
13946 191131 191152 216652 220111 218960 201283 209839 196989 177419 170642 190426 184054 167794 176698
13933 176698 170683 183989 205880 206170 210506 181525 174786 177852 182933 223889 239446 224377 211827
13920 211827 218419 227863 225798 236826 224309 212580 195439 180896 195898 201684 164496 153885
13908 153885 176720 215861 238754 221769 193387 189005 214465 193116 185406 213095 218961 237107
13896 237107 227584 200431 203229 205629 205291 185149 177168 186307 203265 212612 220279 232181 218854
13883 218854 197433 192893 216943 227830 232437 211892 195711 176877 196499 237672 245451 252958
13871 252958 248039 245279 267959 257791 247869 230463 228963 252068 260145 238127 222351 205076
13859 205076 195231 196683 216078 259398 265950 279643 277196 294502 295046 277772 243311 253891 250338
13846 250338 218343 223713 230588 233504 209107 210572 237978 238858 237778 238409 224514 230786 230313 239233
13832 239233 262466 246117 268468 283548 270849 253753 229261 200517 209055 238617 236474 231498
13820 231498 239904 244535 274351 292598 281140 264185 247913 263846 261281 243357 254924 259770
13808 259770 262046 246462 238253 214104 217961 267173 285960 305643 299073 263026 255279 241198
13796 241198 254315 265590 260011 250813 245899 243517 256103 268483 273096 300181 313449 291079
13784 291079 269108 265626 285328 307891 297933 271287 263735 246660 225539 245429 222700 212614
13772 212614 225610 251084 256944 277088 275898 251026 262291 268782 258823 266447 275677 304692 308420
13759 308420 293875 308183 310664 292295 280658 291283 272494 246422 246250 265844 276881 288984
13747 288984 291757 301948 319748 315119 322165 302802 295430 300455 280885 277921 306221 313535 307943
13734 307943 296307 278189 272342 287761 297097 322137 325898 314878 321952 300249 280288 281443
13722 281443 293348 308677 307240 302843 296166 294380 306309 355697 351965 339789 346427 346745 334120
13709 334120 327681 346088 341339 335017 328405 310236 324187 323827 318679 337718 340261 325610 328248
13696 328248 331632 337337 326283 351147 374240 408433 376924 341342 317626 344354 333380 342723
13684 342723 365688 353366 347228 355214 356334 350623 357416 367648 368124 332466 336826 366947 369779
13671 369779 375071 376013 371944 359906 340731 354551 372810 389569 389950 362501 371294 368936 360403
13658 360403 368312 367042 376987 386055 374124 353761 351492 346346 380738 389820 381071 352259 358014
13645 358014 379229 369953 362074 368099 356803 339511 349314 355434 382537 402967 395471 393068 377455
13632 377455 356937 352729 347086 352399 347676 359520 342132 326128 353893 371516 366090 345268
13620 345268 329139 336541 355445 374316 367431 382815 381687 395773 429248 416908 393175 376607
13608 376607 375730 374454 394661 405066 416363 410748 402059 408980 417445 405375 386669 392011 410046
13595 410046 430515 411686 376988 380304 412835 430514 423437 385302 350046 374701 404079 433318
13583 433318 460734 457721 449995 448669 454559 443853 412401 422551 433327 436174 441466 456129 454149
13570 454149 458023 463795 449503 428397 435685 449539 425624 422011 458448 462989 452008 465338
13558 465338 447926 439534 440763 431079 431958 454072 449279 453158 480804 466888 470800 462328 441355
13545 441355 435102 420392 442779 473892 483647 485210 456936 453167 443474 436536 434582 447421 472358
13532 472358 470397 468552 499640 500907 523581 538314 544052 523515 506786 505772 486426 508370
13520 508370 535653 529783 520571 514957 504795 504722 508304 509960 527972 535949 531531 519541 523513 525265
13506 525265 509746 522639 517180 499476 525631 557920 543177 536995 533518 525503 541399 541331 548842
13493 548842 553202 549458 549494 537280 527745 533665 544999 561194 578070 572266 546346 558035 580614
13480 580614 573467 564910 564249 553784 557435 566859 555366 561424 561157 553979 529527 537885 538912 521489
13466 521489 520320 542146 567092 578147 595884 596317 591456 579337 603011 609357 592969 583318 578442
13453 578442 574884 595350 603417 625190 623000 615513 599017 576490 591681 601219 616175 613758 599336
13440 599336 599430 600179 607756 607637 611941 610891 630006 610602 606954 604629 612496 629465 638989 676374
13426 676374 678587 678561 678739 667928 664650 653048 649966 656591 667046 666795 657177 671147 680440 655516
13412 655516 653852 655344 658424 686948 696181 690855 672866 656654 643931 674979 683213 678791 691876
13399 691876 697693 665372 654452 678960 706157 699221 730120 741969 722135 718500 719344 729708
13387 729708 743898 724203 717046 717997 717240 732137 733194 715151 743874 771712 783331 767822 766844
13374 766844 806188 819536 780159 754013 777645 787555 784243 781449 795848 815819 808960 790923
13362 790923 812543 824700 819233 806219 813019 848255 883349 861267 849064 849931 841494 849505 854857
13349 854857 839784 814402 795342 842554 875208 866927 856315 864666 841235 809512 826812 858709
13337 858709 878298 895802 909328 937570 918916 897506 909600 893996 887774 891276 880365 866037
13325 866037 881052 907771 912100 911974 924329 910207 906998 916646 939551 961494 962067 963769 960066
13312 960066 956770 951711 958450 964217 978763 975161 970538 981973 981993 963053 975388 997119 995131
13299 995131 975891 986011 994720 973115 977761 990332 1003198 1007638 1006637 1019776 1037635 1053207
13287 1053207 1071124 1085712 1050515 1024273 1041863 1047093 1033625 1039564 1039616 1050987 1072388 1102877
13275 1102877 1107621 1110278 1122966 1119870 1097816 1099577 1130243 1124804 1108890 1117613 1121667 1130988 1153863
13262 1153863 1167695 1176266 1196105 1196736 1170138 1152099 1138079 1140176 1122648 1156517 1201106 1210007
13250 1210007 1184763 1160410 1162471 1195252 1204931 1194070 1178045 1186203 1208939 1212752 1218498 1225059
13238 1225059 1217201 1222293 1225232 1235597 1246345 1215369 1202919 1216334 1212637 1220282 1238196 1244444
13226 1244444 1219406 1221368 1210393 1221002 1227562 1240840 1271694 1288283 1286943 1252427 1245431 1265664
13214 1265664 1257678 1230020 1214235 1225224 1229021 1252790 1264262 1271858 1264569 1255283 1270380 1279401
13202 1279401 1286252 1278589 1286938 1269070 1281273 1296265 1316031 1331417 1340957 1341974 1318681 1306195
13190 1306195 1351719 1359128 1342056 1304404 1298860 1330467 1355580 1329939 1319872 1345662 1366152 1338017
13178 1338017 1324137 1338577 1389730 1404890 1397731 1386803 1393205 1389918 1383772 1376518 1358045 1369912
13166 1369912 1383426 1405271 1408401 1394214 1404625 1393996 1395294 1393862 1404101 1411068 1444022 1440612
13154 1440612 1448619 1443995 1422186 1413755 1440738 1472187 1491192 1469141 1453696 1469029 1492208 1496663
13142 1496663 1496845 1499218 1521040 1521727 1514950 1500125 1499986 1536941 1546499 1555696 1575674 1597533 1594873
13129 1594873 1609912 1632894 1604944 1589470 1574368 1572286 1593315 1598732 1606523 1599891 1602282 1629010
13117 1629010 1664755 1671881 1653511 1673551 1675941 1666626 1646221 1664759 1699707 1687772 1699334 1718376
13105 1718376 1732075 1761121 1764743 1755427 1751623 1743488 1748678 1762253 1777719 1771492 1785545 1787181 1796422
13092 1796422 1803663 1811013 1822508 1821985 1826140 1844120 1851042 1854781 1855644 1873281 1896601 1910330 1881252
13079 1881252 1897372 1911931 1921619 1920269 1919390 1917202 1931600 1938793 1933193 1961070 2000358 1997393 2013220
13066 2013220 2004621 1985917 2001690 2022426 2020167 2048066 2080384 2079758 2045442 2042536 2075651 2099582
13054 2099582 2121978 2130717 2122975 2122812 2130085 2154674 2138163 2122909 2143457 2177386 2178503 2186002 2187150
13041 2187150 2172371 2193675 2201545 2213357 2244906 2277022 2284454 2285043 2286638 2307267 2313599 2297680
13029 2297680 2309310 2312655 2290629 2309067 2326405 2336154 2357839 2367490 2403549 2438567 2464067 2471743
13017 2471743 2452323 2430473 2459610 2492303 2498167 2494650 2493707 2517865 2529364 2541146 2570477 2579961
13005 2579961 2592491 2611247 2616024 2609711 2641273 2666832 2659099 2679183 2672243 2701409 2739808 2749740
12993 2749740 2736093 2767325 2793884 2816731 2840477 2852488 2860827 2853315 2862348 2881464 2889914 2918496
12981 2918496 2967735 2989390 2989460 3011001 3038869 3033129 3023660 3025345 3016397 3028818 3019190 3042937 3061738
12968 3061738 3104572 3139564 3160518 3177170 3201683 3226939 3234003 3261271 3251420 3231023 3262344 3301853
12956 3301853 3331820 3359011 3364670 3355114 3404410 3460972 3504697 3506829 3502894 3497923 3509562 3530877
12944 3530877 3562040 3586222 3624635 3664753 3666801 3663958 3694900 3722728 3759071 3817319 3842240 3824191
12932 3824191 3835635 3847743 3858459 3887263 3935011 3970163 3998683 4021456 4058011 4077826 4087870
12921 4087870 4108896 4137328 4149041 4153865 4183724 4213718 4211765 4237788 4259494 4289044 4290932 4319688
12909 4319688 4342743 4382725 4433275 4481703 4519504 4550049 4588974 4601319 4611927 4635356 4664107
12898 4664107 4676761 4729821 4775436 4783419 4803078 4852216 4884778 4908361 4930016 4958759 5015209
12887 5015209 5085464 5122672 5127228 5151621 5206220 5225706 5248043 5280738 5307029 5317973 5360150
12876 5360150 5384306 5406709 5453192 5491135 5537996 5602642 5623003 5663724 5697545 5717639 5786118
12865 5786118 5818676 5851855 5922651 5982704 6026317 6101494 6144523 6180996 6250982 6274885 6288413
12854 6288413 6304177 6333757 6388455 6463651 6531756 6596886 6629880 6647182 6707147 6777122 6833594
12843 6833594 6869259 6924870 6993878 7061655 7088103 7151005 7213418 7264456 7326367 7384830 7430549
12832 7430549 7489435 7573028 7643651 7709126 7745107 7794657 7849873 7887549 7956429 8054036 8133748
12821 8133748 8187249 8266355 8343179 8414009 8489513 8534464 8574320 8631002 8722472 8786935 8868532
12810 8868532 8940613 9020187 9101409 9208769 9300215 9367971 9448841 9536480 9620232 9682943 9725471
12799 9725471 9820378 9934601 10040588 10140131 10231887 10312625 10400348 10526091 10664132 10769218
12789 10769218 10861466 10947500 11040680 11132464 11235997 11357532 11494767 11635324 11774977 11870618
12779 11870618 11972065 12101572 12205084 12294947 12409351 12535014 12662059 12774764 12890685
12770 12890685 13042776 13201568 13348122 13479395 13614759 13781181 13903395 14040941 14200323
12761 14200323 14369300 14503620 14661068 14787200 14923172 15070615 15251039 15411193 15595601
12752 15595601 15813075 16035608 16206081 16355406 16544400 16759447 16941922 17108310 17292874
12743 17292874 17509342 17726109 17946066 18150376 18360589 18598009 18851046 19073892 19299387
12734 19299387 19517061 19723798 19943356 20176981 20445959 20713110 20962881 21214732 21487241
12725 21487241 21769372 22061740 22297159 22525025 22808412 23098831 23377974 23671437 23987329
12716 23987329 24289145 24568301 24890877 25206682 25557966 25905560 26219930 26550271 26908753
12707 26908753 27307798 27657286 28002922 28367840 28746973 29137356 29539008 29961279 30357122
12698 30357122 30750794 31166989 31580979 32005127 32447678 32913324 33352854 33785074 34231002
12689 34231002 34696340 35186165 35653894 36109586 36621826 37134366 37635297 38182138 38697108
12680 38697108 39214667 39740150 40297884 40888788 41429357 41959603 42536018 43119120 43696153
12671 43696153 44285865 44886559 45460717 46043847 46676998 47292028 47918226 48530547 49161736
12662 49161736 49780604 50409489 51063928 51698864 52335926 52968974 53607197 54269717 54923171
12653 54923171 55581217 56203265 56820176 57455216 58087327 58750464 59383006 60025703 60655110
12644 60655110 61260077 61850057 62467820 63052812 63614276 64208971 64781555 65380929 65945147
12635 65945147 66541101 67165050 67848196 68643361 69571962 70412397 70922985 71077304 71006665
12626 71006665 70883478 70848396 70904604 71021760 71157338 71293659 71453417 71600164 71727777 71849104
12616 71849104 71930023 71957321 71939196 71910198 71877360 71825821 71745237 71633843 71483625 71296585
12606 71296585 71108632 70892802 70631612 70366500 70059403 69721661 69366880 68971983 68539710
12597 68539710 68122598 67702993 67260651 66771314 66271691 65751579 65228785 64682979 64140321
12588 64140321 63546453 62948939 62388106 61801962 61206615 60577230 59937543 59308171 58705031
12579 58705031 58056039 57403554 56785363 56119701 55422167 54753656 54078984 53434809 52784478
12570 52784478 52111284 51452821 50823741 50154252 49475718 48830566 48178495 47553962 46917735
12561 46917735 46246359 45607355 44993970 44392786 43776067 43187022 42621642 42041360 41456231
12552 41456231 40878712 40279657 39691599 39155255 38630312 38069091 37516069 36985646 36473990
12543 36473990 35986247 35477231 34989502 34510613 34020297 33491482 33004347 32534434 32072704
12534 32072704 31589397 31129932 30682235 30244061 29834748 29430276 29014162 28588613 28174394
12525 28174394 27792424 27399186 27020681 26648254 26289185 25943188 25570170 25210211 24876775
12516 24876775 24570139 24206421 23859124 23505699 23203852 22904514 22586146 22274290 21975802
12507 21975802 21682613 21412791 21135805 20841884 20578835 20337818 20098566 19841405 19575482
12498 19575482 19326533 19072833 18800379 18556279 18303444 18069561 17857793 17632924 17420790
12489 17420790 17210722 17010715 16820752 16600563 16407339 16208565 16010941 15802270 15607090
12480 15607090 15398824 15217792 15054615 14873997 14715274 14547557 14363812 14195081 14046457
12471 14046457 13895711 13723400 13547212 13407761 13268645 13113392 12958148 12805271 12668600
12462 12668600 12538965 12357782 12203155 12064007 11948593 11815434 11677574 11567962 11439690
12453 11439690 11303586 11179775 11067516 10948200 10855055 10734398 10629856 10522116 10376011
12444 10376011 10246714 10186261 10125041 10032135 9917676 9789628 9684851 9563278 9453346 9389775
12434 9389775 9300811 9190423 9103546 8995864 8901852 8840147 8757423 8671055 8571484 8470580 8380810
12423 8380810 8308286 8239393 8154220 8085254 8016597 7915699 7820610 7744411 7667566 7617826 7580993
12412 7580993 7510034 7394937 7299221 7232497 7188194 7134229 7051731 6995124 6926059 6864025 6805888
12401 6805888 6752625 6719287 6637171 6554290 6481916 6425647 6375156 6317210 6273330 6240131 6193278
12390 6193278 6133503 6071264 5996644 5937747 5909468 5874806 5838723 5786568 5697808 5651720 5629972
12379 5629972 5586616 5566559 5507253 5460249 5430344 5398142 5333631 5271068 5242401 5249699 5224671
12368 5224671 5168139 5082504 5012096 4967417 4951796 4907961 4862462 4812594 4761837 4742802 4697927
12357 4697927 4650545 4619488 4581519 4535634 4495019 4466955 4457003 4439998 4418548 4370126 4308531
12346 4308531 4263905 4235681 4204140 4182923 4165018 4146000 4105428 4074795 4025650 3973099 3967825
12335 3967825 3957817 3920875 3895156 3846986 3820975 3805256 3789402 3770559 3768991 3740222 3687118
12324 3687118 3679704 3653630 3607231 3572936 3533029 3525395 3477531 3450030 3429604 3422289 3386517 3352896
12312 3352896 3317557 3296446 3268596 3240403 3251438 3231439 3233844 3212249 3197944 3149453 3147344 3130819
12300 3130819 3080670 3061052 3048436 3019750 2991626 2977863 2970048 2961389 2959108 2935679 2903037 2872957
12288 2872957 2856041 2857685 2854199 2816397 2784587 2756976 2752105 2750112 2727273 2711140 2704563 2700777
12276 2700777 2675761 2657232 2631590 2602595 2605900 2578555 2551519 2498792 2477231 2477276 2474112 2481943
12264 2481943 2475371 2464056 2426803 2394915 2388919 2380970 2354896 2331104 2314491 2305489 2279859 2267923
12252 2267923 2257897 2265164 2238377 2216073 2205509 2213343 2216130 2185710 2168516 2168637 2166591 2149321
12240 2149321 2136165 2084333 2084035 2071781 2063118 2072685 2018801 1988347 1992725 1979306 1967230 1951203
12228 1951203 1935759 1944280 1933912 1921097 1918394 1916750 1929091 1917372 1911364 1915153 1900207 1864505
12216 1864505 1860042 1865113 1853959 1838138 1843952 1820544 1786284 1751758 1724820 1726933 1735455 1704336
12204 1704336 1721983 1725387 1699432 1675110 1667460 1676130 1680239 1666901 1654514 1641754 1635690 1653913
12192 1653913 1627573 1627039 1598593 1589015 1557000 1518197 1516317 1521936 1536308 1529255 1527337 1513926 1510774
12179 1510774 1523772 1534699 1512468 1511220 1516616 1496729 1455200 1470311 1489116 1477806 1461139 1432380
12167 1432380 1403322 1432617 1455905 1417650 1391853 1385518 1363646 1361604 1389188 1379332 1371618 1361787
12155 1361787 1372073 1367440 1339491 1339735 1320909 1295624 1291394 1283690 1288546 1287804 1280441 1310903 1336475
12142 1336475 1330818 1320807 1312119 1278648 1259460 1254220 1306198 1363649 1405616 1514033 1634427
12131 1634427 1657033 1578017 1462143 1361676 1287641 1237558 1200264 1200212 1189676 1182593 1181625 1131613
12119 1131613 1092936 1115729 1111332 1096773 1085339 1051512 1034607 1061018 1055781 1037222 1042329 1045004
12107 1045004 1026959 1030642 1039675 1069287 1041359 1035347 1026300 1001455 998002 1013614 1012723 1000801 1011486
12094 1011486 1018307 986648 969774 972857 986539 993722 963341 960577 973004 958794 962340 966739
12082 966739 968282 925513 919746 923788 919945 891145 881682 902412 907390 916619 911494 887624 869697
12069 869697 857068 852825 860136 885248 880693 860230 862096 842675 844244 848874 835649 818831 833556
12056 833556 859891 854183 848881 837415 836938 807517 806092 813293 812557 810484 802358 798570 773898 765509
12042 765509 791314 801543 783528 761738 767214 755700 772373 782429 763772 739774 707279 717137
12030 717137 719647 711555 715337 729700 742491 727796 733291 725035 711123 708923 706596 709170 702241
12017 702241 678834 659911 654224 671527 706210 729712 703300 717908 739613 735205 722022 693043
12005 693043 665508 649736 649263 640763 629040 639154 663489 657254 651233 677496 713848 702484
11993 702484 701913 687590 660231 654446 652422 626370 622593 627357 622300 591510 591804 598890 594622 592069
11979 592069 609773 625844 644433 636944 635216 592043 570077 570450 556918 583267 600791 615372
11967 615372 620583 594528 568922 552069 561503 553583 571393 573130 606548 585082 521569 494447
11955 494447 489898 482177 514437 523510 521313 538337 558474 553196 531429 536205 510653 517928 518669
11942 518669 493014 488882 487571 497225 495362 493981 501612 530067 510770 507152 518381 516603 508725
11929 508725 495919 479747 453531 487673 489378 494758 501089 465566 453185 483363 496937 490298
11917 490298 482878 482910 474482 469090 465728 458570 439831 417763 416410 432671 447361 439874 427812
11904 427812 440909 448609 450922 458511 472360 466299 467194 453491 439957 414656 404239 423716 456501
11891 456501 466369 426841 420827 416176 404713 412796 445051 450229 462251 484788 460869 423195
11879 423195 410093 422999 445432 426441 399361 382131 386902 419932 431442 423144 374001 352458
11867 352458 347418 358749 374585 369255 383948 407787 379543 344540 348892 371906 370540 365681
11855 365681 384995 408947 407313 388481 361975 358800 364042 345225 316623 313760 348579 384479
11843 384479 373774 368931 359766 344537 330220 345656 361344 370514 367237 357892 344309 334626 355974
11830 355974 352752 346288 337891 341119 334130 342945 325116 307319 309188 314717 313433 301883 305360
11817 305360 316128 316948 328790 326336 308880 320719 320446 330843 356476 363759 336145 315780 281711
11804 281711 266567 273619 293417 310276 315929 294532 275609 296185 311918 328990 344596 322216
11792 322216 263980 255211 291061 289760 286759 274046 285281 280188 261847 246734 248958 246332 253312
11779 253312 252413 236525 227377 215338 215711 238930 251729 253772 247694 257153 272566 276625 280504
11766 280504 288864 272283 303116 324586 327131 320116 292435 269546 272731 267455 247180 231705
11754 231705 241890 249815 260791 274797 290471 264109 251022 271022 283475 249277 230308 247692
11742 247692 253647 261771 244626 219901 199847 215909 229380 253341 256084 248392 252637 233943
11730 233943 240673 250610 271292 287644 281752 252375 250013 245043 242944 248407 237517 216228 209106
11717 209106 206274 218448 219393 229929 240144 248425 249166 245727 234497 214554 239210 231011 223048
11704 223048 212152 221613 228632 213001 227964 241022 196446 166512 166233 154231 181787 209277
11692 209277 200597 198612 207254 203699 188719 177025 166182 172459 167871 161214 158373 168492 168946
11679 168946 190354 233018 228958 207442 198760 201155 199455 190896 190436 211692 203384 191562 166901
11666 166901 167473 183474 201769 151330 148831 153648 159798 174979 192352 197474 219359 202170 154910
11653 154910 139767 146023 163202 172404 181634 173108 171612 170689 185647 183535 175937 181283 150947
11640 150947 131389 140521 168061 157259 150318 158613 177351 189569 200516 214440 186874 192239
11628 192239 197612 193405 164679 155238 142700 151081 146190 149861 131120 130218 121504 148417 192478
11615 192478 199532 193199 202995 203352 189734 159627 142595 150392 162410 179890 164503 139327 148794
11602 148794 178500 201378 207563 212758 193647 174778 140196 149697 180748 173491 158816 156905
11590 156905 150700 127330 127275 151932 165646 159692 169298 195471 218933 210035 163433 134769 148435
11577 148435 161207 154749 164197 157421 121207 110745 95224 105768 112850 74644 64062 108742
11565 108742 143894 119456 95056 125677 138321 129027 123723 143049 133725 110962 87186 86428
11553 86428 89014 100245 88954 69869 81266 76264 102185 123243 135192 117864 95009 107323
11541 107323 109533 88626 89780 102992 123286 107681 121759 137474 112540 76312 39349 23059
11529 23059 56798 66136 55725 76946 113617 135263 109414 103042 105547 115523 119215 116571 122944
11516 122944 109786 118064 126272 124011 132661 128982 112186 87012 71322 91561 90925 109843 123288
11503 123288 103497 100936 112376 79466 61038 91702 111525 127959 142457 143851 121873 97622
11491 97622 107365 114842 129501 149797 128141 106202 91556 91327 86110 97997 116747 111919 92718
11478 92718 89750 91354 68893 71270 61507 48703 60326 65773 78000 106777 111297 94928 75244
11465 75244 73822 95573 122163 141184 153886 129972 118299 95610 63124 69441 62784 90361
11453 90361 83018 98018 110200 102915 92357 77783 100535 105471 114293 131190 98138 78471
11441 78471 66914 50031 60848 79099 89652 70645 73393 62898 65701 74745 84116 92116 96961
11428 96961 98504 34457 30565 53232 65471 61967 66528 60306 60942 73244 85847 109726 111008
11415 111008 97850 84525 91884 82766 86625 88591 102081 92120 126866 128264 110207 101106 84448
11402 84448 74712 67392 62798 69503 103628 87322 60636 72266 84410 97103 91734 72744 67624
11389 67624 87028 124543 125345 121941 136613 90797 48129 49395 57028 57614 51687 53167 64391
11376 64391 88897 112202 100872 87133 73862 33817 36929 44885 46721 72709 55647 63408
11364 63408 80510 87154 55576 34176 58432 81955 109728 135286 113069 74747 70736 66824
11352 66824 111687 115531 78410 45076 60708 33987 35069 48915 59783 57845 44851 22268
11340 22268 38142 67169 58040 57230 60633 50578 60839 73193 92804 93242 84830 80723 66339
11327 66339 60231 87328 75364 75233 60442 52472 61092 75062 88535 81423 79282 64348 54204
11314 54204 56904 86326 102396 83014 74552 67292 82839 102729 76815 62114 71385 90217
11302 90217 86021 67777 70261 89725 91089 83232 102211 114943 102532 73738 61059 76070
11290 76070 62477 53169 65681 81336 89050 72799 84466 102711 110178 98911 74832 71907
11278 71907 84594 41211 53053 126138 141136 117972 90162 71678 86960 84880 59329 52555
11266 52555 51642 38670 45147 60444 79237 86343 74312 59835 39083 39530 19698 -39 6257
11253 6257 16680 38073 48981 42100 35295 71736 69544 75334 80512 55734 44993 49885 49500
11240 49500 56674 53426 63634 116480 118447 79309 52235 18710 37747 57084 47162 34705
11228 34705 13901 26078 61732 68034 76499 65270 56600 87753 106364 91870 74516 83425
11216 83425 60452 25805 22491 19637 27071 52123 45380 32338 35580 51705 53908 35537 39059
11203 39059 27704 52871 56855 55387 57486 77253 84883 76844 58682 46567 43168 60787 65121
11190 65121 54998 60826 52672 61115 64940 64262 50214 67212 53584 91733 116881 87508 54063
11177 54063 31640 32104 44923 84900 102284 73056 45198 65240 56899 77713 94488 74283
11165 74283 42539 50324 53940 47945 48673 40823 14746 -12446 -18153 -13450 3302 29078 28567 21494
11151 21494 20501 25947 21279 21566 63618 59856 27429 16353 37509 25701 -4176 -26212 19160
11138 19160 55976 94053 74427 88751 61606 36944 69088 68835 74235 56705 57076 37901 50675
11125 50675 78995 95332 91546 74525 38008 30333 23598 1369 10946 23485 34808 54799
11113 54799 56359 82326 72172 60107 59562 32834 47631 46987 31052 25962 27668 38219 61276
11100 61276 59917 46691 42402 43350 56298 53461 47200 50559 51238 78971 67153 50193 43848 18721
11086 18721 22557 57883 68923 87563 95790 101163 74669 45715 36029 32130 20824 5940 22316
11073 22316 31378 35461 27404 11950 -1420 10097 21794 13031 24999 25790 30277 39765 25712
11060 25712 8999 7015 -10202 -2332 -46 -4255 33448 74052 43979 30861 24838 29976 63808
11047 63808 99138 71846 50441 67265 55298 45911 65390 67192 72181 93329 79864 54638
11035 54638 41139 45154 67587 64234 44964 26708 28668 2483 12888 37461 19316 8842
11023 8842 22391 30163 46841 52450 55396 70606 64351 60177 44343 40029 54771 51504 32961
11010 32961 28448 53972 64188 52600 57806 58754 58696 26371 27549 48749 36216 22713 43071
10997 43071 49891 41490 57014 81328 74964 61552 49569 28031 30907 34572 33544 25119 26710
10984 26710 23505 25901 18124 13922 10127 18975 17925 13101 -3517 -11649 -16623 -10938 2501 25849
10970 25849 39036 61111 61105 14779 -21638 -3893 6414 10108 19392 25600 -9729 -22261 2737
10957 2737 2625 13598 27058 34028 40294 24435 51847 67576 62194 41390 41005 46917 48088 32779
10943 32779 38892 16174 13843 25133 34976 37053 43207 55083 50190 48438 26017 17830 32357
10930 32357 51235 45878 42118 29610 -5888 -7081 17443 30380 38890 33843 23550 -4449 18290
10917 18290 42143 25701 23643 22704 38611 35881 41090 48408 44785 39046 24443 29752 44828
10904 44828 43429 52246 37380 9822 -5933 21051 55146 56514 57795 64810 66181 48058 45662
10891 45662 59955 65585 74049 54669 32381 38517 58343 44657 46217 36664 42599 56851 50288
10878 50288 65314 67397 55524 47972 41616 58759 63865 39508 27349 25631 5385 5392 10782 6258
10864 6258 -10015 -12857 -14416 867 26920 45808 45531 58599 57988 58177 69561 54121 51949 53154
10850 53154 64728 43407 23609 18394 9063 12632 29378 42631 44492 62711 65829 51668 63335
10837 63335 64796 52518 61223 55671 45311 52364 29650 20859 33110 25295 40127 36168 19117
10824 19117 8497 7234 19500 -5653 10619 45572 77121 83324 71497 36210 -5136 -26270
10812 -26270 -12687 12608 13000 -10238 -8019 26125 32162 26364 30736 34727 40896 39666 19183
10799 19183 6855 23961 9586 6282 -535 12840 34125 52344 54059 48963 47862 69228 79309
10786 79309 83099 82437 54401 51906 73186 61197 49709 63426 54783 36175 50547 60573 50229
10773 50229 64029 67285 74894 88663 86209 83095 63633 66496 85238 77204 67209 65482 63564
10760 63564 65059 67029 55491 62815 71051 75112 69609 50625 24247 38518 60120 61127 74666
10747 74666 88445 81125 73594 58239 52083 40584 44391 40869 40469 24270 42680 59166 49621
10734 49621 67056 89067 92712 60374 59043 59482 75904 78946 75132 60084 32904 19566 37946
10721 37946 40649 46295 59487 86069 81329 71008 64304 42211 71176 75636 54850 49278 40980
10708 40980 35076 26886 37896 66372 67286 45480 45148 86569 89765 89895 69330 71325 77273 63627
10694 63627 64132 69933 94939 93982 76867 54918 31422 12172 12144 29274 67116 84728 84366 83432
10680 83432 56362 14492 -8429 -6590 -1573 -2177 22906 37136 61545 59172 60974 39467 32349
10667 32349 44293 59396 71493 82390 79728 50186 38054 20668 11199 15571 43411 38032
10655 38032 -4824 24851 38891 61772 77278 55459 57248 87128 77213 69627 55826 49282
10643 49282 51766 88444 102833 94218 106162 90341 77610 64623 65739 34758 41048 54788
10631 54788 67912 80213 81498 105747 95132 66696 46249 66637 65575 43958 33882 46519
10619 46519 59690 44028 37482 53259 50023 22587 4819 34235 80893 103465 104396 79801
10607 79801 59812 22388 17842 20319 24425 31453 23027 28512 70944 99316 83862 95504 123101
10594 123101 121426 96979 101317 77838 57869 76487 98032 84086 90006 80773 68157 54153
10582 54153 49600 19416 5168 14858 9820 12960 42081 27270 20745 47169 51279 68061 85572
10569 85572 69982 45299 34675 52513 63925 60556 69342 46929 36402 39789 36505 51838
10557 51838 47994 49819 44809 58873 84726 107180 79038 78927 76976 83927 62864 44240 63347
10544 63347 67512 79707 102775 96693 102013 115709 98496 74640 96913 86531 81680 63163
10532 63163 53558 50034 60483 50819 25850 51760 67422 68974 59210 61871 47264 66295 116520
10519 116520 128518 97945 90082 97256 103456 116897 109174 104548 113628 125551 112749 114871 96534
10506 96534 85321 108999 115768 104196 85618 46900 27124 50562 74082 93827 97801 114388
10494 114388 97034 82854 81060 108185 111546 86129 80777 119214 114921 96059 81993 89296
10482 89296 104922 117298 129570 117079 107700 94725 87053 72496 50674 45221 58217 72752
10470 72752 97632 106131 88696 77760 68986 61666 41771 31584 35274 36982 37978 44295 69759
10457 69759 71183 52491 75708 72138 68818 86366 88162 75256 60097 53788 33615 39646 56178
10444 56178 80602 82625 72537 47722 66313 74592 74492 81723 73030 75247 94401 107017 131223
10431 131223 97607 103899 112934 106327 102865 110056 93875 90247 78164 82562 89918 116978 111476
10418 111476 95537 93556 89964 90748 117658 116277 97796 60941 50440 50432 75471 91235 88726
10405 88726 97461 109980 119579 159275 150933 129007 100409 96162 87622 86637 121480 133065 152295
10392 152295 145440 131522 155475 146683 129600 94044 96508 110685 103789 122729 101001 82670
10380 82670 73031 78918 104912 114555 113154 115516 98336 106893 121335 152246 166515 157241 141268
10367 141268 150928 147082 148612 138031 107169 109702 120729 120972 157250 187857 203577 197314 192824
10354 192824 200266 179981 175237 159722 172664 166817 147944 127405 130799 146857 141847 154737
10342 154737 156566 177550 160368 138754 136772 130255 129194 130761 153584 154387 134690 132308 144142
10329 144142 126694 111584 120995 108668 124760 148742 135014 127010 150897 162813 155329 138666
10317 138666 115102 131195 160691 185647 208747 260006 287801 291337 310199 363752 382356 402170
10305 402170 391210 395094 373523 295620 263050 258213 244214 227165 228120 186474 163815 149456
10293 149456 159818 181167 173569 170852 165291 146495 130702 113154 138549 145310 155463 164435
10281 164435 174227 154964 149784 169163 183759 200962 222360 239304 279100 313196 303713 301745
10269 301745 333661 377302 413543 424536 425704 408870 400374 380733 354711 329706 294374 253427
10257 253427 215607 216333 196170 177944 179408 178734 158084 172008 184744 193442 192281 173092 165847
10244 165847 149801 146885 143436 131064 135675 129026 136934 117167 122831 151527 162306 156636 149259
10231 149259 144188 130414 131610 126132 117768 132519 156865 140651 108633 99289 121530 151277
10219 151277 171580 174571 160587 156368 181044 165833 152303 170762 176164 144485 124900 103830
10207 103830 107075 119171 164192 207663 195647 194719 188082 155040 126388 129126 117643 124312 152458
10194 152458 183635 181096 164561 179848 202823 201571 176192 168552 188875 215095 210838 192922
10182 192922 195052 230175 246107 255197 247387 281158 299905 325923 312072 259175 253326 252404 240293
10169 240293 273722 282941 281067 288301 282537 272901 258925 231384 227144 216100 217865 229168 212148
10156 212148 193782 205329 234691 227915 211710 199497 176473 161884 170075 188857 154019 144919
10144 144919 142770 156731 187854 198172 206212 203618 194251 193260 217026 244956 218402 190610 203285
10131 203285 188457 207828 219625 228882 219342 200622 181391 186132 187848 160431 145808 167645
10119 167645 160497 159362 134276 141736 145606 126821 128248 128394 157084 155505 134727 124995 127124
10106 127124 134331 132868 131392 130306 148763 161162 177638 182531 175876 177664 166487 172594 166641
10093 166641 144249 152379 161388 174389 176163 168072 159150 186014 181983 165742 182661 216550 219056
10080 219056 218604 231640 197146 179658 179541 180689 171419 190472 193763 176465 188977 218010 237879
10067 237879 240381 240030 214397 197414 195795 216605 224611 209430 205055 210326 217145 213440 199791
10054 199791 200192 207775 197719 201707 190032 214904 219682 194075 198533 197661 194262 185355 177656 179772
10040 179772 187330 184001 183284 205768 211362 225271 238330 259574 280796 307447 343251 395074
10028 395074 440934 466412 478787 494977 471784 439880 449628 457778 440262 378707 319973 275198
10016 275198 248452 249838 233277 228535 257861 291320 272961 236753 207434 228167 237213 212755
10004 212755 231319 234248 249276 262233 258096 255593 239190 221212 201522 212133 230493 228019
9992 228019 231310 239853 248388 236059 221280 244486 257972 250302 256807 255520 278611 292497 301622
9979 301622 286509 280578 275584 265611 226203 174237 154805 176781 209256 220129 222745 216542 207538
9966 207538 231302 233060 240128 244486 266043 253436 236659 225272 237456 230339 207944 213238 227544
9953 227544 232481 247483 249778 236395 217706 230405 244389 246030 243671 240426 227119 226860 234930
9940 234930 230534 236013 253554 244402 249341 227019 225139 213814 202809 200273 193216 218682 236096
9927 236096 238392 232821 219721 227196 228807 243554 267011 273365 265339 264625 266820 250235 264398
9914 264398 285057 260908 258521 219284 225908 216993 210280 220567 254692 260669 257123 247925 250589
9901 250589 293903 302639 303793 301817 295058 296341 271001 287284 280679 284822 276243 298758 315777
9888 315777 314508 307015 300545 272838 273029 259023 257884 278323 273941 268773 280785 278027 295336
9875 295336 297803 286100 290380 310357 307504 293740 295958 325274 328654 337293 314735 302740 290509
9862 290509 294370 312612 325349 309616 286066 289768 306534 299255 279930 291952 301045 284175
9850 284175 274264 273686 318202 343215 339543 312723 318834 326130 294354 305471 310684 314383 292075
9837 292075 289696 319263 324807 326115 327263 333514 334548 326569 311575 317406 329360 331381 327104 319160
9823 319160 333472 335834 327265 338999 336039 328181 334602 355488 352530 338918 355204 367087 365436
9810 365436 386063 366920 324250 332341 338845 320920 336966 353403 376373 335147 295959 331386
9798 331386 336142 367073 397222 401015 390144 377292 365307 359542 352911 363556 400709 410838
9786 410838 376883 352872 351465 381130 414170 396404 404372 427478 408225 389940 417496 407450
9774 407450 378421 385453 384698 365018 349664 354736 325906 306987 314355 321438 336168 373415 394741
9761 394741 379179 370396 352779 360584 388718 376180 353406 356559 355960 387243 381219 382197 373689
9748 373689 364065 376365 400742 423142 419034 425550 418738 420914 406157 395555 375557 370905 377897
9735 377897 380341 414087 409164 398475 393002 364233 338323 340048 354130 366710 383296 411167
9723 411167 412470 413315 396550 404989 439731 457305 453887 431853 377580 350606 369026 409849 426436
9710 426436 419080 425314 417259 420392 438571 429185 450258 442956 443278 472975 488690 488939 487956 469007
9696 469007 446269 470131 480857 510696 499790 485694 457116 434849 442375 443111 434709 425261 418886
9683 418886 400729 430471 429116 450039 446285 437613 453091 468916 489252 470360 462376 458484 438536
9670 438536 442828 454136 461104 467305 453697 481931 496372 487475 475572 455064 445919 420020 418894
9657 418894 445925 457570 438589 419239 444992 491913 506203 483338 452509 409644 415355 454454
9645 454454 457901 433472 462374 510904 530834 539584 537075 508855 483886 482676 481643 502047 511673
9632 511673 512911 519203 514332 473075 462547 454338 480805 505411 529735 530322 530969 515619 517493
9619 517493 538645 560392 567804 562613 553565 561439 574803 576407 548194 518648 494470 496654 515092
9606 515092 518638 520832 544669 523095 493407 493936 499674 491437 469685 453964 462595 491845 515121
9593 515121 518033 519042 527239 519790 528405 537544 552367 568798 561730 556630 550733 562282 571962 559872
9579 559872 541855 544276 553151 553352 524056 513950 527078 550741 552824 552966 543986 579749 598492
9566 598492 631196 652620 681656 666472 635882 624025 621613 597922 577909 588416 592325 598272
9554 598272 597488 596076 622488 629955 630485 641269 636383 623567 627131 638770 653667 650007 637634
9541 637634 629918 621650 619991 612304 614947 616688 598856 609673 626888 633205 637188 640838 625528
9528 625528 621244 641548 660371 652804 654700 655564 643964 655274 665953 678208 656243 636017 641186
9515 641186 637555 631099 658350 687915 690056 672978 643964 644155 646886 648108 655761 680146 679300 682903
9501 682903 708961 712782 714294 700508 673566 671925 680936 697578 696421 677822 670318 687959 723043
9488 723043 722568 693414 701074 726082 703257 689676 690063 708076 709917 707948 710496 718117 719687 704517
9474 704517 697564 717013 736418 724557 739883 745075 719906 691371 688222 725807 721757 714487 710227
9461 710227 703086 677709 677297 691505 721388 751747 762179 757883 772145 769283 765758 757315 736284
9448 736284 735962 754902 754774 746224 729205 735429 769134 789642 762470 763075 758542 752868 739608 757399
9434 757399 794145 795818 782186 779251 811578 807175 799348 769291 766610 762814 768559 764951 768797
9421 768797 757562 740375 765912 778232 764072 764997 780352 779066 788993 790467 773050 772036 747239
9408 747239 761055 785229 790402 796999 813083 794497 777709 767402 764037 773365 753164 755620 762227
9395 762227 765878 773478 790060 798055 792244 783850 771902 760054 790676 800132 796637 807345 803316
9382 803316 785420 785284 808982 840302 856140 838851 835597 836225 830403 832155 848038 856037 821133
9369 821133 821388 852583 853122 842047 809607 781358 796841 799373 788581 785905 771976 814936 842082
9356 842082 830231 823283 803240 802498 797977 816360 799715 794575 816020 808029 785099 782893 792158
9343 792158 803037 808474 798780 799831 807431 821533 795849 779583 773992 775514 784687 774789 764676
9330 764676 788295 824073 830849 857767 847500 843478 842731 846055 845174 849292 848505 829869 832264 828405
9316 828405 816413 814155 817087 830498 841823 826130 845061 848126 833416 841870 837156 829533 828080
9303 828080 804352 795887 800901 822744 793423 775874 776702 806612 816518 817288 814344 780905 786213
9290 786213 798835 807379 788678 791796 794154 801173 830807 848531 855517 847536 829995 822131 815285
9277 815285 805988 797319 786893 807848 828179 837354 828229 837038 810967 802782 835515 844354 859208
9264 859208 854637 852611 857819 835791 824110 819264 829086 822717 834231 831748 839058 834691 805246
9251 805246 814771 789551 757355 791772 821585 816390 807316 811661 790525 800888 815417 815671 828265
9238 828265 818338 822674 816341 824603 830353 806442 802467 810237 806126 830301 831149 827612 818113 813441
9224 813441 808524 795192 793569 773192 762761 749587 726482 759158 802255 810934 793518 777544
9212 777544 787131 808183 781705 763120 754051 738580 735662 755580 788626 782991 749966 758588 742260
9199 742260 758224 758782 734909 737076 760777 761938 748481 740515 740853 741889 746822 748370 753148 747963
9185 747963 727615 719080 761430 779692 750652 718514 700603 730287 747912 756656 743991 752238
9173 752238 754712 752419 741667 725814 715751 725449 730538 714670 707592 697539 704781 737404 738351
9160 738351 733052 736863 713949 701681 708286 699032 683740 672600 678676 696651 680056 680462 694633
9147 694633 668585 637752 621427 630460 658849 665567 633233 622588 634155 658537 693631 682385
9135 682385 648332 617633 633125 654707 636684 625488 633387 666074 684250 676126 649715 646530
9123 646530 663467 661411 663079 670282 671364 679361 685690 674307 655691 655098 643010 606678 620746
9110 620746 641107 678423 688218 664099 638727 642840 638332 608659 587879 568341 564637 583927
9098 583927 581607 596261 626518 632676 624907 596119 578859 597929 608728 598771 584002 589542 591891
9085 591891 588744 588884 596724 592305 593599 579777 573748 567312 575842 559121 554701 563307 578437 612085
9071 612085 619878 597312 593999 605291 608419 622336 642740 596747 582978 560305 556372 568798
9059 568798 582485 590902 550398 536960 558453 550983 519245 517961 510908 519818 523475 530129 518675
9046 518675 491564 473800 489093 489926 471369 454583 468761 478606 480905 479872 500185 518046 517415
9033 517415 514837 522084 538029 525451 508129 490593 505575 480872 463230 466183 481282 487627
9021 487627 486059 497676 515925 523517 489145 470699 482771 467939 484238 512629 526364 526251
9009 526251 522621 496453 471900 461703 443352 430876 455060 463432 447405 423571 430855 465440
8997 465440 474567 457343 452094 440399 455722 440987 411168 383867 385196 408127 404015 409304 422462
8984 422462 419832 422910 434568 450707 415625 377259 379473 403095 407461 413613 402693 400666 407820
8971 407820 407999 411740 429088 438249 442073 430471 438694 431271 424587 409997 392441 376372 371360
8958 371360 371876 377513 366558 360100 357090 364225 356459 340654 325319 335070 374071 365167 379540
8945 379540 398326 410159 395801 389960 378568 377613 375036 363820 347939 350168 377338 392680 358195
8932 358195 363551 389840 395882 403685 397641 391288 394943 377068 337966 338770 344489 342979 344339 343361
8918 343361 349596 375198 365837 363865 363779 374017 403285 394176 376517 348484 348379 356652 375824 371071
8904 371071 362194 376380 371956 359899 383710 391113 347614 328367 321465 305092 318994 315751 302256
8891 302256 319388 327062 313627 292237 283899 289949 310809 300551 309139 303254 302104 313672 306851
8878 306851 288105 266664 244290 261419 277169 291602 326705 318183 293149 279259 277950 292218
8866 292218 290251 300789 316057 299034 278566 293189 279327 274418 271527 275803 278086 248158 260720
8853 260720 255724 263878 263460 270476 274347 262065 257314 264919 263547 249581 251649 276038 285305 265115
8839 265115 268411 285690 295091 295598 284621 271774 252205 224344 220467 243316 242676 249197 247670
8826 247670 250799 215823 209915 241782 249845 225400 193744 195218 224681 223907 215415 180138 156625
8813 156625 178009 212766 229053 196076 177906 184316 218308 228019 202334 217754 252855 241906
8801 241906 231165 202669 194851 183084 172393 192979 205396 221726 217802 193756 206980 221413
8789 221413 214799 198670 192517 179822 176337 174237 147914 149488 167129 168103 148009 171375 173995
8776 173995 186489 200406 190651 183613 183650 202038 207212 191695 177148 168081 150953 140457 144055
8763 144055 143420 153820 146424 164230 181253 199883 186758 159047 146386 165644 170728 144248
8751 144248 148477 152418 132249 143019 159864 162018 144536 138325 153606 155456 148895 151116 174850
8738 174850 203764 201468 227831 234299 210534 191137 200627 199392 147315 175108 169676 173507 201204
8725 201204 195754 185758 171297 149730 149825 161468 174630 169118 158888 154102 185129 202028 192994
8712 192994 179825 170102 137097 119156 114637 138899 159621 157043 143756 123914 119785 143771
8700 143771 168349 171358 139726 136173 161224 159119 149169 146907 155866 169149 185906 178598 184901
8687 184901 170771 152202 163142 191979 167885 131184 131771 155278 172955 155339 132856 131734
8675 131734 136019 120633 128928 140830 147064 169336 189629 178054 187683 206572 248527 248305 236513
8662 236513 202536 194642 217066 246052 206019 193726 213736 249795 251092 251917 253754 244414 226149
8649 226149 224671 235409 265409 280364 288832 330265 335688 318649 332745 362864 403834 429432
8637 429432 463427 511224 561791 587343 581161 552980 544390 522143 479029 450652 414700 391107
8625 391107 340597 286357 270866 269777 256029 231747 218413 200327 178142 159052 159884 163738
8613 163738 161508 153982 170981 147452 104555 88011 126373 137382 157235 168541 149085 127049
8601 127049 102199 98729 93724 75639 51068 56984 45973 42922 49852 65784 75584 76951 90259
8588 90259 91249 90556 112144 105113 87829 64458 45275 69860 95105 99636 60885 44125 71200
8575 71200 87384 68075 62926 58993 59023 83969 97211 67353 46814 49823 66546 71212 75515
8562 75515 57632 71920 81541 68683 60076 43910 38985 62688 80752 72187 37004 14604 18235
8549 18235 20295 39545 75586 78324 73034 63206 67039 80032 71752 60088 40686 76296 61252
8536 61252 20315 9972 44822 73085 87146 77484 87366 88648 71549 56902 53475 59645 39112
8523 39112 35476 61712 58000 46448 22810 21798 34516 25923 10106 14003 50135 52493 61364
8510 61364 61036 42258 30189 53997 73978 96801 98907 85073 48838 39381 37651 62222 59828
8497 59828 35101 42957 51565 3516 13212 22517 26350 54969 75460 31698 35868 41672 48118
8484 48118 38255 25815 49868 49073 50069 33442 28109 40801 37602 40802 71213 61670 60898 22099
8470 22099 27644 39388 36522 38474 43435 49184 52046 34498 14399 961 -583 18307 12329
8457 12329 31691 47703 35070 6199 -6874 4699 20651 26061 23325 36619 51540 66746
8445 66746 60811 63423 59368 32334 20538 10136 25778 32902 29330 8284 3420 -20776 -30373
8432 -30373 -17401 7481 14543 41707 57884 69819 66747 43159 19877 -9778 -25726 -33434
8420 -33434 -28806 -4118 -3752 -8534 -12789 13150 10660 -23539 -35188 -2520 11357 17530 8477
8407 8477 8632 3665 -2640 -35176 -48213 -6828 10256 13797 24053 24251 48100 51929 21987 16279
8393 16279 9168 -6251 -4332 -12135 -16972 474 -21551 -18376 -2055 8143 14835 23021 9892
8380 9892 -6831 -18800 -25268 -6370 -21417 -16046 -25829 -36667 -5781 -9162 -20279 -26601 -24359
8367 -24359 2459 10538 22099 21299 24946 12794 7211 3244 -528 2639 31574 34777 12114 -3210
8353 -3210 -11931 -16643 -10146 -26657 -19698 -1719 -8637 -39720 -28985 -15144 -6599 -17021 -27473
8340 -27473 -2600 -10229 5370 26771 28665 4834 -20531 -11315 -20557 -24259 -4982 21708 32556
8327 32556 34779 23430 -12694 -41807 -28680 -17702 -4868 -17525 -25770 -13463 -2091 6203
8315 6203 -692 -2106 -10755 4507 12398 23407 26783 36376 -21072 -43725 -45268 -31950 9084
8302 9084 -11913 -24681 -28173 -47654 -34525 -18229 -21034 -46925 -38136 -7986 -2879 -1332 -3980
8289 -3980 -20717 -50157 -50470 -45434 -44684 -48456 -42580 -57019 -66181 -39963 -3783 10588 -11657 -34196
8275 -34196 -54752 -59353 -31194 -20024 -35049 -51535 -72745 -73416 -32867 2359 -18934 -8969 6786
8262 6786 15593 23010 20097 -16548 -37982 -57498 -60624 -72644 -59866 -22476 3617 -7866 -27379
8249 -27379 -11344 -20179 -30973 -21707 -27528 -20167 -39200 -50729 -33168 -29752 -31053 -14265 -23442
8236 -23442 -17522 -12295 -14938 -15716 -14490 -26642 -28019 -2154 16277 18233 6293 -12904 -40705
8223 -40705 -20484 -14182 -17165 -23026 -21499 -18534 -26033 -4788 -34510 -42293 -39472 -14624 -16250 -13441
8209 -13441 3774 2393 -30884 -33438 -7130 14614 799 -20043 -41115 -34951 -22680 -15267 -3068
8196 -3068 1576 -1565 -3174 -7148 1502 7190 11239 -17564 -60298 -75250 -81671 -68681 -47358 -49537
8182 -49537 -31017 -9786 13028 -1873 -18019 -32742 -48237 -12260 -21674 -37275 -41509 -55945
8170 -55945 -49728 -26110 -20402 -11619 -15834 -25418 -10870 7905 31023 21554 1684 -20298 -30400
$$ [...]
##END NTUPLES=NMR SPECTRUM
##END=
