##TITLE=Analysis number 314187
Compound Code sb 01743
Project Code adrs
Chemist Name stores
##JCAMPDX= 6.0         $$ Bruker NMR JCAMP-DX V2.0
##DATA TYPE= NMR SPECTRUM
##DATA CLASS= NTUPLES
##ORIGIN= Bruker BioSpin GmbH
##OWNER= NMR
$$ XWIN-NMR		Version 3.5
$$ Fri Oct  7 10:59:47 2005 GMT Daylight Time (UT+1h)  MAYBRIDGE\NMR@NMR_250MHZ
##.OBSERVE FREQUENCY= 250.131544655141
##.OBSERVE NUCLEUS= ^1H
##.ACQUISITION MODE= SIMULTANEOUS (DQD)
##.ACQUISITION SCHEME= undefined
##.AVERAGES= 16
##.DIGITISER RES= 18
##SPECTROMETER/DATA SYSTEM= dpx250
##.PULSE SEQUENCE= zg30
##.SOLVENT NAME= CDCl3
##.SHIFT REFERENCE= (INTERNAL, CDCl3, 0, 16.522)
##AUDIT TRAIL= $$ (NUMBER, WHEN, WHO, WHERE, WHAT)
$$ ##TITLE= Audit trail, XWIN-NMR		Version 3.5
$$ ##JCAMPDX= 5.01
$$ ##ORIGIN= Bruker BioSpin GmbH
$$ ##OWNER= NMR
$$ C:\u/data/dgb/nmr/ADRS/10610/pdata/1/auditp.txt
$$ ##AUDIT TRAIL=  $$ (NUMBER, WHEN, WHO, WHERE, WHAT)
(   1,<2005-10-07 10:59:26.32 +100>,<MAYBRIDGE\NMR>,<NMR_250MHZ>,
      <created by zg, POWCHK disabled, PULCHK disabled
       configuration hash MD5:
       62 19 C7 07 E1 42 D1 B7 37 6C 3D D0 77 39 F9 E6
       data hash MD5: 64K
       46 5A DA 68 B1 13 91 AE F0 D5 6E AF C9 24 B7 3D>)
(   2,<2005-10-07 10:59:39.07 +100>,<MAYBRIDGE\NMR>,<NMR_250MHZ>,
      <Start of raw data processing
       ef LB = 0.3 FT_mod = 6 PKNL = 1 SI = 32K 
       data hash MD5: 32K
       BC 04 4C CD 34 0E 97 3A 4C FE 27 AE DE 1B EC 80>)
(   3,<2005-10-07 10:59:40.71 +100>,<MAYBRIDGE\NMR>,<NMR_250MHZ>,
      <apk 
       data hash MD5: 32K
       A1 10 10 CC 1E 95 BE 83 4C B4 86 14 53 B3 03 B1>)
(   4,<2005-10-07 10:59:41.49 +100>,<MAYBRIDGE\NMR>,<NMR_250MHZ>,
      <abs ABSG = 5 
       data hash MD5: 32K
       17 8E 77 3E F0 C8 39 69 F8 3A 8F C5 72 BD CC 2C>)
$$ ##END=
$$ 
$$ hash MD5
$$ 54 66 0D DF 22 15 13 65 62 EC 8E 71 AC 9D A5 92
##$RELAX= 
##$RELAX= 
##$RELAX= 
##$RELAX= 
##$RELAX= 
##$RELAX= 
##$RELAX= 
$$ Bruker specific parameters
$$ --------------------------
##$DU= <C:\u>
##$EXPNO= 10610
##$NAME= <ADRS>
##$PROCNO= 1
##$TYPE= <nmr>
##$USER= <dgb>
##$AMP= (0..31)
100 100 100 100 100 100 100 100 100 100 100 100 100 100 100 100 100 100 
100 100 100 100 100 100 100 100 100 100 100 100 100 100 
##$AQSEQ= 0
##$AQ_mod= 3
##$AUNM= <au_zg>
##$AUTOPOS= <8 >
##$BF1= 250.13
##$BF2= 250.13
##$BF3= 250.13
##$BF4= 250.13
##$BF5= 500.13
##$BF6= 500.13
##$BF7= 500.13
##$BF8= 500.13
##$BYTORDA= 1
##$CFDGTYP= 0
##$CFRGTYP= 5
##$CHEMSTR= <none>
##$CNST= (0..31)
1 1 145 1 1 1 1 1 1 1 1 1 1 1 1 1 1 1 1 1 1 1 1 1 1 1 1 1 1 1 1 1 
##$CPDPRG= <>
##$CPDPRG1= <>
##$CPDPRG2= <>
##$CPDPRG3= <>
##$CPDPRG4= <mlev>
##$CPDPRG5= <mlev>
##$CPDPRG6= <mlev>
##$CPDPRG7= <mlev>
##$CPDPRG8= <mlev>
##$CPDPRGB= <>
##$CPDPRGT= <>
##$D= (0..31)
0 1 0 0 0 0 0 0 0 0.06 0 0 0 0 0 0 0.0002 0 0 0 0 0 0 0 0 0 0 0 0 0 0 
0 
##$DATE= 1128679165
##$DBL= (0..7)
120 120 120 120 120 120 120 120 
##$DBP= (0..7)
150 150 150 150 150 150 150 150 
##$DBP07= 0
##$DBPNAM0= <>
##$DBPNAM1= <>
##$DBPNAM2= <>
$$ [...]
##$SUBNAM7= <"">
##$SUBNAM8= <"">
##$SUBNAM9= <"">
##$SW= 20.6930455092707
##$SWIBOX= (0..15)
0 0 3 0 0 0 0 0 0 0 0 0 0 0 0 0 
##$SW_h= 5175.983436853
##$TD= 65536
##$TD0= 1
##$TE= 295.16
##$TE2= 300
##$TE3= 300
##$TEG= 300
##$TL= (0..7)
0 120 120 120 120 120 120 120 
##$TP= (0..7)
150 150 150 150 150 150 150 150 
##$TP07= 0
##$TPNAME0= <>
##$TPNAME1= <>
##$TPNAME2= <>
##$TPNAME3= <>
##$TPNAME4= <>
##$TPNAME5= <>
##$TPNAME6= <>
##$TPNAME7= <>
##$TPOAL= (0..7)
0.5 0.5 0.5 0.5 0.5 0.5 0.5 0.5 
##$TPOFFS= (0..7)
0 0 0 0 0 0 0 0 
##$TUNHIN= 0
##$TUNHOUT= 0
##$TUNXOUT= 0
##$USERA1= <user>
##$USERA2= <user>
##$USERA3= <user>
##$USERA4= <user>
##$USERA5= <user>
##$V9= 5
##$VALIST= <valist>
##$VCLIST= <CCCCCCCCCCCCCCC>
##$VD= 0
##$VDLIST= <DDDDDDDDDDDDDDD>
##$VPLIST= <PPPPPPPPPPPPPPP>
##$VTLIST= <TTTTTTTTTTTTTTT>
##$WBST= 1024
##$WBSW= 4
##$XGAIN= (0..3)
0 0 0 0 
##$XL= 0
##$YL= 0
##$YMAX_a= 185795
##$YMIN_a= -157867
##$ZGOPTNS= <>
##$ZL1= 120
##$ZL2= 120
##$ZL3= 120
##$ZL4= 120
##$ABSF1= 16.522
##$ABSF2= -4.171173
##$ABSG= 5
##$ABSL= 3
##$ALPHA= 0
##$AQORDER= 0
##$ASSFAC= 0
##$ASSFACI= 0
##$ASSFACX= 0
##$ASSWID= 0
##$AUNMP= <proc_1d>
##$AZFE= 0.1
##$AZFW= 0.1
##$BCFW= 0
##$BC_mod= 0
##$BYTORDP= 0
##$COROFFS= 0
##$CY= 12.5
##$DATMOD= 1
##$DC= 0
##$DFILT= <>
##$DTYPP= 0
##$F1P= 14.0000005364418
##$F2P= -0.99999901652339
##$FCOR= 0.5
##$FTSIZE= 32768
##$FT_mod= 6
##$GAMMA= 0
##$GB= 0
##$INTBC= 1
##$INTSCL= 1
##$ISEN= 128
##$LB= 0.3
##$LEV0= 0
##$LPBIN= 0
##$MAXI= 10000
##$MC2= 0
##$MEAN= 0
##$ME_mod= 0
##$MI= 0
##$NCOEF= 0
##$NC_proc= -5
##$NLEV= 6
##$NOISF1= 0
##$NOISF2= 0
##$NSP= 0
##$NTH_PI= 0
##$NZP= 0
##$OFFSET= 16.522
##$PC= 1
##$PHC0= -62.41826
##$PHC1= 9.087692
##$PH_mod= 1
##$PKNL= yes
##$PPARMOD= 0
##$PSCAL= 4
##$PSIGN= 0
##$REVERSE= no
##$SF= 250.13
##$SI= 32768
##$SIGF1= 0
##$SIGF2= 0
##$SINO= 400
##$SIOLD= 32768
##$SREGLST= <1H.CDCl3>
##$SSB= 0
##$STSI= 32768
##$STSR= 0
##$SW_p= 5175.98343685301
##$SYMM= 0
##$S_DEV= 0
##$TDeff= 65536
##$TDoff= 0
##$TI= <Analysis number 999999
Compound Code 99
Book Reference 9
Project Code 9>
##$TILT= no
##$TM1= 0
##$TM2= 0
##$TOPLEV= 0
##$USERP1= <user>
##$USERP2= <user>
##$USERP3= <user>
##$USERP4= <user>
##$USERP5= <user>
##$WDW= 1
##$XDIM= 32768
##$YMAX_p= 546435259
##$YMIN_p= -1372674
$$ End of Bruker specific parameters
$$ ---------------------------------
##NTUPLES= NMR SPECTRUM
##VAR_NAME=  FREQUENCY,     SPECTRUM/REAL,   SPECTRUM/IMAG
##SYMBOL=    X,             R,               I
##VAR_TYPE=  INDEPENDENT,   DEPENDENT,       DEPENDENT
##VAR_FORM=  AFFN,          ASDF,            ASDF
##VAR_DIM=   32768,         32768,           32768
##UNITS=     HZ,            ARBITRARY UNITS, ARBITRARY UNITS
##FACTOR=    0.157963299565203, 1,           1
##FIRST=     4132.6476996994, 0,             0
##LAST=      -1043.33573715361, 0,           0
##MIN=       -1043.33573715361, -1372674,    0
##MAX=       4132.6476996994, 546435259,     0
$$ Real data points
##PAGE= N=1
##DATA TABLE= (X++(R..R)), XYDATA
$$ [...]
$$ plain form
23048 108071 385402 -192916 -495396 -226983 92035 176432 246924 508506 496138 276366
23038 276366 464412 698656 550964 478642 176739 106595 457357 885340 482172 225857
23028 225857 330926 494904 344545 -27444 -97204 24559 -123159 -91344 -22499 -181118
23018 -181118 -192367 -138578 -253410 -491701 -310079 -22696 2027 -46249 -197331 61816
23008 61816 306992 465423 497822 355507 279530 95845 -172174 -234013 -275533 -92188
22998 -92188 -240394 -345680 -23776 -133478 -292342 -353929 -350794 -147695 -54667 -68966 -241120
22987 -241120 -122625 -508183 -574043 -236569 98693 47624 124247 346484 545448 460322
22977 460322 173691 84921 -198919 -109191 -70063 -209320 -361019 -482459 -365569 -131435
$$ packed form
23048A08071K77331n78318l02480K68413L19018Q4397P0492K61582j2368k19772
23038B76366J88046K34244j47692p2322l01903p0144L50762M27983m03168k56315
23028B25857J05069J63978j50359l71989o9760J21763j47718L1815O8845j58619
23018a81118j1249N3789j14832k38291J81622K87383K4723m8276j51082K59147
23008F1816K45176J58431L2399j42315p5977j83685k68019o1839m1520J83345
22998i2188j48206j05286L21904j09702j58864o1587L135K03099R3028j4299j72154
22987b41120J18495l85558o5860L37474L35262n1069P6623K22237J98964q5126
22977D60322k86631q8770k83840Q9728L9128j39257j51699j21440J16890K34134
$$ plain form
22967 -131435 29044 -34667 -228587 -447324 -464690 -269341 -184612 -182714 -365719 -259094
22957 -259094 -135518 179592 390393 153825 -163944 -80874 -68254 -345480 -301752 -34553
22947 -34553 144097 190526 157748 16337 -258810 -382004 -340659 -230238 -311358 -405657 -373206
22936 -373206 -344760 -403557 -399027 -406018 -703069 -677382 -495541 -252635 -447186 -698725 -404628
22925 -404628 -110328 200202 366840 388739 197324 34182 -39657 -301714 -487596 -788875
22915 -788875 -608793 -104963 416960 403096 120004 -7417 279493 354047 -20340 -223241
22905 -223241 -178024 35845 347374 305820 211297 27621 -118178 -247602 -13083 63568
22895 63568 237195 80550 -77033 -106628 -415089 -94902 11804 289014 762949 693563
$$ packed form
22967a31435J60479o3711j93920k18737j7366J95349Q4729J898j83005J06625
22957b59094J23576L15110K10801k36568l17769Q3070J2620k77226M3728K67199
22947c4553J78650M6429l2778j41411k75147j23194M1345J10421q1120r4299L2451
22936c73206K8446n8797M530o991k97051K5687J81841K42906j94551k51539K94097
22925d04628K94300L10530J66638K1899j91415j63142p3839k62057j85882l01279
22915g88875J80082N03830N21923j3864k83092j27421K86910P4554l74387k02901
22905b23241M5217K13869L11529m1554r4523j83676j45799j29424K34519P6651
22895F3568J73627j56645j57583k9595l08461L20187J06706K77210M73935o9386
$$ plain form
22885 693563 238114 -85559 135040 7795 4899 -342401 -396141 -299439 -162260 -211868
22875 -211868 -364814 -237491 -154549 -24432 100708 459224 811573 588037 66177 -104374
22865 -104374 -129759 -398259 -200848 77445 370103 327039 188207 182780 -361520 33285
22855 33285 354838 242942 244729 114977 52277 -333655 -27516 31031 -41807 128822 132229
22844 132229 110040 303850 240568 178429 373953 631191 373444 115393 55193 218490
22834 218490 278767 -246366 -374314 -262544 -307236 -344891 -181935 -140721 -173512 -191304 -42235
22823 -42235 65081 -170663 -150200 -317659 -499412 -562015 -447483 23294 262309 247554
22813 247554 104516 1925 69763 227803 206141 141611 222433 50172 -181786 58292
$$ packed form
22885F93563m55449l23673K20599j27245k896l47300n3740R6702J37179m9608
22875b11868j52946J27323Q2942J30117J25140L58516L52349k23536n21860j70551
22865a04374k5385k68500J97411K78293K92658m3064j38832n427n44300L94805
22855C3285L21553j11896J787j29752o2700l85932L06139N8547p2838J70629L407
22844A32229k2189J93810o3282o2139J95524K57238k57747k58051o0200J63297
22834B18490O0277n25133j27948J11770m4692l7655J62956M1214l2791j7792J49069
22823d2235J07316k35744K0463j67459j81753o2603J14532M70777K39015j4755
22813B47554j43038j02591O7838J58040k1662o4530Q0822j72261k31958K40078
$$ plain form
22803 58292 43858 -246052 -117398 349380 405114 129860 -98701 -253986 -559034 -548484
22793 -548484 -237779 -316032 -552353 -528754 -356486 -79104 417045 569767 173366 224571
22783 224571 -100066 -186906 156647 270908 348103 29801 168482 321058 319103 307450
22773 307450 327037 379832 280676 253193 243001 40356 107120 307874 202863 -278341 -351633
22762 -351633 -183981 -75026 -186136 -458693 -770551 -647414 -745466 -790524 -456859 4560
22752 4560 93159 115540 -80869 -37798 -87540 -69995 -209565 -155088 174401 41036 248946
22741 248946 439539 433367 460270 880358 890574 563414 53999 -397129 -659342 -661430 -780957
22730 -780957 -845258 -603845 -257279 -215280 -259886 -68671 4970 -37967 -202411 -50867
$$ packed form
22803E8292j4434k89910J28654M66778N5734k75254k28561j55285l05048J0550
22793e48484L10705p8253k36321K3599J72268K77382M96149J52722l96401N1205
22783B24571l24637q6840L43553J14261P7195l18302J38681J52576j955j1653
22773C07450J9587N2795r9156k7483j0192k02645O6764K00754j05011m81204p3292
22762c51633J67652J08955j11110k72557l11858J23137r8052m5058L33665M61419
22752D560Q8599K2381j96409M3071m9742J7545j39570N4477L29489j33365K07910
22741B48946J90593o172K6903M20088J0216l27160n09415m51128k62213k088j19527
22730g80957o4301K41413L46566M1999m4606J91215P3641m2937j64444J51544
$$ plain form
22720 -50867 8116 63919 304496 188346 -96519 -46789 -59252 36314 43823 36621 262335
22709 262335 424845 189867 232472 177237 76622 44291 -157286 47855 323619 234821
22699 234821 -309488 -402550 -324126 -262406 -272140 -338091 125229 115217 255178 430279 484257
22688 484257 217879 27658 205057 207022 401537 314483 428921 133136 -415521 -379632
22678 -379632 -151446 4996 79408 37896 -406405 -223291 -312700 -747235 -529913 -412164
22668 -412164 -78209 333236 606070 241459 -182301 -300095 -324670 -64827 257605 144797
22658 144797 -9743 -55321 196946 400355 -23326 -352422 -441921 -127332 -149250 227056
22648 227056 456453 478662 222218 -54202 -323112 -522355 -601565 -916690 -363666 358514
$$ packed form
22720e0867N8983N5803K40577j16150k84865M9730j2463R5566P509p202K25714
22709B62335J62510k34978M2605n5235j00615l2331k01577K05141K75764q8798
22699B34821n44309r3062P8424O1720r734o5951M63320j0012J39961J75101N3978
22688D84257k66378j90221J77399J965J94515q7054J14438k95785n48657L5889
22678c79632K28186J56442P4412m1512m44301J83114q9409m34535K17322J17749
22668d12164L33955M11445K72834l64611m23760j17794k4575K59843L22432j12808
22658A44797j54540m5578K52267K03409m23681l29096q9499L14589k1918L76306
22648B27056K29397K2209k56444k76420k68910j99243p9210l15125N53024P22180
$$ plain form
22638 358514 782937 861818 553984 764577 781978 850025 358202 125036 68742 55142
22628 55142 101891 56853 82142 311230 401474 366694 234072 82027 -19076 -419751 -454496
22617 -454496 256446 329728 351922 640799 671491 730052 488699 420895 326283 168006 2051
22606 2051 -140991 -388585 -92033 -213665 -473901 93920 -12855 -239326 -264553 -390781
22596 -390781 -157263 138523 -185016 -147054 153000 380753 105982 101272 197070 182702
22586 182702 -150180 -20578 563124 720085 923252 937770 603586 271988 290092 525652
22576 525652 756411 532132 216974 -9348 129311 273736 -34926 -166878 -15161 70384
22566 70384 -145290 -110196 172456 539574 519003 606695 367442 188028 176093 -100636
$$ packed form
22638C58514M24423P8881l07834K10593J7401O8047m91823k33166n6294j3600
22628E5142M6749m5038K5289K29088R0244l4780j32622j52045j01103m00675l4745
22617d54496P10942P3282K2194K88877L0692N8561k41353o7804r4612j58277j65955
22606B051j43042k47594K96552j21632k60236N67821j06775k26471k5227j26228
22596c90781K33518K95786l23539L7962L00054K27753k74771m710R5798j4368
22586A82702l32882J29602N83702J56961K03167J4518l34184l31598J8104K35560
22576E25652K30759k24279l15158k26322J38659J44425l08662j31952J51717Q5545
22566G0384k15674L5094K82652L67118k0571Q7692k39253j79414j1935k76729
$$ plain form
22556 -100636 -311156 -68101 -5101 -37533 -93931 100052 -297683 -509756 -288679 -235302
22546 -235302 -242430 50069 209388 375129 423325 345251 261871 325682 659436 772833 681858
22535 681858 558211 356589 283848 391316 329225 32472 -13972 -16847 144825 339555
22525 339555 304103 19657 -64041 -114883 -221071 37659 270635 -3183 71259 -54896
22515 -54896 -136942 190801 513920 478165 48096 -22960 158300 220694 81857 42283 306937
22504 306937 501062 363466 382222 517308 472670 624464 463122 209616 19991 117194
22494 117194 78454 155578 203078 95710 341979 643334 401439 85427 116839 393606
22484 393606 771913 952760 821064 406563 213281 287608 262449 221648 51295 -266392
$$ packed form
22556a00636k10520K43055O3000l2432n6398J93983l97735k12073K21077N3377
22546b35302p128K92499J59319J65741M8196p8074q3380O3811L33754J13397r0975
22535F81858j23647k01622p2741J07468o2091k96753m6444k875J61672J94730
22525C39555l5452k84446q3698n0842j06188K58730K32976k73818P4442j26155
22515e4896q2046L27743L23119l5755m30069p1056J81260O2394j38837l9574K64654
22504C06937J94125j37596J8756J35086m4638J51794j61342k53506j89625R7203
22494A17194l8740P7124M7500j07368K46269L01355k41895l16012L1412K76767
22484C93606L78307J80847j31696m14501j93282P4327k5159m0801j70353l17687
$$ plain form
22474 -266392 -268031 -332598 -224082 -332125 -81357 43509 15092 -321215 -128400 -111190
22464 -111190 -50651 -122667 -259368 -31879 168975 -24797 -69557 196497 187862 243243 371761
22453 371761 181147 178898 261324 64519 22777 -139348 -26468 62154 246535 580632
22443 580632 78682 -347239 -584679 -561545 -476357 -726264 -216439 166945 96402 36247
22433 36247 276012 221318 -105214 88935 94434 15983 -66240 -55199 -112491 -130278 73731
22422 73731 484634 538659 192082 -8010 -47097 19943 242449 369712 688909 497803
22412 497803 432900 486666 348575 169872 137987 181531 -142405 -256466 -696887 -1029095
22402 -1029095 -873689 -323595 -163895 -700692 -570341 -410263 -256703 -395594 -379254 -169875
$$ packed form
22474b66392j639o4567J08516j08043K50768J24866k8417l36307J92815J7210
22464a11190O0539p2016j36701K27489K00854j93772m4760K66054q635N5381J28518
22453C71761j90614k249Q2426j96805m1742j62125J12880Q8622J84381L34097
22443E80632n01950m25921k37440K3134Q5188k49907N09825L83384p0543o0155
22433C6247K39765n4694l26532J94149N499p8451q2223J1041n7292j7787K04009
22422G3731M10903N4025l46577k00092l9087O7040K22506J27263L19197j91106
22412D97803o4903N3766j38091j78703l1885M3544l23936j14061m40421l32208
22402a029095J55406N50094J59700n36797J30351J60078J53560j38891J6340K09379
$$ plain form
22392 -169875 -138033 -343921 -327033 -1881 58252 -236462 -443573 -255594 -239644 5971
22382 5971 108233 -46781 -259870 -482052 -5542 177601 363419 261330 -56552 -117848
22372 -117848 49838 230813 28225 -445890 -350500 -306927 -624126 -430237 -82306 -22386
22362 -22386 -85026 170914 111751 350767 311020 280992 2210 -252594 -91765 -149449 -99982
22351 -99982 -28284 -189052 -362825 -323734 58844 68703 76663 -219500 -258841 -157314 -160077
22340 -160077 -126542 63642 17936 -134034 -106826 -83475 -8695 -44865 259434 37370 -426307
22329 -426307 -308540 8718 54375 38463 -98659 55397 38444 333043 125448 -82498
22319 -82498 111150 549820 227263 -16618 -165578 -130457 -96294 -145582 46313 242286
$$ packed form
22392a69875L1842k05888J6888L25152O0133k94714k07111J87979J5950K45615
22382E971J02262j55014k13089k22182M76510J83143J85818j02089l17882o1296
22372a17848J67686J80975k02588m74115R5390M3573l17199J93889L47931N9920
22362b2386o2640K55940n9163K39016l9747l0028k78782k54804J60829n7684M9467
22351i9982P1698j60768j73773L9091L82578R859P960k96163l9341J01527k763
22340a60077L3535J90184m5706j51970K7208K3351P4780l6170L04299k22064m63677
22329d26307J17767L17258M5657j5912j37122J54056j6953K94599k07595k07946
22319h2498J93648M38670l22557k43881j48960L5121L4163m9288J91895J95973
$$ plain form
22309 242286 167236 142989 91709 38155 401456 306865 -48467 -332106 -459499 -454344 -293374
22298 -293374 -392884 -544121 -473474 -513856 -430803 -612201 -429255 -115802 -160514 -350086
22288 -350086 -451711 -345900 -386113 -265821 -320859 -405179 4300 23061 88080 120218 -1694
22277 -1694 70402 295264 22845 -520867 -413588 -327170 -1172 249366 -52347 94010
22267 94010 197825 311402 271272 292659 188470 328583 449852 369532 432879 539893
22257 539893 622963 250707 320015 638331 435710 82125 159641 534293 454681 284699
22247 284699 33553 186275 389425 320997 164861 252085 391547 342297 624810 684269
22237 684269 698339 272575 26242 -12255 -51327 30284 15581 -386694 -489290 -384895
$$ packed form
22309B42286p5050k4247n1280n3554L63301r4591l55332k83639j27393N155J60970
22298b93374r9510j51237P0647m0382Q3053j81398J82946L13453m4712j89572
22288c50086j01625J05811m0213J20292n5038q4320M09479J8761O5019L2138j21912
22277a694P2096K24862k72419n43712J07279Q6418L25998K50538l01713J46357
22267I4010J03815J13577m0130K1387j04189J40113J21269q0320O3347J07014
22257E39893Q3070l72256O9308L18316k02621l53585P7516L74652p9612j69982
22247B84699k51146J52722K03150o8428j56136Q7224J39462m9250K82513N9459
22237F84269J4070m25764k46333l8497l9072Q1611j4703m02275j02596J04395
$$ plain form
22227 -384895 -373836 -108285 -258417 -223728 -379308 -540694 -556581 -391379 -46761 -234740
22217 -234740 -518667 -582764 -313833 118056 261769 278014 109017 69875 -48803 -45586
22207 -45586 -279583 -196393 20710 -52644 113138 213373 -63155 -129654 48829 32135
22197 32135 -19205 -24229 -106203 -247863 -382737 -262043 -141722 -128645 -152952 -137804 -45764
22186 -45764 41711 -228035 -94952 338875 428773 366207 293574 463318 118716 -117919
22176 -117919 -300568 -406920 -200393 -251103 -216676 -170844 123022 253553 -16120 -195182
22166 -195182 -123238 -40666 90306 48548 82330 243775 76535 -117160 -132849 55891
22156 55891 -28796 -265022 -238928 37164 65265 -75145 -425834 -402483 -188638 -53744
$$ packed form
22227c84895J1059K65551j50132L4689j55580j61386j5887J65202L44618j87979
22217b34740k83927o4097K68931M31889J43713J6245j68997l9142j18678L217
22207d5586k33997Q3190K17103p3354J65782J00235k76528o6499J78483j6694
22197C2135n1340n024q1974j41660j34874J20694J20321J3077k4307J5148R2040
22186d5764Q7475k69746J33083M33827Q9898o2566p2633J69744l44602k36635
22176a17919j82649j06352K06527n0710L4427M5832K93866J30531k69673j79062
22166a95182P1944Q2572J30972m1758L3782J61445j67240j93695j5689J88740
22156E5891q4687k36226K6094K76092K8101j40410l50689K3351K13845J34894
$$ plain form
22146 -53744 -188749 121261 441598 621605 377785 99980 202917 250761 518297 367211
22136 367211 39896 -330179 -238509 60478 393375 233074 -224586 -93644 112645 360747
22126 360747 361367 321337 -12283 58619 483060 482693 494989 155814 300181 586446 470881
22115 470881 241946 94151 -42958 -19703 286640 361798 -46158 -11914 224148 387236
22105 387236 327792 345519 82247 -160081 -439300 -451679 -189791 -64356 -333559 -541935
22095 -541935 -419485 -155132 118024 101539 -1368 -406042 -430590 -434161 -392430 22621
22085 22621 -83943 98438 392136 501205 22134 -288154 -201562 -318403 -55596 192743
22075 192743 223022 182517 -71242 -243583 -459257 -485032 -256163 -58106 -276374 -339189
$$ packed form
22146e3744j35005L10010L20337J80007k43820k77805J02937M7844K67536j51086
22136C67211l27315l70075R1670K98987L32897j60301m57660J30942K06289K48102
22126C60747O20m0030l33620P0902M24441l67J2296l39175J44367K86265j15565
22115D70881k28935j47795j37109K3255L06343P5158m07956L4244K36062J63088
22105C87236n9444J7727k63272k42328k79219j2379K61888J25435k69203k08376
22095e41935J22450K64353K73156j6485j02907m04674k4548l571M1731M15051
22085B2621j06564J82381K93698J09069m79071l10288Q6592j16841K62807K48339
22075A92743L0279m0505k53759j72341k15674k5775K28869J98057k18268o2815
$$ plain form
22065 -339189 -446614 -438475 -280875 -339937 -255683 -138452 -166267 -120152 157478 181881 28078
22054 28078 -310027 -176099 33281 220733 93765 -95309 -111546 48157 188782 97991
22044 97991 -324278 -185971 216106 316931 471632 581692 271939 216338 -24794 -124948
22034 -124948 2884 -45179 -236914 -78292 76563 308690 335834 237570 81190 -29268
22024 -29268 -24348 5596 176939 192865 342774 355633 504151 142410 -352460 -430185 -541022
22013 -541022 -621098 -435856 -250697 -22554 149846 -104051 -95161 -140286 -127391 -56147 99875
22002 99875 37598 322561 412420 8836 -552787 -501526 -176378 -130828 -119388 -94277 102936
21991 102936 110066 326971 442749 308473 63124 40770 124568 -9358 -475090 -798761
$$ packed form
22065c39189j07425Q139J57600n9062Q4254J17231k7815M6115K77630K4403j53803
22054B8078l38105J33928K09380J87452j26968j89074j6237J59703J40625r0791
22044I7991m22269J38307M02077J00825J54701J10060l09753n5601k41132j00154
22034a24948J27832m8063j91735J58622J54855K32127K7144r8264j56380j10458
22024b9268M920K9944J71343J5926J49909J2859J48518l61741m94870p7725j10837
22013e41022q0076J85242J85159K28143J72400k53897Q890m5125J2895P1244J56022
22002I9875o2277K84963Q9859m03584n61623N1261L25148M5550J1440K5111J97213
21991A02936P130K16905J15778j34276k45349k2354Q3798j33926m65732l23671
$$ plain form
21981 -798761 -381076 -463610 -386743 -32706 56638 24350 166413 362294 407522 153508
21971 153508 150814 451382 90387 -65787 250763 299403 284580 391142 240924 178986
21961 178986 419919 588340 297625 170980 -69285 -96721 64140 221888 454134 297015
21951 297015 56013 -66822 -57334 -158316 -122085 -93993 -96830 217536 211142 98906 -110888
21940 -110888 -208226 -351958 -299411 -126422 -165548 223817 234454 366488 374590 148018 -166068
21929 -166068 -226435 -135504 383005 589389 71508 -156360 -21271 239728 -60767 -321939
21919 -321939 -55259 -47135 -60589 263678 138418 68723 172956 -90915 -152640 -350233
21909 -350233 -698162 -642246 -266705 -251205 -95369 -234144 -348579 -266814 13768 -125815
$$ packed form
21981g98761M17685q2534P6867L54037Q9344l2288J42063J95881M5228k54014
21971A53508k694L00568l60995j56174L16550M8640j4823J06562j50218o1938
21961A78986K40933J68421k90715j26645k40265k7436J60861J57748K32246j57119
21951B97015k41002j22835R488j00982L6231K8092k837L14366o394j12236k09794
21940a10888r7338j43732N2547J72989l9126L89365J0637J32034Q102k26572l14086
21929a66068o0367R0931N18509K06384n17881k27868J35089K60999l00495k61172
21919c21939K66680Q124j3454L24267j25260o9695J04233k63871o1725j97593
21909c50233l47929N5916L75541J5500J55836j38775j14435Q1765K80582j39583
$$ plain form
21899 -125815 -131543 189063 371240 278713 208382 105285 80520 -254551 -429301 -229885
21889 -229885 5569 109494 428618 267720 -105394 -82252 -281428 -272357 -76023 -206486
21879 -206486 -479422 -54043 -150397 -513093 -323866 -295329 -212144 36217 313124 -164756
21869 -164756 -442883 -163224 46830 -32605 104425 -90050 -355599 -177094 -130219 -36074
21859 -36074 11667 -190863 -196980 -145607 -252735 -210827 257070 162979 -165587 -264447 -95937
21848 -95937 -154699 -101531 -74142 -119689 -143737 -289323 -144113 -19205 -22190 -222275 -46142
21837 -46142 -227075 -519807 -451149 -436819 -239304 -8990 323413 150771 31303 -127530
21827 -127530 -426825 -511946 -265829 57338 -155503 26870 -252348 -172683 167828 342861
$$ packed form
21899a25815n728L20606J82177r2527p0331j03097k4765l35071j74750J99416
21889b29885K35454J03925L19124j60898l73114K3142j99176R071J96334j30463
21879b06486k72936M25379r6354l62696J89227K8537Q3185K48361K76907m77880
21869a64756k78127K79659K10054p9435J37030j94475k65549J78505M6875R4145
21859c6074M7741k02530o117N1373j07128M1908M67897r4091l28566r8860J68510
21848i5937n8762N3168K7389m5547k4048j45586J45210J24908k985k00085J76133
21837d6142j80933k92732O8658J4330J97515K30314L32403j72642j19468j58833
21827a27530k99295q5121K46117L23167k12841J82373k79218P9665L40511J75033
$$ plain form
21817 342861 211439 119585 145856 126203 130570 93866 76560 -311829 -504093 -346679 -203185
21806 -203185 -138615 -20447 -67723 -187655 -93965 62082 85659 -176251 -120223 -187606 -362132
21795 -362132 -280059 -379464 -462514 -553685 -486737 -410279 -168176 80966 -161442 -507007 -644298
21784 -644298 -379602 -273823 -514260 -228653 -567063 -683398 -426844 -522450 -615486 -529496
21774 -529496 -164078 213995 177517 225623 347827 -42673 -256400 -118829 72864 47959
21764 47959 234343 534741 519253 17855 -347155 -318459 -47313 -161091 99051 256948
21754 256948 289547 74383 153790 -102793 -369401 -451878 -435484 -388554 -211586 -137586 -486831
21743 -486831 -764544 -655676 -348342 -207556 -7748 318919 333483 68675 -48237 -115782
$$ packed form
21817C42861j31422r1854K6271j9653M367l6704j7306l88389j92264J57414J43494
21806b03185O4570J18168m7276j19932R3690J56047K3577k61910N6028o7383j74526
21795c62132Q2073r9405q3050r1171O6948P6458K42103K49142k42408l45565j37291
21784f44298K64696J05779k40437K85607l38410j16335K56554r5606r3036Q5990
21774e29496L65418L78073l6478M8106J22204l90500k13727J37571J91693k4905
21764D7959J86384L00398j5488n01398l65010K8696K71146j13778K60142J57897
21754B56948L2599k15164P9407k56583k66608q2477J6394M6930J76968P4000l49245
21743d86831k77713J08868L07334J40786J99808L26667J4564k64808j16912o7545
$$ plain form
21733 -115782 176629 9107 -110788 174205 311807 354538 602868 509372 283284 446192
21723 446192 805784 416611 57198 92749 -52367 -339230 -518839 -279342 231376 172093
21713 172093 -52526 -83724 -213008 -83574 85108 -273206 -429100 -287599 -278344 -398840
21703 -398840 -208416 71756 218153 90797 -325213 -692758 -401534 -470539 -571611 -290715
21693 -290715 -80270 62087 145667 26746 -122375 -244211 -289792 -119954 -178163 -44315
21683 -44315 -138973 -301405 -145002 112680 197225 152810 107082 193293 410669 532687 317827
21672 317827 149753 -26264 190150 465349 517758 235767 -15402 -223134 -5622 -71242
21662 -71242 -15231 346549 250767 -54826 -139877 -128281 -45839 -216319 -264087 -109809 82215
$$ packed form
21733a15782K92411j67522j19895K84993J37602M2731K48330r3496k26088J62908
21723D46192L59592l89173l59413L5551j45116k86863j79609K39497N10718n9283
21713A72093k24619l1198j29284J29434J68682l58314j55894J41501R255j20496
21703c98840J90424K80172J46397j27356m16010l67545K91224o9005j01072K80896
21693b90715K10445J42357Q3580j18921j49121j21836m5581J69838n8209J33848
21683d4315r4658j62432J56403K57682Q4545m4415m5728Q6211K17376J22018k14860
21672C17827j68074j76017K16414K75199N2409k81991k51169k07732K17512o5620
21662g1242N6011L61780r5782l05593q5051J1596Q2442j70480m7768J54278J92024
$$ plain form
21651 82215 14411 -7116 183195 272610 -95266 -346801 -262436 -164978 -96043 140778 -67400
21640 -67400 -381856 -322334 171863 407006 220684 41210 -436089 -448508 -578152 -296468
21630 -296468 190276 322057 62450 57446 -94586 -48555 -135181 -298108 -89046 -36175
21620 -36175 159586 343806 415944 -10791 -25528 187749 306451 340573 266900 73627
21610 73627 -54039 -230805 -59123 107951 41306 -313510 -381948 -455840 -459630 -31042 -122073
21599 -122073 -200965 122847 87730 -6446 88356 206533 567802 605722 309552 149213
21589 149213 147246 95832 -34207 84525 618229 619642 434422 322737 529435 339334
21579 339334 287136 264686 281278 299319 212223 128712 72740 372085 227072 153621 23535
$$ packed form
21651H2215o7804k1527J90311Q9415l67876k51535Q4365R7458O8935K36821k08178
21640f7400l14456N9522M94197K35143j86322j79474m77299j2419j29644K81684
21630b96468M86744J31781k59607n004j52032M6031q6626j62927K09062N2871
21620c6175J95761J84220P2138m26735j4737K13277J18702L4122p3673j93273
21610G3627j27666j76766J71682J67074o6645l54816o8438p3892l790M28588r1031
21599a22073p8892L23812l5117r4176R4802J18177L61269L7920k96170j60339
21589A49213j967n1414j30039J18732N33704J413j85220j11685K06698j90101
21579C39334n2198k2450J6592J8041q7096q3511n5972K99345j45013p3451j30086
$$ plain form
21568 23535 -6313 -283176 -333605 -238062 -239289 -287806 -410957 -433947 -105073 -67789 200741
21557 200741 319138 276346 552141 656418 408597 206513 263721 253254 229765 207476
21547 207476 -246714 -416776 -513629 50913 268505 309259 238426 -223309 -267236 -155560
21537 -155560 167603 79916 -257862 -56246 185598 42160 -437514 -443432 -166066 -178546
21527 -178546 -199620 -300371 -142181 29788 -67862 216733 360348 213115 123293 327784
21517 327784 2291 -189653 68392 227213 184192 93832 243409 -48271 -466420 -344928
21507 -344928 -190250 -109462 196991 252635 549861 501851 177672 -243354 15280 367638
21497 367638 423869 326131 550346 516365 438228 117777 -160410 -237439 -6939 58768 -74510
$$ packed form
21568B3535k9848k76863n0429R5543j227m8517j23151k2990L28874L7284K68530
21557B00741J18397m2792K75795J04277k47821k02084N7208j0467k3489k2289
21547B07476m54190j70062r6853N64542K17592M0754p0833m61735m3927J11676
21537a55560L23163q7687l37778K01616K41844j43438m79674n918K77366j2480
21527a78546k1074j00751J58190J71969r7650K84595J43615j47233q9822K04491
21517C27784l25493j91944K58045J58821m3021r0360J49577k91680m18149J21492
21507c44928J54678Q0788L06453N5644K97226m8010l24179m21026K58634L52358
21497C67638N6231r7738K24215l3981p8137l20451k78187p7029K30500O5707j33278
$$ plain form
21486 -74510 -316611 -289230 -39232 36715 -139240 -305401 -138015 -174049 -499605 -504470 -253755
21475 -253755 -78448 99327 125735 -302164 -613881 -171161 -92615 125934 462971 539605
21465 539605 294653 211204 174284 -145469 -313885 -361742 -434969 -536712 -541685 -382732 -54562
21454 -54562 -296378 -434088 -360778 -348408 -408397 -589408 -727663 -389989 -263546 -113230
21444 -113230 -44154 -182882 -436493 -697375 -787510 -593691 -562993 -325081 -1565 101537
21434 101537 153900 141322 254225 325418 -10786 -294139 -156664 -342395 -229514 -109847
21424 -109847 223775 173350 -95451 -85867 -137314 -226707 -157121 -179490 -224586 -154599 -280798
21413 -280798 -182950 -398118 -554032 -486385 -424873 -579395 -752444 -583615 -96224 56637
$$ packed form
21486g4510k42101K7381K49998P5947j75955j66161J67386l6034l25556m865K50715
21475b53755J75307J77775K6408m27899l11717M42720P8546K18549L37037P6634
21465E39605k44952q3449l6920l19753j68416m7857p3227j01743m973J58953L28170
21454e4562k41816j37710P3310J2370n9989j81011j38255L37674J26443J50316
21444a13230O9076j38728k53611k60882r0135J93819L0698K37912L23516J03102
21434A01537N2363j2578J12903P1193l36204k83353J37475j85731J12881J19667
21424a09847L33622n0425k68801R584n1447q9393O9586k2369m5096O9987j26199
21413b80798R7848k15168j55914O7647O1512j54522j73049J68829M87391J52861
$$ plain form
21403 56637 193743 191780 -150644 -273529 -383527 -54008 -58340 -30158 190191 261317 269189
21392 269189 91951 -94849 -83599 -81351 -108738 -266384 -641413 -913386 -790917 -585554
21382 -585554 -385360 -363833 -351203 -304713 -350989 -184134 -54203 39132 -93788 -226183
21372 -226183 -144850 146136 210173 294969 436920 548676 133229 64 -125206 -150178
21362 -150178 127864 57235 -41996 66206 346546 167753 -2157 -541216 -601074 -484557
21352 -484557 -341714 -393773 -351246 -153103 12507 -295311 -583274 -456125 -326369 -93131
21342 -93131 -204431 -135445 -43067 96855 -27755 -271256 -619223 -671455 -800111 -824861
21332 -824861 -541069 -326752 -486418 -458696 -134127 126486 -117311 19609 24355 -41300
$$ packed form
21403E6637J37106j963l42424j22885j09998L29519m332K8182K20349P1126P872
21392B69189j77238j86800J1250K248k7387j57646l75029k71973J22469K05363
21382e85554K00194K1527J2630M6490m6276J66855J29931R3335j32920j32395
21372b26183Q1333K90986O4037Q4796J41951J11756m15447j33165j25270k4972
21362a50178K78042p0629r9231J08202K80340j78793j69910n39059n9858J16517
21352d84557J42843n2059M2527J98143J65610l07818k87963J27149J29756K33238
21342i3131j11300O8986R2378J39922j24610k43501l47967n2232j28656k4750
21332h24861K83792K14317j59666K7722L24569K60613k43797J36920M746o5655
$$ plain form
21322 -41300 -176947 -312739 -203231 251652 566260 679311 727971 372981 350975 346123
21312 346123 111954 86629 365495 517950 694630 425272 29932 -409868 -439343 -411165
21302 -411165 -517203 -582592 -552969 -236437 116392 -40922 -75982 -224146 13761 59377
21292 59377 -59649 -85852 -219552 -405345 -52170 17538 -545349 -664182 -682012 -400276
21282 -400276 -235415 -259742 -127499 -193530 -566300 -252584 -12292 -34317 -309374 -240458
21272 -240458 157038 377791 149846 -33954 204565 316152 293564 226504 244890 466934
21262 466934 863820 828436 797825 528103 97990 128570 -1188 542 203221 581523
21252 581523 484111 300375 262648 202109 40462 219127 136483 109014 102945 105678 275867
$$ packed form
21322d1300j35647j35792J09508M54883L14608J13051M8660l54990k2006m852
21312C46123k34169k5325K78866J52455J76680k69358l95340m39800k9475K8178
21302d11165j06038o5389K9623L16532L52829j57314l5060j48164K37907M5616
21292E9377j19026k6203j33700j85793L53175O9708n62887j18833j7830K81736
21282d00276J64861k4327J32243o6031l72770L13716K40292k2025k75057O8916
21272b40458L97496K20753k27945j83800K38519J11587k2588o7060J8386K22044
21262D66934L96886l5384l0611k69722m30113L0580j29758J730K02679L78302
21252E81523r7412j83736l7727o0539j61647J78665q2644k7469o069K733J70189
$$ plain form
21241 275867 435870 345137 388501 323917 545365 829988 855731 491070 281573 44176
21231 44176 148501 192532 255420 182505 249841 537181 -109277 105287 351627 368201 139575
21220 139575 148113 170696 -23507 -41334 102750 37282 103145 206531 446623 693263 569768
21209 569768 370612 301302 348393 265129 -227494 -396926 -125723 142916 264627 513869
21199 513869 609420 115425 -238470 -183896 -303431 -367693 -431087 -466885 -271260 123505
21189 123505 40297 -481783 -512818 -142768 248291 140784 -111751 69251 -101788 -87148
21179 -87148 100276 196057 162009 16145 146856 392156 308168 292444 533895 748705
21169 748705 799529 725642 623599 335142 152577 -72677 -199091 -551522 -620842 -206700
$$ packed form
21241B75867J60003r0733M3364o4584K21448K84623K5743l64661k09497k37397
21231D4176J04325M4031O2888p2915O7336K87340o46458K14564K46340J6574k28626
21220A39575Q538K2583j94203j7827J44084o5468O5863J03386K40092K46640j23495
21209E69768j99156o9310M7091q3264m92623j69432K71203K68639J21711K49242
21199E13869R5551m93995l53895N4574j19535o4262o3394l5798J95625L94765
21189A23505q3208n22080l1035L70050L91059j07507k52535J81002j71039J4640
21179h7148J87424R5781l4048j45864J30711K45300q3988j5724K41451K14810
21169G48705N0824p3887j02043k88457j82565k25254j26414l52431o9320M14142
$$ plain form
21159 -206700 -312637 -443855 -152223 18318 -58179 -346316 -379853 -501465 -351783 -70346
21149 -70346 361632 527119 281288 170005 84803 -124968 -2881 -130521 -333412 -520474
21139 -520474 -140233 219570 168387 369573 227298 -94294 21309 -204395 -307309 -72073
21129 -72073 -285262 -376841 107233 374481 279667 103100 -11394 -55689 -278822 -415287
21119 -415287 -151944 254391 529156 390287 45555 -105096 -217729 -93760 123917 214926
21109 214926 150242 -156940 -276606 -35629 84267 134570 -200749 -416287 -156861 -122329
21099 -122329 61129 -97923 43103 -21402 -182822 -386842 -284235 39118 177775 -126661
21089 -126661 -458473 -468856 -309804 -371003 -139941 148542 -126569 -312741 -71336 -6983
$$ packed form
21159b06700j05937j31218K91632J70541p6497k88137l3537j21612J49682K81437
21149g0346M31978J65487k45831j11283q5202k09771J22087j27640k02891j87062
21139e20474L80241L59803n1183K01186j42275l21592J15603k25704j02914K35236
21129g2073k13189r1579M84074K67248r4814j76567j14494m4295k23133j36465
21119d15287K63343M06335K74765j38869l44732j50651j12633J23969K17677R1009
21109B14926o4684l07182j19666K40977J19896N0303l35319k15538K59426L4532
21099a22329J83458j59052J41026o4505j61420k04020J02607L23353J38657l04436
21089a26661l31812j0383J59052o1199K31062K88483k75111j86172K41405O4353
$$ plain form
21079 -6983 -46479 109681 330640 160137 -197806 209590 363251 370118 276426 222210 145207
21068 145207 -462062 -695874 -445714 -119083 -155361 -212689 -426948 -259485 216086 185468
21058 185468 -46260 -39036 -110247 -433353 -808568 -407773 -264717 -331697 35271 222691
21048 222691 318480 101870 -201762 -209924 -206729 -173150 -235308 -50915 -117496 25710 116819
21037 116819 332789 371133 -92239 -484492 -329596 -19460 -159586 -215721 -221946 -149607
21027 -149607 -411127 -700717 -326448 46916 58023 195580 103921 -158260 -344638 -467399
21017 -467399 -422634 -254420 -134911 -474497 -333384 -106033 -34492 49478 352008 452893
21007 452893 176732 28192 -67167 -68335 -7529 217877 34407 -260028 -104581 96615
$$ packed form
21079f983l9496J56160K20959j70503l57943M07396J53661O867r3692n4216p7003
21068A45207o07269k33812K50160L26631l6278n7328k14259J67463M75571l0618
21058A85468k31728P224p1211l23106l75215M00795J43056o6980L66968J87420
21048B22691R5789k16610l03632q162L195L3579o2158J84393o6581J43206R1109
21037A16819K15970L8344m63372l92253J54896L10136j40126n6135o225P2339
21027a49607k61520k89590L74269L73364J1107J37557r1659k62181j86378j22761
21017d67399M4765J68214J19509l39586J41113K27351P1541Q3970L02530J00885
21007D52893k76161j48540r5359j168O0806K25406j83470k94435J55447K01196
$$ plain form
20997 96615 229853 111636 -8173 25596 54837 349153 420493 402250 26500 10046 77461
20986 77461 130770 288039 425031 455628 488681 449830 118849 81972 287813 198307 -132587
20975 -132587 -78290 107624 211915 216576 154318 295070 701040 736779 578418 86589
20965 86589 -26835 -56499 -238662 -181156 -73416 -389536 -192451 -44545 219691 136678
20955 136678 30933 221057 432534 26833 -163613 -28762 -61069 -458345 -759399 -630865
20945 -630865 -463627 -370411 -597417 -622548 -281724 -193462 -197050 -13449 4547 -241190 -225146
20934 -225146 189509 864245 919749 593581 595080 480256 464815 -21724 -290982 -51533
20924 -51533 -309126 -417358 -352890 -420045 -280961 -221950 -353468 88509 514639 343184
$$ packed form
20997I6615J33238j18217j19809L3769K9241K94316P1340j8243l75750j6454O7415
20986G7461N3309J57269J36992L0597L3053l8851l30981l6877K05841q9506l30894
20975a32587N4297J85914J04291M661o2258J40752M05970L5739j58361m91829
20965H6589j13424k9664j82163N7506J07740l16120J97085J47906K64236q3013
20955A36678j05745J90124K11477m05701j90446J34851l2307l97276l01054J28534
20945f30865J67238R3216k27006k5131L40824Q8262l588J83601J7996k45737J6044
20934b25146M14655O74736N5504l26168J499j14824j5441m86539k69258K39449
20924e1533k57593j08232O4468o7155J39084N9011j31518M41977M26130j71455
$$ plain form
20914 343184 468328 720058 416172 287839 319719 168005 283780 201683 -57260 -115324
20904 -115324 62766 43534 -320299 -557003 -505037 -534639 -387380 -511262 -262018 -44777
20894 -44777 -117175 68203 2077 -398374 -587907 -244193 -187728 -55681 -77269 -28154 -110000
20883 -110000 -56940 306721 58771 -146094 -124838 -312076 -312199 18628 206435 -97810
20873 -97810 -275725 -48777 -55739 -189399 -226893 -43225 126207 433228 481400 407017 120303
20862 120303 20054 156003 510115 273967 130477 -32464 -53628 -36876 171167 141553
20852 141553 -120694 -428348 -311140 -474433 -560445 -531378 -440586 -403625 -233624 -305487
20842 -305487 -289763 -233136 502794 808697 554392 275207 1610 19241 109389 63756
$$ packed form
20914C43184J25144K51730l03886j28333L1880j51714J15775q2097k58943n8064
20904a15324J78090j9232l63833k36704N1966k9602J47259j23882K49244K17241
20894d4777p2398J85378o6126m00451j89533L43714N6465J32047k1588M9115q1846
20883a10000N3060L63661k47950k04865K1256j87238j23L30827J87807l04245
20873i7810j77915K26948o962j33660l7494J83668J69432L07021M8172p4383k86714
20862A20303j00249J35949L54112k36148j43490j62941k1164J6752K08043k9614
20852A41553k62247l07654J17208j63293q6012K9067R0792L6961J70001p1863
20842c05487J5724N6627P35930L05903k54305k79185k73597J7631R0148m5633
$$ plain form
20832 63756 194728 294896 377989 235542 144053 47486 105030 -77123 -219266 -134819 144716
20821 144716 260207 382751 31790 -235989 276998 704201 837122 592401 448782 40212
20811 40212 59430 -100079 -540412 -357579 -43311 120395 54089 -334120 -290957 -184030
20801 -184030 -114608 63023 373992 131079 -241195 -8727 162324 -129305 -273733 -46737
20791 -46737 -290454 -147631 -286987 -158651 -259496 -398895 -326023 -556874 -607237 -288909
20781 -288909 -115773 -308496 -407533 -238625 -585576 -544877 -166229 273878 435530 341999
20771 341999 412072 328608 -57196 -26024 182603 216938 209235 135799 186564 222107 406008
20760 406008 570531 636684 818062 896097 757340 569361 637819 328965 333278 586497
$$ packed form
20832F3756J30972J00168Q3093j42447r1489r6567N7544j82153j42143Q4447K79535
20821A44716J15491J22544l50961k67779N12987M27203J32921k44721j43619m08570
20811D0212J9218j59509m40333J82833L14268J63706o6306l88209M3163J06927
20801a84030O9422J77631L10969k42913l72274K32468J71051k91629j44428K26996
20791d6737k43717J42823j39356J28336j00845j39399P2872k30851n0363L18328
20781b88909J73136j92723r9037J68908l46951M0699L78648M40107J61652r3531
20771C41999P0073q3464l85804L1172K08627L4335p703p3436N0765L5543J83901
20760D06008J64523O6153J81378P8035j38757j87979O8458l08854M313K53219
$$ plain form
20750 586497 295925 341217 461446 643793 390069 61265 -275754 -380207 -408044 -498923
20740 -498923 -48653 -183142 -206306 70596 -38946 -447021 -554824 -219651 -64097 -136167
20730 -136167 -340291 -268347 -282306 -346077 -273149 -316657 -290626 -53850 -12651 -234793 -271410
20719 -271410 -225442 -411076 -192562 -325899 -36193 301737 543177 671720 593401 268816
20709 268816 -56331 -432079 -277034 -78874 52567 87333 41790 -67506 72759 221865
20699 221865 500210 362364 176126 64429 -299291 -432403 -639313 -652097 -702831 -687345
20689 -687345 -360654 -166655 -224514 -340738 -135375 -334047 -305855 -67740 62036 141186
20679 141186 233502 -7126 -2400 364019 554727 518580 266857 106326 -60105 -203944
$$ packed form
20750E86497k90572M5292J20229J82347k53724l28804l37019j04453k7837r0879
20740d98923M50270j34489k3164K76902j09542m08075j07803L35173J55554p2070
20730a36167k04124P1944j3959o3771P2928m3508K6031K36776M1199k22142l6617
20719b71410M5968j85634K18514j33337K89706L37930K41440J28543p8319l24585
20709B68816l25147l75748J55045J98160J31441L4766m5543j09296J40265J49106
20699B21865K78345j37846j86238j11697l63720j33112k06910j2784n0734J5486
20689f87345L26691J93999n7859j16224K05363j98672K8192K38115J29776P9150
20679A41186R2316k40628M726L66419J90708l6147k51723j60531j66431j43839
$$ plain form
20669 -203944 -354783 -406614 -163498 -90338 -64404 104413 -305 64878 -50434 31406
20659 31406 -37288 22399 222384 -43003 -134838 -353251 -290214 -43537 37751 -105493 -236714
20648 -236714 -602684 -749312 -711248 -558710 -638783 -301397 -312989 -204891 -36561 -216099
20638 -216099 -313833 -279404 -438170 -683452 -641581 -643766 -375144 -214431 11914 91999 -27166
20627 -27166 -52842 -252259 -339281 -238508 -154607 -234888 -242557 -329111 -209210 -131711 18410
20616 18410 220801 112318 -146999 -223863 -279158 -134591 17473 -85072 197151 330810
20606 330810 488318 793194 920969 746923 285174 -21469 -385440 -549730 -213026 -54386
20596 -54386 255684 399080 226684 -120253 -125704 -71457 -51363 -27669 130929 52848 -315281
$$ packed form
20669b03944j50839n1831K43116P3160K5934J68817j04718O5183j15312Q1840
20659C1406o8694N9687J99985k65387r1835k18413O3037K46677Q1288j43244j31221
20648b36714l65970j46628L8064J52538q0073L37386j1592J08098J68330j79538
20638b16099r7734L4429j58766k45282M1871k185K68622J60713K26345Q0085j19165
20627b7166k5676j99417q7022J00773Q3901q0281p669q6554J19901P7499J50121
20616A8410K02391j08483k59317p6864n5295J44567J52064j02545K82223J33659
20606C30810J57508L04876J27775j74046m61749l06643l63971j64290L36704J58640
20596e4386L10070J43396j72396l46937n451N4247K0094K3694J58598p8081l68129
$$ plain form
20585 -315281 -141031 250431 391139 367349 232221 241102 -85577 -292938 -165936 -17406
20575 -17406 69433 -28767 253686 167298 -32874 -267714 -468186 -724770 -635472 -443984
20565 -443984 -399259 85895 362293 -14795 5118 -134830 -354563 -311725 -371375 -213815
20555 -213815 227814 420183 125589 149590 -50402 -235003 -123120 185949 494336 251433
20545 251433 117781 118052 -146370 -186714 -189089 53198 186183 59465 -271311 -247777 -100742
20534 -100742 -469025 -676331 -394798 -610134 -603874 -375585 -215001 -135623 -84939 3506
20524 3506 112468 223718 -97113 39292 348130 175430 91979 261607 383443 493353
20514 493353 373799 295927 215862 185268 -22162 -219373 -234016 -115100 -64500 -158029 -298926
$$ packed form
20585c15281J74250L91462J40708k3790j35128Q881l26679k07361J27002J48530
20575a7406Q6839r8200K82453q6388k00172k34840k00472k56584Q9298J91488
20565d43984M4725M85154K76398l77088J9913j39948k19733M2838n9650J57560
20555b13815M41629J92369k94594K4001j99992j84601J11883L09069L08387k42903
20545B51433j33652K71k64422m0344k375K42287J32985j26718l30776K3534J47035
20534a00742l68283k07306K81533k15336O260K28289J60584P9378N0684Q8445
20524C506J08962J11250l20831J36405L08838j72700q3451J69628J21836J09910
20514D93353j19554p7872q0065l0594k07430j97211j4643J18916N0600r3529j40897
$$ plain form
20503 -298926 169609 882495 941763 722174 315127 162757 180442 233822 -390819 -843220
20493 -843220 -672385 -340434 -59461 -86473 47850 231050 52496 -51267 76993 90568
20483 90568 147205 -36429 28188 352958 330259 245948 91120 48442 225269 539957 354143
20472 354143 344539 141755 -329716 -397678 -484809 -241652 -204579 -296535 -216099 -171425 -159121
20461 -159121 104603 133712 120299 272634 357400 91693 -158420 -159395 62645 83910 15543
20450 15543 230111 276566 170324 -164785 96361 -5168 156981 245803 -171113 3260
20440 3260 -73160 -186627 -254343 -77104 -85934 -289711 -390411 -245370 -247881 -135564 -165164
20429 -165164 -200210 -317171 -275339 -373670 -122132 -137892 288665 369790 598 -114768
$$ packed form
20503b98926M68535P12886N9268k19589m07047j52370J7685N3380o24641m52401
20493h43220J70835L31951K80973k7012J34323J83200j78554j03763J28260J3575
20483I0568N6637j83634O4617L24770k2699q4311j54828m2678J76827L14688j85814
20472C54143r604k02784m71471o7962q7131K43157L7073r1956Q0436M4674J2304
20461a59121K63724K9109j3413J52335Q4766k65707k50113r75K22040K1265o8367
20450A5543K14568M6455j06242l35109K61146j01529J62149Q8822m16916J74373
20440C260p6420j13467o7716J77239q830k03777j00700J45041k511J12317k9600
20429a65164l5046j16961M1832r8331K51538j5760M26557Q1125l69192j15366
$$ plain form
20419 -114768 -272308 -785244 -822408 -483438 -541678 -289951 -284113 -414065 -396863 -585544
20409 -585544 -720019 -469623 -625684 -693202 -440100 -333382 -276231 -97622 307322 186418
20399 186418 -108299 -333446 -130506 -114311 -362358 -495929 -653038 -518892 -329151 -304009
20389 -304009 -508833 -385656 16572 96401 -86409 -395400 -631859 -521904 -303715 -378198
20379 -378198 -223895 -385474 -416394 -274415 -142440 -230334 -497510 -522416 -425985 -328666
20369 -328666 -171262 336779 649361 290566 71795 -88283 -55716 -103784 -91876 143519
20359 143519 513033 639535 433226 147012 -191943 -588776 -244974 191878 734383 996142
20349 996142 645643 534625 686492 243541 -42591 57224 -194844 -532082 -331431 -567545
$$ packed form
20419a14768j57540n12936l7164L38970n8240K51727N838j29952J7202j88681
20409e85544j34475K50396j56061o7518K53102J06718N7151J78609M04944j20904
20399A86418k94717k25147K02940J6195k48047j33571j57109J34146J89741K5142
20389c04009k04824J23177M02228P9829j82810l08991k36459J09955K18189p4483
20379c78198J54303j61579l0920J41979J31975q7894k67176k4906R6431R7319
20369c28666J57404N08041L12582l58795k18771j60078L2567m8068J1908K35395
20359A43519L69514J26502k06309k86214l38955l96833L43802M36852N42505K61759
20349I96142l50499j11018J51867m42951k86132R9815k52068l37238K00651k36114
$$ plain form
20339 -567545 -808467 -688992 -419051 -24595 -136725 -433755 -204057 -147486 -385866 -257782
20329 -257782 24927 -9539 -63850 96054 137937 -147742 -163463 -32612 -80585 113462
20319 113462 259916 205007 277809 362218 680777 702887 490274 351851 363478 331146 475727
20308 475727 272627 331206 317930 -33503 -97499 144385 151313 -79905 170790 178369 149431
20297 149431 131588 -116960 -205220 -111087 207957 506463 121344 -371668 -550843 1772
20287 1772 -230520 -587248 -364157 85948 205651 370626 209482 289709 205150 -83957
20277 -83957 8024 -48788 -130110 -130899 166319 -53125 -333577 -62333 272159 274790 315649
20266 315649 385985 266070 -130342 -232826 -121187 -386738 -535901 -333281 -80191 157027
$$ packed form
20339e67545k40922J19475K69941L94456j12130k97030K29698N6571k38380J28084
20329b57782K82709l4466n4311J59904M1883k85679j5721J30851m7973J94047
20319A13462J46454n4909P2802Q4409L18559K2110k12613j38423J1627l2332J44581
20308D75727k03100N8579j3276l51433o3996K41884O928k31218K50695P579k8938
20297A49431j7843k48548q8260R4133L19044K98506l85119m93012j79175N52615
20287A772k32292l56728K23091M50105J19703J64975j61144Q0227q4559k89107
20277h3957R1981n6812q1322p89K97218k19444k80452K71244L34492K631M0859
20266C15649P0336j19915l96412j02484J11639k65551j49163K02620K53090K37218
$$ plain form
20256 157027 286737 402437 259073 -33154 -14340 -35660 -257457 -671129 -601823 -234001
20246 -234001 -60478 -29026 -319123 -93653 32449 42941 -158472 -82927 309263 375113
20236 375113 354321 509842 371121 20945 161103 33095 -102820 -100359 -206169 -258918
20226 -258918 -255076 -256109 -220424 -165391 233801 438691 270075 327703 403315 298727 235462
20215 235462 -79562 -249569 16357 243634 86049 79642 -49099 -359773 -839382 -835516
20205 -835516 -709045 -374092 31061 287730 585964 460336 92786 -271129 -478395 -483043
20195 -483043 -410182 -66556 -175818 -198936 -483259 -374894 -217626 115494 302197 146946
20185 146946 28823 80483 496649 839467 765554 347502 -104738 -216288 157002 307875
$$ packed form
20256A57027J29710J15700j43364k92227J8814k1320k21797m13672O9306L67822
20246b34001J73523L1452k90097K25470J26102J0492k01413P5545L92190O5850
20236C75113k0792J55521j38721l50176J40158j28008j35915K461j05810n2749
20226b58918L842j033L5685N5033L99192K04890j68616N7628P5612j04588o3265
20215B35462l15024j70007K65926K27277j57585o407j28741l10674m79609L866
20205h35516J26471L34953M05153K56669K98234j25628l67550l63915k07266m648
20195d83043P2861L43626j09262k3118k84323J08365J57268L33120J86703j55251
20185A46946j18123N1660M16166L42818p3913m18052m52240j11550L73290J50873
$$ plain form
20175 307875 488970 380872 426597 137213 -114341 -40153 367063 325517 -139792 -357691
20165 -357691 -418102 -487587 -685335 -617548 -261439 -178270 -249450 -444500 79498 521016
20155 521016 306198 16314 151522 -88724 -219925 -227786 -483501 -262054 -402347 -418512
20145 -418512 -551933 77857 588207 640624 158168 -40707 463425 776212 896019 920997
20135 920997 579446 155576 -77352 48210 -110589 66992 208815 226593 -6826 -275358
20125 -275358 -247016 -56782 -172114 -60008 296339 314364 81638 -41015 -163466 -221219
20115 -221219 -344868 -434931 -597096 -562482 -468624 -141419 -129099 -56722 -212708 60465
20105 60465 117391 -193009 -179494 -170310 -411514 -556762 -534472 -119169 -8176 -144986 -299962
$$ packed form
20175C07875J81095j08098M5725k89384k51554P4188M07216m1546m65309k17899
20165c57691o0411o9485j97748O7787L56109Q3169p1180j95050N23998M41518
20155E21016k14818k89884J35208k40246j31201p861k55715K21447j40293j6165
20145d18512j33421O29790N10350N2417m82456j98875N04132L12787J19807K4978
20135I20997l41551m23870k32928J25562j58799J77581J41823J7778k33419k68532
20125b75358K8342J90234j15332J12106L56347J8025k32726j22653j22451n7753
20115b21219j23649r0063j62165L4614R3858L27205J2320P2377j55986K73173
20105F0465N6926l10400J3515R184k41204j45248K2290M15303J10993j36810j54976
$$ plain form
20094 -299962 -321669 -34055 189471 137968 -64937 58665 439868 351513 278592 227596
20084 227596 365441 316585 230355 -26592 163095 303291 188650 64094 -1225 226557
20074 226557 258473 -29834 189245 431408 8703 -86709 87011 95419 282114 648361
20064 648361 572484 275722 71067 219453 47102 -92290 106321 467518 396513 27017
20054 27017 -145564 270306 663908 244600 -197889 -14130 -231472 -78308 164337 290559
20044 290559 354926 -55254 -470191 -339576 -296422 172579 307934 307729 23364 -9489 -125905
20033 -125905 -295062 -210965 -262125 -365240 -477170 -694834 -632978 -329597 69416 1526
20023 1526 78795 -286773 -552292 -705009 -633792 -114331 334676 535558 367117 68805
$$ packed form
20094b99962k1707K87614K23526n1503k02905J23602L81203q8355p2921n0996
20084B27596J37845m8856q6230k56947J89687J40196j14641j24556o5319K27782
20074B26557L1916k88307K19079K42163m22705r5412J73720Q408J86695L66247
20064F48361p5877k96762k04655J48386j72351j39392J98611L61197p1005l69496
20054B7017j72581M15870L93602m19308m42489J83759k17342J53164K42645J26222
20044B90559O4367m10180m14937J30615M3154M69001J35355k05k84365l2853j16416
20033a25905j69157Q4097n1160j03115j11930k17664O1856L03381L99013o7890
20023A526P7269l65568k65519j52717P1217N19461M49007K00882j68441k98312
$$ plain form
20013 68805 269694 286591 225375 -348911 -268867 -210084 -169022 50645 -70611 -13575 267218
20002 267218 270766 -227764 -568633 -549179 -564935 -447008 -50735 -82344 -51923 -350122 -149083
19991 -149083 271272 212095 -255874 -366869 -248849 -439642 -768720 -609217 -307566 -78171
19981 -78171 27554 113433 -23277 -124732 -2377 -236870 -556878 -614382 -536795 -528422 -610929
19970 -610929 -606476 -713064 -285446 -54981 -333184 -519103 -150332 -19074 -182940 -247669
19960 -247669 102242 -54840 30081 320704 183904 -68361 -363694 -37810 86629 -138145
19950 -138145 -58801 -3990 -80990 169375 42920 -70079 -120690 -146079 -51799 -170981 -102927
19939 -102927 -209679 -119679 -274304 -473326 -135472 -51618 -79319 -51670 -64350 -137434 -58733
$$ packed form
20013F8805K00889J6897o1216n74286Q0044N8783M1062K19667j21256N7036K80793
20002B67218L548m98530l40869J9454j5756J17927L96273l1609L0421k98199K01039
19991a49083M20355n9177m67969j10995J18020j90793l29078J59503L01651K29395
19981g8171J05725Q5879j36710j01455J22355k34493l20008n7504P7587Q373q2507
19970f10929M453j06588M27618K30465k78203j85919L68771J31258j63866o4729
19960b47669L49911j57082Q4921K90623j36800k52265k95333L25884J24439k24774
19950a38145P9344N4811p7000K50365j26455j12999n0611k5389R4280j19182O8054
19939a02927j06752R0000j54625j99022L37854Q3854k7701K7649j2680p3084P8701
$$ plain form
19928 -58733 102916 173058 296491 412213 400843 167624 -196886 -417739 -466512 -489040
19918 -489040 -570558 -226539 327098 555394 915612 583982 544556 545692 212280 194013
19908 194013 -9722 -54778 -440110 -281925 -88348 -67008 223554 306037 279911 331487
19898 331487 270225 244296 174630 17099 -42506 365867 663831 616025 395321 147135
19888 147135 -48177 -88018 15910 160882 203888 401767 84110 -77403 -182620 -338683
19878 -338683 -205416 -203566 -192251 -168841 -49870 129986 -34515 -10668 -102833 -297966 -168209
19867 -168209 253456 724793 795579 331227 -6379 -308457 -135535 192100 139060 189559
19857 189559 374528 146518 44947 117745 92742 -445264 -484425 -29428 -118944 -121773 174151
$$ packed form
19928e8733J61649P0142J23433J15722j1370k33219l64510k20853m8773k2528
19918d89040q1518L44019N53637K28296L60218l31630l9426J136l33412j8267
19908A94013k03735m5056l85332J58185J93577K1340K90562Q2483k6126N1576
19898C31487o1262k5929o9666j57531n9605M08373K97964m7806k20704k48186
19888A47135j95312l9841J03928J44972M3006J97879l17657j61513j05217j56063
19878c38683J33267J850J1315K3410J18971J79856j64501K3847r2165j95133J29757
19867a68209M21665M71337P0786m64352l37606l02078J72922L27635n3040N0499
19857A89559J84969k28010j01571P2798k5003n38006l9161M54997q9516k829K95924
$$ plain form
19846 174151 -100205 -246394 -202501 -242965 -7052 31437 -58497 189872 447421 476185
19836 476185 160212 -41089 -243240 -496369 -510219 -562848 -198546 -262140 -483502 -372853
19826 -372853 -126898 -202016 -178931 -449 13905 199845 374577 406495 -68812 -65835 102699
19815 102699 469702 73251 -102808 -74224 -80246 16018 79672 348331 353498 -23735 -36053
19804 -36053 263288 317976 447976 610666 532912 203668 186813 94344 -19571 -6160 157964
19793 157964 -63262 -33321 -148989 -498131 -677976 -575206 -246483 -173480 -404221 -213510
19783 -213510 273539 250508 46296 -127750 -20741 53413 155 -288131 -116695 55287
19773 55287 -147903 -81285 503650 774888 824879 617246 351295 644869 529507 390437
$$ packed form
19846A74151k74356j46189M3893m0464K35913L8489q9934K48369K57549K8764
19836D76185l15973k01301k02151k53129j3850n2629L64302o3594k21362J10649
19826c72853K45955p5118K3085J78482J4354J85940J74732L1918m75307K977J68534
19815A02699L67003l96451j76059K8584o022R6264O3654K68659N167l77233j2318
19804c6053K99341N4688J30000J62690p7754l29244j6855r2469j13915J3411J64124
19793A57964k21226K9941j15668l49142j79845J02770L28723P3003k30741J90711
19783b13510M87049k3031k04212j74046J07009P4154n3258k88286J71436J71982
19773E5287k03190O6618N84935K71238M9991k07633k65951K93574j15362j39070
$$ plain form
19763 390437 308277 175127 123560 223961 299532 110241 -83153 -227846 126618 307395
19753 307395 547863 226072 325754 197444 -3320 173945 74947 -52445 -55178 122391
19743 122391 266603 284280 123086 -246598 -154331 197034 162863 -200930 -168542 37054
19733 37054 -219782 -270849 47086 -117594 -513868 -437694 -348141 -161483 -277008 -844480
19723 -844480 -551157 -203191 -807 -39999 -116564 -216932 -118870 -31629 209413 6278
19713 6278 17445 264420 462591 398294 273887 4599 -250342 -581110 -585926 -336498 -310078
19702 -310078 -302630 -70329 80700 -56713 -142134 -75576 19994 -222436 -470140 -286201
19692 -286201 -484909 -617900 -618920 -159657 64172 -414365 -457235 -134109 -71665 9630
$$ packed form
19763C90437q2160j33150n1567J00401P5571j89291j93394j44693L54464J80777
19753C07395K40468l21791R9682j28310k00764J77265r8998j27392k733J77569
19743A22391J44212J7677j61194l69684R2267L51365l4171l63793L2388K05596
19733C7054k56836n1067L17935j64680l96274P6174Q9553J86658j15525n67472
19723h44480K93323L47966K02384l9192p6565j00368R8062Q7241K41042k03135
19713F278J1167K46975J98171o4297j24407k69288k54941l30768m816K49428K6420
19702c10078P448K32301J51029j37413q5421O6558R5570k42430k47704J83939
19692b86201j98708j32991j020M59263K23829m78537m2870L23126O2444Q1295
$$ plain form
19682 9630 -147766 -92467 16458 -70468 43082 -194249 -105058 375150 309650 82853 103894
19671 103894 74423 256120 170349 -45407 -379439 18091 18571 128737 442251 294874
19661 294874 10358 -95114 -107569 -94386 -262535 -579968 -479973 -238686 -448228 -437846
19651 -437846 -337273 -451434 -38466 -71045 27186 270914 124545 -17333 -6960 -13457
19641 -13457 -125634 -303934 26750 374054 358207 54529 -406842 -282866 -325709 -490302
19631 -490302 -263550 128442 363148 226454 400574 186326 -51627 45741 104221 -439767
19621 -439767 -535971 -551619 -503103 -359562 -134812 31032 86635 -91829 -476184 -294958
19611 -294958 -282914 -136884 19067 47593 102249 208165 133937 156243 167329 282224 302304
$$ packed form
19682I630j57396N5299J08925q6926J13550k37331Q9191M80208o5500k26797K1041
19671A03894k9471J81697q5771k15756l34032L97530M80J10166L13514j47377
19661B94874k84516j05472j2455J3183j68149l17433R9995K41287k09542J0382
19651d37846J00573j14161M12968l2579R8231K43728j46369j41878J0373o497
19641a3457j12177j78300L30684L47304j5847l03678m61371J23976m2843j64593
19631d90302K26752L91992K34706j36694J74120k14248k37953R7368N8480n43988
19621d39767r6204j5648M8516J43541K24750J65844N5603j78464l84355J81226
19611b94958J2044J46030J55951K8526N4656J05916p4228K2306J1086J14895K0080
$$ plain form
19600 302304 254432 322731 126406 -82858 -284287 -333756 -67604 -332104 -526860 -213793
19590 -213793 74408 158291 84938 111421 50314 15775 185664 218385 133398 -115178 -84017
19579 -84017 -32712 17195 -45440 -180822 -313330 -212625 -206986 -252866 -141100 -195422 -398783
19568 -398783 -544267 77130 371424 197956 -189891 -77457 155970 -127013 92206 34550
19558 34550 -89914 -117191 -160424 -78692 -40214 -226296 -271179 -281481 -242573 -294427 -247364
19547 -247364 -328119 -426512 -432282 -326140 1582 321191 486477 284392 305234 324797 61888
19536 61888 -133967 42784 144963 -119249 -743670 -561465 -218396 -259427 72189 3715
19526 3715 -251944 -354384 -252042 -197758 -159494 -106569 -277134 -461301 -195213 148357
$$ packed form
19600C02304m7872O8299j96325k09264k01429m9469K66152k64500j94756L13067
19590b13793K88201Q3883p3353K6483o1107l4539J69889L2721q4987k48576L1161
19579h4017N1305M9907o2635j35382j32508J00705N639m5880J11766n4322k03361
19568c98783j45484O21397K94294j73468l87847J12434K33427k82983K19219n7656
19558C4550j24464k7277m3233Q1732L8478j86082m4883j0302L8908n1854M7063
19547b47364q0755r8393n770J06142L27722L19609J65286k02085K0842J9563k62909
19536F1888j95855J76751J02179k64212o24421J82205L43069m1031L31616o8474
19526C715k55659j02440J02342N4284L8264N2925j70565j84167K66088L43570
$$ plain form
19516 148357 211820 626436 745440 254238 64769 -133248 -136088 134958 287831 336733
19506 336733 513477 52115 -373420 -199997 -284695 67441 379989 340682 184664 116395
19496 116395 22355 -489601 -435804 -92654 101350 196309 351806 158075 65359 71789 33573
19485 33573 -110124 -268942 -236498 -326787 -314225 -118602 -238674 -298542 -404044 -407564 83823
19474 83823 190077 99295 -206704 -449366 -341983 -239041 -450030 -252197 -53107 211916
19464 211916 154008 -60630 -64556 -85660 -251993 -21367 71333 -288206 -210874 394922 549718
19453 549718 389756 219775 -48250 -164548 198963 457996 446103 172745 -179646 -75198
19443 -75198 307451 159313 281263 376145 483799 492892 513695 703357 498711 346528
$$ packed form
19516A48357O3463M14616J19004m91202j89469j98017k840K71046J52873M8902
19506C36733J76744m61362m25535J73423q4698L52136L12548l9307j56018o8269
19496A16395r4040n11956N3797L43150J94004R4959J55497j93731r2716O430l8216
19485C3573j43697j58818L2444r0289J2562J95623j20072n9868j05502l520M91387
19474H3823J06254r0782l05999k42662J07383J02942k10989J97833J99090K65023
19464B11916n7908k14638l926k1104j66333K30626R2700l59539P7332O05796J54796
19453E49718j59962j69981k68025j16298L63511K59033j1893k73358l52391J04448
19443g5198L82649j48138J21950R4882J07654R093K0803J89662k04646j52183
$$ plain form
19433 346528 422384 120130 223314 331519 308888 313770 319310 388575 300038 552060 703337
19422 703337 475886 37415 -90592 207797 683951 729182 923330 713167 167967 78685
19412 78685 181874 488321 546689 270448 74506 -41648 -38496 -40302 98023 175083 61850
19401 61850 50909 123908 470998 698434 924791 654300 429841 -3629 -189406 158435
19391 158435 272626 332802 465024 276791 -192580 -87640 516 -326827 -564525 -663302
19381 -663302 -565216 -112924 -216527 -378575 -373107 -558095 -448862 -328095 -278757 -80724
19371 -80724 -28522 72636 -17039 244184 259883 8056 -175808 -88618 -76902 -89709 -183006
19360 -183006 -118948 232341 67487 11873 225901 118955 -221984 -56781 -365062 -587663
$$ packed form
19433C46528P5856l02254J03184J08205k2631M882N540O9265q8537K52022J51277
19422G03337k27451m38471j28007K98389M76154M5231J94148k10163n45200q9282
19412G8685J03189L06447N8368k76241j95942j16154L152j806J38325P7060j13233
19401F1850j0941P2999L47090K27436K26357k70491k24459m33470j85777L47841
19391A58435J14191O0176J32222j88233m69371J04940Q8156l27343k37698r8777
19381f63302R8086M52292j03603j62048N468j84988J09233J20767M9338J98033
19371h0724N2202J01158q9675K61223J5699k51827j83864Q7190J1716j2807r3297
19360a83006O4058L51289j64854n5614K14028j06946l40939J65203l08281k22601
$$ plain form
19350 -587663 -215813 -334692 -361891 -209090 -434150 -527517 -337527 -235924 -13863 -19049
19340 -19049 135399 -82846 -574171 -275036 83886 -45220 -94829 57370 -165208 -236568
19330 -236568 240226 430474 -23889 -356114 -144375 -40588 -271440 -181837 -83942 73379
19320 73379 -53481 -141100 9136 -62475 65956 227207 464307 837672 884013 687407
19310 687407 243328 -23339 49260 111150 62595 416907 518098 565972 651269 482047
19300 482047 379153 160700 168718 93694 247292 652808 451207 269371 -50033 -153327
19290 -153327 -180972 -281637 -62397 -117263 -67070 91685 304684 219298 161856 233104 118530
19279 118530 -196575 -40559 -144062 -32885 318541 234074 346584 403040 307208 8134
$$ packed form
19350e87663L71850j18879k7199J52801k25060r3367J89990J01603K22061n186
19340a9049J54448k18245m91325K99135L58922j29106m9609J52199k22578p1360
19330b36568M76794J90248m54363l32225K11739J03787k30852Q9603R7895J57321
19320G3379j26860q7619J50236p1611J28431J61251K37100L73365M6341j96606
19310F87407m44079k66667P2599O1890m8555L54312J01191M7874Q5297j69222
19300D82047j02894k18453Q018p5024J53598M05516k01601j81836l19404j03294
19290a53327k7645j00665K19240n4866N0193J58755K12999q5386n7442P1248j14574
19279A18530l15105J56016j03503J11177L51426q4467J12510N6456r5832k99074
$$ plain form
19269 8134 -161987 29028 117619 -90403 -1757 368006 342586 86409 338576 463656
19259 463656 560496 397409 174962 75689 173464 628290 588900 260597 380741 543723
19249 543723 258577 -229594 113365 -31828 114122 286848 235133 23044 88600 -49714
19239 -49714 187345 333103 52108 -372770 -608229 -104282 132095 -206308 -244476 -150143
19229 -150143 -101125 333601 481908 374977 208808 50492 -824 -225886 183105 167100
19219 167100 164336 184730 7618 -219127 -194129 -116512 178412 212064 82697 257463 151323
19208 151323 41448 -40745 -93781 186238 95435 -119756 -126068 -228170 -218109 -472948 -614247
19197 -614247 -436059 -238773 -94104 -260069 -379305 -181350 85188 231474 132976 48090
$$ packed form
19269H134j70121J91015Q8591k08022Q8646L69763k5420k56177K52167J25080
19259D63656R6840j63087k22447r9273R7775M54826l9390l28303J20144J62982
19249E43723k85146m88171L42959j45193J45950J72726n1715k12089O5556j38314
19239d9714K37059J45758k80995m24878k35459N03947K36377l38403l8168R4333
19229a50143M9018M34726J48307j06931j66169j58316n1316k25062M08991j6005
19219A67100k764K0394j77112k26745K4998P7617K94924L3652j29367J74766j06140
19208A51323j09875q2193n3036K80019r0803k15191o312j02102J0061k54839j41299
19197f14247J78188J97286J44669j65965j19236J97955K66538J46286r8498q4886
$$ plain form
19187 48090 376595 -147550 -316421 87399 596912 638075 330274 -48701 -99205 154453
19177 154453 612110 436441 64863 -54383 -124820 27251 200032 -70584 29180 36761
19167 36761 231909 309736 66032 -61204 -293214 -248263 -83354 -149638 225083 476003
19157 476003 497397 461280 196111 170514 -130795 -82860 -65343 267270 483498 256532
19147 256532 -83481 -40498 81505 -199287 -381020 -289362 109303 158602 67144 97207
19137 97207 -299362 -545383 -479464 -349528 -514679 -288325 -276179 -218422 -294353 -262987 -76743
19126 -76743 -24099 -46592 49421 189375 204061 -21186 7984 -37341 -137626 13511 -130427
19115 -130427 -235566 -145309 41919 -175143 -94280 -191675 -521486 -397342 -454666 -671319
$$ packed form
19187D8090L28505n24145j68871M03820N09513M1163l07801l78975n0504K53658
19177A54453M57657j75669l71578j19246p0437J52071J72781k70616R9764P581
19167C6761J95148P7827k43704j27236k32010M4951J64909o6284L74721K50920
19157D76003K1394l6117k65169k5597l01309M7935J7517L32613K16228k26966
19147B56532l40013M2983J22003k80792j81733R1658L98665M9299r1458L0063
19137I7207l96569k46021O5919J29936j65151K26354J2146N7757p5931L1366J86244
19126g6743N2644k2493R6013J39954J4686k25247K9170m5325j00285J51137j43938
19115a30427j05139R0257J87228k17062Q0863r7395l29811J24144n7324k16653
$$ plain form
19105 -671319 -484191 -399336 -703001 -492109 -499862 -110334 362046 404159 173933 -224013
19095 -224013 -517076 -192190 79416 327809 632641 772010 675986 690655 625304 677282
19085 677282 333714 150874 294249 135037 -276037 -268983 -247108 -239424 281837 -10668
19075 -10668 -389344 -207606 62908 -234166 -270859 -121912 -57411 205501 479738 522852
19065 522852 589266 247803 76406 177342 23955 86483 -19166 -128812 -23532 -275651
19055 -275651 -417140 -268238 -180512 -201265 -147792 -192290 -43800 -54014 -163029 -230189 -31805
19044 -31805 14682 144945 113286 -247475 49027 437952 577331 417863 -82906 18665
19034 18665 263204 295690 163316 -106469 262444 318317 437810 284185 463227 230866
$$ packed form
19105f71319J87128Q4855l03665K10892p753L89528M72380M2113k30226l97946
19095b24013k93063L24886K71606K48393L04832J39369r6024J4669o5351N1978
19085F77282l43568j82840J43375j59212m11074P054K1875P684N21261k92505
19075a0668l78676J81738K70514k97074l6693J48947O4501K62912K74237M3114
19065E22852O6414l41463j71397J00936j53387O2528j05649j09646J05280k52119
19055b75651j41489J48902Q7726k0753N3473m4498J48490j0214j09015o7160J98384
19044c1805M6487J30263l1659l60761K96502L88925J39379j59468n00769J01571
19034A8665K44539L2486j32374k69785L68913N5873J19493j53625J79042k32361
$$ plain form
19024 230866 -19399 -209811 -57013 77871 117064 242007 337637 190293 256899 169940
19014 169940 126754 -16397 94352 238911 358653 326765 73213 224860 190323 66237
19004 66237 181779 297504 70914 333314 396058 359079 33608 -61467 -30142 316372
18994 316372 395031 271304 250794 27371 -225209 -137739 -191771 -197374 101465 547685 401467
18983 401467 259464 379145 397178 466006 513570 518810 125062 -25360 203079 218058 23704
18972 23704 -119670 194202 639621 616628 313071 196622 94116 36721 -3694 107257
18962 107257 529842 516666 609647 348180 188921 169910 334102 627514 209334 -67589
18952 -67589 49999 -315157 -255641 10695 131138 250391 441732 644787 734056 513774
$$ packed form
19024B30866k50265j90412J52798J34884L9193J24943R5630j47344O6606q6959
19014A69940m3186j43151J10749J44559J19742l1888k53552J51647l4537j24086
19004F6237J15542J15725k26590K62400O2744l6979l25471r5075L1325L46514
18994C16372P8659j23727k0510k23423k52580Q7470n4032n603K98839M46220j46218
18983D01467j42003J19681J8033O8828M7564N240l93748j50422K28439J4979j94354
18972B3704j43374L13872M45419k2993l03557j16449j02506n7395m0415J10951
18962A07257M22585j3176R2981k61467j59259j9011J64192K93412m18180k76923
18952f7589J17588l65156N9516K66336J20443J19253J91341K03055Q9269k20282
$$ plain form
18942 513774 221297 294480 162601 -57027 -19819 105347 195174 24339 -17121 164022
18932 164022 333036 310459 328695 157897 -436445 -594028 -148195 131826 163431 447868
18922 447868 122351 -211736 -171161 274740 528111 937130 947523 889932 712796 459679
18912 459679 51744 -72821 108610 438027 502690 766304 718998 729677 859756 653328
18902 653328 376694 444274 442303 444671 320802 296399 285643 270143 521653 376043 587410
18891 587410 591092 252492 434702 410397 358473 291184 381722 463082 830370 743028 347924
18880 347924 -72172 -268 28547 127445 72702 -24230 40893 367356 559552 422842 462826
18869 462826 232285 153055 168625 -150694 -119834 224794 377661 400583 404790 555315 503840
$$ packed form
18942E13774k92477P3183j31879k19628L7208J25166Q9827j70835m1460J81143
18932A64022J69014k2577J8236j70798n94342j57583M45833K80021L1605K84437
18922D47868l25517l34087M0575M45901K53371M09019J0393n7591j77136k53117
18912D59679m07935j24565J81431L29417O4663K63614m7306J0679J30079k06428
18902F53328k76634O7580j971K368j23869k4403j0756j5500K51510j45610K11367
18891E87410L682l38600J82210k4305n1924o7289R0538Q1360L67288q7342l95104
18880C47924m20096P1904K8815R8898n4743r6932O5123L26463J92196j36710L9984
18869D62826k30541p9230J5570l19319L0860L44628J52867K2922M207J50525n1475
$$ plain form
18858 503840 496433 403038 432083 404057 377250 380019 357199 196610 320989 115263 357039
18847 357039 427618 850402 861525 504791 202156 275331 477574 771321 792987 334991
18837 334991 398558 337028 -2587 -418100 -568716 -582567 -515011 -80845 8954 -171399
18827 -171399 116858 160692 101925 216901 128653 347621 751148 1014943 1006501 830246
18817 830246 519646 273569 276747 67515 -117236 28288 259719 216624 135482 209688
18807 209688 151415 285171 708214 551357 279865 290957 246308 755646 812636 601881
18797 601881 550661 567099 406789 400935 518159 377305 278893 306576 14237 -278548 -160758
18786 -160758 -38452 -110562 -361454 -7974 539032 622327 321811 152484 -86750 -217465
$$ packed form
18858E03840p407r3395K9045k8026k6807K769k2820j60589J24379k05726K41776
18847C57039P0579M22784J1123l56734l02635P3175K02243K93747K1666m57996
18837C34991O3567o1530l39615m15513j50616j3851O7556M34166Q9799j80353
18827a71399K88257M3834n8767J14976q8248K18968M03527K63795q442j76255
18817H30246l10600k46077L178k09232j84751J45524K31431m3095q1142P4206
18807B09688n8273J33756M23043j56857k71492J1092m4649N09338N6990k10755
18797F01881n1220J6438j60310n854J17224j40854r8412K7683k92339k92785J17790
18786a60758J22306p2110k50892L53480N47006Q3295l00516j69327k39234j30715
$$ plain form
18776 -217465 -400519 -286491 -195988 -45213 -99037 34132 504049 631564 528631 648826
18766 648826 1119782 2052732 3072612 3240777 2508745 1631047 1199342 1243396 1346282 1283313
18756 1283313 994525 645146 658805 724159 594768 384670 335839 531516 936604 1068878
18746 1068878 1356438 1417456 1380551 1044329 336930 302812 289763 -116164 -28023 154051
18736 154051 -14671 212468 209707 273512 330780 412986 618430 666223 661998 658334 588258
18725 588258 546244 551154 533843 806649 556149 397531 383511 323309 564370 617655 571894
18714 571894 582099 721477 541533 92588 12183 491452 809858 727761 707532 757316
18704 757316 864282 862158 802467 766154 927934 886448 1008189 1017433 884847 815580 810306
$$ packed form
18776b17465j83054J14028R0503J50775n3824J33169M69917J27515j02933J20195
18766F48826M70956R32950J019880J68165p32032q77698m31705M4054J02886o2969
18756A283313k88788l49379J3659O5354j29391k10098m8831J95677M05088J32274
18746A068878K87560O1018l6905l36222p07399l4118j3049m05927Q8141J82074
18736A54051j68722K27139k761O3805N7268Q2206K05444M7793m225l664p0076
18725E88258m2014M910j7311K72806k50500j58618j4020o0202K41061N3285m5761
18714E71894J0205J39378j79944m48945q0405M79269L18406q2097k0229M9784
18704G57316J06966k124n9691l6313J61780m1486J21741R244j32586o9267n274
$$ plain form
18693 810306 679371 648314 735990 377746 534938 786292 824123 547081 189997 199151
18683 199151 423174 420199 491530 483655 418252 278733 570173 774665 862522 866034 907347
18672 907347 750023 490152 732993 649240 254333 71813 -79830 -83700 231377 483358
18662 483358 315929 149106 242324 416351 421603 378903 190813 617574 853538 938105
18652 938105 920583 462125 255780 411203 405971 178887 -71095 137607 363270 674103
18642 674103 986666 1346506 1347993 989262 988099 988594 1125970 987100 317807 -111363 386873
18631 386873 369593 397103 395259 199974 479125 461263 288215 479103 305180 147277
18621 147277 490361 697771 731710 895621 918837 1054188 908024 466651 293704 359677
$$ packed form
18693H10306j30935l1057Q7676l58244J57192K51354L7831k77042l57084R154
18683A99151K24023k975P1331p875o5403j39519K91440K04492Q7857L512M1313
18672I07347j57324k59871K42841q3753l94907j82520j51643l870L15077K51981
18662D83358j67429j66823R3218J74027N252m2700j88090M26761K35964Q4567
18652I38105j7522m58458k06345J55423n232k27084k49982K08702K25663L10833
18642F74103L12563L59840J487l58731j163M95J37376j38870o69293m29170M98236
18631C86873j7280K7510j844j95285K79151j7862j73048J90888j73923j57903
18621A47277L43084K07410L3939J63911K3216J35351j46164m41373j72947O5973
$$ plain form
18611 359677 504839 69020 -176795 75501 467810 563988 437980 377737 582696 831219
18601 831219 612216 544664 482146 271558 712877 654693 578124 654635 850668 905313 991023
18590 991023 513177 528746 691552 662657 814150 746841 560442 667430 792135 760402
18580 760402 1001635 693570 436241 530202 417750 390663 435322 587148 737352 524905
18570 524905 575765 446065 498834 486811 737651 594734 480469 490629 360800 739467
18560 739467 943106 934011 751604 844333 761054 500716 81920 -42235 246188 155411
18550 155411 -4152 -63836 -16965 362336 989052 1144490 1010717 988749 929090 914443
18540 914443 1191956 1083271 1031968 1015332 1186102 1195240 894614 797767 792941 793224 942117
$$ packed form
18611C59677J45162m35819k45815K52296L92309R6178j26008o0243K04959K48523
18601H31219k19003o7552o2518k10588M41319n8184p6569P6511J96033N4645Q5710
18590I91023m77846J5569J62806k8895J51493o7309j86399J06988J24705l1733
18580G60402K41233l08065k57329R3961j12452k7087M4659J51826J50204k12447
18570E24905N0860j29700N2769j2023K50840j42917j14265J0160j29829L78667
18560G39467K03639r095j82407R2729q3279k60338m18796j24155K88423r0777
18550A55411j59563n9684M6871L79301O26716J55438j33773k1968n9659j4647
18540I14443K77513j08685n1303j6636J70770R138l00626r6847m826K83J48893
$$ plain form
18529 942117 932576 698497 796703 794444 937327 878664 644540 654150 691076 898232 894106
18518 894106 1045142 1379364 1657341 1419969 1095029 937643 1430425 1407713 1074879 894087
18508 894087 998346 1237531 1303235 1258628 1181481 971996 815873 1103351 1306869 1287344
18498 1287344 1208169 1421796 1293472 1450408 1488538 1885166 2010980 2042927 2067900 2020962
18488 2020962 1952694 2214554 2874074 3139169 3810124 4553103 4966566 4998774 4407934 4203806
18478 4203806 4430064 4914358 5270912 5844241 6903134 8469277 10735270 13843479 18755043
18469 18755043 24202648 28418494 29477654 28136129 27573009 28125766 29912519 33386915
18461 33386915 37642048 41864865 44478702 42707753 37622952 33238731 30325299 27493247
$$ packed form
18529I42117r541k34079R8206k259J42883n8663k34124R610L6926K07156m126
18518H94106J51036L34222K77977k37372l24940j57386M92782k2712l32834j80792
18508H94087J04259K39185O5704m4607p7147k09485j56123K87478K03518j9525
18498A287344p9175K13627j28324J56936L8130L96628J25814L1947K4973m6938
18488B020962o8268K61860O59520K65095O70955P42979M13463L2208n90840k04128
18478D203806K26258M84294L56554N73329J058893J566143K265993L108209M911564
18469A8755043N447605M215846J059160j341525n63120N52757J786753L474396
18461C3386915M255133M222817K613837j770949n084801m384221k913432k832052
$$ plain form
18453 27493247 24748887 23467204 23730234 25197296 26993295 26730236 23560729 19786989
18445 19786989 17052177 15273437 13855443 12500376 11716193 11332641 10884456 10303842 10080564
18436 10080564 10282698 10978364 11886541 13378479 15174187 16863594 17274935 16585650 15490517
18427 15490517 14799701 14801275 15622690 16800649 19297720 23530742 28878028 35358046 43184039
18418 43184039 53502871 64436817 68955246 64293107 55109286 46493392 41060750 38987121
18410 38987121 40011791 43954163 51266587 60086500 66498595 68575582 68398764 67098456
18402 67098456 63797001 58695617 51493931 43768513 38042869 34178774 31191097 29043202
18394 29043202 28639598 29950743 32560206 37129785 42604388 47356624 50395390 49334166
$$ packed form
18453B7493247k744360j281683K63030J467062J795999k63059l169507l773740
18445A9786989k734812j778740j417994j355067p84183l83552m48185n80614k23278
18436A0080564K02134O95666R08177J491938J795708J689407M11341o89285j095133
18427A5490517o90816J574Q21415J177959K497071M233022N347286O480018P825993
18418D3184039J0318832J0933946M518429m662139r183821q615894n432642k073629
18410C8987121J024670L942372P312424Q819913O412095K076987j76818j300308
18402F7098456l301455n101384p201686p725418n725644l864095k987677k147895
18394B9043202m03604J311145K609463M569579N474603M752236L038766j061224
$$ plain form
18386 49334166 42935509 35889344 30294312 26270326 23452028 22085219 22472247 23796499
18378 23796499 24418131 24087337 23069515 22537960 23422209 25945151 28644566 30707625 31207631
18369 31207631 31287429 31239120 30655218 29429721 29409846 31229037 33674080 36023980 38442696
18360 38442696 41203620 42573688 41534865 39146602 36711166 35471539 34322488 32459249
18352 32459249 30029120 28080320 27406556 28482126 30966742 34663280 39485553 45236281
18344 45236281 51930451 59282678 67985396 77150931 83570759 85411133 80734997 68987925
18336 68987925 55764545 45359646 37338459 31590875 27835347 25123265 23673079 23532891
18328 23532891 24152482 24978375 25257378 25035560 24080238 21984332 19773057 17840131 15902802
$$ packed form
18386D9334166o398657p046165n595032m023986k818298j366809L87028J324252
18378B3796499O21632l30794j017822n31555Q84249K522942K699415K063059N00006
18369C1207631P9798m8309n83902j225497j9875J819191K445043K349900K418716
18360C8442696K760924J370068j038823k388263k435436j239627j149051j863239
18352C2459249k430129j948800o73764J075570K484616L696538M822273N750728
18344D5236281O694170P352227Q702718R165535O419828J840374m676136j1747072
18336F8987925j3223380j0404899q021187n747584l755528k712082j450186j40188
18328B3532891O19591Q25893K79003k21818r55322k095906k211275j932926j937329
$$ plain form
18319 15902802 14017060 12674576 11858920 11112976 10777707 10586227 10432077 10330027 10816343
18310 10816343 11902792 13261605 15764194 19838880 24195796 26398751 25236350 22495489
18302 22495489 19607014 18116353 18144323 19232267 21824173 26015887 29788932 31295981
18294 31295981 29711838 26300917 23082992 20925515 19614374 18587546 18133531 18176536
18286 18176536 18633974 18388196 17057728 14578395 12728708 11224378 9966557 8985093
18278 8985093 8722664 8472206 7998186 7791791 7730658 7444181 7445294 7999972 8371511 8767464
18268 8767464 9213870 9975093 11157239 12978692 14419453 15055245 14504877 13757858 13248438
18259 13248438 13503547 14793607 17258866 20786126 24890380 28530425 30840704 31642354
$$ packed form
18319A5902802j885742j342484q15656p45944l35269j91480j54150j02050M86316
18310A0816343J086449J358813K502589M074686M356916K202955j162401k740861
18302B2495489k888475j490661K7970J087944K591906M191714L773045J507049
18294C1295981j584143l410921l217925k157477j311141j026828m54015M3005
18286A8176536M57438k45778j330468k479333j849687j504330j257821r81464
18278H985093k62429k50458m74020k06395o1133k86477J113N54678L71539L95953
18268H767464M46406P61223J182146J821453J440761O35792n50368p47019n09420
18259A3248438K55109J290060K465259L527260M104254L640045K310279Q01650
$$ plain form
18251 31642354 31992674 32662525 33522271 34292100 35320861 38409317 44107317 51618493 58350294
18242 58350294 63640176 71313973 84717446 103419894 120588721 128280059 126748926 121577862
18234 121577862 114244456 104743380 94558042 86561244 81994093 80970928 81559417 84021494
18226 84021494 88409124 92908183 97049776 98269689 93861832 85868872 77813598 69597279
18218 69597279 60729969 52165509 45288206 39770552 36123621 33790973 32022734 31523397
18210 31523397 31709244 32702709 34557238 37759921 42934308 49729395 56315709 62414370
18202 62414370 66981376 67683862 64365800 60134236 57300936 56022965 56206756 58257443
18194 58257443 62822451 70167443 78698087 85750908 89427845 88654465 83483347 73446605
$$ packed form
18251C1642354L50320O69851Q59746P69829J028761L088456N698000P511176O731801
18242E8350294N289882P673797J3403473J8702448J7168827P691338j531133n171064
18234A21577862p333406r501076j0185338p996798m567151j023165N88489K462077
18226H4021494M387630M499059M141593J219913m407857p992960q055274q216319
18218F9597279q867310q564460o877303n517654l646931k332648j768239m99337
18210C1523397J85847R93465J854529L202683N174387O795087O586314O098661
18202F2414370M567006P02486l318062m231564k833300j277971J83791K050687
18194E8257443M565008P344992Q530644P052821L676937p73380n171118j0036742
$$ plain form
18186 73446605 61029132 50127238 42769195 38248379 35139873 32602832 30657879 29317171
18178 29317171 27876476 25983390 23759915 21843133 19942897 18998050 18429596 17986320
18170 17986320 17428411 16581747 15554595 14649263 13781620 13176434 13337835 14244844 15846460
18161 15846460 16652307 16726890 16500523 16581286 16206120 14986424 13344949 12306780 11760580
18152 11760580 11923172 12949455 14754307 17663658 21169312 22877148 21914575 19377338
18144 19377338 16581066 14365037 13138452 12682445 13086783 13841415 15341040 16511027
18136 16511027 16468933 15657262 15298630 14672931 13889686 12841977 11468828 10750238 10099905
18127 10099905 9823353 9853853 10094838 10377178 10765389 11642253 12862677 14182108 15919394
$$ packed form
18186G3446605j2417473j0901894p358043m520816l108506k537041j944953j340708
18178B9317171j440695j893086k223475j916782j900236r44847n68454m43276
18170A7986320n57909q46664j027152r05332q67643o05186J61401R07009J601616
18161A5846460Q05847P4583k26367Q0763l75166j219696j641475j038169n46200
18152A1760580J62592J026283J804852K909351L505654J707836r62573k537237
18144A9377338k796272k216029j226585m56007M04338P54632J499625J169987
18136A6511027m2094q11671l58632o25699p83245j047709j373149p18590o50333
18127A0099905k76552L0500K40985K82340L88211Q76864J220424J319431J737286
$$ plain form
18118 15919394 17453258 19475202 22605907 26781992 32106807 39367633 50484539 66626384
18110 66626384 91077143 131221838 200211273 315467745 462376039 546435259 472035330
18103 472035330 334805354 239956149 178904037 137183364 109245692 91002373 78274949
18096 78274949 69045792 62883678 58129064 54703665 52909452 51667822 48858525 44469149
18088 44469149 38944195 34088739 29448119 25348377 22270007 19635708 17241972 15147524
18080 15147524 13250132 12069019 10802597 9793997 9051440 8503945 7785585 6920991 6462142
18071 6462142 6358539 5919356 5098316 4706147 4452534 4258646 4017482 3560105 3054826
18062 3054826 2745908 2404175 2141097 1953576 2141103 2141404 1929566 1456588 847786 501126
$$ packed form
18118A5919394J533864K021944L130705M176085N324815P260826J1116906J6141845
18110F6626384K4450759M0144695O8989435J15256472J46908294Q4059220p4399929
18103D72035330j37229976r4849205o1052112m1720673k7937672j8243319j2727424
18096G8274949r229157o162114m754614l425399j794213j241630k809297m389376
18088D4469149n524954m855456m640620m099742l078370k634299k393736k094448
18080A5147524j897392j181113j266422j008600p42557n47495p18360q64594m58849
18071F462142j03603m39183q21040l92169k53613j93888k41164m57377n05279
18062C054826l08918l41733k63078j87521J87527L01k11838m72978o08802l46660
$$ plain form
18052 501126 572470 656449 705104 612758 570450 745203 594587 552350 470745 403758 624900
18041 624900 184168 82913 384904 691906 564183 164763 78005 -193907 -22823 -3719
18031 -3719 -237186 -361347 -471791 -682611 -314432 -38924 240929 611666 832704 334799
18021 334799 -65653 -359440 -206363 -4932 106145 -15531 -85742 -141993 -179842 -443655
18011 -443655 -580967 -850791 -673271 -483274 -458860 -443603 -173621 -61568 -132724 -371603
18001 -371603 -60551 -285244 -565624 -663286 -494915 -504028 -418721 -399690 -664477 -590751 -378838
17990 -378838 -351323 -350636 -212023 -28904 173267 383747 448842 112106 -53098 44655 179444
17979 179444 121520 -139947 -113681 -163478 -6191 131023 79610 -144870 -353993 -809182
$$ packed form
18052E01126P1344Q3979M8655r2346m2308J74753j50616m2237q1605o6987K21142
18041F24900m40732j01255L01991L07002j27723l99420q6758k71912J71084J9104
18031c719k33467j24161j10444k10820L68179K75508K79853L70737K21038m97905
18021C34799m00452k93787J53077K01431J11077j21676p0211n6251l7849k63813
18011d43655j37312k69824J77520J89997K4414J5257K69982J12053p1156k38879
18001c71603L11052k24693k80380r7662J68371r113Q5307J9031k64787P3726K11913
17990c78838K7515O87J38613J83119K02171K10480O5095l36736j65204R7753J34789
17979A79444n7924k61467K6266m9797J57287J37214n1413k24480k09123m55189
$$ plain form
17969 -809182 -861262 -544510 -743072 -714057 -592409 -718612 -708098 -407167 -269006 -366196
17959 -366196 -394388 -117690 124231 535863 542415 451031 222996 2884 -341326 -608660
17949 -608660 -400176 -105737 -332760 -320982 81916 446593 429800 116976 23466 -38768
17939 -38768 -13793 -58268 45908 -170192 -99780 -99713 -77192 -462269 -659230 -470629 -208448
17928 -208448 -191512 -144879 155548 -145129 -272124 -249903 96247 88627 81085 40026 88876
17917 88876 153159 -19116 -372642 -506978 -414533 -144779 -133561 -397841 -208404 -4025
17907 -4025 31361 -113779 51981 198068 -107160 -446046 -668403 -517596 -199483 -260182
17897 -260182 -352789 -449739 -466736 -481341 -452839 -243546 -93296 -55635 108774 446423 741921
$$ packed form
17969h09182n2080L16752j98562K9015J21648j26203J0514L00931J38161r7190
17959c66196k8192K76698K41921M11632O552r1384k28035k20112l44210k67334
17949f08660K08484K94439k27023J1778M02898L64677j6793l12824r3510o2234
17939c8768K4975m4475J04176k16100P0412O7K2521l85077j96961J88601K62181
17928b08448J6936M6633L00427l00677j26995K2221L46150p620p542m1059M8850
17917H8876O4283j72275l53526j34336R2445K69754J1218k64280J89437K04379
17907d025L5386j45140J65760J46087l05228l38886k22357J50807L18113o0699
17897b60182r2607r6950j6997j4605K8502K09293J50250L7661J64409L37649K95498
$$ plain form
17886 741921 526110 338748 227968 -263056 -245472 217801 40118 -179959 -75128 -120840
17876 -120840 -221974 -69408 368846 103346 -279671 -272576 75557 279683 169350 117330
17866 117330 -12637 -210714 15684 -113807 -251380 47120 85588 -84493 -31549 108518
17856 108518 113533 -133560 -215530 -303076 -454915 -145402 285024 184748 -283736 17013
17846 17013 -124391 -326641 -42650 -127089 -503691 -642138 -325893 53580 161753 74231
17836 74231 -201127 -92109 -66161 75952 338212 230038 68420 241121 271437 -50824
17826 -50824 -459612 -516004 -520420 -19924 -98199 -406026 -496813 -329760 -634620 -977017 -872624
17815 -872624 -762978 -660094 -463505 -82659 131155 -11043 -101330 -211236 -513068 -632855
$$ packed form
17886G41921k15811j87362j10780m91024J7584M63273j77683k20077J04831m5712
17876a20840j01134J52566M38254k65500l83017P095L48133K04126j10333n2020
17866A17330j29967j98077K26398j29491j37573K98500L8468j70081N2944J40067
17856A08518N015k47093q1970q7546j51839L09513M30426j00276m68484L00749
17846A7013j41404k02250K83991q4439l76602j38447L16245L79473J08173q7522
17836G4231k75358J09018K5948J42113K62260j08174j61618J72701L0316l22261
17826e0824m08788n6392m416N00496p8275l07827r0787J67053l04860l42397J04393
17815h72624J09646J02884J96589L80846K13814j42198r0287j09906l01832j19787
$$ plain form
17805 -632855 -445055 85949 -55865 -221838 -389533 -376610 -329333 -527268 -308003 120930
17795 120930 106551 117291 89322 219250 361049 271654 473928 347585 519564 533734
17785 533734 425757 -59418 -46430 100290 57104 -95810 -130415 195412 521014 704144
17775 704144 461823 254933 112513 -60360 -167261 12848 266199 519554 584528 461420
17765 461420 372404 85133 190515 -36043 -191002 -295199 -259030 -502699 -665825 -458965
17755 -458965 -378069 -142958 125925 92289 -32238 -266911 -449340 -159505 -166533 -304995
17745 -304995 -558985 -513027 -211012 293118 476523 602389 619182 705881 586966 484036
17735 484036 317258 459009 198480 68010 4370 -192590 -479106 -379120 -412871 -279981
$$ packed form
17805f32855J87800N31004j41814j65973j67695J2923M7277j97935K19265M28933
17795A20930j4379J0740k7969J29928J41799q9395K02274j26343J71979J4170
17785E33734j07977m85175J2988J46720m3186j52914l4605L25827L25602J83130
17775G04144k42321k06890j42420j72873j06901J80109K53351K53355O4974j23108
17765D61420q9016k87271J05382k26558j54959j04197L6169k43669j63126K06860
17755d58965Q0896K35111K68883l3636j24527k34673j82429K89835p028j38462
17745c04995k53990M5958L02015N04130J83405J25866J6793Q6699j18915j02930
17735D84036j66778J41751k60529j30470o3640j96960k86516R9986l3751J32890
$$ plain form
17725 -279981 -78621 -224514 -194094 -299970 -324396 -284021 13794 -268499 -500709 -713997
17715 -713997 -450227 -242905 -508229 -497236 -174513 23546 156043 72831 302735 342746
17705 342746 107538 395983 782780 784318 590074 458286 225046 174824 330557 -2559
17695 -2559 28278 101045 129594 -145807 -378905 -579929 -300941 -103060 93041 23850 -238003
17684 -238003 -30672 251174 672478 779414 396166 261130 -173433 -98360 -79621 220516
17674 220516 366149 166888 228994 108128 -241106 104430 -112341 -64652 -45743 375245
17664 375245 502478 292020 112071 20532 -311424 -478404 -277810 -97968 -109652 22091
17654 22091 197271 235345 328642 310493 382012 114249 -64498 -330189 -366384 -330170 -314436
$$ packed form
17725b79981K01360j45893L0420j05876k4426M0375K97815k82293k32210k13288
17715g13997K63770K07322k65324J0993L22723J98059J32497q3212K29904M0011
17705C42746k35208K88445L86797J538j94244j31788k33240n0222J55733l33116
17695b559L0837P2767K8549k75401k33098k01024K78988J97881J96101o9191k61853
17684b38003K07331K81846M21304J06936l83248j35036m34563P5073J8739L00137
17674B20516J45633j99261O2106j20866l49234L45536k16771M7689J8909M20988
17664C75245J27233k10458j79949r1539l31956j66980K00594J79842j1684J31743
17654B2091J75180L8074R3297j8149P1519k67763j78747k65691l6195L6214J5734
$$ plain form
17643 -314436 -46078 193734 414756 506905 328970 174329 245687 369251 457790 377754
17633 377754 446933 651063 577517 262745 270497 525368 137591 -169219 -222753 -269864 -26158
17622 -26158 -7702 -89539 -189668 -210973 -307717 -504981 -429235 -24429 98449 44374 -159092
17611 -159092 -157007 -93506 70720 319363 291347 -49383 -386024 -504243 -375062 -421493
17601 -421493 44741 174855 -7348 37777 -184015 -416615 -447469 -437273 -273728 -291636
17591 -291636 -281653 -114128 157734 -82969 -432001 -269356 -471379 -461340 -671595 -995666
17581 -995666 -440103 -9859 -72279 171752 612304 635166 342813 -13914 117243 169244
17571 169244 251956 -146561 -142314 -93958 114704 204252 431384 442907 267267 310126 511137
$$ packed form
17643c14436K68358K39812K21022R2149j77935j54641P1358J23564Q8539q0036
17633C77754O9179K04130p3546l14772P752K54871l87777l06810n3534m7111K43706
17622b6158J8456q1837j00129k1305r6744j97264P5746M04806J22878n4075k03466
17611a59092K085O3501J64226K48643k8016l40730l36641j18219J29181m6431
17601d21493M66234J30114j82203M5125k21792k32600l0854J0196J63545j7908
17591b91636R983J67525K71862k40703l49032J62645k02023J0039k10255l24071
17581i95666N55563M30244o2420K44031M40552K2862k92353l56727J31157N2001
17571A69244Q2712l98517M247M8356K08662Q9548K27132J1523j75640M2859K01011
$$ plain form
17560 511137 842112 533510 442307 148185 26004 89156 -240629 -174572 -22879 -314782
17550 -314782 -356376 -195484 116475 184212 261431 92784 -8017 84615 116884 226726
17540 226726 297877 -41807 67606 -210512 -332055 -187125 -18265 -153986 -361416 -668250
17530 -668250 -1004833 -1124705 -972278 -1027554 -1323581 -1372674 -1164232 -730539 -252163 -241516
17520 -241516 -16558 -136423 -404471 -381801 -245325 -281154 -549085 -532476 -214060 -54327
17510 -54327 -103192 -125120 -200495 -42878 -191036 -530669 -582439 -273296 79930 274568
17500 274568 -121842 -257436 -165375 -105550 -162316 -13394 -275882 -588061 -306503 277035
17490 277035 309635 270763 96684 -143762 -336903 -357030 -369169 -365678 -120124 207207 142419
$$ packed form
17560E11137L30975l08602r1203k94122j22181O3152l29785O6057J51693k91903
17550c14782m1594J60892L11959O7737P7219j68647j00801R2632L2269J09842
17540B26726P1151l39684J09413k78118j21543J44930J68860j35721k07430l06834
17530f68250l36583j19872J52427n5276k96027m9093K08442M33693M78376J0647
17520b41516K24958j19865k68048K2670J36476l5829k67931J6609L18416J59733
17510e4327m8865k1928p5375J57617j48158l39633n1770L09143L53226J94638
17500B74568l96410j35594R2061N9825n6766J48922k62488l12179K81558N83538
17490B77035L2600l8872j74079k40446j93141k0127j2139L491K45554L27331o4788
$$ plain form
17479 142419 17894 -20346 -43817 118758 391796 484818 172131 -5919 170873 172495
17469 172495 103525 83101 191300 59572 250296 352943 382259 238092 201526 -254025
17459 -254025 -424859 -453853 -404904 -398604 -296827 232149 132497 -59661 -241670 -252062 104988
17448 104988 40364 15377 329284 513900 435709 452237 1075044 1766285 2458689 2712817
17438 2712817 2449692 1871127 1489979 861737 794392 756603 511494 262034 -83154 -105216
17428 -105216 -444145 -803595 -610232 -284916 -52017 -389949 -563672 -481240 81866 448204
17418 448204 507996 414181 114477 -61240 -45293 -166868 -234136 -466818 -958801 -832885
17408 -832885 -645492 -557749 -332851 -73130 -325483 -180428 94582 74910 -506694 -630570
$$ packed form
17479A42419j24525l8240k3471J62575K73038R3022l12687j78050J76792J622
17469A72495o8970k0424J08199j31728J90724J02647K9316j44167l6566m55551
17459b54025j70834k8994M8949O300J01777N28976r9652j92158j82009j0392L57050
17448A04988o4624k4987L13907J84616p8191J6528O22807O91241O92404K54128
17438B712817k63125n78565l81148o28242o7345l7789k45109k49460l45188k2062
17428a05216l38929l59450J93363L25316K32899l37932j73723Q2432N63106L66338
17418D48204N9792r3815k99704j75717J5947j21575o7268k32682m91983J25916
17408h32885J87393Q7743K24898K59721k52353J45055K75010j9672n81604j23876
$$ plain form
17398 -630570 -552437 -265638 136132 -7172 -22649 173955 59286 -121321 -485134 -462356
17388 -462356 -331065 -283367 -518378 -773549 -311129 -65710 -74007 -207073 -301223 -296973 -296772
17377 -296772 -446598 -518134 -468817 -326409 -404017 -706655 -860483 -742762 -669117 -363994
17367 -363994 -140380 170231 264223 -209176 -512135 -28775 231404 241498 -23566 -460748
17357 -460748 -584888 -502834 -497016 -423598 -367124 -220838 -314530 -277478 112830 103816 82206
17346 82206 -53229 111697 94978 -318141 -92656 -50174 143241 220306 26852 64777
17336 64777 249700 -29829 -313474 -290758 -435697 -673249 -975338 -830176 -796816 -613798
17326 -613798 -953359 -855023 -454706 -377075 -173964 -139715 -270367 -218426 -315139 -273860 -554264
$$ packed form
17398f30570P8133K86799M01770j43304j5477J96604j14669j80607l63813K2778
17388d62356J31291M7698k35011k55171M62420K45419q297j33066r4150M250K01
17377b96772j49826p1536M9317J42408p7608l02638j53828J17721P3645L05123
17367c63994K23614L10611R3992m73399l02959M83360K60179J0094k65064m37182
17357d60748j24140Q2054N818P3418N6474J46286r3692L7052L90308r014k1610
17346H2206j35435J64926j6719m13119K25485M2482J93415P7065j93454L7925
17336F4777J84923k79529k83645K2716j44939k37552l02089J45162L3360J83018
17326f13798l39561R8336M00317P7631K03111L4249j30652N1941r6713M1279k80404
$$ plain form
17315 -554264 -819528 -475475 -174015 -152105 -269429 -247071 -381175 -496193 -676665 -594189
17305 -594189 -356881 -194246 -313744 -528410 -332029 -277512 23081 -140870 -242726 -176798
17295 -176798 -82931 -26226 -2830 -180450 -112256 172700 118941 13116 114716 324414
17285 324414 88154 808 124160 419827 132856 -150949 -28299 56180 176860 93637
17275 93637 -213544 -87077 162748 176664 53255 46829 -239085 -430968 -296699 -158114
17265 -158114 -349588 -401033 -232096 -76204 9399 157544 490290 278680 -38797 -337200
17255 -337200 -42417 157514 215079 95287 -182601 -611594 -659694 -619254 -417426 -326252
17245 -326252 -91058 195373 160537 -125988 -494909 -423863 156061 392724 94935 -75461
$$ packed form
17315e54264k65264L44053L01460K1910j17324K2358j34104j15018j80472Q2476
17305e94189K37308J62635j19498k14666J96381N4517L00593j63951j01856O5928
17295a76798R3867N6705K3396j77620O8194K84956n3759j05825J01600K09698
17285C24414k36260q7346J23352K95667k86971k83805J22650Q4479J20680q3223
17275I3637l07181J26467K49825J3916j23409o426k85914j91883J34269J38585
17265a58114j91474n1445J68937J55892Q5603J48145L32746k11610l17477k98403
17255c37200K94783J99931N7565j19792k77888m28993m8100M0440K01828R1174
17245c26252K35194K86431l4836k86525l68921P1046N79924K36663k97789j70396
$$ plain form
17235 -75461 -62385 -397251 -346708 52299 199495 382633 294981 330886 348611 34530 -204545
17224 -204545 -480086 -224949 43204 -130299 -536608 -510060 -352637 -164054 -363476 -404108
17214 -404108 -343242 -198071 -166563 -170005 -132071 60355 -17790 -284583 -735232 -776205 -437502
17203 -437502 -275054 -291637 -314328 -197725 -162022 -355207 -330773 -353110 -239945 49719
17193 49719 106975 -198800 -129218 -290442 -378893 -225763 165869 -27251 42936 296062
17183 296062 205651 203343 213428 32035 -78612 -104714 396601 627654 119579 87631 288377
17172 288377 -41851 -345024 -262686 -136187 -38945 -158481 -248689 -151718 -88485 23607
17162 23607 -251626 -106697 -41596 43676 -204451 -223478 -284321 -399366 -44237 -26903 10881
$$ packed form
17235g5461J3076l34866N0543L99007J47196J83138q7652L5905J7725l14081k39075
17224b04545k75541K55137K68153j73503m06309K6548J57423J88583j99422m0632
17214d04108O0866J45171L1508l442L7934J92426p8145k66793m50649m0973L38703
17203d37502J62448j6583k2691J16603L5703j93185K4434k2337J13165K89664
17193D9719N7256l05775O9582j61224q8451J53130L91632j93120P0187K53126
17183B96062r0411k308J0085j81393j10647k6102N01315K31053n08075l1948K00746
17172B88377l30228l03173Q2338J26499R7242j19536r0208R6971O3233J12092
17162B3607k75233J44929O5101Q5272k48127j9027o0843j15045L55129J7334L7784
$$ plain form
17151 10881 187185 225049 151517 -14064 151429 -19771 -168106 -14853 25145 54227
17141 54227 23705 476985 464191 68680 -71130 -391367 -653487 -533868 -293201 -147619
17131 -147619 -435536 -494955 -403509 -70753 -215491 -412584 -424726 -408633 -406753 -233652 51287
17120 51287 133741 -24548 -220898 -133767 -623470 -524216 -272381 -92443 118323 65685
17110 65685 -145979 -293677 -391717 -254803 225083 289498 35805 13347 -57300 -186200
17100 -186200 -234066 -140678 -185231 62336 63712 -268804 -608390 -943042 -468749 -682525
17090 -682525 -868288 -957675 -548775 -373985 -230844 -224298 -204733 -110260 -85199 -167717 -269508
17079 -269508 -188660 -392619 -511540 -718414 -672985 -776634 -888037 -545560 -607954 -101207
$$ packed form
17151A0881J76304L7864p3532j65581J65493j71200j48335J53253L9998K9082
17141E4227l0522M53280j2794l95511j39810l20237k62120J19619K40667J45582
17131a47619k87917n9419R1446L32756j44738j97093j2142J6093J880J73101K84939
17120E1287Q2454j58289j96350Q7131m89703R9254K51835J79938K10766n2638
17110F5685k11664j47698r8040J36914M79886O4415k53693k2458p0647j28900
17100a86200m7866R3388m4553K47567J376l32516l39586l34652M74293k13776
17090f82525j85763q9387M08900J74790J43141O546J9565R4473K5061q2518j01791
17079b69508Q0848k03959j18921k06874M5429j03649j11403L42477o2394N06747
$$ plain form
17069 -101207 64668 -349366 -784388 -1057638 -858062 -455137 -83396 -251138 -417310 -280461
17059 -280461 -97390 -182328 -375416 -351523 -375357 -77921 -74179 -139843 -101410 112580 295756
17048 295756 -80673 -694031 -619787 -250132 -121316 63818 -174230 -231211 -15448 101541
17038 101541 147498 109560 207246 84562 -251196 -311112 -322073 -292228 -296294 17503 93709
17027 93709 62759 -84276 117765 216881 47806 -109559 -36710 130537 -131832 -325845
17017 -325845 117529 488845 547678 939206 1140065 719240 226415 -94081 -159720 26755
17007 26755 195341 -208603 -427896 -307264 -297706 -245632 -195931 -30081 88414 310246
16997 310246 492052 580464 435794 302908 179604 43830 119342 153382 -282648 26155
$$ packed form
17069a01207J65875m14034m35022k73250J99576M02925L71741j67742j66172J36849
17059b80461J83071q4938j93088K3893k3834K97436L742o5664L8433K13990J83176
17048B95756l76429o13358P4244L69655J28816J85134k38048n6981K15763J16989
17038A01541M5957l7938R7686j22684l35758n9916j0961K9845m066L13797P6206
17027I3709l0950j47035K02041R9116j69075j57365P2849J67247k62369j94013
17017c25845M43374L71316N8833L91528K00859m20825m92825l20496o5639J86475
17007B6755J68586m03944k19293J20632R558N2074M9701J65850J18495K21832
16997C10246J81806Q8412j44670j32886j23304j35774P5512L4040m36030L08803
$$ plain form
16987 26155 -13741 -94722 40915 9889 -145092 -30175 35043 -397618 -470210 -404379 -586029
16976 -586029 -767501 -619594 -460277 -578754 -420853 90790 230872 4242 -70127 -20282
16966 -20282 48962 246172 437588 270963 -35492 146741 173211 199637 34683 -102688
16956 -102688 -164778 -90047 15735 123374 69773 2158 145536 131035 -48664 -272120
16946 -272120 -593224 -323542 -64726 64009 67631 -14574 285674 311392 190292 136168
16936 136168 129514 20498 -367180 -259601 -115194 -318436 -403033 -342661 -203069 -140820
16926 -140820 -47224 -30291 -75377 -137640 13827 189680 60221 92270 208319 130923 153101
16915 153101 138077 397613 179027 -287009 -294576 -221048 -360695 -85770 70969 -106819
$$ packed form
16987B6155l9896q0981J35637l1026j54981J14917O5218m32661p2592O5831j81650
16976e86029j81472J47907J59317j18477J57901N11643J40082k26630p4369M9845
16966b0282O9244J97210J91416j66625l06455J82233K6470K6426j64954j37371
16956a02688o2090P4731J05782J07639n3601o7615J43378j4501j79699k23456
16946b72120l21104K69682K58816J28735L622q2205L00248K5718j21100n4124
16936A36168o654j09016l87678J07579J44407k03242q4597O0372J39592O2249
16926a40820R3596J6933m5086o2263J51467J75853j29459L2049J16049p7396K2178
16915A53101j5024K59536k18586m66036p567P3528j39647K74925J56739j77788
$$ plain form
16905 -106819 -10836 33119 -40612 35495 -29607 -209259 -44826 -28756 124026 165953 247269
16894 247269 122860 -39982 149483 181860 -60005 -386477 -211181 124293 -153932 -140330
16884 -140330 111602 -154410 -548045 -596805 -759279 -1053960 -504408 -184045 -62985 -89615
16874 -89615 -47529 -96033 124941 112875 206078 2002 -264420 -289455 -178571 -159845 -332606
16863 -332606 -388185 -177125 84325 -79695 203671 -26366 23789 252730 208315 -182726
16853 -182726 -167936 -264270 -277171 -168634 -173863 -313563 -724705 -727172 -882889 -518014 -176710
16842 -176710 -318295 -191209 -186137 -53916 180474 77685 59083 294065 282988 134849
16832 134849 67651 162663 -146541 -437079 -499188 -213353 -194908 48561 311526 102516
$$ packed form
16905a06819R5983M3955p3731P6107o5102j79652J64433J6070J52782M1927Q1316
16894B47269j24409j62842J89465L2377k41865l26472J75296L35474k78225J3602
16884a40330K51932k66012l93635m8760j62474k94681N49552L20363J21060k6630
16874h9615M2086m8504K20974j2066R3203k04076k66422k5035J10884J8726j72761
16863c32606n5579K11060K61450j64020K83366k30037N0155K28941m4415l91041
16853a82726J4790r6334j2901J08537n229j39700m11142k467j55717L64875L41304
16842a76710j41585J27086N072J32221K34390j02789j8602K34982j1077j48139
16832A34849o7198R5012l09204k90538o2109K85835J8445K43469K62965k09010
$$ plain form
16822 102516 -72301 -18560 162649 45780 -559716 -818654 -808826 -1110314 -1211831 -740943
16812 -740943 -247775 -186292 -227899 -144620 120188 167734 226500 192708 185029 390950 536871
16801 536871 396585 -144004 -407886 -165647 -263897 -156023 -130377 82741 108086 145710
16791 145710 -49846 328457 472915 151120 63999 -210664 -352086 -482154 -325879 -298811
16781 -298811 -116264 5226 74337 -99579 79040 63794 101288 31102 156561 305356
16771 305356 199316 281553 255020 140893 -138458 -451400 -355078 74720 40352 -272626
16761 -272626 -410245 -594348 -468298 -227158 58930 9462 29259 -238380 -689393 -412290
16751 -412290 73187 -96618 -277668 -325730 -293388 -97201 -74372 -222865 76325 90130
$$ packed form
16822A02516j74817N3741J81209j16869o05496k58938R828l01488j01517M70888
16812g40943M93168O1483m1607Q3279K64808M7546N8766l3792p679K05921J45921
16801E36871j40286n40589k63882K42239r8250J07874K5646K13118K5345L7624
16791A45710j95556L78303J44458l21795q7121k74663j41422j30068J56275K7068
16781b98811J82547J21490O9111j73916J78619j5246L7494p0186J25459J48795
16771C05356j06040Q2237k6533j14127k79351l12942R6322M29798l4368l12978
16761b72626j37619j84103J26050K41140K86088m9468J9797k67639m51013K77103
16751d12290M85477j69805j81050m8062L2342J96187K2829j48493K99190J3805
$$ plain form
16741 90130 -158339 -38632 26128 -5517 54983 154942 212795 393018 117317 286560 236961
16730 236961 99412 56121 275548 430855 393180 295435 413192 206114 115950 188624
16720 188624 -203317 -211178 310866 341386 212119 267554 165584 -10964 -130497 -42414
16710 -42414 220086 39620 -51344 -324365 -239548 29513 123343 13939 63488 76727 59833
16699 59833 -108648 -80324 88488 623026 1075636 1163167 525709 -101221 -296183 -434954
16689 -434954 -153148 427517 627841 243720 145922 -25139 -165898 82911 255866 230862
16679 230862 381721 797820 1005609 792284 733198 574297 657051 605297 334010 100466
16669 100466 273874 271490 82816 175483 357507 458798 552585 502898 322767 328052 373864
$$ packed form
16741I0130k48469J19707O4760l1645O0500R9959N7853J80223k75701J69243m9599
16730B36961j37549m3291K19427J55307l7675r7745J17757k07078r0164P2674
16720A88624l91941p861N22044L0520j29267N5435j01970j76548j19533Q8083
16710d2414K62500j80466r0964k73021Q4817K69061R3830j09404M9549J3239j6894
16699E9833j68481K8324J68812N34538M52610Q7531o37458o26930j94962j38771
16689d34954K81806N80665K00324l84121r7798j71061j40759K48809J72955k5004
16679B30862J50859M16099K07789k13325n9086j58901Q2754n1754k71287k33544
16669A00466J73408k384j88674R2667J82024J01291R3787m9687j80131N285M5812
$$ plain form
16658 373864 -15963 -225211 -438039 -454349 -502507 -630193 -538043 -676995 -816871 -303219
16648 -303219 310883 283293 -6243 -474493 -613967 -820827 -276032 193599 302861 -129939
16638 -129939 -387884 -353965 -323687 -60690 324761 598076 495731 209873 86541 105110
16628 105110 259825 229454 32563 203933 197644 139217 423895 131537 -21929 -521466
16618 -521466 -651458 -419005 -512140 -789389 -519679 -201563 -302062 -164705 -55824 -280696
16608 -280696 -401802 -309136 -283495 -79189 -36062 -241131 -429637 -284777 -357550 -463403
16598 -463403 -104620 44535 -14220 -170693 -522166 -488842 -392029 -325985 -138270 -80299
16588 -80299 99311 36362 103777 281788 319322 1506 54397 511359 732392 715451 272358
$$ packed form
16658C73864l89827k09248k12828j6310m8158j27686R2150j38952j39876N13652
16648c03219O14102k7590k89536m68250j39474k06860N44795M69631J09262m32800
16638a29939k57945L3919L0278K62997L85451K73315j02345k85858j23332J8569
16628A05110J54715l0371j96891J71370o289n8427K84678k92358j53466m99537
16618e21466j29992K32453r3135k77249K69710L18116j00499J37357J08881k24872
16608b80696j21106R2666K5641K04306M3127k05069j88506J44860p2773j05853
16598d63403L58783J49155n8755j56473l51473L3324R6813O6044J87715N7971
16588h0299J79610o2949O7415J78011L7534l17816N2891M56962K21033j6941m43093
$$ plain form
16577 272358 -137364 -198999 -605288 -468148 -80385 60064 158270 -14998 179090 38613
16567 38613 126804 69680 149459 90994 51887 38977 155177 253545 235178 336871 495996
16556 495996 592887 598924 683583 372485 105748 135666 112013 320935 153697 83527 241904
16545 241904 -27265 -140492 -171460 -354424 -304189 -326985 -105926 -227571 -214514 2975
16535 2975 70922 -134148 -285514 -292875 -72720 177896 358056 181577 -170413 -324592
16525 -324592 -554117 -680120 -425709 -248012 -60419 101918 107590 97460 28555 -271880
16515 -271880 -281757 -10366 -44541 -311509 -660858 -997687 -694487 -372853 -354708 -61299
16505 -61299 226930 143653 321969 142945 -141757 330530 655421 489718 -197134 -686313
$$ packed form
16577B72358m09722o1635m06289J37140L87763J40449R8206j73268J94088j40477
16567C8613Q8191n7124P9779n8465l9107j2910J16200R8368j8367J01693J59125
16556D95996R6891O037Q4659l11098k66737K9918k3653K08922j67238p0170J58377
16545B41904k69169j13227l0968j82964N0235k2796K21059j21645J3057K17489
16535B975O7947k05070j51366p361K20155K50616J80160j76479l51990j54179
16525c24592k29525j26003K54411J77697J87593J62337N672j0130o8905l00435
16515b71880r877K71391l4175k66968l49349l36829L03200L21634J8145K93409
16505f1299K88229q3277J78316j79024k84702M72287L24891j65703o86852m89179
$$ plain form
16495 -686313 -617772 -352989 -110699 48731 -30991 77032 297824 -61517 -326004 5681
16485 5681 143256 -65444 317985 59999 14569 276800 113227 292716 498514 221758
16475 221758 240683 181138 294169 152652 180159 380282 477129 732871 491425 468670
16465 468670 249995 15939 186591 353010 -38630 -530924 -523291 -237646 -422207 -320702
16455 -320702 -208729 -426409 -178907 318476 488075 379697 182931 -21049 -195199 53334
16445 53334 -124479 -186101 -48808 105281 87875 471771 363311 98757 -217647 -91003
16435 -91003 73941 -8324 -383007 -84011 368390 370413 76830 238926 161502 -199100
16425 -199100 -496047 -157018 -132208 42935 -221520 -504844 -653389 -467629 -505772 -591803
$$ packed form
16495f86313O8541K64783K42290J59430p9722J08023K20792l59341k64487L31685
16485E681J37575k08700L83429k57986m5430K62231j63573J79489K05798k76756
16475B21758J8925n9545J13031j41517K7507K00123R6847K55742k41446k2755
16465D68670k18675k34056J70652J66419l91640m92294P633K85645j84561J01505
16455c20702J11973k17680K47502M97383J69599j08378j96766k03980j74150K48533
16445E3334j77813o1622J37293J54089j7406L83896j08460k64554l16404J26644
16435i1003J64944q2265l74683K98996M52401K023k93583J62096p7424l60602
16425a99100k96947L39029K4810J75143k64455k83324j48545J85760l8143q6031
$$ plain form
16415 -591803 -703761 -557743 -279996 -154743 258866 438644 421341 139610 -314755 -297181
16405 -297181 -449942 -510885 -278093 -332825 -437964 -478345 -322202 -47705 -18845 -8220
16395 -8220 205171 285889 199556 297957 751557 909176 447537 211229 346903 290627 382004
16384 382004 464677 213595 238616 143708 17628 -18749 -76846 -253454 -39226 113046
16374 113046 61791 -41458 126293 359690 342591 344980 424387 503922 434618 283915 -85649
16363 -85649 -88732 -398709 -426296 38032 -254253 -398747 -379811 -461488 -437994 -686346 -600474
16352 -600474 -414456 -243353 198795 -122026 -717218 -367841 -357104 -466873 -184920 -391194
16342 -391194 -259038 -6548 12986 -228136 -334108 26779 270022 366585 477522 -49781
$$ packed form
16415e91803j11958J46018K77747J25253M13609J79778j7303k81731m54365J7574
16405b97181j52761o0943K32792n4732j05139m0381J56143K74497K8860J0625
16395h220K13391Q0718q6333R8401M53600J57619m61639k36308J35674n6276R1377
16384C82004Q2673k51082K5021r4908j26080l6377n8097j76608K14228J52272
16374A13046n1255j03249J67751K33397j7099K389P9407P9535o9304j50703l69564
16363h5649l083l09977k7587M64328k92285j44494J8936q1677K3494k48352Q5872
16352f00474J86018J71103M42148l20821n95192L49377J0737j09769K81953k06274
16342c91194J32156K52490J9534k41122j05972L60887K43243R6563J10937n27303
$$ plain form
16332 -49781 190082 661809 390708 135920 145815 19925 96162 219753 458409 404008
16322 404008 64715 -453773 -540580 -787800 -730619 -231443 -62525 36642 270447 130270
16312 130270 -283684 -300669 -371845 -318459 -113152 -227379 -155209 2082 -7523 49998 -7922
16301 -7922 -19827 49888 -372779 -627565 -439743 -222760 -340998 -337849 -375427 -85735 -349304
16290 -349304 -434699 -438180 -267256 -56843 238129 645827 486819 311639 364019 556289
16280 556289 440883 251265 399356 655906 433388 197753 86537 -42636 -33693 47905
16270 47905 120328 105711 92358 66805 19164 -187171 -92309 -228217 -198224 -45590 -198305
16259 -198305 -288935 -227460 -33173 -285054 -252050 -294650 -298259 35588 246010 290064 28120
$$ packed form
16332d9781K39863M71727k71101k54788R895j25890P6237J23591K38656n4401
16322D04008l39293n18488q6807k47220N7181M99176J68918R9167K33805j40177
16312A30270m13954j6985p1176N3386K05307j14227P2170J57291r605N7521n7920
16301g922j1905O9715m22667k54786J87822K16983j18238L149l7578K89692k63569
16290c49304q5395l481J70924K10413K94972M07698j59008j75180N2380J92270
16280E56289j15406j89618J48091K56550k22518k35635j11216j29173Q943Q1598
16270D7905P2423j4617j3353k5553m7641k06335R4862j35908K9993J52634j52715
16259a98305r0630O1475J94287k51881L3004m2600l609L33847K10422M4054k61944
$$ plain form
16248 28120 -118635 -45127 18557 80424 50874 112807 423514 588504 408512 305791 117252
16237 117252 -14642 32254 246772 253373 105651 207320 146549 22929 5928 350030
16227 350030 516045 789396 785684 431842 -144279 -16022 -233357 -381461 -339473 -261109
16217 -261109 -371036 -342498 -108133 63790 345821 382296 171491 191439 9807 -152787
16207 -152787 -56268 -111178 -82630 -155124 79673 168988 -37707 -198152 -356781 -340797 -448792
16196 -448792 -281039 -430271 -603769 -372969 -29343 316114 247737 137765 280802 -312161
16186 -312161 -495442 -417502 -245075 -218061 -120122 64046 -86225 -140560 -243133 -362012
16176 -362012 -182133 -65589 -7713 80410 317618 597438 257984 62447 -150596 -387765
$$ packed form
16248B8120j46755P3508O3684O1867k9550O1933L10707J64990j79992j02721j88539
16237A17252j31894M6896K14518O601j47722J01669o0771j23620j7001L44102
16227C50030J66015K73351l712l53842n76121J28257k17335j48104M1988P8364
16217b61109j09927K8538K34365J71923K82031L6475k10805J9948j81632j62594
16207a52787R6519n4910K8548p2494K34797Q9315k06695j60445j58629J5984j07995
16196d48792J67753j49232j73498K30800L43626L45457o8377j09972J43037n92963
16186c12161j83281P7940J72427K7014R7939J84168j50271n4335j02573j18879
16176c62012J79879J16544N7876Q8123K37208K79820l39454j95537k13043k37169
$$ plain form
16166 -387765 -372953 -271236 -212081 -115362 -211862 -274295 -90664 69100 180067 310711
16156 310711 187990 -179666 -139375 28586 105495 -301136 -545820 -348566 -170992 101064
16146 101064 213646 304931 228771 146274 44657 47082 62241 -128232 69398 -101938 -663084
16135 -663084 -707367 -249940 147818 116011 43625 56924 -264184 61970 269974 -63402
16125 -63402 -369021 -306936 129614 185654 1838 -158349 -371198 -461762 -321901 -48837
16115 -48837 144717 276447 112169 212764 363287 117989 71682 451264 292277 81990
16105 81990 -253391 -71759 123329 110657 81006 71247 -186147 79113 263635 202179 230938
16094 230938 -48223 -122371 -35538 -197628 -367341 -410663 -266031 -91850 114094 522691
$$ packed form
16166c87765J4812J01717N9155R6719r6500o2433J83631J59764J10967J30644
16156C10711j22721l67656M0291J67961P6909m06631k44684J97254J77574K72056
16146A01064J12582R1285p6160q2497j01617K425J5159j90473J97630j71336n61146
16135f63084m4283M57427L97758l1807p2386J3299l21108L26154K08004l33376
16125f3402l05619O2085M36550N6040j83816j60187k12849r0564J39861K73064
16115d8837J93554J31730j64278J00595J50523k45298m6307L79582j58987k10287
16105H1990l35381J81632J95088j2672k9651r759k57394K65260J84522o1456K8759
16094B30938k79161p4148Q6833j62090j69713m3322J44632J74181K05944M08597
$$ plain form
16084 522691 222166 -378910 -552266 -790582 -890336 -775751 -693877 -629141 -408849 -101166
16074 -101166 -222198 -538465 -259762 -79000 -190012 -146727 -67288 -128903 -696277 -743506
16064 -743506 -713925 -341887 85558 491249 553183 619979 620110 175297 28120 -45511 263927
16053 263927 567643 431004 61324 45214 -17385 114987 69045 -133412 -44672 -303173
16043 -303173 -218170 31626 -108030 -303577 -21188 -9695 -397143 -325415 -339678 -415749
16033 -415749 -351556 -572733 -587673 -652194 -779463 -603476 -189107 -15158 -27939 271187
16023 271187 683008 465040 175857 328083 278940 70627 -390210 -357037 -37176 360863
16013 360863 557034 272523 57403 -86619 4613 111480 296244 320039 457827 579237
$$ packed form
16084E22691l00525o01076j73356k38316r9754J14585Q1874O4736K20292L07683
16074a01166j21032l16267K78703J80762j11012M3285P9439o1615n67374m7229
16064g43506K9581L72038M27445M05691O1934O6796J31m44813j47177p3631L09438
16053B63927L03716j36639l69680j6110o2599J32372m5942k02457Q8740k58501
16043c03173Q5003K49796j39656j95547K82389J1493l87448P1728j4263p6071
16033d15749O4193k21177j4940o4521j27269J75987M14369J73949j2781K99126
16023B71187M11821k17968k89183J52226m9143k08313m60837L3173L19861L98039
16013C60863J96171k84511k15120j44022R1232J06867J84764K3795J37788J21410
$$ plain form
16003 579237 440371 214057 22920 89497 -18729 -5090 -86754 -156676 -514980 -626825
15993 -626825 -483000 -397889 -234123 -343952 -226424 5744 -36382 167655 139164 -102533
15983 -102533 -601994 -575488 -224158 304371 367091 115972 -279435 -284502 110397 99838
15973 99838 225745 122207 -250509 -131000 -72432 -4408 123196 22016 -12881 -129524
15963 -129524 -249500 -397822 -445800 -209401 -2643 -85852 -292452 -100972 108350 308905
15953 308905 11380 -111815 208222 304683 -19257 -342681 -57871 314672 173524 -197062
15943 -197062 -197705 195891 237178 311375 -12654 -143530 21402 -86625 -145584 -266056 -282300
15932 -282300 -679376 -482436 -362795 -351391 -225687 -145096 -155001 -401620 -108213 -120375
$$ packed form
16003E79237j38866k26314j91137O6577j08226J3639q1664o9922l58304j11845
15993f26825J43825Q5111J63766j09829J17528K32168m2126K04037k8491k41697
15983a02533m99461K6506L51330N28529O2720k51119l95407n067L94899j0559
15973I9838J25907j03538l72716J19509N8568O8024J27604j01180l4897j16643
15963a29524j19976j48322m7978K36399K06758q3209k06600J91480K09322K00555
15953C08905k97525j23195L20037R6461l23940l23424K84810L72543j41148l70586
15943a97062o43L93596M1287P4197l24029j30876J64932j08027n8959j20472j6244
15932b82300l97076J96940J19641J1404J25704Q0591r905k46619K93407j2162
$$ plain form
15922 -120375 -275071 -413847 -430158 -350667 -518130 -256440 235105 355664 217218 -147386
15912 -147386 -132954 -7361 189976 332285 377616 401172 381539 383273 541696 222838 -132243
15901 -132243 -685220 -458825 -477395 -883344 -958572 -391940 -316432 -457033 -243142 -50846
15891 -50846 -95358 70504 154928 13071 204235 312376 -181309 -417443 -358763 71786
15881 71786 306783 -189179 -356800 -142729 -327699 -390368 -352145 -180306 -214931 45546
15871 45546 318978 -41816 55903 81182 -61423 -153712 -146286 -400718 -495951 -298111 -230805
15860 -230805 -68002 -137087 -14743 -719218 -805717 -656678 -796034 -567186 -241206 -101880
15850 -101880 52373 58443 -280548 -295363 -231353 -679 -130561 71466 -41790 -493234
$$ packed form
15922a20375j54696j38776j6311P9491j67463K61690M91545J20559j38446l64604
15912a47386J4432J25593J97337J42309M5331K3556j9633J734J58423l18858l55081
15901a32243n52977K26395j8570m05949p5228N66632P5508j40601K13891J92296
15891e0846m4512J65862Q4424j41857J91164J08141m93685k36134N8680M30549
15881G1786K34997m95962j67621K14071j84970o2669L8223J71839l4625K60477
15871D5546K73432l60794R7719K5279j42605r2289P426k54432r5233J97840O7306
15860b30805J62803o9085J22344p04475q6499J49039j39356K28848L25980J39326
15850a01880J54253O070l38991j4815O4010K30674j29882K02027j13256m51444
$$ plain form
15840 -493234 -394257 -206504 -314534 27127 -26107 4114 -217473 -403495 -493011 -331045
15830 -331045 -316965 -415319 -145297 -77498 -231448 -90133 2267 -106644 -3704 88719
15820 88719 8753 -194881 -472690 -604214 -482613 -514983 -529417 -544539 -683224 -474957
15810 -474957 41396 218132 -28543 2504 -103897 -276130 63845 360019 -121807 -639299
15800 -639299 -283669 63370 97199 151007 305403 177680 -209677 -172687 18621 76947
15790 76947 252275 431867 141529 -208075 -502479 28335 -325 -192714 -260869 -202949
15780 -202949 -206045 -267202 -278128 -538751 -887362 -999327 -241341 142967 237864 192041 219939
15769 219939 308861 203179 -209004 -489783 -168126 -101996 -103323 -47364 110513 128211 62900
$$ packed form
15840d93234R8977J87753j08030L41661n3234L0221k21587j86022q9516J61966
15830c31045J4080r8354K70022O7799j53950J41315R2400j08911J02940R2423
15820H8719p9966k03634k77809j31524J21601l2370j4434j5122j38685K08267
15810d74957N16353J76736k46675L1047j06401j72233L39975K96174m81826n17492
15800f39299L55630L47039L3829N3808J54396j27723l87357L6990J91308N8326
15790G6947J75328J79592k90338l49604k94404N30814k8660j92389o8155N7920
15780b02949l096o1157j0926k60623l48611j11965P57986L84308R4897m5823K7898
15769B19939Q8922j05682m12183k80779L21657O6130j327N5959J57877J7698o5311
$$ plain form
15758 62900 -215509 -103237 3454 63123 173441 65602 -38503 128299 144913 161790
15748 161790 -25356 -142671 -321586 -249509 -363741 -246778 -345006 -165726 -81929 -53526
15738 -53526 174683 -76051 -188381 -295178 -19282 67212 99197 -81645 46601 121738
15728 121738 355817 71247 -188867 -33653 253153 298359 -4818 -264115 -417436 -382860
15718 -382860 -323071 -393549 -385960 -413570 66658 400737 278863 123608 50561 -14071 -169808
15707 -169808 -55392 115199 55321 494161 443061 298921 78348 30216 -267402 -405020
15697 -405020 -383344 -253959 -102330 -327534 -674755 -740298 -334770 -216905 -142383 -282302
15687 -282302 -520888 -644429 10166 348056 -111346 -472598 -406980 -195514 -157324 -436562
$$ packed form
15758F2900k78409J12272J06691N9669J10318j07839j04105J66802J6614J6877
15748A61790j87146j17315j78915P2077j14232J16963r8228J79280Q3797K8403
15738e3526K28209k50734j12330j06797K75896Q6494L1985j80842J28246P5137
15728A21738K34079k84570k60114J55214K86806M5206l03177k59297j53321L4576
15718c82860N9789p0478P589k7610M80228L34079j21874j55255p3047o4632j55737
15707a69808J14416J70591n9878M38840n1100j44140k20573m8132k97618j37618
15697d05020K1676J29385J51629k25204l47221o5543M05528J17865P4522j39919
15687b82302k38586j23541O54595L37890m59402l61252O5618K11466L8190k79238
$$ plain form
15677 -436562 24069 535274 634247 709301 646803 514451 444423 231550 153761 101950 248112
15666 248112 530539 181857 -63121 160554 58521 -140090 229176 195253 321550 -129509
15656 -129509 -285368 -142247 -43102 -23084 246975 382203 424363 200382 225909 419208
15646 419208 540483 627823 286222 123730 302473 479928 654739 111823 -125621 185276
15636 185276 260590 298675 191116 31597 -89215 -159208 -196660 -106572 33012 100806 48306
15625 48306 197826 261292 230743 10969 138538 145288 186005 -339602 -555634 -561686 -649966
15614 -649966 -921924 -594419 -388622 -322127 -382591 64320 255746 148372 -70426 29581
15604 29581 134199 365419 468412 207064 16948 111056 387552 127091 213643 508102
$$ packed form
15677d36562M60631N11205R8973P5054o2498j32352p0028k12873p7789n1811J46162
15666B48112K82427l48682k44978K23675j02033j98611L69266l3923J26297m51059
15656a29509j55859J43121R9145K0018K70059J35228M2160k23981K5527J93299
15646D19208J21275Q7340l41601j62492J78743J77455J74811n42916k37444L10897
15636A85276P5314L8085j07559j59519j20812o9993l7452R0088J39584O7794n2500
15625D8306J49520O3466l0549k19774J27569O750M0717n25607k16032o052q8280
15614f49966k71958L27505K05797O6495o0464M46911J91426j07374k18798J00007
15604B9581J04618K31220J02993k61348j90116R4108K76496k60461Q6552K94459
$$ plain form
15594 508102 432479 256918 444815 635538 384317 199141 -111074 -270517 -445412 -416362
15584 -416362 -364567 -413469 -393588 -432235 -160276 228239 224070 179888 30291 70056 265767
15573 265767 107766 440277 698302 406722 81108 -31350 -334993 -221322 61697 72519
15563 72519 163673 35511 -453869 -379742 6578 78266 -71836 -379138 -506999 -221831
15553 -221831 166577 -66333 157392 239635 427462 576990 421010 103604 -35464 -271009
15543 -271009 -309327 -565730 -265743 16091 -6687 -306932 -421773 -384565 -359577 35214
15533 35214 506661 832576 720818 186468 170894 -178581 -405234 -15965 453358 -105442
15523 -105442 -425511 -420215 -432670 -147689 148747 123571 -3384 152089 -6256 -245219
$$ packed form
15594E08102p5623j75561J87897J90723k51221j85176l10215j59443j74895K9050
15584d16362N1795m8902J9881l8647K71959L88515m169m4182j49597L9765J95711
15573B65767j58001L32511K58025k91580l25614j12458l03643J13671K83019J0822
15563G2519R1154j28162m89380P4127L86320P1688j50102l07302j27861K85168
15553b21831L88408k32910K23725Q2243J87827J49528j55980l17406j39068k35545
15543b71009l8318k56403K99987K81834k2778l00245j14841L7208K4988L94791
15533C5214M71447L25915j11758n34350j5574l49475k26653L89269M69323n58800
15523a05442l20069N296j2455K84981K96436k5176j26955J55473j58345k38963
$$ plain form
15513 -245219 -390718 -500279 -246074 72972 -167802 -523617 -435146 -193044 -338448 -12239
15503 -12239 246691 -175382 -455738 -310988 127714 -148188 -330901 -204559 -183537 -154971
15493 -154971 -233087 -548438 -578195 -637395 -488777 -235348 -316103 -222292 177549 416824
15483 416824 622705 480231 734898 712068 767261 531459 1451 -154011 213223 478557
15473 478557 851025 702295 738516 595792 367903 194197 295830 -21013 -85495 231164
15463 231164 115837 -45918 -328106 -108674 11366 -118350 -132260 -60920 -357060 -290236
15453 -290236 -292111 -234677 71572 363496 445723 283870 -83626 -81631 37696 -223656 -102724
15442 -102724 384433 718698 511259 15445 -291485 -432275 -138150 182403 86697 146412
$$ packed form
15513b45219j45499j09561K54205L19046k40774l55815Q8471K42102j45404L26209
15503a2239K58930m22073k80356J44750M38702k75902j82713J26342K1022K8566
15493a54971p8116l15351k9757n9200J48618K53429q0755R3811L99841K39275
15483D16824K05881j42474K54667k2830N5193k35802n30008j55462L67234K65334
15473D78557L72468j48730L6221j42724k27889j73706J01633l16843o4482L16659
15463B31164j15327j61755k82188K19432J20040j29716j3910P1340k96140O6824
15453b90236j875N7434L06249K91924Q2227j61853l67496J995J19327k61352J20932
15442a02724M87157L34265k07439m95814l06930j40790K94125L20553r5706N9715
$$ plain form
15432 146412 42161 221919 404710 241997 204569 107086 -4774 53430 37426 -145164
15422 -145164 -259971 -104199 152546 196176 -123870 -155701 54476 182886 300477 310638
15412 310638 538163 747139 897554 974948 603519 331352 -49030 204554 282287 126594
15402 126594 135383 396084 1004240 965681 483256 33346 91770 440106 290503 69360
15392 69360 97569 212504 213503 334938 -33975 -46011 -15771 -50420 -105233 -206531 -404930
15381 -404930 -184189 510214 783714 711235 534938 312340 65576 190154 120514 120452 245658
15370 245658 252503 180505 293408 351206 12148 -140344 -236121 -171869 -130521 -82433 -99491
15359 -99491 126727 54929 -117083 -228612 -86547 383179 544189 562915 481658 567666
$$ packed form
15432A46412j04251J79758J82791j62713l7428r7483j11860N8204j6004j82590
15422a45164j14807J55772K56745M3630l20046l1831K10177J28410J17591J0161
15412C10638K27525K08976J50415P7394l71429k72167l80382K53584P7733j55693
15402A26594Q789K60701O08156l8559m82425m49910N8424L48336j49603k21143
15392F9360K8209J14935R99J21435l68913j2036L0240l4649n4813j01298j98399
15381d04930K20741O94403K73500p2479j76297k22598k46764J24578o9640o2J25206
15370B45658O845p1998J12903N7798l39058j52492r5777O4252M1348M8088j7058
15359i9491K26218p1798j72012j11529J42065M69726J61010J8726q1257Q6008
$$ plain form
15349 567666 609598 281769 155891 -52211 77731 393980 603448 614433 522869 321959
15339 321959 550088 884049 819000 257657 13799 311267 744727 907533 954527 895492
15329 895492 664915 438777 292600 238129 253705 359281 691502 588372 92028 177410
15319 177410 -96916 -123608 351332 604313 471801 502316 332316 406652 276851 168763
15309 168763 100332 176494 274956 385896 -8618 -225094 28563 317256 547519 631513
15299 631513 762569 934437 851454 622028 274908 12544 202930 532884 752450 374280
15289 374280 26928 312750 883527 977180 860308 625998 394262 419711 475369 498790
15279 498790 572608 706460 906771 856043 945179 669954 700616 700668 479535 321999 42485
$$ packed form
15349E67666M1932l27829j25878k08102J29942L16249K09468J0985r1564k00910
15339C21959K28129L33961o5049n61343k43858K97468M33460J62806M6994n9035
15329H95492k30577k26138j46177n4471J5576J05576L32221j03130m96344Q5382
15319A77410k74326k6692M74940K52981j32512L0515j70000P4336j29801j08088
15309A68763o8431P6162R8462J10940l94514k16476K53657K88693K30263Q3994
15299F31513J31056J71868q2983k29426l47120k62364J90386L29954K19566l78170
15289C74280l47352K85822N70777R3653j16872k34310k31736K5449N5658K3421
15279D98790P3818J33852K00311n0728Q9136k75225L0662N2k21133j57536k79514
$$ plain form
15268 42485 202704 117899 -71679 275693 736549 1140592 974147 760292 456082 -133643
15258 -133643 738 651207 667310 645854 854418 845961 962289 1157518 1105328 925702
15248 925702 1030900 987537 1166397 1022936 709617 712710 1090507 1506879 1409275 1079593
15238 1079593 934967 874803 1088351 1394584 1709345 1748183 1601585 1628159 1555958 1581157
15228 1581157 1440943 1574278 1697150 1518875 994712 849578 1047394 963827 985562 1155788
15218 1155788 1387864 1103123 931861 1131317 1541664 2106115 2045076 1892034 1896897 2091000
15208 2091000 2130141 2116282 2116732 1929898 1709950 1574239 1717582 1733549 1836947 2051544
15198 2051544 2141876 1777320 1778644 1951203 2354057 2642366 2879867 2635493 2360644 2661747
$$ packed form
15268D2485J60219q4805j89578L47372M60856M04043j66445k13855l04210n89725
15258a33643J34381O50469J6103k1456K08564q457J16328J95229n2190j79626
15248I25702J05198m3363J78860j43461l13319L093L77797M16372r7604l29682
15238A079593j44626o0164K13548L06233L14761L8838j46598K6574p2201K5199
15228A581157j40214J33335J22872j78275n24163j45134J97816q3567K1735J70226
15218A155788K32076k84741j71262J99456M10347N64451o1039j53042M863J94103
15208B091000L9141j3859M50j86834k19948j35711J43343J5967J03398K14597
15198B051544R0332l64556J324J72559M02854K88309K37501k44374k74849L01103
$$ plain form
15188 2661747 2930271 2863181 2614586 2759694 2741697 2953929 2987676 2672861 2754770 2642554
15178 2642554 2778401 2910443 3080253 3302904 3100882 3069228 3651152 3839963 3738094 3613837
15168 3613837 3737939 3643631 3856822 4214852 4515033 4793709 4684826 4831909 4962134 5258580
15158 5258580 5456343 5607426 5867734 5928395 5980741 6286104 6130398 6116719 6246740 6278655
15148 6278655 6650157 6920792 7207281 7545754 7753540 8012722 8163965 8771212 9410847
15139 9410847 9741417 9986224 10379969 10744618 11262803 12148621 12830761 12922326 13367797 14071476
15129 14071476 14463386 14542924 15235137 16415857 17354972 17659448 18021683 19062625 20346578
15120 20346578 21332057 21983265 22681826 23418633 24292439 25014753 25972902 26775746 27522610
$$ packed form
15188B661747K68524o7090k48595J45108j7997K12232L3747l14815Q1909j12216
15178B642554J35847J32042J69810K22651k02022l1654N81924J88811j01869j24257
15168C613837J24102r4308K13191L58030L00181K78676j08883J47083J30225K96446
15158E258580J97763J51083K60308O0661N2346L05363j55706j3679J30021L1915
15148F278655L71502K70635K86489L38473K07786K59182J51243O07247O39635
15139I410847L30570K44807L93745L64649N18185Q85818O82140R1565M45471P03679
15129A4071476L91910P9538O92213J180720R39115L04476L62235J040942J283953
15120B0346578R85479O51208O98561P36807Q73806P22314R58149Q02844P46864
$$ plain form
15111 27522610 28183844 28536078 29270615 30006072 30289285 30767333 30995543 31007248 30924770 30745562
15101 30745562 30603012 30657161 30409750 30109463 29952778 29241848 28615151 28305585 27770110
15092 27770110 26866965 25722694 24874689 24304824 23702402 23184849 22716031 22094153 21421290
15083 21421290 20540606 19144550 18469324 18129653 17534958 16606366 16146551 15558536 14884663
15074 14884663 14713569 14439316 13610166 12644122 12056993 11770223 11467427 11158227 10434389
15065 10434389 9966955 9698359 9116236 8227925 7519092 7518660 8178945 8359458 8196714 7887927
15055 7887927 7358087 6951692 6656455 6036720 5686678 5557508 5395639 5216551 5156134 4973060
15045 4973060 4795562 4613235 4461401 4265830 3806468 3989150 4003877 3770583 3745755 3809150
$$ packed form
15111B7522610O61234L52234P34537P35457K83213M78048K28210J1705q2478j79208
15101C0745562j42550N4149k47411l00287j56685p10930o26697l09566n35475
15092B7770110r03145j144271q48005n69865o02422n17553m68818o21878o72863
15083B1421290q80684j396056o75226l39671n94695r28592m59815n88015o73873
15074A4884663j71094k74253q29150r66044n87129k86770l02796l09200p23838
15065A0434389m67434k68596n82123q88311p08833m32O60285J80513j62744l08787
15055G887927n29840m06395k95237o19735l50042j29170j61869j79088o0417j83074
15045D973060j77498j82327j51834j95571m59362J82682J4727k33294k4828O3395
$$ plain form
15035 3809150 3966909 4068992 4052546 3624172 3451794 3246360 3261724 3292493 3284624 3069940
15025 3069940 3207608 3224784 2610384 2503630 2399085 2478538 2401412 2378944 2467012 2273268
15015 2273268 2223070 2014423 2059866 2279286 2103940 1828629 1645466 1699631 1819826 2124088
15005 2124088 2041893 1813350 1321353 1309077 1354099 1648740 1613769 1025489 1036370 1087523
14995 1087523 1267569 1251369 1517080 1437976 1469218 1762108 1862323 1871212 2152827 1828589
14985 1828589 1173329 967480 741685 599047 407974 711101 1195390 1377952 1060253
14976 1060253 764121 851437 796772 620270 722702 703301 788763 824910 830162 923146 922329
14965 922329 668409 551537 729252 1051503 1017939 651169 662866 838734 780672 726432
$$ packed form
15035C809150J57759J02083j6446m28374j72378k05434J5364L0769p869k14684
15025C069940J37668J7176o14400j06754j04545P9453p7126k2468Q8068j93744
15015B273268n0198k08647M5443K19420j75346k75311j83163N4165J20195L04262
15005B124088q2195k28543m91997j2276M5022K94641l4971n88280J0881N1153
14995A087523J80046j6200K65711p9104L1242K92890J00215Q889K81615l24238
14985A828589o55260k05849k25795j42638j91073L03127M84289J82562l17699
14976A060253k96132Q7316n4665j76502J02432j9401Q5462L6147N252R2984q17
14965I22329k53920j16872J77715L22251l3564l66770J1697J75868n8062n4240
$$ plain form
14955 726432 822634 858285 910818 533727 602171 564265 538704 476556 244300 470251 607146
14944 607146 441963 348019 414213 560531 555115 721475 649572 701161 853517 765924 1163177
14933 1163177 1023903 799692 800565 747734 745472 748591 488342 295395 345032 419727 488009
14922 488009 762257 834055 455138 334187 321234 337030 268327 559808 553276 526799 741493
14911 741493 1040293 1205150 1347862 1401022 993362 626276 406952 817723 1044368 544797
14901 544797 311125 335971 441763 598910 792608 494093 312051 301621 250043 294257
14891 294257 10254 -10809 84180 325436 357208 468372 719039 499920 312869 437914
14881 437914 193209 4733 386073 473903 460815 446745 485137 555923 233538 109010
$$ packed form
14955G26432R6202L5651N2533l77091O8444l7906k5561o2148k32256K25951J36895
14944F07146j65183r3944O6194J46318n416J66360p1903N1589J52356q7593L97253
14933A163177j39274k24211Q73n2831k262L119k60249j92947M9637P4695O8282
14922D88009K74248P1798l78917j20951j2953J5796o8703K91481o532k6477K14694
14911G41493K98800J64857J42712N3160m07660l67086k19324M10771K26645m99571
14901E44797k33672K4846J05792J57147J93698k98515j82042j0430n1578M4214
14891B94257k84003k1063R4989K41256L1772J11164K50667k19119j87051J25045
14881D37914k44705j88476L81340Q7830j3088j4070L8392P0786l22385j24528
$$ plain form
14871 109010 232061 440640 347724 325520 284058 426589 746786 416811 -39130 171188
14861 171188 202945 245947 409000 519649 629484 399027 216370 569339 775275 741454
14851 741454 574348 312453 224384 -224597 -378244 -212866 -121142 151564 511147 438175
14841 438175 706005 705205 403079 43461 163485 765833 768079 257287 145336 365249
14831 365249 509486 592531 702726 663342 554654 691673 706871 203567 -105385 127188
14821 127188 534334 656971 762001 630271 665103 799354 593857 346378 464211 547565
14811 547565 555348 420443 264658 674758 807295 481704 513291 348542 25907 -31338
14801 -31338 -106315 2960 66856 33774 -37462 -38292 -33945 -217181 -247878 54700 411123
$$ packed form
14871A09010J23051K08579r2916k2204m1462J42531L20197l29975m55941K10318
14861A71188L1757M3002J63053J10649J09835k30457j82657L52969K05936l3821
14851G41454j67106k61895q8069m48981j53647J65378R1724K72706L59583p2972
14841D38175K67830q00l02126l59618J20024O02348K246n10792j11951K19913
14831C65249J44237Q3045J10195l9384j08688J37019J5198n03304l08952K32573
14821A27188M07146J22637J05030j31730L4832J34251k05497k47479J17833Q3354
14811E47565P783j34905j55785M10100J32537l25591L1587j64749l22635n7245
14801c1338p4977J09275O3896l3082p1236q30M347j83236l0697L02578L56423
$$ plain form
14790 411123 508215 292017 -64339 -5704 321493 486528 310238 203391 172541 175974
14780 175974 205431 371835 189496 15750 66955 13369 150277 85840 83496 -83031 -165568
14769 -165568 -78028 46604 284249 355309 333235 382814 277688 33987 -48561 148783
14759 148783 193785 194078 266579 541523 541875 372756 343605 -162255 -617832 -653855 -334222
14748 -334222 75491 371237 587055 465677 251878 233832 185856 329243 373928 133111
14738 133111 -290597 -230612 8738 16964 -318301 -244877 70820 138767 181665 251821 10217
14727 10217 -69888 -127127 -19881 92237 359781 299008 169008 6176 231656 497132
14717 497132 346496 334209 21964 -108206 -209693 -261594 195990 158492 114111 37526
$$ packed form
14790D11123R7092k16198l56356N8635L27197J65035j76290j06847l0850L433
14780A75974K9457J66404j82339j73746N1205n3586J36908o4437k344j66527q2537
14769a65568Q7540J24632K37645P1060k2074M9579j05126k43701q2548J97344
14759A48783M5002K93P2501K74944L52j69119k9151n05860m55577l6023L19633
14748c34222M09713K95746K15818j21378k13799j8046m7976J43387M4685k40817
14738A33111m23708N9985K39350Q226l35265P3424L15697O7947M2898P0156k41604
14727A0217q0105n7239J07246J12118K67544o0773j30000j62832K25480K65476
14717D97132j50636j2287l12245j30170j01487n1901M57584l7498m4381p6585
$$ plain form
14707 37526 63033 64463 -21460 -77650 73594 11676 199 361263 314077 179561 237897
14696 237897 365901 550099 410419 346997 362208 109038 459852 516254 370467 737
14686 737 109518 228552 334644 257289 676558 747956 867117 797292 640433 898803 1113325
14675 1113325 1167376 733115 456640 272208 404543 197142 -121304 -224040 -373883 -636403
14665 -636403 -588274 -481351 -669326 -400625 -96986 -616 142780 33395 7370 4735
14655 4735 241986 395907 284998 121455 265528 185738 40632 -147945 -208822 301674
14645 301674 255289 183617 -69946 -223096 -59592 -140333 -90728 13606 148611 219944
14635 219944 438091 621705 695349 453619 -19960 -470420 -510204 -456881 -249250 -106771
$$ packed form
14707C7526K5507J430q5923n6190J51244o1918j1477L61064m7186j34516N8336
14696B37897J28004J84198j39680o3422J5211k53170L50814N6402j45787l69730
14686G37J08781J19034J06092p7355M19269P1398J19161o9825j56859K58370K14522
14675A113325N4051m34261k76475j84432J32335k07401l18446j02736j49843k62520
14665f36403M8129J06923j87975K68701L03639R6370J43396j09385k6025k635
14655D735K37251J53921j10909j63543J44073p9790j45106j88577o0877N10496
14645C01674m6385p1672k53563j53150J63504q0741M9605J04334J35005P1333
14635B19944K18147J83614P3644k41730m73579m50460l9784N3323K07631J42479
$$ plain form
14625 -106771 -182183 -78397 -76567 143794 26931 -43909 65344 -67419 49379 -152132
14615 -152132 -242626 73797 -34811 -58583 190514 56109 134745 200903 61736 157090
14605 157090 376071 293015 228221 217637 460695 409326 311166 289911 387407 353933 -204311
14594 -204311 -303365 -265219 -388981 -721653 -637041 -110142 2244 -194065 -195053 -113893 135664
14583 135664 399432 206368 -48245 -73268 -235508 -423781 -230493 -116 -234799 -769069
14573 -769069 -391170 156805 361323 125880 431832 259886 99642 76956 -86805 60611
14563 60611 292217 439845 681414 899844 840493 676582 609983 741905 707358 482705
14553 482705 368140 191812 920 -189795 -243026 -225317 22338 65504 -120567 -228995
$$ packed form
14625a06771p5412J03786J830K20361j16863p0840J09253j32763J16798k01511
14615a52132r0494L16423j08608k3772K49097j34405P8636O6158j39167R5354
14605A57090K18981q3056o4794j0584K43058n1369r8160k1255R7496l3474n58244
14594b04311r9054L8146j23762l32672Q4612N26899J12386j96309r88Q1160K49557
14583A35664K63768j93064k54613k5023j62240j88273J93288K30377k34683n34270
14573g69069L77899N47975K04518k35443L05952j71946j60244k2686j63761J47416
14563F0611K31606J47628K41569K18430n9351j63911o6599J31922l4547k24653
14553D82705j14565j76328j90892j90715n3231J7709K47655M3166j86071j08428
$$ plain form
14543 -228995 -177837 -62386 -81513 -148337 -20209 -109401 -266584 -208836 170714 524035
14533 524035 569872 688600 728632 684203 390431 77830 228843 288758 558225 249637
14523 249637 -39034 373429 636697 232645 40151 372285 175181 -208184 -59970 369187
14513 369187 312236 172708 177639 -58795 -168636 -107727 -302224 -588180 -292166 -100727
14503 -100727 -121232 -44231 114812 34045 269295 487166 353313 201313 197143 188490 399573
14492 399573 544592 108605 -222609 -495879 -389922 -126845 121369 227095 350062 231166
14482 231166 50839 282322 427625 460892 283337 -129174 1875 189948 228713 335751
14472 335751 -73491 -209710 -174439 -230694 -262818 15389 359212 259822 -17296 -246126
$$ packed form
14543b28995N1158J15451j9127o6824J28128q9192j57183N7748L79550L53321
14533E24035M5837J18728M0032m4429k93772l12601J51013N9915K69467l08588
14523B49637k88671M12463K63268m04052j92494L32134j97104l83365J48214M29157
14513C69187n6951j39528M931k36434j09841O0909j94497k85956K96014J91439
14503a00727k0505P7001J59043q0767K35250K17871j33853j52000m170q653K11083
14492C99573J45019m35987l31214k73270J05957K63077K48214J05726J22967j18896
14482B31166j80327K31483J45303L3267j77555m12511J31049J88073L8765J07038
14472C35751m09242j36219L5271n6255l2124K78207L43823r9390k77118k28830
$$ plain form
14462 -246126 -28471 -160994 -212223 -421793 -466424 -341182 -84194 -154542 -418566 -332586
14452 -332586 -2810 91893 -263670 -467211 -150200 -122128 -51735 -83046 34441 130752
14442 130752 -211263 -516232 -395647 -242104 -324082 -469883 -378635 -71030 -184576 -180883
14432 -180883 -19310 -81151 -134971 222462 32639 -154043 -181270 21789 99099 103838 54095
14421 54095 7553 -62445 -10292 22687 72070 -86984 -47852 23857 81999 174737 255170
14410 255170 538149 584340 554657 203739 65066 182934 76306 -31713 379800 796983
14400 796983 324821 114597 63244 -278027 83202 499048 572438 329003 143836 304527
14390 304527 190411 96812 -78868 1126 190603 212712 338349 395254 383115 424931 78851
$$ packed form
14462b46126K17655j32523n1229k09570m4631J25242K56988p0348k64024Q5980
14452c32586L29776R4703l55563k03541L17011K8072P0393l1311J17487R6311
14442A30752l42015l04969J20585J53543q1978j45801R1248L07605j13546L693
14432a80883J61573o1841n3820L57433j89823j86682k7227K03059P7310M739m9743
14421E4095m6542o9998N2153L2979M9383j59054L9132P1709N8142R2738Q0433
14410B55170K82979M6191k9683l50918j38673J17868j06628j08019M11513M17183
14400G96983m72162k10224n1353l41271L61229M15846P3390k43435j85167J60691
14390C04527j14116r3599j75680P9994J89477K2109J25637N6905j2139M1816l46080
$$ plain form
14379 78851 2424 -53848 176371 90096 -306895 -491385 -366774 -363120 -330044 -477543 -710455
14368 -710455 -622852 -248870 80543 307722 -26900 -106069 -134422 -242503 -425512 -360950
14358 -360950 -507161 -417728 -117004 -113 98394 -88928 -49458 -159624 -768280 -971644
14348 -971644 -260373 90920 77110 159773 63919 -221482 -371788 -632333 -358703 -149498
14338 -149498 -149034 -720 113450 300785 281002 29634 -82501 -160291 -191922 -295273 -182213
14327 -182213 115278 360980 187424 137572 335802 548392 466245 314079 238621 133845
14317 133845 -28439 19774 -95121 -331704 -489469 -704928 -892398 -496424 -88357 -239172
14307 -239172 -273491 -453626 -617939 -286875 -273612 220139 692545 697023 604916 364429
$$ packed form
14379G8851p6427n6272K30219q6275l96991j84490J24611L654L3076j47499k32912
14368g10455Q7603L73982L29413K27179l34622p9169k8353j08081j83009O4562
14358c60950j46211Q9433L00724J16891R8507j87322L9470j10166o08656k03364
14348i71644P11271L51293j3810Q2663r5854k85401j50306k60545K73630K09205
14338a49498M64J48314J14170J87335j9783k51368j12135p7790l1631j03351J13060
14327a82213K97491K45702j73556m9852J98230K12590q2147j52166p5458j04776
14317A33845j62284M8213j14895k36583j57765k15459j87470L95974M08067j50815
14307b39172l4319j80135j64313L31064J3263M93751M72406M478r2107k40487
$$ plain form
14297 364429 171582 261845 422744 397458 -208469 -263491 182039 418688 486315 130643
14287 130643 89887 -42873 43881 191559 153985 152458 337152 308096 48034 -226992 -166492
14276 -166492 -764 -177121 -87949 106242 180079 -138174 -310868 -351350 -121552 -39571
14266 -39571 -77810 32726 29297 247311 109457 78115 126184 64548 -163093 -56046 170503
14255 170503 202469 -95328 -231885 -289749 -455087 -319819 -94246 -30798 -81507 -142648
14245 -142648 -172390 -108302 -259549 -486208 -596127 -150670 -3400 83869 162547 49390
14235 49390 290553 410780 -27309 -180199 -99978 -149105 -466222 -791130 -580373 -81476
14225 -81476 210273 336174 552007 534630 392373 579909 538993 420149 328859 204538
$$ packed form
14297C64429j92847R0263J60899k5286o05927n5022M45530K36649O7627l55672
14287A30643m0756j32760Q6754J47678l7574j527J84694k9056k60062k75026O0500
14276a66492J65728j76357Q9172J94191P3837l18253j72694m0482K29798Q1981
14266c9571l8239J10536l429K18014j37854l1342M8069o1636k27641J07047K26549
14255A70503L1966k97797j36557n7864j65338J35268K25573O3448n0709o1141
14245a42648k9742O4088j51247k26659j09919M45457J47270Q7269P8678j13157
14235D9390K41163J20227m38089j52890Q0221m9127l17117l24908K10757M98897
14225h1476K91749J25901K15833j7377j42257J87536m0916j18844r1290j24321
$$ plain form
14215 204538 179773 -18636 -16303 49940 39213 129327 229861 -184603 -285515 -219334 -28211
14204 -28211 -267298 -185683 -185143 -229751 -322209 -498054 -560613 -478706 -290811 65641 378002
14193 378002 317754 -67223 -519037 -655085 -521874 -123395 131095 -6531 -303038 -243676
14183 -243676 -221926 -276052 -496989 -578272 -485307 -282130 208578 434104 216917 51463
14173 51463 388993 516817 221711 195698 237615 187588 121584 350401 444573 440395 217583
14162 217583 322525 246163 164501 156203 368004 112903 177723 309534 265337 136229 359980
14151 359980 275499 165885 188403 197313 50146 -259901 -332545 -234629 -145463 -76111 53278
14140 53278 238944 199516 -203861 -97685 82963 -75619 72554 181666 384362 530246
$$ packed form
14215B04538k4765j98409K333O6243j0727R0114J00534m14464j00912O6181J91123
14204b8211k39087Q1615N40m4608r2458j75845o2559Q1907J87895L56452L12361
14193C78002o0248l84977m51814j36048J33211L98479K54490j37626k96507N9362
14183b43676K1750n4126k20937q1283R2965K03177M90708K25526k17187j65454
14173E1463L37530J27824k95106k6013M1917n0027o6004K28817R4172m178k22812
14162B17583J04942p6362q1662q298K11801k55101O4820J31811m4197j29108K23751
14151C59980q4481j09614K2518Q910j47167l10047p2644R7916Q9166O9352J29389
14140E3278J85666l9428m03377J06176J80648j58582J48173J09112K02696J45884
$$ plain form
14130 530246 364927 330349 490700 114428 -351642 -122341 -68394 -289649 -348486 -263275
14120 -263275 -514825 -666095 193938 915268 1082598 765435 642002 374790 377260 141592
14110 141592 158863 162152 110930 -87412 38786 158230 148280 -351127 -311601 193949 355022
14099 355022 306737 382273 402808 236524 331257 339395 -170169 -302680 127973 54784 124904
14088 124904 -160724 -487975 -177004 -51130 -257211 -362680 -434870 -287823 51646 229085
14078 229085 266991 89549 218105 154354 -231393 -74034 416924 513357 604732 318852
14068 318852 397817 324699 436599 417917 242976 274283 462062 602173 603779 457435 95012
14057 95012 195765 108757 97154 179777 44506 112774 667117 768340 620119 894742
$$ packed form
14130E30246j65319l4578J60351l76272m66070K29301N3947k21255n8837Q5211
14120b63275k51550j51270Q60033P21330J67330l17163j23433k67212K470k35668
14110A41592J7271L289n1222j98342J26198J19444r950m99407L9526N05550J61073
14099C55022m8285P5536K0535j66284R4733Q138n09564j32511M30653p3189P0120
14088A24904k85628l27251L10971J25874k06081j05469p2190J47047L39469J77439
14078B29085L7906j77442J28556o3751l85747J57359M90958R6433R1375k85880
14068C18852P8965p3118J11900j8682j74941L1307J87779J40111J606j46344l62423
14057I5012J00753q7008j1603Q2623j35271O8268N54343J01223j48221K74623
$$ plain form
14047 894742 801835 618557 746564 429501 275509 416809 753672 467813 283375 179687
14037 179687 359345 124844 99729 88518 -139217 -201886 -45630 141893 392136 414741
14027 414741 531356 686383 342092 211425 627223 649543 652350 314895 270112 -106108
14017 -106108 -217386 8446 58223 78758 214451 310869 433370 437332 543293 203738
14007 203738 104761 280027 113618 144343 238910 528101 214009 -35650 -167151 -12613
13997 -12613 99073 25439 -271147 -364664 -128459 -89624 20635 -286390 -384982 -294959 -446904
13986 -446904 -494901 -560363 -441272 -258041 -188752 -14334 -184420 -280089 243802 137069
13976 137069 61971 -210851 -126584 497231 720326 458363 302540 442398 313120 -55246
$$ packed form
14047H94742r2907j83278J28007l17063j53992J41300L36863k85859j84438j03688
14037A79687J79658k34501k5115j1211k27735o2669J56256J87523K50243K2605
14027D14741J16615J55027l44291j30667M15798K2320K807l37455m4783l76220
14017a06108j11278K25832M9777K0535J35693R6418J22501L962J05961l39555
14007B03738r8977J75266j66409L0725R4567K89191l14092k49659j31501J54538
13997a2613J11686p3634k96586r3517K36205L8835J10259l07025r8592R0023j51945
13986d46904m7997o5462J19091J83231O9289J74418j70086r5669N23891j06733
13976A37069p5098k72822Q4267O23815K23095k61963j55823J39858j29278l68366
$$ plain form
13966 -55246 39286 49841 352835 394073 357704 -9967 240373 175028 126886 231410 123426
13955 123426 -32904 -194263 -237840 -100434 -92165 -50729 -29299 202464 602185 478811
13945 478811 638636 440168 326195 -25626 -194330 -231665 -254179 -34700 117425 -76521
13935 -76521 -18233 416607 257428 244184 250003 364506 689293 663898 229221 409741 411554
13924 411554 -163842 -703890 -1031569 -793562 -818551 -671777 -779326 -740876 -467576 -67883
13914 -67883 22248 -34073 448609 749804 318402 -322188 -251016 -186011 265071 392656
13904 392656 175851 176107 344909 581615 378223 204629 251275 81429 95994 216437
13894 216437 383766 335653 139643 -198102 -571561 -827735 -361590 -251620 -283408 -31781
$$ packed form
13966e5246R4532J0555L02994M1238l6369l67671K50340o5345m8142J04524j07984
13955A23426j56330j61359m3577J37406Q269M1436K1430K31763L99721j23374
13945D78811J59825j98468j13973l51821j68704l7335k2514K19479J52125j93946
13935g6521N8288M34840j59179j3244N819J14503L24787k5395m34677J80520J813
13924D11554n75396n40048l27679K38007k4989J46774j07549L8450K73300L99693
13914f7883R0131n6321M82682L01195m31402o40590P1172O5005M51082J27585
13904C92656k16805K56J68802K36706k03392j73594M6646j69846J4565J20443
13894B16437J67329m8113j96010l37745l73459k56174M66145J09970l1788K51627
$$ plain form
13884 -31781 -5301 34307 225037 168877 163677 179223 147158 -27852 297889 508472 323894
13873 323894 317190 303282 -62458 80465 41275 111945 -223722 -384721 -381445 -164561 164108
13862 164108 534845 576941 116429 -275580 -382428 -291217 -164358 13135 -115610 15076
13852 15076 78741 257834 272066 295823 323141 -61972 -87187 -142012 71356 298489 160510
13841 160510 162 362475 272430 10313 -287447 -381152 -163767 6717 299640 120205
13831 120205 220600 448739 539577 182874 151846 -6158 -147926 193213 -197907 -454520
13821 -454520 -553472 -366495 -241454 39936 260491 196072 -42258 -336503 -210773 41458
13811 41458 175381 68455 134177 412916 312940 16928 343912 540677 168632 364501
$$ packed form
13884c1781K6480L9608J90730n6160n200J5546l2065j75010L25741K10583j84578
13873C23894o704j3908l65740J42923l9190P0670l35667j60999L276K16884L28669
13862A64108L70737M2096m60512l92009j06848R1211J26859J77493j28745J30686
13852A5076O3665J79093J4232K3757K7318l85113k5215n4825K13368K27133j37979
13841A60510j60348L62313r0045k62117k97760r3705K17385J70484K92923j79435
13831A20205J00395K28139R0838l56703l1028j58004j41768L41139l91120k56613
13821d54520r8952J86977J25041K81390K20555o4419k38330k94245J25730K52231
13811D1458J33923j06926O5722K78739r9976k96012L26984J96765l72045J95869
$$ plain form
13801 364501 288872 225559 276258 36708 -271248 -122566 36027 165024 190631 424923
13791 424923 550309 191000 553861 422394 405102 66555 -163773 -70600 377957 606228
13781 606228 639388 694556 728931 337971 168350 -84814 -108147 11235 -436455 -659116
13771 -659116 -352617 -370908 -493097 -486535 -330974 -54613 -60647 -308786 -160443 123398
13761 123398 -40523 56109 -9006 53450 -225046 -467748 -501288 -306626 -114486 248351
13751 248351 42056 -288147 -203853 -255311 -372370 -311975 -423664 -348060 204190 168294
13741 168294 389201 685742 865919 694244 455437 139288 37780 152977 210390 356916
13731 356916 240977 -83891 -96554 -101382 263383 491002 329935 15462 -306261 -239428
$$ packed form
13801C64501p5629o3313N0699k39550l07956J48682J58593J28997K5607K34292
13791D24923J25386l59309L62861j31467j7292l38547k30328R3173M48557K28271
13781F06228L3160N5168L4375l90960j69621k53164k3333J19382m47690k22661
13771f59116L06499j8291j22189O562J55561K76361o034k48139J48343K83841
13761A23398j63921R6632o5115O2456k78496k42702l3540J94662J92140L62837
13751B48351k06295l30203Q4294n1458j17059O0395j11689P5604N52250l5896
13741A68294K20907K96541J80177j71675k38807l16149j01508J15197N7413J46526
13731C56916j15939l24868j2663m828L64765K27619j61067l14473l21723O6833
$$ plain form
13721 -239428 -250641 -286034 -277046 -137776 172201 416101 179459 112730 52230 366806 561897
13710 561897 673394 424937 36456 344786 643477 305415 -135456 293374 99008 318356
13700 318356 239802 334173 294962 245428 84623 -49078 64999 242434 -23317 -279675
13690 -279675 -300077 -540422 -472296 -671751 -596322 -213994 174143 312814 196795 210598
13680 210598 364856 219861 270374 309674 351071 622414 237343 207785 160247 89304 187327
13669 187327 95672 -44239 -198183 104364 145016 426238 322577 290144 102611 -62862
13659 -62862 15813 -30093 -31395 149453 213375 311004 241494 196504 175379 -265557 -448177
13648 -448177 -217482 25722 262684 265324 105716 -51063 -291427 -118083 69156 -267924
$$ packed form
13721b39428j1213l5393Q988J39270L09977K43900k36642o6729o0500L14576J95091
13710E61897J11497k48457l88481L08330K98691l38062m40871M28830j94366K19348
13700C18356p8554R4371l9211m9534j60805j33701J14077J77435k65751k56358
13690b79675k0402k40345O8126j99455P5429L82328L88137J38671j16019J3803
13680B10598J54258j44995N0513L9300M1397K71343l85071k9558m7538p0943R8023
13669A87327r1655j39911j53944L02547M0652K81222j03661l2433j87533j65473
13659f2862P8675m5906j302J80848O3922R7629o9510m4990k1125m40936j82620
13648d48177K30695K43204K36962K640j59608j56779k40364J73344J87239l37080
$$ plain form
13638 -267924 -247327 -119088 336679 230490 -71963 -368723 -445521 -415706 -449129 -255209
13628 -255209 -107649 246347 190217 -7106 -182484 -103714 -281234 -369019 -226320 -313480
13618 -313480 -300675 -46190 -285190 -285388 35536 -68863 30622 -65017 88156 13237 94793
13607 94793 100001 28043 91289 -199975 -384140 -84717 405158 619777 803884 659171
13597 659171 313716 -93059 76303 98469 153091 149987 48292 -217256 -613798 -535419
13587 -535419 -377845 -216454 197934 62911 -266828 74590 313475 499548 299901 123738
13577 123738 301460 86585 -292234 -328131 -323325 -4904 -72168 81744 349723 128419
13567 128419 9424 14105 -71237 -184810 -260547 167983 -104151 -341057 -147791 241854
$$ packed form
13638b67924K0597J28239M55767j06189l02453k96760p6798K9815l3423J93920
13628b55209J47560L53996n6130j97323j75378P8770j77520q7785J42699q7160
13618c13480J2805K54485k39000j98L20924j04399R9485r5639J53173p4919Q1556
13607I4793N208p1958O3246k91264j84165K99423M89875K14619J84107j44713
13597F59171l45455m06775J69362K2166N4622l104j01695k65548l96542P8379
13587e35419J57574J61391M14388j35023l29739L41418K38885J86073j99647j76163
13577A23738J77722k14875l78819l5897M806L18421o7264J53912K67979k21304
13567A28419j18995M681q5342j13573p5737M28530k72134k36906J93266L89645
$$ plain form
13557 241854 217433 240683 149333 289518 225484 363549 106010 -52538 -263923 -388396
13547 -388396 -119773 -14922 67551 116615 108890 327080 462142 337471 403928 249620
13537 249620 16821 93093 126614 -102206 -367220 -272694 -371950 -576242 -466184 -348747
13527 -348747 -314643 -196515 81514 285497 166938 -118654 -209282 -107744 97807 198367
13517 198367 196185 45460 -4432 199731 18276 -150063 -375480 -334200 3735 443523
13507 443523 474657 414833 -186907 -483994 -76831 -15076 -280688 -101398 267034 223810
13497 223810 136155 425 216170 124673 114109 89310 219222 323204 241700 229529 190778
13486 190778 271771 499423 703644 558773 313407 -105423 -382836 -446003 -259679 -30923
$$ packed form
13557B41854k4421K3250r1350J40185o4034J38065k57539j58548k11385j24473
13547c88396K68623J04851Q2473M9064p725K18190J35062j24671O6457j54308
13537B49620k32799P6272L3521k28820k65014R4526r9256k04292J10058J17437
13527c48747L4104J18128K78029K03983j18559k85592r0628J01538K05551J00560
13517A98367k182j50725m9892K04163j81455j68339k25417M1280L37935M39788
13507D43523L1134n9824o01740k97087M07163O1755k65612J79290L68432m3224
13497B23810q7655j35730K15745r1497j0564k4799J29912J03982q1504j2171l8751
13486A90778Q0993K27652K04221j44871k45366m18830k77413o3167J86324K28756
$$ plain form
13476 -30923 42364 65285 310814 295993 394726 446706 622626 570778 441924 449607 697203
13465 697203 469733 211685 27418 218967 431541 397856 279388 309473 466247 578983
13455 578983 652616 238358 -178426 -222701 54208 185491 -6243 177340 310358 93152
13445 93152 39421 -228517 -157796 -130375 179762 285051 201001 -39927 101519 182798 40389
13434 40389 -127953 -103594 -314441 -295110 -177416 -146103 -170967 -133190 -265696 -287731 -54088
13423 -54088 196175 175655 302157 542454 556496 430483 213180 242525 56410 -287319
13413 -287319 -545243 -703484 -623010 -615630 -639733 -548494 -243734 -258211 306254 419834 117312
13402 117312 -261159 -285158 125247 459036 425886 397281 -66903 -464426 -114260 -33153
$$ packed form
13476c0923P3287K2921K45529j4821R8733N1980J75920n1848j28854P683K47596
13465F97203k27470k58048j84267J91549K12574l3685j18468L0085J56774J12736
13455E78983P3633m14258m16784m4275K76909J31283j91734J83583J33018k17206
13445I3152n3731k67938P0721K7421L10137J05289q4050k40928J41446Q1279j42409
13434D0389j68342K4359k10847J9331J17694L1313k4864L7777j32506k2035K33643
13423e4088K50263k0520J26502K40297J4042j26013k17303K9345j86115l43729
13413b87319k57924j58241Q0474P380k4103R1239L04760j4477N64465J13580l02522
13402A17312l78471k3999M10405L33789l3150k8605m64184l97523L50166Q1107
$$ plain form
13392 -33153 -87623 -218991 -51717 -81153 2781 100842 49599 -342860 -492332 -265612 -138534
13381 -138534 -107567 -106347 -160307 -398544 -416630 -140797 -257048 -450736 -519916 -282275 119889
13370 119889 139110 125347 158042 323435 316643 196983 296706 40081 -290938 -68651 258423
13359 258423 84549 21813 345334 321862 374085 240492 317826 347021 78718 108566 157624
13348 157624 -114465 -163859 152951 123385 48568 3878 282031 184032 -162821 268835
13338 268835 341532 188115 -46534 -218745 -16205 333522 508689 398666 72789 -387836
13328 -387836 -657451 -606409 -628261 -376727 -239541 34770 295108 209865 -78169 -208083
13318 -208083 -374246 -81910 59065 -52258 173717 139125 -437339 -549424 -149715 -92118
$$ packed form
13392c3153n4470j31368J67274k9436Q3934R8061n1243l92459j49472K26720J27078
13381a38534L0967J220n3960k38237j8086K75833j16251j93688o9180K37641M02164
13370A19889J9221j3763L2695J65393o792j19660R9723k56625l31019K22287L27074
13359B58423j73874o2736L23521k3472N2223j33593P7334K9195k68303K9848M9058
13348A57624k72089m9394L16810k9566p4817m4690K78153r7999l46853M31656
13338B68835P2697j53417k34649j72211K02540L49727J75167j10023l25877m60625
13328c87836k69615N1042k1852K51534J37186K74311K60338q5243k88034j29914
13318b08083j66163K92336J40975j11323K25975l4592n76464j12085L99709N7597
$$ plain form
13308 -92118 162620 180764 310931 195841 198808 250024 420577 751068 557802 94497
13298 94497 -144766 -119119 -215376 -25420 141757 337986 481261 658636 471402 114043
13288 114043 -96546 -175665 -229879 -66730 -19453 -234677 -55008 407714 671840 619638
13278 619638 407288 -301026 -699010 -482373 -138075 -39041 135909 123551 232878 121391
13268 121391 -34220 -137733 -198105 -757404 -933174 -507194 -428004 -146860 -270057 -602109
13258 -602109 -561486 -285605 -140274 78149 74832 -24901 -76168 -19632 -214304 -434267 -614722
13247 -614722 -809655 -628240 -352554 -315204 -409934 -165333 -50732 -81771 -257167 -210832
13237 -210832 -507447 -563233 -227740 -488 136428 587208 900707 513260 84780 -80605
$$ packed form
13308i2118K54738J8144J30167j15090K967N1216J70553L30491j93266m63305
13298I4497k39263K5647r6257J89956J67177J96229J43275J77375j87234l57359
13288A14043k10589p9119n4214J63149M7277k15224J79669M62722K64126n2202
13278F19638k12350p08314l97984K16637L44298R9034J74950j2358J09327j11487
13268A21391j55611j03513o0372n59299j75770M25980P9190K81144j23197l32052
13258f02109M0623K75881J45331K18423l317r9733n1267N6536j94672k19963j80455
13247f14722j94933J81415K75686L7350r4730K44601J14601l1039j75396M6335
13237b10832k96615n5786L35493K27252J36916M50780L13499l87447m28480j65385
$$ plain form
13227 -80605 -155246 -80655 332717 368691 665142 821860 769350 211792 8920 171430
13217 171430 -84075 162942 305276 7201 -162969 -241836 -196706 161929 241505 -186257
13207 -186257 -404740 -317204 -331114 -235013 94188 308246 275938 -151906 -305944 -185743
13197 -185743 -54900 -192063 -11357 59394 -12048 -86482 -137983 -46989 -3155 176147 30834
13186 30834 -139822 -405100 -389150 -224422 -379026 -348050 -243397 -222249 -221579 -310934 310210
13175 310210 381139 -27056 -180669 -91178 -41250 -13612 -110883 -200877 -391641 -150825 -220362
13164 -220362 -526329 -300759 57064 -227167 -315892 -149290 -159382 -107212 166699 219601
13154 219601 137373 257208 321621 327453 379614 175154 16324 128961 385514 258352
$$ packed form
13227h0605p4641P4591M13372L5974K96451J56718n2510n57558k02872J62510
13217A71430k55505K47017J42334k98075j70170p8867M5130L58635P9576m27762
13207a86257k18483Q7536j3910R6101L29201K14058l2308m27844j54038J20201
13197a85743J30843j37163J80706P0751p1442p4434n1501R0994M3834J79302j45313
13186C0834j70656k65278J5950J64728j54604L0976J04653K1148O70q9355O21144
13175C10210P0929m08195j53613Q9491M9928K7638r7271q9994j90764K40816o9537
13164b20362l05967K25570L57823k84231q8725J66602j0092N2170K73911N2902
13154B19601q2228J19835O4413N832N2161k04460j58830J12637K56553j27162
$$ plain form
13144 258352 102330 266568 100214 15988 62561 431843 185062 -228343 -729486 -551449
13134 -551449 -229030 -27485 189051 -52939 -357496 -350564 -81996 39405 142297 131611
13124 131611 91006 203217 368528 333168 417442 627828 329029 221720 96993 75623
13114 75623 -4886 -196998 -272268 -253110 -537477 -745054 -577814 -221716 -43479 148591
13104 148591 90037 -56662 -330067 -241138 -274908 -384116 -150352 142830 57888 8629
$$ packed form
13144B58352j56022J64238j66354q4226M6573L69282k46781m13405n01143J78037
13134e51449L22419K01545K16536k41990l04557O932K68568J21401J02892j0686
13124A31611m0605J12211J65311l5360Q4274K10386k98799j07309j24727k1370
13114G5623q0509j92112p5270J9158k84367k07577J67240L56098J78237J92070
13104A48591n8554j46699k73405Q8929l3770j09208K33764K93182q4942m9259
$$ [...]
##END NTUPLES=NMR SPECTRUM
##END=
