##TITLE=Analysis number 317970
Compound Code sb 01807
Project Code adrs
Chemist Name matrix
##JCAMPDX= 6.0         $$ Bruker NMR JCAMP-DX V2.0
##DATA TYPE= NMR SPECTRUM
##DATA CLASS= NTUPLES
##ORIGIN= Bruker BioSpin GmbH
##OWNER= nmr
$$ XWIN-NMR		Version 3.5
$$ Thu Mar  9 10:09:49 2006 GMT Standard Time (UT+0h)  MAYBRIDGE\nmr@NMR_250MHZ
##.OBSERVE FREQUENCY= 250.131544655141
##.OBSERVE NUCLEUS= ^1H
##.ACQUISITION MODE= SIMULTANEOUS (DQD)
##.ACQUISITION SCHEME= undefined
##.AVERAGES= 16
##.DIGITISER RES= 18
##SPECTROMETER/DATA SYSTEM= dpx250
##.PULSE SEQUENCE= zg30
##.SOLVENT NAME= DMSO
##.SHIFT REFERENCE= (INTERNAL, DMSO, 0, 16.522)
##AUDIT TRAIL= $$ (NUMBER, WHEN, WHO, WHERE, WHAT)
$$ ##TITLE= Audit trail, XWIN-NMR		Version 3.5
$$ ##JCAMPDX= 5.01
$$ ##ORIGIN= Bruker BioSpin GmbH
$$ ##OWNER= nmr
$$ C:\u/data/dgb/nmr/ADRS/390/pdata/1/auditp.txt
$$ ##AUDIT TRAIL=  $$ (NUMBER, WHEN, WHO, WHERE, WHAT)
(   1,<2006-03-09 10:09:27.37 +000>,<MAYBRIDGE\nmr>,<NMR_250MHZ>,
      <created by zg, POWCHK disabled, PULCHK disabled
       configuration hash MD5:
       84 BC 41 DB A1 6E 1D 46 DA 25 12 A5 C1 ED C5 3A
       data hash MD5: 64K
       EC 79 AF 1B 07 DF D4 B2 01 54 79 14 30 E1 34 65>)
(   2,<2006-03-09 10:09:39.21 +000>,<MAYBRIDGE\nmr>,<NMR_250MHZ>,
      <Start of raw data processing
       ef LB = 0.3 FT_mod = 6 PKNL = 1 SI = 32K 
       data hash MD5: 32K
       0C 2C 0C A8 F0 F6 00 6A 40 0B 80 67 60 50 D9 53>)
(   3,<2006-03-09 10:09:40.93 +000>,<MAYBRIDGE\nmr>,<NMR_250MHZ>,
      <apk 
       data hash MD5: 32K
       5B C0 B5 7E A5 15 60 19 7C 74 F0 B3 2F 91 A3 FA>)
(   4,<2006-03-09 10:09:41.91 +000>,<MAYBRIDGE\nmr>,<NMR_250MHZ>,
      <abs ABSG = 5 
       data hash MD5: 32K
       96 6E EB 35 ED BF AD 9A 2D E7 88 C4 38 87 CB 73>)
$$ ##END=
$$ 
$$ hash MD5
$$ 78 E5 EE 8B 59 68 DE 9C DC 12 B0 17 96 B3 8E B4
##$RELAX= 
##$RELAX= 
##$RELAX= 
##$RELAX= 
##$RELAX= 
##$RELAX= 
##$RELAX= 
$$ Bruker specific parameters
$$ --------------------------
##$DU= <C:\u>
##$EXPNO= 390
##$NAME= <ADRS>
##$PROCNO= 1
##$TYPE= <nmr>
##$USER= <dgb>
##$AMP= (0..31)
100 100 100 100 100 100 100 100 100 100 100 100 100 100 100 100 100 100 
100 100 100 100 100 100 100 100 100 100 100 100 100 100 
##$AQSEQ= 0
##$AQ_mod= 3
##$AUNM= <au_zg>
##$AUTOPOS= <11 >
##$BF1= 250.13
##$BF2= 250.13
##$BF3= 250.13
##$BF4= 250.13
##$BF5= 500.13
##$BF6= 500.13
##$BF7= 500.13
##$BF8= 500.13
##$BYTORDA= 1
##$CFDGTYP= 0
##$CFRGTYP= 5
##$CHEMSTR= <none>
##$CNST= (0..31)
1 1 145 1 1 1 1 1 1 1 1 1 1 1 1 1 1 1 1 1 1 1 1 1 1 1 1 1 1 1 1 1 
##$CPDPRG= <>
##$CPDPRG1= <>
##$CPDPRG2= <>
##$CPDPRG3= <>
##$CPDPRG4= <mlev>
##$CPDPRG5= <mlev>
##$CPDPRG6= <mlev>
##$CPDPRG7= <mlev>
##$CPDPRG8= <mlev>
##$CPDPRGB= <>
##$CPDPRGT= <>
##$D= (0..31)
0 1 0 0 0 0 0 0 0 0.06 0 0 0 0 0 0 0.0002 0 0 0 0 0 0 0 0 0 0 0 0 0 0 
0 
##$DATE= 1141898966
##$DBL= (0..7)
120 120 120 120 120 120 120 120 
##$DBP= (0..7)
150 150 150 150 150 150 150 150 
##$DBP07= 0
##$DBPNAM0= <>
##$DBPNAM1= <>
##$DBPNAM2= <>
##$DBPNAM3= <>
$$ [...]
##$SUBNAM7= <"">
##$SUBNAM8= <"">
##$SUBNAM9= <"">
##$SW= 20.6930455092707
##$SWIBOX= (0..15)
0 0 3 0 0 0 0 0 0 0 0 0 0 0 0 0 
##$SW_h= 5175.983436853
##$TD= 65536
##$TD0= 1
##$TE= 294.16
##$TE2= 300
##$TE3= 300
##$TEG= 300
##$TL= (0..7)
0 120 120 120 120 120 120 120 
##$TP= (0..7)
150 150 150 150 150 150 150 150 
##$TP07= 0
##$TPNAME0= <>
##$TPNAME1= <>
##$TPNAME2= <>
##$TPNAME3= <>
##$TPNAME4= <>
##$TPNAME5= <>
##$TPNAME6= <>
##$TPNAME7= <>
##$TPOAL= (0..7)
0.5 0.5 0.5 0.5 0.5 0.5 0.5 0.5 
##$TPOFFS= (0..7)
0 0 0 0 0 0 0 0 
##$TUNHIN= 0
##$TUNHOUT= 0
##$TUNXOUT= 0
##$USERA1= <user>
##$USERA2= <user>
##$USERA3= <user>
##$USERA4= <user>
##$USERA5= <user>
##$V9= 5
##$VALIST= <valist>
##$VCLIST= <CCCCCCCCCCCCCCC>
##$VD= 0
##$VDLIST= <DDDDDDDDDDDDDDD>
##$VPLIST= <PPPPPPPPPPPPPPP>
##$VTLIST= <TTTTTTTTTTTTTTT>
##$WBST= 1024
##$WBSW= 4
##$XGAIN= (0..3)
0 0 0 0 
##$XL= 0
##$YL= 0
##$YMAX_a= 383993
##$YMIN_a= -506141
##$ZGOPTNS= <>
##$ZL1= 120
##$ZL2= 120
##$ZL3= 120
##$ZL4= 120
##$ABSF1= 16.522
##$ABSF2= -4.171173
##$ABSG= 5
##$ABSL= 3
##$ALPHA= 0
##$AQORDER= 0
##$ASSFAC= 0
##$ASSFACI= 0
##$ASSFACX= 0
##$ASSWID= 0
##$AUNMP= <proc_1d>
##$AZFE= 0.1
##$AZFW= 0.1
##$BCFW= 0
##$BC_mod= 0
##$BYTORDP= 0
##$COROFFS= 0
##$CY= 12.5
##$DATMOD= 1
##$DC= 0
##$DFILT= <>
##$DTYPP= 0
##$F1P= 14.0000005364418
##$F2P= -0.99999901652339
##$FCOR= 0.5
##$FTSIZE= 32768
##$FT_mod= 6
##$GAMMA= 0
##$GB= 0
##$INTBC= 1
##$INTSCL= 1
##$ISEN= 128
##$LB= 0.3
##$LEV0= 0
##$LPBIN= 0
##$MAXI= 10000
##$MC2= 0
##$MEAN= 0
##$ME_mod= 0
##$MI= 0
##$NCOEF= 0
##$NC_proc= -3
##$NLEV= 6
##$NOISF1= 0
##$NOISF2= 0
##$NSP= 0
##$NTH_PI= 0
##$NZP= 0
##$OFFSET= 16.522
##$PC= 1
##$PHC0= 160.0682
##$PHC1= 5.107888
##$PH_mod= 1
##$PKNL= yes
##$PPARMOD= 0
##$PSCAL= 4
##$PSIGN= 0
##$REVERSE= no
##$SF= 250.13
##$SI= 32768
##$SIGF1= 0
##$SIGF2= 0
##$SINO= 400
##$SIOLD= 32768
##$SREGLST= <1H.DMSO>
##$SSB= 0
##$STSI= 32768
##$STSR= 0
##$SW_p= 5175.98343685301
##$SYMM= 0
##$S_DEV= 0
##$TDeff= 65536
##$TDoff= 0
##$TI= <Analysis number 999999
Compound Code 99
Book Reference 9
Project Code 9>
##$TILT= no
##$TM1= 0
##$TM2= 0
##$TOPLEV= 0
##$USERP1= <user>
##$USERP2= <user>
##$USERP3= <user>
##$USERP4= <user>
##$USERP5= <user>
##$WDW= 1
##$XDIM= 32768
##$YMAX_p= 293814394
##$YMIN_p= -142667
$$ End of Bruker specific parameters
$$ ---------------------------------
##NTUPLES= NMR SPECTRUM
##VAR_NAME=  FREQUENCY,     SPECTRUM/REAL,   SPECTRUM/IMAG
##SYMBOL=    X,             R,               I
##VAR_TYPE=  INDEPENDENT,   DEPENDENT,       DEPENDENT
##VAR_FORM=  AFFN,          ASDF,            ASDF
##VAR_DIM=   32768,         32768,           32768
##UNITS=     HZ,            ARBITRARY UNITS, ARBITRARY UNITS
##FACTOR=    0.157963299565203, 1,           1
##FIRST=     4132.6476996994, 0,             0
##LAST=      -1043.33573715361, 0,           0
##MIN=       -1043.33573715361, -142667,     0
##MAX=       4132.6476996994, 293814394,     0
$$ Real data points
##PAGE= N=1
##DATA TABLE= (X++(R..R)), XYDATA
$$ [...]
18210A12189764R52174q95299O95715L261607L332303k29926n561610r348937
$$ 112189764 113141938 112246639 112942354 116203961 119536264 119306338 113744728 104395791
18202A04395791r989490q249661o195711n009984m917575n510468o254778o602568
$$ 104395791 94406301 86156640 79960929 74950945 70033370 64522902 58268124 51665556
18194E1665556o115150m734550k972843j838420j922538k791585l468579l312449
$$ 51665556 45550406 40815856 37843013 36004593 34082055 31290470 27821891 24509442
18186B4509442k522170j752652j414696j438207j546182j405707j032166n02531
$$ 24509442 21987272 20234620 18819924 17381717 15835535 14429828 13397662 12895131
18178A2895131J6806L69275M82910M50743N87750J074884J691851K105721J970733
$$ 12895131 12911937 13281212 13764122 14214865 14802615 15877499 17569350 19675071 21645804
18169B1645804J356535Q60200J054290J882305K788194L234771L167187K708471
$$ 21645804 23002339 23862539 24916829 26799134 29587328 32822099 35989286 38697757
18161C8697757K166280J834138J874355K639145L629552L839517K412920k79679
$$ 38697757 40864037 42698175 44572530 47211675 50841227 54680744 57093664 56813985
18153E6813985k461913k589268j057051J74753n82262l060424n429875n961804
$$ 56813985 54352072 51762804 50705753 50880506 50298244 47237820 41807945 35846141
18145C5846141m716771l140541k304073k407423k792373k921586k577215k165739
$$ 35846141 31129370 27988829 25684756 23277333 20484960 17563374 14986159 12820420
18137A2820420j710301j229810q37535n56374n05589o51968p67524p71117o44957
$$ 12820420 11110119 9880309 9042774 8486400 7980811 7328843 6561319 5790202 5145245
18128E145245m89996l44721l35448l83498l68841l25798l12941k56788j82557
$$ 5145245 4655249 4310528 3975080 3591582 3222741 2896943 2584002 2327214 2144657
18119B144657j54958j55552j46804j57801j23180j06522q3820o9541l8597n2517
$$ 2144657 1989699 1834147 1687343 1529542 1406362 1299840 1216020 1146479 1107882 1055365
18109A055365n7845n2390j8955L1446k006k788J3089l5249m1292l449m9472j0479
$$ 1055365 997520 945130 926175 957621 955615 952827 965916 930667 889375 885926 836454 825975
18097H25975p340n2540m1282m4890k8100J8829J7122m253r615J9410L0313L408
$$ 825975 818635 766095 724813 679923 651823 670652 687774 683521 673906 693316 723629 727037
18085G27037n446j3752N5316M5054j3492l0146r99j8114n3071o7477j0393K5889
$$ 727037 721591 707839 763155 808209 794717 764571 763572 745458 692387 624910 614517 640406
18073F40406n954n648l4179O905J1478j501m3000p269J2911J683k822k3961n731
$$ 640406 634452 628804 594625 601530 613008 611507 568507 561238 574149 575832 573010 549049 543318
18060E43318K9723J8352M4293R644k6798j3413M925J8887J2321j8062l7078k9263
$$ 543318 573041 591393 635686 645330 618532 605119 610044 628931 641252 623190 586112 556849
18048E56849k9595k9043r18p150k8908m1679k2758p537M349k9257j5055n370j2506
$$ 556849 527254 498211 497293 490143 461235 419556 396798 389261 393610 364353 349298 343928 331422
18035C31422J8912J4200J5875j707Q743l712L2258j2628p39O82j8919l056j018
$$ 331422 350334 364534 380409 378702 387445 383733 415991 403363 402624 403306 384387 381331 380313
18022C80313q747L0580J4963n276R57j3158j6881L8529J3581j7652j7407K493
$$ 380313 371566 402146 417109 411833 412790 399632 382751 421280 434861 417209 399802 402295
18010D02295J7059J4708J4569r276n7862k3402K5049L894L199m449N410k5278
$$ 402295 419354 434062 448631 439355 381493 358091 383140 387034 390233 385784 391194 365916
17998C65916o546l3174p232q837k521J374k442k9486k0501l4824j6991j6310j1417
$$ 365916 359370 326196 318964 310127 307606 308980 306538 277052 256551 221727 204736 188426 177009
17985A77009M626Q533k2293k4934L1696K3793k6277m886K7632J8778j7369k4172
$$ 177009 181635 190168 167875 142941 174637 198430 172153 167267 194899 213677 196308 172136
17973A72136o117J7690J6238J6412j2772k0418j4634K8311J9936J091j2914L550
$$ 172136 166019 183709 199947 216359 203587 183169 168535 196846 216782 217873 204959 208509
17961B08509O329l8311R411N256R479K5181k505R945L9052J9962k6580l2283q432
$$ 208509 214838 176527 185938 191194 200673 225854 223349 233294 272346 292308 265728 233445 225013
17948B25013o196J6858K7466k7704j1642k0753n8084m2913J7429j1200J0704j356
$$ 225013 218817 235675 263141 235437 223795 203042 144958 102045 119474 108274 118978 117622
17936A17622n743n063o601l7200j6360j195J4297J1965q490J6375j4468j657J9308
$$ 117622 111879 106816 100215 63015 46655 45460 59757 71722 63232 79607 65139 63482 82790
17923H2790Q829K3390L378J3121J4617k6542J0099M423m704j9189k5369j5823
$$ 82790 91619 115009 118387 131508 146125 119583 129682 134105 129401 110212 84843 69020
17911F9020L7696o443m4685l9952J3646Q172J9899N056j3169P21J3678j1185N238
$$ 69020 106716 100273 55588 15636 29282 37454 57353 62409 49240 49961 63639 52454 57692
17898E7692Q586O079K0006J9852j3206P60m161p038J2506r671k2234J6708p898
$$ 57692 66278 72357 92363 112215 99009 99769 95608 88570 101076 91405 69171 85879 77981
17885G7981l3276O004r317N063K2104J4283Q524j6875r872j414J132N505l3607
$$ 77981 44705 50709 41392 46455 68559 82842 91366 74491 64619 63205 64337 69842 36235
17872C6235j6579J449M6713j2128k2953K3785L1684J5388k760K5633l655l0160
$$ 36235 19656 21105 67818 55690 32737 56522 88206 103594 100834 126467 122812 92652
17860I2652k3798K698K0006m1361j307j7308K0046M7016r668j2427o86R596r629
$$ 92652 68854 71552 91558 50197 48890 31582 51628 98644 88976 76549 75863 85459 75830
17847G5830K1641n761j1489L2154P7969N1897j0642j1225M6777L9067O8240K6790
$$ 75830 97471 91710 80221 112375 190344 242241 231599 220374 267151 306218 374458 401248
17835D01248J0523K7493p934k9628l5830O93n2664l0155l880J2656K2317r507
$$ 401248 411771 439264 431330 401702 365872 366565 313901 283746 279866 292522 314839 305332
17823C05332M2395M1221K7311L7184L823k9658j5676j9907j3718r791k1140k3703
$$ 305332 347727 388948 416259 453443 457266 427608 411932 392025 378307 368516 347376 323673
17811C23673q434l1724L0449r03l3868m6976k5467q011j5360m4677M577k6842
$$ 323673 315239 283515 313964 313061 279193 232217 206750 198739 183379 138702 143279 116437
17799A16437k1864l8511J9419K2082L4322M5984K7638j6370j8446J6227k1507
$$ 116437 94573 56062 75481 97563 131885 177869 205507 189137 170691 186918 165411
17788A65411J6212n026j4601Q55k2391O847K2051N3733K9030K5203N1983L7448
$$ 165411 181623 176597 161996 162851 140460 147307 169358 223091 252121 277324 329307 366755
17776C66755p792M9773L8429j2681k6875J14P42k0857k0336j1038k1289Q444M384
$$ 366755 358963 408736 447165 434484 407609 407723 408465 387608 367272 356234 334945 343389 347773
17763C47773J7152p16o8342n8875n0320l3997j2507l2610l999m9083J9885J4671
$$ 347773 364925 364209 295867 236992 186672 152675 140168 107558 103559 54476 74361 89032
17751H9032K6053p76j9612j1180j0076m578n983P86k3743j8213n406K228r372
$$ 89032 115085 114309 94697 83517 73441 68863 62880 63666 39923 21710 16304 18532 9160
17738I160j2586j2416Q258J8272o584k1026k3399J6207Q581k3866P807L3382J1378
$$ 9160 -3426 -15842 -7584 10688 4104 -16922 -40321 -24114 -15533 -39399 -31592 1790 13168
17725A3168M011k665J098J8660K1827k474o891k0264K4951q158n169K9019M8890
$$ 13168 17179 14514 15612 34272 56099 53625 46734 26470 51421 43263 38094 67113 116003
17712A16003j6311N724n291j2443L1476O501L1528K9202l28k0369N6342M7574
$$ 116003 99692 105416 100125 87682 119158 125659 157187 186389 186061 165692 222034 269608
17700B69608R158l916K1393K1896L9927L2654K9746l8859k1216j8955j5077L0534
$$ 269608 278766 274850 296243 318139 358066 390720 420466 381607 360391 341436 326359 356893
17688C56893L0375J5190j1562l3535J926m1747l2059J7916L5347J2223k2064l8650
$$ 356893 387268 402458 390896 357361 359287 317540 285481 303397 338744 350967 328903 290253
17676B90253l0953l7893n668J3129m7640k6756k0169l1897L222L7814k1979l1495
$$ 290253 259300 221407 215739 228868 181228 154472 134303 102406 105628 143442 121463 89968
17664H9968j6672l192K3604P234j4929K8447J9816j1813O1j0689M2894J4295J2651
$$ 89968 73296 70104 93708 100942 86013 114460 134276 122463 122524 111835 154729 169024 181675
17651A81675K2239N253L043K0432K7333M9038R199O821J6223K0015J6607l5928
$$ 181675 203914 209167 212210 232642 259975 309013 318212 325033 341256 361271 377878 341950
17639C41950n117j1093l7622n6167l644P928K1124L3730J743n0581j8947M060
$$ 341950 336833 325740 288118 231951 228307 236235 257359 291089 292832 242251 223304 227364
17627B27364N444K4806p142k2097r571K4625l7397r294j283P842k1095j4012N411
$$ 227364 232808 257614 250472 228375 218804 243429 206032 196738 195455 203297 182202 168190 173601
17614A73601m0178p177J8856m2651j5517q696k1221L1336J8567k867m9615q581
$$ 173601 133423 126246 145102 102451 86934 78238 57017 88353 106920 104053 54438 45857
17602D5857J6462o2180m9092l2961J4978K8087J6731K3837j990p685O439M3332
$$ 45857 62319 139 -48953 -81914 -66936 -38849 -22118 1719 -271 -7956 -1517 41815
17590D1815J9708m716M174k693k7462Q44K367k8278M11l0950o817j6582j0347
$$ 41815 61523 56807 60981 58288 30826 31670 34037 5759 6170 -24780 -31597 -48179 -58526
17577e8526qM0133J8702K7202J6206R027J508r246K1458k9444k8165j3171K0967
$$ -58526 -58534 -18401 301 27503 43709 52736 54244 44998 66456 37012 8847 -4324 16643
17564A6643M5628k3619k4586l0074j7592J3454K6769K4705m656l5485m275j182
$$ 16643 62271 38652 14066 -16008 -33600 -20146 6623 31328 26672 -8813 -13088 -14270
17552a4270j5625n999L9454K7974j1854P203l768K696n879j3078n1207m9668K3474
$$ -14270 -29895 -35894 3560 31534 19680 26883 23115 25811 19932 6854 -44353 -94021 -70547
17539g0547L0577L3340N759J0915k8348o840K6695k2049J0141q843J4195K64J5337
$$ -70547 -39970 -6630 -871 10044 -18304 -25144 1551 -20498 -10357 -19200 -5005 -4741 10596
17526A0596L0800k1397j8153k4656j7464q351l987L5567Q194l438q408k6004O33
$$ 10596 41396 19999 1846 -22810 -40274 -48625 -52612 -17045 -8851 -12289 -20697 -46701 -46068
17513d6068M5177N58K0320J3730n048j6723M811K0295M680o826o536r1j3627k4162
$$ -46068 -891 -333 19987 33717 28669 11946 16757 37052 41732 34906 28370 28279 14652 -9510
17499i510p700M775M7837R901p371L298j0637J3121N7739K9388l7433k0776j271
$$ -9510 -17210 -12435 35402 45303 37932 41230 30593 43714 101453 130841 93408 72632 71361
17486G1361k898j8828M612O808m348j8390l7745j4667K2663K0027j6393l0724
$$ 71361 68463 49635 54247 61055 56707 38317 572 -14095 8568 28595 12202 -18522
17474a8522J176l112o404Q687k7879J0447j4254J8321J5047J7299J5683L3395
$$ -18522 -17346 -20458 -26862 -18175 -46054 -35607 -49861 -31540 -16493 806 16489 49884
17462D9884L118r212q864m1491k9466k8273k598M5081J8347R903j9114K2392K7406
$$ 49884 53002 43790 34926 -6565 -36031 -64304 -66902 -21821 -3474 6429 -12685 9707 37113
17449C7113k4353k4280P08J3162P372J2324L854N330l229j0885l0660j9300R015
$$ 37113 12760 -11520 -10812 2350 9722 22046 25900 31230 28001 17116 -13544 -32844 -23829
17436b3829K3946J2996P699J2999q524N393K1108J0122M434m677l5737j6990j3753
$$ -23829 117 13113 20812 33811 25287 30680 51788 61910 66344 61667 25930 8940 -4813
17423d813k9395j6148K9073J4685j3248k4194N499L6485j3025L4702M5828l0146
$$ -4813 -34208 -50356 -21283 -6598 -19846 -44040 -38541 -2056 -15081 19621 65449 35303
17411C5303r379K9122j997k0536m0324o410Q330k8309q993n762j5718J3256J6133
$$ 35303 25924 55046 53049 32513 -7811 -14221 -5891 -34200 -43193 -48955 -64673 -51417 -35284
17398c5284J2281K9200L1533j3319l3K4408k7404J8420K1221j3878j7717r334
$$ -35284 -23003 6197 37730 24411 24378 48786 21382 39802 61023 47145 29428 20094
17386B0094J2556j7909j909K9267L5821J6533k7478l5947l2975k4982m0122j0553
$$ 20094 32650 14741 12832 42099 77920 94453 66975 31028 -1947 -26929 -67051 -77604
17374g7604Q108J6364J8400p854j9132k6684K8817L0175j7818j0459J4673Q77
$$ -77604 -69496 -53132 -34732 -42586 -61718 -88402 -59585 -29410 -47228 -57687 -43014 -42137
17362d2137L187k0345k0561K3320K6055L3241k994j0255k174J4245J0885q335
$$ -42137 -38950 -59295 -79856 -56536 -30481 2760 -234 -10489 -12663 1582 12467 4132
17350D132J8849J6653M0449N84K6530Q012o7169l6162j3368L625K8493j6958L768
$$ 4132 22981 39634 80083 80667 107197 115209 48040 11878 -1490 2135 30628 13670 17438
17337A7438M022j6589P871R052p558l1041K2450J0549J193k5576J559J459P12
$$ 17438 21460 4871 12742 21794 14236 -16805 5645 16194 17387 -8189 -6630 -5171 -4459
17324d459m222j6367j8834J603n74L2193Q596K340J7316j2498p396L87m6827J6277
$$ -4459 -8681 -25048 -43882 -42279 -42853 -10660 -2064 276 17592 5094 -2302 -1915 -48742 -32465
17310c2465M3355j0132l306L012j1954j9752l2776K0320K4503J6929j3458l8033
$$ -32465 10890 758 -2548 464 -11490 -31242 -64018 -43698 -19195 -2266 -15724 -53757
17298e3757k8487K5645M218O611j6811j0800K02L9763p875K0567K4993K1026k3663
$$ -53757 -82244 -56599 -52381 -45770 -62581 -73381 -73179 -33416 -41291 -20724 4269 25295 1632
17285A632j2424J0331J657j5j8359l9933m4526k418J5294O1062P316p356L3586
$$ 1632 -10792 -461 1196 1181 -17178 -57111 -101637 -104055 -88761 -27699 -20383 -27739 5847
17272E847L400L3755l0058m0017j5675J0252q635J0744k269j0680K0041k3088
$$ 5847 9247 43002 12944 -27073 -42748 -32496 -41131 -30387 -32656 -43336 -23295 -46383
17260d6383M640Q932k0665K0507M4833J215k5437k456j879J7854K5919J0507L2086
$$ -46383 -41743 -32811 -53476 -32969 11864 13079 -12358 -14814 -16693 1161 27080 37587 69673
17247F9673k1083p90R229o261k2205m1065j6748j2163J9757l166j6128J7776K228
$$ 69673 48590 47800 57029 50768 28563 -12502 -29250 -41413 -21656 -24822 -40950 -23174 -20946
17234b0946L0364K5729N84n9192L401M6006l0743L305M394K0652m0528j2816O300
$$ -20946 9418 35147 35731 -23461 -20060 25946 -4797 -1492 2902 23554 -16974 -29790 -23490
17221b3490j4010l9620l0348P323j0284L8775J5893K4922K1427K002K3985K740
$$ -23490 -37500 -77120 -107468 -100145 -110429 -71654 -55761 -30839 -9412 -7410 16575 19315
17209A9315n3030J0686K4956l244k6252l0337J4852L6020j8596l06K1049J2695
$$ 19315 -33715 -23029 1927 -1317 -27569 -57906 -43054 -7034 -25630 -25936 -4887 7808
17197G808l990l6012l1183k1614L6841J6226J4075N4343L90n083k0426j6056j0566
$$ 7808 3818 -32194 -63377 -84991 -48150 -31924 -17849 36494 36884 31801 11375 -4681 -15247
17184a5247K4740l111j7021r113j0476P178K863l3778n077j6756K666K1098L195
$$ -15247 9493 6382 -10639 -19752 -30228 -23050 -20187 -53965 -59042 -75798 -73132 -52034 -48839
17171d8839J8867Q250N054o367K0902l2757k2040K7434J4474L5476J7242J0650
$$ -48839 -29972 -21722 -16668 -23035 -2133 -34890 -56930 -29496 -15022 20454 37696 48346
17159D8346j6760j8641j0086l3625k3379k0960K4062j6732l3885j1345M3330K3669
$$ 48346 31586 12945 2859 -30766 -54145 -75105 -51043 -67775 -101660 -113005 -69675 -46006
17147d6006L842k3608L8034K6687P911j2267l6339k1136j4238M844K6341k854
$$ -46006 -42164 -65772 -27738 -1051 6860 -5407 -41746 -62882 -77120 -72276 -45935 -48789
17135d8789j7000M542L3308Q646K1764k3804n0446L482M8989J6796P013j6118
$$ -48789 -65789 -61247 -27939 -19293 2471 -21333 -71779 -68297 -19308 -2512 4501 -11617
17123a1617P646K3853J114n333j7134l7738L9675K4245j0027k5669m5953M187
$$ -11617 -3971 19882 20996 15663 -1471 -39209 466 24711 14684 -10985 -56938 -52751
17111e2751L8154M192m1011l1081L3018K4185J5357J9463J3776K2586l5404m5342
$$ -52751 -14597 -10405 -51416 -82497 -49479 -25294 -9937 9526 23302 45888 10484 -34858
17099c4858j038K1139M507r703J4953J4454p497m857J5984k315j1850L2824j2478
$$ -34858 -35896 -14757 -10250 -19953 -5000 9454 1957 -2900 13084 10769 -1081 31743 19265
17086A9265O20N132m4720j9438M287J2621k3646J8244K8164j7354n771j0738r641
$$ 19265 19885 25017 -19703 -39141 -34854 -22233 -45879 -27635 529 -16825 -22596 -33334 -42975
17073d2975R359Q871P241k693J3517j6410J3553L6702r400k3923n075L3414J0903
$$ -42975 -33616 -24745 -17504 -20197 -6680 -23090 -9537 27165 17765 -6158 -11233 22181 33084
17060C3084l5164j7041j0904K2606P900l3305k564M4038J6914k08l2977O081J3943
$$ 33084 -2080 -19121 -30025 -7419 481 -32824 -35388 8650 25564 25356 -7621 -1540 12403
17047A2403L5004N761J3234k1938r322l4357k1219R014N857J5809m982k0544Q561
$$ 12403 47407 53168 66402 44464 35142 785 -20434 -11420 -5563 10246 5264 -15280 -6719
17034f719o862j6242J8389K6782l342j3745J3471J3994k7850j0851J3454L8333
$$ -6719 -13581 -29823 -11434 15348 12006 -1739 11732 25726 -2124 -12975 479 38812
17022C8812J142k5051k44L87n8404k0759l115M0315Q320J0022q936J7485J2799
$$ 38812 39954 14903 14659 15046 -43358 -64117 -67232 -26917 -18597 -8575 -17511 -26 12773
17009A2773j4046l0332j0371J6736J1664q23l1345k2167N623K8844j8715q471
$$ 12773 -1273 -31605 -41976 -25240 -13576 -14399 -45744 -67911 -62288 -33444 -52159 -60630
16997f0630K3820l769o849J8638K6199K9032K104J6132o05n5863o477K0739o393
$$ -60630 -36810 -40579 -47428 -28790 -2591 26441 28545 44677 44072 -11791 -18268 2471 -3922
16984c922j1676K0099O465M800R10J0770K3010m745q513L957l3279j8596j1128
$$ -3922 -15598 4501 10966 15766 16676 27446 50456 45711 37198 41155 7876 -10720 -21848
16971b1848k2846K681J4461K1953J3990m076j4040j8380j117J0544K0986J0519
$$ -21848 -44694 -42013 -27552 -5599 8391 4315 -9725 -28105 -29222 -18678 2308 12827
16959A2827j3107n452j6675k8222J8392n487l359J0231J705J1609O619m7768j9468
$$ 12827 -280 -5732 -22407 -50629 -32237 -37724 -41083 -30852 -29147 -17538 -10919 -58687 -78155
16946g8155N385L2634q180l6930L901o109M5909L3301k0690j9762j0286n245L0955
$$ -78155 -72770 -40136 -48316 -85246 -81345 -87454 -41545 -8244 -28934 -48696 -58982 -64227 -33272
16933c3272R377M04k315j5165j4042K4222K0878O567J4579K402k5829L7549Q307
$$ -33272 -23895 -23491 -25806 -40971 -55013 -30791 -9913 -3346 11233 13635 -12194 25355 33662
16920C3662p071k8r741P565J1276k1607k0803k4100k4901P782N3911K4755j6726
$$ 33662 26591 26563 16822 24387 35663 14056 -6747 -30847 -55748 -47966 5945 30700 13974
16907A3974j0502k2219K1007K0904j9499j7218R673P915j5138j0957J2969R062
$$ 13974 3472 -18747 2260 23164 3665 -13553 -3880 4035 -11103 -22060 -9091 -29
16895b9J213k5654R088M2949r844m1783K43L6008J8501j5500L0773M5081q334
$$ -29 1184 -24470 -15382 27567 17723 -24060 -23817 12191 30692 15192 45965 91046 82712
16882H2712l4436k4575L3232q467l0954j276q561O35R879O100k5727l0970m815
$$ 82712 48276 23701 56933 48466 17512 16236 7675 8310 18189 24289 -1438 -32408 -37223
16869c7223j1301J925L1260J4745k920Q035o127k5672J2791K2483K7957j2686
$$ -37223 -48524 -46599 -15339 -594 -3514 4521 -1606 -27278 -14487 7996 35953 23267
16857B3267n5997k7378O138J122k232J7769P532J6418M359O67j7930J2534J5549
$$ 23267 -32730 -60108 -53970 -52848 -55080 -37311 -29779 -13361 -9002 -8335 -26265 -13731 1818
16844A818L9553j9986j989Q150n931J2014j9852J2561j9042j1795j0659k2121
$$ 1818 41371 21385 19396 27546 21615 33629 13777 26338 7296 -4499 -15158 -37279
16832c7279K7538Q225l1843K9129K7662j5768r542K5840j7907l4682l4904O887
$$ -37279 -9741 -1516 -33359 -4230 23432 7664 -1878 23962 6055 -28627 -63531 -56644
16820e6644L8945L4508o945L9217K7474l3703j1978Q020o510O727j8280L049J5584
$$ -56644 -17699 16809 9864 49081 76555 42852 30874 38894 32384 39111 20831 23880 39464
16807C9464j3340K1657l7641l6474P715K9955N055n335j2607n075j6584K1242
$$ 39464 26124 47781 10140 -26334 -18619 11336 16391 11056 -1551 -6626 -23210 -1968
16795a968J3915J4634k4643k5429k9220o230J407J8089M0585n2556j6814K2248
$$ -1968 11947 26581 1938 -23491 -52711 -58941 -57534 -39445 1140 -51416 -68230 -45982
16783d5982J9751j651j1496J511K3396L5243L719m319n983j9537r086j3211k7031
$$ -45982 -26231 -27882 -39378 -37867 -14471 20772 24491 20172 14189 -5348 -14434 -27645 -54676
16770e4676k9167K5216J6279K7719K2134n60O141J4379j1188l3300j3232J4770
$$ -54676 -83843 -58627 -42348 -14629 7505 6945 13086 27465 16277 -17023 -30255 -15485
16758a5485O445J571l4587j7990K0243n610J2141K4007j9435l844R560J2129L807
$$ -15485 -9040 -7469 -42056 -60046 -39803 -45413 -33272 -9265 -28700 -32544 -22984 -10855 -7048
16745g048J5329n846Q946l6333m4249J748j5403l801L1768j0211M871K2239K0729
$$ -7048 8281 2435 11381 -24952 -69201 -67453 -82856 -86657 -54889 -65100 -60229 -37990 -17261
16732a7261k725o399J8992M094j2032R877r415K5853j121n744j4739k6156m9494
$$ -17261 -19986 -26385 -7393 -3299 -15331 -5454 -14869 10984 9863 4119 -10620 -36776 -86270
16719h6270K351M6933J2009N076l1738J192L512j249j781J0808l4127k5914L1657
$$ -86270 -83919 -36986 -24977 -19901 -51639 -50447 -46935 -48184 -49965 -39157 -73284 -99198 -67541
16706f7541L0645J2511k0914J1899K2999L641l917Q786j4398k4769m22J1601r335
$$ -67541 -36896 -24385 -45299 -33400 -10401 -6760 -10677 -1891 -16289 -41058 -41480 -29879 -39214
16693c9214O199p293k0235j1498J623k1955r222M3738P4959M2602J149k8439j8614
$$ -39214 -33015 -40308 -60543 -72041 -70418 -92373 -101595 -57857 17102 59704 60853 32414 13800
16680A3800l2890K9928o513J050J876j719j5622J0700J2005j0106j6197J5548
$$ 13800 -19090 10838 4325 5375 7251 5532 -10090 610 12615 2509 -13688 1860
16668A860j0728R74K676J1649p507q221J2212k6826R550j1591J4594J335J2102
$$ 1860 -8868 -7894 -5218 6431 -1076 -9297 2915 -23911 -14361 -25952 -11358 -10023 2079
16655B079M949L2441j6700m8794k044L2118J6465l208j2074j6685l0960l568J6895
$$ 2079 7028 39469 22769 -26025 -28069 4049 20514 17306 5232 -11453 -42413 -45981 -29086
16642b9086l808m0962J1540J8056K8814L6098o91O57j5154o642J2312j8083k3879
$$ -29086 -32894 -73856 -62316 -44260 -15446 20652 19961 20618 5464 -1178 11134 -6949 -30828
16629c0828M8760K2068Q197k8556l9984N153K3413K5190J6952p634J4733j4566
$$ -30828 17932 40000 48197 19641 -20343 -15190 8223 33413 50365 42731 57464 42898
16617D2898k9445k1398m863k2707J609K3858J0079J417j1440l6166j939L3113
$$ 42898 13453 -7945 -12808 -35515 -33906 -10048 31 1448 -9992 -46158 -48097 -14984
16605a4984K1679l5546j0552j9343K5152P981J2643k3821j0229j3510K158K7269
$$ -14984 6695 -28851 -39403 -58746 -33594 -25613 -12970 -36791 -47020 -60530 -58372 -31103
16593c1103L2682k0774k5111L4116J3872l8179j0439K6551J7458j4592m0798K4559
$$ -31103 1579 -19195 -44306 -10190 3682 -34497 -44936 -18385 -927 -15519 -56317 -31758
16581c1758M5845K7477j57j2598l2868K398j8354o3245k2404N7782N617j4544
$$ -31758 14087 41564 41407 28809 -4059 -1661 -20015 -83260 -105664 -47882 -42265 -56809
16569e6809j4935N586M0526L6523K1803l5058k2455j932K5408l32M704m90m363
$$ -56809 -71744 -66158 -25632 10891 32694 -2364 -24819 -26751 -1343 -1675 3029 2539 -1824
16556a824L2449l4684l1362o315r509J1397Q122K8432J5943j8763J4832k3594
$$ -1824 30625 -4059 -35421 -41736 -51245 -39848 -31726 -3294 12649 -6114 8718 -14876
16544a4876l6611K7327K1675J6187p741r872k5603o977m757K583M1279p391J3021
$$ -14876 -51487 -24160 -2485 13702 5961 -3911 -29514 -36491 -41248 -38665 2614 -4777 8244
16531H244J8815J8891k7521j7579j8177m278j9299O719j474j2149K124N6771L0723
$$ 8244 27059 45950 18429 850 -17327 -21605 -40904 -34185 -35659 -47808 -45684 11087 41810
16518D1810m167j7976J06k2645k1010K1702L5807o422j5164j4353j7917M9j4431
$$ 41810 37643 19667 19773 -2872 -23882 -2180 33627 27205 12041 -2312 -20229 -20180 -34611
16505c4611K7066K5064j7743k0006J9245l2163j13J6707K7693j1109l6348j0963
$$ -34611 -7545 17519 -224 -20230 -985 -33148 -33261 -16554 11139 30 -36318 -47281
16493d7281N0937L0773l0285n2457k6751k798R767L4710L4120J9939R867O065
$$ -47281 3656 34429 4144 -48313 -75064 -77862 -68095 -33385 735 20674 30541 36606
16481C6606k834k873l0169o796j8157L5667J4421j2008R884j7156k7490l8845
$$ 36606 33772 30899 730 -6066 -24223 11444 25865 13857 23741 6585 -20905 -59750
16469e9750p963J6862J4682L320K5283l6083J0062J1417L5638L8663j6903l9961
$$ -59750 -67713 -50851 -36169 -32849 -7566 -43649 -33587 -22170 13468 52131 35228 -4733
16457d733n0654R032J5235M4036L2758k0150l019l958j1532k8854m954Q313o331
$$ -4733 -55387 -46355 -31120 12916 45674 25524 22505 18547 7015 -21839 -26793 -18480 -24811
16444b4811j9301L768K9922o749J0171O626n477r138l0151q249O4488L0954K9441
$$ -24811 -44112 -40344 -10422 -17171 -7000 -374 -5851 -14989 -45140 -53389 11099 42053 71494
16431G1494q602n2276m7261K4540L2432M65r847j8190L535J7580k9323m7830M448
$$ 71494 62892 10616 -36645 -12105 20327 20792 10945 -7245 -3710 13870 -15453 -63283 -58835
16418e8835K4763M5470K489l5074L749K2920R308q112l8711j2442K7533J3461
$$ -58835 -34072 11398 13887 -21187 -17438 5482 14790 6678 -32033 -44475 -16942 -3481
16406c481J1288K681n6492l5747J8128j5818K228K4624K4268J1339p769r159n820
$$ -3481 7807 10488 -46004 -81751 -63623 -79441 -77213 -52589 -28321 -16982 -24751 -33910 -39730
16393c9730P749j6160k8330l264J671K8615K8919J1694J6421J000k2804k3124
$$ -39730 -31981 -48141 -76471 -79735 -78064 -49449 -20530 -8836 7585 8585 -14219 -37343
16381c7343l8301l224J3521J0638P59Q407K6209Q084K4775l027l5139L692M087
$$ -37343 -75644 -78868 -65347 -54709 -53950 -45543 -19334 -11250 13525 10498 -24641 -20949 -16862
16368a6862J4694K0998j6673J948p662K1496L4693L0764J737l8582l6873j2806
$$ -16862 -2168 18830 2157 4105 -3557 17939 52632 83396 85133 46551 9678 -3128
16356c128k3297J735R746k5144q593L4609m553l2315Q248M155K8095J7620Q205
$$ -3128 -26425 -24690 -14944 -40088 -48681 -14072 -18625 -50940 -42692 -38537 -10442 7178 15383
16343A5383l5071k7610K7478K1087j9842o6481k4756M7706Q9589o720j7290o459
$$ 15383 -19688 -47298 -19820 1267 -18575 -85056 -109812 -62106 27483 20763 3473 -2986
16331b986k0776J0942M800m880J0186Q596j2372j649J085l938k380J8871K3226
$$ -2986 -23762 -12820 -8020 -12900 -2714 5882 -6490 -8139 -7054 -10992 -13372 5499 28725
16318B8725J6281Q840j7595j7284l375k162l2676K4728j5263m923R383P610j2429
$$ 28725 45006 53846 36251 18967 15592 13430 -19246 5482 -9781 -14704 -5321 2289 -10140
16305a0140j416o881K9992m49k1676j6681L06p312j876j6024n073K6239K3674
$$ -10140 -11556 -18437 11555 11106 -10570 -27251 -26945 -34257 -36133 -52157 -57230 -30991 -7317
16292g317o690K444k4781N83K1817N888K2029o27k2117o161P825J8492J3418j4343
$$ -7317 -14007 -11563 -36344 -35761 -13944 -8056 13973 13346 -8771 -14932 -7107 11385 24803 10460
16278A0460j5879K675K8152j5138J0680J6036J3770k3852j0195L887K1572q660
$$ 10460 -5419 -2744 25408 10270 20950 36986 50756 26904 16709 20596 42168 33508
16266C3508J5628J1109j8360k8627j9937P356R198j1505j4431m128J3517J1422
$$ 33508 49136 60245 41885 13258 -6679 677 9875 -1630 -16061 -20189 -6672 4750
16254D750l8937j9386L1175K1608j0712M909K8744k3723k6809J1490J0655M3130
$$ 4750 -34187 -53573 -22398 -790 -11502 -6593 22151 -1572 -28381 -16891 -6236 36894
16242C6894J1741k2332k8311o197J4047o302R3J1266K221k0143m412N4968J1110
$$ 36894 48635 26303 -2008 -8205 5842 -460 -367 10899 13120 -7023 -11435 43533 54643
16229E4643l3159j676j7740j8526l570m2225k059K3695N3810j1130m1883N929
$$ 54643 21484 19808 2068 -16458 -20028 -62253 -64312 -40617 13193 2063 -39820 -33891
16217c3891R767r160k5509L284M6110K2313M057p100k6099k2966K5321N92K4383
$$ -33891 -24124 -33284 -58793 -55509 -9399 12914 16971 9871 -16228 -39194 -13873 -13281 11102
16204A1102o001m5986j2597J1201J8922P408O175R323K5578N42K6421m4528l5148
$$ 11102 5101 -40885 -53482 -42281 -23359 -15951 -9776 -453 25125 25667 52088 7560 -27588
16191b7588O171M7554J3010j6620J9430l587p002k569k4133j6934J3713L3915
$$ -27588 -21417 26137 39147 22527 41957 38370 31368 28799 4666 -12268 1445 35360
16179C5360J5880n1336k2304l2919k3125J4063L0727R615P789K4060k9873j4950
$$ 35360 51240 -96 -22400 -55319 -78444 -64381 -33654 -24039 -16250 7810 -22063 -37013
16167c7013j1426j3621J7189K7759k5467j1912q99J0366J572k0541L7002L9891
$$ -37013 -48439 -62060 -44871 -17112 -42579 -54491 -55390 -45024 -43452 -63993 -26991 12900
16155A2900K1393r215j3965J4350m6193j8316n0072k8861L5276K6915J972J281
$$ 12900 34293 25078 11113 25463 -20730 -39046 -89118 -117979 -82703 -55788 -53816 -52535
16143e2535m695J6658j6556J088j591R023L7941L9648q887n3464k7634J0218o333
$$ -52535 -57230 -40572 -57128 -56040 -57631 -48608 -10667 28981 20094 -33370 -61004 -50786 -57119
16130e7119M2001R399n904J1181M8m4956l8619n122R78K0080M1181N0849r496
$$ -57119 -15118 -5719 -11623 -442 -394 -45350 -83969 -89091 -88113 -68033 -26852 23997 14501
16117A4501j4976r590J5938R565J3160R767k2952j924K3420K413j480j8822j5495
$$ 14501 -475 -10065 5873 15438 28598 38365 15413 13489 36909 39322 37842 19020 3525
16104C525O34J441L68N132q248m6103K7662M1786p668k6181P480K2313q810j7019
$$ 3525 4159 5600 5968 11100 2852 -43251 -15589 26197 18529 -7652 -172 22141 13331 -3688
16090c688l7251j2463K6074J2030J8193P251J0519N739o127J1230j5895p7784
$$ -3688 -40939 -53402 -27328 -15298 2895 10146 20665 26404 20277 31507 15612 -62172
16078f2172L489L4155L686K3562k7814k4805R596j1992p885K3564M3058q368k3952
$$ -62172 -58683 -24528 -20842 2720 -25094 -49899 -40303 -52295 -60180 -36616 6442 -1926 -25878
16065b5878N840j3890l1027J3014K0741K3313J0701N897O284J5414j6987j7995
$$ -25878 -20038 -33928 -64955 -51941 -31200 -7887 2814 8711 14995 30409 13422 -4573
16053d573K3963K1401j4106k6456j1150l0669j6845J7318j0666j0206L5986R462
$$ -4573 19390 40791 26685 229 -10921 -41590 -58435 -41117 -51783 -61989 -26003 -16541
16041a6541J117R250j2723J984J5946L1518j6917J9652J5397M556m100l964l5869
$$ -16541 -15424 -6174 -18897 -16913 -967 30551 13634 33286 48683 53239 49139 45175 9306
16028I306O301J0305q396K2497J5009L3810j4351m6441l5066l1639l7355J5733
$$ 9306 15607 25912 17516 40013 55022 88832 74481 28040 -7026 -38665 -76020 -60287
16016f0287m233K5780J164K9619M0136k5530n8580p598J6960K4236N263P74J4728
$$ -60287 -64520 -38740 -37576 -7957 32179 6649 -51931 -59529 -42569 -18333 -13070 -12296 2432
16003B432Q77o868r822l9053j7773J1939O404Q763L3175l2362j2322N189P052
$$ 2432 3309 -3559 -13381 -52434 -70207 -58268 -51864 -43101 -9926 -42288 -54610 -49421 -42369
15990d2369K7084P812p843j9464l1518k261K0648M5835k5613M668K6523Q766L6108
$$ -42369 -15285 -7473 -15316 -34780 -66298 -68559 -47911 -2076 -27689 -23021 3502 12268 48376
15977D8376J8183m6264j0173j3323j5154j8204O783J979M521J2054k380k4281
$$ 48376 66559 20295 10122 -3201 -18355 -36559 -29776 -27797 -23276 -11222 -13602 -37883
15965c7883n0369l477K1074r583K9777L2956q462J6373Q68p769p34Q396l561P257
$$ -37883 -88252 -91729 -70655 -80238 -50461 -17505 -25967 -9594 -8726 -16495 -17229 -8833 -12394 -5137
15951e137K4377l2978m912K5177J529m9306J495R199K7782j4624k659L6292j3496
$$ -5137 19240 -13738 -18650 6527 8056 -41250 -39755 -30556 -2774 -17398 -20057 16235 2739
15938B739K4718M5177j3330m7448k9250K6650M0017j7666j0309P62j998J3717
$$ 2739 27457 72634 59304 11856 -17394 9256 49273 31607 21298 22060 20062 33779
15926C3779J1688m6571r40Q772j6367p5429R026J5327K9546J9004K2142J0144
$$ 33779 45467 -1104 -2044 6728 -9639 -85068 -76042 -60715 -31169 -12165 9977 20121
15914B0121p87j4280k8317r246k359K7071j5081j465j9027j563L6116K3217J0343
$$ 20121 19334 5054 -23263 -32509 -34868 -7797 -22878 -24343 -43370 -44933 -8817 14400 24743
15901B4743p532k2032j5792J983J2041l7431k3568K840K5534J279J6255O628J4820
$$ 24743 17211 -4821 -20613 -18630 -6589 -44020 -67588 -64748 -39214 -37935 -21680 -15052 -232
15888b32J5810k315j749K466N280J9099k3299j2887k4059K0118J6537J490N605
$$ -232 15578 13263 11514 13980 19260 38359 15060 2173 -21886 -1768 14769 16259 21864
15875B1864r290O948J477q224m1020l0948k2584n73M7103K2853q243n0929p294
$$ 21864 12574 19522 20999 12775 -28245 -59193 -81777 -82350 -35247 -12394 -20637 -71566 -78860
15862g8860j1401M699J2366K544N402K696J5966J1326J6264R1K2106n688M693
$$ -78860 -90261 -85562 -73196 -70652 -65250 -62554 -46588 -35262 -18998 -18907 3199 -2489 2204
15849B204j6809j9719M968K1194j9719p205k5033P851J6943J8490K5064q893j0458
$$ 2204 -14605 -34324 -29356 -8162 -27881 -35086 -60119 -52268 -35325 -16835 8229 -664 -11122
15836a1122J922M807R129P849q543j6454k0744N605j777J7230K1909k0927J1654
$$ -11122 -9200 -4393 4736 12585 4042 -12412 -33156 -27551 -29328 -12098 9811 -11116 538
15823E38k4531q293r758J4150J5485L320l3663l0876q655L4045M8972J2868M229
$$ 538 -23993 -32286 -42044 -27894 -12409 -9089 -42752 -73628 -82283 -48238 734 13602 17831
15810A7831j1437k8646r933O7K2026m38k1540j4885M222M091J6295K3191o527
$$ 17831 6394 -22252 -32185 -32118 -10092 -10530 -32070 -46955 -42733 -38642 -22347 844 -5683
15797e683k1305J5597J3502K8699j2289k5975l9735j8785j2898L5238J6661k6486
$$ -5683 -26988 -11391 2111 30810 18521 -7454 -47189 -65974 -78872 -43634 -26973 -53459
15785e3459L050J2868M638M7507j5537j1049J8373Q130k3553q114R730K3754j7646
$$ -53459 -50409 -37541 -32903 14604 -933 -11982 6391 14521 -9032 -17146 -7416 16338 -1308
15772a308j8602m04j4945R989K173j6059K2627m46K3575O100m0048j9095L1091
$$ -1308 -19910 -20314 -35259 -25270 -23097 -39156 -16529 -16975 6600 12700 -27348 -46443 -15352
15759a5352L882r933K1983K394J1273k20j6242o277R634j8605L710J7269M0968
$$ -15352 -11470 -21403 580 2974 14247 14027 -2215 -8492 1142 -17463 -13753 3516 44484
15746D4484J7258j1327O935n3550m0624J9795M0141R514j5463j1220r145j4785
$$ 44484 61742 50415 57350 3800 -36824 -17029 23112 32626 17163 5943 -3202 -17987
15734a7987j6939r049J6189K3663k321J8117K5960k0116k0832j2183J1631L5467
$$ -17987 -34926 -43975 -27786 -4123 -6444 11673 37633 17517 -3315 -15498 -3867 31600
15722C1600N241n963m9570j3039p954q552K6516L0096K807J1173j9064j8825k7996
$$ 31600 36841 30878 -18692 -31731 -39685 -48237 -21721 8375 11182 22355 3291 -15534 -43530
15709d3530j0765J9545K7129p029J243K619j4351k0587j9689J2989J1295K2731
$$ -43530 -54295 -34750 -7621 -14650 -13407 -10788 -25139 -45726 -65415 -52426 -41131 -18400
15697a8400j3305J5868J9669J5025m445N205J429k444l1999l2388K6653k359M6
$$ -18400 -31705 -15837 3832 18857 14412 19617 21046 18602 -13397 -45785 -19132 -21491 -21445
15684b1445j5259k412k1052R045L7712L4980n956j2008O426j2391J8723k9707
$$ -21445 -36704 -39116 -60168 -51123 -13411 21569 15613 3605 10031 -2360 16363 -13344
15672a3344k0554J5983K8374j0263J7212J5786K094l135j2804j356J3747K0416
$$ -13344 -33898 -17915 10459 196 17408 33194 35288 32153 19349 17993 31740 52156
15660E2156j0305q147k0871l6646l8322J5794j535L1613K1993r039q503J8406
$$ 52156 41851 33704 12833 -23813 -62135 -46341 -47876 -16263 5730 -3309 -11812 6594
15648F594j0467P152K9789L197j4025l2928m1731J994K8687K8976j9855j591m780
$$ 6594 -3873 3279 33068 36265 22240 -10688 -52419 -50425 -21738 7238 -12617 -14208 -18988
15635a8988N643L245j6585K01j3308M982J7108J2317k5565R086K6621n250j0566
$$ -18988 -13345 -10100 -26685 -26484 -39792 -34810 -17702 -5385 -30950 -21864 4757 -493 -11059
15622a1059N972J9697j1105j6830K0692n75k1249J3640m898K2402k3488N157j0069
$$ -11059 -5087 14610 3505 -13325 7367 6792 -14457 -817 -5715 16687 -6801 -1644 -11713
15609a1713l4426j754m722p654L1781L6562K150j6328o710k299m529j3608p283
$$ -11713 -46139 -47893 -52615 -60269 -28488 8074 10224 -6104 -12814 -15113 -19642 -33250 -40533
15596d0533p707J8470m444M4495L4805l3558Q970N125l7308L670J2897J4967k8417
$$ -40533 -48240 -29770 -34214 10281 45086 11528 20498 25623 -11685 -8015 4882 19849 -8568
15583h568j3969q698Q533K162K3122L9330M2780j5488j2056l0858l7584K8538
$$ -8568 -22537 -31235 -22702 -20540 2582 41912 84692 69204 57148 26290 -11294 17244
15571A7244J758K735k1767R24K5163m885l5785l8110k743K8613n927j9135K0671
$$ 17244 19002 21737 -30 894 26057 21172 -14613 -52723 -55466 -26853 -32780 -51915 -31244
15558c1244M2817L283j9545O841J0150k2057r280k4567k6354o653L3228q047J1607
$$ -31244 11573 14856 -4689 2152 12302 -9755 -19035 -43602 -69956 -76609 -43381 -51428 -39821
15545c9821J0557Q471p408o27J9282L8443J3656K018j4835m0616j8167l9134k942
$$ -39821 -29264 -20793 -28201 -28828 -9546 28897 42553 44571 29736 -10880 -29047 -68181 -71123
15532g1123K6358O489K3221J0786Q485m797k087J554k3463j5133K4235L9972J3316
$$ -71123 -44765 -38276 -15055 -4269 4216 -581 -2668 -1114 -24577 -39710 -15475 24497 37813
15519C7813J9367j0869n9457j1944l916J7668K3478N452j8682p326J6737J9740
$$ 37813 57180 46311 -13146 -25090 -29006 -11338 12140 17592 -1090 -8416 8321 28061
15507B8061k4493l5734K9466L7763j0303l9699n5817J2782J9895j0493K0042N8438
$$ 28061 3568 -32166 -2700 35063 24760 -14939 -70756 -57974 -38079 -48572 -28530 29908
15495B9908q249m381q024l0964j9128K8994M3991N060l3398k9845l8999j0318
$$ 29908 21659 17278 9254 -21710 -40838 -11844 32147 37207 3809 -26036 -65035 -75353
15483g5353N2214j9507k7985J456J2760M4507n385l1152L987n755j3663K821L2734
$$ -75353 -23139 -42646 -70631 -69175 -56415 -11908 -17293 -48445 -44458 -50213 -63876 -61055 -28321
15470b8321K8081K1063n33l6953O589j3874K2163M8754J6021k1492r641j5770
$$ -28321 -240 20823 20290 -16663 -10074 -23948 -1785 46969 62990 41498 31857 16087
15458A6087j1489j2164K705j7057j4473P473J0139N2475J7669k5854l9957k2417
$$ 16087 4598 -7566 -4861 -21918 -36391 -28918 -18779 33696 51365 25511 -14446 -36863
15446c6863n603l709R945J1405l5856k3576L7454J5675P520P564L7181l1901k3729
$$ -36863 -42466 -46175 -36230 -24825 -60681 -84257 -46803 -31128 -23608 -16044 21137 -10764 -34493
15433c4493j6090J5964M7289J7963o352j7672k1767k2657j4545J013L5971N031
$$ -34493 -50583 -34619 12670 30633 24281 6609 -15158 -37815 -52360 -51347 -15376 -10345
15421a0345j7691M799j3780P820L0475o089K0991J6180l0691k9644L4199K8020
$$ -10345 -28036 -23237 -37017 -29197 1278 -4811 16180 32360 1669 -27975 6224 34244
15409C4244j772K212N579J0467o532M652l127r892l0728M506L9270L538m6142
$$ 34244 32472 34684 40263 50730 44198 48850 45723 35831 5103 9609 48879 52417 6275
15396F275l3161J2539L4581Q015m424j5469R291K761M630L66J1290j224j3740
$$ 6275 -26886 -14347 20234 28249 23825 8356 17647 20408 25038 25404 36694 35470 21730
15383B1730j4192M141q004j0603J8059j8171J783J420k794l529Q416J1799J5237
$$ 21730 7538 11679 3675 -6928 11131 -7040 -5257 -3837 -6631 -10160 -1744 10055 25292
15370B5292l18j239M531l866j8180j7522L395P014k0258n216j7048J0066M9742
$$ 25292 24974 23735 28266 24400 6220 -11302 -7907 -893 -21151 -26367 -43415 -33349 16393
15357A6393j1043J612K0525k0204Q124j9630K8673p533j7515J5649N323M065m0124
$$ 16393 5350 6962 27487 7283 15407 -4223 24450 16917 -598 15051 20374 24439 -15685
15344a5685L0016L0345j0706l6992m44J0639L839j3772k5686k0938L2815J0471
$$ -15685 14331 44676 33970 -3022 -3466 7173 11012 -2760 -28446 -49384 -16569 -6098
15332f098k724O43J10J4914J831n84K7252L7202j2607j1799M440J5262l4818k5843
$$ -6098 -8822 -8179 -8069 6845 8676 8092 35344 72546 59939 48140 52580 67842 33024 7181
15318G181j2436L2586j8004J1589L135j4302Q808j5052j2118q286k1881k1058
$$ 7181 -5255 27331 9327 20916 24051 9749 18557 3505 -8613 -16899 -38780 -59838
15306e9838j2334j0716N224M5734J4796l91k668J9014J6503K6388j1561K3459
$$ -59838 -72172 -82888 -77664 -31930 -17134 -17525 -20193 -1179 15324 41712 30151 53610
15294E3610k9605J196j540k680l822J6753k46K3359j2667m7005j6251O693L993
$$ 53610 24005 25201 23661 20981 17159 33912 33666 57025 44358 -2647 -18898 -12205 -8212
15281h212k97K5644J5979k7130m0332O055L0692K6247O120O184o187j4129j1434
$$ -8212 -8509 17135 33114 5984 -34348 -28293 2399 28646 34766 40950 34763 20634 9200
15268I200m6777l2781o90J4761J7602K7635J1032K5216j3108k0562j6376J1557
$$ 9200 -37577 -70358 -71048 -56287 -38685 -11050 -18 25198 12090 -8472 -24848 -13291
15256a3291L0511L1460M185l6391j3886j4228j931J9622J1474J2876L1940k0040
$$ -13291 17220 48680 52865 16474 2588 -11640 -13571 6051 17525 30401 62341 42301
15244D2301m9610J0046L0561k9223j7170j4161q896j44M591m544J216K9694l0115
$$ 42301 -7309 2737 33298 4075 -13095 -27256 -36152 -36296 -31705 -36249 -35033 -5339 -35454
15231c5454k7293K5670J7723K725J6138K569j7717l8694K7650K9226m967J0043
$$ -35454 -62747 -37077 -19354 -16629 -491 2078 -15639 -54333 -26683 2543 -2424 7619
15219G619k1488j9526Q361O739J366o012L8214Q53n7639m555K9491K6715K9863
$$ 7619 -13869 -33395 -25034 -18295 -16929 -22941 15273 16126 -41513 -46068 -16577 10138 40001
15206D0001l1542j5634J0351J0374J7451J6458l7950l8551n889k4693J7622L6788
$$ 40001 8459 -7175 3176 13550 31001 47459 9509 -29042 -34931 -59624 -42002 -5214
15194e214k306L41J5944j964j1785j4501J2647J5556j2341j0435M920L5431j1963
$$ -5214 -7520 -7179 8765 6801 -4984 -19485 -6838 8718 -3623 -14058 -9138 26293 14330
15181A4330k3420m390M409j0863j909K9741k6234n328J3885j0532l028r23J0009
$$ 14330 -9090 -13480 -9071 -19934 -21843 7898 -18336 -23664 -9779 -20311 -23339 -24262 -14253
15168a4253N2049M9999K7826l2569n6860r706j3229k1461K029j3391l6018j0184
$$ -14253 37796 87795 115621 83052 26192 16486 3257 -18204 -16175 -29566 -65584 -75768
15156g5768N0886J2811k5075P592K0989L5984j9559O809q652j471p135k3650J3592
$$ -75768 -24882 -12071 -37146 -29554 -8565 27419 7860 14669 6017 4546 -2589 -26239 -12647
15143a2647L250j510K4335J3978j685J7943n829N855J4275n6863j2812L315J0056
$$ -12647 -9397 -10907 13428 27406 25721 43664 37835 43690 57965 1102 -11710 -8395 1661
15130A661L9063M936l0232k4655O624j7815L4729j4889l6696J4313J0809R178
$$ 1661 40724 45660 15428 -9227 -2603 -20418 14311 -578 -37274 -22961 -12152 -2974
15118b974m315J6869j8537J3959L0725K2589l5043k5716j6533k698M5967L163
$$ -2974 -7289 9580 -8957 5002 35727 58316 23273 -2443 -18976 -21674 24293 27456
15106B7456j7671n222j6992R153j4216j2115J278K5592K4674J1986m5913J7757
$$ 27456 9785 4563 -12429 -3276 -17492 -29607 -28329 -2737 21937 33923 -11990 5767
15094E767j0897L814j9368k7909P186J3990j771K4932k2790j6091J2892M4249
$$ 5767 -5130 -1316 -20684 -48593 -41407 -27417 -29188 -4256 -27046 -43137 -30245 14004
15082A4004L8397M833L789L1368j7584l5096k6883m9659M148K1176o661l831n960
$$ 14004 52401 57234 61023 92391 74807 39711 12828 -36831 -32683 -11507 -18168 -21999 -27959
15069b7959K5990L7489J7074j6714k6997l9198Q663o256N18L94L5615K2006p504
$$ -27959 -1969 35520 52594 35880 8883 -30315 -21652 -27908 -27390 -26996 8619 30625 23121
15056B3121r532L402k6391J4873K928k502J0387J3330k4790m799j073r693p837
$$ 23121 13589 16991 -9400 5473 8401 5899 16286 29616 4826 27 -1046 -10739 -18576
15043a8576N418K4372J6918R634l314k8165l356K0759j4129r756J23M8048L91
$$ -18576 -13158 11214 28132 37766 34452 6287 2931 23690 9561 -195 -72 47976 48367
15030D8367o577J4413k4146l0815P640K7230o909n793M921K3911r575L861J775
$$ 48367 41790 56203 32057 1242 8882 36112 29203 23410 28331 52242 42667 46528 48303
15017D8303J4800J1149J6853k5620l6895k2437j9171J2352J0101J25j7672k6094
$$ 48303 63103 74252 91105 65485 28590 6153 -13018 -666 9435 9560 -8112 -34206
15005c4206K6652L4602J3667j7727l8541J8136L0938m035P681L0548O777l6492
$$ -34206 -7554 27048 40715 22988 -15553 2583 33521 29486 37167 67715 74492 38000
14993C8000k9362p981K0986R998r796K6372M459q803j5456K7437q334J7388K413
$$ 38000 8638 657 21643 31641 21845 48217 52676 43873 28417 55854 47520 64908 67321
14980F7321J2466l803k2259r685J8824M646l59K195m100k7104k8971l2539q570
$$ 67321 79787 75984 53725 44040 62864 67510 67151 69346 65246 38142 9171 -23368 -31938
14967c1938K8626L8987l8635q188o918K2176M1214N188q509k4801o547K2180l933
$$ -31938 -3312 35675 -2960 -11148 -18066 4110 45324 50512 42003 17202 10655 32835 28902
14954B8902J3104o769K124m3705j2069J7889k4837j3620k075j2821L667N1875
$$ 28902 42006 35237 37361 -6344 -18413 -524 -25361 -38981 -41056 -53877 -50210 1665
14942A665Q598o270k5212M016J7917J3774k1498J1769j0354k5952j1627j4167
$$ 1665 10263 3993 -21219 -17203 714 14488 -7010 4759 -5595 -31547 -43174 -57341
14930e7341L4244M6761L024l1676R116R223k5982J6434k5195N9314n055k9349
$$ -57341 -23097 23664 26688 -4988 4128 13351 -12631 3803 -21392 37922 32867 3518
14918C518J483J3035N392J2363m523j5011Q940M945K0793K7927j3903m2043n7646
$$ 3518 5001 18036 23428 35791 31268 16257 25197 30142 50935 78862 64959 22916 -34730
14905c4730j2266R690L4269M283O647j790p405M116J163Q871J8780l0888k6706
$$ -34730 -46996 -37306 -3037 1246 7893 6103 -1302 2814 3977 12848 31628 740 -25966
14892b5966J4766J1570K109q787L377L076l761J9542k76k8485k5755J0758K5335
$$ -25966 -11200 370 2479 -6308 -2931 145 -3616 15926 15650 -12835 -38590 -27832 -2497
14879b497K7201L876j4390n7391j5031J5688P09j6158P267J4164L0182p223j7883
$$ -2497 24704 28580 14190 -43201 -58232 -42544 -41835 -57993 -50726 -36562 -6380 -13603 -31486
14866c1486j8514l102O04M282K8179J5402N91K1638P659j2327m5121m7167P78
$$ -31486 -50000 -53102 -52498 -48216 -20037 -4635 -4044 17594 25253 12926 -32195 -79362 -78584
14853g8584J7605m55o431M4860J0126k0058J9795n264J288J9797q249j4473k1847
$$ -78584 -60979 -61434 -67865 -23005 -12879 -32937 -13142 -18406 -17118 2679 -5570 -20043 -41890
14840d1890M947J5680M4583L2979O172k6335j4226j2467k4566k2602J1833M662
$$ -41890 -36943 -21263 23320 56299 62471 36136 21910 9443 -15123 -37725 -25892 -21230
14828b1230R05k6299k0306o891J413L6071J0449J4277L6743k92K864P79j236N257
$$ -21230 -20325 -46624 -66930 -73821 -72408 -36337 -25888 -11611 25132 24840 27704 28483 27247 32504
14814C2504j4202p069k2866j3622N356l3043J8937L9001J8659k354k7560r545
$$ 32504 18302 11233 -11633 -25255 -19899 -52942 -34005 4996 23655 21301 -6259 -15804
14802a5804J5296J7833L6710J4826J5011Q667j1805k1064N582j861P416O292j0249
$$ -15804 -508 17325 54035 68861 83872 92539 80734 59670 65252 63391 70807 77099 66850
14789F6850j8024J9944n1782n0294M2469J9964K3130L8625P783R614l2220o0455
$$ 66850 48826 68770 16988 -33306 9163 29127 52257 90882 98665 108279 76059 15604
14777A5604j6628R274J738r873j6660J3034L0537q849K5717j0826l0420j1342
$$ 15604 -1024 8250 9988 115 -16545 -3511 27026 18177 43894 33068 2648 -8694
14765h694R022l413R177K2911p657J4842J0678l223k7394j1596L4380j2552j4980
$$ -8694 328 -3085 6092 29003 21346 36188 46866 43643 16249 4653 39033 26481 11501
14752A1501q88K493K08o201M7303K6944n454l5032j2189k8133o610M143q67k0739
$$ 11501 10613 13106 13314 7113 54416 81360 75906 40874 28685 552 -6058 -1915 -2782 -23521
14738b3521k2016m007N4297J515k7710r183L98O812J8191K2079M087P542j0745
$$ -23521 -45537 -49544 4753 6268 -21442 -30625 -30227 -23415 -5224 16855 20942 28484 17739
14725A7739L5431L4252j4720R294n1890m9910k4884M2551J1672K8432J3763j5040
$$ 17739 53170 87422 72702 81996 30106 -19804 -44688 -2137 9535 37967 51730 36690
14713C6690l1663j3333Q854l492L452K6506m524k8063m2563L5967K7662k5473
$$ 36690 5027 -8306 548 -2944 508 27014 22490 -5573 -48136 -12169 15493 -9980
14701i980K2515L4556J0900m1148l1164P922M3593k18l2212j8886J8359Q436M357
$$ -9980 12535 47091 57991 16843 -14321 -6399 37194 36976 4764 -14122 4237 12673 17030
14688A7030K1515J0220l9524m236K5128j4859m9183j5283K2714K055p043k2687
$$ 17030 38545 48765 9241 5005 30133 15274 -33909 -49192 -26478 -24423 -31466 -54153
14676e4153q711K5682J6065L3513m239m40J6274K8891L8639m251o6816o048J7563
$$ -54153 -62864 -37182 -21117 12396 8157 7717 23991 52882 91521 87270 20454 14406 31969
14663C1969p778j5376K7623J8396l2472l3691J3506L3941j8194P607K1721l4655
$$ 31969 24191 8815 36438 54834 22362 -11329 2177 36118 17924 25531 47252 12597
14651A2597L724K140P127k1279j4501J1117K2809M3150k2156J2783l0624m3030
$$ 12597 16321 18461 25588 4309 -10192 925 23734 66884 44728 57511 26887 -16143
14639a6143j7399j8628J7677j8581K1734L4369J3042p968O653R021L74J5773K7785
$$ -16143 -33542 -52170 -34493 -53074 -31340 3029 16071 8103 14756 23777 24151 39924 67709
14626F7709J6427P227n4597k0747J8233r191J2303p590J6291j8020l4256n179
$$ 67709 84136 91363 36766 16019 34252 25061 37364 29774 46065 28045 -6211 -11390
14614a1390J3506K6172K2688O981Q504n979m3076k7369J8624m878J3910O482m072
$$ -11390 2116 28288 50976 57957 66461 60482 17406 -9963 8661 3783 17693 24175 20103
14601B0103l4587j6703J3744K1463q605N241K870J7110M3365J8960k3257O252
$$ 20103 -14484 -31187 -17443 4020 -4585 656 3526 20636 64001 82961 59704 65956
14589F5956P896k169j6941R796j2568j9916l1840m0472j792M0880N2394L0666
$$ 65956 73852 71683 54742 64538 51970 32054 214 -40258 -42050 -1170 51224 81890
14577H1890j5471j2915k8955m866J255L789j508M464j8284j3365K5472K3178o74
$$ 81890 66419 53504 24549 19683 20938 24727 23219 27683 9399 -3966 21506 44684 44010
14564D4010k6570K8077K4871j0893l2019j3350k5868J1165K6036j2157k529J21
$$ 44010 17440 45517 70388 59495 27476 14126 -11742 -577 25459 13302 10773 10894
14552A0894j78O226q362J2147j6386K5094K2100j3501o777j954o284l2125k0052
$$ 10894 10716 16942 8580 20727 4341 29435 51535 38034 31257 29303 23019 -9106 -29158
14539b9158Q736N0156K4599l88l6077j6769j613L6705J7372O047j1204k7312n2062
$$ -29158 -20422 29734 54333 53945 17868 1099 -514 36191 53563 59610 48406 21094 -30968
14526c0968l1569L2668M5735K3635k1932N637m648o565K860J8517r941J6510J402
$$ -30968 -62537 -29869 15866 39501 17569 23206 18558 11993 14853 33370 23429 39939 41341
14513D1341j6656k3454J6250j4518q055O972J9840N5552J3261n5141l6403j6258
$$ 41341 24685 1231 17481 2963 -5092 1880 21720 77272 90533 35392 -1011 -17269
14501a7269L826R011J7173j0868N895k4878J546q65R343L4016k1094l0321k9745
$$ -17269 -13443 -4432 12741 1873 7768 -17110 -15564 -16429 -7086 26930 5836 -24485 -54230
14488e4230K746M1231K1235q822J1450L639K5119l3447l689L0596q098m2681n6869
$$ -54230 -51484 -10253 10982 2160 13610 17249 42368 8921 5232 35828 27730 -14951 -71820
14475g1820J3101K1373N919j7106J4409L3872L9029q311l1350p713k514L658R713
$$ -71820 -58719 -37346 -31427 -48533 -34124 -252 38777 30466 -884 -8597 -11111 -7453 2260
14462B260O0339J6524k7544l564j3500P494m059p782J0793K6118k7721j4517K055
$$ 2260 62599 79123 51579 48015 34515 42009 37950 30168 40961 67079 39358 24841 26896
14449B6896O870N525k2202k0399p089J9557J8539k253m05Q772L7216k4213m7756
$$ 26896 33766 39291 17089 -3310 -10399 9158 27697 25444 25039 33811 71027 46814 -942
14436i42k7401j1247K3247O4883M7255k5512n2292k0353j740K2451j7335k7800
$$ -942 -28343 -39590 -16343 48540 95795 70283 17991 -2362 -4102 18349 1014 -26786
14424b6786q048r418L9552J985m1505k6604Q665K7985L5376j2510k9657K7324
$$ -26786 -34834 -44252 -4700 -2715 -44220 -70824 -62159 -34174 1202 -11308 -40965 -13641
14412a3641L2339r311K3608J5060k0353j0607L4820M0331K2548j0242k6665l5587
$$ -13641 18698 9387 32995 48055 27702 17095 51915 92246 114794 104552 77887 42300
14400D2300k8590M32j3552J975J5334K5424j8985k9475R342l910k7749K324Q036
$$ 42300 13710 14142 590 2565 17899 43323 24338 -5137 4205 295 -27454 -25130 -17094
14387a7094p709Q084L822r516J7346l99l0905l9863J3193K6195L7905J9594M962
$$ -17094 -24803 -16719 -12897 -22413 -5067 -5466 -36371 -76234 -63041 -36846 1059 20653 25615
14374B5615j4842l252K7678K1206n3405j8154J7598N856L787J3290J6549K2926
$$ 25615 10773 7521 35199 56405 3000 -15154 2444 8300 12087 25377 41926 64852
14362F4852k3865k1382k7896k4445k6982j8800K8006L85J0180J9208j9304j5997
$$ 64852 40987 19605 -8291 -32736 -59718 -78518 -50512 -50127 -39947 -20739 -40043 -56040
14350e6040K7145J5451K4836K623m6390j0895k1643q582J367M7308K2358K136
$$ -56040 -28895 -13444 11392 14015 -32375 -43270 -64913 -73495 -72128 -24820 -2462 -326
14338c26O204j5912N94l840J925M0527J6866l1923m2148K8587P3925P845n140
$$ -326 5878 -10034 -9440 -13280 -11355 29172 46038 14115 -28033 554 74479 82324 77184
14325G7184o004j5376k6107M014j9138J8599L0556j4346J4154m473j8440j5615
$$ 77184 71180 55804 29697 33711 14573 33172 63728 49382 63536 59063 40623 25008
14313B5008L086L3670K3530N980j9803k7973k8107k026L500K308J6530k638m0570
$$ 25008 28094 61764 85294 91274 71471 43498 15391 13365 16865 19173 35703 33065 -7505
14300g505j6098O901K6927J4734k0042J5629k9565k9262J1426N7331K5018J2140
$$ -7505 -23603 -16702 10225 24959 4917 20546 -9019 -38281 -26855 30476 55494 67634
14288F7634L5882k9939o5917O617l654K978N211j0747J8063K3116P590k6183k6384
$$ 67634 103516 73577 7660 14277 10623 13601 18812 8065 26128 49244 56834 30651 4267
14275D267l519P924q98L235n422j7879n638R660J6200L1188O1437K4740l7503
$$ 4267 748 8672 7774 11009 5587 -12292 -17930 -8270 7930 39118 100555 125295 87792
14262H7792k6142j294j0101K3295R743j667n785l2728N252Q285Q655K6405j5391
$$ 87792 61650 60356 50255 73550 83293 81626 75841 43113 48365 56650 65305 91710 76319
14249G6319j4755j2234m460j4076J9729m223m1251l2811j1821k8912N535J7542
$$ 76319 61564 49330 44870 30794 50523 46300 5049 -27762 -39583 -68495 -62960 -45418
14237d5418Q954K5386L9926K0170l9390o7948j7589J4268K9433j1954j4848J4573
$$ -45418 -36464 -11078 28848 49018 9628 -58320 -75909 -61641 -32208 -44162 -59010 -44437
14225d4437L9713J2739J3362J7041J8291J4905k6075K232o419k0459j3804J4826
$$ -44437 -4724 8015 21377 38418 56709 71614 45539 47771 41352 20893 7089 21915
14213B1915J6789j2883p94p479j2577J7226K4661J1694J0601J2633J2254J606
$$ 21915 38704 25821 25027 17548 4971 22197 46858 58552 69153 81786 94040 95646
14201I5646j6846k5175j3474k1346j3161O958k4346k1378L8880J9520J607k7735
$$ 95646 78800 53625 40151 18805 5644 12602 -11744 -33122 5758 25278 26885 -850
14189h50l86p599J0962K9098J707j6462m02J4803k5524m566J4672R462j9329q109
$$ -850 -1236 -8835 2127 31225 32932 16470 16068 30871 5347 781 15453 24915 5586 -2523
14175b523J5770o167N920r517J2163n291j3281Q739K3225q964J0638M2414l146
$$ -2523 13247 7080 13000 3483 15646 10355 -2926 5813 29038 20074 30712 73126 69980
14162F9980M581r102j3864l9421j7394m893j5300N177j0994n82L9232J6663J0462
$$ 69980 74561 65459 51595 12174 -5220 -10113 -25413 -20236 -31230 -31812 7420 24083 34545
14149C4545j4288j5637L4291L564n1582j9799r799M8889L6191q866l148J0796
$$ 34545 20257 4620 38911 42475 -9107 -28906 -38705 10184 46375 37509 34361 45157
14137D5157n264n589j539L1035L5437j8080k8802j6000J2047O258K0454K8677
$$ 45157 39893 34304 32765 63800 99237 81157 52355 36355 48402 54660 75114 103791
14125A03791j7356K674J710j3244m943r558k4824q595M317l940k625o384J2263
$$ 103791 86435 89109 90819 77575 72632 63074 38250 29655 33972 30032 27407 21023 33286
14112C3286K9271K2548j2973n626J4741r083K236k2117R421J6716N302P601m1274
$$ 33286 62557 85105 72132 66506 81247 72164 74400 52283 61704 78420 83722 91323 50049
14099E0049j5617k108J4797K1715k6069N005J2050m8014q591l1048j6231J0246
$$ 50049 34432 32324 47121 68836 42767 47772 59822 11808 3217 -27831 -44062 -33816
14087c3816R239J4632J6640M4897O918J755j2269j2493K0906J3372M964k0560
$$ -33816 -24577 -9945 6695 51592 58510 60265 47996 35503 56409 69781 74745 54185
14075E4185j5834k8746L5815L1819l1838k0494k5042m683J6564J6821l9479J0962
$$ 54185 38351 9605 45420 77239 45401 24907 -135 -4818 11746 28567 -10912 50
14063E0J3478L8953J4515k7953J6070j5578k1664J2187L4199J6111J1648j5741
$$ 50 13528 52481 66996 39043 55113 39535 17871 30058 64257 80368 92016 76275
14051G6275j7338k7651r421R804K2127J0125q913K449k897k1511R006J2977M244
$$ 76275 58937 31286 21865 31669 53796 63921 55008 57457 54560 33049 42055 55032 59276
14038E9276m816j1498K5459J6044j0183k2443l9528m3562k8738J3995N522K3234
$$ 59276 54460 42962 68421 84465 74282 51839 12311 -31251 -59989 -45994 -40472 -17238
14026a7238K3951j4456M077K8780N1504J4488q864o647k5591j1368k5521J520
$$ -17238 6713 -7743 -3666 25114 76618 91106 82242 75595 50004 38636 13115 14635
14014A4635k1761l301j3145Q014K9012k757l0804J42J1537J0304m601r669M341
$$ 14635 -7126 -10427 -23572 -15558 13454 10697 -20107 -19965 -8428 1876 -2725 -12394 -8053
14001h053N828L5306m976m9766k0330M3193L0244j5523L453k0387J9877j0279
$$ -8053 -2225 33081 28105 -21661 -41991 1202 31446 15923 19376 -1011 18866 8587
13989H587k3767k576M5949J657j0447J7219l7078k6970M530L161m011P357j4657
$$ 8587 -15180 -17756 28193 29850 19403 36622 -456 -27426 -22896 -19735 -23746 -16389 -31046
13976c1046o470J6356L6666K55k9804K2939J8844m401j698k5346l3760K0566J3992
$$ -31046 -37516 -21160 15506 15761 -14043 8896 27740 23339 21641 -3705 -37465 -16899 -2907
13963b907J9620n320k0521J2725J6870M2809j3687k7697k4697l6872N6919L4842
$$ -2907 16713 11393 -9128 3597 20467 63276 49589 21892 -2805 -39677 17242 52084
13951E2084J8688m9939P92K6237J1787M392K5j3148J0644K0621M979k3188k3790
$$ 52084 70772 20833 21625 47862 59649 64041 64066 50918 61562 82183 87162 63974 40184
13938D0184K550Q687j1397J725L5378J6375j9365m2781l601J6736k3729n621J8255
$$ 40184 42734 51421 40024 41749 77127 93502 74137 31356 27755 44491 20762 15141 33396
13925C3396K1463J4660K182J2413Q447M925j0797j9207J1709j5770m4063j2781
$$ 33396 54859 69519 71701 84114 92561 97486 86689 67482 79191 63421 19358 6577
13913F577q084K6995L4300l3690l9809j6188n964L1811K2282K4189M011N914k2166
$$ 6577 -1507 25488 59788 26098 -13711 -29899 -35863 -4052 18230 42419 46430 52344 30178
13900C0178r419k2338l96j5014n947j1722K1623K0637o790j543j2075k404l585
$$ 30178 20759 -1579 -1975 -16989 -22936 -34658 -13035 7602 812 -731 -12806 -15210 -18795
13887a8795M2295J2045j1555o375J3872N5175J1046k0566j8055q027N699r52k2180
$$ -18795 23500 35545 23990 17615 31487 86662 97708 77142 59087 51060 56759 55807 33627
13874C3627q834j1589M151J9105K4274Q605J3430M101l106L554l2016K896J9109
$$ 33627 24793 13204 17355 36460 60734 69339 82769 86870 83764 87318 55302 58198 77307
13861G7307J4268n897r492K5641k7103j2352k771j8118P841J5998K4675o101k4129
$$ 77307 91575 85678 76186 101827 74724 62372 59601 41483 49324 65322 89997 83896 59767
13848E9767k2498l3061K5841K1515j7278N2473J4452l2736j8979Q955n693q943
$$ 59767 37269 4208 30049 51564 34286 86759 101211 68475 49496 58451 52758 43815
13836D3815K8223L822k7739P581K4981J6424l256k6056L357j1388k7562k082n439
$$ 43815 72038 75860 48121 55702 80683 97107 93851 67795 71152 59764 32202 30120 24681
13823B4681L053K776j5430j3928L0889L6793K349p995l1386J3056K6386j4115
$$ 24681 27734 30510 15080 1152 32041 68834 71183 63188 31802 44858 71244 57129
13811E7129j4243Q557j023k304j8396k4683J3773K8353j4249p880Q983r581J1572
$$ 57129 42886 51443 50420 48116 29720 5037 18810 47163 32914 25034 34017 24436 36008
13798C6008k557m726J3856J753J9833J488j4403L3798L706k6107n289K5670o897
$$ 36008 33451 28725 42581 44334 64167 65655 51252 85050 88756 62649 57360 83030 76133
13785G6133j6190L064R622R437j6992j0768j6368J1634J6437K1823j2812m2191
$$ 76133 59943 63007 72629 82066 65074 54306 37938 49572 66009 87832 75020 32829
13773C2829J028K4005L90j8771J7624n093l633j7140K2216N2673R633k7482j3734
$$ 32829 33857 57862 58252 39481 57105 52012 48379 31239 53455 106128 115761 88279 74545
13760G4545K2335n3660k4121J2756o056L185K7441N219j9668K2947J1147J679
$$ 74545 96880 43220 19099 31855 25799 28984 56425 61644 41976 64923 76070 77749
13748G7749m129P670J6770K144n1699k1J4361L633K505r453R516j2705Q172M3233
$$ 77749 73620 81290 98060 100204 48505 48484 62845 66478 68983 59530 69046 56341 64513 107746
13734A07746L088k9817k4934L5118L1113o1424m5255Q758K467Q431L088L469J9013
$$ 107746 110834 81017 56083 91201 122314 60890 15635 24393 26860 35291 38379 41848 60861
13721F0861K2694k7381J1101Q139j3633k3025j681N1784K4432J664j5839q461
$$ 60861 83555 56174 67275 75414 61781 38756 37075 88859 113291 114955 99116 90655
13709I0655n418J851J2457L706k1302j1226J7647o494k0888p424M503k3952m000
$$ 90655 85237 87088 99545 103251 81949 70723 88370 81876 60988 53564 58067 34115 30115
13696C0115K2422L2594k3928j4292K0673O894j212j6068J3098K2057k2429k4340
$$ 30115 52537 85131 61203 46911 67584 74478 73266 57198 70296 92353 69924 45584
13684D5584j0474K3206P356J8358J907j0723k924p932R377R000j3580m763L2846
$$ 45584 35110 58316 65672 84030 85937 75214 72290 64358 73735 82735 69155 64392 97238
13671I7238k7934l9182j3400L9426L9684k7739r680l358M418M5102R277l3745
$$ 97238 69304 30122 16722 56148 95832 68093 58413 55055 59473 104575 113852 80107
13659H0107l6562P651J3266j8065J3973Q126q36L9647J3010l7733n7853k5360
$$ 80107 43545 51196 64462 46397 60370 68496 67660 107307 120317 82584 24731 -629
13647f29J97j0899J8136K4709K8247J4383K2758r033j0471l383j4072J5163k749
$$ -629 -432 -11331 6805 31514 59761 74144 96902 87869 77398 74015 59943 75106 72357
13634G2357M947j3449q814J650m411k0063J6711l718k2974n180k1162K7985N3696
$$ 72357 77304 63855 55041 56691 52280 32217 48928 45210 22236 17056 -4106 23879 77575
13621G7575J2197l5381J4960L9934L6541N82l7013m2590l8840K9114n707M2018
$$ 77575 89772 54391 69351 109285 145826 146408 109395 66805 27965 57079 51372 93390
13609I3390J800j3367k6056j5329K3279j3191j1492q192K247k8846P737L8990
$$ 93390 95190 81823 55767 40438 63717 50526 39034 30842 33089 4243 11980 50970
13597E0970P732J2590n5137k6726q616J3474K1069J2916j596K7958O5363J7920
$$ 50970 58702 71292 16155 -10571 -19187 -5713 15356 28272 26676 54634 119997 137917
13585A37917j2542j8062o266r895k3726l1287Q992J5205J1931j7800o716L5355
$$ 137917 125375 107313 101047 91152 67426 36139 45131 60336 72267 54467 47751 83106
13573H3106O0019j9904m4598k2813r13j0459j0147m470J248j8069o332J8294L5836
$$ 83106 143125 123221 78623 55810 54897 44438 34291 29821 31069 13000 6668 24962 60798
13560F0798p277J9199J0457l1136m501M6917m807n0278o990j0673j2422j128J670
$$ 60798 53521 72720 83177 52041 47540 94457 89650 39372 32382 21709 9287 8159 9829
13547I829j3558M4467K5858O609p016q44K6086j1316n1503m257M4357J3083J1212
$$ 9829 -3729 40738 66596 73205 66189 65345 91431 80115 28612 24355 68712 81795 93007
13534I3007K9373j021k291p150j6829L6273K672r776j2365k972l8996q144M980
$$ 93007 122380 121359 119068 111918 95089 131362 134034 124258 111893 108921 69925 61781 66761
13521F6761J892J7969R308L269m1879l6068K2294o973j9702R131O309K8254J1409
$$ 66761 68653 86622 95930 99199 57320 21252 43546 36573 16871 26002 32311 60565 71974
13508G1974M668K3684J3849k0937r113K0974K7081K6709j330Q46j4495R83m256
$$ 71974 76642 100326 114175 93238 84125 105099 132180 158889 157559 158405 143910 144893 140637
13495A40637l1999J1335m9841j2413J8979N875k9826k7208K9525J5834M055K0855
$$ 140637 108638 119973 70132 57719 76698 82573 52747 25539 55064 70898 74953 95808
13483I5808M748j6651K2054k6281l9828K0569O6071M063j1053Q677j9219j263
$$ 95808 100556 83905 105959 79678 39850 60419 126490 130553 119500 128177 108958 107695
13471A07695J7118k1045j142m628k7021K12R084j1379l2366l2824K0219M2874
$$ 107695 124813 103768 102626 97998 70977 71189 80273 68894 36528 3704 23923 66797
13459F6797K5782N082L2448j0707l1360l0805J655J6276r74j5343k1526j9040
$$ 66797 92579 97661 130109 119402 88042 57237 58892 75168 74194 58851 37325 18285
13447A8285J2634L8003K4110J3878K7839M53p814k2341j7698j6388l010L2839
$$ 18285 30919 68922 93032 106910 134749 135202 127388 105047 87349 70961 67951 100790
13435A00790j2210p758j6899K0387J8839K0760j2589m351k3359M228P743j3576
$$ 100790 88580 80822 63923 84310 103149 123909 111320 106969 83610 87838 95581 82005
13423H2005k2158M778J6403k186N67o162J3284J6921J3093m6166k7571J6620K7797
$$ 82005 59847 64625 81028 78842 79409 73247 86531 103452 116545 70379 42808 59428 87225
13410H7225R908J6749K7811j3306k8022k8404Q962K1679J847k8751l9298O026
$$ 87225 97133 113882 141693 128387 100365 71961 80923 102602 104449 75698 36400 42426
13398D2426j4497K3582J7151K6439j0468J1565q261L281K7837J6393j1398m8718
$$ 42426 27929 51511 68662 95101 84633 96198 87937 91218 119055 135448 124050 75332
13386G5332j8664q891J8930K4184N887J0930k8257K0408L7573j6926p1722J0045
$$ 75332 56668 47777 66707 90891 96778 107708 79451 99859 137432 120506 48784 58829
13374E8829N3360l7032j4949j7412p710J4268J3425J7593J8183j923J572K9803
$$ 58829 112189 75157 60208 42796 35086 49354 62779 80372 98555 96632 98204 128007
13362A28007K0692m2557j5063p84l942j6977j056J9795N1078K7172k4797j6965
$$ 128007 148699 106142 91079 90295 86353 69376 68320 88115 139193 166365 141568 124603
13350A24603k5818l4238r978L2180L3467P361j8216j2676L5208J2635j8033N743
$$ 124603 98785 64547 54569 86749 120216 127577 109361 96685 131893 144528 126495 132238
13338A32238j8092M504N171r963J5582j7049m6409k1263J3039K1250o619l2842
$$ 132238 114146 118650 123821 113858 129440 112391 65982 44719 57758 79008 72389 39547
13326C9547J9150N7561j5872m5734m763L9078J0911O840M32L4413K3258k7846
$$ 39547 58697 116258 100386 54652 49889 88967 99878 106718 107150 141563 164821 136975
13314A36975k2919J2398j7558j4768j1441M0709m92K7625J7130L4110k3225l2674
$$ 136975 114056 126454 108896 94128 82687 123396 122904 150529 167659 201769 178544 145870
13302A45870n26J4690n471j4528j8305j3991K144q553K017k944j7280o748j4101
$$ 145870 145344 160034 154563 140035 121730 107739 109883 101330 103347 100403 83123 76375 62274
13289F2274m103K6069k0297p185J5044l642N809K78j8399r605M1459o32k6117
$$ 62274 58171 84240 63943 56758 71802 68160 73969 74247 55848 46243 87702 87070 60953
13276F0953j1315J5145L6848k0870J9052K5559k2444M534J2849l48J4093l5892
$$ 60953 49638 64783 101631 80761 99813 125372 102928 107462 120311 119963 134056 98164
13264I8164r000K2358L8546j3266J911j2906l5942M741M9387K591k7672k7394
$$ 98164 89164 111522 150068 136802 138713 125807 89865 94606 143993 146584 118912 91518
13252I1518l4121q23m467K5602m182K1180J8257j4670J9657R212k7433o798K59
$$ 91518 57397 56574 52107 77709 73527 94707 112964 98294 117951 127163 99730 92932 93191
13239I3191j7638j9826K2237J7778R766K6395L0065M118j8502l0914k9484M904
$$ 93191 75553 55727 77964 95742 105508 131903 161968 166086 147584 116670 87186 92090
13227I2090j8602m665J2087J1314k2677J1133K3794M778m534J7988K5574K204
$$ 92090 73488 68823 80910 92224 69547 80680 104474 109252 104718 122706 148280 150484
13215A50484m9437l5264j714M106K762K8958j2730j7617k819q871j1774Q417K921
$$ 150484 101047 65783 64069 68175 70937 99895 87165 69548 66729 57858 46084 54501 57422
13202E7422M260M1974N3011j8869j3857O132m7569j1209J2460k482R594j8037
$$ 57422 61682 103656 156667 137798 123941 130073 82504 71295 83755 81273 90867 72830
13190G2830K77L1371J3391k8111K9972J1653L3079Q46j4479K734R360j5807k7658
$$ 72830 73107 104478 117869 89758 119730 131383 164462 165308 150829 153563 162923 147116 119458
13177A19458k7132j8523J2744k865j992J7810L443j2024J6101j8419j1141O514
$$ 119458 92326 73803 86547 83682 81690 99500 102943 90919 107020 88601 77460 83974
13165H3974k1772J8929N7476L6568M3901N3012M9405N0512K1350r350P376L192
$$ 83974 62202 81131 138607 175175 219076 272088 321493 372005 393355 384005 391381 394573
13153C94573o6699l9792j6451j7151m0153l1962l7609J2281M5822j6432l5116
$$ 394573 327874 288082 271631 254480 214327 182365 144756 157037 202859 186427 151311
13142A51311P4k7582J7221L5750K452J4628j9219k461L2030N579k5601j4797K7330
$$ 151311 151385 123803 141024 176774 179226 193854 174635 172174 204204 209783 184182 169385 196715
13129A96715l507k5246m4092J3267K4816M249J2519K7423O6571N1571M2907M2507
$$ 196715 193208 167962 123870 137137 161953 166202 178721 206144 272715 324286 367193 409700
13117D09700O2787L7723P4998J33565K24933K26219O4284p4097j86277k53151
$$ 409700 472487 510210 585208 718773 943706 1169925 1234209 1160112 973835 720684
13107G20684k32670j48288n7241n5206p192L441k292L279l0451J2210K1959M737
$$ 720684 488014 339726 282485 227279 220087 223528 221236 224515 194064 206274 228233 232970
13095B32970j6985m1984l5305j9847J7415j5300j1493M0720n327j8224r353K8642
$$ 232970 215985 174001 138696 118849 136264 120964 109471 150191 144864 126640 117287 145929
13083A45929O3922m400j5049n395R931j1819q0k1579j178M7635L5199J3346N3266
$$ 145929 209851 205451 190402 185007 194938 183119 183039 161460 160282 207917 243116 256462 309728
13070C09728Q9610J33111K02481K04790J42611l7546j73829j78285j84320j47710
$$ 309728 399338 532449 734930 939720 1082331 1044785 870956 692671 508351 360641
13060C60641p1180k2724k8521l6596K140o614j296j169m1994k7756n607l706r787
$$ 360641 289461 266737 238216 201620 203760 197146 195850 194681 152687 124931 119324 115618 105831
13047A05831P464K2451q725j9953K2304J4432q931k2196Q818K2810M4659r791
$$ 105831 113295 135746 127021 107068 129372 143804 134873 112677 121495 144305 188964 179173
13035A79173Q325N444j5334j1360R46J116L0590N130o177n648P1582L9190K9808
$$ 179173 187498 192942 177608 166248 167194 168310 198900 204030 197853 192205 263787 302977 332785
13022C32785R3732M0605j7322p0093n0018o5526m4206k8561J8228O636n5985k0864
$$ 332785 426517 467122 449800 379707 329689 264163 219957 191396 209624 216260 160275 139411
13010A39411j0684K4292n444k7049j3070J8188J4759k9628k766K1156J8323q565
$$ 139411 128727 153019 147575 120526 107456 125644 140403 110775 108009 129165 147488 138923
12998A38923K58N0518J1529l0382O968K8401j874k8152K8844J8330M636k7177
$$ 138923 139181 189699 201228 170846 177814 206215 204341 176189 205033 223363 227999 200822
12986B00822k6081k010O3072K2839k2363l3132j540p480l4552l40l9113j1358
$$ 200822 174741 172731 235803 258642 236279 203147 201607 194127 159575 159235 120122 108764
12974A08764K8193K7161L132Q430j3337P217K6556J9212K7721p628j6388k7991
$$ 108764 136957 164118 167250 175680 162343 169560 196116 215328 243049 235421 219033 191042
12962A91042J6307P996q335J18J3052O632l7894l4443K114J8569o307O015k3373
$$ 191042 207349 215345 207010 207128 220180 226812 188918 154475 156589 175158 168851 174866 151493
12949A51493k667L9630L5338r830j2832M051o63J9900o43Q142J7681J9909j5845
$$ 151493 148826 188456 223794 213964 201132 205183 204520 224420 223777 231919 249600 269509 253664
12936B53664k3748j1786j219K8949J8899m6817L7665J6557k771j459K3765j3746
$$ 253664 229916 218130 216911 245860 264759 217942 255607 272164 269393 267934 291699 277953
12924B77953j2751k6327k1983r262l487K8100l1643j4744r625K727N2165j7549
$$ 277953 265202 238875 216892 207630 204143 232243 200600 185856 176231 178958 231123 213574
12912B13574m4106q297K0141J807j0785M477M248p247p852k3165K8569M3539K4355
$$ 213574 169468 161171 181312 183119 172334 176811 181059 173812 165960 142795 171364 214903 239258
12899B39258K376N448l3846n6588m6601j9928j1321K7445L3387J4420J6617K1616
$$ 239258 241634 247082 213236 156648 110047 90119 78798 106243 139630 154050 170667 192283
12887A92283P333L5524J0700j1076O94p933k0737J8474K4895o97k7284o266K0483
$$ 192283 199616 235140 245840 234764 235458 227525 206788 225262 250157 249460 222176 215910 236393
12874B36393J2917j4870j946J3712l3032j9849O714J0745R126j1852r725O072
$$ 236393 249310 234440 232494 246206 213174 193325 200039 210784 219910 208058 198333 204405
12862B04405j2380o355p151J6365k7451k4583R772J1866L3000L5605M481j901
$$ 204405 192025 185670 178519 194884 167433 142850 152622 164488 197488 233093 237574 235673
12850B35673M663L5009K3968q422q554j4734j7019J4452J7260j8581J898K2683
$$ 235673 240336 275345 299313 290891 282337 267603 250584 265036 282296 263715 265613 288296
12838B88296o287k145k6393R707l3635l338L281j8843l4315k3322M972P803Q28
$$ 288296 282009 279864 253471 263178 229543 226205 229486 210643 176328 153006 157978 165781 166609
12825A66609j2136J7609L6705K9356m3846l9122l6698j591L7367K0801l434n141
$$ 166609 154473 172082 208787 238143 194297 155175 118477 116886 154253 175054 171620 166479
12813A66479Q161M3578r52j3646l1681J376K615L2477K2207L1724L4775J2069
$$ 166479 174640 218218 217266 203620 171939 173315 175930 208407 230614 262338 297113 309182
12801C09182l598j4598N889L6394m007P22J6097j390J5208M6926L3369J0754K9702
$$ 309182 305584 290986 296875 333269 329262 329984 346081 344691 359899 406825 440194 450948 480650
12788D80650O2631O1969R1877J37349J29163J21202J28407J15671O9674M5401
$$ 480650 543281 605250 697127 834476 963639 1084841 1213248 1328919 1398593 1443994
12778A443994L7480m8142j13122j36667j41327j21161j05164o3506m8942j24145
$$ 1443994 1481474 1433332 1320210 1183543 1042216 921055 815891 752385 703443 579298
12768E79298j08705p5223j9144k7932K0480L1987l5539l9798j4678J9742J7033
$$ 579298 470593 395370 376226 348294 368774 400761 365222 325424 310746 330488 347521
12757C47521L704j5017q391k6409j1339j3815o337M424J5734o366j2042J2408
$$ 347521 351225 336208 327817 301408 290069 276254 269917 274341 290075 283709 271667 284075
12745B84075J8211r435R291K520l0261m4457k8827J7071M2138K7671R219m993
$$ 284075 302286 292851 302142 304662 274401 229944 201117 218188 260326 287997 297216 292223
12733B92223j9323m2298R58O270k1872J4094N835J5256Q505J290L1871M7331N4520
$$ 292223 272900 230602 231560 237830 215958 230052 235887 251143 259648 260938 292809 340140 394660
12720C94660K787k2318j4375p383k9645n818k8390k5562J1557R361J547j3643
$$ 394660 397447 375129 360754 353371 323726 317908 289518 263956 275513 284874 286421 272778
12708B72778K1153N272J0231p556q388o892k6099p517K0718j7693K8826J6835
$$ 272778 293931 299203 309434 301878 293490 286598 260499 252982 273700 256007 284833 301668
12696C01668o376J740L6094k3673m7032J093L4759k4685J1414J54N06O1573J6518
$$ 301668 295292 297032 333126 309453 262421 263514 298273 273588 285002 285156 285662 347235 363753
12683C63753l702n294J9381r893o227m502J1583J7201L6603Q182l7713j766R449
$$ 363753 360051 354757 374138 364245 358018 353516 365099 382300 418903 427085 389372 387606 397055
12670C97055J1844j9738l6619k02L9317K6010m0030M8431L0931p241M29q322p270
$$ 397055 408899 389161 352542 352340 391657 417667 377637 426068 456999 449758 450187 441865 434595
12657D34595q182j5685l4748J8766N445j2224k6865M062q489K3742M319l8012
$$ 434595 426413 410728 375980 394746 400191 387967 361102 365164 356675 380417 384736 346724
12645C46724p2296j8672K7765J8800M5990K3906J0349J6186k2916J48Q640J7507
$$ 346724 274428 255756 283521 302321 348311 372217 382566 398752 375836 375984 384624 402131
12633D02131J3979K5488K9639J8589K7172K127J774j69k0452k2452k0945k3450
$$ 402131 416110 441598 471237 489826 516998 519125 520899 520730 500278 477826 456881 433431
12621D33431j8729j4563K9699r460n4062Q857J6082N300O694l2624j5219P092
$$ 433431 414702 400139 429838 420378 366316 375173 391255 396555 403249 370625 355406 362498
12609C62498j4976k071j65k0065j1838J1748J595L6937O799l6873J2442K6194
$$ 362498 347522 345451 345286 325221 313383 325131 326726 363663 370462 333589 346031 372225
12597C72225K5722L541j5222K0341k2094k7620K2171j3007l4181M407L6604K9498
$$ 372225 397947 401488 386266 406607 384513 356893 379064 366057 331876 336283 372887 402385
12585D02385J884m6286j9685J0015L5311R930k8176R48l5817o196q550m704m6123
$$ 402385 404269 357983 338298 348313 383624 393554 365378 366326 330509 324313 315763 311059 264936
12572B64936j5881l0878n9560l8750J4963M5526J0258p211J5939Q261J6367P3230
$$ 264936 249055 218177 158617 119867 134830 180356 190614 183403 199342 207603 223970 297200
12560B97200M6999K6550O0892P5972M5514k7870k4626M0142K5942J4782l859j4470
$$ 297200 344199 370749 431641 507613 553127 525257 500631 540773 566715 581497 577638 563168
12548E63168m9258k6672r74K2272k5931l0055Q115K3962M349N166k3276O530l9977
$$ 563168 513910 487238 486264 508536 482605 452550 460665 484627 488976 494142 470866 477396 437419
12535D37419q7947o7364n9577q3289p0495k7239j0515M9583J29925K09411K94833
$$ 437419 349472 282108 222531 139242 68747 41508 30993 80576 210501 419912 714745
12524G14745L40724K98454K76004K24206J46739K1769j13454j58592k29915k30542
$$ 714745 1055469 1353923 1629927 1854133 2000872 2022641 1909187 1750595 1520680 1290138
12514A290138j70164j59897j11475q9653r4086j17998o4682k3355N199j0930j5333
$$ 1290138 1119974 960077 848602 758949 664863 546865 482183 458828 464027 453097 437764
12503D37764P727l545L0885L2552N3758N0081Q0846N2053L6313N9649k204m2621
$$ 437764 445491 441946 472831 505383 559141 609222 690068 742121 778434 838083 835879 793258
12491G93258J9182J8655k0998l717J3452j0851n945j377P283J4803K579j7341
$$ 793258 812440 831095 810097 806380 819832 808981 803036 801659 808942 823745 826324 808983
12479H08983J8664R039J4984K0688P920q903P879l1376n543M9715J3464J0660
$$ 808983 827647 836686 851670 872358 880278 871375 879254 847878 842335 892050 905514 916174
12467I16174L3161J3817J326K7482j4469J1692K5773O326K2859j2901j372j3564
$$ 916174 949335 963152 964478 991960 977491 989183 1014956 1021282 1044141 1031240 1029868 1016304
12455A016304p258R81n463J8731L9779N6942P51O103L9905L9702M521K3712L1918
$$ 1016304 1009046 1010027 1004564 1023295 1063074 1120016 1120767 1126870 1166775 1206477 1210998 1234710 1266628
12442A266628J3474o392J6393N4169P6554N2100L3407J4072O2303P2386O0048
$$ 1266628 1280102 1273710 1290103 1344272 1420826 1472926 1506333 1520405 1582708 1655094 1715142
12431A715142O5759P0454O7773P7455L7024L7175O4138J172J8014K9338N1139
$$ 1715142 1780901 1851355 1919128 1996583 2033607 2070782 2134920 2136092 2154106 2183444 2234583
12420B234583P0975Q1954Q9820R1090J20726J40533R4516J54647J59009J51613
$$ 2234583 2305558 2387512 2477332 2568422 2689148 2829681 2924197 3078844 3237853 3389466
12410C389466J60499J67510K24702K75686K96280L34528L71542M61840N78359
$$ 3389466 3549965 3717475 3942177 4217863 4514143 4848671 5220213 5682053 6260412
12401F260412O47538P19116P94358Q47449Q88087R42998J050406J193562J222613
$$ 6260412 6907950 7627066 8421424 9268873 10156960 11099958 12150364 13343926 14566539
12392A4566539J258746J355543J426156J536450J796886K267616K886997L845128
$$ 14566539 15825285 17180828 18606984 20143434 21940320 24207936 27094933 30940061
12384C0940061N287409P384147J0450060J4804417K0675976K7443896L3710661
$$ 30940061 36227470 43611617 54061677 68866094 89542070 116985966 150696627
12377A50696627L7561043L7660147L3189193K3951187J0756197m152583j7958076
$$ 150696627 188257670 225917817 259107010 283058197 293814394 289661811 271703735
12370B71703735k8476108l4683727l6486711l4291083k9169600k2856662j6997814
$$ 271703735 243227627 208543900 172057189 137766106 108596506 85739844 68742030
12363F8742030j2406326r084285o751773n100310l907038l051075k480991k131456
$$ 68742030 56335704 47251419 40499646 35399336 31492298 28441223 25960232 23828776
12355B3828776j880520j723037j611811j519520j391329j240099j102817r79323
$$ 23828776 21948256 20225219 18613408 17093888 15702559 14462460 13359643 12380320
12347A2380320r10908q14490p81560p53200p18480p17835o01159n38956n13746
$$ 12380320 11469412 10654922 9873362 9120162 8401682 7683847 7082688 6543732 6029986
12338F029986l92073l46428k89299k86646k73353k41589j97719k00438j54872
$$ 6029986 5637913 5291485 5002186 4715540 4442187 4200598 4002879 3802441 3647569
12329C647569j72810j41582j33904j12150j15137j35068j31414j06089j05756
$$ 3647569 3474759 3333177 3199273 3087123 2971986 2836918 2705504 2599415 2493659
12320B493659j11264j00701j06164j06819j21559j00209l3298l8700p1422q1172
$$ 2493659 2382395 2281694 2175530 2068711 1947152 1846943 1813645 1774945 1703523 1622351
12310A622351l3237l0196j7094l3613k8578j7539k1479n8237j494n9078m3855
$$ 1622351 1589114 1558918 1541824 1508211 1479633 1462094 1440615 1382378 1380884 1321806 1277951
12299A277951m2269r524q935J3247m2680k7466n725m843j4588o3287l9130K6690
$$ 1277951 1235682 1226158 1217223 1230470 1187790 1160324 1154599 1149756 1135168 1071881 1032751 1059441
12287A059441L0374j7860m9303k9535k9512k7761j2773k430l64j6958j7344p72
$$ 1059441 1089815 1071955 1022652 993117 963605 935844 923071 920641 920277 903319 885975 885203
12275H85203K2941Q852K0223J4015J0203k0908j947J6085l1775k0644k2583l4682
$$ 885203 908144 916996 937219 951234 961437 940529 938582 954667 922892 902248 879665 844983
12263H44983k2113J3551J2702J6498L2867K0877k2666k2515l3841m166P3048O3865
$$ 844983 822870 836421 849123 865621 898488 919365 896699 874184 840343 836177 909225 973090
12251I73090J1075L6279N8684L0784M9033R7873O4983L5062J7362K3696k2471
$$ 973090 984165 1020444 1079128 1109912 1158945 1256818 1321801 1356863 1374225 1397921 1375450
12240A375450l9998m0973q2307m2763l0602k1599J4118l9628k3454M3137j4595
$$ 1375450 1335452 1294479 1212172 1169409 1138807 1117208 1131326 1091698 1068244 1111381 1096786
12229A096786n60O2280M2362K3154K5668N0008Q0555R7586J18286O7259P332m475
$$ 1096786 1096226 1158506 1200868 1224022 1249690 1299698 1380253 1477839 1596125 1663384 1670716 1666241
12217A666241k1646m5663o5725n7876o4109j10974r0903p9256q7982l3935j5909
$$ 1666241 1644595 1598932 1533207 1475331 1411222 1300248 1209345 1130089 1042107 1008172 992263
12206I92263l0034j7579j3473k3073r820J1346j0775J1102J9759j374J89k3193
$$ 992263 962229 944650 931177 908104 898284 909630 898855 909957 929716 928342 928531 905338
12194I05338J0357N434j3940j36J732K8334L830P562N0952P9606N7537P3468N2544
$$ 905338 915695 921129 907189 907053 908785 937119 940949 948511 999463 1079069 1136606 1210074 1262618
12181A262618L4177M3617k2297k4037l5338k5570l4934j9685o426K8494J0364
$$ 1262618 1296795 1340412 1318115 1294078 1258740 1233170 1198236 1178551 1172125 1200619 1210983
12170A210983o158m662j8296j8953j5567k1888m0251n938j4247j1618k2020J4449
$$ 1210983 1204825 1200163 1181867 1162914 1147347 1125459 1085208 1079270 1065023 1053405 1031385 1045834
12158A045834j4033J0019L2573J224J7466l55L1944L2667j9986J2141M640l4607
$$ 1045834 1031801 1041820 1074393 1075617 1093083 1092728 1124672 1157339 1137353 1149494 1154134 1119527
12146A119527l109J6963l2102M684J1223l286L525p475k0007l289L3015Q867J769
$$ 1119527 1116418 1133381 1101279 1105963 1117186 1113900 1117425 1109950 1089943 1086654 1119669 1128536 1130305
12133A130305J0428O696p801M0052L777k5128L151p308N007r930j288K2407K0963
$$ 1130305 1140733 1147429 1139628 1179680 1183457 1158329 1161480 1154172 1159179 1149249 1147961 1170368 1191331
12120A191331p06R310N094m399k7129k03J555L3084j0128j2845M3949k8934l2300
$$ 1191331 1190625 1199935 1205029 1200630 1173501 1173298 1174853 1207937 1197809 1184964 1228913 1199979 1167679
12107A167679J6640K4866J7557O37j7778j390M416J0141J472l124j9100J2453
$$ 1167679 1184319 1209185 1226742 1227379 1209601 1208211 1212627 1222768 1224240 1221116 1202016 1214469
12095A214469N3694K5096L6356K3882m295k8033j3126J9311J2800J2229l446m7934
$$ 1214469 1268163 1293259 1329615 1353497 1349202 1321169 1308043 1327354 1340154 1352383 1348937 1301003
12083A301003k4863k2814N0733L4070j4697k850j5761k405J1122j6758J3321L9038
$$ 1301003 1276140 1253326 1304059 1338129 1323432 1320582 1304821 1302416 1313538 1296780 1310101 1349139
12071A349139q79l1037l7889j1621J0048K6215O849J0880J5341K0945k955l3993
$$ 1349139 1348260 1317223 1279334 1267713 1277761 1303976 1310825 1321705 1337046 1357991 1355036 1321043
12059A321043R80m7262Q23L0269K4489M6241J9820L330J3602K7814K7036L8011
$$ 1321043 1322023 1274761 1275584 1305853 1330342 1376583 1396403 1399733 1413335 1441149 1468185 1506196
12047A506196K5526j5375l8177n2382k2441K1364K6999N440j0839k2532j1005
$$ 1506196 1531722 1516347 1478170 1425788 1403347 1424711 1451710 1457150 1446311 1423779 1412774
12036A412774P0618J2121J1901O0412K3267k4221l1357r17P851K3004P96j8270
$$ 1412774 1483392 1495513 1507414 1567826 1591093 1566872 1535515 1534598 1542449 1565453 1566249 1547979
12024A547979r623K1752j8967k0241l6330J4992K3405Q542K162K0836K5205j4506
$$ 1547979 1538356 1560108 1541141 1520900 1484570 1499562 1522967 1531509 1533671 1554507 1579712 1565206
12012A565206k6547k2332J6858P959N366j3801K3815K7212O597m274l2336l1458
$$ 1565206 1538659 1516327 1533185 1541144 1546510 1532709 1556524 1583736 1590333 1586059 1553723 1522265
12000A522265Q944Q0M492J8807J3164Q426K3891J922N167l721k6650k5420L0821
$$ 1522265 1531209 1531289 1535781 1554588 1567752 1576178 1600069 1601991 1607158 1603437 1576787 1551367 1582188
11987A582188M9725o211J3208L8009K3924n386M0976K274j466K0243L6796j480
$$ 1582188 1631913 1625702 1638910 1676919 1700843 1695457 1736433 1738707 1737241 1757484 1794280 1792800
11975A792800k764j1091L9418L9467L1972N5434J50777J42046J04442J28031J78915
$$ 1792800 1790036 1778945 1818363 1857830 1889802 1945236 2096013 2238059 2342501 2470532 2649447
11964B649447J07669M1778J9840j5158k8368q1804j18320j54759j51870j00724
$$ 2649447 2757116 2798894 2818734 2803576 2775208 2693404 2575084 2420325 2268455 2167731
11954B167731o8335j11655p9669l9612o2960k7067r235j4837k3584P876K1190
$$ 2167731 2099396 1987741 1908072 1868460 1805500 1778433 1769198 1754361 1730777 1738653 1759843
11943A759843N441j1524r404K6474m78J8737Q403m3583k3928Q967r303j9399l5724
$$ 1759843 1765284 1753760 1744356 1770830 1770352 1789089 1797492 1753909 1729981 1738948 1729645 1710246 1674522
11930A674522L76j3079l5948L672k8350j6563r789J1728N1059l728q402j5100
$$ 1674522 1674898 1661819 1625871 1629543 1601193 1584630 1574841 1586569 1637628 1633900 1625498 1610398
11918A610398p624k3844L2412K4494p079q37l7298k7675j0440J7440K6689k0845
$$ 1610398 1602774 1578930 1611342 1635836 1628757 1627920 1590622 1562947 1552507 1569947 1596636 1575791
11906A575791o209k5323l1453l0662K378K5545L9040O733j8389k8065k3225K8305
$$ 1575791 1569582 1544259 1512806 1482144 1484522 1510067 1549107 1555840 1537451 1509386 1486161 1514466
11894A514466K8465J3038J617q780J9033r909j4106j424m773k9290j9223p959
$$ 1514466 1542931 1555969 1557586 1548806 1567839 1557930 1543824 1542400 1537627 1508337 1489114 1481155
11882A481155j505J0732K3189K0691J3642j5937k7183j6056M115K4298j3987j502
$$ 1481155 1479650 1490382 1513571 1534262 1547904 1531967 1504784 1488728 1492843 1517141 1503154 1501652
11870A501652j4513j1322m0353M859P335m635j8703L2454M3988O283r124k2706
$$ 1501652 1487139 1475817 1435464 1440323 1447658 1443023 1424320 1456774 1500762 1507045 1497921 1475215
11858A475215j3378J6744j1104j8665L1221J3405j4927m637r319N380p26M3p748
$$ 1475215 1461837 1478581 1467477 1448812 1480033 1493438 1478511 1473874 1464555 1469935 1469209 1469252 1461504
11845A461504l7446J7307L8201j9455k7026K841k5955J3512J6119k1020k4504
$$ 1461504 1424058 1441365 1479566 1460111 1433085 1435926 1409971 1423483 1439602 1418582 1394078
11834A394078n405j7049k0843j76n443j7226n467j6005P791k2626Q305J6266P757
$$ 1394078 1388673 1371624 1350781 1350605 1345162 1327936 1322469 1306464 1314255 1291629 1299934 1316200 1323957
11821A323957j0978r28J6339m109n416J8794J7705J552n0095m4782k2503J7746
$$ 1323957 1312979 1312051 1328390 1324281 1318865 1337659 1355364 1356916 1306821 1262039 1239536 1257282
11809A257282J5379J77j6304r572J8442j1701q310K284j9110m4302k295K9850
$$ 1257282 1272661 1272838 1256534 1246962 1265404 1253703 1245393 1247677 1228567 1184265 1181970 1211820
11797A211820J751k416k1430j9635J8696L9999K4492O073J3597j2073l754N038
$$ 1211820 1213571 1211155 1189725 1170090 1188786 1228785 1253277 1259350 1272947 1260874 1257120 1262158
11785A262158j148q940j0123N948K4665j565l6759m1542l9744m4770l138J9024
$$ 1262158 1261010 1252070 1241947 1247895 1272560 1270995 1234236 1192694 1152950 1108180 1105042 1124066
11773A124066j1411j5223l4167l4431Q816N9526K308k4681k9900j6639L0782M38
$$ 1124066 1112655 1097432 1063265 1028834 1037650 1097176 1099484 1074803 1044903 1028264 1059046 1059484
11761A059484L519j5008k7146N123P299j4955j9157l2495J6749j1900m404p390
$$ 1059484 1063003 1047995 1020849 1025972 1033271 1018316 999159 966664 983413 971513 967109 959719
11749I59719K8524n891J6663K1657K1089l691n1022L1957J0856q047O499q558
$$ 959719 988243 982352 999015 1020672 1041761 1038070 987048 1019005 1029861 1021814 1028313 1019755
11737A019755l6140m0278r918q873k471o402J4727J3373p024j2721n05kj9295
$$ 1019755 983615 943337 933419 924546 922075 915673 930400 943773 936749 924028 923523 923521 904226
11724I04226k5730Q08O288L2359L0509j0907k4216M342Q40n534L4673J6032m0939
$$ 904226 878496 879304 885592 917951 948460 937553 913337 917679 918519 912985 947658 963690 922751
11711I22751k4237o085l6776k8191J0014l5044J3243K5197k669p21j64J9240J185
$$ 922751 898514 892429 855653 827462 837476 802432 815675 840872 838203 837482 837318 856558 857743
11698H57743L363n093J0648l0628m2841l5366K4417L9916N419r039J0981N983
$$ 857743 861106 856013 866661 836033 793192 757826 782243 822159 827578 818539 829520 835503
11686H35503J1437m2713l2991l1498M7718q930K179k4424k3294J0687K6974k2839
$$ 835503 846940 804227 771236 739738 787456 778526 780705 756281 732987 743674 770648 747809
11674G47809j328l6487J754M1917J4664r391l5523l801J1240P538q54J707J1710
$$ 747809 746481 709994 711748 753665 768329 758938 723415 719614 730854 738392 737538 739245 750955
11661G50955k1014q719J4733k778n182k6279k236m3468j7601O695J3317k1587
$$ 750955 729941 721222 735955 733177 727995 701716 699480 656012 638411 645106 658423 636836
11649F36836P094J8855K7297J2980J6841m268l5500l3400J253K5946J0748k5049
$$ 636836 643930 662785 690082 703062 719903 715635 680135 646735 647988 673934 684682 659633
11637F59633r188l3300j9162k1087J7368J0817k1457L5140J6570L578k6946l7570
$$ 659633 650445 617145 597983 576896 594264 605081 583624 618764 635334 638912 611966 574396
11625E74396K3644K6183k6759j7633j4651j8197J38L2166J6329l006N906K7651
$$ 574396 598040 624223 597464 579831 565180 546983 547121 579287 595616 592610 598516 626167
11613F26167J1126k1262l94k4924J914L8167J3137k2315k2169K1779L0627k5170
$$ 626167 637293 616031 615637 590713 592627 630794 643931 621616 599447 621226 651853 626683
11601F26683m9569m7564j842K5859L721m271k3201j0783M3462M06m6827J0581
$$ 626683 577114 529550 527708 553567 557288 553017 529816 519033 562495 562901 516074 526655
11589E26655J4375J4938k013O749p445j4774j3443k8071k2392J7168M0591j3769
$$ 526655 541030 555968 553955 560704 553259 538485 525042 496971 474579 491747 532338 518569
11577E18569J506j4499J3535j4620q475k7530L3897J8380m1351j0230p698j7794
$$ 518569 520075 505576 519111 504491 496016 468486 502383 520763 479412 469182 461484 443690
11565D43690k2209k336N4802M4625j5431l4311l830L296k9603l4657k1066K2595
$$ 443690 421481 419145 473947 518572 503141 468830 465000 468296 438693 404036 382970 405565
11553D05565M3053K9277j2399j8268K5947L8169P351l0315m4470O102L1127p391
$$ 405565 448618 477895 465496 447228 473175 511344 518695 488380 443910 450012 481139 473748
11541D73748j439l5165m9681k9114L5582L3340J1281J1231k349n48j7595l3273
$$ 473748 472309 437144 387463 358349 393931 427271 438552 449783 447434 446886 429291 396018
11529C96018k1699j9716O180J1696K2110K7885m03k2654K6783m389j4521k702
$$ 396018 374319 354603 360783 372479 394589 422474 422071 399417 426200 421811 407290 404588
11517D04588j3656j9558j3859M135L1785K3443k9130q892J2287L585j4419R835
$$ 404588 390932 371374 357515 361650 393435 416878 387748 378856 391143 394728 380309 390144
11505C90144J8293l0400N6j4260K5608J0116J3965N0522N629l9887k5949o231
$$ 390144 408437 378037 378093 363833 389441 399557 413522 464044 469673 429786 403837 397606
11493C97606o8190k5054K0263J2236k2616j101J5136l057j7481N1264L2092k7376
$$ 397606 329416 304362 324625 336861 314245 313144 328280 325223 307742 359006 391098 363722
11481C63722k6273k2441q50J2149K62l366K1326j9176Q704J9974o089m2842j3495
$$ 363722 337449 315008 314158 326307 326569 323203 344529 325353 334057 354031 347942 305100 291605
11468B91605L463K2328M216j0287J628J4329o146J2542Q399j939q191L7633M3562
$$ 291605 295068 317396 321612 311325 312953 327282 321136 333678 342077 340138 331947 369580 413142
11455D13142K247k0786k162J3064k2356k2485k4205O457L4645N43J389j175r092
$$ 413142 415389 394603 392441 405505 383149 360664 336459 342916 377561 378104 379493 378318 369226
11442C69226k7603K778j129j6059K7847K1642m3024l6475J9805j5552J7069J2920
$$ 369226 341623 344401 343272 327213 355060 376702 333678 297203 317008 301456 318525 331445
11430C31445J1109K4139M582j9332P681N773k1534j9234j9300N698K4540K5748
$$ 331445 342554 366693 371275 351943 359624 365397 343863 324629 305329 311027 335567 361315
11418C61315J352N198J1430o3087k2566K5698K2099L7163R091k1027m044l6562
$$ 361315 362667 367865 379295 316208 293642 319340 341439 378602 387693 366666 362622 326060
11406C26060j1418O12J9485j3346J0674K8412K432M384j8088J6254n648n0298
$$ 326060 314642 315254 334739 321393 332067 360479 362911 367295 349207 365461 359813 309515
11394C09515k7888m188r948l1060J4765J3183N9505L9045p241N581j3836K526
$$ 309515 281627 277439 267491 236431 251196 264379 323884 362929 355688 361269 347433 349959
11382C49959k1261J6835L3229J74j531j6316m2187L602m2004m5911j2178K7296
$$ 349959 328698 345533 378762 378936 377405 361089 318902 322504 280500 234589 222411 249707
11370B49707L2110K7964l7064m4833O370J2355R733j1674l1875P63J309k6645
$$ 249707 281817 309781 272717 227884 234254 246609 256342 244668 212793 213556 214865 188220
11358A88220j6573M6976J719k6683N5364J2650j9567O888R926j4895N302m3400
$$ 188220 171647 218623 220342 193659 249023 261673 242106 248994 258920 244025 249327 205927
11346B05927l0890P2765K4318o500J0734K9713m950k4039j2261l4575p644J2246
$$ 205927 175037 247802 272120 265620 276354 306067 301117 277078 264817 230242 222598 234844
11334B34844M995O517j580P329r962l704L0275j6642l3071M699P173O467j6820
$$ 234844 239839 246356 244776 252105 242143 238439 268714 252072 219001 223700 230873 237340 220520
11321B20520l0814p882j5935K7008L7334J5898j3422j2779j18K4674q946j8206
$$ 220520 189706 181824 165889 192897 230231 246129 232707 219928 219810 244484 235538 217332
11309B17332j2755Q970p924k4492l0L9364L9015j2623l3713j8596J0017N4430
$$ 217332 204577 213547 205623 181131 181101 220465 259480 246857 213144 194548 204565 258995
11297B58995K7113k0125l1980j4388j0123N141q866K678o44k5584J2631L9424
$$ 258995 286108 265983 234003 219615 209492 214633 205767 208445 207801 182217 194848 234272
11285B34272J0927k3297l9966L2698K2755k1630O34L6354P72L0695k1480k8280
$$ 234272 245199 221902 181936 214634 237389 215759 216393 252747 253519 284214 262734 234454
11273B34454l732j2229k7566J900n341r732M634n746o205J5133K1040n569j2992
$$ 234454 230722 218493 190927 192827 187486 177754 182388 176642 170437 185570 206610 201041 188049
11260A88049k1907k731M4048J8134n2307l5504k0858q661N2074L3807p350J9905
$$ 188049 166142 163411 207459 225593 173286 137782 116924 108263 160337 194144 186794 206699
11248B06699k551J8882K054j8204j3262k6053L675k073K8208J3103m2177r492
$$ 206699 204148 223030 225084 206880 193618 167565 171240 169167 197375 210478 168301 158809
11236A58809J5340M908l621N85p882p332o498K4465J8766q688j9560r649j22L277
$$ 158809 174149 179057 175436 176021 168139 160807 154309 178774 197540 188852 169292 159643 159521 162798
11222A62798J7146k5619n956l6027P009L2016K1547L4501r558l5834j3225J9775
$$ 162798 179944 154325 148369 112342 119351 151367 172914 207415 197857 162023 148798 168573
11210A68573o45M807k541m9291J894K0362r350J6572q402O345L3695k1342J354
$$ 168573 167928 172735 170194 120903 122797 143159 133809 150381 141979 148324 182019 160677 162031
11197A62031o141o809L5688L0180O481j3387K1820k1651m2448k428K3974J4549
$$ 162031 155890 149081 184769 214949 221430 208043 229863 208212 165764 163336 187310 201859
11185B01859k3794k1725M4198L6408r241n6316K0845O120k4194q506k722L50j7641
$$ 201859 178065 156340 200538 236946 227705 171389 192234 198354 174160 165654 162932 163282 145641
11172A45641K2235Q129m2939k6414O263n464N934L2704l606k2127P247K3452q478
$$ 145641 167876 176005 133066 106652 112915 107451 113385 146089 142483 120356 127603 151055 142577
11159A42577m2179J491n916K3934K1965K5681L1371P302n157m548N419k2556l5304
$$ 142577 100398 101889 95973 119907 141872 167553 198924 206226 201069 196521 201940 179384 144080
11146A44080k2930l3341k476L3996K4434j8062O470j1781J9833j2937N500L462
$$ 144080 121150 87809 85333 119329 143763 125701 132171 120390 140223 127286 132786 136248
11134A36248P774J9196O456j6991j2647K0918M027j139j4563j7083J4203Q831
$$ 136248 144022 163218 169674 152683 140036 160954 164981 163842 149279 132196 146399 155230
11122A55230R71j6388k6883N24J8095P22j8594m236M046j5128J8105K4354N416
$$ 155230 156201 139813 112930 113454 131549 132271 113677 109441 113487 98359 116464 140818 146234
11109A46234j6065l4222J8756K174k873m984N214L1432k7344m3871q024J1744
$$ 146234 130169 95947 114703 116877 114004 109020 114234 145666 118322 74451 66427 78171
11097G8171L9053J9845j4457j2771K3570J531j1379k2342j3342K322j6426k3996
$$ 78171 117224 137069 122612 109841 133411 134942 123563 101221 87879 90201 73775 49779
11085D9779M2291J8798p368O396O237J2310J1805J2512k233k5713k9329r074L0454
$$ 49779 92070 110868 103500 109896 116133 128443 140248 152760 150527 124814 95485 86411 116865
11072A16865l4541m9484N27J2436Q073J8806m521J2928N24L3276N344k1808P461
$$ 116865 82324 32840 33367 45803 53876 72682 68161 81089 81613 114889 120233 98425 105886
11059A05886K7300j4501n857j9585J3402Q171k0185k3378r535M4939m037l2767
$$ 105886 133186 118685 112828 93243 106645 114816 94631 71253 61718 106657 102620 69853
11047F9853L5766J5755J0006k2965l622N713Q091P7166P2079k9520k8364K0235
$$ 69853 105619 121374 131380 108415 104793 110506 118597 195763 267842 238322 209958 230193
11035B30193L3163L1939j0597l0343j6659R751J2248J3449L3408M5209M0943J4820
$$ 230193 263356 295295 284698 254355 237696 247447 259695 273144 306552 351761 392704 407524
11023D07524k4963k9093j0076j5328k9041j5078J0776K6516N3552N2225M6978
$$ 407524 382561 353468 343392 328064 299023 283945 294721 321237 374789 427014 473992
11012D73992M4890l2783o2559o1566k5891r537k4775J4836j1670J2093J1734j0765
$$ 473992 518882 486099 423540 361974 336083 326546 301771 316607 304937 317030 328764 317999
11000C17999j1021J6250j3792m6080j0930j6845n319j1122k1114l1452N724M8033
$$ 317999 306978 323228 309436 263356 252426 235581 230262 219140 198026 166574 172298 220331
10988B20331L52k3240J0879l1884j4986l7316j4772J8178k3294j4192J3965K9237
$$ 220331 220683 197443 208322 176438 161452 124136 109364 127542 104248 90056 104021 133258
10976A33258J6756K632K6654J1443k1356k4819k8153m0170O585K4368J7993j9066
$$ 133258 150014 152646 179300 190743 169387 144568 116415 76245 82830 107198 125191 106125
10964A06125l8329j1131L4906M4151l8019p5176L9977M6517J5792L0042K0856
$$ 106125 67796 56665 91571 135722 97703 22527 62504 109021 124813 154855 175711
10953A75711k4154l7833O894m3049k9640J785K8610R104J2853K8681L2716j5846
$$ 175711 151557 113724 120618 77569 47929 49714 78324 87428 100281 128962 161678 145832
10941A45832j5848m667J9523N835q882l4462K597L2246k2060k7648J6812j8546
$$ 145832 129984 125317 144840 150675 141793 107331 109928 142174 120114 92466 109278 90732
10929I0732j8825m7172J9398L2972L330j618o859Q497M8938k0569j7025M3959
$$ 90732 71907 24735 44133 77105 80435 78817 71958 80455 129393 108824 91799 135758
10917A35758J2398k0487j5593q238n302K1266L866Q905J4002O03p289m213k4187
$$ 135758 148156 127669 112076 103838 98536 119802 123668 132573 146575 147178 139889 135676 111489
10904A11489q184r041m209j3308K3163J4165n516K1444k763N759L9438k490j5253
$$ 111489 103305 94264 90055 76747 99910 114075 108559 130003 127240 132999 172437 169947 154694
10891A54694k1512l5136k4258L2197J6739j8785J2896q401O748J2427K7143j0078
$$ 154694 133182 98046 73788 105985 122724 103939 116835 108434 115182 127609 154752 144674
10879A44674l0100j4603j5822l49j5182M7033J0865p051n892m04q273Q427k7803
$$ 144674 114574 99971 84149 83800 68618 115651 126516 119465 113573 113169 104896 113323 85520
10866H5520r64j8819K611K7416l528j4816L1570M19k0015m389M6098j1801k6919
$$ 85520 84556 65737 68348 95764 92236 77420 108990 109409 89394 85005 131103 119302 92383
10853I2383M235m12J207J0424J6947J3750l1766Q679o557r970P07J1735L5177
$$ 92383 96618 96206 97413 107837 124784 138534 106768 115447 108890 98920 99627 111362 146539
10840A46539n748k5900K5954P164j6914J7701K432J9645k9214l1937k1787n662
$$ 146539 140791 114891 140845 148009 131095 148796 151228 170873 141659 109722 87935 82273
10828H2273J9961N704q644R4967L7095k7768k5373j5341j6072m4713l5671L0894
$$ 82273 102234 107938 99294 194261 231356 203588 178215 162874 146802 102089 66418 97312
10816I7312K1019j498J7037k3365k6399K5262L2626l2588l1415j8699k6940K846
$$ 97312 118331 116833 133870 110505 84106 109368 141994 109406 77991 59292 32352 35198
10804C5198m651j8910n735J7473L3040K8499j1483l5574J5764P283k0736l020
$$ 35198 30547 11637 5902 23375 56415 84914 73431 37857 53621 60904 40168 37148
10792C7148O254Q229k3352l2428j3142M076J8458L1340M308P634j960L4025K1678
$$ 37148 43402 51631 28279 -4149 -17291 -13215 5243 36583 40891 48525 46565 80590 102268
10779A02268m3858M50N2913r813p5808k8960L5299J3016J3619M2325K4073k2945
$$ 102268 58410 58860 111773 101960 26152 -2808 32491 45507 59126 101451 125524 102579
10767A02579m4989l4544L261k4261q678L826J7840Q648M079q588o352K1076M9391
$$ 102579 57590 23046 26307 2046 -6632 -2806 15034 23682 27761 19173 12821 33897 83288
10754H3288N495q213k6885m2585l6119j9515j6268J3942J6206K6187J0576r699
$$ 83288 88783 80570 53685 11100 -25019 -44534 -60802 -46860 -30654 -4467 6109 -3590
10742c590K0247n468l1868l1590l8996j8849K7381M2478J7038K9339o36r659L775
$$ -3590 16657 11189 -20679 -52269 -91265 -110114 -82733 -40255 -23217 6122 5486 -4173 -398
10729c98R847J5908n1969p9184M2420R206K113k364J2955M9076M3124j2135m4773
$$ -398 9449 25357 -26612 -105796 -63376 -54170 -52057 -54421 -41466 7610 50734 38599 -6174
10716f174J7335L3979K1262j6450j798J757K9534J1457J5210M2740K5542j872
$$ -6174 11161 45140 66402 49952 48154 49911 79445 90902 106112 148852 174394 172522
10704A72522k2782m1031K3114J5582j0376k403J938L1420L8630J7572j0603j6439
$$ 172522 149740 108709 131823 147405 137029 134626 136564 167984 206614 224186 213583 197144
10692A97144m859j6407l1416j0521j3452L0886N0777K6117O763k0766l4542J6144
$$ 197144 192285 175878 144462 133941 120489 151375 202152 228269 235032 214266 179724 195868
10680A95868j9442L3847J7122K154J8304K3159K4073Q189k9866j6304k145K4872
$$ 195868 176426 210273 227395 229549 247853 271012 295085 303274 273408 257104 254959 279831
10668B79831J2295m1524m7771o412J9255K3308J7857k991K8416J7443k5888j2963
$$ 279831 292126 250602 202831 196419 215674 238982 256839 253848 282264 299707 273819 260856
10656B60856M1227N189M779M909l0835k6544M937L9887L1127R441P197K3248M2297
$$ 260856 302083 307272 312051 316960 286125 259581 264518 304405 335532 344973 352170 375418 417715
10643D17715M0507R833L4941L9578p973j8439K1730M1854J1793M8874J3952M1247
$$ 417715 458222 468055 502996 542574 534601 516162 537892 579746 591539 640413 654365 695612
10631F95612K184L4876M7247K6271N6504J10208J33352J58888J44638J44426J02374
$$ 695612 697796 732672 779919 806190 862694 972902 1106254 1265142 1409780 1554206 1656580
10620A656580J45339R8985J82604K48633L34394M45545O42959Q90841J218981
$$ 1656580 1801919 1900904 2083508 2332141 2666535 3112080 3755039 4645880 5864861
10611E864861J664376K214361K826167L349930L251072K252878P36261o34160
$$ 5864861 7529237 9743598 12569765 15919695 19170767 21423645 22159906 21525746
10603B1525746j208527r03260j36439R86662K306328L919563N626356O829376
$$ 21525746 20317219 19413959 19277520 20264182 22570510 26490073 32116429 38945805
10595C8945805O352969L487326n25396l629192m581122l568958j706724L64596
$$ 38945805 45298774 48786100 48260704 44631512 40050390 36481432 34774708 35139304
10587C5139304K632865N043128P446544Q676067P242185K553919l419045p636254
$$ 35139304 37772169 42815297 50261841 58937908 66180093 68734012 65314967 57678713
10579E7678713q463226o869272m446390k074166R5731K162579L877288M602451
$$ 57678713 49215487 42346215 37899825 35825659 35921390 38083969 41961257 46563708
10571D6563708L299782j40831m132499o577671o711676n292499l522863j995081
$$ 46563708 49863490 49722659 45590160 39012489 32300813 27008314 23485451 21490370
10563B1490370p14498K88378R75427J085345L96876j044777k526715l316169l333030
$$ 21490370 20775872 21064250 22039677 23125022 23521898 22477121 19950406 16634237 13301207
10554A3301207k784857k140246j591702j157048q71234o59164n29375m01972l22442
$$ 13301207 10516350 8376104 6784402 5627354 4756120 4096956 3567581 3165609 2843167
10545B843167l09647k50782j89898j91381j72190j55901j37384j05156r1685j04702
$$ 2843167 2533520 2282738 2092840 1901459 1729269 1573368 1435984 1330828 1239143 1134441
10535A134441q8346m0613p0673p3251o9351n1317n2573l9881N256o5448k1690
$$ 1134441 1046095 1005482 934809 861558 792207 740890 688317 648436 653692 588244 566554
10524E66554k6377m0649j6652n9545m8435j2529j2695O513J0858l2139l3584j7356
$$ 566554 540177 499528 482876 423331 374896 362367 349672 356185 367043 334904 301320 283964
10512B83964Q667j7684k8537m1958l3021o4036K2095L7776m497q063l172j8378
$$ 283964 292631 274947 246410 204452 171431 107395 129490 167266 162769 154706 151534 133156
10500A33156L940k9218Q240m994j9536L07k1374l5684L075M1806L0034n913p586
$$ 133156 137096 107878 116118 111124 91588 91895 70521 34837 37912 79718 109752 103839 96253
10487I6253M635j689N982j3056j1780J235j129J114L431j3536k6121m335K3174
$$ 96253 100888 99199 105181 92125 80345 81580 80451 81565 84996 71460 45339 41004 64178
10474F4178p150o508j979p877l1804j6186J2412L8962j787J357N925j8964M807
$$ 64178 57028 50520 48541 40664 8860 -7326 5086 44048 42261 43618 49543 30579 35386
10461C5386n662J7337M67L3761J2065Q730J5435j4346K0106L6352M260o27p603
$$ 35386 29724 47061 47528 81289 93354 102084 117519 103173 123279 159631 163891 163264 155661
10448A55661j0359k5332J8823L3230q265M5650N6279J1072M967m8080n6775J7609
$$ 155661 145302 119970 138793 172023 163758 209408 265687 276759 281726 233646 176871 194480
10436A94480o591l9507K7931J9034o261l2114K2956M7238J9169J0029j0216m644
$$ 194480 187889 148382 176313 195347 189086 156972 179928 227166 246335 256364 246148 241504
10424B41504j6406l8247k0189l4209j2342p039L149Q328n34J8755L3959k133j7168
$$ 241504 225098 186851 166662 132453 120111 113072 116221 124549 124015 142770 176729 174596 157428
10411A57428p0688l8400j2255L8653L5693N978J2455j7160j4573M793K7272N149
$$ 157428 86740 48340 36085 74738 110431 116409 128864 111704 97131 101924 129196 134345
10399A34345m4269m0651q637k159N5964M6290o208K459m6369j139K7918k4750
$$ 134345 90076 49425 40788 38629 94593 140883 134675 137134 90765 89626 117544 92794
10387I2794l18M302j8509K0547L2591j2085m0443k1557j305J8514J0417j3451
$$ 92794 92476 96778 78269 98816 131407 119322 78879 57322 56017 74531 84948 71497
10375G1497J283K4015J1798k83J173J0708Q756n8255k3425J2707J0421J5557K2582
$$ 71497 72780 96795 108593 108310 109483 120191 128947 70692 47267 59974 70395 85952 108534
10362A08534L8989k3524l2484k3612m0009R59Q241N953J7135j3314j8699o381
$$ 108534 147523 123999 91515 67903 27894 28853 37094 43047 60182 46868 28169 21788
10350B1788j3012k6978n561j815L0131N586k2421J618k000M5549K6464l513n6468
$$ 21788 8776 -18202 -23763 -25578 4553 10139 -12282 -10664 -12664 32885 59349 55836 -632
10337f32J229R352n447j6170o089K6447o626J1288O382j186j6338j9702j9350
$$ -632 597 9949 4502 -11668 -17757 8690 2064 13352 19734 18548 2210 -17492 -36842
10324c6842m0065J4887K0172j485J756R449N873K831L892r71j2799K2477j4432
$$ -36842 -76907 -62020 -41848 -43333 -41577 -32128 -26255 -23424 -19532 -20503 -33302 -10825 -25257
10311b5257J1515j0585O986K7704J3224q450p952J9881o366J2803K5759J0523
$$ -25257 -13742 -24327 -17341 10363 23587 15137 7185 27066 20700 33503 59262 69785
10299F9785k8695m722J5557l6500Q723j7791l6772k0879K017L2310l071k7165
$$ 69785 41090 36368 51925 15425 24148 6357 -30415 -51294 -49277 -16967 -20038 -47203
10287d7203J4529R438j8982k4183P333M3739K2219J634M990J656j6171J4145o708
$$ -47203 -32674 -23236 -42218 -66401 -59068 -15329 6890 8524 13514 15170 -1001 13144 6436
10274F436P375K4719j0031P413j5775J4039J1231n607M222O728j4225j650m527
$$ 6436 13811 38530 28499 35912 20137 34176 45407 39800 44022 50750 36525 34875 30348
10261C0348j399o272k8366j989K1261L9485n721l7858P663n447j2741k4979j738
$$ 30348 28949 22677 -5689 -7678 13583 53068 47347 9489 17152 11705 -1036 -26015 -27753
10248b7753r62k410k080R941J4641J6935P861K4196j6491Q416j657j7878j3189
$$ -27753 -28715 -31125 -33205 -23264 -8623 8312 16173 40369 23878 32294 30637 12759 -430
10235d30J92j3064K8324R785K27R294j9961K863J507n4805J5888L5252M3504j0764
$$ -430 -238 -13302 15022 24807 25034 34328 14367 17230 18737 -36068 -20180 15072 58576 47812
10221D7812k0245o284K6666l0802l1089K3370M208L7077k9955l4446l3832o465
$$ 47812 27567 21283 47949 17147 -13942 9428 13636 50713 20758 -13688 -47520 -53985
10209e3985r126L811J7737M7786K5641o756J4271P989q637k9690k088j4961l234
$$ -53985 -63111 -59300 -41563 6223 31864 25108 39379 47368 38731 9041 6953 -8008 -11242
10196a1242K2508P717o643k2274J3288L1136j2508k208J7246l3969j1716M3695
$$ -11242 11266 18983 12340 -9934 3354 34490 21982 19774 37020 3051 -8665 35030
10184C5030J4015R967l1844k8933n077J3589L4689r940k1082J0142J2795M481
$$ 35030 49045 59012 27168 -1765 -6842 6747 41436 31496 10414 20556 33351 37832
10172C7832K8635K4035J9973J27p479K3305j59j3158k1414K4052M4070R403K628
$$ 37832 66467 90502 110475 110602 103123 126428 126269 113111 91697 115749 159819 169222 171850
10159A71850L8680O5785n011k5032k7176l3335J362j846J4442K1876O2293L0611
$$ 171850 210530 276315 271304 246272 219096 185761 187123 185277 199719 221595 283888 314499
10147C14499M3846J4109k9783k5642k7757m6242j5052k7219J3660q287N2805M3740
$$ 314499 358345 372454 342671 317029 289272 243030 227978 200759 214419 206132 258937 302677
10135C02677N3006j3654q4150p3211j0793j2237o493J1106j5978k4842n462K2343
$$ 302677 355683 342029 257879 184668 173875 161638 155145 166251 150273 125431 119969 142312
10123A42312n662j7170m7415l6237J7464k0205k0607R897L876k6037k0937L1226
$$ 142312 136650 119480 72065 35828 53292 33087 12480 22377 26253 216 -20721 10505
10111A0505L6561Q701j2151l8587L0968L5822j7231p851m1283j4643M352n955
$$ 10505 47066 55767 43616 5029 35997 71819 54588 46737 5454 -9189 -4837 -10792
10099a0792m1874J2209q356J2697L9708O780j5436j3281j4012j2163J3282K4158
$$ -10792 -52666 -40457 -48813 -36116 3592 10372 -5064 -18345 -32357 -44520 -31238 -7080
10087g080K3624j2192J586m860N756j1008p719L474q705j8928j0048K3692K5975
$$ -7080 16544 4352 5938 1078 6834 -4174 -11893 -8419 -17124 -36052 -46100 -22408 3567
10074C567L0810l4231k1763k0769M6442J5556r757J8519K1398l2388k4323L684
$$ 3567 34377 146 -21617 -42386 4056 19612 9855 28374 49772 17384 -6939 -3255
10062c255l58k1851K3358K4881N1671Q566j175j6115l0120L1472J5018Q246j1855
$$ -3255 -3613 -25464 -2106 22775 74446 83012 81837 65722 35602 67074 82092 90338 78483
10049G8483m0313l867j6493L1361k5987j6414L865k3734R762K526J7120l3067
$$ 78483 38170 34303 17810 49171 23184 6770 10635 -13099 -3337 -811 16309 -16758
10037a6758m3791K7523M597K1314j3996O243K8155j08j5494L7319j7025L155N290
$$ -16758 -60549 -33026 -28429 -7115 -21111 -14868 13287 13179 -2315 35004 17979 21134 26424
10024B6424K092j0562k2194j2023J1572J3555j4965j0462K1500K6595l6479Q62
$$ 26424 28516 17954 -4240 -16263 -4691 8864 -6101 -16563 4937 31532 -4947 -4085
10012d085J4198R771J799J1135J6328q660p237N995q446Q16j5234M544j1067j3798
$$ -4085 10113 19884 21683 32818 49146 40486 33249 39244 30798 31614 16380 20924 9857 -3941
9998c941P570K2015j5443j8580j4810r647l259L2646L1622m846j1534l344L157
$$ -3941 3629 25644 10201 -8379 -23189 -32836 -36095 -3449 28173 23327 11793 8449 11606
9985A1606N754M609q391o062J4652J5474j769j5311j2166j4670m032j5083K3481
$$ 11606 17360 21969 13578 7516 22168 37642 35873 20562 8396 -6274 -10306 -25389 -1908
9972a908J8280J0283k708r730O313R837q215M332l237k4223l6883p311o863Q504
$$ -1908 16372 26655 23947 14217 20530 30367 22152 26484 23247 -976 -37859 -45170 -52033 -43529
9958d3529K1109K3715K7165J5537k6836k9327k6848K4500K0152j0879k1849J0289
$$ -43529 -22420 1295 28460 43997 17161 -12166 -39014 -14514 5638 -5241 -27090 -16801
9946a6801L9377N3022j4015m4248j2248j1787Q927J7521n089O388L6834J3458
$$ -16801 22576 75598 61583 17335 5087 -6700 2227 19748 14659 21047 57881 71339
9934G1339j4609j0763J1861N25m64j0178m7925j3614J0904L4652K5175k8861n5084
$$ 71339 56730 45967 57828 58353 57889 47711 -214 -13828 -2924 31728 56903 28042 -27042
9921b7042k5432L5559L0284J1304J7947J8175j9602k4980L0548J3009k1220j84
$$ -27042 -52474 -16915 13369 24673 42620 60795 41193 16213 46761 59770 38550 38366
9909C8366l8113k6976l2854K1973O1460j0215l5911J8579O797k9463j5268r965
$$ 38366 253 -26723 -59577 -37604 23856 13641 -22270 -3691 3106 -26357 -41625 -51590
9897e1590O272L13M1271J8271m170j1397j3549j6300o787J9682j9212m653j063
$$ -51590 -45318 -45005 -3734 14537 10367 -1030 -14579 -30879 -37666 -17984 -37196 -41849 -42912
9884d2912L9863K2148j2848j8285q242K4196j3515J3770J9153l4018L937M3964
$$ -42912 -3049 19099 6251 -12034 -20276 3920 -9595 4175 23328 -10690 -6753 37211
9872C7211J4239N780j1710J7744m917l7996m2178j5813k1948Q026L4144J4010
$$ 37211 51450 57230 45520 63264 58347 20351 -21827 -37640 -59588 -51562 -17418 -3408
9860c408k659j2262Q924P463j1887O127K3925K9569O774J3710K119k7590N091
$$ -3408 -6067 -18329 -9405 -1942 -13829 -7702 16223 45792 52566 66276 68395 40805 45896
9847D5896N957l0554k8653j5782J4836K03J6212N330j5544l5542K0498j2416M3234
$$ 45896 51853 21299 -7354 -23136 -8300 -8097 8115 13445 -2099 -37641 -17143 -29559 13675
9834A3675K4446j2514j0445K7359l7891l0013L5203J1435m249k6343J9374L0573
$$ 13675 38121 25607 15162 42521 4630 -25383 9820 21255 17006 -9337 10037 40610
9822D0610j0930r842J0893J101N811l4413K12k0078m836j1117J2469j8186K0216
$$ 40610 29680 19838 30731 31832 37643 3230 3442 -16636 -21472 -32589 -20120 -38306 -18090
9809a8090J4299N581L6045N261m6274n580J482N032j672k3873P676j4597O005
$$ -18090 -3791 1790 37835 43096 -3178 -8758 -7276 -2244 -3916 -27789 -20113 -34710 -28705
9796b8705k2307K0489q59m441M486K735k4284J2394L5057L0986J4013j0627l2556
$$ -28705 -51012 -30523 -31382 -35823 -31337 -28602 -52886 -40492 -5435 25551 39564 28937 -3619
9783c619j3971L1560J3753j0389m2249o606K8366J006j5836L1235k8987J08J8799
$$ -3619 -17590 13970 27723 17334 -24915 -31521 -3155 -2149 -17985 13250 -15737 -15629 3170
9770C170J7128K209Q665O186L439m2376l7016J347K9553n258l093L3636J232m5463
$$ 3170 20298 22507 31172 37358 40797 -1579 -38595 -37248 -7695 -12953 -16046 17590 18822 -26641
9756b6641n0883O452N8341J7784l2701l635J8615n744L3142L1046k8974R088P714
$$ -26641 -77524 -71072 -12731 5053 -27648 -31283 -12668 -18412 14730 45776 16802 25890 33604
9743C3604k582O945m1029k2045p696K4833J0877k1291q221K6245K511K0238L1536
$$ 33604 31022 37967 -3062 -25107 -32803 -7970 2907 -18384 -26605 -360 2151 22389 53925
9730E3925k198r768l5619l6854k582R896r211o828j8293J8148K7977P320K251
$$ 53925 51727 41959 6340 -30514 -33096 -23200 -32411 -39239 -57532 -39384 -11407 -4087 -1836
9717a836m5546K431o785j3222m770K3795J2869k2843k0804M3522l418l5203K2129
$$ -1836 -47382 -44951 -51736 -64958 -69728 -45933 -33064 -55907 -76711 -33189 -36607 -71810 -49681
9704d9681L2460J0799j8525m671O5020J0486j8006K0456K7628l3858j9959k9081
$$ -49681 -17221 -6422 -24947 -29618 35402 45888 27882 48338 75966 42108 22149 -6932
9692f932k2246L233J9718P002l2442k4413k1279j822J3894q3O536M2611O767k
$$ -6932 -29178 -25945 -6227 775 -31667 -56080 -77359 -79181 -65287 -65370 -58834 -16223 -9456 -9458
9678i458k5176l627K1339K5544J6823j9021k4886o661o717N834m037p466K4105
$$ -9458 -34634 -38261 -16922 8622 25445 6424 -18462 -25123 -31840 -26006 -30043 -37509 -13404
9665a3404J10K6021j1331J2319J9695r335j1432k5754n331K1936L5125k2532j0567
$$ -13404 -13294 12727 1396 13715 33410 24075 12643 -13111 -18442 3494 38619 16087 5520
9652E520J2430o978p672k3140J0884J8770P3765O9473N7513N0397K3710o2687
$$ 5520 17950 10972 3300 -19840 -8956 9814 83579 153052 210565 260962 284672 221985
9640B21985q2198k4419p996p0891m1136J3109J2286o173l30l4866j2978J9651
$$ 221985 139787 115368 107372 36481 -4655 8454 20740 14567 14237 -20629 -33607 -13956
9628a3956K7982P306M660j6268l5136n1585m563J1741J7426j643L1529K4423J6640
$$ -13956 14026 21332 25992 9724 -25412 -76997 -81560 -69819 -52393 -54036 -22507 1916 18556
9615A8556k6960K3388M494k6593p333J1638k8263L0273L3970K8174j4613m0129
$$ 18556 -8404 14984 19478 -7115 -14448 -2810 -31073 -800 33170 61344 46731 6602
9603F602k3019L2722m3045j3200K2292J0947J5257K6610p927k1441r126j0995
$$ 6602 -16417 16305 -26740 -39940 -17648 -6701 8556 35166 27239 5798 -3328 -14323
9591a4323n018q778J5591L534j813k0652J0170K6714n985j7020k0970j7329J0699
$$ -14323 -19341 -28119 -12528 -8994 -10807 -31459 -21289 5425 -560 -17580 -38550 -55879 -45180
9578d5180N686N692K6659J4998J853n232p764k0570j8319j2483K6504M9260l0887
$$ -45180 -39494 -33802 -7143 7855 9708 4476 -3288 -23858 -42177 -54660 -28156 21104 -9783
9565i783R559K4669p170l2023o618K6294L4999J4273m995j7832j7318l6602K2957
$$ -9783 -224 24445 17275 -14748 -21366 4928 39927 54200 49205 31373 14055 -22547 410
9552D10O230l1103j9602J5692K9319L605j0299k2932J5187j3032r983O695o000
$$ 410 6640 -24463 -44065 -28373 946 4551 -5748 -28680 -13493 -26525 -36508 -29813 -35813
9539c5813J5042J4466K9107rl6925j4810K9485j0467l1428j1172k729l352J0664
$$ -35813 -20771 -6305 22802 22793 -14132 -28942 543 -9924 -41352 -52524 -55253 -58605 -47941
9526d7941L3212K5398R384J1940n975n971K6887k0556k9462K6422J813J070j3835
$$ -47941 -14729 10669 20053 31993 26018 20047 46934 26378 -3084 23338 25151 26221 12386
9513A2386j8960q092K727n851K8963M627j6099mq853j7007M501J6151J555J8443
$$ 12386 -6574 -14666 -11939 -17790 11173 15800 -299 -303 -9156 -26163 -21662 -5511 -3956 14487
9499A4487l337L9872K2024k9488j8850j1652J148L621l481N739j7950k0276p788
$$ 14487 11150 51022 73046 43558 24708 13056 14204 17825 14344 20083 2133 -18143 -25931
9486b5931m126K7985K3276M2685p584j2852m5873n7421K8474J5704k9940O813
$$ -25931 -30057 -2072 21204 63889 56305 43453 -2420 -59841 -31367 -15663 -45603 -38790
9474c8790O691j4888L0668K3143R153J4510j4491l6176J625l840J0262J0722n96
$$ -38790 -32099 -46987 -16319 6824 15977 30487 15996 -20180 -18555 -22395 -12133 -1411 -2007
9461b007j9274L0615L74k5341o892j2618j3175K6049J2173N768j4162L3241J0138
$$ -2007 -21281 9334 9708 -15633 -22525 -35143 -48318 -22269 -10096 -4328 -18490 14751 24889
9448B4889l49J1343j5455j5498J5767J9373j3996J3594k7586n717m00k5680n60
$$ 24889 24540 35883 20428 4930 20697 40070 26074 39668 12082 6365 5965 -19715 -20275
9435b0275j5806J0729J6238j0398o724j2522j4043J2500K3522L7097l3228k9447
$$ -20275 -36081 -25352 -9114 -19512 -26236 -38758 -52801 -40301 -16779 20318 -12910 -42357
9423d2357J5278p423k3708K1411L7382J964M1417Q81r298J9102j8543j9879j4784
$$ -42357 -27079 -34502 -58210 -36799 583 2547 43964 44845 35547 54649 36106 16227 1443
9410A443P404J0104M829j6538m0101M545M64r03J0758k772J0747K8028o98K8166
$$ 1443 8847 18951 23780 7242 -32859 -28314 -27850 -28753 -17995 -20767 -10020 18008 17310 45476
9396D5476M5432r991m2913m1221k3445r732K648O5338K5333R150k4173L428k0871
$$ 45476 90908 80917 38004 -3217 -26662 -36394 -33746 31592 56925 66075 41902 45330 24459
9383B4459n3419j213J020L0085Q35j9245m1999j3626J6773P062L786O6525r918
$$ 24459 -28960 -30173 -29153 932 1767 -17478 -59477 -73103 -56330 -49268 -45482 21043 11125
9370A1125k7682L180L776n801m737M013m092j4337J4018Q526j5950J312Q903J1616
$$ 11125 -16557 -13377 -9601 -15402 -20139 -16126 -20218 -34555 -20537 -12011 -27961 -26649 -17746 -6130
9356f130J3382J006k9374K3296q158j0459j8463J3246n999K3057M4362J5578j1875
$$ -6130 7252 8258 -21116 2180 -5978 -16437 -34900 -21654 -27653 -4596 39766 55344 43469
9343D3469N148k3163J9194K1451J4660M250o945l2420M645J832k1438k4082k0890
$$ 43469 48617 25454 44648 66099 80759 85009 78064 45644 50289 52121 30683 6601 -14289
9330a4289j8094l1558K1976K4838j6410j5239L216j0156J4742J7065L9293j7058
$$ -14289 -32383 -63941 -41965 -17127 -33537 -48776 -45560 -55716 -40974 -23909 15384 -1674
9318a674q102J5845M844J922k6818N322l7492m8j871L0669P793k5498k0966J0977
$$ -1674 -9776 6069 10913 12835 -13983 -8661 -46153 -46201 -48072 -17403 -9610 -35108 -56074 -45097
9304d5097L2127N5585J0716j9277j1411j3025R147m247l1394P640N925j4737K6240
$$ -45097 -12970 42615 53331 34054 22643 9618 18765 14518 -16876 -9236 -3311 -18048 8192
9291H192M3019J6939l7967l6722J0546J4429j7126l4863k47J2617j013o526j0328
$$ 8192 51211 68150 30183 -6539 4007 18436 1310 -33553 -33800 -21183 -22196 -28722 -39050
9278c9050R833O954k4177j3142j1532J4162K6361K4877J8019o87j8573k8494q445
$$ -39050 -29217 -22263 -46440 -59582 -71114 -56952 -30591 -5714 12305 11618 -6955 -35449 -43894
9265d3894K5338K9664J3762K1435j647j4345J6282n825k2549l6787j7322K0757
$$ -43894 -18556 11108 24870 46305 44658 30313 46595 40770 18221 -18566 -35888 -15131
9253a5131K6255L6119j2205j0339j3399q037J167k2708j5564r80K9110m183l6269
$$ -15131 11124 47243 35038 24699 11300 3263 4430 -18278 -33842 -34822 -5712 -9895 -46164
9240d6164K635l0240l831M9205K5885K5426L5930j0531k760Q368j3786l2712J7453
$$ -46164 -43529 -73769 -77600 -28395 -2510 22916 58846 48315 45555 53923 40137 7425 24878
9227B4878j8243k3141L6871K8335M084K5378M144j1724j0519j847k3314k6504
$$ 24878 6635 -16506 20365 48700 52784 78162 82306 70582 60063 58216 34902 8398
9215H398J2146j9965N637J0922l8314l1673P670J0357N404O099K8805q734o213
$$ 8398 20544 579 6216 17138 -21176 -52849 -45179 -34822 -29418 -23319 5486 -3248 -9461
9202i461j3181l088J8238l3643j8268L5840K824j4367N819M2703K8205j0771O960
$$ -9461 -22642 -25730 -7492 -41135 -59403 -23563 -20739 -35106 -29287 13416 41621 30850 37810
9189C7810m0140m29r709N862J5522j8347K0145Q916j1499K2105K8189l1016l2414
$$ 37810 -2330 -2759 -12468 -6606 8916 -9431 10714 19630 8131 30236 58425 27409 -5005
9176e005J4658k3858j0392q142J728O847p356J266K2541j3469K585k2640J1350
$$ -5005 9653 -14205 -24597 -32739 -31011 -24164 -31520 -30254 -7713 -21182 -18597 -41237 -29887
9163b9887K0647n492j6543M472L1676J059K5038J255j0210l943k1552N423J7597
$$ -29887 -9240 -14732 -31275 -26803 4873 5932 30970 32225 22015 18072 -3480 1943 19540
9150A9540J1721j4107m737J4388K7649m447l2308q439j4558j6019J0129K2518
$$ 19540 31261 17154 12417 26805 54454 50007 17699 9260 -5298 -21317 -11188 11330
9138A1330l004j5208n726L42m387j6155n93M897k072k742Q778k0178j9402J1476
$$ 11330 8326 -6882 -12608 -12266 -16653 -32808 -33401 -28504 -30576 -33318 -24540 -44718 -64120 -52644
9124e2644M021j0266K44J6188K1668J8466J9987L4632k3023j7130j6510j4106
$$ -52644 -48623 -58889 -58645 -42457 -20789 -2323 17664 52296 29273 12143 -4367 -18473
9112a8473p967R548L37J4167J5575j8980q67j2600o360j8025K411K4448K3365
$$ -18473 -26440 -16892 -16555 -2388 13187 -5793 -6660 -19260 -25620 -43645 -41234 -16786 6579
9099F579j2261k2742K5725p271l576j810J1709k35k0206K348M097k2846O595J3323
$$ 6579 -5682 -28424 -2699 -9970 -13546 -15356 -3647 -3882 -24088 -21740 -17643 -40489 -33894 -20571
9085b0571q216J4190K9804n093r193Q938J9084j4058l329j077J4150m216q981
$$ -20571 -28787 -14597 15207 10114 921 9859 28943 14885 11556 10479 24629 20413 11432
9072A1432k3481l2542k357L1235O849j3353N94r759K0779N6371n275l7808l4737
$$ 11432 -12049 -44591 -46948 -15713 -8864 -22217 -21623 -31382 -10603 45768 40493 2685 -32052
9059c2052r035K421J9918K8613K7358k3614j5688r819K171L967k6677J0423L059
$$ -32052 -41087 -38666 -18748 9865 37223 13609 -2079 -11898 -9727 -5760 -32437 -22014 -18955
9046a8955j9097L2840P404L319j9724j108N690L0467j0908Q741J7248L4653J1935
$$ -18955 -38052 -5212 2192 5511 -14213 -15321 -9631 20836 9928 18669 35917 70570 82505
9033H2505j7733k6708J8820k6685k0535k3606k9693Q110L380L3410n237m338j6141
$$ 82505 64772 38064 56884 30199 9664 -13942 -43635 -35525 -32145 1265 -3972 -8310 -24451
9020b4451o398K0916k4029l2173K8156L0638P575J1142q837M8541J5166m3113
$$ -24451 -30849 -9933 -33962 -66135 -37979 -7341 234 11376 2539 51080 66246 23133
9008B3133k1396P735L029l042l5514K9858J8579m93L5576J743l901P540k1726
$$ 23133 1737 9472 12501 9459 -26055 3803 22382 21889 57465 59208 55307 62847 41121
8995D1121k8061J7617n283k7685q748Q391l831j0668l8182m649K6864K7433L6915
$$ 41121 13060 30677 25394 -2291 -11039 -2648 -6479 -17147 -55329 -59978 -33114 -5681 31234
8982C1234j1417j6318K0831N340l1788j5217r848j0852j8403P63M0389J9107l848
$$ 31234 19817 3499 24330 29670 -2118 -17335 -27183 -38035 -56438 -55675 -15286 3821 -27
8969b7J6811j5963M867j8536k531m31L0966N3527K57k1948r432k5945j7989M619
$$ -27 16784 821 5688 -12848 -15379 -15810 15156 68683 68940 46992 37560 11615 -6374 -1755
8955a755j0465L073n089r308L0459R936o595j5732k5452n825L4124J6674l0397
$$ -1755 -12220 -9147 -14236 -23544 6915 16851 10256 -5476 -30928 -36753 -2629 14045 -16352
8942a6352l3133L6320K9737l1322l647K4086J0638j4686J5787K7655q716m3239
$$ -16352 -49485 -13165 16572 -14750 -18397 5689 16327 1641 17428 45083 36367 -6872
8930f872j757j9964L352j3402L0758m26R731j1943l260N291M3750J2790j3468
$$ -6872 -8629 -28593 -25241 -38643 -7885 -8311 1420 -10523 -13783 -8492 35258 48048 34580
8917C4580k8414k4212j0993J3988L2826Q004l578N64n73L3842l19k6542j5187
$$ 34580 6166 -18046 -29039 -15051 17775 25779 22201 22765 22192 56034 55715 29173 13986
8904A3986j6015L281M352j9264n821n07J9631L1428J326l8464k5329L7190K4179
$$ 13986 -2029 1252 5604 -13660 -19481 -19988 -357 31071 32397 -6067 -31396 5794 29973
8891B9973J7428M842K743R716j8198j6061J8269r685q645m4210J5930J8329k6554
$$ 29973 47401 52243 54986 64702 46504 30443 48712 39027 30382 -13828 2102 20431 -6123
8878f123j7606N01O040j2678L1325J3928J1723J0098j0664r380M1051o86J0959
$$ -6123 -23729 -23228 -17188 -29866 1459 15387 27110 37208 26544 17164 58215 57529 68488
8865F8488Q74l4096l1727j1485J2629J9417L881J5114j770k1148L744M562J3834
$$ 68488 69362 35266 3539 -7946 4683 24100 27981 43095 41325 20177 23921 28483 42317
8852D2317p039k4067k302M240j4073J7167J1286k0621l1832j4706q94R013N0091
$$ 42317 35278 11211 8909 13149 -924 16243 27529 6908 -24924 -39630 -40524 -31511 18580
8839A8580l297j806J7665J3116k8056l4776M849N837k6121k2530K5782K8456J4085
$$ 18580 15283 13477 31142 44258 16202 -18574 -13725 -7888 -34009 -56539 -30757 -2301 11784
8826A1784J5931j5272j0282J4150k273P778K2536K7398m405j4054k4848j3975
$$ 11784 27715 12443 2161 16311 14038 21816 44352 71750 67345 53291 28443 14468
8814A4468k4889k785K0783L969N185j266j2086J6499J3021q375K936j1829m2724
$$ 14468 -10421 -13206 7577 11546 16731 15465 3379 19878 32899 24524 27460 15631 -27093
8801b7093l2284L1999K4606P32Q168M0183J1737k5058k4868j9836r053M200K729
$$ -27093 -59377 -27378 -2772 -2040 6128 46311 58048 32990 8122 -11714 -20767 -16567 -13838
8788a3838j2502L7160L6603P974k5859J4948P58j3230K3756L9757p033r449k3242
$$ -13838 -26340 10820 47423 55397 29538 44486 45244 32014 55770 95527 88494 79045 55803
8775E5803n2090M1019K1491L420j0024j5296m622J2174l4628k9642j8464K0088
$$ 55803 3713 44732 66223 69643 59619 44323 39701 51875 17247 -12395 -30859 -10771
8763a0771M3165K1688q821O07K0775j0632k117m4284r215O711m002j9719k4230
$$ -10771 32394 54082 45261 45868 66643 56011 53894 9610 395 7106 3104 -16615 -40845
8750d0845J3132J5509P968M7958K3452k1088k6486K917j2091k3802N5375O709
$$ -40845 -27713 -12204 -4236 43722 67174 46086 19600 22517 10426 -13376 41999 48708
8738D8708n8745k2042k489K4093N812J5766K4024J8987K523l068N760j86k0006
$$ 48708 -10037 -32079 -34568 -10475 -4663 11103 35127 54114 56637 53569 59329 59143 39137
8725C9137j6532j7285j583j068j3336p543j5684J4419L2985J5427K202k424j5994
$$ 39137 22605 5320 3737 2669 -10667 -18210 -33894 -19475 13510 28937 31139 28715 12721
8712A2721K5289j0266j2071j567j2968J5223k1036L7084k136l21K2882o806j8960
$$ 12721 38010 27744 15673 14106 1138 16361 -4675 32409 30273 29952 52834 46028 27068
8699B7068m511K870J6238m477J4448J0968M24j5919m2165l8228K354L4782K0267
$$ 27068 22557 25427 41665 37188 51636 62604 63028 47109 4944 -33284 -30930 3852 24119
8686B4119J8112J0750k5429K0447k4106l3968k2178J8466M862J6270M8414Q493
$$ 24119 42231 52981 27552 47999 23893 -10075 -32253 -13787 -8925 7345 55759 64252
8674F4252o091k7089j0984j4718m35K861J2719J2282k2033n10j802J6169J7645
$$ 64252 58161 31072 20088 5370 4935 7796 20515 32797 10764 10254 8452 24621 42266
8661D2266N809J9228j2134J6434J6481l092k0993l5246j9764l692K3745L0600
$$ 42266 48075 67303 55169 71603 88084 84992 63999 28753 8989 5297 29042 59642
8649E9642k4907l7370K774L0622j5556j8834k2873K7186L0208J2163L494r521
$$ 59642 34735 -2635 139 30761 15205 -3629 -26502 684 30892 43055 46549 37028
8637C7028J1466K4431K9346J5293m3320j1975l201j3256j2494L5721J2843l6447
$$ 37028 48494 72925 102271 117564 74244 62269 59068 45812 33318 69039 81882 45435
8625D5435j4474l1366j7771L5246O333j6676J094L7674O3379p991k7288n730k453
$$ 45435 30961 -405 -18176 17070 23403 6727 7821 45495 108874 100883 73595 67865 65412
8612F5412O250j097k1980j5478J3364N995l2863L731K0320M0925l833l6397K0563
$$ 65412 71662 70565 48585 33107 46471 52466 19603 23334 43654 84579 80746 44349 64912
8599F4912K6721J0307j6555k1709l2784j87k362J0106K8631K9957L7087L635j1539
$$ 64912 91633 101940 85385 63676 30892 30705 28343 38449 67080 97037 134124 137759 126220
8586A26220J4344J7110M529J9573J7938j813M1229M9599O424n905L8759M4774
$$ 126220 140564 157674 162203 181776 199714 197901 239130 288729 295153 289248 328007 372781
8574C72781K3230J8833J9970M0640j9718J587k919l7533j5381K6586o0046o7050
$$ 372781 396011 414844 434814 475454 455736 457323 454404 416871 401490 428076 368030 300980
8562C00980m4967k4844j7540m0586j7880j7807J9211L6445Q158r647j647l2129
$$ 300980 256013 231169 213629 173043 155163 137356 156567 193012 201170 191523 189876 157747
8550A57747r777O246K6303M4296N8275R8179J78560K74639K48552Q5435j42706
$$ 157747 147970 154216 180519 224815 283090 381269 559829 834468 1083020 1168455 1025749
8539A025749k71511k44941j67949n5740k7079m0388j5718j1788m133k2694m4947
$$ 1025749 754238 509297 341348 285608 258529 218141 202423 190635 186502 163808 118861
8528A18861K4327J8133n1352m757j1005k3884l8537n268J2559J9995K5233J5858
$$ 118861 143188 161321 109969 105212 94207 70323 31786 26518 39077 59072 84305 100163
8516A00163p847o186J218J752l172n88K4574L8369L3560k3667k0024K4696O2948
$$ 100163 92316 86130 87348 89100 85928 85340 109914 148283 181843 158176 138152 162848 225796
8503B25796N1629N9456J38901K06292L23155N24424N26719J40287l17538n56283
$$ 225796 277425 336881 475782 682074 1005229 1529653 2056372 2196659 1879121 1322838
8493A322838m30322k14051j23500q3736r6932q2873l6474m4756n5703l8156J2352
$$ 1322838 892516 678465 554965 471229 374297 291424 254950 210194 154491 116335 128687
8482A28687M751N013r469n64J675l7775j7471J9915q986K371P989q580M64M786
$$ 128687 133438 138451 128982 128418 130093 92318 74847 94762 85776 88147 96136 87556 88020 92806
8468I2806k6521J0428M0064k347l0218K3950J6947K2122r764q324J466K5318O5910
$$ 92806 66285 76713 116777 114430 84212 108162 125109 147231 137467 129143 130609 155927 221837
8455B21837J25253J75615K47790K03092R6260j16918k44293k02695r2377p3385
$$ 221837 347090 522705 770495 973587 1069847 952929 708636 505941 413564 340179
8445C40179q7355l8991j8745j1232r638L734j9817n5497r341J1044J999j476k1847
$$ 340179 252824 213833 195088 183856 174218 177952 158135 102638 93297 104341 106340 104864 83017
8432H3017r651j4535R038k6782L7108L8579K5135k9747k2387j9033k882J7371
$$ 83017 73366 58831 67869 41087 78195 116774 141909 112162 89775 70742 67860 85231
8420H5231m8260j5189L3608K507j4232l0249J3082K4910j9536K6409k027j8155
$$ 85231 36971 21782 55390 57897 43665 13416 26498 51408 31872 58281 56254 38099
8408C8099M0946N283m879l662K6901j2927l657J0860k3491k7129j895j2227J4641
$$ 38099 79045 84328 79449 75787 102688 89761 86104 96964 73473 46344 44449 32222 46863
8395D6863J3039p015j3976J724L6727l023l0969M550o651k2466j6646J2356o367
$$ 46863 59902 52887 38911 40635 77362 74339 43370 47920 41269 18803 2157 14513 8146
8382H146K8872p352k2578K0351j195R408L863l006n127N461Q027o842n532k2017
$$ 8146 37018 29666 7088 27439 26244 35652 39515 36509 31382 36843 44870 38028 32496 10479
8368A0479P177n859r63J1782L6082J6417r24l0856l5923P158n142k8084k3469
$$ 10479 17656 11797 10834 22616 58698 75115 74191 43335 7412 14570 9428 -18656 -42125
8355d2125J6775j2250J0726Q515l5747k2256N1514K3178J0163J0412L87N815K125
$$ -42125 -25350 -37600 -26874 -18359 -54106 -76362 -24848 -1670 8493 18905 19292 25107 27232
8342B7232Q961j5277j2467j3906J5719P0565K4061K4349j2126o0104k4109o435
$$ 27232 36193 20916 8449 -5457 10262 80827 104888 129237 117111 57007 32898 26463
8330B6463M4195L4423n115l5293l0436J8786k6696k828N511l99K7272j304J0198
$$ 26463 70658 105081 99966 64673 34237 53023 26327 23499 29010 28611 55883 54579 64777
8317F4777r56j1020k71k7573j8525l599M628J2186J7515l3648j9719R925L6398
$$ 64777 63821 52801 52530 24957 6432 2833 7461 19647 37162 3514 -16205 -6280 30118
8304C0118K1358K8414p271j8017l3743k2033j2349j0361K8797L2028O6638N6666
$$ 30118 51476 79890 72619 54602 20859 -1174 -13523 -23884 4913 36941 103579 160245
8292A60245P1584L4427j7853p6044p8756k9861J962j1426J2531N6060k3556o9965
$$ 160245 231829 266256 248403 172359 93603 63742 65704 54278 66809 122869 99313 29348
8280B9348r253J1379j5185L254l1322m630J8815L0259r921p56J4000l899O247
$$ 29348 20095 31474 16289 19543 -11779 -16409 2406 32665 22744 21988 35988 32089 38336
8267C8336q581k2797n047j5001j4423K0760L6487J3182J7893j2404K0598k174
$$ 38336 29755 6958 1911 -13090 -27513 -6753 29734 42916 60809 48405 69003 66829
8255F6829j3499l1302q037K6589k7498k174J9997K6503l4854K1412K4844k1780
$$ 66829 53330 22028 13991 40580 13082 10908 30905 57408 22554 43966 68810 47030
8243D7030l0803R589o768J6999P121k2972j2228R049L2874k3910k2395j6328J1506
$$ 47030 16227 25816 19048 36047 43168 20196 7968 17017 49891 25981 3586 -12742 -1236
8230a236N2931j4427q836l6274r546j410n625Q150n51J3266J0504L2452j0236
$$ -1236 51695 37268 28432 -7842 -17388 -18798 -24423 -16273 -16824 -3558 6946 39398 29162
8217B9162J9334l883j5354k2582J673P313M1586M5565j1556k6526m2436j9765
$$ 29162 48496 44613 29259 6677 8350 15663 57249 102814 91258 64732 22296 2531
8205B531l293M5380k3934p7449k567L7920L1774K170j0987J526N34j3152J201
$$ 2531 -762 44618 20684 -56765 -59332 -21412 10362 12532 1545 3071 3605 -9547 -8346
8192h346m778K5482M8996J8782l6332l5574j3848J8141N166n253J0024J0823p912
$$ -8346 -13124 12358 61354 80136 43804 8230 -5618 12523 17689 12436 22460 33283 25371
8179B5371j7789l89j4944l577K9384K2063Q067l0441l4383l5818J1735M3490Q956
$$ 25371 7582 7193 -7751 -11328 18056 40119 48186 17745 -16638 -52456 -40721 2769 11725
8166A1725j7751j8199L1433j7384k2050k8151m490j799O892K0077K8861p043n937
$$ 11725 -6026 -24225 7208 -10176 -32226 -60377 -64867 -66666 -59774 -39697 -10836 -17879 -23816
8153b3816K3460J6770l6061L9189J9278p008p197r900K5043J8268K3525n3939
$$ -23816 -356 16414 -19647 19542 38820 31812 24615 14715 39758 58026 81551 27612
8141B7612j0198J0369k2094N04r880o248J8995L158J6125j9558J281k4531j047
$$ 27612 17414 27783 5689 6193 -3687 -9935 9060 12218 28343 8785 10066 -14465 -15512
8128a5512J0452K8944K5656l3910l2617m681K1462N854n317J1486m484l2904M918
$$ -15512 -5060 23884 49540 15630 -16987 -21668 -206 5648 331 11817 7333 -25571 -20653
8115b0653L1605K6421p625P907j8383j6763o882K8008R090K8462J1516k9928p443
$$ -20653 10952 37373 29748 37655 19272 2509 -4373 23635 32725 61187 72703 42775 35332
8102C5332m6024k1610J3563J7787J8046q742K3501L1606J0426J2959j8876m2846
$$ 35332 -10692 -32302 -18739 -952 17094 8352 31853 63459 73885 86844 67968 25122
8090B5122N210K5224l8064r610j0545N275J0960J9393L4164k0570l8410p886j5439
$$ 25122 30332 55556 17492 7882 -2663 2612 13572 32965 67129 46559 8149 263 -15176
8077a5176o686j8794j0018J6693M2661J6323k1875K2085K8160J3178j6705k1518
$$ -15176 -21862 -40656 -50674 -33981 8680 25003 3128 25213 53373 66551 49846 28328
8065B8328Q031k5797J6837J2259O102J2997n841K134J8764J032k3251n813P035
$$ 28328 36359 10562 27399 39658 45760 58757 52916 55050 73814 74846 51595 45782 52817
8052E2817j0551p457j5388p098J7719J8979J7672k8845j8489Q574O736J6669j4803
$$ 52817 42266 34809 19421 12323 30042 49021 66693 37848 19359 27933 34669 51338 36535
8039C6535l4215j9590N655Q81M0646J9275p935M740P34O238J9785k9879m822N242
$$ 36535 2320 -17270 -11615 -10734 29912 49187 41252 45992 46726 52964 72749 42870 38048 43290
8025D3290J2811K7851K3342l8005l2346J8463L8251n4102n7083K6825M483K9177
$$ 43290 56101 83952 107294 69289 36943 55406 93657 39555 -17528 9297 13780 42957
8013D2957L0048K9850j553l0628k581J5792l2817P37p964j0801m1474j5169J0994
$$ 42957 73005 102855 101302 70674 68093 83885 51068 51805 43841 33040 -8434 -23603 -12609
8000a2609k909K8201k0080j6986j064M6554L018K8384r513k4300P64R078L0046
$$ -12609 -15518 12683 -7397 -24383 -25447 21107 24125 52509 42996 18696 19460 28538 58584
7987E8584Q44K1148j8126m0003m160M2112k9578R291J0995j5679J2224j5981j2320
$$ 58584 59428 80576 62450 22447 18287 60399 30821 40112 51107 35428 47652 31671 19351
7974A9351L9450Q62N129J8398J4648Q607K7681j2313j1768n642J616l5013l5697
$$ 19351 58801 59663 64792 83190 97838 106445 134126 121813 110045 104403 106019 71006 35309
7961C5309J1246j959j6077j4750J0516K7931o100l202o121K2799j2436k6534j8836
$$ 35309 46555 44596 28519 13769 24285 52216 46116 42914 36793 59592 47156 20622 1786
7948A786j0504J8631q764Q872N402P182n83L4025K8897o186L042r444K744k98
$$ 1786 -8718 9913 1149 10021 15423 22605 22022 56047 84944 78758 81800 72356 75100 74802
7934G4802j2193J8007J9023J8676N799J3675l782j6585n925J117q246m9257l1501
$$ 74802 62609 80616 99639 118315 124114 137789 134007 117422 111497 112614 104368 55111 23610
7921B3610P316N2890l8336n1773J9814N636K3514K4809J2679j0156j664k6089
$$ 23610 30926 83816 45480 -6293 13521 19157 42671 67480 80159 70003 68339 42250
7909D2250k5860r690M748L599k0630M033L126j4881K1767L2590r596K5936p486
$$ 42250 16390 6700 11448 15047 -5583 -1550 1576 -13305 8462 41052 31456 57392 49906
7896D9906n533m756P887J8614n463j9837r831O931j1568n930J7431K9000K6384
$$ 49906 44373 39617 47504 66118 60655 40818 30987 37918 26350 20420 37851 66851 93235
7883I3235L2130k7990l8221q592J3862p439l9763J690J6456N3681L736j2272l7193
$$ 93235 125365 97375 59154 50562 64424 56985 17222 18912 35368 89049 92785 80513 43320
7870D3320m0193k3928J2544J6140k884J6176j858k816J3295n784j7756K336K6843
$$ 43320 3127 -20801 -8257 7883 4999 21175 19317 16501 29796 24012 6256 8592 35435
7857C5435j482m155k1314R311K5066r64K0302l430k6226k845k3371K2553p924
$$ 35435 33953 29798 8484 17795 42861 41897 62199 58769 32543 29698 6327 28880 20956
7844B0956j0320R467l7722j5610J2350R195K5467R336l0106k2370j7210P221M2411
$$ 20956 10636 20103 -17619 -33229 -20879 -11684 13783 23119 -6987 -29357 -46567 -39346 3065
7831C065K1090l9293k9170R81J6779K9765j1380J5832K083n598j1951j2766J947
$$ 3065 24155 -15138 -44308 -43327 -26548 3217 -8163 7669 9752 4154 -7797 -20563 -18616
7818a8616N965k1578N891L346J0097N54k9934q748K6160L4525Q103K9204L3545
$$ -18616 -12651 -34229 -28338 -24992 -14895 -14341 -44275 -53023 -26863 7662 15765 44969 78514
7805G8514k0435j158K22m02J0049n546l2263k3596j3024J444K3763J053j8610
$$ 78514 58079 56921 57143 56741 66790 61244 28981 5385 -7639 -6195 17568 18621 11
7792A1l3973j4552j565K0960L1200K8865P097J5092r019m6891j3355L637J9377
$$ 11 -33962 -48514 -50079 -29119 2081 30946 38043 53135 44116 -2775 -16130 -12493 6884
7779F884O861R353J2462p385l0410O431j3780K0509J6158j3902K366K4829m509
$$ 6884 13745 23098 35560 28175 -2235 4196 -9584 10925 27083 13181 15547 40376 35867
7766C5867k2335N911l596j4026k4926n3672k450K9141L7473K993j0745k1034R721
$$ 35867 13532 19443 15847 1821 -23105 -76777 -79227 -50086 -12613 -9620 -20365 -41399 -31678
7753c1678q643j9037J5604j334r871M1375M4660P19J5700p115j3556k2864k1806
$$ -31678 -40321 -59358 -43754 -45088 -54959 -13584 31076 31795 47495 40380 26824 3960 -17846
7740a7846L13p48J9585L2719K5648m416J4683m5490k0567j3842l015L371j7586
$$ -17846 -17533 -18281 1304 34023 59671 55255 69938 24448 3881 -9961 -12976 -9605 -27191
7727b7191J3168J6146j847k8440R571J5791l1620m1805M456j767J3478K5320J1315
$$ -27191 -14023 2123 276 -28164 -18593 -2802 -34422 -76227 -71771 -73538 -60060 -34740 -23425
7714b3425q132J3309L5968Q836J350J7615K906m4693k0787j1701n765j4734j2823
$$ -23425 -31557 -18248 17720 26556 27906 45521 48427 3734 -17053 -28754 -34519 -49253 -62076
7701f2076K3656L640k5216P044K2861j7239L548k3687K909k1132r078L3810K7763
$$ -62076 -38420 -34780 -59996 -52952 -30091 -47330 -43782 -67469 -64560 -85692 -94770 -60960 -33197
7688c3197K9906j2563J1935L3560l5095m1573J2401M5765Q075k6312r114K8594
$$ -33197 -3291 -15854 -3919 29641 -5454 -47027 -34626 11139 19214 -7098 -16212 12382
7676A2382R927m3966k555K4239j1662k0441J8882l46L2650J4893j8989m993J6122
$$ 12382 22309 -21657 -24212 27 -11635 -32076 -13194 -13540 19110 34003 15014 10021 26143
7663B6143J858K0956j2324l708L0819m563l2290j5423R287K0438o8759k2701K3492
$$ 26143 28001 48957 36633 32925 63744 59181 26891 11468 20755 41193 -27566 -50267 -26775
7650b6775K4565L7582r743n5271j8969O064K5578L576J4161k1800p636J6616L0823
$$ -26775 -2210 35372 25629 -29642 -48611 -42547 -16969 -13393 768 -21032 -28668 -12052 18771
7637A8771J001O942n1234n2147Q331N1640M8066J3163j2390k8219j7963k8960
$$ 18771 19772 26714 -24520 -76667 -68336 -16696 31370 44533 32143 3924 -14039 -42999
7625d2999j7478N291L977J0585Q053j5041J1745K9217J5567j1419n774L98L1184
$$ -42999 -60477 -55186 -51209 -40624 -32571 -47612 -35867 -6650 8917 -2502 -8276 -7878 23306
7612B3306k7242k6796k7529k915R04K2195L1487j766J3668l803J6166M582J5995
$$ 23306 -3936 -30732 -58261 -61176 -60272 -38077 -6590 -8356 5312 1509 17675 22257 38252
7599C8252N680l3178r334n104k8897Q117K8846l4932j9432K0847L589Q048K8979
$$ 38252 43932 10754 1420 -3684 -32581 -24464 4382 -30550 -49982 -29135 -25546 -17498 11481
7586A1481J503m71j9718J6353j9787K3258L0906l3369k3079J593j4661k473m705
$$ 11481 12984 12513 -7205 9148 -10639 12619 43525 10156 -12923 -11330 -25991 -28464 -33169
7573c3169N7J4182o076p863J8351J4053P230k6961J912J9552O498K2506L0637
$$ -33169 -33112 -18930 -25006 -32869 -14518 -465 6765 -20196 -18284 1268 7766 30272 60909
7560F0909P795l7952k9598j58j1798j1991K7591j9504k4694J6937K153L3028R851
$$ 60909 68704 30752 1154 996 -10802 -22793 4798 -14706 -39400 -22463 -20310 12718 22569
7547B2569p718O204j7483j1842K8687m83l2467J8113J003j1305j2097n236J640
$$ 22569 14851 21055 3572 -8270 20417 19934 -12533 5580 6583 -4722 -16819 -22055 -20415
7534b0415j7636J973J2035r071q169R011J6696P132j558K8124J4962j7452l8145
$$ -20415 -38051 -36078 -24043 -33114 -41283 -32272 -15576 -8444 -10002 18122 33084 15632 -22513
7521b2513r142J5039J8611k2899m1480J9379L0050K0063J755J2343L4522j1977
$$ -22513 -31655 -16616 1995 -20904 -62384 -43005 -12955 7108 8863 21206 55728 43751
7509D3751k488j8931n9745J1434M4952K6644j4045k8621P994O222K1613l4942
$$ 43751 41263 22332 -37413 -25979 18973 45617 31572 2951 10945 17167 38780 3838
7497C838j9707K9111J730Q090l499l9752k8139L2477M0171m67j4361j9083k0285
$$ 3838 -15869 13242 14972 23062 19563 -20189 -48328 -15851 24320 23853 9492 -9591 -29876
7484b9876p19J9540J2559L163j7910k4895l358J2531l212Q411N4195N424k7254
$$ -29876 -30595 -11055 1504 4667 -13243 -38138 -41496 -28965 -32177 -23766 30429 35853 8599
7471H599K1030K3016J031j2440j661j5200n605k556O227J7287j7905p495K4948
$$ 8599 29629 52645 53676 41236 39575 24375 18770 16214 22441 39728 21823 14328 39276
7458C9276l9873q570J9560j5959r42N735J3306k4755J4853J784P373l0223k9920
$$ 39276 -597 -9167 10393 -5566 -6508 -773 12533 -12222 2631 4415 11788 -18435 -48355
7445d8355r583K5126J4035j7216m0390J0210L4007K5569J4758j5909k9184k7273
$$ -48355 -57938 -32812 -18777 -35993 -76383 -66173 -32166 -6597 8161 -7748 -36932 -64205
7433f4205k146p882L0276J5964j1276L6385J254k0677M608J7840j3739P183j5626
$$ -64205 -66351 -74233 -43957 -27993 -39269 -2884 -1630 -22307 -17699 141 -13598 -6415 -22041
7420b2041l1078M46K9424L6402j4408N62q489l0710J8266j5410M720L1184K2476
$$ -22041 -53119 -52673 -23249 13153 -1255 -693 -9182 -39892 -21626 -37036 -32316 -1132 21344
7407B1344N408p796l8318P484K8377j3704k3475l8776j3081J7458J3540J4776
$$ 21344 26752 18956 -19362 -11878 16499 2795 -20680 -59456 -72537 -55079 -41539 -26763
7395b6763J9019j7080l1927J5573J6653L8634k1917l45K2689J1719k3982k6723
$$ -26763 -7744 -24824 -56751 -41178 -24525 14109 -7808 -8153 14536 26255 2273 -24450
7383b4450o630J8147L6417j8042K582J5562J3514o700j4199M686R9m0473j547
$$ -24450 -31080 -12933 23484 5442 8024 23586 37100 30400 16201 20887 20986 -19487 -21034
7370b1034M4269L9519m165l4961o993m7784j8606K7418J2791p722j3548j8111
$$ -21034 23235 62754 58589 23628 16635 -31149 -49755 -22337 -9546 -17268 -30816 -48927
7358d8927QL3083L223k5802J10J1223J6534l4332q94K5182K4243K4110J1798q947
$$ -48927 -48919 -15836 -12613 -38415 -38305 -27082 -10548 -44880 -45774 -20592 3651 27761 39559 30612
7344C0612J5850p977k5382j5950R987p663j4520j1902K3090k7871J242p466Q214
$$ 30612 46462 38485 13103 -2847 7140 -523 -15043 -26945 -3855 -31726 -30484 -37950 -29736
7331b9736K7055o526p058n992o064j2321k9961K4080N483k531J7214N471K837
$$ -29736 -2681 -9207 -16265 -22257 -28321 -40642 -70603 -46523 -41040 -43571 -26357 -20886 -18049
7318a8049j5925k1919J6486P954j8846J0407L5911p111j0953J4370J6285J9507
$$ -18049 -33974 -55893 -39407 -31453 -50299 -39892 -3981 -11092 -22045 -7675 8610 28117
7306B8117n056k4289k4576k5297j6061J1034R226L2297L508o437j9655J8409J4527
$$ 28117 23061 -1228 -25804 -51101 -67162 -56128 -46902 -14605 -11097 -17534 -37189 -18780 -4253
7293d253p613Q403l0110l595J0099r787M5944J1582J5192O238j7690j2836M4372
$$ -4253 -11866 -3463 -33573 -37168 -27069 -36856 9088 20670 35862 42100 24410 11574 55946
7280E5946j5386m0671j9882R468q759J5406l2660K0N0034K6859J991r18m1395
$$ 55946 40560 -111 -19993 -10525 -19284 -3878 -36538 -36518 13516 40375 42366 41448 53
7267E3j3773n803k1162R174j854J609L218J2693m580o5105J5742M4728J7978r682
$$ 53 -13720 -19523 -40685 -31511 -33365 -31756 -28538 -15845 -20425 -85530 -69788 -25060 -7082 -16764
7253a6764m708K3006j037l5015P195j6223k1157J3007L0527M924j7811k496J3164
$$ -16764 -21472 1534 497 -34518 -27323 -43546 -64703 -51696 -21169 -16245 -34056 -36552 -23388
7240b3388q731j221K0041J6447k6573K5360J3776J5075O494j062N83r522j3582
$$ -23388 -32119 -33340 -13299 3148 -23425 1935 15711 30786 37280 36218 36801 27279 13697
7227A3697p470K049l13O792r324r850M0615p308l0218j6488k8992l896L8262K1745
$$ 13697 6227 8276 7963 14755 5431 -4419 36196 28888 -1330 -17818 -46810 -50706 -12444 9301
7213I301l298o371M383N593j84j3844K1914K6296J2010k465k8190k4917q509j9896
$$ 9301 6003 -368 4015 9608 9424 -4420 17494 43790 55800 53335 25145 228 -8281 -28177
7199b8177K1485R337M427j7508j0755j4290k3472M864K5408m279J1665L4860k953
$$ -28177 -6692 2645 7072 -10436 -21191 -35481 -58953 -54089 -28681 -32960 -21295 13565 10612
7186A0612m5432Q25K5795j6930n054l345j0003k097N76L6P616K3005L9331J0204
$$ 10612 -34820 -33995 -8200 -25130 -30184 -33529 -43532 -45629 -45053 -45017 -37401 -14396 24935 35139
7172C5139J7785k3150m9560J1926m264r287K3226j246J0821p129l0039p427J2820
$$ 35139 52924 29774 -19786 -7860 -12124 -21411 1815 569 11390 4261 -25778 -33205 -20385
7159b0385j2060q293N334O83K7228j5614r343K2065l1377l751M941J9142K6561
$$ -20385 -32445 -40738 -35404 -34721 -7493 -23107 -32450 -10385 -41762 -45513 -40572 -21430 5131
7146E131j150P15j0786m174J4908q442l8159j9320L7672K8138L419j2070k4536
$$ 5131 3981 4696 -6090 -10264 4644 -3798 -41957 -61277 -23605 4533 7952 -4118 -28654
7133b8654j3617r873J1867J5878K3741J6506o130M1656K8896l2020j282k4416
$$ -28654 -42271 -52144 -40277 -24399 -658 15848 9718 51374 80270 48250 46968 22552
7121B2552o789L7708J1497m6616k7408J4436j1396K570K7970L1374n801r37m908
$$ 22552 15763 53471 64968 18352 -9056 5380 -6016 -3446 24524 55898 50097 49160 44252
7108D4252p798j8054j2515J8466O750m1033m0419j0830K9939j678m3115n83L0002
$$ 44252 36454 18400 5885 24351 31101 -9932 -50351 -61181 -31242 -32920 -76035 -76618 -46616
7095d6616N041K8549j6438k7136j873j3498K9036K9667J0807j721q989N192J6085
$$ -46616 -41575 -13026 -29464 -56600 -58473 -71971 -42935 -13268 -2461 -4182 -13171 -7979 8106
7082H106m6522k2016j1251J3683L1279q901j6680K4602K895K1050j2323l2252
$$ 8106 -38416 -60432 -71683 -58000 -26721 -35622 -52302 -27700 -24805 -3755 -16078 -48330
7070d8330J2195L6332P903Q331l0908j5853q605O673N360J8197j3654j7069J0615
$$ -48330 -36135 197 8100 16431 -14477 -30330 -38935 -32262 -26902 -8705 -22359 -39428 -28813
7057b8813J4166O837K1827P569m801k2299j667l0150J108J5173j2175k7675P471
$$ -28813 -14647 -7810 14017 21586 16785 -5514 -7181 -37331 -36223 -21050 -33225 -60900 -53429
7044e3429j1876j7047L049j394J417K3424J1888R424O5832J1978Q037m5038j9062
$$ -53429 -65305 -82352 -79303 -80697 -79280 -55856 -43968 -34544 31288 43266 51303 6265 -12797
7031a2797j9444K095R811J6350R899j6136K0403q048K687O584K0555j1607o8j0145
$$ -12797 -32241 -30146 -20335 -3985 5914 -10222 10181 2133 4820 11404 31959 20352 20284 10139
7017A0139k1833J4962p733J9748K8382o304j9585J5973j5668j4235R875k4789
$$ 10139 -11694 3268 -4465 15283 43665 37361 17776 33749 18081 3846 13721 -11068
7005a1068l1397K5894J0101J6176j3517q649p587l596Q572l316j2016N987K352
$$ -11068 -42465 -16571 -6470 9706 -3811 -12460 -20047 -23643 -15071 -18387 -30403 -24416 -22064
6992b2064o003j0713N4516k027l4315M008J1337k7913k3434P235K0229R361r798
$$ -22064 -28067 -38780 15736 13709 -20606 -16598 -5261 -33174 -56608 -49373 -29144 -19783 -29581
6979b9581p69j6469j4042J9412J4484j9380j1083K8646K7191O46J3735l0197j9371
$$ -29581 -30350 -46819 -60861 -41449 -26965 -46345 -57428 -28782 -1591 -945 12790 -17407 -36778
6966c6778r020K9722n437O012P736j9635m1794L8648N3984L2936j3608k4783m510
$$ -36778 -45798 -16076 -21513 -15501 -7765 -27400 -69194 -30546 23438 56374 42766 17983 13473
6953A3473k4437l6633K3291M013J497N416j6887J4297L2876L6216J7205l7914
$$ 13473 -10964 -47597 -24306 -20293 -18796 -13380 -30267 -15970 16906 53122 70327 32413
6941C2413k5388k6906m380m91l9531q953N664N525L4731L0620j4115P576J714
$$ 32413 7025 -19881 -24261 -24752 -64283 -73236 -67572 -62047 -27316 3304 -10811 -3235 -1521
6928a521l6807J1983N2565Q808l3601m450O214L2311R063k8868l1750J0578k0871
$$ -1521 -38328 -26345 26220 35028 1427 -3023 3191 35502 44565 15697 -16053 -5475 -26346
6915b6346m457Q429J03P78L793j7042l2136l311J6512K1296m540J3945L553r401
$$ -26346 -30803 -22374 -22271 -21493 -17700 -34742 -66878 -70189 -53677 -32381 -36921 -22976 -19423 -28824
6901b8824k2411K1624q51j1191J1635J5873j1678J4304k2856k6302k411K1029
$$ -28824 -51235 -29611 -30462 -41653 -30018 -14145 -25823 -11519 -34375 -60677 -63088 -42059
6889d2059L8252o847o842N811J7247J7857k858j8939J873j0597N912l227J0187
$$ -42059 -3807 -10654 -17496 -11685 5562 23419 20561 1622 3495 -7102 -1190 -4417 5770
6876E770L3081j2582k0770Q205j4607n441J0109P879k4087R731j1331j3099J9504
$$ 5770 38851 26269 5499 13704 -903 -6344 3765 11644 -12443 -2712 -14043 -27142 -7638
6863g638N850j5014p866k3921J8095J7388k2118L027K3091K321k6175J2463O6162
$$ -7638 -1788 -16802 -24668 -48589 -30494 -13106 -35224 -32197 -9106 -6785 -32960 -20497 45665
6850D5665Q016j2662j9650o548L101r79j6343j9658j7814O015K1622J6217j316
$$ 45665 53681 41019 21369 14821 17922 16943 600 -19058 -36872 -30857 -9235 6982 5666
6837E666J2417Q162J0689N366j6258o905k8364k4657j1919J6377R844j4296K8299
$$ 5666 18083 26245 36934 42300 26042 19137 -9227 -33884 -45803 -29426 -19582 -33878 -5579
6824e579j0793K7736J782m264O104k53j1010k627K465j0828K1001L3098J5452
$$ -5579 -16372 11364 13146 8882 14986 14733 3723 1096 3561 -7267 13734 46832 62284
6811F2284k31k3889O016l4307j9270J4934J8197j0810J4638l8920l6677l6998
$$ 62284 62053 38164 44180 9873 -9397 5537 23734 12924 27562 -11358 -48035 -85033
6799h5033K8232K8585j5437J478J09L62j0060k0207J5964P524J1484J6553o644
$$ -85033 -56801 -28216 -43653 -42175 -42066 -41704 -51764 -71971 -56007 -48483 -36999 -20446 -27090
6786b7090R766L4493l5483j7479j4407M181J3470m923j7212j2590K2179K5104
$$ -27090 -17324 17169 -18314 -35793 -50200 -46019 -32549 -37472 -54684 -67274 -45095 -19991
6774a9991j2605q885K3112m155n0291j3577K8922J9391J1595L667J3873j4325
$$ -19991 -32596 -41481 -18369 -22524 -72815 -86392 -57470 -38079 -26484 -22817 -8944 -23269
6762b3269l224q598l1719r47J4252k036r657M0582J1673Q273q457K633K4246j0973
$$ -23269 -26493 -35091 -66810 -67757 -53505 -55541 -65198 -24616 -12943 -4670 -13127 -10494 13752 2779
6748B779m4213k9923J7256K2014K7935J1562l36m246l246p96r490j372K139r811
$$ 2779 -41434 -71357 -54101 -32087 -4152 7410 7074 2828 -418 -1214 -10704 -12076 -9937 -19748
6734a9748K1904Q862K3378l416M276j5835l3688R938K1512K1170K885J0783J4091
$$ -19748 2156 11018 34396 30980 35256 19421 -14267 -4329 17183 38353 41238 52021 66112
6721F6112m8145j9991O753j2013j4257l0138j681J0135j876L446J9090N406K2370
$$ 66112 17967 -2024 4729 -7284 -21541 -51679 -53360 -43225 -45101 -41655 -22565 -17159 5211
6708E211M2382j6679l9377k4011K383L91k5347q603k6843J5615K2957K602J0217
$$ 5211 47593 30914 -8463 -32474 -30091 -29700 -55047 -63650 -90493 -74878 -51921 -49319 -39102
6695c9102k384r859M716K1945K1313M0911L944l8035q544k5807n729L2584j0305
$$ -39102 -41486 -51345 -46629 -24684 -3371 37540 41484 3449 -5095 -30902 -36631 -4047 -14352
6682a4352j6908Q707j9391K8375M0294j2117k4433j6415m327M5474K9776j7502
$$ -14352 -31260 -22553 -41944 -13569 26725 14608 -9825 -26240 -30567 14907 44683 27181
6670B7181m5832J579J3127j3624L486L1594l9632m0209j3489K8977K1332K8442
$$ 27181 -18651 -17072 -3945 -17569 -14083 17511 -22121 -62330 -75819 -46842 -25510 2932
6658B932J6450j4112m11K8170N4110o167n6055o1687j6319n26K4649P326j2252
$$ 2932 19382 5270 4859 33029 87139 80972 24917 -36770 -53089 -53615 -28966 -21640 -33892
6645c3892P819J7762J0823j0853q78J3113Q844l3858R354K6333Q690K024O377
$$ -33892 -26073 -8311 2512 -8341 -9219 3894 12738 -21120 -11766 14567 23257 25281 31658
6632C1658R701o472K9631O035k4709l5143l0549L985k6380Q748K2824j1565l872
$$ 31658 41359 34887 64518 70553 45844 10701 -19848 -15863 -42243 -33495 -10671 -22236 -26108
6619b6108N884k6178l506K9979R137J3595j2070k5243k1950k572J4746M6096K4553
$$ -26108 -20224 -46402 -49908 -19929 -10792 2803 -9267 -34510 -56460 -59032 -44286 1810 26363
6606B6363p12j1543j1849l7402j6201R125K3714r965k829j3528k8088L0348r281
$$ 26363 25651 14108 2259 -35143 -51344 -42219 -18505 -28470 -31299 -44827 -72915 -42567 -51848
6593e1848j7135p881L2083K3501k587p900k731o102M341P400J0606L16L3787q844
$$ -51848 -68983 -76864 -44781 -21280 -23867 -31767 -34498 -40600 -36259 -28859 -18253 -17937 15850 7006
6579G006m018K5503Q609N053j7370k0094J279L202K8468j0669m4610l2636K6704
$$ 7006 2988 28491 37100 42153 24783 4689 5968 9170 37638 26969 -17641 -50277 -23573
6566b3573J0678j4452K312p216Q055K7202j5810J0418j842j6142j2892l5569j3214
$$ -23573 -12895 -27347 -25035 -32251 -24196 3006 -12804 -2386 -4228 -20370 -33262 -68831 -82045
6553h2045K1285L330K9243j313M3299K5164j5522k1575j717l6624J8304j8606
$$ -82045 -60760 -57430 -28187 -29500 13799 38963 23441 1866 149 -36475 -18171 -36777
6541c6777O75M1901L4805K230m9318K2423J6639K9973k7345j7282L4875j6955
$$ -36777 -36102 5799 40604 42834 -6484 15939 32578 62551 35206 17924 52799 35844
6529C5844k9950J874J7158j5915k1217j5084J925O173j3142J1349l358M819K0489
$$ 35844 5894 7768 24926 9011 -12206 -27290 -25365 -19192 -32334 -20985 -24343 -19524 965
6516I65k5553j5490k5114m380K0334K9102J0717l5513L4572L6110n22j8782k09
$$ 965 -24588 -40078 -65192 -69572 -49238 -20136 -9419 -44932 -10360 25750 25228 6446 6237
6503F237J1435l756j5221q008K171J652l668M407m450k076K169l851K0658l675
$$ 6237 17672 13916 -1305 -9313 -7142 -5490 -9158 -4751 -9201 -11277 -9108 -12959 7699 4024
6489D024j0633l9239J1194K2963J4532j4221o6321j0404N448k7241N775o534J2326
$$ 4024 -6609 -45848 -34654 -11691 2841 -11380 -77701 -88105 -82657 -109898 -104123 -110657 -98331
6476i8331N6787J5242j9391K2830K5299M3078k459q890k7768j1772j475o502N341
$$ -98331 -41544 -26302 -45693 -22863 2436 45514 43055 34165 6397 -5375 -6850 -13352 -8011
6463h011q508k2332K9694L8171o24R8M6198M381j3406j5329j4180K2104j4173
$$ -8011 -16519 -38851 -9157 29014 28390 28488 74686 79067 65661 50332 36152 58256 44083
$$ [...]
##END NTUPLES=NMR SPECTRUM
##END=
