##TITLE=Analysis number 315850
Compound Code sb 01867
Project Code adrs
Chemist Name stores
##JCAMPDX= 6.0         $$ Bruker NMR JCAMP-DX V2.0
##DATA TYPE= NMR SPECTRUM
##DATA CLASS= NTUPLES
##ORIGIN= Bruker BioSpin GmbH
##OWNER= NMR
$$ XWIN-NMR		Version 3.5
$$ Tue Dec  6 10:36:12 2005 GMT Standard Time (UT+0h)  MAYBRIDGE\NMR@NMR_250MHZ
##.OBSERVE FREQUENCY= 250.131544655141
##.OBSERVE NUCLEUS= ^1H
##.ACQUISITION MODE= SIMULTANEOUS (DQD)
##.ACQUISITION SCHEME= undefined
##.AVERAGES= 16
##.DIGITISER RES= 18
##SPECTROMETER/DATA SYSTEM= dpx250
##.PULSE SEQUENCE= zg30
##.SOLVENT NAME= DMSO
##.SHIFT REFERENCE= (INTERNAL, DMSO, 0, 16.522)
##AUDIT TRAIL= $$ (NUMBER, WHEN, WHO, WHERE, WHAT)
$$ ##TITLE= Audit trail, XWIN-NMR		Version 3.5
$$ ##JCAMPDX= 5.01
$$ ##ORIGIN= Bruker BioSpin GmbH
$$ ##OWNER= NMR
$$ C:\u/data/dgb/nmr/ADRS/13430/pdata/1/auditp.txt
$$ ##AUDIT TRAIL=  $$ (NUMBER, WHEN, WHO, WHERE, WHAT)
(   1,<2005-12-06 10:35:43.96 +000>,<MAYBRIDGE\NMR>,<NMR_250MHZ>,
      <created by zg, POWCHK disabled, PULCHK disabled
       configuration hash MD5:
       62 19 C7 07 E1 42 D1 B7 37 6C 3D D0 77 39 F9 E6
       data hash MD5: 64K
       24 B6 95 A9 B6 B7 D2 92 93 C9 5E A9 0C 69 FD A5>)
(   2,<2005-12-06 10:35:57.60 +000>,<MAYBRIDGE\NMR>,<NMR_250MHZ>,
      <Start of raw data processing
       ef LB = 0.3 FT_mod = 6 PKNL = 1 SI = 32K 
       data hash MD5: 32K
       F6 A3 6C AC EE 61 2F C0 92 5C 3E 54 18 69 91 AF>)
(   3,<2005-12-06 10:35:59.90 +000>,<MAYBRIDGE\NMR>,<NMR_250MHZ>,
      <apk 
       data hash MD5: 32K
       4E AC E7 60 77 E0 D1 33 3A AD 26 27 59 D2 B4 2C>)
(   4,<2005-12-06 10:36:00.76 +000>,<MAYBRIDGE\NMR>,<NMR_250MHZ>,
      <abs ABSG = 5 
       data hash MD5: 32K
       E9 74 23 6D B9 8F CC 32 58 17 0E DF BA EF A2 1C>)
$$ ##END=
$$ 
$$ hash MD5
$$ 1F 6F B9 B9 85 2C 44 1E 50 91 52 06 C4 64 93 69
##$RELAX= 
##$RELAX= 
##$RELAX= 
##$RELAX= 
##$RELAX= 
##$RELAX= 
##$RELAX= 
$$ Bruker specific parameters
$$ --------------------------
##$DU= <C:\u>
##$EXPNO= 13430
##$NAME= <ADRS>
##$PROCNO= 1
##$TYPE= <nmr>
##$USER= <dgb>
##$AMP= (0..31)
100 100 100 100 100 100 100 100 100 100 100 100 100 100 100 100 100 100 
100 100 100 100 100 100 100 100 100 100 100 100 100 100 
##$AQSEQ= 0
##$AQ_mod= 3
##$AUNM= <au_zg>
##$AUTOPOS= <54 >
##$BF1= 250.13
##$BF2= 250.13
##$BF3= 250.13
##$BF4= 250.13
##$BF5= 500.13
##$BF6= 500.13
##$BF7= 500.13
##$BF8= 500.13
##$BYTORDA= 1
##$CFDGTYP= 0
##$CFRGTYP= 5
##$CHEMSTR= <none>
##$CNST= (0..31)
1 1 145 1 1 1 1 1 1 1 1 1 1 1 1 1 1 1 1 1 1 1 1 1 1 1 1 1 1 1 1 1 
##$CPDPRG= <>
##$CPDPRG1= <>
##$CPDPRG2= <>
##$CPDPRG3= <>
##$CPDPRG4= <mlev>
##$CPDPRG5= <mlev>
##$CPDPRG6= <mlev>
##$CPDPRG7= <mlev>
##$CPDPRG8= <mlev>
##$CPDPRGB= <>
##$CPDPRGT= <>
##$D= (0..31)
0 1 0 0 0 0 0 0 0 0.06 0 0 0 0 0 0 0.0002 0 0 0 0 0 0 0 0 0 0 0 0 0 0 
0 
##$DATE= 1133865338
##$DBL= (0..7)
120 120 120 120 120 120 120 120 
##$DBP= (0..7)
150 150 150 150 150 150 150 150 
##$DBP07= 0
##$DBPNAM0= <>
##$DBPNAM1= <>
##$DBPNAM2= <>
$$ [...]
##$SUBNAM7= <"">
##$SUBNAM8= <"">
##$SUBNAM9= <"">
##$SW= 20.6930455092707
##$SWIBOX= (0..15)
0 0 3 0 0 0 0 0 0 0 0 0 0 0 0 0 
##$SW_h= 5175.983436853
##$TD= 65536
##$TD0= 1
##$TE= 294.16
##$TE2= 300
##$TE3= 300
##$TEG= 300
##$TL= (0..7)
0 120 120 120 120 120 120 120 
##$TP= (0..7)
150 150 150 150 150 150 150 150 
##$TP07= 0
##$TPNAME0= <>
##$TPNAME1= <>
##$TPNAME2= <>
##$TPNAME3= <>
##$TPNAME4= <>
##$TPNAME5= <>
##$TPNAME6= <>
##$TPNAME7= <>
##$TPOAL= (0..7)
0.5 0.5 0.5 0.5 0.5 0.5 0.5 0.5 
##$TPOFFS= (0..7)
0 0 0 0 0 0 0 0 
##$TUNHIN= 0
##$TUNHOUT= 0
##$TUNXOUT= 0
##$USERA1= <user>
##$USERA2= <user>
##$USERA3= <user>
##$USERA4= <user>
##$USERA5= <user>
##$V9= 5
##$VALIST= <valist>
##$VCLIST= <CCCCCCCCCCCCCCC>
##$VD= 0
##$VDLIST= <DDDDDDDDDDDDDDD>
##$VPLIST= <PPPPPPPPPPPPPPP>
##$VTLIST= <TTTTTTTTTTTTTTT>
##$WBST= 1024
##$WBSW= 4
##$XGAIN= (0..3)
0 0 0 0 
##$XL= 0
##$YL= 0
##$YMAX_a= 331412
##$YMIN_a= -381409
##$ZGOPTNS= <>
##$ZL1= 120
##$ZL2= 120
##$ZL3= 120
##$ZL4= 120
##$ABSF1= 16.522
##$ABSF2= -4.171173
##$ABSG= 5
##$ABSL= 3
##$ALPHA= 0
##$AQORDER= 0
##$ASSFAC= 0
##$ASSFACI= 0
##$ASSFACX= 0
##$ASSWID= 0
##$AUNMP= <proc_1d>
##$AZFE= 0.1
##$AZFW= 0.1
##$BCFW= 0
##$BC_mod= 0
##$BYTORDP= 0
##$COROFFS= 0
##$CY= 12.5
##$DATMOD= 1
##$DC= 0
##$DFILT= <>
##$DTYPP= 0
##$F1P= 14.0000005364418
##$F2P= -0.99999901652339
##$FCOR= 0.5
##$FTSIZE= 32768
##$FT_mod= 6
##$GAMMA= 0
##$GB= 0
##$INTBC= 1
##$INTSCL= 1
##$ISEN= 128
##$LB= 0.3
##$LEV0= 0
##$LPBIN= 0
##$MAXI= 10000
##$MC2= 0
##$MEAN= 0
##$ME_mod= 0
##$MI= 0
##$NCOEF= 0
##$NC_proc= -5
##$NLEV= 6
##$NOISF1= 0
##$NOISF2= 0
##$NSP= 0
##$NTH_PI= 0
##$NZP= 0
##$OFFSET= 16.522
##$PC= 1
##$PHC0= 86.89469
##$PHC1= -9.903346
##$PH_mod= 1
##$PKNL= yes
##$PPARMOD= 0
##$PSCAL= 4
##$PSIGN= 0
##$REVERSE= no
##$SF= 250.13
##$SI= 32768
##$SIGF1= 0
##$SIGF2= 0
##$SINO= 400
##$SIOLD= 32768
##$SREGLST= <1H.DMSO>
##$SSB= 0
##$STSI= 32768
##$STSR= 0
##$SW_p= 5175.98343685301
##$SYMM= 0
##$S_DEV= 0
##$TDeff= 65536
##$TDoff= 0
##$TI= <Analysis number 999999
Compound Code 99
Book Reference 9
Project Code 9>
##$TILT= no
##$TM1= 0
##$TM2= 0
##$TOPLEV= 0
##$USERP1= <user>
##$USERP2= <user>
##$USERP3= <user>
##$USERP4= <user>
##$USERP5= <user>
##$WDW= 1
##$XDIM= 32768
##$YMAX_p= 416042991
##$YMIN_p= -2899745
$$ End of Bruker specific parameters
$$ ---------------------------------
##NTUPLES= NMR SPECTRUM
##VAR_NAME=  FREQUENCY,     SPECTRUM/REAL,   SPECTRUM/IMAG
##SYMBOL=    X,             R,               I
##VAR_TYPE=  INDEPENDENT,   DEPENDENT,       DEPENDENT
##VAR_FORM=  AFFN,          ASDF,            ASDF
##VAR_DIM=   32768,         32768,           32768
##UNITS=     HZ,            ARBITRARY UNITS, ARBITRARY UNITS
##FACTOR=    0.157963299565203, 1,           1
##FIRST=     4132.6476996994, 0,             0
##LAST=      -1043.33573715361, 0,           0
##MIN=       -1043.33573715361, -2899745,    0
##MAX=       4132.6476996994, 416042991,     0
$$ Real data points
##PAGE= N=1
##DATA TABLE= (X++(R..R)), XYDATA
$$ [...]
$$ plain form
25912 202678 312809 280337 21418 181382 287070 99154 57915 30896 6789 19149
25902 19149 110933 238360 307259 247469 169047 -26990 -99498 -8294 90548 89636 -10832
25891 -10832 116226 190415 263367 237048 180992 127150 104600 175785 304174 354546 368853
25880 368853 299299 348129 326292 158292 146058 94894 -15771 217672 379392 539074
25870 539074 549327 425779 397415 365563 281324 263140 199844 274684 198167 134160 156394
25859 156394 300209 451521 390150 231553 287911 175394 142394 206127 173853 149245 272980
25848 272980 246605 204640 200139 101885 -13253 64067 136116 78573 86722 90802 171435 303818
25836 303818 313182 292302 231013 179900 27156 -2934 -35807 48588 115245 210111 295348
$$ packed form
25912B02678J10131l2472k58919J59964J05688j87916m1239k7019k4107J2360
25902A9149R1784J27427O8899n9790p8422j96037p2508R1204R8842r12j00468
25891a0832J27058P4189P2952k6319n6056n3842k2550P1185J28389N0372J4307
25880C68853o9554M8830k1837j68000j2234n1164j10665K33443J61720J59682
25870E39074J0253j23548k8364l1852q4239j8184o3296P4840p6517o4007K2234
25859A56394J43815J51312o1371j58597N6358j12517l3000O3733l2274k4608J23735
25848B72980k6375m1965m501r8254j15138P7320P2049n7543Q149M080Q0633J32383
25836C03818R364k0880o1289n1113j52744l0090l2873Q4395O6657R4866Q5237
$$ plain form
25825 295348 351240 495326 386018 330307 370172 302327 357332 141499 317 188896
25815 188896 127352 1175 3060 -131596 -46617 63717 42861 89768 225865 214649 236452
25804 236452 274161 167175 121666 96639 145857 81568 -55710 -80124 103002 246506 266078
25793 266078 203718 112282 97554 222947 170039 91143 52888 -5163 -5759 98812 262002
25782 262002 237785 140043 157649 173730 180266 274687 256622 192791 280869 309734 218359 192815
25770 192815 337351 539631 512640 402828 363897 235489 226648 396111 457272 397262 174851
25759 174851 93562 188277 207830 166735 160049 314815 454022 352013 101084 76856 220361
25748 220361 292560 263470 454646 219035 162284 377904 403094 196422 259068 303157 257765
$$ packed form
25825B95348N5892J44086j09308n5711L9865o7845N5005k15833j41182J88579
25815A88896o1544j26177J885j34656Q4979J10334k0856M6907J36097j1216K1803
25804B36452L7709j06986m5509k5027M9218o4289j37278k4414J83126J43504J9572
25793B66078o2360r1436j4728J25393n2908p8896l8255n8051n96J04571J63190
25782B62002k4217r7742J7606J6081O536R4421j8065o3831Q8078K8865r1375k5544
25770A92815J44536K02280k6991j09812l8931j28408q841J69463O1161o0010k22411
25759A74851q1289R4715J9553m1095o686J54766J39207j02009k50929k4228J43505
25748B20361P2199k9090J91176k35611n6751K15620K5190k06672O2646M4089m5392
$$ plain form
25737 257765 215942 63010 61831 212421 326110 386694 333208 262270 311705 261225 280133
25726 280133 267773 240132 207784 102541 37573 116022 262588 120110 193349 322743 393225
25715 393225 179310 53227 291164 309954 199867 344129 390612 402039 424644 484029
25705 484029 347115 201854 197408 108901 248002 184764 251620 415413 283896 223139 147806
25694 147806 229388 177856 300870 343472 313019 438127 407057 183566 11476 127318
25684 127318 231957 257784 133915 72174 160834 93557 -17971 -6911 31513 122984 207868
25673 207868 132127 137266 68404 89007 289837 416851 434575 235777 156914 91689 63606
25662 63606 121445 76889 50609 80310 111039 146833 66295 119217 115267 118719 58023 49780
$$ packed form
25737B57765m1823j52932j179J50590J13689O0584n3486p0938M9435n0480J8908
25726B80133j2360k7641l2348j05243o4968P8449J46566j42478P3239J29394P0482
25715C93225k13915j26083K37937J8790j10087J44262M6483J1427K2605N9385
25705D84029j36914j45261m446q8507J39101o3238O6856J63793j31517o0757p5333
25694A47806Q1582n1532J23014M2602l0453J25108l1070k23491j72090J15842
25684A27318J04639K5827j23869o1741Q8660o7277j11528J1060L8424R1471Q4884
25673B07868p5741N139o8862K0603K00830J27014J7724j98798p8863o5225k8083
25662F3606N7839m4556k6280K9701L0729L5794q0538N2922l950L452o0696q243
$$ plain form
25650 49780 84838 145948 220638 386375 250006 -48190 -40511 138951 116495 152354 124574
25639 124574 110403 79742 173818 281362 273044 60480 103350 272687 361138 317868 281026
25628 281026 168390 25248 41189 163928 310940 280903 283801 299112 340320 308709 324780
25617 324780 329202 185972 103771 233774 321223 143106 75786 44713 -12073 -38663 157171
25606 157171 283574 357505 362499 171569 -22116 100738 199358 389424 433190 254109
25596 254109 229837 237021 185744 177049 164344 193494 225173 262565 434622 326721 272605
25585 272605 329763 361696 390214 244654 122338 18474 -53722 61924 320880 238261
25575 238261 160954 215980 198011 238256 471314 574672 549913 568806 386921 295438 416717
$$ packed form
25650D9780L5058O1110P4690J65737j36369k98196P679J79462k2456L5859k7780
25639A24574j4171l0661R4076J07544q318k12564M2870J69337Q8451m3270l6842
25628B81026j12636j43142J5941J22739J47012l0037K898J5311M1208l1611J6071
25617C24780M422j43230q2201J30003Q7449j78117o7320l1073n6786k6590J95834
25606A57171J26403P3931M994j90930j93685J22854R8620J90066M3766j79081
25596B54109k4272P184n1277q695j2705K9150L1679L7392J72057j07901n4116
25585B72605N7158L1933K8518j45560j22316j03864p2196J15646K58956q2619
25575B38261p7307N5026j7969M0245K33058J03358k4759J8893j81885r1483J21279
$$ plain form
25564 416717 288422 268363 377036 460623 566256 504902 390423 349887 491820 620048
25554 620048 556405 405070 277651 283411 314777 287895 313626 327219 422325 500758 398377
25543 398377 297065 397232 373890 281752 256109 152257 78938 118333 120459 135879 123154
25532 123154 271653 366283 253178 114735 77757 168510 185090 208627 244117 194953 141503
25521 141503 80985 24610 67791 37324 -59925 -61940 -96752 30344 12667 -92115 -48354
25510 -48354 103565 230248 438399 471416 318687 179173 92126 181305 249793 335417 442826
25499 442826 396316 422582 349719 177538 138729 280333 373853 261481 288049 442577 457016
25488 457016 217960 266910 339835 332693 263156 187506 66160 -10308 52634 66378 88197
$$ packed form
25564D16717j28295k0059J08673Q3587J05633o1354j14479m0536J41933J28228
25554F20048o3643j51335j27419N760L1366k6882K5731J3593R5106P8433j02381
25543C98377j01312J00167k3342r2138k5643j03852p3319L9395K126J5420j2725
25532A23154J48499R4630j13105j38443l6978R0753J6580K3537L5490m9164n3450
25521A41503o0518n6375M3181l0467r7249k015l4812J27096j7677j04782M3761
25510d8354J51919J26683K08151L3017j52729j39514q7047Q9179O8488Q5624J07409
25499D42826m6510K6266p2863j72181l8809J41604R3520j12372K6568J54528J4439
25488D57016k39056M8950P2925p142o9537p5650j21346p6468O2942J3744K1819
$$ plain form
25477 88197 168130 138857 132273 268719 327490 246370 322028 307095 282122 246520 288558 406643
25465 406643 400692 332262 294014 257677 207203 224785 258935 233671 312095 391426 379395 369063
25453 369063 255816 206356 345041 391247 226837 71742 173018 232986 255269 346175
25443 346175 285786 181728 289128 358856 312756 365222 333069 476962 660772 796445
25433 796445 735213 585993 377326 306804 478782 477171 318521 213751 237216 393635
25423 393635 399594 423720 248221 -151701 -172064 4854 97455 186204 344706 408524 450170
25412 450170 378219 144992 196364 291561 186113 307541 424038 369231 134222 -25722
25402 -25722 2549 48697 49303 163495 129660 176437 270530 337529 343761 411589 566351 629829
$$ packed form
25477H8197P9933k9273o584J36446N8771q1120P5658j4933k4973l5602M2038J18085
25465D06643n951o8430l8248l6337n0474J7582L4150k5264P8424P9331j2031j0332
25453C69063j13247m9460J38685M6206j64410j55095J01276N9968K2283R0906
25443C46175o0389j04058J07400O9728m6100N2466l2153J43893J83810J35673
25433G96445o1232j49220k08667p0522J71978j611j58650j04770K3465J56419
25423C93635N959K4126j75499l99922k0363J76918R2601Q8749J58502O3818M1646
25412D50170p1951k33227N1372R5197j05448J21428J16497n4807k35009j59944
25402b5722K8271M6148O06J14192l3835M6777R4093O6999O232O7828J54762O3478
$$ plain form
25390 629829 475740 201774 52969 196139 254422 384707 298991 237897 247587 251661 312997
25379 312997 292123 154647 220661 125661 178960 247651 37176 -63778 -87031 33655 224544
25368 224544 342980 225224 169893 139971 277857 379590 338049 297534 502171 328442
25358 328442 325344 321818 245868 86481 7744 217239 429086 445501 181973 187512 340292
25347 340292 509569 533764 333577 284766 396013 547661 555328 490931 577060 559903 562601
25336 562601 536884 470978 328178 378398 338728 498869 427090 267485 249464 162835 221836
25325 221836 273266 350698 300862 179343 287242 262992 461840 491195 488484 411719 229031
25314 229031 216610 197922 286742 284334 414726 526455 514060 464104 448364 377256 319441
$$ packed form
25390F29829j54089k73966j48805J43170N8283J30285q5716o1094R690M074O1336
25379C12997k0874j37476O6014r5000N3299O8691k10475j00954k3253J20686J90889
25368B24544J18436j17756n5331k9922J37886J01733m1541m0515K04637j73729
25358C28442l098l526p5950j59387p8737K09495K11847J6415k63528N539J52780
25347C40292J69277K4195k00187m8811J11247J51648P667o4397Q6129j7157K698
25336E62601k5717o5906j42800N0220l9670J60141p1779j59605j8021q6629N9001
25325B21836N1430P7432m9836j21519J07899k4250J98848K9355k711p6765j82688
25314B29031j2421j8688Q8820k408J30392J11729j2395m9956j5740p1108n7815
$$ plain form
25303 319441 242987 417499 490215 230342 131254 1363 -54230 135098 238166 244814 329894
25292 329894 384802 264264 148460 174893 202436 263039 198828 291226 351226 221427 64365
25281 64365 92343 206311 151594 307051 557453 575345 243506 157818 54541 25471 152310
25270 152310 350042 373176 248740 333116 353179 368280 426787 297294 180295 59013
25260 59013 104602 290072 301565 47899 -1310 151924 183538 327142 192460 244620 194797
25249 194797 205629 194921 89707 -106554 -96809 20769 32850 131594 153140 169272 198004
25238 198004 171815 107214 92738 262258 395868 326909 357128 369013 402702 410022 356525
25227 356525 425084 576466 456490 228692 182818 307739 199777 166618 426329 462139
$$ packed form
25303C19441p6454J74512P2716k59873r9088j29891n5593J89328J03068O648Q5080
25292C29894N4908j20538j15804K6433K7543O0603o4211R2398O0000j29799j57062
25281F4365K7978J13968n4717J55457K50402J7892l31839q5688j03277k9070J26839
25270A52310J97732K3134j24436Q4376K0063J5101N8507j29493j16999j21282
25260E9013M5589J85470J1493k53666m9209J53234L1614J43604j34682N2160m9823
25249A94797J0832j0708j05214j96261R745J17578J2081R8744K1546J6132K8732
25238A98004k6189o4601j4476J69520J33610o8959L0219J1885L3689P320n3497
25227C56525O8559J51382j19976k27798m5874J24921j07962l3159K59711L5810
$$ plain form
25217 462139 370541 326207 512966 479326 380397 428811 518234 651960 535926 578393 505341
25206 505341 237607 141365 163430 147107 168058 436092 462130 365378 365047 425202 378515
25195 378515 354629 298598 316380 509671 360205 173055 285125 342310 312246 379667 368293
25184 368293 486161 439672 328478 121101 123587 173714 28220 85877 117826 192086 286893
25173 286893 372530 257261 245009 363129 374953 342059 296954 360031 255677 110043 33038
25162 33038 83626 249136 285594 394922 412167 190837 193099 135395 82346 19887 -35976
25151 -35976 138351 282742 289016 169122 17428 5981 143009 138995 225027 333162 373048
25140 373048 279052 253800 412585 437019 498509 544606 453882 394450 271693 131252 232153
$$ packed form
25217D62139r1598m4334J86759l3640r8929M8414Q9423J33726j16034M2467p3052
25206E05341k67734r6242K2065j6323K0951K68034K6038r6752l31O0155m6687
25195C78515k3886n6031J7782J93291j49466j87150J12070N7185l0064O7421j1374
25184C68293J17868m6489j11194k07377K486N0127j45494N7657L1949P4260R4807
25173B86893Q5637j15269j2252J18120J1824l2894m5105O3077j04354j45634p7005
25162C3038N0588J65510L6458J09328J7245k21330K262n7704n3049o2459n5863
25151c5976J74327J44391O274j19894j51694j1447J37028m014Q6032J08135L9886
25140C73048r3996k5252J58785K4434O1490M6097r0724n9432j22757j40441J00901
$$ plain form
25129 232153 331387 280004 330618 342081 402819 416788 539329 468122 327021 258509 314467
25118 314467 527215 662834 563560 682287 712355 583393 457176 372289 321585 337915
25108 337915 171045 155569 288687 190271 102274 92052 271205 226463 293484 132165 125370
25097 125370 150735 233062 221044 93265 203708 269337 306828 356316 323854 257808 167159
25086 167159 260074 339223 310974 334365 191081 260001 390804 337450 380466 451331 388849
25075 388849 485927 519469 549798 489771 459283 487009 351531 154709 234441 178864 177659
25064 177659 403437 436073 529868 366272 195666 312144 266911 194360 38827 -14082
25054 -14082 137901 181969 238345 252481 228416 320115 330390 458200 250412 94354 -7455
$$ packed form
25129B32153R9234n1383N0614J1463O0738J3969J22541p1207j41101o8512N5958
25118C14467K12748J35619r9274J18727L0068j28962j26217q4887n0704J6330
25108C37915j66870j5476J33118r8416q7997j0222J79153m4742O7021j61319o795
25097A25370K5365Q2327j2018j27779J10443O5629L7491M9488l2462o6046r0649
25086A67159R2915P9149k8249K3391j43284O8920J30803n3354M3016P0865o2482
25075C88849R7078L3542L0329o0027l0488K7726j35478j96822P9732n5577j205
25064A77659K25778L2636R3795j63596j70606J16478m5233p2551j55533n2909
25054a4082J51983M4068N6376J4136k4065R1699J0275J27810k07788j56058j01809
$$ plain form
25043 -7455 9378 -12617 52449 249233 202585 17559 100860 66582 95345 173336 399907
25032 399907 552360 476171 474788 342488 315459 356438 397089 538898 554871 344820 367144
25021 367144 397998 384346 472352 462698 469821 331842 165744 137319 224850 198254 128989
25010 128989 148038 370544 465036 400886 398329 400101 372946 299071 204096 246307 267152 146813
24998 146813 278895 341352 318768 200840 226531 274439 345406 324793 351623 298449 263835
24987 263835 295551 281654 319169 360404 355655 338750 351337 535123 560863 561236 420245 113618
24975 113618 60690 152168 149438 11615 54692 195555 182662 255497 344625 323227 306993
24964 306993 202351 333021 432923 640129 674021 615870 603542 491672 466725 399801 292717
$$ packed form
25043g455J6833k1995O5066J96784m6648j85026Q3301l4278K8763P7991K26571
25032C99907J52453p6189j383j32300k7029M0979M0651J41809J5973k10051K2324
25021C67144L0854j3652Q8006r654P123j37979j66098k8425Q7531k6596o9265
25010A28989J9049K22506R4492o4150k557J772k7155p3875r4975M2211K0845j20339
24998A46813J32082O2457k2584j17928K5691M7908P0967k0613K6830n3174l4614
24987B63835L1716j3897L7515M1235m749j6905J2587J83786K5740L73j40991l06627
24975A13618n2928R1478k730j37823M3077J40863j2893P2835Q9128k1398j6234
24964C06993j04642J30670R9902K07206L3892n8151j2328j11870k4947o6924j07084
$$ plain form
24953 292717 213767 363892 421386 396039 466987 563673 622908 466749 435663 325525 291307
24942 291307 236911 139867 100011 163422 42826 256619 542138 475659 399432 289574 444027
24931 444027 321502 103967 62458 149199 138213 309081 458990 404962 171415 114184
24921 114184 283015 371366 371381 264341 215916 363601 178548 136816 283977 303959 203758
24910 203758 345241 587435 538734 447783 479089 521543 333740 250016 266729 276265 451790
24899 451790 485736 444568 176763 161718 232182 145009 145315 142405 134841 25468 24557 80074
24887 80074 14359 9608 158143 190348 229891 384628 458672 312386 88148 139885 318588
24876 318588 397535 401771 294855 142313 146204 89409 120723 182775 220367 330114 259044
$$ packed form
24953B92717p8950J50125N7494k5347P0948R6686N9235j56159l1086j10138l4218
24942B91307n4396r7044l9856O3411j20596K13793K85519o6479p6227j09858J54453
24931D44027j22525k17535m1509Q6741j0986J70868J49909n4028k33547n7231
24921A14184J68831Q8351J5j07040m8425J47685j85053m1732J47161J9982j00201
24910B03758J41483K42194m8701r0951L1306M2454j87803q3724J6713R536J75525
24899D51790L3946m1168k67805j5045P0464q7173L06k910p564j09373r11N5517
24887H0074o5715m751J48535L2205L9543J54737P4044j46286k24238N1737J78703
24876C18588P8947M236j06916j52542L891n6795L1314O2052L7592J09747p1070
$$ plain form
24865 259044 220654 299925 160412 47979 58412 153233 215532 163924 218376 344503 366454
24854 366454 366267 393819 349764 236936 306336 307290 161609 167059 290577 386382 463892 440851
24842 440851 283403 178064 132805 177902 79943 77175 162062 261857 231335 277750 318977
24831 318977 415107 492704 520152 330645 336352 282486 314188 206823 186947 343609 419694
24820 419694 466077 373553 196912 143568 -13296 -194903 -98622 54155 234361 250706
24810 250706 281167 297272 275942 345200 415408 415791 441056 418031 443872 426160 346245 299180
24798 299180 336003 350333 243148 207187 225080 399770 468121 415498 277715 336740 394273
24787 394273 377758 286411 324814 441108 558750 520010 384904 325010 264446 222133 175821
$$ packed form
24865B59044l8390P9271j39513j12433J0433R4821O2299n1608N4452J26127K1951
24854C66454j87K7552m4055j12828O9400R54j45681N450J23518R5805P7510k3041
24842D40851j57448j05339m5259M5097r7959k768Q4887R9795l0522M6415M1227
24831C18977R6130P7597K7448j89507N707n3866L1702j07365j9876J56662P6085
24820D19694M6383r2524j76641n3344j56864j81607R6281J52777J80206J6345
24810B50706L0461J6105k1330O9258P0208L83K5265k3025K5841j7712p9915m7065
24798B99180L6823J4330j07185l5961J7893J74690O8351n2623j37783N9025N7533
24787C94273j6515r1347L8403J16294J17642l8740j35106n9894o0564m2313m6312
$$ plain form
24776 175821 75583 -1420 -18562 -86331 163283 308431 279039 247706 266169 286200 200713
24765 200713 75595 110053 251368 341454 173891 104025 121438 20548 10695 105974 224862
24754 224862 256594 278269 348691 412798 280456 355322 408451 277295 142076 207316 376412
24743 376412 133900 90135 60945 163226 308725 437387 653671 617760 456240 484093
24733 484093 434060 368045 488479 484835 467571 495445 594118 534756 500112 511126 509672 265870
24721 265870 194696 311715 349655 249735 224736 194836 179441 273999 270471 370742 444000
24710 444000 370856 493761 442732 296802 260315 252997 197450 385541 359091 268273 169686
24699 169686 249245 459514 535992 487740 416665 207455 65454 140069 204874 256565 276717
$$ packed form
24776A75821j00238p7003j7142o7769K49614J45148k9392l1333J8463K0031q5487
24765B00713j25118L4458J41315R0086j67563o9866J7413j00890r853R5279J18888
24754B24862L1732K1675P0422O4107j32342P4866N3129j31156j35219O5240J69096
24743C76412k42512m3765k9190J02281J45499J28662K16284l5911j61520K7853
24733D84093n0033o6015J20434l644j7264K7874R8673n9362l4644J1014j454k43802
24721B65870p1174J17019L7940r9920k4999k9900j5395R4558l528J00271P3258
24710D44000p3144J22905n1029j45930l6487p318n5547J88091k6450r0818r8587
24699A69686P9559K10269P6478m8252p1075k09210j42001P4615O4805N1691K0152
$$ plain form
24688 276717 419891 517548 407572 309047 306922 299149 198393 164313 310916 343324 425891
24677 425891 423466 334457 462245 402595 377793 341499 345374 278658 315358 357111 251023
24666 251023 165613 150712 359182 611432 765539 699204 540182 570683 391081 245134
24656 245134 159280 282274 227589 122021 101596 68499 10438 90149 266818 486193 652647
24645 652647 534163 483020 532665 525430 613354 685977 492204 219849 194175 172848 162397
24634 162397 338678 433005 248739 123559 249229 305195 419207 547983 517279 454143
24624 454143 334236 311298 322446 274282 272343 344104 227709 181606 161254 105513 22103
24613 22103 -19447 -49234 -32313 255751 381918 214637 278482 418703 345700 210319 204050
$$ packed form
24688B76717J43174R7657j09976r8525k125p773j00756l4080J46603L2408Q2567
24677D25891k425q9009J27788n9650k4802l6294L875o6716L6700M1753j06088
24666B51023q5410j4901K08470K52250J54107o6335j59022L0501j79602j45947
24656B45134q5854J22994n4685j05568k0425l3097n8061P9711J76669K19375J66454
24645F52647j18484n1143M9645p235Q7924P2623j93773k72355k5674k1327j0451
24634A62397J76281R4327j84266j25180J25670N5966J14012J28776l0704o3136
24624D54143j19907k2938J1148m8164j939P1761j16395m6103k0352n5741q3410
24613B2103m1550k9787J6921K88064J26167j67281O3845J40221p3003j35381o269
$$ plain form
24602 204050 120773 262859 420586 299314 241648 196653 171446 256331 237431 58117 -217896
24591 -217896 -317089 -186655 -4051 286372 414051 275582 197197 228907 149827 93579
24581 93579 329673 361331 288526 344308 289592 301243 266116 125842 49570 29005 48381
24570 48381 264565 208251 186585 239604 222135 223145 327204 427641 346250 255397 191966
24559 191966 287506 311563 237867 171440 27013 100091 237683 239610 241069 249279 171313 177756
24547 177756 227553 92011 31236 72589 103822 143736 122124 323924 390441 434116 406490
24536 406490 395729 416730 372902 311844 352488 429111 233781 106758 272409 167584 -135597
24525 -135597 105956 200442 251426 315845 358764 436555 410860 415258 464697 415999 238721
$$ packed form
24602B04050q3277J42086J57727j21272n7666m4995k5207Q4885j8900j79314k76013
24591b17896r9193J30434J82604K90423J27679j38469p8385L1710p9080n6248
24581I3579K36094L1658p2805N5782n4716J1651l5127j40274p6272k0565J9376
24570D8381K16184n6314k1666N3019j7469J010J04059J00437q1391r0853o3431
24559A91966R5540K4057p3696o6427j44427P3078J37592J927J459Q210p7966O443
24547A77756M9797j35542o0775M1353L1233L9914k1612K01800O6517M3675k7626
24536D06490j0761K1001m3828o1058M0644P6623j95330j27023J65651j04825l03181
24525a35597K41553R4486N0984O4419M2919P7791k5695M398M9439m8698j77278
$$ plain form
24514 238721 150705 207114 314327 213428 177029 149031 130724 159184 92774 129932 175095
24503 175095 165851 174332 264332 381646 368081 173914 242848 313828 328343 283841 200731
24492 200731 144364 239766 503398 700332 582576 466600 414151 369739 236112 163187
24482 163187 85407 221190 305750 236725 202202 99002 139388 238459 207836 264742 427232
24471 427232 332401 205183 278168 300695 330139 350183 356433 420604 302571 217676 287809
24460 287809 241241 203663 184232 230263 232117 301900 289015 231201 28037 -10165 54181
24449 54181 204141 236104 185791 171709 250878 170369 8458 117848 346788 319525 395288
24438 395288 404505 354586 271901 282537 364095 363152 191938 116001 124453 20576 -19749 40570
$$ packed form
24514B38721q8016N6409J07213j00899l6399k7998j8307K8460o6410L7158M5163
24503A75095r244Q481R0000J17314j3565j94167O8934P0980J4515m4502q3110
24492B00731n6367R5402K63632J96934j17756j15976n2449m4412j33627p2925
24482A63187p7780J35783Q4560o9025l4523j03200M0386R9071l0623N6906J62490
24471D27232r4831j27218P2985K2527K9444K0044O250O4171j18033q4895P0133
24460B87809m6568l7578j9431M6031J854O9783j2885n7814k03164l8202O4346
24449E4181J49960L1963n0313j4082P9169q0509j61911J09390K28940k7263P5763
24438C95288R217m9919q2685J0636Q1558r43j71214p5937Q452j03877m0325O0319
$$ plain form
24426 40570 217398 321426 346608 200626 131236 102350 88221 10399 84506 229169 264940
24415 264940 276730 454970 512725 332357 366693 379303 187975 85128 20952 29016 107118
24404 107118 172049 196053 299666 433281 541666 563721 541669 496677 486204 411767 298259
24393 298259 351526 369673 319431 295478 145044 76489 106768 123865 381764 435418 231799
24382 231799 245027 272193 384702 358649 425532 417631 567255 620344 639377 593144 658491
24371 658491 582041 405467 333355 151527 9420 109182 122644 76464 321243 331024 291873
24360 291873 252242 196216 269637 336708 463344 472771 488260 346893 220095 159445 342133
24349 342133 364790 188095 20210 35179 284970 411631 350025 325515 244127 227895 216894
$$ packed form
24426D0570J76828J04028K5182j45982o9390k8886j4129p7822P4107J44663L5771
24415B64940J1790J78240N7755j80368L4336J2610j91328j02847o4176Q064P8102
24404A07118O4931K4004J03613J33615J08385K2055k2052m4992j0473p4437j13508
24393B98259N3267J8147n0242k3953j50434o8555L0279J7097K57899N3654k03619
24382B31799J3228K7166J12509k6053O6883p901J49624N3089J9033m6233O5347
24371F58491p6450j76574p2112j81828j42107R9762J3462m6180K44779R781l9151
24360B91873l9631n6026P3421O7071J26636R427J5489j41367j26798o0650J82688
24349C42133K2657j76695j67885J4969K49791J26661o1606k4510q1388j6232j1001
$$ plain form
24338 216894 205182 133250 -47428 71549 191346 151181 42012 454 116234 164520
24328 164520 83423 141203 180794 106802 61988 54348 -97747 -10197 167672 150025 150028 279558
24316 279558 71139 -27370 -816 181471 112178 39893 131318 159521 247143 271520 258332
24305 258332 121585 73993 116114 293231 415216 199991 75188 101929 95059 74932 237991
24294 237991 327287 457320 417100 386930 521534 549092 435496 302752 332594 371047 357870
24283 357870 354286 225771 233082 365097 498456 489272 502258 399190 207559 169824 128278
24272 128278 82818 120147 160499 -6758 79823 203677 167961 28017 40989 192831 179021
24261 179021 136314 14388 145828 398237 452609 487270 438068 538127 345750 244473
$$ packed form
24338B16894j1712p1932j80678J18977J19797m0165j09169m1558J15780M8286
24328A64520q1097N7780L9591p3992m4814p640j52095Q7550J77869j7647LJ29530
24316B79558k08419r8509K6554J82287o9293p2285R1425K8203Q7622K4377j3188
24305B58332j36747m7592M2121J77117J21985k15225j24803K6741o870k0127J63059
24294B37991Q9296J30033m0220l0170J34604K7558j13596j32744K9842L8453j3177
24283C57870l584j28515P311J32015J33359r184J2986j03068j91631l7735m1546
24272A28278m5460L7329M0352j67257Q6581J23854l5716j39944J2972J51842j3810
24261A79021m2707j21926J31440K52409N4372L4661m9202J00059j92377j01277
$$ plain form
24251 244473 309825 421403 495325 452454 281014 243175 68418 -4163 127443 -624
24241 -624 2224 70705 112624 209836 328727 280085 387694 451910 383644 385959 246478 239198
24229 239198 347652 434606 302800 381281 445647 485738 464496 537208 521090 423772 255441
24218 255441 308927 335686 488939 585221 662774 544126 456139 320699 217611 311786 360195
24207 360195 394728 366274 361073 200648 86339 172306 275760 344660 335908 242353 351622
24196 351622 525929 382706 244938 404530 464310 535994 424062 401175 358338 290731
24186 290731 260155 381205 216824 250432 341603 251025 99121 -24512 -110559 26491
24176 26491 163949 211878 283901 200724 183616 128671 29768 127295 229148 130529 248124
$$ packed form
24251B44473O5352J11578P3922m2871j71440l7839j74757p2581J31606j28067
24241f24K848O8481M1919R7212J18891m8642J07609O4216o8266K315j39481p280
24229B39198J08454Q6954j31806P8481O4366M0091k1242P2712j6118r7318j68331
24218B55441N3486K6759J53253R6282P7553j18648q7987j35440j03088R4175M8409
24207C60195L4533k8454n201j60425j14309Q5967J03454O8900q752r3555J09269
24196C51622J74307j43223j37768J59592N9780P1684j11932k2887m2837o7607
24186B90731l0576J21050j64381L3608R1171r0578j51904j23633q6047J37050
24176B6491J37458M7929P2023q3177j7108n4945r8903R7527J01853r8619J17595
$$ plain form
24165 248124 499846 486108 435120 312331 244018 197060 304006 323994 438783 417963 180410
24154 180410 72727 225567 254778 211099 449928 582980 453887 326417 311259 379281
24144 379281 422806 425608 239309 185130 198170 97397 179762 200808 366919 491891 409376
24133 409376 219472 42563 107214 318161 383611 262296 162535 262908 337327 307886
24123 307886 169318 204536 258769 258371 272322 204964 83917 41845 123455 252929 397163
24112 397163 281281 154673 301403 342480 299163 90628 31031 -56131 47342 102414
24102 102414 124691 254005 271482 199273 284213 147449 47490 215780 181088 227125 223225
24091 223225 220146 277038 384644 396584 365520 208339 264580 370893 467174 412645 482105
$$ packed form
24165B48124K51722j3738n0988j22789o8313m6958J06946J9988J14789k0820k37553
24154A80410j07683J52840K9211m3679K38829J33052j29093j27470j5158O8022
24144C79281M3525K802j86299n4179J3040j00773Q2365K1046J66111J24972q2515
24133D09376j89904j76909O4651K10947O5450j21315r9761J00373P4419k9441
24123C07886j38568L5218N4233l98J3951o7358j21047m2072Q1610J29474J44234
24112C97163j15882j26608J46730M1077m3317k08535n9597q7162J03473N5072
24102A02414K2277J29314J7477p2209Q4940j36764r9959J68290l4692M6037l900
24091B23225l079N6892J07606J1940l1064j57181N6241J06313R6281n4529O9460
$$ plain form
24080 482105 398075 257016 281384 273016 159176 186318 301566 333733 319896 280917 199000
24069 199000 238292 218460 278787 313338 406368 314182 71128 183757 263477 266461 369219
24058 369219 502207 342922 292465 289762 347659 376412 355130 295713 159295 62254 131235
24047 131235 108940 47586 28206 98929 174641 204630 303961 471709 622818 526302 395868
24036 395868 420235 341305 323672 271293 362088 409845 322547 229882 277824 365679 398523
24025 398523 451134 393386 338493 196524 195348 255513 222729 278593 371443 257203 186750
24014 186750 164267 90713 -12043 -106337 -30173 115401 217491 156602 101952 131089 115704
24003 115704 116534 325606 282224 196633 347374 464720 471224 405867 472633 371595 273882
$$ packed form
24080D82105q4030j41059K4368q368j13840K7142J15248L2167j3837l8979q1917
24069A99000L9292j9832O0327L4551R3030r2186k43054J12629P9720K984J02758
24058C69219J32988j59285n0457k703N7897K8753k1282n9417j36418r7041O8981
24047A31235k2295o1354j9380P0723P5712K9989R9331J67748J51109r6516j30434
24036C95868K4367p8930j7633n2379R0795M7757q7298r2665M7942Q7855L2844
24025C98523N2611n7748n4893j41969j176O0165l2784N5864R2850j14240p0453
24014A86750k2483p3554j02756r4294P6164J45574J02090o0889n4650K9137j5385
24003A15704Q30K09072m3382q5591J50741J17346O504o5357O6766j01038r7713
$$ plain form
23992 273882 184442 227701 290636 347268 278044 279292 264314 296357 197593 99541 123224 247577
23980 247577 482896 465807 333312 341750 388569 310314 211420 132626 154020 411577 417168
23969 417168 256024 276585 225971 283430 396193 206711 187465 264890 245820 250280 143029
23958 143029 81010 111703 308172 260571 288879 406166 361416 272399 281079 311419 173345
23947 173345 31775 89580 333081 494818 352676 185467 205722 171272 72476 142011
23937 142011 295388 155728 57813 161946 82157 -79546 84317 162408 123217 12991
23927 12991 -48293 100827 213085 383617 391733 332658 159885 170452 243818 317762 325846
23916 325846 277862 436962 284940 287715 298616 257174 228573 3901 125132 298163 319838
$$ packed form
23992B73882q9440M3259O2935N6632o9224J248j4978L2043r8764r8052K3683J24353
23980B47577K35319j7089j32495Q438M6819p8255r8894p8794K1394K57557N591
23969D17168j61144K0561n0614N7459J12763j89482j9246P7425j9070M460j07251
23958A43029o2019L0693J96469m7601K8308J17287m4750q9017Q680L0340j38074
23947A73345j41570N7805K43501J61737j42142j67209K0255l4450r8796O9535
23937A42011J53377j39660r7915J04133p9789j61703J63863P8091l9191j10226
23927A2991o1284J49120J12258J70532Q116n9075j72773J0567P3366P3944Q084
23916C25846m7984J59100j52022K775J0901m1442k8601k24672J21231J73031K1675
$$ plain form
23905 319838 222211 302192 370765 167191 232737 204674 116104 356191 317968 207992 236913
23894 236913 150947 -36111 -14194 221499 260757 142425 56266 252785 453954 336490
23884 336490 407712 489091 614457 609107 363518 310678 262122 303791 461946 559452 476907
23873 476907 513433 469814 291162 82044 125719 257415 246009 391449 581843 557566
23863 557566 351635 266390 218108 206167 149234 121254 182880 276818 309939 396897 452130
23852 452130 432913 343871 233222 169761 309042 489711 507666 428463 586330 453368
23842 453368 239310 232950 308025 479156 653459 540623 572213 507998 507415 488708 469595
23831 469595 363389 183043 307426 233226 89311 96470 116196 152297 159227 48839 -30247
$$ packed form
23905C19838r7627P9981O8573k03574O5546k8063q8570K40087l8223j09976K8921
23894B36913q5966j87058K1917K35693L9258j18332q6159J96519K01169j17464
23884C36490P1222Q1379J25366n350k45589n2840m8556M1669J58155R7506q2545
23873D76907L6526m3619j78652k09118M3675J31696j1406J45440J90394k4277
23863E57566k05931q5245m8282j1941n6933k7980O1626R3938L3121Q6958N5233
23852D52130j9217q9042j10649o3461J39281J80669J7955p9203J57867j32962
23842D53368k14058o360P5075J71131J74303j12836L1590o4215n83j8707j9113
23831D69595j06206j80346J24383p4200j43915P159J9726L6101O930j10388p9086
$$ plain form
23820 -30247 51510 185987 119681 147805 209164 378334 466466 448930 367484 164306 110006
23809 110006 51663 89581 87582 237609 382434 352520 304639 253831 159490 224472 264335
23798 264335 285096 399590 472817 434639 415528 383380 218596 29535 66006 136653 207006
23787 207006 87827 65613 90099 182154 261024 200338 136128 195086 100247 70801 165968
23776 165968 247179 139043 140050 195163 249326 179187 206816 280144 141433 16211 40112
23765 40112 91739 63453 237895 235453 135475 126429 236267 165946 254118 402000 350291
23754 350291 339127 215294 55440 14655 4275 100932 76878 12766 134046 80354 202163
23743 202163 235366 277351 239849 66723 45487 322807 365123 255985 150948 157819 213323
$$ packed form
23820c0247Q1757J34477o6306K8124O1359J69170Q8132j7536q1446k03178n4300
23809A10006n8343L7918j999J50027J44825k9914m7881n0808r4341O4982L9863
23798B64335K0761J14494P3227l8178j9111l2148j64784j89061L6471P0647P0353
23787B07006j19179k2214K4486R2055P8870o0686o4210N8958r4839k9446R5167
23776A65968Q1211j08136J007N5113N4163p0139K7629P3328j38711j25222K3901
23765D0112N1627k8286J74442k442r9978r046J09838p0321Q8172J47882n1709
23754C50291j1164j23833j59854m0785j0380R6657k4054o4112J21280n3692J21809
23743B02163L3203M1985l7502j73126k1236K77320M2316j09138j05037O871N5504
$$ plain form
23732 213323 99126 33262 -79242 -80830 -198085 32103 116685 188630 173595 215729 193621
23721 193621 207499 227575 68225 46998 180204 91353 208466 258437 245539 214041 204928
23710 204928 167143 229814 375685 346491 267594 93505 146716 130226 -24650 -149089 -77847
23699 -77847 44183 62103 125638 95663 192375 253541 335708 451108 403855 403480 373129 324555
23687 324555 252534 205919 177734 207001 116735 52300 160528 127837 70155 175018 189361
23676 189361 258300 270201 226842 285339 313286 307170 240022 240817 108104 178712 211915 302088
23664 302088 525205 473892 508133 481504 331104 189032 189325 281917 252445 320921 424170
23653 424170 447775 512830 561746 506750 293372 193337 187954 110482 121035 95311 -78288
$$ packed form
23732B13323j14197o5864j12504j588j17255K30188Q4582P1945j5035M2134k2108
23721A93621J3878K0076j59350k1227J33206q8851J17113M9971j2898l1498r113
23710B04928l7785O2671J45871k9194p8897j74089N3211j6490j54876j24439P1242
23699g7847J22030J7920O3535k9975R6712O1166Q2167J15400m7253l75l0351m8574
23687C24555p2021m6615k8185K9267r0266o4435J08228l2691n7682J04863J4343
23676A89361O8939J1901m3359N8497K7947o116o7148P95j32713P0608L3203R0173
23664C02088K23117n1313L4241k6629j50400j42072K93R2592k9472O8476J03249
23653D24170K3605O5055M8916n4996k13378j00035n383p7472J0553k5724j73599
$$ plain form
23642 -78288 -76872 89339 197798 207174 132100 320310 378840 288750 350984 355896 89661
23631 89661 -26060 28028 83003 131204 18259 86024 81840 -29805 -38359 -117106 -36459
23620 -36459 -23276 54146 238104 229708 132364 64931 44320 160199 171807 21891 68281
23609 68281 230197 270079 163926 79434 74129 50084 11930 130535 189363 -106917 -61843
23598 -61843 143672 96185 32716 -13183 2434 70328 167531 110237 68268 129257 181643
23587 181643 266175 87731 -72892 55310 124719 99369 30423 49865 -80093 -128335 -29859
23576 -29859 12705 60710 18416 35002 -17164 11588 -12290 9781 -4674 -150317 -143014 -12756
23564 -12756 -45243 72968 13502 4273 175959 316644 213453 -26867 30029 173769 72743
$$ packed form
23642g8288J416J66211J08459R376p5074J88210N8530r0090O2234M912k66235
23631H9661j15721N4088N4975M8201j12945O7765m184j11645q554p8747Q0647
23620c6459J3183P7422J83958q396r7344o7433k0611J15879J1608j49916M6390
23609F8281J61916L9882j06153q4492n305k4045l8154J18605N8828k96280M5074
23598f1843K05515m7487o3469m5899J5617O7894R7203n7294m1969O0989N2386
23587A81643Q4532j78444j60623J28202O9409k5350o8946J9442j29958m8242R8476
23576b9859M2564M8005m2294J6586n2166K8752k3878K2071j4455j45643P303J30258
23564a2756l2487J18211n9466r229J71686J40685j03191k40320N6896J43740j01026
$$ plain form
23553 72743 -38725 -19475 83563 276603 103117 68950 22585 102062 112758 9881 92324
23542 92324 257445 262612 240012 241008 277081 219192 355553 231366 153085 168221 175739 82796
23530 82796 78067 70999 -90783 -128167 31744 52485 106704 94659 203065 190601 157370
23519 157370 236741 261430 118225 -21533 -108900 -49229 62959 95202 66341 155454 191154
23508 191154 18571 -104763 5820 128842 193137 222313 314006 243498 9733 -46118
23498 -46118 79431 264794 275691 236645 119512 34323 73189 190992 169869 148276 91031
23487 91031 27081 -110762 -46044 127990 75130 -67479 -108565 -53555 170227 268263 208636
23476 208636 163585 190157 -34383 -144994 -79193 112523 170543 199043 134101 112212 242684
$$ packed form
23553G2743j11468J9250J03038J93040j73486l4167m6365P9477J0696j02877Q2443
23542I2324J65121N167k2600R96L6073n7889J36361j24187p8281J5136P518r2943
23530H2796m729p068j61782l7384J59911K0741N4219j2045J08406j2464l3231
23519A57370P9371K4689j43205j39758q7367N9671J12188L2243k8861Q9113L5700
23508A91154j72583j23334J10583J23022O4295K9176R1693p0508k33765n5851
23498d6118J25549J85363J0897l9046j17133q5189L8866J17803k1123k1593n7245
23487I1031o3950j37843O4718J74034n2860j42609m1086N5010K23782R8036n9627
23476B08636m5051K6572k24540j10611O5801J91716N8020K8500o4942k1889J30472
$$ plain form
23465 242684 209432 213211 266518 70042 -82821 10456 37095 -50241 -225069 -171536 -22924
23454 -22924 222672 287662 182658 139917 78589 126060 219941 230835 82026 147080 177023
23443 177023 99568 -20769 -81527 44407 207615 335389 390241 139182 24599 79826
23433 79826 -1745 -8560 94730 46654 -9947 -17189 66673 70734 85569 229119 65697 -38136
23421 -38136 3864 15795 -6922 -60687 -42699 72497 108344 -20098 -66760 -117453 -16009
23410 -16009 134400 193129 12095 9147 111855 135917 37182 -29046 56567 42697 143934
23399 143934 162113 202968 170777 279420 380607 155857 49035 -63855 -67045 -15866 -10679
23388 -10679 614 49895 29851 5276 -80032 -68189 -27981 -44983 -70527 -16222 84840
$$ packed form
23465B42684l3252L779N3307j96476j52863R3277K6639q7336j74828N3533J48612
23454b2924K45596O4990j05004m2741o1328M7471R3881J0894j48809O5054K9943
23443A77023p7455j20337o0758J25934J63208J27774N4852k51059j14583N5227
23433G9826q1571o815J03290m8076n6601p242Q3862M061J4835J43550j63422j03833
23421c8136M2000J1931k2717n3765J7988J15196L5847j28442m6662n0693J01444
23410a6009J50409N8729j81034k948J02708K4062r8735o6228Q5613j3870J01237
23399A43934J8179M0855l2191J08643J01187k24750j06822j12890l190N1179N187
23388a0679J1293M9281k0044k4575q5308J1843M0208j7002k5544N4305J01062
$$ plain form
23377 84840 65383 108410 205509 259537 200637 28847 67780 49485 49061 161547 316216
23366 316216 299582 211518 25021 73544 207019 240470 292885 167923 -2093 -93331 95417
23355 95417 251235 274136 272640 133033 151395 54255 70474 185616 224749 206000 242379
23344 242379 92345 96852 203046 144647 135948 323283 202922 100814 217407 263214 297951
23333 297951 251576 113813 128854 229514 332039 249346 102789 199555 213141 69618
23323 69618 7163 -43972 -108480 -12976 32823 234184 130482 67900 202332 323846 327756
23312 327756 234770 96708 14606 61200 125736 35674 78851 205629 291090 303248 335475
23301 335475 346232 250783 169622 43190 -39152 121522 197502 229820 290604 318163 264909
$$ packed form
23377H4840j9457M3027R7099N4028n8900j71790L8933j8295m24J12486J54669
23366C16216j6634q8064j86497M8523J33475L3451N2415j24962j70016r1238J88748
23355I5417J55818K2901j496j39607J8362r7140J6219J15142L9133j8749L6379
23344B42379j50034M507J06194n8399q699J87335j20361j02108J16593M5807L4737
23333B97951m6375j37763J5041J00660J02525q2693j46557R6766J3586j43523
23323F9618o2455n1135o4508R5504M5799K01361j03702o2582J34432J21514L910
23312C27756r2986j38062q2102M6594O4536r0062M3177J26778Q5461J2158L2227
23301C35475J0757r5449q1161j26432q2342J60674P5980L2318O0784K7559n3254
$$ plain form
23290 264909 168878 168786 108130 115874 165378 119160 82539 41704 76998 52441 109204 189140
23278 189140 184043 124147 172072 165645 34660 -64455 -69962 53409 137890 155188 140299 15654
23266 15654 -10969 2669 -6216 -100082 -160062 -165053 -200217 -129716 -108363 -42047 -23217 -62039
23254 -62039 -132113 -21765 86194 23693 -118698 57879 59974 204261 364107 284338 58547
23243 58547 119186 67935 10227 -39548 11958 -36733 -79461 16844 -71842 -121096 11028
23232 11028 217611 407703 379856 348269 199606 101176 57980 17842 -10260 128791 215864
23221 215864 154649 144690 266298 300183 271121 311388 385078 400803 313013 97552 31495
23210 31495 24479 -50432 -45548 -26675 117950 257221 269589 163013 152789 -61085 -25117
$$ packed form
23290B64909r6031r2o0656P744M9504m6218l6621m0835L5294k4557N6763P9936
23278A89140n097n9896M7925o427j30985r9115n507J23371Q4481J7298j4889j24645
23266A5654k6623J3638q885r3866n9980m991l5164P0501K1353O6316J8830l8822
23254f2039p0074J10348J07959o2501j42391J76577K095J44287J59846p9769k25791
23243E8547O0639n1251n7708m9775N1506m8691m2728R6305q8686m9254J32124
23232A1028K06583J90092k7847l1587j48663r8430m3196m0138k8102J39051Q7073
23221B15864o1215r959J21608L3885k9062M0267P3690J5725q7790k15461o6057
23210C1495p016p4911M884J8873J44625J39271J2368j06576j0224k13874L5968
$$ plain form
23199 -25117 74993 -104968 -63809 62503 -61893 -43587 -18566 -206303 -156446 -148727 -44131
23188 -44131 40191 141543 145932 75535 137560 155736 258838 213239 162244 173366 113875
23177 113875 41939 29488 20731 -75463 -64093 -42600 14348 227138 235987 391630 362736
23166 362736 398626 192700 43075 -6949 144465 205414 271346 359675 355257 256845 160695
23155 160695 181664 132959 170131 -80254 -235228 -61176 160375 93830 116392 66095 80408
23144 80408 129143 191227 221882 140756 237984 111582 102483 -17926 -4105 -69366 -47145
23133 -47145 -36834 95423 90259 -21004 -77689 -6995 20252 -112767 -135172 -86719 -135887
23122 -135887 -24356 -17129 -206568 -177949 -236147 -291433 -322996 -224770 -249565 -215886 -148915
$$ packed form
23199b5117J00110j79961M1159J26312j24396J8306K5021j87737M9857P719J04596
23188d4131Q4322J01352M389p0397O2025J8176J03102m5599n0995J1122n9491
23177A13875p1936j2451q757r6194J1370K1493N6948K12790Q849J55643k8894
23166C62736L5890k05926j49625n0024J51414O0949O5932Q8329m418r8412r6150
23155A60695K0969m8705L7172k50385j54974J74052K21551o6545K2562n0297J4313
23144H0408M8735O2084L0655q1126R7228j26402r099j20409J3821o5261K2221
23133d7145J0311J32257n164j11263n6685P0694K7247j33019k2405M8453m9168
23122a35887J11531P227j89439K8619n8198n5286l1563R8226k4795L3679O6971
$$ plain form
23111 -148915 -184551 -205631 -227004 -208753 -80520 -58488 44818 -5551 105260 313658 166193
23100 166193 44489 98096 30572 -131334 -330134 -238810 -213911 -226195 20701 10183 43439
23089 43439 -88390 -198128 -174798 -148990 -183688 -97896 53853 21054 -108683 -175596 -252961
23078 -252961 -101456 8932 80124 -65015 -154467 -86749 73791 98957 143185 104970 45273
23067 45273 -3973 29747 39954 59454 77652 60850 7943 -141394 -292706 -89928 -20661
23056 -20661 -82997 -52144 25093 -36872 86250 51512 -222216 -407790 -362296 -166436 -140369
23045 -140369 -70511 -12200 -96 54028 -10208 -133756 -17296 134422 -16233 -154767
23035 -154767 -105185 -187867 -182842 -181789 -51674 -143312 -125635 -36409 -101892 -159631 -240272 -221023
$$ packed form
23111a48915l5636k1080k1373J8251J28233K2032J03306n0369J10811K08398j47465
23100A66193j21704N3607o7524j61906j98800R1324K4899j2284K46896j0518L3256
23089D3439j31829j09738K3330K5808l4698Q5792J51749l2799j29737o6913p7365
23078b52961J51505J10388P1192j45139q9452O7718J60540K5166M4228l8215n9697
23067D5273m9246L3720J0207J9500J8198j6802n2907j49337j51312K02778O9267
23056b0661o2336L0853P7237o1965J23122l4738k73728j85574M5494J95860K6067
23045a40369O9858N8311J2104N4124o4236j23548J16460J51718j50655j38534
23035a54767M9582q2682N025J053J30115r1638J7677Q9226o5483n7739q0641J9249
$$ plain form
23023 -221023 -301808 -255745 -200223 -130350 37860 115152 150835 75923 197475 253398 195896
23012 195896 79395 9833 -125121 -153381 -38005 -90007 -185334 -299410 -303754 -190269 -77485
23001 -77485 -75886 -92975 -119948 -183355 -255749 -154223 11268 -49605 -46531 -117641 -211590 -271932
22989 -271932 -245061 -67185 19260 5155 -12048 -97967 -143473 -232157 -274866 -135016 -9775
22978 -9775 27502 -47493 109831 234290 211923 -54365 -297325 -336954 -311148 -166986 -125401
22967 -125401 -73016 -54298 -138632 -139343 -95144 -45155 17051 -72339 -213284 -123464 -94532 -163646
22955 -163646 -101494 -68865 -293274 -268955 -131553 8999 -15909 -51635 2795 16855 -69463
22944 -69463 -241160 -284343 -293123 -207657 -245096 -236068 -211257 -104551 31065 273783 230451
$$ packed form
23023b21023q0785M6063N5522O9873J68210P7292L5683p4912J21552N5923n7502
23012A95896j16501o9562j34954k8260J15376n2002r5327j14076m344J13485J12784
23001g7485J599j7089k6973o3407p2394J01526J65491o0873L074p1110r3949o0342
22989b71932K6871J77876Q6445j4105j7203q5919m5506q8684m2709J39850J25241
22978i775L7277p4995J57324J24459k2367k66288k42960l9629K5806J44162M1585
22967a25401N2385J8718q4334p11M4199M9989O2206q9390j40945Q9820K8932o9114
22955a63646O2152L2629k24409K4319J37402J40552k4908l5726N4430J4060q6318
22944f9463j71697m3183q780Q5466l7439R028K4811J06706J35616K42718m3332
$$ plain form
22933 230451 26589 -66445 -76989 16779 86966 193139 106353 -16725 -48757 -81641 -41133
22922 -41133 -94521 -82539 -5531 46546 31393 -53741 -262998 -313283 -193655 -122683 -71986
22911 -71986 -133774 122844 22153 -58180 -120258 -300003 -181221 84466 48871 -104101
22901 -104101 -11652 23790 44659 141212 95198 2711 78697 120713 4478 -255813 -196233
22890 -196233 -105935 -121832 -124368 -149920 -88517 -53627 -153467 -130399 -110778 -154024 -52957
22879 -52957 104474 -3112 -7278 -96756 -222581 -108234 28359 74430 28577 60951 90597
22868 90597 -3445 -17678 73713 108680 195361 229714 185611 226278 125831 28533 -31986
22857 -31986 -126978 -151499 -155378 -95932 13840 -135784 -223011 -262700 -188650 -128978 -71867
$$ packed form
22933B30451k03862r3034j0544R3768P0187J06173q6786j23078l2032l2884M0508
22922d1133n3388J1982P7008N2077j5153q5134k09257n0285J19628P0972N0697
22911g1986o1788K56618j00691q0333o2078j79745J18782K65687l5595j52972
22901a04101R2449L5442K0869R6553m6014r2487P5986M2016j16235k60291N9580
22890a96233R0298j5897k536k5552O1403L4890r9840K3068J9621m3246J01067
22879e2957J57431j07586m166q9478j25825J14347J36593M6071m5853L2374K9646
22868I0597r4042j4233R1391L4967Q6681L4353m4103M0667j00447r7298o0519
22857c1986r4992k4521l879N9446J09772j49624q7227l9689P4050N9672N7111
$$ plain form
22846 -71867 -23519 -127466 -103245 -43979 166061 83328 -31166 26724 45198 -158189 -181514
22835 -181514 -159651 -33656 -114322 -284600 -237121 -201936 -110026 134551 17391 -64916 -20148
22824 -20148 -155871 -202733 -150601 -228819 -213512 8857 -53891 -360189 -451650 -384398 -220824
22813 -220824 -82218 -24113 -22564 -30740 -22916 3534 -36940 2571 63718 -8687 -122085 -50994
22801 -50994 26452 4860 32964 -24911 -102822 -40589 38857 107822 133853 7759 -24553
22790 -24553 -124744 -234072 -254877 -82933 15209 35694 155182 138385 59247 64696 58543
22779 58543 79381 89170 -17612 -25738 42184 -61539 -64078 8249 176022 294177 351062
22768 351062 96115 -168350 -224866 -188161 -65562 66393 -22749 -30670 -4306 -62789 -179124
$$ packed form
22846g1867M8348j03947K4221N9266K10040q2733j14494N7890J8474k03387k3325
22835a81514K1863J25995q0666j70278M7479L5185R1910K44577j17160q2307M4768
22824b0148j35723m6862N2132p8218J5307K22369o2748l06298r1461O7252J63574
22813b20824J38606N8105J549q176P824K6450m0474L9511O1147p2405j13398P1091
22801e0994P7446k1592K8104n7875p7911O2233P9446O8965K6031j26094l2312
22790b4553j00191j09328k0805J71944R8142K0485J19488j6797p9138N449o153
22779E8543K0838R789j06782q126O7922j03723k539P2327J67773J18155N6885
22768C51062k54947k64465n6516L6705J22599J31955q9142p921K6364n8483j16335
$$ plain form
22757 -179124 -316580 -555542 -664359 -395616 -113775 5017 -11677 -54142 -121304 -195599
22747 -195599 -339480 -302127 -194478 -233490 -193649 -10619 27668 -80673 -88458 -233570 -352967
22736 -352967 -575557 -660201 -455691 -310274 -323661 -421826 -419615 -371783 -311689 -177650 14866
22725 14866 123964 19543 -57473 -168636 -192095 -116599 -81044 -83451 -115838 -166811 -70713
22714 -70713 -125814 -183578 -73447 75286 203954 75774 -117942 -110517 -141756 -99243 -42112
22703 -42112 -185206 -129485 -178338 -175369 -139845 -100339 -68616 30026 -109264 -174209 -20144
22692 -20144 -16983 -64298 -221549 -265128 -198368 -150702 -236844 -103432 44393 77032 6393
22681 6393 -175632 -204203 -201273 -161910 -117757 -128096 -177035 29028 315615 208101 135521
$$ packed form
22757a79124j37456k38962j08817K68743K81841J18792j6694m2465o7162p4295
22747a95599j43881L7353J07649l9012L9841J83030L8287j08341p785j45112j19397
22736c52967k22590q4644K04510J45417j3387r8165K211M7832O0094J34039J92516
22725A4866J09098j04421p7016j11163k3459P5496L5555k407l2387n0973R6098
22714g0713n5101n7764J10131J48733J28668j28180j93716P425l1239M2513N7131
22703d2112j43094N5721m8853K969L5524L9506L1723R8642j39290o4945J54065
22692b0144L161m7315j57251m3579O6760M7666q6142J33412J47825L2639p0639
22681F393j82025k8571K930L9363M4153j0339m8939K06063K86587j07514p2580
$$ plain form
22670 135521 141570 71325 -9228 50375 124862 175935 110970 -9664 -177570 -18813 59750
22659 59750 59287 -108198 -147187 -95392 -225446 -379769 -358299 -231416 -329622 -366729 -290253
22648 -290253 -181156 -182065 -254595 -344839 -359963 -306884 -266037 -293223 -517710 -423301 -372098
22637 -372098 -328768 -268849 -229166 -317466 -319503 -348245 -170861 -81843 -169979 -221653 -177276
22626 -177276 58656 153364 -18864 -100583 -221998 -107918 -24202 -209112 -319008 -296991
22616 -296991 -147450 -123471 -154746 -338525 -339715 -303689 -219087 -267396 -240234 -235423 -268878
22605 -268878 -318911 -399249 -406055 -339995 -353469 -225371 -157046 -113025 -101281 -264427 -328739
22594 -328739 -248757 -49775 -31390 -177593 -170900 -288715 -365783 -308231 -261045 -279408 -406576
$$ packed form
22670A35521O049p0245q0553N9603P4487N1073o4965j20634j67906J58757P8563
22659E9750m63j67485l8989N1795j30054j54323K1470J26883r8206l7107P6476
22648b90253J09097r09p2530r0244j5124N3079M0847k7186k24487R4409N1203
22637c72098M3330N9919L9683q8300k037k8742J77384Q9018q8136n1674M4377
22626a77276K35932R4708j72228q1719j21415J14080Q3716j84910j09896K2017
22616b96991J49541K3979l1275j83779j190L6026Q4602m8309K7162M811l3455
22605b68878n0033q0338o806O6060j3474J28098O8325M4021J1744j63146o4312
22594c28739P9982J98982J8385j46203O693j17815p7068N7552M7186j8363j27168
$$ plain form
22583 -406576 -370748 -282447 -105509 -17909 -26006 -23041 -93015 -201047 -104396 -124550 -124243 -69130
22571 -69130 -91120 -124131 -105829 -132385 -267773 -360322 -368565 -293515 -137573 -43503 -10444
22560 -10444 -71649 33420 27865 -60642 -129062 -167367 -68387 -87414 -42816 -14185 -14981 -206999
22548 -206999 -351648 -280273 -174276 -84905 -236149 -488005 -593348 -341983 -225326 -214687
22538 -214687 -54982 -27472 -72130 -75751 -55632 13020 -40128 -245333 -406470 -398775 -241713
22527 -241713 -57299 140964 70123 -106657 -292589 -261120 -181242 -248111 -334310 -284609 -316563
22516 -316563 -303568 -279062 -193776 -278560 -105223 -2370 39165 -48338 -117982 -170029 -206701
22505 -206701 -152814 -129392 -17468 -63888 -71792 -14754 -54730 -116914 -178096 -244743 -270687
$$ packed form
22583d06576L5828Q8301J76938Q7600q097K965o9974j08032R6651k0154L07N5113
22571f9130k1990l3011J8302k6556j35388r2549q243P5050J55942R4070L3059
22560a0444o1205J05069n555q8507o8420l8305R8980j9027M4598K8631p96j92018
22548b06999j44649P1375J05997Q9371j51244k51856j05343K51365J16657J0639
22538b14687J59705K7510m4658l621K0119O8652n3148k05205j61137P695J57062
22527b41713J84414J98263p0841j76780j85932L1469P9878o6869q6199M9701l1954
22516c16563J2995K4506Q5286q4784J73337J02853M1535q7503o9644n2047l6672
22505b06701N3887K3422J11924m6420p904N7038l9976o2184o1182o6647k5944
$$ plain form
22494 -270687 -237418 -336745 -256595 -184191 -145347 -93980 -22283 51815 -97250 -198681 -290241
22483 -290241 -164778 -135187 -99637 -248984 -351958 -390418 -384331 -327532 -232821 -170738 -153031
22472 -153031 -82817 15531 -22310 57154 4280 -209835 -238898 -205927 -162698 -167177 -215764
22461 -215764 -336907 -368222 -395204 -405480 -307105 -366538 -425528 -462073 -477355 -384016 -272996
22450 -272996 -185415 -264627 -298204 -274986 -310221 -273152 -154794 -98733 -28059 -58384 -126932
22439 -126932 -185885 -193293 -292819 -255801 -204496 -486616 -491131 -344377 -314178 -295929 -225952
22428 -225952 -189202 -196513 -195476 -229594 -174343 -256180 -180063 -57131 -148354 -341186 -421387
22417 -421387 -384196 -223014 -155042 -109111 -32006 -34999 -136455 -357214 -558664 -461956 -232528
$$ packed form
22494b70687L3269r9327Q0150P2404L8844N1367P1697P4098j49065j01431r1560
22483b90241J25463K9591L5550j49347j02974l8460O087N6799R4711O2083J7707
22472a53031P0214R8348l7841P9464n2874k14115k9063L2971M3229m479m8587
22461b15764j21143l1315k6982j0276R8375n9433n8990l6545j5282R3339J11020
22450b72996Q7581p9212l3577K3218l5235L7069J18358N6061P0674l0325o8548
22439a26932n8953p408r9526L7018N1305k82120m515J46754L0199J8249O9977
22428b25952L6750p311J037l4118N5251q1837P6117J22932r1223j92832q0201
22417d21387L7191J61182O7972M5931P7105k993j01456k20759k01450R6708K29428
$$ plain form
22406 -232528 56834 30122 33712 -45710 -31560 -69891 -94567 -158815 -249026 -188729 -144941
22395 -144941 -115500 -209814 -413113 -421633 -299217 -301271 -255438 -167974 -265257 -393548 -385264
22384 -385264 -180002 -154126 -94316 46367 -80763 -253944 -212031 -248427 -189261 -141087 -22644
22373 -22644 -2523 -181547 -281389 -412810 -459315 -288497 -121915 -106059 -73189 -119149 -140753
22362 -140753 -195221 -194018 -293090 -407236 -347605 -216958 -170012 -73189 28240 -36624 -67783
22351 -67783 -9743 -69499 -122335 -181658 -164728 -309251 -384510 -190926 -208861 -175036 -234976
22340 -234976 -118561 -166199 -255802 -174298 -324407 -550224 -658856 -471748 -438451 -348086
22330 -348086 -264009 -236324 -204312 -225906 -227775 -113409 -127219 -106586 -8811 -66975 -114097
$$ packed form
22406b32528K89362k6712L590p9422J4150l8331k4676o4248r0211O0297M3788
22395a44941K9441r4314k03299q520J22416k054M5833Q7464r7283j28291Q284
22384c85264K05262K5876N9810J40683j27130j73181M1913l6396N9166M8174J18443
22373b2644K0121j79024r9842j31421m6505J70818J66582J5856L2870m5960k1604
22362a40753n4468J203r9072j14146N9631J30647M6946R6823J01429o4864l1159
22351f7783N8040n9756n2836n9323J6930j44523p5259J93584j7935L3825n9940
22340b34976J16415m7638q9603Q1504j50109k25817j08632J87108L3297R0365
22330c48086Q4077K7685L2012k1594j869J14366j3810K0633R7775n8164m7122
$$ plain form
22319 -114097 -197434 -248761 -347263 -414076 -369080 -369089 -478440 -406129 -110606 -133426 -386908 -478208
22307 -478208 -316433 -369092 -347332 -202448 -253122 -332725 -223236 -178519 -284769 -238330 -425647
22296 -425647 -535591 -316128 -121094 -32595 -71692 -98216 -155415 -218078 -324932 -332055 -308914
22285 -308914 -417458 -499582 -498008 -438739 -395196 -152545 -117288 -337692 -402730 -362952 -427947
22274 -427947 -382221 -410749 -341948 -459100 -487414 -401052 -386243 -243259 -196265 -215310 -383040
22263 -383040 -326535 -403602 -452895 -471477 -490963 -370598 -230889 -297672 -494032 -597746 -613103
22252 -613103 -560576 -504167 -366838 -314176 -347951 -508383 -639243 -516561 -335494 -266637
22242 -266637 -227810 -310705 -337245 -267249 -221425 -205428 -259277 -218660 -137965 -322116 -582350
$$ packed form
22319a14097q3337n1327r8502o6813M4996rj09351P2311K95523k2820k53482r1300
22307d78208J61775n2659K1760J44884n0674p9603J09489M4717j06250M6439j87317
22296d25647j09944K19463J95034Q8499l9097k6524n7199o2663j06854p123K3141
22285c08914j08544q2124J574N9269M3543K42651L5257k20404o5038L9778o4995
22274d27947M5726k8528O8801j17152k8314Q6362J4809J42984M6994j9045j67730
22263c83040N6505p7067m9293j8582j9486J20365J39709o6783j96360j03714j5357
22252f13103N2527N6409J37329N2662l3775j60432j30860J22682J81067O8857
22242b66637L8827q2895k6540O9996M5824J5997n3849M0617Q0695j84151k60234
$$ plain form
22231 -582350 -556957 -471018 -444394 -437942 -510561 -640779 -497729 -275602 -316181 -410069 -230141
22220 -230141 -217382 -290047 -301665 -406103 -461488 -442160 -411516 -400927 -258052 -154012 -227667
22209 -227667 -273867 -398625 -427806 -482748 -373278 -403031 -404915 -310430 -330372 -277817 -318275
22198 -318275 -397612 -480801 -438940 -261241 -179067 -388353 -415440 -376853 -291633 -262214 -83700
22187 -83700 -10461 -114376 -97116 -102455 -143674 -209339 -352958 -402166 -544010 -680124 -579935
22176 -579935 -538343 -520662 -462986 -319607 -241495 -358035 -346031 -208864 -183941 -232661 -274856
22165 -274856 -233990 -234866 -330040 -527407 -514883 -543633 -641258 -472600 -379187 -353185 -493977
22154 -493977 -583047 -560789 -689975 -786944 -736883 -704258 -590609 -566529 -590977 -537055 -389857
$$ packed form
22231e82350K5393Q5939K6624O452p2619j30218J43050K22127m0579r3888J79928
22220b30141J2759p2665j1618j04438n5385J9328L0644J0589J42875J04040p3655
22209b27667m6200j24758k9181n4942J09470k9753j884R4485j9942N2555m0458
22198c18275p9337q3189M1861J77699Q2174k09286k7087L8587Q5220K9419J78514
22187h3700P3239j03915J7260n339m1219o5665j43619m9208j41844j36114J00189
22176e79935M1592J7681N7676J43379P8112j16540J2004J37167K4923m8720m2195
22165b74856M0866q76r5174j97367J2524k8750r7625J68658R3413K6002j40792
22154d93977q9070K2258j29186r6969N0061L2625J13649K4080k4448N3922J47198
$$ plain form
22143 -389857 -133434 15760 -58115 -198437 -265136 -298934 -330055 -198015 -270479 -438662
22133 -438662 -464579 -429396 -482818 -443189 -603623 -552469 -529693 -564978 -446150 -370352 -279165
22122 -279165 -226011 -469675 -657782 -619761 -488380 -393528 -241048 -154132 -181524 -244535 -313832
22111 -313832 -352979 -459900 -556726 -557109 -387736 -278783 -312975 -162477 -205888 -262766 -311098
22100 -311098 -317816 -447673 -593939 -640364 -644048 -618237 -546999 -640280 -713005 -668320 -533301
22089 -533301 -448051 -408518 -418821 -246405 -121359 -119529 -309422 -425757 -452980 -371097 -473382
22078 -473382 -558420 -555264 -490714 -460924 -468987 -585870 -660349 -598363 -608532 -576783 -390223
22067 -390223 -389822 -404283 -386748 -493389 -552844 -462474 -444388 -501266 -423326 -393504 -356327 -398350
$$ packed form
22143c89857K56423J49194p3875j40322o6699l3798l1121J32040p2464j68183
22133d38662k5917L5183n3422L9629j60434N1154K2776l5285J18828P5798R1187
22122b79165N3154k43664j88107L8021J31381R4852J52480Q6916k7392o3011o9297
22111c13832l9147j06921r6826l83J69373J08953l4192J50498m3411n6878m8332
22100c11098o718j29857j46266m6425l684K5811P1238r3281p2725M4685J35019
22089e33301Q5250L9533j0303J72416J25046J830j89893j16335k7223Q1883j02285
22078d73382q5038L156O4550K9790q063j16883p4479O1986j0169L1749J86560
22067c90223M01j4461J7535j06641n9455R0370J8086n6878P7940K9822L7177m2023
$$ plain form
22055 -398350 -250031 -133763 -274960 -317629 -271675 -335739 -274921 -147027 -267338 -340721
22045 -340721 -290119 -314369 -385870 -238617 -10670 -20967 -89914 -285754 -433487 -440264 -484390
22034 -484390 -496410 -434498 -314946 -335583 -288150 -358827 -507076 -452981 -418590 -457353 -525522
22023 -525522 -426130 -345320 -324069 -278721 -320475 -467968 -595986 -613734 -534367 -561984 -398521
22012 -398521 -497216 -592738 -501204 -464223 -473151 -592237 -591717 -503081 -516957 -581217 -715282 -804998
22000 -804998 -732947 -573908 -357141 -419335 -480014 -540601 -628859 -648360 -595973 -519042 -474595
21989 -474595 -446431 -366909 -310117 -473896 -561724 -538773 -589775 -576861 -712314 -576534 -555418
21978 -555418 -619746 -579013 -524330 -586041 -636818 -602266 -562748 -380919 -298779 -274923 -417893
$$ packed form
22055c98350J48319J16268j41197m2669M5954o4064O0818J27894j20311p3383
22045c40721N0602k4250p1501J47253K27947j0297o8947j95840j47733o777m4126
22034d84390j2020O1912J19552k0637M7433p0677j48249N4095L4391l8763o8169
22023e25522R9392Q0810K1251M5348m1754j47493j28018j7748P9367k7617J63463
22012c98521r8695r5522R1534L6981q928j19086N20Q8636j3876o4260j34065q9716
22000h04998P2051J59039K16767o2194o0679o0587q8258j9501N2387P6931M4447
21989d74595K8164P9522N6792j63779q7828K2951n1002J2914j35453J35780K1116
21978e55418o4328M0733N4683o1711n0777L4552L9518J81829Q2140K3856j42970
$$ plain form
21967 -417893 -453563 -390060 -340266 -383224 -436450 -405124 -509170 -524749 -353283 -404855 -446094
21956 -446094 -315195 -336696 -359336 -454700 -485895 -616075 -610670 -588557 -612520 -431336 -395881
21945 -395881 -471121 -490229 -520920 -447289 -408510 -477355 -558633 -588720 -592643 -471002 -412727
21934 -412727 -415264 -526123 -482459 -453856 -554455 -523377 -553605 -514915 -513740 -502376 -516452
21923 -516452 -356979 -240428 -260358 -375007 -400689 -492368 -403953 -461448 -604926 -567954 -579271
21912 -579271 -655765 -711440 -570215 -548958 -716836 -718795 -535353 -603175 -690078 -520539 -423856
21901 -423856 -374508 -390043 -463935 -624488 -684613 -583908 -529293 -440979 -308141 -242423 -354350
21890 -354350 -451576 -674751 -647717 -647583 -751258 -855815 -678497 -621899 -485232 -328225 -350224
$$ packed form
21967d17893l5670O3503M9794m2958n3226L1326j04046j5579J71466n1572m1239
21956d46094J30899k1501k2640r5364l1195j30180N405K2113k3963J81184L5455
21945c95881p5240j9108l0691P3631L8779o8845q1278l0087l923J21641N8275
21934d12727k537j10859M3664K8603j00599L1078l0228L8690J175J1364j4076
21923e16452J59473J16551j9930j14649k5682r1679Q8415n7495j43478L6972j1317
21912e79271p6494n5675J41225K1257j67878j959J83442o7822q6903J69539R6683
21901d23856M9348j5535p3892j60553o0125J00705N4615Q8314J32838O5718j11927
21890c54350r7226k23175K7034J34j03675j04557J77318N6598J36667J57007k1999
$$ plain form
21879 -350224 -551605 -731834 -900894 -1027133 -922999 -772828 -785542 -732985 -693094 -841149
21869 -841149 -886873 -706375 -543117 -418198 -381915 -331277 -394658 -510026 -663080 -637812
21859 -637812 -534541 -446168 -639129 -830264 -698464 -641542 -546264 -537963 -566415 -602965 -616411
21848 -616411 -509829 -520355 -570796 -569404 -451097 -432324 -426833 -317750 -361287 -370323 -297627
21837 -297627 -226729 -254587 -233140 -354964 -497045 -499237 -491932 -618452 -714083 -623741 -481050
21826 -481050 -296547 -362331 -503965 -719892 -625973 -533205 -600870 -535254 -482189 -513829 -609105
21815 -609105 -602604 -665210 -703005 -774667 -829562 -827478 -744086 -832097 -852718 -774114 -766500 -688678
21803 -688678 -576641 -513522 -518913 -548842 -612126 -587302 -489596 -385603 -561203 -598299 -517835
$$ packed form
21879c50224k01381j80229j69060j26239J04134J50171j2714N2557L9891j48055
21869h41149m5724J80498J63258J24919L6283N0638o3381j15368j53054K5268
21859f37812J03271Q8373j92961j91135J31800N6922R5278Q301k8452l6550j3446
21848f16411J06582j0526n0441J392J18307J8773N491J09083m3537r036P2696
21837b97627P0898k7858K1447j21824j42081k192P305j26520r5631R0342J42691
21826d81050J84503o5784j41634k15927R3919R2768o7665O5616N3065l1640r5276
21815f09105O501o2606l7795p1662n4895K084Q3392q8011k0621P8604P614P7822
21803f88678J12037O3119n391k9929o3284K4824R7706J03993j75600l7096Q0464
$$ plain form
21792 -517835 -550729 -511871 -457089 -382120 -446053 -394966 -331848 -402287 -518347 -582133 -648628
21781 -648628 -682867 -536919 -450753 -405444 -591976 -635983 -513792 -458237 -465328 -480890 -440317
21770 -440317 -439015 -402765 -515161 -602417 -541520 -567434 -736796 -768175 -733243 -720393 -613292
21759 -613292 -646071 -621906 -664355 -674598 -653794 -609877 -649339 -611557 -582579 -625379 -651414
21748 -651414 -642096 -475031 -345038 -406973 -327131 -381863 -482450 -428407 -459071 -607476 -681126
21737 -681126 -697899 -666201 -718583 -726733 -685870 -694214 -515547 -443927 -469318 -444099 -422313 -396743
21725 -396743 -463367 -709447 -890966 -838850 -744545 -611231 -217740 -140262 -407867 -601110
21715 -601110 -686190 -659494 -509871 -339644 -522687 -587818 -651782 -553400 -508164 -669681 -621663
$$ packed form
21792e17835l2894L8858N4782P4969o3933N1087O3118p0439j16060o3786o6495
21781f48628l4239J45948Q6166M5309j86532m4007J22191N5555p091j5562M0573
21770d40317J302L6250j12396q7256O0897k5914j69362l1379L4932J2850J07101
21759f13292l2779K4165m2449j0243K0804M3917l9462L7782K8978m2800k6035
21748f51414R318J67065J29993o1935P9842n4732j00587N4043l0664j48405p3650
21737f81126j6773L1698n2382q150M0863q344J78667P1620k5391K5219K1786K5570
21725c96743o6624k46080j81519N2116R4305J33314L93491P7478k67605j93243
21715f01110q5080K6696J49623J70227j83043o5131o3964R8382M5236j61517M8018
$$ plain form
21704 -621663 -582203 -601542 -703675 -668396 -502768 -438767 -546215 -629951 -607413 -619536 -662709
21693 -662709 -542373 -337112 -416400 -654239 -823328 -1058501 -861267 -647283 -562095 -554783
21683 -554783 -567011 -482394 -562359 -704762 -681088 -647930 -632951 -696073 -644415 -551255 -446969
21672 -446969 -528894 -676139 -745497 -720291 -728303 -770848 -809997 -875109 -929916 -873799 -859584
21661 -859584 -825841 -657235 -658889 -637149 -759222 -758875 -723656 -482645 -400574 -375046 -463083
21650 -463083 -623526 -643917 -776022 -850061 -915181 -798836 -609991 -562393 -646004 -796481
21640 -796481 -853574 -992108 -997580 -906068 -768547 -579165 -621760 -622822 -618267 -710667 -675936
21629 -675936 -780636 -759376 -481293 -496129 -577867 -515765 -547210 -525177 -435062 -539905 -704035
$$ packed form
21704f21663L9460j9339j02133L5279J65628O4001j07448q3736K2538j2123m3173
21693f62709J20336K05261p9288k37839j69089k35173J97234K13984Q5188P312
21683e54783j2228Q4617p9965j42403K3674L3158J4979o3122N1658R3160J04286
21672d46969q1925j47245o9358K5206q012m2545l9149o5112n4807N6117J4215
21661h59584L3743J68606j654K1740j22073L47L5219K41011Q2071K5528q8037
21650d63083j60443k0391j32105p4039o5120J16345J88845M7598q3611j50477
21640g96481n7093j38534n472R1512J37521J89382m2595j062M555r2400L4731
21629f75936j04700K1260K78083j4836q1738O2102l1445K2033R0115j04843j64130
$$ plain form
21618 -704035 -730573 -701008 -671636 -610004 -704279 -754172 -743391 -692392 -884959 -933011 -840706
21607 -840706 -764310 -805321 -799720 -814205 -801907 -581968 -545341 -658286 -781599 -820480 -837101
21596 -837101 -683252 -646891 -806987 -763190 -829080 -859836 -799817 -663402 -768606 -782882 -746012
21585 -746012 -776968 -691847 -731664 -842142 -853490 -941659 -841601 -712030 -707511 -772650 -777278
21574 -777278 -786300 -1029314 -951130 -683377 -647398 -705505 -813183 -964751 -1043646 -970255 -899029
21563 -899029 -778168 -690233 -500035 -494526 -541915 -622628 -659097 -770954 -956469 -838422 -748510
21552 -748510 -672570 -768108 -686117 -651401 -698906 -684408 -689023 -692593 -656146 -723610 -784670 -791273
21540 -791273 -869062 -789044 -558565 -570060 -594907 -757412 -895649 -936040 -904134 -732952 -785438
$$ packed form
21618g04035k6538K9565K9372O1632r4275m9893J0781N0999j92567m8052R2305
21607h40706P6396m1011N601j4485J2298K19939L6627j12945j23313l8881j6621
21596h37101J53849L6361j60096M3797o5890l0756O0019J36415j05204j4276L6870
21585g46012l0956Q5121l9817j10478j1348q8169J00058J29571M519o5139m628
21574g77278r022k43014P8184K67753L5979n8107j07678j51568p8895P3391P1226
21563h99029J20861Q7935J90198N509m7389q0713l6469j11857j85515J18047Q9912
21552g48510P5940r5538Q1991L4716m7505J4498m615l570L6447o7464o1060o603
21540g91273p7789Q0018K30479j1495k4847j62505j38237m0391L1906J71182n2486
$$ plain form
21529 -785438 -908664 -953163 -911972 -659524 -613803 -712652 -654778 -675445 -746126 -685358 -784704
21518 -784704 -853221 -929994 -803022 -623116 -686467 -753409 -879425 -850736 -938450 -944638 -987740
21507 -987740 -990210 -859097 -720827 -738011 -715143 -532414 -567582 -547753 -607771 -685727 -736218
21496 -736218 -771262 -793611 -749319 -921346 -1037328 -809402 -580386 -626117 -783592 -820376
21486 -820376 -999503 -866500 -680434 -735473 -742066 -911962 -923380 -805619 -827997 -847059 -738473
21475 -738473 -688885 -787376 -743109 -701353 -667889 -694370 -765884 -826102 -754749 -581134 -587244
21464 -587244 -683597 -789294 -756545 -599614 -592191 -616798 -480260 -493803 -676762 -714922 -805134
21453 -805134 -901782 -955347 -954133 -843437 -674136 -578701 -723108 -977936 -940117 -725540 -860305
$$ packed form
21529g85438j23226m4499M1191K52448M5721r8849N7874k0667p0681O0768r9346
21518g84704o8517p6773J26972J79906o3351o6942j26016K8689q7714o188m3102
21507i87740k470J31113J38270j7184K2868J82729l5168J9829o0018p7956n0491
21496g36218l5044k2349M4292j72027j15982K27926K29016m5731j57475l6784
21486h20376j79127J33003J86066n5039o593j69896j1418J17761k2378j9062J08586
21475g38473M9588r8491M4267M1756L3464k6481p1514o0218P1353J73615o110
21464e87244r6353j05697L2749J56931P423k4607J36538j3543j82959l8160r0212
21453h05134r6648n3565J214J10696J69301R5435j44407k54828L7819K14577j34765
$$ plain form
21442 -860305 -916049 -1000472 -968871 -909623 -974522 -1001956 -951078 -925686 -927943 -805778 -722499
21431 -722499 -795344 -857786 -879940 -929012 -876368 -603403 -723956 -963472 -1013420 -1010073 -882246
21420 -882246 -883313 -914436 -880149 -968585 -1038207 -990901 -967170 -933360 -796756 -816498 -760558
21409 -760558 -785701 -719854 -570901 -556748 -615156 -338001 -113538 -12066 200121 299142
21399 299142 393452 420487 659664 686694 726318 686104 670064 812267 1044989 1212644 1231068
21388 1231068 1112888 1054566 873315 840704 761792 535136 366398 235026 64987 78297
21378 78297 81737 68156 -153345 -366121 -359453 -280884 -320427 -322512 -303212 -182157 -94876 -143022
21366 -143022 -130253 143863 332554 373000 452051 564014 643872 824575 873622 827502 848700
$$ packed form
21442h60305n5744q4423L1601N9248o4899k7434N0878K5392k257J22165Q3279
21431g22499p2845o2442k2154m9072N2644K72965j20553k39516m9948L347J27827
21420h82246j067l1123L4287q8436o9622M7306K3731L3810J36604j9742N5940
21409g60558k5143O5847J48953J4153n8408K77155K24463J01472K12187R9021
21399B99142R4310K7035K39177K7030L9624m0214j6040J42203K32722J67655J8424
21388A231068j18180n8322j81251l2611p8912k26656j68738j31372j70039J3310
21378G8297L440j3581k21501k12776O668P8569l9543k085J9300J21055Q7281m8146
21366a43022J2769K74116J88691M0446P9051J11963P9858J80703M9047m6120K1198
$$ plain form
21355 848700 968000 947778 1129875 1303817 1166783 1107805 904123 800198 473395 240695
21345 240695 126133 -23825 -54896 -149684 -356997 -294647 -340110 -487075 -568289 -700843
21335 -700843 -714674 -732504 -588560 -747193 -975675 -885538 -903077 -1119383 -1112384 -877052 -925195
21324 -925195 -1013111 -1036486 -935146 -811877 -753971 -660670 -697006 -809330 -983920 -1050044 -1003376
21313 -1003376 -874880 -780318 -655791 -607142 -627589 -774715 -785000 -862382 -798021 -1009677
21303 -1009677 -1197174 -977464 -915412 -1042739 -1035188 -926512 -975735 -835766 -878831 -674562
21293 -674562 -741642 -832110 -900079 -968743 -984574 -878202 -898760 -1025566 -1145760 -1030025 -933278
21282 -933278 -988700 -1007536 -914436 -830432 -831236 -1033734 -997867 -1119177 -1188512 -1266365 -1358245
$$ packed form
21355H48700J19300k0222J82097J73942j37034n8978k03682j03925l26803k32700
21345B40695j14562j49958l1071r4788k07313O2350m5463j46965q1214j32554
21335g00843j3831j7830J43944j58633k28482R0137j7539k16306O999K35332m8143
21324i25195q7916k3375J01340J23269N7906R3301l6336j12324j74590o6124M6668
21313a003376J28496R4562J24527M8649k0447j47126j0285p7382O4361k11656
21303a009677j87497K19710O2052j27327P551J08676m9223J39969m3065K04269
21293f74562o7080r0468o7969o8664j5831J06372k0558j26806j20194J15735R6747
21282i33278n5422j8836R3100Q4004q04k02498L5867j21310o9335p7853r1880
$$ plain form
21271 -1358245 -1371697 -1276212 -1107131 -1021206 -1034408 -1226968 -1344330 -1309740 -1214955 -1180240 -1050116
21260 -1050116 -1047614 -1129190 -1075191 -1011201 -1029294 -1230239 -1268060 -1130086 -972001 -834492 -904133
21249 -904133 -960940 -894585 -870084 -957954 -895546 -828446 -921544 -947352 -950373 -1107398 -1195471
21238 -1195471 -1107505 -1126411 -1292088 -1276230 -1206123 -1138966 -1021304 -996252 -983422 -940930 -1022068
21227 -1022068 -1089025 -1243685 -1317464 -1265735 -1085754 -1158900 -1160114 -1290554 -1485946 -1408605 -1379032
21216 -1379032 -1438273 -1441150 -1340867 -1350350 -1370975 -1362461 -1352028 -1197619 -1185834 -1310844 -1276030
21205 -1276030 -1350393 -1197284 -1160057 -1109371 -1155771 -1123788 -1087180 -1186517 -1126659 -1115554 -1108799
21194 -1108799 -1179369 -1142184 -1079169 -1065864 -1183725 -1284348 -1370608 -1365542 -1431200 -1452621 -1329717
$$ packed form
21271a358245j3452R5485J69081Q5925j3202j92560j17362L4590R4785L4715J30124
21260a050116K502q1576N3999O3990j8093k00945l7821J37974J58085J37509o9641
21249i04133n6807O6355K4501q7870O2408O7100r3098k5808l021j57025q8073
21238a195471Q7966j8906j65677J5858P0107O7157J17662K5052J2830M2492q1138
21227a022068o6957j54660p3779N1729J79981p3146j214j30440j95392P7341K9573
21216a379032n9241k877J00283r483k0625Q514J0433J54409J1785j25010L4814
21205a276030p4363J53109L7227N0686m6400L1983L6608r9337N9858J1105O755
21194a108799p0570L7185O3015J3305j17861j00623q6260N066o5658k1421J22904
$$ plain form
21183 -1329717 -1192977 -1140873 -1148823 -1114266 -1112744 -1102555 -1050409 -1181051 -1409480 -1357988 -1217208
21172 -1217208 -1280881 -1369517 -1420189 -1482900 -1327228 -1136651 -1183630 -1216742 -1198960 -1258595 -1211318
21161 -1211318 -1085100 -1084409 -1270900 -1412347 -1419189 -1295543 -1215360 -1268836 -1475484 -1733492 -1682574
21150 -1682574 -1715844 -1646493 -1488094 -1352237 -1308437 -1203543 -1215754 -1165229 -1089378 -1217913
21140 -1217913 -1162214 -920969 -1150395 -1436340 -1460404 -1323487 -1232491 -1097385 -1263023 -1322036
21130 -1322036 -1263376 -1160057 -1100519 -1166607 -1362997 -1493614 -1432212 -1356479 -1290791 -1300633 -1270801
21119 -1270801 -1155630 -1205642 -1320574 -1356421 -1297878 -1363883 -1437462 -1461035 -1425477 -1317151 -1178836
21108 -1178836 -1370539 -1433435 -1516719 -1517555 -1458760 -1396314 -1493706 -1513547 -1491794 -1473121 -1372034
$$ packed form
21183a329717J36740N2104p950L4557J522J0189N2146j30642k28429N1492J40780
21172a217208o3673q8636n0672o2711J55672J90577m6979l3112J7782n9635M7277
21161a211318J26218O91j86491j41447o842J23646Q0183n3476k06648k58008N0918
21150a682574l3270O9351J58399J35857M3800J04894j2211N0525P5851j28535
21140a217913N5699K41245k29426k85945k4064J36917R0996J35106j65638n9013
21130a322036N8660J03319N9538o6088j96390j30617O1402P5733O5688r842K9832
21119a270801J15171n0012j14932l5847N8543o6005p3579k3573L5558J08326J38315
21108a178836j91703o2896q3284q36N8795O2446r7392j9841K1753J8673J01087
$$ plain form
21097 -1372034 -1215189 -1187907 -1271018 -1237066 -1215925 -1220035 -1386039 -1383770 -1342686 -1408742 -1357973
21086 -1357973 -1337245 -1417240 -1327839 -1337917 -1229373 -1210577 -1386853 -1517735 -1625199 -1775616
21076 -1775616 -1645958 -1509325 -1447408 -1342430 -1340885 -1399695 -1316932 -1286435 -1490195 -1593900
21066 -1593900 -1617837 -1588330 -1547032 -1578352 -1487538 -1448185 -1420640 -1495454 -1520481 -1362698 -1332769
21055 -1332769 -1417237 -1441865 -1471860 -1518963 -1505824 -1368317 -1269934 -1246752 -1444033 -1406136 -1467296
21044 -1467296 -1465866 -1409815 -1368541 -1306320 -1330893 -1351648 -1448270 -1527303 -1586489 -1756208 -1933740
21033 -1933740 -1913150 -1773045 -1729764 -1623559 -1516428 -1657746 -1604552 -1582489 -1697857 -1673246
21023 -1673246 -1596462 -1620683 -1741820 -1804993 -1738490 -1439883 -1467226 -1531846 -1527860 -1587709 -1668786
$$ packed form
21097a372034J56845K7282q3111L3952K1141m110j66004K269M1084o6056N0769
21086a357973K0728p9995Q9401j0078J08544J8796j76276j30882j07464j50417
21076a775616J29658J36633O1917J04978J545n8810Q2763L0497k03760j03705
21066a593900k3937K9507M1298l1320R0814L9353K7545p4814k5027J57783K9929
21055a332769q4468k4628k9995m7103J3139J37507R8383K3182j97281L7897o1160
21044a467296J430N6051M1274O2221k4573k0755r6622p9033n9186j69719j77532
21033a933740K0590J40105M3281J06205J07131j41318N3194K2063j15368K4611
21023a673246P6784k4221j21137o3173O6503K98607k7343o4620L986n9849q1077
$$ plain form
21012 -1668786 -1598582 -1601457 -1522569 -1506965 -1635337 -1698224 -1602654 -1708667 -1755546 -1735261 -1505417
21001 -1505417 -1492388 -1698462 -1661530 -1700189 -1813133 -1887775 -1825435 -1631352 -1700264 -1761933 -1836389
20990 -1836389 -1808265 -1910149 -2027571 -1831078 -1871566 -1845077 -1725285 -1701792 -1874471 -1868839
20980 -1868839 -1853513 -1875837 -1833002 -1791448 -1996780 -2077898 -2031036 -2086310 -2073968 -1982432 -1953748
20969 -1953748 -2035828 -2109648 -2191862 -2130932 -2109247 -1840253 -1811352 -1947326 -2081415 -2094516 -2083176
20958 -2083176 -2085282 -1937238 -1886813 -1885996 -1948305 -1905980 -1889159 -1704345 -1826463 -1971340 -1906448
20947 -1906448 -1737042 -1717127 -1659074 -1614986 -1655182 -1923393 -1801953 -1676973 -1707928 -1861971
20937 -1861971 -1982043 -2037484 -2012963 -2005084 -1969160 -1942989 -1915316 -1959672 -2110437 -2140989 -2266096
$$ packed form
21012a668786P0204k875P8888J5604j28372o2887R5570j06013m6879K0285K29844
21001a505417J3029k06074L6932l8659j12944p4642O2340J94083o8912o1669p4456
20990a836389K8124j01884j17422J96493m0488K6489J19792K3493j72679N632
20980a868839J5326k2324M2835M1554k05332q1118M6862n5274J2342R1536K8684
20969a953748q2080p3820q2214O0930K1685K68994K8901j35974j34089j3101J1340
20958b083176k106J48044N0425Q17o2309M2325J6821J84814j22118j44877O4892
20947a906448J69406J9915N8053M4088m0196k68211J21440J24980l0955j54043
20937a861971j20072n5441K4521P879L5924K6171K7673m4356j50765l0552j25107
$$ plain form
20926 -2266096 -2235225 -2108181 -2153461 -2305730 -2411711 -2400318 -2386249 -2312131 -2358111 -2146171
20916 -2146171 -2065406 -2012834 -1929612 -1749446 -1593866 -1709544 -1942199 -1990036 -1933346 -1863292
20906 -1863292 -1951896 -1851114 -1792123 -1822404 -1919551 -1946859 -2078935 -1988033 -1984324 -2037488 -2111792
20895 -2111792 -2164748 -2261849 -2361517 -2247620 -2336771 -2399667 -2177902 -2111150 -2064945 -2144527 -2141954
20884 -2141954 -2014938 -2220855 -2282051 -2248755 -2177926 -2241415 -2170109 -2169672 -2493648 -2489781 -2437180
20873 -2437180 -2422608 -2424749 -2344807 -2379295 -2491810 -2774653 -2899745 -2766121 -2488925 -2393951
20863 -2393951 -2386791 -2394945 -2346252 -2393120 -2585223 -2488549 -2306172 -2161881 -2137661 -2072543 -1850898
20852 -1850898 -1823590 -1971148 -1973333 -1875699 -1754184 -1845663 -1896658 -1775586 -1631965 -1560532 -1358583
$$ packed form
20926b266096L0871J27044m5280j52269j05981J1393J4069P4118m5980K11940
20916b146171Q0765N2572Q3222J80166J55580j15678k32655m7837N6690P0054
20906a863292q8604J00782N8991l0281r7147k7308j32076R0902L709n3164p4304
20895b111792n2956r7101r9668J13897q9151o2896K21765O6752M6205p9582K573
20884b141954J27016k05917o1196L3296P0829o3489P1306M37l23976L867N2601
20873b437180J4572k141P9942l4488j12515k82843j25092J33624K77196R4974
20863b393951P160q154M8693m6868j92103R6674J82377J44291K4220O5118K21645
20852a850898K7308j47558k185R7634J21515r1479n0995J21072J43621P1433K01949
$$ plain form
20841 -1358583 -1313786 -1201559 -984797 -849543 -652570 -394895 -236072 -262682 -378012 -384398
20831 -384398 -138282 156995 706782 1270940 1612970 2144751 2773701 3365651 3971832 4752670
20821 4752670 5752033 6943042 8425178 10024600 11644940 13224829 14824099 16986408
20813 16986408 19878203 23436963 27850112 33301255 40493132 49734543 61737584 77079282
20805 77079282 96327246 119522537 147684303 181663796 219322986 253324149 275603345
20798 275603345 282502377 276160052 266321520 264717122 276264229 301267327 336040607
20791 336040607 372800617 399383224 405979238 392089061 362556352 328302254 298756539
20784 298756539 275273858 254459163 235354723 218177045 202844753 188414953 173644211
$$ packed form
20841a358583M4797J12227K16762J35254J96973K57675J58823k6610j15330o386
20831c84398K46116K95277N49787N64158L42030N31781O28950N91950O06181P80838
20821D752670R99363J191009J482136J599422J620340J579889J599270K162309
20813A6986408K891795L558760M413149N451143P191877R241411J2003041J5341698
20805G7079282J9247964K3195291K8161766L3979493L7659190L4001163K2279196
20798B75603345O899032o342325r838532j604398J1547107K5003098L4773280
20791C36040607L6760010K6582607O596014j3890177k9532709l4254098k9545715
20784B98756539k3482681k0814695j9104440j7177678j5332292j4429800j4770742
$$ plain form
20777 173644211 157997625 143167936 132190320 126672120 126986661 132904904 143548924
20770 143548924 156821743 170074742 181639367 191049411 199205503 207548307 217611327
20763 217611327 231188168 251559910 282223559 323162374 367319975 401588144 416042991
20756 416042991 410521342 391534002 370361611 354373931 343699521 337262182 336922870
20749 336922870 341979192 345113452 336328267 310186661 268610267 221967701 180435668
20742 180435668 147565412 122899195 104656813 90997772 80423717 72046787 65156033
20735 65156033 59217955 54256965 50199735 46395169 43034843 39982185 37195961 34780703
20727 34780703 32476880 30393750 28382845 26569018 24851917 23405887 22240202 21040370
$$ packed form
20777A73644211j5646586j4829689j0977616n518200L14541N918243J0644020
20770A43548924J3272819J3252999J1564625R410044Q156092Q342804J0063020
20763B17611327J3576841K0371742L0663649M0938815M4157601L4268169J4454847
20756D16042991n521649j8987340k1172391j5987680j0674410o437339l39312
20749C36922870N056322L134260q785185k6141606m1576394m6642566m1532033
20742A80435668l2870256k4666217j8242382j3659041j0574055q376930o890754
20735F5156033n938078m960990m057230l804566l360326l052658k786224k415258
20727C4780703k303823k083130k010905j813827j717101j446030j165685j199832
$$ plain form
20719 21040370 19855564 18858401 18077235 17394501 16566702 15837252 15196403 14714145 14136803
20710 14136803 13653318 13181777 12428141 11828168 11590601 11435772 11072440 10637592 10283142
20701 10283142 10089398 9693159 9468933 9208276 8861432 8515480 8385166 8288668 8018970
20692 8018970 7815736 7650509 7391349 7190131 7117355 6977480 6802621 6800068 6589073 6457399
20682 6457399 6298170 6122690 6053551 6008421 5897698 5694553 5738772 5635215 5483838 5491762
20672 5491762 5596287 5336517 5186685 5230034 5003022 4650231 4653897 4769842 4711923 4680457
20662 4680457 4418728 4216090 4208324 4050714 4076655 4059091 3979338 3915877 3848101 3700906 3504109
20651 3504109 3479153 3561680 3448752 3196790 3078141 3086810 2999518 2965817 3000429 2896395 2863851
$$ packed form
20719B1040370j184806r97163p81166o82734q27799p29450o40849m82258n77342
20710A4136803m83485m71541p53636n99973k37567j54829l63332m34848l54450
20701A0283142j93744l96239k24226k60657l46844l45952j30314r6498k69698
20692H018970k03234j65227k59160k01218p2776j39875j74859k553k10995j31674
20682F457399j59229j75480o9139m5130j10723k03145M4219j03557j51377P924
20672E491762J04525k59770j49832M3349k27012l52791L666J15945n7919l1466
20662D680457k61729k02638p766j57610K5941j7564p9753o3461o7776j47195j96797
20651C504109k4956Q2527j12928k51962j18649Q669q7292l3701L4612j04034l2544
$$ plain form
20640 2863851 2954398 2993876 2951213 2913197 2986816 2922210 2808143 2822252 2811224 2737089 2734556
20629 2734556 2712719 2798180 2869975 2818301 2856602 2963681 2992171 2837195 2778250 2726590 2633973
20618 2633973 2601892 2570832 2507420 2473505 2426276 2450611 2291943 2077500 2152796 2313033 2063116
20607 2063116 1616720 1522875 1584600 1507147 1642347 1720537 1847499 1789213 1661329 1653717 1713857
20596 1713857 1762854 1697251 1669854 1745252 1693261 1522133 1475167 1607767 1560276 1514121 1581582
20585 1581582 1742052 1961611 1928253 1767155 1762444 1631621 1471696 1604286 1751330 1624173
20575 1624173 1482470 1422402 1430646 1349326 1351560 1497822 1500885 1566498 1601086 1527789 1452907
20564 1452907 1375069 1238300 1273160 1358072 1345901 1416966 1271631 1221255 1162122 1171672 1274115
$$ packed form
20640B863851R0547L9478m2663l8016P3619o4606j14067J4109j1028p4135k533
20629B734556k1837Q5461P1795n1674L8301J07079K8490j54976n8945n1660r2617
20618B633973l2081l1060o3412l3915m7229K4335j58668k14443P5296J60237k49917
20607B063116m46396r3845O1725p7453J35200P8190J26962n8286j27884p612O0140
20596A713857M8997o5603k7397P5398n1991j71128m6966J32600m7491m6155O7461
20585A581582J60470K19559l3358j61098m711j30823j59925J32590J47044j27157
20575A624173j41703o0068Q244q1320K234J46262L063O5613L4588p3297p4882
20564A452907p7838j36769L4860Q4912j2171P1065j45335n0376n9133R550J02443
$$ plain form
20553 1274115 1395959 1477287 1319800 1149620 1206098 1315765 1274614 1243091 1153285 1155120 1061844
20542 1061844 1094462 1255587 1308731 1342566 1340768 1310967 1072888 993368 752754 686565 824275
20531 824275 831583 864473 862456 866043 954848 1074391 924070 749060 618921 810202 963390
20520 963390 1148765 1223715 1273764 1244645 1198524 1091628 1022560 1089315 1255303 1161760 896514
20509 896514 687798 697994 821316 975113 974391 814665 694983 744782 806355 717080 720354
20498 720354 659456 725754 662632 537653 473222 383721 420367 537171 657532 559612 388859
20487 388859 442302 421606 398731 429596 308280 157489 178581 368676 451961 494433 543153
20476 543153 535503 578677 647130 712975 720822 720161 648777 624243 687081 695811 697533 677690 533511
$$ packed form
20553A274115J21844Q1328j57487j70180N6478J09667m1151l1523q9806J835r3276
20542A061844L2618J61125N3144L3835j798k9801k38079p9520k40614o6189J37710
20531H24275P308L2890k017L587Q8805J19543j50321j75010j30139J91281J53188
20520I63390J85375P4950N0049k9119m6121j06896o9068O6755J65988r3543k65246
20509H96514k08716J0196J23322J53797p22j59726j19682M9799O1573q9275L274
20498G20354o0898O6298o3122j24979o4431q9501L6646J16804J20361r7920j70753
20487C88859N3443k0696k2875L0865j21316j50791K1092J90095Q3285M2472M8720
20476E43153p650M3174O8453O5845P847o61p1384k4534O2838Q730J722j9843j44179
$$ plain form
20463 533511 558805 415871 285332 227836 238621 233704 288679 279337 377473 362116 459071
20452 459071 355610 379168 481097 468189 235066 122812 210676 237945 212029 189715 282930
20441 282930 353903 254673 56932 51819 112902 86402 26199 174309 213537 -32880 -214669
20430 -214669 -103925 -62077 -85964 -85443 -65967 -18705 -7264 -70552 -92401 98696 123005
20419 123005 96264 17454 21929 23962 -9143 108496 205295 103041 -23404 -43930 61350
20408 61350 2915 -78735 -93075 -103735 -222307 -146606 -166697 -305278 -345406 -275556 -378924
20397 -378924 -417651 -317379 -370624 -279297 -273275 -237326 -261235 -204075 -202114 -304230 -340862
20386 -340862 -346951 -271882 -342509 -444091 -534487 -370436 -408731 -442054 -398238 -325911 -352472
$$ packed form
20463E33511K5294j42934j30539n7496J0785m917N4975r342R8136j5357R6955
20452D59071j03461K3558J01929j2908k33123j12254Q7864K7269k5916k2314R3215
20441B82930P0973r9230j97741n113O1083k6500o0203J48110L9228k46417j81789
20430b14669J10744M1848k3887N21J9476M7262J1441o3288k1849J91097K4309
20419A23005k6741p8810M475K033l3105J17639R6799j02254j26445k0526J05280
20408F1350n8435q1650j4340j0660j18572P5701k0091j38581m0128O9850j03368
20397c78924l8727J00272n3245R1327O022L5949k3909N7160J961j02116l6632
20386c40862o089P5069p0627j01582r0396J64051l8295l3323M3816P2327k6561
$$ plain form
20375 -352472 -389463 -507086 -453469 -420674 -379364 -323800 -397806 -500398 -429573 -371331 -400979
20364 -400979 -446765 -286861 -258954 -230401 -142080 51853 12029 121333 80113 202257 287020
20353 287020 222805 97058 -27457 -43355 68684 -47170 94813 310644 434800 409446
20343 409446 386809 482619 569640 639682 816507 958420 1170212 1481252 1941089 2345359
20333 2345359 2856994 3189410 3502074 4123397 4993418 6193783 7866783 10331339 14009975
20324 14009975 18979791 25925146 35776035 47281453 56702521 60505250 58242023 51836840
20316 51836840 46499260 45625190 49960330 59884265 75906895 95213972 109027574 111225087
20308 111225087 101141481 81908871 64127864 53535689 48835129 49035545 53459866
$$ packed form
20375c52472l6991j17623N3617L2795M1310N5564p4006j02592P0825N8242k9648
20364d00979m5786J59904K7907K8553Q8321J93933l9824J09304m1220J22144Q4763
20353B87020o4215j25747j24515j5898J12039j15854J41983K15831J24156k5354
20343D09446k2637R5810Q7021P0042J76825J41913K11792L11040M59837M04270
20333B345359N11635L32416L12664O21323Q70021J200365J673000K464556L678636
20324A4009975M969816O945355R850889J1505418R421068L802729k263227o405183
20316E1836840n337580q74070M335140R923935J6022630J9307077J3813602K197513
20308A11225087j0083606j9232610j7781007j0592175m700560K00416M424321
$$ plain form
20301 53459866 59906128 63990920 62610975 55525289 44308636 34093074 26942370 22330184
20293 22330184 19354748 17049216 15319789 14105282 13490572 13080667 12821479 12817236 13062673
20284 13062673 13648653 14002007 14552853 15390361 16835135 19156406 22521953 27487080 34483846
20275 34483846 44389402 57853637 74615019 92018665 107616154 119888221 125628655
20268 125628655 124897830 121189001 116166027 116184030 127179495 151770711 188508278 227029806
20260 227029806 249782520 246422576 217484582 175257557 140402169 121081913 114609583
20253 114609583 116450946 121633702 126499348 128439924 123266362 111185036 94835720 75726827
20245 75726827 58969914 47245623 39508040 34119224 30228888 27615321 25746406 24099006
$$ packed form
20301E3459866O446262M084792j379945p085686j1216653j0215562p150704m612186
20293B2330184k975436k305532j729427j214507o14710m09905k59188m243K45437
20284A3062673N85980L53354N50846Q37508J444774K321271L365547M965127O996766
20275C4483846R905556J3464235J6761382J7403646J5597489J2272067N740434
20268A25628655p30825l708829n022974J8003J0995465K4591216L6737567L8521528
20260B27029806K2752714l359944k8937994m2227025l4855388j9320256o472330
20253A14609583J841363N182756M865646J940576n173562j2081326j6349316j9108893
20245G5726827j6756913j1724291p737583n388816l890336k613567j868915j647400
$$ plain form
20237 24099006 22476565 21057373 19971644 19167033 18695534 18437341 18570115 19156506 20257039
20228 20257039 21913125 24176542 27464484 32262347 39739367 50667194 64625372 77791449
20220 77791449 84640765 84049701 76716134 68291133 65000081 68091428 77875330 95226486
20212 95226486 118383796 138631828 146055612 138127918 116394779 91953300 75078914
20205 75078914 66752795 64675878 68177221 75464402 81574869 81930448 75247924 62183345
20197 62183345 48248805 37889108 30965549 26189825 22577278 20181461 18686272 17529498
20189 17529498 16502906 15367949 14320826 13196526 12124662 11326622 10539586 10109447
20181 10109447 9952205 9905232 9637693 9235183 8648496 8171733 7729156 7254638 6863875
$$ packed form
20237B4099006j622441j419192j085729q04611m71499k58193J32774N86391J100533
20228B0257039J656086K263417L287942M797863P477020J0927827J3958178J3166077
20220G7791449O849316n91064p333567q425001l291052L091347R783902J7351156
20212I5226486K3157310K0248032P423784p927694k1733139k4441479j6874386
20205G5078914q326119k076917L501343P287181O110467L55579o682524j3064579
20197F2183345j3934540j0359697o923559m775724l612547k395817j495189j156774
20189A7529498j026592j134957j047123j124300j071864p98040p87036m30139
20181A0109447j57242m6973k67539m02510n86687m76763m42577m74518l90763
$$ plain form
20172 6863875 6489197 6050363 5693524 5485754 5309905 5208558 5149766 4971393 4836198 4839172
20162 4839172 4778848 4804096 4820972 4807420 4925365 4938719 4843895 4873998 4945135 4983144 5014040
20151 5014040 5094586 4924480 4940305 5006917 4901178 4621702 4240132 3893248 3898549 3867822
20141 3867822 3764516 3772625 3596691 3460916 3342464 3124473 3288824 3328379 3169025 2851820
20131 2851820 2638367 2559899 2553338 2586079 2436327 2218298 1987450 1955339 2129652 1990189
20121 1990189 1865144 1853511 1938939 1985187 1920813 1899929 1937494 1895437 1941583 1796967 1670936
20110 1670936 1628038 1550287 1471264 1438038 1375703 1294072 1138417 1483200 1573197 1533952 1517259
20099 1517259 1312792 1296591 1473584 1488331 1515475 1567488 1461511 1470406 1640752 1622098 1417499
$$ packed form
20172F863875l74678m38834l56839k07770j75849j01347n8792j78373j35195K974
20162D839172o0324K5248J6876j3552J17945J3354r4824L0103P1137L8009L0896
20151E014040Q0546j70106J5825O6612j05739k79476l81570l46884N301l0727
20141C867822j03306Q109j75934j35775j18452k17991J64351L9555j59354l17205
20131B851820k13453p8468o561L2741j49752k18029k30848l2111J74313j39463
20121A990189j25045j1633Q5428M6248o4374k0884L7565m2057M6146j44616j26031
20110A670936m2898p7751p9023l3226o2335q1631j55655L44783Q9997l9245j6693
20099A517259k04467j6201J76993J4747K7144N2013j05977Q895J70346j8654k04599
$$ plain form
20088 1417499 1353280 1421162 1437637 1417852 1286652 1191494 1300109 1272406 1109892 1117338 1376712
20077 1376712 1539974 1622282 1587458 1647378 1614276 1525525 1357516 1263391 1091651 950230
20067 950230 989950 1197539 1102323 1172235 1180459 1067763 834443 674683 768305 925240 940544
20056 940544 969607 927594 896010 1026786 1074236 1047983 1008293 1089876 1113388 980084 929264
20045 929264 1000229 916980 580368 561764 579239 786720 931465 940285 881602 727275 579119
20034 579119 752435 924494 860410 845378 870661 973065 933431 907264 983396 995324 1143733
20023 1143733 1134472 1367631 1661941 1916014 1994431 2010418 2026084 2025303 2065394 2038720 1992992
20012 1992992 1999383 2121670 2085901 1929658 1838582 1786223 1827057 1743984 1579262 1466968 1415613
$$ packed form
20088A417499o4219O7882J6475j9785j31200r5158J08615k7703j62514P446K59374
20077A376712J63262Q2308l4824N9920l3102q8751j68009r4125j71740j41421
20067I50230L9720K07589r5216O9912Q224j12696k33320j59760R3622J56935J5304
20056I40544K9063m2013l1584J30776M7450k6253l9690Q1583K3512j33304n0820
20045I29264P0965q3249l36612j8604J7475K07481J44745Q820n8683j54327j48156
20034E79119J73316J72059o4084j5032K5283J02404l9634k6167P6132J1928J48409
20023A143733r261K33159K94310K54073P8417J5987J5666p81M0091k6674m5728
20012A992992O391J22287l5769j56243r1076n2359M0834q3073j64722j12294n1355
$$ plain form
20001 1415613 1393582 1269079 1141546 934014 788789 730612 819192 785791 762527 757610 828262
19990 828262 945434 987234 906701 874700 1033916 1194986 1346664 1494849 1503876 1430049 1454310
19979 1454310 1794313 1988335 1875943 1770217 1815707 1914190 1874827 2143066 2373732 2385880
19969 2385880 2229478 2220005 2102756 1921521 1710305 1593216 1719640 1771646 1636477 1489931
19959 1489931 1471972 1635048 1669636 1597909 1448436 1431370 1544227 1241125 1050302 941207
19949 941207 740587 712552 675298 678379 652070 469701 444871 540293 590652 715651 718211
19938 718211 612184 615153 652565 878474 1186010 1263008 1232381 1141526 1322218 1370263 1174771
19927 1174771 1142726 1209090 1375909 1310674 1214208 1157598 1131659 1195788 1017923 823869 825982
$$ packed form
20001A415613k2031j24503j27533k07532j45225n8177Q8580l3401k3264m917P0652
19990H28262J17172M1800q0533l2001J59216J61070J51678J48185R027p3827K4261
19979A454310L40003J94022j12392j05726M5490R8483l9363K68239K30666J2148
19969B385880j56402r473j17249j81235k11216j17089J26424N2006j35169j46546
19959A489931j7959J63076L4588p1727j49473j7066J12857l03102j90823j09095
19949I41207k00620k8035l7254L081k6309j82369k4830R5422N0359J24999K560
19938G18211j06027K969L7412K25909L07536P6998l0627r0855J80692M8045j95492
19927A174771l2045O6364J66819o5235r6466n6610k5939O4129j77865j94054K113
$$ plain form
19916 825982 920286 837826 611632 495281 463453 483475 361666 377165 518500 473909 423920
19905 423920 457452 365029 232061 279211 319414 222312 261666 184903 311436 405832 219835
19894 219835 186531 128800 -69188 -110458 -66266 -94094 27581 148135 216096 267054 266294
19883 266294 264886 217663 180034 173080 94103 -25936 -60380 55604 169575 216495 187532
19872 187532 221064 17411 20598 143786 203356 234041 121017 151148 233496 239948 253833
19861 253833 245780 37504 -4751 136631 183532 141260 -18239 9237 -36480 34489 50821
19850 50821 103428 51527 -55233 -83631 -41923 -23645 140188 156740 -70565 -184540 -237701
19839 -237701 -222514 -167723 -174847 -251640 -202996 -6771 -31070 -132175 -231975 -175290 -101080
$$ packed form
19916H25982R4304q2460k26194j16351l1828K0022j21809J5499J41335m4591m9989
19905D23920L3532r2423j32968M7150M0203r7102L9354p6763J26533R4396j85997
19894B19835l3304n7731j97988m1270M4192k7828J21675J20554O7961N0958p60
19883B66294j408m7223l7629o954p8977j20039l4444J15984J13971M6920k8963
19872A87532L3532k03653L187J23188N9570L0685j13024L0131Q2348O452J3885
19861B53833q053k08276m2255J41382M6901m2272j59499K7476m5717P0969J6332
19850E0821N2607n1901j06760k8398M1708J8278J63833J6552k27305j13975n3161
19839b37701J5187N4791p124p6793M8644J96225k4299j01105r9800N6685P4210
$$ plain form
19828 -101080 63747 235282 293798 298345 116273 -111574 28828 84854 24745 -7605 -48599
19817 -48599 -6718 -79488 7306 59528 69473 11169 -149272 -258792 -273876 -131483 -39400
19806 -39400 -172903 -169687 -104644 35743 50830 43461 -111763 -31570 77988 165128 204796
19795 204796 179999 164814 -33593 -199634 -341371 -274779 -168853 -124989 -220986 -268938 -250670
19784 -250670 -105654 -11062 161203 142148 58891 33575 57573 -46605 -46435 -119715 -125421
19773 -125421 -165007 -181702 -40723 96362 72571 -35453 -171980 -193152 -225803 -353112
19763 -353112 -287868 -55746 200151 235739 154315 71344 63917 148865 108321 63500 -78820
19752 -78820 -228757 -85532 -129267 -274509 -358048 -300127 -329784 -467923 -523564 -564666 -548488
$$ packed form
19828a01080J64827J71535N8516M547j82072k27847J40402N6026o0109l2350m0994
19817d8599M1881p2770Q6794N2222R945n8304j60441j09520j5084J42393R2083
19806c9400j33503L216O5043J40387J5087p369j55224Q0193J09558Q7140L9668
19795B04796k4797j5185j98407j66041j41737O6592J05926M3864r5997m7952J8268
19784b50670J45016R4592J72265j9055q3257k5316K3998j04178J70p3280n706
19773a25421l9586j6695J40979J37085k3791j08024j36527k1172l2651j27309
19763c53112O5244K32122K55897L5588q1424q2971p427Q4948m0544m4821j42320
19752g8820j49937J43225m3735j45242q3539N7921k9657j38139n5641m1102J6178
$$ plain form
19741 -548488 -496674 -261511 -134295 -164999 -104134 58295 71901 -137975 -88754 251934
19731 251934 288367 136339 165736 225219 286854 590685 681296 627103 759014 1013921 1094214
19720 1094214 1043481 965334 750859 342356 205798 232603 153360 165646 178621 34723
19710 34723 -129296 -35523 120541 166935 180280 148588 -141949 -196424 -194269 -243624 -214078
19699 -214078 -138326 -189657 -172401 -285006 -427122 -175939 -52380 -5608 -63023 -175804
19689 -175804 -165423 -177026 -112071 -70638 -19002 228416 433971 449647 331813 353881 200861
19678 200861 115060 218756 166143 264091 296748 180260 265412 412276 421071 180625 69996
19667 69996 -110866 -137645 -188180 -150443 -147074 -284663 -313155 -263434 -356176 -453724 -484567
$$ packed form
19741e48488N1814K35163J27216l0704O0865J62429J3606k09876M9221L40688
19731B51934L6433j52028K9397N9483O1635L03831R0611n4193J31911K54907Q0293
19720A094214n0733p8147k14475m08503j36558K6805p9243J2286J2975j43898
19710C4723j64019R3773J56064M6394J3345l1692k90537n4475K155m9355K9546
19699b14078P5752n1331J7256j12605j42116K51183J23559M6772n7415j12781
19689a75804J0381j1603O4955M1433N1636K47418K05555J5676j17834K2068j53020
19678B00861q5801J03696n2613R7948L2657j16488Q5152J46864Q795k40446j10629
19667F9996j80862k6779n0535L7737L369j37589k8492M9721r2742r7548l0843
$$ plain form
19656 -484567 -549748 -655362 -534861 -513605 -353910 -358353 -512749 -685126 -699843 -693264 -618433
19645 -618433 -468028 -630747 -850471 -798386 -679264 -687052 -616870 -575774 -572886 -608194 -634963
19634 -634963 -667982 -662175 -633855 -589807 -681030 -472878 -435222 -359930 -296576 -472296 -577026
19623 -577026 -620611 -532031 -321890 -335475 -471106 -596393 -457937 -558058 -577278 -562183
19613 -562183 -636472 -768771 -773660 -899072 -898589 -814451 -639549 -625421 -608038 -856105 -979295
19602 -979295 -1066701 -958389 -840173 -780325 -591731 -466205 -531383 -586540 -731408 -875154
19592 -875154 -836256 -864493 -746079 -650719 -674759 -549853 -486784 -468193 -458345 -417366 -518694
19581 -518694 -490179 -377947 -472358 -504337 -563722 -520174 -683402 -659439 -669190 -651179 -664212
$$ packed form
19656d84567o5181j05614J20501K1256J59695m443j54396j72377j4717O579P4831
19645f18433J50405j62719k19724N2085J19122p788P0182M1096K888l5308k6769
19634f34963l3019N807K8320M4048r1223K08152L7656P5292O3354j75720j04730
19623e77026m3585Q8580K10141j3585j35631j25287J38456j00121j9220J5095
19613e62183p4289j32299m889j25412M83Q4138J74902J4128J7383k48067j23190
19602i79295q7406J08312J18216N9848J88594J25526o5178n5157j44868j43746
19592h75154L8898k8237J18414R5360k4040J24906O3069J8591R848M0979j01328
19581e18694K8515J12232r4411l1979n9385M3548j63228K3963r751J8011j3033
$$ plain form
19570 -664212 -687470 -721964 -738925 -845109 -974059 -998525 -833430 -824791 -898162 -837803 -720372
19559 -720372 -746581 -886131 -938457 -796339 -713551 -722023 -854005 -1047825 -1073747 -1022667 -919737
19548 -919737 -716422 -522496 -457093 -619927 -709161 -608357 -647850 -555892 -618549 -619503 -584010
19537 -584010 -667003 -664179 -721374 -674595 -535573 -447526 -490480 -555069 -662981 -644280 -594416
19526 -594416 -600429 -591709 -590527 -441720 -382771 -492224 -407711 -324965 -357585 -401193 -290158
19515 -290158 52402 242696 300901 248613 156979 132824 230964 328419 478468 629838 788330
19504 788330 1058745 1385009 1556841 1738001 2053246 2487744 2789748 3324653 3802857 4367831
19494 4367831 4992730 5417745 5909496 6645312 7451767 8379196 9395688 10834841 12488927
$$ packed form
19570f64212k3258l4494j6961j06184j28950k4466J65095Q639p3371O0359J17431
19559g20372k6209j39550n2326J42118Q2788q472j31982j93820k5922N1080J02930
19548i19737K03315J93926O5403j62834q9234J00804l9493R1958o2657r54L5493
19537e84010q2993K824n7195M6779J39022Q8047m2954o4589j07912J8701M9864
19526e94416o013Q720J182J48807N8949j09453Q4513Q2746l2620m3608J11035
19515b90158L42560J90294N8205n2288r1634k4155R8140R7455J50049J51370J58492
19504G88330K70415L26264J71832J81160L15245M34498L02004N34905M78204N64974
19494D367831O24899M25015M91751P35816Q06455R27429J016492J439153J654086
$$ plain form
19485 12488927 14184896 16468021 19347140 22701500 27011855 32404118 39379473 48837117
19477 48837117 61315554 78227612 100376812 127895781 160895182 198103576 234931638
19470 234931638 263695940 277717125 274933942 258699477 237335397 218570822 204798409
19463 204798409 194701765 186549280 178489342 168747491 156809352 142298163 125029293
19456 125029293 106836023 90635389 77816040 68345490 61728868 57312168 54617824
19449 54617824 53318826 53047422 53822737 55668760 59130089 64541505 72242053 83291598
19441 83291598 97958990 115771324 134895759 152914457 168263887 180788804 191055162
19434 191055162 201086451 212569269 227252561 247133425 272716267 299111464 318582492
$$ packed form
19485A2488927J695969K283125K879119L354360M310355N392263O975355R457644
19477D8837117J2478437J6912058K2149200K7518969L2999401L7208394L6828062
19470B34931638K8764302J4021185k783183j6234465k1364080j8764575j3772413
19463B04798409j0096644q152485q059938r741851j1938139j4511189j7268870
19456A25029293j8193270j6200634j2819349r470550o616622m416700k694344
19449E4617824j298998k71404P75315J846023L461329N411416P700548J1049545
19441H3291598J4667392J7812334J9124435J8018698J5349430J2524917J0266358
19434A91055162J0031289J1482818J4683292J9880864K5582842K6395197J9471028
$$ plain form
19427 318582492 326113131 321626588 310446938 301748915 301803226 309843468 319114194 322493186
19419 322493186 315741925 298133090 273466992 248543641 227493872 210456092 196315688
19412 196315688 184191821 173303374 163249306 153162513 141553626 127410380 111622727
19405 111622727 96571909 84043784 74621997 67872128 63149434 59872624 57649756 56517707
19397 56517707 56832963 58642877 61949599 66968721 74685617 85410791 98748005 112773600
19389 112773600 125422741 135733043 144193814 151893423 159897608 169035097 179778097
19382 179778097 192718618 208542447 226046822 239895221 244455369 236211528 215086457
19375 215086457 185606477 154174700 125952084 102661950 84205097 70381841 60134046
$$ packed form
19427C18582492P530639m486543j1179650q698023N4311Q040242R270726L378992
19419C22493186o751261j7608835k4666098k4923351k1049769j7037780j4140404
19412A96315688j2123867j0888447j0054068j0086793j1608887j4143246j5787653
19405A11622727j5050818j2528125r421787o749869m722694l276810k222868j132049
19397E6517707L15256J809914L306722N019122P716896J0725174J3337214J4025595
19389A12773600J2649141J0310302Q460771P699609Q004185R137489J0743000
19382A79778097J2940521J5823829J7504375J3848399M560148q243841k1125071
19375B15086457k9479980l1431777k8222616k3290134j8456853j3823256j0247795
$$ plain form
19368 60134046 52429616 46310984 41419420 37325684 33981530 31022125 28530222 26477920
19360 26477920 24635844 22928826 21462038 20182389 18923308 17758800 16829002 16139881
19352 16139881 15363690 14572582 13990486 13379037 12839569 12229833 11632666 11048724 10617314
19343 10617314 10330289 10008653 9749656 9371499 8961548 8794876 8818034 8727339 8346026 7998996
19333 7998996 7804766 7591539 7309130 7226248 7164395 6972387 6849128 6815631 6595760 6179981
19323 6179981 6043623 5929518 5844294 5686450 5401817 5339658 5346995 5298369 5127027 4972068
19313 4972068 4908138 4861998 4827841 4713778 4780704 4776293 4672810 4541618 4624193 4557425 4407357
19302 4407357 4441687 4509218 4473851 4414423 4423015 4395433 4265900 4103941 4016764 3957151 3809451
$$ packed form
19368F0134046p704430o118632m891564m093736l344154k959405k491903k052302
19360B6477920j842076j707018j466788j279649j259081j164508r29798o89121
19352A6139881p76191p91108n82096o11449n39468o09736n97167n83942m31410
19343A0617314k87025l21636k58997l78157m09951j66672K3158r0695l81313l47030
19333G998996j94230k13227k82409q2882o1853j92008j23259l3497k19871m15779
19323F179981j36358j14105q5224j57844k84633o2159P337m8626j71342j54959
19313D972068o3930m6140l4157j14063O6926m411j03483j31192Q2575o6768j50068
19302D407357L4330O7531l5367n9428Q592k7582j29533j61959q7177n9613j47700
$$ plain form
19291 3809451 3685446 3816818 3949777 3807259 3880753 3767332 3633431 3630529 3567869 3498048
19281 3498048 3557080 3549871 3312076 3167449 3046499 3015683 3029539 2984019 2832224 2984765
19271 2984765 2979988 2940270 3018564 2875350 2653880 2684339 2630904 2543122 2603453 2619004 2751677
19260 2751677 2868422 2890903 2815952 2722183 2625864 2505207 2620797 2732675 2683348 2834946
19250 2834946 2913532 2861106 2887748 2925286 2798446 2769137 2872364 2809795 2618456 2633101 2716973
19239 2716973 2772879 2713813 2634262 2430680 2389872 2389551 2321261 2169675 2073043 2081772 2174848
19228 2174848 2178370 2109561 2060783 2004485 2012980 2113787 2244178 2172463 2210614 2259709 2027779
19217 2027779 1971614 2059106 2124334 2340774 2380015 2346773 2355364 2258043 2078725 1810900 1882940
$$ packed form
19291C809451j24005J31372J32959j42518P3494j13421j33901k902o2660o9821
19281C498048N9032p209k37795j44627j20950l0816J3856m5520j51795J52541
19271B984765m777l9718P8294j43214k21470L0459n3435q7782O0331J5551J32673
19260B751677J16745K2481p4951r3769r6319j20657J15590J11878m9327J51598
19250B834946P8586n2426K6642L7538j26840k9309J03227o2569j91339J4645Q3872
19239B716973N5906n9066p9551k03582m0808l21o8290j51586r6632Q729R3076
19228B174848L522o8809m8778n6298Q495J00807J30391p1715L8151M9095k31930
19217B027779n6165Q7492O5228K16440L9241l3242Q591r7321j79318k67825P2040
$$ plain form
19206 1882940 1960901 1999771 1957229 2002584 2054203 2117408 2101428 1937334 1872145 1767147 1755298
19195 1755298 1872124 2097132 2255130 2048677 1975033 1995892 1996341 2044202 1975150 2095295 2028035
19184 2028035 1855969 1686290 1670227 1699909 1725126 1798457 1870226 1781225 1804482 1952003 1841787
19173 1841787 1746390 1703431 1652253 1766933 1813068 1606476 1504998 1579687 1568420 1476025 1487072
19162 1487072 1569647 1527156 1643850 1615005 1491209 1484197 1533509 1636306 1799103 1713305 1626892
19151 1626892 1582466 1564412 1552800 1625161 1633489 1685160 1467466 1435059 1536083 1501767 1553253
19140 1553253 1479857 1386791 1427570 1504188 1587673 1619943 1942252 2081758 1879538 1509053
19130 1509053 1362354 1396461 1430399 1290961 1145668 990719 1141939 1220747 1297570 1361980
$$ packed form
19206A882940P7961L8870m2542M5355N1619O3205j5980j64094o5189j04998j1849
19195A755298J16826K25008J57998k06453p3644K0859M49M7861o9052J20145o7260
19184B028035j72066j69679j6063K9682K5217P3331P1769q9001K3257J47521j10216
19173A841787r5397m2959n1178J14680M6135k06592j01478P4689j1267r2395J1047
19162A487072Q2575m2491J16694k8845j23796p012M9312J02797J62797q5798q6413
19151A626892m4426j8054j1612P2361Q328N1671k17694l2407J01024l4316N1486
19140A553253p3396r3066M0779P6618Q3485L2270L22309J39506k02220l70485
19130A509053j46699L4107L3938j39438j45293j54949J51220P8808P6823O4410
$$ plain form
19120 1361980 1406976 1440603 1396096 1509756 1497649 1421799 1379187 1320601 1328682 1174222 1103365
19109 1103365 1061663 1038043 923889 912643 1158220 1397642 1496205 1349153 1277499 1166120
19099 1166120 1113837 1145632 1128472 1173608 1234319 1197658 1130578 1162409 1212931 1121908 1101120
19088 1101120 1134906 1137176 1237707 1330879 1403156 1338651 1203451 1215087 1266967 1255079 1246581
19077 1246581 1287606 1309024 1363604 1181992 1242985 1314057 1324036 1325890 1241890 1232232 1180924 1134238
19065 1134238 1234341 1254098 1240130 1043460 905260 906506 1009862 1235962 1355911 1346897
19055 1346897 1247814 1120143 1022702 872767 842038 960975 1031539 1082385 1024780 984846 905863
19044 905863 805540 774660 992771 970748 865161 1023763 1054357 953610 1134762 1172143
$$ packed form
19120A361980M4996L3627m4507J13660j2107p5850m2612n8586Q081j54460p0857
19109A103365m1702k3620j14154j1246K45577K39422R8563j47052p1654j11379
19099A166120n2283L1795j7160M5136O0711l6661o7080L1831N0522r1023k0788
19088A101120L3786K270J00531R3172P2277o4505j35200J1636N1880j1888q498
19077A246581M1025K1418N4580j81612O0993P1072R979J854q4000r658n1308m6686
19065A134238J00103J9757j3968j96670j38200J246J03356K26100J19949r014
19055A346897r9083j27671r7441j49935l0729J18937P0564N0846n7605l9934p8983
19044I05863j00323l0880K18111k2023j05587J58602L0594j00747J81152L7381
$$ plain form
19034 1172143 1155420 1082203 939730 1046701 1080289 1009507 965149 859196 910361 860817 878640
19023 878640 890528 984996 1013628 903846 904513 952301 939912 948389 926743 732859 464261
19012 464261 602094 830695 977553 1002334 836913 743444 753034 767426 784062 857928 1058095
19001 1058095 1112263 1042946 1020978 971699 839272 790399 804514 710627 605266 714562 718403
18990 718403 958757 1021359 1012781 958322 978328 940292 916391 941273 828576 782794 849420
18979 849420 810104 560547 495049 441489 569911 752149 850655 931482 944992 895836 845986
18968 845986 750044 727724 761117 663655 720456 801632 1061493 1054233 794343 668296 795349
18957 795349 883655 955446 820051 687534 638444 676577 625077 661456 742829 776100 788876
$$ packed form
19034A172143j6723p3217j42473J06971L3588p0782m4358j05953N1165m9544J7823
19023H78640J1888R4468K8632j09782O67M7788j2389Q477k1646j93884k68598
19012D64261J37833K28601J46858K4781j65421r3469R590J4392J6636P3866K00167
19001A058095N4168o9317k1968m9279j32427m8873J4115r3887j05361J09296L841
18990G18403K40354O2602q578n4459K0006l8036k3901K4882j12697m5782O6626
18979H49420l9316k49557o5498n3560J28422J82238R8506Q0827J3510m9156m9850
18968H45986r5942k2320L3393r7462N6801Q1176K59861p260k59890j26047J27053
18957G95349Q8306P1791j35395j32517m9090L8133n1500L6379Q1373L3271J2776
$$ plain form
18946 788876 690957 675820 716892 611030 789178 645565 612961 581801 782446 789958 952899
18935 952899 1046013 910313 869151 814304 897378 783796 888569 1110410 1280595 1267954
18925 1267954 1266658 1215679 1310150 1447118 1632242 1734424 1719706 1757617 1810634 1844249 1708006
18914 1708006 1665501 1642422 1727727 1717023 1593997 1476342 1445086 1433623 1384880 1386340 1336435
18903 1336435 1074686 983111 1005735 923316 901318 892879 847414 820701 876934 1016664 1015154
18892 1015154 1012148 1105884 1195738 1315805 1352744 1397972 1429393 1571136 1555784 1556653 1588671
18881 1588671 1588809 1726317 1984393 2067732 2066609 2150748 2213728 2268874 2389850 2543050 2632895
18870 2632895 2608837 2523122 2578680 2286223 2129000 2007615 1843278 1611731 1642751 1710226
$$ packed form
18946G88876r7919j5137M1072j05862J78148j43613l2604l1160K00645P512J62941
18935I52899R3114j35700m1162n4847Q3074j13582J04773K21841J70185j2641
18925A267954j296n0979R4471J36968J85124J02182j4718L7911N3017L3615j36243
18914A708006m2505k3079Q5305j0704j23026j17655l1256j1463m8743J460m9905
18903A336435k61749r1575K2624q2419k1998q439m5465k6713N6233J39730j510
18892A015154l006R3736Q9854J20067L6939M5228L1421J41743j5352Q69L2018
18881A588671J38J37508K58076Q3339j123Q4139O2980N5146J20976J53200Q9845
18870B632895k4058q5715N5558k92457j57223j21385j64337k31547L1020O7475
$$ plain form
18860 1710226 1702021 1776096 1563853 1312966 1236590 1021014 995452 1113502 1174771 1109044 915335
18849 915335 828867 666693 603692 688388 813548 838654 777406 882505 983968 924573 997113
18838 997113 1146424 1236617 1362292 1489139 1555160 1565806 1520035 1637827 1719602 1593958
18828 1593958 1536929 1650430 1720269 1768922 1780488 1606046 1557543 1441289 1326655 1255355
18818 1255355 1397203 1188492 927318 1063813 1177268 1078109 858065 750305 691410 656949
18808 656949 664696 704236 622346 763398 838408 820561 886913 697376 535732 490133 595461
18797 595461 754667 806630 637026 508521 504530 470074 549503 637524 502805 579704 784446
18786 784446 805702 814768 767259 567457 341109 195021 357340 516451 609939 773028
$$ packed form
18860A710226q205P4075k12243k50887p6376k15576k5562J18050O1269o5727j93709
18849I15335q6468j62174o3001Q4696J25160K5106o1248J05099J01463n9395P2540
18838I97113J49311R0193J25675J26847O6021J0646m5771J17792Q1775j25644
18828A593958n7029J13501O9839M8653J1566j74442m8503j16254j14634p1300
18818A255355J41848k08711k61174J36495J13455r9159k20044j07760n8895l4461
18808F56949P747L9540q1890J41052P5010j7847O6352j89537j61644m5599J05328
18797E95461J59206N1963j69604j28505l991l4456P9429Q8021j34719P6899K04742
18786G84446K1256R066m7509j99802k26348j46088J62319J59111R3488J63089
$$ plain form
18776 773028 831294 843040 804496 642215 344794 317712 354035 342310 307154 529556 653822
18765 653822 708885 634707 583521 473920 472887 585023 581311 663000 793483 907767 826204
18754 826204 686600 597027 505882 491089 569966 779140 661829 586436 552363 385452 261694
18743 261694 243686 434995 574716 368147 69640 137886 287700 408118 440768 557226
18733 557226 606901 581742 412657 418260 564182 425224 204367 86669 234844 242271 318128
18722 318128 427147 597805 773626 784244 570749 472923 396861 235933 182012 152976
18712 152976 84064 274703 540058 506636 442292 483215 442012 420291 332608 277637 426758
18701 426758 489739 518081 487398 527973 634137 509214 395747 378694 390273 457785 471915
$$ packed form
18776G73028N8266J1746l8544j62281k97421k7082L6323j1725l5156K22402J24266
18765F53822N5063p4178n1186j09601j033J12136l712Q1689J30483J14284q1563
18754H26204j39604q9573r1145j4793P8877K09174j17311p5393l4073j66911j23758
18743B61694j8008J91309J39721k06569k98507O8246J49814J20418L2650J16458
18733E57226M9675k5159j69085N603J45922j38958k20857j17698J48175P427P5857
18722C18128J09019J70658J75821J0618k13495r7826p6062j60928n3921k9036
18712A52976o8912J90639K65355l3422o4344M0923m1203k1721q7683n4971J49121
18701D26758O2981K8342l0683M0575J06164j24923j13467j7053J1579O7512J4130
$$ plain form
18690 471915 329163 369993 376659 443700 424167 439293 339626 591558 583748 297756 317810
18679 317810 244103 319558 504353 443254 247864 -31731 -16345 148700 313772 421798
18669 421798 440800 531784 632615 512749 404119 418914 354744 296208 279728 142916 195315
18658 195315 334869 360604 270210 214351 296175 333302 337969 352887 346080 211247 227664
18647 227664 453731 469340 270915 131501 141947 288200 473845 498056 470369 394779
18637 394779 268454 435122 471521 386360 495811 619736 523134 574315 624742 504135
18627 504135 285464 315195 635173 871985 853407 693025 644220 668732 480098 403499
18617 403499 391020 312025 334887 380101 479820 400526 446110 413913 191330 102035 237484
$$ packed form
18690D71915j42752M0830O666O7041j9533J5126r9667K51932p810k85992K0054
18679C17810p3707P5455J84795o1099j95390k79595J5386J65045J65072J08026
18669D21798J9002R0984J00831j19866j08630J4795o4170n8536j6480j36812N2399
18658A95315J39554K5735r0394n5859Q1824L7127M667J4918o807j34833J6417
18647B27664K26067J5609j98425j39414J0446J46253J85645K4211k7687p5590
18637C94779j26325J66668L6399q5161J09451J23925r6602N1181N0427j20607
18627E04135k18671K9731L19978K36812j8578j60382m8805K4512j88634p6599
18617D03499j2479p8995K2862M5214R9719p9294M5584l2197k22583q9295J35449
$$ plain form
18606 237484 282112 236957 45484 100653 356402 441070 333266 293834 333291 494718 465098
18595 465098 391798 332963 277841 371951 492495 506818 465266 479302 391389 397706 358034
18584 358034 350920 418459 620482 720943 579526 431958 424329 448735 404571 404204 405530 353743
18572 353743 271699 202593 127854 130807 156209 244162 271146 129965 111880 119188 231462
18561 231462 255362 356376 354325 93966 -67372 129997 357141 214235 184774 273006
18551 273006 96707 36505 238014 311182 359459 359499 361235 224344 220729 194522 205477 211533
18539 211533 258537 290050 308923 395937 355882 391164 706459 741427 622989 726673 793851
18528 793851 760574 643022 600104 674691 554589 515783 454411 314057 271297 474781 515266
$$ packed form
18606B37484M4628m5155j91473N5169K55749Q4668j07804l9432L9457J61427k9620
18595D65098p3300n8835n5122R4110J20544J4323m1552J4036q7913O317l9672
18584C58034p114O7539K02023J00461j41417j47568p629K4406m4164l67J326n1787
18572C53743q2044o9106p4739K953K5402Q7953K6984j41181j8085P308J12274
18561B31462K3900J01014k051k60359j61338J97369K27144j42906k9461Q8232
18551B73006j76299o0202K01509P3168M8277M0J736j36891l615k6207J0955O056
18539B11533M7004L1513J8873Q7014m0055L5282L15295L4968j18438J03684O7178
18528G93851l3277j17552m2918P4587j20102l8806o1372j40354m2760K03484M0485
$$ plain form
18517 515266 408557 208773 71256 76365 139877 221370 330185 289775 154197 161119 82542
18506 82542 119171 84895 55306 131437 230744 484083 505415 488704 450324 362619 298012
18495 298012 281950 348424 293715 159776 95958 76567 110006 103508 106095 152824 287211
18484 287211 343403 248065 298321 185252 150065 326231 327658 236689 -28887 101435 287237
18473 287237 515957 492305 453927 378016 271362 173144 227025 227990 164613 213573 309241
18462 309241 350853 523592 611278 415821 324154 37813 154917 323531 376003 484337
18452 484337 395273 266346 289982 217763 166558 200358 266456 246561 139354 124690 161008
18441 161008 121290 312669 205694 103320 228823 386110 334197 276283 357178 460738
$$ packed form
18517E15266j06709j99784j37517N109O3512Q1493J08815m0410j35578O922p8577
18506H2542L6629l4276k9589P6131R9307K53339K1332j6711l8380q7705o4607
18495B98012j6062O6474n4709j33939o3818j9391L3439o498K587M6729J34387
18484B87211N6192r5338N0256j13069l5187J76166J427r0969k65576J30322J85802
18473B87237K28720k3652l8378p5911j06654r8218N3881R65o3377M8960R5668
18462C09241M1612J72739Q7686j95457r1667k86341J17104J68614N2472J08334
18452D84337q9064j28927K3636p2219n1205L3800O6098j9895j07207j4664L6318
18441A61008l9718J91379j06975j02374J25503J57287n1913n7914Q0895J03560
$$ plain form
18431 460738 545904 462919 586576 703032 571191 674391 755184 546265 367446 302036
18421 302036 283974 176713 171159 318359 457955 288612 207364 235055 42840 -191026
18411 -191026 -176386 25778 283528 317309 438639 451084 488051 492805 450619 442367 479260
18400 479260 288124 258274 257797 257249 203588 245688 409593 367222 232143 170302 -35202
18389 -35202 -228140 -126709 -53451 48297 44209 26703 60431 143562 295613 357331 253726
18378 253726 83637 57950 217455 281650 328638 322409 255159 206900 177109 341050 171524
18367 171524 60431 261222 246926 139397 -16498 49629 159632 190589 157679 97187
18357 97187 56974 -15533 38549 108110 89556 116759 306046 328629 309063 268104 255304
$$ packed form
18431D60738Q5166q2985J23657J16456j31841J03200Q0793k08919j78819o5410
18421C02036j8062j07261n554J47200J39596j69343q1248K7691j92215k33866
18411a91026J4640K02164K57750L3781J21330J2445L6967M754m2186q252L6893
18400D79260j91136k9850m77n48n3661M2100J63905m2371j35079o1841k05504
18389c5202j92938J01431P3258J01748m088j7506L3728Q3131J52051O1718j03605
18378B53726j70089k5687J59505O4195M6988o229o7250m8259k9791J63941j69526
18367A71524j11093K00791j4296j07529j55895O6127J10003L0957l2910o0492
18357I7187m0213p2507N4082O9561j8554K7203J89287K2583j9566m0959j2800
$$ plain form
18346 255304 245861 257474 227000 287228 352120 345481 371690 372234 230806 263223 449739 421228
18334 421228 189114 -63615 -78517 56470 229260 343211 539188 728433 693595 437187
18324 437187 168558 189740 111084 147234 150727 142387 144814 123894 174330 146886 243195 178172
18312 178172 279114 383078 312501 191523 141197 -12829 87121 178873 159635 233885 244689
18301 244689 106772 215448 225912 240342 242984 271353 196278 143995 160174 147495 184948
18290 184948 222485 302090 318981 197480 123224 153038 126757 -23227 79561 300907 335812
18279 335812 314591 335690 288345 384886 369274 348850 221455 273250 239747 136710 117492
18268 117492 56706 80258 215393 280080 204058 257506 346737 123274 -5777 121275 225083
$$ packed form
18346B55304r443J1613l0474O0228O4892o639K6209N44j41428L2417J86516k8511
18334D21228k32114k52729j4902J34987J72790J13951J95977J89245l4838k56408
18324D37187k68629K1182p8656L6150L493q340K427k0920N0436k7444R6309o5023
18312A78172J00942J03964p0577j20978n0326j54026R9950R1752j9238P4250J0804
18301B44689j37917J08676J0464J4430K642K8369p5075n2283J6179j2679L7453
18290A84948L7537P9605J6891j21501p4256K9814k6281j49984J02788K21346L4905
18279C35812k1221K1099m7345R6541j5612k0424j27395N1795l3503j03037j9218
18268A17492o0786K3552J35135O4687p6022N3448Q9231k23463j29051J27052J03808
$$ plain form
18257 225083 301715 273083 227525 277766 202711 400013 476242 292535 292175 158200 60245
18246 60245 -1723 -98721 -135544 -129923 -86113 -172529 -314162 -54430 163217 187894 140578
18235 140578 238118 217726 234622 204636 168000 195071 176488 42977 57704 280594 323605
18224 323605 233629 219912 273600 249196 123213 79861 137697 302863 362905 325176 348486
18213 348486 342034 393764 439183 378682 290371 115959 30116 -44748 23881 229159 296465
18202 296465 219758 35444 -88909 -32516 43756 24166 62694 69981 117383 36989 -300
18191 -300 56026 -49323 -53263 94501 -82296 -66579 202224 251058 93028 -6775 25945
18180 25945 90937 241304 245300 271891 200363 191977 177486 143861 165831 119714 166321 136069
$$ packed form
18257B25083P6632k8632m5558N0241p5055J97302P6229j83707l60j33975r7955
18246F0245o1968r6998l6823N621M3810q6416j41633K59732K17647K4677m7316
18235A40578R7540k0392J6896k9986l6636K7071j8583j33511J4727K22890M3011
18224C23605q9976j3717N3688k4404j25983m3352N7836J65166O0042l7729K3310
18213C48486o452N1730M5419o0501q8311j74412q5843p4864O8629K05278O7306
18202B96465p6707j84314j24353N6393P6272j9590L8528P287M7402q0394l7289
18191c00N6326j05349l940J47764j76797J5717K68803M8834j58030r9803L2720
18180B5945O4992J50367L996K6591p1528q386j4491l3625K1970m6117M6607l0252
$$ plain form
18168 136069 37053 -33758 -6192 374 -119222 -27485 59243 68045 100691 190691 41083
18157 41083 -18383 -24893 -170028 -129525 -126500 -81483 -163354 -241962 -292001 -231689 -117548 507
18145 507 59281 -47070 -101685 58118 218787 218864 185172 61484 -85751 -42325 123127
18134 123127 158911 212672 246073 245093 310191 427510 480469 400685 228645 143319 259743
18123 259743 361507 294848 84476 16675 241758 338877 327147 349210 286293 169989 289823
18112 289823 235964 53815 157937 200079 -4843 -60306 205857 309067 141018 172719
18102 172719 182589 171938 51862 -51941 100781 99412 -27988 10543 126226 145811 185485
18091 185485 173009 3185 -54121 186460 365567 367155 198150 54705 -35211 -73902 19622
$$ packed form
18168A36069r9016p0811K7566O566j19596R1737Q6728Q802L2646R0000j49608
18157D1083n9466o510j45135M0503L025M5017q1871p8608n0039O0312J14141J18055
18145E07N8774j06351n4615J59803J60669P7l3692j23688j47235M3426J65452
18134A23127L5784N3761L3401r80O5098J17319N2959p9784j72040q5326J16424
18123B59743J01764o6659k10372o7801K25083R7119j1730K2063o2917j16304J19834
18112B89823n3859j82149J04122M2142k04922n5463K66163J03210j68049L1701
18102A72719R870j0651j20076j03803J52722j369j27400L8531J15683J9585L9674
18091A85485j2476j69824n7306K40581J79107J588j69005j43445q9916l8691R3524
$$ plain form
18080 19622 48965 -10380 -135621 -244560 -283145 -61376 12920 -135194 5734 216457
18070 216457 218712 347808 498133 464772 368241 293915 267127 283889 344381 273061 94468
18059 94468 -56092 26836 89618 215008 344779 292015 196840 203928 222854 101682 28270
18048 28270 -24526 32445 433 105911 162463 86040 73929 12318 94495 179341 168496
18037 168496 10406 26711 11132 -184536 -155403 -148753 -257679 -204140 -188856 -126786 -138543
18026 -138543 -147920 -30262 200643 347932 317207 172326 71024 -24708 -46599 -128960 -228654
18015 -228654 -107596 115899 182035 60586 -120118 -221866 -278712 -271492 -81248 212142
18005 212142 224130 141205 108808 102371 67020 261199 282141 217768 87307 -42350 19444
$$ packed form
18080A9622K9343n9345j25241j08939l8585K21769P4296j48114J40928K10723
18070B16457K255J29096J50325l3361r6531p4326k6788J6762O0492p1320j78593
18059I4468j50560Q2928O2782J25390J29771n2764r5175P088J8926j21172p3412
18048B8270n2796N6971l2012J05478N6552p6423j2111o1611Q2177Q4846j0845
18037A68496j58090J6305j5579j95668K9133O650j08926N3539J5284O2070j1757
18026a38543r377J17658K30905J47289l0725j44881j01302r5732k1891q2361r9694
18015b28654J21058K23495O6136j21449j80704j01748n6846P220J90244K93390
18005B12142J1988q2925l2397o437l5351J94179K0942o4373j30461j29657O1794
$$ plain form
17994 19444 128516 34980 18335 -44302 -62297 128910 228961 342332 384179 365529 313370
17983 313370 276151 181059 -3403 45414 -40045 -116182 -199682 4752 169814 17800 -65808
17972 -65808 -92865 -152890 -131937 -227450 -132167 -28640 -16734 113974 92943 -64784 -59338
17961 -59338 53135 145709 169599 156518 116177 53123 -154132 -185788 -218812 -282534 -186491
17950 -186491 778 -84489 34153 307687 331449 233693 131825 28055 -106416 57290
17940 57290 121001 287284 74743 -105186 -14313 -31622 -129942 -51646 88175 58294 130042
17929 130042 2454 -92 -7705 370 114037 267899 168426 63916 -84741 -166871 -94704
17918 -94704 -91450 24753 2321 105482 189936 370306 433483 427980 416481 446172 383375
$$ packed form
17994A9444J09072r3536j6645o2637j7995J91207J00051J13371M1847j8650n2159
17983C13370l7219r5092j84462M8817q5459p6137q3500K04434J65062j52014q3608
17972f5808k7057o0025K0953r5513R5283J03527J1906J30708k1031j57727N446
17961e9338J12473R2574K3890j3081m0341o3054k07255l1656l3024o3722R6043
17950a86491J87269q5267J18642K73534K3762r7756j01868j03770j34471J63706
17940E7290O3711J66283k12541j79929R0873j7309r8320P8296J39821k9881P1748
17929A30042j27588k546p613Q075J13667J53862r9473j04510j48657q2130P2167
17918i4704L254J16203k2432J03161Q4454J80370O3177n503j1499K9691o2797
$$ plain form
17907 383375 212092 95748 100050 165415 126663 -50501 2845 182214 310676 20999
17897 20999 9488 -15179 -139505 -63954 121531 -25324 9993 -6710 122023 76847 -58517
17886 -58517 -149354 -35273 76737 -24216 -233508 -271474 -319034 -255417 -50805 -12755 354
17875 354 -54931 -12241 -79481 -49879 62723 -43157 -68586 305387 256017 109463 -122829
17864 -122829 -145036 98221 153570 185071 125465 -9185 72124 81669 19251 -62985 -90322
17853 -90322 -159088 -89554 -90002 -74380 -95352 -92241 -92249 -14112 110485 185004 222879 235673 313474
17840 313474 295616 360948 113770 -123588 -70227 -11135 -24000 131365 329997 327494 330758
17829 330758 159514 74426 142482 80748 148455 248878 123737 237711 231546 173935 226894
$$ packed form
17907C83375j71283j16344M302O5365l8752j77164N3346J79369J28462k89677
17897B0999j1511k4667j24326P5551J85485j46855L5317j6703J28733m5176j35364
17886e8517r0837J14081J12010j00953k09292l7966m7560O3617K04612L8050J3109
17875C54n5285M2690o7240K9602J12602j05880k5429L73973m9370j46554k32292
17864a22829k2207K43257N5349L1501n9606j34650Q1309R545o2418q2236k7337
17853i0322o8766O9534m48J5622k0972L111qP8137J24597P4519L7875J2794P7801
17840C13474j7858O5332k47178k37358N3361N9092j2865J55365J98632k503L264
17829C30758j71244q5088O8056o1734O7707J00423j25141J13974o165n7611N2959
$$ plain form
17818 226894 -1763 -81124 -23583 -60444 -83805 -69722 -64899 -29748 -35912 71986 184684
17807 184684 275409 317578 301981 195912 81369 110279 51114 177131 498346 346400
17797 346400 192713 58611 -29414 18802 70842 61679 152985 144703 271282 204258 -32358
17786 -32358 13270 113597 77025 72797 124364 217842 142169 28518 5652 162405 293167
17775 293167 375376 297339 82958 39715 -34346 8119 83598 73205 98804 -159464 -301100
17764 -301100 -71632 53509 134231 129437 139162 -25159 149654 217881 136167 35191 59391
17753 59391 66815 41496 -15568 34987 77790 177178 189828 -18255 -178020 -154396 -73786
17742 -73786 129233 315905 346373 359406 259771 100621 -67081 -62026 -126093 -262266 -177574
$$ packed form
17818B26894k28657p9361N7541l6861k3361J4083M823L5151o164J07898J12698
17807A84684R0725M2169j5597j06069j14543K8910n9165J26017L21215j51946
17797C46400j53687j34102q8025M8216N2040r163R1306q282J26579o7024k36616
17786c2358M5628J00327l6572m228N1567R3478p5673j13651k2866J56753J30762
17775B93167Q2209p8037k14381m3243p4061M2465P5479j0393K5599k58268j41636
17764c01100K29468J25141Q0722m794R725j64321J74813O8227q1714j00976K4200
17753E9391P424k5319n7064N0555M2803R9388J2650k08083j59765K3624Q0610
17742g3786K03019J86672L0468J3033r9635j59150j67702N055o4067j36173Q4692
$$ plain form
17731 -177574 -81006 -58647 27057 121677 197962 200885 300543 277951 244657 274616 295023 121148
17719 121148 -12844 -16139 60562 70006 190122 174485 25638 40463 71485 -11769 162457
17708 162457 155418 102718 -109643 -220436 -187583 -77224 -18412 -104793 6189 147718 302653
17697 302653 426612 247650 2099 -18744 -33771 117097 190417 106482 45719 -207361
17687 -207361 -273103 -84222 34984 -4856 -174944 -77088 -78805 41854 61252 17774 21667
17676 21667 87690 173702 247752 273478 274107 213682 131891 43016 38055 -70388 164593 119462
17664 119462 -2702 -24499 14803 121178 -10355 -4070 -40957 -123130 -133321 -5552 156321
17653 156321 133636 57073 78043 264621 268395 137635 -29841 -195004 -134833 5729 154155
$$ packed form
17731a77574R6568K2359Q5704R4620P6285K923R9658k2592l3294K9959K0407j73875
17719A21148j33992l295P6701R444J20116j5637j48847J4825L1022q3254J74226
17708A62457p039n2700k12361j10793L2853J10359N8812q6381J10982J41529J54935
17697C02653J23959j78962k45551k0843j5027J50868P3320q3935o0763k53080
17687b07361o5742J88881J19206l9840j70088R7856j717J20659J9398m3478L893
17676B1667O6023Q6012P4050K5726O29o0425q1791q8875m961j08443K34981m5131
17664A19462j22164k1797L9302J06375j31533O285l6887q2173j0191J27769J61873
17653A56321k2685p6563K0970J86578L774j30760j67476j65163O0171J40562J48426
$$ plain form
17642 154155 138569 153127 127499 98295 99803 69020 -79207 -37845 68521 58931 -40502
17631 -40502 -112833 -178173 -148225 -55482 188990 224936 151418 196245 251068 41562 -17337
17620 -17337 -109299 -275164 -248968 -108543 -77942 -208060 -244501 -219104 -102792 45463 4451
17609 4451 -63385 -48292 -50421 74347 162072 97360 21036 -17182 119716 239486 144713
17598 144713 14862 -69862 -177747 -323817 -315168 -156198 -158883 -111768 176620 306098 297604
17587 297604 186551 103361 80748 62603 32285 -32866 -12766 93520 302584 334185 201118
17576 201118 -76492 -112735 -143306 -75309 -56378 17983 -26335 -200592 -232475 -329308 -259360
17565 -259360 -84720 -203733 -280381 -341880 -370087 -235392 -277146 -324915 -66908 -5875 -67457
$$ packed form
17642A54155j5586J4558k5628k9204J508l0783j48227M1362J06366r590r9433
17631d0502p2331o5340K9948R2743K44472L5946p3518M4827N4823k09506n8899
17620a7337r1962j65865K6196J40425L0601j30118l6441K5397J16312J48255m1012
17609D451o7836J5093k129J24768Q7725o4712p6324l8218J36898J19770r4773
17598A44713j29851q4724j07885j46070Q649J58970k685M7115K88388J29478q494
17587B97604j11053q3190k2613j8145l0318o5151K0100J06286K09064L1601j33067
17576B01118k77610l6243l0571O7997J8931P4361m4318j74257l1883r6833O9948
17565b59360J74640j19013p6648o1499k8207J34695m1754m7769K58007O1033o1582
$$ plain form
17554 -67457 -140703 -124348 -182798 -67095 -68797 -81299 36630 264107 292570 163158 -70659
17543 -70659 -48411 172992 180670 151650 201146 100747 123729 243286 196738 279536 263392
17532 263392 267869 150469 43082 -10034 -79877 -31699 98739 104292 163597 98567 -30022
17521 -30022 -97714 -161889 -175185 -90237 -2648 -128862 -222003 -136326 -169732 -217661 -206624
17510 -206624 -25163 159512 79325 84917 6281 -19437 -22181 -101922 -130031 -77749 19561
17499 19561 -96029 -37754 -16013 39769 115982 21227 -92606 -126604 -152098 -196466 -197180 -306662
17487 -306662 -193659 41092 102991 154623 164881 293556 265153 117497 39394 -40902 -114349
17476 -114349 21924 41443 -7090 -1914 -89872 -57614 -65949 -205453 -207611 -225933 -199901 -102609
$$ packed form
17554f7457p3246J6355n8450J15703j702j2502J17929K27477K8463j29412k33817
17543g0659K2248K21403P678k9020M9496j00399K2982J19557m6548Q2798j6144
17532B63392M477j17400j07387n3116o9843M8178J30438N553N9305o5030j28589
17521c0022o7692o4175j3296Q4948Q7589j26214r3141Q5677l3406m7929J1037
17510b06624J81461J84675q0187N592p8636k5718k744p9741k8109N2282R7310
17499A9561j15590N8275K1741N5782P6213r4755j13833l3998k5494m4368p14j09482
17487c06662J13003K34751O1899N1632J0258J28675k8403j47656p8103q0296p3447
17476a14349J36273J9519m8533N176q7958L2258q335j39504k158j8322K6032R7292
$$ plain form
17464 -102609 -135292 -86119 -158475 -152008 -205317 -264928 -337333 -324414 -67358 22780 33953
17453 33953 6140 -67280 -98132 -9629 -22732 -41297 -184702 -202047 -206815 -228302 -122325
17442 -122325 35963 -17677 -42262 47853 75614 114527 221170 158145 129774 -38109 -71507
17431 -71507 151834 133320 56578 -60609 -73396 -68217 -67520 -186560 -247693 -280176 -410532
17420 -410532 -414677 -246483 -346581 -175980 19425 111510 106491 253329 403881 347111 141276
17409 141276 125022 257841 210288 121757 13211 -68470 -79067 11113 179744 314087 250805
17398 250805 92066 170703 6934 -152399 -141099 -21680 -198946 -243893 76582 255968
17388 255968 115004 162225 104780 32760 -157844 -343219 -350056 -241683 -116821 -22571 -49560
$$ packed form
17464a02609l2683M9173p2356O467n3309n9611p2405J2919K57056R0138J1173
17453C3953k7813p3420l0852Q8503j3103j8565j43405j7345m768k1487J05977
17442a22325J58288n3640k4585R0115K7761L8913J06643o3025k8371j67883l3398
17431g1507K23341j8514p6742j17187j2787N179O97j19040o1133l2483j30356
17420d10532m145J68194j00098J70601J95405R2085n019J46838J50552n6770k05835
17409A41276j6254J32819m7553q8531j08546q1681j0597R0180J68631J34343o3282
17398B50805j58739P8637j63769j59333J1300J19419j77266m4947L20475J79386
17388B55968j40964M7221n7445p2020j90604j85375o837J08373J24862R4250k6989
$$ plain form
17377 -49560 -33160 -55525 -117710 -88514 -66882 -72666 -31624 76853 135243 188732 254244 143827
17365 143827 -52578 -92754 -102262 -97233 -79600 -70586 -9260 -93054 -248115 -231986 -56782
17354 -56782 -134445 -96761 164876 186509 195222 91926 27581 -86957 -88098 -24469 -31098 -45417
17342 -45417 -109462 -89964 -90786 -44286 256440 364490 290026 318507 210245 122334 -42113
17331 -42113 -369391 -226160 39188 178395 65976 -62797 -28380 131824 186179 257499
17321 257499 179654 56250 76380 131392 135890 -18268 -80979 27224 39750 33661 -5653
17310 -5653 -204952 -88995 -141281 -185131 -172483 -191976 -4129 189465 335767 231012 -70452
17299 -70452 -110715 -3507 3456 109144 116100 354 10451 43038 108239 159968 170778
$$ packed form
17377d9560J6400k2365o2185K9196K1632n784M1042J08477N8390N3489O5512j10417
17365A43827j96405m0176r508N029J7633R014O1326q3794j55061J6129J75204
17354e6782p7663L7684K61637K1633Q713j03296o4345j14538j141O3629o629j4319
17342d5417o4045J9498q22M6500L00726J08050p4464K8481j08262q7911j64447
17331d2113l27278J43231K65348J39207j12419j28773L4417J60204N4355P1320
17321B57499p7845j23404K0130N5012M498j54158o2711J08203J2526o089l9314
17310e653j99299J15957n2286m3850J2648j9493J87847J93594J46302j04755l01464
17299g0452m0263J07208O963J05688O956j15746J0097L2587O5201N1729J0810
$$ plain form
17288 170778 15211 -18135 66444 145973 159153 112323 20105 -115769 -24740 99799 74964
17277 74964 73471 233902 413945 329368 235839 189456 83568 -74583 -17283 -10051 -121030
17266 -121030 -206794 -186492 -135527 -77795 -87681 2043 -20687 -217823 -212339 -14252 72892
17255 72892 170201 239027 326220 232979 157484 137102 160596 177639 79806 35250 113819 -6245
17243 -6245 -109124 -37240 -5151 124010 201318 49903 -83967 -16624 99000 33912 -106830
17232 -106830 -161000 -36314 159543 212771 35006 -58 -47302 -114332 -31044 -43347 -134137
17221 -134137 17574 -198590 -336619 -242819 -139723 -19469 25673 15912 -92071 -164421
17211 -164421 -191278 -125292 95728 180576 225909 1292 -322456 -238274 -256107 -284053 -268192
$$ packed form
17288A70778j55567l3346Q4579P9529J3180m6830r2218j35874R1029J24539k4835
17277G4964j493J60431J80043q4577r3529m6383j05888j58151N7300P232j10979
17266a21030q5764K0302N0965N7732r886Q9724k2730j97136N484J98087Q7144
17255G2892R7309O8826Q7193r3241p5495k0382K3494J7043r7833m4556P8569j20064
17243f245j02879P1884L2089J29161P7308j51415j33870O7343J15624o5088j40742
17232a06830n4170J24686J95857N3228j77765l5064m7244o7030Q3288j2303r0790
17221a34137J51711k16164j38029R3800J03096J20254M5142r761j07983p2350
17211a64421k6857O5986K21020Q4848M5333k24617l23748Q4182j7833k7946J5861
$$ plain form
17200 -268192 -24192 104145 6384 51029 219893 53635 57477 54949 -107953 -74419 56312
17189 56312 64335 50303 2844 -96563 -38812 -158038 -63159 235426 294165 191885 57035
17178 57035 6850 176923 261958 262648 54767 7470 341 12560 270952 286382 350588 206186
17166 206186 39677 -18983 52007 228793 238504 146609 144400 197244 191650 207168 267245 118762
17154 118762 205421 244924 119172 89018 113479 118064 140923 128365 64701 105102 -104036
17143 -104036 -112970 -124475 -176080 -88574 -51350 -119524 -149833 -224922 -315873 -107964 -92267
17132 -92267 -318557 -502710 -481643 -328613 -366968 -361343 -354497 -376916 -532151 -515537 -329748
17121 -329748 -280990 -213847 -215390 -295921 -240924 -267064 -268397 -335362 -413707 -303467 -25278
$$ packed form
17200b68192K44000J28337r7761M4645J68864j66258L842k528j62902L3534J30731
17189E6312Q023j4032m7459r9407N7751j19226R4879K98585N8739j02280j34850
17178E7035n0185J70073Q5035O90k07881m7297p129J2219K58392J5430O4206j44402
17166B06186j66509n8660P0990J76786R711r1895k209N2844n594J5518O0077j48483
17154A18762Q6659L9503j25752l0154K4461M585K2859j2558o3664M0401k09138
17143a04036q934j1505n1605Q7506L7224o8174l0309p5089r0951K07909J5697
17132i2267k26290j84153K1067J53030l8355N625O846k2419j55235J6614J85789
17121c29748M8758O7143j543q0531N4997k6140j333o6965p8345J10240K78189
$$ plain form
17110 -25278 5303 -45447 -84792 -13428 135000 79913 -55337 -72678 -134226 -29821 -9685
17099 -9685 23487 32415 -37400 -90926 -262753 -201822 66153 218874 86912 -22232 -39622
17088 -39622 24601 -55298 -61980 28047 -216154 -153325 -53363 -80659 13262 59779 -51671
17077 -51671 -134722 -145008 -43683 58745 121550 -9833 -120222 -174391 -229491 -169170 -127418
17066 -127418 -167198 -128889 -110079 6524 81126 278835 -10992 -158852 -157936 -96908 -159615
17055 -159615 -92939 952 57988 -220122 -286959 -148086 1144 22557 -97511 -200666
17045 -200666 -256229 -203148 -110442 -103450 -23559 63209 178925 204281 100457 31431 -52530
17034 -52530 -179323 -130861 59163 193247 136854 53223 66870 172182 177655 66281 67226
$$ packed form
17110b5278L0581n0750l9345P1364J48428n5087j35250j7341o1548J04405K0136
17099i685L3172Q928o9815n3526j71827O0931K67975J52721j31962j09144j7390
17088c9622O4223p9899o682R0027k44201O2829R9962k7296R3921M6517j11450
17077e1671q3051j0286J01325J02428O2805j31383j10389n4169n5100O0321M1752
17066a27418l9780L8309J8810J16603P4602J97709k89827j47860R16O1028o2707
17055a59615O6676R3891N7036k78110o6837J38873J49230K1413j20068j03155
17045b00666n5563N3081R2706O992P9891Q6768J15716K5356j03824o9026q3961
17034e2530j26793M8462J90024J34084n6393q3631J3647J05312N473j11374R45
$$ plain form
17023 67226 -74307 -143441 -69738 -8608 -87999 -142351 -96881 -101150 -25689 166148 152956
17012 152956 146472 274534 355871 263728 136038 -19284 -63959 75123 52417 -88922 -95328
17001 -95328 19245 63395 135684 -47314 -138717 -213246 -263433 -329032 -530855 -466530 -463174
16990 -463174 -437956 -229151 -74162 -40983 -208432 -265285 -168174 37096 -46933 -33492 105511
16979 105511 172218 100844 78659 -8215 -142659 -139499 -56857 -118555 -196288 -153224 -908
16968 -908 21893 19445 22049 41833 126583 82522 -48882 -101773 -68358 -132213 -304043 -263273
16956 -263273 -159198 -171970 -149023 -318317 -261762 -165644 12437 -43238 -87896 -101360 -57290
16945 -57290 210575 140722 -4090 -148250 -167542 -212953 -268835 -164280 -27758 -120885 -203021
$$ packed form
17023F7226j41533o9134P3703O1130p9391n4352M5470m269P5461J91837j3192
17012A52956o484J28062Q1337r2143j27690j55322m4675J39082k2706j41339o406
17001i5328J14573M4150P2289j82998r1403p4529n0187o5599k01823O4325L356
16990d63174K5218K08805J54989L3179j67449n6853R7111K05270q4029J3441J39003
16979A05511O6707p1374k2185q6874j34444L160Q2642o1698p7733M3064J52316
16968i08K2801k448K604J9784Q4750m4061j31404n2891L3415o3855j71830M0770
16956b63273J04075j2772K2947j69294N6555R6118J78081n5675m4658j3464M4070
16945e7290K67865o9853j44812j44160j9292m5411n5882J04555J36522r3127q2136
$$ plain form
16934 -203021 -184639 33837 131572 94507 -46663 20867 -44703 -29744 -84441 -106940 -95863
16923 -95863 -220626 -225596 -222514 -147382 10086 203578 194895 3580 57532 7788 -178263
16912 -178263 -216207 -210603 -265529 -340403 -300313 -245176 -348685 -204687 -150450 -125052 -191466
16901 -191466 -159718 -144969 -210292 -277915 -259848 -207039 -95551 -190593 -251983 -66092 3557
16890 3557 -8773 -13681 -65664 -31162 26999 -96917 -292608 -277701 -147817 -202913 -97475
16879 -97475 149218 185265 190644 132190 121326 14731 -34875 1913 -48561 -122337 -98074
16868 -98074 -148902 -62524 -172726 -101837 -169903 -180863 -152769 -196053 -264470 -263077 -207404 -87783
16856 -87783 43236 99300 96908 235882 267423 108186 108831 -1583 -73476 -102266 -188785
$$ packed form
16934b03021J8382K18476R7735l7065j41170O7530o5570J4959n4697k2499J1077
16923i5863j24763m970L082P5132J57468J93492q683j91315N3952m9744j86051
16912a78263l7944N604n4926p4874M0090N5137j03509J43998N4237K5398o6414
16901a91466L1748J4749o5323o7623J8067N2809J11488r5042o1390J85891O9649
16890C557j2330m908n1983L4502N8161j23916j95691J4907J29884n5096J05438
16879i7475K46693L6047N379n8454j0864j06595m9606L6788n0474p3776K4263
16868i8074n0828Q6378j10202P0889o8066j0960K8094m3284o8417J393N5673J19621
16856h7783J31019N6064k392J38974L1541j59237O45j10414p1893k8790q6519
$$ plain form
16845 -188785 -187351 -235311 -337541 -218875 -105250 -118809 -126950 -118167 32539 43573 98097
16834 98097 114079 149639 83997 -42938 -162334 -19264 143807 132847 100669 327201 280354
16823 280354 232968 123947 68942 -66906 -203138 -128347 116729 107638 50585 -38024 -73161
16812 -73161 -47518 109901 34908 -146542 -127250 -117273 -206272 -4939 55922 -51127 -41813
16801 -41813 -55702 -825 -88309 -14687 -95197 -47605 -17715 22696 -94914 -120628 -115269 -287843
16789 -287843 -248660 -182802 -59621 -41363 -33445 25901 113151 149101 153908 240471 266487 238572
16777 238572 198179 121200 9887 -151350 -195839 -10739 110122 118101 103670 92214 146609
16766 146609 204994 170302 42262 39861 -15206 -132653 -83602 5321 48756 -50536 -24914
$$ packed form
16845a88785J434m7960j02230J18666J13625j3559q141Q783J50706J1034N4524
16834I8097J5982L5560o5642j26935j19396J43070J63071j0960l2178K26532m6847
16823B80354m7386j09021n5005j35848j36232P4791K45076r091n7053q8609l5137
16812g3161K5643J57419p4993j81450J9292R977q8999K01333O0861j07049R314
16801d1813j3889N4877q7484P3622q0510M7592K9890M0411j17610k5714N359j72574
16789b87843L9183O5858J23181J8258P918N9346Q7250L5950M807Q6563K6016k7915
16777B38572m0393p6979j11313j61237m4489J85100J20861P979j4431j1456N4395
16766A46609N8385l4692j28040k401n5067j17447M9051Q8923M3435r9292K5622
$$ plain form
16755 -24914 -29094 32422 -88083 -175287 -100726 118665 164866 88215 219461 341414 236135
16744 236135 152282 130429 -32747 -996 82089 -170971 -430061 -430890 -354416 -230746 -159134
16733 -159134 -87393 -217691 -248812 -137872 -254324 -394114 -391942 -400466 -288039 5778 67503
16722 67503 126488 234694 123105 61504 101706 48090 86897 191092 156957 316539 266120
16711 266120 343271 379085 262683 123428 -12057 -12844 -71452 -37961 -89533 38034 -38032
16700 -38032 -317504 -438913 -344459 -117888 -20592 106352 234221 43449 73115 128387
16690 128387 38202 68029 196791 172970 114478 93349 126782 1634 160712 195767 75388
16679 75388 110364 179186 92871 -20575 -63781 203710 199146 -34301 -63494 -11579 -39434
$$ packed form
16755b4914m180O1516j20505q7204P4561K19391M6201p6651J31246J21953j05279
16744B36135q3853k1853j63176L1751Q3085k53060k59090q29P6474J23670P1612
16733a59134P1741j30298l1121J10940j16452j39790K172q524J12427K93817O1725
16722F7503N8985J08206j11589o1601M0202n3616L8807J04195l4135J59582n0419
16711B66120P7151L5814j16402j39255j35485p87n8608L3491n1572J27567p6066
16700c8032k79472j21409R4454K26571R7296J26944J27869j90772K9666N5272
16690A28387r0185K9827J28762k3821n8492k1129L3433j25148J59078L5055j20379
16679G5388L4976O8822q6315j13446m3206K67491m564k33447k9193N1915k7855
$$ plain form
16668 -39434 -49920 -21179 -128710 -140495 45879 145992 93588 80364 111569 123606 4370
16657 4370 11173 -43773 -155001 -112696 20626 107790 169013 87998 35432 23803 -25312 -100272
16645 -100272 -249822 -251416 -49883 105837 6748 -81016 -23598 49126 -2145 78333 85836
16634 85836 108625 117172 116567 188973 137931 514 46134 -99359 -164730 118566 247172
16623 247172 196727 107824 57566 -42734 -225736 -276927 -218952 -54706 -31425 -573 95536
16612 95536 -5662 -19007 -125687 -92819 -174918 -68559 -21532 37896 -193974 -267319 -314757
16601 -314757 -282010 -268068 -318731 -309149 -239079 -149666 -107795 -140009 -152627 -254499 -290719
16590 -290719 -117840 -72785 -61478 -188415 -5987 164855 199695 310249 297842 77636
$$ packed form
16668c9434j0486K8741j07531j1785J86374J00113n2404j3224L1205J2037j19236
16657D370O803n4946j11228M2305J33322Q7164O1223q1015n2566j1629m9115p4960
16645a00272j49550j594K01533J55720r9089q7764N7418P2724n1271Q0478P503
16634H5836K2789Q547o05P2406n1042j37417M5620j45493o5371K83296J28606
16623B47172n0445q8903n0258j00300j83002n1191N7975J64246K3281L0852R6109
16612I5536j01198j3345j06680L2868q2099J06359M7027N9428k31870p3345m7438
16601c14757L2747J3942n0663R582P0070Q9413M1871l2214j2618j01872l6220
16590b90719J72879M5055J1307j26937J82428J70842L4840J10554j2407k20206
$$ plain form
16580 77636 -57569 -84256 -79225 -185976 -117258 -150302 -305767 -406705 -401645 -240622 -175042
16569 -175042 -170153 -146897 -92597 -61814 -109461 139428 273190 220705 34859 -134394 -146568
16558 -146568 -118091 -136797 -119678 -231348 -320035 -351427 -214499 -168126 -108391 -35706 -18153
16547 -18153 23131 63579 60612 10944 -10362 -21275 -22129 -187144 -157415 -208716 -156905 -173008
16535 -173008 -46607 60498 99398 75887 114281 111284 -3394 -64788 -135994 -218319 -271298
16524 -271298 -154608 2651 2147 30707 77757 162629 306404 242441 68889 -134882 -223817
16513 -223817 -278737 -134783 -79623 11014 71280 90441 -22213 -88046 -76700 -47643 -14465
16502 -14465 -12814 -46614 -114397 -65805 -121286 -69578 78744 -224034 -332821 -265274 -147606
$$ packed form
16580G7636j35205k6687N031j06751O8718l3044j55465j00938N060J61023O5580
16569a75042M889K3256N4300L0783m7647K48889J33762n2485j85846j69253j2174
16558a46568K8477j8706J7119j11670q8687l1392J36928M6373N9735P2685J7553
16547a8153M1284M0448k967m9668k1306j0913q54j65015K9729n1301N1811j6103
16535a73008J26401J07105L8900k3511L8394k997j14678o1394p1206q2325n2979
16524b71298J16690J57259n04K8560M7050Q4872J43775o3963j73552k03771q8935
16513b23817n4920J43954N5160R0637O0266J9161j12654o5833J1346K9057L3178
16502a4465J651l3800o7783M8592n5481N1708J48322l02778j08787O7547J17668
$$ plain form
16491 -147606 -53915 86603 153267 49422 6871 -88852 -132137 -56793 -29340 -66015 -43222
16480 -43222 -63159 -165644 -134181 -150083 -205003 -268020 -260376 -109450 -126389 -24131 94987
16469 94987 62725 96313 -35538 -106650 6693 127868 39928 -62794 37154 49970 107838
16458 107838 -2832 19432 80492 78767 85497 46787 38892 -21530 -2840 23839 158205 88127
16446 88127 -55306 -119503 -17786 -43380 -145084 -71559 -171524 -81152 10642 149290 257945
16435 257945 175917 73020 -91487 -288907 -360606 -309537 -221933 -243296 -259850 -119058 -58544
16424 -58544 -20146 -178529 -248694 -228445 -94762 -96818 -75915 -173887 -179814 -214315 -148666 32669
16412 32669 184958 150842 72904 -11459 -43940 -35340 12161 -44597 9687 -29643 -130907
$$ packed form
16491a47606R3691J40518O6664j03845m2551r5723m3285P5344K7453l6675K2793
16480d3222j9937j02485L1463j5902n4920o3017P644J50926j6939J02258J19118
16469I4987l2262L3588j31851p1112J13343J21175q7940j02722R9948J2816N7868
16458A07838j10670K2264O1060j725O730l8710p895o0422J8690K6679J34366p0078
16446H8127j43433o4197J01717k5594j01704P3525r9965R0372R1794J38648J08655
16435B57945q2028j02897j64507j97420p1699N1069Q7604k1363j6554J40792O0514
16424e8544L8398j58383p0165K0249J33683k056K0903r7972n927l4501O5649J81335
16412C2669J52289l4116p7938q4363l2481Q600M7501n6758N4284l9330j01264
$$ plain form
16401 -130907 -203718 -114539 -88962 -15835 147060 95663 -139245 -230249 -168035 -96520 -51136
16390 -51136 -96854 -170610 -83683 -56551 -144682 -201521 -186347 -60908 -130928 -120046 -85600
16379 -85600 -86314 68473 129027 40423 127037 192561 262531 130234 135767 78624 271440 200022
16367 200022 112874 71856 -88302 -149502 -134554 -31142 -39117 -6939 -44445 16745 35409
16356 35409 21372 16328 -96787 -187243 -119641 9014 57943 57744 112164 52328 -17747 38324
16344 38324 -92149 -121412 -174863 -269847 -341520 -356844 -335670 -203868 -112758 -27988 58138
16333 58138 -8232 -146556 -259279 -190916 -26712 18664 -6760 -95457 -166770 -108474 -68940
16322 -68940 23184 -34094 -93061 -137317 -178659 -195138 -147480 -133080 -125139 -260804 -288209 -279379
$$ packed form
16401a30907p2811Q9179K5577P3127J62895n1397k34908r1004O2214P1515M5384
16390e1136m5718p3756Q6927K7132q8131n6839J5174J25439p0020J0882L4446
16379h5600p14J54787O0554q8604Q6614O5524O9970j32297N533n7143J92816p1418
16367B00022q7148m1018j60158o1200J4948J03412p975L2178l7506O1190J8664
16356C5409j4037n044j13115r0456O7602J28655M8929j99N4420n9836p0075N6071
16344C8324j30473k9263n3451r4984p1673j5324K1174J31802R1110Q4770Q6126
16333E8138o6370j38324j12723O8363J64204M5376k5424q8697p1313N8296L9534
16322f8940R2124n7278n8967m4256m1342j6479M7658J4400P941j35665k7405Q830
$$ plain form
16310 -279379 -128607 -109854 -194880 -64160 64000 38431 -64844 66930 170387 134324
16300 134324 20445 43724 -53137 33047 32100 175039 121036 118231 64288 -14907 -2178 51631
16288 51631 -30698 -107635 -125380 -46275 31235 96106 -144709 -329832 -271098 -262499 -218239
16277 -218239 -60280 53712 56177 2819 131651 237282 280198 236556 -18524 -149338
16267 -149338 -182492 -106094 -72628 -133697 -47150 -33535 -203432 -311476 -214775 -47378 -19886
16256 -19886 -76906 59551 13029 -152231 -73704 42039 59456 -15965 -125397 -264862 -237480
16245 -237480 -63686 -15443 55350 -37188 -37546 50566 83948 46738 -18680 -60122 -47090 -86669
16233 -86669 -150531 -154500 -174823 22281 137743 150470 189287 346215 322779 256895 90823
$$ packed form
16310b79379J50772J8753q5026J30720J28160k5569j03275J31774J03457l6063
16300A34324j13879K3279r6861Q6184r47J42939n4003k805n3943p9195J2729N3809
16288E1631q2329p6937j7745P9105P7510O4871k40815j85123N8734Q599M4260
16277b18239J57959J13992K465n3358J28832J05631M2916m3642k55080j30814
16267a49338l3154P6398L3466o1069Q6547J3615j69897j08044R6701J67397K7492
16256a9886n7020J36457m6522j65260P8527J15743J7417p5421j09432j39465K7382
16245b37480J73794M8243P0793r2538l58Q8112L3382l7210o5418m1442J3032l9579
16233h6669o3862l969k0323J97104J15462J2727L8817J56928k3436o5884j66072
$$ plain form
16222 90823 -16254 -34258 -94687 -134745 32672 148069 86494 34883 120066 105083 108862
16211 108862 -510 -52269 -175326 -120610 -10382 -132162 -242467 -357838 -342384 -233204
16201 -233204 -137807 61254 -98174 -262034 -315150 -330932 -410993 -463111 -241717 83535
16191 83535 79769 -191759 -184475 -173115 -69622 13619 6337 222042 273445 38927 28583
16180 28583 -13224 -4312 48087 158351 69978 -99699 -153838 -65566 -191846 -92068 55845
16169 55845 42125 107239 207307 145884 -7360 70402 98694 -146259 -228776 -308941 -328898
16158 -328898 -145290 -253544 -298327 -110157 24095 65334 168214 273690 266250 212219
16148 212219 202140 220422 217943 109323 71757 -18180 162463 223324 178900 97873 -19174
$$ packed form
16222I0823j07077j8004o0429m0058J67417J15397o1575n1611Q5183j4983L779
16211A08862j09372n1759j23057N4716J10228j21780j10305j15371J5454J09180
16201b33204R5397J99061j59428j63860n3116j5782q0061n2118K21394L25252
16191H3535l766k71528P284J1360J03493Q3241p282K15705N1403k34518j0344
16180B8583m1807Q912N2399J10264q8373j69677n4139Q8272j26280R9778J47913
16169E5845j3720O5114J00068o1423j53244P7762K8292k44953q2517q0165j9957
16158c28898J83608j08254m4783J88170J34252M1239J02880J05476p440n4031
16148B12219j0079J8282k479j08620l7566q9937J80643O0861m4424q1027j17047
$$ plain form
16137 -19174 91832 236765 132286 115696 76555 -38612 -121554 -58413 -18022 4150 59775
16126 59775 33507 -136376 -80747 -141083 -141653 -180677 -236716 -226342 -232142 -189659 -185981 -322306
16114 -322306 -307614 -233936 -162546 -171532 -235658 -184760 -83550 -152156 -168743 17816 206509
16103 206509 288683 254458 169522 203916 202544 272683 129140 20081 -93338 -68448 61921
16092 61921 116918 148351 -5258 -176678 -284155 -214346 25349 159489 140649 166649 166177
16081 166177 35783 109708 -47424 -256964 -328133 -254566 -84554 -67574 82816 236105
16071 236105 130321 -4670 94748 159993 198070 137818 53925 -49190 -217821 -369293
16061 -369293 -254610 -149423 -90936 -584 -22825 59188 128329 56112 11016 -17202 -111064
$$ packed form
16137a9174J11006J44933j04479j6590l9141j15167q2942O3141M0391K2172N5625
16126E9775k6268j69883N5629o0336n70l9024n6039J0374n800M2483L678j36325
16114c22306J4692P3678P1390q986o4126N0898J01210o8606j6587J86559J88693
16103B06509Q2174l4225q4936L4394j372P0139j43543j09059j13419K4890J30369
16092F1921N4997L1433j53609j71420j07477O9809K39695J34140j8840K6000m72
16081A66177j30394P3925j57132k09540p1169P3567J70012J6980J50390J53289
16071B36105j05784j34991R9418O5245L8077o0252q3893j03115j68631j51472
16061c69293J14683J05187N8487R0352k2241Q2013O9141p2217m5096k8218r3862
$$ plain form
16050 -111064 -106265 -75980 -85846 -199026 -231821 -186363 51542 157374 8671 -188993 -155504
16039 -155504 -123274 -62233 5484 6802 -38666 -67382 -20905 -107921 -87292 -90668 -43192 -22425
16027 -22425 -29122 101770 87235 107517 62225 -74596 -49994 -47405 -229825 -327429 -355215
16016 -355215 -325844 -330866 -263088 -64345 -171221 -251394 -206936 -335730 -291103 -219184 -103857
16005 -103857 -52850 -211310 -241935 -234882 -284598 -265631 -358115 -243475 -89801 -107189 -158596
15994 -158596 -180416 -170775 -160175 -328797 -331745 -40327 27269 -128704 -75406 120277 107963
15983 107963 50503 -157308 -277730 -130243 -18307 -102767 -138972 -101073 -194387 -329013
15973 -329013 -242730 -246665 -93287 44501 -146294 -348052 -322260 -200792 -20950 21318
$$ packed form
16050a11064M799L0285r866j13180l2795M5458K37905J05832j48703j97664L3489
16039a55504L2230O1041O7717J318m5468k8716M6477q7016K0629l376M7476K0767
16027b2425o697J30892j4535K0282m5292j36821K4602K589j82420r7604k7786
16016c55215K9371n022O7778J98743j06876q0173M4458j28794M4627P1919J15327
16005a03857N1007j58460l0625P053m9716J8967r2484J14640J53674j7388n1407
15994a58596k1820R641J0600j68622k948K91418O7596j55973N3298J95683j2314
15983A07963n7460k07811j20422J47487J11936q4460l6205L7899r3314j34626
15973c29013Q6283l935J53378J37788j90795k01758K5792J21468J79842M2268
$$ plain form
15963 21318 18551 -75250 -124189 -88884 6865 30897 52609 4220 -72103 -209767 -227439 -243993
15951 -243993 -124479 29522 119231 59637 -37506 -21512 -348 7548 -8846 78522 142159
15940 142159 -12668 -164764 -244064 -154723 88454 -1055 20688 143261 112355 20036 15210
15929 15210 196985 103974 72929 -18461 -10747 72759 5605 -130257 -336707 -355176 -304226
15918 -304226 -191564 -150524 -209168 -161336 -8605 -59280 -85602 -12320 -129984 -102599 90520
15907 90520 246283 110299 -65923 -155639 -214558 -298059 -300445 -210037 -221703 -191794 -139785
15896 -139785 -24788 -145192 -400629 -546580 -521234 -301321 -176043 -32172 187755 242119
15886 242119 326613 317289 358329 369868 340301 207322 37314 -88378 -119907 -6862 143798
$$ packed form
15963B1318k767r3801m8939L5305R5749K4032K1712m8389p6323j37664j7672j6554
15951b43993J19514J54001Q9709n9594r7143J5994K1164P896j6394Q7368O3637
15940A42159j54827j52096p9300Q9341K43177q9509K1743J22573l0906r2319m826
15929A5210J81775r3011l1045r1390P714Q3506o7154j35862k06450j8469N0950
15918c04226J12662M1040n8644M7832J52731n0675k6322P3282j17664K7385J93119
15907I0520J55763j35984j76222q9716n8919q3501k386R0408j1666K9909N2009
15896a39785J14997j20404k55437j45951K5346K19913J25278J43871K19927N4364
15886B42119Q4494r324M1040J1539k9567j32979j70008j25692l1529J13045J50660
$$ plain form
15875 143798 52205 -10534 34896 75046 72878 54071 -26333 -47355 -132865 -208512 -132541 27978
15863 27978 34072 -7610 -39412 -225563 -358379 -291463 -293587 -213944 -23280 -28023 -143116
15852 -143116 -103230 -215206 -99839 241866 302987 218623 44947 199 -104968 -149517
15842 -149517 -193854 -241128 -252226 -148077 -244932 -301716 -208849 -192121 -88789 -60413 -158295
15831 -158295 -118961 -84255 -69989 -136510 -269758 -307984 -148932 -89156 -66814 21000 -9494
15820 -9494 -175462 -91799 82429 87646 -157932 -237692 -192364 -121661 -132518 -59314 39073
15809 39073 10310 130556 82392 35832 207270 57092 -45048 -14010 28412 -163530 -306352
15798 -306352 -293124 -71013 24441 20424 -113937 -148823 -213657 -318277 -385213 -479096 -558549
$$ packed form
15875A43798r1593o2739M5430M0150k168j8807q0404k1022q5510p5647P5971J60519
15863B7978O094m1682l1802j86151j32816O6916k124P9643J90664m743j15093
15852a43116L9886j11976J15367L41705O1121q4364j73676m4748j05167m4549
15842a49517m4337m7274j1098J04149r6855n6784R2867J6728J03332K8376r7882
15831a58295L9334L4706J4266o6521j33248l8226J59052N9776K2342Q7814l0494
15820i494j65968Q3663J74228N217k45578p9760M5328P0703j0857P3204R8387
15809C9073k8763J20246m8164m6560J71438j50178j02140L1038M2422j91942j42822
15798c06352J3228K22111R5454m017j34361l4886o4834j04620o6936r3883p9453
$$ plain form
15787 -558549 -555146 -262586 -202763 -291440 -262544 -168003 31384 84404 89343 17593 -132717
15776 -132717 -191217 -193593 -134862 -80652 -51764 -91991 41724 73546 37876 15220 -109500
15765 -109500 -198548 -112625 -91308 -191504 -152885 -128829 -54113 137913 108513 116006 42429
15754 42429 29137 70934 -142132 -109365 -169585 -90713 -49471 -65746 -104190 -26835 -42710
15743 -42710 -106931 -213670 -219531 -226118 -205313 -235789 -252462 -381023 -137827 27403 -52839
15732 -52839 -217871 -243322 -143430 -108011 -76489 -134516 -209761 -20572 29340 -46630 -190039
15721 -190039 -230976 -292948 -513095 -476053 -212542 -127518 -208491 -251118 -274196 -236299 -111729
15710 -111729 -10407 -4947 6223 30062 -26016 -93590 -157173 -149654 -117550 -74974 -138667 -60240
$$ packed form
15787e58549L403K92560N9823q8677K8896R4541J99387N3020M939p1750j50310
15776a32717n8500k376N8731N4210K8888m0227J33715L1822l5670k2656j24720
15765a09500q9048Q5923K1317j00196L8619K4056P4716J92026k9400P493p3577
15754D2429j3292M1797k13066L2767o0220P8872M1242j6275l8444P7355j5875
15743d2710o4221j06739n861o587K0805l0476j6673j28561K43196J65230q0242
15732e2839j65032k5451R9892L5419L1522n8027p5245J89189M9912p5970j43409
15721a90039m0937o1972k20147L7042K63511Q5024q0973m2627k3078L7897J24570
15710a11729J01322N460J1170K3839n6078o7574o3583P519L2104M2576o3693P8427
$$ [...]
##END NTUPLES=NMR SPECTRUM
##END=
