##TITLE=Analysis number 313519
Compound Code sb 02040
Book Reference 2
Project Code adrs
Chemist Name stores
##JCAMPDX= 6.0         $$ Bruker NMR JCAMP-DX V2.0
##DATA TYPE= NMR SPECTRUM
##DATA CLASS= NTUPLES
##ORIGIN= Bruker BioSpin GmbH
##OWNER= NMR
$$ XWIN-NMR		Version 3.5
$$ Mon Sep 12 16:29:27 2005 GMT Daylight Time (UT+1h)  MAYBRIDGE\NMR@NMR_250MHZ
##.OBSERVE FREQUENCY= 250.131544655141
##.OBSERVE NUCLEUS= ^1H
##.ACQUISITION MODE= SIMULTANEOUS (DQD)
##.ACQUISITION SCHEME= undefined
##.AVERAGES= 16
##.DIGITISER RES= 18
##SPECTROMETER/DATA SYSTEM= dpx250
##.PULSE SEQUENCE= zg30
##.SOLVENT NAME= CDCl3
##.SHIFT REFERENCE= (INTERNAL, CDCl3, 0, 16.522)
##AUDIT TRAIL= $$ (NUMBER, WHEN, WHO, WHERE, WHAT)
$$ ##TITLE= Audit trail, XWIN-NMR		Version 3.5
$$ ##JCAMPDX= 5.01
$$ ##ORIGIN= Bruker BioSpin GmbH
$$ ##OWNER= NMR
$$ C:\u/data/dgb/nmr/ADRS/9330/pdata/1/auditp.txt
$$ ##AUDIT TRAIL=  $$ (NUMBER, WHEN, WHO, WHERE, WHAT)
(   1,<2005-09-12 16:29:08.16 +100>,<MAYBRIDGE\NMR>,<NMR_250MHZ>,
      <created by zg, POWCHK disabled, PULCHK disabled
       configuration hash MD5:
       62 19 C7 07 E1 42 D1 B7 37 6C 3D D0 77 39 F9 E6
       data hash MD5: 64K
       82 63 B1 2F C6 49 5F 15 A5 37 38 70 4C B6 81 75>)
(   2,<2005-09-12 16:29:19.66 +100>,<MAYBRIDGE\NMR>,<NMR_250MHZ>,
      <Start of raw data processing
       ef LB = 0.3 FT_mod = 6 PKNL = 1 SI = 32K 
       data hash MD5: 32K
       E0 83 62 27 CB 53 E0 32 C9 9A 34 90 FE 30 81 77>)
(   3,<2005-09-12 16:29:21.75 +100>,<MAYBRIDGE\NMR>,<NMR_250MHZ>,
      <apk 
       data hash MD5: 32K
       8C D2 63 16 66 A0 EC EB 2F C7 73 46 AE FD 2F 3F>)
(   4,<2005-09-12 16:29:22.55 +100>,<MAYBRIDGE\NMR>,<NMR_250MHZ>,
      <abs ABSG = 5 
       data hash MD5: 32K
       ED 1E DA 87 EC CE 3D 97 27 56 AA EA 2B 6D C8 07>)
$$ ##END=
$$ 
$$ hash MD5
$$ B8 19 8E 1C 46 15 18 F6 42 BA E4 8B 4B 60 CD FF
##$RELAX= 
##$RELAX= 
##$RELAX= 
##$RELAX= 
##$RELAX= 
##$RELAX= 
##$RELAX= 
$$ Bruker specific parameters
$$ --------------------------
##$DU= <C:\u>
##$EXPNO= 9330
##$NAME= <ADRS>
##$PROCNO= 1
##$TYPE= <nmr>
##$USER= <dgb>
##$AMP= (0..31)
100 100 100 100 100 100 100 100 100 100 100 100 100 100 100 100 100 100 
100 100 100 100 100 100 100 100 100 100 100 100 100 100 
##$AQSEQ= 0
##$AQ_mod= 3
##$AUNM= <au_zg>
##$AUTOPOS= <49 >
##$BF1= 250.13
##$BF2= 250.13
##$BF3= 250.13
##$BF4= 250.13
##$BF5= 500.13
##$BF6= 500.13
##$BF7= 500.13
##$BF8= 500.13
##$BYTORDA= 1
##$CFDGTYP= 0
##$CFRGTYP= 5
##$CHEMSTR= <none>
##$CNST= (0..31)
1 1 145 1 1 1 1 1 1 1 1 1 1 1 1 1 1 1 1 1 1 1 1 1 1 1 1 1 1 1 1 1 
##$CPDPRG= <>
##$CPDPRG1= <>
##$CPDPRG2= <>
##$CPDPRG3= <>
##$CPDPRG4= <mlev>
##$CPDPRG5= <mlev>
##$CPDPRG6= <mlev>
##$CPDPRG7= <mlev>
##$CPDPRG8= <mlev>
##$CPDPRGB= <>
##$CPDPRGT= <>
##$D= (0..31)
0 1 0 0 0 0 0 0 0 0.06 0 0 0 0 0 0 0.0002 0 0 0 0 0 0 0 0 0 0 0 0 0 0 
0 
##$DATE= 1126538947
##$DBL= (0..7)
120 120 120 120 120 120 120 120 
##$DBP= (0..7)
150 150 150 150 150 150 150 150 
##$DBP07= 0
##$DBPNAM0= <>
##$DBPNAM1= <>
$$ [...]
##$SUBNAM7= <"">
##$SUBNAM8= <"">
##$SUBNAM9= <"">
##$SW= 20.6930455092707
##$SWIBOX= (0..15)
0 0 3 0 0 0 0 0 0 0 0 0 0 0 0 0 
##$SW_h= 5175.983436853
##$TD= 65536
##$TD0= 1
##$TE= 295.16
##$TE2= 300
##$TE3= 300
##$TEG= 300
##$TL= (0..7)
0 120 120 120 120 120 120 120 
##$TP= (0..7)
150 150 150 150 150 150 150 150 
##$TP07= 0
##$TPNAME0= <>
##$TPNAME1= <>
##$TPNAME2= <>
##$TPNAME3= <>
##$TPNAME4= <>
##$TPNAME5= <>
##$TPNAME6= <>
##$TPNAME7= <>
##$TPOAL= (0..7)
0.5 0.5 0.5 0.5 0.5 0.5 0.5 0.5 
##$TPOFFS= (0..7)
0 0 0 0 0 0 0 0 
##$TUNHIN= 0
##$TUNHOUT= 0
##$TUNXOUT= 0
##$USERA1= <user>
##$USERA2= <user>
##$USERA3= <user>
##$USERA4= <user>
##$USERA5= <user>
##$V9= 5
##$VALIST= <valist>
##$VCLIST= <CCCCCCCCCCCCCCC>
##$VD= 0
##$VDLIST= <DDDDDDDDDDDDDDD>
##$VPLIST= <PPPPPPPPPPPPPPP>
##$VTLIST= <TTTTTTTTTTTTTTT>
##$WBST= 1024
##$WBSW= 4
##$XGAIN= (0..3)
0 0 0 0 
##$XL= 0
##$YL= 0
##$YMAX_a= 545432
##$YMIN_a= -525658
##$ZGOPTNS= <>
##$ZL1= 120
##$ZL2= 120
##$ZL3= 120
##$ZL4= 120
##$ABSF1= 16.522
##$ABSF2= -4.171173
##$ABSG= 5
##$ABSL= 3
##$ALPHA= 0
##$AQORDER= 0
##$ASSFAC= 0
##$ASSFACI= 0
##$ASSFACX= 0
##$ASSWID= 0
##$AUNMP= <proc_1d>
##$AZFE= 0.1
##$AZFW= 0.1
##$BCFW= 0
##$BC_mod= 0
##$BYTORDP= 0
##$COROFFS= 0
##$CY= 12.5
##$DATMOD= 1
##$DC= 0
##$DFILT= <>
##$DTYPP= 0
##$F1P= 14.0000005364418
##$F2P= -0.99999901652339
##$FCOR= 0.5
##$FTSIZE= 32768
##$FT_mod= 6
##$GAMMA= 0
##$GB= 0
##$INTBC= 1
##$INTSCL= 1
##$ISEN= 128
##$LB= 0.3
##$LEV0= 0
##$LPBIN= 0
##$MAXI= 10000
##$MC2= 0
##$MEAN= 0
##$ME_mod= 0
##$MI= 0
##$NCOEF= 0
##$NC_proc= -3
##$NLEV= 6
##$NOISF1= 0
##$NOISF2= 0
##$NSP= 0
##$NTH_PI= 0
##$NZP= 0
##$OFFSET= 16.522
##$PC= 1
##$PHC0= 134.3231
##$PHC1= -7.096635
##$PH_mod= 1
##$PKNL= yes
##$PPARMOD= 0
##$PSCAL= 4
##$PSIGN= 0
##$REVERSE= no
##$SF= 250.13
##$SI= 32768
##$SIGF1= 0
##$SIGF2= 0
##$SINO= 400
##$SIOLD= 32768
##$SREGLST= <1H.CDCl3>
##$SSB= 0
##$STSI= 32768
##$STSR= 0
##$SW_p= 5175.98343685301
##$SYMM= 0
##$S_DEV= 0
##$TDeff= 65536
##$TDoff= 0
##$TI= <Analysis number 999999
Compound Code 99
Book Reference 9
Project Code 9>
##$TILT= no
##$TM1= 0
##$TM2= 0
##$TOPLEV= 0
##$USERP1= <user>
##$USERP2= <user>
##$USERP3= <user>
##$USERP4= <user>
##$USERP5= <user>
##$WDW= 1
##$XDIM= 32768
##$YMAX_p= 448545837
##$YMIN_p= -99870
$$ End of Bruker specific parameters
$$ ---------------------------------
##NTUPLES= NMR SPECTRUM
##VAR_NAME=  FREQUENCY,     SPECTRUM/REAL,   SPECTRUM/IMAG
##SYMBOL=    X,             R,               I
##VAR_TYPE=  INDEPENDENT,   DEPENDENT,       DEPENDENT
##VAR_FORM=  AFFN,          ASDF,            ASDF
##VAR_DIM=   32768,         32768,           32768
##UNITS=     HZ,            ARBITRARY UNITS, ARBITRARY UNITS
##FACTOR=    0.157963299565203, 1,           1
##FIRST=     4132.6476996994, 0,             0
##LAST=      -1043.33573715361, 0,           0
##MIN=       -1043.33573715361, -99870,      0
##MAX=       4132.6476996994, 448545837,     0
$$ Real data points
##PAGE= N=1
##DATA TABLE= (X++(R..R)), XYDATA
$$ [...]
18078E9901R28m8m004j697n10m174n277j276N106q268k303j97l65J560l221o11
18062C5544M64m074l214O160k083k80k618m158o225k390K846M191J342m962k181
18047A8362K067K371J00L511L088J50J383k068K013j775k081K737Q26j816m235
18032B4633j179K540J396q88j152l217k696j804m216K07O51l259o658l73M011
18017G996M96k04J814q36k283L543M235J483n733j224M534J655k349q95j084J493
18001A2641M36l036k33N972K199J22L741l24k579L856M137K338J544L05o131k699
17985B2289k960l876Q26l496l071P43L83r32J199j95m268m29J747N54n2J16Q17
17968I395k093P10P93l43K808L093l643p359m584N518l84k51N348O41K258L662
$$ plain form
18078 59901 60829 60781 56777 55080 54570 50396 45119 43843 48949 40681 38378 38181 37816 39376 36155 35544
18062 35544 36008 31934 28720 34880 32797 32517 29899 25741 19516 17126 19972 24163 25505 20543 18362
18047 18362 20429 22800 22900 26411 29499 29649 31032 28964 30977 29202 27121 29858 30684 28868 24633
18032 24633 23454 25994 27390 26502 25350 22133 19437 17633 13417 13624 14275 11016 4358 3985 7996
18017 7996 8492 8288 10102 9266 6983 10526 14761 16244 10511 9287 13821 15476 13127 12232 11148 12641
18001 12641 13077 10041 9808 15780 17979 18101 21842 21518 18939 22795 26932 29270 30814 31119 24988 22289
17985 22289 19329 15453 16279 12783 9712 10455 10838 9906 11105 10910 6642 6213 7960 8514 8462 8578 9395
17968 9395 7302 8012 8805 8462 11270 14363 10720 3361 -1223 4295 3911 3660 9008 9649 11907 15569
17952A5569j571k707m461k140M509j166k738j647M310N332o18k860K177q54Jr21
17936A0215j802J768M797Q614K590R89M444R3j297M50k809j483o08P83j121J766
17920B7389O58Q17K564m191l007j84m482m377l51l51n943j255L430r7k84n45j984
17903G807n036M8O766k221l870k311K170O702N098K951n643q347O964O053K79
17888A7410k522k528J625K957K140l340j314R58J521o99l819Q90J737K015K110
17873A9141K258N079l784m770l367K25n060k748o257o10J012N00p54j335j761
17858b231j923O63N468l274j481N341O333m881J190o60O903K879q03r68o350n549
17842F57l292M237J433o21J140O99k127n73m992J673L552l000k247o025k045N367
$$ plain form
17952 15569 13998 11291 6830 4690 9199 8033 5295 3648 7958 13290 12672 9812 11989 11135 11136 10215
17936 10215 8413 10181 14978 23592 26182 27171 31615 31708 30411 30861 28052 26569 25961 26744 25623 27389
17920 27389 28047 28864 31428 27237 24230 24046 19564 15187 14836 14485 8542 7287 10717 10620 10336 9791 7807
17903 7807 2771 2819 9585 7364 3494 1183 3353 10055 15153 18104 12461 4114 11078 17131 17410
17888 17410 14888 12360 13985 16942 19082 15742 14428 15386 16907 16208 12389 13279 15016 17031 19141
17873 19141 21399 26478 22694 17924 14557 14782 9722 6974 717 107 1119 1619 865 -470 -2231
17858 -2231 -4154 -3491 1977 -1297 -2778 2563 8896 4015 5205 4545 11448 14327 13524 12556 6206 657
17842 657 -2635 1602 3035 2414 3554 4253 2126 1553 -3439 -1766 1786 -1214 -3461 -9486 -11531 -6164
17826f164R379M347j482k192p6K128Q78O260q56p327O99N862n032k715K351K988
17810I048K16n076o329j572K360k6L003n218R06K962N294k285k342R31m878l033
17794f039J89J49J323k257K203J865P586O6j319n895k908J26m62Q91K308K992
17778H18L902P41r383J556q11M29j605k866K121k414j054N942M888O81j616n0
17762A279l11N493Q22J288o197k424j274j094M68n054j315M190j14k103O456j723
17746a613l424K434j99l495l416M93n80J15O217K831j848J393p1j636M057L976
17730E234j519l181j183k551K722j616k000j969O535L306l597m091o06J693p07
17715c530L537j087l832k306L041l326k92K909j45J536P84j707J241J394n92R16
$$ plain form
17826 -6164 3215 7562 6080 3888 3812 5940 6818 13078 12222 4895 5594 11456 6424 3709 6060 9048
17810 9048 9264 4188 -2141 -3713 -1353 -1379 1624 -3594 -2688 274 5568 3283 941 1872 -3006 -6039
17794 -6039 -5850 -5701 -4378 -6635 -4432 -2567 5019 5085 3766 -2129 -5037 -4911 -5373 -4482 -2174 818
17778 818 4720 5461 -3922 -2366 -3177 -2748 -4353 -7219 -5098 -7512 -8566 -2624 2264 2945 1329 1279
17762 1279 968 6461 7283 8571 2374 -50 -1324 -2418 -1950 -7004 -8319 -4129 -4243 -6346 110 -1613
17746 -1613 -5037 -2603 -2802 -6297 -9713 -9220 -9800 -9685 -3468 -637 -2485 -1092 -1163 -2799 1258 5234
17730 5234 3715 534 -649 -3200 -478 -2094 -4094 -6063 472 3778 181 -3910 -4516 -2823 -3530
17715 -3530 7 -1080 -4912 -7218 -4177 -7503 -7795 -4886 -5031 -3495 -2711 -4418 -3177 -1783 -2375 -1459
17699a459J875q87n59J383o96J370j425k81R50J227m67j216j519j127L203M687
17683E059L92n195k322N70M755M249l807n251k148L760j561N14m15J540r04j028
17667a792l913N21Q08j405L541r32p136l543K068N566M547m475K810L786j733
17652a282j240k551K732J222n561k552N136M849j166j914r23J005k030o18k69
17637e162K127j856j642J706R09l19R02K742j124j011N996J664m390k60J751L85
17621B418K49L817J792j616l197k190j209j532Q19m752P98o78k446L555M437q153
17605g888j805O031n14N714K28o568m060M198J588J88J638N08j173J038K969k974
17589h82K23l57n64j22J527k96j963j378J621K967J24k015J196k592m436k450
$$ plain form
17699 -1459 416 -471 -1030 353 -343 1027 -398 -679 271 1498 1031 -185 -1704 -2831 372 5059
17683 5059 5451 256 -2066 -1496 3259 7508 3701 -1550 -3698 62 -1499 -985 -1400 140 -764 -1792
17667 -1792 -5705 -5184 -4376 -5781 -2240 -3172 -10308 -13851 -11783 -6217 -1670 -6145 -3335 451 -1282
17652 -1282 -2522 -5073 -2341 -1119 -6680 -9232 -4096 753 -413 -2327 -3250 -2245 -4275 -4893 -5162
17637 -5162 -3035 -4891 -6533 -4827 -3918 -4237 -3335 -593 -1717 -2728 3268 4932 542 282 2033 2418
17621 2418 2667 6484 8276 6660 3463 1273 64 -1468 -649 -5401 -4603 -5281 -7727 -4172 265 -7888
17605 -7888 -9693 -3662 -4176 1538 1766 -4802 -8862 -4664 -3076 -2888 -1250 -742 -1915 -877 2092 -882
17589 -882 -659 -1016 -1580 -1702 -175 -471 -2434 -3812 -2191 776 900 -1115 81 -2511 -6947 -9397
17573i397J276r05L166M798o08j836l281K794J217k535n90M632K010l671p341
17558a0271m179M513L041M320J440k936L732m265n328J670m95M170K197k791j838
17543g020K424K560k462k256j532l617n49J058J008L372p66K563P21J711L361
17528E76l90Q22j852j604k004j731Q20K575k770o84L511P6j722k602K052J865
17512c062J418L656J857q63J411j204m230j036l97k124j301j025j215n68N169
17497c514J293m392P72j399l523k03M77J091J98j158L683O224k23J312r58J714
17481A394l294k185n71O50j177N792J463l793o236Q90L366r7j00j936l066J846
17465g054K690j95k839k732j809k653M623L413O55k946J589M892M062l134k281
$$ plain form
17573 -9397 -8121 -9026 -5860 -1062 -1670 -3506 -6787 -3993 -2776 -5311 -5901 -1269 741 -2930 -10271
17558 -10271 -14450 -9937 -6896 -2576 -1136 -4072 -340 -4605 -9933 -8263 -8758 -4588 -2391 -5182 -7020
17543 -7020 -4596 -2036 -4498 -6754 -8286 -11903 -12452 -11394 -10386 -7014 -7780 -5217 -4496 -2785 576
17528 576 186 1008 -844 -2448 -4452 -6183 -5363 -2788 -5558 -6242 -2731 -2655 -4377 -6979 -4927 -3062
17512 -3062 -1644 2012 3869 3006 4417 3213 -1017 -2053 -2450 -4574 -5875 -6900 -8115 -8683 -3514
17497 -3514 -2221 -6613 -5841 -7240 -10763 -10966 -10489 -9398 -9200 -10358 -6675 -451 -674 638 -320 1394
17481 1394 -1900 -4085 -4656 -4006 -5183 609 2072 -1721 -7957 -7067 -3701 -3798 -3898 -5834 -8900 -7054
17465 -7054 -4364 -4559 -7398 -10130 -11939 -14592 -9969 -6556 -5901 -8847 -7258 -2366 1696 -1438 -3719
17450c719J269q1L810O02j71m176J133M073O159Q640R056j712N99j194l658p824
17434A2806l460j528j604k00n071r12j124k019k555m307l956J264O730L96j436
17419f976l974m18M549L697L21J835m04q68k575k877K725k262m81K901n825p946
17403a8578j843L578L606L066M788l700o19n19p95j154O11K023j1J864M764n47
17387c466O20Q38N134p49m108L82l039k633M438L441l667m099K47J96P62m94K212
17370c985J847P233L783j618p01l65K213J017l54l247p8m692n051j760N01n4o78
17353e989L965J430k476j823Q61L360J134K650k498n362K092K128m93j065o220
17338h306p44M62J548L391j492j371j649M920M087M163m791m231M72r12m326J716
$$ plain form
17450 -3719 -2450 -2531 1279 1881 1710 -2466 -1333 2740 8899 17539 26595 24883 25482 24288 20630 12806
17434 12806 9346 7818 6214 6014 943 31 -1093 -3112 -5667 -9974 -13930 -12666 -5936 -5540 -6976
17419 -6976 -10950 -11368 -6819 -3122 -2801 -966 -1370 -2238 -4813 -7690 -4965 -7227 -7708 -4807 -10632 -18578
17403 -18578 -20421 -16843 -13237 -10171 -5383 -9083 -9702 -10221 -11016 -12170 -11559 -9536 -9547 -7683 -2919 -3466
17387 -3466 -2846 -2008 3126 2377 -1731 -1349 -4388 -7021 -2583 858 -2809 -6908 -6661 -6465 -5703 -6197 -3985
17370 -3985 -2138 5095 8878 7260 6559 6194 8407 9424 9070 5823 5745 1053 -3998 -5758 -5257 -5311 -5989
17353 -5989 -2024 -594 -3070 -4893 -4032 -672 462 3112 614 -4748 -2656 -528 -1021 -2086 -8306
17338 -8306 -9050 -8588 -7040 -3649 -5141 -6512 -8161 -3241 846 5009 218 -4013 -3541 -4453 -8779 -7063
17322g063J72j485L098K993J349L929j407k138l64j520k630l773k331O309L957
17307i04K448O68l320m535l712L599L882j77K110O578K214k175J657k058q190
17292a915j859M26L055n152m240n459r63J095K475K813l2l883K222L778J239J708
17276d692m05l619j562K070L62m7k655K284J581m74K059k782M250M064k688Q06
17260a448K604o86o281l208P067L479m864p808P57K958J536l217q17L447j577
17245h058N85J918k969q151J443K221l42M830M348l367p23n09J215L531L362j762
17229b428J265q33j460o26j549J137K689K135k979m919L012N507m851k856L239
17214c517n80j968j92K084r0k146N17J586K36J649P29n6J539j662k469k806J364
$$ plain form
17322 -7063 -6891 -8376 -5278 -2285 -936 2993 1586 -552 -916 -2436 -5066 -8839 -11170 -4861 -904
17307 -904 1544 2212 -1108 -5643 -9355 -5756 -1874 -2051 59 6637 8851 6676 8333 6275 -1915
17292 -1915 -3774 -3348 -293 -5445 -9685 -15144 -16107 -15012 -12537 -9724 -9756 -13639 -11417 -7639 -6400 -4692
17276 -4692 -5097 -8716 -10278 -8208 -7846 -7893 -10548 -8264 -6683 -7157 -5098 -7880 -3630 434 -2254 -1448
17260 -1448 1156 470 -5811 -9019 -1952 1527 -3337 -11145 -10388 -7430 -5894 -9111 -9928 -6481 -8058
17245 -8058 -7473 -5555 -8524 -16675 -15232 -13011 -13353 -8523 -4175 -7542 -8265 -8774 -7559 -4028 -666 -2428
17229 -2428 -1163 -1996 -3456 -4082 -5631 -4494 -1805 330 -2649 -7568 -4556 951 -3900 -6756 -3517
17214 -3517 -4097 -6065 -6257 -4173 -4263 -6409 -5892 -4306 -4070 -2421 -1692 -1748 -209 -1871 -4340 -7146 -5782
17197e782J745l228l68N045J457k006m173r79L48M39o44j200n282J116N785Q667
17181I40J147n395M812K712k821J747L289j924j173l815k012O68J047k248K259
17166g67j781j689o45l43m53L752N774K569M504K819P914R135K3900L4535N0803
17151A40027M6603L4602J1738l0551n1939m4627k8822k1360j1890o887j0709j0359
17139A5826n255M299l013m196R76j983o683m32L644J400j833n877k664j957L756
17124c992M945N426l053q607m496M496Q085N443L300o769j0368o164m386L988
17110a2152N536R40k208J106J890L151R45O80p93n214k629M126P301L184k484
17095C379k819K10M221n10m540m126n369R14J958L342K646K169k645q352j823
$$ plain form
17197 -5782 -4037 -7265 -7633 -2588 -1131 -3137 -7310 -8289 -7941 -7502 -8146 -9346 -14628 -13512 -7727 940
17181 940 2087 -3308 1504 4216 1395 3142 6431 4507 3334 -481 -2493 -1825 -778 -3026 -767
17166 -767 -2548 -4237 -4882 -5225 -5678 -1926 3848 6417 10921 13740 21654 30789 54689 89224 140027
17151 140027 186630 221232 232970 202419 150480 105853 77031 55671 43781 36894 26185 15826
17139 15826 10571 14870 11857 7661 8637 6654 -29 -461 3183 4583 2750 -3127 -5791 -7748 -3992
17124 -3992 953 6379 3326 -5281 -9777 -5281 2804 8247 11547 4778 -5590 -11754 -16140 -12152
17110 -12152 -6616 -5676 -7884 -6778 -4888 -1737 -792 -112 -905 -6119 -8748 -4622 2679 5863 3379
17095 3379 560 770 4991 4481 -59 -4185 -9554 -8640 -6682 -3340 -694 1475 -1170 -9522 -11345
17080a1345M741O560O929Q239k086q226p364l600k339N768P680l20n209n080l868
17065i520o86M663N260J203n304l014Q40j408k49r9k894J868J461K122L960K900
17049A103K979N80o650o841K557J197p92m217J300K444L638j539j631J942K625
17034a305K901M22r18K94p094k642n416O68M756J832J118n227j010L218j581K624
17018g360l39R00l7r81J35N8m236J144k744K689R344L86k125n824k203n6K266
17001h983L839o91N133N7K191L156R18j439n152j411l373Q48j504l373m107j502
16985a5393J49l824k761M699N978K093J391O89J765L615J684q76k735q9j967j043
16969f625o00M74J28K577m492p543j525j37K250J87J000M658J016j309N294M964
$$ plain form
17080 -11345 -6604 -44 6885 15124 13038 4812 -2552 -6152 -8491 -2723 4957 4637 -572 -5652 -9520
17065 -9520 -10206 -5543 -283 920 -4384 -7398 -6558 -7966 -8215 -8314 -11208 -9340 -7879 -5757 -1797 1103
17049 1103 4082 4662 -1988 -8829 -6272 -5075 -5867 -10084 -8784 -6340 -2702 -4241 -5872 -3930 -1305
17034 -1305 1596 2018 1100 1394 -5700 -8342 -13758 -13090 -8334 -6502 -5384 -10611 -11621 -8403 -9984 -7360
17018 -7360 -7699 -6799 -6836 -7817 -7682 -7624 -11860 -10716 -13460 -10771 -1427 -1041 -3166 -8990 -11193 -11249 -8983
17001 -8983 -5144 -5835 -702 -645 1546 4702 5620 4181 -971 -2382 -5755 -4907 -6411 -9784 -13891 -15393
16985 -15393 -15244 -19068 -21829 -17130 -11152 -9059 -7668 -6979 -5214 -1599 85 -791 -3526 -3615 -5582 -6625
16969 -6625 -7225 -6751 -6623 -4046 -8538 -16081 -17606 -17743 -15493 -15306 -14306 -9648 -8632 -9941 -4647 317
16953C17K536l82o275q04L545R61l271l020N182N386l055p511R30J830j895j485
16937g011M723P11q571l551M241N584M222n63O93k011o870k954j157O079O521
16922H6j180k557l57m36K161J959m27K037k3M22J780m699p867o926J15J613L850
16905a0449R96J642L287k250l89L624M68j220L558K118m6l665J38L201j928m847
16889e762m002J170N175J823l4j448k414J479l48M948k500L18o49m191m340M467
16873f308K426l519O34J287J068l399m0L434L152M68m488k979P05k573k058j908
16857a4098J386N365j793l981J197M52l685L698o20n189J067P448K712Q13j863
16842g091K285n368l227p8J372M389L436L863k272j970l30o77J038J664q42m336
$$ plain form
16953 317 2853 2471 -3804 -4608 -1063 -102 -3373 -6393 -1211 4175 1120 -6391 -5461 -3631 -5526 -7011
16937 -7011 -2288 -1577 -10148 -13699 -9458 -3874 348 -215 478 -1533 -8403 -11357 -12514 -6435 86
16922 86 -1094 -3651 -4008 -4444 -2283 -324 -751 1286 1263 1685 3465 -1234 -9101 -16027 -15912 -14299 -10449
16905 -10449 -9453 -7811 -4524 -6774 -7163 -3539 -3071 -4291 -733 1385 1339 -2326 -2188 1013 -915 -5762
16889 -5762 -9764 -8594 -3419 -1596 -1630 -3078 -5492 -4013 -4361 587 -1913 -1595 -2244 -6435 -10775 -6308
16873 -6308 -3882 -7401 -6767 -5480 -4412 -7811 -7851 -4417 -1265 -797 -5285 -8264 -7559 -10132 -12190 -14098
16857 -14098 -12712 -7347 -9140 -13121 -11924 -11472 -15157 -11459 -12079 -17268 -16201 -8753 -6041 -5228 -7091
16842 -7091 -4806 -10174 -13401 -13479 -12107 -7718 -4282 -419 -2691 -4661 -4991 -5668 -4630 -2966 -3808 -8144
16826h144m943J955m74J808K747j759N257K784k690J576M32K263r05l120l585
16811f798k710K550n30l394Q57q82J076j372p11q59k94J417M527o9J083l165l900
16794a3174l110Q37K949J792k915k188j249k66K770M345J508M55p775k276P444
16779a0853K550j541r28K059K142j636k493q73j280k872L976M263o072m691J133
16764a7116P474M790O75J066n50P69o039L503K621k77k649l009o52L87R21M080
16748d006K895K008L372Q57O403J900r204o986O73L741O537K289k948m788n532
16733b789l075o03j269k327J93K981K140L021j194m335j903o49J788l975M32M928
16717f636J601J945j821j879j124p335N702O50l998N571K684j855k716o96P72
$$ plain form
16826 -8144 -13087 -11132 -11606 -9798 -7051 -8810 -3553 -769 -3459 -1883 -1451 812 -93 -3213 -6798
16811 -6798 -9508 -6958 -7488 -10882 -10025 -10907 -9831 -11203 -11914 -12773 -13067 -11650 -7123 -7192 -6109 -9274 -13174
16794 -13174 -16284 -15447 -12498 -10706 -13621 -15809 -17058 -17324 -14554 -10209 -8701 -8246 -16021 -18297 -10853
16779 -10853 -8303 -9844 -10772 -8713 -6571 -8207 -10700 -11573 -12853 -15725 -11749 -7486 -13558 -18249 -17116
16764 -17116 -9642 -4852 -4177 -3111 -3661 -2892 -8931 -5428 -2807 -3084 -5733 -8742 -9394 -9007 -8086 -4006
16748 -4006 -1111 897 4269 5126 11529 13429 4225 -2761 -2088 1653 8190 10479 7531 2743 -2789
16733 -2789 -5864 -6467 -7736 -10063 -9870 -6889 -4749 -1728 -2922 -7257 -9160 -9809 -8021 -11996 -11564 -6636
16717 -6636 -5035 -3090 -4911 -6790 -7914 -15249 -9547 -8897 -12895 -7324 -4640 -6495 -9211 -9907 -9135
16702i135ol712k947j226J403K655K976N4J231J297J455L000M36O85j014k127
16686d975l593K916L463k315n181m951j854M329J0276r00l986p23N466P019j298
16671C693j569r13k023l260J500K568J312j815m224J551K979q8o030K667N395
16656A743q58L63j178l057j735L81k77K414n288k827j013j310K721K606q91m516
16640a2722l689L587L25P55Q44N47K343M159m054j450O33P333M835P714k125p119
16624A916k187j691m983j908N059L336M998K084M08P95l588q045L50m494K624
16609e326N53j04l466n133J078O877J346k776o692m12N389o13K765L412k845K198
16593c749j28l679K86O502K989j815m544J979j431p78J084m004K422K216K492
$$ plain form
16702 -9135 -9141 -12853 -15800 -17026 -15623 -12968 -9992 -9938 -8707 -7410 -5955 -2955 -2519 -1834 -2848 -4975
16686 -4975 -8568 -5652 -2189 -4504 -9685 -14636 -16490 -12161 -1885 -2785 -6771 -7494 -2028 4991 3693
16671 3693 2124 1211 -812 -4072 -2572 -4 1308 -507 -4731 -3180 -201 -289 -6319 -3652 1743
16656 1743 885 1248 70 -2987 -4722 -4341 -4618 -2204 -7492 -10319 -11332 -12642 -9921 -7315 -8206 -12722
16640 -12722 -16411 -12824 -12499 -11744 -10900 -10353 -8010 -3851 -7905 -9355 -8722 -1389 3446 11160 9035 1916
16624 1916 -271 -1962 -6945 -8853 -3794 -458 4540 6624 7032 7827 4239 -3806 -3456 -7950 -5326
16609 -5326 -4773 -4877 -8343 -13476 -12398 -5521 -4175 -6951 -13643 -14055 -8666 -9279 -6514 -3102 -5947 -3749
16593 -3749 -3877 -7556 -7270 -768 2221 406 -4138 -2159 -3590 -4368 -3284 -7288 -4866 -2650 -158
16578a58K129J085L789k702K313J206L22l862o203Q1J272k251N36M834L42p585
16562d852n298K924J092k532M51N475L958j376o569q27K075M351J006l603m988
16547h713L40R881M824k287Nm89r175k844L212q2R97k887j715Q286L853j611J976
16530C571l830n291O136N023l933J819o027l44J930O924K382M360n80p81k79k728
16514H352N93M743O832M826L808p13j251Q380P711j303O915P661o36J40L859R761
16498F9678J2726J1914J3594J4395K2667M2486N7171Q0520J26914J79469K19770
16487H51304J84150J21788K4259m7953o358O6884M3645j3204j29026k25585k22560
16476F47344j70237j29397r7593o4266l6265k4590j2065p847o005l891r954j8825
$$ plain form
16578 -158 1971 3056 6845 4143 6456 7662 7984 4122 -2081 -2000 -728 -2979 -2443 2391 2733 -4852
16562 -4852 -10150 -7226 -6134 -8666 -8215 -2740 1218 -158 -6727 -7554 -5479 -1128 -122 -3725 -8713
16547 -8713 -8373 1508 6332 4045 4050 3561 -5614 -8458 -5246 -5328 -4331 -7218 -8933 -647 3206 1595 3571
16530 3571 -259 -5550 586 5609 1676 3495 -2532 -2876 -946 5978 8360 12720 12140 11359 11080 8352
16514 8352 8945 13688 20520 25346 29154 28441 27190 35570 43281 41978 48893 56554 55918 56058 59917 69678
16498 69678 82404 94318 107912 122307 144974 187460 244631 325151 452065 631534 851304
16487 851304 1035454 1157242 1181501 1133548 1127190 1194074 1237719 1224515 1095489 869904 647344
16476 647344 477107 347710 250117 185851 149586 124996 112931 105084 99079 95188 85234 66409
16464F6409j6738o326l266j0341n206J443J719p98m312l871k700J616k462l577
16450A1590o431k692J844K236k176j626J516N38l52k43O203K602o386O56K143
16435I422j792l768j821j727j124M83j854l248K937N707J242j798K900L342j417
16420G484k457l456k736O10P21k672N702O197L744k447P33J906l71O397Q981L073
16404C1409J26N22J233P011J0479Q921Q791O169K745P132P955l091m626J071L688
16389H9535l525M569P411N182R285J2354J4489K0007L2084N0714P7208J18841
16377D38154J64514K37633K75332K24494J41126J2094m9163J9511Q0419M0315
16367A584429m4712k06686k93555k69140k03822j56934j10759p2373m7813l6705
$$ plain form
16464 66409 49671 43345 40079 29738 24532 25975 27694 26896 22584 18713 16013 17629 15167 11590
16450 11590 5159 2467 4311 6547 4371 2745 4261 4799 4447 4204 10407 13009 6623 7279 9422
16435 9422 7630 3862 2041 314 -810 -327 -2181 -5429 -2492 3215 4457 2659 5559 8901 7484
16420 7484 5027 1571 -1165 -555 166 -2506 3196 9393 13137 10690 11423 13329 12958 19355 28336 31409
16404 31409 31535 32057 33290 40301 50780 59701 68492 74661 77406 84538 92493 89402 84776 85847 89535
16389 89535 86010 90579 97990 103172 112457 124811 139300 159307 191391 242105 319313 438154
16377 438154 602668 840301 1115633 1340127 1481253 1493347 1444184 1463695 1544114 1584429
16367 1584429 1539717 1333031 1039476 770336 566514 409580 298821 226448 178635 141930
16357A41930k3545k1600k2999j4861p719m513p773l268kj576m738J693K308l719
16343B9618k905k683n363j753N004O943P473M384J918L638N940M771j1300q237
16329C7448j761j0156q331M423J0172J837l160n527n815k936k519p263J819L662
16315A1893l529p12k49p021l916J3N537N168J240J454J96o96m108o053J209P604
16299H030L726j062n340p997O67j905m78L900N980K433L411P924J292r75K274
16284B1880m379k722k634l657j719k30K055N14j442l427m436M495K751J65l524
16269C690o865j116K172L186Q70J410O878O743N845M357J0219Q178J14k183j621
16254D1877l64j745J073N606O872J194O923R121L889M017K758J3222K2148K5376
$$ plain form
16357 141930 118385 96785 73786 58925 51206 46693 38920 35652 35650 34074 29336 31029 33337 29618
16343 29618 26713 24030 18667 16914 21918 28861 36334 40718 42636 46274 52214 56985 45685 37448
16329 37448 35687 25531 17200 21623 31795 33632 30472 24945 19130 16194 13675 6412 8231 11893
16315 11893 8364 7652 7403 382 -3534 -3521 2016 7184 8424 9878 10074 9378 5270 -783 426 8030
16299 8030 11756 10694 5354 -2643 -1976 -3881 -4359 -459 5521 7954 11365 19289 20581 19606 21880
16284 21880 17501 14779 12145 8488 6769 6539 8594 9108 7666 4239 -197 4298 7049 7214 3690
16269 3690 -3175 -4291 -2119 1067 1937 3347 10225 16968 22813 27170 37389 45567 45681 43498 41877
16254 41877 41513 39768 40841 46447 53319 54513 61436 70557 74446 78463 81221 94443 116591 141967
16240A41967L4650M3465P0688J06228J66960K23622K07358J54414O7955l5691
16230A181616k8488N0992M8346M285r2097k07641k36319j89326j41179j05926
16220B84263p1460m6417l5091k4839j2561j3758j5519q602m382l853p647m893
16208C5241j907M06L14J357k381j727l181m332o612p602O5O021N283L198J495
16193B5638j888k279l66k026N521O824M126j915P996M595L058P576M586L391L7
16178F4874M869J0521N817N768R064L746m09N490J4262J7338J5277K2101L8131
16165B16849O2761J02599J48444K18171K91522K74970K00263Q9318o0474p9903
16155A464520J7327K8837j8828j17524k43203k78254k22971j66547j29600r0918
$$ plain form
16240 141967 176617 220082 290770 396998 563958 787580 994938 1149352 1217307 1181616
16230 1181616 1153128 1204120 1252466 1256751 1164654 957013 720694 531368 390189 284263
16220 284263 212803 166386 131295 106456 93895 80137 64618 56016 51634 47781 40134 35241
16208 35241 33334 33740 34054 35411 33030 31303 28122 23790 17178 9576 9641 15662 20945 24143 25638
16193 25638 23750 21471 21105 19079 24600 31424 35550 33635 41631 46226 49284 56860 61446 64837 64874
16178 64874 69743 80264 86081 91849 100913 104659 104250 109740 124002 141340 156617 178718 216849
16165 216849 279610 382209 530653 748824 1040346 1315316 1515579 1604897 1544423 1464520
16155 1464520 1481847 1510684 1491856 1374332 1131129 852875 629904 463357 333757 242839
16145B42839n9017l6380k9157k0799j9648j1111n868n335m002q071r871k839m585
16132B6156j723K764J1k223m846j578j696k582j522k431K775O526j941k290K914
16117A8314j596j297l765j44j7K140N33Q33K908M742p84l636J801M30n827k743
16101A1892l28j46M791n63k661m779O13K219q65J22l007o84l187k501K638K918
16085F472q78J470j39M55k516m206L932L650L297K34k455l858j253k616K44J124
16069B957j633k224k536k865n05N275L108k494l526j92k243j373J047o98J100
16054f802R33M441K836l757J778N714q47k03O42n15m06l739k353r65L368O158
16038F283j044k850p62O94P55j828j43k969k630j02J192J932r2K443q79N51m890
$$ plain form
16145 242839 183822 147442 118285 97486 77838 66727 60859 55524 51522 43451 33580 30741 26156
16132 26156 24433 27197 27208 24985 20139 18561 16865 14283 12761 10330 13105 19631 17690 15400 18314
16117 18314 16718 15421 11656 11512 11495 13635 14168 15001 17909 22651 21867 18231 20032 20462 14635 11892
16101 11892 11564 11418 16209 15646 12985 8206 8819 11038 10173 10295 7288 6604 3417 916 3554 6472
16085 6472 5594 7064 6925 7380 4864 658 4590 8240 11537 11771 9316 5458 4205 1589 1833 2957
16069 2957 1324 -900 -3436 -6301 -6806 -1531 1577 -917 -4443 -4635 -6878 -8251 -7204 -7902 -6802
16054 -6802 -5869 -1428 1408 -2349 -571 5143 4296 4093 4735 4220 3814 75 -2278 -3243 125 6283
16038 6283 5239 2389 1627 2321 3076 1248 1105 -1864 -4494 -4596 -3404 -1472 -1564 879 0 551 -4339
16021d339o521J896n826l232N252O440p61j688K175J529J840L871J985k042l523
16006b944J908k439L17L985K907L28m775k063R18k977m906k929K306j76M538N826
15990a76J40k608m111j413P241k26m441m369j475J779M329O954M958n573l180
15975b171N91L448L617L82k092j955L26l457l048k994J289l577M391j869k239
15960i358L169J165K872L414l484k810q59J512j082l57j725j595r76J434L275
15945e405J485J127K57l571m254O8M800M825j684m608L123P356r08j757j78k489
15929a813j115j241P66j933l59L500k69n487M962L297J629k028j519l985j717
15914g312n64K379J191o371q12N129L157O237J181M5K546l350m729j945P95m42
$$ plain form
16021 -4339 -10860 -8964 -14790 -18022 -12770 -6330 -7091 -8779 -6604 -5075 -3235 636 2621 579 -2944
16006 -2944 -1036 -3475 -3158 827 3734 4062 -713 -2776 -1858 -4835 -9741 -12670 -10364 -10540 -6002 -176
15990 -176 -36 -2644 -6755 -8168 -927 -1153 -5594 -9963 -11438 -9659 -5330 1624 6582 1009 -2171
15975 -2171 -1580 1868 5485 5867 3775 1820 2146 -1311 -4359 -7353 -6064 -9641 -5250 -7119 -9358
15960 -9358 -6189 -5024 -2152 1262 -2222 -5032 -5891 -4379 -5461 -5818 -7543 -9138 -10114 -8680 -5405
15945 -5405 -3920 -2793 -2536 -6107 -10361 -10293 -5493 -668 -2352 -6960 -3837 3519 2611 854 676 -1813
15929 -1813 -2928 -4169 -3403 -5336 -5695 -2195 -2464 -7951 -2989 308 1937 -91 -1610 -5595 -7312
15914 -7312 -7876 -5497 -4306 -10677 -11489 -6360 -3203 3034 4215 4260 6806 3456 -1273 -3218 -2423 -2865
15898b865L722P5p79j342r9r97k35K73J339j791n66O53j329J542J757K943N460
15881G761J904j809k384J128k277j278O11L36k245p054l812J865K161L84L097
15866a612o32J219J522o09L79K940m035l058k316J963M304J482J430M119J60j169
15850F087J880k501q171k314n91K853m161l283J177J911k254M442K329m701k317
15835i614N89K68k189J974N552K432l342l123N163N24j439p973J43L329L377l56
15819d685l210N287J294k7J512R54j755r83R77O07n911n554L199J474J087K30
15803e504J172j196M254M291K545L434m8n369k597l948Q25M593J071K591j87J104
15787G031Q92l956L20J438k054j395k143o534k907L237M018N086j771M591N20
$$ plain form
15898 -2865 857 932 153 -1189 -1288 -2285 -2520 -2247 -908 -2699 -3265 -2612 -3941 -2399 -642 2301 7761
15881 7761 9665 7856 5472 6600 4323 3045 3656 3992 1747 -5307 -9119 -7254 -5093 -4709 -1612
15866 -1612 -2244 -1025 497 -112 267 3207 -828 -3886 -6202 -4239 65 1547 2977 7096 7256 6087
15850 6087 7967 5466 -2705 -5019 -5610 -2757 -6918 -10201 -9024 -7113 -9367 -4925 -2596 -7297 -9614
15835 -9614 -9025 -8757 -10946 -8972 -3420 -988 -4330 -7453 -2290 -1766 -3205 -11178 -11035 -7706 -4329 -4685
15819 -4685 -7895 -2608 -1314 -1341 171 1125 -630 -1613 -636 -29 -5940 -11494 -8295 -6821 -5734 -5504
15803 -5504 -4332 -5528 -1274 3017 5562 8996 8948 3579 982 -2966 -2141 2452 3523 6114 5927 7031
15787 7031 7923 3967 4287 5725 3671 2276 133 -6401 -9308 -6071 -2053 3033 1262 5853 6373
15772F373L010k140j026K390m54p92m761l692K393k803j315k085l737J435j66
15757g370Q46L16k238R70M336M251j501m169N017L807m586q388M21K928j005R47
15741e418L697P2K178J923q74j103p97n379M060K503j434k211j44O225J793K785
15725G876j47j418K024L615n19k270k707j640k971k775k954k869n33J653l74K623
15709c386N634j450n814j953N26M881K910n967j742M699p67j694k746j246Q202
15694H7K395k681J050Q43K094J441m660m469m084l689L657O785j968k252L064
15679b387J478m195o807J873K732ro04K561q42J093M558N654j50l362N055L452
15663A0100j97K921K385j738j460K28O011O212J173J984J537j481K226O837Q895
$$ plain form
15772 6373 9383 7243 6217 8607 8153 7361 2600 -1092 1301 -1502 -2817 -4902 -8639 -7204 -7370
15757 -7370 -6524 -6208 -8446 -7476 -3140 1111 -390 -4559 458 4265 -321 -8709 -8288 -5360 -6365 -5418
15741 -5418 -1721 -1649 529 2452 1578 475 -322 -5701 -1641 862 -572 -2783 -2927 3298 5091 7876
15725 7876 7729 6311 8335 11950 11431 9161 6454 4814 1843 -932 -3886 -6755 -7288 -5635 -6009 -3386
15709 -3386 2248 798 -5016 -6969 -6443 -1562 1348 -4619 -6361 -1662 -2429 -4123 -6869 -8115 87
15694 87 2482 -199 851 1694 3788 5229 569 -3900 -7984 -11673 -8016 -1231 -3199 -5451 -2387
15679 -2387 -909 -5104 -11911 -10038 -7306 -7315 -7919 -5358 -6200 -5107 -549 5105 4955 1593 6648 10100
15663 10100 9903 12824 15209 13471 12011 12239 18250 24462 25635 27619 29156 27675 29901 36738 45633
15648D5633N160L424l4K046N409L361O903K297J3055J4100K0828K6275L9808O0976
15634B49241R1966J36974K00904K70188K52465J52016K682j83682k61683k31286
15624F79785j85307j34714r1209n9765m3135k4130j8779q656r988j3060j3298
15613G7744r490j0476n035n501o898n684m058l834l507m452j141J925l201J143
15599A7535m756j532J225l466l035m877L890N921L188M8L6K616K11j427K252l556
15583A4273J327L778j617K829J0788L36m853M514M034M805j37L293J619N035P860
15568E7884R713R882J2030J2258J9063K4614L0491L8461O5236J00731J44805K08695
15556G33863K02024J26450R872j37415k08781j82455j38297j06368p3013m9353
$$ plain form
15648 45633 50793 54217 54183 56229 61638 64999 71902 74199 87254 101354 122182 148457 188265 249241
15634 249241 341207 478181 679085 949273 1201738 1353754 1356436 1172754 911071 679785
15624 679785 494478 359764 268555 208790 165655 141525 122746 114090 104102 91042 77744
15613 77744 68254 57778 52743 47242 40344 34660 30602 26768 23261 18809 17668 19593 16392 17535
15599 17535 12779 11247 12472 9006 5971 1094 4984 10905 14093 14141 14177 16793 17004 15577 17829 14273
15583 14273 15600 19378 17761 20590 31378 31714 26861 31375 35409 40214 40077 43370 44989 50024 57884
15568 57884 67597 77479 89509 101767 120830 145444 175935 214396 279632 380363 525168 733863
15556 733863 935887 1062337 1072209 934794 726013 543558 405261 298893 225880 176527
15546A76527l4564k1119j6018j0376q285j1121q569m207j820k661j775j836K404
15533E6580l839K146j975P055R051r15O116J0784J1093K0565L0806N2905P6658
15520B77030J11804J59639K10775J80444J05368k1401j59226k08803j72799j31288
15510C51543r7751o8687m7350k8774k0741r321j1355p518r305j2968p709r610
15498B0454r247j230L060O887N70k488l385k308o43q01K70m00o4k510K197L410
15482A3772O81J77P82J139K972k543m177n599J758J493j18P48j937j751K930M93
15466A0820k39N286Q868k054m131K711M614O172R76n6R56J320J1464J0260J1493
15451F8460N415J1691K2501L7270N9701R1088J33043J71763J46725Q5043p809
$$ plain form
15546 176527 141963 120844 104826 94450 86165 75044 66475 62268 60448 57787 56012 54176 56580
15533 56580 52741 54887 52912 59967 69018 68103 74219 85003 96096 116661 147467 200372 277030
15520 277030 388834 548473 759248 939692 1045060 1023659 864433 655630 482831 351543
15510 351543 253792 185105 137755 108981 88240 78919 67564 60046 50741 37773 30064 20454
15498 20454 11207 9977 13037 19924 20494 18006 14621 12313 11670 10869 11139 10739 10675 8165 10362 13772
15482 13772 14453 14630 15412 16551 19523 16980 12803 7204 8962 10455 10337 11085 9148 7397 10327 10820
15466 10820 10581 15867 24735 22681 18550 21261 25875 32047 33023 32967 33923 35243 46707 56967 68460
15451 68460 73875 85566 108067 145337 205038 296126 429169 600932 747657 832700 824891
15440H24891j26830j70381j41471j09824q2407n2276l7944k1923j5480j2638r859
15429D3858n175j0613n724q64k856j386L55n843l711P60L022M465k057q266r23
15414E042j249j721j821j387k360Q113P21j990q57j087j437P37K939N186m075
15399D754p268Q20K380l736j003k309r69J057R68Q88K206o3j134m996J889P095
15383E79K390j817q30J135J515k064k970l424j276K440J871N931M555n35n800
15368A700m63K462J33j991K232J21L619J013k929n086K271M991M066m075j974
15353F090K132K258J785L897L792J052N364O214J0558M941J037K365m952p146
15339C9387j374p67k380k499j173n547l031n446o365m713j295R94J431l229m712
$$ plain form
15440 824891 698061 527680 386209 276385 193978 141702 103758 81835 66355 53717 43858
15429 43858 38683 28070 22346 21482 18626 17240 17595 11752 8041 8801 11823 16288 14231 5965 5042
15414 5042 3793 2072 251 -1136 -3496 4617 5338 3348 2491 1404 -33 704 3643 8829 4754
15399 4754 -2514 -1694 686 -3050 -4053 -6362 -7331 -6274 -5306 -4418 -2212 -2275 -3409 -8405 -6516 579
15383 579 2969 1152 322 1457 2972 908 -2062 -5486 -6762 -4322 -2451 3480 8035 7500 1700
15368 1700 1237 3699 3832 1841 4073 4194 7813 8826 5897 811 3082 8073 12139 8064 6090
15353 6090 8222 10480 12265 16162 19954 21006 26370 32584 43142 48083 49120 51485 46533 39387
15339 39387 38013 37246 34866 32367 31194 25647 22616 17170 10805 6092 4797 5791 7222 3993 -719
15324g19j553J967Q933m5l344j131J171j194j722N47M63j238J337j643m334r15
15308c420L261P40j859R01j555K597K286r93K083j658j977m380r61n05Q223k709
15292G4m780j222Q139L854m460l156n543j771r82J417n8l939J334M168j737k446
15276a1108K321J857J830J168k76m659R08r39q95k480j357j500J071L263J642
15261i154k242L72O350L5m052R78N56K807j108k418J683M127j232j810K935J316
15245h57k64k101l502k869K323M62l461j823k067k802K450L510k706l10K413r95
15229a2599o39j098MO85N033J238K976j066j39j045l679j327m281M469O743N04
15213d221p09p4K731j939l317n212R40K563M126O92j416l390L764K472Q67J354
$$ plain form
15324 -719 -2272 -305 8628 8583 5239 4108 5279 4085 2363 2910 3373 2135 3472 1829 -2505 -3420
15308 -3420 -159 581 -1278 -377 -1932 665 2951 1958 4041 2383 406 -3974 -4935 -5440 2783 74
15292 74 -4706 -5928 2211 6065 1605 -1551 -7094 -8865 -9847 -8430 -8488 -12427 -11093 -6925 -8662 -11108
15276 -11108 -8787 -6930 -5100 -3932 -4208 -8867 -7959 -8898 -9793 -12273 -13630 -15130 -14059 -10796 -9154
15261 -9154 -11396 -11024 -4674 -4639 -8691 -7713 -7157 -4350 -5458 -7876 -6193 -2066 -3298 -5108 -2173 -857
15245 -857 -1121 -3222 -6724 -9593 -7270 -6808 -10269 -12092 -14159 -16961 -14511 -11001 -13707 -14017 -11604 -12599
15229 -12599 -13238 -14336 -14332 -13647 -8614 -7376 -4400 -5466 -5605 -6650 -10329 -11656 -15937 -11468 -4725 -4221
15213 -4221 -4930 -5004 -2273 -4212 -7529 -12741 -11801 -9238 -5112 -4420 -5836 -9226 -5462 -2990 -2123 -769
15197g69Q9M817m22j074O53j057k296n173j099M875K64k706n880K804K395q34
15181e413m819K169N523r06k165L267L34l89J592k723K77J803O29j73l046l045
15165g085k699N50k049J532M461R17Q32K787l039j221K948J505k001K6o13l564
15149f713p32K330j232j453o46m83l105n62J061P64K681j541o18L583O6k671P41
15132h530J841K709k942r72K012J810j828j67k176j506l516q53M712M661l856
15117h601P20M105m303j122K741J742Q17J95j294j703K014R28m234o67N33K665
15101e464l20M326k037l537n926K84M403j189J301O466r87q738j205O518J406
15086d699k703L4K482m25j049k077j203n178L559N443k502J553P177J155l012
$$ plain form
15197 -769 -680 4137 3715 2641 3294 2237 -59 -5232 -6331 -1456 -1192 -3898 -9778 -6974 -4579 -5413
15181 -5413 -10232 -8063 -2540 -3446 -5611 -2344 -2010 -2399 -807 -3530 -3253 -1450 -821 -994 -4040 -7085
15165 -7085 -9784 -9234 -11283 -9751 -5290 -4373 -3541 -754 -3793 -5014 -2066 -561 -2562 -2536 -3149 -6713
15149 -6713 -7445 -5115 -6347 -7800 -8446 -8929 -12034 -12596 -11535 -10771 -8090 -9631 -10249 -6666 -6600 -9271 -8530
15132 -8530 -6689 -3980 -6922 -7894 -5882 -4072 -5900 -6067 -8243 -9749 -13265 -14118 -9406 -4745 -8601
15117 -8601 -7881 -3776 -8079 -9201 -6460 -4718 -3901 -3706 -5000 -6703 -4689 -3761 -7995 -8662 -8129 -5464
15101 -5464 -5784 -1458 -3495 -7032 -12958 -12674 -8271 -9460 -8159 -1693 -2680 -11418 -12623 -6105 -4699
15086 -4699 -7402 -7368 -4886 -5311 -6360 -8437 -9640 -14818 -11259 -5816 -8318 -6765 412 1567 -1445
15071a445k306k360m556k725K181N89m978k074K321N295O548J349n944K007k39
15056f337j872Q50M592M726j628n628l268k274Q93O321L521j305l122k966j322
15041h819l303L952M138n209q62J567j339p63K522K050n96l160J027L036j08k910
15025h777K021j961k545J802r21o861J7L081M726L232k277K350K108J424j24q81
15009c586n562k231L176K92k32R55L867j54R82J719n6J502j850j265k214m00J58
14992d899K659j13K245J252j918R08p98l914J519k596k479j058M129O95j87Q57
14976c698J150J437k328p94J020p022m202j075O54J692K285j328J716N331R37
14961d225P93M032k319m979l461M030k63j853J957q53j461m493L028L039j130
$$ plain form
15071 -1445 -3751 -6111 -10667 -13392 -11211 -10622 -15600 -17674 -15353 -10058 -3510 -2161 -8105 -6098 -6337
15056 -6337 -8209 -7359 -2767 1959 331 -5297 -8565 -10839 -9946 -3625 -104 -1409 -4531 -7497 -8819
15041 -8819 -12122 -8170 -4032 -9241 -10103 -8536 -9875 -10638 -8116 -6066 -6662 -9822 -8795 -5759 -5867 -8777
15025 -8777 -6756 -8717 -11262 -9460 -10381 -17242 -17225 -14144 -9418 -6186 -8463 -6113 -4005 -2581 -2705 -3586
15009 -3586 -9148 -11379 -8203 -7911 -8143 -7188 -3321 -3475 -2493 -774 -830 672 -1178 -2443 -4657 -5057 -4899
14992 -4899 -2240 -2353 -108 1144 -774 134 -664 -4578 -3059 -5655 -8134 -9192 -5063 -4368 -4555 -3698
14976 -3698 -2548 -1111 -3439 -4233 -3213 -10235 -14437 -15512 -14858 -13166 -10881 -12209 -10493 -5162 -4225
14961 -4225 -3432 600 -1719 -6698 -10159 -6129 -6392 -8245 -6288 -7141 -8602 -13095 -10067 -7028 -8158
14946h158n675l795L717m47j549L332N141l01k222n92J127M732k620q321l828
14931a9459N222J516m34k337K92k818j251L298q64M07L611N167R50k304L97j928
14915a0535L502J898j433n29L698J894k652j645o069P95K398j89r5l554j436N085
14899h867J814J687k621j636J467K206J953L166m815m077j095L890N97K891o75
14884d115l455P8J887l04l714j571p92k506j178K057J348K505K543J327k061l771
14868a1722j079L531J160J600J735N000J083m777k213K477M64k40p5N63k601q04
14852e898J056P79J621j236k477K361K728k118L27J452K282l41K664O425K661
14837A2286K260l614R97O578M267K611R112J2269L577J240M486r68l205K339J419
$$ plain form
14946 -8158 -13833 -17628 -13911 -14358 -15907 -12575 -7434 -7735 -9957 -10549 -9422 -4690 -7310 -15631 -19459
14931 -19459 -14237 -12721 -13155 -15492 -15200 -18018 -19269 -15971 -16835 -16428 -12817 -7650 -6700 -9004 -8607 -10535
14915 -10535 -7033 -5135 -6568 -7097 -3399 -1505 -4157 -5802 -11871 -11076 -8678 -8867 -8962 -12516 -13952 -8867
14899 -8867 -7053 -5366 -7987 -9623 -8156 -5950 -3997 -831 -5646 -9723 -10818 -6928 -6331 -3440 -4115
14884 -4115 -7570 -7492 -5605 -5909 -9623 -11194 -11986 -14492 -15670 -13613 -12265 -9760 -7217 -5890 -7951 -11722
14868 -11722 -12801 -9270 -8110 -6510 -4775 225 1308 -3469 -5682 -3205 -2741 -2981 -3056 -2493 -5094 -5898
14852 -5898 -4842 -4063 -2442 -3678 -6155 -3794 -1066 -3184 -2857 -1405 877 536 3200 9625 12286
14837 12286 14546 10932 11929 18507 22774 25385 34497 46766 50343 51583 56069 55101 51896 54235 55654
14822E5654J649K849L486L439J2537J1704J7672K2415L0805L3715J8188J4910
14810B29023O930l711j0018j1858m201L91L110J4929K1447L3480M3433M8684M4102
14797D15741M0137K9861J3765J9901M1105N7818O0503M4206J1896k1827l9939
14786F73167m5334l4200k847J8216K7768K4977p147k7018k5158k2553l7584l5887
14774E06400j9256K040K2757K8029K6296O554j2568k1949l1934m8778o2614o6499
14762C28478n9621n4283l7127l1124j9142q228L661J6601J7548J6993J6054K094
14750A91904j0102k2153k8806k9473k4717j9553j7631j0744p326l606k631n803
14738I359o316l808n69n288J175L151m065l631k814K977J993k640n372K602J319
$$ plain form
14822 55654 57303 60152 63638 67077 79614 91318 108990 131405 162210 195925 214113 229023
14810 229023 235953 232242 222224 210366 206165 206556 209666 224595 246042 279522 322955 371639 415741
14797 415741 455878 485739 499504 519405 560510 618328 678831 723037 734933 713106 673167
14786 673167 627833 593633 590786 609002 636770 661747 654600 627582 602424 579871 542287 506400
14774 506400 487144 489184 511941 539970 566266 572820 560252 538303 506369 457591 394977 328478
14762 328478 268857 214574 177447 146323 127181 118953 122614 139215 156763 173756 189810 191904
14750 191904 181802 159649 130843 101370 76653 57100 39469 28725 21399 17793 15162 9359
14738 9359 3043 -765 -1334 -6622 -5447 -2296 -6361 -9992 -12806 -9829 -7836 -10476 -15848 -13246 -11927
14723a1927j59M157P06l751O31j833K045Q208K744J537R7L913k005r00J915L89
14707E767L044k398l662l517R07L525l21l204m8L364M066M004L840K885m632o456
14691G164o903k719p99N501Q105j87j682l748K833J392j863K198m760l786N426
14676F172P086m794l841q87J757N362Q44m820l66L090K18n001j530q09j812K000
14660B669J812k445k701j889M698K247j438n828l26K254K932k808k833O193l80
14645B157r443M225J807n88l613l84l26l487n131j648L537k109L025l894m187
14630b0059k534J784K776J295K032p62l039K925J095R51J206k38k478o330Q52
14615b0524K371k247N05L130J812K94K164K065m649m476N869M38K038K984m11
$$ plain form
14723 -11927 -12086 -7929 -7223 -10974 -10343 -12176 -10131 -1923 821 2358 2455 6368 4363 3463 5378 5767
14707 5767 8811 6413 2751 -766 141 3666 3345 141 93 3457 7523 11527 15367 18252 13620 7164
14691 7164 261 -2458 -3257 2244 10349 10162 8480 4732 7565 8957 7094 9292 4532 746 6172
14676 6172 13258 8464 4623 3736 5493 10855 11699 6879 6513 9603 9821 4820 3290 2481 669 2669
14660 2669 4481 2036 -665 -2554 2144 4391 2953 -2875 -3201 -947 1985 -823 -3656 2537 2157
14645 2157 -7286 -3061 -1254 -1842 -5455 -5839 -6165 -9652 -14783 -16431 -12894 -15003 -11978 -15872 -20059
14630 -20059 -22593 -20809 -18033 -16738 -14706 -15468 -18507 -15582 -14487 -13536 -12330 -12568 -15046 -21376 -20524
14615 -20524 -18153 -20400 -19895 -16765 -14953 -14659 -12495 -10430 -15079 -19555 -13686 -13248 -11210 -8226 -8637
14600h637J598K381O559K987M426M534J141j443K758N137k152J352J065n389q2
14585A6235j497o75L799O697J0742p48k88O2j14J396L068L403M578m14l288j031
14569D1925j147K396m20L176K189p31j548n21K399k019j153j923K846M043M579
14554E4091L333N200K259M57N948Q515Q84L754M741Q42L555k696k791j684J13
14539H6521L939O400L491k605j218P83J127k33M638K401J719M84J559J160L258
14524A13424J265n181o233K998j653k256o18m993q882L66j101j948n498k548l273
14509G3869k112K953N903L032K376q29K404k02l064k833o005o96k694o175j436
14494F4491l00q67O797P100Q651K89j887L024L107P225O222P564J1559M014P77
$$ plain form
14600 -8637 -7039 -4658 1901 4888 9314 13848 14989 13546 16304 21441 19289 20641 21706 16317 16235
14585 16235 14738 14063 17862 24559 35301 34553 34265 34327 34213 35609 38677 42080 46658 46244 42956 41925
14569 41925 40778 43174 42754 45930 48119 47388 45840 45319 47718 45699 44546 42623 45469 49512 54091
14554 54091 57424 62624 64883 65340 71288 79803 80687 84441 89182 90024 93579 90883 88092 86408 86521
14539 86521 90460 96860 100351 97746 96528 97311 98438 98205 102843 105244 106963 107447 109006 110166 113424
14524 113424 114689 109508 103275 106273 104620 102364 101746 96753 87871 88237 87136 85188 79690 77142 73869
14509 73869 71757 74710 80613 83645 86021 85192 87596 87394 84330 81497 75492 74796 72102 65927 64491
14494 64491 64191 63324 70121 77221 85872 86161 84274 87298 90405 97630 103852 111416 122975 126989 127766
14479A27766J603l163O503M116K632J917K172J674q171j1729j5383j5954o917
14466H7066q53M472J0953J3782J1913Q268M000J986k606j6223j0679j5725r356
14453H6998L921Q82o414j7474l1489l0904j0774J3763K2467J6255P906K200o436
14440E0901k0375j4167k036M837K532J3810K3749K6337K3710J0326K725j836K043
14427A22556Q101J5337J0035K116J508O106L981O754J5364J9450J1622P316L731
14414B33977L107P70p919m676q746K546M103K050Q226J8049R120O506Q492j049
14400B74556q633j703n894k780J965P192N556J2111J0817J4810J7989J3084P357
14387C46427J0617O230J213J994o170m289L788M768J0681J8656L0827L3025L6536
$$ plain form
14479 127766 129369 126206 132709 136825 139457 141374 143546 145220 137049 125320 109937 93983 87066
14466 87066 86213 90685 101638 115420 127333 135601 139601 141587 138981 122758 112079 96354 86998
14453 86998 90919 91801 85387 67913 36424 5520 -5254 8509 30976 47231 55137 57337 50901
14440 50901 30526 16359 14323 19160 21692 35502 59251 85588 109298 119624 122349 120513 122556
14427 122556 130657 145994 156029 158145 159653 165759 169740 176494 191858 211308 222930 230246 233977
14414 233977 237084 237854 229935 225259 216513 219059 223162 225212 233438 251487 260607 267113 275605 274556
14400 274556 265923 264220 258326 255546 257511 264703 270259 282370 293187 307997 325986 339070 346427
14387 346427 357044 363274 364487 366481 360311 356022 359810 364578 375259 393915 424742 457767 494303
14374D94303M8908N7084O8895Q5867R2192P9471M9095J2261j5291l1029l2896
14363I08860k4544j1692n304o55j977M044J1043K1642K8764L0819K4843K2513
14351A008356L0806N0438O7038Q8946J18479J32607J48554J61687J68920J66899
14341B142730J59436J38956J32801J33599J50112J70274J93763K20945K47661
14332C690277K85558L30276L80842M33016M87818N57469O47090P60238R26868
14323H499452J162193J499308K003347K690935L570984M243658M200064L744122
14315C1614063K704184J316446L13971m37986j253843j348130l31973J296033
14307C3872765L006107M459162N648730O796466Q100401Q509721P136105M959900
$$ plain form
14374 494303 543211 600295 669190 755057 847249 926720 975815 988076 972785 941756 908860
14363 908860 884316 872624 867320 866665 864688 868732 879775 901417 930181 961000 985843 1008356
14351 1008356 1039162 1089600 1156638 1245584 1364063 1496670 1645224 1806911 1975831 2142730
14341 2142730 2302166 2441122 2573923 2707522 2857634 3027908 3221671 3442616 3690277
14332 3690277 3975835 4306111 4686953 5119969 5607787 6165256 6812346 7572584 8499452
14323 8499452 9661645 11160953 13164300 15855235 19426219 23669877 27869941 31614063
14315 31614063 34318247 35634693 35948664 35510678 34256835 32908705 32576732 33872765
14307 33872765 36878872 41338034 46986764 53783230 61883631 70393352 77529457 82489357
14299H2489357J939008J172166M873116J0249522J3379944J2390872O782998j459731
14291A31817252q768367j1457425q799490k621417M018388P018878O928351L834873
14283A21971043j932601n801532p383646r231227r676898p094050k484857K565371
14275H0931603O633693Q004277O764939M078640k70545m392622p192873j0853230
14267H3703882j3226015j2629198j0821316q686911o302631m120668k239096n67055
14259B5110992J067679K571441L263030K996708J360392j314350l593107m993180
14251B6469605n181225m364646l355246k469156j744804j240024r22916p34562
14243F457026o29264n47783m79488m15973l66975l14359k49252j99624j49754
$$ plain form
14299 82489357 84428365 85600531 90473647 100723169 114103113 126493985 133276983 131817252
14291 131817252 123048885 111591460 102791970 100170553 104188941 111207819 118136170 121971043
14283 121971043 120038442 114236910 106853264 97622037 87945139 80851089 78366232 80931603
14275 80931603 87565296 95569573 102334512 106413152 106142607 101749985 94557112 83703882
14267 83703882 70477867 57848669 47027353 38340442 32037811 27917143 25678047 25110992
14259 25110992 26178671 28750112 32013142 35009850 36370242 35055892 31462785 26469605
14251 26469605 21288380 16923734 13568488 11099332 9354528 8114504 7191588 6457026
14243 6457026 5827762 5279979 4800491 4384518 4017543 3703184 3453932 3254308 3104554
14234C104554j15984r3471p7432p0922n7454n9932p2772p8725r1734q9702p7127
14223B219299o1404m5898k4860q182j391k1890n8028r7538j20576j22409j15770
14212A541353r4885p3038n9179n0321m3536l9327l9932l1291k8068l4197l2978
14201A014601l0969l1279k0773j1956j045J3719J5298J0224n56j3035k6483l3733
14189H84013l3600j7315r656j1111p057q553k4737k7884k5326l1424k8730k0300
14177F38320k0731j6668j3172o779J636j921p811n246q489q899M63L847J223n790
14163E49983j1428j7745j4969o502n353r534r314r093j2406k11K134K086j575
14150D56073L897J3788J1877J0618M335j396n089K735J4430P282k019j5380j9955
$$ plain form
14234 3104554 2988570 2895099 2817667 2746745 2689291 2629359 2556587 2477862 2386128 2296426 2219299
14223 2219299 2157895 2111997 2087137 2078955 2077564 2055674 1997646 1900108 1779532 1657123 1541353
14212 1541353 1446468 1373430 1314251 1263930 1220394 1181067 1141135 1109844 1081776 1047579 1014601
14201 1014601 983632 952353 931580 919624 918579 932298 947596 957820 957264 944229 917746 884013
14189 884013 850413 833098 823442 812331 805274 796721 771984 744100 718774 687350 658620 638320
14177 638320 617589 600921 587749 580970 582606 580685 572874 567628 559139 550240 550703 554550 555773 549983
14163 549983 538555 520810 505841 499339 493986 484452 475138 466045 453639 453428 455562 457648 456073
14150 456073 459970 473758 485635 496253 500588 499192 494103 496838 511268 518550 516531 501151 481196
14137D81196k7167k3241j1367p238j205M321K994J121l888n736k097k241p429
14124C98023p122l565K491L33n655j9228j9889k1978k0582j6395j6432j4801p293
14111B47907k412k05M331l718j4833j2819j1624j543K979N122j62o707j2667q509
14097A85140p285k142l528O39K235k020j422M027l196p206j0155p356q802l058
14083A35871j82M513N915N590O303K45l289l394n585m442j480j090k634k907j490
14068A31944n107p284k044l565j249m194n425L165J130N84p05l676l137K270O63
14053A03370j750L607J075m036l726K001L626j101j658R98m101m232qR98Q48P412
14037A03323M737O951J123l228l32l975m823K007K216j028K892L674p47j315M4
$$ plain form
14137 481196 454029 430788 419421 412183 410978 415299 418293 419414 415526 409790 407693 405452 398023
14124 398023 390901 387336 389827 390160 384505 365277 345388 323410 302828 286433 270001 255200 247907
14111 247907 245495 245290 249621 245903 231070 218251 206627 205084 208063 213185 213023 206316 193649 185140
14097 185140 177855 175713 172185 172824 175059 173039 171617 175644 172448 165242 155087 147731 138929 135871
14083 135871 135689 140202 146117 151707 158010 158255 154966 151572 145987 141545 140065 138975 136341 133434 131944
14068 131944 126837 119553 117509 113944 112695 108501 103076 106241 107371 107955 107250 103574 100437 102707 103370
14053 103370 101620 105227 106302 102266 98540 100541 104167 103066 101408 102406 98305 94073 94065 95063 95911 103323
14037 103323 108060 115011 116134 112906 112574 108599 103776 105783 107999 106971 109863 113537 112790 111475 111519
14022A11519M044J57k001M167L160K948k83R27r49o735n415J358K136j798k201
14007A11034L89m354p361K035N786k18p880k087k69k767m834m52n212q40M641
13992H7611J29j901K162J588K238k397J90o160k880N835P503L993M84k197k160
13977I4038k585K590L782K277K061m6P06p30j678n631p201k317L84N685Q439M583
13961A04357n39J321K242M256k50k332J316M81m839k697J804J685n721l149J558
13946I9493N614k321q18l05mL350K663k978k501n51J916L516j521p637m896j264
13930I1756Q63R07O70o43l96N37j810J338N488n156l587L139K466R81m947l816
13914H7790j119k771j643K292N312L873P6l553n330k405j513J285l302l816m635
$$ plain form
14022 111519 115563 115720 113719 117886 121046 123994 123711 124638 123689 116954 111539 112897 115033 113235 111034
14007 111034 111423 107069 99708 101743 107529 107311 99431 97344 97075 94308 89474 89022 83810 82970 87611
13992 87611 87740 85839 88001 89589 91827 89430 89620 83460 80580 86415 93918 97911 98395 96198 94038
13977 94038 91453 94043 97825 100102 102163 102117 102823 102093 100415 94784 87583 85266 85650 91335 99774 104357
13961 104357 103818 105139 107381 111637 111387 109055 110371 110852 106013 103316 105120 106805 101084 97935 99493
13946 99493 105107 102786 101968 101663 101659 105009 107672 104694 102193 101642 103558 107074 105553 97916 93020 91756
13930 91756 92619 93526 94196 93553 93157 93694 91884 93222 98710 93554 89967 93106 95572 96553 91606 87790
13914 87790 86671 83900 82257 84549 89861 93734 93810 90257 84927 82522 81009 82294 78992 75176 70541
13899G0541l848P51N662L636L925j550J81j848L548J472R7L395Q8p077m678J60
13883G4455N94l624k558k453M640J759p548j456Q996O865K870j460m437J21L019
13868G9783k644k042J8R29l15J911O489K885j169k390k184Jk795M437J208J555
13852H5677L242M667l428k969j408o16R04m13N88N470N858L330j541j453o4k849
13836I4995K684K342J805K110M407n97m417n011L674j602L304M896M772K87l010
13821A10639O378M700P057J0415J0183J8228K0969K2089J8140J1979J0559R419
13809B60755L990J83l081J9J234J1344J8407J9398K4790L4172M7632M7457L8023
13796E04323J6262K457J1151M4261P2323P9786O1035K0230l3238o2914o0486k3819
$$ plain form
13899 70541 66693 67444 73106 76742 80667 79117 79298 77450 80998 82470 82567 85962 86050 78973 74295 74455
13883 74455 75049 71425 68867 66414 71054 72813 65265 63809 72805 79670 82540 81080 76643 76764 79783
13868 79783 77139 75097 75115 76044 75729 77640 84129 87014 85845 83455 81271 81272 78477 82914 84122 85677
13852 85677 88919 93586 90158 87189 85781 85165 86069 85656 86244 91714 97572 100902 99361 97908 97844 94995
13836 94995 97679 100021 101826 103936 108343 107746 103329 98318 101992 100390 103694 108590 113362 113649 110639
13821 110639 117017 121717 128774 139189 149372 167600 188569 210658 228798 240777 251336 260755
13809 260755 264745 264928 261847 261866 263100 274444 292851 312249 337039 371211 418843 466300 504323
13796 504323 520585 523042 534193 578454 650777 730563 791598 811828 778590 715676 655190 631371
13784F31371R769L5536M6020L9330n07l8636m9346n7634o8897n2669k7235n6K7733
13771D94779N4780N5562M3228K3818j0793l7426o2215p7563q0408o5744n3540
13760B84478m2210k1470j5374p882J243Q295J4139K2336J9799l210j8766k7066
13748B14312k9040k3184j8698j7832r363p144q894j1006q541l698k972k430k572
13735F8938K624M591K146O83M35l844k615o73O056J584m59l499k237l139p85K515
13719G2321k717J740j246k503K028K45O075l73p596m69n515k933K151l45J257
13704F2120p86M397J832N11j938M50n830q476O402K826K365k760l199o335K098
13689E3677N37P72k71J464j910K006L206J755p70K714m878k781j892P0l809k191
$$ plain form
13784 631371 641140 676676 722696 762026 761519 722883 673537 615903 547006 494337 467102 467046 494779
13771 494779 549559 605121 648349 672167 661374 623948 561733 484170 403762 338018 284478
13760 284478 242268 220798 205424 197542 198785 207080 221219 243555 263354 260144 241378 214312
13748 214312 185272 162088 143390 125558 116195 109051 100157 89151 80610 76912 73940 71510 68938
13735 68938 71562 76153 78299 78982 79417 75573 72958 72285 78341 79925 79466 75967 73730 70591 69806 72321
13719 72321 69604 71344 70098 67595 69623 69868 75943 75570 67974 67505 61990 59057 61208 60863 62120
13704 62120 61334 65731 67563 68074 66136 66586 60756 52280 58682 61508 63873 61113 57914 51579 53677
13689 53677 54214 54986 54715 56179 54269 56275 59481 61236 60466 63180 58302 55521 53629 53699 49890 47699
13673D7699n720J650Q288R24J836K462J744n165l229J308L340l877K414L221K291
13658E9186k53k52o535m596J219Q094J742J023k528P53L196K279p18l539m055
13643E5016J115m744J486J77K121K998l261j093m762m002K801N603j430J162l1
13628E3156k215P23N987M232k024q072k646m167l77M438N093l178j499J33J677
13613E1261J283J569k987j686J46j536J739P56j180m223n504L003K900K109Q29
13598D8479j456K182K162J899j518L014O366K596j644Q6l431j775j324l863P03
13583E2476J241j35J683O9n507q194k653L06J734L258j272K506N674K503k333
13568E1356l564r63L982L194j885jm817K248j376l513K149k471M082L986m598
$$ plain form
13673 47699 41979 43629 51917 52841 54677 57139 58883 53718 50489 51797 55137 51260 53674 56895 59186
13658 59186 58933 58681 52146 47550 48769 56863 58605 59628 57100 57853 61049 63328 62610 59071 55016
13643 55016 56131 51387 52873 53050 55171 58169 54908 53815 49053 45051 47852 53455 52025 53187 53156
13628 53156 50941 51664 57651 61883 59859 51787 49141 44974 44597 49035 54128 50950 49451 49584 51261
13613 51261 52544 54113 51126 49440 49586 48050 49789 50545 49365 45142 39638 42641 45541 47650 48479
13598 48479 47023 49205 51367 53266 51748 54762 61128 63724 62080 62166 58735 56960 55636 51773 52476
13583 52476 53717 53582 55265 55334 49827 41633 38980 39286 41020 44278 43006 45512 51186 53689 51356
13568 51356 47792 46829 50811 54005 52120 52119 47302 49550 48174 44661 46810 44339 48421 52407 47809
13553D7809j217l869n930R57J885K215J905L522J155n856j064J631O81J033k149
13538D2708l953q19J573M963q70K484j788l142N230N563K817K657k453K501j9
13523E7452j824j211k450j263j030j889M952J765j944j811j795J998N75r93j274
13508D9258L247L753o91p527k454J309J732K664m792l589m679K95M458K357N14
13493D5855o51K8m309m24Q94O886L87m75l541l453J540L024j653K321K050k039
13477D6440P254J048m418Rl1L60k789L103l9o704l507N261L229k009p5l289l653
13460D0190k163Q383J464k323j517j533L548K177l176k063L549k236k006N49K329
13445D5172K775k174n118M86L097m342l062k591J793N351k461k429L565M450l715
$$ plain form
13553 47809 46592 42723 36793 37750 39635 41850 43755 47277 48432 42576 41512 43143 43824 44857 42708
13538 42708 38755 37936 39509 44472 43602 46086 44298 41156 46386 51949 54766 57423 54970 57471 57452
13523 57452 55628 54417 51967 50704 49674 47785 52737 54502 52558 50747 48952 50950 51525 50532 49258
13508 49258 52505 56258 55567 48040 45586 46895 48627 51291 46499 42910 38231 38526 42984 45341 45855
13493 45855 45204 45232 40923 40499 41393 48279 48666 48191 44650 41197 42737 45761 44108 46429 48479 46440
13477 46440 53694 54742 50324 50333 50302 50662 47873 50976 50937 44233 40726 45987 49216 47207 47132 43843 40190
13460 40190 38027 46410 47874 45551 44034 42501 46049 48226 45050 42987 46536 44300 42294 42843 45172
13445 45172 47947 45773 40655 41141 44238 39896 36834 34243 36036 41387 38926 36497 40062 44512 40797
13430D0797p067j681M221L071j065n874n961K379O049O544J312j319r51M345o784
13415C8016k304J612N03J899P477o51n140l939j883j986R05j38K193K393j482
13400C7475M20j946M72N188J457J603K102Q32k041j334j533J549k398J704k857
13385D0693j172J900m832l118P5o56N545Q194p96m089m773l077M158M493j05J882
13369D4322l915j691J003j105M456j686o698L62J523K1L010m25Q79j35r97J576
13353D0500L320q8m561j402M41p47O29K11j634J700J495k82J04P72M085K173o89
13336D6027j420m838l190l73j452j133N141O153j556l634K41k003j738M158l578
13321C6805k00J735O194J546o69J004m085n906J251q78j47p74K950K752M61j792
$$ plain form
13430 40797 33730 32049 36270 39341 38276 32402 26441 28820 34869 41413 42725 41406 40455 44800 38016
13415 38016 35712 37324 37827 39726 47203 46552 41412 37473 35590 33604 34509 34371 36564 38957 37475
13400 37475 37895 35949 36421 41609 43066 44669 46771 47603 45562 44228 42695 44244 41846 43550 40693
13385 40693 39521 41421 36589 33471 33546 32890 38435 46629 45833 41744 36971 33894 38052 42545 42440 44322
13369 44322 40407 38716 39719 38614 43070 41384 34686 35048 36571 36592 39602 39177 40056 39921 38924 40500
13353 40500 43820 43732 39171 37769 38210 37463 38092 38303 36669 38369 39864 39582 39686 40458 44543 46716 46027
13336 46027 44607 39769 36579 36206 34754 33621 38762 44915 43359 39725 39966 37963 36225 40383 36805
13321 36805 36605 38340 44534 46080 45411 46415 42330 36424 37675 36797 36650 35876 38826 41578 42039 40247
13305D0247l803J434j259j151l20L196O091k646L540j829k357o27k600r84k01
13290C6731M522q29O485L765l728k612J906Q4O59m25n6O983M430l470o686n096
13274D2663J273l645j706M863N091j867L670J827l377k517r85r91n17m82J582
13259D4882k418l566L735l056l949Q29j542L961M350j43j631P94N342J838j271
13244D8155j071j330j204R29J339J436l295N1J074j184j715j256p34m057K010
13229C9148O005m20K766r12l644k824M77k140N89j927L482L991j39l09Q22K49
13213D5214k32q143m080J442J072N040J004l265J128n29P69k058j224L97r0Q42
13197C7287M024p97k277J427K381j722j977K672m505j873L059N62o152j700L021
$$ plain form
13305 40247 36444 37878 36619 35468 35148 38344 44435 41789 45329 43500 41143 40516 37916 36932 36731
13290 36731 41253 40424 46909 50674 46946 44334 46240 46324 46983 46558 46502 53485 57915 54445 47759 42663
13274 42663 43936 40291 38585 43448 48539 46672 50342 52169 48792 46275 45290 44299 43782 43300 44882
13259 44882 42464 38898 42633 39577 35628 36457 34915 38876 43226 43083 41452 42246 47588 49426 48155
13244 48155 47084 45754 44550 45479 46818 48254 44959 45010 46084 44900 43185 41929 41195 37138 39148
13229 39148 45153 44733 47499 46587 42943 40119 40596 38456 39045 37118 40600 44591 44452 44143 44965 45214
13213 45214 44982 36839 32759 34201 35273 40313 41317 38052 39180 38651 39420 37362 36138 36535 36445 37287
13197 37287 41311 40514 38237 39664 42045 40323 38346 41018 36513 34640 37699 38261 32109 30409 33430
13182C3430P466N648M377K932k059l62P531M155n915n274l710l32k425m189l291
13167C7982j584l629n14J421O418J568k512j252j876q05L90R03j522N730K155
13152D2873m728m68L515J173l478j131K030M240O27M825m11L848l35j101J289
13137E2768M473O432Q032J465K635K872m181m452l425p090p495p426o680J138
13123C9066J357q36J003L463l73o987J489N226l739K21j259L82M169L130r77j70
13107D5165J201o58L10j05j999l895J786J508n15K89k4q58L349O889P614K324
13091F2381K054P88n487n222m878m627p19j987j640j883k332K96K958j124l083
13076C5495j190K847K794k29m48O227M477k546j892P9R66l277j409k688K91j117
$$ plain form
13182 33430 40896 46544 50921 53853 51794 51432 58963 63118 57203 51929 48219 47887 45462 41273 37982
13167 37982 36398 32769 32255 33676 40094 41662 39150 37898 36022 35217 35607 36510 34988 40718 42873
13152 42873 38145 37677 41192 42365 38887 37756 39786 44026 44653 49478 49067 52915 52580 51479 52768
13137 52768 57241 63673 71705 73170 75805 78677 74496 70044 66619 59529 52034 44608 37928 39066
13123 39066 40423 39587 40590 44053 43680 36693 38182 43408 39669 39890 38631 39013 43182 46312 45335 45165
13107 45165 46366 45708 46018 45913 43914 40019 41805 43313 42798 43087 43063 42205 45554 52443 60057 62381
13091 62381 64435 65223 59736 54514 49636 45009 44290 42303 40663 38780 36448 36744 39702 38578 35495
13076 35495 34305 37152 39946 39717 39269 45496 49973 47427 45535 45614 46580 43303 41894 39206 39497 38380
13060C8380k864m043K754N668J033K909M677j073k765n022k616J00m225o85K584
13045C4812M77l785K087K214j192p19l025M88N979N967M075L681J99k191l821
13030D5246k888l615K610L203j026n581K255l667k414J365R99k276r0K690m6L636
13014D0401L848j680K25Q09J916Q52K332l225o178m590K94j446J843N423N949
12999D6773o72k580O01J27N242J452j289L53l116k669k62n434m80K336L551k186
12983D1747m105j255K525J051J65J441M412k121m721L763M93n806o913L692L871
12968C8239L533L927m605l147L74R7K612R52l299k918j864k677q42L151N901j070
12952C8364j705J053l19k449J542K022j846J159L35ML123K559L122k194L253l71
$$ plain form
13060 38380 35516 31473 34227 39895 40928 43837 48514 47441 44676 39654 37038 37138 32913 32228 34812
13045 34812 35289 31504 33591 35805 34613 33894 30869 31357 37336 43303 47378 51059 51258 49067 45246
13030 45246 42358 38743 41353 44556 43530 37949 40204 36537 34123 35488 36487 34211 34121 36811 36765 40401
13014 40401 44249 42569 42794 43603 45519 46371 48703 45478 39300 34710 35004 33558 35401 40824 46773
12999 46773 46101 43521 44122 44249 49491 50943 49654 50007 46891 44222 43960 38526 38046 40382 43933 41747
12983 41747 37642 36387 38912 39963 40128 41569 45981 43860 39139 42902 43395 37589 30676 34368 38239
12968 38239 41772 45699 41094 37947 38321 38418 41030 41982 38683 35765 33901 31224 30382 33533 39434 38364
12952 38364 36659 37712 37393 34944 36486 38508 36662 37821 38156 38160 41283 43842 46964 44770 48023 47652
12936D7652j544j762j741l6k152j256Q45M234L936n323j412k952j918J944N351
12921D3866L368L004K91j966O26l797k261R11K557j124j462J503m131m245k441
12906C4699o78J599J629J371M603j745O86K235K095K194j591j180m134k669K543
12891D1657M579n376k355J857r84J329L512L856K170L532n416o933j139K967L021
12876D6277L908J312k719J191p31o469P6k941j525M975R18K537J518P47j36J432
12860E0370l207l433r59K362k706p904L661P140O26j267j015K46M952K11m978
12845D4099k81m283K293K814k546J780L435o35l296k322O90J556K701O754M009
12830E6768o25l886k225j722j49L34k5k953K030j211m7l056k169K806L581J068
$$ plain form
12936 47652 46108 44346 42605 42569 40417 39161 40006 44240 48176 42853 41441 38489 36571 38515 43866
12921 43866 47234 50238 50529 48563 49189 45392 43131 44042 46599 45475 44013 45516 41385 37140 34699
12906 34699 34021 35620 37249 38620 43223 41478 42164 44399 46494 48688 47097 45917 41783 39114 41657
12891 41657 46236 40860 38505 40362 39378 40707 44219 48075 50245 53777 48361 41428 40289 43256 46277
12876 46277 50185 51497 48778 49969 49238 42769 42845 39904 38379 43354 44272 46809 48327 49074 48938 50370
12860 50370 47163 43730 42771 45133 42427 34523 38184 45324 45950 44683 43668 43914 48866 49077 44099
12845 44099 43818 39535 41828 44642 42096 43876 47311 46676 43380 41058 41748 43304 46005 52759 56768
12830 56768 56143 52257 50032 48310 48161 48495 48470 45517 47547 46336 46289 43233 41064 43870 47451 48519
12814D8519m563J651K517J834k334M801K446K635m86L31o553q186n124O470M799
12799D8757M24J8R62j771P573j551K558J436K791m09p18n64J79n40K717j870n006
12782E4986R4N10L256M21j2q19j00n131l635m666N01K56j601Q98k78J696p86m063
12764D1527m519j850n08N905J184K588K853K970J683K36M151N131K16j745k712
12749E7110l607k178L0J346k085k285j439j020L599N763N48l502O87j876l743
12734D7348l543M979J523r92k994j052j961N718N591M615k91q773m127M417J252
12719E1710m716P56L81m9q96k724J919l048K65K700k632J104Q262M031j756l938
12703E1369J879l396j09L81M91K370J544k76L341L657M27M54r180n479J774M925
$$ plain form
12814 48519 43956 45607 48124 49958 47624 52425 54871 57506 57020 57351 50798 42612 37488 43958 48757
12799 48757 49181 49199 50161 48390 55963 54412 56970 58406 61197 60788 60070 59506 59685 59145 61862 59992 54986
12782 54986 55080 55590 58846 59267 59255 58436 58336 53205 49570 44904 45405 45661 44060 44958 44680 46376 45590 41527
12764 41527 37008 35158 34650 40555 41739 44327 47180 50150 51833 52069 56220 61351 61567 59822 57110
12749 57110 53503 51325 51355 52701 50616 48331 46892 45872 49471 55234 55782 52280 52967 51091 47348
12734 47348 43805 48784 50307 49315 46321 45269 43308 49026 54617 59232 58941 50168 46041 50458 51710
12719 51710 46994 47750 48131 48082 47186 44462 46381 43333 43598 46298 43666 44770 53032 57063 55307 51369
12703 51369 53248 49852 49743 50124 50615 52985 54529 54253 57594 61251 61678 62132 52952 47473 49247 54172
12687E4172J473l596l273j17J611J704k153N2K958j554k143J508Q2k822n47K277
12671D9632L503M75m992k425L43M771O420p51L344N042M734k715j297N95k836
12656F3843n978n702k186P30N671J988K0r93k011n971L91m322k184L905N847K487
12640E5535k616L891j508j603J530L363J402J440k216J761N88L279K95k504L279
12625F5916M07K238J858l00K36J290n5l596j647l532l962K276J648k032k055o98
12609E7992k477j733j895M33k596m371K396M196J492K567O97M65l221l669J03
12594E0379J389P044m02o063K858K326L915R89m660P59N195R80j356n174J071
12579E9250M178j442k713J099L29j110o133L19m63L389K838n43m549K31k530r89
$$ plain form
12687 54172 55645 52049 48776 48659 50270 51974 49821 49873 52831 51277 49134 50642 50724 47902 47355 49632
12671 49632 53135 53610 48618 46193 46536 51307 57727 56976 60320 65362 70096 67381 66084 66679 63843
12656 63843 57865 52163 49977 50707 56378 58366 58386 57393 55382 49411 49802 45480 43296 47201 53048 55535
12640 55535 52919 56810 55302 53699 55229 58592 59994 61434 59218 60979 61567 64846 65141 62637 65916
12625 65916 66323 68561 70419 70119 70355 71645 71590 67994 66347 62815 58853 61129 62777 60745 58690 57992
12609 57992 55515 53782 51887 52320 49724 45353 47749 51945 53437 56004 56701 57166 53945 50276 50379
12594 50379 51768 58812 58410 52347 55205 57531 61446 62435 57775 58534 63729 64709 63353 58179 59250
12579 59250 63428 61986 59273 60372 60701 59591 53458 53777 53314 56703 59541 58998 54449 54680 52150 51161
12563E1161K170k137L9M004M668L942M7m05j903q30l994R95j482m334l211K108
12547E0838P035L10k600k892j529N183K656k278K637p42l886M464m79r69K493
12532F0241m05M717j127J700o32L761j038J679k369k687l944p67K124k409K338
12517F1182J84R37j871k781K555L432R84l781P88Q91J722Q26K58k574j614m826
12501E6312m49J474M31K859L071j82M734k373K212N563l300j119L806j70l998
12486F8871l495m575j809N537j990k1n3J860K929j714j181J640K820k117n196
12471F1506L432J483m097o18L651m00m925m88M541k013M465q06k285p569j832
12456E4045L219M65r38J220j425p798J080L378O208o79n063L792L567J645M131
$$ plain form
12563 51161 53331 51194 51233 55237 59905 63847 63894 63489 61586 60756 56762 57757 56275 51941 48730 50838
12547 50838 57873 58183 55583 52691 51162 56345 59001 56723 59360 58618 54732 59196 58717 57748 60241
12532 60241 59836 64553 63426 65126 64494 68255 67217 68896 66527 63840 59896 59129 61253 58844 61182
12517 61182 61366 62303 60432 57651 60206 63638 64622 60841 61629 62520 64242 65068 65326 62752 61138 56312
12501 56312 55863 57337 57768 60627 63698 63516 68250 65877 68089 73652 70352 69233 73039 72869 68871
12486 68871 65376 60801 58992 64529 62539 62518 62465 64325 67254 65540 64359 65999 68819 66702 61506
12471 61506 64938 66421 62324 61706 65357 64957 60032 59544 64085 62072 66537 65731 63446 55877 54045
12456 54045 57264 57729 56791 58011 56586 48788 49868 53246 59454 58775 53712 57504 61071 62716 66847
12441F6847K438k224l058q74M61j395j063K491K243l383L310M66o88K083K317
12426F9971J574J659m855m76M463r35n08J137j398O32m48J220j139K429L24m957
12410F8693L40J087l361J274n47J020L364J34n10k923K217L937L046r56k71l123
12394G3421r83L18M59j863m041P74l19M353L59K071n16l62k252j752J687k17j924
12377F9213J003J284n125k141J890O419K422j923m409m223k484k81K394Q351K466
12362G4856l940m611K315L64O64J607J060k071j714P18k028o87L384Q39M306M207
12346G9269ko811m515L081L066k155k348R90L609j14p25J147K12m22K76J851K524
12329G8933n892n068R30j537j571J125j311j522J307K113J284l327K01Q361P11
$$ plain form
12441 66847 69285 67061 64003 63129 63590 62195 61132 63623 65866 62483 65793 66259 65571 67654 69971
12426 69971 71545 73204 68349 67873 72336 71401 70893 72030 70632 71264 70816 72036 70897 73326 73650 68693
12410 68693 69033 70120 66759 68033 67486 68506 71870 72004 71494 68571 70788 74725 77771 76815 76544 73421
12394 73421 72438 72756 73215 71352 67311 68085 67766 72119 72478 74549 74033 73671 71419 69667 71354 71137 69213
12377 69213 70216 71500 66375 64234 66124 72543 74965 73042 68633 64410 61926 61645 64039 72390 74856
12362 74856 70916 66305 68620 68984 69648 71255 72315 70244 68530 69248 67220 66533 69917 70756 75062 79269
12346 79269 79267 72456 67941 71022 74088 71933 69585 70575 74184 74070 73345 74492 74704 74282 74558 76409 78933
12329 78933 73041 67973 68903 67366 65795 66920 65609 64087 65394 67507 68791 65464 65665 74026 74737
12314G4737J727L211j168k256k129j398J782j389o69K542O066J507P03o87P6j691
12298H0964P52k251l587k679k161j698m680l891J108O724L34M42M424O779j552
12283G9028j873M96K450J51J123N40k089J836k240l753P0j398l867k099L268L26
12267G1969J223j472q73k015n24K771K118J925K776l560l008j197m189R6N791
12252G1831K932m105n140k032K977M980J484N839J65o53N072J307j585q321m403
12237G0348k778L869N581R59k351j553l29j793L885P661K820J279J018L64k057
12222H6923k745l165m283K517N762K88P21L619n433q512n1M848N8Q7K721o74l117
12205G9564J541j111l284J616K072K798j591o89M010K442k845L420K844K608J266
$$ plain form
12314 74737 76464 79675 78507 76251 74122 72724 74506 73117 72448 74990 81056 82563 83266 82579 82655 80964
12298 80964 81716 79465 75878 73199 71038 69340 64660 60769 61877 68601 68935 69377 73801 80580 79028
12283 79028 77155 77651 80101 80252 81375 81915 79826 81662 79422 75669 75739 74341 70474 68375 71643 71969
12267 71969 73192 71720 70847 68832 68308 71079 73197 75122 77898 74338 71330 70133 65944 66040 71831
12252 71831 74763 70658 65518 63486 66463 71443 72927 78766 78931 78278 83350 84657 83072 74751 70348
12237 70348 67570 71439 77020 77979 75628 74075 73746 71953 75838 83499 86319 87598 88616 88980 86923
12222 86923 84178 81013 76730 79247 85009 85297 86018 89637 84204 75692 75641 80489 80547 80634 83355 82681 79564
12205 79564 81105 79994 76710 78326 80398 83196 81605 80916 84926 87368 84523 87943 90787 93395 94661
12190I4661J243j689m008j099J090J36K876N058J620O35n937k624q63K329n70
12175I2858o56M503J493O61N207l200l443j987M47o02M365O75j89M52J216j779
12159A00021k489o82L993N690j302l156J1j62m840J512L745l33J824J756j168
12144A04420k671o084n583r52K449O32k15j481j037L922O075L763J436O63m100
12129A01237n108j908J868n5M357N218M41j33M664R316J785m40P688k073K371
12114A29228j562o979o421n802J804K861P699K506K520K470M745L328O094L800
12100A46291j684o814k562N189k786m336O75K16m390j099L740k092P453J461m265
12085A34997j594J100N80j425J456N289J839k398J432K189J931N580O000Q733
$$ plain form
12190 94661 95904 94215 90207 89108 90198 90334 93210 98268 99888 100523 94586 91962 91099 93428 92858
12175 92858 92202 96705 98198 98859 104066 100866 97423 95436 95883 95281 99646 100321 100132 100584 101800 100021
12159 100021 97532 96850 100843 106533 105231 102075 102086 101924 97084 98596 102341 102008 103832 105588 104420
12144 104420 101749 95665 90082 89130 91579 92211 91996 90515 89478 93400 99475 103238 104674 105337 101237
12129 101237 96129 94221 96089 96034 100391 105609 106050 105917 110581 119897 121682 121242 128930 126857 129228
12114 129228 127666 120687 114266 108464 110268 113129 120828 123334 125854 128324 133069 136397 142491 146291
12100 146291 144607 137793 135231 140420 137634 133298 133973 134189 129799 128700 132440 130348 137801 139262 134997
12085 134997 133403 134503 135083 133658 135114 140403 142242 139844 141276 143465 145396 150976 156976 165709
12071A65709P649Q388J2530Q081n09l658k673n765R941R177O813j119m282p916
12057B02366j6350j6882q335n484k850K798J668o78l087J803J818K164n77l174
12043A55200L14P4l02l39O80l544m532m465l251M59N9M564K035P347M764N546
12027A64609J0805J3245J1603J4065J6428J3191P328O087R322J2674J3062J9100
12015C11519K1681K0605M482j0524k0724k8602k7618k0379j4941j1613m702Q37
12003B20021j427j0982m904K57L92q63p615l415K132M070K428J681q81m710k239
11988A93945l684k792m931k800K075k540L288J2431J4394J2717J1153J3989J2163
11975B59408J7711J4313O179K702N87L795O002J7958L5391N3180M9784M4291M0491
$$ plain form
12071 165709 173358 181746 194276 202357 201848 198190 195517 189752 199693 208870 215683 214564 210282 202366
12057 202366 186016 169134 160799 155315 152465 155263 156931 156253 153166 154969 156787 158951 158374 155200
12043 155200 155514 155588 155286 154947 155627 152083 147551 143086 139835 140294 140353 144917 146952 154299 159063 164609
12027 164609 175414 188659 200262 214327 230755 243946 251274 257361 266683 279357 292419 311519
12015 311519 333200 353805 358287 347763 327039 298437 270819 250440 235499 223886 219184 220021
12003 220021 218594 207612 202708 202965 203357 202494 194879 191464 193596 197666 200094 201775 200894 196184 193945
11988 193945 190261 187469 182538 179738 181813 179273 182561 194992 209386 222103 233256 247245 259408
11975 259408 277119 291432 297611 300313 300900 304695 310697 328655 364046 417226 467010 511301 551792
11962E51792K7717J4012Q090P482j654j2476j5839j2305k3641l1468k7767j1614
11950D72329k099J3887K0536K0842K0749R950R693J3652K6919L6952N1209N0837
11938G45456L4476R636j8125l5451l9431k2282j4256o247Q55R430J5424K2332
11926G01817L0146L9280M1145M0559L6669L7752M4738M0845L0949K2787J2639
11915A079326N417O867O744J1180N509j4191l1291m9411n9940n7210l6164r931
11903H56905J7499L8558N3219M8711L7870K7866R579j4069m3507p0006q4225r1297
11891G87103p1934n2388m1869k0003o018K834l314M060J586m242l629l439j0920
11878E77827k3852l4195l5553l3873k7123k2311k2045k5394k4338k1079j0835
$$ plain form
11962 551792 579509 593521 601611 609093 607439 594963 579124 566819 543178 511710 483943 472329
11950 472329 470230 484117 504653 525495 546244 556194 565887 579539 606458 643410 694619 745456
11938 745456 779932 789568 771443 735992 696561 674279 660023 653776 654631 664061 679485 701817
11926 701817 731963 771243 812388 852947 889616 927368 972106 1012951 1043900 1066687 1079326
11915 1079326 1084743 1091610 1098354 1109534 1115043 1100852 1069561 1020150 960210 903000 866836 856905
11903 856905 874404 912962 966181 1014892 1052762 1080628 1090207 1076138 1032631 962625 878400 787103
11891 787103 715169 662781 620912 600909 594891 597725 594411 598471 600057 595815 592186 588747 577827
11878 577827 553975 519780 484227 450354 423231 400920 378875 353481 329143 308064 297229
11867B97229n367k471N261J1589J2942J8901J9606K270j3564k4850k3551j5608
11855B82387j6182j0851j0667k801k171m285o343j046L458M992L917O796R564
11842B56768L635l435o890m086n685q100n170n869q6M247K075J293P574O034J60
11827B42465N647M588k35J874K05o788r021o333j424N27k18n67l79j397k432n106
11811B21406p81J663r7j888k127k535m385n502K521P554J6140J0724k189j663
11797B38841K553k05q8o23K031P561O881R581Q140J3829K0914J0926K805J553
11783C24699L763L238K905N825L15K044J82J984Q138N484M524L368P924Q562m471
11768C78484n706k626o35l668l86M285L819Q572Q695M906M344n34M884J912L40
$$ plain form
11867 297229 291862 289391 294652 306241 319183 338084 357690 359960 346396 321546 297995 282387
11855 282387 266205 255354 244687 241886 239715 235430 229087 228041 231499 236491 240408 247204 256768
11842 256768 260403 256968 250078 245992 240307 232207 227037 221168 221082 225329 227404 228697 236271 242305 242465
11827 242465 248112 252700 252465 254339 254544 247756 238735 232402 230978 231505 231287 230720 230341 228944 226512 221406
11811 221406 220625 222288 222191 220303 218176 215641 211256 205754 208275 215829 231969 242693 240504 238841
11797 238841 241394 241189 241101 240478 242509 250070 256951 266532 274672 288501 309415 320341 323146 324699
11783 324699 328462 331700 334605 340430 340745 342789 342971 344955 353093 358577 363101 366469 374393 382955 378484
11768 378484 372778 370152 369517 365849 365463 369748 373567 382139 390834 395740 400084 399550 404434 406346 406686
11753D06686K280Q997J0497M653J0343R868R806M492Q577J4413J4758P968n2N306
11739E18592O124L758J0436R631J1501J2635O690P219O821L967J032L588M982
11726F06976L653P123J3433J1061J0216J518p039j1080j0202j1286p385k019L700
11713F08669P580J0425J4156P326q630j7570j9095j9593j5815q478J340j026K299
11700E61588M192n47J56q603j7901k0550j6529j1195j0207r728k658j711J655
11687D67962o499j5376r470N169J7044L3939L4514K6017J8501J863n812o550j1461
11674E49841r835o93P501K0366L3967M2369M4148K9493Q516q542j3791j0294q055
11661F84991J948J3209K1715K2643K2341K9980K4389K1533J4111K138k189n260
$$ plain form
11753 406686 408966 417963 428460 433113 443456 453324 463130 467622 476199 490612 505370 513338 513286 518592
11739 518592 524716 528474 538910 548541 560042 572677 579367 586586 593407 597374 598406 601994 606976
11726 606976 610629 617752 631185 642246 652462 653980 646941 635861 625659 614373 606988 604969 608669
11713 608669 616249 626674 640830 648156 639526 621956 602861 583268 567453 558975 560315 559289 561588
11700 561588 565780 565233 565389 556786 538885 518335 501806 490611 480404 470676 468018 466307 467962
11687 467962 461463 446087 436617 441786 458830 492769 527283 553300 571801 573664 567852 561302 549841
11674 549841 540006 539313 546814 567180 601147 643516 687664 717157 725673 717131 703340 693046 684991
11661 684991 686939 700148 721863 744506 766847 796827 821216 842749 856860 858998 856809 851549
11649H51549j0595l1874o6554r3501r8794m8677J2089L9672N9556O0380M3876
11638G17127Q707j4767m1271o9586p7953o6617l7106J7244N8614Q1163Q6447Q9402
11626G51404P9450P5084Q5411Q7150O9085K4263J007j4426l1443j2999K0556L8901
11614A173443N2989N6837M5747N4095N2734K9301J8836J1450j2459l8679l5095
11603A409199j5455n651j455N707J1997K0853K2343K5835K9443K8129J0687p862
11591A533770r211r292n03N88N776J0972J8464K7396L2194M0093L4260M3956N7214
11578A785677N1267M3489M6603N9141P3828R9003J31929J82800K42680K85792
11568C002209L11927K84756K02741J00228j1845j08502j67435j97774j79744j16522
$$ plain form
11649 851549 840954 809080 742526 649025 550231 501554 513643 553315 612871 673251 717127
11638 717127 725834 711067 669796 600210 522257 455640 418534 435778 494392 575555 662002 751404
11626 751404 830854 905938 991349 1078499 1147584 1171847 1172854 1158428 1126985 1113986 1134542 1173443
11614 1173443 1226432 1283269 1329016 1383111 1435845 1465146 1483982 1495432 1482973 1444294 1409199
11603 1409199 1393744 1388093 1386638 1392345 1404342 1425195 1447538 1473373 1502816 1530945 1541632 1533770
11591 1533770 1524559 1515267 1514764 1515352 1521128 1532100 1550564 1577960 1610154 1650247 1684507 1728463 1785677
11578 1785677 1836944 1880433 1927036 1986177 2060005 2159008 2290937 2473737 2716417 3002209
11568 3002209 3314136 3598892 3801633 3901861 3890016 3781514 3614079 3416305 3236561 3120039
11558C120039l9614K9554Q5047J02240Q2159L6473L131K270K3676N9402J04707
11547C609084J68715K31949K51926K22447J52500N4354p72n820K5656P2730J22482
11536D905251J74222K26924K76562L24857L69452M01239M16175M09697L92930
11527G897309L73995L76812M17173M93828N90059P06897Q35278R55425J060831
11518A3707607J170510J263932J339068J382800J408718J445033J485319J564543
11510B4767530J724612J934680K186600K516443K853072L249097L760580M394064
11502D7386678N289160O594436Q304380J0535915J3895962J8764988K4469939
11495A35241458L0526775L7837394M5580327M6791679L5651122J8958312o559004
$$ plain form
11558 3120039 3080425 3109979 3195026 3297266 3379425 3415898 3419029 3421299 3444975 3504377 3609084
11547 3609084 3777799 4009748 4261674 4484121 4636621 4690975 4690203 4684383 4710039 4782769 4905251
11536 4905251 5079473 5306397 5582959 5907816 6277268 6678507 7094682 7504379 7897309
11527 7897309 8271304 8648116 9065289 9559117 10149176 10856073 11691351 12646776 13707607
11518 13707607 14878117 16142049 17481117 18863917 20272635 21717668 23202987 24767530
11510 24767530 26492142 28426822 30613422 33129865 35982937 39232034 42992614 47386678
11502 47386678 52675838 59270274 67574654 78110569 92006531 110771519 135241458
11495 135241458 165768233 203605627 249185954 295977633 331628755 350587067 344028063
11488C44028063k8741558l2819808k4221673r243392J1237543L0674705M3409841
11481C34323721M7052713M1126258K4676711J366434k0150926m0973871n1901177
11474C35519863m5659701l1199191j5434318m4676R469792J3004343R118860J0757
11466B74785729q178489j6714351k5814198l2202412l4505935l1693809k5674754
11459A00001781j9523089j4137436r603055n890752k811825o8363K573107M224235
11451E4764603L798207J802317j550855m852155o211645o040279n856743n685433
11443C0168017n118567m223721l321541k549215j927500j457108j103514q47735
11435I619116o69069n28160m22073l57266l28291l12637l02323k77729k53486
$$ plain form
11488 344028063 315286505 282466697 258245024 249001632 260239175 290913880 334323721
11481 334323721 381376434 422502692 447179403 448545837 428394911 387421040 335519863
11474 335519863 289860162 258660971 243226653 243181977 252651769 265656112 274774972 274785729
11466 274785729 266607240 249892889 224078691 191876279 157370344 125676535 100001781
11459 100001781 80478692 66341256 56738201 50847449 48035624 47967261 50540368 54764603
11451 54764603 58562810 60365127 58814272 53962117 47750472 41710193 35853450 30168017
11443 30168017 25049450 20825729 17504188 14954973 13027473 11570365 10466851 9619116
11435 9619116 8950047 8421887 7999814 7642548 7314257 7001620 6699297 6421568 6168082
11426F168082k45220k56340k71053k89402k92448k75003k32982j79597j22921
11417D003116p3253n0109l5699k0128k1177r819J5927M2364N6828K0830m3686
11406C885194r5496j24615p2042M4193J34951J35129L1740j42330l20212l99007
11396C077505l56825k78877k04063j49810j21312j06176j00514j03276j05729
11387A550923q8830p6701p1759n7396n1965m7371l5106k1482j8602k3069j2877
11376A045765N580R917J8984J8821J8140Q722n211j8523k3166k6163k8356l1589
11364I92921j6254o449O706J9581K9296M0468N0071M8392K1979P4k7314o9262
11352A090209r4182r9326r0144p3631o1404l3970n291J5957L5270M3868L6044
$$ plain form
11426 6168082 5922862 5666522 5395469 5106067 4813619 4538616 4305634 4126037 4003116
11417 4003116 3929863 3879754 3844055 3823927 3802750 3792931 3808858 3851222 3908050 3928880 3885194
11406 3885194 3789698 3665083 3593041 3637234 3772185 3907314 3939054 3796724 3476512 3077505
11396 3077505 2720680 2441803 2237740 2087930 1966618 1860442 1759928 1656652 1550923
11387 1550923 1462093 1385392 1313633 1256237 1204272 1156901 1121795 1100313 1081711 1058642 1045765
11376 1045765 1051345 1061262 1080246 1099067 1117207 1125929 1120718 1102195 1079029 1052866 1024510 992921
11364 992921 976667 970218 976924 996505 1025801 1066269 1116340 1164732 1186711 1186785 1159471 1090209
11352 1090209 996027 896701 806557 732926 671522 637552 632261 648218 683488 727356 763400
11341G63400L7969K7621K1871N535k5182o6070j00313j03170o6362k2386K627
11330D75540K2110L7530M6548L8271R521k4913n7114q0600q9486r2397n7630k4604
11318B02776o559J1928J3573Q269o755j9464l7902m0636m9901n0072m9783l4368
11306e8894k0767j4552n657M777J5230J8507L4738M2112J8267L285k958j8350
11294A5738j5606o583k212K917J7879K6220K8494M0140L8641O787n865j9792k4584
11281A02174j8920j0642k027R173M326J577J3052R591K295k430j2482j0788o968
11268G7931k013k406r311j1440j1585j5974j7853j4898j4943m725O022P685R436
11255d074R904J848l620l675j0240r296l179L384J634J4472K7807K0053K3893
$$ plain form
11341 763400 801369 828990 850861 856396 831214 765144 664831 561661 495299 472913 475540
11330 475540 497650 535180 581728 619999 629520 604607 547493 466893 377407 285010 227380 202776
11318 202776 196217 208145 221718 229987 223232 203768 165866 125230 75329 25257 -24526 -58894
11306 -58894 -79661 -94213 -99870 -95093 -79863 -61356 -26618 15494 33761 37046 34088 15738
11294 15738 132 -6451 -8663 -5746 12133 38353 66847 106987 145628 152415 146550 126758 102174
11281 102174 83254 72612 70585 79758 84084 85661 98713 108304 110599 108169 95687 84899 77931
11268 77931 75918 73512 64201 52761 41176 25202 7349 -7549 -22492 -27217 -21195 -13510 -4074
11255 -4074 5830 7678 4058 383 -9857 -19153 -22332 -18948 -17314 -2842 24965 45018 68911
11242F8911L8482L9854N0895P6676J12388J64583K28527K83294K94233K53911
11232A611754J54813P001j19578k18899k84832k84407k30500j60604j15653q6734
11222B72361n8821l5770k6828k2598j6470q998q70j662k032n764n873q333q027
11209G0315l883r10l755o313o984n889l638o25o927k598m779k757O4l094k489
11194A5738o291q233p647p495q992o207m393j974N095O768R230Q133K687L918
11180C37J098P16M822r103j044L732k375q48O276R237Q050K1325J8511R876N511
11165G6121L463q001l016r01m984J617O265N667M970J694L440K781M928K26m700
11150H9570j812j858J738k538k486P131M316j847M072J0267Q318K772L240J0527
$$ plain form
11242 68911 107393 147247 198142 274818 387206 551789 780316 1063610 1357843 1611754
11232 1611754 1766567 1773568 1653990 1435091 1150259 865852 635352 474748 359095 272361
11222 272361 213540 177770 150942 128344 111874 102876 102006 100344 98312 92548 86675 78342 70315
11209 70315 66432 65522 61767 55454 48470 42581 38943 38318 31391 28793 24014 21257 21321 18227 15738
11194 15738 9447 1214 -6433 -13928 -22920 -29127 -33520 -35494 -30399 -23631 -14401 -6268 -3581 337
11180 337 1435 2151 6973 -2130 -3174 558 -1817 -2665 3611 12848 20898 42223 60734 70610 76121
11165 76121 79584 71583 68567 67666 62682 64299 70564 76231 81201 82895 86335 89116 94044 94270 89570
11150 89570 87758 85900 87638 85100 82614 89745 94061 92214 96286 106553 114871 117643 120883 131410
11136A31410P144N868Q191Q060L605R052J6535J7449K0925K0647L5668M5989L9543
11123C70086K7347J7385r58j1799j3171r09K5399N1332Q5993J39343K03004K44414
11111A137466K33280J88532J15848K8872l7158r6950j73799k48134k57268k04820
11101F85869j51991j16364o9973m5616l6130k4684k0277j8039j2094p815J387
11090A84273L537N100Q618J2765J3212J0192Q020P694Q270K0475J6526K2759L2967
11077C54408L4425M0636M5665L7948K1528j2531l8126m3190l9387l5422k0842
11066C45112j937J6044L5797N3971P4459Q1634P0163M2129j259l0414l9254l8081
11054F08364k9048j0521N908K9923M8267N8603O8363P1911O6079N9986N0209L2327
$$ plain form
11136 131410 138554 144422 152613 160673 164278 173330 189865 207314 228239 248886 284554 330543 370086
11123 370086 397433 414818 413860 402061 388890 387981 413380 464712 550705 690048 893052 1137466
11111 1137466 1370746 1559278 1675126 1703998 1666840 1569890 1396091 1147957 890689 685869
11101 685869 533878 417514 347541 301925 265795 241111 220834 202795 190701 182886 184273
11090 184273 187810 192910 201528 214293 227505 237697 245717 253411 261681 282156 298682 321441 354408
11077 354408 388833 429469 475134 513082 534610 522079 483953 440763 401376 365954 345112
11066 345112 343175 359219 395016 448987 523446 605080 675243 717372 716113 685699 646445 608364
11054 608364 579316 568795 574703 604626 652893 711496 779859 851770 917849 977835 1028044 1060371
11042A060371O039k3540m2039o5273n6472m3650k7032k0631J193J7167K9984M2780
11030H78897N5395N7999N1746L5950J5830j3992l1894n9277o2986n0463l3915
11019H43290j8916j0729j1679j9152j7153j6111j9440j6745j6070j8949q949k966
11007F66431r236j0060k457J129Q049N513O741L96j329p365j5971k6634k9180
10994E86027m3314m7592m2954m6937m0519k9988j1093L556P871L476J790p838
10982C32485j5132j7568k3133l0522k3200j6606j4575j1403N98J2581K6078K4374
10970B43977J5420L661j5155k3342j8149j3718j6902k870k277l280p536r558j3245
10957A37026j6140j0915r054l500m730l881M55n049o330o778k833L48p96o920
$$ plain form
11042 1060371 1066410 1042870 1000831 935558 879086 835436 808404 787773 788966 806133 836117 878897
11030 878897 934292 992291 1044037 1079987 1095817 1081825 1049931 990654 927668 877205 843290
11019 843290 824374 813645 801966 782814 765661 749550 730110 713365 697295 678346 669397 666431
11007 666431 657195 647135 644678 645807 653856 659369 666110 666506 665177 657812 641841 615207 586027
10994 586027 542713 495121 452167 405230 364711 334723 323630 327186 335057 338533 340323 332485
10982 332485 317353 299785 276652 246130 222930 206324 191749 180346 180944 193525 219603 243977
10970 243977 259397 263058 247903 224561 206412 192694 175792 172922 170645 167365 159829 150271 137026
10957 137026 120886 109971 100917 97417 92687 88806 89261 84212 77882 71104 68271 68619 67823 60903
10943F0903n319k191J230j081l506n459J903L054K263K498J827R05N352L607L465
10928F9451M832N625O028N800J1902J8019K7237L1762K3777R075L370k093m87
10915B14298k996q864j2939p462l59Q81M021M524N200L060R321J0472J0860J4867
10901B44884R033O02L105J415K514P160K592p92M249j717q89N348J357r3p176
10886B71592q950j1160r635j1214n308m326k197p755j3552j2765p846j1175j1104
10873A54605q582j0139m728r758r469k719r607j3994j475o177p960m570m225q345
10859E2857r023o577q073j674Q39k974o488K069L15l535j097M658j176l120k889
10844A4112j541N384k712J049L08k156R00l962J64M9k923k758K970J274j846M262
$$ plain form
10943 60903 55584 53393 54623 53542 50036 44577 46480 49534 51797 54295 56122 57027 62379 65986 69451
10928 69451 74283 79908 85936 91736 103638 121657 148894 180656 204433 213508 216878 214785 214298
10915 214298 211302 202438 189499 182037 181678 182559 186580 191104 196304 199364 208685 219157 230017 244884
10901 244884 253917 254519 257624 259039 261553 268713 271305 270513 274762 273045 272156 277504 278861 278768 271592
10886 271592 262642 251482 241847 230633 225325 220999 218802 211047 197495 184730 176884 165709 154605
10873 154605 146023 135884 131156 121398 111929 109210 99603 85609 84134 77957 69997 65427 61202 52857
10859 52857 43834 37257 29184 27510 28349 25375 18887 20956 21271 17736 16639 21297 20121 17001 14112
10844 14112 12571 17955 15243 16292 16600 14444 15344 11382 11546 11595 8672 5914 8884 10158 8312 12574
10828A2574L17n282l581M354M794R45N456J590K26J17m04N22j079p222l034l357
10812F936m15K560K79J154l878l34P042L592l637J363j415m714L36N302J34l10
10796A3995M07M677P302K55o163L537M173k107p31O61K903M016k4l520k814p38
10780B5829k873l792j001J921K776K209J224J464m32L605M376N327J337k470j47
10765C9353M513k159k145K465L996J830Q30m798R26k732p580O480N876M47o12
10750D6690O20L732R404N541M072j532K178N616j014m477q436r255m755o451o320
10735C5613j016l94K016K636J1790R000O106J556K313M460O957M896n884n388
10721G4661q254p386j058M325P582R214K245J91l419O73k213R44K444k64o89J803
$$ plain form
10828 12574 12891 7609 4028 8382 13176 14121 19577 21167 21393 21510 21106 21628 20549 13327 10293 6936
10812 6936 6521 9081 9360 10514 6636 6302 13344 16936 13299 14662 13247 8533 8869 14171 14305 13995
10796 13995 14402 19079 26381 26636 20473 24010 28183 26076 25345 26006 28909 32925 32901 29381 26567 25829
10780 25829 22956 19164 18163 20084 22860 25069 26293 27757 27325 30930 35306 40633 41970 39500 39353
10765 39353 43866 41707 39562 42027 46023 47853 48683 43885 44811 42079 34499 40979 46855 47302 46690
10750 46690 47310 51042 60446 65987 70059 68527 70705 76321 75307 70830 62394 53139 48384 41933 35613
10735 35613 34597 34203 36219 38855 50645 59645 65751 67307 69620 74080 81037 85933 80049 74661
10721 74661 66407 59021 57963 62288 69870 79084 81329 81520 78101 78774 76561 77505 79949 79685 78996 80799
10705H0799L185N493J4341R570O505O20J283k749q318j4312j2970p691o281l889
10691F5586k633j620N786N013O067M091L916j040k419m712m86k884m097o347L92
10676F4613J844k932L78J628K592K910J279j746M309P656M311L481K040o365o624
10661G9374r21m256n064M726R5O94N507Q047R045O140M184l793r178q532l888
10646H2180n854l258J049K646l030M768N609K978M739J469n935j0789j386j295
10632G3891p325m387j933M329L084K13k687J913M172k653j497O417M971K401M671
10617H5580J0293O805J1875R200J2396J0792O465N326N324R275J0821J6660J5609
10604B16421J7610J8265K2793J5766J3760J3745J4081J4072K0965K4299K7114
$$ plain form
10705 80799 83984 89477 103818 113388 119893 120513 121796 119047 110729 96417 83447 75756 69475 65586
10691 65586 62953 61333 67119 72132 78199 82290 86206 85166 82747 78035 77549 74665 70568 64221 64613
10676 64613 66457 63525 63903 65531 68123 71033 72312 70566 74875 82531 86842 90323 92363 85998 79374
10661 79374 78453 74197 69133 73859 73954 74648 80155 88202 97247 103387 107571 103778 94600 86068 82180
10646 82180 76326 73068 74117 76763 73733 78501 84110 87088 91827 93296 87361 76572 75186 73891
10632 73891 66566 62179 60246 64575 67659 67872 65185 67098 71270 68617 67120 73537 78508 80909 85580
10617 85580 95873 102678 114553 123753 136149 146941 153406 158732 164056 173331 184152 200812 216421
10604 216421 234031 252296 275089 290855 304615 318360 332441 346513 367478 391777 418891
10593D18891M6138P1155J02867J53737K23836L21611M49553N62507N99365M87402
10583C437062K46851q7643l84627n35559n46234m54515l39330k41556j76785j29939
10573G87725q0094n5125m4974l4052l0389k5255j9036j2403p450J903J1442K4151
10561E16443L6070L6507L2532K7891J5284K1939L6774L2089K3081O770O532J7535
10549H09447M4800Q1527J22086J85153K78152M10814N98436Q50123J119016J290742
10539E790296J247138Q75573J95710n38659j118441j366925j262783r91826p18858
10530B111225m97343l34907k23764j55449j06505q2193n9997l5210j9357j0166
10520E86334r928j7326l0157l4073k7691j1158N744K0722K8554K7236K4906K1415
$$ plain form
10593 418891 465029 536184 639051 792788 1016624 1338235 1787788 2350295 2949660 3437062
10583 3437062 3683913 3596270 3211643 2676084 2129850 1675335 1336005 1094449 917664 787725
10573 787725 707631 652506 607532 573480 543091 517836 498800 486397 478947 480850 492292 516443
10561 516443 552513 589020 621552 649443 664727 686666 723440 755529 778610 785380 791912 809447
10549 809447 854247 935774 1057860 1243013 1521165 1931979 2530415 3380538 4499554 5790296
10539 5790296 7037434 7913007 8108717 7570058 6451617 5084692 3821909 2830083 2111225
10530 2111225 1613882 1278975 1055211 899762 793257 711064 651067 615857 596500 586334
10520 586334 576406 559080 528923 494850 467159 456001 461745 482467 511021 538257 563163 584578
10508E84578J5660J3082J2139K1860K4048L4256M9773Q2119J30951J94195K89391
10497A452052M15209N75896P03315P19567N77441K40815j65871m95299o72314
10488C350811o83032n74750m40706l12031k12217j45174r1005m1937j3528O199
10478H42630J9148R574j3038l6310n4009o4529o8268o0726m6459m1994l5352l0714
10466D19953k8828j7091j1626j4603l534k119n188o838j2138j0360j431M012P90
10453C10999J806M09r93Q35m997J391R70m376k162r33R09L907P89L671M732J1818
10437C28775K1523L1952L4504K9903J8546P067j0621k3195l1204l9125k9185j5342
10425C23598m327J8081L2720K8603N483k4280m3987n2343l9727k9207k1956j0884
$$ plain form
10508 584578 600238 613320 625459 647319 671367 705623 755396 837515 968466 1162661 1452052
10497 1452052 1867261 2443157 3146472 3866039 4443480 4684295 4518424 4023125 3350811
10488 3350811 2667779 2093029 1652323 1340292 1128075 982901 891896 849959 836431 842630
10478 842630 861778 871352 858314 822004 767995 703466 635198 574472 528013 486019 450667 419953
10466 419953 391125 374034 362408 347805 344271 342152 336964 330126 317988 307628 306197 310209 310999
10453 310999 312805 313214 312221 313056 308059 309450 310420 306044 303882 302949 303858 307765 308554 312225 316957 328775
10437 328775 350298 382250 416754 446657 465203 472270 461649 438454 407250 368125 338940 323598
10425 323598 319271 337352 370072 398675 404158 379878 335891 283548 243821 214614 192658 181774
10413A81774l185q771j2530q382j454n38k610k957K709L255k820J72l817m045
10399A36801L422P71N792K380R213J8186J5222J6850K0927K7420K5195L1318L1867
10386C45364K0436Q062J9130K6367K8310L1807L3081M3100O3053R3371J30257
10375H42338J85527K42914K68694K42333J49373J3592j34361k38868k74055k50980
10365A046507j83451j19309p2358j9661L0896P9721J34234J98164K44807K57414
10355A596964K22252J22675m732j20437k07381k53457k42371j95377j46623j00548
10345F70965n7158l1013j4498n124L397J8376L4353M3896O5725R9272J48517K22761
10333A199469L20196M36790N39457N71963M94387K97117N217k79917m60886n35669
$$ plain form
10413 181774 178589 169818 157288 148906 147452 146914 144304 141347 144056 147311 144491 144663 140846 136801
10399 136801 140223 140994 146786 149166 158379 176565 191787 208637 229564 256984 282179 313497 345364
10386 345364 365800 373862 392992 419359 447669 479476 512557 555657 618710 712081 842338
10375 842338 1027865 1270779 1539473 1781806 1931179 1944771 1810410 1571542 1297487 1046507
10365 1046507 863056 743747 671389 651728 682624 762345 896579 1094743 1339550 1596964
10355 1596964 1819216 1941891 1937159 1816722 1609341 1355884 1113513 918136 771513 670965
10345 670965 613807 582794 568296 563172 566569 584945 619298 663194 728919 828191 976708 1199469
10333 1199469 1519665 1956455 2495912 3067875 3562262 3859379 3864596 3584679 3123793 2588124
10323B588124m95794l87001k56275j39588l0271O9202J76054L03351M35219N31458
10313B794479N44825M33757K05457q8586l47842n03967n69049n43278m42526l21925
10303A161345k25011j57248j01041n7014l7981k5779o876K989J0839K8746M7469
10292F40438P9868J25344J83318K58092L19566L26688K62399J33640l3008j88391
10282B107954k71462k95494k61894k02567j35982p4619k2563K3992Q0971J63893
10272A112229K49413L25492L42485K59724J02352r7912k87523l75382l66280l09814
10262I54784k35748j74419j23284r2330o5033l8818k6474j9557j7500j1447q532
10251A41642j0685r765j0146q437p171q992n518p01l356R25J712n863M84M124
$$ plain form
10323 2588124 2092330 1705329 1449054 1309466 1279195 1348397 1524451 1827802 2263021 2794479
10313 2794479 3339304 3773061 3978518 3889932 3542090 3038123 2469074 1925796 1483270 1161345
10303 1161345 936334 779086 678045 621031 583050 557271 550395 553384 564223 592969 640438
10292 640438 720306 845650 1028968 1287060 1606626 1933314 2195713 2329353 2296345 2107954
10282 2107954 1836492 1540998 1279104 1076537 940555 865936 843373 867365 948336 1112229
10272 1112229 1361642 1687134 2029619 2289343 2391695 2293783 2006260 1630878 1264598 954784
10262 954784 719036 544617 421333 329003 263970 225152 198678 179121 161621 150174 141642
10251 141642 130957 121192 111046 102609 95438 86446 80928 80227 76871 77796 79508 73645 74129 78253
10237G8253K512j469k323o928j5j187k006J250K144N771J767J065J885J601m7
10222H2273N086J848l16P11M38p8j653m471m498k205j055l373P19L920m44l576
10206G3326J107K78k714J387n53K002K162j190n519n955n98J0093N494K418J001
10191H2739J611m937O73P08P60K063n766j668J446l14P317Q155Q411L608J55n517
10175I9444n264o01j721R67j203j254N51L659M48l414k754L620M075K758J242
10160A00553J693R404J310j156j669m562M24J54J009J057j373K273K715l168m504
10145A04160l638o476m369j741R31n26L307N012K809k244Q97k441j664j81m845
10130H8991p981n021m916K567J696j55m285j296L087Q514R983L576j531L886J125
$$ plain form
10237 78253 80765 79296 76973 70045 70030 68843 66837 68087 70231 76002 77769 78834 80719 82320 82273
10222 82273 87359 89207 88891 89602 90040 89962 88309 83838 79340 77135 76080 72707 73426 77346 76902 73326
10206 73326 74433 74711 71997 73384 72831 74833 76995 75805 70286 64331 63733 73826 79320 81738 82739
10191 82739 84350 79413 80086 80794 81554 83617 77851 76183 77629 77315 84632 92787 101198 104806 104961 99444
10175 99444 94180 93579 91858 92825 91622 90368 90919 94578 95026 91612 88858 92478 96553 99311 100553
10160 100553 102246 111650 112960 111804 110135 105573 105997 106151 107160 108217 106844 109117 111832 108664 104160
10145 104160 100522 94046 89677 87936 88867 88341 91648 96660 99469 97225 98122 95681 94017 93836 88991
10130 88991 81010 75989 71073 73640 75336 75181 70896 69600 72687 81201 91184 94760 93229 97115 98240
10115I8240m740j405j020Q063J1167M103O247O861R479Q986J1504M296q988j5005
10101A37788j6906j4683j2756p608M97k505j395l194J43M611l974r51o21j510
10087G6936K601J321Q21j364n158J022j569J02K95J1j930P945Q216O433J2429
10072A08111J6073J1175J3297O453K307L71n397m501j411l205p415m027q247r794
10058A13790m377o033n466n98l420m872k088k680M267N916P891P680P836M662
10044A22508R58k562l435m95m507p636j573l2J626k321N881Q156r83n967m663
10029A04955j257k128n674n306r36K214K480M884Q351J4689J6880O160K048L565
10015A50925k929j1884j4596o310m901o55M617J1590J8497K3870L0979K3872J1556
$$ plain form
10115 98240 93500 92095 91075 99138 110305 114408 120655 127516 136995 145981 157485 161781 152793 137788
10101 137788 120882 106199 93443 85835 86332 83827 82432 79238 79381 83992 80018 79067 78446 76936
10087 76936 79537 80858 81679 80315 75157 76179 74610 74712 75007 75018 73088 81033 89249 95682 108111
10072 108111 124184 135359 148656 155109 157416 157787 152390 147889 146478 143273 135858 131831 123584 113790
10058 113790 109413 103380 97914 97316 93896 89024 86936 84256 88523 94439 102330 110010 117846 122508
10044 122508 123466 120904 117469 116974 112467 104831 103258 103226 104852 102531 108412 116568 115585 109618 104955
10029 104955 103698 101570 95896 90590 89654 91868 94348 99232 107583 122272 139152 145312 147360 150925
10015 150925 147996 136112 121516 115206 110305 109650 114267 125857 144354 168224 199203 223075 234631
10002B34631J724j7215k3394j7043j4826r234m510l421j261N981J2416J5704K4099
9989B03651M4832M6476K9974J4200j6795l7176m3441m0910k9354j8761j1915j0020
9977A30761N251P383M658P819J0752J5029J7306J0282K22l554j3480k0537j5688
9964A56204j4581j2723j2252n982L768j904N500Q095N200Q61j683M009N038J827
9950A41377J0536J1670J1565M603R56p211j0961q257k644K442o5m224j670j4901
9936A33216j6193j5312q623m315k417m049l815k441k255N248M06j048L849l12
9922H1939l579k5O013L23l20m297J687R598N09l188O110J1580J1272Q280R17O907
9906A33726J0069J4744R581P005J2596J3101M852L2r15p307r814j2041j4191j3268
$$ plain form
10002 234631 236355 219140 195746 178703 163877 154643 150133 146712 145451 151432 163848 179552 203651
9989 203651 248483 294959 324933 339133 322338 285162 241721 200811 171457 152696 140781 130761
9977 130761 136012 143395 148053 155872 166624 181653 198959 209241 209463 205909 192429 171892 156204
9964 156204 141623 128900 116648 110666 114434 112530 118030 126125 131325 132186 130503 134512 139550 141377
9950 141377 151913 163583 175148 179751 180707 173496 162535 154278 151634 154076 154011 149787 148117 133216
9936 133216 117023 101711 93088 88773 86356 82307 78492 76051 73796 79044 79450 78402 82251 81939
9922 81939 78360 78335 84348 84671 84351 80054 81741 91339 91848 88660 94770 106350 117622 125902 126819 133726
9906 133726 143795 158539 168120 175125 187721 200822 205674 205706 204791 197484 187670 175629 161438 148170
9892A48170q214j2259n815J67m24K373N875M129M864M380J996K913M902l87n517
9877A47153n125m004o305j1806j0641o058m673k64n639n465l699K880M124L514
9863I3992M539J939K057m547n788M96k039l788K925P854O093O528O128Q618N221
9848A30228K94j805m998n791n028k562l806J2506J4603J0604J2160J9595K5134
9835B01134K1804J5686P262P379J681j413j290P148N276M395Q009M589K608Q672
9821B92940J2542J6901K2900K5060L7064N1406P2829J09411J57491K36379L41318
9810A376241M47289M28503K71685L4575k56044m02493l59832k67314j89928j08607
9800I74075m4111J4306Q2673J69087K81658M30726O21343Q11418P32219M32560
$$ plain form
9892 148170 139956 127697 121882 122049 121625 123998 129873 134002 138866 143246 145242 148155 153057 152670 147153
9877 147153 142028 138024 131719 119913 109272 103214 98541 98277 92638 87173 83474 86354 90478 93992
9863 93992 98531 100470 102527 97980 92192 92688 90649 86861 89786 97640 103733 110261 116389 125007 130228
9848 130228 130522 128717 123719 117928 112900 110338 106532 119038 133641 144245 156405 176000 201134
9835 201134 222938 238624 245886 253265 254946 253533 252243 259391 264667 269062 277071 281660 284268 292940
9821 292940 305482 322383 345283 370343 407407 458813 531642 641053 798544 1034923 1376241
9810 1376241 1823530 2252033 2523718 2558293 2302249 1899756 1539924 1272610 1082682 974075
9800 974075 929964 944270 1026943 1196030 1477688 1908414 2529757 3341175 4073394 4505954
9790D505954m6944o06572q40168p39429n63113l97383k58637j57252p5936k0662
9780G99858M4206J15893J90356K88471L53966K78038J22826j11220l49705m16338
9770A316351l43637k60307j83302j27923q2266o1635l9311k0609k1784j9903j2822
9759A42852j1433j4141r501p321o501r226j382O31l110m182m084J374J986K45
9745G6207l68k275m154n716q99p327q294k793m47K633J991J511l356k677m188
9730C9848j535K635n17l486N027O703Q099L218m721K413J477J59J554N29l631
9715E7772m266l085P21K789K725j601l581M76L07k588m540m167m983k90K181J310
9699C9180J043j79k4N934M492J507p00J0588J1236K633k136l554N058M963o3L00
$$ plain form
9790 4505954 4459010 3852438 3012270 2272841 1709728 1312345 1053708 896456 820520 799858
9780 799858 844064 959957 1150313 1438784 1792750 2070788 2193614 2082394 1732689 1316351
9770 1316351 972714 712407 529105 401182 318916 257281 217970 197361 175577 155674 142852
9759 142852 131419 117278 107777 100456 93955 84729 83347 83978 80868 76686 72602 73976 75962 76207
9745 76207 75839 73564 69410 63694 62795 55468 47174 44381 43934 46567 48558 50069 46713 44036 39848
9730 39848 38313 40948 40431 36945 41972 48675 56774 59992 55271 57684 59161 59320 60874 61403 57772
9715 57772 53506 50421 51142 53931 56656 55055 51474 51950 52257 49669 45129 40962 35979 35689 37870 39180
9699 39180 40223 40044 40020 45954 50446 51953 51253 61841 73077 75710 73574 70020 75078 80041 79978 80278
9683H0278K656j572j035m099j434Q031O359L296K032M182R818J5098J3943J3356
9669A50909J0038Q778M565P077j527r023j2764j2442r661o896k112K046M116M133
9655A37237m100K45j097k654k972p88J433j554j654k47M400N087N994Q273J2095
9640A59698J2495J6269J6703K3992K2052J4078J8172J5593J3538J8007K4428L1069
9628C86094M6732P0773R5916J24574J35946J19975Q3510L8217k191l6502o9121
9617I93923j14602j53976j48246j13545q4792o0310m1445l2056j4695j0615o08
9606B19033M262P945J1212J4680J0266O760P430J0795R260J0790J3718J7416J5442
9593C59009J5070J9551K5721L0814L8601N2960P0769R4715J33337J82946K51705
$$ plain form
9683 80278 82934 81362 80327 76228 74794 82825 89184 92480 94512 98694 108512 123610 137553 150909
9669 150909 160947 169725 174290 181367 179840 170817 158053 145611 135950 129054 126942 128988 133104 137237
9655 137237 133137 133382 132285 129631 126659 125871 127304 125750 124096 123849 128249 133336 139330 147603 159698
9640 159698 172193 188462 205165 229157 251209 265287 283459 299052 312590 330597 355025 386094
9628 386094 432826 503599 599515 724089 860035 980010 1063520 1101737 1099546 1063044 993923
9617 993923 879321 725345 577099 463554 378762 318452 277007 244951 230256 219641 219033
9606 219033 223295 231240 242452 257132 267398 274158 281588 292383 301643 312433 326151 343567 359009
9593 359009 374079 393630 419351 450165 488766 541726 612495 707210 840547 1023493 1275198
9582A275198L14582L76826M46010M77167M52243L55854J35480j46131l79645n09700
9572B797884n46657m98511m09776l06628k12571j51887j03796p2137m1078l1519
9562D23324j9448q944M315N627L007P421J4413R244O524J391o440J40J0508J2805
9548D63887J6996L3742L7212M3923O6727Q2334J06715J50440K24961L25253M62624
9537B014814N98812O76115O83693N66805L38518Q5588j86901m41268o12525p03260
9527C020391o79856n61448m23266l12853k23814j51639r9870o8943m7514l0522
9517D20666k2089j5218q311p206J088M813n478n540n991p569p301j145l079P117
9503C44757P339J2100K1396K9683M1268N9774Q2130J28393J83259K61756L35294
$$ plain form
9582 1275198 1589780 1966606 2412616 2889783 3342026 3697880 3833360 3687229 3307584 2797884
9572 2797884 2251227 1752716 1342940 1036312 823741 671854 568058 495921 454843 423324
9562 423324 403876 394932 399247 404874 407881 415302 429715 438959 445483 446874 440434 440574 451082 463887
9548 463887 480883 514625 551837 595760 662487 744821 851536 1001976 1226937 1552190 2014814
9537 2014814 2613626 3289741 3973434 4540239 4878757 4964345 4777444 4336176 3723651 3020391
9527 3020391 2340535 1779087 1355821 1042968 819154 667515 567645 498702 451188 420666
9517 420666 398577 383359 375048 367842 368930 373743 368265 362725 356734 349165 341864 340719 337640 344757
9503 344757 352096 364196 385592 415275 456543 516317 598447 726840 910099 1171855 1507149
9492A507149M00309M29527L96474K74483Q0249j30549l16134m20238m26255l85943
9482A409072l23514k59919j90308j38383r8890o9638m4293l1632k3623j4938j3423
9471B00511q823r009r805o261n359o268p590j4514j1464m738l188j480j177P92
9457A11627K000L828P355Q996K2527L1789M1606O4938Q3875R7578R3428P1436
9445F40983M0425O524k0922l7242o5463r8010j02492q5183o5696m8806l7773j9445
9433A06900j3470j1667j0823p671p884k378o48J373L138k904p018j807k80l885
9419D0976n754q364q45K131r34L153N84n216k712J342L194M033J226j202P58M627
9403C6997M797r47k224j413K027p04k011L566O790K094K535J942L847K810J701
$$ plain form
9492 1507149 1907458 2336985 2733459 3007942 3088191 2957642 2641508 2221270 1795015 1409072
9482 1409072 1085558 825639 635331 496948 398058 328420 284127 252495 228872 213934 200511
9471 200511 191688 182679 172874 166613 161254 154986 147396 132882 121418 116680 113492 112012 110835 111627
9457 111627 113627 117455 124810 133806 156333 188122 229728 294666 378541 476119 569547 640983
9445 640983 681408 687932 667010 629768 564305 466295 363803 278620 212924 164118 126345 106900
9433 106900 93430 81763 70940 63269 55385 53007 52359 53732 56870 53966 46948 45141 44861 40976
9419 40976 35222 26858 26013 28144 27210 30363 30947 25731 23019 24361 27555 31588 32814 31612 32370 36997
9403 36997 41794 40847 38623 37210 39237 38533 36522 40088 46878 48972 51507 53449 57296 60106 61807
9388F1807R171O471O27N283O821K584Q040P402N630Q409R130J3807J2339J1082
9374A68603R188J1488J4270K5392K3276J9396K2733K6768K1365K4416K7275K4273
9362D18443K8037K9806L7069M1084M2043M8756O2645P6339R2875J18257J57318
9351A152672K02853K62142L66112N17773P20170R82982J266591J422300J240020
9342H133615O99359p7830q40970j283545j362762j208447r71183p40121n48983
9333A799133l98662k90630k14659j65066j29050j00672p7683o0076m7758l7965
9323B76912l3795k5451k3066k5934k4203j5151r441j3563j1805o589m418j338
9311H2158k168l599j0227r382m986m162k37l38l479M46r76n57k90j72k340l183
$$ plain form
9388 61807 70978 77449 78076 83359 90180 92764 100804 108206 113836 122245 131375 145182 157521 168603
9374 168603 177791 189279 203549 228941 252217 271613 294346 321114 342479 366895 394170 418443
9362 418443 446480 476286 513355 554439 596482 645238 707883 784222 877097 995354 1152672
9351 1152672 1355525 1617667 1983779 2501552 3221722 4204704 5471295 6893595 8133615
9342 8133615 8832974 8755144 7914174 6630629 5267867 4059420 3088237 2348116 1799133
9333 1799133 1400471 1109841 895182 730116 601066 500394 422711 362635 314877 276912
9323 276912 243117 217666 194600 168666 144463 129312 119871 106308 94503 87914 83496 82158
9311 82158 79990 76391 66164 56782 51796 47634 47397 47059 43580 44026 43050 42493 42203 42031 39691 36508
9295C6508p425n583k949O18m516n26K180j053m11P84m496l321l531K438k483m766
9279A468j903L98K829L838m3r71K133J830l516m53J873m234L139j136k937L055
9263E370K202K270L27k522o651k171m636j474J033k233J822K260K95n94L666K314
9247A278M674K64n195k206K08L980N960J295r762l284k75M3n635n055k598L474
9231a2834Q75P069M933j955j891K804j918m62O457M212M390L057q6q240k255K380
9215F536k177j30k883J54k666L095M72k632k064j556O10J242L070J818K489N15
9199E893J053j275k111l87J092o47M71l09m35O9k819n157m619J730M621j590m919
9182i339K355j184k49L396j836j305Q357p11l871J209n33l207l338K961J276K83
$$ plain form
9295 36508 29083 23500 20551 21169 16653 16127 18307 17254 16843 17627 13131 9810 6279 8717 6234 1468
9279 1468 -435 -37 2792 6630 6587 5616 7749 9579 6063 5610 7483 3249 6388 5252 2315 5370
9263 5370 7572 9842 10169 7647 996 -1175 -5811 -7285 -6252 -8485 -6663 -4403 -4108 -4702 -1036 1278
9247 1278 5952 6216 1021 -1185 -977 3003 8963 10258 496 -2788 -3063 -3020 -8655 -13710 -16308 -12834
9231 -12834 -11959 -4890 43 -1912 -3803 -999 -2917 -3379 3078 7290 11680 14737 14651 6411 4156 6536
9215 6536 4359 4229 1346 1500 -1166 1929 2401 -231 -2295 -3851 -3241 -1999 1071 2889 5378 5893
9199 5893 6946 5671 3560 3173 4265 3618 4089 3780 3345 3414 595 -4562 -9181 -7451 -2830 -4420 -9339
9182 -9339 -6984 -8168 -8417 -5021 -6857 -8162 195 -516 -4387 -3178 -3711 -6918 -10256 -7295 -6019 -5736
9166e736l546q235L122N525J768L078j021M760K652J558K329j513l82J575o62
9151E272j718K955L222K38q143m855j335o027M68K549L184M194K010k89P2k246
9135d49l340j959j822N731P43m673r8M332J768N11J741j630L76k800j149L697
9119I79K752N77r9L559j529l388k787L327J962k39N354P133J927l595n943p593
9103B397n880o117k240K257K271O173K792l177K004j435k714R68R49J55K188J522
9087B113K077K96r60r13k983K197l21j638M200J560J526L823l531m063n8n758
9071b433m290J341L859K252N27l19R35L420K526L603K27J986p533o691m920j857
9055g367M540J129r85l556j255K395M93K811Q54k871K354K073k137k063K082k743
$$ plain form
9166 -5736 -9282 -17517 -14395 -8870 -7102 -4024 -5045 -285 2367 3925 6254 4741 4359 5934 5272
9151 5272 3554 6509 9731 9969 1826 -3029 -4364 -10391 -9923 -7374 -4190 4 2014 1725 1797 -449
9135 -449 -3789 -5748 -7570 -1839 -1096 -5769 -5867 -1535 233 744 2485 855 1231 -1569 -2718 979
9119 979 3731 4308 4209 7768 6239 2851 64 3391 5353 5114 10468 17601 19528 15933 9990 2397
9103 2397 -3483 -9600 -11840 -9583 -7312 -1139 1653 -1524 480 -955 -3669 -2701 -1752 -1597 591 2113
9087 2113 4190 4486 3526 2613 -370 1827 1506 -132 4068 5628 7154 10977 7446 3383 3325 -2433
9071 -2433 -6723 -5382 -1523 729 1256 937 1872 5292 7818 11421 11648 13634 6101 -590 -5510 -7367
9055 -7367 -2827 -1698 -2683 -6239 -7494 -5099 -4606 -1795 -941 -3812 -1458 615 -1522 -3585 -1503 -4246
9039d246k765L449L889J568k982j910K914m5J306J258J066M140O00o724J172N375
9023H065J681l171J85Q324Q643O572N940N02L30L601P115J3857J2306J0909j139
9008H3720j0134q865o860j5014r068m523n954j629R9J396O94n922l867n622p925
8993E26p832J81N745K61l293j65Q886J511K405J770L063k79q935q69N023j724
8977F274o769n490m04K118J779l25q70J297p072j38M681j66j513j797K273p23
8961f845J465k637L515K276o041k389O54L41J855M197K299j256k519l215l189
8946a1489j377K004M881K534k108m049O45j038k348k105L327J736o62j244L856
8931g437K10P93L774J810l241j265j19j28o68l455N662J504L0q07q70l097o47
$$ plain form
9039 -4246 -7011 -3562 327 1895 -1087 -2997 -83 -128 1178 2436 3502 7642 8242 1518 2690 8065
9023 8065 9746 6575 6760 15084 23727 30299 36239 36741 37071 40672 47787 61644 73950 84859 83720
9008 83720 73586 64721 57861 42847 33779 29256 23302 21673 21772 23168 23862 17940 14073 8451 526
8993 526 -7306 -7125 -1380 -1119 -4412 -4577 4309 5820 8225 9995 13058 12779 3844 2975 7998 6274
8977 6274 -495 -5985 -6389 -4271 -2492 -2817 -3687 -2390 -9462 -9600 -4919 -5085 -6598 -8395 -6122 -6845
8961 -6845 -5380 -8017 -4502 -2226 -8267 -10656 -10002 -9661 -7806 -3609 -1310 -2566 -5085 -8300 -11489
8946 -11489 -12866 -10862 -5981 -3447 -5555 -9604 -8959 -9997 -12345 -14450 -11123 -9387 -10049 -11293 -7437
8931 -7437 -7227 -6434 -2660 -850 -4091 -5356 -5475 -5603 -6271 -9726 -4064 -2560 -2530 -3337 -4207 -7304 -7951
8914g951J925p49j01L216n131k182K049L69k173J378K783k42j236J279J347K374
8898c045O578L758M82n143n068R92n85J307K14N27P36j377J32P07R22P213n723
8881B627J808L921m353k176o22K32K038k371J914N576l04j043k605j584M43M850
8865H351q42k380J364R94K229L123L593n90j206J761K814j000J767L179O828M233
8849C4218R119J242K257L7J57L371M406O181Q271P019J3129J9228K4294M0872
8835A73801N9668Q9989J26812J44921J18398N2315m4606j27317j43868j21072
8825C29041r5434o5709m3921k3986j8044k0994o962p012o319N08J742k612k752
8812C7546K133M59K436P793j45J042o17k506L402K215j396K097k96K543p60Q784
$$ plain form
8914 -7951 -6026 -6775 -6876 -3660 -8791 -10973 -8924 -8555 -10728 -9350 -6567 -6809 -8045 -6766 -5419 -3045
8898 -3045 3533 7291 7773 2630 -2438 -1446 -2031 -724 -510 17 753 -624 -492 215 1137 8350 2627
8881 2627 4435 8356 4003 1827 1205 1437 3475 1104 3018 8594 8290 7247 4642 3058 3501 8351
8865 8351 7509 5129 6493 7487 9716 12839 16432 15842 14636 16397 19211 18211 19978 23157 29985 34218
8849 34218 43337 44579 46836 46873 47030 50401 54807 60988 69259 76278 89407 108635 132929 173801
8835 173801 233469 323458 450270 595191 713589 765904 721298 593981 450113 329041
8825 329041 233607 167898 123977 99991 81947 60953 53991 46979 40660 41168 42910 40298 37546
8812 37546 39679 40138 42574 50367 50222 51264 50647 48141 51543 53758 52362 54459 54163 56706 55946 64730
8796F4730J0164N452Q279K0571L0162M0202O5529R7654J28535J37358R4994K8215
8784G31845o8238j33234j36533j11453q2866n8141m2852k5985j3260j0120r098
8773D0065o110l957R48Q85o347k878l098k623n390L19r22k818m718n72p8M755
8757G461M095K061J318k15k47l622k686N21m048k422L578P519J222q484k855l35
8741B861l52J68L163J258k94K60L705R78J094q380j0641o834K37N838K029K858
8725b052J335l780k413J524j189k137Q46L979Q539P557O527p544o397q854J313
8710b746J0262O396L266j568K235k542l120k792l62m212P45l570K379Q48j0111
8695d892n667J366L635j513N671J0803N612P471L507K431j619q983j6010j1979
$$ plain form
8796 64730 74894 80346 88625 109196 139358 179560 245089 342743 471278 608636 703630 731845
8784 731845 663607 530373 393840 282387 199521 141380 98528 72543 59283 49163 40065
8773 40065 33955 29998 30946 31831 25484 22606 19508 16885 11495 11814 10892 8074 3356 2784 2706 7461
8757 7461 11556 13617 14935 14720 14473 10851 8165 8686 4638 2216 5794 13313 14535 6051 3196 2861
8741 2861 2509 2677 5840 7098 6804 7064 10769 11747 12841 4461 -6180 -13014 -12777 -6939 -4910 -2052
8725 -2052 -717 -4497 -6910 -5386 -6575 -8712 -7866 -3887 4652 12209 18736 11192 4795 -4059 -2746
8710 -2746 7516 13912 17178 15610 17845 15303 12183 9391 9029 4817 5562 1992 4371 5219 -4892
8695 -4892 -10559 -9193 -5558 -7071 -1400 9403 15015 22486 25993 28424 26805 17822 1812 -10167
8681a0167p790k639P915P873P465Q413O875K72K053k108k787k538K427K295n84
8666A6975K501M800j664j0174j3191p116j026P39K685K529k606n85n689l610J812
8651a3620l053K651l222n145J197L538J0641J0012M176k360m954k389k785K019
8637c294L206L43n588p905r81M695M290L25N03j800R68k757O534N082p08p85N78
8620B706J82j534K547J992K342J206n234k329k301l227L586p08k321J205P13J369
8604A94J873L223O724K441p991k599l393k076j535L350J100J700k10K90k194m059
8588c162j70O25N012J022m094m366p80o37L525k835m553k556M801L380K808k8
8572b008k461l703p968O923J0162J816j9j171j545l677j40k99L07L840P009P51
$$ plain form
8681 -10167 -17957 -20596 -12681 -4808 2657 11070 17945 18217 20270 18162 15375 12837 15264 17559 16975
8666 16975 19476 24276 22612 12438 -753 -7869 -8895 -8156 -5471 -2942 -5548 -6133 -11822 -15432 -13620
8651 -13620 -16673 -14022 -17244 -22389 -21192 -17654 -7013 2999 7175 4815 -139 -2528 -5313 -3294
8637 -3294 -88 255 -5333 -13238 -14219 -9524 -5234 -4909 -4406 -6206 -5238 -7995 -1461 3621 2913 2128 2706
8620 2706 2888 1354 3901 5893 8235 9441 4207 1878 -423 -3650 -64 -772 -3093 -1888 -1175 194
8604 194 2067 5290 12014 14455 6464 3865 472 -1604 -3139 211 1311 3011 2801 3091 897 -3162
8588 -3162 -3332 -2707 2305 3327 -767 -5133 -5913 -6550 -3025 -5860 -10413 -12969 -8168 -4788 -1980 -2008
8572 -2008 -4469 -8172 -16140 -9217 945 2761 2742 1571 26 -3651 -3791 -4090 -3783 57 7066 7817
8556G817J021L25k93o622m83N526K125j925o87L503O270R066L545l344r3j549
8540B4202K992L944K302n34n565n247j273m177n003k356n356m171l241K426j29
8525a186J439j998k174q84j1r15M715L368J00l332m230m166n14J383N07J447J315
8508e136J283L472K014J314l698k284k773m373L944O850M757O587O562M439J526
8493B4484q02k462q060n141m553n213l915j426j061l643L602O915j216p439M029
8478e901N45L973R05m45k613o69J487n762k065L889J734J593O04l931M59L389
8462b808k037m579L754L996Q20K254N322l146O95j572N324J380q363j820J665
8447H85L191L210k942k620o234k806J743L870J249J062L374J351j355k089L157
$$ plain form
8556 7817 8838 9163 8870 2248 1765 7291 9416 7491 6804 10307 16577 25643 29188 25844 25751 24202
8540 24202 27194 31138 33440 32906 27341 22094 20821 16644 11641 9285 3929 -242 -3483 -1057 -1186
8525 -1186 253 -1745 -3919 -4803 -4814 -5729 -1014 2354 2454 -878 -5108 -9274 -9788 -8405 -7898 -6451 -5136
8508 -5136 -3853 -381 1633 2947 -751 -3035 -5808 -10181 -6237 613 5370 11957 18519 22958 24484
8493 24484 23682 21220 13160 8019 3466 -1747 -5662 -7088 -8149 -11792 -8190 -1275 -2491 -9930 -5901
8478 -5901 -5356 -1383 -478 -923 -3536 -4205 -2718 -8480 -10545 -6656 -4922 -3329 -2725 -6656 -6197 -2808
8462 -2808 -4845 -9424 -5670 -1674 -854 1400 6722 3576 4271 2699 8023 9403 1040 -780 885
8447 885 4076 7286 4344 1724 -4510 -7316 -5573 -1703 -454 608 3982 5333 3978 1889 5046
8432E046L557n408K50n233j987Q32n33K477j290P151k40r004l940J456O903M883
8416D920J034j640M399K247J101j621j941k003p534n016j01j121j107J421N32
8401f430Q93L24q55j705R33O48K317N14R86L678o682r172k127M003M220P71l500
8384a1184k428L510M82M496M116r94k916n49j712R60L261K630M794j068j57k444
8368G97J716O065j361o129k92k957R89J445l017J624O72m6O05j825m230n638K565
8351i017P461R58K228k895l807L785P942L419n341r722J317j0K075J504k948R10
8335b141J4J683R54P18r82q03K226J189n53J680m996k203J778K577J333l745j695
8318b966K07m245k460J118J944r50l349l696K064O399J031j197l47k506k851M342
$$ plain form
8432 5046 8603 3195 3445 -1788 -3775 -2943 -3476 -999 -2289 4862 4622 -4382 -8322 -6866 37 4920
8416 4920 5954 4314 8713 10960 12061 10440 8499 6496 -1038 -6054 -6155 -7276 -8383 -6962 -6430
8401 -6430 -5537 -5213 -6068 -7773 -6840 -6192 -3875 -3361 -2375 1303 -5379 -14551 -16678 -12675 -8455 -7684 -11184
8384 -11184 -13612 -10102 -9620 -5124 -1008 -2002 -4918 -5467 -7179 -6219 -2958 -328 4466 3398 3241 797
8368 797 2513 8578 7217 1088 796 -2161 -1172 273 -2744 -1120 -448 -494 111 -1714 -5944 -11582 -9017
8351 -9017 -1556 -598 1630 -1265 -5072 -1287 6655 10074 4733 -4989 -3672 -3682 -1607 -103 -3051 -2141
8335 -2141 -2127 -444 510 1228 246 -557 1669 2858 2305 3985 -1011 -3214 -1436 1141 2474 -1271 -2966
8318 -2966 -2759 -7004 -9464 -8346 -6402 -7352 -10701 -14397 -12333 -5934 -4903 -6100 -6447 -8953 -11804 -7462
8302g462p24k821l57L585o79l27J428j55n055J23L128K177L047L36L001M060m565
8285a260K063N55m33J597j036r63m233p361M59J940q77J10L444L474q08j240M79
8268d090k440m797M040L698k662j30o91k084K835P827K44M8k714R61o76k025m602
8251g258J189N147n61N1k785l963J866N315R80K439L729p39o898k491R57O20K224
8234a78k991J353r79l644K374M068J587J478l138l321J910j363m041j203K141
8219e947P59k946j288L707M88L050L09j074k400j575N21k439l60J011J696J741
8203d747J408M823O32K324L007k482o692n166K112q3Q86O990K748r679m290L834
8187d375M376j267N56r00o634j879J028J73M507L606RK541j688j730j003n622
$$ plain form
8302 -7462 -8186 -11007 -11364 -7779 -8458 -8785 -7357 -7512 -12567 -12444 -9316 -7139 -4092 -3756 -755 3305 -1260
8285 -1260 803 1358 925 2522 1486 523 -3710 -11071 -10612 -8672 -9549 -9439 -5995 -2521 -3329 -4569 -4090
8268 -4090 -6530 -11327 -7287 -3589 -6251 -6381 -7072 -9156 -6321 1506 1750 1798 -916 45 -631 -2656 -7258
8251 -7258 -6069 -922 -1483 -1432 -4217 -8180 -6314 -999 -19 2420 6149 5410 -1488 -3979 -3022 -2402 -178
8234 -178 -3169 -1816 -2795 -6439 -4065 3 1590 3068 -70 -3391 -1481 -2844 -6885 -8088 -5947
8219 -5947 -5188 -8134 -9422 -5715 -5227 -2177 -1868 -2942 -5342 -6917 -6396 -8835 -9195 -8184 -6488 -4747
8203 -4747 -3339 1484 2116 4440 7447 4965 -1727 -6893 -4781 -4864 -3978 3012 5760 -3919 -8209 -4375
8187 -4375 1 -1266 -710 -1610 -8244 -10123 -9095 -8922 -4415 -809 -800 1741 53 -1677 -2680 -8302
8171h302q00J937J688l918p98M061L682j351j450j024M818K210k047r00L15N84
8155a295k802j481K33k098J005n14R72J555J394k527j812Q66k453N45L637N578
8139H03j850l695j118R00J092j575J139j5K269j302l040R07K200l167k668j329
8123a0449Q02M56K643M327J360N37n059N071L840k313L547l819j0136j000R92
8108i201L62K576J715J363j717L485L612l138J500O906N358Q10M755K622o9j89
8092B0750o01l736p320r375l470K531P071j921n503k687P59K882K836j323M76
8077A369m985J590k032k290j306j840L677J343n017m111O22K797r93M743J811
8062d622k037j800Q87N600N574J907J809K33O054K851J964N088O698O094O691
$$ plain form
8171 -8302 -9102 -7165 -5477 -9395 -10193 -6132 -2450 -3801 -5251 -6275 -1457 753 -1294 -2194 -1879 -1295
8155 -1295 -4097 -5578 -5345 -7443 -6438 -6952 -5980 -4425 -3031 -5558 -7370 -6504 -8957 -8412 -4775 803
8139 803 -1047 -4742 -5860 -4960 -3868 -5443 -4304 -4319 -2050 -3352 -6392 -5485 -3285 -6452 -9120 -10449
8123 -10449 -9647 -9191 -6548 -2221 -861 -324 -5383 -312 3528 1215 4762 943 -9193 -10193 -9201
8108 -9201 -8839 -6263 -4548 -3185 -4902 -1417 2195 -943 557 7463 12821 13631 18386 21008 20939 20750
8092 20750 20149 16413 9093 -282 -3752 -1221 5850 3929 -1574 -4261 -3502 -620 2216 893 1369
8077 1369 -3616 -2026 -4058 -6348 -7654 -9494 -5817 -4474 -9491 -13602 -12980 -10183 -11176 -6433 -4622
8062 -4622 -6659 -8459 -7572 -1972 3602 5509 7318 7551 13605 16456 18420 23508 30206 36300 42991
8047D2991j773r533l490n397p865n545q155J109o9j652P60r63k741m5O2q28p167
8030a0301l069N926N873O117m583n372MR97J792M809M511n98n4m187J012j800
8014A077k996R24K189M184K432j789N46k929K519M610O077J407L71L262l352k101
7998A6431r23l260l334o35j046r07j834m923k645J306j517l43J677j029M352K512
7982C882j306j589R23M218Q76n116N583Q54k376j555N74k849l521j302R16J788
7966@O58m52m100k534L945j369q69Q66M999P288l587k108J873M862O183l40k655
7949A2660j112l761M772j152l645l741K863J654n431K779K903K349M328r5J171
7934A6542r10p948m298J021L11j886J306l296m183J844L019m15N592n3k877K146
$$ plain form
8047 42991 41218 31685 28195 22798 14933 9388 1233 2342 2273 621 1381 418 -2323 -2368 -2306 -3134 -10301
8030 -10301 -13370 -7444 -1571 4546 -37 -5409 -5405 -4408 -2616 2193 6704 6106 6052 1865 2877 1077
8014 1077 -1919 -995 1194 5378 7810 6021 6567 3638 6157 10767 16844 18251 18622 21884 18532 16431
7998 16431 15508 12248 8914 8279 7233 6326 4492 -431 -3076 -1770 -3287 -3630 -1953 -2982 1370 3882
7982 3882 2576 987 1910 6128 7004 1888 7471 8325 5949 4394 4968 2119 -1402 -2704 -1788 0
7966 0 658 206 -3894 -6428 -2483 -3852 -4721 -3855 1144 8432 4845 2737 4610 9472 15655 15315 12660
7949 12660 11548 7787 12559 11407 7762 4021 6884 8538 3107 5886 8789 11138 15466 15371 16542
7934 16542 15632 7684 3386 4407 4718 2832 4138 842 -3341 -1497 1522 1107 6699 6646 3769 5915
7918E915l498J602L678L512j676n144k492J83J163Q83O77L849L264J136J824K153
7902A7029M04k13J130K26k428k871n29j166k712L333L036K5Q22L345l184n047
7886A1200o465k163m10j953n068M524K379J328n40k997K639L724M12k23j583K068
7870F872j747n42J842L376L628J859n69k066l471l00o89k534l474J684p91P46
7854C824j326J292J866J821j903l252k206j88K306k214r2K568P58J093L608L690
7838A1645l843K26k29j902j463o27o396j505M476J550K593k435j998J390M055
7823E537L115n980l654j491l250k322L631N494Q65L551J715r90k311l5K40o7j020
7806C028J645m349l082k85j824k366P61O03j756K332K14m96J759j346K753L087
$$ plain form
7918 5915 2417 4019 7697 11209 9533 4389 1897 2080 3243 4126 4803 8652 11916 13052 14876 17029
7902 17029 17433 17220 18350 18576 16148 13277 12748 11582 8870 12203 15239 15264 16086 19431 16247 11200
7886 11200 4735 2572 2162 209 -4859 -335 2044 3372 2832 -165 2474 6198 6610 6387 4804 6872
7870 6872 5125 4583 6425 9801 13429 15288 14719 12653 9182 8882 8193 5659 2185 3869 3078 3824
7854 3824 2498 3790 5656 7477 5574 2322 116 -72 2234 20 -72 2496 3254 4347 7955 11645
7838 11645 7802 8028 7799 5897 4434 3807 -2589 -4094 382 1932 4525 2090 92 1482 5537
7823 5537 8652 2672 -982 -2473 -5723 -8045 -4414 1080 1945 5496 7211 6221 3910 3875 4115 4048 3028
7806 3028 4673 324 -2758 -3043 -4867 -7233 -6472 -5869 -7625 -5293 -5079 -5575 -3816 -5162 -2409 678
7790F78J123O82j758k209m62j896O48k527j365K95N258j221K145j659k739l050
7774h057j259L914N689k078n449j454N21K38j533j82K695Q20J535P25j347K733
7758b489L210n034o83j200K23k483J378L501j790l52K416j907L68J548q53k29
7742d376M815N67l07K633j705k156L461K105j511j620J922n921o338l385J956
7727i860M54k192M857k418r04O675J710L30l604p641k038j188p19N518O210J415
7711c395l67q67l320p93k996k705M054K039j101J174J643O019L744l314n415J199
7695d401K618L19j984m652l25k986j339J898L084j845K122R287L843j600O88n728
7679a001J753J975p751j932K625O20K397n54K682j189n115k330O1n747O229K084
$$ plain form
7790 678 1801 2483 725 -1484 -1946 -3842 -3194 -5721 -7086 -6791 -1533 -2754 -609 -2268 -5007 -8057
7774 -8057 -9316 -5402 287 -1791 -7240 -8694 -8173 -7935 -9468 -9650 -6955 -6135 -4600 -3875 -5222 -2489
7758 -2489 721 -4313 -4996 -6196 -5973 -8456 -7078 -3577 -5367 -5719 -3303 -5210 -4842 -3294 -4147 -4376
7742 -4376 439 1006 699 3332 1627 -529 2932 5037 3526 1906 3828 -2093 -8431 -11816 -9860
7727 -9860 -9406 -11598 -6741 -9159 -10063 -3388 -1678 -1348 -4952 -12593 -14631 -15819 -16538 -11020 -4810 -3395
7711 -3395 -3762 -4629 -7949 -8742 -11738 -14443 -10389 -8350 -9451 -8277 -6634 -615 3129 -185 -5600 -4401
7695 -4401 -1783 -1464 -3448 -8100 -8425 -11411 -12750 -10852 -7768 -9613 -7491 1796 5639 4039 4727 -1001
7679 -1001 752 2727 -5024 -6956 -4331 -3711 -1314 -1868 814 -375 -5490 -7820 -7759 -13506 -7277 -5193
7663e193l610J220L115M187j977P98N700q1n81l412k492J455k605n5L82K616J958
7646A425l230k455N607j004j847M890J840k799q361J409K522j856J401j687K693
7631a452J568p992o450n37K608J366J990J762j21j206n29k838P02P5K424M173
7615d457M788j361m369M487K18r78R54K737K841j858k856l203n023J512M400p18
7599b886m780k721Q250k032r034j224L708M888p86k551l91P597J980l116J978
7584a120L249Q81k06k063l282k603l557M03N496k447m831K177M167N98m53N46
7568c045k170L504N365M067k409n415r926l897R3L33N165L259N85j651K083J791
7552b268k499m750J751K901Q5j386j640L431k004l16j858J219j999j105J076K097
$$ plain form
7663 -5193 -8803 -7583 -4468 -281 -2258 -1460 4240 4159 3578 166 -2326 -871 -3476 -3531 -3149 -533 1425
7646 1425 -1805 -4260 1347 343 -1504 3386 5226 2427 -5934 -4525 -2003 -3859 -2458 -4145 -1452
7631 -1452 116 -7876 -14326 -14863 -12255 -10889 -8899 -7137 -7258 -8464 -8993 -11831 -11129 -11054 -8630 -4457
7615 -4457 331 -1030 -5399 -912 -694 -1672 -718 2019 4860 3002 146 -3057 -8080 -6568 -2168 -2886
7599 -2886 -7666 -10387 -2137 -4169 -13203 -14427 -10719 -5831 -6617 -9168 -9559 -1962 18 -3098 -1120
7584 -1120 2129 3010 2804 741 -2541 -5144 -8701 -8298 -2802 -5249 -10080 -7903 -3736 -3138 -3591 -3045
7568 -3045 -5215 -1711 3654 7721 5312 -103 -10029 -13926 -13833 -13500 -8335 -5076 -4491 -6142 -4059 -2268
7552 -2268 -4767 -9517 -7766 -4865 -4780 -6166 -7806 -4375 -6379 -6695 -8553 -7334 -9333 -10438 -9362 -7265
7536g265O935L933j869o944l05m204l542M111O846M588j106k135m598m72L995
7521b032j617n26j490r61j3j562O057j481M375k131k051k91p7P31L289J293n635
7504d122j782J278o297n553L938M711N857L588L44l678r85j118o479M079P963
7489A744n77J392N040l515p868J333L269J026M238k051l604m37j658n048J575
7474e141K716K598J483J04j850j863K73r40k872l986K11L891p7M562l121J073
7458b939j81Q065L30l799n147m597k567N394L047l229o155l075J592J851L749
7443g661N236K792M340j069l14K361j241m615j648L702m598m308O67l07l21N5
7427f929L849L922j461n79n24m96k039L505J905j262m08n353j379J349M354R49
$$ plain form
7536 -7265 -330 3603 1734 -5210 -5515 -9719 -13261 -9150 -2304 2284 1178 -957 -5555 -6027 -2032
7521 -2032 -3649 -4175 -5665 -6626 -6639 -8201 -2144 -3625 750 -1381 -3432 -3723 -3800 -3069 220 1513 -4122
7504 -4122 -5904 -4626 -10923 -16476 -12538 -7827 -1970 1618 1962 -1716 -2701 -3819 -10298 -6219 1744
7489 1744 1167 2559 7599 4084 -3784 -2451 818 1844 6082 4031 427 -10 -1668 -6716 -5141
7474 -5141 -2425 173 1656 1760 -90 -1953 -1680 -2620 -5492 -9478 -9267 -5376 -5453 -891 -4012 -2939
7458 -2939 -3120 4945 5275 1476 -3671 -8268 -10835 -5441 -2394 -5623 -11778 -14853 -13261 -11410 -7661
7443 -7661 -2425 367 4707 3638 3324 5685 4444 -171 -1819 1883 -2715 -7023 -6356 -6663 -6984 -6929
7427 -6929 -3080 842 -619 -1198 -1722 -2218 -4257 -752 1153 -109 -517 -5870 -7249 -5900 -1546 -597
7411e97p33J695j420m208l004o28J426m659r39L557Q80k737L206O427j457k263
7395e454O9K778k538K635K545J418j784l949l79O593o25n060j973K43K364P35
7379b382q35L390k937O92j433k006j860j577l022N780O551j440m146r23N887j232
7363a493n68L327J363J191K53r70n368l486l257k2J235L569l406r78N697k000
7347d913m064K591K580L306K704K991K764k783L40J1m306n769k697J753L525Q85
7331a082n78M45L983J717k519q94R22N627k8p269l051J563J137J956k651O76j349
7314a395m744l254Q439L761q73n115p4k376m295K128L341p17j712k945j395K119
7298i107N371k335n455P497M83O276p131k643L545N918K43k008n06K04N3J657
$$ plain form
7411 -597 -1330 365 -1055 -5263 -8267 -8895 -7469 -12128 -13067 -9510 -8630 -11367 -8161 -1734 -3191 -5454
7395 -5454 -5385 -2607 -5145 -2510 35 1453 -331 -4280 -4659 1934 1309 -3751 -5724 -5481 -3117 -2382
7379 -2382 -3217 173 -2764 -2072 -3505 -5511 -7371 -8948 -11970 -6190 361 -1079 -5225 -6148 -261 -1493
7363 -1493 -2061 1266 2629 3820 4073 3103 -2265 -5751 -9008 -9030 -7795 -4226 -7632 -8610 -2913 -4913
7347 -4913 -8977 -6386 -3806 -500 2204 5195 7959 5176 5516 5527 1221 -4548 -7245 -5492 -1967 -1082
7331 -1082 -1660 -1215 2768 4485 1966 1072 1994 7621 7593 324 -2727 -1164 -27 1929 -722 -46 -1395
7314 -1395 -6139 -9393 -954 2807 1934 -3181 -3255 -5631 -9926 -7798 -4457 -5174 -6886 -9831 -11226 -9107
7298 -9107 -3736 -6071 -11526 -4029 -3546 2730 -4401 -7044 -3499 2419 2662 654 148 352 405 2062
7282B062n664m148K48P198K832l262k378l166k320O383L766m96j656K701M141
7267F241k478l738k158P328J399k041j142o54J055M322J103m506n962q886l317
7252a3434M447O722J333l748K480k105J558j990o80L928J23k283K515J759l32
7237B93m625l244p29k886n6N454L084q82J651j850j292M34l4k911K711j807M063
7220b626j95l67K161M872j215J196j703m428k084L473J672q21l129K572j005N32
7204a095o5l365l299J070j702J99k354j03o5L47K430M478J803o038m859j281J546
7187a2353J146K496K827M837O092k791P1j681j883J74l019L72L862O032K530m501
7171D211k341l958l859n65J051J440J051j055m671l238N091N898J374m111k163
$$ plain form
7282 2062 -3602 -7750 -7502 -304 2528 -734 -3112 -6278 -8598 -2215 1551 1055 -601 2100 6241
7267 6241 3763 25 -2133 5195 6594 4553 3411 2757 3812 8134 9237 4731 -1231 -10117 -13434
7252 -13434 -8987 -2265 -932 -4680 -2200 -4305 -2747 -4737 -5417 -1489 -1366 -3649 -1134 625 293
7237 293 -4332 -7576 -8305 -11191 -11247 -5793 -2709 -3591 -1940 -3790 -5082 -4648 -4682 -7593 -4882 -6689 -2626
7220 -2626 -2821 -3188 -1027 3845 2630 3826 2123 -2305 -4389 -916 756 -65 -3194 -622 -1627 -1095
7204 -1095 -1160 -4525 -7824 -6754 -8456 -8257 -10611 -10714 -10779 -10432 -8002 -3524 -1721 -7759 -12618 -13899 -12353
7187 -12353 -11207 -8711 -5884 -1047 5045 2254 2325 644 -1239 -1065 -4084 -3712 150 6182 8712 4211
7171 4211 1870 -2088 -5947 -6512 -5461 -4021 -2970 -4025 -8696 -11934 -6843 -945 429 -3682 -5845
7156e845P74K344k548k59K368j720k49J578J106J451N83pk320m9l917l17L180
7139c847Q33k184J471M267K185j592l385k536J477L16p91j430j42j992J087n73
7123f836K684k872J102J446k313j497K063K680O53K350j981P300M29o702l008
7108d502l718J940j598R68M891p08m439J635K636m20J265K221j222m020J415K802
7092h54M68L09O88M58k025k567J32l258n475L657O232R6o80L579K372m65l949
7075a282j610J58J903j830j359K947m648l611J084L766M9m172j347K708L158J064
7059c022k107r67k418P85L150m783M12L695J549L188n86l338k244J623R49p48
7043d862r6n44K82j884j151M254K207n301M054J417j336J573l124n90J573K796
$$ plain form
7156 -5845 -5071 -2727 -5275 -5534 -3166 -4886 -5135 -3557 -2451 -1000 -417 -424 -2744 -2793 -6710 -7027 -3847
7139 -3847 -3014 -5198 -3727 540 2725 1133 -2252 -4788 -3311 -2995 -3786 -5216 -5358 -7350 -6263 -6836
7123 -6836 -4152 -7024 -5922 -4476 -6789 -8286 -6223 -3543 -2890 -540 -2521 4779 5208 -1494 -4502
7108 -4502 -8220 -6280 -7878 -6910 -2019 -2727 -7166 -5531 -2895 -3315 -2050 171 -1051 -5071 -3656 -854
7092 -854 -386 -77 611 1069 -956 -3523 -3391 -6649 -12124 -8467 -2235 -2139 -2819 760 3132 2667 -1282
7075 -1282 -2892 -2734 -831 -2661 -4020 -1073 -5721 -9332 -8248 -4482 -4433 -8605 -9952 -7244 -4086 -3022
7059 -3022 -5129 -6096 -8514 -7729 -4579 -9362 -8950 -5255 -3706 -518 -1104 -4442 -6686 -5063 -4114 -4862
7043 -4862 -4958 -5502 -5220 -7104 -8255 -4001 -1794 -7095 -3041 -1624 -2960 -1387 -4511 -5101 -3528 -732
7027g32J919j942m49k492J002J841j940l575j12N123j144j07J028K536m518m178
7011g740m187L31N167j626m391J690N520M607m76j063q664l432L750K918j809
6996i405K804J528L874n13k252j851j5j72l22J313r97k730p44L158K656J021K165
6979d82j260p193M69M895J391k972M42K621r24O44K49j462J74M193l90j752K531
6962A174o6k595o737j426L64Q92J733N054l680L03K953L249m959Q23j505l173
6946g596L599l13m032K012J78k028M981P176l725j417k897p56L947j565m380j334
6930h150L611J759M08l695j91K329M265J291k154l64M351j052r60l935j102K93
6914c296l160P5K54J291K744R62M07J342j884k034Q26k375k364l660k042N81L001
$$ plain form
7027 -732 1187 -755 -1204 -3696 -2694 -853 -2793 -6368 -6480 -1357 -2501 -2608 -1580 956 -3562 -7740
7011 -7740 -11927 -11596 -6429 -8055 -12446 -10756 -5236 -629 -1105 -2168 -10832 -14264 -10514 -7596 -9405
6996 -9405 -6601 -5073 -1199 -1712 -3964 -5815 -5830 -6002 -6324 -5011 -6008 -8738 -9482 -6324 -3668 -2647 -482
6979 -482 -1742 -8935 -8466 -3571 -2180 -5152 -4710 -2089 -3013 -2369 -2120 -3582 -3408 785 395 -1357 1174
6962 1174 1108 -1487 -8224 -9650 -9286 -8394 -6661 -1607 -5287 -4984 -2031 1218 -3741 -2918 -4423 -7596
6946 -7596 -3997 -4310 -8342 -6330 -6152 -8180 -3199 3977 252 -1165 -4062 -4818 -871 -2436 -6816 -8150
6930 -8150 -4539 -2780 -2372 -6067 -6258 -3929 336 1627 -527 -891 3460 2408 1448 -2487 -3589 -3296
6914 -3296 -6456 -6381 -6127 -4836 -2092 -1130 -723 619 -1265 -3299 -2473 -4848 -7212 -10872 -12914 -12333 -9332
6897i332J953K231J784J525j652k925J687J707j836m406k651M965N942M21K340
6882A753j424p430p111k206M137L789j198l356R35L132j145n113j04Q347M538
6867b456j051O05L325k432k870L906l44J02j591j884K44J55N31K417K816J793
6851C266M12K054r90j771l755j367k30p76J532r1m962k298K108M466P08J263L45
6834h6M819J551m855K602o332m651K558J229n38k07k334J892k185N46L82Q61J793
6817b955m618J22k645K960Q364M295o523p607j73M827N02k63q26j991J307L011
6801b213J080M08j681l862j050L510J930k400J261J957J32m215l630j964J486
6786i251J352k503K276M827K814j523j482L904j169K288M383L641k237l769m158
$$ plain form
6897 -9332 -7379 -5148 -3364 -1839 -3491 -6416 -4729 -3022 -4858 -9264 -11915 -6950 -1008 -587 1753
6882 1753 329 -7101 -14212 -16418 -12281 -8492 -9690 -13046 -12111 -8979 -10124 -15237 -15341 -6994 -2456
6867 -2456 -3507 -2902 423 -2009 -4879 -973 -1317 -1215 -2806 -4690 -4446 -4291 -3760 -1343 1473 3266
6851 3266 3678 5732 4742 2971 -784 -2151 -2381 -3157 -1625 -1716 -6678 -8976 -6868 -2402 -1694 -431 -86
6834 -86 4733 6284 1429 4031 -2301 -6952 -4394 -3165 -3703 -3910 -6244 -4352 -6537 -5991 -5609 -4748 -2955
6817 -2955 -7573 -7451 -10096 -7136 1228 5523 -1000 -8607 -8780 -3953 -3451 -3714 -4540 -6531 -5224 -2213
6801 -2213 -1133 -725 -2406 -6268 -7318 -3808 -1878 -4278 -3017 -1060 -928 -5143 -8773 -10737 -9251
6786 -9251 -7899 -10402 -8126 -3299 -485 -2008 -3490 414 -755 1533 5916 9557 7320 3551 -607
6771f07q61j380O72J029M937J452n794j721k130L676N293J979l431k336l87m36
6755d5K11K973L912j414kl129M90J714L859m729m045p78j871N25m909n335p72
6738a3345M705R563M019j037J373k446l566M088l59m546K809o524j770K52Q66
6723e918j476n11M627K701M003q94k915k977p72L85K680K145J275N55n625K672
6707d5L636j602o618Q29N683r28m455k129Q70J68L173k24k072J914J003n872l108
6690i777K255K528M503K130N6P2l418r61J369L89q900j721L172K953M255N422
6674D327l130p342k267K203L354j365j368R55n73L097M665L050j434k411m94m058
6658b791l587M003M791l989l450j769J277m013j019O011L845M060J504n61l473
$$ plain form
6771 -607 -1468 -2848 -2176 -1147 3790 5242 -552 -2273 -4403 -727 4566 6545 3114 778 391 -45
6755 -45 166 3139 7051 5637 5635 2506 2996 4710 8569 3840 -205 -983 -2854 -2329 -7238 -12573 -13345
6738 -13345 -8640 923 4942 3905 5278 2832 -734 3354 2995 -1551 1258 -5266 -7036 -6784 -5918
6723 -5918 -7394 -7905 -3278 -577 3426 2532 -383 -3360 -4132 -3747 -1067 1078 2353 2908 -2717 -45
6707 -45 3591 1989 -4629 -3800 1883 955 -3500 -5629 -4759 -4591 -1418 -1642 -3714 -1800 -797 -6669 -9777
6690 -9777 -7522 -4994 -491 1639 1695 1767 -1651 -2612 -1243 -854 -9754 -11475 -8303 -5350 -1095 4327
6674 4327 1197 -6145 -8412 -6209 -2855 -4220 -5588 -4633 -5206 -2109 2556 5606 4172 1761 1267 -2791
6658 -2791 -6378 -2375 2416 -1573 -5023 -6792 -5515 -9528 -10547 -4536 -691 3369 4873 4312 839
6643H39q685j904M262M979k799K874J6k918K886r4l474k87K70j30J650l79N254
6626B360l915m554n520K020M383L872l617m187J226N46k217K402p3M047K997J339
6610A109K35j370L97o457N308P954L786k250n766l712j545K786J084l432m84K919
6594E62j55Q7l3K180k745j664r45j663r22L908m12j887N435J460k195L314L198
6577G523j096P5k620l881l734J489J930J75j747J730n582J517O432L410j82l584
6561A855M572p80n873l318j141j389Q89N446R44J408P435j283p613m861K311L436
6545B038k455n57J97J22O39j628j864m998J639L547J254m940J499N889P22J317
6529B421n091j965Q70j671l97J822J369l208j547n06J575n62r65J318K694K826
$$ plain form
6643 839 -7846 -9750 -5488 -509 -3308 -434 -418 -3336 -450 -544 -4018 -4305 -4035 -4165 -2515 -2894 2360
6626 2360 -1555 -6109 -11629 -9609 -5226 -1354 -4971 -9158 -7932 -7386 -9603 -7201 -7274 -3227 -230 1109
6610 1109 1344 -26 371 -6086 -778 7176 10962 8712 2946 -766 -2311 475 1559 -1873 -2357 562
6594 562 407 494 461 2641 -104 -1768 -2713 -4376 -5298 -1390 -1802 -3689 1746 3206 1011 4325 7523
6577 7523 6427 6502 3882 1 -3733 -2244 -314 -139 -1886 -156 -5738 -4221 2211 5621 5439 1855
6561 1855 6427 5647 -226 -3544 -4685 -6074 -5185 261 1205 2613 10048 8765 1152 -3709 -1398 2038
6545 2038 -417 -974 -777 -655 -16 -1644 -3508 -8506 -6867 -3320 -2066 -7006 -5507 382 1104 2421
6529 2421 -2670 -4635 -3765 -5436 -5833 -4011 -2642 -5850 -7397 -7903 -6328 -6890 -7855 -6537 -3843 -1017
6513a017L99P66P20j460J607L51J441L30n161N8J686n12k32j946O026K408k842
6496B622R27l277L202J39L899N882M67l369q774J099j085r084j879M864K133N640
6480C406L343n856K808l409m897l370n77L40O059N896N511L281q49p543o260k023
6464d140k459L428J373N78L283R99j987r74n179m199j854J002O316N744P75k500
6448B06k117J84J971J187k780K780q06L052P50K133j947j371Q74m052K406L144
6432E614j915o654K663K84j678l93r77j175K240K082M30k88n576n583K05M092
6416f629K114j963j626J581M393M627k042j002n93k660K97j848o23K713L137O69
6400E45K086J447k720k356Q64k632J176M63k07j581L317K151K381l159k047k221
$$ plain form
6513 -1017 -618 148 868 -592 1015 1366 2807 3137 -2024 -1966 -280 -792 -1024 -2970 3056 5464 2622
6496 2622 3549 272 3474 3613 7512 13394 13861 10492 1718 2817 1732 -7352 -9231 -4367 -2234 3406
6480 3406 6749 893 3701 292 -4605 -7975 -8552 -8212 -2153 3743 9254 12535 11686 4143 -2117 -4140
6464 -4140 -6599 -3171 -1798 -1220 2063 3062 1075 101 -5078 -9277 -11131 -10129 -3813 1931 2706 206
6448 206 -1911 -1727 244 1431 -1349 1431 625 3677 4427 6560 4613 3242 4116 64 2470 5614
6432 5614 3699 -2955 -292 -8 -1686 -2079 -3056 -4231 -1991 91 521 233 -5343 -10926 -10721 -6629
6416 -6629 -4515 -6478 -8104 -6523 -2130 2497 455 -547 -1140 -3800 -3503 -5351 -5974 -3261 -124 545
6400 545 2631 4078 1358 -998 -134 -2766 -1590 -1127 -1334 -2915 402 2553 4934 1775 -272 -2493
6384b493K77j764J582k652k361K198O173m78J537k891l591p22J247M979L629n245
6368e75j537L528M418R99J746l479L516l058l190n545l486K811p96J553n65j26
6352c786O265L574p59j134J804k415J975L522l435j254m68p73K86L353l264m471
6336i80J406J960l133l596l953M473N794k64k698l961K256l278R19l06k315K465
6320e211q95o67k823j114L349L465J98J801M716K855M40l729j375R09J304J287
6304D510j930J016M022p03j689l075K704K983n524q613m030N490R45J553J934
6289d07j242m276o534j561P504P805m267m05N064j941q4l286K71l213n27J960
6273e139N55K343K22l129L266j51j247j726m4M033K381m440m053P591K419M471
$$ plain form
6384 -2493 -2216 -3980 -2398 -5050 -7411 -5213 960 482 2019 -872 -4463 -5185 -3938 1041 4670 -575
6368 -575 -2112 1416 5834 6833 8579 5100 8616 5558 2368 -3177 -6663 -3852 -4648 -3095 -3660 -3786
6352 -3786 2479 6053 5294 4160 5964 3549 5524 9046 5611 4357 3889 3116 3402 6755 3491 -980
6336 -980 426 2386 -747 -4343 -8296 -3823 1971 1707 -991 -4952 -2696 -5974 -5055 -5361 -7676 -5211
6320 -5211 -6106 -6773 -9596 -10710 -7361 -3896 -3698 -1897 2819 5674 6114 2385 1010 1919 3223 4510
6304 4510 2580 3596 7618 6915 5226 2151 4855 7838 2314 -6299 -10329 -4839 -3894 -2341 -407
6289 -407 -1649 -5925 -12459 -14020 -6516 1289 -2978 -3383 1681 -260 -344 -3630 -3359 -6572 -7099 -5139
6273 -5139 -4584 -2241 -2019 -5148 -1882 -2033 -3280 -5006 -5050 -1017 1364 -3076 -7129 462 2881 7352
6257G352Q90m435m40J281K850J284j436j836m025K463P599M75k256o798R09K073
6241E950n34k602l789o494O82K026q85K549R42n156r98j06o33Q002Q24J184K987
6224C949K686J538l192j06m075j17P769P39k416j085j169J70n068j031K976P168
6208H736J210n781r81J285j069l239r21O78L934M089O501J461o175n020j518l449
6192b59j9R96J991O86j319m965L89O012K001Q68p4m100j697J397j317j770k93
6175a473L860j507l369l395K167J056j758l465N097M102L20J598L089j151j452
6160C719l390k265K944K333M13n279l187J352K234J508k695J105K752P90j268
6145A066K559r19p51J807j014p82p427n732R25L603M190N514L151k445j512k000
$$ plain form
6257 7352 8242 3807 3367 4648 7498 8782 7346 5510 1485 3948 11547 12022 9766 2968 3877 5950
6241 5950 5416 2814 -975 -7469 -6787 -4761 -5646 -3097 -2155 -7311 -8309 -8415 -9048 -1046 -222 962 3949
6224 3949 6635 8173 4981 4875 800 683 8452 9191 6775 5690 4521 4691 -377 -1408 1568 8736
6208 8736 9946 4165 3184 4469 3400 161 -760 -82 3852 7941 14442 15903 9728 4708 3190 -259
6192 -259 -278 718 2709 3395 2076 -2889 -2500 3512 5513 6381 6307 2207 510 1907 590 -1180 -1473
6175 -1473 2387 880 -2489 -5884 -3717 -2661 -4419 -7884 -2787 1315 1635 3233 6322 5171 3719
6160 3719 329 -1936 1008 3341 3754 -1525 -4712 -3360 -1126 382 -2313 -1208 1544 2334 1066
6145 1066 3625 2706 1955 3762 2748 1966 -5461 -11193 -10268 -6665 -2475 3039 6190 3745 2233 233
6129B33o56J006r93k781r31R32j657J176M382J835J801j345j635k725p076o149
6113a4583J342R231K328J256k855j945Q83K694J869M246K410K623j0876J257R284
6098I164K320k876o533o304R05K712j479k353m094J152K379J063m508L863O764
6083B175k818j55K306j290j577l920k415K838M021j310j616j443M91L902P57J994
6067A940p40J769j620j493l973l730k138l512j665J71K024O586J762o159L266
6052g512M799m081K589J267J349O818K696m500r54L157k967l44K190k767m881
6037c141R09k027M10J591N491P00k954l512r44N98r61L612M730k773O7J349n457
6020b312J41k78P46p52n130K650M158K091l478q507l725j152O122j240l6M88K505
$$ plain form
6129 233 -423 583 -410 -3191 -4122 -3190 -4847 -3671 711 2546 4347 3002 1367 -1358 -8434 -14583
6113 -14583 -13241 -4010 -1682 -426 -3281 -5226 -4343 -1649 220 4466 6876 9499 -1377 -120 9164
6098 9164 11484 8608 2075 -4229 -3324 -612 -2091 -4444 -8538 -7386 -5007 -3944 -8452 -4589 2175
6083 2175 -643 -798 1508 218 -1359 -5279 -7694 -4856 -835 -2145 -3761 -5204 -4713 -811 -54 1940
6067 1940 1200 2969 1349 -144 -4117 -7847 -9985 -13497 -15162 -14991 -12967 -6381 -4619 -10778 -7512
6052 -7512 -2713 -6794 -4205 -2938 -1589 5229 7925 3425 2471 5628 2661 2317 4507 1740 -3141
6037 -3141 -2232 -4259 -3849 -2258 3233 3933 979 -2533 -3477 -2879 -3840 -228 4502 1729 1796 3145 -2312
6020 -2312 -2171 -2449 -1703 -2455 -7585 -4935 -777 1314 -2164 -10671 -14396 -15548 -9426 -10666 -10702 -10214 -7709
6003g709J032k752l180Q358R686L403k675m771l344J131l27n68j116j833k51j143
5987f059k918N81k558K019Q691l704k910j669M74M721J23k537o01L880L516J990
5971C039p66m245j30J604J116m153k366k047J276n04M088J261j047J642Q03n06
5955i35n675l795Q11J544M884L153J823M599K670k989j194l088k948J161k292
5940b271J898l372m586j068P350K27q227L85J838M239l273N86R006N881m433l537
5924F43j729l95j480o06P49j276P382j727j731k843p19o695n766M119J2801M517
5908E244K411l055l912l143K444k9L214M892r65K312l235j633k357l963Q99J893
5892A017M104J161l46j336k848j833K828n33j472k959n338j016O168M736m564
$$ plain form
6003 -7709 -6677 -9429 -12609 -4251 5435 8838 6163 1392 -1952 -821 -1148 -1716 -2832 -4665 -4916 -6059
5987 -6059 -8977 -8396 -10954 -8935 -244 -3948 -6858 -8527 -8053 -3332 -3209 -5746 -6347 -2467 1049 3039
5971 3039 2273 -1972 -2102 -498 618 -3535 -5901 -7948 -6672 -7176 -3088 -1827 -2874 -1232 -429 -935
5955 -935 -6610 -10405 -9594 -8050 -3166 -13 1810 6409 9079 6090 4896 1808 -1140 21 -2271
5940 -2271 -373 -3745 -8331 -9399 -2049 -1822 -10049 -9664 -7826 -3587 -6860 -6274 2732 8613 4180 643
5924 643 -1086 -1481 -2961 -3567 -2818 -4094 3288 1561 -170 -3013 -3732 -10427 -16193 -12074 727 5244
5908 5244 7655 4600 688 -2455 -11 -40 3174 8066 7101 9413 6178 4545 2188 -1775 -876 1017
5892 1017 5121 6282 5936 4600 1752 -81 2747 2214 742 -2217 -7555 -8571 -2403 2333 -2231
5877b231n322L040K156K037K936k848n242k639o044L466Q428K161j923q751p841
5862a8617P125J1568R593j128n559K030N895j940Q56Q80K486l852o836p461K091
5847b869R43N43N421k700k872l227J520P063K588q70r77j006J894j751J048P228
5831A1976J207l81l002l399n633k013j922l462j184L922m397l127M73Q79P089
5816b974K871k71K410N936M546J769k447j492p460P42m07k068R21Q44k743j436
5800a259j094K806k802k62J166j781j942K892M349o397n663J01N813M624n02k451
5784b402j318k841K78q46l84N30M830J612M069K122J912K62l57j959k63J13k832
5767B526k403k964O35P21K575p9L874L185j683m983k628m1J140j611o121K736
$$ plain form
5877 -2231 -7553 -4513 -2357 -320 2616 -232 -5474 -8113 -14157 -10691 -2263 -102 -2025 -10776 -18617
5862 -18617 -11492 76 9669 8541 2982 5012 10907 8967 9823 10703 13189 9337 2501 -4960 -2869
5847 -2869 -1926 -1383 4038 1338 -1534 -4761 -3241 3822 6410 5540 4563 3557 5451 3700 4748 11976
5831 11976 13183 12802 9800 6401 768 -1245 -3167 -6629 -7813 -3891 -8288 -11415 -10942 -10063 -2974
5816 -2974 -103 -374 2036 7972 12518 14287 11840 10348 2888 3630 3223 1155 2076 2920 177 -1259
5800 -1259 -2353 453 -2349 -2611 -1445 -3226 -5168 -2276 2073 -4324 -9987 -9886 -4073 551 49 -2402
5784 -2402 -3720 -6561 -6283 -7129 -7513 -6983 -2153 -541 3528 5650 7562 7824 7467 5508 5245 5358 2526
5767 2526 123 -2841 -2206 -1485 1090 1011 4885 8070 6387 1404 -1224 -1265 -125 -1736 -7857 -5121
5751e121M802J877p22L58J378J758j969r20M407R55k75m360o241k836L600n019
5735h328n060j471P451M475j040j743Q1O93J40l028K808K177O331r46n845l46
5719c651K082J264J118k639Q98j127N35M928J753k499k916j155k510p1J272K592
5703a26j506k401J877J348J06q61L048L738K905l763n661m566Q79M315N841J617
5687F790m097l227m655K779J772l62N88k40l564J410M276k658K78J885L52K096
5671C423r9l182k735j352P10M23N952L177L034J460k677j706l619J386k023n687
5655c515r4N295j273k391J250K555J173k875K279K961J731J614j191M19k439l445
5639B054j044k433o01j091R73q2l722K972R92m986j819O887L281q7L33r09l601
$$ plain form
5751 -5121 -319 1558 836 1194 2572 4330 2361 1441 5848 6803 6528 2168 -4073 -6909 -3309 -8328
5735 -8328 -13388 -14859 -7408 -2933 -3973 -5716 -5635 -4942 -4802 -7830 -5022 -2845 3486 2540 -3305 -3651
5719 -3651 -1569 -305 813 -1826 -928 -2055 -1520 3408 5161 2662 -254 -1409 -3919 -3990 -2718 -126
5703 -126 -1632 -4033 -2156 -808 -702 -1563 1485 5223 8128 4365 -1296 -5862 -4983 -668 5173 6790
5687 6790 2693 -534 -5189 -2410 -638 -1000 -412 -652 -4216 -2806 1470 -1188 -910 975 1327 3423
5671 3423 3324 142 -2593 -3945 -3235 -2812 3140 6317 9351 10811 8134 6428 2809 4195 2172 -3515
5655 -3515 -3609 1686 413 -1978 -728 1827 3000 125 2404 5365 7096 8710 7519 7938 5499 2054
5639 2054 1010 -1423 -2024 -3115 -2142 -2224 -5946 -2974 -1982 -6968 -8787 -1900 1381 1294 1627 718 -2883
5622b883J710M496k116n567J157M744j195M65k989K474J763l50k072N518k707
5607B448o173j029K813M192K364n620l409L633N75k670K519J576o62j170L80L166
5591B933J760N797J3n767m095k83l395k553J445O40J596j738m65K914J508k948
5575b638J484M242j776k017k075J874L99k735l64K385R57J010K932m537J553P165
5559G859L086r91j814N3Q10j036m767J713j880J855l28m615J725J548k637K158
5543B739P27K333k582l934r42L500L046k65L79K54K496m373n146l51K774J157
5527A812m371M38L029l169p99K3M508j95J898o06j591M43K192O578r41o912n26
5510A811J714L063J227p251k584j006K058m98O20J567K519o5j087j777q07M422
$$ plain form
5622 -2883 -1173 3323 1207 -4360 -3203 1541 346 811 -2178 296 2059 1709 -363 5155 2448
5607 2448 -3725 -4754 -1941 2251 4615 -1005 -4414 -781 -206 -2876 -357 1219 557 -613 -233 2933
5591 2933 4693 10490 10503 4736 641 358 -3037 -5590 -4145 -3505 -1909 -3647 -4112 -1198 310 -2638
5575 -2638 -1154 3088 1312 -705 -2780 -906 -507 -3242 -3606 -1221 -264 746 3678 -859 694 7859
5559 7859 10945 9954 8140 8193 9003 7967 3200 4913 3033 4888 4560 -55 1670 3218 581 2739
5543 2739 3466 5799 3217 -717 -1659 1841 4887 4622 5001 5255 7751 3378 -1768 -2119 655 1812
5527 1812 -2559 -2121 908 -2261 -3060 -3037 1471 1276 3174 2568 977 1420 3612 10190 9249 2337 1811
5510 1811 3525 6588 7815 564 -2020 -3026 -968 -1466 -846 721 3240 3175 2088 311 -496 3926
5494C926K528m825k555K669N05K497k761j738L053l244j525n69k032L102O267
5479E298j744k56k796k470j289j714K855O847j435j675K838K850J215k597K076
5464H003q17m994j775l955J213M238M086O47k048j786L856j465n311m563J224
5449c447J191j460N91J229j033r48O50K337M629J432J275N18n70j644n447J937
5433A240n59j479L25K631l541n74M902j261k142M725M945l64o571Q18j693q82
5417E20n201K677R083l48k911N946J380k546N3k728k693P76j015L3O99J929o86
5400D968m57J248j816r65k024j705J134O01q39j055j201j3J213M178k059j286
5384g8K495l072l22N981n159k694j931K36M498o75l706k194M208p39k948J145
$$ plain form
5494 3926 6454 1629 -926 1743 2248 4745 1984 246 3299 55 -1470 -2039 -4071 -969 5298
5479 5298 3554 3298 502 -1968 -3257 -4971 -2116 4731 3296 1621 4459 7309 8524 5927 8003
5464 8003 7186 2192 417 -3538 -2325 1913 5999 6646 4598 2812 6668 5203 -108 -4671 -3447
5449 -3447 -2256 -3716 -3125 -1896 -2929 -3877 -3227 -890 3739 5171 6446 6964 6394 4750 -697 1240
5433 1240 681 -798 -473 2158 -1383 -1957 2945 1684 -458 4267 9212 8848 2277 3095 1402 520
5417 520 -4681 -2004 7079 6731 3820 9766 11146 8600 8653 5925 3232 4008 2993 3026 3725 5654 4968
5400 4968 4511 5759 3943 2978 954 -751 383 984 145 -910 -2111 -2124 -911 3267 1208 -78
5384 -78 2417 -655 -977 5004 -155 -2849 -4780 -4544 -46 -721 -4427 -6621 -2413 -3152 -6100 -4955
5368d955K372J945L584L164k61p552j212L934M956K529M27k754l611j417J718
5353B867j234k285n010Q89N310M076L7o410K46p5r34m226K65N580L614k875m94
5336f59m57j630k311L300k507j153L845q55%N661J848n489l250J338J998K030
5320A709j456K29n294m415L449N090J210J787K129M536l214m474k455l344M03
5305d110l504k661L585L584k444k566N058K345k982l318j587L686l722K324L593
5290b719J47M702L530j650k156J499J309l46j963k322J390k014m259K931K590
5275F69m60q04j338m586l719M829L848L315j564k036M794K090j532K909K077k96
5259H196n344r20K160j495m769K709J368l682k078J175j98J335L188K522O508
$$ plain form
5368 -4955 -2583 -638 2946 6110 5849 -1703 -2915 1019 5975 8504 8931 6177 2566 1149 2867
5353 2867 1633 -652 -5662 -4773 537 4613 4650 -1760 -1514 -1589 -2523 -6749 -6484 -904 2710 -165 -659
5336 -659 -1116 -2746 -5057 -1757 -4264 -5417 -1572 -2427 -2427 3234 5082 -407 -3657 -2319 -321 1709
5320 1709 253 482 -4812 -9227 -5778 -688 522 2309 4438 8974 5760 1286 -1169 -4513 -4110
5305 -4110 -7614 -10275 -6690 -3106 -5550 -8116 -3058 -713 -3695 -7013 -8600 -4914 -8636 -6312 -2719
5290 -2719 -2572 2130 5660 4010 1854 3353 4662 4316 2353 31 1421 -593 -4852 -1921 669
5275 669 209 -595 -1933 -6519 -10238 -5409 -1561 1754 190 -1846 2948 5038 3506 6415 8492 8196
5259 8196 2852 1932 4092 2597 -2172 537 1905 -1777 -3855 -2680 -2878 -1543 1645 4167 10675
5244A0675j99q291k653l954j957L934K733l543J182K142P82k814o28O568j50k966
5228H61M5J966k630o756k560J831O906J330K341j02r3m436j224J822K43J706K673
5211C923j571m15m198l534K927J668J572j875R70P66J038n19k265O87K924p9p33
5194A286l492n306K031O322L806K648M326p15l511k404l427L929j842K460M987
5179A1098K863l852O52K451K420m156m661K155q97k656j879L26k248o137J842
5164b679O664K527J566m249m003o75j061N141K101k359J038j802k904k098N231
5149B438M299N9J229o12j565k100k569L06O66l9l441p8j820r49j94L462o76l923
5131e507K149K561n572K583N759J57j070J114j4k53K015k108m82j354L568J22
$$ plain form
5244 10675 10476 2185 -468 -4422 -6379 -2445 288 -3255 -2073 69 851 -1963 -2591 3977 3827 861
5228 861 906 2872 242 -6514 -9074 -7243 -337 993 3334 3232 3139 -1297 -2521 -699 -456 1250 3923
5211 3923 2352 1937 -2261 -5795 -2868 -1200 372 -1503 -533 233 1271 752 -1513 -826 2098 2019 1286
5194 1286 -2206 -7512 -5481 841 4647 7295 11621 10906 7395 4991 1564 5493 3651 6111 11098
5179 11098 13961 10109 10761 13212 15632 11476 6815 8970 8073 5417 3538 3864 1616 -4521 -2679
5164 -2679 3985 6512 8078 3829 -174 -849 -1910 3231 5332 2973 4011 2209 -695 -2793 2438
5149 2438 6737 6796 8025 7413 5848 3748 1179 1485 2151 2112 -1329 -1407 -3227 -4176 -4370 -908 -1584 -5507
5131 -5507 -3358 -797 -6369 -3786 1973 2130 1060 2174 2160 1907 3922 1814 1332 -22 3546 3668
5115C668j493k000M62L126l060p26l726J198q57K38j667p39L52j715j208Q71L796
5098c480N313n553k427J588O78K19K995J446J442R65k185k939j428K386k858j289
5082e127N531K065l207j727k85M386L027j953j854k41K717J360m530k05K045K418
5066D420k460N74L713N889k687n209j339J947j40l971m479J904K737L49q651m32
5050g835M724J037J266j59q41M099J872l656m899L83N060J687k787o40Q38J156
5034A305j885l173J917J948J374j367K098n05j164l947l916n84K35M827M399l835
5018b273j871M67K255N699K936J139o589k042K613N270M22j478k128R30N233J924
5002A2507m256q171l900J948j822K20J265N889M335m266k253N292L138j071q03
$$ plain form
5115 3668 2175 175 637 3763 703 -23 -3749 -2551 -3408 -3170 -4837 -5576 -5224 -6939 -8147 -7276 -3480
5098 -3480 1833 -3720 -6147 -4559 -3881 -3662 -667 779 2221 3186 1001 -1938 -3366 -980 -3838 -5127
5082 -5127 404 2469 -738 -2465 -2750 1636 4663 2710 856 615 3332 4692 162 -43 2002 4420
5066 4420 1960 2534 6247 12136 9449 4240 2901 4848 4708 737 -3742 -1838 899 1248 -7403 -7835
5050 -7835 -3111 -2074 -808 -967 -1808 2291 4163 507 -4392 -4009 1051 2738 -49 -689 149 1305
5034 1305 -580 -3753 -1836 112 1486 119 2217 1712 548 -3399 -7315 -7899 -7664 -2837 1562 -2273
5018 -2273 -4144 -3677 -1422 4277 7213 8352 1763 -279 2334 7604 8026 6548 4420 5350 10583 12507
5002 12507 8251 80 -3820 -1872 -3694 -3474 -2209 3680 8015 3749 1496 6788 9926 8855 8052
4987H052J776K98n548n297O00J95J770L573J61k829O568J639p07Q71m051J586
4971H657n57m911J334k333j437J967r89L520J945K622j274l270l020J288K184
4956E726o15j775m514j793N261J126j047L271R68L021m37l446l623n781J995M700
4940C037j179M759j78k301K196j235k369k502j631k562p98N139L246l470l014
4925b862K333P30O584K483j093k552J332l902j904N19j562l412j025M226J177
4910A072N072J986L74o690j082l534j241K537L933k177J999K164J309J03J445
4895G270M122l063M17k004j398M696l935n435j898q78J942m34m436j726L769q30
4879c821n8J488O39n91L275P18J204n26n370K54J622J097n15l460l13L204j146
$$ plain form
4987 8052 9828 10126 4578 -719 -119 76 1846 5419 5580 2751 9319 10958 10251 11122 7071 8657
4971 8657 8100 3189 4523 2190 753 2720 1731 5251 7196 9818 8544 5274 2254 3542 5726
4956 5726 5111 3336 -1178 -2971 2290 3416 2369 5640 6608 9629 9192 5746 2123 -3658 -1663 3037
4940 3037 1858 6617 6439 4138 6334 5099 2730 228 -1403 -3965 -4763 376 3622 152 -2862
4925 -2862 -529 201 6785 9268 8175 5623 6955 3053 1149 1668 106 -3306 -4331 -105 1072
4910 1072 6144 8130 8504 1814 732 -2802 -4043 -1506 2427 250 2249 4413 5722 5825 7270
4895 7270 11392 8329 8746 6742 5344 10040 6105 670 -1228 -2106 -164 -598 -5034 -6760 -2991 -3821
4879 -3821 -3879 -2391 -1752 -2343 932 1650 2854 2328 -3042 -2788 -1166 -69 -584 -4044 -4357 -1153 -2299
4862b299L881J437K800K645m195n564L719M717K282K503p202J518Q09K793o04
$$ plain form
4862 -2299 1582 3019 5819 8464 4269 -1295 2424 7141 9423 11926 4724 6242 7051 9844 9240
$$ [...]
##END NTUPLES=NMR SPECTRUM
##END=
