##TITLE=Analysis number 316098
Compound Code sb 02063
Project Code adrs
Chemist Name flurochem
##JCAMPDX= 6.0         $$ Bruker NMR JCAMP-DX V2.0
##DATA TYPE= NMR SPECTRUM
##DATA CLASS= NTUPLES
##ORIGIN= Bruker BioSpin GmbH
##OWNER= NMR
$$ XWIN-NMR		Version 3.5
$$ Fri Dec 16 08:07:49 2005 GMT Standard Time (UT+0h)  MAYBRIDGE\NMR@NMR_250MHZ
##.OBSERVE FREQUENCY= 250.131544655141
##.OBSERVE NUCLEUS= ^1H
##.ACQUISITION MODE= SIMULTANEOUS (DQD)
##.ACQUISITION SCHEME= undefined
##.AVERAGES= 16
##.DIGITISER RES= 18
##SPECTROMETER/DATA SYSTEM= dpx250
##.PULSE SEQUENCE= zg30
##.SOLVENT NAME= CDCl3
##.SHIFT REFERENCE= (INTERNAL, CDCl3, 0, 16.522)
##AUDIT TRAIL= $$ (NUMBER, WHEN, WHO, WHERE, WHAT)
$$ ##TITLE= Audit trail, XWIN-NMR		Version 3.5
$$ ##JCAMPDX= 5.01
$$ ##ORIGIN= Bruker BioSpin GmbH
$$ ##OWNER= NMR
$$ C:\u/data/dgb/nmr/ADRS/13930/pdata/1/auditp.txt
$$ ##AUDIT TRAIL=  $$ (NUMBER, WHEN, WHO, WHERE, WHAT)
(   1,<2005-12-16 08:07:04.04 +000>,<MAYBRIDGE\NMR>,<NMR_250MHZ>,
      <created by zg, POWCHK disabled, PULCHK disabled
       configuration hash MD5:
       62 19 C7 07 E1 42 D1 B7 37 6C 3D D0 77 39 F9 E6
       data hash MD5: 64K
       75 23 E0 64 36 5C 8B 3D 82 00 B9 86 6A 86 F7 59>)
(   2,<2005-12-16 08:07:29.10 +000>,<MAYBRIDGE\NMR>,<NMR_250MHZ>,
      <Start of raw data processing
       ef LB = 0.3 FT_mod = 6 PKNL = 1 SI = 32K 
       data hash MD5: 32K
       6A 34 3B CE 6A EA D1 0C 7C 59 16 EA B2 40 4D FE>)
(   3,<2005-12-16 08:07:33.73 +000>,<MAYBRIDGE\NMR>,<NMR_250MHZ>,
      <apk 
       data hash MD5: 32K
       17 DA F3 77 A5 48 69 7A 9D 33 94 0F F8 8A 20 3D>)
(   4,<2005-12-16 08:07:35.15 +000>,<MAYBRIDGE\NMR>,<NMR_250MHZ>,
      <abs ABSG = 5 
       data hash MD5: 32K
       07 74 E8 DC C6 F8 89 19 76 34 45 C8 BD D2 AD B8>)
$$ ##END=
$$ 
$$ hash MD5
$$ 62 4D 88 60 62 A8 1B AF C8 E8 5C 18 0B B6 DE AE
##$RELAX= 
##$RELAX= 
##$RELAX= 
##$RELAX= 
##$RELAX= 
##$RELAX= 
##$RELAX= 
$$ Bruker specific parameters
$$ --------------------------
##$DU= <C:\u>
##$EXPNO= 13930
##$NAME= <ADRS>
##$PROCNO= 1
##$TYPE= <nmr>
##$USER= <dgb>
##$AMP= (0..31)
100 100 100 100 100 100 100 100 100 100 100 100 100 100 100 100 100 100 
100 100 100 100 100 100 100 100 100 100 100 100 100 100 
##$AQSEQ= 0
##$AQ_mod= 3
##$AUNM= <au_zg>
##$AUTOPOS= <44 >
##$BF1= 250.13
##$BF2= 250.13
##$BF3= 250.13
##$BF4= 250.13
##$BF5= 500.13
##$BF6= 500.13
##$BF7= 500.13
##$BF8= 500.13
##$BYTORDA= 1
##$CFDGTYP= 0
##$CFRGTYP= 5
##$CHEMSTR= <none>
##$CNST= (0..31)
1 1 145 1 1 1 1 1 1 1 1 1 1 1 1 1 1 1 1 1 1 1 1 1 1 1 1 1 1 1 1 1 
##$CPDPRG= <>
##$CPDPRG1= <>
##$CPDPRG2= <>
##$CPDPRG3= <>
##$CPDPRG4= <mlev>
##$CPDPRG5= <mlev>
##$CPDPRG6= <mlev>
##$CPDPRG7= <mlev>
##$CPDPRG8= <mlev>
##$CPDPRGB= <>
##$CPDPRGT= <>
##$D= (0..31)
0 1 0 0 0 0 0 0 0 0.06 0 0 0 0 0 0 0.0002 0 0 0 0 0 0 0 0 0 0 0 0 0 0 
0 
##$DATE= 1134720419
##$DBL= (0..7)
120 120 120 120 120 120 120 120 
##$DBP= (0..7)
150 150 150 150 150 150 150 150 
##$DBP07= 0
##$DBPNAM0= <>
##$DBPNAM1= <>
##$DBPNAM2= <>
$$ [...]
##$SUBNAM7= <"">
##$SUBNAM8= <"">
##$SUBNAM9= <"">
##$SW= 20.6930455092707
##$SWIBOX= (0..15)
0 0 3 0 0 0 0 0 0 0 0 0 0 0 0 0 
##$SW_h= 5175.983436853
##$TD= 65536
##$TD0= 1
##$TE= 293.16
##$TE2= 300
##$TE3= 300
##$TEG= 300
##$TL= (0..7)
0 120 120 120 120 120 120 120 
##$TP= (0..7)
150 150 150 150 150 150 150 150 
##$TP07= 0
##$TPNAME0= <>
##$TPNAME1= <>
##$TPNAME2= <>
##$TPNAME3= <>
##$TPNAME4= <>
##$TPNAME5= <>
##$TPNAME6= <>
##$TPNAME7= <>
##$TPOAL= (0..7)
0.5 0.5 0.5 0.5 0.5 0.5 0.5 0.5 
##$TPOFFS= (0..7)
0 0 0 0 0 0 0 0 
##$TUNHIN= 0
##$TUNHOUT= 0
##$TUNXOUT= 0
##$USERA1= <user>
##$USERA2= <user>
##$USERA3= <user>
##$USERA4= <user>
##$USERA5= <user>
##$V9= 5
##$VALIST= <valist>
##$VCLIST= <CCCCCCCCCCCCCCC>
##$VD= 0
##$VDLIST= <DDDDDDDDDDDDDDD>
##$VPLIST= <PPPPPPPPPPPPPPP>
##$VTLIST= <TTTTTTTTTTTTTTT>
##$WBST= 1024
##$WBSW= 4
##$XGAIN= (0..3)
0 0 0 0 
##$XL= 0
##$YL= 0
##$YMAX_a= 465249
##$YMIN_a= -502047
##$ZGOPTNS= <>
##$ZL1= 120
##$ZL2= 120
##$ZL3= 120
##$ZL4= 120
##$ABSF1= 16.522
##$ABSF2= -4.171173
##$ABSG= 5
##$ABSL= 3
##$ALPHA= 0
##$AQORDER= 0
##$ASSFAC= 0
##$ASSFACI= 0
##$ASSFACX= 0
##$ASSWID= 0
##$AUNMP= <proc_1d>
##$AZFE= 0.1
##$AZFW= 0.1
##$BCFW= 0
##$BC_mod= 0
##$BYTORDP= 0
##$COROFFS= 0
##$CY= 12.5
##$DATMOD= 1
##$DC= 0
##$DFILT= <>
##$DTYPP= 0
##$F1P= 14.0000005364418
##$F2P= -0.99999901652339
##$FCOR= 0.5
##$FTSIZE= 32768
##$FT_mod= 6
##$GAMMA= 0
##$GB= 0
##$INTBC= 1
##$INTSCL= 1
##$ISEN= 128
##$LB= 0.3
##$LEV0= 0
##$LPBIN= 0
##$MAXI= 10000
##$MC2= 0
##$MEAN= 0
##$ME_mod= 0
##$MI= 0
##$NCOEF= 0
##$NC_proc= -3
##$NLEV= 6
##$NOISF1= 0
##$NOISF2= 0
##$NSP= 0
##$NTH_PI= 0
##$NZP= 0
##$OFFSET= 16.522
##$PC= 1
##$PHC0= 83.51948
##$PHC1= 7.697601
##$PH_mod= 1
##$PKNL= yes
##$PPARMOD= 0
##$PSCAL= 4
##$PSIGN= 0
##$REVERSE= no
##$SF= 250.13
##$SI= 32768
##$SIGF1= 0
##$SIGF2= 0
##$SINO= 400
##$SIOLD= 32768
##$SREGLST= <1H.CDCl3>
##$SSB= 0
##$STSI= 32768
##$STSR= 0
##$SW_p= 5175.98343685301
##$SYMM= 0
##$S_DEV= 0
##$TDeff= 65536
##$TDoff= 0
##$TI= <Analysis number 999999
Compound Code 99
Book Reference 9
Project Code 9>
##$TILT= no
##$TM1= 0
##$TM2= 0
##$TOPLEV= 0
##$USERP1= <user>
##$USERP2= <user>
##$USERP3= <user>
##$USERP4= <user>
##$USERP5= <user>
##$WDW= 1
##$XDIM= 32768
##$YMAX_p= 306776490
##$YMIN_p= -153755
$$ End of Bruker specific parameters
$$ ---------------------------------
##NTUPLES= NMR SPECTRUM
##VAR_NAME=  FREQUENCY,     SPECTRUM/REAL,   SPECTRUM/IMAG
##SYMBOL=    X,             R,               I
##VAR_TYPE=  INDEPENDENT,   DEPENDENT,       DEPENDENT
##VAR_FORM=  AFFN,          ASDF,            ASDF
##VAR_DIM=   32768,         32768,           32768
##UNITS=     HZ,            ARBITRARY UNITS, ARBITRARY UNITS
##FACTOR=    0.157963299565203, 1,           1
##FIRST=     4132.6476996994, 0,             0
##LAST=      -1043.33573715361, 0,           0
##MIN=       -1043.33573715361, -153755,     0
##MAX=       4132.6476996994, 306776490,     0
$$ Real data points
##PAGE= N=1
##DATA TABLE= (X++(R..R)), XYDATA
$$ [...]
$$ plain form
29064 13598 7444 6737 741 -6945 -4542 2062 -1339 5304 14158 18294 13483 18750 15934 21145 12653
29049 12653 5692 3202 2971 3534 1364 360 -2191 -1 2534 4033 7665 -1187 -11964 -8500 -8025
29034 -8025 745 -5102 -12277 -5891 -5025 -10553 1443 7516 2578 -4465 -4403 -4090 -9441 -19973 -15168
29019 -15168 -11427 -6794 -932 -3587 -10700 -13425 -1475 12906 26756 20289 3184 5280 -3624
29006 -3624 -4448 167 14594 24133 26555 25876 28674 33527 36369 39018 33673 19468 6952 3537
28992 3537 3070 2962 241 4332 10504 2620 -11297 628 7447 6758 6206 -4130 -6998 -4016 -9254
28977 -9254 -13773 -5841 -2128 -7132 -7624 -7781 -19571 -22866 -19166 -10265 -5202 -12611 -7770 -11576 -9933
28962 -9933 4565 4636 -11483 -13273 -19973 -19762 -23616 -10569 -3383 -4794 -12212 467 -2559 -17316
$$ packed form
29064A3598o154p07n996p686K403O604l401O643Q854M136m811N267k816N211q492
29049A2653o961k490k31N63k170j004k551K190K535J499L632q852j0777L464M75
29034h025Q770n847p175O386Q66n528J1996O073m938p043O2L13n351j0532M805
29019a5168L741M633N862k655p113k725J1950J4381J3850o467j7105K096q904
29006c624q24M615J4427R539K422o79K798M853K842K649n345j4205j2516l415
28992C537m67j08k721M091O172p884j3917J1925O819o89n52j0336k868K982n238
28977i254m519P932L713n004m92j57j1790l295L700Q901N063p409M841l806J643
28962i933J4498P1j6119j790o700K11l854J3047P186j411p418J2679l026j4757
$$ plain form
28948 -17316 -6327 19174 13236 7171 5853 7481 -7011 -14709 -11588 -3336 -8369 -1717 11829
28935 11829 15288 19330 9203 10318 27734 29228 16451 -890 -9275 -4334 1600 7843 3270
28922 3270 25457 36235 21502 13402 17041 10635 11715 24977 24954 24245 14127 -895 -7290 558
28908 558 16518 23646 14550 11225 3067 -12928 -18641 -15139 -23735 -27369 -7455 13642 7026 -10536
28894 -10536 -15692 -4552 5430 2073 3941 6596 -1424 -8178 -14712 -11553 -9665 -1195 -9337 -7910
28880 -7910 -12783 -14927 -16067 -9827 -1977 13075 11781 359 -2351 -8722 10720 24534 22468 19436
28866 19436 7919 -220 -387 -16080 -14651 -9710 6756 -4970 -64 3922 16282 29871 20791
28853 20791 950 5915 10824 9271 14666 13481 16173 7878 -12194 -12781 -18522 -17851 -14776 -8511
$$ packed form
28948a7316J0989K5501n938o065j318J628j4492p698L121Q252n033O652J3546
28935A1829L459M042j0127J115J7416J494j2777j7341q385M941N934O243m573
28922C270K2187J0778j4733q100L639o406J080J3262k3p09j0118j5022o395P848
28908E58J5960P128r096l325q158j5995n713L502q596l634J9914K1097o616j7562
28894a0536n156J1140R982l357J868K655q020o754o534L159J888Q470q142J427
28880g910m873k144j140O240P850J5052j294j1422k710o371J9442J3814k066l032
28866A9436j1517q139j67j5693J429M941J6466j1726M906L986J2360J3589r080
28853B0791j9841M965M909j553N395j185K692q295k0072n87n741O71L075O265
$$ plain form
28839 -8511 430 10070 9930 -94 -2795 20701 30578 16977 3344 4336 10796 4067 2908 5271
28825 5271 6873 11347 10939 2508 8978 22039 21905 22398 15861 10155 4429 5398 24456 25802 24520
28810 24520 11828 -1716 -12599 -12958 -12794 -9108 -4431 3858 13217 14798 4383 15641 29693
28797 29693 34343 26691 8607 -4894 -4163 -13061 -14358 -19233 -25799 -11765 -171 -348 3975 -12639
28783 -12639 -18789 -5527 13735 322 -9112 -15720 -15890 -9892 -3659 -11704 -11165 -11642 -4220 7943
28769 7943 12661 10764 4271 7967 3815 -6151 5145 21492 19511 8192 1839 -7691 -4001 -726
28755 -726 3243 1991 11227 11982 3069 -5008 -5947 4976 6885 8820 4444 5768 15237 11619 16315
28740 16315 28049 39519 18919 3082 -19477 -24604 -4668 1467 -3140 -1280 -6734 -14795 -25284
$$ packed form
28839h511Q941R640j40j0024k701K3496R877j3601j3633R92O460o729j159K363
28825E271J602M474m08q431O470J3061j34M93o537n706n726R69J9058J346j282
28810B4520j2692j3544j0883l59J64L686M677Q289R359J581j0415J1258J4052
28797B9693M650p652j8084j3501P31q898j297m875o566J4034J1594j77M323j6614
28783a2639o150J3262J9262j3413r434o608j70N998O233q045N39m77P422J2163
28769G943M718j897o493L696m152r966J1296J6347j981j1319o353r530L690L275
28755g26L969j252R236P55q913q077r39J0923J909J935m376J324R469l618M696
28740A6315J1734J1470k0600j5837k2559n127J9936O135m607J860n454q061j0489
$$ plain form
28727 -25284 -24511 -17877 -6642 4121 6634 2853 6661 -4960 -13683 -13617 -12495 -6058 4081 19082
28713 19082 29865 20853 15264 21229 22887 8265 8144 5219 -8009 -21440 -13897 -9190 -7023 859
28699 859 -4880 -2596 7024 15557 18309 6917 12926 14427 2794 -9316 -13136 -8783 -5985 -8972
28685 -8972 -3311 -4606 1347 12206 -1037 -22746 -21842 -15225 -1629 -1264 -14954 -13591 -8416 -9528
28671 -9528 -17070 -13641 1787 6004 12703 17660 11776 7709 1138 5112 8819 9486 13553 17510 5523
28656 5523 -5315 -3331 -9409 -12973 -7233 4709 16572 11076 6850 10818 3202 742 7552 6741
28642 6741 7451 2375 3285 4382 -6971 -12943 -3623 1661 -2121 -4000 -21271 -26689 -19580 -18203 -15480
28627 -15480 -7376 -9227 -15803 -9008 922 7098 6944 3923 6698 7081 -6577 5320 4806 -6003
$$ packed form
28727b5284P73O634J1235J0763K513l781L808j1621q723O6J122O437J0139J5001
28713A9082J0783r012n589N965J658j4622j21k925j3228j3431P543M707K167P882
28699H59n739K284R620Q533K752j1392O009J501j1633j2110l820M353K798k987
28685h972N661j295N953J0859j3243k1709R04O617J3596L65j3690J363N175j112
28671i528p542L429J5428M217O699M957n884m067o571L974L707O67M067L957j1987
28656E523j0838J984o078l564N740J1942J1863n496m226L968p616k460O810q11
28642F741P10n076R10J097j1353n972R320N284l782j879j7271n418P109J377K723
28627a5480Q104j851o576O795R930O176j54l021K775L83j3658J1897n14j0809
$$ plain form
28613 -6003 3040 18787 21523 9521 12289 7606 -2257 -17030 -25364 -21552 -32031 -34329 -17579
28600 -17579 -21917 -26968 -1731 10834 6563 1985 15630 16075 3281 -17076 -7923 11244 -5296
28587 -5296 -11318 -9327 1330 7691 -399 -4624 -14943 -18221 -6836 -12576 -2147 8203 1499
28574 1499 -1124 -2118 3149 16875 22286 10496 3257 13687 13131 6514 -2379 3397 5346 7128
28560 7128 7580 19477 21918 33527 32950 19451 4649 8553 15777 22383 21185 24677 25577 16770
28546 16770 8609 8646 2649 -656 4166 14795 26970 23399 22907 15368 5860 545 -1962 9797
28532 9797 13299 15957 17052 19456 5711 2348 1793 -6785 -10632 -10383 -3106 14907 24340 17627 9869
28517 9869 11733 14540 6528 7722 17286 3740 -287 10423 10222 5680 -4030 -8724 -7342 1018
$$ packed form
28613f003R043J5747K736j2002K768m683r863j4773q334L812j0479k298J6750
28600a7579m338n051K5237J2565m271m578J3645M45j2794k0357R153J9167j6540
28587e296o022J991J0657O361q090m225j0319l278J1385n740J0429J0350o704
28574A499k623r94N267J3726N411j1790p239J0430n56o617q893N776J949J782
28560G128M52J1897K441J1609n77j3499j4802L904P224O606j198L492R00q807
28546A6770q161L7n997l305M822J0629J2175l571m92p539r508n315k507J1759
28532I797L502K658J095K404j3745l363n55q578l847K49P277J8013R433o713p758
28517I869J864K807q012J194R564j3546m027J0710k01m542r710m694J382Q360
$$ plain form
28503 1018 13787 -1811 -3920 2501 27992 29152 30963 37278 21315 -6483 -519 11779 10350
28490 10350 -5571 -18643 -2330 23138 17851 4766 216 -11702 -15610 -8478 -11876 -16247 -15614
28477 -15614 1795 8412 1046 6524 -1677 -9741 -3402 4790 1740 -11721 -14207 -10248 -16023 -16292
28463 -16292 -7089 114 8044 3901 3059 -5701 -9282 -5460 -4981 -5321 -12199 -9821 -4829 4313 1319
28448 1319 8140 8714 10469 11070 14129 3770 -2155 -8895 -5613 818 1238 2591 11533 20252 20699
28433 20699 16012 16606 12089 7185 12726 6735 -1887 -1450 6013 13970 13767 4816 -4522 6596 6289
28418 6289 -7477 -9015 -1246 -66 -1402 -6242 -19624 -33027 -25977 -23516 -16689 -18202 -20806 -13564
28404 -13564 -669 -5842 808 12986 9441 5287 19412 48322 53283 41012 25776 7244 4639
$$ packed form
28503A018J2769j5598k109O421K5491J160J811O315j5963k7798N964J2298j429
28490A0350j5921j3072J6313K5468n287j3085m550j1918l908P132l398m371O33
28477a5614J7409O617p366N478q201q064O339Q192l050j3461k486L959n775k69
28463a6292R203P203P930m143q42q760l581L822M79l40o878K378M992R142k994
28448A319O821N74J755O01L059j0359n925o740L282O431M20J353Q942Q719M47
28433B0699m687N94m517m904N541n991q622M37P463P957k03q951r338J1118l07
28418F289j3766j538P769J180j336m840j3382j3403P050K461O827j513k604P242
28404a3564J2895n173O650J2178l545m154J4125K8910M961j2271j5236j8532k605
$$ plain form
28391 4639 3873 10186 17423 12522 16428 17062 16081 17981 11082 3966 -1769 -6679 7179 8829 6904
28376 6904 6001 8832 4435 16841 22305 22129 13268 -4413 -10556 -11910 -4929 -10438 -18967 -24018 -26577
28361 -26577 -18525 -18334 -19991 -14556 -3044 -3369 -14100 -20920 -16680 -5644 5073 2905 7534 3315
28347 3315 -6337 -5074 776 -1417 -6417 -12614 -10571 -7738 1668 17901 12912 1947 5518 -5804
28333 -5804 -6208 2118 -16613 -24164 -17496 -13347 -8964 -15205 -23826 -14522 -10065 17366 13320 1243
28319 1243 -508 1682 -8453 6209 14788 10425 4549 220 -17032 -10905 6171 2953 726 7034
28305 7034 29124 28145 20905 8217 -816 -7763 -4016 5267 4458 -3041 -4776 -7061 2509 -2534 3493
28290 3493 26058 26213 18335 17128 2619 9326 23635 20368 14514 10648 8128 17146 13592 -2696
$$ packed form
28391D639p66O313P237m901L906O34r81J900o899p116n735m910J3858J650j925
28376F904r03K831m397J2406N464j76q861j7681o143j354O981n509q529n051k559
28361b6577Q052J91j657N435J1512l25j0731o820M240J1036J0717k168M629m219
28347C315r652J263N850k193n000o197K043K833R406J6233m989j0965L571j1322
28333e804m04Q326j8731p551O668M149M383o241q621R304M457K7431m046j2077
28319A243j751K190j0135J4662Q579m363n876m329j7252O127J7076l218k227O308
28305G034K2090r79p240j2688r033o947L747R283q09p499j735k285R570n043O027
28290C493K2565J55p878j207j4509O707J4309l267n854l866k520R018l554j6288
$$ plain form
28276 -2696 -6000 -1554 -5551 209 2062 -60 -1978 5895 3154 -6216 4301 -107 -11203 -14777
28262 -14777 -16028 -10064 5547 12587 2964 -1674 3462 9496 20567 27815 23120 13649 15279 6262
28248 6262 -7524 -738 2818 12535 5032 -2341 -187 17445 17852 12596 4450 -197 -3015 18874
28234 18874 34370 40052 21818 3693 -3604 -3360 -1357 2132 -1930 -4714 1015 18380 21466 12419
28220 12419 24072 29355 29165 25628 19541 10215 -4469 4839 13236 7265 6192 6061 4911 15428
28206 15428 17272 10029 7060 3041 -977 -5889 -9575 -7351 -3110 -2510 -546 18472 27674 37015
28192 37015 34343 16183 5612 -8546 -15524 -1706 -2326 -4416 925 3495 11479 16111 11251 11124
28178 11124 12152 17138 12722 7399 -2175 -6927 -11772 -3098 3064 7143 17197 11875 4375 -2412
$$ packed form
28276b696l304M446l997N760J853k122j918P873k741r370J0517m408j1096l574
28262a4777j251N964J5611P040r623m638N136O034J1071P248m695r471J630r017
28248F262j3786O786L556R717p503p373K154J7632M07n256q146m647k818K1889
28234A8874J5496N682j8234j8125p297K44K003L489m062k784N729J7365L086r047
28220A2419J1653N283j90l537o087r326j4684R308Q397n971j073j31j150J0517
28206A5428J844p243k969m019m018m912l686K224M241O00J964J9018R202R341
28192C7015k672j8160j0571j4158o978J3818o20k090N341K570P984M632m860j27
28178A1124J028M986m416n323r574m752m845Q674O162M079J0054n322p500o787
$$ plain form
28164 -2412 -7366 -5228 -4699 525 -1241 -6283 -10471 -17877 -13604 -5753 6395 8845 -4146 -15713
28150 -15713 -2738 -2966 -667 159 -2114 -2539 5963 15397 2859 -14091 -18980 -34035 -42680 -35490
28136 -35490 -27010 -21236 -5674 11220 9074 1761 -3318 -9707 -6869 -5954 -6154 -2582 79 -555 -8703
28121 -8703 -13407 -25062 -28579 -20148 -14191 1811 8580 13224 -3040 -2023 7745 11543 7495 10055
28107 10055 -501 8198 7799 3510 16578 13010 13996 18336 19977 3334 -2755 15858 19270 8403
28093 8403 4212 21108 21995 15049 18475 19329 29911 21902 10769 -181 -3449 -4300 14017 24647
28079 24647 5646 -8192 -14903 4427 17797 5271 65 665 5625 2049 1281 5563 -666 -508
28065 -508 -5548 -12210 -13673 -78 1529 -1112 -2874 3162 8525 835 -1599 -1615 -9510 4133 6981
$$ packed form
28164b412m954K138N29N224j766n042m188p406M273P851J2148K450j2991j1567
28150a5713J2975k28K299Q26k273m25Q502R434j2538j6950m889j5055q645P190
28136c5490Q480N774J5562J6894k146p313n079o389K838R15k00L572K661o34q148
28121h703m704j1655l517Q431N957J6002O769M644j6264J017R768L798m048K560
28107A0055j0556Q699l99m289J3068l568R86M340J641j6643o089J8613L412j0867
28093H403m191J6896Q87o946L426Q54J0582q009j1133j0950l268q51J8317J0630
28079B4647j9001j3838o711J9330J3370j2526n206O00M960l576p68M282o229J58
28065e08n040o662j463J3595J607k641j762O036N363p690k434j6p895J3643K848
$$ plain form
28050 6981 16279 23055 16541 5240 -262 -4219 -7654 -2922 -7839 -5611 -964 -382 3175 -6508 -4904
28035 -4904 -9481 -3009 -14081 -22392 -20787 -8003 11191 14543 5018 -4556 -15810 -11722 1691
28022 1691 5779 22680 31941 30672 27255 24294 14502 11281 6685 5548 12146 18403 26510 14096
28008 14096 -2078 -12119 -7784 -3821 4457 22048 31420 17032 6153 11344 26510 17462 6475
27995 6475 5879 5593 -281 3084 12538 1351 9049 12356 4567 -11753 -3363 5276 13816 17655 19792
27980 19792 15548 9259 6819 14613 7666 -2969 -2324 -4049 -9006 -2517 -2741 4558 -8296 -22819
27966 -22819 -17920 -1238 3514 4715 9723 14029 15487 9853 19976 34092 30451 23058 5074
27953 5074 -7012 1789 -3087 -7604 -14305 -3839 1885 10550 -2895 -7616 5649 15142 15638 1292
$$ packed form
28050F981R298O776o514j1301n502l957l435M732m917K228M647N82L557r683J604
28035d904m577O472j1072q311J605J2784J9194L352r525r574j1254M088J3413
28022A691M088J6901R261j269l417k961r792l221m596j137O598O257Q107j2414
28008A4096j6174j0041M335L963Q278J7591R372j4388j0879N191J5166r048j0987
27995F475n96k86n874L365R454j1187P698L307p789j6320Q390Q639Q540L839K137
27980A9792m244o289k440P794o947j0635O45j725m957O489k24P299j2854j4523
27966b2819M899J6682M752J201N008M306J458n634J0123J4116l641p393j7984
27953E074j2086Q801m876m517o701J0466N724Q665j3445m721J3265R493M96j4346
$$ plain form
27939 1292 -3865 -3494 6105 9938 14107 13701 15532 8904 10869 10745 9697 2453 3637 22948 32509
27924 32509 16716 4140 -5307 -13955 -16075 1043 15429 26265 32881 36979 22684 9879 6915
27911 6915 15858 20577 18774 14284 17257 20945 14843 10729 25956 30620 28755 19807 21871 22077 16164
27896 16164 2727 7197 14868 18384 23515 21350 23169 15961 1089 -6242 -8307 -5032 -13172 -3139
27882 -3139 6071 2081 7907 13006 13391 1902 -8480 -10545 -20975 -3592 -458 -9834 3073 11867
27868 11867 -4084 -13451 -12553 -7286 12915 11839 -10519 -14444 -8649 36 776 6769 15082 30458
27854 30458 27247 10606 -7270 -17056 -4215 5317 1651 -3603 -6097 -3448 4941 1752 9314 7001
27840 7001 2264 -5301 3520 7819 -3570 -8923 -4169 2263 -16423 -22408 -3112 13645 12306 2398
$$ packed form
27939A292n157L71R599L833M169m06J831o628J965j24j048p244J184J9311R561
27924C2509j5793j2576r447q648k120J7118J4386J0836O616M098j4295j2805k964
27911F915Q943M719j803m490K973L688o102m114J5227M664j865q948K064K06n913
27896A6164j3437M470P671L516N131k165J819p208j4872p331k065L275q140J0033
27882c139R210l990N826N099L85j1489j0382k065j0430J7383L134r376J2907Q794
27868A1867j5951r367Q98N267K0201j076k2358l925N795Q685P40N993Q313J5376
27854C0458l211j6641j7876r786J2841R532l666n254k494K649Q389l189P562k313
27840G001m737p565Q821M299j1389n353M754O432j8686n985J9296J6757j339r908
$$ plain form
27826 2398 8297 7088 7022 15719 15918 11855 3033 8417 6223 10114 20364 21360 14123 11995 3722
27811 3722 17346 21247 16020 12755 16345 2772 -7846 1583 -666 4806 18819 18669 6823 10159
27797 10159 10082 11279 13799 5928 -10764 -14401 -19415 -11077 -3992 2440 1468 -2130 -5860 -8189 -666
27782 -666 3116 2305 35 4172 9141 17274 18765 7188 -5006 -10541 -24922 -27278 -24717 -18404
27768 -18404 -9324 -7867 -5399 3464 -4940 -13572 -13503 -7245 -7800 -7839 -23710 -38503 -27427 -11300 -1429
27753 -1429 -10414 -11785 -18678 -20989 -7908 475 -8968 -10068 5442 -7379 -10977 -13587 -18702 -15117
27739 -15117 -848 6469 5987 23791 37919 20941 -2710 -16655 -20158 -16118 -11073 -12292 36
27726 36 5749 -392 -3397 15032 14823 5916 16662 19610 5762 11846 14584 6300 7493 6651 4578
$$ packed form
27826B398N899j209o6Q697J99m063q822N384k194L891J0250R96p237k128q273
27811C722J3624L901n227l265L590j3573j0618R429k249N472J4013j50j1846L336
27797A0159p7J197K520p871j6692l637n014Q338P085O432r72l598l730k329P523
27782f66L782q11k270M137M969Q133J491j1577j2194n535j4381k356K561O313
27768a8404R080J457K468Q863q404q632O9O258n55l9j5871j4793J1076J6127R871
27753a429q985j371o893k311J3081Q383r443j100J5510j2821l598k610n115L585
27739a5117J4269P317m82J7804J4128j6978k3651j3945l503M040N045j219J2328
27726C6N713o141l005J8429k09q907J0746K948j3848O084K738q284J193q42k073
$$ plain form
27711 4578 1994 -6652 -5060 -7472 -27124 -34398 -20085 -7189 -16116 -17625 -10067 -10610 4707 6306
27697 6306 3895 -3492 -4361 6568 13208 -8748 -12487 -2810 -1128 5370 14554 9000 5508 1492
27683 1492 11189 23147 19462 9714 16014 19853 6162 8165 23282 15605 5691 -5077 709 1836
27669 1836 5186 -4743 -8488 7574 19237 5901 5238 5234 7542 8412 4775 6261 6094 -1416 -2447
27654 -2447 3934 21370 23651 7160 -4320 -16159 -11125 13178 17336 8429 -6266 448 24511
27641 24511 16591 4137 5944 21772 19512 22084 25878 22956 29247 22147 17285 10415 13445 12947
27627 12947 10942 21535 20424 -847 -3480 -10814 -7040 -10723 -20825 -26119 -12198 -4513 13164
27614 13164 11402 -4186 -2423 -5079 -7910 -8386 -4143 -18 -3885 -8287 -4310 -1106 -4989 -188
$$ packed form
27711D578k584q646J592k412j9652p274J4313J2896q927j509P558n43J5317J599
27697F306k411p387q69J0929O640k1956l739R677J682O498R184n554l492m016
27683A492R697J1958l685r748O300L839j3691K003J5117p677r914j0768N786J127
27669A836L350r929l745J6062J1663j3336o63mK308Q70l637J486j67p510j031
27654b447O381J7436K281j6491j1480j1839N034K4303M158q907j4695O714K4063
27641B4511p920j2454J807J5828k260K572L794k922O291p100m862o870L030m98
27627A2947k005J0593j111k1271k633p334L774l683j0102n294J3921P685J7677
27614A3164j762j5588J763k656k831m76M243M125l867m402L977L204l883M801
$$ plain form
27600 -188 1771 -4282 -9215 -11288 5339 16271 22208 31340 24044 28470 21776 11326 5475 6435
27586 6435 17659 24235 15594 4144 4233 17281 17229 24586 23016 14761 23666 31839 22399 13928 2628
27571 2628 -1082 11555 17770 20330 15826 11509 7700 18622 14597 11112 8178 11510 18294 13507
27557 13507 2710 -15032 -12099 -6968 -402 5576 -2108 8011 15954 5606 -8524 -6639 -13389
27544 -13389 -4099 4750 11335 15760 72 -13514 -8106 -3433 511 -6674 -7930 5191 7391 6205
27530 6205 7802 8929 2508 -15020 -11845 -6017 -6671 -8620 -17068 -11681 -14499 -1858 8560 5508
27516 5508 489 -407 7933 9251 5208 3159 709 1009 -713 -2960 -6097 -9225 -11101 -5757 -2505
27501 -2505 -7765 -19984 -20815 -9619 -11629 -14173 -4558 8336 14437 16792 20408 18907 16426 13262
$$ packed form
27600a88J959o053m933k073J6627J0932N937R132p296M426o694j0450n851R60
27586F435J1224O576q641j1450Q9J3048n2P357j570q255Q905Q173r440q471j1300
27571B628l710J2637O215K560m504m317l809J0922m025l485k934L332O784m787
27557A3507j0797j7742K933N131O566N978p684J0119P943j0348j4130J885o750
27544a3389R290Q849O585M425j5688j3586N408M673L944p185j256J3121K200j186
27530F205J597J127o421j7528L175N828o54j949q448N387k818J2641J0418l052
27516E508n019q96Q340J318m043k049k450L00j722k247l137l128j876N344L252
27501b505n260j2219q31J1196k010k544R615J2894O101K355L616j501k481l164
$$ plain form
27487 13262 11896 10669 15726 26730 16874 11903 17381 18042 14360 8360 14742 14561 11355 11121 11758
27472 11758 5228 941 2596 -3070 1517 -4192 -6368 -6905 -4999 -2059 -9808 -3097 1097 -5118 -18892
27457 -18892 -15622 -17932 -20291 -23746 -19371 -10061 3763 20352 24858 18026 16480 19447 11829 14379
27443 14379 7139 -947 -8126 -2039 -15180 -20822 31 7456 70 3994 1721 -6652 6316 20514
27429 20514 28803 16051 6018 971 -7350 -6600 -12899 -15220 -14942 4848 18083 14956 8942 9948
27415 9948 14748 15469 17648 16101 13381 -1961 -18142 -23496 -20488 -8145 -8851 -9982 -4963 -4535 -10274
27400 -10274 -14741 -13838 -6041 -1734 8446 11346 15185 19369 16550 5586 7591 20069 20641 19236
27386 19236 29120 33227 25793 11446 5690 2655 404 8338 1874 -4439 381 3851 -4500 -14274
$$ packed form
27487A3262j366j227N057J1004r856m971N478O61l682o000O382j81l206k34O37
27472A1758o530m287J655n666M587n709k176n37J906K940p749O711M194o215j3774
27457a8892L270k310k359l455M375R310J3824J6589M506o832j546K967p618K550
27443A4379p240q086p179O087j3141n642K0853P425p386L924k273q373J2968J4198
27429B0514Q289j2752j0033n047q321P50o299k321K78J9790J3235l127o014J006
27415I948M800P21K179j547k720j5342j6181n354L008J2343p06j131N019M28n739
27400a0274m467R03P797M307J0180K900L839M184k819j0964K005J2478N72j405
27386A9236R884M107p434j4347n756l035k251P934o464o313M820L470q351r774
$$ plain form
27372 -14274 -3326 437 -8669 -5545 -4679 -7503 -13734 -11367 -352 10449 6330 5732 16412 6697
27358 6697 -1889 -4838 2335 15156 14588 15225 12295 7414 3607 1786 -2953 -9343 -16763 -16608 -14854
27343 -14854 -13774 -16158 -9016 -502 -6636 -12981 -26306 -27265 -43395 -42348 -30975 -17996 -22797 -26829
27329 -26829 -20230 -19895 -10253 -3877 10562 23207 17246 876 -12216 -18876 -16838 3362 2146
27316 2146 -21099 -18487 -12237 -4582 -6900 -2361 -1654 16754 19972 2674 6729 10359 16472 25070
27302 25070 20340 25998 27498 24060 10757 9600 19803 12486 5669 8668 463 -6635 -2830 11658
27288 11658 22350 28362 14634 9670 10190 10159 6830 69 3676 5865 -10770 -10141 -8919 -7881 -1300
27273 -1300 550 3047 16053 21404 13007 -129 -3933 -8931 -5872 -7327 -7982 -9395 -28386 -28259
$$ packed form
27372a4274J0948L763r106L124Q66k824o231K367J1015J0801m119n98J0680r715
27358F697q586k949P173J2821n68O37k930m881l807j821m739o390p420J55J754
27343a4854J080k384P142Q514o134o345j3325r59j6130J047J1373J2979m801m032
27329b6829O599L35R642O376J4439J2645n961j6370j3092o660K038K0200j216
27316B146k3245K612O250P655k318M539P07J8408L218j7298M055L630O113Q598
27302B5070m730N658J500l438j3303j157J0203p317o817K999q205p098L805J4488
27288A1658J0692O012j3728m964N20l1l329o761L607K189j6635O29J222J038O581
27273a300J850K497J3006N351q397j3136l804m998L059j455o55j413j8991J27
$$ plain form
27259 -28259 -17027 -6519 780 10191 12332 19731 17724 5906 2080 -5111 7052 18074 4578
27246 4578 1916 376 -12162 -15092 1909 15119 15670 19769 24799 22222 12901 11903 19980 23707
27232 23707 34186 36555 31864 19379 19884 22754 18377 1668 -19940 -21132 -19789 -13450 -13980 -16416
27218 -16416 -21079 -27552 -19912 -11555 -13148 -3120 25 -4295 1926 3245 -8913 -15702 -22792 -14099
27204 -14099 171 -5161 -11082 -8155 1427 4863 10542 -3473 -11659 -6013 -6735 -17719 -20352 -15343
27190 -15343 -18236 -26916 -14717 -4271 24 -1392 -13791 -13126 -293 442 5805 6597 366 -9790
27176 -9790 -6521 1373 -558 7146 13211 5242 2355 -7625 -3795 7873 1001 -9502 -15043 -19852
27162 -19852 -16707 -13297 -12237 -6263 1777 7856 10072 13767 17932 7456 11368 9808 9033 -2701
$$ packed form
27259b8259J1232J0508P299R411K141P399k007j1818l826p191J2163J1022j3496
27246D578k662j540j2538k930J7001J3210N51M099N030k577r321r98Q077L727
27232B3707J0479K369m691j2485N05K870m377j6709k1608j192J343O339n30k436
27218a6416m663o473P640Q357j593J0028L145m320O221J319j2158o789p090Q693
27204a4099J4270n332n921K927R582L436N679j4015q186N646p22j0984k633N009
27190a5343k893q680J2199J0446M295j416j2399O65J2833P35N363P92o231j0156
27176i790L269P894j931P704O065p969k887r980L830J1668o872j0503n541m809
27162a9852L145L410J060N974Q040O079K216L695M165j0476L912j560p75j1734
$$ plain form
27148 -2701 1048 -3501 -1606 1353 10727 2436 2184 15917 13287 13120 9452 1618 -2323 -1702 -324
27133 -324 -9149 -10821 -8887 2717 13250 20238 15913 6949 4992 6105 4846 6434 13835 7121
27119 7121 4898 8248 19906 31168 34857 35623 21356 13410 3050 9613 13943 11747 10081 6268
27105 6268 -1543 -13070 -7397 -2912 -6345 -5061 -565 -1175 -3647 2757 10843 12166 14517 8731 -421
27090 -421 2328 12508 935 -12230 -13490 -5818 11713 -1741 -13903 -6691 -5178 -3748 2411
27077 2411 5421 6770 -1210 -15735 -21411 -9161 9048 24874 19359 8434 6427 8735 8251 -9681
27063 -9681 -8858 2532 7479 15365 668 -3292 11626 12293 6951 3495 -6091 -20564 -5813 5251
27049 5251 2194 6162 9240 4349 -3173 -519 -5362 -10955 7776 14733 6494 1269 -7074 -11623
$$ packed form
27148b701L749m549J895K959R374q291k52J3733k630j67l668p834l941O21J378
27133c24q825j672J934J1604J0533O988m325q964j957J113j259J588P401o714
27119G121k223L350J1658J1262L689P66j4267p946j0360O563M330k196j666l813
27105F268p811j1527N673M485l433J284M496o10k472O404Q086J323K351n786r152
27090d21K749J0180j1573j3165j260P672J7531j3454j2162P212J513J430O159
27077B411L010J349p980j4525n676J2250J8209J5826n515j0925k007K308m84j7932
27063i681Q23J1390M947P886j4697l960J4918O67n342l456r586j4473J4751J1064
27049E251l057L968L078m891p522K654m843n593J8731O957q239n225q343m549
$$ plain form
27035 -11623 -897 3173 1785 5448 2382 -167 -3 5290 -1539 -11743 -10039 -2462 3107 2488
27021 2488 8570 10701 19757 30784 29717 17158 6197 19608 19459 18573 11523 11332 5350 18561
27007 18561 41213 36094 25616 15301 6085 12012 12860 4506 5040 12877 10854 -1292 -42 4407
26993 4407 818 3552 215 -1347 11333 10237 8216 -4599 -11598 514 -16614 -28012 -28337 -11143
26979 -11143 14472 16120 6444 -6896 -8676 5657 21892 32265 29441 31131 23154 16139 24642
26966 24642 24683 15749 13729 6199 -223 2941 -230 -10931 -811 7523 7050 5638 3195 1832 -7109
26951 -7109 -5886 -995 -210 8427 4307 -3694 -5820 -7841 -17740 -21097 -5536 2672 590 3401 -3230
26936 -3230 -15486 -12491 -4846 -4272 5014 12396 8604 -10515 -5433 -1953 -1369 -11118 -12033 -118 -7772
$$ packed form
27035a1623J0726M070j388L663l066k549J64N293o829j0204J704P577N569o19
27021B488O082K131R056J1027j067j2559j0961J3411j49q86p050j91n982J3211
27007A8561K2652n119j0478j0315r216N927Q48q354N34P837k023j2146J250M449
26993D407l589K734l337j562J2680j096k021j2815o999J2112j7128j1398l25J7194
26979a1143K5615J648r676j3340j780J4333J6235J0373k824J690p977p015Q503
26966B4642M1q934k020p530o422L164l171j0701J0120Q334m73j412k443j363q941
26951g109J223M891P85Q637m120q001k126k021r899l357J5561Q208k082K811o631
26936c230j2256K995P645N74R286P382l792j9119N082L480N84r749r15J1915p654
$$ plain form
26921 -7772 -6878 5997 -2361 -5839 5303 -9481 -13503 -16108 -8751 8206 10094 19433 10329 -11889
26907 -11889 -10487 -8272 9952 7961 -1183 -1396 -10572 -15848 -9429 4318 7968 2843 6784 13305
26893 13305 10593 -4021 -21816 -34615 -28403 -15518 -11824 -4046 -6134 5010 3118 -5040 -1645
26880 -1645 -3613 -3409 -6785 -19786 -18679 -12829 -28980 -31455 -21409 -30078 -29248 -21014 -3371 3692
26866 3692 483 -11682 -11270 -1637 904 1863 -9900 -16156 -6677 -6242 -5030 3362 3104 206 -2927
26851 -2927 -2663 -17839 -26646 -15697 -1521 1430 -11229 -8012 -8202 -4301 9134 11533 -7461 4394
26837 4394 18559 23140 21274 7805 -8025 -7486 -3706 3875 5842 10454 10344 13783 8301 7965 9703
26822 9703 16171 16560 14934 14770 13288 5912 2316 4790 1852 10740 12771 14241 24591 29604 14352
$$ packed form
26921g772Q94J2875q358l478J1142j4784m022k605P357J6957J888R339r104k2218
26907a1889J402K215J8224j991r144k13r176n276O419J3747L650n125L941O521
26893A3305k712j4614j7795j2799O212J2885L694P778k088J1144j892q158L395
26880a645j968K04l376j3001J107N850j6151k475J0046q669Q30Q234J7643P063
26866C692l209j2165M12R633K541R59j1763o256R479M35J212Q392k58k898l133
26851b927K64j5176q807J0949J4176K951j2659L217j90L901J3435K399j8994J1855
26837D394J4165M581j866j3469j5830N39L780P581J967M612j10L439n482l36J738
26822I703O468L89j626j64j482p376l596K474k938Q888K031J470J0350N013j5252
$$ plain form
26807 14352 14936 3019 -6824 -4513 -3832 -7496 -10788 -11270 -5909 -4318 -8013 -4641 -6809 -9472 4888
26792 4888 -247 -5586 3053 13136 8561 -1734 -11668 -9653 -18515 -27931 -28770 -23172 -19367 -3261
26778 -3261 2770 11949 20879 15855 31092 28783 19157 17569 15832 13859 14892 9609 19242 32241
26764 32241 28922 18708 10798 9447 -3304 11290 31327 33180 20578 14974 25455 9252 146
26751 146 2865 -5181 -21347 -7009 -2024 -6857 -15786 -25000 -14524 9152 27201 12447 2522
26738 2522 8666 16426 4467 -7241 7982 2512 -12554 -17733 -13701 2257 9627 17758 32738
26725 32738 24123 5587 10667 10820 11563 -1359 -22389 -23908 -19981 -10873 -9539 -6292 -7416 -10636
26711 -10636 -9449 -11545 -13074 -7305 2860 -3020 -1593 6137 -4247 -10837 -13283 -15487 -21588 -25509
$$ packed form
26807A4352N84j1917r843K311O81l664l292m82N361J591l695L372k168k663J4360
26792D888n135n339Q639J0083m575j0295r934K015q862r416q39N598L805J6106
26778c261O031R179Q930n024J5237k309r626j588j737j973J033n283R633J2999
26764C2241l319j0214p910j351j2751J4594K0037J853j2602n604J0481j6203r106
26751A46K719q046j6166J4338M985m833q929r214J0476K3676J8049j4754r925
26738B522O144P760j1959j1708J5223n470j5066n179M032J5958P370Q131J4980
26725C2738q615j8536N080J53P43j2922k1030j519L927R108J334L247j124l220
26711a0636J187k096j529N769J0165n880J427P730j0384o590k446k204o101l921
$$ plain form
26697 -25509 -17640 -11135 -9833 -25971 -28421 -24833 -23654 -21065 -17857 -17571 -6816 4160 -6424 -8241
26683 -8241 -4081 -11523 -18528 -15145 -13909 -13309 -8537 2455 6174 -6957 -128 18444 25642 15405
26669 15405 5320 5849 7543 19046 15987 14288 5029 14006 1769 -6327 -15847 -23487 -19240 3996
26655 3996 2535 8567 7721 -2497 -6522 -12696 -8891 4713 8510 4357 4473 13231 17746 3547
26641 3547 -5281 -3123 -4196 219 10509 20544 19723 9902 166 -1687 6850 21950 20503 14325
26627 14325 -1770 -20589 -7881 -6080 -7296 6120 11376 -274 11314 28196 40257 36278
26615 36278 29511 12659 5538 -2006 -12456 -16226 -25668 -22533 -18365 -4649 3698 1304 2513 -13619
26601 -13619 -29984 -28232 -34005 -20505 -9531 -6882 -1568 218 -2292 -1734 -8422 -16314 -20598 -17056
$$ packed form
26697b5509P869O505J302j6138k450L588J179K589L208K86J0755J0976j0584j817
26683h241M160p442p005L383J236O00M772J0992L719j3131O829J8572P198j0237
26669A5405j0085N29J694J1503l059j699r259Q977j2237q096r520p640M247K3236
26655C996j461O032q46j0218m025o174L805J3604L797m153J16Q758M515j4199
26641C547q828K158j073M415J0290J0035q21r821r736j853Q537J5100j447o178
26627A4325j6095j8819J2708J801j216J3416N256j1650J1588J6882J2061l979
26615C6278o767j6852p121p544j0450l770r442L135M168J3716Q347k394J209j6132
26601a3619j6365J752n773J3500J0974K649N314J786k510N58o688p892m284L542
$$ plain form
26587 -17056 -2175 -11796 -20108 -13418 -10449 -655 10557 -1654 -13988 -14933 -11705 -15796 -17603 -27701
26573 -27701 -31471 -17299 -9469 -8949 -10702 -22098 -23078 -14512 2143 3796 3980 9577 6626 5936 11901
26558 11901 4013 -786 -2577 5445 3788 46 -1032 -10484 -14885 -12448 -17503 -10671 6312 11694
26544 11694 6917 -6479 -19025 -23683 -25291 -8218 -1032 -5636 -14575 -2223 -1907 6047 12837 14722
26530 14722 10758 8439 1798 18175 20756 15713 -5001 -22714 -19195 -14889 -8709 1604 9538
26517 9538 12337 10364 4402 131 -87 -4925 -6380 -1396 4729 3599 -9325 -540 3226 -3159 7335
26502 7335 22042 7280 -1522 7503 21278 14674 21667 32542 20431 196 -11214 9330 16674
26489 16674 14534 3048 -14078 -22426 -7156 12400 17743 12436 6636 13152 30035 27328 18664
$$ packed form
26587a7056J4881r621q312O690K969R794J1212j2211j2334r45L228m091j807j0098
26573b7701l770J4172P830N20j753j1396r80Q566J6655J653J84N597k951o90N965
26558A1901p888m799j791Q022j657l742j078r452m401K437n055O832J6983N382
26544A1694m777j3396j2546m658j608J7073P186m604q939J2352L16P954O790J885
26530A4722l964k319o641J6377K581n043k0714j7713L519M306O180J0313P934
26517I538K799j973n962m271k18m838j455M984O125j130j2924Q785L766o385J0494
26502G335J4707j4762q802R025J3775o604O993J0875j2111k0235j1410K0544P344
26489A6674k140j1486j7126q348J5270J9556N343n307n800O516J6883k707q664
$$ plain form
26476 18664 17275 24452 16904 11174 6835 12139 19038 19675 10945 2885 -1364 -11300 -5693 -10291 -13902
26461 -13902 -10448 -8945 -15512 -9597 -5603 2143 6114 5555 -4547 -2853 -7091 -10905 -12741 -5570
26447 -5570 -5108 -13535 -22307 -14477 -16436 -14819 2803 -3092 -28570 -32111 -10522 -7733 -7514 813
26433 813 5164 8647 5878 1059 12429 9245 -3475 -6000 -5113 -1489 11307 7463 4888 -11076
26419 -11076 -20418 -29147 -17458 -28269 -19379 -6974 2711 1821 -1465 -16267 -5616 17675 13589
26406 13589 -568 2136 -3375 1767 2502 1652 1847 -5334 -1953 3488 14799 10357 2322 1495 3672
26391 3672 9044 -1126 6588 10017 -4392 -10721 -5289 -5850 5632 6686 12357 16097 24455 26830
26377 26830 22384 25635 28476 15044 12475 12501 15392 11381 -2560 -2906 -7470 1571 6559 776 4300
$$ packed form
26476A8664j389P177p548n730m339N304O899O37q730q060m249r936N607m598l611
26461a3902L454J503o567N915L994P746L971n59j0102J694m238l814j836P171
26447e570M62q427q772P830j959J617J7622n895k5478l541K1589K789K19Q327
26433H13M351L483k769m819J1370l184j2720k525Q87L624J2796l844k575j5964
26419a1076r342q729J1689j0811Q890J2405R685q90l286j4802J0651K3291m086
26406A3589j4157K704n511N142P35q50J95p181L381N441J1311m442q035q27K177
26391C672N372j0170P714L429j4409o329N432n61J1482J054N671L740Q358K375
26377B6830m446L251K841j3432k569K6K891m011j3941l46m564R041M988n783L524
$$ plain form
26362 4300 3967 -828 -1192 2877 -7610 -8964 -13642 -5769 3538 -18797 -31914 -31200 -23320 -5623
26348 -5623 8576 11509 10802 10181 1831 -5230 -26890 -43825 -35084 -32952 -11363 10874 30019 30884
26334 30884 20639 4310 4595 14098 3557 3364 9841 8674 13514 17757 14514 -4151 -1273 4097
26320 4097 8368 20676 25447 13847 1865 -6481 -21770 -28870 -9898 262 3688 -5751 -9770
26307 -9770 -9042 -8086 -7370 -11821 -6678 -11297 -6002 16395 10736 9942 20220 9036 -6052 -11191 -20208
26292 -20208 -16634 -4995 -7161 -11172 -21331 -25735 -7119 3597 6297 7523 8640 -4342 -9565
26279 -9565 -17145 2555 7448 -5028 -11836 -14483 -9260 -16324 -27488 -5430 -12870 -30119 -23510
26266 -23510 -12029 -6366 -1742 -1910 -5565 -8450 -7050 -1835 -13990 -23803 -20057 -24739 -20379 -15721
$$ packed form
26362D300l33m795l64M069j0487j354m678P873R307k2335j3117P14P880J7697
26348e623J4199K933p07o21q350p061k1660j6935Q741K132K1589K2237J9145Q65
26334C0884j0245j6329K85R503j0541j93O477j167M840M243l243j8665K878N370
26320D097M271J2308M771j1600j1982q346j5289p100J8972J0160L426r439m019
26307i770P28R56P16m451N143m619N295K2397n659p94J0278j1184j5088n139r017
26292b0208L574J1639k166m011j0159m404J8616J0716K700J226J117j2982n223
26279i565p580J9700M893j2476o808k647N223p064j1164K2058p440j7249O609
26266b3510J1481N663M624j68l655k885J400N215j2155r813L746m682M360M658
$$ plain form
26252 -15721 -17092 -15032 -23363 -22478 -7942 -5414 -6559 2337 3957 8113 7296 13599 28478 24044
26238 24044 21982 18603 11352 4308 2872 4667 -372 3828 -4920 -3411 699 -7725 -6518 -10973
26224 -10973 -2470 8950 8386 5569 9849 6007 9580 7235 5334 11674 21881 19229 15191 18711
26210 18711 11309 -2001 3212 307 -10899 -18846 -21426 -10701 229 -9415 -11734 -10123 -5713
26197 -5713 -3165 -5677 -4753 -7085 -15809 -24615 -34855 -30918 -26359 -15449 -8732 -3150 -4894 13322
26183 13322 16852 14067 7672 -250 -4031 -14038 -5992 16964 25620 32129 26791 24953 13193 17662
26169 17662 19804 9723 6840 8207 3480 3539 390 -9278 -13862 -9264 -7419 -16636 -23924 -17187 -14624
26154 -14624 -18697 -9679 -6079 -13834 10557 24136 17311 15075 15973 16366 17395 18860 17575 11811
$$ packed form
26252a5721j371K060q331Q85J4536K528j145Q896J620M156q17O303J4879m434
26238B4044k062l379p251p044j436J795n039M200q748J509M110q424J207m455
26224a0973Q503J1420n64k817M280l842L573k345j901O340J0207k652m038L520
26210A8711p402j3310N213k905j1206p947k580J0725J0930r644k319J611M410
26197e713K548k512R24k332q724q806j0240L937M559J0910O717N582j744J8216
26183A3322L530k785o395p922l781j0007Q046K2956Q656O509n338j838j1760M469
26169A7662K142j0081k883J367m727N9l149r668m584M598J845r217p288O737K563
26154a4624m073R018L600p755K4391J3579o825k236Q98L93J029J465j285n764
$$ plain form
26140 11811 -2480 -9385 8663 16545 4958 3721 11887 9706 9222 6749 -264 -10576 1629
26127 1629 -3072 -16786 -5072 -1720 -9595 -10760 -14154 -10117 -9838 -15767 -14445 -14915 -11572 -6464 -11741
26112 -11741 -9701 -1016 6197 10664 10297 -8865 -12964 -2120 -5201 -16629 -19538 -10365 -11640 -19460
26098 -19460 -16225 -14697 -6009 -6841 332 3521 13435 7720 1941 8173 23839 23569 17428 5741
26084 5741 -10109 -19634 -22211 -13467 13962 19180 5227 -7984 -20597 -27945 -24582 -8659 1568
26071 1568 3512 142 -10136 -13308 -216 8404 10526 -2538 -10573 -10745 5494 -1964 -12210 -17022
26057 -17022 -13164 3320 9147 -5066 -12468 -9477 -9206 -338 -3087 -9981 -8362 -12085 -43 169
26043 169 -5826 -861 13695 16418 2728 -19196 -24919 -24350 -19412 -7882 1380 7867 -3994 -3518
$$ packed form
26140A1811j4291o905J8048P882j1587j237Q166k181m84k473p013j0312J2205
26127A629m701j3714J1714L352p875j165l394M037K79n929J322m70L343N108n277
26112a1741K040Q685P213M467l67j9162m099J0844l081j1428k909R173j275p820
26098a9460L235J528Q688q32P173L189R914n715n779O232J5666k70o141j1687
26084E741j5850r525k577Q744K7429N218j3953j3211j2613p348L363J5923J0227
26071A568J944l370j0278l172J3092Q620K122j3064q035j72J6239p458j0246m812
26057a7022L858J6484N827j4213p402K991K71Q868k749o894J619l723J2042K12
26043A69n995M965J4556K723j3690k1924n723N69M938J1530R262O487j1861M76
$$ plain form
26029 -3518 6450 -6413 -15897 -16684 -4131 -3738 7376 14357 17482 8755 12467 15740 6069 -10004
26015 -10004 -9162 3857 10171 10611 5113 9610 10949 4037 1002 2332 1901 -5246 -5899 -11324 -16865
26000 -16865 -7822 -10086 -16022 -21257 3782 5672 -5851 -340 1855 13636 6556 -944 -16608
25987 -16608 -9861 -1527 -6136 -7902 -17291 -15045 -10549 -7805 -13496 -4129 -1128 -2708 -3260 1152 -265
25972 -265 -352 -693 9856 19498 19098 1427 -8263 373 11273 14502 11383 8233 -13984 -14254 5958
25957 5958 11723 3929 -2752 -4425 -23487 -29774 -23146 -12408 -15764 -15955 -8468 1836 4255 7637
25943 7637 6512 -4679 -12034 -6432 10857 5350 -1969 4541 1674 -4549 -7160 -8479 -17629 -22855
25929 -22855 -3808 3596 5115 8437 -8057 -22250 -21386 -18008 -9887 -1030 -3169 -11867 -20892 -13262
$$ packed form
26029c518R968j2863r484p87J2553L93J1114O981L125q727L712L273r671j6073
26015a0004Q42J3019O314M40n498M497J339o912l035J330m31p147o53n425n541
26000a6865R043k264n936n235K5039J890j1523N511K195J1781p080p500j5664
25987a6608O747Q334m609j766r389K246M496K744n691R367L001j580n52M412j417
25972b65q7l41J0549R642m00j7671r690Q636J0900L229l119l150k2217k70K0212
25957E958N765p794o681j673j9062o287O628J0738l356j91P487J0304K419L382
25943G637j125j1191p355N602J7289n507p319O510k867o223k611j319r150n226
25929b2855J9047P404J519L322j6494j4193Q64L378Q121Q857k139q698r025P630
$$ plain form
25915 -13262 -4721 -16002 -19472 -12358 7234 14818 22985 26575 9182 -9946 -12464 -20367 -31329
25902 -31329 -37664 -28402 -13058 8235 5164 22 -4256 -14147 -13523 -25644 -31102 -39130 -33183 -21445
25888 -21445 -21695 -10548 8795 2712 -4657 -1816 -3187 -15830 -13119 -611 13960 24792 33891
25875 33891 32284 28231 3609 -13262 -9871 -13554 -15342 -19961 -19189 -12903 -5290 -3583 -7813 -11462
25861 -11462 -12708 -12715 -14482 -25172 -23434 -11004 -1354 4854 3946 -8344 4612 15329 17143 4223
25847 4223 1723 -1791 -2261 -5938 2661 4948 15705 27706 32658 28610 16969 7049 -13644 -13952
25833 -13952 -15944 -25199 -25822 -20501 -7402 7520 16532 11064 -5010 -1190 11247 20970 23288 3346
25819 3346 -2771 -3895 -24029 -22857 -27995 -20985 -19136 -28556 -27084 -13171 -1663 11655 12658 3473
$$ packed form
25915a3262Q541j1281l470P114J9592P584Q167L590j7393j9128k518p903j0962
25902c1329o335R262J5344K1293l071n142m278r891O24j2121n458q028N947J1738
25888b1445k50J1147J9343o083p369K841j371j2643K711J2508J4571J0832R099
25875C3891j607m053k4622j6871L391l683j788m619P72O286P613J707m230l649
25861a1462j246pj767j0690J738J2430R650O208r08j2290J2956J0717J814j2920
25847D223k500l514m70l677Q599K287J0757J2001M952m048j1641r920k0693l08
25833a3952j992r255o23N321J3099J4922R012n468j6074L820J2437R723K318j9942
25819C346o117j124k0134J172n138P010J849r420J472J3913J1508J3318J003r185
$$ plain form
25805 3473 5878 5316 4648 2124 -1631 -2741 -4598 -8224 -8482 -8356 -9023 -15323 -5440 6005 5124 -6628
25789 -6628 -21520 -10561 -7251 -3227 4074 4417 13298 21285 19008 24940 27169 27431 6206 -1933
25775 -1933 -5557 -4647 17049 19700 16178 8883 10745 9530 4514 -8492 -14788 -1145 -6049 5923
25761 5923 -2642 -559 4803 -8887 -27232 -18415 -8583 -3416 -7366 789 -7055 -10928 -15392 -15974
25747 -15974 -16466 -8006 2650 -1222 -10855 -11292 7526 23977 31103 18144 16385 10326 174 -6105
25733 -6105 592 3886 -2056 7212 5927 -9024 -4309 6052 -7859 -20040 -26082 -15722 2109
25720 2109 1214 -1771 -4790 1594 -524 -19568 -12557 -22414 -18715 -4179 15573 9323 -12707 842
25706 842 13956 5345 -1735 -1556 -2715 -660 -6376 -15746 -9507 -2000 -2449 -12078 -16470 -7718 1335
$$ packed form
25805C473K405n62o68k524l755j110j857l626k58J26o67o300R883J1445q81j1752
25789f628j4892J0959L310M024P301L43Q881P987k277N932K229K62k1225q139
25775a933l624R10K1696K651l522p295J862j215n016j3006o296J3643m904J1972
25761E923q565K083N362j3690j8345Q817R832N167l950Q155p844l873m464n82
25747a5974m92Q460J0656l872r633m37J8818J6451P126j2959j759o059j0152o279
25733f105O697L294n942R268j285j4951M715J0361j3911j2181o042J0360J7831
25720B109q95k985l019O384k118j9044P011r857L699J4536J9752o250k2030J3549
25706H42J3114q611p080J79j159K055n716r370O239P507m49r629m392Q752R053
$$ plain form
25691 1335 8376 5697 1047 -7655 -1159 5908 -1222 -4371 2641 -10115 -13414 -9825 -19118 -17607
25677 -17607 -10733 -24603 -23884 -16415 -19052 -15502 558 -1420 -10291 -6407 -12201 -18737 -2858 12193
25663 12193 19521 13434 -1886 -8186 -8112 -2558 -1289 9097 6433 -15733 -25129 -27724 -21171 -13310
25649 -13310 -15027 -21314 -17651 -10798 -18595 -20473 -12524 -8014 -23068 -16567 -4242 -4324 4888 -1639
25635 -1639 -14639 -13889 -17484 -16949 -21231 -20411 -15567 -2088 -1692 -8424 -24443 -22936 -5267 6774
25621 6774 10101 7526 9191 8714 9932 9378 12306 17628 16364 13646 9417 962 3401 10420 11910
25606 11910 -2153 -7 8343 3790 8990 3696 9502 11501 -3754 -18793 -16130 -5843 5279
25593 5279 7475 -2362 644 5197 16016 17076 10603 5756 1677 9658 1207 -1559 1128 16545
$$ packed form
25691A335P041k679m650q702O496P067p130l149P012j2756l299L589r293J511
25677a7607O874j3870P19P469k637L550J6060j978q871L884n794o536J5879J5051
25663A2193P328o087j5320o300P4N554J269J0386k664k2166r396k595O553P861
25649a3310j717o287L663O853p797j878P949M510j5054O501J2325q2R212o527
25635a639j3000P50l595N35m282Q20M844J3479L96o732j6019J507J7669J2041
25621F774L327k575J665m77J218n54K928N322j264k718m229q455K439P019J490
25606A1910j4063K146Q350m553N200n294N806J999j5255j5039K663J0287J1122
25593E279K196r837L006M553J0819J060o473m847m079P981q451k766K687J5417
$$ plain form
25579 16545 14006 3346 -7884 -11436 2338 20257 19091 6941 -7259 -21116 -26073 -22797 1527
25566 1527 20703 2061 -4904 6505 14929 13675 12136 8514 5554 4295 13900 414 -5511 -18999
25552 -18999 -18294 -11103 -811 7011 13515 2433 -1505 -5407 -12042 -8509 -3208 -2539 -2019 1656 8876
25537 8876 65 -4164 -2745 -565 4309 -1159 8172 20302 26856 11475 9070 9970 11906 14309
25523 14309 23649 1846 -5774 -16145 -19049 -18042 -5641 11710 20690 19810 16647 1653 -6676
25510 -6676 -6207 4420 7100 5005 5330 110 -7978 -7696 -4601 -14994 -20058 -21199 -8044 4911
25496 4911 6573 -9777 -22963 -24375 -16252 -14983 -14360 -6550 -10890 -7204 5679 2127 -7819 -7805 3487
25481 3487 -1419 6272 26614 33566 30870 28803 18227 9317 8591 8611 -2268 -5907 -5013 -14059 -20892
$$ packed form
25579A6545k539j0660j1230l552J3774J7919j166j2150j4200j3857m957L276K4324
25566A527J9176j8642o965J1409Q424j254j539l622k960j259R605j3486n925j3488
25552a8999P05P191J0292P822O504j1082l938l902o635L533N301O69N20L675P220
25537H876q811m229J419K180M874n468R331J2130O554j5381k405R00J936K403
25523A4309R340k1803p620j0371k904J007J2401J7351Q980q80l163j4994q329
25510f676M69J0627K680k095L25n220q088K82L095j0393n064j141J3155J2955
25496D911J662j6350j3186j412Q123J269O23P810m340L686J2883l552r946J4J1292
25481C487m906P691K0342O952k696k067j0576q910p26K0j0879l639Q94r046o833
$$ plain form
25466 -20892 -28960 -41080 -33089 -36383 -28600 -16118 -886 -9323 -7128 -11619 -11674 -4561 -7472 -1308
25452 -1308 -2737 -5000 -6085 2627 17634 15171 4203 13440 9002 16488 23366 15382 25531 19031
25438 19031 -972 -11009 -10099 -15404 -13558 -6909 -7929 -11243 -7548 -2564 -4727 -4046 2641 -4284
25424 -4284 -10956 4736 19565 15211 11569 3897 -9255 -19382 -23672 -22874 -10312 -14053 -12196 -10462
25410 -10462 -14862 -3976 16843 20333 6702 2345 -4987 -6659 -13155 -15654 -11957 -17366 -5331
25397 -5331 -1249 4341 4953 6145 -913 -3704 3032 -6171 -10514 -8267 4199 -4116 -10580 -6014 4146
25382 4146 14441 18870 11460 -5169 -13811 -10982 4128 1530 -9011 -6318 -11504 -16175 -19103 -24321
25368 -24321 -23317 -7452 8043 12519 9629 6591 14766 14010 5222 10381 12260 10057 -3432 8999
$$ packed form
25466b0892q068j2120P991l294P783J2482J5232q437K195m491n5P113k911O164
25452a308j429k263j085Q712J5007k463j0968R237m438P486O878p984J0149o500
25438A9031k0003j0037R10n305J846O649j020l314L695M984k163O81O687o925
25424d284o672J5692J4829m354l642p672j3152j0127m290P98J2562l741J857J734
25410a0462m400J0886K0819L490j3631m357p332j672o496k499L697n409J2035
25397e331M082N590O12J192p058k791O736r203m343K247J2466q315o464M566J0160
25382D146J0295M429p410j6629q642K829J5110k598j0541K693n186m671k928n218
25368b4321J004J5865J5495M476k890l038Q175p56q788N159J879k203j3489J2431
$$ plain form
25354 8999 21643 9568 7596 14060 16783 15227 -6965 -8240 -1691 1251 10822 17245 11239 -1918
25340 -1918 -4071 -16711 -21596 -17644 -7246 9015 5193 -9718 13 16899 15583 11888 3217
25327 3217 -6779 -4996 -1755 -11593 -19272 -10664 -9607 -4600 -19301 -15863 -1871 -2215 3590 6143
25313 6143 -1173 -14969 -27008 -16733 -12539 -7231 6057 5992 4221 765 -16032 -7952 2750 5510
25299 5510 1357 -7604 -13385 -10882 -6251 -83 7401 8086 10042 14640 9105 5191 3120 -10645 -18220
25284 -18220 -11835 -12918 -15180 -15303 -9789 -2888 6325 27625 21636 7568 10231 9447 -6869 -5180
25270 -5180 710 -4638 -11442 -21966 -21087 -13446 3882 14324 18337 9013 7886 3376 -6644 -8438
25256 -8438 -8345 2305 7606 -5184 -3056 -7032 -5182 4131 9155 14981 16578 -5245 952 13930
$$ packed form
25354H999J2644j2075j972O464K723j556k2192j275O549K942R571O423o006j3157
25340a918k153j2640m885L952J0398J6261l822j4911R731J6886j316l695q671
25327C217r996J783L241r838p679Q608J057N007j4701L438J3992l44N805K553
25313F143p316j3796j2039J0275M194N308J3288o5j771l456j6797Q080J0702K760
25299E510m153q961n781K503M631O168P484O85J956M598n535l914k071j3765p575
25284a8220O385j083k262j23N514O901R213K1300n989j4068K663p84j6316J689
25270e180N890n348o804j0524Q79P641J7328J0442M013r324j127m510j0020j794
25256h438R3J0650N301j2790K128l976J850R313N024N826J597k1823O197J2978
$$ plain form
25242 13930 6372 -6188 -13091 -13739 -7823 -9366 -6457 -11141 -27369 -34325 -19540 -23996 -24568 -6148
25228 -6148 9759 26450 23250 11975 863 731 -276 101 9886 13160 15050 1710 -6732 -5540
25214 -5540 -1633 3583 7072 6937 3465 11273 13041 832 9200 18065 9795 -2214 -8657 5540
25200 5540 13959 14144 13039 9449 6552 2011 376 -9964 -22904 -27312 -10192 -3105 -12346 -1766
25186 -1766 7201 -5382 -24090 -15213 -4439 -5031 -5355 -16718 -20431 -16208 930 3963 3628 -2391
25172 -2391 -8082 467 6489 9333 -2548 -30384 -19810 -6283 -18026 -7136 2847 -5108 136
25159 136 603 -5636 -4583 -7691 -1590 444 1790 4085 -1964 -2687 8087 10567 12667 6608 593
25144 593 7491 13784 3762 4824 8439 4253 -7442 -11694 4560 5362 -213 1232 5761 18944
$$ packed form
25242A3930p558j2560o903o48N916j543K909m684j6228o956J4785m456n72J8420
25228f148J5907J6691l200j1275j1112j32j007L77R785L274J890j3340q442J192
25214e540L907N216L489j35l472P808J768j2209Q368Q865q270j2009o443J4197
25200E540Q419J85j105l590k897m541j635j0340j2940m408J7120P087r241J0580
25186a766Q967j2583j8708Q877J0774n92l24j1363l713M223J7138L033l35o019
25172b391n691Q549O022K844j1881k7836J0574J3527j1743J0890R983p955N244
25159A36M67o239J053l108O101K034J346K295o049p23J0774K480K100o059o015
25144E93O898O293j0022J062L615m186j1695m252J6254Q02n575J445M529J3183
$$ plain form
25130 18944 24296 32722 41838 36920 6308 -4241 6673 21789 15776 15324 8591 7511 10137 6178
25116 6178 5162 -2079 -13267 -20941 -4487 6256 -8557 -8773 -3877 3911 4671 18517 24788 20412
25102 20412 19020 12813 5909 -9375 -4944 5352 6539 18408 -5380 -31410 -20525 1712 8412
25089 8412 11990 11791 9045 16724 3677 -10993 -1798 1426 12787 25378 16748 16496 14139 -473
25075 -473 -17254 -20395 -15213 -20450 -11456 -8105 -1959 637 -6481 5179 16798 17648 16853 7331 7090
25060 7090 9012 3881 10248 14329 12850 677 -5112 7770 14158 12358 -5173 -5993 15889 9233
25046 9233 -5866 -8029 -18225 -13072 -15431 -14210 -4686 -1515 -8823 -26693 -22434 -13628 -20610 -26261
25032 -26261 -27602 -15777 -5920 -6211 -18947 -23133 -19164 -27015 -22882 -14955 -12820 1002 13534 19185
$$ packed form
25130A8944N352Q426R116m918l0612j0549J0914J5116o013m52o733j080K626l959
25116F178j016p241j1188p674J6454J0743j4813k16M896P788P60J3846O271m376
25102B0412j392o207o904j5284M431J0296J187J1869k3788k6030J0885K2237O700
25089H412L578j99k746P679j3047j4670R195L224J1361J2591q630k52k357j4612
25075d73j6781l141N182n237Q994L351O146K596p118J1660J1619Q50p95r522k41
25060G090J922n131O367M081j479j2173n789J2882O388j800j7531q20K1882o656
25046I233j5099k163j0196N153k359J221R524L171p308j7870M259Q806o982n651
25032b6261j341J1825R857k91j2736m186L969p851M133P927K135J3822J2532N651
$$ plain form
25018 19185 -114 -14285 -14991 -22684 -10875 6337 15596 12088 12413 9009 -450 -6229 -9948 2112
25004 2112 -10918 -20705 -17943 -14045 -15262 -815 2134 -7373 -10312 -5557 -5636 -10095 -3431 -14034
24990 -14034 -11604 -9092 2612 6385 12041 665 12998 11128 4279 -3787 -7099 -15660 -14769 -22285
24976 -22285 -19050 -13939 -21666 -27456 -15759 -3072 -5002 -17567 -30937 -16416 -826 -925 4318
24963 4318 11583 10823 -1854 1284 663 -1906 3143 -2383 -1006 10054 -1719 -10159 -11441 -3085
24949 -3085 6096 -3126 -19889 -18604 -20890 -21348 -12628 -3349 -6698 -1348 2444 -3586 -4229 -13967 -28143
24934 -28143 -25417 -23356 -14305 -17186 -7717 8678 8984 2558 5148 -751 -19613 -18785 1959 -5380
24920 -5380 -2392 26790 30300 4384 522 14296 16349 22923 18605 -9004 -11693 -6964 -1610 4679
$$ packed form
25018A9185j9299j4171p06p693J1809J7212R259l508L25l404r459n779l719J2060
25004B112j3030r787K762L898j217J4447K949r507k939M755p9m459O664j0603
24990a4034K430K512J1704L773N656j1376J2333j870o849q066l312q561Q91p516
24976b2285L235N111p727n790J1697J2687j930j2565j3370J4521J5590r9N243
24963D318P265p60j2677L138o21k569N049n526J377J1060j1773q440j282Q356
24949c085R181r222j6763J285k286m58Q720R279l349N350L792o030o43r738j4176
24934b8143K726K061R051k881R469J6395L06o426K590n899j8862Q28K0744p339
24920e380K988K9182L510k5916l862J3774K053O574m318k7609k689M729N354O289
$$ plain form
24906 4679 392 5867 -2695 -4921 -1267 -2979 -6617 -1636 -14258 -17112 -7697 -6220 -18686 -21607
24892 -21607 -12853 -11476 -11716 -15020 -23855 -23812 -26701 -11974 -13742 -24036 -28849 -19657 -22788 -14084 -1813
24877 -1813 11139 9832 11981 3757 -9498 -1394 -6431 -9211 -11418 -19207 -16102 -5946 -4955 -11284
24863 -11284 -17304 -3134 6241 -3591 1149 -54 1132 10455 1823 -11757 -15056 -10221 -7134 8048
24849 8048 21370 14217 -7963 -4073 5623 1792 1855 2862 -7778 -11152 -6962 -3837 1390 9218
24835 9218 6869 -3507 -12480 8177 19681 16027 5517 10130 7827 -5361 -8943 -16688 -24617
24822 -24617 -12154 3586 14218 11805 8076 5887 1131 -9183 -5206 3473 3873 -2979 -19407
24809 -19407 -10718 -13655 5149 -1466 -8132 -12506 -16603 -8944 -6469 -7356 -8567 -20632 -30275 -34662
$$ packed form
24906D679m287N475q562k226L654j712l638M981j2622k854R415J477j2466k921
24892b1607Q754J377k40l304q835M3k889J4727j768j0294m813R192l131Q704J2271
24877a813J2952j307K149q224j3255Q104n037k780k207p789L105J0156R91o329
24863a1284o020J4170R375r832M740j203J186R323q632j3580l299M835L087J5182
24849H048J3322p153k2180L890R696l831O3J007j0640l374M190L125N227P828
24835I218k349j0376q973K0657J1504l654j0510M613k303j3188l582p745p929
24822b4617J2463J5740J0632k413l729k189m756j0314L977Q679M00o852j6428
24809a9407Q689k937J8804o615o666m374m097P659K475q87j211j2065r643m387
$$ plain form
24795 -34662 -31150 -14574 -8816 -6619 -5810 -1209 2303 -2110 -3615 -16222 -22574 -14306 -15709 -22158
24781 -22158 -27365 -17504 -18858 -17593 -15255 -12780 -17806 -5774 192 2827 3341 -9785 -11789 -14240
24767 -14240 4698 1878 9429 10245 -10631 -4792 3953 16254 24805 18709 -8383 -12153 3857
24754 3857 -938 -16282 -11143 -20791 -24429 -26137 -30861 -27913 -14069 3335 8970 13473 26176 33152
24740 33152 27198 7297 9141 20591 34707 38019 13039 -6753 -14441 -1066 -442 -238 4804
24727 4804 13604 16827 10918 10382 9776 9019 5062 873 4430 14820 9009 4635 -7499 -17159 -19281
24712 -19281 -43719 -42719 -28931 -14825 -23695 -28183 -22873 -15340 -17707 -20969 -9759 -5947 -8126
24699 -8126 -8875 2718 1911 487 2862 -2433 -6455 -17477 -13849 -9351 -17419 -14073 -19483 -17480 -16539
$$ packed form
24795c4662L512J6576N758K197Q09M601L512m413j505j2607o352Q268j403o449
24781b2158n207R861j354J265K338K475n026J2032N966K635N14j3126k004k451
24767a4240J8938k820P551Q16k0876N839Q745J2301Q551o096k7092l770J6010
24754C857m795j5344N139r648l638j708m724K948J3844J7404N635M503J2703O976
24740C3152n954j9901J844J1450J4116L312k4980j9792p688J3375O24K04N042
24727D804Q800L223n909n36o06p57l957m189L557J0390n811m374j2134r660k122
24712a9281k4438J000J3788J4106q870m488N310P533k367l262J1210L812k179
24699h126p49J1593q07j424K375n295m022j1022L628M498q068L346n410K003R41
$$ plain form
24684 -16539 -4488 -8108 -9929 -13658 -18443 -12237 -2753 -11155 -14239 -7864 5679 12638 18525 10870
24670 10870 11276 3204 -1940 457 1751 -14377 -10424 1084 1864 -7896 -12990 -15996 -17432 -16243
24656 -16243 -12869 -3720 3639 2462 17174 15339 5485 602 -15263 -17381 -13731 -4339 -2687 -1232
24642 -1232 -116 1501 354 -4015 -12993 -19403 -20775 -15116 2343 25579 33735 41253 40149 15685
24628 15685 5943 -7020 -964 18175 19350 16406 10338 -5534 -15908 -9865 -1572 467 3066
24615 3066 2665 13163 19208 -3095 -20582 -17927 -17832 -19539 -27143 -23580 -22319 -12295 -9939 -7767
24601 -7767 9272 19150 7568 397 6312 9583 5060 7754 11105 9260 542 -19482 -25421 -19784
24587 -19784 -9781 -7365 -10567 -9610 -8778 -13756 -18736 -12861 -2831 -11388 -1605 -2792 -5251 -21941
$$ packed form
24684a6539J2051l620j821l729m785O206R484q402l084O375J3543O959N887p655
24670A0870M06q072n144K397J294j6128L953J1508P80r760n094l006j436J189
24656a6243L374R149P359j177J4712j835r854m883j5865k118L650R392J652J455
24642a232J116J617j147m369q978o410j372N659J7459K3236Q156P518j104k4464
24628A5685r742j2963O056J9139J175k944o068j5872j0374O043Q293K039K599
24615C066m01J0498O045k2303j7487K655R5j707p604L563J261J0024K356K172
24601g767J7039R878j1582p171N915L271m523K694L351j845q718k0024n939N637
24587a9784J0003K416l202R57Q32m978m980N875J0030q557R783j187k459j6690
$$ plain form
24573 -21941 -25706 -26343 -24844 -40468 -43751 -35870 -25693 -14477 -14072 684 -6226 -20850 -19894 -15564
24559 -15564 -20741 -28850 -21022 -21141 -25121 -13188 -3731 -5748 -9938 -11548 -13547 -1949 3392 5752
24545 5752 12251 13225 -2237 -1918 -6350 -9189 -26369 -30877 -32516 -30865 -31730 -15636 -7130 -8325 -10308
24530 -10308 -7053 -4675 -1477 4322 -3853 -1208 1392 2109 7583 8748 1455 -5213 -19956 -27258
24516 -27258 -30628 -30581 -24989 -16963 -11067 -2051 6657 13946 9773 -1825 -1913 8496 12524 8060 21308
24501 21308 33497 10963 11866 5496 522 4614 3857 6164 -2133 -3704 10661 754 -1729 -4192
24487 -4192 -12795 -11420 -9568 -13598 -12941 2661 16370 14862 -4693 -3060 -1826 8476 11190 3471
24473 3471 -15035 -7651 8339 15763 3921 -5207 -14635 -15478 -10665 -3838 -4116 -3045 -25582 -45668
$$ packed form
24573b1941l765o37J499j5624l283P881J0177J1216M05J4756o910j4624R56M330
24559a5564n177q109P828j19l980J1933R457k017m190j610j999J1598N341K360
24545E752O499R74j5462L19m432k839j7180m508j639J651q65J6094Q506j195j983
24530a0308L255K378L198N799q175K645K600P17N474J165p293o668j4743p302
24516b7258l370M7N592Q026N896R016Q708P289m173j1598q8J0409M028m464J3248
24501B1308J2189k2534R03o370m974M092p57K307q297j571J4365r907k483k463
24487d192q603J375J852m030O57J5602J3709j508j9555J633J234J0302K714p719
24473C471j8506P384J5990P424j1842r128r428q43M813O827k78J071k2537k0086
$$ plain form
24459 -45668 -46390 -34212 -22387 -31508 -32393 -29441 -18328 2342 19608 31867 19152 -1148 -12526
24446 -12526 -7059 -3185 -7669 -14274 -7011 -1054 -5228 -7525 -5182 -7421 -10119 3536 2093 -3360
24432 -3360 -6270 5380 8696 -2018 -5563 3201 6598 10393 18105 11099 -6680 -14313 -14355 -9910
24418 -9910 -3351 2548 -10678 -13619 -15505 -31799 -40307 -26010 -19855 -3494 2078 -4647 -7582 -18544
24404 -18544 -21050 -18471 -13329 -17132 -16188 -21982 -22292 -19793 5681 8576 13301 -14479 -25301 -14467
24390 -14467 -5384 1876 2515 -5109 -8540 3529 -7 3035 10431 5842 850 -4288 -973 -7154
24376 -7154 -15465 -19575 731 12695 12595 13226 7404 6725 3981 -18754 -26497 -29713 -17417 -2697
24362 -2697 3755 -7553 -8934 -7784 -5659 -5917 -13058 -4852 2073 -4750 -15281 -15159 -13863 -16873 -17823
$$ packed form
24459d5668p22J2178J1825r121q85K952J1113K0670J7266J2259j2715k0300j1378
24446a2526N467L874m484o605P263N957m174k297K343k239k698J3655j443n453
24432c360k910J1650L316j0714l545Q764L397L795P712p006j7779p633m2M445
24418i910O559N899j3226k941j886j6294q508J4297O155J6361N572o725k935j0962
24404a8544k506K579N142l803R44n794l10K499K5474K895M725k7780j0822J0834
24390a4467R083P260O39p624l431J2069l536L042P396m589m992n138L315o181
24376g154q311m110K0306J1964j00O31n822o79k744k2735p743l216J2296J4720
24362b697O452j1308j381J150K125k58p141Q206O925o823j0531J22J296l010r50
$$ plain form
24347 -17823 -18734 -19708 -16142 -18683 -16690 -16042 -15275 -12798 -3849 5088 -2700 -7643 -3579 5648 3879
24332 3879 -378 -370 -2701 4653 7890 5939 -7505 -5411 3737 6117 18771 18807 30453 19627 -7106
24317 -7106 -16539 -8901 -2372 8675 14819 6633 -2304 -3365 520 5332 -9009 -12114 -7962 1389
24303 1389 3258 -12556 -14924 -1528 -14951 -18684 -7267 -1122 2582 6335 -6434 -13473 -3641
24290 -3641 18041 12330 11919 16402 20963 20203 10135 7200 5884 6603 -2083 -1570 -2576 -8727 -12367
24275 -12367 -5045 -7382 -3905 -496 -2813 -5669 -2710 5360 2875 2741 -2493 -12491 -10901 -1602 7117
24260 7117 -9038 -19464 -15585 -2993 2415 -11611 -14705 -25769 -23243 -10076 8834 12167 9766
24247 9766 3237 7928 8883 51 6026 16283 21455 22559 4839 408 -8113 -11380 -21011 -5898
$$ packed form
24347a7823r11r74L566k541J993O48P67K477Q949Q937p788m943M064R227j769
24332C879m257Qk331P354L237j951j3444K094R148K380J2654L6J1646j0826k6733
24317g106r433P638O529J1047O144q186q937j061L885M812j4341l105M152R351
24303A389J869j5814k368J3396j3423l733J1417O145L704L753j2769p039R832
24290c641K1682n711m11M483M561p60j0068k935j316P19q686N13j006o151l640
24275a2367P322k337L477L409k317k856K959Q070k485j34n234r998J590R299Q719
24260G117j6155j0426L879J2592N408j4026l094j1064K526J3167J8910L333k401
24247I766o529M691R55q832N975J0257N172J104j7720m431q521l267r631J5113
$$ plain form
24233 -5898 7625 9667 8463 5457 -757 -8774 -5183 852 -3436 6262 3149 -16342 -17264 -15467
24219 -15467 -6477 -2987 -1547 -3189 -7626 -2481 7401 13643 8637 9065 17641 12922 13344 18369 7171
24204 7171 -10950 -20817 -26540 -26321 -17377 -10308 -4556 -692 -1499 3743 2844 6854 8089 12952 22556
24189 22556 26070 18184 27539 28561 24981 16893 13035 3461 6409 -6775 -15162 -182 593 -7384
24175 -7384 -24347 -29827 -16014 -16108 -13205 -10984 -16596 -19786 -14678 -7566 -2414 2712 11580 17841 728
24160 728 -629 4127 3395 -7721 -250 2381 4873 7135 995 5459 1726 -1352 3334 4678 -12529
24145 -12529 -23535 -18002 -4377 5361 15612 14648 10021 -817 -17505 -11410 -584 4472 2919
24132 2919 2368 -7206 -23751 -30260 -21691 -19079 -18140 -28934 -25745 -12517 -9844 -7243 -883 -13123
$$ packed form
24233e898J3523K042j204l006o214q017L591O035m288R698l113j9491r22J797
24219a5467Q990L490J440j642m437N145R882O242n006M28Q576m719M22N025j1198
24204G171j8121r867n723K19Q944P069N752L864q07N242q99M010J235M863R604
24189B2556L514p886R355J022l580q088l858r574K948j3184q387J4980P75p977
24175g384j6963n480J3813r4K903K221n612l190N108P112N152N126Q868O261j7113
24160G28j357M756p32j1116P471K631K492K262o140M464l733l078M686J344j7207
24145a2529j1006N533J3625R738J0251r64m627j0838j6688O095J0826N056j553
24132B919n51r574j6545o509Q569K612R39j0794L189J3228K673K601O360j2240
$$ plain form
24118 -13123 -19734 -16214 -12622 -15715 -14370 -15418 -6860 -4590 -3493 6756 9027 -5152 -15892 -8059
24104 -8059 258 5480 2271 -9194 -2883 14967 13076 2533 -7896 -18992 -13479 -16218 -18969
24091 -18969 -24941 -19194 -6822 -2500 -17374 -28128 -31594 -24160 -6209 7385 1089 -14875 -22644
24078 -22644 -12221 10618 15715 3447 670 11889 17813 18694 15952 5157 -5226 -19208 -18744
24065 -18744 -13241 -17444 -17907 -11245 3887 -2010 -6728 -9475 -11172 -6767 -6402 -15433 -12034 -16832 -11777
24050 -11777 -12921 -19976 -8042 1594 -9152 -14381 -11001 -5561 -3122 -7307 -1248 2899 -1827 784
24036 784 10426 10424 9519 3976 8116 4667 1606 4242 11480 -2134 -13998 -17834 -8982 -11524 -3853
24021 -3853 2474 3810 11623 19806 20362 2068 -4137 -9422 -1613 3349 8246 3363 -1443 2601 1867
$$ packed form
24118a3123o611L520L592l093J345j048Q558K270J097J0249K271j4179j0740P833
24104h059Q317N222l209j1465O311J7850j891j0543j0429j1096N513k739k751
24091a8969n972N747J2372M322j4874j0754l466P434J7951J3594o296j5964p769
24078b2644J0423K2839N097j2268k777J1219N924Q81k742j0795j0383j3982M64
24065a8744N503m203m63O662J5132n897m718k747j697M405L65r031L399m798N055
24050a1777j144p055J1934R636j0746n229L380N440K439m185O059M147m726K611
24036G84R642kr05n543M140l449l061K636P238j3614j1864l836Q852k542P671
24021c853O327J336P813Q183N56j8294o205n285P809M962M897m883m806M044p34
$$ plain form
24006 1867 2054 4530 -4343 -6561 2618 8210 8920 9028 -2872 -8405 2557 7232 6660 2801 -7956
23991 -7956 -3814 -3285 -10824 -8561 -6770 -1423 1186 2115 -396 -3794 -7338 -3212 215 -4682 -7954
23976 -7954 -2106 6824 4633 6540 14173 11330 9714 11884 4546 -1104 3230 3514 1124 -1836 -7508
23961 -7508 -284 7242 13721 3670 -13886 -371 -6895 -14408 -15467 -13232 6145 801 -3567 -1234
23947 -1234 7028 12028 3835 -5168 -2584 -8985 -21534 -35167 -22609 -22524 -15502 -9894 -7580 -12376
23933 -12376 -13886 985 -6501 -9001 -6942 -10108 -17920 -23873 -28432 -28992 -12834 -2023 2262 -678
23919 -678 1544 10674 -1172 -12199 -8120 -13727 -4257 2242 -11350 -20790 -6181 6270 12900 -1997
23905 -1997 -21098 -14902 -1713 2214 -12103 -19914 -17616 -16454 1018 5687 4673 -3117 -2992 11599
$$ packed form
24006A867J87K476q873k218R179N592P10J08j1900n533J0962M675n72l859j0757
23991g956M142N29p539K263J791N347K609R29k511l398l544M126L427m897l272
23976g954N848Q930k191J907P633k843j616K170p338n650M334K84k390k960n672
23961g508P224P526O479j0051j7556J3515o524p513j059K235J9377n344m368K333
23947a234Q262N000q193r003K584o401j2549j3633J2558Q5P022N608K314m796
23933a2376j510J4871p486k500K059l166p812n953m559n60J6158J0811M285k940
23919f78K222R130j1846j1027M079n607R470O499j3592r440J4609J2451O630j4897
23905a997j9101O196J3189L927j4317p811K298J162J7472M669j014p790J25J4591
$$ plain form
23891 11599 7001 -866 -2047 -536 11731 16048 2760 -3862 -11044 1955 8479 -7134 -4340
23878 -4340 10470 -2616 -14951 -1601 9016 20707 10074 909 -5362 -11537 -12044 -4290 2494
23865 2494 1389 -2008 16840 16943 7512 -19776 -30477 -22398 -11909 -3350 -4319 -13445 -26650 -30889
23851 -30889 -14771 -6357 -13809 -11193 1327 -786 -1910 -6863 -10205 -16482 -21596 -18569 -7428 12432
23837 12432 10052 412 6462 8558 20525 25276 19485 15782 27677 26795 29092 22195 13114 13665
23823 13665 9295 15111 16823 8852 -8316 -19375 -10008 -12539 -31964 -20948 -2038 -1984 -2378 1484
23809 1484 6832 -297 -12878 -11040 -11418 -7847 -13356 -11496 431 6018 7002 8195 6738 499 -7604
23794 -7604 363 17130 18842 20729 19141 1645 -8956 -7494 -6402 8365 12002 11151 14895 8607
$$ packed form
23891A1599m598p867j181J511J2267M317j3288o622p182J2999O524j5613K794
23878d340J4810j3086j2335J3350J0617J1691j0633r165o271o175n07P754O784
23865B494j105l397J8848J03r431k7288j0701Q079J0489Q559r69r126j3205m239
23851c0889J6118Q414p452K616J2520k113j124m953l342o277n114L027J1141J9860
23837A2432k380r640O050K096J1967M751n791l703J1895q82K297o897r081N51
23823A3665m370N816J712p971j7168j1059R367k531j9425J1016J8910N4l94L862
23809A484N348p129j2581J838l78L571n509J860J1927N587R84J193j457o239q103
23794g604P967J6767J712J887j588j7496j0601J462J092J4767L637q51L744o288
$$ plain form
23780 8607 -1843 -6220 -1359 -9295 -17628 -6295 8687 10624 2004 3770 9846 26922 26366 4907
23766 4907 5676 2640 4768 1073 1229 1397 15767 4852 5418 8707 -1378 -5441 -488 -4638 -3389
23751 -3389 6541 3816 -3686 -10245 -21447 -22422 -16338 -11066 -8341 -3910 -2764 -8846 -15816 -15960 -21498
23736 -21498 469 22976 23500 8874 -1776 2811 17011 11876 24923 18297 9199 6164 -8592
23723 -8592 -758 -446 -8627 -8205 -7926 -11058 -15254 -11035 -3936 2420 -1203 1536 1212 -4345 -435 -3697
23707 -3697 -3492 12852 33615 22640 7061 -3031 -18861 -18687 -9075 -2567 9556 7320 8837
23694 8837 16083 1660 -1351 5485 6578 8733 22962 15921 7341 11519 14878 2065 -13362 -22964
23680 -22964 -25723 -31383 -24448 -18090 -13532 -4975 -8661 -9733 10195 16318 6043 10512 17556 12445
$$ packed form
23780H607j0450m377M861p936q333J1333J4982J937q620J766O076J7076n56k1459
23766D907P69l036K128l695J56J68J4370j0915N66L289j0085m063M953m150J249
23751c389R930k725p502o559j1202r75O084N272K725M431J146o082o970j44n538
23736b1498K1967K2507N24j4626j0650M587J4200n135J3047o626r098l035j4756
23723h592P834L12q181M22K79l132m196M219P099O356l623K739l24n557L910l262
23707c697K05J6344K0763j0975j5579j0092j5830J74R612O508J2123k236J517
23694H837P246j4423l011O836J093K155J4229p041q580M178L359j2813j5427r602
23680b2964k759n660O935O358M558Q557l686j072J9928O123j0275M469P044n111
$$ plain form
23666 12445 -448 -571 12021 21716 22619 23379 11276 -5308 -549 3582 337 -15256 -14590 3851
23652 3851 15305 8799 16782 14447 14571 19979 12888 3863 7601 4387 4798 2991 -2621 -8919 -11275
23637 -11275 -10593 -16386 -18399 -9660 -5920 6710 18224 17195 14382 -11195 -22986 -31505 -35847 -29822
23623 -29822 -21885 -6024 -4362 -9428 -18138 -17973 -16378 -5 -5766 -15787 5361 16602 18704
23610 18704 9136 7611 16347 3524 -4042 1855 5563 -79 -8138 -10045 -10876 -380 5340 7912
23596 7912 2943 -1177 1983 -2223 -7488 -6438 -10810 -10562 -2665 -7904 -17208 -21778 -16299 -18845 -14978
23581 -14978 1209 12515 12136 11081 334 -4118 -15733 -11086 -2460 5647 7323 -347 -17223
23568 -17223 -16346 -16288 -7493 -9202 -2056 -8336 -18728 -15982 -16280 -19097 -14379 -22727 -21322 -11984 -559
$$ packed form
23666A2445j2893j23J2592R695R03P60j2103j6584M759M131l245j5593O66J8441
23652C851J1454o506P983k335J24N408p091r025L738l214M11j807n612o298k356
23637a1275O82n793k013Q739L740J2630J1514j029k813k5577j1791q519m342O025
23623b9822P937J5861J662n066q710J65J595J6373n761j0021K1148J1241K102
23610A8704r568j525Q736j2823p566N897L708n642q059j907q31J0496N720K572
23596G912m969m120L160m206n265J050m372K48P897n239r304m570N479k546L867
23581a4978J6187J1306l79j055j0747m452j1615M647Q626Q107J676p670j6876
23568a7223Q77N8Q795j709P146o280j0392K746k98k817M718q348J405R338J1425
$$ plain form
23553 -559 8446 -5770 -2586 1282 -590 -3785 -2766 6845 11270 22488 14297 -8659 -13747 -18538
23539 -18538 -5117 -3689 -6287 -10118 -6726 -8469 -4123 2917 -7759 -15354 -5977 10621 21250
23526 21250 17855 15259 14769 8594 12648 17126 10760 5571 1182 -5892 1484 5923 180 -7965 -3361
23511 -3361 9560 -6650 1216 6334 6532 12629 11279 9338 18429 23242 27011 35835 32417 15435
23497 15435 4411 -6486 -14182 -16397 -13651 -9396 7494 13598 5523 8553 1518 -10519 -23119
23484 -23119 -33429 -17443 -5570 -3419 -6807 -7720 11057 13687 7154 5681 9572 24227 17381
23471 17381 5000 15790 30851 42817 42600 39306 26289 14857 10026 280 -8458 -2615 -5734
23458 -5734 -534 1797 6051 -8508 -11997 -3582 -6931 -11772 -11523 -6570 -8988 -7954 -9623 -18266 -5583
$$ packed form
23553e59R005j4216L184L868j872l195J019R611M425J1218q191k2956n088m791
23539a8538J3421J428k598l831L392j743M346P040j0676p595R377J6598J0629
23526B1250l395k596m90o175M054M478o366n189m389p074P376M439n743q145M604
23511c361J2921j6210P866N118J98O097j350j941R091M813L769Q824l418j6982
23497A5435j1024j0897p696k215K746M255J6890O104q075L030p035j2037j2600
23484b3119j0310J5986J1873K151l388r13J8777K630o533j473L891J4655o846
23471A7381j2381J0790J5061J1966k17l294j3017j1432m831r746q738N843l119
23458e734N200K331M254j4559l489Q415l349m841K49M953k418J034j669q643J2683
$$ plain form
23443 -5583 -43 11585 16109 2145 -9390 -27727 -14921 -6630 2572 -7357 -14817 -12903 -14847
23430 -14847 -17932 -15273 -6819 -2390 -5617 -11935 -12239 -9531 -7998 -14405 -13567 -1054 7927 10826 -1711
23415 -1711 -10206 -7388 2611 16805 16488 15418 14325 7360 -269 -12585 -9072 -5048 2082 8768
23401 8768 6245 810 1620 5611 2400 8043 12516 15181 8835 11955 11787 -1761 -13722 -5565 -2149
23386 -2149 157 -2506 -5288 9339 23178 22326 6291 8457 5235 7530 21061 1073 -4995 -3431
23372 -3431 -8275 -8917 -10629 -3934 6960 11802 16968 18164 2856 -4114 5426 17827 11478 2888
23358 2888 16235 5976 3469 7947 23297 29278 30571 29397 27259 10513 -5045 -850 5387
23345 5387 19646 14022 1394 3357 -4881 -809 15808 12144 10928 10350 856 126 15269 34421
$$ packed form
23443e583N540J1628M524j3964j1535j8337J2806Q291R202r929p460J914j944
23430a4847l085K659Q454M429l227o318l04K708J533o407Q38J2513Q981K899j2537
23415a711q495K818R999J4194l17j070j093o965p629j2316L513M024P130O686
23401H768k523n435Q10L991l211N643M473K665o346L120j68j3548j1961Q157L416
23386b149K306k663k782J4627J3839q52j6035K166l222K295J3531j9988o068J564
23372c431m844o42j712O695J0894M842N166J196j5308o970R540J2401o349q590
23358B888J3347j0259k507M478J5350N981J293j174k138j6746j5558M195O237
23345E387J4259n624j2628J963q238M072J6617l664j216n78r494p30J5143J9152
$$ plain form
23331 34421 29314 10215 -1999 5567 14697 13247 19275 7907 57 -5410 1064 12517 24178
23318 24178 17160 18308 24074 22543 21670 8209 11077 7793 -8104 -5739 7423 8409 6224 10571
23304 10571 21307 12333 3299 -807 -8273 -5980 -5077 -4018 -4325 9341 8946 2824 -554 -260 -11482
23289 -11482 -15004 -7309 -2559 869 8232 11341 14866 14537 6743 4550 -333 -6377 -17478 -21043
23275 -21043 -29894 -31995 -29907 -25637 -17675 -7901 2423 3386 -2110 -2499 -1314 5457 1503 963 1305
23260 1305 -2926 3977 1966 725 9625 15909 6695 11322 14054 3138 68 6035 10370 6043
23246 6043 16715 10751 18211 17818 15410 37685 64838 83945 77948 66353 68946 81010 85459
23233 85459 64135 56281 61258 56081 47228 38266 23456 15216 18966 20404 15779 1978 2505 5786
$$ packed form
23331C4421n107j9099j2214P566R130j450O028j1368p850n467O474J1453J1661
23318B4178p018J148N766j531q73j3461K868l284j5897K365J3162R86k185M347
23304A0571J0736q974r034m106p466K293R03J059l07J3666l95o122l378K94j1222
23289a1482l522P695M750L428P363L109L525l29p794k193m883o044j1101l565
23275b1043q851k101K088M270P962R774J0324R63n496l89J185O771l954n40L42
23260A305m231O903k011j241Q900O284r214M627K732j0916l070N967M335m327
23246F043J0672n964P460l93k408K2275K7153J9107n997j1595K593J2064M449
23233H5459k1324p854M977n177q853q962j4810q240L750J438m625j3801N27L281
$$ plain form
23219 5786 8098 14654 2583 1471 17823 8320 7891 13810 10820 6388 2312 11288 26802 41798
23205 41798 40087 36776 19763 14865 26471 27189 19262 14257 13189 19292 16802 18266 9609 7698
23191 7698 12739 22818 28774 29190 22751 7667 -1668 -1848 7374 13700 7330 -7514 -6604 10269
23177 10269 21625 38910 37013 33884 25916 15375 13676 15391 6689 13942 4633 399 -4476 5866
23163 5866 569 8224 26577 30650 35289 24980 18336 14892 3730 3108 15071 10780 12343 7712
23149 7712 21422 38931 43188 25886 14718 10186 10560 13786 21566 28154 29563 35985 35362 35065
23135 35065 48372 51133 50834 44262 43722 32087 42050 50070 67767 78894 79508 76888 91930 100658
23121 100658 128411 163496 192605 232922 295171 399420 568443 821639 1122424 1387197
$$ packed form
23219E786K312O556j2071j112J6352r503m29N919k990m432m076Q976J5514J4996
23205D1798j711l311j7013m898J1606P18p927n005j068O103k490J464q657j911
23191G698N041J0079N956M16o439j5084r335j80R222O326o370j4844R10J6873
23177A0269J1356J7285j897l129p968j0541j699J715q702P253r309m234m875J0342
23163E866n297P655J8353M073M639j0309o644l444j1162o22J1963m291J563m631
23149G712J3710J7509M257j7302j1168m532L74L226P780O588J409O422o23k97
23135C5065J3307K761k99o572n40j1635R963Q020J7697J1127O14k620J5042Q728
23121A00658K7753L5085K9109M0317O2249J04249J69023K53196L00785K64773
$$ plain form
23111 1387197 1565367 1645226 1573750 1379641 1127795 900256 670831 470721 354948 286464
23101 286464 229312 183796 149259 125951 105351 97477 93869 98450 103923 96529 91367 82753 81779
23088 81779 97611 107690 101519 96805 109310 131609 139727 147679 162772 200068 216837 216740 200769
23075 200769 176998 167168 164924 157356 164301 198155 252114 303991 352153 411683 451400 467376
23063 467376 457147 425730 377175 336686 313036 294546 282633 281677 294457 330462 375644 407532
23051 407532 435110 439125 430294 403609 339370 281612 236344 201083 194166 187727 172113 170085
23039 170085 168866 186382 198664 188173 172890 168436 162280 144473 124883 100859 79509 73762
23027 73762 87815 91008 78439 64932 69516 75829 72252 67292 64801 62244 56443 50241 41108 32018
$$ packed form
23111A387197J78170P9859p1476j94109k51846k27539k29425k00110j15773o8484
23101B86464n7152m5516l4537k3308k0600p874l608M581N473p394n162q614r74
23088H1779J5832J0079o171m714J2505K2299Q118P952J5093L7296J6769r7j5971
23075B00769k3771r830k244p568O945L3854N3959N1877M8162N9530L9717J5976
23063D67376j0229l1417m8555m0489k3650j8490j1913r56J2780L6005M5182L1888
23051D07532K7578M015q831k6685o4239n7758m5268l5261o917o439j5614k028
23039A70085j219J7516J2282j0491j5283m454o156j7807j9590k4024k1350n747
23027G3762J4053L193j2569j3507M584O313l577m960k491k557n801o202r133r090
$$ plain form
23013 32018 23941 24101 31925 34411 32819 21479 8409 14532 13710 1976 9948 10795 3928 6684
22999 6684 17945 27159 43031 45729 43144 40244 36961 36618 33719 41312 36538 47644 46808 39363
22985 39363 28467 25746 29541 49597 58306 37496 37305 45284 46521 48664 44453 34114 29448 27554
22971 27554 25607 28446 25781 23197 11878 16101 15324 -1529 901 14456 29403 37597 37392 34976
22957 34976 35896 37582 27562 7949 19871 31891 36579 31659 41342 53819 38377 18828 9091
22944 9091 8895 22920 35560 27339 22106 25751 25148 27357 25314 25130 21622 12385 4525 15525 20919
22929 20919 38882 53321 46474 31228 18765 15121 16196 29951 27511 14650 8429 5621 13446
22916 13446 11889 8406 4782 16693 36119 42075 31969 32489 42667 44417 23959 19322 12885
$$ packed form
23013C2018q077J60P824K486j592j1340j3070O123q22j1734P972Q47o867K756
22999F684J1261R214J5872K698k585k900l283l43k899P593m774J1106q36p445
22985C9363j0896k721L795K0056Q709k0810j91P979J237K143m211j0339m666j894
22971B7554j947K839k665k584j1319M223p77j6853K430J3555J4947Q194k05k416
22957C4976R20J686j0020j9613J1922J2020M688m920R683J2477j5442j9549r737
22944I091j96J4025J2640q221n233L645o03K209k043j84l508r237p860J1000N394
22929B0919J7963J4439o847j5246j2463l644J075J3755k440j2861o221k808P825
22916A3446j557l483l624J1911J9426N956j0106N20J0178J750k0458m637o437
$$ plain form
22903 12885 9748 19034 24800 25380 31806 22093 13523 31331 36022 30111 24057 32941 30906 28496
22889 28496 15646 3210 -8835 7361 21796 31285 25522 24554 32132 32695 25993 19469 10240 16850
22875 16850 21382 8302 12362 29618 38493 38684 41092 53816 47882 16535 -17880 -49199 -64551
22862 -64551 -71198 -74325 -60124 -44437 -17276 6507 26913 38084 45924 38144 32579 35364 38197
22849 38197 42727 45401 25432 1407 -3873 10768 38343 47197 46798 26841 23608 39745 42890
22836 42890 39477 20838 17473 24803 34298 33260 30835 33121 26474 21235 20700 17962 28812 46988
22822 46988 53755 65316 70780 78854 86861 88504 94019 98279 114013 144024 162776 168558 177840
22809 177840 210046 212575 214542 230494 202990 182590 169031 147722 135120 132553 129559 124251
$$ packed form
22903A2885l137R286N766N80O426r713q570J7808M691n911o054Q884k035k410
22889B8496j2850j2436j2045J6196J4435R489n763r68P578N63o702o524r229O610
22875A6850M532j3080M060J7256Q875J91K408J2724n934l1347l4415l1319j5352
22862f4551o647l127J4201J5687K7161K3783K0406J1171P840p780n565K785K833
22849C8197M530K674j9969k4025n280J4641K7575Q854l99j9957l233J6137L145
22836D2890l413j8639l365P330R495j038k425K286o647n239n35k738J0850J8176
22822D6988O767J1561N464Q074Q007J643N515M260J5734L0011J8752N782R282
22809A77840L2206K529J967J5952k7504k0400j3559k1309j2602k567k994n308
$$ plain form
22797 124251 110416 98263 74471 69335 79522 79800 80606 72204 65605 62673 64037 63616 74329 75907
22783 75907 80682 72633 61477 38422 38540 41426 43610 54444 73053 73570 64449 57831 67767 70935
22769 70935 75314 80511 73212 60048 52990 50592 47258 54045 68267 81736 95998 96639 98060 95643
22755 95643 87310 77622 53122 24790 2620 -23202 -53462 -65205 -72003 -74401 -50802 -47418 -42012
22742 -42012 -20277 -3828 752 630 -2057 6767 7502 3736 29311 51690 52463 48065 43114 44572
22728 44572 49095 58846 50754 65968 85469 93870 115554 117888 113577 118746 119098 114260 107403 111036
22714 111036 106194 117707 118461 117251 118366 110809 71840 34083 26286 38193 37590 53374 55357
22701 55357 63750 75216 84808 100964 107048 120179 128979 122501 122062 116922 128239 124391 140867
$$ packed form
22797A24251j3835j2153k3792n136J0187K78Q06q402o599k932J364m21J0713J578
22783G5907M775q049j1156k3055J18K886K184J0834J8609N17r121o618R936L168
22769G0935M379N197p299j3164p058k398l334O787J4222J3469J4262O41J421k417
22755I5643q333r688k4500k8332k2170k5822l0260j1743o798k398K3599L384N406
22742d2012K1735J6449M580j22k687Q824P35l766K5575K2379P73m398m951J458
22728D4572M523R751q092J5214J9501Q401K1684K334m311N169L52m838o857L633
22714A11036m842J1513P54j210J115p557l8969l7757p797J1907o03J5784J983
22701E5357Q393J1466R592J6156O084J3131Q800o478m39n140J1317l848J6476
$$ plain form
22688 140867 145651 147140 141130 148508 171771 208329 276906 353888 420234 456901 431838 386247
22676 386247 320380 249014 199379 164786 145160 137934 123151 120865 115665 112997 108923 111873 112812
22663 112812 100852 87650 84162 110436 133492 137479 160141 166353 171027 171514 178875 176337 171359
22650 171359 178913 193357 211803 228050 255872 270712 299087 349076 407438 466670 516148 596770
22638 596770 717238 904703 1215509 1562361 1843349 2052329 2132876 2037265 1829904 1593100
22628 1593100 1359486 1110957 910305 807982 755366 712649 686091 667064 648423 638352
22618 638352 644016 636005 633721 643828 663646 674960 690100 720607 743532 776238 797042 809719
22606 809719 825223 850253 867994 900722 942895 989929 1048878 1124939 1211721 1276357 1327424
$$ packed form
22688A40867M784J489o010P378K3263L6558O8577P6982O6346L6667k5063m5591
22676C86247o5867p1366m9635l4593j9626p226j4783k286n200k668m074K950R39
22663A12812j1960j3202l488K6274K3056L987K2662O212M674M87P361k538m978
22650A71359P554J4444J8446J6247K7822J4840K8375M9989N8362N9232M9478Q0622
22638E96770J20468J87465L10806L46852K80988K08980Q0547r5611k07361k36804
22628A593100k33614k48529k00652j02323n2616m2717k6558j9027j8641j0071
22618F38352N664q011k284J0107J9818J1314J5140L0507K2925L2706K0804J2677
22606H09719J5504K5030J7741L2728M2173M7034N8949P6061Q6782O4636N1067
$$ plain form
22595 1327424 1358005 1391281 1421552 1453671 1515091 1597023 1679906 1795384 1944088 2113492 2313136
22584 2313136 2520040 2751605 2990372 3227858 3473055 3736574 4022611 4353922 4738908
22575 4738908 5212030 5790805 6502791 7353844 8362126 9550494 10955488 12676185 14848939
22566 14848939 17684597 21395406 26227735 32427534 40657489 52515655 71571257 104405731
22558 104405731 155488242 212964466 258979396 292641348 306776490 291783951 253578665
22551 253578665 207024638 163030063 119441534 82249809 58440428 44509720 35742956
22544 35742956 29722916 25263742 21824767 19180089 17153391 15580250 14319996 13316189
22536 13316189 12532680 11910675 11409258 10953932 10482467 9943796 9351897 8706273 8043620
$$ packed form
22595A327424L0581L3276L0271L2119O1420Q1932Q2883J15478J48704J69404J99644
22584B313136K06904K31565K38767K37486K45197K63519K86037L31311L84986
22575D738908M73122N78775P11986Q51053J008282J188368J404994J720697K172754
22566A4848939K835658L710809M832329O199799Q229955J1858166J9055602L2834474
22558A04405731N1082511N7476224M6014930L3661952J4135142j4992539l8205286
22551B53578665m6554027m3994575m3588529l7191725k3809381j3930708q766764
22544C5742956o020040m459174l438975k644678k026698j573141j260254j003807
22536A3316189p83509o22005n01417m55326m71465n38671n91899o45624o62653
$$ plain form
22527 8043620 7419544 6860197 6394567 5993466 5661044 5380536 5134609 4898542 4689419
22518 4689419 4457881 4243229 4053051 3874796 3715512 3587151 3486199 3391335 3281725 3175846
22508 3175846 3071658 2920194 2744945 2561564 2359396 2172083 1991956 1829529 1689459
22499 1689459 1578340 1462316 1367208 1288456 1206412 1143320 1095898 1043034 976162 916087 876333
22488 876333 843572 806898 772375 750966 734382 737378 743087 772086 861360 1041936 1323385
22477 1323385 1604877 1831422 1989828 2024542 1899843 1661293 1388847 1128352 887209 714123
22467 714123 611173 545749 529694 520573 511748 500271 471428 452134 435610 424608 409828 398879
22455 398879 383767 368063 370114 352155 340068 346388 332390 323135 310140 296734 304975 309334
$$ packed form
22527H043620o24076n59347m65630m01101l32422k80508k45927k36067k09123
22518D689419k31538k14652j90178j78255j59284j28361j00952r4864j09610j05879
22508C175846j04188j51464j75249j83381k02168j87313j80127j62427j40070
22499A689459j11119j16024r5108p8752q2044o3092m7422n2864o6872o0075l9754
22488H76333l2761l6674l4523k1409j6584K996N709K8999Q9274J80576K81449
22477A323385K81492K26545J58406L4714j24699k38550k72446k60495k41143j73086
22467G14123j02950o5424j6055r121q825j1477k8843j9294j6524j1002j4780j0949
22455C98879j5112j5704K051j7959j2087O320j3998r255j2995j3406Q241M359
$$ plain form
22443 309334 298069 291290 290058 287483 275627 271368 256607 257391 250745 249351 254885 277727 289403
22430 289403 301229 293968 270060 244742 210055 188053 180460 156711 126912 99045 92274 91667
22418 91667 67294 71088 81151 93454 98238 84814 83988 87182 94849 106313 128176 137700 149438
22405 149438 169182 163033 157454 143989 117773 106055 103538 78839 52241 52519 64387 64832 53648
22392 53648 58330 66645 58635 49987 51049 51791 42578 41371 59434 67984 67680 71117 61532 57937 54590
22377 54590 60115 64814 65576 74175 86324 91070 90631 75636 86700 112640 120823 131673 139990 163867
22363 163867 173442 174132 173598 163601 158996 141528 116899 85998 71135 57501 37308 30160 21343
22350 21343 21220 22936 19611 31219 37351 42167 51229 55126 57710 51397 54038 24411 7814 4687
$$ packed form
22443C09334j1265o779j232k575j1856m259j4761P84o646j394N534K2842J1676
22430B89403J1826p261k3908k5318l4687k2002p593k3749k9799k7867o771o07
22418I1667k4373L794J0063J2303M784j3424q26L194P667J1464K1863R524J1738
22405A49438J9744o149n579j3465k6216j1718k517k4699k6598K78J1868M45j1184
22392E3648M682Q315q010q648J062P42r213j207J8063Q550l04L437r585l595l347
22377E4590N525M699P62Q599J2149M746m39j4995J1064K5940Q183J0850Q317K3877
22363A63867R575O90n34r997m605j7468k4629l0901j4863j3634k0193p148q817
22350B1343j23J716l325J1608O132M816R062L897K584o313K641k9627j6597l127
$$ plain form
22336 4687 12721 33940 39803 45080 40525 22339 40060 44908 46774 52380 51855 46030 40663 36618
22322 36618 25733 16032 19107 2138 -4083 -3560 -6005 -8577 -6724 -3064 -3474 -13274 -9699 -1756
22308 -1756 -9783 -11194 -3276 -3498 -3873 15108 37382 28397 20393 27739 30184 26478 16504 12833 10780
22293 10780 309 -8741 -6980 2932 8040 13503 13599 1279 -379 13625 26674 29382 13840 4006
22279 4006 26473 35047 35735 33063 27216 29474 30989 29707 41089 35177 13766 12132 13262 34638
22265 34638 51331 53475 44281 34900 36632 27683 19740 6342 4984 1798 -4231 -11806 -8351 5136
22251 5136 25262 36899 65717 99241 119427 126023 117934 110052 81515 57428 29373 13442
22239 13442 -825 -1826 4131 8294 24812 35928 29823 21787 20812 20176 22236 28159 33321 30276
$$ packed form
22336D687Q034K1219N863N277m555j8186J7721M848J866N606n25n825n367m045
22322C6618j0885r701L075j6969o221N23k445k572J853L660m10r800L575P943
22308a756q027j411P918k22l75J8981K2274q985q004P346K445l706r974l671k053
22293A0780j0471r050J761R912N108N463R6j2320j658J4004J3049K708j5542r834
22279D006K2467Q574O88k672n847K258J515j282J1382n912k1411j634J130K1376
22265C4638J6693K144r194r381J732q949p943j3398j358l186o029p575L455J3487
22251E136K0126J1637K8818L3524K0186O596q089p882k8537k4087k8055j5931
22239A3442j4267j001N957M163J6518J1116o105q036r75o36K060N923N162l045
$$ plain form
22225 30276 15996 11255 16301 20690 21127 29972 17245 -2347 -1417 6906 22213 19631 19758 21367
22211 21367 20611 27653 18141 10804 1580 906 2424 10503 25980 25276 18303 29144 29392 20138 11874
22196 11874 4515 1720 -10625 5153 24551 24266 16549 14386 15599 14359 19422 22761 17708 10840
22182 10840 5305 -4959 -14831 -15147 -10179 -4905 -1736 -8090 -13291 -13204 -13441 -19221 -18690 -17687 -14802
22167 -14802 -4789 1626 -15966 -23130 -36738 -36640 -23412 -15620 -15721 1474 3968 -5406 -929 -763
22153 -763 13199 29302 22791 4514 -15577 -16239 4619 10725 -5535 -17537 -11099 -129 -3114
22140 -3114 -10958 -135 -826 -3826 3650 9786 17661 7953 -3234 -290 12243 -2084 -4476 -741
22126 -741 -10747 -14661 -10744 -5786 12720 16322 12995 1099 -16513 -25378 -28652 -22016 -9957 -10455
$$ packed form
22225C0276j4280m741N046M389M37Q845j2727j9592R30Q323J5307k582J27J609
22211B1367p56P042r512p337r224o74J518Q079J5477p04o973J0841K48r254q264
22196A1874p359k795j2345J5778J9398k85p717k163J213j240N063L339n053o868
22182A0840n535j0264r872l16M968N274L169o354n201Q7k37n780N31J003K885
22167a4802J0013O415j7592p164j3608R8J3228P792j01J7195K494r374M477J66
22153g63J3962J6103o511j8277k0091o62K0858O106j6260j2002O438J0970k985
22140c114p844J0823o91l000P476O136P875r708j1187K944J2533j4327k392L735
22126g41j0006l914L917M958J8506L602l327j1896j7612q865l274O636J2059m98
$$ plain form
22112 -10455 3425 10364 -11577 -8169 1513 6864 10964 -1933 -5617 -13866 -17555 -20394 -28921 -37782
22098 -37782 -33468 -24345 -11921 -6978 -4594 6471 15274 1097 -12455 -13300 -18073 -18840 -28296 -36411
22084 -36411 -40107 -40252 -33541 -20148 -20180 -14053 7075 8271 4719 12338 16699 12118 18251 22880 20059
22069 20059 7491 -1773 3326 5436 4647 22564 24460 14162 36069 45630 35995 21861 1682
22056 1682 6751 6851 -5831 -17706 -16497 -3518 10057 24397 22771 28083 20960 15580 12082 12700
22042 12700 13827 5190 1409 7207 22254 30557 17448 15664 10739 -11402 -10722 3236 19095
22029 19095 20444 10542 -454 -5209 -11590 2655 -5630 -10191 -4699 -8543 3789 14235 26316
22016 26316 22125 30287 32910 24578 14684 26445 32911 33050 30696 36031 52683 60073 53248 53025
$$ packed form
22112a0455J3880O939k1941L408R682N351M100j2897l684q249l689k839q527q861
22098c7782M314R123J2424M943K384J1065Q803j4177j3552q45m773p67r456q115
22084c6411l696j45O711J3393l2O127K1128J196l552P619M361m581O133M629k821
22069B0059j2568r264N099K110p89J7917J896j0298K1907R561r635j4134k0179
22056A682N069J00j2682j1875J209J2979J3575J4340j626N312p123n380l498O18
22042A2700J127q637l781N798J5047Q303j3109j784m925k2141O80J3958J5859
22029A9095J349r902j0996m755o381J4245q285m561N492l844J2332J0446J2081
22016B6316m191Q162K623q332r894J1761O466J39k354N335J6652P390o825k23
$$ plain form
22002 53025 68885 76505 95642 125756 155583 190699 251312 333703 462417 683150 982211
21991 982211 1268464 1484478 1618326 1614232 1454748 1203651 953739 724520 507104 334937
21981 334937 240729 203133 174774 139320 112584 99620 99433 93373 80161 79721 82601 71835 65807
21968 65807 60035 51727 63205 61111 58678 51979 46036 32530 27054 31050 24386 20065 14833 17479
21954 17479 23684 20915 17654 21618 28947 14914 4547 4166 -5191 431 14401 14281 10441 10394 6136
21939 6136 418 -2535 -3280 3730 2130 2409 -1532 -7127 -19405 -27438 -26720 -17852 -3948 -11729 -10553
21924 -10553 -22076 -25600 -15324 -8276 -8342 761 11145 -7595 -19395 -15222 3664 3942 14321
21911 14321 15472 12858 10370 1501 3903 639 -3101 -15544 3305 15630 8660 7367 7846 -12738
$$ packed form
22002E3025J5860P620J9137L0114K9827L5116O0613Q2391J28714K20733K99061
21991I82211K86253K16014J33848m094j59484k51097k49912k29219k17416j72167
21981C34937r4208l7596k8359l5454k6736j2964j87o060j3212m40K880j0766o028
21968F5807n772q308J1478k094k433o699n943j3506n476L996o664m321n232K646
21954A7479O205k769l261L964P329j4033j0367l81r357N622J3970j20l840m7m258
21939F136n718k953p45P010j600K79l941n595j2278q033P18Q868J3904p781J176
21924a0553j1523l524J0276P048o6R103J0384j8740j1800M173J8886K78J0379
21911A4321J151k614k488q869K402l264l740j2443J8849J2325o970j293M79k0584
$$ plain form
21897 -12738 -29716 -13819 -5864 4136 11640 5089 1881 -11174 -23364 -21195 -14902 -10175 -12768
21884 -12768 -21822 -10627 -3623 -2029 -23871 -36137 -32580 -25556 -12010 -7034 -4447 179 11067
21871 11067 12513 -9264 -13723 -12958 -3754 6482 9583 3041 1219 8038 13771 15738 18406 11238
21857 11238 -2331 -17318 -13353 -2689 -12916 -17652 -22118 -15031 -14259 -12417 258 10305 11091
21844 11091 16852 14849 3952 -10232 -11547 -12763 -11109 -10822 -15258 452 7753 18663 18754 -8329
21830 -8329 -13129 -8606 -16306 -12414 -6180 -13972 -19331 -18093 -9009 -9635 -8209 1454 3460 7235 3176
21815 3176 1564 3852 -8804 -18013 -10111 -11583 -11507 -14552 -12121 3540 8451 -1734 -14002 -24877
21801 -24877 -40825 -35600 -22006 -13359 -10350 -11558 -3173 2130 -2747 -12400 -13424 -4442 -12733 -13219
$$ packed form
21897a2738j6978J5897P955J0000P504o551l208j3055j2190K169O293M727k593
21884a2768r054J1195P004J594k1842j2266L557P024J3546M976K587M626J0888
21871A1067J446k1777m459P65R204J0236L101o542j822O819N733J967K668p168
21857A1238j3569j4987L965J0664j0227m736m466P087P72J842J2675J0047P86
21844A1091N761k003j0897j4184j315j216J654K87m436J5710P301J0910R1k7083
21830h329m800M523p700L892O234p792n359J238R084o26J426R663K006L775m059
21815C176j612K288j2656r209P902j472P6l045K431J5661M911j0185j2268j0875
21801b4877j5948N225J3594Q647L009j208Q385N303m877r653j024Q982q291m86
$$ plain form
21787 -13219 -8942 -10110 -9956 -16918 -19403 -4553 -11869 -20185 -14328 68 -6193 -13682 -24998 -19588
21773 -19588 -16100 -17064 -24395 -25703 -23270 -12432 -5709 -839 -6573 -4526 624 -6074 1198 6001
21759 6001 615 -6241 1819 11739 8660 -2884 -8947 -24188 -23859 -14598 -8610 -14569 -13958 -17853 -18459
21744 -18459 -12551 -14901 -19155 -20158 -5078 8085 -4991 -23040 -33012 -24480 -5164 -1745 -3122
21731 -3122 -18316 -25414 -31670 -22280 -28050 -35117 -37346 -37856 -36800 -37876 -46306 -44192 -15476 1243
21717 1243 -2817 -188 2352 -651 -8333 -12943 -7186 -6189 -7839 -539 -2124 16748 18602 6332
21703 6332 6682 17244 15830 14285 2635 -10955 -12865 -19428 -24580 -18159 -5842 -11634 -24593 -23824
21689 -23824 -9484 8201 732 193 -9293 -15649 -28232 -24784 -23245 -18455 -13837 -13691 1322 -2859
$$ packed form
21787a3219M277j168J54o962k485J4850p316q316N857J4396o261p489j1316N410
21773a9588L488r64p331j308K433J0838O723M870n734K047N150o698P272M803
21759F001n386o856Q060R920l079j1544o063j5241L29R261N988n959O11l895o06
21744a8459N908k350m254j003J5080J3163j3076j8049r972Q532J9316L419j377
21731c122j5194p098o256R390n770p067k229n10J056j076q430K114K8716J6719
21717A243m060K629K540l003p682m610N757R97j650P300j585J8872J854j2270
21703F332L50J0562j414j545j1650j3590j910o563n152O421J2317n792j2959P69
21689b3824J4340J7685p469n39r486o356j2583L448J539M790M618J46J5013m181
$$ plain form
21675 -2859 -5829 -16599 -19141 -8480 -13752 -14842 -14233 -20597 -12884 -9147 -15623 -14125 3359 7850
21661 7850 -3203 -19751 -23043 -15877 -5614 -8598 -11692 -9746 -13364 -16520 -16988 -10129 3794 5958
21647 5958 -6575 -7284 4007 3757 -6170 -15716 -18597 -31065 -27788 -25756 -19776 -20730 -17978 -15346 1827
21632 1827 28715 14525 7711 13861 10576 2132 -6246 -4094 -11835 -4631 5305 3624 2577 -1044
21618 -1044 -2506 -2612 6336 18767 18152 3278 1093 -1747 -3232 -17378 -31382 -34502 -26268 -17154
21604 -17154 -5874 -3206 -4334 -11236 -19941 -21670 -8836 -2641 -1778 -403 -5627 13372 5554 -4054
21590 -4054 -8835 -21085 -23951 -18640 -14386 -8972 -5270 -10410 -19773 -27142 -32262 -22217 -5328 -6046
21576 -6046 -5718 -5451 -10680 -609 1134 -8565 -11281 -19178 -17179 -18387 -9018 -5412 -7416 -15240 -12020
$$ packed form
21675b859k970j0770k542J0661n272j090O09o364P713L737o476J498J7484M491
21661G850j1053j6548l292P166J0263k984l094J946l618l156m68O859J3923K164
21647E958j2533p09J1291k50r927r546k881j2468L277K032N980r54K752K632J7173
21632A827K6888j4190o814O150l285q444q378K152p741P204R936j681j047l621
21618a044j462j06Q948J2431o15j4874k185k840j485j4146j4004l120Q234R114
21604a7154J1280K668j128o902q705j729J2834O195Q63J375n224J8999p818r608
21590d054m781j2250k866N311M254N414L702n140r363p369n120J0045J6889p18
21576f046L28K67n229J0071J743r699k716p897J999j208R369L606k004p824L220
$$ plain form
21561 -12020 -4776 4398 -2478 -7578 -2103 -3359 10125 2050 -7251 -7781 -8761 -5250 -2593 -4642 -1585
21546 -1585 9654 8501 2792 -8016 -22380 -22072 -9864 -3758 -24039 -31581 -26122 -17821 -13550 -8089
21532 -8089 2741 14935 10390 3654 3474 4717 -4947 1098 -15717 -35189 -28506 -15417 -13673 -5555
21518 -5555 -10154 -5185 5915 1552 -11382 -2726 2859 10200 8520 -414 5707 6048 -774 -11557
21504 -11557 -18218 -8904 -9046 -15353 -4399 9796 17489 22350 18127 4730 -12629 -16334 -27670
21491 -27670 -24805 -5765 5610 2189 -12650 -12861 -1029 6318 7146 14662 20173 20079 17797 6901
21477 6901 10080 10075 -856 -8039 -11087 -14770 -16335 -21951 -16461 -22323 -39533 -48052 -43890 -27071 -20968
21462 -20968 -20146 -21504 -15132 -20886 -66 6740 2080 1797 -1045 -2390 -9613 -7878 296 -354 -2134
$$ packed form
21561a2020P244R174o876n100N475j256J3484q075r301n30r80L511K657k049L057
21546a585J1239j153n709j0808j4364L08J2208O106k0281p542N459Q301M271N461
21532h089J0830J2194m545o736j80J243r664O045j6815j9472O683J3089J744Q118
21518e555m599M969J1100m363j2934Q656N585P341j680q934O121L41o822j0783
21504a1557o661R314j42o307J0954J4195P693M861m223j3397j7359l705j1336
21491b7670K865J9040J1375l421j4839k11J1832P347Q28P516N511r4k282j0896
21477F901L179nj0931p183l048l683j565n616N490n862j7210q519M162J6819O103
21462b0968Q22j358O372n754K0820O806m660k83k842j345p223J735Q174o50j780
$$ plain form
21447 -2134 646 -8655 -18358 -12739 -5307 -5287 -9607 -18371 -4167 6070 16263 19700 15536 5336
21433 5336 -2438 -1315 4489 6807 -4955 -4703 -7714 -16688 -21153 -17998 -10003 1385 -1042 -14007
21419 -14007 -15615 -10253 -5576 -3789 -253 7390 2785 -8373 -7050 -6359 -3833 304 10201 10881 5550
21404 5550 -5695 -6968 -577 1138 -2036 -6316 -88 8286 15166 5278 -7264 -5229 -12888 -12771
21390 -12771 -10403 -5633 1440 -5988 -6315 -13731 -19205 -17532 -10079 8534 12213 5750 -5936 -16898
21376 -16898 -7116 11340 7476 9849 2623 8084 10620 18321 14234 19678 11080 8780 -2099 -7776
21362 -7776 -3093 12697 11337 -589 -7754 -7884 -17395 -15437 -9590 -15484 -14380 -21811 -14658 -22053
21348 -22053 -30303 -17592 -16554 -11422 -11501 -11004 -5574 -7460 8301 -307 -15825 -15838 -4620 -2296 -13469
$$ packed form
21447b134K780r301r703N619P432K0m320q764J4204J0237J0193L437m164j0200
21433E336p774J123N804K318j1762K52l011q974m465L155P995J1388k427j2965
21419a4007j608N362M677J787L536P643m605j1158J323O91K526M137R897O80n331
21404E550j1245j273O391J715l174m280O228Q374O880r888j2542K035p659J17
21390a2771K368M770P073p428l27p416n474J673P453J8613L679o463j1686j0962
21376a6898R782J8456l864K373p226N461K536P701m087N444q598k300j0879n677
21362g776M683J5790j360j1926p165j30r511J958N847n894J104p431P153p395
21348b2053q250J2711J038N132p9M97N430j886J5761q608j5518j3J1218K324j1173
$$ plain form
21333 -13469 -23427 -35948 -32803 -25796 -12447 1598 9855 7932 -4209 5274 15910 34020 36980
21320 36980 18900 8018 1800 7591 3429 -11058 -11525 -9063 -15381 -20854 -12593 -12458 -12633 -29259
21306 -29259 -28685 -17552 -9165 -8872 -11203 -10868 -14975 -15817 -8253 -14259 -17299 -22070 -18614 -3657 2568
21291 2568 4672 599 2481 -650 5655 9452 9029 15873 12109 12057 1386 -663 3592 -12097 -10768
21276 -10768 -4349 2536 7173 8386 1441 -4957 -16058 -15907 4381 4473 -4576 -12645 -8379 -13475 -4673
21261 -4673 -12060 -7584 -4897 -11693 -12780 -9940 -3753 -6788 -15319 -19901 -8799 -1324 -204 -3625
21247 -3625 -11764 -5846 -10328 -6297 8588 6960 5600 2319 -6084 -14810 -17532 -22542 -18323 -18167 796
21232 796 13785 7996 5156 6491 -3877 -5541 1168 -10354 -23692 -19920 -5765 4137 8975 17442
$$ packed form
21333a3469r958j2521L145P007J3349J4045Q257j923j2141R483J0636J8110K960
21320C6980j8080j0882o218N791m162j4487m67K462o318n473Q261J35j75j6626
21306b9259N74J1133Q387K93k331L35m107q42P564o006l040m771L456J4957O225
21291B568K104m073J882l131O305L797m23O844l764n2j0671k049M255j5689J329
21276a0768O419O885M637J213o945o398j1101J51K0288R2r049q069M266n096Q802
21261d673p387M476K687o796j087K840O187l035q531m582J1102P475J120l421
21247c625q139N918m482M031J4885j628j360l281q403q726k722n010M219J56J8963
21232G96J2989n789k840J335j0368j664O709j1522j3338L772J4155R902M838Q467
$$ plain form
21218 17442 17500 8766 -1385 -6278 -9108 -4375 2741 -7805 -9202 -12683 -2749 2071 -11066 -20623
21204 -20623 -17811 -18413 -14101 -13209 -20185 -18716 -14712 6315 21235 19063 14883 -526 -24036 -17224
21190 -17224 5124 21005 19913 13545 5381 -3784 -7895 111 -2923 -18948 -21796 -10329 4589
21177 4589 7586 -6008 1345 6829 -4156 7036 15128 1786 -8223 -10923 621 5427 9997
21164 9997 2366 -1310 -9814 -9244 -11810 -26782 -21179 -14981 -26283 -25739 -22718 -25575 -22000 -13654 -13191
21149 -13191 -10821 -7911 10051 9755 7630 -7489 -6027 1560 13797 14512 -2866 -9562 -14143 -6825
21135 -6825 -1471 6965 4261 9327 10100 8262 19359 21978 14438 7252 -8522 -14577 -15012 -11033 -19202
21120 -19202 -6625 -10799 -20808 1130 -1690 968 -3214 2965 8221 5219 7673 10552 9030 -1842
$$ packed form
21218A7442N8q734j0151m893k830M733P116j0546j397l481R934M820j3137r557
21204b0623K812o02M312Q92o976J469M004K1027J4920k172m180j5409k3510O812
21190a7224K2348J5881j092o368q164r165m111Q006l034j6025k848J1467J4918
21177D589K997j3594P353N484j0985J1192Q092j3342j0009k700J1544M806M570
21164I997p631l676q504N70k566j4972N603O198j1302N44L021k857L575Q346M63
21149a3191K370K910J7962k96k125j5119J462P587J2237P15j7378o696m581P318
21135f825N354Q436k704N066P73j838J1097K619p540p186j5774o055m35L979q169
21120a9202J2577m174j0009K1938k820K658m182O179N256l002K454K879j522j0872
$$ plain form
21106 -1842 -14303 -21807 -15760 -16303 -4644 -5543 -8344 -8718 -3041 7935 15677 7712 -20704 -26880
21092 -26880 -26172 -11571 -9839 -7069 -2327 -12293 -18750 -24330 -31178 -32827 -25832 -7754 -4917 -10319
21078 -10319 -9027 -8282 -6835 -8220 -4549 4292 12806 6612 -17395 -30550 -11450 8992 4397 -12412
21064 -12412 -6951 -10748 -21198 -25525 -33283 -19989 -4291 -4386 -16492 -25421 -21128 -15162 -8304 473
21050 473 -495 114 3818 3512 8051 5925 8438 11021 4256 -3022 4487 4632 4746 7338 -796 3929
21034 3929 24772 20536 24469 24886 -3740 -14919 -12321 -24673 -22984 -10379 -5851 -12084 -13102 -15742
21020 -15742 -16718 -10431 -25108 -20685 -4464 -14090 -26788 -16572 -12191 -13533 -7632 -8651 -8758 -3565
21006 -3565 6734 -16675 -30857 -16472 -8275 -19778 -23853 -25813 -30106 -30688 -28983 -30484 -34712 -20810
$$ packed form
21106a842j2461p504O047n43J1659q99k801l74N677J0976P742p965k8416o176
21092b6880P08J4601J732K770M742r966o457n580o848j649O995J8078K837n402
21078a0319J292P45J447j385L671Q841Q514o194k4007j3155J9100K0442m595j6809
21064a2412N461l797j0450m327p758J3294J5698r5j2106q929M293N966O858Q777
21050D73r68O09L704l06M539k126K513K583o765p278P509J45J14K592q134M725
21034C929K0843m236L933M17k8626j1179K598j2352J689J2605M528o233j018k640
21020a5742r76O287j4677M423J6221r626j2698J0216M381j342N901j019j07N193
21006c565J0299k3409j4182J4385Q197j1503m075j960m293n82J705j501m228J3902
$$ plain form
20992 -20810 -14794 -18431 -29191 -30205 -13073 341 -6543 -16061 -12614 -10124 -4668 5556 13003
20979 13003 5938 1688 -7388 -17096 -23422 -2146 11347 -2731 -13945 -16470 -16904 -7415 3541
20966 3541 10105 -489 -12175 -21836 -5960 5317 4884 -1652 6608 1041 12680 7234 -278 -2150
20952 -2150 -2616 -11441 -3259 -2706 -5461 -10333 -8532 -15166 -11611 -15233 -20398 -16417 -4148 2651 12027
20937 12027 14663 9135 2279 259 8140 14835 22513 20576 16310 10675 9488 -5091 -3172 7375
20923 7375 5309 -2427 -2933 -5915 219 2114 949 1214 10727 17541 5871 1708 173 440 -18414
20908 -18414 -17741 -7088 13239 22775 29958 25818 8744 13128 18847 18412 8400 -5450 -12323 -17784
20894 -17784 -19462 -5408 -8898 -30353 -47617 -28054 -29554 -32221 -19221 -15958 -10238 -15217 -26099
$$ packed form
20992b0810O016l637j0760j014J7132J3414o884r518L447K490N456J0224P447
20979A3003p065m250r076r708o326K1276J3493j4078j1214k525m34R489J0956
20966C541O564j0594j1686r661J5876J1277m33o536Q260n567J1639n446p512j872
20952b150m66q825Q182N53k755m872J801o634L555l622n165L981J2269O799R376
20937A2027K636n528o856k020P881O695P678j937m266n635j187j4579J919J0547
20923G375k066p736n06k982O134J895j165K65R513O814j1670m163j535K67j8854
20908a8414O73J0653K0327R536P183m140j7074M384N719m35j0012j3850o873n461
20894a7784j678J4054l490k1455j7264J9563j500k667J3000L263N720m979j0882
$$ plain form
20881 -26099 -23881 -23150 -19291 -23281 -16941 -6525 -218 3349 -2624 -17741 -20879 -22617 -21482 -15573
20867 -15573 -8741 -22147 -24242 -12589 -10177 -11365 -15350 -21194 -6607 -2275 -1814 -1344 -16930 -26301
20853 -26301 -18251 -9023 -17366 -19963 -21701 -19453 -15844 -12504 -12654 -12530 -21613 -34160 -38281 -39193 -27054
20838 -27054 -11207 -595 -300 8140 7577 -9153 -20077 -23847 -27911 -21065 -10304 -7010 -5537 -9423
20824 -9423 -20182 -23192 -27145 -35481 -33588 -23513 -20751 -11717 -6186 -8176 -14061 -8885 3965 -2413
20810 -2413 -2121 -10588 -21911 -13211 -1645 208 1855 -7971 -12000 -13191 -972 -3061 -15502 -16288
20796 -16288 -17332 -24193 -25027 -24759 -33990 -36382 -32702 -19229 -19682 -24612 -11442 -11204 -8204 5804 4522
20781 4522 5671 1690 6510 2333 -11958 -1086 -693 -3203 554 6446 27906 25918 24671 24342
$$ packed form
20881b6099K218P31L859l990O340J0416O307L567n973j5117l138j738J135N909
20867a5573O832j3406k095J1653K412j188l985n844J4587M332M61M70j5586r371
20853b6301Q050R228q343k597j738K248L609L340j50J24r083j2547m121r12J2139
20838b7054J5847J0612K95Q440n63j6730j0924l770m064O846J0761L294J473l886
20824i423j0759l010l953q336J893J0075K762R034N531j990n885N176J2850o378
20810b413K92q467j1323Q700J1566J853J647r826m029j191J2219k089j2441p86
20796a6288j044o861q34K68r231k392L680J3473m53m930J3170K38L000J4008j282
20781D522J149l981M820m177j4291J0872L93k510L757N892K1460j988j247l29
$$ plain form
20767 24342 25634 17555 12307 9947 3354 3131 4266 2157 -12768 -15672 -25567 -36489 -31190 -39066
20753 -39066 -27248 -35530 -40319 -34389 -11717 -5686 -1570 968 -7676 -23414 -24905 -20673 -16591 -19155
20739 -19155 -5743 3487 -1238 -19178 -22718 -21892 -22350 -8385 -15339 -16493 -10180 -9571 -10204 4265
20725 4265 701 -2615 15693 19226 25595 19123 9876 18079 22212 15634 31095 25181 3286 -1546
20711 -1546 -3507 1827 3507 -1468 -7968 -12491 -5563 -14680 -13135 -28203 -28233 -14189 -2062 5425
20697 5425 7685 10781 21662 15304 -3541 -5319 -10140 -11530 -11749 -886 -2450 -11891 -13983 -22454
20683 -22454 -31317 -27958 -16260 -23608 -29054 -29602 -25709 -20175 -11260 -8542 1520 11750 7962 -10367
20669 -10367 -13171 -8755 -7153 -1740 -2126 2900 7194 -1612 347 11126 16428 -3423 -18161 -19816
$$ packed form
20767B4342J292q079n248k360o593k23J135k109j4925k904r895j0922N299p876
20753c9066J1818q282m789N930K2672O031M116K538q644j5738j491M232M082k564
20739a9155J3412R230m725j7940l540Q26m58J3965o954j154O313O09o33J4469
20725D265l564l316J8308L533O369o472r247Q203M133o578J5461n914k1895m832
20711a546j961N334J680m975o500m523O928r117J545j5068l0J4044J2127P487
20697E425K260L096J0881o358j8845j778m821j390k19J0863j564r441k092q471
20683b2454q863L359J1698p348n446n48L893N534Q915K718J0062J0230l788j8329
20669a0367k804M416J602N413l86N026M294q806J959J0779N302j9851j4738j655
$$ plain form
20655 -19816 -12100 2349 12663 13904 13046 10288 17918 18160 18128 2720 -6834 1146 -5210 -672 4462
20640 4462 -8678 -13562 -13254 -16125 -24501 -27910 -22283 -12338 -23786 -26163 -16934 -12115 -10076 -2964
20626 -2964 -3415 1835 1805 203 18614 26271 23423 6862 -1020 -9303 -1547 4126 4767 1575 -1757
20611 -1757 -1850 1136 -1995 7923 15629 15120 7374 -14987 -35136 -25069 -15479 -15127 -5499 -11379 -19852
20596 -19852 -15306 -6542 -735 5052 10649 625 5297 13353 11631 16021 14179 4896 3881 2030
20582 2030 -2122 -3869 -5466 -1257 4386 10076 -594 -3023 2113 -8885 -14456 -3200 -4911 -11084
20568 -11084 -8332 953 -8450 -10150 -6692 -12467 -6791 -1881 10648 9116 17216 14509 -5708 -6396
20554 -6396 1 -5436 -8745 -11006 -2323 18471 18634 4702 8087 -1169 2758 2463 3108 5019 -2019
$$ packed form
20655a9816P716J4449J0314J241q58k758P630K42l2j5408r554P980o356M538N134
20640D462j3140m884L08k871q376l409N627R945j1448k377R229M819K039P112
20626b964m51N250l0j602J8411P657k848j6561p882q283P756N673O41l192l332
20611a757r3K986l131R918P706n09p746k2361k0149J0067R590L52R628n880q473
20596a9852M546Q764N807N787N597j0024M672Q056j722M390j842r283j015j851
20582B030m152j747j597M209N643N690j0670k429N136j0998n571J1256j711o173
20568a1084K752R285r403j700L458n775N676M910J2529j532Q100k707k0217o88
20554f396O397n437l309k261Q683K0794J63j3932L385r256L927k95O45J911p038
$$ plain form
20539 -2019 -4760 5277 -6174 -9242 -3026 -3939 -3149 -254 -3656 -3937 4410 3204 -240 112 604
20524 604 3642 -2353 -10028 -9443 -5394 -4420 -10804 -11931 -10600 -15152 -12284 -17529 -16777 -21385 -21785 1039
20508 1039 10893 4869 7958 12772 -10551 -1653 7147 13196 -4409 -1241 -2337 -10378 -13074 5559
20494 5559 13022 1475 -16456 -19408 -24078 -18954 -5501 -10601 -651 7172 1849 12661 11777 13193
20480 13193 11398 10048 2845 -17843 -25582 -26474 -13269 -3499 3390 5531 503 -20655 -36900 -34528
20466 -34528 -31084 -26026 -13067 -322 -6122 -6181 -2861 -3163 -15887 -28530 -29972 -15527 -8328 -10939
20452 -10939 -22985 -18703 -1661 9573 1491 -7639 -8360 -16318 -20904 -9218 2696 7515 -701
20439 -701 -7320 -15343 -14918 -5952 -152 -10368 -6331 -364 -7631 -7081 -3898 -7465 -1798 -8199 -2522
$$ packed form
20539b019k741J0037j1451l068O216r13P90K895l402k81Q347j206l444L52M92
20524F04L038n995p675N85M049R74o384j127J331m552K868n245P52m608m00K2824
20508A039R854o024L089M814k3323Q898Q800O049j7605L168j096q041k696J8633
20494E559P463j1547j7931k952m670N124J3453n100R950P823n323J0812q84J416
20480A3193j795j350p203k0688p739q92J3205R770O889K141n028k1158j6245K372
20466c4528L444N058J2959J2745n800n9L320l02j2724j2643j442J4445P199k611
20452a0939j2046M282J7042J1234q082r130p21p958m586J1686J1914M819q216
20439g01o619q023M25Q966N800j0216M037N967p267N50L183l567N667o401N677
$$ plain form
20424 -2522 -1419 -1979 7605 12391 13245 6665 -2035 -2264 -4829 1374 -1820 -4265 -19166 -14971 6148
20409 6148 6049 -3608 2245 -3308 -5558 7809 4014 -11614 -14155 -13557 -3193 3283 -11439 -10586 -5778
20394 -5778 -8882 -4391 6712 17256 18660 14447 14861 25636 30240 31373 24612 22865 19109 10490
20380 10490 12258 20344 6825 6220 12915 21130 24767 18362 22991 24510 6806 -8713 10073 6311
20366 6311 12401 15717 10725 7185 -2776 -512 -3051 -1105 -1832 -19170 -27600 -6022 6557 24465
20352 24465 19087 7201 6054 12616 12188 4181 3264 10254 9568 -8921 -9885 -9558 -3856 -3771 -11517 -19435
20336 -19435 -13570 2066 8299 5102 4678 -3797 -40 4687 847 3653 8739 5106 -16108 -8109
20322 -8109 -491 -242 -1918 -3194 2296 6146 3963 6351 2950 7583 6879 5285 3451 2628 1829 549
$$ packed form
20424b522J103n60R584M786Q54o580q700k29k565O203l194k445j4901M195K1119
20409F148r9r657N853n553k250J3367l795j5628k541N98J0364O476j4722Q53M808
20394e778l104M491J1103J0544J404m213M14J0775M604J133o761j747l756q619
20380A0490J768Q086j3519o05O695Q215L637o405M629J519j7704j5519J8786l762
20366F311O090L316m992l540r961K264k539J946p27j7338q430K1578J2579J7908
20352B4465n378j1886j147O562m28q007r17O990o86j8489r64L27N702Q5p746p918
20336a9435N865J5636O233l197m24q475L757M727l840K806N086l633k1214P999
20322h109P618K49j676j276N490L850k183K388l401M633p04j594j834q23p99j280
$$ plain form
20306 549 1874 -4349 -18345 -10694 4514 11958 920 9367 24070 21296 18278 22008 18303 15967
20292 15967 20367 16105 17041 12708 15303 15068 15029 11512 10522 11834 -176 -3811 4548 5340 -5194
20277 -5194 -12146 -10320 -2915 372 3486 -5855 -19601 -11745 2497 -59 3422 648 -5587 14447
20263 14447 28611 32983 29480 32179 31654 12164 4399 6477 13040 9529 6062 16282 32160 48466
20249 48466 35449 24422 14562 8544 10312 3940 -3750 8802 11378 -8624 -7488 -7229 -9189 -3359
20235 -3359 5223 -323 -9801 -11660 -3172 3010 1919 4793 23398 29375 29888 29767 33163 30144 20632
20220 20632 7182 591 5672 3445 10472 16397 17447 23736 35150 18600 -1927 -5427 4780
20207 4780 16458 16849 16792 276 -957 4246 12159 11602 13031 9712 15154 15165 10015 5487 11423 8603
$$ packed form
20306E49J325o223j3996P651J5208P444j1038Q447J4703k774l018L730l705k336
20292A5967M400m262R36m333K595k35l9l517r90J312j2010l635Q359P92j0534
20277e194o952J826P405L287L114r341j3746P856J4242k556L481k774o235K0034
20263A4447J4164M372l503K699n25j9490p765K078O563l511l467J0220J5878J6306
20249D8466j3017j1027r860o018J768o372p690J2552K576k0002J136K59j960N830
20235c359Q582n546r478j859Q488O182j091K874J8605N977N13j21L396l019r512
20220B0632j3450o591N081k227P027N925J050O289J1414j6550k0527l500J0207
20207D780J1678L91n7j6516j233N203P913n57J429l319N442J1n150m528N936k820
$$ plain form
20191 8603 14202 28560 29255 23299 15739 17201 8396 5769 8598 761 -12852 -13591 -12201 -3561 -262
20176 -262 -8834 -11160 -9876 -3792 -9103 -13903 -4400 17693 11596 5356 -3143 -8063 -10320 -12630 -21908
20161 -21908 -27384 -22550 -22407 -17358 -21421 -15790 -601 7366 14040 20629 19345 19859 16350 2676
20147 2676 -20494 -17548 4443 8348 866 9195 26339 33607 31262 18489 505 -6604 12242
20134 12242 16638 35681 37061 35191 38494 35785 29618 37350 39905 37183 35697 23360 22047 20150
20120 20150 24811 5106 -330 17998 31669 15850 7570 8469 -380 -5017 4765 10919 10571 23564
20106 23564 29061 15838 16352 19701 15951 27131 16443 19779 33048 31092 36225 27291 15172
20093 15172 16232 27849 23392 23084 30628 24083 13165 5244 1305 9288 22353 30864 27983 28259
$$ packed form
20191H603N599J4358O95n956p560J462q805k627K829p837j3613p39J390Q640L299
20176b62q572k326J284O084n311m800R503K2093o097o240q499m920k257k310r278
20161b1908n476M834J43N049m063N631J5189P967O674O589j284N14l509j3674
20147B676k3170K946K1991L905p482Q329J7144P268k345j2773j7984p109J8846
20134A2242M396J9043J380j870L303k709o167P732K555k722j486j2337j313j897
20120B0150M661j9705n436J8328J3671j5819q280Q99q849m637R782O154l48J2993
20106B3564N497j3223N14L349l750J1180j0688L336J3269j956N133q934j2119
20093A5172J060J1617m457l08P544o545j0918p921l939P983J3065Q511k881K76
$$ plain form
20079 28259 30237 15421 32714 33929 31230 23611 25210 30133 35824 46961 56223 44405 45300 41038
20065 41038 35775 40060 25306 10726 17399 31524 45547 41777 29294 17726 20646 18598 30243
20052 30243 30922 25249 31956 42568 34271 20390 22756 30736 37270 40391 34929 24403 31794 39310
20038 39310 46594 50217 54459 54352 58737 65035 73091 77084 92773 91562 120165 154326 163020 175887
20024 175887 204975 240434 278647 309549 355108 392693 408407 426435 457772 486652 514442
20013 514442 535896 553189 586786 616390 640803 649694 645228 634910 635001 618674 590627 551583
20001 551583 537052 532433 517841 489904 451359 410623 386014 365754 345324 303760 251540 225186
19989 225186 211446 192484 177482 155849 125951 112596 111725 111906 90030 85584 102070 98832 96455
$$ packed form
20079B8259J978j4816J7293J215k699p619J599M923N691J1137R262j1818Q95m262
20065D1038n263M285j4754j4580O673J4125J4023l770j2483j1568K920k048J1645
20052C0243O79n673O707J0612q297j3881K366P980O534L121n462j0526P391P516
20038C9310P284L623M242j07M385O298Q056L993J5689j211K8603L4161Q694J2867
20024A75887K9088L5459L8213L0902M5559L7585J5714J8028L1337K8880K7790
20013E14442K1454J7293L3597K9604K4413Q891m466j0318R1j6327k8047l9044
20001E51583j4531m619j4592k7937l8545m0736k4609k0260k0430m1564n2220k6354
19989B25186j3740j8962j5002k1633k9898j3355q71J81k1876m446J6486l238k377
$$ plain form
19976 96455 92344 84633 81510 73760 71302 61930 65159 67557 53303 52401 49182 44188 38073 39176
19962 39176 56656 69725 68069 52499 46616 55806 71131 70540 83970 77162 74917 77300 66070
19949 66070 62765 62779 74430 93192 109041 144718 172241 195435 210139 216204 235967 253950 266776
19936 266776 288012 311580 335100 338230 344739 357669 365750 377160 385690 371326 357883 328315
19924 328315 297426 281413 275368 255699 231532 220053 208695 185983 178195 157782 134509 126565
19912 126565 130936 115792 107434 114809 115235 107048 119286 136302 130178 123522 123564 123325 121167 119263
19898 119263 130644 147621 167249 187098 216932 245418 263719 289885 323444 351430 376152
19887 376152 387383 409492 426131 443805 453440 469054 474459 458704 436864 420393 419310 398415
$$ packed form
19976I6455m111p711l123p750k458r372L229K398j4254r02l219m994o115J103
19962C9176J7480J3069j656j5570n883R190J5325n91J3430o808k245K383j1230
19949F6070l305J4J1651J8762J5849L5677K7523K3194J4704O065J9763J7983J2826
19936B66776K1236K3568K3520L130O509J2930Q081J1410Q530j4364j3443k9568
19924C28315l0889j6013o045j9669k4167j1479j1358k2712p788k0413k3273p944
19912A26565M371j5144q358P375M26q187J2238J7016o124o656M2k39k158j904
19898A19263J1381J6977J9628J9849K9834K8486J8301K6166L3559K7986K4722
19887C76152J1231K2109J6639J7674R635J5614N405j5755k1840j6471j083k0895
$$ plain form
19875 398415 368376 342849 322063 306982 284059 253158 237397 222584 205938 195565 178559
19864 178559 169484 153782 136812 122757 123079 140463 151675 144719 132491 131522 132349 145257 157173
19851 157173 145368 150742 167725 187029 205545 213204 219503 229118 253792 262346 296069 327198
19839 327198 346045 355175 377077 412826 421977 439358 460934 501416 534545 563307 573424 579168
19827 579168 589656 615691 628763 622469 601414 594973 605629 602038 588789 561468 531477 519563
19815 519563 493174 468757 450559 426260 401365 371556 335708 312060 289710 262071 248250
19804 248250 234066 198095 180177 176667 159040 145947 121420 110157 101531 89138 88429 100493
19792 100493 110474 122690 119460 113228 103096 84943 80985 89369 96581 90626 84305 82212 81268 74962
$$ packed form
19875C98415l0039k5527k0786j5081k2923l0901j5761j4813j6646j0373j7006
19864A78559r075j5702j6970j4055L22J7384J1212o956j2228r69Q27J2908J1916
19851A57173j1805N374J6983J9304J8516P659O299R615K4674Q554L3723L1129
19839C27198J8847R130K1902L5749R151J7381K1576M0482L3129K8762J0117N744
19827E79168J0488K6035J3072o294k1055o441J0656l591j3249k7321k9991j1914
19815E19563k6389k4417j8198k4299k4895k9809l5848k3648k2350k7639j3821
19804B48250j4184l5971j7918l510j7627j3093k4527j1263q626j2393p09J2064
19792A00493R981J2216l230o232j0132j8153l958Q384P212n955o321k093r44o306
$$ plain form
19778 74962 71128 72084 70744 74014 74647 75673 81270 81098 100913 112307 117491 120636 109935 104037
19764 104037 114041 120072 133705 163741 174282 165369 149353 136926 148013 161376 166283 179141
19752 179141 195467 209529 217335 229588 243173 245445 251645 272043 294428 310079 307863 331367
19740 331367 344624 356280 367657 393852 417276 428352 440867 438247 424186 430996 443592 470656
19728 470656 474772 452489 424460 414683 414012 395908 375372 340697 325939 319335 320094 299630 292646
19715 292646 285132 273118 266190 252970 234439 225866 220939 206674 194273 182311 178179 175179 167072
19702 167072 174139 175644 183616 182942 204351 220243 220986 224506 244689 268771 274734 279290 283382 291791
19688 291791 304755 318924 335699 356166 368899 388491 398455 403190 412924 411083 418870 422414 414311
$$ packed form
19778G4962l834R56j340L270O33J026N597j72J9815J1394N184L145j0701n898
19764A04037J0004O031J3633L0036J0541q913j6016j2427J1087J3363M907J2858
19752A79141J6326J4062P806J2253J3585K272O200K0398K2385J5651k216K3504
19740C31367J3257J1656J1377K6195K3424J1076J2515k620j4061O810J2596K7064
19728D70656M116k2283k8029r777o71j8104k0536l4675j4758o604P59k0464o984
19715B92646p514j2014o928j3220j8531q573m927j4265j2401j1962m132l000q107
19702A67072P067J505P972o74K1409J5892P43L520K0183K4082N963M556M092Q409
19688B91791J2964J4169J6775K0467J2733J9592R964M735R734j841P787L544q103
$$ plain form
19675 414311 404889 397207 396008 388940 388125 373414 364224 366824 356495 337291 316724 302462 287682
19662 287682 267651 252524 252943 252325 243080 232094 231463 230422 234511 234272 218735 206480 208239 221869
19648 221869 225613 216379 215262 215897 209124 216824 245053 277553 302788 323696 344839 368961 394032
19635 394032 432762 458932 464652 482899 507010 518027 534143 567431 580135 583531 597720 615221
19623 615221 626394 626946 612609 594541 580551 564042 549499 527047 517063 493910 473835 446359
19611 446359 433242 410800 374437 343423 328341 318999 310473 304084 298981 294985 303770 303492 303987
19598 303987 300868 307440 316543 332566 370705 386965 400423 413194 440773 469278 501367 519964
19586 519964 540934 561263 585366 628258 662539 675483 703299 732483 754415 767636 775488 791742
$$ packed form
19675D14311r422p682j199p068q15j4711r190K600j0329j9204k0567j4262j4780
19662B87682k0031j5127M19o18r245j0986o31j041M089k39j5537j2255J759J3630
19648B21869L744r234j117O35o773P700K8229L2500K5235K0908K1143K4122K5071
19635C94032L8730K6170N720J8247K4111J1017J6116L3288J2704L396J4189J7501
19623F15221J1173N52j4337j8068j3990j6509j4543k2452r984k3153k0075k7476
19611D46359j3117k2442l6363l1014j5082r342q526o389n103l996Q785k78M95
19598C03987l119O572R103J6023L8139J6260J3458J2771K7579K8505L2089J8597
19586E19964K0970K0329K4103M2892L4281J2944K7816K9184K1932J3221P852J6254
$$ plain form
19574 791742 803470 804230 815893 841168 849926 834286 813594 791166 769781 765379 757803 744883
19562 744883 730813 730192 725796 729036 729759 737058 742658 744821 766805 801001 822986 838903 873071
19549 873071 896071 922604 948296 963429 995588 1027438 1059123 1091489 1131199 1179957 1237000
19538 1237000 1275301 1336772 1410300 1490050 1586589 1697369 1821242 1953273 2104229 2301192
19528 2301192 2507564 2711564 2939151 3231224 3575752 3948167 4342026 4806918 5334594
19519 5334594 5951199 6677592 7582376 8753266 10322584 12386039 14829083 17503933 20733675
19510 20733675 25026938 30185914 34975317 39071818 43827576 50084635 56500755 61189375
19502 61189375 65041196 70078160 76554997 82855167 87944308 92504753 97308209 102501933
$$ packed form
19574G91742J1728P60J1663K5275Q758j5640k0692k2428k1385m402p576j2920
19562G44883j4070o21m396L240P23P299N600K163K1984L4196K1985J5917L4168
19549H73071K3000K6533K5692J5133L2159L1850L1685L2366L9710M8758N7043
19538A237000L8301O1471P3528P9750R6539J10780J23873J32031J50956J96963
19528B301192K06372K04000K27587K92073L44528L72415L93859M64892N27676
19519E334594O16605P26393R04784J170890J569318K063455K443044K674850L229742
19510B0733675M293263N158976M789403M096501M755758O257059O416120M688620
19502F1189375L851821N036964O476837O300170N089141M560445M803456N193724
$$ plain form
19494 102501933 107403300 110875607 112636595 112900128 112521990 111553607 109843053 107360733
19486 107360733 103541554 98775711 94452995 91559990 88612335 83446325 77159700 72137078
19478 72137078 68245926 63054548 55970101 49146524 43650141 38655365 33288490 28189560
19470 28189560 24112103 20958855 18362983 16171616 14404601 13032348 11988912 11173991
19462 11173991 10486474 9856171 9313471 8853473 8447304 8063022 7687399 7369271 7093542
19453 7093542 6838566 6618377 6434376 6307934 6211112 6158323 6142004 6167383 6229585 6316858
19443 6316858 6463747 6669258 6926824 7283382 7767227 8437864 9400020 10809446 12851615
19434 12851615 15479680 18537966 22252068 26757733 31213829 34999028 38797091 42937746
$$ packed form
19494A02501933M901367L472307J760988K63533l78138r68383j710554k482320
19486A07360733l819179m765843m322716k893005k947655n166010o286625n022622
19478G2137078l891152n191378p084447o823577n496383m994776n366875n098930
19470B8189560m077457l153248k595872k191367j767015j372253j043436q14921
19462A1173991o87517o30303n42700m59998m06169l84282l75623l18128k75729
19453G093542k54976k20189j84001j26442r6822n2789j6319K5379O2202Q7273
19443F316858J46889K05511K57566L56558M83845O70637R62156J409426K042169
19434A2851615K628065L058286L714102M505665M456096L785199L798063M140655
$$ plain form
19426 42937746 46368774 48783039 51514179 55066175 58159868 60354999 62463480 64132838
19418 64132838 64368228 63233502 61194901 58210314 54675850 51399929 48267763 44794450
19410 44794450 41631975 39154677 36447319 32954232 29394676 26175426 22955790 19670915
19402 19670915 16862905 14717158 13054963 11793277 10925417 10391659 10087982 9919112 9883179
19393 9883179 9965435 10160222 10508959 11060017 11897548 13161088 15055682 17663529 20806111
19384 20806111 24573280 29293029 34442672 38975037 43146004 47733158 52072859 55249152
19376 55249152 58191011 62042695 66018334 69058144 71768302 74211121 75330750 74830121
19368 74830121 73148328 70301277 66490926 62679320 59237513 55370954 51389466 48202444
$$ packed form
19426D2937746L431028K414265K731140L551996L093693K195131K108481J669358
19418F4132838K35390j134726k038601k984587l534464l275921l132166l473313
19410D4794450l162475k477298k707358l493087l559556l219250l219636l284875
19402A9670915k808010k145747j662195j261686q67860n33758l03677j68870l5933
19393I883179Q2256J94787L48737N51058Q37531J263540J894594K607847L142582
19384B0806111L767169M719749N149643M532365M170967M587154M339701L176293
19376E5249152K941859L851684L975639L039810K710158K442819J119629n00629
19368G4830121j681793k847051l810351l811606l441807l866559l981488l187022
$$ plain form
19360 48202444 45092417 41003456 36422222 32184369 28073082 23754739 19786893 16637148
19352 16637148 14144147 12154170 10663208 9576404 8755538 8104533 7552063 7078989 6637577
19343 6637577 6225021 5829532 5457903 5131784 4831038 4529482 4252130 4004963 3766164
19334 3766164 3540431 3336059 3160026 3003292 2866064 2717338 2583395 2450081 2332495
19325 2332495 2243156 2161238 2075220 1980766 1900653 1816302 1731777 1654028 1597221 1537727 1474011
19314 1474011 1417429 1369775 1340261 1312593 1284692 1272884 1264089 1266822 1270319 1279622 1294317 1309065
19302 1309065 1307524 1280005 1258864 1235077 1199359 1150798 1098386 1038204 988396 930756 872011
19291 872011 812838 751685 690571 641235 600482 560877 545752 521854 509316 494819 492860 496692
$$ packed form
19360D8202444l110027m088961m581234m237853m111287m318343l967846l149745
19352A6637148k493001j989977j490962j086804q20866o51005n52470m73074m41412
19343F637577m12556l95489l71629l26119l00746l01556k77352k47167k38799
19334C766164k25733k04372j76033j56734j37228j48726j33943j33314j17586
19325B332495q9339q1918q6018r4454q0113q4351q4525p7749n6807n9494o3716
19314A474011n6582m7654k9514k7668k7901j1808q795K733L497R303J4695J4748
19302A309065j541k7519k1141k3787l5718m8561n2412o0182m9808n7640n8745
19291H72011n9173o1153o1114m9336m0753l9605j5125k3898j2538j4497j959L832
$$ plain form
19279 496692 477306 457889 438324 441257 433474 437760 436806 432289 430951 427261 414772 402891 400467
19266 400467 419116 415291 420389 409480 397464 394194 397528 412137 441163 463570 491765 514827
19254 514827 533859 531066 527208 529088 515887 501420 512244 502521 469411 451699 428439 406832
19242 406832 390620 379863 362964 339799 340581 332242 334419 328543 336444 335054 343282 345956 339362
19229 339362 330962 329937 330583 317721 316933 315686 293531 277608 275304 280871 282743 295761 298828 294099
19215 294099 272461 270608 275598 272699 275942 285959 287727 294748 310841 325694 334865 344539 363778
19202 363778 387339 390031 384620 390908 403668 416991 420309 440726 453619 457810 467437 484026 489799
19189 489799 489380 495628 501603 506335 499893 510306 535867 557290 568741 574334 581260 584951 584442 588380
$$ packed form
19279D96692j9386j9417j9565K933p783M286r54m517j338l690j2489j1881k424
19266D00467J8649l825N098j0909j2016l270L334J4609K9026K2407K8195K3062
19254E14827J9032k793l858J880j3201j4467J0824r723l3110j7712k3260k1607
19242D06832j6212j0757j6899k3165P82q339K177n876P901j390Q228K674o594
19229C39362q400j025O46j2862p88j247k2155j5923k304N567J872J3018L067m729
19215B94099k1638j853M990k899L243J0017J768P021J6093J4853R171R674J9239
19202C63778K3561K692n411O288J2760J3323L318K0417J2893M191R627J6589N773
19189D89799m19O248N975M732o442J0413K5561K1423J1451N593O926L691n09L938
$$ plain form
19175 588380 592361 605978 629999 651211 665687 681669 708648 745964 790514 838144 896649 986007
19163 986007 1095639 1224690 1348745 1511201 1730237 1957652 2148043 2352214 2634503 2963323
19153 2963323 3248095 3479814 3758518 4113170 4505054 4850587 5185136 5526562 5885993
19144 5885993 6288771 6671862 7010579 7248575 7459343 7716209 8007058 8310781 8584922
19135 8584922 8892068 9368280 10176847 11363283 12859213 14503079 16253392 18460937 21494868
19126 21494868 24876351 27468325 29574498 32365983 35777848 38335504 39795443 41978231
19118 41978231 44944980 46766876 47292194 48583926 51074077 52169422 51146162 50394655
19110 50394655 50737664 50267626 47974407 45948047 45028261 43491541 40712646 38203684
$$ packed form
19175E88380L981J3617K4021K1212J4476J5982K6979L7316M4550M7630N8505Q9358
19163I86007J09632J29051J24055J62456K19036K27415J90391K04171K82289L28820
19153B963323K84772K31719K78704L54652L91884L45533L34549L41426L59431
19144E885993M02778L83091L38717K37996K10768K56866K90849L03723K74141
19135H584922L07146M76212Q08567J186436J495930J643866J750313K207545L033931
19126B1494868L381483K591974K106173K791485L411865K557656J459939K182788
19118D1978231K966749J821896N25318J291732K490151J095345j023260p51507
19110E0394655L43009m70038k293219k026360r19786j536720k778895k508962
$$ plain form
19102 38203684 36746937 34924221 31874959 28840500 26483552 24310026 21755935 19263209
19094 19263209 17308817 15808898 14614952 13710877 13082082 12664164 12502058 12603487 12899035
19085 12899035 13395075 14243092 15630480 17651006 20139895 22782146 25749043 29596539
19077 29596539 34449661 38999301 42329517 45765440 50309406 54751423 57310816 59479836
19069 59479836 62988755 66183015 67288214 68030003 70708453 73296989 72782227 71111048
19061 71111048 70968450 71152536 68801031 65131797 62902984 61082373 57544998 53207214
19053 53207214 50126826 47752510 44017807 39410440 35465583 32311845 28989014 25283304
19045 25283304 22001054 19439015 17416187 15677028 14150844 12930261 12051493 11426716
$$ packed form
19102C8203684j456747j822716l049262l034459k356948k173526k554091k492726
19094A9263209j954392j499919j193946r04075o28795m17918j62106J01429K95548
19085A2899035M96040Q48017J387388K020526K488889K642251K966897L847496
19077B9596539M853122M549640L330216L435923M543966M442017K559393K169020
19069E9479836L508919L194260J105199P41789K678450K588536n14762j671179
19061G1111048j42598J84086k351505l669234k228813j820611l537375m337784
19053E3207214l080388k374316l734703m607367l944857l153738l322831l705710
19045B5283304l282250k562039k022828j739159j526184j220583q78768o24777
$$ plain form
19037 11426716 10891980 10437437 10159369 9997675 9850193 9738950 9672598 9609181 9455907 9208862
19027 9208862 8880574 8512415 8151461 7804479 7468257 7173753 6933828 6697221 6453345
19018 6453345 6193300 5867735 5495674 5114437 4764195 4389799 4023136 3720322 3448460
19009 3448460 3191617 2956361 2746699 2557336 2388964 2247211 2118076 2011911 1904035
19000 1904035 1815831 1741951 1684624 1626185 1577551 1540032 1496987 1464897 1430351 1399032 1356313
18989 1356313 1335533 1323984 1309653 1305503 1282109 1252221 1239491 1240071 1249423 1235408 1210284 1192621
18977 1192621 1185055 1193272 1198514 1201971 1193908 1204286 1223047 1227287 1222688 1209621 1200453 1189546 1184245
18964 1184245 1152001 1117897 1086561 1046413 1015958 987558 937176 884003 846103 814275 789505
$$ packed form
19037A1426716n34736m54543k78068j61694j47482j11243o6352o3417j53274k47045
19027I208862l28288l68159l60954l46982l36222k94504k39925k36607k43876
19018F453345k60045l25565l72061l81237l50242l74396l66663l02814k71862
19009C448460k56843k35256k09662j89363j68372j41753j29135j06165j07876
19000A904035q8204p3880n7327n8439m8634l7519m3045l2090l4546l1319m2719
18989A356313k0780j1549j4331m150k3394k9888j2730N80R352j4015k5124j7663
18977A192621p566Q217N242L457q063J0378J8761M240m599j3067r168j0907n301
18964A184245l2244l4104l1336m0148l0455k8400n0382n3173l7900l1828k4770
$$ plain form
18953 789505 768053 736362 707765 691282 669289 649034 650207 651924 649079 633918 616917 595135
18941 595135 572763 562844 550318 543079 531679 543532 561721 558273 552021 544625 522959 508047
18929 508047 493064 473913 465592 463123 471513 466507 467647 480344 487328 501813 516414 527365 536176
18916 536176 560816 584747 604234 634000 675744 725905 769957 796161 841534 912382 958580
18905 958580 971172 974521 965980 938183 889522 835061 780692 727661 686577 640904 617977 600353
18893 600353 586302 571913 554512 541712 547833 536844 544821 549096 554991 563210 555695 561869 576919
18880 576919 592638 604565 635446 667508 687575 717626 748768 802423 867148 931376 1009201
18869 1009201 1084242 1160176 1236107 1315427 1384112 1457921 1562570 1680207 1795412 1918900
$$ packed form
18953G89505k1452l1691k8597j6483k1993k0255J173J717k845j5161j7001k1782
18941E95135k2372r919j2526p239j1400J1853J8189l448o252p396k1666j4912
18929E08047j4983j9151q321k469Q390n006J140J2697O984J4485J4601J0951Q811
18916E36176K4640K3931J9487K9766M1744N0161M4052K6204M5373P0848M6198
18905I58580J2592L349q541k7797m8661n4461n4369n3031m1084m5673k2927j7624
18893F00353j4051j4389j7401j2800O121j0989P977M275N895Q219p515O174J5050
18880E76919J5719J1927L0881L2062K0067L0051L1142N3655O4725O4228P7825
18869A009201P5041P5934P5931P9320O8685P3809J04649J17637J15205J23488
$$ plain form
18859 1918900 2071967 2243837 2416401 2579436 2711457 2842338 2965262 3088016 3242526
18850 3242526 3424988 3651508 3949699 4353772 4886913 5595277 6533110 7789392 9454875
18841 9454875 11543581 14030041 17046544 20799848 25267283 30037132 34756542 39665126
18833 39665126 44662613 49169405 52559578 54895365 56464031 56743692 55471680 52901142
18825 52901142 49726135 45942458 41275496 36194554 31317872 26983595 22900607 19144620
18817 19144620 16013962 13576106 11719164 10257405 9166923 8440643 7980207 7691926
18809 7691926 7527110 7455009 7422867 7415938 7420589 7447584 7509022 7583588 7681951 7845605 8088650
18798 8088650 8444366 9006680 9838892 11076431 12905455 15462737 18701458 22657994 27529750
$$ packed form
18859A918900J53067J71870J72564J63035J32021J30881J22924J22754J54510
18850C242526J82462K26520K98191M04073N33141P08364R37833J256282J665483
18841I454875K088706K486460L016503L753304M467435M769849M719410M908584
18833C9665126M997487M506792L390173K335787J568666K79661j272012k570538
18825E2901142l175007l783677m666962n080942m876682m334277m082988l755987
18817A9144620l130658k437856j856942j461759j090482p26280m60436k88281
18809G691926j64816p2101l2142o929M651K6995O1438P4566R8363J63654K43045
18798H088650L55716N62314Q32212J237539J829024K557282L238721L956536M871756
$$ plain form
18789 27529750 33570975 40643285 48105392 55637592 63361982 71020245 77747033 82830682
18781 82830682 86390306 88526316 88710666 86630782 82741627 77737591 71684649 64556037
18773 64556037 56939703 49522794 42586032 36130688 30327827 25421429 21390725 18134790
18765 18134790 15580795 13639620 12153745 11026440 10171484 9514442 8995693 8572849 8224453
18756 8224453 7910700 7632749 7376224 7145023 6951103 6784961 6670190 6623297 6660692 6820960
18746 6820960 7165981 7750851 8648889 9854283 11319609 13196087 15570686 18382306 21326349
18737 21326349 24241792 27326641 30451076 33210967 35251973 36720592 37724518 37914598
18729 37914598 37180551 35722617 33894831 31586945 28760721 25780702 22912613 20225173
$$ packed form
18789B7529750O041225P072310P462107P532200P724390P658263O726788N083649
18781H2830682L559624K136010J84350k079884l889155n004036o052942p128612
18773F4556037p616334p416909o936762o455344n802861m906398m030704l255935
18765A8134790k553995j941175j485875j127305q54956o57042n18749m22844l48396
18756H224453l13753k77951k56525k31201j93920j66142j14771m6893L7395J60268
18746F820960L45021N84870Q98038J205394J465326J876478K374599K811620K944043
18737B1326349K915443L084849L124435K759891K041006J468619J003926J90080
18729C7914598p34047j457934j827786k307886k826224k980019k868089k687440
$$ plain form
18721 20225173 17562280 15124341 13068889 11350677 9863044 8552668 7511503 6711519
18713 6711519 6032453 5469638 5003991 4643043 4349963 4110533 3906349 3714678 3564126
18704 3564126 3440581 3311095 3172021 3033449 2912801 2795869 2660131 2528937 2392205
18695 2392205 2277809 2180654 2081671 1992684 1921120 1854297 1796619 1745607 1689584 1639832 1601841
18684 1601841 1607737 1650721 1652631 1669447 1739893 1841335 1934850 2002615 2049522 2132357 2255463
18673 2255463 2306166 2246163 2170549 2136177 2099872 1993727 1820648 1646462 1521332 1405919
18663 1405919 1268944 1147043 1050006 988705 942681 903791 872216 866186 865928 873459 862773 858698
18651 858698 866544 867957 863116 852939 829056 792533 760807 732597 714165 696717 679386 672868
$$ packed form
18721B0225173k662893k437939k055452j718212j487633j310376j041165p99984
18713F711519o79066n62815m65647l60948k93080k39430k04184j91671j50552
18704C564126j23545j29486j39074j38572j20648j16932j35738j31194j36732
18695B392205j14396r7155r8983q8987p1564o6823n7678n1012n6023m9752l7991
18684A601841N896M2984J910J6816P0446J01442R3515O7765M6907Q2835J23106
18673B255463N0703o0003p5614l4372l6305j06145j73079j74186j25130j15413
18663A405919j36975j21901r7037o1301m6024l8890l1575o030k58P531j0686m075
18651H58698P846J413m841j0177k3883l6523l1726k8210j8432j7448j7331o518
$$ plain form
18639 672868 651376 620971 610081 620845 611023 620079 635870 639882 635062 639461 633949 631920 640455
18626 640455 643237 634835 616404 600587 583195 581181 574451 571750 574528 566690 572720 568220 562297
18613 562297 543935 538592 550733 559013 567455 572146 565470 575996 603822 627000 641771 646443 671989
18600 671989 683918 702812 706697 704114 718142 745465 763555 778716 792615 815791 829825 856733
18588 856733 887181 920232 950215 973926 991458 1016413 1026021 1024702 1024070 1014570 994177 996741 1002135
18575 1002135 987092 964548 942909 919699 893910 873652 836136 807515 768037 731348 696694
18564 696694 655775 615221 566358 532971 509526 479750 439434 413787 411567 386524 368881 372072
18552 372072 373628 380154 383371 369822 374936 388120 408816 420489 415108 428463 435694 449364 460242
$$ packed form
18639F72868k1492l0405j0890J0764r822R056J5791M012m820M399n512k029Q535
18626F40455K782q402j8431j5817j7392k014o730k701K778p838O030m500n923
18613E62297j8362n343J2141Q280Q442M691o676J0526K7826K3178J4771M672K5546
18600F71989J1929J8894L885k583J4028K7323J8090J5161J3899K3176J4034K6908
18588H56733L0448L3051K9983K3711J7532K4955R608j319o32r500k0393K564N394
18575A002135j5043k2544k1639k3210k5789k0258l7516k8621l9478l6689l4654
18564F96694m0919m0554m8863l3387k3445k9776m0316k5647k220k5043j7643L191
18552C72072J556O526L217j3549N114J3184K0696J1673n381J3355P231J3670J0878
$$ plain form
18539 460242 440272 457370 458609 452375 440362 424674 420859 423221 422419 414024 384773 355075 359940
18526 359940 365734 354483 323059 307748 310172 306301 295348 276786 258961 236027 226440 213795
18514 213795 206327 193003 183633 203295 216515 216236 207863 202643 210493 229250 229142 237556 258831
18501 258831 282630 316929 356571 405209 453647 486383 508924 536652 565245 584776 598435
18490 598435 609993 605630 597600 582723 561485 530052 507632 477820 445123 415733 377091 352941
18478 352941 344093 319272 294689 286023 282416 273862 265063 250042 238667 223749 223666 221304 236440
18465 236440 237756 239934 246593 241494 248059 258084 260599 282418 289758 294893 305610 305356 308876 302465
18451 302465 305900 333732 356024 393153 426249 454205 509560 575203 645068 694653 727755 776997
$$ packed form
18539D60242j9970J7098J239o234j2013j5688l815K362q02q395k9251k9698M865
18526C59940N794j1251l1424j5311K424l871j0953j8562j7825k2934r587j2645
18514B13795p468j3324r370J9662J3220k79q373n220P850J8757j08Q414K1275
18501B58831K3799L4299L9642M8638M8438L2736K2541K7728K8593J9531J3659
18490E98435J1558m363q030j4877k1238l1433k2420k9812l2697k9390l8642k4150
18478C52941q848k4821k4583q666l607q554q799j5021j1375j4918q3k362J5136
18465B36440J316K178O659n099O565J0025K515K1819P340N135J0717k54L520o411
18451C02465L435K7832K2292L7129L3096K7956N5355O5643O9865M9585L3102M9242
$$ plain form
18439 776997 837083 886934 902215 877198 844188 814146 805113 769997 691391 622164 573388 520719
18427 520719 444037 360534 315961 283116 248055 228370 200980 180081 166627 162327 162281 161540 165269
18414 165269 157031 154462 153582 160455 167600 175271 186853 197313 190977 184567 184983 209859 231722 250320
18400 250320 261809 278504 302851 320052 340812 383292 457253 527559 565934 583802 610624
18389 610624 641505 672713 682052 665296 652404 637370 608868 556319 491939 430859 392143 345663
18377 345663 296195 266780 246852 216927 188875 157160 133093 128828 119913 111619 113738 114028 110967
18364 110967 113165 103705 98484 92154 79649 76655 97374 111018 89138 89095 93370 99517 104969 111314
18350 111314 112493 105734 89354 97271 93508 94427 98050 89415 86833 95003 106476 104391 100048 101600
$$ packed form
18439G76997O0086M9851J5281k5017l3010l0042r033l5116p8606o9227m8776n2669
18427E20719p6682q3503m4573l2845l5061j9685k7390k0899j3454m300m6p41L729
18414A65269q238k569q80O873P145P671J1582J0460o336o410M16K4876K1863J8598
18400B50320J1489J6695K4347J7201K0760M2480P3961P0306L8375J7868K6822
18389F10624L0881L1208R339j6756j2892j5034k8502n2549o4380o1080l8716m6480
18377C45663m9468k9415j9928k9925k8052l1715k4067m265q915q294K119K90l061
18364A10967K198r460n221o330j2505k994K0719J3644k1880m3M275O147N452O345
18350A11314J179o759j6380P917l763R19L623q635k582Q170J1473k085m343J552
$$ plain form
18336 101600 108781 110064 115072 125795 140129 133679 157290 195108 228500 245003 270721 325774
18324 325774 363697 389783 408095 462406 532672 580954 627411 678108 738784 784474 845830
18313 845830 898771 921604 935504 958313 970921 961936 949065 952326 931683 893057 847091 796613
18301 796613 748643 675371 603538 545231 480890 408297 347843 301448 259535 215075 180662
18290 180662 151461 141436 144009 144780 138516 134205 133529 141774 149171 163817 183809 199505 209463
18277 209463 209074 213669 244729 297251 325567 351626 373102 388593 422406 452066 476985 529286
18265 529286 591506 641855 682623 723524 761806 805481 845466 843943 834829 834286 805562 768970
18253 768970 737155 704247 645648 584390 526750 465603 408575 350271 290847 268137 244598
$$ packed form
18336A01600P181J283N008J0723J4334o450K3611L7818L3392J6503K5718N5053
18324C25774L7923K6086J8312N4311P0266M8282M6457N0697O0676M5690O1356
18313H45830N2941K2833J3900K2809J2608q985j2871L261k0643l8626m5966n0478
18301G96613m7970p3272p1833n8307o4341p2593o0454m6395m1913m4460l4413
18290A80662k9201j0025K573P71o264m311o76Q245P397J4646J9992J5696R958
18277B09463l89M595L1060N2522K8316K6059K1476J5491L3813K9660K4919N2301
18265E29286O2220N0349M0768M0901L8282M3675L9985j523r114n43k8724l6592
18253G68970l1815l2908n8599o1258n7640o1147n7028n8304n9424k2710k3539
$$ plain form
18242 244598 203850 166003 165941 170925 169369 147946 135283 132047 123094 114757 106744 110854 122506
18229 122506 129775 128213 124533 124127 130031 130279 125567 114551 110829 116647 125514 133819 140244 157623
18215 157623 174397 205475 228993 246929 261504 286821 296387 297180 305244 290326 265187 260598
18203 260598 250304 242123 222851 200568 179731 168430 160327 156574 134580 125167 119415 110626 109722
18190 109722 114730 112370 102771 93540 82435 78986 89153 94427 91376 85710 84920 86985 73914 67039
18176 67039 70263 85446 97629 102105 106327 113666 111023 104345 87745 74897 62413 60683 72479
18163 72479 83685 96769 92700 92135 86605 89964 109770 97406 84514 69719 71310 85599 92194
18150 92194 95188 81929 79310 86354 93005 88607 83609 89022 88185 96551 110759 111770 106520 126227
$$ packed form
18242B44598m0748l7847o2M984j556k1423j2663l236q953q337q013M110J1652
18229A22506P269j562l680m06N904K48m712j1016l722N818Q867Q305O425J7379
18215A57623J6774L1078K3518J7936J4575K5317R566P93Q064j4918k5139m589
18203B60598j0294q181j9272k2283k0837j1301q103l753k1994r413n752q789r04
18190A09722N008k360r599r231j1105l449J0167N274l051n666p90K065j3071o875
18176F7039L224J5183J2183M476M222P339k643o678j6600j2848j2484j730J1796
18163G2479J1206J3084m069n65n530L359J9806j2364j2892j4795J591J4289O595
18150I2194K994j3259k619P044O651m398m998N413q37Q366J4208J011n250J9707
$$ plain form
18136 126227 141944 157233 161017 185609 206508 205193 206933 215069 219209 232419 247670 272856
18124 272856 311275 350284 377499 400045 450754 518315 594744 687912 804818 951337 1148166
18113 1148166 1393002 1690781 2109518 2744503 3724608 5536897 9074948 14531879 18251537
18104 18251537 17997669 16282989 14632233 12617013 8875778 5457808 3623192 2671827
18096 2671827 2130690 1778480 1531049 1355922 1216900 1091986 984967 899652 832456 777659
18086 777659 742906 725029 722902 741309 751374 747792 752080 756887 739356 730853 753713 780596
18074 780596 798183 813640 833988 856042 877397 889473 904355 937480 976320 1022087 1052944
18063 1052944 1062552 1081039 1131287 1180552 1183289 1158714 1146710 1133177 1095224 1050183 996573 948902
$$ packed form
18136A26227J5717J5289L784K4592K0899j315J740Q136M140J3210J5251K5186
18124B72856L8419L9009K7215K2546N0709O7561P6429R3168J16906J46519J96829
18113A148166K44836K97779M18737O34985R80105J812289L538051N456931L719658
18104A8251537k53868j714680j650756k015220l741235l417970j834616r51365
18096B671827n41137l52210k47431j75127j39022j24914j07019q5315o7196n4797
18086G77659l4753j7877k127J8407J0065l582M288M807j7531q503K2860K6883
18074G80596J7587J5457K0348K2054K1355J2076J4882L3125L8840M5767L0857
18063A052944R608J8487N0248M9265K737k4575j2004j3533l7953m5041n3610m7671
$$ plain form
18051 948902 929890 915147 873257 824067 778871 756554 714225 661855 623674 600842 603012 607682
18039 607682 604762 608970 622119 650088 667046 664363 659478 668021 697741 707898 692407 687124 692385
18026 692385 676261 650314 627265 594013 552640 518075 480186 449601 444148 430927 428517 406661
18014 406661 380220 354209 332398 297877 285230 262385 230988 203943 172083 149998 131480
18003 131480 106653 114310 132594 146492 148417 145081 149472 156725 169546 192522 210922 225232
17991 225232 244975 283278 313800 327202 355771 383829 407361 417462 433442 449897 459774 456769
17979 456769 469495 469684 457444 431569 435960 435171 403937 394474 395724 381127 370652 374839 385020
17966 385020 371747 352688 346832 348247 330071 323856 311514 287487 259554 238321 230326 233592
$$ packed form
18051I48902j9012j4743m1890m9190m5196k2317m2329n2370l8181k2832K170M670
18039F07682k920M208J3149K7969J6958k683m885Q543K9720J0157j5491n283N261
18026F92385j6124k5947k3049l3252m1373l4565l7889l0585n453j3221k410k1856
18014D06661k6441k6011k1811l4521j2647k2845l1397k7045l1860k2085j8518
18003A31480k4827P657J8284J3898J925l336M391P253J2821K2976J8400J4310
17991B25232J9743L8303L0522J3402K8569K8058K3532J0101J5980J6455R877l005
17979D56769J2726J89j2240k5875M391p89l1234r463J250j4597j0475M187J0181
17966C85020j3273j9059n856J415j8176o215j2342k4027k7933k1233p995L266
$$ plain form
17954 233592 227000 207943 195297 189666 185091 182447 168961 153468 138800 126986 122058 105007
17942 105007 89321 68689 67586 71253 76062 72046 72645 61244 56064 60793 67575 70233 54305
17929 54305 42002 42050 56218 78749 79560 61701 56733 64755 69210 75529 87235 83367 82706 81760
17915 81760 87124 75661 56031 66415 88653 90858 84450 89331 91901 95437 88081 82898 75122
17902 75122 82697 88107 71876 66517 79687 79504 69746 69762 56995 46591 33156 20228 17414 22801
17888 22801 35843 43055 41427 25428 24257 40655 35905 26694 21522 28961 38193 44493 33371
17875 33371 37603 46719 39171 32700 29177 33815 39126 40367 46300 62464 78444 95147 86917 83630
17861 83630 89630 92157 80058 72297 75526 76932 70946 70046 68844 71939 81584 83994 88491 86489
$$ packed form
17954B33592o592j9057j2646n631m575k644j3486j5493j4668j1814m928j7051
17942A05007j5686k0632j103L667M809m016N99j1401n180M729O782K658j5928
17929E4305j2303M8J4168K2531Q11j7859m968Q022M455O319J1706l868o61r46
17915H1760N364j1463j9630J0384K2238K205o408M881K570L536p356n183p776
17902G5122P575N410j6231n359J3170j83r758J6j2767j0404j3435j2928k814N387
17888B2801J3042P212j628j5999j171J6398m750r211n172P439R232O300j1122
17875C3371M232R116p548o471l523M638N311J241N933J6164J5980J6703q230l287
17861H3630O000K527j2099p761L229J406n986r00j202L095R645K410M497k002
$$ plain form
17847 86489 79839 85129 82935 82222 72484 58076 58293 63514 62366 71664 63187 57456 63771 72249 74126
17832 74126 62654 53165 46504 44930 55261 53625 48446 44331 43476 44606 40104 38603 43848 42784
17818 42784 31895 32241 28044 27137 23124 31662 41797 35893 21291 13479 24998 47077 47837 42937
17804 42937 34851 31663 19691 14551 31167 49542 41735 35679 38076 28306 27056 24246 6246
17791 6246 5369 1589 7161 1177 4310 8589 10747 33253 44769 50021 36971 36888 44119 37924 33265
17776 33265 45032 46068 53568 60657 66718 67845 64726 51982 44771 58244 57807 50642 48121 57069
17762 57069 44887 34546 33126 31650 49073 57419 48726 44321 35765 31687 42416 52355 51581 51309
17748 51309 40817 26014 19990 19308 23968 23492 17429 17964 26584 14335 14904 30132 39473 30017
$$ packed form
17847H6489o650N290k194p13r738j4408K17N221j148R298q477n731O315Q478J877
17832G4126j1472r489o661j574J0331j636n179m115q55J130m502j501N245j064
17818D2784j0889L46m197r07m013Q538J0135n904j4602p812J1519K2079P60m900
17804D2937q086l188j1972n140J6616J8375p807o056K397r770j250k810j8000
17791F246q77l780N572n984L133M279K158K2506J1516N252j3050q3P231o195m659
17776C3265J1767J036P500P089O061J127l119j2744p211J3473m37p165k521Q948
17762E7069j2182j0341j420j476J7423Q346q693m405q556m078J0729R939p74k72
17748E1309j0492j4803o024o82M660m76o063N35Q620j2249N69J5228R341r456
$$ plain form
17734 30017 17613 11664 12659 6610 2859 6640 11726 19433 32291 45286 56636 60538 46294
17721 46294 34666 22863 28201 39163 46168 58019 62043 63376 71421 80939 66446 52159 46930
17708 46930 39200 36271 26157 27957 28306 15564 15790 12974 6449 25490 22511 20906 24354 25466
17694 25466 29548 27045 12556 5163 3266 18222 26729 9361 -483 8779 9731 16614 29557 19993
17680 19993 20684 16169 26593 11275 -4257 1829 -3472 124 16772 20156 13752 20270 33107
17667 33107 34657 45325 41190 37924 40349 41654 36093 34784 26950 18212 9091 7328 15320 25262
17653 25262 25248 14476 4141 4454 4460 11574 34728 42486 38188 23815 5289 12091 15929 -74
17639 -74 1906 9533 1593 2694 -1414 5590 11622 -3172 -13465 -7011 2142 -7058 -4554 6241
$$ packed form
17734C0017j2404n949R95o049l751L781N086P707J2858J2995J1350L902j4244
17721D6294j1628j1803N338J0962P005J1851M024J333Q045R518j4493j4287n229
17708D6930p730k929j0114J800L49j2742K26k816o525J9041k979j605L448J112
17694B5466M082k503j4489p393j897J4956Q507j7368r844R262R52O883J2943r564
17680A9993O91m515J0424j5318j5532O086n301L596J6648L384o404O518J2837
17667C3107J550J0668m135l266K425J305n561j309p834q738r121j763P992R942
17653B5262j4j0772j0335L13OP114K3154P758m298j4373j8526O802L838j6003
17639g4J980P627p940J101m108P004O032j4794j0293O454R153r200K504J0795
$$ plain form
17625 6241 6724 5518 18019 33680 35173 17097 195 8132 12258 -4490 -3477 17510 24689
17612 24689 19551 23341 27820 37026 43635 35276 32086 37722 37042 28189 15654 12105 13585 11462
17598 11462 4228 -491 209 5950 -1930 -11876 -6427 -3306 11281 17303 3333 -45 -10803 -24109
17584 -24109 -26327 -15590 -19251 -28125 -22310 -21201 -17323 -7713 -11861 -21116 -12863 2767 -5533 -16785
17570 -16785 -13396 -2988 4031 -4838 -2616 98 -9976 -17823 5187 12540 11357 7368 -1230 930
17556 930 3698 11324 5813 -630 14214 24155 22466 22030 6540 53 12029 22082 26223 35302
17542 35302 29764 23945 23086 17430 10550 10202 20751 29404 19909 12791 18026 19097 21727 22951 22447
17527 22447 21565 18422 13613 5981 17116 24140 15585 10394 6519 3953 -5315 -4707 4440 12504 12187
$$ packed form
17625F241M83j206J2501J5661J493j8076j6902P937M126j6748J013K0987P179
17612B4689n138L790M479R206O609q359l190N636o80q853j2535l549J480k123
17598A1462p234m719P00N741p880r946N449L121J4587O022j3970l378j0758j3306
17584b4109k218J0737l661q874N815J109L878R610m148r255Q253J5630q300j1252
17570a6785L389J0408P019q869K222K714j0074p847K3010P353j183l989q598K160
17556I30K768P626n511o443J4844R941j689m36j5490o487J1976J0053M141R079
17542C5302n538n819q59n656o880l48J0549Q653r495p118N235J071K630J224n04
17527B2447q82l143m809p632J1135P024q555n191l875k566r268O08R147Q064l17
$$ plain form
17512 12187 11359 15892 4931 7673 19064 22535 20265 -2115 -12446 -10733 -1649 2620 20977
17499 20977 27673 27875 22155 25136 29754 34017 26392 15335 3560 4622 4530 -4439 -2525 13687
17485 13687 15437 12871 8101 5428 2071 2114 10996 11228 3212 2286 -269 4935 -3841 -6420 -6851 -6841
17469 -6841 2 13233 7550 49 5690 2879 3983 10778 19952 13620 24887 27998 37726 33703
17455 33703 29923 15172 -9435 -15924 -13009 -5134 9505 75 -8523 19094 38756 38371 40983
17442 40983 40610 48039 67744 93847 111733 101485 84761 67788 57552 34460 18469 2681
17430 2681 -5128 -10735 -13745 -7675 -6888 5760 10893 -3869 -12812 -4100 -135 7336 622 -1316
17416 -1316 4397 -1210 -9122 -10347 -26820 -30357 -36366 -34496 -20070 -18558 -7741 -5914 -2919 2568
$$ packed form
17512A2187q28M533j0961K742J1391L471k270k2380j0331J713R084M269J8357
17499B0977O696K02n720K981M618M263p625j1057j1775J062r2q969J914J6212
17485A3687J750k566m770k673l357M3Q882K32q016r26k555N204q776k579m31J0
17469f841O843J3231n683p501N641k811J104O795R174o332J1267L111R728m023
17455C3703l780j4751k4607o489K915P875J4639r430q598K7617J9662l85K612
17442D0983l73P429J9705K6103J7886j0248j6724j6973j0236k3092j5991j5788
17430B681p809n607l010O070P87J2648N133j4762q943Q712L965P471o714j938
17416a316N713n607p912j225j6473l537o009J870J4426J512J0817J827K995N487
$$ plain form
17402 2568 12211 21048 19491 16401 13878 28656 25050 29447 23825 13225 20219 6459 7919 16792
17388 16792 12409 -1173 -7305 -11183 -2721 2598 3911 -19975 -14311 9313 8323 -1533 -5712 -3411
17374 -3411 -1982 5287 6352 -1926 -9875 -11407 -6518 3033 19946 15954 15358 27311 25807 16596
17360 16596 4835 -3817 -3910 -5392 -3767 9345 13424 645 -3330 -7902 -3592 758 -7164 -579
17346 -579 7622 13648 7193 1275 2188 14739 12925 15130 13352 6299 15089 28711 21288 11050
17332 11050 17419 24585 21992 21883 32761 35508 33070 13930 546 8661 4332 3489 3622 4243 6925
17317 6925 -1824 -15586 -13415 635 -755 3643 14153 12348 837 -2951 -5409 -11702 -3718 3610
17303 3610 1879 15633 19958 14670 -8788 -15969 -6972 -890 -1821 7607 3138 -9968 -12228 -3121
$$ packed form
17402B568R643Q837j557l090k523J4778l606M397n622j0600O994j3760J460Q873
17388A6792m383j3582o132l878Q462N319J313k3886N664K3624r90r856m179K301
17374c411J429P269J065q278p949j532M889R551J6913l992n96J1953j504r211
17360A6596j1761q652r3j482J625J3112M079j2779l975m572M310M350p922O585
17346e79Q201O026o455n918R13J2551j814K205j778p053Q790J3622p423j0238
17332A1050O369P166k593j09J0878K747k438j9140j3384Q115m329q43J33O21K682
17317F925q749j3762K171J4050j390M398J0510j805j1511l788k458o293P984P328
17303C610j731J3754M325n288k3458p181Q997O082r31R428m469j3106k260R107
$$ plain form
17289 -3121 -3847 -7717 -5403 -10884 -3588 4499 -1177 -3728 -7335 -9252 -19130 -15165 -10088 -4575 12920
17274 12920 18363 19668 20310 22468 25484 16649 5343 1072 -3135 -7821 -12137 -9962 -15257 -10025
17260 -10025 254 3837 8201 4701 3378 7460 11198 -12881 -9132 8635 9700 1199 1923 -492
17246 -492 -7175 -7690 -170 2592 6795 17661 14762 3868 -13412 -7913 -14353 -22746 -12856 -17728
17232 -17728 -12464 6898 17401 7914 -11854 -13232 7466 7073 3490 14138 21789 17441 30511
17219 30511 24916 27674 16731 5284 17698 21018 15410 16229 11396 -3869 2250 1218 -12809
17206 -12809 -11916 -689 5216 3857 -5896 -10236 -8804 -10166 -15294 10450 14947 6525 -1708 -12803
17192 -12803 -20385 -8696 6210 11959 11402 10947 523 -6437 -10504 -15851 -15995 -14906 -15006 -15880 -7135
$$ packed form
17289c121p26l870K314n481P296Q087n676k551l607j917r878L965N077N513J7495
17274A2920N443J305O42K158L016q835j1306m271m207m686m316K175n295N232
17260a0025J0279L583M364l500j323M082L738k4079L749J7767J065q501P24k415
17246d92o683n15P520K762M203J0866k899j0894j7280N499o440q393R890m872
17232a7728N264J9362J0503r487j9768j378K0698l93l583J0648P651m348J3070
17219C0511n595K758j0943j1447J2414L320n608Q19m833j5265O119j032j4027
17206a2809Q93J1227N905j359r753m340J432j362n128K5744M497q422q233j1095
17192a2803p582J1689J4906N749n57m55j0424o960m067n347j44J089j00q74Q745
$$ plain form
17177 -7135 11519 9837 -3424 -16225 -8807 -5152 6672 20483 7251 -9711 -13121 -929 17162
17164 17162 16416 10371 9270 404 4101 11086 1971 -14003 -16247 7978 15951 19344 18673 9041
17150 9041 -8106 -2280 23404 26785 27395 19801 10193 2572 12652 -4560 -2819 1630 -9813 -1063
17136 -1063 5016 6715 2469 6482 6572 -626 -2941 10043 22024 25410 20628 3978 1251 3327
17122 3327 -1961 -5791 -6451 -7227 -8596 6802 14731 16213 7250 5295 5848 12153 1710 1950 4506
17107 4506 11721 17989 20040 5450 11417 25803 33226 30089 28542 25492 16384 5240 -6251 2594
17093 2594 3976 5044 6949 8183 11415 1877 -12396 -16690 -3168 -3615 -6983 -10757 1974 8012
17079 8012 -2791 -7737 -13472 -13471 -18324 -2322 838 3462 9618 668 -9741 -14186 -13002 -7104 -5168
$$ packed form
17177g135J8654j682j3261j2801P418L655J1824J3811j3232j6962l410J2192J8091
17164A7162p46o045j101q866L697O985r115j5974k244K4225P973L393o71r632
17150I041j7147N826K5684L381O10p594r608p621J0080j7212J741M449j1443Q750
17136a063O079J699m246M013R0p198k315J2984J1981L386m782j6650k727K076
17122C327n288l830o60p76j369J5398P929J482q963j955N53O305j0443K40K556
17107D506P215O268K051j4590N967J4386P423l137j547l050r108j1144j1491Q845
17093B594J382J068J905J234L232r538j4273m294J3522m47l368l774J2731O038
17079H012j0803m946n735Jm853J6002L160K624O156q950j0409m445J184N898J936
$$ plain form
17064 -5168 4522 -1619 6947 1967 -99 5917 13267 15637 12747 10672 3963 7039 14211 14919 -4762
17049 -4762 -11624 -7516 2445 3309 4431 -1021 7339 19907 19407 10511 892 -6102 -16015 -18778 -11991
17034 -11991 -5763 4242 12 -1646 14198 22648 14485 5343 1418 -2949 -2115 -4165 -1516 286
17020 286 -6391 -13345 -16905 -14777 -16948 -5668 9896 8186 2607 -9807 -14797 -20702 -16493 -10323
17006 -10323 -2313 -5940 -8393 7769 8386 7098 140 -6826 -20668 -25896 -13324 -7111 -7257 9441
16992 9441 2174 -5435 -2345 9583 17917 18101 13920 11862 20796 22432 19003 5788 883 4287
16978 4287 -8435 -14842 -8680 4394 8530 -4096 -9607 -16721 -11896 -7576 -4561 -20083 -22871 -10776
16964 -10776 2665 -14442 -16335 -8569 2494 8205 1741 -7024 -5489 4627 8581 6626 9414
$$ packed form
17064e168R690o141Q566m980k066O016P350K370k890k075o709L076P172P08j9681
17049d762o862M108R961Q64J122n452Q360J2568n00q896r619o994r913k763O787
17034a1991O228J0005m230j658J5844Q450q163r142l925m367Q34k050K649J802
17020B86o677o954l560K128k171J1280J5564j710n579j2414m990n905M209O170
17006a0323Q010l627k453J6162O17j288o958o966j3842n228J2572O213j46J6698
16992I441p267p609L090J1928Q334J84m181k058Q934J636l429j3215m905L404
16978D287j2722o407O162J3074M136j2626n511p114M825M320L015j5522k788J2095
16964a0776J3441j7107j893P766J1063N711o464q765J535J0116L954j955K788
$$ plain form
16951 9414 7394 14324 8574 -3553 -9500 -2444 -10677 3262 14130 15199 5547 -2400 2582 6362
16937 6362 7801 2739 -3115 478 12562 12331 26013 26516 30020 30135 16106 26 -8886 -15715
16923 -15715 -25173 -6635 7627 9883 17667 14416 1291 -2637 3051 -3926 -9770 -2515 820 2822
16909 2822 1934 -15979 -10225 -12107 -18288 -16148 -15884 -8423 -829 4948 9051 7157 10415 9399 4202
16894 4202 -1997 -6123 -7616 -3601 3849 -7004 -665 -1867 -13433 -13103 9765 5158 -9044 -15594
16880 -15594 -17182 -15898 -8266 -4771 -7545 -7909 -2520 -2303 7487 5187 -5554 -15833 -2902 -4946
16866 -4946 3547 -6114 -15819 -15021 -313 5255 7975 17257 20848 6181 2454 9486 7606 2031
16852 2031 1023 3883 6180 178 -2024 -15214 -11059 8203 7983 12525 25629 13667 -2260 -5907
$$ packed form
16951I414k020O930n750j2127n947P056q233J3939J0868J069r652p947M982L780
16937F362J439n062n854L593J2084k31J3682N03L504J15j4029j6080q912o829
16923a5715r458J8538J4262K256P784l251j3125l928N688o977n844P255L335K002
16909B822q88j7913N754j882o181K140K64P461P594N777M103j894L258j016n197
16894D202o199m126j493M015P450j0853O339j202j1566L30K2868m607j4202o550
16880a5594j588J284P632L495k774l64N389K17R790k300j0741j0279J2931k044
16866d946Q493r661r705P98J4708N568K720R282L591j4667l727P032j880n575
16852B031j008K860K297o002k202j3190M155J9262k20M542J3104j1962j5927l647
$$ plain form
16838 -5907 965 -1033 -1702 8658 10623 5765 -7635 881 10689 7426 3717 1977 10890 18673
16824 18673 28312 16527 8703 12791 5643 4254 130 9573 6534 -3640 -12323 -3544 7869 -4237
16810 -4237 -1347 -198 1247 -11110 -20655 -15267 -15431 -21531 -31037 -34874 -23058 -23627 -18245 -2237
16796 -2237 14935 6400 16419 14249 -2329 -25145 -19142 -1823 -4125 -8989 -8983 8038 15842 2507
16782 2507 2835 -4479 -4323 -2309 -10197 -11083 -9112 -8921 -20064 -17875 -8825 -4561 -9328 -11026 -6074
16767 -6074 -10763 -9447 -6483 -15548 -28545 -14243 -6782 -1944 -7319 -6367 10115 19972 18897 4434
16753 4434 -6627 -13104 1667 570 -7197 -5324 3127 9771 21852 24466 25548 21123 23619 21476
16739 21476 17444 7133 3779 3272 -1401 7248 6296 4602 4649 -675 -6844 -5146 -9903 -13072 -23672
$$ packed form
16838e907O872j998o69J0360J965m858j3400Q516R808l263l709j740Q913P783
16824A8673R639j1785p824M088p148j389m124R443l039j0174q683Q779J1413j2106
16810d237K890J149J445j2357r545N388j64o100r506l837J1816n69N382J6008
16796b237J7172q535J0019k170j6578k2816O003J7319k302m864OJ7021P804j3335
16782B507L28p314J56K014p888q86J971J91j1143K189R050M264m767j698M952
16767f074m689J316K964r065j2997J4302P461M838n375R52J6482R857j075j4463
16753D434j1061o477J4771j097p767J873Q451O644J2081K614J082m425K496k143
16739B1476m032j0311l354n07m673Q649r52j694M7n324o169J698m757l169j0600
$$ plain form
16724 -23672 -26244 -21443 1946 10539 4703 6326 1718 -7974 -6905 -6658 -3688 7100 13914 -2054
16710 -2054 -7896 9662 10422 -88 -5331 -3505 3693 2049 2756 -2073 7872 12525 9242 1511 1977
16695 1977 -6339 -4285 5293 8704 2951 6263 21830 20927 13557 -813 -11180 -2666 7361 6577
16681 6577 4242 -2727 -9995 -11625 1398 28599 30150 9186 -9973 -8558 5514 14195 13631 6972
16667 6972 -4980 3629 6816 2575 2860 10854 17012 3555 -7747 -23110 -14048 -4201 -13484 -3925
16653 -3925 10622 6723 -142 -2221 -19386 -17375 -17370 -16385 -13071 -9802 -10056 -18368 -8485 -8224 -14933 -17886
16637 -17886 -24042 -25309 -22176 -10931 -6794 -15544 -12284 -10620 1638 3466 -11232 -20270 -11059 -7598
16623 -7598 -22553 -20437 -3451 -9251 -23661 -27393 -26836 -10840 349 7359 9487 8445 7970 4694
$$ packed form
16724b3672k572M801K3389Q593n836J623m608r692J069K47K970J0788O814j5968
16710b054n842J7558P60j0510n243J826P198j644P07m829R945M653l283p731M66
16695A977q316K054R578L411n753L312J5567r03p370j4370j0367Q514J0027p84
16681F577k335o969p268j630J3023K7201J551k0964j9159J415J4072Q681n64o659
16667F972j1952Q609L187m241K85P994O158j3457j1302j5363R062R847r283R559
16653c925J4547l899o865k079j7165K011NR85L314L269k54q312R883K61o709k953
16637a7886o156j267L133J1245M137q750L260J664J2258J828j4698r038R211L461
16623g598j4955K116J6986n800j4410l732N57J5996J1189P010K128j042m75l276
$$ plain form
16609 4694 9824 11784 2047 -4675 -4163 10429 17018 4741 -4419 -2102 3617 10892 5462 3263
16595 3263 -2387 -3984 -10856 -7227 -3579 -13432 -12612 -14225 4666 10658 15143 13173 8658 6122 3007
16580 3007 -11648 -20576 -28470 -42973 -51108 -22484 -6067 -10884 -9243 -6420 5731 -7961 -26368
$$ packed form
16609D694N130J960r737o722N12J4592O589j2277r160K317N719P275n430k199
16595C263n650j597o872L629L648r853Q20j613J8891N992M485j970m515k536l115
16580C007j4655q928p894j4503q135K8624J6417m817J641K823J2151j3692j8407
$$ [...]
##END NTUPLES=NMR SPECTRUM
##END=
