##TITLE=Analysis number 313889
Compound Code sb 02109
Project Code adrs
Chemist Name komarov
##JCAMPDX= 6.0         $$ Bruker NMR JCAMP-DX V2.0
##DATA TYPE= NMR SPECTRUM
##DATA CLASS= NTUPLES
##ORIGIN= Bruker BioSpin GmbH
##OWNER= NMR
$$ XWIN-NMR		Version 3.5
$$ Tue Sep 27 09:12:25 2005 GMT Daylight Time (UT+1h)  MAYBRIDGE\NMR@NMR_250MHZ
##.OBSERVE FREQUENCY= 250.131544655141
##.OBSERVE NUCLEUS= ^1H
##.ACQUISITION MODE= SIMULTANEOUS (DQD)
##.ACQUISITION SCHEME= undefined
##.AVERAGES= 16
##.DIGITISER RES= 18
##SPECTROMETER/DATA SYSTEM= dpx250
##.PULSE SEQUENCE= zg30
##.SOLVENT NAME= CDCl3
##.SHIFT REFERENCE= (INTERNAL, CDCl3, 0, 16.522)
##AUDIT TRAIL= $$ (NUMBER, WHEN, WHO, WHERE, WHAT)
$$ ##TITLE= Audit trail, XWIN-NMR		Version 3.5
$$ ##JCAMPDX= 5.01
$$ ##ORIGIN= Bruker BioSpin GmbH
$$ ##OWNER= NMR
$$ C:\u/data/dgb/nmr/ADRS/10000/pdata/1/auditp.txt
$$ ##AUDIT TRAIL=  $$ (NUMBER, WHEN, WHO, WHERE, WHAT)
(   1,<2005-09-27 09:12:06.69 +100>,<MAYBRIDGE\NMR>,<NMR_250MHZ>,
      <created by zg, POWCHK disabled, PULCHK disabled
       configuration hash MD5:
       62 19 C7 07 E1 42 D1 B7 37 6C 3D D0 77 39 F9 E6
       data hash MD5: 64K
       DD D6 87 AC DB 15 60 76 D2 36 9C FB 16 1A 8D 93>)
(   2,<2005-09-27 09:12:17.38 +100>,<MAYBRIDGE\NMR>,<NMR_250MHZ>,
      <Start of raw data processing
       ef LB = 0.3 FT_mod = 6 PKNL = 1 SI = 32K 
       data hash MD5: 32K
       34 35 2E D3 60 F4 EE D2 5C BE 3F 92 AF B0 98 9D>)
(   3,<2005-09-27 09:12:19.06 +100>,<MAYBRIDGE\NMR>,<NMR_250MHZ>,
      <apk 
       data hash MD5: 32K
       1F E3 75 77 34 13 7D 84 C3 9B 26 27 61 F2 48 FA>)
(   4,<2005-09-27 09:12:19.86 +100>,<MAYBRIDGE\NMR>,<NMR_250MHZ>,
      <abs ABSG = 5 
       data hash MD5: 32K
       B3 C3 4A BA 4D D9 96 DA E7 0F B3 7B 1B 09 56 E2>)
$$ ##END=
$$ 
$$ hash MD5
$$ 4C 58 F5 D4 E3 68 15 B7 6A 53 49 88 F3 38 87 C7
##$RELAX= 
##$RELAX= 
##$RELAX= 
##$RELAX= 
##$RELAX= 
##$RELAX= 
##$RELAX= 
$$ Bruker specific parameters
$$ --------------------------
##$DU= <C:\u>
##$EXPNO= 10000
##$NAME= <ADRS>
##$PROCNO= 1
##$TYPE= <nmr>
##$USER= <dgb>
##$AMP= (0..31)
100 100 100 100 100 100 100 100 100 100 100 100 100 100 100 100 100 100 
100 100 100 100 100 100 100 100 100 100 100 100 100 100 
##$AQSEQ= 0
##$AQ_mod= 3
##$AUNM= <au_zg>
##$AUTOPOS= <4 >
##$BF1= 250.13
##$BF2= 250.13
##$BF3= 250.13
##$BF4= 250.13
##$BF5= 500.13
##$BF6= 500.13
##$BF7= 500.13
##$BF8= 500.13
##$BYTORDA= 1
##$CFDGTYP= 0
##$CFRGTYP= 5
##$CHEMSTR= <none>
##$CNST= (0..31)
1 1 145 1 1 1 1 1 1 1 1 1 1 1 1 1 1 1 1 1 1 1 1 1 1 1 1 1 1 1 1 1 
##$CPDPRG= <>
##$CPDPRG1= <>
##$CPDPRG2= <>
##$CPDPRG3= <>
##$CPDPRG4= <mlev>
##$CPDPRG5= <mlev>
##$CPDPRG6= <mlev>
##$CPDPRG7= <mlev>
##$CPDPRG8= <mlev>
##$CPDPRGB= <>
##$CPDPRGT= <>
##$D= (0..31)
0 1 0 0 0 0 0 0 0 0.06 0 0 0 0 0 0 0.0002 0 0 0 0 0 0 0 0 0 0 0 0 0 0 
0 
##$DATE= 1127808725
##$DBL= (0..7)
120 120 120 120 120 120 120 120 
##$DBP= (0..7)
150 150 150 150 150 150 150 150 
##$DBP07= 0
##$DBPNAM0= <>
##$DBPNAM1= <>
##$DBPNAM2= <>
$$ [...]
##$SUBNAM7= <"">
##$SUBNAM8= <"">
##$SUBNAM9= <"">
##$SW= 20.6930455092707
##$SWIBOX= (0..15)
0 0 3 0 0 0 0 0 0 0 0 0 0 0 0 0 
##$SW_h= 5175.983436853
##$TD= 65536
##$TD0= 1
##$TE= 294.16
##$TE2= 300
##$TE3= 300
##$TEG= 300
##$TL= (0..7)
0 120 120 120 120 120 120 120 
##$TP= (0..7)
150 150 150 150 150 150 150 150 
##$TP07= 0
##$TPNAME0= <>
##$TPNAME1= <>
##$TPNAME2= <>
##$TPNAME3= <>
##$TPNAME4= <>
##$TPNAME5= <>
##$TPNAME6= <>
##$TPNAME7= <>
##$TPOAL= (0..7)
0.5 0.5 0.5 0.5 0.5 0.5 0.5 0.5 
##$TPOFFS= (0..7)
0 0 0 0 0 0 0 0 
##$TUNHIN= 0
##$TUNHOUT= 0
##$TUNXOUT= 0
##$USERA1= <user>
##$USERA2= <user>
##$USERA3= <user>
##$USERA4= <user>
##$USERA5= <user>
##$V9= 5
##$VALIST= <valist>
##$VCLIST= <CCCCCCCCCCCCCCC>
##$VD= 0
##$VDLIST= <DDDDDDDDDDDDDDD>
##$VPLIST= <PPPPPPPPPPPPPPP>
##$VTLIST= <TTTTTTTTTTTTTTT>
##$WBST= 1024
##$WBSW= 4
##$XGAIN= (0..3)
0 0 0 0 
##$XL= 0
##$YL= 0
##$YMAX_a= 644995
##$YMIN_a= -702227
##$ZGOPTNS= <>
##$ZL1= 120
##$ZL2= 120
##$ZL3= 120
##$ZL4= 120
##$ABSF1= 16.522
##$ABSF2= -4.171173
##$ABSG= 5
##$ABSL= 3
##$ALPHA= 0
##$AQORDER= 0
##$ASSFAC= 0
##$ASSFACI= 0
##$ASSFACX= 0
##$ASSWID= 0
##$AUNMP= <proc_1d>
##$AZFE= 0.1
##$AZFW= 0.1
##$BCFW= 0
##$BC_mod= 0
##$BYTORDP= 0
##$COROFFS= 0
##$CY= 12.5
##$DATMOD= 1
##$DC= 0
##$DFILT= <>
##$DTYPP= 0
##$F1P= 14.0000005364418
##$F2P= -0.99999901652339
##$FCOR= 0.5
##$FTSIZE= 32768
##$FT_mod= 6
##$GAMMA= 0
##$GB= 0
##$INTBC= 1
##$INTSCL= 1
##$ISEN= 128
##$LB= 0.3
##$LEV0= 0
##$LPBIN= 0
##$MAXI= 10000
##$MC2= 0
##$MEAN= 0
##$ME_mod= 0
##$MI= 0
##$NCOEF= 0
##$NC_proc= -2
##$NLEV= 6
##$NOISF1= 0
##$NOISF2= 0
##$NSP= 0
##$NTH_PI= 0
##$NZP= 0
##$OFFSET= 16.522
##$PC= 1
##$PHC0= -77.85202
##$PHC1= 5.344214
##$PH_mod= 1
##$PKNL= yes
##$PPARMOD= 0
##$PSCAL= 4
##$PSIGN= 0
##$REVERSE= no
##$SF= 250.13
##$SI= 32768
##$SIGF1= 0
##$SIGF2= 0
##$SINO= 400
##$SIOLD= 32768
##$SREGLST= <1H.CDCl3>
##$SSB= 0
##$STSI= 32768
##$STSR= 0
##$SW_p= 5175.98343685301
##$SYMM= 0
##$S_DEV= 0
##$TDeff= 65536
##$TDoff= 0
##$TI= <Analysis number 999999
Compound Code 99
Book Reference 9
Project Code 9>
##$TILT= no
##$TM1= 0
##$TM2= 0
##$TOPLEV= 0
##$USERP1= <user>
##$USERP2= <user>
##$USERP3= <user>
##$USERP4= <user>
##$USERP5= <user>
##$WDW= 1
##$XDIM= 32768
##$YMAX_p= 426828707
##$YMIN_p= -138645
$$ End of Bruker specific parameters
$$ ---------------------------------
##NTUPLES= NMR SPECTRUM
##VAR_NAME=  FREQUENCY,     SPECTRUM/REAL,   SPECTRUM/IMAG
##SYMBOL=    X,             R,               I
##VAR_TYPE=  INDEPENDENT,   DEPENDENT,       DEPENDENT
##VAR_FORM=  AFFN,          ASDF,            ASDF
##VAR_DIM=   32768,         32768,           32768
##UNITS=     HZ,            ARBITRARY UNITS, ARBITRARY UNITS
##FACTOR=    0.157963299565203, 1,           1
##FIRST=     4132.6476996994, 0,             0
##LAST=      -1043.33573715361, 0,           0
##MIN=       -1043.33573715361, -138645,     0
##MAX=       4132.6476996994, 426828707,     0
$$ Real data points
##PAGE= N=1
##DATA TABLE= (X++(R..R)), XYDATA
$$ [...]
$$ plain form
19887 -4777 -3783 -4381 -3556 2217 7086 8169 10102 9082 11099 9682 8654 11902 12448 8152 154 -1224
19871 -1224 1218 5322 4816 2044 2739 -756 1887 5306 9960 11570 9271 3980 5834 9044 3107
19856 3107 -1528 373 6067 5521 3526 -1391 -6013 -4708 -3836 -6957 -13695 -22882 -15190 -6547 -9094
19841 -9094 -11511 -12725 -11147 -7722 -8588 -13987 -16430 -9830 -10569 -5156 -2234 260 -5803 -3668 3935
19826 3935 -1012 -909 -1146 4305 7175 2963 -2382 1252 2362 -736 -4930 -9051 -8550 -6827 -6646 -6353
19810 -6353 -11324 -8418 -7089 -3042 2259 3380 -2688 -3831 -5520 -7568 -9290 -4167 933 4016 826
19795 826 -4950 -7615 -5957 -9991 -10552 -5114 -4343 -1932 1884 346 -1791 -2345 1098 1506 -5890 -5124
19779 -5124 -264 6729 3377 -5335 -3780 -2009 -5699 -4658 1902 3241 1982 4807 420 -2527 585
$$ packed form
19887d777R94n98Q25N773M869J083J933j020K017j417j028L248N46m296p998j378
19871a224K442M104n06k772O95l495K643L419M654J610k299n291J854L210n937
19856C107m635J901N694n46j995m917m622J305Q72l121o738r187P692Q643k547
19841i094k417j214J578L425q66n399k443O600p39N413K922K494o063K135P603
19826C935m947J03k37N451K870m212n345L634J110l098m194m121N01J723J81K93
19810f353m971K906J329M047N301J121o068j143j689k048j722N123N100L083l190
19795H26n776k665J658m034n61N438P71K411L816j538k137n54L443M08p396P66
19779e124M860O993l352q712J555J771l690J041O560J339j259K825m387k947L112
$$ plain form
19764 585 5360 9197 6126 1455 7893 9013 7565 3184 -489 -6153 -8650 -10562 -16233 -14584 -9473
19749 -9473 -4227 -813 -3955 -5843 -626 1894 7273 9218 4344 -938 -10090 -10215 -8852 -12813 -16586
19734 -16586 -14569 -17002 -12353 -5202 -5304 -7209 -7775 -3343 -1648 2931 4883 1169 -1879 -5556 -7017
19719 -7017 -6839 -11365 -13648 -8084 -6063 -9524 -8765 -2975 5853 -1077 -5754 -588 903 5315 6141
19704 6141 -3802 -13922 -15306 -16932 -13760 -9485 -9628 -6544 -4613 -947 3442 -2540 -687 -449 -3474
19689 -3474 -3391 -2978 -3198 -5680 593 6469 3364 -6531 -10326 -5050 1873 -2981 -7124 -5011 -732 -1027
19673 -1027 48 399 -883 -3152 -8387 -4812 -432 3291 5942 3859 -5829 -13017 -3804 -1630 -2730
19658 -2730 2522 2973 -3683 -11202 -7036 -4366 -7039 -2253 737 658 -971 1364 4274 3861 2471 1943
$$ packed form
19764E85M775L837l071m671O438J120j448m381l673n664k497j912n671J649N111
19749i473N246L414l142j888N217K520N379J945m874n282r152j25J363l961l773
19734a6586K017k433M649P151j02j905n66M432J695M579J952l714l048l677j461
19719g017J78m526k283N564K021l461P59N790Q828o930m677N166J491M412Q26
19704F141r943j0120j384j626L172M275j43L084J931L666M389n982J853K38l025
19689c474Q3M13k20k482O273N876l105r895l795N276O923m854m143K113M279k95
19673a027J075L51j282k269n235L575M380L723K651k083r688p188R213K174j100
19658b730N252M51o656p519M166K670k673M786K990p9j629K335K910m13j390n28
$$ plain form
19642 1943 -4358 -9765 -11051 -6940 -6002 -7832 -8484 -7836 -9073 -8808 -1328 3871 289 -8037 -4668 -5467
19626 -5467 -1777 4770 2726 -2704 -2558 3095 1746 -884 -4477 -3294 3031 6690 5877 1505 2126
19611 2126 2583 -104 2632 9326 8260 6691 7398 5334 5002 6155 -1651 -11097 117 6292 -1483
19596 -1483 -6234 -5583 1929 5891 8306 9088 11210 8917 -4463 -6326 -1907 3852 -98 1798 2119
19581 2119 -3347 958 2685 -355 -4275 -5293 -3088 -2627 1318 1941 517 -8027 -8738 -9004 -5518 1706
19565 1706 3307 13 1477 275 -375 168 -1644 -2422 -1255 -4483 -8439 -2747 -5653 -5206 -3909 -2459
19549 -2459 -9561 -5497 -1387 -1530 -2654 -4032 -8207 -9801 -7513 -9180 -5474 -1285 -4945 -8032 -6994
19534 -6994 -6384 -4121 -5123 -3329 1484 1707 4611 4536 2595 -2586 2860 4790 3434 1989 -2859 -5203
$$ packed form
19642A943o301n407j286M111R38j830o52O48j237K65P480N199l582q326L369p99
19626e467L690O547k044n430J46N653j349k630l593J183O325L659q13m372O21
19611B126M57k687K736O694j066j569P07k064l32J153p806r446J1214O175p775
19596a483m751O51P512L962K415P82K122k293j3380j863M419N759l950J896L21
19581B119n466M305J727l040l920j018K205M61L945O23j424q544p11k66L486P224
19565A706J601l294J464j202o50N43j812p78J167l228l956N692k906M47J297J450
19549b459p102M064M110j43j124j378m175j594K288j667L706M189l660l087J038
19534f994O10K263j002J794M813K23K904p5j941n181N446J930j356j445m848k344
$$ plain form
19518 -5203 -602 793 6663 7659 5686 7106 10584 8400 2802 200 -42 -6815 -4516 -4624 -5339 1126
19502 1126 1873 -3344 2370 4595 4442 1695 -3061 -2357 -8509 -13109 -12015 -5744 -10087 -12067 -12154 -14326
19486 -14326 -11337 -7914 -2819 -1425 619 1697 -4046 -7530 -9632 -8939 -10240 -10921 -4806 -4115 -4086 -5181
19470 -5181 -1011 2762 868 -1212 -3693 -4839 -2866 -3261 -6587 -1293 -2476 -2836 8290 4494 -41
19455 -41 -3124 1881 6929 11264 9766 4891 3908 3319 933 190 -9418 -10220 -10941 -1306 4023 -1636
19439 -1636 -6634 -12414 -12320 -9102 -3232 -137 3976 5022 967 -125 3034 132 -341 -7971 -2751
19424 -2751 4176 5151 544 -1006 -6363 -1647 -380 -1175 3541 2498 -4902 -4879 -9165 -17252 -17253 -14328
19408 -14328 -11151 -7672 -2304 -5575 -7620 -299 5082 5593 4397 8280 10918 8205 4081 -1727 -6906
$$ packed form
19518e203M601J395N870R96j973J420L478k184n598k602k42o773K299j08p15O465
19502A126P47n217N714K225j53k747m756P04o152m600J094O271m343j980q7k172
19486a4326K989L423N095J394K044J078n743l484k102O93j301o81O115O91K9j095
19470e181M170L773j894k080k481j146J973l95l326N294j183l60J1126l796m535
19455d1l083N005N048M335j498m875r83n89k386p43r608q02p21R635N329n659
19439a636m998n780R4L218N870L095M113J046m055j092L159k902m73p630N220
19424b751O927R75m607j550n357M716J267p95M716j043p400K3m286q087jK925
19408a4328L177L479N368l271k045P321N381N11j196L883K638k713m124n808n179
$$ plain form
19393 -6906 -9456 -2884 3841 4059 2826 1760 -1092 -4226 -9917 -9679 -3827 549 -1633 -3435 -8530
19378 -8530 -13078 -8769 -6449 -7187 -6012 53 1330 1089 -8280 -10037 -8732 -8030 -14666 -17248 -9502
19363 -9502 -7945 -13732 -10212 -6580 -7127 -4176 -4323 -14330 -11623 -9562 -4769 -3173 -4182 -5826 -3851
19348 -3851 -9948 -4506 -3538 -949 308 -2222 130 -2280 1946 7955 9740 9996 4619 865 4090
19333 4090 5796 -1695 -5350 -63 -95 -2071 -2350 -4888 -7085 -7100 -6928 -6790 -4193 -5044 -4599 -5221 -3461
19316 -3461 -7060 -12801 -12441 -5792 -2478 31 220 -611 -1560 759 -4648 -7262 -2167 343 -6199 -6135
19300 -6135 -5394 -2735 -1243 4815 6709 -2175 3019 3297 -3118 -3202 -5665 -10012 -13729 -16508 -10057 -2253
19284 -2253 -4974 -7935 -6648 -8301 -11082 -10166 -8398 -7143 -13018 -8918 4060 2054 -7613 -9842 -12260
$$ packed form
19393f906k550O572O725K18j233j066k852l134n691K38N852M376k182j802n095
19378h530m548M309K320p38J175O065J277k41r369j757J305P02o636k582P746
19363i502J557n787L520L632n47K951j47j0007K707K061M793J596j009j644J975
19348c851o097N442R68K589J257k530K352k410M226O009J785K56n377l754L225
19333D090J706p491l655N287l2j976k79k538k197j5J72J38K597q51M45o22J760
19316c461l599n741L60O649L314K509J89q31r49K319n407k614N095K510o542O4
19300f135P41K659J492O058J894q884N194K78o415q4k463m347l717k779O451P804
19284b253k721k961J287j653k781R16J768J255n875M100J2978k006r667k229k418
$$ plain form
19269 -12260 -10735 -4687 -3044 -9085 -13419 -9491 -6098 -11963 -12738 -5512 -5300 -6842 -7602 -11906 -10326
19254 -10326 -3928 2432 -4212 -9198 -15814 -15935 -12704 -9721 -11345 -13468 -6606 1244 6662 9073 7951
19239 7951 10348 12981 5835 8116 8989 1899 -3482 -4133 -3378 -1425 -873 -3978 -763 4253 -7408
19224 -7408 -6711 -5901 -5243 -5040 -1268 2403 4959 2334 4716 6215 5893 10007 9641 -442 -8624 -6155
19208 -6155 928 3453 2222 -3204 -4956 -4188 -3996 831 1647 3389 -544 -8755 -4502 -3490 -5437
19193 -5437 -6065 -4559 -1764 -3404 1611 4829 455 5315 10857 13030 10962 2312 25 5169 635
19178 635 -3021 -1734 -5466 -6334 -4537 1641 -794 -299 524 3480 255 -4621 -3562 -6616 -8459 -5948
19162 -5948 -496 -4304 -1619 2297 4160 1984 2145 6485 2661 -2556 -4642 -10028 -12207 -10684 -8169
$$ packed form
19269a2260J525O048J643o041m334L928L393n865p75P226K12j542p60m304J580
19254a0326O398O360o644m986o616j21L231K983j624k123O862P850N418K411j122
19239G951K397K633p146K281Q73p090n381o51P55J953N52l105L215N016j1661
19224g408O97Q10O58K03L772L671K556k625K382J499l22M114l66j0083q182K469
19208f155P083K525j231n426j752P68J92M827Q16J742l933q211M253J012j947
19193e437o28J506K795j640N015L218m374M860N542K173k068q650k287N144m534
19178F35l656J287l732q68J797O178k435M95Q23K956l225m876J059l054j843K511
19162e948N452l808K685L916J863k176J61M340l824n217k086n386k179J523K515
$$ plain form
19147 -8169 -12329 -10631 -9812 -3879 3022 244 789 621 2545 -1995 -1824 -1106 -548 4019 707 -7888
19131 -7888 -6958 823 3576 -1031 -2884 -4852 -10014 -10221 -12880 -11237 -7656 -6119 -5737 -5160 -9094 -9258
19115 -9258 -6326 146 -6030 -12712 -12107 -3184 -718 1815 9553 6886 5409 3078 3406 1255 -2097
19100 -2097 -113 746 2529 1337 -3313 -2884 -1834 -8959 -16713 -13298 -8620 -6084 5473 9457 6857
19085 6857 -5612 -5108 780 324 -7148 -9979 -7314 -14474 -25824 -24036 -22806 -18770 -14377 -12113 -8016
19070 -8016 -97 257 -7100 -5231 -1339 -2464 -5698 3279 5535 729 205 1424 450 -6104 -10251
19055 -10251 -9371 -14342 -17871 -17791 -10556 -12718 -10074 -8149 -6157 -6275 -7172 -9824 -9445 -6213 -8641 -4511
19039 -4511 -734 -2031 -12020 -15423 -17698 -14247 -9534 -2193 4277 4942 3681 2218 -6834 -6656 -2372
$$ packed form
19147h169m160J698Q19N933O901k778N45j68J924m540J71P18N58M567l312q595
19131g888R30P781K753m607j853j968n162k07k659J643L581J537L82N77l934j64
19115i258K932O472o176o682O05Q923K466K533P738k667j477k331L28k151l352
19100b097J984Q59J783j192m650M29J050p125p754L415M678K536J1557L984k600
19085F857j2469N04N888m56p472k831K665p160j1350J788J230M036M393K264M097
19070h016P919L54p357J869L892j125l234Q977K256m806n24J219r74o554m147
19055a0251Q80m971l529Q0P235k162K644J925J992j18q97k652L79L232k428M130
19039d511L777j297r989l403k275L451M713P341O470O65j261j463r052J78M284
$$ plain form
19024 -2372 4836 -21 -5129 -1943 1178 2395 -2988 -8538 -3925 1193 -289 -3175 -4775 -1162 6015
19009 6015 2214 2334 5107 426 -1048 -3105 -6090 -7592 2131 6661 2218 -3499 -308 -1757 -4842
18994 -4842 -9678 -7443 -1318 318 -139 2533 -2095 1733 -1918 316 4688 11978 10163 5351 2016
18979 2016 -2366 -6922 -11360 -10363 3492 4861 7386 1886 -1977 -4107 -8953 -9099 -10164 -6530 -11492
18964 -11492 -7691 -4 1440 3462 3355 3619 1825 -3198 -2227 -9491 -7614 -2795 -3077 -1286 -354 -4602
18948 -4602 -1584 1671 5362 -5055 -6592 -4246 388 3175 7735 3592 4879 1725 -1548 -2953
18934 -2953 -2297 849 2360 -3561 -7953 -1094 2589 6248 7408 7242 6272 6018 -3026 -10443 -11578 -7667
18918 -7667 -212 6130 7203 2788 23 -2767 -70 -125 -2009 -3949 333 4465 227 -165 -2910
$$ packed form
19024b372P208m857n108L186L121J217n383n550M613N118j482k886j600L613P177
19009F015l801J20K773m681j474k057k985j502R723M530m443n717L191j449l085
18994d842m836K235O125J636m57K672m628L828l651K234M372P290j815m812l335
18979B016m382m556m438R97J3855J369K525n500l863k130m846j46j065L634m962
18964a1492L801P687J444K022j07K64j794n023R71p264J877M819k82J791R32m248
18948d602L018L255L691j0417j537K346M634K787M560m143J287l154l273j405
18934b953O56L146J511n921m392O859L683L659J160j66r70k54r044p417j135L911
18918g667P455O342J073m415k765k790K697n5j884j940M282M132m238l92k745
$$ plain form
18903 -2910 -4936 1286 5578 5283 2120 368 1960 -748 -3311 -5749 -2395 -501 695 1284 -2776
18888 -2776 -4072 -651 1649 852 1025 5615 4371 -2674 2001 3157 5796 8623 9344 3580 -622
18873 -622 1687 -2042 -2101 2914 -5229 -9406 -11313 -9888 -4273 3337 -11 -3281 1014 5302 5851 6927
18857 6927 9004 2220 -9406 -11741 -11647 -12268 -10877 -7447 -12055 -14536 -15857 -8724 -2678 4375 7315
18842 7315 6155 9363 3581 -7696 -10273 -4852 -4293 -1281 -877 5558 10706 11132 7801 4910 -317
18827 -317 -1410 148 -825 -2493 -1758 6522 9047 4186 -1226 994 -253 1423 -544 -2322 -3225 -3589
18811 -3589 -6268 -4104 4626 4287 9080 3633 1541 2254 374 -3188 -7788 -5937 -4980 -8380 -7486 -8709
18795 -8709 -6810 -10277 -10775 -10081 -14591 -13988 -11132 -15068 -9913 -5328 -8577 -9869 -11731 -15320 -10236
$$ packed form
18903b910k026O222M292k95l163j752J592k708k563k438L354J894J196N89m060
18888b776j296L421K300p97J73M590j244p045M675J156K639K827P21n764m202
18873f22K309l729n9N015q143m177j907J425N615P610l348l270M295M288N49J076
18857F927K077o784j1626k335R4o21J391L430m608k481j321P133O046P053K940
18842G315j160L208n782j1277k577N421N59L012M04O435N148M26l331k891n227
18827c17j093J558r73j668P35Q280K525m861n412K220j247J676j967j778r03l64
18811c589k679K164Q730l39M793n447k092P13j880l562m600J851R57l400Q94j223
18795h709J899l467m98O94m510O03K856l936N155M585l249j292j862l589N084
$$ plain form
18780 -10236 2902 3185 1336 -4858 -10044 -10395 -4964 -1711 1478 3081 11952 21569 31762 43865
18766 43865 49760 45755 30737 15976 9329 5449 1978 5055 -2739 -4253 4177 2761 -4425 -6970
18752 -6970 -5613 2716 4244 1629 -1051 -1040 -2844 -702 5762 8855 8445 3544 6045 4750 3714
18737 3714 1873 4164 32 -2049 2733 4202 -980 4658 8046 7584 11235 14209 4083 -2183 -3746
18722 -3746 106 2056 2327 -1055 349 4881 5763 1111 5271 -316 -6316 -7305 -7461 -3630 -1773 -7613
18706 -7613 -14545 -10646 -6333 -2318 -2092 -2845 -5901 -5387 1900 5057 -3 -4792 -3140 825 3167
18691 3167 -511 -6332 -4295 264 -488 -7545 -13570 -18356 -17202 -10182 -6470 -6565 -4850 -6172 -3766
18676 -3766 -6325 -5011 -5185 -7416 -5966 -11936 -15604 -15639 -6602 934 -181 -1819 1712 4837 5674 4936
$$ packed form
18780a0236J3138K83j849o194n186l51N431L253L189J603Q871R617J0193J2103
18766D3865N895m005j5018j4761o647l880l471L077p794j514Q430j416p186k545
18752f970J357Q329J528k615k680J1j804K142O464L093m10m901K501j295j036
18737C714j841K291m132k081M782J469n182N638L388m62L651K974j0126o266j563
18722c746L852J950K71l382J404M532Q82m652M160n587o000r89j56L831J857n840
18706g613o932L899M313M015K26p53l056N14P287L157n060m789J652L965K342
18691C167l678n821K037M559p52p057o025m786J154P020L712r5J715j322K406
18676c766k559J314j74k231J450n970l668l5R037P536j115j638L531L125Q37p38
$$ plain form
18660 4936 -1201 -6154 -8624 -4889 -3269 429 6114 6895 -2638 -3322 -3053 -6878 -2336 -691 6109
18645 6109 1833 -1166 -470 3572 7987 9440 3950 846 -6815 -7102 -1313 80 4665 4513 -2028
18630 -2028 -1859 -1776 -5158 -7998 -471 2225 1825 -1416 -5020 -3714 -2167 401 2299 -1834 365 -772
18614 -772 -3057 992 10482 12188 2662 -1035 -2840 -1143 1585 -2370 2166 3542 -1961 -4824 -3140
18599 -3140 3929 2612 4252 3947 130 1178 1639 2143 3313 -5389 -4856 -3760 -2545 -2739 -6732 -8040
18583 -8040 -3915 -3219 -3114 -1031 1473 250 360 12153 20259 23683 13342 5481 -3081 2167 7309
18568 7309 8892 12629 9599 9592 7165 -2810 -9907 -6190 1073 5447 651 -5155 -278 7592 7412 989
18552 989 -994 -4834 493 618 1772 5127 8809 -2297 -3016 4426 5530 6688 13718 10856 4765
$$ packed form
18660D936o137m953k470L735J620L698N685P81r533o84K69l825M542J645O800
18645F109m276k999O96M042M415J453n490l104p661k87N789J393M585j52o541
18630b028J69Q3l382k840P527K696m00l241l604J306J547K568J898m133K199j137
18614g72k285M049R490J706r526l697j805J697K728l955M536J376n503k863J684
18599c140P069j317J640l05l817J048M61N04J170q702N33J096J215j94l993j308
18583h040M125O96J05K083K504j223J10J1793Q106L424j0341p861q562N248N142
18568G309J583L737l030pk427r975p097L717P263M374m796n806M877P870j80o423
18552I89j983l840N327J25J154L355L682j1106p19P442J104J158P030k862o091
$$ plain form
18537 4765 3838 7142 11700 13295 11079 10285 2161 -8344 -3648 -2454 4064 6135 3731 1737 2691
18522 2691 3590 2558 -6963 -8719 -9813 -9375 -9089 -7553 -3644 -4431 -3365 -1962 -1999 -1010 -825 -3446 -3494
18505 -3494 -5318 217 4367 3159 -576 -3540 -2274 1578 -5349 -6264 -1190 3355 832 2589 2755
18490 2755 1208 837 -1365 -5524 -154 3366 746 766 9206 2305 -2872 602 -3687 860 -1431
18475 -1431 -4261 -7864 -9805 -5851 -7907 -5999 -4230 -1661 -1035 1011 2089 2825 8904 6112 -2342
18460 -2342 388 -2167 -2853 1862 4059 -5710 -10154 -7610 -4898 -1489 -3370 -11770 -17076 -12060 -8662
18445 -8662 -3460 -4850 -6198 -5853 -1490 2117 2040 -5893 -9677 1471 4653 6858 5803 5467 -558
18430 -558 103 5305 4037 8229 14514 15413 11919 2008 -990 -4251 -9562 -9471 -1738 367 1271 8657
$$ packed form
18537D765r27L304M558J595k216p94q124j0505M696J194O518K071k404j994R54
18522B691Q99j032r521j756j094M38K86J536L909p87J066J403l7R89J85k621m8
18505c494j824N535M150j208l735k964J266L852o927r15N074M545k523J757J66
18490B755j547l71k202m159N370L520k620K0Q440o901n177L474m289M547k291
18475a431k830l603j941L954k056J908J769K569O26K046J078P36O079k792q454
18460b342K730k555o86M715K197r769m444K544K712L409j881q400n306N016L398
18445h662N202j390j348L45M363L607p7p933l784J1148L182K205j055l36o025
18430e58O61N202j268M192O285Q99l494r911k998l261n311R1P733K105R04P386
$$ plain form
18414 8657 9044 8244 12987 13791 18063 13079 6660 4372 4515 -1428 1294 3576 4063 8421 7069 1071
18398 1071 1571 6058 6725 3964 2682 4676 6203 5743 6286 2751 3933 4835 1402 -4013 -3279 -2845
18382 -2845 -873 -3204 -9059 -7141 704 -362 779 -1343 -6510 -3035 1362 -3028 -6005 -2742 6445
18367 6445 8221 -1963 -537 -3829 1331 9298 7379 2311 5555 7666 3781 -1622 -5387 -2342
18353 -2342 -216 1865 482 -1678 -1358 3313 4489 5306 432 -7837 -7233 -10418 -5579 5967 16475
18338 16475 19791 15024 9591 1916 349 4974 9040 12987 17563 12631 12287 5616 3226 2800 884
18323 884 525 2655 483 -3435 -8018 -7457 -3210 2291 -844 -6736 -9908 -5950 -9858 -7570 -3859
18308 -3859 -1554 -8023 -10113 -5220 -3402 -2144 5134 9438 5738 10522 12205 13085 7517 737 1369
$$ packed form
18414H657L87q00M743Q04M272m984o419k288J43n943K722K282M87M358j352n998
18398A071N00M487O67k761j282J994J527m60N43l535J182R02l433n415P34M34
18382b845J972k331n855J918P845j066J141k122n167L475M397m390k977L263R187
18367F445J776j0184J426l292N160P967j919n068L244K111l885n403l765L045
18353b342K126K081j383k160L20M671J176Q17m874q269O04l185M839J1546J0508
18338A6475L316m767n433p675j567M625M066L947M576m932l44o671k390m26j916
18323H84l59K130k172l918m583N61M247N501l135n892l172L958l908K288L711
18308c859K305o469k090M893J818J258P278M304l700M784J683Q80n568o780O32
$$ plain form
18293 1369 4419 7507 6908 10403 14430 14523 10495 6366 3008 1559 7976 6702 1579 -1071 3935
18278 3935 1787 322 -845 -1964 -794 -349 2625 5734 4641 742 -8274 -8204 -12194 -10026 -4869
18263 -4869 -7462 -1798 4809 11156 11575 13330 12520 10309 12724 13984 12052 12490 12001 13763 17245 15455
18247 15455 14778 16370 12260 7934 4428 963 -1278 6649 2667 6236 6918 4628 5265 5169 16174
18232 16174 20366 21656 11069 4863 7648 7174 11438 16249 14844 13078 6620 -2117 -1922 3629 4488
18217 4488 8611 7154 9556 13978 13243 15611 10258 3480 -954 1239 3948 9607 12487 9728 11751
18202 11751 11060 8025 5874 -6816 -9202 -8771 -6746 3358 9595 9192 8465 16408 16566 10808 6343
18187 6343 3954 10290 14157 5752 6979 14491 13350 15663 11025 10359 10424 7267 4814 8845 13726
$$ packed form
18293A369L050L088n99L495M027R3m028m129l358j449O417j274n123k650N006
18278C935k148j465j167j119J170M45K974L109j093l899r016P0l990K168N157
18263d869k593N664O607O347M19J755q10k211K415J260j932M38m89J762L482j790
18247A5455o77J592m110m326l506l465k241P927l982L569O82k290O37r6J1005
18232A6174M192J290j0587o206K785m74M264M811j405j766o458q737J95N551Q59
18217D488M123j457K402M422p35K368n353o778m434K193K709N659K880k759K023
18202A1751o91l035k151j2690k386M31K025J0104O237m03p27P943J58n758m465
18187F343k389O336L867q405J227P512j141K313m638o66O5l157k453M031M881
$$ plain form
18172 13726 7135 4026 7996 9336 11294 16832 18390 11979 14111 18047 18918 18550 23191 29071 35556
18157 35556 37771 37732 39026 38021 37370 27910 29358 35939 35402 45442 49961 46789 45336 48427 54855
18142 54855 65060 69969 70227 70606 67987 68983 75338 83888 89007 101962 114556 123178 133262 142573
18128 142573 160712 183826 213150 252661 290494 332181 376320 413273 457921 501529 553215
18117 553215 632641 730172 869984 1088936 1405907 1906206 2742579 4181825 6502385 9217689
18107 9217689 11070882 11724997 9388979 5973392 3713775 2481206 1786218 1386096 1166135
18098 1166135 1065056 1026049 982280 873365 731090 649864 630660 657374 690176 664195 559567
18087 559567 450584 376705 343755 323934 304202 268200 212303 161855 133224 113273 95427
$$ packed form
18172A3726o591l109L970J340J958N538J558o411K132L936Q71l68M641N880O485
18157C5556K215l9J294j005o51r460J448O581n37J0040M519l172j453L091O428
18142E4855J0205M909K58L79k619R96O355Q550N119J2955J2594Q622J0084R311
18128A42573J8139K3114K9324L9511L7833M1687M4139L6953M4648M3608N1686
18117E53215P9426R7531J39812K18952L16971N00299Q36373J439246K320560K715304
18107I217689J853193O54115k336018l415587k259617j232569o94988m00122k19961
18098A166135j01079l9007m3769j08915j42275q1226j9204K6714L2802k5981j04628
18087E59567j08983p3879l2950j9821j9732l6002n5897n0448k8631j9951j7846
$$ plain form
18076 95427 85738 76266 68194 62776 59066 55150 53591 47420 46151 37784 33672 32130 34897 35620 31122
18061 31122 25974 26450 23938 19604 26342 36144 35966 30384 22649 27413 35120 29194 18414 11513 13825
18046 13825 21792 20590 16427 14396 11519 9651 10558 14685 16079 13138 13919 10178 12442 13905 15683
18031 15683 19486 22624 25665 21362 12498 4983 5284 5886 12054 11562 8007 11186 16670 14029 17384
18016 17384 19294 9681 5636 12040 20971 24483 22984 18162 17239 26344 27428 22979 17257 18725 12882
18001 12882 14463 15937 11119 10293 7538 5906 10421 11538 12073 15958 13917 12108 10231 10530 15648
17986 15648 18620 19879 15781 15852 11478 8801 4540 5511 11545 12341 19651 21084 17056 21084 20286 16040
17970 16040 12426 15019 21128 23053 20583 22141 22703 18127 17850 12281 9252 6403 12514 17277 22276
$$ packed form
18076I5427r689r472q072n418l710l916j559o171j269q367m112j542K767P23m498
18061C1122n148M76k512m334O738R802j78n582p735M764P707n926j0780o901K312
18046A3825P967j202m163k031k877j868R07M127J394k941P81l741K264J463J778
18031A5683L803L138L041m303q864p515L01O02O168m92l555L179N484k641L355
18016A7384J910r613m045O404Q931L512j499m822r23R105J084m449n722J468n843
18001A2882J581J474m818q26k755j632M515J117N35L885k041j809j877K99N118
17986A5648K972J259m098P1m374k677m261R71O034P96P310J433m028M028p98m246
17970A6040l614K593O109J925k470J558N62m576k77n569l029k849O111M763M999
$$ plain form
17955 22276 29588 25175 14913 7121 5283 4630 10897 12765 8104 3801 7152 10442 14859 17187
17941 17187 16697 4359 3980 1675 -2147 -1190 3489 4840 3879 5304 -340 -1800 -872 -428 2881 8110
17925 8110 11160 17271 13715 9483 2900 2982 4704 11803 7190 5474 393 1445 -755 -2697 4782
17910 4782 3403 5276 6622 3618 -318 -3988 -5811 -3410 2578 11451 14026 12793 6819 1896 6017
17895 6017 2830 3774 6422 12045 15200 16585 14302 7427 8917 14106 14781 9232 10014 13441 10075
17880 10075 8203 688 1432 8337 15871 16926 15544 15748 15952 12166 14785 17968 16059 10886 5217
17865 5217 1728 11610 12797 5762 8005 10335 14141 21242 20608 17288 20585 20409 17686 15736 13496
17850 13496 7612 11017 17468 22171 17263 12924 14508 18482 24403 23487 16283 19116 18967 18065 18296
$$ packed form
17955B2276P312m413j0262p792j838o53O267J868m661m303L351L290M417K328
17941A7187m90j2338l79k305l822R57M679J351r61J425n644j460R28M44L309N229
17925H110L050O111l556m232o583Q2J722P099m613j716n081J052k200j942P479
17910D782j379J873J346l004l936l670j823K401N988Q873K575j233n974m923M121
17895F017l187R44K648N623L155J385k283o875J490N189O75n549P82L427l366
17880A0075j872p515P44O905P534J055j382K04K04l786K619L183j909n173n669
17865E217l489R882J187p035K243K330L806P101o34l320L297j76k723j950k240
17850A3496n884L405O451M703m908m339J584L974N921r16p204K833j49r02K31
$$ plain form
17835 18296 16260 19650 21133 15110 14167 18776 14407 17942 25817 20985 21524 22465 17302 13839 12833
17820 12833 17219 18400 19498 12218 7051 7881 18236 23493 21297 18946 17589 8296 6694 7163 9015
17805 9015 7765 8389 8009 3854 1961 601 3391 5301 3660 4308 2880 3173 9503 13204 15166 18323
17789 18323 21983 18981 13889 11222 13534 19310 21285 18713 19784 22245 26315 24826 20316 24401
17775 24401 32157 39031 41182 40454 40760 40817 35691 40266 39291 45196 49659 50908 53774 68475 76660
17760 76660 70050 73529 84571 83529 85406 84193 78165 85871 85369 88075 82793 78688 74889 67278
17746 67278 56969 62247 65040 65051 57321 55113 58605 51141 42976 41042 39086 39617 40421 46146 40934
17731 40934 39117 44186 51878 49953 48991 52673 54060 52389 55428 50268 38067 37875 42342 42161 34332
$$ packed form
17835A8296k036L390J483o023r43M609m369L535P875m832N39R41n163l463j006
17820A2833M386J181J098p280n167Q30J0355N257k196k351j357r293j602M69J852
17805I015j250O24l80m155j893j360K790J910j641O48j428K93O330L701J962L157
17789A8323L660l002n092k667K312N776J975k572J071K461M070j489m510M085
17775B4401P756O874K151p28L06N7n126M575r75N905M463J249K866J4701Q185
17760G6660o610L479J1042j042J877j213o028P706n02K706n282m105l799p611
17746F7278j0309N278K793J1p730k208L492p464q165j934j956N31Q04N725n212
17731D0934j817N069P692j925r62L682J387j671L039n160j2201j92M467j81p829
$$ plain form
17716 34332 25906 26658 31881 33238 38154 46299 44148 34125 32446 29806 29367 29714 35098 44071 45499
17701 45499 42127 41788 39212 32644 29970 41453 47486 43400 38450 40415 36344 38191 45135 37451
17687 37451 28691 27352 26692 22454 24569 30502 22354 19890 17561 15661 12945 11459 9686 7597 12169
17672 12169 23139 24059 20314 20806 22433 31765 32491 27972 24378 20095 20021 27203 38039 45017 43066
17657 43066 31512 28499 35942 42249 53884 57934 53748 43105 44274 46415 55002 53984 50990 47377
17643 47377 52202 56471 65534 77543 93477 104910 115279 125830 137716 153904 158446 171529
17631 171529 194529 198206 200326 190712 182726 181171 192596 195058 195783 176892 145580 134173 124776
17618 124776 115125 112629 108665 90812 80233 76237 72730 74937 77289 80811 78432 73912 67977 70173
$$ packed form
17716C4332q426P52N223J357M916Q145k151j0023j679k640m39L47N384Q973J428
17701D5499l372l39k576o568k674J1483O033m086m950J965m071J847O944p684
17687C7451q760j339o60m238K115N933q148k464k329j900k716j486j773k089M572
17672A2169J0970R20l745M92J627R332P26m519l594m283p4P182J0836O978j951
17657D3066j1554l013P443O307J1635M050m186j0643J169K141Q587j018k994l613
17643D7377M825M269R063J2009J5934J1433J0369J0551J1886J6188M542J3083
17631A71529K3000L677K120r614p986j555J1425K462P25j8891l1312j1407r397
17618A24776r651k496l964j7853j0579l996l507K207K352L522k379m520n935K196
$$ plain form
17604 70173 74116 78993 84639 86421 92865 98096 99783 105934 116510 116352 113087 112377 115909 120270 122756
17589 122756 122524 127615 124920 122681 128502 140626 151809 150065 153617 160811 167215 172355 181559 180041
17575 180041 186759 191244 187027 184395 194981 207169 208587 207208 212202 217750 218647 235638 250184
17562 250184 264470 281213 291645 314305 338255 357791 374070 397648 424705 453378 477885
17551 477885 504763 537055 565491 596162 634959 672599 705722 741317 786627 839907 901760
17540 901760 980929 1072150 1160843 1257073 1377461 1512781 1656888 1802441 1989099 2238714
17530 2238714 2564216 2943661 3306784 3581167 3855056 4236912 4782109 5486312 6279990
17521 6279990 7057963 7823225 8793786 10192515 12225669 15172349 19463320 25722866 33923946
$$ packed form
17604G0173L943M877N646J782O444N231J687O151J0576j58l265p10L532M361K486
17589A22756k32N091k695k239N821J2124J1183j744L552P194O404N140R204j518
17575A80041O718M485m217k632J0586J2188J418j379M994N548Q97J6991J4546
17562B50184J4286J6743J0432K2660K3950J9536J6279K3578K7057K8673K4507
17551D77885K6878L2292K8436L0671L8797L7640L3123L5595M5310N3280O1853
17540I01760P9169R1221Q8693R6230J20388J35320J44107J45553J86658K49615
17530B238714L25502L79445L63123K74383K73889L81856N45197P04203P93678
17521F279990P77973P65262R70561J398729K033154K946680M290971O259546Q201080
$$ plain form
17512 33923946 41926145 46595536 47298983 49156208 57052611 72850013 92236034 104326894
17504 104326894 99558492 83838849 74120989 76190931 88218830 100383452 100616922 83332354
17496 83332354 62592578 49334715 44036668 43140349 41656126 35893313 26920676 19139242
17488 19139242 13893082 10613677 8470838 6944546 5795873 4970726 4427626 4078200
17480 4078200 3783949 3442136 3087034 2757123 2531729 2398068 2282418 2098351 1844842
17471 1844842 1620576 1448702 1325559 1227722 1125613 1007809 893644 807276 745471 693601
17461 693601 652037 613249 572553 536315 513519 505306 493307 471118 449271 434673 417460 408168
17449 408168 392279 381888 373212 367101 358055 354272 357621 364340 371019 373139 375674 367176 341945
$$ packed form
17512C3923946Q002199M669391P03447J857225P896403J5797402J9386021J2090860
17504A04326894m768402j5719643r717860K069942J2027899J2164622K33470j7284568
17496H3332354k0739776j3257863n298047q96319j484223n762813q972637p781434
17488A9139242n246160l279405k142839j526292j148673q25147n43100l49426
17480D078200k94251l41813l55102l29911k25394j33661j15650j84067k53509
17471A844842k24266j71874j23143r7837j02109j17804j14165q6368o1805n1870
17461F93601m1564l8788m0696l6238k2796q213j1999k2189k1847j4598j7213r292
17449D08168j5889j0391q676o111r046l783L349O719O679K120K535q498k5231
$$ plain form
17436 341945 313614 291056 282292 273316 275874 280168 271368 266035 266123 264905 266954 276987 286433 310193
17422 310193 325336 322408 313278 295767 283902 282879 290735 301770 295764 275811 250120 231748
17410 231748 225862 214878 199444 186449 174298 164593 157801 156169 153214 149405 152744 154830 147778
17397 147778 146331 147826 143891 145956 149649 145335 133012 130072 126327 125060 120061 112850 101243 98982
17383 98982 95774 92082 81461 66388 46808 25644 23721 36303 49587 49347 39110 19910 15881
17370 15881 37001 64909 84685 85034 73706 69872 74961 86935 101368 103159 98048 83220 66677
17357 66677 64735 63268 61802 56959 53442 46592 39534 41568 46780 46157 49456 45517 39205 37145 35153
17342 35153 44347 53048 59137 62606 60108 59026 55006 50241 53276 49434 43217 45206 40092 40442 44657
$$ packed form
17436C41945k8331k2558q764q976K558M294q800n333Q8j218K049J0033R446K3760
17422C10193J5143k928r130j7511j1865j023P856J1035o006j9953k5691j8372
17410B31748n886j0984j5434j2995j2151r705o792j632k955l809L339K086p052
17397A47778j447J495l935K065L693m314j2323k940l745j267m999p211j1607k261
17383I8982l208l692j0621j5073j9580k1164j923J2582J3284k40j0237j9200m029
17370A5881K1120K7908J9776L49j1328l834N089J1974J4433J791n111j4828j6543
17357F6677j942j467j466m843l517o850p058K034N212o23L299l939o312k060j992
17342C5153R194Q701O089L469k498j082m020m765L035l842o217J989n114L50M215
$$ plain form
17327 44657 43841 32956 32009 32430 29434 30593 29838 25795 23325 19632 21230 15605 15324 19360 12734
17312 12734 17231 15696 6862 -5028 -3564 7272 18036 17819 16202 10847 9104 8186 13615 10251
17298 10251 4877 3708 6137 3211 -287 -1912 135 5877 421 -7418 -11394 -11469 -9459 -7713 -8010
17283 -8010 -6605 -2320 -3054 -3697 1815 4352 1542 -1716 -4180 -2448 2345 -1247 -11086 -17811 -11226
17268 -11226 -7244 -2342 2210 -4236 -7810 -9327 -2285 -1725 -7170 -1288 -4379 -8088 -5184 -1466 489
17253 489 2729 5717 8754 10668 8116 2671 -383 1250 6918 5674 395 955 7767 9222 4880
17238 4880 6228 5840 5523 1316 -4841 -2070 2250 1592 2705 5371 5410 5502 6057 4657 3282 -3896 3536
17221 3536 8321 7756 4845 7135 9520 7116 8888 10842 6109 -292 2853 10676 10760 8991 10312
$$ packed form
17327D4657q16j0885r47M21k996J159p55m043k470l693J598n625k81M036o626
17312A2734M497j535q834j1890J464J0836J0764k17j617n355j743r18N429l364
17298A0251n374j169K429k926l498j625K047N742n456p839l976p5K010J746k97
17283h010J405M285p34o43N512K537k810l258k464J732M793l592r839o725O585
17268a1226L982M902M552o446l574j517P042N60n445N882l091l709K904L718J955
17253D89K240K988L037J914k552n445l054J633N668j244n279N60O812J455m342
17238D880J348l88l17m207o157K771M320o58J113K666L9R2N55j400j375p178P432
17221C536M785n65k911K290K385k404J772J954m733o401L145P823Q4j769J321
$$ plain form
17206 10312 4079 7627 9239 10864 12231 11632 11281 10292 11631 16359 11361 9105 2990 3234 3759 8671
17190 8671 7963 2169 628 3549 1347 4543 9054 10460 11909 12646 12489 8128 3924 2027 4568
17175 4568 9169 5266 -3268 -9700 -3127 1886 6918 8492 -1678 -6701 -2738 -114 -589 7216 8886
17160 8886 7422 2667 5552 3289 2447 710 3200 4243 8656 4691 3702 5367 4085 5070 6609
17145 6609 6461 1284 -3408 -1318 1111 902 1636 -1671 -1834 -1628 1940 -9 -2946 2154 4532 5573
17129 5573 4535 -2880 -6065 -7524 -9134 -5720 -2080 811 5006 5666 4477 1520 -1809 -1436 -2982
17114 -2982 -10508 -16821 -10750 -8053 -4498 -5002 -9822 -11640 -11853 -8070 -7972 -11205 -11053 -6445 -6510 -4382
17098 -4382 -4463 -3493 88 5932 7675 11746 9607 3022 -2096 -995 5132 6593 4982 8663 2352
$$ packed form
17206A0312o233L548J612J625J367n99l51r89J339M728m998k256o115K44N25M912
17190H671p08n794j541K921k202L196M511J406J449P37j57m361m204j897K541
17175D568M601l903q534o432O573N013N032J574j0170n023L963K624m75P805J670
17160H886j464m755K885k263q42j737K490J043M413l965r89J665j282R85J539
17145F609j48n177m692K090K429k09P34l307j63K06L568j949k937N100K378J041
17129E573j038p415l185j459j610L414L640K891M195O60j189k957l329L73j546
17114b982p526o313O071K697L555n04m820j818k13L783R8l233J52M608o5K128
17098d382q1R70L581N844J743M071k139o585n118J101O127J461j611L681o311
$$ plain form
17083 2352 -4188 8 2364 4205 3731 4222 4135 3135 -1550 -8350 -8659 -3306 1957 -961 -5292 -2337
17067 -2337 -2421 -4020 5296 5036 -101 -327 8072 9156 4286 5140 2986 -2986 -3519 2429 6355 7245
17051 7245 9264 6814 -801 1838 8795 9822 6196 3686 2717 4954 3533 1582 -6059 -10403 -5991
17036 -5991 -4461 -6024 -14149 -11478 -9834 -12956 -15581 -11351 -13231 -12768 -14950 -19657 -22542 -16759 -8381
17021 -8381 -5730 -1328 -4425 -1197 4294 11265 9489 2928 1367 -5286 -17 1529 -8290 -9053 -8844
17006 -8844 -9726 -15792 -16064 -9268 -2267 3945 392 814 6746 5101 4655 5202 554 -5590 -2230 1026
16990 1026 -233 -6228 -10430 -4177 3361 9854 6997 952 3076 3927 -5002 -8925 -7073 -11014 -8461
16975 -8461 -8477 -12537 -13719 -13705 -11166 -7476 -5831 845 1118 -3276 -6742 -5615 -215 1961 -1410 2102
$$ packed form
17083B352o540M196K356J841m74M91q7j000m685o800l09N353N263k918m331K955
17067b337q4j599R316k60n137k26Q399J084m870Q54k154n972n33N948L926Q90
17051G245K019k450p615K639O957J027l626k510r69K237j421j951p641m344M412
17036e991J530j563q125K671J644l122k625M230j880M63k182m707k885N783Q378
17021h381K651M402l097L228N491O971j776o561j561o653N269J546r819p63K09
17006h844q82o066k72O796P001O212l553M22N932j645m46N47m648o144L360L256
16990A026j259n995m202O253P538O493k857o045K124Q51q929l923J852l941K553
16975h461j6m060j182J4K539L690J645O676K73m394l466J127N400K176l371L512
$$ plain form
16959 2102 -938 -407 7773 4372 879 420 6513 9697 9634 3086 798 4330 1658 -1036 272 -4068
16943 -4068 -2337 3322 8881 7322 4819 -965 613 4348 2937 6086 13587 19880 13008 10151 7996
16928 7996 8009 15531 18287 20019 26674 25674 25579 26795 34132 45476 59833 78007 99261 120165
16914 120165 156518 201274 232499 241621 254639 287872 359765 458861 540869 542731 470858 408475
16902 408475 409628 462607 527415 530681 455577 349797 272631 234797 226303 221884 195786 153905
16890 153905 111241 77485 58814 49583 41534 37725 32349 26278 12538 5466 10612 7941 5507
16877 5507 7492 9685 11404 6401 3431 1074 -576 -2079 -4021 -2427 -3485 -5582 -10811 -11011 -1056
16862 -1056 461 -2430 -1304 2917 1084 -7119 -7672 -7220 -10247 -9213 -4354 -5424 -5749 -3133 -1756
$$ packed form
16959B102l040N31Q180l401l493m59O093L184o3o548k288L532k672k694J308m340
16943d068J731N659N559j559k503n784J578L735j411L149P501O293o872k857k155
16928G996J3P522K756J732O655j000r5J216P337J1344J4357J8174K1254K0904
16914A20165L6353M4756L1225R122J3018L3233P1893R9096Q2008J862p1873o2383
16902D08475J153N2979O4808L266p5104j05780p7166l7834q494m419k6098m1881
16890A53905m2664l3756j8671r231q049l809n376o071j3740p072N146k671k434
16877E507J985K193J719n003k970k357j650j503j942J594j058k097n229k00R955
16862a056J517k891J126M221j833q203n53M52l027J034M859j070l25K616J377
$$ plain form
16847 -1756 199 -6537 -2575 11261 10699 -285 -7139 -1537 2186 8729 11489 13395 7328 570
16833 570 414 496 -3003 -4852 372 -4046 -5802 -8013 -1147 226 -5185 -8052 -3650 -5856 -8022 -9790
16817 -9790 -9440 -9799 -8863 -6697 -3050 742 -4942 -5386 -10545 -10671 -4857 -7656 -15716 -15064 -6362 5431
16801 5431 12044 12960 7092 3796 2651 -3145 -2857 1516 1860 2940 3713 3866 3527 -2540 -2345 -8751
16785 -8751 -11495 -6378 -1515 -2806 -6168 -7319 -4792 -2281 -2258 1125 1232 3727 3145 -2949 -6448 -1475
16769 -1475 -276 -1759 -6598 -6475 -4245 2927 -1818 -5464 1823 3119 -1805 -7951 -6291 -6160 -8159
16754 -8159 -10857 -10825 -9139 -9156 -1741 446 6766 5126 6659 6100 3911 2098 6769 7719 6394 396
16738 396 -6412 -7268 -9899 -17422 -11438 -6666 -8573 -5534 -8230 -6735 300 -3282 -8228 -11340 -8479
$$ packed form
16847a756J955o736L962J3836n62j0984o854N602L723O543K760J906o067o758
16833E70j56Q2l499j849N224m418j756k211O866J373n411k867M402k206k166j768
16817i790L50l59R36K166L647L792n684m44n159j26N814k799q060O52Q702J1793
16801E431O613R16n868l296j145n796K88M373L44J080P73J53l39o067J95o406
16785h751k744N117M863j291l362j151K527K511K3L383J07K495n82o094l499M973
16769a475J199j483m839J23K230P172m745l646P287J296m924o146J660J31j999
16754h159k698L2J686j7P415K187O320j640J533n59k189j813M671R50j325n998
16738C96o808q56k631p523N984M772j907L039k696J495P035l582m946l112K861
$$ plain form
16723 -8479 -4742 419 -4569 -1938 4927 11274 7559 3783 -1002 -3144 -4514 -6493 -9570 -11260 -9293
16708 -9293 -11485 -10110 1258 10372 622 -8007 -11395 -9029 -8510 -9921 -8889 -9807 -14458 -11715 -10662
16693 -10662 -6721 -6173 4836 3758 -7119 -12722 -13631 -9233 -4969 -2410 4510 6181 779 -347
16679 -347 7741 8188 -948 -8423 -9303 -10828 -11323 -8626 -12255 -6580 -6991 -7339 -6796 -6066 -8363 -15803 -14769
16662 -14769 -11566 -6766 -2137 2599 2082 -4023 -7849 -10109 -11569 -14190 -16116 -14720 -12447 -10211 -4436
16647 -4436 -3287 -7386 -6026 -5640 -5288 -7257 -608 -5865 -10367 -14024 -7466 -5884 -10891 -4653 1127
16632 1127 2614 1525 -52 -1930 -1386 -2985 -8366 -6220 -1658 4137 1253 -4077 -7339 -4860 -3795
16617 -3795 -1103 -3441 -593 -8118 -7112 -1790 -3972 4239 3890 -5225 -7726 -5671 -2931 2230 294
$$ packed form
16723h479L737N161m988K631O865O347l715l776m785k142j370j979l077j690J967
16708i293k192J375J1368R114r750q629l388K366N19j411J032r18m651K743J053
16693a0662L941N48J1009j078j0877n603r09M398M264K559O920J671n402j126
16679c47Q088M47r136p475q80j525m95K697l629N675m11l48N43P30k297p440J034
16662a4769L203M800M629M736n17o105l826k260j460k621j926J396K273K236N775
16647d436J149m099J360L86L52j969O649n257m502l657O558J582n007O238N780
16632A127J487j089j577j878N44j599n381K146M562N795k884n330l262K479J065
16617c795K692k338K848p525J006N322k182Q211l49r115k501K055K740N161j936
$$ plain form
16602 294 -6545 -5307 -4815 -2762 -2775 -6039 -9856 -12309 -11103 -10206 -2893 -7045 -8993 -10333 -10413 -3985
16586 -3985 687 2332 -7395 -9091 -2035 3081 1445 2210 -2917 -5748 -2540 -550 -2410 -7641 -2752
16571 -2752 946 -1318 -2014 2281 -3694 -10186 -6129 -9379 -10958 -9645 -15689 -16829 -17096 -8016 -6011
16556 -6011 -2711 -1942 -4550 -3010 -481 8605 5335 -1103 -413 231 2879 8326 3826 -2307 423
16541 423 -2681 -9544 -10045 -4188 -396 -2566 -3007 -10108 -12057 -14428 -8181 -4388 -3059 -5154 -324
16526 -324 -1341 -5736 -7023 -4480 -4675 -1277 1332 247 -4157 -6981 -1881 -3754 -7944 -10048 -8500
16511 -8500 -6793 -5118 -5812 -7199 -4828 -7145 -4586 753 4166 2717 127 -2193 -1009 -9005 -12984
16496 -12984 -12740 -10867 -9152 -6365 -7279 -2115 2012 -2807 -7864 -8266 -4606 -6783 -8408 -9357 -5769
$$ packed form
16602B94o839J238M92K053j3l264l817k453J206Q97P313m152j948j340q0O428
16586c985M672J645r727j696P056N116j636P65n127k831L208J990j860n231M889
16571b752L698k264o96M295n975o492M057l250j579J313o044j140k67R080K005
16556f011L300P69k608J540K529R086l270o438O90O44K648N447m500o133K730
16541D23l104o863n01N857L792k170m41p101j949k371O247L793J329k095M830
16526c24j017m395j287K543j95L398K609j085m404k824N100j873m190k104J548
16511h500J707J675o94j387K371k317K559N339L413j449k590k320J184p996l979
16496a2984K44J873J715K787r14N164M127m819n057m02L660k177j625r49L588
$$ plain form
16481 -5769 479 -3589 -4101 -9474 -12168 -12179 -14020 -12643 -6521 -3891 -738 -1754 1825 6003 7010
16466 7010 3344 -1999 -4147 -6948 -2728 -2342 -6871 -2871 -1299 4018 6525 8141 8317 6094 3326
16451 3326 -3494 -6816 -7545 -9776 939 5025 10684 9351 5648 2633 2043 -1343 -6836 -3257 -3497
16436 -3497 -6497 -9749 -5606 -131 632 1152 2489 -397 -2204 -6470 -6183 -3666 -7480 -13142 -9799
16421 -9799 -1417 3944 2049 -1721 1201 1355 -6011 -4763 -7633 -10260 -7847 -5320 -3909 -4650 257
16406 257 144 -85 841 -3631 299 843 -562 -3619 -6184 -10396 -4951 -8104 -9973 -11759 -10197 -6848
16390 -6848 -350 3276 880 5554 2896 -2406 -857 172 -3294 -1724 2515 -3646 -8499 -7017 2159
16375 2159 1750 1870 -559 -2770 -1055 -856 -2501 -9501 -4485 -5344 -3640 -7161 -9465 -9907 -13055 -13685
$$ packed form
16481e769O248m068n12n373k694j1j841J377O122K630L153j016L579M178J007
16466G010l666n343k148k801M220L86m529M000J572N317K507J616J76k223k768
16451C326o820l322p29k231J0715M086N659j333l703l015n90l386n493L579k40
16436c497l000l252M143N475P63N20J337k886j807m266K87K517l814n662L343
16421i799Q382N361j895l770K922J54p366J248k870k627K413K527J411p41M907
16406B57j13k29R26m472L930N44j405l057k565m212N445l153j869j786J562L349
16390f848O498L626k396M674k658n302J549J029l466J570M239o161m853J482R176
16375B159m09J20k429k211J715J99j645p000N016q59J704l521k304m42l148o30
$$ plain form
16359 -13685 -11931 -13461 -16540 -17582 -15799 -14273 -11628 -14265 -14606 -9331 935 5543 2818 1138
16345 1138 -1707 -1607 -5272 -7837 -5352 -8638 -11567 -8477 -10452 -13569 -15900 -20113 -17997 -11921 -10758
16330 -10758 -6964 -1698 -94 -2475 -6372 -10221 -12461 -6797 -175 179 -5977 -7430 247 4109 2259
16315 2259 -5921 -13174 -10057 -6970 -7468 -7392 -3797 -3171 -4249 -2822 -2284 -10046 -8114 1946 3899 8863
16299 8863 9108 -3457 -9214 -8666 -9699 -5917 -5522 -5589 -6491 -5135 -4852 254 -994 -1024 -2252 -7056 -2337
16282 -2337 -1462 -11412 -12663 -7274 -8567 -9820 -7034 -171 573 4696 -317 -4671 -6096 -6542 -6315 -8580
16266 -8580 -8162 -6878 -3238 -7801 -11369 -10563 -8277 -2952 -5154 -5776 -8438 -8271 -2500 1921 -1067 -1856
16250 -1856 -4812 -8218 -8808 -3557 -8450 -6851 -5816 -4485 -4688 -8480 -4265 -3823 -1744 4050 3615 1240
$$ packed form
16359a3685J754j530l079j042J783J526K645k637l41N275J0266M608k725j680
16345A138k845J00l665k565K485l286k929L090j975l117k331m213K116O076J163
16330a0758L794N266J604k381l897l849k240N664O622L54o156j453P677L862j850
16315B259q180p253L117L087m98P6L595O26j078J427N38p762J932J0060J953M964
16299H863K45j2565n757N48j033L782L95o7r02J356K83N106j248l0j228m804M719
16282b337Q75r950j251N389j293j253K786O863P44M123n013m354j425m46K27k265
16266h580M18J284L640m563l568Q06K286N325k202o22k662J67N771M421k988p89
16250a856k956l406n90N251m893J599J035J331k03l792M215M42K079N794m35k375
$$ plain form
16234 1240 2616 -2160 -2173 488 -5460 -4407 285 2946 -4565 -9609 -6399 -4311 -808 3785 6306
16219 6306 -3346 -2831 1138 2799 3384 -2646 -3368 -1866 -4919 -8145 -7451 270 2894 1927 -102 -7275
16203 -7275 -10051 -8691 -7095 -965 269 -2593 -7655 -9928 -5834 896 -3733 760 6719 2406 6495
16188 6495 3568 -1447 -4670 -3594 -11085 -8226 -3708 2089 -1977 -8596 -11632 -6624 -10673 -13913 -12471
16173 -12471 -11335 -9478 -3551 -2777 191 3507 3635 3199 7019 10259 8595 8123 4836 -5737 -11047
16158 -11047 -11794 -8580 -3946 -3913 -4323 -7130 265 6702 410 -3181 702 4573 -675 -7099 -9125
16143 -9125 -10322 -12622 -16759 -17631 -11068 -2786 5851 7002 143 -10000 -10647 -12517 -16010 -9864 -6178
16128 -6178 -8574 -8691 -9990 -14006 -12918 -5776 347 53 -6334 -7881 -9166 1229 3140 2772 627
$$ packed form
16234A240J376m776j3K661n948J053M692K661p511n044L210K088L503M593K521
16219F306r652N15L969J661N85o030p22J502l053l226O94P721K624r67k029p173
16203g275k776J360J596O130J234k862n062k273M094O730m629M493N959m313M089
16188F495k927n015l223J076p491K859M518N797m066o619l036N008m049l240J442
16173a2471J136J857N927P74K968L316J28m36L820L240j664m72l287j0573n310
16158a1047p47L214M634L3m10k807P395O437o292l591L883L871n248o424k026
16143i125j197k300m137q72O563Q282Q637J151o859j0143o47j870l493O146L686
16128f178k396j17j299m016J088P142O123k94o387j547j285J0395J911l68k145
$$ plain form
16113 627 -1891 -9288 -11598 -5784 -2612 2279 7243 9807 4957 2288 4445 5773 8160 5489 -5156
16098 -5156 -5922 -3382 -1335 -1819 2780 11134 4135 -2724 -928 -863 1156 -1543 2528 -2538 -6058 -11642
16082 -11642 -16123 -7129 1006 4744 1572 635 -2406 -2548 1204 -3447 -6113 -6478 -8228 -12356 -11463
16067 -11463 -6394 3850 8925 6967 4824 2835 -4369 -1081 3866 1733 -663 -1701 1409 1175
16053 1175 -2754 -5076 1220 6545 8998 5369 -489 -4527 47 -1688 -3921 -2788 -1920 1527 1517
16038 1517 -2949 -3168 4121 -2495 -7824 -7951 -8051 -5568 -8748 -9308 -7391 -9044 -8348 -3529 -3123 367
16022 367 -239 -4778 -5052 -6397 -1875 -1676 -3824 -6892 -7492 -3894 -849 -4444 -13782 -8350 -194 167
16006 167 -54 -326 -2791 -11 6057 9636 7788 616 -5670 -4165 -7539 -9877 -12030 -13452 -7667
$$ packed form
16113F27k518p397k310N814L172M891M964K564m850k669K157J328K387k671j0645
16098e156p66K540K047m84M599Q354o999o859J796O5K019k699M071n066l520n584
16082a1642m481Q994Q135L738l172r37l041j42L752m651k666l65j750m128Q93
16067a1463N069J0244N075j958k143j989p204L288M947k133k396j038L110k34
16053A175l929k322O296N325K453l629n858m038M574j735k233J133Q68L447j0
16038A517m466k19P289o616n329j27j00K483l180n60J917j653O96M819M06L490
16022C67o06m539k74j345M522J99k148l068o00L598L045l595r338N432Q156L61
16006A67k21k72k465K780O068L579j848p172o286J505l374k338k153j422N785
$$ plain form
15991 -7667 -4225 -3698 -2969 -5735 -5766 -3808 -9305 -15813 -10452 2897 4293 5201 5892 6511 644 -788
15975 -788 4469 2153 -4351 -4012 -5318 -4864 344 1907 -528 -3518 -941 2396 -319 -1475 -404
15960 -404 -4450 -1349 4330 8414 -654 -5005 -4766 -573 5046 -954 -7870 -8804 -211 3276 5933
15945 5933 321 -2553 -4641 -4405 296 5803 6395 6454 5999 -1759 -4956 -781 113 2945 10068 6077
15929 6077 5841 -524 -4748 270 -2171 -1756 2340 3677 1329 -6543 -9133 -10712 -7549 -2540 433
15914 433 3809 6860 8735 10288 10994 6452 7721 4978 6686 7014 5455 879 -2048 -2577 2188 -520
15898 -520 -761 -4189 -6554 -5260 -3270 -4007 -6029 -10186 -11643 -13407 -9609 -6326 -11609 -9145 -5375
15883 -5375 -1517 -2324 -7914 -3613 1760 4669 1106 -1002 -3034 -2810 -6466 -7700 -5387 -1111 -1254
$$ packed form
15991g667L442N27P29k766l1J958n497o508N361J3349J396R08O91O19n867j432
15975g88N257k316o504L39j306M54N208J563k435k990K577L337k715j156J071
15960d04m046L101N679M084r068m351K39M193N619o000o916r34Q593L487K657
15945E933n612k874k088K36M701N507N92N9m55p758l197M175Q94K832P123l991
15929F077k36o365m224N018k441M15M096J337k348p872k590j579L163N009K973
15914D33L376L051J875J553P06m542J269k743J708L28j559m576k927n29M765k708
15898e20k41l428k365J294J990p37k022m157j457j764L798L283n283K464L770
15883e375L858q07n590M301N373K909l563k108k032K24l656j234K313M276j43
$$ plain form
15868 -1254 -1035 -1056 -96 6042 11863 4812 -1433 -2296 -5913 898 6890 5041 6443 4094 -638 -4220
15852 -4220 -3675 -4990 -8366 -2465 -913 -1670 226 7379 10365 7147 -40 -4543 -4917 -3503 -1448
15837 -1448 -3946 -8470 -4601 5821 6236 3761 5102 491 265 -2734 -5257 -5931 -11345 -11602 -6789
15822 -6789 -908 -3844 -11366 -8577 -5666 -3886 -1020 -2188 -5204 -5888 -1835 12834 15463 9781 7928
15807 7928 6154 3715 -3865 -2034 4046 9256 6959 -419 -6371 -5551 -5070 -7764 -7670 -5573 -4064 -563
15791 -563 -2534 -4954 -7982 -12372 -6746 -4893 -7130 -6560 1285 118 -2009 -2935 -2715 -3366 1141 5096
15775 5096 4320 -4835 -11731 -14301 -8521 2489 2127 -1650 1491 2415 -247 1111 5621 6555 5813 1735
15759 1735 10858 10326 -348 -10024 -12385 -10007 -5277 -8019 -5832 -1527 780 -5625 -10519 -8110 -14062
$$ packed form
15868a254K19k1R60O138N821p051o245q63l617O811N992j849J402k349m732l582
15852d220N45j315l376N901J552p57J896P153K986l218p187m503l74J414K055
15837a448k498m524L869J0422M15k475J341m611k26k999k523o74n414k57M813
15822f789N881k936p522K789K911J780K866j168l016o84M053J4669K629n682j853
15807G928j774k439p580J831O080N210k297p378n952Q20M81k694R4K097J509L501
15791e63j971k420l028m390N626J853k237N70P845j167k127r26K20o51M507L955
15775E096p76r155o896k570N780J1010l62l777L141R24k662J358M510R34p42m078
15759A735R123n32j0674r676k361K378M730k742K187M305K307o405m894K409n952
$$ plain form
15744 -14062 -16073 -16951 -10820 -5716 1694 4133 6441 7924 7372 4036 -265 -1436 -6749 -9663 -6032
15729 -6032 -6040 -10644 -11317 -7509 -9195 -4401 -4000 -6121 -10873 -13947 -9307 -8524 -11626 -14249 -14651 -7371
15713 -7371 -6460 -8282 -7811 -2778 -6649 -7873 -8032 -9837 -9230 -3568 -4312 -7262 -7925 -2346 3741 6920
15697 6920 5771 820 2812 6776 6242 4327 -2162 -11196 -11505 -6118 3503 5840 2251 -9689 -11360
15682 -11360 -9057 -10357 -6731 -7507 -4624 745 -3609 -3291 1138 -3582 -4694 1888 6440 7098 13864
15667 13864 12688 -2417 -5741 -6237 -3241 -4007 1628 -1076 3672 6779 11087 9643 4442 -6053
15653 -6053 -10315 402 12553 16487 10714 1430 -1215 -3742 -18262 -28212 -24784 -14148 -4111
15640 -4111 4425 14320 14950 11688 5162 595 -9009 -16591 -14627 -3917 188 3681 8080 3589 1410
$$ packed form
15744a4062k011q78O131N104P410K439K308J483n52l336m301j171n313k914L631
15729f032qm604o73L808j686M794M01k121m752l074M640P83l102k623m02P280
15713g371R11j822M71N033l871j224j59j805O07N662p44k950o63N579O087L179
15697F920j149m951J992L964n34j915o489r034l09N387R621K337l589j1940j671
15682a1360K303j300L626p76K883N369m354L18M429m720j112O582M552O58O766
15667A3864j176j5105l324m96K996p66N635k704M748L107M308j444n201j0495
15653f053m262J0717J2151L934n773r284k645k527j4520r950L428J0636J0037
15640d111Q536R895O30l262o526m567r604p582J964J0710M105L493M399m491k179
$$ plain form
15625 1410 -9252 -8951 -12306 -12748 -14773 -15053 -11611 -5405 5089 3137 55 -262 -240 -2307 -576 -4201
15609 -4201 -2527 -1938 -1458 -4831 -9042 -9369 -12337 -17226 -14239 -14940 -15868 -10084 -6228 -4406 -3051 -544
15593 -544 1388 -1280 -3907 -3166 -5011 -7864 -7629 -3303 1552 -3110 -7843 -4768 -2815 -1636 -4197
15578 -4197 -8419 -9805 -11845 -2954 114 -1433 -3932 -636 1244 -6580 -2424 -7924 -9904 -10561 -7534
15563 -7534 -2042 -544 -460 5095 5382 9055 4183 -5890 -13953 -5643 1006 -7195 -16138 -15545 -10569
15548 -10569 -5744 -6876 -8296 -4544 674 756 -20 -3789 -7758 -6045 -3071 867 -2070 -2827 -6467
15533 -6467 -5738 1794 1742 -60 -1952 1428 432 -8951 -8589 -856 2164 3378 3850 -3214 -229 4485
15517 4485 5024 1568 1851 4314 4702 6369 8974 10297 2161 -7968 -10065 -9946 -12925 -9496 -7805
$$ packed form
15625A410j0662L01l355m42k025k80L442O206J0494j952l082l17K2k067J731l625
15609d201J674N89M80l373m211l27k968m889K987p01r28N784L856J822J355K507
15593e44J932k668k627P41j845k853K35M326M855m662m733L075J953J179k561
15578d197m222j386k040Q891L068j547k499L296J880p824M156n500j980o57L027
15563g534N492J498Q4N555K87L673m872j0073q063Q310O649q201q943N93M976
15548a0569M825j132j420L752N218Q2p76l769l969J713K974L938k937p57l640
15533f467P29P532n2j802j892L380r96r383L62P733L020J214M72p064K985M714
15517D485N39l456K83K463L88J667K605J323q136j0129k097J19k979L429J691
$$ plain form
15502 -7805 -13752 -10834 -4925 -9638 -14894 -10822 -10776 -11088 -12913 -11798 -13822 -9640 -3916 -4342 -4140 -2978
15486 -2978 2123 4805 6824 4691 5089 4703 -4634 -527 730 1510 1660 992 4774 856 -5193 -9483
15470 -9483 -11449 -7304 -3042 -6863 -14633 -19557 -20582 -21747 -28079 -18993 -13743 -17794 -11035 -11588 -11044
15455 -11044 -12494 -9349 -5352 920 4847 4376 -481 1460 3154 5436 7402 7826 1287 -4183 -7584
15440 -7584 -7750 -2543 1970 4200 4802 4114 -5749 -3864 1836 -3913 -8715 -10203 -11261 -6019 -5382 -6202
15424 -6202 -2487 6542 5664 3572 7643 7743 4975 1478 -4435 -2821 -3193 -4294 -5582 1037 2403
15409 2403 3535 5526 7847 2120 -266 2045 5370 1299 -2223 -223 -2587 -3498 2743 950 -2580
15394 -2580 -2195 5860 7096 2401 1838 -230 -7044 -10317 -7624 -3945 -7978 -11660 -6638 -2404 -258
$$ packed form
15502g805n947K918N909m713n256M072M6l12j825J115k024M182N724m26K02J162
15486b978N101K682K019k133L98l86r337M107J257P80J50o68L782l918o049m290
15470i483j966M145M262l821p770m924j025j165o332R086N250m051O759n53N44
15455a1044j450L145L997O272L927m71m857J941J694K282J966M24o539n470l401
15440g584j66N207M513K230O02o88r863J885N700n749m802j488j058N242O37q20
15424f202L715R029q78k092M071J00k768l497n913J614l72j101j288O619J366
15409B403J132J991K321n727k386K311L325m071l522K000k364r11O241j793l530
15394b580L85Q055J236m695n63k068o814l273K693L679m033l682N022M234K146
$$ plain form
15379 -258 3036 6771 5184 3316 3178 -2416 -8538 -10693 -7604 122 2572 213 -2917 -8922 -10957
15364 -10957 -7449 -9398 -12835 -6616 -2172 -4738 -9715 -8348 -3942 390 1351 2007 468 863 4715
15349 4715 370 -5964 -7775 -1846 -1222 -4949 -8652 -7334 -3084 1380 -135 -319 3290 2606 -252
15334 -252 -321 -440 -370 -5699 -4200 240 506 -1056 -8864 -17226 -8016 813 -620 -942 -60 -5387 -5282
15317 -5282 -1021 4035 7536 5504 859 -922 294 3349 3659 -8875 -8660 -404 678 -1633 -12626
15302 -12626 -21023 -20581 -18417 -9763 -4993 -318 1331 1596 -590 1136 5815 8379 7564 2960 -1820
15287 -1820 -4406 -2332 -8240 -11034 -12269 -9096 -10551 -10746 -6098 -9033 -12079 -12674 -4664 2955 -4831
15272 -4831 -7619 -2417 -1382 -2488 -1026 179 -28 -1442 -9929 -16197 -16193 -11370 -6914 -4642 -9079 -8438
$$ packed form
15379b58L294L735j587j868j38n594o122k155L089P726K450k359l130o005k035
15364a0957L508j949l437O219M444k566m977J367M406M332R61O56j539L95L852
15349D715m345o334j811N929O24l727l703J318M250M464j515j84L609o84k858
15334b52o9j19P0n329J499M440K66j562p808q362R210Q829j433l22Q82n327J05
15317e282M261N056L501k032m645j781J216L055L10j2534K15Q256J082k311j0993
15302a2626q397M42K164Q654M770M675J649K65k186J726M679K564q15m604m780
15287a820k586K074n908k794j235L173j455j95M648k935l046n95Q010P619p786
15272d831k788N202J035j106J462J205k07j414q487o268MM823M456K272m437O41
$$ plain form
15256 -8438 -8906 -9983 -718 3447 -311 1961 1991 1727 -1379 -4988 -14388 -12725 -11750 -5657 -4853 -11483
15240 -11483 -14551 -13660 -12543 -10864 -7970 -5936 -1029 5081 11600 11481 8066 2960 -1048 998 2148
15225 2148 1358 1968 2706 5720 3667 -1281 335 825 2280 -1132 -657 1064 6228 9329 1760 2514
15209 2514 5560 4187 4531 7548 7331 -1329 -7334 -12561 -19766 -18856 -13268 -8880 -11512 -16767 -23427
15194 -23427 -22248 -15181 -6349 -1717 -3376 -2521 -413 -4869 -12030 -8136 -8007 -7119 -5432 -7981 -12258
15179 -12258 -11651 -7634 -1339 1383 6602 11735 13666 11699 5161 -2283 796 7266 5940 7787 2633
15164 2633 1997 5186 5684 2300 3061 6561 8812 4164 -2473 2616 7286 6758 5846 4974 1299 -4305
15148 -4305 -11413 -14193 -13216 -7301 1081 3503 -2735 -2231 5372 4167 4103 -209 -5308 -6570 -5287 -2951
$$ packed form
15256h438m68j077R265M165l758K272L0k64l106l609r400J663R75O093Q04o630
15240a1483l068Q91J117J679K894K034M907O110O519j19l415n106m008K046J150
15225B148p90O10P38L014k053m948J616M90J455l412M75J721N164L101p569P54
15209B514L046j373L44L017k17q660o005n227p205R10N588M388k632n255o660
15194b3427J179P067Q832M632j659Q55K108m456p161L894J29Q88J687k549m277
15179a2258O07M017O295K722N219N133J931j967o538p444L079O470j326J847n154
15164B633o36L189M98l384P61L500K251m648o637N089M670n28r12q72l675n604
15148d305p108k780R77N915Q382K422o238N04P603j205o4m312n099j262J283K336
$$ plain form
15132 -2951 -2618 -3219 3183 6298 2387 96 1510 -2248 -5434 -435 4923 234 -2948 538 1008
15117 1008 -3790 -940 4804 5199 -6427 -10991 -10677 -6517 -53 -2095 -9795 -12854 -8435 -9685 -18305
15102 -18305 -18616 -13523 -5257 4091 7397 1353 -4497 -2578 2592 3487 1181 -110 6267 1093 -7496
15087 -7496 -7193 -4418 -804 1031 3427 5517 2385 1194 -532 -1186 -10183 -6797 -9904 -9994 -5958 1829
15071 1829 6139 6441 2640 848 1298 5409 5787 -2709 2130 1311 74 -430 -2313 -10142 -8437 -4805
15055 -4805 -7100 -11024 -12636 -13931 -13544 -11330 -2517 -2171 -4746 -5237 -10484 -8881 -8853 -9766 -7038 -9059
15039 -9059 -11813 -6357 930 5826 8916 2307 -4984 -5494 -4344 -4417 709 4254 4099 5581 8018 4790
15023 4790 -5161 -4651 -4869 2024 6301 3747 3988 4377 -708 -2760 -3347 -5907 -5521 1278 6441 5771
$$ packed form
15132b951L33o01O402L115l911k291J414l758l186M999N358m689l182L486M70
15117A008m798K850N744L95j1626m564L14M160O464k042p700l059M419j250q620
15102a8305l11N093Q266R348L306o044n850J919N170Q95k306j291O377n174q589
15087g496L03K775L614J835K396K090l132j191j726o54q997L386l107r0M036P787
15071A829M310L02l801j792M50M111L78q496M839q19j237n04j883p829J705L632
15055d805k295l924j612j295L87K214Q813L46k575m91n247J603K8r13K728k021
15039i059k754N456P287M896L090o609p291n10J150p3N126L545j55J482K437l228
15023D790r951N10k18O893M277k554K41L89n085k052n87k560L86O799N163o70
$$ plain form
15007 5771 8105 5880 2932 2965 1715 -1575 536 3834 8565 6353 3366 -1006 -1588 -2078 -5677 -5994
14991 -5994 -8788 -10103 -8156 -5331 -165 -5879 -10351 -9747 -3454 4116 -613 -10129 -14354 -12043 -13329
14976 -13329 -8650 -9157 -18238 -19951 -16542 -10570 -3726 -1696 -9115 -9839 -10375 -6681 -8279 -3420 4667
14961 4667 6601 2475 -2640 -10238 -8489 -9567 -9866 -9289 -11526 -292 5540 3192 -5035 -3615 -4666
14946 -4666 -9563 -9423 -6102 -4367 -6395 -4195 3590 3558 12009 15825 11233 4114 3727 3658 3737 -4342 -5853
14929 -5853 -7577 -6990 -5443 -2677 -7163 -10418 -6904 -8533 -5577 -4541 -1095 -2699 -6074 -3279 870
14914 870 -4648 -7173 -6921 -9972 -11506 -9270 -7528 -8339 -8658 -3594 1278 -397 587 -1562 -694 8210
14898 8210 16303 11473 2432 -1504 -243 8090 22547 24347 13912 1761 -3199 -3617 -2405 -2636
$$ packed form
15007E771K334k225k948L3j250l290K111L298M731k212k987m372n82m90l599l17
14991e994k794j315J947K825N166n714m472O04O293P570m729r516m225K311j286
14976a3329M679n07r081j713L409N972O844K030p419p24n36L694j598M859Q087
14961D667J934m126n115p598J749j078k99N77k237J1234N832k348q227J420j051
14946d666m897J40L321J735k028K200P785l2Q451L816m592p119l87o9P9q079j511
14929e853j724N87J547K766m486l255L514j629K956J036L446j604l375K795M149
14914H70n518k525K52l051j534K236J742q11l19N064M872j675R84k149Q68Q904
14898H210Q093m830r041l936J261Q333J4457J800j0435j2151m960m18J212k31
$$ plain form
14884 -2636 -5396 -5875 -8198 -6822 -1690 -1344 -8752 -8843 -7464 -5047 -2217 -6089 570 5174 1646 -151
14868 -151 1308 2190 -4003 -8559 -8396 -9800 -3204 4195 6354 5200 8213 8360 7077 7355 4767 593
14852 593 -4663 -10601 -5077 -17 -4738 -8291 -4861 -2969 -388 753 6133 10791 6417 -1321 -2854
14837 -2854 2575 4790 -3507 -1544 4175 -334 -8687 -13674 -12501 -6478 -3943 -5487 187 3518 1347
14822 1347 -1821 -372 -11636 -17376 -7381 3103 2598 3965 116 -7466 -7556 -2400 1108 745 1003
14807 1003 8955 9064 1016 -3416 -2768 -2604 3116 4497 2633 -1379 -4208 -11230 -9684 -2826 1542
14792 1542 -3962 -4635 5283 -158 -5516 -12354 -4529 -1040 -1566 -5446 -10384 -16893 -9757 -7746 -4471
14777 -4471 -1051 3646 14980 14068 3342 -3880 4109 11588 13690 14844 11620 -804 -3816 -3953
$$ packed form
14884b636k760m79k323J376N132L46p408r1J379K417K830l872O659M604l528j797
14868a51J459Q82o193m556J63j404O596P399K159j154L013J47j283K78k588m174
14852E93n256n938N524N060m721l553L430J892K581J141N380M658m374p738j533
14837b854N429K215q297J963N719m509q353m987J173O023K535j544N674L331k171
14822A347l168J449j1264n740R995J0484n05J367l849p582r0N156L508l63K58
14807A003P952J09q048m432O48J64N720J381j864m012k829p022J546O858M368
14792A542n504o73R918n441n358o838P825L489n26l880m938o509P136K011L275
14777d471L420M697J1334r12j0726p222P989P479K102J154l224j2424l012j37
$$ plain form
14763 -3953 2411 -862 -1833 -4049 -3749 -3685 -6928 -4506 -8906 -16419 -17384 -13208 -6845 -2851 2451 2249
14747 2249 1289 174 -5825 -8254 -11357 -4479 255 3570 -1568 -6791 -4691 -1619 -359 -3865 -8334
14732 -8334 -12341 -14144 -12406 -2103 331 -5316 913 7455 6143 2813 -7290 -7076 -3521 5469
14718 5469 7591 8118 3153 -2037 -1988 -182 -1628 2124 1356 4083 7394 1892 -1465 -3387 2799 1887
14702 1887 -827 -45 -3597 1595 8596 11076 11411 13410 9378 5224 6931 13042 11203 6035 -719
14687 -719 34 -3205 -434 2892 9662 12893 16561 20519 19959 19862 23701 23452 22280 25546 19105 10908
14671 10908 9336 5111 6700 10495 4143 10332 16132 14703 15517 19334 18486 10989 5490 2477 -33
14656 -33 5641 3993 5525 203 -5989 -12406 -11219 -9858 3073 9280 8661 9132 9781 16710 25603 37648
$$ packed form
14763c953O364l273r71k216L00O4l243K422m400p513r65M176O363L994N302k02
14747B249r60j115n999k429l103O878M734L315n138n223K100L072J260l506m469
14732h334m007j803J738J0303K434n647O229O542j312l330j0103K14L555Q990
14718E469K122N27m965n190M9J806j446L752p68K727L311n502l357j922O186r12
14702A887k714P82l552N192P001K480L35J999m032m154J707O111j839n168o754
14687g19P53l239K771L326O770L231L668L958n60r7L839k49j172L266o441q197
14671A0908j572m225J589L795o352O189N800j429Q14L817q48p497n499l013k510
14656c3N674j648J532n322o192o417J187J361J2931O207o19M71O49O929Q893J2045
$$ plain form
14640 37648 46522 55408 64545 69800 64770 50791 42734 36790 24787 12987 18337 17636 12184 13675
14626 13675 18882 21296 26067 28644 27823 20961 17097 13313 3167 3879 7662 4409 13859 11869 7950
14611 7950 10889 5745 4411 7098 7755 6791 7126 12968 25677 31818 47969 72755 89313 102793
14597 102793 102817 89210 64384 44052 34036 31458 31217 22419 15912 11003 9076 9802 17950 26242
14583 26242 16310 8438 18270 25593 21990 14651 10727 9020 7872 6622 11140 7699 5059 11445
14569 11445 11998 14116 16480 20258 20144 26519 28198 30640 41791 56646 71646 73819 66780 54289
14555 54289 42125 34481 21847 12175 8860 619 3852 7722 10431 8700 10188 12213 13331 10522
14541 10522 9902 11501 3660 -904 -2938 -4026 4411 11571 11734 16651 10744 8637 9994 15337 18124
$$ packed form
14640C7648Q874Q886R137N255n030j3979q057n944j2003j1800N350p01n452J491
14626A3675N207K414M771K577q21o862l864l784j0146P12L783l253R450j990l919
14611G950K939n144j334K687O57r64L35N842J2709O141J6151K4786J6558J3480
14597A02793K4j3607k4826k0332j0016k578k41q798o507m909j927P26Q148Q292
14583B6242r932p872R832P323l603p339l924j707j148j250M518l441k640O386
14569A1445N53K118K364L778j14O375J679K442J1151J4855J5000K173p039j2491
14555E4289j2164p644j2634r672l315q241L233L870K709j731J488K025J118k809
14541A0522o20J599p841m564k034j088Q437P160J63M917n907k107J357N343K787
$$ plain form
14526 18124 14026 9688 12687 7184 7821 11273 17403 23314 28542 28973 28693 20546 10264 9958 15042
14511 15042 1234 -4919 1233 5180 5838 2679 5964 5067 6885 4018 -156 1320 4794 6483 3051
14496 3051 -4423 -2177 2767 7761 5789 250 1624 8805 10400 15447 7265 5996 6459 12872 12986
14481 12986 8950 7084 5681 6866 6088 5299 566 -1890 -6984 -4374 -5787 -467 -1789 993 5231
14466 5231 10058 8161 4271 7363 2990 -2736 -4430 -6268 -8881 -6759 396 2034 810 4073 7452
14451 7452 3381 1355 482 1826 6434 3243 -4687 -1784 9597 11610 11770 13786 4628 -3036 -2131
14436 -2131 2061 -229 3093 2901 3516 600 2094 2177 -1657 1400 2061 3754 6763 7686 8045 5200
14420 5200 -2023 -6425 -8269 -9080 -613 9613 5846 2985 6460 5048 7003 5319 5337 5489 8268
$$ packed form
14526A8124m098m338K999n503O37L452O130N911N228M31k80q147j0282l06N084
14511A5042j3808o153O152L947O58l159L285q97J818k867m174J476L474J689l432
14496C051p474K246M944M994j972n539J374P181J595N047q182j269M63O413J14
14481A2986m036j866j403J185p78p89m733k456n094K610j413N320j322K782M238
14466E231M827j897l890L092m373n726j694j838k613K122P155J638j224L263L379
14451G452m071k026q73J344M608l191p930K903J1381K013J60K016r158p664R05
14436b131M192k290L322j92O15k916J494Q3l834L057O61J693L009R23L59k845
14420E200p223m402j844q11Q467J0226l767k861L475j412J955j684J8J52K779
$$ plain form
14405 8268 2625 254 3115 3561 2999 4981 4862 450 4684 4914 2768 -4661 -247 4665 3604 -316
14389 -316 -1055 -5897 -8316 -10862 -1359 2237 984 -739 -1042 -1344 -1099 3120 3227 2595 2090 1229 5437
14372 5437 14336 13621 12509 10983 12778 7005 -570 135 10115 9928 8665 6069 -1333 -7075 -8803
14357 -8803 -388 1845 -1430 290 308 4917 9791 12396 11104 12446 20123 21115 16011 14344 15423
14342 15423 9310 9199 4190 735 902 10916 2459 -5604 -4185 -15 -163 -3489 292 594 -1285
14327 -1285 -5487 -1134 -2623 -1124 3959 10007 8759 -1942 -9836 -4686 3718 7653 3577 -5488
14313 -5488 -12619 -17147 -10117 -9044 -4310 1256 -1630 1601 2476 3621 5416 6450 9939 10646 7946
14298 7946 3 -3701 -5422 -5794 -7827 -6686 1012 -627 -4023 -1599 3318 166 1577 4378 2622
$$ packed form
14405H268n643k371K861M46n62J982j19m412M234K30k146p429M414M912j061l920
14389c16p39m842k419k546R503L596j253j723l03l02K45M219J07o32n05q61M208
14372E437Q899p15j112j526J795n773p575P05R980j87j263k596p402n742j728
14357h803Q415K233l275J720J8M609M874K605j292J342P677R92n104j667J079
14342A5423o113j11n009l455J67J0014q457q063J419M170j48l326L781L02j879
14327a285m202M353j489J499N083O048j248j0701p894N150Q404L935m076r065
14313e488p131m528P030J073M734N566k886L231Q75J145J795J034L489P07k700
14298G946p943l704j721l72k033J141P698j639l396K424M917l152J411K801j756
$$ plain form
14283 2622 832 -7995 -5479 1240 127 4644 8448 3271 3327 4835 6722 8037 8275 8908 -2453
14268 -2453 -1815 1650 1912 4188 5191 723 -5449 -9705 -6931 -5735 2320 4116 829 178 3774
14253 3774 1031 -4163 -4945 -5033 -904 831 -3758 -7764 -8334 1576 5642 7041 5153 5768 6012 6367
14237 6367 10600 17610 20371 10170 2951 3072 3995 3045 -2442 -1327 8929 10574 6056 -3999 -7633
14222 -7633 -2602 -3273 -4449 -418 2442 884 -1301 -6602 -6142 5408 4865 3252 4471 4373 3078 -3187
14206 -3187 -1624 1654 5696 6450 7727 6763 -541 -489 -6061 -8798 -10723 -15196 -11154 -5900 -6794 -5183
14190 -5183 2036 2115 -4589 -10966 -11586 -6223 998 5604 3738 2908 5236 3955 2009 4378 8436 5614
14174 5614 -604 -2645 -569 -5444 -4885 -4840 -2336 5242 13226 10441 7705 8602 6897 5624 5885 8074
$$ packed form
14283B622j790q827K516O719j113M517L804n177N6J508J887J315K38O33j1361
14268b453O38L465K62K276J003m468o172m256K774J196Q055J796l287o51L596
14253C774k743n194p82q8M129J735m589m006n70R910M066J399j888O15K44L55
14237F367M233P010K761j0201p219J21R23r50n487J115J0256J645m518j0055l634
14222g633N031o71j176M031K860j558k185n301M60J1550n43j613J219r8j295o265
14206c187J563L278M042P54J277r64p304N2n572k737j925m473M042N254q94J611
14190e183P219P9o704o377o20N363P221M606j866q30K328j281j946K369M058k822
14174E614o218k041K076m875N59M5K504P578P984k785k736Q97j705j273K61K189
$$ plain form
14158 8074 11257 7686 1636 -2580 2131 4997 2734 -1156 -857 8810 12212 8889 4824 5025 9043
14143 9043 6950 4872 4195 3428 -814 1082 -3735 -2936 2913 2710 3815 7919 13287 17006 6951
14128 6951 -3253 -4833 -2658 -900 6703 13177 14023 11274 7426 7320 3310 4065 5179 3970 9772
14113 9772 17920 13909 5688 6249 7844 7320 2931 4268 4811 2198 -492 -173 833 368 6320 15267
14097 15267 9712 1735 397 460 3249 5363 2906 6168 5225 152 -1390 4506 12520 17581 18401
14082 18401 13354 5686 -3098 -1688 89 -4789 -5750 -6555 -5398 -2409 4422 2202 2919 3863 -1270
14067 -1270 -4476 -337 5941 -643 -3988 -1797 2800 -527 -3493 -3551 818 2452 240 1646 -2939
14052 -2939 -61 1030 4689 3297 -12 1234 4632 1796 -4180 1988 4019 6334 6379 97 3039
$$ packed form
14158H074L183l571o050m216M711K866k263l890K99R667L402l323m065K01M018
14143I043k093k078o77p67m242J896m817P99N849k03J105M104N368L719j0055
14128F951j0204j580K175J758P603O474Q46k749l848j06m010P55J114j209N802
14113I772Q148m011q221N61J595n24m389J337N43k613k690L19J006m65N952Q947
14097A5267n555p977j338O3K789K114k457L262r43n073j542N896Q014N061Q20
14082A8401n047p668q784J410J777m878r61q05J157K989O831k220P17R44n133
14067a270l206M139O278o584l345K191M597l327k966n8M369J634k212J406m585
14052b939K878J091L659j392l309J246L398k836n976O168K031K315M5o282K942
$$ plain form
14037 3039 1971 2797 3309 5060 -2701 -8872 1432 3307 7991 10836 7050 5529 7168 5599 8600
14022 8600 8012 5479 -985 447 2805 -107 2492 3215 443 -3267 -8036 -6100 -5334 -2880 -1717
14007 -1717 -4968 -3452 1533 -950 -438 3188 9328 15794 18019 13525 5526 4046 6775 9000 10223
13992 10223 17010 18876 10542 9567 2683 4486 5414 2325 -1250 377 4869 9738 6669 5389 13925
13977 13925 17420 14170 7391 10070 14014 9472 12010 17693 9586 3350 463 4449 11334 13760
13963 13760 15325 15606 13670 18638 17998 17565 20426 26915 29269 29749 35238 40616 48013 53115 64863
13948 64863 87341 104384 110346 104558 85941 65689 40508 26966 23615 22488 22004 26252 20123
13935 20123 12335 10923 16852 20716 21947 20738 18454 19129 19167 11714 9458 7685 -1114 969 3406
$$ packed form
14037C039j068Q26N12J751p761o171J0304J875M684K845l786j521J639j569L001
14022H600n88k533o464J432K358k912K599P23k772l710m769J936P66K454J163
14007a717l251J516M985k483N12L626O140O466K225m494p999j480K729K225J223
13992A0223O787J866q334r75o884J803R28l089l575J627M492M869l069j280Q536
13977A3925L495l250o779K679L944m542K538N683q107o236k887L986O885K426
13963A3760J565K81j936M968o40m33K861O489K354M80N489N378P397N102J1748
13948F4863K2478J7043N962n788j8617k0252k5181j3542l351j127m84M248o129
13935B0123p788j412N929L864J231j209k284O75L8p453k256j773q799K083K437
$$ plain form
13920 3406 5832 11396 10954 4578 7071 3459 3662 1402 -562 5329 4681 100 1349 1733 1704 6564
13904 6564 3629 733 2742 8456 14878 13468 12894 15342 11617 6895 792 -102 4937 3686 6446
13889 6446 7898 7286 10809 11127 12054 13298 18488 11953 2327 6273 11335 10138 9033 8767 6909 8013
13873 8013 3566 1134 70 2321 -3410 -6377 -4720 -3096 -5845 2016 6052 8617 11756 16266 14210
13858 14210 10289 8480 5291 6320 6178 8196 10942 10445 4675 6959 7871 12916 12956 8977 5509 6694
13842 6694 -19 -78 -604 2076 3097 1432 729 -1986 -4139 1564 769 1636 -2667 -2772 4674 5075 4980
13825 4980 -358 -1964 4457 3764 7288 12170 13512 11414 8519 8481 10314 12925 15836 16805 17157 20342
13809 20342 21861 15930 8352 6334 4537 3295 -3337 -429 8323 11831 9312 7389 14745 11784
$$ packed form
13920C406K426N564m42o376K493l612K03k260j964N891o48m581J249L84k9M860
13904F564k935k896K009N714O422j410n74K448l725m722o103q94N039j251K760
13889F446J452o12L523L18R27J244N190o535r626L946N062j197j105k66j858J104
13873H013m447k432j064K251n731k967J657J624k749P861M036K565L139M510k056
13858A4210l921j809l189J029j42K018K746m97n770K284R12N045M0l979l468J185
13842F694o713n9n26K680J021j665p03k715k153N703p95Q67m303j05P446M01r5
13825D980n338j606O421o93L524M882J342k098k895l8J833K611K911R69L52L185
13809B0342J519n931p578k018j797j242o632K908Q752L508k519j923P356k961
$$ plain form
13795 11784 9081 13405 15066 11664 11534 12970 14845 13830 8535 12687 11885 15524 14941 7669 11526
13780 11526 16282 13375 15328 17604 25385 22560 17493 17017 15949 18735 21566 18875 13453 5547 271
13765 271 -2479 6803 16382 19667 18897 19112 19038 14828 12061 14889 18758 11295 15693 18468 8723 -2305
13749 -2305 -546 6631 9833 9114 1653 -575 1922 3400 3909 4200 9927 17320 18261 14112 7245 4190
13733 4190 10042 14068 11911 17887 19158 16948 11647 7740 10040 8472 2692 -846 -589 5296 9425
13718 9425 14320 13631 9658 8860 12011 11887 9884 11166 10856 8670 10714 11675 11689 4723 1058 940 12986
13701 12986 20420 20290 17696 15153 11778 18401 21416 15145 16840 13741 17623 21534 24230 22296 18858
13686 18858 12114 11925 9407 12813 15094 14593 13961 18862 19833 22315 24569 24191 18953 19163 24197 25022
$$ packed form
13795A1784k703M324J661l402j30J436J875j015n295M152q02L639n83p272L857
13780A1526M756k907J953K276P781k825n067m76j068K786K831k691n422p906n276
13765B71k750R282R579L285p70K15p4m210k767K828L869p463M398K775r745j1028
13749b305J759P177L202p19p461k228K497J478N09K91N727P393R41m149o867l055
13733D190N852M026k157N976J271k210n301l907K300j568n780l538K57N885M129
13718I425M895o89l973p98L151j24k003J282l10k186K044R61J4o966l665j18J2046
13701A2986P434j30k594k543l375O623L015o271J695l099L882L911K696j934l438
13686A8858o744j89k518L406K281n01o32M901R71K482K254l78n238K10N034Q25
$$ plain form
13670 25022 16528 17171 13014 14995 16653 15694 15493 12382 9824 5867 7266 10623 12687 17776 20536
13655 20536 18800 18990 15864 18767 14470 6822 7017 13838 23480 21926 17639 18411 19301 21976 29498
13640 29498 25361 24356 21679 20986 19514 15063 7221 1207 5623 10328 10545 17219 14358 10447 11066
13625 11066 9481 10549 11607 11309 5475 -445 11776 22990 32127 34334 23488 21234 20255 19010
13611 19010 14861 12242 18642 17395 12916 11684 15961 23765 27803 29233 29527 24844 25874 17000 15057
13596 15057 23189 32978 31794 31161 29954 30483 33672 32909 26614 22746 14926 15937 18182 20896 23051
13581 23051 20005 18214 26723 28281 28805 27406 20545 13599 8031 11056 12647 5376 -1747 3295 1962
13566 1962 3870 18137 23663 18600 19540 20504 17593 14617 10884 18388 24848 17637 25141 34372 39113
$$ packed form
13670B5022q494O43m157J981J658r59k01l111k558l957J399L357K064N089K760
13655B0536j736J90l126K903m297p648J95O821R642j554m287P72Q90K675P522
13640B9498m137j005k677o93j472m451p842o014M416M705K17O674k861l911O19
13625A1066j585J068J058k98n834n920J2221J1214R137K207j0846k254r79j245
13611A9010m149k619O400j247m479j232M277P804M038J430K94m683J030q874j943
13596A5057Q132R789j184o33j207N29L189p63o295l868p820J011K245K714K155
13581B3051l046j791Q509J558N24j399o861o946n568L025J591p271p123N042j333
13566A962J908J4267N526n063R40R64k911k976l733P504O460p211P504R231M741
$$ plain form
13551 39113 40392 53393 61634 56661 52345 41976 29891 15036 14867 17919 17911 22431 32821 32647
13537 32647 22571 15603 14624 15948 21856 35214 39633 42307 39033 31144 25918 28990 31410 34345
13523 34345 35797 33503 28374 32501 37935 39673 46860 53271 57205 59223 65346 76478 85561 85199
13509 85199 75178 66524 63248 56512 46767 40252 43384 53216 54028 55998 59765 61571 69848 84222
13495 84222 84761 91330 98030 110804 124822 137332 145349 153265 174351 209103 246431 300485 382680
13482 382680 507784 705262 1000743 1426769 1933485 2341830 2412856 2057727 1504800 1021910
13472 1021910 691662 488376 366839 280817 212438 176865 148281 120737 109500 101188 92114
13461 92114 80030 67112 63216 63002 62393 60175 54780 49975 53619 55613 50967 49419 51442 58177
$$ packed form
13551C9113J279J3001Q241m973m316j0369j2085j4855j69L052qM520J0390j74
13537C2647j0076o968r79J324N908J3358M419K674l274p889n226L072K420K935
13523C4345J452k294n129M127N434J738P187O411L934K018O123J1132R083l62
13509H5199j0021q654l276o736r745o515L132R832Q12J970L767J806Q277J4374
13495H4222N39O569O700J2774J4018J2510Q017P916K1086L4752L7328N4054Q2195
13482C82680J25104J97478K95481M26026N06716M08345P1026l55129n52927m82890
13472A021910l30248k03286j21537q6022o8379l5573k8584k7544j1237q312r074
13461I2114j2084j2918l896k14o09k218n395m805L644J994m646j548K023O735
$$ plain form
13447 58177 64676 67156 57315 55887 59349 56156 51647 43795 51188 55528 51355 41090 36168 36889
13433 36889 38736 35518 39390 38180 32787 28835 24299 21715 24267 26307 26512 30837 28137 30321 31319
13418 31319 28951 35650 40111 39334 40080 42880 44949 43454 43453 40594 38908 34280 28188 24090 27424 32877
13402 32877 34469 29796 26381 23439 28707 33506 34705 38455 43572 40668 36146 29791 31720 36122
13388 36122 33759 34472 35508 30400 31898 36719 39922 42005 38926 36004 43191 53737 57336 63364
13374 63364 59389 58777 48972 39193 36338 33885 30035 30648 32348 37425 40545 31812 28745 31045 31762
13359 31762 30450 28017 28462 25341 27877 34468 33473 24696 23788 25145 25727 27068 26605 15623 7201
13344 7201 1454 1378 240 2745 9020 6239 9487 19731 22996 35109 42934 46353 47182 44276 37770
$$ packed form
13447E8177O499K480r841j428L462l193m509p852P393M340m173j0265m922P21
13433C6889J847l218L872j210n393l952m536k584K552K040K05M325k700K184R98
13418C1319k368O699M461p77P46K800K069j495jk859j686m628o092m098L334N453
13402C2877J592m673l415k942N268M799J199L750N117k904m522o355J929M402
13388C6122k363P13J036n108J498M821L203K083l079k922P187J0546L599O028
13374F3364l975o12r805r779k855k453l850O13J700N077L120q733l067K300P17
13359C1762j312k433M45l121K536O591r95q777r08J357N82J341m63j0982q422
13344G201n747p6j138K505O275k781L248J0244L265J2113P825L419Q29k906o506
$$ plain form
13329 37770 40637 39951 44699 56561 59902 65338 76254 77392 72536 71365 64961 65706 67461 67191 66655
13314 66655 73646 86279 96506 106979 106338 100694 90766 87092 87528 98929 118379 144279 172019
13301 172019 203900 235006 253983 270217 283993 280876 251879 226386 202948 171724 140498 122450
13289 122450 105878 98756 96687 95105 99401 105808 116585 119698 117453 106417 98911 93966 91539
13276 91539 92643 90356 89698 93869 95057 94682 107855 112188 114372 121557 132649 136963 130723 127227
13262 127227 115204 101525 92040 84632 79306 82762 90194 94646 96819 93570 92539 98777 101723 100878
13248 100878 96748 94308 91597 90853 83623 65385 56731 64052 80166 106224 131497 151957 166922
13235 166922 177505 176317 144462 99543 73141 53078 45558 43106 46832 61267 69517 72173 71126
$$ packed form
13329C7770K867o86M748J1862L341N436J0916J138m856j171o404P45J755k70n36
13314F6655O991J2633J0227J0473o41n644r928l674M36J1401J9450K5900K7740
13301A72019L1881L1106J8977J6234J3776l117k8997k5493k3438l1224l1226j8048
13289A22450j6572p122k069j582M296O407J0777L113k245j1036p506m945k427
13276I1539J104k287o58M171J188l75J3173M333K184P185J1092M314o240l496
13262A27227j2023j3679r485p408n326L456P432M452K173l249j031O238K946q45
13248A00878m130k440k711p44p230j8238q654P321J6114K6058K5273K0460J4965
13235A66922J0583j188l1855m4919k6402k0063p520k452L726J4435Q250K656j047
$$ plain form
13222 71126 70245 67393 68932 72776 68303 53040 43278 41468 48303 49728 46821 34823 33067 39914
13208 39914 55363 77309 91690 99626 97006 96346 100523 110544 125148 142859 153883 152046 135116
13195 135116 114593 110198 121092 135181 138621 137749 125002 114574 111497 107497 106920 123900 132648
13182 132648 136380 144203 153474 159409 183757 210497 247488 321840 416475 521783 606539 673699
13170 673699 721803 744258 698920 579617 431323 337581 285160 255189 243849 233174 221707
13159 221707 217871 203651 196379 192394 177867 165104 142107 131697 132270 147190 169102 177172 185577
13146 185577 190232 208771 221805 230964 237766 240573 251038 263524 275710 277613 275132 271603 273897
13133 273897 272764 277789 286872 298603 320876 341647 357220 369722 376300 388225 401410 414880
$$ packed form
13222G1126q81k852J539L844m473j5263r762j810O835J425k907j1998j756O847
13208C9914J5449K1946J4381P936k620o60M177J0021J4604J7711J1024j837j6930
13195A35116k0523m395J0894J4089L440q72j2747j0428l077m000n77J6980Q748
13182A32648L732P823R271N935K4348K6740L6991P4352R4635J05308Q4756O7160
13170F73699M8104K2455m5338j19303j48294r3742n2421k9971j1340j0675j1467
13159B21707l836j4220p272l985j4527j2763k2997j0410N73J4920K1912Q070Q405
13146A85577M655J8539J3034R159O802K807J0465J2486J2186J903k481l529K294
13133B73897j133N025R083J1731K2273K0771J5573J2502O578J1925J3185J3470
$$ plain form
13121 414880 418413 417211 415007 406735 402244 422979 449619 481569 503454 516083 519376 531321 547271
13108 547271 547907 555404 565217 581229 606954 638500 668250 715023 765775 827504 891043 955754
13096 955754 1018529 1083831 1157100 1228046 1293938 1359490 1429720 1499716 1574801 1666235 1784381
13085 1784381 1929386 2084737 2278418 2551956 2940789 3486148 4188419 4920243 5407780
13076 5407780 5450269 5178038 4993689 5154480 5653173 6329700 6909380 7164557 7156581 7197317
13066 7197317 7530068 8216276 9230803 10515883 12012520 13649579 15375366 17160768
13058 17160768 19018720 21044367 23401401 26354885 30270058 35723902 43580898 54952867
13050 54952867 71600919 96823252 136013358 196002482 278860983 367912715 426828707
$$ packed form
13121D14880L533j202k204q272m491K0735K6640L1950K1885J2629L293J1945J5950
13108E47271O36P497R813J6012K5725L1546K9750M6773N0752O1729O3539O4711
13096I55754O2775O5302P3269P0946O5892O5552P0230O9996P5085R1434J18146
13085A784381J45005J55351J93681K73538L88833N45359P02271P31824M87537
13076E407780M2489k72231j84349J60791M98693O76527N79680K55177p976M0736
13066G197317L32751O86208J014527J285080J496637J637059J725787J785402
13058A7160768J857952K025647K357034K953484L915173N453844P856996J1371969
13050E4952867J6648052K5222333L9190106N9989124Q2858501Q9051732N8915992
$$ plain form
13043 426828707 421552173 349893034 251783522 169611834 114691935 80432311 58808207
13036 58808207 44544265 34642862 27486295 22171551 18103928 14926041 12454796 10561222
13028 10561222 9135862 8067547 7251402 6606723 6122324 5777816 5528611 5356227 5292656
13019 5292656 5404047 5658585 5903674 5885073 5455802 4782262 4217720 3952200 3998534 4234837
13009 4234837 4393967 4216026 3654468 2982962 2439265 2048702 1780415 1599258 1466952
13000 1466952 1360825 1264972 1181875 1107691 1043956 993763 958817 930305 904171 879990 866029
12989 866029 855276 853106 848718 850531 836996 816183 788529 756849 720776 679749 639761 611594
12977 611594 591425 564573 537460 526734 524626 515315 501571 487470 465753 444353 421533 402270
$$ packed form
13043D26828707n276534p1659139r8109512q2171688n4919899l4259624k1624104
13036E8808207j4263942r901403p156567n314744m067623l177887k471245j893574
13028A0561222j425360j068315q16145o44679m84399l44508k49205j72384o3571
13019E292656J11391K54538K45089j8601m29271o73540n64542k65520M6334K36303
13009D234837J59130j77941n61558o71506n43697l90563k68287j81157j32306
13000A466952j06127r5853q3097p4184o3735n0193l4946k8512k6134k4181j3961
12989H66029j0753k170m388J813j3535k0813k7654l1680l6073m1027l9988k8167
12977F11594k0169k6852k7113j0726k108r311j3744j4101k1717k1400k2820j9263
$$ plain form
12965 402270 386891 385556 398466 403998 393811 376105 371787 366800 357262 351631 348488 346149 340280
12952 340280 330516 314143 305722 300328 304743 299735 292875 295761 314876 326611 324243 314853 313661
12939 313661 322086 333865 337834 339872 331837 317275 296494 273906 271059 273281 266650 256503 259891
12926 259891 287322 303463 308568 314469 292627 252124 188321 108904 10356 -82400 -104424 -36947
12914 -36947 97286 258607 415948 550944 640149 662542 621063 532826 432128 350833 294281
12903 294281 256124 228435 201058 177051 157158 135548 116902 102283 96856 94766 96827 90608
12891 90608 75045 67891 69365 71808 83181 93460 100930 101211 93677 89404 95943 105660 117093 128080
12877 128080 130960 122685 119941 118910 115196 114021 113124 100560 87200 76174 64984 66305 65702 62840
$$ packed form
12965D02270j5379j335J2910N532j0187j7706m318m987r538n631l143k339n869
12952C40280r764j6373q421n394M415n008o860K886J9115J1735k368r390j192
12939C13661Q425J1779L969K038q035j4562k0781k2588k847K222o631j0147L388
12926B59891K7431J6141N105N901k1842m0503o3803p9417r8548r2756k2024O7477
12914c6947J34233J61321J57341J34996Q9205K2393m1479q8237j00698q1295n6552
12903B94281l8157k7689k7377k4007j9893k1610j8646j4619n427k090K061o219
12891I0608j5563p154J474K443J1373J0279P470K81p534m273O539R717J1433J0987
12877A28080K880q275k744j031l714j175q97j2564j3360j1026j1190J321o03k862
$$ plain form
12863 62840 64240 73219 79909 95389 106151 100833 94141 63539 10904 -36361 -49061 -43141 -27807
12850 -27807 -8774 13322 23267 32861 43390 46018 40330 30100 26715 27338 30641 27506 19469 15563
12836 15563 17775 18960 21804 14662 9604 14739 19450 24595 20959 12608 4564 -8193 -11422 -16776
12822 -16776 -20455 -15467 -12225 -10042 1094 6790 13191 17921 21123 19999 15587 12467 5876 -3219
12808 -3219 136 -269 889 4333 7150 7055 2391 4417 15212 24127 30626 40900 49745 51221 45250
12793 45250 36075 25996 15211 5190 6079 6886 12765 19546 25819 24559 23294 25895 22736 26972
12779 26972 26269 22696 10157 6722 2109 1468 6873 8122 2770 -4884 -3475 2520 7599 4549 -845
12764 -845 235 6416 14986 16191 18283 25310 22178 16120 19489 15716 9818 19146 33466 37313 39634
$$ packed form
12863F2840J400Q979O690J5480J0762n318o692l0602n2635m7265j2700N920J5334
12850b7807J9033K2096R945R594J0529K628n688j0230l385O23L303l135q037l906
12836A5563K212J185K844p142n058N135M711N145l636q351q044j2757l229n354
12822a6776l679M988L242K183J1136N696O401M730L202j124m412l120o591r095
12808c219L355m05J158L444K817r5m664K026J0795Q915O499J0274Q845J476n971
12793D5250r175j0079j0785j0021Q89Q07N879O781O273j260j265K601l159M236
12779B6972p03l573j2539l435m613o41N405J249n352p654J409N995N079l050n394
12764h45J080O181Q570J205K092P027l132o058L369l773n898R328J4320L847K321
$$ plain form
12749 39634 51133 53357 52238 57545 56451 51904 51308 46627 37310 36301 31529 23019 26290 33519
12735 33519 30691 27476 27975 26826 33025 36303 32790 22132 19730 13946 4129 7167 11718 20278
12721 20278 28099 23962 21963 18435 20760 15718 10739 5937 1782 2935 -75 -1422 -7703 -5303
12707 -5303 4654 10214 14770 15311 10773 2103 3566 4657 3783 6706 12956 16153 20241 18266 19059
12692 19059 23302 24596 22455 13183 10300 14095 19798 23757 16906 12494 5268 5329 6801 1224 -156
12677 -156 6601 10039 5417 -2145 234 7218 11620 2974 -3277 2685 7481 7301 9342 14453 13908
12662 13908 12814 12826 19364 24222 20755 19490 17767 10522 9257 13662 9824 4580 8757 1784 5099
12647 5099 10173 10363 4424 748 6841 10893 16194 16109 24712 36403 31916 31976 32433 33543 38420 35194
$$ packed form
12749C9634J1499K224j119N307j094m547n96m681r317j009m772q510L271P229
12735C3519k828l215M99j149O199L278l513j0658k402n784r817L038M551Q560
12721B0278P821m137j999l528K325n042m979m802m155J153l010j347o281K400
12707e303R957N560M556N41m538q670J463J091q74K923O250L197M088j975P93
12692A9059M243J294k141r272k883L795N703L959o851m412p226O1J472n577j380
12677a56O757L438m622p562K379O984M402q646o251N962M796j80K041N111n45
12662A3908j094J2O538M858l467j265j723p245j265M405l838n244M177o973L315
12647E099N074J90n939l676O093M052N301q5Q603J1691m487O0M57J110M877l226
$$ plain form
12631 35194 35619 33700 29970 25772 28484 36071 42027 54429 66795 69066 76480 86925 111253 136150
12617 136150 147002 159616 186476 220357 267456 327144 415401 568868 801362 1152434 1630414
12606 1630414 2128070 2415763 2293347 1820315 1272332 850896 578626 403793 297873
12597 297873 228122 181334 145537 113555 93350 80903 73514 71583 66233 56782 50675 43962 44441
12584 44441 42219 35248 23887 11203 680 -534 -1151 -1279 -5201 -4296 -132 2603 2424 19 -6243
12569 -6243 -4693 157 -2333 -1370 4420 6767 6686 7566 11387 7961 -4322 -12013 -11012 -3655 3619
12554 3619 6962 16507 14094 7320 5130 550 -4106 992 2371 -2841 -1568 -229 1513 -4171 -9796
12539 -9796 -9804 -10588 -11076 -13116 -15634 -6387 -987 2023 2996 3127 7560 7217 4568 -81 -3606 487 3201
$$ packed form
12631C5194M25j919l730m198K712P587N956J2402J2366K271P414J0445K4328K4897
12617A36150J0852J2614K6860L3881M7099N9688Q8257J53467K32494L51072M77980
12606A630414M97656K87693j22416m73032n47983m21436k72270j74833j05920
12597B97873o9751m6788l5797l1982k0205j2447p389j931n350r451o107o713M79
12584D4441k222o971j1361j2684j0523j214o17j28l922R05M164K735j79k405o262
12569f243J550M850k490R63N790K347q1Q80L821l426j2283p691J001P357P274
12554C619L343R545k413o774k190m580m656N098J379n212J273J339J742n684n625
12539i796qp84m88k040k518R247N400L010R73J31M433l43k649m649l525M093K714
$$ plain form
12522 3201 6276 5614 4358 3011 9997 12000 9909 4969 3705 2667 -2930 -2425 -2708 -2675 -10020 -10604
12506 -10604 -7869 -7374 3131 6695 10989 10896 4957 -2880 -2385 -1426 -1336 -4263 -667 1022 -876 -485
12490 -485 -2107 -1291 3567 8215 6292 2986 -6686 -10130 -13424 -18010 -15062 -12979 -3995 -3545 -2635 -1153
12474 -1153 2814 6708 9498 1628 -501 1692 4326 2608 -604 835 -2684 -901 2691 5413 10952
12459 10952 11878 8976 7466 14430 16738 8727 3668 204 2860 8039 10992 10030 8870 9651 5274
12444 5274 5625 1313 2004 6877 6129 3414 6420 8029 12498 12529 10530 12154 12244 8914 7207 1584
12428 1584 2619 4354 1778 2500 -129 -2794 -4822 2522 2307 -607 -3098 -1338 1335 175 -1811
12413 -1811 -945 -1381 -3142 3277 3855 -485 -83 -1472 -5833 -7741 -3508 394 5622 5686 5326 8223
$$ packed form
12522C201L075o62j256j347O986K003k091m940j264j038n597N05k83L3p345n84
12506a0604K735M95J0505L564M294r3n939p837M95R59R0k927L596J689j898L91
12490d85j622Q16M858M648j923l306r672l444l294m586K948K083Q984M50R10J482
12474a153L967L894K790p870k129K193K634j718l212J439l519J783L592K722N539
12459A0952R26k902j510O964K308q011n059l464K656N179K953r62j160P81m377
12444E274L51m312O91M873p48k715L006J609M469L1j999J624R0l330j707n623
12428A584J035J735k576P22k629k665k028P344k15k914k491J760K673j160j986
12413a811Q66m36j761O419N78m340M02j389m361j908M233L902N228O4l60K897
$$ plain form
12397 8223 3719 4799 7185 18585 31228 34278 36466 39223 26801 13883 844 -8268 -7918 2359
12383 2359 4799 4522 5676 4715 8365 5918 6468 5454 446 -2056 3359 4538 2857 2879 2579 3510
12367 3510 3194 6433 6858 4419 4640 5740 8520 3735 2400 5506 4151 -2009 -2569 -7265 -1947 5126
12351 5126 5052 9135 5948 617 269 4200 2391 3745 881 -2028 -3701 -3781 -4977 -6769 -5191 -3637
12335 -3637 -9440 -5365 -2603 -6928 -3886 -4570 -4489 456 7781 4437 2769 -3125 -2135 -2081 -7436 -9493
12319 -9493 -4202 -6137 -6224 -1988 -2963 -2824 1479 4371 -579 -2281 -6438 -8922 -2795 -3084 -5480 -1353
12303 -1353 300 -1957 2611 4815 105 -5716 -5592 -1898 -1339 -3875 -5251 -5943 1202 3397 -5456
12288 -5456 -7225 -3469 -1301 -3192 -12 -1186 990 1563 -8390 -6149 -4323 -75 2464 1599 -319
$$ packed form
12397H223m504J080K386J1400J2643L050K188K757j2422j2918j3039r112L50J0277
12383B359K440k77J154r61L650k447N50j014n008k502N415J179j681K2l00R31
12367C510l16L239M25k439K21J100K780m785j335L106j355o160n60m696N318P073
12351E126p4M083l187n331l48L931j809J354k864k909j673q0j196j792J578J554
12335c637n803M075K762m325L042o84Q1M945P325l344j668n894R90N4n355k057
12319i493N291j935q7M236r75J39M303K892m950j702m157k484O127k89k396M127
12303a353J653k257M568K204m710n821J24L694N59k536j376o92P145K195q853
12288e456j769L756K168j891L180j174K176N73r953K241J826M248K539q65j918
$$ plain form
12273 -319 -5542 -5301 -1385 -6751 -7137 -3778 -1942 -5097 -7517 -14346 -11858 -5465 -1149 -221 4481 4816
12257 4816 5351 8580 9346 10617 4572 -514 -3516 -2736 -3851 -5510 266 9116 6807 -5481 -8970
12242 -8970 -5519 -3592 -3298 -2943 -975 991 -975 3011 5817 5643 1396 1107 700 -5537 -9313 -5936
12226 -5936 -5334 -4341 -3247 3412 15583 14598 5966 -255 -649 9358 10246 6490 5242 2340 -975
12211 -975 15 2115 7216 18023 15838 7505 9378 7097 5329 6015 3030 1869 814 -894 1685
12196 1685 2828 1944 6196 1182 3549 2994 -177 2797 9287 9134 7157 4169 6939 3826 -1673
12181 -1673 -5900 -1207 1509 -493 -6285 -6158 -2000 1368 -2376 -90 -2436 -3069 -4384 -4355 -7570 -2252
12165 -2252 2276 -1166 -7399 -12145 -10326 -8209 -6310 -922 -172 4322 -2027 -671 4191 4965 -3758
$$ packed form
12273c19n223K41L916n366l86L359J836l155k420o829K488O393M316R28M702L35
12257D816N35L229P66J271o045n086l002P80j115j659N776Q850k309j2288l489
12242h970L451J927K94L55J968J966j966L986K806j74m247k89m07o237l776L377
12226e936O02R93J094O659J2171r85q632o221l94J0007Q88l756j248k902l315
12211i75R90K100N101J0807k185q333J873k281j768O86k985j161j055j708K579
12196A685J143q84M252n014K367n55l171K974O490j53j977k988K770l113n499
12181a673m227M693K716k002n792J27M158L368l744K286k346o33j315K9l215N318
12165b252M528l442o233m746J819K117J899N388P50M494o349J356M862P74q723
$$ plain form
12150 -3758 -3545 -2013 -3384 -1677 3851 3029 6404 6590 -926 -4382 -878 966 2734 2861 2132 6500
12134 6500 6340 5509 -1745 -4656 526 2457 -1064 -340 4691 2918 5452 5095 7853 8790 3853 -4166
12118 -4166 1232 283 -6760 -10307 -11828 -5658 1627 3745 -1543 -1852 -103 -2290 -3193 -2969 -6940 -8039
12102 -8039 -8877 -5080 -2375 -3423 -3008 -6149 -7038 2323 7488 11010 13717 4806 1496 -4265 -8419
12087 -8419 -5767 -504 -5500 -3995 1187 796 -1213 -1307 1167 -303 3157 5357 2950 3895 1874 -339
12071 -339 -6599 -12082 -8820 -3114 -5976 -6342 -5037 -3724 -4611 -4120 -4556 -800 -924 -2129 -2423 -986
12055 -986 6487 8718 4597 4549 2790 -90 13 -5958 -6313 2115 5335 1214 3295 12395 16328 13686
12039 13686 12874 12470 8135 6131 7008 10273 2932 3426 5091 1620 6470 8109 5728 3633 5336
$$ packed form
12150c758K13J532j371J707N528q22L375J86p516l456L504J844J768J27p29M368
12134F500j60q31p254k911N182J931l521P24N031j773K534l57K758R37m937q019
12118d166N398r49p043l547j521O170P285K118n288l09J749k187r03K24l971j099
12102h039q38L797K705j048M15l141q89R361N165L522K707q911l310n761m154
12087h419K652N263m996J505N182l91k009r4K474j470L460K200k407R45k021k213
12071c39o260n483L262N706k862l66J305J313q87M91m36L756j24j205k94J437
12055i86P473K231m121m8j759k880J03n971l55Q428L220m121K081R100L933k642
12039A3686q12m04m335k004Q77L265p341M94J665l471M850J639k381k095J703
$$ plain form
12024 5336 5103 7515 12678 17270 18817 18262 17545 21273 39124 58614 89802 132478 177055 198971
12010 198971 178796 124208 77913 47750 29057 17271 12083 15871 21983 22342 13716 7804 3197
11997 3197 -936 2464 9827 12408 13094 6806 4533 5636 6363 4029 2931 5431 -4856 -4063 3625
11982 3625 1711 -1697 -5528 -10615 -8663 -7801 -548 3332 -1626 -2380 -1818 -1741 603 4086 5067 4734
11966 4734 7141 9803 3215 1611 2268 2055 -2029 159 4670 3728 6916 14644 15428 12234 20816 19759
11950 19759 18828 19291 14492 14605 12943 12936 12303 9496 3962 4011 5188 14706 12331 9785 2926 -22 -2785
11933 -2785 1551 5730 8070 11567 10595 779 -4406 -3565 847 -2960 -3811 -3359 3840 3130 3128 4295 2125
11916 2125 2196 6073 10710 10508 11817 7500 5593 5990 6287 -1549 -2311 -1785 1557 3186 6485 -2890
$$ packed form
12024E336k33K412N163M592J547n55p17L728J7851J9490L1188M2676M4577K1916
12010A98971k0175n4588m6295l0163j8693j1786n188L788O112L59q626n912m607
11997C197m133L400P363K581O86o288k273J103P27k334j098K500j0287P93P688
11982C625j914l408l831n087J952Q62P253L880m958p54N62P7K344L483R81l33
11966D734K407K662o588j604O57k13m084K188M511r42L188P728P84l194Q582j057
11950A9759r31M63m799J13j662po33k807n534M9J177R518k375k546o859k948k763
11933b785M336M179K340L497r72r816n185Q41M412l807q51M52P199p10kJ167k170
11916B125P1L877M637k02J309m317j907L97K97p836p62N26L342J629L299r375
$$ plain form
11900 -2890 -9773 -13543 -14736 -6810 -528 1649 6226 5344 1660 3189 7196 5667 2492 1261 4044
11885 4044 4773 8124 1858 -2190 -5347 -6430 -3613 -3150 -5044 -2385 -1755 -190 -4531 -7122 1045
11870 1045 8201 991 -2039 5411 10981 4185 -4298 -6044 -2175 913 2196 8241 9524 9991 10476
11855 10476 8057 3205 943 1017 -538 59 100 -4545 -5542 -1351 -7943 -6205 -38 -103 8301 4340
11839 4340 -801 3611 11972 8330 5777 11792 6936 3052 -3331 -4331 -2891 -2269 -2632 -5124 -9340
11824 -9340 -5949 -7092 -5683 -3667 1235 5379 5163 961 -3897 -4218 -8591 -3731 -4493 -3663 -13 6039
11808 6039 8246 9887 13042 5275 -1691 -1352 -4656 3829 3002 1104 1280 1909 758 -948 -7779 -13065
11792 -13065 -11335 -4639 -3309 -1763 1036 7184 2295 -1958 165 3241 2521 4212 10894 12457 10435
$$ packed form
11900b890o883l770j193P926O282K177M577q82l684J529M007j529l175j231K783
11885D044P29L351o266m048l157j083K817M63j894K659O30J565m341k591Q167
11870A045P156p210l030P450N570o796q483j746L869L088J283O045J283M67M85
11855A0476k419m852k262P4j555N97M1m645r97M191o592J738O167o5Q404l961
11839D340n141M412Q361l642k553O015m856l884o383j000J440O22l63k492m216
11824i340L391j143J409K016M902M144k16m202m858l21m373M860p62Q30L650O052
11808F039K207J641L155p767o966L39l304Q485q27j898J76O29j151j706o831n286
11792a3065J730O696J330J546K799O148m889m253K123L076p20J691O682J563k022
$$ plain form
11777 10435 7140 9539 12619 13746 15403 10955 8020 5893 1637 -1587 -3359 2648 13208 14303
11763 14303 4024 -3719 526 6058 5901 4361 17 -4599 -1601 -1249 -2223 -5012 -2022 3938 5652
11748 5652 4764 1807 5844 824 3605 8140 8471 6462 553 -4678 -7488 -5972 -6754 -5926 -6418 -3289
11732 -3289 1096 1968 7750 11995 6040 805 -3072 5086 7686 7033 11029 3305 -840 -400 -506 -7630
11716 -7630 -10293 -4115 1039 5434 6010 7414 4356 3563 4411 588 -4717 306 3732 -1650 -3631
11701 -3631 -8720 -13092 -6003 -8392 -4168 2003 -1492 -1475 1843 -3112 -4585 -9196 -4281 951 -4546
11686 -4546 1727 3610 -1071 -1826 -3050 -1659 2827 3519 -992 -2744 1409 2300 -1393 -4115 -9462
11671 -9462 -2693 -1576 4376 2755 -5400 -2361 5351 7243 5369 3834 -970 23 3720 1063 878
$$ packed form
11777A0435l295K399L080J127J657m448k935k127m256l224j772O007J0560J095
11763A4303j0279p743M245N532j57j540m344m616K998L52r74k789K990N960J714
11748E652q88k957M037n020K781M535L31k009n909n231k810J516p82Q28m92L129
11732c289M385Q72N782M245n955n235l877Q158K600o53L996p724m145M40j06p124
11716g630k663O178N154M395N76J404l058p93Q48l823n305N023L426n382j981
11701c631n089m372P089k389M224O171l495J7L318m955j473m611M915N232n497
11686d546O273J883m681p55j224J391M486O92m511j752M153Q91l693k722n347
11671i462O769J117N952j621q155L039P712J892j874j535m804R93L697k657j85
$$ plain form
11656 878 8842 11597 7908 6631 11646 12874 10133 6475 5466 7105 8306 5873 -41 -285 2741
11641 2741 3506 7622 17211 22674 17371 12345 6433 8140 7202 1866 -5285 -4525 1453 3178 1654
11626 1654 -7641 -6105 4514 8682 9955 7635 9295 10728 6713 2728 6575 649 -5224 -801
11612 -801 3204 7988 4665 8050 10408 7910 1318 1113 11102 13375 10181 11343 10655 1678 -2046
11597 -2046 204 5303 7759 4913 -3093 -7350 -2500 520 -3566 -10023 -2835 -4567 -10121 -5733 900
11582 900 2742 6525 7840 11369 10694 8704 7040 12814 10928 6244 1455 2466 2962 1681 -5836
11567 -5836 -1228 4114 3405 3187 6304 2313 5735 12051 15056 6661 3480 11406 16981 13487 8415
11552 8415 4861 -3870 -3285 1522 3392 -207 -187 -1234 6869 8884 10791 8430 2850 4967 4219 1906
$$ packed form
11656H78P964K755l689j277N015J228k741l658j009J639J201k433n914k44L026
11641B741P65M116R589N463n303n026n912J707r38n336p151P60N978J725j524
11626A654r295J536J0619M168J273k320J660J433m015l985L847n926n873M423
11612h01M005M784l323L385K358k498o592k05R989K273l194J162o88q977l724
11597b046K250N099K456k846q006m257M850L020m086o457P188j732n554M388O633
11582I00J842L783J315L529o75j990j664N774j886m684m789J011M96j281p517
11567e836M608N342p09k18L117l991L422O316L005q395l181P926N575l494n072
11552H415l554q731N85M807J870l599K0j047Q103K015J907k361n580K117p48k313
$$ plain form
11536 1906 5420 8216 14593 12944 4496 1635 -1416 3765 6102 6964 10590 16202 17612 11709 4631
11521 4631 4323 4584 5085 6410 8987 9629 6906 5419 5741 1216 3185 1466 2500 1326 -705 4613
11505 4613 5354 7565 13717 11376 13122 9315 5972 893 -3393 4530 10939 8157 6970 5652 5476
11490 5476 9877 7947 2005 2917 2902 4622 1454 -5306 -5818 -6067 -4003 4318 9279 8555 9410 2639
11474 2639 -489 -5039 -9227 -8284 -1468 9302 10455 6452 8215 14300 12655 13813 15033 12863 5898
11459 5898 3733 5431 4971 10338 13858 16730 14056 10357 17747 13294 6142 5326 4389 3913 5360 9058
11443 9058 4810 3564 6556 -2667 -3898 3100 -286 -1655 -2790 -2276 116 3385 7505 12529 10756
11428 10756 12494 9360 9524 10080 12227 11135 11420 14987 17202 13761 8770 8161 12683 11377 4446
$$ packed form
11536A906L514K796O377j649q448k861l051N181K337Q62L626N612J410n903p078
11521D631l08K61N01J325K577O42k723j487L22m525J969j719J034j174k031N318
11505D613P41K211O152k341J746l807l343n079m286P923O409k782j187j318j76
11490E476M401j930n942R12j5J720l168o760n12k49K064Q321M961p24Q55o771
11474B639l128m550m188R43O816J0770J153m003J763O085j645J158J220k170o965
11459E898k165J698m60N367L520K872k674l699P390m453p152q16r37m76J447L698
11443I058m248j246K992r223j231O998l386j369j135N14K392L269M120N024j773
11428A0756J738l134J64N56K147j092K85L567K215l441m991o09M522j306o931
$$ plain form
11413 4446 1830 2034 8190 16377 15968 9136 12078 12752 8240 2342 6558 9141 10667 -2407 -6793
11398 -6793 -5105 -1363 -6400 -9175 -7184 -5557 -4959 -3210 1927 9967 6630 3728 6722 13220 15334
11383 15334 17941 15832 11617 11780 13688 14208 7217 10226 15131 18871 11253 4649 -855 3236 11665
11368 11665 14529 16836 12236 7071 7214 6765 15372 17465 18944 18636 15156 13353 14789 14068 12280
11353 12280 7682 4254 5454 4082 643 2809 15056 23045 22785 17285 12694 8986 6259 12026
11339 12026 13143 8631 10212 11137 14427 20459 16614 11806 14922 19789 19145 20128 15623 14340 6643
11324 6643 3847 4630 16303 17867 15786 15948 11205 17009 21674 21949 15935 9511 9062 9370 9829 6545
11308 6545 -3958 -209 11224 6281 5775 15412 13403 7923 6500 1685 4619 5707 5442 7766 8353
$$ packed form
11413D446k616K04O156Q187m09o832K942O74m512n898M216K583J526j3074m386
11398f793J688L742n037k775J991J627N98J749N137Q040l337k902K994O498K114
11383A5334K607k109m215J63J908N20o991L009M905L740p618o604n504M091Q429
11368A1665K864K307m600n165J43m49Q607K093J479l08l480j803J436p21j788
11353A2280m598l428J200j372l439K166J2247P989k60n500m591l708k727N767
11339A2026J117m512J581R25L290O032l845m808L116M867o44R83m505j283p697
11324F643k796P83J1673J564k081J62m743N804M665K75o014o424m49L08M59l284
11308F545j0503L749J1433m943n06R637k009n480j423m815K934J088k65K324N87
$$ plain form
11293 8353 5445 9735 12426 11683 9860 10520 14390 14557 9127 9710 10001 11553 17403 17146 15492 9614
11277 9614 10984 13222 14203 9602 10927 6708 2788 805 6128 11403 7297 4540 8950 10094 9439
11262 9439 9734 11901 13273 16237 24168 28152 22158 12958 10250 13467 15237 11811 8758 3818 3184
11247 3184 8352 11369 15085 13986 8091 4878 1174 -4802 -3057 374 182 56 2926 8577 7069
11232 7069 7287 9159 18173 20739 14602 14795 12152 9341 10402 17977 18798 18447 13958 8670 10823 11728
11216 11728 8107 12882 15276 13702 13196 8525 7369 8401 9579 7475 16581 19611 21656 25490 26205
11201 26205 25559 21952 14025 15738 19804 23736 28628 23984 22743 18356 11118 6198 7527 13213 14798
11186 14798 15864 12207 20570 21290 20821 14499 13968 18111 23843 21420 21145 15716 11331 6142 7030 12388
$$ packed form
11293H353k908M290K691p43j823O60L870J67n430N83K91J552N850k57j654n878
11277I614J370K238R81m601J325m219l920j983N323N275m106k757M410J144o55
11262I439K95K167J372K964P931L984n994r200k708L217J770l426l053m940o34
11247C184N168L017L716j099n895l213l704n976J745L431j92j26K870N651j508
11232G069K18J872R014K566o137J93k643k811J061P575Q21l51m489n288K153R05
11216A1728l621M775K394j574n06m671j156J032J178k104R106L030K045L834P15
11201B6205o46l607p927J713M066L932M892m644j241m387p238m920J329N686J585
11186A4798J066l657Q363P20m69o322n31M143N732k423k75n429m385n189Q88N358
$$ plain form
11170 12388 14563 10070 7256 11864 18708 16575 23578 23904 17026 12254 9551 10287 14017 17488 23674
11155 23674 21389 13619 13324 11164 8335 7960 11860 12721 10173 10078 8784 8656 9107 13497 13942 12598
11139 12598 7073 2725 -2124 -2138 5258 7931 16511 21724 18529 8427 3329 5848 10991 14171 15885
11124 15885 21091 19214 19390 16302 12143 18343 24277 27340 22789 17473 18546 20994 20526 13391 3965
11109 3965 2854 8122 9610 9971 14839 19569 15803 14626 20256 21312 17996 11950 9027 13265 16387
11094 16387 15768 15464 13877 15558 16659 16574 12653 11300 9374 15814 19028 13769 15488 19988 26522
11079 26522 29077 31948 28015 25681 25113 23257 27883 35850 30080 28490 29937 32980 33904 34402 31018
11064 31018 32694 28675 19803 15513 23012 30824 35114 29223 22489 20231 13839 14885 19106 23479
$$ packed form
11170A2388K175m493k814M608O844k133P003L26o878m772k703P36L730L471O186
11155B3674k285p770k95k160k829l75L900Q61k548r5j294j28M51M390M45j344
11139A2598n525m348m849j4P396K673Q580N213l195j0102n098K519N143L180J714
11124A5885N206j877J76l088m159O200N934L063m551n316J073K448m68p135r426
11109C965j111N268J488L61M868M730l766j177N630J056l316o046k923M238L122
11094A6387o19l04j587J681J101q5l921j353j926O440L214n259J719M500O534
11079B6522K555K871l933k334n68j856M626P967n770j590J447L043R24M98l384
11064C1018J676m019q872m290P499P812M290n891o734k258o392J046M221M373
$$ plain form
11050 23479 17452 5017 7127 21579 29792 22765 20220 27337 31434 27764 31965 37835 31111 27761
11036 27761 24514 19262 16406 11601 25468 35550 35741 31221 27707 21005 18999 22958 27086 26637
11022 26637 25159 25124 22165 22374 17604 18607 18304 16500 13891 7918 7982 11487 16626 17786 19585 24875
11006 24875 29642 26303 28709 30206 28541 26416 26473 31335 30990 30724 29110 28901 31671 30973 26903 24342
10990 24342 22029 24505 30574 34792 34782 27127 28792 33481 37597 35460 39349 42220 40961 34698 33733
10975 33733 37759 40551 44418 42917 37271 32967 34008 37583 40138 42838 44707 36252 31313 33817
10961 33817 29793 29470 36172 37503 34146 29472 28010 28580 31283 34815 38836 41974 41943 41151 49794 55477
10945 55477 62370 62469 65204 70956 75043 65959 61260 60692 56831 64471 65622 55494 52612 51306 44671
$$ packed form
11050B3479o027j2435K110J4452Q213p027k545P117M097l670M201N870o724l350
11036B7761l247n252k856m805J3867J0082J91m520l514o702k006L959M128m49
11022B6637j478l5k959K09m770J003l03j804k609n973O4L505N139J160J799N290
11006B4875M767l339K406J497j665k125N7M862l45k66j614k09K770o98m070k561
10990B4342k313K476O069M218j0p655J665M689M116k137L889K871j259o263r65
10975C3733M026K792L867j501n646m304J041L575K555K700J869q455m939K504
10961C3817m024l23O702J331l357m674j462N70K703L532M021L138l1p92Q643N683
10945E5477O893R9K735N752M087r084m699n68l861P640J151j0128k882j306o635
$$ plain form
10930 44671 38397 37272 38171 42153 45229 43615 43149 41396 38462 39122 46773 54589 58515 55784 47314
10915 47314 50436 49764 49058 52406 55154 58025 62496 71812 75379 75602 80055 78518 80099 81445 71727
10900 71727 62102 57973 54179 58221 54831 45570 38630 30557 33572 36839 44262 47063 44048 41565
10886 41565 41575 46329 50032 53313 55313 58055 53150 51733 53039 52612 53494 59353 54985 52542 47807
10871 47807 43945 44061 45579 45339 47906 56770 61104 72006 73471 79137 92252 95125 106518 119392
10857 119392 131175 146564 159962 176539 189729 205825 230735 255425 289947 328546 383443
10846 383443 472484 603906 811431 1132403 1569673 2011497 2212420 2070862 1799086 1656475
10836 1656475 1744096 1991951 2169394 2041346 1618774 1146556 790322 557913 412611 322554
$$ packed form
10930D4671o274j125Q99L982L076j614m66j753k934O60P651P816L926k731q470
10915D7314L122o72p06L348K748K871M471R316L567K23M453j537J581J346r718
10900G1727r625m129l794M042l390r261o940q073L015L267P423K801l015k483
10886D1565J0M754L703L281K000K742m905j417J306m27Q82N859m368k443m735
10871D7807l862J16J518k40K567Q864M334J0902J465N666J3115K873J1393J2874
10857A19392J1783J5389J3398J6577J3190J6096K4910K4690L4522L8599N4897
10846C83443Q9041J31422K07525L20972M37270M41824K00923j41558k71776j42611
10836A656475Q7621K47855J77443j28048m22572m72218l56234k32409j45302r0057
$$ plain form
10826 322554 264953 226708 196740 165505 140491 123333 114997 107703 107116 100260 96185 98912 88921
10813 88921 76161 71254 70722 72295 70977 71857 67461 65294 66560 60109 55940 58169 57449 52039 52461
10798 52461 55681 59336 57313 54923 50887 50316 58029 60088 55894 55725 57780 56939 54191 51900 52036
10783 52036 56775 61750 63718 63947 65515 71671 72345 69729 64520 59131 59086 65958 67579 67481 71594 68809
10767 68809 63280 71870 73703 72542 70713 69302 62449 61873 66266 64685 61002 62317 60788 54576 47296
10752 47296 46577 50389 58012 58776 60114 55704 49881 45646 51887 58180 57338 45147 37375 35830 35658
10737 35658 36194 31698 24029 22172 20835 19749 22132 30555 36057 39052 39648 32948 37107 43597 50106
10722 50106 60761 68577 75233 82372 88878 97153 96710 88363 92076 106240 121381 132635 130803 126594
$$ packed form
10826C22554n7601l8245k9968l1235k5014j7158q336p294n87o856m075K727r991
10813H8921j2760m907n32J573j318Q80m396k167J266o451m169K229p20n410M22
10798E2461L220L655k023k390m036n71P713K059m194j69K055q41k748k291J36
10783E2036M739M975J968K29J568O156O74k616n209n389m5O872J621r8M113k785
10767F8809n529Q590J833j161j829j411o853n76M393j581l683J315j529o212p280
10752D7296p19L812P623P64J338m410n823m235O241O293q42j2191p772j545j72
10737C5658N36m496p669j857j337j086K383Q423N502K995N96o700M159O490O509
10722E0106J0655P816O656P139O506Q275m43q347L713J4164J5141J1254j832m209
$$ plain form
10708 126594 120802 125101 129954 132222 129713 133158 136663 134375 135607 147381 160294 177932 199426
10695 199426 220666 231570 242627 256757 284308 311425 320238 329981 340845 332258 325268 328200
10683 328200 314673 279577 251300 221935 190866 176234 173472 176914 179148 178880 168619 157304
10671 157304 151112 150933 153706 153309 151701 152257 157182 158636 155963 164817 167754 170496 177495 178460 174997
10656 174997 173770 172796 169439 174711 176819 180488 176575 165371 153051 137595 139244 147336 153454 154843
10642 154843 151217 144678 142117 146359 151204 146639 131307 122158 131579 146402 162548 176830 189146
10629 189146 204561 221681 212174 176233 161174 167579 179500 185514 178732 156557 129914 112853
10617 112853 110358 109418 115467 123567 127375 124656 116699 106595 104693 105292 100414 89097 81642 79439
$$ packed form
10708A26594n792M299M853K268k509L445L505k288J232J1774J2913J7638K1494
10695A99426K1240J0904J1057J4130K7551K7117Q813R743J0864q587o990K932
10683C28200j3527l5096k8277k9365l1069j4632k762L442K234k68j0261j1315
10671A57304o192j79K773l97j608N56M925J454k673Q854K937K742O999R65l463
10656A74997j227r74l357N272K108L669l913j1204j2320j5456J649Q092O118J389
10642A54843l626o539k561M242M845m565j5332r149R421J4823J6146J4282J2316
10629A89146J5415J7120r507l5941j5059O405J1921O014o782k2175k6643j7061
10617A12853k495r40O049Q100L808k719p957j0104j902N99m878j1317p455k203
$$ plain form
10603 79439 77816 79057 89870 99945 104127 107754 114728 118703 124306 140824 167505 187871 185275
10590 185275 166812 156089 151230 168583 204717 228088 226271 209632 187238 182379 190382 202526
10578 202526 216060 230788 230933 221009 220490 227120 241339 266457 301907 355287 422764 503168 584480
10565 584480 654721 732814 789079 804283 784258 749889 732114 743253 775164 771336 718198 611726
10553 611726 498727 424225 384444 363581 352494 336112 317576 299920 288303 296516 310565
10542 310565 312211 302997 291606 284884 285912 302907 327879 348103 363763 374455 385627 393855
10530 393855 399318 409663 421073 428626 436267 452726 472241 484108 500129 511911 511670 520072 538611
10517 538611 560026 578356 610092 626715 636658 646278 655409 673274 698055 714949 733453 745201
$$ packed form
10603G9439j623J241J0813J0075M182L627O974L975N603J6518K6681K0366k596
10590A85275j8463j0723m859J7353L6134K3371j817j6639k2394m859Q003J2144
10578B02526J3534J4728J45r924n19O630J4219K5118L5450N3380O7477Q0404Q1312
10565E84480P0241P8093N6265J5204k0025l4369j7775J1139L1911l828n3138j06472
10553F11726j12999p4502l9781k0863j1087j6382j8536j7656j1617Q213J4049
10542C10565J646r214j1391o722J028J6995K4972K0224J5660J0692J1172Q228
10530C93855N463J0345J1410P553P641J6459J9515J1867J6021J1782k41Q402J8539
10517E38611K1415J8330L1736J6623R943R620R131J7865K4781J6894J8504J1748
$$ plain form
10505 745201 753799 775291 806662 835340 857984 872348 884182 902018 932962 969832 1010571 1053002
10493 1053002 1097106 1155138 1213885 1277792 1348052 1420638 1505885 1597714 1685449 1773044 1866418
10482 1866418 1964986 2065163 2170037 2289725 2417693 2546087 2680603 2840048 3021107 3226063
10472 3226063 3449536 3679310 3896127 4106973 4358304 4670458 5045703 5481117 5972960
10463 5972960 6541044 7258273 8179461 9363052 10807520 12356936 13822892 15304294 17104829
10454 17104829 19386073 22047618 24736889 27123883 29354811 32032200 35701143 40672982
10446 40672982 47231069 55762638 67246230 83995789 109706613 149448230 209019204
10439 209019204 286997943 359674070 388811351 360772628 310607037 284473954 299925730
$$ packed form
10505G45201Q598K1492L1371K8678K2644J4364J1834J7836L0944L6870M0739M2431
10493A053002M4104N8032N8747O3907P0260P2586Q5247R1829Q7735Q7595R3374
10482A866418R8568J00177J04874J19688J27968J28394J34516J59445J81059K04956
10472C226063K23473K29774K16817K10846K51331L12154L75245M35414M91843
10463E972960N68084P17229R21188J183591J444468J549416J465956J481402J800535
10454A7104829K281244K661545K689271K386994K230928K677389L668943M971839
10446D0672982O558087Q531569J1483592J6749559K5710824L9741617N9570974
10439B09019204P7978739P2676127K9137281k8038723n0165591k6133083J5451776
$$ plain form
10432 299925730 343670284 375649460 356430634 286538999 205545107 142148199 99917602
10425 99917602 73125538 56024098 44820448 37005852 30975860 26067040 22250764 19569496
10417 19569496 17914806 16884075 15792241 14201008 12405035 10936130 9984251 9437596
10409 9437596 8981790 8299724 7359415 6397894 5580562 4945202 4463695 4091546 3776546
10400 3776546 3494371 3222429 2967064 2744859 2576349 2444543 2341571 2246906 2144502 2033299
10390 2033299 1915594 1821019 1739608 1671214 1612161 1552523 1500691 1458391 1422912 1395118 1368415
10379 1368415 1340837 1309979 1277346 1252382 1227349 1202901 1168309 1134210 1099786 1067909 1032127
10368 1032127 990652 949729 914421 884865 858757 827580 799427 772888 746491 723450 710792
$$ packed form
10432B99925730M3744554L1979176j9218826o9891635q0993892o3396908m2230597
10425I9917602k6792064j7101440j1203650p814596o029992m908820l816276k681268
10417A9569496j654690j030731j091834j591233j795973j468905r51879n46655
10409I437596m55806o82066r40309r61521q17332o35360m81507l72149l15000
10400C776546k82175k71942k55365k22205j68510j31806j02972r4665j02404j11203
10390B033299j17705r4575q1411o8394n9053n9638n1832m2300l5479k7794k6703
10379A368415k7578l0858l2633k4964k5033k4448l4592l4099l4424l1877l5782
10368A032127m1475m0923l5308k9556k6108l1177k8153k6539k6397k3041j2658
$$ plain form
10357 710792 695387 679517 655440 630127 614708 607002 598500 592651 585291 576835 572938 557051 543448
10344 543448 531170 524263 517972 513284 508607 499258 492502 484307 482134 483865 482272 481575 487404 495684
10330 495684 496008 491542 482435 464350 445213 439341 444241 443399 431937 417151 406009 402439 398473
10317 398473 393273 383721 371689 339878 272449 180511 84028 17462 27648 76862 107732 85167
10305 85167 9806 -63887 -83839 -44323 35102 108883 150894 170473 173708 179178 191582 194788
10293 194788 186308 182328 175453 160910 153128 163561 167825 150159 129640 110816 107278 128138 159180
10280 159180 170848 158299 137732 122455 125363 137343 156883 170991 172963 169113 171913 174762
10268 174762 172835 178895 181331 178909 175897 173127 163243 160789 154800 149689 148046 144025 138383 132578
$$ packed form
10357G10792j5405j5870k4077k5313j5419p706q502n849p360q456l897j5887j3603
10344E43448j2278o907o291m688m677r349o756q195k173J731j593o97N829Q280
10330D95684L24m466r107j8085j9137n872M900q42j1462j4786j1142l570l966
10317C98473n200r552j2032l1811o7429r1938r6483o6566J0186M9214L0870k2565
10305H5167p5361p3693j9952L9516P9425P3781M2011J9579L235N470J2404L206
10293A94788q480l980o875j4543p782J0433M264j7666k0519j8824l538K0860L1042
10280A59180J1668j2549k0567j5277K908J1980J9540J4108J972l850K800K849
10268A74762j927O060K436k422l012k770r884k454n989n111j643m021n642n805
$$ plain form
10254 132578 127264 126762 131037 127591 117512 90554 59571 44402 40982 42182 53601 59977 40838
10241 40838 14539 4174 14194 22676 29829 32826 41779 50112 54977 48128 42475 45211 39079 43296
10227 43296 45520 35252 20376 20340 32504 37488 31877 22245 12690 2183 -4440 -9574 -7015 -4932
10213 -4932 -2372 -17231 -30469 -26014 -20576 -21479 -14766 -8237 -8454 -4844 1798 5823 4755 4676 8478
10198 8478 10999 17905 9575 1997 139 8802 20250 29032 34839 36042 44942 52000 45215 36325
10184 36325 40646 46060 41770 44107 48758 37232 29957 26249 24594 22091 22832 22223 21628 17823 10280
10169 10280 10910 19167 26827 33550 25322 15718 15979 14552 15638 14911 14868 17759 20212 22448 27360 35104
10153 35104 34731 28827 21338 23783 28939 31287 29344 33620 46933 53731 51191 48068 50296 50977 59219
$$ packed form
10254A32578n314n02M275l446j0079k6958l0983j5169l420J200J1419O376j9139
10241D0838k6299j0365J0020Q482P153K997Q953Q333M865o849n653K736o132M217
10227D3296K224j0268j4876l6J2164M984n611r632r555j0507o623n134K559K083
10213d932K560j4859j3238M455N438r03O713O529k17L610O642M025j068p9L802
10198H478K521O906q330p578j858Q663J1448Q782N807J203Q900P058o785q890
10184C6325M321N414m290K337M651j1526p275l708j655k503P41o09n95l805p543
10169A0280O30Q257P660O723q228r604K61j427J086p27m3K891K453K236M912P744
10153C5104l73n904p489K445N156K348j943M276J3313O798k540l123K228O81Q242
$$ plain form
10138 59219 69934 76447 78787 77401 72949 64424 53764 53068 58678 54562 44609 40096 39515 41071
10124 41071 46122 44731 40704 40657 38265 40453 44012 49319 52112 52705 48734 41783 39965 40448 37397
10109 37397 35774 34540 26516 30887 30377 24912 22012 15200 12696 11800 15348 12242 10124 15843 22767
10094 22767 25524 22918 20851 22208 23801 21862 20693 21623 20722 25959 29031 30188 33609 29243 27274
10079 27274 22252 22079 33511 35646 29285 27374 34560 32897 35317 36319 35542 33245 32137 37547 39526
10064 39526 34489 30181 27348 32979 39893 46765 52850 57811 62054 60001 57311 67468 78274 88208
10050 88208 92539 94921 91942 98506 109241 121784 135673 146220 157062 171063 188936 210236
10038 210236 233761 268960 313631 381164 487760 653310 909538 1279013 1732174 2098512
$$ packed form
10138E9219J0715O513K340j386m452q525j0660o96N610m116r953m513n81J556
10124D1071N051j391m027m7k392K188L559N307K793N93l971o951j818M83l051
10109C7397j623j234q024M371n10n465k900o812k504q96L548l106k118N719O924
10094B2767K757k606k067J357J593j939j169R30r01N237L072J157L421m366j969
10079B7274n022j73J1432K135o361j911P186j663K420J002p77k297j108N410J979
10064C9526n037m308k833N631O914O872O085M961M243k053k690J0157J0806R934
10050H8208M331K382k979O564J0735J2543J3889J0547J0842J4001J7873K1300
10038B10236K3525L5199M4671O7533J06596J65550K56228L69475M53161L66338
$$ plain form
10028 2098512 2161496 1940680 1694151 1629972 1796511 2038978 2102434 1846833 1391116 968241
10018 968241 668388 474511 353743 272924 219448 187783 169412 147016 130714 122507 117452
10007 117452 119414 115482 111423 103493 87615 81049 78604 84856 76746 66134 59332 57405 57472 52992
9993 52992 45791 40161 36682 32037 25926 25566 28408 27548 24493 29442 32617 31331 28710 37600 40539
9978 40539 37051 33865 36406 34471 29656 23620 17491 13787 4681 -730 3535 2560 12 -1796 2481
9963 2481 -4771 -7270 3402 12124 11373 14581 21176 17973 26834 29734 28521 21797 14916 22711 36441
9948 36441 38358 32695 28672 20064 13828 18950 27230 32730 38448 41743 35382 31864 26861 22427 23201
9933 23201 27572 33688 32021 35271 38498 35532 39005 31745 32586 40892 43587 48427 49116 37640 33992
$$ packed form
10028B098512O2984k20816k46529o4179J66539K42467O3456k55601m55717m22875
10018I68241k99853j93877j20768q0819n3476l1665j8371k2396j6302q207n055
10007A17452J962l932m059p930j5878o566k445O252q110j0612o802j927O7m480
9993E2992p201n630l479m645o111l60K842q60l055M949L175j286k621Q890K939
9978D0539l488l186K541j935m815o036o129l704r106n411M265r75k548j808M277
9963B481p252k499J0672Q722p51L208O595l203Q861K900j213o724o881P795J3730
9948C6441J917n663m023q608o236N122Q280N500N718L295o361l518n003m434P74
9933B3201M371O116j667L250L227k966L473p260Q41Q306K695M840O89j1476l648
$$ plain form
9918 33992 45010 55322 61480 65354 61135 59456 63242 66477 64798 65355 66999 70027 66971 69883
9904 69883 70396 66271 64251 63537 70213 73840 76119 75167 75051 69041 70204 78141 81711 81917 85562 99806
9888 99806 105702 107252 107831 102776 106643 112801 116832 117520 126222 136248 145268 157282 162121 158132 161997
9873 161997 167714 172474 182398 191249 198036 205437 216384 226186 233553 244074 250214 254294 266566 287977
9859 287977 302201 312580 325223 341679 357139 376895 391934 406634 431267 452983 481191 509671
9847 509671 525108 539670 556261 576232 600051 624170 659508 692798 723384 750153 780692 809901
9835 809901 843975 886507 918986 947550 974375 1004447 1027681 1041334 1053608 1068647 1075878 1084596
9823 1084596 1083727 1077160 1072746 1056116 1042932 1028484 1001823 973034 947102 916710 887244 853935
$$ packed form
9918C3992J1018J0312O158L874m219j679L786L235j679N57J644L028l056K912
9904F9883N13m125k020p14O676L627K279r52j16o010J163P937L570K06L645J4244
9888I9806N896J550N79n055L867O158M031O88Q702J0026R020J2014M839l989L865
9873A61997N717M760R924Q851O787P401J0947R802P367J0521O140M080J2272K1411
9859B87977J4224J0379J2643J6456J5460J9756J5039J4700K4633K1716K8208K8480
9847E09671J5437J4562J6591J9971K3819K4119L5338L3290L0586K6769L0539K9209
9835H09901L4074M2532L2479K8564K6825L0072K3234J3653J2274J5039P231Q718
9823A084596q69o567m414j6630j3184j4448k6661k8789k5932l0392k9466l3309
$$ plain form
9811 853935 822702 788360 752138 719680 687601 656165 624392 595558 573816 553577 524150 498439
9799 498439 470721 450916 431239 408022 386733 367605 355031 344128 326718 316997 299826 285701
9787 285701 276527 266229 257066 243093 231790 223646 210082 202578 192573 187921 185287 176904 165921
9774 165921 154933 149625 151804 146251 138051 135100 129707 128946 129607 121949 119761 122009 118209 107314
9760 107314 95250 84552 82786 85576 84251 80304 80551 79681 79393 79547 79045 82881 86793 81369 78527
9745 78527 73208 64081 60792 62501 61568 56808 50029 52504 64254 70129 62514 54598 50155 49027 52880
9730 52880 57406 55510 51864 45057 42821 36011 35440 31712 30363 37334 47233 48107 43941 41344 40332
9715 40332 40078 30758 29000 29516 35201 37738 35438 35710 34706 33818 34428 25554 20097 21628 25607 23103
$$ packed form
9811H53935l1233l4342l6222l2458l2079l1436l1773k8834k1742k0239k9427k5711
9799D98439k7718j9805j9677k3217k1289j9128j2574j0903j7410r721j7171j4125
9787B85701r174j0298r163j3973j1303q144j3564p504j0005m652k634q383j0983
9774A65921j0988n308K179n553q200k951n393p61O61p658k188K248l800j0895
9760A07314j2064j0698j766K790j325l947K47q70k88J54n02L836L912n424k842
9745G8527n319r127l289J709r33m760o779K475J1750N875p615p916m443j128L853
9730E2880M526j896l646o807k236o810n71l728j349O971R899Q74m166k597j012
9715D0332k54r320j758N16N685K537k300K72j004q88O10q874n457J531L979k504
$$ plain form
9699 23103 20357 19403 24463 21331 21157 24836 22322 20519 22359 26838 21837 13619 10927 9181 11189
9684 11189 18053 18643 23399 26950 20817 15088 17487 13200 16283 26136 25767 24264 23005 24557 15066
9669 15066 10153 9259 12950 18923 16686 16114 18876 17361 12033 6405 6385 8797 1310 -5579 -10170 -10206
9653 -10206 -190 7110 5145 3805 8465 11244 15126 18329 11164 4173 366 -3469 4117 5398
9639 5398 4750 3455 3588 5247 7267 17390 12590 9310 6334 8520 7658 9867 2314 -1374 5428
9624 5428 5830 7158 7965 7476 3049 4018 3207 365 944 5237 9241 9371 5668 3930 2257 6756 16285
9607 16285 23107 16842 8779 6121 8012 12914 13006 10854 6644 4908 4526 9690 12122 11428 13077 5461
9591 5461 6915 5386 713 6261 14044 19144 15225 8713 1725 703 4821 8623 11305 14758 6885
$$ packed form
9699B3103k746r54N060l132j74L679k514j803J840M479n001q218k692j746K008
9684A1189O864N90M756L551o133n729K399m287L083R853l69j503j259J552r491
9669A5066m913q94L691N973k237n72K762j515n328n628k0K412p487o889m591l6
9653a0206J0016P300j965j340M660K779L882L203p165o991l807l835P586J281
9639E398o48j295J33J659K020J0123m800l280k976K186q62K209p553l688O802
9624E428M02J328Q07m89m427R69q11k842N79M293M004J30l703j738j673M499R529
9607A6285O822o265q063k658J891M902R2k152m210j736l82N164K432o94J649p616
9591E461J454j529m673N548P783N100l919o512o988j022M118L802K682L453p873
$$ plain form
9576 6885 2247 -626 772 8328 5447 2890 2139 4816 8742 10902 8239 4220 1678 5216 3434
9561 3434 179 -7310 -9486 -3860 -3929 -7848 -10676 -7886 3371 3443 -3534 5132 5146 -1037 471 2346
9545 2346 3179 4483 -2950 -4155 -5995 -8711 -9342 -14529 -15672 -11899 -9037 -12736 -11568 -9076 -6159
9530 -6159 -6895 -4238 -4953 222 10254 3634 3168 -560 -3760 -5404 -11967 -11865 -4698 245 4933 4779
9514 4779 2218 7219 7163 7568 11653 8147 8050 11610 8082 1676 -3074 -3961 -3379 -719 -6942 -11024 -7091
9497 -7091 -10809 -8208 -560 -613 -5470 -12579 -11535 -4489 -1598 -3769 -853 -1288 -4683 -4686 -7700 -6564
9481 -6564 -971 1131 1824 4061 7372 7866 10464 10152 14120 16471 14486 12804 11510 16091 21087 17927
9465 17927 8931 -3226 -10403 -5139 -2198 971 -800 -3912 -6398 -7248 -1537 -2499 -3357 1719 1702 2326
$$ packed form
9576F885m638k873J398P556k881k557p51K677L926K160k663m019k542L538j782
9561C434l255p489k176N626o9l919k828K790J1257P2o977Q666J4o183J508J875
9545B346Q33J304p433j205j840k716o31n187j143L773K862l699J168K492K917
9530f159p36K657p15N175J0032o620m66l728l200j644o563J02P167M943M688j54
9514D779k561N001n6M05M085l506r7L560l528o406m750q87N82K660o223m082L933
9497g091l718K601P648n3m857p109J044P046K891k171K916m35l395ll014J136
9481f564N593K102O93K237L311M94K598l12L968K351j985j682j294M581M996l160
9465A7927q996j2157p177N264K941L169j771l112k486q50N711r62q58N076j7O24
$$ plain form
9449 2326 9233 14779 12545 8972 8020 11679 5964 6482 7232 4015 10107 8453 -2405 -15276 -15865
9434 -15865 -6908 1465 7374 9752 10403 8706 15381 8191 1384 -2590 -8329 -3926 -4276 3098 1400
9419 1400 -4650 -2861 2692 1179 -1544 -192 -157 1129 -2310 -2541 -5619 -6933 -11474 -13381 -7919 -4340
9403 -4340 2140 8517 11024 9239 7080 8211 10302 4777 4698 6176 11279 9739 1607 -1813 -1576 -6156
9387 -6156 -2340 -3313 834 2484 -242 -5267 -9563 -6298 2665 1555 2377 -178 2882 5048 3519
9372 3519 2838 -1269 -878 -585 -828 -1013 -4373 -4685 -4183 -3012 -4618 -1886 -6003 -6247 1175 3375 1228
9355 1228 223 -301 1616 7047 7634 5857 7535 6827 -8 -3625 -5364 -1821 -295 488 3963 5249
9339 5249 1798 -7981 -7568 -62 3903 4082 363 -7180 -8157 -1548 -2553 -4886 -6108 -7902 -9008 -766
$$ packed form
9449B326O907N546k234l573r52L659n715N18P50l217O092j654j0858j2871n89
9434a5865Q957Q373N909K378O51j697O675p190o807l974n739M403l50P374j698
9419A400o050J789N553j513k723J352L5J286l439k31l078j314m541j907N462L579
9403d340O480O377K507j785k159J131K091n525p9J478N103j540q132l420K37m580
9387f156L816r73M147J650k726n025m296L265Q963j110Q22k555L060K166j529
9372C519o81m107L91K93k43j85l360l12N02J171j606K732m117k44P422K200k147
9355A228j005n24J917N431N87j777J678p08o835l617j739L543J526P83L475J286
9339E249l451r779M13P506L965J79l719p543r77O609j005k333j222j794j106Q242
$$ plain form
9323 -766 3488 7410 3284 -1600 -6075 -3684 3301 2305 3118 -1553 -8105 -14242 -18619 -13455 -9527 -8958
9307 -8958 -2512 409 594 3666 11585 10659 8156 -1675 -5006 -2294 -319 3840 7057 4732 -4698
9292 -4698 -5163 -2809 1827 1118 -1960 -13065 -17440 -12341 -6680 -5722 180 6155 14717 12319 7982
9277 7982 5164 5670 11486 14666 11921 9831 8813 3028 -3498 -3761 -6344 -12404 -11606 -9396 -9145 142
9261 142 -1221 -2406 4444 6406 551 -5068 -12915 -11512 -7904 -5385 -1498 1490 -6680 -6350 -4894
9246 -4894 2628 11344 5037 -2727 -4515 -6052 -444 2538 1276 11633 8939 5596 2002 1756 1250
9231 1250 2570 -2106 -1308 -333 1047 2343 -2792 -7231 -7157 -5244 -771 3866 9704 6079 5277 206
9215 206 4914 3515 3042 -112 -7211 -11086 -9495 -3142 -2403 -5068 -8183 -5347 -7132 -10803 -8725 -10508
$$ packed form
9323g66M254L922m126m884m475K391O985r96Q13m671o552o137m377N164L928N69
9307h958O446K921J85L072P919r26k503r831l331K712J975M159L217k325r430
9292d698m65K354M636p09l078j1105m375N099N661R58N902N975Q562k398m337
9277G982k818N06N816L180k745k090j018n785o526k63k583o060P98K210K51R287
9261A42j363j185O850J962n855n619p847J403L608K519L887K988q170L30J456
9246d894P522Q716o307p764j788j537N608K982j262J0357k694l343l594k46n06
9231A250J320m676P98R75J380J296n135m439P4J913M473M637N838l625q02n071
9215B06M708j399m73l154p099l875J591O353P39k665l115K836j785l671K078j783
$$ plain form
9199 -10508 -12780 -5921 756 -570 1357 327 6021 2171 -5540 -9142 -1797 4433 3975 872 7079
9184 7079 4299 1217 -2220 4243 2661 -3637 -721 -2879 -3419 2453 6966 8631 7118 3878 -1470
9169 -1470 3718 6828 11270 7497 2905 -4623 -436 2758 4243 8329 9141 8293 -1669 -11341 -6481
9154 -6481 -1185 7313 5980 -371 -2527 -3302 -2711 1900 6518 5433 2454 -3757 -13963 -13037 -9192
9139 -9192 -8988 -11372 -17333 -18760 -11169 -5854 -4334 2309 4517 5946 13089 7600 3457 1830 -4655
9124 -4655 -791 4023 4430 5974 6084 -1314 1071 0 -4813 -2630 3687 11352 11871 8688 1709 -6650
9108 -6650 -8189 -7023 -5912 1040 5532 7607 755 1926 1486 -2074 -5303 -5965 -1163 2173 1627 4236
9092 4236 5722 7793 7923 6047 3008 6784 3266 4866 24 1107 -2104 -2678 -7918 -7729 4025
$$ packed form
9199a0508k272O859O677j326J927j030N694l850p711l602P345O230m58l103O207
9184G079k780l082l437O463j582o298K916k158n40N872M513J665j513l240n348
9169a470N188L110M442l773m592p528M187L194J485M086Q12q48r962r672M860
9154f481N296Q498j333o351k156p75N91M611M618j085k979o211j0206R26L845
9139i192K04k384n961j427P591N315J520O643K208J429P143n489m143j627o485
9124d655L864M814M07J544J10p398K385j071m813K183O317P665N19l183o979q359
9108f650j539J166J111O952M492K075o852J171m40l560l229o62M802L336n46K609
9092D236J486K071J30j876l039L776l518J600m842J083l211n74n240J89J1754
$$ plain form
9077 4025 1604 -2689 -5094 -666 1454 -7269 -8722 -8782 -748 1493 441 -4002 -7931 -4209 2210
9062 2210 9772 11639 6943 10347 13563 7011 7001 8152 -229 -852 2542 4219 2952 -5550 535 4586
9046 4586 -875 -3904 -3267 -2342 -2645 -6483 -8075 -1602 5101 1304 -2427 -1707 -2766 -3376 2325 -3859
9030 -3859 -6908 -342 1037 635 -3442 -5439 -13037 -7644 -7547 -6774 -2943 125 499 -3326 -1698 520
9014 520 -3141 -425 -4828 -9009 -8377 -10878 -9043 -388 -471 671 3999 2769 -1420 3313 10032 7094
8998 7094 4307 2655 1987 1793 -905 4865 9531 13317 9005 5092 4142 4236 -386 -6252 -6548 860
8982 860 5405 11811 12927 6959 -1298 -463 3226 1860 -4134 -3934 2313 2254 -2729 984 6711 6759 7449
8965 7449 2686 -959 -1750 5600 3911 1697 -1254 2465 -3 -7062 -12269 -8664 1838 3753 2596
$$ packed form
9077D025k421m293k405M428K120q723j453o0Q034K241j052m443l929L722O419
9062B210P562J867m696L404L216o552j0J151q381o23L394J677j267q502O085M051
9046D586n461l029O37R25l03l838j592O473O703l797l731P20j059o10N701o184
9030c859l049O566J379m02m077j997p598N393R7P73L831L068L74l825J628K218
9014E20l661K716m403m181O32k501J835Q655q3J142L328j230m189M733O719k938
8998G094k787j652o68j94k698N770M666L786m312l913r50R4m622n866k96P408
8982H60M545O406J116n968q257Q35L689j366n994K00O247n9m983L713N727M8O90
8965G449m763l645p91P350j689k214k951L719k468p059n207L605J0502J915j157
$$ plain form
8950 2596 2738 5002 10355 14018 10159 4043 3252 3669 7381 17820 14265 5430 1358 775 -3299 1044
8934 1044 2282 265 4892 3729 -2120 -3406 -2423 -5163 -2155 3098 9931 14279 3069 -2595 -6184
8919 -6184 -8626 -10302 -5325 3479 6755 7231 6341 4114 -1278 -8879 -2653 7258 13650 10348 1053
8904 1053 808 6593 6093 -3630 -10627 -12351 -9149 -6535 801 1636 -3111 -2674 -3797 9 -3040 -2243
8888 -2243 -1321 -6952 -8207 -5078 -3166 147 3726 3193 -739 -3014 1058 3034 3510 -4005 -9104 -6740
8872 -6740 -10549 -8210 -3234 -3262 -3545 -769 129 -692 -1175 -5296 -4039 -6487 -617 2710 1356 5590
8856 5590 6084 -1730 626 185 -656 8120 13305 12782 9723 7088 393 -401 -1397 -1917 -7992 -7716 -2355
8839 -2355 -2975 -5424 1188 6139 5474 5648 3712 -7395 -5852 -750 4413 9134 11298 10426 8459 11832
$$ packed form
8950B596J42K264N353L663l859o116p91M17L712J0439l555q835m072n83m074M343
8934A044J238k017M627j163n849j286R83k740L008N253O833M348j1210n664l589
8919f184k442j676M977Q804L276M76q90k227n392p601O226R911O392l302r295
8904A053k45N785n00r723o997j724L202K614P336Q35m747M37j123L806l049P97
8888b243R22n631j255L129J912L313L579n33l932k275M072J976M76p515n099K364
8872f740l809K339M976k8k83K776Q98q21m83m121J257k448N870L327j354M234
8856E590M94p814K356m41q41Q776N185n23l059k635o695p94r96n20o075K76N361
8839b355o20k449O612M951o65J74j936j1107J543N102N163M721K164q72j967L373
$$ plain form
8823 11832 13272 2298 -2782 -1864 -736 -1920 -1913 -56 6477 11241 5902 -150 2685 11101 15896
8808 15896 10490 6985 -476 -10893 -5638 -2382 -2019 2422 3891 4569 -3569 -5460 -1894 -302 -6516
8793 -6516 -6262 -3536 -815 -3311 -6126 -3419 -4467 -10124 -4918 -1729 -5296 -10703 -2182 1600 1657 2672
8777 2672 92 6331 7397 4050 3117 2768 5206 1198 -3455 -388 2683 3845 4731 6986 7660 4739
8761 4739 8045 13366 18747 15773 13746 12611 9758 8850 8538 10192 5399 3567 4755 3642 1380
8746 1380 -1649 -3235 -872 -1344 4282 2432 -3198 -2720 -933 -1577 3219 10985 17895 19764 17129 11904
8730 11904 -2610 77 6548 5619 3869 -662 -557 5904 3280 -460 -635 -5063 -3205 3942 1050
8715 1050 -2035 -7313 -4204 -858 -4909 -10132 -5883 4378 3957 2767 -3412 -1895 1089 1604 4793
$$ packed form
8823A1832J440j0974n080R18J128j184PJ857O533M764n339o052K835Q416M795
8808A5896n406l505p461j0417N255L256L63M441J469O78q138j891L566J592o214
8793f516K54K726K721k496k815K707j048n657N206L189l567n407Q521L782N7J015
8777B672k580O239J066l347r33l49K438m008m653L067L071J162Q86K255O74k921
8761D739L306N321N381k974k027j135k853r08l12J654m793j832J188j113k262
8746A380l029j586K363m72N626j850n630M78J787o44M796P766O910J869k635n225
8730A1904j4514K687O471r29j750m531J05O461k624l740j75m428J858P147k892
8715A050l085n278L109L346m051n223M249J0261m21j190o179J517K984N15L189
$$ plain form
8700 4793 2694 8303 13515 21017 15676 4803 1970 -1845 -7963 1526 13435 14328 8610 6994 11677
8685 11677 9138 7937 3319 -4604 -1239 4018 1436 1699 1483 4626 7000 11828 10247 6042 4816
8670 4816 3985 5134 -580 2486 6035 13085 10839 2592 -4490 -6906 -8994 -7315 -2906 768 1181
8655 1181 5230 10740 16689 22273 20409 19036 23175 23456 26082 35772 42780 52457 73039 102878 144444
8640 144444 203226 266408 293878 252381 184017 130156 83649 52831 34621 23108 19474 19856
8628 19856 15676 11777 10313 13082 16848 15315 13218 13975 21324 18241 18574 24537 29681 37651 36157
8613 36157 44226 45818 46628 42350 45966 56875 64822 71394 85332 103870 130216 169531 222535
8600 222535 294120 364079 380064 323510 258227 220689 210319 225975 269626 347553 475529
$$ packed form
8700D793k099N609N212P502n341j0873k833l815o118R489J1909Q93n718j616M683
8685A1677k539j201m618p923L365N257k582K63k16L143K374M828j581m205j226
8670D816q31J149n714L066L549P050k246q247p082k416k088J679M409L674M13
8655A181M049N510N949N584j864j373M139K81K626R690P008R677K0582K9839M1566
8640A44444N8782O3182K7470m1497o8364n3861m6507l0818j8210j1513l634L82
8628A9856m180l899j464K769L766j533k097P57P349l083L33N963N144P970j494
8613C6157Q069J592Q10m278L616J0909P947O572J3938J8538K6346L9315N3004
8600B22535P1585O9959J5985n6554o5283l7538j0370J5656M3651P7927J27976
$$ plain form
8589 475529 670043 919697 1126321 1117727 879459 611555 419113 297903 223286 167740
8579 167740 128459 98387 76835 69888 79148 79334 69865 67861 61610 56447 56272 59672 59421 60185 69008
8564 69008 72455 76530 85162 98546 100779 100304 108564 120767 139756 158927 185269 227028 293108
8551 293108 402074 556908 777443 1028385 1182334 1099303 830244 568306 389935 281193
8541 281193 208051 152678 123564 103680 86508 71585 66490 67346 59119 50579 41075 34930 32130
8528 32130 31082 24670 23068 25327 21289 20181 18266 19303 12651 12139 13914 11442 6191 1442 -4233
8513 -4233 -6151 -2368 2887 12664 13731 11165 5154 -4525 -9693 -10024 -10116 -1268 6500 4379 2499 4712
8497 4712 8530 9093 11773 3400 1799 -90 2061 5048 6654 4802 1993 2429 3193 1880 3513 2163
$$ packed form
8589D75529J94514K49654K06624q594k38268k67904j92442j21210p4617n5546
8579A67740l9281l0072k1552o947R260J86r469k004o251n163j75L400k51P64Q823
8564F9008L447M075Q632J3384K233m75Q260J2203J8989J9171K6342M1759O6080
8551B93108J08966J54834K20535K50942J53949q3031k69059k61938j78371j08742
8541B81193p3142n5373k9114j9884j7172j4923n095Q56q227q540r504o145k800
8528C2130j048o412j602K259m038j108j915J037o652n12J775k472n251m749n675
8513d233j918L783N255R777J067k566o011r679n168l31r2Q848P768k121j880K213
8497D712L818N63K680q373j601j889K151K987J606j852k809M36P64j313J633j350
$$ plain form
8481 2163 687 12858 13183 11077 6568 -1842 -577 4608 7980 6840 5311 9801 12574 9025 8169
8466 8169 12230 9238 4722 -3097 -12291 -14255 -11790 -7619 -4985 -3617 1243 -4874 -6698 -5969 -5488
8451 -5488 -475 4051 5255 5904 5006 4013 6933 1836 -8063 -6625 -2991 -5101 -6243 -775 5773 3388
8435 3388 -2107 -8697 -11887 -2751 -1932 -4766 2632 1957 3891 4616 2659 335 -4928 -4495 -248 -579
8419 -579 2836 9674 6805 4579 5102 1363 4266 1650 633 1703 3785 694 -555 -2255 -5333
8404 -5333 -3415 -857 2432 -142 105 -4426 -9609 -8571 -6387 -3431 -1309 4289 4578 1991 8982
8389 8982 9702 5161 1799 4899 8265 4304 -616 -5244 -5109 -1556 7053 6363 2727 5654 6320 3725
8373 3725 3105 -1538 1503 1996 1012 -2137 458 1021 -700 395 6605 10116 11546 13631 10968 9195
$$ packed form
8481B163j476J2171L25k106m509q410J265N185L372j140j529M490K773l549q56
8466H169M061k992m516p819r194j964K465M171K634J368M860o117j824P29M81
8451e488N013M526J204O49q98r93K920n097r899J438L634k110j142N468O548k385
8435C388n495o590l190R136Q19k834P398o75J934P25j957k324n263M33M247l31
8419e79L415O838k869k226N23l739K903k616j017J070K082l091j249j700l078
8404e333J918K558L289k574K47m531n183J038K184K956K122N598K89k587O991
8389H982P20m541l362L100L366l961m920m628J35L553Q609o90l636K927O66k595
8373C725o20m643L041M93r84l149K595N63j721J095O210L511J430K085k663j773
$$ plain form
8357 9195 4158 570 2238 359 -2260 -3563 207 787 1535 7267 11307 11715 11268 7670 1554 2695
8341 2695 455 -7328 -8474 -9606 -15577 -14141 -9292 -7616 -6587 -2859 6259 5349 2801 3746 3099 -394
8325 -394 -4088 -2454 -606 1520 2116 5447 2659 -717 7595 1383 -2170 -636 -2423 -1678 3446 3850
8309 3850 3931 2982 -2835 -7907 -8181 -12102 -9461 -12398 -16005 -15510 -9384 -8568 -9561 -14609 -1797 8792
8293 8792 15953 14261 3337 -4680 -8240 -5807 361 -4611 -11792 -17764 -18156 -15011 -7527 -5226 -4597
8278 -4597 -4199 -1675 -5831 -6578 -3072 -4060 -9488 -5646 -3919 -298 4676 4405 170 -2632 -3380 -7189
8262 -7189 -5626 -8264 -11571 -10288 -9314 -8867 -7421 -2670 -421 -2830 -344 1254 726 -923 -8070 -5478
8246 -5478 1763 1758 4116 4132 -3434 -6691 -11848 -11236 -8674 -11392 -10449 -4915 -3225 522 -1000 -1659 -8715
$$ packed form
8357I195n037l588J668j879k619j303L770N80P48N732M040M08m47l598o116J141
8341B695k240p783j146j132n971J436M849J676J029L728R118r10k548R45o47l493
8325c94l694J634J848K126N96L331k788l376Q312o212l553J534j787P45N124M04
8309C850Q1r49n817n072k74l921K641k937l607M95O126Q16r93n048J2812J0589
8293H792P161j692j0924q017l560K433O168m972p181n972l92L145P484K301O29
8278d597L98K524m156p47L506r88n428L842J727L621M974k71m235k802p48l809
8262g189J563k638l307J283R74M47J446M751K249k409K486J598n28j649p147K592
8246e478P241nK358J6p566l257n157O12K562k718R43N534J690L747j522o59p056
$$ plain form
8229 -8715 -3897 4876 2311 2655 -5082 -11180 -9535 -6088 -9308 -11941 -14734 -10712 -7290 -1838 3980
8214 3980 -2764 -3448 -1578 -2108 -1947 5684 1964 1447 -1779 -7137 -6129 -10654 -9183 -10136 -6601 -1652
8198 -1652 1381 2658 6554 9149 11153 6356 2481 3041 -239 -1331 2572 859 -1836 1145 1457
8183 1457 -1573 4625 637 6511 6420 2965 4952 -3812 -6635 -2053 -2887 297 414 -1840 2053 1765
8167 1765 2352 1071 -2764 -3024 2027 2183 1450 -1982 -1633 4041 5299 11231 6561 2813 -983 -3320
8151 -3320 -1010 -298 -2592 -2543 3963 7499 7321 7234 8703 10640 14834 5761 3168 4768 4831 1972 3804
8134 3804 7001 9775 5776 1524 5615 6809 2443 2236 3580 -1092 -5379 -7919 -5823 -5364 -7320
8119 -7320 -11349 -2275 4031 5239 3564 -2301 -4917 -1369 2274 -2027 -848 -956 -1159 900 814 -2814
$$ packed form
8229h715M818Q773k565L44p737o098J645L447l220k633k793M022L422N452N818
8214C980o744o84J870n30J61P631l720n17l226n358J008m525J471r53L535M949
8198a652L033J277L896K595K004m797l875N60l280j092L903j713k695K981L12
8183A457l030O198l988N874r1l455J987q764k823M582q34L184J17k254L893k88
8167A765N87j281l835k60N051J56p33l432L49N674J258N932m670l748l796k337
8151c320K310P12k294M9O506L536j78q7J469J937M194r073k593J600O3k859J832
8134C804L197K774l999m252M091J194m366k07J344m672m287k540K096M59j956
8119g320m029R074O306J208j675n865k616L548L643m301J179j08k03K059q6l628
$$ plain form
8103 -2814 -5500 -7147 -8406 -10368 -13293 -12633 -8001 -5622 -10942 -11189 -10241 -11556 -5352 8066 10157
8088 10157 3281 -4744 -4961 3390 4742 -1234 749 1552 -4112 -8459 -5270 -3735 -7171 -2594 -1247
8073 -1247 -1314 3055 6259 1551 3022 2035 -2695 -6917 -3800 -10374 -16673 -11234 -9042 -3077 1924 1393
8057 1393 576 296 -1428 2642 5184 2215 2592 1032 -2957 5041 6572 7195 8273 3167 -6198 -11012
8041 -11012 -18715 -15848 -11030 -6462 -4426 2101 13417 8425 1556 2176 3267 -109 -42 -1629 -1422
8026 -1422 -5344 -7782 -6157 -1786 2051 2723 1198 -3455 -438 -2068 -5784 -12320 -12785 -9351 -6882
8011 -6882 -1320 -230 502 -408 -2405 -6353 -3953 -7406 -3134 3217 1978 1445 2550 -262 -525 -3546
7995 -3546 -4277 2136 1354 2263 8175 7785 763 -5592 -2067 1997 886 322 -36 -2160 -7512 -9387
$$ packed form
8103b814k686j647j259j962k925O60M632K379n320k47R48j315O204J3418K091
8088A0157o876q025k17Q351J352n976J983Q03n664m347L189J535l436M577J347
8073a247o7M369L204m708J471r87m730m222L117o574o299N439K192N965N001n31
8057A393q17k80j724M070K542k969L77j560l989P998J531O23J078n106r365m814
8041a1012p703K867M818M568K036O527J1316m992o869O20J091l376O7j587K07
8026a422l922k438J625M371L837O72j525m653L017j630l716o536m65L434K469
8011f882N562J090P32r10j997l948K400l453M272O351j239n33J105k812k63l021
7995c546p31O413p82R09N912l90p022o355L525M064j111n64l58k124n352j875
$$ plain form
7979 -9387 -10509 -9196 -8523 -2836 2543 7164 6708 8100 2977 4085 8280 11734 6482 715 4251
7964 4251 4889 4150 4902 7484 8017 12058 11531 1889 -5286 -5755 -382 14714 20329 17122 9503 10735
7948 10735 13179 8944 10045 13096 13306 19605 18727 10400 6008 9013 4497 824 -2188 -5711 -3490
7933 -3490 -4756 -8811 -2281 -2180 -253 5118 5876 5191 3277 702 -5160 -5416 -3851 4074 10640 8930
7917 8930 5896 7261 7970 8196 10098 18763 19971 15590 18006 18628 21091 19142 11415 8874 6713 14318
7901 14318 17364 7730 2942 5817 11380 14572 10590 10912 14954 22555 21330 14723 12123 10034 4458
7886 4458 5965 6418 10199 3736 3864 4138 1846 3329 1723 2227 3291 3760 546 8272 13258 9724
7870 9724 9545 8141 9194 14435 13768 7571 4921 4179 2146 7579 5219 2613 2822 2026 2233 4100
$$ packed form
7979i387j122J313O73N687N379M621m56J392n123J108M195L454n252n767L536
7964D251O38p39P52K582N33M041n27r642p175m69N373J5096N615l207p619J232
7948A0735K444m235J101L051K10O299q78q327m392L005m516l673l012l523K221
7933c490j266m055O530J01J927N371P58o85j914k575n862k56J565P925O566j710
7917H930l034J365P09K26J902Q665J208m381K416O22K463j949p727k541k161P605
7901A4318L046r634m788K875N563L192l982L22M042P601j225o607k600k089n576
7886D458J507M53L781o463J28K74k292J483j606N04J064M69l214P726M986l534
7870I724j79j404J053N241o67o197k650p42k033N433k360k606K09p96K07J867
$$ plain form
7854 4100 2400 4514 5475 5096 -1104 -2273 2912 5603 3705 3848 -1098 5688 7824 1998 -4631 -5098
7838 -5098 1235 7423 8922 12664 8664 10408 15593 16824 11581 841 -1993 13880 37667 51672
7824 51672 48133 29361 8161 -160 4543 16713 22663 19504 14093 6839 468 -2721 -7227 -11719
7810 -11719 -13169 -4956 -620 -424 -3463 104 -1288 -2984 -4048 2773 6860 9397 7362 -416 -1514
7795 -1514 -2102 -9147 -15034 -14498 -13468 -15226 -10406 -8966 -6502 2342 1717 1407 3154 8501 4453 1828
7779 1828 856 5316 566 -2100 -4729 -8945 -10318 -1430 1408 594 432 2399 -7645 -10789 -8953
7764 -8953 -8198 -10741 -5604 -4214 -5554 -10728 -14374 -6918 -1159 7082 6156 -2811 1177 10059 11643
7749 11643 5564 1153 -5794 -9598 -11542 -2846 2278 2045 2388 -2215 -8652 -6041 -4969 -4392 -6050
$$ packed form
7854D100j700K114R61l79o200j169N185K691j898J43m946O786K136n826o629m67
7838e098O333O188J499L742m000J744N185J231n243j0740k834J5873K3787J4005
7824E1672l539j8772k1200q321M703J2170N950l159n411p254o371l189m506m492
7810a1719j450Q213M336J96l039L567j392j696j064O821M087K537k035p778j098
7795a514n88p045n887N36J030j758M820J440K464Q844o25l10J747N347m048k625
7779A828r72M460m750k666k629m216j373Q888K838q14j62J967j0044l144J836
7764h953P55k543N137J390j340n174l646P456N759Q241r26q967L988Q882J584
7749A1643o079m411o947l804j944Q696N124k33L43m603o437K611J072N77j658
$$ plain form
7734 -6050 -6664 -2468 3751 2942 519 -3008 -10735 -12977 -9017 -11887 -13523 -14355 -10181 -9686 -4691 5192
7718 5192 9805 4348 -1075 -3987 -3125 3 8045 10065 776 -1071 5850 7574 7267 9663 2707
7703 2707 -673 -1971 -2960 -1924 7308 8098 5434 1429 914 -592 -2401 -9638 -12104 -6539 -2931 3870
7687 3870 5769 2575 -5195 588 3463 8517 4858 7474 6838 -917 -5693 -7834 -8270 -1557 4337
7672 4337 6539 3247 -2421 -5980 -8756 -6432 -2665 -3689 -6588 -4451 2501 6065 1340 -8291 -9684
7657 -9684 -6312 698 4360 624 -7379 -5618 639 248 -4609 -11222 -16409 -10983 -10506 -10367 -7084 -11767
7641 -11767 -12730 -8215 -5076 -1421 -2628 -2953 -1915 -4755 -9342 -4997 -2215 -1871 -3049 -679 -1057 -4567
7625 -4567 -1168 1137 -4374 -12787 -13398 -11639 -6362 -4169 467 -2273 -4725 -3781 107 -128 -6650 -1815
$$ packed form
7734f050o14M196O219q09k423l527p727k242L960k870j636q32M174M95M995R883
7718E192M613n457n423k912Q62L128Q042K020r289j847O921J724l07K396o956
7703B707l380j298r89J036R232P90k664m005n15j506j809p237k466N565L608O801
7687C870J899l194p770N783K875N054l659K616o36p755m776k141m36O713N894
7672D337K202l292n668l559k776K324L767j024k899K137O952L564m725r631j393
7657i684L372P010L662l736q003J761O257l91m857o613n187N426M77J39L283m683
7641a1767r63M515L139L655j207l25J038k840m587M345K782L44j178K370l78l510
7625d567L399K305n511q413o11J759N277K193M636k740k452R44L888k35o522M835
$$ plain form
7609 -1815 -5764 -12559 -15466 -11305 -10659 -7400 -6889 -12128 -13570 -8724 -5557 -5818 -5613 -504 6157 982
7593 982 -6225 -7271 -10297 -10851 -7238 -5689 -8196 -5840 -8817 -6450 -3029 -1354 -996 -2695 -5396 -9500
7577 -9500 -10148 -6881 -6723 -3134 -5942 -12534 -10028 -9131 -8754 -10034 -10975 -7748 -9618 -10214 -9359 -9090 -10211
7560 -10211 -8243 1512 -6002 -9412 -7472 -12583 -11888 -8072 -3286 -2973 -6113 -2931 -226 2224 4110
7545 4110 3867 2753 -630 4713 2846 4148 -775 1138 3977 4932 2828 -2835 -4176 -5220 -2905
7530 -2905 -2285 -6069 -1630 734 -5589 -11673 -13144 -11346 -7844 -7982 -5632 -3112 -5997 -5108 -5151 -5192 -2957
7513 -2957 -1930 92 2275 3941 2534 -6338 -8559 -7437 -2689 3307 8074 4951 1258 4773 10004
7498 10004 6975 7195 718 -7434 -8044 -8652 -5245 5351 4267 -757 -436 -373 -6924 -7345 -11421 -20061
$$ packed form
7609a815l949o795k907M161O46L259N11n239j442M846L167k61K05N109O661n175
7593I82p207j046l026n54L613J549k507K356k977K367L421J675L58j699k701m104
7577i500o48L267J58L589k808o592K506Q97L77j280r41L227j870n96Q55K69j121
7560a0211J968R755p514l410J940n111O95L816M786L13l140L182K705K450J886
7545D110k43j114l383N343j867J302m923J913K839R55k104n663j341j044K315
7530b905O20l784M439K364o323o084j471J798L502j38K350K520k885Q89m3m1K235
7513b957J027K022K183J666j407q872k221J122M748N996M767l123l693L515N231
7498A0004l029K20o477q152o10o08L407J0596j084n024L21O3o551m21m076q640
$$ plain form
7482 -20061 -18865 -5243 216 -3973 -9331 -11296 -5035 1393 -3965 -5779 -5061 -1982 3050 2410 -919
7467 -919 -3357 -4280 -7231 -5917 -6979 -5156 -10423 -9922 -8601 -9139 -5307 -4572 -6791 -8038 -12430 -9462
7451 -9462 -7515 -4610 -2837 -1834 1281 -6297 -4827 -5643 -14668 -17324 -10630 -9339 -2522 465 2166
7436 2166 9990 7201 -3103 -8754 -1249 12360 12222 8816 12123 13344 7346 -1233 -269 -765 -1100
7421 -1100 -2989 -5722 -1283 3805 5784 12749 11484 235 -1121 -664 -6012 -9312 -4365 -1076 -9221
7406 -9221 -1766 -76 -290 -7081 -13081 -9945 2102 3736 6070 2100 1646 2411 1571 1374 4279 2477
7390 2477 -3939 -6001 -11149 -7512 -2467 -2013 -3341 -8610 -15089 -17880 -4423 6718 13838 12508 9723
7375 9723 3343 -1204 -675 -314 1789 5504 334 -5598 -5220 -1318 4819 5345 4982 4019 -3344 -11588
$$ packed form
7482b0061J196J3622N459m189n358j965O261O428n358j814P18L079N032o40l329
7467i19k438r23k951J314j062J823n267N01J321n38L832P35k219j247m392K968
7451i462J947K905J773J003L115p578J470q16r025k656O694J291O817K987J701
7436B166P824k789j0304n651P505J3609j38l406L307J221n998q579R64m96l35
7421a100j889k733M439N088J979O965j265j1249j356M57n348l300M947L289q145
7406i221P455J690k14o791o000L136J2047J634K334l970m54P65q40j97K905j802
7390B477o416k062n148L637N045M54j328n269o479k791J3457J1141P120j330k785
7375I723o380m547N29L61K103L715n170n932L78L902O137N26l63r63p363q244
$$ plain form
7359 -11588 -11692 -12659 -10214 -7709 -3340 6380 6372 2158 -4020 -2297 2995 3638 5997 2851 3450 1726
7343 1726 -4190 -581 -994 -1343 -1761 -1173 -2791 -6785 -7494 -10476 -7457 -3090 2621 4032 -3828 -5913
7327 -5913 -29 799 -1622 -8674 -9811 -7985 -7444 1723 5583 -10253 -13564 -8274 -11969 -17344 -16748
7312 -16748 -14615 -13394 -13056 -7531 -6514 -6305 -3883 -2679 -3345 -8706 -9658 -11852 -6384 1303 -4237 -5001
7296 -5001 -4071 -6402 -12452 -16512 -13853 -9454 -4348 -558 -1574 -3641 1829 -147 -1253 1016 3331
7281 3331 2034 1473 -1040 -8232 -6943 -3525 -3455 -4446 -3646 -4086 -10128 -9749 -2273 985 -791 -5423 -9129
7264 -9129 -8171 -576 969 -2329 -6161 -6284 -3837 2341 317 659 -3070 -3974 4339 2765 -3761 -11915
7248 -11915 -11929 -17181 -14828 -10004 -3747 -4952 -6146 -7946 -12293 -9226 -2098 -5986 -8327 -7575 -5538
$$ packed form
7359a1588j04r67K445K505M369R720qm214o178J723N292O43K359l146N99j724
7343A726n916L609m13l49m18N88j618l994p09k982L019M367N711J411p860k085
7327e913N884Q28k421p052j137J826N41R167L860j5836l311N290l695n375N96
7312a6748K133J221L38N525J017K09K422J204o66n361r52k194N468P687n540p64
7296e001R30k331o050m060K659M399N106L790j016k067N470j976j106K269K315
7281C331j297n61k513p192J289L418P0r91Q00m40o042L79P476L258j776m632l706
7264i129R58P595J545l298l832j23K447O178k024L42l729r04Q313j574o526q154
7248a1915j4n252K353M824O257j205j194j800m347L067P128l888k341P52K037
$$ plain form
7233 -5538 -6427 -5002 -4852 -11735 -11855 -6953 -9545 -17211 -14191 -7648 -8641 -6842 -3488 -3169 -4543 -5678
7217 -5678 -4473 -3150 1035 3297 5726 -5149 -4862 -12291 -12395 -9828 -6066 1485 983 1349 -534 -4763
7201 -4763 -7875 -13467 -3826 101 -2056 -2304 -8629 -1304 7435 3875 8979 9735 7189 4350 -4179
7186 -4179 -7841 -2208 6723 3974 -1765 538 -1423 -8990 -14436 -17797 -13921 -11496 -10523 -2193 -2741
7171 -2741 -4999 -3702 2635 6206 4788 -2891 -9165 -10236 -631 5637 6034 -1016 -7756 -8024 -1122
7156 -1122 2746 5144 296 -930 -910 -358 287 -2464 -4733 -8305 -18115 -18749 -14608 -4003 3431 901
7140 901 -2157 -3838 -6344 -9592 -8504 -8118 -5334 -10551 -14960 -15494 -11303 -10197 -11796 -5064 -7366 -5652
7124 -5652 1708 -119 -3452 -1128 -3825 -6966 -10847 -12337 -8395 -4213 1148 983 -637 -3126 -7491
$$ packed form
7233e538q89J425J50o883j20M902k592p666L020O543r93J799L354L19j374j135
7217e678J205J323M185K262K429j0875K87p429j04K567L762P551n02L66j883m229
7201d763l112n592R641L927k157k48o325P325Q739l560N104P56k546k839q529
7186d179l662N633Q931k749n739K303j961p567n446l361L876K425R73Q330n48
7171b741k258J297O337L571j418p679o274j071R605O268L97p050o740k68O902
7156a122L868K398m848j226K0N52O45k751k269l572r810o34M141J0605P434k530
7140I01l058j681k506l248J088L86K784n217m409n34M191J106j599O732k302J714
7124e652P360j827l333K324k697l141l881j490L942M182N361j65j620k489m365
$$ plain form
7109 -7491 -2364 -3990 -9815 -11392 -12348 -6918 -6437 -2904 328 3333 590 3970 8027 6335 -3347
7094 -3347 -298 -550 665 4728 4244 4418 6367 7037 6251 10969 15733 14148 14899 7356 2556 3684
7078 3684 4936 5415 6220 1977 767 1896 953 18 80 -5295 -6434 -4488 -6429 -6476 -4523 -6908 -6250
7061 -6250 -4339 1290 1677 -3534 -6599 113 2500 -4889 -8397 -1697 5176 10917 14411 1744 -5020
7046 -5020 -6267 -5003 -246 3331 4625 4654 2414 -463 -2340 -1534 -782 3751 7364 5356 2351 4858
7030 4858 1948 233 -2457 -3439 -5253 -8353 -11950 -7661 2091 6887 4797 -245 1657 4358 4341 -2137
7014 -2137 -11263 -12075 -13718 -6973 -1018 -511 -6914 -5676 -3050 1173 -328 -1008 -220 -2672 3166 3037
6998 3037 347 713 3491 5397 155 -6140 -7059 -2836 1864 796 99 3706 946 -66 -5060 -2180
$$ packed form
7109g491N127j626n825j577r56N430M81L533L232L005k743L380M057j692r682
7094c347L049k52J215M063m84J74J949O70p86M718M764j585P51p543m800J128
7078C684J252M79Q05m243j210J129r43r35O2n375j139J946j941m7J953k385O58
7061f250J911N629L87n211l065O712K387p389l508O700O873N741L494j2667o764
7046e020j247J264M757L577J294K9k240k877j877Q06P52M533L613k008l005K507
7030D858k910j715k690r82j814l100l597M289R752M796k090n042J902K701j7o478
7014b137r126q12j643O745N955N07o403J238K626M223j501o80P88k452N838j29
6998C037k690L66K778J906n242o295r19M223M700j068o97L607k760j012m994K880
$$ plain form
6982 -2180 -3479 -14344 -14636 -13985 -11993 -5389 117 1430 44 -1542 -918 -1873 -4045 -9196 -9561 -3912
6966 -3912 -3877 -2510 2293 3411 2998 -1100 -8240 -13233 -13161 -8570 -3708 -4063 472 3657 -1496 -4586
6950 -4586 -5761 -395 -4122 -1501 -3026 -1091 240 -7052 -111 -2098 -6743 -8021 -1744 1587 -3117
6935 -3117 -8325 -11534 -13400 -14254 -23859 -22350 -9167 -735 469 -2685 -6612 -9579 -12189 -10508 -8647
6920 -8647 -9608 -10636 -4509 -5166 -5939 -2152 2678 2797 -3944 -9938 -13878 -8372 -4663 -7506 -2408 2315
6904 2315 5752 3266 -904 -2274 -7007 -14058 -10797 -9518 -6362 -6547 -7535 -5443 -4349 588 8144
6889 8144 7308 5724 5377 9148 7933 5636 -1667 -6068 -12009 -14845 -4758 1543 5895 2123 3595
6874 3595 8810 13086 11787 8807 8276 8984 2780 -2069 -3517 -2655 -2545 -3256 -3582 -7588 -14051 -21646
$$ packed form
6982b180j299j0865k92O51J992O604N506J313j386j586O24r55k172n151l65N649
6966c912L5J367M803J118m13m098p140m993P2M591M862l55M535L185n153l090
6950d586j175N366l727K621j525J935J331p292O941j987m645j278O277L331m704
6935c117n208l209j866q54r605J509J3183Q432J204l154l927k967k610J681J861
6920h647r61j028O127o57p73L787M830J19o741n994l940N506L709k843N098M723
6904B315L437k486m170j370m733p051L261J279L156j85r88K092J094M937P556
6889H144q36j584l47L771j215k297p303m401n941k836J0087O301M352l772J472
6874C595N215M276j299k980n31P08o204m849j448Q62J10p11l26m006o463p595
$$ plain form
6858 -21646 -14375 -6689 -6069 -6234 -2599 2953 2261 -2369 244 41 -3789 1358 3648 5721 3265 -580
6842 -580 297 2537 7449 6753 3544 4850 3932 -1603 -4037 -10061 -13870 -6486 -2638 -3920 -5951 -4599
6826 -4599 -69 -792 -3797 -12094 -17522 -12330 -4418 -1407 2687 -1440 -8726 -7240 -5885 -4983 -7749
6811 -7749 -3803 -5230 -184 6400 6178 1988 -5110 -3827 1235 5201 7451 4895 3969 -1819 -1723 -2940
6795 -2940 -9546 -8704 -6069 -4671 -1113 263 1386 6407 5186 -1727 -4312 -10079 -9634 -7815 -7713 -4248
6779 -4248 -1620 -6977 -7879 -9523 -4611 -87 -696 1582 3095 4131 3114 1216 -5015 -6750 3284
6764 3284 -1706 -4093 4262 4181 2969 -924 -4514 -11509 -13649 -7957 -7541 -6293 -6131 -7111 -10435 -7292
6748 -7292 -4535 1884 2785 -346 -1487 854 -281 -5108 -4044 -1804 -1101 -5808 -3655 1565 3670
$$ packed form
6858b1646P271P686O20j65L635N552o92m630K613k03l830N147K290K073k456l845
6842e80Q77K240M912o96l209J306r18n535k434o024l809P384L848j282k031J352
6826d599M530p23l005q297n428N192P912L011M094m127p286J486J355R02k766
6811g749L946j427N046O584k22m190p098J283N062L966K250k556r26n788R6j217
6795b940o606Q42K635J398L558J376J123N021j221o913k585n767M45J819J02L465
6779d248K628n357r02j644M912M524o09K278J513J036j017j898o231j735J0034
6764C284m990k387Q355q1j212l893l590o995k140N692M16J248J62r80l324L143
6748g292K757O419R01l131j141K341j135m827J064K240P03m707K153N220K105
$$ plain form
6733 3670 -1947 -6708 -4163 -4580 -3675 -6024 -5630 -6950 -7819 -162 1804 -2370 -2476 -1144 642 -3497
6717 -3497 -2979 -686 -5529 -6768 -1885 -2499 -1498 2814 -3281 1067 698 -4694 -6698 -7789 -7657 -8695
6701 -8695 -6216 -3989 -3054 -5236 -4671 -3787 -6717 -7068 -3361 5477 1684 -1749 477 3273 1141 -1336
6685 -1336 -1675 -434 6142 9172 13525 14409 9340 5732 12291 12718 6677 4654 6362 2892 2736 1772
6669 1772 -1856 -355 -6085 -6835 -5703 -5886 -12995 -14536 -8852 -3932 -5751 -6355 -2788 -3327 -1801 -3865
6653 -3865 -8328 -8670 -5225 -8170 -7666 -4511 -1102 -1470 2132 3047 -1595 -6152 -9135 -12053 -5806 -1360
6637 -1360 -3159 -7058 -5169 -1361 -530 -5481 -12059 -15092 -13686 -12666 -10948 -5014 -9297 -10281 -7969
6622 -7969 -8027 -6734 -6373 -7314 -10232 -17107 -12455 -6771 -7359 -5920 -3504 -838 -683 -5345 -4490 786 -656
$$ packed form
6733C670n617m761K545m17R05k349L94j320q69P657J966m174j06J332J786m139
6717c497N18K293m843j239M883o14J001M312o095M348l69n392k004j091J32j038
6701h695K479K227R35k182N65Q84k930l51L707Q838l793l433K226K796k132k477
6685a336l39J241O576L030M353Q84n069l608O559M27o041k023J708l470j56r64
6669A772l628J501n730p50J132j83p109j541N684M920j819o04L567n39J526k064
6653c865m463l42L445k945N04L155L409l68L602R15m642m557k983k918O247M446
6637a360j799l899J889L808Q31m951o578l033J406J020J718N934m283r84K312
6622g969n8J293L61r41k918o875M652N684n88J439K416K666J55m662Q55N276j442
$$ plain form
6605 -656 -3081 -8334 -10161 -8192 -3343 6553 7616 -3188 -2790 4138 4380 1790 1450 1390 2740 4798
6589 4798 3442 7237 12969 13375 8556 8973 12551 3717 263 -2330 -2697 2116 6269 3935 5776 4756
6573 4756 1515 -184 3884 3232 2692 314 -145 -3888 -5708 -4625 -8611 -9435 -11032 -5683 -2049 -4587
6557 -4587 -2834 -1446 5772 2385 -7919 -12594 -9569 -6416 -2829 -6633 -7952 -9909 -8243 -2296 1231
6542 1231 4648 6563 3005 -4485 -12244 -15580 -12917 -10415 -2157 -1333 -4425 -1782 1799 2207 -4180
6527 -4180 -9487 -7914 -6485 -6478 1882 6496 4394 1186 -3500 -4287 -1645 -923 -6266 -6073 -904 -1150 -93
6510 -93 -2101 -10634 -12418 -7239 -84 1225 -1323 5575 -3548 -11786 -7918 -3241 -4934 -8013 -8329 -6239
6494 -6239 -303 4860 3408 -721 -4838 -6331 -730 316 -4993 -6949 855 2367 -613 -3989 -1813
$$ packed form
6605f56k425n253j827J969M849R896J063j0804L98O928K42k590l40o0J350K058
6589D798j356L795N732M06m819M17L578q834l454k593l67M813M153k334J841j020
6573D756l241j699M068o52n40k378m59l743j820J083l986q24j597N349L634k538
6557d587J753J388P218l387j0304m675L025L153L587l804j319j957J666N947L527
6542A231L417J915l558p490p759l336K663K502Q258Q24l092K643L581M08o387
6527d180n307J573J429PQ360M614k102l208m686p87K642P22n343J93N169k46J057
6510i3k008q533j784N179P155J309k548O898r123q238L868M677j693l079l16K090
6494f239N936N163j452m129m117j493N601J046n309j956P804J512k980l376K176
$$ plain form
6479 -1813 2895 -1524 4886 13995 8893 7058 6677 7252 300 2899 10024 13813 12269 5603 -3677
6464 -3677 -5107 -2320 -5166 -9541 -5222 -3191 -4557 -5567 -1087 -4799 563 2426 -3022 -6651 -7429
6449 -7429 2562 914 -881 -1074 -5161 -12094 -11929 -4448 -476 3867 5203 -2935 -8964 -8354 -11643 -5055
6433 -5055 384 176 -2272 683 5146 2218 -2673 -6363 -9790 -14538 -11339 -9700 -6896 -6759 -508
6418 -508 -5642 -8561 -7203 -4936 -783 501 -4521 -3522 -5966 -10920 -11707 -12893 -9459 -2376 -2833 -8917
6402 -8917 -10150 -2403 703 3147 -3588 -9502 -7129 -3416 -3024 -1825 -837 5078 2246 1827 -700 -1345
6386 -1345 -2883 -5875 -5085 -6462 -7639 -5656 -8966 -3639 4108 -1608 -8230 -1703 5703 4585 -2263
6371 -2263 -5846 -1817 -2561 -6659 -5660 -1441 -1064 5653 5403 2567 6711 15403 16092 17003 16268 6292 -271
$$ packed form
6479a813M708m419O410R109n102j835l81N75o952K599P125L789j544o666r280
6464c677j430K787k846m375M319K031j366j010M480l712N362J863n448l629p78
6449g429R991j648j795j93m087o933J65P481L972M343J336q138o029O10l289O588
6433e055N439k08k448K955M463k928m891l690l427m748L199J639K804J37O251
6418e08n134k919J358K267M153J284n022R99k444m954p87j186L434P083m57o084
6402h917j233P747L106K444o735n914K373L713L92J199R88N915k832m19k527o45
6386a345j538k992P90j377j177J983l310N327P747n716o622O527P406j118o848
6371b263l583M029p44m098R99M219L77O717k50k836M144Q692O89R11p35r976o563
$$ plain form
6354 -271 -1576 -4028 877 4524 955 -880 214 2007 -768 -7056 -12524 -9117 -568 5293 5306 -2578
6338 -2578 -4224 -7209 -3358 5173 -2821 -2545 -368 2039 -407 -3555 -641 3097 2288 1032 -754
6323 -754 -3707 -1867 144 574 1660 -4550 -6800 -7381 4 535 -575 -2733 -6766 -8103 -6276 -5870
6307 -5870 -4957 -1806 3774 -246 -3926 -7310 -6147 2500 -1778 -4171 3865 8695 6590 2589 6301
6292 6301 4664 658 -2085 -9464 -8905 -10498 -12692 -11153 -7378 -3833 -639 1173 327 5783 7588
6277 7588 4323 4092 5082 4356 8628 5119 6278 7824 6434 4699 5621 1435 -6446 2932 6763 -2681
6261 -2681 -10350 -5873 -1700 4276 7365 6019 1827 -4418 -4145 -4091 -2221 6482 12267 11747 14619 14873
6245 14873 12276 8082 547 -3679 -6695 -4588 5351 -963 -7845 -5297 -2919 1899 3748 -750 -250
$$ packed form
6354b71j305k452M905L647l569j835J094J793k775o288n468L407Q549N861J3p884
6338b578j646k985L851Q531p994K76K177K407k446l148K914L738q09j256j786
6323g54k953J840K011M30J086o210k250n81P385N31j110k158m033j337J827M06
6307e870R13L151N580m020l680l384J163Q647m278k393Q036M830k105m001L712
6292F301j637m006k743p379N59j593k194J539L775L545L194J812q46N456J805
6277G588l265k31R90p26M272l509J159J546j390j735R22m186p881R378L831r444
6261b681p669M477M173N976L089j346m192o245K73N4J870Q703N785n20K872K54
6245A4873k597m194p535m226l016K107R939o314o882K548K378M818J849m498N00
$$ plain form
6230 -250 9176 12465 11780 5387 1307 5573 8989 5462 1556 -1683 -8961 -2382 211 -5533 -3448
6215 -3448 -2673 -8746 -14267 -6475 -1053 525 -6622 -11316 -10134 -5583 -4000 -4445 -1560 1857 8344
$$ packed form
6230b50R426L289o85o393m080M266L416l527l906l239p278O579K593n744K085
6215c448P75o073n521P792N422J578p147m694J182M551J583m45K885L417O487
$$ [...]
##END NTUPLES=NMR SPECTRUM
##END=
