##TITLE=Analysis number 317219
Compound Code sew 03493
Project Code adrs
Chemist Name endeavour
##JCAMPDX= 6.0         $$ Bruker NMR JCAMP-DX V2.0
##DATA TYPE= NMR SPECTRUM
##DATA CLASS= NTUPLES
##ORIGIN= Bruker BioSpin GmbH
##OWNER= nmr
$$ XWIN-NMR		Version 3.5
$$ Mon Feb 13 08:39:30 2006 GMT Standard Time (UT+0h)  MAYBRIDGE\nmr@NMR_250MHZ
##.OBSERVE FREQUENCY= 250.131544655141
##.OBSERVE NUCLEUS= ^1H
##.ACQUISITION MODE= SIMULTANEOUS (DQD)
##.ACQUISITION SCHEME= undefined
##.AVERAGES= 16
##.DIGITISER RES= 18
##SPECTROMETER/DATA SYSTEM= dpx250
##.PULSE SEQUENCE= zg30
##.SOLVENT NAME= CDCl3
##.SHIFT REFERENCE= (INTERNAL, CDCl3, 0, 16.522)
##AUDIT TRAIL= $$ (NUMBER, WHEN, WHO, WHERE, WHAT)
$$ ##TITLE= Audit trail, XWIN-NMR		Version 3.5
$$ ##JCAMPDX= 5.01
$$ ##ORIGIN= Bruker BioSpin GmbH
$$ ##OWNER= nmr
$$ C:\u/data/dgb/nmr/ADRS/15870/pdata/1/auditp.txt
$$ ##AUDIT TRAIL=  $$ (NUMBER, WHEN, WHO, WHERE, WHAT)
(   1,<2006-02-13 08:38:58.92 +000>,<MAYBRIDGE\nmr>,<NMR_250MHZ>,
      <created by zg, POWCHK disabled, PULCHK disabled
       configuration hash MD5:
       84 BC 41 DB A1 6E 1D 46 DA 25 12 A5 C1 ED C5 3A
       data hash MD5: 64K
       00 58 BB E6 A2 9B 4D 95 7D 91 F3 83 44 6E 6C 9B>)
(   2,<2006-02-13 08:39:19.89 +000>,<MAYBRIDGE\nmr>,<NMR_250MHZ>,
      <Start of raw data processing
       ef LB = 0.3 FT_mod = 6 PKNL = 1 SI = 32K 
       data hash MD5: 32K
       28 FC 3D C7 15 8B 6D 1E 10 45 12 A8 BE 54 D4 C2>)
(   3,<2006-02-13 08:39:21.90 +000>,<MAYBRIDGE\nmr>,<NMR_250MHZ>,
      <apk 
       data hash MD5: 32K
       57 0C A5 D7 E6 33 15 31 B0 76 59 76 EA FE E6 87>)
(   4,<2006-02-13 08:39:22.81 +000>,<MAYBRIDGE\nmr>,<NMR_250MHZ>,
      <abs ABSG = 5 
       data hash MD5: 32K
       20 82 F8 B6 C7 75 FB C5 D7 3C 71 8D 4A F9 D6 29>)
$$ ##END=
$$ 
$$ hash MD5
$$ D5 D0 DC 99 6A E6 5B 26 C4 3D 30 1D 9F C3 9C 31
##$RELAX= 
##$RELAX= 
##$RELAX= 
##$RELAX= 
##$RELAX= 
##$RELAX= 
##$RELAX= 
$$ Bruker specific parameters
$$ --------------------------
##$DU= <C:\u>
##$EXPNO= 15870
##$NAME= <ADRS>
##$PROCNO= 1
##$TYPE= <nmr>
##$USER= <dgb>
##$AMP= (0..31)
100 100 100 100 100 100 100 100 100 100 100 100 100 100 100 100 100 100 
100 100 100 100 100 100 100 100 100 100 100 100 100 100 
##$AQSEQ= 0
##$AQ_mod= 3
##$AUNM= <au_zg>
##$AUTOPOS= <2 >
##$BF1= 250.13
##$BF2= 250.13
##$BF3= 250.13
##$BF4= 250.13
##$BF5= 500.13
##$BF6= 500.13
##$BF7= 500.13
##$BF8= 500.13
##$BYTORDA= 1
##$CFDGTYP= 0
##$CFRGTYP= 5
##$CHEMSTR= <none>
##$CNST= (0..31)
1 1 145 1 1 1 1 1 1 1 1 1 1 1 1 1 1 1 1 1 1 1 1 1 1 1 1 1 1 1 1 1 
##$CPDPRG= <>
##$CPDPRG1= <>
##$CPDPRG2= <>
##$CPDPRG3= <>
##$CPDPRG4= <mlev>
##$CPDPRG5= <mlev>
##$CPDPRG6= <mlev>
##$CPDPRG7= <mlev>
##$CPDPRG8= <mlev>
##$CPDPRGB= <>
##$CPDPRGT= <>
##$D= (0..31)
0 1 0 0 0 0 0 0 0 0.06 0 0 0 0 0 0 0.0002 0 0 0 0 0 0 0 0 0 0 0 0 0 0 
0 
##$DATE= 1139819937
##$DBL= (0..7)
120 120 120 120 120 120 120 120 
##$DBP= (0..7)
150 150 150 150 150 150 150 150 
##$DBP07= 0
##$DBPNAM0= <>
##$DBPNAM1= <>
##$DBPNAM2= <>
$$ [...]
##$SUBNAM7= <"">
##$SUBNAM8= <"">
##$SUBNAM9= <"">
##$SW= 20.6930455092707
##$SWIBOX= (0..15)
0 0 3 0 0 0 0 0 0 0 0 0 0 0 0 0 
##$SW_h= 5175.983436853
##$TD= 65536
##$TD0= 1
##$TE= 294.16
##$TE2= 300
##$TE3= 300
##$TEG= 300
##$TL= (0..7)
0 120 120 120 120 120 120 120 
##$TP= (0..7)
150 150 150 150 150 150 150 150 
##$TP07= 0
##$TPNAME0= <>
##$TPNAME1= <>
##$TPNAME2= <>
##$TPNAME3= <>
##$TPNAME4= <>
##$TPNAME5= <>
##$TPNAME6= <>
##$TPNAME7= <>
##$TPOAL= (0..7)
0.5 0.5 0.5 0.5 0.5 0.5 0.5 0.5 
##$TPOFFS= (0..7)
0 0 0 0 0 0 0 0 
##$TUNHIN= 0
##$TUNHOUT= 0
##$TUNXOUT= 0
##$USERA1= <user>
##$USERA2= <user>
##$USERA3= <user>
##$USERA4= <user>
##$USERA5= <user>
##$V9= 5
##$VALIST= <valist>
##$VCLIST= <CCCCCCCCCCCCCCC>
##$VD= 0
##$VDLIST= <DDDDDDDDDDDDDDD>
##$VPLIST= <PPPPPPPPPPPPPPP>
##$VTLIST= <TTTTTTTTTTTTTTT>
##$WBST= 1024
##$WBSW= 4
##$XGAIN= (0..3)
0 0 0 0 
##$XL= 0
##$YL= 0
##$YMAX_a= 423292
##$YMIN_a= -427546
##$ZGOPTNS= <>
##$ZL1= 120
##$ZL2= 120
##$ZL3= 120
##$ZL4= 120
##$ABSF1= 16.522
##$ABSF2= -4.171173
##$ABSG= 5
##$ABSL= 3
##$ALPHA= 0
##$AQORDER= 0
##$ASSFAC= 0
##$ASSFACI= 0
##$ASSFACX= 0
##$ASSWID= 0
##$AUNMP= <proc_1d>
##$AZFE= 0.1
##$AZFW= 0.1
##$BCFW= 0
##$BC_mod= 0
##$BYTORDP= 0
##$COROFFS= 0
##$CY= 12.5
##$DATMOD= 1
##$DC= 0
##$DFILT= <>
##$DTYPP= 0
##$F1P= 14.0000005364418
##$F2P= -0.99999901652339
##$FCOR= 0.5
##$FTSIZE= 32768
##$FT_mod= 6
##$GAMMA= 0
##$GB= 0
##$INTBC= 1
##$INTSCL= 1
##$ISEN= 128
##$LB= 0.3
##$LEV0= 0
##$LPBIN= 0
##$MAXI= 10000
##$MC2= 0
##$MEAN= 0
##$ME_mod= 0
##$MI= 0
##$NCOEF= 0
##$NC_proc= -1
##$NLEV= 6
##$NOISF1= 0
##$NOISF2= 0
##$NSP= 0
##$NTH_PI= 0
##$NZP= 0
##$OFFSET= 16.522
##$PC= 1
##$PHC0= 98.24349
##$PHC1= 3.689422
##$PH_mod= 1
##$PKNL= yes
##$PPARMOD= 0
##$PSCAL= 4
##$PSIGN= 0
##$REVERSE= no
##$SF= 250.13
##$SI= 32768
##$SIGF1= 0
##$SIGF2= 0
##$SINO= 400
##$SIOLD= 32768
##$SREGLST= <1H.CDCl3>
##$SSB= 0
##$STSI= 32768
##$STSR= 0
##$SW_p= 5175.98343685301
##$SYMM= 0
##$S_DEV= 0
##$TDeff= 65536
##$TDoff= 0
##$TI= <Analysis number 999999
Compound Code 99
Book Reference 9
Project Code 9>
##$TILT= no
##$TM1= 0
##$TM2= 0
##$TOPLEV= 0
##$USERP1= <user>
##$USERP2= <user>
##$USERP3= <user>
##$USERP4= <user>
##$USERP5= <user>
##$WDW= 1
##$XDIM= 32768
##$YMAX_p= 274499431
##$YMIN_p= -407989
$$ End of Bruker specific parameters
$$ ---------------------------------
##NTUPLES= NMR SPECTRUM
##VAR_NAME=  FREQUENCY,     SPECTRUM/REAL,   SPECTRUM/IMAG
##SYMBOL=    X,             R,               I
##VAR_TYPE=  INDEPENDENT,   DEPENDENT,       DEPENDENT
##VAR_FORM=  AFFN,          ASDF,            ASDF
##VAR_DIM=   32768,         32768,           32768
##UNITS=     HZ,            ARBITRARY UNITS, ARBITRARY UNITS
##FACTOR=    0.157963299565203, 1,           1
##FIRST=     4132.6476996994, 0,             0
##LAST=      -1043.33573715361, 0,           0
##MIN=       -1043.33573715361, -407989,     0
##MAX=       4132.6476996994, 274499431,     0
$$ Real data points
##PAGE= N=1
##DATA TABLE= (X++(R..R)), XYDATA
$$ [...]
17764A383L451L920N742J954L242j094Q642J1017M427o822k750m017n537o545
17750A7013m287n97l569J847n30J25m69O603Q024k379r81J413L269Q59j285k618
17734B2438o159k324k347L120K643j750j431Q377M642O122O864L492o003l292
17720C4392j898q48O642L944K393P507N389j961K411Q282j820q713l598J0025
17706F2147N990l69n286m828J2564J2557j65l461n379K106O715M346O463R256
17692A02656J5592J2601J0502J6386K3254K1503L5067P2635Q9186O4820R490k4880
17680D48812l3708k5090r596J256J7368K7320L9093N8372R7446J36349J82692
17669I40314J72208J10527O7059O4803J01795J88548L07211M60094O67163R98567
$$ y = [1383, 4834, 8754, 14496, 16450, 19692, 18598, 27240, 38257, 42684, 35862, 33112, 29095, 23558, 17013, 12726, 12129, 8560, 10407, 9877, 10002, 9533, 16136, 24160, 21781, 20800, 22213, 25482, 26341, 25056, 22438, 16279, 13955, 11608, 14728, 17371, 15621, 14190, 22567, 27209, 33331, 40195, 43687, 37684, 34392, 32494, 31646, 38288, 42232, 44625, 52132, 57521, 55560, 57971, 66253, 64433, 55720, 52122, 62147, 68137, 67768, 62482, 57654, 70218, 82775, 82610, 79149, 73770, 75876, 82591, 86937, 93400, 102656, 118248, 130849, 141351, 157737, 180991, 202494, 237561, 310196, 399382, 464202, 473692, 448812, 415104, 390014, 380418, 381674, 399042, 426362, 465455, 523827, 621273, 757622, 940314, 1112522, 1223049, 1290108, 1354911, 1456706, 1645254, 1952465, 2412559, 3079722, 4078289]
17659D078289J581812K694971M986158R147617J3178733J0087441K31841o804851
17651C9182011r702487r531459o834105m024016k239781j280560p75168n05257
17643D289178l87628l09985k30514j18877L5398J98042L40011M84016P02976J150400
17633F153017K101298M104696P841544J2113867J0670301J691509n786553r009803
17625B9879876r337921p062552m322744k486170j506261r99543p08757n20527
17617B935401l86411k96431k24168j45167q8261o4650p1652j26685j73119j80568
17607A178289j57555j28289r6230o7974m1297p168L1187L1297k2218o2343p3407
17596E84292p4163o0963m8359l3503k4774k3205k1755j3845q798r953o062p443
$$ y = [4078289, 5660101, 8355072, 13341230, 22488847, 35667580, 45755021, 45986862, 39182011, 29479524, 19948065, 13113960, 9089944, 6850163, 5569603, 4794435, 4289178, 3901550, 3591565, 3361051, 3242174, 3277572, 3475614, 3815625, 4299641, 5002617, 6153017, 8254315, 12359011, 20200555, 32314422, 42984723, 44676232, 38889679, 29879876, 20541955, 13479403, 9156659, 6670489, 5164228, 4164685, 3455928, 2935401, 2548990, 2252559, 2028391, 1883224, 1794963, 1730313, 1658661, 1531976, 1358857, 1178289, 1020734, 892445, 796215, 728241, 686944, 679776, 710963, 742260, 720042, 657699, 584292, 510129, 449166, 400807, 367304, 342530, 319325, 297570, 283725, 274927, 264974, 258912, 251469]
17584B51469j7468k0128j4305r420j0774o527j2602q704n960r797r223n595p723
17571A13243j3588j2451n844J14K930j330j482J033j162l717O62k02p202m738
17557F6266O86K203l039p16J440j703M352J199k413K936o296j544l34j776l090
17542E8171l420l105K392K167l621L540K155J174m981j478l10j6M311l334m630
17527D9015j446O249K298k554n23J344J213N87P0P576k626j507l560k879J036
17512E4293M242J402N193l561l337j587M699J148m608n002K573M286p440k3966
17498B8335k8152k6718j8255J666J2754J2308Q825Q758P434L263P48M067K154
17485A7187L113Q759L288q283l356J115K39O889M802q511o145j3855k6655k6255
$$ y = [251469, 234001, 213873, 199568, 190148, 179374, 172847, 160245, 151541, 145581, 135784, 126561, 120966, 113243, 99655, 87204, 81360, 81474, 84404, 83074, 81592, 82625, 81463, 77746, 78408, 78206, 71004, 66266, 66952, 69155, 66116, 65400, 66840, 65137, 69489, 70688, 68275, 71211, 64915, 63371, 63037, 61261, 58171, 54751, 51646, 54038, 56205, 52584, 56124, 58279, 59453, 54472, 52994, 52684, 52668, 56979, 53645, 49015, 47569, 53818, 56116, 53562, 53039, 54383, 55596, 56183, 56253, 63829, 61203, 59696, 56136, 53257, 54293, 58535, 59937, 65130, 61569, 58232, 56645, 61344, 62492, 57884, 52882, 55455, 59741, 52301, 28335, 183, -26535, -44790, -43124, -30370, -18062, -9237, -479, 6955, 10218, 10966, 15033, 17187, 20300, 29059, 32347, 24064, 20708, 21823, 22062, 28951, 33753, 25242, 19097, 5242, -21413, -47668]
17471d7668j1537j830P902P879J0465J0248Q110l44o812m78O115J1595J0337o559
17457b577j245m151L354J377m091n375m266L607P440Q520L762M074k873l403J236
17442E389O025M058J1031K0252J0312m582q364p745n437k436r487j0069j1508
17429b561l685L008J915M504j213n602J413Q05L522m883m017J267L595J722Q190
17414G980j392J836J034n07N47M172l465P17k904l309J396O47l642l039O663P66
17398G500r436K887L612m799n914J819q67L526K226l77L853J905j089l785j70
17383H91l059k158Q46K033L817L248k067K88K167o633n54L670K417l796n090L624
17367c56M705N66j214q927L639P488j558j878j876p159p90P50L151m116q05L346
$$ y = [-47668, -59205, -61035, -53133, -45254, -34789, -24541, -16431, -16775, -23587, -24065, -17950, -6355, 3982, -2577, -3822, -7973, -4619, -3242, -7333, -12708, -16974, -13367, -5927, 2593, 6355, 10429, 7556, 4153, 5389, 11414, 15472, 26503, 46755, 57067, 52485, 44121, 36376, 30939, 28503, 19016, 8947, -2561, -6246, -3238, -1323, 3181, 1968, -3634, -2221, -1416, 2106, -2777, -6794, -5527, -1932, -210, 7980, 6588, 8424, 9458, 8951, 9498, 13670, 10205, 10922, 8018, 4709, 6105, 6752, 3110, 71, 6734, 7500, -1936, 951, 4563, -236, -6150, -4331, -5198, -1672, 554, 177, 4030, 5935, 4846, 1061, 891, -2168, -4326, -3480, -1447, 2370, 5618, 3551, 3839, 6006, -627, -1181, 2489, 4906, 1110, -3980, -356, 4349, 4915, 3701, -5226, -1587, 5901, 4343, 2465, 589, -6570, -7360, -6610, -3459, -7575, -8380, -5034]
17351e034P016k711O54J195N19j9J381L875N874l464m378k170O75m317r097J883
17335h118M383J075N079j204K565N3j208r64j634J002J077k061J858j692n559
17320e348l926M334R064R355J0575M251l040q249p553j813m348j369n564k419
17306f050n36K878P788K481l383m60n991m296M136N294M265o581j68Q93P431K730
17290A0431n072k811m209L214J317j572l576n451q29m88N115L392r32K90k931
17275d112O663L622k888k464M198O41o862n771L441K911k72J400J964J69l813
17260a173K85M244k33k584N594J240j152J636M783n55l923r60k012n547J642M369
17244E654k015q029k339K366R26M471K106j026M310P200n768j0294n08O578N77
$$ y = [-5034, 1982, -729, -75, 1120, 1639, 1620, 3001, 6876, 12750, 9286, 4908, 2738, 3413, -904, -10001, -8118, -3735, -2660, 2419, 1215, 3780, 3833, 2625, 1661, 27, 1029, 2106, 45, 1903, 211, -5348, -9274, -4940, 4124, 13479, 24054, 28305, 25265, 17016, 9463, 7650, 3302, 1933, -3631, -6050, -6586, -3708, 4080, 6561, 3178, 2718, -3273, -7569, -3433, 1861, 6126, -455, -623, 270, 7701, 10431, 5359, 2548, -1661, 1553, 2870, 1298, -2278, -7729, -8558, -9046, -3931, -539, -1471, -1181, -4112, 2551, 6173, 3285, 821, 5019, 5660, -1202, -6973, -3532, -621, -893, 507, 2471, 2640, -1173, -888, 3356, 3123, 539, 6133, 7373, 6221, 7857, 12640, 12085, 8162, 7202, 5190, -357, 1285, 5654, 3639, -4390, -6729, -4363, -3437, 1034, 3140, 2114, 6424, 13624, 7856, -2438, -2946, 3632, 4209]
17229D209R81k811l96N770L746q206j412O20l542R56J417K262k598j617K569K043
17213C991j671l140j610n660j729N865M186L82m433J412J208o163n727O512Q49
17198e728N94M404k019j205k308k760J964L05l682k645O093Q119n6m388l893R90
17182f215J311k981J148L63N102M302o118k338K03L901k412m568p106r75P198
17167i185N687K319k083J397L120N129O14l283j360n584m073j378k055L77L322
17152g036K911j244n833O957J593K897k787K770N801N952K70p799o320n64j573
17137d005M25q67N033M487M425K294o824o153k395O175P28K196M88J79N305j654
17121I837m282q774L000N912N155Q83K681K397P867J6356K2424L8493O1570O2836
$$ y = [4209, 5190, 2379, 1983, 7753, 11499, 3293, 1881, 2501, -1041, -85, 1332, 3594, 996, -621, 1948, 3991, 2320, -820, -2430, -8090, -9819, -3954, 232, 614, -3819, -2407, -1199, -7362, -13089, -6577, -5728, -5134, -730, -2749, -3954, -6262, -9022, -7058, -6753, -10435, -13080, -6987, 1132, 1076, -3312, -7205, -6215, -4904, -7885, -6737, -6374, -1272, 3030, -3088, -5426, -5223, -1322, -3734, -8302, -15408, -16383, -9185, -3498, -1179, -3262, -1865, 1255, 6384, 6998, 3715, 2355, -3229, -7302, -8680, -10735, -10358, -7036, -4125, -5369, -11202, -4245, -2652, 245, -2542, 228, 6029, 11981, 12251, 4452, -1868, -2432, -4005, -3580, -4447, 586, 5073, 9498, 11792, 4968, -1185, -3580, 2595, 3323, 5519, 6007, 6186, 11491, 9837, 5555, -3219, -219, 5693, 10848, 11731, 14412, 16809, 24676, 41032, 63456, 101949, 163519, 226355]
17107B26355K2318k3437m4708n2292m7430k3161p447p177j2277r591l732P23M895
17094B3039o830l215k400K400P204M750Q021J0504J5500L2052M9957O5927L4437
17081B41346j4424m1366n2411m6803k7749j4870j2590j0899k430j0052n023M22
17069C151K01J0144r77q472L401K414n686j214J730O114M873m505n379l662l853
17054a720K371K439L88m672l16O068j76n010L022J79k499m845m75R009K672p293
17038h58l498l353N3Q64L1p67l139j399j126N252K752N962O70k154L388Q855K232
17021A3765j467k111L498p366l385Q029J094o294m895j834M19n50n56L097j33
17006A311L82j016q39M776L325J551j415k312j538p353k584m82n215l200N352
$$ y = [226355, 248673, 225236, 180528, 128236, 80806, 57645, 50198, 43021, 30744, 21153, 17421, 18144, 23039, 16209, 12994, 10594, 12994, 20198, 24948, 32969, 43473, 58973, 91025, 140982, 206909, 241346, 226922, 185556, 133145, 86342, 58593, 43723, 31133, 20234, 17804, 7752, 2729, 3151, 3352, 13496, 12519, 4047, 7448, 9862, 4176, 2962, 4692, 10806, 15679, 11174, 5795, 2133, -1720, 651, 3090, 3478, -1194, -1510, 4558, 4382, -628, 2394, 2573, 74, -4771, -5246, 3763, 6435, -858, -4356, -7709, -7656, -6792, -6761, -7528, -10667, -12066, -13192, -7940, -5188, 774, 1444, -710, 2678, 11533, 13765, 12298, 10187, 13685, 6319, 2934, 10963, 12057, 5763, 868, -966, -547, -1097, -1653, 1444, 1311, 1693, 677, -162, 4614, 7939, 9490, 8075, 5763, 4225, -3128, -5712, -6194, -11409, -14609, -9257]
16991i257L453j431N158J434j035N253k368J732k246n154J589P79N319J236k293
16976B169l769N606O524J072o726p590m668P55Q87r59k21L607L604l603j47m23
16960c882k6M45O645Q55o615Q11J871j61M240N126m101k886K83o78n322j01J753
16943a743j870m703M861L887k334K51N115L941n172m129N650K303k367K68k344
16928A614k63K944j982R39M221k089m511o038m796K469R024K707J354n232k203
16913a842j322j550N8M771J72Q79j630j381K75K368n827m318k807N280J288j805
16897g391J338L411o95K30M214M942k219l63m985n228l16k17m644M336M603l595
16881f579O24l066K687N879o527l892K910j732K532k824p36K268N270m095p020
$$ y = [-9257, -5804, -7235, -2077, -643, -1678, 3575, 1207, 2939, 693, -4461, -2872, -2093, 3226, 4462, 2169, -1600, 4006, 10530, 11602, 4876, -2714, -7382, -6627, -5740, -6699, -6920, -3313, 291, -3312, -3459, -3882, -3908, -3463, 3182, 4037, -2578, -1767, 104, -57, 4183, 9309, 5208, 2322, 2605, 1927, -3395, -3496, -1743, -3613, -8316, -3455, 432, -1902, -1651, 3464, 7405, 2233, -1896, 3754, 6057, 3690, 3958, 1614, 1351, 4295, 2313, 3252, 7473, 5384, 873, -5165, -9961, -7492, 1532, 4239, 5593, 361, -1842, -3164, -4714, -4656, 115, 287, 1166, -464, -1845, -1570, 798, -5029, -9347, -12154, -6874, -5586, -7391, -6053, -2642, -3337, -3107, 1107, 6049, 3830, 3467, -1518, -6746, -7062, -7279, -11923, -7587, -2984, -6579, -5955, -9021, -6334, -455, -6982, -10874, -7964, -9696, -7164, -9988, -10724, -8456, -3186, -7281, -14301]
16866a4301O002M040j194m405K902O49l043k178J277K873M15L999j856j051j024
16851f895L636L80l837q553R15P900K465j32n932J683K922K456Q59J626k453o88
16835c648K747o175l734K406L978o063R98r78o8r52K569N598O652l69k320l877
16819c236O470j35n386r190q49k1r69O5L993P196N813j035l830J461n82n601l206
16802i042j549M565O783N20j534n75K168R678O418p753j0403L295j195K725J687
16787E788p017L803m401k94L578R04L426J315k528L29J819j398j719J765N78M259
16771A0207m756k69j547m681l462k59N676J096k613m738j19J589L09N103k503
16756i67m166L685R20M925K026N525J324j719p584K88P02rR1j006m886l64p756
$$ y = [-14301, -8299, -4259, -5453, -9858, -6956, -6307, -9350, -11528, -10251, -7378, -6963, -2964, -4820, -5871, -6895, -3259, -2879, -6716, -15269, -14354, -6454, -3989, -4121, -10053, -8370, -5448, -2992, -2133, -507, -2960, -3648, -901, -7076, -10810, -8404, -4426, -10489, -9491, -10469, -10537, -11489, -8920, -3322, 3330, 2961, 641, -3236, 3234, 3099, -2287, -11477, -12326, -12347, -13316, -13251, -9258, -2062, 3751, 2716, -1114, 347, -235, -5836, -9042, -10591, -6026, 757, 1277, -257, -832, 1336, 11014, 17432, 9679, -724, 2571, 1376, 4101, 5788, -1229, 2574, -1827, -2121, 1457, 2361, 5787, 7102, 4574, 4903, 6722, 5324, 3605, 5370, 5948, 10207, 5451, 5182, 3635, -1046, -4508, -4767, 909, 2005, -608, -5346, -5465, -3876, -3567, 1536, -967, -5133, -1448, -528, 4397, 6423, 11948, 13272, 11553, 3969, 4257, 4959, 4950, 5041, 4035, -851, -1215, -8971]
16739h971l586R313L960m704k168K631m52K555K229p907j929n52Nj093N734O666
16723A731L278M487N872j055p289m419k624k33K542o991l815O222K150r32J553
16708D77o775m201P420nJ088M353J692J676L357l654o414O25q68n313K514L634
16692c94O999Q84k373k776k784k517N92N571K288K108q947p033J439O85M649O91
16676i18n518k822L156O792J676m012K622m31o756K008O9j592N653J57L786k542
16660A328o95q57O100N841o476r807n455L181M425N97N212M292l421m321K422
16645B366R86j975N49k236n803j80j803L769N856L051R1K692k710o158p694P23
16629h476R755n204n229l72O590M136K086o474j007R21M007k812l198P627Q399
$$ y = [-8971, -12557, -3244, 716, -3988, -6156, -3525, -3977, -1422, 807, -7100, -9029, -9581, -9576, -10669, -4935, 1731, 5009, 9496, 15368, 14313, 7024, 2605, -19, -252, 2290, -4701, -8516, -2294, -144, -1076, 477, -6298, -10499, -3079, -3084, -1996, 2357, 4049, 5725, 9082, 5428, -986, -361, -1229, -6542, -4028, -394, 6605, 7489, 5116, 2340, -444, -2961, -2369, 3202, 5490, 7598, -1349, -8382, -6943, -6258, -1609, -918, -6436, -9258, -6102, 690, 2366, -1646, 976, 545, -6211, -4203, -4134, -5726, -73, 84, 3870, 1328, 633, -224, 5876, 11717, 5241, -4566, -10021, -6840, -2415, -1818, 3394, 7686, 4265, -56, 2366, 3352, 1377, 1926, -310, -6113, -6293, -8096, -4327, 1529, 4580, 4671, 7363, 4653, -1505, -9199, -8476, 1279, -3925, -9154, -9526, -2936, 1200, 3286, -3188, -4195, -3274, 733, -2079, -5277, 2350, 10749]
16614A0749P00m4j436l494M31m68k471j228k600m901L404M680K174K110k478k339
16598B789j889j47l088K99O498k652p511m61L423K744l31p05n315R8N752L098
16582B602m597M538K02k362m724n27k574o096J044P629j753Q373M598j536J94
16567E011K452n007j238N712n909k241K834J804l190l361N056K80N48J773k751
16552A773o343L413p21j0406J813O551P787M308J493r37M257q12j075m397o210
16537D94q771R87J638K929P80J617R034J803m565k572n437m035K275k93M079R28
16521H91k289k225K452N075j080L899N529J817r53o072M61p659m107l598M360
16506c499Q834L925j187m934p002m422N429L969L166L857k391l568n579Q94j787
$$ y = [10749, 11449, 11405, 9969, 6475, 6906, 6438, 3967, 2739, 139, -4762, -1358, 3322, 5496, 7606, 5128, 2789, 900, 753, -2335, -2036, 4462, 1810, -5701, -6162, -2739, 5, -326, -1031, -6346, -6248, -496, 2602, -1995, 2543, 2745, 383, -4341, -4868, -7442, -13538, -12494, -4865, -6618, 1755, 6353, 4817, 5011, 7463, 2456, 1218, 6930, 1021, -1220, 1614, 3418, 228, -3133, 1923, 2203, 2751, 4524, 1773, -4570, -1157, -1878, -12284, -10471, -3920, 3867, 8175, 9668, 8731, 12988, 12176, 11101, 6704, 494, -8277, -7290, -5652, -2723, -1943, -326, 8708, 10511, 5946, 3374, -2063, -6098, -3823, -4116, -37, 891, -1398, -3623, -1171, 3904, 2824, 6723, 12252, 14069, 13116, 7044, 7505, -154, -4261, -7859, -3499, 5335, 9260, 8073, 3139, -3863, -8285, -2856, 1113, 4279, 8136, 5745, 2177, -3402, -2508, -4295]
16491d295L06Q8L823m930j826m896j961k088J467K980P762j139N088q56m660o95
16475e832J915K421N33r484N804J0481k126r128k84L542J865K925o450j432K708
16460b542j370L799J1351K404n723k408j30k628j938j213r059j88O520J195m787
16445f717r73K323l91n210l147L068K10L213o65n501P00L708J687M078K085j473
16429c005k386k015J246R28J539r29J737K361j061l851M368l233l104R98N918
16414d89L290L095k374l028K872l28l379J526k34q986m026J245P878J37j225K245
16398a781j59j08L033j505l160P117k555J878O27n119J76j376L972r86l458Q07
16382b597N542O407n87M75O01l73K476k228j28o028q619K991o12n17L54K852K132
$$ y = [-4295, -3989, -3901, -78, -5008, -6834, -11730, -13691, -15779, -14312, -11332, -3570, -4709, 379, -477, -5137, -5832, -3917, -1496, -963, -10447, -4643, 5838, 3712, -5416, -5700, -2158, -293, 2632, -3818, -5250, -2542, -3912, -113, 11238, 13642, 7919, 5511, 5381, 2753, 815, -398, -9457, -9645, -3125, -1930, -6717, -7690, -5367, -5758, -10968, -14115, -11047, -10837, -7624, -8289, -13790, -13090, -9382, -7695, -3617, -1532, -3005, -5391, -7406, -6160, -5232, -3693, -4622, -2885, -524, -1585, -5436, -1068, -4301, -7405, -6407, -489, 2801, 5896, 3522, 494, 3366, 3038, -341, 1185, 951, -8035, -12061, -10816, -2938, -2801, -4026, -1781, -1940, -2048, 985, -520, -3680, 3437, 882, 2760, 3387, -1732, -1556, -2932, 1040, 54, -3404, -2597, 2945, 9352, 8765, 9240, 9841, 9468, 11944, 9716, 9588, 3560, -5059, -2068, -2680, -3197, -2843, 9, 2141]
16365B141l265p151l610J091k93L309K452j643l367K648J382N0J85J566L201j593
16349b897O947l318m496r73M25o237k494j603M12R091P106k718r334R84J448J19
16333g538L362L467J965j129m284l448J298O761r03m38m654o241m048P26Q40M277
16317i987P017P822m778J634L176J590n37j889j738l90k731J23L503n682k628
16302e495K730L376K293p269p240K781P737Q49j135J882q69k66k12m724L613N042
16286C093m66N643K379p403k243p607m42l192J505N876N1N707Q07j367j018n767
16270d444l972l418K580L705N653l118k084M367J78k15j785j140p170K105N007
16255c751j63l386j717P697J787k690L041K963k829j545l529n53n91k690o59J391
$$ y = [2141, -1124, -8275, -11885, -10794, -11087, -7778, -5326, -6969, -10336, -7688, -6306, -6256, -6071, -4505, -1304, -2897, 4050, 732, -3764, -4737, -4312, -10549, -13043, -14646, -14234, -5143, 1963, -755, -10089, -9105, -7657, -7538, -4176, -709, 1256, 127, -4157, -7605, -6307, 454, -449, -887, -5541, -11782, -15830, -15104, -14264, -9987, -2970, 4852, 74, 1708, 4884, 6474, 5937, 4048, 2310, 1920, -811, -688, 2815, -2867, -5495, -2765, 611, 2904, -4365, -11605, -8824, -1087, -238, -1373, 509, -360, -626, -838, -5562, -1949, 3093, 2627, 8270, 10649, 3246, 1003, -6604, -7046, -10238, -8733, -2857, -2806, 2901, 3708, 2341, 1323, -4444, -8416, -11834, -9254, -5549, 104, -3014, -5098, -731, -553, -768, -2553, -3693, -10863, -8758, -3751, -3914, -7300, -9017, -1320, 467, -2223, 818, 3781, 952, -593, -4122, -4675, -5266, -7956, -8615, -7224]
16239g224m108J600L911L82j998m757o234P38O256N456L899L864O374l139k129
16224B891k601M88K797j18J031J2k913l930K919J029k253j509j301j070J215P174
16208C861j608K57M71j319N648N651j602m345k124L899m54n667q732l619Q082
16193a601L135j75M514N123j283k186q356o840J870j332J206J157P549o86p083
16178d988L726O040J367n470m118l840N95j0K933M176M328k684l095J439R410
16163I809N37k772n226m268j386K872L990q56m924J332om317M417P674l070m96
16147C310m57n570m334L238O120j173o215o13p36q26J056J789K670J256O250L416
16131I181n671K125j629p669J146P96k635m999J002N346l43j34L045J304O705
$$ y = [-7224, -11332, -9732, -5821, -5439, -7437, -12194, -18428, -17690, -11434, -5978, -2079, 1785, 8159, 5020, 2891, 290, 778, 3575, 3457, 4488, 4500, 1587, -2343, 576, 1605, -648, -2157, -3458, -4528, -3313, 3861, 2253, 2510, 2981, 1662, 7310, 12961, 11359, 7014, 4890, 8789, 8335, 2668, -6064, -9683, -1601, 1534, 1359, 5873, 10996, 9713, 7527, -829, -7669, -5799, -7131, -5925, -4768, 2781, 2095, -4988, -1262, 4778, 6145, 675, -3443, -7283, -6688, -6698, -3765, 411, 4739, 2055, -1040, 399, 9809, 10346, 7574, 2348, -1920, -3306, -434, 3556, 2700, -2224, -892, -898, -5215, -798, 6876, 3806, 3310, 2853, -2717, -7051, -3813, 2307, 1134, -5081, -5694, -6430, -7256, -6200, -4411, -1741, -485, 5765, 9181, 3510, 5635, 4006, -3663, -2517, -1721, -4356, -9355, -8353, -3007, -3350, -3484, -439, 865, 7570]
16116G570J007r021m541l929J787K59N336O806R714p88o108k716M161J56L518
16101A3211J72k380p93l644k749j708J214l519l254K287j718l852J002j255J33
16086f853J87L474l57m886L507K019M775J803k943K492o330o475M628J646Q81
16071b432J121K011P551N31n649J90j983n21r75k338N087N15l159j019N011M284
16055H225j839k466m896q51k675O23l154K105L527Q98p52k183M605K91k347n942
16039f831J909M733j92n006O30L60M249P377j794l863L031j190q42p911k146L745
16023c741L863K149j965l584j573K366J78l864J936J821L677J721l95K295J837
16008F721o040l354j022Q24O607k740o022M173K445J79J606j620n678k380n388
$$ y = [7570, 8577, -444, -4985, -8914, -7127, -6868, -1532, 5274, 14988, 14200, 8092, 5376, 9537, 9693, 13211, 13383, 11003, 10210, 6566, 3817, 2109, 3323, -196, -3450, -1163, -2881, -6733, -5731, -6986, -6853, -6666, -3192, -3549, -8435, -4928, -2909, 1866, 3669, 726, 3218, -3112, -9587, -4959, -3313, -2432, -1311, 700, 8251, 8782, 3133, 3323, 1340, 819, -156, -2494, 2593, 3108, -51, -1070, 3941, 8225, 6386, 3920, -976, -1827, -4502, -3879, -7033, -4928, -1401, -503, -1255, -3438, 1167, 1458, -889, -6831, -4922, -189, -381, -5387, -4757, -4397, -148, 7229, 5435, 1572, 4603, 3413, 2571, -5340, -7486, -3741, 122, 2271, 306, -3278, -4851, -2485, -2307, -6171, -4235, -2414, 1263, 2984, 2589, 4884, 6721, 681, -2673, -3695, -2871, 3736, 996, -5026, -853, 1592, 1771, 3377, 1757, -3921, -6301, -11689]
15993a1689j479N748M30J33O039o858j449j102M97O22J467N388j346m712J530
15978f781j147M342L207j0361J25N242L976J77K778j464L432L939l39m70l31n067
15962A258M67K648K722K017l856k701N166m489m559K464J153J267L299M21M609
15947A1886n385n001K940J321m754o351m185K682N951N09p23O87k838O499J833
15932E071n791k916j773K686O120k111m244j472K948J988k864k077q32O168l18
15917E83K538j575K998J219j515k25J080N7l45l977q47j71J831j854L215N690
15901H702M026o167n175Q44L045j347j845L836j746n768j379K466K968K215l038
15886A637J655L89k591l269N385K343j681P739l966o771j544k290O22Q61J780
$$ y = [-11689, -13168, -7420, -6990, -6857, -818, -7676, -9125, -10227, -9730, -9108, -7641, -2253, -3599, -8311, -6781, -7928, -3586, -379, -10740, -10615, -5373, -1397, -1220, 1558, 94, 3526, 7465, 7126, 6656, 6325, 1258, 1725, 4373, 7095, 9112, 5256, 2555, 7721, 3232, -1327, 1137, 2290, 3557, 6856, 7277, 11886, 6501, 1500, 4440, 5761, 1007, -5344, -9529, -6847, -896, -387, -1110, -423, -3261, 3238, 5071, -720, -3636, -5409, -2723, 3397, 1286, -2958, -4430, -1482, 506, -2358, -4435, -5267, 901, 583, 3121, 1546, 4544, 5763, 4248, 4023, 5103, 5160, 4815, 838, -9, -180, 1651, -203, 3012, 8702, 12728, 6561, 1386, 2230, 5275, 3928, 2083, 5919, 4173, -1595, -2974, -508, 2460, 4675, 1637, 3292, 3681, 1090, -2179, 3206, 5549, 3868, 11607, 7641, 870, -674, -2964, -2342, -1481, 299]
15871B99q61p732J30K005J598L901O06J952K931n446j035o85n08j341M771O655
15855G240j377k281q98k983k654L944On493N880o16j733r14K945k884o074j385
15839i277R557k174o230k960L94L520j585L477J903m312K273L323p34l98L837
15824F14k772J629M197j880m930k554M86n24J687J304P942L381K25M557m547p057
15808A758k426r16l399L587K407l628m165m335L215J756j329J561K50k570N712
15793b522J048L336m235l69N458O079l019l251L892m174n342k300L916K385K297
15778C199L97m041m558L490K188M07j229k540p042n496p13O279M159m59M452J170
15762c37N8M11k192j510L445K543M72M726J685j520L835n743l96J101j958L036
$$ y = [299, -562, -8294, -8164, -6159, -4561, -660, -54, 1898, 4829, -617, -1652, -2337, -2845, -4186, 585, 7240, 5863, 3582, 2684, -299, -2953, 991, 997, -4496, 1384, 768, -965, -1879, 1066, -1818, -7892, -9277, 280, -1894, -8124, -11084, -10690, -7170, -8755, -5278, -3375, -7687, -5414, -2091, -2825, -3223, 614, -2158, -529, 3668, 1788, -3142, -5696, -5210, -5734, -4047, -2743, 5199, 8580, 8805, 13362, 8815, 1758, -668, -1584, -4983, -1396, 1011, -2617, -6782, -11117, -7902, -6146, -7475, -5914, -5664, -8234, -2522, -1474, 1862, -2373, -2742, 2716, 8795, 5776, 2525, 6417, 2243, -3099, -5399, -1483, 902, 3199, 3596, -445, -5003, -1513, 675, 1082, -147, -2687, -9729, -15225, -15938, -9659, -5500, -5959, -1507, -337, -279, 132, -2060, -3570, -125, 2418, 2890, 7616, 9301, 7781, 11616, 5873, 5477, 6578, 4620, 7656]
15746G656P45j339j347l036K337o99l360l730j7j485k068l411P91L150Q63M505
15730d45L114j652J263j287m355j516j609k339O549L731o957J227j005l67M85
15715e163L069K869j894j794j929n486K247P145N360J557m050j860p34k109j951
15700d723J335K051K591j212l720q831Q39L339j39K02N422P323M688K783j630
15685A0318p165q383L023k106J58P97J4107j42l277m192j631q17J614j386J990
15670B908M435k008o863J3P33k014O134P97p469J855L446l865M791K305o035P383
15654F546K564L110l792j2810o65R949N268J108l343j994m042j785n359m149L771
15639e623j042J052n646l609J0829Q960q18j360k15r45l857l839K002n220l149
$$ y = [7656, 8401, 7062, 5715, 2679, 5016, 4317, 957, -2773, -2790, -4275, -6343, -9754, -8963, -5813, -4950, -445, 2669, 1017, 2280, 993, -3362, -4878, -6487, -8826, -2277, 1454, -5503, -4276, -5281, -5648, -5163, -2094, 775, -1119, -2913, -4842, -10328, -8081, -936, 4424, 5981, 1931, 71, -663, -2772, -4723, -3388, -1337, 1254, 42, -3678, -12509, -11670, -8331, -8470, -8268, -2846, 4477, 9165, 11948, 10318, 3153, -5230, -2207, -4313, -4155, -3358, 10749, 10607, 7330, 3138, 1507, 690, 2304, 918, 2908, 7343, 5335, -1528, -1515, -782, -2796, 3338, 4135, -3334, -1479, 1967, -1898, 2893, 5198, -837, 6546, 9110, 12220, 8428, -4382, -5047, 4902, 10170, 11278, 7935, 5941, 1899, 114, -5245, -9394, -5623, -6665, -5613, -11259, -14868, -4039, 4921, 4103, 2743, 2528, 1583, -2274, -6113, -4111, -9331, -12480]
15624a2480J856J062M759J498J080j127m611R22J284k884Q4L706k18M75L838N575
15608D819N89O58L2k963R84j552n017j696K407M255L815l408j407N88j168J707
15592B643L729l63k171n536m21q85J519j841O935j866j820R40j460J126k638l00
15576b409K007k526j058O656M92l840k70J518k373q547J771Q552q87m251j1324
15561a6489P02O066R197L793L547m587m856L562K742j461n763m057N224J14l460
15546e726m626K16K992P177j581n990J504L896J532N126m808k309L439j049m643
15531d850K951L060j495j645k703m171j55P84k678k16Q703N493N711R71n158m639
15515c7k965J261k235l362M57j780k938R02K310q70j849J0440O122q75K299K337
$$ y = [-12480, -10624, -9562, -4803, -3305, -2225, -3352, -7963, -7041, -5757, -8641, -8557, -4851, -5069, -4594, -756, 4819, 5408, 6066, 6098, 3135, 4119, 2567, -2450, -4146, -1739, 2516, 6331, 2923, 1516, 2104, 936, 2643, 6372, 6009, 3838, -1698, -2119, -3004, -1485, -3326, 3609, 1743, -77, 863, -597, 529, -2109, -2409, -402, -2928, -3986, 2670, 3162, -678, -948, 570, -1803, -10350, -8579, -27, -914, -5165, -16489, -15787, -9721, -524, 3269, 6816, 2229, -2627, 935, 3677, 2216, -3547, -7604, -2380, -2266, -5726, -10352, -10136, -7144, 33, -1548, -7538, -6034, -2138, -606, 4520, -288, -2597, 842, -207, -4850, -1899, 1161, -334, -1979, -4682, -8853, -9008, -8224, -10902, -11118, -2415, 3078, 8789, 9760, 4602, -37, -3002, -1741, -3976, -7338, -6881, -8661, -11599, -10697, -8387, -9257, -11106, -666, 5456, 4581, 6880, 9217]
15499I217J437J456J852j842m898n501k297l407P11K351Q70N299l070o893K610
15484b105K071j133l351K57l95J540J333J597j517O89n907k529K501M697k664
15469d916J270O57l345n944K804j657K419l9o3m439N6L662Q47P686O918l314q187
15452e585r74m51K508O212J266Q631j542o248k145l629N15M334j092k407K294
15437A687k200p978q73L888K871n472k500L179q341j913N239N9J569K360Q52m776
15421a2349J541P351R653q48r153J511Q883m935n716j387j23J202Q373Q904k497
15406A0410j453O22j898l905m095Q636P170n469j669k166j394k463N56J505l667
15391G20l589j147j967P91J405L874j126l347j111K903P463k29k882n900j687
$$ y = [9217, 10654, 12110, 13962, 12120, 7222, 1721, -576, -3983, -3272, -921, -51, 5248, 2178, -4715, -2105, -34, -1167, -4518, -4261, -4656, -3116, -1783, -186, -1703, -1014, -6921, -9450, -6949, -2252, -4916, -3646, -2989, -6334, -12278, -9474, -11131, -8712, -8751, -8814, -13253, -13197, -9535, -8688, -1002, 5916, 2602, -5585, -6559, -7010, -4502, 1710, 2976, 11607, 10065, 3817, 1672, -1957, -1442, 2892, 1800, -607, 1687, -513, -8491, -9364, -5476, -2605, -8077, -10577, -7398, -15739, -17652, -12413, -12354, -10785, -8425, -7573, -12349, -10808, -3457, 6196, 5348, -3805, -2294, 6589, 1654, -4062, -5449, -5572, -4370, 4003, 12907, 10410, 8957, 9579, 7681, 3776, -319, 8317, 15487, 10018, 8349, 6183, 4789, 2326, 2882, 4387, 720, -2869, -4016, -5983, -5192, -3787, 87, -1039, -4386, -5497, -2594, 4869, 4640, 1758, -4142, -5829]
15376e829L545j893j776K678P62k033J581R05P93M369J150k795r249j636M904
15361d524J174K8J026J855p07n43K726j657R2K245N103p49p779n32Q175N978j275
15344A0636p135j225k51K436p576k437Q17J169n96j014O07j890n358l06P95N961
15328e367N076L697o03l476k15k061J080j136q774O62O798J829k501k348L87L891
15312c061P083J726J069m193K79O72J279k792m104l051K386q59N065j833m174
15297d508K170l913K850M403r654k902j965M001P681Q831l202o456M48M052k194
15282c58n291k929J0113P723K550l127p292L760k538l19K431L580k179k887L785
15267G022j645k299l989L265M127j664j250k961j608k248J869J225l960j405J302
$$ y = [-5829, -2284, -4177, -5953, -3275, -2513, -4546, -2965, -2060, -1267, 3102, 4252, 1457, -7792, -9428, -4524, -3350, -3322, -2296, -441, -1148, -1691, 1035, -622, -530, 1715, 6818, 6069, -1710, -2242, 5933, 11911, 10636, 3501, 2276, 2025, 4461, -3115, -5552, -4735, -3566, -4162, -5176, -4569, -6459, -11817, -12123, -11328, -5367, -291, 3406, 2803, -673, -888, -2949, -1869, -3005, -11779, -11117, -4319, -2490, -4991, -7339, -6952, -3061, 4022, 5748, 6817, 2624, 2903, 3575, 4854, 2062, -2042, -5093, -2707, -3566, 1499, -334, -4508, -2338, -6251, -3401, 1002, -8652, -11554, -13519, -9518, -1837, 6994, 3792, -2664, -2216, 1836, -358, -5649, -8578, 1535, 9258, 11808, 8681, 1389, 5149, 2611, 2292, 4723, 8303, 6124, 3237, 7022, 5377, 3078, -911, 2354, 6481, 4817, 3567, 606, -1002, -3250, -1381, -156, -4116, -5521, -4219]
15252d219P52k922m415J213P98j878M975L194K272P30l44P07Q35k782l364m728
15236i176J51K424M843N184J504l17J003J507J592N481K529n110l110m853n835
15221b183m100J317L163M579l577j310J600m746l906N08M210j935p97l54j205
15206h736O108J1171L599m200p912L104M205N73l703m303l601m656k792J309M274
15191e560M425J520M50j775n315m428k231M264L907O085j85m425j215j37J404
15176c216j349m41J07l131M226L008L489n832j341K160l171q99M352k677m29M326
15160h18J993j316k941J487J686K852M001m64o377k159K351K628Q024J637r883
15145B701j158J174l753O10M810m831L543M349K762j170o022n160L629M736J153
$$ y = [-4219, -3467, -6389, -10804, -9591, -8793, -10671, -5696, -2502, -230, 500, 156, 863, 1698, -1084, -4448, -9176, -9025, -6601, -1758, 3426, 4930, 4613, 5616, 7123, 8715, 14196, 16725, 11615, 8505, 3652, -2183, -6283, -4966, -1803, 2776, -801, -2111, -511, -5257, -9163, -8655, -4445, -6380, -7177, -7531, -8736, -2628, 8543, 12142, 7942, 30, 3134, 7339, 7912, 4209, -94, -3695, -8351, -11143, -9834, -5560, -1135, 385, 835, -940, -6255, -10683, -12914, -8650, -4743, 1342, 1157, -3268, -4483, -4620, -3216, -4565, -5006, -4899, -8030, -3804, -796, 2693, -3139, -4480, -2320, -5491, -6390, -2038, -4715, -5144, -818, 1175, -141, -3082, -1595, 91, 2943, 6944, 6480, 103, -2056, 295, 2923, 10947, 12584, 2701, 1543, 2717, -1036, -426, 4384, -447, 3096, 7445, 10207, 9037, 3015, -2145, 1484, 6220, 7373]
15130G373J1013J010j1802o22n03k601k328J629r502j0027n808O388N572K717
15116g491K066J604K630k071j162n280P87O961k73J145N234K366n582l224N231
15101B941P22L83k439N62L307k008q543k417J967j155K327p32Q296L332j912k530
15085B101j446j192k787K263J76O936L887J541l183p384j649J840o37M044l302
15070A208J973M96o519o300l52Q395L795K780j435j1467l015K611K920m04K432
15055b882l367m277m35m134k325N300L032Q903L660M147k404j407o428o290Q40
15040h067k368m408O594Q466K507p5n169j587l45k610m533K154L603j545N281
15025b102M080l913J072J075J321l762k565K389m765m67j546l688J342O911Q651
$$ y = [7373, 18386, 19396, 7594, 6972, 6469, 3868, 1540, 3169, -6333, -16360, -22168, -15780, -10208, -7491, -5425, -3821, -1191, -3262, -4424, -9704, -8917, -1956, -2229, -1084, 4150, 6516, 934, -2290, 2941, 3663, 4046, 1607, 2169, 5476, 3468, -5075, -7492, -5525, -6680, -4353, -5085, 3211, 6543, 4631, 2101, 655, -537, -3324, -1061, -885, 6051, 9938, 11479, 8296, 912, -737, 1103, 466, 4510, 1208, 3181, 3677, -2842, -9142, -9494, -1099, 2696, 5476, 4041, -7426, -10441, -7830, -4910, -5314, -2882, -6249, -10526, -10961, -15095, -17420, -12120, -9088, -185, 3475, 7622, 5218, 3811, -2617, -8907, -8067, -10435, -14843, -8249, 217, 2724, 2649, -2520, -4107, -4452, -7062, -11595, -9441, -5838, -7383, -2102, 1978, -1935, -863, 212, 1533, -2229, -4794, -2405, -7170, -7637, -9183, -12871, -11529, -4618, 4033]
15010D033k863q424q09N048N966m61Q21k430o615M107n02m091O28K005m450M108
14994c929P061k50l886J163J086Q51L695j502k871k94R10k618K539J983O10J07
14978D655l026n33p83j497k047o957l135O043Q544O421j390m340O644K753n923
14963E429m260Q17J601K317Q19K7l777l215K139Q259M469n121p008o11M848J93
14947F926l634J082Q93J673p004n625l034K290p28k66N934L818o265n645K756
14932f829P920M641o56J139K576J501J122m739j937J960Qm580m511k886m46L751
14916a966j187P53O243L567o068p281J038M338J032l174j541j936o8L42L440R28
14900a540l156k797L985M607j524n289K703n1J740k914K196N372J776n028k286
$$ y = [4033, 1170, -7254, -8063, -3015, 2951, 2490, 3311, 881, -5734, -1627, -2129, -6220, -5592, -3587, -8037, -3929, 3132, 2882, -1004, 159, 1245, 2096, 5791, 4289, 1418, 1124, 2034, -584, 1955, 3938, 4548, 4655, 1629, 1096, 313, -1184, -3231, -10188, -13323, -7280, 1264, 7685, 6295, 1955, 8599, 11352, 5429, 1169, 1986, 3587, 5904, 6723, 6750, 2973, -242, 1897, 10156, 14625, 9504, 2496, 1885, 6733, 6926, 3292, 4374, 5267, 6940, -64, -5689, -8723, -6433, -7161, -7427, -1493, 2325, -3940, -9585, -6829, 1091, 5732, 5076, 6215, 8791, 10292, 11414, 6675, 4738, 6698, 6706, 2126, -2385, -5271, -5717, -1966, -3153, -2400, 3843, 7410, 1342, -5939, -4901, -563, 469, -2705, -4246, -6182, -6250, -5908, -2468, -1540, -4696, -7493, -3508, 1099, -425, -5714, -3011, -3062, -1322, -4236, -2040, 3332, 5108, 80, -2206]
14885b206l79L56N23k110l570M90J874n193K748N060O568M27n789n349L68J885
14869d297N486p643L971Q136j856j018l62J572J963n492O01J58n181K945M184
14854C167J390l71N34q12k097L433L03k306o027q778N167L079K995l156N81j28
14838c026k164K019L321O151q42M28l446m220J673K608L161m320l330N451N812
14823I276l309l820j251n189R99K130j741K08m38J396Q9N537Q443J445l638n301
14807D836o541j150R955p10o44K800l838o641j311k984L932M000J003K792k52
14792E247m132N026j556q450k338N772P46L82K055J355q03k971j603Q25p41M617
14776C431K045m022l330j333M893O659N414n717p246k773k299K402R525k92o919
$$ y = [-2206, -2585, -2229, -1706, -3816, -7386, -6896, -5022, -10215, -7467, -2407, 4161, 4588, -1201, -6550, -6182, -4297, 1189, -6454, -2483, 5653, 3797, 2779, 2417, 3989, 5952, 460, 1061, 1219, -3962, -1017, 3167, 4557, 4186, 4720, 3908, 1811, 5244, 5547, 3241, -2786, -11564, -6397, -3318, -323, -3479, -2898, -3026, -5190, -3171, 150, 6301, 5459, 5887, 2441, -1779, -106, 2502, 5663, 1343, -1987, 3464, 9276, 5967, 2147, 896, -4293, -3294, -1164, -2905, -2697, -3135, -1739, -1650, 3887, 12330, 13775, 10137, 4836, -1705, -2855, 7100, 6390, 5746, 8546, 4708, -1933, -3244, -6228, -2296, 1704, 2707, 5499, 5247, 1115, 6141, 4585, -3865, -6203, -431, 315, 697, 2752, 4107, 3304, 333, -1270, -445, -1186, 3431, 5476, 1454, -1876, -3209, 1684, 8343, 13757, 8040, 794, -1979, -4278, -1876, 7649, 7357, 438]
14761D38o892j589r61O384O285m355j415K130M909J967L083n048o226N597M136
14746H443m094l577O42J287j071k859K021O153n776j344o442q70L516q93l224
14731h088J634K910J822P367M241J828k435K598l052m165j876m11n355l11R30
14716b363L139j0M648j847o864K633j423K84R44l187j251P088N066k735p99l579
14700b56K392K865K907L248n80p508l799n1K59j247k662N05J560J142n86k380
14684d191n999n360M678O946N992n041P198M961p43j997m152j082k874L192N477
14669G005l255n351K486j945M1L568N548L155l513k624m604N223j486l792n65
14654a09l172n40j145l99M819K721j328J905k483N61M491K684P17M18k579N43
$$ y = [438, -6454, -8043, -9004, -2620, 3665, -690, -2105, 25, 4934, 6901, 9984, 4936, -1290, 4307, 8443, 4349, 772, 1414, 2701, 1630, -1229, 792, 6945, 1169, -175, -6617, -7487, -3971, -4864, -8088, -6454, -3544, -1722, 5645, 9886, 11714, 9279, 11877, 8825, 4660, 2784, 2373, -2982, -3293, -2363, 776, 766, 5414, 3567, -3297, -664, -2087, -1803, -859, -4046, -5297, 1791, 6857, 4122, 3323, -256, 2136, 5001, 7908, 11156, 10576, 3068, -731, -782, -523, -1770, -4432, -3927, -2367, -1225, -1811, -4191, -10190, -15550, -10872, -3926, 2066, -2975, 4223, 9184, 8441, 6444, 2292, 1210, -1664, 1528, 7005, 3750, -1601, 885, -1060, -1019, 2549, 8097, 11252, 7739, 5115, 511, 5734, 4248, 456, -109, -3281, -3821, -4966, -5365, -546, 2175, 847, 2752, 269, 830, 5321, 8005, 8722, 9140, 6561, 7104]
14638G104j855j815j025j039j578M05q74o21M606L199k032M73R37k418K68K616
14622F351J776M811J623m080k658K549J159j578M17k642l700j198k759p476n078
14607a2483L225Q150K526o040J149p86j525P443j169q9J678N919o69k271J282
14592F340m335m533J165O356j544n243J517l366k650L762N455n3m498k89P555
14577E639J940o389q752K718k464N091M869m857q79k342p714O694M389R76k030
14562c111o480k881N950K189L135J684k402r80L091M475K65R69m332m343j024
14547c795L845R02j069n671m946K677P911l410m094m50m689L582J1980L52o406
14532c281l949J084J270k631n595R24l825r77K219K754J502J326K879K429P93
$$ y = [7104, 5249, 3434, 2409, 1370, -208, 197, -677, -1298, 3308, 6507, 4475, 4948, 5885, 3467, 3735, 6351, 8127, 12938, 14561, 10481, 7823, 10372, 11531, 9953, 10370, 7728, 4028, 2830, 71, -7405, -12483, -9258, -1108, 1418, -4622, -3473, -4259, -5784, 1659, 490, 401, 2079, 7998, 7329, 5058, 6340, 2005, -2528, -1363, 4993, 3449, -1794, -277, -3643, -6293, -2531, 2924, 2871, -1627, -1916, 5639, 7579, 1190, -7562, -4844, -7308, -2217, 2652, -2205, -3084, -5426, -13140, -6446, -2057, -1081, -3111, -9591, -12472, -6522, -4333, -1198, 486, -1916, -2896, 195, 4670, 4935, 5904, 1572, -2771, -3795, 50, 952, -117, -5788, -10734, -8057, -146, -3556, -7650, -8100, -12789, -9207, 2773, 3125, -3281, -7230, -6146, -4876, -7507, -13102, -12178, -16003, -16980, -14761, -12007, -10505, -9179, -6300, -3871, -3078]
14517c078L856P715M588l919l633k601r095K133L290J465k318n576o998n900K347
14502a7724P840P460j851M3k763J377N603M792N35l21o548p035P177O401J329
14487F315o718o843q8M056k390j955P8O025P772n977R82M560J682j0462k837m355
14471a0155K924K992r39K420l939k288n62m47Q415M529J433j314m296M891j784
14456A880j350j664k382O077K186l347o759j23K126m743j910N928O726j991q66
14441b12K121j297j461k553k807j848j84l295j692J201n03j234L251J2412P970
14426I869m545K197R00o802k892L708P320l03n311n582k098L013l340m941L858
14411d949N799L78j793k083l168J724L908j487K081m351m777M460o84r732N866
$$ y = [-3078, 778, 8493, 13081, 9162, 5529, 2928, -6167, -4034, -744, 721, -1597, -7173, -14171, -20071, -17724, -9884, -2424, -4275, -4232, -6995, -5618, -15, 4777, 5312, 4991, -1557, -8592, -1415, 4986, 6315, -403, -7246, -7334, -3278, -5668, -7623, -7545, -1520, 6252, 275, 1257, 5817, 7499, -2963, -5800, -10155, -7231, -4239, -5178, -2758, -6697, -8985, -9547, -9994, -1579, 2950, 4383, 3069, -1227, 3664, 1880, 530, -1134, -3516, 2561, 4747, 1400, -5359, -5482, -3356, -8099, -10009, -4081, 2645, 654, -212, 1909, 612, -849, -3402, -6209, -8057, -8241, -11536, -13228, -12027, -12530, -13764, -10513, 1899, 9869, 5324, 7521, 8421, 1619, -1273, 2435, 9755, 9452, 4141, -1441, -3539, -526, -3866, -8807, -4949, 850, 1228, -565, -2648, -5816, -4092, -184, -1671, 410, -3941, -8718, -4258, -4942, -14674, -8808]
14396h808K624m606P236P328L182q873p500l4J843P590K858k357J856M137l280
14381C196n847J880K229J007k131j042K48O36L268L696k250J991j124j748j189
14366B820L753m493R6L618M503l558J667n890M750l359j0427j049r51N760J538
14351a222N055J2272L434j049K783m767r508j70J320r163o345M639M515o787n168
14336a0161k279N42L185J401L66q86K185K566P85j004m826L998N645L247n343
14321e79l395k355r81N362o75N356M045P81K762L76l207K327j133J385k549p636
14305a16k365L100k500o957q223J17O308O751j077j802O493K49m48N022k979j711
14289a38L093q094l303M100j131J79K883O56j434m78l312J291O656K886k78J244
$$ y = [-8808, -6184, -10790, -3554, 3774, 6956, -1917, -9417, -9451, -7608, -18, 2840, 483, 2339, 6476, 3196, -2651, -771, 1458, 2465, 334, -708, -460, 176, 3444, 7140, 4890, 6881, 5757, 4009, 2820, 6573, 2080, 2176, 5794, 10297, 6739, 8406, 2516, 7266, 3907, -6520, -7569, -8520, -2760, -1222, 3833, 16105, 19539, 18490, 21273, 16506, 6998, 6828, 8148, -1015, -7360, -2721, 1794, -4993, -10161, -12440, -11898, -8713, -7312, -6946, -7832, -5647, -3081, -2296, -3300, -8126, -4128, 1517, 4764, -579, -3974, -6329, -7310, -1948, -2623, 2733, 6778, 7559, 10321, 10697, 7490, 9817, 8684, 10069, 7520, -116, -2481, 619, -1881, -8838, -17061, -16944, -10636, -3885, -4962, -6764, -271, -22, -470, 4552, 1573, -138, 2955, -5139, -8442, -4342, -5473, -5294, -2411, -1755, -3189, -3667, -6979, -5688, 968, 3854, 3576, 4820]
14273D820K840N502K371o349m919J863l844n837k334m068j484P042L226k955J815
14258b311M237k419m514k202L253K529K145L985J659k780o035n60M977l40K215
14243C839J45J37n883n283l485j430m37M282O584Q04K525q49m379J713p77l891
14227f385j00Q423o60m489J277J99j123j532Q38j506M258J719O45r093l775m15
14211a1719M944R619K77L914K961k723q49j591P299j468j578p024l191K990N32
14196B393k731l968j577L956k905k603O006L165L322p96m872L596n530j917N61
14181c900J686r47L09m227l351L733L563N309k416j756j364k31m885q34L208j016
14165g119K047j136J1132O383m421l328L43k199l30k091j198L253M0k734k670
$$ y = [4820, 7660, 13162, 15533, 9184, 4265, 6128, 2284, -3553, -5887, -9955, -11439, -4397, -1171, -4126, -2311, 1926, -493, -5007, -7209, -3956, -1427, 718, 4703, 6362, 3582, -2453, -3013, 1964, 1624, 3839, 3984, 4121, -1762, -7045, -10530, -11960, -12397, -8115, -1531, -727, 1798, 949, -3430, -1717, -2494, -6385, -6485, 1938, 1278, -3211, -1934, -1735, -2858, -4390, -3552, -5058, -800, 919, 1564, -7529, -11304, -11719, -6775, 2844, 3121, 7035, 9996, 7273, 6424, 4833, 12132, 10664, 9086, 2062, -1129, 1861, 2393, -338, -4306, -5883, -1927, -4832, -7435, -1429, 1736, 5058, 4262, -610, 2986, -2544, -4461, -3900, -2214, -3161, -2852, -7079, -10430, -6697, -3134, 2175, -241, -1997, -3361, -3592, -8477, -9311, -6103, -7119, -5072, -6208, 4924, 11307, 6886, 3558, 3901, 1702, 1372, -719, -1917, 1336, 1376, -1358, -4028]
14150d028l470K841L540L589M690k404L11N211k974o76J439L982L123L08n044
14135A0438q845m097l229l37J1001j678l831k655J709K05J124p32l164K381p93
14120b503J791j361l816j54j644m420N162J3735l769p650n005N120O474k260J651
14105A351O687O55m517P81j779m799K262L147O100q71k724q532r10K574K686M977
14089G088Q658M60l903q98k64j365l379Q2r046m81k463j552k109M782P529l043
14073I6J586K501j518M890N324J350p63p436l010j935J834o20m191j090J370L442
14057A830N14j784j945l820K634r01m516j283O077K19n153j534k856N752k005
14042h771j114l591J714P478L616K315L234M102K70q019n051L033L603Q76M654
$$ y = [-4028, -7498, -4657, -1117, 2472, 7162, 4758, 5069, 10280, 7306, 6630, 8069, 12051, 15174, 15482, 10438, 1593, -2504, -5733, -6070, 4931, 3253, -578, -3233, -1524, -1319, -195, -927, -4091, -1710, -2503, -712, -2073, -5889, -6043, -7687, -12107, -6945, 6790, 3021, -4629, -9634, -4514, 1960, -300, 1351, 8038, 8693, 4176, 4957, 3178, -1621, 641, 3788, 9888, 9017, 6293, -2239, -3149, -575, 2111, 7088, 15746, 16206, 12303, 11405, 11141, 9776, 6397, 6479, -2567, -3048, -5511, -7063, -9172, -4390, 3139, 96, 1682, 4183, 2665, 7555, 12879, 14229, 13466, 6030, 3020, 1085, 2919, 2299, -1892, -2982, -1612, 1830, 2344, 560, -1385, -5205, -2571, -3472, -7988, -9271, -3194, -2975, -8128, -9662, -12518, -6766, -8771, -9885, -13476, -11762, -4284, -668, 1647, 4881, 8983, 9253, 1234, -3817, -784, 2819, 3695, 8349]
14027H349J999J371K950n154k452J143k892n711q234m145q29M709Q416j001n006
14012f487j16J020J374k502M568Q495L33J482l258k166k560k754L182P547p414
13997G44k211J578O888l881J2R35K384o877k633j456K405K218J283N620k99J587
13981H297J186q65k603p067M79P16K342K810l191K68j696J244J789o043k738m747
13965i819O41l71J836j952j176M241J889o987j52K434K128P75m056j458P142k107
13949f992k044k059K921R09K180K305J30n83O631O141k043J287k708j0611r898
13934a4434J450R560O284m542j253K131R39m503m237l521m67J049O893L308O899
13919E556m924l555O050l046k088j508J274K834M771M379k218p809j500N228J426
$$ y = [8349, 10348, 11719, 14669, 9515, 7063, 8206, 5314, -397, -8631, -12776, -13605, -8896, -480, -1481, -6487, -6603, -5583, -4209, -6711, -2143, 6352, 6685, 8167, 4909, 2743, 183, -2571, 611, 8158, 744, -1467, 111, 6999, 3118, 3130, 4065, 6449, -428, -3061, -4517, -2112, 106, 1389, 7009, 6710, 8297, 9483, 8618, 6015, -1052, -573, 143, 2485, 5295, 2104, 2372, 676, 1920, 3709, -2334, -5072, -9819, -9178, -9549, -7713, -9665, -10841, -6600, -4711, -11698, -11850, -9416, -7288, -6513, -10569, -12027, -4885, -6992, -9036, -11095, -8174, -7265, -5085, -2780, -2650, -3233, 3398, 9539, 7496, 8783, 6075, -4536, -14434, -12984, -3424, 2860, -1682, -2935, -804, 135, -4368, -8605, -12126, -12593, -11544, -4651, -1343, 5556, 632, -2923, 3127, 81, -2007, -3515, -2241, 593, 5364, 9743, 7525, -284, -1784, 3444, 4870]
13904D870K85L353n3j004l848J204M60J025m334O36j7j514l161n934J608Q285
13888A861K334N51k267m030K150K467O03n294j906M393L303m655l058J603k471
13873d416O899J770r59j274o420j351n04K534R961J514J172M977q52p121p45k053
13857C132k976J240N24j034j326p72J017M465M884m046k332k62J199l400m160
13842c847J311J890O819j073j0850r155J299R635L259j758m204l447l534K279
13828a1376R81J688J782O099j032l049J554K088r93k218o789l834K480N700R43
13813e976M45P088K968m221J270L78M2k740l670k381j695N008p49l039j630n027
13797a3929j729N507O449L230j016j608j030J299K980J044O881R98n85m725m984
$$ y = [4870, 5155, 8508, 8455, 7451, 3603, 4807, 5267, 6292, 1958, 2594, 2577, 1063, -2098, -8032, -6424, 1861, 4195, 4746, 2479, -1551, 599, 3066, 3669, -1625, -3531, 862, 4165, -490, -3548, -1945, -4416, 2483, 4253, 3294, 2020, -4400, -5751, -6255, -3721, 6240, 7754, 8926, 13903, 13051, 5930, 5185, 3132, 156, 1396, 1920, 886, -440, -1212, -195, 4270, 9154, 5108, 2776, 2514, 3713, 313, -3847, -2536, -646, 6173, 5100, -5750, -14905, -13606, -3971, -712, -2470, -6674, -10121, -13655, -11376, -10395, -8707, -6925, -826, -1858, -4907, -3353, -1265, -2258, -4476, -11265, -15099, -12619, -6919, -5976, -5531, 1557, 4525, 304, 1574, 1952, 1994, -746, -4416, -6797, -8492, -3484, -4233, -7272, -8902, -13929, -15658, -10151, -3702, -472, -1488, -3096, -4126, -2827, 153, 1197, 8078, 9076, 8491, 3766, -1218]
13782a218m772q384J826N272J128K281L540L266n967k1L464O322j156l252j107
13767A222L457J940l519k156J712k082J187K085j258k851q825K147M698L373N993
13752G123M5n496R53J821k339l494n523j218Q077N033K42L06K167K214N000j951
13736A2960p621j963K343m87n908k46k426L396l561J070M030L128N443m145K892
13721H905m928j175k916q37N48N543M589m638k574Q43L981M370r29q158l902O32
13705f46j702o809O821L852n4Q45N314p388J989p8K119L133p484k948k670K495
13689c211M334l377n707R122R330m263k046p65k810L528J556J208N09k037j488
13674C883k155p757j655N911M676k419l427P39J315j76P071M841o859q610j392
$$ y = [-1218, -5990, -14374, -12548, -7276, -6148, -3867, -327, 2939, -3028, -3049, 415, 6737, 5581, 2329, 1222, 4679, 6619, 3100, 944, 2656, 574, 1761, 3846, 2588, -263, -9088, -6941, -2243, 1130, 7123, 7168, 1672, 2625, 4446, 2107, -1387, -6910, -8128, -51, 4982, 5224, 5530, 7697, 9911, 14911, 12960, 5339, 3376, 5719, 5232, -676, -922, -3348, 48, -3513, -2443, 1587, 4715, 10158, 6013, 8905, 3977, 2802, -114, -951, -403, 5140, 9729, 5091, 2517, 3360, 7341, 11711, 10782, 2624, -1278, -646, -2348, -9157, -2336, 1516, 1462, 2307, 7621, 233, 2222, 2144, 4263, 7396, -88, -3036, -5706, -3211, 1123, -2254, -7961, 1161, 10491, 6228, 4182, 3417, 607, 4135, 5691, 6899, 7408, 5371, 3883, 1728, -6029, -7684, -1773, 2903, 484, -2943, -2204, -889, -1065, 6006, 10847, 3988, -4622, -6014]
13659f014m552N47K874K065J509k828n65J972R88j698m204L51K728m21K883J559
13643b806k644L650L595J624j341K603J095Q51k137m236m472l249j496M84j122
13628i601J199J775K239M284L096m768j972J092M194r46l496R5K639M050j235
13613B645K666m392l306j582J245j964O112M802R5j479j044j702j679J61L359
13598C937k634m114R54j519M600M697k232o156k152j435j715k41K060R493N452
13583H995O30o486j753J223L846J028j685K367k154L129L620J35n959p880j176
13568b120n61j297j071M131Q401K666r457l014m665m187m88J1086M883j975l593
13553a261N005l51r426o618j16N72O89K759K519r08J474K506K01l949M44K427
$$ y = [-6014, -10566, -10019, -7145, -5080, -3571, -6399, -6964, -4992, -4004, -5702, -9906, -9555, -6827, -7248, -4365, -2806, -5450, -1800, 1795, 3419, 2078, 4681, 5776, 6627, 4490, 254, -4218, -7467, -8963, -8479, -9601, -8402, -6627, -4388, -104, 2992, -1776, -3748, -2656, 1538, 592, -2904, -2809, -170, 3880, 2645, 5311, 919, -2387, -3969, -2724, -4688, 1424, 6226, 6321, 4842, 3798, 2096, 417, 578, 3937, 1303, -2811, -1857, -3376, 1224, 5921, 3689, -2467, -4619, -6054, -7769, -8010, -5950, 3543, 8995, 9625, 3139, 1386, 2609, 6455, 7483, 5798, 8165, 6011, 9140, 12760, 12895, 6936, -944, -2120, -2681, -3978, -5049, -918, 7483, 10149, 692, -2322, -6987, -11174, -11662, -576, 4307, 2332, -1261, 3744, 3393, -6033, -12651, -12767, -12195, -11506, -8747, -6228, -7136, -5662, -3156, -2955, -6904, -6460, -4033]
13537d033L742l056N389k472J98N1q035j257O18O88o53N070K882j871m206M463
13521b482L198M723l660k524M133O251k806j956J209n183j275J572k124K553J059
13506B688q022k56N037J099l322n784n30j072o940J070J2435M616j43n275p285
13491a1684q8n32O754L794L267m223j0558l991J0235O890n480K795Q952L301k0
13476I412m273K622N895j392k023m648p373m530k007k811K051J1868O728k252
13462G267l160L020K573J527K006j222o976o776l901k946M574N950J82p520q605
13447a4007r40M295K914K359L250J301N493p34k014M243M653n795J167J602N21
13432H308j55l493m844Q10M935m47k715m571J076O13j717N332j179k878n4k674
$$ y = [-4033, -291, -3347, 2042, -430, -232, -181, -8216, -9473, -8855, -8167, -8820, -3750, -868, -2739, -6945, -2482, 716, 5439, 1779, -745, 3388, 9639, 6833, 4877, 6086, 903, -372, 1200, -924, 1629, 2688, -5334, -5590, -553, 546, -2776, -8560, -9090, -10162, -17102, -16032, -3597, 1019, 876, -4399, -11684, -11772, -12304, -5550, -1756, 1511, -2712, -13270, -17261, -7026, -136, -5616, -2821, 6131, 9432, 9412, 5139, 7761, 13656, 12264, 10241, 5593, -1780, -6310, -8317, -11128, -9077, 2791, 9519, 7267, 4107, 7127, 9700, 11227, 13233, 12011, 5035, -1741, -5642, -8588, -4014, 1936, 2118, -5402, -14007, -14947, -10652, -7738, -5379, -2129, -828, 4665, 3931, 1917, 6160, 10813, 5018, 6185, 7787, 8308, 8153, 4660, -184, 626, 5561, 5114, 2399, -2172, -1096, -483, -2200, 3132, 1953, -925, -979, -3653]
13416c653n27N592m852j179M108L954m07L170M211m042k977k154K196R34k111
13401B263j681R79r32j446J858N468l3m886K383L341n007k374J407N258k766J896
13385E728J160l161j029k028k472k784K14K156K790l337K426J1799l9j1794l910
13370d281M219Q36j874J415m125Q212P598r95r364m976J230j421L787K970L235
13355F466m49k388K42L599n714n79J514r45m680k736O91N655j90l505J558r38
13339b399m221Q426p17k549j128Q96L207O78k606q558J186J574J545K820q48m071
13323f765J311Q346n505m897K140M614N305J322L33n836k00j726K084K202n975
13308c247K534P281J956q742k501J695L164M392p114J935J1224M417m002n576
$$ y = [-3653, -4180, 1412, -3440, -4619, -511, 3443, 3036, 6206, 10417, 6375, 3398, 1244, 3440, 4374, 2263, 582, 1561, 629, -817, 1041, 6509, 6476, 1590, 3973, 7314, 2307, -67, 1340, 6598, 3832, 5728, 6888, 3727, 2698, 670, -1802, -4586, -4372, -2216, 574, -2763, -337, 11462, 11423, -371, -4281, -62, 774, -1100, 315, -3810, 4402, 12000, 11005, 1641, -3335, -2105, -3526, 261, 3231, 6466, 6017, 3629, 3871, 7470, 1756, 1177, 2691, 1746, -2934, -5670, -4979, 676, 486, -3019, -1461, -2399, -6620, 1806, 1089, -1460, -2588, -1692, 1515, 2193, -413, -8971, -7785, -6211, -4666, -1846, -2694, -6765, -5454, 2892, -2613, -7510, -5370, -756, 4549, 5871, 6204, 368, 168, -1558, 526, 2728, -3247, -713, 6568, 8524, -218, -2719, -1024, 2140, 6532, -582, 1353, 12577, 16994, 12992, 7416]
13294G416l92L40m334K588j848m10Q456j960o507N50M182K452M05o782l664K052
13278B544n84k322m224n811Q107J690q396L582O403N28j658N213R19j359j459
13263C173J827k709n888K169J667O32L887l267m145q26L889K473j545P14L850
13248E901k80K062m166n80OM41l401J905J488O60L405K089r18M63n233J569l611
13231A800M46K424o404k226j676r1N250j829j924l767j202L11K495N02n506K43
13215a1154M845R514J390r162k43L172J345K960p707m518N575M041l584K917j329
13200a938l958m190J938N181L698L129k687o127J553J271J440O061k222l844l276
13185c971l994L858L910J323k273K979j009J683L640M713K414j854J68n458k748
$$ y = [7416, 7024, 7364, 3030, 5618, 3770, 3360, 11816, 9856, 3349, 3899, 8081, 10533, 10938, 4156, 492, 2544, 1960, -362, -4586, -10397, -2290, -600, -8996, -5414, 989, 1517, -141, 5072, 5991, 4632, 3173, 5000, 2291, -3597, -1428, 239, 871, 4758, 1491, -2654, -3480, 409, 2882, 1337, 2051, 5901, 5621, 7683, 3517, 2937, 2943, 3384, -17, 1888, 3376, 4036, 7441, 9530, 8612, 9075, 3842, 5411, 1800, 2246, 4670, -1734, -3960, -5636, -5727, -477, -2306, -4230, -7997, -9199, -8888, -6393, -5891, -11397, -11154, -6309, 3205, 4595, -4567, -4810, -1638, -293, 2667, -5040, -9558, -3983, 58, -3526, -609, -1938, -5896, -10086, -8148, -2967, 731, 3860, 1173, -4954, -3401, -2130, -690, 5371, 3149, -695, -3971, -7965, -4107, -197, 1126, -1147, 1832, 823, 2506, 6146, 10859, 13273, 11419, 11587, 6129, 3381]
13170C381k85l84l674l640k568l536n48J186N659J036M285P538K649r363k286
13155e50M212J359L856N595k017n326l143m069O80L489N973L037n217n684l207
13140a012K875R95j591j846j867J616M255O014M986R43l116j0438l378n647p376
13125a4587L391M341L140L469N925k971m474P77L941L141l097L76L199k082k732
13110A757j070M816L287n226R2k717m656K422k167L488N190L285M189p913j1400
13095f623l351R0M524M75M917K160l04O434q33m89k199j662J158k050o784q17
13079e354J917M061K095l317m337k33M398M560M341m5k500m904r824j649R472
13064a319O240Q79k399k536M018l891m468K988M12q8m279n31O59K828P716J166
$$ y = [3381, 3096, 2712, -962, -4602, -7170, -10706, -11254, -10068, -4409, -3373, 912, 8450, 11099, 1736, -550, 3662, 5021, 8877, 14472, 12455, 7129, 3986, -83, 597, 4086, 10059, 13096, 7879, 2195, -1012, 1863, 2858, 1267, -579, -2446, -830, 3425, 9439, 14425, 15368, 12252, 1814, -1564, -7211, -14587, -11196, -6855, -3715, -246, 5679, 2708, -1766, -989, 2952, 6093, 2996, 3372, 6571, 4489, 1757, 687, 5503, 8790, 3564, 3656, 939, -3717, -1295, -3462, 26, 5216, 8501, 12690, 4777, -6623, -9974, -9884, -5360, -4885, 32, 2192, 1888, 8322, 7489, 7000, 4801, 3139, 4297, 2247, -4537, -5354, -3437, 624, 2719, -598, -4935, -5168, -770, 3790, 8131, 8086, 5586, 682, -9142, -10791, -1319, 4921, 5800, 3401, 865, 4883, 992, -3476, -488, -76, -164, -4443, -4974, -4315, -1487, 6229, 7395]
13048G395k444l389Q44l288q4P52J449J120q951j985Q960K665r0j399j117o80
13032b42R44k991J796k241L377P414k356l326k271J540N61k572m197l462m983
13017a3009K304k7R49N832L640k156j458j03o93M279q85k189K967K048K82N763
13001G544q28j951M379K633l347l567N51L398K26m249j283l68N151M638J733k720
12985A1940l125r757k109N808J397o697l462L993K911j03J496J649M782l746k64
12970D713J403n530J024O284K701j604k528J129o72j279j697r777o430O28J754
12955i881O635j71O42K570j780k247j373N21P7Q406O447l398l393l071l325K738
12939f03M936L874n190K468o40m88L100q31m232J760k882l546L270L304K303K201
$$ y = [7395, 4951, 1562, 2406, -882, -966, -214, 1235, 2355, -6596, -8581, 379, 3044, 2954, 1555, 438, -242, 702, -2289, -493, -2734, 643, 8057, 5701, 2375, 104, 1644, 2205, -367, -4564, -8026, -13009, -10705, -10732, -9783, -3951, -311, -2467, -3925, -4028, -4721, -442, -1327, -3516, -549, 1499, 1781, 7544, 6716, 4765, 9144, 11777, 8430, 4863, 5414, 8812, 9038, 4789, 3506, 3138, 8289, 12927, 14660, 11940, 8815, -942, -3051, 2757, 4154, -2543, -6005, -2012, 899, 796, 2292, 3941, 8723, 4977, 4713, 6116, 586, 1610, 7894, 10595, 8991, 6463, 7592, 6920, 5641, 3944, -5833, -12263, -11635, -9881, -3246, -3417, -2775, -205, -1985, -4232, -5605, -5084, -5007, 3399, 9846, 6448, 3055, -16, -3341, -603, 4333, 8207, 3017, 5485, 4845, 4357, 7457, 6626, 2394, 4154, 1272, -2274, 996, 4300, 6603, 8804]
12923H804N64N8n851P11l025o502K64q70J357Q078O039p05m02m45k974n524l318
12906c741N850J948o666m531m82J016j305O49L744M428J421P14K689L551K614
12891A1899O7k518K821l348k645k37l778j659j03J212k494j713M400K489M027
12876H420M553r06p340l125O201L485m607n327q276n820L287L350M229K432j927
12861a371J730K696l060n75j916p609k250L524L593L115j450n614K644N858Q853
12846H168k729n435j302J931K786M761l376j0591J776L78K696J209j147l555l168
12831g598O461N710m205n172J614l466j698N307J666n51j704p69M947N150p80
12816D912l07l530Q123L039p201k331M004L931R45p625K64J973p584l946M739
$$ y = [8804, 9368, 9426, 3575, 4286, 1261, -5241, -4977, -5847, -4490, 3588, 9627, 8922, 8520, 8075, 5101, -423, -3741, 2109, 4057, -2609, -7140, -7622, -6606, -7911, -7262, -3518, 910, 2331, 3045, 5734, 9285, 11899, 11966, 9448, 12269, 8921, 6276, 6039, 2261, 602, 499, 1711, -783, -2496, 1904, 4393, 8420, 12973, 12067, 4727, 1602, 7803, 11288, 6681, 1354, -6922, -12742, -9455, -6105, -1876, 556, -1371, 359, 3055, -5, -580, -2496, -10105, -12355, -8831, -5238, -2123, -3573, -9187, -6543, -685, 8168, 5439, 4, -1298, 633, 3419, 8180, 4804, -5787, -4011, -3633, -937, 272, -875, -4430, -7598, -1137, 4573, 368, -4804, -3190, -6656, -8354, -3047, -1381, -1932, -3636, -4405, 542, 5692, 4912, 4605, 1075, 9198, 12237, 5036, 2705, 6709, 10640, 11585, 3960, 4224, 6197, -1387, -5333, -594]
12801e94M174m121j618L036k311k802l59N570j965r000L451M258L425j505K95
12786f6l616j260j58L501N417J774l228k788p469J016Q624N466K089o94Q20j042
12770H386o852l690o520Q03O263M885K613l682J593j390j216j959p22k199j268
12755d955N122j153N972m7o224m185J062J407L706L716n000k942n20N783k644
12740i02j7j194J607L490O827j330Q09l23l548j670l126m493L67K80O76m389k586
12723i522K158L2M698J664M61n184l883M490L929M838k283n038L20k180q36M923
12707a413K353O801L496o130o363O406O163m789o594N32N388j973o399j33j573
12692d228K578M571N110m629p24M491l294o064K361P285N475p14j2768M838l90
$$ y = [-594, 3580, -541, -2159, 877, -1434, -4236, -4595, 975, -990, -9990, -6539, -2281, 1144, -361, -66, -3682, -4942, -5100, -1599, 3818, 5592, 2364, -424, -7893, -6877, 1747, 7213, 9302, 8608, 9428, 8386, 1534, -2156, -8676, -7873, -1610, 3275, 5888, 2206, 3799, 2409, 1193, -766, -1488, -3687, -4955, 167, -986, 4986, 4939, -1285, -5470, -4408, -3001, 705, 4421, -579, -3521, -4041, 1742, -902, -919, -2113, -506, 2984, 9811, 8481, 9290, 8967, 5419, 3749, 623, -3870, -3503, -3223, -2547, -6936, -9522, -7364, -7332, -2634, -970, -509, -5693, -9576, -5086, -1157, 3681, 1398, -3640, -3320, -5500, -6336, -1413, 940, 7741, 11237, 5107, -1256, 5150, 11313, 6524, -70, 462, 5850, 3877, -2522, -2655, -4228, -1650, 2921, 8031, 3402, 2678, 7169, 3875, -2189, 172, 7457, 12932, 12218, -550, 4288, 3898]
12677C898O89O528k330l921J721O556l540o521l746L647l212k053M818J915o815
12662b366m787L3N650l081m99K925J909J002k576j311O591K284J62N82n775o505
12646e762m334M770P519L173M05n378k818l382k54q58Q47P156K901q24n940k102
12630d881K268L318m380j578M018J568K332j70j0992J77M784L373N485L201k19
12615H304R1R006l778m330o763k097r60L465M452M661m582n183j005N886j716
12600E451p228k414Q45L931L269q58j102M45K156n144J121J31K139N968P109K964
12584A8783K7p604k84N3j606M55J456n202p260K529L298J440j31o696l143J849
12568b036n70K955R110k991j209r67m374K015J547O380O363m536o307j995m50
$$ y = [3898, 4587, 11115, 8785, 4864, 6585, 13141, 9601, 3080, -666, 2981, -231, -2284, 2534, 4449, -2366, -7153, -7120, -1470, -4551, -5050, -2125, -216, 786, -1790, -3101, 3490, 5774, 5936, 6518, 743, -5762, -10096, -5326, 2193, 5366, 5771, 393, -2425, -5807, -6061, -6919, -6072, 1084, 3985, 3161, -2779, -4881, -2613, 705, -3675, -5253, -1235, 333, 2665, 2495, -8497, -8320, -3536, -163, 5322, 8523, 8304, 8395, 17401, 13623, 9293, 2530, 433, -527, 2938, 7390, 12051, 7469, 2286, 1281, 7167, 5451, -1777, -4191, -3346, 585, 3854, 2996, 1894, 2339, 4495, -649, 472, 603, 2742, 8710, 15819, 18783, 18810, 11206, 10922, 10975, 9369, 9824, 11280, 6078, -1182, 1347, 4645, 6085, 5954, -742, -3885, -2036, -2606, 349, 9459, 6468, 5259, 4292, -82, 1933, 3480, 9860, 16223, 11687, 5380, 3385, 2935]
12553B935K329k075n663J843P867J019J415l989O95J44p03l713p95K468k197R29
12537B509L815M247k165k166k876P43m467K816l638j862k797n918O211R298L631
12522G381l198n11M951P00m12k823Q68J023l462k995K791K519j866m725k415O195
12506D021M29m820j287r05k899K552m56q74q5L265K61n31l10m94M281R76l542
12489d18M35L205K511R84J748J346o046k892J648J814J013M945l18o074k417Q38
12473B322q140m257J89N054N629k388n84P746L684j126Q2J389o58n226o65R10
12457C961k386l856K75j581j190L365J354J702Jm219M246P345j598l683K017O399
12441A2152K503o485J718l673k951J26k333K948M779j11o191o71n97m00J117M766
$$ y = [2935, 5264, 3189, -2474, -631, 7236, 8255, 9670, 5681, 6376, 6520, 5817, 2104, 1309, 3777, 1580, 2509, 6324, 10571, 8406, 6240, 3364, 4107, -360, 2456, -1182, -3044, -5841, -11759, -5548, 3750, 7381, 4183, 3672, 8623, 9323, 8911, 6088, 6956, 7979, 4517, 1522, 4313, 6832, 4966, 241, -2174, 4021, 4450, -370, -1657, -2562, -5461, -2909, -3365, -4239, -4324, -1059, -798, -1329, -1639, -2133, 2148, 3124, -418, 17, 3222, 5733, 6717, 8465, 9811, 3765, 873, 2521, 4335, 5348, 10293, 9975, 3901, 1484, 2322, -5818, -10075, -9886, -4832, 797, -1591, -2175, 5571, 9255, 8129, 8211, 9600, 8942, 3716, 3051, 3961, 1575, -2281, -2006, -3587, -4777, -1412, -58, 1644, 1645, -2574, 1672, 9017, 7419, 3736, 5753, 12152, 14655, 8170, 9888, 6215, 3264, 3390, 1057, 4005, 8784, 8673, 2482, 1811, 1214, 814, 1931, 6697]
12425F697L056j871m092P24L060j171L692k43m623l905k131k03Q036N843j404
12410A1465M7L358n097m519r12L636j593k819J043M924n848m151k649L878P474
12395H237n235l558l710l86m433J325L413N958L718j2210o554L774O631N090l964
12380a904k312l826K931P661M317M589K424k083k604j526n604N759K376p455l552
12365h09O12K497P18m111K694O948m521k994J531J794O42p293j064N336N140L183
12349A0303p784p060j992L472L722J294L237K44k791R653L88n936o551n587m77
12334e865L028L277m84p91K841K95J627k23K670l268p969N03O149L043n69r09
12318C355n706k453N083K760J404m076l969L291m45J628k236o163M606O670L511
$$ y = [6697, 9753, 7882, 3790, 4514, 7574, 6403, 10095, 9852, 5229, 1324, -807, -1010, 7026, 12869, 11465, 11512, 14870, 9773, 5254, 4342, 7978, 6385, 3566, 4609, 9533, 3685, -466, -3115, 763, 8237, 3002, -556, -4266, -4652, -9085, -7760, -4347, 1611, 5329, -6881, -13435, -9661, -3030, 2060, -1904, -4216, -8042, -5111, 2550, 6867, 11456, 13880, 11797, 9193, 7667, 2063, 7822, 10198, 2743, -809, -197, 2300, 3018, -1093, 1601, 8549, 4028, 1034, 2565, 4359, 5001, -2292, -3356, 1980, 7120, 10303, 2519, -4541, -6533, -3061, 661, 1955, 5192, 5436, 2645, 12298, 12686, 6750, 199, -5388, -5865, -2837, 440, -44, -835, 2006, 2301, 3928, 3705, 6375, 3107, -4862, -4359, 1790, 4833, 4264, 3355, -2351, -4804, 279, 3039, 4443, 367, -3602, -311, -756, 872, -1364, -7527, -2921, 3749, 7260]
12303G260L923k112k807N721N29n020K543N032m94l288m723o223o589K354P886
12288C992m880r58K449j131O13L037N093L507L089l89k290n057j998N380k331
12273H126n839m184M733j950J759l675J082J687j877M57Q1l994M869K543K13k166
12257A865O048L074o530j344J180p29K646p95J626K944o096o366M217O440o941
12242A239q881K841K117M814L164l335P40J520Q68n446R7L224M2K361j639k352
12226A374K568j636J37M576J485q49l33M456K05j835p631j811j330k12O340N836
12210A1340q111j85l713j001k011j823K847P855o867p692J6k98N795L719O939
12195F810k13l376N74l417j129M163L111o60K837l260m931O754Q00l371n843n491
$$ y = [7260, 11183, 9071, 6264, 11985, 12514, 7494, 10037, 15069, 14575, 11287, 6564, 341, -6248, -3894, 3992, -888, -1846, 603, -528, 85, 3122, 8215, 11722, 14811, 14422, 12132, 7075, 5077, 10457, 8126, 2287, -1897, 2836, 886, 2645, -1030, 52, 1739, -138, 319, 400, -3594, 1275, 3818, 4031, 1865, 7913, 10987, 4457, 3113, 4293, 3564, 6210, 5415, 7041, 9985, 3889, -2477, 1740, 8180, 1239, -7642, -4801, -2684, 2130, 5294, 1959, 2699, 4219, 5087, -359, -262, 2962, 3004, 5365, 3726, 1374, 3942, 2306, 2443, 7019, 8504, 7655, 7322, 11778, 11983, 10148, 2517, 706, -624, -836, 5504, 11340, 3229, 3044, -669, -1670, -3681, -5504, -2657, 5198, -1669, -9361, -9345, -9643, -3848, -129, 6810, 6597, 3221, 3795, 378, -751, 3412, 6523, 5863, 8700, 5440, 509, 7263, 8063, 4692, -1151, -6642]
12179f642J639N838M278m652p6J026J743L461J281O434J475j0164n883k56M33
12164f5k0N803K117K262l243o515k208M899L378j807K15l057N821M787J791o920
12148G238m700M867o551p055L794Pl395L601J66J720k994M87L06M161J378L837
12132F867J04n271l136k55L472p15j110N581j080J881j226o387R13O892J890k396
12116F024K678m149n044M38l967N22N448R82n320O57M288K079n302l194K612N525
12100D277K302L179L628K913j824j416O37j056n79l255m484Q60K225L400k625
12085H182j254q59n985m209J101J657r36p66o090J10J988n80L100N395K803J199
12069D856p48l83J080j659K009k532k139k415K926K684O735M281J103m528j0729
$$ y = [-6642, -5003, 835, 5113, 461, 385, 1411, 3154, 6615, 7896, 14330, 15805, 5641, -242, -498, -65, -85, 5718, 7835, 10097, 6854, 339, -1869, 3030, 6408, 4601, 4816, 1759, 7580, 12367, 14158, 7238, 2538, 7405, 854, -6201, -2407, -2400, -5795, -2194, -2028, -308, -3302, -2815, -2509, 1652, 3030, 6867, 6971, 1700, -1436, -1691, 1781, 1066, -44, 5537, 4457, 6338, 5112, -1275, -362, 6530, 8420, 6024, 8702, 4553, -491, -53, -4020, -3498, 1950, 2932, -2388, -1731, 2557, 4636, -666, -3860, -1248, 4277, 6579, 9758, 13386, 16299, 14475, 13059, 13696, 12640, 12061, 8806, 4322, 5182, 7407, 10807, 8182, 6928, 6069, 84, -4125, -3024, -1367, -2303, -3069, -9159, -9049, -7061, -7641, -4541, 854, 3657, 4856, 4108, 3725, 4805, 3146, 5155, 2623, 484, -1931, 995, 3679, 10414, 14695, 15798, 11270, 541]
12054E41j647J0820M227K40k246l450j366M706n625n349l339M391m040K452l838
12039c523l621M500L978O701j598k867K976m52P54K956L551k033J361k180n150
12024E353M248N097J963l800j748n249Q31q078l39M893K268M38l938R23l186l070
12008c394k523M432N497J893M387l918j712N8p592k381m195M18N709J236L560
11993A475Q59k352j536K339J819K544k809l221j986K026k70o46N089L76l807j109
11977a209l678J893j933M708P383J259p882O754J070P15K811p457j461M887J532
11962I392L484j325m041q47o13N980m02L953m300n727L40k092j161m777K263N067
11946E194J807R89M633K516l204K390m829l701k98k608K261N098k005K831l441
$$ y = [541, -1106, 9714, 13941, 14181, 11935, 8485, 7119, 11825, 6200, 851, -2488, 1903, -2137, 315, -3523, -7144, -2644, 1334, 8035, 6437, 3570, 6546, 6094, 6848, 9804, 13355, 11322, 12683, 10503, 5353, 9601, 14698, 16661, 12861, 11113, 5864, 6695, -1383, -1722, 3171, 5439, 5877, 1939, 2862, -324, -3394, -5917, -1485, 4012, 5905, 10292, 6374, 4662, 4720, -2872, -5253, -9448, -9030, -3321, -2085, 1475, 2334, -18, -1554, 785, 2604, 5148, 2339, -882, -2868, -842, -1112, -1758, 3331, 3707, -100, -1209, -4887, -2994, -4927, -219, 7164, 8423, 541, 7295, 8365, 9080, 11891, 4434, 2973, 7860, 9392, 12876, 11551, 7510, 6663, 6050, 12030, 11628, 15581, 11281, 5554, 5894, 3802, 2641, -2136, 127, 5194, 7001, 7990, 12623, 15139, 11935, 14325, 9496, 5795, 5497, 2889, 5150, 10248, 8243, 11074, 7633]
11931G633j368k400n899J787R705q17m524J974O69k395J065n761j403K211L7L703
11915D217J236r46L197J224J750O45Pk833l846N00O548j187k296J327l035Q4J974
11898H566j538m125L907j681J179J101j134l148M092q597j182J299J534J541k543
11883g29K397N757L529j153l529K40K068L791q99q30k391o74n180k703K801L276
11867E771l892j038J641M867J23K67J548k196n248J190J795j991M316M601M786
11852A6540j780n768n430K026L134k616q228J335k439l197j44O118P062K331m224
11837D720K55J921l381K724n520o696j787M517P29L077j565L772M02J952l964
11822A156N410m567m012L829M010M091k965k495k152j396J174l129J211K128J101
$$ y = [7633, 6265, 3865, -2034, -247, 9458, 8641, 4117, 6091, 6760, 4365, 5430, -331, -1734, 477, 514, 4217, 5453, 4507, 7704, 8928, 10678, 11323, 11330, 8497, 4651, 5151, 11699, 10512, 8216, 9543, 6508, 6592, 8566, 7028, 2903, 6810, 5129, 6308, 7409, 6275, 3127, 7219, -1378, -2560, -1261, 273, 1814, -729, 1668, 7425, 10954, 9801, 6272, 6512, 8580, 12371, 11472, 10642, 8251, 7577, 2397, -306, 2495, 5771, 1879, 841, 2482, 7349, 7472, 7739, 9287, 7091, 1843, 3033, 4828, 2837, 7153, 11754, 16540, 14760, 8992, 3562, 5588, 8722, 6106, -2122, -787, -3226, -6423, -6567, -449, 6613, 8944, 4720, 4975, 6896, 3515, 6239, 719, -5977, -7764, -3247, -2518, 559, -1006, 2766, 3168, 5120, 1156, 6566, 1999, -2013, 1816, 5826, 9917, 6952, 4457, 2305, 909, 2083, -1046, 165, 2293, 3394]
11807C394p26J605m511P58L614J1883N241m655j290q72l473K578l042K134N850
11792A8488k78o217o580J89K719n04L312l12K146k048l041M649K815k986j114
11777A1238R75M14k105N626M937o401m78k987k339o465j430O167K745r24j900
11762G073J825N5O600J700m894m896j458k721Q2K610M05J610j3l879O51L336j451
11745F635o01M471n433o748J304M770K756L707L389n73L989j194j701R4m060O65
11729A1470K765k874R02m323Q82J880m818K221O721K472m745OL168N87L06p013
11713I607j218j921l753J107K446l446j865k262j054l413J523N212J358j490L33
11698A164J715M032K417j983N243l514m142k627Q37L914m314m929J856K608P662
$$ y = [3394, 2668, 4273, -238, 520, 4134, 16017, 21258, 16603, 15313, 14441, 10968, 13546, 10504, 12638, 18488, 18210, 11993, 5413, 5602, 8321, 7817, 11129, 10817, 12963, 10915, 7874, 12523, 15338, 12352, 11238, 12213, 12627, 10522, 16148, 21085, 14684, 14206, 11219, 8880, 2415, 985, 7152, 9897, 8973, 7073, 8898, 8953, 15553, 17253, 12359, 7463, 6005, 3284, 3366, 5976, 6381, 7991, 7978, 4099, 4750, 8086, 6635, 6034, 10505, 5072, -1676, -372, 4398, 7154, 10861, 14250, 13677, 17666, 16472, 14771, 14865, 10805, 11470, 14235, 11361, 12263, 7940, 8822, 10702, 5884, 8105, 14826, 17298, 12553, 12559, 15727, 16314, 16620, 9607, 8389, 6468, 2715, 3822, 6268, 2822, 957, -1305, -2359, -5772, -4249, 963, 2321, 831, 1164, 2879, 6911, 9328, 7345, 12588, 9074, 4932, 2305, 3142, 7056, 2742, -2187, -331, 2277, 9939]
11683I939Q364n976j0900N129j129m639j520L164N860P539j601l381l288m490
11669C071J030Q740P974K688o140j0960k099L176M322l025o092L49j52k365m350
11654c833L580N041L715j652o724k109O433M687m29k973j886k518J855K945m953
11639A179l472o25J245l355L568M176k081J63p950M350K28m094M895Q721J125
11624H073l32M015r92k897k337O164m026l240K927o160Q54N436J079J494M377
11609A4435K224k114P10P71q025n619Q22J032K950J262p376K657J536j017K631
11594F879K025l530l35N036m711O07Q614k845J813O341N319n820j0069j217M270
11579A2377J051k440K201j109l631n14L811o71o36Q87j445l243j110O403L862
$$ y = [9939, 18303, 12327, 1427, 6556, 5427, 788, -732, 2432, 8292, 15831, 14230, 10849, 7561, 3071, 4101, 12841, 20815, 23503, 17363, 6403, 4304, 7480, 11802, 8777, 2685, 3034, 2882, 517, -3833, -253, 4788, 8503, 6851, 127, -1982, 4451, 9138, 8709, 5736, 3850, 1332, 3187, 6132, 1179, -2293, -2918, -1673, -5028, -1460, 2716, 635, 798, -7152, -2802, -2574, -6668, -1773, 6948, 8073, 7741, 11756, 10764, 7867, 5530, 11694, 7668, 4428, 7355, 1195, 2049, 7485, 8564, 10058, 14435, 16659, 14545, 15255, 16026, 8001, 2382, 3204, 4236, 7186, 8448, 1072, 3729, 5265, 4248, 6879, 8904, 5374, 5039, 10075, 5364, 5971, 14585, 11740, 13553, 19894, 25213, 19393, 9324, 8107, 12377, 13428, 10988, 13189, 12080, 8449, 7935, 11746, 11075, 10439, 11326, 9881, 6638, 5528, 11931, 15793]
11564A5793L726l934q70l655j655p6l148p86j993L256K921m882k296J439K790
11549F630L355L940K803J515k615k542j202m83K570J24m60R36L089J198k308k447
11533A4103l102M032k293J177L57l33o126n319R298K211m948m608j023M702k451
11518E677o386L931N087k99n57j990J66J160j570n06N424N008k252l890J407J309
11502A1719l221k22N067J370k724P29J68k293L041J0067l055o896J655O131L466
11487B5002o809J643N7k491q256r07N769K025j817l048k372j715J0252J656k138
11472A6851j498o858l298K598O358J280j057k183j689n383N235O419K513M171
11458B3459r2l616J98R81P2j206n735K26J817k033k038J792K650O763l220j097
$$ y = [15793, 19519, 15585, 14715, 11060, 9405, 9329, 6181, 5395, 3402, 6658, 9579, 4697, 2401, 3840, 6630, 9985, 13925, 16728, 18243, 15628, 13086, 11884, 11401, 13971, 14095, 13635, 14571, 17660, 18858, 16550, 14103, 11001, 15033, 12740, 13917, 14274, 13941, 7815, 2496, 11794, 14005, 9057, 4449, 3426, 8128, 5677, -709, 3222, 8309, 8010, 7453, 5463, 5629, 6789, 5219, 4713, 10137, 15145, 12893, 9003, 10410, 11719, 8498, 8276, 13343, 14713, 11989, 12718, 12886, 10593, 13634, 23701, 20646, 13750, 15405, 21536, 25002, 18193, 19836, 19893, 17402, 9146, 8239, 14008, 16033, 14216, 11168, 8796, 7081, 17333, 18989, 16851, 15353, 8495, 5197, 7795, 14153, 15433, 14376, 12193, 10504, 5121, 10356, 16775, 19288, 23459, 23367, 19751, 19949, 20930, 21002, 19796, 14061, 14287, 16104, 14071, 12033, 13825, 16475, 23238, 20018, 18921]
11442A8921j820j252j558l880N546J928j962J413j932R76q08R81L840m492k314
11427A3587K111M358M606K528K107l340p850m138l595K14j653O410M355k305n135
11412A2260m766J436N315o17k513L73J649K456n128k798O12j016K541j323o00
11397G881R89K926p32j956Q47J671l005o87J432L669J674n58L507j617L75j558
11381A4858l485Q88m02J034M009O092J375j581o680k965K746N167M471O352J865
11366C3744J4745J7783j65l926m025j4103j0974o737l649M470o222n236k696N55
11352A3564O98M859L039N49R1L473O46l182j175m712n88J732M90p381l158Q232
11336A7177Q15k093j912n140p81N988M27K709L265Q562k669n583j481n70p86J59
$$ y = [18921, 17101, 15849, 14291, 10411, 15957, 17885, 15923, 17336, 15404, 16380, 15572, 16553, 20393, 15901, 13587, 15698, 20056, 24662, 27190, 29297, 25957, 18107, 13969, 10374, 10588, 8935, 15345, 19700, 17395, 12260, 7494, 8930, 14245, 13628, 11115, 11488, 13137, 15593, 10465, 7667, 8279, 7263, 9804, 8481, 7881, 8870, 11796, 11064, 9108, 9955, 11626, 8621, 7934, 9366, 13035, 14709, 14151, 17658, 16041, 16416, 14858, 11373, 12261, 11859, 12893, 16902, 22994, 24369, 22788, 16108, 13143, 15889, 21056, 25527, 31879, 33744, 48489, 66272, 66107, 62181, 58156, 44053, 33079, 26342, 22693, 27163, 20941, 15705, 13009, 13564, 14262, 19121, 22160, 22709, 22800, 26273, 26919, 23737, 22562, 17850, 17262, 18994, 19484, 12103, 8945, 17177, 17992, 15899, 13987, 8847, 8066, 14054, 14481, 17190, 20455, 29017, 26348, 20765, 19284, 18714, 17928, 18087]
11320A8087M609N117P72l431j716K035J833j693k476J55l993n063k224l261O107
11305A4858L178l569K310J685o01J763J279K769K180l554k242l531l966J058l229
11290A0388J967O014P131p523m301M344J948q4P950J0349R263k904N444J0225
11276F0211P050Q700k282j1270j4872o643o584l408J209J871k820j74l776o679
11262B0533m212j717L428J809M398P491P119m29J150J240J782J288L785J522m39
11247D8748K740m654m97l67l709m184J698m487k508n97p004m751j1502j194l517
11232D215K406M393K620J493N46N592Q39k137K400o81l241m600k292j363q67R79
11216A0302L192J1472J2933Q076P984Q354n22j501n956Q78M25j075J117M581P476
$$ y = [18087, 22696, 27813, 28585, 25154, 23438, 25473, 27306, 25613, 23137, 23292, 19299, 14236, 12012, 8751, 14858, 18036, 14467, 16777, 18462, 17861, 19624, 20903, 23672, 25852, 22298, 20056, 16525, 12559, 13617, 10388, 12355, 18369, 25500, 17977, 13676, 18020, 19968, 19884, 27834, 38183, 47446, 44542, 49986, 60211, 67261, 75961, 73679, 62409, 47537, 40894, 34310, 30902, 32111, 33982, 31162, 30988, 27212, 20533, 16321, 14604, 18032, 19841, 24239, 31730, 38849, 38420, 39570, 40810, 42592, 43880, 47665, 49187, 48748, 51488, 46834, 46337, 45970, 42261, 38077, 39775, 35288, 32780, 32183, 25179, 20428, 8926, 7732, 4215, 6621, 11014, 13634, 15127, 15673, 21265, 22104, 19967, 22367, 21686, 18445, 13845, 11553, 10190, 9323, 10302, 13494, 24966, 37899, 45975, 53959, 62313, 61791, 60290, 54334, 55212, 55637, 54562, 55679, 60260, 67736]
11201F7736J7908J8315K0852L1551N9958J06551K04527L37973L91107K12400o2505
11190A406373k38698l03664k76231j88543j12569o3790m1443k9835j7938j5594
11180A18068o350j0092p863o371l040o524j1524l397j72K908M22j3580r737m810
11166C7938n267k645M570J0537L161N328J1801M658M455L718P884M850o358j5275
11152F9355j3118q668j948l652J375L451N57o657K52J333M828J321M094m431p813
11137D0279Q94n333l902M903Q985l155n079m089k354J938Q101P574L514m923l110
11122D4243J488K952Q01k388p982J509J704K724M463L540m044q058m65o079K846
11107C7254M946M479P83N453k815o179k027j267K84l506K348k306P6R17O1J85
$$ y = [67736, 85644, 103959, 124811, 156362, 216320, 322871, 527398, 865371, 1256478, 1468878, 1406373, 1167675, 864011, 587780, 399237, 286668, 222878, 181435, 151600, 133662, 118068, 111718, 101626, 93763, 87392, 84352, 77828, 66304, 62907, 62735, 65643, 66065, 52485, 42748, 37938, 32671, 30026, 34596, 45133, 48294, 53622, 65423, 70081, 74536, 78254, 86138, 90988, 84630, 69355, 56237, 47569, 45621, 41969, 43344, 46795, 47352, 40695, 40947, 42280, 47108, 48429, 52523, 48092, 40279, 41173, 35840, 31938, 36841, 45826, 42671, 37592, 33503, 31149, 33087, 41188, 48762, 52276, 47353, 44243, 45731, 48683, 49484, 47096, 39114, 40623, 42327, 45051, 49514, 53054, 49010, 40952, 40487, 34408, 37254, 42200, 46679, 47462, 52915, 50100, 43921, 41894, 40627, 40911, 37405, 39753, 37447, 37523, 38440, 38501, 38686]
11091C8686L292K168j177k279q64r77P12J204J622q682M661M335n826n748Q84
11076C2011L452M077O98K328j119Q641L274o519n243N70k183o390p288r947q185
11061H177q163P89P707R436J3800K905k67j468O991M197p41k861r04K494O328
11046D8420J145j435Q438L189j245M94N923O897j51K077o048n909k980j978J995
11031E8832k172L582L032o02L76N117l89J58R925K506R39p91J21n93k068o84Q477
11014H5766m694o566l542p713L536J0141L810L35M472K9915M5952N8389M3879
11001B63680R42l3118l8752m0578l0533j9299j9278p766n884o203o73P69j859
10988F1448L315j706j450j169j580P363n24m503k391k991k30K433m497o136L555
$$ y = [38686, 41978, 44146, 42969, 40690, 39826, 38849, 39561, 40765, 42387, 33705, 38366, 42701, 36875, 31127, 32011, 35463, 39540, 40238, 42566, 41447, 50088, 53362, 46843, 41600, 42170, 39987, 33597, 26309, 16362, 8177, 14, 803, 8510, 17946, 31746, 34651, 34384, 32916, 39907, 44104, 43363, 40502, 39598, 42092, 48420, 49565, 48130, 56568, 59757, 58512, 59006, 64929, 71826, 71675, 73752, 67704, 61795, 58815, 56837, 58832, 56660, 60242, 63274, 62672, 63048, 68165, 67776, 67934, 77859, 80365, 81304, 80513, 80634, 80041, 77973, 77289, 85766, 81072, 74506, 70964, 63251, 66787, 76928, 80738, 81073, 85545, 115460, 161412, 219801, 263680, 264622, 231504, 192752, 152174, 121641, 102342, 83064, 75298, 69414, 63211, 62538, 63307, 61448, 64763, 63057, 61607, 60438, 58858, 66221, 65697, 61194, 58803, 55812, 55582, 58015, 53518, 47382, 50937]
10973E0937O395P735l408o846l895o08Q27J288P275L884j87r84P136L738P93K406
10957G6486K590O89M474j75Q093K858p854l461K127n212j2758r496j3290m47P487
10942E2111J5744R978O252Q558q060o624P389J5944O139k210J235J1181Q025K471
10928A28133J375N929L655M316R732K434K857J3878Q042N74J370j025M387J1816
10914A97473J0705J6888J6967K2908K4088L5042M8489P3251P9512L8272p0085
10903D93510j57739j55041j15301o4978k0231N99P136j272j0146p663j4994j668
10891d7788O756J0753J2841J5330J3052J2053J6406J6373Q149J0404Q678R610
10879I2617J9231L1013M4998J7793m2715m8276k0288j5609j8098j2621k794J158
$$ y = [50937, 57332, 65067, 61659, 54813, 50918, 50310, 51137, 52425, 59700, 63584, 63397, 62413, 69549, 73287, 74080, 76486, 79076, 79765, 84239, 84064, 92157, 95015, 87161, 83700, 85827, 80615, 67857, 58361, 45071, 44624, 52111, 67855, 77833, 84085, 92643, 84583, 77959, 85348, 101292, 107431, 105221, 106456, 117637, 125662, 128133, 129508, 135437, 139092, 143408, 153140, 155574, 158431, 172309, 180351, 180925, 182295, 181270, 185657, 197473, 208178, 225066, 242033, 264941, 289029, 324071, 372560, 445811, 525323, 563595, 493510, 335771, 180730, 65429, 451, -19780, -19181, -12045, -13317, -23463, -31126, -46120, -47788, -41032, -30279, -17438, -2108, 10944, 22997, 39403, 55776, 63925, 74329, 83007, 92617, 111848, 142861, 187859, 205652, 162937, 114661, 94373, 78764, 60666, 48045, 45251, 46409]
10867D6409O12n850J852J2391J1519J3922J733j494k579l484m03l048J088J0959
10853H3627L425J1153J6124P109Q276N39m411L895J6518Q571M759K375k501J147
10839A60606n113M127J0275J0415L305J2633L237p372M275L90N768n079N77M403
10825B02447L906P193Q380R370P721J1560P408L228M29k721n919o912K12P312
10811B53614K4979L7886K6893K4327J2777J0826J7813J7326P257J938N590J1833
10799D53059O431j292J824J4261J3844O437l766p959R770L3391N7060P6488O9975
10786G29523M3372K9535L3574M3774O0374P1128Q0455P5381P2178O9674Q8330
10775A397298J26023J50596J60376J68264J76945J88770K17608L07481M68432
$$ y = [46409, 47021, 41171, 43023, 55414, 66933, 80855, 82588, 81094, 78515, 75031, 74628, 71580, 72668, 83627, 87052, 98205, 114329, 121438, 129714, 130253, 125842, 129737, 146255, 154826, 159585, 161960, 159459, 160606, 155493, 159620, 169895, 180310, 183615, 196248, 199485, 192113, 196388, 196778, 202546, 197467, 198044, 202447, 206353, 213546, 221926, 231296, 239017, 250577, 257985, 261213, 261642, 258921, 253002, 246090, 246302, 253614, 278593, 316479, 343372, 367699, 380476, 391302, 409115, 426441, 433698, 435636, 441226, 453059, 459490, 458198, 460022, 474283, 488127, 494564, 490798, 482839, 492609, 526000, 583060, 659548, 729523, 772895, 802430, 836004, 879778, 940152, 1011280, 1091735, 1167116, 1239294, 1308968, 1397298, 1523321, 1673917, 1834293, 2002557, 2179502, 2368272, 2585880, 2893361, 3361793]
10766C361793O76229P93921O66383M25299L54899M78439P81360J219047J759860
10757A0517230K431852L358794M729749O999669J1210506J9752268L6695298O2669373
10749A58364739P4101677M2033015r654988m3791249n7066852n3655199l7909282
10742G2421861k2543477j3031137q101956n531667m028141l007814k255602j713687
10734A2208380j265045q87707p07159p89577r07186r12710q57201p38918n94043
10725D548834m83338l94416l19311k66816k27810j82063j61479j57955j47084
10716B208562j29721j02558r2666j03353j05203j03205j02294q9528p5182n5094
10706A249758n0476n3025p2280r0638q8906p3845o4933o9819o6085n5693n0105
$$ y = [3361793, 4038022, 4831943, 5498326, 5923625, 6278524, 6756963, 7538323, 8757370, 10517230, 12949082, 16307876, 21037625, 28037294, 39247800, 59000068, 95695366, 158364739, 232466416, 274499431, 264844443, 221053194, 163986342, 110331143, 72421861, 49878384, 36847247, 28745291, 23213624, 19185483, 16177669, 13922067, 12208380, 10943335, 10055628, 9348469, 8558892, 7651706, 6738996, 5881795, 5142877, 4548834, 4065496, 3671080, 3351769, 3084953, 2857143, 2675080, 2513601, 2355646, 2208562, 2078841, 1976283, 1883617, 1780264, 1675061, 1571856, 1469562, 1380034, 1304852, 1249758, 1199282, 1146257, 1073977, 983339, 894433, 820588, 755655, 685836, 619751, 564058, 513953]
10695E13953l8922l5337l3799k3398j6767j8517j6985j9001k1737j0254Q148J1789
10683B99173P737m223q987j3566k3398k6135j9605r393L265q86k120K190n275
10670A98777o195o105n138q95j0364q997o388j0090m984M094N657J525Q7j381
10656A49603j656q213p169r357r925N504K832m37P17p693l252O267K964P598P240
10641A35023L094k233r24l42p700o224n389Q87O579J4785J3361L670J444m0K143
10626A58134N324n613r516j3880o788O204L33n926p776p505n210n991J899O873
10612A10562P820R385M495n13Q807P445J6379J3945P165j561r144j1276j2258
10599A51251n01P369J2906J5036j1057p7510j55117j80986j23531m5849K5847
$$ y = [513953, 475031, 439694, 405895, 382497, 365730, 347213, 330228, 311227, 289490, 279236, 287384, 299173, 306910, 302687, 293700, 280134, 256736, 230601, 210996, 201603, 204868, 203982, 201862, 204052, 198777, 192582, 186477, 181339, 180444, 170080, 161083, 154695, 144605, 139621, 143715, 149372, 150897, 150984, 149603, 147947, 139734, 132565, 123208, 113283, 118787, 121619, 121182, 121899, 114206, 110954, 117221, 120185, 127783, 135023, 138117, 135884, 134960, 134618, 126918, 120694, 115305, 116192, 122771, 137556, 150917, 154587, 156031, 155991, 158134, 163458, 157845, 148329, 134449, 127661, 133865, 134198, 128272, 120496, 112991, 107781, 101790, 103689, 110562, 118382, 127767, 132262, 131749, 140556, 148001, 164380, 178325, 185490, 183929, 174785, 163509, 151251, 150750, 158119, 171025, 186061, 175004, 97494, -57623, -238609, -362140, -407989, -382142]
10588c82142O4624N8451M6702L3650J8171J8406J7522J6107J5376N799J0245M875
10576g2214o522o065K558M287P009l722l583Q500N468J4647J1147N582O856O424
10562a9628l117m038N038J7277P521q547p798o63P983J2800J0533R025M26p770
10548A9042j845p065q579r904l666L647N188K931l711R785K376O68J480K183r60
10533A1570n491j903L247N416Q388K830p14k938l220m539k172j438K133J06J633
10518A2908J216Q56p91M624k17l625q749J232J734m149k484N32J279m151R15L15
10502A445Q30n252p715l550J181O295j756n549k001K729J3515O864l305m287l177
10487c733j820J00l374n302J470l126m691n259R94K955J831R86K188k589j785
$$ y = [-382142, -317518, -259067, -212365, -178715, -160544, -142138, -124616, -108509, -93133, -87334, -77089, -72214, -78736, -84801, -82243, -77956, -70947, -74669, -78252, -69752, -64284, -49637, -38490, -32908, -26052, -19628, -22745, -26783, -21745, -4468, 3053, -5494, -13292, -13955, -5972, 6828, 17361, 26386, 26812, 19042, 17197, 10132, 1553, -8351, -12017, -8370, -3182, -251, -3962, 5823, 8199, 8867, 10347, 12530, 11570, 6079, 4176, 7423, 12839, 21227, 24057, 23343, 20405, 17185, 12646, 10474, 9036, 11169, 11275, 12908, 14124, 14980, 14189, 18813, 18596, 14971, 6222, 7454, 9188, 5039, 2555, 3087, 4366, 215, 1130, 1445, 2275, -2977, -10692, -14242, -13061, -6766, -8522, -14071, -16072, -13343, 172, 7036, 3731, -556, -3733, -5553, -5453, -8827, -14129, -12659, -15785, -20476, -25735, -24741, -21786, -19955, -18969, -16781, -19370, -21155]
10472b1155n897K758N681k551q54L055N618j511j718o261l871o111Q9L822J569
10457b7337O207O44q96L751K326N675m57K666J227J978K647l865Q25l790m116
10442a2515j429j857Q92M857J9270J8038J1971N603o121o291n316k008p468j2300
10428E326r518m951j368K261M122M36j336K156K964K563k205j466J240L355M675
10413H254m761K180L171k184o727j021m289q273r21J501J223J903J691M371M761
10398H79k727K301L244o469o308L709o552r29J857n807j402L850o03k898j008
10383a8863N820l30R971m03n162J77J559O47O672l808j772k547L39j3320r37N773
10367a6184p84m525n2l116p05O143Q126n35N11K232J772o57N78J16j139Q410J215
$$ y = [-21155, -27052, -24294, -18613, -21164, -22018, -18963, -13345, -14856, -16574, -22835, -26706, -32817, -32728, -28906, -27337, -21130, -20486, -21382, -17631, -15305, -9630, -10087, -7421, -6194, -4216, -1569, -5434, -4609, -8399, -12515, -13944, -15801, -14909, -10052, 9218, 27256, 39227, 44830, 38709, 32418, 27102, 25094, 17626, 5326, -4192, -9143, -10511, -8250, -4128, -3692, -5028, -2872, 92, 2655, 450, -1016, 224, 3579, 8254, 3493, 5673, 8844, 6660, -67, -1088, -5377, -13650, -14571, -13070, -11847, -9944, -8253, -3882, 879, -1848, 453, 3697, -2772, -9080, -5371, -11923, -12852, -10995, -16802, -18204, -14354, -14957, -17855, -18863, -13043, -13373, -3402, -3805, -8967, -8790, -7231, -6584, 88, -3720, -5492, -8039, -7700, -21020, -21957, -16184, -16968, -21493, -21545, -24661, -25366, -19223, -11097, -11632, -11121, -8889, -7117, -7774, -7196, -7080, -8219, 191, 1406]
10350A406K175J328p547j074O316k200l58k09n890K08L292l561l447R09J822J311
10334e519J858Q88M97l077J057O156K770k128k01J856j495l443m001N88M88K351
10318a355N783K034J533K676N24o3K24L660L121Q166N885P201J8185K2558L1215
10303A11347M4301P1005J32337K44880L81863L53421J10889j53644k86723l06982
10293G02694k43618j55184r5450n2883l2892k5015j8874k1009j5341j0195n512
10282B6721K21O091K921j731m251m968q30q409j871j750q47L52m996l258L111
10267F506M32m619o81L178M708j017M42M109M515p89J036k288j667k88l46n419
10251G812l955j508N81M204r41j0140l199K943J3l76j991k629O469L971m729o982
$$ y = [1406, 3581, 4909, -2638, -3712, 2604, 404, 46, -163, -6053, -5845, -2553, -6114, -9561, -8652, -6830, -5519, -3661, -2773, -2276, -5353, -4296, 1860, 4630, 2502, 2301, 4157, 2662, -781, -4782, -4194, -3706, -1355, 4428, 6462, 7995, 10671, 11195, 11132, 11356, 15016, 18137, 26303, 32188, 39389, 57574, 80132, 111347, 155648, 226653, 358990, 603870, 985733, 1339154, 1450043, 1296399, 1009676, 702694, 459076, 303892, 208442, 155559, 122667, 97652, 78778, 57769, 42428, 32233, 26721, 26942, 33033, 35954, 34223, 29972, 25004, 24174, 15765, 13894, 12144, 11297, 11649, 6653, 3395, 6506, 6938, 2319, 1638, 4816, 9524, 8507, 8949, 13058, 17573, 16784, 17820, 15532, 13865, 13577, 13231, 7812, 3857, 2349, 2930, 7134, 6193, -3947, -7146, -4203, -4190, -4566, -6557, -9186, -2717, 1254, -3475, -10457]
10235a0457K597j158J973k137J622K545j871r98N038O877j065m680o782k813J615
10220i694N925K2n49L231m905M0j999l663J466N646k476L838j398o051j621M602
10204g586K655n605M582O707R45n226q513M47N902M09k373k201o268m884P567
10189a3442K606M55J0257n991j703P017P34p018M755K460k394l274k736l673l051
10174a4998J87Q78O647O348M857q445n994k066L042K155K972L706K765p78p278
10159f002o004J412K893J514P896j373k922k474J67K581l633q933N508J0336p83
10144A83j509k431l903n767k639q04j047P958K333j549J785m078k355L450M089
10129f284J406j59m914q651p177J0355O852n006n052K597M255N231j695q73J039
$$ y = [-10457, -7860, -9018, -7045, -9182, -7560, -5015, -6886, -7884, -2846, 4031, 2966, -1714, -8496, -11309, -9694, -3769, -3747, -4296, -1065, -5970, -5930, -7929, -11592, -10126, -4480, -6956, -3118, -4516, -10567, -12188, -7586, -4931, -10536, -5954, 753, 1698, -3528, -12041, -11594, -5692, -5283, -7656, -9857, -16125, -21009, -13442, -10836, -10381, -124, -6115, -7818, -801, -67, -7085, -2330, 130, -2264, -5538, -8274, -11947, -14998, -14811, -13933, -7286, -938, 3919, -4526, -10520, -12586, -9544, -7389, -4417, -711, 2054, 1276, -6002, -12006, -10594, -7701, -6187, 1709, 336, -2586, -5060, -4893, -2312, -5945, -14878, -9370, 966, 183, -1326, -3757, -7660, -13427, -16066, -16870, -17917, -9959, -7626, -9175, -7390, -11468, -13823, -10373, -6284, -4878, -5037, -9951, -18602, -25779, -15424, -8572, -13578, -18630, -16033, -11778, -6547, -8242, -9115, -8076]
10114h076K24m94J156k92r037m58K669j970J70K536K957M527j459o717J327j62
10098a3099p56k860Q3O34L237M963J98l522J302O446J538m24p71J999J256m955
10082d731O82j089M32p01j636j658k193N56J75K01k78J600k678J933L930K53k314
10065g516pK037m969k691R14k523J454K473K481Q39k338j163K203j287N86J05
10049i402J851N219Q75p32o808j670M708k145L711q18j947j893K781j280j777
10034i327J478N11l387J180J28L373K086p939K838N32L181j188K539j151L220
10019a926J440j008m169L404m020K098N503j649p809J303k989k66P271L642L407
10004D232q385l438M03L567K108j859o916j559k693M474N389M39q055m815R530
$$ y = [-8076, -7852, -8346, -7190, -7482, -16519, -16977, -14308, -16278, -16108, -13572, -10615, -6088, -7547, -14264, -12937, -13099, -13855, -16715, -16632, -15998, -12761, -7798, -7600, -11122, -9820, -3374, -1836, -2260, -3031, -1032, 224, -4731, -4049, -5138, -4706, -5407, -7043, -8701, -10894, -10338, -10163, -9962, -10240, -8640, -11318, -9385, -5455, -5202, -7516, -7523, -5486, -10455, -13146, -12232, -14755, -13301, -10828, -8347, -7508, -9846, -11009, -8806, -10093, -9507, -9402, -7551, -2332, -1457, -2189, -8997, -10667, -5959, -8104, -4393, -5211, -7158, -9051, -6270, -7550, -9327, -7849, -7338, -10725, -9545, -9417, -6044, -3958, -11897, -9059, -8527, -5346, -6534, -3995, -5146, -1926, -486, -1494, -5663, -2259, -6279, -4181, 1322, -327, -8136, -6833, -9822, -10088, -2817, 825, 4232, -4153, -7591, -7188, -3621, -1513, -3372, -10288, -11847, -14540, -10066, -4677, -4238, -12293, -17108, -7578]
9989g578N483J509j111n59M864k195k918K293M886n576M218J47k978m053q386
9974a1954m451K59M657N771M919k007J370L110j839K181R636n66j331L923L22
9959A4000k271j0992m463N257q33r554q37M206K114M71j477l40K034L405k353
9944a633o104K357j14N106J729l935m943l986l615J353N662r60k538L619K980
9929e022J61J241j180N703o39m351m413M753J499N910J0147L242K962q24J197
9914B0386n481j2467k695k557k802Q6j068K240k993j518M528j209j383R059M882
9899G008j221J708L079L090Q263L573N436K981k086R18j349n320j491k196q886
9884A3507n935m037n404J279r89q73P208M081l115j848j203K4l548n823Q28P683
$$ y = [-7578, -2095, -586, -1697, -2256, 2608, 413, -2505, -212, 4674, -902, 3316, 3463, 485, -3568, -11954, -16405, -16146, -11489, -5718, -799, -2806, -1436, 1674, -165, 2016, 11652, 11086, 9755, 13678, 14000, 11729, 737, -3726, 1531, 698, -8856, -9693, -5487, -3373, -2902, -4379, -4719, -2685, 720, -1633, -7737, -5380, -5494, -388, 1341, -2594, -7537, -11523, -15138, -13785, -8123, -9083, -11621, -8002, -5022, -4861, -3620, -4800, 903, 264, -4087, -8500, -3747, -2248, 3662, 13809, 17051, 20013, 19189, 20386, 14905, 2438, -257, -2814, -5616, -5530, -6598, -4358, -7351, -8869, -4341, -5550, -6933, 2126, 7008, 5787, 7495, 10574, 13664, 21927, 25500, 30936, 33917, 31831, 32749, 31400, 26080, 24589, 22393, 13507, 7572, 3535, -1869, -590, -1579, -2452, 4756, 8837, 5722, 3874, 2671, 2695, -853, -6676, -5848, 1835]
9868A835J443j044K56k759r849k140R66L638L60K320M975k470k007N470K243r92
9852B245J609L391m936k743m818l88J479m472l609J0719J273p825K505P635K54
9837B319n675n187j132J642R79L970K254n384m773P53k571P318M635N71l148k192
9821e621L755j243k601L966R4l036m23L757n011n778J620k210K649M425K336l787
9805g108J56j430L054M826P28N99l79J582r78l883Q88M298m330p448J729K743
9789d953m862o904J38M609M03L106K159l788J473M064O133k318n431K67K268O88
9773b948K680j011n733K064Q54o895m708J855L051M789M894L156N388M609j976
9758A0069n987K899M803r31k867n064K530l48n502o595M291K760Q31j341O558
$$ y = [1835, 3278, 2234, 2490, -269, -10118, -12258, -11292, -7654, -7294, -4974, 1, -2469, -4476, 994, 3237, 2245, 3854, 7245, 2309, -434, -5252, -5640, -4161, -8633, -12242, -1523, -250, -8075, -5570, 2065, 2319, -3356, -8543, -9675, -8033, -7054, -3084, -830, -6214, -10987, -10234, -12805, -5487, -852, -281, -3429, -5621, -1866, -3109, -5710, -1744, -1650, -4686, -5109, -1352, -6363, -12141, -10521, -12731, -10082, -5657, -3321, -7108, -6952, -8382, -5328, -502, 226, 825, 446, 2028, 1050, -2833, -1945, 2353, -1977, -9425, -7696, -4953, -9815, -16719, -16581, -11972, -11569, -8463, -6304, -10092, -8619, -4555, 1578, -740, -6171, -5904, -3636, -2948, -268, -1279, -7012, -4948, -4094, -10989, -15697, -13842, -10791, -6002, -1108, 2048, 7436, 12045, 10069, 4082, 6981, 11784, 10853, 7986, 2922, 5452, 5104, -398, -6993, -2702, 58, 889, -452, 6106]
9743F106L865l270m850j978j800p437M347J868n07k143L660M878j854k291J754
9728C48j339n590o847L700k881j11j321m53M054L443k100p875N036L609q13j284
9712a0424n543l78N585R144K15j565k073q64K245j759m543l547P218L908M049
9697A668K343k655M512K291r036n207j699M072O067J676n565n267k850p49K308
9682h091K414j676n91N415J552q061n672K366N407L411O10k851j921R039M530
9667E881l885k619n253J302J884j96M01o70L258n422n913K630k495M009J2310
9652E222j44m199k580J321l752l662L924K844l985l479J139K98J325N533n013
9637e208o166j522L734r79M372k01q951K517N66K548O438M643Q4q90l16l263P29
$$ y = [6106, 9971, 6701, 1851, -127, -1927, -9364, -5017, -3149, -3656, -5799, -2139, 2739, 885, -1406, 348, -991, -6581, -13428, -9728, -12609, -12720, -14041, -14494, -10440, -6997, -9097, -16972, -11936, -8327, -9140, -10424, -15967, -16345, -10760, -1616, -1401, -2966, -5039, -5903, -3658, -5417, -9960, -13507, -6289, -2381, 1668, 4011, 1356, 5868, 8159, -877, -6084, -7783, -3711, 2356, 4032, -1533, -6800, -9650, -10399, -8091, -5677, -7353, -7944, -2529, -977, -9038, -14710, -12344, -6937, -3526, -2916, -5767, -7688, 1351, 5881, 1996, -623, -5876, -4574, -2690, -2886, -2485, -3155, 103, -5319, -11232, -8602, -11097, -7088, 5222, 5078, 879, -1701, -380, -4132, -7794, -3870, -1026, -5011, -8490, -7351, -7053, -5728, -195, -5208, -11374, -12896, -9162, -10141, -5769, -5970, -14921, -12404, -11838, -9290, -2852, 1791, 1875, 985, 669, -2594, -1865]
9620a865N356q39l935l918k259n583J124L382N168J335k374N648J334Q75M109
9605G558m010j0706k08O7J951P68K078K162l934J32O179j6l556L874k983n299
9589e943n59M867N040m024l011m734L142L757K60K78j752K018o10k173j609N450
9573C97O930N84j383j896j275L35J614o043m590p76p66l9q55N423P406n913o098
9556f945J74N158O74J942L457m24j974l350k401J657N57J094O81p244l771k175
9540a2890K479N829R689J111p249o934J7L533J518J021j430J403L596k323J395
9525G65k336p32K583l220n603r62K130N59o889l653K314K736K278Q95R39M871
9509c325J751l057m230M625Q419O579O57m113m520j528o337P21k647N572K741
$$ y = [-1865, 3491, 2652, -1283, -5201, -7460, -13043, -11919, -8537, -3369, -2034, -4408, 1240, 2574, 3449, 7558, 3548, -7158, -7366, -7299, -5348, -4580, -2502, -340, -4274, -4142, 2037, 2021, -1535, 2339, -644, -5943, -6502, -1635, 3405, -619, -3630, -8364, -5222, -1465, -1205, -927, -2679, -661, -1271, -3444, -5053, 397, 7327, 7911, 6528, 4632, 3357, 3692, 5306, -737, -5327, -6103, -6869, -6908, -7763, -2340, 5066, -847, -6945, -6771, -1613, -939, 1003, 4460, 4036, 2062, -1288, -3689, -2032, -1475, -381, 300, -6944, -10715, -12890, -10411, -4582, 5107, 6218, -1031, -7965, -7948, -4415, -2897, -1876, -3306, -1903, 1693, -630, 765, -1571, -2303, 280, -2940, -8543, -9505, -7375, -6816, -13705, -17358, -15044, -12308, -10030, -9135, -8196, -3325, -1574, -4631, -8861, -4236, 4183, 10762, 11419, 7306, 2786, 1258, -5079, -4358, -7005, -1433, 1308]
9494A308q09L265J332l131n666k164P55P188O398J318o468m839n420l917K176
9479h674M231N993m592k510L525K08J609N100p938o015N1M717M393M04J277j178
9463F01j566m881O87P459j297n827l73N880k260l937k427k524j191k927N599P007
9447a977p7J969P696k454l834k929J63J979J951j336m978k368K360N900J539p253
9431c649k379M875K170k917l404k325K356M196m131K651K759o56O72K35K898P52
9415D103J687m742n704L346L037j358M506N2p84m377j516J017k842M86O901L386
9399G198p814p867K583L081J355l841K03L67M362l83k159L616J941K309k935J134
9383C150q18M276J267N538k388m008L203k749j185l184l692k981L837n108K458
$$ y = [1308, 499, 3764, 5096, 1965, -3701, -5865, -5110, 2078, 8476, 9794, 3326, -1513, -6933, -10850, -8674, -4443, 1550, -3042, -5552, -2027, -1819, -210, 4890, -3048, -9063, -9012, -4295, 98, 502, 1779, 601, -965, -5846, -5159, 2300, 1003, -4824, -5197, 683, -1577, -5514, -7941, -10465, -11656, -14583, -8984, -1977, -2054, -85, 7611, 5157, 1323, -1606, -1443, 536, 2487, 1151, -3827, -6195, -3835, 2065, 3604, -3649, -6028, -1153, 1017, -1900, -5304, -7629, -5273, -1077, -5208, -2557, 202, -454, 218, 453, 3351, 4103, 5790, 1048, -4656, -1310, 1727, 369, 4875, 4927, 4143, -234, -1750, -733, -3575, -3089, 3812, 7198, -616, -8483, -5900, -2819, -1464, -5305, -5102, -4735, -373, -756, -2915, 701, 2642, 4951, 2016, 3150, 2332, 6608, 7875, 13413, 11025, 7017, 10220, 7471, 6286, 3102, -590, -3571, 266, -4842, -2384]
9368b384L832k901L783N900K960n120p837k186P95O733r85M88k471o17l701n306
9352i017j915J872K564m711Q345Q096M29p1n588M16L968L33l699m59M94M406j989
9335C474p279m352N429k95P73L53L068K002j63l015K228K524L373K016l946q73
9319E317n080N209M226K737l527m159K56k981K288J239K417J688p729m387L950
9304A464J1764j517N70M698o02m689j817P795J0545K519k227m399R62M516Q80
9289C0462M35J824K243m934k183M292P248O03p037n04J1055P479Q0M637K685j302
9273E7083M950R227M691L150M398L306P18L940K047Q504J1140J4901J3645Q926
9259A50626J4565J3074K0737K5371L0741L8774M3491M8208O2158O7990Q0832R9437
$$ y = [-2384, 1448, -1453, 2330, 8230, 11190, 6070, -1767, -3953, -3158, 3575, 2590, 3078, 607, -10, -3711, -9017, -10932, -9060, -6496, -11207, -2862, 5234, 5663, 5592, 4, 420, 4388, 4721, 1022, 563, 1057, 5463, 3474, -3805, -8157, -2728, -3023, -2250, -1897, 1171, 3173, 3010, -5, 2223, 4747, 8120, 10136, 6190, 5317, 237, 5446, 9672, 12409, 8882, 4723, 4979, 1998, 4286, 5525, 7942, 9630, 1901, -2486, 1464, 13228, 11711, 12281, 16979, 16377, 11688, 9871, 17666, 28211, 30730, 28503, 24104, 25066, 29582, 30462, 30897, 32721, 34964, 30030, 27847, 32139, 39387, 39990, 32953, 32449, 43504, 50983, 51063, 55700, 58385, 57083, 62033, 71260, 75951, 79101, 83499, 86805, 87523, 91463, 93510, 102014, 113154, 128055, 141700, 150626, 165191, 178265, 199002, 224373, 255114, 293888, 337379, 385587, 447745, 515735, 596567, 696004]
9247F96004J26010J55679J71347J86699J76138J40646Q2103J1436p2812j35243
9237A538007j64855j69545j62746j52427j26341j03004q8184p1890o5882n0118
9227C83015m5367m0068l2239j8504k3029k2736j6424j6890r715j0677j4629q870
9215A23867m280p180k464m394m79o989j5777r963n100p432n165k755R18j382p95
9200E0630J773k066q789l440j13L115n034q822M57O49o564n941J710L801K997
9185B4363K790J748p66j319k041k242k571k767m45k687j858K1J529m058L182q59
9169A2020o29J764l69J639o85m544m755L995m3k39K270J075q26K431J55k149M466
9152A5576O351P85j0080o056j877k155m6M335p34k059k282R640L607r1n939l179
$$ y = [696004, 822014, 977693, 1149040, 1335739, 1511877, 1652523, 1734626, 1746062, 1673250, 1538007, 1373152, 1203607, 1040861, 888434, 762093, 659089, 570905, 499015, 433133, 383015, 337648, 297580, 265341, 246837, 223808, 201072, 184648, 167758, 158043, 147366, 132737, 123867, 119587, 112407, 109943, 105549, 105070, 98081, 82304, 72341, 67241, 59809, 54644, 51889, 52807, 51425, 50630, 52403, 50337, 41548, 38108, 37995, 41110, 36076, 27254, 27711, 28360, 21796, 15855, 17565, 21366, 24363, 27153, 28901, 28135, 26816, 24775, 22533, 19962, 17195, 16750, 14063, 12205, 12226, 13755, 9697, 12879, 12020, 11391, 13155, 12786, 14425, 13740, 9196, 4441, 8436, 8393, 8154, 10424, 11499, 10673, 13104, 13259, 11110, 15576, 21927, 22712, 12632, 6576, 4699, 2544, 2498, 6833, 6099, 4040, 1758, 11398, 15005, 14914, 8975, 5796]
9136E796n27O5l192J4j587j317L355k916L000J902k59M08k504l030j325K095l996
9119d018k833J996L394M427J718m079q99M23r892l043n2K464O248N680N00L22
9103B356p61j45M147p61k162J035k866p969r446j038O111N110j014K597M171j4
9087f49M858L244k526o956L254M197m924k601j589R01M209M206l388J783J179
9072E198n377M89P536P78l338m451q7N239p20j424l199Q6J247L12j860q69Q32
9055C92j499K404j125k492N402j936m13l006k96J620j919j624j508J833P505k105
9039A233j33K215rk712l949J586N365N105j362j1080l509j40Q76Q675J507M15
9023D083L827q171n170j184N752P459l295k764L12q36N161O944M0l764n075J489
$$ y = [5796, 5269, 5334, 2142, 2156, 569, -748, 2607, -309, 2691, 4593, 4334, 4742, 2238, -792, -2117, -22, -4018, -6851, -4855, -1461, 2966, 4684, 605, -294, 129, -9763, -12806, -12858, -10394, -4146, 1534, 2034, 2356, 1595, 1450, 5597, 4836, 2674, 3709, 843, -7126, -16572, -17610, -11499, -6389, -7403, -4806, -635, -649, 4209, 7453, 4927, -2029, 1225, 5422, 498, -2103, -3692, -2791, 1418, 5624, 2236, 4019, 5198, -179, 310, 7846, 8624, 5286, 835, 748, 5987, 5267, 3843, 644, 730, 1977, 2289, 429, -440, 392, -1107, 1297, 172, -2320, 3082, 1146, 733, -2273, -2569, -949, -2868, -4492, -6000, -4167, 3338, 1233, 1100, 3315, 3306, 594, -3355, -1769, 3596, 8701, 7339, -3741, -7250, -7390, -6514, 2161, 3668, 4083, 7910, -261, -5431, -6615, -863, 6596, 3301, 537, 849, 13, 5174, 12118, 12158, 8394, 3319, 4808]
9007D808K649o90J789p97o135l593K329N00O81p702j889N271L6m98j802N443J613
8990B013j901K925M007k000l917j35O702K216j706l380m933K186j861k119N901
8975C998L589k912M29m274K974O533j473p389m247l022m803J645K874n61J085
8960e554L421N189q43O738K65Q5k907o881o709J993M745j623l576J509K551K373
8944G76Q96j0M549M203k055m513n076j340k664r77l519r13L803L951K829J865
8928A805r99J2m96m746L097j988k589k050j513j683N846J136M941J797n122N23
8912b029O47K171n02k19J960K359r653n159L222O332K157K63N485L421M94o289
8896D660n003K119p44k2n22l017k470m2L091L882o98j024k075J347j698j426j757
$$ y = [4808, 7457, 6767, 8556, 7759, 1624, -1969, 360, 860, 1541, -6161, -8050, -2779, -2743, -3241, -5043, 400, 2013, 112, 3037, 7044, 5044, 1127, 992, 7694, 9910, 8204, 4824, -109, 2077, 216, -1903, 3998, 7587, 4675, 5104, 830, 3804, 10337, 8864, 1475, -2772, -5794, -10597, -8952, -6078, -6639, -5554, -2133, 3056, 2213, 8951, 9216, 9301, 6394, -487, -7196, -5203, -458, -2081, -5657, -4148, -1597, 776, 1672, 1662, 6211, 10414, 8359, 3846, -1230, -2570, -5234, -6211, -9730, -10643, -6840, -2889, -60, 1805, 806, 818, 322, -4424, -1327, -3315, -5904, -7954, -9467, -11150, -5304, -4168, 773, 2570, -2552, -2029, -1382, 789, 287, 68, 2028, 4387, -5266, -10425, -7203, -871, 1286, 1549, 7034, 10455, 10949, 4660, -343, 1776, 1032, 1010, 488, -2529, -4999, -5041, -1950, 1932, 1234, 210, -1865, -518, -2216, -3642, -5399]
8879e399L264P375j692l365j406M096M25K738J769Q35N46l312Q78J849Q21m716
8863D706k741l224O624O399M825k268J059m175m612l874J070Q24l460k941m03
8848b191L2p832n521n70L634Q858L922L441K510m354l963o345K975L381j047N492
8832B422O542L904L28L462n639q508o915L868M796J592j287n247o60k544r75m248
8816i109m314j179N980P575J700M177l074l431L649j303M46N485N244M936o035
8801A0747n123L150K026l61j764k227j694L142K08n651Q16J923j677k906m957
8786d348j335N980K750O4k978J3M545j821o90N37k996q124q25L110N793R52M34
8769A061J936K937m39m871o019K63M921L68l497J729M488J454j862J82L857r90
$$ y = [-5399, -2135, 5240, 3548, 183, -1223, 2873, 3298, 6036, 7805, 8640, 9186, 5874, 6752, 8601, 9422, 4706, 1965, -1259, 5365, 11764, 16589, 14321, 15380, 11205, 6593, 2719, 3789, 4613, 1153, -1788, -2191, -2159, -9991, -15512, -16082, -12448, -3590, 332, 3773, 6283, 1929, -2034, -8379, -5404, -2023, -3070, 2422, 8964, 12868, 13196, 16658, 11019, 2511, -4404, -536, 4260, 5852, 4565, -682, -1342, -3886, -4861, -9109, -13423, -14602, -8622, -1047, 653, 4830, 1756, -1675, 1974, 671, 1117, 6602, 11846, 16782, 10747, 5624, 8774, 10800, 10439, 8675, 6448, 4754, 7896, 8104, 2453, 3269, 5192, 3515, 609, -4348, -5683, 297, 3047, 3111, 133, 146, 4691, 2870, 2180, 2717, -279, -8403, -9228, -6118, -325, 627, 1061, 2997, 5934, 5495, 624, -5395, -5132, -211, 157, -3340, -1611, 2877, 4331, 2469, 2651, 6508, 5518]
8753E518k204l915k174j082L991P86j741j095J287J193K978O13n467r09O198J090
8737E067J86o05M136Q19K431j078j867K06k045q591o68N96M112J440m255l363
8721c479j18L230j174m75L345m91l82n409P06K020L037M015J592M994l306q333
8705b28r82P973N50K651J158l280o782j231M826J884J872K252n503J242k129J409
8689E682N94l654j36J102O436N670k782q051j287l13j581M185K066j449k804L803
8673G481J557m390M178J484N975l310o61P95j580M735J510n30j960L436n527o848
8657F345j835l780k765J549K972L421K921J071J512K311J466j173o201k409M54
8642E859M95j550M111N495l790O48l948L95L063K971N370k543l118n259p5K635
$$ y = [5518, 3314, -601, -2775, -3857, 134, 920, -821, -1916, -629, 564, 3542, 4155, -1312, -2221, 3977, 5067, 5253, 4648, 8784, 9603, 12034, 10956, 9089, 9295, 7250, -1341, -2009, -1413, 2699, 4139, -116, -3479, -3597, -367, -1541, -2016, 1329, 838, 456, -4953, -4247, -2227, 810, 4825, 6417, 11411, 8105, -228, -1210, 6763, 7313, 9964, 11122, 7842, 1060, -171, 4655, 6539, 8411, 10663, 5160, 6402, 4273, 5682, 6276, 2622, 2486, 3588, 10024, 15694, 12912, 4861, 3574, 3261, 1680, 5865, 7931, 6482, 3678, 7481, 9038, 4648, 8826, 10310, 16285, 12975, 12314, 13109, 11529, 16264, 17774, 17244, 15284, 18720, 13193, 6345, 4510, 730, -2035, -486, 2486, 5907, 8828, 9899, 11411, 13722, 15188, 14015, 7814, 5405, 5859, 6354, 4804, 8915, 14410, 10620, 11268, 7320, 7715, 10778, 13749, 19119, 16576, 13458, 8199, 8124, 10759]
8626A0759o100N10N283M170L819l770j718O372j607o035m541n358j938k500k94
8611b948N878M793L481P187M38p610p279O638O093j82l772l279L611J027m253
8596I823K536P917n936k181l076M319Q296J1038L335n422m75N497L012m62L968
8581D2189P400J0110J983J136N379R840L851L714K97j059j1341j1754n000l558
8567E3187q195m278R61k379m964j830R42N40j854k986j712k062j031l583O14L68
8551B1738m91L024n10m80m241j4212m072M768M587m30n670m93L713O794m30p880
8535E715l133J727N655O702j876k287j556K895K127o449m708l886J356l08M31
8520B405K092j822k250l586Q50K765M659P01m781k466k844l267n31L168M103j177
$$ y = [10759, 4659, 5169, 10452, 14622, 18441, 14671, 12953, 19325, 17718, 11683, 7142, 1784, -154, -2654, -2948, 2930, 7723, 11204, 18391, 18829, 11219, 3940, 10578, 16671, 16489, 12717, 9438, 13049, 14076, 9823, 12359, 20276, 14340, 12159, 9083, 13402, 21698, 32736, 36071, 30649, 30174, 35671, 38683, 38221, 42189, 49589, 59699, 61682, 62818, 68197, 78037, 81888, 85602, 85899, 84840, 73499, 61745, 56745, 53187, 44992, 40714, 41675, 39296, 34332, 32502, 33444, 33984, 32130, 29144, 27432, 25370, 24339, 20756, 21370, 21738, 21247, 24271, 23761, 23281, 19040, 4828, 756, 5524, 10111, 9681, 4011, 3518, 7231, 14025, 13595, 5715, 2582, 4309, 9964, 16666, 14790, 12503, 10947, 13842, 15969, 9520, 4812, 926, 2282, 1974, 2405, 4497, 2675, 425, -3161, -2311, 454, 5113, 5814, 1033, -1433, -4277, -7544, -8075, -4907, -804, -1981]
8504a981J711K437K986k826k473M248O59l939L866J169m003k822j758j342j948
8489f016J99K501k68J705q52j407L082k260K44L096m50J419L08m319M578j789
8473b29m72m34R6M212L49K916r54n039k38M620l298K446O727j636m076p358M471
8456B103K967O38j257L431J235j1115m563P137p55m718K268K594%j451p93k272
8440d551Q11L503L103k657o3j951K987N396l684L991J894m339o18L896j53l554
8424D011l94O93l4j062Q24m329L174j043k607N236j930m652J347O226m579J600
8408B481L903m888m278o492R05K438O117J222L466M189k18M027N7N85N05k744
8392A1275l033k442k48k615j421M550J915m543J535N621n09q648N66K659o750
$$ y = [-1981, -270, 2167, 5153, 2327, -146, 4102, 4761, 822, 4688, 5857, 1854, -968, -2726, -4068, -6016, -5817, -3316, -3584, -1879, -2731, -4138, -1056, -3316, -3072, 24, -426, 993, 1301, -3018, 1560, -229, -701, -1135, -1039, 3173, 3522, 6438, 5484, 445, 207, 4827, 1529, 3975, 10702, 9066, 4990, -2368, 2103, 5070, 5708, 4451, 7882, 9117, -1998, -6561, 576, -179, -4897, -2629, -35, -35, -1486, -2279, -4551, -3740, -237, 2866, 209, 146, -1805, 1182, 6578, 2894, 6885, 8779, 4440, 3822, 7718, 7565, 4011, 3617, 4310, 4276, 3214, 4038, -291, 2883, 1840, -767, 4469, 2539, -2113, -766, 5460, 881, 2481, 6384, 1496, -2782, -9274, -8369, -5931, 186, 1408, 4874, 9063, 8845, 12872, 12929, 13514, 14019, 11275, 8242, 5800, 5552, 2937, 1516, 6066, 7981, 3438, 4973, 10594, 10085, 1437, 2003, 4662, -2088]
8377b088N38K460J657Q512M391p78n400n326k547J327M748n8j236j514L973l53
8361H306l788K642J059j638L585K077o203J815K555o019n432K839J699K751O731
8346A2979k916n129o39l508J359K063N51J984K780M431k667l021l809L625M432
8331A2515o038P46k832r962n885M087M652M052K361k333j657j42Q55K282O329
8316I030N188K02p127p04j738m268j159k85n256J085L28j147n507L018L895j770
8300f215r59L75K129L999N46m89J182N666K78o585l399l742K000L643K452j740
8284h59k567j693l785M267O624l697Q33K662L939j657J036N654k547l384l9k276
8268B511n111k141j192Q637j223r653l206Q134L213j783k202K203O397K609l4
$$ y = [-2088, -1550, 910, 2567, 11079, 15470, 14692, 9292, 3966, 1419, 2746, 7494, 7436, 6200, 4686, 8659, 8306, 4518, 7160, 8219, 6581, 10166, 12243, 6040, 7855, 10410, 4391, -1041, 1798, 3497, 6248, 12979, 10063, 4934, 4295, 787, 2146, 4209, 4760, 6744, 9524, 13955, 11288, 8267, 4458, 8083, 12515, 6477, 7223, 4391, -5571, -11456, -7369, -2717, 1335, 3696, 1363, -294, -436, 419, 2701, 9030, 14218, 14420, 7293, 6589, 4851, 583, -576, -861, -6117, -5032, -4704, -5851, -11358, -8340, -4445, -6215, -7174, -6799, -4670, -671, -125, -614, 568, 6234, 6512, -73, -3472, -7214, -5214, -1571, 881, -859, -3426, -5119, -8904, -4637, 1987, -1710, -877, 1785, 5724, 4067, 5103, 10757, 8210, 4826, 4787, 2511, -2600, -4741, -5933, 2704, 1481, -8172, -11378, -3244, -31, -1814, -4016, -1813, 4584, 7193, 7159]
8253G159m308n425k730J836N386K527J171l68j997m928m018N774N553L111n95
8238H148k954l560r94k891l28k389K874J641n428m838n496Q646Q436K603L448
8223F918q61m78m063o084K273n347o26L282L592J6L971K607l61k272J175J768
8207E510n204o08m829k368p01m520k203K333J1352J1399n741j434J737p570K310
8192e37o18m840K616O296K13p412j64K052Q202K849j066n547L588o393J434M179
8176D852M979N7L240o68l675k499j980K247N45j623k945p938J664K339j259M700
8160B036j59j061J762k90J501n816j452O37l536K004M565J545l694J525K399j719
8144B47J340K701j64j536K09k70L587L943k053q29J661J495J357J128l657K046
$$ y = [7159, 2851, -2574, -5304, -3468, 1918, 4445, 5616, 5248, 3251, -1677, -5695, 79, 5632, 8743, 8148, 5194, 1634, 640, -2251, -2579, -4968, -2094, -453, -5881, -10719, -16215, -7569, 867, 3470, 6918, 6057, 5579, 1516, -4568, -2295, -7642, -8268, -4986, -1394, -1378, 2593, 5200, 4839, 2567, 3742, 5510, 306, -302, -5131, -7499, -8200, -12720, -14923, -12590, -1238, 10161, 4420, 2986, 4723, -2847, -537, -1155, -5995, -3379, 2917, 3130, -4282, -4446, -2394, 5808, 8657, 7591, 2044, 5632, -761, 673, 4852, 9831, 9888, 13128, 12460, 8785, 6286, 4306, 6553, 7098, 5475, 2530, -5408, -3744, -1405, -2664, 2036, 1877, 816, 2578, 2288, 3789, -2027, -3479, -2842, -6378, -4374, 191, 1736, -1958, -433, 1966, 247, 1587, 4288, 4124, 2588, 2797, 2527, 6114, 10057, 8004, 7175, 8836, 10331, 11688, 12816, 9159, 11205]
8128A1205O53k848k247m786m812p7L459j918j766L332P345M579m567o083j351
8113A18j578K543J0380M703l379k432m269n346n36N824N627k882n872j442k579
8098a120Q601O378p275l963j670Q99J43O05N317J746k274l845o482L042j442J439
8082I9K465m234K897N374o175o163n646p81N821J240n23N357O459q91l059j949
8066B91J204M60p284m51j16k008R74M383L395J277K557M019J271m599j600N68
8050D341j757R33l802L109K009j779l462r09J432L754o334p045R88P261K698O449
8034G886J643M613k187l45j137l268K165m21J271L297o030j355Q83k955j577L267
8018E750K69n435J836o20J940L526J315K643j166o586j906L483N309n57j498m33
$$ y = [11205, 11858, 9010, 6763, 1977, -2835, -2912, 547, -1371, -3137, 195, 7540, 12119, 7552, 1469, 118, -1460, 1083, 11463, 16166, 12787, 10355, 6086, 740, 204, 6028, 11655, 8773, 2901, 1459, -1120, 7481, 13859, 6584, 2621, 951, 1850, 1993, 2598, 7915, 9661, 7387, 3542, -2940, 102, -1340, 99, 2564, -1670, 1227, 6601, 426, -5737, -11383, -12164, -6343, -5103, -5626, -269, 6190, 5299, 2240, 291, 1495, 1955, -5329, -5780, -5896, -7904, -6930, -2547, 848, 2125, 4682, 8701, 9972, 5373, 3773, 4341, 2584, 3517, -285, 2824, 4833, 3054, -408, -1317, 115, 3869, -2465, -9510, -8522, -1261, 1437, 7886, 9529, 14142, 11955, 11610, 10473, 7205, 9370, 8949, 10220, 13517, 7487, 6132, 7015, 4060, 2483, 5750, 6019, 584, 2420, 1800, 3740, 7266, 8581, 11224, 10058, 3472, 1566, 5049, 10358, 9801, 8303, 7870]
8002G870P28p071r656L400Q107L833M11J871L676j862P031o09j007r07J962k497
7986A5280r73K995k74n805P579L939n627j882l88m911M648M265J233o353m369
7971I357J962q60j52j407n02m120m110K816r53J64o05j466K213l53k021K416N74
7954B953M078L818P70k556j288N628K646k873K040J150o83O23J051o67k386M225
7938A8529N508j017j267j867O11O48O305p11p001l876R04n284p440o281K679J0678
7922A1118J490q89k629j718n359M278J677n118M485M366l594o666L234L07L948
7907H930L730j77M709M46o223l747J284M70J334l688L875M84m076K539p86M567
7891A3671k649j650l833M355J437L271J086j150n641n346O07K535J980P90n766
$$ y = [7870, 8598, 1527, -8129, -4729, 3378, 7211, 7622, 9493, 13169, 11307, 18338, 17729, 16722, 15815, 17777, 15280, 14307, 17302, 17028, 11223, 18802, 22741, 17114, 15232, 14844, 9933, 14581, 18846, 20079, 13726, 9357, 11319, 10459, 10307, 8900, 8398, 4278, 168, 2984, 2031, 2195, 1590, 124, 2337, 1984, -37, 2379, 2953, 7031, 10849, 11619, 9063, 7775, 13403, 16049, 13176, 15216, 16366, 15683, 16306, 17357, 16690, 14304, 18529, 24037, 23020, 21753, 19886, 20497, 21145, 27450, 26739, 19738, 15862, 16766, 11482, 4042, -2239, 440, 11118, 12608, 11719, 9090, 7372, 2013, 6291, 7968, 2850, 7335, 11701, 8107, 1441, 4675, 4982, 8930, 12660, 12483, 17192, 17638, 11415, 7668, 8952, 9422, 10756, 7068, 10943, 11427, 7351, 9890, 9104, 13671, 11022, 9372, 5539, 9894, 11331, 14602, 15688, 14538, 8897, 3551, 4158, 6693, 8673, 9463, 3697]
7876C697p756l875p36K367O829K038N439l390n877l217L087l61M649j735L007
7861D166N660O01j745n182k260p66P68l718m276J873O091J969L349K151m110l215
7845A356k125l378O364R514K903l059j0804o753O462O004L095k62n086l373l173
7830b315J108j304M340L522j864j020k890j288j415J73j835r80L449N428N823
7815H932N884m127o170m97J069l077K315K202n507j65m29k094m966k705j842M333
7799f844L353j77j674N760r74K184M953l939n899L903M504L880j576j18M861K769
7783A4966o309r629k749k857n325n51R185K278p08J150n644j709J684jl670J344
7767h545K890P55N756m738k665K313L550M496l779k266j813J190K270P965m705
$$ y = [3697, -4059, -7934, -8670, -6303, 526, 2564, 8003, 4613, -1264, -4481, -1394, -1755, 2894, 1159, 4166, 9826, 10427, 8682, 3500, 1240, 474, 1242, -2476, -6752, -4879, 1212, 3181, 6530, 8681, 4571, 1356, -769, -4147, 2217, 11731, 14634, 11575, 771, -5982, 480, 6484, 9579, 9317, 4231, 858, -2315, -1207, -2511, 1829, 5351, 3487, 2467, -423, -1711, -3126, -2953, -4788, -5768, -2319, 3109, 8932, 14816, 10689, 4519, 4022, 5091, 2014, 4329, 6531, 1024, 859, 430, -1664, -6630, -9335, -11177, -6844, -3491, -3668, -5342, 418, -556, 1628, 6581, 2642, -3257, 646, 5150, 9030, 7454, 7336, 12197, 14966, 8657, -972, -3721, -6578, -11903, -12454, -3269, -991, -1699, -549, -6193, -7902, -6218, -6219, -9889, -8545, -5655, -4900, 856, -3882, -6547, -4234, -684, 3812, 33, -2233, -4046, -2856, -586, 7379, 2674]
7752B674j449k78o817K62j431k727l390K821M003p55P085R823J932o228p909l294
7736e678L6J918M499N779L496m286n907k746l67k595l806l481L034K878j614O15
7720h225J161J481k909j397n209L970j388J650K0M23q81Q814K51k748j102N22
7704e567L030J631O14m725J015K9k41o038k69M392l698L403O363J556K917J412
7688E824l313k452K23N35j893j1695j270P092L970M305J369q79M946q65k970m433
7672a506J740L891n098k429Q781m371j1647J524N80L521L662Q034j169n068j396
7657i51O30J172J199Q24M498n235r132j044P1n96M743j165q47O276R325M869n298
7640I339j4045r687o11N035O251M340J00m553J280J445N741N42k527n6j617L550
$$ y = [2674, 1225, 947, -5870, -5608, -7039, -9766, -13156, -10335, -6332, -7087, -2, 9821, 11753, 5525, -2384, -5678, -5642, -3724, 775, 6554, 10050, 5764, -143, -2889, -3256, -5851, -9657, -13138, -10104, -7226, -8840, -8225, -7064, -5583, -8492, -9889, -15098, -11128, -12516, -10866, -10846, -10423, -11304, -2490, -2239, -4987, -6089, -5567, -2537, -906, -292, -5017, -4002, -3973, -4214, -10252, -10521, -6129, -9827, -6424, -61, 1495, 4412, 5824, 2511, 59, 282, 817, -1076, -12771, -14041, -6949, -2979, 1326, 2695, 1816, 6762, 5897, 2927, -1506, 234, 4125, -973, -3402, 5379, 1008, -10639, -9115, -8535, -5014, -1352, 6682, 5513, 445, -951, -321, 851, 2050, 2874, 7372, 2137, -6995, -8039, -7968, -8564, -3821, -4986, -5833, 443, 9768, 14637, 9339, -4706, -14393, -15004, -9969, -3718, 622, 722, -3831, -2551, -1106, 4635, 5177, 2650, 2594, 977, 4527]
7624D527m169m017J503M651n468o745l304M816N596M43K373P38j256m008K029
7609b291P73m041m315l003N233N197M520J31n567o261k938M027K189m466k965
7594a3777O470N003l232k324l303O422N887o882k362J816J460l192M057k09l242
7579g408k840K32l52L013L219L916n359p564l948O055mJ013M428m474N69L770
7563e734L778L445K7N071j723L486k331J793L986k314m359m526k408K226J278
7548A695l330o242n211L837O755O076m200J403l025m143M189J715n586j782j88
7533h037O533O643K484j710L612L388k054k687Q96o770m784J334N046q89j705
7518A300o60l621l164K407m418p104M318P208K32j481N342J523J257j1263J080
$$ y = [4527, 358, -3659, -2156, 2495, -2973, -9718, -13022, -8206, -2610, -2167, 206, 944, -312, -4320, -2291, -1518, -5559, -9874, -12877, -7644, -2447, 2073, 2204, -3363, -9624, -12562, -8535, -6346, -10812, -13777, -7307, -2304, -5536, -7860, -11163, -4741, 1146, -5736, -8098, -6282, -4822, -8014, -3957, -4166, -7408, -10248, -10016, -10368, -7355, -4136, -220, -5579, -13143, -17091, -11036, -11040, -10027, -5599, -10073, -9504, -5734, -1956, 1489, 1516, 6587, 4864, 8350, 6019, 7812, 11798, 9484, 5125, 599, -1809, 417, 1695, -1635, -7877, -13088, -9251, -2496, 3580, -620, 783, -2242, -6385, -2196, -481, -6067, -7849, -8037, -1504, 5139, 7623, 5913, 9525, 12913, 10859, 8172, 9068, 2298, -2486, -1152, 3894, 3005, 1300, 640, -2981, -6145, -3738, -8156, -15260, -10942, -3734, -3502, -4983, 359, 1882, 3139, -8124, -7044]
7503g044O434k846J123N411l326n506L540j288j399O196K040M291j002l353J676
7488D947j308q55j808j191n17R25K555J221L70n074q869j319J452O852K747l311
7472c183m903j877M810J377R31K604j640k095l407K034M251n02J849L552K132
7457E933j960l05o281j994j999k746L035O117K133n056k647M295J688K131j484
7442H60o351l302k078j044j72J36k637L221M815K404m54Q899J782o623l626k826
7426f996j24J591N916K300n862J9k353P404m330p688M087K987L410J753M85l775
7410a176j891Q655R32r920m523p88K674J475L736P390K054K250Q59p186l727n97
7394B17l817k656j5P75k591M166R4j03N917R88R41o629k108l8j818l581n599L499
$$ y = [-7044, -610, -3456, -2333, 3078, -248, -5754, -2214, -3502, -4901, 1295, 3335, 7626, 6624, 3271, 4947, 3639, 2784, 976, -215, -732, 193, 2748, 3969, 4339, -735, -9604, -10923, -9471, -2619, 128, -3183, -8086, -9963, -5153, -3776, -2845, -241, -1881, -3976, -7383, -5349, -1098, -1600, 249, 3801, 5933, 3973, 3668, -2613, -4607, -6606, -9352, -6317, -200, 1933, -3123, -5770, -1475, 213, 2344, 860, -5491, -8793, -10871, -11915, -12087, -11951, -14588, -11367, -6552, -4148, -4602, 4297, 6079, -544, -4170, -6996, -7120, -5529, 387, 2687, -3175, -3156, -5509, 1895, -2435, -10123, -6036, -3049, 361, 2114, 2599, -1176, -3067, 5588, 6520, -3400, -7923, -8711, -6037, -4562, -826, 6564, 8618, 10868, 11727, 4541, 814, 217, -3600, -6256, -6271, -5496, -8087, -3921, -3827, -3930, 1987, 2975, 3916, -2713, -4821, -4859, -6677, -10258, -15857, -12358]
7376a2358n2j89J923P589J59l39L297m07n299k079j84l416L388J488K721J635
7360b123L252K210k976m824j326P148O88n608j581n187L435M411O128J299l135
7345A811K48L875L230o359n691k557K307R70j266r09k269j941P03J515k048k292
7329a0673O971L667J700m126n706N855K980k643J459K2k279K604o650m062M360
7314f521j512j709j186J198q17L834J247M907o03l63n23l109m740M895Q644K132
7298E774m13k589n424L356j255n141K841M254k083k385n782l111K803L684O69
7283d802j0104M734Q813J675k693K628l899j584o70M738P736k471k273j762L932
7268C998j210L81K158J848k556n92l721o820l285j037J126N146L530j12O063K128
$$ y = [-12358, -12410, -12599, -10676, -3087, -2928, -3267, 30, -377, -5676, -7755, -7939, -11355, -7967, -6479, -3758, -2123, 1129, 3339, 363, -4461, -5787, 1361, 2049, -3559, -5140, -10327, -6892, -2481, 3647, 4946, 1811, 2059, 5934, 9164, 2805, -2886, -5443, -3136, -2166, -3432, -4341, -6610, -8551, -7848, -6333, -8381, -10673, -3702, -35, 1665, -2461, -8167, -2312, 668, -1975, -516, -494, -2773, -169, -6819, -10881, -6521, -8033, -9742, -10928, -9730, -10547, -6713, -5466, -559, -1162, -1525, -2048, -5157, -9897, -5002, 3642, 5774, 5361, 2772, -2652, 704, -551, -5692, -2851, 1403, -680, -3065, -8847, -11958, -9155, -5471, -4802, -14906, -10172, -1359, 316, -2377, 251, -3648, -5232, -5902, -1164, 6572, 4101, 1828, 66, 3998, 2788, 3169, 5327, 7175, 4619, 4027, 306, -6514, -9799, -10836, -9710, -4564, -1034, -1146, 4917, 7045]
7252G045o969m015o71o367K176J157L17m54N216K434l595P29J94l24k248M540
7236h35l810J287K029k57p095l352N487K459J155R16N151m326m85j346K240L704
7220B922l100l491K636j446n015p647L588M900L45o4p065K22k63k55O595L303
7204c835J561K125k799j044K871j471p46k490N94k504k501q36k1o44M691J773
7188e276R032J749n23K703P43k202r99m70j607M47K333J00l284o972K565K330
7172F69r418j895p20M762P148o88L907k082j482k835l951J263J1023M252p283
7157B670m162O00J512M421n071k87L755K932m134j549R00k511K285N605q56n274
7141H36n089k382n345j260Q412N470l665p278j67M500j604K010N914J78j308m107
$$ y = [7045, 76, -3939, -4610, -10977, -8801, -7644, -7327, -7781, -2565, -131, -3726, -2997, -2803, -3127, -5375, -835, -4645, -3358, -1329, -1586, -8681, -12033, -6546, -4087, -2932, -2016, 3135, -1191, -1676, -3022, -782, 2922, -178, -3669, -1033, -2479, -7494, -15141, -11553, -6653, -6308, -6372, -13437, -13215, -13478, -13733, -7138, -3835, -2274, -149, -2948, -3992, -1121, -2592, -3338, -5828, -5234, -7738, -10239, -11075, -11096, -11740, -7049, -5276, 3756, 5505, 4982, 7685, 8428, 6226, 5227, 4757, 3150, 3597, 5930, 6030, 2746, -4226, -1661, 669, -8749, -10644, -11364, -6602, 546, -142, 3765, 1683, 201, -2634, -6585, -5322, 5701, 9953, 2670, -1492, -892, 620, 5041, -30, -317, 3438, 6370, 2236, 687, 1587, -924, 1361, 6966, 6110, 836, -4253, -6635, -11980, -13240, -4828, 642, -3023, -10301, -10468, -5968, -7572, -5562, 352, 530, -778, -4885]
7125d885n340N475L780m530N31k332o010j966p88M341L939L436L877r00j570K700
7109b42L238o529j382k714N053L899O437K202m070j323r25k341k902K261L722
7094D384O5p861J254j176k255l13K834J41K450k251k582K200j431l060L030j239
7078e810k479q99N439L723p053k154l415j168M915J682N023J952k940k81O71K300
7062d94j27J243J791l880o467n868M337K147l021j976N543L027k873l826N245
7047e199j647L142N209O660n742o96n481k38k56L187J0942q08k766m419j862k458
7031b432J296KK059K191J307k527o468k141L035J395L531K180j286o270m18m113
7015h659m117M35M393K267l372K989R546K419p04j544p808p060K974J821J830
$$ y = [-4885, -10225, -4750, -970, -5500, -4969, -7301, -13311, -15277, -16065, -11724, -7785, -4349, -472, -1372, -2942, -242, 2996, -3533, -4915, -7629, -2576, 1323, 7760, 9962, 5892, 4569, 3644, 1303, -1599, 662, 4384, 4449, -3412, -2158, -3334, -5589, -5902, -3068, -2927, -477, -2728, -5310, -3110, -4541, -7601, -4571, -5810, -8289, -9188, -3749, -26, -7079, -9233, -12648, -13816, -8901, -7219, -2196, -244, -3184, -3465, -2794, -494, -621, 622, 2413, -1467, -7934, -13802, -9465, -7318, -10339, -12315, -6772, -3745, -6618, -10444, -5199, -6846, -3704, 1505, 8165, 2423, 1727, -3754, -3992, -4248, -1061, 9881, 9073, 6307, 1888, 26, -2432, -1136, -1134, 925, 3116, 4423, 1896, -4572, -6713, -3678, -2283, 1248, 3428, 2142, -4128, -4546, -8659, -12776, -12341, -7948, -5681, -9053, -6064, 3482, 5901, 5197, 3653, -4155, -11215, -8241, -6420, -4590]
7000d590j852J185J337M258l451q33m31J779J462M841K477k562n76n432n89N532
6984B555k27j335K168M780M978m537q722j0910o14Q135Q119M08k142L88j853M656
6968E847r95m054K298J476n878j801m565L57J532J230K40j68M98j563o549j427
6952a3522O453j373P902P693n005m395K276M01M058L457o733n828r41n303J959
6937h901L745m878K918J160L651M878K365J701j659j781m153n04J022O8J435n565
6921d498j074j148j109O386K080k799o25K721K0L154L25J635N062r608l577N838
6905B783N921K603p391m066J647M886j627m619j711J626o050l127j487K193M879
6890c540o12L169k948O450L079m305J00m503J505L896M558r73p55m806n219O72
$$ y = [-4590, -6442, -5257, -3920, 338, -3113, -3946, -4377, -2598, -1136, 3705, 6182, 3620, 3044, -2388, -2977, 2555, 2328, 993, 3161, 7941, 12919, 8382, -340, -11250, -11864, -3729, 4390, 4798, 2656, 3044, 1191, 5847, 4852, 798, 3096, 4572, -1306, -3107, -7672, -7315, -5783, -4553, -4313, -4481, -3983, -5546, -12095, -13522, -7069, -8442, -540, 7153, 2148, -2247, 29, 430, 4488, 7945, 1212, -4616, -5557, -10860, -8901, -5156, -10034, -7116, -5956, -2305, 2573, 4938, 6639, 4980, 3199, -954, -1458, -436, -368, 1067, -4498, -5572, -6720, -7829, -1443, 637, -2162, -2787, -66, -46, 3108, 3433, 5068, 10130, 522, -3055, 2783, 8704, 11307, 3916, -150, 1497, 6383, 4756, 137, -1574, 52, -5998, -9125, -10612, -8419, -3540, -4152, -983, -3931, 2519, 5598, 1293, 1393, -3110, -1605, 2291, 6849, 5876, 5121, 315, -4904, -4232]
6874d232L233R765m410q174P76K680K484O836J063n327k108o760o903L436M394
6859c247m332O619Q173L26m279m056M286L66J011K159j292l002q952n308K429
6844i099N196J1867L025m868R32o57j636l078N051J86j955l126k792k447n16l751
6828g668l226L685L023J848P578L81p62L178M13m168o442M813K62j699M772q95
6812E093m500o597K151J332L345J29l187M07N849J044J469l028n819k862L887
6797a287n387q71K304O106j634m366K831N052K712n695l989L845m357J652Q45
6782b239j152K125l338K6r45J292J595l594L948n618m47J551L409K678M852K953
6766G096J945l9m613J446M532l115m000m441o629M291K233j695j735M258j510
$$ y = [-4232, -999, 8766, 4356, -3818, -3042, -362, 2122, 8958, 10021, 4694, 2586, -4174, -11077, -7641, -3247, -7579, -960, 7213, 7539, 3260, -796, 3490, 3856, 4867, 7026, 5734, 2732, -6220, -11528, -9099, -3903, 7964, 10989, 6121, 7053, 6396, 4760, 1682, 6733, 6919, 4964, 1838, -954, -3401, -3917, -7668, -10894, -7209, -4186, -2338, 5240, 5621, 4859, 8037, 8450, 4282, -2160, 2653, 2915, 1216, 5988, 5093, 593, -6004, -3853, -2521, 824, 953, -2234, -1827, 4022, 5066, 6535, 3507, -2312, -5174, -1287, -6674, -7545, -5241, 865, -769, -5135, -2304, 2748, 5460, -235, -4224, -379, -4736, -3084, -2239, -3391, -1266, -4604, -4578, -5523, -4231, -2636, -6230, -2282, -7900, -8347, -6796, -3387, -709, 4143, 7096, 9041, 9002, 4389, 5835, 10367, 7252, 3252, -1189, -7818, -3527, -1294, -2989, -4724, -466, -1976]
6751a976j686K457n330l1M828K8K648J489k311J030N679M266l990k150k95n307
6735f51M96K137l305m327l050l190O63L819N419L215p55p16m401l967m040J769
6719a0884N284J396k198j485K394O631r55j645k893r84N901L658M611L007l805
6704H033N79J572j734l327o004M992K076n22l8k620n555n708Q641j039l51n060
6688f065j061l56q16J290l641n557M427Q668J94j660K54K781m823K723P106k827
6672F37K95l723K018J215L619P231N81j949l910k391Q19l433l785p042l385M253
6656h950M742k376k126M097j013j392K337J592l790l07M651J649K537J414j212
6641A853o035n11k150J834O535p06K396k16m963n777L947J150L681J977J554j873
$$ y = [-1976, -3662, -1205, -6535, -6566, -1738, -1710, 938, 2427, 116, 1146, 6825, 11091, 7101, 4951, 4656, -651, -155, 1982, -1323, -5650, -8700, -11890, -11227, -7408, -1989, 1226, 471, -245, -4646, -8613, -12653, -10884, -5600, -4204, -6402, -7887, -5493, 1138, 183, -1462, -4355, -5339, 562, 4220, 8831, 11838, 8033, 8612, 10184, 8450, 5123, -881, 4111, 6187, 5665, 5627, 3007, -2548, -8256, 385, -654, -1005, -6065, -7126, -7482, -8298, -7008, -10649, -16206, -11779, -3111, -2917, -4577, -4323, -1542, -6365, -3642, 3464, 637, 932, -2791, -773, 442, 4061, 11292, 11873, 9924, 6014, 3623, 4442, 1009, -2776, -9818, -13203, -8950, -4208, -6584, -8710, -4613, -5626, -7018, -4681, -3089, -6879, -7186, -2535, -886, 1651, 3065, 1853, -4182, -4693, -6843, -5009, 1526, 820, 3216, 3000, -1963, -7740, -3793, -2643, 1038, 3015, 4569, 2696]
6625B696M78n056k828l25J446o446q666M348O083L274K841r00j666J250L676J680
6609A885L779L72M278n685m880m069N636L270L052j962j330k658j582J88J92l292
6593b806M433N412L092j710j747P23M4k009j607k735l534k019M999J37l148l587
6577f062M55p45l007q112p64J1189O247j641K028j874n703P151K318m352k454
6562e326j780L249K540j429l78k122n4k465J357O26L559N894J547m74k727j144
6546H73P91K714K384k867m57J739j375n725m806l527k090k962O953O740R751J602
6530I738o414J105N37n800m616J55j271l429M675J057o44M708p953n799L599L492
6514f860N909J00L99N783L101j773o199o309q199K780K325J594L708N695k39p269
$$ y = [2696, 3174, -1882, -4710, -5035, -3589, -10035, -18701, -14353, -8270, -4996, -2155, -3055, -4721, -3471, 205, 1885, 5664, 6036, 10314, 4629, -251, -4320, 1316, 4586, 7638, 5676, 4346, 1688, 106, 294, 486, -2806, 1627, 7039, 10131, 8421, 6674, 7397, 7441, 5432, 3825, 1090, -2444, -4463, 536, 673, -2475, -6062, -5607, -6352, -9359, -17471, -18235, -7046, -799, -2440, -412, -2286, -7989, -838, 1480, -2872, -5326, -7106, -3857, -1317, -2746, -3124, -5246, -5300, -7765, -6408, -5782, -2223, 3671, 5218, 4744, 2017, 873, 1664, 4378, 6762, 3895, 3438, 5177, 3802, -1923, -6729, -10256, -12346, -15308, -8355, -1615, 8136, 9738, 3324, 4429, 4966, -834, -5450, -5295, -6566, -9995, -5320, -4263, -4907, -199, -8152, -13951, -10352, -6860, -951, -851, -452, 5331, 8432, 6659, 460, -5849, -14048, -11268, -8943, -7349, -3641, 2054, 1815, -5454]
6498e454K87K127R77K122N867J252j851n54K214N70L908O22k196n355m729k289
6482b482M408K465k886j184M380m151K711N169n3k402l76j097J635l344j291k015
6466e13m00K68K644k371K279m48l282l565M155L660l815p314k180O079M464R899
6450I560N064l321n962k540k744r9K065n70n301N20o88J815M728K793o360o470
6434g510l522K645J954l35n193L617P526L624k1K306n0j609m219n751m902k225
6418a3665k84M744N427K729j167k09l958o196j672L315M602N272k285J635N454
6403C742k223j85K220k315j64l385k771M586R21J359l111o559j207J915L858k753
6387f072L597O857N67l640l645K367L846n493O612J577o192J17j603n924j606
$$ y = [-5454, -5167, -3040, -2063, 59, 5926, 7178, 5327, 4773, 6987, 7557, 11465, 12087, 9891, 4536, -193, -2482, 1926, 4391, 1505, 321, 4701, 550, 3261, 8430, 8377, 5975, 5599, 4502, 6137, 2793, 1502, -513, -913, -645, 1999, -372, 1907, 1459, -1823, -5388, -1233, 2427, -1388, -8702, -10882, -4803, -339, 9560, 14624, 11303, 5341, 2801, 57, -42, 2023, 1453, -3848, -3328, -4016, -2201, 2527, 5320, -1040, -7510, -11032, -8387, -6433, -6768, -11961, -8344, -818, 2806, 2785, 5091, 5041, 3432, -787, -6538, -11440, -13665, -13949, -9205, -3778, -1049, -2216, -2425, -6383, -12579, -14251, -10936, -6334, -1062, -3347, -1712, 3742, 1519, 1334, 3554, 1239, 1075, -2310, -5081, -495, 426, 1785, -1326, -7885, -9092, -7177, -3319, -6072, -2475, 4382, 4949, 1309, -2336, 31, 3877, -1616, 4996, 6573, 381, 498, -1105, -7029, -8635]
6372h635O33j171K429M493L000P374k945k865J021k05j762J748l901m201M088
6357h99M82J058M536j077q04k332J036P22p02n772K989K959n104n512l356J877
6341i899K386J416R738J912l567r55m751j338Q07N63K872O902J102r069j82N701
6325C638K893J136J119J146l969r97m554K171L089j714r00j045l826o209j466
6310i488Q399Q51j073L689K116L349n034j0000m784J065m698k567Q197R39k217
6295a1256l34J786N75L988Q149J718L963m778k07K730m852o909M253O991m435
6280A382l064J001m955n673P39O588L050K951M858K77m641j706k239j581M1M031
6264A059M461p869O84O757N11n573K115k127l29J535k771j595k388k158K295l911
$$ y = [-8635, -8002, -9173, -6744, -2251, 749, 8123, 5178, 2313, 3334, 3129, 1367, 3115, -786, -4987, -899, -417, 641, 5177, 4100, 3296, 964, 2000, 2722, 2020, -3752, -763, 2196, -2908, -8420, -11776, -9899, -7513, -6097, 3641, 5553, 1986, 1031, -3720, -5058, -4251, -3688, -816, 6086, 7188, -1881, -2063, 3638, 6531, 7667, 8786, 9932, 5963, 4966, 412, 2583, 5672, 3958, 3058, 2013, -1813, -8022, -9488, -1089, -238, -1311, 2378, 4494, 7843, 2809, -7191, -11975, -10910, -15608, -18175, -9978, -9039, -11256, -11590, -9804, -9229, -5241, 2908, 4626, 8589, 3811, 3604, 6334, 1482, -5427, -1174, 5817, 1382, -1682, -681, -5636, -11309, -10570, -3982, -932, 2019, 6877, 7154, 2513, 807, -1432, -3013, -2972, 1059, 5520, -2349, -1665, 5092, 5603, 30, 2145, 18, -311, 1224, -1547, -3142, -5530, -7688, -5393, -9304]
6248i304L031L823K137o231p666L502J1438L364j0516n703L660K940m472o967
6234a6964L347R841J908j879l231K287R40o933j432K439Q79k586k053N35M039
6219h863k6O227J335M501n307k536o84M16M621J954N999R46n244j994Q29L26j951
6202E49k05J187o48l350m456L909o34l058k16L956k797l767k221J71l230m3K420
6185a2433q115J92N275P432k175k661L622P686M367p073r829N855K491K065r05
6170d206L31L013j510L68l79J55p521J211J226j317N76k732K070L634k795N35
6154g341J834j944M029R638O38n489K502p83p306j012K046M354J567j968l671
6139b906m240j589J342Q230J444k873n493q82J514PQ17L965q46Q39P741R94m836
$$ y = [-9304, -6273, -2450, -313, -6544, -14210, -10708, 730, 4094, -6422, -12125, -8465, -5525, -9997, -16964, -13617, -3776, -1868, -3747, -6978, -4691, -3751, -10684, -12116, -9677, -8798, -11384, -13437, -12902, -8863, -8889, -2662, -1327, 3174, -2133, -4669, -5353, -4937, -316, 1638, 7637, 8583, 3339, 1345, 2174, 2500, 549, 344, 1531, 883, -2467, -6923, -3014, -3648, -6706, -6922, -2966, -5763, -9530, -11751, -11580, -14810, -14853, -12433, -20548, -20356, -15081, -7649, -9824, -12485, -8863, -1177, 3190, -3883, -13712, -7857, -5366, -3301, -4206, -3875, -862, -2372, -2004, -2383, -2228, -9749, -8538, -7312, -8629, -8053, -10785, -8715, -5081, -7876, -7341, -5507, -7451, -3422, 6216, 6854, 1365, 3867, 3084, -4222, -5234, -3188, 1166, 2733, 765, -2906, -7146, -8735, -7393, 837, 2281, -592, -6085, -6967, -5453, -5446, -4629, -664, -1510, -671, 7070, 8064, 3228]
6122C228k760n737O555l11k995J470N28K413k994r81o94J73J250L19L902R21j551
6105B736o761O461L649p949q473k415L720K98P34j871Q75L05K464K052r93J287
6089c881L899Q577j717q267r38k498m57k093l913Q25P564K947N466L23p736N49
6073a350M192L044k936m566j186m035J796L669q63j15L753J354j091l727p054
6058i115n76M943J261l45N477K806Q61n544p63j251P43J009l102L116L329L335
6042F184J876k626p500p369K740N663O808m56k201j418p182K840R782L862n158
6027E845m490K917k160m904M11O16R984r33m462p625q088l972N105J252M95O414
6011c595J616K088L244l353M01j84k892m120l032k81J595j446O886K70j799O43
$$ y = [3228, 468, -5269, 1286, 975, -2020, -550, -22, 2391, -603, -1584, -2278, -2105, -855, -536, 3366, 4287, 2736, -4025, 2436, 6085, -1864, -10337, -12752, -9032, -8734, -8000, -9871, -8996, -8691, -6227, -4175, -5168, -3881, 18, 8595, 6878, -1389, -2327, -4825, -5282, -7375, -11288, -10463, -2899, 48, 5514, 5837, -1899, -1350, 2842, 5886, 2950, -1616, -2802, -6837, -5041, -1372, -2235, -2350, 1403, 2757, 1666, -2061, -9115, -9691, -4748, -3487, -3832, 1645, 4451, 5312, -232, -995, -2246, -1503, -494, -3596, -480, 2849, 6184, 8060, 5434, -2066, -9435, -6695, -1032, 5776, 5320, 3119, 1701, -5481, -2641, 7141, 11003, 5845, 1355, 4272, 2112, -2792, -2381, -1765, 8219, 7286, 2824, -4801, -12889, -16861, -11756, -10504, -10009, -3595, -1979, 109, 3353, 0, 401, 217, -2675, -6795, -9827, -10108, -8513, -9959, -3073, -2803, -4602, -3959]
5995c959K346J795M89m554k074l47N010P22q006n131M111O113l141p60N337O795
5979D746J242j0017k307Q935O62j61R77j689k772k04K533m04q77k450k29p26J502
5962a239k089J704K434k84j188m395o33N593k59j1p51O233P620J893j0125o119
5946a616p507J075P226r18r93m11M643K163K575n199q29P88l117Q513N003p00
5930A0696m176n268M781K09n683o76K007J722j028l389q547n162J56Q373M512
5915a473J631K211L593q13N515k088l643K322k403n245O574J710k780n206J591
5900A496k222J178p73k025K68K949m556m781j348j668M476O685J436r04O606N487
5884A2304l516q830l094O526m211l478k061K792P165o231l330l218k850l81K396
$$ y = [-3959, -1613, 182, 671, -3883, -5957, -6304, -1294, -572, -8578, -13709, -9598, -3485, -6626, -7386, -2049, 4746, 5988, -4029, -6336, 2599, 3261, 3100, 4077, 2388, -384, -588, 1945, 1541, 664, -1786, -2015, -2741, -1239, -3328, -1624, 810, 526, -662, -5057, -5690, -97, -356, -367, -1118, 5115, 12735, 14628, 4503, -1616, -9123, -8048, -822, -1740, -2733, -3144, 1499, 3662, 6237, 1038, 209, 997, -2120, 6393, 11396, 10696, 6520, 1252, 6033, 6242, 559, -117, 1890, 3612, 2584, -805, -9352, -14514, -14358, -5985, -1473, 158, 2369, 5962, 5149, 10664, 8576, 4933, 7255, 4852, -393, 6181, 7891, 5111, -95, 1496, -726, 452, -321, -2346, -2078, 871, -3685, -8466, -9814, -11482, -7006, -321, 1115, 211, 6817, 12304, 8788, -42, -3136, 3390, -821, -4299, -6360, -3568, 3597, -2634, -5964, -9182, -12032, -12413, -10017]
5869a0017L673k089l384L07m44L772M941N366k590m432j286m688j003j167N155
5854g886Q949J409R8k207m079j961M373j485k558n089K854K35k873k779N120K817
5838e062L113l747o014K092O395l44k737J010M728l597l633P009L243P37k527
5823F66n903j116k82L544J014k256l285K227N873m372j847K549P58O244o241k245
5807d672O601K007k658k980J347N12q65J337j375j308O387r56K316L420J819o27
5791A0305j378o330j464K790O329J145M095j10n577k549j284P94K751k138o842
5776E37M25P42J555m114K105O139j18l679l42J488J133q61n97q96l779k997j094
5759d353j812L52l419K585O240j242m194l73K591j458L374J0284K821k728k807
$$ y = [-10017, -6344, -8433, -11817, -11510, -11954, -8182, -3241, 2125, -465, -4897, -6183, -10871, -11874, -13041, -7886, 1063, 2472, 2570, 363, -3716, -5677, -1304, -2789, -5347, -10436, -7582, -7347, -10220, -12999, -7879, -5062, -1949, -5696, -11710, -9618, -3223, -3567, -6304, -5294, -566, -4163, -7796, -787, 2456, 3193, 666, -5237, -6353, -6635, -3091, -2077, -4333, -7618, -5391, 482, -3890, -5737, -3188, -2430, 3814, -2427, -4672, 1929, 3936, 1278, -1702, -355, 157, -708, 629, -746, -2054, 4333, 3377, 5693, 9113, 10932, 10305, 8927, 2597, 1133, 3923, 10252, 11397, 15492, 15382, 9805, 7256, 5972, 6766, 9517, 7379, 537, 962, 1704, 3259, -855, 1250, 7389, 7271, 3592, 3250, 4738, 5871, 5010, 4413, 3517, -262, -3259, -4353, -6165, -5813, -9232, -6647, -407, -1649, -5843, -6216, -3625, -5083, -1709, 8575, 11396, 8668, 5861]
5744E861J89k638j291j049m90K599O93l713J448K857O89k070j0137M71K457m070
5728h194K851q20M302M727l82l688q53K82M522L125j796q725K04L155M058L47
5712C115O75L657n116m325o079q35J779l066k423L068K802J576M921L58k25N369
5696E251J094p320n321n572j164J022J268L215J416r03N584O577l974m401j808
5681e036L115k636K228P974j064j062n96j761J17J001K045L383m10Q13l772o885
5665b546J465k035l355n080K898j975m538L941j282O474O595M581N957l372q010
5650b82k503M389L008j788J077J524k957k524J785k026k16J442n846n516J770
5635h663K082L61R23P364M848j076k608N54K33J565L762L948o775p344j907P77
$$ y = [5861, 6050, 3412, 2121, 1072, 582, 3181, 3874, 161, 1609, 4466, 5155, 3085, -7052, -6581, -4124, -8194, -5343, -6163, -1861, 2866, 2484, -1204, -2057, -1775, 2747, 5872, 4076, -4649, -4445, -1290, 2768, 3115, 3790, 7447, 2331, -1994, -8073, -8908, -7129, -10195, -12618, -9550, -6748, -5172, -251, 107, -118, 5251, 6345, -975, -6296, -11868, -13032, -12010, -10742, -7527, -6111, -7014, -1430, 5147, 1173, -3228, -5036, -1921, -4557, -2329, 5645, 4581, 3519, 2923, 1162, 1279, 2280, 4325, 7708, 7298, 8111, 4339, -2546, -1081, -3116, -6471, -11551, -8653, -10628, -15166, -11225, -12507, -6033, 562, 5143, 11100, 7728, -282, -2785, 1604, 4612, 2824, 3901, 5425, 2468, -56, 1729, -297, -513, 929, -4917, -10433, -8663, -6581, -6220, -5297, 2067, 6915, 5839, 3231, 3785, 4018, 5583, 9345, 13293, 6518, -826, -2733, -1956]
5619a956k015l285j684J06J260J1494K149j173J121M296K257n397o380l945J234
5604a918K39L113J413j2149n651L385N002N15J808K864P127k383K80m93K25N428
5588H805j684r957k917J589J826K044m53J349j442k659L473K460K0k285l593M8
5572c376j754j6N750L139j14p586m866j262Q112J657K210J729j129o180l959m945
5556a2590N57Q69k359k21J633K145L879J0224M258k887k225n288N369M960p343
5541I81n118J685R547K321J1j937p715l979K235K269m378j532J320N81k478J783
5525d404k846j41L257j542j960l070K562N293M187k477j2335K947N116N374k064
5510b103m181N690j017j700K432L443l000J226J16O40L090K691j695j063L695
$$ y = [-1956, -3971, -7256, -8940, -8834, -7574, 3920, 6069, 4896, 6017, 10313, 12570, 7173, 793, -3152, -1918, -1679, 1434, 2847, -9302, -14953, -11568, -6566, -6051, -4243, -1379, 5748, 3365, 3645, 3152, 3377, 8805, 7121, -2836, -5753, -4164, -2338, -294, -747, 602, -840, -3499, -26, 2434, 2454, 169, -3424, -3376, -5130, -5146, 604, 3743, 3629, -3957, -8823, -10085, -1973, -316, 1894, 3623, 2494, -3686, -7645, -12590, -12033, -11164, -13523, -13744, -12111, -9966, -6087, 4137, 8395, 5508, 3283, -2005, 3364, 8324, 981, -4137, -2452, 7095, 9416, 9427, 7490, -225, -4204, -1969, 300, -4078, -5610, -4290, -3709, -6187, -4404, -7250, -7391, -4134, -5676, -7636, -10706, -8144, -2851, 1336, -1141, -13476, -10529, -5413, -39, -2103, -6284, -594, -1611, -3311, -879, 2564, -436, 790, 906, 1546, 4636, 7327, 5632, 4569, 8264]
5495H264n97m974m430j037k62l615L543r95k230l705N121L831q494P363R039K563
5479I385K901k696m863k583k273j054J283m091K555P554K370n22j1634m687k65
5464h620L815N89J371L393l444n184N408P710K802l171r850l179J21K582K396
5449c261N286R09m828J518Q56K454k33l004k995L423J0157K287m369K961j173
5434I988k183K323j533J390l82o231l648l477o895k97J234J650j226O13j939l695
5418a4308K692k401N991P370L090m94m205m908J728O753K259M886j823j165q832
5403c367M17lk926l021L483Q006M238M085J392p852k418N80j155K204M58m614
5387d93o737j752O90J690M765J433l260J048N627L081j478q87J70l817q59R63
$$ y = [8264, 7667, 2693, -1737, -2774, -3036, -6651, -3108, -4103, -6333, -10038, -4917, -1086, -9580, -2217, 6822, 9385, 12286, 9590, 4727, 2144, -129, -1183, 100, -3991, -1436, 6118, 8488, 7966, -3668, -8355, -8620, -4805, -4216, -2845, 548, -2896, -8080, -2672, 5038, 7840, 4669, -5181, -8360, -8239, -5657, -3261, 2025, 2934, -1894, -376, 480, 2934, 2701, -303, -3298, 125, 10282, 12569, 8200, 11161, 9988, 7805, 10128, 8595, 9985, 9603, 3372, -276, -3753, -10648, -10945, -9711, -8061, -9287, -8674, -10613, -14308, -11616, -14017, -8026, -656, 2434, 1940, -2265, -7173, -5445, 1308, 3567, 8453, 6630, 5465, -3367, -2950, -2953, -5879, -8900, -5417, 2589, 6827, 10912, 12304, 4452, 2034, 2614, 1459, 3663, 4121, -493, -7230, -8982, -8292, -6602, -1837, -404, -3664, -2616, 3011, 6092, 4614, 3727, 3897, 80, -779, 184]
5371A84P405M115j953m459k282k836P32m84o4r43P95J091Q48j167k690J781o224
5354f151m682K704Q98M623L032k45m291l915j791M579P163l159l784J781K761
5339d77l57q15m948K86M295P80n345J338l762l68o26Q44K456L347R148N016r058
5322A754n250O358j688l063J197J059p61l994l586j454m715M770Q636P606m041
5307B828j182m531r921k316L467K969J169j695O446K851j80j543o53J257lL013
5291A976j809K316K496r52l454j178K634l486r42M598L782k92l194k791K224M105
5275F033K72J463l170R80j755M856J442O65M22m820m782p56n922J173N436j178
5259C59K01j227m091L811J074n437r081k572J360O78N389K764K737R311j109q762
$$ y = [184, 7589, 11704, 9751, 5292, 3010, 174, 906, 422, 358, -585, 210, 1301, 2149, 982, -1708, 73, -6151, -10833, -8129, -7231, -2608, 424, 179, -4112, -8027, -9818, -5239, 1924, -1235, -5019, -3238, -477, -834, -1649, -6597, -6311, -2016, -1236, -6581, -5243, -9005, -9373, -9999, -9155, -6699, -3352, 5796, 10812, 1754, -3496, 2862, 1174, -1889, -692, 367, -394, -4388, -7974, -9428, -14143, -9373, -737, 6869, 2828, 1646, -2885, -12806, -15122, -11655, -8686, -7517, -9212, -2766, 85, -95, -1638, -2291, -1034, -1037, 1976, 167, 2483, 4979, 4027, 573, -605, 2029, -1457, -2399, 2199, 5981, 5689, 2495, -296, 1928, 6033, 6305, 7768, 4598, 5578, 3823, 8679, 10121, 10786, 11208, 6388, 1606, 850, -5072, -3899, 1537, 359, 560, -667, -4758, -947, 127, -5310, -14391, -16963, -15603, -14925, -9536, -6772, -4035, 5276, 4167, -4595]
5243d595N40J074j629K265k711j329M092K563l331m82K196P173L306K305j275
5228A0162o349K521J801k248l147n788k969L385K236L6P09n204o68N755N09j03
5212F38L11J831p045o28O437L931L767l797j623l196j285m41j939l251N778k957
5196c469K205J516N865K65l331n268l058J944P80k267k313j55q40K141N991L69
5180C75k088P69Q58k391n6O910R38k379k317k821L786j613R23o535k868R343N850
5163F684k78O050Q84r826l796k156K871P919j925o275o10R28L596j468j241n566
5147d209j069j33K975P261K598p321k798k196M601K462M85L912j446o765P79n713
5131f577j331N997P246J007k364N157J525l580p79M92n31N02k674j782L562j627
$$ y = [-4595, -4055, -2981, -4610, -2345, -5056, -6385, -2293, 270, -3061, -3543, -1347, 5826, 9132, 11437, 10162, 3813, 6334, 8135, 5887, 2740, -3048, -6017, -2632, -396, -360, 349, -4855, -5523, 232, 741, 638, 949, 2780, -4265, -4893, 1544, 5475, 9242, 5445, 3822, 626, -659, -1100, -3039, -6290, -512, -3469, -1264, 252, 6117, 6382, 3051, -2217, -5275, -3331, -2551, -4818, -7131, -7286, -8126, -5985, 6, 375, -1713, -944, -86, -2477, -2533, 4377, 5315, 2936, 619, -2202, 1584, -29, 894, -5641, -8509, 834, 6684, 6406, 12456, 13340, 3514, -282, -2438, 433, 8352, 6427, 152, -458, 470, 4066, 2598, 1357, -4209, -5278, -5411, -2436, 4825, 7423, 102, -2696, -4892, -291, 2171, 2656, 6568, 5122, -1643, -864, -6577, -7908, -1911, 5335, 6342, 3978, 9135, 10660, 7080, 6301, 6793, 6262, 6764, 4090, 2308, 5870, 4243]
5115D243n93K031j279N11n780j1014m375M327M721J06K62M640m145n056O95N33
5099a0173M701K640L491M357J011J615n55l39L03J556K503m24r183p21M774J75
5083E731n012n241l37K109J492N099o315l213N502J544n468j537K715O46O051
5068C766r9m198M71K680M533k126k900j513N958N395q87l021m585k538k689J249
5052e04L482j443j142q80n392k521K391K852k16L610J421m105k488l607M58L079
5036e005J070L195L138j243l805J835L739K704M888m499m211o858L565L112m16
5021A209q01m10r32j697J204M54K839k035j094K109O159j630M625M252m113j909
5005H230J232l615q112J437L797o58j519J040J50J541Q7j440Q77j487m849p903
$$ y = [4243, 3650, 5681, 4402, 4913, -867, -11881, -16256, -11929, -7208, -7102, -6840, -2200, -6345, -11401, -10706, -10173, -5472, -2832, 659, 5016, 6027, 7642, 7087, 6748, 7051, 8607, 11110, 10686, 1503, 782, 5556, 5731, 719, -4522, -4859, -2750, -1258, 3841, -2474, -5687, -185, 1359, -4109, -5646, -2931, -2285, 3766, 3667, -531, -60, 2620, 7153, 5027, 2127, 614, 6572, 11967, 11080, 8059, 3474, 936, -1753, -504, 2978, 1535, 393, -487, -5879, -8400, -6009, -3157, -3373, 237, 1658, -2447, -4935, -8542, -8084, -5005, -3935, -740, 2398, 1155, -2650, -815, 2924, 5628, 10516, 6017, 1806, -5052, -1487, 1625, 1209, 408, -2, -934, -2631, -1427, -973, 1866, -169, -1263, 846, 7005, 5375, 10000, 14252, 10139, 8230, 9462, 5847, -2265, -828, 2969, 2311, 792, 1832, 1982, 3523, 3610, 2170, 3047, 1560, -3289, -11192]
4989a1192J746O015k9l09n83m64O18O55N872k192p745n73L821N684L545K213m513
4972B569p864k771K388Q544M01p274K280J561J332n86J307k866k313m99R67M342
4956A518K800L9K662k290m302n06Q62K918j1044k087M956k127J008Q561J637l128
4940A477p563l04J830L939M188K637m399j171j651j251m859k125P68K390N69M90
4924e035K766k940q00J689J50n08J549M139O147J956m460k885J067l448m139j102
4908e854L191J686L586K612j123J603j130l324m957J654l257K677P217J583j620
4893D544N042K55k495k383j028m432J849K796L40n617J975k873n422N097L97k431
4877d386K711P125L021n856p411L823Q146k8l468k145j974J884L404p93K54J100
$$ y = [-11192, -9446, -3431, -3460, -3769, -4352, -4816, -4198, -3543, 2329, 137, -7608, -8181, -4360, 1324, 4869, 7082, 2569, -5295, -8066, -5678, 2866, 3267, -4007, -1727, -166, 1166, 580, 1887, -979, -3292, -3791, -2824, 1518, 4318, 4357, 7019, 4729, 427, -79, 783, 3701, -7343, -9430, -4474, -6601, -5593, 2968, 4605, 1477, -6086, -6390, -4560, -621, 3567, 6204, 1805, 634, -1017, -2268, -7127, -9252, -8484, -6094, -5525, -5035, -2269, -5209, -6009, -4320, -4170, -4678, -3129, 1010, 7157, 9113, 4653, 1768, 2835, -613, -4752, -5854, -2663, -977, 2609, 5221, 4098, 5701, 4571, 1247, -3710, -2056, -5313, -2636, 4581, 6164, 4544, 9586, 9841, 7346, 4963, 3935, -497, 1352, 4148, 4488, -1129, 846, -2027, -7449, -2352, -1955, -4386, -1675, 5450, 8471, 2615, -4796, -973, 7173, 7145, 3677, 1532, -442, 1442, 4846, 4053, 4307, 5407]
4861E407K281r086l683R5M150Q622j351n122J997L494j107p767k278K588J608
4846a52P842j668m098J331n487l775l072J043N393K155r61N659J461J869K152
4831I692j756L854m811k915m227o295n16n218L043N430k616N481L096J889m772
4816f41k001N657R8J899L79m458o15K7l40L424Q91J881j92l161m14k659k420M93
4798b152l46J205l369j624j750M708J319N586k947k622M003O03l65K422m584j943
4782a856J25O262N40N7m587J230L340l722J433J102P827N580k775l749l680N602
4766A2729K113p46k127j056r03r175K061J652j767k93m401J377l67M022l030j946
4750a857j373O806l45r457R12M681K207k918o517L265K074J028J348M9j987m141
$$ y = [5407, 7688, -1398, -5081, -4986, -836, 7786, 6435, 1313, 3310, 6804, 5697, -2070, -4348, -1760, -152, 7690, 6022, 1924, 3255, -2232, -6007, -9079, -8036, -2643, -488, -1449, 4210, 5671, 7540, 9692, 7936, 11790, 6979, 4064, -163, -6458, -6974, -12192, -9149, -3719, -6335, -854, 2242, 4131, -641, -2642, 3015, 3113, 5012, 5391, 933, 318, 345, 5, 3429, 4320, 6201, 6009, 2848, 2434, -225, -2645, -2152, -2498, -1293, -4662, -6286, -8036, -3328, -2009, 3577, 630, -1992, 2011, 2614, 2249, 4671, 87, -1856, -1731, 4531, 5071, 5128, 541, 1771, 5111, 1389, 2822, 3924, 11751, 17331, 14556, 10807, 7127, 12729, 14842, 14096, 11969, 10913, 10010, 835, 2896, 4548, 2781, 2488, -1913, -536, -903, 3119, 89, -1857, -3230, 3576, 3231, -6226, -5314, -633, 1574, -1344, -7861, -4596, -2522, -1494, -146, -97, -2084, -6225]
4734f225j789O782K143j111Q362j248J355L450L019K97l582k722l88R80k953j890
4718D480P884M14r605k886K287J962K760j316k149l717j966O69j626O93q491K616
4702g991N849M068L622P514J628r982M54K842o911J159K647k636p633N453N187
4687E270k678m581p172R60N131O221k697K210O837j797L414m793j364M39j550
4672C850k078n95M136K897q207m332K294j347K44N147L165k000o763p079R52m094
4656a3810p55L648J179M96P218N322J932p924n464k354m97J094L387N492K789
4641A753K615j02l153k86M072k632q242m508K968Q19l43J847j319k250K446L941
4625b374K744L85l466j754O87O641P867l055k760L09m286m593J629M238P038J610
$$ y = [-6225, -8014, -1232, 911, -200, 8162, 6914, 8269, 11719, 14738, 15035, 11453, 8731, 8343, 9323, 6370, 4480, 12364, 12778, 3173, 287, 2574, 4536, 7296, 5980, 3831, 114, -1852, -1183, -2809, -2116, -10607, -7991, -2142, 1926, 5548, 13062, 14690, 4708, 5162, 8004, 1093, 2252, 4899, 2263, -5370, 83, 5270, 2592, -1989, -9161, -8201, -3070, 3151, 454, 2664, 9501, 7704, 11118, 6325, 4961, 5400, 3850, 1772, 1177, 5313, 8210, 3, -4329, -2035, -3382, -3138, 2009, 5174, 3174, -3589, -10668, -9716, -13810, -14565, -10917, -9738, -9242, -2024, 3298, 5230, -2694, -8158, -10512, -11009, -9915, -6528, -1036, 1753, 4368, 4266, 1113, 827, 4899, 2267, -5975, -10483, -7515, -6696, -7039, -5192, -6511, -8761, -6315, -2374, 370, 755, -2711, -4465, -3778, 2863, 10730, 7675, 4915, 5224, 938, -3655, -2026, 2212, 9250, 10860]
4609A0860k765l007o934l742O65M72K972J475K369K029j553J367o21o726n957
4594i096L761L700N842R154m423m617L497l201o446J695O468J216l998l519j118
4579a085p44p601K308M54L758l323k240K364Q67k64l39Q20Q381N244l932k397
4563B271o484J0942K689o383n655o168Q19R349l960p074l460k574Q000M141K166
4548a381J867l220N58q95J228q08O100J363p121k657J533O873M097n717J238L835
4532F893o097o149M020O751J00o926J172p711j624j103L602O815L627J511N510
4517A0391m517o345M160L050j833j691j272K897j123o635j233k760m053l165R943
4502d186Q509j739n301k020J235J849L143l2j257P78Q17J09P82L790k010m596
$$ y = [10860, 8095, 5088, -1846, -5588, -4923, -4451, -1479, -4, 2365, 4394, 2841, 4208, 3587, -3139, -9096, -5335, -1635, 4207, 13361, 8938, 4321, 7818, 4617, -1829, -134, 6334, 7550, 3552, 33, -1085, -1829, -9430, -7122, -6668, -2910, -6233, -8473, -6109, -5242, -5506, -5845, -5025, 3356, 8600, 4668, 2271, -4213, 6729, 9418, 3035, -2620, -8788, -7969, 1380, -2580, -9654, -13114, -15688, -7688, -3547, -1381, 486, -2734, -2176, -3071, -1843, -2651, 3449, 4812, -2309, -4966, -3433, 3440, 7537, 1820, 3058, 6893, 796, -5353, -1333, 5418, 5518, -1408, -236, -7947, -9571, -10674, -7072, -257, 3370, 4881, 10391, 5874, -471, 3689, 6739, 4906, 3215, 1943, 4840, 3717, -2918, -4151, -6911, -10964, -14129, -4186, 4323, 2584, -2717, -4737, -3502, -1653, 1490, 1458, 201, 979, 1796, 1905, 2687, 6477, 4467, -129]
4486a29K168N916K745n241J266n083m29K29n263o630M020L773K321L529q52o08
4470A732J338Q18k366r08j389j281r29p28L792n60J107l718m85J109l178L296
4454b350N907m553J453k00q021r026J460O489O850K064m373J829Q136l060k490
4439A15j105k102n926j863L037P85J788o17m32J647K157J834k946K657J858N37
4423A424j14m112K037L47k93K90J525K252k217j5245q33N485O487K988K513k33
4407B301K38m480n510J431j142K335j45m74R41N988O550r52n756j612K737J729
4391D179k67j003j02J509l643k928j683l388N343P279J53L163M48o848J103Q88
4375D203j128M6m025m47R30m341M364P627l787m245j087N032K211k188n602k316
$$ y = [-129, 2039, 7955, 10700, 5459, 6725, 1642, 1213, 1442, -3821, -10451, -6431, -2658, -337, 3192, 2340, 1732, 3070, 3888, 1522, 614, -775, -2056, -2985, -3713, 79, -481, 626, -3092, -3577, -2468, -5646, -2350, 3557, -996, 457, 257, -7764, -16790, -15330, -8841, -1991, 73, -4300, -2471, 5665, 2605, 115, -990, -3092, -9018, -10881, -7844, -7059, -5271, -5888, -6320, -4673, -2516, -682, -3628, -971, 887, 1424, 1310, -2802, -765, -418, -711, -421, 1104, 3356, 1139, -14106, -14939, -9454, -2967, 21, 2534, 2301, 2539, -1941, -7451, -6020, -7162, -4827, -4972, -5446, -4505, 1483, 8033, 7081, 1325, -287, 2450, 4179, 3912, 2909, 2807, 4316, 673, -2255, -3938, -7326, -1983, 5296, 5449, 8612, 9060, 2212, 3315, 4203, 3075, 3121, -904, -1351, -421, -4762, -398, 7229, 3442, -803, -1890, 3142, 5353, 3165, -2437, -4753]
4359d753J178M23K30l161m229j705M753J389J357M298L276n303l159j7k130J603
4343e950J973N013o88M211M99J486j327K525J172l010k097m529l935K607K593
4328E43l435k369M13K028l072J444J4819J174q725k040k899J102J336j322L32
4313f71j307L40J085j621k526J63l371K050Q415J634l735k33M625j944L958l828
4297C034l639J098m89J617N878J918m303p949n045K075K680m351K714M750j774
4282a786j471K488l696J93N49n455K83M960Q649j33k906R89l104J576n291j0575
4266a4730K288Q638M789K595L26K042j157n147J902L610J81m923o056j765M459
4251b948O159J811o87R83J630m978p554m895M994P119l670m239k192J001N224
$$ y = [-4753, -3575, -3152, -2922, -6083, -10312, -12017, -7264, -5875, -4518, -220, 3056, -2247, -5406, -5423, -7553, -5950, -3977, 1036, 348, 4559, 5058, 6544, 5217, 7742, 8914, 5904, 3807, -722, -4657, -2050, 543, -2892, -5261, -4848, -2820, -5892, -4448, 10371, 11545, 2820, 780, -2119, -1017, 319, -1003, -671, -1978, -1638, -553, -2174, -4700, -4537, -7908, -5858, 2557, 4191, 456, 223, 4848, 2904, 6862, 3034, -605, 493, 4, 1621, 7499, 9417, 5114, -2835, -7880, -5805, -3125, -7476, -4762, -12, -1786, -3257, -769, -4465, -4272, -3723, -9178, -8895, -3935, 4714, 4581, 1675, 2664, -440, 1136, -4155, -14730, -12442, -3804, 985, 3580, 3906, 5948, 4791, -356, 1546, 5156, 5337, 414, -5642, -7407, -2948, 3211, 5022, 4335, 5318, 6948, 1970, -5584, -10479, -5485, 1634, -2036, -6275, -8467, -7466, -2242]
4236b242O444R17J613J300k362r005o446l138N398J167p129P38R89N125L967Q7
4220b577J746K958o414K337J453J335L016n589l486K646j936K376O39j889K123
4205a262J044r64m8p13L133k145m064l353L24M209j256j607K661J162M118L419
4189D658k205k81j311J844j958J553N302Q483L406o647m350m750n86l117N90N994
4173F625M01l433m722M92L367O417j683k427n357L445m157k741j750j357L910
4158b970N289N216l278k132l576j60K380N204n005o144k166j266J575J999P74
4143d260L517J057l049K55L303k780J214N99n76m301k332N999k435k641J0625
4128D195Q949K64q56m698p953o406K515O88k098j292K281K784j020j620m288k865
$$ y = [-2242, 4202, 5119, 6732, 8032, 5670, -3335, -9781, -12919, -7521, -6354, -13483, -12745, -11756, -6631, -2664, -2577, -831, 2127, -4287, -1950, -497, 838, 3854, -1735, -5221, -2575, -4511, -2135, -1496, -3385, -1262, -218, -1182, -1230, -1943, 1190, -955, -5019, -8372, -8048, -3839, -5095, -6702, -4041, -2879, 1239, 4658, 2453, 2172, 861, 2705, 747, 2300, 7602, 16085, 19491, 12844, 8494, 3744, 3158, 41, 631, 6625, 7026, 3593, -1129, -637, 2730, 9147, 7464, 5037, -320, 3125, -1032, -3773, -5523, -6880, -2970, 2319, 7535, 4257, 2125, -1451, -1611, 769, 5973, 968, -5176, -7342, -8608, -7033, -5034, -4260, -743, 314, -2735, -2480, 823, -1957, -743, -144, -720, -5021, -7353, -1354, -3789, -6430, 4195, 13144, 13408, 12552, 7854, -99, -6505, -3990, -3302, -5400, -6692, -4411, -1627, -2647, -4267, -8555, -11420]
4112a1420N060p50k554j456M554O337M287k053n184j08K271J035j116l615Q0l015
4096g647k356K250L164K914k173M116N368N603j663P05l019m888j337L456M42
4081D935n146m469l616L249j143j17M03J18p5L054n076p185P490M395j611m01
4065e195K565K91K501j78l86K313j939j753l236j06l541K121mj596O638k202p675
4048a1382O22L26N196N45M742O857n08o422j953o80m31J188K951j436P120K155
4032H890j610o06o499n94o526P49P368N491o436L52m41k033L992J0476J658m024
4016A0207o165k383l113J388l994j163O539n28l56q86J529M391j314l255o958
4001f061n51L949M935l98p58n03l479M46L546J540k582k298j066K557N636K182
$$ y = [-11420, -6360, -7110, -9664, -11120, -6566, -229, 4058, 2005, -3179, -3287, -1016, 19, -1097, -4712, -4632, -7647, -10003, -7753, -4589, -1675, -3848, 268, 5636, 11239, 9576, 10281, 7262, 2374, 1037, 4493, 4935, -211, -4680, -8296, -5047, -6190, -6307, -5904, -5786, -5861, -2807, -7883, -15068, -7578, -3183, -4794, -5195, -2630, -2339, 162, -16, -402, 1911, -28, -1781, -5017, -5123, -8664, -6543, -6547, -8143, -1505, -3707, -11382, -10760, -10434, -5238, -4693, 49, 6906, 6398, -24, -1977, -2657, -3088, -1900, 1051, -385, 6735, 8890, 7280, 6674, 175, -419, -6945, -6196, 1172, 6663, 227, 579, 138, -1895, 2097, 12573, 14231, 10207, 4042, 1659, -1454, -66, -4060, -5223, 1316, 788, 432, -454, 1075, 5466, 4152, 897, -6061, -6612, -2663, 2272, 1874, 1116, 613, -2866, -2420, 1126, 2666, 84, -2214, -3280, -723, 4913, 7095]
3985G095m531m32K092j067j900N566M729M490p077p154K236m31r256Q08N803m227
3969c256N149O993k145J215J892q918p45K843K543P58k937M010L65l290p81L987
3953G683j046k404j118o107M29L989k250k541L224L117K525o114J702K185P75
3938D049J84r20L564P73p999n335L527l441m065L978N992J423M462P43n557o122
3922d744K922L887M127M43N37o717m067M495K595j022k68o74n356l840j45J689
3906f138k090J014N425K23j059N62O57Q936K530m524k419K090o92n154l58J504
3890E07M591J680Q1M81k577k026J340l006l433L004m583O83J007L079l50k919
3874b441j87j904l243l463M696N209m78p1O23k320q382L322J346n93K064K248
$$ y = [7095, 2564, 2132, 4224, 3157, 1257, 6823, 11552, 16042, 8965, 1811, 4047, 3616, -5640, -4832, 971, -3256, 1893, 8886, 6741, 7956, 9848, 930, 185, 3028, 5571, 6329, 3392, 7402, 7767, 4477, 3696, 7683, 6637, 4233, 3115, -2992, -2563, 1426, -824, -3365, -141, 2976, 5501, -613, 1089, 3274, 4049, 4233, 3313, 6877, 7650, -349, -5684, -2157, -5598, -9663, -5685, 307, 1730, 6192, 6935, 1378, -4744, -1822, 2065, 6192, 6635, 7172, 455, -3612, 883, 3478, 2456, 2188, 1514, -3842, -7682, -7827, -6138, -8228, -7214, -1789, -1566, -2625, -2063, -1406, 7530, 10060, 5536, 3117, 5207, 4515, -639, -997, 507, 5098, 6778, 6859, 7340, 4763, 2737, 4077, 1071, -2362, 642, -3941, -3258, -2251, 828, 478, -2441, -2628, -4532, -7775, -11238, -6542, -1333, -1811, -1882, -1259, -3579, -11961, -8639, -7293, -7886, -5822, -3574]
3858c574L381L718O18j444o38o384n813N350K985j481M101Q274j17j719k266l327
3842A664j26l793m267J819j810k460M169J646J674k490j055k64K571m397N442
3827a677J1719R14n706l676L8k972p70N916K385l378j601k174n459K040J138J333
3811a930K804N904J649J490j734m157l753N030J18O306k778o498q296j234L466
3796c613M428O947J38l941j634k83m571p95l68J033N78j341K998l804J100O893
3780C765j887r159k633J736L423J191M358L528j404m581l843K140L425J593J798
3765C450o45l899J788J884k08o984L750r33L075M827K574m192m225j908J110m896
3749e432j204K750k88Q805L51j88p217p754P38K368P31M413L677K037J505O115
$$ y = [-3574, -193, 3525, 4143, 2699, 2061, -4323, -10136, -4786, -1801, -3282, 819, 9093, 8976, 7257, 4991, 1664, 1538, -2255, -6522, -4703, -6513, -8973, -4804, -3158, -1484, -3974, -5029, -5293, -2722, -7119, -1677, 10042, 10956, 5250, 1574, 1612, -1360, -2130, 3786, 6171, 2793, 1192, -982, -6441, -4401, -3263, -1930, 874, 6778, 8427, 9917, 8183, 4026, 273, 5303, 5421, 11727, 8949, 2451, -5845, -7079, -3613, 815, 7762, 7900, 3959, 2325, 2042, -2529, -3324, -3692, -2659, -2081, -3422, -424, -4228, -3128, 3765, 1878, -7281, -9914, -8178, -4755, -3564, 794, 4322, 2918, -1663, -5506, -3366, 59, 1652, 3450, 2805, -1094, 694, 2578, 2370, -4614, -864, -1797, 1278, 6105, 8679, 4487, 262, -1646, -536, -5432, -6636, -3886, -4174, 4631, 4982, 4794, -2423, -10177, -9439, -7071, -6340, -1927, 1750, 3787, 5292, 11407]
3733A1407m433j2752j402L994L204j254M507K473k540k263k148J41j820K068K307
3718A489J099Q07r457p282L268M73P650j52M40L829k11L120K15J411l239L794
3702G254j545K47J3L685l054k345n051l278l026K42M660N42j092j306J744M565
3686B255j037o25j830r58m627m7L611L584N582M77n991l940j907L170J119m286
3670e450J264L234J745l054K87M560K775k68L86n76k561n302m506M984P456Q45
3654E819m24n794N538J102l414N01M440J377r20o845r03N410J516n21l676L876
3638G082m831j919k156N933N416P3o539m697L343n09j708k222K399L597j010m156
3622a904p547k25O707j676O263P19J478m443k997O587J815j360m647N99J0348
$$ y = [11407, 6974, -5778, -7180, -3186, 18, -1236, 3271, 5744, 3204, 941, -1207, -1066, -2886, -818, 1489, 2588, 3395, -6062, -13344, -10076, -9603, -1953, -2105, -1665, 2164, 1953, 5073, 5288, 6699, 3460, 7254, 5709, 5956, 5969, 9654, 6600, 4255, -796, -4074, -7100, -6858, -2198, -1656, -2748, -4054, -2310, 2255, 1218, 593, -1237, -2195, -6822, -6869, -3258, 326, 5908, 6385, 394, -3546, -5453, -2283, -1164, -5450, -4186, -952, 793, -2261, -1974, 2586, 5361, 5093, 5479, 4903, 2342, -2960, -7466, -2482, 4974, 5819, 5395, -399, 5139, 6241, 2827, 3328, 7768, 9145, 8225, 1380, 477, 5887, 7403, 6882, 3206, 7082, 2251, 332, -1824, 4109, 9525, 9598, 3059, -1638, 1705, 1196, -512, -2734, -335, 3262, 2252, -1904, -9451, -9676, -2969, -4645, 1618, 2337, 3815, -628, -3625, 2962, 4777, 3417, -1230, -631, 9717]
3607I717K126j320m07l059k502K596J639o882K116k53j541n97m394l098m82Q53
3591e488J403n72j520j948M184p750K914M057K996K61J130P228M231j972p930
3576A224L23m489o194K155M818P704k54n255m19Q095L755j787l328m565J677k353
3560A107k06J03K948M558m724m332J076o76M182Q97o950q188M165R497K511l126
3544B842k069M747J013M396L720J85j416j849k064n0j397L884m584k408j038L19
$$ y = [9717, 11843, 10523, 10116, 7057, 4555, 7151, 8790, 1908, 4024, 3771, 2230, 1633, -2761, -5859, -6341, -5488, -4085, -4657, -6177, -8125, -3941, -11691, -8777, -4720, -1724, -1463, -333, 6895, 11126, 9154, 1224, 1547, -2942, -9136, -6981, -2163, 5541, 5287, 32, -387, 7708, 11463, 9676, 6348, 1783, 3460, 1107, 901, 1004, 3952, 8510, 3786, -546, 530, -146, 4036, 4933, -2017, -10205, -6040, 3457, 5968, 2842, 773, 5520, 6533, 10929, 14649, 14834, 13418, 11569, 9505, 9455, 8058, 11942, 7358, 4950, 3912, 4231]
$$ [...]
##END NTUPLES=NMR SPECTRUM
##END=
