##TITLE=Analysis number 315945
Compound Code sew 04290
Project Code adrs
Chemist Name endeavour
##JCAMPDX= 6.0         $$ Bruker NMR JCAMP-DX V2.0
##DATA TYPE= NMR SPECTRUM
##DATA CLASS= NTUPLES
##ORIGIN= Bruker BioSpin GmbH
##OWNER= NMR
$$ XWIN-NMR		Version 3.5
$$ Thu Dec  8 14:09:38 2005 GMT Standard Time (UT+0h)  MAYBRIDGE\NMR@NMR_250MHZ
##.OBSERVE FREQUENCY= 250.131544655141
##.OBSERVE NUCLEUS= ^1H
##.ACQUISITION MODE= SIMULTANEOUS (DQD)
##.ACQUISITION SCHEME= undefined
##.AVERAGES= 16
##.DIGITISER RES= 18
##SPECTROMETER/DATA SYSTEM= dpx250
##.PULSE SEQUENCE= zg30
##.SOLVENT NAME= DMSO
##.SHIFT REFERENCE= (INTERNAL, DMSO, 0, 16.522)
##AUDIT TRAIL= $$ (NUMBER, WHEN, WHO, WHERE, WHAT)
$$ ##TITLE= Audit trail, XWIN-NMR		Version 3.5
$$ ##JCAMPDX= 5.01
$$ ##ORIGIN= Bruker BioSpin GmbH
$$ ##OWNER= NMR
$$ C:\u/data/dgb/nmr/ADRS/13630/pdata/1/auditp.txt
$$ ##AUDIT TRAIL=  $$ (NUMBER, WHEN, WHO, WHERE, WHAT)
(   1,<2005-12-08 14:09:13.06 +000>,<MAYBRIDGE\NMR>,<NMR_250MHZ>,
      <created by zg, POWCHK disabled, PULCHK disabled
       configuration hash MD5:
       62 19 C7 07 E1 42 D1 B7 37 6C 3D D0 77 39 F9 E6
       data hash MD5: 64K
       81 F6 40 4B 09 B3 E8 E7 0A 26 73 6C 86 29 8F 90>)
(   2,<2005-12-08 14:09:26.23 +000>,<MAYBRIDGE\NMR>,<NMR_250MHZ>,
      <Start of raw data processing
       ef LB = 0.3 FT_mod = 6 PKNL = 1 SI = 32K 
       data hash MD5: 32K
       61 7B 49 F8 FB F9 E7 34 D5 BE 89 03 57 90 F7 C4>)
(   3,<2005-12-08 14:09:28.09 +000>,<MAYBRIDGE\NMR>,<NMR_250MHZ>,
      <apk 
       data hash MD5: 32K
       D5 58 61 2C 5A DB 9F E7 FB 36 7F 14 BC B4 7B D9>)
(   4,<2005-12-08 14:09:28.92 +000>,<MAYBRIDGE\NMR>,<NMR_250MHZ>,
      <abs ABSG = 5 
       data hash MD5: 32K
       85 D2 E9 83 EF 6F CB 75 E8 62 CB 22 98 91 9B B5>)
$$ ##END=
$$ 
$$ hash MD5
$$ 5E 89 09 F9 52 E4 58 39 C1 71 A2 2B 44 D1 65 33
##$RELAX= 
##$RELAX= 
##$RELAX= 
##$RELAX= 
##$RELAX= 
##$RELAX= 
##$RELAX= 
$$ Bruker specific parameters
$$ --------------------------
##$DU= <C:\u>
##$EXPNO= 13630
##$NAME= <ADRS>
##$PROCNO= 1
##$TYPE= <nmr>
##$USER= <dgb>
##$AMP= (0..31)
100 100 100 100 100 100 100 100 100 100 100 100 100 100 100 100 100 100 
100 100 100 100 100 100 100 100 100 100 100 100 100 100 
##$AQSEQ= 0
##$AQ_mod= 3
##$AUNM= <au_zg>
##$AUTOPOS= <26 >
##$BF1= 250.13
##$BF2= 250.13
##$BF3= 250.13
##$BF4= 250.13
##$BF5= 500.13
##$BF6= 500.13
##$BF7= 500.13
##$BF8= 500.13
##$BYTORDA= 1
##$CFDGTYP= 0
##$CFRGTYP= 5
##$CHEMSTR= <none>
##$CNST= (0..31)
1 1 145 1 1 1 1 1 1 1 1 1 1 1 1 1 1 1 1 1 1 1 1 1 1 1 1 1 1 1 1 1 
##$CPDPRG= <>
##$CPDPRG1= <>
##$CPDPRG2= <>
##$CPDPRG3= <>
##$CPDPRG4= <mlev>
##$CPDPRG5= <mlev>
##$CPDPRG6= <mlev>
##$CPDPRG7= <mlev>
##$CPDPRG8= <mlev>
##$CPDPRGB= <>
##$CPDPRGT= <>
##$D= (0..31)
0 1 0 0 0 0 0 0 0 0.06 0 0 0 0 0 0 0.0002 0 0 0 0 0 0 0 0 0 0 0 0 0 0 
0 
##$DATE= 1134050951
##$DBL= (0..7)
120 120 120 120 120 120 120 120 
##$DBP= (0..7)
150 150 150 150 150 150 150 150 
##$DBP07= 0
##$DBPNAM0= <>
##$DBPNAM1= <>
##$DBPNAM2= <>
$$ [...]
##$SUBNAM7= <"">
##$SUBNAM8= <"">
##$SUBNAM9= <"">
##$SW= 20.6930455092707
##$SWIBOX= (0..15)
0 0 3 0 0 0 0 0 0 0 0 0 0 0 0 0 
##$SW_h= 5175.983436853
##$TD= 65536
##$TD0= 1
##$TE= 294.16
##$TE2= 300
##$TE3= 300
##$TEG= 300
##$TL= (0..7)
0 120 120 120 120 120 120 120 
##$TP= (0..7)
150 150 150 150 150 150 150 150 
##$TP07= 0
##$TPNAME0= <>
##$TPNAME1= <>
##$TPNAME2= <>
##$TPNAME3= <>
##$TPNAME4= <>
##$TPNAME5= <>
##$TPNAME6= <>
##$TPNAME7= <>
##$TPOAL= (0..7)
0.5 0.5 0.5 0.5 0.5 0.5 0.5 0.5 
##$TPOFFS= (0..7)
0 0 0 0 0 0 0 0 
##$TUNHIN= 0
##$TUNHOUT= 0
##$TUNXOUT= 0
##$USERA1= <user>
##$USERA2= <user>
##$USERA3= <user>
##$USERA4= <user>
##$USERA5= <user>
##$V9= 5
##$VALIST= <valist>
##$VCLIST= <CCCCCCCCCCCCCCC>
##$VD= 0
##$VDLIST= <DDDDDDDDDDDDDDD>
##$VPLIST= <PPPPPPPPPPPPPPP>
##$VTLIST= <TTTTTTTTTTTTTTT>
##$WBST= 1024
##$WBSW= 4
##$XGAIN= (0..3)
0 0 0 0 
##$XL= 0
##$YL= 0
##$YMAX_a= 534477
##$YMIN_a= -396718
##$ZGOPTNS= <>
##$ZL1= 120
##$ZL2= 120
##$ZL3= 120
##$ZL4= 120
##$ABSF1= 16.522
##$ABSF2= -4.171173
##$ABSG= 5
##$ABSL= 3
##$ALPHA= 0
##$AQORDER= 0
##$ASSFAC= 0
##$ASSFACI= 0
##$ASSFACX= 0
##$ASSWID= 0
##$AUNMP= <proc_1d>
##$AZFE= 0.1
##$AZFW= 0.1
##$BCFW= 0
##$BC_mod= 0
##$BYTORDP= 0
##$COROFFS= 0
##$CY= 12.5
##$DATMOD= 1
##$DC= 0
##$DFILT= <>
##$DTYPP= 0
##$F1P= 14.0000005364418
##$F2P= -0.99999901652339
##$FCOR= 0.5
##$FTSIZE= 32768
##$FT_mod= 6
##$GAMMA= 0
##$GB= 0
##$INTBC= 1
##$INTSCL= 1
##$ISEN= 128
##$LB= 0.3
##$LEV0= 0
##$LPBIN= 0
##$MAXI= 10000
##$MC2= 0
##$MEAN= 0
##$ME_mod= 0
##$MI= 0
##$NCOEF= 0
##$NC_proc= -4
##$NLEV= 6
##$NOISF1= 0
##$NOISF2= 0
##$NSP= 0
##$NTH_PI= 0
##$NZP= 0
##$OFFSET= 16.522
##$PC= 1
##$PHC0= 79.43232
##$PHC1= 3.262459
##$PH_mod= 1
##$PKNL= yes
##$PPARMOD= 0
##$PSCAL= 4
##$PSIGN= 0
##$REVERSE= no
##$SF= 250.13
##$SI= 32768
##$SIGF1= 0
##$SIGF2= 0
##$SINO= 400
##$SIOLD= 32768
##$SREGLST= <1H.DMSO>
##$SSB= 0
##$STSI= 32768
##$STSR= 0
##$SW_p= 5175.98343685301
##$SYMM= 0
##$S_DEV= 0
##$TDeff= 65536
##$TDoff= 0
##$TI= <Analysis number 999999
Compound Code 99
Book Reference 9
Project Code 9>
##$TILT= no
##$TM1= 0
##$TM2= 0
##$TOPLEV= 0
##$USERP1= <user>
##$USERP2= <user>
##$USERP3= <user>
##$USERP4= <user>
##$USERP5= <user>
##$WDW= 1
##$XDIM= 32768
##$YMAX_p= 300053755
##$YMIN_p= -331875
$$ End of Bruker specific parameters
$$ ---------------------------------
##NTUPLES= NMR SPECTRUM
##VAR_NAME=  FREQUENCY,     SPECTRUM/REAL,   SPECTRUM/IMAG
##SYMBOL=    X,             R,               I
##VAR_TYPE=  INDEPENDENT,   DEPENDENT,       DEPENDENT
##VAR_FORM=  AFFN,          ASDF,            ASDF
##VAR_DIM=   32768,         32768,           32768
##UNITS=     HZ,            ARBITRARY UNITS, ARBITRARY UNITS
##FACTOR=    0.157963299565203, 1,           1
##FIRST=     4132.6476996994, 0,             0
##LAST=      -1043.33573715361, 0,           0
##MIN=       -1043.33573715361, -331875,     0
##MAX=       4132.6476996994, 300053755,     0
$$ Real data points
##PAGE= N=1
##DATA TABLE= (X++(R..R)), XYDATA
$$ [...]
17480b9889k1445N959j3428j663J6313Q9138K5727l3952N1901q999l3223J815
$$ -29889 -51334 -45375 -58803 -60466 -44153 44985 70712 36760 88661 79662 46439 48254
17468D8254k5023j154j035m9213k6148q4352L9037J6868o7056L7361R3932K4891
$$ 48254 23231 22077 21042 -28171 -54319 -138671 -99634 -82766 -149822 -112461 -18529 6362
17456F362M5108o2938m5975O0780k5536K5298K4452M7001L2174L4842r4618p0068
$$ 6362 51470 -11468 -57443 3337 -22199 3099 27551 74552 106726 141568 46950 -23118
17444b3118m0843n2449n028r842R6301P9889N3672N5506M7852m4264k9787M003
$$ -23118 -63961 -116410 -121438 -131280 -34979 44910 98582 154088 201940 157676 127889 131892
17432A31892n7622P781n8594j01492Q91j5437K0957L169R160N2993n440l4519
$$ 131892 74270 82051 23457 -78035 -77144 -92581 -71624 -68455 -59295 -6302 -11742 -46261
17420d6261j1674L493q923O6055R434o0713q4820J01892Q6385m3775r468O2864
$$ -46261 -57935 -54442 -63365 2690 12124 -48589 -133409 -31517 54868 11093 1625 64489
17408F4489l8831l568L1819L3152l0440j02610l7027O0735J5126O2536J5668L2778
$$ 64489 25658 22090 53909 87061 56621 -45989 -83016 -22281 -7155 55381 71049 103827
17396A03827m0461n9065n5442j0719N6686j1197R608J8513j1536N0446K966m7422
$$ 103827 63366 4301 -51141 -61860 -5174 -16371 -6763 11750 214 50660 53626 6204
17384F204m0166M881K6486r400R1655M754j2735j1970J2528l3257q416J6384q651
$$ 6204 -33962 -29081 -2595 -11995 79660 84414 71679 59709 72237 38980 30564 46948 38297
17371C8297l6929k8283l924Q891Q9482J6414k6105j27823l4550K8566j9890K748
$$ 38297 1368 -26915 -30839 -21948 67534 83948 57843 -69980 -104530 -75964 -95854 -93106
17359i3106L1569j3638J3356o5335K6275O3550M1446k8073L5893Q202o9238j12738
$$ -93106 -61537 -75175 -61819 -127154 -100879 -37329 4117 -23956 11937 20139 -49099 -161837
17347a61837l5837o551L119Q2298K5423K7828J45067Q7333j12621j08227j06370
$$ -161837 -197674 -204225 -201106 -118808 -93385 -65557 79510 166843 54222 -54005 -160375
17336a60375J34981J10018l4320j6661M8275J8707p4136q8928o5240J44328J21892
$$ -160375 -25394 84624 50304 33643 81918 100625 26489 -62439 -127679 16649 138541
17325A38541m1445l4605j6187j0760O9623J3969j14054K2516R6056N3941k5410
$$ 138541 97096 62491 46304 35544 105167 119136 5082 27598 123654 177595 152185
17314A52185l0617q2964n8096K5152R142p195l7196O8888K9714N272j10725o7302
$$ 152185 121568 38604 -19492 5660 14802 7607 -29589 39299 69013 74285 -36440 -103742
17302a03742P3352n401p2229o8009M3573J14840M2046k1958o0789j7404k7784
$$ -103742 -30390 -35791 -108020 -176029 -132456 -17616 24430 2472 -58317 -75721 -103505
17291a03505N0371J2341L8097M9866o7004k6124J5538o0845k551l8927O1083J0394
$$ -103505 -53134 -40793 -2696 47170 -19834 -45958 -30420 -91265 -93816 -132743 -71660 -61266
17279f1266K7788l2552P241J45482M399r2485p9139k898K368K8821k8866j5564
$$ -61266 -33478 -66030 -58789 86693 91092 -1393 -80532 -83430 -81062 -52241 -81107 -96671
17267i6671O9716p828n5594n1845J025N3410Q0174J7245j34796k9227K4224J11608
$$ -96671 -26955 -34783 -90377 -142222 -141197 -87787 -7613 9632 -125164 -154391 -130167 -18559
17255a8559L9529l7002J4497L6612K95L000K8533p714q5673j04712l3273J6575
$$ -18559 20970 -16032 -1535 35077 35372 38372 66905 59191 -26482 -131194 -164467 -147892
17243a47892O0957O1978k8134k1771O4126N2132m8608k2311k0272K7345K0967
$$ -147892 -86935 -24957 -53091 -74862 -10736 41396 -7212 -29523 -49795 -22450 -1483
17232a483N7082l1486j24651k4280J11786O4475R537m3623n6171n8449L1189N5490
$$ -1483 55599 24113 -100538 -124818 -13032 51443 60980 17357 -38814 -97263 -66074 -10584
17220a0584L5260L8551M1686p0591l1293k4167l1550J2258O8335O360O3242J1943
$$ -10584 24676 63227 104913 34322 3029 -21138 -52688 -40430 27905 34265 97507 109450
17208A09450j4270n7414J958R4827P244j01534J4934m9419o9423J2391J04374
$$ 109450 95180 37766 39724 134551 141795 40261 55195 5776 -63647 -51256 53118
17197E3118N2019R9373R689o0013r1967o86J19719j6096q792l546n1426j09481
$$ 53118 105137 204510 214199 154186 62219 61533 181252 165156 156364 152818 101392 -8089
17185h089k0774m5262o6233L804O5110J14504O882j12878l9624J830L2101p7177
$$ -8089 -28863 -74125 -140358 -136554 -71444 43060 49942 -62936 -102560 -100730 -68629 -145806
17173a45806o9592Q8282O7948o7040n2320K027k6444j0629P8901O5624m540k1988
$$ -145806 -215398 -127116 -59168 -126208 -178528 -176501 -202945 -213574 -134673 -69049 -73589 -95577
17161i5577O2508P2870J1409j5040K3612J6204n4420n1798p5795k3443M8385m5661
$$ -95577 -33069 39801 51210 36170 59782 75986 21566 -30232 -106027 -129470 -81085 -126746
17149a26746M946k869K3605K2214L8752J20924K5022l1592k0359q2981p4047j6813
$$ -126746 -121800 -124669 -101064 -78850 -40098 80826 105848 74256 53897 -29084 -103131 -119944
17137a19944K755M7908p2262N802J41910J2483J1247L7198K368p0446q1795n89
$$ -119944 -117189 -69281 -141543 -135741 6169 18652 29899 67097 69465 -981 -82776 -83365
17125h3365J3715r906j2048k4689M45K8132p097N13l784L4032M7855k2675J3983
$$ -83365 -69650 -79556 -91604 -116293 -115848 -87716 -94813 -94300 -98084 -64052 -16197 -38872 -24889
17112b4889p198j1054O8138k4548N44j7737J9504L5209N598k7039O1136J6255
$$ -24889 -32087 -43141 24997 449 993 -16744 2760 37969 43567 16528 77664 93919
17100I3919J9035m352p3966N2909Q9837k4168r4446q0166Q9814k2202q8642n6731
$$ 93919 112954 108602 34636 87545 177382 153214 58768 -21398 68416 46214 -42428 -99159
17088i9159L069o422J22601l9865o1374O2119O4307o2308M3865K3316p6371L5015
$$ -99159 -96090 -102512 20089 -19776 -81150 -19031 45276 -17032 26833 50149 -26222 8793
17076H793k9930n0146K4751Q1614l3919L988J03048Q4935o9689k4063n2465n1698
$$ 8793 -21137 -71283 -46532 35082 1163 5151 108199 193134 123445 99382 46917 -4781
17064d781k3343k6606P6687p6619m7295O9725L8216k4136k3895l0596l6301n9249
$$ -4781 -28124 -54730 21957 -54662 -101957 -32232 5984 -18152 -42047 -72643 -108944 -168193
17052a68193m6489m6487N816R0054M0128j9497n3474J8159P0547O6196K7807O0601
$$ -168193 -214682 -261169 -255353 -165299 -125171 -144668 -198142 -179983 -109436 -43240 -15433 45168
17040D5168K632m4413m1520J5801K05M3775K6490m0464L9294J760n2329k3838
$$ 45168 47800 3387 -38133 -22332 -22127 21648 48138 7674 46968 48728 -3601 -27439
17028b7439J2677l3940K0492L1405j415l285J6960L0176K5168o7733l7103L9434
$$ -27439 -14762 -48702 -28210 3195 1780 -1505 15455 45631 70799 3066 -34037 5397
17016E397L2856k048k0793L5768J0706j7079L5539N0862q5303p1192j9477p853
$$ 5397 38253 36205 15412 51180 61886 44807 80346 131208 45905 -25287 -44764 -52617
17004e2617J2828P0626O8073n5008k4380p1270k0875k050O8814k1110p4809o3779
$$ -52617 -39789 30837 98910 43902 19522 -51748 -72623 -74673 -5859 -26969 -101778 -165557
16992a65557Q3981J54153n1611p9969j4743L0439m320j3550J7121R0475n1403
$$ -165557 -81576 72577 20966 -59003 -73746 -43307 -47627 -61177 -44056 46419 -4984
16981d984j0720O3745L3289J4992k0602K4973j9516j03658l6972K581l5867N744
$$ -4984 -15704 48041 81330 96322 75720 100693 81177 -22481 -59453 -56872 -92739 -86995
16969h6995L4775k3399o1153P0591k8640L8657M6969j8568N0590M8811q5335J092
$$ -86995 -52220 -75619 -136772 -66181 -94821 -56164 -9195 -27763 22827 71638 -13697 -12605
16957a2605O0317j5888k7182j3241o1000p5128M311L814m3299L7513Q4414k1064
$$ -12605 47712 31824 4642 -8599 -69599 -144727 -140416 -136602 -179901 -142388 -57974 -79038
16945g9038p7278m277L0929M3534J00009K8519k420L1229n07k480M9032J6265
$$ -79038 -156316 -160593 -129664 -86130 13879 42398 39978 71207 70700 68220 117252 133517
16933A33517m4496o6921J4156k0672J044j2228K4748l9604M312J1723m3001p1703
$$ 133517 89021 22100 36256 15584 16628 4400 29148 -10456 -6144 5579 -37422 -109125
16921a09125Q8923k8004p3853N6520P5475r5627o8125L1051P7620N4183n145j02507
$$ -109125 -20202 -48206 -122059 -65539 9936 -85691 -153816 -122765 -45145 9038 3893 -98614
16909i8614l2236L6287o691r796l4057l0373Q839N2425Q484M4819j3344M9678
$$ -98614 -130850 -94563 -101254 -111050 -145107 -175480 -166641 -114216 -105732 -60913 -74257 -24579
16897b4579J3009j396m5472j05263l8277N9836P6944M4512o9831j472j1818P6386
$$ -24579 -11570 -12966 -58438 -163701 -201978 -142142 -65198 -20686 -90517 -91989 -103807 -27421
16885b7421M9625n637n5745o2162l0944O1904K3624J8624L9492k5145J3382Q9225
$$ -27421 22204 16567 -39178 -101340 -132284 -70380 -46756 -28132 11360 -13785 -403 88822
16873H8822l3916j4759j3999r7402J5134K9550R93o2998m3561J2122j5310K5344
$$ 88822 54906 40147 26148 -71254 -56120 -26570 -25577 -88575 -132136 -120014 -135324 -109980
16861a09980n7135L0501Q4240R012n2317K5758o532m9593J07242J03852M9260
$$ -109980 -167115 -136614 -52374 -43362 -95679 -69921 -76453 -126046 -18804 85048 134308
16850A34308o0822m2571l3290j9217n1468k0370R9781L1149o7852j8598K3034
$$ 134308 73486 30915 -2375 -21592 -73060 -93430 6351 37500 -30352 -48950 -25916
16839b5916j2390l3382R4922O2522j4804K4193k2911L4026p2261l8593m5596N1702
$$ -25916 -38306 -71688 23234 85756 70952 95145 72234 106260 33999 -4594 -50190 1512
16827A512L1261J1768K9561l1792o2142r9815k4299K3567n821N5247R293j8984
$$ 1512 32773 44541 74102 42310 -19832 -119647 -143946 -120379 -126200 -70953 -61660 -80644
16815h0644K9585j7852j3209L2679m3627j6170l7523J1160L0080M9733O6172o438
$$ -80644 -51059 -68911 -82120 -49441 -93068 -109238 -146761 -135601 -105521 -55788 10384 3946
16803C946K2608n2341N9520M3095p2799r480j6052q5769J3806J0008L9831k4237
$$ 3946 26554 -25787 33733 76828 4029 -5451 -21503 -107272 -93466 -83458 -43627 -67864
16791f7864R956m2066M8227P3210Q9819K4991m355m3008m0760P7933j6820n8896
$$ -67864 -57908 -99974 -51747 21463 111282 136273 131918 88910 48150 126083 109263 50367
16779E0367j3830M0306r1600k8925j5005R803J5339j8875N1479n7348J3467J09415
$$ 50367 36537 76843 -14757 -43682 -58687 -48884 -33545 -52420 -941 -58289 -44822 64593
16767F4593l8616o0239r909k1527q5689j9894O654K4062n8139l7883J14638K2198
$$ 64593 25977 -34262 -44171 -65698 -151387 -171281 -164627 -140565 -198704 -236587 -121949 -99751
16755i9751P4829n2858p1865L597K7837k4957Q723J23611L5241l3789k184J00714
$$ -99751 -24922 -77780 -149645 -146048 -118211 -143168 -134445 -10834 24407 -9382 -11566 89148
16743H9148L676L139j0186r7690k1461L8561k8201l8199l0656P4834m015k2932
$$ 89148 92824 95963 85777 -11913 -33374 5187 -23014 -61213 -91869 -17035 -21050 -43982
16731d3982M1431j3688P6547m275m8596m956m82l589q6073O9404K7252K625l1411
$$ -43982 -2551 -16239 60308 56033 7437 2481 1999 -1590 -87663 -18259 8993 11618 -19793
16718a9793m6586m1833m423L9902Q9781k224j0274Q234O460m173k0998j0067K3532
$$ -19793 -66379 -108212 -112635 -72733 17048 14824 4550 12784 19244 15071 -5927 -15994 7538
16705G538J0125K1989r5370l7157M5382J047J3604j476k3638O4038N9447o280
$$ 7538 17663 39652 -55718 -92875 -47493 -46446 -32842 -34318 -57956 6082 65529 59249
16693E9249Q7498j5022p6725J4027L3904j8318n0113l0559K6098m558j967k2527
$$ 59249 146747 131725 55000 69027 102931 84613 34500 3941 30039 25481 23514 987
16681I87j6191M1982j5587J7784L9888k0727n9386J986l9077p4717K2004P3623
$$ 987 -15204 26778 11191 28975 68863 48136 -11250 -9264 -48341 -123058 -101054 -27431
16669b7431p4104J6861k7491K15J6670n2162L9535L7897N7112n3461l7113n3246
$$ -27431 -101535 -84674 -112165 -111950 -95280 -147442 -107907 -70010 -12898 -66359 -103472 -156718
16657a56718k0186N5495J31042Q2166m208l9905r9695O3504R4107M452k0118l8809
$$ -156718 -176904 -121409 9633 91799 87591 47686 -52009 11495 105602 110054 89936 51127
16645E1127p7535k3921O0998M1586j5184k4912M6226O8918q0636r4261r186M035
$$ 51127 -26408 -50329 10669 52255 37071 12159 58385 127303 46667 -47594 -56780 -52745
16633e2745j6850J4944k7538Q2671P4179M9389n2884l8651k2317J4786l5275N333
$$ -52745 -69595 -54651 -82189 482 74661 124050 71166 32515 10198 24984 -10291 -4958
16621d958J9311L2218M6327N8692o3580k8837n2763j7961O7174K2433n6244j36733
$$ -4958 14353 46571 92898 151590 88010 59173 6410 -11551 55623 78056 21812 -114921
16609a14921J8732K5147k5348n7825J3447J07410l1805k2052O7844J03592L8814
$$ -114921 -96189 -71042 -96390 -154215 -140768 -33358 -65163 -87215 -19371 84221 123035
16598A23035j4134l5227k5406J1190j430o5279k9935K2201R1049J9765k9792m6595
$$ 123035 108901 73674 48268 59458 58028 -7251 -37186 -14985 76064 95829 66037 19442
16586A9442m5528M6487P350l766K079q470J33105O3922j20510m3687l9700n25
$$ 19442 -26086 20401 27751 23985 26064 17594 150699 214621 94111 50424 10724 10199
16574A0199J7768J4638m5502j358K6767P1302L4501m1986j07944m5832J795L5547
$$ 10199 27967 42605 -2897 -4255 22512 93814 128315 86329 -21615 -67447 -65652 -30105
16562c0105Q5268m932k0812p3806o5750K4189L2391K0539K5005K0404J1868n5279
$$ -30105 55163 50231 29419 -44387 -110137 -85948 -53557 -33018 -8013 12391 24259 -31020
16550c1020n5166n985L9967N2073j8074q6441k6845J5763p840J20860M9689j70474
$$ -31020 -86186 -92171 -52204 -131 -18205 -104646 -131491 -115728 -123568 -2708 46981 -123493
16538a23493p4619k5094Q6992L5618M9685R665m7098O2712N1514K1269L7003M5458
$$ -123493 -198112 -223206 -136214 -100596 -50911 -41246 -88344 -25632 25882 47151 84154 129612
16526A29612r2630p8776m3692K8352K4694j3608n7665m3278K0663j2858K0522
$$ 129612 36982 -41794 -85486 -57134 -32440 -46048 -103713 -146991 -126328 -139186 -118664
16515a18664N4712J07493l3300o4299J2158J7908k1885N3305P518n8694j4774
$$ -118664 -63952 43541 10241 -54058 -41900 -23992 -45877 7428 14946 -43748 -58522
16504e8522P9658L9830L1992q4411n307k6410j1881l566m9335L9428N4824J7847
$$ -58522 21136 60966 92958 8547 3240 -23170 -35051 -38617 -87952 -48524 6300 24147
16492B4147j7971k8014K5582L6666q437l7203j9308O5430j6459j3137j9991J2304
$$ 24147 6176 -21838 3744 40410 31973 -5230 -24538 40892 24433 11296 -8695 3609
16480C609O4802Q1096q3676n5899K4468J3576m6336m0266L7845j1721r566q993
$$ 3609 68411 149507 65831 9932 34400 47976 1640 -38626 -781 -12502 -22068 -31061
16468c1061n2163k7541R7836r448l6635J401k121m2316n2907Q7330Q5354k9108
$$ -31061 -83224 -110765 -12929 -22377 -59012 -57611 -59732 -102048 -154955 -67625 17729 -11379
16456a1379O088N0281k6135r6505n0293L6158P0648J2916K7815M7075q612j62600
$$ -11379 -5291 44990 18855 -77650 -127943 -91785 -21137 -8221 19594 66669 58057 -104543
16444a04543m3859J8978M4689k4630K6595J08232K9558o9565m8309J6882O604
$$ -104543 -148402 -129424 -84735 -109365 -82770 25462 55020 -14545 -62854 -45972 -39368
16433c9368M4112j6738K5153K0823j0178l4869J0386j3979Q0524O651k1479p8209
$$ -39368 4744 -11994 13159 33982 23804 -11065 -679 -14658 65866 72517 51038 -27171
16421b7171J1877J7438l4236J3476J6658K4525J18254J4623j6541j12833P087
$$ -27171 -15294 2144 -32092 -18616 -1958 22567 140821 155444 138903 26070 33157
16410C3157k3043m398P3709L5174R950j7404o7218m7324j6923K7671k6511m4292
$$ 33157 10114 5716 79425 114599 124549 107145 39927 -7397 -24320 3351 -23160 -67452
16398f7452L1472m1746p7622k7685n622K7173N0535j5853K2838k761N3017M0344
$$ -67452 -35980 -77726 -155348 -183033 -188655 -161482 -110947 -126800 -103962 -106723 -53706 -13362
16386a3362l4841k2462k2949M673J04939p9684l5490J1229O991O6575N1516o659
$$ -13362 -48203 -70665 -93614 -88941 15998 -63686 -99176 -87947 -80956 -14381 37135 30476
16374C0476r234L9081o5340j3721k2459L7857Q4170k8199j1064j03694k7230J677
$$ 30476 21242 60323 -5017 -18738 -41197 -3340 80830 52631 41567 -62127 -89357 -87680
16362h7680J1701R944N7429n6941p0137L1858M7986M2540l5668N1642K8694J03519
$$ -87680 -75979 -66035 -8606 -65547 -135684 -103826 -55840 -13300 -48968 2674 31368 134887
16350A34887j4763j06524p869N478n1965J4109j3936P5477J9703l2995K559k9665
$$ 134887 120124 13600 5731 11209 -40756 -26647 -40583 34894 54597 21602 24161 -5504
16338e504k8025J3418o2226O6793J7973q0621l9332K2304N9295M9254k1445p1292
$$ -5504 -33529 -20111 -82337 -15544 2429 -78192 -117524 -95220 -35925 13329 -8116 -79408
16326g9408m6878L0809M1536p646K7403l0201m8509L5894Q7716O5110k6010m165
$$ -79408 -126286 -95477 -53941 -61587 -34184 -64385 -112894 -77000 10716 75826 49816 45651
16314D5651p3858ON6665K9574L8992K9777m724K6322k4243j9133p160J3939l6875
$$ 45651 -28207 -28201 28464 58038 97030 126807 122083 148405 124162 105029 97869 111808 74933
16301G4933o3276p6816J7729n8940j0094q943O3066Q1908m5797o010M9881n967
$$ 74933 11657 -65159 -47430 -106370 -116464 -125407 -62341 19567 -26230 -32240 17641 11674
16289A1674m6438n863J1548K6340k3588K0444m2485J5472o9133m3013R2017K2040
$$ 11674 -34764 -40627 -29079 -2739 -26327 -5883 -48368 -32896 -102029 -145042 -53025 -30985
16277c0985k8560j155q315k199l6660l947J8580m486P30J6436n5165L2711P1882
$$ -30985 -59545 -60700 -69015 -71214 -107874 -111821 -93241 -97727 -96997 -80561 -135726 -103015 -31133
16264c1133R3051m6462n8146r9934L62J6149j973K2996J7340N5957l4676o3613
$$ -31133 61918 15456 -42690 -142624 -142262 -126113 -128086 -105090 -87750 -31793 -66469 -130082
16252a30082M9722N9816q1421m8459J0951Q0444K4412l2891l3870l940M8385L9669
$$ -130082 -80360 -20544 -101965 -150424 -139473 -59029 -34617 -67508 -101378 -105318 -56933 -17264
16240a7264o4562L2842o405k1548j7357m6805M0695K1632k7663K973L9504p5545
$$ -17264 -81826 -48984 -55389 -76937 -94294 -141099 -100404 -78772 -106435 -103462 -63958 -139503
16228a39503o253M6519Q5254K7184j8205l5822K5752O416j1802J07605j4059k9987
$$ -139503 -145756 -99237 -13983 13201 -5004 -40826 -15074 -8658 -20460 87145 73086 43099
16216D3099l1515M2414l4886m210k5890M2458L4896k6600k9995p9188o7097O954
$$ 43099 11584 53998 19112 14902 -10988 31470 66366 39766 9771 -69417 -136514 -129560
16204a29560Q5652o170m1478O4045M8993j8691R302P5811j0950p8664j6411K3100
$$ -129560 -43908 -50078 -91556 -27511 21482 2791 12093 87904 76954 -1710 -18121 4979
16192D979n9955o3902J12923M1812p242o9910o7207n863L9315Q0797Q0728K0670
$$ 4979 -54976 -118878 -5955 35857 28615 -41295 -108502 -114365 -75050 5747 86475 107145
16180A07145o6650O416J9327K2947k9269q434L8377n3986j13697N0190K3191o0810
$$ 107145 40495 46911 66238 89185 59916 51482 89859 35873 -77824 -27634 -4443 -65253
16168f5253J2027R9394M9240l1260n5647m236L7653j5244K0104k0391p7839q4333
$$ -65253 -53226 46168 95408 64148 8501 4265 41918 26674 46778 26387 -51452 -135785
16156a35785J3432m2456J0699J05536J9770j6136j6478r8493p444M3290M103R012
$$ -135785 -122353 -164809 -154110 -48574 -28804 -44940 -61418 -159911 -167355 -124065 -119962 -110950
16144a10950p275J7443r6336l0391J08474J30721P4017M9603p0534k1254K3928
$$ -110950 -118225 -100782 -197118 -227509 -119035 11686 85703 135306 64772 43518 67446
16133F7446M1924n4837j09672M7847L8885M689o0259n8406O4242J0833q5097j1404
$$ 67446 109370 54533 -55139 -7292 31593 36282 -23977 -82383 -18141 -7308 -92405 -103809
16121a03809J7893L6361m5033L155O531l2482Q006L0082k9330L0082L6816r3457
$$ -103809 -85916 -49555 -94588 -91433 -84902 -117384 -109378 -79296 -108626 -78544 -41728 -135185
16109a35185j2017R5007Q2168m2307m2138K3415J9054M0541l9696n498L5001l8520
$$ -135185 -147202 -52195 29973 -12334 -54472 -31057 -12003 28538 -11158 -16656 18345 -20175
16097b0175n3207J4871K514J1607r418L5145M7398L4008q3430j12603m1947P8028
$$ -20175 -73382 -58511 -55997 -44390 -53808 -18663 28735 62743 -20687 -133290 -175237 -97209
16085i7209J06182o45n7720k1297K4713j02774N145N3053J04102J3403n7754n1903
$$ -97209 8973 8328 -49392 -70689 -45976 -148750 -143605 -90552 13550 26953 -30801 -82704
16073h2704j7782o3495l3976N7674O4562L1952J0887j073m5974l0605j1488M6914
$$ -82704 -100486 -163981 -197957 -140283 -75721 -43769 -32882 -33955 -79929 -110534 -122022 -75108
16061g5108L0978j4321n0709K4975l9482k6673j014o6718J506J8070O201N9943
$$ -75108 -44130 -58451 -109160 -84185 -123667 -150340 -151354 -218072 -216566 -198496 -192295 -132352
16049a32352K2420K1003o2940M8712L5112J6305m0117L2891J3992j3081N0214
$$ -132352 -109932 -88929 -151869 -103157 -68045 -51740 -91857 -58966 -44974 -58055 -7841
16038g841P077M9526n1907j00030O1507L0181k5409M615J5717K5931o9428l0666
$$ -7841 -764 48762 -3145 -103175 -41668 -11487 -36896 -32281 -16564 9367 -60061 -90727
16026i0727O7407l8566l8217K0836M5394k4417k6354j4630j3088O6159Q8029L8397
$$ -90727 -23320 -61886 -100103 -79267 -33873 -58290 -84644 -99274 -112362 -46203 41826 80223
16014H0223j11282m2670r141J31887Q9757j6436m7168l5600k1811k8302n0751
$$ 80223 -31059 -73729 -82870 49017 138774 122338 75170 39570 17759 -10543 -61294
16003f1294m9951J0034N4630J2946R819j04001k5607N9898K472m557q772P1208
$$ -61294 -111245 -101211 -46581 -33635 -23816 -127817 -153424 -93526 -91054 -95611 -104383 -33175
15991c3175J0873n221n9923K4339N3271m2079N0803M0215O2029k388n066k3750
$$ -33175 -22302 -27523 -87446 -63107 -9836 -51915 -1112 39103 101132 98744 93678 69928
15979F9928j1523J4440L815K6360l8730k9052n6425k2826o6035o4612L3009L9722
$$ 69928 58405 72845 76660 103020 64290 35238 -21187 -44013 -110048 -174660 -141651 -101929
15967a01929J49775N4256j7248n2310n5024K0664j979p728j5232j6945P1092L9411
$$ -101929 47846 102102 84854 32544 -22480 -1816 -3795 -11523 -26755 -43700 27392 66803
15955F6803j10968r4132O0209k0671p362k9044q568K332l814J8706Q398j0413
$$ 66803 -44165 -138297 -78088 -98759 -106121 -135165 -143733 -141401 -145215 -126509 -118111 -128524
15943a28524P333N8091j2923L5537M3684J8967J7324N9379j7603L6778K1334j5390
$$ -128524 -121191 -63100 -76023 -40486 3198 22165 39489 98868 81265 118043 139377 123987
15931A23987p0184l0163j34588o5934M1939l448J01737M3663l1542O240M6638
$$ 123987 53803 23640 -110948 -176882 -134943 -138391 -36654 7009 -24533 -18293 28345
15920B8345R256j07979o126Q3483M1617n6655L8940K0210m0640K1485M9274j14337
$$ 28345 37601 -70378 -76504 6979 48596 -8059 30881 51091 10451 31936 81210 -33127
15908c3127j31382J4571K4750M2353K3820k4655K3536P3460N782r995M0719J6603
$$ -33127 -164509 -149938 -125188 -82835 -59015 -83670 -60134 13326 19108 9113 49832 66435
15896F6435n2374j04151M4893k0277J2290m274p4714k5028N9091P5232m6629J9701
$$ 66435 14061 -90090 -45197 -65474 -53184 -57458 -132172 -157200 -98109 -22877 -69506 -49805
15884d9805O7538M7792k4290k1937k7579M2571N6973k9956j48495n5500J06735
$$ -49805 17733 65525 41235 19298 -8281 34290 91263 61307 -87188 -142688 -35953
15873c5953M5132l9875M6109N20K8348r9548k5144J61062P5410k95n2179l8073
$$ -35953 9179 -30696 15413 15933 44281 -55267 -80411 80651 156061 155766 103587 65514
15861F5514N8468K0255j07516k6347k9279N5749q6136o5417J0411Q3381P7498
$$ 65514 123982 144237 36721 10374 -18905 36844 -49292 -114709 -104298 -20917 56581
15850E6581m602p8242n432J1066l0768o2009L5425J07346K3590J5181o2470K9240
$$ 56581 51979 -26263 -31695 -20629 -51397 -113406 -77981 29365 52955 68136 5666 34906
15838C4906M1588R460o5337o3294j6043K8597k8868k7556p091J2744Q1732L56
$$ 34906 76494 85954 20617 -42677 -58720 -30123 -58991 -86547 -93638 -80894 838 1194
15826A194k8033j02380K7722R0473K8658m2955m4307k6707M296m2k5017l6765
$$ 1194 -26839 -129219 -101497 -11024 17634 -25321 -69628 -96335 -92039 -92081 -117098 -153863
15814a53863k9915J12025Q0080l0938l8468Q3746K8720l8185j0156L5089J9076
$$ -153863 -183778 -71753 8327 -22611 -61079 22667 51387 13202 3046 38135 57211
15803E7211l6697j05N8301j23746r4850K0161M7375j2994j22639N626J25945j5039
$$ 57211 20514 20409 78710 -45036 -139886 -119725 -72350 -85344 -207983 -202357 -76412 -91451
15791i1451L3650J22786r80q370k6295l9337L7626L2659m8716J1997l9977L1971
$$ -91451 -57801 64985 64005 55635 29340 -9997 27629 60288 11572 23569 -16408 15563
15779A5563J07309n7967j2077L5474K5537r5453r1515j9931K5098k3304j00399
$$ 15563 122872 64905 52828 88302 113839 18386 -73129 -93060 -67962 -91266 -191665
15768a91665L1034K3013m3622l2074N1096M8832P20J3122L5396N4157m788l4539
$$ -191665 -160631 -137618 -181240 -213314 -162218 -113386 -112666 -99544 -64148 -9991 -14779 -49318
15756d9318j3302J2078m4709p991k7230l802q192k3549P8983M6633K9029l8036
$$ -49318 -62620 -50542 -95251 -103242 -130472 -134274 -142466 -166015 -87032 -40399 -11370 -49406
15744d9406k9701L2620J1319j9550j5377n9729l2269J10318J1546l8520m7797
$$ -49406 -79107 -46487 -35168 -54718 -70095 -129824 -162093 -51775 -40229 -78749 -126546
15733a26546J9741m974J09201L7002o6320r0105m7426N6940P2259M1533o6164
$$ -126546 -106805 -111779 -2578 34424 -31896 -122001 -169427 -112487 -40228 1305 -64859
15722f4859l9395N0431K9808j9530k6323l7695O6865M1894M8464K5575j0943j08521
$$ -64859 -104254 -53823 -24015 -43545 -69868 -107563 -40698 1196 49660 75235 64292 -44229
15710d4229l3392j3678q3726K2049O9233o4169l2746p406J5243O3760O4008N34
$$ -44229 -77621 -91299 -175025 -152976 -83743 -147912 -180658 -188064 -172821 -109061 -45053 -44519
15698d4519J744J0953J3536p8012l233M8646Q5973k8364k2437l8828n7793J6266
$$ -44519 -42775 -31822 -18286 -96298 -99531 -50885 35088 6724 -15713 -54541 -112334 -96068
15686i6068J0063N5739J2087L2507q135n0762O1101l8307m8118P5348R1356N364
$$ -96068 -86005 -30266 -18179 14328 6193 -44569 16532 -21775 -69893 5455 96811 102175
15674A02175k8382m9802l9869p4541r743O2232L3818J7008J4017k95m5126m2580
$$ 102175 73793 23991 -15878 -90419 -100162 -37930 -4112 12896 26913 26618 -18508 -61088
15662f1088p638P4375j775M6774n0695r3844M457Q7213K9021N7074K2447n0995
$$ -61088 -68726 5649 3874 50648 -47 -93891 -89434 -2221 26800 83874 106321 55326
15650E5326m8932m6797j4750k2872J3842P7196P3707N2875k2435o8075q7484n6673
$$ 55326 6394 -40403 -55153 -78025 -64183 13013 86720 139595 117160 49085 -38399 -95072
15638i5072l1906Q3864R658n3344j2519o574L4647O9429m3313l1430j3480R0817
$$ -95072 -126978 -43114 -33456 -86800 -99319 -105893 -71246 -1817 -45130 -76560 -90040 777
15626G77L7873m0544J590j29868k6493J23278l110j5127O814p3753M3836M0829
$$ 777 38650 -1894 -304 -130172 -156665 -33387 -36497 -51624 -44810 -118563 -74727 -33898
15614c3898n7364l6327L5142j5624J3140N2807K6361N211Q824k1949K1367N6317
$$ -33898 -91262 -127589 -92447 -108071 -94931 -42124 -15763 -10552 -1728 -23677 -2310 54007
15602E4007o8625j9892O331J2146m726l6935m1129l5472R93M2272J2363k8162
$$ 54007 -14618 -34510 -28179 -16033 -20759 -57694 -98823 -134295 -133302 -91030 -78667 -106829
15590a06829K4472P9J5389K2705M8065o044M6933J7359n9479q9664m608O0671
$$ -106829 -82357 -82278 -66889 -44184 3881 -2163 44770 62129 2650 -87014 -91622 -30951
15578c0951j5221P0340o0295m2557L0293k53J3617m7066K6966l2611o2917K5849
$$ -30951 -46172 24168 -36127 -78684 -48391 -48644 -35027 -82093 -55127 -87738 -150655 -124806
15566a24806q2840L8649O9440o3086M9154L2277l5031j0923L0107O8110M9429
$$ -124806 -207646 -168997 -99557 -162643 -113489 -81212 -116243 -127166 -97059 -28949 20480
15555B0480n4764n4155l1229m9787N0088L9314n6403N267J4588M0726K9502J8741
$$ 20480 -34284 -88439 -119668 -169455 -119367 -80053 -136456 -131189 -116601 -75875 -46373 -27632
15543b7632L2218J4799J1785k3404J2678K6201R079m3786j8313O296l3383P311
$$ -27632 4586 19385 31170 7766 20444 46645 55724 11938 -6375 -79 -33462 -26151
15531b6151P565J8857l854m6296n8952J3603j10509M0909M4681L5199R096m3600
$$ -26151 -18586 271 -3583 -49879 -108831 -95228 -205737 -164828 -120147 -84948 -75852 -119452
15519a19452P8581O7209m3627o3709p4571m2128J14549O9471j0169j871j3239
$$ -119452 -40871 26338 -17289 -80998 -155569 -197697 -83148 -13677 -23846 -25717 -38956
15508c8956k2005K2346O329L6067K1360o7770o2567L0819R8094M5032M3525J0245
$$ -38956 -60961 -38615 -32286 3781 25141 -42629 -105196 -74377 23717 68749 112274 122519
15496A22519J5039o6255k7316m7133M4316Q2669o6133n34Q878O859L2354k8663
$$ 122519 137558 71303 43987 -3146 41170 123839 57706 57172 66050 72909 105263 76600
15484G6600r4734k9120J8163K8043O0506K1881j9743n3171K5292j7132n37l9839
$$ 76600 -18134 -47254 -29091 -1048 59458 81339 61596 8425 33717 16585 16048 -23791
15472b3791m5000M4151Q2809r186k4235o9701k4739m1638N718O0239q2073r0046
$$ -23791 -68791 -24640 58169 48983 24748 -44953 -69692 -111330 -105612 -45373 -127446 -217492
15460b17492P4850Q5199J0271O3970Q486P6217Q3039k0876q6646M7112J7861r0658
$$ -217492 -142642 -57443 -47172 16798 25284 101501 184540 163664 77018 124130 141991 51333
15448E1333j23770N253q0038j1218Q4839L7517M6786j5398n5939L291M0932N5468
$$ 51333 -72437 -67184 -147222 -158440 -73601 -36084 10702 -4696 -60635 -57344 -16412 39056
15436C9056L1823k5879m6707O031L8473N5792n3057j39391j3408P0942J823L9117
$$ 39056 70879 45000 -1707 4324 42797 98589 45532 -93859 -107267 -36325 -34502 4615
15424D615P4311l6507P291k4271n2211M4752l0664k0335J9702O9626m0824l2424
$$ 4615 78926 42419 49710 25439 -26772 17980 -12684 -33019 -13317 56309 15485 -16939
15412a6939J9793J614l8457L008N1653J801n1785q2319n7708O6107J3081L0587
$$ -16939 2854 4468 -33989 -30981 20672 22473 -29312 -111631 -169339 -103232 -90151 -59564
15400e9564Q3237k7335p9494J3075j0616r04n568j6482L1439q9L7633m5220k7930
$$ -59564 23673 -3662 -83156 -70081 -80697 -81601 -87169 -103651 -72212 -72301 -34668 -79888 -107818
15387a07818Q338M5079J48621L0988l5234j761j890l2506p5113L0385R2079L1469
$$ -107818 -99480 -54401 94220 125208 89974 88213 86323 53817 -21296 9089 101168 132637
15375A32637n3176j03391j503K7662j17805o2314J32444R4718N3640q5505r9455
$$ 132637 79461 -23930 -25433 2229 -115576 -177890 -45446 49272 102912 17407 -82048
15364h2048N411L098L6674L3642Q661q383N7082p411K2759l7879j06084J0093
$$ -82048 -76637 -73539 -36865 -3223 5438 -2945 54137 46726 69485 31606 -74478 -64385
15352f4385J01035L0691L691m9170j62752M1932M9999k7915o8809k5481Q135J04112
$$ -64385 36650 67341 71032 21862 -140890 -98958 -48959 -76874 -145683 -171164 -163029 -58917
15340e8917N8432m1163o9245Q5736L1860K284K9882q529l512J8661m9416K4490
$$ -58917 -485 -41648 -110893 -25157 6703 8987 38869 30340 26828 45489 -3927 20563
15328B0563m15k1779j0006p5156l9220j7381K7788P5130j671m8701M2005O983
$$ 20563 20148 -1631 -11637 -86793 -126013 -143394 -115606 -40476 -42147 -90848 -48843 -41860
15316d1860O1909k3404N2193O3181J3986o6553n1440o2720j2323K7540L469P185
$$ -41860 20049 -3355 48838 112019 126005 59452 8012 -54708 -67031 -39491 -36022 -28837
15304b8837N5683j7693m8322k8310L0172O5224k054l7471Q3951k8241n3988o9513
$$ -28837 26846 9153 -39169 -67479 -37307 27917 25863 -11608 72343 44102 -9886 -79399
15292g9399j694p012J9166M659l4762M1686j0692j689M9608J02082n999j5687
$$ -79399 -81093 -88105 -68939 -64280 -99042 -57356 -68048 -69737 -20129 81953 75954 60267
15280F0267L9729m8382j40463j0460P497N8178O249K1960M6516n0032k1203l7946
$$ 60267 99996 51614 -88849 -99309 -91812 -33634 -27385 -5425 41091 -8941 -30144 -68090
15268f8090K0582K4022P3375O6746j3099k2593M4808O5878q5660m5399N0004j02061
$$ -68090 -47508 -23486 49889 116635 103536 80943 125751 191629 105969 60570 110574 8513
15256H513n6400Q3249J6476j2361n8123J4157k8067p7255o4442J4602M3738J1105
$$ 8513 -47887 35362 51838 39477 -18646 -4489 -32556 -109811 -174253 -159651 -115913 -104808
15244a04808L9003P2461l9700n412J5787P3868P6261p20p6481l9358q1658p4431
$$ -104808 -65805 6656 -33044 -38456 -22669 51199 127460 126740 50259 10901 -70757 -145188
15232a45188q9029K7724R1590R3520M3722n2549J9759J6091l2849o1117l8517
$$ -145188 -234217 -206493 -114903 -21383 22339 -30210 -10451 5640 -27209 -88326 -126843
15221a26843k5133Q475M2720L3556k4754m8296n7077k9105N0371O9748P6397N8569
$$ -126843 -151976 -143501 -100781 -67225 -91979 -140275 -197352 -226457 -176086 -106338 -29941 28628
15209B8628N3156k1187r9745K5513r430r8814L2882P8057J6899J8936k2583l684
$$ 28628 81784 60597 -39148 -13635 -23065 -121879 -88997 -10940 5959 24895 2312 -1372
15197a372O6012k8918q9512O9963O3430K1787p8417k7753L607J2639j6139p3519
$$ -1372 64640 35722 -53790 16173 79603 101390 22973 -4780 -1173 11466 -4673 -78192
15185g8192j9507l221j744L8513J27752k0900L1578l4283k807m0261j4495L6575
$$ -78192 -97699 -100920 -102664 -64151 63601 42701 74279 39996 37189 -3072 -17567 19008
15173A9008r138J0538O0611K2809p0148j5824J16457j214j6998p3744n9715q114
$$ 19008 9870 20408 81019 103828 33680 17856 134313 133099 116101 42357 -17358 -25472
15161b5472j7329k8050l5810J0970J48041P5164o2554o8766M1234J5932n466r1322
$$ -25472 -42801 -70851 -106661 -95691 52350 127514 64960 -3806 37428 53360 47894 -43428
15149d3428n9624R919Q8442L982M9890p948n5961J6110M8394j1963p1456n1493
$$ -43428 -103052 -93133 -4691 -709 49181 41233 -14728 1382 49776 37813 -33643 -85136
15137h5136L9151L6318M9541q5015l6889l7188K2267L6696k9633K8377m3029k9035
$$ -85136 -45985 -9667 39874 -45141 -82030 -119218 -96951 -60255 -89888 -61511 -104540 -133575
15125a33575K7926K9502M2298q810l8804l4117N8237K3359M5913j0670N185R0577
$$ -133575 -105649 -76147 -33849 -42659 -81463 -115580 -57343 -33984 11929 1259 6444 97021
15113I7021M8674n1321m1210q6255l1497r6612M6768Q1889n3298n475J6412n0234
$$ 97021 145695 94374 53164 -33091 -64588 -161200 -114432 -32543 -85841 -91316 -74904 -125138
15101a25138k5073P8811J7127k1839L712l4254l0470j7707K9189K6926M6431N2321
$$ -125138 -150211 -71400 -54273 -76112 -72400 -106654 -137124 -154831 -125642 -98716 -52285 36
15089C6O1055L3885l7749l6436l0744j5097p712N330L8872J756j3299l3335p793
$$ 36 61091 94976 57227 20791 -9953 -25050 -32762 -27432 11440 13196 -103 -33438 -41231
15076d1231l5837n2380j6491N4933L3107L1225m461l3071M6826j0645O2932K4238
$$ -41231 -77068 -129448 -145939 -91006 -57899 -26674 -31135 -64206 -17380 -28025 34907 59145
15064E9145j14056n1970J2536M4199L4279m4391l6973J7838M4447j6852l37M6389
$$ 59145 -54911 -106881 -94345 -50146 -15867 -60258 -97231 -79393 -34946 -51798 -52135 -5746
15052e746J04264N0208p5177n4681l91N4272L2931K983q4605j58168n8579L3655
$$ -5746 98518 148726 73549 18868 18477 72749 105680 108663 24058 -134110 -192689 -159034
15040a59034J25856L7072p945p6825N3328O6163p718Q9951M025o0428l6511l5195
$$ -159034 -33178 3894 -4051 -80876 -27548 38615 30897 120848 124873 64445 27934 -7261
15028g261R474p1879j9547L3267O5515O7479j2945n3477M7347q0094j08512O8751
$$ -7261 2213 -69666 -89213 -55946 9569 77048 64103 10626 57973 -22121 -130633 -61882
15016f1882j0211k6965o99K345l9915l744J9105P410N806j04169Q4594Q2799J9806
$$ -61882 -72093 -99058 -99757 -97412 -137327 -141071 -121966 -114556 -108750 -212919 -128325 -45526 -25720
15003b5720R8284m5688q7896k2982R467N0682R025M2534q1556o8930m7328l2918
$$ -25720 72564 26876 -61020 -84002 -74535 -23853 -14828 27706 -53850 -122780 -170108 -203026
14991b03026M7908M6886L4074m7864L7712J1940O3599J7951m6817m305L247J1060
$$ -203026 -155118 -108232 -74158 -122022 -84310 -72370 -8771 9180 -37637 -41942 -38695 -27635
14979b7635M9471k1061K8040N7207p107l2493O4721p7491p588L8858r5761J1650
$$ -27635 21836 775 28815 86022 78915 46422 111143 33652 26064 64922 -30839 -19189
14967a9189M0983m2716n6483l7015M7409J21658K1830J7291J2489N7690o7232
$$ -19189 21794 -20922 -77405 -114420 -67011 54647 76477 93768 106257 163947 96715
14956I6715j236q1725n5211J0008L3687j0886k1357k9186L9882J10964k7910j9613
$$ 96715 95479 13754 -41457 -31449 2238 -8648 -30005 -59191 -19309 91655 63745 44132
14944D4132p2334m0306J9006J2750K1525M8983j3989p698q0508n9191r4564l6453
$$ 44132 -28202 -68508 -49502 -36752 -15227 33756 19767 12069 -68439 -127630 -222194 -258647
14932b58647J3223R4838P856m1443M7803P2150j7997R364o607n4315P9397M6470
$$ -258647 -245424 -150586 -142730 -184173 -136370 -64220 -82217 -72853 -79460 -133775 -54378 -7908
14920g908l540l4691j06413j6165L1693j2960p587J02357O7339M535N6667N59
$$ -7908 -11448 -46139 -152552 -168717 -137024 -149984 -157571 -55214 12125 16660 73327 73886
14908G3886r6709l9205o4379k9442M4783O0668j0981j3894J3751q4427n9110k7893
$$ 73886 -22823 -62028 -126407 -155849 -111066 -50398 -61379 -75273 -61522 -145949 -205059 -232952
14896b32952J01215J17705K5851p3619k4729J7604Q7912N9764l9465l8047p3581
$$ -232952 -131737 -14032 11819 -61800 -86529 -68925 18987 78751 39286 1239 -72342
14885g2342j8754m0437J8720M3716j0694O2174l6892Q6964N5576m6100L6462P4395
$$ -72342 -91096 -131533 -112813 -69097 -79791 -17617 -54509 32455 88031 41931 78393 152788
14873A52788k0345j4001l2676o0980p5667P855K068k4152L3227M147L5860P4966
$$ 152788 132443 118442 85766 24786 -50881 -43026 -40958 -65110 -31883 -27736 8124 83090
14861H3090j02708k6106Q5M8112L050l3580L3974m3106j3592p562J1269P9844
$$ 83090 -19618 -45724 -45639 2473 5523 -28057 5917 -37189 -50781 -58343 -47074 32770
14849C2770L226K7630K4050o2338m0706Q528o2271j25303J7782J26519J10928
$$ 32770 35996 63626 87676 25338 -15368 -6840 -69111 -194414 -176632 -50113 60815
14838F0815k1943p8014m3950j0928M2255M6284O0659m1954m9695K1009j4555l60
$$ 60815 38872 -39142 -83092 -94020 -51765 -5481 55178 13224 -36471 -15462 -30017 -30377
14826c0377o0585n5827P3923K1932j11750l4470L7359M2273J02336M7614K4891
$$ -30377 -90962 -146789 -72866 -50934 -162684 -197154 -159795 -117522 -15186 32428 57319
14815E7319r3260j49573n0053J09952J03627J9637N7517l8113j5961k2631n3370
$$ 57319 -35941 -185514 -235567 -125615 -21988 -2351 55166 17053 1092 -21539 -74909
14804g4909J4903l627L221p7175J9262M0576K9874L8816m2833n7933K2886J8477
$$ -74909 -60006 -63633 -60412 -137587 -118325 -77749 -47875 -9059 -51892 -109825 -86939 -68462
14792f8462K1443n1312O923K666Q6884K5183j0129k6211N292j2515o958J7749
$$ -68462 -47019 -98331 -91408 -88742 -1858 23325 13196 -13015 -7723 -20238 -27196 -9447
14780i447l4224n0487M7483L1811J00912k0180j92720m2391P1846N9737L093q482
$$ -9447 -43671 -94158 -46675 -14864 86048 65868 -126852 -169243 -97397 -37660 -34567 -43049
14768d3049l7877o603R4258M320L7879l4661R658R2651M0011m4634o3010k0983
$$ -43049 -80926 -87529 6729 11049 48928 14267 23925 116576 156587 111953 48943 27960
14756B7960j147m2238Qj1306m5959K5984O518P3515O4331j8135q7444k6508M2768
$$ 27960 26813 -15425 -15417 -26723 -72682 -46698 -40180 33335 97666 79531 -7913 -34421 8347
14743H347N0043o5343p1278J785L7014K5338L630o7139k4662j4198j923q6722
$$ 8347 58390 -6953 -78231 -76446 -39432 -14094 -10464 -77603 -102265 -116463 -118386 -205108
14731b05108k0633n2634K2317P9174N1154j3327j178L7544n1860j7839r57L5608
$$ -205108 -225741 -278375 -256058 -176884 -125730 -139057 -140235 -102691 -154551 -172390 -173347 -137739
14719a37739J3510N9041M014m8509L601O4434q6880l5669J4747R4518J4768m650
$$ -137739 -124229 -65188 -61174 -109683 -106082 -41648 -128528 -164197 -149450 -54932 -40164 -44814
14707d4814L5172j6316n2909k7464O8966P0820L9802p0141n3541K1390L7298n7604
$$ -44814 -9642 -25958 -78867 -106331 -37365 33455 73257 3116 -50425 -29035 8263 -49341
14695d9341J6230L4751M4857K7013k0107j5101J6113P450k7752J0769J3981J017
$$ -49341 -33111 1640 46497 73510 53403 38302 54415 61865 34113 44882 58863 59880
14683E9880l5477j6585r1814n4475L146J9057O3138J41206n1663o1997P136m5412
$$ 59880 24403 7818 -83996 -138471 -135325 -116268 -53130 88076 36413 -25584 -18448 -63860
14671f3860j4906o131L5371K487R410N8472M9403L5620P0385l7710l511j7164
$$ -63860 -78766 -84897 -49526 -47039 -37629 20843 70246 105866 176251 138541 135030 117866
14659A17866q1393n3509j4828L2918k8725j11L1699O265l1027p4531p0982M4706
$$ 117866 36473 -17036 -31864 1054 -27671 -27782 3917 10182 -20845 -95376 -166358 -121652
14647a21652P5076N8695j3010n7746K1556Q346m3216j0524Q3537J27357j00562
$$ -121652 -46576 12119 -891 -58637 -37081 -28735 -71951 -82475 1062 128419 27857
14636B7857j10825K2967J20473n6681p3047j2750P4092J13338P5389n88n3440
$$ 27857 -82968 -60001 60472 3791 -69256 -82006 -7914 105424 180813 180225 126785
14625A26785q0367k0658n2149p9263n1140Q5545Q3608k7900j3761N6288R1087
$$ 126785 46418 25760 -26389 -105652 -156792 -71247 12361 -15539 -29300 26988 118075
14614A18075j372K7091l1540l3661k0493k7275r5559Q584k381l9973J8367K3088
$$ 118075 116703 143794 112254 78593 58100 30825 -64734 -56150 -58531 -98504 -80137 -57049
14602e7049l1281Q625J4245O6232p0613k8619j230K823N7690O1986n334q396p6157
$$ -57049 -88330 -79705 -65460 772 -69841 -98460 -99690 -96867 -39177 22809 17475 9079 -67078
14589f7078J7676J9380m2493m0433L2007p445j0766N2551l0061k9380M9269m3616
$$ -67078 -49402 -30022 -72515 -112948 -80941 -88386 -99152 -46601 -76662 -106042 -56773 -100389
14577a00389k5195p357o5900k6278P5996M5520L1244R8963J6106K6316m8270j3189
$$ -100389 -125584 -132941 -198841 -225119 -149123 -103603 -72359 26604 42710 69026 20756 7567
14565G567K0854K2776j6330j9800k6878n3251j6364L8523L6600k3961J011j4465
$$ 7567 28421 51197 34867 15067 -11811 -65062 -81426 -42903 -6303 -30264 -29253 -43718
14553d3718K3766l0331J2769j9050N18J809J6617l2237K6818N364k744L3881m5826
$$ -43718 -19952 -50283 -37514 -56564 -56046 -54237 -37620 -69857 -43039 -37675 -40419 -6538 -52364
14540e2364o5013o7488l3692N9174Q3512k620j3685O0992O9853m1478k2696p5060
$$ -52364 -117377 -184865 -218557 -159383 -75871 -78491 -92176 -31184 38669 -2809 -25505 -100565
14528a00565n7104J3549N8488R8437m3898j24868j3012p236N8637Q1232p6364
$$ -100565 -157669 -144120 -85632 12805 -31093 -155961 -168973 -176209 -117572 -36340 -112704
14517a12704j9551l71J27290Q9618o9127j9336m2707P8603K1795L7217j5135k5160
$$ -112704 -132255 -132626 -5336 84282 15155 -4181 -46888 31715 53510 90727 75592 50432
14505E0432q4335o331O3489l7849J5061J0485p296P620l3219l5551J3984J0093
$$ 50432 -33903 -40234 23255 -14594 467 10952 3656 11276 -21943 -57494 -43510 -33417
14493c3417j4913q290j548p392K5577L7480j4349M5551J03785M0028k0730l9963
$$ -33417 -48330 -56620 -58168 -65560 -39983 -2503 -16852 28699 132484 172512 151782 111819
14481A11819p269m2160r1758o7581P8225K3498l6119J0020Q835k3278p385N5527
$$ 111819 104550 62390 -29368 -96949 -18724 4774 -31345 -21325 -12490 -35768 -43153 12374
14469A2374n139m2047k7153J475K3755J03520K4156m7724l7677m6155k4373Q2508
$$ 12374 7235 -34812 -61965 -60490 -36735 66785 90941 43217 5540 -40615 -64988 17520
14457A7520N3040j7004p1701O6132J3206q7221K8666K5621l8933o2998p7300j4659
$$ 17520 70560 53556 -18145 47987 61193 -26028 2638 28259 -10674 -73672 -150972 -165631
14445a65631R488J1899L0474K836P7297L8669j0192R798R989L7117o1809n9377
$$ -165631 -156143 -144244 -113770 -110934 -33637 5032 -5160 4638 14627 51744 -10065 -69442
14433f9442Q4857n0255K7626j3633n1161J9403N9367O7138j0608k6748p4537J7307
$$ -69442 15415 -34840 -7214 -20847 -72008 -52605 6762 73900 63292 36544 -37993 -20686
14421b0686N9108k4333o7213M3952k3173k9083L9445L5531k165k032k3958j21823
$$ -20686 38422 14089 -53124 -9172 -32345 -61428 -21983 13548 11383 9351 -14607 -136430
14409a36430p9071N7728J2207k8920M6303P6782L9798l0863j03664m0980R1675
$$ -136430 -215501 -157773 -145566 -174486 -128183 -51401 -11603 -42466 -146130 -187110 -95435
14398i5435J36057N8852J1459q505n8198J1270m6007n2941L5128n1253l7253m7958
$$ -95435 40622 99474 110933 102428 44230 55500 9493 -43448 -8320 -59573 -96826 -144784
14386a44784J5504l7950K3300L0358J3177K5213k3468k2037P20k4527R2820J5341
$$ -144784 -129280 -167230 -143930 -113572 -100395 -75182 -98650 -120687 -119967 -144494 -51674 -36333
14374c6333M7594P376p3845J5464m1009j9668N0407k1499k9824Q8582N130L2212
$$ -36333 11261 18637 -55208 -39744 -80753 -100421 -50014 -71513 -101337 -12755 -7625 24587
14362B4587L7794q8842l1650K259O6454O8375K6217P4313J1103K130m8347m3056
$$ 24587 62381 -26461 -58111 -55852 10602 78977 105194 179507 190610 192740 144393 101337
14350A01337L7140L608j8536J847j21257l6915L2081J6079m6386M7753n1205o7875
$$ 101337 138477 142085 123549 125396 4139 -32776 -695 15384 -31002 16751 -34454 -102329
14338a02329j4573K4531k0167K4752O2724J2172k8813k1613R913l5028q5220j7215
$$ -102329 -116902 -92371 -112538 -87786 -25062 -12890 -41703 -63316 -53403 -88431 -173651 -190866
14326a90866K3596n5362j2896J15484j7533p033J9450K5540J1376P4953K7939
$$ -190866 -167270 -222632 -235528 -120044 -137577 -144610 -125160 -99620 -88244 -13291 14648
14315A4648M2880O1355M074r163l1635l4616n9340J5136J9901q888J1785m1780
$$ 14648 57528 118883 122957 113794 82159 47543 -11797 3339 23240 14352 26137 -15643
14303a5643n0069o4895o4913p0586O553N1826R2122P9063m247Q1996o5774p2443
$$ -15643 -65712 -130607 -195520 -266106 -259553 -207727 -115605 -36542 -40789 41207 -24567 -97010
14291i7010j4454M9359j03352L0941N7088P0053N6480M0834o2543k5720J2220
$$ -97010 -111464 -62105 -165457 -134516 -77428 -7375 49105 89939 27396 1676 13896
14280A3896R8829K4684r7389l1907m5336p1598R8594j0022k869J1870L4062o0783
$$ 13896 112725 137409 40020 8113 -37223 -108821 -10227 -20249 -23118 -11248 22814 -37969
14268c7969l4001l0163L0486O4946p28l3833P84l5031k1073k7305o2001O4288
$$ -37969 -71970 -102133 -71647 -6701 -7429 -41262 -40478 -75509 -96582 -123887 -185888 -121600
14256a21600M4036M8376P6496J2801r9296q0524R008o005n448K9833J2085N5172
$$ -121600 -77564 -29188 47308 60109 -39187 -119711 -110703 -116708 -122156 -92323 -80238 -25066
14244b5066M0347l4560n8760M6519J0731J9170j551L4285J7288q2976m6284P8099
$$ -25066 15281 -19279 -78039 -31520 -20789 -1619 -3170 31115 48403 -34573 -80857 -2758
14232b758L1077k2994L9130m1668k5048r5819o8629j3267L7228M9687l7630L1418
$$ -2758 28319 5325 44455 2787 -22261 -118080 -186709 -199976 -162748 -113061 -150691 -119273
14220a19273K102K1712j9579K4315L7945K2348N7075K3929l9064r3371k4064J6594
$$ -119273 -117171 -95459 -115038 -90723 -52778 -30430 26645 50574 11510 -81861 -105925 -89331
14208h9331L6329J1520l126L5572R1019n7165n9119j1757O4984N604J1422N0728
$$ -89331 -53002 -41482 -44608 -9036 81983 24818 -34301 -46058 18926 24530 35952 86680
14196H6680K1362k828j2571J726K1051p6224L4384N7733j5067K8381j01650o8646
$$ 86680 108042 105214 92643 94369 115420 39196 73580 131313 116246 144627 42977 -25669
14184b5669l593R1299l0085p4966r1510R941O6375L3547m4725n5266j00857O4342
$$ -25669 -29262 62037 31952 -43014 -134524 -124583 -58208 -24661 -69386 -124652 -225509 -161167
14172a61167K2693L5871J6917J1859k7940p0406M5821M3430n8530j0407J05893
$$ -161167 -138474 -102603 -85686 -73827 -101767 -172173 -126352 -82922 -141452 -151859 -45966
14161d5966R1408J0513j7249k4050j3297n084K5809N913j11203m508J569k4583
$$ -45966 45442 55955 38706 14656 1359 -3725 22084 27997 -83206 -87714 -86145 -110728
14149a10728M0625L5012K0883L6029N4193L9665j9982k1375J9459j45094j10307
$$ -110728 -70103 -35091 -14208 21821 76014 115679 95697 74322 93781 -51313 -161620
14138a61620l031J04025J2808k4248j06919m5071M3209J15725K4431M153m4991
$$ -161620 -164651 -60626 -47818 -72066 -178985 -224056 -180847 -65122 -40691 -36538 -81529
14127h1529O9807Q5453j6318o623m9318J6952l7720k1255j0379l4376l3872J5494
$$ -81529 -11722 73731 57413 50790 1472 18424 -19296 -40551 -50930 -85306 -119178 -103684
14115a03684N0615P1149R817j14313m4276j27885J1666J35175M6861r5463J5854
$$ -103684 -53069 18080 27897 -86416 -130692 -258577 -246911 -111736 -64875 -160338 -144484
14104a44484L9508m3829q6043m504N1385O8118j8004J1583R066M2793J3183k5057
$$ -144484 -104976 -148805 -234848 -239352 -187967 -119849 -137853 -126270 -117204 -74411 -61228 -86285
14092h6285L2437j1600p50l7215k5566m5825m7853K69Q0363O1849M60M7942q458
$$ -86285 -53848 -65448 -66198 -103413 -128979 -174804 -222657 -222388 -142025 -80176 -79716 -31774 -40232
14079d0232j18554n4800M5685P1062K3852O9986J2277J22037K812m5675j9339
$$ -40232 -158786 -213586 -167901 -96839 -72987 -3001 9276 131313 134125 88450 69111
14068F9111j6156q869j3904q1330r53N6218n5503o8437k0810m4770J5071l7105
$$ 69111 52955 44086 30182 -51148 -52101 4117 -51386 -119823 -140633 -185403 -170332 -207437
14056b07437N8764j6137L4032N3114l3714q6787L7520J09239Q4814n937N2133
$$ -207437 -148673 -164810 -130778 -77664 -111378 -198165 -160645 -51406 33408 27471 79604
14045G9604K0066j49461m6250N2453K6886j9521l2391r817n467L2293R4213J0248
$$ 79604 99670 -49791 -96041 -43588 -16702 -36223 -68614 -78431 -83898 -51605 42608 52856
14033E2856p2188k4442N5639N0099l577k6651M1770r150M797r110n6452n3374
$$ 52856 -19332 -43774 11865 61964 58387 31736 73506 64356 69153 60043 3591 -49783
14021d9783p28j2481K8620Q0686q1246P169M1337m5082J3116o314P717l359r8909
$$ -49783 -50511 -62992 -34372 46314 -34932 -27763 13574 -31508 -18392 -24706 -16989 -20348 -119257
14008a19257K9569R9073k4445K0276J82M7449j4313k1810k2871j4093l2352k2898
$$ -119257 -89688 9385 -15060 5216 5398 52847 38534 16724 -6147 -20240 -52592 -75490
13996g5490M3542M0971K2703M6257L3406j5397j3577k8496m0816k3366j6517Q6631
$$ -75490 -31948 9023 31726 77983 111389 95992 82415 53919 13103 -10263 -26780 59851
13984E9851k1615l0282M058k0212L706j1647j4441K4727L3887j3526l2563r945
$$ 59851 38236 7954 12012 -8200 -4494 -16141 -30582 -5855 28032 14506 -18057 -28002
13972b8002o8098l3484L8149o8859L479J45452M9822o4729K690n6778R3034l0460
$$ -28002 -96100 -129584 -91435 -160294 -156815 -11363 38459 -26270 -23580 -80358 12676 -17784
13960a7784k6793J884l8520J8196O470k2201L143j8810q5895K5893j7711M0296
$$ -17784 -44577 -42693 -81213 -63017 -56547 -78748 -75605 -94415 -180310 -154417 -172128 -131832
13948a31832P3826m690N1660L8536K1046n5885r0153l1609o2988L7994P8931P2605
$$ -131832 -58006 -62696 -11036 27500 48546 -7339 -97492 -129101 -192089 -154095 -75164 -2559
13936b559j7168p4959P4086M7008O186p3942j7088m2302m5102L1265O9740J2526
$$ -2559 -19727 -94686 -20600 26408 32594 -41348 -58436 -100738 -145840 -114575 -44835 -32309
13924c2309m9855N670Q2575j581p0973p1146m0256P0057L1075J470J02520K0971
$$ -32309 -82164 -76494 6081 4500 -66473 -137619 -177875 -107818 -76743 -75273 27247 48218
13912D8218j1623J7506Q523k6020l7038o8558j07528J04342J7897L2201N3386
$$ 48218 36595 54101 62624 36604 -434 -68992 -176520 -72178 -54281 -22080 31306
13901C1306l609o753o6654k3323l2211K2776j3653p9241n5211K3242L2666N9338
$$ 31306 27697 20944 -45710 -69033 -101244 -78468 -92121 -171362 -226573 -203331 -170665 -111327
13889a11327k0423P4561p5201Q684N8982M6173K8567K9659L9158m2540J7813l1307
$$ -111327 -131750 -57189 -132390 -123706 -64724 -18551 10016 39675 78833 36293 54106 22799
13877B2799k1923M5368n880o3819q9596j0844N7260O7715O9410K4062n3295p1944
$$ 22799 876 46244 40364 -23455 -113051 -123895 -66635 1080 70490 94552 41257 -30687
13865c0687j7560M5484N9815P0968m1067p0322k4739R302L6030l9414j09315n2126
$$ -30687 -48247 -2763 57052 128020 86953 16631 -8108 1194 37224 -2190 -111505 -163631
13853a63631O8046N4325o7067l2879j5401O3877N0943L1108O352j5737J0136M2793
$$ -163631 -95585 -41260 -108327 -141206 -156607 -92730 -41787 -10679 -4327 -20064 -9928 32865
13841C2865m7966q304M9797K4885m831m7221p4965j8674J8315J4062n9872l8869
$$ 32865 -15101 -23405 26392 51277 46446 -775 -75740 -94414 -76099 -62037 -121909 -160778
13829a60778J0509J10352O5468m8798J2704j3205k8585j8879p616J14336L3723
$$ -160778 -150269 -39917 25551 -23247 -10543 -23748 -52333 -71212 -78828 35508 69231
13818F9231j6526N6165m530n8688j4863l287R2030N1634p16n4708n1912q579q4070
$$ 69231 52705 108870 104340 45652 30789 27502 119532 171166 170450 115742 63830 55251 -28819
13805b8819k397j3659j7810P2001m4083K5889L1271N2816m0119j04632j2169M2078
$$ -28819 -31216 -44875 -62685 9316 -34767 -8878 22393 75209 35090 -69542 -81711 -39633
13793c9633k0784J373M2113R2k9457j0660M4388J1087K6933M1168L3611j5446
$$ -39633 -60417 -59044 -16931 -16839 -46296 -56956 -12568 -1481 25452 66620 100231 84785
13781H4785q0098K3165J4202n2696K7126l4687o5660j3890K0768P0138K7294m06
$$ 84785 4687 27852 42054 -10642 16484 -18203 -83863 -97753 -76985 -6847 20447 20041
13769B0041j5165m6132q5983j6325J6227J78162O9584m9879K8169J4279j24737
$$ 20041 4876 -41256 -127239 -143564 -127337 50825 120409 70530 98699 112978 -11759
13758a1759p4435j10341R8960J07863Q2500J6540k886L4914n3867q7609j35868
$$ -11759 -86194 -196535 -97575 10288 92788 109328 106442 141356 87489 -120 -135988
13747a35988M437N1818l2405J7247N9969L5857k4905p6309O4969N1749j6225k7766
$$ -135988 -131551 -79733 -112138 -94891 -34922 935 -23970 -100279 -35310 16439 214 -27552
13735b7552K8308M9393o0140k5081o5336m3988l9775M3493M0683L5062J46085
$$ -27552 756 50149 -9991 -35072 -100408 -144396 -184171 -140678 -99995 -64933 81152
13724H1152J3700m4488n8790j24995L4803J26644M0553k0665q6270j4249n3011
$$ 81152 94852 50364 -8426 -133421 -98618 28026 68579 47914 -38356 -52605 -105616
13713a05616k4Q1019P9366l10l3124o2060k0109R594j3027K3877L4593J4486j1371
$$ -105616 -105640 -24621 54745 54435 21311 -40749 -60858 -51264 -64291 -40414 -5821 8665 -2706
13700b706r8937m6464k2090K7507P2898k7533n789K944M2576O737j4887L3186
$$ -2706 -101643 -148107 -170197 -142690 -69792 -97325 -103114 -100170 -57594 -50857 -65744 -32558
13688c2558l7482O1130M3693J7310n2313K9234n4742j7655k6191O8057L8590m477
$$ -32558 -70040 -8910 34783 52093 -220 29014 -25728 -43383 -69574 -1517 37073 32596
13676C2596L0187n2729j2138J4297j4592o4317o635K0171m0958Q680J5502O276
$$ 32596 62783 10054 -2084 12213 -2379 -66696 -73331 -53160 -94118 -85438 -69936 -63660
13664f3660L8458N9807p4323o6018J5152J12805J11184O4587l2033p0566n6170
$$ -63660 -25202 34605 -39718 -105736 -90584 22221 133405 197992 165959 95393 39223
13653C9223o209k4108M6847N5257j5260j9729L4552k287l0467k2518l8985n3749
$$ 39223 33014 8906 55753 111010 95750 76021 110573 108286 77819 55301 16316 -37433
13641c7433O5337M8445p6190N2414j3519l8089k4438P2373R393q559k7340K304
$$ -37433 27904 76349 159 52573 39054 965 -23473 48900 58293 49734 22394 24698
13629B4698J7859M51n3106r175L4622l5966K8744O0653k3399l1828O681N7331
$$ 24698 42557 43008 -10098 -19273 15349 -20617 8127 68780 45381 13553 20234 77565
13617G7565M0201N1028J0809l9026j9002l5801k1903o7645Q540L4621n138p4233
$$ 77565 117766 168794 179603 140577 121575 85774 63871 -3774 4766 39387 34249 -39984
13605c9984K6693R0857L7124l7971K6460J20915K5242J1153j7091j05441p5262
$$ -39984 -13291 77566 114690 76719 103179 224094 249336 260489 243398 137957 62695
13594F2695m4093K8896K2855l4046L4546k4293m0213P657O0568L080l084l271
$$ 62695 18602 47498 70353 36307 70853 46560 6347 14004 74572 77652 74568 71297
13582G1297k8868J3796l813m2689O7338P0206r5956l7214K902K2003p2617j0454
$$ 71297 42429 56225 52412 9723 77061 147267 51311 14097 16999 39002 -33615 -44069
13570d4069R3148Q6575J12616M2596m4386o8884j5433M6592m3526p0605K7379
$$ -44069 49079 135654 248270 290866 246480 177596 162163 208755 165229 94624 122003
13559A22003l7099L9386k5746q689O014j0859P490j2961L4548L4043j0362l3110
$$ 122003 84904 124290 98544 89855 95869 85010 92500 79539 114087 148130 137768 104658
13547A04658n9285K4909k3095r4303k6409k244J6294j3932J47203O2913R506j9472
$$ 104658 45373 70282 47187 -47116 -73525 -75769 -59475 -73407 73796 136709 146215 126743
13535A26743L4298j5851j5232J2728M4898M7679l6707n8168q0998j25230J7564
$$ 126743 161041 145190 129958 142686 187584 235263 198556 140388 59390 -65840 -48276
13524d8276j3190M9270K5004n559K8360L1742p3768o1724O7874m4506j04254L1524
$$ -48276 -61466 -12196 12808 7249 35609 67351 -6417 -68141 -267 -44773 -149027 -117503
13512a17503J23557M9344n750j23454m1021P4975M4610j6375k354P5184j2945
$$ -117503 6054 55398 49648 -73806 -114827 -39852 4758 -11617 -13971 61213 48268
13501D8268o6664J8648k0676M912K574J1906K3069m0929k6173M2081l2436K1051
$$ 48268 -18396 252 -20424 -15512 -12938 -1032 22037 -18892 -45065 -2984 -35420 -14369
13489a4369R6964j20857q9913L6931o4053k3782O6133Q6288J04094N9640J2573
$$ -14369 82595 -38262 -128175 -91244 -155297 -179079 -112946 -26658 77436 137076 149649
13478A49649n5548K4057k4313p2491N0606K7028p3716o8653j0342m1651n348j9100
$$ 149649 94101 118158 93845 21354 71960 98988 25272 -43381 -53723 -95374 -100722 -119822
13466a19822o6758O9035J7700j6006K0127l532K3897O7574O7206K4270q562k0335
$$ -119822 -186580 -117545 -99845 -115851 -95724 -99256 -75359 -7785 59421 83691 75129 54794
13454E4794n2524n0937l6742O4967L2342L1611M7485o7046j23440m0201L6482
$$ 54794 2270 -48667 -85409 -20442 11900 43511 90996 23950 -99490 -139691 -103209
13443a03209R2227m7843J5477N5628j664L7398N1878o5524L1957K9810k6232n1867
$$ -103209 -10982 -58825 -43348 12280 10616 48014 99892 34368 66325 96135 69903 18036
13431A8036j04094j2074k4455J4N8388R6144L1681q2934r73r133P006p5403l9679
$$ 18036 -86058 -98132 -122587 -122573 -64185 31959 63640 -19294 -20267 -29400 -22394 -97797 -137476
13418a37476n36K1112N4641L3068O974k7485K7374n4445J4589K7677L6360N8096
$$ -137476 -138012 -116900 -62259 -29191 -22217 -49702 -22328 -76773 -62184 -34507 1853 59949
13406E9949q639m4387k3362K5839Q2560O749p0763K6456M8784l7746M0979j7244
$$ 59949 51310 6923 -16439 9400 91960 98709 27946 54402 103186 65440 106419 89175
13394H9175K3865J2759j5945k0638J8595j9710j37609q0848K2468O6948o3386
$$ 89175 113040 125799 109854 89216 107811 88101 -49508 -130356 -107888 -40940 -104326
13383a04326l8584P581J897N3565M1739P827Q0661M9583r5545r2948K8147J6792
$$ -104326 -142910 -135329 -133432 -79867 -38128 -30301 50360 99943 4398 -88550 -60403 -43611
13371d3611R1868N1498Q600j3176k9746J6902J556L1642k4729n7353n7690n7177
$$ -43611 48257 99755 108355 95179 65433 82335 83891 115533 90804 33451 -24239 -81416
13359h1416j6910L5777R396m1776K6829k404k6203j7436M7122R835J8350m6909
$$ -81416 -98326 -62549 -53153 -94929 -68100 -70504 -96707 -114143 -67021 -57186 -38836 -85745
13347h5745n621l6504n8683M4124L3107k5122K7986L2269l9210P738O3235k1795
$$ -85745 -91366 -127870 -186553 -142429 -109322 -134444 -106458 -74189 -113399 -105661 -42426 -64221
13335f4221N7598R7858j8081j6560N1982k6954m5933m0532p0162l6346K1828N4880
$$ -64221 -6623 91235 73154 56594 108576 81622 35689 -4843 -75005 -111351 -89523 -34643
13323c4643j4692k7282L4308j8819P05Q3683K7685l0860L5252J111o5263l763
$$ -34643 -49335 -76617 -42309 -61128 -60423 23260 50945 20085 55337 56448 -8815 -12578
13311a2578N7354m8104p9867j0193o657L330J9041K5671L4532M4284p057l8526
$$ -12578 44776 -3328 -83195 -93388 -100045 -96715 -77674 -52003 -17471 26813 19756 -18770
13299a8770Q498j102l368k3380m4432o8K7880M5755K1748L1968J9842j1977p5202
$$ -18770 -10272 -11374 -14742 -38122 -82554 -82622 -54742 -8987 12761 44729 64571 52594 -22608
13286b2608R509J4583k6019K2151R418N3058O0323k7945P1022j2056p3516n4270
$$ -22608 -13099 1484 -24535 -2384 7034 60092 120415 92470 163492 151436 77920 23650
13274B3650N4497M6336m5312l4940o8714K5110M2783J3473r5513n611m5398R2897
$$ 23650 78147 124483 79171 44231 -24483 627 43410 56883 -38630 -44241 -89639 3258
13262C258Q0041L4304m4722q619o0426l3926l0843M847J03235J1661n3872k2074
$$ 3258 83299 117603 72881 64262 3836 -30090 -60933 -56086 47149 58810 4938 -17136
13250a7136j9826j8129M7225K5357K60j4818K1587q987l2774j525N1817P457k3107
$$ -17136 -36962 -55091 -7866 17491 17751 2933 24520 15533 -17241 -18766 33051 40508 17401
13237A7401n3766j26227K504L7062J03986L1427q3147K4421P2386m2708j3430
$$ 17401 -36365 -162592 -160088 -123026 -19040 12387 -70760 -46339 26047 -16661 -30091
13226c0091n297L8740Q4814o1704m2671J447P0250r097N3429O3457R0841j3653
$$ -30091 -35388 3352 88166 26462 -16209 -14762 55488 46391 99820 163277 254118 240465
13214B40465j61511r9806k09J7591K9795N622k5817J880K4347j7529p5784n334
$$ 240465 78954 -20852 -21061 -3470 26325 31947 6130 8010 32357 14828 -60956 -66290
13202f6290N0150q206k6480R185n66k4787K7693J5544P5485k2929K731L6924n0936
$$ -66290 -16140 -24346 -50826 -41641 -42207 -66994 -39301 -23757 51728 28799 31530 68454 17518
13189A7518j7754l4372k8677J9204P3996m0906m1764M886j1477J8805K0200j3895
$$ 17518 -236 -34608 -63285 -44081 29915 -10991 -52755 -47869 -59346 -40541 -20341 -34236
13177c4236j1308k6313Q5038M8744m4274k9169o5264J4908M7768p033l8839M3795
$$ -34236 -45544 -71857 13181 61925 17651 -11518 -76782 -61874 -14106 -21139 -59978 -16183
13165a6183k8456K4179J5841j5114m1308k0272k0219k2624O9140K2920k4020Q1571
$$ -16183 -44639 -20460 -4619 -19733 -61041 -81313 -101532 -124156 -55016 -32096 -56116 25455
13153B5455J15544l5731p2775K00L7833N1448j5814l1336J47N8204J0126m4935
$$ 25455 140999 105268 32493 32693 70526 121974 106160 74824 74971 133175 143301 98366
13141I8366q6422q3471l9173M2138Q9333j0429r015n6786N4924j1689j965n2014
$$ 98366 11944 -71527 -110700 -68562 20771 10342 1327 -55459 -535 -12224 -14189 -66203
13129f6203j9409r147L4950N7231k4461q1432j0080J8117Q2402J17046L636n0736
$$ -66203 -85612 -94759 -59809 -2578 -27039 -108471 -118551 -100434 -18032 99014 102650 51914
13117E1914m5357p9684n7040l1768P167M9379K9890N1966n7072M2985K4965Q2902
$$ 51914 6557 -73127 -130167 -161935 -154768 -105389 -75499 -23533 -80605 -37620 -12655 70247
13105G0247Q6611q648o735j09740j16943k762K5857L9925j1258N7927Q4766P6642
$$ 70247 156858 148210 141475 31735 -85208 -87970 -62113 -22188 -33446 24481 109247 185889
13093A85889J3144j14772l9098J6222K2925m7463K5180O2552n8579l7190o0819
$$ 185889 199033 84261 45163 61385 84310 36847 62027 124579 66000 28810 -32009
13082c2009J7291R0110o693q4548j07081n4747o1576K0920J10031R6209Q2118
$$ -32009 -14718 75392 68699 -15849 -122930 -177677 -239253 -218333 -108302 -12093 70025
13071G0025J3512k9202n1012n2392m2861N1481J6961r3061J3618J10747J53l7442
$$ 70025 83537 54335 3323 -49069 -91930 -40449 -23488 -116549 -102931 7816 7969 -29473
13059b9473k2362L4696k2965k111M8771k8513J4983N4214M9763p6551m0166K7333
$$ -29473 -51835 -17139 -40104 -42215 6556 -21957 -6974 47240 97003 20452 -19714 7619
13047G619j615K5404J4222j04985r0554R470J03838J12408L4088l3138l1488L5636
$$ 7619 6004 31408 45630 -59355 -149909 -140439 -36601 75807 109895 76757 45269 80905
13035H0905O5428K3934k1758l2457o1452L5078r761k3898o5040k6989l0641M9020
$$ 80905 146333 170267 148509 116052 54600 89678 79917 56019 -9021 -36010 -66651 -17631
13023a7631M6873N2892P019o9385N8479P4403M7017o661l2132J8016N370L2604
$$ -17631 29242 82134 89153 19768 78247 152650 199667 193006 160874 178890 184260 216864
13011B16864K30n3761P997M435j5819O98o7888r1881O5489J50401K6625O1366
$$ 216864 217094 163333 171330 175765 159946 160644 92756 875 66364 216765 243390 304756
12999C04756L7163j06221r1069p7014J502o6139K1925Q1674l2068m9182O8108
$$ 304756 341919 235698 144629 67615 69117 2978 24903 106577 74509 25327 93435
12988I3435m8168k2314J13122j432l5521K2393l1640K1246J2829K9568n283q7525
$$ 93435 45267 22953 136075 134643 99122 121515 89875 111121 123950 153518 148235 60710
12976F0710k1655M7971K8578J3539m591L1089q5494m2243R242P5246J3404j24777
$$ 60710 39055 87026 115604 129143 124552 155641 70147 27904 37146 112392 125796 1019
12964A019n9803M6245M0532K9201l552N688M5370l0087q4513L7749m0782j477
$$ 1019 -58784 -12539 27993 57194 53642 59330 104700 74613 -9900 27849 -12933 -14410
12952a4410O8107M2345o2166j31273m0149J12829R9606k8608L2705N0422j8878
$$ -14410 53697 96042 33876 -97397 -137546 -24717 74889 46281 78986 129408 110530
12941A10530N480M518k3258j9476Q1270M9076p9765k5997M5050m8649j13527p4517
$$ 110530 116010 120528 97270 77794 159064 208140 128375 102378 147428 98779 -14748 -89265
12929h9265j990K8287l5620R5004J5272k9468N4799Q339M6402M0989l0937J2313
$$ -89265 -91255 -62968 -98588 -3584 11688 -17780 37019 45358 91760 132749 101812 114125
12917A14125k883M595n4958M1782O5674j9948l0307r6371r3480n3919J18118J6729
$$ 114125 111242 115837 60879 102661 168335 148387 118080 21709 -71771 -125690 -7572 9157
12905I157P2291k4374p386L2421r019p5250q6414P0409Q7273L8718m7983m2664
$$ 9157 81448 57074 49688 82109 73090 -2160 -88574 -18165 69108 107826 59843 17179
12893A7179j8014k3244M3354n2072Q744j2619k7408N1320R6395J0029P214O792
$$ 17179 -835 -24079 19275 -32797 -24053 -36672 -64080 -12760 83635 93664 100878 107670
12881A07670M7002L2935J2657o636k4974n4978l3096m0466N94k3756j9815K3259
$$ 107670 154672 187607 200264 193628 168654 113676 80580 40114 40708 16952 -2863 20396
12869B0396l5380O4218Q6844J4946n741J363k6690j1232M1913r3946n4118k2959
$$ 20396 -14984 49234 136078 151024 145283 146646 119956 108724 150637 56691 2573 -20386
12857b0386K6406K6169J579N70K6717M3965L0107n8823k5431J1142K2325R2263
$$ -20386 6020 32189 33768 34338 61055 105020 135127 76304 50873 62015 84340 176603
12845A76603L0663l5132n7234j12599k3778K5121N4716K9972n8670k9895L6409
$$ 176603 207266 172134 114900 2301 -21477 3644 58360 88332 29662 -233 36176
12834C6176k0268m2593l9424N6279Q9576K8322J1025r981m0898n6946k6434L8430
$$ 36176 15908 -26685 -66109 -9830 79746 108068 119093 109112 68214 11268 -15166 23264
12822B3264p6013p1490L248L4934J3389M1189k5992n087M134K1425l2871Q0817
$$ 23264 -52749 -124239 -120991 -86057 -72668 -31479 -57471 -62558 -58424 -36999 -69870 10947
12810A0947l0246n5446M9358M5140L1818L1824J778K5776l1428k105N6920L4827
$$ 10947 -19299 -74745 -25387 19753 51571 83395 85173 110949 79521 77416 134336 169163
12798A69163l0679m6563m0895N246k2273j9443O3340M4560m7360p7623j0690R328
$$ 169163 138484 91921 51026 56272 33999 14556 77896 122456 75096 -2527 -13217 -3889
12786c889P2770K512o9388R6479J20479m3384o3313k9486j10408o983J54005Q8640
$$ -3889 68881 71393 2005 98484 218963 175579 112266 82780 -27628 -34611 119394 208034
12774B08034p6408j20693k0953M915O9820M0801O6826J914j2392o891l8379m2465
$$ 208034 131626 10933 -10020 -5105 64715 105516 172342 174256 161864 154973 116594 74129
12762G4129J6759K1353J7345j8523L5671J1288K175L0867p37n519l7200l9836
$$ 74129 90888 112241 129586 111063 146734 158022 160197 191064 190327 184808 147608 107772
12750A07772O562K4390j713P7533J6250M265j12702k5107J874n3763K6174N3504
$$ 107772 114334 138724 137011 214544 230794 235059 122357 97250 99124 45361 71535 125039
12738A25039O4883R2088R2009P9354k4273p6932p8727L1278j1942p3138l388N8218
$$ 125039 189922 282010 374019 453373 429100 352168 273441 304719 292777 219639 216251 274469
12726B74469P4997O902k2982N4190o5103j4252K9772Q6098J07654N6724R8779
$$ 274469 349466 356368 333386 387576 322473 308221 337993 424091 531745 588469 687248
12715F87248J03118R4503m2588P3422J59258O7893j155M1910J85977K96973L08743
$$ 687248 790366 884869 842281 915703 1074961 1142854 1141699 1183609 1369586 1666559 1975302
12704A975302L00376L00964M02383L73194M36950M66465M78991M77793M21501
$$ 1975302 2275678 2576642 2979025 3352219 3789169 4255634 4734625 5212418 5633919
12695E633919K92856Q0845r2296j00331j00518j73956k08374j88422j31245n6363
$$ 5633919 5926775 6007620 5915324 5814993 5714475 5540519 5332145 5143723 5012478 4956115
12685D956115n272J5325J21186K24008L05750M49978N68893N55302O79635Q25640
$$ 4956115 4950843 4966168 5087354 5311362 5617112 6067090 6635983 7191285 7870920 8696560
12675H696560R30689P76313O99134M83710J81567o6491m02104n27657p29082q71140
$$ 8696560 9627249 10403562 11102696 11586406 11767973 11701482 11299378 10771721 10042639 9171499
12665I171499p82953o11807m94478m31552l17843l29977k63842j19564K1073J26305
$$ 9171499 8388546 7776739 7282261 6850709 6532866 6202889 5939047 5819483 5840556 5966861
12655E966861J21580Q2547K66833L20091L54396L60501L43253J30346J24752j06097
$$ 5966861 6088441 6170988 6437821 6757912 7112308 7472809 7816062 7946408 8071160 7965063
12645G965063l84431m14435l91327l67766k59500k35574j57258q3407p4390M6472
$$ 7965063 7580632 7166197 6774870 6407104 6147604 5912030 5754772 5671365 5596975 5643447
12635E643447K92887L64509M60841O15282P87879R40581J029070J151922J069334
$$ 5643447 5936334 6300843 6761684 7376966 8164845 9105426 10134496 11286418 12355752
12626A2355752R21398P13152M35275J80657k86695o46245q36407p13611o78426
$$ 12355752 13277150 13990302 14425577 14606234 14319539 13673294 12836887 12123276 11444850
12617A1444850o16650l31957q2440M310J65259L04714M74599P84231J046808J243246
$$ 11444850 10828200 10496243 10413803 10418113 10583372 10888086 11362685 12146916 13193724 14436970
12607A4436970J632599J909885J972267J850122J805500J434770P19685J0583
$$ 14436970 16069569 17979454 19951721 21801843 23607343 25042113 25761798 25772381
12599B5772381r38766j644652j857760j890804j859599j678895j486977j224597
$$ 25772381 24833615 23188963 21331203 19440399 17580800 15901905 14414928 13190331
12591A3190331r27995o84933m69693l41963j17500J27033K39392K85142L97710
$$ 13190331 12262336 11577403 11107710 10765747 10648247 10775280 11014672 11299814 11697524
12582A1697524N51121O93072N86726M99175K79258K3027l27302o62652q62184
$$ 11697524 12248645 12941717 13528443 14027618 14306876 14329903 14002601 13339949 12477765
12573A2477765r97335j054730q65694p10272p85141o67880n57240m14241k23667
$$ 12477765 11480430 10425700 9560006 8849734 8064593 7396713 6839473 6425232 6201565
12564F201565j26189m5902P6299K01125K90328M42720N40313O50171O33304N59727
$$ 6201565 6075376 6029474 6105773 6306898 6597226 7039946 7580259 8230430 8863734 9423461
12554I423461L50955N3393k65694n00883o04856o54718n32631m10688l61586k72064
$$ 9423461 9774416 9827809 9562115 9061232 8456376 7801658 7269027 6858339 6496753 6224689
12544F224689q6134P4972J71786J69808K71242M45366N73521Q23511R36529R77071
$$ 6224689 6138555 6213527 6385313 6555121 6826363 7271729 7845250 8668761 9605290 10582361
12534A0582361R95528J012311Q73700N07831j7171l63243p43785j028024j184430
$$ 10582361 11577889 12590200 13463900 13971731 13954560 13591317 12847532 11819508 10635078
12525A0635078j153883r11951q15585o69754n57618m50132l52197j88463j56341
$$ 10635078 9481195 8569244 7753659 7083905 6526287 6076155 5723958 5535495 5379154
12516E379154j67045N5203J75485K10266L05115L98805K71583J93059M0147q6258
$$ 5379154 5212109 5267312 5442797 5653063 5958178 6356983 6628566 6821625 6861772 6775514
12506F775514j37843l03485m17560m94504n97377n53489l66752l73075m12993
$$ 6775514 6637671 6334186 5916626 5422122 4824745 4271256 3904504 3531429 3118436
12497C118436l81560l19432k23843j51914p3130j16357k44693k23597o7113p8862
$$ 3118436 2736876 2417444 2193601 2041687 1968557 1852200 1607507 1383910 1316797 1237935
12487A237935r9054j83546o6969p0034J7497k725j17275j00781J6248k0843m6869
$$ 1237935 1138881 955335 888366 818332 835829 833104 715829 615048 631296 610453 563584
12476E63584J3372o7220m4021l42j8082J5736L8578N2802m4976l9753n0376m5379
$$ 563584 576956 509736 465715 465373 447291 463027 501605 554407 509431 469678 419302 373923
12464C73923K5226J7877j2464o9761n3014k2799K0111N5333n5858l3435k3099
$$ 373923 399149 417026 404562 334801 281787 258988 279099 334432 278574 245139 222040
12453B22040L1512L7574p6350o0050j3194N4073K3512N7618L0024k5035n1032
$$ 222040 253552 291126 214776 154726 141532 195605 219117 276735 306759 281724 230692
12442B30692J4322M5645N9070P2806p0259n3954L824q2165p4520l526M0878M8444
$$ 230692 245014 290659 349729 422535 352276 298322 302146 219981 145461 141935 182813 231257
12430B31257n940O5861m0965q0531R261L6594o237O6267O5334o2835M96m064j01185
$$ 231257 225317 291178 250213 169682 178943 215537 209300 275567 340901 278066 278562 274498 173313
12417A73313m0614R1228M4269L390n4249m7267Q6604M2071l7089r3719o4985J8121
$$ 173313 132699 223927 268196 271586 217337 170070 256674 298745 261656 167937 102952 121073
12405A21073O1350n4785r0409m958L2220J00396J2995n1068J4579Q956m1485N9649
$$ 121073 182423 127638 37229 32271 64491 164887 177882 126814 141393 150349 108864 168513
12393A68513N6884K5930o4851q7130O2286r4416m2973l0118J2625J4647K0624
$$ 168513 225397 251327 186476 99346 161632 67216 24243 -5875 6750 21397 42021
12382D2021L9185Q5332N7561o2444n3335K401j2182M8549N3994k5512J1390R299
$$ 42021 81206 166538 224099 161655 108320 110721 98539 147088 201082 175570 186960 196259
12370A96259m949O5394m6556j7135O6388k332j00149k7776l0257j3038K5757o3330
$$ 196259 191310 256704 210148 193013 259401 257069 156920 129144 98887 85849 111606 48276
12358D8276k2070K7470j0086Q486J04235J059J1951j217P595o1273J571N3657
$$ 48276 26206 53676 43590 52076 156311 157370 169321 168104 175699 114426 115997 169654
12346A69654J2094k1126O75N13K192M473N116p738q670R911L8796O3771p3213
$$ 169654 181748 160622 161297 161810 164002 168475 173591 165853 157183 167094 205890 269661 196448
12333A96448n585J2050L5350L7700l1972k9600l8643r555M5697J36005M7199M0062
$$ 196448 190863 202913 238263 275963 243991 214391 175748 166193 211890 347895 395094 435156
12321D35156m2543j26429o6138L0433L3690k049n054j0868o8438q8505K5420O0310
$$ 435156 392613 266184 200046 230479 264169 262120 257066 246198 177760 89255 114675 174985
12309A74985j7298k7372N5496K4177l803m1613P07j3848K3516J2993L9823k165
$$ 174985 157687 130315 185811 209988 206185 164572 165279 151431 174947 187940 227763 225598
12297B25598K1858n6297q9043l014J64935P6447l0738n6356j9495K8060R720L2470
$$ 225598 247456 191159 102116 99102 264037 340484 309746 253390 233895 261955 271675 304145
12285C04145q8569j33033l136O1478J43761K5754p0040j23788o4226J2363P5942
$$ 304145 215576 82543 79407 140885 284646 310400 240360 116572 52346 64709 140651
12274A40651K3535O1198N2525n9295J6058J8016N611k2441R88M7407k1921K776
$$ 140651 164186 225384 277909 218614 234672 252688 258299 235858 236846 284253 262332 265108
12262B65108K0666P7321m1081k2123j5297r356N098Q7876M5899l3603L6661J0016
$$ 265108 285774 363095 322014 299891 284594 275238 280336 368212 414111 380508 417169 427185
12250D27185n8644P640r035K9860m6117j08903n4712K7165J2972K2387O923N6566
$$ 427185 368541 376181 367146 397006 350889 241986 187274 214439 227411 249798 256721 313287
12238C13287M981J675M0762k8148o1811j501n5950j1871M4440m7331q3583j2955
$$ 313287 318268 319943 360705 332557 270746 269245 213295 201424 245864 198533 114950 101995
12226A01995N5879n67K7756P4690L7472m0773k8332o0690L9536J5143l496N4570
$$ 101995 157874 157307 185063 259753 297225 256452 228120 167430 206966 222109 218613 273183
12214B73183J03122j7601l8665k8318M5285o6527r51L6966Q64q8625m514K7099
$$ 273183 376305 358704 320039 291721 337006 270479 269528 306494 307358 218733 214219 241318
12202B41318o526O9158O8498m7472q0905J3425l5395l5782N127o4958K3049J00176
$$ 241318 234792 303950 372448 324976 244071 257496 222101 186319 191446 126488 149537 249713
12190B49713Q2789m3678o6829O9654O8520J4334J6019l8674p9774n7748M8734
$$ 249713 332502 288824 221995 291649 360169 374503 390522 351848 272074 214326 263060
12179B63060O3358n6074J7608p6502o9796j0811K2820L932k920l84J7212m780
$$ 263060 326418 270344 287952 211450 141654 130843 153663 157595 154675 154291 171503 166723
12167A66723l9359p247M635M425R702O209K1595K0157M7657P7641l3644p1293
$$ 166723 127364 120117 124752 129177 138879 145088 166683 186840 234497 312138 278494 207201
12155B07201n9792l725l3077j2674J7028K8806j5670O251r10j1258K7689J04445
$$ 207201 147409 143684 110607 97933 114961 143767 128097 134348 133438 122180 149869 254314
12143B54314j3402o2587p568J70K4036J8087p7204P5400Q2141P8706K512j06463
$$ 254314 240912 178325 170757 170927 194963 213050 135846 211246 293387 372093 374605 268142
12131B68142j04368J8374J73722n259n2642n7118O1399L391p005Q203K5527J0385
$$ 268142 163774 182148 355870 350611 297969 240851 302250 305641 298636 306839 332366 342751
12119C42751N1129p282n0400P081J636q0768m0897J01932L1841l7341o8892K2059
$$ 342751 393880 386598 336198 343279 344915 264147 223250 325182 357023 319682 250790 272849
12107B72849m934L414N4353K5602P6652J3334k294K9320R6647r4134j01P0751
$$ 272849 267915 271329 325682 351284 427936 441270 438976 468296 564943 470809 470708 541459
12095E41459O5899n0935j9798q5921l54N0338n5449j100M356l1222m3793K8970
$$ 541459 607358 556423 536625 450704 450350 500688 445239 444139 448495 417273 373480 402450
12083D02450Q6360P4957n4787N684K0646n1513K3170L6798O9631Q6539K7630m6343
$$ 402450 488810 563767 508980 514664 535310 483797 506967 543765 613396 699935 727565 681222
12071F81222l8891j0600n9368k5549n3639L3817J4750M620M6073J8154n9102l4143
$$ 681222 642331 631731 572363 546814 493175 526992 541742 546362 592435 610589 551487 517344
12059E17344N9540n776J5653P337L8397L1182n7311k2993j2719j0009P531j8569
$$ 517344 576884 571108 586761 594098 632495 663677 606366 583373 570654 560645 568176 549607
12047E49607K1j0868p0915N460K9452O1810O6951j6555n008l7446Q591J282O0682
$$ 549607 549628 538760 467845 473305 502757 564567 631518 614963 609955 572509 581100 582382 643064
12034F43064M3395J7312J4317k7684o6290K8219O6981M7692L179L695r7725J4900
$$ 643064 686459 703771 718088 690404 624114 652333 719314 767006 770185 773880 676155 691055
12022F91055J8539M2164m067q3759o3274K0088N6395Q741J8433l111j50032p3704
$$ 691055 709594 751758 747691 663932 600658 620746 677141 685882 704315 701204 551172 477468
12010D77468J17155J44353M7686Q6511R0196k5465k5314q7289m5465K9718R8082
$$ 477468 594623 738976 786662 873173 963369 937904 912590 825301 779836 809554 907636
11999I07636K0159N8105k8143L0053j7502K3134K7927l6620J0062M8270k2068
$$ 907636 927795 985900 957757 987810 970308 993442 1021369 984749 994811 1043081 1021013
11988A021013J7296M4399O0519Q1885M5238M2694J02914j5661j507J23391J02542
$$ 1021013 1038309 1082708 1143227 1225112 1270350 1313044 1415958 1400297 1398790 1522181 1624723
11977A624723Q3343R031J7596J53477P2717l422J45484P9174J0867M1607O813
$$ 1624723 1708066 1717097 1734693 1888170 1960887 1957465 2102949 2182123 2192990 2234597 2241410
11966B241410Q6638J06951R1040J39483K60794K96190J23448K53696K22798K39715
$$ 2241410 2328048 2434999 2526039 2665522 2926316 3222506 3345954 3599650 3822448 4062163
11956D062163L46219L46290K72932L04247N32523O34942O14172P69458Q55752
$$ 4062163 4408382 4754672 5027604 5331851 5864374 6499316 7113488 7882946 8738698
11947H738698R84108J206206J443156J773126K160832K655305L342515M289595
$$ 8738698 9722806 10929012 12372168 14145294 16306126 18961431 22303946 26593541
11939B6593541N617721P530510R815225J2670875J6823029K2900165L2755259
$$ 26593541 32211262 39741772 49556997 62227872 79050901 101951066 134706325
11932A34706325M7366065O0879216N1515959N586190m3117687o2141011n3474763
$$ 134706325 182072390 242951606 294467565 300053755 256936068 194795057 141320294
11925A41320294l7436755k4895332j6788386j1686939q420900o167237m652503
$$ 141320294 103883539 78988207 62199821 50512882 42091982 35924745 31272242
11918C1272242l603742k813764k099393j635643j298041r90156o89880l92683
$$ 31272242 27668500 24854736 22755343 21119700 19821659 18831503 18141623 17748940
11910A7748940k85038l8025J39157J92462L57536M36187M84960M66710M05475
$$ 17748940 17463902 17425877 17565034 17757496 18115032 18551219 19036179 19502889 19908364
11901A9908364L65745L32281K65808K20421K67444J28686O4874J33923Q4109J32410
$$ 19908364 20274109 20606390 20872198 21092619 21360063 21488749 21553623 21687546 21771655 21904065
11891B1904065J50299K53214M61787N97636O40682P77547R73677J004082J129490
$$ 21904065 22054364 22307578 22769365 23367001 24007683 24785230 25758907 26762989 27892479
11882B7892479J222820J053345R88528R78846P87581M10014R7962n2022l83059
$$ 27892479 29115299 30168644 31157172 32136018 32923599 33333613 33431575 33379553 32996494
11873C2996494o69711p58328r01764r88605j060279r76933r81387r10994q05592
$$ 32996494 32326783 31568455 30666691 29678086 28617807 27640874 26659487 25748493 24942901
11864B4942901o58383m88038l84084k50135k11669k14615q9902n3531j32038j40296
$$ 24942901 24284518 23796480 23412396 23162261 22950592 22735977 22646075 22592544 22460506 22320210
11854B2320210k44219m26539m07144n25532o97036q23199q22279p88024p56235
$$ 22320210 22075991 21649452 21242308 20716776 20019740 19196541 18374262 17586238 16830003
11845A6830003p59785p93662o11290n87853n36178l61436k52570j34514P103M3282
$$ 16830003 16070218 15276556 14665266 14077413 13541235 13179799 12927229 12792715 12799818 12843100
11835A2843100J82964K74645M26506N86335P60963Q37920Q67717R73526J211946
$$ 12843100 13026064 13300709 13727215 14313550 15074513 15912433 16780150 17753676 18965622
11826A8965622J276128J308076J296268J125162J160886J228161R64386P62027
$$ 18965622 20241750 21549826 22846094 23971256 25132142 26360303 27324689 28086716
11818B8086716O25657N29283L90211K85558K88126K52654K05948L43063M09471
$$ 28086716 28712373 29241656 29631867 29917425 30205551 30458205 30664153 31007216 31416687
11809C1416687N87007Q25205R60164J096922J280251J427417J505810J521702
$$ 31416687 32003694 32828899 33789063 34885985 36166236 37593653 39099463 40621165
11801D0621165J413112J317311J192478R65986P23052K98728p7190n01073q24938
$$ 40621165 42034277 43351588 44544066 45510052 46233104 46531832 46454642 45953569 45128631
11792D5128631j078068j278504j525255j608644j565258j434949j433090j371455
$$ 45128631 44050563 42772059 41246804 39638160 38072902 36637953 35204863 33833408
11784C3833408j196635j049352r74494p57116m95616l77028m04029m21661n23860
$$ 33833408 32636773 31587421 30612927 29855811 29360195 28983167 28579138 28157477 27633617
11775B7633617n53017n44326p62767p84650q65544j063473j157645j269219j328412
$$ 27633617 27080600 26536274 25773507 24988857 24123313 23059840 21902195 20632976 19304564
11766A9304564j386268j286468j249793j204955j152316j019174r19758q39152
$$ 19304564 17918296 16631828 15382035 14177080 13024764 12005590 11085832 10246680
11758A0246680q68252p03039o75683n51614n10586n30433m45393l06781l32500
$$ 10246680 9378428 8675389 7999706 7448092 6937506 6407073 5961680 5654899 5322399
11749E322399k90840k43303l07101k15291k48900k35396j72362k04379j41037
$$ 5322399 5031559 4788256 4481155 4265864 4016964 3781568 3609206 3404827 3263790
11740C263790j02056j08937j36360j19018j59884j09773j01256j77287k23980
$$ 3263790 3161734 3052797 2916437 2797419 2637535 2527762 2426506 2249219 2025239
11731B025239j01699L2627j01870p4641q5671j07301K874l1988q8307r2485q0035
$$ 2025239 1923540 1956167 1854297 1779656 1693985 1586684 1589558 1557570 1469263 1376778 1296743
11720A296743j2746P6840N2572p356j45283q9495j6097j0970q295K0149N4673
$$ 1296743 1283997 1360837 1413409 1406053 1260770 1171275 1155178 1144208 1135913 1156062 1210735
11709A210735N0933J7705N134n4900m4267m0078o1325j07237o4583L0993L8414
$$ 1210735 1261668 1279373 1284507 1229607 1185340 1145262 1083937 976700 912117 943110 981524
11698I81524n8707l4177K6316J1128r376q152N21k7036O79J31115M9339l5457
$$ 981524 922817 888640 914956 926084 916708 908556 909077 882041 882720 1013835 1063174 1027717
11686A027717j05668j9053q7860r8743o4236l4080O9346M6816k6492j4226N3766
$$ 1027717 922049 902996 815136 716393 652157 618077 687423 734239 707747 693521 747287
11675G47287N9776l2755p1162r316L3501j2977l9286q0709k0987J9008Q9770O1290
$$ 747287 807063 774308 703146 693830 727331 714354 675068 594359 573372 592380 682150 743440
11663G43440o8479p9626k125L2191j8634n9275k5588L1660K2489Q747R7500n0078
$$ 743440 674961 595335 593210 625401 606767 547492 521904 553564 576053 584800 682300 632222
11651F32222l2470K6600j23641p1580L5898m317Q825k3987P1666R0731M0452o1975
$$ 632222 599752 626352 502711 431131 467029 462712 471537 447550 519216 609947 650399 588424
11639E88424n1735L5314K7022M2872o9932q8516J3663Q5565J863n8760r229L0783
$$ 588424 536689 572003 599025 641897 571965 483449 497112 582677 584540 525780 516551 547334
11627E47334O193R222M0554N7738o5676K5820J8917n9886j4100p26R8182j6674
$$ 547334 553527 562749 603303 661041 595365 621185 640102 580216 566116 565390 663572 646898
11615F46898j3056l7876l268j5943r3556J03858K0348J039J8620q8727M4652P2354
$$ 646898 633842 595966 592698 576755 483199 587057 607405 608444 627064 538337 582989 655343
11603F55343j7697O7524L9879r6813K6470O9111k8506j9599M4537n760J5518R4117
$$ 655343 637646 705170 745049 648236 674706 743817 715311 695712 740249 734489 750007 844124
11591H44124l6915J6000m3150j0855j8972M3648N5129N7006Q5933L9836j5543
$$ 844124 807209 823209 780059 769204 750232 793880 849009 906015 991948 1031784 1016241
11580A016241p1596n8427N8854N9548m1429n3613N8119M8932Q3317J00642N9046
$$ 1016241 944645 886218 945072 1004620 963191 909578 967697 1016629 1099946 1200588 1259634
11569A259634J719n9868l2941O9420M9472R4478O8658j8578N1712R6647J89179
$$ 1259634 1261353 1201485 1168544 1237964 1287436 1381914 1450572 1431994 1483706 1580353 1769532
11558A769532m360L7731O9081l3837M3449P7992P057k6828R0890J31886J37064
$$ 1769532 1765172 1802903 1871984 1838147 1881596 1959588 1966645 1939817 2030707 2162593 2299657
11547B299657R7553J26886J54351L5448J41503J46740J22080J15878J06054J19336
$$ 2299657 2397210 2524096 2678447 2713895 2855398 3002138 3124218 3240096 3346150 3465486
11537C465486R4672J95183J77518J28298J05601K02218K55178L22277K57081K83981
$$ 3465486 3560158 3755341 3932859 4061157 4166758 4368976 4624154 4946431 5203512 5487493
11527E487493K36777J41847J29753K68465L44194L54009L63082L62542L11261
$$ 5487493 5724270 5866117 5995870 6264335 6608529 6962538 7325620 7688162 7999423
11518G999423K62133L62976M48462L68835L25917L66390L71839M17565L74720
$$ 7999423 8261556 8624532 9072994 9441829 9767746 10134136 10505975 10923540 11298260
11509A1298260L78517M01819M36019M37781L50096L00989M21792M35265K71542
$$ 11298260 11676777 12078596 12514615 12952396 13302492 13603481 14025273 14460538 14732080
11500A4732080J88138K84407K77925K40480K23519K15094K72811K87132J59632
$$ 14732080 14920218 15204625 15482550 15723030 15946549 16161643 16434454 16721586 16881218
11491A6881218J43288J71939J35144O9257J4855J01404J08170L2730J6408j7238
$$ 16881218 17024506 17196445 17331589 17400846 17415701 17517105 17625275 17658005 17674413 17657175
11481A7657175J9355o8678j63799q9458j27327L7167j37803k28013k22765j60633
$$ 17657175 17676530 17607852 17444053 17354595 17227268 17264435 17126632 16898619 16675854 16515221
11471A6515221k26935j67553k72393k57705j91331k62471k39856j19607j24977
$$ 16515221 16288286 16120733 15848340 15590635 15399304 15136833 14896977 14777370 14652393
11462A4652393j60902j73557j88816j31425p9424j1994k0365n5275j177J22328
$$ 14652393 14491491 14317934 14129118 13997693 13918269 13906275 13885910 13830635 13829458 13951786
11452A3951786J70742M9493M2292Q1298J42022K19579K52409K61630L30209L66768
$$ 13951786 14122528 14172021 14214313 14295611 14437633 14657212 14909621 15171251 15501460 15868228
11442A5868228L06755L20966L84605M83323M35250M51949M95960M47808N27947
$$ 15868228 16174983 16495949 16880554 17363877 17799127 18251076 18747036 19194844 19722791
11433A9722791M38961M91502N83092O25890O04859N72796N81660N76110M86079
$$ 19722791 20161752 20653254 21236346 21862236 22467095 23039891 23621551 24197661 24683740
11424B4683740N27002M70828L62734M52032L89238L26012L81426K32335K84066
$$ 24683740 25210742 25681570 26044304 26496336 26885574 27211586 27593012 27825347 28109413
11415B8109413K17388J46560Q6851J8498M7634j856Q0831M0630P887r9989k29283
$$ 28109413 28326801 28473361 28560212 28578710 28626344 28624488 28705319 28745949 28753836 28653847 28424564
11404B8424564k05082r1454j91162k95818l40236l18869l22011l59798m79715
$$ 28424564 28219482 28128028 27936866 27641048 27300812 26981943 26659932 26300134 25820419
11395B5820419n19086n66477m90844n38375o56760o35305o35796n11159m94335
$$ 25820419 25301333 24734856 24244012 23705637 23048877 22413572 21777776 21266617 20772282
11386B0772282o26649o51276o01268n18215m00152m74980n18498n27888m76557
$$ 20772282 20145633 19494357 18893089 18374874 17974722 17499742 16981244 16453356 15976799
11377A5976799l42359l64795l29891l27415l86737l90744k42857j77731k07136
$$ 15976799 15634440 15269645 14939754 14612339 14225602 13834858 13592001 13414270 13207134
11368A3207134l23735j90116p5137j56907j83005q9345j9957j27586k5231N336
$$ 13207134 12883399 12693283 12618146 12461239 12278234 12188889 12168932 12041346 12016115 12021451
11358A2021451J6594l4654m9611J93948J44845P8564R7919K00018K30682K41833
$$ 12021451 12038045 12003391 11953780 12147728 12292573 12371137 12469056 12669074 12899756 13141589
11348A3141589M9045Q7717J24749J56434R3592O1922J03379Q7577N5517M9587
$$ 13141589 13190634 13278351 13403100 13559534 13653126 13715048 13818427 13906004 13961521 14011108
11338A4011108j682K0899k6442o0776j7980k4202l6076o058l5967j50947p7504
$$ 14011108 14009426 14030325 14003883 13943107 13925127 13900925 13864849 13858791 13822824 13671877 13594373
11327A3594373j01879j17439j90797q6829p1806k20541l10878k54994j36269j29219
$$ 13594373 13492494 13375055 13184258 13097429 13025623 12805082 12494204 12239210 12102941 11973722
11317A1973722k58176l49287l50618l32210k42965k63162k73567l23826l20090
$$ 11973722 11715546 11366259 11015641 10683431 10440466 10177304 9903737 9579911 9259821
11308I259821k20071k86203k97595l89462l49863l48507k93114k31394k01509
$$ 9259821 9039750 8753547 8455952 8066490 7716627 7368120 7075006 6843612 6642103
11299F642103j98661k62076k94422l25096j65858k59369k59452j61245k16183
$$ 6642103 6443442 6181366 5886944 5561848 5395990 5136621 4877169 4715924 4499741
11290D499741r5708j35660k89405k27015j62926j36726j78195j68760q5571j05117
$$ 4499741 4404033 4268373 3978968 3751953 3589027 3452301 3274106 3105346 3019775 2914658
11280B914658r7477k8129r2657j36391l2606k5216j26372j49725j24372r3185
$$ 2914658 2817181 2789052 2696395 2560004 2527398 2502182 2375810 2226085 2101713 2008528
11270B008528j39059j08339j08579l8088m9190j29165n4582N934J1811L1229k1769
$$ 2008528 1869469 1761130 1652551 1614463 1565273 1436108 1381526 1387460 1399271 1430500 1408731
11259A408731m4974m7606j2968J8257R6462n1443j79532j22967o5568l4839j14473
$$ 1408731 1363757 1316151 1303183 1321440 1417902 1366459 1186927 1063960 998392 963553 849080
11248H49080K424j4045j13217L4779M2831J7688q9851p7476Q2633Q4018J0895
$$ 849080 851504 837459 724242 759021 801852 819540 729689 652213 734846 818864 829759
11237H29759j34056j37922m2263l2200k8615L2937J5224P0045N6121o4974j5145
$$ 829759 695703 557781 515518 483318 454703 487640 502864 572909 629030 564056 548911
11226E48911O9104P7258P878P2376q0680r0606j04541o5301p1158M4346O1823
$$ 548911 618015 695273 703151 775527 694847 604241 499700 434399 363241 407587 469410
11215D69410m490K0138J3650k763J0359j0606o6659k9839K1962n1818n5007K5511
$$ 469410 464920 485058 498708 495945 506304 495698 429039 399200 421162 369344 314337 339848
11203C39848P5787K0891k8279P015q672o7360K2535M425j6825M0459j8446J9353
$$ 339848 415635 436526 408247 415262 406590 339230 361765 366190 349365 389824 371378 390731
11191C90731n4463O904M3749m4814q9116j0503Q2535M8366J0003l7489o2390K7357
$$ 390731 336268 343172 386921 342107 252991 242488 325023 373389 383392 345903 283513 310870
11179C10870k6462j6551m9367l7756P9739M1882J3283o5p7817J921J9822K3528
$$ 310870 284408 267857 218490 180734 260473 302355 315638 315573 237756 239677 259499 283027
11167B83027r778o3961L3166K4219r812k4691j6171k9252O934O5266p6489m6195
$$ 283027 273249 209288 242454 266673 256861 232170 215999 186747 193681 258947 182458 136263
11155A36263k2358K6357O0566l2052j3058K0867K2694l7577N6085L4057M7314
$$ 136263 113905 140262 200828 168776 155718 176585 199279 161702 217787 251844 299158
11144B99158k6943j1765j4533k03631j5857N2608M1141P299k4559J2648J1724
$$ 299158 272215 260450 245917 42286 26429 79037 120178 127477 102918 115566 127290
11133A27290J09677j0010p3813q3935P1487J28591R942o0660o6608r9274m6712
$$ 127290 236967 226957 153144 69209 140696 269287 279229 218569 151961 52687 5975
11122E975q56P2625K1792j6000k139p78K5891M9932k5263n1855k2344J1357K6816
$$ 5975 5119 77744 99536 83536 81397 80619 106510 156442 131179 79324 56980 68337 95153
11109I5153Q7774O8130R9810j5000j72877j10412m1236R128J8582m4335O8544
$$ 95153 182927 251057 350867 335867 162990 52578 11342 20470 39052 -5283 63261
11098F3261R1568k7809j4990Q7754N1640P953J2891L7597l1660m5605n0360j01007
$$ 63261 154829 127020 112030 199784 251424 259377 272268 309865 278205 232600 182240 81233
11086H1233n5183K551K0825P150l7792P9059O7505l7599l1090K3681L922o4559
$$ 81233 26050 28601 49426 56576 18784 97843 165348 127749 96659 120340 124262 59703
11074E9703K8415l4278N8475N1112M4755q5897n2535Q0075J692j17460k3690R5039
$$ 59703 88118 53840 112315 163427 208182 122285 69750 149825 151517 34057 10367 105406
11062A05406K3304R023r0456K1240r110L1731N6013k477l1775k1971N2656L9563
$$ 105406 128710 137733 47277 68517 59407 91138 147151 144674 112899 90928 143584 183147
11050A83147J0505O2274R687k4635M921j9966O3409j8988O301j8020P0049J7886
$$ 183147 193652 255926 265613 240978 245899 225933 289342 270354 276655 258635 328684 346570
11038C46570m5724J7781Q095N3032O8230M7384j5456k0454m3858M9680N0311k7892
$$ 346570 300846 318627 326722 379754 447984 495368 479912 459458 415600 465280 515591 487699
11026D87699Q805J51689K9158p9909n1322p0708M8552K4239m0437R4592R3664
$$ 487699 496504 648193 677351 597442 546120 475412 523964 548203 507766 602358 696022
11015F96022J9471N7394K3766K188L1283n3108j22340q8510l4999k9763k0901
$$ 696022 715493 772887 796653 798841 830124 777016 654676 566166 531167 501404 480503
11004D80503N7805K4671J5451o512m7269j9210m1787j7989K6410J7288o0471r4821
$$ 480503 538308 562979 578430 571918 524649 505439 463652 445663 472073 489361 428890 334069
10992C34069p9441J4450P4925O2302n095m9730n3481j03025J2220J4525K9837
$$ 334069 254628 269078 344003 406305 401210 351480 297999 194974 207194 221719 251556
10981B51556K6647q0596l7971J0219j86n9213k6374J12456K3408N955K4569Q087
$$ 251556 278203 197607 159636 169855 169669 110456 84082 196538 219946 225901 250470 258557
10969B58557p1443N0361Q8896M1947k9290K1813j7185K12l7721n3420m248m0616
$$ 258557 187114 237475 326371 368318 339028 360841 343656 343868 306147 252727 248479 207863
10957B07863L9455M42M740L0169j11749l1648L1848M93j8657P9120J2368N706
$$ 207863 247318 247760 252500 282669 170920 139272 171120 171613 152956 232076 244444 250150
10945B50150J6061n172k9133p0025p485R4285j1740r0265m0602K9385k9119M7235
$$ 250150 266211 261039 231906 161881 154396 248681 236941 146676 106074 135459 106340 153575
10933A53575N9926k6911j4925N1897l6037n9789P7870j6289j37844K421N6309
$$ 153575 213501 186590 171665 223562 187525 127736 205606 189317 51473 53894 110203
10922A10203M7474j9251m5014k7291K6669r920r87J8791p3444m9464M9469N4074
$$ 110203 157677 138426 93412 66121 92790 82870 81883 100674 27230 -22234 27235 81309
10910H1309l6543k3613l1728Q495L1551j3370N1238m811j5775L5016P7486r46
$$ 81309 44766 21153 -10575 -2080 29471 16101 67339 62528 46753 81769 159255 158309
10898A58309o606l6910m1763p3518P7612Q2368M9806J9567l4395q0119o6842K1592
$$ 158309 151703 114793 73030 -488 77124 159492 209298 228865 194470 114351 47509 69101
10886F9101L8068O6442l1959o3628L825n102l4774J7916m7522k1024J06551N7947
$$ 69101 107169 173611 141652 78024 81849 76747 41973 59889 12367 -8657 97894 155841
10874A55841J757O0025j4685p452o2448k8734o489K5166j5552l191J1909M9835
$$ 155841 157598 217623 202938 195486 133038 104304 97815 122981 107429 104238 116147 165982
10862A65982M5579J7552m8155o439N9570o041j4935J1708L3385J6343j1518j01231
$$ 165982 211561 229113 180958 174519 234089 228048 213113 224821 258206 274549 263031 161800
10850A61800j4791k813K9092m1972j12658j1629L6835J5485o731L0393k2854L5292
$$ 161800 147009 144196 173288 131316 18658 7029 43864 59349 52618 83011 60157 95449
10838I5449m4278N3070Q0701k0187l319L3333j8714J6973q3729m1033J3255K4937
$$ 95449 51171 104241 184942 164755 161436 194769 176055 193028 109299 68266 81521 106458
10826A06458J6180o857O1454J0974r1235j527k0526P9872l5992j04485o0152P5402
$$ 106458 122638 115781 177235 188209 96974 95447 74921 154793 118801 14316 -45836 29566
10814B9566J7410q8198M7525J05955q979J1433q516L6175n2629r6026j2013J04986
$$ 29566 46976 -41222 6303 112258 103279 114712 106196 142371 89742 -6284 -18297 86689
10802H6689P0300n6661r9466m9253M2030Q4194l0384O885j1619M6660O6619M1979
$$ 86689 156989 100328 862 -48391 -6361 77833 47449 54334 42715 89375 155994 197973
10790A97973K8638p1695j21610o9822M3556J10167M3229j16364l4258m4083K0038
$$ 197973 226611 154916 33306 -36516 7040 117207 160436 44072 9814 -34269 -14231
10779a4231o420o0921J9351P5072K4935P122L6242M2306j7343k7679m6686j4716
$$ -14231 -20651 -81572 -62221 12851 37786 44908 81150 123456 106113 78434 31748 17032
10767A7032L6568L2922o0765q1229R026k3137m4243q0941L1656M1010P7756N6706
$$ 17032 53600 86522 25757 -55472 -46446 -69583 -113826 -194767 -163111 -122101 -44345 12361
10755A2361n511k9747n4475K7951j15771N5515J39536O3287O547R854o741K2835
$$ 12361 6850 -22897 -77372 -49421 -165192 -109677 29859 93146 99693 109547 102806 125641
10743A25641K6690p4728q1640Q276J8747p9539L3635K1218J5195O9047j2326j6648
$$ 125641 152331 77603 -4037 4239 22986 -56553 -22918 -1700 13495 82542 70216 53568
10731E3568N6090j9037k098O4722P3243L939k6556R869J23419k3530o3329l0553
$$ 53568 109658 90621 88523 153245 226488 230427 203871 213740 337159 313629 250300 219747
10719B19747k0628O3033m340l2945J4039n234K3599k9712J3887O089j4256m1806
$$ 219747 199119 262152 257812 224867 238906 233672 257271 227559 241446 247535 233279 191473
10707A91473m8968K803k4126k6746l2614q914M9856M9553N2443o560L9777m9191
$$ 191473 142505 145308 121182 94436 61822 52908 102764 152317 204760 198200 237977 188786
10695A88786p116r6596q2430L4945P6989J16681M4247m5439q3612L3654K9746
$$ 188786 181670 85074 2644 37589 114578 231259 275506 230067 146455 180109 209855
10684B09855l1953r9900l3645k6052O0933O8138k7814J9039j0948M0470l1292
$$ 209855 177902 78002 44357 18305 79238 147376 119562 138601 127653 168123 136831
10673A36831L3374J11200l2782o1492j5827J8297L8274P8850m4757N213K2705
$$ 136831 170205 281405 248623 187131 171304 189601 227875 306725 261968 267181 289886
10662B89886j783N2541N2390l507j3418O183N3283m712o5830k1456J8972M3928
$$ 289886 288103 340644 393034 389527 376109 382292 435575 430863 365033 343577 362549 406477
10650D06477L7377O2071o9987m504k7443R777Q1373R0888J18124L6076M1155P4040
$$ 406477 443854 505925 435938 431434 403991 413768 495141 586029 704153 740229 781384 855424
10638H55424M283j5606L4836J04938P2770R0775L7273j3027R1362R4911P8954
$$ 855424 859707 844101 878937 983875 1056645 1147420 1184693 1171666 1263028 1357939 1436893
10627A436893J93742K01030J46004J82241J64345J74591L57052L20350M09218
$$ 1436893 1630635 1831665 1977669 2159910 2324255 2498846 2855898 3176248 3585466
10618C585466M73735N74176P13630Q72552J295394J684838K214180L011452M001946
$$ 3585466 4059201 4633377 5347007 6219559 7514953 9199791 11413971 14425423 18427369
10609A8427369M790819N373069M895365L273299J123923n87824j391843j008201
$$ 18427369 23218188 28591257 33486622 36759921 37883844 37296020 35904177 34895976
10601C4895976L04868K202025M446033O851867R398758J0842052R361611M504844
$$ 34895976 35200844 37402869 41848902 48700769 58099527 68941579 78303190 82808034
10593H2808034j153491n121825o382521n038007k172674J259678M897581Q621895
$$ 82808034 81654543 76532718 70150197 65112190 62939516 64199194 69096775 77718670
10585G7718670J2010411J3365231J0087992K072134n981416j1350597j2786067
$$ 77718670 89729081 103094312 113182304 115254438 109273022 97922425 85136358
10578H5136358j0724000p044868l203335M30019L544790O020364O543049L834727
$$ 85136358 74412358 67367490 64164155 64594174 68138964 74159328 80702377 84537104
10570H4537104j631274o965000r964053j0320941q449279n773518l389970j330745
$$ 84537104 82905830 75940830 65976777 55655836 47206557 41433039 38043069 36712324
10562C6712324K83076J150799J244951O962k099745m076399n273179n318432m647749
$$ 36712324 36995400 38146199 39391150 39398112 37298367 33221968 27948789 22630357 17982608
10553A7982608l547850k671689k039342j496389j023597q52872q20835n47663
$$ 17982608 14434758 11763069 9723727 8227338 7203741 6350869 5530034 4982371
10545D982371l74262l57792k75858k65706k65276k37998k61869k17485k20832
$$ 4982371 4608109 4250317 3974459 3708753 3443477 3205479 2943610 2726125 2505293
10536B505293j81614j69270j49431j37135l6314M6935j7396r1825m9204o1236
$$ 2505293 2323679 2154409 2004978 1867843 1831529 1878464 1861068 1769243 1720039 1658803
10526A658803j00353j6383l6881j01424n1027j5024l6699p7751M9852J12880J2188
$$ 1658803 1558450 1542067 1505186 1403762 1352735 1337711 1301012 1223261 1273113 1385993 1398181
10515A398181p1088O842j2439j02930q2480m7204J0024q6868k4125j1061M2050
$$ 1398181 1327093 1333935 1321496 1218566 1136086 1088882 1098906 1012038 987913 976852 1018902
10504A018902L4195j7604P876j5981L1726p115M1033J1167j8132J19590N8790
$$ 1018902 1053097 1035493 1043369 1027388 1059114 1051999 1093032 1104199 1086067 1205657 1264447
10493A264447M806n7506N0177l011n6352k5643N014p1213m3514k2187m432m1406
$$ 1264447 1269253 1211747 1261924 1258913 1202561 1176918 1181932 1110719 1067205 1045018 1040586 999180
10481I99180p4350j8258j7384l4653l6824l8528R370o600J3190r087L286K4798
$$ 999180 924830 906572 889188 854535 817711 779183 788553 781953 795143 786056 789342 814140
10469H14140m8153J9717J9221j5269j7669l5733Q4605R0702P1733N874j43375
$$ 814140 765987 785704 804925 789656 771987 736254 820859 911561 983294 989168 845793
10458H45793j34263m6913K63j5522m5083n4679k110o0131n1233L4795L9878N1133
$$ 845793 711530 664617 664880 649358 604275 549596 547486 487355 436122 470917 510795 561928
10446E61928m698j90332j37704p520L6250r278L3038M6582m6944n8354o0634L7880
$$ 561928 557230 366898 229194 221674 257924 248646 281684 328266 281322 222968 162334 200214
10434B00214O8165R0051l4969j05678m4188j1997N5087r828j7596n86K177m4892
$$ 200214 268379 358430 323461 217783 173595 161598 216685 206857 189261 188675 190852 145960
10422A45960j9976J9537k7369M5265P5587k3193L6616M7678l9546k8154K6417
$$ 145960 125984 145521 118152 163417 239004 215811 252427 300105 260559 232405 258822
10411B58822o0423K3696J06960p4166j08631N102L8841m090l4381L2836J00055
$$ 258822 198399 222095 329055 254889 146258 151360 190201 186111 151730 184566 284621
10400B84621P793j34154K3982P9495o7311j1627K293p9443j02262q185M1967K4127
$$ 284621 292414 158260 182242 261737 194426 182799 185092 105649 3387 -4798 37169 61296
10388F1296N0102O3702m3362q9864m8584j1643J03948K158m038K8626J25932K3398
$$ 61296 111398 175100 131738 41874 -6710 -18353 85595 87753 83715 112341 238273 261671
10376B61671q5645n2455j7446N2667o67j1364k9894j6280j5892L5647P0696l8290
$$ 261671 176026 123571 106125 158792 158125 146761 116867 100587 84695 120342 191038 152748
10364A52748j4689l9457k8233M4244J126L8959j3397j0087l7477O414m7977l5127
$$ 152748 138059 98602 70369 114613 115739 154698 141301 131214 93737 100151 52174 17047
10352A7047R2443j3683R060j883L2532q0115r018M0739K0114j6204J4521L3982
$$ 17047 109490 95807 104867 102984 135516 55401 46383 87122 107236 91032 105553 139535
10340A39535n4024p5257L6425K8816L7295n4812m5641P168K0409K2575K0417K0121
$$ 139535 85511 10254 46679 75495 112790 57978 12337 19505 39914 62489 82906 103027
10328A03027k0642m0176L9629K7210M0093q4897p4104O4751M6692O1833K7850
$$ 103027 82385 42209 81838 109048 149141 64244 -9860 54891 101583 163416 191266
10317A91266L3888o0607j90210r5908j4089L1415K5148J38230J50819j3327n6729
$$ 191266 225154 164547 -25663 -121571 -135660 -104245 -79097 59133 209952 196625 139896
10306A39896L4707n5761j10429m097Q084L6139j6709K2084K5552o3035K4490M8607
$$ 139896 174603 118842 8413 4316 12400 48539 31830 53914 79466 16431 40921 89528
10294H9528O298P9980L9883j7677j14969n509j6852l8187r161L4325l1528J9440
$$ 89528 95826 175806 215689 198012 83043 77534 60682 22495 13334 47659 16131 35571
10282C5571l725l6911o9760p4003N1436O9257J03626N059j0890L1539J1088j67168
$$ 35571 31846 -5065 -74825 -148828 -97392 -28135 75491 80550 69660 101199 112287 -54881
10270e4881n8566K4978R482O8384M5271Q4674m2771n4426K413l885K8601N2738
$$ -54881 -113447 -88469 -78987 -10603 34668 119342 76571 22145 24558 20673 49274 102012
10258A02012k1439l5433j7161J1642k2664L5223R8680K6928l4693m4966m656o48
$$ 102012 80573 45140 27979 39621 16957 52180 150860 177788 143095 98129 93473 92825
10246I2825p7712j20042J14042P8825J3469M5752J01021j13760k8582R149j5100
$$ 92825 15113 -104929 9113 87938 101407 147159 248180 134420 105838 114987 99887
10235I9887k647L3765R8634k2672o4589L3523m3056k8930n9532j680R5561O1627
$$ 99887 97240 131005 229639 206967 142378 175901 132845 103915 44383 42703 138264 199891
10223A99891J2501n9546o7120o5246k4561J06376N93p4561n381P2681J07878K4989
$$ 199891 212392 152846 85726 20480 -4081 102295 102888 28327 22946 95627 203505 228494
10211B28494j1934m4237k7307k623n5118r7171j2761O4120J9689k7171l179Q2283
$$ 228494 216560 172323 145016 142393 87275 -9896 -22657 41463 61152 33981 30802 113085
10199A13085k5098M712N131p100L1232o0659o2333J04511J8569o2240m9362k820
$$ 113085 87987 92699 97830 90730 121962 61303 -1030 103481 122050 59810 10448 7628
10187G628L5395r678O3943k4749K7467J14980j0974r1043l3209R4872J0953K3466
$$ 7628 43023 33345 97288 72539 100006 214986 204012 112969 79760 174632 185585 209051
10175B09051l815m7599N8793j1499O8284Q4360p146j9835m1038l5601J2595m6069
$$ 209051 205236 157637 216430 204931 273215 357575 350429 330594 289556 253955 266550 220481
10163B20481P831N255K4196J09623O1575M8319R3898K1362N4498n57o7635L5395
$$ 220481 228312 233567 257763 367386 428961 477280 571178 592540 647038 646481 578846 614241
10151F14241m5635K0791P4570J00492N4685n906l7509k014n2936r5265q6853O312
$$ 614241 568606 589397 663967 764459 819144 813238 775729 773715 720779 625514 538661 544973
10139E44973K374L5195L6226k0332J4619K37j3316p0579q7763k1064o0470n1147
$$ 544973 547347 582542 618768 598436 613055 613292 599976 529397 441634 420570 360100 308953
10127C08953n5965p9125M8571L268P742j3306l5733j7593K7610J3684O2770n1939
$$ 308953 252988 173863 222434 225702 233444 220138 184405 166812 194422 208106 270876 218937
10115B18937J911J7898N3918K8357K2515q2366K4339J7415l7169j5019K6400J0515
$$ 218937 220848 238746 292664 321021 343536 261170 285509 302924 265755 250736 277136 287651
10103B87651j6029q8079j07094N4119N4316J8579J04464M0273r5789N90p4478
$$ 287651 271622 183543 76449 130568 184884 203463 307927 348200 252411 253001 178523
10092A78523L6286P2647l7762J5197j3179K5112k4600J4870j2742j0380j651m4613
$$ 178523 214809 287456 249694 264891 251712 276824 252224 267094 254352 243972 242321 197708
10080A97708r346P1645Q1450m7942K1165L3234q7707k8333N3437Q6486M0164m023
$$ 197708 188362 260007 341457 293515 314680 347914 260207 231874 285311 371797 411961 407938
10068D07938m7643m1906M2505j5090K5559r379k9304J7070k654l8088m4322n6055
$$ 407938 360295 318389 360894 345804 371363 361984 332680 349750 347096 309008 264686 208631
10056B08631K2440N7844J9376n5162m6735L6686J6615O7385J47436m711p8636
$$ 208631 231071 288915 308291 253129 206394 243080 259695 327080 474516 469805 391169
10045C91169p904k4438l077m382k4870J0038l7816j00669j8110N5855M7906j7856
$$ 391169 383265 358827 355750 351368 326498 336536 298720 198051 179941 235796 283702 265846
10033B65846J7593m5110p1480L122J0231L3881M3130l2626o852j20110q9842K9480
$$ 265846 283439 238329 166849 169971 180202 214083 257213 224587 217735 97625 7783 37263
10021C7263J35685Q1314J7710l2956l0948p419L0553q0523J0428N1668R222L6535
$$ 37263 172948 254262 271972 239016 208068 200649 231202 150679 161107 212775 221997 258532
10009B58532J0378o8993m2475O861L835j8331q6284k4920P9651P5082l2924N0727
$$ 258532 268910 199917 157442 164303 168138 149807 63523 38603 118254 193336 160412 211139
9997B11139m8384m3098m4333O418J8486k1736M1179K2506q4402k4143R011O1380
$$ 211139 162755 119657 75324 81742 100228 78492 119671 142177 57775 33632 42643 104023
9985A04023M1057P2610K848r9418K4622k7237l0919Q7911L7687q1192M2515p2692
$$ 104023 145080 217690 220538 121120 145742 118505 87586 175497 213184 131992 174507 101815
9973A01815N5432M6523m6935Q9762j5865l5139N2333Q3339l3537k3407o3592p0595
$$ 101815 157247 203770 156835 246597 230732 195593 247926 331265 297728 274321 210729 140134
9961A40134P0311M0564l0041m6084J7829K7847m4887j4879N979n2903n838N0408
$$ 140134 210445 251009 220968 174884 192713 220560 175673 160794 166773 113870 108032 158440
9949A58440O2401r196K1718j8415j0801K209k3073L8297O869o4970N4364k322
$$ 158440 220841 211645 233363 214948 204147 206356 183283 221580 228449 163479 217843 215521
9937B15521o6457o1790n6809R0970K6747L0214L3978O467M5218O540K8842l5095
$$ 215521 149064 87274 30465 121435 148182 178396 212374 218841 264059 270599 299441 264346
9925B64346m4332n4811m8502M1860O0375o986L8805o1263n2977m232O6787K9094
$$ 264346 220014 165203 116701 158561 218936 211950 250755 189492 136515 132283 199070 228164
9913B28164j0194K2671J3738K7852J7734J4736j21145P886M8697o6831L088N3656
$$ 228164 217970 240641 254379 282231 299965 314701 193556 201442 250139 183308 186396 240052
9901B40052m2543N8918N3653n0150O616k830l0228j4118L7879L0257J07150Q5597
$$ 240052 197509 256427 310080 259930 266546 263716 233488 219370 257249 287506 394656 480253
9889D80253j00671j65367l9976P1203O2406R181L1578k001j17212J2229J03533
$$ 480253 379582 214215 174239 245442 307848 317029 348607 346606 229394 241623 345156
9878C45156L8349p7568q9008R5885K5625j9952J9297J9421k3394Q0786O6964J18
$$ 345156 383505 305937 216929 312814 338439 318487 337784 357205 333811 414597 481561 481679
9866D81679n0623k8947Q016l6973n1261J1313M6499j4550K8726M256o3916M2988
$$ 481679 431056 402109 410125 373152 321891 333204 379703 365153 393879 398135 334219 377207
9854C77207J09995L7203l1813k9887m172o0246o0262q365L2355n261J1756k2797
$$ 377207 487202 524405 492592 462705 458533 398287 338025 329660 362015 356754 368510 345713
9842C45713J2101N6938K1919l2745k5332J8458P8219O3215k2625n865p5326j01412
$$ 345713 357814 414752 436671 403926 378594 397052 475271 538486 515861 509996 434670 333258
9830C33258j7875L4144M1344K30J5990M9984P450j9621m573l3558K6426M3055
$$ 333258 315383 349527 390871 391101 407091 457075 464525 444904 440331 406773 433199 476254
9818D76254l072O0155L004j6402Q7142M5918J6416k1149k8265K2070L6900J08655
$$ 476254 473182 533337 536341 519939 607081 652999 669415 648266 620001 642071 678971 787626
9806G87626J032k3165P8312R1196j9693m4242J6371L8064J05911O0178l8651p6148
$$ 787626 788658 765493 843805 935001 915308 871066 887437 925501 1031412 1091590 1052939 976791
9794I76791N458J22115J21781O0874J06285P6469J1698m7008l4430K2794J35342
$$ 976791 982249 1104364 1226145 1287019 1393304 1469773 1481471 1434463 1400033 1422827 1558169
9783A558169J58907J58541K16257K02084J94436J45272K11180L52076L05944K29976
$$ 1558169 1717076 1875617 2091874 2293958 2488394 2633666 2844846 3196922 3502866 3732842
9773C732842L39188M08050L80724L06019M53985M37330L47680L43689L91779M03665
$$ 3732842 4072030 4480080 4860804 5166823 5620808 6058138 6405818 6749507 7141286 7544951
9763G544951M63737L48201L92539L53101L26985K82677L44750M09469M84485O37065
$$ 7544951 8008688 8356889 8749428 9102529 9429514 9712191 10056941 10466410 10950895 11587960
9753A1587960P04494P53568Q60679R72110R88550J008391R19658Q29480O57513
$$ 11587960 12292454 13046022 13906701 14878811 15867361 16875752 17795410 18624890 19282403
9744A9282403M96630M58040L12515L14705J24778P5354K1879m9553n9129o7113
$$ 19282403 19779033 20237073 20549588 20864293 20989071 21064425 21086304 21036751 20977622 20910509
9734B0910509j32879p4860j33074j6965P0387J98050L53030M54231M32975L55988
$$ 20910509 20777630 20702770 20569696 20552731 20623118 20821168 21174198 21628429 22061404 22417392
9724B2417392K42048K25173J06153k1880l3625j33335l62344n10858o44464o98029
$$ 22417392 22659440 22884613 22990766 22968886 22935261 22801926 22439582 21928724 21284260 20586231
9714B0586231o75594p77274p36662p54529q48934q00058o90853o88663m97524
$$ 20586231 19910637 19133363 18396701 17642172 16793238 15993180 15302327 14613664 14116140
9705A4116140l67748l48473l36631k99996l30948l23231l05162k38386k32882
$$ 14116140 13748392 13399919 13063288 12763292 12432344 12109113 11803951 11565565 11332683
9696A1332683k93578k28816j88182j8664k2025K5738N6215J02639J71760K39826
$$ 11332683 11039105 10810289 10622107 10603443 10581418 10607156 10663371 10766010 10937770 11177596
9686A1177596K97593M16170N34756N89364O22043O17441O03745O51771P06463
$$ 11177596 11475189 11891359 12426115 13015479 13637522 14254963 14858708 15510479 16216942
9677A6216942O25735O36984P66651Q30740O33422O31741Q13896P77284Q46623
$$ 16216942 16842677 17479661 18246312 19077052 19710474 20342215 21156111 21933395 22780018
9668B2780018Q37210R30115R66188J085898J260203J388214J450055J621602J609817
$$ 22780018 23617228 24547343 25513531 26599429 27859632 29247846 30697901 32319503 33929320
9659C3929320J534500J399966J393895J273915J081199J010091P75107N26700
$$ 33929320 35463820 36863786 38257681 39531596 40612795 41622886 42397993 42924693
9651D2924693L90474K44898P5913j98354l43650m51589m49724m44944l93315k16612
$$ 42924693 43315167 43560065 43635978 43437624 43093974 42642385 42192661 41747717 41354402 41137790
9641D1137790p1605K7929K9657J6284p465j0853L2940J7577k10666l32976l02231
$$ 41137790 41066185 41094114 41123771 41140055 41132590 41121737 41154677 41172254 40961588 40628612 40326381
9630D0326381k73578n07286p76946r90100j187195j389405j527263j634613j687437
$$ 40326381 40052803 39545517 38768571 37778471 36591276 35201871 33674608 32039995 30352558
9621C0352558j623460j556625j484409j344351j218823j194715j059108r02843
$$ 30352558 28729098 27172473 25688064 24343713 23124890 21930175 20871067 19968224
9613A9968224r02190q35244q22837p60348p61043p59924p54731o89397p13490
$$ 19968224 19066034 18230790 17407953 16647605 15886562 15126638 14371907 13682510 12969020
9604A2969020p34452p31394p19696p85922q32886p17265o10574n82844o21135
$$ 12969020 12234568 11503174 10783478 9997556 9164670 8447405 7836831 7253987 6632852
9595F632852n14023n63248m96396k79929k90663k33781k59077j88495k02436r9108
$$ 6632852 6118829 5555581 5059185 4779256 4488593 4254812 3995735 3807240 3604804 3505696
9585C505696r0952j35714j77164p1940q8096m8809m3143n3265p6748l1351P1266
$$ 3505696 3414744 3279030 3101866 3029926 2941830 2893021 2849878 2796613 2719865 2688514 2759780
9574B759780M3312J6712P8798O9619J60123N5292R8001J62453J66821K31435K35453
$$ 2759780 2803092 2819804 2898602 2968221 3128344 3183636 3281637 3444090 3610911 3842346 4077799
9563D077799K97230M24284M29672M47706N01122O21652P51238Q14723R34519R92795
$$ 4077799 4375029 4799313 5228985 5676691 6177813 6799465 7550703 8365426 9299945 10292740
9553A0292740J032372J065405J107527J000902P93394M89465L54895K600m11724
$$ 10292740 11325112 12390517 13498044 14498946 15292340 15781805 16136700 16139300 15727576
9544A5727576o29758p48709p92620p61269o53346n80356m68863l72839k40169
$$ 15727576 15097818 14349109 13556489 12795220 12141874 11561518 11092655 10719816 10479647
9535A0479647p9028J38612J10545K88674M29762N66403P09734Q31952Q36377Q53022
$$ 10479647 10400619 10539231 10649776 10938450 11368212 11934615 12644349 13476301 14312678 15165700
9525A5165700Q71375P36892M67691K06366j052l84891p71680r18394r91776j104886
$$ 15165700 16037075 16773967 17241658 17448024 17446972 17062081 16290401 15372007 14380231 13275345
9515A3275345j049266j013316q56707p70142p55383o20480n67914m88565l88477
$$ 13275345 12226079 11212763 10356056 9585914 8830531 8210051 7642137 7153572 6765095
9506F765095k83138k30819j79736j01905j03649n2491n307k2993P0503J74007
$$ 6765095 6481957 6251138 6071402 5969497 5865848 5813357 5808050 5785057 5855560 6029567
9496F029567J20325J29614K01990L53073L80407M81493O13062P38448P48548Q52071
$$ 6029567 6149892 6279506 6481496 6834569 7214976 7696469 8309531 9047979 9796527 10648598
9486A0648598R61283J086990J280449J252481J397430J611866J501374J416047
$$ 10648598 11609881 12696871 13977320 15229801 16627231 18239097 19740471 21156518
9478B1156518J375186J272141J037619R17572P62859N73297L56191K13002M0087
$$ 21156518 22531704 23803845 24841464 25759036 26521895 27095192 27451383 27664385 27704472
9469B7704472l33133n20284n56334n01254l70855l51550l5356J91886L52604N32114
$$ 27704472 27371339 26851055 26294721 25793467 25422612 25071062 25035706 25227592 25580196 26112310
9459B6112310P04070P32408P39308P59913O78232L69616L08062K18466J74973
$$ 26112310 26816380 27548788 28288096 29048009 29726241 30095857 30403919 30622385 30797358
9450C0797358p9866j90002k68906l38864n85390n72612p27049q88183j037986
$$ 30797358 30717492 30527490 30258584 29919720 29334330 28761718 28034669 27146486 26108500
9441B6108500j215554j350099j415011j208615r56491r11608q04907p18179o62199
$$ 26108500 24892946 23542847 22127836 20919221 19962730 19051122 18246215 17528036 16865837
9432A6865837p32474p25713p33282q15165r38487q23612p92465p24020n42195
$$ 16865837 16133363 15407650 14674368 13859203 12920716 12097104 11304639 10580619 10038424
9423A0038424n40717n01202m48081l21366j91809j97826q9959M2355R0383J35053
$$ 10038424 9497707 8996505 8548424 8227058 8035249 7837423 7747464 7789819 7880202 8015255
9413H015255K28972K84816L39305M09692N24961O23422Q13646R34122R20551Q73715
$$ 8015255 8244227 8529043 8868348 9278040 9803001 10426423 11240069 12174191 13094742 13968457
9403A3968457R48284J054843Q89270P10688M81847J97351R1555J40910O6504J40513
$$ 13968457 14916741 15971584 16860854 17571542 18053389 18250740 18342295 18483205 18549709 18690222
9393A8690222O8775J61898L71372M43841M97534N26128L53804K09393K70536L07296
$$ 18690222 18758997 18920895 19292267 19736108 20233642 20759770 21113574 21322967 21593503 21900799
9383B1900799K87225L35998K83281K67611L32737K34575J51517J58224J27134
$$ 21900799 22188024 22524022 22807303 23074914 23407651 23642226 23793743 23951967 24079101
9374B4079101p5184l08730n27736p21712p79331q12694p18299o57572n51997l63829
$$ 24079101 24003917 23695187 23167451 22445739 21666408 20853714 20135415 19477843 18925846 18562017
9364A8562017k57543k09763k62337k99585l03497m35913n19108n40722o14520
$$ 18562017 18304474 18094711 17832374 17532789 17229292 16793379 16274271 15733549 15119029
9355A5119029o94827p17774p21059q58886r28786q41799q39011q02220p21361
$$ 15119029 14424202 13706428 12985369 12126483 11197697 10355898 9516887 8714667 7993306
9346G993306o52862o37097n11812m07982n67300m14532k62037k81739k73397j79394
$$ 7993306 7340444 6703347 6191535 5783553 5216253 4801721 4539684 4257945 3984548 3805154
9336C805154k47936k10380n7757K9247o517k453L4244K4425L1128r9198J9280
$$ 3805154 3557218 3346838 3289081 3318328 3311811 3309358 3343602 3368027 3399155 3299957 3319237
9325C319237Q6211Q3665K40966K49789K59827K56338K87701L36283L93997M31104
$$ 3319237 3405448 3489113 3730079 3979868 4239695 4496033 4783734 5120017 5514014 5945118
9315E945118N21565M99554N09407N30431M05078L11998K07076l8872k44638n03465
$$ 5945118 6466683 6966237 7475644 8006075 8411153 8723151 8930227 8891355 8646717 8143252
9305H143252o11100m39678n09125n33215m27312k39302k32969k29656r8361j5928
$$ 8143252 7532152 7092474 6583349 6050134 5622822 5383520 5150551 4920895 4822534 4806606
9295D806606L6783N0569J02502J12528K15163L04686L89930L82477L55086L77579
$$ 4806606 4843389 4893958 4996460 5108988 5324151 5628837 6018767 6401244 6756330 7133909
9285G133909L32039R5386k4508k13929k60215m61326n68600o22758n79030n82638
$$ 7133909 7465948 7561334 7536826 7322897 7062682 6601356 6032756 5409998 4830968 4248330
9275D248330m35910l56095l79575k96846j81846k20101k11459k09842j13153j37147
$$ 4248330 3812420 3456325 3076750 2779904 2598058 2377957 2166498 1956656 1843503 1706356
9265A706356r8399j59870j17716q3783r2814J6287m2505r0118n0065K7580N396
$$ 1706356 1607957 1448087 1330371 1246588 1153774 1170061 1127556 1037438 987373 1014953 1020349
9254A020349r5290m983k6420j15479O8511m1046K7949k1335q6822r4754j8685
$$ 1020349 925059 920076 893656 778177 846688 805642 833591 812256 725434 630680 611995
9243F11995P0668N0451o6024j16858k7518L4135M0506p6853O861l2564L5997m6605
$$ 611995 682663 733114 667090 550232 522714 556849 597355 520502 527363 494799 530796 484191
9231D84191j6037M8524j6101L587k6857L718K1386j0877l9305K7927m1693q216
$$ 484191 468154 516678 500577 504164 477307 481025 502411 491534 452229 480156 438463 430247
9219D30247l9602k4585r3524K1855L8156Q099L4927Q5683o397p9802l2349j51
$$ 430247 390645 366060 272536 294391 332547 340646 375573 461256 454859 375057 342708 342557
9207C42557M5519n627K2342L6190l3815M604k1271p3392l2506M3383O1694R0353
$$ 342557 388076 382449 404791 440981 407166 411770 390499 317107 284601 327984 389678 480031
9195D80031m45j09324q4961N949j8731K7513P0995m9112p1216K3775M7515j01981
$$ 480031 479586 370262 285301 291250 272519 300032 371027 321915 250699 274474 321989 220008
9183B20008n4489o7579l2306P6153O4785l1091p0125m5627L4399n288k1364K0938
$$ 220008 165519 97940 65634 141787 206572 175481 105356 59729 94128 88840 67476 88414
9171H8414O4893O7425r5697p3760M3164N8935L2134l433L7251l2977j7369m6291
$$ 88414 153307 220732 125035 51275 94439 153374 185508 182075 219326 186349 168980 122689
9159A22689M0425k7765o0161q892J2691n159J8050p0682k0297M7382J14470P2333
$$ 122689 163114 135349 75188 66296 78987 73828 91878 21196 899 48281 162751 235084
9147B35084n5882p883R272l3424M3246N7097q919k6443M593k1311o276N3830q0801
$$ 235084 179202 171319 180591 147167 190413 247510 238591 212148 216741 195430 189154 242984 162183
9134A62183l4478M4990j7173M983J2906m2526j10757O0214J10953P717J5586L0696
$$ 162183 127705 172695 155522 160505 173411 130885 20128 80342 191295 199012 214598 245294
9122B45294J9044q258r2455j08501o6864N7986N6520l2542j290k891P3856P3723
$$ 245294 264338 256080 163625 55124 -11740 46246 102766 70224 68934 66043 139899 213622
9110B13622r363j0264J2795J2482k5725l8340r3913p2605L5623N2935L8475Q304
$$ 213622 204259 193995 206790 219272 193547 155207 61294 -11311 24312 77247 115722 124026
9098A24026O3755l6218j05978M252M8824O3746j4122K2054o5620K5730q29N1411
$$ 124026 187781 151563 45585 49837 98661 162407 148285 170339 104719 130449 129620 181031
9086A81031N10k951r9710k4548R3639p591m3675k1203M635j8902O0377M0312R9893
$$ 181031 181541 178590 78880 54332 147971 140380 96705 75502 80137 61235 121612 161924 261817
9073B61817L0609m4702o3224q896p3915j0344O6746J6521K1277p9715L3825j2701
$$ 261817 292426 247724 184500 175604 101689 91345 158091 174612 195889 116174 149999 137298
9061A37298L8375Q9755m0155l7369M2246N5987o6579m4262k7968J1908k0687k4558
$$ 137298 175673 265428 225273 187904 230150 286137 219558 175296 147328 159236 138549 113991
9049A13991K5312j6531M3394M3764Q6670K0281n0850j3603o3366p4671N9859j5631
$$ 113991 139303 122772 166166 209930 296600 316881 266031 252428 189062 114391 174250 158619
9037A58619Q326m047P1587L2816M3658O040q7677j08471p3362J554j5281k2254
$$ 158619 166945 162898 234485 267301 310959 316999 229322 120851 47489 49043 33762 11508
9025A1508M7109J30812J3308m1104J1762k9803j9241K355N205m634N0418k0363
$$ 11508 58617 189429 202737 161633 173395 143592 124351 126706 131911 127277 177695 157332
9013A57332n1548j9791j03696k0554O3267K7382O3213j60R552l9233O3094l4351
$$ 157332 105784 85993 -17703 -38257 25010 52392 115605 115445 124997 85764 148858 114507
9001A14507K141J9679N6436L6653n946j8463k8497j05416R674O5637K5302L8230
$$ 114507 116648 136327 192763 229416 223470 205007 176510 71094 80768 146405 171707 209937
8989B09937N353m1414k682M0927j9145j6102J1167N5568K705r7923m0325n6485
$$ 209937 215290 173876 171194 212121 192976 176874 188041 243609 246314 148391 108066 51581
8977E1581j119M8792J09467R4076p6021j0008r154J6145n6492n8769K5951N2766
$$ 51581 50462 99254 208721 302797 226776 216768 207614 223759 167267 108498 134449 187215
8965A87215M797n5712l7852o680M4215O1304j9082j9640L8051n6467o0776l3901
$$ 187215 192012 136300 98448 91768 135983 197287 178205 158565 196616 140149 79373 45472
8953D5472M3030R2972k8113l1903k4204L9254Q253N3272L9461N4661M7400K102
$$ 45472 88502 181474 153361 121458 97254 136508 144761 198033 237494 292155 339555 341657
8941C41657J9211k9671j11780P8930L9734k1212q2320r9809q7793l5750j3623
$$ 341657 360868 331197 219417 298347 338081 316869 234549 134740 46947 11197 -2426
8930b426M8049K7173K0587K0144n3875J2753L9708l5058j4680N5720P2715M5152
$$ -2426 45623 72796 93383 113527 59652 72405 112113 77055 62375 118095 190810 235962
8918B35962j03876l2495p398q398j3671m8508L8835k2586o8936P7601O3766Q7333
$$ 235962 132086 99591 92193 83795 70124 21616 60451 37865 -31071 46530 110296 197629
8906A97629n5826j08909o1127o514k5290O3431O2759M170j0581M1804P4058k4402
$$ 197629 141803 32894 -28233 -34747 -60037 3394 66153 70323 59742 101546 175604 151202
8894A51202m3587J7274N1278l0394p415K7134K1152J3637p7817j01331l8022m5184
$$ 151202 107615 124889 176167 145773 138358 165492 186644 200281 122464 21133 -16889 -62073
8882f2073O8125K3601N7116L1865n5644j32972q7154J6075J26392O3313l6813
$$ -62073 6052 29653 86769 118634 62990 -69982 -157136 -141061 -14669 48644 11831
8871A1831o4006j4134j5700L9124J58826N2447m3799k6061l1169r1847o1222r8587
$$ 11831 -52175 -66309 -82009 -42885 115941 168388 124589 98528 67359 -24488 -85710 -184297
8859a84297J00070J58271l7971q0348J6245K2091k5608J4158M2923Q8612k9637
$$ -184297 -84227 74044 36073 -44275 -28030 -5939 -31547 -17389 25534 114146 84509
8848H4509p9958q5311P1666J10781L4104p6153M793j9175m7204k0210j12019j249
$$ 84509 4551 -80760 -9094 101687 135791 59638 64431 45256 -1948 -22158 -134177 -135426
8836a35426m8948J3904O854O0649J12059P3167m3838L321l7801m6568M7724n5108
$$ -135426 -184374 -170470 -163616 -102967 9092 82259 38421 41742 3941 -42627 5097 -50011
8824e0011j0381R233L3232j1149m1979k413m384P3685J34927j5779j16819L6477
$$ -50011 -60392 -51159 -17927 -29076 -71055 -73468 -77852 -4167 130760 114981 -1838 34639
8812C4639o0058r5394K2425N0038J08275O2752q6172l7653k2959k3127N8339J3033
$$ 34639 -25419 -120813 -98388 -48350 59925 122677 36505 -1148 -24107 -47234 11105 24138
8800B4138K107P7763l2955o0538P2847O1570j0360o0410k6309n7008j486L8519
$$ 24138 26245 104008 71053 10515 83362 144932 134572 74162 47853 -9155 -10641 27878
8788B7878J10633K9323p5746j26404j9297o9583O6841J67393l3819p2061k5096
$$ 27878 138511 167834 92088 -34316 -53613 -123196 -56355 111038 77219 5158 -19938
8777a9938N8050M0042L7537k3868p0049M5831j06043n2810N6159P8625k9482n231
$$ -19938 38112 78154 115691 91823 21774 67605 -38438 -91248 -35089 43536 14054 8823
8765H823P507K9849n789j3076o0834r864n2487l9782M2276N6523N9218J9425p9723
$$ 8823 16330 46179 40390 27314 -33520 -43384 -95871 -135653 -93377 -36854 22364 41789 -37934
8752c7934m066o235J1318Q0276J5414K7742J148l8367K6863o3242M6578J9310
$$ -37934 -42000 -48235 -36917 43359 58773 86515 87663 49296 76159 12917 59495 78805
8740G8805L279k8861n0472L7038M5017L5765p6455j20020N0422L9081K9869L8756
$$ 78805 82084 53223 2751 39789 84806 120571 44116 -75904 -25482 13599 43468 82224
8728H2224n4726l4595R0508N696j2789n9345m4119M3940M9474K8572j33304r5557
$$ 82224 27498 -7097 83411 89107 76318 16973 -27146 16794 66268 94840 -38464 -134021
8716a34021Q7359N6285P1668J10238K836o5080p3909j10003O785K8437l0565N1272
$$ -134021 -46662 9623 81291 191529 194365 129285 55376 -54627 -47842 -19405 -49970 1302
8704A302J068N660N6072J08824L5049j6826K5591L570o0495j7989M8121l3753
$$ 1302 2370 8030 64102 172926 207975 191149 216740 220310 159815 141826 189947 156194
8692A56194r2478m1499j06192m5010O9496m6238j6081J3188N4913J3652m1712
$$ 156194 63716 22217 -83975 -128985 -59489 -105727 -121808 -108620 -53707 -40055 -81767
8681h1767O967l3012n8087J0734J06036L6536L8230J6596k7905j3355N0859j5209
$$ -81767 -74800 -107812 -165899 -155165 -49129 -12593 25637 42233 14328 973 51832 36623
8669C6623n243n826M8337j0411n2720L4095M5424p7251j4650M1770J9979l2759
$$ 36623 31380 25554 73891 63480 10760 44855 90279 13028 -1622 40148 60127 27368
8657B7368j01597n3796L8302K7671r525N2782q6467K8220L3045P3963r4469l6289
$$ 27368 -74229 -128025 -89723 -62052 -71577 -18795 -105262 -77042 -43997 29966 -64503 -100792
8645a00792P3642R580Q6497M4499l4319j283j03948J9265L9043J3434P1641j3344
$$ -100792 -27150 -17570 68927 113426 79107 77824 -26124 -6859 32184 45618 117259 103915
8633A03915m8905l3679m4219m8184J5950J35878P2257q6253o6297j345K8844M8495
$$ 103915 55010 21331 -22888 -71072 -55122 80756 153013 66760 463 -882 27962 76457
8621G6457P3957j4139K6357n9002r4281k5496j07820l2245Q9659P3862l8019j2018
$$ 76457 150414 136275 162632 103630 9349 -16147 -123967 -156212 -66553 7309 -30710 -42728
8609d2728Q4217O090J00325J1466k3460m1084r3274k0437K7913L0422M2406J01255
$$ -42728 41489 47579 147904 159370 135910 94826 1552 -18885 9028 39450 81856 183111
8597A83111l3507r6958n2804j7069k2965L7246n8194m0134J0547J15364M6506
$$ 183111 149604 52646 -158 -17227 -40192 -2946 -61140 -101274 -90727 24637 71143
8586G1143m8744k4539M053o9311p1863l787J72518P7892n0479r2470L795n106
$$ 71143 22399 -2140 1913 -67398 -139261 -143048 29470 107362 56883 -35587 -31792 -36898
8574c6898j7583k2344O3383M2078M1526K7219m3458l5661l9401m2885m9122M2892
$$ -36898 -54481 -76825 -13442 28636 70162 97381 53923 18262 -21139 -64024 -113146 -70254
8562g0254R0325j099O7440l9036n1387r4487l8224J6727J00177P1669q075l1427
$$ -70254 20071 18972 86412 47376 -4011 -98498 -136722 -119995 -19818 51851 43776 12349
8550A2349n0485n405L876O8038l1972j09770k5786J44124J1957n204K5138M255
$$ 12349 -38136 -43541 -39665 28373 -3599 -113369 -139155 4969 16926 11722 36860 41115
8538D1115L3389j556m3997k0644o476m3122M5123l6449r5464O3822P9781M9141
$$ 41115 74504 72948 28951 8307 1831 -41291 3832 -32617 -128081 -64259 15522 64663
8526F4663q7680n1969n6744N8668l514K373R2201j5157j6098K715L7665L4120
$$ 64663 -23017 -74986 -131730 -73062 -76576 -74203 17998 2841 -13257 -10542 27123 61243
8514F1243m4667l9034J8445M6504L3127r0415l9183J7370k707n2418k4022J12386
$$ 61243 16576 -22458 -4013 42491 75618 -14797 -53980 -36610 -39317 -91735 -115757 -3371
8502c371N4998p0131l6054m4742K8290o9930j125J21569L8731L1491P0023n5798
$$ -3371 51627 -18504 -54558 -99300 -71010 -140940 -142065 -20496 18235 49726 119749 63951
8490F3951o1160m6083l281O6212j5213N312K0393r773O9469m2101j43172l2221
$$ 63951 2791 -43292 -46573 19639 4426 9738 30131 20358 89827 47726 -95446 -127667
8478a27667N0000K8436K5392l0756K1255n376m8287K02J747J7608J8970n074R228
$$ -127667 -77667 -49231 -23839 -54595 -33340 -38716 -87003 -86801 -85054 -67446 -48476 -53550 -44322
8465d4322j2640L698Q9799J9009r7018j0209N2827q1526l8599K9902Q5423n7447
$$ -44322 -56962 -53264 36535 55544 -41474 -51683 1144 -80382 -118981 -89079 -3656 -61103
8453f1103M4681Q0539o7287j02164n2843M5829L9677P140J471n224m1284Q0650
$$ -61103 -16422 64117 -3170 -105334 -158177 -112348 -72671 -65531 -64060 -69284 -110568 -29918
8441b9918O7270J9056j7928n9587p589K8180J0153n5016r376K844N2533J17418
$$ -29918 37352 56408 38480 -21107 -28696 -516 9637 -45379 -54755 -51911 622 118040
8429A18040Q5279q2137k8739m3417n5938J5046N6287Q3193q107r2834j2673J06042
$$ 118040 203319 121182 92443 49026 -6912 8134 64421 147614 139507 46673 34000 140042
8417A40042P2688q4324o3630p6121P0058O1193N6808J6993m3114m3815m0776k7646
$$ 140042 212730 128406 64776 -11345 58713 119906 176714 193707 150593 106778 66002 38356
8405C8356M5680j8346r1613k3279J4311M3200l9741N866j5723k2135k1961j765
$$ 38356 84036 65690 -25923 -49202 -34891 8309 -31432 -25566 -41289 -63424 -85385 -87150
8393h7150j44l7507M5215O0736K4057O2905P4740K6951M5484m9575l3265L0246
$$ -87150 -87294 -124801 -79586 -18850 5207 68112 142852 169803 215287 165712 132447 162693
8381A62693j6910k5909j62O2806m605m9099k3562p9066j06081M2863J07392Q4376
$$ 162693 145783 119874 119712 182518 177913 128814 105252 26186 -79895 -37032 70360 154736
8369A54736o4477m7549M2336j2531J1992k7294l0139n6994p0180P3204M9346M2011
$$ 154736 90259 42710 85046 72515 84507 57213 27074 -29920 -100100 -26896 22450 64461
8357F4461l1666K9699o3055o3428O9064M4918N146k3709k7923Q167K1209J02674
$$ 64461 32795 62494 -561 -63989 5075 49993 55139 31430 3507 11674 32883 135557
8345A35557Q0278M4628J03537K5503k6466o1440n0252K4202o7270l9855R5564
$$ 135557 215835 260463 364000 389503 363037 301597 251345 275547 208277 168422 263986
8334B63986q694N4651J31392K49261M50372L18270o8349j81040k91940l22279
$$ 263986 255292 309943 441335 690596 1140968 1459238 1390889 1209849 917909 595630
8324E95630j51201j80622m9934n8567N666q7741r4135N3562N1630m2488N9857
$$ 595630 444429 263807 213873 155306 160972 73231 -20904 32658 84288 41800 101657
8313A01657L6786m8205m1562j4469M8482P5464R976M6308m1723l7831j18298j18057
$$ 101657 138443 90238 48676 34207 82689 158153 168129 214437 172714 134883 16585 -101472
8301a01472L6231M8968J23886m2518J9514R5950l9234l9425n518J1410P2083J60469
$$ -101472 -65241 -16273 107613 65095 84609 180559 141325 101900 96382 107792 179875 340344
8289C40344K61349K59956L91917Q43971R58971O5603l80803n48889q44242o11211
$$ 340344 601693 861649 1253566 2097537 3056508 3122111 2741308 2192419 1348177 736966
8279G36966k87061j26979k8023o4205k5464o9052M9221n322n2900m5490o0985
$$ 736966 449905 322926 294903 230698 205234 136182 185403 180081 127181 81691 20706
8268B0706L261J5142k393O7223J6962k786l1830m3051K3200P0205J5565l2061
$$ 20706 23967 39109 36716 103939 120901 118115 86285 43234 66434 136639 152204 120143
8256A20143m6829L2979N6730l9467n2901O6310n7489m4031k8456K5789R1941R4065
$$ 120143 73314 106293 163023 123556 70655 136965 79476 35445 6989 32778 124719 218784
8244B18784J48844J83475L02647M88504K54851j50186l16371k72122l22436k21223
$$ 218784 367628 551103 853750 1342254 1597105 1446919 1130548 858426 535990 314767
8234C14767j07480j08923l7126k0401j9790m2219J5054l0082m3083J2281N5866
$$ 314767 207287 98364 61238 40837 21047 -21172 -6118 -36200 -79283 -67002 -11136
8223a1136j4889J889J3445Q0407O8589n6204r060r1276j46954J914R2657O7479
$$ -11136 -26025 -24136 -10691 69716 138305 82101 73041 -18235 -165189 -163275 -70618 -3139
8211c139O3547P2973M9732q1019j43626p7393j5719p8757L3645M8653K8272K0109
$$ -3139 60408 133381 183113 102094 -41532 -118925 -134644 -213401 -179756 -131103 -102831 -82722
8199h2722o0840M945R607m97O6395M0087K9228P3321l9622M5237K7163o5903J0167
$$ -82722 -143562 -138617 -129010 -129507 -63112 -23025 6203 79524 39902 85139 112302 46399 56566
8186E6566j504m3865k6477k203j5350J79m2135k5679J0449P7643J3703M603j2796
$$ 56566 55062 11197 -15280 -17483 -32833 -32654 -74789 -100468 -90019 -12376 1327 5930 -6866
8173f866m2421k4597J3046M1651J5857K5015N4887m7481k40l2635j4808J002O8951
$$ -6866 -49287 -73884 -60838 -19187 -3330 21685 76572 29091 28851 -3784 -18592 -17590 51361
8160E1361J8865o8328o2106K5954p690N328l6623o5458L9181M7522N0107N7638
$$ 51361 70226 1898 -60208 -34254 -41944 -36616 -73239 -138697 -99516 -51994 -1887 55751
8148E5751p987j8143k9159m2085O4282L2389j0264r991r4810n3959j2314P3580
$$ 55751 47764 29621 462 -41623 22659 55048 44784 34793 -60017 -113976 -126290 -52710
8136e2710Q1059K1884p3809R87N1562M0659K7227l7525J0060P8027J44o0542o5773
$$ -52710 28349 50233 -23576 -22589 28973 69632 96859 59334 69394 147421 147565 87023 21250
8123B1250k1014M6500N630m946j09274K8204R8888R5742m947k9892m0308j14183
$$ 21250 236 46736 52366 47420 -61854 -33650 65238 160980 156033 126141 85833 -28350
8111b8350N1312O0853M315k1576J696N0257n9127j15183l4946L3599M8241K0680
$$ -28350 22962 83815 88130 66554 68250 118507 59380 -55803 -90749 -57150 -8909 11771
8099A1771o979l8667l1970r342L054J2360n2l717M083L1252O274Q8846J4564o372
$$ 11771 4792 -33875 -65845 -75187 -72133 -59773 -59825 -63542 -59459 -28207 -21933 66913 81477 75105
8085G5105k302j1051N3403o6038k4704J3617j9538k1422j8600N2084m6512q7399
$$ 75105 72803 61752 115155 49117 24413 38030 18492 -2930 -21530 30554 -15958 -103357
8073a03357j3541K0027J12M220M7259J24346Q6280k5725o2554o2881k5779k3561
$$ -103357 -116898 -96871 -96759 -92539 -45280 79066 165346 139621 77067 14186 -11593 -35154
8061c5154m181n9737O1766Q1688K8932K9758p4763j18833O321R988R7250Q9910
$$ -35154 -39335 -99072 -37306 44382 73314 103072 28309 -90524 -84203 -74215 23035 112945
8049A12945j5073o1810K476m4325J0988K2342k2081m5844K1152o256r516n6403
$$ 112945 97872 36062 38538 -5787 5201 27543 5462 -40382 -19230 -25486 -35002 -91405
8037i1405L4140O0560q869m3758O9755m5559j7939K5223R6115l2429j72756n996
$$ -91405 -57265 3295 -5574 -49332 20423 -25136 -43075 -17852 78263 45834 -126922 -132918
8025a32918J05433J25462l7757j47487n0699j2091m3000P501M5569J07590N0766
$$ -132918 -27485 97977 60220 -87267 -137966 -150057 -193057 -185556 -139987 -32397 18369
8014A8369j3773L9464M3502n5629k9946k8421j2647o1331k4109P1262L8260m308
$$ 18369 4596 44060 87562 31933 1987 -26434 -39081 -100412 -124521 -53259 -14999 -19307
8002a9307J6872M2443O0193L9052o3297o0834j0490p8546K8393N5350M9365j2056
$$ -19307 -2435 40008 100201 139253 75956 15122 4632 -73914 -45521 9829 59194 47138
7990D7138p5985k0888J7934P3814K4226L1469P991K4640N6558l4209j18159n3337
$$ 47138 -28847 -49735 -31801 42013 66239 97708 105699 130339 186897 152688 34529 -18808
7978a8808j1K4364k079R3230P5452j9455n1189p8803R227O5627k1331l3444j1490
$$ -18808 -18819 5545 3466 96696 172148 152693 101504 22701 31928 97555 76224 42780 31290
7965C1290L911n3636l3566O790Q9728J8501R176l8058m6867l0410L2593J05818
$$ 31290 35201 -18435 -52001 -45211 44517 63018 72194 34136 -12731 -43141 -10548 95270
7953I5270K3038j22943o7098O4870m340J5607N1821K5269K8192m3952j1133m040
$$ 95270 118308 -4635 -71733 -6863 -11203 4404 56225 81494 109686 65734 54601 50561
7941E0561k643J3192N4699k407J6050l3053K8696J4509k1907L921M227j1605o0730
$$ 50561 47918 61110 115809 113402 129452 96399 125095 139604 117697 121618 125845 114240 53510
7928E3510M7811Q3539K6799q1675j00469L4072l4051j148M51L9142K7792L0475
$$ 53510 101321 184860 211659 129984 29515 63587 29536 28388 28839 67981 95773 126248
7916A26248M2002J1287j09248p2597J2029o2063O647L5578P2770L4641K2413J8076
$$ 126248 168250 179537 70289 -2308 9721 -52342 -45695 -10117 62653 97294 119707 137783
7904A37783m3255j26579k8315N0259n1763n2720n7192k8200j9812R0005P375N7025
$$ 137783 94528 -32051 -60366 -10107 -61870 -114590 -171782 -199982 -219794 -129789 -122414 -65389
7892f5389R5120N7942o412q5785J5859J7430p6558n2744R606J7482n884P6219
$$ -65389 29731 87673 81261 -4524 11335 28765 -47793 -100537 -90931 -73449 -79333 -3114
7880c114N2709m8382p4126n4915P6459O4299q9592m1144l3580m6M0942j5774N423
$$ -3114 49595 1213 -72913 -127828 -51369 12930 -76662 -117806 -151386 -151432 -110490 -126264 -120841
7867a20841K8980J00182J6167K3492L5848J0973K1501j12178n0009l435M0342
$$ -120841 -91861 8321 24488 47980 83828 94801 116302 4124 -45885 -49320 -8978
7856h978J09028m1061j00298k9049M8545J3783k060j9699j4372P3579k481j9088
$$ -8978 100050 58989 -41309 -70358 -21813 -8030 -10090 -29789 -44161 29418 26937 7849
7844G849M817L3600p3670k6578N3753J0176j46363j12573K4930K6863K5564P8775
$$ 7849 12666 46266 -27404 -53982 -229 9947 -136416 -248989 -224059 -197196 -171632 -92857
7832i2857N2501r190k1171M8285J5243j0757K9345J1959N8625m7492J4233j4840
$$ -92857 -40356 -49546 -70717 -22432 -7189 -17946 11399 23358 81983 34491 48724 33884
7820C3884r6197n8851J09349J2590n4295K1640N7797N130J9782M8086l838r7166
$$ 33884 -62313 -121164 -11815 775 -53520 -31880 25917 31047 50829 98915 95077 -2089
7808b089N214m1998j3570M4227M5107K006l9785m4058O6529N3506k8787R526L8483
$$ -2089 3125 -38873 -52443 -8216 36891 38897 -888 -44946 21583 75089 46302 55828 94311
7795I4311j3862N434j9976j4986K6758J3265K1617N0039P6759l4435r6449r9016
$$ 94311 80449 85883 65907 50921 77679 90944 112561 162600 239359 204924 108475 9459
7783I459k1945P9162M3379o3110j11237p916O0691L9408N8567q6860n1515M8557
$$ 9459 -12486 66676 110055 46945 -64292 -72208 -11517 27891 86458 -402 -51917 -3360
7771c360J5289j5394j0612M8711K1491o1083L9501L4984M0843k9313r230L4191
$$ -3360 11929 -3465 -14077 34634 56125 -4958 34543 69527 110370 81057 71827 106018
7759A06018o7341j7066j1408J8566O796o1280J7962K0099K8240K3471r538K949
$$ 106018 38677 21611 10203 28769 35565 -25715 -7753 12346 40586 64057 54519 57468
7747E7468k9794N2487J7252j2699p2119r7804o4654P99M3496M5462o5006p2119
$$ 57468 27674 80161 97413 84714 12595 -85209 -149863 -149064 -105568 -60106 -125112 -197231
7735a97231J00220O2025k7955l4726P743n5680n7617P1013J49454J32833L5809
$$ -197231 -97011 -34986 -62941 -97667 -89924 -145604 -203221 -132208 17246 150079 185888
7724A85888l0281r7424r0340n1701l3412L5868R9914L0930r1904m5911j9785L2784
$$ 185888 155607 58183 -32157 -83858 -117270 -81402 18512 49442 -42462 -88373 -108158 -75374
7712g5374l7739J5439J0632L0155K7966N2389N2500J224O826j8652K1172q9707
$$ -75374 -113113 -97674 -87042 -56887 -28921 23468 75968 77192 84018 65366 86538 -3169
7700c169q3053J736O9815l2942n9527M1187J58127N3357m9609q4688m9885K2544
$$ -3169 -86222 -84486 -14671 -47613 -107140 -65953 92174 145531 95922 11234 -38651 -16107
7688a6107K6464k6749k7989N7416J6646j3898J5300L2207j5230j046N8416J6996
$$ -16107 10357 -16392 -44381 13035 29681 15783 31083 63290 48060 47014 105430 122426
7676A22426k7242r3982O543k5312M0975J2134l1431k9473L0325J5667J00765L0910
$$ 122426 95184 1202 7745 -17567 23408 35542 4111 -25362 4963 20630 121395 152305
7664A52305j8483N8368O7795m2828m9554q2740n8771L824J27327J5625n6074N0089
$$ 152305 133822 192190 259985 217157 167603 84863 26092 29916 157243 172868 116794 166883
7652A66883j00756n8680j5474m9926M9728m1313k9638K6830M2422L9387K236n8179
$$ 166883 66127 7447 -8027 -57953 -8225 -49538 -79176 -52346 -9924 29463 31699 -26480
7640b6480n9312R0855M527j15939K9227P7539K2394n4693k978n639p510K2697
$$ -26480 -85792 5063 9590 -106349 -77122 417 22811 -31882 -34860 -40499 -48009 -25312
7628b5312P8248Q158l9272q4140J61m7087K2384K9037R9486M4027r68n4237M1563
$$ -25312 52936 61094 21822 -62318 -62157 -109244 -86860 -57823 41663 85690 84722 30485 72048
7615G2048m6046m1511k6194K0105o1292m8216J825J0303L0903q359k732M6873
$$ 72048 26002 -15509 -41703 -21598 -82890 -131106 -129281 -118978 -88075 -96434 -99166 -52293
7603e2293J5187j14338k0443n21J23132J46720J9480m6165k8787K5934l4534q4754
$$ -52293 -37106 -151444 -171887 -172408 -49276 97444 116924 70759 41972 67906 33372 -51382
7591e1382m4076l1778M1173k7168M7588P3081N5559O4804J7322m6399q2920k6320
$$ -51382 -95458 -127236 -86063 -113231 -65643 7438 62997 127801 145123 98724 15804 -10516
7579a0516k7613j3611q0758j3034K4473K4107k4033j4389l218l9287L0236K7157
$$ -10516 -38129 -51740 -132498 -145532 -121059 -96952 -120985 -135374 -138592 -177879 -147643 -120486
7567a20486J52775J13272O4156n7464l7932r186p1938J7920O769p0649P448p0417
$$ -120486 32289 145561 209717 152253 114321 105135 33197 51117 57886 -12763 -5315 -75732
7555g5732j18719j2445L6654Q6604K8567j9399O149O8954R378n5866m7517L7935
$$ -75732 -194451 -206896 -170242 -83638 -55071 -74470 -68321 633 10011 -45855 -93372 -55437
7543e5437N9186m4244o6226m6064P3317L0968Q9960o4539l5424P413j470J9350
$$ -55437 3749 -40495 -106721 -152785 -79468 -48500 41460 -23079 -58503 -51090 -52560 -33210
7531c3210j6017J3323O7267K5152J0517l3657p4783N6693L0546j717m3767J6904
$$ -33210 -49227 -35904 31363 56515 67032 33375 -41408 15285 45831 44114 347 17251
7519A7251J1025p3826l2901K5201Q424O78j1645m2521k9446O4816l7386m3261
$$ 17251 28276 -45550 -78451 -53250 -44826 -44148 -55793 -98314 -127760 -62944 -100330 -143591
7507a43591J195J0882L0497L4093J00055L7115R315q7304p6788M3887m432j2321
$$ -143591 -142396 -131514 -101017 -66924 33131 70246 79561 -7743 -84531 -40644 -45076 -57397
7495e7397m819m559N5294K3121l2763m385J46947j3766r3077N9448K2406j4449
$$ -57397 -62216 -66775 -11481 11640 -21123 -25508 121439 107673 14596 74044 96450 82001
7483H2001l2314l2726R295k3906R2503N8850n111j2634n3175o8542j5747M44J4960
$$ 82001 49687 16961 26256 2350 94853 153703 148592 135958 82783 14241 -1506 -1062 13898
7470A3898o0295O4646K0780o3489l8788o243Q1256P0740Q3094k2309R809k7720
$$ 13898 -46397 18249 39029 -24460 -63248 -69491 11765 82505 165599 143290 153099 125379
7458A25379j9745j853o3989n1234L2960N4200m2990m4076m4186P41m7827N9636
$$ 125379 105634 103781 39792 -11442 21518 75718 32728 -11348 -55534 -54793 -102620 -42984
7446d2984R3675O5005l0108o1194j9239k9073j9351O7195J2842J0629o9192p9464
$$ -42984 50691 115696 85588 24394 5155 -23918 -43269 23926 36768 47397 -21795 -101259
7434a01259Q682K8111J10533L3663q957m3617J7244m7495L8625O9675J8271o4669
$$ -101259 -92577 -64466 46067 79730 70773 27156 44400 -3095 35530 105205 123476 58807
7422E8807q0227l6455Q7517K9698n0741K905K4667J2096k0995r4393r2576K6183
$$ 58807 -21420 -57875 29642 59340 8599 11504 36171 48267 27272 -67121 -159697 -133514
7410a33514K5881n8961o2474j5688P3641J85638R8280j4672p7334n4413N663j0533
$$ -133514 -107633 -166594 -229068 -244756 -171115 14523 112803 98131 20797 -33616 -27953 -38486
7398c8486j5767l9722J3674K2327P7532m9993o365l0494O284N2637r63N6090O2939
$$ -38486 -54253 -93975 -80301 -57974 19558 -30435 -36800 -67294 -61010 -8373 -9336 46754 109693
7385A09693m0431P086R566j0171m3696l2953n4089n3940j31160M4345M2244Q5252
$$ 109693 69262 76348 85914 75743 32047 -906 -54995 -108935 -240095 -195750 -153506 -68254
7373f8254k3693j7597q5817J9373r728P8476J53503L679o1662m9535K5358k9899
$$ -68254 -91947 -109544 -195361 -175988 -185716 -107240 46263 49942 -11720 -61255 -35897 -65796
7361f5796k0487l8426L155K6243O1900j5353L5710N5269K4557l0941n5317m4374
$$ -65796 -86283 -124709 -121554 -95311 -33411 -48764 -13054 42215 66772 35831 -19486 -63860
7349f3860J6574J8020L1501M3698k888j1796k0729o8845p9276k6560M40N8735
$$ -63860 -47286 -29266 2235 45933 43045 31249 10520 -58325 -137601 -164161 -163721 -104986
7337a04986j6746J8010J1953q0704m176N9817L5429J01562O0473j7664o3208l7304
$$ -104986 -121732 -103722 -91769 -172473 -176649 -116832 -81403 20159 80632 62968 -240 -37544
7325c7544M9769k0508k4854k0711m1945k7509L3367K8555N6855j5321o7323k0306
$$ -37544 12225 -8283 -33137 -53848 -95793 -123302 -89935 -61380 -4525 -19846 -87169 -107475
7313a07475L9442m9724k7835q7876M2127P0001M1984j9226k1751K4853K1258N4296
$$ -107475 -68033 -117757 -145592 -233468 -191341 -121340 -79356 -98582 -120333 -95480 -74222 -19926
7301a9926M1491J8257K7162r0489K1377o0570N0230J28601q698m9031J2751N8657
$$ -19926 21565 39822 66984 -23505 -2128 -62698 -12468 116133 107435 58404 71155 129812
7289A29812r3508j03089p080P0245n594k9623J9497m006k0077J0766K6199j2671
$$ 129812 36304 -66785 -73865 -3620 -9214 -38837 -19340 -23346 -43423 -32657 -6458 -19129
7277a9129o4304j7081k7401P9533N3097j02465p9971p6112R2663n6682L2803M8311
$$ -19129 -83433 -100514 -127915 -48382 4715 -97750 -177721 -253833 -161170 -217852 -185049 -136738
7265a36738m9973r287M0271L7097L0400N824M5669k1793l3012P0539R0718l5845
$$ -136738 -186711 -195998 -155727 -118630 -88230 -82406 -36737 -58530 -91542 -21003 69715 33870
7253C3870k4230j3904M642k2596p5608n2149N7815P4909O0257L1494m1200K8007
$$ 33870 9640 -4264 378 -22218 -97826 -149975 -92160 -17251 43006 74500 33300 61307
7241F1307l8662r8953q936N6247n1635o6256N4603O3567P130k2274j0965k9463
$$ 61307 22645 -76308 -85244 -28997 -80632 -146888 -92285 -28718 -21588 -43862 -54827 -84290
7229h4290j17036j0995J39006J09611k5172o2424L9896J5048n638L46O1512J4981
$$ -84290 -201326 -212321 -73315 36296 11124 -51300 -11404 3644 -1994 -1648 59864 74845
7217G4845k9328J13156J5501l0138K8056K8236o118j7416j12036r41J16261m0715
$$ 74845 45517 158673 174174 144036 172092 200328 194210 176794 64758 63817 180078 139363
7205A39363J9600L066n7605n3964p7201p0049M0828m3531M171Q0020N1618m0064
$$ 139363 158963 162029 104424 50460 -26741 -96790 -55962 -99493 -95322 -15302 36316 -3748
7193c748k6207l5103l5577O950j0365J216k9701J2348O0400N7389M7325J1886
$$ -3748 -29955 -65058 -100635 -93685 -104050 -102834 -132535 -120187 -59787 -2398 44927 56813
7181E6813m5269n1474k0562N7121J1295j5892L2134J3300l709j6883l0999O3085
$$ 56813 11544 -39930 -60492 -3371 7924 -7968 24166 37466 33757 16874 -14125 48960
7169D8960J8541o854j0657p3826N3000J5469L2147m8872q5442o2007L2215J06765
$$ 48960 67501 60647 49990 -23836 29164 44633 76780 27908 -57534 -119541 -87326 19439
7157A9439K73l9635M5166P5128K5355o6126r4234o7552J2821j7314K6432l7506
$$ 19439 19712 -19923 25243 100371 125726 59600 -34634 -102186 -89365 -106679 -80247 -117753
7145a17753J5396O1090l9396l4621M9095R5912n2751k9041l3527R2071J2172p6053
$$ -117753 -102357 -41267 -80663 -115284 -66189 29723 -23028 -52069 -85596 6475 18647 -57406
7133e7406j1927j6845p0225M3583N3774l4780M7224L7172m5483K8487j7104L2611
$$ -57406 -69333 -86178 -156403 -112820 -59046 -93826 -46602 -9430 -54913 -26426 -43530 -10919
7121a0919L9556N2743m8095r0833J9862R590l1707n93Q7558J7658k807r2404q9448
$$ -10919 28637 81380 33285 -57548 -37686 -28096 -59803 -60396 27162 44820 42013 -50391 -139839
7108a39839L1078O2630M8241N3588m8188r6483J0461K2092N2201j3664m9761o8583
$$ -139839 -108761 -46131 2110 55698 7510 -88973 -78512 -56420 -4219 -17883 -67644 -136227
7096a36227K7907L6392l2636N0162k807m5151P45L0557K5978J6159Q6430R827
$$ -136227 -108320 -71928 -104564 -54402 -57209 -102360 -101615 -71058 -45080 -28921 57509 67336
7084F7336j06208J0777k479j5055n0750l5429Q482N5742J1040J4206L8766J3372
$$ 67336 -38872 -28095 -30574 -45629 -96379 -131808 -123326 -67584 -56544 -42338 -3572 9800
7072I800M0372J2305n9661n4300J4593m3395L6097K7197O2952l3371q4720K3024
$$ 9800 50172 62477 2816 -51484 -36891 -80286 -44189 -16992 45960 12589 -72131 -49107
7060d9107J23503l3739q7339K89J13624J6106r8290l9400J7274L6619j7370L4681
$$ -49107 74396 40657 -46682 -46393 67231 83337 -14953 -54353 -37079 -460 -17830 16851
7048A6851P2258Q9946m4633q5983mK9706q508l2643k1805n7518M8495J2616o1494
$$ 16851 89109 179055 134422 48439 48435 78141 69633 36990 15185 -42333 6162 18778 -42716
7035d2716l3455j6725N6949M5789l3734m1185K5460J338m9120m1136J05434J09140
$$ -42716 -76171 -92896 -35947 9842 -23892 -65077 -39617 -38279 -87399 -128535 -23101 86039
7023H6039j3355q1335n6330J7673N5715n1002n4371N1693O9782J6065m8308j6404
$$ 86039 72684 -8651 -64981 -47308 8407 -42595 -96966 -45273 24509 40574 -7734 -24138
7011b4138M1191L7526j2534R1369l0262n9981n7060n1516K9870J10693J07538
$$ -24138 17053 54579 42045 133414 103152 43171 -13889 -65405 -35535 75158 182696
7000A82696K4011j15715p8700l4649k4720p824L643J8626K3839m1021r6886l1811
$$ 182696 206707 90992 12292 -22357 -47077 -54901 -51258 -32632 -8793 -49814 -146700 -178511
6988a78511K9435O3648J07953m1490q7443J6895R0790k6506l2714p737J4111M0105
$$ -178511 -149076 -85428 22525 -18965 -106408 -89513 1277 -25229 -57943 -65680 -51569 -11464
6976a1464K2037N604o3514L5106l938n3208M7861O3695J10843o6166j10676k6746
$$ -11464 10573 16177 -47337 -12231 -16169 -69377 -21516 42179 153022 86856 -23820 -50566
6964e0566l1577o4311N9715J3784O639J33568K5410l2581l7021l4673K5206o0848
$$ -50566 -82143 -146454 -86739 -72955 -66316 67252 92662 60081 23060 -11613 13593 -47255
6952d7255m5255J13165J22567l1136m8008m8659p519l557m6124k6144M8055k2451
$$ -47255 -92510 20655 143222 112086 64078 15419 7900 4343 -41781 -67925 -19870 -42321
6940d2321q4054m4208M5551J5900J18715P7971j8860j646p6259k3342N997J2013
$$ -42321 -126375 -170583 -125032 -109132 9583 87554 68694 67048 -9211 -32553 -26556 -14543
6928a4543J2449p0388o0340Q096J6512K9812N4162J2822m9749l4792J6908K84
$$ -14543 -2094 -72482 -132822 -124726 -108214 -78402 -24240 -11418 -61167 -95959 -79051 -78767
6916g8767P2407P0241k6683j03830M9465l4721n8602j5167m1239L2638j6351P2647
$$ -78767 -6360 63881 37198 -66632 -17167 -51888 -110490 -125657 -166896 -134258 -150609 -77962
6904g7962L6918N8798k7772j8209M115l9368j5147O16r9581o26L2047O5655R6561
$$ -77962 -41044 17754 -10018 -28227 -24112 -63480 -78627 -78011 -177592 -178218 -146171 -80516 16045
6891A6045L8236m263m1081P1927K8595r1269l6941L3190L0468M1827K1566j9666
$$ 16045 54281 50018 8937 80864 109459 18190 -18751 14439 44907 86734 108300 88634
6879H8634N31k0149k9129o7564l2206L0617l0157J7480M2582O7471J0850m3811
$$ 88634 89165 69016 39887 -27677 -59883 -29266 -59423 -41943 639 68110 78960 35149
6867C5149n0524L557l7763k0260O1457N2108R8268K0946j24256k8543Q6100N1800
$$ 35149 -15375 -11818 -49581 -69841 -8384 43724 141992 162938 38682 10139 96239 148039
6855A48039J5229l0677P96r5558l6065K373j815l3768o0856m1400L7328N4720
$$ 148039 163268 132591 133387 37829 1764 4137 2322 -31446 -92302 -133702 -96374 -41654
6843d1654K8238o6803L117P4673K3003o4206l7029j8275N0271R5079q7578p7952
$$ -41654 -13416 -80219 -77102 -2429 20574 -43632 -80661 -98936 -48665 46414 -41164 -119116
6831a19116M1055r595R2594M2441j1105l3817k6296m6135M178m2507J36932J46271
$$ -119116 -78061 -87656 4938 47379 36274 2457 -23839 -69974 -65796 -108303 28629 174900
6819A74900l7682l5794K2240j3971n781m473k3843n6477j9340J7416p0816p5343
$$ 174900 137218 101424 123664 109693 103912 99439 75596 19119 -221 17195 -53621 -128964
6807a28964M0386Q9439J07440q7683j02063o491r092Q1316n2090r63N8106J188
$$ -128964 -88578 861 108301 20618 -81445 -87936 -97028 -15712 -67802 -68765 -10659 -9471
6795i471M0903j0796p5592J1781M9952J8130j9286n5271O7243L3935N6098p3350
$$ -9471 31432 20636 -54956 -43175 6777 24907 5621 -49650 17593 51528 107626 34276
6783C4276j12469N2569N8795J5666j3707n889n0899K6617m5425j3534N919k1504
$$ 34276 -78193 -25624 33171 48837 35130 29241 -21658 4959 -40466 -54000 -48081 -69585
6771f9585l2095q5847J7674j374m7463L5054J40817M4743l2927N884N3196q6655
$$ -69585 -101680 -187527 -169853 -171227 -218690 -183636 -42819 1924 -31003 -25119 28077 -58578
6759e8578j8160k8065j7347K5594j6577j3527l4438N241K7888L1117P4857N7836
$$ -58578 -76738 -104803 -122150 -96556 -113133 -126660 -161098 -155857 -127969 -96852 -21995 35841
6747C5841K0336J3316l1159K8355Q9745K266l2283p4107q4701k2633L2113p955
$$ 35841 56177 69493 38334 66689 156434 158700 126417 52310 -32391 -55024 -22911 -30866
6735c0866k2488J6585K7185K5731L9345L0036l0008l1672M284l5913Q445M2626
$$ -30866 -53354 -36769 -9584 16147 55492 85528 55520 23848 28132 -7781 664 43290
6723D3290N2595l9632p8057k1876r0288K135J03492O1116N7737N1761k5306p1764
$$ 43290 95885 56253 -21804 -43680 -133968 -131833 -28341 32775 90512 142273 116967 45203
6711D5203k9397m7568m3031k2450J6675P739n3197K3410K7841K9250J32761k3422
$$ 45203 15806 -31762 -74793 -97243 -80568 -72829 -126026 -102616 -74775 -45525 87236 63814
6699F3814k3547l5232p8221r4811o2118j5649N3024N2366N3504J4211J02013L4849
$$ 63814 40267 5035 -73186 -167997 -230115 -245764 -192740 -140374 -86870 -72659 29354 64203
6687F4203n7194j3260L0408r5366k9662J10253J38349j2560l6767j5978N6807
$$ 64203 7009 -6251 24157 -71209 -100871 9382 147731 135171 98404 82426 139233
6676A39233n6830p7274O4082O4136r9713k5427O1668k6796Q242R55Q7299L9826
$$ 139233 82403 5129 69211 133347 33634 8207 69875 43079 51321 52276 139575 179401
6664A79401j01207k8662N4173M2106P9019n589r244m7879o862j11584m0898j3337
$$ 179401 78194 49532 103705 145811 224830 219241 209997 162118 155256 43672 2774 -10563
6652a0563K4558M2204M5857j1412n6042k7960m2052n2752j6803r834J29301R0668
$$ -10563 13995 56199 102056 90644 34602 6642 -35410 -88162 -104965 -114799 14502 105170
6640A05170P323l1591n2012K9617k9411K9547M1372j1417p2890m347l4361L5250
$$ 105170 112493 80902 28890 58507 29096 58643 100015 88598 15708 11361 -23000 12250
6628A2250K5251j6623j2619O0471l4301k1235J8240P031k5425q4902k5924m0273
$$ 12250 37501 20878 8259 68730 34429 13194 31434 38465 13040 -71862 -97786 -138059
6616a38059L2142K7804n6866P9233J49510O4932j9766j20115L2920l8583R9690
$$ -138059 -105917 -78113 -134979 -55746 93764 158696 138930 18815 51735 13152 112842
6605A12842j3070j06756j48893l0712K2642j1469r662M1031K5107m7379l9140
$$ 112842 99772 -6984 -155877 -186589 -163947 -175416 -185078 -144047 -118940 -166319 -205459
6594b05459L8163J1911k2636L4920N5545r00O6643M2289k508p2878J7531m5628
$$ -205459 -167296 -155385 -178021 -143101 -87556 -88456 -21813 20476 17968 -54910 -37379 -83007
$$ [...]
##END NTUPLES=NMR SPECTRUM
##END=
