##TITLE=Analysis number 316183
Compound Code sew 04470
Project Code adrs
Chemist Name ugmt
##JCAMPDX= 6.0         $$ Bruker NMR JCAMP-DX V2.0
##DATA TYPE= NMR SPECTRUM
##DATA CLASS= NTUPLES
##ORIGIN= Bruker BioSpin GmbH
##OWNER= nmr
$$ XWIN-NMR		Version 3.5
$$ Tue Jan  3 12:12:16 2006 GMT Standard Time (UT+0h)  MAYBRIDGE\nmr@NMR_250MHZ
##.OBSERVE FREQUENCY= 250.131544655141
##.OBSERVE NUCLEUS= ^1H
##.ACQUISITION MODE= SIMULTANEOUS (DQD)
##.ACQUISITION SCHEME= undefined
##.AVERAGES= 16
##.DIGITISER RES= 18
##SPECTROMETER/DATA SYSTEM= dpx250
##.PULSE SEQUENCE= zg30
##.SOLVENT NAME= CDCl3
##.SHIFT REFERENCE= (INTERNAL, CDCl3, 0, 16.4444)
##AUDIT TRAIL= $$ (NUMBER, WHEN, WHO, WHERE, WHAT)
$$ ##TITLE= Audit trail, XWIN-NMR		Version 3.5
$$ ##JCAMPDX= 5.01
$$ ##ORIGIN= Bruker BioSpin GmbH
$$ ##OWNER= nmr
$$ C:\u/data/dgb/nmr/ADRS/14100/pdata/1/auditp.txt
$$ ##AUDIT TRAIL=  $$ (NUMBER, WHEN, WHO, WHERE, WHAT)
(   1,<2006-01-03 12:11:55.03 +000>,<MAYBRIDGE\nmr>,<NMR_250MHZ>,
      <created by zg, POWCHK disabled, PULCHK disabled
       configuration hash MD5:
       62 19 C7 07 E1 42 D1 B7 37 6C 3D D0 77 39 F9 E6
       data hash MD5: 64K
       E9 EA 23 53 2B 36 C3 DC 0A 85 F5 1C 08 91 BC 78>)
(   2,<2006-01-03 12:12:07.85 +000>,<MAYBRIDGE\nmr>,<NMR_250MHZ>,
      <Start of raw data processing
       ef LB = 0.3 FT_mod = 6 PKNL = 1 SI = 32K 
       data hash MD5: 32K
       C8 D5 C1 A6 97 ED D7 F0 B3 29 DB 6E 63 88 9C 12>)
(   3,<2006-01-03 12:12:09.72 +000>,<MAYBRIDGE\nmr>,<NMR_250MHZ>,
      <apk 
       data hash MD5: 32K
       A1 C4 CF 4C C3 C6 C2 69 FB 6B 24 18 C8 21 EE 13>)
(   4,<2006-01-03 12:12:10.46 +000>,<MAYBRIDGE\nmr>,<NMR_250MHZ>,
      <abs ABSG = 5 
       data hash MD5: 32K
       1F 9F CA 86 3D 84 A0 2E 1C 9A E9 4F 0D 03 B0 30>)
$$ ##END=
$$ 
$$ hash MD5
$$ 3F 35 0F F9 15 DD 78 2B 79 9F 8E C6 0B A8 E4 A0
##$RELAX= 
##$RELAX= 
##$RELAX= 
##$RELAX= 
##$RELAX= 
##$RELAX= 
##$RELAX= 
$$ Bruker specific parameters
$$ --------------------------
##$DU= <C:\u>
##$EXPNO= 14100
##$NAME= <ADRS>
##$PROCNO= 1
##$TYPE= <nmr>
##$USER= <dgb>
##$AMP= (0..31)
100 100 100 100 100 100 100 100 100 100 100 100 100 100 100 100 100 100 
100 100 100 100 100 100 100 100 100 100 100 100 100 100 
##$AQSEQ= 0
##$AQ_mod= 3
##$AUNM= <au_zg>
##$AUTOPOS= <6 >
##$BF1= 250.13
##$BF2= 250.13
##$BF3= 250.13
##$BF4= 250.13
##$BF5= 500.13
##$BF6= 500.13
##$BF7= 500.13
##$BF8= 500.13
##$BYTORDA= 1
##$CFDGTYP= 0
##$CFRGTYP= 5
##$CHEMSTR= <none>
##$CNST= (0..31)
1 1 145 1 1 1 1 1 1 1 1 1 1 1 1 1 1 1 1 1 1 1 1 1 1 1 1 1 1 1 1 1 
##$CPDPRG= <>
##$CPDPRG1= <>
##$CPDPRG2= <>
##$CPDPRG3= <>
##$CPDPRG4= <mlev>
##$CPDPRG5= <mlev>
##$CPDPRG6= <mlev>
##$CPDPRG7= <mlev>
##$CPDPRG8= <mlev>
##$CPDPRGB= <>
##$CPDPRGT= <>
##$D= (0..31)
0 1 0 0 0 0 0 0 0 0.06 0 0 0 0 0 0 0.0002 0 0 0 0 0 0 0 0 0 0 0 0 0 0 
0 
##$DATE= 1136290314
##$DBL= (0..7)
120 120 120 120 120 120 120 120 
##$DBP= (0..7)
150 150 150 150 150 150 150 150 
##$DBP07= 0
##$DBPNAM0= <>
##$DBPNAM1= <>
##$DBPNAM2= <>
$$ [...]
##$SUBNAM7= <"">
##$SUBNAM8= <"">
##$SUBNAM9= <"">
##$SW= 20.6930455092707
##$SWIBOX= (0..15)
0 0 3 0 0 0 0 0 0 0 0 0 0 0 0 0 
##$SW_h= 5175.983436853
##$TD= 65536
##$TD0= 1
##$TE= 294.16
##$TE2= 300
##$TE3= 300
##$TEG= 300
##$TL= (0..7)
0 120 120 120 120 120 120 120 
##$TP= (0..7)
150 150 150 150 150 150 150 150 
##$TP07= 0
##$TPNAME0= <>
##$TPNAME1= <>
##$TPNAME2= <>
##$TPNAME3= <>
##$TPNAME4= <>
##$TPNAME5= <>
##$TPNAME6= <>
##$TPNAME7= <>
##$TPOAL= (0..7)
0.5 0.5 0.5 0.5 0.5 0.5 0.5 0.5 
##$TPOFFS= (0..7)
0 0 0 0 0 0 0 0 
##$TUNHIN= 0
##$TUNHOUT= 0
##$TUNXOUT= 0
##$USERA1= <user>
##$USERA2= <user>
##$USERA3= <user>
##$USERA4= <user>
##$USERA5= <user>
##$V9= 5
##$VALIST= <valist>
##$VCLIST= <CCCCCCCCCCCCCCC>
##$VD= 0
##$VDLIST= <DDDDDDDDDDDDDDD>
##$VPLIST= <PPPPPPPPPPPPPPP>
##$VTLIST= <TTTTTTTTTTTTTTT>
##$WBST= 1024
##$WBSW= 4
##$XGAIN= (0..3)
0 0 0 0 
##$XL= 0
##$YL= 0
##$YMAX_a= 504816
##$YMIN_a= -618759
##$ZGOPTNS= <>
##$ZL1= 120
##$ZL2= 120
##$ZL3= 120
##$ZL4= 120
##$ABSF1= 16.44439
##$ABSF2= -4.248783
##$ABSG= 5
##$ABSL= 3
##$ALPHA= 0
##$AQORDER= 0
##$ASSFAC= 0
##$ASSFACI= 0
##$ASSFACX= 0
##$ASSWID= 0
##$AUNMP= <proc_1d>
##$AZFE= 0.1
##$AZFW= 0.1
##$BCFW= 0
##$BC_mod= 0
##$BYTORDP= 0
##$COROFFS= 0
##$CY= 12.5
##$DATMOD= 1
##$DC= 0
##$DFILT= <>
##$DTYPP= 0
##$F1P= 14.0000005364418
##$F2P= -0.99999901652339
##$FCOR= 0.5
##$FTSIZE= 32768
##$FT_mod= 6
##$GAMMA= 0
##$GB= 0
##$INTBC= 1
##$INTSCL= 1
##$ISEN= 128
##$LB= 0.3
##$LEV0= 0
##$LPBIN= 0
##$MAXI= 10000
##$MC2= 0
##$MEAN= 0
##$ME_mod= 0
##$MI= 0
##$NCOEF= 0
##$NC_proc= -3
##$NLEV= 6
##$NOISF1= 0
##$NOISF2= 0
##$NSP= 0
##$NTH_PI= 0
##$NZP= 0
##$OFFSET= 16.44439
##$PC= 1
##$PHC0= 86.5208
##$PHC1= -2.736047
##$PH_mod= 1
##$PKNL= yes
##$PPARMOD= 0
##$PSCAL= 4
##$PSIGN= 0
##$REVERSE= no
##$SF= 250.130019411348
##$SI= 32768
##$SIGF1= 0
##$SIGF2= 0
##$SINO= 400
##$SIOLD= 32768
##$SREGLST= <1H.CDCl3>
##$SSB= 0
##$STSI= 32768
##$STSR= 0
##$SW_p= 5175.98343685301
##$SYMM= 0
##$S_DEV= 0
##$TDeff= 65536
##$TDoff= 0
##$TI= <Analysis number 999999
Compound Code 99
Book Reference 9
Project Code 9>
##$TILT= no
##$TM1= 0
##$TM2= 0
##$TOPLEV= 0
##$USERP1= <user>
##$USERP2= <user>
##$USERP3= <user>
##$USERP4= <user>
##$USERP5= <user>
##$WDW= 1
##$XDIM= 32768
##$YMAX_p= 271762818
##$YMIN_p= -126368
$$ End of Bruker specific parameters
$$ ---------------------------------
##NTUPLES= NMR SPECTRUM
##VAR_NAME=  FREQUENCY,     SPECTRUM/REAL,   SPECTRUM/IMAG
##SYMBOL=    X,             R,               I
##VAR_TYPE=  INDEPENDENT,   DEPENDENT,       DEPENDENT
##VAR_FORM=  AFFN,          ASDF,            ASDF
##VAR_DIM=   32768,         32768,           32768
##UNITS=     HZ,            ARBITRARY UNITS, ARBITRARY UNITS
##FACTOR=    0.157963299565203, 1,           1
##FIRST=     4113.23542563782, 0,            0
##LAST=      -1062.74801121519, 0,           0
##MIN=       -1062.74801121519, -126368,     0
##MAX=       4113.23542563782, 271762818,    0
$$ Real data points
##PAGE= N=1
##DATA TABLE= (X++(R..R)), XYDATA
$$ [...]
$$ plain form
24070 -44283 -49014 -27541 18778 38993 25697 6473 -26817 -20001 -7938 -2978 -14647 -3564
24058 -3564 -8212 -22054 -12633 7074 -9533 -16111 -9574 -3798 -7871 -19986 -27489 -28566 -28610 -11316
24044 -11316 -36087 -45830 -29577 -21093 -4285 15213 3328 -8342 -6480 -8743 -45123 -50430 -32013
24031 -32013 -18692 -1464 7947 6717 7026 -1436 -19323 -9509 454 16340 -7054 -17157 -14346
24018 -14346 4369 1938 -11299 -29034 -27297 -42514 -47799 -38902 -28561 -19561 -25094 -28517 5783
24005 5783 21699 12333 -2044 -10350 -4010 30265 22851 5847 12257 13753 10054 5410 8380 2873
23991 2873 14183 30318 27123 24705 17749 -11638 -17744 -26201 -23715 -29723 -33677 -18330 13395
23978 13395 -4613 -30284 -58043 -49468 -37158 -19043 6237 -12492 -20477 -32612 -56662 -59302
$$ packed form
24070d4283m731K1473M6319K0215j3296j9224l3290O816J2063M960j1669J1083
24058c564m648j3842R421J9707j6607o578O537N776m073j2115p503j077m4J7294
24044a1316k4771r743J6253Q484J6808J9498j1885j1670J862k263l6380n307J8417
24031c2013J3321J7228R411j230L09q462j7887R814R963J5886k3394j0103K811
24018a4346J8715k431j3237j7735J737j5217n285Q897J0341R000n533l423L4300
24005E783J5916r366j4377q306O340L4275p414j7004O410J496l699m644K970n507
23991B873J1310J6135l195k418o956k9387o106q457K486o008l954J5347L1725
23978A3395j8008k5671k7759Q575J2310J8115K5280j8729p985j2135k4050k640
$$ plain form
23966 -59302 -49256 -27234 -26166 -11027 8179 24595 43010 43681 27269 5823 -67 734 -23529
23953 -23529 -44339 -38539 -22686 -20665 -30059 -28203 -18805 8593 4522 2125 -17325 -15879 -1545
23940 -1545 -1543 -6650 3347 7071 -990 -5898 -7401 -30029 -12823 -13298 -12188 8291 -12870 -42336
23926 -42336 -54578 -5537 35855 38498 15141 -2016 -1031 4102 20674 14414 -11098 -40122 -33513
23913 -33513 -5154 -5525 -2010 -5029 -7473 -27399 -19853 -12830 -21268 -21229 -10288 -47431 -64218 -55322
23899 -55322 -56218 -39575 -33227 -19252 -16195 -27783 1226 5420 13844 37070 45892 40490 28564
23886 28564 8896 -22063 -42808 -27019 1090 34847 33753 18034 1308 1200 -6619 -34912
23874 -34912 -50840 -45800 -15523 -27752 -28764 -8120 7828 -1372 15093 32289 19304 -12490
$$ packed form
23966e9302J0046K2022J068J5139J9206J6416J8415O71j6412k1446n890Q01k4263
23953b3529k0810N800J5853K021r394J856R398K7398m071k397j9450J446J4334
23940a545Kn107R997L724q061m908j503k2628J7206m75J110K0479k1161k9466
23926d2336j2242M9041M1392K643k3357j7157R85N133J6572o260k5512k9024O609
23913c3513K8359l71L515l019k444j9926P546P023q438L9J0941l7143j6787Q896
23899e5322q96J6643O348J3975L057j1588K9009M194Q424K3226Q822n402j1926
23886B8564j9668l0959k0745J5789K8109L3757j094j5719j6726j08p819k8293
23874c4912j5928N040L0277j2229j012K0644J5948r200J6465J7196j2985l1794
$$ plain form
23862 -12490 -32430 -28922 -14903 -24127 -15932 -16167 -33480 -41158 -996 26664 9585 -4988 -4937
23849 -4937 -19047 -19705 -27551 -48282 -52203 -45074 -54721 -32756 -15880 -29543 -40809 -9253 -9503
23836 -9503 -8141 12147 8976 -14505 -23621 -8133 13861 -249 -15857 -2600 -9557 -24307 -18015
23823 -18015 -30996 -6312 36577 51454 34148 -3844 -2928 -27608 -60667 -53772 -16615 -32043
23811 -32043 -25247 14614 51513 54072 41385 22824 36843 19258 -2576 5302 18928 -4530
23799 -4530 -26921 -26649 -10174 -11013 -2706 1269 -3090 7891 6116 10111 25690 11942 16333 3971
23785 3971 -23220 -30642 -42482 -44278 -8907 46710 55981 32889 21097 6295 -15153 -11098 -9373
23772 -9373 12635 24770 7121 26196 34805 29350 19692 20523 16406 10362 6801 -394 12424 21554
$$ packed form
23862a2490j9940L508J4019r224Q195k35j7313p678M0162K7660j7079j4573N1
23849d937j4110o58p846k0731l921P129r647K1965J6876j3663j1266L1556k50
23836i503J362K0288l171k3481r116J5488K1994j4110j5608J3257o957j4750O292
23823a8015j2981K4684M2889J4877j7306l7992R16k4680l3059O895L7157j5428
23811c2043O796L9861L6899K559j2687j8561J4019j7585k1834P878J3626k3458
23799d530k2391K72J6475q39Q307L975m359J0981j775L995J5579j3748M391j2362
23785C971k7191p422j1840j796L5371N5617R271k3092j1792j4802k1448M055J725
23772i373K2008J2135j7649J9075Q609n455r658Q31m117o044l561p195J2818R130
$$ plain form
23758 21554 24174 -4046 -17733 -42066 -18969 10073 -529 -28955 -40591 -33300 -9668 -33558
23746 -33558 -22951 -16411 -20170 -14460 -13088 3392 2496 -18802 -22056 -28646 -31611 -5571 -1957 -34329
23732 -34329 -35405 -3450 19350 14747 -12230 -25596 -11349 -22356 -24454 -27251 -27457 -13124 11562
23719 11562 20111 3354 612 1603 -19400 -33130 -67268 -64387 -52032 -57649 -56664 -54498 -59757 -57734
23705 -57734 -44369 -49816 -56627 -59045 -26334 -2536 357 10144 -3053 -16488 12002 46445 30636
23692 30636 -3923 4842 40367 64332 65886 44464 23872 18808 18751 28617 31172 32196 42278
23679 42278 48610 29334 -15767 -12005 -9711 -24897 -44019 -67721 -67356 -51740 -39683 -41919 -39394
23666 -39394 -24216 -17092 11512 26171 13542 15758 20501 27491 18775 19164 10729 5429 9104 20041
$$ packed form
23758B1554K620k8220j3687k4333K3097K9042j0602k8426j1636P291K3632k3890
23746c3558J0607O540l759N710J372J6480q96k1298l254o590k965K6040L614l2372
23732c4329j076L1955K2800m603k6977j3366J4247j1007k098k797k06J4333K4686
23719A1562Q549j6757k742R91k1003j3730l4138K881J2355n617R85K166n259K023
23705e7734J3365n447o811k418L2711K3798K893R787j3197j3435K8490L4443j5809
23692C0636l4559Q765L5525K3965J554k1422k0592n064n7R866K555J024J0082
23679D2278O332j9276m5101L762K294j5186j9122k3702L65J5616J2057k236K525
23666c9394J5178P124K8604J4659j2629K216M743O990q716L89q435n300L675J0937
$$ plain form
23652 20041 57806 68587 8624 -23648 -44842 -27295 -6932 -10020 -25748 -3825 1308 22876
23640 22876 34841 24376 14398 1276 -1293 29986 23977 21 -11768 -1252 -19127 -22576
23628 -22576 -6753 10024 -3558 -12391 -38139 -61538 -46331 -52880 -58948 -66791 -51178 -14265
23616 -14265 -32578 -23997 -19284 -1926 15071 5466 -3660 262 -11728 -31948 -20376 5358 27777
23603 27777 -1181 -490 -11923 -11700 1055 -10162 -11588 18249 21990 9749 15050 41781 29883
23590 29883 39682 42130 35717 30109 20736 14811 21160 18674 -56 5284 17274 109 -545 -5035
23576 -5035 -5991 769 7843 16414 26113 27783 27036 1855 2263 10522 15685 29195 13919 -12762
23562 -12762 -17505 -13104 -42795 -60010 -24553 -9032 -16110 -17771 -11931 -15427 -14298 -29468 -21701
$$ packed form
23652B0041L7765J0781n9963l2272k1194J7547K0363l088j5728K1923N133K1568
23640B2876J1965j0465r978j3122k569L1279o009k3956j1789J0516j7875l449
23628b2576J5823J6777j3582q833k5748k3399J5207o549o068p843J5613L6913
23616a4265j8313Q581M713J7358J6997r605r126L922j1990k0220J1572K5734K2419
23603B7777k8958O91j1433K23J2755j1217j426K9837L741j2241N301K6731j1898
23590B9883R799K448o413n608r373n925O349k486j8730N340J1990j7165o54m490
23576e035r56O760P074Q571R699J670p47k5181M08Q259N163J3510j5276k6681
23562a2762m743M401k9691j7215L5457J5521p078j661N840l496J129j5170P767
$$ plain form
23549 -21701 -17501 -13280 -13941 13696 -2656 -4104 11538 12394 -19135 -29576 -19434 -10125 -14263
23536 -14263 -15034 -17878 -25562 -21951 -23002 -16787 -25180 -23489 -4138 -21584 -18812 -29298 -48875 -48239
23522 -48239 -42580 -13932 -9693 -24658 -34036 -39703 -21042 -10444 -10026 10700 30106 16409 -20477
23509 -20477 -36798 1866 26265 8967 -3029 -16917 -51819 -57949 -60988 -38492 -22509 2463
23497 2463 8228 -9316 -10326 -5837 -32250 -25428 13575 5442 9990 25195 7314 -13314 -38988
23484 -38988 -27741 -28451 -29387 -2726 15756 17170 18596 23286 6688 3557 12172 29920 13410
23471 13410 -7907 -5549 -22714 -27048 -45322 -32423 -48658 -57487 -37908 -11228 4020 -4817
23459 -4817 -9700 -17754 -10348 10603 650 -8844 -25178 -44260 -72897 -68923 -46709 -28288 -16105
$$ packed form
23549b1701M200M221o61K7637j6352j448J5642Q56l1529j0441J0142R309m138
23536a4263p71k844p684L611j051O215q393J691J9351j7446K772j0486j9577O36
23522d8239N659K8648M239j4965r378n667J8661J0598M18K0726J9406j3697l6886
23509b0477j6321L8664K4399j7298j1996j3888l4902o130l039K2496J5983K4972
23497B463N765j7544j010M489k6413O822L9003q133M548J5205j7881k0628k5674
23484c8988J1247p10r36K6661J8482J414J426M690j6598l131Q615J7748j6510
23471A3410k1317K358j7165m334j8274J2899j6235q829J9579K6680J5248q837
23459d817m883q054P406K0951r953r494j6334j9082k8637L974K2214J8421J2183
$$ plain form
23446 -16105 4630 22934 34180 22320 -1846 -12383 -7596 7943 3639 13471 32316 19578
23434 19578 14707 -2786 -14201 -20902 -39911 -47985 -70594 -75890 -62450 -58405 -71095 -47016 9080
23421 9080 36510 19872 7556 13065 25719 43867 44434 31938 23907 27878 12605 25657 37852
23408 37852 18612 -18934 -51807 -29370 -9939 -1667 -7851 -18440 -2699 3913 -8409 -18603
23396 -18603 -28531 -20349 -39555 -41516 -36738 -47621 -45488 -49771 -47852 -26435 11435 -7775 -19744
23383 -19744 -27763 -28397 -8400 35304 45148 33523 30710 -5678 -19096 -10426 -7858 -1876 14929
23370 14929 13929 12371 -6987 -53942 -59963 -50077 -27655 -12869 -3035 14391 28630 15586 -12737
23357 -12737 -59611 -57716 -56244 -49447 -31215 -12296 -7609 -27368 -23983 -34594 -44553 -63010 -33382
$$ packed form
23446a6105K0735J8304J1246j1860k4166j0537M787J5539m304R832J8845j2738
23434A9578m871j7493j1415o701j9009q074k2609n296J3440M045j2690K4079N6096
23421I080K7430j6638j2316N509J2654J8148N67j2496q031L971j5273J3052J2195
23408C7852j9240l7546l2873K2437J9431Q272o184j0589J5741O612j2322j0194
23396a8603r928Q182j9206j961M778j0883K133m283J919K1417L7870j9210j1969
23383a9744q019o34J9997M3704R844j1625k813l6388j3418Q670K568N982J6805
23370A4929j000j558j9358m6955o021R886K2422J4786R834J7426J4239j3044k8323
23357a2737m6874J895J472O797J8232J8919M687j9759L385j0611r959j8457K9628
$$ plain form
23344 -33382 -3451 -9809 -24924 -30630 -22347 -34367 -51231 -60582 -80785 -68068 -25230 18062
23332 18062 22144 27126 17636 17006 17011 -7678 -34231 -22154 -20304 -39569 -36060 -22739 19211 16827
23318 16827 -24874 -45825 -42096 -39236 -14371 -906 -13241 -48158 -54370 -19268 -16859 13248
23306 13248 39113 37400 13236 -1466 -12239 -254 -23186 -64608 -77797 -75197 -54578 -46040
23294 -46040 -30377 -25640 -28796 -31017 -27918 -2128 16049 10169 -10227 -23549 -20984 -20519 -10211
23281 -10211 -4346 1220 -17869 9443 3734 -22622 -32109 -29948 -29771 -39866 -20127 -738 -1787
23268 -1787 -18149 -11559 9818 6131 -16504 -2326 -10495 -15139 -31652 -14566 1997 -19571 -25462
23255 -25462 -11849 -29881 -23003 -17880 -20759 -15252 -37298 -60963 -54529 -60852 -67458 -51898 7457
$$ packed form
23344c3382K9931o358j5115n706Q283j2020j6864r351k0203J2717M2838M3292
23332A8062M082M982r490o30Nk4689k6553J2077J850j9265L509J3321M1950k384
23318A6827m1701k0951L729K860K4865J3465j2335l4917o212L5102K409L0107
23306A3248K5865j713k4164j4702j0773J1985k2932m1422j3189K600K0619Q538
23294d6040J5663M737l156k221L099K5790J8177n880k0396j3322K565M65J0308
23281a0211N865N566j9089K7312n709k6356r487K161J77j0095J9739J9389j049
23268a787j6362O590K1377l687k2635J4178q169m644j6513J7086J6563k1568n891
23255b5462J3613j8032O878N123k879N507k2046k3665O434o323o606J5560N9355
$$ plain form
23242 7457 8424 -14853 -7236 -5495 7326 860 6017 7535 -16497 -29582 -9414 9988 22564
23229 22564 25894 39993 20534 3442 -12857 -25696 -21015 -46449 -38487 10181 3031 -8753
23217 -8753 -321 -3882 -7584 535 13775 10090 8596 6344 -10930 -11192 -12284 5524 20957 25022
23203 25022 27991 19937 6529 -836 4452 25913 18984 25057 22024 -7740 -4968 3308 -15498
23190 -15498 -42996 -52424 -54026 -34300 -20916 -9066 9 -11738 -15657 -18447 -6970 10947 28370
23177 28370 21558 -5938 -20985 -11240 4560 16085 37887 41069 43292 48513 27259 20445 7830
23164 7830 17474 46775 33648 4420 -1707 -942 -24677 -53814 -46712 -25778 -45946 -50937 -26963
23151 -26963 -10722 -30817 -44080 -17992 -20208 -7909 -2963 -29530 -38251 -17012 -7019 -17032
$$ packed form
23242G457R67k3277P617J741J2821o466N157J518k4032j3085K0168J9402J2576
23229B2564L330J4099j9459j7092j6299j2839M681k5434P962M8668p150j1784
23217h753Q432l561l702Q119J3240l685j494k252j7274k62j092J7808J5433M065
23203B5022K969q054j3408p365N288K1461o929O073l033k9764K772Q276j8806
23190a5498k7498r428j602J9726J3384J1850R075j1747l919k790J1477J7917J7423
23177B8370o812k7496j5047R745J5800J1525K1802L182K223N221k1254o814j2615
23164G830R644K9301j3127k9228o127P65k3735k9137P102K0934k0168m991K3974
23151b6963J6241k0095j3263K6088k216J2299M946k6567q721K1239R993j0013
$$ plain form
23139 -17032 -31265 -11397 564 7616 10055 901 -11100 -24056 -41988 -18171 -16485 -2383
23127 -2383 -1801 14999 30066 8574 -15748 -1961 33753 55703 77204 45103 33405 23637
23115 23637 28565 14432 12787 19603 -1075 -20247 -41471 -35374 -16113 -67 -6789 -10650 -7419
23102 -7419 -12238 -10846 -21470 -9470 -2417 18257 -4948 -4626 25486 2806 -13270 -12879 -19840
23089 -19840 -4629 10861 7384 15704 13184 8971 13978 26593 42137 30328 20115 25169 28267
23076 28267 5506 -865 2599 21109 45493 35179 46282 45454 15748 1434 3881 -373 4194
23063 4194 -12623 -17404 -50897 -53794 -46387 -44016 -16061 -8824 -44112 -45878 -28787 13959 46807
23050 46807 46030 32010 12670 22143 22904 26327 33179 42878 54030 49886 41447 21645 16810 30994
$$ packed form
23139a7032j4233J9868J1961P052K439r154j2001j2956j7932K3817J686J4102
23127b383N82J6800J5067k1492k4322J3787L5714K1950K1501l2101j1698r768
23115B3637M928j4133j645O816k0678j9172k1224O097J9261J6046o722l861L231
23102g419m819J392j0624J2000P053K0674k3205L22L0112k2680j6076L91o961
23089a9840J5211J5490l477Q320k520m213N007J2615J5544j1809j0213N054L098
23076B8267k2761o371L464J8510K4384j0314J1103q28k9706j4314K447m254M567
23063D194j6817m781l3493k897P407K371K7955P237l5288j766J7091M2746L2848
23050D6807p77j4020j9340R473P61L423O852R699J1152m144q439j9802m835J4184
$$ plain form
23036 30994 35209 23097 14967 9175 8446 -23492 -23242 13112 13193 -6500 -9374 -6498 29416 34222
23022 34222 24976 -8706 15508 20173 13192 29684 25259 -5639 -2527 -30343 -31279 -29343 -23210
23009 -23210 -12422 -13179 17221 41311 27658 37228 36931 3387 -28511 -34864 -32602 -45509 -32497
22996 -32497 -5217 1450 -13827 -22548 -5988 8281 6393 6887 11164 4783 1454 20867 11261
22983 11261 -13761 -34714 -33179 -9651 11103 9685 26513 11015 14130 32824 20281 1279
22971 1279 -30289 -24444 -4744 11190 15942 8562 -1631 4728 14320 9996 17297 16729 24802 13155
22957 13155 19417 24419 11093 14347 3628 4146 33564 17610 -4552 9049 27939 5281 6775
22944 6775 4115 9519 17362 9474 9287 10291 5977 3601 2990 -4734 11205 99 -22171 -46387
$$ packed form
23036C0994M215j2112q130n792p29l1938K50L6354Q1j9693k874K876L5914M806
23022C4222r246l3682K4214M665o981J6492m425l0898L112k7816r36J936O133
23009b3210J0788p57L0400K4090j3653R570k97l3544l1898o353K262j2907J3012
22996c2497K7280O667j5277q721J6560J4269j888M94M277o381l329J9413r606
22983A1261k5022k0953J535K3528K0754j418J6828j5498L115J8694j2543j9002
22971A279l1568N845J9700J5934M752p380j0193O359R592m324P301n68Q073j1647
22957A3155O262N002j3326L254j0719N18K9418j5954k2162J3601J8890k2658J494
22944F775k660N404P843p888j87J004m314k376o11p724J5939j1106k2270k4216
$$ plain form
22930 -46387 -53440 -19052 -9008 3647 -10607 -17056 -8499 27180 28825 8006 -226 -30666 -60544
22917 -60544 -65407 -55941 -39582 -20935 -29075 -42065 -38746 -19812 4285 3031 -5 3544 21357
22904 21357 29922 36987 27985 1918 -7177 -13175 -36953 -41908 -26124 -28056 -45578 -30244 -31976
22891 -31976 -52312 -28247 -14719 -21746 -21233 7581 31889 -375 -23649 -14279 10443 -7807
22879 -7807 -8061 11305 19431 16489 -6531 -17560 3256 13853 26101 38807 28216 -422 2698
22866 2698 -4880 -13904 3916 -6856 -21796 -30261 -24651 -34808 -28529 1876 16020 28713 25090
22853 25090 20749 -5503 1822 22375 5819 6037 26705 35451 38654 13221 -25015 -10890 12710
22840 12710 -9580 -4492 17622 25452 8476 -1175 1229 2074 3236 10836 17769 14290 905 24465
$$ packed form
22930d6387p053L4388J0044J2655j4254o449Q557L5679J645k0819q232l0440k9878
22917f0544m863R466J6359J8647q140j2990L319J8934K4097j254l036L549J7813
22904B1357Q565P065r002k6067r095n998k3778m955J5784j932j7522J5334j732
22891c1976k0336K4065J3528p027N13K8814K4308l2264k3274R370K4722j8250
22879g807k54J9366Q126k942k3020j1029K0816J0597J2248J2706j0591k8638L120
22866B698p578r024J7820j0772j4940q465N610j0157O279L0405J4144J2693l623
22853B5090m341k6252P325K0553j6556K18K0668Q746L203k5433l8236J4125K3600
22840A2710k2290N088K2114P830j6976r651K404Q45J162P600O933l479j3385K3560
$$ plain form
22826 24465 26786 22206 17077 -11606 9188 8244 -2283 19482 10718 -13932 -26642 -29432 -31653
22813 -31653 -9418 14531 23139 3148 -31398 -30789 -18191 12773 29730 28839 17873 -10598 -7460
22800 -7460 34929 60470 52213 44038 -4027 -37378 -25513 -5846 9845 26683 24128 35577
22788 35577 28096 41963 63198 58948 34586 21577 16951 17284 -828 -23446 -31566 -42613 -40606
22775 -40606 -11007 -32706 -51791 -48927 -20998 1228 27010 4688 -28258 -12432 -14720 1102
22763 1102 21513 1097 -28292 -39554 -46760 -28166 -22631 -12690 1380 6121 813 -2585 3713
22750 3713 18571 10638 -10065 -26451 -23461 -8401 1623 -9060 -178 12138 25849 10234
22738 10234 -17604 -1942 17547 34427 41290 34410 18749 -3605 -4460 12958 11803 -6406 -959
$$ packed form
22826B4465K321m580n129k8683K0794r44j0527K1765q764k4650j2710k790k221
22813c1653K2235K3949Q608j9991l4546O09J2598L0964J6957q91j0966k8471L138
22800g460M2389K5541q257q175m8065l3351J1865J9667J5691J6838k555J1449
22788C5577p481J3867K1235m250k4362j3009m626L33j8112k2618q120j1047K007
22775d0606K9599k1699j9085K864K7929K2226K5782k2322l2946J5826k288J5822
22763A102K0411k0416k9389j1262p206J8594N535R941J4070M741n308l398O298
22750C713J4858p933k0703j6386K990J5060J0024j0683Q882J2316J3711j5615
22738A0234k7838J5662J9489J6880O863o880j5661k2354q55J7418j155j8209N447
$$ plain form
22725 -959 19560 14930 1555 -11547 -25103 -5596 16892 12674 11827 1957 -11845 -15813 -14304
22712 -14304 -2892 21536 -4221 -1938 93 9290 13414 -460 -26311 -42094 -8858 -341 12019
22699 12019 31877 14331 7477 -10625 -26471 4345 36740 35436 34398 24661 -4225 4220 3910
22686 3910 -7377 -8114 9744 14880 22175 25044 8551 3431 -2549 -5084 8908 -7275 -13394 -12605
22672 -12605 -26325 -61399 -51008 -12483 15648 8566 -14389 -16455 -28086 -18879 4089 22621
22660 22621 34917 33900 20063 13442 11516 9114 4354 31654 7303 -33153 -40112 -49827 -46181
22647 -46181 -35639 -21687 21082 17378 7356 3216 -176 -8734 -3911 -20781 -33167 -34936 -12538
22634 -12538 50203 29920 -7720 -21080 -22665 -23944 -24611 -48555 -45453 -29419 -40051 -33560 -26483
$$ packed form
22725i59K0519m630j3375j3102j3556J9507K2488m218q47r870j3802l968J509
22712a4304J1412K4428k5757K283K031R197M124j3874k5851j5783L3236Q517J2360
22699A2019J9858j7546o854j8102j5846L0816L2395j304j038r737k8886Q445l10
22686C910j1287p37J7858N136P295K869j6493n120n980k535J3992j6183o119P89
22672a2605j3720l5074J0391L8525K8131p082k2955k066j1631R207K2968J8532
22660B2621J2296j017j3837o621j926k402m760K7300k4351m0456o959r715L646
22647d6181J0542J3952M2769l704j0022m140l392q558M823j6870j2386j769K2398
22634a2538O2741k0283l7640j3360j585j279o67k3944L102J6034j0632O491P077
$$ plain form
22621 -26483 -38348 -25035 -10902 -25134 -40972 -30455 -61385 -67901 -42270 -9028 2067 10213
22609 10213 -9517 -32291 -28424 -19111 -36961 -26831 -6190 4379 -9926 -15500 -7467 3946
22597 3946 35689 47607 9844 8946 47373 25031 -14071 -10149 3775 -3645 -13382 -9359 -2513
22584 -2513 -27433 -33488 -46590 -41038 -15639 2826 5793 -4375 -10063 -30076 -26052 -7629 -8735
22571 -8735 -49003 -35900 -5816 10237 12421 24749 30330 6125 26598 39454 26096 7499
22559 7499 -11212 -31806 -29262 21144 30406 6575 -8424 8201 7220 89 10174 12329 20161
22546 20161 8060 -6172 -12373 6618 12553 19803 48429 39265 13914 9125 25815 43346 40524
22533 40524 10709 -6154 8667 14906 -19695 -33046 -19350 -11757 -5100 17725 22208 6689
$$ packed form
22621b6483j1865J3313J4133j4232j5838J0517l0930o516K5631L3242J1095Q146
22609A0213j9730k2774L867R313j7850J0130K0641J0569j4305n574Q033J1413
22597C946L1743J1918l7763q98L8427k2342l9102L922J3924p420r737M023O846
22584b513k4920o055j3102N552K5399J8465K967j0168n688k0013M024J8423j106
22571h735m0268J3103L0084J6053K184J2328N581k4205K0473J2856j3358j8597
22559G499j8711k0594K544N0406R262k3831j4999J6625r81p131J0085K155P832
22546B0161j2101j4232o201J8991N935P250K8626r164k5351m789J6690J7531k822
22533D0524k9815j6863J4821O239l4601j3351J3696P593O657K2825M483j5519
$$ plain form
22521 6689 -15761 -25420 -11783 10217 -13059 -18239 -11354 -35998 -37899 -6376 -19381 -29987 1746
22508 1746 26728 45797 36147 15411 21573 35093 47500 59277 50537 64110 74621 69968 76222
22495 76222 83341 74691 119362 149233 182459 302364 440211 526457 583399 607752 578468 490549
22483 490549 376539 263202 173915 102141 63550 49938 16397 -1844 -2115 -10958 11394 25294
22471 25294 14587 -9908 7635 20082 25175 14993 16568 23653 17638 14520 -1807 -18671 -40434
22458 -40434 -42994 -30323 -20275 -24530 -14076 -10786 -12791 -11588 7851 31156 54550 36753 16938
22445 16938 -20654 -52805 -49978 -38826 -27383 -13994 16651 33250 11024 -363 14432 31825
22433 31825 26003 12712 -1018 -12737 15 23438 35537 39095 39622 35417 20664 32975 36618
$$ packed form
22521F689k2450r659J3637K2000k3276n180O885k4644j901L1523j3005j0606L1733
22508A746K4982J9069r650k0736O162J3520J2407J1777q740J3573J0511m653O254
22495G6222P119q650M4671K9871L3226J19905J37847Q6246N6942K4353k9284q7919
22483D90549j14010j13337q9287p1774l8591j3612l3541j8241k71q843K2352J3900
22471B5294j0707k4495J7543J2447N093j0182J575P085o015l118j6327j6864k1763
22458d0434k560J2671J0048m255J0454L290k005J203J9439K3305K3394j7797j9815
22445A6938l7592l2151K827J1152J1443J3389L0645J6599k2226j1387J4795J7393
22433C1825n822j3291j3730j1719J2752K3423J2099L558N27m205j4753J2311L643
$$ plain form
22420 36618 36752 28813 11922 -15570 -6254 -19883 -30719 -38181 -41167 -42021 -5104 11412 11949 10617
22406 10617 -3906 -7842 -9176 -13945 -19234 -42261 -14367 -7963 -14692 -6161 -1792 -7492 2092 15221
22392 15221 25738 22042 10874 12749 26819 29219 15897 -2149 -7915 -17052 -27104 -36049 -20360
22379 -20360 -16853 -23366 -17233 -7266 -1040 20153 -14342 -50013 -45261 -11261 -949 12937 23959
22366 23959 32830 47186 60713 50059 33715 33261 35278 24581 12957 -2413 17147 43147
22354 43147 46638 11098 -7150 -20513 -4142 359 -14616 -4897 7245 -9754 -32886 -27670
22342 -27670 4000 40123 34966 7752 -22048 -31694 -17901 -596 19757 10393 -13759 -3997
22330 -3997 6578 -1743 -1743 13563 -6837 -26463 -11642 -13589 -9544 8908 14593 1187 -25627
$$ packed form
22420C6618J34p939j6891k7492R316j3629j0836p462k986q54L6917J6516N37j332
22406A0617j4523l936j334m769n289k3027K7894O404o729Q531M369n700R584J3129
22392A5221J0517l696j1168J875J4070K400j3322j8046n766r137j0052q945J5689
22379b0360L507o513O133R967O226K1193l4495l5671M752L4000J0312J3886J1022
22366B3959Q871J4356J3527j0654j6344m54K017j0697j1624j5370J9560K6000
22354D3147L491l5540j8248j3363J6371M501j4975R719J2142j6999k3132N216
22342b7670L1670L6123n157k7214k9800r646J3793J7305K0353r364k4152R762
22330c997J0575q321%J5306k0400j9626J4821j947M045J8452N685j3406k6814
$$ plain form
22317 -25627 -18553 -15377 -8831 5310 2590 -7879 -9841 -10486 -22750 -7122 -5448 4280 10839 12736
22303 12736 14382 15602 -23841 -20641 -2339 25698 27593 5707 1738 2573 -17448 -10445 28056
22290 28056 25660 7911 -17739 -9695 -14118 -9857 -18246 -29020 -27977 10044 34626 30707 -5210
22277 -5210 -30730 -31505 -21543 -24148 -15430 -33573 -48939 -9409 8753 -7523 -5914 20650 37847
22264 37847 28818 30861 22677 35672 41265 35206 45766 36049 1201 -20271 -19023 2392 -914
22251 -914 -24081 -10614 26189 17771 -4410 -9533 -14786 2190 518 -19157 4689 3628 -12079
22238 -12079 -19144 -18193 17365 24782 40872 62848 37456 -8542 -7991 -12599 -44264 -42108 -11044
22225 -11044 7311 -20394 -18547 -9327 3721 11281 38043 45262 25044 28902 48544 62040 68906
$$ packed form
22317b5627P074L176O546J4141k720j0469j962o45j2264J5628J674R728O559J897
22303A2736J646J220l9443L200J8302K8037J895k1886l969Q35k0021P003L8501
22290B8056k396j7749k5650Q044m423M261q389j0774J043L8021K4582l919l5917
22277e210k5520p75R962k605Q718j8143j5366L9530J8162j6276J609K6564J7197
22264C7847r029K043q184J2995N593o059J0560r717l4848k1472J248K1415l306
22251i14k3167J3467L6803q418k2181n123n253J6976j672j9675K3846j061j5707
22238a2079p065R51L5558P417J6090K1976k5392m5998N51m608l1665K156L1064
22225a1044J8355k7705J847R220J3048P560K6762P219k0218L858J9642J3496O866
$$ plain form
22212 68906 38127 32764 35239 2353 -19342 -4170 38118 50265 44058 35596 27525 31107 25932
22199 25932 2030 1125 882 2086 1106 -3220 -8019 4341 -9298 -11461 21931 38365 14895 -18828
22185 -18828 -19204 -17784 -28552 -491 11215 20770 11704 -10182 -32520 -45705 -20808 -5730 -18476
22172 -18476 -14444 7305 8281 -1617 -26069 -12636 -3031 16443 6019 4869 -7043 -5469 5517
22159 5517 15322 -7612 -22263 -5922 5329 28743 34505 30962 25423 -2461 -16254 -33235 -6948
22146 -6948 16122 47824 72547 61427 23794 -11085 -16639 -33634 -17380 -4812 -10860 -11003 4837
22133 4837 15190 9887 -26614 -31359 -22751 -15852 -15427 980 12966 10586 -2239 -2626 3372 -11458
22119 -11458 -27540 -10137 -16492 -19144 -19228 -776 7193 16693 7473 15848 21076 26413 17758 21592
$$ packed form
22212F8906l0779n363K475l2886k1695J5172M2288J2147o207q462q071L582n175
22199B5932k3902r05k43J204r80m326m799J2360j3639k163L3392J6434k3470l3723
22185a8828l76J420j0768K8061J1706R555r066k1886k2338j3185K4897J5078j2746
22172a8476M032K1749R76r898k4452J3433R605J9474j0424j150j1912J574J0986
22159E517R805k2934j4651J6341J1251K3414N762l543n539k7884j3793j6981K6287
22146f948K3070L1702K4723j1120l7633l4879n554j6995J6254J2568o048j43J5840
22133D837J0353n303l6501m745Q608O899M25J6407J1986k380j2825l87N998j4830
22119a1458j6082J7403o355k652q4J8452P969R500r220Q375N228N337q655L834
$$ plain form
22105 21592 22017 -9900 -42189 -37622 -17327 -5320 8214 3765 17518 27259 21418 19698 44531
22092 44531 22809 -1412 8313 21324 14054 22516 13993 -4889 -11005 -11654 2869 13730 6232
22079 6232 -12368 7525 -29306 -44517 -22628 -37872 -36101 -18939 -1018 3005 11695 40914
22067 40914 30125 51816 49365 36934 24566 33660 24936 19084 20519 27209 20941 7523 -3370
22054 -3370 -15429 -15376 -155 8071 4805 -5065 -23963 -37076 -14130 -16678 13990 21576 -4272
22041 -4272 2096 -9193 -14497 -42030 -34540 -14160 4937 -17738 -18739 -36965 -65689 -79192 -40640
22028 -40640 -23481 3795 15750 4253 20293 9030 -24510 -13523 -12966 -3107 28016 41618
22016 41618 46295 48799 36413 49762 32391 -15769 -31484 -38679 -32909 -43555 -14515 -8343 -17114
$$ packed form
22105B1592M25l1917l2289M567K0295J2007J3534m449J3753R741n841j720K4833
22092D4531k1722k4221R725J3011p270Q462q523j8882o116o49J4523J0861p498
22079F232j8600J9893l6831j5211K1889j5244J771J7162J7921M023Q690K9219
22067D0914j0789K1691k451j2431j2368R094q724n852J435O690o268j3418j0893
22054c370j2059N3J5221Q226l266r870j8898j3113K2946k548L0668P586k5848
22041d272O368j1289n304k7533P490K0380J9097k2675j001j8226k8724j3503L8552
22028d0640J7159K7276J1955j1497J6040j1263l3540J0987N57R859L1123J3602
22016D1618M677K504j2386J3349j7371m8160j5715p195N770j0646K9040O172q771
$$ plain form
22003 -17114 -15644 -16513 -15550 -11238 -18562 7075 1355 -4855 590 8977 15948 4563 -8581 1898
21989 1898 11084 10970 30447 3701 8098 7536 -19514 -14285 12400 23003 7160 -10777 -8855
21976 -8855 -2400 -21687 -16914 -13845 -13284 -17832 -28162 -33377 -38012 -45528 -55727 -30848 -15390 -9698
21962 -9698 -18644 -13296 -2284 -17803 -5239 -5531 22027 26501 -362 -10594 13506 30599 27068
21949 27068 48148 43724 21290 -20239 -30373 -15528 -6632 -16493 -34263 2933 -7373 -27189
21937 -27189 -19400 -3214 -4096 -32686 -32764 3643 31587 18788 -10152 -24685 -13305 -8805 -10812
21924 -10812 -14147 -11627 -1766 6054 20176 35868 49978 14818 8490 7991 17591 15979 5030
21911 5030 -15592 -52635 -26331 -7183 -19004 -48590 -47267 -33843 -29149 -33387 -19767 2213
$$ packed form
22003a7114J470q69R63M312p324K5637n720o210N445Q387O971j1385j3144J0479
21989A898R186j14J9477k6746M397n62k7050N229K6685J0603j5843j7937J922
21976h855O455j9287M773L069N61m548j0330n215m635p516j0199K4879J5458N692
21962i698q946N348J1012j5519J2564k92K7558M474k6863j0232K4100J7093l531
21949B7068K1080m424k2434m1529j0134J4845Q896r861j7770L7196j0306j9816
21937b7189P789J6186q82k8590p8L6407K7944j2799k8940j4533J1380M500k007
21924a0812l335K520R861P820J4122J5692J4110l5160o328m99R600j612j0949
21911E030k0622l7043K6304J9148j1821k9586J323J3424M694m238J3620K1980
$$ plain form
21899 2213 15956 33957 53549 63004 71091 64131 56956 57866 35799 26201 39019 20482 9955
21886 9955 23449 26562 36999 38585 23021 11854 18459 13571 6080 20276 15680 -13147 -8549
21873 -8549 9726 16357 32837 50275 30643 22113 27838 26108 19547 31777 44677 34771 28199
21860 28199 35124 47545 17571 20579 17006 -11408 -22559 -20107 -5648 -23715 -16963 -2851 815
21847 815 2759 5124 -10592 -14529 -19403 -12311 -1039 5956 11525 -13848 -30718 -28718 -49585 -59338
21833 -59338 -36900 -34403 -22979 -7391 -11242 -14472 -19425 -52876 -64134 -47623 -32107 -9280
21821 -9280 3302 2156 19603 23486 25129 40664 43175 32959 32228 32503 9430 -5738 -13252 -35184
21807 -35184 -36992 -61435 -47552 -32362 -1089 6650 -5387 -30535 -27607 -37892 -19201 -1070
$$ packed form
21899B213J3743J8001J9592R455Q087o960p175R10k2067r598J2818j8537j0527
21886I955J3494L113J0437J586j5564j1167O605m888p491J4196m596k8827M598
21873h549J8275O631J6480J7438j9632q530N725j730o561J2230J2900r906o572
21860B8199O925J2421k9974L008l573k8414j1151K452J4459j8067O752J4112L666
21847H15J944K365j5716l937m874P092J1272O995N569k5373j6870K000k0867r753
21833e9338K2438K497J1424J5588l851l230m953l3451j1258J6511J5516K2827
21821i280J2582j146J7447L883J643J5535K511j0216p31K75k3073j5168p514k1932
21807c5184j808k4443J3883J5190L1273P739j2037k5148K928j0285J8691J8131
$$ plain form
21795 -1070 42142 57643 42298 10694 -8584 18429 15781 -15959 -20306 -33523 -47597 -49060
21783 -49060 -32180 24484 34080 15994 -4719 26896 37537 31589 36401 18377 -3840 -27997
21771 -27997 -38659 -22648 -5302 3594 -12009 3111 -7185 -18478 -15528 -5350 -5620 -17330
21759 -17330 -24440 -26136 -9255 2675 15474 2765 8862 24427 18372 10359 2451 3265 2213
21746 2213 14178 16348 9937 -203 12778 19615 -5869 -19203 17805 20057 27906 25491 16830
21733 16830 5464 -3922 14274 9465 20775 29988 6873 -28351 -35304 -25068 -22545 -18922 -19238
21720 -19238 -18930 -25209 -35319 -48462 -59738 -49484 -19349 21202 14249 -147 4408 13635 -13805
21707 -13805 -13170 -19218 -7535 19128 20737 32461 34661 -16350 -16532 26980 17628 -23928 -26088
$$ packed form
21795a070M3212J5501j5345l1604j9278K7013k648l1740m347j3217j4074j463
21783d9060J6880N6664R596j8086k0713L1615J0641n948M812j8024k2217k4157
21771b7997j0662J6011J7346Q896j5603J5120j0296j1293K950J0178k70j1710
21759a7330p110j696J6881J1930J2799j2709O097J5565o055q013p908Q14j052
21746B213J1965K170o411j0140J2981O837k5484j3334L7008K252P849k415q661
21733A6830j1366r386J8196m809J1310R213k3115l5224o953J0236K523L623l16
21720a9238L08o279j0110j3143j1276J0254L0135M0551o953j4396M555R227k7440
21707a3805O35o048J1683K6663J609J1724K200n1011j82M3512r352m1556k160
$$ plain form
21694 -26088 -8282 9925 -30760 -25552 14008 34281 32419 7619 6466 15620 -3205 -574 15590
21681 15590 46166 47276 16821 -15246 -17383 19455 30405 8100 10397 -3594 -17395 -14181
21669 -14181 -15728 -4434 17204 34874 16362 7721 -3225 -1935 -3210 -680 20856 -20590 -30654
21656 -30654 -20723 -9463 9209 19041 16801 12823 1911 -37202 -49217 -32060 -40780 -30087 -15048
21643 -15048 19449 49346 25951 -4305 -25174 -23659 21663 60393 41646 13953 10814 29089
21631 29089 -1846 -10432 2644 22652 25081 -6732 -12192 -29046 -44405 -47710 -25598 -21734 -14280
21618 -14280 1039 -9183 -28839 -35742 -29369 -21312 -5592 -16899 -9413 -9230 -22924 3980 15320
21605 15320 15709 134 -6441 -25266 -31603 -20531 2509 1499 29227 23142 -15790 -15145 -5535
$$ packed form
21694b6088J7806J8207m0685N208L9560K0273j862k4800j153R154j8825K631J6164
21681A5590L0576J110l0455l2067k137L6838J0950k2305K297j3991j3801L214
21669a4181j547J1294K1638J7670j8512q641j0946J290j275K530K1536m1446j0064
21656c0654R931J1260J8672R832k240l978j0912l9113j2015J7157q720J0693J5039
21643a5048L4497K9897k3395l0256k0869J515M5322L8730j8747k7693l139J8275
21631B9089l0935q586J3076K0008K429l1813n460j6854j5359l305K2112L864P454
21618a4280J5319j0222j9656o903O373Q057J5720j1307P486J83j3694K6904J1340
21605A5320L89j5575o575j8825o337J1072K3040j010K7728o085l8932O45R610
$$ plain form
21592 -5535 12419 24182 11027 20073 11890 19694 17523 3398 -16564 -6482 -1538 -9461 -8619
21579 -8619 -5840 38723 53402 40106 22732 31935 -157 4049 10754 30759 40958 21642 10521
21566 10521 -10273 -42569 -33939 -22968 -32889 -37535 -17951 6351 -14487 -18380 -20492 -60434 -53718
21553 -53718 -37507 -32814 -24340 12085 26892 38709 31975 4151 1174 13555 119 -8723 -19022
21540 -19022 -6483 8782 12054 27967 54818 52489 24662 13666 31706 51792 38468 -10451
21528 -10451 -25867 -6963 2031 12924 12771 11638 43455 36216 4989 19784 31608 27650 19852
21515 19852 -20422 -2220 30639 12327 -7623 12755 42837 21007 29216 51019 29813 11632
21503 11632 22557 16425 5449 -15244 8317 25909 27651 18666 -3277 -18275 -12260 -7042 18417
$$ packed form
21592e535J7954J1763j3155R046q183P804k171j4125j9962J0082M944p923Q42
21579h619K779M4563J4679j3296j7374R203l2092M206O705K0005J0199j9316j1121
21566A0521k0794l2296Q630J0971r921m646J9584K4302k0838l893k112l9942O716
21553e3718J6211M693Q474L6425J4807J1817o734k7824k977J2381j3436q842j0299
21540a9022J2539J5265L272J5913K6851k329k7827j0996J8040K0086j3324m8919
21528a0451j5416J8904Q994J0893j53j133L1817p239l1227J4795J1824l958p798
21515A9852m0274J8202L2859j8312j9950K0378L0082k1830Q209K1803k1206j8181
21503A1632J0925o132j0976k0693K3561J7592J742q985k1943j4998O015N218K5459
$$ plain form
21490 18417 26671 4648 -7556 -8341 -17095 -25311 -9213 16933 3496 -19395 -34157 -7315 16848
21477 16848 -7194 4274 13815 -11507 -12431 6477 -7336 -41895 -41631 -3875 12716 -5652 -16281
21464 -16281 4710 21674 9988 -3898 -14776 -25270 -29341 2281 -8315 -18176 -10913 5312
21452 5312 -14298 -21653 -29263 -36418 -20319 18046 25760 16190 30689 27954 -21206 -48202 -13394
21439 -13394 -1477 6807 6235 -20403 -35602 -40025 -22172 -2693 13861 42576 43275 45387 38516
21426 38516 45826 37293 18578 -764 5208 25822 1536 -14876 -10685 -19766 -10036 13257 8099
21413 8099 8993 9004 3404 1015 -3175 22403 31741 18022 20038 4965 -8429 12510 27828 29341
21399 29341 18617 11150 41701 53969 14556 -35144 -33588 -44231 -60725 -70435 -76039 -37687
$$ packed form
21490A8417Q254k2023j2204p85q754q216J6098K6146j3437k2891j4762K6842K4163
21477A6848k4042J1468R541k5322r24J8908j3813l4559K64L7756J6591j8368j0629
21464a6281K0991J6964j1686j3886j0878j0494m071L1622j0596r861P263J6225
21452E312j9610p355p610p155J6099L8365P714r570J4499k735m9160k6996L4808
21439a3394J1917Q284n72k6638j5199m423J7853J9479J6554K8715O99K112o871
21426C8516P310q533j8715j9342N972K0614k4286j6412M191r081R730K3293n158
21413H099Q94J1n600k389m190K5578R338j3719K016j5073j3394K0939J5318J513
21399B9341j0724p467L0551J2268l9413m9700J556j0643j6494r710n604L8352
$$ plain form
21387 -37687 -20158 -5082 -13726 8935 20171 29133 8320 -16737 -48477 -31162 -24057 -25522
21375 -25522 -24164 -11818 20603 47832 58829 72745 74166 55449 46812 16180 -21061 -30170
21363 -30170 -7547 22953 22043 14366 21479 18909 -7146 -21340 -15792 -7649 3201 913 -17837
21350 -17837 -28288 -15132 -10454 -2358 -3252 16264 39784 22264 12153 -14281 2131 35685
21338 35685 24564 14597 4648 3613 -2167 10920 7942 -11167 -24502 -34678 -18537 -7540 -13839
21325 -13839 -9190 -632 18965 21820 37356 26929 4330 2724 -7348 21138 40128 59229
21313 59229 26792 11121 51578 82845 39202 9001 9119 24583 47957 32626 -3959 7230
21301 7230 -4083 11411 32291 34573 6885 -19512 2041 34859 39156 24051 2276 -21280
$$ packed form
21387c7687J7529J5076q644K2661J1236Q962k0813k5057l1740J7315P105j465
21375b5522J358J2346L2421K7229J0997J3916J421j8717q637l0632l7241r109
21363c0170K2623L0500r10p677P113k570k6055j4194N548Q143J0850k288j8750
21350a7837j0451J3156M678Q096q94J9516K3520j7520j0111k6434J6412L3554
21338C5685j1121r967r949j035n780J3087k978j9109j3335j0176J6141J0997o299
21325a3839M649Q558J9597K855J5536j0427k2599j606j0072K8486J8990J9101
21313E9229l2437j5671M0457L1267m3643l0201J18J5464K3374j5331l6585J1189
21301G230j1313J5494K0880K282k7688k6397K1553L2818M297j5105k1775k3556
$$ plain form
21289 -21280 -14522 10353 15434 18981 19028 19238 -96 4616 21117 13477 -14976 -28340 -20004 15160
21275 15160 26570 8947 10285 -5266 -13456 12067 19733 16654 22982 6692 7334 524 -12613
21262 -12613 -17154 23829 48438 22170 10094 19743 5664 3654 17890 34247 45265 11545
21250 11545 -35728 -28594 -47562 -49095 -25766 -21058 -3799 51645 48839 43335 46666 65672 61195
21237 61195 19182 14538 3261 -4879 -2849 -12841 -10406 -4483 9368 22998 17049 14119 13611 40106
21223 40106 38164 42773 51672 42665 22608 33959 25782 42477 37416 56951 49374 13136 -1925
21210 -1925 -11862 3233 23217 54408 44812 16207 -24791 -41842 -32205 -30513 -19928 -48226 -55936
21197 -55936 -48383 -19451 37884 57304 71667 42772 22718 32777 44372 31975 14413 -14438
$$ packed form
21289b1280O758K4875N081L547M7K10j9334M712J6501p640k8453j3364Q336L5164
21275A5160J1410j7623J338j5551q190K5523P666l079O328j6290O42o810j3137
21262a2613m541M0983K4609k6268j2076R649j4079k010J4236J6357J1018l3720
21250A1545m7273P134j8968j533K3329M708J7259N5444k806n504L331J9006m477
21237F1195m2013m644j1277q140K030r992K435N923J3851J3630n949k930n08K6495
21223D0106j942M609Q899r007k0057J1351q177J6695n061J9535p577l6238j5061
21210a925r937J5095J9984L1191r596k8605m0998j7051R637J692J0585k8298p710
21197e5936P553K8932N7335J9420J4363k8895k0054J0059J1595j2397j7562k8851
$$ plain form
21185 -14438 -8419 11098 22557 3507 5961 8906 9969 10304 13573 14558 -5138 -24150 -47865
21172 -47865 -32684 -27545 -17302 -7818 -10476 -10972 -16545 -4077 -6162 -12633 3498 46012 55552
21159 55552 23473 31073 27809 11976 20812 39495 28082 14961 11603 -19703 -35288 -20712
21147 -20712 -16160 -9773 945 -12374 -3392 8817 -2514 5309 32534 43786 19720 15713 15659
21134 15659 14211 5384 28387 35402 46542 57570 28196 -11089 -21318 -16817 -12065 -11065 -8373
21121 -8373 -4080 -9228 -4981 10912 -4837 -6582 -24557 -21224 9470 38509 24293 13294 25753
21108 25753 21984 6698 17094 10864 16923 -2520 -33104 -41004 -8275 3933 -16547 -23977 6028
21095 6028 20699 35226 19304 9015 1766 1489 23774 28471 20365 5927 -9610 -8907 3426
$$ packed form
21185a4438O019J9517J1459j9050K454K945J063L35L269R85j9696j9012k3715
21172d7865J5181N139J0243R484k658m96n573J2468k085o471J6131M2514R540
21159E5552l2079P600l264j5833Q836J8683j1413j3121l358l1306j5585J4576
21147b0712M552O387J0718j3319Q982J2209j1331P823K7225J1252k4066m007n4
21134A5659j448q827K3003P015J1140J1028k9374l9285j0229M501M752J000K692
21121h373M293n148M247J5893j5749j745j7975L333L0694K9039j4216j0999J2459
21108B5753l769j5286J0396o230O059j9443l0584p900L2729J2208k0480p430L0005
21095F028J4671J4527j5922j0289p249k77K2285M697q106j4438j5537P03J2333
$$ plain form
21082 3426 -27 -10117 11367 20379 705 -4103 19962 18227 -8711 -6933 -6549 -3127 12421
21069 12421 29539 -1456 9846 36287 52624 79242 45746 24358 29425 25273 20015 37260
21057 37260 42808 31257 10833 3791 5815 22928 42511 35646 23179 4957 -1430 -12352 -16391
21044 -16391 -10368 1845 13962 -341 -5963 12602 19292 11747 4460 9506 1295 -1478 -13374
21031 -13374 -1688 11183 -1292 -8503 6199 22994 26172 -7265 15036 20274 25213 27270 15920
21018 15920 9418 2848 5236 33241 53593 64538 40923 28751 22497 -371 -3246 -6057 -13684
21005 -13684 -15469 -23028 -19705 8726 24354 30676 -931 -37448 -29383 33892 64056 59929 47308
20992 47308 37502 15195 2546 -13869 -1300 15085 -7943 -14083 -627 13788 19820 10726
$$ packed form
21082C426l453j0090K1484R012j9674m808K4065j735k6938J778L84L422J5548
21069A2421J7118l0995J1302K6441J6337K6618l3496k1388N067m152n258J7245
21057C7260N548j1551k0424p042K024J7113J9583o865j2467j8222o387j0922m039
21044a6391O023J2213J2117j4303n622J8565O690p545p287N046q211k773j1896
21031a3374J1686J2871j2475p211J4702J6795L178l3437K2301N238M939K057j1350
21018A5920o502o570K388K8005K0352J0945k3615j2172o254k2868k875k811p627
21005a3684j785p559L323K8431J5628O322l1607l6517Q065O3275L0164m127j2621
20992D7308r806k2307j2649j6415J2569J6385k3028o140J3456J4415O032r094
$$ plain form
20980 10726 6307 19377 9664 18726 32497 31607 29821 16937 -8389 -28025 -811 15931 6428
20967 6428 16468 37705 31560 8627 21802 26564 33831 13648 9514 -9028 -8588 1364 8609
20954 8609 8001 16562 21053 -1130 -12526 -17642 -4765 18343 11699 15937 30779 36919 18382
20941 18382 13572 22076 24781 28110 31236 18666 9712 -10816 -6903 -7709 -2779 28041 32940 19663
20927 19663 19015 30565 27956 28572 11039 -11364 -21195 -42676 -42863 -30826 -18605 122 -3777
20914 -3777 -1171 -27934 -32985 -6990 32407 34494 41537 23540 12960 18986 13413 -14132 -24035
20901 -24035 -31206 -23547 -19447 -23364 -25041 -16563 -1678 8513 11160 18103 943 3996 -10108
20888 -10108 -5895 3732 -9103 -14838 -18433 -34185 -42257 -28813 -8882 -14661 -14193 4821 7930
$$ packed form
20980A0726m419J3070r713R062J3771q90j786j2884k5326j9636K7214J6742r503
20967F428J0040K1237o145k2933J3175M762P267k0183m134j8542M40R952P245
20954H609o08Q561M491k2183j1396n116J2877K3108o644M238J4842O140j8537
20941A8382m810Q504K705L329L126j2570q954k0528L913q06M930L0820M899j3277
20927A9663o48J1550k609O16j7533k2403r831k1481j87J2037J2221J8727l899
20914c777K606k6763n051K5995L9397K087P043j7997j0580O026n573k7545r903
20901b4035p171P659M100l917j677Q478J4885J0191K647O943j7160L053j4104
20888a0108M213R627j2835n735l595j5752q072J3444J9931n779M68J9014L109
$$ plain form
20875 7930 21750 31372 34601 60270 56285 37732 4887 24581 47439 31170 481 7321 34881
20862 34881 53142 51472 44946 62971 49178 29675 27708 19280 26498 31163 30426 36964 34781 34755
20848 34755 51364 64027 61918 33877 20908 46237 71067 54301 12044 -4451 -4177 -31345
20836 -31345 -44883 -45704 -36399 -17374 -16795 -7259 3774 6285 -4736 -34059 -28038 -18771 -4629
20823 -4629 6460 18157 10519 -5762 -18444 -39269 -16374 -9712 -20920 -10166 5799 8706
20811 8706 31339 26693 5980 -2984 15011 24386 18613 4442 14921 33356 43433 65816 55452
20798 55452 40621 14917 -5359 -26140 -26288 -32916 -9645 27259 24047 17408 28187 36795 49500
20785 49500 52209 22212 11427 13533 7031 14650 31396 30520 34509 45612 16043 6488 3830
$$ packed form
20875G930J3820R622L229K5669l985j8553l2845J9694K2858j6269l0689O840K7560
20862C4881J8261j670o526J8025j3793j9503j967q428P218M665p37O538k183k6
20848C4755J6609J2663k109k8041j2969K5329K4830j6766m2257j6495K74k7168
20836c1345j3538q21R305J9025N79R536J1033K511j1021k9323O021R267J4142
20823d629J1089J1697p638j6281j2682k0825K2895O662j1208J0754J5965K907
20811H706K2633m646k0713q964J7995R375n773j4171J0479J8435J0077K2383j0364
20798E5452j4831k5704k0276k0781j48o628K3271L6904l212o639J0779Q608J2705
20785D9500K709k9997j0785K106o502P619J6746q76L989J1103k9569r555k658
$$ plain form
20772 3830 15067 23287 6491 15820 28280 2544 -8967 13753 38136 43389 15171 3874
20760 3874 29566 43557 55971 52507 43342 38914 45189 37702 23262 23927 48409 29116 35213
20747 35213 66954 52329 29298 15753 33262 88779 97536 56705 31046 11374 13304 17815
20735 17815 22772 22840 19241 22293 34102 33456 26330 -4497 -39203 -17590 17312 42452 38201 12152
20721 12152 16078 26852 60142 55791 33995 47589 41647 38365 30678 48917 31284 39393 35795
20708 35795 15459 -3719 9614 21249 20626 35040 22796 6760 23286 36877 31421 8722
20696 8722 -11788 15895 6176 -24265 -12515 -5354 -890 -18160 619 14572 45750 53800 41111
20683 41111 56245 51928 28901 16114 1163 17359 24884 36294 19508 13096 49707 63478
$$ packed form
20772C830J1237Q220j6796R329J2460k5736j1511K2720K4383N253k8218j1297
20760C874K5692J3991J2414l464r165m428O275p487j4440O65K4482j9293O097
20747C5213L1741j4625k3031j3545J7509N5517Q757m0831k5659j9672J930M511
20735A7815M957O8l599L052J1809o46p126l0827l4706K1613L4902K5140m251k6049
20721A2152L926J0774L3290m351k1796J3594n942l282p687J8239j7633Q109l598
20708C5795k0336j9178J3333J1635o23J4414j2244j6036J6526J3591n456k2699
20696H722k0510K7683r719l0441J1750P161M464j7270J8779J3953L1178Q050j2689
20683D1111J5134m317k3027j2787j4951J6196P525J1410j6786o412L6611J3771
$$ plain form
20671 63478 24754 -29372 -35784 -6985 23592 22010 7216 5042 1676 35587 58176 61583 66146
20658 66146 69616 69290 64312 67484 58593 21289 7575 9180 23615 38125 56604 35909 34059
20645 34059 46078 35221 43902 52383 61654 54348 50529 54933 65174 44745 13654 59225 52372
20632 52372 21892 -3479 -14226 -12339 -11495 1680 4381 16241 16377 13375 13124 30069 58679
20619 58679 61124 60141 45814 27621 -6685 4711 -5334 -947 29795 46747 39644 49320 37632
20606 37632 44075 49022 59362 44427 22287 49530 70298 56810 24639 19929 16492 17697 -9303
20593 -9303 -19400 11158 46146 74060 57854 23491 5445 -14689 -3847 541 -18703 -39465
20581 -39465 -25303 -109 20948 5367 -38129 -23310 -11422 7956 14957 36068 28987 -5984
$$ packed form
20671F3478l8724n4126o412K8799L0577j582j4794k174l366L3911K2589L407M563
20658F6146L470l26m978L172q891l7304j3714J605J4435J4510J8479k0695j850
20645C4059J2019j0857Q681Q481R271p306l819M404J0241k0429l1091M5571o853
20632E2372l0480k5371j0747J887Q44J3175K701J1860J36l002k51J6945K8610
20619E8679K445r83j4327j8193l4306J1396j0045M387L0742J6952p103R676j1688
20606C7632O443M947J0340j4935k2140K7243K0768j3488l2171m710l437J205k7000
20593i303j0097L0558L4988K7914j6206l4363j8046k0134J0842M388j9244k0762
20581c9465J4162K5194K1057j5581m3496J4819J1888J9378P001K1111p081l4971
$$ plain form
20569 -5984 14736 34590 19922 -9564 1714 -6341 -10498 4037 3619 36795 59869 56330 57371
20556 57371 51690 33850 38381 65010 54843 30569 47241 39164 13175 25331 35662 14266
20544 14266 6417 8196 11541 17297 28733 12429 17874 20707 37700 47206 47054 54521 43311 344
20530 344 -9448 14291 25320 23840 29543 18772 23665 -9194 -41710 -15601 -2967 -11625 14203
20517 14203 44486 39430 44109 23030 25272 29077 22628 25717 29829 34860 42571 49633 1744 -928
20503 -928 10426 30751 46161 62913 67038 58277 53091 61103 67821 51018 24488 -11830 -4831
20490 -4831 5197 7819 441 17787 38622 35208 12700 22966 5622 13845 17042 -4100 -12074
20477 -12074 -12312 -22242 -13781 -22320 4908 23117 47789 35147 18502 19331 52682 87805 37688
$$ packed form
20569e984K0720J9854j4668k9486J1278q055m157J4535m18L3176K3074l539J041
20556E7371n681j7840M531K6629j0167k4274J6672q077k5989J2156J0331k1396
20544A4266p849J779L345N756J1436j6304N445K833J6993R506j52P467j1210m2967
20530C44r792K3739J1029j480N703j0771M893l2859l2516K6109J2634q658K5828
20517A4203L0283n056M679k1079K242L805o449L089M112N031P711P062m7889k672
20503i28J1354K0325J5410J6752M125q761n186Q012O718j6803k6530l6318O999
20490d831J0028K622p378J7346K0835l414k2508J0266j7344Q223L197k1142p974
20477a2074k38r930Q461q539K7228J8209K4672j2642j6645Q29L3351L5123n0117
$$ plain form
20464 37688 39326 64457 65644 53886 53151 47550 53331 50546 64280 44543 18395 6551 28979
20451 28979 4264 3881 20242 12812 40038 31379 -1585 7310 27245 26308 3774 -6345 23055
20438 23055 28352 32542 5830 14489 30872 40721 42650 26549 13577 12246 17940 22859 28516
20425 28516 26065 27456 12396 11407 1149 277 -7962 -2415 -8678 -20834 -4603 10006 17579 7257
20411 7257 -8065 -25033 -20465 -34613 -23442 -82 9240 16331 13542 4011 -2758 -2405 -9994 -18048
20397 -18048 -13305 11219 25590 26360 33094 18888 32735 52276 94259 108552 76604 60002
20385 60002 68318 13715 -443 52151 57583 18328 -2224 23105 38970 25138 30458 39929
20373 39929 30310 36328 43422 35420 48263 59009 49366 50898 39249 37256 16153 8973 36938
$$ packed form
20464C7688J638K5131J187j1758p35n601N781k785J3734j9737k6148j1844K2428
20451B8979k4715l83J6361p430K7226q659l2964Q895J9935r37k2534j0119K9400
20438B3055N297M190k6712Q659J6383R849J929j6101j2972j331N694M919N657
20425B8516k451J391j5060r89j0258q72q239N547o263j2156J6231J4609P573j0322
20411G257j5322j6968M568j4148J1171K3360R322P091k789r531o769L53p589q054
20397a8048M743K4524J4371P70O734j4206J3847J9541M1983J4293l1948j6602
20385F0002Q316n4603j4158N2594N432l9255k0552K5329J5865j3832N320R471
20373C9929r619O018P094q002J2843J0746r643J532j1649j993k1103p180K7965
$$ plain form
20360 36938 53106 34728 31473 76155 61317 38920 31451 10112 -1078 -22116 -14228 -3342
20348 -3342 9986 51098 56552 40861 16247 5254 16306 45530 52691 57378 43195 25409
20336 25409 10283 17595 20247 29376 35701 40852 47057 56463 22867 -10058 -1176 14544 40392
20323 40392 35502 9456 2434 2759 17299 60173 62193 54190 35045 5589 -17825 -18993 -227
20310 -227 12195 594 12659 9655 24535 36187 36344 22305 9818 8231 -26836 -20462 -9500
20297 -9500 -1022 27547 54941 70651 93155 80455 74879 68133 38484 50044 70068 53158
20285 53158 28829 8489 16750 38019 31938 35935 36897 7665 5472 14416 20574 30365 24315 25509
20271 25509 31625 21044 23632 62964 59450 49479 31678 36953 64246 69909 48355 44099 32016
$$ packed form
20360C6938J6168j8378l255M4682j4838k2397p469k1339j1190k1038P888J0886
20348c342J3328M1112N454j5691k4614j0993J1052K9224P161M687j4183j7786
20336B5409j5126P312K652R129O325N151O205R406l3596l2925Q882J5720K5848
20323D0392m890k6046p022L25J4540M2874K020q003j9145k9456k3414j168J8766
20310b27J2422j1601J2065l004J4880J1652J57j4039j2487j587l5067O374J0962
20297i500Q478K8569K7394J5710K2504j2700n576o746k9649J1560K0024j6910
20285E3158k4329k0340Q261K1269o081L997R62k9232k193Q944O158R791o050J194
20271B5509O116j0581K588L9332l514r971j7801N275K7293N663k1554m256j2083
$$ plain form
20258 32016 31840 45401 71784 49645 68251 78325 57554 38814 34535 56377 43098 66468
20246 66468 49413 9394 -15963 2664 14090 43386 56442 46913 40097 15865 -22377 -26576
20234 -26576 -2382 21656 52812 43002 33795 25346 29612 33730 16699 2197 -6384 -3269 -10157
20221 -10157 7457 37832 54590 74205 53081 45294 40188 9327 6934 28935 29266 49410 46253
20208 46253 48532 45877 59563 61120 43895 11464 -4541 2687 27015 30159 22126 16278 21171
20195 21171 20723 40121 52691 58712 51942 11729 8624 18405 40771 34522 43749 43516 40163 48533
20181 48533 16922 2273 -2706 2835 21139 38888 62069 74227 80141 81788 75384 69498 82443
20168 82443 108084 108804 82409 48624 19791 17316 45510 55646 48486 15948 22622 36294 21473
$$ packed form
20258C2016j76J3561K6383k2139J8606J0074k0771j8740m279K1842j3279K3370
20246F6468j7055m0019k5357J8627J1426K9296J3056r529o816k4232l8242m199
20234b6576K4194K4038L1156r810r207q449M266M118j7031j4502q581L115o888
20221a0157J7614L0375J6758J9615k1124p787n106l0861k393K2001L31K0144l157
20208D6253K279k655J3686J557j7225l2431j6005P228K4328L144q033n848M893
20195B1171m48J9398J2570O021o770m0213l105R781K2366o249R227k33l353Q370
20181D8533l1611j4649m979N541J8304J7749K3181J2158N914J647o404n886J2945
20168H2443K5641P20k6395l3785k8833k475K8194J0136p160l2538O674J3672j4821
$$ plain form
20155 21473 26286 22406 36318 63278 64777 54158 36440 31180 57622 45659 49076 52868 52963
20142 52963 70378 75460 42875 22545 58027 39204 52227 52799 39181 29400 33831 40723 30646
20129 30646 -1515 16100 27850 8866 7571 10832 33171 42752 37156 52032 44255 48178 58303
20116 58303 54256 39755 27867 58923 64870 61381 76275 52005 24320 10956 5381 25014
20104 25014 26630 23655 30261 36189 35892 25562 1026 12190 8781 28778 53884 48752 33294
20091 33294 35569 53105 45993 29068 39301 50956 53811 70998 51992 27716 43011 52903
20079 52903 34693 24826 32915 32725 46349 31629 37301 45820 73247 71635 77104 62607 45466
20066 45466 34799 32124 32579 55244 117287 111622 91131 69765 70917 86121 61248 35424 36882
$$ packed form
20155B1473M813l880J3912K6960J499j0619j7718n260K6442j1963L417L792R5
20142E2963J7415N082l2585k0330L5482j8823J3023N72j3618r781M431O892j0077
20129C0646l2161J7615J1750j8984j295L261K2339R581n596J4876p777L923J0125
20116E8303m047j4501j1888L1056N947l489J4894k4270k7685j3364n575J9633
20104B5014J616k975O606N928k97j0330k4536J1164l409J9997K5106n132j5458
20091C3294K275J7536p112j6925J0233J1655K855J7187j9006k4276J5295R892
20079E2903j8210r867Q089j90J3624j4720N672Q519K7427j612N469j4497j7141
20066D5466j0667k675M55K2665O2043n665k0491k1366J152J5204k4873k5824J458
$$ plain form
20053 36882 66311 69392 58804 63794 71856 84796 61279 56320 64606 87714 87822 62229 41488
20040 41488 38815 21905 -516 4222 41414 89547 101435 90338 64662 89180 96789 57363
20028 57363 40789 10677 15778 43658 58191 53113 62939 44620 33060 43015 34874 30321 27619
20015 27619 30244 8929 7409 15957 35228 56677 42203 5011 10936 27349 44534 51730 63237
20002 63237 43050 27294 53997 76427 78452 67221 60491 44237 39655 26927 17736 52074
19990 52074 45672 23627 31418 14061 3793 5954 11899 18707 35081 78055 70682 40023 21720
19977 21720 26494 28411 34679 47608 68177 74006 59725 40839 46453 36631 39959 44275 61790
19964 61790 54897 49848 25028 8696 -1983 20987 32608 45312 69869 87895 87374 80390 115863
$$ packed form
20053C6882K9429L081j0588M990Q062J2940k3517m959Q286K3108J08k5593k0741
20040D1488k673j6910k2421M738L7192M8133J1888j1097k5676K4518P609l9426
20028E7363j6574l0112N101K7880J4533n078R826j8319j1560R955q141m553k702
20015B7619K625k1315j520Q548J9271K1449j4474l7192N925J6413J7185P196J1507
20002F3237k0187j5756K6703K2430K025j1231o730j6254m582j2728r191L4338
19990E2074o402k2045P791j7357j0268K161N945O808J6374M2974p373l0659j8303
19977B1720M774J917O268J2929K0569N829j4281j8886N614r822L328M316J7515
19964F1790o893n049k4820j6332j0679K2970J1621J2704K4557J8026n21o984L5473
$$ plain form
19951 115863 103709 89577 81383 78357 73945 77670 85267 77239 94189 83205 75148 94002 87820
19938 87820 58322 34198 20136 41483 48754 34548 45424 41420 52741 40737 38714 57703
19926 57703 72977 78403 86331 88529 73294 42179 38783 45351 69711 72900 89724 95096 87856
19913 87856 81100 43738 13608 8016 15160 11954 42382 77036 79603 79127 95080 63348 69246
19900 69246 70222 78047 92307 96599 98131 98263 105986 131202 116907 127621 152578 153405 147350 159043
19886 159043 167721 168620 171359 187710 206256 250762 278831 299472 338185 389261 475062 613816
19874 613816 825354 1066406 1276301 1406316 1401416 1289355 1052704 764558 562523 410528
19864 410528 329538 283537 244361 216779 198970 187439 181327 157780 154008 124600 138115 124493
$$ packed form
19951A15863j2154j4132q194l026m412L725P597q028J6950j0984q057J8854o182
19938H7820k9498k4124j4062K1347P271j4206J0876m004J1321j2004k023J8989
19926E7703J5274N426P928K198j5235l1115l396O568K4360L189J6824N372p240
19913H7856o756l7362l0130n592P144l206L0428L4654K567m76J5953l1732N898
19900F9246R76P825J4260M292J532J32P723K5216j4295J0714K4957Q27o055J1693
19886A59043Q678Q99K739J6351J8546M4506K8069K0641L8713N1076Q5801J38754
19874F13816K11538K41052K09895J30015m900j12061k36651k88146k02035j51995
19864D10528q0990m6001l9176k7582j7809j1531o112k3547l772k9408J3515j3622
$$ plain form
19852 124493 111279 85943 72732 70106 78043 82506 92197 95639 92320 87200 81589 83686 88537
19839 88537 83732 94397 108519 107479 94698 90573 115805 121681 92260 76980 91506 87343 110716
19826 110716 114267 104601 111702 86119 79929 97940 94181 72012 77370 90998 93694 104784 127815
19813 127815 118410 100346 81715 68213 73628 87530 104625 118352 126924 112161 77388 72849
19801 72849 75982 58269 51901 54825 53822 37722 44438 57209 58583 64636 38420 14241 33537
19788 33537 58890 72923 61985 56285 56250 92668 101082 93144 100611 97550 67367 67284 44419 44051
19774 44051 64893 64449 73157 78916 42355 11437 4610 27539 73298 79982 77600 70787 66618
19761 66618 48722 35646 61886 60860 55044 53344 57767 92507 82240 75494 96548 115195 122507
$$ packed form
19852A24493j3214k5336j3211k626P937M463R691L442l319n120n611K097M851
19839H8537m805J0665J4122j040j2781m125K5232N876k9421j5280J4526m163K3373
19826A10716L551r666P101k5583o190J8011l759k2169N358J3628K696J1090K3031
19813A27815r405j8064j8631j3502N415J3902J7095J3727Q572j4763l4773m539
19801G2849L133j7713o368K924j003j6100O716J2771J374O053k6216k4179J9296
19788C3537K5353J4033j0938n700l5L6418Q414p938P467l061l0183q3k2865l68
19774D4051K0842m44Q708N759l6561l0918o827K2929M5759O684k382o813m169
19761F6618j7896j3076K6240j026n816j700M423L4740j0267o746K1054J8647P312
$$ plain form
19748 122507 100793 77198 49854 57151 77980 83875 86966 92512 67732 48796 41340 40651 70959
19735 70959 70918 56037 53842 67091 74268 82528 95998 73135 91407 112592 127946 110505 99709
19722 99709 81724 101235 94278 83284 122625 117142 109734 83031 89371 86828 74767 89478 107415
19709 107415 107032 65343 33968 63941 84055 83857 93153 98405 101957 103304 92836 102532 138870
19696 138870 159949 141140 115689 91706 92408 89145 106619 112713 134072 118690 120256 143228
19684 143228 125350 111103 119430 112136 119115 96126 105007 101993 76787 78999 48746 32945 45298
19671 45298 42210 27565 19903 63877 69493 83262 80942 69466 76238 75012 55080 65610 64043
19658 64043 65856 56379 55573 72575 40784 34098 41790 69141 89736 100280 72079 57654 57861
$$ packed form
19748A22507k1714k3595k7344P297K0829N895L091N546k4780j8936p456o89L0308
19735G0959m1j4881k195J3249P177Q260J3470k2863J8272K1185J5354j7441j0796
19722I9709j7985J9511o957j0994L9341n483p408k6703O340k543j2061J4711J7937
19709A07415l83m1689l1375K9973K0114j98R296N252L552J347j0468R696L6338
19696A38870K1079j8809k5451k3983P02l263J7474O094K1359j5382J566K2972
19684A43228j7878j4247Q327p294O979k2989Q881l014k5206K212l0253j5801J2353
19671D5298l088j4645p662M3974N616J3769k320j1476O772j226j9932J0530j567
19658F4043J813r477q06J7002l1791o686P692K7351K0595J0544k8201j4425K07
$$ plain form
19645 57861 72084 83332 98349 95770 104123 106022 87865 107085 121477 139861 141531 148870 141748
19632 141748 125725 126701 134674 124045 116495 124560 134823 112782 101921 96420 81546 99984 132994
19619 132994 134394 139414 133890 156499 156913 146879 122029 82183 63155 72503 89772 88466 74532
19606 74532 96573 117349 124130 127839 134954 95594 72417 114398 135012 127637 94509 89348 52744
19593 52744 45350 69056 108530 131634 134925 156765 165588 157162 168541 173878 162266 156389 153001
19580 153001 163762 159920 161098 142371 130021 137454 116072 107671 85180 58461 58621 49809 77312
19567 77312 87701 111501 118357 94604 110451 101503 73493 52201 68923 97955 93501 85777
19555 85777 60796 28311 35947 69886 60602 84623 101349 89619 72655 64431 83789 106412
$$ packed form
19645E7861J4223J1248J5017k579Q353J899j8157J9220J4392J8384J670P339p122
19632A41748j6023R76P973j0629p550Q065J0263k2041j0861n501j4874J8438L3010
19619A32994J400N020n524K2609M14j0034k4850l9846j9028R348J7269j306j3934
19606G4532K2041K0776O781L709P115l9360k3177M1981K0614p375l3128n161l6604
19593E2744p394K3706L9474K3104L291K1840Q823q426J1379N337j1612n877l388
19580A53001J0761l842J178j8727j2350P433k1382q401k2491k6719J60q812K7503
19567G7312J0389K3800O856k3753J5847q948k8010k1292J6722K9032m454p724
19555H5777k4981l2485P636L3939r284K4021J6726j1730j6964q224J9358K2623
$$ plain form
19543 106412 101142 95746 113677 113438 118480 113164 103961 123092 138967 130027 148647 188757 192940
19530 192940 190044 171973 167046 184698 186740 146680 116317 112721 148818 181209 188369 163802
19518 163802 137736 142619 169942 180624 172333 200294 278454 370245 441778 404752 289297 218399
19506 218399 199948 179124 173459 170555 167346 166965 174860 162178 159746 181028 214178 250007 269320
19493 269320 248947 237387 217817 221145 214123 228681 232493 224888 244119 257903 245743 243126
19481 243126 222486 213535 230896 217883 176246 174102 196759 178132 142600 128927 127540 138190
19469 138190 154470 135399 107860 78850 76777 77757 98988 118943 115036 127714 137519 177596
19457 177596 216640 257559 243363 235864 241066 259663 250057 240324 238032 243089 297764 335335 315429
$$ packed form
19543A06412n270n396J7931k39N042n316r203J9131J5875q940J8620M0110M183
19530A92940k896j8071m927J7652K042m0060l0363l596L6097L2391P160k4567
19518A63802k6066M883K7323J0682q291K7961P8160R1791P1533l7026j15455p0898
19506B18399j8451k0824n665k904l209l81P895j2682k432K1282L3150L5829J9313
19493B69320k0373j1560j9570L328p022J4558L812p605J9231J3784j2160k617
19481B43126k0640q951J7361j3013m1637k144K2657j8627l5532j3673j387J0650
19469A38190J6280j9071k7539k9010k073R80K1231J9955l907J2678R805M0077
19457A77596L9044M0919j4196p499N202J8597r606r733k292N057N4675L7571j9906
$$ plain form
19444 315429 321752 338491 349821 345135 288999 241224 208980 199461 206676 229703 268772 302069
19432 302069 327392 319850 295895 260015 234792 202321 190586 179697 204764 225441 216558 234369
19420 234369 214384 217003 203429 184953 172428 185777 172983 191960 189335 214830 224067 230623
19408 230623 238085 241229 248236 278548 296016 314557 322850 307564 298102 284637 289246 328202 355223
19395 355223 330500 303820 255663 236563 214718 172158 161165 162949 183356 223886 261602 248489
19383 248489 230063 227533 242716 273549 268437 239035 262138 274527 254216 233070 220066 244922
19371 244922 264248 238137 234405 225319 224800 219808 215672 231811 245639 244457 246011 242316 219612
19358 219612 205015 223910 242797 233461 221198 193302 176413 199459 223955 244746 217740 207769
$$ packed form
19444C15429O323J6739J1330m686n6136m7775l2244r519P215K3027L9069L3297
19432C02069K5323p542k3955l5880k5223l2471j1735j0889K5067K0677q883J7811
19420B34369j9985K619j3574j8476j2525J3349j2794J8977k625K5495R237O556
19408B30623P462L144P007L0312J7468J8541Q293j5286r462j3465M609L8956K7021
19395C55223k4723k6680m8157j9100k1845m2560j0993J784K0407M0530L7716j3113
19383B48489j8426k530J5183L0833n112k9402K3103J2389k0311k1146j3004K4856
19371B44922J9326k6111l732r086n19m992m136J6139J3828j182J554l695k2704
19358B19612j4597J8895J8887r336j2263k7896j6889K3046K4496K0791k7006r971
$$ plain form
19346 207769 223208 217623 221364 233625 268751 265531 234983 227518 214713 247793 263299 235060
19334 235060 249213 239071 237962 261762 292878 299558 317696 325801 325900 321959 274887 262924 271729
19321 271729 280417 299856 318356 349183 358971 341423 336093 345475 350331 351577 347741 321184 310153
19308 310153 333376 345697 332581 322282 346194 351057 333831 318478 315140 331340 344395 332966
19296 332966 325966 356251 389174 407537 402188 389109 393088 400246 399315 416084 444657 480593 514075
19283 514075 568389 642750 718270 766419 803339 858144 906899 915822 918148 915407 883155 894021
19271 894021 913107 914317 861417 778899 709207 684138 696861 727938 729037 710069 703736 727919
19259 727919 722042 699466 698988 696917 683942 667362 679820 697205 689771 658038 601139 538735
$$ packed form
19346B07769J5439n585L741J2261L5126l220l0548p465j2805L3080J5506k8239
19334B35060J4153j0142j109K3800L1116O680J8138Q105R9l941m7072j1963Q805
19321B71729Q688J9439J8500L0827R788j7548n330R382M856J246l836k6557j1031
19308C10153K3223J2321j3116j0299K3912M863j7226j5353l338J6200J3055j1429
19296C32966p000L0285L2923J8363n349j3079L979P158r31J6769K8573L5936L3482
19283E14075N4314P4361P5520M8149L6920N4805M8755Q923K326k741l2252J0866
19271H94021J9086J210n2900q2518o9692k5069J2723L1077J099j8968o333K4183
19259G27919n877k2576m78k071j2975j6580J2458J7385p434l1733n6899o2404
$$ plain form
19247 538735 509144 508346 534895 549382 548718 546794 587268 598754 635243 683508 761172 814348
19235 814348 862316 922031 931398 935133 929799 924544 957942 975809 956918 939823 978958 1051563
19223 1051563 1110135 1171887 1229302 1301287 1351298 1401061 1465334 1475743 1400080 1282812 1179175
19212 1179175 1141231 1147998 1201983 1251854 1307364 1372180 1372719 1346585 1318819 1354735 1390222 1445266
19200 1445266 1493234 1546136 1623823 1744846 1871763 2031900 2184431 2326160 2375097 2447812
19190 2447812 2592326 2807253 3076345 3358643 3569594 3664062 3626441 3536309 3468125 3552502
19180 3552502 3727669 3944705 4287713 4742979 5281410 5913533 6536149 7108212 7625656
19171 7625656 8070311 8502937 9034245 9709870 10544438 11547661 12698799 13991156 15457356
$$ packed form
19247E38735k9591p98K6549J4487o64j924M0474J1486L6489M8265P7664N3176
19235H14348M7968N9715R367L735n334n255L3398J7867j8891j7095L9135P2605
19223A051563N8572O1752N7415P1985N0011M9763O4273J0409p5663j17268j03637
19212A179175l7944O767N3985M9871N5510O4816N39k6134k7766L5916L5487N5044
19200A445266M7968N2902P7687J21023J26917J60137J52531J41729M8937P2715
19190B447812J44514K14927K69092K82298K10951R4468l7621r0132o8184Q4377
19180C552502J75167K17036L43008M55266N38431O32123O22616N72063N17444
19171G625656M44655M32626N31308O75625Q34568J003223J151138J292357J466200
$$ plain form
19162 15457356 17130953 18988424 21021459 23305684 25937886 29022631 32842465 37858615
19154 37858615 44573709 53834663 67081452 86537503 115143518 154404925 199504791
19147 199504791 235853980 248334441 234124463 196955848 147022949 101792390 70112885
19140 70112885 50008059 37178596 28757535 23101205 19243198 16516207 14578459 13088550
19132 13088550 11785765 10474715 9091298 7822357 6821976 6069916 5484383 5076522
19124 5076522 4799221 4628180 4508845 4413775 4316298 4167710 3900447 3552147 3175945 2847957
19114 2847957 2553197 2334931 2133464 1927738 1760501 1649086 1569346 1544800 1602738 1698613
19104 1698613 1783961 1756965 1655441 1476465 1280825 1127187 1021461 943836 925334 927081
$$ packed form
19162A5457356J673597J857471K033035K284225K632202L084745L819834N016150
19154C7858615O715094R260954J3246789J9456051K8606015L9261407M5099866
19147A99504791L6349189J2480461j4209978l7168615m9932899m5230559l1679505
19140G0112885k0104826j2829463q421061n656330l858007k726991j937748j489909
19132A3088550j302785j311050j383417j268941j000381p52060n85533m07861
19124E076522k77301j71041j19335r5070r7477j48588k67263l48300l76202l27988
19114B847957k94760k18266k01467k05726j67237j11415p9740k4546N7938R5875
19104A698613Q5348k6996j01524j78976j95640j53638j05726p7625j8502J747
$$ plain form
19094 927081 917678 891195 848054 825244 796473 772769 758670 756619 765509 791008 810770 883566
19082 883566 987090 1065085 1102762 1056528 922011 792181 730581 702536 683461 727924 791912
19071 791912 851668 874923 838960 777692 694176 625973 542644 491986 482793 486072 465851 473706
19059 473706 482785 482550 442200 390528 392359 396405 416161 442682 424841 401499 386428 378162 362624
19046 362624 346679 347350 342661 343229 351832 351862 366558 364158 353343 344572 372737 377572 402813 445296
19032 445296 448533 429296 438480 463384 483033 484051 455485 474351 478502 485832 476811 458698 435871
19019 435871 409189 408730 417079 428500 406652 394331 377888 333375 300255 315851 308880 295542
19007 295542 306047 313043 329620 338882 323896 307824 285671 279420 298107 307612 289544 315678
$$ packed form
19094I27081r403k6483m3141k2810k8771k3704j4099k051Q890K5499J9762P2796
19082H83566J03524P7995L7677m6234j34517j29830o1600k8045j9075M4463O3988
19071G91912N9756K3255l5963o1268q3516o8203q3329n0658r193L279k0221P855
19059D73706R079k35m0350n1672J831M046J9756K6521j7841k3342j5071q266j5538
19046C62624j5945O71m689N68Q603L0J4696k400j0815q771K8165M835K5241M2483
19032D45296L237j9237R184K4904J9649J018k8566J8866M151P330r021j8113k2827
19019D35871k6682m59Q349J1421k1848j2321j6443m4513l3120J5596o971j3338
19007B95542J0505O996J6577R262j4986j6072k2153o251J8687R505j8068K6134
$$ plain form
18995 315678 349764 375361 359475 322507 328534 324058 279645 278311 287726 282868 279947 282859 290628
18982 290628 302829 314488 305445 275227 264255 278995 300790 307736 323775 347048 337454 325848
18970 325848 334784 346329 349078 347284 364798 375055 360456 342728 341936 348086 359433 358167 346006
18957 346006 350653 352044 372203 367947 349749 332077 325054 326130 329797 345613 377062 380350 370161
18944 370161 364296 411853 452211 464234 477014 514540 527805 500873 479017 474859 488956 523924
18932 523924 576267 637965 688828 710506 648194 552953 483064 458192 474125 473793 452933 450644
18920 450644 479818 522214 552180 534918 530223 515592 469258 411544 400255 427074 443445 459743
18908 459743 506343 513352 525311 534733 492610 485450 520379 565765 608842 654342 668256 701982
$$ packed form
18995C15678L4086K5597j5886l6968O027m476m4413j334R415m858k921K912P769
18982B90628J2201J1659r043l0218j0972J4740K1795O946J6039K3273r594j1606
18970C25848Q936J1545K749j794J7514J0257j4599j7728p92O150J1347j266j2161
18957C46006M647J391K0159m256j8198j7672p023J076L667J5816L1449L288j0189
18944C70161n865M7557M0358J2023J2780L7526J3265k6932k1856m158J4097L4968
18932E23924N2343O1698N0863K1678o2312r5241o9889k4872J5933l32k0860k289
18920D50644K9174M2396K9966j7262m695j4631m6334n7714j1289K6819J6371J6298
18908D59743M6600P009J1959R422m2123p160L4929M5386M3077M5500J3914L3726
$$ plain form
18896 701982 744503 825190 914910 959131 940500 899936 866814 897655 963172 1082549 1267882
18885 1267882 1394600 1375677 1241995 1102630 1045666 1043119 1064915 1132852 1267587 1465037
18875 1465037 1725921 2004943 2184652 2227004 2184648 2048458 1799818 1461612 1189979 998666
18865 998666 856838 776977 750404 726691 726025 719929 715756 744134 760029 769044 762226 747405
18853 747405 762668 811972 862488 920660 956356 992189 980904 949458 964446 1012842 1052839
18842 1052839 1116499 1182995 1256359 1260206 1165464 1111997 1131400 1172833 1151700 1173581 1282292
18831 1282292 1370842 1445875 1456052 1368309 1256332 1175777 1135083 1141937 1168525 1219500 1264242
18820 1264242 1259427 1260308 1271620 1326387 1409354 1490156 1577801 1639142 1702745 1794917 1882069 1945538
$$ packed form
18896G01982M2521Q0687Q9720M4221j8631m0564l3122L0841O5517J19377J85333
18885A267882J26718j8923j33682j39365n6964k547K1796O7937J34735J97450
18875A465037K60884K79022J79709M2352m2356j36190k48640l38206k71633j91313
18865I98666j41828p9861k6573k3713o66o096m173K8378J5895R015o818j4821
18853G47405J5263M9304N0516N8172L5696L5833j1285l1446J4988M8396L9997
18842A052839O3660O6496P3364L847r4742n3467J9403M1433k1133K1881J08711
18831A282292Q8550P5033J0177q7743j11977q0555m0694O854K6588N0975M4742
18820A264242m815Q81J1312N4767Q2967Q0802Q7645O1341O3603R2172Q7152O3469
$$ plain form
18808 1945538 2012483 2087312 2182700 2302458 2463593 2673841 2908619 3171373 3494233 3848240
18798 3848240 4247368 4628145 5087312 5617663 6103788 6531743 6995229 7534126 8175230
18789 8175230 8900000 9690700 10483148 11300614 12247268 13454284 15062954 17173562 20030684
18780 20030684 23990782 29650717 37581435 47904113 60414007 74216536 87806111
18773 87806111 99366199 103237492 93222459 74554266 60082005 55213770 59002792
18766 59002792 71158448 91842596 117554163 137229136 138216859 119525162 93426767
18759 93426767 72442409 59483936 49566988 39644136 31788407 27833431 27357276 29678389
18751 29678389 34193855 38937878 40122938 35693167 28498529 22602358 19116369 17335739
$$ packed form
18808A945538O6945P4829R5388J19758J61135K10248K34778K62754L22860L54007
18798C848240L99128L80777M59167N30351M86125M27955M63486N38897O41104
18789H175230P24770P90700P92448Q17466R46654J207016J608670K110608K857122
18780B0030684L960098N659935P930718J0322678J2509894J3802529J3589575
18773H7806111J1560088L871293j0015033j8668193j4472261m868235L789022
18766E9002792J2155656K0684148K5711567J9674973R87723j8691697k6098395
18759I3426767k0984358j2958473r916948r922852p855729l954976m76155K321113
18751B9678389M515466M744023J185060m429771p194638n896171l485989j780630
$$ plain form
18743 17335739 16506163 16158735 16197994 16622788 17393590 18605040 20265237 22385831 25102075
18734 25102075 28868104 34375988 42860208 55475798 70574687 81702169 82875983 77351186
18726 77351186 73863943 75658838 78842728 81332846 88018167 105814229 134334085 158586556
18718 158586556 160023860 142359029 123985964 111825210 104957850 106744933 117354287
18711 117354287 128154469 124619168 100834179 69171124 45072501 31312636 23795682
18704 23795682 19250207 16230307 14396603 13578506 13745944 14998818 17115248 18931674
18696 18931674 18457640 15297282 11410082 8467669 6559754 5340102 4544722 4062943
18688 4062943 3755379 3542700 3339928 3091892 2796095 2499267 2212010 1997910 1822692
$$ packed form
18743A7335739q29576l47428L9259M24794P70802J211450J660197K120594K716244
18734B5102075L766029N507884Q484220J2615590J5098889J1127482J173814n524797
18726G7351186l487243J794895L183890K490118O685321J7796062K8519856K4252471
18718A58586556J437304j7664831j8373065j2160754o867360J787083J0609354
18711A17354287J0800182l535301k3784989l1663055k4098623j3759865p516954
18704B3795682m545475l019900j833704q18097J67438J252874K116430J816426
18696A8931674m74034l160358l887200k942413j907915j219652p95380m81779
18688D062943l07564k12679k02772k48036k95797k96828k87257k14100j75218
$$ plain form
18679 1822692 1724946 1640384 1564002 1477867 1407722 1338992 1265663 1174333 1111144 1075081 1060604
18668 1060604 1028779 997210 969139 958130 983708 1011329 1091041 1154432 1097312 961153 878461
18657 878461 872044 899573 908117 965901 1054822 1109226 1093713 978503 880987 810595 758519 756948
18645 756948 802634 838571 832042 751298 671876 655164 631193 606482 642784 682888 745352 763234
18633 763234 787179 786079 773734 744976 736658 704893 659851 642287 634397 622205 604018 588050
18621 588050 597350 629541 638674 591537 521411 501359 507333 505706 518958 565156 605968 667579
18609 667579 720333 723054 701460 675194 622958 574327 544096 508412 485370 463347 458909 510520
18597 510520 560481 589221 599728 646119 714940 734374 778681 791931 810087 799907 801557 772564
$$ packed form
18679A822692r7746q4562p6382q6135p0145o8730p3329r1330o3189l6063j4477
18668A060604l1825l1569k8071j1009K5578K7621P9712O3391n7120j36159q2692
18657H78461o417K7529Q544N7784Q8921N4404j5513j15210r7516p0392n2076j571
18645G56948M5686L5937o529q0744p9422j6712k3971k4711L6302M0104O2464J7882
18633G63234K3945j100j2345k8758q318l1765m5042j7564p890j2192j8187j5968
18621E88050R300L2191R133m7137p0126k0052N974j627J3252M6198M0812O1611
18609F67579N2754K721k1594k6266n2236m8631l0231l5684k3042k2023m438N1611
18597E10520M9961K8740J0507M6391O8821J9434M4307J3250J8156j0180J650k8993
$$ plain form
18585 772564 674123 593304 563662 544271 582983 646702 643515 591292 570003 557070 533870 534891
18573 534891 576051 602026 640372 697031 702837 664615 658980 679992 687222 685440 677899 677057 685876
18560 685876 682703 660814 672067 675150 716159 724471 700093 744693 822565 862062 882205 909520
18548 909520 941940 969658 1037316 1115745 1202629 1294610 1410283 1552197 1611847 1533625 1412426
18537 1412426 1278737 1155940 1051915 955514 929405 925513 939732 912293 862109 818226 779654
18526 779654 772637 781720 806601 807347 815761 832581 832232 843084 846979 818032 781953 796761 840271
18513 840271 880998 926754 945891 956887 952639 923848 909246 945541 1028447 1087709 1148495 1249754
18501 1249754 1335485 1354632 1314062 1295281 1298049 1351187 1442388 1549077 1632584 1700729 1706400
$$ packed form
18585G72564r8441q0819k9642j9391L8712O3719l187n2223k1289j2933k3200J021
18573E34891M1160K5975L8346N6659N806l8222n635K1012P230j782p541q42Q819
18560F85876l173k1889J1253L083M1009Q312k4378M4600P7872L9497K0143K7315
18548I09520L2420K7718O7658P8429Q6884R1981J15673J41914N9650p8222j21199
18537A412426j33689j22797j04025r6401k6109l892J4219k7439n0184m3883l8572
18526G79654p017R083K4881P46Q414J6820l49J0852L895k8947l6079J4808M3510
18513H40271M0727M5756J9137J0996m248k8791j4602L6295Q2906N9262O0786J01259
18501A249754Q5731J9147m0570j8781K768N3138R1201J06689Q3507O8145N671
$$ plain form
18490 1706400 1605583 1508907 1459223 1409444 1304834 1240704 1220520 1227252 1236166 1228252 1209384
18479 1209384 1212113 1231782 1236952 1274796 1315030 1355800 1366224 1350802 1339273 1335173 1367100 1399652
18467 1399652 1422659 1486371 1550577 1656341 1758553 1857197 1994254 2160943 2347734 2565636
18457 2565636 2796689 2985307 3064249 3121367 3194901 3395868 3698014 4121605 4595179 5056605
18447 5056605 5515225 5861675 6108178 6413952 6911194 7636356 8602700 9860401 11493068
18438 11493068 13690433 16831659 21579225 28423806 36449101 43234750 48252064 48450364
18430 48450364 40100673 31183423 27291544 27830056 32356574 41475319 55319057 69819759
18422 69819759 75389495 68567449 52186471 35495022 25350803 20236625 17942617 17530946
$$ packed form
18490A706400j00817r6676m9684m9779j04610o4130k0184O732Q914p914j8868
18479A209384K729J9669N170L7844M0234M0770J0424j5422j1529m100L1927L2552
18467A399652K3007O3712O4206J05764J02212R8644J37057J66689J86791K17902
18457B565636K31053J88618P8942N7118P3534K00967L02146M23591M73574M61426
18447E056605M58620L46450K46503L05774M97242P25162R66344J257701J632667
18438A1493068K197365L141226M747566O844581Q025295O785649N017314J98300
18430D8450364q349691q917250l891879N38512M526518R118745J3843738J4500702
18422F9819759N569736o822046j6380978j6691449j0144219n114178k294008m11671
$$ plain form
18414 17530946 18739316 21632004 26135600 30447321 30324098 24548209 18473891 14771736
18406 14771736 12788553 11838409 11619607 11818086 12208281 12698973 13321715 14169592 15286595
18397 15286595 16696723 18611592 21451565 25596420 31261821 37455700 41235038 42006009
18389 42006009 43282409 45094387 46553856 50935557 61241252 78672922 101335182 119801371
18381 119801371 125582092 128545937 141025030 163624335 174358207 149114450 104648917
18374 104648917 71591146 54720640 48069558 48073194 53504916 62949239 71662824 73435898
18366 73435898 69715631 60757358 44666034 30345227 22001663 17428877 14751488 13122589
18358 13122589 12155826 11636173 11477788 11548103 11742764 11940876 11984085 12105283 12434653 12972010
$$ packed form
18414A7530946J208370K892688M503596M311721j23223n775889o074318l702155
18406A4771736j983183r50144k18802J98479L90195M90692O22742Q47877J117003
18397A5286595J410128J914869K839973M144855N665401O193879L779338P70971
18389D2006009J276400J811978J459469M381701J0305695J7431670K2662260J8466189
18381A19801371N780721K963845J2479093K2599305J0733872k5243757m4465533
18374A04648917l3057771j6870506o651082L636N431722R444323Q713585J773074
18366G3435898l720267q958273j6091324j4320807q343564m572786k677389j628899
18358A3122589r66763n19653j58385P0315J94661J98112M3209J21198L29370N37357
$$ plain form
18348 12972010 13751315 14801589 16304531 18291335 20963889 24866020 30830741 39656528
18340 39656528 50728691 59458809 58527425 50713831 45928054 47618134 56135449 72062874
18332 72062874 93031679 108490589 110072550 103447265 91690435 83836758 82717656 75418106
18324 75418106 55798365 37052075 25976642 20111233 17080575 15887869 16203354 17763792
18316 17763792 19848934 20241248 17354337 13677915 11247592 9856872 9033486 8656819
18308 8656819 8471417 8340617 8341003 8460887 8705802 9127638 9682565 10194267 10670723 11352855
18298 11352855 12320752 13474077 14794220 16346171 18306227 21097306 25402714 32093200
18290 32093200 41425854 51173764 54984337 49559321 41581231 37554180 38195327 43296463
$$ packed form
18348A2972010P79305J050274J502942J986804K672554L902131N964721Q825787
18340C9656528J1072163Q730118r31384p813594m785777J690080Q517315J5927425
18332G2062874K0968805J5458910J581961o625285j1756830p853677j119102p299550
18324G5418106j9619741j8746290j1075433n865409l030658j192706L15485J560438
18316A7763792K085142L92314k886911l676422k430323j390720q23386l76667
18308H656819j85402j30800L86J19884K44915M21836N54927N11702M76456O82132
18298A1352855R67897J153325J320143J551951J960056K791079M305408O690486
18290C2093200R332654R747910L810573n425016p978090m027051O41147N101136
$$ plain form
18282 43296463 53510454 69575572 89013904 100646157 92090306 71302896 55256804
18275 55256804 47872154 46753898 50489454 58814825 70460579 80226138 81553899 78260070
18267 78260070 80894650 94406760 120557911 160063190 208034591 250660365 271762818
18260 271762818 263270441 227722905 175937961 124121854 84997348 60773204 47242962
18253 47242962 40528116 38567028 39971890 42083429 40549156 34341548 27719427 23526504
18245 23526504 21306578 20244874 20153158 21127786 23219854 26832969 32771962 41937747
18237 41937747 53844305 65963950 76960500 85221831 83935268 70437793 53577582
18230 53577582 41533679 33096014 25430587 19154904 15025908 12484875 10830895 9669506
$$ packed form
18282D3296463J0213991J6065118J9438332J1632253q555851k0787410j6046092
18275E5256804p384650j118256L735556Q325371J1645754R765559J327761l293829
18267G8260070K634580J3512110K6151151L9505279M7971401M2625774K1102453
18260B71762818q492377l5547536n1784944n1816107l9124506k4224144j3530242
18253D7242962o714846j961088J404862K111539j534273o207608o622121m192923
18245B3526504k219926j061704r1716R74628K092068L613115N938993R165785
18237D1937747J1906558J2119645J0996550Q261331j286563j3497475j6860211
18230E3577582j2043903q437665p665427o275683m128996k541033j653980j161389
$$ plain form
18222 9669506 8760332 8175502 8035074 8478046 9651689 11795012 14728914 16965950 16100393
18213 16100393 12509523 9164184 7224950 6291452 5901095 5811464 5842931 5923512 5951522
18204 5951522 5985574 6010185 6058784 6226767 6739778 7880853 9915306 12759961 15270133
18195 15270133 15371736 13022563 10702326 9752473 10259185 12324853 16142343 21030261
18187 21030261 23823904 21211436 15388141 10819364 8432089 7620269 8074974 9568169
18179 9568169 11174168 11104787 8661544 5780706 3912226 2876990 2275743 1862961 1552095
18170 1552095 1338692 1214706 1123273 1084310 1098482 1150723 1146761 1071789 985799 892253 840049
18159 840049 826166 798714 793383 759602 733603 707255 651541 601931 572405 526722 519491 523389
$$ packed form
18222I669506r09174n84830j40428M42972J173643K143323K933902K237036q65557
18213A6100393l590870l345339j939234r33498l90357q9631L1467Q0581K8010
18204E951522L4052K4611M8599J67983N13011J141075K034453K844655K510172
18195A5270133J01603k349173k320237r49853N06712K065668L817490M887918
18187B1030261K793643k612468n823295m568777k387275q11820M54705J493195
18179I568169J605999o9381k443243k880838j868480j035236o01247m12782l10866
18170A552095k13403j23986r1433l8963J4172N2241l962p4972q5990r3546n2204
18159H40049j3883k7452n331l3781k5999k6348n5714m9610k9526m5683p231L898
$$ plain form
18147 523389 514732 481769 467562 454651 473376 509853 507558 521664 528512 537705 566564 603209
18135 603209 707115 819427 909443 968513 1016224 1082735 1189940 1322785 1467531 1625288
18125 1625288 1777478 1920694 2093870 2301738 2553052 2831754 3168874 3603623 4137525
18116 4137525 4806489 5698955 6949410 8853179 12011128 17690971 27946008 43879360
18108 43879360 58967676 52804882 30112046 15534723 8939902 5699557 3900916 2829662
18100 2829662 2176584 1768547 1454064 1225867 1061852 913261 776298 614636 471400
18091 471400 398277 379821 350280 305834 299415 302179 290151 250847 246969 208218 154612 150147
18079 150147 153100 164017 177774 161324 124870 83160 47914 10817 -8114 5036 -22353 -21749
$$ packed form
18147E23389q657l2963j4207j2911J8725L6477k295J4106O848R193K8859L6645
18135F03209J03906J12312R0016N9070M7711O6511J07205J32845J44746J57757
18125A625288J52190J43216J73176K07868K51314K78702L37120M34749N33902
18116D137525O68964Q92466J250455J903769L157949N679843J0255037J5933352
18108D3879360J5088316o162794k2692836j4577323o594821l240345j798641j071254
18100B829662o53078m08037l14483k28197j64015j48591j36963j61662j43236
18091D71400p3123j8456k9541m4446o419K764j2028l9304l878l8751n3606m465
18079A50147K953J0917J3757j6450l6454m1710l5246l7097j8931J3150k7389O04
$$ plain form
18067 -21749 6874 47977 96145 116392 96978 86337 38314 7429 13614 7454 -9484 -18546
18055 -18546 -21795 -16236 13842 16575 5382 11134 17037 29584 20046 16867 22253 20742 35724
18042 35724 54731 26668 27320 44310 22609 5174 14856 23791 8980 10765 -14565 -18695 -8689
18029 -8689 -11945 -10758 -15022 4930 -12736 -26671 -53498 -52851 -60524 -54511 -44343 -21464 2936
18016 2936 2852 -14210 -19605 -37707 -47513 -25947 -22923 -25024 -9416 -23120 -27015 -7479 29165
18003 29165 12778 -18568 -38886 -37474 -33081 -41294 -20517 1844 11500 27414 16968 9247 14766
17990 14766 1055 -17864 -13080 -37570 -32548 -31271 -32306 -60206 -84235 -76226 -45158 -25418 -51282
17977 -51282 -71206 -81647 -97711 -120122 -126368 -100411 -106908 -100532 -46674 -35727 -48439 -42311
$$ packed form
18067b1749K8623M1103M8168K0247j9414j0641m8023l0885O185o160j6938r062
18055a8546l249N559L0078K733j1193N752N903J2547r538l179N386j511J4982
18042C5724J9007k8063O52J6990k1701j7435R682Q935j4811J785k5330m130J0006
18029h689l256J187m264J9952j7666j3935k6827O47p673O013J0168K2879K4400
18016B936q4j7062n395j8102r806K1566L024k101J5608j3704l895J9536L6644
18003B9165j6387l1346k0318J412M393q213K0777K2361R656J5914j0446p721N519
17990A4766j3711j8919M784k4490N022J277j035k7900k4029Q009L1068J9740k5864
17977e1282j9924j0441j6064k2411o246K5957o497O376N3858J0947j2712O128
$$ plain form
17965 -42311 -20614 -34710 -49141 -61681 -77469 -103032 -87846 -67904 -64927 -84485 -111810 -112537
17953 -112537 -87250 -65472 -56499 -30370 -10341 18327 27969 -14778 -30146 -31874 -18237 -39365
17941 -39365 -42787 -47110 -70037 -55742 -29837 -26335 -37724 -65795 -64023 -61300 -41824 -31581 -5236
17928 -5236 -6442 11076 28083 53446 81162 116572 148885 147941 143408 181229 240676 302280 362723
17915 362723 338418 286178 234704 256442 291931 343722 426930 449722 479710 505774 443219
17904 443219 303682 174029 98742 44831 27600 49447 38127 27731 51851 72758 82994
17893 82994 93043 75173 62009 51775 69718 69947 18553 -15651 -24145 -10030 26748 39644
17881 39644 53035 76496 62738 49762 100823 178588 164154 171654 216170 300803 387668 476376
$$ packed form
17965d2311K1697j4096j4431j2540j5788k5563J5186J9942K977j9558k7325p27
17953a12537K5287K1778Q973K6129K0029K8668R642m2747j5368j728J3637k1128
17941c9365l422m323k2927J4295K5905L502j1389k8071J772K723J9476J0243K6345
17928e236j206J7518J7007K5363K7716L5410L2313r44m533L7821N9447O1604O0443
17915C62723k4305n2240n1474K1738L5489N1791Q3208K2792K9988K6064o2555
17904D43219j39537j29653p5287n3911j7231K1847j1320j0396K4120K0907J0236
17893H2994J0049j7870j3164j0234J7943K29n1394l4204q494J4115L6778J2896
17881C9644J3391K3461j3758j2976N1061P7765j4434P500M4516Q4633Q6865Q8708
$$ plain form
17869 476376 554099 544307 466349 441439 477329 545945 600672 642714 647864 577297 463984 338763
17857 338763 265947 250599 274366 306891 380401 425892 384762 290694 180607 101664 74204
17846 74204 86537 102255 57117 -1045 -32481 -30660 -5730 783 -12748 -9160 2495 4384
17834 4384 -15109 -15810 -16560 15095 47852 65010 91431 111296 153918 182623 197317 214565 229963
17821 229963 230458 225022 201492 197190 184267 136698 83774 74074 57976 69124 75024 92822 125975
17808 125975 197660 264536 277974 237360 146499 78846 44863 19736 2220 -21725 -36883
17797 -36883 -34972 -24250 -38463 -29614 -33918 -43040 -38348 -42499 -48459 -50988 -42612 14462 48998
17784 48998 64873 76308 49464 43545 48708 52330 69089 120953 172159 222058 192190 141576
$$ packed form
17869D76376P7723r792p7958k4910L5890O8616N4727M2042N150p0567j13313j25221
17857C38763p2816j5348K3767L2525P3510M5491m1130r4068j10087p8943k7460
17846G4204J2333J5718m5138n8162l1436J821K4930O513j3531L588J1655J889
17834D384j9493p01p50L1655L2757J7158K6421J9865M2622K8705J4694J7248J5398
17821B29963M95n436k3530m302j2923m7569n2924r700j6098J1148N900J7798L3153
17808A25975P1685O6876J3438m0614r0861o7653l3983k5127j7516k3945j5158
17797c6883J911J0722j4213Q849m304r122M692m151n960k529Q376N7074L4536
17784D8998J5875J1435k6844n919N163L622J6759N1864N1206M9899k9868n0614
$$ plain form
17772 141576 92841 65496 74709 91176 108691 115285 105958 61259 9365 -1696 -8056 -10773
17760 -10773 -30612 -25550 -15128 -25683 -32533 -31575 -27214 -28398 -16565 -710 3142 6215 -1567
17747 -1567 -24361 -33183 -21685 4292 9576 1824 4443 54289 94947 139256 182366 175451 163157
17734 163157 184601 176031 187072 218360 259974 322267 401774 419492 359139 262271 180820 176177
17722 176177 189596 231380 215703 185223 122709 85180 40799 5240 -8285 -2582 18258 1916
17710 1916 14732 19191 -14247 -64974 -88391 -50311 -32844 -34377 -42257 -40275 -27049 -30168 -15411
17697 -15411 -31958 -9388 12866 -12309 -32877 -21156 36063 63286 103006 126144 107699 84442
17685 84442 52699 53835 66974 110046 159907 160030 115014 102917 71049 54656 40658 46086
$$ packed form
17772A41576m8735k7345R213J6467J7515O594r327m4699n1894j1061o360k717
17760a0773j9839N062J0422j0555o850R58M361j184J1833J5855L852L073p782
17747a567k2794q822J1498K5977N284p752K619M9846M0658M4309M3110o915j2294
17734A63157K1444q570J1041L1288M1614O2293P9507J7718o0353r6868q1451m643
17722A76177J3419M1784j5677l0480o2514l7529m4381l5559j3525N703K0840j6342
17710A916J2816M459l3438n0727k3417L8080J7467j533p880J982J3226l119J4757
17697a5411j6547K2570K2254k5175k0568J1721N7219K7223L9720K3138j8445k3257
17685H4442l1743J136J3139M3072M9861J23m5016j2097l1868j6393j3998N428
$$ plain form
17673 46086 82250 84904 63860 38453 -1953 -12190 -9367 10400 15469 24845 28962 6139 26772
17660 26772 44658 53592 70643 71561 67583 88274 98749 123217 144334 166134 244503 347013
17648 347013 484654 631729 854845 1107818 1315839 1352907 1222747 1001972 731546 497129
17638 497129 324312 211049 155108 80214 28542 -9829 -4500 -1280 -11956 -28271 -30909 -20381
17626 -20381 -29073 -45567 -43243 -62967 -83910 -98897 -97303 -92434 -75353 -77052 -100219 -108017 -85128
17613 -85128 -42173 -36071 -33882 -23957 -31404 -43125 -48258 -33178 -33621 -42121 -26381 -19175 -47306
17600 -47306 -75153 -83571 -61860 -79095 -79111 -40438 -17242 -3645 -23619 -30093 -11228 -29521 -31119
17587 -31119 -26289 -30675 -13480 -2810 -8757 -26106 -28758 -36809 -58713 -57257 -49870 -58529 -72138
$$ packed form
17673D6086L6164K654k1044k5407m0406j0237K823J9767N069R376M117k2823K0633
17660B6772J7886Q934J7051R18l978K0691J0475K4468K1117K1800P8369J02510
17648C47013J37641J47075K23116K52973K08021L7068j30160k20775k70426k34417
17638D97129j72817j13263n5941p4894n1672l8371N329L220j0676j6315k638J0528
17626b0381q692j6494K324j9724k0943j4987J594M869J7081j699k3167p798K2889
17613h5128M2955O102K189R925p447j1721n133J5080m43q500J5740P206k8131
17600d7306k7847q418K1711j7235j6L8673K3196J3597j9974o474J8865j8293j598
17587c1119M830m386J7195J0670n947j7349k652q051k1904J456P387q659j3609
$$ plain form
17574 -72138 -57337 -51984 -62923 -39779 -8406 -23286 -33408 -63193 -85200 -105985 -74303 -46556
17562 -46556 -56167 -55383 -62403 -96224 -102045 -75694 -50250 -36186 -54448 -89778 -84389 -56025 -45973
17549 -45973 -50322 -56470 -54722 -42042 -52292 -60790 -47072 -39595 -52240 -63570 -50904 -21572 -21128
17536 -21128 -50375 -93020 -94754 -73197 -65079 -57482 -58209 -38230 -18058 -25599 -57053 -52883 -69043
17523 -69043 -53369 -702 17326 -19004 -59299 -44536 -12977 -20928 -27017 -32709 -42284 -54998
17511 -54998 -47910 -52326 -35263 -52598 -61370 -69768 -60533 -76068 -69660 -35137 -23500 -12873 -28179
17498 -28179 -52375 -69875 -61334 -32617 -30185 -42197 -53843 -33133 -33247 -64221 -66277 -55374 -47289
17485 -47289 -18846 -22692 -36797 -47805 -45529 -52452 -45624 -33604 -12735 2732 -9710 1642
$$ packed form
17574g2138J4801N353j0939K3144L1373j4880j0122k9785k2007k0785L1682K7747
17562d6556r611P84p020l3821n821K6351K5444J4064j8262l5330N389K8364J0052
17549d5973m349o148J748J2680j0250q498J3718P477j2645j1330J2666K9332M44
17536b1128k9247m2645j734K1557Q118P597p27J9979K0172p541l1454M170j6160
17523f9043J5674N2667J8028l6330m0295J4763L1559p951o089n692r575j2714
17511e4998P088m416J7063j7335q772q398R235j5535O408L4523J1637J0627j5306
17498b8179k4196j7500Q541K8717K432j2012j1646K0710j14l0974k056J0903Q085
17485d7289K8443l846j4105j1008K276o923O828J2020K0869J5467j2442J1352
$$ plain form
17473 1642 -9538 -9069 -22386 -5301 16974 11952 -14566 -66102 -87454 -89591 -72395 -44710 -36044
17460 -36044 -18155 1701 -24477 -76866 -71170 -39627 -24250 -18080 -20324 -37715 -35625 -45033 -45568
17447 -45568 -19163 14959 35419 70710 108424 185520 224059 150364 61963 27761 -15764 -27063
17435 -27063 -8460 515 -11042 -33178 -39835 -33643 -39021 -48403 -67431 -87295 -99962 -99861 -109356
17422 -109356 -114234 -81534 -69602 -58740 -34568 -43433 -49906 -40796 -43281 -41341 -39046 -28953 -25395
17409 -25395 -26537 -35759 -56835 -49448 -12333 -23485 -48718 -65052 -82295 -101480 -113794 -87335
17397 -87335 -72483 -63250 -72170 -60581 -49578 -56063 -86028 -66556 -44051 -54200 -59194 -40000
17385 -40000 -22075 -26137 -29103 -11152 -28149 -20198 27588 50135 32559 37606 37280 21611 -6352
$$ packed form
17473A642j1180M69j3317J7085K2275n022k6518n1536k1352k137J7196K7685Q666
17460c6044J7889J9856k6178n2389N696L1543J5377O170k244j7391K090r408n35
17447d5568K6405L4122K0460L5291L7714P7096L8539p3695q8401l4202m3525j1299
17435b7063J8603Q975j1557k2136o657O192n378r382j9028j9864j2667J01r495
17422a09356m878L2700J1932J0862K4172q865o473R110k485J940K295J0093L558
17409b5395j142r222k1076P387L7115j1152k5233j6334j7243j9185j2314K6459
17397h7335J4852R233q920J1589J1003o485k9965J9472K2505j0149m994J9194
17385d0000J7925m062k966J7951j6997P951M7786K2547j7576N047l26j5669k7963
$$ plain form
17372 -6352 -30390 -67129 -67575 -39566 -4863 -12614 -29823 -12390 -11099 -21761 -16256 -20732 -9801
17359 -9801 -13849 -33873 -42512 -40873 -41341 -32657 -14791 -8804 -18469 -20935 -216 4968 977 28258
17345 28258 36768 -8141 -28425 -15412 -14827 -34095 -66647 -106512 -103790 -81795 -96049 -61663
17333 -61663 -31337 -20968 -34319 -30543 -22405 -11884 -12325 -13242 -44498 -99444 -120946 -83614 -64003
17320 -64003 -65322 -81710 -82724 -63700 -57139 -38330 -39590 -57551 -61059 -64862 -59655 -21450 -13625
17307 -13625 -19566 -53644 -61768 -46235 -48222 -33818 -16009 -34168 -42556 -49530 -37704 -24074 -16608
17294 -16608 -23172 -24551 -19125 -22539 -13258 -9346 -15383 -12478 -11092 -2416 14115 -3208 -19206 -34637
17280 -34637 -62067 -62396 -81120 -105364 -101874 -82553 -41518 -31278 -49380 -51766 -42405 2800 2727
$$ packed form
17372f352k4038l6739m46K8009L4703p751j7209J7433J291j0662N505m476J0931
17359i801m048k0024q639J639m68Q684J7866N987r665k466K0719N184l991K7281
17345B8258Q510m4909k0284J3013N85j9268l2552l9865K722K1995j4254L4386
17333f1663L0326J0369j3351L776Q138J0521m41r17l1256n4946k1502L7332J9611
17320f4003j319j6388j014J9024O561J8809j260j7961l508l803N207L8205P825
17307a3625n941l4078q124J5533j987J4404J7809j8159q388o974J1826J3630P466
17294a6608o564j379N426l414R281L912o037K905J386Q676J6531j7323j5998j5431
17280c4637k7430l29j8724k4244L490J9321M1035J0240j8102k386R361M5205p3
$$ plain form
17267 2727 3448 3433 -5173 -15112 -35360 -46650 -50558 -32555 -14477 -4369 2423 -11333 -25894 -29952
17253 -29952 -17638 -22151 -40648 -70805 -86791 -80729 -80608 -58013 -61334 -56133 -33536 -25153 -22551
17240 -22551 -18355 -31352 -52820 -77461 -78459 -69617 -40873 -28639 1753 -8319 -23137 -48286
17228 -48286 -70366 -89313 -62962 -24266 -15598 -3094 -4184 -25782 -23916 -27652 -15700 7909
17216 7909 3764 10547 -11735 -18445 -51468 -57051 -63204 -56992 -73176 -102442 -85034 -46642 -35131
17203 -35131 -56960 -42021 -30558 -37751 -61132 -57927 -62015 -61979 -16391 -27709 -26658 -10656 -11142
17190 -11142 3480 13492 -11605 -37980 -50683 -52215 -29912 -13568 -30593 -41887 -47817 -54589
17178 -54589 -77315 -60414 -53690 -44693 -31125 -21161 -14027 0 -9133 -42987 -15138 7935 4032
$$ packed form
17267B727P21j5q606r939k0248j1290l908J8003J8078J0108O792j3756j4561m058
17253b9952J2314m513j8497l0157j5986O062J21K2595l321N201K2597Q383K602
17240b2551M196j2997k1468k4641r98Q842K8744J2234L0392j0072j4818k5149
17228d8286k2080j8947K6351L8696Q668J2504j090k1598J866l736J1952K3609
17216G909m145O783k2282o710l3023n583o153O212j6184k9266J7408L8392J1511
17203c5131k1829J4939J1463p193k3381L205m088L6M5588j1318J051J6002m86
17190a1142J4622J0012k5097k6375j2703j532K2303J6344j7025j1294n930o772
17178e4589k2726J6901O724Q997J3568R964P134J4027r133l3854K7849K3073l903
$$ plain form
17165 4032 -3784 -36841 -53501 -53096 -41029 -38067 -40907 -27600 9873 4427 -44931 -63378 -39918
17152 -39918 -39152 -43111 -30715 -27879 -25684 -27932 -19086 -14834 25588 4036 -18843 1924 16594
17139 16594 12922 24040 19459 -7699 -22173 -48050 -50579 -67674 -61882 -53123 -64313 -70431 -77145
17126 -77145 -63322 -50010 -31283 -43660 -81468 -90605 -75654 -59529 -40743 -41125 -57140 -73198
17114 -73198 -63890 -68314 -52137 -53834 -62632 -48344 -31375 -21900 -62029 -74468 -34782 -18425 -52260
17101 -52260 -111947 -84126 -45503 -23167 11747 7450 -252 -19665 -36202 -63816 -62906 -27696
17089 -27696 754 -22208 -20873 -9186 -31314 -69631 -58795 -52127 -55611 -54233 -36883 449
17077 449 -7660 -23530 -11744 9211 6287 14128 -15551 -36342 -35339 -39343 -66130 -66098 -50526 -38088
$$ packed form
17165D032p816l3057j6660M05J2067K962k840J3307L7473n446m9358j8447K3460
17152c9918P66l959J2396K836K195k248Q846M252M0422k1552k2879K0767J4670
17139A6594l672J1118m581k7158j4474k5877k529j7095N792Q759j1190o118o714
17126g7145J3823J3312J8727j2377l7808r137J4951J6125J8786l82j6015j6058
17114g3198R308m424J6177j697q798J4288J6969R475m0129j2439L9686J6357l3835
17101e2260n9687K7821L8623K2336L4914m297p702j9413j6537k7614R10L5210
17089b7696K8450k2962J335J1687k2128l8317J0836O668l484J378J7350L7332
17077D49q109j5870J1786K0955k924P841k9679k0791J003m004k6787L2J5572J2438
$$ plain form
17063 -38088 -52537 -52544 -37868 -54847 -28300 5819 -13885 -32763 -13194 2959 15454 5840 -5398
17050 -5398 -17200 -32573 -19792 -54467 -53172 -13698 -8301 -29057 -25744 -7446 -31387 -29013 -20349
17037 -20349 -31915 -21074 3208 -4973 -27419 -22830 -10492 -21495 -49236 -38031 -25828 -15145
17025 -15145 2139 1337 -25431 -36299 -6018 11091 13636 2823 -13849 -23856 -20555 -61315
17013 -61315 -90394 -103620 -112179 -86389 -72751 -56508 -35099 -56836 -45707 -15931 -28324 -37689
17001 -37689 -45478 -61101 -42877 -49609 -57882 -54395 -54257 -56580 -62828 -80576 -84396 -49732 -30652
16988 -30652 -25858 -65780 -81471 -76967 -41507 -19348 -17775 -42066 -49232 -15102 -15018 -22030 5462
16975 5462 10293 2909 -25169 -52317 -56225 -40506 -29076 -40216 -57880 -78721 -92110 -68036
$$ packed form
17063c8088j4449pJ4676j6979K6547L4119j9704j8878J9569J6153J2495r614j1238
17050e398j1802j5373J2781l4675J295L9474N397k0756L313J8298k3941K374Q664
17037b0349j1566J0841K4282q181k2446M589J2338j1003k7741J1205J2203J0683
17025a5145J7284q02k6768j0868L0281J7109K545j0813j6672j0007L301m0760
17013f1315k9079j3226q559K5790J3638J6243K1409k1737J1129K9776j2393r365
17001c7689p789j5623J8224o732q273L487J38k323o248j7748l820L4664J9080
16988c0652M794l9922j5691M504L5460K2159J573k4291p166L4130Q4p012K7492
16975E462M831p384k8078k7148l908J5719J1430j1140j7664k0841j3389K4074
$$ plain form
16963 -68036 -71417 -84414 -89429 -54579 -44954 -31203 -47785 -55575 -37167 -28290 -15694 -8600 7240
16950 7240 -3928 -9383 -16941 -15074 -32468 -53887 -64160 -48035 -42461 -35851 -30711 -7451 -30648
16937 -30648 -47148 -57414 -55517 -61076 -24448 -11632 -26400 -35997 -41864 -38089 -15440 -7831 -11689
16924 -11689 -52847 -56106 -37069 -16181 -19426 -24444 -29556 -39292 -56940 -81287 -82703 -56840 -52946
16911 -52946 -37530 -29259 -43472 -38305 -49025 -37737 -16041 -10703 -23318 -66347 -101836 -71460
16899 -71460 -25020 -5588 -17437 -15350 -16374 -12125 -36801 -54175 -61909 -61648 -54444 -8766 2759
16886 2759 32743 22608 -14025 -32186 -65838 -67242 -46968 -9427 -18115 -15624 3272 -13774
16874 -13774 -29600 -16058 20842 21715 9977 -21983 -14660 -919 -20618 -44858 -50879 -41720 -18505
$$ packed form
16963f8036l381j2997n015L4850R625J3751j6582p790J8408Q877J2596P094J5840
16950G240j1168n455p558J867j7394k1419j0273J6125N574O610N140K3260k3197
16937c0648j6500j0266J897n559L6628J2816j4768r597n867L775K2649P609l858
16924a1689m1158l259J9037K0888l245n018n112r736j7648k4347j416K5863L894
16911e2946J5416Q271j4213N167j0720J1288K1696N338j2615m3029l5489L0376
16899g1460M6440J9432j1849K087j024M249k4676j7374p734K61P204M5678J1525
16886B759K9984j0135l6633j8161l3652j404K0274L7541q688K491J8896j7046
16874a3774j5826J3542L6900Q73j1738l1960P323J3741j9699k4240o021R159K3215
$$ plain form
16861 -18505 24547 5552 -20459 -42947 -38273 -17828 1100 -12806 -36764 -36713 -42014 -46710 -54477
16848 -54477 -34864 -18492 27969 8066 -14604 -6179 -10417 -38515 -57272 -21595 -6381 -29874
16836 -29874 -56195 -51590 -42165 -30425 -7376 -16819 -39844 -48845 -14441 -2771 2220 -697 8118
16823 8118 13664 8089 -7967 -22533 -29843 -17101 2880 -4498 -9623 31 -5525 -15782 -20983
16810 -20983 -43886 -45755 -35673 -49844 -63623 -47244 -58480 -76875 -82434 -52380 -41239 -38176
16798 -38176 -36116 -24179 -25938 -49958 -53956 -60395 -56223 -86972 -54256 -49190 -37985 -14903 -25311
16785 -25311 -35188 -38317 -32234 -53579 -55198 -61337 -39268 -30865 -11368 -14428 -44492 -46889 -28197
16772 -28197 -28710 -31132 -6723 -31101 -47484 -25189 -31568 -21828 -22636 -9847 -30120 -46392 -28865
$$ packed form
16861a8505M3052j8995k6011k2488M674K0445J8928j3906k3958N1n301m696p767
16848e4477J9613J6372M6461j9903k2670Q425m238k8098j8757L5677J5214k3493
16836b9874k6321M605R425J1740K3049r443k3025r001L4404J1670M991k917Q815
16823H118N546n575j6056j4566p310J2742J9981p378n125R654n556j0257n201
16810b0983k2903j869J0082j4171j3779J6379j1236j8395n559L0054J1141L063
16798c8176K060J1937j759k4020l998o439M172l0749L2716N066J1205K3082j0408
16785b5311r877l129O083k1345j619o139K2069Q403J9497l060l0064k397J8692
16772b8197n13k422K4409k4378j6383K2295o379R740q08J2789k0273j6272J7527
$$ plain form
16759 -28865 -25594 -24764 -48552 -76388 -57472 -42697 -27738 -9884 -30062 -35710 -38720 -39187 -38251
16746 -38251 -34528 5168 22242 -5545 -29314 -41223 -41773 -40947 -23648 -41739 -8841 10509 12353
16733 12353 3326 1909 2007 1163 957 -4724 -34037 -29911 -17861 -5903 -29687 -34578 -28399 -61939
16719 -61939 -55116 -45625 -27630 -53941 -71594 -62519 -40503 -44009 -16725 -4256 -14484 -28190
16707 -28190 -12851 -17634 -31978 -55321 -53766 -50813 -41815 -25882 -28911 -37973 -39551 -57185 -65020
16694 -65020 -47572 -51492 -53706 -47529 -42861 -34209 -37979 -47984 -50672 -46545 -46615 -23816 6167 -9248
16680 -9248 -32729 -39569 -39876 -40041 -40940 -29440 3992 14404 17802 -2677 -28430 -41316 -65562
16667 -65562 -74812 -45100 -43454 -54205 -28419 -1575 4860 4346 -9582 -16541 -5568 -16002 9584
$$ packed form
16759b8865L271Q30k3788k7836J8916J4775J4959J7854k0178n648l010m67R36
16746c8251L723L9696J7074k7787k3769j1909n50Q26J7299j8091L2898J9350J844
16733A2353r027j417R8q44k06n681k9313M126J2050J1958k3784m891O179l3540
16719f1939O823R491J7995k6311j7653R075K2016l506K7284J2469j0228j3706
16707b8190J5339m783j4344k3343J555K953Q998J5933l029r062j578j7634p835
16694f5020J7448l920k214O177M668Q652l770j0005k688M127p0K2799K9983j5415
16680i248k3481o840l07j65q99J1500L3432J0412L398k0479k5753j2886k4246
16667f5562r250K9712J646j0751K5786K6844O435n14j3928o959J0973j0434K5586
$$ plain form
16654 9584 8220 -6202 -23950 -25687 -29388 -16758 -16494 -16556 -39796 -31419 -21363 -7282 -33104 -48522
16640 -48522 -73969 -58395 -24702 -893 -232 -14882 -39127 -61058 -50592 -61726 -39190 -10267
16628 -10267 -25646 -34923 -14191 -9122 -21131 -10545 -29313 -31199 -19155 -24362 -30579 -37515 -61592
16615 -61592 -84501 -91576 -69174 -40308 -20772 -4211 -13172 -24020 -29369 -37557 -24918 -36591
16603 -36591 -49617 -18328 2891 33987 18331 3578 -12222 -29919 -46220 -21477 -30205 -19936
16591 -19936 -39873 -33576 -40848 -48134 -64427 -65833 -80171 -66087 -54080 -59564 -71860 -40334 -18637
16578 -18637 -37502 -31104 -47724 -57433 -44018 -40494 -46885 -50611 -37996 -32554 -46994 -45253 -43762
16565 -43762 -26758 -7094 19548 9310 13797 -12885 -34508 -52104 -37666 -8717 -22660 -6968
$$ packed form
16654I584j364j4422j7748j737l701J2630K64o2k3240Q377J0056J4081k5822j5418
16640d8522k5447J5574L3693K3809O61j4650k4245k1931J0466j1134K2536K8923
16628a0267j5379r277K0732N069j2009J0586j8768j886J2044n207o217o936k4077
16615f1592k2909p075K2402K8866J9536J6561q961j0848n349q188J2639j1673
16603c6591j3026L1289K1219L1096j5656j4753j5800j7697j6301K4743q728J0269
16591a9936j9937O297p272p286j6293j406j4338J4084J2007n484j2296L1526K1697
16578a8637j8865O398j6620r709J3415L524o391l726J2615N442j4440J741J491
16565d3762J7004J9664K6642j0238M487k6682k1623j7596J4438K8949j3943J5692
$$ plain form
16553 -6968 -8140 -18437 -44245 -34293 -32817 -43460 -28708 -19138 -30573 -11023 14839 28844 6186
16540 6186 -14919 -12174 -1578 14037 12959 7535 -33824 -58416 -47623 -35464 -32373 -19411 -24366
16527 -24366 -13016 -5221 -14949 -5268 14749 13807 23545 -5129 -42656 -43410 -37509 -41584 -37811 -20318
16513 -20318 -23313 -21610 -45167 -44624 -40503 -39223 -34535 -19194 -15003 1007 -8658 -15562 -11681 -15050
16499 -15050 -513 -6912 -52888 -61589 -49387 -33418 -21098 -4309 -9604 3077 -535 -25824
16487 -25824 -35554 -32069 -45020 -44645 -30521 -20617 6506 4256 12549 1582 -21714 -16730 -2341
16474 -2341 -19514 -17602 -24352 -7943 -20771 -39105 -45688 -25782 -1818 18102 22184 16256 13901
16461 13901 4336 -3501 -819 -26760 -27430 -18640 -41685 -46649 -34561 -32671 -10273 16171 6988
$$ packed form
16553f968j172j0297k5808R952J476j0643J4752R570j1435J9550K5862J4005k2658
16540F186k1105K745J0596J5615j078n424m1359k4592J0793J2159L091J2962m955
16527b4366J1350P795r728R681K0017r42R738k8674l7527p54N901m075L773J7493
16513b0318k995J703k3557N43M121J280M688J5341M191J6010r665o904L881l369
16499a5050J4537o399m5976q701J2202J5969J2320J6789n295J2681l612k5289
16487b5824r730L485j2951L75J4124R904K7123k250Q293j0967k3296M984J4389
16474b341j7173J912o750J6409j2828j8334o583J9906K3964J9920M082n928k355
16461A3901r565p837K682k5941o70Q790k3045m964J2088J890K2398K6444r183
$$ plain form
16448 6988 -2422 -2252 -24585 -31014 -34331 -7424 14273 10792 -3236 -12347 -14172 -24922 -20695 8805
16434 8805 10888 -17425 -6075 11212 525 -2550 2967 -12608 -28710 -27982 -16575 8757 -8805
16421 -8805 -11895 -3879 -7369 -20863 -8535 -26729 -19255 4717 13324 8398 2145 -7313 9344
16408 9344 30252 33265 19200 10573 3656 -33484 -32171 750 2827 21124 11270 -1707 -6944
16395 -6944 5030 5519 -5201 -5319 9512 51976 8607 10665 27911 30104 -12984 -31047 -50028
16382 -50028 -51195 -43958 -18792 5675 32092 19690 16017 13237 -12390 -2954 16050 7367 3875
16369 3875 -15239 -11193 8190 -1079 -31684 -29706 -19191 -18776 -11079 -25431 -1401 14223 18386
16356 18386 20375 5188 2555 31643 42568 41276 23607 7052 8572 26439 20862 3520 4273
$$ packed form
16448F988r410J70k2333o429l317K6907K1697l481j4028r111j825j0750M227K9500
16434H805K083k8313J1350J7287j0687l075N517j5575j6102P28J1407K5332j7562
16421h805l090Q016l490j3494J2328j8194P474K3972Q607m926o253r458J6657
16408I344K0908L013j4065q627o917l7140J313L2921K077J8297r854j2977n237
16395f944J1974M89j0720j18J4831M2464m3369K058J7246K193m3088j8063j8981
16382e0028j167P237K5166K4467K6417j2402l673k780k5627R436J9004q683l492
16369C875j9114M046J9383r269l0605J978J0515M15P697j4352K4030J5624M163
16356A8386J989j5187k633K9088J0925j292j7669j6555J520J7867n577j7342P53
$$ plain form
16343 4273 -10499 -48351 -47529 -59906 -30387 -1206 -5477 -18731 -15958 -32161 -2362 -10852 -14675
16330 -14675 -967 -18580 -38592 -38534 -57948 -60539 -23126 4218 -11389 -8227 8227 31518 22726
16317 22726 21038 18435 14232 -4320 8965 14108 9920 28019 38550 48261 42584 19639 32523
16304 32523 49125 22209 -1060 -11531 -14353 -10562 -11439 5472 8822 -1039 -24589 -35186 -49143
16291 -49143 -66673 -54208 -14954 16974 15270 25768 15516 19652 10783 -3523 22352 37795
16279 37795 15216 7586 -5357 -9115 9116 8134 21537 17639 -6672 -19366 -44204 -23876 -14041
16266 -14041 6512 28574 -1733 -20370 -35498 -33832 -10140 10439 -502 -15973 -8813 -21542
16254 -21542 -18039 -5095 -27625 -42618 -50314 -31949 -38585 -20906 -21125 -49966 -61040 -42172 -37157
$$ packed form
16343D273j4772l7852Q22j2377K9519K9181m271j3254K773j6203K9799q490l823
16330a4675J3708j7613k0012N8j9414k591L7413K7344j5607L162J6454K3291q792
16317B2726j688k603m203j8552J3285N143m188J8099J0531R711n677k2945J2884
16304C2523J6602k6916k3269j0471k822L791q77J6911L350r861k3550j0597j3957
16291d9143j7530J2465L9254L1928j704J0498j0252M136q869j4306K5875J5443
16279C7795k2579p630j2943l758J8231r82J3403l898k4311j2694k4838K0328R835
16266a4041K0553K2062l0307j8637j5128J666K3692K0579j0941j5471P160j2729
16254b1542L503J2944k2530j4993p696J8365o636J7679k19k8841j1074J8868N015
$$ plain form
16241 -37157 -40193 -38574 -23805 -4218 -2841 -7146 -11607 -25873 -3581 -605 -26423 -47616 -37846
16228 -37846 -26328 456 13824 31883 32576 20423 15189 30911 30269 18742 195 -21962 -18085
16215 -18085 -7305 7556 14064 3298 -14124 -34557 -31859 -8519 -4290 -15982 -20688 -9795
16203 -9795 2043 -12582 -27250 -42677 -50053 -39318 -16194 10906 34550 46001 66061 69320
16191 69320 52727 6943 5700 22788 2970 2904 -23595 -56198 -64214 -64068 -56979 -47838 -31086
16178 -31086 -29666 -34402 -66155 -54928 -49105 -54205 -39649 -27111 -7848 6530 10100 25146 34321
16165 34321 3615 8463 -12133 -29566 -15113 -28480 -35069 -6178 13178 -11106 -36547 -41693
16153 -41693 -49387 -34308 -36131 -28634 -40661 -58299 -52228 -40875 -45666 -23559 -22666 -5016 19218
$$ packed form
16241c7157l036J619J4769J9587J377m305m461j4266K2292K976k5818k1193R770
16228c7846J1518K6784J3368J8059O93j2153n234J5722o42j1527j8547k2157L877
16215a8085J0780J4861O508j0766j7422k0433K698K3340M229j1692m706J0893
16203i795J1838j4625j4668j5427p376J0735K3124K7100K3644J1451K0060L259
16191F9320j6593m5784j243J7088j9818o6k6499l2603q016J46P089R141J6752
16178c1086J420m736l1753J1227N823n100J4556J2538J9263J4378L570J5046R175
16165C4321l0706M848k0596j7433J4453j3367o589K8891J9356k4284k5441n146
16153d1693p694J5079j823P497j2027j7638O071J1353m791K2107Q93J7650K4234
$$ plain form
16140 19218 -10778 -27149 -35442 -35424 -31008 -18913 -15595 14998 11570 7002 15831 1155 6223 13758
16126 13758 3923 26455 11333 -16842 -21467 -24422 -13318 -25958 -56294 -55202 -38515 -16648
16114 -16648 -14934 -13158 -10228 -10074 -12185 319 -15138 -23268 -26008 -10035 -31213 -40980 -28803
16101 -28803 -27573 -27693 -7657 47025 26307 6914 -31854 -31868 -12363 -13870 -15375 1820 489
16088 489 -24426 -43728 -56129 -47923 -39544 -11674 563 10033 9321 12722 20184 27049 7616 -12143
16074 -12143 -12019 -22270 -17637 -21923 -15883 7123 15599 -20305 -3016 4597 -3596 -18679 -30421
16061 -30421 -57265 -64736 -45137 -3182 26405 40571 31240 -8733 -2189 25982 21923 22166 27941
16048 27941 26692 19613 11696 -24013 -46634 -40371 -46575 -46917 -35169 -53633 -59908 -41639 -15578
$$ packed form
16140A9218k9996j6371q293J8M416J2095L318L0593l428m568Q829j4676N068P535
16126A3758r835K2532j5122k8175m625k955J1104j2640l0336J092J6687K1867
16114a6648J714J776K930J54k111J2504j5457q130k740J5973k1178r767J2177
16101b8803J230j20K0036N4682k0718j9393l8768j4J9505j507j505J7195j331
16088D89k4915j9302j2401Q206Q379K7870J2237R470p12L401P462O865j9433j9759
16074a2143J24j0251M633m286O040K3006Q476l5904J7289P613q193j5083j1742
16061c0421k6844p471J9599M1955K9587J4166r331l9973O544K8171m059K43N775
16048B7941j249p079p917l5709k2621O263o204l42J1748j8464o275J8269K6061
$$ plain form
16035 -15578 18753 27308 9232 23177 21434 13726 -4383 -25601 -28234 -37405 -37265 -38158 -18208
16022 -18208 -6243 -2693 -7179 -37351 -46620 -58639 -46131 -37474 -45038 -51893 -33276 -2564 -11620
16009 -11620 -43609 -57196 -35582 -44866 -20061 -23622 -50184 -43402 -38877 -15109 -12101 14575 14848
15996 14848 -19259 -15715 10718 15112 22029 22965 5245 24375 19124 -3408 -18040 2885 17453
15983 17453 -2685 -19760 -21577 -31259 -4878 7866 13719 18597 19150 25484 24627 5660 9857 26291
15969 26291 6595 -11812 4063 9901 -7199 -20921 -13532 -18321 -25090 -34341 -55660 -30937 -4795
15956 -4795 -9108 -8829 -3011 -5636 -11250 -35544 -25772 -2474 695 -11254 -17477 -11693 8272 5210
15942 5210 -13888 -7895 1975 -14550 -31770 7763 20137 -19675 -40244 -32356 -17977 -17842 -14445
$$ packed form
16035a5578L4331Q555j8076J3945j743p708j8109k1218k633r171J40q93J9950
16022a8208J1965L550m486l0172r269j2019J2508Q657p564o855J8617L0712r056
16009a1620l1989j3587K1614r284K4805l561k6562O782M525K3768L008K6676K73
15996A4848l4107L544K6433M394O917R36j7720J9130n251k2532j4632K0925J4568
15983A7453k0138j7075j817r682K6381J2744N853M878N53O334q57j8967M197J6434
15969B6291j9696j8407J5875N838j7100j3722P389m789o769r251k1319K4723K6142
15956d795m313K79N818k625n614k4294R772K3298L169j1949o223N784J9965l062
15942E210j9098N993R870j6525j7220L9533J2374l9812k0569P888J4379J35L397
$$ plain form
15929 -14445 -26713 -11988 -3977 -7115 -4721 -14130 1825 15081 3829 -8066 -7936 -22147 -12911
15916 -12911 17873 17809 26153 2152 -4789 -6201 1628 -9758 -15690 -25462 -33827 -25161 -43564 -19821
15902 -19821 17890 6546 -34769 -34158 -25628 -4072 6286 -4368 9540 12694 1059 -20297
15890 -20297 -21091 3835 -8347 -35950 -39372 -34043 -23600 -2516 -8165 -2642 10315 1360 22379
15877 22379 34246 42056 -10437 -32302 -8380 -26783 -45456 -15490 2237 -23690 -35190 -21431
15865 -21431 -20612 -22541 -15577 -11014 -8828 -20040 -44806 -19814 -5585 -8117 -6577 5927 10106
15852 10106 51840 26004 -20422 -49410 -18724 -10688 -40217 -30689 -9521 3868 -3069 -9978
15840 -9978 16273 20131 -27303 -32943 -17383 -28366 -45678 -17762 2788 -14678 -22969 -32017 -40510
$$ packed form
15929a4445j2268J4725Q011l138K394r409J5955J3256j1252j1895J30j4211R236
15916a2911L0784o4Q344k4001o941j412P829j1386n932r772q365Q666j8403K3743
15902a9821L7711j1344m1315O11Q530K1556J0358j0654J3908L154j1635k1356
15890b0297p94K4926j2182k7603l422N329J0443K1084n649N523J2957q955K1019
15877B2379J1867P810n2493k1865K3922j8403j8673K9966J7727k5927j1500J3759
15865b1431Q19j929O964M563K186j1212k4766K4992J4229k532J540J2504M179
15852A0106M1734k5836m6426k8988L0686Q036k9529R528K1168J3389o937o909
15840i978K6251L858m7434n640J5560j0983j7312K7916K0550j7466q291r048q493
$$ plain form
15827 -40510 -26837 -4522 -20542 -19116 3940 15361 13309 -20238 -18871 -10012 1841 13155
15815 13155 10707 25393 34447 16165 5127 18270 18301 23095 23883 -28467 -39224 -31439 -36159 -32712
15801 -32712 -4546 -2313 -6040 12892 13174 13782 -4799 -12755 -44469 -25680 -27136 -27449 -25074 -10206
15787 -10206 -29652 -55237 -37333 -20403 13810 40745 7239 -11063 -31497 -23755 -34551 -33277
15775 -33277 -34678 -53829 -52173 -29051 -14784 -2977 -4273 -12226 -9139 -28876 -48819 -67844 -48872
15762 -48872 -18296 -12491 -13603 -23239 -20343 -23985 -15449 330 5302 -23414 -36288 -26574 -22290
15749 -22290 -39905 -56165 -43748 -28728 -31466 -47334 -28868 -24909 -17653 30 -3966 -23775
15737 -23775 -33043 -40618 -43023 -63394 -68988 -38539 -22262 -4832 -15338 -22165 -31317 -18015 -24750
$$ packed form
15827d0510J3673K2315j6020J426K3056J1421k052l3547J367Q859J1853J1314
15815A3155k448J4686R054j8282j1038J3143L1M794P88n2350j0757P785m720L447
15801c2712K8166K233l727J8932K82O08j8581p956l1714J8789j456l13K375J4868
15787a0206j9446k5585J7904J6930L4213K6935l3506j8302k0434P742j0796J274
15775c3277j401j9151J656K3122J4267J1807j296p953L087j9737j9943j9025J8972
15762d8872L0576N805j112r636K896l642Q536J5779M972k8716j2874R714M284
15749b2290j7615j6260J2417J5020k738j5868J8466L959P256J7683l996j9809
15737b3775r268p575k405k0371n594L0449J6277J7430j0506o827r152J3302o735
$$ plain form
15724 -24750 -37888 -18916 -7162 -33487 -21932 5847 -6461 16119 11071 15302 -6504 -13118
15712 -13118 -6843 -21386 -8261 4420 -1869 -3866 -232 17982 9408 2085 8509 16548 744
15699 744 11916 19884 42466 27655 20033 31997 7179 4483 -17063 -23761 11423 14633 3829
15686 3829 -6903 -10847 -8638 -28673 -24322 -9585 -5700 -12097 -22393 -34445 -23280 -16202 -8900
15673 -8900 -32418 -16798 11110 36377 24974 13317 20179 17084 604 -50421 -69222 -29814
15661 -29814 -13604 -41629 -41618 -31823 -8930 9486 12546 -659 -21012 -26814 -32423 -28292 -15650
15648 -15650 -18420 -17876 -34363 -49947 -41316 -39159 -31801 -12851 -8940 -19291 -29588 -45852 -59783
15635 -59783 -36564 4968 6853 4421 -213 6737 12627 13126 8972 16573 -2010 -29776 -57285
$$ packed form
15724b4750j3138J8972J1754k6325J1555K7779j2308K2580n048M231k1806o614
15712a3118O275j4543J3125J2681o289j997L634J8214q574p323O424Q039j5804
15699G44J1172P968K2582j4811p622J1964k4818k696k1546o698L5184L210j0804
15686C829j0732l944K209k0035M351J4737L885o397j0296j2052J1165P078P302
15673h900k3518J5620K7908K5267j1403j1657O862l095j6480n1025j8801L9408
15661b9814J6210k8025J1R795K2893J8416L060j3205k0353n802n609M131J2642
15648a5650k770N44j6487j5584Q631K157P358J8950L911j0351j0297j6264j3931
15635e9783K3219M1532J885k432m634O950N890M99m154P601j8583k7766k7509
$$ plain form
15622 -57285 -64287 -57133 -34539 -30394 -28589 -32407 -14215 -7485 -30991 -25568 -15555 -32070 -5645
15609 -5645 21429 26006 19163 -1953 -27514 -36090 -17200 -6966 -11331 -22494 -39020 -48681 -60768
15596 -60768 -76331 -45480 -46031 -35065 -34095 -26031 -6848 31903 9472 -6744 16437 32175 14372
15583 14372 -27869 -37362 -6875 -253 8287 -15733 -11963 4158 -15436 -33067 -28995 -3053 27169
15570 27169 9493 -17662 -9511 -10893 -43549 -63597 -38940 -12971 -31335 -58306 -73112 -36172
15558 -36172 -21132 -2762 7145 24948 31295 20722 7870 6606 2820 -6679 -6742 3376 -10748
15545 -10748 -8712 -16200 -3609 14501 3300 -9744 -2196 -10995 -30892 -30182 -27432 -10431 -15365
15532 -15365 -17669 -13313 5791 -2958 -30350 -19771 6691 -8697 -4075 -8988 -27460 -53258 -58404
$$ packed form
15622e7285p002P154K2594M145J805l818J8192O730k3506N423J0013j6515K6425
15609e645K7074M577o843k1116k5561q576J8890J0234m365j1163j6526r661j2087
15596f0768j5563L0851n51J0966R70Q064J9183L8751k2431j6216K3181J5738j7803
15583A4372m2241r493L0487O622Q540k4020L770J6121j9594j7631M072K5942L0222
15570B7169j7676k7155Q151j382l2656k0048K4657K5969j8364k6971j4806L6940
15558c6172J5040J8370R907J7803O347j0573j2852j264l786r499o3J0118j4124
15545a0748K036p488J2591J8110j1201j3044P548q799j9897P10K750J7001m934
15532a5365k304M356J9104q749k7392J0579K6462j5388M622m913j8472k5798n146
$$ plain form
15519 -58404 -50978 -24825 4214 -2670 -21148 -5811 42926 56243 3784 -16637 11813 -10575
15507 -10575 -31472 -45128 -51858 -40969 -43277 -47900 -28819 -23237 -34798 -52660 -53970 -53215 -45147
15494 -45147 -47428 -60249 -51360 -42727 -28367 -12910 -6104 -21271 -30399 -24574 -41162 -53692 -53245
15481 -53245 -21761 -8429 -27725 -36210 -31042 -20137 -39820 -13558 14205 -2178 20822 23433
15469 23433 9530 -18622 -66056 -56912 -18369 16991 45688 69237 43105 17320 -1362 -10977
15457 -10977 -15998 -33209 -24474 -3511 -8082 -22275 -27144 -19634 -4154 5533 -14126 -4635 13690
15444 13690 21500 25877 16407 927 -17835 -13629 -27106 -8568 -12407 -26937 -25925 -56678 -46187
15431 -46187 -51013 -60313 -56505 -52088 -20300 -11351 5669 24126 32218 13146 9586 -9874 -14804
$$ packed form
15519e8404P426K6153K9039o884j8478J5337M8737J3317n2459k0421K8450k2388
15507a0575k0897j3656o730J0889k308m623J9081N582j1561j7862j310P55Q068
15494d5147k281j2821Q889Q633J4360J5457O806j5167r128N825j6588j2530M47
15481e3245L1484J3332j9296q485N168J0905j9683K6262K7763j6383K3000K611
15469B3433j3903k8152m7434R144L8543L5360K8697K3549k6132k5785j8682r615
15457a0977n021j7211Q735K0963m571j4193m869P510J5480R687j9659R491J8325
15444A3690P810M377r470j5480j8762M206j3477J8538l839j4530J012l0753J0491
15431d6187m826r300L808M417L1788Q949J7020J8457Q092j9072l560j9460m930
$$ plain form
15418 -14804 3224 4487 3467 -9128 -30994 -39298 -8082 4743 -5191 -10515 -10671 -38199 -23506
15405 -23506 -4036 -4613 -12819 3785 7386 6926 9258 28291 -1557 -8997 12551 11545 18375 6810
15391 6810 785 -96 -7109 12714 22688 4148 -2924 6591 -1940 -18133 -6987 -18744 -22711 338
15377 338 7632 -1227 -9758 -17292 -17423 7366 25322 10368 12623 18188 19389 13277 1820 -6862
15363 -6862 -12424 3634 -2086 -15069 -38449 -17158 2160 17527 -2397 -24194 -671 4422
15351 4422 -9568 -27819 -18044 -5450 12540 24934 -11812 -13532 141 -12353 -18070 3199
15339 3199 1775 -12326 -31254 -53391 -28168 12439 -3192 -18374 -29144 -50804 -58598 -67666
15327 -67666 -55559 -53838 -41665 -57201 -39328 -14466 -26290 -37099 -10399 -7801 -18535 -9813
$$ packed form
15418a4804J8028J263j020j2595k1866q304L1216J2825r934n324j56k7528J4693
15405b3506J9470n77q206J6604L601m60K332J9033k9848p440K1548j006O830j1565
15391F810o025q81p013J9823R974j8540p072R515q531j6193J1146j1757l967K3049
15377C38P294q859q531p534j31K4789J7956j4954K255N565J201o112j1457q682
15363f862n562J6058n720j2983k3380K1291J9318J5367j9924k1797K3523N093
15351D422j3990j8251R775J2594J7990J2394l6746j720J3673j2494n717K1269
15339C199j424j4101j8928k2137K5223M0607j5631j5182j0770k1660p794r068
15327f7666J2107J721J2173j5536J7873K4862j1824j0809K6700K598j0734Q722
$$ plain form
15315 -9813 -5838 -13986 -20792 -17319 -17641 -30980 -31870 -20715 -8641 -13538 1369 -977 -13511 -28226
15301 -28226 -34221 -11063 -17878 -17386 -8340 -25051 -24865 -39866 -30202 -15059 -23928 -27180 -21421 -10351
15287 -10351 -38782 -31061 -36707 -24135 -3611 3435 -2472 24624 28692 24583 4704 -18336 -32308
15274 -32308 -12743 -29561 -38407 -13921 -14985 -15010 -3592 36335 36267 -21610 -31532 -32061 -37408 -32122
15260 -32122 697 30592 53583 48491 28080 -5801 -8525 8279 3227 10008 11189 -200 5619
15247 5619 11664 31607 31957 41032 52685 26846 -8401 -8867 6569 47631 65728 69716 51660
15234 51660 28696 35079 65329 67112 68048 63521 49998 42021 55446 36928 22343 17251 -3134
15221 -3134 4752 -12335 -8814 25542 55136 11595 6156 28982 32684 37925 22147 29078 37394
$$ packed form
15315i813L975q148o806L473l22j3339q90J1155J2074m897J4907k346j2534j4715
15301b8226n995K3158o815M92R046j6711J86j5001R664J5143q869l252N759J1070
15287a0351k8431P721n646J2572K0524P046n907K7096M068m109j9879k3040j3972
15274c2308J9565j6818q846K4486j064k5J1418L9927o8n7877r922n29n347N286
15260c2122L2819K9895K2991n092k0411l3881k724J6804n052O781J181j1389N819
15247E619O045J9943L50R075J1653k5839l5247m66J5436M1062J8097L988j8056
15234E1660k2964O383L0250J783R36m527j3523p977J3425j8518j4585n092k0385
15221c134P886j7087L521L4356K9594m3541n439K2826L702N241j5778O931Q316
$$ plain form
15208 37394 40335 46684 21290 5638 1748 4061 36198 48237 24259 34579 40226 25174 30173
15195 30173 42665 38644 40180 49202 27687 -3559 -17441 9383 23572 59169 60993 47671
15183 47671 32334 22408 23669 20562 5168 -14025 11035 25974 13414 19401 42903 43772 15988
15170 15988 47268 43819 20519 14621 -2153 -9452 -16508 -568 -9701 -13001 -27281 -29803 -23434
15157 -23434 -61317 -26853 -23348 13082 55467 37167 14003 9903 22016 27576 17198 26906
15145 26906 27920 46739 65904 46171 27504 59496 78535 58978 16017 13675 27524 39686
15133 39686 12832 6802 27293 35048 27342 10581 19157 9490 -7702 7526 7903 7954 18181 -6871
15119 -6871 -64896 -37425 -16277 -26057 -24723 -34267 -30181 -23650 -31885 -30604 -16477 6911 11141
$$ packed form
15208C7394K941O349k5394j5652l890K313L2137J2039k3978J0320N647j5052M999
15195C0173J2492m021J536R022k1515l1246j3882K6824J4189L5597J824j3322
15183D7671j5337r926J261l107j5394j9193K5060J4939j2560N987K3502Q69k7784
15170A5988L1280l449k3300n898j6774p299p056J5940r133l300j4280k522O369
15157b3434l7883L4464L505L6430M2385j8300k3164m100J2113N560j0378R708
15145B6906J014J8819J9165j9733j8667L1992J9039j9557m2961k342J3849J2162
15133C9686k6854o030K0491P755p706j6761Q576r667j7192J5228L77N1J0227k5052
15119f871n8025K7471K1148r780J334r544M086O531q235J281J4127K3388M230
$$ plain form
15106 11141 17950 -12469 -15875 -3518 -15062 -27428 -34384 -22270 -10315 -18329 2055 10963 19584
15093 19584 39562 20547 -1047 -40688 -60206 -46749 -21453 2543 25873 30887 13305 15366
15081 15366 38658 13809 -26850 -42053 -58998 -57566 -36259 -34347 1424 24996 23596 -9816
15069 -9816 -26473 -18941 -1402 372 -2579 841 -6448 2832 16163 16849 11812 -3986 -4229 13111
15055 13111 1314 -4991 -23629 -45235 -34011 -18074 -2338 -775 23400 27043 17474 22549 17988
15042 17988 23595 30457 42319 36708 29997 17866 30064 1842 -21444 -27328 -1867 33976 39941
15029 39941 33261 30809 30468 15662 13812 14865 24474 12427 11089 2878 1197 24074 43415 27625
15015 27625 15827 15396 -868 12937 25822 21981 16083 22171 23065 13926 52485 70933 52105
$$ packed form
15106A1141O809l0419l406J2357j1544j2366o956J2114J1955q014K0384Q908Q621
15093A9584J9978j9015k1594l9641j9518J3457K5296K3996K3330N014j7582K061
15081A5366K3292k4849m0659j5203j6945J432K1307J912L5771K3572j400l3412
15069i816j6657P532J7539J774k951L420p289R280J3331O86n037j5798k43J7340
15055A3111j1797o305j8638k1606J1224J5937J5736J563K4175L643r569N075m561
15042A7988N607O862J1862n611o711j2131J2198k8222k3286n884K5461L5843N965
15029C9941o680k452l41j4806j850J053R609j2047j338q211j681K2877J9341j5790
15015B7625j1798m31j6264J3805J2885l841n898O088Q94r139L8559J8448j8828
$$ plain form
15002 52105 6038 -33762 -58448 -48454 -43317 -30218 -18695 -39383 -39058 -32185 -27212 -7610 -15538
14989 -15538 3964 15315 -2169 -2258 18879 13183 19598 24240 28208 12925 -16935 -8269 -1601
14976 -1601 -49644 -51281 -36571 -41906 -11365 2616 8181 15224 23770 11584 -12729 -12855 -8261
14963 -8261 284 -15290 -10863 -153 -7176 -8538 -20314 -19509 -20438 -7549 10439 -5339 -2055 11407
14949 11407 7329 3060 -8928 -21541 -8499 -10200 3454 23940 11108 -21937 -31332 -19858
14937 -19858 19235 41528 26228 -14511 5795 31754 41186 36561 21099 27688 13728 -13757
14925 -13757 -3004 3023 17775 30206 31123 17598 -15598 -13062 -968 6545 -11692 -14829 -7559
14912 -7559 -295 27618 26440 11500 6682 -4479 21653 14888 14684 29899 7851 23911 7940
$$ packed form
15002E2105m6067l9800k4686R994N137J3099J1523k0688L25O873M973J9602p928
14989a5538J9502J1351j7484q9K1137n696O415M642L968j5283k9860Q666O668
14976a601m8043j637J4710n335L0541J3981N565P043Q546j2186k4313j26M594
14963h261Q545j5574M427J0710p023j362j1776Q05r29J2889J7988j5778L284J3462
14949A1407m078m269j1988j2613J3042j701J3654K0486j2832l3045r395J1474
14937a9858L9093K2293j5300m0739K0306K5959R432m625j5462O589j3960k7485
14925a3757J0753O027J4752J2431R17j3525l3196K536J2094P513j8237l137P270
14912g559P264K7913j178j4940m818j1161K6132o765k04J5215k2048J6060j5971
$$ plain form
14899 7940 -16169 -22150 -16592 2984 7334 -5029 -9216 -19105 -46115 -56860 -40616 -24068 9036
14886 9036 13539 15916 39934 30217 36346 35643 47188 9373 -28793 -5464 14639 21697 26615
14873 26615 18195 18182 19826 13261 23299 45565 32223 34528 14586 2313 27683 24119 -6550
14860 -6550 -8202 -11911 3765 -2029 5617 -847 -432 6638 12882 2870 -2542 23744 36587 17757
14846 17757 -84 -5596 -3151 71 -19149 -27757 -5434 29778 40075 19736 14090 -23455 -45120
14833 -45120 -20201 -2401 10626 4517 -19531 -21783 -21458 13205 18694 2761 18932 26624 11147
14820 11147 10821 16209 13407 -1424 10172 25130 3128 -17044 -11098 14340 50595 72503 38241
14807 38241 7336 69 -3216 -22841 -24029 15347 29748 25404 23328 40012 43802 31315 25651
$$ packed form
14899G940k4109n981N558J9576M350j2363m187r889k7010j0745J6244J6548L3104
14886I036M503K377K4018r717O129p03J1545l7815l8166K3329K0103P058M918
14873B6615q420j3J644o565J0038K2266j3342K305j9942j2273K5370l564l0669
14860f550j652l709J5676n794P646o464M15P070O244j0012n412K6286J2843j8830
14846A7757j7841n512K445L222j9220q608K2323L5212J0297k0339n646l7545k1665
14833d5120K4919J7800J3027o109k4048k252L25L4663N489j5933J6171P692j5477
14820A1147l26N388k802j4831J1596J4958k2002k0172N946K5438L6255K1908l4262
14807C8241l0905p267l285j9625j188L9376J4401m344k076J6684L790j2487n664
$$ plain form
14794 25651 1658 313 14283 14801 11313 -5859 -38591 -31816 -23878 -9338 14060 11373 18077
14781 18077 31878 33755 -14946 -14210 16554 30035 24356 25245 16794 -12387 -17919 -11195 -5408 13476
14767 13476 -6851 -26967 -3666 24746 11495 -30908 -33926 -26503 -1256 2642 -39177 -38411 -15428
14754 -15428 -15753 -7583 11549 21180 26962 48312 46728 4643 43 5638 25086 14103 20514
14741 20514 19132 33258 46006 40531 8700 20011 39282 47691 19029 -15184 -24712 -33350 -37722
14728 -37722 -17119 9264 14251 26851 -2749 -19181 -5275 27401 34554 37449 38268 30244 29686
14715 29686 33758 20617 18964 12710 3338 2668 20139 14566 -7258 -18375 8622 -11192 -23257
14702 -23257 -9493 -7730 -16365 -4606 9234 -4787 -3764 29564 26625 -1018 -6359 -19215 -31282
$$ packed form
14794B5651k3993j345J3970N18l488j7172l2732O775P938J4540K3398k687O704
14781A8077J3801J877m8701P36L0764J3481n679Q89q451k9181n532O724N787J8884
14767A3476k0327k0116K3301K8412j3251m2403l018P423K5247L898m1819P66K2983
14754a5428l25Q170J9132R631N782K1350j584m2085m600N595J9448j0983O411
14741B0514j382J4126J2748n475l1831J1311J9271Q409k8662l4213r528q638m372
14728c7722K0603K6383M987J2600k9600j6432J3906L2676P153K895Q19q024n58
14715B9686M072j3141j653o254r372o70J7471n573k1824j1117K6997j9814j2065
14702b3257J3764J763q635J1759J3840j4021J023L3328k939k7643n341j2856j2067
$$ plain form
14689 -31282 -26604 -13249 -3184 11128 7653 12585 11733 7042 31232 36851 47815 60568 42157
14676 42157 30432 16188 28085 24545 28341 11797 14352 11530 12365 6552 29795 33786 27370
14663 27370 16755 15484 -1922 -27711 -40811 -26344 -27102 -28006 -35054 -30749 -1549 23211 13034
14650 13034 -13642 -3228 14914 40012 29253 418 -27464 -22422 -5315 25894 18226 -1254
14638 -1254 -21799 -6219 1203 -1726 5817 -1528 -18048 -514 15278 -10064 661 13097 10658
14625 10658 16170 35507 29288 14117 33662 30925 -320 -33995 -33524 7170 22530 20432 34601
14612 34601 46694 35009 10535 -10304 -14489 -28661 -46370 -21663 -14983 -6292 2670 -7867
14600 -7867 -28016 -26772 -21211 -23557 -23329 -3128 -3031 -18671 -3887 3757 12689 10074 -6612 -31525
$$ packed form
14689c1282M678J3355J0065J4312l475M932q52m691K4190N619J0964J2753j8411
14676D2157j1725j4244J1897l540L796j6544K555k822Q35n813K3243L991o416
14663B7370j0615j271j7406k5789j3100J4467p58r04p048M305K9200K4760j0177
14650A3034k6676J0414J8142K5098j0759k8835k7882N042J7107L1209p668j9480
14638a254k0545J5580P422k929P543p345j6520J7534J5792k5342J0725J2436k439
14625A0658N512J9337o219j5171J9545k737l1245l3675M71M0694J5360k098J4169
14612C4601J2093j1685k4474k0839m185j4172j7709K4707O680Q691Q962j0537
14600g867k0149J244N561k346K28K0201R7j5640J4784P644Q932k615j6686k4913
$$ plain form
14586 -31525 -20064 -16745 -21823 -6855 -1846 3562 6403 -13797 -1372 -3261 -16558 -7793 35135
14573 35135 40373 52852 29388 13136 22835 36463 41532 43763 22404 -19947 -6009 -5248 10819
14560 10819 38087 56610 42124 45929 10688 -9059 -33026 -40803 -33733 -20704 -26085 -25069 -38819
14547 -38819 -37387 -38237 -10533 -20934 -50762 -43723 -46633 -62727 -41186 -23872 -25164 -27669 -23936
14534 -23936 -3995 21323 19927 10366 7972 13574 21095 20932 13447 14133 1033 -9072 -19639 -18866
14520 -18866 1264 21107 10443 -28051 -10217 11548 1319 17535 18913 1487 13499 21563
14508 21563 39523 28122 52060 83483 80227 41161 16568 22213 11635 -13489 -5707 705
14496 705 -13237 -1589 20066 25443 12863 32129 40731 29957 44104 52652 49665 46060 42806
$$ packed form
14586c1525J1461L319n078J4968N009N408K841k0200J2425j889j3297Q765M2928
14573C5135N238J2479k3464j6252R699J3628N069K231k1359m2351J3938P61J6067
14560A0819K7268J8523j4486L805l5241j9747k3967p777P070J3029n381J016j3750
14547c8819J432q50K7704j0401k9828P039k910j6094K1541J7314j292k505L733
14534b3936J9941K5318j396r561k394N602P521j63p485O86j3100j0105j0567P73
14520a8866K0130J9843j0664l8494J7834K1765j0229J6216J378j7426J2012Q064
14508B1563J7960j1401K3938L1423l256l9066k4593N645j0578k5124P782O412
14496G05j3942J1648K1655N377j2580J9266Q602j0774J4147Q548k987l605l254
$$ plain form
14483 42806 56257 46684 52414 34631 17694 311 5080 24019 21488 30816 31103 29172 36939
14470 36939 4180 10394 28605 6811 -17993 -19316 -11276 14264 34619 36615 32318 20553 21629
14457 21629 -9688 -47485 -11812 20131 24755 1049 14679 23882 24335 19197 34363 48999 64886
14444 64886 40834 25799 68013 52226 15413 17945 11081 4482 -7363 -7979 -21220 -15364 -13839
14431 -13839 2236 28340 64975 31115 901 -17622 -1040 22866 25580 5978 14369 37290
14419 37290 41437 33723 24743 -14772 -27739 -29244 -31829 -32217 16068 37854 18049 6850 29403
14406 29403 28028 35368 23585 16934 12116 9555 -5619 -12905 -8916 7489 15557 33149 17913
14393 17913 30738 36105 40335 55382 67028 59498 79973 98432 71280 66687 57197 58533 68873
$$ packed form
14483D2806J3451r573N730j7783j6937j7383M769J8939k531R328K87j931P767
14470C6939l2759O214J8211k1794k4804j323Q040K5540K0355J996m297j1765J076
14457B1629l1317l7797L5673L1943M624k3706J3630R203M53n138J5166J4636J5887
14444F4886k4052j5035M2214j5787l6813K532o864o599j1845o16j3241N856J525
14431a3839J6075K6104L6635l3860l0214j8523J6582K3906K714j9602Q391K2921
14419C7290M147p714q980l9515j2967j505k585l88M8285K1786j9805j1199K2553
14406B9403j375P340j1783o651m818k561j5174p286L989J6405Q068J7592j5236
14393A7913J2825N367M230J5047J1646p530K0475J8459k7152m593r490J336J0340
$$ plain form
14380 68873 92006 118783 114332 120855 134765 147563 126956 127167 165826 196276 205718 238058 303283
14367 303283 416458 540219 690099 881099 1028783 1110102 1063194 928107 747407 595524
14357 595524 479478 388597 334384 297510 264554 248457 212006 183647 198361 227901 223096
14346 223096 239859 230830 241661 246765 264364 294766 333264 363857 436785 554860 716304
14335 716304 863524 1016455 1120590 1107845 957294 773441 562969 394551 285250 207060
14325 207060 153086 134444 110504 77655 43687 37666 31766 20953 5943 7862 33726 41117
14313 41117 41466 47748 24436 511 -35277 -37908 -13362 29443 29600 18996 38887 57989 47463
14300 47463 20947 3650 -11665 -20188 -19374 -18965 -44325 -29053 -6637 3903 5946 14349 -11536
$$ packed form
14380F8873K3133K6777m451O523J3910J2798k0607K11L8659L0450R442L2340O5225
14367C03283J13175J23761J49880J91000J47684Q1319m6908j35087j80700j51883
14357E95524j16046r0881n4213l6874l2956j6097l6451k8359J4714K9540m805
14346B23096J6763r029J0831N104J7599L0402L8498L0593P2928J18075J61444
14335G16304J47220J52931J04135j2745j50551j83853k10472j68418j09301p8190
14325B07060n3974j8642k3940l2849l3968o021n900j0813j5010J919K5864P391
14313D1117L49O282k3312k3925l5788k631K4546M2805J57j0604J9891J9102j0526
14300D7463k6516j7297j5315q523Q14M09k5360J5272K2416J0540K043Q403k5885
$$ plain form
14287 -11536 -30546 -11227 22467 19392 13608 27594 21921 -9131 -17982 -19691 -11932 -22478 1828
14274 1828 9673 16604 13667 20808 50110 55153 24953 13598 -2528 -23930 -7180 -16867 -2073
14261 -2073 -15499 -5403 7614 21303 28755 5514 -22383 -8562 -6660 -40298 -52781 -48418
14249 -48418 -40627 -21067 -30454 -14217 -14168 788 16188 3545 -1503 -6801 -10955 -12635 6096
14236 6096 37251 11890 4485 -11910 12091 -6611 -15925 -4194 -3722 -15689 -4802 29705 19253
14223 19253 22731 -7106 -14048 8844 -397 3282 16799 13205 -9883 12030 31931 14348 -7908
14210 -7908 -12774 -38985 -46754 -37989 -17473 -1186 4324 -215 -21496 -1299 11058 9744 22733
14197 22733 18785 6370 -4872 -18873 -2721 -5877 -17428 -1748 -5699 -3588 -20157 177
$$ packed form
14287a1536j9010J9319L3694l075n784J3986n673l1052q851j709P759j0546K4306
14274A828P845O931k937P141K9302N043l0200j1355j6126k1402J6750r687J4794
14261b073j3426J0096J3017J3689P452k3241k7897J3821J902l3638j2483M363
14249d8418P791J9560r387J6237M9J4956J5400j2643n048n298m154j680J8731
14236F096L1155k5361p405j6395K4001j8702r314J1731M72j1967J0887L4507j0452
14223A9253L478k9837o942K2892r241L679J3517l594k3088K1913J9901j7583k2256
14210g908m866k6211p769Q765K0516J6287N510m539k1281K0197J2357j314J2989
14197B2733l948j2415j1242j4001J6152l156j1551J5680l951K111j6569K0334
$$ plain form
14185 177 12510 -5593 -98 -19447 -48269 -50986 -35105 -30480 13850 10114 295 -9963 -33366
14172 -33366 -60172 -87410 -67360 -33489 -3422 6511 10970 19447 30085 17608 -14736 -15862
14160 -15862 -20674 -10040 -7192 12460 13619 20290 38748 14533 17840 45097 37521 21362 1497
14147 1497 11210 27290 -1873 -18946 821 -11610 8390 -2003 5149 20550 33596 37474
14135 37474 31947 9100 -1369 -19097 -31606 -20842 -9052 -34912 -34531 -23876 -36391 -48592
14123 -48592 -25753 2942 -15609 -6136 -11459 -22791 -12258 -10619 -21070 -9945 23704 31771
14111 31771 43491 49288 61718 66429 53745 23055 431 3691 -9931 -10028 8671 25720 27914
14098 27914 38163 16102 13964 10360 10192 3160 19020 44419 52289 40611 22202 21059 18499
$$ packed form
14185A77J2333j8103N495j9349k8822k717J5881M625M4330l736r819j0258k3403
14172c3366k6806k7238K0050L3871L0067R933M459Q477J0638j2477l2344j126
14160a5862m812J0634K848J9652J159O671J8458k4215L307K7257p576j6159j9865
14147A497R713J6080k9163j7073J9767j2431K0000j0393P152J5401J3046L878
14135C7474n527k2847j0469j7728j2509J0764J1790k5860L81J0655j2515j2201
14123d8592K2839K8695j8551R473n323j1332J0533J639j0451J1125L3649Q067
14111C1771J1720N797J2430M711j2684l0690k2624L260j3622r7J8699J7049K194
14098B7914J0249k2061k138l604j68p032J5860K5399P870j1678j8409j143k560
$$ plain form
14085 18499 15286 5948 -22667 -11072 24870 11319 14906 22214 22021 16656 16482 7501 12031 -11388
14071 -11388 -13804 -20578 -23277 -3773 8991 23535 14828 4620 -17451 -12825 15404 23491 -9950
14058 -9950 -11188 -526 26883 10652 -13190 -12761 -24565 -12281 7330 17133 31458 25467 9191
14045 9191 -12973 -18710 -3959 27019 21448 -13726 -21886 -11379 -21410 -32122 -21607 -17131 -6527
14032 -6527 -884 12666 20441 -4271 -16765 6552 5591 -20084 -2740 6381 8433 7239 3529
14019 3529 -12466 -13094 -6674 -31246 -21536 -27828 -258 20567 42679 56767 52824 40534 44618
14006 44618 41539 16857 24910 41578 49505 52406 27773 26064 36610 14391 -2774 4623 -1247
13993 -1247 -18105 -29673 -16690 12403 28394 25287 23077 27065 30335 25469 37809 39753 34406
$$ packed form
14085A8499l213r338k8615J1595L5942j3551L587P308j93n365j74q981M530k3419
14071a1388k416o774k699J9504J2764J4544q707j0208k2071M626K8229Q087l3441
14058i950j238J0662K7409j6231k3842M29j1804J2284J9611R803J4325n991j6276
14045I191k2164n737J4751L0978n571l5174q160J0507j0031j0712J0515M476J0604
14032f527N643J3550P775k4712j2494K3317r61k5675J7344R121K052j194l710
14019C529j5995o28O420k4572R710o292K7570K0825K2112J4088l943j2290M084
14006D4618l079k4682Q053J6668P927K901k4633j709J0546k2219j7165P397n870
13993a247j6858j1568J2983K9093J5991l107k210L988L270m866J2340J944n347
$$ plain form
13980 34406 36628 16644 19336 24701 14749 -27567 -38439 -14343 1584 14979 3938 12600 34599
13967 34599 15655 -26573 -32284 6647 -3726 -13361 13621 18546 3183 18560 20976 776
13955 776 -8319 -9540 -2884 2579 5466 22573 28311 29689 28993 26157 5276 9902 32515 30547
13941 30547 21568 26886 18854 15738 31089 13946 9046 28559 34306 33467 -17676 -29906 -25791
13928 -25791 -34328 -39377 -28427 -20503 -5688 -17495 -18541 7556 6411 7825 16578 30836 16605
13915 16605 25829 41880 26113 -3273 -19604 -14543 19864 42519 48221 16852 -15320 -19156
13903 -19156 4936 -7316 -30977 -15265 4307 4276 -2039 -11707 -25972 -11053 -4495 16165 60272
13890 60272 63084 42794 19252 10280 20104 806 -6704 12585 2541 -3984 25073 14839 -12923
$$ packed form
13980C4406K222j9984K692N365r952m2316j0872K4096J5927J3395j1041Q662K1999
13967C4599j8944m2228n711L8931j0373r635K6982M925j5363J5377K416k0200
13955G76r095j221O656N463K887J7107N738J378o96k836k0881M626K2613j968
13941C0547q979N318q032l116J5351j7143m900J9513N747q39n1143j2230M115
13928b5791q537n049J0950P924J4815j1807j046K6097j145J414Q753J4258j4231
13915A6605R224J6051j5767k9386j6331N061L4407K2655N702l1369l2172l836
13903a9156K4092j2252k3661J5712J9572l1o315r668j4265J4919O558K0660M4107
13890F0272K812k0290k3542q972R824j9298p510J9289j0044o525K9057j0234k7762
$$ plain form
13877 -12923 -28082 -10290 -19177 -23292 -7964 4558 -33 7863 15659 6032 -25084 -5257 18099
13864 18099 19182 5619 -8710 -6145 -11765 -28457 -23264 -43717 -40426 -27462 5068 15309 28076
13851 28076 20663 16782 -22881 -20442 -30230 -28991 16616 35110 41187 40642 22817 -4131 -24875
13838 -24875 -23118 -25872 -5303 13097 -15645 -31505 -35701 -19921 4865 25759 25638 6147 6274
13825 6274 1314 -5297 -15451 13976 33907 25032 46512 55743 33851 -1371 -23820 -7684 -11275
13812 -11275 -3836 34454 37568 24556 29168 51202 37958 16248 7796 14087 14206 14971 15103 -1221
13798 -1221 -17724 -21779 -19525 -30441 29 32956 32920 33968 14022 33345 40123 41112 25241 5436
13784 5436 4193 11600 -7735 -8794 -3902 -8558 4578 1920 -1418 -2304 -3314 -1317 -20036 -1757
$$ packed form
13877a2923j5159J7792q887m115J5328J2522m591P896P796r627l1116J9827K3356
13864A8099J083j3563j4329K565n620j6692N193k0453L291J2964L2530J0241J2767
13851B8076p413l881l9663K439r788J239M5607J8494O077n45j7825k6948k0744
13838b4875J757k754K0569J8400k8742j5860m196J5780K4786K0894j21j9491J27
13825F274m960o611j0154K9427J9931q875K1480R231k1892l5222k2449J6136l591
13812a1275P439L8290L114j3012M612K2034j3244k1710q452O291J19P65J32j6324
13798a221j6503m055K254j0916L0470L2927l6J048j9946J9323O778R89j5871j9805
13784E436j243P407j9335j059M892m656J3136k658l338q86j010J997j8719J8279
$$ plain form
13770 -1757 22166 28696 16833 20967 21670 35288 59365 43148 13505 4505 -15846 -19483 -22216
13757 -22216 -13972 -18077 -6102 1877 21841 47753 45007 14696 14769 24726 19293 5329 738 18907
13743 18907 28316 30031 9830 14330 30674 56044 53278 57832 50731 70319 46591 13866 16968
13730 16968 9699 2912 18780 13209 14305 7530 -3640 -28621 523 -8803 -3207 36775 47269
13717 47269 53468 38776 20927 5407 -649 3071 -1410 -3775 -692 -11073 -1763 15703 9411
13704 9411 -391 -8179 -3086 -22835 -40140 -27785 -43502 -40628 -9167 -4850 -12140 -2340 39582
13691 39582 50683 26121 21070 25197 36772 41821 51665 37007 15284 -1919 -20109 -31883
13679 -31883 -23261 -29230 1962 1339 3605 119 -3368 -5959 4065 4142 -7512 -17710 -32561 -19248
$$ packed form
13770a757K3923O530j1863M134P03J3618K4077j6217k9643r000k0351l637k733
13757b2216Q244m105J1975P979J9964K5912k746l0311P3R957n433j3964m591J8169
13743A8907R409J715k0201M500J6344K5370k766M554p101J9588k3728l2725L102
13730A6968p269o787J5868n571J096o775j1170k4981K9144r326N596L9982J0494
13717D7269O199j4692j7849j5520o056L720m481k365L083j0381R310J7466o292
13704I411r802p788N093j9749j7305J2355j5717K874L1461M317p290R800M1922
13691C9582J1101k4562n051M127J1575N049R844j4658k1723j7203j8190j1774
13679c1883Q622n969L1192o23K266l486l487k591J0024P7j1654j0198j4851J3313
$$ plain form
13665 -19248 -8637 -8089 -1065 -8630 -20511 -25112 -22028 -30243 -40593 -48991 -51879 -34849 -3359
13652 -3359 28034 39815 45163 6049 -12774 -22324 1266 17284 23730 20740 28910 27117 -801
13639 -801 559 12135 6456 -8532 -8695 -16894 -19823 -11787 -10914 -4774 11763 -8289 -11898 6310
13625 6310 -7265 -17314 -2636 19377 29378 7563 -10421 -15124 -2804 15647 8959 -12241
13613 -12241 -2347 7159 12647 26995 33331 34205 8164 -26606 -23524 -9118 -8990 -13176 -32443 -24635
13599 -24635 -20968 -31263 -19112 -14686 8200 -4650 -6053 3437 -5507 -27684 -31958 -44934 -39156
13586 -39156 -37415 -35801 -31760 -15478 -33352 -34776 -32930 -26568 -37093 -39842 -41934 -53560 -29247
13573 -29247 -7732 2229 -5419 4210 396 15858 34958 18347 7756 17642 23359 6134 -5591
$$ packed form
13665a9248J0611N48P024p565j1881m601L084q215j0350q398k888J7030L1490
13652c359L1393J1781N348l9114j8823r550K3590J6018O446k990Q170j793k7918
13639h01J360J1576n679j4988j63q199k929Q036Q73O140J6537k0052l609J8208
13625F310j3575j0049J4678K2013J0001k1815j7984m703J2320J8451o688k1200
13613a2241R894R506N488J4348O336Q74k6041l4770L082J4406J28m186j9267P808
13599b4635L667j0295J2151M426K2886j2850j403R490q944k2177m274j2976N778
13586c9156J741J614M041J6282j7874j424J846O362j0525k749k092j1626K4313
13573b9247K1515R961p648R629l814J5462J9100j6611j0591R886N717j7225j1725
$$ plain form
13560 -5591 -11917 -3520 -15104 -16468 -12663 -9199 -22435 -22466 -59770 -58089 -34414 -7822 -34076 -54273
13546 -54273 -41104 -30979 -24668 -27390 -57418 -74211 -47317 -19090 -27635 -14689 5222 3597
13534 3597 -25179 -24423 -7732 9858 16937 3976 4324 5914 -15498 -46519 -19781 -6019 12294
13521 12294 15670 14753 -389 2219 30902 52274 60093 36541 32831 21828 -8329 -4995 19166
13508 19166 34378 30366 4044 -19634 -28665 -19451 -784 27122 40175 14840 5094 4152 8320
13495 8320 -2335 15047 9584 -877 900 18222 17112 22343 12440 -1357 15523 34404 5366
13482 5366 15672 -9491 -14251 15931 19230 14760 12123 2396 2324 11707 20638 36566 16518 -16901
13468 -16901 -6017 28362 16765 -5790 -1613 -4571 -9832 -15187 17889 38113 24935 7832
$$ packed form
13560e591o326Q397j1584j364L805L464j3236l1l7304J681K3675K6592k6254k0197
13546e4273J3169J0125O311k722l0028j6793K6894K8227q545J2946J9911j625
13534C597k8776P56J6691J7590P079j2961L48J590k1412l1021K6738J3762J8313
13521A2294L376r17j5142K608K8683K1372P819k3552l710j1003l0157L334K4161
13508A9166J5212m012k6322k3678r031R214J8667K7906J3053k5335r746r42M168
13495H320j0655J7382n463j0461J777J7322j110N231r903j3797J6880J8881k9038
13482E366J0306k5163m760L0182L299m470k637r727p2R383Q931J5928k0048l3419
13468a6901J0884L4379j1597k2555M177k958n261n355L3076K0224j3178j7103
$$ plain form
13456 7832 -3016 -5564 -4504 3905 17263 -12587 -27826 -48804 -57834 -52941 -17727 6662 33382
13443 33382 54121 43725 42074 41412 29784 5313 -19758 -46629 -56268 -37528 -8132 -1713 7007
13430 7007 1773 -21022 -13311 -6444 -12836 10673 24979 17110 -15496 -27967 -6915 -68 -22007
13417 -22007 -22985 -15930 -5495 2444 11212 14291 361 -20417 1241 3618 -14967 -41983 -13192
13404 -13192 -7036 -15492 -8245 -4269 6362 16208 29553 26961 23784 22424 -5696 571 31374
13391 31374 31548 6572 -11362 -26544 -33532 -17186 8519 24094 28592 11408 5751 1084 -12899
13378 -12899 9873 27343 28955 13010 14561 30614 37070 39747 17228 13188 33308 48673 26622
13365 26622 16028 7204 16785 2809 -8721 -22866 -42803 -57545 -61341 -50791 -34153 -44689
$$ packed form
13456G832j0848k548J060Q409J3358k9850j5239k0978r030M893L5214K4389K6720
13443C3382K0739j0396j651o62j1628k4471k5071k6871r639J8740K9396O419Q720
13430G007n234k2795P711O867o392K3509J4306p869l2606j2471K1052O847k1939
13417b2007r78P055J0435P939Q768L079j3930k0778K1658K377j8585k7016K8791
13404a3192O156q456P247L976J0631R846J3345k592l177j360k8120O267L0803
13391C1374J74k4976j7934j5182o988J6346K5705J5575M498j7184n657m667j3983
13378a2899K2772J7470J612j5945J551J6053O456K677k2519m040K0120J5365k2051
13365B6622j0594q824R581j3976j1530j4145j9937j4742l796J0550J6638j0536
$$ plain form
13353 -44689 -56515 -60803 -44911 -56474 -74929 -52926 -28947 -39172 -20312 4419 -20886 -33405
13341 -33405 -9695 -1771 -7253 23341 12428 -23092 -34815 -36064 -16611 22145 14449 1858
13329 1858 -21879 -13060 -2431 17321 27976 3444 17019 12123 -3186 -7993 -13115 -17171 12722
13316 12722 26327 -4042 6309 7400 -5868 -20649 -14736 -3963 1214 -19777 -25256 -34759 -20965
13303 -20965 -17569 -20543 -27970 -38523 -36207 -45411 -44087 -43179 -41196 -33455 -49766 -57888 -21544 -7659
13289 -7659 -2294 3974 -4768 5223 22856 34413 13185 -3047 -32745 -41404 -18781 -2127 -16440
13276 -16440 -3534 -1509 -793 30671 10680 3452 -695 -36192 -44916 1101 26144 16977 -6554
13263 -6554 -13331 -17889 -14744 -23488 -33080 -16402 19262 49977 31885 6107 1123 -5478 11273
$$ packed form
13353d4689j1826m288J5892j1563j8455K2003K3979j0225J8860K4731k5305j2519
13341c3405K3710P924n482L0594j0913l5520j1723j249J9453L8756p696j2591
13329A858k3737Q819J0629J9752J0655k4532J3575m896j5309m807n122m056K9893
13316A2722J3605l0369J0351J091j3268j4781N913J0773N177k0991n479r503J3794
13303b0965L396k974p427j0553K316r204J324R08J983P741j6311q122L6344J3885
13289g659N365O268q742R991J7633J1557k1228j6232k9698q659K2623J6654j4313
13276a6440J2906K025P16L1464j9991p228m147l5497q724M6017K5043r167k3531
13263f554o777m558L145q744r592J6678L5664L0715j8092k5778m984o601J6751
$$ plain form
13250 11273 26199 19733 28355 29044 -703 6378 16132 -3414 -6324 -29545 -51185 -25984 3694
13237 3694 11032 13670 -12422 -40333 -38296 -62220 -78004 -58199 -54753 -36992 2149 11698 -12265
13224 -12265 1644 3304 -9508 1164 18511 13969 -16060 -28287 -14679 4052 -2447 2361
13212 2361 26754 1717 -3129 -690 -1481 10151 8413 -2134 3626 16105 24156 7067 -17506
13199 -17506 -41591 -30621 3573 20150 409 -24284 -25302 -29045 -7953 -14858 -12472 -15991 -34060
13186 -34060 -23845 -25649 -27624 -27775 -34444 -17295 -23184 -10988 3079 -9429 -14755 -32845 -11022
13173 -11022 -374 -16013 -8409 4107 -4327 -16578 -20909 6800 18612 7616 -26174 -35642
13161 -35642 -30419 -17179 -906 44944 32617 14891 20524 -3305 -24546 -27330 8186 24513
$$ packed form
13250A1273J4926o466Q622O89k9747P081R754j9546k910k3221k1640K5201K9678
13237C694P338K638k6092k7911K037k3924j5784J9805L446J7761L9141R549k3963
13224a2265J3909J660j2812J0672J7347m542l0029j2227J3608J8731o499M808
13212B361K4393k5037m846K439p91J1632j738j0547N760J2479Q051j7089k4573
13199a7506k4085J0970L4194J6577j9741k4693j018l743K1092o905K386l519j8069
13186c4060J0215j804j975j51o669J7149n889J2196J4067j2508n326j8090K1823
13173a1022J0648j5639P604J2516q434j2251m331K7709J1812j0996l3790r468
13161c5642N223J3240J6273M5850j2327j7726N633k3829k1241k784L5516J6327
$$ plain form
13149 24513 28249 39459 35438 41091 24907 6225 11741 18938 -530 -17556 -35627 -50711 -26765
13136 -26765 -18118 -5186 -18018 -39555 -48884 -38320 -16497 4300 5975 11215 -2427 -12502
13124 -12502 -31908 -18408 2712 24346 40636 31202 38061 43844 47449 40525 31353 34240 -3254
13111 -3254 -20184 2690 15331 -8544 -50108 -29092 3597 20969 8567 14851 28812 18534
13099 18534 29836 44685 35434 23848 -2711 -6879 -9194 -17318 8098 46648 44676 4492 8111
13086 8111 27492 54236 46727 32949 31372 36910 19979 790 -27438 -36214 -23060 5720 14487
13073 14487 -10384 -22334 -19507 -37298 -40283 -51436 -22965 -5409 6273 -10939 -30876 -44211
13061 -44211 -22549 11821 4125 -8775 -32942 -56610 -60283 -25750 -17408 -3994 -8430 -29598
$$ packed form
13149B4513L736J1210m021N653j6184j8682N516P197j9468j7026j8071j5084K3946
13136b6765Q647J2932j2832k1537r329J0564K1823K0797J675N240j3642j0075
13124a2502j9406J3500K1120K1634J6290r434O859N783L605o924r172K887l7494
13111c254j6930K2874J2641k3875m1564K1016L2689J7372j2402O284J3961j0278
13099A8534J1302J4849r251j1586k6559m168k315q124K5416L8550j972m0184L619
13086H111J9381K6744p509j3778j577N538j6931j9189k8228q776J3154K8780Q767
13073A4487k4871j1950K827j7791k985j1153K8471J7556J1682j7212j9937j3335
13061d4211K1662L4370p696j2900k4167k3668l673L4533Q342J3414m436k1168
$$ plain form
13049 -29598 -17315 -1602 -14444 -10577 8721 4359 2687 2447 7425 38912 63883 54405 37695
13036 37695 59874 39990 21528 6328 -6348 -4392 -2871 1505 4007 8350 46764 73803 50687
13023 50687 34435 29308 25235 33001 20598 16293 6154 -5370 -7099 15516 39763 52835 -6023
13010 -6023 -25581 -18028 -11156 -22049 -27333 -9185 -1350 17319 -5893 -31688 -24554 -9039 3556
12997 3556 4136 2 -27799 -18393 -19919 -20021 -19107 -19712 12657 26475 23602 17963 19870 8367 1117
12982 1117 -23804 -42560 -39180 -4842 -1751 -18173 -20873 -17422 2573 -1152 -6432 12631 5299
12969 5299 -12612 -5350 4864 -13466 -24040 -33844 -41367 -26111 -10181 -4535 14126 -682 9909
12956 9909 17615 22443 25055 51447 48610 47690 51431 21220 -13020 -25192 -3528 8808 34086
$$ packed form
13049b9598J2283J5713j2842L867J9298m362j672k40M978L1487K4971r478j6710
13036C7695K2179j9884j8462j5200j2676J956J521M376K502M343L8414K7039k3116
13023E0687j6252n127m073P766j2403m305j0139j1524j729K2615K4247J3072n8858
13010f023j9558P553O872j0893n284J8148P835J8669k3212k5795P134J5515J2595
12997C556N80m134k7801R406j526j02R14o05L2369J3818k873n639J907j1503p250
12982A117k4921j8756L380L4338L091j6422k700L451J9995l725n280J9063p332
12969E299j7911P262J0214j8330j0574r804p523J5256J5930N646J8661j4808J0591
12956I909P706M828K612K6392k837r20L741l0211l4240j2172K1664J2336K5278
$$ plain form
12943 34086 22890 -11113 -21930 -20503 -32315 -4843 3402 7839 14767 35313 62527 82397
12931 82397 65412 49286 36862 21871 19919 3208 -18169 -35005 -41892 -21783 -2115 -2950
12919 -2950 2481 16895 16451 21811 26982 13358 20108 653 -14366 -24849 -27700 -19121 -11910 -25082
12905 -25082 -40996 -29767 -12948 -16539 -5349 -5122 -3777 -3483 -4476 -31342 -53113 -46182 -38092 -35159
12891 -35159 -29653 -21300 -27411 -30321 -36068 -1454 24328 18317 -3931 -17514 1138 14553 -16825
12878 -16825 -25919 -20731 -48922 -82588 -32564 -7682 7367 22453 12784 -10311 -6414 10158
12866 10158 10730 -2124 3361 10485 13965 18367 34778 37430 36488 29493 23802 6212 19039 20802
12852 20802 13636 43958 63932 23709 -12544 -21877 1445 -14110 -20678 -5258 9953 -8473
$$ packed form
12943C4086j1196l4003j0817J427j1812K7472Q245M437O928K0546K7214J9870
12931H2397j6985j6126j2424j4991j952j6711k1377j6836o887K0109J9668q35
12919b950N431J4414m44N360N171j3624O750j9455j5019j0483k851Q579P211j3172
12905b5082j5914J1229J6819l591J1190K27J345K94r93k6866k1771O931Q090K933
12891c5159N506Q353o111k910n747L4614K5782o011k2248j3583J8652J3415l1378
12878a6825r094N188k8191l3666N0024K4882J5049J5086r669k3095L897J6572
12866A0158N72j2854N485P124L480M402J6411K652r42o995n691j7590J2827J763
12852B0802p166L0322J9974m0223l6253r333K3322j5555o568J5420J5211j8426
$$ plain form
12840 -8473 9792 19302 21835 11900 -11870 -15331 1505 3875 22372 27839 36946 23819 37762
12827 37762 41764 95862 103911 98566 98015 94712 84579 110835 174470 284314 451302 673665
12815 673665 795609 613125 341183 171031 69886 36645 24274 30838 42060 24353 9132
12804 9132 -1287 -8965 -20150 -16579 -26229 -8958 20829 35401 29261 -60 5903 16688 -10501
12791 -10501 -26994 -1822 15944 -4157 -61672 -85096 -56047 -18700 -2462 -3973 3857 879
12779 879 -17179 -25500 -14978 -16588 -9168 -5514 5121 -9527 -19788 -30672 2610 21064 28330
12766 28330 6890 3315 -28306 -19850 -11603 -4869 20589 5205 11168 20598 15593 14174 13551 -1267
12752 -1267 10448 41569 54624 40331 35793 3557 -41479 -35027 -27647 -28345 -21563 -21452 -11358
$$ packed form
12840h473J8265R510K533r935k3770l461J6836K370J8497N467R107j3127J3943
12827C7762M002N4098Q049n345n51l303j0133K6256O3635J09844J66988K22363
12815F73665J21944j82484k71942j70152j01145l3241j2371O564J1222j7707j5221
12804I132j0419p678j1185L571r650J7271K9787J4572o140k9321N963J0785k7189
12791a0501j6493K5172J7766k0101n7515k3424K9049L7347J6238j511P830k978
12779H79j8058q321J0522j610P420L654J0635j4648j0261j0884L3282J8454P266
12766B8330k1440l575l1621Q456Q247O734K5458j5384N963R430n005j419o23j4818
12752a267J1715L1121J3055j4293m538l2236m5036O452P380o98O782J11J0094
$$ plain form
12739 -11358 -10561 2313 36183 32850 5565 -9232 -19075 -18234 -7828 24696 4926 -13136 -4392
12726 -4392 -2306 -21750 -21734 19088 -19830 -35638 -9055 2262 9449 17720 21376 9383 17437
12713 17437 10025 -19695 -22869 -22161 -33616 -52803 -59036 -43220 -12138 3328 11374 18305 7771
12700 7771 -16762 20050 22534 -3732 -13941 -17720 -3838 -179 1873 1309 7601 5940 7816 2744
12686 2744 -5539 6827 19229 27092 24790 8993 7448 13265 871 6674 31344 62114 43184
12673 43184 43458 30407 6292 2589 -21442 -23531 -6839 -14505 -32579 -60584 -61090 -31686 -16694
12660 -16694 -25858 -38543 -17112 -3514 -23998 -34614 -39657 -61073 -57805 -40712 -44349 -41776 -10588
12647 -10588 3430 9396 4516 -4639 2746 -600 26574 28266 4733 7203 10437 3292 8431 42026
$$ packed form
12739a1358P97J2874L3870l333k7285j4797r843Q41J0406L2524j9770j8062Q744
12726d392K086j9444J6M0822l8918j5808K6583J1317P187Q271L656j1993Q054
12713A7437p412k9720l174P08j1455j9187o233J5816L1082J5466Q046O931j0534
12700G771k4533L6812K484k6266j0209l779J3882L659K052n64O292j661J876n072
12686B744q283J2366J2402P863k302j5797j545N817j2394N803K4670L0770j8930
12673D3184K74j3051k4115l703k4031k089J6692p666j8074k8005n06K9404J4992
12660a6694r164j2685K1431J3598k0484j0616n043k1416L268J7093l637K573L1188
12647a0588J4018N966m880r155P385l346K7174J692k3533K470L234p145N139L3595
$$ plain form
12633 42026 26053 -1432 -3789 -1882 5671 5312 -25590 -19191 -4503 24475 20556 15125 20256
12620 20256 -1129 -4840 -5514 -13692 -25975 -55269 -57403 -42319 -8579 22751 24354 11921 15307
12607 15307 -5600 -27774 -39498 -35237 -30062 -33880 -23445 -29261 -18001 -22135 -15651 18899 28216
12594 28216 3789 -17335 -25335 -22767 -5081 5847 46283 42921 41222 68038 61013 18430 -13320
12581 -13320 -31533 -6827 17363 22065 35614 51812 53947 51731 38135 49622 43254 42388 54879
12568 54879 70211 71862 79175 133973 240119 296416 297653 232037 172150 185668 169788 178026
12556 178026 222037 278787 307751 390972 500379 581100 588093 574250 544201 462593 390550
12545 390550 313970 237763 195500 156746 110023 85574 87323 78992 86792 81422 61736 28398
$$ packed form
12633D2026j5973k7485k357J907P553l59l0902O399J4688K8978l919n431N131
12620B0256k1385l711o74q178j2283k9294k134J5084L3740L1330J603j2433L386
12607A5307k0907k2174j1724M261N175l818J0435n816J1260m134O484L4550R317
12594B8216k4427k1124q000K568J7686J0928M0436l362j699K6816p025m2583l1750
12581a3320j8213K4706K4190M702J3549J6198K135k216j3596J1487o368q66J2491
12568E4879J5332J651P313N4798J06146N6297J237o5616n9887J3518j5880Q238
12556A78026M4011N6750K8964Q3221J09407Q0721O993j3843l0049q1608p2043
12545C90550p6580p6207m2263l8754m6723k4449J749q331P800n370j9686l3338
$$ plain form
12533 28398 2713 -8719 -22762 -23924 -18148 -16472 -6570 15661 29399 25882 10063 1325 4054
12520 4054 17507 21634 13880 5130 17964 22029 14436 -1094 4064 10726 17313 9527 -3434 -8136
12506 -8136 -8141 -16712 -26211 -18349 -9014 30801 24319 4710 -6160 -7452 5304 24613 34304 23592
12492 23592 10283 16120 8616 9633 17644 16652 15150 -19973 -35104 -16727 -17053 -32715 -55314
12479 -55314 -43234 2114 11518 8102 3387 -15801 -22598 -17674 -22690 -6513 3456 11232 5544
12466 5544 1201 10495 25508 41938 43577 56863 73097 93987 129626 204663 304143 416900
12454 416900 518003 544028 439116 288487 186144 110855 72642 63818 35983 11759 28943
12443 28943 59040 56081 58382 33805 23622 -7422 -18537 -12232 -31601 -21267 -962 -2791
$$ packed form
12533B8398k5685j1432j4043j162N776J676R902K2231J3738l517j5819q738K729
12520D054J3453M127p754q750J2834M065p593j5530N158O662O587p786j2961m702
12506h136nq571r499P862R335L9815o482j9609j0870j292J2756J9309R691j0712
12492B3592j3309N837p504J017Q011r92j502l5123j5131J8377l26j5662k2599
12479e5314J2080M5348R404l416m715j9188o797M924n016J6177R969P776n688
12466E544m343R294J5013J6430J639J3286J6234K0890L5639P5037R9480J12757
12454D16900J01103K6025j04912j50629j02343p5289l8213q824k7835k4224J7184
12443B8943L0097k959K301k4577j0183l1044j1115O305j9369J0334K0305j829
$$ plain form
12431 -2791 5829 11404 11310 11094 44071 46324 23180 11140 8105 -4033 -22933 -9005 -6392 23974
12417 23974 60059 51052 33428 29767 29640 18174 21048 7693 7785 10412 -12826 -9996 3580 10479
12403 10479 29977 20719 33945 24773 33843 65760 56313 45894 24285 6472 7717 -10571 3903
12390 3903 24320 12495 8923 12954 44446 32715 22734 40672 54998 36837 38374 48720 35461
12377 35461 15382 4119 19438 16364 -6218 8757 33410 66293 55082 32595 65058 63891
12365 63891 56188 91481 143217 153143 158471 162987 183799 195653 188880 174764 117773 65508 30374
12352 30374 -4972 -14701 13064 19641 11361 24609 25436 16515 -12907 -12513 -784 -12313 -2807
12339 -2807 -888 -8481 -19474 18505 46362 38218 31093 23373 -7354 -11885 -25481 -10222 12600
$$ packed form
12431b791Q620N575r4k16L2977K253k3144j2040l035j2138j8900J3928K613L0366
12417B3974L6085r007j7624l661j27j1466K874j3355R2K627k3238K830J3576O899
12403A0479J9498r258J3226r172R070L1917r447j0419k1609j7813J245j8288J4474
12390C903K0417j1825l572M031L1492j1731r981J7938J4326j8161J537J0346j3259
12377C5461k0079j1263J5319l074k2582J4975K4653L2883j1211k2487L2463j167
12365F3891p703L5293N1736R926N328M516K0812J1854o773j4116n6991n2265l5134
12352C0374l5346r729K7765O577q280J3248Q27q921k9422L94J1729j1529R506
12339b807J919p593j0993L7979K7857q144p125p720l0727m531j3596J5259K2822
$$ plain form
12326 12600 9397 9468 -3982 -38099 -12595 -6952 -36700 -27804 -23418 -17167 -4663 -9134 -2936 36280
12312 36280 45484 38455 26484 2556 -8560 -9257 -13998 -1371 966 9657 -4257 -613 14395
12299 14395 36124 35910 18779 13377 24773 14375 20997 9672 7175 6245 3480 20499 53243
12286 53243 52668 61509 41757 36582 27735 30151 28268 61736 91143 97018 106978 146499 172251
12273 172251 192055 216179 231316 215473 185951 150476 186329 170817 124124 105366 103413 106766
12261 106766 101564 99064 117002 139325 99174 79075 108731 130486 136229 129602 157695 174002
12249 174002 200700 179131 167485 183784 249353 300421 372409 420072 422068 403621 353984 290120
12237 290120 241089 195573 160008 122331 100464 79571 73426 79614 61446 48738 56710 54824
$$ packed form
12326A2600l203P1j3450l4117K5504N643k9748Q896M386O251J2504m471O198L9216
12312C6280R204p029j1971k3928j1116o97m741J2627K337Q691j3914L644J5008
12299A4395K1729k14j7131n402J1396j0398O622j1325k497r30k765J7019L2744
12286E3243n75Q841j9752n175q847K416j883L3468K9407N875R960L9521K5752
12273A72251J9804K4124J5137j5843k9522l5475L5853j5512m6693j8758j953L353
12261A06766n202k500J7938K2323m0151k0099K9656K1755N743o627K8093J6307
12249A74002K6698k1569j1646J6299O5569N1068P1988M7663J996j8447m9637o3864
12237B90120m9031m5516l5565l7677k1867k0893o145O188j8168j2708P972j886
$$ [...]
##END NTUPLES=NMR SPECTRUM
##END=
