##TITLE=Analysis number 315620
Compound Code sew 04524
Project Code adrs
Chemist Name hixia
##JCAMPDX= 6.0         $$ Bruker NMR JCAMP-DX V2.0
##DATA TYPE= NMR SPECTRUM
##DATA CLASS= NTUPLES
##ORIGIN= Bruker BioSpin GmbH
##OWNER= NMR
$$ XWIN-NMR		Version 3.5
$$ Thu Nov 24 16:08:58 2005 GMT Standard Time (UT+0h)  MAYBRIDGE\NMR@NMR_250MHZ
##.OBSERVE FREQUENCY= 250.131544655141
##.OBSERVE NUCLEUS= ^1H
##.ACQUISITION MODE= SIMULTANEOUS (DQD)
##.ACQUISITION SCHEME= undefined
##.AVERAGES= 16
##.DIGITISER RES= 18
##SPECTROMETER/DATA SYSTEM= dpx250
##.PULSE SEQUENCE= zg30
##.SOLVENT NAME= DMSO
##.SHIFT REFERENCE= (INTERNAL, DMSO, 0, 16.522)
##AUDIT TRAIL= $$ (NUMBER, WHEN, WHO, WHERE, WHAT)
$$ ##TITLE= Audit trail, XWIN-NMR		Version 3.5
$$ ##JCAMPDX= 5.01
$$ ##ORIGIN= Bruker BioSpin GmbH
$$ ##OWNER= NMR
$$ C:\u/data/dgb/nmr/ADRS/13020/pdata/1/auditp.txt
$$ ##AUDIT TRAIL=  $$ (NUMBER, WHEN, WHO, WHERE, WHAT)
(   1,<2005-11-24 16:08:36.59 +000>,<MAYBRIDGE\NMR>,<NMR_250MHZ>,
      <created by zg, POWCHK disabled, PULCHK disabled
       configuration hash MD5:
       62 19 C7 07 E1 42 D1 B7 37 6C 3D D0 77 39 F9 E6
       data hash MD5: 64K
       90 27 CD 12 9F 87 1C 39 06 F8 D9 F3 80 95 A1 34>)
(   2,<2005-11-24 16:08:49.24 +000>,<MAYBRIDGE\NMR>,<NMR_250MHZ>,
      <Start of raw data processing
       ef LB = 0.3 FT_mod = 6 PKNL = 1 SI = 32K 
       data hash MD5: 32K
       3D F8 E0 2A 47 CA 74 76 3B 37 05 FF 44 4A DF F6>)
(   3,<2005-11-24 16:08:51.20 +000>,<MAYBRIDGE\NMR>,<NMR_250MHZ>,
      <apk 
       data hash MD5: 32K
       3D 2E B5 93 10 FC B0 88 71 8A 29 B5 C9 E0 9B 49>)
(   4,<2005-11-24 16:08:51.99 +000>,<MAYBRIDGE\NMR>,<NMR_250MHZ>,
      <abs ABSG = 5 
       data hash MD5: 32K
       C5 93 9F E1 ED D2 4A BB E6 2F 57 29 E0 E8 6C 68>)
$$ ##END=
$$ 
$$ hash MD5
$$ 82 03 0D 04 90 07 9A 19 50 7B A6 B6 D7 51 3F 40
##$RELAX= 
##$RELAX= 
##$RELAX= 
##$RELAX= 
##$RELAX= 
##$RELAX= 
##$RELAX= 
$$ Bruker specific parameters
$$ --------------------------
##$DU= <C:\u>
##$EXPNO= 13020
##$NAME= <ADRS>
##$PROCNO= 1
##$TYPE= <nmr>
##$USER= <dgb>
##$AMP= (0..31)
100 100 100 100 100 100 100 100 100 100 100 100 100 100 100 100 100 100 
100 100 100 100 100 100 100 100 100 100 100 100 100 100 
##$AQSEQ= 0
##$AQ_mod= 3
##$AUNM= <au_zg>
##$AUTOPOS= <48 >
##$BF1= 250.13
##$BF2= 250.13
##$BF3= 250.13
##$BF4= 250.13
##$BF5= 500.13
##$BF6= 500.13
##$BF7= 500.13
##$BF8= 500.13
##$BYTORDA= 1
##$CFDGTYP= 0
##$CFRGTYP= 5
##$CHEMSTR= <none>
##$CNST= (0..31)
1 1 145 1 1 1 1 1 1 1 1 1 1 1 1 1 1 1 1 1 1 1 1 1 1 1 1 1 1 1 1 1 
##$CPDPRG= <>
##$CPDPRG1= <>
##$CPDPRG2= <>
##$CPDPRG3= <>
##$CPDPRG4= <mlev>
##$CPDPRG5= <mlev>
##$CPDPRG6= <mlev>
##$CPDPRG7= <mlev>
##$CPDPRG8= <mlev>
##$CPDPRGB= <>
##$CPDPRGT= <>
##$D= (0..31)
0 1 0 0 0 0 0 0 0 0.06 0 0 0 0 0 0 0.0002 0 0 0 0 0 0 0 0 0 0 0 0 0 0 
0 
##$DATE= 1132848515
##$DBL= (0..7)
120 120 120 120 120 120 120 120 
##$DBP= (0..7)
150 150 150 150 150 150 150 150 
##$DBP07= 0
##$DBPNAM0= <>
##$DBPNAM1= <>
##$DBPNAM2= <>
$$ [...]
##$SUBNAM6= <"">
##$SUBNAM7= <"">
##$SUBNAM8= <"">
##$SUBNAM9= <"">
##$SW= 20.6930455092707
##$SWIBOX= (0..15)
0 0 3 0 0 0 0 0 0 0 0 0 0 0 0 0 
##$SW_h= 5175.983436853
##$TD= 65536
##$TD0= 1
##$TE= 294.16
##$TE2= 300
##$TE3= 300
##$TEG= 300
##$TL= (0..7)
0 120 120 120 120 120 120 120 
##$TP= (0..7)
150 150 150 150 150 150 150 150 
##$TP07= 0
##$TPNAME0= <>
##$TPNAME1= <>
##$TPNAME2= <>
##$TPNAME3= <>
##$TPNAME4= <>
##$TPNAME5= <>
##$TPNAME6= <>
##$TPNAME7= <>
##$TPOAL= (0..7)
0.5 0.5 0.5 0.5 0.5 0.5 0.5 0.5 
##$TPOFFS= (0..7)
0 0 0 0 0 0 0 0 
##$TUNHIN= 0
##$TUNHOUT= 0
##$TUNXOUT= 0
##$USERA1= <user>
##$USERA2= <user>
##$USERA3= <user>
##$USERA4= <user>
##$USERA5= <user>
##$V9= 5
##$VALIST= <valist>
##$VCLIST= <CCCCCCCCCCCCCCC>
##$VD= 0
##$VDLIST= <DDDDDDDDDDDDDDD>
##$VPLIST= <PPPPPPPPPPPPPPP>
##$VTLIST= <TTTTTTTTTTTTTTT>
##$WBST= 1024
##$WBSW= 4
##$XGAIN= (0..3)
0 0 0 0 
##$XL= 0
##$YL= 0
##$YMAX_a= 463154
##$YMIN_a= -478493
##$ZGOPTNS= <>
##$ZL1= 120
##$ZL2= 120
##$ZL3= 120
##$ZL4= 120
##$ABSF1= 16.522
##$ABSF2= -4.171173
##$ABSG= 5
##$ABSL= 3
##$ALPHA= 0
##$AQORDER= 0
##$ASSFAC= 0
##$ASSFACI= 0
##$ASSFACX= 0
##$ASSWID= 0
##$AUNMP= <proc_1d>
##$AZFE= 0.1
##$AZFW= 0.1
##$BCFW= 0
##$BC_mod= 0
##$BYTORDP= 0
##$COROFFS= 0
##$CY= 12.5
##$DATMOD= 1
##$DC= 0
##$DFILT= <>
##$DTYPP= 0
##$F1P= 14.0000005364418
##$F2P= -0.99999901652339
##$FCOR= 0.5
##$FTSIZE= 32768
##$FT_mod= 6
##$GAMMA= 0
##$GB= 0
##$INTBC= 1
##$INTSCL= 1
##$ISEN= 128
##$LB= 0.3
##$LEV0= 0
##$LPBIN= 0
##$MAXI= 10000
##$MC2= 0
##$MEAN= 0
##$ME_mod= 0
##$MI= 0
##$NCOEF= 0
##$NC_proc= -3
##$NLEV= 6
##$NOISF1= 0
##$NOISF2= 0
##$NSP= 0
##$NTH_PI= 0
##$NZP= 0
##$OFFSET= 16.522
##$PC= 1
##$PHC0= 68.90276
##$PHC1= 15.5203
##$PH_mod= 1
##$PKNL= yes
##$PPARMOD= 0
##$PSCAL= 4
##$PSIGN= 0
##$REVERSE= no
##$SF= 250.13
##$SI= 32768
##$SIGF1= 0
##$SIGF2= 0
##$SINO= 400
##$SIOLD= 32768
##$SREGLST= <1H.DMSO>
##$SSB= 0
##$STSI= 32768
##$STSR= 0
##$SW_p= 5175.98343685301
##$SYMM= 0
##$S_DEV= 0
##$TDeff= 65536
##$TDoff= 0
##$TI= <Analysis number 999999
Compound Code 99
Book Reference 9
Project Code 9>
##$TILT= no
##$TM1= 0
##$TM2= 0
##$TOPLEV= 0
##$USERP1= <user>
##$USERP2= <user>
##$USERP3= <user>
##$USERP4= <user>
##$USERP5= <user>
##$WDW= 1
##$XDIM= 32768
##$YMAX_p= 332110635
##$YMIN_p= -335062
$$ End of Bruker specific parameters
$$ ---------------------------------
##NTUPLES= NMR SPECTRUM
##VAR_NAME=  FREQUENCY,     SPECTRUM/REAL,   SPECTRUM/IMAG
##SYMBOL=    X,             R,               I
##VAR_TYPE=  INDEPENDENT,   DEPENDENT,       DEPENDENT
##VAR_FORM=  AFFN,          ASDF,            ASDF
##VAR_DIM=   32768,         32768,           32768
##UNITS=     HZ,            ARBITRARY UNITS, ARBITRARY UNITS
##FACTOR=    0.157963299565203, 1,           1
##FIRST=     4132.6476996994, 0,             0
##LAST=      -1043.33573715361, 0,           0
##MIN=       -1043.33573715361, -335062,     0
##MAX=       4132.6476996994, 332110635,     0
$$ Real data points
##PAGE= N=1
##DATA TABLE= (X++(R..R)), XYDATA
$$ [...]
$$ plain form
26023 -50214 -64962 -50656 -16922 -17212 -50943 -58816 -34050 -39062 -74100 -66318 -36172 -32221 -16281
26010 -16281 -9591 -9372 -6969 -1398 -29277 -38373 -25510 -46314 -58354 -35711 -22784 -55301 -49902
25997 -49902 -50922 -48036 918 -7528 -23656 -9512 -4866 -25917 -57669 -71992 -36887 -18420
25985 -18420 -37796 -32119 -12613 1165 1081 -1731 -61486 -73020 -53174 -66022 -40691 -10934 -59753
25972 -59753 -114816 -108227 -117446 -122415 -105110 -73831 -53841 -59971 -82313 -46197 -20046 11721
25960 11721 19534 9768 739 5215 13579 8843 4774 -8795 -25882 -49611 -60996 -38215 28764
25947 28764 57565 51163 43683 -7032 -59466 -62617 -89652 -55443 -10537 37082 64083 11563
25935 11563 5535 -4462 -39365 -56098 -64890 -37352 -10834 -10783 -662 -10010 19664 20953 -26797
$$ packed form
26023e0214j4748J4306L3734k90l3731p873K4766n012l5038P782L0146L951J5940
26010a6281O690K19K403N571k7879r096J2863k0804j2040K2643J2927l2517N399
25997d9902j020K886M8954q446j6128J4144M646k1051l1752j4323L5105J8467
25985a8420j9376N677J9506J3778q4k812n9755j1534J9846j2848K5331K9757m8819
25972e9753n5063O589r219m969J7305L1279J9990o130k2342L6116K6151L1767
25960A1721P813r766r029M476Q364m736m069j3569j7087k3729j1385K2781O6979
25947B8764K8801o402p480n0715n2434l151k7035L4209M4906M7619K7001n2520
25935A1563o028r997l4903j6733q792K7538K6518N1J0121r348K9674J289m7750
$$ plain form
25922 -26797 -26741 -46833 -78351 -105192 -89173 -92942 -96064 -68543 -35096 -8419 -32246 -42391 -25687
25909 -25687 -45558 -75722 -80362 -42608 -39915 -26661 -54469 -58065 -75833 -84804 -93602 -71265 -54052
25896 -54052 -56275 -90505 -92606 -39811 -8710 -8049 -46149 -86181 -66804 -28190 -18715 -18690 -13303
25883 -13303 17459 39739 69733 60398 23191 -14110 -16195 -13390 -27270 -2276 16100 47414
25871 47414 56301 36884 -14693 -72800 -34467 37577 67566 33796 -10153 -36040 -70716 -75226
25859 -75226 -60274 -27999 21928 53662 66187 47997 60078 7986 -30090 -44855 -16657 4371
25847 4371 51162 18286 -17428 -3383 -11682 -17871 -5939 35959 -1822 -45108 -69667 -69326 -61034
25834 -61034 -26233 19926 -6107 -17365 -60374 -61767 -74090 -43931 -48065 -45133 -36630 -26248
$$ packed form
25922b6797N6k0092l1518k6841J6019l769l122K7521L3447K6677k3827j0145J6704
25909b5687j9871l0164m640L7754K693J3254k7808l596j7768q971q798K2337J7213
25896e4052k223l4230k101N2795L1101O61l8100m0032J9377L8614R475K5N387
25883a3303L0762K2280K9994r335l7207l7301k085K805j3880K4994J8376L1314
25871D7414Q887j9417n1577n8107L8333P2044K9989l3770m3949k5887l4676m510
25859g5226J4952L2275M9927L1734J2525j8190J2081n2092l8076j4765K8198K1028
25847D371M6791l2876l5714J4045q299o189J1932M1898l7781m3286k4559L41Q292
25834f1034L4801M6159k6033j1258m3009j393j2323L0159m134K932Q503J0382
$$ plain form
25822 -26248 15624 28539 -29921 -63946 -42634 -12990 442 -964 9255 -8738 239 16515
25810 16515 34886 38830 13352 -5769 18956 62622 38758 -38720 -70896 -43485 -26895 -23020
25798 -23020 -9693 62091 66531 -14726 -76572 -64315 -30402 5485 -7992 -67320 -104784 -89789
25786 -89789 -31003 -34913 -26345 -10160 15186 3150 -8374 565 -25982 -37137 -59585 -89774
25774 -89774 -101522 -73726 -30041 -28328 -23371 -21196 -46979 -55516 -933 17934 41460 40036 8203
25761 8203 -28777 -48628 -77201 -103713 -124286 -102263 -61706 -72152 -72112 -67798 -34748 -25599 -31434
25748 -31434 -42365 -27164 -1398 -50257 -85030 -47197 -56585 -85028 -97697 -69450 -28351 -21802
25736 -21802 -42524 -39201 -39949 -37888 -20596 -17312 -25631 -25475 -9091 -4317 -8084 -32079 -61141 -62631
$$ packed form
25822b6248M1872J2915n8460l4025K1312K9644J3432j406J0219j7993Q977J6276
25810A6515J8371L944k5478j9121K4725M3666k3864p7478l2176K7411J6590L875
25798b3020J3327P1784M440q1257o1846J2257L3913L5887j3477n9328l7464J4995
25786h9789N8786l910Q568J6185K5346j2036j1524Q939k6547j1155k2448l0189
25774h9774j1748K7796M3685J713M957K175k5783q537N4583J8867K3526j424l1833
25761H203l6980j9851k8573k6512k0573K2023M0557j0446M0M314L3050R149n835
25748c1434j0931J5201K5766m8859l4773L7833r388k8443j2669K8247M1099O549
25736b1802k0722L323p48K061J7292L284q319J56J6384M774l767k3995k9062j490
$$ plain form
25722 -62631 -12043 30557 12006 -11497 34070 22325 -11335 20040 42078 6342 -12209 6586
25710 6586 785 -14655 -45781 -75624 -69738 -20055 -2303 -854 -2249 -46675 -17670 17614 15095
25697 15095 -2255 -26000 -19825 -21027 -17525 -1614 13260 -4083 -63095 -32481 16933 -4646
25685 -4646 -28107 -27730 -31926 -20724 9592 43670 35361 241 12559 38620 3117 21602 48920
25672 48920 85066 97227 72233 61308 47795 27087 -17453 -30045 -37630 -65906 -77627 -68103
25660 -68103 -37539 -23015 -14475 -34096 -49087 -62200 -79345 -48416 -21743 27400 29641 16786
25648 16786 33684 24977 16527 -7676 -11816 -47738 -70724 -54680 -9306 9862 448 33643
25636 33643 16971 -8743 419 -32844 -33620 -24176 -46856 -73100 -73841 -28886 -6819 -18281 -2996
$$ packed form
25722f2631N0588M2600j8551k3503M5567j1745l3660L1375K2038l5736j8551J8795
25710F586n801j5440l1126k9843N886M9683J7752J449j395m4426K9005L5284k519
25697A5095j7350k3745O175j202L502J5911J4874j7343n9012L0614M9414k1579
25685d646k3461L77m196J1202L0316L4078q309l5120J2318K6061l5503J8485K7318
25672D8920L6146J2161k4994j0925j3513k0708m4540j2592p585k8276j1721R524
25660f8103L0564J4524Q540j9621j4991j3113j7145L0929K6673M9143K241j2855
25648A6786J6898q707q450k4203m140l5922k2986J6044M5374J9168r414L3195
25636C3643j6672k5714R162l3263p76R444k2680k6244p41M4955K2067j1462J5285
$$ plain form
25623 -2996 -1117 -3603 -16487 -43136 -86862 -89456 -54040 -20345 -20179 -46128 -48120 -43506 -47486
25610 -47486 -30794 -17097 -32236 -40153 -10665 11892 17042 19066 -12300 -30584 -43100 -34269
25598 -34269 -36040 -24376 -8236 -13107 -3633 -25350 -71074 -39792 -51639 -94353 -97123 -34229
25586 -34229 1544 13726 14872 14277 10278 -5711 -22203 -13791 -4392 17 -10525 3636 23944
25573 23944 19561 -10618 -48075 -33063 4339 -4147 -23042 -22490 -23825 -29741 -56813 -49343 -16625
25560 -16625 13766 -16526 -35621 -7846 -18643 -54614 -33178 -27783 -64999 -65396 -57609 -80014
25548 -80014 -58599 -59357 -75400 -65980 -39123 852 37565 49412 23909 30231 32110 23239 22510
25535 22510 18990 23359 23397 -17539 -81780 -91454 -70773 -48985 -45144 -76616 -96526 -98617 -92268
$$ packed form
25623b996J879k486j2884k6649m3726k594L5416L3695J66k5949j992M614l980
25610d7486J6692J3697j5139p917K9488K2557N150K024l1366j8284j2516Q831
25598c4269j771J1664J6140m871R474k1717m5724L1282j1847m2714k770O2894
25586c4229L5773J2182J146n95l999j5989j6492Q412R399M409j0542J4161K0308
25573B3944m383l0179l7457J5012L7402q486j8895N52j335n916k7072P470L2718
25560a6625L0391l0292j9095K7775j0797l5971K1436N395l7216l97P787k2405
25548h0014K1415p58j6043R420K6857L9975L6713J1847k5503O322J879q871p29
25535B2510l520M369L8m0936o4241r674K0681K1788L841l1472j9910k091O349
$$ plain form
25522 -92268 -69980 -56370 -71165 -3156 1946 -16274 -9326 -17198 -24627 -39431 -21998 29836
25510 29836 21014 22224 27735 27432 -7863 -18713 26321 38868 59655 58630 81231 74866 28180
25497 28180 14085 -704 -24002 -1867 12750 -14145 -21706 -30017 11889 46037 -38282 -118501
25485 -118501 -122870 -75660 -30266 -20345 7916 5365 13802 25467 4873 -3871 -33173 -9754
25473 -9754 17337 8282 -7645 -17141 -23243 -56163 -54108 -28587 -9388 -17160 -39995 -51108 -72855
25460 -72855 -66613 -55270 -66390 -37318 -13633 -44170 -91091 -66270 -18994 -7724 2894 34908
25448 34908 36236 1382 -13507 -20068 -5632 3605 47157 61086 54741 61549 19338 5262 15578
25435 15578 10778 -19196 1936 9171 22780 -1384 -36372 -18728 35084 12988 -418 -323 -19065
$$ packed form
25522i2268K2288J3610j4795O8009N102j8220O948p872p429j4804J7433N1834
25510B9836q822J210N511l03l5295j0850M5034J2547K0787j025K2601o365m6686
25497B8180j4095j4789k3298K2135J4617k6895p561q311M1906L4148q4319q0219
25485a18501m369M7210M5394R921K8261k551Q437J1665k0594q744k9302K3419
25473i754K7091r055j5927r496o102l2920K055K5521J9199p772k2835j1113k1747
25460g2855O242J1343j1120K9072K3685l0537m6921K4821M7276J1270J0618L2014
25448C4908J328l4854j4889o561J4436R237M3552J3929o345O808m2211j4076J0316
25435A5578m800k9974K1132P235J3609k4164l4988J7644N3812k2096j3406R5j8742
$$ plain form
25422 -19065 -24374 -14204 -4813 -6228 -10230 12230 -7030 -32826 -50541 -18409 -22629 -23393 -44807
25409 -44807 -48078 -14279 2215 17586 -15372 -65136 -42352 13476 8789 29762 20546 16212
25397 16212 13173 10156 -14068 -39080 -75920 -106889 -61732 -38897 -4865 -10414 -3010 -4907 -32329
25384 -32329 -55564 -41365 -9155 -28459 -20920 -4137 -5793 -33580 -10481 10533 54627 115498
25372 115498 103553 41980 -28821 -23330 -27918 -23123 -22733 -37274 -28773 -43505 -90843 -49553 -41900
25359 -41900 -13625 -13674 -48386 -43085 -69107 -94112 -71417 -82544 -79041 -73760 -53710 -63512 -47840
25346 -47840 -29319 3274 19865 9945 2344 -21858 -26921 -9092 4624 -15513 -11223 12270
25334 12270 -8469 -31816 -25322 -10472 6626 31403 65299 75151 29077 -18065 -49633 -49811
$$ packed form
25422a9065n309J0170R391j415m002K2460j9260k5796j7715L2132m220p64k1414
25409d4807l271L3799J6494J5371l2958m9764K2784N5828m687K0973r216m334
25397A6212l039l017k4224k5012l6840l0969M5157K2835L4032n549P404j897k7422
25384c2329k3235J4199L2210j9304P539J6783j656k7787K3099K1014M4094O0871
25372A15498j1945o1573p0801N491m588M795L90j4541Q501j4732m7338M1290P653
25359d1900K8275m9l4712N301k6022k5005K2695j1127L503N281K0050r802J5672
25346d7840J8521L2593J6591r920p601k4202n063J7829J3716k0137M290K3493
25334A2270k0739k3347O494J4850J7098K4777L3896R852m6074m7142l1568j78
$$ plain form
25322 -49811 -73341 -83783 -75062 -62036 -79165 -92106 -80125 -75788 -88351 -94519 -60186 -8189
25310 -8189 22336 4881 -39615 -55530 -63148 -72031 -33186 -10667 8046 -10819 -16999 -5409
25298 -5409 -19996 7081 59659 54935 44057 45552 17585 6532 5804 1499 -19938 -5261 1856
25285 1856 5347 45857 21211 -36871 -30932 -20771 -5274 -43978 -51639 -49034 5485 -4853 -11801
25272 -11801 18040 26700 -21191 -36987 -28004 -10048 -23348 -71305 -52538 -27733 1155 29329
25260 29329 25386 -12146 -4655 -17208 -34333 23761 -1473 -11030 32124 25252 16240 32344 28175
25247 28175 -23597 -36156 -42460 -17776 1741 4023 -23447 781 -34876 -45747 -4632 1712
25235 1712 -17697 -45544 -29476 21870 25723 13200 16310 18282 50628 67527 62321 46137 27990
$$ packed form
25322d9811k3530j0442Q721J3026j7129j2941J1981M337j2563o168L4333N1997
25310h189L0525j7455m4496j5915p618q883L8845K2519J8713j8865o180J1590
25298e409j4587K7077N2578m724j0878J495k7967j1053p28m305k1437J4677P117
25285A856L491M0510k4646n8082N939J0161J5497l8704p661K605N4519j0338o948
25272a1801K9841Q660m7891j5796Q983J7956j3300m7957J8767K4805K8888K8174
25260B9329l943l7532P491j2553j7125N8094k5234r557M3154o872r012J6104m169
25247B8175n1772j2559o304K4684J9517K282k7470K4228l5657j0871M1115O344
25235A712j9409k7847J6068N1346L853j2523L110J972L2346J6899n206j6184j8147
$$ plain form
25222 27990 13268 -23982 -11632 -14890 -1261 -6239 -5208 -15440 -9472 2882 -20112 -5191
25210 -5191 45599 23167 -43499 -75492 -38247 -18269 -48176 -53807 -27412 10423 3324 26722
25198 26722 21359 3419 -4171 -5549 -47305 -58054 -22029 -19765 -47623 -53108 -89696 -79406 -65536
25185 -65536 -66588 -85999 -72517 -40822 -20504 1045 -19298 -34685 -28007 -839 -14188 10326
25173 10326 -5549 12212 2955 -10818 -377 32869 49277 32299 4909 -6079 -19691 -7973
25161 -7973 39584 43897 4666 -8392 -12417 2886 5906 18375 4596 9062 16256 5983 11471
25148 11471 -15724 9124 13111 -3203 9117 -8734 -35524 -33863 -66131 -74447 -75474 -64707
25136 -64707 -59431 -52531 -52062 -67355 -35523 -21481 -11003 -5365 -37270 -31097 -43326 -12683 6176
$$ packed form
25222B7990j4722l7250J2350l258J3629m978J031j0232N968J2354k2994J4921
25210e191N0790k2432o6666l1993L7245J9978k9907n631K6395L7835p099K3398
25198B6722n363j7940p590j378m1756j0749L6025K264k7858n485l6588J0290J3870
25185f5536j052j9411J3482L1695K0318K1549k0343j5387O678K7168j3349K4514
25173A0326j5875J7761r257j3773J0441L3246J6408j6978k7390j0988j3612J1718
25161g973M7557M313l9231j3058m025J5303L020J2469j3779M466P194j0273N488
25148A1471k7195K4848L987j6314J2320j7851k6790J661l2268q316j027J0767
25136f4707N276O900M69j5293L1832J4042J0478N638l1905O173j2229L0643J8859
$$ plain form
25123 6176 1002 24478 31398 -4621 -27030 -30875 -33248 -6973 -15303 -66072 -47202 6288 7185
25110 7185 24288 43028 20925 34008 29659 24443 15104 21184 26238 28939 68143 42230 11023
25097 11023 -36144 -72310 -70604 -86946 -91505 -95927 -81527 -73006 -43004 -56533 -70362 -65295 -30986
25084 -30986 29722 51589 2556 -34285 -2523 32693 -19235 -47499 -83741 -84201 -79088 -62611
25072 -62611 -38537 -43875 -66201 -56445 -54389 -105156 -73930 -27770 -18215 -28383 -13191 -40720
25060 -40720 -80191 -102433 -88681 -60370 -33046 -13892 10407 57541 36551 -14537 -18306 16535
25048 16535 27735 8886 21152 -21304 -30315 -8832 12479 -10431 -22256 -82247 -62320 -54066
25036 -54066 -21529 -26145 -21885 -56682 -63876 -37940 -60812 -58275 -20988 -31681 -55939 -76378
$$ packed form
25123F176n174K3476O920l6019k2409l845k373K6275q330n0769J8870N3490Q97
25110G185J7103J8740k2103J3083m349n216r339O080N054K701L9204k5913l1207
25097A1023m7167l6166J706j6342m559m422J4400Q521L0002j3529j3829N067L4309
25084c0986O0708K1867m9033l6841L1762L5216n1928k8264l6242m60N113J6477
25072f2611K4074n338k2326R756K056n0767L1226M6160R555j0168J5192k7529
25060d0720l9471k2242J3752K8311K7324J9154K4299M7134k0990n1088l769L4841
25048A6535J1200j8849J2266m2456r011K1483K1311k2910j1825n9991J9927Q254
25036e4066L2537m616M260l4797p194K5936k2872K537L7287j0693k4258k0439
$$ plain form
25024 -76378 -72224 -42004 -39329 -44200 -69274 -60160 -16755 -4314 -4103 -4503 9055 25358 -10113
25011 -10113 -39886 -64951 -87670 -101889 -97071 -85792 -94079 -72226 -41403 -49033 -37040 -48468
24999 -48468 -62290 -73399 -18997 35751 4868 -42265 -26307 -52708 -50900 -62584 -73226 -10232
24987 -10232 -18565 -79980 -92242 -91762 -92141 -69075 -65035 -41252 -7620 3276 -18721 -57369 -106400
24974 -106400 -79823 -31525 -35114 -21894 -19788 -24457 -25377 -28837 -16072 -27576 -27275 -18204 -2497
24961 -2497 -9650 -33930 -43525 -50174 -60251 -80678 -28566 28299 23178 -33299 -41178 -36876 -81342
24948 -81342 -75808 -47416 18408 29229 24214 -9153 4481 21543 29614 19431 -3468 4427
24936 4427 9065 23073 54011 48553 -14675 -48662 -50038 -56771 -64301 -59877 -63343 -32798 -28867
$$ packed form
25024g6378M154L0220K675m871k5074R114M3405J2441K11m00J3558J6303l5471
25011a0113k9773k5065k2719j4219M818J1279q287K1853L0823p630J1993j1428
24999d8468j3822j1109N4402N4748l0883m7133J5958k6401J808j1684j0642O2994
24987a0232q333o1415j2262M80l79K3066M040K3783L3632J0896k1997l8648m9031
24974a06400K6577M8298l589J3220K106m669r20l460J2765j1504L01R071J5707
24961b497p153k4280r595o649j0077k0427N2112N6865n121n6477p879M302m4466
24948h1342N534K8392O5824J0821n015l3367J3634J7062Q071j0183k2899P895
24936D427M638J4008L0938n458o3228l3987j376o733p530M424l466L0545L931
$$ plain form
24923 -28867 -20343 -43046 -36078 -12647 -24901 -84113 -108201 -83453 -84712 -100005 -116404 -114862
24911 -114862 -102565 -64355 -37015 -20749 -50094 -42287 -36117 -38838 -16293 -13738 -31943 -44024
24899 -44024 -72513 -79227 -54538 -41341 -49662 -32674 21231 46700 33302 7252 -19378 -45251
24887 -45251 -39549 -25635 -37284 -69226 -49746 2349 35529 4424 29683 39900 34222 2649
24875 2649 32515 72308 90964 81865 48696 20531 2648 -11247 -44637 -60490 -39078 10378
24863 10378 24750 -35825 -21695 -59464 -83446 -91565 -136850 -180244 -162928 -75279 -11814 16450
24851 16450 21155 18750 22864 16389 -18625 -28710 -24235 -8735 -21862 -14465 -22769 -51022 -47066
24838 -47066 -26523 -26869 16300 11264 106 -62754 -83929 -78967 -55350 -61792 -62095 -33863 -41050
$$ packed form
24923b8867Q524k2703O968K3431j2254n9212k4088K4748j259j5293j6399J542
24911a14862J2297L8210K7340J6266k9345P807O170k721K2545K555j8205j2081
24899d4024k8489o714K4689J3197q321J6988N3905K5469j3398k6050k6630k5873
24887d5251N702J3914j1649l1942J9480N2095L3180l1105K5259J0217n678l1573
24875B649K9866L9793J8656r099l3169k8165j7883j3895l3390j5853K1412M9456
24863A0378J4372o0575J4130l7769k3982q119m5285m3394J7316Q7649O3465K8264
24851A6450M705k405M114o475l5014j0085M475J5500j3127P397q304k8253L956
24838d7066K0543l46M3169n036j1158o2860k1175M962K3617o442l03K8232p187
$$ plain form
24825 -41050 -63749 -99091 -88169 -74768 -73494 -84923 -74419 -69258 -49745 -27352 -55240 -71544
24813 -71544 -27692 -85883 -99973 -83695 -50801 -26274 -15380 -14444 -30220 -40843 -70433 -86115
24801 -86115 -113526 -104553 -41058 -23871 -9353 -7021 -40596 -68764 -96018 -122028 -92521 -37398
24789 -37398 -68985 -69858 -81766 -83896 -98458 -89085 -66781 -47736 -61095 -44961 -29125 -11076
24777 -11076 13046 37919 20605 -50202 -69620 -64374 -61120 -23583 -8999 -46139 -98386 -115568
24765 -115568 -89173 -24388 12566 -17323 -58319 -29402 -3260 -33993 -29716 -30462 -45439 -76465
24753 -76465 -91266 -69278 -24750 11852 38923 20119 -4866 -18727 -9958 -18894 -18817 -36731 -48694
24740 -48694 -6180 -74 -41042 -57505 -59282 -12660 33654 52271 34057 -15662 -30460 -5414
$$ packed form
24825d1050k2699l5342J0922J3401J274j1429J0504N161J9513K2393k7888j6304
24813g1544M3852n8191j4090J6278L2894K4527J0894R36j5776j0623k9590j5682
24801h6115k7411Q973O3495J7187J4518K332l3575k8168k7254k6010K9507N5123
24789c7398l1587q73j1908k130j4562R373K2304J9045j3359J6134J5836J8049
24777a1076K4122K4873j7314p0807j9418N246L254L7537J4584l7140n2247j7182
24765a15568K6395O4785L6954k9889m0996K8917K6142l0733M277p46j4977l1026
24753g6465j4801K1988M4528L6602K7071j8804k4985j3861Q769q936P7j7914j1963
24740d8694M2514O106m0968j6463j777M6622M6314J8617j8214m9719j4798K5046
$$ plain form
24728 -5414 36403 7128 -34023 -55405 -60762 -25552 21698 40963 36523 -17658 -5029 17401
24716 17401 -9232 -12431 -1764 -5575 -36905 -82434 -84026 -69964 -82491 -119503 -68812 -18344
24704 -18344 29677 43616 24381 53188 25726 10185 -27138 -44866 -67327 -42100 -25137 10429
24692 10429 33265 61592 91805 98239 118194 114380 100512 71917 42965 -2215 752 9271
24680 9271 17362 14547 -17866 -1516 -20105 -50198 -37248 -40272 -87626 -58754 -14549 -17463 -33025
24667 -33025 -66987 -86572 -38858 -22678 -31925 -38932 -57805 -49643 -20985 10967 -16144 -48776
24655 -48776 -76112 -75167 -64625 -49131 -58244 -63348 -33867 11057 14847 65686 94786 107041 72303
24642 72303 59687 27419 22037 3319 30054 32446 46947 33948 41699 24768 5321 -30057
$$ packed form
24728e414M1817k9275m1151k1382n357L5210M7250J9265m440n4181J2629K2430
24716A7401k6633l199J0667l811l1330m5529j592J4062j2527l7012N0691N0468
24704a8344M8021J3939j9235K8807k7462j5541l7323j7728k2461K5227J6963L5566
24692A0429K2836K8327L0213O434J9955l814j3868k8595k8952m5180K967Q519
24680I271Q091k815l2413J6350j8589l0093J2950l024m7354K8872M4205k914j5562
24667c3025l3962j9585M7714J6180r247p007j8873Q162K8658L1952k7111l2632
24655d8776k7336R45J0542J5494r113n104K9481M4924L790N0839K9100J2255l4738
24642G2303j2616l2268n382j8718K6735K392J4501j2999P751j6931j9447l5378
$$ plain form
24630 -30057 -10064 -1884 -23126 -56594 -99812 -95495 -75198 -34773 2463 -7909 -40312 -68571
24618 -68571 -69496 -69955 -57867 -19016 -4230 31613 36822 31719 16009 -25154 -46623 -42261 -3607
24605 -3607 3104 -31025 -63617 -31487 -28080 -73904 -70116 -91479 -141431 -101112 -30806 -15955
24593 -15955 -38441 -54585 -85181 -84187 -61732 -25788 1612 -11491 -23295 7883 8003 17424 -9395
24580 -9395 -51998 -94052 -89661 -29241 10397 16412 -18756 -36753 -66097 -51666 -20675 -10142
24568 -10142 -48356 -75028 -94563 -92615 -56022 -20150 -10412 -46691 -44138 -33475 -35773 34622
24556 34622 25260 -23450 -50201 -45344 -51855 -57477 -73699 -89850 -68831 -25646 8595 3682 3309
24543 3309 -2376 -71784 -73371 -28809 -4800 -15214 -32062 -19158 -9646 -40940 -102416 -137625
$$ packed form
24630c0057J9993Q180k1242l3468m3218M317K0297M0425L7236j0372l2403k8259
24618f8571r25m59J2088L8851J4786L5843N209n103j5710m1163k1469M362L8654
24605c607O711l4129l2592L2130L407m5824L788k1363m9952M0319P0306J4851
24593a5955k2486j6144l0596R94K2455L5944K7400j3103j1804L1178J20R421k6819
24580i395m2603m2054M391O0420L9638O015l5168j7997k9344J4431L0991J0533
24568a0142l8214k6672j9535J948L6593L5872R738l6279K553J0663k298P0395
24556C4622r362m8710k6751M857o511n622j6222j6151K1019M3185L4241m913l73
24543C309n685o9408j587M4562K4009j0414j6848J2904R512l1294o1476l5209
$$ plain form
24531 -137625 -159207 -152921 -172842 -137625 -88675 -47781 -16857 -23092 -18132 -16954 -30401 -58604
24519 -58604 -66401 -93049 -70120 -79337 -151399 -165198 -116608 -74317 -28510 -53008 -56851 -32821
24507 -32821 -55653 -72732 -10071 4320 -21023 -22530 -29071 -42073 -66961 -93536 -99316 -92993
24495 -92993 -80752 -77506 -64508 -71235 -34793 -12005 6502 13284 24086 33709 30345 29579 -31193
24482 -31193 -56232 -46407 -28748 3005 -22774 -27656 -13213 16643 -3989 -12561 -27232 -46255
24470 -46255 -30016 -32459 -37663 -51464 -12783 -3186 33649 46584 6339 22309 -17931 -80320
24458 -80320 -84845 -41573 -38290 -31786 112 1896 -3203 -26677 23932 62070 55750 42338 19021
24445 19021 30631 39248 33388 29507 43066 66516 45119 -11008 -24764 -22934 -61454 -94062
$$ packed form
24531a37625k1582O286j9921L5217M8950M0894L0924o235M960J178j3447k8203
24519e8604p797k6648K2929r217p2062j3799M8590M2291M5807k4498l843K4030
24507c2821k2832j7079O2661J4391k5343j507o541j3002k4888k6575n780O323
24495i2993J2241L246J2998o727L6442K2788J8507O782J0802R623l364p66o0772
24482c1193k5039R825J7659L1753k5779m882J4443K9856k0632q572j4671j9023
24470d6255J6239k443n204j3801L8681R597L6835J2935m0245J5970m0240o2389
24458h0320m525M3272L283O504L1898J784n099k3474N0609L8138o320j3412k3317
24445A9021J1610Q617n860l881J3559K3450k1397n6127j3756J830l8520l2608
$$ plain form
24433 -94062 -74394 -50452 -32990 -37343 -26134 -746 -10617 -12559 -5236 -26853 -42662 -22078
24421 -22078 -13924 42148 58520 53311 50822 43196 48347 89840 112608 73695 1785 -8425 13255
24408 13255 43924 11199 3048 24661 46957 54398 33261 -38891 -50803 -56094 -59667 -32434
24396 -32434 -10839 -7989 -24129 -57451 -72539 -51261 -15985 -11322 -19273 -5171 -2317 -23938
24384 -23938 -42836 -30887 -58977 -56765 -1789 17174 -9924 -25673 -31732 -17463 -33804 -21963
24372 -21963 -10671 7071 16482 9354 -40495 -62597 -28715 19064 -11501 -21493 -6590 -3624
24360 -3624 11082 27075 43751 16341 -15198 -13006 -5209 -44384 -41492 -24581 -29250 -62703 -75816
24347 -75816 -41881 1012 14951 -1728 10986 20324 18705 1792 -17469 -16731 9120 -11336
$$ packed form
24433i4062J9668K3942J7462m353J1209K5388r871j942P323k1617j5809K0584
24421b2078Q154N6072J6372n209k489p626N151M1493K2768l8913p1910j0210K1680
24408A3255L0669l2725q151K1613K2296P441k1137p2152j1912n291l573K7233
24396c2434K1595K850j6140l3322j5088K1278L5276M663p951J4102K854k1621
24384b3938j8898J1949k8090K212N4976J8963k7098j5749o059J4269j6341J1841
24372b1963J1292J7742R411p128m9849k2102L3882M7779l0565r992J4903K966
24360c624J4706J5993J6676k7410l1539K192P797l9175K892J6911m669l3453j3113
24347g5816L3935M2893J3939j6679J2714R338j619j6913j9261P38K5851k0456
$$ plain form
24335 -11336 -16380 -22258 116 20106 8235 5556 11206 -4015 -8931 -11113 -29554 -20178 -45744
24322 -45744 -33261 -6964 -7427 -36669 -48013 -49381 -14813 -31368 -13275 -4752 12814 -17871
24310 -17871 -13518 -24290 -31614 -8856 38363 57909 64037 17951 -30559 -276 34159 43350
24298 43350 8502 -44306 -96034 -63523 -39039 -41223 -65094 -77070 -116183 -133159 -125481 -104277
24286 -104277 -35985 320 10928 -5339 22619 45171 -10164 -39624 -80978 -60621 -9511
24275 -9511 -16830 -8753 -1237 -32596 -5247 -11181 -41200 -39947 -61733 -98343 -59257 7801 62334
24262 62334 30588 -30790 -50162 -12439 17346 32651 -27519 -39970 -21282 -33109 -24148 -29638
24250 -29638 -13506 -55579 -60622 -59203 -41090 -29331 -46614 -54806 -91984 -115642 -62080 -76090
$$ packed form
24335a1336n044n878K2374J9990j1871k679N650j5221m916k182j8441R376k5566
24322d5744J2483K6297m63k9242j1344j368L4568j6555J8093Q523J7566l0685
24310a7871M353j0772p324K2758M7219J9546O128m6086m8510L0283L4435R191
24298D3350l4848n2808n1728L2511K4484k184k3871j1976l9113j6976P678K1204
24286a04277O8292L6305J0608j6267K7958K2552n5335k9460m1354K0357N1110
24275i511p319Q077P516l1359K7349n934l0019J253k1786l6610L9086O7058N4533
24262F2334l1746o1378j9372L7723K9785J5305o0170j2451J8688j1827Q961n490
24250b9638J6132m2073n043J419J8113J1759j7283q192l7178k3658N3562j4010
$$ plain form
24238 -76090 -83200 -88236 -61172 -41460 -36988 2400 12145 2321 3354 -4007 -9305 10606 5840
24225 5840 23138 -2019 -30978 -65666 -58123 -49680 -42476 -21421 -589 -9951 -43797 -46589 -4721
24212 -4721 -23194 -35603 -19286 -29951 -31830 -51140 -105167 -82184 -56261 -53238 -36141 -12771
24200 -12771 -18964 -13543 146 -14816 -51898 -20133 6696 10486 -18588 -15635 -4505 13863
24188 13863 16308 12449 -14349 -66872 -91522 -62146 -55953 -75849 -61492 -35938 -9465 -9724 -10800
24175 -10800 11497 25227 15962 -4369 -7086 12405 25306 2748 -30728 -61616 -81478 -94740
24163 -94740 -55847 -57103 -63955 -54638 -63381 -55455 -19043 -47663 -34557 -22962 -65324 -81396 -80037
24150 -80037 -62638 -67949 -47083 -22665 -26979 -64428 -93639 -80159 -52084 -38665 -28001 -49630
$$ packed form
24238g6090p110n036K7064J9712M472L9388R745r824J033p361n298J9911m766
24225E840J7298k5157k8959l4688P543Q443P204K1055K0832r362l3846k792M1868
24212d721j8473j2409J6317j0665j879j9310n4027K2983K5923L023J7097K3370
24200a2771o193N421J3689j4962l7082L1765K6829L790k9074K953J1130J8368
24188A3863K445l859k6798n2523k4650K9376O193j9896J4357K5554K6473k59j076
24175a0800K2297J3730r265k0331k717J9491J2901k2558l3476l0888j9862j3262
24163i4740L8893j256o852R317q743P926L6412k8620J3106J1595m2362j6072J359
24150h0037J7399n311K0866K4418m314l7449k9211J3480K8075J3419J0664k1629
$$ plain form
24138 -49630 -20019 7726 31879 29182 -11316 2394 -10973 -21637 16513 22316 -36318 -59745
24126 -59745 -40151 -35308 -31766 -26023 -34942 -62562 -70667 -101065 -122814 -95484 -97239 -72557 -22916
24113 -22916 10103 -19676 -20778 -2684 -8881 -38075 -15761 -17094 -7392 5103 8425 -2887 38533
24100 38533 31103 38434 56787 42923 21800 9739 4773 -12960 -30180 -55451 -43516 -18818
24088 -18818 -8679 12714 11081 -4673 -32409 -60451 -60378 -70440 -62274 -35601 -20091 -25986 -54394
24075 -54394 -75812 -93862 -108502 -99759 -91951 -78577 -34591 -16766 -49415 -41870 -30541 2385
24063 2385 31978 22212 45398 46718 47936 46789 36208 31655 -7908 -22594 -41756 -53651 -36007
24050 -36007 -36012 -25697 -48412 -50559 -28845 -6466 7776 6113 12994 25937 -15071 -38920 -59840
$$ packed form
24138d9630K9611K7745K4153k697m0498J3710j3367j0664L8150N803n8634k3427
24126e9745J9594M843L542N743q919k7620q105l0398k1749K7330j755K4682M9641
24113b2916L3019k9779j102J8094o197k9194K2314j333R702J2495L322j1312M1420
24100C8533p430P331J8353j3864k1123j2061m966j7733j7220k5271J1935K4698
24088a8818J0139K1393j633j5754k7736k8042P3j0062Q166K6673J5510n895k8408
24075e4394k1418j8050j4640Q743P808J3374M3986J7825l2649P545J1329L2926
24063B385K9593r766K3186J320J218j147j0581m553l9563j4686j9162j1895J7644
24050c6007nJ0315k2715k147K1714K2379J4242j663O881J2943m1008k3849k0920
$$ plain form
24037 -59840 -44367 -67465 -80430 -39549 -24160 -7037 -12808 -27432 -48157 -86340 -109320 -43359
24025 -43359 -24328 -22292 -33969 -43638 -73282 -57870 -53284 -63432 -83640 -54387 -29655 -88448
24013 -88448 -98129 -70345 -60465 -37873 -23831 -45082 -53635 -57484 -57108 -74433 -71964 -62768 -69884
24000 -69884 -65503 -56535 -29781 -49894 -51551 -38557 -25632 -32122 -91313 -121379 -93176 -39187
23988 -39187 -39307 -77336 -109655 -115072 -90234 -49894 -24698 977 6690 -28917 -44810 -66209
23976 -66209 -37893 -17261 -10989 -20597 -34872 -33327 -25138 5935 16573 18764 -18594 -5635 -18661
23963 -18661 -32258 -14069 -51077 -32053 -27418 -68773 -74768 -41792 -15485 -32867 -32411 -36308 -26056
23950 -26056 20055 -5599 -42740 -50750 -42244 -44109 -73523 -74266 -36610 -15602 -41676 -45651 -26266
$$ packed form
24037e9840J5473k3098j2965M0881J5389J7123n771j4624k0725l8183k2980O5961
24025d3359J9031K036j1677r669k9644J5412M586j0148k0208K9253K4732n8793
24013h8448r681K7784R880K2592J4042k1251q553l849L76j7325K469R196p116
24000f9884M381Q968K6754k0113j657J2994J2925o490n9191l0066K8203N3989
23988c9187j20l8029l2319n417K4838M0340K5196K5675N713l5607j5893k1399
23976f6209K8316K0632O272r608j4275J545Q189L1073J0638K191l7358J2959j3026
23963a8661j3597J8189l7008J9024M635m1355n995L2976K6307j7382M56l897J0252
23950b6056M6111k5654l7141q010Q506j865k9414p43L7656K1008k6074l975J9385
$$ plain form
23937 -26266 -37646 -30546 -54329 -71729 -48648 -50309 -36238 -89227 -93313 -46994 -80052 -109096
23925 -109096 -79551 3102 38455 -7673 -54670 -46204 -26505 -49869 -62075 -109618 -135656 -93847
23913 -93847 -34271 -31980 -47348 -15709 16167 7842 -38928 -40476 -24261 -40840 -11988 -18459
23901 -18459 -58006 -91242 -82822 -47744 -41315 -42192 1513 -7477 -27333 4255 35151 470 -44742
23888 -44742 -56588 -66299 -16660 -4592 33428 69605 61486 40606 -20500 -39362 -32057 -38106
23876 -38106 -45163 -35310 -12636 -39545 -59104 -62863 -39797 -18119 1946 -2456 -35972 -27084 -25316
23863 -25316 -8430 -10331 21427 34700 30037 -3155 -34030 -46026 -44220 -17321 -8223 -35608
23851 -35608 -19237 -519 26049 68914 50631 32126 873 -21184 -56643 -16289 11872 15127
$$ packed form
23937b6266j1380P100k3783j7400K3081j661J4071n2989m086M6319l3058k9044
23925a09096K9545Q2653L5353m6128m6997Q466J9699k3364j2206m7543k6038M1809
23913i3847N9576K291j5368L1639L1876q325m6770j548J6215j6579K8852o471
23901a8459l9547l3236Q420L5078O429q77M3705q990j9856L1588L0896l4681m5212
23888d4742j1846r711M9639J2068L8020L6177q119k0880o1106j8862P305o049
23876c8106p057R853K2674k6909j9559l759K3066K1678K0065m402l3516Q888J768
23863b5316J6886j901L1758J3273m663l3192l0875j1996J806K6899R098k7385
23851c5608J6371J8718K6568M2865j8283j8505l1253k2057l5459M0354K8161L255
$$ plain form
23839 15127 -16307 -65167 -52859 -16097 -8014 1518 9399 -18822 -20721 -25748 544 6164 10582
23826 10582 21594 -9754 -40602 -39195 -20367 -152 762 -7857 15606 27764 31344 -2614 -31594
23813 -31594 -27194 364 19122 6757 -2014 640 41625 54775 46280 23877 20021 57682 58317
23800 58317 53476 38606 52107 37815 -8622 -47322 -32109 -575 28207 28125 -93 2019 -11500
23787 -11500 -39740 -48719 -59922 -45450 -49194 -61703 -55818 -45768 -9583 -8252 -30078 1941
23775 1941 595 -30497 -85887 -103001 -91971 -83487 -33612 30012 13357 -25139 -16515 -37792
23763 -37792 -47331 -40671 -60359 -41792 -26770 -19990 -39318 -57944 -72741 -64028 -53114 -39691
23751 -39691 -93959 -112431 -93334 -77159 -30788 39051 86023 95157 75473 29547 26867 47471
$$ packed form
23839A5127l1434m8860J2308L6762Q083R532P881k8221j899n027K6292N620M418
23826A0582J1012l1348l0848J407J8828K0215R14q619K3463J2158L580l3958k8980
23813c1594M400K7558J8758j2365q771K654M0985J3150q495k2403l856L7661O35
23800E8317m841j4870J3501j4292m6437l8700J5213L1534K8782q2k8218K112j3519
23787a1500k8240q979j1203J4472l744j2509N885J0050L6185J331k1826L2019
23775A941j346l1092n5390j7114J1030Q484M9875O3624j6655l8496Q624k1277
23763c7792r539O660j9688J8567J5022O780j9328j8626j4797Q713J0914J3423
23751c9691n4268j8472J9097J6175M6371O9839M6972R134j9684m5926k680K0604
$$ plain form
23739 47471 23494 23380 21868 -6059 -14633 -11218 3081 -6417 -24429 -57579 -95288 -57823 -8913
23726 -8913 -1140 11346 -40328 -82993 -36076 -25520 -69853 -105250 -90662 -80264 -57716 -46430
23714 -46430 -20536 -24516 24719 25678 -27837 -56185 -56260 -40444 -23700 -29415 -49441 1176 21996
23701 21996 12399 -44573 -74523 -68573 -35473 -6433 -62360 -110034 -91104 -86940 -67438 -16005
23689 -16005 -10069 -11260 -12528 -43114 -24409 -38275 -76730 -62913 -51456 -46022 -38486 -13404 11205
23676 11205 19102 32003 66455 58473 20128 -4582 -47046 -78174 -51803 580 31282 4015
23664 4015 -51777 -34318 -4754 -38734 -62444 -43111 -49193 -33215 -23934 -1540 16626 29528
23652 29528 86 -52317 -52020 -52727 -94008 -107251 -94047 -53967 -43335 -16300 14144 -24912
$$ packed form
23739D7471k3977j14j512k7927q574L415J4299r498j8012l3150l7709L7465M8910
23726h913P773J2486n1674m2665M6917J0556m4333l5397J4588J0398K2548J1286
23714d6430K5894l980M9235R59n3515k8348p5J5816J6744n715k0026N0617K0820
23701B1996r597n6972k9950N950L3100K9040n5927m7674J8930M164J9502N1433
23689a6005N936j191j268l0586J8705j3866l8455J3817J1457N434P536K5082K4609
23676A1205P897J2901L4452p982l8345k4710m2464l1128K6371N2383L0702k7267
23664D015n5792J7459K9564l3980k3710J9333o082J5978R281K2394J8166J2902
23652B9528k9442n2403K97p07m1281j3243J3204M0080J0632K7035L0444l9056
$$ plain form
23640 -24912 -49934 -10902 56418 56537 -2737 -72966 -112953 -87887 -39512 -26946 -34516 6063
23628 6063 -2952 -28942 -46417 -45739 -32089 -31291 -21729 -41357 -48608 -14765 -34547 -33018 -25623 -29056
23614 -29056 -19451 -31661 -28143 -6950 -28333 -39757 -65962 -61667 -43439 11631 53943 59883
23602 59883 67091 30480 5850 35390 72310 53185 26590 -834 -17273 -3989 -7852 11752
23590 11752 -10935 -3751 -45976 -53817 -48491 -21514 -20437 16654 43459 4740 -26135 7017
23578 7017 749 -24088 -27401 -55383 -39688 -42203 -46895 -40122 -42468 -29058 -17372 31515 27627
23565 27627 72546 111956 110657 47152 18956 -43031 -108232 -91991 -42882 -38688 -26255 -13592
23553 -13592 12312 -5835 3814 -8167 -31481 -29025 -41313 -16564 -18043 -70160 -97980 -75692
$$ packed form
23640b4912k5022L9032O7320J19n9274p0229l9987K5066M8375J2566p570M0579
23628F063r015k5990j7475O78J3650P98R562j9628p251L3843j9782J529P395l433
23614b9056R605j2210L518K1193k1383j1424k6205M295J8228N5070M2312N940
23602E9883P208l6611k4630K9540L6920j9125k6595k7424j6439J3284l863J9604
23590A1752k2687P184m2225p841N326K6977J077L7091K6805l8719l0875L3152
23578G017o268k4837l313k7982J5695k515m692O773k346J3410J1686M8887l888
23565B7627M4919L9410j299o3505k8196o1987o5201J6241M9109M194J2433J2663
23553a3592K5904j8147R649j1981k3314K456j2288K4749j479n2117k7820K2288
$$ plain form
23541 -75692 -55402 -47465 -31116 -35116 -54537 -40698 -48785 -43291 -50826 -33390 -4098 -43798 -87700
23528 -87700 -82729 -45408 -19955 -15603 -17924 -2781 -50257 -81874 -50669 -14769 -5011 -6291 7689
23515 7689 -25172 -44144 -28108 8077 36069 23517 -9534 -38010 -31677 -41062 -53233 -42234
23503 -42234 -39943 -18700 -27533 -45764 -61239 -36929 -18023 -8733 -8548 30132 55411 55337 -8095
23490 -8095 -69498 -108236 -88443 -103554 -70353 -70280 -48230 -86272 -58182 -63472 -52731 -33687 -26809
23477 -26809 -43078 -80114 -79223 -60258 -40965 -9898 11369 32939 8946 -13648 -26961 -30513
23465 -30513 -23783 -26719 -30444 -66631 -49359 -29808 -22536 -15275 -30220 -25373 -18617 -16505 -2173
23452 -2173 15061 8133 -46792 -64665 -36266 -25915 -49326 -55589 -36245 -54755 -52170 -29624
$$ packed form
23541g5692K0290P937J6349m000j9421J3839q087N494p535J7436K9292l9700m3902
23528h7700M971L7321K5453M352k321J5143m7476l1617L1205L5900R758j280J3980
23515G689l2861j8972J6036L6185K7992j2552l3051k8476O333r385j2171J0999
23503d2234K291K1243q833j8231j5475K4310J8906R290J85L8680K5279p4o3432
23490h095o1403l8738J9793j5111L3201P3K2050l8042K8090n290J0741J9044O878
23477b6809j6269l7036Q91J8965J9293L1067K1267K1570k3993k2594j3313l552
23465c0513O730k936l725l6187J7272J9551P272P261j4945M847O756K112J4332
23452b173J7234o928n4925j7873K8399J0351k3411o263J9344j8510K585K2546
$$ plain form
23440 -29624 2418 26708 16034 -32446 -50857 -6687 -10713 -31455 2080 17013 -21328 -11518
23428 -11518 -13487 -11290 -47667 -40736 -24170 23349 18537 2664 -27121 -55219 -31338 -15525
23416 -15525 -3940 -35147 -78753 -74936 -55161 -41631 -21674 -20845 -38583 -41557 -18218 -4779
23404 -4779 -15583 -59277 -62141 -26519 4462 15239 2355 -32256 -15883 10501 23795 -13896
23392 -13896 -30281 -24636 -30735 -33627 -43340 -25549 3206 10054 -32009 -23173 -19410 -31453 -39331
23379 -39331 -14919 11135 15156 18385 29461 12512 -2243 21423 16297 17862 -2163 -55281
23367 -55281 -49913 -75269 -73795 -18912 14264 28958 10855 -15922 -23627 -25924 -24577 3337 -3083
23354 -3083 -4307 -11697 -7038 4087 -39286 -68649 -38907 -39017 7168 19862 8036 4154 -17683
$$ packed form
23440b9624L2042K4290j0674m8480j8411M4170m026k0742L3535J4933l8341R810
23428a1518j969K197l6377O931J6566M7519m812j5873k9785k8098K3881J5813
23416a5525J1585l1207m3606L817J9775J3530J9957Q29j7738k974K3339J3439
23404d779j0804m3694k864L5622L0981J0777j2884l4611J6373K6384J3294l7691
23392a3896j6385N645o099k892r713J7791K8755O848m2063Q836L763j2043p878
23379c9331K4412K6054M021L229J1076j6949j4755K3666n126J565k0025n3118
23367e5281N368k5356J474N4883L3176J4694j8103k6777p705k297J347K7914o420
23354c083j224p390M659J1125m3373k9363K9742j10M6185J2694j1826l882k1837
$$ plain form
23341 -17683 6853 45435 11987 -13400 -12541 17268 -19708 -33744 11899 -2717 -48303 -38805
23329 -38805 -1658 1937 -10853 -39606 -21455 -34195 -59203 -17489 -45766 -43725 -31031 -32419
23317 -32419 -74948 -73386 -19379 -10564 7113 -1193 -16683 -17849 -13979 -28042 -17872 -49617 -46144
23304 -46144 -51155 -68737 -77990 -50719 -27358 -9082 -22969 -35856 -68339 -86445 -56405 -57627
23292 -57627 -63188 -45220 -15836 -30063 -45282 -18435 -18480 -32002 -35048 -24470 16606 30977 4406
23279 4406 27246 45973 35621 17297 8287 -18344 -26992 -8099 -11019 -707 -10559 -47042 -82065
23266 -82065 -69815 -53071 1747 33555 27752 25570 851 -29368 -62184 -94969 -89805 -19225
23254 -19225 -14341 -35288 11014 56482 72663 43450 -631 -9375 13224 30495 40879 37774
$$ packed form
23341a7683K4536L8582l3448k5387Q59K9809l6976j4036M5643j4616m5586R498
23329c8805L7147L595j2790k8753J8151j2740k5008M1714k8277K041J2694j388
23317c2419m2529J562N4007Q815J7677q306j5490j166L870j4063J0170l1745L473
23304d6144n011j7582r253K7271K3361J8276j3887j2887l2483j8106L0040j222
23292e7627n561J7968K9384j4227j5219K6847m5j3522l046J0578M1076J4371k6571
23279D406K2840J8727j0352j8324r010k6631q648J8893k920J0312r852l6483l5023
23266h2065J2250J6744N4818L1808n803k182k4719l0219l2816l2785N164P0580
23254a9225M884k0947M6302M5468J6181k9213m4081q744K2599J7271J0384l105
$$ plain form
23242 37774 9399 -13663 -9784 17290 262 1040 9549 -575 -14664 -9090 -9402 1086 5185
23229 5185 -36816 -47534 -18116 -30216 -48171 -21964 41427 40295 62770 54414 -3930 -25224
23217 -25224 4014 1191 26980 50457 57598 77958 82355 80311 65190 48290 63972 93424
23205 93424 55365 14775 4600 30304 32777 -7429 -45234 -81372 -94778 -76048 -35033 6425
23193 6425 15177 41201 31091 16213 25500 10135 -9500 -19080 -15116 761 21636 20756 17664
23180 17664 18065 9951 -13463 -50241 -33929 -4975 624 5036 -28141 -16260 17472 6595 8366
23167 8366 7202 23020 21169 -20345 -43160 -29484 -39592 -26140 -6299 4888 34976 31230
23155 31230 15596 -2341 -490 -886 -17576 -30303 -25339 -43936 -27903 -757 -1509 19544 28703
$$ packed form
23242C7774k8375k3062L879K7074j7028P78Q509j0124j4089N574l12J0488M099
23229E185m2001j0718K9418j2100j7955K6207O3391j132K2475q356n8344k1294
23217b5224K9238k823K5789K3477P141K0360M397k044j5121j6900J5682K9452
23205I3424l8059m0590j0175K5704K473m0206l7805l6138j3406J8730M1015M1458
23193F425Q752K6024j0110j4878R287j5365j9635r580L964J5877K0875q80l092
23180A7664M01q114k3414l6778J6312K8954N599M412l3177J1881L3732j0877J771
23167H366j164J5818j851m1514k2815J3676j0108J3452J9841J1187L0088l746
23155C1230j5634j7937J851l96j6690j2727M964j8597J6033K7146p52K1053R159
$$ plain form
23142 28703 51940 -5988 -27837 -19767 -32902 -37605 -30914 -16514 19350 10657 9485 11977 14274
23129 14274 -2799 18935 7685 -1998 -14648 -30668 -36791 -33964 -37669 10382 8657 -2299 7570
23116 7570 -7975 -9125 -24039 -38602 -23946 -20921 9988 -3935 -11834 21906 66526 32170
23104 32170 -32887 -36916 -65638 -92439 -87451 -36795 -5489 -7731 -50478 -75724 -57142 -50598
23092 -50598 -35657 -56315 -82348 -82132 -60627 -50875 -51885 -64986 -65620 -105017 -56466 1615 26823
23079 26823 5230 1660 -4348 -17299 -17523 -11310 -18605 -3462 14858 12548 -2057 -16110 -39975
23066 -39975 8606 25365 65929 55955 22174 29844 31719 15610 2580 21998 1803 -41782
23054 -41782 -41260 -29894 -38454 -51339 -61643 -17577 -19556 -37434 -53893 -25057 -40899 -25710
$$ packed form
23142B8703K3237n7928k1849Q070j3135m703O691J4400L5864q693j172K492K297
23129A4274j7073K1734j1250r683j2650j6020o123K827l705M8051j725j0956R869
23116G570j5545j150j4914j4563J4656L025L0909j3923p899L3740M4620l4356
23104C2170o5057m029k8722k6801M988N0656L1306k242m2747k5246J8582O544
23092e0598J4941k0658k6033K16K1505R752j010j3101o34l9397M8551N8081K5208
23079B6823k1593l570o008j2951k24O213p295J5143J8320k310j4605j4053k3865
23066c9975M8581J6759M0564r974l3781P670J875j6109j3030J9418k0195m3585
23054d1782N22J1366q560j2885j0304M4066j979j7878j6459K8836j5842J5189
$$ plain form
23042 -25710 -17718 -36899 -39061 -38916 -67490 -68771 -56245 -55484 -68328 -78105 -39519 -63130 -64242
23029 -64242 -11082 11821 16974 3069 -16740 -24637 -22502 -5085 5139 37074 4570 8497
23017 8497 -13603 -52135 -76895 -69246 -32574 -31721 -60023 -36328 -40596 -42076 -35884 -48054 -47707
23004 -47707 -76617 -92918 -77838 -25425 -12891 14261 17368 -968 -52023 -108184 -116998 -116237
22992 -116237 -102251 -60783 -32245 -49545 -58787 -44393 -13469 6263 -38757 -86992 -43847 -6889
22980 -6889 -16148 -11751 -12867 -6989 -14787 -29058 -48939 -36180 -17677 -15748 -2943 47386 88498
22967 88498 55449 -8591 -28608 -25644 -44046 -10349 -23032 -37453 -27517 -659 25326 27056
22955 27056 -20309 -53898 -66420 -52126 -60982 -26106 9750 -26388 -42265 -53169 -35133 -15819
$$ packed form
23042b5710P992j9181k162J45k8574j281J2526P61j2844r777L8586k3611j112
23029f4242N3160K2903N153j3905j9809p897K135J7417J0224L1935l2504L927
23017H497k2100l8532k4760P649L6672Q53k8302K3695m268j480O192j2170L47
23004d7707k8910j6301J5080N2413J2534K7152L107j8336n1055n6161q814P61
22992a16237J3986M1468K8538j7300r242J4394L0924J9732m5020m8235M3145L6958
22980f889r259M397j116N878p798j4271j9881J2759J8503J929J2805N0329M1112
22967H8498l3049o4040k0017K964j8402L3697j2683j4421R936K6858K5985J730
22955B7056m7365l3589j2522J4294q856L4876L5856l6138j5877j0904J8036J9314
$$ plain form
22943 -15819 -62087 -69319 -23345 -34466 -69179 -72203 -43674 -44560 -62747 -67795 -65552 -48213 -47025
22930 -47025 -60127 -66390 -40547 -64559 -101571 -86939 -88565 -53858 -32496 -38273 -76954 -63871
22918 -63871 -46071 -40424 -54474 -14839 21544 -12238 -29318 7477 -12068 -8273 -19323 -25985
22906 -25985 -32567 -11139 -2862 -7681 -12506 -662 31781 -26458 -65403 -50526 -49867 -43991 -24155
22893 -24155 29917 18943 -12516 -20390 -18992 -62733 -66413 -87700 -66918 -65796 -66558 -48943 -37818
22880 -37818 -30001 -6928 -15514 -29022 -36064 -33525 -48535 -38106 -35320 -29612 -22513 -3576 3907
22867 3907 -7600 -63016 -57617 -27609 21760 14661 13732 16145 -7760 3744 11575 -25973 -56904
22854 -56904 -36585 -26541 -44010 -37132 -31862 -66887 -96900 -109483 -87697 -35865 -14854 -28490
$$ packed form
22943a5819m6268p232M5974j1121l4713l024K8529q86j8187n048K243J7339J188
22930d7025j3102o263K5843k4012l7012J4632j626L4707K1362n777l8681J3083
22918f3871J7800N647j4050L9635L6383l3782j7080L6795j9545L795j1050o662
22906b5985o582K1428Q277m819m825J1844L2443n8239l8945J4877O59N876J9836
22893b4155N4072j0974l1459p874J398m3741l680k1287K0782J122p62J7615J1125
22880c7818P817K3073q586j3508p042K539j5010J0429K786N708P099J8937P483
22867C907j1507n5416N399L0008M9369p099r29K413k3905J1504P831l7548l0931
22854e6904K0319J0044j7469O878N270l5025l0013j2583K1786N1832K1011j3636
$$ plain form
22842 -28490 -21616 -18778 -9552 19311 17918 -798 20354 13229 23023 -17106 -85159 -106735 -96535
22829 -96535 -87844 -30412 -31822 -43508 -37423 -90252 -127287 -100375 -94723 -66896 -82940 -60684
22817 -60684 -57875 -69022 -1663 -94 -19074 -39545 -72512 -86248 -48153 -55173 -54537 -50917 -76441
22804 -76441 -64293 -31500 -19473 -34739 -43192 -13238 -4830 3933 -17178 -40773 -70322 -65800
22792 -65800 -26460 -18413 -2499 -4906 -37000 -14923 7592 36504 28870 -10652 -16405 -13032 13713
22779 13713 25564 -19063 -65475 -79961 -57561 -38763 -40833 -44205 -13857 -6589 -11690 -6706 -27831
22766 -27831 -26241 -22065 -13005 -59981 -48853 -9914 2161 -6766 -49630 -57569 -2636 11687 8519
22753 8519 -20051 -37950 -59018 -49396 -38402 -72958 -103492 -40859 -11029 -32868 -40812 -22858
$$ packed form
22842b8490O874K838R226K8863j393j8716K1152p125R794m0129o8053k1576J0200
22829i6535Q691N7432j410j1686O085n2829l7035K6912N652K7827j6044K2256
22817f0684K809j1147O7359J569j8980k0471l2967j3736L8095p020O36L620k5524
22804g6441J2148L2793J2027j5266q453K9954Q408Q763k1111k3595k9549M522
22792f5800L9340Q047J5914k407l2094K2077K2515K8912p634l9522n753L373K6745
22779A3713J1851m4627m6412j4486K2400J8798k070l372L0348P268n101M984k1125
22766b7831J590M176R060m6976J1128L8939J2075q927m2864p939N4933J4323l168
22753H519k8570j7899k1068R622J0994l4556l0534O2633K9830k1839p944J7954
$$ plain form
22741 -22858 35252 50487 35541 11095 7273 15654 -6627 -38842 -43874 -53026 -24042 -990
22729 -990 7691 30102 16327 11737 -18756 14951 63440 76222 59350 34529 28143 3356 -24937
22716 -24937 -41058 -49861 -29382 -3261 9698 -6525 -25083 -28146 -13916 -33651 -28347 -7772
22704 -7772 22771 35460 -6151 -664 -14945 -12922 -29419 -42824 -66903 -54339 -21043 -24368
22692 -24368 -29707 -11831 13441 24553 33699 24684 26165 -13585 -30735 -25444 -66394 -86210 -52926
22679 -52926 -14299 15799 22273 -4239 -5232 -2952 -34742 -57144 -19677 -10495 -33229 -30683 -25505
22666 -25505 -4857 6566 -20464 6244 -23105 -23322 -15281 -38340 -37961 -51097 -90259 -87664 -89472
22653 -89472 -104530 -89433 -42694 -34580 -5275 -30789 333 -13166 -20384 4723 7702 -10493
$$ packed form
22741b2858N8110J5235j4946k4446l822Q381k2281l2215n032r152K8984K3052
22729i90Q681K2411j3775m590l0493L3707M8489J2782j6872k4821o386k4787k8293
22716b4937j6121q803K0479K6121J2959j6223j8558l063J4230j9735N304K0575
22704g772L0543J2689m1611N487j4281K023j6497j3405k4079J2564L3296l325
22692b4368n339J7876K5272J1112R146r015J481l9750j7150N291m0950j9816L3284
22679e2926L8627L0098O474k6512r93K280l1790k2402L7467R182k2734K546N178
22666b5505K0648J1423k7030K6708k9349k17Q041k3059L79j3136l9162K595j808
22653h9472j5058J5097M6739Q114K9305k5514L1122j3499p218K5107K979j8195
$$ plain form
22641 -10493 26857 44532 28253 16105 22103 17821 34511 67431 90946 94975 48380 -1440
22629 -1440 -10783 29179 63417 50571 10870 -8721 -22664 -23957 1621 3876 -47099 -64600
22617 -64600 -62728 11161 43910 35683 18348 17905 10163 -4434 -18104 -3158 37779 56500 76422
22604 76422 38333 12467 13347 35672 30438 29755 37631 12198 18316 42780 66260 83864 79030
22591 79030 73196 78254 93281 121300 103881 76880 38832 14716 14690 1960 -32852 -36656 -24408
22578 -24408 -19480 -23049 -20460 7757 -13852 -41594 -51129 -12195 1697 166 14437 28198 28701
22565 28701 34108 9306 17442 21139 8621 -44054 -29773 -3817 34894 42916 30409 10557
22553 10557 32097 40980 52891 77033 57328 47689 41017 31611 -7432 -17718 -38391 -40933 -7452
$$ packed form
22641a0493L7350J7675j6279j2148N998m282J6690L2920K3515M029m6595m9820
22629a440r343L9962L4238j2846l9701j9591j3943j293K5578K255n0975j7501
22617f4600J872P3889L2749q227j7335m43p742j4597j3670J4946M0937J8721J9922
22604G6422l8089k5866Q80K2325n234o83P876k5433O118K4464K3480J7604m834
22591G9030n834N058J5027K8019j7419k7001l8048k4116k6j2730l4812l804J2248
22578b4408M928l569K589K8217k1609k7742r535L8934J3892j531J4271J3761N03
22565B8701N407k4802Q136L697j2518n2675J4281K5956L8711Q022j2507j9852
22553A0557K1540Q883J1911K4142j9705r639o672r406l9043j0286k0673k542L3481
$$ plain form
22540 -7452 8251 4976 -24336 -12774 16751 27558 2726 31587 77396 36807 24350 1174
22528 1174 -39194 -36476 -15565 33775 54552 14878 7941 52335 80563 95644 83887 51068
22516 51068 21347 13847 8056 15897 30180 -8373 -13529 -15546 -27206 -19646 12261 11283 -17090
22503 -17090 28190 51371 51621 -2451 -65876 -116121 -129237 -124556 -90303 -50861 -41416 -47196 -41063
22490 -41063 -6316 61295 32808 -21042 -32752 -26517 -12033 25539 49121 67255 85663 58528
22478 58528 58868 80705 60494 61142 52334 9353 -24093 -70420 -104992 -52874 -110 15217 24194
22465 24194 41063 24381 -13360 -48560 -40770 -16581 535 30685 15075 27316 20643 -11050
22453 -11050 -8047 -12971 -31078 -35293 -31128 -15591 -40105 -78472 -89842 -74714 -52306 -38662
$$ packed form
22540g452J5703l275k9312J1562K9525J0807k4832K8861M5809m0589j2457k3176
22528A174m0368K718K0911M9340K0777l9674o937M4394K8228J5081j1757l2819
22516E1068k9721p500n791P841J4283l8553n156k017j1660P560L1907r78k8373
22503a7090M5280K3181K50n4072o3425n0245j3116M681L4253L9442R445n780O133
22490d1063L4747O7611k8487n3850j1710O235J4484L7572K3582J8134J8408k7135
22478E8528L40K1837k0211O48q808m2981l3446m6327l4572N2118N2764J5327Q977
22465B4194J6869j6682l7741l5200P790K4189J7116L0150j5610J2241o673l1693
22453a1050L003m924j8107m215M165J5537k4514l8367j1370J5128K2408J3644
$$ plain form
22441 -38662 -7687 -36129 -36088 -9148 -10546 -26324 -10862 2983 5838 19260 33988 3307 -13683
22428 -13683 -1601 -4684 -16917 -33931 -49073 -27743 -6258 13893 15302 -4611 13709 27493
22416 27493 24645 38935 28610 37769 30510 10214 16431 60133 81664 58697 24943 54614
22404 54614 70839 42872 25725 -21880 -40052 -1087 6911 16822 -9228 -38056 -1853 18746
22392 18746 54570 63879 108151 78456 77128 64257 29318 43480 57966 38177 26270 33837
22380 33837 44774 31633 -4052 -17427 -19597 19150 -7197 -19636 14346 3349 -45272 -41120
22368 -41120 -10466 4880 70310 85556 43438 30741 645 -36171 -26972 -17654 -15747 -40913
22356 -40913 -20184 28811 53934 40753 -18189 -24471 8544 31161 -21737 -44189 -15240 -9219
$$ packed form
22441c8662L0975k8442M1K6940j398j5778J5462J3845K855J3422J4728l0681j6990
22428a3683J2082l083j2233j7014j5142K1330K1485K0151J409j9913J8320J3784
22416B7493k848J4290j0325R159p259k0296O217M3702K1531k2967l3754K9671
22404E4614J6225k7967j7147m7605j8172L8965P998R911k6050k8828L6203K0599
22392A8746L5824R309M4272k9695j328j2871l4939J4162J4486j9789j1907P567
22380C3837J0937j3141l5685j3375k170L8747k6347j2439L3982j0997m8621M152
22368d1120L0654J5346O5430J5246m2118j2697l0096l6816R199R318J907k5166
22356d0913K0729M8995K5123j3181n8942o282L3015K2617n2898k2452K8949O021
$$ plain form
22344 -9219 14727 40876 35412 7468 6099 -19956 22563 36762 10038 28365 33165 46695
22332 46695 48418 51923 50580 30633 27363 21376 -13351 -6234 -10765 31870 46082 53525 16000
22319 16000 -4968 17458 15855 -19057 -22548 -14694 579 -2820 -10766 -43778 -18318 28372 43822
22306 43822 56766 53868 3714 -11335 -28901 -16901 33890 43788 39127 25941 -2274 53173
22294 53173 21081 12868 17031 -3352 -25093 -3343 18754 11601 -27977 -10140 -10450 7807 19638
22281 19638 14798 -5380 -33798 3600 -1020 -24921 -49631 -19084 17649 24575 29635 9175
22269 9175 -8109 -41601 -47338 -5477 27082 47824 76526 86827 57983 40968 46005 46796 8376
22256 8376 -30489 -32804 7521 22499 -374 -5036 9912 39200 21810 -5847 -16582 -29857
$$ packed form
22344i219K3946K6149n464k7944j369k6055M2519J4199k6724J8327M800J3530
22332D6695J723L505j343j9947l270n987l4727P117m531M2635J4212P443l7525
22319A6000k0968K2426j603l4912l491P854J5273l399p946l3012K5460M6690J5450
22306D3822J2944k898n0154j5049j7566J2000N0791R898m661j3186k8215N5447
22294E3173l2092q213M163k0383k1741K1750K2097p153l9578J7837l10J8257J1831
22281A9638m840k0178k8418L7398m620k3901k4710L0547L6733O926N060k0460
22269I175j7284l3492n737M1861L2559K0742K8702J0301k8844j7015N037P91l8420
22256H376l8865k315M0325J4978k2873m662J4948K9288j7390k7657j0735j3275
$$ plain form
22244 -29857 -22847 -30038 23664 33566 15606 44105 79411 87095 50595 27461 24686 9061 -5478
22231 -5478 18253 4062 32764 86658 69889 20765 -10696 23648 61850 20790 -18548 -8074
22219 -8074 -11224 22307 2963 21186 22947 39956 69568 54808 37227 -18424 18641 50033
22207 50033 39753 32708 17606 36262 18965 12329 15624 32807 60051 32324 -7999 -67887
22195 -67887 -59790 -17878 -21857 -14916 41724 58142 13200 -13522 -17439 15121 40492 47161 52387
22182 52387 63418 40942 44295 55214 68276 74640 33221 13245 55007 79391 -4575 -65308
22170 -65308 -62665 -44062 -8797 -39204 -24559 4148 64446 108269 64262 20088 30125 67923
22158 67923 72623 69375 56783 60920 61988 58349 91397 121994 132904 116580 104077 67783 60287
$$ packed form
22244b9857P010p191N3702R902j7960K8499L5306P684l6500k3134k775j5625j4539
22231e478K3731j4191K8702N3894j6769m9124l1461L4344L8202m1060l9338J0474
22219h074l150L3531j9344J8223J761J7009K9612j4760j7581n5651L7065L1392
22207E0033j0280p045j5102J8656j7297o636L295J7183K7244k7727m0323n9888
22195f7887Q097M1912l979O941N6640J6418m4942k6722l917L2560K5371O669N226
22182E2387J1031k2476L353J0919J3062O364m1419j9976M1762K4384q3966o0733
22170f5308K643J8603L5265l0407J4645K8707O0298M3823m4007m4174J0037L7798
22158F7923M700l248j2592M137J068l639L3048L0597J0910j6324j2503l6294p496
$$ plain form
22145 60287 49145 49356 23538 -10302 -26713 -10877 34876 48250 42696 47127 12662 29644
22133 29644 35004 36626 3633 -8900 -45951 -17120 4450 19809 54956 46283 1976 -11666
22121 -11666 -5636 2174 -24876 -56229 -28042 35226 40213 24863 19007 4065 -27990 -32152 -3071
22108 -3071 30333 49319 -3151 -11488 56913 70569 51533 84285 132223 119015 59758 22745
22096 22745 -3734 21741 34654 46854 72932 60142 39382 52120 76539 100546 97641 71942
22084 71942 63414 59221 59782 46309 10713 25397 4574 -99 62402 77574 78026 103812 97439
22071 97439 120534 134361 80853 35935 -18264 -52431 9236 20708 -17585 -11604 32038 56226
22059 56226 59617 41890 23565 54334 75823 66276 47404 41596 9273 22908 79505 70192
$$ packed form
22145F0287j1142K11k5818l3840j6411J5836M5753J3374n554M431l4465J6982
22133B9644N360J622l2993j2533l7051K8831K1570J5359L5147q673m4307j3642
22121a1666O030P810k7050l1353K8187O3268M987j5350n856j4942l2055m162K9081
22108c071L3404J8986n2470q337O8401J3656j9036L2752M7938j3208n9257l7013
22096B2745k6479K5475J2913J2200K6078j2790k0760J2738K4419K4007k905k5699
22084G1942q528m193N61j3473l5596J4684k0823m673O2501J5172M52K5786o373
22071I7439K3095J3827n3508m4918n4199l4167O1667J1472l8293N981M3642K4188
22059E6226L391j7727j8325L0769K1489r547j8872n808l2323J3635N6597r313
$$ plain form
22047 70192 59958 64010 29336 -10453 30596 28947 38643 69277 116959 159373 143185 118684
22035 118684 69555 26279 31644 81222 108944 77934 30713 -40500 -20174 70160 82711 88351
22023 88351 35121 21127 25126 31596 49324 68235 90109 82659 77784 26012 28838 34848 67771
22010 67771 80438 39951 24689 17475 19798 45728 19335 -1235 9453 9289 33899 19225
21998 19225 15130 12301 60500 55153 51174 68245 71422 54609 31306 57057 80931 62748 64602
21985 64602 64770 65889 58198 61036 70522 87126 106510 113814 92978 27021 8906 -237 10712
21972 10712 31310 35978 63409 57299 55046 93193 72285 41471 57823 84279 75446 80591 33989
21959 33989 15720 25158 25225 44663 39432 14286 33849 62159 99231 81275 66780 49174 76593
$$ packed form
22047G0192j0234M052l4674l9789M1049j649R696L0634M7682M2414j6188k4501
22035A18684m9129m3276N365M9578K7722l1010m7221p1213K0326R0334J2551N640
22023H8351n3230j3994L999O470J7728J8911K1874p450m875n1772K826O010L2923
22010F7771J2667m0487j5262p214K323K5930k6393k0570J0688j64K4610j4674
21998A9225m095k829M8199n347l979J7071L177j6813k3303K5751K3874j8183J854
21985F4602J68J119p691K838R486J6604J9384P304k0836o5957j8115r143J0949
21972A0712K0598M668K7431o110k253L8147k0908l0814J6352K6456q833N145m6602
21959C3989j8269R438O7J9438n231k5146J9563K8310L7072j7956j4495j7606K7419
$$ plain form
21946 76593 59651 52020 30577 31609 46590 62167 73975 60636 49643 24276 42844 52658
21934 52658 22952 71471 74165 30712 22853 30581 30146 34916 23484 19154 52219 52504 28545
21921 28545 53602 47521 28124 27976 32591 34360 45483 48740 23944 43389 44178 14093 10991
21908 10991 12991 38185 71720 34491 10509 -10197 -7479 57479 97536 86226 62847 53522
21896 53522 72004 68917 35895 15558 39017 55466 67022 61077 31208 2744 -4395 -8256
21884 -8256 -18352 8168 37345 60100 50442 58641 117893 113608 91739 112454 88440 78810 70527
21871 70527 70382 71801 71270 72339 67375 47215 29671 39044 38890 71705 77267 58044 70907 83907
21857 83907 76879 60628 59191 13360 19278 72443 51244 22905 22849 75051 72791 58621 41501
$$ packed form
21946G6593j6942p631k1443J032J4981J5577J1808j3339j0993k5367J8568R814
21934E2658k9706M8519K694m3453p859P728m35M770j1432m330L3065K85k3959
21921B8545K5057o081j9397j48M615J769J1123L257k4796J9445P89l0085l102
21908A0991K000K5194L3535l7229k3982k0706K718O4958M0057j1310k3379r325
21896E3522J8482l087l3022k0337K3459J6449J1556n945k9869k8464p139l861
21884h256j0096K6520K9177K2755r658Q199N9252m285k1869K0715k4014r630q283
21871G0527j45J419n31J069m964k0160j7544R373j54L2815N562j9223J2863J3000
21857H3907p028j6251j437m5831N918N3165k1199k8339n6N2202k260j4170j7120
$$ plain form
21844 41501 30840 24426 27328 13333 67775 88848 112397 87974 95819 86287 76790 26026 -9566
21831 -9566 16649 89886 71270 55610 79572 63365 52439 76511 82812 69744 78578 72649
21819 72649 52985 12544 278 -38094 -10238 4112 4417 8732 87 18178 36839 67967
21807 67967 104992 104251 85150 57313 -9701 -49353 -38286 11873 40520 50442 61511 51347
21795 51347 44709 43307 60238 80283 91998 82107 23361 11949 72260 82648 83341 73623 45973
21782 45973 39475 17485 28647 37745 55892 63412 53551 50610 64231 41230 12322 -2742 -9584
21769 -9584 -3634 20876 14680 54922 76470 67335 69472 63772 33074 16439 60230 81794 96026
21756 96026 121022 104329 89356 128554 95009 56891 43972 54162 116249 85852 4918 -34795
$$ packed form
21844D1501j0661o414K902j3995N4442K1073K3549k4423P845r532r497n0764l5592
21831i566K6215P3237j8616j5660K3962j6207j0926K4072O301j3068Q834n929
21819G2649j9664m0441j2266l8372K7856J4350L05M315q645J8091J8661L1128
21807F7967L7025p41j9101k7837o7014l9652J1067N0159K8647R922J1069j0164
21795E1347o638j402J6931K0045J1715r891n8746j1412O0311J0388O93r718k7650
21782D5973o498k1990J1162R098J8147P520r861k941J3621k3001k8908j5064o842
21769i584N950K4510o196M0242K1548r135K137n700l0698j6635M3791K1564J4232
21756I6026K4996j6693j4973L9198l3545l8118j2919J0190O2087l0397q0934l9713
$$ plain form
21744 -34795 -8185 52909 59638 39085 33278 56610 90700 89842 27633 33413 73881 53173 26961
21731 26961 23011 38416 28362 23800 24217 33146 23291 18564 57253 59712 29596 33151 57956
21718 57956 62832 60175 66775 82584 57668 33263 52121 39600 20235 29897 58023 80551
21706 80551 22852 -29203 -25510 1214 33711 48079 71086 52154 29733 420 23124 75210
21694 75210 117290 110768 89327 41770 -41446 -29462 -18008 -3670 -14573 -40002 -22077 17620
21682 17620 -11184 16925 65211 77170 62938 61301 52700 62658 133662 160735 112725 77470
21670 77470 39586 13406 23052 49151 55067 38793 22672 19576 26355 26346 43653 52636 38529
21657 38529 32401 10711 -908 12868 89518 109784 78004 67741 52944 55465 83864 72942
$$ packed form
21744c4795K6610O1094O729k0553n807K3332L4090q58o2209N780M0468k0708k6212
21731B6961l950J5405j0054m562M17Q929r855m727L8689K459l0116L555K4805
21718E7956M876k657O600J5809k4916k4405J8858j2521j9365R662K8126K2528
21706H0551n7699n2055L693K6724L2497J4368K3007j8932k2421k9313K2704N2086
21694G5210M2080o522k1441m7557q3216J1984J1454J4338j0903k5429J7925L9697
21682A7620k8804K8109M8286J1959j4232j637q601R958P1004K7073m8010l5255
21670G7470l7884k6180R646K6099N916j6274j6121l096O779rJ7307Q983j4107
21657C8529o128k1690j1619J3776P6650K0266l1780j0263j4797K521K8399j0922
$$ plain form
21645 72942 92191 96064 111966 123218 104938 88942 56132 59906 64102 71751 82325 86700 60461
21632 60461 48842 85840 75942 74841 31641 5710 8416 31288 24361 44511 41882 18902 9960
21619 9960 4393 25340 40952 88991 109653 98894 109330 86764 61374 70818 43782 9823
21607 9823 30939 57935 94716 108011 57027 35182 91281 114073 117791 124565 116231 107481 100856
21594 100856 120899 158507 158263 119345 79838 23429 55730 101120 98388 54012 26608 50744
21582 50744 74548 71744 77906 61734 58815 59522 15918 26487 126306 152138 125092 123452 96515
21569 96515 98710 103259 84495 80663 64141 73931 85418 100596 147712 113622 114862 110784 132886
21556 132886 133668 100782 100341 141476 134483 85406 100165 134913 94210 42024 17752 59050
$$ packed form
21645G2942J9249L873J5902J1252j8280j5996l2810L774M196P649J0574M375k6239
21632F0461j1619L6998r898j101m3200k5931K706K2872o927K0150k629k2980q942
21619I960n567K0947J5612M8039K0662j0759J0436k2566k5390R444k7036l3959
21607I823K1116K6996L6781J3295n0984k1845N6099K2792L718O774q334q750o625
21594A00856K0043L7608k44l8918l9507n6409L2301M5390k732m4376k7404K4136
21582E0744K3804k804O162j6172k919P07m3604J0569R9819K5832k7046j640k6937
21569I6515K195M549j8764l832j6522R790J1487J5178M7116l4090J240m078K2102
21556A32886P82l2886m41M1135o993m9077J4759L4748m0703n2186k4272M1298
$$ plain form
21544 59050 91538 88102 87469 106817 115720 113885 101220 68031 79209 99562 90217 63176 84778
21531 84778 88759 63781 40802 54710 65617 78872 77043 90894 77413 87366 61967 72804
21519 72804 128261 143502 115709 96450 94075 64398 28419 25817 16600 38695 87935 71238
21507 71238 42490 44194 29214 20211 30528 40271 64320 81784 76415 62390 113760 120219 60916
21494 60916 27430 37470 55243 49881 57644 121569 132918 131938 144661 90008 100393 101447 32732
21481 32732 13003 32120 49460 57727 45540 49375 52220 104453 107459 85774 37256 47160 98546
21468 98546 89391 99246 145992 188684 159744 128565 102425 105238 135659 149590 132975 86870
21456 86870 98546 84993 34965 43099 79645 64501 70604 80532 100041 93822 57210 72970
$$ packed form
21544E9050L2488l436o33J9348Q903j835j2665l3189J1178K0353r345k7041K1602
21531H4778L981k4978k2979J3908J0907J3255j829J3851j3481R953k5399J0837
21519G2804N5457J5241k7793j9259k375k9677l5979k602r217K2095M9240j6697
21507G1238k8748J704j4980r003J0317R743K4049J7464n369j4025N1370O459n9303
21494F0916l3486J0040J7773n362P763O3925J1349r80J2723n4653J0385J054o8715
21481C2732j9729J9117J7340Q267j2187L835K845N2233L006k1685m8518R904N1386
21468I8546r155R855M6746M2692k8940l1179k6140K813L0421J3931j6615m6105
21456H6870J1676j3553n0028Q134L6546j5144O103R928J9509o219l6612J5760
$$ plain form
21444 72970 105806 139215 135912 136560 130736 132191 135811 172788 203500 142555 109150 89727 37237
21431 37237 88693 143543 171104 178027 165186 145496 123769 139086 133304 118461 96252 117502
21419 117502 133623 126466 162611 184265 199973 201677 176604 172349 206362 227790 203762 126096
21407 126096 130534 144956 148280 108256 87020 89107 108050 134054 121292 124345 134147 115406
21395 115406 121346 117158 126449 115454 81457 92594 109143 102787 81877 58641 73296 81133
21383 81133 57934 35787 61832 52404 73328 116020 129585 76535 21631 26760 83290 81328
21371 81328 95254 110772 139445 145946 125325 130797 113348 122337 134294 187089 168218 106387
21359 106387 100186 95972 125669 112310 70155 65546 76386 74382 73635 58707 120122 146919 126133
$$ packed form
21444G2970L2836L3409l303O48n824J455L620L6977L0712o0945l3405j9423n2490
21431C7237N1456N4850K7561O923j2841j9690k1727J5317n782j4843k2209K1250
21419A17502J6121p157L6145K1654J5708J704k5073m255L4013K1428k4028p7666
21407A26096M438J4422L324m0024k1236K087J8943K6004j2762L053R802j8741
21395A15406N940m188R291j0995l3997J1137J6549o356k0910k3236J4655P837
21383H1133k3199k2147K6045r428K0924M2692J3565n3050n4904N129N6530j962
21371H1328J3926J5518K8673O501k0621N472j7449Q989J1957N2795j8871o1831
21359A06387o201m214K9697j3359m2155m609J0840k004p47j4928O1415K6797k0786
$$ plain form
21346 126133 170137 204224 190704 166875 133011 151251 162030 197546 194495 168489 134630 128202
21334 128202 137888 82113 90143 114175 140086 131872 132447 95947 116835 147748 125738 108003
21322 108003 119599 122937 115673 98801 73862 41845 83751 119718 131263 130547 116348 134363
21310 134363 133417 102764 76013 88232 123662 142563 117605 86221 67118 68116 95412 130614
21298 130614 122458 105646 90666 70369 76155 75762 86961 111332 150096 192194 195428 186072 172441
21285 172441 194974 164027 182139 184482 169272 97894 91299 142925 121919 125066 141996 170016
21273 170016 149444 110284 94157 57224 40971 73026 64104 77749 96000 113317 98192 115940
21261 115940 133524 146065 113014 134372 136249 126816 113775 120723 146017 147656 127080 97054
$$ packed form
21346A26133M4004L4087j3520k3829l3864J8240J0779L5516l051k6006l3859o428
21334A28202R686n5775Q030K4032K5911q214N75l6500K0888L0913k2010j7735
21322A08003J1596L338p264j6872k4939l2017M1906L5967J1545p16j4199J8015
21310A34363r46l0653k6751J2219L5430J8901k4958l1384j9103R98K7296L5202
21298A30614q156j6812j4980k0297N786l93J1199K4371L8764M2098L234r356j3631
21285A72441K2533l0947J8112K343j5210p1378o595N1626k1006L147J6930K8020
21273A70016k0572l9160j6127l6933j6253L2055q922J3645J8251J7317j5125J7748
21261A15940J7584J2541l3051K1358J877r433j3041O948K5294J639k0576l0026
$$ plain form
21249 97054 98983 149284 153860 139095 119961 119025 129982 128860 115977 141768 144266 147263 152241
21236 152241 150995 147887 132936 157637 167028 110965 108418 136270 155353 171465 167239 154353
21224 154353 124601 136949 153778 149471 143928 128313 110188 88360 76439 117591 155107 131557
21212 131557 126206 118411 97491 94629 108271 98674 113977 134418 163930 221291 219793 171508
21200 171508 134201 150329 136879 136625 110433 87251 107216 114548 87739 65964 82731 117592
21188 117592 143433 152480 164725 123801 90943 85480 61188 86517 107359 136681 145312 124572
21176 124572 158537 159769 194875 205599 201021 162158 157938 134099 108927 143642 135335 150002
21164 150002 198466 197583 185804 170457 134710 119667 125897 128210 190414 186688 180973 175417 207872
$$ packed form
21249I7054J929N0301M576j4765j9134r36J0957j122j2883K5791K498K997M978
21236A52241j246l108j4951K4701R391n6063k547K7852J9083J6112m226j2886
21224A54353k9752J2348J6829m307n543j5615j8125k1828j1921M1152L7516k3550
21212A31557n351p795k0920k862J3642r597J5303K0441K9512N7361j498m8285
21200A71508l7307J6128j3450k54k6192k3182J9965P332k6809k1775J6767L4861
21188A17592K5841R047J2245m0924l2858n463k4292K5329K0842K9322Q631k0740
21176A24572L3965J232L5106J0724m578l8863m220k3839k5172L4715q307J4667
21164A50002M8464q83j1779j5347l5747j5043O230K313O2204l726n715n556L2455
$$ plain form
21151 207872 220795 219258 196255 186764 154458 154015 133917 145743 175986 195631 208978 231980
21139 231980 230684 197450 172359 164929 184759 180428 175429 191104 200111 204171 237720 252103 230176
21126 230176 217580 216941 180789 193723 203305 209721 179512 181472 178793 203180 186747 187511 182933
21113 182933 211540 231151 213827 218749 211743 208752 178624 159380 170914 105875 75626 103556
21101 103556 134014 140358 195248 234075 227608 246782 230828 170100 203589 202726 174817 193279
21089 193279 207671 212350 248742 240469 198037 170339 189249 250799 247230 253182 240662 218022
21077 218022 222398 241367 248096 254159 225979 240405 233013 199284 213435 246056 287237 246562
21065 246562 266093 270592 216086 209853 185518 186569 198142 236515 239654 236656 208921 210434 223789
$$ packed form
21151B07872J2923j537k3003r491l2306m43k0098J1826L0243J9645J3347K3002
21139B31980j296l3234k5091p430J9830m331m999J5675R007M060L3549J4383k1927
21126B30176j2596o39l6152J2934R582O416l0209J960k679K4387j6433P64m578
21113A82933K8607J9611j7324M922p006k991l0128j9244J1534o5039l0249K7930
21101A03556L0458O344N4890L8827o467J9174j5954o0728L3489q63k7909J8462
21089A93279J4392M679L6392q273m2432k7698J8910O1550l569N952j2520k2640
21077B18022M376J8969O729O063k8180J4426p392l3729J4151L2621M1181m0675
21065B46562J9531M499n4506o233k4335J051J1573L8373L139k998k7735J513J3355
$$ plain form
21052 223789 185244 192686 197767 204340 196112 204825 239697 289042 260954 222655 211914 203740 234617
21039 234617 231687 230052 226219 201545 147022 101183 129516 140214 161425 188777 208450 227166
21027 227166 227325 227719 214638 225244 240791 218478 222430 241227 225939 219316 212874 177581 193961
21014 193961 248463 214148 188160 203759 232462 219941 205342 191196 216502 236209 215101
21003 215101 208958 236745 252184 265964 256912 280740 299956 258464 220875 196451 166606 160237
20991 160237 171324 209354 221868 254515 266973 246046 214307 155670 141996 175212 187891
20980 187891 227792 226461 203201 209953 212160 200140 215074 243624 273602 271613 248305 259019
20968 259019 242883 239112 254972 245396 217020 242504 270489 291795 254316 204837 217626 231781
$$ packed form
21052B23789l8545P442N081O573q228Q713L4872M9345k8088l8299j0741q174L0877
21039B34617k930j635l833k4674n4523m5839K8333J0698K1211K7352J9673J8716
21027B27166J59L94j3081J0606J5547k2313L952J8797j5288o623o442l5293J6380
21014A93961N4502l4315k5988J5599K8703j2521j4599j4146K5306J9707k1108
21003B15101o143K7787J5439J3780r052K3828J9216m1492l7589k4424k9845o369
20991A60237J1087L8030J2514L2647J2458k0927l1739n8637j3674L3216J2679
20980A87891L9901j331k3260O752K207j2020J4934K8550K9978j989k3308J0714
20968B59019j6136l771J5860r576k8376K5484K7985K1306l7479m9479J2789J4155
$$ plain form
20956 231781 245372 225024 236394 255999 255422 291027 258371 256711 290333 268009 253417 251847
20944 251847 241933 243325 218202 207716 187654 206238 228535 239604 247165 256191 247988 292439
20932 292439 293088 282863 270852 322733 354419 287124 253739 223746 246412 233681 233201 268188
20920 268188 260432 250096 269073 271013 233802 218729 251247 295316 327078 279585 237206 264089
20908 264089 331648 338693 328272 352836 344164 264639 249065 250857 240524 251943 220314 191671
20896 191671 240552 287514 277031 307714 359496 340571 324584 315696 287464 301993 313214 290274
20884 290274 319232 301958 295337 322056 348829 366126 376239 348283 331501 374347 399880 391466
20872 391466 394004 409668 394365 367878 383183 396620 407849 423907 450053 407186 394584 439568
$$ packed form
20956B31781J3591k0348J1370J9605n77L5605l2656j660L3622k2324j4592j570
20944B51847r914J392k5123j0486k0062J8584K2297J1069P561R026q203M4451
20932B92439O49j0225j2011N1881L1686o7295l3385k9993K2666j2731m80L4987
20920B68188p756j0336J8977J940l7211j5073L2518M4069L1762m7493m2379K6883
20908B64089O7559P045j0421K4564q672p9525j5574J792j0333J1419l1629k8643
20896A91671M8881M6962j0483L0683N1782j8925j5987q888k8232J4529J1221k2940
20884B90274K8958j7274o621K6719K6773J7297J0113k7956j6782M2846K5533q414
20872C91466K538J5664j5303k6487J5305J3437J1229J6058K6146m2867j2602M4984
$$ plain form
20860 439568 430339 418776 434542 468749 479200 479897 472177 476183 503122 570807 654949 699043
20848 699043 774095 881107 990139 1143480 1348541 1519559 1650642 1772382 1890388 1947884
20838 1947884 1903799 1787968 1603578 1448439 1273176 1117827 989974 905570 745761 643556
20828 643556 586122 558460 474825 416202 431450 443196 447021 437930 435386 434926 407948 410586 458498
20815 458498 438289 413453 423177 401826 391540 391580 426151 467762 404789 368095 341138 315942
20803 315942 346586 377255 408348 420928 407051 383787 394324 402343 407184 392270 370719 369128
20791 369128 332085 325367 317571 306363 303495 336434 328208 334938 290514 301136 315518 318504 326121
20778 326121 331786 348812 375706 358470 331917 346831 345727 366695 378875 341159 326215 355831
$$ packed form
20860D39568r229j1563J5766L4207J0451O97p720M006K6939O7685Q4142M4094
20848F99043P5052J07012J09032J53341K05061J71018J31083J21740J18006N7496
20838A947884m4085j15831j84390j55139j75263j55349j27853q4404j59809j02205
20828F43556n7434k7662q3635n8623J5248J1746L825r091k544m60k6978K638M7912
20815D58498k0209k4836R724k1351j0286M0L4571M1611o2973l6694k6957k5196
20803C15942L0644L0669L1093J2580j3877k3264J0537Q019M841j4914k1551j591
20791C69128l7043o718p796j1208k868L2939q226O730m4424J0622J4382K986P617
20778C26121N665J7026K6894j7236k6553J4914j104K0968J2180l7716j4944K9616
$$ plain form
20766 355831 382341 397184 382153 377492 373679 392586 348536 339926 353158 357445 345189 363201
20754 363201 381191 387351 401322 374776 337149 346880 321847 297136 351222 374429 381966 357843
20742 357843 335555 373394 391141 358545 338998 404385 459442 454244 447660 463234 462490 446512
20730 446512 425896 394000 378595 423543 426543 433833 429749 342052 314981 335794 378598 418998
20718 418998 470396 476596 458499 431644 392189 371258 395160 376051 398282 409665 400682 440858
20706 440858 448883 471147 434781 386810 362397 400764 427368 445213 430134 422361 376474 386078
20694 386078 431776 451324 477383 469702 454296 436328 431673 470337 507243 495218 501197 503670
20682 503670 491273 455519 425237 423966 423800 452988 485123 494071 457536 461764 480135 511808
$$ packed form
20766C55831K6510J4843j5031m661l813J8907m4050q610J3232M287j2256J8012
20754C63201J7990O160J3971k6546l7627R731k5033k4711N4086K3207P537k4123
20742C57843k2288L7839J7747l2596j9547O5387N5057n198o584J5574p44j5978
20730D46512k0616l1896j5405M4948L000P290m084q7697k7071K0813M2804M0400
20718D18998N1398O200j8097k6855l9455k0931K3902j9109K2231J1383q983M0176
20706D40858Q025K2264l6366m7971k4413L8367K6604J7845j5079p773m5887R604
20694C86078M5698J9548K6059p681j5406j7968m655L8664L6906j2025N979K473
20682E03670j2397l5754l0282j271j66K9188L2135Q948l6535M228J8371L1673
$$ plain form
20670 511808 498299 472145 481228 490196 474424 472317 488408 478327 471000 485008 489441 469065
20658 469065 480460 495328 535910 539362 512851 519750 516212 497236 485173 495990 453868 456391
20646 456391 512134 546040 559100 559857 521924 514775 480934 481712 496472 493337 509955 531582 490205
20633 490205 472288 460515 446563 540150 610170 595739 594348 568160 526797 541585 550924 564131
20621 564131 577416 554305 545933 527172 493692 483231 456804 461252 492100 524652 539734 525289
20609 525289 522479 502935 496541 517914 489975 482751 555992 635847 639073 636248 635497 598220 573448
20596 573448 569523 600196 611328 611329 605844 596718 609641 621224 652189 620728 620672 640941 618006
20583 618006 592728 555421 571222 625492 651417 654992 665491 624100 617249 648635 697159 699319
$$ packed form
20670E11808j3509k6154R083Q968j5772k107J6091j0081p327J4008M433k0376
20658D69065J1395J4868M0582L452k6511O899l538j8976j2063J0817m2122K523
20646D56391N5743L3906J3060P57l7933p149l3841P78J4760l135J6618K1627m1377
20633D90205j7917j1773j3952R3587P0020j4431j391k6188m1363J4788R339J3207
20621E64131J3285k3111q372j8761l3480j0461k6427M448L0848L2552J5082j4445
20609E25289k810j9544o394K1373k7939p224P3241P9855L226k825p51l7277k4772
20596E73448l925L0673J1132Jn485r126J2923J1583L0965l1461n6K0269k2935
20583F18006k5278l7307J5801N4270K5925L575J0499m1391o851L1386M8524K160
$$ plain form
20571 699319 688927 674549 688276 671047 644755 657297 656364 630250 606252 587821 612398 613365
20559 613365 609388 613091 610675 596421 560801 570159 582523 588087 571867 568562 513485 547138 568479
20546 568479 615509 698272 782358 846060 861707 842799 832234 830836 831262 830717 782052 760911
20534 760911 754712 759799 740811 738266 725171 759874 748139 755871 812840 857538 866245 827580
20522 827580 834481 851537 814999 804342 806085 790444 830757 820064 814764 848255 871480 881679
20510 881679 857823 864710 847039 844198 839602 824347 840259 862117 864362 884893 891355 850085
20498 850085 860862 911866 935275 928165 969733 983859 991184 1050361 1023098 1010779 982004 959315
20486 959315 957440 915709 932758 948134 949039 935278 962030 983023 965689 927466 923694 912992
$$ packed form
20571F99319j0392j4378J3727j7229k6292J2542r33k6114k3998j8431K4577R67
20559F13365l977L703k416j4254l5620R358J2364N564j6220l305n5077L3653K1341
20546E68479M7030Q2763Q4086O3702J5647j8908j0565j398M26n45m8665k1141
20534G60911o199N087j8988k545j3095L4703j1735P732N6969M4698Q707l8665
20522H27580O901J7056l6538j0657J743j5641M0313j0693n300L3491K3225J0199
20510H81679k3856O887j7671k841m596j5255J5912K1858K245K0531O462m1270
20498H50085J0777N1004K3409p110M1568J4126P325N9177k7263j2319k8775k2689
20486I59315j875m1731J7049J5376R05j3761K6752K0993j7334l8223l772j0702
$$ plain form
20474 912992 935643 955399 998803 983915 998740 1031075 1022163 968655 978277 1003522 1035626 1042559
20462 1042559 1081342 1114420 1128348 1094842 1060049 1040800 1047717 1075044 1102074 1106118 1118029 1131028
20450 1131028 1101250 1084530 1089525 1083495 1070418 1066360 1054938 1090608 1131858 1101500 1070141 1042979
20438 1042979 1060794 1079191 1056974 1043490 1039141 1033278 1055626 1120436 1126732 1124506 1108013 1076082
20426 1076082 1075995 1106843 1098530 1080758 1071683 1103056 1157426 1165488 1160864 1165902 1181622 1206809 1225775
20413 1225775 1244206 1232954 1270052 1264052 1263390 1280919 1259149 1195200 1179756 1200324 1187005 1186115
20401 1186115 1172481 1167438 1141360 1148850 1139380 1105132 1047434 1009409 1025891 1086157 1111363 1099349
20389 1099349 1125006 1183528 1206094 1194813 1207865 1227219 1212281 1214513 1226023 1226834 1209201 1172901
$$ packed form
20474I12992K2651J9756M3404j4888J4825L2335q912n3508R622K5245L2104O933
20462A042559L8783L3078J3928l3506l4793j9249O917K7327K7030M044J1911J2999
20450A131028k9778j6720M995o030j3077m058j1422L5670M1250l0358l1359k7162
20438A042979J7815J8397k2217j3484m349n863K2348O4810O296k226j6493l1931
20426A076082q7L0848q313j7772r075L1373N4370Q062m624N038J5720K5187J8966
20413A225775J8431j1252L7098o000o62J7529k1770o3949j5444K0568j3319q90
20401A186115j3634n043k6078P490r470l4248n7698l8025J6482O0266K5206j2014
20389A099349K5657N8522K2566j1281J3052J9354j4938K232J1510Q11j7633l6300
$$ plain form
20377 1172901 1155531 1098427 1057728 1026603 960314 920260 866272 808368 754926 738851 782063
20366 782063 867490 1013607 1181010 1302653 1509165 1714111 1798223 1832137 1891527 1962100
20356 1962100 1984598 1954483 1910926 1903107 1958846 1974789 1978401 1973967 2003527 2024805 2012938 2044195
20344 2044195 2040887 2021476 2041458 2025587 2071798 2153710 2165619 2163321 2198676 2218212 2209277 2240401
20332 2240401 2253034 2274584 2303865 2347836 2406335 2443493 2483460 2534829 2533106 2539619 2577460 2599713
20320 2599713 2650994 2720340 2718360 2724263 2789530 2858599 2942800 2980890 2990258 3048376 3121561 3233592
20308 3233592 3332996 3388833 3506000 3609041 3768798 3900154 4028614 4129510 4220345 4324257
20298 4324257 4434826 4543220 4636263 4723825 4746382 4710011 4719724 4770160 4763425 4850196 5012065
$$ packed form
20377A172901j7370n7104m0699l1125o6289m0054n3988n7904n3442j6075M3212
20366G82063Q5427J46117J67403J21643K06512K04946Q4112L3914N9390P0573
20356A962100K2498l0115m3557p819N5739J5943L612m434K9560K1278j1867L1257
20344B044195l308j9411J9982j5871M6211Q1912J1909k298L5355J9536q935L1124
20332B240401J2633K1550K9281M3971N8499L7158L9967N1369j723O513L7841K2253
20320B599713N1281O9346j980N903O5267O9069Q4201L8090R368N8118P3185J12031
20308C233592R9404N5837J17167J03041J59757J31356J28460J00896R0835J03912
20298D324257J10569J08394R3043Q7562K2557l6371R713N0436o735Q6771J61869
$$ plain form
20287 5012065 5108869 5216357 5385618 5523388 5616827 5687398 5811538 5891724 5944271 6023273
20277 6023273 6132440 6235227 6371302 6606075 6839504 7173683 7554149 7969276 8477160
20268 8477160 9013232 9598499 10207411 10772059 11283649 11824077 12358729 13006348 13727061
20259 13727061 14560720 15646711 17049972 18808485 20973007 23656664 27068133 31345063
20251 31345063 36833973 44115508 54062605 67845017 86749698 111462281 140953172
20244 140953172 172618372 205461165 241788963 282527736 318766858 332110635 318949701
20237 318949701 295055564 266872185 232401324 194591404 158123003 126047889 98812072
20230 98812072 76132229 58420797 45457298 36218713 29529394 24550160 20793731 17825809
$$ packed form
20287E012065R6804J07488J69261J37770R3439P0571J24140Q0186N2547P9002
20277F023273J09167J02787J36075K34773K33429L34179L80466M15127N07884
20268H477160N36072N85267O08912N64648N11590N40428N34652O47619P20713
20259A3727061Q33659J085991J403261J758513K164522K683657L411469M276930
20251C1345063N488910P281535R947097J3782412J8904681K4712583K9490891
20244A40953172L1665200L2842793L6327798M0738773L6239122J3343777j3160934
20237C18949701k3894137k8183379l4470861l7809920l6468401l2075114k7235817
20230I8812072k2679843j7711432j2963499r238585o689319m979234l756429k967922
$$ plain form
20222 17825809 15440629 13511022 11973121 10753462 9748130 8950410 8329250 7876399
20214 7876399 7530894 7226799 6902579 6562871 6177073 5819804 5418073 4994606 4610547
20205 4610547 4295552 3990784 3675293 3406050 3198415 2999978 2897327 2837181 2747904 2711890
20195 2711890 2709754 2736096 2785464 2830863 2860337 2802155 2756705 2710819 2632328 2560488 2519492
20184 2519492 2485340 2432461 2404424 2362132 2330273 2327464 2351471 2363353 2340789 2324737 2287090
20173 2287090 2220362 2209968 2238995 2306702 2343851 2359083 2363747 2377199 2401611 2415878 2464179
20162 2464179 2512679 2554351 2604893 2665746 2659719 2656029 2630924 2679213 2756911 2810684 2874897 2929146
20150 2929146 2994438 3047891 3104846 3137943 3160286 3199996 3280163 3393475 3519189 3641491 3745822
$$ packed form
20222A7825809k385180j929607j537901j219659j005332p97720o21160m52851
20214G876399l45505l04095l24220l39708l85798l57269m01731m23467l84059
20205D610547l14995l04768l15491k69243k07635j98437j02651o0146q9277l6014
20195B711890k136K6342M9368M5399K9474n8182m5450m5886p8491p1840m0996
20184B519492l4152n2879k8037m2292l1859k809K4007J1882k2564j6052l7647
20173B287090o6728j0394K9027O7707L7149J5232M664J3452K4412J4267M8301
20162B464179M8500M1672N0542O0853o027l690k5105M8289P7698N3773O4213N4249
20150B929146O5292N3453N6955L3097K2343L9710Q0167J13312J25714J22302J04331
$$ plain form
20139 3745822 3853877 3962092 4014038 4120535 4211683 4249378 4354446 4447810 4535390 4638112
20129 4638112 4772672 4872248 4955072 5019301 5154748 5268783 5346845 5400323 5459222 5548753 5658106
20118 5658106 5858303 6047320 6229577 6421029 6670103 7005007 7361027 7626383 7838646
20109 7838646 8026462 8203491 8370525 8493570 8614958 8743127 8831432 8956079 9067977 9178285
20099 9178285 9341368 9535971 9711763 9869288 10053101 10276068 10466066 10684408 10929934
20090 10929934 11246518 11553870 11806947 12070149 12391614 12682026 12987188 13260461 13519109
20081 13519109 13859618 14162296 14479910 14836172 15229052 15616124 16059572 16507666 16970754
20072 16970754 17429007 17873804 18355799 18871400 19420852 19985266 20659362 21348305 22016146
$$ packed form
20139C745822J08055J08215N1946J06497R1148L7695J05068R3364Q7580J02722
20129D638112J34560R9576Q2824O4229J35447J14035P8062N3478N8899Q9531J09353
20118E658106K00197J89017J82257J91452K49074L34904L56020K65356K12263
20109G838646J87816J77029J67034J23045J21388J28169Q8305J24647J11898J10308
20099I178285J63083J94603J75792J57525J83813K22967J89998K18342K45526
20090A0929934L16584L07352K53077K63202L21465K90412L05162K73273K58648
20081A3519109L40509L02678L17614L56262L92880L87072M43448M48094M63088
20072A6970754M58253M44797M81995N15601N49452N64414O74096O88943O67841
$$ plain form
20063 22016146 22702822 23492346 24311268 25162922 26050489 26964333 27965500 29030263 30101486
20054 30101486 31264951 32456791 33707949 35032765 36428740 37918275 39468432 41148414
20046 41148414 42924361 44844296 46886662 49019290 51305625 53724693 56291309 59036331
20038 59036331 61965477 65053583 68330740 71819458 75501355 79370302 83411939 87713683
20030 87713683 92229808 96977119 101945872 107017112 112232773 117549896 122954459 128362345
20022 128362345 133654468 138809124 143779417 148463538 152713608 156459195 159632097 162086350
20014 162086350 163866710 164897125 165120215 164486859 163072531 160911871 158013417 154441736
20006 154441736 150346769 145761391 140792850 135557957 130102437 124541131 118906099 113289505
$$ packed form
20063B2016146O86676P89524Q18922Q51654Q87567R13844J001167J064763J071223
20054C0101486J163465J191840J251158J324816J395975J489535J550157J679982
20046D1148414J775947J919935K042366K132628K286335K419068K566616K745022
20038E9036331K929146L088106L277157L488718L681897L868947M041637M301744
20030H7713683M516125M747311M968753N071240N215661N317123N404563N407886
20022A28362345N292123N154656M970293M684121M250070L745587L172902K454253
20014A62086350J780360J030415K23090o33356j414328k160660k898454l571681
20006A54441736m094967m585378m968541n234893n455520n561306n635032n616594
$$ plain form
19998 113289505 107787201 102432483 97178855 92116127 87302744 82692445 78301507 74148679
19990 74148679 70227305 66524494 63012907 59690106 56557692 53619369 50873021 48254838
19982 48254838 45803259 43509505 41364275 39346657 37418837 35624353 33969712 32374756
19974 32374756 30876494 29508598 28184510 26915401 25728358 24603892 23569924 22623276
19966 22623276 21680655 20823006 19954082 19101523 18323414 17596418 16930391 16284220 15664799
19957 15664799 15048837 14461788 13937081 13448680 12978675 12509925 12106153 11646802 11240042
19948 11240042 10890667 10501295 10121522 9779693 9433194 9130960 8863911 8594195 8275369
19939 8275369 7986550 7761480 7548270 7374114 7183109 6955039 6809774 6649863 6430591
$$ packed form
19998A13289505n502304n354718n253628n062728m813383m610299m390938m152828
19990G4148679l921374l702811l511587l322801l132414k938323k746348k618183
19982D8254838k451579k293754k145230k017618j927820j794484j654641j594956
19974C2374756j498262j367896j324088j269109j187043j124466j033968r46648
19966B2623276r42621q57649q68924q52559p78109p26996o66027o46171o19421
19957A5664799o15962n87049n24707m88401m70005m68750m03772m59351m06760
19948A1240042l49375l89372l79773l41829l46499l02234k67049k69716l18826
19939H275369k88819k25070k13210j74156j91005k28070j45265j59911k19272
$$ plain form
19930 6430591 6250016 6161636 6013887 5815166 5645584 5467350 5295421 5128822 5013601 4899477
19920 4899477 4760045 4621700 4538750 4411330 4240592 4115638 4007844 3908430 3814960 3739542
19910 3739542 3648218 3532712 3454424 3391065 3330134 3249987 3180819 3099394 3039619 3022496 2954541
19899 2954541 2874238 2790944 2751928 2702917 2668822 2610590 2558003 2563735 2569487 2554396 2542429 2514741
19887 2514741 2501763 2485970 2415470 2367780 2330865 2310543 2258344 2213305 2203316 2235836 2225394
19876 2225394 2197569 2108580 2062531 2056895 2043174 2031065 1999138 1962803 1924690 1913897 1879006
19865 1879006 1815342 1751692 1694169 1663702 1707379 1699169 1645395 1580874 1533856 1485554 1430357
19854 1430357 1420148 1391485 1412771 1420097 1382428 1367931 1340793 1319105 1304877 1258426 1212673
$$ packed form
19930F430591j80575q8380j47749j98721j69582j78234j71929j66599j15221j14124
19920D899477j39432j38345q2950j27420j70738j24954j07794r9414r3470p5418
19910C739542r1324j15506p8288o3359o0931q0147o9168q1425n9775j7123o7955
19899B954541q0303q3294l9016m9011l4095n8232n2587N732N752j5091j1967k7688
19887B514741j2978j5793p0500m7690l6915k0322n2199m5039r989L2520j0442
19876B225394k7825q8989m6049n636j3721j2109l1927l6335l8113j0793l4891
19865A879006o3664o3650n7523l0467M3677q210n3774o4521m7018m8302n5197
19854A430357j0209k8663K1286P326l7669j4497k7138k1688j4228m6451m5753
$$ plain form
19843 1212673 1154016 1125184 1069108 1036650 1025940 1024232 988477 944227 896960 870366 839742
19832 839742 828216 859775 872004 855979 840472 814670 760115 729005 716631 736572 740058 665541
19820 665541 675195 687134 618091 624018 608686 561089 562509 608212 616479 589292 535328 470749
19808 470749 483591 489113 442375 446863 420374 381018 410641 420325 371211 387377 399670 372972
19796 372972 365099 361254 391294 382226 361583 314342 259504 250469 296497 314773 284013 286684
19784 286684 274724 284294 319033 298343 279544 318006 323612 286887 259409 227607 254033 294190
19772 294190 313380 332881 248284 198993 212110 185678 123574 83137 96870 106567 119386 143791
19760 143791 164731 167797 118762 125591 143871 143252 183149 211544 208899 173583 142904 123323
$$ packed form
19843A212673n8657k8832n6076l2458j0710j708l5755m4250m7267k6594l0624
19832H39742j1526L1559J2229j6025j5507k5802n4555l1110j2374J9941L486p4517
19820F65541R654J1939o9043N927j5332m7597J420M5703Q267k7187n3964o4579
19808D70749J2842N522m6738M488k6489l9356K9623R684m9114J6166J2293k6698
19796C72972p873l845L0040r068k0643m7241n4838r035M6028J8276l0760K671
19784B86684j1960R570L4739k0690j8799L8462N606l6725k7478l1802K6426M0157
19772B94190J9190J9501q4597m9291J3117k6432o2104m0437J3733R697J2819K4405
19760A43791K0940L066m9035O829J8280o19L9897K8395k645l5316l0679j9581
$$ plain form
19748 123323 125373 150430 152422 149649 165832 168878 169128 184210 166424 171628 190903 214629 251294
19735 251294 301997 343221 420127 504385 625894 741699 866176 952585 996379 963610 962394
19724 962394 970164 933205 859027 743914 622404 477650 385318 336797 281689 220417 199329
19713 199329 157582 131282 100092 89222 88156 95450 75834 57610 57546 89537 119759 104174
19701 104174 64155 48435 50116 65114 71057 51917 18268 18435 -7789 -29344 -23525 -54784
19689 -54784 -47330 -2179 -38529 -39446 -14025 -15941 -8456 5513 -21691 -15402 -8584 -34326 -87107
19676 -87107 -70016 -53535 -7253 14998 -35781 -68163 -76788 -61262 -68656 -88126 -82810 -13564
19664 -13564 33556 44540 76236 87706 87650 41955 19869 -10303 -19982 -8278 -8751 -11620 13112
$$ packed form
19748A23323K050K5057J992k773J6183L046K50J5082j7786N204J9275K3726L6665
19735B51294N0703M1224P6906Q4258J21509J15805J24477Q6409M3794l2769j216
19724I62394P770l6959p4178j15113j21510j44754r2332m8521n5108o1272k1088
19713A99329m1747k6300l1190j0870j066P294j9616j8224o4L1991L0222j5585
19701A04174m0019j5720J681J4998N943j9140l3649J67k6224k1555N819l1259
19689e4784P454M5151l6350r17K5421j916P485J3969k7204O289O818k5742n2781
19676h7107J7091J6481M6282K2251n0779l2382q625J5526p394j9470N316O9246
19664a3564M7120J0984L1696J1470n6m5695k2086l0172r679J1704m73k869K4732
$$ plain form
19651 13112 -3365 -30094 -32767 -13027 -6153 -12444 13771 87102 126561 159238 158552 207487 288907
19638 288907 320549 374841 543377 731283 855593 1020787 1185485 1341592 1484530 1502639
19628 1502639 1438461 1356480 1269938 1094781 878996 705212 599410 481497 339912 250637
19618 250637 189389 123502 42249 29844 20092 29051 40204 41542 -31209 -99829 -103838 -104773 -102894
19605 -102894 -98446 -118151 -122586 -59815 -26377 -20576 -55381 -77127 -98741 -89697 -82859 -147956
19593 -147956 -215688 -194113 -158467 -139732 -123250 -140344 -126253 -86819 -53925 -88349 -136677
19582 -136677 -158898 -142039 -127190 -118306 -115571 -174169 -177111 -175900 -197634 -166593 -178966 -222826
19570 -222826 -243348 -258719 -212859 -182098 -217129 -230450 -214516 -217724 -219035 -184916 -158997 -185167
$$ packed form
19651A3112j6477k6729k673J9740O874o291K6215P3331L9459L2677o86M8935Q1420
19638B88907L1642N4292J68536J87906J24310J65194J64698J56107J42938J8109
19628A502639o4178q1981q6542j75157k15785j73784j05802j17913j41585q9275
19618B50637o1248o5887q1253j2405r752Q959J1153J338p2751o8620m009r35J879
19605a02894M448j9705m435O2771L3438N801l4805k1746k1614R044O838o5097
19593a47956o7732K1575L5646J8735J6482j7094J4091L9434L2894l4424m8328
19582a36677k2221J6859J4849Q884K735n8598k942J211k1734L1041j2373m3860
19570b22826k0522j5371M5860L0761l5031j3321J5934l208j311L4119K5919k6170
$$ plain form
19558 -185167 -196018 -206483 -199472 -234277 -218833 -215043 -190848 -177180 -198362 -198995 -218772 -158836
19546 -158836 -129024 -118257 -132098 -174767 -182444 -160899 -149128 -183476 -218980 -192379 -181687 -202191
19534 -202191 -183417 -177351 -180646 -189077 -152411 -131183 -128722 -153286 -169676 -208015 -239024 -233206
19522 -233206 -213439 -196778 -193064 -214969 -232505 -193896 -150482 -136492 -158483 -177933 -174671 -184637
19510 -184637 -179818 -196957 -225289 -234172 -213407 -188148 -147187 -169951 -213354 -204985 -190685 -159159
19498 -159159 -136670 -128330 -198456 -219464 -257415 -264969 -259688 -260228 -254656 -244327 -215875 -193124 -161648
19485 -161648 -145235 -141211 -154637 -199297 -222019 -197148 -158819 -192038 -201086 -204658 -240021 -235090
19473 -235090 -220022 -255984 -266030 -184662 -169920 -169140 -173729 -132324 -152149 -169248 -187481 -188833
$$ packed form
19558a85167j0851j0465P011l4805J5444L790K4195J3668k1182o33j9777N9936
19546a58836K9812J0767j3841m2669p677K1545J1771l4348l5504K6601J0692k0504
19534b02191J8774O066l295q431L6666K1228K461k4564j6390l8339l1009N818
19522b33206J9767J6661L714k1905j7536L8609M3414J3990k1991j9450L262r966
19510a84637M819j7139k8332q883K0765K5259M0961k2764m3403Q369J4300L1526
19498a59159K2489Q340p0126k1008l7951p554N281n40N572J0329K8452K2751L1476
19485a61648J6413M024j3426m4660k2722K4871L8329l3219r048l572l5363M931
19473b35090J5068l5962j0046Q1368J4742P80m589M1405j9825j7099j8233j352
$$ plain form
19461 -188833 -171213 -190604 -207809 -225319 -183041 -140887 -192249 -252203 -283448 -321753 -335062
19450 -335062 -274900 -236204 -233496 -209279 -217910 -209988 -212972 -223390 -199063 -164557 -152219 -195971
19438 -195971 -244466 -257426 -229559 -212010 -177077 -166912 -217536 -194170 -198361 -220599 -235857 -238722
19426 -238722 -213933 -190851 -222644 -227295 -214352 -206384 -197765 -175964 -181182 -242282 -268708 -258572
19414 -258572 -243414 -239697 -225832 -271171 -300118 -325108 -319639 -301321 -252773 -226875 -251084 -274703
19402 -274703 -255074 -243678 -228420 -278312 -273028 -250410 -214890 -225388 -255817 -293850 -262033 -234200
19390 -234200 -217343 -267300 -290867 -291942 -281848 -288436 -296062 -295556 -254042 -233570 -253318 -287244
19378 -287244 -293202 -265458 -208622 -191410 -209165 -200608 -175022 -198636 -213808 -186183 -134608 -146094
$$ packed form
19461a88833J7620j9391j7205j7510M2278M2154n1362n9954l1245l8305j3309
19450c35062O0162L8696K708K4217q631P922k984j0418K4327L4506J2338m3752
19438a95971m8495j2960K7867J7549L4933J0165n0624K3366m191k2238j5258k865
19426b38722K4789K3082l1793m651J2943P968Q619K1801n218o1100k6426J0136
19414b58572J5158L717J3865m5339k8947k4990N469J8318M8548K5898k4209k3619
19402b74703J9629J1396J5258m9892N284K2618L5520j0498l0429l8033L1817K7833
19390b34200J6857m9957k3567j075J0094o588p626N06M1514K0472j9748l3926
19378b87244n958K7744N6836J7212j7755Q557K5586k3614j5172K7625N1575j1486
$$ plain form
19366 -146094 -199888 -187224 -205146 -239037 -214696 -222004 -233559 -261885 -277145 -263818 -254387 -237039
19354 -237039 -229341 -205569 -226422 -194750 -172238 -202973 -237869 -241091 -229035 -227871 -259261 -250658
19342 -250658 -255636 -293689 -313621 -299216 -250521 -227214 -215771 -219490 -230108 -217886 -223771 -214524
19330 -214524 -190902 -182558 -220693 -265234 -263645 -216604 -198318 -200752 -203471 -220936 -200613 -205590
19318 -205590 -205933 -186417 -205178 -192492 -218901 -257526 -235529 -214162 -197206 -211384 -246266 -241197
19306 -241197 -226952 -243549 -229792 -183122 -154633 -164924 -178001 -175324 -188878 -205883 -171426 -190419
19294 -190419 -212730 -220865 -250916 -244167 -232271 -234435 -265586 -319887 -303092 -274213 -244721 -232900
19282 -232900 -197580 -219008 -224727 -234688 -225421 -228791 -183676 -175890 -156057 -158395 -182121 -195204 -205067
$$ packed form
19366a46094n3794J2664j7922l3891K4341p308j1555k8326j5260J3327R431J7348
19354b37039P698K3772k0853L1672K2512l0735l4896l222J2056J164l1390Q603
19342b50658m978l8053j9932J4405M8695K3307J1443l719j0618J2222n885R247
19330b14524K3622Q344l8135m4541J589M7041J8286k434k719j7465K0323m977
19318b05590l43J9516j8761J2686k6409l8625K1997K1367J6956j4178l4882N069
19306b41197J4245j6597J3757M6670K8489j0291j3077K677j3554j7005L4457j8993
19294a90419k2311q135l0051O749J1896k164l1151n4301J6795K8879K9492J1821
19282b32900L5320k1428n719r961R267l370M5115P786J9833k338k3726j3083r863
$$ plain form
19269 -205067 -196527 -207247 -232754 -245891 -276017 -261817 -241025 -227372 -235732 -255513 -251158 -227975
19257 -227975 -233364 -203525 -177018 -206239 -228075 -253444 -275160 -259758 -269060 -274176 -271215 -214800
19245 -214800 -223850 -229400 -214131 -208084 -218821 -226398 -271652 -280154 -241974 -265696 -272157 -246759 -243824
19232 -243824 -220700 -203561 -168975 -198259 -232430 -234015 -256347 -219813 -213568 -198562 -185828 -205659
19220 -205659 -204844 -193754 -175987 -157187 -135190 -134088 -159399 -215216 -203573 -200023 -256719 -299382
19208 -299382 -258760 -163842 -128121 -140684 -142848 -185504 -218515 -180928 -157754 -194552 -219367 -203674
19196 -203674 -194653 -189921 -230324 -186601 -188302 -204202 -208428 -197205 -209338 -190681 -237401 -197857
19184 -197857 -188035 -189567 -175895 -185642 -207639 -168696 -153526 -177535 -159089 -149577 -181725 -181255 -166857
$$ packed form
19269b05067Q540j0720k5507j3137l0126J4200K0792J3653q360j9781M355K3183
19257b27975n389K9839K6507k9221k1836k5369k1716J5402r302n116K961N6415
19245b14800r050n550J5269O047j0737p577m5254q502L8180k3722o461K5398K935
19232b43824K3124J7139L4586k9284l4171j585k2332L6534O245J5006J2734j9831
19220b05659Q15J1090J7767J8800K1997J102k5311n5817J1643L550n6696m2663
19208b99382M0622R4918L5721j2563k164m2656l3011L7587K3174l6798k4815J5693
19196b03674R021M732m0403M3723j701j5900m226J1223j2133J8657m6720L9544
19184a97857R822j532J3672r747k1997L8943J5170k4009J8446R512l2148M70J4398
$$ plain form
19171 -166857 -165069 -183146 -205461 -214494 -173836 -157043 -199111 -212634 -230378 -248071 -247708 -217906
19159 -217906 -196920 -206316 -203527 -180004 -178215 -222724 -242428 -232067 -253013 -208359 -151684 -152143
19147 -152143 -160929 -151286 -139132 -131948 -152066 -177480 -190468 -209146 -240627 -241557 -163971 -139220
19135 -139220 -135928 -163675 -154174 -137336 -129889 -94150 -82581 -52254 -96133 -179087 -211378 -215019
19123 -215019 -157730 -154415 -156634 -157524 -181111 -159397 -145146 -176166 -192406 -214306 -197308 -169062
19111 -169062 -168370 -146781 -162873 -157417 -187303 -209787 -216179 -219342 -241381 -274600 -275412 -239279 -189302
19098 -189302 -179474 -226394 -245447 -250276 -271855 -255626 -212789 -177658 -164751 -177284 -165666 -140918
19086 -140918 -122947 -142003 -155973 -200206 -222176 -194301 -223023 -185452 -195372 -196585 -200416 -223168
$$ packed form
19171a66857J788j8077k2315r033M0658J6793m2068j3523j7744j7693L63K9802
19159b17906K0986r396K789K3523J789m4509j9704J0361k0946M4654N6675m59
19147a52143q786R643J2154P184k0118k5414j2988j8678l1481r30P7586K4751
19135a39220L292k7747R501J6838P447L5739J1569L0327m3879q2954l2291l641
19123b15019N7289L315k219q90k3587K1714J4251l1020j6240k1900J6998K8246
19111a69062O92K1589j6092N456k9886k2484o392l163k2039l3219q12L6133M9977
19098a89302R828m6920j9053m829k1579J6229M2837L5131J2907j2533J1618K4748
19086a40918J7971j9056j3970m4233k1970K7875k8722L7571r920j213l831k2752
$$ plain form
19074 -223168 -220662 -223965 -229051 -233008 -239348 -242498 -213969 -221306 -235883 -231182 -221365 -205992 -204907
19061 -204907 -217240 -233345 -203365 -169453 -169226 -177721 -142935 -131905 -163967 -175954 -168527 -162424
19049 -162424 -180947 -201892 -202987 -228231 -229210 -202204 -211826 -218612 -196004 -159336 -160229 -154198 -120049
19036 -120049 -125752 -134190 -131836 -111790 -150912 -199172 -205067 -187657 -171690 -159081 -148296 -174193
19024 -174193 -200401 -128388 -132109 -153033 -161527 -128189 -144863 -156068 -150275 -151671 -127201 -112739
19012 -112739 -65372 -52004 -69720 -64820 -79630 -108080 -179351 -210999 -206976 -228095 -219049 -191989
19000 -191989 -195489 -183260 -187221 -187986 -186343 -187947 -184355 -203348 -221525 -198143 -163326 -182370 -181409
18987 -181409 -173640 -190456 -205423 -217759 -219117 -221522 -217461 -237786 -239618 -225606 -256025 -217011
$$ packed form
19074b23168K506l303n086l957o340l150K8529p337j4577M701R817J5373J085
19061b04907j2333j6105K9980L3912K27q495L4786J1030l2062j1987P427O103
19049a62424j8523k0945j095k5244r79K7006r622o786K2608L6668q93O031L4149
19036a20049n703q438K354K0046l9122m8260n895J7410J5967J2609J0785k5897
19024a74193k6208P2013l721k0924q494L3338j6674j1205N793j396K4470J4462
19012a12739M7367J3368j7716M900j4810k8450p1271l1648M023k1119R046K7060
19000a91989l500J2229l961p65J643j604L592j8993j8177K3382L4817j9044R61
18987a81409P769j6816j4967j2336j358k405M061k0325j832J4012l0419L9014
$$ plain form
18975 -217011 -199948 -188585 -198645 -184338 -151633 -147822 -147481 -135361 -150490 -166780 -173867 -135072
18963 -135072 -126765 -144475 -134750 -160373 -145543 -116027 -101405 -148381 -179670 -158711 -111375 -123014
18951 -123014 -144901 -154134 -147983 -109507 -87176 -119817 -130439 -140465 -158597 -140741 -130320 -132390
18939 -132390 -207996 -232344 -186475 -157712 -157141 -180759 -153613 -120947 -93207 -89842 -94293 -138301
18927 -138301 -191204 -160518 -138747 -123833 -84774 -74635 -84553 -93389 -89769 -88804 -56545 -63511 -106559
18914 -106559 -130743 -157470 -156669 -122273 -117695 -113541 -97402 -124376 -116955 -141646 -173805 -171850 -120395
18901 -120395 -117116 -164614 -168466 -134260 -90294 -78145 -33324 -55553 -100494 -120177 -121051 -121033 -80473
18888 -80473 -77113 -66447 -18945 -40768 -73390 -75246 -82334 -80584 -121383 -118727 -82661 -110353 -123082
$$ packed form
18975b17011J7063J1363j0060J4307L2705L811L41J2120j5129j6290p087L8795
18963a35072Q307j7710R725k5623J4830K9516J4622m6976l1289K0959M7336j1639
18951a23014k1887r233O151L8476K2331l2641j0622j0026j8132J7856J0421k070
18939a32390p5606k4348M5869K8763N71k3618K7146L2666K7740L365m451m4008
18927a38301n2903L0686K1771J4914L9059J0139r918q836L620R65L2259o966m3048
18914a06559k4184k6727Q01L4396M578M154J6139k6974P421k4691l2159J955N1455
18901a20395L279m7498l852L4206M3966J2149M4821k2229m4941j9683q74J8M0560
18888h0473L360J0666M7502k1823l2622j856p088J750m0799K656L6066k7692j2729
$$ plain form
18875 -123082 -128888 -103215 -99938 -102619 -102058 -97773 -75784 -83565 -76646 -60148 -46925 -45870 -46579 -83246
18861 -83246 -118368 -109952 -78640 -61194 -49670 -36596 -40010 -114407 -138793 -111688 -64745 -74420
18849 -74420 -64990 -69479 -68222 -55713 -19051 6958 -43770 -64506 -43215 -49911 -69720 -72874 -43631
18836 -43631 -17685 -38838 -42693 18868 1358 -54711 -80524 -47020 22781 44927 13130 -32367
18824 -32367 -21658 11015 -5243 -46206 -67381 -36028 -56446 -66068 -41686 -44473 -65147 -70304
18812 -70304 -54992 -64996 -92669 -93952 -154120 -184806 -139284 -153771 -134172 -68800 -6651 18
18800 18 -2158 14460 76 -48265 -71822 -79715 -63875 -79584 -76767 -90318 -74982 -63962 -83690
18787 -83690 -97188 -101064 -94487 -90584 -91397 -88076 -83623 -129101 -156202 -143070 -56469 36904 47695
$$ packed form
18875a23082n806K5673L277k681N61M285K1989p781O919J6498J3223J055p09l6667
18861h3246l5122Q416L1312J7446J1524J3074l414p4397k4386K7105M6943r675
18849g4420R430m489J257J2509L6662K6009n0728k0736K1291o696j9809l154K9243
18836d3631K5946k1153l855O1561j7510n6069k5813L3504O9801K2146l1797m5497
18824c2367J0709L2673j6258m0963k1175L1353k0418r622K4382k787k0674n157
18812g0304J5312j0004k7673j283o0168l0686M5522j4487J9599O5372O2149O669
18800A8k176J6618j4384m8341k3557p893J5840j5709K817j3551J5336J1020j9728
18787h3690j3498l876O577L903q13L321M453m5478k7101J3132Q6601R3373J0791
$$ plain form
18774 47695 8898 -24486 -11565 35093 63859 56255 54268 14806 36571 73275 95980 77002
18762 77002 59013 45992 25371 -7954 -14450 41633 28830 -2779 -15663 -736 -6800 -21045
18750 -21045 -12912 6149 -2677 6820 -10173 -4973 -50009 -78112 -51290 -34008 -21726 -12773 16857
18737 16857 23939 49771 96472 65539 -3918 11401 43668 46207 22986 15305 6638 14420 21093
18724 21093 35424 26731 30821 37166 28657 29131 6841 -15838 -23220 -37978 -8073 26473 45060
18711 45060 59803 45104 13371 13213 11192 35388 32900 12559 24704 27755 53721 48530 49267
18698 49267 55921 78867 89177 74212 38732 -2369 -48610 -60509 -51361 5549 16001 40255
18686 40255 71214 76937 46937 27662 11811 20943 9115 -40471 -47933 -51020 -63203 -41600
$$ packed form
18774D7695l8797l3384J2921M6658K8766p604j987l9462K1765L6704K2705j8978
18762G7002j7989j3021k0621l3325o496N6083j2803l1609j2884J4927o064j4245
18750b1045Q133J9061q826R497j6993N200m5036k8103K6822J7282J2282Q953K9630
18737A6857P082K5832M6701l0933o9457J5319L2267K539k3221p681q667P782O673
18724B1093J4331q693M090O345q509M74k2290k2679p382j4758K9905L4546J8587
18711D5060J4743j4699l1733j58k021K4196k488k0341J2145L051K5966n191P37
18698D9267O654K2946J0310j4965l5480m1101m6241j1899R148N6910J0452K4254
18686D0255L0959N723l0000j9275j5851R132j1828m9586p462l087j2183K1603
$$ plain form
18674 -41600 -23333 -17723 306 26441 82628 118210 84228 88695 94961 45602 13041 -18233
18662 -18233 -69781 -66575 -54861 -34455 -15110 5160 34365 48021 56490 13167 5955 21084
18650 21084 -5639 -10827 -42368 -24097 -5941 32147 45576 23785 17753 -7284 2280 -18758
18638 -18758 -37171 -35088 -9941 4624 7074 27854 25948 43379 72339 57244 82751 99874
18626 99874 112809 66715 52184 62014 40001 9432 -14218 -31085 -54881 -39100 -6267 33343
18614 33343 54373 52641 75297 90358 61352 74765 54466 59973 43991 11422 26050 20560
18602 20560 32328 46561 47183 51465 44564 24037 22691 23346 40781 93721 78365 39006 8132
18589 8132 -19136 -35928 14034 31177 16046 71649 68194 99307 102237 94198 127560 127465 121536
$$ packed form
18674d1600J8267N610J8029K6135N6187L5582l3982M467O266m9359l2561l1274
18662a8233n1548L206J1714K0406J9345K0270K9205J3656Q469m3323p212J5129
18650B1084k6723n188l1541J8271J8156L8088J3429k1791o032k5037R564k1038
18638a8758j8413K083K5147J4565K450K0780j906J7431K8960j5095K5507J7123
18626I9874J2935m6094j4531R830k2013l0569k3650j6867k3796J5781L2833L9610
18614C3343K1030j732K2656J5061k9006J3413k0299N507j5982l2569J4628n490
18602B0560J1768J4233O22M282o901k0527j346O55J7435N2940j5356l9359l0874
18589H132k7268j6792M9962J7143j5131N5603l455L1113K930q039L3362r5n929
$$ plain form
18576 121536 102213 106163 115292 88991 82951 95483 96185 88349 55560 63147 47004 51217 48706
18563 48706 79478 84245 110640 89103 63817 94926 94471 67101 64293 70237 90002 42157 -3627
18550 -3627 27608 72347 102762 139455 103895 91298 70837 57484 111285 143069 120108 95856
18538 95856 83460 94862 98056 98749 74880 80066 73263 83907 51878 45980 35445 15812 22727
18525 22727 84918 156637 188742 146827 148178 129376 76803 98029 83726 14346 -9085 28542
18513 28542 19255 11518 28249 59968 75167 73970 68013 71555 31314 36019 66008 74100 80542
18500 80542 50590 33095 31098 17699 -17958 -6750 30691 106976 84444 21078 29990 67016
18488 67016 82693 99265 89816 86272 71705 88074 101810 115476 128846 136314 116419 97262
$$ packed form
18576A21536j9323L950R129k6301o040J2532P02p836l2789P587j6143M213k511
18563D8706L0772M767K6395k1537k5286L1109m55k7370k808N944J9765m7845m5784
18550c627L1235M4739L0415L6693l5560j2597k0461j3353N3801L1784k2961k4252
18538I5856j2396J1402L194O93k3869N186o803J0644l2029n898j0535j9633O915
18525B2727O2191P1719L2105m1915J351j8802n2573K1226j4303o9380k3431L7627
18513B8542r287p737J6731L1719J5199j197n957L542m0241M705K9989Q092O442
18500H0542k9952j7495j997j3399l5657J1208L7441P6285k2532o3366Q912L7026
18488F7016J5677J6572r449l544j4567J6369J3736J3666J3370P468j9895j9157
$$ plain form
18476 97262 95133 104101 99562 108351 133977 101741 87250 100939 134329 132651 118077 106999 110714
18463 110714 109201 62621 39202 41422 62430 40643 28978 35326 35538 73368 88890 93183 80450
18450 80450 40989 25215 20310 49179 111269 115864 119906 65179 59315 63368 86706 147488 110293
18437 110293 95942 112573 138619 165426 149435 149090 171273 176462 162279 112385 102204 91298
18425 91298 79676 31755 35613 59751 57795 52318 55074 76646 88504 73663 70979 79018 97960
18412 97960 75500 20778 41008 97852 87714 87204 66667 65847 58007 48227 82363 83144 45715
18399 45715 30780 17652 54110 97263 60729 45387 97003 42866 31344 37452 26617 41766
18387 41766 67082 59146 58759 55907 64763 99375 64871 24666 55885 61558 57023 50145 52464
$$ packed form
18476I7262k129Q968m539Q789K5626l2236j4491J3689L3390j678j4574j1078L715
18463A10714j513m6580k3419K220K1008k1787j1665O348K12L7830J5522M293j2733
18450H0450l9461j5774m905K8869O2090M595M042n4727n864M053K3338O0782l7195
18437A10293j4351J6631K6046K6807j5991l45K2183N189j4183m9894j0181j0906
18425I1298j1622m7921L858K4138j956n477K756K1572J1858j4841k684Q039J8942
18412I7960k2460n4722K0230N6844j0138n10k0537q20p840r780L4136P81l7429
18399D5715j4935j3128L6458M3153l6534j5342N1616n4137j1522O108j0835J5149
18387D1766K5316p936l87k852Q856L4612l4504m0205L1219N673m535o878K319
$$ plain form
18374 52464 60617 89456 90745 74337 29461 44029 71228 55170 28439 41105 35243 29861
18362 29861 41802 32765 53481 64524 63738 35819 67999 72099 45838 53090 51598 38323 4410
18349 4410 10512 31874 41189 62492 47926 55230 99691 124500 101437 100106 89078 62133 54184
18336 54184 77624 44391 -4784 -7959 19131 41378 61374 48158 10704 23933 -15896 -13781
18324 -13781 20930 59397 74927 88961 96572 64536 49413 38989 47636 60076 41779 13665
18312 13665 19074 48706 43012 72319 81081 114376 131218 115471 99017 74475 69745 75440 66679
18299 66679 88731 85148 90437 85383 65121 80535 122586 109068 125037 130075 119183 120430 111672
18286 111672 69877 58932 17339 11356 41483 14688 8655 70156 113552 65054 68308 78715
$$ packed form
18374E2464Q153K8839J289j6408m4876J4568K7199j6058k6731J2666n862n382
18362B9861J1941r037K0716J1043p86k7919L2180M100k6261P252j492j3275l3913
18349D410O102K1362R315K1303j4566P304M4461K4809k3063j331j1028k6945p949
18336E4184K3440l3233m9175l175K7090K2247J9996j3216l7454J3229l9829K115
18324a3781L4711L8467J5530J4034P611l2036j5123j0424Q647J2440j8297k8114
18312A3665N409K9632n694K9307Q762L3295J6842j5747j6454k4542m730N695q761
18299F6679K2052l583N289n054k0262J5414M2051j3518J5969N038j0892J247q758
18286A11672m1795j0945m1593n983L0127k6795o033O1501M3396m8498L254J0407
$$ plain form
18274 78715 56102 1056 12251 42667 61699 62614 78419 58621 76407 123899 113744 99739
18262 99739 117128 100423 91031 113966 66817 26060 52280 32494 25785 4734 31585 40197
18250 40197 44431 32166 1171 10348 29509 32144 35026 69838 70847 57019 56438 82020 40367
18237 40367 45669 21206 -19363 -33780 -37523 -7786 50285 87117 74720 118523 113221 104443
18225 104443 85937 61299 11997 21080 51594 91239 74193 34458 -20045 -21343 9642 54770
18213 54770 85755 60757 64003 52741 49217 54337 50860 71764 40192 7143 12644 53573 34766
18200 34766 32416 69784 52338 17728 -382 -20024 3587 9646 30683 52311 42784 34559
18188 34559 21041 37189 23226 34219 37555 31545 22939 56171 77870 71374 51836 52444 33626
$$ packed form
18274G8715k2613n5046J1195L0416J9032R15J5805j9798J7786M7492j0155j4005
18262I9739J7389j6705r392K2935m7149m0757K6220j9786o709k1051K6851Q612
18250D0197M234j2265l0995R177J9161K635K882L4812J009j3828n81K5582m1653
18237D0367N302k4463m0569j4417l743K9737N8071L6832j2397M3803n302q778
18225A04443j8506k4638m9302R083L0514L9645j7046l9735n4503j298L0985M5128
18213E4770L0985k4998L246j1262l524N120l477K0904l1572l3049N501M0929j8807
18200C4766k350L7368j7446l4610j8110j9642K3611O059K1037K1628r527q225
18188C4559j3518J6148j3963J0993L336o010q606L3232K1699o496j9538O08j8818
$$ plain form
18175 33626 35571 58428 24508 9658 2851 15455 -1221 8350 67896 96321 149099 148516 152828
18162 152828 187902 184499 154086 157918 175293 186048 193792 241454 284861 301479 300144 371833
18150 371833 413793 448945 424805 343850 243478 262471 286822 241603 230062 220181 212634 189656
18138 189656 155801 131101 153562 129093 103595 106258 137782 134614 141519 115358 85504 115706
18126 115706 107238 78219 85284 110064 106269 87971 100609 84113 68761 99825 57747 34180
18114 34180 17731 19450 19925 4069 -10803 -13357 -7368 -22855 -2034 43952 41676 42310 46858
18101 46858 78684 57825 30556 41124 36187 70784 102144 84931 87586 136362 98471 62911
18089 62911 80639 61675 41150 43537 49663 20337 -14047 -13254 58609 91323 49331 66707
$$ packed form
18175C3626J945K2857l3920j4850o807J2604j6676R571N9546K8425N2778n83M312
18162A52828L5074l403l0413L832J7375J0755P744M7662M3407J6618j335P1689
18150C71833M1960L5152k4140q0955j00372J8993K4351m5219j1541r881p547k2978
18138A89656l3855k4700K2461k4469k5498K663L1524l168O905k6161k9854L0202
18126A15706q468k9019P065K4780l795j8298J2638j6496j5352L1064m2078k3567
18114C4180j6449J719M75j5856j4872k554N989j5487K0821M5986k276O34M548
18101D6858L1826k0859k7269J0568m937L4597L1360j7213K655M8776l7891l5560
18089F2911J7728j8964k0525K387O126k9326l4384P93P1863L2714m1992J7376
$$ plain form
18077 66707 78007 67382 76382 55583 34159 56719 80418 68998 69139 106666 119296 129913
18065 129913 168326 172359 154897 124899 103752 120235 104696 78912 49971 28518 9572 52395
18053 52395 83217 93649 92857 80206 42381 32193 63495 82310 60960 72228 93662 77084
18041 77084 72693 115106 133275 123094 109166 116012 94707 81394 99452 110979 90276 72061
18029 72061 83001 60716 61151 44855 6849 -29504 -42311 -18522 1593 38798 35978 33978
18017 33978 29044 24403 22690 75612 101702 61640 74214 88779 71985 11628 31054 53027
18005 53027 50931 58368 72499 51756 44422 71512 70496 59013 44566 48651 35473 17241 -1777
17992 -1777 34027 51163 65775 14702 29851 47094 28161 27572 29912 65434 69341 38808 51506
$$ packed form
18077F6707J1300j0625R000k0799k1424K2560K3699j1420J41L7527J2630J0617
18065A29913L8413M033j7462k9998k1147J6483j5539k5784k8941k1453j8946M2823
18053E2395L0822J0432p92j2651l7825j0188L1302J8815k1350J1268K1434j6578
18041G7084m391M2413J8169j0181j3928O846k1305j3313J8058J1527k0703j8215
18029G2061J0940k2285M35j6296l8006l6353j2807K3789K0115L7205k820k000
18017C3978m934m641j713N2922K6090m0062J2574J4565j6794o0357J9426K1973
18005E3027k096P437J4131k0743p334K7090j016j1483j4447M085j3178j8232j9018
17992a777L5804J7136J4612n1073J5149J7243j8933n89K340L5522L907l0533J2698
$$ plain form
17979 51506 64042 11972 14642 -32205 -33121 41813 62576 47147 47032 35697 36300 34212 53438
17966 53438 52516 59246 26308 37697 64778 56682 39999 24542 79454 96782 108197 79948
17954 79948 23094 -3791 -48396 -42031 -13615 11228 40367 41104 103350 145334 144805 121059 94942
17941 94942 80557 88407 95139 89891 54755 29545 92231 89993 37180 49872 37804 29895 11727
17928 11727 5378 70998 98112 98693 98588 80845 66700 49886 23097 38550 35026 65729 54548
17915 54548 38836 94143 142628 115774 121980 115110 137701 134800 145060 114142 62220 45556
17903 45556 59548 109623 91107 56825 73039 63761 41050 21306 6996 42879 48364 53400
17891 53400 50236 73330 44975 35270 47328 21754 14933 28151 48254 51805 61079 75170 52327
$$ packed form
17979E1506J2536n2070K670m6847r16P4934K0763j5429j15j1335O03k088J9226
17966E3438r22O730l2938J1389K7081q096j6683j5457N4912J7328J1415k8249
17954G9948n6854k6885m4605O365K8416K4843K9139P37O2246M1984n29k3746k6117
17941I4942j4385P850O732n248l5136k5210O2686k238n2813J2692j2068p909j8168
17928A1727o349O5620K7114N81j05j7743j4145j6814k6789J5453l524L0703j1181
17915E4548j5712N5307M8485k6854O206o870K2591k901J0260l0918n1922j6664
17903D5556J3992N0075j8516l4282J6214r278k2711j9744j4310L5883N485N036
17891E3400l164K3094k8355r705J2058k5574o821J3218K0103L551R274J4091k2843
$$ plain form
17878 52327 14512 -15326 12073 27827 45863 56905 42870 51067 40563 44762 59586 27575
17866 27575 33605 72820 47333 37702 72388 72589 85494 82600 91489 86777 85317 68054 68974 84351
17852 84351 37326 60189 100096 108928 95331 72348 73619 45746 29081 58021 59995 72499
17840 72499 51643 65006 95465 110355 134626 122328 108906 89446 122017 138000 150544 202532
17828 202532 267017 338477 399554 402724 399449 407183 370287 307624 305282 281604 245186 230186
17816 230186 179269 118589 99196 75884 97871 114918 110032 72061 71358 40845 33943 74212
17804 74212 91823 83278 56188 25076 21860 87815 59636 -1002 -12344 25599 41825 47527
17792 47527 -2335 -22713 -34661 -47262 -16875 43665 104526 100582 59978 61169 39624 94135
$$ packed form
17878E2327l7815k9838K7399J5754J8036J1042j4035Q197j0504M199J4824l2011
17866B7575O030L9215k5487r631L4686K01J2905k894Q889m712j460j7263R20J5377
17852H4351m7025K2863L9907Q832j3597k2983J271k7873j6665K8940J974J2504
17840G2499k0856J3363L0459J4890K4271j2298j3422j9460L2571J5983J2544N1988
17828B02532O4485P1460O1077L170l275P734l6896o2663k342k3678l6418j5000
17816B30186n0917o0680j9393k3312K1987J7047m886l7971p03l0513o902M0269
17804G4212J7611q545k7090l1112l216O5955k8179o0638j1342L7943J6226N702
17792D7527m9862k0378j1948j2601L0387O0540O0861l944m0604J191k1545N4511
$$ plain form
17780 94135 98301 52719 48126 86242 113397 82674 49956 15830 -11514 -36638 9168 20925
17768 20925 50827 44972 59648 55710 78956 93238 6562 -8660 21144 21875 13448 -459 -6160
17755 -6160 8578 43075 55957 33882 30947 45645 59576 46536 51255 43007 36948 64021 103833
17742 103833 112664 79594 32729 13236 55344 18236 -22322 2007 73239 86722 73348 66740
17730 66740 51509 31397 11432 23788 42074 35491 5082 3759 19742 29640 21467 39850
17718 39850 24394 27827 39253 39903 35656 104207 56546 21291 46782 60229 60613 90641 86466
17705 86466 72120 48068 22664 34017 63142 56799 27259 36846 14939 -25286 -25987 -26650 -26536
17692 -26536 -4212 23848 38877 93116 85878 58866 60477 65827 59463 90669 71392 36319
$$ packed form
17780I4135M166m5582m593L8116K7155l0723l2718l4126k7344k5124M5806J1757
17768B0925K9902n855J4676l938K3246J4282q6676j5222K9804P31q427j3907n701
17755f160J4738L4497J2882k2075k935J4698J3931j3040M719q248o059K7073L9812
17742A03833Q831l3070m6865j9493M2108l7108m0558K4329P1232J3483j3374o608
17730F6740j5231k0112j9965J2356J8286o583l0409j323J5983R898q173J8383
17718C9850j5456L433J1426O50m247O8551m7661l5255K5491J3447L84L0028m175
17705H6466j4346k4052k5404J1353K9125o343k9540R587k1907m0225p01o63J14
17692b6536K2324K8060J5029N4239p238k7012J611N350o364L1206j9277l5073
$$ plain form
17680 36319 -5965 -43424 -82664 -61896 -19402 -24470 1714 26073 45769 35526 28967 44287
17668 44287 51377 3030 -43569 -63076 -49417 5210 59656 60551 37432 35734 19469 18856 42350
17655 42350 38761 30921 15925 24255 53603 36414 34084 61357 37554 16672 17098 15790 24442
17642 24442 51085 84063 98918 121218 59184 9769 24319 27268 19164 21065 64648 66444
17630 66444 47970 68666 71948 70985 85320 48866 23850 -9185 -26314 -44589 -43604 -6174 37115
17617 37115 26923 18044 11582 62368 109326 101978 47859 4239 -7304 26502 59151 91482
17605 91482 90889 80975 90657 89190 78913 94336 66507 42004 51343 49670 20878 5999 37623
17592 37623 92337 142048 109530 71566 24861 21911 28582 37442 17083 38296 50533 73048
$$ packed form
17680C6319m2284l7459l9240K0768M2494n068K6184K4359J9696j0243o559J5320
17668D4287P090m8347m6599j9507J3659N4627N4446Q95k3119j698j6265o13K3494
17655D2350l589p840j4996Q330K9348j7189k330K7273k3803k0882M26j308Q652
17642B4442K6643L2978J4855K2300o2034m9415J4550K949q104J901M3583J796
17630F6444j8474K0696L282r63J4335l6454k5016l3035j7129j8275R85L7430M3289
17617C7115j0192q879o462N0786M6958p348n4119m3620j1543L3806L2649L2331
17605I1482n93r914R682j467j0277J5423k7829k4503R339j673k8792j4879L1624
17592C7623N4714M9711l2518l7964m6705k950O671Q860k0359K1213J2237K2515
$$ plain form
17580 73048 81874 26699 -10111 -7117 -9045 28886 43563 17879 20504 47091 77591 100284
17568 100284 81661 22699 26257 46090 8786 -2762 -2829 10956 -13 2428 25529 34216 44193
17555 44193 96001 78694 76525 62185 46790 44316 13847 -10625 -30500 -9744 28412 36805
17543 36805 57486 63738 30294 15238 20306 46437 43605 31919 22575 21986 40563 29311 47332
17530 47332 55110 53877 36535 54186 57064 41982 63334 59942 63480 90204 87286 77266 36681
17517 36681 19990 64078 82531 107886 92454 78461 67514 128337 143185 179672 192757 213978
17505 213978 255120 286181 334645 335745 353714 330639 289139 264629 222517 168644 149456 104824
17493 104824 66256 65238 87431 60830 45671 63664 37634 17693 58098 126006 147607 157377
$$ packed form
17580G3048Q826n5175l6810K994j928L7931J4677k5684K625K6587L0500K2693
17568A00284j8623n8962L558J9833l7304j1548o7J3785j0969K441K3101Q687R977
17555D4193N1808j7307k169j4340j5395k474l0469k4472j9875K0756L8156Q393
17543C6805K0681O252l3444j5056N068K6131k832j1686r344n89J8577j1252J8021
17530D7332P778j233j7342J7651K878j5082K1352l392L538K6724k918j0020m0585
17517C6681j6691M4088J8453K5355j5432j3993j0947O0823J4848L6487J3085K1221
17505B13978M1142L1061M8464J100J7969k3075m1500k4510m2112n3873j9188m4632
17493A04824l8568j018K2193k6601j5159J7993k6030j9941M0405O7908K1601R770
$$ plain form
17481 157377 131862 112811 78123 50279 38407 36032 35523 56152 45558 15678 -16220 -17420
17469 -17420 -4911 2923 -8136 10414 3732 8022 44138 20660 21679 53940 64945 57271 51175
17456 51175 14845 39526 46298 67033 38071 33428 9455 -5488 -10458 -9300 26689 31455 50095
17443 50095 46771 41038 47361 35178 46284 60757 61212 67609 71660 61986 61800 59836 119770 106539
17429 106539 80861 104155 133858 142427 121747 140679 154492 106866 55997 64225 38820 13393
17417 13393 24018 33229 29262 22308 -11992 -43334 -69645 -88538 -33624 -8484 -9543 -40365
17405 -40365 -52465 -34542 -27011 9081 26769 16090 25255 45266 57450 19085 -18702 -20180
17393 -20180 -6304 -14604 30618 38921 -8661 -28820 -35987 -51517 -27360 38142 29825 46225
$$ packed form
17481A57377k5515j9051l4688k7844j1872k375n09K0629j0594k9880l1898j200
17469a7420J2509P834j1059J8550o682M290L6116k3478J019L2261J1005p674o096
17456E1175l6330K4681O772K0735k8962m643k3973j4943m970J158L5989M766J8640
17443E0095l324n733O323j2183J1106J4473M55O397M051r674j86j964N9934j3231
17429A06539k5678K3294K9703Q569k0680J8932J3813m7626n0869Q228k5405k5427
17417A3393J0625R211l967o954l4300l1342k6311j8893N4914K5140j059l0822
17405d0365j2100J7923P531L6092J7688j0679R165K0011J2184l8365l7787j478
17393b0180J3876q300M5222Q303m7582k0159p167j5530K4157O5502q317J6400
$$ plain form
17381 46225 40661 15583 17570 20027 1882 -22296 -36088 -37716 18310 47127 19994 -4075
17369 -4075 24094 60277 109975 143464 133906 138379 119865 102491 54293 48471 61314 73937
17357 73937 31461 12669 8024 47734 74772 35265 17907 17094 24861 6004 -15571 -20500 6308
17344 6308 49832 92823 69519 39409 24967 13687 37890 57576 48898 -11414 -34393 -14280
17332 -14280 15020 30800 44868 72879 40369 34731 40043 27026 46263 30652 15693 70474
17320 70474 106931 79319 78623 70537 67445 65338 77550 96386 35219 -17999 -19048 -543 7909
17307 7909 29996 17921 13356 34987 37043 37442 36225 25345 -2469 291 4244 15933 33600
17294 33600 78284 83888 55694 33365 16152 980 -9715 -14154 9751 27101 1555 -21990
$$ packed form
17381D6225n564k5078J987K457j8145k4178j3792j628N6026K8817k7133k4069
17369d075K8169L6183M9698L3489r558M473j8514j7374m8198n822J2843J2623
17357G3937m2476j8792m645L9710K7038l9507j7358q13P767j8857k1575m929K6808
17344F308M3524M2991k3304l0110j4442j1280K4203J9686q678o0312k2979K0113
17332a4280K9300J5780J4068K8011l2510n638N312j3017J9237j5611j4959N4781
17320G0474L6457k7612o96q086l092k107J2212J8836o1167n3218j049J8505Q452
17307G909K2087j2075m565K1631K056L99j217j0880k7814K760L953J1689J7667
17294C3600M4684N604k8194k2329j7213j5172j0695m439K3905J7350k5546k3545
$$ plain form
17282 -21990 57104 46765 39394 44001 40313 22467 36944 66359 84834 77383 45373 32114
17270 32114 27623 2551 -5266 -9897 -22542 4795 42207 38252 46644 45342 11421 30007 28321
17257 28321 35358 58094 64827 85582 79484 45990 85459 110637 65779 61100 56233 8020 -16425
17244 -16425 -23895 -11564 -7202 -35320 32945 93060 85252 40538 7490 4565 5137 -924 8610
17231 8610 -19011 -36673 -61953 -49400 20726 32558 -13672 -23037 -22485 27800 46421 52242 39764
17218 39764 13420 19418 -4024 17190 48097 61214 86309 71034 -6199 -43272 -11445 -8965
17206 -8965 -49358 -53777 -43874 -17608 -6104 9459 40083 23713 8606 -11189 -39961 -17160
17194 -17160 14213 -32229 -85051 -94407 -49757 6777 700 9461 19998 -16603 -4172 19218
$$ packed form
17282b1990P9094j0339p371M607l688j7846J4477K9415J8475p451l2010j3259
17270C2114m491k5072p817m631j2645K7337L7412l955Q392j302l3921J8586j686
17257B8321P037K2736O733K0755o098l3494L9469K5178m4858m679m867m8213k4445
17244a6425p470J2331M362k8118O8265O0115p808m4714l3048k925N72o061R534
17231H610k7621j7662k5280J2553P0126J1832m6230r365N52N0285J8621N821j2478
17218C9764k6344N998k3442K1214L0907J3117K5095j5275p7233l7073L1827K480
17206h965m0393m419R903K6266J1504J5563L0624j6370j5107j9795k8772K2801
17194a7160L1373m6442n2822r356M4650N6534o077Q761J0537l6601J2431K3390
$$ plain form
17182 19218 -11264 -69204 -108276 -100386 -87755 -74827 -62258 -59347 -84334 -82654 -68205 -59663
17170 -59663 -51919 -37798 -27170 -19359 43611 36078 30284 36371 43165 29030 23128 40141 22669
17157 22669 20936 12382 -12028 -27693 111 25094 21088 -10029 -3394 -3769 14284 22568 4166
17144 4166 -38165 -32420 -31826 -21812 -20237 2601 728 -1189 -11521 22702 39391 35698 49532
17131 49532 62647 28975 15236 -25932 -8463 -16386 -20431 6724 -6568 2254 -6528 -31622
17119 -31622 3572 73381 98014 71944 37452 29019 47362 -4051 -20587 -26100 -14020 -25778
17107 -25778 -49194 -36017 -10246 -50273 -65785 -39047 -9495 703 -7895 7246 29471 -20337
17095 -20337 -57971 -53803 -42552 24000 38886 30882 33385 16086 -6123 -19174 -7659 1745
$$ packed form
17182A9218l0482n7940l9072P890J2631J2928J2569K911k4987J680J4449Q542
17170e9663P744J4121J0628P811O2970p533n794O087O794j4135n902J7013j7472
17157B2669j733q554k4410j5665K7804K4983m006l1117O635l75J8053Q284j8402
17144D166m2331N745N94J0014J575K2838j873j917j0332L4223J6689l693J3834
17131D9532J3115l3672j3739m1168J7469p923m045K7155j3292Q822q782k5094
17119c1622L5194O9809K4633k6070l4492q433J8343n1413j6536n513J2080j1758
17107b5778k3416J3177K5771m0027j5512K6738K9552J0198q598J5141K2225m9808
17095b0337l7634M168J1251O6552J4886q004K503j7299k2209j3051J1515R404
$$ plain form
17083 1745 -39446 -21284 -9772 -20016 -61105 -81217 -49818 -29856 -25894 -39142 11378 59916
17071 59916 54500 64382 62929 44498 17533 47088 45692 20878 -1380 8942 -20130 -23641 14759
17058 14759 5226 -35752 -26507 31476 35655 14433 9385 18523 -20602 -17159 704 -6565 5837
17045 5837 9308 -25954 113 12637 7522 -14898 -28203 26239 44725 22862 -846 19873
17033 19873 33781 45701 -7526 15590 17880 -4984 11681 14233 -27791 -21937 -38004 -16299
17021 -16299 49381 52519 57252 50651 16425 4915 11743 15679 -17382 3754 3881 -8193 30209
17008 30209 57899 61449 75884 68109 44854 -1045 -18232 -14009 -8223 10627 1658 457 14049
16995 14049 42524 -5594 -47241 -22205 -10131 -27432 -6156 -5238 -37757 -55657 -75713 -97950
$$ packed form
17083A745m1191J8162J1512j0244m1089k0112L1399J9962L962j3248N0520M8538
17071E9916n416R882j453j8431k6965K9555j396k4814k2258J0322k9072l511L8400
17058A4759r533m0978R245N7983M179k1222n048R138l9125L443J7863p269J2402
17045E837L471l5262K6067J2524n115k2420j3305N4442J8486k1863k3708K0719
17033A9873J3908J1920n3227K3116K290k2864J6665K552m2024N854j6067K1705
17021a6299O5680L138M733o601l4226j1510O828L936l3061K1136J27j2074L8402
17008C0209K7690L550J4435p775k3255m5899j7187M223N786J8850q969j201J3592
16995A4049K8475m8118m1647K5036J2074j7301K1276R18l2519j7900k0056k2237
$$ plain form
16983 -97950 -91647 -67601 -64062 -87246 -79015 -45384 -15430 18923 16890 -17498 15116 35823
16971 35823 50950 52030 36721 61742 62564 67580 47134 30156 19027 -18041 -42253 -36509 -14001
16958 -14001 -39861 -99476 -97054 -40545 -15468 -1215 -2118 -2099 -26448 -28101 -8536 -45084 -70975
16945 -70975 -47229 -9996 11458 51519 56003 14525 -38458 -23347 20992 23477 -9154 -23334
16933 -23334 6852 46425 47862 61905 71312 95016 64184 31089 -5850 -967 46901 37452
16921 37452 36543 28616 8467 40263 32977 6764 -13397 -38379 -57783 -27779 -5237 -39163
16909 -39163 -48312 -37957 -61416 -62974 -79351 -65112 -62106 -73973 -89682 -65796 -63063 -53201 -5772
16896 -5772 7647 17610 -11405 -4075 -19592 -17535 -19991 -22528 -37070 -29558 -6129 2657 48285
$$ packed form
16983i7950O303K4046L539k3184Q231L3631K9954L4353k033l4388L2614K0707
16971C5823J5127J080j5309K5021Q22N016k0446j6978j1129l7068k4212N744K2508
16958a4001k5860n9615K422N6509K5077J4253r03J9k4349j653J9565l6548k5891
16945g0975K3746L7233K1454M0061M484m1478n2983J5111M4339K485l2631j4180
16933b3334L0186L9573J437J4043R407K3704l0832l3095l6939M883M7868r449
16921C7452r09p927k0149L1796p286k6213k0161k4982j9404L0004K2542l3926
16909c9163r149J0355k3459j558j6377J4239L006j1867j5709K3886K733R862M7429
16896e772J3419R963k9015P330j5517K057k456k537j4542P512K3429Q786M5628
$$ plain form
16883 48285 13266 -18909 -60491 -37610 -3948 -7065 -5232 -5651 -9622 -3095 6194 30292 22850
16870 22850 19805 5951 -66067 -116951 -84020 -39035 -36613 -17909 17059 2557 -39593 -80794
16858 -80794 -121520 -110701 -62554 -31745 245 13425 1658 -6408 3292 -1184 -39974 -19153
16846 -19153 5984 -28115 -40986 -1432 -16295 -44881 -73469 -56489 1623 49720 32292 15977
16834 15977 20203 1299 -11394 16946 65015 56399 46050 44157 44126 30762 32538 5002 20202
16821 20202 30503 22929 47187 9946 -14006 -50 472 670 35715 43659 31064 12576 21658
16808 21658 20301 58750 82958 100984 90123 59737 70703 61164 72021 42112 22395 21688
16796 21688 16651 22888 40860 18265 -8006 -42361 -24128 -37805 -45300 -42414 -50469 -121 17559
$$ packed form
16883D8285l5019l2175m1582K2881L3662l117J833m19l971O527R289K4098p442
16870B2850l045j3854p2018n0884L2931M4985K422J8704L4968j4502m2150m1201
16858h0794m0726J0819M8147L0809L1990J3180j1767q066R700m476l8790K0821
16846a9153K5137l4099j2871L9554j4863k8586k8588J6980N8112M8097j7428j6315
16834A5977M226j8904j2693K8340M8069q616j0349j893l1j3364J776k7536J5200
16821B0202J0301p574K4258l7241k3952J3956N22J98L5045P944j2595j8488R082
16808B1658j357L8449K4208J8026j0861l0386J0966r539J0857k9909j9717p07
16796B1688n037O237J7972k2595k6271l4355J8233j3677p495K886q055N0348J7680
$$ plain form
16783 17559 -10837 -6667 20496 15902 55175 56499 21296 44642 2029 -7839 21101 21543 -7499
16770 -7499 -35379 1844 -4539 -12232 -8719 -187 -2914 -19715 -10452 -35353 -30397 -25570 -45410
16757 -45410 -64286 -37992 -12033 11577 17058 42829 27647 3431 -9054 11863 17078 21747
16745 21747 40860 1634 -32458 -24638 -21021 -64150 -32482 57583 72263 43196 28854 13746
16733 13746 -9603 -37780 -40586 -33435 -32883 -34397 -51209 -29524 813 -20780 9218 26650 5808
16720 5808 -45586 -42142 1402 -9195 -15070 -13184 43758 64365 56354 39671 7482 17772 66300
16707 66300 89534 27990 -12495 54 44661 87884 50242 40689 59600 77661 57154 46402
16695 46402 23196 -8552 -54680 -50961 -29385 -53420 -92775 -85642 -39274 -30910 -44690 -8482
$$ packed form
16783A7559k8396M170K7163m594L9273J324l5203K3346m2613r868K8940M42k9042
16770g499k7880L7223o383p693L513Q532k727j6801R263k4901M956M827j9840
16757d5410j8876K6294K5959K3610N481K5771j5182k4216j2485K0917N215M669
16745B1747J9113l9226l4092P820L617m3129L1668R0065J4680k9067j4342j5108
16733A3746k3349k8177k806P151N52j514j6812K1685L0337k1593K9998J7432k0842
16720E808n1394L444M3544j0597n875J886N6942K0607q011j6683l2189J0290M8528
16707F6300K3234o1544m0485J2549M4607M3223l7642r553J8911J8061k0507j0752
16695D6402k3206l1748m6128L719K1576k4035l9355P133M6368Q364j3780L6208
$$ plain form
16683 -8482 469 19997 27067 32966 56611 58679 -2165 -41015 -3710 5678 39639 45627 28850
16670 28850 47609 38305 15941 42175 46487 42789 -2661 -32052 -69611 -60378 -52171 -35993 -26350
16657 -26350 -11669 -24910 -29232 4500 -17494 -17511 -13163 -13075 -29279 11475 19173 27036 -4382 -39342
16643 -39342 -15814 -15656 -58849 -63562 -42053 -22425 -31494 -20406 9218 -26511 -29819 -11522 9793
16630 9793 5690 -3660 21940 21528 -26143 -34729 -13638 52570 59404 9640 -166 -2767 4743 20791
16616 20791 -12602 -56385 -31566 31261 -13092 -78659 -69868 -27675 -65683 -105702 -108354 -89008
16604 -89008 -36654 285 -49287 -53162 -56707 -47655 -3232 -6037 -32744 -46160 -44111 -27189 3888
16591 3888 18852 11400 -3116 -2096 26984 8598 26152 34033 48684 26961 29707 36444 37748
$$ packed form
16683h482Q951J9528P070N899K3645K068o0844l8850L7305R388L3961N988j6777
16670B8850J8759r304k2364K6234M312l698m5450k9391l7559R233Q207J6178R643
16657b6350J4681j3241m322L3732k1994j7M348Q8j6204M0754P698P863l1418l4960
16643c9342K3528J58m3193m713K1509J9628r069J1088K9624l5729l308J8297K1315
16630I793m103r350K5600m12m7671q586K1091O6208O834m9764r806k601P510J6048
16616B0791l3393m3783K4819O2827m4353o5567Q791M2193l8008m0019k652J9346
16604h9008N2354L6939m9572l875l545R052M4423k805k6707j3416K049J6922L1077
16591C888J4964p452j4516J020K9080j8386J7554P881J4651k1723K746O737J304
$$ plain form
16578 37748 19010 34075 57848 58424 42389 -11885 -69714 -53915 -4173 27185 21621 -11725
16566 -11725 1115 7548 36206 48589 7899 -59981 -60061 -40681 -47279 -73091 -56363 -54796 -55998
16553 -55998 -60312 -65890 -52071 -27742 1156 22691 3654 8629 29953 24548 34920 44266 30343
16540 30343 69 -4445 -14206 -24249 -17976 -20726 -27334 6196 7328 5618 6401 48215 89095
16527 89095 58859 66752 61464 25205 -24012 -57041 -43392 -40401 -27363 -39671 -55788 -80577
16515 -80577 -95155 -83539 -26708 37673 8740 -27579 -50215 -40585 -47332 -38890 -27352 19207
16503 19207 14642 3092 1464 10263 32289 90407 94726 43899 20638 -5003 -5117 -24089 31610
16490 31610 10939 13422 11977 15251 8330 14766 18086 42662 40240 29349 51363 13321 18558
$$ packed form
16578C7748j8738J5065K3773N76j6035n4274n7829J5799M9742L1358n564l3346
16566a1725J2840O433K8658J2383m0690o7880q0J9380o598k5812J6728J567j202
16553e5998m314n578J3819K4329K8898K1535j9037M975K1324n405J0372R346j3923
16540C0343l0274m514r761j0043O273k750o608L3530J132j710P83M1814M0880
16527H9095l0236P893n288l6259m9217l3029J3649K991J3038j2308j6117k4789
16515h0577j4578J1616N6831O4381k8933l6319k2636R630o747Q442J1538M6559
16503A9207m565j1550j628Q799K2026N8118M319n0827k3261k5641j14j8972N5699
16490C1610k0671K483j445L274o921O436L320K4576k422j0891K2014l8042N237
$$ plain form
16477 18558 14904 51726 58042 43890 67853 71696 32376 24203 14754 -25353 -52720 -9691 -14303
16464 -14303 -11564 -19890 -1252 -10715 -20003 5394 12545 39333 33400 -6600 371 17447 64849
16451 64849 46861 5034 11948 -731 -30478 -34723 -30535 -32535 -803 29194 10039 28672
16439 28672 38970 3756 -35733 -53951 -27125 -47109 -75582 -87412 -69073 -34524 -9944 -7365
16427 -7365 240 -1082 8149 16763 65367 92114 86416 49405 1351 -20923 -46612 -62739 -14214
16414 -14214 33243 55936 68457 92902 73989 50126 65576 66086 46332 8189 -170 10806
16402 10806 31364 44384 48924 24775 -24565 -328 4513 -13770 813 28333 28972 23935 44167
16389 44167 -3866 -51902 -40344 -30799 4634 39141 36137 26637 4057 -27250 -27027 -2737 11409
$$ packed form
16477A8558l654L6822O316j4152K3963L843l9320q173r449m0107k7367M3029m612
16464a4303K739q326J8638r463r288K5397P151K6788n933m0000O971J7076M7402
16451F4849j7988m1827O914j2679k9747m245M188k000L1732K9997j9155J8633
16439B8672J0298l5214l9489j8218K6826j9984k8473j1830J8339L4549K4580K579
16427g365P605j322R231Q614M8604K6747n698l7011m8054k2274k5689j6127M8525
16414a4214M7457K2693J2521K4445j8913k3863J5450N10j9754l8143q359J0976
16402A0806K0558J3020M540k4149m9340K4237M841j8283J4583K7520O39n037K0232
16389D4167m8033m8036J1558R545L5433L4507l004r500k2580l1307K23K4290J4146
$$ plain form
16376 11409 39153 53524 25711 40869 39154 9278 -19871 -3628 2438 796 -18420 -14935
16364 -14935 30818 37607 35477 62119 73591 59064 55716 60355 36109 38856 50557 66733 77494
16351 77494 62683 51248 61824 49181 -3100 -24896 -26553 3538 55168 66182 28260 10107
16339 10107 12966 13559 8884 20432 51773 32614 40369 10860 -37388 -53344 -29134 6981 -5314
16326 -5314 612 45478 116276 107207 50747 7150 5786 23846 27864 37678 36443 29614 50840
16313 50840 60730 34778 37512 41831 1422 -19548 -40406 -36667 -54490 -59729 -18635 42376 27752
16300 27752 28365 18614 -9276 10762 21023 26372 22480 20205 15801 33307 22352 64337 74748
16287 74748 61258 61910 41281 38403 29876 59563 67887 64287 87372 100333 88320 84796 51876
$$ packed form
16376A1409K7744J4371k7813J5158j715k9876k9149J6243O066j642j9216L485
16364a4935M5753O789k130K6642J1472j4527l348M639k4246K747J1701J6176J0761
16351G7494j4811j1435J0576j2643n2281k1796j657L0091N1630J1014l7922j8153
16339A0107K859N93m675J1548L1341j9159P755k9509m8248j5956K4210L6115j2295
16326e314N926M4866P0798r069n6460m3597j364J8060M018R814j235o829K1226
16313E0840R890k5952K734M319m0409k0970k0858L739j7823n239M1094O1011j4624
16300B7752O13r751k7890K0038J0261N349l892k275m404J7506j0955M1985J0411
16287G4748j3490O52k0629k878q527K9687Q324l600K3085J2961j2013l524l2920
$$ plain form
16274 51876 11851 28147 -26539 -27202 -11773 -19840 -26424 -1982 21136 35823 -4225 -25898
16262 -25898 -26513 -10108 32544 18957 -41602 -4425 52600 79059 67128 24043 -35999 -44990
16250 -44990 -17596 19950 36651 16885 -1787 -47981 -12556 12964 -583 -24054 -35399 -19528
16238 -19528 -14711 16686 66037 76056 46936 25164 2086 3638 49228 49433 23157 25751 51504
16225 51504 54092 59030 38577 53917 81773 99049 117111 73560 50621 71305 89028 54972
16213 54972 55709 71672 88421 56698 -23621 -23543 -29191 22790 38950 53495 63973 79913 92644
16200 92644 59545 49478 39337 47922 50170 78576 73830 73769 101341 54200 8492 30696 2645
16187 2645 1619 16059 24468 2714 12332 36814 615 -22831 28520 74683 56490 63597 67204
$$ packed form
16274E1876m0025J6296n4686o63J5429q067o584K4442K3118J4687m0048k1673
16262b5898o15J6405M2652j3587o0559L7177N7025K6459j1931m3085o0042q991
16250d4990K7394L7546J6701j9766j8672m6194L5425K5520j3547k3471j1345J5871
16238a9528M817L1397M9351J0019k9120k1772k3078J552M5590K05k6276K594K5753
16225E1504K588M938k0453J5340K7856J7276J8062m3551k2939K0684J7723l4056
16213E4972P37J5963J6749l1723q0319P8n648N1981J6160J4545J0478J5940J2731
16200I2644l3099j0067j0141Q585K248K8406m746o1K7572m7141m5708K2204k8051
16187B645j026J4440Q409k1754R618K4482l6199k3446N1351M6163j8193P107L607
$$ plain form
16174 67204 18126 13623 45723 71724 55560 18970 74378 77911 23704 -9279 2495 -12526
16162 -12526 3824 82147 121696 122672 99970 63008 2377 -16849 27949 49300 68851 20360
16150 20360 7634 24070 62299 79590 97675 73716 52237 47367 78565 71076 83111 47848
16138 47848 5090 -2265 70748 128361 165766 185870 145847 111507 57063 49986 77336 89474
16126 89474 111393 97182 60142 43963 52522 17167 -23499 -22299 3760 71670 100837 111162
16114 111162 109909 94475 115014 111112 86330 82988 82437 81432 74398 81216 86775 43331 59988
16101 59988 61469 55394 45921 70653 89352 84200 100024 110724 102064 71595 48834 123579 159355
16088 159355 166082 150735 114188 107010 102692 77913 65228 86777 90391 86983 96940 71909 14372
$$ packed form
16174F7204m9078m503L2100K6001j6164l6590N5408L533n4207l2983J1774j5021
16162a2526J6350P8323L9549R76k2702l6962o0631j9226M4798K1351J9551m8491
16150B0360j2726J6436L8229J7291J8085k3959k1479m870L1198p489J2035l5263
16138D7848m2758p355P3013N7613L7405K0104m0023l4340n4444p077K7350J2138
16126H9474K1919j4211l7040j6179Q559l5355m0666J200K6059O7910K9167J0325
16114A11162j253j5434K0539l902k4782l342n51j005p034O818N559m3444J6657
16101E9988J481o075r473K4732J8699n152J5824J0700q660l0469k2761P4745L5776
16088A59355O727j5347l6547p178m318k4779j2685K1549L614l408R957k5031n7537
$$ plain form
16075 14372 18139 62704 38868 21205 37038 8318 -22055 32171 48124 55445 13504 -18352
16063 -18352 5896 39808 34800 54080 43065 82366 84690 60661 61981 96975 92073 81274
16051 81274 67110 33970 60827 69913 79208 79422 95306 150463 143112 98780 95069 74209 75423
16038 75423 61334 101461 69524 51844 24912 4193 51676 75458 43348 16814 52224 123478
16026 123478 94837 83384 86505 93819 90961 99718 103601 112306 136028 116994 77636 53256 49732
16013 49732 39264 -14299 -20202 5851 44823 74861 114622 145394 116893 58514 48444 81897
16001 81897 82308 102601 101161 96045 89668 80709 108053 114074 108553 84117 31339 33058 84948
15988 84948 142421 181224 182333 203887 157669 131828 98323 106973 102040 98717 120460 123505 117410
$$ packed form
16075A4372L767M4565k3836j7663J5833k8720l0373N4226J5953P321m1941l1856
16063a8352K4248L3912n008J9280j1015L9301K324k4029J320L4994m902j0799
16051H1274j4164l3140K6857R086R295K14J5884N5157p351m4332l711k0860J214
16038G5423j4089M0127l1937j7680k6932k0719M7483K3782l2110k6534L5410P1254
16026A23478k8641j1453L121P314k858Q757L883Q705K3722j9034l9358k4380l524
16013D9732j0468n3563n903K6053L8972L0038L9761L0772k8501n8379j0070L3453
16001H1897M11K0293j440n116o377q959K7344O021n521k4436n2778J719N1890
15988H4948N7473L8803J109K1554m6218k5841l3505Q650m933l323K1743L045o095
$$ plain form
15975 117410 131129 149942 148518 152848 129069 79444 53778 54815 66724 120711 138136 157370
15963 157370 160879 130251 56016 22783 70389 109853 79424 72680 61865 50109 74419 65755
15951 65755 76944 112694 93168 79176 87655 77747 59351 91925 94447 57429 45422 47587
15939 47587 85141 123102 133936 110281 123763 65584 59940 47312 39330 3321 -35924 -9727
15927 -9727 61228 70147 99069 97905 112115 105311 96945 83031 49540 62194 77753 55061 79068
15914 79068 117693 131494 138947 109851 91968 98092 97853 127488 101174 33016 48784 96101
15902 96101 95049 110862 98892 75881 97575 126396 109913 96044 81131 107343 145485 131433
15890 131433 121714 104653 79680 75025 69217 71667 68811 117179 135267 115788 91945 88454 86636
$$ packed form
15975A17410J3719J8813j424M330k3779m9625k5666J037J1909N3987J7425J9234
15963A57370L509l0628p4235l3233M7606L9464l0429o744j0815j1756K4310q664
15951F5755J1189L5750j9526j3992Q479r908j8396L2574K522l7018j2007K165
15939D7587L7554L7961J0834k3655J3482n8179n644j2628p982l6009l9245K6197
15927i727P0955Q919K8922j164J4210o804q366j3914l3491J2654J5559k2692K4007
15914G9068L8625J3801P453k9096j7883O124k39K9635k6314o8158J5768M7317
15902I6101j052J5813j1970k3011K1694K8821j6483j3869j4913K6212L8142j4052
15890A31433r719j7061k4973m655n808K450k856M8368J8088j9479k3843l491j818
$$ plain form
15877 86636 76645 86477 86914 94741 77294 88905 88222 77313 60702 88944 54534 91144 121030
15864 121030 141721 157450 159498 172188 154371 107113 133786 104042 54461 -7784 43656 67937
15852 67937 69098 89936 74807 94824 113878 136581 142265 117274 85536 69454 49062 65118
15840 65118 37042 45007 71268 61638 77987 99490 99376 96795 59618 78796 97263 116247 119711
15827 119711 116160 130122 137352 118881 131331 130481 110156 143679 139145 121644 108917 101532 87459
15814 87459 105256 113801 127311 104002 87910 93554 159757 197233 149248 149946 145782 116524 95322
15801 95322 49434 67142 77365 66057 51757 87913 96388 99869 82118 82206 82050 84090 102596
15788 102596 145858 160502 111916 86034 68933 53251 65187 93060 99516 119719 166236 175015
$$ packed form
15877H6636r991R832M37P827j7447J1611o83j0909j6611K8242l4410L6610K9886
15864A21030K0691J5729K048J2690j7817m7258K6673k9744m9581o2245N1440K4281
15852F7937J161K0838j5129K0017J9054K2703N684k4991l1738j6082k0392J6056
15840F5118k8076P965K6261r630J6349K1503j14k581l7177J9178J8467J8984L464
15827A19711l551J3962P230j8471J2450q50k0325L3523m534j7501j2727p385j4073
15814H7459J7797Q545J3510k3309j6092N644O6203L7476m7985O98m164k9258k1202
15801I5322m5888J7708J0223j1308j4300L6156Q475L481j7751Q8j56K040J8506
15788A02596M3262J4644m8586k5882j7101j5682J1936K7873O456K0203M6517Q779
$$ plain form
15776 175015 127414 114290 144427 162906 112353 88895 100717 152788 176451 166299 128673
15765 128673 133723 92856 61626 68490 58146 82685 93471 120485 96595 89607 115676 127028
15753 127028 139484 111992 101229 130977 76090 12363 33210 66998 124593 142057 156337
15742 156337 149311 115969 119197 104118 107705 80175 45667 72595 97420 84146 41025 45724
15730 45724 110420 118461 134830 151638 155264 159093 176974 143617 107304 118036 141135 105617
15718 105617 78307 132046 193235 200589 109018 69793 79811 107862 135915 139046 121159 139980
15706 139980 168492 142647 126329 127663 149080 177886 185785 179722 195498 178026 187961 207295
15694 207295 235027 199743 201346 184784 181263 191727 196931 205332 163522 108611 110895 130460
$$ packed form
15776A75015m7601j3124L0137J8479n0553k3458J1822N2071K3663j0152l7626
15765A28673N050m0867l1230O864j0344K4539J0786K7014k3890o988K6069J1352
15753A27028J2456k7492j0763K9748n4887o3727K0847L3788N7595J7464J4280
15742A56337p026l3342L228j5079L587k7530l4508K6928K4825j3274m3121M699
15730D5724O4696Q041J6369J6808L626L829J7881l3357l6313J0732K3099l5518
15718A05617k7310N3739O1189P354r1571l9225J0018K8051K8053L131j7887J8821
15706A39980K8512k5845j6318J334K1417K8806P899o063J5776j7472R935J9334
15694B07295K7732l5284J603j6562l521J0464N204Q401m1810n4911K284J9565
$$ plain form
15682 130460 164231 181362 185467 189788 179495 201857 219970 191344 138408 110912 118539 144144
15670 144144 121452 118926 98942 86167 68774 73147 84366 93723 115829 115942 131605 168043
15658 168043 163101 184090 158980 134753 131951 167804 200174 191806 166140 120363 83332 77764
15646 77764 100451 75218 125189 145736 173447 156990 134228 149459 136869 146771 154405 132980
15634 132980 148851 166966 175968 177228 197930 208953 203676 187481 166970 173093 180017 184111 204329
15621 204329 206136 203673 166856 123447 122038 171201 223186 221816 208070 190404 148217 164777
15609 164777 188050 187145 189787 164164 153298 166193 148523 177348 202274 165217 118269 123190
15597 123190 177454 226749 254197 244142 212008 174971 157483 206054 207736 206274 210488 187280
$$ packed form
15682A30460L3771J7131M105M321j0293K2362J8113k8626n2936k7496P627K5605
15670A44144k2692k526j9984j2775j7393M373J1219R357K2106J13J5663L6438
15658A68043m942K0989k5110k4227k802L5853L2370q368k5666m5777l7031n568
15646G7764K2687k5233M9971K0547K7711j6457k2762J5231j2590R902P634k1425
15634A32980J5871J8115R002J260K0702J1023n277j6195k0511O123O924M094K0218
15621B04329J807k463l6817m3409j409M9163N1985j370j3746j7666m2187J6560
15609A64777K3273r05K642k5623j0866J2895j7670K8825K4926l7057m6948M921
15597A23190N4264M9295K7448j0055l2134l7037j7488M8571J682j462M214k3208
$$ plain form
15585 187280 194938 164038 156238 133115 123576 126681 118053 99620 109424 117947 96544 127472 172963
15572 172963 189879 183604 176017 137462 81389 82841 111041 151543 176600 146354 142096 164806
15560 164806 187152 194320 174909 204277 233347 230544 206175 221064 215492 208864 223160 230464
15548 230464 235353 199141 201680 210315 179540 191098 240670 211790 169585 159583 164391 169639
15536 169639 182830 158245 154080 143640 149819 207000 181693 141781 160045 199427 227616 254035
15524 254035 214031 199065 198208 156082 168191 185173 169012 186120 161536 149973 123506 137174
15512 137174 165801 166802 162530 175248 216871 242311 195796 169825 191304 207808 248265 274971
15500 274971 238987 186120 195630 190390 192538 186068 186186 211894 217282 235887 244675 223831 233349
$$ packed form
15585A87280P658l0900p800k3123r539L105q628j8433R804Q523k1403L0928M5491
15572A72963J6916o275p587l8555n6073J452K8200M0502K5057l0246m258K2710
15560A64806K2346P168j9411K9368K9070k803k4369J4889n572o628J4296P304
15548B30464M889l6212K539Q635l0775J1558M9572k8880m2205j0002M808N248
15536A69639J3191k4585m165j0440O179N7181k5307l9912J8264L9382K8189K6419
15524B54035m0004j4966q57m2126J2109J6982j6161J7108k4584j1563k6467J3668
15512A37174K8627J001m272J2718M1623K5440m6515k5971K1479J6504M0457K6706
15500B74971l5984n2867R510n240K148o470J18K5708N388J8605Q788k0844R518
$$ plain form
15487 233349 200139 196947 223480 241324 214079 211968 211028 154228 154422 135519 94675 93519 126464
15474 126464 133010 166507 209317 209402 226608 208243 246081 249104 250152 261846 271398 254632 242587
15461 242587 206758 212494 230331 191659 199499 241942 262952 239838 285647 312880 277021 213603
15449 213603 206065 241638 251235 251301 266061 255441 253649 258729 247361 270662 273121 300663 303374
15436 303374 260455 199403 177321 192262 201959 212683 188963 189647 211564 229296 195442 180022
15424 180022 176901 170500 178685 176672 172210 182335 219866 232071 294200 289370 259545 213723 204634
15411 204634 210873 206631 212640 228544 236332 226913 217040 207083 204977 209290 191326 175931 187942
15398 187942 172715 178061 242356 228902 218923 241426 273213 286409 257635 254178 281345 287850
$$ packed form
15487B33349l3210l192K6533J7844k7245k111r40n6800J94j8903m0844j156L2945
15474A26464O546L3497M2810Q5J7206j8365L7838L023J048J1694R552j6766j2045
15461B42587l5829N736J7837l8672P840M2443K1010k3114M5809K7233l5859o3418
15449B13603p538L5573R597O6J4760j0620j792N080j1368K3301K459K7542K711
15436C03374m2919o1052k2082J4941R697J0724k3720O84K1917J7732l3854j5420
15424A80022l121o401Q185k013m462J0125L7531J2205O2129m830k9825m5822r089
15411B04634O239m242O009J5904P788r419r873r957k106M313j7964j5395J2011
15398A87942j5227N346O4295j3454r979K2503L1787J3196k8774l457K7167O505
$$ plain form
15386 287850 269921 267008 274137 253753 202713 222764 213108 223974 223551 207544 204579 256517 288959
15373 288959 293548 279312 248769 244820 310563 319773 234513 204135 214239 232104 270622 283746
15361 283746 285955 282320 238408 215103 263132 273317 312820 280096 247712 248342 226389 232574
15349 232574 296415 296385 258787 237309 226792 252277 276497 301681 262787 247746 250563 241178
15337 241178 244661 232623 254828 287598 267503 282668 250265 212439 219907 226891 258025 271459
15325 271459 324776 369874 374220 347177 334772 341547 351846 311478 289606 287031 262964 250557
15313 250557 274071 341501 352211 315727 325444 311173 271552 271726 259105 268674 301075 301999 327073
15300 327073 360292 353982 322948 286956 310968 328442 322551 333335 296087 297453 322048 313832
$$ packed form
15386B87850j7929k913P129k0384n1040K0051r656J0866m23j6007k965N1938L2442
15373B88959M589j4236l0543l949O5743R210q5260l0378J0104J7865L8518J3124
15361B83746K209l635m3912k3305M8029J0185L9503l2724l2384O30k1953O185
15349B32574O3841l0l7598k1478j0517K5485K4220K5184l8894j5041K817r385
15337B41178L483j2038K2205L2770k0095J5165l2403l7826P468O984L1134J3434
15325B71459N3317M5098M346k7043j2405O775J0299m0368k1872k575k4067j2407
15313B50557K3514O7430J0710l6484R717j4271l9621J74j2621R569L2401R24K5074
15300C27073L3219o310l1034l5992K4012J7474n891J0784l7248J366K4595q216
$$ plain form
15288 313832 273447 292492 325908 268035 243185 289345 308377 321423 321614 263577 218954 224664
15276 224664 228689 237712 251902 264982 293282 310805 354547 319965 251405 253109 313920 364883
15264 364883 359060 351248 305795 304143 328618 338251 310791 310694 315839 337432 359690 380142 389949
15251 389949 377388 311437 284279 288781 295554 308946 318159 312867 303876 290056 321536 335833
15239 335833 324136 316793 322897 327197 367482 344870 350390 347081 346273 358136 335700 304004 285478
15226 285478 290292 294880 341833 344127 317745 314436 327756 361013 372575 345248 350344 345860 329381
15213 329381 347223 337161 318876 297271 288736 321459 371984 368011 317163 293346 305052 302852
15201 302852 306647 330514 342477 377157 351327 299299 310478 302966 272751 298981 319211 311258
$$ packed form
15288C13832m0385J9045L3416n7873k4850M6160J9032J3046J91n8037m4623N710
15276B24664M025R023J4190J3080K8300J7523M3742l4582o8560J704O0811N0963
15264C64883n823p812m5453j652K4475R633k7460r7N145K1593K2258K0452R807
15251C89949j2561o5951k7158M502O773J3392R213n292q991j3820L1480J4297
15239C35833j1697p343O104M300M0285k2612N520l309q08J1863k2436l1696j8526
15226B85478M814M588M6953K294k6382l309J3320L3257J1562k7327N096m484j6479
15213C29381J7842j0062j8285k1605q535L2723N0525l973n0848k3817J1706k200
15201C02852L795K3867J1963L4680k5830n2028J1179p512l0215K6230K0230p953
$$ plain form
15189 311258 352378 371023 430828 452388 410823 370110 378860 363758 375783 343926 364953 351710
15177 351710 377980 337141 249659 271342 321399 328888 341831 328146 307220 300000 361462 397328
15165 397328 359663 359082 338701 308886 336056 340434 341087 353616 353340 353163 369536 369196 357829 376261
15151 376261 380349 399828 382038 348228 343675 321738 333177 330290 394764 381529 357782 350222
15139 350222 392590 400822 390264 357272 340969 338458 370074 334723 316213 307408 323819 356750
15127 356750 388991 424191 419012 392029 393496 383842 419040 436525 440704 444490 429467 409460
15115 409460 409978 414760 435402 403924 373040 378102 385543 393614 381235 392363 414489 413184 420219
15102 420219 401191 372972 378336 408590 422999 429242 438075 446331 473566 508266 479549 435299
$$ packed form
15189C11258M1120J8645N9805K1560m1565m0713Q750j5102J2025l1857K1027j3243
15177C51710K6270m0839q7482K1683N0057P489J2943j3685k0926p220O1462L5866
15165C97328l7665n81k0381k9815K7170M378O53J2529k76j77J6373l40j1367J8432
15151C76261M088J9479j7790l3810m553k1937J1439k887O4474j3235k3747p560
15139C50222M2368Q232j0558l2992j6303k511L1616l5351j8510q805J6411L2931
15127C56750L2241L5200n179k6983J467r654L5198J7485M179L786j5023k0007
15115D09460N18M782K0642l1478l0884N062P441Q071j2379J1128K2126j305P035
15102D20219j9028k8219N364L0254J4409O243Q833Q256K7235L4700k8717m4250
$$ plain form
15090 435299 434889 446728 443301 420934 416433 404784 378578 387707 370161 361112 398111 464673 466070
15077 466070 469433 442616 445699 489727 475610 415345 408150 445738 470366 497969 475987 473040
15065 473040 505223 484074 445254 442641 480300 489851 447659 397336 396177 410569 410757 421506
15053 421506 465620 498216 445632 437467 437983 462841 462557 518682 536417 538831 530234 484930 490167
15040 490167 476148 446886 488288 484784 469345 431193 378534 367487 378219 382327 387583 393740
15028 393740 438983 462919 466876 477057 466548 467365 481598 495597 464522 429390 435348 449066
15016 449066 465577 474317 460656 452774 435083 451055 512601 525120 499071 463177 471611 484400
15004 484400 458275 465585 465001 435789 415468 400693 395757 422776 451135 476025 475480 473072 490843
$$ packed form
15090D35299m10J1839l427k2367m501j1649k6206R129j7546r049L6999O6562J397
15077D66070L363k6817L083M4028j4117o0265p195L7588K4628K7603k1982k947
15065D73040L2183k1149l8820k613L7659R551m2192n0323j159J4392J88J0749
15053D21506M4114L2596n2584q165N16K4858k84N6125J7735K414q597m5304N237
15040D90167j4019k9262M1402l504j5439l8152n2659j1047J0732M108N256O157
15028C93740M5243K3936L957J0181j0509Q17J4233J3999l1075l5132N958J3718
15016D49066J6511Q740j3661p882j7691J5972O1546J2519k6049l5894Q434J2789
15004D84400k6125P310n84k9212k0321j4775m936K7019K8359K4890n45k408J7771
$$ plain form
14991 490843 476018 455112 436766 458692 494883 469463 467385 460860 496765 503923 539102 527576
14979 527576 497430 492310 489845 488226 453544 425647 393312 443021 452529 465949 497614 501058
14967 501058 508359 494623 504963 547378 521020 500488 482324 522517 515601 498208 477997 478579
14955 478579 464192 458183 470528 515934 539290 536346 536005 534193 518772 522889 548933 578351 586426
14942 586426 519475 519487 549082 550854 545889 525547 472047 456863 472138 507815 531911 509467
14930 509467 495017 507481 524973 560780 555827 545637 554262 537841 529481 526406 543505 554589
14918 554589 545484 566465 555034 529625 501344 457908 463463 478945 492804 511129 501285 517060
14906 517060 573573 598879 600984 606252 587622 561346 568669 566272 589836 584596 600094 607884 554878
$$ packed form
14991D90843j4825k0906j8346K1926L6191k5420k078o525L5905P158L5179j1526
14979E27576l0146n120k465j619l4682k7897l2335M9709R508J3420L1665L444
14967E01058P301j3736J0340M2415k6358k0532j8164M0193o916j7393k0211N82
14955D78579j4387o009J2345M5406K3356k944l41j812j5421M117K6044K9418Q075
14942E86426o6951J2K9595J772m965k0342n3500j5184J5275L5677K4096k2444
14930E09467j4450J2464J7492L5807m953j0190Q625j6421q360l075J7099J1084
14918E54589r105K0981j1431k5409k8281m3436N555J5482J3859J8325r844J5775
14906E17060N6513K5306K105N268j8630k6276P323k397K3564n240J5498P790n3006
$$ plain form
14893 554878 535369 523587 518432 511896 554979 564530 560710 596854 631721 610465 540874 505237
14881 505237 516310 515034 508327 521521 538340 553873 534470 517266 530295 542842 494613 460355
14869 460355 475260 517990 557805 598879 599870 573705 564907 584442 611547 569977 570786 590472
14857 590472 664847 652347 599313 610590 638264 628460 598925 598269 607535 614655 625490 642146
14845 642146 610137 601073 587979 580495 559250 595180 616371 625445 626719 622277 630543 615027 567320
14832 567320 591214 614334 616619 582682 586691 585869 554194 569512 632996 643443 623092 593992
14820 593992 586811 578027 571461 616502 649932 676090 639542 586914 569217 578407 633984 654754
14808 654754 675180 647818 603842 569321 560976 586329 574533 584819 583784 598051 614726 606831
$$ packed form
14893E54878j9509j1782n155o536M3083R551l820L6144L4867k1256o9591l5637
14881E05237J1073j276o707J3194J6819J5533j9403j7204J3029J2547m8229l4258
14869D60355J4905M2730L9815M1074R91k6165q798J9535K7105m1570Q09J9686
14857E90472P4375j2500n3034J1277K7674r804k9535o56R266P120J0835J6656
14845F42146l2009r064j3094p484k1245L5930K1191R074J274m442Q266j5516m7707
14832E67320K3894K3120K285l3937M009q22l1675J5318O3484J0447k0351k9100
14820E93992p181q784o566M5041L3430K6158l6548n2628j7697R190N5577K0770
14808F54754K0426k7362m3976l4521q345K5353j1796J0286j035J4267J6675p895
$$ plain form
14796 606831 631756 615094 570139 577291 564752 588662 638227 656401 635633 649588 665248 686588
14784 686588 695020 627032 606880 646080 679167 671701 674116 650498 606911 613529 599573 589684
14772 589684 602879 610987 628330 626530 623535 628375 661450 640522 606583 620511 631973 639428
14760 639428 619408 632154 645768 653856 687427 699124 661456 635045 622411 602012 614406 626822
14748 626822 606057 641434 676512 693315 638980 627896 622192 643950 733867 728490 728918 723814
14736 723814 687656 666621 664676 619924 602166 601654 629371 679744 684656 653264 670304 708414
14724 708414 701039 674940 672178 677495 659163 696766 743284 709716 665305 645513 681512 681393
14712 681393 689280 675533 654195 627908 602245 631974 685194 681408 691404 724905 702614 671109
$$ packed form
14796F06831K4925j6662m4955P152j2539K3910M9565J8174k0768J3955J5660K1340
14784F86588Q432o7988k0152L9200L3087p466K415k3618m3587O618j3956r889
14772E89684J3195Q108J7343j800k995M840L3075k0928l3939J3928J1462P455
14760F39428k0020J2746J3614Q088L3571J1697l7668k6411j2634k0399J2394J2416
14748F26822k0765L5377L5078J6803n4335j1084n704K1758Q9917n377M28n104
14736G23814l6158k1035j945m4752j7758n12K7717N0373M912l1392J7040L8110
14724G08414p375k6099k762N317j8332L7603M6518l3568m4411j9792L5999j19
14712F81393P887j3747k1338k6287k5663K9729N3220l786R996L3501k2291l1505
$$ plain form
14700 671109 663197 700161 741439 733048 732271 727031 707338 696081 700949 699689 720467 745927 693855
14687 693855 657258 684420 703356 720551 697754 679660 678026 662762 652228 685800 682090 701158
14675 701158 715904 728415 754460 780672 769348 723549 704193 726814 732223 715854 716763 728439
14663 728439 686217 674311 683567 707150 706281 703970 744012 767896 744788 750022 724027 714126 719868
14650 719868 726147 728584 746520 768670 773681 739414 713137 719087 726424 708958 695911 697394 699585
14637 699585 689490 704748 704596 704741 691499 655660 681420 639462 593036 610623 627133 681028
14625 681028 723642 674661 667704 709835 691862 677628 662744 644326 657263 649355 659138 689413
14613 689413 699676 709709 734015 736944 734178 717158 676130 667438 714272 713437 671673 676073 710826
$$ packed form
14700F71109p912L6964M1278q391p77n240j9693j1257M868j260K0778K5460n2072
14687F93855l6597K7162J8936J7195k2797j8094j634j5264j0534L3572l710J9068
14675G01158J4746J2511K6045K6212j1324m5799j9356K2621N409j6369R09J1676
14663G28439m2222j1906R256K3583q69k311M0042K3884k3108N234k5995r901N742
14650G19868O279K437J7936K2150N011l4267k6277N950P337j7466j3047J483K191
14637F99585j0095J5258j52J45j3242l5839K5760m1958m6426J7587J6510N3895
14625F81028M2614m8981o957M2131j7973j4234j4884j8418J2937p908R783L0275
14613F89413J0263J0033K4306K929k766j7020m1028q692M6834q35m1764M400L4753
$$ plain form
14600 710826 733843 747482 773925 750445 755306 754708 700406 678415 691149 692452 727080 755219
14588 755219 723010 693382 664308 657838 669408 683096 704569 695142 688717 661758 697065 702744
14576 702744 681074 721855 786151 763191 765052 731534 708788 691799 721203 730967 736613 772308
14564 772308 798915 775963 755901 783652 774455 773589 754711 741813 704113 693954 702556 721871
14552 721871 739491 737813 726345 738341 768263 752510 717912 703235 748439 768536 777538 771974
14540 771974 742921 699707 691448 664536 669142 714476 732700 719652 679496 686856 686745 697591
$$ packed form
14600G10826K3017J3639K6443k3480M861n98n4302k1991J2734J303L4628K8139
14588G55219l2209k9628k9074o470J1570J3688K1473r427o425k6959L5307N679
14576G02744k1670M0781O4296k2960J861l3518k2746j6989K9404R764N646L5695
14564G72308K6607k2952k0062K7751r197q66j8878j2898l7700j0159Q602J9315
14552G21871J7620j678j1468J1996K9922j5753l4598j4677M5204K0097R002n564
14540G71974k9053m3214q259k6912M606M5334J8224j3048m0156P360j11J0846
$$ [...]
##END NTUPLES=NMR SPECTRUM
##END=
