##TITLE=Analysis number 313631
Compound Code sp 00460
Book Reference 382/110/1
Project Code adrs
Chemist Name simons
##JCAMPDX= 6.0         $$ Bruker NMR JCAMP-DX V2.0
##DATA TYPE= NMR SPECTRUM
##DATA CLASS= NTUPLES
##ORIGIN= Bruker BioSpin GmbH
##OWNER= NMR
$$ XWIN-NMR		Version 3.5
$$ Thu Sep 15 12:02:34 2005 GMT Daylight Time (UT+1h)  MAYBRIDGE\NMR@NMR_250MHZ
##.OBSERVE FREQUENCY= 250.131544655141
##.OBSERVE NUCLEUS= ^1H
##.ACQUISITION MODE= SIMULTANEOUS (DQD)
##.ACQUISITION SCHEME= undefined
##.AVERAGES= 16
##.DIGITISER RES= 18
##SPECTROMETER/DATA SYSTEM= dpx250
##.PULSE SEQUENCE= zg30
##.SOLVENT NAME= CDCl3
##.SHIFT REFERENCE= (INTERNAL, CDCl3, 0, 16.522)
##AUDIT TRAIL= $$ (NUMBER, WHEN, WHO, WHERE, WHAT)
$$ ##TITLE= Audit trail, XWIN-NMR		Version 3.5
$$ ##JCAMPDX= 5.01
$$ ##ORIGIN= Bruker BioSpin GmbH
$$ ##OWNER= NMR
$$ C:\u/data/dgb/nmr/ADRS/9490/pdata/1/auditp.txt
$$ ##AUDIT TRAIL=  $$ (NUMBER, WHEN, WHO, WHERE, WHAT)
(   1,<2005-09-15 12:02:12.06 +100>,<MAYBRIDGE\NMR>,<NMR_250MHZ>,
      <created by zg, POWCHK disabled, PULCHK disabled
       configuration hash MD5:
       62 19 C7 07 E1 42 D1 B7 37 6C 3D D0 77 39 F9 E6
       data hash MD5: 64K
       AA D8 C3 E1 33 EA B0 75 A4 EC E6 49 3A C3 AA F5>)
(   2,<2005-09-15 12:02:24.80 +100>,<MAYBRIDGE\NMR>,<NMR_250MHZ>,
      <Start of raw data processing
       ef LB = 0.3 FT_mod = 6 PKNL = 1 SI = 32K 
       data hash MD5: 32K
       45 89 51 35 2A A8 E0 9E EB DC 2E 63 85 00 E1 16>)
(   3,<2005-09-15 12:02:26.75 +100>,<MAYBRIDGE\NMR>,<NMR_250MHZ>,
      <apk 
       data hash MD5: 32K
       F3 78 C6 E4 30 EF C0 B8 10 B0 29 D1 C5 2F 87 67>)
(   4,<2005-09-15 12:02:27.50 +100>,<MAYBRIDGE\NMR>,<NMR_250MHZ>,
      <abs ABSG = 5 
       data hash MD5: 32K
       B1 FF CA F3 E1 CB 82 E5 19 17 80 7D 06 60 FC 2E>)
$$ ##END=
$$ 
$$ hash MD5
$$ 9B CA D8 66 CA 7A 34 FC AB 81 BA 62 E1 33 28 6D
##$RELAX= 
##$RELAX= 
##$RELAX= 
##$RELAX= 
##$RELAX= 
##$RELAX= 
##$RELAX= 
$$ Bruker specific parameters
$$ --------------------------
##$DU= <C:\u>
##$EXPNO= 9490
##$NAME= <ADRS>
##$PROCNO= 1
##$TYPE= <nmr>
##$USER= <dgb>
##$AMP= (0..31)
100 100 100 100 100 100 100 100 100 100 100 100 100 100 100 100 100 100 
100 100 100 100 100 100 100 100 100 100 100 100 100 100 
##$AQSEQ= 0
##$AQ_mod= 3
##$AUNM= <au_zg>
##$AUTOPOS= <14 >
##$BF1= 250.13
##$BF2= 250.13
##$BF3= 250.13
##$BF4= 250.13
##$BF5= 500.13
##$BF6= 500.13
##$BF7= 500.13
##$BF8= 500.13
##$BYTORDA= 1
##$CFDGTYP= 0
##$CFRGTYP= 5
##$CHEMSTR= <none>
##$CNST= (0..31)
1 1 145 1 1 1 1 1 1 1 1 1 1 1 1 1 1 1 1 1 1 1 1 1 1 1 1 1 1 1 1 1 
##$CPDPRG= <>
##$CPDPRG1= <>
##$CPDPRG2= <>
##$CPDPRG3= <>
##$CPDPRG4= <mlev>
##$CPDPRG5= <mlev>
##$CPDPRG6= <mlev>
##$CPDPRG7= <mlev>
##$CPDPRG8= <mlev>
##$CPDPRGB= <>
##$CPDPRGT= <>
##$D= (0..31)
0 1 0 0 0 0 0 0 0 0.06 0 0 0 0 0 0 0.0002 0 0 0 0 0 0 0 0 0 0 0 0 0 0 
0 
##$DATE= 1126782131
##$DBL= (0..7)
120 120 120 120 120 120 120 120 
##$DBP= (0..7)
150 150 150 150 150 150 150 150 
##$DBP07= 0
##$DBPNAM0= <>
##$DBPNAM1= <>
$$ [...]
##$SUBNAM7= <"">
##$SUBNAM8= <"">
##$SUBNAM9= <"">
##$SW= 20.6930455092707
##$SWIBOX= (0..15)
0 0 3 0 0 0 0 0 0 0 0 0 0 0 0 0 
##$SW_h= 5175.983436853
##$TD= 65536
##$TD0= 1
##$TE= 295.16
##$TE2= 300
##$TE3= 300
##$TEG= 300
##$TL= (0..7)
0 120 120 120 120 120 120 120 
##$TP= (0..7)
150 150 150 150 150 150 150 150 
##$TP07= 0
##$TPNAME0= <>
##$TPNAME1= <>
##$TPNAME2= <>
##$TPNAME3= <>
##$TPNAME4= <>
##$TPNAME5= <>
##$TPNAME6= <>
##$TPNAME7= <>
##$TPOAL= (0..7)
0.5 0.5 0.5 0.5 0.5 0.5 0.5 0.5 
##$TPOFFS= (0..7)
0 0 0 0 0 0 0 0 
##$TUNHIN= 0
##$TUNHOUT= 0
##$TUNXOUT= 0
##$USERA1= <user>
##$USERA2= <user>
##$USERA3= <user>
##$USERA4= <user>
##$USERA5= <user>
##$V9= 5
##$VALIST= <valist>
##$VCLIST= <CCCCCCCCCCCCCCC>
##$VD= 0
##$VDLIST= <DDDDDDDDDDDDDDD>
##$VPLIST= <PPPPPPPPPPPPPPP>
##$VTLIST= <TTTTTTTTTTTTTTT>
##$WBST= 1024
##$WBSW= 4
##$XGAIN= (0..3)
0 0 0 0 
##$XL= 0
##$YL= 0
##$YMAX_a= 325609
##$YMIN_a= -288017
##$ZGOPTNS= <>
##$ZL1= 120
##$ZL2= 120
##$ZL3= 120
##$ZL4= 120
##$ABSF1= 16.522
##$ABSF2= -4.171173
##$ABSG= 5
##$ABSL= 3
##$ALPHA= 0
##$AQORDER= 0
##$ASSFAC= 0
##$ASSFACI= 0
##$ASSFACX= 0
##$ASSWID= 0
##$AUNMP= <proc_1d>
##$AZFE= 0.1
##$AZFW= 0.1
##$BCFW= 0
##$BC_mod= 0
##$BYTORDP= 0
##$COROFFS= 0
##$CY= 12.5
##$DATMOD= 1
##$DC= 0
##$DFILT= <>
##$DTYPP= 0
##$F1P= 14.0000005364418
##$F2P= -0.99999901652339
##$FCOR= 0.5
##$FTSIZE= 32768
##$FT_mod= 6
##$GAMMA= 0
##$GB= 0
##$INTBC= 1
##$INTSCL= 1
##$ISEN= 128
##$LB= 0.3
##$LEV0= 0
##$LPBIN= 0
##$MAXI= 10000
##$MC2= 0
##$MEAN= 0
##$ME_mod= 0
##$MI= 0
##$NCOEF= 0
##$NC_proc= -3
##$NLEV= 6
##$NOISF1= 0
##$NOISF2= 0
##$NSP= 0
##$NTH_PI= 0
##$NZP= 0
##$OFFSET= 16.522
##$PC= 1
##$PHC0= -78.70261
##$PHC1= 8.582866
##$PH_mod= 1
##$PKNL= yes
##$PPARMOD= 0
##$PSCAL= 4
##$PSIGN= 0
##$REVERSE= no
##$SF= 250.13
##$SI= 32768
##$SIGF1= 0
##$SIGF2= 0
##$SINO= 400
##$SIOLD= 32768
##$SREGLST= <1H.CDCl3>
##$SSB= 0
##$STSI= 32768
##$STSR= 0
##$SW_p= 5175.98343685301
##$SYMM= 0
##$S_DEV= 0
##$TDeff= 65536
##$TDoff= 0
##$TI= <Analysis number 999999
Compound Code 99
Book Reference 9
Project Code 9>
##$TILT= no
##$TM1= 0
##$TM2= 0
##$TOPLEV= 0
##$USERP1= <user>
##$USERP2= <user>
##$USERP3= <user>
##$USERP4= <user>
##$USERP5= <user>
##$WDW= 1
##$XDIM= 32768
##$YMAX_p= 519826625
##$YMIN_p= -154373
$$ End of Bruker specific parameters
$$ ---------------------------------
##NTUPLES= NMR SPECTRUM
##VAR_NAME=  FREQUENCY,     SPECTRUM/REAL,   SPECTRUM/IMAG
##SYMBOL=    X,             R,               I
##VAR_TYPE=  INDEPENDENT,   DEPENDENT,       DEPENDENT
##VAR_FORM=  AFFN,          ASDF,            ASDF
##VAR_DIM=   32768,         32768,           32768
##UNITS=     HZ,            ARBITRARY UNITS, ARBITRARY UNITS
##FACTOR=    0.157963299565203, 1,           1
##FIRST=     4132.6476996994, 0,             0
##LAST=      -1043.33573715361, 0,           0
##MIN=       -1043.33573715361, -154373,     0
##MAX=       4132.6476996994, 519826625,     0
$$ Real data points
##PAGE= N=1
##DATA TABLE= (X++(R..R)), XYDATA
$$ [...]
$$ plain form
16967 25674 20375 2235 3213 3016 -15521 -1921 19935 53036 2811 -34739 -54811 -52545 2661
16954 2661 20954 -4219 -30753 -31251 -1483 -10441 -8766 -6702 -11623 -41140 -46222 -26929 -39764
16941 -39764 -47531 -48075 -43829 -47009 -24341 -13996 -14292 -3250 -47093 -41602 -10741 6720 42404
16928 42404 6589 -34541 -20429 -33113 -51808 -45302 -20741 -15117 1024 -5991 14608 -23501
16916 -23501 -38599 7441 65434 97039 62875 36846 -1047 -21634 30646 10224 11520 20603
16904 20603 7617 -2705 -28336 -55389 -12391 5931 -3893 25368 37838 22261 36430 104549
16892 104549 91706 51737 37195 20811 -30777 -48644 -8610 -2768 -17861 -34759 7968 -5453
16880 -5453 -12774 17093 20496 40063 18289 1382 6138 35521 37412 4932 10397 21553 14684
$$ packed form
16967B5674n299j8140R78j97j8537J3600K1856L3101n0225l7550k0072K266N5206
16954B661J8293k5173k6534m98K9768q958J675K064m921k9517n082J9293j2835
16941c9764p767n44M246l180K2668J0345k96J1042m3843N491L0861J7461L5684
16928D2404l5815m1130J4112j2684j8695O506K4561N624J6141p015K0599l8109
16916b3501j5098M6040N7993L1605l4164k6029l7893k0587N2280k0422J296R083
16904B0603j2986j0322k5631k7053M2998J8322r824K9261J2470j5577J4169O8119
16892A04549j2843l9969j4542j6384n1588j7867M0034N842j5093j6898M2727j3421
16880e453p321K9867L403J9567k1774j6907M756K9383J891l2480N465J1156o869
$$ plain form
16867 14684 8527 39548 59163 48278 51910 33387 24833 12548 -8593 -45355 -39117 -38403 -28236
16854 -28236 -29176 -51658 -67293 -71950 -24560 6277 3785 8184 -8473 -68756 -62097 -36649 -2662
16841 -2662 -9958 -51061 -64146 -57187 -61595 -39871 -31196 -54822 -39523 -28666 -5440 -3543 -30777
16828 -30777 -65300 -54218 -36986 -907 19053 31292 18599 46196 7016 -20841 -19128 -43538
16816 -43538 -9636 -16886 4086 9192 -4295 -1919 -45661 -56527 -76879 -20912 43283 52771
16804 52771 12061 -11682 -8546 17764 38937 -14387 -16693 20629 44340 56650 -14520 -79470
16792 -79470 -53281 3250 9087 -10910 -19242 -61925 -41757 19264 47764 37616 4957 -8595
16780 -8595 -30574 -42353 -39199 -23714 6073 -4654 4516 -10651 -24042 -19008 -33432 -5058
$$ packed form
16867A4684o157L1021J9615j0885L632j8523q554j2285k1141l6762O238P14J0167
16854b8236r40k2482j5635m657M7390L0837k492M399j6657o0283O659K5448L3987
16841b662p296m1103j3085O959m408K1724Q675k3626J5299J0857K3226J897k7234
16828c0777l4523J1082J7232L6079J9960J2239j2693K7597l9180k7857J713k4410
16816d3538L3902p250K0972N106j3487K376m3742j0866k0352N5967O4195R488
16804E2771m0710k3743L136K6310K1173n3324k306L7322K3711J2310p1170o4950
16792g9470K6189N6531N837j9997q332m2683K0168O1021K8500j0148l2659j3552
16780h595k1979j1779L154J5485K9787j0727R170j5167j3391N034j4424K8374
$$ plain form
16768 -5058 -13181 -26534 -26948 -41600 -4337 -12520 -50844 -42221 -17103 4551 -14750 -49079 -40948
16755 -40948 -8337 23148 16702 10150 28693 5510 8112 39782 38841 47979 63764 34303 9141
16742 9141 -11218 -39379 -62282 -60068 -44369 26054 47860 26958 23000 11149 -28611 -21218
16730 -21218 -19418 -16014 -5739 16307 20017 -25291 -55539 -82697 -76551 -39632 -65863 -63649 -31559
16717 -31559 -33555 -47632 -57985 -36516 -29749 4610 -1710 38903 31531 10962 44917 33117
16705 33117 44587 35240 12000 22264 268 -1450 36221 55574 45656 24813 -15355 -29074
16693 -29074 -23123 -58568 -64420 -55168 -5076 34883 -33617 -62048 -28376 -2445 2342 11878 22357
16680 22357 -3761 -85270 -88192 -84531 -71454 -40536 -40766 -8241 -27647 -18262 18666 38853 60487
$$ packed form
16768e058q123j3353m14j4652L7263q183l8324Q623K5118K1654j9301l4329Q131
16755d0948L2611L1485o446o552J8543k3183K602L1670r41R138J5785k9461k5162
16742I141k0359k8161k2903K214J5699P0423K1806k0902l958j1851l9760P393
16730b1218J800L404J0275K2046L710m5308l0248k7158O146L6919k6231K214L2090
16717c1559j996j4077j0353K1469O767L4359o320M0613p372k0569L3955j1800
16705C3117J1470r347k3240J0264k1996j718L7671J9353r918k0843m0168j3719
16693b9074N951l5445n852R252N0092L9959o8500k8431L3672K5931M787R536J0479
16680B2357k6118q1509k922L661J3077L0918k30L2525j9406R385L6928K0187K1634
$$ plain form
16667 60487 70656 51159 -11094 -47084 -66059 -56072 -16256 -15186 -21909 -37190 -31903 -24719 -21652
16654 -21652 -9596 -28879 -21 29046 32325 6697 -29231 4503 43190 67667 39487 -13966
16642 -13966 -51303 -61319 -17205 13991 -14749 -28154 -60323 -50769 -47355 -34328 6660 5748
16630 5748 741 -31044 -31505 -18298 10985 10126 7459 -14532 -41307 -12722 13954 -35210 -52493
16617 -52493 -56288 -50285 -14042 -28790 -33723 -66768 -72389 -53015 -15298 14468 11358 -9622 -27867
16604 -27867 -49501 -68202 -51667 -41083 -23520 -21216 1908 40573 61821 84113 56328 8429
16592 8429 -38115 -70594 -55429 -20695 -22468 -27598 -16471 -15283 -14519 -28491 -29294 8325 22273
16579 22273 18741 -16597 -85054 -52494 -13030 3267 -7237 -9247 39805 17080 2705 -12399
$$ packed form
16667F0487J0169j9497o2253l5990j8975R987L9816J070o723j5281N287P184L067
16654b1652J2056j9283K8858K9067L279k5628l5928L3734L8687K4477k8180n3453
16642a3966l7337j0016M4114L1196k8740j3405l2169R554L414J3027M0988r12
16630E748n007l1785m61J3207K9283q59k667k1991k6775K8585K6676m9164j7283
16617e2493l795O003L6243j4748m933l3045n621J9374L7717K9766l110k0980j8245
16604b7867k1634j8701J6535J0584J7563K304K3124L8665K1248K2292k7785m7899
16592H429m6544l2479J5165L4734j773n130J1127J188P64j3972q03L7619J3948
16579B2273l532l5338o8457L2560L9464J6297j0504k010M9052k2725j4375j5104
$$ plain form
16567 -12399 -40050 -68630 -23494 15165 1835 24054 53436 48136 39150 15911 14594 17741
16555 17741 -1547 -21858 -37829 5111 29396 -6059 247 29461 -7395 -315 7659 -14839
16543 -14839 -57554 -6098 45806 19582 10150 -25733 -51022 -38420 -5478 26090 28500 28848
16531 28848 40441 32948 4456 -11631 -10364 -44141 -53185 -24907 -9871 16641 36430 77123
16519 77123 70513 9808 -33929 -75605 -84738 -37873 -11350 -23512 -31953 -57000 -89115 -106722
16507 -106722 -150563 -105094 -17913 19727 -30873 -37693 7404 44353 47325 16008 -25316 -45136
16495 -45136 -51463 -43897 -6627 1809 -32963 -34442 -36817 -65288 -74797 -49356 -15227 -27314 -36847
16482 -36847 -56599 -28716 -24103 -35133 -45999 -35812 -48971 -13274 5151 -1168 3109 1330
$$ packed form
16567a2399k7651k8580M5136L8659j3330K2219K9382n300q986k3239j317L147
16555A7741j9288k0311j5971M2940K4285l5455O306K9214l6856P080P974k2498
16543a4839m2715N1456N1904k6224r432l5883k5289J2602L2942L1568K410L48
16531B8848J1593p493k8492j6087J267l3777r044K8278J5036K6512J9789M0693
16519G7123o610o0705m3737m1676r133M6865K6523j2162q441k5047l2115j7607
16507a06722m3841M5469Q7181L7640n0600o820M5097L6949K972l1317m1324j9820
16495d5136o327P566L7270Q436l4772j479k375k8471r509K5441L4129j2087r533
16482c6847j9752K7883M613j1030j0866J0187j3159L5697J8425o319M277j779
$$ plain form
16470 1330 -35231 -73822 -72661 -16924 25452 75219 74162 73505 44828 44643 27571 10827 16695
16457 16695 44236 19174 16177 21293 -47021 -67343 -63308 -67564 -49051 -24620 -18722 33232 12082
16444 12082 -23923 -18241 -49134 -51164 -39330 -28572 -36587 -22223 9579 -8588 -31985 -39582
16432 -39582 -9702 28534 53234 42422 -8511 -14892 21069 21970 -18055 18833 44777 -8416
16420 -8416 -18758 -56079 -64968 -69360 -67798 -87598 -66652 -22702 -14237 -39855 -45583 -61197 -67724
16407 -67724 -37987 -6000 11143 9686 -9194 -6108 -42898 -57384 -33054 20690 51407 14735
16395 14735 -17227 -29396 -1974 4153 -4561 -16419 726 -4381 -27103 -49707 -24104 -11516
16383 -11516 -12957 39082 56810 68746 10880 14117 31981 25834 22306 5871 2064 -16140 -1960
$$ packed form
16470A330l6561l8591J161N5737M2376M9767j057o57k8677j85j7072j6744N868
16457A6695K7541k5062k997N116o8314k0322M035m256J8513K4431N898N1954k1150
16444A2082l6005N682l0893k030J1834J0758q015J4364L1802j8167k3397p597
16432c9582K9880L8236K4700j0812n0933o381L5961R01m0025L6888K5944n3193
16420h416j0342l7321q889m392J562j9800K0946M3950Q465k5618n728j5614o527
16407f7724K9737L1987J7143j457j8880L086l6790j4486K4330N3744L0717l6672
16395A4735l1962j2169K7422O127q714j1858J7145n107k2722k2604K5603J2588
16383a1516j441N2039J7728J1936n7866L237J7864o147l528j6435l807j8204J4180
$$ plain form
16370 -1960 23306 9018 26882 37410 30828 -15946 -81986 -87876 -56058 -3082 26573 14163
16358 14163 -7562 -31290 18419 12010 -18690 -36026 -29165 -54874 -71473 -17361 6893 27127
16346 27127 44837 56069 51585 28196 9517 -3927 -13217 6499 -3344 6836 24022 10561
16334 10561 -20458 -24836 -5175 15459 26543 20890 -12538 2936 12867 17506 -11019 -49479
16322 -49479 -14653 11699 -10559 -9227 -30634 -44248 -42066 -37563 -20572 -16101 -61903 -91212
16310 -91212 -59647 23103 64074 10584 37712 76642 83865 48283 24285 -32790 -25029 -33712
16298 -33712 -19022 -13659 -804 -22792 -46138 -48610 -26067 7918 29219 8809 -17875 -9337
16286 -9337 -9973 3766 36237 40261 53488 38930 43236 82036 69286 32304 26417 28359 23753
$$ packed form
16370a960K5266j4288J7864J0528o582m6774o6040n890L1818N2976K9655j2410
16358A4163k1725k3728M9709o409l0700j7336O861k5709j6599N4112K4254K0234
16346B7127J7710J1232m484k3389j8679j3444r290J9716r843J0180J7186j3461
16334A0561l1019m378J9661K0634J1084n653l3428J5474R931M639k8525l8460
16322d9479L4826K6352k2258J332k1407j3614K182M503J6991M471m5802k9309
16310i1212L1565Q2750M0971n3490K7128L8930P223l5582k3998n7075P761q683
16298c3712J4690N363J2855k1988k3346k472K2543L3985K1301k0410k6684Q538
16286i337o36J3739L2471M024J3227j4558M306L8800j2750l6982n887J942m606
$$ plain form
16273 23753 -1126 -14194 -46569 -40511 -9102 10914 14599 44801 64548 70068 56176 43032
16261 43032 -36911 -64304 -40310 -18226 -7462 -52003 -47083 -24239 23370 61806 39132 24786
16249 24786 -32087 -37784 -6241 -29131 -68790 -50494 -41968 -34185 38743 -1734 -3740 32010
16237 32010 27372 21820 37385 19777 -17647 -70783 -75642 -74897 -40086 -14140 5460 4266 -20509
16224 -20509 -5111 22817 72941 46577 37045 10435 4043 8566 -19463 6218 16142 -6143
16212 -6143 22749 30222 6438 -24838 -46640 -60528 -15115 577 -13049 -33623 -10122 -26855
16200 -26855 -55020 -41488 -2652 15020 -5600 -27292 -30506 -18359 22781 49715 41763 24800
16188 24800 40111 44590 14898 -27110 1040 30757 20777 9480 -31332 7711 15704 23504
$$ packed form
16273B3753k4879j3068l2375O058L1409K0016L685L0202J9747N520j3892j3144
16261D3032p9943k7393K3994K2084J0764m4541M920K2844M7609L8436k2674j4346
16249B4786n6873n697L1543k2890l9659J8296Q526P783P2928m0477k006L5750
16237C2010m638n552J5565j7608l7424n3136m859P45L4811K5946J9600j194k4775
16224b0509J5398K7928N0124k6364r532k6610o392M523k8029K5681R924k2285
16212f143K8892P473k3784l1276k1802j3888M5413J5692j3626k0574K3501j6733
16200b6855k8165J3532L8836J7672k0620k1692l214J2147M1140K6934p952j6963
16188B4800J5311M479k9692m2008K8150K9717r980j1297m0812L9043P993P800
$$ plain form
16176 23504 27750 -26412 -50261 -50031 -19072 -29429 -18627 -3527 -9326 -3588 -2884 2956 14568
16163 14568 18576 -9763 -2761 -12752 -49760 -57986 -12262 4940 27186 47465 60260 51932 31899
16150 31899 8817 -7648 10574 30733 40657 -7314 -25953 -25770 -70866 -58602 -34555 -17336
16138 -17336 -37289 -27827 -21861 -13678 24443 14077 -13493 -39679 -62733 -66109 -20813 8971
16126 8971 -11287 18385 16164 28675 26846 36021 21609 60138 85928 80733 48493 1910 -12280
16113 -12280 -13696 -5108 14504 48769 18818 20127 2621 -13953 -34653 -24382 -33621 -24603 0
16100 0 -11685 3570 -896 -9984 34581 48390 16702 -14511 15261 20163 19636 24580 -3944 -37255
16086 -37255 -35019 -18915 6380 -7331 -21702 -12618 30538 69778 64173 6268 -40554 -17597
$$ packed form
16176B3504M246n4162k3849K30L0959j0357J0802J5100n799N738P04N840J1612
16163A4568M008k8339P002r991l7008q226M5724J7202K2246K0279J2795q328k0033
16150C1899k3082j6465J8222K0159R924m7971j8639J83m5096J2264K4047J7219
16138a7336j9953R462N966Q183L8121j0366k7570k6186k3054l376M5296K9784
16126H971k0258K9672k221J2511j829R175j4412L8529K5790n195l2240m6583j4190
16113a2280j416Q588J9612L4265k9951J309j7506j6574k0700J0271r239R018K4603
16100@j1685J5255m466r088M4565J3809l1688l1213K9772M902n27M944k8524l3311
16086c7255K236J6104K5295j3711j4371R084M3156L9240n605n7905m6822K2957
$$ plain form
16074 -17597 17033 -3786 -226 19145 4074 -22283 -31514 -61100 -53257 -45556 -13651 28988
16062 28988 30215 -18154 -46331 -53798 -57731 -62992 -42507 1053 7006 -39566 -55776 -29637 -9143
16049 -9143 6258 34535 36639 8145 -5190 -27968 -10341 -34898 -71355 -101929 -82820 -47075
16037 -47075 -70394 -70366 -61148 -50211 -29100 -16159 1093 15667 -162 -15779 -707 -17023
16025 -17023 -6318 -4410 -4840 -11710 -61254 -45852 -9299 8129 -15366 -45920 -6247 16039
16013 16039 5617 50483 40614 26825 13051 -25993 -31981 -28560 3830 3540 -17473 -54533 -75177
16000 -75177 -66219 -16087 -8123 -9682 -17476 -54194 -75363 -70811 7265 -13654 -56560 -69645 -58172
15987 -58172 -50947 -47824 -54711 -43248 -91950 -70165 -77324 -54777 -24716 -5468 -3185 21355 7869
$$ packed form
16074a7597L4630k0819L560J9371j5071k6357r231k9586P843P701L1905M2639
16062B8988J227m8369k8177p467l933n261K0485M3560N953m6572j6210K6139K0494
16049i143J5401K8277K104k8494j3335k2778J7627k4557l6457l0574J9109L5745
16037d7075k3319K8R218J0937K1111J2941J7252J4574j5829j5617J5072j6316
16025a7023J0705J908m30o870m9544J5402L6553J7428k3495l0554L9673K2286
16013A6039j0422M4866r869j3789j3774l9044n988L421L2390k90k1013l7060k0644
16000g5177Q958N0132P964j559p794l6718k1169M552P8076k0919m2906j3085J1473
15987e8172P225L123o887J1463m8702K1785p159K2547L0061J9248K283K4540j3486
$$ plain form
15974 7869 -35434 -58451 -87833 -100563 -99744 -66450 -40796 -35458 -59342 -68102 -37639 -33260 -36921
15961 -36921 -41104 -41671 -19649 -12730 26948 67076 47006 35658 -24692 6851 21670 1695
15949 1695 -31187 196 -6556 -6041 -13197 -6913 -10465 -28182 -1877 12799 -10779 -41862 -35413
15936 -35413 27214 60654 67529 54639 11039 -961 -11689 -43849 -33963 18382 -2547 -12876
15924 -12876 31767 15345 8439 5211 -17201 -16170 -10752 -44587 -46035 -42439 -21346 18808 20143
15911 20143 -1147 -7984 2929 -10567 808 17011 12532 2577 46776 42541 11428 31615
15899 31615 36082 48243 48306 -7334 -15810 8730 27762 -6344 -19163 -28201 -17943 -6660 7095
15886 7095 1319 -23043 -7625 -31425 -32922 -33610 -6865 -6299 -8584 -35369 -65129 -65883 -65954 -51931
$$ packed form
15974G869m3303k3017k9382j2730Q19L3294K5654N338k3884q760L0463M379l661
15961c6921m183n67K2022O919L9678M0128k0070j1348o0350L1543J4819j9975
15949A695l2882L1383o752N15p156O284l552j7717K6305J4676k3578l1083O449
15936c5413O2627L3440O875j2890m3600j2000j0728l2160R886N2345k0929j0329
15924a2876M4643j6422o906l228k2412J031N418l3835j448L596K1093M0154J335
15911B0143k1290o837J0913j3496J1375J6203m479r955M4199m235l1113K0187
15899C1615M467J2161O3n5640q476K4540J9032l4106j2819r038J0258J1283J3755
15886G095n776k4362J5418k3800j497o88K6745N66k285k6785k9760p54p1J4023
$$ plain form
15872 -51931 -2808 50053 47134 33962 33908 -17018 -52342 -47453 2529 10805 29000 46436 23733
15859 23733 34463 24769 26246 17780 3747 28323 71282 64759 34932 4227 -4283 -16097 -9185
15846 -9185 -16432 -59525 -44722 -47661 -27309 10573 33774 29197 22716 32276 53906 69239 25297
15833 25297 1327 -1064 -8622 -35792 -26210 4484 12541 46451 7985 14346 9816 -10213 -7884
15820 -7884 -30909 -18608 -9116 -9362 -17142 -27148 -16943 -10580 -6931 7836 44927 28267 23234
15807 23234 15270 30032 2027 -49557 -45421 -52341 -94894 -110530 -73930 -40733 -51339 -51611 -32395
15794 -32395 -44738 -54883 -68696 -79130 -52214 -17528 -30657 -47629 -53877 -44928 -12916 -37407
15782 -37407 -57199 -57521 -29515 -41797 -73392 -70667 -67406 -31546 4369 -18287 -17502 12057 17393
$$ packed form
15872e1931M9123N2861k919j3172n4n0926l5324M889M9982Q276J8195J7436k2703
15859B3733J0730r694J477q466j4033K4576M2959o523k9827l0705q510j1814O912
15846i185p247m3093J4803k939K0352L7882K3201m577o481R560K1630J5333m3942
15833B5297k3970k391p558k7170R582L0694Q057L3910l8466O361m530k0029K329
15820g884k3025J2301R492k46p780j0006J0205O363L649J4767L7091j6660n033
15807B3234p964J4762k8005n1584M136o920m2553j5636L6600L3197j0606k72J9216
15794c2395j2343j0145j3813j0434K6916L4686j3129j6972o248Q949L2012k4491
15782c7407j9792l22K8006j2282l1595K725L261L5860L5915k2656P85K9559N336
$$ plain form
15769 17393 -3220 -14537 -19319 -44300 -28358 -25169 -52527 -68245 -41899 -53248 -80933 -117840
15757 -117840 -69789 -19390 -2401 -21945 -42560 -75039 -67297 -37044 -20658 -24849 -3026 -3216
15745 -3216 -34934 -36581 -19722 12187 -40390 -73477 -43166 2258 -9538 -29738 -8783 23869
15733 23869 36920 3162 -34220 -15892 10883 14648 -24660 -51888 -45641 -50474 -66922 -1364
15721 -1364 -26986 -62070 -105650 -118753 -109365 -66759 -7090 -16536 -50675 -102492 -118043 -87409
15709 -87409 -66292 -71944 -55320 -2306 -15454 -20495 -12148 -16947 220 6205 -29214 -48628 -29547
15696 -29547 -26274 -17694 11486 17527 11850 -9674 -28161 -39495 -44253 -10029 37622 22047 -5961
15683 -5961 -47833 -36016 -57783 -48185 -47117 -26117 7583 29781 28386 71208 129859 132355 102637
$$ packed form
15769A7393k0613j1317m782k4981J5942L189k7358j5718K6346j1349k7685l6907
15757a17840M8051N0399J6989j9544k0615l2479P742L0253J6386m191K1823j90
15745c216l1718j647J6859L1909n2577l3087L0311M5424j1796k0200K0955L2652
15733B3869J3051l3758l7382J8328K6775L765l9308k7228O247m833j6448O5558
15721a364k5622l5084m3580j3103R388M2606N9669r446l4139n1817j5551L0634
15709h7409K1117n652J6624N3014j3148n041Q347m799J7167N985l5419j9414J9081
15696b9547L273Q580K9180O041n677k1524j8487j1334m758L4224M7651j5575k8008
15683e961m1872J1817k1767R598J068K1000L3700K2198j395M2822N8651K496k9718
$$ plain form
15670 102637 86517 84388 62887 52878 21002 -5566 18632 33849 -12753 -15165 -6408 -6309 -45060
15657 -45060 -33645 -12722 -50576 -41091 -6390 -5404 -16589 -7344 30319 57916 61332 45825 7124
15644 7124 -55431 -82837 -51615 463 3811 -11562 -27208 -34629 5139 39252 24568 19293
15632 19293 18904 5533 -35009 -75690 -35236 -19406 -28155 -41867 -40170 -53831 -55180 -49617 -47376
15619 -47376 -52881 -64209 -44575 4709 15541 -4253 -7370 -16267 2647 43895 15015 3652
15607 3652 -27638 -41549 -30286 -19854 5429 -3940 -2588 -29134 -44008 -32272 -58310 -51562
15595 -51562 -14816 -1663 -16351 -28657 -9932 -29217 -7168 8124 24009 9227 4988 -42578
15583 -42578 -64392 -57910 -8246 19188 28679 17776 -35921 -77932 -26469 25992 52967 54244
$$ packed form
15670A02637j6120k129k1501j0009l1876k6568K4198J5217m6602k412Q757R9l8751
15657d5060J1415K0923l7854R485L4701R86j1185R245L7663K7597L416j5507l8701
15644G124o2555k7406L1222N2078L348j5373j5646p421L9768L4113j4684n275
15632A9293l89j3371m0542m0681M0454J5830q749j3712J697j3661j349N563K241
15619d7376n505j1328J9634M9284J0832j9794l117q897J8914M1248k8880j1363
15607C652l1290j3911J1263J0432K5283r369J352k6546j4874J1736k6038O748
15595e1562L6746J3153j4688j2306J8725j9285K2049J5292J5885j4782m239m7566
15583d2578k1814O482M9664K7434R491j0903n3697m2011N1463N2461K6975J277
$$ plain form
15571 54244 33456 21597 10259 7250 3914 4451 8361 16159 -1043 1144 28498 -5564 -35727
15558 -35727 -43830 -14110 4162 48848 15865 -6219 1242 10750 -15907 -16351 4077 -10465 7481
15545 7481 -18322 -63441 -91729 -66635 -41494 -3110 32060 15368 -43754 -42048 -9085 22905
15533 22905 64674 36052 31616 62322 8675 -80219 -76823 16080 58090 72044 71891 52340
15521 52340 12441 12732 32207 10332 13530 17702 22302 10631 -65 57848 17773 -16767 -14884
15508 -14884 -10986 -11126 46581 74189 68942 25779 -42094 -39108 -56497 -40735 -7621 -1663 17440
15495 17440 28789 73516 83589 63864 40379 9677 23451 3015 -36557 -44179 -67190 -45648
15483 -45648 -61708 -66538 -46686 -65570 -81005 -71994 -36864 -27699 -49830 -95256 -73657 -57185
$$ packed form
15571E4244k0788j1859j1338l009l336N37L910P798j7202K187K7354l4062l0163
15558c5727q103K9720J8272M4686l2983k2084P461R508k6657m44K0428j4542J7946
15545G481k5803m5119k8288K5094K5141L8384L5170j6692n9122J706L2963L1990
15533B2905M1769k8622m436L0706n3647q8894L396R2903M2010J3954j53j9551
15521E2340l9899K91J9475k1875L198M172M600j1671j0696N7913m0075l4540J883
15508a4884L898j40N7707K7608n247m3163o7873K986j7389J5762L3114N958J9103
15495A7440J1349M4727J0073j9725k3485l0702J3774k0436l9572p622k3011K1542
15483d5648j6060m830J9852j8884j5435R011L5130R165k2131m5426K1599J6472
$$ plain form
15471 -57185 -63255 -73405 -76298 -36972 -31783 -30926 -34910 -11163 5875 22448 53558 62236 47589
15458 47589 5487 3450 6772 -30590 -49905 -64065 23988 32849 -11694 -8469 21176 33591
15446 33591 69181 47355 33506 40548 83833 91127 45165 7601 -52532 -52963 12755 9091 16033
15433 16033 23975 31970 8127 -14633 -22836 -10727 -1072 7470 -7210 -32367 -45287 -32011 -33870
15420 -33870 -19171 2656 14031 31519 22499 -21933 -37380 -26518 -24593 -49650 -32244 11143
15408 11143 23389 23669 -20334 -54939 -52140 3059 4402 -23577 -5418 16717 69579 39134
15396 39134 4923 -1819 -21746 -39610 -37967 -70309 -69713 -38987 12461 45735 41791 8763 -23733
15383 -23733 -25877 -400 -140 -42748 -5127 53969 40967 34034 -7640 -42744 -49332 -6489 22556
$$ packed form
15471e7185o070j0150k893L9326N189Q57l984K3747J7038J6573L1110Q678j4647
15458D7589m2102k037L322l7362j9315j4160Q8053Q861m4543L225K9645J2415
15446C3591L5590k1826j3849P042M3285P294m5962l7564o0133m31O5718l664O942
15433A6033P942P995k3843k2760q203J2109R655Q542j4680k5157j2920J3276j859
15420c3870J4699K1827J1375J7488r020m4432j5447J0862J925k5057J7406M3387
15408A1143J2246K80m4003l4605K799N5199J343k7979J8159K2135N2862l0445
15396C9134l4211o742j9927j7864J643l2342N96L0726N1448L3274l944l3028l2496
15383b3733k144K5477K60m2608L7621N9096j3002o933m1674l5104o588M2843K9045
$$ plain form
15370 22556 36063 33013 16983 -8303 -14760 17291 35539 -2418 -34163 1878 -5675 -9459
15358 -9459 10007 17763 7561 -1400 3675 3707 6033 10863 -28917 -20786 4210 -20971 -80778 -90511
15344 -90511 -98810 -86557 -50779 -39189 9305 17458 -15347 -42920 -90925 -122416 -104117 -73244
15332 -73244 -47949 -18091 -56476 -52923 -29811 -7262 -50122 -62395 -40883 -20528 -16152 -24280
15320 -24280 15548 33159 -7756 -44700 -68459 -88277 -73118 -25673 -58723 -89870 -89675 -59745
15308 -59745 -11989 -38917 -78297 -60764 -71070 -49880 -2543 45049 44622 23104 6529 11078
15296 11078 21735 15118 16148 22822 28379 12636 14670 32143 -3720 -20636 -20480 -58965 -42124
15283 -42124 -20735 -17758 -21790 -46329 -32163 -32960 -47430 -36300 -7184 54644 49463 57182 47942
$$ packed form
15370B2556J3507l050j6030k5286o457L2051J8248l7957l1745L6041p553l784
15358i459J9466P756j0202q961N075L2K326M830l9780Q131K4996k5181n9807r733
15344i0511q299J2253L5778J1590M8494Q153l2805k7573m8005l1491J8299L0873
15332g3244K5295K9858l8385L553K3112K2549m2860j2273K1512K0355M376q128
15320b4280L9828J7611m0915l6944k3759j9818J5159M7445l3050l1147J95K9930
15308e9745M7756k6928l9380J7533j0306K1190M7337M7592m27k1518j6575M549
15296A1078J0657o617J030O674N557j5743K034J7473l5863j6916J56l8485J6841
15283d2124K1389K977m032k4539J4166p97j4470J1130K9116O1828n181P719r240
$$ plain form
15270 47942 56825 79201 68616 49969 28327 12417 41884 47543 -2631 -20604 -21338 -15008 11769
15257 11769 8405 12363 23695 28072 -2600 32857 -7385 -21491 -17367 -6154 22277 37675
15245 37675 56478 68046 51412 19902 37552 50394 52407 30225 36707 25285 15171 23849
15233 23849 10790 13722 45110 36624 -25077 -39228 -22624 -7615 -8672 -38534 -28951 -16548
15221 -16548 -4466 -3108 -62081 -99369 -68257 -57701 -83842 -86784 -92366 -69974 -64625 -92848
15209 -92848 -76544 -24523 19239 17575 660 1628 6281 33223 11525 -9833 24031 30062 -24143
15196 -24143 -68929 -49879 -23692 -44978 -50333 -63719 -45675 64 8179 14634 25091 783
15184 783 23141 69631 64306 38768 20687 28657 17765 30423 62580 60898 63374 35692 -16029
$$ packed form
15270D7942Q883K2376j0585j8647k1642j5910K9467N659n0174j7973p34O330K6777
15257A1769l364L958J1332M377l0672L5457m0242j4106M124J1213K8431J5398
15245C7675J8803J1568j6634l1510J7650J2842K013k2182O482j1422j0114Q678
15233B3849j3059K932L1388q486o1701j4151J6604J5009j057k9862R583J2403
15221a6548J2082J358n8973l7288L1112J0556k6141k942n582K2392N349k8223
15209i2848J6304N2021M3762j664j6915R68M653K6942k1698k1358L3864O031n4205
15196b4143m4786J9050K6187k1286n355j3386J8044M5739Q115O455J0457k4308
15184G83K2358M6490n325k5538j8081P970j0892J2658L2157j682K476k7682n1721
$$ plain form
15171 -16029 7035 -8651 -16994 -6165 -2793 -35840 -29090 -24249 -56479 -77976 -135912 -113333
15159 -113333 -21547 2783 13721 -1083 -48581 -94757 -83886 -24018 7880 1304 -35461 -70579
15147 -70579 -46939 7580 10232 -54715 -73767 -40932 -33813 26581 56824 42031 36044 60536
15135 60536 34635 46231 8569 25805 77723 65915 55004 51452 28448 -23432 -31542 -25155
15123 -25155 -43458 -66939 -21525 3936 -34068 -24824 -12757 -12407 10220 48758 52740 20810
15111 20810 21227 -13560 -62390 -43242 -62430 -64455 -47839 -59020 -57684 -41706 -56306 -69627
15099 -69627 -26217 -13851 -34068 -26918 34194 77605 82394 75335 79194 76792 57409 41362 34546
15086 34546 23504 24962 21503 -1616 25686 37169 43632 56085 42894 33500 22973 15082 -4348
$$ packed form
15171a6029K3064j5686q343J0829L372l3047O750M841l2230k1497n7936K2579
15159a13333R1786K4330J0938j4804m7498m6176J0871N9868L1898o576l6765l5118
15147g0579K3640N4519K652o4947j9052L2835P119O0394L0243j4793n987K4492
15135F0536k5901J1596l7662J7236N1918j1808j0911l552k3004n1880q110O387
15123b5155j8303k3481M5414K5461l8004R244J2067L50K2627L8538L982l1930
15111B0810M17l4787m8830J9148j9188k025J6616j1181J336J5978j4600j3321
15099f9627M3410J2366k0217P150O1112M3411M789p059L859k402j9383j6047o816
15086C4546j1042J458l459k3119K7302J1483O463J2453j3191r394j0527p891j9430
$$ plain form
15073 -4348 5152 -1904 40645 54947 63944 39927 6413 -2000 -31766 -26818 -15790 -29388 -26224
15060 -26224 -25044 -11263 6151 68981 113787 85048 82954 92932 101014 62156 41572 48495 26253
15047 26253 28169 2399 -33718 -29828 -52659 -31890 -30355 -37415 -2992 14552 18891 14357 12138
15034 12138 27494 21685 13030 -1630 -28057 -13073 -22382 -15811 14807 12782 428 14381 34881
15021 34881 -7916 2044 22053 29067 -6075 9145 -9861 -54125 -54596 -62736 -28042 21717 51078
15008 51078 88802 85061 54995 25425 14632 -1836 -24341 -61703 -31209 -14688 -58453 -70065
14996 -70065 -78672 -62422 1662 -6384 -30855 -30457 -62716 -23876 -869 -30375 -26386 -19249 5696
14983 5696 -28740 -65940 -10732 23791 14471 2921 7276 10522 16600 24602 21579 -8083 -18013
$$ packed form
15073d348R500p056M2549J4302Q997k4017l3514q413k9766M948J1028j3598L164
15060b6224J180J3781J7414O2830M4806k8739k094R978Q082l8858k0584O923k2242
15047B6253J916k5770l6117L890k2831K0769J535p060L4423J7544M339m534k219
15034A2138J5356n809q655j4660k6427J4984r309O571L0618k025j2354J3953K0500
15021C4881m2797R960K0009P014l5142J5220j9006m4264m71q140L4694M9759K9361
15008E1078L7724l741l0066k9570j0793j6468k2505l7362L0494J6521m3765j1612
14996g0065q607J6250O4084q046k4471L98l2259L8840K3007k9506L989P137K4945
14983E696l4436l7200N5208L4523r320j1550M355L246O078Q002l023k9662r930
$$ plain form
14970 -18013 19477 41534 8256 -17829 12971 4159 -45461 -61415 -41279 -36221 -38720 -65981
14958 -65981 -84618 -70561 -63922 -72735 -25139 3894 -30674 -29028 10959 -5811 26601 9916
14946 9916 -10315 -56110 -44019 -13431 19310 8136 35881 63183 51466 -4888 -43279 -30315
14934 -30315 -10762 3275 4014 -46373 -75675 -62400 -64585 -38602 -12330 7185 -38089 -51211
14922 -51211 -42289 -53492 -36211 -50869 -56486 -50263 -3748 -2181 -12571 -56340 -76999 -34678
14910 -34678 5404 -3207 -36860 -34337 9740 20188 20984 5920 7728 24024 23531 6110 -3442
14897 -3442 -41767 -65575 -80221 -31471 -30749 -20538 -50229 -81811 -62155 -23062 -12979 5226
14885 5226 -40217 -51755 19311 53595 47278 38605 29785 935 3299 19275 19797 -16046 -40662
$$ packed form
14970a8013L7490K2057l3278k6085L0800q812m9620j5954K0136N058k499k7261
14958f5981j8637J4057O639q813M7596K9033l4568J646L9987j6770L2412j6685
14946I916k0231m5795J2091L0588L2741j1174K7745K7302j1717n6354l8391J2964
14934c0315J9553J4037P39n0387k9302J3275k185K5983K6272J9515m5274j3122
14922e1211Q922j1203J7281j4658n617O223M6515J567j0390m3769k0659M2321
14910c4678M0082q611l3653K523M4077J0448P96j5064J808J6296m93j7421r552
14897c442l8325k3808j4646M8750P22J0211k9691l1582J9656L9093J0083J8205
14885E226m5443j1538P1066L4284o317q673q820k8850K364J5976N22l5843k4616
$$ plain form
14872 -40662 -47511 -50769 -55523 -52540 -73236 -27753 -15777 -37284 -35945 -7957 33548 35952 41891
14859 41891 14326 -12580 35532 55674 62792 32804 -32677 -9772 8047 22765 41208 18333
14847 18333 2917 -2287 -24128 -12392 15688 379 -12136 11121 8324 15516 8924 -17090
14835 -17090 -9944 -43741 -50380 -12487 9766 31490 9537 -17547 -22527 -22847 -39800 -27845 -40985
14822 -40985 -99772 -89117 -33123 17668 6575 -30190 -60951 -40040 16764 22746 -10730 -28951
14810 -28951 -1173 1244 -30272 -39236 -58495 -85574 -36204 -4874 -21679 -43439 -58607 -44330
14798 -44330 -36162 -67630 -56999 -76942 -88901 -52117 -48224 -30816 -37769 -52999 -53149 -47466 -2853
14785 -2853 50789 15871 23622 26153 45633 58819 73023 28382 -15025 -24614 -426 44393
$$ packed form
14872d0662o849l258m754K983k0696M5483J1976k1507J339K7988M1505K404N939
14859D1891k7565k6906M8112K0142P118k9988o5481K2905J7819J4718J8443k2875
14847A8333j5416n204k1841J1736K8080j5309j2515K3257k797P192o592k6014
14835a7090P146l3797o639L7893K2253K1724k1953k7084m980l20j6953J1955j3140
14822d0985n8787J0655N5994N0791j1093l6765l0761K0911N6804N982l3476j8221
14810b8951K7778K417l1516q964j9259k7079M9370L1330j6805k1760j5168J4277
14798d4330Q168l1468J0631j9943j1959L6784L893J7408o953j5230j50N683M4613
14785b853N3642l4918P751K531J9480J3186J4204m4641m3407r589K4188M4819
$$ plain form
14773 44393 11589 -10887 -17960 -22900 9802 10601 -35154 -25402 -36524 -56290 -52514 -42552 -36032
14760 -36032 -49912 -5748 49226 2715 -37831 -61832 -62483 -57933 -56697 -41671 -15262 15581
14748 15581 -2801 -3941 -14450 -32584 -39710 -7538 -7548 4558 37506 64866 74798 79713 80413
14735 80413 60528 41100 7096 -12502 -33112 -47217 -6236 19464 -16686 -1559 -7011 4774
14723 4774 15214 19775 56897 62159 25270 3011 30180 31880 45342 22599 -1102 -2946 -3968
14710 -3968 12522 51868 61228 39938 10989 -8594 -46823 -61920 -58321 -25381 -39935 -52856
14698 -52856 -33239 -16822 5176 11043 11052 44926 81558 57412 49595 99611 76983 -11365 -87741
14685 -87741 -109005 -62820 -30462 -62047 -65125 -49550 -34504 -29375 -28223 -33923 -31719 -29353 -10112
$$ packed form
14773D4393l2804k2476p073m940L2702P99m5755R752j1122j9766L776R962O520
14760c6032j3880M4164N4974m6511m0546k4001o51M550J236J5026K6409L0843
14748A5581j8382j140j0509j8134p126L2172j0J2106L2948K7360R932M915P00
14735H0413j9885j9428l4004j9598k0610j4105M0981K5700l6150J5127n452J1785
14723D774J0440M561L7122N262l6889k2259K7169J700J3462k2743k3701j844j022
14710c968J6490L9346R360k1290k8949j9583l8229j5097L599L2940j4554j2921
14698e2856J9617J6417K1998N867RL3874L6632k4146p817N0016k2628q8348p6376
14685h7741k1264M6185L2358l1585l078J5575J5046N129J152n700K204K366J9241
$$ plain form
14672 -10112 -6514 13530 15204 2812 35807 43560 -2527 -7567 -8638 -19942 -34223 -46307 -29341
14659 -29341 -23432 -55453 -38192 -32455 -31144 -29360 -332 -12316 -38910 -41748 -48271 -45359 -27125
14646 -27125 -7689 14530 15318 -1392 831 -5389 18650 1002 -37481 -63069 -47458 -18966
14634 -18966 762 11906 2330 7287 16387 19337 18765 31404 36174 -8673 -13772 3869 40820
14621 40820 38973 29936 21589 -12383 -27759 -1255 5481 11940 28902 41308 25038 19353 26353
14608 26353 6995 14758 16008 13582 45294 46080 48744 63433 51247 40996 65917 51312 -5868
14595 -5868 -41822 -36464 -26371 4811 42420 23195 -210 9635 -18232 -26039 -12108 -39829
14583 -39829 -58129 -53359 -25316 4892 4305 25607 65157 47790 47715 35660 4841 34387 62516
$$ packed form
14672a0112L598K0044J674j2392L2995P753m6087n040j071j1304j4281j2084J6966
14659b9341N909l2021J7261N737J311J784K9028j1984k6594k838o523K912J8234
14646b7125J9436K2219P88j6710K223o220K4039j7648l8483k5588J5611K8492
14634a8966J9728J1144r576M957R100K950n72J2639M770m4847n099J7641L6951
14621D0820j847r037q347l3972j5376K6504O736O459J6962J2406j6270n685P000
14608B6353j9358P763J250k426L1712P86K664J4689j2186j0251K4921j4605n7180
14595e868l5954N358J0093L1182L7609j9225k3405R845k7867p807J3931k7721
14583c9829j8300M770K8043L0208n87K1302L9550j7367p5j2055l0819K9546K8129
$$ plain form
14570 62516 44393 15279 24906 49441 28907 28325 23503 -9204 -32235 -49452 -50007 -71539 -70046
14557 -70046 -33325 -35709 -39027 -14820 -3558 -5744 -14990 -20720 -12296 34188 25217 55042 16699
14544 16699 1439 3785 2299 -15651 -23555 15556 21406 -16660 -37099 -48661 -72581 -85006
14532 -85006 -50126 -53301 -49571 -74588 -125535 -98910 -77111 -47766 -32865 -30599 5497 12104
14520 12104 15876 11258 -14698 -2872 14706 -18272 -22340 -5050 13062 13001 -9509 -34961 -79818
14507 -79818 -32544 -17894 -23610 -20749 -41794 -23469 24468 25583 -9325 -9305 -24635 -31146 -49081
14494 -49081 -23915 21292 77430 89279 64455 75226 74704 66003 31571 4062 -16756 22586
14482 22586 40664 16952 3475 -11031 -11651 -18864 -22042 1033 -2066 -14761 -28229 8459 26583
$$ packed form
14570F2516j8123k9114R627K4535k0534n82m822l2707k3031j7217n55k1532J493
14557g0046L6721k384l318K4207J1262k186r246n730Q424M6484q971K9825l8343
14544A6699j5260K346j486j7950p904L9111N850l8066k0439j1562k3920j2425
14532h5006L4880l175L730k5017n0947K6625K1799K9345J4901K266L6096O607
14520A2104L772m618k5956J1826J7578l2978m068J7290J8112o1k2510k5452m4857
14507g9818M7274J4650n716K861k1045J8325M7937J115l4908K0j5330o511j7935
14494d9081K5166M5207N6138J1849k4824J0771n22q701l4432k7509k0818L9342
14482B2586J8078k3712j3477j4506o20p213l178K3075l099j2695j3468L6688J8124
$$ plain form
14469 26583 46420 40668 7219 5677 27380 36531 24566 34092 6223 -9522 7775 18198
14457 18198 -38646 -74161 -69295 -44653 -38239 -58573 -47113 -2502 23048 -17587 -15875 12967
14445 12967 -6999 -16198 -6744 13403 -852 3331 -9569 -47 -19295 -41881 -45846 -20841 -9281
14432 -9281 -18739 -29315 -4032 7405 15008 17927 -3480 5424 -12877 -71497 -113436 -138347 -117556
14419 -117556 -86649 -78032 -32939 -14554 18070 1328 14855 66933 84930 46807 20642 13254
14407 13254 -5687 2056 33958 54583 53950 46111 34352 -6683 -25788 -25284 -14127 -27839 -8295
14394 -8295 -5741 -27382 -18822 37766 53862 59280 41417 23862 -5880 3770 20408 77822 68160
14381 68160 20466 27480 48213 16685 11047 33862 36221 5656 -19794 6633 20569 -29950
$$ packed form
14469B6583J9837n752l3449j542K1703R151j1965R526k7869j5745J7297J0423
14457A8198n6844l5515M866K4642O414k0334J1460M4611K5550m0635J712K8842
14445A2967j9966r199R454K0147j4255M183j2900R522j9248k2586l965K5005J1560
14432i281r458j0576K5283J1437P603K919k1407Q904j8301n8620m1939k4911K0791
14419a17556L0907Q617M5093J8385L2624j6742J3527N2078J7997l8123k6165p388
14407A3254j8941P743L1902K0625o33p839j1759m1035j9105N04J1157j3712J9544
14394h295K554k1641Q560N6588J6096N418j7863j7555k9742R650J6638N7414r662
14381F8160m7694P014K0733l1528n638K2815K359l0565k5450K6427J3936n0519
$$ plain form
14369 -29950 -31278 -1955 -102 14800 64147 66380 12869 -36318 -65219 -45020 -7676 -6592
14357 -6592 20127 83499 75033 31433 21179 14695 12775 35076 55774 17212 -24934 -47002
14345 -47002 -42647 -29344 609 28147 60159 64147 38383 5633 -16591 -13664 -41092 -44521
14333 -44521 -4287 -7114 176 3702 46305 59017 79770 61910 -23739 -69338 -57044 -16480
14321 -16480 1218 -55848 -38411 19953 17490 5882 -11822 -40553 -84038 -93717 -47784 -21823
14309 -21823 -9764 14142 46385 56457 66165 48059 45519 95410 66760 24141 40719 46353
14297 46353 71907 101731 127165 111292 94702 66979 50288 39941 31790 45665 66587 53931
14285 53931 28597 4291 10859 24865 32961 29443 37947 40445 6394 7575 7198 -4142 -38882
$$ packed form
14369b9950j328K9323J853J4902M9347K233n3511m9187k8901K0199L7344J084
14357f592K6719O3372q466m3600j0254o484j920K2301K0698l8562m2146k2068
14345d7002M355J3303K9953K7538L2012L988k5764l2750k2224K927k7428l429
14333d4521M0234k827P290L526M2603J2712K0753j7860q5649m5599J2294M0564
14321a6480J7698n7066J7437N8364k463j1608j7704k8731m3485r679M5933K5961
14309b1823J2059K3906L2243J0072R708j8106k540M9891k8650m2619J6578N634
14297D6353K5554K9824K5434j5873j6590k7723j6691j0347q151J3875K0922j2656
14285E3931k5334k4306O568J4006Q096l518Q504K498l4051J181l77j1340l4740
$$ plain form
14272 -38882 -72437 -89543 -78935 -64088 -36553 -30932 -8171 -13954 -21804 -24395 -5527 -14105 9946
14259 9946 35604 15255 -10008 -36945 -40071 -21889 -13815 -2470 -7930 -7550 38286 51482 17669
14246 17669 26519 38692 45485 52350 84660 81588 65927 59064 21654 -36487 -36704 -16379 27108
14233 27108 25938 17989 550 -3870 -22469 18653 77658 57958 19122 -7013 -11436 -17448 -33587
14220 -33587 -46683 -34413 -3368 3686 -30428 -24491 -24958 -17646 -9306 -26503 -54763 -34402 -12692
14207 -12692 4826 12684 43186 57609 52523 32098 -9695 5239 33142 62297 47945 21679
14195 21679 7032 34027 52016 53123 34496 40217 11965 20780 21041 -10126 14664 50331 14741
14182 14741 -65540 -39345 19603 42684 40714 -1911 -19835 -27535 -15883 -28786 -49000 -27403
$$ packed form
14272c8882l3555j7106J0608J4847K7535N621K2761n783p850k591J8868q578K4051
14259I946K5658k0349k5263k6937l126J8182Q074J1345n460L80M5836J3196l3813
14246A7669Q850J2173O793O865L2310l072j5661o863l7410n8141k17K0325M3487
14233B7108j170p949j7439m420j8599M1122N9005j9700l8836k6135m423o012j6139
14220c3587j3096J2270L1045P054l4114N937m67P312Q340j7197k8260K0361K1710
14207a2692J7518P858L0502J4423n086k0425m1793J4934K7903K9155j4352k6266
14195B1679j4647K6995J7989J107j8627N721k8252Q815K61l1167K4790L5667l5590
14182A4741q0281K6195N8948K3081j970m2625j7924p700J1652j2903k0214K1597
$$ plain form
14170 -27403 23477 52759 61398 48570 54081 17951 -6438 -1489 -15185 -6334 46113 46602 8845
14157 8845 -32395 -39559 -39456 -32631 -37084 -37080 -10817 -3764 9725 29304 49151 36909 9242 -26259
14143 -26259 -30325 -38533 -16421 -11361 -5680 2696 27094 22614 22974 23207 9532 -28218 -41235 -25181
14129 -25181 -28171 -17001 -11965 11843 18509 -25452 -26975 1456 -11929 -13538 -18444 -34458 -24879
14116 -24879 -10391 25552 10130 -12152 -21226 -11302 14485 38871 54604 54979 77969 54322
14104 54322 39994 -26420 -41338 -20094 -7640 17133 9057 36152 20014 659 19638 19690
14092 19690 23017 42071 33324 3701 -27607 -29831 -18883 -3753 33774 31965 21633 62897
14080 62897 69589 65590 32161 16147 20226 6658 58909 39709 32190 54344 62337 38810 19602
$$ packed form
14170b7403N0880K9282Q639j2828N511l6130k4389M949j3696Q851N2447M89l7757
14157H845m1240p164J03O825m453MK6263P053J3489J9579J9847j2242k7667l5501
14143b6259m066q208K2112N060N681Q376K4398m480L60K33j3675l7750j3017J6054
14129b5181k990J1170N036K3808O666m3961j523K8431j3385j609m906j6014R579
14116b4879J4488L5943j5422k2282r074R924K5787K4386J5733L75K2990k3647
14104E4322j4328o6414j4918K1244J2454K4773q076K7095j6138j9355J8979N2
14092A9690L327J9054q747k9623l1308k224J0948J5130L7527j809j0332M1264
14080F2897O692l999l3429j6014M079j3568N2251j9200p519K2154P993k3527j9208
$$ plain form
14067 19602 34271 34255 33651 49120 44908 8999 -17602 -21489 -25573 -7797 -10299 -3857 30560 32980
14053 32980 57165 44815 21899 4993 14237 27318 14452 -3452 -36994 -41756 -30956 -19093
14041 -19093 -1241 -5206 -49885 -74519 -50670 -1848 35796 73830 59450 16788 -17886 11790
14029 11790 40912 45234 28517 18507 22043 10194 -17087 -18755 -8959 5008 -16539 -69817
14017 -69817 -62449 -51107 -21509 -26755 -23847 -34031 -39874 -37000 -33030 -52766 -37309 6907 13542
14004 13542 -9096 -41945 -90602 -97549 -65703 -38004 -26055 1420 13559 39056 53673 51525
13992 51525 -7738 -23406 16303 22497 33961 5802 -25757 -13092 666 -4705 -13091 -22881
13980 -22881 -15778 -54902 -7777 -11084 9547 14439 -8143 36982 30237 24196 8694 -11296 -36125
$$ packed form
14067A9602J4669j6o04J5469m212l5909k6601l887m084J7776k502O442L4417K420
14053C2980K4185j2350k2916j6906R244J3081j2866j7904l3542m762J0800J1863
14041a9093J7852l965m4679k4634K3849M8822L7644L8034j4380m2662l4674K9676
14029A1790K9122M322j6717j0010L536j1849k7281j668R796J3967k1547n3278
14017f9817P368J1342K9598n246K908j0184n843K874L970j9736J5457M4216O635
14004A3542k2638l2849m8657o947L1846K7699J1949K7475J2139K5497J4617k148
13992E1525n9263j5668L9709O194J1464k8159l1559J2665J3758n371q386r790
13980b2881P103l9124M7125l307K0631M892k2582M5125o745o041j5502j9990k4829
$$ plain form
13967 -36125 -33305 -44929 -33054 -17205 -48374 -60890 -20686 6243 -2851 11189 2706 5654
13955 5654 11628 29491 3388 -31098 -78900 -107774 -56318 -10367 8936 -4087 -5450 1854
13943 1854 10524 -11314 -30863 -18706 10882 13866 9772 22428 63984 49696 -9380 -29229
13931 -29229 -38777 -36266 -89091 -48138 -13430 -30738 -12228 -11957 15603 36392 22789 5873
13919 5873 -23662 -24090 -11273 -16307 -9413 28368 28799 54215 117463 119962 95033 57166 11064
13906 11064 -22936 -41310 -18435 -5846 -1168 23370 -23319 -26358 -38497 -24046 -63687 -60161
13894 -60161 -61950 -604 25301 6316 -17316 -31935 -43407 -8450 20719 20666 30767 4528
13882 4528 -5561 22773 -1694 -16255 -65595 -61129 -17937 11499 -7173 -17380 -20229 -30367
$$ packed form
13967c6125K820j1624J1875J5849l1169j2516M0204K6929r094J4040q483K948
13955E654N974J7863k6103l4486m7802k8874N1456M5951J9303j3023j363P304
13943A854Q670k1838j9549J2157K9588K984m094J2656M1556j4288n9076j9849
13931b9229r548K511n2825M0953L4708j7308J8510K71K7560K0789j3603j6916
13919E873k9535m28J2817n034O894L7781M31K5416O3248K499k4929l7867m6102
13906A1064l4000j8374K2875J2589M678K4538m6689l039j2139J4451l9641L526
13894f0161j789O1346K5905j8985k3632j4619j1472L4957K9169n3J0101k6239
13882D528j0089K8334k4467j4561m9340M466M3192K9436j8672j0207k849j0138
$$ plain form
13870 -30367 -32782 -16925 10944 -11584 8315 -5459 4323 -4704 -23832 -37311 -33644 -937
13858 -937 -2784 -29016 -44364 -50046 -62260 -71674 -60635 -43948 -5803 10576 8449 28704 14221
13845 14221 5014 14044 13368 -28391 -27607 8097 -3668 -11207 596 23608 12798 -254 -9920
13832 -9920 34473 22093 -19076 -28907 -56376 -76718 -79793 -56974 -27859 -14539 14617 -11496
13820 -11496 -5356 -12159 -41365 -20875 4109 50428 92763 97845 67074 30367 41989 18057
13808 18057 42294 28033 -1618 -10318 -5915 -35889 -67104 -32827 -15391 -15298 -18875 -22259 -30551
13795 -30551 -40426 -59536 -35159 19431 41989 35178 59355 26382 -16407 -22840 -19229 6769
13783 6769 48690 7974 -17778 -52549 -52108 -40882 -37813 -49682 -33276 -44543 -62144 -32802
$$ packed form
13870c0367k415J5857K7869k2528J9899j3774R782r027j9128j3479L667L2707
13858i37j847k6232j5348n682j2214r414J1039J6687L8145J6379k127K0255j4483
13845A4221r207R030o76m1759P84L5704j1765p539J1803K3012j0810j3052r666
13832i920M4393j2380m1169r831k7469k0342l075K2819K9115J3320K9156k6113
13820a1496O140o803k9206K0490K4984M6319M2335N082l0771l6707J1622k3932
13808A8057K4237j4261k9651q700M403k9974l1215L4277J7436R3l577l384q292
13795c0551r875j9110K4377N4590K2558o811K4177l2973m2789o433L611K5998
13783F769M1921m0716k5752l4771M41J1226L069j1869J6406j1267j7601K9342
$$ plain form
13771 -32802 7766 -10732 -7934 22487 15025 15180 -6554 -25101 -37995 -4483 15201 -5352
13759 -5352 -31835 -24505 -3971 -59420 -73028 -62622 -81293 -43157 -27312 -36780 -29084 -30295 -15885
13746 -15885 -2035 -27711 -26260 -8862 -21289 -43707 -63231 -50655 -22449 -5354 -19553 -17037
13734 -17037 8565 -25191 -53220 -59638 -30683 -2326 12325 42216 35901 16164 -36622 -48959
13722 -48959 -84963 -91447 -59814 -36798 -14032 3782 39047 48492 17914 42042 61224 40240
13710 40240 13122 -28365 -50706 -79948 -69652 -20427 41096 10820 2 15918 7968 -13298
13698 -13298 -15962 3258 -5387 -34991 -58189 -33092 -20663 18475 43691 42521 6122 -12740
13686 -12740 -4332 -3374 -7143 -32862 -1625 4712 -17165 18197 18194 4959 32965 49492 59126 -626
$$ packed form
13771c2802M0568j8498K798L0421p462J55k1734j8547j2894L3512J9684k0553
13759e352k6483P330K0534n5449j3608J0406j8671L8136J5845r468P696j211J4410
13746a5885J3850k5676J451J7398j2427k2418j9524J2576K8206J7095j4199K516
13734a7037K5602l3756k8029o418K8955K8357J4651K9891o315j9737n2786j2337
13722d8959l6004o484L1633K3016K2766J7814L5265R445l0578K4128J9182k0984
13710D0240k7118m1487k2341k9242J0296M9225O1523l0276j0818J5916p950k1266
13698a3298k664J9220q645k9604k3198K5097J2429L9138K5216j170l6399j8862
13686a2740Q408R58l769k5719L1237O337k1877L5362lj3235K8006J6527R634n9752
$$ plain form
13672 -626 -38200 -30213 9688 -5411 -3346 -35627 -42177 -40952 -37920 -56419 -43801 -43210 -30605
13659 -30605 -5355 -24135 -32092 -23694 -33706 -70533 -91823 -82184 -97718 -64946 14049 58061
13647 58061 6659 7639 -3211 -31144 -630 2013 1740 11628 29267 59419 28652 19251 41673
13634 41673 43368 27635 59150 95709 95326 106231 132862 70579 -3638 -10114 -23859 -24350 -10140
13621 -10140 -26154 -31378 17688 9595 18400 -69 -11938 -21157 -36034 -68548 -47618 10989
13609 10989 -15401 -25526 -6672 37381 28179 39631 58348 50478 25510 16774 49110 58102
13597 58102 -13811 -50339 -65452 -58400 -15703 34403 17501 10176 66342 151515 195567 263522
13585 263522 295500 306448 275419 203160 166556 123073 94168 74912 30232 5441 15641
$$ packed form
13672f26l7574P987L9901j5099K065l2281o550J225L032j8499J2618N91J2605
13659c0605K5250j8780p957Q398j0012l6827k1290R639j5534L2772P8995M4012
13647E8061n1402R80j0850k7933L0514K643k73R888J7639L0152l0767r401K2422
13634D1673J695j5733L1515L6559l83J0905K6631o2283p4217o476j3745m91J4210
13621a0140j6014n224M9066q093Q805j8469j1869r219j4877l2514K0930N8607
13609A0989k6390j0125J8854M4053r202J1452J8717p870k4968q736L2336Q992
13597E8102p1913l6528j5113P052M2697N0106j6902p325N6166Q5173M4052O7955
13585B63522L1978J0948l1029p2259l6604m3483k8905j9256m4680k4791J0200
$$ plain form
13574 15641 -10204 -24268 -1784 1649 3098 5927 18444 19473 11314 3894 23015 68628 39117
13561 39117 46874 55328 35752 45162 33817 47151 35371 32959 37448 52847 24019 -1203 16162
13548 16162 42360 63059 115080 127370 118232 137580 203063 275177 313475 288601 219023 130878
13536 130878 77562 92810 76592 44582 35558 28097 68158 73045 53677 57163 35438 20108
13524 20108 -2067 4870 47495 56449 61388 72521 70786 15070 740 10636 32984 74566 82897
13511 82897 76619 85579 54351 44473 51512 53613 10662 -6021 -28916 -59997 -42684 5813 -12531
13498 -12531 -19407 27543 74202 88002 97723 97040 107421 52231 54756 14368 -24623 -12777 -3304
13485 -3304 -30741 -38565 -20727 -4475 -13666 -20653 -26476 3756 9072 12497 22717 60065 47208
$$ packed form
13574A5641k5845j4064K2484L433J449K829J2517J029q159p420J9121M5613k9511
13561C9117P757Q454j9576R410j1345J3334j1780k412M489J5399k8828k5222J7365
13548A6162K6198K0699N2021J2290r138J9348O5483P2114L8298k4874o9578q8145
13536A30878n3316J5248j6218l2010r024p461M0061M887j9368L486k1725j5330
13524B0108k2175O937M2625Q954M939J1133j735n5716j4330R896K2348M1582Q331
13511H2897o278Q960l1228r878P039K101m2951j6683k2895l1081J7313M8497j8344
13498a2531o876M6950M6659J3800R721o83J0381n5190K525m0388l8991J1846R473
13485c304k7437p824J7838J6252r191o987n823L0232N316L425J0220L7348j2857
$$ plain form
13472 47208 -6165 -44471 -66170 -84946 -64831 -46382 -21181 5644 40469 30865 9767 21665
13460 21665 -15092 -1520 21110 28587 34143 6 -37207 -14622 12480 21693 4414 -4711
13448 -4711 -15898 -53054 -61063 -22553 16074 -19575 -22114 -1588 -15990 -34313 -49096 -9923
13436 -9923 18919 7079 15195 24707 27927 -12181 -18877 -20164 -15608 13102 35539 49371 48437
13423 48437 34064 2047 1097 -5096 2964 35780 9748 4940 7793 47087 33612 31959 23469
13410 23469 -6621 -9839 -9522 -20046 -21634 -15775 7180 -10163 -20372 238 2370 44889 36092
13397 36092 37343 13092 -7992 -7426 -36949 -22822 17710 68658 58231 16346 19228 18090 -32404
13384 -32404 -34023 715 -11109 -1161 -9500 6135 51788 45203 40138 75016 92292 91923 76078
$$ packed form
13472D7208n3373l8306k1699j8776K0115J8449K5201K6825L4825r604k1098J1898
13460B1665l6757J3572K2630P477N556l4137l7213K2585K7102R213j7279r125
13448d711j1187l7156q009L8510L8627l5649k539K0526j4402j8323j4783L9173
13436i923K8842j1840Q116R512L220m0108o696j287M556K8710K2437J3832r34
13423D8437j4373l2017r50o193Q060L2816k6032m808K853L9294j3475j653q490
13410B3469l0090l218L17j0524j588N859K2955j7343j0209K0610K132M2519q797
13397C6092J251k4251k1084N66k9523J4127M0532N0948j0427m1885K882j138n0494
13384c2404j619L4738j1824R948q339J5635M5653o585n065L4878J7276l69j5845
$$ plain form
13371 76078 68310 45338 47494 48273 7680 -2457 25423 37752 22989 -19820 -51285 -28683
13359 -28683 -7609 24172 61107 38795 8305 17686 25749 40597 55845 46895 18426 -38042
13347 -38042 -80379 -19828 -26330 -23398 -17606 -30407 721 -8012 -24654 2950 4094 8172 -35572
13334 -35572 -25181 -14947 -25444 18132 42382 72739 23884 3854 24178 38132 7600 -3744
13322 -3744 13096 22212 9222 -36211 -56269 -68818 -76224 -68275 -41733 -13097 22215 39347
13310 39347 22928 29550 64249 20936 3099 11417 58421 81248 57500 64211 63407 27092 -795
13297 -795 15905 56730 41503 23580 7381 5508 50712 29561 1789 18475 48525 51099
13285 51099 27550 8539 13277 24584 -3981 -28347 -16706 -39167 6367 13755 37138 38143
$$ packed form
13371G6078p768k2972K156P79m0593j0137K7880J2329j4763m2809l1465K2602
13359b8683K1074L1781L6935k2312l0490R381Q063J4848J5248q950k8469n6468
13347c8042m2337O0551o502K932N792j2801L1128q733j6642K7604J144M078m3744
13334c5572J0391J0234j0497M3576K4250L0357m8855k0030K0324J3954l0532j1344
13322c744J6840R116j2990m5433k0058j2549p406P949K6542K8636L5312J7132
13310C9347j6419O622L4699m3313j7837Q318M7004K2827k3748O711q04l6315k7887
13297g95J6700M0825j5227j7923j6199j873M5204k1151k7772J6686L0050K574
13285E1099k3549j9011M738J1307k8565k4366J1641k2461M5534P388K3383J005
$$ plain form
13273 38143 17499 9874 3271 -40553 -75298 -20594 11197 2251 13558 34501 -22077 -47628
13261 -47628 -84324 -73627 -32451 -13684 -35631 -25593 6814 23736 4875 -22366 -36121 -2957
13249 -2957 23121 15983 -13364 -33817 -49220 -41209 -46750 -73127 -70782 -33615 -42717 -31485 -4076
13236 -4076 -17327 -31213 -55605 -58208 -18092 27748 6734 -18482 -7996 -14722 -9234 -1446 -21556
13223 -21556 -24483 -14139 21343 72802 87943 86612 32206 -25126 -34733 -43790 -56600 -37361
13211 -37361 -127 8764 -11548 -46878 -36277 -14356 -17284 -25485 -46889 -67201 -63248 -48762
13199 -48762 -36966 -49571 -55077 -53144 -102958 -85771 -42974 -27634 -17204 -21320 13541 41090
13187 41090 39198 3378 11187 22716 49316 50840 85549 107774 81881 15557 -4825 38908
$$ packed form
13273C8143k0644p625o603m3824l4745N4704L1791q946J1307K0943n6578k5551
13261d7628l6696J0697M1176J8767k1947J0038L2407J6922j8861k7241j3755L3164
13249b957K6078p138k9347k0453j5403Q011n541k6377K345L7167r102J1232K7409
13236d076j3251j3886k4392k603M0116M5840k1014k5216J0486o726N488P788k0110
13223b1556k927J0344L5482N1459J5141j331n4406n7332r607r057j2810J9239
13211c7361L7234Q891k0312l5330J0601K1921k928q201k1404k0312L953J4486
13199d8762J1796j2605n506J933m9814J7187M2797J5340J0430m116L4861K7549
13187D1090j892l5820P809J1529K6600J524L4709K2225k5893o6324k0382M3733
$$ plain form
13175 38908 43804 -2427 -3521 2325 51134 30986 -20891 -36788 -9528 -698 18469 33053
13163 33053 31922 29230 40774 26802 10872 -25276 -40296 -8651 -8980 -14962 7136 35328 9192
13150 9192 -9670 -32338 -17599 -12622 7136 18730 43819 58291 74541 82688 68342 56657
13138 56657 37736 1415 18262 46345 33678 7989 12392 5286 -1515 22330 21434 19815 25967
13125 25967 -3633 -25477 -15136 30824 58817 53535 27092 64432 51481 33401 49392 58361
13113 58361 54459 13885 11334 38274 82099 78399 42417 22980 18725 2383 -29242 -19927 -6384
13100 -6384 -8941 32140 58469 14294 -39657 -91421 -38072 17845 40230 28060 15860 -33335
13088 -33335 -38838 -31692 -7760 -13583 -33196 -40147 -35226 -3167 8354 -6387 -27606 -33357 -3898
$$ packed form
13175C8908M896m6231j094N846M8809k0148n1877j5897K7260Q830J9167J4584
13163C3053j131k692J1544j3972j5930l6148j5020L1645l29n982K2098K8192k6136
13150I192j8862k2668J4739M977J9758J1594K5089J4472J6250Q147j4346j1685
13138E6657j8921l6321J6847K8083j2667k5689M403p106o801K3845q96j619O152
13125B5967k9600k1844J0341M5960K7993n282k6443L7340j2951j8080J5991Q969
13113E8361l902m0574k551K6940M3825l700l5982j9437m255j6342l1625R315J3543
13100f384k557M1081K6329m4175n3951n1764N3349N5917K2385j2170j2200m9195
13088c3335n503P146K3932n823j9613o951M921L2059J1521j4741k1219n751K9459
$$ plain form
13075 -3898 18188 21409 12389 36997 10542 -11325 -34598 -73130 -39775 -43250 -49638 -10295 35662
13062 35662 50794 60168 61590 59823 23517 6893 -19181 -15254 -19316 -53294 -34780 -42390 -20231
13049 -20231 11347 28227 2598 -25651 -59777 -90294 -97997 -69460 -3618 29644 1412 35471
13037 35471 51765 23204 -10810 -23973 -25128 4003 -20449 -34206 -22975 -16593 -29143 -69520
13025 -69520 -41138 -43305 2825 40802 14799 -38388 -17853 -4785 9023 -34886 -28325 5756
13013 5756 31 1830 -53413 -44960 30723 30437 27810 29173 -20880 -41442 -19663 -22575 -8854
13000 -8854 24456 40236 32920 25730 3206 -4253 41555 67688 18539 5680 2350 -269 32059
12987 32059 25445 13182 -20592 -38300 -1198 35166 6850 -15967 -46809 -20498 17567 35379
$$ packed form
13075c898K2086L221r020K4608k6455k1867k3273l8532L3355l475o388L9343M5957
13062C5662J5132R374J422j767l6306j6624k6074L927m062l3978J8514p610K2159
13049b0231L1578J6880k5629k8249l4126l0517p703K8537O5842L3262k8232L4059
13037C5471J6294k8561l4014j3163j155K9131k4452j3757J1231O382j2550m0377
13025f9520K8382k167M6130L7977k6003n3187K0535J3068J3808m3909O561L4081
13013E756n725J799n5243Q453P5683k86k627J363n0053k0562K1779k912J3721
13000h854L3310J5780p316p190k2524p459M5808K6133m9149j2859l330k619L2328
12987C2059o614j2263l3774j7708L7102L6364k8316k2817l0842K6311L8065J7812
$$ plain form
12975 35379 48067 56146 37866 21578 -6822 29359 58500 50918 25733 -8784 -7703 23515
12963 23515 13631 4029 -27 -18826 -59363 -67120 2536 54218 16954 -18248 -17794 -9374 25426
12950 25426 33021 30326 58850 51305 47002 38717 -6561 16331 53475 34112 -25004 -14183 -5370
12937 -5370 -10753 -20066 -2626 -18665 -43056 -46751 -20456 -38529 -63547 -33191 14845 10762 -13113
12924 -13113 -13205 14311 7065 5154 1324 -9901 -7251 -6370 -30535 -45966 -34372 715 -16355
12911 -16355 1590 14176 20400 48475 37693 48078 49097 17891 12769 1581 -11020 5963
12899 5963 30058 57156 48360 5114 -9526 -2494 -33346 -67669 -56442 -19254 -29249 -16835
12887 -16835 6633 29893 16481 45508 36299 67994 40011 12205 -27408 -26668 23878 64638
$$ packed form
12975C5379J2688Q079j8280j6288k8400L6181K9141p582k5185l4517J081L1218
12963B3515r884r602m056j8799m0537p757O9656N1682l7264l5202M54Q420L4800
12950B5426P595k695K8524p545m303q285m5278K2892L7144j9363n9116J0821Q813
12937e370n383r313J7440j6039k4391l695K6295j8073k5018L0356M8036m083k3875
12924a3113r2K7516p246j911l830j1225K650Q81k4165j5431J1594L5087j7070
12911a6355J7945J2586O224K8075j0782J0385J019l1206n122j1188j2601J6983
12899E963K4095K7098q796m3246j4640P032l0852l4323J1227L7188r995J2414
12887a6835K3468K3260j3412K9027r209L1695k7983k7806l9613P40N0546M0760
$$ plain form
12875 64638 47377 16211 29707 40470 26548 -26093 -37515 -29447 36593 37027 16028 17247
12863 17247 -22714 -42229 -34270 -40034 -43204 -10638 7678 15731 -9626 -21523 -25424 -34701 -25897
12850 -25897 -6347 -22035 -4515 14715 23377 4404 -21923 -37579 -19602 -26161 16240 41440
12838 41440 27343 51474 56539 68304 101428 123344 109375 101476 56540 18862 23674 39673
12826 39673 1587 -23583 -45845 -20007 -17939 4814 36963 42263 51973 1458 -1902 22226
12814 22226 15263 -32391 -45693 -29383 5861 4773 56097 73835 35516 -13540 21708 38731
12802 38731 32967 -30550 -54176 -23692 -10381 32711 25076 27902 33140 -1348 -32063 -37093 -54662
12789 -54662 -60834 -40548 3120 26016 6060 -21698 -45182 -47829 -16935 25252 43676 39226
$$ packed form
12875F4638j7261l1166J3496J0763j3922n2641j1422Q068O6040M34k0999J219
12863A7247l9961j9515P959n764l170L2566J8316Q053k5357j1897l901r277Q804
12850b5897J9550j5688J7520J9230Q662j8973k6327j5656J7977o559M2401K5200
12838D1440j4097K4131N065J1765L3124K1916j3969p899m4936l7678M812J5999
12826C9673l8086k5170k2262K5838K068K2753L2149N300R710n0515l360K4128
12814B2226o963m7654j3302J6310L5244j088N1324J7738l8319m9056L5248J7023
12802C8731n764o3517k3626L0484J3311M3092p635K826N238l4488l0715n030j7569
12789e4662o172K0286M3668K2896j9956k7758k3484k647L0894M2187J8424m450
$$ plain form
12777 39226 14141 -19603 6706 12659 1075 -4716 -856 2200 18251 50618 77187 55048
12765 55048 27420 24173 -7703 -2550 -5500 -22877 -18182 -15730 -22333 8607 -7290 -12464 -7160
12752 -7160 -3537 -8829 12197 -30769 -84584 -86181 -32434 -38269 -22911 -24408 26482 62411 28281
12739 28281 -28850 -32940 -63778 -61099 -62039 -54547 -42885 -10580 -16035 -26676 -18602 -11027 -382
12726 -382 15220 28119 -11732 -19074 5886 6586 -20007 -36277 -24161 21453 46048 29337 7244
12713 7244 -17083 -30730 -9831 25704 20535 -13378 -43139 -73590 -57084 -48408 -4263 30579
12701 30579 -34684 -86494 -79153 -18789 4916 -3669 -13274 -5480 3530 -6524 -18594 -48751 -42436
12688 -42436 -54450 -47951 -28706 -50279 -37361 -12524 -15770 -2604 -9717 -22144 3346 34491
$$ packed form
12777C9226k5085l3744K6309N953j1584n791L860L056J6051L2367K6569k2139
12765E5048k7628l247l1876N153k950j7377M695K452o603L0940j5897n174N304
12752g160L623n292K1026m2966n3815j597N3747n835J5358j497N0890L5929l4130
12739B8281n7131m090l0838K679r40P492J1662L2305n455j0641Q074P575J0645
12726c82J5602J2899l9851p342K4960P00k6593j6270J2116M5614K4595j6711k2093
12713G244k4327j3647K0899L5535n169l3913k9761l0451J6506Q676M4145L4842
12701C0579o5263n1810P341O0364K3705q585r605P794R010j0054j2070l0157O315
12688d2436j2014O499J9245k1573J2918K4837l246J3166p113j2427K5490L1145
$$ plain form
12676 34491 82323 48152 23022 60954 80675 74162 51364 53684 36706 27801 63983 65235
12664 65235 64943 82513 97561 91459 96968 114669 39085 -27153 -10945 30785 -7661 -6187 27038
12651 27038 17812 -19097 -24687 -27455 1438 62193 110784 99882 58624 26553 49213 80496
12639 80496 64860 30877 42891 31647 5204 2162 16773 -8598 -26168 -331 28359 37307
12627 37307 12706 -11678 -12005 -25866 -29034 -9427 -11904 -27990 27712 45316 44018 73732 73218
12614 73218 31337 82143 61573 39428 48841 53241 43360 51250 46850 58993 58716 36227 -6691
12601 -6691 -17733 -3529 -18040 6903 45491 20261 32823 72853 50073 36048 28037 45356
12589 45356 45613 14269 93 -43214 -27407 -12990 -1286 8067 20107 2595 15296 -1887
$$ packed form
12676C4491M7832l4171k5130L7932J9721o513k2798K320j6978q905L6182J252
12664F5235k92J7570J5048o102N509J7701p5584o6238J6208M1730l8446J474L3225
12651B7038r226l6909n590k768K8893O0755M8591j0902m1258l2071K2660L1283
12639H0496j5636l3983J2014j1244k6443l042J4611k5371j7570K5837K8690Q948
12627C7307k4601k4384l27j3861l168J9607k477j6086N5702J7604j298K9714n14
12614G3218m1881N0806k0570k2145R413M400r881P890m400J2143k77k2489m2918
12601f691j1042J4204j4511K4943L8588k5230J2562M0030k2780j4025q011J7319
12589D5356K57l1344j4176m3307J5807J4417J1704R353J2040j7512J2701j7183
$$ plain form
12577 -1887 -24469 -11354 44461 77423 55429 40253 54670 68185 43326 47799 100961 118029
12565 118029 128652 153216 112873 127326 109756 55953 81692 87743 51257 44231 74501 99307
12553 99307 113149 64739 67776 47410 42218 35352 50791 72649 77472 77742 88044 80879 81169
12540 81169 101112 115215 170649 190050 175859 187379 187582 157457 167356 195622 197882 200042 237127
12527 237127 205317 201633 185028 156636 124953 151078 206321 205690 190833 194568 184421 161739
12515 161739 129892 137307 127595 124703 159614 149432 120750 137296 175984 183691 214482 209982
12503 209982 144360 147295 161984 171656 160780 140153 148921 215675 239220 212597 211926 232938
12491 232938 256907 258134 273410 275608 232534 181127 146748 184582 242044 234310 244106 230140
$$ packed form
12577a887k2582J3115N5815L2962k1994j5176J4417J3515k4859M473N3162J7068
12565A18029J0623K4564m0343J4453j7570n3803K5739O051l6486p026L0270K4806
12553I9307J3842m8410L037k0366n192o866J5439K1858M823K70J0302p165K90
12540H1169J9943J4103N5434J9401j4191J1520K03l0125R899K8266K260K160L7085
12527B37127l1810l684j6605k8392l1683K6125N5243o31j4857L735j0147k2682
12515A61739l1847P415r712k892L4911j0182k8682J6546L8688P707L0791m500
12503B09982o5622K935J4689R672j0876k0627Q768O6754K3545k6623o71K1012
12491B32938K3969J227J5276K198m3074n1407l4379L7834N7462p734R796j3966
$$ plain form
12479 230140 211244 206005 180363 174338 202530 225591 243266 241088 195222 199328 186356 191467
12467 191467 171698 149002 180479 173268 128450 91936 81853 99812 73021 40306 30311 57787
12455 57787 70352 81543 65889 50311 45795 59815 39198 54505 55247 93926 142508 132120
12443 132120 86976 80455 105170 84247 102162 132185 122649 88158 49365 31601 24407 12533
12431 12533 1396 35245 93056 145056 130866 102607 102355 78023 76100 64339 54175 54730 76844
12418 76844 61311 26343 11446 -5465 -15228 -1889 -3404 36594 55285 38591 42389 30637
12406 30637 10539 41922 54107 17353 -8238 2148 -25871 -33078 -35082 -27918 5960 33301
12394 33301 81374 52976 35779 56940 65039 50757 63063 49677 26484 3762 -9919 -27447
$$ packed form
12479B30140j8896n239k5642o025K8192K3061J7675k178m5866M106j2972N111
12467A91467j9769k2696L1477p211m4818l6514j0083J7959k6791l2715r995K7476
12455E7787J2565J1191j5654j5578m516J4020k0617J5307P42L8679M8582j0388
12443A32120m5144o521K4715k0923J7915L0023r536l4491l8793j7764p194j1874
12431A2533j1137L3849N7811N2000j4190k8259k52k4332j923j1761j0164N55K2114
12418G6844j5533l4968j4897j6911r763J3339j515L9998J8691j6694L798j1752
12406C0637k0098L1383J2185l6754k5591J0386k8019p207k004P164L3878K7341
12394C3301M8073k8398j7197K1161Q099j4282J2306j3386k3193k2722j3681j7528
$$ plain form
12382 -27447 -39050 -1716 50520 68899 40903 -7681 38901 36099 6411 483 31395 28863
12370 28863 -768 -43967 -52443 -10985 35504 52541 46785 69826 77625 52411 31926 9066
12358 9066 10010 -14715 -62214 -23401 -20689 -16089 -28002 -22332 -11828 -13596 3257 27189 54265
12345 54265 68224 31080 44010 46955 37860 31235 25420 43296 30991 10799 22096 6129
12333 6129 27200 32630 21627 26517 -5347 -18887 -27103 -54103 -49326 -9138 -1865 -30099 -23045
12320 -23045 632 -1304 -9161 233 -27359 -7031 17674 26827 4063 -23339 -55605 -47817 8355
12307 8355 39887 24614 25997 47569 2417 7066 47955 43716 1337 -20305 -27066 -34391 -19962
12294 -19962 -14179 10428 6597 31660 55045 65535 67312 35393 28594 2316 -7547 -10271 -44933
$$ packed form
12382b7447j1603L7334N2236J8379k7996m8584M6582k802k9688n928L0912k532
12370B8863k9631m3199q476M1458M6489J7037n756K3041P799k5214k0485k2860
12358I066R44k4725m7499L8813K712M600j1913N670J0504j768J6853K3932K7076
12345E4265J3959l7144J2930K945r095o625n815J7876j2305k0192J1297j5967
12333F129K1071N430j1003M890l1864j3540q216k7000M777M0188P273k8234P054
12320b3045K3677j936p857R394k7592K0328K4705R153k2764k7402l2266P788N6172
12307H355L1532j5273J383K1572m5152M649M0889m239m2379k1642o761p325J4429
12294a9962N783K4607l831K5063K3385J0490J777l1919o799k6278r863k724l4662
$$ plain form
12281 -44933 -28286 -42825 -31365 -13282 7106 4563 33584 32184 28737 -39598 -87983 -80615
12269 -80615 -78732 -64256 -19721 -8576 -23159 9883 4511 -12755 -3448 -30675 -44038 18819
12257 18819 46468 30509 39741 33044 23744 45218 52728 36813 -4041 -40075 -80559 -47204
12245 -47204 7287 68049 133484 134113 112891 109707 120595 80566 78435 91791 44129 45154 36187
12232 36187 20822 45476 45305 27200 41401 67823 81134 53524 36901 8738 -34376 -53255
12220 -53255 -49314 -75022 -91311 -32226 1410 18508 33113 52502 44633 28441 34861 33162
12208 33162 11613 -22733 -19267 3433 -13872 -17733 16274 26979 6357 9622 40598 40968 9870
12195 9870 -21200 -29814 7593 26493 37499 27574 3048 -18864 -10163 35159 49842 27078
$$ packed form
12281d4933J6647j4539J1460J8083K0388k543K9021j400l447o8335m8385P368
12269h0615J883J4476M4535J1145j4583L3042n372j7266R307k7227j3363O2857
12257A8819K7649j5959R232o697r300K1474P510j5915m0854l6034m0484L3355
12245d7204N4491O0762O5435O29k1222l184J0888m0029k131J3356m7662J025q967
12232C6187j5365K4654j71j8105J4201K6422J3311k7610j6623k8163m3114j8879
12220e3255L941k5708j6289N9085L3636J7098J4605J9389p869j6192O420j699
12208C3162k1549l4346L466K2700j7305l861L4007J0705k0622L265L0976L70l1098
12195I870l1070q614L7407J8900J1006r925k4526k1912Q701M5322J4683k2764
$$ plain form
12183 27078 7344 8897 29528 -22125 -47900 -40180 -34794 33591 30394 -3719 5357 41332 31517
12170 31517 30725 33908 -10082 412 22212 46013 11448 -36310 -50963 -42715 -26766 -50767
12158 -50767 -24595 -12012 -2906 1220 3930 4919 -17349 -27150 -18833 -1537 32713 32935 52700
12145 52700 51232 59573 59081 79351 82902 36056 42932 87500 52455 46930 13242 17942 43906
12132 43906 62234 90092 123109 117734 65845 28630 21822 53725 56176 94432 87891 60792
12120 60792 98667 120433 97487 55221 20271 -6040 9275 30353 14518 -14917 -26240 -34898
12108 -34898 -24503 -4908 -3164 31253 46850 16326 -7131 -17810 -4022 -27133 -37664 -31266
12096 -31266 -956 -3742 6120 34766 14159 -29346 -36081 -32399 463 4307 14755 40004 17619
$$ packed form
12183B7078j9734J553K0631n1653k5775P720N386O8385l197l4113R076L5975r815
12170C1517p92L183m3990J0494K1800K3801l4565m7758j4653Q248J5949k4001
12158e0767K6172J2583R106M126K710R89k2268r801Q317J7296L4250K22J9765
12145E2700j468Q341m92K0270L551m6846O876M4568l5045n525l3688M700K5964
12132D3906J8328K7858L3017n375n1889l7215o808L1903K451L8256o541k7099
12120F0792L7875K1766k2946m2266l4950k6311J5315K1078j5835k9435j1323q658
12108c4898J0395J9595J744L4417J5597l0524k3457j0679J3788k3111j0531O398
12096c1266L0310k786R862K8646k0607m3505o735L682L2862L844J0448K5249k2385
$$ plain form
12083 17619 4183 -9632 -26998 -18065 18151 22311 32408 26001 18792 1719 -12375 -5208 -15247
12070 -15247 -22785 -24584 -44503 -24685 -12265 -2761 -7698 -16495 4361 40783 91235 84871 51584
12057 51584 22712 -2012 -21169 -5713 -15203 -36189 -52031 -54662 -44950 -76066 -62068 -15601
12045 -15601 -29579 -8808 -10311 -14257 -6700 -49421 -22792 -4676 -973 -11383 11321 25917
12033 25917 16612 -12796 -29066 -8526 -1511 -8529 -32923 -49770 -2721 46364 41636 4071
12021 4071 15883 16790 -4574 13739 58756 50870 45054 35208 46538 5361 -24859 7151 24166
12008 24166 15867 -35440 -61245 -42724 -22169 28104 48645 34931 11255 10515 -3348 60529
11996 60529 111474 63900 -266 -46644 -13252 6369 29244 43919 45298 20950 -52919 -76069
$$ packed form
12083A7619j3436j3815j7366Q933L6216M160J0097o407p209j7073j4094P167j0039
12070a5247p538j799j9919J9818J2420R504m937q797K0856L6422N0452o364l3287
12057E1584k8872k4724j9157J5456r490k0986j5842k631R712l1116J3998M6467
12045a5601j3978K0771j503l946P557m2721K6629J8116L703j0410K2704J4596
12033B5917r305k9408j6270K0540P015p018k4394j6847M7049M9085m728l7565
12021D071J1812R07k1364J8313M5017p886n816r846J1330m1177l0220L2010J7015
12008B4166q299n1307k5805J8521K0555N0273K0541j3714k3676p40j3863O3877
11996F0529N0945m7574o4166m6378L3392J9621K2875J4675J379k4348p3869k3150
$$ plain form
11984 -76069 -81289 -93891 -73269 -34472 -18983 -49556 -29698 11059 24059 6378 8604 10287
11972 10287 -1476 13542 20631 4006 -15513 -44236 -28584 -21824 33785 59564 12085 -7789
11960 -7789 44821 55678 11499 -38163 -60717 -70128 -70213 -40758 -82217 -79083 -49523 -79179 -63662
11947 -63662 -53345 -39737 -13771 53696 38008 5905 -5039 -8914 -12466 -29597 3878 34849
11935 34849 24136 3389 17518 4979 11524 26043 26431 36518 10830 13438 -45596 -70012
11923 -70012 -90458 -109670 -96282 -78400 -34490 -41145 -51239 -18192 -6944 -32625 -62087 -47720
11911 -47720 -17997 13715 24022 16706 22704 -14326 -59363 -59701 -34199 24492 6875 -17767
11899 -17767 -56631 -54863 -11011 46145 20563 -28829 -41506 -22512 -25750 -55302 -9127 24130
$$ packed form
11984g6069n220j2602K0622L8797J5489l0573J9858M0757J3000j7681K226J683
11972A0287j1763J5018P089j6625j9519k8723J5652O760N5609K5779m7479j9874
11960g789N2610J0857m4179m9662k2554r411q5K9455m1459L134K9560k9656J5517
11947f3662J0317J3608K5966O7467j5688l2103j0944l875l552j7131L3475L0971
11935C4849j0713k0747J4129j2539O545J4519L88J0087k5688K608n9034k4416
11923g0012k0446j9212J3388J7882M3910o655j0094L3047J1248k5681k9462J4367
11911d7720K9723L1712J0307p316N998l7030m5037l38K5502N8691j7617k4642
11899a7767l8864J768M3852N7156k5582m9392j2677J8994l238k9552M6175L3257
$$ plain form
11887 24130 -5584 -19331 -26026 -39715 -19000 25514 34499 54375 16834 -25022 -5298 7688
11875 7688 3141 4771 -30177 -26336 -9807 13730 42299 54463 62412 61492 -1083 -31315 4267
11862 4267 64012 69157 40435 5151 -29460 -20064 3302 7485 17527 4642 -8763 -27830
11850 -27830 -19108 -12814 -35455 -44659 -49794 -20735 -32679 -22513 -8621 -21421 -39596 -16290
11838 -16290 -5416 10997 8038 -21466 3581 28286 26454 19101 -26435 -80577 -76925 -39038
11826 -39038 -10915 -48779 -61941 -70921 -53953 -11178 14193 15357 2954 -37757 -24775 -31679
11814 -31679 -57225 -48103 -48835 -55850 -71160 -47163 -278 8080 6365 -31044 -29874 -33208 -72862
11801 -72862 -69853 -40992 -42252 -19470 14942 18222 -9822 -22021 -12748 -13619 -2537 8463 -18762
$$ packed form
11887B4130k9714j3747o695j3689K0715M4514Q985J9876l7541m1856J9724J2986
11875G688m547J630l4948L841J6529K3537K8569J2164P949r20o2575l0232L5582
11862D267N9745N145k8722l5284l4611R396K3366M183J0042j2885j3405j9067
11850b7830Q722O294k2641r204n135K9059j1944J0166J3892j2800j8175K3306
11838a6290J0874J6413k959k9504K5047K4705j832p353m5536n4142L652L7887
11826c9038K8123l7864j3162q980J6968M2775K5371J164j2403m0711J2982o904
11814c1679k5546R122p32p015j5310K3997M6885Q358j715l7409J170l334l9654
11801g2862L009K8861j260K2782L4412L280k8044j2199R273q71J1082J1000k7225
$$ plain form
11788 -18762 -35580 -40384 -55770 -63296 -41528 -17338 -30631 -37204 -12629 -30335 -67142 -53390
11776 -53390 -28223 9177 29178 -2932 1674 20376 -13105 -20048 1231 -420 -9349 -9780 11134
11763 11134 8281 -32846 -23233 596 26310 -6765 -44788 -25993 -38429 7189 -2937 -23328
11751 -23328 -14555 -8154 -3404 8817 42081 52307 42534 66123 36835 12341 -21099 -39120
11739 -39120 -41372 -42422 -40144 -27258 -28533 -36116 -5998 21260 -8133 -24247 -17969 16150 73811
11726 73811 63799 52124 43002 65179 30475 39250 22766 19661 -13153 -4024 4060 5264 -49677
11713 -49677 -75528 -63311 -45561 -21804 9587 -9922 -9977 -6358 -15076 -3507 -39055 -18242 30012
11700 30012 48452 55508 44103 14004 23353 49383 40566 7348 -3194 -38438 -24134 -15880
$$ packed form
11788a8762j6818m804j5386p526K1768K4190j3293o573K4575j7706l6807J3752
11776e3390K5167L7400K0001l2110M606J8702l3481o943K1279j651q929m31K0914
11763A1134k853m1127R613K3829K5714l3075l8023J8795j2436M5618j0126k0391
11751b3328Q773O401M750J2221L3264J0226r773K3589k9288k4494l3440j8021
11739c9120k252j050K278J2886j275p583L0118K7258k9393j6114O278L4119N7661
11726G3811j0012j1675r122K2177l4704Q775j6484l105l2814R129Q084J204n4941
11713d9677k5851J2217J7750K3757L1391j9509n5L619q718J1569l5548K0813M8254
11700C0012J8440P056j1405l0099R349K6030q817l3218j0542l5244J4304Q254
$$ plain form
11688 -15880 12304 24298 20855 40972 8436 -46958 -11238 15517 -20769 -15179 -19811 -20721 -14281
11675 -14281 18313 73926 69037 41914 52496 46238 36357 15491 24469 87803 70922 25362
11663 25362 60723 51182 57834 73381 51038 40513 38407 19542 1410 11393 29436 39105 -849
11650 -849 -23413 -13928 -25317 15177 63974 50565 31207 -2852 -22326 -53342 -64743 -50952
11638 -50952 -45764 -46351 -39298 -38112 -34528 1132 53995 66795 19538 -21560 -7379 -14632 -21012
11625 -21012 -10417 -23414 -59219 -74096 -33986 -6532 -30939 -25340 -34421 -49479 -36409 -50170
11613 -50170 -54686 -49016 -11474 -12758 -21376 -30858 -5436 -14322 -58479 -61302 -20631 -34085 -59673
11600 -59673 -76744 -60540 -20726 23580 28764 15104 -15423 -14390 3409 -878 -26889 -21847
$$ packed form
11688a5880K8184J1994l443K0117l2536n5394L5720K6755l6286N590m632r10O440
11675a4281L2594N5613m889k7123J0582o258r881k0866Q978O3334j6881m5560
11663B5362L5361r541O652J5547k2343j0525k106j8865j8132R983J8043R669l9954
11650h49k2564R485j1389M0494M8797j3409j9358l4059j9474l1016j1401J3791
11638e0952N188n87P053J186L584L5660N2863J2800m7257m1098J4181p253o380
11625b1012J0595j2997l5805j4877M0110K7454k4407N599r081j5058J3070j3761
11613e0170m516N670L7542j284q618r482K5422q886m4157k823M0671j3454k5588
11600e9673j7071J6204L9814M4306N184j3660l0527J033J7799m287k6011N042
$$ plain form
11588 -21847 -9415 20433 27600 14807 -33960 1062 48736 36619 8415 -24210 -47220 -71242
11576 -71242 -55012 -39764 4271 39128 48889 70328 47985 7469 -3113 33700 27729 12187
11564 12187 9958 -2290 -35296 -64579 -94290 -72353 -29794 -33610 -63577 -47929 -30391 -19112
11552 -19112 -304 -5467 -53 15716 32318 44530 63190 38403 9985 11273 -22943 -24914
11540 -24914 9536 29280 35809 4686 800 1787 -6319 6585 17119 -7370 1736 26020 64385
11527 64385 70524 43258 34022 22117 -1675 -12727 19403 11991 -6409 -2733 1431 21121 34814
11514 34814 -21550 -64052 -20371 17319 43631 94193 84042 41111 35174 40427 33542 4788
11502 4788 -5448 20056 -8999 30677 38396 16768 44955 42482 34310 18715 35657 26312 -19587
$$ packed form
11588b1847J2432K9848P167j2793m8767L5022M7674j2117k8204l2625k3010k4022
11576g1242J6230J5248M4035L4857R761K1439k2343m0516j0582L6813n971j5542
11564A2187k229j2248l3006k9283k9711K1937M2559l816k9967J5648J7538J1279
11552a9112J8808n163N414J5769J6602J2212J8660k4787k8418J288l4216j971
11540b4914L4450J9744O529l1123l886R87q106J2904J0534k4489R106K4284L8365
11527F4385O139k7266r236j1905k3792j1052L2130p412j8400L676M164J9690J3693
11514C4814n6364m2502M3681L7690K6312N0562j0151m2931n937N253o885k8754
11502D788j0236K5504k9055L9676P719k1628K8187k473q172j5595J6942r345m5899
$$ plain form
11489 -19587 -16747 -22586 -31627 -24544 -2670 15243 40028 18963 41582 94674 89626 22103 -15238
11476 -15238 -10287 11797 -11 8028 28445 50507 60202 72863 77125 55768 53945 53519 48409
11463 48409 61812 21348 6310 1951 2251 10235 -6402 -10462 -19152 -34399 -16353 48523 68572
11450 68572 75767 101556 108513 84683 95433 108251 90023 76902 77005 98653 110221 139745
11438 139745 152174 110471 55123 57428 69246 107831 174594 198595 283406 389548 547850
11427 547850 834708 1302796 2009756 2741256 2857898 2254971 1559343 1077222 762630 567198
11417 567198 401618 319171 245181 186548 187862 184830 161393 106767 73201 29612 -18604 -23532
11405 -23532 20407 33078 36265 24779 46712 74606 84251 59830 48410 54362 50645 26356
$$ packed form
11489a9587K840n839r041P083K1874J7913K4785k1065K2619N3092n048o7523l7341
11476a5238M951K2084j1808Q039K0417K2062R695J2661M262k1357j823m26n110
11463D8409J3403m0464j5038m359L00P984j6637m060q690j5247J8046O4876K0049
11450F8572P195K5789O957k3830J0750J2818j8228j3121J03K1648J1568K9524
11438A39745J2429m1703n5348K305J1818L8585O6763K4001Q4811J06142J58302
11427E47850K86858M68088P06960P31500J16642o02927o95628m82121l14592j95432
11417E67198j65580q2447p3990n8633J314l032k3437n4626l3566m3589m8216m928
11405b3532M3939J2671L187j1486K1933K7894R645k4421j1420N952l717k4289
$$ plain form
11393 26356 4265 34952 57765 75683 78824 70676 50081 -11056 -70414 -36645 24164 31664
11381 31664 35186 -330 -33837 9606 31438 8377 -38962 -21333 -5394 5025 42367 31141
11369 31141 21774 27897 48167 47660 50248 46186 28516 -8213 19106 44955 4290 -69805 -48689
11356 -48689 -37179 -20378 21816 50356 40610 17288 66730 73240 76483 59062 38459 48523
11344 48523 47941 25004 12533 1225 22304 2831 -10822 2807 -5054 -11447 -13481 -39449 -53261
11331 -53261 3814 -17341 -11271 -783 16630 6941 27150 27463 12508 -52928 -75524 -55496
11319 -55496 -15683 -24853 -23688 13085 50074 30391 1167 -1178 6203 36836 56207 45478
11307 45478 56216 72191 117546 119231 119931 106157 105348 94205 82572 70296 23764 -17958 -14530
$$ packed form
11393B6356k2091L0687K2813J7918L141q148k0595o1137n9358L3769O0809P500
11381C1664L522l5516l3507M3443K1832k3061m7339J7629J5939J0419L7342j1226
11369C1141r367O123K0270n07K588m062j7670l6729K7319K5849m0665p4095K1116
11356d8689J1510J6801M2194K8540r746k3322M9442O510L243j7421k0603J0064
11344D8523n82k2937j2471j1308K1079j9473j3653J3629p861o393k034k5968j3812
11331e3261N7075k1155O070J0488J7413r689K0209L13j4955o5436k2596K0028
11319e5496L9813r170J165L6773L6989j9683k9224k345P381L0633J9371j0729
11307D5478J0738J5975M5355J685P00j3774q09j1143j1633j2276m6532m1722L428
$$ plain form
11294 -14530 -214 -22784 -41555 -23604 -51796 -24183 -4906 -4059 12488 16042 55354 69504
11282 69504 29771 -37431 -57733 -71743 -81045 -25286 35406 59950 85773 111541 160493 172035
11270 172035 192672 226622 257654 237091 185139 166155 153163 143427 117664 60751 61553 19841
11258 19841 2731 30892 30086 19937 -227 28191 31278 8997 45503 98877 87965 68954
11246 68954 90903 109440 132302 133992 147031 148985 142819 90878 63368 55822 45903 16243 36225
11233 36225 39275 66293 91205 119150 100973 72375 77920 72001 52641 41679 20792 5179
11221 5179 -7895 -21208 17724 43283 97707 84225 82492 103372 144758 179503 149146 170573
11209 170573 169313 144002 149587 148947 73626 -18972 -21365 50207 111513 131142 114372 65635
$$ packed form
11294a4530J4316k2570j8771J7951k8192K7613J9277Q47J6547L554L9312J4150
11282F9504l9733o7202k0302j4010r302N5759O0692K4544K5823K5768M8952J1542
11270A72035K0637L3950L1032k0563n1952j8984j2992r736k5763n6913Q02m1712
11258A9841j7110K8161q06j0149k0164K8418L087k2281L6506N3374j0912j9011
11246F8954K1949J8537K2862J690J3039J954o166n1941k7510p546r919k9660J9982
11233C6225L050K7018K4912K7945j8177k8598N545n919j9360j0962k0887j5613
11221E179j3074j3313L8932K5559N4424j3482j733K0880M1386L4745l0357K1427
11209A70573j260k5311N585o40p5321r2598k393P1572O1306J9629j6770m8737
$$ plain form
11197 65635 9910 33433 66027 54922 51144 89540 143555 141805 114208 102875 68851 31257
11185 31257 -10656 -12382 5468 4005 -42623 -17078 64691 104024 78379 83790 93264 77994
11173 77994 52293 34724 -3245 19694 29132 18067 11312 28086 84757 138520 144594 143502
11161 143502 166595 163340 123573 133910 146768 133433 107406 58502 40006 45686 66418 100671
11149 100671 137900 153661 195000 191016 155483 60234 -58223 -126784 -66744 55965 125781
11138 125781 154792 195957 211190 216571 260357 264927 238027 186265 172264 244276 277497 261893
11126 261893 280148 286191 269074 228520 203488 230955 218255 215930 277232 287038 270441 221499
11114 221499 182003 195998 201489 199144 188483 165834 157543 195051 240961 280467 310376 336895
$$ packed form
11197F5635n5725K3523L2594j1105l778L8396N4015j750k7597j1333l4024l7594
11185C1257m1913j726J7850j463m6628K5545Q1769L9333k5645N411R474j5270
11173G7994k5701j7569l7969K2939R438j1065o755J6774N6671N3763O074j092
11161A43502K3093l255l9767J0337J2858j3335k6027m8904j8496N680K0732L4253
11149A00671L7229J5761M1339l984l5533r5249j18457o8561O0040J22709O9816
11138A25781K9011M1165J5233N381M3786M570k6900n1762j4001P2012L3221j5604
11126B61893J8255O043j7117m0554k5032K7467j2700k325O1302R806j6597m8942
11114B21499l9496J3995N491k345j0661k2649q291L7508M5910L9506K9909K6519
$$ plain form
11102 336895 403001 466339 448892 395118 387334 388055 365804 308302 325986 375812 377756 398744
11090 398744 376954 375180 438299 465907 470865 484496 489325 480178 474722 481509 465944 549803 604572
11077 604572 615732 629259 673276 700715 701682 718886 774258 836321 874370 916425 963183 1033715
11065 1033715 1079163 1160035 1226743 1355611 1445982 1468870 1509874 1610484 1693166 1799985 1927153
11054 1927153 2060791 2176931 2321260 2524541 2688891 2817436 2965722 3114492 3341121
11045 3341121 3689807 4107534 4615843 5142279 5766264 6592964 7765294 9269032 10627050
11036 10627050 11307980 11841170 12748337 14067416 15632284 17279744 18970389 20702918
11028 20702918 22451984 24246256 26315044 29229560 33276710 38615923 45728859 56550322
$$ packed form
11102C36895O6106O3338j7447n3774p784P21k2251n7502J7684M9826J944K0988
11090C98744k1790j774O3119K7608M958J3631M829r147n456O787j5565Q3859N4769
11077F04572J1160J3527M4017K7439R67J7204N5372O2063L8049M2055M6758P0532
11065A033715M5448Q0872O6708J28868R0371K2888M1004J00610Q2682J06819J27168
11054A927153J33638J16140J44329K03281J64350J28545J48286J48770K26629
11045C341121L48686M17727N08309N26436O23985Q26700J172330J503738J358018
11036A0627050O80930N33190R07167J319079J564868J647460J690645J732529
11028B0702918J749066J794272K068788K914516M047150N339213P112936J0821463
$$ plain form
11020 56550322 74243293 104294863 157164709 250650421 391435471 519826625 513844290
11013 513844290 387151042 266627955 181164819 125664078 90916534 68555130 53462368
11006 53462368 42627560 34355594 27754011 22486232 18341439 15189915 12777192 10847994
10998 10847994 9299577 8092648 7233940 6728207 6500494 6586341 6901421 7268941 7097076
10989 7097076 6110979 5091442 4330089 3845341 3551322 3277695 3033996 2812653 2625620
10980 2625620 2482278 2361128 2256873 2137741 2037294 1902269 1754745 1665320 1566758 1480043
10970 1480043 1435714 1369753 1301675 1248878 1213993 1202072 1177662 1143394 1150583 1112442 1070891
10959 1070891 1061596 1030173 981079 968211 921193 811778 784697 805036 812342 787001 776673
$$ packed form
11020E6550322J7692971L0051570N2869846R3485712J40785050J28391154n982335
11013E13844290j26693248j20523087q5463136n5500741l4747544k2361404j5092762
11006E3462368j0834808q271966o601583n267779m144793l151524k412723j929198
10998A0847994j548417j206929q58708n05733k27713Q5847L15080L67520j71865
10989G097076r86097j019537p61353m84748k94019k73627k43699k21343j87033
10980B625620j43342j21150j04255j19132j00447j35025j47524q9425r8562q6715
10970A480043m4329o5961o8078n2797l4885j1921k4410l4268P189l8141m1551
10959A070891r295l1423m9094j2868m7018j09415k7081K0339P306k5341j0328
$$ plain form
10948 776673 787218 785209 777727 756025 685595 622011 623716 639117 584314 528473 483531 480255
10936 480255 519503 547807 531659 521225 502739 498497 435159 346799 319916 280086 277244 331583
10924 331583 382617 413378 391903 359179 365332 338635 290259 282728 327958 361512 370935 331357
10912 331357 262168 266179 275219 259861 255852 233647 223016 194239 213605 229063 212506 221997
10900 221997 200859 177782 204041 233011 256047 225077 224046 189945 177271 211993 284361 435309
10888 435309 634487 677338 590715 540357 443840 379170 315374 344311 362676 373572 399938
10877 399938 449275 462182 372060 293413 230530 194448 189852 189069 159174 140965 150696 145577
10865 145577 167705 246465 288441 276476 278043 257807 202704 190020 219949 224824 236134 224100
$$ packed form
10948G76673J0545k009p482k1702p0430o3584J705J5401n4803n5841m4942l276
10936D80255L9248K8304j6148j0434j8486m242o3338q8360k6883l9830k842N4339
10924C31583N1034L0761k1475l2724O153k6697m8376p531M5230L3554R423l9578
10912C31357o9189M011R040j5358m009k2205j0631k8777J9366J5458j6557R491
10900B21997k1138k3077K6259K8970K3036l0970j031l4101j2674L4722P2368J50948
10888D35309J99178M2851q6623n0358r6517o4670o3796K8937J8365J0896K6366
10877C99938M9337J2907r0122p8647o2883l6082m596p83k9895j8209R731n119
10865A45577K2128P8760M1976j1965J567k0236n5103j2684K9929M875J1310j2034
$$ plain form
10853 224100 186639 157072 160003 158106 172043 178037 179825 145559 108583 142561 136170 45812
10841 45812 28144 50900 97035 78044 90984 123957 177325 168617 139602 120655 95468 65639
10829 65639 66216 112750 178145 228569 180457 68827 2386 -42021 -28806 7172 -2777 -28403
10817 -28403 -33399 11197 22564 2851 -20058 24743 67530 90327 117536 122363 143924 185634
10805 185634 161850 128183 157691 239065 255958 192644 152706 142223 133855 147820 133208 121860
10793 121860 110819 107650 97764 83871 64581 35487 80164 131393 104378 80125 43907 8932
10781 8932 -3232 10789 51349 56448 44716 31833 48410 66123 92176 46741 -8746 -15608
10769 -15608 42348 89545 124603 170781 140723 116582 99827 76921 68374 97805 118424 126488
$$ packed form
10853B24100l7461k9567K931j897J3937N994J788l4266l6976L3978o391r0358
10841D5812j7668K2756M6135j8991J2940L2973N3368q708k9015j8947k5187k9829
10829F5639N77M6534O5395N0424m8112j11630o6441m4407J3215L5978r949k5626
10817b8403m996M4596J1367j9713k2909M4801M2787K2797K7209M827K1561M1710
10805A85634k3784l3667K9508Q1374J6893o3314l9938j0483q368J3965j4612j1348
10793A21860j1041l169r886j3893j9290k9094M4677N1229k7015k4253l6218l4975
10781H932j2164J4021M0560N099j1732j2883J6577J7713K6053m5435n5487o862
10769a5608N7956M7197L5058M6178l0058k4141j6755k2906q547K9431K0619Q064
$$ plain form
10757 126488 148206 144820 160685 141117 114056 121619 137175 111217 69213 96787 120860 116921
10745 116921 81834 98804 59586 83362 108346 57434 15743 21496 59481 91558 105663 92329
10733 92329 32695 22234 52442 104445 88252 58835 28879 23477 35734 54373 47772 13892
10721 13892 14034 25783 31352 37147 17578 -823 -976 15549 31817 67567 81158 82181 85176
10708 85176 60830 33672 40001 37457 21681 -24779 -2526 4666 40531 76967 78755 99066
10696 99066 112507 90155 65092 22516 14483 -3659 -29220 -41982 -33275 -16293 30146 38799
10684 38799 13250 12009 59006 56294 34871 5407 17913 26773 37230 36542 15874 29041 75447
10671 75447 97545 80800 39767 20081 -6137 -27670 -13253 2717 24633 -13910 -25885 -7493
$$ packed form
10757A26488K1718l386J5865j9568k7061P563J5556k5958m2004K7574K4073l939
10745A16921l5087J6970l9218K3776K4984n0912m1691N753L7985L2077J4105j3334
10733I2329n9634j0461L0208N2003j6193k9417k9956n402J2257J8639o601l3880
10721A3892J42J1749N569N795j9569j8401j53J6525J6268L5750J3591J023K995
10708H5176k4346k7158O329k544j5776m6460K2253P192L5865L6436J788K0311
10696I9066J3441k2352k5063m2576q033j8142k5561j2762Q707J6982M6439Q653
10684C8799k5549j241M6997k712k1423k9464J2506Q860J0457o88k0668J3167M6406
10671G5447K2098j6745m1033j9686k6218k1533J4417J5970K1916l8543j1975J8392
$$ plain form
10659 -7493 -11769 -15419 6809 44581 78241 33060 -14672 -54767 -35996 -17601 5128 28509
10647 28509 65438 70822 35578 13746 22645 12120 -20486 7709 8400 15422 13025 19125 41585
10634 41585 64130 95058 55574 26143 17876 18117 -6160 17903 93708 81078 41383 677
10622 677 -3243 36308 49668 39234 31111 68464 85286 92042 121126 167700 147449 194903 243309
10609 243309 237616 261054 332607 400525 478677 707422 1094063 1699945 2490181 2856952 2401111
10598 2401111 1716717 1194667 868867 634557 459807 321501 229996 194221 179588 139017
10588 139017 99616 64689 45138 84160 90302 107007 127535 90275 88603 63148 36145 42471
10576 42471 33564 29772 23106 34585 7073 18359 28474 58505 53002 47099 30178 39410 49572
$$ packed form
10659g493m276l650K2228L7772L3660m5181m7732m0095J8771J8395K2729K3381
10647B8509L6929N384l5244k1832Q899j0525l2606K8195O91P022k397O100K2460
10634D1585K2545L0928l9484k9431q267K41k4277K4063P5805j2630l9695m0706
10622F77l920L9551J3360j0434q123L7353J6822O756K9084M6574k0251M7454M8406
10609B43309n693K3438P1553O7918P8152K28745L86641O05882P90236L66771m55841
10598B401111o84394n22050l25800k34310j74750j38306r1505l5775j4633m0571
10588A39017l9401l4927j9551L9022O142J6705K0528l7260j672k5455k7003O326
10576D2471q907l792o666J1479k7512J1286J0115L0031n503n903j6921R232J0162
$$ plain form
10563 49572 56157 55184 7968 -16374 24379 20099 17888 29987 40623 8698 3335 17908 39683
10550 39683 82337 100670 83160 50356 47935 40841 27153 -8776 -2061 5002 1493 39107 60382
10537 60382 20048 -34811 -59968 -64500 -50231 -4429 52783 22308 33503 6736 -53897 -38525
10525 -38525 -8899 41886 74707 98817 66089 28470 18173 47245 23688 6612 21348 44539
10513 44539 26171 39594 23644 5162 6061 -22555 -45927 -19579 -12543 4305 10099 -19045
10501 -19045 -24781 -454 18455 -15926 -479 -5910 -38678 -47107 -60620 -25926 22148 8343
10489 8343 -12797 -8278 14593 55043 72685 50348 49338 31475 -9499 6595 8448 -499 -25278
10476 -25278 -42420 -43573 -82032 -73086 -37027 -25947 -19348 -14387 -2862 -41098 -42041 -12469 15026
$$ packed form
10563D9572O585r73m7216k4342M0753m280k211J2099J0636l1925n363J4573K1775
10550C9683M2654J8333j7510l2804k421p094j3688l5929O715P063l509L7614K1275
10537F0382m0334n4859k5157m532J4269M5802N7212l0475J1195k6767o0633J5372
10525c8525K9626N0785L2821K4110l2728l7619j0297K9072k3557j7076J4736K3191
10513D4539j8368J3423j5950j8482Q99k8616k3372K6348P036J6848N794k9144
10501a9045n736K4327J8909l4381J5447n431l2768q429j3513L4694M8074j3805
10489H343k1140M519K2871M0450J7642k2337j010j7863m0974J6094J853q947k4779
10476b5278j7142j153l8459Q946L6059J1080O599M961J1525l8236r43K9572K7495
$$ plain form
10463 15026 28143 50615 26720 26682 2271 -31728 -36422 -30767 -25393 -38069 -28269 -27237 5619
10450 5619 7558 74 -13747 -34458 -32801 -33854 -54228 -31394 -21541 -44203 -6443 17849 -13847
10437 -13847 -59457 -70076 -37426 -17693 -24458 -50510 -48024 -29517 -10343 34326 30183 49951
10425 49951 17891 990 480 -12156 15083 25053 -2669 -59532 -27137 4370 11145 -4631
10413 -4631 17355 43866 45548 16520 -8932 14899 46277 38540 31674 15838 17438 45939 44544
10400 44544 34810 34858 54379 59857 36065 13719 45764 70763 60834 52717 50359 44918 8393
10387 8393 28505 46865 63964 62276 39790 26783 7333 -15991 10047 54963 66819 36721
10375 36721 -14237 -68584 -69799 -78132 -52871 -48266 -51806 -57343 -19673 22722 48617 8141 -8906
$$ packed form
10463A5026J3117K2472k3895l8k4411l3999m694N655N374j2676R800J032L2856
10450E619J939p484j3821k0711J657j053k0374K2834R853k2662L7760K4292l1696
10437a3847m5610j0619L2650J9733o765k6052K486J8507J9174M4669m143J9768
10425D9951l2060j6901n10j2636K7239R970k7722n6863L2395L1507O775j5776
10413d631K1986K6511J682k9028k5452K3831L1378p737o866j5836J600K8501j395
10400D4544r734M8J9521N478k3792k2346L2045K4999r929q117k358n441l6525
10387H393K0112J8360J7099j688k2486j3007j9450k3324K6038M4916J1856l0098
10375C6721n0958n4347j215q333K5261M605l540n537L7670M2395K5895m0476j7047
$$ plain form
10362 -8906 -16485 -12312 6738 6654 -25522 -49587 -57309 -36134 -21742 -8447 -33027 -30384 -9867
10349 -9867 35164 3788 -19567 -37888 -74955 -27409 1612 12573 -12754 -21776 -8937 -3599
10337 -3599 34082 49548 51367 80404 75910 63605 26210 -41260 -51767 -57366 -49771 -32232 6640
10324 6640 31713 48991 48986 31349 3545 8496 5643 13996 3348 -27688 -44203 -17722 4574
10311 4574 -19187 20549 57946 45733 33824 29906 2778 -28805 -40672 -19596 -24775 -61780
10299 -61780 -84129 -55349 -74324 -63689 -55225 -28087 4064 10124 4707 -15095 -5461 10031
10287 10031 -11601 15383 -7731 -38901 -31269 -45341 -44974 -52859 -24471 -7439 5196 -37520
10275 -37520 -33663 40106 76235 44391 4359 28989 40400 9744 32014 44882 20887 40046
$$ packed form
10362h906p579M173J9050q4l2176k4065p722K1175J4392J3295k4580K643K0517
10349i867M5031l1376k3355j8321l7067M7546K9021J0961k5327r022J2839N338
10337c599L7681J5466J819K9037m494j2305l7395o7470j0507n599P595J7539L8872
10324F640K5073J7278nj7637k7804M951k853Q353j0648l1036j6515K6481K2296
10311D574k3761L9736L7397j2213j1909l918k7128l1583j1867K1076n179l7005
10299f1780k2349K8780j8975J0635Q464K7138L2151O060n417j9802R634J5492
10287A0031k1632K6984k3114l1170P632j4072L67p885K8388J7032J2635m2716
10275c7520L857P3769L6129l1844m0032K4630J1411l0656K2270J2868k3995J9159
$$ plain form
10263 40046 40395 22886 31940 21610 -25147 -32556 6365 44212 42575 18218 33351 51285 39750
10250 39750 25359 33026 30381 8878 17493 -10236 -51816 -10459 -7 -14504 3216 17861
10238 17861 45724 39806 -1234 -58802 -102391 -55207 -11996 -20088 18765 22742 -8612 -29275
10226 -29275 -65707 -84339 -48093 3516 57743 21540 -12721 -923 52188 62876 36950 58037
10214 58037 73781 29777 9189 -18209 -44231 -41128 -80143 -91920 -116367 -95205 -47194 -40007
10202 -40007 -21868 -1301 -8770 -1894 -23473 -78584 -102478 -72603 -20556 15764 8386 23701
10190 23701 13978 -33402 -13168 -3593 -21898 -44160 -51090 -5379 -14310 -13544 -271 -100 39864
10177 39864 14890 -3828 -8655 -13599 -37973 -35370 -30969 -26284 -39612 -14075 -14056 -4574 14717
$$ packed form
10263D0046L49j7509R054j0330m6757p409L8921L7847j637k4357J5133J7934j1535
10250C9750j4391P667k645k1503Q615k7729m1580M1357J0452j4497J7720J4645
10238A7861K7863n918m1040n7568m3589M7184M3211q092L8853L977l1354k0663
10226b9275l6432j8632L6246N1609N4227l6203l4261J1798N3111J0688k5926K1087
10214E8037J5744m4004k0588k7398k6022L103l9015j1777k4447K1162M8011P187
10202d0007J8139K0567p469O876k1579n5111k3894K9875N2047L6320p378J5315
10190B3701r723m7380K0234R575j8305k2262o930M5711q931P66J3273J71L9964
10177C9864k4974j8718m827m944k4374K603M401M685j3328K5537J9R482J9291
$$ plain form
10164 14717 14632 6497 -22275 -34901 -19510 16891 35959 17793 33574 1195 -39004 -43799 12047
10151 12047 48486 24587 13008 4936 13653 -7583 -12994 -14835 -32907 9724 34387 -7209
10139 -7209 -15927 -18757 -29156 -67051 -44227 -23303 -16231 -8275 11004 28525 35430 7471 -8600
10126 -8600 31013 88761 78308 45279 28208 5196 -22229 -15916 152 35561 20496 -6213
10114 -6213 4185 -5042 -16643 2267 10618 19301 3314 -1307 36824 37973 23717 4242 -3238
10101 -3238 32673 93410 81145 36478 28383 11085 -9439 13017 11883 2497 -12233 -8479 -5695
10088 -5695 -11098 12133 33309 42597 22686 1015 -15901 -24138 -20743 -13325 -18300 5400 61789
10075 61789 97585 94499 38377 44934 65552 30129 43729 64845 76976 67672 76765 104924
$$ packed form
10164A4717q5q135k8772j2626J5391L6401J9068j8166J5781l2379m0199m795N5846
10151A2047L6439k3899j1579q072Q717k1236n411j841j8072M2631K4663m1596
10139g209q718k830j0399l7895K2824K0924P072P956J9279J7521O905k7959j6071
10126h600L9613N7748j0453l3029j7071k3012k7425O313J6068L5409j5065k6709
10114f213J0398r227j1601J8910Q351Q683j5987m621L8131J149j4256j9475p480
10101c238L5911O0737j2265m4667q095j7298k0524K2456j134r386j4730L754K784
10088e695n403K3231K1176R288j9911k1671j6916q237L395P418m975K3700N6389
10075F1789L5796l086n6122O557K0618l5423J3600K1116J2131r304R093K8159
$$ plain form
10063 104924 96863 52147 59464 90772 49801 -16517 -29110 -26534 2403 14678 35347 52203
10051 52203 40718 36374 60456 146141 229415 208618 152988 126694 98821 70731 22527 16333
10039 16333 16048 -1736 -23554 -1209 66900 62030 48069 55244 44285 8722 -39109 -17993
10027 -17993 5691 1043 14854 48952 77805 65215 41966 35964 36768 42356 32746 28792 -10146
10014 -10146 24461 57727 19460 -22890 25547 87425 98274 72722 93586 97029 77673 49758
10002 49758 -3292 -770 18954 19658 37308 65812 43982 43970 39511 43969 62823 76206 44012
9989 44012 47994 55517 61107 81301 56706 90693 69788 -5026 -4639 21499 25576 36893 11035
9976 11035 11195 32238 30037 27368 49686 42254 59350 23116 -12887 -11526 24049 42676 34376
$$ packed form
10063A04924q061m4716P317L1308m0971o6318j2593K576K8937J2275K0669J6856
10051E2203j1485m344K4082Q5685Q3274k0797n5630k6294k7873k8090m8204o194
10039A6333k85j7784k1818K2345O8109m870j3961P175j0959l5563m7831K1116
10027a7993K3684m648J3811L4098K8853j2590k3249o002Q04N588r610l954l8938
10014a0146L4607L3266l8267m2350M8437O1878J0849k5552K0864L443j9356k7915
10002D9758n3050K522J9724P04J7650K8504k1830j2m459M458J8854J3383l2194
9989D4012L982P523N590K0194k4595L3987k0905p4814L87K6138M077J1317k5858
9976A1035J60K1043k201k669K2318p432J7096l6234l6003J361L5575J8627q300
$$ plain form
9963 34376 19787 -20259 -54062 -33696 41744 44532 26810 66321 44445 20833 27568 8031
9951 8031 -21288 -4708 -11630 -20675 -5479 34499 9054 -12961 -4688 -26805 -14843 10565 18073
9938 18073 37631 68720 56545 27806 17335 21399 39522 18590 -5138 24136 2636 -53505
9926 -53505 -73872 -68291 -57581 -35493 -23106 -2301 -6714 29643 61294 23711 -4777 -2193
9914 -2193 -22702 -27335 6473 -1666 -28278 14160 39788 59127 50584 -5032 -8307 -12043 -49451
9901 -49451 -78976 -46040 -17157 15401 39101 28278 28994 82088 125426 115774 90849 42050
9889 42050 31357 6408 7513 31039 30253 22558 7320 20773 9976 1715 11462 16489 148
9876 148 -207 -26684 317 -10887 -25695 7757 62804 46660 -16547 -50893 -67661 -77928 -39194
$$ packed form
9963C4376j4589m0046l3803K0366P5440K788j7722L9511k1876k3612O735j9537
9951H031k9319J6580o922r045J5196L9978k5445k2015Q273k2117J1962K5408P508
9938A8073J9558L1089j2175k8739j0471M064J8123k0932k3728K9274k1500n6141
9926e3505k0367N581J0710K2088J2387K0805m413L6357L1651l7583k8488K584
9914b193k0509m633L3808q139k6612M2438K5628J9339q543n5616l275l736l7408
9901d9451k9525L2936K8883L2558K3700j0823P16N3094M3338r652k4925m8799
9889D2050j0693k4949J105K3526p86p695j5238J3453j0797q261R747N027j6341
9876A48l55k6477K7001j1204j4808L3452N5047j6144o3207l4346j6768j0267L8734
$$ plain form
9863 -39194 -25541 -25283 -10103 -14282 -17176 -30267 -29624 -18118 -23914 -39484 -34291 -15045 31010
9850 31010 -1839 -21579 -5144 11409 21611 2261 4536 24868 38109 65249 50427 49759
9838 49759 70322 39213 10764 6985 1209 -13387 -65143 -69064 -41952 -44172 -55295 -72273 -98987
9825 -98987 -56089 -56104 -46417 -34505 544 -1198 -21938 -1477 48734 65333 89024 84551 12813
9812 12813 -13903 32306 33976 -24276 -22876 -28597 -9431 8719 -19413 -28377 -7671 13985 37115
9799 37115 55977 32843 38090 57911 75502 25970 3119 19519 2833 -14316 -14276 -9082 641
9786 641 -16118 -13938 -1382 985 -36917 -28938 -30537 -36050 19017 14964 -4473 -57106 -34510
9773 -34510 -14256 11314 33817 67341 83238 38391 19780 -1908 -3346 -13316 -20109 -40058
$$ packed form
9863c9194J3653K58J5180m179k894j3091O43J1506n796j5570N193J9246M6055
9850C1010l2849j9740J6435J6553J0202j9350K275K0332J3241K7140j4822o68
9838D9759K0563l1109k8449l779n776j4596n1756l921K7112k220j1123j6978k6714
9825i8987M2898j5R687J1912L5049j742k0740K0461N0211J6599K3691m473p1738
9812A2813k6716M6209J670n8252J400n721J9166J8150k8132q964K0706K1656K3130
9799C7115J8862k3134N247J9821J7591m9532k2851J6400j6686j7149M0N194R723
9786F41j6759K180J2556K367l7902P979j599n513N5067m053j9437n2633K2596
9773c4510K0254K5570K2503L3524J5897m4847j8611k1688j438r970o793j9949
$$ plain form
9761 -40058 -48664 -61062 -4823 9973 -21983 -10629 42812 48042 17079 -11586 -17570 7865
9749 7865 -2351 -30520 -26442 -2919 -20846 -86664 -64896 -7157 -35722 -68489 -96829 -72458
9737 -72458 4364 23314 40190 34104 4865 16620 47445 36509 4410 2331 8227 19247
9725 19247 -32126 -61701 -23691 -12923 17007 34826 28897 39855 52801 33995 42525 59063
9713 59063 46789 30999 -7969 -4163 -6234 9867 33125 61968 64014 42774 33321 19115 -24346
9700 -24346 -8351 202 11221 -893 27839 20835 5213 -9942 7474 34938 25506 452
9688 452 -8843 -37815 -10132 10031 18905 -13502 -30053 -25877 -20902 -19892 -52927 -32488 -43785
9675 -43785 -29549 22848 56071 67502 61539 50274 33654 42040 40937 23889 27713 7909 22948
$$ packed form
9761d0058q606j2398N6239J4796l1956J1354N3441N230l0963k8665n984K5435
9749G865j0216k8169M078K3523j7927o5818K1768N7739k8565l2767k8340K4371
9737g2458P6822J8950J6876o086k9239J1755L0825j0936l2099k079N896J1020
9725A9247n1373k9575L8010J0768K9930J7819n929J0958J2946j8806Q530J6538
9713E9063j2274j5790l8968L806k071J6101K3258K8843K046k1240r453j4206m3461
9700b4346J5995Q553J1019j2114K8732p004j5622j5155J7416K7464r432k5054
9688D52r295k8972K7683K0163Q874l2407j6551M176M975J010l3035K0439j1297
9675d3785J4236N2397L3223J1431n963j1265j6620Q386j103j7048L824j9804J5039
$$ plain form
9662 22948 -6489 -18338 -9847 -10915 -8672 -20920 5671 -5933 5032 26632 38147 17350
9650 17350 41953 38686 -2945 -36183 -60051 -86776 -102340 -67253 -24239 8510 -15664 -45177
9638 -45177 -8207 24685 66058 99165 95636 96206 67909 66308 64068 32915 5529 5870 14219
9625 14219 24981 48697 56742 36095 30500 33731 30556 10939 -20888 -34528 -60099 -47336 -46143
9612 -46143 -15007 10493 15027 3301 -8752 -9878 -7265 11256 28987 55929 51067 47934 41509
9599 41509 43907 10313 -17469 -7177 6937 32083 50570 32506 67354 49656 31259 61323
9587 61323 7681 -5797 3222 -28438 -25839 -38793 -41524 -5665 27759 25640 -13162 -13909 18563
9574 18563 38098 11852 14227 16396 27651 17354 1279 1520 474 30621 18570 -5795 5674
$$ packed form
9662B2948k9437j1849Q491j068K243j2248K6591j1604J0965K1600J1515k0797
9650A7350K4603l267m1631l3238k3868k6725j5564L5087M3014L2749k4174k9513
9638d5177L6970L2892M1373L3107l529N70k8297j601k240l1153k7386L41Q349
9625A4219J0762K3716Q045k0647n595L231l175j9617l1827j3640k5571J2763J193
9612d6143L1136K5500M534j1726j2053j126K613J8521J7731K6942m862l133o425
9599D1509K398l3594k7782J0292J4114K5146J8487j8064L4848j7698j8397L0064
9587F1323n3642j3478R019l1660K599j2954k731L5859L3424k119l8802p47L2472
9574A8563J9535k6246K375K169J1255j0297j6075K41j046L0147j2051k4365J1469
$$ plain form
9561 5674 18945 17486 28534 7943 19756 12730 -45844 -64951 -45911 1486 36508 48622
9549 48622 24332 -6068 15558 -26349 2637 685 -3103 3645 11521 38150 38641 33324 12099
9536 12099 38 22835 69030 64944 37425 -7842 -11739 -28479 -34289 -10833 25391 -9993
9524 -9993 -10175 -7580 -15044 -12176 -23447 -20057 -30585 -35660 43387 76971 11084 10487 24190 30493
9510 30493 44737 57199 113873 68682 -1514 -40402 -25194 1748 23632 22994 52076 56636
9498 56636 38003 31220 43043 27098 -4947 -9083 -14234 -2064 14498 -5115 13877 -4376
9486 -4376 -5209 6222 41063 45942 32880 15514 -11888 -5130 42826 63572 41102 18692 -14616
9473 -14616 12807 4601 -15446 -37569 -42118 -11771 -6348 -8000 37237 61794 56284 48374 10162
$$ packed form
9561E674J3271j459J1048k0591J1813p026n8574j9107J9040M7397L5022J2114
9549D8622k4290l0400K1626m1907K8986j952l788O748P876K6629M91n317k1225
9536A2099j2061K2797M6195m086k7519m5267l897j6740n810K3456L6224l5384
9524i993j82K595p464K868j1271L390j0528n075P9047L3584o5887n97J3703O303
9510C0493J4244J2462N6674m5191p0196l8888J5208K6942K1884o38K9082M560
9498E6636j8633o783J1823j5945l2045m136n151J2170J6562j9613J8992j8253
9486d376q33J1431L4841M879j3062j7366k7402O758M7956K0746k2470k2410l3308
9473a4616K7423q206k0047k2123m549L0347N423j652M5237K4557n510p910l8212
$$ plain form
9460 10162 -30935 -60235 -29305 19908 25650 19664 12274 -2935 24215 20758 5556 12991 39299
9447 39299 13019 1720 -31696 -38595 -44666 -46424 -19036 23508 64603 32964 7290 37573
9435 37573 28757 -11931 -31330 -7717 -16799 -21836 16776 52916 46697 37715 41804 45286 53403
9422 53403 67447 47982 46074 39623 50391 46083 36685 16667 1562 5634 -28018 -67988 -69930
9409 -69930 -41924 -17906 31058 47995 63973 44557 63756 84362 72503 30685 46135 46789
9397 46789 41419 36260 37811 41399 -7290 -6509 -17802 -19741 35159 56584 46462 33648 43693
9384 43693 46596 30948 11103 30452 84165 67566 11365 9051 54669 99857 106912 66476
9372 66476 73330 91750 53453 -9780 -7738 2851 -4681 18985 35864 54090 79025 87141 69432
$$ packed form
9460A0162m1097k9300L0930M9213N742n986p390j5209K7150l457j5202P435K6308
9447C9299k6280j1299l3416o899o071j758K7388M2544M1095l1639k5674L0283
9435C7573q816m0688j9399K3613r082n037L8612L6140o219q982M089L482Q117
9422E3403J4044j9465j908o451J0768m308r398k0018j5105M072l3652l9970j942
9409f9930K8006K4018M8964J6937J5978j9416J9199K0606j1859m1818J5450O54
9397D6789n370n159J551L588m8689P81j1293j939N4900K1425j0122j2814J0045
9384D3693K903j5648j9845J9349N3713j6599n6201k314M5618M5188P055m0436
9372F6476O854J8420l8297o3233K042J0589p532K3666J6879J8226K4935Q116j7709
$$ plain form
9359 69432 83131 88651 84581 91794 41266 -24879 -32403 2691 42609 59431 73403 83073 89300
9346 89300 66513 51576 41017 23006 40526 48616 82393 73972 26450 28672 58093 32186
9334 32186 32926 25407 48126 42732 60384 46328 49580 68544 53924 67948 60547 109103 115881
9321 115881 108945 150641 147543 118786 99836 85428 63285 46992 54987 95544 117417 145643
9309 145643 148981 102228 47001 49318 58692 64638 72821 79706 96269 106897 106058 114690 145578
9296 145578 161756 156219 110011 92268 82568 80757 68979 92959 120541 88876 117277 157078
9284 157078 166694 142820 142834 142279 133768 76924 36361 71012 52262 28133 47464 87907 128365
9271 128365 177158 170768 152680 132771 117804 105771 78726 96195 83826 94236 138944 211053
$$ packed form
9359F9432J3699N520m070P213n0528o6145p524L5094L9918J6822J3972R670O227
9346H9300k2787j4937j0559j8011J7520Q090L3777q421m7522K222K9421k5907
9334C2186P40p519K2719n394J7652j4056L252J8964j4620J4024p401M8556O778
9321A15881o936M1696l098k8757j8950j4408k2143j6293P995M0557K1873K8226
9309A45643L338m6753n5227K317R374N946Q183O885J6563J0628q39Q632L0888
9296A45578J6178n537m6208j7743r700j811j1778K3980K7582l1665K8401L9801
9284A57078R616k3874J4n55q511n6844m0563L4651j8750k4129J9331M0443M0458
9271A28365M8793o390j8088j9909j4967j2033k7045J7469j2369J0410M4708P2109
$$ plain form
9259 211053 209413 162784 155685 196918 218163 237059 275462 322037 297064 266328 239032 178936
9247 178936 155418 167866 213464 253312 263470 292666 288554 304542 342892 312027 274180 272278
9235 272278 290342 341212 360944 361929 375221 428497 420895 435727 457911 542774 566436 570915
9223 570915 548195 570651 589699 565385 541125 567429 626043 639669 674891 716451 778232 837663
9211 837663 889217 912818 915482 962448 1000393 1027195 1111384 1219437 1307408 1373017 1403861 1499225
9199 1499225 1607432 1720209 1792729 1862569 1946193 2119358 2313377 2484911 2610971 2773617
9189 2773617 2998653 3231153 3440149 3689611 3991536 4258638 4551288 4883872 5256770 5658701
9179 5658701 6086794 6480598 6852033 7328612 7782278 8169024 8601829 8984984 9243276 9410390
$$ packed form
9259B11053j640m6629p099M1233K1245J8896L8403M6575k4973l0736k7296o0096
9247A78936k3518J2448M5598L9848J0158K9196m112J5988L8350l0865l7847j902
9235B72278J8064N0870J9732R85J3292N3276p602J4832K2184Q4863K3662M479
9223E70915k2720K2456J9048k4314k4260K6304N8614J3626L5222M1560O1781N9431
9211H37663N1554K3601K664M6966L7945K6802Q4189J08053Q7971O5609L0844R5364
9199A499225J08207J12777P2520O9840Q3624J73165J94019J71534J26060J62646
9189B773617K25036K32500K08996K49462L01925K67102K92650L32584L72898M01931
9179E658701M28093L93804L71435M76579M53666L86746M32805L83155K58292J67114
$$ plain form
9169 9410390 9487969 9495779 9346666 9099752 8742661 8383644 8057005 7658125 7191331 6708564
9159 6708564 6231211 5783016 5379312 5021405 4635706 4277804 3997670 3690413 3428309 3175989
9149 3175989 2978889 2778148 2603967 2463983 2281739 2117389 1977997 1860517 1787820 1729409
9139 1729409 1622005 1502661 1395453 1334981 1261629 1194536 1162831 1156558 1134082 1081367 1015820
9128 1015820 944282 901773 844556 786912 766044 742192 671488 627440 626554 656519 648680 617458
9116 617458 598316 552154 523773 494148 486984 485556 524179 531986 523745 461559 413914 417364 394265
9103 394265 403814 412379 403997 364651 367937 350034 336069 302039 241856 251482 234902 239971 250818
9090 250818 241448 259548 254626 203356 244719 255736 248802 233930 204242 174917 195195 200914
$$ packed form
9169I410390P7579P810j49113k46914l57091l59017l26639l98880m66794m82767
9159F708564m77353m48195m03704l57907l85699l57902k80134l07257k62104k52320
9149C175989j97100k00741j74181j39984j82244j64350j39392j17480p2697n8411
9139A729409j07404j19344j07208o0472p3352o7093l1705o273k2476n2715o5547
9128A015820p1538m2509n7217n7644k0868k3852p0704m4048q86K9965p839l1222
9116F17458j9142m6162k8381k9625p164j428L8623P807q241o2186m7645L450k3099
9103C94265R549Q565q382l9346L286j7903j3965l4030o0183R626j6580N069J0847
9090B50818r370J8100m922n1270M1363J1017o934j4872k9688k9325K0278N719
$$ plain form
9078 200914 190472 180478 143427 143217 158173 173373 169304 177784 196056 218313 202973 176591 166012
9065 166012 136044 131688 123847 144905 196321 237740 193744 147673 164825 172885 148084 131750
9053 131750 127940 161952 192840 198529 159063 117965 81541 100900 67048 97642 109362 119448
9041 119448 129186 106849 95158 111715 103786 75135 68960 81142 42193 95119 165693 141136
9029 141136 114021 118324 111060 112627 125204 141423 131650 130117 104334 103746 114820 107259 122503
9016 122503 127209 89791 48855 60237 46186 84650 114274 87326 43751 64029 92274 112076
9004 112076 86788 85617 92960 61579 41905 12321 -21720 -17643 16833 15557 31950 94595
8992 94595 100848 119844 91171 98782 97858 81516 70746 41872 56969 83379 92023 80359 94524
$$ packed form
9078B00914j0442r994l7051k10J4956J5200m069Q480J8272K2257j5340k6382j0579
9065A66012k9968m356p841K1058N1416M1419m3996m6071J7152Q060k4801j6334
9053A31750l810L4012L0888N689l9466m1098l6424J9359l3852L0594J1720J0086
9041A19448R738k2337j1691J6557p929k8651o175J2182l8949N2926P0574k4557
9029A41136k7115M303p264J567J2577J6219r773j533k5783n88J1074p561J5244
9016A22503M706l7418m0936J1382j4051L8464K9624k6948m3575K0278K8245J9802
9004A12076k5288j171P343l1381j9674k9584l4041M077L4476j276J6393O2645
8992I4595O253J8996k8673P611r24j6342j0770k8874J5097K6410Q644j1664J4165
$$ plain form
8979 94524 73482 61527 59332 36519 20316 -13080 -14238 13935 83922 93256 93165 79421 42988
8966 42988 24761 53168 69735 43296 45472 59025 35753 -15135 -10312 3101 3112 22622 42464
8953 42464 28612 64289 76758 64094 77922 59860 19958 -27640 -39205 -19427 8089 19597
8941 19597 90414 82184 46924 40704 12396 -6008 -16824 -18889 6317 10414 41362 73846 60301
8928 60301 60094 43634 -19359 -21646 9232 25802 22850 39473 29091 37735 33857 54519 38079
8915 38079 21304 42315 85189 77277 42034 47669 108057 107793 99876 80144 90950 99523 124164
8902 124164 111885 112926 121502 111027 116367 99118 69555 29160 78061 115184 130873 157391
8890 157391 224580 314600 363488 312531 233953 199775 136195 107483 74905 43936 35972 66252
$$ packed form
8979I4524k1042j1955k195k2813j6203l3396j158K8173O9987R334r1j3744l6433
8966D2988j8227K8407J6567k6439K176J3553k3272n0888M823J3413J1J9510J9842
8953D2464j3852L5677J2469j2664J3828j8062l9902m7598j1565J9778K7516J1508
8941A9597P0817q230l5260o220k8308j8404j0816k065K5206M097L0948L2484j3545
8928F0301k07j6460o2993k287L0878J6570k952J6623j0382Q644l878K0662j6440
8915C8079j6775K1011M2874p912l5243N635O0388k64p917j9732J0806Q573K4641
8902A24164j2279J041Q576j0475N340j7249k9563m0395M8901L7123J5689K6518
8890A57391O7189R0020M8888n0957p8578l4178o3580k8712l2578l0969p964L0280
$$ plain form
8878 66252 72513 64795 88011 89149 36975 21174 35687 13077 16262 44069 99948 86426 71411
8865 71411 89926 107125 84139 104894 99962 94119 111717 127166 87419 33558 -14238 -21634
8853 -21634 50316 89529 94059 101777 126836 155785 219600 364667 518515 639050 645644 493626
8841 493626 345114 274895 235184 169303 125489 115738 114517 93558 72929 48009 75831 99162
8829 99162 93146 83969 132040 93496 77444 54901 38129 -27396 -10453 46570 26922 51215
8817 51215 59879 35027 69992 90313 113757 88980 80327 50874 45093 95459 133497 146293
8805 146293 119202 91908 127375 126319 157033 227636 305818 305799 259807 161888 147716 144589 96843
8792 96843 112768 110476 68241 72080 66802 98661 69387 39347 31146 5797 -27931 -14739 23424
$$ packed form
8878F6252O261p718K3216J138n2174j5801J4513k2610L185K7807N5879j3522j5015
8865G1411J8515J7199k2986K0755m932n843J7598J5449l9747n3861m7796p396
8853b1634P1950L9213M530P718K5059K8949O3815J45067J53848J20535O594j52018
8841D93626j48512p0219l9711o5881m3814r751j221k0959k0629k4920K7822K3331
8829I9162o016r177M8071l8544j6052k2543j6772o5525J6943N7023j9648K4293
8817E1215Q664k4852L4965K0321K3444k4777q653k9453n781N0366L8038J2796
8805A46293k7091k7294L5467j056L0714P0603P8182j9m5992r7919j4172l127m7746
8792I6843J5925k292m2235L839n278L1859k9274l0040q201k5349l3728J3192L8163
$$ plain form
8779 23424 62574 71887 76108 83317 73635 77971 81992 95452 60471 31638 37699 13305 9161
8766 9161 813 -20877 2671 -30218 -28113 14953 53164 16586 -11233 -15876 -31522 -39455 -8982
8753 -8982 46784 88582 75786 41604 59075 52997 27092 39904 49775 45151 -3319 -40000 -38571
8740 -38571 -21845 -19945 512 23671 35761 38855 37470 23779 22573 31795 22618 -2520 -9891
8727 -9891 -3878 1742 -9042 -38673 -26620 -18556 11035 10352 23722 63780 74335 76597 60510
8714 60510 20440 31934 59668 30507 19223 -15442 19260 36195 58801 83613 89735 74774
8702 74774 71912 43822 17096 33124 21749 24720 17103 2666 -21851 -27319 9405 41140 28167
8689 28167 21505 32679 13903 2468 17749 769 -15389 -2892 -31595 -7407 41447 38844
$$ packed form
8779B3424L9150R313M221P209r682M336M021J3460l4981k8833O061k4394m144
8766I161q348k1690K3548l2889K105M3066L8211l6578k7819m643j5646p933L0473
8753h982N5766M1798j2796l4182J7471o078k5905J2812R871m624m8470l6681J429
8740c8571J6726J900K0457K3159J2090L094j385j3691j206R222r177k5138p371
8727i891O013N620j0784k9631J2053Q064K9591o83J3370M0058J0555K262j6087
8714F0510m0070J1494K7734k9161j1284l4665L4702J6935K2606K4812O122j4961
8702G4774k862k8090k6726J6028j1375K971p617j4437k4517n468L6724L1735j2973
8689B8167o662J1174j8776j1435J5281j6980j6158J2497k8703K4188M8854k603
$$ plain form
8677 38844 32392 35694 71067 86132 61431 15994 29049 69976 44460 39377 50915 55357 94518
8664 94518 55920 3108 20187 3234 24216 38340 22506 -4091 21882 34771 25737 42848
8652 42848 6912 7956 79644 80237 94778 81027 79136 134532 146969 133582 151124 169933 217363
8639 217363 194719 121789 127027 118129 114379 121585 84182 50373 70452 68931 89105 116587 136033
8626 136033 206162 247240 304138 383772 515031 739018 1101432 1259397 1043831 755443
8616 755443 576132 473731 394459 300661 228905 173932 146072 162146 155546 144976 157719
8605 157719 214375 216140 185918 206345 213464 191902 123422 107696 104655 125952 134240 156065
8593 156065 190319 225565 232584 237148 209731 212053 254895 235834 206589 251267 277831 344896
$$ packed form
8677C8844o452L302L5373J5065k4701m5437J3055M0927k5516n083J1538M442L9161
8664I4518l8598n2812J7079j6953K0982J4124j5834k6597K5973J2889r034J7111
8652D2848l5936J044P1688N93J4541j3751j891N5396J2437j3387J7542J8809M7430
8639B17363k2644p2930N238q898l750P206l7403l3809K0079j521K0174K7482J9446
8626A36033P0129M1078N6898P9634J31259K23987L62414J57965k15566k88388
8616G55443j79311j02401p9272r3798p1756n4973k7860J6074o600j0570J2743
8605A57719N6656J765l0222K0427P119k1562o8480j5726l041K1297Q288K1825
8593A56065L4254L5246P019M564k7417K322M2842j9061k9245M4678K6564O7065
$$ plain form
8581 344896 421293 484415 553234 731605 1141147 1758910 2267805 2108321 1544380 1066528
8571 1066528 699105 465553 385348 359113 325691 341676 326654 282488 261497 268447 261264
8560 261264 217653 174465 128263 96029 75917 58359 39890 76712 98082 66089 49526 70575
8548 70575 94850 118953 117277 100831 72166 53661 24192 39336 74897 69430 84875 140019
8536 140019 163689 226527 319838 474140 724147 1026259 1071194 839157 543061 380462
8526 380462 294513 252705 184996 129148 108774 109788 83215 25483 8788 18082 -5494 13842
8514 13842 30883 35722 19889 21220 45096 56662 62661 60882 21610 8818 26262 51286 75916
8501 75916 100414 59314 8226 -17363 -41027 -24533 -14926 -18977 -11572 -32920 -33102 4590 19240
$$ packed form
8581C44896P6397O3122O8819J78371M09542O17763N08895j59484n63941m77852
8571A066528l67423k33552q0205k6235l3422J5985j5022m4166k0991O950p183
8560B61264m3611m3188m6202l2234k0112j7558j8469L6822K1370l1993j6563K1049
8548G0575K4275K4103j676j6446k8665j8505k9469J5144L5561n467J5445N5144
8536A40019K3670O2838R3311J54302K50007L02112M4935k32037k96096j62599
8526C80462q5949m1808o7709n5848k0374J014k6573n7732j6695R294k3576J9336
8514A3842J7041M839j5833J331K3876J1566N999j779l9272j2792J7444K5024K4630
8501G5916K4498m1100n1088k5589k3664J6494R607m051P405k1348j82L7692J4650
$$ plain form
8488 19240 7861 -50288 -47901 -9812 1076 -2553 -15123 -39250 -59846 -26480 -7731 -19201
8476 -19201 1440 8674 23486 20054 2086 23878 25334 9022 35893 46943 27866 6816
8464 6816 16131 9906 -24272 -27265 6585 23980 -22795 -36809 -23636 -5434 45758 25982 -11826
8451 -11826 -9589 -1587 6921 -30408 -71906 -45807 -38553 -18695 23244 25587 29047 47214 42336
8438 42336 28834 -1735 -30431 -14542 10453 17857 17725 16840 -2177 17765 -14311 -39343 -24100
8425 -24100 -2426 36863 52608 40169 42105 51824 46872 67489 34750 13019 30114 22394 14352
8412 14352 13229 29364 -4183 -15261 -35087 -52701 447 51223 38941 17980 21071 3990
8400 3990 -35945 -59317 -60204 -66420 -82714 -70829 -55992 -54975 -59236 -49149 -29249 22069 1734
$$ packed form
8488A9240j1379n8149K387L8089J0888l629j2570k4127k0596L3366J8749j1470
8476a9201K0641P234J4812l432j7968K1792J456j6312K6871J1050j9077k1050
8464F816R315o225l4178k993L3850J7395m6775j4014J3173J8202N1192j9776l7808
8451a1826K237Q002Q508l7329m1498K6099P254J9858M1939K343L460J8167m878
8438D2336j3502l0569k8696J5889K4995P404j32q85j9017J9942l2076k5032J5243
8425b4100K1674L9289J5745j2439J936R719m952K0617l2739k1731J7095p720q042
8412A4352j123J6135l3547j1078j9826j7614N3148N0776j2282k0961L091j7081
8400C990l9935k3372q87o216j6294J1885J4837J017m261J0087J9900N1318k0335
$$ plain form
8387 1734 -25231 -37579 -59947 -8731 4977 21121 -230 35611 54748 47553 3423 -16799
8375 -16799 17912 45361 -11902 -94415 -84138 -33987 -769 2570 -2689 -14080 -18097 -18330 -25531
8362 -25531 -70432 -107062 -87901 -61130 -27554 -8151 -13420 8595 41861 17175 26803 27087 53175
8349 53175 45869 27099 20485 23514 62592 42664 29089 -12130 -46642 -41647 -34010 -12726 -29212
8336 -29212 -38300 -56162 -37562 -46697 -89476 -55847 -24393 8660 -1886 -11204 14839 13400 -924
8323 -924 -2340 14268 59680 52028 43970 40146 42064 52025 43180 92930 94438 62506 33129 52463
8309 52463 44165 -20070 -5391 -1624 -4692 21865 51731 23517 -21041 1299 19346 19235 -8451
8296 -8451 -17648 -39946 -33239 -14771 -57352 -41682 -4135 -5886 -31980 -34242 -2035 -10069 -25442
$$ packed form
8387A734k6965j2348k2368N1216J3708J6144k1351L5841J9137p195m4130k0222
8375a6799L4711K7449n7263q2513J0277N0151L3218L339n259j1391m017k33p201
8362b5531m4901l6630J9161K6771L3576J9403n269K2015L3266k4686R628K84K6088
8349E3175p306j8770o614L029L9078j9928j3575m1219l4512M995P637K1284j6486
8336b9212r088j7862J8600r135m2779L3629L1454L3053j0546r318K6043j439j4324
8323i24j416J6608M5412p652q058l824J918R961q845M9750J508l1932k9377J9334
8309E2463q298o4235J4679L767l068K6557K9866k8214m4558K2340J8047j11k7686
8296h451r197k2298O707J8468m2581J5670L7547j751k6094k262L2207q034j5373
$$ plain form
8283 -25442 -27323 -31178 -12766 12941 -2545 -44383 6395 67893 51842 14692 -31394 -39059
8271 -39059 24250 4694 -37836 -5982 84 27426 21876 -35354 -31359 11867 -10419 -23477
8259 -23477 -18577 -50333 -45507 -24520 -23684 14640 56817 42026 16548 7951 -1732 5205 -1936
8246 -1936 -23548 -41229 -30493 -9430 24669 47102 29084 36290 43373 59893 92060 28757
8234 28757 14926 38194 42320 11308 37093 79024 89208 66634 58655 5222 -2893 -17066
8222 -17066 -52871 -43779 -30922 -32920 -42314 -10408 33022 32531 -951 9820 12719 15818 10882
8209 10882 -14750 -2379 719 -12882 -11204 13200 26967 2843 -28776 -9657 -34198 -63330
8197 -63330 -31064 6887 8363 34069 62214 61521 55372 63292 30258 -33445 -80976 -15760 133
$$ packed form
8283b5442j881l855J8412K5707j5486m1838N0778O1498j6051l7150m6086p665
8271c9059O3309j9556m2530L1854O066K7342n550n7230L995M3226k2286j3058
8259b3477M900l1756M826K0987Q36L8324M2177j4791k5478q597r683O937p141
8246a936k1612j7681J0736K1063L4099K2433j8018P206P083J6520L2167o3303
8234B8757j3831K3268M126l1012K5785M1931J0184k2574p979n3433q115j4173
8222a7066l5805R092J2857j998r394L1906M3430m91l3482J0771K899L099m936
8209A0882k5632J2371L098j3601J678K4404J3767k4124l1619J9119k4541k9132
8197f3330L2266L7951J476K5706K8145o93o149P920l3034o3703m7531O5216J5893
$$ plain form
8184 133 -4438 -11422 -25485 -22846 4804 52436 43820 47504 59184 23990 51625 55846 79041
8171 79041 73006 20761 14092 15238 1827 -2804 9924 22283 56085 52773 29716 -1113 -38520
8158 -38520 -57708 -77596 -56277 -37356 -2469 27800 6005 4988 11063 13638 -14323 -14255 -32397
8145 -32397 -56188 -55079 -19443 -16149 -49803 -63238 -70914 -69696 -45830 -54815 -32576 10043 15770
8132 15770 -10737 -20769 -33793 -67341 -85865 -47605 9489 -42107 -88317 -33870 7077 24135
8120 24135 38099 11443 -5352 736 29196 41418 10129 -17579 838 35009 72263 48503
8108 48503 12555 32467 47659 46886 20246 18135 68471 69065 24224 8774 12614 6194 -6333
8095 -6333 -31551 -33292 -39715 -31912 -31097 -42004 -24032 -32553 -44751 -26836 -26610 8835 27892 33831
$$ packed form
8184A33m571o984j4063K639K7650M7632q616L684J1680l5194K7635M221K3195
8171G9041o035n2245o669J146j3411m631J2728J2359L3802l312k3057l0829l7407
8158c8520j9188j9888K1319J8921L4887L0269k1795j017O075K575k7961O8j8142
8145c2397k3791J109L5636L294l3654j3435p676J218K3866q985K2239M2619N727
8132A5770k6507j0032j3024l3548j8524L8260N7094n1596m6210N4447M0947J7058
8120B4135J3964k6656j6795O088K8460J2222l1289k7708J8417L4171L7254k3760
8108D8503l5948J9912J5192p73k6640k111N0336N94m4841j5450L840o420j2527
8095f333k5218j741o423P803Q15j0907J7972q521j2198J7915K26L5445J9057N939
$$ plain form
8081 33831 23110 26336 31791 28174 17139 -25028 -39189 -24032 15452 28243 32404 12311 -22097
8068 -22097 -36883 -26896 -28218 -13352 19895 22333 -23361 -30022 -13276 18356 45030 71456 41143
8055 41143 -23083 15191 35109 -2232 -24434 -28066 -5130 -4231 -3428 -26328 -8104 -23268 -40648
8042 -40648 -17262 -249 8062 -4743 11251 8535 -37771 -37569 15737 39305 45799 24856 -11373
8029 -11373 12747 12277 -27372 -63858 -94856 -95724 -81275 -51038 -5805 -31602 -29304 -17769 -54271
8016 -54271 -39374 13591 23014 41218 59856 49009 43765 -6596 -39649 -49547 -48712 -18587 12323
8003 12323 1408 2006 28774 57405 39910 29895 13686 17983 14967 -25046 -24168 36698 54287
7990 54287 66449 64799 17051 5033 32239 68574 74580 24002 -6594 -20167 -21210 -27952 -46680
$$ packed form
8081C3831j0721L226N455l617j1035m2167j4161J5157L9484J2791M161k0093l4408
8068b2097j4786R987j322J4866L3247K438m5694o661J6746L1632K6674K6426l0313
8055D1143o4226L8274J9918l7341k2202l632K2936Q99Q03k2900J8224j5164j7380
8042d0648K3386J7013Q311j2805J5994k716m6306K02N3306K3568O494k0943l6229
8029a1373K4120m70l9649l6486l0998q68J4449L0237M5233k5797K298J1535l6502
8016e4271J4897N2965R423J8204J8638j0847n244n0361l3053r898Q35L0125L0910
8003A2323j0915N98K6768K8631j7495j0015j6209M297l016m0013Q78O0866J7589
7990E4287J2162j650m7748j2018K7206L6335O006n0578l0596j3573j043o742j8728
$$ plain form
7977 -46680 -49126 6163 50124 57804 53671 79448 61175 72115 90768 85402 48692 27069 53200
7964 53200 43179 9943 18159 24078 49092 51979 32778 36301 22404 13415 20847 19685 14651
7951 14651 6208 -855 -25865 -30180 -7038 7041 16500 16878 1736 -6930 -24975 -12111 11872
7938 11872 5 -12491 -39821 -48623 -47982 -58429 -24775 20406 18132 32028 42457 29499 41436
7925 41436 29999 41628 45606 -10189 -65360 -28993 3406 -23079 1445 -10663 -40926 -59898
7913 -59898 -49228 -20669 22626 35228 30844 36905 51719 21835 56970 80032 74620 5610
7901 5610 -41385 -39209 -6128 17911 9235 12041 28609 -10980 -29948 -17284 -2981 -9693 3664
7888 3664 37631 28035 48436 63125 52645 -16404 -36631 4294 31776 66530 46598 8907
$$ packed form
7977d6680k446N5289M3961P680m133K5777j8273J0940J8653n366l6710k1623K6131
7964E3200j0021l3236Q216N919K5014K887j9201L523j3897q989P432j162n034
7951A4651q443p063k5010m315K3142J4079R459L78j5142q666j8045J2864K3983
7938A1872j1867j2496k7330q802O41j0447L3654M5181k274J3896J0429j2958J1937
7925D1436j1437J1629L978n5795n5171L6367L2399k6485K4524j2108l0263j8972
7913e9898J0670K8559M3295J2602m384O061J4814k9884L5135K3062n412o9010
7901E610m6995K176L3081K4039q676K806J6568l9589j8968J2664J4303o712J3357
7888C664L3967r596K0401J4689j0480o9049k0227M0925K7482L4754j9932l7691
$$ plain form
7876 8907 9775 19333 30224 18415 3771 11250 -23861 -15918 -30334 -46244 -18262 -28632 8564
7863 8564 -18039 -23191 -20472 -44007 -76524 -81913 -100270 -67462 -56210 -69590 -50931 -85517 -75776
7850 -75776 -68735 -43963 -33429 -60325 -46277 -2012 24063 40341 18456 -18423 -19318 -10885 -1744
7837 -1744 -37359 -25535 44152 69543 70792 65720 60179 28250 66861 77090 45677 50806 -2150
7824 -2150 -50310 -16486 -9756 -12170 -11597 -15367 -1243 47123 78748 28375 43241 57771 21920
7811 21920 7830 15198 19181 16065 29369 29887 -634 27504 47936 41149 22436 3916 19614
7798 19614 28146 37969 37124 47262 61308 74684 53988 10676 -2794 4203 2412 -6551 -3777
7785 -3777 31274 31150 2328 -18544 -24856 -45529 -44194 -66382 -48911 -30301 -21852 21061 29362
$$ packed form
7876H907Q68R558J0891j1809j4644P479l5111P943j4416j5910K7982j0370L7196
7863H564k6603n152K719k3535l2517n389j8357L2808J1252j3380J8659l4586R741
7850g5776P041K4772J0534k6896J4048M4265K6075J6278k1885l6879q95Q433R141
7837a744l5615J1824O9687K5391J249n072n541l1929L8611J0229l1413N129n2956
7824b150m8160L3824O730k414N73l770J4124M8366L1625n0373J4866J4530l5851
7811B1920j4090P368L983l116J3304N18l0521K8138K0432o787j8713j8520J5698
7798A9614Q532R823q45J0138J4046J3376k0696m3312j3470O997j791q963K774
7785c777L5051j24k8822k0872o312k0673J335k2188J7471J8610Q449M2913Q301
$$ plain form
7772 29362 45078 46356 28720 8969 27996 23131 -27998 -33997 -192 22396 -30684 -40051 -23199
7759 -23199 -21391 21581 55281 58790 56141 32245 11157 -13102 44564 49064 33300 25512 26703
7746 26703 8506 3433 -15614 -21941 -25406 -45315 -61597 -60539 -13861 -4344 -12141 -57793 -56131
7733 -56131 -32731 -44970 -27359 -2792 848 1393 25853 16866 -15159 -64458 -99157 -95256 -81484
7720 -81484 -59722 -43671 -66951 -55666 -20150 -35411 -72979 -51093 -8066 -17908 -38700 -45379
7708 -45379 -46306 -46652 -33470 -4030 305 6673 -10127 -6070 16701 22212 20532 13155 -7628 -24044
7694 -24044 -26665 -15971 27605 37749 43339 1805 -24514 -5152 21024 8019 15684 -13224
7682 -13224 -28878 -36198 -25395 -22039 1204 23060 24629 2090 -29255 -24937 -11173 -11985 -33400
$$ packed form
7772B9362J5716J278j7636j9751J9027m865n1129n999L3805K2588n3080r367J6852
7759b3199J808M2972L3700L509k649k3896k1088k4259N7666M500j5764p788J191
7746B6703j8197n073j9047o327l465j9909j6282J058M6678R517p797m5652J662
7733e6131K3400j2239J7611K4567L640N45K4460q987l2025m9299l4699L901J3772
7720h1484K1762J6051k3280J1285L5516j5261l7568K1886M3027r842k0792o679
7708d5379r27l46J3182K9440M335O368j6800M057K2771N511j680p377k0783j6416
7694b4044k621J0694M3576J0144N590m1534k6319J9362K6176j3005P665k8908
7682a3224j5654p320J0803L356K3243K1856J569k2539l1345M318J3764q12k1415
$$ plain form
7669 -33400 -59176 -43093 6415 42617 27152 5972 293 -21803 -49861 -44641 -62077 -57502
7657 -57502 -98927 -70378 -48312 -41067 -57078 -35673 -1385 12036 -34378 -65112 -82854 -94121
7645 -94121 -59645 -64753 -90021 -68854 -57313 -16046 -17332 -37995 -61220 -78778 -75536 -54269
7633 -54269 -60804 -80556 -119176 -129037 -76933 -40421 -58334 -82357 -52784 -7049 50092 53902
7621 53902 -14904 -41867 -50419 -47802 -35400 -19829 -49743 -69931 -50668 -10192 11946 -19694
7609 -19694 -3192 39632 11181 4849 -2393 15992 14841 -6449 12080 18107 -10760 -26347 -64598
7596 -64598 -86127 -70563 -3122 32819 -6092 -24104 -10549 -10447 -44252 -63618 -74125 -54210
7584 -54210 -4706 29687 41560 7438 40480 36458 51639 57064 22874 -2600 -23208 17335
$$ packed form
7669c3400k5776J6083M9508L6202j5465k1180n679k2096k8058N220j7436M575
7657e7502m1425K8549K2066P245j6011K1405L4288J3421m6414l0734j7742j1267
7645i4121L4476n108k5268K1167J1541M1267j286k0663k3225j7558L242K1267
7633e4269o535j9752l8620r861N2104L6512j7913k4023K9573M5735N7141L810
7621E3902o8806k6963q552K617J2402J5571k9914k0188J9263M0476K2138l1640
7609a9694J6502M2824k8451o332p242J8385j151k1290J8529O027k8867j5587l8251
7596f4598k1529J5564O7441L5941l8911j8012J3555J02l3805j9366j0507J9915
7584e4210M9504L4393J1873l4122L3042m022J5181N425l4190k5474k0608M0543
$$ plain form
7572 17335 19642 -31827 -63122 -45459 -17669 11888 27836 2164 13910 -7217 -13432 26979
7560 26979 44417 19979 21843 9456 166 -3073 22526 9495 -720 -11454 -32778 -5871
7548 -5871 2635 28251 48222 19280 -643 -12249 -3240 -1744 -2831 -2514 21483 55933 69337
7535 69337 50287 20973 -15786 -17003 -20758 -29453 -33855 -36937 -17067 4839 7164 -15198 -7706
7522 -7706 -31197 -68162 -93468 -118695 -100875 -102667 -108845 -99246 -83664 -66704 -43690 4549 12166
7509 12166 12201 -21281 -58920 -30361 -39430 -67528 -34059 -47183 -42312 -15979 -18346 -28557 -15777
7496 -15777 1827 -57470 -55214 -11010 19011 56861 46808 17147 -8162 -2168 -21560 -41666
7484 -41666 -33723 -34498 -14012 6596 6880 17147 15619 27605 57847 54799 9892 6129 -6519
$$ packed form
7572A7335K307n1469l1295J7663K7790K9557J5948k5672J1746k1127o215M0411
7560B6979J7438k4438J864j2387r290l239K5599j3031j0215j0734k1324K6907
7548e871Q506K5616J9971k8942j9923j1606R009J496j087L17K3997L4450J3404
7535F9337j9050k9314l6759j217l755q695m402l082J9870K1906K325k2362P492
7522g706k3491l6965k5306k5227J7820j792o178R599J5582J6960K3014M8239P617
7509A2166L5l3482l7639K8559r069k8098L3469j3124M871K6333k367j0211J2780
7496a5777J7604n9297K256M4204L0021L7850j0053k9661k5309N994j9392k0106
7484d1666P943p75K0486K0608K84J0267j528J1986L0242l048m4907l763j2648
$$ plain form
7471 -6519 -10735 -17213 -5541 20085 22543 50636 37060 7560 -12526 3711 40335 31204 22296
7458 22296 -14975 -20839 -16667 -43299 -30292 -5632 -16456 -7403 7379 -8693 -12528 -21207 -30207
7445 -30207 828 28078 16617 -12682 -50685 -18623 -24797 -9534 12490 41233 30040 8663
7433 8663 -26727 -52454 -26033 31100 33341 14639 3425 3261 22463 40886 24665 4506 -12634
7420 -12634 -4343 -11636 -12971 9109 -20442 -13712 -17701 -21175 -21204 -21312 -35458 -18982 13622 3580
7406 3580 -51661 -57181 -13635 21471 64417 114677 90392 57778 36776 -1862 -33899 -24872
7394 -24872 530 -3057 -11340 -25188 -36863 -45307 -51217 -12130 8298 24753 6968 6698 -14844
7381 -14844 25230 61876 68292 62639 25416 29622 29630 8699 -30095 -46901 -60533 -61262 -40705 -13680
$$ packed form
7471f519m216o478J1672K5626K458K8093j3576k9500k0086J6237L6624r131q908
7458B2296l7271n864M172k6632J3007K4660j0824R053J4782j6072l835q679r000
7445c0207L1035K7250j1461k9299l8003L2062o174J5263K2024K8743j1193k1377
7433H663l5390k5727K6421N7133K241j8702j1214j64J9202J8423j6221k0159j7140
7420a2634Q291p293j335K2080k9551O730l989l474k9j08j4146J6476L2604j0042
7406C580n5241n520M3546L5106M2946N0260k4285l2614k1002l8638l2037R027
7394b4872K5402l587q283j3848j1675q444n910L9087K0428J6455j7785k70k1542
7381a4844M0074L6646O416n653l7223M206Qk0931l8794j6806j3632p29K0557K7025
$$ plain form
7367 -13680 12445 -2714 27936 35825 12870 -9291 -10465 7707 25433 14709 4429 11783
7355 11783 26056 55335 101950 71780 49185 35990 45812 28599 819 26908 38216 32140
7343 32140 35238 21497 -4920 -23368 -6824 -872 -15843 -40679 -19279 41797 66885 64808
7331 64808 11893 -2027 -20470 -32215 -35909 -15620 8282 23757 6479 -42511 -80516 -82931
7319 -82931 -67921 -38395 7776 26124 28313 20752 15777 -19958 -24116 16442 33774 33325 47981
7306 47981 44500 66003 30901 55308 76070 26853 15422 44064 39767 54208 20727 198
7294 198 25526 9820 -20129 2170 -47086 -61017 -33242 -5527 2549 -6813 -37606 -47090 -582
7281 -582 21559 36272 57485 59931 73699 60882 -4032 -71853 -115522 -75192 -12470 25563
$$ packed form
7367a3680K6125j5159L0650P889k2955k2161j174J8172J7726j0724j0280P354
7355A1783J4273K9279M6615l0170k2595j3195R822j7213k7780K6089J1308o076
7343C2140L098j3741k6417j8448J6544N952j4971k4836K1400O1076K5088k077
7331F4808n2915j3920j8443j1745l694K0289K3902J5475j7278m8990l8005k415
7319h2931J5010K9526M6171J8348K189p561m975l5735m158M0558J7332m49J4656
7306D7981l481K1503l5102K4407K0762m9217j1431K8642m297J4441l3481k0529
7294A98K5328j5706k9949K2299m9256j3931K7775K7715Q076r362l0793r484M6508
7281e82K2141J4713K1213K446J3768j2817o4914o7821m3669M0330O2722L8033
$$ plain form
7269 25563 44939 8183 -10759 31342 40385 1833 -32853 -62399 -51585 5485 -1200 -13671
7257 -13671 8236 42407 91511 69007 61216 114014 84824 57127 -6503 -40265 -30564 -6638
7245 -6638 -74979 -96326 -65533 -20973 6625 -2598 -9234 -2864 17481 3458 9925 38082 32094
7232 32094 -15517 -20808 -51336 -23588 -9994 -16327 -10437 24235 29235 5782 -36971 -48015 -13494
7219 -13494 -7293 28495 34711 10475 -7160 30038 35502 29947 -448 33590 55222 49738 36796
7206 36796 19629 -15337 -36209 -51536 -20474 -2548 -30038 -40308 -29804 -40283 -53398 -69844
7194 -69844 -77140 -34308 33154 28708 -6248 -35711 -39845 -47126 -42980 3328 27462 41427 64554
7181 64554 50512 37489 22431 1432 11895 29104 -5088 -56284 -63062 -47196 -33141 -893
$$ packed form
7269B5563J9376l6756j8942M2101R043l8552l4686k9546J0814N7070o685j2471
7257a3671K1907L4171M9104k2504p791N2798k9190k7697o3630l3762R701K3926
7245f638o8341k1347L0793M4560K7598r223o636O370K0345j4023O467K8157n988
7232C2094m7611n291l0528K7748J3594o333N890L4672N000k3453m2753j1044L4521
7219a3494O201L5788O216k4236j7635L7198N464n555l0395L4038K1632n484j2942
7206C6796j7167l4966k0872j5327L1062J7926k7490j0270J0504j0479j3115j6446
7194f9844p296M2832O7462m446l4956k9463m134p281M146M6308K4134J3965K3127
7181F4554j4042j3023j5058k0999J0463J7209l4192n1196o778J5866J4055L2248
$$ plain form
7169 -893 -3318 -21688 -35208 -20579 -7014 25919 40353 69594 64499 61911 67806 33549 5924
7156 5924 5852 42557 46641 3612 -3420 -22465 -57279 -81495 -64743 -18652 10261 14321 4128
7143 4128 28320 61980 38647 28393 6719 1953 45076 69373 67232 40381 36339 38094 39905
7130 39905 38762 49228 13609 -6841 21683 42388 31561 -6749 -23442 -15079 -2858 -5420
7118 -5420 -7642 7166 41019 -4031 -27438 -57744 -48989 -25005 -1610 9123 -18107 -38590
7106 -38590 -20244 14198 29881 28758 -21343 -54134 -52866 -39267 -43463 -47590 -63060 -100558 -82652
7093 -82652 -75111 -53861 -34264 -49532 -50170 -60754 -61369 -49413 -60644 -41619 7846 -16319 -22182
7080 -22182 -43670 -48479 -66837 -49789 -51589 -14437 9376 -6927 -26625 -59233 -89697 -63223
$$ packed form
7169h93k425j8370j3520J4629J3565L2933J4434K9241n095k588N895l4257k7625
7156E924p2L6705M084m3029p032j9045l4814k4216J6752M6091K8913M060j0193
7143D128K4192L3660k3333j0254k1674m766M3123K4297k141k6851m042J755J811
7130C9905j143J0466l5619k0450K8524K0705j0827l8310j6693Q363J2221k562
7118e420k222J4808L3853m5050k3407l0306Q755K3984K3395J0733k7230k0483
7106c8590J8346L4442J5683j123n0101l2791J268J3599m196m127j5470l7498J7906
7093h2652P541K1250J9597j5268o38j0584o15J1956j1231J9025M9465k4165n863
7080b2182k1488m809j8358J7048j800L7152K3813j6303j9698l2608l0464K6474
$$ plain form
7068 -63223 -55109 -86497 -48297 -38705 -53182 -33046 -74952 -75679 -75800 -85331 -74233 -70386 -76664 -78615
7054 -78615 -86361 -80943 -77665 -46255 -26745 3932 -16807 4227 4166 2555 1140 -2559 9548 19463
7040 19463 4751 -423 24701 15657 -15439 -6083 -25713 -37692 -15369 22757 57494 38097
7028 38097 30330 10679 -4376 -7519 4361 16964 -4910 -23593 -46424 -35629 -36824 -70688
7016 -70688 -69623 -94365 -91845 -51038 -926 27603 11392 48311 54494 -5671 -48827 2519
7004 2519 53997 53592 19264 -37023 -6587 35421 30603 39175 13745 4254 -3156 2805 1783 9846
6990 9846 7504 2314 11542 -4457 9417 16404 42090 64192 47857 32221 32484 30802 -13563
6977 -13563 8041 27344 39439 3671 -36262 -31321 -7820 -14239 -15792 -26095 -37384 -28898 -39700
$$ packed form
7068f3223Q114l1388L8200R592j4477K0136m1906p27j21r531J1098L847o278j951
7054g8615p746N418L278L1410J9510L0677k0739K1034o1j611j415l699J2107R915
7040A9463j4712n174K5124r044l1096R356j9630j1979K2323L8126L4737j9397
7028C8097p767j9651j5055l143J1880J2603k1874j8683k2831J0795j195l3864
7016g0688J065k4742K520M0807N0112K8529j6211L6919O183o0165m3156N1346
7004B519N1478m05l4328n6287L0436M2008m818Q572k5430r491p410N961j022Q063
6990I846k342n190R228j5999J3874O987K5686K2102j6335j5636K63j682m4365
6977a3563K1604J9303J2095l5768l9933M941K3501o419j553j0303j1289Q486j0802
$$ plain form
6964 -39700 -10512 -18275 -8715 -22225 -13581 8415 16778 9386 7672 -17350 -3820 -627 8041
6951 8041 18111 32132 8675 -3703 -14057 -39883 -61235 -48330 -10620 7907 40766 -2624
6939 -2624 2694 45839 19938 46598 25638 -3988 -1250 -16135 -36200 -37438 -12164 9829 -18662
6926 -18662 -20783 -23101 2107 1095 -29682 -3801 -7989 20154 33078 42874 6701 -29458 -58756
6913 -58756 -49200 -20209 -17308 -32997 -30533 -34647 -49280 -45397 -27476 -9783 18012 -19738 -28967
6900 -28967 -33941 -54895 -48388 -51263 -38728 -42039 -22011 -27847 -57880 -18624 8844 16669 17042
6887 17042 -1545 -22698 -30176 -36117 -38229 -6714 12474 14877 1424 -4940 -44861 -23386 8328
6874 8328 38430 77081 68555 59581 18345 15542 -15553 -32823 -44624 -23731 -5859 -17123 26219
$$ packed form
6964c9700K9188p763R560j3510Q644K1996Q363p392j714k5022J3530L193Q668
6951H041J0070J4021k3457j2378j0354k5826k1352J2905L7710J8527L2859m3390
6939b624N318M3145k5901K6660k0960k9626K738j4885k0065j238K5274K1993k8491
6926a8662k121k318K5208j012l0777K5881m188K8143J2924R796l6173l6159k9298
6913e8756R556K8991K901j5689K464m114j4633L883J7921J7693K7795l7750r229
6900b8967m974k0954O507k875J2535l311K0028n836l0033L9256K7468P825L73
6887A7042j8587k1153p478n941k112L1515J9188K403j3453o364l9921K1475L1714
6874H328L0102L8651q526q974m1236k803l1095j7270j1801K0893J7872j1264M3342
$$ plain form
6861 26219 71897 42408 -9879 -84924 -81242 -67868 -32636 8386 40553 34432 -44768 -54587
6849 -54587 -44779 -54856 -45501 -55201 -50192 -46116 15578 15267 -39905 -40821 -11923 -20549 -23039 -22278
6835 -22278 4941 38599 15092 14616 22103 28385 40488 39141 40147 -36844 -60479 -23596 -3114
6822 -3114 -44535 -33046 -24660 29892 40272 5213 -12148 -36718 -49433 -45883 14960 9096 -9232
6809 -9232 13424 18288 15687 23414 45672 53413 32045 7530 -21110 -30705 5759 42803 1827
6796 1827 -7382 22209 14750 856 -37449 -50351 -52846 -67859 -66183 -102181 -128841 -107023 -55562
6783 -55562 -17592 -13004 -27480 -36237 -38754 -45649 -41305 -15905 -24924 -39540 -44827 -26272 -19282
6770 -19282 23770 40089 10399 -15736 -7725 -23111 -33721 -5383 -8545 -35763 -50785 -34083
$$ packed form
6861B6219M5678k9489n2287p5045L682J3374L5232M1022L2167o121p9200r819
6849e4587R808j0077R355r700N009M076O1694l11n5172r16K8898q626k490P61
6835b2278K7219L3658k3507m76P487O282J2103j347J006p6991k3635L6883K0482
6822c114m1421J1489Q386N4552J0380l5059j7361k4570j2715L550O0843n864j8328
6809i232K2656M864k601P727K2258P741k1368k4515k8640r595L6464L7044m0976
6796A827r209K9591p459j3894l8305j2902k495j5013J676l5998k6660K1818N1461
6783e5562L7970M588j4476q757k517o895M344K5400r019j4616n287J8555O990
6770a9282M3052J6319k9690k6135Q011j5386j0610K8338l162k7218j5022J6702
$$ plain form
6758 -34083 -66574 -69548 -64193 -63938 -21689 23653 49406 -6996 -45326 -40740 -54185 -45154 -16341
6745 -16341 -6362 -6832 -8984 -46154 -43903 -14743 22362 7750 -63759 -19090 30220 17527 -38968
6732 -38968 -34756 -11548 -7462 -53703 -90588 -68510 -73113 -90877 -75993 -53569 -11580 725
6720 725 -44280 -56353 -27971 23624 31495 -9902 -9714 -21533 -23317 -11584 -3480 21603 24990
6707 24990 20366 29797 37335 -7206 -40895 -50145 -28308 11806 17985 26146 -7159 -15892 -18160
6694 -18160 -21067 11797 44021 36862 17048 -11546 -15590 5352 10370 13136 -3508 -9123 -26039
6681 -26039 -57925 -77103 -88177 -77161 18460 44866 2675 -9916 -36656 -30810 -12053 28429
6669 28429 68676 85935 50749 38165 13021 -5281 18812 68019 40461 4747 -8672 -22313
$$ packed form
6758c4083l2491k974N355K55M2249M5342K5753n6402l8330M586j3445R031K8813
6745a6341R979m70k152l7170K251K9160L7105j4612p1509M4669M9310j2693n6495
6732c8968M212K3208M086m6241l6885K2078m603j7764J4884K2424M1989J2305
6720G25m5005j2073K8382N1595P871m1397J88j1819j784J1733Q104K5083L387
6707B4990m624R431P538m4541l3689r250K1837M0114O179Q161l3305q733k268
6694a8160k907L2864L2224p159j9814k8594m044K0942N018K766j6644n615j6916
6681b6039l1886j9178j1074J1016R5621K6406m2191j2591k6740N846J8757M0482
6669B8429M0247J7259l5186j2584k5144j8302K4093M9207k7558l5714j3419j3641
$$ plain form
6657 -22313 -6631 -4856 -8136 -63 16284 -5447 21163 44900 54281 33950 26098 46631 45584
6644 45584 9633 -36850 -58998 10433 60076 13558 -15324 -40773 -33100 -18835 590 41707
6632 41707 28518 2616 -16120 -11674 4405 8568 -7385 2060 15313 74023 69813 853 -57086
6619 -57086 -58553 -22956 -18968 -51096 -51438 -7048 7468 24202 15006 24597 -16884 -73390 -64581
6606 -64581 -38781 -948 -8078 -26494 -59068 -18513 -41318 -77060 -70690 -56903 -51724 -25810
6594 -25810 2355 11388 4690 755 22045 17400 -1744 -24825 -37172 -30141 -2794 20078 22382
6581 22382 27346 24785 16215 -2020 -22029 -17767 12724 10975 3326 -15339 -46489 -61280 -64987
6568 -64987 -37870 -15022 -36170 -32230 -27201 -39507 -47330 -65606 -83171 -92491 -82674 -53257 -34350
$$ packed form
6657b2313J5682J775l280Q073J6347k1731K6610K3737R381k0331p852K0533j047
6644D5584l5951m6483k2148O9431M9643m6518k8882k5449P673J4265J9425M1117
6632D1707j3189k5902j8736M446J6079M163j5953R445J3253N8710m210o8960n7939
6619e7086j467L5597L988l2128l42M4390J4516J6734r196R591m1481n6506Q809
6606f4581K5800L7833p130j8416l2574M0555k2805l5742O370J3787N179K5914
6594b5810K8165R033o698l935K1290m645j9144k3081j2347P031K7347K2872K304
6581B2382M964k561q570j8235k0009M262L0491j749p649j8665l1150j4791l707
6568f4987K7117K2848k1148L940N029j2306p823j8276j7565r320R817K9417J8907
$$ plain form
6555 -34350 -14601 -17572 -26501 -2923 11094 34622 18223 37207 65085 71574 1089 -22531
6543 -22531 -7885 3712 -28412 -80726 -152919 -126358 -51097 -38851 -77299 -44806 -12504 30111
6531 30111 32902 19827 12738 -3504 6233 9385 7986 12816 30336 15082 7131 16517 39024
6518 39024 43584 30329 44292 66804 23926 4330 -12192 -15454 25051 61784 45093 31296
6506 31296 40430 -8953 -28695 -28418 -16554 -34032 -52301 -16651 4018 17413 33127 598
6494 598 -5842 -7289 13748 17755 -363 -25950 18706 25680 50606 34659 33708 -8910 -34944
6481 -34944 -8542 -4302 -5905 29871 28335 21457 26869 48478 76623 43028 15937 14503 -8517
6468 -8517 -67738 -81753 -95496 -97091 -90471 -41693 26726 20004 -17637 -73442 -44802 4931 3293
$$ packed form
6555c4350J9749k971q929K3578J4017K3528j6399J8984K7878O489p0485k3620
6543b2531J4646J1597l2124n2314p2193K6561P5261J2246l8448L2493L2302M2615
6531C0111K791j3075p089j6242R737L152j399M830J7520j5254p951R386K2507
6518C9024M560j3255J3963K2512m2878j9596j6522l262M0505L6733j6691j3797
6506C1296R134m9383j9742K77J1864j7478j8269L5650K0669J3395J5714l2529
6494E98o440j447K1037M007j8118k5587M4656O974K4926j5947r51m2618k6034
6481c4944K6402M240j603L5776j536o878N412K1609K8145l3595k7091j434k3020
6468h517n9221j4015j3743j595O620M8778O8419o722l7641n5805K8640M9733j638
$$ plain form
6455 3293 -27894 -14754 -28215 -69753 -65679 -49448 -54982 -41005 -57354 -71595 -45297 -34646
6443 -34646 -43134 -31086 32221 70746 49346 -2922 -29674 -36177 -6925 20807 23118 41112
6431 41112 51182 40370 44889 15719 -34019 -49485 -29219 -5206 8176 -7600 -32515 -50639
6419 -50639 -79968 -73614 -36535 -6796 -416 -23516 -30414 8597 -1443 -34655 -36907 -25333 -7523
6406 -7523 8896 38089 51320 53503 7041 -27146 -21006 -25514 -50961 -64168 -61857 -36984 -14281
6393 -14281 -2724 15156 52657 33576 14475 -6561 -49601 -68300 -11501 46652 13661 -26208
6381 -26208 -25588 -14849 -25661 -2653 -17677 -47506 -32469 -9345 28898 10567 -16735 -53941
6369 -53941 -44545 -14663 4912 2623 10695 26532 39722 37176 172 -17515 -21069 12768 -1136
$$ packed form
6455C293l1187J3140j3461m1538M074J6231n534J3977j6349j4241K6298J0651
6443c4646q488J2048O3307L8525k1400n2268k6752o503K9252K7732K311J7994
6431D1112J0070j0812M519k9170m9738j5466K0266K4013J3382j5776k4915j8124
6419e0639k9329O354L7079K9739O380k3100o898L9011j0040l3212k252J1574J7810
6406g523J6419K9193J3231K183m6462l4187O140m508k5447j3207K311K4873K2703
6393a4281J1557J7880L7501j9081j9101k1036m3040j8699N6799N8153l2991l9869
6381b6208O20J0739j0812K3008j5024k9829J5037K3124L8243j8331k7302l7206
6369e3941R396K9882J9575k289Q072J5837J3190k546l7004j7687l554L3837j3904
$$ plain form
6356 -1136 -1523 14884 18065 14453 17889 28464 26595 36181 35569 41427 53128 55565 46766 49109 68918
6341 68918 64037 46909 59119 45405 31820 27208 25924 -719 -44205 -29015 7216 32710
6329 32710 12504 -18387 -22485 -20143 -8843 -5126 1255 5395 64658 70214 40946 14744 12665
6316 12665 4878 21676 61709 65479 40043 56076 60836 -239 -34465 -43613 -72008 -64055 -1751
6303 -1751 -3192 -9861 24536 29273 -33399 -62954 -54545 -11085 7304 10129 30817 33179 31020
6290 31020 33392 13038 22755 90487 108093 63564 -16235 -58646 -64477 -86425 -118228 -76798
6278 -76798 -31813 -37769 -41905 -37553 -24624 -18267 13083 18602 11168 50520 77920 32277 29152
6265 29152 21829 19638 20853 -13534 -51789 -113662 -93380 -45716 -41142 -26177 -34431 -48530 -22621
$$ packed form
6356a136l87J6407L181l612L436J0575j869R586o12N858J1701K437q799K343J9809
6341F8918m881j7128J2210j3714j3585m612j284k6643m3486J5190L6231K5494
6329C2710k0206l0891m098K342J1300L717O381M140N9263N556k9268k6202k079
6316A2665p787J6798M0033L770k5436J6033M760o1075l4226r148k8395P953O2304
6303a751j441o669L4397M737o2672k9555Q409M3460J8389K825K0688K362k159
6290C1020K372k0354R717O7732J7606m4529p9799m2411n831k1948l1803M1430
6278g6798M4985n956m136M352J2929O357L1350N519p434L9352K7400m5643l125
6265B9152p323k191J215l4387l8255o1873K0282M7664M574J4965q254j4099K5909
$$ plain form
6252 -22621 -3214 8565 26141 18213 7029 -38402 -92475 -70614 -38183 -34509 -58382 -55569
6240 -55569 -29736 -30195 -38842 -10077 4209 -7120 8417 44049 51490 23255 22496 40894 53956
6227 53956 45445 39267 18932 -24818 -37577 -49859 -66409 -18405 -2806 -13718 -16956 -10055 -14389
6214 -14389 -39628 -19857 -10498 -17599 -33483 -18557 -26150 5180 31275 11439 53871 61437 42586
6201 42586 16845 -30256 -71831 -50972 -58422 -83544 -75556 -40396 -25803 -9758 7951 -12129
6189 -12129 -41659 -43489 -37023 -33520 -34918 -920 -5101 -18160 -22295 -12715 -14424 -20763 10851 96564
6175 96564 102158 73243 50240 26206 25370 17721 43336 29770 2807 -10227 -10182 18020 24976
6162 24976 6961 -64263 -80925 -57194 -62838 -44416 -36736 -43383 4072 8037 -8843 -43 -22028
$$ packed form
6252b2621J9407J1779J7576p928j1184m5431n4073K1861L2431L674k3873K813
6240e5569K5833m59q647K8765J4286j1329J5537L5632P441k8235p59J8398J3062
6227E3956q511o178k0335m3750j2759j2282j6550M8004J5599j0912l238O901m334
6214a4389k5239J9771R359p101j5884J4926p593L1330K6095j9836M2432P566j8851
6201D2586k5741m7101m1575K0859p450k5122P988L5160J4593J6045J7709k0080
6189a2129k9530j830O466L503j398L3998m181j3059m135R580j709o339L1614Q5713
6175I6564N594k8915k3003k4034q36p649K5615j3566k6963j3034M5K8202O956
6162B4976j8015p1224j6662K3731n644J8422P680o647M7455L965j6880Q800k1985
$$ plain form
6149 -22028 -19138 10669 6987 20624 64834 82972 93222 89183 77185 49610 -19335 -5683
6137 -5683 -1951 -31717 -31822 -69197 -20301 8612 8711 18183 2665 -27646 -41410 -84157 -106575
6124 -106575 -41397 -601 -6345 -18985 16087 25781 19288 17242 18231 -21483 -27461 -26657 32614
6111 32614 83351 79517 65695 22255 -11352 -21692 -25866 -65381 -11533 56165 71177 25881
6099 25881 14303 44178 18590 -3113 -42441 -41945 -39313 -25721 4574 15958 3222 6356 5446
6086 5446 -7713 17613 3625 -47213 -15801 16820 40264 29804 -2822 -13042 -87 -22594
6074 -22594 -28015 -313 4118 -8740 5822 30029 -1706 -8301 24838 -7729 -17293 23045 37182
6061 37182 35488 251 -930 -6098 23075 26415 -6825 -40163 -33936 -17088 -66819 -88470 -53926
$$ packed form
6149b2028K890K9807l682J3637M4210J8138J0250m039j1998k7575o8945J3652
6137e683L732k9766j05l7375M8896K8913R9R472j5518l0311j3764m2747k2418
6124a06575O5178M0796n744j2640L5072R694o493k046R89l9714n978Q04N9271
6111C2614N0737l834j3822m3440l3607j0340m174l9515N3848O7698J5012m5296
6099B5881j1578K9875k5588k1703l9328M96K632J3592L0295J1384j2736L134r10
6086E446j3159K5326j3988n0838L1412L2621K3444j0460l2626j0220J2955k2507
6074b2594n421K7702M431j2858J4562K4207l1735o595L3139l2567r564M0338J4137
6061C7182j694l5237j181n168K9173L340l3240l3338O227J6848m9731k1651L4544
$$ plain form
6048 -53926 -14788 -43431 -55222 -27914 -28066 -3186 -23367 -19288 1037 -4063 31271 46172 10876
6035 10876 -10453 -2076 25375 36886 41510 33036 44405 -8071 -63616 -56194 -6727 22625 41669
6022 41669 36714 2249 6733 25222 23608 -9907 -17282 4183 30066 -25403 -13351 -10838 -23876
6009 -23876 -37894 -37878 -69181 -75290 -49982 -27792 -30428 -20037 -22028 -15712 -10845 -21363 -10163
5996 -10163 -29323 -48272 -49465 -23323 -12990 -10600 -30608 -30425 1116 26016 42891 20017 6139
5983 6139 25776 7646 20170 38811 43905 32619 14881 -21213 -18107 18805 -9875 11443
5971 11443 -10007 -65047 -102482 -68091 -41503 -48690 -40534 -8593 -5931 -21446 -26705 -23306 41863
5958 41863 47070 23007 4179 -21069 -16850 -20554 -20815 -1220 -14584 -10493 -30034 -62026 -57218
$$ packed form
6048e3926L9138k8643j1791K7308j52K4880k0181M079K0325n100L5334J4901l5296
6035A0876k1329Q377K7451J1511M624q474J1369n2476n5545P422M9467K9352J9044
6022D1669m955l4465M484J8489j614l3515p375K1465K5883n5469J2052K513j3038
6009b3876j4018J6l1303o109K5308K2190k636J0391j991O316M867j0518J1200
5996a0163j9160j8949j193K6142J0333K390k0008J83L1541K4900J6875k2874j3878
5983F139J9637j8130J2524J8641N094j1286j7738l6094L106L6912k8680K1318
5971A1443k1450n5040l7435L4391K6588p187Q156L1941K662j5515n259L399O5169
5958D1863N207k4063j8828k5248M219l704k61J9595j3364M091j9541l1992M808
$$ plain form
5945 -57218 -14951 -37656 -36279 14678 11737 2840 -934 -7528 -34783 -26261 7203 29892 16280
5932 16280 -3737 -36687 -59380 -47049 -65201 -36659 -51353 -76560 -42026 -26820 -15894 16529
5920 16529 24546 3886 -9885 -10805 -27431 -27803 -9193 2556 9629 44531 42811 6210 18643
5907 18643 -17632 -46281 -42050 -13612 5736 -2757 6558 2282 14628 19333 41593 67711 43085
5894 43085 -20496 -53752 -36276 -24671 -8925 3756 6733 48198 73100 74764 42533 57959
5882 57959 19510 -8789 17650 58264 7354 -4590 23435 21620 35808 41093 21843 -23793
5870 -23793 -33214 -10153 -12253 -14917 16999 24201 12284 22797 13573 -1907 7724 21325 13894
5857 13894 -6808 332 -13466 -26583 -15841 -22449 -37685 -34424 -37270 -38223 -33927 -40801 -22325
$$ packed form
5945e7218M2267k2705J377N0957k941q897l774o594k7255Q522L3464K2689j3612
5932A6280k0017l2950k2693J2331j8152K8542j4694k5207L4534J5206J0926L2423
5920A6529Q017k0660j3771r20j6626l72J8610J1749P073L4902j720l6601J2433
5907A8643l6275k8649M231K8438J9348q493R315m276J2346M705K2260K6118k4626
5894D3085o3581l3256J7476J1605J5746J2681K977M1465K4902J664l2231J5426
5882E7959l8449k8299K6439M0614n0910j1944K8025j815J4188N285j9250m5636
5870b3793r421K3061k100k664L1916P202j1917J0513r224j5480R631J3601p431
5857A3894k0702P140j3798j3117J0742o608j5236L261k846r53M296o874J8476
$$ plain form
5844 -22325 -3705 16074 28510 25830 24007 12291 3415 -8361 -13679 -23010 -32844 -40088 -11463
5831 -11463 26812 25200 -2375 -22988 -52981 -26391 -17736 -50384 -19896 -5731 -42629 -35151
5819 -35151 4235 28010 11754 -27613 -26123 -7467 1757 -12219 -3661 -15127 -31430 -27347 -13679
5806 -13679 3121 16783 -27732 -36156 -38685 2740 3867 196 -19053 -42045 -15852 19637 31090
5793 31090 32548 24520 -11549 -22057 7570 9313 32512 -16980 -35284 -44243 -274 21101 26426
5780 26426 16621 24083 15233 1391 -30485 -30771 -39594 -15519 6818 26533 6579 -17680 -43109
5767 -43109 -60880 -63771 -60599 -76147 -45944 -28607 -9848 -7474 -948 11812 -21146 -47747 -74178
5754 -74178 -72256 -76673 -106189 -73725 -27772 -9144 -18036 -19328 5749 -27662 -25974 -40370 -61528
$$ packed form
5844b2325J8620J9779J2436k680j823j1716q876j1776n318r331r834p244K8625
5831a1463L8275j612k7575k0613k9993K6590Q655l2648L0488J4165l6898P478
5819c5151L9386K3775j6256l9367J490J8656R224j3976Q558j1466j6303M083J3668
5806a3679J6800J3662m4515q424k529M1425J127l671j9249k2992K6193L5489J1453
5793C1090J458q028l6069j0508K9627J743K3199m9492j8304q959M3969K1375N325
5780B6426r805P462q850j3842l1876k86q823K4075K2337J9715j9954k4259k5429
5767d3109j7771k891L172j5548L0203J7337J8759K374O526J2760l2958k6601k6431
5754g4178J922m417k9516L2464M5953J8628q892j292K5077l3411J688j4396k1158
$$ plain form
5741 -61528 -59754 -51544 -61624 -48473 -26555 -25255 -13788 274 -30302 -34388 -5061 -53 -24251
5728 -24251 -49796 -55004 -54193 -48611 -12160 3193 -10265 4057 8737 -20737 -19221 -18079 -38907
5715 -38907 -7552 -21385 -27770 -27489 -24613 -19467 -14996 -19432 -22813 -40570 -21810 5123 -13068
5702 -13068 -52055 -47153 -24129 11777 14966 -7199 14901 69936 43688 8833 -3842 -12811
5690 -12811 -44881 -11890 -23678 -20391 -43288 -43515 -70367 -63104 -66886 -77038 -54888 -63343 -44061
5677 -44061 -52193 -61989 -61488 -38484 -41331 -34206 -21010 -11320 -32240 -39673 -19888 7686 23396
5664 23396 19704 67914 93235 96738 86980 83300 68754 33315 -29365 -64517 -60420 -47575 -47426
5651 -47426 -43467 -34697 26848 53837 54798 34027 17191 4138 29097 1760 -14648 -5827 -7119
$$ packed form
5741f1528J774Q210j0080J3151K1918J300J1467J4062l0576m086K9327N008k4198
5728b4251k5545n208Q11N582L6451J5353j3458J4322M680k9474J516J142k0828
5715c8907L1355j3833o385K81K876N146M471m436l381j7757J8760K6933j8191
5702a3068l8987M902K3024L5906L189k2165K2100N5035k6248l4855j2675q969
5690a2811l2070L2991j1788L287k2897k27k6852P263l782j0152K2150q455J9282
5677d4061q132r796N01K3004k847P125J3196R690k0920p433J9785K7574J5710
5664B3396l692M8210K5321L503r758l680j4546l5439o2680l5152M097J2845J49
5651d7426L959Q770O1545K6989R61k0771j6836j3053K4959k7337j6408Q821j292
$$ plain form
5638 -7119 -39026 -40213 -36640 -31413 -8524 -33823 -28361 -2164 13544 3806 14275 34714 54345
5625 54345 41673 38359 20195 13170 -24913 -14354 -11467 23998 37677 -8459 18674 54771
5613 54771 47825 2183 -13131 38259 26937 24864 49241 36843 34313 37960 40494 26600 64784
5600 64784 83426 47454 -3074 3193 15537 27051 36951 26770 16092 18054 30218 84268
5588 84268 66745 14587 5217 -12836 -32886 -39187 -61872 -45195 -31315 2310 -7865 -7622 18432
5575 18432 10312 13052 -4708 -21333 4941 49081 38589 -17538 5141 6272 27900 14205
5563 14205 14527 -11603 -2702 17196 40094 2868 -39199 -80102 -56148 -36214 -3425 5679 -7544
5550 -7544 -24342 4356 -39651 -86651 -117081 -64692 -42850 -20403 -2658 -26566 -22743 -40255
$$ packed form
5638g119l1907j187L573N227K2889k5299N462K6197J5708r738J0469K0439J9631
5625E4345j2672l314j8164p025l8083J0559K887L5465J3679m6136K7133L6097
5613E4771o946m5642j5314N1390j1322k073K4377j2398k530L647K534j3894L8184
5600F4784J8642l5972n0528O267J2344J1514R900j0181j0678J962J2164N4050
5588H4268j7523n2158r370j8053k0050o301k2685J6677J3880L3625j0175K43K6054
5575A8432q120K740j7760j6625K6274M4140j0492n6127K2679J131K1628j3695
5563A4205L22k6130Q901J9898K2898l7226m2067m0903K3954J9934L2789R104j3223
5550g544j6798K8698m4007m7000l0430N2389K1842K2447J7745k3908L823j7512
$$ plain form
5538 -40255 -51951 -12289 -4540 5059 32759 50885 -33703 -60165 -50697 -17024 -36298 -15409
5526 -15409 7500 6180 -592 -7005 2834 19418 61143 52771 -18797 -20654 -35375 -36327 -65568
5513 -65568 -86302 -74191 -51583 -24356 -58797 -106200 -71355 -65043 -87190 -80306 -77208 -69586 -70897
5500 -70897 -23385 -19102 -42174 -14315 26978 7443 8060 -34198 -34932 -4101 58563 61510 41703
5487 41703 6608 42351 5165 -4354 -35007 -36540 11572 20821 -9359 3887 31050 26568 46897
5474 46897 36928 13032 6511 -5754 -19304 -39561 -44919 -60382 -43166 -16812 299 24287
5462 24287 48384 17559 -8274 2541 21432 -13247 -37806 -60680 -55169 -31441 -27566 -16660
5450 -16660 -34873 -46293 -32315 8486 41543 390 3578 -19038 4429 9829 -14706 -34657
$$ packed form
5538d0255j1696L9662P749R599K7700J8126q4588k6462R468L3673j9274K0889
5526a5409K2909j320o772o413R839J6584M1725q372p1568j857j4721r52k9241
5513f5568k0734J2111K2608K7227l4441m7403L4845O312k2147O884L098P622j311
5500g0897M7512M283k3072K7859M1293j9535O17m2258p34L0831O2664K947j9807
5487D1703l5095L5743l7186r519l0653j533M8112R249l0180J3246K7163m482K0329
5474D6897r969k3896o521j2265j3550k0257n358j5463J7216K6354J7111K3988
5462B4287K4097l0825k5833J0815J8891l4679k4559k2874N511K3728L875J0906
5450a6660j8213j1420J3978M0801L3057m1153L188k2616K3467N400k4535j9951
$$ plain form
5438 -34657 -35261 -30884 -5114 8225 12830 6309 1330 24163 42650 15281 41758 48797 -16755
5425 -16755 -35305 -25048 -7195 7244 -14316 -4595 44516 34077 16431 29605 9524 22799
5413 22799 26012 11303 8713 31151 38202 35925 34140 13615 21753 48958 43473 16130 -250
5400 -250 -23317 8067 -731 -10289 -3666 15150 9115 -30640 -25718 -44129 -50046 -32640 4411
5387 4411 -24870 -50676 -13305 11173 -7787 -46023 -37542 -33527 -18916 5549 -38351 -60938
5375 -60938 -10639 46961 48514 32325 -4407 7825 33620 23815 4741 -12756 -39354 -35381
5363 -35381 -37946 -39052 -42528 -18945 6920 36614 14430 6405 23465 -5651 -43974 -29832 -13108
5350 -13108 -12545 1447 -33643 -58186 -43110 -64959 -70155 -78364 -84326 -68911 -52519 31008 66729
$$ packed form
5438c4657o04M377K5770J3339M605o521m979K2833J8487k7369K6477P039o5552
5425a6755j8550J0257J7853J4439k1560R721M9111j0439j7646J3174k0081J3275
5413B2799L213j4709k590K2438P051k277j785k0525Q138K7205n485k7343j6380
5400b50k3067L1384q798r558O623J8816o035l9755M922j8411n917J7406L7051
5387D411k9281k5806L7371K4478j8960l8236Q481M015J4611K4465m3900k2587
5375f0938N0299N7600J553j6189l6732J2232K5795r805j9074j7497k6598L973
5363c5381k565j106l476K3583K5865K9694k2184q025J7060k9116l8323J4142J6724
5350a3108N63J3992l5090k4543J5076k1849n196q209n962J5415J6392Q3527L5721
$$ plain form
5337 66729 10955 -22279 -29004 -34696 -33213 -27631 -50910 -49032 -35802 -703 -9784 -69493 -91044
5324 -91044 -59117 -40674 -84881 -69413 -70650 -52653 -84940 -73101 -84985 -74857 -91967 -47120
5312 -47120 -26242 -7295 -38541 -69618 -98428 -69653 -32208 -12724 -22450 -43207 -24933 -22498
5300 -22498 -8996 14075 641 -20136 -40934 -48581 -30247 -13861 -27161 -9607 -8936 7832
5288 7832 18640 24136 8193 -7106 -22776 -88674 -98561 -59931 -53481 -80997 -95174 -44033 -30293
5275 -30293 -40694 -4159 -4626 -39703 -36201 8474 42748 62963 52499 62892 36424 44839 14110
5262 14110 -20713 -27423 -15347 -13396 -22199 2277 9513 -2038 -34881 -48188 -64048 -64628 -34663
5249 -34663 3661 -14777 -32592 -18631 -486 10334 -26810 -25313 -10560 2914 5152 -6711
$$ packed form
5337F6729n5774l3234o725n692J483N582k3279J878J3230L5099r081n9709k1551
5324i1044L1927J8443m4207J5468j237J7997l2287J1839j1884J0128j7110M4847
5312d7120K0878J8947l1246l1077k8810K8775L7445J9484r726k0757J8274K435
5300b2498J3502K3071j3434k0777k0798p647J8334J6386j3300J7554O71J6768
5288G832J0808N496j5943j5299j5670o5898r887L8630O450k7516j4177N1141J3740
5275c0293j0401L6535m67l5077L502M4675L4274K0215j0464J0393k6468Q415l0729
5262A4110l4823o710J2076J951q803K4476P236j1551l2843j3307j5860n80K9965
5249c4663L8324j8438j7815J3961J8145J0820l7144J497J4753J3474K238j1863
$$ plain form
5237 -6711 -30766 -25807 -8942 27251 38401 31226 19499 48233 15599 4527 6009 10734 -7941
5224 -7941 9252 41726 48952 63731 30134 -10708 1913 37278 21187 -10454 -20297 4070
5212 4070 -24062 -44044 -61908 -47642 5720 25433 10361 638 12836 64515 73732 35959
5200 35959 44148 52615 77552 84577 30930 25424 9082 -39281 -61041 -36422 -15299 -14199 -31352
5187 -31352 -36091 -16248 -8231 -12603 -2884 -9246 -15325 -2472 -20327 4256 34656 13965 9300
5174 9300 -41113 -15523 -9111 -29351 -53320 -40714 -25933 -33359 -37245 -30839 -14909 19643 11082
5161 11082 -5190 15674 41638 45258 27067 15912 -18752 -7657 35935 54015 78442 73766
5149 73766 55080 28686 -4935 9439 11977 19695 20296 29059 37136 17459 31831 23009 20998
$$ packed form
5237f711k4055M959J6865L6193J1150p175j1727K8734l2634j1072J482M725j8675
5224g941J7193L2474P226J4779l3597m0842J2621L5365j6091l1641r843K4367
5212D070k8132j9982j7864J4266N3362J9713j5072r723J2198N1679R217l7773
5200C5959Q189Q467K4937P025n3647n506j6342m8363k1760K4619K1123J100j7153
5187c1352m739J9843Q017m372R719o362o079J2853j7855K4583L0400k0691m665
5174I300n0413K5590O412k0240k3969J2606J4781p426l886O406J5930L4552q561
5161A1082j6272K0864K5964L620j8191j1155l4664J1095M3592J8080K4427m676
5149G3766j8686k6394l3621J4374K538P718O01Q763Q077j9677J4372q822k011
$$ plain form
5136 20998 5800 -30267 -24946 -11009 -23344 -43035 -15152 -12791 14777 25222 28223 43406
5124 43406 27244 -11772 -7582 -9545 -24013 -46895 -73581 -79498 -74754 -87122 -31774 18306 44005
5111 44005 72518 90388 38280 15162 -15945 -12032 -22549 -40938 -39693 -13029 1683 -16719
5099 -16719 -8522 -9291 -19763 -24493 -24753 -29995 -34136 -32610 -32731 -10343 22395 50639 29196 11384
5085 11384 31416 24575 13937 8346 1406 30709 7704 -27916 -6735 -24791 -11862 -7631 -19868
5072 -19868 -26100 826 3299 1362 -14746 -15587 -6874 21449 33102 53470 30354 12004 17646
5059 17646 -210 16890 27300 -4616 -7452 22274 33310 95 -23317 -25675 3517 29322
5047 29322 -3532 -13506 -1106 -7718 -12978 18254 40867 15258 -19206 6721 40347 42969 34313
$$ packed form
5136B0998j5198l6067N321J3937j2335j9691K7883K361K7568J0445L001J5183
5124D3406j6162l9016M190j963j4468k2882k6686n917M744j2368N5348N0080K5699
5111D4005K8513J7870n2108k3118l1107L913j0517j8389J245K6664J4712j8402
5099a6719Q197p69j0472m730k60n242m141J526j21K2388L2738K8244k1443j7812
5085A1384K0032o841j0638n591o940K9303k3005l5620K1181j8056J2929M231j2237
5072a9868o232K6926K473j937j6108q41Q713K8323J1653K0368k3116j8350N642
5059A7646j7856J7100J0410l1916k836K9726J1036l3215k3412k358K9192K5805
5047B9322l2854r974J2400o612n260L1232K2613k5609l4464K5927L3626K622q656
$$ plain form
5034 34313 47712 3899 -27676 -11480 -30366 -12188 -15282 -39165 -23634 -49089 -30680 -29960
5022 -29960 -30030 14053 12394 -8892 1361 -295 7184 8689 -32293 -10808 6813 -13652 -20294
5009 -20294 -5104 3759 -36057 -21489 -14379 -84705 -112843 -98596 -113862 -96354 -79070 -60707
$$ packed form
5034C4313J3399m3813l1575J6196j8886J8178l094k3883J5531k5455J8409P20
5022b9960p0M4083j659k1286J0253j656P479J505m0982K1485J7621k0465o642
5009b0294J5190Q863l9816J4568P110p0326k8138J4247j5266J7508J7284J8363
$$ [...]
##END NTUPLES=NMR SPECTRUM
##END=
