##TITLE=Analysis number 319144
Compound Code sp 01443
Project Code adrs
Chemist Name melford
##JCAMPDX= 6.0         $$ Bruker NMR JCAMP-DX V2.0
##DATA TYPE= NMR SPECTRUM
##DATA CLASS= NTUPLES
##ORIGIN= Bruker BioSpin GmbH
##OWNER= nmr
$$ XWIN-NMR		Version 3.5
$$ Wed May  3 14:47:33 2006 GMT Daylight Time (UT+1h)  MAYBRIDGE\nmr@NMR_250MHZ
##.OBSERVE FREQUENCY= 250.131544655141
##.OBSERVE NUCLEUS= ^1H
##.ACQUISITION MODE= SIMULTANEOUS (DQD)
##.ACQUISITION SCHEME= undefined
##.AVERAGES= 16
##.DIGITISER RES= 18
##SPECTROMETER/DATA SYSTEM= dpx250
##.PULSE SEQUENCE= zg30
##.SOLVENT NAME= CDCl3
##.SHIFT REFERENCE= (INTERNAL, CDCl3, 0, 16.522)
##AUDIT TRAIL= $$ (NUMBER, WHEN, WHO, WHERE, WHAT)
$$ ##TITLE= Audit trail, XWIN-NMR		Version 3.5
$$ ##JCAMPDX= 5.01
$$ ##ORIGIN= Bruker BioSpin GmbH
$$ ##OWNER= nmr
$$ C:\u/data/dgb/nmr/ADRS/3780/pdata/1/auditp.txt
$$ ##AUDIT TRAIL=  $$ (NUMBER, WHEN, WHO, WHERE, WHAT)
(   1,<2006-05-03 14:46:42.34 +100>,<MAYBRIDGE\nmr>,<NMR_250MHZ>,
      <created by zg, POWCHK disabled, PULCHK disabled
       configuration hash MD5:
       84 BC 41 DB A1 6E 1D 46 DA 25 12 A5 C1 ED C5 3A
       data hash MD5: 64K
       D2 67 C4 94 F1 C6 9F 5E BE FF 27 C5 01 CF 58 CE>)
(   2,<2006-05-03 14:47:06.60 +100>,<MAYBRIDGE\nmr>,<NMR_250MHZ>,
      <Start of raw data processing
       ef LB = 0.3 FT_mod = 6 PKNL = 1 SI = 32K 
       data hash MD5: 32K
       31 A1 67 33 DD 88 3B 6D 90 F9 84 06 FA ED BF 46>)
(   3,<2006-05-03 14:47:09.90 +100>,<MAYBRIDGE\nmr>,<NMR_250MHZ>,
      <apk 
       data hash MD5: 32K
       E6 86 7E 58 32 C7 C6 C1 82 FE FC 70 65 13 B6 D8>)
(   4,<2006-05-03 14:47:11.49 +100>,<MAYBRIDGE\nmr>,<NMR_250MHZ>,
      <abs ABSG = 5 
       data hash MD5: 32K
       A5 C6 27 67 D8 5A 66 09 C9 3D 2C 16 C5 1C 4E 73>)
$$ ##END=
$$ 
$$ hash MD5
$$ 9E 71 60 AC 09 5E 85 CB C6 8E 4A 2C 05 85 CD 82
##$RELAX= 
##$RELAX= 
##$RELAX= 
##$RELAX= 
##$RELAX= 
##$RELAX= 
##$RELAX= 
$$ Bruker specific parameters
$$ --------------------------
##$DU= <C:\u>
##$EXPNO= 3780
##$NAME= <ADRS>
##$PROCNO= 1
##$TYPE= <nmr>
##$USER= <dgb>
##$AMP= (0..31)
100 100 100 100 100 100 100 100 100 100 100 100 100 100 100 100 100 100 
100 100 100 100 100 100 100 100 100 100 100 100 100 100 
##$AQSEQ= 0
##$AQ_mod= 3
##$AUNM= <au_zg>
##$AUTOPOS= <40 >
##$BF1= 250.13
##$BF2= 250.13
##$BF3= 250.13
##$BF4= 250.13
##$BF5= 500.13
##$BF6= 500.13
##$BF7= 500.13
##$BF8= 500.13
##$BYTORDA= 1
##$CFDGTYP= 0
##$CFRGTYP= 5
##$CHEMSTR= <none>
##$CNST= (0..31)
1 1 145 1 1 1 1 1 1 1 1 1 1 1 1 1 1 1 1 1 1 1 1 1 1 1 1 1 1 1 1 1 
##$CPDPRG= <>
##$CPDPRG1= <>
##$CPDPRG2= <>
##$CPDPRG3= <>
##$CPDPRG4= <mlev>
##$CPDPRG5= <mlev>
##$CPDPRG6= <mlev>
##$CPDPRG7= <mlev>
##$CPDPRG8= <mlev>
##$CPDPRGB= <>
##$CPDPRGT= <>
##$D= (0..31)
0 1 0 0 0 0 0 0 0 0.06 0 0 0 0 0 0 0.0002 0 0 0 0 0 0 0 0 0 0 0 0 0 0 
0 
##$DATE= 1146663999
##$DBL= (0..7)
120 120 120 120 120 120 120 120 
##$DBP= (0..7)
150 150 150 150 150 150 150 150 
##$DBP07= 0
##$DBPNAM0= <>
##$DBPNAM1= <>
##$DBPNAM2= <>
$$ [...]
##$SUBNAM7= <"">
##$SUBNAM8= <"">
##$SUBNAM9= <"">
##$SW= 20.6930455092707
##$SWIBOX= (0..15)
0 0 3 0 0 0 0 0 0 0 0 0 0 0 0 0 
##$SW_h= 5175.983436853
##$TD= 65536
##$TD0= 1
##$TE= 296.16
##$TE2= 300
##$TE3= 300
##$TEG= 300
##$TL= (0..7)
0 120 120 120 120 120 120 120 
##$TP= (0..7)
150 150 150 150 150 150 150 150 
##$TP07= 0
##$TPNAME0= <>
##$TPNAME1= <>
##$TPNAME2= <>
##$TPNAME3= <>
##$TPNAME4= <>
##$TPNAME5= <>
##$TPNAME6= <>
##$TPNAME7= <>
##$TPOAL= (0..7)
0.5 0.5 0.5 0.5 0.5 0.5 0.5 0.5 
##$TPOFFS= (0..7)
0 0 0 0 0 0 0 0 
##$TUNHIN= 0
##$TUNHOUT= 0
##$TUNXOUT= 0
##$USERA1= <user>
##$USERA2= <user>
##$USERA3= <user>
##$USERA4= <user>
##$USERA5= <user>
##$V9= 5
##$VALIST= <valist>
##$VCLIST= <CCCCCCCCCCCCCCC>
##$VD= 0
##$VDLIST= <DDDDDDDDDDDDDDD>
##$VPLIST= <PPPPPPPPPPPPPPP>
##$VTLIST= <TTTTTTTTTTTTTTT>
##$WBST= 1024
##$WBSW= 4
##$XGAIN= (0..3)
0 0 0 0 
##$XL= 0
##$YL= 0
##$YMAX_a= 525004
##$YMIN_a= -485129
##$ZGOPTNS= <>
##$ZL1= 120
##$ZL2= 120
##$ZL3= 120
##$ZL4= 120
##$ABSF1= 16.522
##$ABSF2= -4.171173
##$ABSG= 5
##$ABSL= 3
##$ALPHA= 0
##$AQORDER= 0
##$ASSFAC= 0
##$ASSFACI= 0
##$ASSFACX= 0
##$ASSWID= 0
##$AUNMP= <proc_1d>
##$AZFE= 0.1
##$AZFW= 0.1
##$BCFW= 0
##$BC_mod= 0
##$BYTORDP= 0
##$COROFFS= 0
##$CY= 12.5
##$DATMOD= 1
##$DC= 0
##$DFILT= <>
##$DTYPP= 0
##$F1P= 14.0000005364418
##$F2P= -0.99999901652339
##$FCOR= 0.5
##$FTSIZE= 32768
##$FT_mod= 6
##$GAMMA= 0
##$GB= 0
##$INTBC= 1
##$INTSCL= 1
##$ISEN= 128
##$LB= 0.3
##$LEV0= 0
##$LPBIN= 0
##$MAXI= 10000
##$MC2= 0
##$MEAN= 0
##$ME_mod= 0
##$MI= 0
##$NCOEF= 0
##$NC_proc= -3
##$NLEV= 6
##$NOISF1= 0
##$NOISF2= 0
##$NSP= 0
##$NTH_PI= 0
##$NZP= 0
##$OFFSET= 16.522
##$PC= 1
##$PHC0= 15.90152
##$PHC1= 5.759447
##$PH_mod= 1
##$PKNL= yes
##$PPARMOD= 0
##$PSCAL= 4
##$PSIGN= 0
##$REVERSE= no
##$SF= 250.13
##$SI= 32768
##$SIGF1= 0
##$SIGF2= 0
##$SINO= 400
##$SIOLD= 32768
##$SREGLST= <1H.CDCl3>
##$SSB= 0
##$STSI= 32768
##$STSR= 0
##$SW_p= 5175.98343685301
##$SYMM= 0
##$S_DEV= 0
##$TDeff= 65536
##$TDoff= 0
##$TI= <Analysis number 999999
Compound Code 99
Book Reference 9
Project Code 9>
##$TILT= no
##$TM1= 0
##$TM2= 0
##$TOPLEV= 0
##$USERP1= <user>
##$USERP2= <user>
##$USERP3= <user>
##$USERP4= <user>
##$USERP5= <user>
##$WDW= 1
##$XDIM= 32768
##$YMAX_p= 335018290
##$YMIN_p= -35732
$$ End of Bruker specific parameters
$$ ---------------------------------
##NTUPLES= NMR SPECTRUM
##VAR_NAME=  FREQUENCY,     SPECTRUM/REAL,   SPECTRUM/IMAG
##SYMBOL=    X,             R,               I
##VAR_TYPE=  INDEPENDENT,   DEPENDENT,       DEPENDENT
##VAR_FORM=  AFFN,          ASDF,            ASDF
##VAR_DIM=   32768,         32768,           32768
##UNITS=     HZ,            ARBITRARY UNITS, ARBITRARY UNITS
##FACTOR=    0.157963299565203, 1,           1
##FIRST=     4132.6476996994, 0,             0
##LAST=      -1043.33573715361, 0,           0
##MIN=       -1043.33573715361, -35732,      0
##MAX=       4132.6476996994, 335018290,     0
$$ Real data points
##PAGE= N=1
##DATA TABLE= (X++(R..R)), XYDATA
$$ [...]
16631A8604k137k538p96j420k393J79L568k98l35m98r89M68R43j367m065j854
16615E072J396j917N460P104l289j0451J120M89R60k861Q235P23l411J196P521
16600A7347J866m240m235k926r60N764j988k668k74q328m651K901M827R14m545
16585a196N055O465l221o931P92R747K288j705m042k592Q05L088P133N548j622
16570A9612R41k162n099J092o566p168j779P934M725J823j417M003j06o329k496
16555G008o187M717N115l753n344L992M645J528r147j919j209J23K162N496k22
16540G005K936j031L844O046l045J732l419k847j977j0689k754M057K426l938
16526a654p43M513L911J688k254p773j358P714N363n83J611L953k342j1448R82
$$ y = [18604, 16467, 13929, 13133, 11713, 9320, 9499, 13067, 12769, 12434, 11936, 10947, 11415, 12358, 10991, 6926, 5072, 6468, 4551, 10011, 17115, 13826, 3375, 4495, 4984, 5944, 3083, 11318, 12041, 8630, 9826, 17347, 19213, 14973, 10738, 7812, 6852, 12616, 10628, 7960, 7686, -642, -5293, -2392, 2435, 3349, -1196, 3859, 10324, 7103, 172, 964, 10711, 12999, 11294, 7252, 4660, 5465, 8553, 15686, 21234, 19612, 20553, 18391, 13292, 14384, 7818, 650, -1129, 6805, 11530, 13353, 11936, 15939, 15833, 9504, 7008, 821, 5538, 10653, 6900, 1556, 5548, 10193, 11721, 2574, 655, -554, -431, 1731, 7227, 7005, 9941, 8910, 12754, 18800, 15755, 17487, 14068, 11221, 9244, -1445, -4199, -142, 2284, -1654, -2397, 2116, 6027, 7715, 5461, -2312, -3670, 4044, 9407, 8824, 10435, 14388, 12046, 598, 1580]
16511A580J051L285J010m370O99L713q89K223J528K771N255j032p117m905j150
16496C652l367l917j435m69O171M790j61J729K44k567k97O834M608o287o797r44
16480A787l430j825J1291L792n517k526K603j808J250j706p5N506l847l167l393
16465a065N967N717m74l179l781k762l115N807N560o17n66K619J039m06o48l715
16449F381J944m92R61o9l266j43P98R19j703o66j578k571J956K926K053j40l092
16432D218n979R38N372J0887m568q911k54j619m693l274K63o31L832l330l915
16417a1664J171K24J098N263R99j488k110J857R626m419k768M070M470j892k751
16402A686m71k709p791J407N234L514Q3J734Q17M250m492k474O207J104k408M47
$$ y = [1580, 2631, 5916, 6926, 2556, 3255, 6968, 6079, 8302, 9830, 12601, 17856, 16824, 9707, 4802, 3652, 285, -3632, -5067, -5536, 635, 5425, 5264, 6993, 7237, 4670, 4373, 11207, 15815, 9528, 2731, 1787, -1643, -3468, 7823, 11615, 6098, 3572, 6175, 4367, 5617, 3911, 3836, 9342, 5495, 2328, -1065, 4902, 10619, 10145, 6966, 3185, 423, -2692, 3115, 8675, 8058, 7492, 10111, 11150, 10744, 10096, 6381, 8325, 7833, 8794, 8725, 5459, 5316, 6114, 7033, 5330, 4664, 3086, 515, 2471, 5397, 7450, 7310, 4218, -1761, -823, 4549, 15436, 10868, 1957, 1703, 84, -4609, -7883, -7620, -8251, -4419, -7749, -11664, -10493, -10269, -9171, -3908, -2909, -4397, -6507, -4650, 4976, 557, -2211, 1859, 6329, 4437, 1686, 1215, -1494, -9285, -7878, -2644, 870, 953, 2687, 3504, 7754, 3262, 788, 6995, 8099, 5691, 6138]
16386F138R629p902q990j17J681K727n254j591j39j775K899j660N527N23q84m590
16370c778M993o041j636P239J823M316L836j359l089p767k849L608o8N264J974
16355F466m353J693L539K160l62q31m431q18K960n492n913M389K934m228p032
16340i319N912J890J877M79Q155L517q878k515O858K479n424k122j628K846J801
16325E928l314j276q088P90Q670O851l787K781M474p150m673k64j234j48K134
16310A694m804l028Q600Q298J896k83o215J702n422j0705k336J614J0178l230
16296b041j530J301J379M814m308p056J251l169j018J2734P985r38n447k939M068
16281E086Q614P724m234q855m441J012O04M489J075L10l788n109j140l986J310
$$ y = [6138, 15767, 7865, -1125, -1242, 439, 3166, -2088, -3679, -3818, -5593, -2694, -4354, 1173, 1696, 812, -3778, 1215, -4826, -6462, 777, 2600, 6916, 10752, 9393, 6304, -1463, -4312, -704, -772, 4492, 6466, 2113, 3806, 7345, 9505, 9143, 8312, 3881, 3063, 6023, 531, -5382, -993, 1941, -2287, -9319, -3407, -1517, 360, 839, 8994, 12511, 3633, 1118, 7976, 10455, 5031, 2909, 1281, 4127, 5928, 2614, 1338, -6750, -5960, 2710, 9561, 5774, 8555, 13029, 5879, 1206, 942, -292, -440, 1694, -3110, -6138, 2462, 10760, 12656, 12373, 6158, 7860, 2438, -8267, -10603, -8989, 1189, -2041, -3571, -2270, -891, 3923, -385, -7441, -6190, -9359, -10377, 2357, 10342, 9404, 3957, 1018, 5086, 13700, 21424, 17190, 8335, 3894, 4906, 5510, 9999, 11074, 11384, 7596, 2487, 1347, -2639, -1329]
16266a329L408k916J357k207m217J597L489O361M391Q420N050K979p419k176r61
16251A5827k084j2026j397j473k168L543K702K975L472k262o551k897l883j726
16237g948J960r28j650J285P957j520l513p274p942M616J4268Q699J386K92k371
16222G317M561l677l396j374K188o816L621J0667k174o183n636l069m825M638
16208d158L696L716k521j259K108l003N1Q05L55N968l583r895M6m015K484O482
16192b723O543k756n999j184L964O7k143J276L308N846mm598r822nM736j34m373
16175h001N27N57O582M247n461n97R377N049k930j2632L758O101m087k280n186
16160d976k282L347P358O285k536O15j491j461q22m776O957k17n057M955r762
$$ y = [-1329, 2079, -837, 520, -1687, -5904, -4307, -818, 5543, 9934, 18354, 23404, 26383, 18964, 16788, 15827, 13743, 1717, 320, -1153, -3321, 222, 2924, 5899, 9371, 7109, 558, -2339, -6222, -7948, -5988, -6916, -8566, -7281, 676, -844, -4357, -11631, -19573, -14957, -689, 8010, 9396, 9688, 7317, 11878, 8201, 4805, 3431, 5619, -1197, 2424, 13091, 10917, 4734, -902, -3971, -8796, -4158, -462, 3254, 733, -526, 1582, -1421, -1370, -565, -210, 5758, 2175, -7720, -7674, -11689, -9205, -2723, 3820, 1064, -4935, -6119, -2155, -2088, -4231, -2955, 353, 6199, 6195, 1597, -8225, -8230, -3494, -3628, -8001, -7474, -6917, -335, 3912, -1549, -2146, 7231, 12280, 9350, -3282, 476, 6577, 2490, 210, -4976, -7258, -3911, 3447, 9732, 7196, 7811, 6320, 4859, 4037, -739, 6218, 6001, 944, 5899, -3863]
16145c863j1608j982R658K289n216m622J309R636L756j586O406L399j103j793
16131D680M476k314j618j337P447p914o426m81J871l251L26O797J572k160m095
16116b427m884L214K636k907M269q05L180m6J054j469N234O669K024K61m237o206
16100E560J103K11j300o47p755l706J033J915L040J413Q62M628j2502o777M156
16085h766K44k545j134J462O072L257L830k535n940j992P838K377J801k053j692
16070B24l83Q27J252l122m565k895M345k992P91M48R54N675q04L992K882k294
16054D335k307l41J295M731J010p832J285n03o46J285J065j846L211M906J344
16039A0992j61j136j0621K83J0341J920l474o334j0535k073L017J273r558L886
$$ y = [-3863, -15471, -17453, -7795, -5506, -10722, -15344, -14035, -4399, -643, -2229, 4177, 7576, 6473, 4680, 9156, 6842, 5224, 3887, 11334, 3420, -3006, -3487, -1616, -4867, -4541, 2256, 3828, 1668, -2427, -7311, -4097, -1461, -4368, -99, -904, 2276, 2230, 3284, 1815, 7049, 13718, 15742, 16003, 11766, 5560, 6663, 6874, 5574, 4927, -2828, -6534, -5501, -3586, -546, 867, 1729, 6357, -6145, -12922, -8766, -8522, -11067, -12201, -10739, -4667, -1410, 2420, -115, -6055, -8047, -209, 2168, 3969, 1916, 224, -159, 668, 1920, -1202, -5767, -8662, -4317, -7309, -6518, -6070, -5116, 559, -245, 3747, 6629, 4335, 2028, 1687, 2982, 7713, 8723, 891, 2176, 1673, 1027, 2312, 3377, 1531, 4742, 9648, 10992, 10831, 9695, -926, -643, 9698, 11618, 8144, 1810, -8725, -10798, -7781, -6508, -16066, -12180]
16025a2180N238j362J251J0582O154n02N73M994l394n128k962P340O356n525k910
16010H525o047l030L700k844n554J366J268r22L947L50o29M342L557J349m19j249
15994G710o681l864n191k751K619J887R694P253q137J020K339r578J033M806R830
15979A1989k002l248l894m346J215k781Q65k769K439J527L041m958j35N212R18
15964C073P58k888O393j265j0978n380P74P478m263K636N013l608l502j714k268
15949i741j189k8N793J669l418L51N247n783l855O104O345K537L043L719n55q419
15933A820o659k045R57O326r23N1n40l883n855J229L908J758N167N057K988r979
15917f23j475K587L217p15m433m223J326Q43J2398K412r516j065l320K995Q64
$$ y = [-12180, -6942, -8304, -7053, 3529, 9683, 9181, 9754, 14748, 11354, 6226, 3264, 10604, 16960, 11435, 8525, 2478, -552, 3148, 304, -5250, -3884, -2616, -3538, 409, 759, 130, 4472, 8029, 9378, 8959, 7710, 1029, -2835, -8026, -10777, -8158, -6271, 3423, 10676, 2539, 3559, 5898, -3680, -2647, 2159, 11989, 9987, 6739, 2845, -1501, -286, -3067, -2202, -4971, -2532, -1005, 2036, -2922, -3057, 2155, 3073, 3831, 943, 7336, 6071, -4907, -10287, -9513, -2035, -6298, -3662, 1351, -2257, -5759, -7473, -9741, -10930, -10958, -5165, -3496, -6914, -6563, -1316, -7099, -10954, -4850, 1495, 4032, 7075, 10794, 10239, 1820, -4839, -6884, -5927, 399, -524, -473, -1013, -4896, -10751, -9522, -5614, -3856, 1311, 6368, 9356, -623, -2098, 489, 3706, 2991, -1442, -5665, -4339, -3496, 8902, 11314, 1798, 733, -2587, 408, 1272]
15902A272O40J723J07K866l600m254N860q99n506n115J70M362j973K349L353L262
15886D617L38K423k503M51k303m470k625R703Q63j1146l508O121J433M311L997
15871G702J740k620j533k515l808J182M550k131k0O50j791m246j505m01m549r49
15855a0244j905l909K623N862K914L374l511k567N327L92P855L321J036P238j691
15840A6115n753Q37K057n602j339n306r76R795O396l191m767l051l017K19j545
15825H72p018M647K229l801L259L054m241K85q30Q27J561J66l059k092j847K286
15809c702k10j08Q919r71l748m20l707M39K765M817Qj276p019r65L717Q74m222
15792d809k448j984j918k89P034N173o675k352q9J290R25Q117j814p204k970j3
$$ y = [1272, 1912, 3635, 3742, 6608, 3008, -1246, 4614, 3715, -1791, -6906, -6736, -2374, -4347, -1998, 1355, 4617, 4955, 7378, 4875, 5326, 3023, -1447, -4072, 5631, 6494, -4652, -8160, -2039, -606, 3705, 7702, 9442, 6822, 5289, 2774, -1034, 148, 4698, 2567, 2547, 3197, 1406, -2840, -4345, -4746, -9295, -10244, -12149, -16058, -13435, -7573, -4659, -1285, -4796, -7363, -2036, -1644, 6211, 9532, 10568, 17806, 16115, 10362, 11199, 13256, 7654, 6315, 1009, 33, 9828, 16224, 13033, 8266, 5215, 2198, 2417, 872, -6146, -1499, 730, -3071, 188, 3242, -999, -714, -1544, -717, 844, 1010, -2049, -4141, -5988, -3702, -3912, -4020, 4899, 3928, 180, -240, -3947, -3508, -743, 4074, 4082, 2806, -4213, -5178, -1461, -587, -4809, -7257, -9241, -11159, -11448, -4414, 759, -5916, -8268, -8357, -7067, -6142, 1975, 161, -7043, -10013, -10026]
15776a0026l974N140M987l681J925R540m224j874j104J871k684N102L306l37l077
15761H90k226m89K280j407p139m232K94m06N555R942l312q345k432K871m64J899
15745f721p115n0M180K203J319k73N012N725k201k589k95j406L408o421k789Q8
15729g925k497l161o030L46K470j172m383L060N728L064K342kK989j936L658j403
15713d852O67R62L941M637L568k167q545l76j722k425K056m403K362k312l084
15698a1693k669P12K860K430l644j161L378L156Q11L659j921k105L185j765M020
15683g47k659k31j112K315m170J407N909o317n123j42M875K795l305o82j515r251
15667a7953m778O599L396Q197K075k06k534K51K116N296Q824O846J327Q346l33
$$ y = [-10026, -14000, -8860, -3873, -7554, -5629, 3911, -313, -2187, -3291, -1420, -4104, 998, 4304, 3967, 890, -1336, -1825, 455, -952, -8091, -12323, -12029, -12435, -6880, 3062, -250, -8595, -11027, -8156, -8620, -6721, -13836, -13886, -9706, -7503, -6184, -6457, -1445, 4280, 2079, -510, -805, -2211, 1197, -5224, -8013, -7925, -10422, -13583, -19613, -19267, -16797, -17969, -22352, -19292, -13564, -10500, -8158, -8160, -5171, -7107, -3449, -4852, -4185, -3223, 718, 5355, 8923, 6756, -1789, -2165, -3887, -6312, -4256, -8659, -6297, -8609, -11693, -14362, -13650, -10790, -8360, -12004, -13165, -9787, -6631, -5820, -2161, -4082, -6187, -3002, -4767, -747, -3406, -3637, -4749, -2434, -6604, -5197, 712, -5605, -10728, -10870, -5995, -3200, -6505, -7187, -8702, -17953, -22731, -16132, -12736, -4539, -2464, -2670, -5204, -4953, -2837, 2459, 11283, 18129, 19456, 27802, 27469]
15652B7469q194p574j2922k152L200L536K143L009j92l083m153l582l296Q74L527
15637a390O719p39m106m770j47j787n818P03M902P700O652J484j2288k299K024
15622c160k759k793N666N19m2J477J404o245p42j118K827n554k099R265N497K233
15606D376o249j670L590l795k183K94j990k419l082L117l259o084l432J45N750
15591a6891L906R079N706j414l291q1l163l623J170r3O262J119k451Q90R37j381
15575c319o68j729n801M086M787M921M83J022J995n936r218k991K511L566L448
15560b843Q45L514L87L908N820Q03r640n230K846k564m103L736K009j241j852
15545c605p176j608n55l1K131J219k22k090j268n254J704k861M83l636O503O179
$$ y = [27469, 19275, 11701, -1221, -3373, -173, 3363, 5506, 8515, 8323, 5240, 1087, -2495, -5791, -4917, -1390, 5329, 4590, 484, -4286, -4433, -6220, -12038, -11335, -6433, 1267, 7919, 9403, -2885, -5184, -3160, -5919, -8712, -3046, -2527, -2569, -1092, 312, -5933, -6675, -7793, -4966, -10520, -12619, -3354, 2143, 4376, -1873, -3543, 47, -3748, -5931, -5637, -7627, -10046, -13128, -10011, -13270, -19354, -22786, -22641, -16891, -12985, -3906, 1800, 386, -2905, -2986, -6149, -9772, -8602, -8695, -2433, -1314, -3765, -2875, -1938, -3319, -3987, -5716, -11517, -7431, -2644, 2277, 2760, 3782, 5777, -159, -9377, -12368, -9857, -6291, -2843, -1998, 1516, 1903, 5811, 11631, 12434, 2794, -2436, 410, -2154, -6257, -2521, -512, -1753, -3605, -10781, -12389, -12944, -12975, -10844, -9625, -9847, -11937, -13205, -18459, -16755, -19616, -19133, -22769, -16266, -10087]
15529a0087k953R914N853j859K987K012N03p61m964j367J415K663j45N83M742
15514H536M318o369l348j340M287L355l353m596K967k017j740j81j347l297K821
15499a304M9N6J617j1749l815L100N36J948K668j935m308M765J415m507j407L158
15483i713J323J465n67k214L803J2586k319j264j132j0708j954J941j887N06O040
15468d094L468L405L338k673o178N885r41j462k439p02J935m078R96N555Q715
15453A0730o80R75m65J26p385j0257j701K533N551P005M902p216l952o126L828
15438b132P889N44r836j0017j895m976N557L118R591J749J14j430O27j925K500
15423e22m62J813r175l647R88J134K665N596m65l794p254l323M602L811R936m64
$$ y = [-10087, -13040, -3126, 2727, 868, 3855, 5867, 6370, 5609, 645, -722, 693, 3356, 3211, 3794, 8536, 12854, 6485, 3137, 1797, 6084, 9439, 6086, 1490, 4457, 2440, 700, 519, -828, -4125, -1304, -1255, -1199, 418, -11331, -15146, -12046, -11510, -9562, -6894, -8829, -13137, -8372, -6957, -11464, -12871, -9713, -8390, -6925, -7492, -9706, -5903, 6683, 4364, 3100, 1968, -8740, -10694, -8753, -10640, -10134, -4094, -626, 2779, 6117, 3444, -2734, 3151, 2210, 748, -1691, -2393, -458, -4536, -3540, 2015, 10730, 10050, 11025, 10560, 10686, 3301, -6956, -8657, -6124, -573, 6432, 11334, 4118, 166, -5960, -2132, 5757, 6301, -3535, -13552, -15447, -20423, -14866, -11748, -2157, -408, -294, -1724, -1097, -3022, -522, -984, 829, -8346, -11993, -11005, -9871, -7206, -1610, -2075, -5869, -13123, -16446, -11844, -8033, 1903, 1439]
15407A439p016p22J235N385k198n425j71j424k070k05l759J211M136k517k890
15392a4991m09L656M026r3O74p83Q65l102q78O505O823m37l201m471j228O630
15376d14k368m315m885j009O793O475k196n873K414M312M108K495k534l245k16
15361d58m879o318L645q32l213K959L548P43M343k090K30L734k140o69n424M626
15345b195Q011l805p259L267K102n183J322L731K215r55o70k844p946Q85j401
15330a0725j946J720n559O879J0577J034p390j558N229M796P81m833j763q60J940
15315a678M746n17l154j369O502K954m085j208J589l483m602m292P27M211R26
15300b733L202R54l143J695q305o53L13l76L245K94L155m128o626J0877K317R23
$$ y = [1439, -5577, -6299, -5064, 321, -1877, -7302, -7473, -8897, -10967, -11172, -14931, -13720, -9584, -12101, -14991, -15400, -11744, -7718, -7811, -7137, -7920, -7055, -10157, -11035, -4530, 2293, 1856, -1345, -5816, -7044, -414, -2782, -7097, -11982, -12991, -6198, 277, -1919, -7792, -5378, -1066, 3042, 5537, 3003, -242, -458, -5337, -11655, -8010, -8842, -12055, -9096, -5548, -4805, -462, -2552, -2322, 1412, -728, -1397, -6821, -2195, 5816, 2011, -5248, -1981, 121, -5062, -3740, -9, 2206, 1251, 581, -2263, -10209, -9324, -10725, -12671, -10951, -16510, -9631, 946, 1980, -5410, -6968, -1739, 3057, 3838, -995, -2758, -3618, -1678, 3068, 2551, -603, -1972, 4530, 7484, 3399, 2191, 3780, 297, -4305, -8597, -7870, -3659, -2733, 469, 1423, -1720, -25, -8330, -8983, -8670, -9046, -5801, -5507, -2352, -6480, -13106, -2229, 88, 1011]
15284A011L84n817J439k258m929K876l91m669q11m07P305K914R58n179R80l127
15268i721K555M82n776P256k651K173L956K469N91j0232L042O579k555o935o074
15253a4841q195J546J3829M319j7q019l752M755M398J316J85o574N3L545M804
15238b648J443k045m800K408K572p755J347J718L585L278o561m333P3K739J675
15223g304p405K086M997O58J281m684Q406J948o482k808k27J3216N093j0159j2956
15208a4340n710J4743R022O784J139j2038o730n135N529K170l109L397N656J422
15194B800l377N16R08l59M068N118q531n972N075K144m6L803L108r32m435m530
15178f42R35k065K471K289k074l422m89k77J743l665N259M0k175K14p135q029
$$ y = [1011, 1395, -4422, -2983, -5241, -10170, -7294, -7685, -12354, -13165, -13572, -6267, -3353, -2395, -7574, -6594, -9721, -7166, -6684, -12460, -5204, -7855, -5682, -1726, 743, 1334, -8898, -5856, 723, -1832, -8767, -14841, -23036, -21490, -7661, -3342, -3359, -11378, -15130, -10375, -5977, -4661, -4476, -11050, -10997, -7452, -2648, -1205, -3250, -8050, -5642, -3070, -10825, -9478, -7760, -4175, -897, -7458, -11791, -11718, -8979, -7304, -14709, -12623, -7626, -6968, -5687, -10371, -1965, -17, -6499, -9307, -9534, 3682, 8775, -1384, -14340, -20050, -5307, 3715, 10499, 11638, -400, -7130, -12265, -6736, -4566, -7675, -4278, 1378, 2800, -577, -61, 847, 488, 4556, 9674, 1143, -4829, 246, 2390, 2344, 6147, 9255, 8323, 3888, -642, 293, -1772, 699, 2988, 914, -2508, -2997, -3274, -1531, -5196, 63, 103, -2072, -1858, -8993, -17022]
15162a7022k35m06N988O347K968O669J37n696n88L993l513l878r82k859k212k634
15146a3923j24K630P654L888k49J942J522j329q076n007L007J857r87L531Q187
15131D523l339o411o172r252l933L296k173l218J01m076J767O601J2313O205R86
15116b782P156P62p477p685o042j204M689n18J722P250L678k815o618l692L875
15101i701k847J47O711k287o826N2N484r69Q56K186k650k539k641K077M552M016
15085d379Q6k316K910K547m357l989l82l20K96j402P93J437N729l160J674o407
15069a1240n491M623l01L962L846J33Q83m970j357J454oK876j860r43k34k286
15053a0911r83Q5J228K715j564O323J2258l176R77J003L609p357o908j618l590
$$ y = [-17022, -17257, -17663, -11675, -5328, -2360, 4309, 4446, -1250, -1838, 2155, -1358, -5236, -6218, -9077, -11289, -13923, -14047, -11417, -3763, 125, -124, 1818, 3340, 2011, -6065, -11072, -8065, -6208, -7195, -3664, 4523, 1184, -5227, -11399, -20651, -24584, -21288, -23461, -26679, -26578, -30654, -28887, -22286, -9973, -3768, -2782, 4374, 5136, -2341, -10026, -16068, -17272, -12583, -13101, -11379, -4129, -451, -3266, -9884, -13576, -9701, -12548, -12401, -5690, -7977, -14803, -14751, -9267, -10236, -9380, -7194, -9844, -12383, -15024, -12947, -8395, -4379, -4293, -6609, -3699, -1152, -5509, -9498, -9880, -10200, -9904, -11306, -10513, -9076, -3347, -6507, -4833, -11240, -16731, -12108, -12409, -8447, -4601, -4468, -3585, -8555, -9912, -8458, -8464, -5588, -7448, -8391, -8625, -10911, -11894, -11809, -10581, -7866, -9430, -3107, 9151, 5975, 6952, 7955, 11564, 4207, -2701, -4319, -7909]
15038g909o005n164L819J4660M535q830p325m256P737M832k843l640l500L524
15024a0365l430L85L228q22M173L006M337m132m836L181L194R820N197Q3k91J377
15008A4105k332j4001n892j705J251J4017M622p727k534l502k849l23k789M92
14994i167l851n481L38M353N694M962K414k651m503O16k378j840q56J068M032
14979g250K26j008J749l065L712M52p65M435L02k022j316J220J299O148M839j575
14963G381R333P301L350o171r706o838m473r82J29j382m422J97n164k863Q60J303
14947a2147j123O982K370k285J223k993L439M863k33j248O439K255o379m977r597
14932a3411L0L187J456L979p25N20M704m556k571J352k28j272J425N297K966l540
$$ y = [-7909, -13914, -19078, -15259, -599, 3936, -4894, -12219, -16475, -8738, -3906, -6749, -10389, -13889, -10365, -13795, -13410, -10182, -11004, -6831, -3825, 512, -3620, -8456, -5275, -2081, 7739, 12936, 13019, 12728, 14105, 11773, -2228, -8120, -9825, -8574, 5443, 10065, 2338, -196, -3698, -6547, -6870, -9659, -9167, -13018, -18499, -18161, -13808, -8114, -3152, -738, -3389, -7892, -7276, -9654, -11494, -12350, -11282, -7250, -7024, -8032, -6283, -9348, -5636, -5184, -5949, -1514, -1212, -3234, -4550, -3330, -2031, 4117, 8956, 7381, 16714, 24015, 27365, 21194, 11488, 4650, 177, -805, -676, -2058, -6480, -6283, -11447, -14310, -13450, -12147, -13270, -6288, -3918, -6203, -4980, -7973, -4534, 329, 96, -1152, 5287, 7542, 1163, -3814, -13411, -13381, -10194, -8738, -4759, -5484, -4964, -260, -4816, -7387, -6035, -6263, -7535, -6110, -813, 2153, -1387]
14916a387o931Q73m778M017K071M08O644l166k315m710J945O209k762j281j292
14901f455m826J95M334N30n637j216n96K478N089O547m06k533k707j488k473J543
14885g621L12L486j373k741k591N295O741M039r95j969n345N2L970o301l054J447
14869f648M79o052q540M562L148J091n084n274L616O299J69J310L401k326K862
14854f987j587k621k374k524j865j063j724K982J15n70K445K317J84l131K333
14839a4070O747j682M130J191j444m34r83q176j270j943J400q03N35k64N382L90
14823a1294K165j676m512j034N157J678L732j838o47K741M416R37k996j325L739
14808g57L262m441j106k865m047J754n005j0329O058M624M025K570o785K523O589
$$ y = [-1387, -8318, -7445, -12223, -8206, -6135, -5727, 917, -2249, -4564, -9274, -7329, -1120, -3882, -5163, -6455, -11281, -11086, -6752, -6222, -11859, -13075, -13671, -11193, -6104, 443, 37, -2496, -5203, -6691, -9164, -7621, -7309, -3823, -5196, -7937, -10528, -5233, 1508, 5547, 4552, 2583, -2762, -2710, 1260, -5041, -8095, -6648, -6169, -12221, -20761, -16199, -13051, -11960, -17044, -22318, -18702, -12403, -12234, -10924, -7523, -9849, -6987, -8574, -11195, -13569, -16093, -17958, -19021, -20745, -17763, -17648, -18218, -15773, -13456, -13272, -16403, -14070, -7323, -9005, -4875, -3684, -5128, -5562, -6545, -14721, -15991, -17934, -16534, -17337, -16802, -17066, -11684, -11294, -9129, -10805, -15317, -16351, -11194, -9516, -5784, -7622, -8269, -5528, -1112, -175, -3171, -4496, -757, 2505, -1936, -3042, -5907, -9954, -8200, -13205, -23534, -17476, -12852, -8827, -6257, -13042, -10519, -3930]
14793c930J066l57J948l970j215l276j903n270l755Q642R064K8Q76k796m198M81
14777h565j821QM461r881l835L476n52l98k472M220P788L67N41O496l21k191J254
14760a425J3872l237j3842q224j709K073j005Q254L299P93J51l682j015p65n247
14745a1709k882K856Q49m038M703m220k173J235M287j044j932Q78o05J412j540
14730a3923L015L786j395o353M438m281J764N811k611l45M620R9n25O859l736
14715b777j0562j080J689J064M198O215q18j563m604p576j700L641m1K746R990
14700a178K47m247n706k511k042M200M665J767J421J156j354M903M197N53o526
14685d55o011J584m283J090k595N09O81M447p89L618r48l70k190o58k712L617
$$ y = [-3930, -2864, -3221, -1273, -5243, -6458, -9734, -11637, -16907, -20662, -12020, -2956, -2928, -2052, -4848, -9046, -8565, -10386, -10378, -5917, -15798, -19633, -16157, -16709, -17107, -19579, -15359, -7571, -7204, -6663, -167, -488, -2679, -1425, 12447, 9210, -4632, -12856, -14565, -12492, -13497, -5243, -1944, -1151, -1000, -4682, -5697, -6462, -11709, -14591, -11735, -10886, -14924, -10221, -14441, -16614, -15379, -11092, -12136, -14068, -13190, -13795, -12383, -13923, -10908, -7122, -8517, -14870, -10432, -14713, -12949, -7138, -9749, -10094, -5474, -5375, -5900, 959, -2777, -13339, -14419, -12730, -11666, -7468, -1253, -2071, -3634, -8238, -15814, -17514, -13873, -13914, -11168, -1178, -931, -5178, -10884, -13395, -15437, -11237, -6572, -4805, -3384, -2228, -3582, 1321, 5518, 6071, -455, -6466, -4882, -9165, -8075, -10670, -10161, -9480, -5033, -5822, -2204, -3152, -3522, -5712, -6370, -9082, -5465]
14669e465j880k424K199J363O116r57j836P399M838n86o707q036K08l754j898
14654a1420L353L686j790p374m45Q742N850M996m414J082k102j622K399m235K19
14639c075o815R67K063n569K12k847L564R57p168m094k130N57k020J9j533J464
14623b5448L816O328N397k30M402l877J20J904k356j607P142o444o428k824K880
14608a7225Q170M300o004k612O26m277O11j032N929N314J144N216P15M89p902
14593f538k047q74o101p299L241M981K125L071j990k673o51k90K2L282q3l122
14577a4946J62O341L427j459L703J373m179k272K6N381N148N43n460M221O462
14562H471M41j082j490p466o790j713K414k402N131K644j034n272pl82P75j053
$$ y = [-5465, -7345, -9769, -7570, -6207, -91, -1048, -2884, 4515, 9353, 8767, 2060, -5976, -5768, -9522, -11420, -8067, -4381, -6171, -13545, -13990, -5248, 602, 5598, 1184, 2266, 164, -1458, 941, -3294, -3075, -9890, -8923, -6860, -12429, -12217, -15064, -11500, -10543, -17711, -21805, -23935, -23378, -25398, -25379, -26912, -25448, -21632, -15304, -9907, -10137, -5735, -9612, -9492, -7588, -9944, -11551, -4409, -10853, -17281, -20105, -17225, -9055, -4755, -10759, -13371, -12745, -17022, -16411, -17443, -11514, -6200, -5056, 160, 875, 1364, -6538, -8585, -9459, -15560, -22859, -19618, -14637, -12512, -9441, -11431, -14104, -14755, -15045, -15023, -11741, -11824, -14946, -14784, -8443, -5016, -6475, -2772, -1399, -5578, -7850, -7824, -2443, 2705, 3248, -2212, 2009, 8471, 8912, 7830, 6340, -1126, -7916, -9629, -7215, -9617, -4486, -1842, -2876, -8148, -8155, -8537, -7762, -8815]
14546h815m727L73Q51m361o429J550J0368N355K705j656J081n513j186J691J920
14531f793O314q726p713j89M265j83m84n638q599N86Q396n94O653O283n29M447
14515b504m52l884o531J492L716L284q62o80k976k852J471K973M089K296o222
14500g642N626J511j975N457o0q28j33k924R41K257m06k146j95Q71J937k104m487
14483d300l887l519L392P518K066l361j217J695l367l750N853J952o673R77J89
14468f432M008O853K223N4l215J218J356j812o214n554j838L958K142m742J253
14453f742K468j699l570j08P461M909k121l445M277j038j555j783J178K918l357
14438b207j264n400j184K051k799K52K756M141N094k948l615j185L34k84Q607
$$ y = [-8815, -13542, -13169, -12318, -16679, -23108, -21558, -11190, -5835, -3130, -4786, -3705, -9218, -10404, -8713, -6793, -479, -9205, -16918, -17107, -12842, -13025, -13509, -19147, -27746, -27160, -18764, -19358, -12705, -6422, -6951, -2504, -2956, -6840, -13371, -11879, -8163, -4879, -5741, -6421, -9397, -12249, -10778, -7805, -3716, -1420, -7642, -2016, -505, -2480, 2977, 2917, 2089, 1956, -968, -27, 2230, 1824, -322, -517, 354, 2291, 187, -4300, -8187, -11706, -8314, -796, 1270, -2091, -3308, -1613, -4980, -8730, -2877, -925, -7598, -6621, -6432, -2424, 4429, 6652, 6706, 3491, 4709, 6065, 4253, -1961, -7515, -9353, -5395, -3253, -7995, -6742, -4274, -5973, -9543, -9651, -2190, 2719, 598, -2847, 1430, 392, -1163, -2946, -1768, 1150, -2207, -3471, -8871, -10055, -8004, -10803, -10551, -7795, -3654, 1440, -1508, -5123, -6308, -5974, -6258, 2349]
14423B349K06o490k330q211R0P729N43l057j35o399P394L314m441j113K160k541
14407a0932k446J851OL935k516p008k690l762q36Q728k500K481K383j316L302
14392a1320Q47n126L159J510j172O996j019k496m701j290J388K363J003L764N137
14377i57O116n379l864m213N989P52k148l330J540k791j76L987J1m63O14J64j519
14360e667k333K138l575k610O226o61k899N50k27m953l150L002J917l519l514
14345a9275L2K880K277j6M73O900J632j360o152m604N99L305K473o59N64k316
14329a3247M044J011P233J08l573p76L345L909K748j622O946J2698J4043J0623
14315D7490O129R149M602M067J1221R949N648J902N84P270L361L429l410j907
$$ y = [2349, 2555, -3935, -6265, -14476, -14386, -6657, -6114, -9171, -9306, -15705, -8311, -4997, -9438, -10551, -8391, -10932, -13378, -11527, -11521, -7586, -10102, -17110, -19800, -23562, -24398, -15670, -18170, -15689, -13306, -14622, -11320, -10473, -15599, -12440, -10930, -12102, -5106, -6125, -8621, -13322, -14612, -13224, -10861, -9858, -6094, -957, 5159, -220, -4084, -8297, -2308, -1556, -3704, -7034, -5494, -8285, -8461, -4474, -4463, -4926, -4312, -4148, -5667, -8000, -5862, -9437, -12047, -5821, -6482, -9381, -8831, -9058, -14011, -17161, -14159, -12242, -15761, -19275, -19243, -16363, -14086, -14102, -13629, -6729, -5097, -6457, -12609, -17213, -16614, -13309, -10836, -11495, -10931, -13247, -9203, -8192, -959, -851, -4424, -5200, -1855, 2054, 4802, 3180, 10126, 22824, 36867, 47490, 53619, 62768, 67370, 71437, 82658, 92607, 98255, 100157, 100741, 108011, 111372, 114801, 111391, 109484]
14301A09484J023o214q151r527o823q698j0722j1977q387m190k784m298o92j036
14287B7008k852N19n367m384m589j900m36n206l859j56k4M350n215l382j812N413
14271a892J297k593L933M756k094k612k911L688N555M606j904n887k408M72K271
14256D277l572k685K864j0701j064M441K015J188j802o10j449M200j260J17J2079
14241H038K177l8j231o624q817p7j38N5J888J431K550l314J324N128j580o892
14225f120J0115j326J432L03j729o605J640j1051k389N287p91L661M303m199L765
14210c704J562l727q27O984n313J157J149l684K060J076m978m861M403J933l72
14195g142j556k397m217j785q81j042J443J049L357J572j156J770J931N285L642
$$ y = [109484, 110507, 104293, 96142, 86615, 79792, 71094, 60372, 48395, 40008, 35818, 33034, 28736, 28044, 27008, 24156, 24675, 19308, 14924, 10335, 8435, 7999, 2793, -1066, -1222, -1246, 3104, -2111, -5493, -7305, -1892, -595, -3188, 745, 5501, 3407, 795, -2116, 1572, 7127, 11733, 9829, 3942, 1534, 2006, 4277, 705, -1980, 884, -9817, -10881, -6440, -4425, -3237, -5039, -5649, -7098, -2898, -4158, -4041, 8038, 10215, 10177, 8946, 2322, -6495, -6572, -6710, -6655, -4767, -3336, -786, -4100, -2776, 2352, 772, -6120, 3995, 2669, 4101, 4404, 2675, -3930, -2290, -13341, -15730, -10443, -11234, -7573, -3270, -7469, -3704, -2142, -5869, -6696, 288, -5025, -3868, -2719, -6403, -4343, -3267, -8245, -13106, -8703, -6770, -7142, -8698, -11095, -15312, -17097, -17978, -19020, -17577, -16528, -13171, -11599, -12755, -10985, -9054, -3769, -127]
14180a27m242n356J603K724n576k799O033n007n508M394l139n064M92P70J495
14165a9307L652M262j022K577j609j455K971Q5l862L575m684Q76K975Q30l246
14150a3382j065J531l546l291L589N427o54L29p878L606O975k749q295l981N464
14135a7920L343N89L833Q471o96m388P17j237K145K886N355k881M09k325j331
14120c030p056p624O679J820k245K65j089M433m878n395j090R31N921j63n215
14105a7736N39l3L678P418m151m592L36K723J208P295k002m047p05k275r883Q7
14089b2140L002j023m419M667O612l960l688J425N397m265L226P425P32m516J002
14074a0523L469J118k145K033m130j713L165k779n65k721p33K377j28m848J960
$$ y = [-127, -4369, -9725, -8122, -5398, -10974, -13773, -7740, -12747, -18255, -13861, -17000, -22064, -21572, -20802, -19307, -15655, -11393, -12415, -9838, -11447, -12902, -9931, -9846, -13708, -10133, -14817, -13941, -10966, -10136, -13382, -14447, -12916, -16462, -19753, -16164, -10737, -11391, -11062, -18940, -15334, -8359, -11108, -19403, -23384, -17920, -14577, -13988, -10155, -1684, -2380, -6768, -6051, -7288, -5143, -2257, 3098, 217, 626, -1699, -3030, -10086, -17710, -11031, -9211, -11456, -11191, -12280, -7847, -12725, -18120, -19210, -18279, -12358, -12521, -17736, -17197, -17230, -13552, -6134, -10285, -14877, -14541, -11818, -10610, -3315, -5317, -9364, -10069, -12344, -22227, -22140, -19138, -20161, -24580, -19913, -13301, -17261, -20949, -19524, -14127, -18392, -15166, -7741, -7009, -11525, -10523, -7054, -5936, -8081, -6048, -10178, -11891, -8726, -11505, -12070, -14791, -15524, -13147, -13275, -18123, -16163]
14059a6163L034l544r38P63N22Q71N965Q69m032l663j234j545N385N527j958P90
14043i351n340m395L596M117l672p330o399J065J598P154N586K445K811j510j922
14028a1547K063k381q304L00P079j962j153O751J639K291L150r837p747J845M895
14013a2918L737J818n27j644M014Q509L67o113n018o334p085j212L803J1623Q793
13998A813J3764Q673N351J266N631L930o557r197j2853j2612q608o571j098o411
13984b3479k315J1393J666k59Q03n40J29j473P417M190q341p431N094m837j031
13969a9014N787p151o601r7J68N512O159j780M55J232m212k458J926N773N71m918
13953a8648k777N429M325O91R70j618l59J488L108l761R45O445P571j832n829
$$ y = [-16163, -13129, -16673, -17611, -16848, -16326, -15455, -9490, -8621, -12653, -16316, -17550, -19095, -13710, -8183, -10141, -9351, -14691, -19086, -15490, -11373, -15045, -22375, -28774, -27709, -26111, -18957, -13371, -10926, -8115, -9625, -11547, -9484, -11865, -20169, -19869, -12790, -14752, -15905, -9154, -7515, -5224, -2074, -11911, -19658, -17813, -12918, -9181, -7363, -7890, -9534, -5520, 2989, 3356, -2757, -7775, -14109, -21194, -22406, -18603, -6980, 1813, 15577, 24250, 29601, 30867, 36498, 40428, 33871, 24674, 11821, -791, -9399, -15970, -17068, -23479, -25794, -14401, -12735, -12994, -12191, -12731, -12602, -14075, -6658, -2468, -10809, -18240, -13146, -17983, -19014, -13227, -20378, -26979, -27076, -26908, -21396, -15237, -17017, -16562, -15330, -19542, -22000, -20074, -14301, -13730, -18648, -21425, -15996, -11671, -10980, -10010, -11628, -11987, -10499, -7391, -11152, -10207, -3762, 3809, 1977, -3852]
13938c852l678k758l476k572P764J538l725l654L13J349p336l90O583k395o41
13923a6930O290R56j123n909j906j43L21m446M230j035n697J046R462M356L891
13908f637k621k625l421P124P639n169k29J909n786m993n963K568K02l252K75
13893b0979k253m99M9N758Q101m572m002L001L878p58l728K303j947n266L749
13878a7165M387K04j964j395k976l342L472O003K140J60j344o747p69J143L5K787
13862a5371K76Q947L291JK015o019n437j931J605N212l300P193O265k895l630
13847c778m924j320p9M658R460L805n032o271n86K40r773J405Q50N55L305r48
13831h433j647m435j85M246Q536M81r345m931P900P66q294r01N820J0138K949
$$ y = [-3852, -7530, -10288, -13764, -16336, -8572, -7034, -10759, -14413, -14100, -12751, -20087, -20477, -13894, -16289, -16930, -10640, -9684, -10807, -16716, -18622, -18765, -18444, -22890, -18660, -19695, -25392, -24346, -14884, -10528, -6637, -9258, -11883, -15304, -8180, -541, -5710, -5939, -4030, -9816, -14809, -20772, -18204, -18002, -21254, -20979, -23232, -23731, -23682, -17924, -9823, -14395, -18397, -15396, -11518, -12276, -16004, -13701, -15648, -20914, -17165, -12778, -12574, -14538, -15933, -18909, -22251, -18779, -12776, -10636, -10476, -11820, -18567, -19336, -18193, -18158, -15371, -15095, -6148, -2857, -2856, -841, -6860, -12297, -14228, -12623, -7411, -10711, -3518, 2747, -148, -3778, -8702, -10022, -10101, -5443, 4017, 7822, 2790, -3481, -4067, -3827, -13600, -12195, -11345, -10790, -7485, -8433, -10080, -14515, -14700, -10454, -1918, -1437, -10782, -15713, -7813, -7047, -15341, -16242, -10422, -284, 2665]
13816B665m468K04o87k93P63k564p76q39o400k834J705m36n243N500O221P219
13800b63J404J014J519L18l236j1552l059M156q52M110k763J905J428N059N206
13785D394m454l995k13n178J397Q640O64M206N501l411l900l871l575n140L288
13770e647N718j800O621P64M06l373M810K846K444L093p43N713n763k130J977
13755A4936J4562P692o71L659L788K864Q580J1473k9K104J2555J3158R424J1745
13741A15840J0635J0118J5790J5700Q957Q813O608J0418L562J658P777Q351O829
13728B31056l84m460l369J336m472p757p686j1968j4326j3563j1224j0711o608
13715A35864p627o610n736q317q618q624n495k504p652r869o557j1176k206K576
$$ y = [2665, -1803, -1599, -2286, -2579, -1816, -4380, -5156, -5995, -12395, -15229, -13524, -13960, -19203, -13703, -7482, -263, 1141, 2155, 3674, 3992, 756, -10796, -13855, -9699, -10551, -6441, -9204, -7299, -5871, -812, 4394, -60, -4055, -4268, -9446, -8049, 591, 1255, 5461, 10962, 7551, 3651, -220, -3795, -8935, -5647, 71, -1729, 4892, 5656, 6062, 2689, 7499, 10345, 12789, 15882, 15139, 20852, 15089, 12959, 14936, 29498, 37190, 36519, 40178, 43966, 46830, 55410, 66883, 66854, 68958, 81513, 94671, 104095, 115840, 126475, 136593, 152383, 168083, 177040, 185853, 192461, 202879, 206441, 208099, 215876, 224227, 231056, 230672, 226212, 222843, 224179, 219707, 211950, 204264, 192296, 177970, 164407, 153183, 142472, 135864, 128237, 121627, 115891, 107574, 98956, 90332, 84837, 82333, 74681, 64812, 58255, 47079, 44873, 47449]
13701D7449J566n446j748l471j51N94o07j067o21m944p110O884m626n142n268
13686A6292K666P097L771k564r696q061p138o36Q892N24j396k25n491l415L136
13671C756l24J503oK077J331R67n683k295K471L766J024o05P76M060k59j0103
13655B456l248P99m05O108L562O512K64n1q19j333n261K257L487q452j301L777
13639H352M6J891l446K603L643m20N79k296n608N643j620m864r71J316N52M025
13623I425K341J994K513l856n608L858L696P64J56n13J495k062J711j704l534
13608A0676n95L322K679n01M538n64n64l460n758m824J022P841k215k223L502
13593A2876R50J009O165P20n021n814P9k654p795m488Q27j014J3048k742k326
$$ y = [47449, 49015, 43569, 41821, 38350, 38199, 38793, 38186, 37119, 36498, 31554, 24444, 31328, 26702, 21560, 16292, 18958, 26055, 29826, 27262, 17566, 9505, 2367, 1731, 10623, 11147, 9751, 9526, 4035, 620, 3756, 3432, 4935, 4929, 7006, 8337, 9304, 3621, 1326, 3797, 7563, 8587, 7982, 8758, 12818, 12559, 2456, -792, 7, -398, 5710, 9272, 15784, 16048, 15997, 15178, 13845, 8584, 10841, 14328, 5876, 4575, 8352, 8398, 10289, 6843, 9446, 13089, 12669, 13248, 10952, 5344, 10987, 9367, 4503, 3532, 4848, 5400, 9425, 11766, 13760, 16273, 12417, 6809, 10667, 14363, 15127, 15283, 14770, 16265, 14203, 15914, 14210, 10676, 10081, 13403, 16082, 15581, 20119, 19555, 18991, 15531, 9773, 4949, 5971, 13812, 11597, 9374, 12876, 13826, 14835, 21000, 21720, 16699, 10885, 10964, 8310, 515, -3973, -3146, -4160, 8888, 6146, 3820]
13578C820O20L643K268q43L853k304k688p48N304j731n238j019j443J35K719O018
13562A2366j425L057n830l344L569M339o092n986N11m291O4P767m074m590M127
13547A68J063L725j929j068j090k395o566l622j238j317L840L662L624n545J123
13532g565O39o828N28j092o073J469J0716P959l596m870L688K525n792K496L407
13517b389k741M52Q80N265J448q81r05M07p5N034j858l359l942p38o39k906k973
13500i920L637L194o28j87K818K852q733k301p69K411P602M101j971k138l708
13485c740K892O531m905j0092j700L749n185L794L715p382K964k705l057J073
13471a4048m57M102M477j365o863rJ771P812K803l408n057N82J262K625K363P719
$$ y = [3820, 4440, 8083, 10351, 9508, 13361, 11057, 8369, 7621, 12925, 11194, 5956, 4937, 3494, 3629, 6348, 12366, 10941, 13998, 8168, 4824, 8393, 12732, 6640, 654, 1165, -3126, -3062, 4705, 631, -3959, 168, 1231, 4956, 3027, 1959, 869, -1526, -8092, -11714, -12952, -14269, -10429, -6767, -3143, -8688, -7565, -6926, -13754, -13226, -14318, -20391, -18922, -8206, -247, -3843, -8713, -5025, -2500, -8292, -5796, -2389, -5130, -4678, -3798, 1467, 2915, 2034, 1129, 1536, 1461, 6495, 4637, 1278, -2664, -3402, -4041, -6947, -9920, -6283, -3089, -3717, -3904, -1086, 1766, -6967, -9268, -10037, -7626, -24, 4077, 2106, -32, -3740, -848, 5683, 778, -9314, -11014, -7265, -12450, -8656, -4941, -12323, -9359, -12064, -15121, -14048, -14505, -10403, -5926, -7291, -14154, -14163, -12392, -4580, -1777, -5185, -10242, -9660, -8398, -5773, -3410, 4309]
13455D309l388q075K121k095J775r03j469k343k048l414j635M22N111K267l292
13440a2657l659N036L465l33j591n06J62k247M067K421m835k053r52L171J721
13425h790k434k351j23J325q80L193l79m018l755m426K071P026m489j322K76n976
13409b5052K240O322O667O91p836k897M645O55N108P954K814P47l759J885k657
13394b473m341n319q785P377Q361j963j731J227m102m213m338r96J057j216N190
13379a6265L396j720O0P546K136n158K067L050O57k298k206m974L791J41R012
13364g65j077m00P27P42J352K640o30n022q42M753k522P319J809j0514m126L224
13348c332M631o83L376N01m455l410k049k562k255P86K101j485r447q40K350N024
$$ y = [4309, 921, -7154, -5033, -7128, -5353, -6256, -7725, -10068, -12116, -15530, -17165, -16743, -11632, -9365, -12657, -16316, -11280, -7815, -8148, -9739, -10245, -10083, -12330, -8263, -5842, -10677, -12730, -13682, -10511, -8790, -11224, -13575, -13698, -12373, -13253, -10060, -10439, -14457, -18212, -22638, -20567, -13541, -18030, -19352, -19076, -25052, -22812, -16490, -9823, -9132, -16968, -19865, -15220, -14565, -9457, -1503, 1311, 2058, -1701, 184, -2473, -6814, -12133, -20918, -13541, -5180, -7143, -8874, -7647, -11749, -15962, -20300, -21296, -20239, -21455, -16265, -12869, -14589, -14529, -6983, -4847, -10005, -7938, -4888, -4231, -6529, -8735, -13709, -9918, -9777, -765, -1842, -2242, -1515, -773, 579, 3219, 2589, -2433, -3275, 1478, -1044, 6275, 8084, -2430, -6556, -3332, 1299, 616, 3992, 4493, 38, -3372, -5421, -7983, -10238, -9452, -7351, -8836, -18283, -19123, -16773, -11749]
13332a1749K208K305q50O894J84j111Q45n299l297k700k82O745k156n218o925
13317b0406N97Q582O521R19M595L339O817N687J1447Q222K649N125J2246Q462
13303F4802J3271K3107M0200N9438Q2499J09248J37054J58515J61326J52559J22165
13292A124184O4607R210m9886j06055j40347j54591j45990j15915r9912p3360
13282C11945m2134k5503k3742k0933j1924j3246j2324r749j5611o742q669o141
13270A15227n037p077m355l963k379p89J37k253n483j834K366k752m985J352L571
13255H1746p694r266l220q038L618K403j0580N120O808p835j3609q047L932J527
13241C6865O537k380k4K625j47n619o878p806j2621k76L717p839n292M036R410
$$ y = [-11749, -9541, -7236, -8086, -1192, -1008, -2119, -1274, -6573, -9870, -12570, -12852, -6107, -8263, -13481, -20406, -19809, -11227, -4706, -3787, 808, 4147, 10964, 16651, 28098, 36320, 38969, 44094, 56340, 64802, 78073, 101180, 141380, 200818, 283317, 392565, 529619, 688134, 849460, 1002019, 1124184, 1188791, 1198001, 1148115, 1042060, 901713, 747122, 601132, 485217, 385305, 311945, 269811, 244308, 220566, 199633, 187709, 174463, 162139, 152390, 136779, 130037, 121368, 115227, 110190, 103113, 98758, 94795, 92416, 91627, 91764, 89511, 84028, 82194, 84560, 81808, 76823, 78175, 81746, 74052, 64786, 61566, 53528, 57146, 59549, 48969, 54089, 60897, 53062, 39453, 31406, 35338, 36865, 43402, 41022, 40998, 43623, 43476, 37857, 30979, 23173, 10552, 10276, 13993, 6154, 862, 4898, 14308]
13226A4308K006k720PJ880k682k207r40L822L859o560r066m327Q530N12o388N826
13210E860N528L391j266J53p90J819m067M350O351L400m30O47l40N164M13o580
13194B3603l435o108r944q61Q939J2149M638Q43K536J684J6O603Q275L016J097
13179E3051L982j182l030N034J678M70o978j2000n127j067r04j1221j0071M032
13165A6667P445l728l470N458j688N860M119q91p189j851M678M791N272L724l144
13150C6053o267o450p85l683m640L662M698J232j1069p556k752R618L021M119
13136A9201Q86k874J70N672Q673O077j467J378l89P217R359J2760Q949J3624O772
13121I6008J524Q571J4545R272N021P639O15k089j89o669o431p908n197n159P
$$ y = [14308, 16314, 13594, 13601, 15481, 12799, 10592, 9652, 13474, 17333, 10773, 1707, -2620, 5910, 6422, 34, 5860, 11388, 14779, 13513, 13666, 12876, 14695, 10628, 14978, 21329, 24729, 24299, 24946, 24606, 29770, 30183, 23603, 20168, 14060, 4116, 3255, 12194, 24343, 28981, 29824, 32360, 34044, 34060, 40663, 48938, 51954, 53051, 57033, 55851, 52821, 57855, 59533, 60003, 53025, 41025, 35898, 34831, 33927, 22706, 12635, 16667, 24112, 20384, 16914, 22372, 20684, 26544, 30663, 29772, 22583, 20732, 25410, 30201, 35473, 39197, 36053, 29786, 23336, 22551, 18868, 14228, 17890, 22588, 23820, 12751, 5195, 2443, 12061, 15082, 19201, 20087, 17213, 17383, 23055, 31728, 37805, 36338, 37716, 37327, 44544, 53903, 66663, 75612, 89236, 96008, 97532, 106103, 120648, 129920, 134941, 142580, 143195, 141106, 140917, 134248, 127817, 119909, 114712, 109553, 109560]
13106A09560j5788k3870p632o415r115l900p521m059j452K461J336o417q234l78
13092A8576N327l16P742J1262m579n053q728k413m835J938J0274N356j519j161
13078C1871J859J701M90q719j734M601q329n877l169l451K420N633J2278M880
13064C4454l417L288M923Q50L570M186N509N436m482O45R6n360m320k90p31j1178
13048C3179m449j656P506j919o854p999l96M015j111J372J983n66P690P037j458
13033C6374O577N852M061J572J678j868k530n183o411k908k460M115Q332O92L473
13018E1366k505q8k425k255M690J133m075j486K294K170J493N996O908j423l994
13003E7799Q905J1690J0079J666j170J2585Q772P215O488K3065J9496J9215J6465
$$ y = [109560, 93772, 69902, 62270, 55855, 46740, 42840, 35319, 31260, 29808, 32269, 33605, 27188, 18954, 18576, 23903, 23587, 31329, 42591, 38012, 32959, 24231, 21818, 16983, 18921, 29195, 34551, 33032, 31871, 33730, 35431, 35921, 27202, 25468, 30069, 21740, 15863, 12694, 9243, 11663, 17296, 29574, 34454, 31037, 34325, 39248, 40098, 43668, 47854, 53363, 58799, 54317, 54962, 55058, 49698, 45378, 45088, 44357, 33179, 28730, 27074, 34580, 32661, 25807, 17808, 17412, 21427, 20316, 21688, 23671, 23105, 30795, 37832, 36374, 42951, 48803, 52864, 54436, 56114, 54246, 51716, 46533, 40122, 37214, 34754, 38869, 47201, 47893, 51366, 48861, 48773, 46348, 44093, 48783, 49916, 45841, 44355, 46649, 48819, 50312, 56308, 63216, 61793, 57799, 66704, 78394, 88473, 90139, 88969, 101554, 110326, 117541, 124029, 147094, 166590, 185805, 202270]
12990B02270L926K045J714m933l456j0669j1764j9370j7758m968m011K016K500
12977A37542j285L243J2004M165L592Q522M488L497J5377Q092N225J1279K544
12964B18285J287J398p82K47K318J1158J0382P208j770N848L501N379P63o403
12950B58819J328J841J120J245m587k151R291O015L592Q3K141P772J1441J4794
12936C12744N846J3558J0597R248J3999J5539J3130J5235K3319J6015J0314R137
12924D68681J4206J8267K0071J4465J9071K0648K3017K7427L6078L9780L7978
12913G39689M6807N2569O4963P7565P3348O1742N2134K8535K1767K5395L5968
12902A280482N2060M6578K6739J5917K3006M6202O8362R1240J17094J41353J59436
$$ y = [202270, 206196, 208241, 209955, 205022, 201566, 190897, 179133, 159763, 142005, 137037, 133026, 135042, 137542, 136257, 139500, 151504, 155669, 159261, 167783, 172271, 175768, 191145, 199237, 204462, 215741, 218285, 219572, 220970, 220188, 220435, 222753, 233911, 244293, 251501, 249731, 255579, 259080, 264459, 265222, 258819, 260147, 261988, 263108, 264353, 259766, 257615, 266906, 272921, 276513, 276596, 278737, 286509, 297950, 312744, 318590, 332148, 342745, 351993, 365992, 381531, 394661, 409896, 433215, 449230, 459544, 468681, 482887, 501154, 521225, 535690, 554761, 575409, 598426, 625853, 661931, 701711, 739689, 786496, 839065, 904028, 981593, 1054941, 1116683, 1168817, 1197352, 1219119, 1244514, 1280482, 1332542, 1379120, 1405859, 1421776, 1444782, 1490984, 1559346, 1650586, 1767680, 1909033, 2068469]
12891B068469J82990K05417K33823K71596L15844L61991M25006M98620O07697
12882E171453P55499R15742J083983J278533J491173J776001K182985K846873
12874A7502242M000151N975456R021817J3142305J8094734K3590742K8203755
12867A19531202K9426718K8388393K4831205J5357877M790861m670369j5430078
12860B02225809k2327658k5902749k8259697k4247581j9321808j5471702j0851098
12853E5843516p158086m989865l762469l039465k594266k278231k045740j835855
12845B8139539j624719j444672j265666j110219r88948q91339q14105p47113o87896
12836A8564862o39605n83085n44952n07502m74595m46147m43795m55180m65129
$$ y = [2068469, 2251459, 2456876, 2690699, 2962295, 3278139, 3640130, 4065136, 4563756, 5171453, 5926952, 6842694, 7926677, 9205210, 10696383, 12472384, 14655369, 17502242, 21502393, 27477849, 36499666, 49641971, 67736705, 91327447, 119531202, 148957920, 177346313, 202177518, 217535395, 222326256, 217655887, 202225809, 179898151, 153995402, 125735705, 101488124, 82166316, 66694614, 55843516, 48685430, 43695565, 39933096, 36893631, 34299365, 32021134, 29975394, 28139539, 26514820, 25070148, 23804482, 22694263, 21705315, 20813976, 19999871, 19252758, 18564862, 17925257, 17342172, 16797220, 16289718, 15815123, 15368976, 14925181, 14470001, 14004872]
12827A4004872m57835m54199m53688m42946m08506l80711l52268l22414l07765
12818A0424540k93534k73307k68323k54199k43041k37119k23017k19384k08223
12809H204393j96150j98988j83228j84366j77347j64131j61073j55477j50721
12800F632912j49472j41057j38515j29472j25274j24691j15951j10908j11330
12791E486242r7071r3155r3166j01673j01246q6196r5567r0869r1844r2502q4420
12780D458533p8163p0359p0784o0146n6602o0973n7520n6628m8796m2553m7459
12769C808550n5512n2748n0074n2397o1842o3420n6802m8301m9072k8649j0201
12758C279532J7328N2229R9140J47580K06501K54042K61788K46674J79851M9038
$$ y = [14004872, 13547037, 13092838, 12639150, 12196204, 11787698, 11406987, 11054719, 10732305, 10424540, 10131006, 9857699, 9589376, 9335177, 9092136, 8855017, 8632000, 8412616, 8204393, 8008243, 7809255, 7626027, 7441661, 7264314, 7100183, 6939110, 6783633, 6632912, 6483440, 6342383, 6203868, 6074396, 5949122, 5824431, 5708480, 5597572, 5486242, 5389171, 5296016, 5202850, 5101177, 4999931, 4913735, 4818168, 4727299, 4635455, 4542953, 4458533, 4380370, 4310011, 4239227, 4179081, 4122479, 4061506, 4003986, 3947358, 3898562, 3856009, 3808550, 3753038, 3700290, 3650216, 3597819, 3535977, 3472557, 3415755, 3367454, 3318382, 3289733, 3279532, 3296860, 3349089, 3448229, 3595809, 3802310, 4056352, 4318140, 4564814, 4744665, 4793703]
12748D793703o1844j79276k79011l09699l29805l01598k49980k11425j63985j23110
12738B583970r7572q4991p1326p2353o5074o6484n6654n5439o3725n5565n3067
12727A841720l5632l1193l4735l0401k9926l1045k3846k6266k9320k3794k0097
12716A525465l1689k1189j8594k0753k8453k4151j8222j4335k206N892J5860L4801
12704A402426N4308O1516P3124Q4598O3487L6917M842l0798p3141r2827j01440
12693A483012j04860r6523p6185n9783m5641m1209l3114k1264k0140k0090k5343
12682I38860k6792j9759k2551j9791j5125j4532j4747j5236j5058k0210j8578
12671G36481k0561j8426j5422j980l744j181q179o903j4797p882k457o04n637
$$ y = [4793703, 4731859, 4552583, 4273572, 3963873, 3634068, 3332470, 3082490, 2871065, 2707080, 2583970, 2486398, 2401407, 2330081, 2257728, 2192654, 2126170, 2069516, 2014077, 1950352, 1894787, 1841720, 1806088, 1774895, 1740160, 1709759, 1679833, 1648788, 1624942, 1598676, 1569356, 1545562, 1525465, 1493776, 1472587, 1453993, 1433240, 1404787, 1380636, 1362414, 1348079, 1345873, 1351765, 1367625, 1402426, 1456734, 1518250, 1591374, 1675972, 1739459, 1776376, 1781218, 1750420, 1677279, 1584452, 1483012, 1378152, 1281629, 1205444, 1145661, 1100020, 1058811, 1025697, 1004433, 984293, 964203, 938860, 912068, 892309, 869758, 849967, 834842, 820310, 805563, 790327, 775269, 755059, 736481, 715920, 697494, 682072, 680092, 676348, 675167, 666988, 660085, 645288, 637406, 634949, 634345, 628708]
12658F28708q010p469j2611j1675l710p488j2187o744j4161j1144m812j709j1510
12645E15478o697j5865l676J082m48r085m715q176l459K301q943p057k169p603
12631D40968q925j1104L614m411j2962l893r977p580r887q947p540j579p593j1502
12617C38682o088k894j885J204k305o203m515r378j1035j098n676n025n39j149
12603B82096j291n943n903m504l604l12o620q395r199J832K137p715q493m583
12589B19503o125L874J754o012l784j675K163j0460j4463q585l610J631J708r48
12575A74971r062p440J264M28L965K36L59k894m30Q96K241N769P488O252O463
12560A90506k011q922q529j0453q845j2714j3615j0967p052l283m493k979M44
$$ y = [628708, 620698, 613229, 600618, 588943, 585233, 577745, 565558, 558814, 544653, 533509, 528697, 526988, 515478, 508781, 492916, 489240, 490322, 489874, 480789, 476074, 467898, 464439, 466740, 457797, 450740, 448571, 440968, 432043, 420939, 424553, 420142, 407180, 403287, 393310, 385730, 375843, 366896, 359356, 357777, 350184, 338682, 332594, 329700, 327815, 329019, 326714, 320511, 315996, 306618, 295583, 294485, 288809, 283784, 283245, 282096, 280805, 274862, 268959, 264455, 260851, 260539, 253919, 245524, 236325, 238157, 240294, 232579, 224086, 219503, 213378, 217252, 219006, 212994, 209210, 207535, 209698, 199238, 184775, 176190, 172580, 174211, 175919, 174971, 165909, 158469, 159733, 160161, 164126, 164362, 164721, 161827, 161397, 162293, 164534, 170303, 177791, 184043, 190506, 188495, 179573, 171044, 160591, 151746, 139032, 125417, 114450, 107398, 104115, 99622, 96643, 97087]
12547I7087j460J203L962Q729j808p08K019O630j986j950n10L834K649p373p619
12532A02699o784J520j970k551L682k685r181J440J0672j810m772p334j87N354
12518H8093L628l404R54N171K00K40L485o533k656n897L265Q878n109r16j692
12503H7707o730n041l731P411J2245R765r680q201k949l618L904O277N72K946
12489I0877J513l610r029l731l646k540j755L300k412l463n860L068J567j69K130
12474F6240J381L702j374k792n682q718k453L846M981M114j325n168J55o32j997
12459E4278K661O958N268l910o240k035N986r48N41r88L061M759Q510Q159L661
12444H9721K856N677J0871J0999J2747J6039L3853N5227O7643R5824J30031J53574
$$ y = [97087, 95627, 96830, 100792, 109521, 107713, 107005, 109024, 115654, 113668, 111718, 111208, 115042, 117691, 110318, 102699, 95915, 97435, 95465, 92914, 96596, 93911, 84730, 86170, 96842, 95032, 90260, 82926, 82739, 88093, 91721, 88317, 89271, 94442, 94642, 94882, 98367, 91834, 89178, 83281, 86546, 95424, 90315, 89399, 87707, 80977, 75936, 72205, 79616, 91861, 101626, 91946, 83745, 80796, 77178, 81082, 87359, 87931, 90877, 92390, 88780, 79751, 76020, 72374, 69834, 68079, 71379, 68967, 65504, 59644, 62712, 64279, 64110, 66240, 67621, 71323, 69949, 67157, 61475, 52757, 50304, 54150, 59131, 63245, 61920, 56752, 56907, 56275, 54278, 56939, 63897, 69165, 65255, 59015, 56980, 62966, 62018, 62559, 61571, 64632, 69391, 77901, 86060, 89721, 92577, 98254, 109125, 120124, 132871, 148910, 182763, 237990, 305633, 401457, 531488, 685062]
12432F85062J53011J49879J39010Q8538L4334l4184r6851j26157j43328j54934
12422F94380j27779j01785q5846o2306l7416k2736j3022j0001j4009q317j3526
12411A97637j0817m285n350p557p059m873o900p472Q82Q4n970m082l411o217q296
12396A16314m237q429n224k388M823r79k821n246M071l1Q20n671j1110q205O56
12381G2343K390l994m126j070K97j312k556O98N448n86k072m447R55L747k221
12366F3494m492n482p77J296j024r292L327K800j559J559K950M43R29K063J938
12351E8173j693o362n762j989m309K356O980j923R656Q175o603o929p288r346
12337C3136l942m228J884M440k004K82m257j222N804M863p62j441n06j52N165
$$ y = [685062, 838073, 987952, 1126962, 1215500, 1249834, 1215650, 1118799, 992642, 849314, 694380, 566601, 464816, 378970, 316664, 279248, 256512, 243490, 233489, 219480, 211163, 197637, 186820, 182535, 177185, 169628, 162569, 157696, 150796, 143324, 144206, 144290, 138320, 134238, 130827, 124610, 116314, 112077, 103648, 98424, 96036, 100859, 99880, 97059, 91813, 95884, 95853, 96673, 91002, 79892, 71687, 72343, 74733, 70739, 66613, 65543, 65840, 64528, 61972, 62670, 68118, 67532, 65460, 61013, 61968, 65715, 63494, 59002, 53520, 52743, 54039, 53015, 43723, 47050, 49850, 48291, 49850, 52800, 53243, 54172, 56235, 58173, 56480, 50118, 44356, 42367, 38058, 40414, 47394, 45471, 55127, 63302, 56699, 49770, 42482, 33136, 29194, 24966, 26850, 31290, 29286, 29568, 25311, 24089, 29893, 34756, 33994, 32553, 32047, 31895, 37060]
12322C7060Q958k264L243m841p820J581N177N068o042K529L362K192j378L680
12308E0505r83q671r260o51L070o303k76k689r4n29j649j862K898J537K153l63
12292B6833J140o185l491l872J050r29j194p86N267O431k459j726J907N994M719
12277C2699J196n846J656p742p312N37M661n06k50K040K927j377J640n298j1099
12262G926l555j92R993O045N481J141p812L881j269k905J478m713L074k8K416
12247B0961P54o383p548L910k705o999M702M007j489O73O019O474O91m100n502
12232A3465K939K307o808k536K86L721M452p13N260M91n927j1146p205l390J0475
12217E671K517K048O017L98r795p87J105J315j958K085J959L026N388j450o10
$$ y = [37060, 46018, 43754, 46997, 42156, 34336, 35917, 41094, 46162, 40120, 42649, 46011, 48203, 46825, 50505, 49522, 40851, 31591, 30940, 34010, 27707, 27431, 24742, 24648, 24119, 22470, 20608, 23506, 25043, 27196, 26833, 27973, 21788, 18297, 14425, 15475, 14546, 13352, 12566, 17833, 24264, 21805, 20079, 21986, 27980, 32699, 33895, 28049, 29705, 21963, 14651, 15188, 19849, 19343, 19093, 21133, 24060, 22683, 24323, 19025, 7926, 4371, 4179, 14172, 20217, 25698, 26839, 19027, 22908, 21639, 18734, 20212, 15499, 18573, 18545, 20961, 21715, 15332, 7784, 11694, 8989, 1990, 6692, 10699, 9210, 9883, 15902, 22376, 23067, 18967, 13465, 16404, 18711, 11903, 9367, 9653, 13374, 17826, 17113, 22373, 22864, 16937, 5791, -1414, -4804, 5671, 8188, 10236, 16253, 16651, 6856, 6069, 7174, 8489, 6531, 8616, 10575, 13601, 18989, 17539, 16929]
12202A6929k740l907M078k71o905L191J038m236j801j737O10K046K351j172l780
12187C694m09M209M345l596k662n677j770l023N704L553R72R2n669j949L34M734
12171B882Q321K866L92j0503k457R190N027j019n38O614P982n932j2978J647M675
12156A6169m285j677J654m390J184K044j605L843m091k665N171j501k149P81n80
12141G903L697L581q066o743M445L162L565O59M131K996m534p433k348j072k856
12126A087l694M03Q091j143o322j344N297r13l125K886r64L547K260J145Q18n15
12110G514K19N345L849l130K565Q7o4L046M27L114l265k02k506r68p617o029l882
12093a497L333N085R742j226m608M122l191n121q402m473K560J309l501J045N661
$$ y = [16929, 14189, 10282, 14360, 14089, 7184, 10375, 11413, 7177, 5376, 3639, 4249, 6295, 8646, 7474, 3694, 3285, 7494, 11839, 8243, 5581, -96, -1866, -4889, 815, 4368, 5340, 5432, -237, -2186, -1852, 2882, 11203, 14069, 14461, 3958, 1501, 10691, 15718, 14699, 14161, 20775, 28757, 22825, 9847, 11494, 16169, 11884, 10207, 11861, 7471, 8655, 10699, 9094, 12937, 8846, 6181, 11352, 9851, 7702, 8483, 7903, 11600, 15181, 7115, 372, 4817, 7979, 11544, 12203, 16334, 19330, 14796, 7363, 5015, 3943, 1087, -2607, -2204, 5887, 4744, -1578, -2922, 2375, 1462, -1663, 1223, 259, 3806, 6066, 7211, 8029, 7514, 7733, 13078, 16927, 13797, 16362, 16449, 16385, 19431, 19858, 22972, 19707, 19505, 16999, 16031, 8414, 2385, -1497, 1836, 6921, 16663, 15437, 10829, 14951, 11760, 6639, -1763, -6236, -3676, -2367, -5868, -4823, 838]
12078H38J583n287k436J1663N185r11j375j549p063J045N195o18J292j700K408
12063H270Q530N560K394L302p252l985K944n352j460l627k434j66Q009L189o128
12048A1794K740k498r147M662P595j025p62n901k554m282P98Q12J759P273M386
12033A5650l571j744M018M184K619Q376K513K264r027r414o71n429m795k588n77
12018A808K745N638n63k755l282K740K41j529L994k77k03k774k669k518l533L974
12002A037J208k214Q35O86N571k843m139q81p864l35M870O329P648R50L758m155
11986A0461o574n176m963M829j497O754O92K876O334N220R202J7762J8135R975
11972G4030J1918K245k5313k1677n912o772j0737k493j663R620P484K123J3564
$$ y = [838, 2421, -2866, -5302, 6361, 11546, 10635, 9260, 7711, 648, 1693, 6888, 6270, 7562, 5862, 8270, 16800, 22360, 24754, 28056, 20804, 16819, 19763, 14411, 12951, 9324, 6890, 6724, 14733, 17922, 11794, 14534, 12036, 2889, 7551, 15146, 14121, 13359, 7458, 4904, 622, 1420, 2232, 3991, 11264, 15650, 12079, 10335, 14353, 18537, 21156, 29532, 32045, 34309, 25282, 15868, 15197, 9768, 4973, 2385, 1808, 4553, 10191, 9628, 6873, 3591, 6331, 6572, 5043, 9037, 8760, 8557, 5783, 3114, 596, -2937, 1037, 2245, 31, 866, 1552, 7123, 4280, 141, -740, -8604, -8939, -4069, 2260, 9908, 10858, 14616, 10461, 3887, -1289, -6252, -1423, -2920, 3834, 4526, 7402, 13736, 18956, 28158, 45920, 64055, 74030, 85948, 88193, 62880, 41203, 35291, 28519, 17782, 15289, 13626, 23246, 30730, 32853, 46417]
11959D6417J2996K627n527j4714j2313q133l884m093j712J040N930j944l07J133
11945A7516k075K241M292j562L714j150m850l275L619p840q26L622j784K14L8
11930A1894n36j1331l882J0229K776k441n706k6n297n494M104j689L601K883M334
11915C419M728m310J406m292L7M042O797M984j0688j005l023n819J392O889l4
11900D523n865k618l443R87m550K045J291Q81M533M632K013L507j2P97N012p185
11884F548n245j803j122l23o439j787L719q43N844J599N01J127M920L921K63K70
11868A1150k775l256P088m307r40j822m077j976J618k480m906O696M599n300m126
11853d814K959j431K431O064R56k603M08J460k761L1L224j458m312M39j879K960
$$ y = [46417, 59413, 62040, 56513, 41799, 29486, 21353, 17469, 13376, 11664, 12704, 18634, 16690, 16383, 17516, 15441, 17682, 21974, 20412, 24126, 22976, 18126, 14851, 18470, 10630, 9804, 13426, 11642, 11856, 11894, 11358, 27, -3855, 6374, 9150, 6709, 1003, 977, -4320, -9814, -5710, -7399, -3798, -915, 3419, 8147, 3837, 5243, 951, 988, 5030, 11827, 16811, 6123, 5118, 2095, -3724, -2332, 4557, 4523, -1342, -3960, -7403, -6416, -10966, -8921, -7630, -6749, -2216, 2416, 4429, 7936, 7924, 8721, 13733, 6548, 1303, -500, -1622, -1945, -8384, -10171, -6452, -7295, -1451, 148, 649, 1776, 6696, 10617, 10880, 11150, 8375, 5119, 12207, 7900, 6960, 5138, 1061, -915, 703, -1777, -6683, 13, 4612, -688, -4814, -1855, -3286, -855, 5209, 6165, 3562, 3970, 5430, 2669, 2700, 5924, 4466, 154, 593, -1286, 1674]
11837A674O791l569j911n036o69o7k745M612l316k108j252Q55j004M295O790L803
11821G143P17j192O200n291q696K828J27k931n302m188o948j389P072O861N80
11806d409p265k2K645L256q051o19O972j617j592K421J966k946l311L954L900
11791d718K438k301l247m12N090L532K218M940k120p074p843k767J063J50n254
11776a6305j100M203j317J898N627L668l22l268j000m556l362O908M511l115k704
11761a0234J0569M352p997j721M734q81m141n880M673l386K591M944N732j146
11747B209l340l300o013o714l88R91K737L434Q859M104O529J3371J0736k70k651
11732C0294O720l948j0322p668j1562j4238r640m629j589O836J0534K225m625
$$ y = [1674, 8465, 4896, 2985, -2051, -2720, -2787, -5532, -920, -4236, -6344, -7596, -6741, -7745, -3450, 3340, 7143, 7860, 6668, 12868, 7577, -1119, 1709, 1836, -1095, -6397, -10585, -17533, -18922, -11850, -4989, -4409, -11674, -11696, -9051, -5795, -13846, -14465, -7493, -9110, -10702, -8281, -6315, -9261, -12572, -8618, -4718, -2280, -4581, -7828, -8240, -3150, 382, 2600, 7540, 5420, -1654, -9497, -12264, -11201, -11051, -16305, -17405, -13202, -14519, -12621, -6994, -3326, -3648, -6916, -7916, -12472, -15834, -8926, -4415, -7530, -10234, 335, 4687, -3310, -5031, -297, -1178, -5319, -11199, -6526, -9912, -7321, -2377, 3355, 2209, -1131, -4431, -10444, -17158, -17546, -16555, -13818, -10384, -1525, 2579, 9108, 22479, 33215, 32945, 30294, 37014, 33066, 22744, 15076, 3514, -10724, -20364, -24993, -26582, -19746, -9212, -6987, -11612]
11719a1612j465N750J257m387m592j65K565o8L660Q52N483l668m609k660L418
11704a0241J253o099R9K310n154K438k404K06O311k72L517P210n833n966j0074
11689b2699k380L952Q933J0817l712p019p377q01k250l223O807M546k1L907L72
11674a0148K268m917k879L810l541l113m448j450M02R533J1266Q553J153m636
11660A853n137m133n543q33K073n739L607J308L303j665j118J736L756Q77k475
11645h130N79J728n98J639N38o07l175n804l514j684L756K545l52J691L228m596
11629a2756n583P07J569k351Q621O070m592k038M82k783n472K11M667j902o058
11614b1208K994J230Q86Q31J55j742l76J477K04o890O60K560m613l90N671L230
$$ y = [-11612, -13077, -7327, -6070, -10457, -15049, -15214, -12649, -12717, -9057, -8205, -2722, -6390, -10999, -13659, -10241, -8988, -15087, -14988, -12678, -17832, -15394, -17798, -17592, -11281, -11553, -8036, -826, -6659, -12625, -22699, -25079, -21127, -12194, -1377, -5089, -12108, -19485, -20286, -22536, -25759, -18952, -14406, -14427, -10520, -10148, -7880, -12797, -15676, -11866, -15407, -18520, -22968, -24418, -24016, -14483, -3217, 5336, 6489, 1853, -3284, -7417, -12960, -13793, -11720, -17459, -13852, -12544, -9241, -10906, -12024, -10288, -6532, -5655, -8130, -7551, -5823, -6421, -4782, -4244, -4851, -8026, -13830, -17344, -19028, -15272, -12727, -13079, -11388, -8160, -12756, -18339, -17632, -16063, -18414, -9793, -3723, -8315, -10353, -9871, -12654, -18126, -17915, -13248, -15150, -21208, -18214, -16984, -16098, -15267, -15112, -16854, -17230, -15753, -15549, -22439, -21779, -19219, -23832, -24222, -18551, -15321]
11598a5321m215j515J106P437Q494j278m521k950M054N631q87K366n346p306M327
11583i924j303M609J474j811n9K937j1710q572K555M492q83l791k057J3264R041
11568a738k567k070p543p710J565m949m547P662Q634J0769M720L529o847l759
11554d851J309N144L685j381p529o617k480P303L323l297J445N410l186r8n477
11539g297q04L469K765k547k135k224l87M13J084P87l75k645j932m964K674K849
11523a1269O372L733k636R12j742p167l598n12L632M07j057n767o966L981q22
11508b2499k352L331m675k575j77k539Q881R617L217N777Q50j912o377j809K842
11493a0400l016J401J864K739M173M947k068j697m01r1l631p166j606P396J0578
$$ y = [-15321, -19536, -21051, -19945, -12508, -4014, -5292, -9813, -12763, -8709, -3078, -3965, -1599, -6945, -14251, -9924, -11227, -6618, -5144, -6955, -7014, -4077, -15787, -24359, -21804, -17312, -18195, -21986, -24043, -10779, -1738, -4305, -6375, -13918, -21628, -20063, -25012, -29559, -21897, -13263, -2494, 2226, 5755, -1092, -4851, -3542, 1602, 5287, 3906, -3623, -10240, -12720, -5417, -2094, -5391, -3946, 1464, -1722, -1820, -7297, -8101, -4632, -1867, -4414, -6549, -8773, -9160, -8747, -7663, -6876, -7251, -9896, -11828, -16792, -14118, -11269, -4897, -1164, -3800, -2888, -4630, -11797, -15395, -15907, -12275, -11868, -12925, -18692, -25658, -21677, -22499, -24851, -21520, -26195, -28770, -28947, -31486, -22605, -12988, -9771, -3994, -3144, -5056, -11433, -13242, -10400, -13416, -12015, -10151, -7412, -3239, 1708, -360, -2057, -2458, -2549, -6180, -13346, -14952, -7556, 3022]
11478C022P65j1083j3167k675N072M128q6O026m820m913m077N342P188k157L23
11463a1112J871m398j067N93N690M291l537J701j402p356L114O072J627M66j391
11448d838O06o902M648P430n464p50N75l285k90M947r88m556M52l07j024p47J680
11431h813K120l987P96N616p135J6P82l266L37N072K536J162M830M752M72o408
11415a118o839K896k151O6J414O696J1500N093R176N466L440o661j2245j0787
11401E946k66P57o831p02j414j128K725M663r36q752l599o1J788P071K519R415
11385A1195J5697J0419J822O938N042m158N576Q898k877j3458r707j434J239J987
11371C7179q820p243m01M491N955J4358J0617j425K964O233n231j8695j0984l628
$$ y = [3022, 3787, -7296, -20463, -23138, -18066, -13938, -14024, -7998, -12818, -17731, -21808, -16466, -9278, -11435, -11112, -9241, -13639, -14706, -14113, -8423, -4132, -7669, -5968, -7370, -14726, -11612, -5540, -3913, -3447, -4838, -4232, -11134, -6486, 944, -4520, -5270, -4695, -7980, -8270, -3323, -4311, -8867, -8415, -8722, -9746, -10493, -8813, -6693, -10680, -9884, -4268, -11403, -11387, -10605, -13871, -13534, -8462, -5926, -4764, 66, 4818, 5290, -1118, -7957, -5061, -7212, -7146, -5732, 964, 12464, 17557, 26733, 32199, 35639, 28978, 16733, 5946, 5680, 6437, -394, -1096, -2510, -3638, -913, 3750, 2814, -5938, -9537, -9598, -7810, -739, 1780, 11195, 26892, 37311, 39133, 46071, 51113, 46955, 52531, 61429, 58552, 45094, 35387, 33953, 35192, 37179, 28359, 21116, 20715, 25206, 31161, 45519, 56136, 54711, 57675, 63908, 58677, 39982, 28998, 25370]
11357B5370l579K106O411J3475K899K263J1357J5309J7161K6389K5655L6020L0343
11344B11179J3465K564j07l841q692n627l765r635j0286k2147k6630k8262j8323
11331H9893o279k054m523n729o461j3181j0895m329O02j831l120k626J164N754
11317C6385J772k126k535M02P566J4685J3047J2516J3944Q038j475j0426j3538
11304G8255q641q001j62N339m654P93p096p561n35K204J323n514j1678n668L910
11289C2314P708N769M792Q012P281Q255R440J1945K1050K2711K0840K4274Q620
11276A93011k399j4368k3130k4964k2986j8073j4250p256m013M230J3668J6838
11264I6308J7116Q795J2151K1894O291j1310j9735j7149j1187o486K118J0446
$$ y = [25370, 21791, 23897, 30308, 43783, 46682, 48945, 60302, 75611, 92772, 119161, 144816, 180836, 211179, 224644, 227208, 227101, 223260, 214568, 208941, 205176, 195541, 185255, 163108, 136478, 108216, 89893, 83614, 81560, 77037, 71308, 64847, 51666, 40771, 36442, 37044, 35213, 32093, 29467, 30631, 36385, 38157, 36031, 33496, 33898, 41464, 56149, 69196, 81712, 95656, 103694, 102219, 91793, 78255, 69614, 61613, 61451, 66790, 62136, 62929, 55833, 48272, 47737, 49941, 51264, 45750, 34072, 28404, 32314, 40022, 45791, 50583, 58595, 65876, 74131, 83571, 95516, 116566, 139277, 160117, 184391, 193011, 190612, 176244, 153114, 128150, 105164, 87091, 72841, 65585, 61572, 65802, 79470, 96308, 113424, 122219, 134370, 156264, 162555, 151245, 131510, 114361, 103174, 96688, 98806, 109252]
11252A09252J2371R658P145m260j8537j2822j0296j2082j4074j591l891r731p186
11239D3956n460m610M435P34M616L01k949J389O333N628M283Q802J5458K7256
11225A10172L8893M7483M9997M6711K4336K448l8331n8882n0679l7567k2986k1605
11213H9990j5293m559j323n925N781J0568Q94L013J317m275l366p255j3743r519
11199D6305l52k934K65J599L74M289M911J923R900J1631J4413K2792K9118L6407
11185A80641N4537P0144O5848M8422K6180k8872p1127p9574p3147m7638k2404
11174A23010j2448j1444q811m455l841o460J920j7504m759M066m326J498L307
11161E9753M807K933l550m764k76J296j505O079L313P03J0455J5779J2949J2363
$$ y = [109252, 121623, 131281, 138426, 134166, 115629, 102807, 92511, 80429, 66355, 64764, 60873, 51142, 43956, 38496, 33886, 38321, 39055, 43671, 43972, 41023, 42412, 48745, 54373, 58656, 67458, 82916, 110172, 149065, 196548, 246545, 293256, 317592, 320040, 281709, 222827, 172148, 134581, 111595, 89990, 74697, 70138, 68815, 62890, 68671, 79239, 80133, 83146, 84463, 80188, 76822, 69567, 55824, 46305, 45953, 43019, 43284, 44883, 45257, 49546, 54457, 56380, 66280, 77911, 92324, 115116, 144234, 180641, 235178, 305322, 371170, 419592, 445772, 416900, 345773, 266199, 193052, 145414, 123010, 110562, 99118, 90307, 85852, 82011, 75551, 77471, 59967, 55208, 59274, 54948, 56446, 59753, 64560, 67493, 63943, 59179, 58903, 60199, 58694, 64773, 68086, 68789, 79244, 95023, 107972, 120335]
11147A20335K1821M0156M6051N3781M6054K8427p344l1561n8772n7220l6332k0191
11135A45205k2586j3178o706n069j0697l45J0680Q03L131J0621J8303J9965L0553
11122A80680L3929K6915J1306J629k0909m3013l4435k3145k0620o268J159K214
11110A09442p433l545M573R356J8439J9408K1734J6811N121r100k9244l1651j3612
11097A10299p705m228o758O370J3293J0752K7364L7198M3428L9324K9334O425
11085C05096k1742m4510m8637k7300j2941j4373j0929l343J0423J0478J8907L7751
11073A98880M0732L6499K5703o33k2050l4289m8135l5952k1376j7254k0211r499
11061I2415L21n63l642k637k898j1480K868P261J398j2528l025L247m41M328O928
$$ y = [120335, 142156, 182312, 228363, 282144, 328198, 356625, 349281, 317720, 258948, 201728, 165396, 145205, 122619, 109441, 102735, 97666, 86969, 86624, 97304, 98107, 101238, 111859, 130162, 150127, 180680, 214609, 241524, 252830, 254459, 233550, 190537, 156102, 132957, 112337, 106069, 107228, 109442, 102009, 98464, 103037, 112393, 130832, 150240, 171974, 188785, 193906, 184806, 155562, 123911, 110299, 102594, 98366, 91608, 97978, 111271, 122023, 149387, 186585, 230013, 269337, 298671, 305096, 283354, 238844, 190207, 162907, 149966, 135593, 124664, 121321, 131744, 142222, 161129, 198880, 239612, 276111, 301814, 301181, 279131, 244842, 196707, 160755, 139379, 122125, 101914, 92415, 92736, 92173, 88531, 85894, 82996, 71516, 74384, 81645, 83043, 70515, 67490, 70737, 70296, 74624, 81552]
11046H1552j49l8O904J1016J4202K9030M0460L7404K5706J1270o170k3734l7962
11033A89491m0918l0287k0782j4582j8209k353M379L162q933q506k344n53J908
11020E1473n571p61o41M00j24r85j2356m645L168k419r738n844l518K964Q777
11005B0180K498k389M675l674j372M514J323o122O136O617o00j0897n356m12J452
10990A6573m368k107K223N087L796N656K747k29j356o015j85r84k017L953L867
10975B6641K787L203K829j172j167N11P089k513n645p14M38N814L162n424J837
10960C7676O063j552n306P096k042j1700q049O294J5197J602r775J387m681p029
10946B5181J966J069M560M110k261l212K601M625j526j0633n639K828K423m956
$$ y = [81552, 81403, 81365, 88269, 99285, 113487, 142517, 182977, 220381, 246087, 257357, 251187, 227453, 189491, 148573, 118286, 97504, 82922, 64713, 62360, 66739, 69901, 60968, 52462, 50118, 49565, 51473, 45902, 45141, 44500, 44900, 44776, 43791, 31435, 26790, 29958, 27539, 17801, 11957, 8439, 11403, 20180, 22678, 20289, 24964, 21290, 19918, 24432, 25755, 19633, 25769, 32386, 31786, 20889, 15533, 15121, 16573, 12205, 10098, 12321, 17408, 21204, 26860, 29607, 29378, 28022, 22007, 21822, 20838, 18821, 22774, 26641, 29428, 32631, 35460, 34288, 33121, 33632, 40721, 38208, 32563, 31849, 32287, 38101, 41263, 35839, 37676, 43739, 42187, 36881, 43977, 41935, 30235, 22186, 28480, 43677, 45279, 35504, 36891, 32210, 25181, 27147, 28216, 32776, 36886, 34625, 31413, 34014, 38639, 37113, 26480, 20841, 23669, 26092, 21136]
10932B1136K877R507L57o762q436o144j564L137O893R395J402k986n93k509p533
10917A8177j109q862p102M755O412P528K590j718m435n806J282p65k199M19l280
10902E887m842M758l191j199N125L256j054l802k183j321M668R084k515o437m698
10887A536N763N209l764K570j463l076N31j615k15K395K120k680L432J430M7l648
10871H572j965n901o409O820P143K328P100n573J34J3693M270N419R360N972r85
10856D9978n116J222K374O413m231L67j498m193m101k203r035n892k635j529L246
10841B3167K607l498J12L481N495J102J343k709p67J090Q99r9n3q715p105j076
10825A5274L035M329p380p964K513R124J3900L515j1569j0718k727l661N36L929
$$ y = [21136, 24013, 33520, 33877, 27115, 18679, 12535, 10971, 14108, 21001, 30396, 31798, 28812, 28219, 25710, 18177, 17068, 8206, 1104, 5859, 12271, 19799, 22389, 20671, 16236, 10430, 11712, 10947, 8748, 9167, 5887, 1045, 5803, 2612, 1413, 6538, 9794, 8740, 4938, 2755, 1434, 6102, 15186, 12671, 6234, 1536, 7299, 12508, 8744, 11314, 9851, 6775, 7306, 5691, 5476, 7871, 9991, 7311, 10743, 12173, 12220, 8572, 6607, 706, -5703, 1117, 8260, 10588, 17688, 12115, 12249, 25942, 30212, 35631, 44991, 50963, 49978, 44862, 46084, 48458, 54871, 50640, 51007, 49509, 45316, 41215, 39012, 29977, 24085, 21450, 19921, 23167, 25774, 22276, 22388, 25869, 31364, 32466, 33809, 31100, 30333, 31423, 32322, 32223, 32170, 23455, 16350, 15274, 18309, 22638, 15258, 7294, 9807, 18931, 32831, 36346, 24777, 14059, 11332, 7671, 8207, 12136]
10811A2136k20l23M445M078K383J073P640J2138M672K119K095J2947J614M327
10797G1124K322l526j481p142j0176m257k478j161j162q27j013k815j0466l260
10783B3682M314K494l8l129M90O20N42m292K132N725P015M79m428J20R642N309
10767E0677Q408P122L88j2931L351Q90q509l389n046j745m608q888o213Q684M545
10752C2736o158k902M974j137k102p47j218j519r97J755M639j652O594k073o396
10737B3797n57N293k375J93J72R45l186K893L595o967j765J57K687k811l65J174
10721B2880K770O026N59r28m583o648L83J0203K336R10Q24L969l281j413m31L422
10705C6998m564j559l857l361p068Q65n565L702l346k371M988J810k788m510o984
$$ y = [12136, 11916, 11593, 16038, 20116, 22499, 23572, 31212, 43350, 48022, 50141, 52236, 65183, 66797, 71124, 73446, 69920, 68439, 61297, 51121, 46864, 44386, 43225, 42063, 41236, 40223, 37408, 26942, 23682, 27996, 30490, 30452, 27323, 27813, 28433, 28975, 24683, 26815, 32540, 39555, 40034, 35606, 35726, 45368, 50677, 59085, 66207, 66595, 53664, 57015, 57905, 49396, 46007, 40961, 39216, 34608, 25720, 19507, 28191, 32736, 26578, 23676, 28650, 27513, 25411, 24664, 23446, 21927, 20930, 22685, 27324, 25672, 32266, 30193, 23797, 23240, 28533, 26158, 26351, 26523, 27468, 24282, 27175, 30770, 23803, 22038, 22195, 24882, 22071, 21706, 22880, 25650, 31676, 32235, 31307, 26724, 20076, 20459, 30662, 32998, 33908, 34732, 38701, 35420, 34007, 33576, 36998, 32434, 30875, 27018, 23657, 16589, 17454, 11889, 15591, 12245, 9874, 14862, 16672, 13884, 9374, 2390]
10690B390n304K626n125n565l544Q046N313k348j302K74j790K763N088L223l214
10675A531l096O847Q046L614k729k96N924k895o596L979k893j1167n662M965P70
10660C42L048J569P592j80j90l339k847L188l945m789k183N49K695K162k863J105
10644A914n628L745j547l21J147Q912K443N83M53K338J667m897m682j778k277
10629B072l603o821j777K189j41l519M287P857L881j0007n86P359o42m179j446
10614e076L289R77K513J770P10l94o551p031o430p131l531k541o306O848O451
10599b2433K267J103K735J238J544J797m403n419Q247M219j700J094J419l568
10585a1860K819J607Q739P508N689M29o55j799m188l86l130J98N386j333n451
$$ y = [2390, -2914, -288, -5413, -10978, -14522, -6476, -1163, -3511, -4813, -4539, -6329, -3566, 1522, 4745, 1531, -1565, 5282, 13328, 16942, 14213, 13917, 19841, 16946, 10350, 14329, 11436, 269, -5393, -428, 342, 3390, 4959, 12551, 12371, 12181, 8842, 5995, 9183, 5238, 449, -1734, -1185, 1510, 3672, 809, 1914, -3714, 31, -1516, -1837, -690, 8222, 10665, 11248, 11701, 14039, 15706, 10809, 6127, 4349, 2072, -1531, -8352, -10129, -7940, -8081, -11600, -7313, 544, 4425, -5582, -6168, 1191, 549, -3630, -5076, -1787, -810, 1703, 3473, 4183, 3789, -2762, -9793, -16223, -23354, -26885, -29426, -35732, -28884, -22433, -20166, -19063, -16328, -15090, -13546, -11749, -16152, -21571, -13324, -9105, -10805, -9711, -8292, -11860, -9041, -7434, 1305, 8813, 14502, 14931, 14276, 12477, 8289, 7903, 4773, 4971, 10357, 9024, 3573]
10570C573K49l71M382L028m062l027K222j857M468M415k44q743R182N473k381
10555A6307J982N95Q1j726l681m532L926K324l454N882R450O374N043J2322J0740
10540F1633L283N829J4284K3906K8322M8280Q5062J46490K25518L03521L21294
10529A267422K50522J08854j29066l52033l52995k29161j32628q1253n1196l1420
10519B67046k3820k4282j5754k3515j2617r682j763K742m870l885j2843j0893
10507A25864k270j634j1232r916j1291n686M954m958M913N041L528j544l97O696
10493A02068J3696J5435J1354M932O630O011R530O946J8836K6221K8478N2644
10481C02781Q4734J12845J57610K04900K53490K69423K62745K27257J14748K8410
$$ y = [3573, 3822, 3451, 7833, 10861, 6799, 3772, 5994, 4137, 8605, 13020, 12776, 4033, 13215, 18688, 16307, 18289, 18884, 18965, 17239, 13558, 9026, 12952, 15276, 11822, 17704, 27154, 33528, 38571, 50893, 61633, 64916, 70745, 85029, 108935, 137257, 185537, 270599, 417089, 642607, 946128, 1267422, 1517944, 1626798, 1497732, 1145699, 792704, 563543, 430915, 349662, 298466, 267046, 243226, 218944, 203190, 179675, 167058, 157376, 155613, 158355, 153485, 149600, 136757, 125864, 123594, 121960, 110728, 100812, 89521, 83835, 88789, 83831, 88744, 93785, 97313, 95769, 95372, 102068, 115764, 131199, 142553, 147485, 154115, 160126, 169656, 176602, 195438, 221659, 250137, 302781, 387515, 500360, 657970, 862870, 1116360, 1385783, 1648528, 1875785, 1990533, 2018943]
10471B018943o9067j92343k28557k38585k55436k04933j56483j22166q1302m5813
10461D24258l9016l3977k0117j6569j6815j6986j4211j6929m312j0656j3588j6482
10449B04600j9965j2500p942p956n033j1170n382o41n23j581n167r439k716j0740
10435A03845r478o130l430L895K185L774q518o922L073K557k990m237L968L314
10421H4906r271m378j158m47P478L356M450l092n790M126k902j0126o249j593
10407E9310j487J190M45P846M518k670q815J222O113N604L96O75O868K438P52
10392H4405L029M016L555J534o65N88p464q580Q6l600m398m028q128j1152q149
10377D1049q454J993J558L754J915R368K664k859M911O147k816L08O988j163q790
$$ y = [2018943, 1949876, 1757533, 1528976, 1290391, 1034955, 830022, 673539, 551373, 470071, 424258, 385242, 351265, 331148, 314579, 297764, 280778, 266567, 249638, 245326, 234670, 221082, 204600, 184635, 172135, 164193, 156237, 151204, 140034, 134652, 134011, 133488, 131907, 126740, 117301, 114585, 103845, 94367, 88237, 84807, 88702, 90887, 94661, 86143, 79221, 82294, 84851, 81861, 77624, 81592, 84906, 75635, 71257, 70099, 69652, 77130, 80486, 84936, 81844, 76054, 80180, 77278, 67152, 60903, 59310, 57823, 59013, 59458, 67304, 71822, 69152, 60337, 61559, 67672, 73276, 73672, 74347, 81215, 83653, 84405, 87434, 91450, 95005, 96539, 95874, 96462, 88998, 80418, 80504, 76904, 72506, 68478, 60350, 49198, 41049, 32595, 34588, 36146, 39900, 41815, 51183, 53847, 50988, 55899, 62046, 59230, 59538, 66526, 65363, 56573]
10362E6573n19N86j0866o052K627K476O589l967O19O905m883l008p30k547L351
10347D7154M248N210j962K863j160n315O506R613R729R033K8303L8199M4980N6826
10333B54227O3696P8433P7590N0702K8305l113l0640l2726m6643n4994m1135l7169
10321C06533l6743k6442j7289j9204j5893k0974j6176j4857r069o674j0474j5444
10309I7294j3419l916k82l255l116j17j453j007j947l249k190J913N616j017J2626
10294H2481R740K90q610p98q530m932J549J997p674j0479n430n749m059n83j243
10279C7970j894J970k541M022J0859Q006P290J5297Q789L965P632M268K802n613
10265A02822j1683k747K921m246n577o035l946n727J6l062k165L907o080k351
$$ y = [56573, 56054, 56640, 45774, 39722, 42349, 44825, 51414, 47447, 48066, 54971, 50088, 47080, 46350, 43803, 47154, 51402, 56612, 54650, 57513, 56353, 51038, 57544, 67157, 76886, 85919, 114222, 152421, 197401, 254227, 317923, 396356, 473946, 524648, 552953, 549840, 519200, 486474, 439831, 384837, 343702, 306533, 269790, 243348, 226059, 206855, 190962, 169988, 153812, 138955, 129886, 123212, 112738, 97294, 83875, 79959, 79677, 76422, 73306, 73189, 71736, 70729, 68782, 65533, 63343, 65256, 70872, 69855, 82481, 92221, 92511, 83901, 83103, 74573, 69641, 71190, 73187, 65513, 55034, 49604, 43855, 39796, 39213, 37970, 36076, 38046, 35505, 39527, 50386, 58392, 65682, 80979, 89768, 93733, 101365, 105633, 108435, 102822, 91139, 88392, 91313, 87067, 81490, 75455, 71509, 65782, 65798, 62736, 60571, 64478, 58398, 56047]
10251E6047m021J927r29o478Q61Q718N433J3372J0808Q900j185k558P45n162p604
10236G8874L756L64n70M652j350q101J168L701K379M436O692j4309j0282l841
10222F7569l374N918P485R276J398L896L269N506R01Q465J3879J0761J0046Q583
10208A53578J7585K3670K3503K0182K0463K4238K9734K2870J1996L970k980J017
10196C49826j2035k2703k4174k3451j5414p193r249m390O687J1959J2000k230
10184B59633M53J5671J4481J1539R918N810J5216J1619k959P03J0897P120q87
10171C59214Q829J0490N796L179K809P846J1047R14L241K793L433L049L775M281
10157D30696k952l579J2020O130L953J0387R047J2834J8314J6446O210J2879J8340
$$ y = [56047, 52026, 53953, 53024, 46546, 47407, 56125, 61558, 74930, 85738, 94638, 93453, 90895, 91640, 86478, 78874, 82630, 82994, 82424, 87076, 85726, 77625, 78793, 82494, 84873, 89309, 96001, 81692, 71410, 67569, 64195, 70113, 77598, 86874, 88272, 92168, 95437, 100943, 101844, 110309, 124188, 134949, 144995, 153578, 171163, 194833, 218336, 238518, 258981, 283219, 312953, 335823, 347819, 351789, 348809, 349826, 337791, 315088, 290914, 267463, 252049, 244856, 235607, 231217, 237904, 249863, 261863, 259633, 260086, 275757, 290238, 301777, 311695, 317505, 332721, 344340, 341381, 342084, 352981, 360101, 359214, 368043, 378533, 384329, 387508, 390317, 398163, 409210, 410124, 413365, 416158, 419591, 422640, 426415, 430696, 427744, 424165, 436185, 442315, 446268, 456655, 465702, 478536, 496850, 513296, 519506, 532385, 550725]
10144E50725K3087K1112K5514K3420J6218K6036L0684K3146K5037L0438K6236
10133H21653K4145L1721L0868M2736N4861O1704Q9375J10352J18445J23406J27721
10122A636987J17883J10127Q1290M0781J4271J566J5438K9709N4957P0600O8529
10111B242138N5524M8940N0776R0735J25630J53485J95556K40629K83941L30724
10101C818078M08958N01505O34544P86215R34398J101969J296809J486810J628249
10092A2597535J760224J895180J943481K009495K209700K439949K916696L910444
10084C1682704N630335Q724572J3547452K0124463K8138019L6788748M3379292
10077A88015585M4464764M3141397L5719765J8420417N256362r632613l0002851
$$ y = [550725, 573812, 594924, 620438, 643858, 660076, 686112, 716796, 739942, 764979, 795417, 821653, 845798, 877519, 908387, 951123, 1005984, 1067688, 1157063, 1267415, 1385860, 1509266, 1636987, 1754870, 1864997, 1946287, 1987068, 2001339, 2002905, 2018343, 2048052, 2103009, 2173609, 2242138, 2297662, 2346602, 2397378, 2488113, 2613743, 2767228, 2962784, 3203413, 3487354, 3818078, 4227036, 4728541, 5363085, 6149300, 7083698, 8185667, 9482476, 10969286, 12597535, 14357759, 16252939, 18196420, 20205915, 22415615, 24855564, 27772260, 31682704, 37313039, 46037611, 59585063, 79709526, 107847545, 144636293, 188015585, 232480349, 275621746, 311341511, 329761928, 335018290, 325385677, 295382826]
10070B95382826l5829590l9843350m2957726l5226318k7460184k1167864j4112011
10063G8785783r170613o337743m766860l789705l125782k766388k505410k252370
10055D4070912k139160k031096j888668j789239j724082j611039j510022j413694
10047B9963912j277921j158217j043968r25814q23983p49923o93023o51232o28788
10038B2011043o34249o47517o55760o80032o44797o20928n92013n42055m86930
10029A6506762m14602l60169l53056l54042l60003m53470m97028m14797l57014
10020A2942581l23885l04621k92096k77274k78188k74578k61223k54558k56728
10011A0419430k35756k23992k18610k14174k05353k00640j98905j88647j75220
$$ y = [295382826, 259553236, 219709886, 176752160, 141525842, 114065658, 92897794, 78785783, 69615170, 63277427, 58510567, 54720862, 51595080, 48828692, 46323282, 44070912, 41931752, 39900656, 38011988, 36222749, 34498667, 32887628, 31377606, 29963912, 28685991, 27527774, 26483806, 25557992, 24734009, 23984086, 23291063, 22639831, 22011043, 21376794, 20729277, 20073517, 19393485, 18748688, 18127760, 17535747, 16993692, 16506762, 16092160, 15731991, 15378935, 15024893, 14664890, 14211420, 13714392, 13299595, 12942581, 12618696, 12314075, 12021979, 11744705, 11466517, 11191939, 10930716, 10676158, 10419430, 10183674, 9959682, 9741072, 9526898, 9321545, 9120905, 8922000, 8733353, 8558133]
10002H558133j65946j52512j55995j49091j42604j30958j45418j48535j43031
9993G224043j39557j34953j29095j19332j12358j05455j00695r1711r0029q0202
9983F120656q8332r3269q3268p7367p7217q2949q3677r1101r2123j01359j10617
9972E139377j19635j20355j23090j18812j04670q6068q8957q4093p9077q3149
9962D131471q2942p3229p2027o8413p2882p4029p3228o0661o4212o2946o1984
9951C364918n6505o6978o5546n2738o0820o0500m8874n6364m7053l7766n0346
9940B761428n6019o2145o0259o1053n5851n5512m8648m4960m6230k9836l2338
9929B208577l9082l9015l1807l8444l5193l7046l9784l8076l5510l5750l3282
$$ y = [8558133, 8392187, 8239675, 8083680, 7934589, 7791985, 7661027, 7515609, 7367074, 7224043, 7084486, 6949533, 6820438, 6701106, 6588748, 6483293, 6382598, 6290887, 6200858, 6120656, 6032324, 5939055, 5855787, 5778420, 5701203, 5618254, 5534577, 5443476, 5351353, 5249994, 5139377, 5019742, 4899387, 4776297, 4657485, 4552815, 4466747, 4377790, 4293697, 4214620, 4131471, 4048529, 3975300, 3903273, 3834860, 3761978, 3687949, 3614721, 3554060, 3489848, 3426902, 3364918, 3308413, 3241435, 3175889, 3123151, 3062331, 3001831, 2952957, 2896593, 2849540, 2811774, 2761428, 2705409, 2643264, 2583005, 2521952, 2466101, 2410589, 2361941, 2316981, 2270751, 2240915, 2208577, 2169495, 2130480, 2098673, 2060229, 2025036, 1987990, 1948206, 1910130, 1874620, 1838870, 1805588]
9918A805588l0055j9264k0644k5979k5264k7246j2751r595r226n140L40N547J7171
9905A643482J6667n473m733j3874j9676j923K0972L4341L5676J4831o897m8692
9893A664701p3802p4279m5049l0355k2996j7727j7204m4880n2844n9035n4570
9882A171960m1491l4523l4972k2547j6247r661j3979p630m848j1996r192m753
9870I60121o420j1851j2150j2224j9091j3003p688j2730j5933k0792j2777j8465
9858G96997j8147j1370r696j1294j0042k861p363m117J884o553l729p806m095
9845G01808l269j214q145r206n458p418l053l870l834k3415k4170l915j606o919
9831E96316k1348j4142j3578o574r861j1134j2488j2122k229M662m047o050p182
$$ y = [1805588, 1775533, 1756269, 1735625, 1709646, 1684382, 1657136, 1644385, 1634790, 1625564, 1620424, 1620764, 1626311, 1643482, 1660149, 1654676, 1649943, 1636069, 1616393, 1614470, 1635442, 1669783, 1705459, 1720290, 1713393, 1664701, 1590899, 1516620, 1471571, 1441216, 1418220, 1400493, 1383289, 1338409, 1285565, 1226530, 1171960, 1130469, 1095946, 1060974, 1038427, 1022180, 1012519, 998540, 990910, 986062, 974066, 964874, 960121, 953701, 941850, 929700, 917476, 898385, 885382, 877694, 864964, 849031, 828239, 815462, 796997, 778850, 767480, 757784, 746490, 736448, 733587, 726224, 722107, 723991, 717438, 713709, 705903, 701808, 698539, 697325, 689180, 679974, 674516, 667098, 664045, 660175, 656341, 632926, 608756, 604841, 603235, 596316, 574968, 560826, 547248, 540674, 530813, 519679, 507191, 495069, 492840, 497502, 493455, 487405, 480223]
9818D80223m137L306m986r745j5265n330m859l147L297l06n257J351j2660o312
9804D16173p706p159q679j6070q989p531m551J424k164l125p682k995q69l156
9790C36921r112j4797n452M528K612j0314j9483p231k408M941j751J454j640m451
9776B73817j325l87j909N110M911K682O174O274M434j1653j2679q044q993r941
9762B48471j3212j2371j6355n049o469K334N781R00P529M689M999N805P872l305
9748B31619q309o57j320l378o694m715l188m166j1706j2736r685J80P364O874
9734A79483P387O339K099J752k011l019K766k249j111M475M09N032J768k709J312
9719B01723n845j1025p214M985P578K340M725P580M988N204k687q087m554j318
$$ y = [480223, 476086, 479392, 474406, 464661, 449396, 444066, 439207, 436060, 439357, 439051, 433794, 435145, 422485, 416173, 408467, 401308, 392629, 376559, 367570, 360039, 355488, 356912, 354748, 351623, 343941, 340946, 340077, 336921, 327809, 313012, 307560, 312088, 314700, 304386, 284903, 277672, 275264, 280205, 278454, 279908, 278268, 273817, 272492, 272105, 270196, 275306, 280217, 282899, 289073, 295347, 299781, 288128, 275449, 267405, 258412, 248471, 235259, 222888, 206533, 201484, 195015, 197349, 203130, 204030, 211559, 216248, 221247, 227052, 234924, 231619, 223310, 222653, 221333, 217955, 211261, 206546, 203358, 199192, 187486, 174750, 165065, 165245, 172609, 179483, 186870, 193209, 195308, 197060, 195049, 192030, 194796, 192547, 191436, 195911, 196320, 201352, 203120, 200411, 201723, 195878, 184853, 177639, 182624, 190202, 192542, 197267, 204847, 209835, 215039, 212352, 204265, 199711, 198393]
9705A98393m274p534l408J300O37M893K928L779K419P79O549J0298J1616J0299
9691B38674J9460K3999K6049M0025N3979O4325O9490P1620P0085O8379O2310P4932
9679H83327P3898N1731M2344O4128J24067J80112K00140J95901J99944J35117
9669B150709M8886j8722j40962k31836k44058k59479k36807j88254j41554r2679
9659F45244o9665m6589l7873k0492j4660j9356k0017j2355j5227j1780j1873r709
9647C55648r773j0924p416l21j1258j0226j5456j0452l662j5218q041k103n741
9634B45057r532q572l74J102j75m915r643k75O56j5522m601K320l507p123q08
9619A84088k115o936k768J606K989k370o712n586j122l738l117o598j2416q621
$$ y = [198393, 194119, 186585, 183177, 184477, 185114, 190007, 192935, 196714, 199133, 199912, 206461, 216759, 228375, 238674, 258134, 282133, 308182, 348207, 402186, 466511, 536001, 607621, 677706, 746085, 808395, 883327, 957225, 1008956, 1051300, 1115428, 1239495, 1419607, 1619747, 1815648, 2015592, 2150709, 2199595, 2180873, 2039911, 1808075, 1564017, 1304538, 1067731, 879477, 737923, 645244, 575579, 528990, 491117, 470625, 455965, 436609, 416592, 404237, 389010, 377230, 365357, 355648, 345875, 334951, 327535, 327214, 315956, 305730, 290274, 279822, 276160, 260942, 252901, 250798, 245057, 235525, 226953, 226579, 227681, 227506, 222591, 212948, 212673, 213329, 197807, 193206, 195526, 192019, 184896, 184088, 181973, 175037, 172269, 173875, 176864, 174494, 167782, 162196, 161074, 157336, 154219, 147621, 135205, 126584]
9605A26584k81N548N575L849j278j010N586K68J832k769r905j0284j995k349J489
9590A20860M804o046m475j772m038l6Q878Pp612O73j8021n963P268P557J79m972
9574I7291k195m908k616L141L079k096l711n1N034N166m350r269j249N251n156
9559H3361l772P66l086l439o717M099k16N81J977N746J530J333l191k961L334
9544G9345m93N2n8o742n212J694L688l243p651M421J596K470k554j534m885p442
9528E3452k18L238K519R348k551l540o03O052J074j042k602J441j782k081M434
9513F7139L797m700l223M636N722j407j2751r861n259J378N978O174O4q947L683
9498E2423J058o08n155J02K033j308M039k454k898P81j822p03j813o399J603L644
$$ y = [126584, 126303, 131851, 137426, 141275, 139997, 138987, 144573, 144841, 146673, 143904, 133999, 123715, 121720, 119371, 120860, 125664, 119618, 115143, 113371, 109333, 109297, 118175, 118182, 110570, 111243, 93222, 87259, 94527, 102084, 102263, 97291, 95096, 90188, 87572, 90713, 93792, 91696, 87985, 87934, 92968, 98134, 93784, 84515, 83266, 88517, 83361, 79589, 80355, 77269, 73830, 67113, 71212, 70996, 71577, 73554, 79300, 80830, 82163, 78972, 76011, 79345, 78852, 78904, 78846, 72104, 66892, 68586, 72274, 69031, 61380, 65801, 67397, 69867, 67313, 65779, 60894, 53452, 53234, 56472, 58991, 68339, 65788, 62248, 61645, 67697, 68771, 67729, 65127, 66568, 64786, 62705, 67139, 70936, 66236, 63013, 67649, 73371, 71964, 59213, 49352, 44093, 45471, 51449, 57623, 57687, 48740, 52423, 53481, 52873, 47718, 47820, 49853, 48545, 52584, 50130, 47232, 48013, 46191, 45488, 43675, 37276, 38879, 42523]
9482D2523r02M759j215k94k197l576P522J447m494l820J534R079J793L962P79
9467E6900n054J767k868P227J012J707j4145n764N794m642M006M834j117l840
9453D5817o658N90j736j093r88k249K212O96K252Q57M321L432M802K541L019L93
9437E8208j89m122l826K913o72r929p561j327N302j046j03J0025M421r538Q60
9422D3416J802p426p627l996n429P993Q097R910J4818J0584J1290K428j0688j2308
9408F2864p789J761o49j1561n206j861q10O300N873p96n51J106m431k991q860
9393C2399n345j22N486R718N167j749M112o03m65J96k546k580K305M230k263o171
9377D1769K194J3734k871n795k39L256N753k231P97J217l595J184J8791J9140
$$ y = [42523, 41621, 46380, 45165, 44871, 42674, 39098, 46620, 48067, 43573, 39753, 41287, 50366, 52159, 56121, 56900, 51846, 53613, 50745, 57972, 58984, 60691, 46546, 40782, 46576, 41934, 45940, 50774, 49657, 45817, 39159, 39749, 38013, 36920, 35932, 33683, 35895, 36591, 38843, 39700, 44021, 47453, 52255, 54796, 57815, 58208, 58019, 53897, 50071, 52984, 52312, 42383, 34822, 33495, 38797, 37751, 37648, 47673, 52094, 42556, 43416, 45218, 37792, 30165, 26169, 20740, 28733, 36830, 46740, 61558, 72142, 83432, 85860, 75172, 62864, 55075, 56836, 56187, 44626, 39420, 37559, 36749, 43049, 48922, 48126, 47575, 48681, 44250, 41259, 32399, 27054, 26932, 32418, 42136, 47303, 45554, 49666, 49063, 48598, 48794, 46248, 43668, 45973, 50203, 47940, 41769, 43963, 57697, 54826, 49031, 48792, 52048, 57801, 55570, 56367, 57584, 53989, 55173, 73964, 93104]
9363I3104J1903Q231P003n918l809j513m095m44m065l509o102q337j0318L395
9349G5526L177p504q200M392n073o056k269J993N364l004R54M106R528K571L670
9334G9175J827l45O33k162p720n303J740j431m147o240k768o62j869m96J42L438
9318E3812K807L696O513J977O121P480r62J686q87K478J3076M516q58o80p490
9303I3285j4505j0373l943L773J918k146l300J855J662J599j067j470L711r92
9289G0007R419J4878K0576O503N282m869o068j922o484k520P539k15l657k400
9275A06069j5016l834n39O711l968q082O530M824k442J668O614l412N888N938
9261A06949l34M629J2798Q961K361m345q435j0754p957n730j3084j2824l407k422
$$ y = [93104, 105007, 113238, 120241, 114323, 110514, 109001, 104906, 104462, 100397, 96888, 90786, 82449, 72131, 75526, 78703, 71199, 62999, 67391, 62318, 56262, 53993, 55986, 61350, 58346, 59300, 63406, 72934, 75505, 79175, 81002, 80657, 81290, 79128, 71408, 66105, 67845, 66414, 62267, 56027, 53259, 52597, 50728, 50232, 50374, 53812, 56619, 60315, 66828, 68805, 74926, 82406, 81444, 83130, 82243, 84721, 97797, 102313, 101455, 100775, 93285, 78780, 68407, 64464, 68237, 70155, 68009, 64709, 66564, 68226, 69825, 68758, 67288, 70999, 70007, 79426, 94304, 114880, 121383, 126665, 121796, 115728, 113806, 107322, 104802, 112341, 112126, 108469, 106069, 91053, 87219, 86680, 93391, 89423, 81341, 87871, 92695, 90253, 91921, 98535, 95123, 101011, 106949, 106615, 111244, 124042, 133003, 135364, 131019, 122584, 111830, 103873, 98143, 85059, 72235, 68828, 66406]
9247F6406j455k74O094N606k46J0447R602J1115P10j842K593M379J0305L541L058
9232A30039M461J179k843n03n548o702r169p777n380n493o705l256q149l305M017
9217G4866J5893N270n426m598l77K491m266L709K817Pj69N297J3633J4643J0435
9202A34225J4938J5992L795O958J2929J9924N798q33k790m876o028m572j4412
9189A81048j1419o404l93l696p00j0565p174k144l38m53n788j2724j3385n489
9175A00376K794Q09J875o73k745m204m597L651L911j813o14K761K193R335J2714
9160A25773P135q13r164k519J187m890j1303m743O449K657J524l341k807Q16N917
9145A11878N793M879P442N162J059q454L164N906O623j418J419m361k468m251
$$ y = [66406, 64951, 64677, 70771, 76377, 76131, 86578, 96180, 107295, 108005, 106163, 108756, 113135, 123440, 126981, 130039, 134500, 135679, 132836, 132333, 126785, 120083, 110914, 103137, 97757, 92264, 85559, 82303, 74154, 70849, 74866, 90759, 96029, 90603, 86005, 85628, 88119, 83853, 87562, 90379, 90386, 90217, 95514, 109147, 123790, 134225, 149163, 165155, 168950, 175908, 188837, 208761, 214559, 213726, 210936, 206060, 200032, 195460, 181048, 169629, 163225, 162832, 159136, 158436, 147871, 140697, 138553, 138215, 137762, 131974, 119250, 105865, 100376, 103170, 103979, 105854, 105181, 102436, 98232, 93635, 97286, 101197, 99384, 98770, 101531, 103724, 113059, 125773, 132908, 132095, 122931, 120412, 121599, 116709, 105406, 100663, 107112, 109769, 111293, 107952, 105145, 105961, 111878, 117671, 122550, 129992, 135154, 136213, 127759, 130923, 136829, 143452, 142034, 143453, 139092, 136624, 132373]
9131A32373K232o96l518m530l644j343J205M049N281N910J077j0428n511J02k865
9116A19694M475N503J5388J1588Q506J0243j039q3O125R46m258q20o618k776j571
9101A65303J232O074J844K368N542o118k930j946k38K09M594L938J350L150J1165
9086A95537J1526M760j441L949O833M800P472J1450P695J0635J3647Q528K1350
9073C06741K7216J5630J0875L759K989K321J3750J2433l294j1865j4301j4602
9061C51652r674J12m249L081J0137R537L966K849O04J3169J4919J0743J5689J7054
9047D39589J1719J2905P234O003O366L347l301j58R766J6462J8611J0940P966
9034E47449J2320J1822L820M400J0237Q762Q140J0415J2559P038P504J2355Q926
$$ y = [132373, 134605, 133909, 130391, 125861, 122217, 120874, 122079, 126128, 131409, 137319, 138396, 127968, 122457, 122559, 119694, 124169, 129672, 145060, 156648, 165154, 175397, 174358, 174275, 180400, 181346, 177088, 176268, 169650, 166874, 165303, 166535, 172609, 174453, 176821, 182363, 176245, 173315, 171369, 171131, 171340, 175934, 179872, 181222, 184372, 195537, 207063, 211823, 210382, 214331, 221164, 225964, 233436, 244886, 252581, 263216, 276863, 285391, 306741, 333957, 349587, 360462, 364221, 367210, 369531, 383281, 395714, 392420, 380555, 366254, 351652, 341978, 342090, 337841, 340922, 351059, 360596, 364562, 367411, 368015, 381184, 396103, 406846, 422535, 439589, 451308, 464213, 471447, 477450, 483816, 487163, 483862, 483704, 493470, 509932, 528543, 539483, 547449, 559769, 571591, 575411, 579811, 590048, 598810, 606950, 617365, 629924, 636962, 644466, 656821, 665747]
9021F65747J4474J5032J1575K0227K2797K2674K6470J9787J5699J9382K8919K7563
9009I10346K8543K9298L7773L8787L6324K3867L6461M2106L5620L3459L0215M2893
8997A325692N1192O0786N9765N8742O1814P0491P0907O3508O9646O8405O4923
8986B025871P3451Q5004Q4735R5984J14315J29261J30070J31218J50799J67608
8976C188316J83700K07173K38504K67197K94187L20116L63380L96144M48238N02983
8966F409938N60168O29368P04928P89551R04339J062928J263558J473421J735378
8957A5533577K061657K478758L045321L827321M895303O351139Q360392J1137356
8949E7690824J4936177J9898615K5543235L0239868L1392060K6847238J6272094
$$ y = [665747, 680221, 695253, 706828, 727055, 749852, 772526, 798996, 818783, 834482, 853864, 882783, 910346, 938889, 968187, 1005960, 1044747, 1081071, 1104938, 1141399, 1183505, 1219125, 1252584, 1282799, 1325692, 1376884, 1437670, 1497435, 1556177, 1617991, 1688482, 1759389, 1822897, 1892543, 1960948, 2025871, 2099322, 2184326, 2269061, 2365045, 2479360, 2608621, 2738691, 2869909, 3020708, 3188316, 3372016, 3579189, 3817693, 4084890, 4379077, 4699193, 5062573, 5458717, 5906955, 6409938, 6970106, 7599474, 8304402, 9093953, 9998292, 11061220, 12324778, 13798199, 15533577, 17595234, 20073992, 23119313, 26946634, 31841937, 38193076, 46553468, 57690824, 72627001, 92525616, 118068851, 148308719, 179700779, 206548017, 222820111]
8942B22820111Q79586j6136093k8168432l0702868k6542136k0633586j5513327
8935H6003255j1682421q954078p029893n647693m663469l943748l376594k884185
8927C7821174k476638k134801j849009j617808j440656j302009j189947j092436
8919B4717870j015002r48243q92028q39849p88311p38090o96192o54811o29141
8910A7516203o08297n77547n45090n14883m91148m68025m41691m10694l84834
8901A3073994l71455l57724l44331l30217l21549l09544l03286k82364k61850
8892A0191674k57637k46958k40035k28305k21060k12726k12582k03709j83696
8883H184966j81674j80849j74970j67879j66189j57552j53197j47186j40196j26768
$$ y = [222820111, 223699697, 207563604, 179395172, 148692304, 122150168, 101516582, 86003255, 74320834, 65366756, 58336863, 52689170, 48025701, 44081953, 40705359, 37821174, 35344536, 33209735, 31360726, 29742918, 28302262, 27000253, 25810306, 24717870, 23702868, 22754625, 21862597, 21022748, 20234437, 19496347, 18800155, 18145344, 17516203, 16907906, 16330359, 15785269, 15270386, 14779238, 14311213, 13869522, 13458828, 13073994, 12702539, 12344815, 12000484, 11670267, 11348718, 11039174, 10735888, 10453524, 10191674, 9934037, 9687079, 9447044, 9218739, 8997679, 8784953, 8572371, 8368662, 8184966, 8003292, 7822443, 7647473, 7479594, 7313405, 7155853, 7002656, 6855470, 6715274, 6588506]
8873F588506j31584j23397j21135j23571j21964j13798j08037j03156j04776j05019
8863E432069j08111j06244j02422r6680r3107q5602q0341p9495p1229o4112p1983
8852D472743o4828o3772o4856o3441n8847o7733o6265p1060p9344p6439p6968
8841C719190p7147q8376p5584o0352o0744n6450o3306p0499o7294o3019o0594
8830B975825n7528n1387m6219m2067m2124m2588m7072n1066o0740n1458m7463
8819B436113l9283m1428l7778m4617m6969m3946m9031n1930l8889m4574m3680
8808A953988m1624l8596l1683k3711l1030l3126k9342k6601k9397k9714k9746
8797A609418k4015k0786k6151k6384k8071k5760k9698k1772k7838k7651k2049
$$ y = [6588506, 6456922, 6333525, 6212390, 6088819, 5966855, 5853057, 5745020, 5641864, 5537088, 5432069, 5323958, 5217714, 5115292, 5018612, 4925505, 4839903, 4759562, 4680067, 4608838, 4544726, 4472743, 4407915, 4344143, 4279287, 4215846, 4156999, 4089266, 4023001, 3951941, 3872597, 3796158, 3719190, 3642043, 3553667, 3478083, 3417731, 3356987, 3300537, 3237231, 3166732, 3099438, 3036419, 2975825, 2918297, 2866910, 2820691, 2778624, 2736500, 2693912, 2646840, 2595774, 2535034, 2483576, 2436113, 2396830, 2355402, 2317624, 2273007, 2226038, 2182092, 2133061, 2081131, 2042242, 1997668, 1953988, 1912364, 1873768, 1842085, 1818374, 1787344, 1754218, 1724876, 1698275, 1668878, 1639164, 1609418, 1585403, 1564617, 1538466, 1512082, 1484011, 1458251, 1428553, 1406781, 1378943, 1351292, 1329243]
8786A329243j5427j9528j8287k3258k5357k6301k6679j9195j6805k0991j8953
8775A098462j5671j0605q253p382j5180n902j0779j0559j7500k0565j1886j0804
8763I53376j6838j6172j4155j1949j5766j4691j3414j611j381j7995k1615j5119
8751G92670j3800j0995j5652j7668j4199r109j0295p405k565j080K948q12k074
8738F89964o941j3158n654l821j2351j4095p983j952o661k1052j5166m251L141
8725E80020k541n804n897m408M258q20o366N82l393m04l144l914p366l487p749
8710E29567j1084j1975p140q487j0442j3529j0053j0065n696n018k917l437j793
8697D27931p613j4480q178n657J981j68m470j076m288j7483r889m226q14J42j080
$$ y = [1329243, 1313816, 1294288, 1276001, 1252743, 1227386, 1201085, 1174406, 1155211, 1138406, 1117415, 1098462, 1082791, 1072186, 1063933, 1056551, 1041371, 1035469, 1024690, 1014131, 996631, 976066, 964180, 953376, 936538, 920366, 906211, 894262, 878496, 863805, 850391, 848780, 847399, 829404, 807789, 792670, 778870, 767875, 752223, 734555, 720356, 711247, 700952, 693547, 690982, 689902, 692850, 692038, 689964, 683023, 669865, 664211, 660390, 648039, 633944, 625961, 624009, 617348, 596296, 581130, 576879, 580020, 577479, 571675, 565778, 561370, 565628, 564808, 558442, 559024, 555631, 555227, 552083, 548169, 540803, 537316, 529567, 518483, 506508, 499368, 490881, 480439, 466910, 456857, 446792, 441096, 436078, 433161, 429724, 427931, 420318, 405838, 397660, 392003, 393984, 393816, 389346, 388270, 383982, 366499, 356610, 352384, 351570, 351712, 350632]
8682C50632j544n966p333q034r543n312n118q013k543K694k777j2277p630Q002
8668B85238P677J001o874k816K257n597m378o609q106j883q830k907N384L289
8654B56846o014o175o066j459k127k837o20q369N012l66l757L815K604l203k561
8639B24723r517j470J723p519j0431n561q616o982n417J837P200j975K092o627
8625A73460l413j012o728k662J077Q358R067L850n33k900J008M36m781P79j808
8610A74198L597K817k263J416N594m030q692o780j061M969l347J506K789J514
8596A72227k448j0132J73Q68K348l542m336n830j392l644l109Q31o528o904Q142
8581A36724O674O705m151p695j974L939j558k72q986J919Q118l019q079m781m115
$$ y = [350632, 349088, 343122, 335789, 327755, 318212, 312900, 307782, 299769, 297226, 299920, 297143, 284866, 277236, 285238, 292915, 293916, 287042, 284226, 286483, 280886, 276508, 269899, 261793, 259910, 251080, 248173, 253557, 256846, 250832, 244657, 238591, 237132, 235005, 232168, 231548, 223179, 228191, 227825, 224068, 227883, 230487, 227284, 224723, 215206, 213736, 215459, 207940, 197509, 191948, 183332, 176350, 170933, 172770, 179970, 177995, 180087, 173460, 170047, 169035, 162307, 159645, 160722, 169080, 178147, 181997, 181464, 178564, 179572, 180008, 175227, 176006, 174198, 177795, 180612, 178349, 179765, 185359, 181329, 172637, 165857, 164796, 169765, 166418, 167924, 170713, 172227, 169779, 159647, 159820, 160688, 163036, 159494, 155158, 149328, 147936, 144292, 141183, 142014, 135486, 128582, 136724, 143398, 150103, 145952, 138257, 136283, 140222, 138664, 138392, 129406, 131325, 139443, 136424, 128345, 123564, 119449]
8566A19449o44R16j278m230L21j628p72N51j109J622K407m523j569n458j2457
8551I1598o088P198M227m867q71l210j680j81j3192p057Q050P584P325q713l371
8536G6752J007O8L82K211j978m458j368N810M238L297l668J470m086m24P10o749
8520G3214k884J207R295P46k80k07r32L341m823m803K549J620k265M337J311j0061
8504G1365j0754R92P97m291J0127J2059p51j727m006n420m191r23J2956M601p805
8489G3029k785L35k289P12O55J562N020M248k793m333j214K349l749j301%j225
8473F8221k84j832j348p65j182k199N636R50J897n747l601P31N456j877j953k345
8457E9758j256n355n183J938M34R4m22O720O149R323p69L042k727L83n860p632
$$ y = [119449, 118805, 119721, 118443, 114213, 114534, 112906, 112134, 112685, 111576, 113198, 115605, 111082, 109513, 104055, 91598, 85510, 92708, 96935, 92068, 91197, 87987, 86307, 86126, 72934, 65877, 73927, 81511, 88836, 80123, 76752, 77759, 77827, 78209, 80420, 78442, 73984, 72616, 78426, 82664, 85961, 82293, 83763, 79677, 79253, 79963, 73214, 70330, 71537, 80832, 81578, 81298, 81091, 80159, 83500, 78677, 73874, 76423, 78043, 75778, 80115, 81426, 71365, 60611, 61603, 62400, 58109, 68236, 80295, 79544, 77817, 73811, 68391, 64200, 63277, 76233, 80834, 73029, 70244, 70579, 68290, 69002, 69657, 71219, 76239, 80487, 77694, 73361, 72147, 74496, 70747, 69446, 69446, 68221, 67937, 66105, 64757, 63992, 62810, 60611, 66247, 67197, 69094, 63347, 59746, 60477, 65933, 64056, 62103, 59758, 58502, 53147, 47964, 49902, 50336, 50430, 50008, 56728, 62877, 72200, 71431, 74473, 71746, 72129, 66269, 58637]
8441E8637L190L507l978L120M094M967k547j763M887m726L288M446k950j671J137
8426G3638j095j468K283n157m986k73m199l26p336n062N808K715J146P217K50
8411F3155K815J290p50K197j161m049L840N285K870N145J985k842M443O62o46
8396H4239l979K04R880Q793n796p188j307O501R821P695k506J628L531J0891J0305
8381A32712O022P310M482J6593K2840K8563K2186K2386K8745L0371L2875L8639
8369C93724P2558J07008J76182K74085M43832O83029Q96699R08465O80733K77983
8359D914298m14355j073166j008932o36887l81331k38898j51159j06530q3295
8350H19745o2296m7204l4001l0678l0744k2731j2612j3105q137n398m712J346
$$ y = [58637, 61827, 65334, 61356, 64476, 68570, 73537, 70990, 69227, 74114, 69388, 72676, 77122, 74172, 72501, 73638, 72543, 71075, 73358, 68201, 63215, 62942, 58743, 58417, 51081, 46019, 51827, 54542, 55688, 62905, 63155, 65970, 67260, 66510, 68707, 67546, 63497, 67337, 72622, 75492, 80637, 82622, 79780, 84223, 84885, 84239, 80260, 80464, 90344, 99137, 93341, 86153, 84846, 91347, 101168, 108863, 106357, 107985, 111516, 122407, 132712, 138734, 146044, 150526, 167119, 189959, 218522, 240708, 263094, 291839, 322210, 355085, 393724, 466282, 573290, 749472, 1023557, 1467389, 2150418, 3047117, 3955582, 4636315, 4914298, 4499943, 3426777, 2417845, 1780958, 1399627, 1160729, 1009570, 903040, 819745, 757449, 710245, 676244, 645566, 614822, 592091, 579479, 566374, 558237, 552839, 548127, 549473]
8338E49473O251Q935J1310J0953J0711K0966K4532L0250N4628R1636J46979K26267
8326A192891L68388N92167Q67171J036168R44683O27990O2250p96532j248086
8317C647090j005443o36739l88818k39916j61235j15289q4494o4074n4058n0715
8307H46309m3597l3425k9948k7732j7511k3031l3299k4281k0024k7136k1730j4392
8295E30203j6350j2182j3566j1621p349n940j3137m088O022P758K1626M3445O1677
8282E86498J01078J41874J42914J01065J6486q5893j76748j66092j10946o3406
8272D86830l7369l0367k4541j1632j4712j2107j1582o272L977J389m714m489q621
8259C25790j4544k0863j2784o464p861K916p241j6242j2987l692l113m403O96
$$ y = [549473, 555724, 564659, 575969, 586922, 597633, 618599, 643131, 673381, 728009, 819645, 966624, 1192891, 1561279, 2153446, 3020617, 4056785, 5001468, 5629458, 5691708, 4895176, 3647090, 2641647, 2004908, 1616090, 1376174, 1214939, 1099650, 1015156, 951082, 897024, 846309, 802712, 769287, 739339, 711607, 694096, 671065, 637766, 613485, 593461, 566325, 544595, 530203, 513853, 501671, 488105, 476484, 469135, 463195, 450058, 445970, 451992, 459750, 481376, 524821, 586498, 687576, 829450, 972364, 1073429, 1089915, 1004022, 827274, 661182, 550236, 486830, 449461, 419094, 394553, 382921, 368209, 356102, 344520, 338248, 342225, 343614, 338900, 334411, 325790, 311246, 290383, 277599, 271135, 263274, 266190, 258949, 242707, 229720, 226028, 222915, 218512, 219208]
8246B19208n022j0907k544j672q634r926j925L920p221j0706q371M78l997L280
8232A55961j094o09k74k960n425L14R174Q85q689n378l651o433L03L022k557o673
8216A25916q31j722l92M821L760m501p414M437J706m019j124n970k753p070k928
8201A01916M64J57N505K052k24q799J405j155R56n241l939J352l217q066L476
8186H6642Q21o019p275O637K298k532o762K320n59M790Q31m222p67l1m520p674
8170F3978l191o058N29l758K190P573P133L457j0276r658j924k320j0357K329
8156C9647K643L845J693K113N714l778p43P346K36j0360m530N109Q20K092N907
8141E7754m231o235M738n16m057l771K5P965m457M914L771k284o091o199l530
$$ y = [219208, 214186, 203279, 200735, 199063, 190429, 180503, 178578, 182498, 175277, 164571, 156200, 156678, 152681, 155961, 154867, 154258, 153984, 151024, 145599, 145913, 155087, 155972, 147283, 141905, 138254, 131821, 132124, 135146, 132589, 125916, 125085, 123363, 122971, 127792, 131552, 127051, 119637, 124074, 125780, 121761, 120637, 114667, 111914, 104844, 101916, 102380, 102537, 108042, 110094, 109870, 101071, 102476, 101321, 102277, 97036, 93097, 94449, 91232, 83166, 86642, 87463, 81444, 74169, 80806, 83104, 80572, 73810, 76130, 75571, 80361, 81192, 76970, 76203, 76172, 71652, 63978, 60787, 54729, 55258, 51500, 53690, 61263, 68396, 71853, 61577, 51919, 49995, 47675, 37318, 39647, 42290, 46135, 47828, 49941, 55655, 51877, 51134, 58480, 58716, 48356, 43826, 48935, 49755, 51847, 57754, 53523, 47288, 52026, 51510, 47453, 43682, 43707, 51672, 47215, 52129, 55900, 53616, 47525, 41326, 37796]
8126C7796N280q71o25n693j166R679K117m199L951O461n03m558n79K761n906K798
8110D6743n00p932j91L16j574o29K014L548n047j817k585K95L158O554M936p636
8094C9653l625O269K372l833k159N00l76j298q966p388M578P279R47q582J444
8079B6815J0105l260j888L117P743m250l750k253r48m337N585Q071K783j034j939
8064D0560O842n612k092j083j959O658p742n2L307Q2p685j150m17Q33J668k070
8048C0088n781J789M491n373M065N197m868O76O295K518O06k021k312j358J864
8033C5876j71N461k92o333K923J284k065k909K309m923l986P890j78J253j325
8018C4814K632k088n157L857N161J606o54J56K724k52J082K365n770r17n894K988
$$ y = [37796, 43076, 42205, 41580, 35887, 34721, 44400, 46517, 42318, 46269, 52730, 52227, 47669, 47090, 49851, 43945, 46743, 46243, 38311, 38120, 38436, 36862, 36233, 38247, 41795, 36748, 34931, 32346, 32641, 35799, 42353, 47289, 39653, 36028, 42297, 44669, 40836, 38677, 39177, 38801, 37503, 28537, 21149, 25727, 33006, 33953, 25371, 26815, 36920, 33660, 31772, 34889, 42632, 38382, 34632, 32379, 31431, 27094, 32679, 40750, 43533, 42499, 40560, 47402, 41790, 39698, 38615, 36656, 43314, 35572, 35520, 38827, 38909, 31224, 30074, 29657, 30490, 32158, 30088, 24307, 26096, 30587, 25214, 29279, 34476, 29608, 30284, 36579, 39097, 39703, 37682, 35370, 34012, 35876, 35705, 41166, 40874, 34541, 37464, 38748, 36683, 33774, 36083, 31160, 27174, 35064, 34886, 36139, 34814, 37446, 35358, 30201, 34058, 39219, 40825, 40171, 40327, 43051, 42799, 43881, 46246, 40476, 39559, 33665, 36653]
8002C6653j596R57q620k401J1111j806k566m83p021J158M06J574M214k918k577
7987B6085J554O220R30k886l408m637J0057O006l268L493j988l105M64l22j649
7972C3546l36J387J705K802L162r68J689K188J596M528K871P35L599K71r798p603
7956D1374j296O102J098k636M91l363l710L174M715j045p246r184j461l191L098
7941B6920M697K795N016O25j196k675n242M16O372m873k814m589J606O228M831
7926C8117J749r44L853L112P378K079p477o225k804r315k577k89L927J274O527
7911C8385J192k666l861m987l970n134n01j485j794N918O071M680l57j764j1196
7896A8531m134K584R113K196k065k232p11M629L572n043k088Q89K152j454L128
$$ y = [36653, 35057, 36014, 27394, 24993, 36104, 34298, 31732, 31249, 24228, 25386, 25792, 27366, 31580, 28662, 26085, 27639, 33859, 34789, 31903, 28495, 23858, 33915, 39921, 36653, 40146, 38158, 35053, 35517, 35195, 33546, 33210, 34597, 36302, 39104, 42266, 41298, 42987, 45175, 46771, 51299, 54170, 54905, 58504, 58775, 48977, 41374, 40078, 46180, 47278, 44642, 45133, 41770, 38060, 41234, 45949, 44904, 37658, 28474, 27013, 23822, 26920, 31617, 34412, 39428, 40053, 38857, 36182, 30940, 31356, 37728, 32855, 30041, 25452, 27058, 33286, 38117, 39866, 38922, 42775, 45887, 53265, 55344, 47867, 41642, 38838, 29523, 26946, 26657, 30584, 31858, 38385, 39577, 36911, 33050, 28063, 24093, 18959, 18458, 16973, 15179, 21097, 27168, 31848, 31491, 29727, 18531, 14397, 16981, 26094, 28290, 26225, 23993, 23282, 27911, 31483, 26440, 24352, 25241, 27393, 25939, 29067]
7881B9067R492k328r854q165p3r35j33N214J821K530K806k298K043j50p35L842
7865C2144o216k59k187l936M63j06o055j509l417l862J957L455Q144O720o858
7850A8478l526M82L074K355n888o723o949Q049M818o006k183k06L352N925R618
7835B4670J432p452l046n617l39l054Q56k486R829O640m318k979N959M703N87
7820B5385j535j239M625j201N581Q152J266K463m530l503m03m047p420m130p894
7805A1570k071L001j11r62R993jo989J376J452q36l754J392L389K353J800m800
7789A6802j453N018J044n704p639j488K60j093L788J676j599m23p37l265Q98k2
7773F063O875L835m582J39P71k390k185J666j988l497N724J221l099K173j552
$$ y = [29067, 38559, 36231, 26377, 18212, 18139, 17204, 17071, 22285, 24106, 26636, 29442, 27144, 29187, 29037, 28302, 32144, 25928, 25669, 23482, 19546, 20009, 19903, 13848, 12339, 8922, 5060, 7017, 10472, 18616, 25336, 18478, 14952, 15434, 18508, 20863, 14975, 8252, 1303, 9352, 14170, 8164, 5981, 5775, 9127, 15052, 24670, 26102, 18650, 15604, 9987, 9648, 6594, 7450, 4964, 14793, 21433, 17115, 14136, 20095, 24798, 25385, 23850, 22611, 27236, 26035, 31616, 39768, 41034, 43497, 38967, 35464, 35061, 31014, 23594, 19464, 11570, 9499, 12500, 12389, 11427, 21420, 21419, 14430, 15806, 17258, 16422, 12668, 14060, 17449, 19802, 21602, 16802, 15349, 20367, 21411, 15707, 8068, 6580, 6840, 5747, 9535, 11211, 9612, 9189, 8452, 5187, 6085, 6063, 12938, 16773, 12191, 12330, 13101, 10711, 8526, 10192, 8204, 4707, 10431, 11652, 8553, 10726, 9174]
7758I174O965K278l985m77N690M016o711m414O126M358K020j591n712n280r68
7743A1489j361k212l400o501M773N086Q52j67n713l078J902J122J968P393J90
7728A2343q69k10K141q14k454n119L863M860P95r38K410q518k948L185k903n683
7712h59N041L773l958K554p18j683M546P49J413k251J970K042j888k251O264L884
7696A8628j240R05j404m335r260J639K802m57o241J811M029j591J499J829J0427
7681A9041O211l789j1595m257o46l94K277O256L221J422k613m796J196J126o817
7666E843m927N72K763Q122O552k68M318k186l999q144L328Q801n082n622O97l792
7650F976K775m661j367l475J185M634L129M420q32k454n533L626J46j755r9L790
$$ y = [9174, 16139, 18417, 14432, 13955, 19645, 23661, 16950, 12536, 18662, 23020, 25040, 23449, 17737, 12457, 11489, 10128, 7916, 4516, -1985, 2788, 7874, 8726, 8559, 2846, -232, 1670, 2792, 4760, 12153, 12343, 11474, 11264, 13405, 12591, 10137, 5018, 8881, 13741, 14536, 13598, 16008, 7490, 4542, 7727, 4824, -859, 4182, 7955, 3997, 6551, 5833, 4150, 8696, 9445, 10858, 8607, 10577, 12619, 10731, 8480, 14744, 18628, 17388, 18293, 16889, 12554, 3294, 4933, 7735, 7278, 1037, 2848, 6877, 5286, 6785, 8614, 19041, 25252, 21463, 9868, 5611, 4965, 4571, 6848, 13104, 16325, 17747, 15134, 10338, 11534, 12660, 5843, 916, 1488, 4251, 12373, 18925, 18657, 22975, 20789, 16790, 8646, 11974, 20775, 15693, 10071, 10768, 6976, 9751, 5090, 3723, 248, 1433, 6067, 9196, 13616, 12784, 10330, 4797, 8423, 8569, 6814, 6715, 10505]
7634A0505L693n736l378P55l149L555O78j942j600P54Q73o200r58R227J1343j037
7618A7383k163Q47P87j968k109L929j611r289P68N853P54K006n277J643j24L242
7602A4671j445l763J227K820j297j278l390k151j534k152N50K860l145N524K970
7587A0467j548o245j673K755l123p99l913q53Q686J196L623P234J556r474n185
7572B704k26J729N261K245n98K39j648l313L763O831l834k317k347o288l454L561
7556B308O175N98n594m662K562m19M393O772l64j095M266M97k980J445m241o98
7540H963L331K084k822n421K246K243p59L218L16o079K998k36l833k785o8J149
7524D545l06K281Q096J247k922l128J556L124J227K443J091J56l245j508m970
$$ y = [10505, 14198, 8462, 5084, 5839, 2690, 6245, 6923, 4981, 3381, 4135, 5008, -1192, -2150, 7077, 18420, 17383, 15220, 16067, 16854, 14886, 12777, 16706, 15095, 5806, 6574, 12427, 13181, 15187, 9910, 11553, 11429, 14671, 13226, 9463, 10690, 13510, 12213, 10935, 7545, 5394, 3860, 1708, 2258, 5118, 1973, 7497, 10467, 8919, 2674, 1001, 3756, 633, -166, -4079, -4932, 3754, 4950, 8573, 15807, 17363, 7889, 2704, 2478, 4207, 9468, 11713, 11115, 11354, 9706, 6393, 10156, 16987, 13153, 10836, 8489, 2201, -1253, 2308, 8483, 9081, 3487, -1175, 1387, 968, 5361, 12133, 11769, 10674, 14940, 15437, 12457, 13902, 9661, 8963, 12294, 14378, 11556, 6135, 8381, 10624, 9865, 13083, 13399, 7320, 10318, 10082, 6249, 3464, 3396, 4545, 4239, 6520, 14616, 15863, 12941, 9813, 11369, 14493, 15720, 18163, 19254, 19410, 16165, 14657, 9687]
7509I687j039m685j752J764n92Q68N486m147m072j354M69Q974P117K867m772l303
7493A1516M656l692k88m105M77k81n985m664N517K81M536Q284n320j1o715j0615
7477f409N559J0456M327Q06m739k421K693k087J735J652M307K270K328l335j0813
7462F329K97N165L193j385k820o1M116M145l244J078j0153l573N281J260k495
7447G133M080r41k052n121L478M58J425K778l553J306j991j804p98o177q257j52
7431a0188O467M569R15m673K067O463R069N013q896p066K87p938q36j421L596
7416b572K913O268O212J505R82k585K020j975o119N979K847m23q660j0579J782
7401b405M651Q967o9J409m211j183K316l012K732J2602O27j1367n74R54n762o405
$$ y = [9687, 8648, 3963, 2211, 3975, 3383, 4251, 9737, 5590, 1518, 164, 633, 9607, 16724, 19591, 14819, 11516, 16172, 12480, 12192, 8087, 8564, 8283, 2298, -2366, 3151, 3432, 7968, 16252, 10932, 10921, 4206, -6409, -850, 9606, 13933, 14739, 10000, 7579, 10272, 8185, 9920, 11572, 15879, 18149, 20477, 17142, 6329, 6626, 11791, 14984, 13599, 10779, 10718, 14834, 18979, 15735, 16813, 6660, 3087, 8368, 9628, 7133, 11213, 10272, 8220, 3099, 6577, 7035, 8460, 11238, 7685, 8991, 7000, 5196, 4398, -1779, -10036, -10188, -3721, 848, 1763, -2910, -843, 5620, 14689, 19702, 10806, 3740, 4027, -3911, -4747, -6168, -2572, 341, 6609, 12821, 14326, 15308, 12723, 14743, 12768, 6649, 12628, 15475, 15052, 6392, -4187, -2405, 2246, 11213, 11144, 12553, 8342, 7159, 9475, 6463, 9195, 21797, 22424, 11057, 10483, 11437, 5675, -730]
7385g30j579k062p07q45L684J2137J826N994N357m131j2597m761N050j855n286
7370e05J0656J2824j875q753J100K336J447j1352m803L649j875o969M300O592
7356F772R85m317N47J86L846L032r401k373p62L074J783M170m364l506l180M854
7340A346M888M610n677m581l166M552J94o57P73m111q18K232O37J914J974L113
7324G223l301l66R45n450K904m354K504J31m549m547q54j645N817l054M98O126
7308a972N727j602Q61O040K257l350M238O322n768r993n357J954j0006o702J268
7293a6083J0148Q054K33j19N528P832K21M604O835O079M435j518p629j1239m328
7278A3053K330n385j2239k867R33P537J763o520J536M809P43K139n863p544K833
$$ y = [-730, -2309, -4371, -5078, -5923, -2239, 9898, 11724, 17718, 23075, 18944, 6347, 1586, 6636, 4781, -505, 10151, 22975, 21100, 12347, 13447, 15783, 17230, 5878, 1075, 4724, 2849, -4120, 180, 6772, 7757, 3440, 3987, 4173, 8019, 11051, 1650, -723, -1485, 1589, 3372, 7542, 3178, -328, -3508, 1346, 6234, 10844, 5167, 586, -2580, 1972, 2166, 1509, 2282, -1829, -2647, -415, 222, 2136, 4110, 7223, 3922, 3556, 4501, -949, 1955, -2399, 105, 236, -4313, -8860, -9714, -11359, -5542, -8596, -8098, -1972, 3755, 2153, 3014, 9054, 11311, 7961, 12199, 18521, 12753, 2760, -2597, -643, -10649, -17351, -16083, -5935, 2119, 2352, 2233, 7761, 15593, 15814, 20418, 27253, 33332, 37767, 36249, 28620, 17381, 13053, 15383, 9998, -2241, -5108, -4175, 3362, 5125, -1395, 141, 4950, 5693, 7832, 1969, -5575, -2742]
7263b742N01m668o779J505O552Q240J356o90k024M389Jl651k423n998K60N741
7247d30M701n336K804j09O62N240l562l245N030m485p838K038K985M176O911j800
7231G742j338M913n863m673N341O814N95k048p936p919L433R415J048j2608m35
7216c519K212q442j857R812N476Q06m588Q448P796m327J601m521k804q206m294
7201f407l173P525M488k460o627L857O582J754k754j240l610l903o4J949J1044
7186F961m051k169j19L250K08P0j684K193K991j236J430K137j463l024K924M106
7170A2524p936l886K114L445m587N696N110k448q77m772J913l439l847n270k222
7155h482N955N979N016m219j209K805k973l088n515O265L943k675j617L253K772
$$ y = [-2742, -2241, -6909, -13688, -12183, -5631, 2609, 3965, 3275, 1251, 5640, 5641, 1990, -433, -6431, -6171, -430, 4271, -1065, 1739, 1630, 2292, 7532, 3970, 725, 5755, 1270, -6568, -4530, -1545, 2631, 9542, 7742, 6404, 11317, 5454, 781, 6122, 12936, 13531, 11483, 3547, -4372, -939, 8476, 9524, -3084, -3519, -1307, -9749, -11606, -1794, 3682, 4488, -100, 8348, 16144, 11817, 13418, 8897, 6093, -2113, -6407, -9580, -2055, 2433, -27, -6654, -2797, 3785, 5539, 2785, 1545, -2065, -5968, -6032, -4083, 6961, 2910, 741, 622, 3872, 4080, 4150, 2466, 4659, 7650, 6414, 7844, 9981, 8518, 5494, 8418, 12524, 4588, 702, 2816, 6261, 1674, 7370, 12480, 10032, 9155, 4383, 6296, 2857, -990, -6260, -8482, -2527, 3452, 8468, 4249, 3040, 5845, 2872, -216, -5731, 534, 4477, 1802, 185, 3438, 6210]
7140F210J008l184k390M067k712p059l649J0378N855j830q583J299L594O860N211
7125A5075l317o298J868L514j371k719l441Q41M283j600O349m115l324l509L648
7110E884J4616L560r424n602m890q180n328O698M074M170M237m582K370J0598
7096A8201m804o259L66j02k537O37l26k029Q09r28n495k520j77k709P585P965
7080G677l87l809m497n415j782J506J554j027l606K673M662K014J287Q8n007k5
7064d094M545k47K636L170p646n058J0224J731m227L906M713K643j164L922j080
7049A3974o612j792j199J252J0149K43q473n614J363Q93J908j221k483K858r92
7034D254n039J986M461J295L058n040K384j780m902m764m910L482N832K195N106
$$ y = [6210, 7218, 4034, 1644, 5711, 2999, -4060, -7709, 2669, 8524, 6694, -1889, -590, 3004, 9864, 15075, 11758, 5460, 7328, 10842, 9471, 6752, 3311, 4152, 8435, 6835, 13184, 9069, 5745, 2236, 5884, 20500, 24060, 14636, 9034, 4144, -4036, -9364, -2666, 1408, 5578, 9815, 5233, 7603, 18201, 13397, 7138, 7504, 7402, 4865, 5502, 5176, 3147, 3956, 3028, -2467, -4987, -5164, -7873, -288, 7677, 7290, 3481, -1016, -6431, -8213, -6707, -5153, -6180, -9786, -7113, -2451, -437, 850, 938, -4069, -4094, 451, 204, 2840, 6010, -1636, -6694, 3530, 5261, 1034, 4940, 9653, 12296, 11132, 15054, 13974, 7362, 5570, 4371, 5623, 15772, 16015, 7542, 1928, 3291, 4184, 6092, 4871, 2388, 5246, 4254, -785, 1201, 5662, 6957, 10015, 4975, 7359, 5579, 677, -4087, -8997, -5515, 317, 2512, 7618]
7019G618M627o008n583l328N115L865K920p328p323r56L124Q281J013M263M820
7004A5120L058p080l993m7n645K19q036p811P222N313J38P404l033L12L214K195
6988H550k944k05m753k850L117Q276l921m877m89L387r03K251J696j106M31l65
6972E295K100l267j962j497J028O745o781R92k129K679J602k49k800J361K974
6957F091N863N38l891l703K977L823K391m967o502P25j864K187M542K449K039
6942A2698J004l799J041J414J0046k806j2184m156N51k163j012L131o380M3m84
6927c056j195q386l639J52J0237O781Q869J93q392j838O221M114m826L534Q90
6912I659n842J508Q89J893q24j775J149N917k194j106n968n986M337P91l17K141
$$ y = [7618, 12245, 6237, 654, -2674, 2441, 6306, 9226, 1898, -5425, -6381, -3257, 5024, 6037, 10300, 15120, 18178, 11098, 7105, 7058, 1413, 1632, -6404, -14215, -6993, -1680, -1542, 5862, 2829, 3141, 6355, 8550, 5606, 5401, 648, -2202, 915, 9191, 5270, 393, -96, 3291, 2388, 4639, 6335, 5229, 5660, 5295, 7395, 4128, 2166, 669, 1697, 8442, 1661, 2653, 524, 3203, 4805, 4556, 1756, 3117, 6091, 11954, 12492, 8601, 4898, 7875, 11698, 14089, 9122, 2620, 3345, 1481, 3668, 8210, 10659, 12698, 13702, 9903, 10944, 12358, 22404, 19598, 7414, 3258, 3809, 1646, 634, 3765, -2615, -2572, -3056, -4251, -12637, -16276, -16124, -5887, 894, 9763, 9956, 1564, -274, 5947, 10061, 5235, 8769, 9659, 3817, 5325, 6214, 8107, 7283, 5508, 6657, 12574, 10380, 9274, 3306, -2680, 1657, 2448, 2131, 4272]
6896D272M152M110J535p547J247l544m462m095P02J947J30o13m297Q99p33l87
6880f684P495K666p28m938o35k265L249L025L581n19J465j075J353k316j856p843
6864f025n121N949M523L924M73Q78k116j340L287j328o735K177K907p122j143
6849f812O824O106k423K28j215k860O10O033l290o026p65J589o278K391N649J064
6833H25J378k71R40M538k966L269n478n433o316O895O871m793l897o30n944J404
6817i608Q148J737O79n766o621L813O942M127j612k096M446P416J089n735q832
6802a873N118M026o877n609j590L222P874M421j876N520k013m282l660oq34K922
6786D483K49q568l864K182M557K318Q64J737N53o65n501o95K708J09K731l253
$$ y = [4272, 8424, 12534, 14069, 6522, 7769, 4225, -237, -4332, -3630, -1683, -1553, -2166, -6463, -5564, -6297, -6684, 811, 3477, 2749, -2189, -2824, -5089, -1840, 1185, 4766, 4247, 5712, 4637, 5990, 3674, 1818, -6025, -11146, -5197, -674, 3250, 3723, 4601, 2485, 1145, 4432, 3104, -3631, -1454, 1453, -5669, -6812, 12, 6118, 3695, 3923, 2708, -152, 458, 6491, 3201, -2825, -3590, -2001, -8279, -5888, -239, 825, 2203, 1932, 2872, 7410, 4444, 7713, 2235, -3198, -9514, -2619, 4252, -541, -4438, -5068, -11012, -9608, -1460, 277, 956, -4810, -11431, -7618, -676, 3451, 1839, -257, 4189, 11605, 12694, 6959, -1873, 3245, 7271, 394, -5215, -6805, -3583, 4291, 8712, 6836, 12356, 10343, 6061, 2401, 2395, 1561, 4483, 4732, -3836, -7700, -5518, -961, 1357, 2221, 3958, 4511, 3846, -1655, -2350, 358, 467, 3198, -55]
6770e5r47j616L173K146P623k993J784K45p57j651k325n560J254o99k000o998
6754i376N935J845j192P056R464k178o02L600O318N146n565M14P745J2260J32
6739D1002m758J867m30m672p416o560j959k456K266j232j620O54m363k968l646
6724C709L83K820L150O64o52N702n488l921n338q417P05N862M873J793n81j344
6708C920j866k798N346k07l886K855M789K147L394j646k37l591L004P738j211
6693A7751m732n711l679P479J23j0890K408j397n285l962m303M713Q00R938Q40
6678D093P31M043n46k871r06M478N349m193j2860R94L919O145L923M582l542j0121
6662C218m306j723L031N680m830k040O218P210J949K78Q69R19m387n931P9L291
$$ y = [-55, -1002, -2618, 555, 2701, 10324, 7331, 9115, 9360, 8603, 6952, 4627, -933, 321, -378, -2378, -9376, -3441, -1596, -2788, 4268, 13732, 11554, 10952, 14552, 20870, 26016, 20451, 20865, 28610, 40870, 41002, 36244, 38111, 37681, 33009, 25593, 19033, 17074, 14618, 16884, 15652, 14032, 14686, 10323, 7355, 3709, 4092, 6912, 10062, 10726, 10074, 15776, 10288, 6367, 1029, -7388, -6683, -821, 4052, 5845, 5264, 3920, 2054, -744, 4602, 4395, 509, 3364, 8153, 10300, 13694, 12048, 11811, 8220, 11224, 18962, 17751, 13019, 7308, 3629, 11108, 11231, 341, 2749, 1352, -3933, -7895, -12198, -7485, -6685, 3253, 4093, 4824, 8867, 8321, 5450, 4544, 9022, 14371, 10178, -2682, -1688, 2231, 8376, 12299, 16881, 13339, 3218, -1088, -2811, 220, 5900, 1070, -970, 5248, 12458, 14407, 14685, 15554, 16473, 12086, 6155, 6234, 9525]
6646I525q65j188M439J941J910J550m003J189M225p407k178k618n475k505L205
6631A745J952k164Q41K622M206k198o723m386M053Q896J448q333j945J090P84
6616A888J943r31k245k317M495m422q351O573l175K580P421p197k513j843M208
6601c886N08L761p602k077R381N902l191M220J18K606j447n332k663j390K575
6586A483j58j554m74K715r980J199P702M80o227L787Q702K209j340o971K54J925
6570C752O009K4k490N100k505m209m418j749M860P468q428p832M730j49K277J579
6554D019L532J891L057l744m732q697j883Q379M064j862l74p532p660m798k660
6539a9000O019K89k213K274Q109Q559l379p738J512J085o8j01M156L433k396J934
$$ y = [9525, 8660, 7472, 11911, 13852, 15762, 17312, 13309, 14498, 18723, 11316, 9138, 6520, 1045, -1460, 1745, 3697, 1533, 2374, 4996, 9202, 7004, 281, -4105, -52, 8844, 10292, 1959, 14, 1104, 1888, 3831, 2900, 655, -1662, 2833, -1589, -9940, -3367, -6542, -3962, 3459, -3738, -6251, -8094, -3886, -3378, 383, -7219, -9296, 85, 5987, 2796, 7016, 7134, 9740, 8293, 2961, 298, -1092, 1483, 1325, -229, -703, 2012, -7968, -6769, 933, 1413, -4814, -1027, 7675, 9884, 8544, 1573, 1827, 3752, 9761, 9785, 7295, 12395, 9890, 5681, 1263, -486, 4374, 11842, 3414, -4418, 312, 163, 2440, 4019, 7551, 9442, 12499, 8755, 4023, -4674, -6557, 1822, 5886, 4024, 3650, -3882, -11542, -16340, -19000, -12981, -12692, -14905, -12631, -4522, 4037, 658, -7080, -5568, -4483, -4551, -4652, -496, 2937, 541, 2475]
6523B475L828K673p504p78m522l709O494Q779K819L4q40n96j140k574r098l977
6507g636M653P82l622M550N645Q28K022L118N31n336m904J31J497R54n942n918
6491h647N870J492n894J626O176O867o17m708j502k600K873K544n826p452J957
6476g841Q497K104j036P77M695J821r044l609M83M747k846p711J713L748M273
6461G71k773O12n907L263K635J392N788O775K395r32k28M400m571j755Q47k069
6445A0643n261L58n063m787k840K88J0002K571J289j027j013m965O454k384j2488
6430h223k092K021J266k812N35K187q611J584J0195K828j345o626N57M545l496
6415g487j738L381Q05L055J06L992J420J47L715m871j595j944J697j354K967K227
$$ y = [2475, 6303, 8976, 1472, 694, -3828, -7537, -1043, 7736, 10555, 10589, 9749, 9153, 8013, 5439, -3659, -7636, -2983, -2201, -5823, -1273, 4372, 5200, 7222, 10340, 10871, 5535, 631, 762, 2259, 3213, -2729, -8647, -2777, -1285, -7179, -5553, 623, 7490, 6873, 2165, 663, -1937, 936, 3480, -2346, -9798, -7841, 656, 2760, 1724, 2501, 7196, 9017, -27, -3636, -3153, 1594, -1252, -8963, -7250, -3502, 771, -2002, -1390, -7297, -4034, -1399, -7, 5781, 12556, 14951, 14019, 13791, 18191, 13620, 11865, 12712, 10643, 5382, 5740, 677, -4110, -6950, -6662, 3340, 5911, 7200, 6173, 5160, 195, 6649, 4265, -8223, -10315, -8294, -7028, -9840, -9305, -7118, -15729, -14145, -3950, -1122, -2467, -9093, -8536, -3991, -7487, -9225, -5844, -5039, -1984, -1878, 2114, 3534, 3681, 7396, 2525, 930, -1014, 683, -671, 2296, 4523]
6399D523K932j1463r34q08L218K477j835Q646l37l143l705j746L192J310o179
6384c852J630O203R18L55K140k590J8n261n006k874j245R198j833o856K877O968
6368G90K43J933R373p854q084j057k599k021o603O1J224K159j781j980p82J607
6352a5371M735r68K718j818J295P872J2338J908o480j392k653o288L147K305j701
6337c53J147Q885m593l814J655n401n455J663l506K059p4P345K123m705L572N649
6321F197k993k418N268k871j829j870k746l757r030J144J1673P676n324j619m86
6306b985j093k378M277M558R74l614p5R89m767k78m495j833m048K076N142P558
6290Hj125l623K798J678m523l221k21K756k320K930L922q959o452K661M272O623
$$ y = [4523, 7455, -4008, -4942, -5750, -2532, -55, -1890, 6756, 6419, 3276, -429, -2175, 1017, 2327, -3852, -2222, 3981, 4899, 5254, 7394, 4804, 4822, -439, -5445, -8319, -9564, -366, -2199, -9055, -6178, 790, 1033, 2966, 12339, 4485, -3599, -4656, -7255, -9276, -15879, -15818, -14594, -12435, -14216, -16196, -16978, -15371, -10636, -11604, -8886, -10704, -9409, -1537, 10801, 12709, 6229, 4837, 2184, -4104, -957, 1348, -353, 794, 9679, 5086, 1272, 2927, -2474, -7929, -6266, -9772, -7713, -7787, -442, 1681, -3024, 548, 6197, 3204, 786, 6054, 3183, 1354, -516, -3262, -7019, -16049, -14905, -3232, 4444, -880, -2499, -2985, -4078, -6456, -2179, 2379, 3353, -261, -336, 653, -4114, -4392, -8887, -10720, -14768, -12692, -7550, 8, -1117, -4740, -1942, -264, -4787, -8008, -8229, -5473, -7793, -4863, -941, -9900, -16352, -13691, -9419, -2796]
6274b796J175k305K272k295j873j281m489K255n03o851m413J91J193l597L557
6259a9760P239j354k415M464R61k872L893K871j410n9k312M056j24p192k99N14
6243a3799P066L874q55O52j250L255l993L812k714r479L89Q310K78N116k751K031
6227e8O189J002m350R089k837n295p35l288j690M838M021k484l043l029m566K139
6211d097M272K360m568l054n170J356J645n03L568K885K30n051K255K585j966
6196c253M184j457k218m547o040M226M694n068Q74M87p38O887l84k082N249O688
6180G502K952o202p293N632k176m413K260L77j290j955m978L877r79j934N417
6165c203K384p359o813o36J886K720M026K963J4924J5436J3807N201K949l099
$$ y = [-2796, -1621, -3926, -1654, -3949, -5822, -7103, -11592, -9337, -9840, -16691, -21104, -20913, -19720, -23317, -19760, -12521, -13875, -16290, -11826, -10865, -13737, -9844, -6973, -8383, -8442, -10754, -6698, -6822, -14014, -14313, -13799, -6733, -2859, -3714, -3062, -4312, -1057, -5050, -1238, -3952, -13431, -13042, -4732, -4454, 662, -2089, -58, 6131, 7133, 2783, 11872, 9035, 3740, 3005, -283, -1973, 2865, 6886, 4402, 1359, -1670, -6236, -4097, 175, 2535, -2033, -5087, -10257, -8901, -7256, -7759, -4191, -1306, -1076, -6127, -3872, -1287, -3253, 931, -526, -2744, -7291, -13331, -9105, -4411, -9479, -8605, -8118, -8856, -1969, -2353, -4435, 814, 7502, 10454, 4252, -3041, 2591, 415, -3998, -1738, -1361, -2651, -4606, -9584, -5707, -6686, -8620, -3203, -819, -8178, -14991, -15627, -13741, -11021, -6995, -4032, 10892, 26328, 40135, 45336, 48285, 45186]
6151D5186n071j1291j9066m922p840q018p144P88o99k016M446L434L653K719P076
6136A235L891n846o344J746J021K537M118R912l100n153j537o876p314K06J241
6121a0263l877J178J467k163M335O178k707o45P53j929j175r0L2N055j324m540
6105i715N798L960L908J409K722l216o22K359o83q55K78J697J578m098r80j263
6089B277J499q0m076o514k433K458R448J255K303R448M715n229n708l024k58n456
6073F25q23p059Q72P105K760k092j097K484N265q04o156q009k691N936M909j382
6057a57J576J863k966l036Q848J093o570l419N931L5l066K48o198m085k885J920
6041a0868l291l408L089L686N937N299M8N071O24n720k313p561k233N381P373
$$ y = [45186, 40115, 28824, 9758, 4836, -3004, -11022, -18166, -17378, -18077, -20093, -15647, -12213, -8560, -5841, 1235, 5126, -720, -7064, -5318, -4297, -1760, 2358, 12270, 9170, 4017, 2480, -4396, -11710, -11504, -10263, -14140, -12962, -11495, -13658, -9323, -3145, -5852, -6497, -5744, -7673, -8848, -8938, -8906, -3851, -5175, -9715, -3917, 43, 3951, 5360, 8082, 4866, 4244, 6603, 5920, 5065, 5343, 7040, 8618, 4520, 3540, 2277, 3776, 3696, -380, -6894, -9327, -6869, 2579, 3834, 6137, 15585, 20300, 15071, 9363, 6339, 6081, 625, -198, -7257, -6385, 720, 3480, 1388, 291, 2775, 8040, 7236, 1080, -6929, -9620, -3684, 1225, -157, 1419, 3282, 316, -2720, 6128, 7221, 651, -2768, 3163, 3198, 132, 380, -5818, -9903, -12788, -10868, -14159, -17567, -14478, -10792, -4855, 444, 492, 5563, 6187, 467, -1846, -9407, -11640, -6259, 1114]
6026A114N578j238o249n73j11L297l177j136M627l521K332l55k621l833Q549P081
6010I764p454m886k388L3P532P4K647l749m961m472J259K229j344m478L823O625
5994B54O443j182j163Q90p42L65K698M202M844l282m265l746q445q23K158L822
5978B028m521N966o12k054M52J397M402N914j502k750n232l913j0048o599L111
5963a3961k637J1668P516l835j936P890J050j0468j820M228Q47n584j817M893
5949c966N949P58J333K43l004n188K433L78k633K673N201k741o019j503P530K328
5933C772n582K533n4l079N1M77M303J319j931k290o066j755P511K581o0L841K202
5916G773K14L283k310m247r20N113Q623n416j853o352l063O6j636L61J158p747
$$ y = [1114, 6692, 5454, -795, -1368, -1479, 1818, -1359, -2495, 2132, -1389, 943, 588, -2033, -5866, 2683, 9764, 2310, -2576, -4964, -4931, 2601, 2675, 5322, 1573, -3388, -7860, -6601, -4372, -5716, -10194, -6371, 254, 6697, 5515, 4352, 5242, 4500, 4865, 7563, 11765, 16609, 13327, 9062, 5316, -3129, -3952, -1794, 2028, -2493, 3473, 2861, 807, 1259, 2656, 7058, 12972, 11470, 8720, 3488, -425, -10473, -17072, -13961, -16598, -4930, 2586, -1249, -3185, 4705, 5755, -4713, -6533, -2305, -1458, -7042, -8859, -3966, 1983, 2741, 4074, 4317, 1313, -3875, -1442, -1064, -3697, -1024, 4177, 1436, -4583, -6086, 1444, 3772, -1810, 723, 669, -2410, -2359, -1882, 2421, 3740, 1809, -481, -6547, -8302, -791, 1790, 1730, 5571, 7773, 7987, 11270, 8960, 4713, 3793, 8906, 17529, 12113, 10260, 3908, 845, 911, -725, -364, 794, -6953]
5900f953L247L297O60J181N222O28j936p215m654M900Q278n750l049Q15J783J848
5884B302K470k089j170o547J397N510j435l924k333j61k204J832L798l567l971
5869a0092N914N36P857N497Q405m94k605n16m416p720j1795N88R683L267l047
5854A062l057L131Q30r144R0L659J885L149j952K555q144n558n85M189K670L644
5838a576N844q80p493j004J508K874O65l302M891J862m954m112k349o40N700J0267
5822G301j671k178r46k294k837R69k298j579j386P377j268n76O12j829l244J085
5806d762R083Q75p213Q90k993O223L82R50J02n402p936k906R72J923L702m306
5790a0416K766K516n088j3R521R33j253q77o613j258K540M8j418K061q5K544J260
$$ y = [-6953, -3706, -409, 251, 1432, 6654, 7282, 5346, -1869, -6523, -1623, 6655, 905, -2144, -1329, 454, 2302, 4772, 2683, 1513, -5034, -3637, 1873, 438, -3486, -5819, -5980, -8184, -6352, -2554, -6121, -10092, -4178, -3642, 4215, 9712, 18117, 17623, 15018, 14502, 10086, 2366, -9429, -8841, 842, 4109, 1062, -1995, 1136, 1966, -7178, -7088, -3429, -1544, 1605, -347, 2208, -5936, -11494, -12079, -7890, -5220, -1576, 4268, 3388, -4105, -5109, -3601, -727, -62, -3364, 1527, 3389, -1565, -5677, -8026, -8666, -2966, 7301, 5630, 3452, 2506, 212, -2625, -1656, -3954, -5533, -6919, 458, -810, -1386, -774, -2603, -5847, -4762, 4321, 5196, -2017, -1127, -4120, 2103, 2485, 3435, 3537, -1865, -9801, -12707, -11735, -9812, -6110, -10416, -7650, -5134, -10222, -10235, -714, 219, -1034, -1911, -8524, -9782, -7242, -7194, -8612, -6551, -6636, -4092, -2832]
5773b832j507p98K276o250o362j099L795N546M47m83J162L17l493j252K114J90
5757h229K129M587m881r063j231L627P712M862J557n179j11J720j344o955j968
5742a2767O773l151j729L974j19M559N07k586L081J333j0107Q66P160Q44L51J2
5726i99J5k844m114n599K222L671N832j74k833n352M972J2391k534o303R07N82
5710a60o943N64K638j469m396l592O804L680q78j398N91L966K81J573j490l29
5694e58k608J37k486j876J083k049k244P148P571L778k700l619M825K1l833p099
5678d509m855L618J993p50j638k179J83O578O844J222o121k317M738L111j155
5663D763q343k42R94J199j798L529K302o33l097l230M514K740j172j152N737P191
$$ y = [-2832, -4339, -5137, -2861, -9111, -15473, -16572, -12777, -7231, -6784, -7267, -6105, -5788, -9281, -10533, -8419, -8229, -6100, -1513, -6394, -15457, -16688, -13061, -5349, -487, 1070, -4109, -4220, -2500, -3844, -10799, -12767, -5994, -9145, -10874, -6900, -7019, -2460, -1953, -4539, -1458, -125, -10232, -9366, -2206, -1362, -1011, -999, -984, -3828, -7942, -13541, -11319, -7648, -1816, -1990, -4823, -10175, -5203, 7188, 4654, -1649, -742, -160, -7103, -6539, -3901, -5370, -9766, -13358, -6554, -2874, -3752, -5150, -4559, -593, -312, 1261, -229, -558, -3166, -3029, -5515, -7391, -6308, -8357, -10601, -3453, 4118, 7896, 5196, 1577, 6402, 6423, 2590, -4509, -9364, -5746, -3753, -4503, -6141, -8320, -8137, -1559, 5285, 6507, 386, -1931, 2807, 5918, 4763, -3580, -3822, -2828, -1629, -3427, 102, 2404, 1771, -1326, -4556, -42, 2698, 1526, 374, 6111, 13302]
5647A3302q93j2356l967N509K281P6K112j739r164K248k237l027m87l913N518
5632f737N996J341o20j834L675j760p117l844M169K999P15N626L485j152p106
5617b164J804O120o387p745o428N671P969N230K825l992K378K632m864j0920n14
5602h385k810j733M088L219M117j233k342N145n396M362o44o876m535N141O00
5587g282J855K258K013N068K195L890p0J68p251n030k979K304K759r84n63R735
5571H086N192q913O58o36R71N414o332j155n051o055N57n844q8R383Q086L792
5555H065P173M06j233j670k796r828k914l10m530J005j531k269J098m967J363
5540a2938K151j258L789l921n58o413L115K410N168J095K346O985j515j981k481
$$ y = [13302, 12409, 53, -3914, 1595, 3876, 3952, 6064, 4325, -4839, -2591, -4828, -7855, -8342, -12255, -6737, -741, 600, -20, -1854, 1821, 61, -7056, -10900, -6731, -3732, -3017, 2609, 6094, 4942, -2164, -360, 5760, -627, -8372, -14800, -9129, -1160, 4070, 6895, 2903, 5281, 7913, 3049, -7871, -8385, -11195, -12928, -8840, -5621, -1504, -2737, -5079, 66, -5330, -968, -1612, -8488, -13023, -7882, -7282, -5427, -3169, -1156, 3912, 6107, 9997, 9927, 10095, 2844, -2186, -5165, -2861, -102, -1086, -1649, 8086, 13278, 4365, 5023, 4387, 5358, 10772, 4440, 3285, -1766, -7821, -7264, -13108, -13196, -3813, 4273, 8065, 15238, 15644, 14411, 12741, 9945, 117, -2797, -3107, -7637, -6632, -8163, -10432, -9334, -14301, -12938, -10787, -12045, -8256, -12177, -12735, -19148, -16033, -13623, -8455, -7360, -5014, 1971, 456, -1525, -4006]
5525d006k341k994J984N720J731p829P33O919N993k169L16l385m276l458o760
5510a3822p226N351M547N137j314L651J560K617l417k752m08Q41J905J985l439
5495d784n804J474k389k202J225n243L387J3170O451p39r421r104r28L715M956
5480f236K491k5j150k536Q1J0013R829n192j140o099n13j129p77J2550O175r724
5464F618r511K255P7J000N854n395l714K644k552j056L024r84K026r40l181K737
5448a098J527j113K53K333k654m696o372K344k949J424P507J640m156l260l878
5433a3148L260N810l505n908M430M469K186l997K846J049R97r523l348M397M995
5418d990J841J713n26j470k247l781j148l698m459m58L059M869M836J918J609
$$ y = [-4006, -6347, -9341, -7357, -1637, 94, -7735, -7002, -83, 5910, 3741, 4057, 672, -3604, -7062, -13822, -21048, -15697, -11150, -6013, -7327, -3676, -2116, 501, -2916, -5668, -6076, -5235, -3330, -1345, -4784, -10588, -9114, -11503, -13705, -12480, -17723, -14336, -1166, 5285, 4546, -4875, -13979, -14907, -11192, -6236, -3745, -3770, -4920, -7456, -7375, 2638, 12467, 7275, 6135, 36, -477, -1606, -2383, 10167, 16342, 6618, -2893, -638, -561, 439, 6293, 898, -2816, -172, -2724, -3780, -756, -1740, 286, -654, -3835, -1098, 429, -684, -431, 1902, -752, -5448, -11820, -9476, -12425, -11001, -3494, -1854, -6010, -9270, -13148, -9888, -4078, -7583, -13491, -9061, -4592, -2406, -6403, -3557, -2508, -1511, -11034, -14382, -9985, -4990, -3149, -1436, -1962, -3432, -5679, -9460, -10608, -14306, -18765, -19223, -16164, -11295, -6459, -4541, -2932]
5403b932J212p28K583L571K207R50m234j248j0994m275q60M414N969q15o760J1
5387a1929J2408Q12m809k956L067J024j66l648l896k792N895N783M189M146j1763
5372d635o051j77o390J273J1523K356J441l724l941K230J452J766k913l453k918
5357a2161k28K51K948P67n388K769J0276M140m187j48J359M341N181p644r367
5342g091r272N480O187l340M752K795P79J886m399L819N791j636k567k302N54
5327A436k175n419m382j572N57M607N456L159k452L22q323l993L129O610K786
5312b54K174J202k642l50o36j134O449M597l487m799n35l81o042O39J996l432
5296f635m130N968R473l595l352k35l32N41P890J24k328r20O5q447m821J835k284
$$ y = [-2932, -1720, -2448, 135, 3706, 5913, 6863, 2629, 1381, -9613, -13888, -14748, -10334, -4365, -5180, -11940, -11929, 479, 1291, -3518, -6474, -3407, -2383, -2549, -6197, -10093, -12885, -6990, -1207, 2982, 7128, -4635, -10686, -10863, -17253, -15980, -4457, -2101, -660, -4384, -8325, -6095, -4643, -2877, -5790, -9243, -12161, -12389, -12138, -9190, -8423, -13811, -11042, -766, 3374, -813, -961, 398, 4739, 9920, 2276, -7091, -16363, -10883, -4696, -8036, -3284, -489, 290, 2176, -2223, 1596, 7387, 5751, 3184, 882, 1436, -739, -6158, -10540, -12112, -11555, -6948, -1492, 1667, -785, -463, -8786, -12779, -9650, -3040, -254, 1920, 3122, 480, 130, -506, -1640, 4809, 9406, 5919, 1120, 585, 204, -5838, -5199, -3203, -6635, -10765, -4797, 4676, 1081, -2271, -2506, -2838, -2297, 5593, 5717, 3389, 2469, 2534, -5913, -10734, -8899, -11183]
5279a1183N963N737j435K891l648L525J198j758J291J434q121n553L066K611P490
5264C508Q443M946n052o424J532q74j664j483n052j726j017m025p111Q783M465
5249b751l423l875l4M387K858l083K093J419l869k430Q6O255O590l325L235L515
5233G648p23m976r581J740K828l784K447n11N237l874n560K885R830P055L12m668
5217F305j805K120k022o934n935j629j426k006L023j014J360Q993L724k748m180
5202d174q86M998j885r563l346K753M676N360j233j055j046L625n901j374L807
5187e244J337k18J386J633K37j547m98j314l293O435L994l446j754K512L643q20
5171C043l758q4J456n17M20P940R458m163l544j0713N056M678p065l429M143l913
$$ y = [-11183, -5220, 517, -918, 1973, -1675, 1850, 3048, 1290, 2581, 4015, -4106, -9659, -6593, -3982, 3508, 11951, 16897, 11845, 5421, 6953, 6079, 4415, 2932, -2120, -3846, -4863, -8888, -15999, -7216, -2751, -6174, -10049, -10083, -5696, -2838, -5921, -3828, -2409, -6278, -8708, -8622, -2367, 4223, 898, 4133, 7648, 6925, 1949, -7632, -5892, -3064, -6848, -4401, -4912, 325, -3549, -9109, -6224, 3606, 10661, 10973, 6305, 4500, 6620, 4598, -2336, -8271, -9900, -11326, -13332, -10309, -11323, -9963, -970, 2754, 6, -4174, -5060, -62, -1947, -11510, -14856, -12103, -7427, -2067, -3300, -4355, -5401, -1776, -7677, -9051, -5244, -3907, -4125, -2739, -1106, -869, -2416, -2914, -4228, -7521, -1086, 2908, -538, -2292, 220, 3863, 3043, -715, -799, 657, 140, 560, 8500, 17958, 13795, 10251, -462, 4594, 9272, 2207, -1222, 2921, -992]
5155i92l567j420m79l857l634k651P028L385L819L359o483l232M98J282L735K6
5139c183j564N002K46k282P565k583j838l920o248j829L626K348M129K623j468
5124F24j603m136j904R92J703P552l631p455N761m123n595K116j51l681K763r77
5108a1745O97J381K502R103L471n581M045M583m637n139j659o463j92M221N443
5093C0l503k698j929K960O187k207k680r25p360k678K768R47k571N438P044j748
5077b925m116J965Q751j515p778l747M071P10J935Q58r041n424o940l294R426
5062a7064R889J688k845l465R55J853L61j34L683Q582R668M84j1815r282l0L049
5046d423p377J048L668P077M689L188l146j960l438p367J272J050m888K081J061
$$ y = [-992, -4559, -5979, -6458, -10315, -13949, -16600, -9572, -6187, -2368, 991, -5492, -8724, -8226, -6944, -3209, -3183, -4747, 255, 501, -1781, 5784, 3201, 1363, -2557, -8805, -10634, -7008, -4660, -531, 2092, 624, -979, -5115, -7019, -6027, -4324, 3228, -403, -7858, -2097, -6220, -11815, -9699, -9850, -13531, -10768, -11745, -11048, -9667, -7165, 1938, 5409, -172, 3873, 8456, 3819, -1320, -2979, -9442, -9634, -5413, 30, -3473, -6171, -8100, -5140, 1047, -1160, -3840, -4765, -12125, -14803, -12035, -11088, -13659, -8221, -1177, -2925, -7041, -5076, 3675, 2160, -5618, -9365, -5294, -4584, -2649, -1791, -10832, -16256, -23196, -26490, -17064, -7175, -5487, -8332, -11797, -10842, -8989, -8628, -8762, -5079, 3503, 13171, 13655, 1840, -7442, -7472, -4423, -11800, -10752, -7084, -7, 4682, 7870, 4724, 2764, -674, -8041, -6769, -5719, -10607, -8526, -7465]
5031g465k479J169k062L978M106m118j0014K50l57N081J834m571p499r26K405
5016b0668P696k690m648R559R116L10J435r23Q14p385j102O128R977o780p806
5001f967r85K375M296O07l186m22J459K868N5l22Q055J044l149r279o806M41K208
4984g708j768J294L774J630m798K965R37j319k92K323J897l048l284l631N947
4969e081M39l748L932j854l498k31O120N156l328l371p20P403N493Q19l397p922
4953c788m279j444l27j570p613O276J1675J147L715j18p671j752o18j874J15N447
4937b679M143k291j843J662O524l470m467L118m487j029J587j154P15K489k000
4922c182j295P636L520j1176l024O454r92k496n106j560K270r93k898n87k512
$$ y = [-7465, -9944, -8775, -10837, -6859, -2753, -6871, -16885, -16635, -16992, -11911, -10077, -14648, -22147, -23073, -20668, -12972, -15662, -20310, -10751, -1635, -1325, 110, -813, 1, -7384, -8486, -2358, 7619, 839, -6967, -7952, -5577, -1281, -674, -3860, -4282, -2823, 45, 100, -222, 7833, 8877, 5728, -3551, -10357, -9916, -7708, -9476, -8182, -4408, -2778, -7576, -4611, -3674, -4993, -5285, -2962, -1065, -4113, -7397, -11028, -5081, -4642, -8390, -4458, -6312, -9810, -10041, -3921, 1235, -2093, -5464, -6184, 1219, 6712, 7531, 4134, -3788, -8067, -9511, -9838, -11408, -19021, -12745, -1070, 77, 3792, 3674, -3997, -5749, -6367, -8241, -8126, -2679, 1464, -827, -2670, -1008, 5516, 2046, -2421, 697, -3790, -4819, -3232, -4386, -3671, -1182, -3182, -4477, 3159, 6679, -4497, -7521, -1067, -2059, -4555, -9661, -11221, -8951, -9944, -12842, -13429, -15941]
4907a5941L707L268J782M213l227r84k488j109J258M831O27n024M332R154K018
4892F417l421m243j481m151M472K549k720N20Q201J410k36k83k307p061L6L01
4876a997Q15O178j82l065o716j538L228M160K831j998n470k497O891Q258l553
4861E345n543j487r202J585Q080J702j985J279J018m10M951J492L368k139r717
4846a663k529L673N296l712j403j723n986n825O23N862m071o422O624M433j38
4831f961j932k542J125L818k843l131J0982l03n606K719o033J974O152N985M09
4816C813k194M293n489j2927L113L227L031l593J119L963P12l37J73j177l127
4801e400r07J159n187L958L882J103K883j823o360L559j364r63L5K612p83l881
$$ y = [-15941, -12234, -8966, -7184, -2971, -6198, -7182, -9670, -10779, -9521, -4690, -4063, -9087, -4755, 4399, 6417, 2996, -1247, -2728, -6879, -2407, 142, -2578, -2058, 6143, 7553, 7317, 7034, 4727, -2334, -2298, -1997, -1182, 4996, 4814, 1749, -4967, -6505, -3277, 883, 3714, 1716, -3754, -6251, 640, 8898, 5345, -198, -1685, -10887, -9302, -1222, 480, -1505, -226, 792, 382, 5333, 6825, 10193, 8054, -1663, -4192, -519, 4777, 1065, -338, -2061, -8047, -13872, -13249, -7387, -11458, -17880, -11256, -6823, -6961, -8893, -11435, -10310, -6492, -9335, -12466, -1484, -1787, -7393, -4674, -10707, -8733, -2581, 3404, 3813, 1619, 5912, 423, -12504, -9391, -6164, -3133, -6726, -5607, -1644, -932, -1269, -1096, -2273, -5400, -6307, -5148, -10335, -6377, -2495, -1392, 1491, -332, -6692, -3133, -4497, -5460, -5425, -2813, -3596, -7477]
4785g477q312j710Q118j593j554L30L823M587P51K329L567l013l306k080J251
4770d289L218K12J294r4o386m604R502J2428n21o289j899o171l167K406L068K718
4754A426J685N531k154N67m590j685o986l729P059P743m220m029m935j021O753
4739b585R218r794o241M926L712l825n426O1P031L855j651n264M823R889o81p246
4723H02j15K884l717k238K131M858N5k346K718o40n449K133Q695m24k977q428
4707b058o835p291J106P960M475J902O846k732o159J415l60p02J858R96m577p71
4691d927l351m230J119l379j768J1027N185o778m501O783M651j939j532J91n4
4676c503j195k499L293r5o409p19J0622J092q44p199K153k320l431K589K295o813
$$ y = [-7477, -15789, -17499, -9381, -10974, -12528, -12198, -8375, -3788, -3037, -708, 2859, -154, -3460, -5540, -4289, -1071, -859, 435, 341, -6045, -10649, -1147, 11281, 10760, 4471, 2572, -3599, -6766, -4360, -1292, 1426, 3111, 8642, 6488, 7055, 2465, 780, -6206, -9935, -2876, 4867, 647, -3382, -8317, -9338, -2585, 6633, -3161, -9402, -4476, -764, -4589, -10015, -9954, -2923, 932, -719, -5983, -1160, 8729, 8048, 802, 687, 3571, -146, -2384, -253, 4605, 4660, 2314, 5032, 4392, -1057, 1076, 9771, 9347, 6370, -2058, -8893, -16184, -15078, -7118, -2643, -741, 6105, 3373, -2786, -1371, -1731, -2433, -575, 421, -4156, -4927, -8278, -12508, -11389, -14768, -16536, -5509, -324, -7102, -11603, -4820, -169, -2108, -3640, -3449, -3503, -4698, -7197, -3904, -3999, -10408, -11127, -505, 587, -257, -7456, -5303, -7623, -11054, -8465, -6170, -12983]
4660a2983J456N113O863l95o470Q597K954l51K28m865k552M504L497l755j406
4645D35k001O318M806l093k291n59K514J060k342l741L648j812J160J690l365
4630B427k572j723l283l863j617M078l262j327k70L258K771m04j590l6L990R156
4614E733q46m81p509l499j628R26K275J660k912j212J365M294J839M299j405k359
4598E40n015N42m031m996l281j407M762O598J911J0756J821j813j0891j1040o59
4583a6203m117R961J0366M577n01o846k523M82L216k843R09K676n003j77o004
4568a2030p024R312M225l754K052N559Q076J135m872l766P85q39P79p122n861
4553a3345j750O162l46j1088L962J1458M939j845J192k727q58j55k043j517K148
$$ y = [-12983, -11527, -6414, 449, 54, -6416, 2181, 5135, 4784, 5012, 147, -2405, 2099, 5596, 1841, 435, -1566, 4752, 9558, 6465, 4174, 3615, 6129, 7189, 4847, 1106, 4754, 2942, 4102, 5792, 2427, -145, -1868, -5151, -9014, -10631, -6553, -9815, -11142, -11412, -8154, -5383, -5787, -7377, -7413, -3423, 5733, 4887, 4406, -3103, -6602, -8230, -7304, -5029, -3369, -6281, -7493, -6128, -1834, 5, 4304, 2899, 540, -4475, -3933, -7964, -12960, -16241, -17648, -12886, -6288, -4377, 6379, 8200, 6387, -4504, -15544, -16203, -20320, -10359, 7, 4584, 4083, -2763, -5286, -4804, -1588, -4431, -3522, -846, -5849, -6026, -12030, -19054, -9742, -5517, -9271, -7219, -1660, 6416, 7551, 2679, -1087, -302, -1141, -362, -7484, -13345, -15095, -8933, -9279, -20367, -16405, -4947, -8, -1853, -661, -3388, -4246, -4401, -6444, -7961, -5813]
4538e813k729J5K976M872j150m389J2L293p608k079K940N970r31J14k29j333J596
4521d473o863o073L299N149P1M746j820K57N168M173o615o660k275L617Q627Q912
4505I240l554q033n537j132J949L235P303k892p058k576M503K006K666l989L942
4490G3n61n050P727L210J16K314n077m240j297K30N101m138n057l90R486M886
4474G333k22p396K051N34n066l042M119O541N23j874P5Q55l838o033j0619K852
4458a3207L413P083M082Q69q93L705n164l218o424o077L057PQ26O302P275K446
4442D082n364l071j347m83K660L261q48R87l502k477J944J478Q128j009j5663
4427a1224o909M742M774M888k81J995m595q57N789j370k683k007k690m496L439
$$ y = [-5813, -8542, -8527, -5551, -679, -1829, -6218, -6206, -2913, -10521, -12600, -9660, -3690, -4621, -4507, -4736, -6069, -4473, -11336, -17409, -14110, -8961, -8890, -4144, -5964, -5707, -539, 3634, -2981, -9641, -11916, -8299, 328, 9240, 5686, -2347, -7884, -9016, -7067, -3832, 3471, 579, -6479, -9055, -4552, -2546, 120, -3869, 73, -488, -5538, 2189, 5399, 5515, 7829, 2752, -1488, -2785, -2555, 2546, -1592, -6649, -7039, 2447, 7333, 7111, -285, 1766, 2300, -2766, -5808, -1689, 4852, 5375, 3501, 3576, 4431, 593, -5440, -16059, -13207, -9794, -2711, 1371, 2240, 1347, 5052, -112, -3330, -9754, -15831, -12774, -12767, -11941, -5639, 1636, 4082, -1282, -4353, -5700, -6183, -3523, -262, -1110, -123, -3625, -6102, -4158, -2680, 5448, 4439, -11224, -18133, -13391, -8617, -3729, -4010, -2015, -6610, -7467, -1678, -3048, -5731, -7738, -10428, -14924, -11485]
4412a1485P473Q704J079j431n582l546K009k569K36O319L570o992m532j326m812
4397a2885k290O34L574K120k464K277L832l775m34K382k261n1L141J801j943l706
4381a0048P216k49k368k737J904P463m5l932n270O64j338M748Q511l512k59L598
4365D346p084k38R009j177m078k181m769o17L523n99K345L31M128M73M47o874
4349c015q003o786O742N627M096J711J278L384m699q786n627J535j015L324k697
4334a2931Q352P892j738k271r45L35K279P0j990M724n344q820m25R572N630L283
4318G673n439p366m166k620J987p897m681P212M892O21K197M540O86r53P73L425
4302H84N685k667k746r6p25n376k556M274M345j36J385p963j0248J15O104J0394
$$ y = [-11485, -4012, 4692, 5771, 4340, -1242, -4788, -2779, -5348, -5112, 1207, 4777, -2215, -6747, -8073, -12885, -15175, -14541, -10967, -8847, -11311, -9034, -5202, -8977, -9411, -7029, -9290, -9341, -6200, -4399, -6342, -10048, -2832, -3081, -5449, -8186, -6282, 1181, 1136, -2796, -8066, -7402, -8740, -3992, 4519, 1007, 748, 4346, -2738, -2976, 6033, 4856, 778, -1403, -6172, -6789, -3266, -3865, -1520, -1189, 2939, 3412, 3859, -3015, -11018, -17804, -11062, -5435, -1339, 372, 1650, 5034, 335, -8451, -14078, -12543, -13558, -10234, -12931, -4579, 3313, 1575, -696, -1641, -1306, 973, 1043, -947, 3777, -1567, -10387, -10812, -1240, 4390, 7673, 2234, -5132, -9298, -11918, -9931, -17828, -22509, -15297, -10405, -9784, -7587, -3047, -2361, -3314, -2541, 884, 6569, 3902, 1156, 1060, 335, -5041, -7597, -3323, 1022, 886, 2271, -5692, -15940, -15825, -9721, 673]
4286F73K450L010q272k282J437Q00P08n339k951J25M828K480J052p00n053o62
4270g696O737O156q951k924k362n936P535l868J0K849N310R708J406l149j0064
4255e239k727K104Q548j530J591p538k754P020K886k032J606N524p870j1314l88
4240a2113o56M880R598N849K687P53q901k491J659q75n68m345o001k058N217J469
4224e896l912q47K321P839l823o593l364L725L57j75n29M750K043k386K838R531
4208E879k776o881J669N030o202p804J507O341J159K583j361m506j844K832K907
4193a467L247N101o826k776K363j671o525p540L157J0965n18J106k457K493M45
4178i03k278n05P53K822L627J154n117Q91j842m507K533N60N792L581j631p871
$$ y = [673, 3123, 6133, -2139, -4421, -2984, -2184, -1476, -6815, -9766, -9641, -4813, -2333, -1281, -1981, -7034, -7696, -959, 5197, -3754, -6678, -9040, -14976, -7441, -11309, -11299, -8450, -3140, 6568, 7974, 4825, -5239, -7966, -5862, 2686, 1156, 2747, -4791, -7545, -525, 2361, 329, 1935, 7459, -411, -11725, -12113, -12769, -7889, 1709, 7558, 10245, 10998, 2097, -394, 1265, 390, -178, -4523, -10524, -12582, -7365, -5896, -9808, -10655, -8334, -495, -4318, -10911, -14275, -10550, -10193, -10368, -10897, -6147, -4104, -6490, -3652, 5879, 3103, -3778, -2109, 2921, -3281, -11085, -9578, -3237, -2078, 505, -856, -5362, -7206, -4374, -1467, 1780, 6881, 55, -2721, -358, -2029, -8554, -16094, -12937, -1972, -2490, -1384, -3841, -1348, -903, -3181, -3686, -2933, -111, 3516, 4670, -447, 444, -1398, -5905, -3372, -2812, 2980, 6561, 4930, -2941]
4162b941l549r9L944p600K147O625K98N44J37K419m810K399M652k122p699J469
4146d186l90M902j302K293n319k539P67R34k83l501J565J744o28M827L519m858
4130b455m454J0068K113k902k173m996j401L581P007l562N74m901k235N48m2k132
4114g362M460J685l447L23m208m368M522L810p3n743m90J308O194L806l772l152
4098f507N210Q803J442l952n632lJ642q023n444J098l379K999o21K402M801O156
4082I92N453q941l927M074O165M280l831j497k347J184L549p330n144J781m67
4067f006L076J345m44q33l437j590P270j79k459l25K401l887M81K872j541m852
4051h108n933j787L851R538L997l010k274K386R94m124L158K069M76l279l888
$$ y = [-2941, -6490, -6589, -2645, -10245, -8098, -1473, -1175, -631, -494, 1925, -2885, -486, 4166, 2044, -5655, -4186, -4576, 326, -976, 1317, -4002, -6541, -5774, -4840, -5123, -8624, -7059, -5315, -5943, -1116, 2403, -2455, -6909, 3159, 5272, 2370, 197, -4799, -6200, -2619, 4388, 826, 1400, -3501, -5736, -5188, -5230, -7362, -2902, -1217, -4664, -4341, -8549, -12917, -8395, -4585, -4658, -10401, -10891, -9583, -3389, 417, -3355, -6507, -1297, 7506, 8948, 4996, -636, -639, 1003, -7020, -12464, -11366, -14745, -11746, -12367, -9965, -5164, 992, 6445, -2496, -6423, -2349, 3816, 8096, 4265, 2768, 421, 1605, 5154, -2176, -7320, -5539, -6006, -2930, -1585, -2029, -2862, -6299, -7889, -619, -798, -3257, -3582, -1181, -5068, -4587, -1715, -3256, -8108, -14041, -15828, -11977, -2439, 1558, -1452, -3726, -1340, -346, -4470, -1312, 757, 1233, -2046, -5934]
4036e934L948N778M0o571o798m500Q760N928O948K598l251P22r332q643j452N66
4020a1193L9j210l531l678J112M608M785N361J451l640j702K300O343N711L875
4005A0631k967q006M33Q81K124m237m194l270J443K922K388K306J47p528m848
3990a1775K61k473K541L980r64K385L70K233M685K101P44l746P783M925l317k237
3974G496l85q534M784L860m741o23k74j235j19o81M774l61n381j1509j540N333
3958i136O142K043m347j380N801n975m850J0438l558R59l562o4j757m651Q012
3943e885K448l56r77N280m100O89M86o558q473O84K213O433O139K496j661k1p96
3926a959q910j955N899Q48r321L546P285r52O159M14k828J913j061k30m573k281
$$ y = [-5934, -1986, 3792, 3832, -2739, -9537, -14037, -5277, 651, 7599, 10197, 6946, 7668, -1664, -10307, -11759, -11193, -11154, -12364, -15895, -19573, -18461, -13853, -9068, -3707, -2256, -5896, -7598, -5298, 1045, 6756, 10631, 7664, -342, 91, 972, 3096, -1141, -5335, -8605, -7162, -4240, -1852, 454, 601, -6927, -11775, -11514, -13987, -11446, -7466, -8430, -6045, -5675, -3442, 1243, 3344, 4088, 342, 8125, 13050, 9733, 7496, 7111, -1423, 3361, 7221, 2480, 1857, 1583, 348, 229, -452, 4322, 3961, -1420, -12929, -14469, -9136, -2994, -951, -5298, -6678, -877, -6852, -11702, -1264, -4822, -3863, -7425, -7489, -9246, -13897, -5885, -3437, -3793, -4770, 510, -3590, -2901, -2415, -8973, -17446, -16762, -14549, -8116, -1977, 519, -1142, -1163, -1959, -10869, -12824, -6925, -6077, -15398, -11852, -4567, -5519, 640, 1054, -1774, 139, -922, -1152, -5725, -8006]
3910h006M098J183m184k189O072P976m761p297N378P022p063n126j762q39K318
3895g180n526J632K691m476q00r40K386n675K081N916R376n113k677n18k87Q652
3879d58L903O121J506J906m988n265J13L699k100q814R83K919J073o6n332j429
3863f229l872o757L465K812Q594Q260J471o942k54m366q799J156K102L883L706
3848a770J778K3R245J514O34j480q138O246k218o237n55O505l689o268k257m091
3832a0758L109J738K021N111J213n170m37m61L774M830L329L587K263n138m426
3817D585k395j907L66J2k07k373Q0P033j323l738L16l486k070O51K562l17M803
3800B592L371L80n462l691k413j463j549o223m222J708J968O48O849P224R107
$$ y = [-8006, -3908, -2725, -6909, -9098, -3026, 4950, 189, -7108, -1730, 5292, -1771, -6897, -8659, -9498, -7180, -12706, -11074, -8383, -12859, -13659, -14599, -12213, -17888, -15807, -9891, -515, -5628, -8305, -8823, -9110, -458, 3445, 9566, 11072, 12978, 7990, 2725, 2838, 6537, 4437, -4377, -3394, -475, 598, 532, -4800, -6229, -10101, -16858, -13393, -10581, -1987, 6273, 7744, 802, 548, -3818, -12617, -11461, -9359, -5476, -1770, 8, 31, 9276, 10790, 11424, 9944, 1806, 8052, 5834, -403, -958, 5547, 1858, -4410, -6667, -10758, -7649, -5911, -3890, 1221, 2434, -2736, -3173, -3634, 140, 4970, 8299, 11886, 14149, 9011, 4585, 2190, 283, 649, 661, 454, -1919, -1839, 5194, 3871, 133, 449, -3037, -5107, -4456, -1894, -2211, 2592, 5963, 6343, 881, -2810, -5223, -6686, -8235, -14458, -18680, -16972, -15004, -14356, -7507, -283, 8824]
3785H824l197o393p297J158N562j47l050L603M057M834o999o125l242L127K286
3770b999n568J206k133J759N861J86p066o422L359N187M551l714K736L296O658
3755F897j485J183j823K564k674m038M18J617n728m089J887R291N038q325p111
3740f378j755j709J071Q559p62r28k087k374j126J946O009L783l138N548K254
3725H913l525Q425O027k637l429k690k197j893l697L612M605L451m154n384n48
3710D879K701n423q642P242K640R63j635m105K805K628m56K545l233r303k04Q4
3694f514K39p71J717m896m98j595L586r06J449L766O45l465l294L435K214j228
3678f116p750k610K768m371K338k323l178r37k194O59J0039M822l94m424M219
$$ y = [8824, 5627, -766, -8063, -6905, -1343, -1490, -4540, -937, 3120, 7954, 955, -5170, -8412, -5285, -2999, -8567, -7361, -9494, -7735, -1874, -1688, -8754, -15176, -11817, -6630, -2079, -5793, -3057, 239, 6897, 5412, 6595, 4772, 7336, 4662, 624, 1042, 2659, -3069, -7158, -5271, 4020, 9058, 733, -6378, -8133, -9842, -8771, -212, -974, -1902, -3989, -6363, -7489, -5543, 466, 4249, 1111, 6659, 8913, 5388, 13813, 19840, 17203, 13774, 11084, 8887, 6994, 3297, 6909, 11514, 14965, 10811, 5427, 4879, 7580, 2157, -6485, 757, 3397, 4360, 2725, -1380, 1425, 4053, 3597, 6142, 2909, -6394, -6598, -6514, -6275, -7046, -5329, -10225, -10723, -12318, -8732, -9638, -8189, -4423, -3778, -7243, -10537, -7102, -4888, -6116, -13866, -16476, -13708, -18079, -15741, -18064, -21242, -22179, -24373, -23714, -13675, -8853, -9247, -13671, -9452]
3663i452P385o657o139K061O334Q465q948o203N408Q390L795Q10m196n27k150
3648a624j0274J823Q672M925j33J417J453k991p92q525k413M340K393o322q46
3633h897L140k949j459Q614P767L41r27M58l287n318m826J86J521R304L366l578
3617C456L011m192n093p822j104L947l23k948J16K37M282q08M70M353m23R13j520
3600c448o005j563N369N571j881p069l894O387O420m024k239r47L751J471m807
3585f908O681k14n389J610J917o235l249k980j27N865R615J169l159rn711J905
3569e219O311o208k496k80N3M464m520m024J422L587J486n86k401l274L269J346
3553g070L008O952K822J954k175r97K947M345M96j359r677j59O01k383K883l121
$$ y = [-9452, -2067, -8724, -14863, -12802, -6468, 1997, -6951, -13154, -7746, 644, 4439, 5249, 1053, 526, -1624, -11898, -10075, -1403, 3522, 3389, 4806, 6259, 3268, 2476, -6049, -8462, -4122, -1729, -8051, -8897, -5757, -8706, -10165, -1551, 6216, 6557, 5630, 6088, 2801, -2517, -7343, -7157, -5636, 3668, 7034, 3456, 6467, 2275, -2818, -10640, -11744, -7797, -8120, -11068, -10952, -10715, -6433, -7241, -6771, -2418, -2841, -1928, -3448, -9453, -11016, -5647, -76, -1957, -9026, -12920, -6533, -113, -4137, -6376, -7323, -3572, -2101, -6908, -227, -441, -5830, -4220, -2303, -8538, -11787, -14767, -14894, -9029, 586, 1755, -1404, -1413, -7124, -5219, 1092, -5116, -7612, -7892, -7839, -3375, -7895, -11919, -10497, -6910, -5424, -6010, -8411, -11685, -8416, -7070, -4062, 2890, 5712, 7666, 5491, 4494, 7441, 11786, 12282, 10923, 1246, 1087, 1688, -695, 2188, -933]
3537i33K723K335L930k680K553J956o277L487J652o373k016p044R56j894J501
3522f124j471M19P331m693J011M035n458L454M415n062k454J887L742J052L015
3507E099L635J687l983r71l199j365l24o430m125K096P2p41M543J811J653R609
3491I067M754n916m506N442M686r838l872L065q191o352l820m314N57O245P99
3476a2194N095j76K621K14n692o361J293M915Q765l457j209k138n75Q607P245
3461F953J411M95m065o134o691l19l810k910k306P164R147M095M748m380r14Q14
3445C298l308O07o375l48P378l43m413l655R86J741l155O453M866K407R20l531
3429C528J419k515N232J870N1J348o556m512m946j501L102J462l22M884K238K185
$$ y = [-933, 1790, 4125, 8055, 5375, 7928, 9884, 3607, 7094, 8746, 2373, 357, -6687, -5731, -7625, -6124, -7595, -7176, 155, -4538, -3527, 508, -4950, -1496, 2919, -2143, -4597, -2710, 1032, 2084, 5099, 8734, 10421, 6438, 5467, 2268, 903, 579, -5851, -9976, -7880, -7808, -8549, -4006, -2195, -542, 9067, 13821, 7905, 3399, 8841, 13527, 3689, -183, 2882, -5309, -11661, -15481, -19795, -19238, -12993, -12194, -7099, -7275, -4654, -4440, -10132, -16493, -15200, -10285, -1520, -4977, -6186, -8324, -8899, -292, 6953, 8364, 8859, 4794, -1340, -8031, -8350, -12160, -15070, -17376, -10212, -1065, 3030, 7778, 3398, 2484, 3298, -10, 597, -5778, -6126, 1252, 909, -3504, -7159, -6173, -4432, -7587, -1134, 3732, 6139, 7059, 3528, 4947, 2432, 7664, 9534, 9585, 10933, 4377, -135, -5081, -6582, -3480, -2018, -2340, 2544, 4782, 6967]
3413F967J897M81l540l940%J813n72K135j78N63K810n834k770j88R18P82P357
3396H701M450j577o702l817k959k582O803L333l411J158J427k827p691o264O90
$$ y = [6967, 8864, 9345, 5805, 1865, 1865, 3678, 3106, 5241, 5063, 5626, 8436, 2602, -168, -356, 562, 1344, 8701, 13151, 11574, 4872, 1055, -1904, -4486, 2317, 5650, 2239, 3397, 4824, 1997, -5694, -11958, -11268]
$$ [...]
##END NTUPLES=NMR SPECTRUM
##END=
