##TITLE=Analysis number 319450
Compound Code spb 00444
Project Code adrs
Chemist Name prosynth
##JCAMPDX= 6.0         $$ Bruker NMR JCAMP-DX V2.0
##DATA TYPE= NMR SPECTRUM
##DATA CLASS= NTUPLES
##ORIGIN= Bruker BioSpin GmbH
##OWNER= nmr
$$ XWIN-NMR		Version 3.5
$$ Tue May 16 08:58:01 2006 GMT Daylight Time (UT+1h)  MAYBRIDGE\nmr@NMR_250MHZ
##.OBSERVE FREQUENCY= 250.131544655141
##.OBSERVE NUCLEUS= ^1H
##.ACQUISITION MODE= SIMULTANEOUS (DQD)
##.ACQUISITION SCHEME= undefined
##.AVERAGES= 16
##.DIGITISER RES= 18
##SPECTROMETER/DATA SYSTEM= dpx250
##.PULSE SEQUENCE= zg30
##.SOLVENT NAME= CDCl3
##.SHIFT REFERENCE= (INTERNAL, CDCl3, 0, 16.522)
##AUDIT TRAIL= $$ (NUMBER, WHEN, WHO, WHERE, WHAT)
$$ ##TITLE= Audit trail, XWIN-NMR		Version 3.5
$$ ##JCAMPDX= 5.01
$$ ##ORIGIN= Bruker BioSpin GmbH
$$ ##OWNER= nmr
$$ C:\u/data/dgb/nmr/ADRS/4330/pdata/1/auditp.txt
$$ ##AUDIT TRAIL=  $$ (NUMBER, WHEN, WHO, WHERE, WHAT)
(   1,<2006-05-16 08:57:37.92 +100>,<MAYBRIDGE\nmr>,<NMR_250MHZ>,
      <created by zg, POWCHK disabled, PULCHK disabled
       configuration hash MD5:
       84 BC 41 DB A1 6E 1D 46 DA 25 12 A5 C1 ED C5 3A
       data hash MD5: 64K
       EA A2 1E FB 59 FB E0 F9 38 DF 3E 0C 35 5E 7B E9>)
(   2,<2006-05-16 08:57:51.45 +100>,<MAYBRIDGE\nmr>,<NMR_250MHZ>,
      <Start of raw data processing
       ef LB = 0.3 FT_mod = 6 PKNL = 1 SI = 32K 
       data hash MD5: 32K
       75 E3 12 9F F3 AC 4C 7F 6C AD 1C 25 C6 52 9A F9>)
(   3,<2006-05-16 08:57:53.06 +100>,<MAYBRIDGE\nmr>,<NMR_250MHZ>,
      <apk 
       data hash MD5: 32K
       F8 F7 A6 6A 5D 93 97 0C F5 56 79 DC 41 11 67 46>)
(   4,<2006-05-16 08:57:53.86 +100>,<MAYBRIDGE\nmr>,<NMR_250MHZ>,
      <abs ABSG = 5 
       data hash MD5: 32K
       BB 60 74 73 60 04 24 0D 12 2B 7C EF AD 3F 10 51>)
$$ ##END=
$$ 
$$ hash MD5
$$ 4E A4 41 1E CD 29 62 89 C7 DE 78 3F 89 D4 2D F3
##$RELAX= 
##$RELAX= 
##$RELAX= 
##$RELAX= 
##$RELAX= 
##$RELAX= 
##$RELAX= 
$$ Bruker specific parameters
$$ --------------------------
##$DU= <C:\u>
##$EXPNO= 4330
##$NAME= <ADRS>
##$PROCNO= 1
##$TYPE= <nmr>
##$USER= <dgb>
##$AMP= (0..31)
100 100 100 100 100 100 100 100 100 100 100 100 100 100 100 100 100 100 
100 100 100 100 100 100 100 100 100 100 100 100 100 100 
##$AQSEQ= 0
##$AQ_mod= 3
##$AUNM= <au_zg>
##$AUTOPOS= <4 >
##$BF1= 250.13
##$BF2= 250.13
##$BF3= 250.13
##$BF4= 250.13
##$BF5= 500.13
##$BF6= 500.13
##$BF7= 500.13
##$BF8= 500.13
##$BYTORDA= 1
##$CFDGTYP= 0
##$CFRGTYP= 5
##$CHEMSTR= <none>
##$CNST= (0..31)
1 1 145 1 1 1 1 1 1 1 1 1 1 1 1 1 1 1 1 1 1 1 1 1 1 1 1 1 1 1 1 1 
##$CPDPRG= <>
##$CPDPRG1= <>
##$CPDPRG2= <>
##$CPDPRG3= <>
##$CPDPRG4= <mlev>
##$CPDPRG5= <mlev>
##$CPDPRG6= <mlev>
##$CPDPRG7= <mlev>
##$CPDPRG8= <mlev>
##$CPDPRGB= <>
##$CPDPRGT= <>
##$D= (0..31)
0 1 0 0 0 0 0 0 0 0.06 0 0 0 0 0 0 0.0002 0 0 0 0 0 0 0 0 0 0 0 0 0 0 
0 
##$DATE= 1147766257
##$DBL= (0..7)
120 120 120 120 120 120 120 120 
##$DBP= (0..7)
150 150 150 150 150 150 150 150 
##$DBP07= 0
##$DBPNAM0= <>
##$DBPNAM1= <>
##$DBPNAM2= <>
$$ [...]
##$SUBNAM7= <"">
##$SUBNAM8= <"">
##$SUBNAM9= <"">
##$SW= 20.6930455092707
##$SWIBOX= (0..15)
0 0 3 0 0 0 0 0 0 0 0 0 0 0 0 0 
##$SW_h= 5175.983436853
##$TD= 65536
##$TD0= 1
##$TE= 295.16
##$TE2= 300
##$TE3= 300
##$TEG= 300
##$TL= (0..7)
0 120 120 120 120 120 120 120 
##$TP= (0..7)
150 150 150 150 150 150 150 150 
##$TP07= 0
##$TPNAME0= <>
##$TPNAME1= <>
##$TPNAME2= <>
##$TPNAME3= <>
##$TPNAME4= <>
##$TPNAME5= <>
##$TPNAME6= <>
##$TPNAME7= <>
##$TPOAL= (0..7)
0.5 0.5 0.5 0.5 0.5 0.5 0.5 0.5 
##$TPOFFS= (0..7)
0 0 0 0 0 0 0 0 
##$TUNHIN= 0
##$TUNHOUT= 0
##$TUNXOUT= 0
##$USERA1= <user>
##$USERA2= <user>
##$USERA3= <user>
##$USERA4= <user>
##$USERA5= <user>
##$V9= 5
##$VALIST= <valist>
##$VCLIST= <CCCCCCCCCCCCCCC>
##$VD= 0
##$VDLIST= <DDDDDDDDDDDDDDD>
##$VPLIST= <PPPPPPPPPPPPPPP>
##$VTLIST= <TTTTTTTTTTTTTTT>
##$WBST= 1024
##$WBSW= 4
##$XGAIN= (0..3)
0 0 0 0 
##$XL= 0
##$YL= 0
##$YMAX_a= 556717
##$YMIN_a= -555469
##$ZGOPTNS= <>
##$ZL1= 120
##$ZL2= 120
##$ZL3= 120
##$ZL4= 120
##$ABSF1= 16.522
##$ABSF2= -4.171173
##$ABSG= 5
##$ABSL= 3
##$ALPHA= 0
##$AQORDER= 0
##$ASSFAC= 0
##$ASSFACI= 0
##$ASSFACX= 0
##$ASSWID= 0
##$AUNMP= <proc_1d>
##$AZFE= 0.1
##$AZFW= 0.1
##$BCFW= 0
##$BC_mod= 0
##$BYTORDP= 0
##$COROFFS= 0
##$CY= 12.5
##$DATMOD= 1
##$DC= 0
##$DFILT= <>
##$DTYPP= 0
##$F1P= 14.0000005364418
##$F2P= -0.99999901652339
##$FCOR= 0.5
##$FTSIZE= 32768
##$FT_mod= 6
##$GAMMA= 0
##$GB= 0
##$INTBC= 1
##$INTSCL= 1
##$ISEN= 128
##$LB= 0.3
##$LEV0= 0
##$LPBIN= 0
##$MAXI= 10000
##$MC2= 0
##$MEAN= 0
##$ME_mod= 0
##$MI= 0
##$NCOEF= 0
##$NC_proc= -3
##$NLEV= 6
##$NOISF1= 0
##$NOISF2= 0
##$NSP= 0
##$NTH_PI= 0
##$NZP= 0
##$OFFSET= 16.522
##$PC= 1
##$PHC0= 171.4771
##$PHC1= 6.502793
##$PH_mod= 1
##$PKNL= yes
##$PPARMOD= 0
##$PSCAL= 4
##$PSIGN= 0
##$REVERSE= no
##$SF= 250.13
##$SI= 32768
##$SIGF1= 0
##$SIGF2= 0
##$SINO= 400
##$SIOLD= 32768
##$SREGLST= <1H.CDCl3>
##$SSB= 0
##$STSI= 32768
##$STSR= 0
##$SW_p= 5175.98343685301
##$SYMM= 0
##$S_DEV= 0
##$TDeff= 65536
##$TDoff= 0
##$TI= <Analysis number 999999
Compound Code 99
Book Reference 9
Project Code 9>
##$TILT= no
##$TM1= 0
##$TM2= 0
##$TOPLEV= 0
##$USERP1= <user>
##$USERP2= <user>
##$USERP3= <user>
##$USERP4= <user>
##$USERP5= <user>
##$WDW= 1
##$XDIM= 32768
##$YMAX_p= 430823273
##$YMIN_p= -172184
$$ End of Bruker specific parameters
$$ ---------------------------------
##NTUPLES= NMR SPECTRUM
##VAR_NAME=  FREQUENCY,     SPECTRUM/REAL,   SPECTRUM/IMAG
##SYMBOL=    X,             R,               I
##VAR_TYPE=  INDEPENDENT,   DEPENDENT,       DEPENDENT
##VAR_FORM=  AFFN,          ASDF,            ASDF
##VAR_DIM=   32768,         32768,           32768
##UNITS=     HZ,            ARBITRARY UNITS, ARBITRARY UNITS
##FACTOR=    0.157963299565203, 1,           1
##FIRST=     4132.6476996994, 0,             0
##LAST=      -1043.33573715361, 0,           0
##MIN=       -1043.33573715361, -172184,     0
##MAX=       4132.6476996994, 430823273,     0
$$ Real data points
##PAGE= N=1
##DATA TABLE= (X++(R..R)), XYDATA
$$ [...]
19516a983R987o085K541J1190L0785L3882k4870j7097M8493J0618l8524l8804
$$ -1983 8004 1919 4460 15650 46435 80317 55447 38350 86843 97461 58937 20133
19504B0133J4931K9154J0903k2584P74k7188l3391k383J7967l4393K1768N261
$$ 20133 35064 64218 75121 52537 53311 26123 -7268 -9651 8316 -26077 -4309 952
19492I52k5634m337K0476j9528p045r504k270J6951L3540O119Q934J4870p653
$$ 952 -24682 -29019 -8543 -28071 -35116 -44620 -46890 -29939 3601 9720 18654 33524 25871
19479B5871K9985M2463j8749k6167j1141j6884k5280k7790J8088J9891l7485k6598
$$ 25871 55856 98319 79570 53403 42262 25378 98 -27692 -9604 10287 -27198 -53796
19467e3796P955J6977K0620J9153R846m28O2664k1159J4791J5895j3796j2965
$$ -53796 -45841 -28864 -8244 10909 20755 20327 82991 61832 76623 92518 78722 65757
19455F5757m654L652l9228M564K3125k7187m0576k080r064M916M4340K130M330
$$ 65757 61103 64755 25527 30091 53216 26029 -14547 -16627 -25691 -20775 23565 25695 30025
19442C0025J1313J960l3553n0253k269N393J714L835m222P3996M9886k3351j9080
$$ 30025 41338 43298 9745 -40508 -42777 -37384 -35670 -31835 -36057 37939 87825 64474 45394
19429D5394j09k5370J5872K0507p535j8530k9798j0062J1423L0365K3970R578
$$ 45394 45285 19915 35787 56294 48759 30229 431 -9631 1792 32157 56127 65705
19417F5705j738m3641k3951k3666j2072n264k921L6248J1716K0706l3920Q32J6274
$$ 65705 63967 20326 -3625 -27291 -39363 -44627 -47548 -11300 416 21122 -12798 -11966 4308
19404D308O5989L4909l6753m5688J4894k8105r707L1037J6642l0218j6246k9595
$$ 4308 70297 105206 68453 22765 37659 9554 -153 30884 47526 17308 1062 -28533
19392b8533j2722J8058J5116q319k3634J6137L2401J7940p693N566k467l8790
$$ -28533 -41255 -23197 -8081 -16400 -40034 -23897 8504 26444 18751 24317 21850 -16940
19380a6940L1339k5669k52k8100K3600J1698j5988Q011k9385P550L5865K6443
$$ -16940 14399 -11270 -11522 -39622 -16022 -4324 -20312 -12301 -41686 -34136 1729 28172
19368B8172j6693l6456n119j6939K6r07M0815M1815K893n6471l1337k3623L4940
$$ 28172 11479 -24977 -30096 -47035 -47009 -47916 -7101 34714 37607 -18864 -50201 -73824 -38884
19355c8884L6210J5730m436M219j0812k712J2365K5285J7756p069l0217J7692
$$ -38884 -2674 13056 8620 12839 2027 -685 11680 36965 54721 47652 17435 35127
19343C5127J2376J225k3001j2917M4926N0834n756l767k9211q780o203r324m3746
$$ 35127 47503 48728 25727 12810 57736 108570 102814 99047 69836 61056 54853 45529 1783
19330A783j1793K6453j5329k6239K2359j6123j7965J1943L1765L4261M4260l1135
$$ 1783 -10010 16443 1114 -25125 -2766 -18889 -36854 -24911 6854 41115 85375 54240
19318E4240l8611j032N6783J8461n6891l7143K246P958k162R692l876J497j5350
$$ 54240 15629 14597 71380 89841 32950 -4193 -1947 6011 3849 13541 9665 11162 -4188
19305d188k7985j8919k6906L5945N264J5253L1932O4988m2507l3727j5293k1913
$$ -4188 -32173 -51092 -77998 -42053 -36789 -21536 10396 75384 32877 -850 -16143 -38056
19293c8056L0514J1940L6889Q246m3952m7213J5626M5995R04m839k808Q332O427
$$ -38056 -7542 4398 41287 49533 5581 -41632 -26006 19989 20893 16054 13246 21578 28005
19280B8005l8112J2385J0547O838M48R54p883k1520j7230L4055Q923q737K545
$$ 28005 -10107 2278 12825 19663 20111 21065 13182 -8338 -25568 8487 17410 8673 11218
19267A1218N9757J3224j8895l5292k2440L1039K3019K8937m841n3554k4706J0019
$$ 11218 70975 84199 65304 30012 7572 38611 61630 90567 85726 32172 7466 17485
19255A7485K4576M111J0150o59l2141J8775M059q0422k2854M7087L9444j0257
$$ 17485 42061 46172 56322 55663 23522 42297 46356 -34066 -56920 -9833 29611 19354
19243A9354K3668k5509o715l1554k6757K9054K2194J181J032K7224r24J1120o556
$$ 19354 43022 17513 10798 -20756 -47513 -18459 3735 4916 5948 33172 32248 43368 36812
19230C6812l1403J1731M4189k2418k0016J60o0108j3940K4318J0801L7145p462
$$ 36812 5409 17140 61329 38911 18895 19055 -41053 -54993 -30675 -19874 17271 9809
19218I809N223m0873L3477P8149L4493l5051l2233K2682l2444J3588K5234m8191
$$ 9809 15032 -25841 7636 85785 120278 85227 52994 75676 43232 56820 82054 33863
19206C3863j6446L082j5904l631Q531J6947J4995p771J763j8974J6453J8191n5019
$$ 33863 17417 20499 4595 964 9495 26442 41437 33666 35429 16455 32908 51099 -3920
19193c920n078m52J863r830k161M341p337K4937j3242l0116K1678m5968N091O6335
$$ -3920 -8998 -9450 -7587 -17417 -19578 -15237 -22574 2363 -10879 -40995 -19317 -65285 -60194 6141
19179F141p655j2960O335o638K1870L0097j2993l942m79k1570K9079J6764Q694
$$ 6141 -1514 -14474 -8139 -14777 7093 37190 24197 20255 19776 -1794 27285 44049 52743
19166E2743J764n1745L852O243r180j0632k8940J4001L1274J2523M1793j7500
$$ 52743 54507 2762 6614 12857 3677 -6955 -35895 -21894 9380 21903 63696 46196
19154D6196k9762P628J3850K6434j7342m2909p398l446J1712k189k9165J7826
$$ 46196 16434 24062 37912 64346 47004 4095 -3303 -6749 4963 2774 -26391 -8565
19142h565R823L269l4924M0487J5533k4629R425K7644L2161L9079p115p2685j2629
$$ -8565 1258 4527 -30397 10090 25623 994 10419 38063 70224 109303 102188 29503 16874
19129A6874K5144j818j4275p476K2888l9142j5374J632K8133L2008J9010k4921
$$ 16874 42018 40200 25925 18449 41337 2195 -13179 -11547 16586 48594 67604 42683
19117D2683l937o71M7370k8626l6649J218L5830L4194k6651m6299l5430o162J9109
$$ 42683 38746 38075 85445 56819 20170 21388 57218 91412 64761 18462 -16968 -23130 -4021
19104d021p428L5734J2216k8116k162L9826j8626k1104J4664o556p026R408J8965
$$ -4021 -11449 24285 36501 8385 6223 46049 27423 6319 20983 14427 7401 16809 35774
19091C5774k6111j7213K2488K1886j6796m6225n105M1482j0764l6187r84J5441
$$ 35774 9663 -7550 14938 36824 20028 -26197 -31302 10180 -584 -36771 -37755 -22314
19079b2314M4353K1320K4416o0740o2914j8180r91K6779N5196L9557M0378Q436
$$ -22314 22039 43359 67775 7035 -55879 -74059 -75050 -48271 6925 46482 86860 95296
19067I5296j9934Q896J1574l5667k1840l8675j7503l0677k5382J2377M8321K0960
$$ 95296 75362 84258 95832 60165 38325 -350 -17853 -48530 -73912 -61535 -13214 7746
19055G746n183J2415l7473k3263K3587k9786j1219L0013K5427l329q935L0484
$$ 7746 2563 14978 -22495 -45758 -22171 -51957 -63176 -33163 -7736 -11065 -20000 10484
19043A0484J7844k0963k0639J7284j7679j1742k9098L0168M0142k7476J4660M11
$$ 10484 28328 7365 -13274 4010 -13669 -25411 -54509 -24341 15801 -11675 2985 3396
19031C396l7531L180K0182K3144l1605j0541M7835L2811q810k3884m9892m2293
$$ 3396 -34135 -30955 -10773 12371 -19234 -29775 18060 50871 42061 18177 -31715 -74008
19019g4008Q131K5235K2360M027J4205J229k2213k9677j1738k5843L8481M9420
$$ -74008 -65877 -40642 -18282 -14255 -50 1179 -21034 -50711 -62449 -88292 -49811 -391
19007c91L4737j1990j6527k6893P287K3859J2089K357J0317m0159k1420L171l851
$$ -391 34346 22356 5829 -21064 -13777 10082 22171 24528 34845 -5314 -26734 -23563 -27414
18994b7414R994K1154L3598K1262Q226l6337l3598Q968L1919K40j0941l8706O047
$$ -27414 -17420 3734 37332 58594 66820 30483 -3115 5853 37772 38012 27071 -11635 -5588
18981e588m0561l803N4763M3763j4798m2645l4056r55N1789J982P290o173O016
$$ -5588 -46149 -49952 4811 48574 33776 -8869 -42925 -43880 7909 9891 17181 11008 17024
18968A7024K4390K7861N9033k5327L2737P285l0350q4212l5636J3573J9056j1367
$$ 17024 41414 69275 128308 102981 135718 143003 112653 28441 -7195 6378 25434 14067
18956A4067l8583k6063l313K145K8024L4862p845N0028M3597j2340n9955m1992
$$ 14067 -24516 -50579 -53892 -51747 -23723 11139 3294 53322 96919 84579 24624 -17368
18944a7368L4446Q906r639J0994K2645k9447J6869k2473O429m3109L942K1294
$$ -17368 17078 25984 16345 27339 49984 20537 37406 14933 21362 -21747 -17805 3489
18932C489m268N34l4875K1769M3940O850l5620p8137K6790P774m2342M721J5267
$$ 3489 -779 -245 -35120 -13351 30589 37439 1819 -76318 -49528 -41754 -84096 -79375 -64108
18919f4108K1333r456N0044L0823m0899K8409M7485M113q280p377n738l4177l1452
$$ -64108 -42775 -52231 -2187 28636 -12263 16146 63631 67744 59464 52087 46349 12172 -19280
18906a9280J7777J8188k163j7610L537k0829j0734L702K7234o029j8274l3734
$$ -19280 -1503 16685 14522 -3088 449 -20380 -31114 -27412 -178 -6207 -24481 -58215
18894e8215L5306J5873J5566m395j7709n123M500R444P34l7717M3066Q702j7528
$$ -58215 -22909 -7036 8530 4135 -13574 -18697 -14197 -4753 -4019 -41736 1330 10032 -7496
18881g496J4903O0488L0600R22k9544l5520m0409o4J1648Q669K6029J8235R297
$$ -7496 7407 67895 98495 99417 69873 34353 -6056 -6120 5528 14197 40226 58461 67758
18868F7758j0203J9889k7623n710O196k8974N976L4597r003k2505J7370k7031
$$ 67758 57555 77444 49821 44111 50307 21333 27309 61906 52903 30398 47768 20737
18856B0737k5856J6292L8925j8075j8422k0187J2868L1800K307K5165J054l6793
$$ 20737 -5119 11173 50098 32023 13601 -6586 6282 38082 40389 65554 66608 29815
18844B9815j4187L0256J8065k4035K6680K4475J2927K4565q368q575n3521n742
$$ 29815 15628 45884 63949 39914 66594 91069 103996 128561 120193 111618 58097 52355
18832E2355K8625k8983j2284r242L3903K237k7801k6084K7751J739l0027j1977
$$ 52355 80980 51997 39713 30471 64374 66611 38810 12726 40477 42216 12189 212
18820B12M3353L9497p506l0175l2963P1004L3280O37k9566J0263l2045n7577j7734
$$ 212 43565 83062 75556 45381 12418 83422 116702 117339 87773 98036 65991 8414 -9320
18807i320K6222K2790L307j1715o5876J2175J6913K9257j7598J3087j4180J8844
$$ -9320 16902 39692 42999 31284 -34592 -22417 -5504 23753 6155 19242 5062 23906
18795B3906L6164o37j4132L2521j1920j7446O884l2359m3462M2093m465N18O693
$$ 23906 60070 59433 45301 77822 65902 48456 55340 22981 -20481 21612 17147 17665 24358
18782B4358J9865l3367k4555K3124L2636j5660p4042k5569j755M8681P8576K7894
$$ 24358 44223 10856 -13699 9425 42061 26401 -47641 -73210 -74965 -26284 52292 80186
18770H0186K702J9866m974l472O7274Q8161O1693K2081j9409q9497l7845k7914
$$ 80186 82888 102754 97780 94308 161582 249743 311436 333517 314108 224611 186766 158852
18758A58852J9636L5529K7638O3073M4305K5611L6880q275j1983j2889j2452j7849
$$ 158852 178488 214017 241655 304728 349033 374644 411524 403249 391266 378377 365925 348076
18746C48076R894L2151Q3732J10755J18306R0184K1410j6315q3536j15897r8363
$$ 348076 357970 390121 473853 584608 702914 793098 814508 798193 714657 598760 500397
18735E00397p6419m9579l4304K4281M007O9558K7042Q526l8962p3947n9868k2852
$$ 500397 423978 374399 340095 364376 368383 437941 464983 473509 434547 360600 300732 277880
18723B77880K356K687l8616n0412l3459P769J0660k360j3734J2261m3423J1724
$$ 277880 280236 282923 244307 193895 160436 168205 178865 176505 162771 175032 131609 143333
18711A43333J0628j0520K6703Q784k1627k7210j4934j7056L304p706j380L5598
$$ 143333 153961 143441 170144 178928 157301 130091 115157 98101 101405 93699 92319 127917
18699A27917K497j1221p5786R830p285M3328N281L5370K4656K0392M5171L9262
$$ 127917 130414 119193 43407 53237 45952 89280 94561 129931 154587 174979 220150 259412
18687B59412j5855o894l6003J7513L932K807P0187J03938J01558R9738Q6738O5686
$$ 259412 243557 236663 200660 218173 222105 224912 295099 399037 500595 600333 687071 752757
18675G52757P6825J4750l2680k6841J085J3066O1417J53062J11708R8762R7663
$$ 752757 829582 844332 811652 784811 785896 798962 860379 1013441 1125149 1223911 1321574
18664A321574J4473L0576l6988j27874j40469o5852n5105k9315m4426J4805O9722
$$ 1321574 1336047 1366623 1329635 1201761 1061292 995440 940335 911020 866594 881399 951121
18653I51121L1894n5956r4018o4144q4070j16421r4146l6331j07m8078p7911j9696
$$ 951121 983015 927059 833041 768897 684827 568406 474260 437929 437822 389744 311833 292137
18641B92137K8568K8986k9832m6939R566K7463n5185k6706J5250K5364p841K5282
$$ 292137 320705 349691 319859 272920 282486 309949 254764 228058 243308 268672 260831 286113
18629B86113k3723k9778N937J2612l0646j9391q607j772K0248J5056L1427J8398
$$ 286113 262390 232612 238549 251161 220515 201124 192517 190745 210993 226049 257476 275874
18617B75874m9112o2209j8621k2193k5058q2777l5263P6110N5717L9305j0809
$$ 275874 226762 164553 145932 123739 98681 15904 -19359 56751 112468 151773 140964
18606A40964l366k869l0004L808k798j6914L5448K3033L0950l7818k8601L6234
$$ 140964 137598 134729 104725 108533 105735 88821 124269 147302 178252 140434 111833 148067
18594A48067O3938r963n339J3298j7104m556l5225k6772k7965o906n827k7669
$$ 148067 212005 202042 196703 210001 192897 188341 153116 126344 98379 91473 85646 57977
18582E7977J512J5663J5720J4477J0785J0970L168m1070m2452k9692J0423R163
$$ 57977 59489 75152 90872 105349 116134 127104 130272 89202 46750 17058 27481 36644
18570C6644K0371J1817L1443K0456M636r336J1229N839j1736K869K3985l3423
$$ 36644 57015 68832 100275 120731 125367 116031 127260 133099 121363 124232 148217 114794
18558A14794k6143j0170o9925J2732L4175J0123j1835j5293k4859p233L6365J1927
$$ 114794 88651 78481 8556 21288 55463 65586 53751 38458 13599 6366 42731 54658
18546E4658L206k273L1570K2097k8560o0733J0534K8105K3836k946K6470j575
$$ 54658 57864 55591 87161 109258 80698 19965 30499 58604 82440 79494 105964 104389
18534A04389j0464L2205L2301m5363j8308J1990K2540j6057J4188O833K7459k3582
$$ 104389 93925 126130 158431 113068 94760 106750 129290 113233 127421 134254 161713 138131
18522A38131l0593k4769J1038K9155r118J0079p723L612P178k2807P536L4466
$$ 138131 107538 82769 93807 122962 113844 123923 116200 119812 126990 104183 111719 146185
18510A46185l1742k423q289J8100p767l6205k5633M8939J7447l2017l1137K7978
$$ 146185 114443 112020 103731 121831 114064 77859 52226 101165 118612 86595 55458 83436
18498H3436N9732j2369n5458j1045L647L4332q61N6897K7187m2166q1511j4624
$$ 83436 143168 130799 75341 64296 67943 102275 101414 158311 185498 143332 61821 47197
18486D7197L6389K349P670J0141K8j5897k6876o062K2982m092J2998j2360l5225
$$ 47197 83586 85935 93605 103746 103774 87877 61001 54939 77921 73829 86827 74467 39242
18473C9242Q063n430J0469Q82J7485K749J0636k8131R1132j413n1711m655l2074
$$ 39242 47305 41875 52344 53226 70711 73460 84096 55965 147097 145684 93973 89318 57244
18460E7244m7334L1103O6145N7029K0566l3455l2538J6590K2521j1545k6366k2888
$$ 57244 9910 41013 107158 164187 184753 151298 118760 135350 157871 146326 119960 97072
18448I7072j2745O2151O0124l1977K474Q360J3440k450k7026J4253j2014M689
$$ 97072 84327 146478 206602 174625 177099 185459 198899 196449 169423 183676 171662 176351
18436A76351j8638l2897j2727k5365k5217K2508K0333o2094N188L5325J6999M024
$$ 176351 157713 124816 112089 86724 61507 84015 104348 42254 47442 82767 99766 103790
18424A03790j5554k0207J4655J5875J0680m4562O052L4817P967k0695j0303L3117
$$ 103790 88236 68029 82684 98559 109239 64677 70729 105546 113513 92818 82515 115632
18412A15632j6417j8367J6599K7771j933K4739J9555L9061J7228K3523N116L3007
$$ 115632 99215 80848 97447 125218 123285 148024 167579 206640 223868 247391 252507 285514
18400B85514L4730M261J4392J4418n3307q5440o1204J6935J7905K4542N4743P1037
$$ 285514 320244 324505 338897 353315 300008 214568 153364 170299 188204 212746 267489 338526
18388C38526K2967n3429k3964k7948J7281J5842k2988p4758J585J4161j0091j227
$$ 338526 361493 308064 284100 256152 273433 289275 266287 191529 193114 207275 197184 195957
18376A95957J5937N4764j883j7571k3518k1980L224m857K7229J3506K580p564
$$ 195957 211894 266658 264775 247204 223686 201706 204930 200073 227302 240808 243388 235824
18364B35824J6413L1588L2520j2512l9366l5896j2630k067k8264k311L0254n674
$$ 235824 252237 283825 316345 303833 264467 228571 215941 213874 185610 183299 213553 207879
18352B07879k45l033k7291p964K0191k6870L327M515n2872k1988j3498n4160l0604
$$ 207879 207634 204601 177310 169346 189537 162667 165994 170509 117637 95649 82151 27991 -2613
18339b613l410N3548K5595J3830K8904O3523k845L7067O0726K1276n5393m7737
$$ -2613 -6023 47525 73120 86950 115854 179377 176532 213599 274325 295601 240208 192471
18327A92471O2833N9780R463K5164N9418J9389J8904L3117K7841J8478J4146J5616
$$ 192471 255304 315084 324547 349711 409129 428518 447422 480539 508380 526858 541004 556620
18315E56620q94k3063M8781J1849j2870k89k725j9715j8803K287K196j4537j6894
$$ 556620 555726 532663 581444 593293 580423 580134 577409 557694 538891 541178 543374 528837 511943
18302E11943n674j7034Q676k4588K1235J7085p6639l3875P613N7424N5444J0207
$$ 511943 506269 489235 497911 473323 494558 511643 435004 401129 408742 466166 521610 531817
18290E31817j3994M189J8495J5746m7336K8982R832k9203K9227M9563q45J9013
$$ 531817 517823 522012 540507 556253 508917 537899 547731 518528 547755 597318 596473 615486
18278F15486L5611k1218l8222k8172L3872j222L0748M3291Q902O158j667J6953
$$ 615486 651097 629879 591657 563485 597357 596135 626883 670174 679076 685234 683567 700520
18266G00520L2959J0750q493m7171j5137J3295q005K5048M0456N2884p303J7195
$$ 700520 733479 744229 735736 688565 673428 686723 678718 703766 744222 797106 789803 806998
18254H06998N1475M9086N4030K7259J1225L5368M2950N3774R4168J04652R7464
$$ 806998 858473 907559 961589 988848 1000073 1035441 1078391 1132165 1226333 1330985 1428449
18243A428449J47406J49429K87368L55007L00714K62018K29953P9417o1717K6354
$$ 1428449 1575855 1725284 2012652 2367659 2668373 2930391 3160344 3239761 3178044 3204398
18233C204398Q5538J67866L54830N50685O82364P37370P24385O14467N50623L08179
$$ 3204398 3289936 3457802 3812632 4363317 5045681 5783051 6507436 7121903 7672526 7980705
18223G980705P4655K72015O61040J262813K172105L496754N425803P586367R095433
$$ 7980705 8055360 8327375 8988415 10251228 12423333 15920087 21345890 28932257 38027690
18214C8027690Q051325N681921K544839m211556m794628m500891k679942K255573
$$ 38027690 46079015 51760936 54305775 50094219 45299591 40798700 38118758 40374331
18206D0374331P589620J2884609J7125609J7942799J7621815R694636n08502n804401
$$ 40374331 47963951 60848560 77974169 95916968 113538783 123233419 122724917 116920516
18198A16920516j6912465j6252789j3040749q387686o29793O674449J2516816
$$ 116920516 100008051 83755262 70714513 62326827 61697034 68371483 80888299
18191H0888299J5045810J0870525O909016l789179j5180649j4915660j6628409
$$ 80888299 95934109 106804634 113713650 109924471 94743822 79828162 63199753
18184F3199753j3391407q424361n360241l613197k591597j845911j320453r15258
$$ 63199753 49808346 41383985 36023744 32410547 29818950 27973039 26652586 25737328
18176B5737328p46657o28628o29722o14389n49912m87187n47101m52530j31578
$$ 25737328 24990671 24362043 23732321 23117932 22568020 22080833 21533732 21081202 20949624
18167B0949624J10041L50700N02891N99078O57583O77457P03148P29967R08986
$$ 20949624 21059665 21410365 21913256 22512334 23169917 23847374 24550522 25280489 26189475
18158B6189475J384147J947655K835627M202275O247899R296881J4594364K3271404
$$ 26189475 27573622 29521277 32356904 36559179 42807078 52103959 66698323 89969727
18150H9969727L3704779M2085466M1544410L0750741L0855741K5977653j3070124
$$ 89969727 123674506 165759972 207304382 238055123 268910864 294888517 281818393
18143B81818393l5129038k2539496k3825884k9575071j4477929M463781J5549675
$$ 281818393 246689355 224149859 200323975 170748904 156270975 160734756 176284431
18136A76284431J6740196J6343426J4888914L103333j3843372k3954994k2918535
$$ 176284431 193024627 209368053 224256967 227360300 213516928 189561934 166643399
18129A66643399k4576282k6221437k1392506j3595045q802091o271870m649777
$$ 166643399 142067117 115845680 94453174 80858129 72056038 65784168 61134391
18122F1134391l648251k899466k473336k241324k004828j732870j755004j675774
$$ 61134391 57486140 54586674 52113338 49872014 47867186 46134316 44379312 42703538
18114D2703538j301563j009628p51574o9312R98614K849123O048909J0255214
$$ 42703538 41401975 40392347 39640773 39571461 40570075 43419198 49468107 59723321
18106E9723321J3018242J0685361n968391j9042722j2690728p096031m151901
$$ 59723321 72741563 83426924 77458533 58415811 45725083 38629052 34477151
18099C4477151k705465j897156j494019j276836j112014j017174r12237q02016
$$ 34477151 31771686 29874530 28380511 27103675 25991661 24974487 24062250 23260234
18091B3260234p79555p40948o89446n94987n03131m08917m46553m41654m30526
$$ 23260234 22480679 21739731 21050285 20455298 19952167 19543250 19096697 18655043 18224517
18082A8224517m00866m31443l98939l29113l00201k85891k74075k82382l13412
$$ 18224517 17823651 17392208 16993269 16664156 16363955 16078064 15803989 15521607 15208195
18073A5208195l55060l51702l99582l65197l17528k78457l24066k93872k82081
$$ 15208195 14853135 14501433 14101851 13736654 13419126 13140669 12816603 12522731 12240650
18064A2240650k70955k47915k71914l02027k62539l63091m17659l77058k91216
$$ 12240650 11969695 11721780 11449866 11147839 10885300 10522209 10104550 9727492 9436276
18055I436276k47768k56509k32113k53569k51365k31572k03470j94127k20190
$$ 9436276 9188508 8931999 8699886 8446317 8194952 7963380 7759910 7565783 7345593
18046G345593k53111k28252k11857j04203j39819k01871j75082j43425n7793r5755
$$ 7345593 7092482 6864230 6652373 6548170 6408351 6206480 6031398 5887973 5830180 5734425
18036E734425j57214j55873j40566j06833j01990j18934j26441p6236q7410o1717
$$ 5734425 5577211 5421338 5280772 5173939 5071949 4953015 4826574 4750338 4662928 4601211
18026D601211r6688j10408j5683M914M8101J06962J76682K31734L72868N38927
$$ 4601211 4504523 4394115 4378432 4383346 4431447 4538409 4715091 4946825 5319693 5858620
18016E858620O63702O68648M44004N15468P22788K65941p18578o37954k51003
$$ 5858620 6522322 7190970 7634974 8150442 8873230 9139171 8420593 7782639 7531636
18007G531636k99564m60944j50251K20770L63978J86388L75452M53197L1303q32523
$$ 7531636 7232072 6771128 6620877 6841647 7205625 7392013 7767465 8220662 8251965 7419442
17997G419442p30554m28777n55194p92883o91168m58065l21543k56217k26567
$$ 7419442 6688888 6260111 5704917 4912034 4220866 3762801 3441258 3185041 2958474
17988B958474j98641j35806j57842j23444l2960q1432j19634n2679l7250o6665
$$ 2958474 2759833 2624027 2466185 2342741 2309781 2228349 2108715 2056036 2018786 1952121
17978A952121j33568j23812j06956q5546r5187l3799o3252l6461o1305q2657o4102
$$ 1952121 1818553 1694741 1587785 1502239 1407052 1373253 1310001 1273540 1212235 1129578 1065476
17967A065476k3619k9897j123n840l2995m5884l5572M316K2235K2733J402L8402
$$ 1065476 1041857 1011960 1010837 1004997 972002 926118 890546 894862 917097 939830 941232 979634
17955I79634K3171J8096m027k0558m2590j5194k7925j7916P429N707J3174L632
$$ 979634 1002805 1020901 1016874 996316 953726 938532 910607 892691 900120 905827 919001 922633
17943I22633j8624M5635L3979J7769l8208j5048Q67n1341p9875o3033j2683k7250
$$ 922633 904009 949644 983623 1001392 963184 948136 949003 897662 817787 754754 742071 714821
17931G14821Q297J4376M2997l2455n7825k0927k7434Q05j879R643k1034l0133
$$ 714821 723118 737494 780491 748036 690211 669284 641850 642655 640776 650419 629385 599252
17919E99252m5331K6007K6955l152R018j4815l5851l1452Q114l271l5649k9959
$$ 599252 553921 579928 606883 603731 612749 597934 562083 530631 538745 535474 499825 469866
17907D69866P413J6036j4055j8648k3213l7795J4156L4339k438o163l9425j4232
$$ 469866 477279 493315 479260 460612 437399 399604 413760 448099 445661 439498 400073 385841
17895C85841L1232K0008J4275j964K0554k1650l8749j6071J8338j2542j6516K8557
$$ 385841 417073 437081 451356 449392 469946 448296 409547 393476 411814 399272 382756 411313
17883D11313m7754n7793J6483J4922O443L3878L898m405K767L1778l5858n0353
$$ 411313 363559 305766 322249 337171 343614 377492 381390 376985 379752 411530 375672 325319
17871C25319N803o142n9315k1005K3601M8780k9209m045j6496o4932k4391K257
$$ 325319 331122 324980 265665 244660 268261 317041 287832 283787 267291 202359 177968 180225
17859A80225L0255J2385n219j6126k9319k4892o712p921O469j9322l2925k751
$$ 180225 210480 222865 217646 201520 172201 147309 140597 132676 139145 119823 86898 84147
17847H4147L8867J9205n404J6634L960m7081m4839J708l8067M9711L1205m982
$$ 84147 123014 142219 136815 153449 157409 110328 65489 67197 29130 78841 110046 105064
17835A05064P561J7846m1303M841J3146J7701k4966j1709K4908k5743j2458j450
$$ 105064 112625 130471 89168 94009 107155 124856 99890 88181 113089 87346 74888 73438
17823G3438K7887j0495n3434j9099J7887N139J5533K0288K7339l5458k1494M894
$$ 73438 101325 90830 37396 18297 36184 41323 56856 77144 104483 69025 47531 52425
17811E2425J1603k621M074J5865P871M1671j7317n546K949j4373n341P663j8430
$$ 52425 64028 61407 65481 81346 89217 130888 113571 108025 110974 96601 91260 98923 80493
17798H0493j0003J0130l8784l2882N3340K053q42J632J9769J5172L1470k4658
$$ 80493 70490 80620 41836 8954 62294 64347 63505 65137 84906 100078 131548 106890
17786A06890m1144J4867J0954M847q828k0873j4151j7250N686j9591j8562N334
$$ 106890 65746 80613 91567 96414 87586 66713 52562 35312 40998 21407 2845 8179
17774H179M0677Q060O960o875j1118J4101K8944o333k1682J4622j5333l3350J7165
$$ 8179 48856 56916 63876 57001 45883 59984 88928 82595 60913 75535 60202 26852 44017
17761D4017j6389l4869n0948L2431L9877L6945k7153j9171K6844K7134k866K6872
$$ 44017 27628 -7241 -58189 -25758 14119 51064 23911 4740 31584 58718 55852 82724
17749H2724P395K4102L4825k7811k7371j5309L306m7057j8430r702j0420N474
$$ 82724 90119 114221 149046 121235 93864 78555 81861 34804 16374 6672 -3748 1726
17737A726j4257n976K5219N1285L1866r989Q111K1388l6920m2012P685K1761j3829
$$ 1726 -12531 -18507 6712 57997 89863 79874 87985 109373 72453 30441 38126 59887 46058
17724D6058r582J0259K0550k0650r323r75m0612L7499L0461J0585J5448k4858
$$ 46058 36476 46735 67285 46635 37312 36337 -4275 33224 63685 74270 89718 64860
17712F4860J1941K9936O658m1818L0043J1625o2937o4326Q152P2203J3464j9929
$$ 64860 76801 106737 113395 71577 101620 113245 50308 -14018 -5866 66337 79801 59872
17700E9872j3598L3723L913k1678m6793J1708M8031Q662j3263k66k4378J252j7660
$$ 59872 46274 79997 83910 62232 15439 27147 75178 83840 70577 70311 45933 47185 29525
17687B9525R634N574N964M3975j8543p1799p901J3049K4848O5839L9230l1866
$$ 29525 39159 44733 50697 94672 76129 4330 -3571 9478 34326 100165 139395 107529
17675A07529p812l9463j6120O2137M3823P3736N2955N6962O3603N6101O687l9814
$$ 107529 99717 60254 44134 106271 150094 223830 276785 333747 397350 453451 460138 420324
17663D20324q5683p3183o4337J6835J06255J08252J31394J37986Q3416J9584j6149
$$ 420324 334641 261458 197121 213956 320211 428463 559857 697843 781259 800843 784694
17652G84694j04208j06855j00314o1723k6761l5695J2600K9933O7237O7401j0096
$$ 784694 680486 573631 473317 411594 384833 349138 361738 391671 458908 526309 516213
17641E16213j2175o7347n3208p3831n4947M0475L2592q257j7825k9489K0105L7785
$$ 516213 504038 436691 383483 309652 254705 295180 327772 319515 301690 272201 292306 330091
17629C30091j7926J5915L3890L7038R6171J10917J09200J50624J03203o1283j22683
$$ 330091 312165 328080 361970 399008 495179 606096 715296 865920 969123 907840 785157
17618G85157N950N6311M05P2781J05313J17268J19049J20867O9869m7530j07639
$$ 785157 791107 847418 847823 920604 1025917 1143185 1262234 1383101 1452970 1405440 1297801
17607A297801j42802j25461p7843l7064j3123J019j8813K883J6102k9128o4747
$$ 1297801 1154999 1029538 951695 914631 901508 902527 883714 886597 902699 873571 808824
17596H08824j00963j32394j28982p8456j7867M2751j8352p4428j3917j9291l1069
$$ 808824 707861 575467 446485 368029 350162 392913 374561 300133 286216 266925 235856
17585B35856m2438J8739M0624K0733j4435K6395k1087l6351k6414j1856q319n0707
$$ 235856 193418 212157 252781 273514 259079 285474 264387 228036 201622 189766 181447 130740
17573A30740J7510j0390m8141P760L2061K9636O753m5074p706K0910O346l3576
$$ 130740 148250 137860 89719 97479 129540 159176 165929 120855 113149 134059 140405 106829
17561A06829k5395n503P88P19K6319J7033N065k5782k4142l03r377k5259O0324
$$ 106829 81434 75931 76719 77438 103757 120790 125855 100073 75931 75628 66251 40992 101316
17548A01316K3519j3497K4752J3874J0224o411O19P287k1787K336J1693K829K6072
$$ 101316 124835 111338 136090 149964 160188 153777 154396 161683 139896 142232 153925 156754 182826
17535A82826n3281o5423L0520K3864q510k2657n7767M745L1206k8751k5239J8905
$$ 182826 129545 64122 94642 118506 109996 87339 29572 34317 65523 36772 11533 30438
17523C0438J0168k5394J5139O1520l0507j9954P260Q303J2257j5753l6239R869
$$ 30438 40606 15212 30351 91871 61364 41410 48670 56973 69230 53477 17238 27107
17511B7107O550L6981R716L025J114L0586L127k3935j8942J413R932k6772l4343
$$ 27107 33657 70638 80354 83379 84493 115079 118206 94271 75329 76742 86674 59902 25559
17498B5559j4175j0967j5214q806L418J7019J9307K0588k391k0178m134J2250
$$ 25559 11384 417 -14797 -23603 -20185 -3166 16141 36729 34338 14160 10026 22276
17486B2276M2808k1860k4693N169L3810J1816O487O9791l0022n7121j6877k5202
$$ 22276 65084 43224 18531 23700 57510 69326 75813 145604 115582 58461 41584 16382
17474A6382J2735k677N566p278j6461k2015L1422N65K6289K2969J6675l1652k6157
$$ 16382 29117 26440 32006 24728 8267 -13748 17674 18239 44528 67497 84172 52520 26363
17461B6363J7968k667l0641k0076K8075j4936l531J5111l4222k682l0498n8616
$$ 26363 44331 41664 11023 -9053 19022 4086 555 15666 -18556 -21238 -51736 -110352
17449a10352L6139O7505J6641K719j6801L3358M5597L5797O3388P8161M4381r658
$$ -110352 -74213 -6708 9933 12652 -4149 29209 74806 110603 173991 252152 296533 286875
17437B86875q8522r5652k8985j3243r050K9423j0142l0628R572K1694J1002l8236
$$ 286875 198353 102701 73716 60473 51423 80846 70704 40076 49648 71342 82344 44108
17425D4108k3613j4831K6523K4479j6891k7850k680j826q463m161l9237m729l3517
$$ 44108 20495 5664 32187 56666 39775 11925 9245 7419 -1044 -5205 -44442 -49171 -82688
17412h2688r502N6872N3145J0185j7026l4853l579K0016j0562M367j5715M1403
$$ -82688 -92190 -35318 17827 28012 10986 -23867 -27446 -7430 -17992 -13625 -29340 12063
17400A2063K9237o5740l2079M46k2598J1761L393J8116K6739O889K0647Q666k2618
$$ 12063 41300 -24440 -56519 -56073 -78671 -66910 -63517 -45401 -18662 -11773 8874 17540 -5078
17387e078K3601O725J0748n928l4963j7074k931O705l7512j5021M6110L2401L2705
$$ -5078 18523 25248 35996 30068 -4895 -21969 -24900 -18195 -55707 -70728 -24618 7783 40488
17374D0488n1616k7701J3538J6376K8979j0919J3461L5960J3728k804J5465k6067
$$ 40488 -11128 -38829 -25291 -8915 20064 9145 22606 58566 72294 69490 84955 58888
17362E8888k9624k3968J0525J4021K1898l7126m2200L703N7195k260l0598j6151
$$ 58888 29264 5296 15821 29842 51740 14614 -27586 -23883 33312 31052 454 -15697
17350a5697K2508J7121j0985k1915l1750K104k4077k616L5665o627n100K2003
$$ -15697 6811 23932 12947 -8968 -40718 -38614 -62691 -65307 -29642 -36269 -41369 -19366
17338a9366L131P362r522k4152J3560J326j9359K6894K6011j3070k140J3859q720
$$ -19366 -16235 -8873 -18395 -42547 -28987 -27661 -47020 -20126 5885 -7185 -9325 4534 -4186
17325d186L0823L0172N374m1932k02J2975j4477j3705l1873l298p297K0447L2455
$$ -4186 26637 56809 62183 20251 20049 33024 18547 4842 -27031 -30329 -37626 -17179 15276
17312A5276K8784j6299k6318l158Q641L6509j9119o9013n7910L1303K7300J6795
$$ 15276 44060 27761 1443 -1715 6926 43435 24316 -44697 -102607 -71304 -44004 -27209
17300b7209K4270L1641L9345k4093k1690k5593K4448O987l1974m916k1692m328
$$ -27209 -2939 28702 68047 43954 22264 -3329 21119 28106 -3868 -8784 -30476 -34804
17288c4804J6713L71J647J4150k3049j2873K3674K0593K7125m1143m5265j8195
$$ -34804 -18091 -17720 -16073 -1923 -24972 -37845 -14171 6422 33547 -7596 -52861 -71056
17276g1056r55J1859N1581J8925l331r893p4452m28K3242l806J3203L2014k1681
$$ -71056 -72011 -60152 -8571 10354 7023 -2870 -77322 -77750 -54508 -58314 -45111 -13097 -34778
17263c4778J0536j1803j2805N24j3391J6998M7746K6375k225l491n112k4036K1308
$$ -34778 -24242 -36045 -48850 -48326 -61717 -44719 3027 29402 27177 23686 18574 -5462 15846
17250A5846J2915M1359N0249K966n2980n6762k5552m02R651J5241J0707k7565
$$ 15846 28761 70120 120369 123335 70355 13593 -11959 -12361 -2710 12531 23238 -4327
17238d327k5633j7456K6827J7416k5556j1887O092K1445j5432j6266K9043l694
$$ -4327 -29960 -47416 -20589 -3173 -28729 -40616 -34524 -13079 -28511 -44777 -15734 -19428
17226a9428k5186J8203N0500k0254l4509k2541l090J9037P9354J6695k9154m2193
$$ -19428 -44614 -26411 24089 3835 -30674 -53215 -56305 -37268 42086 58781 29627 -12566
17214a2566M194N6873L0333l1078q692j0934O297j4770p162k9094l3314k606j3467
$$ -12566 -8372 48501 78834 47756 39064 28130 34427 19657 12495 -16599 -49913 -52519 -65986
17201f5986N8858J1487m1013p0668o059K0810J0074M7055J7453Q023K3968L7743
$$ -65986 -7128 4359 -36654 -107322 -113381 -92571 -82497 -35442 -17989 -9966 14002 51745
17189E1745q375j3656L9499j7326m0831O579j1644j9074r049J5937M197M1213
$$ 51745 43370 29714 69213 51887 11056 17635 5991 -13083 -22132 -6195 -1998 39215
17177C9215J0071J913m8726J8902L7241J0615M0959m1532q3803l8803l908L5864
$$ 39215 49286 51199 2473 21375 58616 69231 110190 68658 -15145 -53948 -57856 -21992
17165b1992R353l331k1139J6788K0454N7946N81j5254J0316j9027j5869R315k633
$$ -21992 -12639 -15970 -37109 -20321 133 58079 58660 43406 53722 34695 18826 28141 25508
17152B5508l2795P419q880k1409k1170l5918Q791J3680k1117J4779M8353M4646
$$ 25508 -7287 132 -8748 -30157 -51327 -87245 -78454 -64774 -85891 -71112 -22759 21887
17140B1887L9139m051m6264j1025K0743J0505j6068m5246k509K1030J5441p758
$$ 21887 61026 56975 10711 -314 20429 30934 14866 -30380 -32889 -11859 3582 -4176
17128d176L2078L4366k2451p800j5478k1534l5466p302O381Q661K3389N572Q461
$$ -4176 27902 62268 39817 32017 16539 -4995 -40461 -47763 -41382 -32721 -9332 -3760 4701
17115D701J0593J1776o9935l5828J3090L6712M772K4124J3932j331k9434m984
$$ 4701 15294 27070 -42865 -78693 -65603 -28891 -24119 5 13937 12606 -16828 -21812
17103b1812L4395j3102j3366L5627L0840K1273L202j3936m9534o012j9177J721
$$ -21812 12583 -519 -13885 21742 52582 73855 77057 63121 13587 7575 -11602 -9881
17091i881P801J0272K6309J5088q446k4481J8360m7763k3457J2907P546l6356
$$ -9881 -2080 8192 34501 49589 41143 16662 35022 -12741 -36198 -23291 -15745 -52101
17079e2101r029P614J7660q81l6300k3285L8892P2865j6963k2538j6121j7618
$$ -52101 -61130 -53516 -35856 -36737 -73037 -96322 -57430 15435 -1528 -24066 -40187 -57805
17067e7805m4470P497n638K4407M1245M0025M4714p788k5669o628o023P51l2286
$$ -57805 -102275 -94778 -100416 -76009 -34764 5261 49975 42187 16518 9890 3867 4618 -27668
17054b7668n207J2431o869N538K6392K9495J444N7509p352k6421j6501P60k9411
$$ -27668 -32875 -20444 -27313 -21775 4617 34112 35556 93065 85713 59292 42791 43551 14140
17041A4140j714j2036m1809j4238L5918M4431P206n0739l1724K5826m303L5924
$$ 14140 12426 390 -41419 -55657 -19739 24692 31898 -18841 -50565 -24739 -29042 6882
17029F882Q075O0751k4760l3651m8262M126J2296k106J2588j1335k702k2745j2433
$$ 6882 14957 75708 50948 17297 -30965 -26839 -14543 -16649 -4061 -15396 -18098 -40843 -53276
17016e3276O1796j5363k7826j8983L2681N0543q06m1175j240m0031j1866j3038
$$ -53276 8520 -6843 -34669 -53652 -20971 29572 28766 -12409 -13649 -53680 -65546 -78584
17004g8584k1461L4318M4095M30n1290o385J1677J752L5203J239l6766M0304K1708
$$ -78584 -100045 -65727 -21632 -21202 -72492 -78877 -67200 -65448 -30245 -29006 -65772 -25468 -3760
16991c760K586l5006j2892l713J2720O5931N7579l5347l4007P633M723M102L6078
$$ -3760 -1174 -36180 -49072 -52785 -40065 25866 83445 48098 14091 21724 26447 30549 66627
16978F6627k4902o259J277o199j0685k3931m4417l7685j9759K9730j4743l874
$$ 66627 41725 35466 36743 30544 19859 -4072 -48489 -86174 -105933 -76203 -90946 -94820
16966i4820K9509K6464J3250J908l8921K406q735k0834K119K1082q66k5056K0481
$$ -94820 -65311 -38847 -25597 -23689 -62610 -60204 -68939 -89773 -87654 -66572 -67438 -92494 -72013
16953g2013P70n144R151N2744J818L5486M0596k7594j04664k9495M3615O4741
$$ -72013 -71243 -76387 -67236 -14492 -12674 22812 63408 35814 -68850 -98345 -54730 10011
16941A0011j7892j148K8918k8241n982j6632n150R830M794o572K9938J6904k3764
$$ 10011 -7881 -9029 19889 -8352 -14334 -30966 -36116 -26286 -21492 -28064 1874 18778 -4986
16928d986J6025n376R593K3853j096k1140R06J1818J736j2303j3807K8803L2849
$$ -4986 11039 5663 15256 39109 38013 16873 17779 29597 31333 19030 5223 34026 66875
16915F6875J7803k7610k9850k0084N183L3411j326k9973k982L0681J1448j2194
$$ 66875 84678 57068 27218 7134 12317 45728 44402 14429 11447 42128 53576 41382
16903D1382l7411R236j0128l601N236K6526p0693j1581O3207K071K1669K4267
$$ 41382 3971 13207 3079 -522 4714 31240 -39453 -51034 12173 14244 35913 60180
16891F0180l2715j261P669l6488l7185P451M1218K0458L170K1087O955j91l4369
$$ 60180 27465 26204 33873 -2615 -39800 -32349 8869 29327 32497 53584 60539 60348 25979
16878B5979j2399R226o6872q45J1399m63j102O6428N021l0661K8632J4640J0527
$$ 25979 13580 22806 -44066 -44911 -33512 -33975 -35077 31351 36372 5711 34343 48983 59510
16865E9510J6937l4209o3388l896N8241M0094j9233k8860l2124m0543M3041M8055
$$ 59510 76447 42238 -21150 -25046 33195 73289 54056 25196 -6928 -47471 -4430 43625
16853D3625J4015l490l6864J5950M504m4579l2495r358O786J8392l561L4737Q553
$$ 43625 57640 54150 17286 33236 37740 -6839 -39334 -48692 -41906 -23514 -27075 7662 16215
16840A6215O357K951k2639k9129j8038r258J209K6393q77K2542K6450O2762m469
$$ 16215 22572 25523 2884 -26245 -44283 -53541 -52332 -25939 -26816 -4274 22176 84938 80469
16827H0469m8972L677r357k8672k3625R54l7186P063N4925k0922k6865L6856j3292
$$ 80469 31497 35174 25817 -2855 -26480 -25526 -62712 -55649 -724 -21646 -48511 -11655 -24947
16814b4947K637J0521M918j8767K0129J9106j0707k9480k2512L6765M0373o693
$$ -24947 -22310 -11789 -6871 -25638 -5509 13597 2890 -26590 -49102 -12337 28036 21343
16802B1343R25P551j3693k417J3537m177k5461p95m7431J7507j0920k7791n9L2724
$$ 21343 22268 29819 16126 13709 27246 23069 -2392 -3187 -50618 -33111 -44031 -71822 -71881 -39157
16788c9157j604k4352M3980K6290O4072J5954j6822k1695l4456k6130M5455j2923
$$ -39157 -40761 -65113 -21133 5157 69229 85183 68361 46666 12210 -13920 31535 18612
16776A8612o008O897R579k3946j9454J2637O584J0296j6035J348k371J729P770
$$ 18612 12604 19501 29080 5134 -14320 -1683 4901 15197 -838 510 -1861 -132 7638
16763G638J206N10k1433j244k230L643L986J6342J8181J7768k3943j6336K0626
$$ 7638 8844 9354 -12079 -13323 -15553 -11910 -7924 8418 26599 44367 20424 4088 24714
16750B4714Q397j1302K7329n103p4037k5508L5145N4560n081j8984k0311k444
$$ 24714 33111 21809 49138 44035 -30002 -55510 -20365 34195 29114 10130 -10181 -12625
16738a2625l7921q969j0478P122J2485L6569r87o476J1051k8062R741K889n8482
$$ -12625 -50546 -59515 -69993 -62871 -50386 -13817 -14804 -21280 -10229 -38291 -28550 -25661 -84143
16725h4143j1074M5299L7726K3843j8688l1050K800r533J2694K877n042k3524
$$ -84143 -95217 -49918 -12192 11651 -7037 -38087 -35287 -44820 -32126 -29249 -34291 -57815
16713e7815M1669K8727j8255p213K6443M076l4788k0652L5209J5523l409n1679
$$ -57815 -16146 12581 -5674 -12887 13556 17632 -17156 -37808 -2599 12924 9515 -42164
16701d2164m6357J0549J0224q241K1270J101J332M0501J2662j7940K5702l294
$$ -42164 -88521 -77972 -67748 -75989 -54719 -53618 -52286 -11785 877 -17063 8639 5345
16689E345M434k3992J6479J0387N095L4849k8233l0135l0017Q522K7005k279j5414
$$ 5345 9779 -14213 2266 12653 17748 52597 24364 -5771 -35788 -27266 -261 -2540 -17954
16676a7954M229N527J8016k8394O3083J1930k9027j7785k194l2742n3591k1042
$$ -17954 -13725 -8198 9818 -18576 44507 56437 27410 9625 7431 -25311 -78902 -99944
16664i9944L1397O8419M8727J5025m6087J1966l3051l2536J2244j8310j7245k5439
$$ -99944 -68547 -128 48599 63624 17537 29503 -3548 -36084 -23840 -42150 -59395 -84834
16652h4834L364M8046K8306j8507l388N393K4092j2521J7135L648j5233L6684
$$ -84834 -81470 -33424 -5118 -23625 -27013 -21620 2472 -10049 7086 10734 -4499 32185
16640C2185J6793j9064j5631K398n124n7326j2441j2711J5099L7284M6423k428
$$ 32185 48978 29914 14283 16681 11557 -45769 -58210 -70921 -55822 -18538 27885 25457
16628B5457p432k178K3428j5287l6577l3458j7719P6831n205l0733J0099J4786
$$ 25457 18025 15847 39275 23988 -12589 -46047 -63766 13065 7860 -22873 -12774 2012
16616B012j524K054K7457j8290l7304k9859q76N2545j4125Q748K9956k0210r493
$$ 2012 488 2542 29999 11709 -25595 -55454 -56330 -3785 -17910 -9162 20794 584 -8909
16603h909M5326L1432K722n8650l8683K2468K247j0908J3431J3502k0218j9164
$$ -8909 36417 67849 70571 11921 -26762 -4294 -2047 -12955 476 13978 -6240 -25404
16591b5404n991L130J3557k7269j9268K9385M0957N1208J3380r789O908l1052
$$ -25404 -31395 -28265 -14708 -41977 -61245 -31860 9097 60305 73685 63896 70804 39752
16579C9752l1295j645k100j287l4802O592J6634K6430k1780m6167M006K7800N2921
$$ 39752 8457 6812 4712 3425 -31377 -24785 -8151 18279 -3501 -49668 -45662 -17862 35059
16566C5059n6826k7865K4512L3595J8311j8487lk0426n120j8725m506K9154k5514
$$ 35059 -21767 -49632 -25120 8475 26786 8299 8296 -12130 -17250 -35975 -40481 -11327 -36841
16553c6841j3514q030j6364L810J5485Q752L8461P067k5416N7498M786K32M122
$$ -36841 -50355 -58385 -74749 -70939 -55454 -46702 -8241 -1174 -26590 30908 35694 35926 40048
16540D0048P9k3833N167j5879k9026J8891m3534J1931L9515J811J2640L6831j7896
$$ 40048 40127 16294 21461 5582 -23444 -4553 -48087 -36156 3359 5170 17810 54641 36745
16527C6745l0036o546l5218j4095j1454K2325J5231q690j2644K7506J1156j9235
$$ 36745 6709 163 -35055 -49150 -60604 -38279 -23048 -31738 -44382 -16876 -5720 -24955
16515b4955L7075j0091l0501j020K714k5937N95K9680L0219k8757p647o821L8517
$$ -24955 12120 2029 -28472 -29492 -26778 -52715 -52120 -22440 7779 -20978 -28625 -35446 3071
16502C071l522k8881n294p677N0513J7398n9878n1646J0641J753M7902O332l9408
$$ 3071 -451 -29332 -34626 -42303 8210 25608 -34270 -85916 -75275 -73522 -25620 -19288 -58696
16489e8696J3059M7205m484j6899j8673Q936m5751k3153L0391Q497O755R773m125
$$ -58696 -45637 1568 -2916 -19815 -38488 -29552 -75303 -98456 -68065 -59568 -52813 -43040 -47165
16476d7165r308J3341o123n321M5192L2674j6351j869j5410j6335K0438j212N698
$$ -47165 -56473 -43132 -49255 -54576 -9384 23290 6939 5070 -10340 -26675 -6237 -7449 -1751
16463a751j702K5185L296j6093K4020k6661p082J3771k0212m9517N890M359L357
$$ -1751 -3453 21732 25028 8935 32955 6294 -788 12983 -7229 -56746 -50856 -46497 -43140
16450d3140M577P11k4178j6414N1548j7293N480r290j038O603n712j1666JJ1135
$$ -43140 -38563 -37852 -62030 -78444 -26896 -44189 -38709 -47999 -49037 -42434 -48146 -59812 -59811 -48676
16436d8676J3990p394L7166R144j232N03j4761k677K2640J6221m9565k2066J7026
$$ -48676 -34686 -42080 -4914 4230 2998 3501 -11260 -13937 8703 24924 -24641 -46707 -29681
16423b9681K0077N4639r615l8090l9333K2721K4622m1306k7278K9802L1432k5027
$$ -29681 -9604 45035 35420 -2670 -42003 -19282 5340 -35966 -63244 -33442 -2010 -27037
16411b7037k8727K4027k0846o0818K5724L8289L2434o893M1086M3562J9762q029
$$ -27037 -55764 -31737 -52583 -113401 -87677 -49388 -16954 -23847 17239 60801 80563 72534
16399G2534l8989k5400R59k776n3324P12j6011n597N3831k3847k6924J4427k0496
$$ 72534 33545 8145 9104 6328 -46996 -46284 -62295 -67892 -14061 -37908 -64832 -50405 -70901
16386g0901j1047J1867k8741K931J6471N6214M3659K879j6661k7999O957K884
$$ -70901 -81948 -70081 -98822 -95891 -79420 -23206 20453 23332 6671 -21328 -14371 -11487
16374a1487R410O290K0565j8687m5938k2050M431M1352J9959R759j7177J2667
$$ -11487 -2077 4213 24778 6091 -39847 -61897 -57466 -16114 3845 13604 -3573 9094
16362I094P829m5482m8354m8527M9528N9486m4094q193L7978J9082j0541l008
$$ 9094 16923 -28559 -76913 -125440 -75912 -16426 -60520 -68713 -30735 -11653 -22194 -25202
16350b5202J4269j1342j4214k1287J2003p072m6072K6388N8818k968J5878J741
$$ -25202 -10933 -22275 -36489 -57776 -45773 -52845 -98917 -72529 -13711 -16679 -801 940
16338I40m5261j4783p743K2498J7248j1036L559M2386J1369L506K087J6544j7734
$$ 940 -44321 -59104 -66847 -44349 -27101 -38137 -34578 7808 19177 22683 24770 41314 23580
16325B3580k3259K7815J0903k3111l844J7997K324j0801O629J8429M1331k0326
$$ 23580 321 28136 39039 15928 12084 30081 32405 21604 28233 46662 87993 67667
16313F7667m4161k5123j3399J8434J5034P261n574j7536K204K1189J3325j6499
$$ 67667 23506 -1617 -15016 3418 18452 25713 20139 2603 4807 25996 39321 22822
16301B2822l1633J984n056J8431O6523J6421k2772l7485k3702j7439j0589L7794
$$ 22822 -8811 -6827 -11883 6548 73071 89492 66720 29235 5533 -11906 -22495 15299
16289A5299n106k7708o128M3282J0103j5700n610n3313M547O889M0270Q099R416
$$ 15299 10193 -17515 -23643 19639 29742 14042 8432 -44881 -40334 -33445 6825 14924 24340
16276B4340j4694m0069j9757J7222l276j2952K3992M8445j2608K037O444k4651
$$ 24340 9646 -30423 -50180 -32958 -36234 -49186 -25194 23251 10643 12680 19124 -5527
16264e527Q902J4758k1020n594K3313J0906J6970O267o733M76j8222n8763k7257
$$ -5527 3375 18133 -2887 -8481 14832 25738 42708 48975 42242 42718 24496 -34267 -61524
16251f1524L073N021l014K9654Q088K8243J0868k2042K180L0431n009l2473m3350
$$ -61524 -58451 -53430 -56444 -26790 -18702 9541 20409 -1633 547 30978 25969 -6504 -49854
16238d9854r8O5437l4546j5092k3193J8044L8736M4087L445J0347J2348Q445j6803
$$ -49854 -49952 15485 -19061 -34153 -57346 -39302 -566 43521 46966 57313 69661 78106 61303
16225F1303l0621k359J6147m6028L490K6677M1120k4335k4019Q446l3662o4455
$$ 61303 30682 28323 44470 -1558 1932 28609 69729 45394 21375 29821 -3841 -68296
16213f8296m8936L8927O9085j3691j6185N3217J4352l7923l2189K195J2174K5037
$$ -68296 -117232 -78305 -9220 -22911 -39096 14121 28473 -9450 -41639 -39444 -27270 -2233
16201b233K2215R914j8158k7796j020L1216J24l9777m78M2992K5576k8093l3019
$$ -2233 19982 29896 11738 -16058 -17078 14138 14262 -25515 -25993 16999 42575 14482 -18537
16188a8537K9479J8641K7788k4826j8035J6429q528J5524j5418l2696J7378J1520
$$ -18537 10942 29583 57371 32545 14510 30939 22411 37935 22517 -10179 7199 18719
16176A8719k5732n439J1516R072o583k3162J6510O916m1000K347L2969L4587M264
$$ 18719 -7013 -12452 -936 8136 1553 -21609 -5099 1817 -39183 -36836 -3867 30720 34984
16163C4984k4861j9488k9807J5037j3717k1602j0252j008L1767L620n0857l6809
$$ 34984 10123 -9365 -39172 -24135 -37852 -59454 -69706 -70714 -38947 -35327 -86184 -122993
16151a22993L1532O7262j2797N0161M067o3241N215M7526R014O996j4365k6682
$$ -122993 -91461 -24199 -36996 13165 17232 -46009 -40794 6732 15746 22742 8377 -18305
16139a8305j9933j6949L7377K9463k3495k0736r754K3400K0112k7672o4456L2586
$$ -18305 -38238 -55187 -17810 11653 -11842 -32578 -42332 -18932 1180 -26492 -90948 -58362
16127e8362M5583O7792j9242j4988l4801j6260K5923K8877M7366k2709k431J7773
$$ -58362 -12779 55013 35771 20783 -14018 -30278 -4355 24522 71888 49179 46748 64521
16115F4521J2583j5723o8162j3379r169J074O527J076L5216L2735k5618M2982
$$ 64521 77104 61381 -6781 -20160 -29329 -28255 -21728 -20652 14564 47299 21681 64663
16103F4663k686l1554j5593L8944j4466m1882k7089L9785K0670o506j5953M0595
$$ 64663 61977 30423 14830 53774 39308 -2574 -29663 10122 30792 24286 8333 48928
16091D8928l5561n648R651Q92N685M872m668l7768k4036M3730Q027R482j8773
$$ 48928 13367 7719 17370 18262 23947 28819 24151 -13617 -37653 6077 14104 23586 4813
16078D813r677J840n1512L0888K5641j0504N895j2229J4299l217j4093K3203p294
$$ 4813 -4864 -3024 -54536 -23648 1993 -8511 -2616 -14845 -546 -3763 -17856 5347 -1947
16065a947k122K833J0411l672M385j8872J7695L0281q006j8947O814J0958J9885
$$ -1947 -4069 -1236 9175 5503 9888 -8984 8711 38992 30986 12039 18853 29811 49696
16052D9696O548p439k0960O536o442l884l0186n2788J1474K4085k3754P394N37
$$ 49696 56244 48805 27845 34381 27939 24055 -6131 -58919 -47445 -23360 -47114 -39720 -39183
16039c9183p683j5863N005K3269J6869M9323L4975j6355l6950j7998R555j5837
$$ -39183 -46866 -62729 -57724 -34455 -17586 31737 66712 50357 13407 -4591 4964 -10873
16027a0873R415k088p293l828K6917P679j1988K3684O8859O936J3066k7756j493
$$ -10873 -1458 -3546 -10839 -14667 12250 19929 7941 31625 100484 107420 120486 92730 91237
16014I1237j2909K8829k0784l9703o122k8019m2108K088K0564p745l1524l1609
$$ 91237 78328 107157 86373 46670 40548 12529 -29579 -27491 -6927 -14672 -46196 -77805
16002g7805R786K503J5436M8056J8620l5303N585P392k4140k1459O710K5772K6018
$$ -77805 -68019 -65516 -50080 -2024 16596 -18707 -13122 -5730 -29870 -51329 -44619 -18847 7171
15989G171l0340l7591r438j376O2308M7762k9645Q026m1975J2005J615P517L0973
$$ 7171 -23169 -60760 -70198 -71574 -9266 38496 8851 16877 -25098 -13093 -11478 -3961 27012
15976B7012J8864J747J139J3775M23K7318J0732p557m9493l9591k9238Q229J0979
$$ 27012 45876 47623 48762 62537 62960 90278 101010 93453 43960 4369 -24869 -16640 -5661
15963e661L2951k2634j4033l051j1277J5603k2637K7164J1959K3885k4349P56
$$ -5661 27290 4656 -9377 -12428 -23705 -8102 -30739 -3575 8384 32269 7920 8676
15951H676L1668k0139K689j350l93o033O093l0146j0804N2275L498k7833L676
$$ 8676 40344 20205 22894 21544 21151 15118 21211 -8935 -19739 32536 36034 8201 11877
15938A1877K0250o3459m1266P816M9094p423j7761L1693M1408K93n8734J4649
$$ 11877 32127 -31332 -72598 -64782 -15688 -23111 -40872 -9179 32229 32522 -26212 -11563
15926a1563K975j8063K417n93l9049l2028K8650K4314j0381J4308N1744N2009
$$ -11563 -8588 -26651 -24234 -24827 -63876 -95904 -67254 -42940 -53321 -39013 12731 64740
15914F4740m694q803r529Q946o440j5873L2844K1295m694o3829m1575J4682R595
$$ 64740 60046 51243 41714 50660 44220 28347 61191 82486 77792 13963 -27612 -12930 -3335
15901c335K5926K1867l0104J5179k2069m3276J2637K5284j8227k6084K3997L5114
$$ -3335 22591 44458 14354 29533 7464 -35812 -23175 2109 -16118 -42202 -18205 16909
15889A6909j2938J2772J4869k6509k946J4755M346k8408N053j0790r84K4231Q16
$$ 16909 3971 16743 31612 5103 2157 16912 21258 -7150 -2097 -12887 -13871 10360 11176
15876A1176Q515K805j8468k3598J9875k625L0386J9210j2303K5764M0595n628
$$ 11176 19691 22496 4028 -19570 305 -2320 28066 47276 34973 60737 101332 95704
15864I5704q3300l0141L5366O9387M4035l7848m9170k4350n976m2955J9479O2770
$$ 95704 12404 -17737 17629 87016 131051 93203 44033 19683 13707 -29248 -9769 53001
15852E3001p944k6302k8384o097K942n252Q818N5614R005J4722j072j1502R654
$$ 53001 45057 18755 -9629 -15726 -12784 -18036 -9218 46396 55401 70123 69051 57549 67203
15839F7203j3686o3778n3315J2398K7975M8N760J4414j013k3069k2340L8389L8528
$$ 67203 53517 -10261 -63576 -51178 -23203 -23155 -17395 -2981 -3994 -27063 -49403 -11014 27514
15826B7514m439j3730l3510M892M8191M7514k3799q9735l4470L4361N6158J328
$$ 27514 23075 9345 -24165 -19273 28918 76432 52633 -37102 -71572 -37211 18947 20275
15814B0275l1166k0384L5420j9213P355o035q797J406Q319J9308l299K242L4885
$$ 20275 -10891 -31275 4145 -15068 -7713 -13748 -22545 -21139 -12820 6488 3189 5431 40316
15801D0316j4955k9270l0131l9493J0905L0233j3799L790k3257m1475M2488O705
$$ 40316 25361 -3909 -34040 -73533 -62628 -32395 -46194 -42404 -65661 -107136 -64648 -57943
15789e7943O7369N2731K515k5135l1284Q659R675l192J9702K4441l204m1566l9996
$$ -57943 9426 62157 64672 39537 8253 16912 26587 23395 43097 67538 64334 22768 -17228
15776a7228q012M1558L1700j2252K3351k026j4002k9769j3852n237l033J4167
$$ -17228 -25240 16318 48018 35766 59117 57091 43089 13320 -532 -5769 -8802 5365
15764E365l2939m042j2897J6427M2253o892k7919k8256k9344M4755J1474J3251
$$ 5365 -27574 -31616 -44513 -28086 14167 7275 -20644 -48900 -78244 -33489 -22015 -8764
15752h764M1252J4383m0232l3072j3582j3688p104P720o916J7253k6427K6474
$$ -8764 32488 46871 6639 -26433 -40015 -53703 -60807 -53087 -60003 -42750 -69177 -42703
15740d2703k192L6186L302j6444j8932K2188l207N2325P216N424j8138k969l3113
$$ -42703 -44895 -8709 -5407 -21851 -40783 -18595 -21802 30523 37739 43163 25025 22056 -11057
15727a1057l4637M9999J6757L5656k1322j1018R11j4656j0539J6190Q378j4204
$$ -11057 -45694 4305 21062 56718 35396 24378 25289 10633 94 16284 24662 10458
15715A0458k1652m4292k9021N2130K6226m153r626L8386J6797j0481o914j6551
$$ 10458 -11194 -55486 -84507 -32377 -6151 -10304 -19930 18456 35253 24772 17858 1307
15703A307n348r169Q111N1259M2205m0372n2966K1079J3599n1030l2233r539J9224
$$ 1307 -4041 -13210 -5099 46160 88365 47993 -4973 16106 29705 -21325 -53558 -63097 -43873
15690d3873k686k077L9925L7477J6641l7432l5023K848K2658J7694m3795N4528
$$ -43873 -46559 -48636 -8711 28766 45407 7975 -27048 -24200 -1542 16152 -27643 26885
15678B6885K1637k0694m9683J4351K4174j2025n297k6111j0839k9359L0469J1946
$$ 26885 48522 27828 -21855 -7504 16670 4645 -652 -26763 -37602 -66961 -36492 -24546
15666b4546j4140l4214J5984L12N208J5087L2088J3401L866J6117j7091L478k2109
$$ -24546 -38686 -72900 -56916 -56604 -51396 -36309 -4221 9180 13046 29163 12072 15550 -6559
15653f559m4078m2096k1110N5295P9601J9319k8479L4908L0806j7165n0982j5260
$$ -6559 -50637 -92733 -113843 -58548 21053 40372 11893 46801 77607 60442 9460 -5800
15641e800K4098L6863p037k3912m749J2548n1226J1111N3366J9402j2740l9082
$$ -5800 18298 55161 48124 24212 19463 32011 -19215 -8104 45262 64664 51924 12842
15629A2842K1794J0130l759k5264l2005q671L7198l070J6301N3458M565k3878
$$ 12842 34636 44766 41007 15743 -16262 -24933 12265 9195 25496 78954 83519 59641
15617E9641m6621j2034K9986j6493o515m2066n284L3478L0548q959k7922m0432
$$ 59641 13020 986 30972 14479 7964 -34102 -39386 -5908 24640 15681 -12241 -52673
15605e2673j2124J9362N9462M4338J3147j7007j4617Q194R16m4549j8141K2192
$$ -52673 -64797 -45435 14027 58365 71512 54505 39888 48082 48998 4449 -13692 8500
15593H500K830j2728Q54o640K1157J9427j7848j4972j9130Q315L079N297m12J731
$$ 8500 11330 -1398 -544 -7184 13973 33400 15552 580 -18550 -10235 -7156 -1859 -2271 -540
15579e40N921k7845p347L7237J8454j4514J357j6344K9464K3473n919l8069j372
$$ -540 5381 -22464 -29811 7426 25880 11366 12723 -3621 25843 49316 43397 5328 3956
15566C956O330J4035p523l559o333O1966L8206p4137j7724M522j6141J7000j3397
$$ 3956 10286 24321 16798 13239 6906 68872 107078 32941 15217 19739 3598 20598 7201
15553G201m0831J106q594l0570J9864J4994L927j6327m896p422R27j2482P178
$$ 7201 -33630 -32524 -41118 -71688 -51824 -36830 -32903 -49230 -54126 -61548 -60621 -73103 -65925
15540f5925J5059L381K5698J0978J3046l997j3951Q027K1227j9804n440J9093
$$ -65925 -50866 -47485 -21787 -10809 2237 -1760 -15711 -7684 13543 -6261 -11701 7392
15528G392K7202l3323K6274Q749l8641j6494k0141j8313j1314J863N93J6123L7530
$$ 7392 34594 1271 27545 36294 -2347 -18841 -38982 -57295 -68609 -66746 -66153 -50030 -12500
15515a2500R155K8925L4470R724o3529n4913n409k7875r55K0963O8272N397k3989
$$ -12500 -3345 25580 60050 69774 6245 -48668 -54077 -81952 -82907 -61944 6328 11725 -12264
15502a2264k6490N912L9162M6906l3249m5101o346n750J7001M6440k8943P342
$$ -12264 -38754 -32842 6320 53226 19977 -25124 -31470 -37220 -20219 26221 -2722 4620
15490D620K2244L2485J2740q1529n237J4202j7623j7068K3738K1463j0894p091
$$ 4620 26864 59349 72089 -9440 -14677 -475 -18098 -35166 -11428 10035 -859 -7950
15478g950n66K7411J011J0591n569m0805l1469k9946k4962K2848r476R665J4507
$$ -7950 -8516 18895 19906 30497 24928 -15877 -47346 -77292 -102254 -79406 -88882 -79217 -64710
15465f4710o649o7308P196J7255P3078J1612J3637m3908l7414Q6437R8204M8932
$$ -64710 -71359 -138667 -131471 -114216 -41138 -29526 -15889 -59797 -97211 -10774 87430 136362
15453A36362o811l9043k3851n0996m346J3275j0137l4405q89P878p26O3689L272
$$ 136362 129551 90508 66657 15661 11315 24590 14453 -19952 -20841 -12963 -13689 50000 53272
15440E3272n109L501j9683J2221k8186k8423O1334P498m8880p10j2559J84M8640
$$ 53272 48163 51664 31981 44202 16016 -12407 48927 56425 7545 6835 -5724 -5540 43100
15427D3100k29j8814j5394k2580M477K1019o848l4920k7543J9778M8138N5320
$$ 43100 42871 24057 8663 -13917 -9440 11579 4731 -30189 -57732 -37954 10184 65504
15415F5504K3086p923l6462m3912j0503j8789l5648L3891K9551k549j3684O941
$$ 65504 88590 80667 44205 293 -10210 -28999 -64647 -30756 -1205 -3754 -17438 -10497
15403a0497K8922J598J3471J1397R0m147j3075j8770j439k204j3230K9914j8881
$$ -10497 18425 20023 33494 44891 44981 40834 27759 8989 7550 5346 -7884 22030 3149
15390C149J5293O882J5022m3854k9404m289L3620P786L1632r759m9020k3160N5452
$$ 3149 18442 25324 40346 -3508 -32912 -37201 -3581 4205 35837 26078 -22942 -46102 9350
15377I350R107k0649m1820J2016n408q45P4422L0456k7541k6396M214k0376k5070
$$ 9350 18457 -2192 -44012 -31996 -37404 -38249 36173 66629 39088 12692 16906 -3470 -28540
15364b8540m73J0883K5149L4715m115m3990j2635p123K1268q890P692N04J4143
$$ -28540 -29013 -18130 7019 41734 37619 -6371 -19006 -26129 -4861 -13751 -6059 -5555 8588
15351H588k1790k1024J848L458K6774l6113K0623k1350L3491K3490l5856j1145
$$ 8588 -13202 -34226 -32378 -28920 -2146 -38259 -17636 -38986 -5495 17995 -17861 -29006
15339b9006K43J7329L9399j5258l8700l2652q184N624M0637K1525L3737k398M997
$$ -29006 -28763 -11434 27965 12707 -25993 -58645 -66829 -61205 -20568 957 34694 32296 37293
15326C7293M28k7380l7530j2500N9077K3775P993L078J0896j8154m1167l5123
$$ 37293 37721 10341 -27189 -39689 19388 43163 51156 54234 65130 46976 5809 -29314
15314b9314j4091j3105M328j6153J0283J359j7571m1120K7465P1412M5784j3638
$$ -29314 -43405 -56510 -52182 -68335 -58052 -56693 -74264 -115384 -87919 -16507 29277 15639
15302A5639j5439m4698N851J2283Q191n139j7505J3561K2644k4909J9K022K893
$$ 15639 200 -44498 -38647 -26364 -18173 -23312 -40817 -27256 -4612 -29521 -29502 -27480 -24587
15289b4587l5359j5765J7850K6361Q153Q608J565q165j8553q716J5719J3166K6392
$$ -24587 -59946 -75711 -57861 -31500 -23347 -14739 -13174 -21339 -39892 -48608 -32889 -19723 6669
15276F669K808J490j0185j0299j9818M5224J3947n3935j7254L8368N3768p443
$$ 6669 9477 10967 782 -9517 -29335 15889 29836 -24099 -41353 -2985 50783 43340
15264D3340m2230j8778r271L3928L768j7913l3648J6208k264J7544L6856q201
$$ 43340 1110 -17668 -26939 6989 10757 -7156 -40804 -24596 -26860 -9316 27540 19339
15252A9339k1307j3753q379J9402K2563j8015q467K4710l1800K978K2275K4274
$$ 19339 -1968 -15721 -24100 -4698 17865 -150 -8617 16093 -15707 -12729 9546 33820
15240C3820j2435N121k1396k5384o128L8615r208l0052k702J6806M868j2605J7682
$$ 33820 21385 26506 5110 -20274 -26402 12213 3005 -27047 -29749 -12943 -8075 -20680 -2998
15227b998r00J1305J5558L2031N342j236m638n5279n963o484m4068l215M693j4724
$$ -2998 -3898 7407 22965 54996 60338 59102 54464 -815 -6778 -13262 -57330 -60545 -55852 -70576
15213g0576R875K2884k3482L238J2581L908p513K8759L1267n46m3550j8352J3925
$$ -70576 -60701 -37817 -61299 -58061 -45480 -41572 -49085 -20326 10941 10395 -33155 -51507 -37582
15200c7582N5488J8327j1245l27j5785k8170K957q618M1402m815k2544L761j5323
$$ -37582 17906 36233 24988 24661 8876 -19294 -16337 -24955 16447 11632 -10912 -7151 -22474
15187b2474J2359J586j5524k7258L0169O5884J7949n283n4333k6267k191k2903
$$ -22474 -10115 -8529 -24053 -51311 -21142 44742 62691 57408 3075 -23192 -25383 -48286
15175d8286k6949Q420J3285j0396O5057L0518m7018l5219L5853J8680k8152m865
$$ -48286 -75235 -66815 -53530 -63926 1131 31649 -15369 -50588 -14735 3945 -24207 -29072
15163b9072J1006J2447N0866k5048m1347L1801j6106m587K1616J7453J0655k1736
$$ -29072 -18066 -5619 45247 20199 -21148 10653 -5453 -10040 11576 29029 39684 17948
15151A7948m2967j5848M1024N2634j7334n005K7544J8970m5732n891j6900l5161
$$ 17948 -25019 -40867 157 52791 35457 30452 57996 76966 31234 25343 8443 -26718
15139b6718J0646K4177P580R722j5814L913j23r462k2547M5595o507k1390J0160
$$ -26718 -16072 8105 15685 25407 9593 13506 13383 3921 -18626 26969 20462 -928 9232
15126I232j6618j57n02j4187l4785O027L8803R835L345K8923q299r661j7228n9163
$$ 9232 -7386 -7543 -8045 -22232 -57017 -50990 -12187 -2352 993 29916 21617 11956 -5272 -64435
15112f4435J9242L6498J2244n156m2898k6010K0314L2615l2424p249N3611O8L58
$$ -64435 -45193 -8695 3549 -1607 -44505 -70515 -50201 -17586 -50010 -57259 -3648 -3580 -3222
15099c222K1104R024K197L4212l353k5634n2226k5530J1984N564o538N109M1463
$$ -3222 17882 26906 29103 63315 59962 34328 -17898 -43428 -31444 -25880 -32418 -27309 14154
15086A4154P572l029k2347R815R5138J9539l4384j6360k5457j7063m2655m723
$$ 14154 21726 18697 -3650 6165 101303 120842 86458 70098 44641 27578 -15077 -19800
15074a9800j9258n9379q362K6694L9106J8230M1181m475r89n5062J516L5155j421
$$ -19800 -39058 -98437 -106799 -80105 -40999 -22769 18412 13937 12948 -42114 -40598 -5443 -6864
15061f864J2059j7958K54K1569l758j1509j7339k0175J2150J2612j176J5634L9712
$$ -6864 5195 -12763 -12509 9060 5302 -6207 -23546 -43721 -31571 -18959 -20135 -4501 35211
15048C5211k496o6050m838l278q938K2441O0106P888j0799j7777J5923n7328j9321
$$ 35211 32715 -33335 -38173 -41451 -50389 -27948 32158 40046 29247 11470 27393 -29935 -49256
15035d9256K5873M6001K1422M678J8473P433K8250k1700k4295n7039j6855M7239
$$ -49256 -23383 22618 44040 48718 67191 74624 102874 81174 56879 -160 -17015 30224
15023C0224M4985n5338j7301n649L1181Q477J3722k5349n461R826L8489J0206
$$ 30224 75209 19871 2570 -3079 28102 36579 50301 24952 19491 29317 67806 78012
15011G8012L97n151m7606l812j9303q639J8658L0667R777r300k685l2565R457
$$ 78012 78409 73258 25652 21840 2537 -6102 12556 43223 53000 43700 41015 8450 17907
14998A7907J8533m3280j7262j442L4957M7968L0989q450k0251j2770j6550l663
$$ 17907 36440 -6840 -24102 -25544 9413 57381 88370 79920 59669 46899 30349 26686
14986B6686j6994m2600j2266L2468J0916j8792J004q342J6898L5237j9587K485
$$ 26686 9692 -32908 -45174 -12706 -1790 -20582 -19578 -27920 -11022 24215 4628 7113
14974G113j4949l4511K5597m89k1961k4816M3784K9600K2758q206j484j0389q91
$$ 7113 -7836 -42347 -16750 -17239 -39200 -64016 -20232 9368 32126 23920 22436 12047 11156
14961A1156K0203k9079K2431m879L046j5582L3220N0019j3631J1355k8072m6572
$$ 11156 31359 2280 24711 19832 22878 7296 40516 90535 76904 88259 60187 13615
14949A3615k7968K111P0335K4474j3817k8755J645j2582j5534K7394J8803j8684
$$ 13615 -14353 -12242 58093 82567 68750 39995 41640 29058 13524 40918 59721 41037
14937D1037n887K748M6787k5084p3306m5663O14l330J2242j5623k0630J0286O562
$$ 41037 35150 37898 84685 59601 -13705 -59368 -58754 -62084 -49842 -65465 -86095 -75809 -69247
14924f9247M3392R452l7551l7304M5905N3355j6470k8700M1203N051k273j641
$$ -69247 -25855 -16403 -53954 -91258 -45353 8002 -8468 -37168 4035 9086 6813 5172
14912E172k2361J6554R29J5210Q304m446k3980R164P82l145J1403K0951j997M340
$$ 5172 -17189 -635 294 15504 23808 19362 -4618 4546 5328 2183 13586 34537 32540 36880
14898C6880J1507J2934m0699r356k3380K9768K3978l303j790K3363J8446p5509
$$ 36880 48387 61321 20622 11266 -12114 17654 41632 38329 36539 59902 78348 2839
14886B839k417M3490j2138m5125j3276Q731L0206k500n260k154K6384J7647m885
$$ 2839 422 43912 31774 -13351 -26627 -17896 12310 9810 4550 2396 28780 46427 41542
14873D1542k6564j9437j1789j7432k4079K6253L2714J9400l1915j0173L1703m2907
$$ 41542 14978 -4459 -16248 -33680 -57759 -31506 1208 20608 -11307 -21480 10223 -32684
14861c2684k1606O3208N1036K4520m4133j1955L2789O123J7321L4426j3790n5622
$$ -32684 -54290 8918 59954 84474 40341 28386 61175 67298 84619 119045 105255 49633
14849D9633k5753M481L7867k7977o1263J1426J3403J4149L792J0219r7k4712J6746
$$ 49633 23880 28361 66228 38251 -23012 -11586 1817 15966 19758 29977 29880 5168 21914
14836B1914J3102l8962m711L3998K3431k8954k3233q459J954K4228N375k2493
$$ 21914 35016 -3946 -8657 25341 48772 19818 -3415 -11874 -9920 14308 19683 -2810
14824b810L1920J8770m1442J4404J9008J5686k3448k5812J0745J969q422N2382
$$ -2810 29110 47880 6438 20842 39850 55536 32088 6276 17021 18990 10568 62950
14812F2950J5508m346K0089m3045k8291j3639n286R947M2839k251j8250l5365
$$ 62950 78458 74112 94201 51156 22865 9226 3940 13887 56726 54475 36225 860
14800H60J1349r472j5062L0553L2140j6054R173p11m7827K7503K1794k6636m3809
$$ 860 12209 2737 -12325 18228 50368 34314 43487 42776 -5051 22452 44246 17610 -26199
14787b6199K0628N111j646j0027l2372l4339L9326M5009K4101l252k2674M554
$$ -26199 -5571 -460 -2106 -12133 -44505 -78844 -39518 5491 29592 26340 3666 8220
14775H220j672k3518N3388L4841k4868k1917k5105l3874p735l012o244L7640N0545
$$ 8220 6548 -16970 36418 71259 46391 24474 -631 -34505 -42240 -45252 -51496 -13856 36689
14762C6689k818l1219j7761K9833j785n584K1347j5060l6183m198l167J7574M1711
$$ 36689 33871 2652 -15109 14724 12939 7355 28702 13642 -22541 -26739 -29906 -12332 29379
14749B9379l899o1586j586Q394k9198J596l901J8681r718R522J844Q713L1034
$$ 29379 25480 -36106 -37692 -29298 -58496 -56900 -60801 -42120 -51838 -42316 -40472 -31759 -725
14736g25j6461j4291J7901M1102L4279l6766K7043M0332k6540j2348R507j0282
$$ -725 -17186 -31477 -13576 27526 61805 25039 52082 92414 65874 53526 63033 52751
14724E2751k8014l3601j0555k3484m707j27L6896L821k3541j1131j392M0741Q209
$$ 52751 24737 -8864 -19419 -42903 -47610 -47737 -10841 -7020 -30561 -41692 -43084 -2343 5866
14711E866L739o37N078P803n2944l7702J2954L0020L6724m813k3735n654J5045
$$ 5866 9605 8968 14046 21849 -31095 -68797 -55843 -25823 10901 6088 -17647 -23301 -8256
14698h256J4029k48Q598J4620J7675r719k9144j3826K6245j4613j2794J4657r325
$$ -8256 5773 5525 14123 28743 46418 36699 7555 -6271 19974 5361 -7433 7224 -2101
14685b101m528K4561O0135o595p2751m4575R983l2627J3528P933J959M982j6977
$$ -2101 -6629 17932 78067 71472 -1279 -45854 -35871 -68498 -54970 -47037 -45078 -40096 -57073
14672e7073L7782Q1742J7057o3881p8490L777L2532k796M4947K0838j3968J5809
$$ -57073 -19291 62451 79508 15627 -62863 -59086 -26554 -29350 15597 36435 22467 38276
14660C8276n112j2045K1885J9487m6792m3842J7380M5779K824K2727R402l5298
$$ 38276 33164 21119 43004 62491 15699 -28143 -10763 35016 37840 60567 69969 34671
14648C4671j782M8624K0317k9365l9710n8254l2504L1319P101J2633k029j3299
$$ 34671 32889 81513 101830 72465 32755 -25499 -58003 -26684 -19583 -6950 -8979 -22278
14636b2278J9595K6039l2656j1743K7885J9559m277J5625L090j0051o233p706
$$ -22278 -2683 23356 -9300 -21043 6842 26401 22124 37749 40839 30788 24555 16849
14624A6849l0823j0572O854N8831O075K519r444k8755Q97J401l562N9737J3679
$$ 16849 -13974 -24546 -17692 41139 47214 49733 40289 11534 12431 13832 10270 70007 83686
14611H3686j3574L854l6590L458J7319l1154l1438K8224L0502q091L8026O4463
$$ 83686 70112 73966 37376 40834 58153 26999 -4439 23785 54287 46196 84222 148685
14599A48685J7266M0433P0424N2630l087k4489l9125n1095j7307p253j1291j0454
$$ 148685 165951 206384 276808 329438 326351 301862 262737 211642 194335 187082 175791 165337
14587A65337k0271l2549p1434j7405K1091M537j5628k947L1556J9548K562k0012
$$ 165337 145066 112517 41083 23678 44769 49306 33678 30731 62287 81835 84397 64385
14575F4385l5776l4364K3637L6892J2267m604m9308J3479J8541m723j5786m5348
$$ 64385 28609 -5755 17882 54774 67041 62437 13129 26608 45149 40426 24640 -20708
14563b0708j7705j7585K8550J1293O8428J9148k4291j6739K4456J4981n867k0546
$$ -20708 -38413 -55998 -27448 -16155 52273 71421 47130 30391 54847 69828 63961 43415
14551D3415J5546L0942k7768K770K0803p913k7973J6418J0482l8415m881k908
$$ 43415 58961 89903 62135 64905 85708 77795 49822 66240 76722 38307 33426 30518
14539C0518j2657k2498p283k8178j5779n711K4965l41R302L4759L2657K6577L9008
$$ 30518 17861 -4637 -11920 -40098 -55877 -61588 -36623 -36964 -27662 7097 39754 66331 105339
14526A05339L597k8936l2013k8885K87M0178N9004M2649K5991r078K5686J31340
$$ 105339 108936 80000 47987 19102 19389 59567 118571 161220 187211 178133 203819 335159
14514C35159J21993R5507J34055J65252J52749L3274p8918l9579m7303r1016r5027
$$ 335159 457152 552659 686714 851966 1004715 1037989 959071 919492 872189 781173 686146
14503F86146r8484j29801j07034k8389n1853j4107P417L4831m6312p8479m0682
$$ 686146 587662 457861 350827 322438 270585 256478 263895 298726 252414 173935 133253
14492A33253K9995p595m509J0043k6028k5736R854N293K2715K4856q995l5929
$$ 133253 163248 155653 151144 161187 135159 109423 119277 124570 147285 172141 163146 127217
14480A27217k7128q151m512M2709N633k9473K5172j54l6767j7466l8501J9001
$$ 127217 100089 91938 87426 130135 135768 106295 131467 131313 94546 77080 38579 57580
14468E7580N5435k4679l3116j3197j6741J4846P9966M6599L3170n9803J4888M680
$$ 57580 113015 88336 55220 42023 25282 40128 120094 166693 199863 140060 154948 159628
14456A59628m9431p299L8971M2399M6735o123l6504j0944K9191p504L0146J1431
$$ 159628 110197 102898 141869 184268 231003 224880 188376 177432 206623 199119 229265 240696
14444B40696K6542J8655K2073P6379P1084J12253J42471K27296L40076M20010
$$ 240696 267238 285893 307966 384345 455429 567682 710153 937449 1277525 1697535
14434A697535M36175M47993N27391L91085J23294k7921K7917j93139m37724m59029
$$ 1697535 2133710 2581703 3109094 3500179 3623473 3595552 3623469 3430330 2992606 2533577
14424B533577l18660l68272l82717k65386j59838j10999r4663q6840o1170o3956
$$ 2533577 2214917 1846645 1463928 1198542 1038704 927705 833042 746202 685032 621076
14414F21076j2809n9978l7788R880k0958k6004N284k0364p7264k5336j1368m53
$$ 621076 608267 548289 510501 520381 499423 473419 478703 458339 381075 355739 344371 343918
14402C43918j7967k7885n004M8086k779q95J9822M127l831j090J9171Q019K5764
$$ 343918 325951 298066 293062 341148 338369 337474 357296 361423 357592 356502 375673 383692 409456
14389D09456O4181K8343J8378j2585K74M133Q2569O7243N9223J30162K11225L18597
$$ 409456 473637 501980 520358 507773 508047 512180 594749 661992 721215 851377 1062602 1381199
14377A381199M56491M23885L88583M99456M90572K64929j6371o7673k33291m49508
$$ 1381199 1837690 2261575 2650158 3149614 3640186 3905115 3888744 3821071 3587780 3138272
14367C138272m34253l53877m13451l92458l01701j68850j09376r2379o6623l1777
$$ 3138272 2704019 2350142 1936691 1544233 1242532 1073682 964306 871927 805304 773527
14357G73527p5704o3076k7577j0107l7020k2540K3447j6633m5463j9837m2209
$$ 773527 697823 634747 607170 597063 560043 537503 560950 544317 498854 479017 436808
14346D36808l8525o4442l2684J843K814L8090K980m5721j9039L9424J3359J3617
$$ 436808 398283 333841 301157 303000 305814 343904 346884 301163 282124 321548 334907 348524
14334C48524J240J5840R84o7967k8976O3Q025m4128k7125j9615j773r582K004
$$ 348524 349764 365604 366588 298621 269645 269708 277733 233605 206480 186865 185092 175510 177514
14321A77514K8724O951P496K8784J4395J1365L849j4352l6952j2595P845L9392
$$ 177514 206238 213189 220685 249469 263864 275229 279078 264726 227774 215179 223024 262416
14309B62416N372L278J1976K5559j8036k3926k3686P8927M9599M9546O6712J41431
$$ 262416 267788 271066 283042 308601 290565 266639 242953 321880 371479 421025 487737 629168
14297F29168Q7357R5954J83890J59489P0603M909N7216j17265k16447j95993r6547
$$ 629168 716525 812479 996369 1155858 1226461 1231370 1288586 1171321 954874 758881 662334
14286F62334j20947r5294k7223o6718n1883j8792K9292Q931m0419k8417l0998
$$ 662334 541387 446093 418870 352152 300269 281477 310769 319700 279281 250864 219866
14275B19866M18j5053L0940n809r673l5350k7542k7675K1790K965j6090k8110
$$ 219866 220284 205231 236171 230362 220689 185339 157797 130122 151912 154877 138787 110677
14263A10677J2629M451j0950k5357L652K2326K3115p485l396O872K5821k569k5925
$$ 110677 123306 127757 116807 91450 95102 117428 140543 133058 129662 136534 162355 159786 133861
14250A33861k349k2158K4003L8258k746k0645N957L357k2400k5883O330J6178
$$ 133861 131512 109354 133357 171615 168869 148224 154181 157538 135138 109255 115585 131763
14238A31763q1K4292J1134m7339k8822J5627O9200J7523o0202l8520L2123K0494
$$ 131763 131682 155974 167108 119769 90947 106574 175774 193297 133095 94575 126698 147192
14226A47192O4892J6397R715N3171K8860L1550M5067P7370J49254J69087K49645
$$ 147192 212084 228481 238196 291367 320227 351777 396844 474214 623468 792555 1042200
14215A042200K90773L24283L13722K86790J19350r895p0681k48244l44806l23663
$$ 1042200 1332973 1657256 1970978 2257768 2377118 2367223 2296542 2048298 1703492 1379829
14205A379829k78881k52670j81702j17044j31j6839n5011P621O906k4529o5091
$$ 1379829 1100948 848278 666576 549532 549401 532562 477551 485172 492078 467549 402458
14194D02458l7869l9368j7758L8737L442q1006n5557n360P237k1335Q473k6561
$$ 402458 364589 325221 307463 346200 349642 268636 213079 207719 214956 193621 202094 175533
14182A75533k4332j2704K3935P19p420J5566l5419M5313M428K842k3401r615J7240
$$ 175533 151201 138497 162432 163151 155731 171297 135878 181191 185619 188461 165060 155445 172685
14169A72685j7368l8654K567l0221K1379M1303J0909K6595q288j1074j7691J0601
$$ 172685 155317 116663 119230 89009 110388 151691 162600 189195 180907 169833 152142 162743
14157A62743L3530K0598j4978P058k026m7391l2248P236j0480L139M228K0189
$$ 162743 196273 216871 201893 208951 206925 159534 127286 134522 124042 127181 131409 151598
14145A51598K9835j789p5476m5989l9491N068M1644N6562J3011j2573j8777K1984
$$ 151598 181433 179644 104168 58179 18688 23756 65400 121962 134973 122400 103623 125607
14133A25607m699j7070k8145j7314L5848l379j6843J2762L4613K0578J9134l5559
$$ 125607 120908 103838 75693 58379 94227 90848 74005 86767 121380 141958 161092 125533
14121A25533r632m0745m9168M3623O0711L4803l9750k4633k9703k7534J771K4312
$$ 125533 115901 75156 25988 69611 130322 165125 125375 100742 71039 43505 45276 69588
14109F9588l3308J0635Q671J2950K8613j6768l2514J8552P365M7585J5236m4740
$$ 69588 36280 46915 55586 68536 97149 80381 47867 66419 73784 121369 136605 91865
14097I1865j9814k5121P842j569m391K0628k8875l2550m040L6355J1093J3919
$$ 91865 72051 46930 54772 53203 48812 69440 40565 8015 3975 40330 51423 65342
14085F5342J2977J1827l8743j4331n243K0560k2061l3210L0792N1066R901N136
$$ 65342 78319 90146 51403 37072 31829 52389 30328 -2882 27910 78976 88877 94013
14073I4013l8660l8534m5241K6019M3602J7920k3835l9975l4098J3528N0122J6149
$$ 94013 55353 16819 -28422 -2403 41199 59119 35284 -4691 -38789 -25261 24861 41010
14061D1010M771K8557j4966m2772Q118J5831p639N7724L627N981l3957J976k3958
$$ 41010 45781 74338 59372 16600 24718 40549 32910 90634 94261 100242 66285 68261 44303
14048D4303l941l7164p688k0527L2583O4394L6828N1231L547o20p87p439k3795
$$ 44303 40362 3198 -4490 -25017 7566 71960 108788 160019 163566 162946 162159 154720 130925
14035A30925m2225K796k462N572m9427O6207J7382k8500l8268J3962k748J8264
$$ 130925 88700 91496 89034 94606 45179 111386 128768 100268 62000 75962 73214 91478
14023I1478J1294P37j5065L7887P045n000k6739o3072k9725J8413K6948K0088
$$ 91478 102772 103509 88444 126331 133376 128376 101637 38565 8840 27253 54201 74289
14011G4289J2426O614O047j0591J9534K299j6287o023J8862J4653J8704N8783
$$ 74289 86715 93329 99376 88785 108319 110618 94331 88308 107170 121823 140527 199310
13999A99310J5403J997K2408m2843K0191K2134N3602P3997K8621J3867R457N4736
$$ 199310 214713 216710 239118 196275 216466 238600 292202 366199 394820 408687 418144 472880
13987D72880N5302l1997o2271k8317n7470o0515j1606j8094l6831n0650L248l7391
$$ 472880 528182 496185 433914 405597 348127 287612 276006 257912 221081 170431 173679 136288
13975A36288k9178j779K2357k5830k0761K4291j1030j7958N0906O381O569k297
$$ 136288 107110 105331 127688 101858 81097 105388 94358 76400 127306 133687 140256 137959
13963A37959J4415K2133j0286o6920m1088Q583K0054J9940K2379j3987k0709j3659
$$ 137959 152374 174507 164221 97301 56213 64796 84850 104790 127169 113182 92473 78814
13951G8814L4769j5255J0465K4602L8321r648l5023k8107p575o0564j2619K2472
$$ 78814 113583 98328 108793 133395 171716 162068 127045 98938 91363 30799 18180 40652
13939D0652K2699P469j2917k3415k7418L543n4150L4992J6774l1925q9498k6146
$$ 40652 63351 70820 57903 34488 7070 10613 -43537 -8545 8229 -23696 -113194 -139340
13927a39340l960k8884J4225M0128L6152N179J22498Q7008M7874N5409J7970J5384
$$ -139340 -143300 -172184 -157959 -117831 -81679 -76500 45998 133006 180880 236289 254259 269643
13915B69643m210L9996M8863n5533l2733J9327M413q048p481J2527R944p093l9676
$$ 269643 265433 305429 354292 298759 266026 285353 289766 281718 274237 286764 296708 289615 249939
13902B49939l684M1098M1190J4660J8217L0019j6495n7315l0239J7987R964k9798
$$ 249939 246255 287353 328543 343203 361420 391439 374944 317629 287390 305377 315341 285543
13890B85543o6958p2118J264r512l5791N912k3161k2159M0084R2264L3965n552
$$ 285543 218585 146467 147731 138219 102428 108340 85179 63020 103104 195368 229333 223781
13878B23781R242J1451J2615l5524K33O331M6488M2428Q505L9907l420J0121K9902
$$ 223781 233023 244474 257089 221565 221798 228129 274617 317045 325550 365457 362037 372158 402060
13865D02060l7262p7780l098q41l6279L7755L5889l2568j04R510m8913k4569o506
$$ 402060 364798 287018 283920 283079 246800 284555 320444 287876 287772 297282 248369 223800 217294
13852B17294L214R177Q952j997N608k1782j062N5376L2839j6081J2819R464P2392
$$ 217294 220508 229685 238637 236640 242248 220466 219404 274780 307619 291538 304357 313821 386213
13839C86213L6873k018K844k5439n7880L7677L6080P138M1147M1043N969J9430
$$ 386213 423086 421068 423912 398473 340593 378270 414350 421488 462635 503678 509647 529077
13827E29077q15K1977M1061M4295m051k8710l368K9525L0159j9507k1223J2449
$$ 529077 528262 550239 591300 635595 631544 602834 599466 628991 659150 639643 618420 630869
13815F30869K2213M2855M0866L4343M5914J28082J38191Q4999Q408M7969j2450
$$ 630869 653082 695937 736803 771146 817060 945142 1083333 1168332 1176740 1224709 1212259
13804A212259k2875o9962q9426q4096j9345j3134p2453l9708J8299R766J9037
$$ 1212259 1189384 1119422 1029996 945900 926555 913421 840968 801260 819559 829325 848362
13793H48362r324j8309M1606N6918L3394K9409K5497J175L744L5406N7638O5951
$$ 848362 839038 820729 862335 919253 952647 982056 1007553 1008728 1012472 1047878 1105516 1171467
13781A171467P2702R1542N5739J8796L4020J08729O6358Q7996J13388J25235J09752
$$ 1171467 1244169 1335711 1391450 1410246 1444266 1552995 1619353 1707349 1820737 1945972 2055724
13770B055724R7317J80350J89110K53497L07335L11876L48077L75216L27272L38654
$$ 2055724 2153041 2333391 2522501 2775998 3083333 3395209 3743286 4118502 4445774 4784428
13760D784428L78302M55707N05511O51872Q48227J110195J376472J661719J876993
$$ 4784428 5162730 5618437 6123948 6775820 7624047 8734242 10110714 11772433 13649426
13751A3649426K171761K210184K166273K503835K857759L311463M632659O868858
$$ 13649426 15821187 18031371 20197644 22701479 25559238 28870701 33503360 40372218
13743D0372218J0453391J6860938K7230495M0909274N4925081O2601629N8671924
$$ 40372218 50825609 67686547 94917042 135826316 190751397 253353026 312024950
13736C12024950O2743472M8766435P288416p545911k0699168n8244101o2441842
$$ 312024950 374768422 423534857 430823273 423277362 402578194 344334093 281892251
13729B81892251m9321691n1711840m1985652k6101574j6061259j0664458p403049
$$ 281892251 232570560 180858720 138873068 112771494 96710235 86045777 78642728
13722G8642728n587107m592546l908003l670978l593747l299429l156426l056778
$$ 78642728 73055621 68463075 64555072 60884094 57290347 53990918 50834492 47777714
13714D7777714k640113k357027k191460j875419j671348j571749j454355j343701
$$ 47777714 45137601 42780574 40589114 38713695 37042347 35470598 34016243 32672542
13706C2672542j339657j251258j106714j058400r92825q73980q23937p83691p24155
$$ 32672542 31332885 30081627 28974913 27916513 26923688 26049708 25225771 24442080 23717925
13697B3717925o51896p14806o54879n95136o00118n59373n64254m54690m55059
$$ 23717925 23066029 22351223 21696344 21101208 20501090 19941717 19377463 18922773 18467714
13688A8467714m60736m29386m35159m15818l96043l97466l79113l66262l35453
$$ 18467714 18006978 17577592 17142433 16726615 16330572 15933106 15553993 15187731 14852278
13679A4852278l53891l76216l21825k47315k79437k85578k62603j73361j50356
$$ 14852278 14498387 14122171 13800346 13553031 13273594 12988016 12725413 12552052 12401696
13670A2401696j48746j64122j22021j55111j79004k10943k41739k24040k27259
$$ 12401696 12252950 12088828 11966807 11811696 11632692 11421749 11180010 10955970 10728711
13661A0728711k78077l07093k94227l08123l03210k86151k25029k49284k48458
$$ 10728711 10450634 10143541 9849314 9541191 9237981 8951830 8726801 8477517 8229059
13652H229059k27313j97455k24043k38558k43822j93279k30676j88410j70444
$$ 8229059 8001746 7804291 7580248 7341690 7097868 6904589 6673913 6485503 6315059
13643F315059j65498j67522j57234j45348j47243j69168j19500j31604j50060
$$ 6315059 6149561 5982039 5824805 5679457 5532214 5363046 5243546 5111942 4961882
13634D961882j50226j37055j58114j36093r9773m5417j03990j49471j17173j09884
$$ 4961882 4811656 4674601 4516487 4380394 4280621 4235204 4131214 3981743 3864570 3754686
13624C754686r5941j41963p4841k0217l2534j07292j24718o2135j8533k4219j7159
$$ 3754686 3658745 3516782 3441941 3421724 3389190 3281898 3157180 3095045 3076512 3052293 3035134
13613C035134P777L8303j2982l9368k7215m5211q4941q7569j9204o2267j55979
$$ 3035134 3042911 3081214 3068232 3028864 3001649 2956438 2871497 2783928 2764724 2702457 2546478
13602B546478j21859r4233j02027q2099q5046m8992k4396o0997l8659q3436j07004
$$ 2546478 2424619 2330386 2228359 2146260 2061214 2012222 1987826 1926829 1888170 1804734 1697730
13591A697730q9692p3004m8154j6035k1379q2162n6347l4401q5382n9435p1986
$$ 1697730 1608038 1535034 1486880 1470845 1449466 1367304 1310957 1276556 1191174 1131739 1059753
13580A059753r0747p2505l1661p1453j04778k4722m1588j185j2581k3346l7545
$$ 1059753 969006 896501 864840 793387 688609 663887 622299 621114 608533 585187 547642
13569E47642k2180l6731j9044o1097o4243J3611l440J3514k1470k8179l2100n6363
$$ 547642 525462 488731 469687 408590 344347 357958 354518 368032 346562 318383 286283 229920
13557B29920l3603l1655n0240j928n109J4616O8718M1364L1262L9994L4118N8320
$$ 229920 196317 164662 114422 112494 107385 122001 190719 232083 263345 303339 337457 395777
13545C95777J23348N7360K5056M5742m2999l5406J8644l2832m7429n839p213R637
$$ 395777 519125 576485 601541 647283 604284 568878 587522 554690 507261 501422 494209 503846
13533E03846l728J7604j3185l4174Q339k555j33K151K2838j1446n5354k5684j7469
$$ 503846 500118 517722 504537 470363 478702 476147 476014 478165 501003 489557 434203 408519 391050
13520C91050J5374J8325Q728j758n5976j0997j837K5122N075m0734k5522N472
$$ 391050 406424 424749 433477 431719 375743 364746 362909 388031 393106 352372 326850 332322
13508C32322j3394n25j3732J3697Q029k857R575L3066J2315M555k6533N720q139
$$ 332322 318928 318403 304671 318368 326397 323540 333115 366181 378496 383051 356518 362238 354099
13495C54099L249m573R397O495r450l8067l7563k7103n888k710J805k227p995
$$ 354099 357348 352775 362172 368667 359217 321150 283587 256484 250596 247886 249691 247464 239469
13482B39469K5141K6121j7264k3559l8685n2720L5438M5558M4936j172l6949K0818
$$ 239469 264610 290731 273467 249908 211223 158503 193941 239499 284435 283263 246314 267132
13470B67132K1748J3319j4072l1898j0546j2865l3867K7352J1223J0020L6494
$$ 267132 288880 302199 288127 256229 245683 232818 198951 226303 237526 247546 284040
13459B84040L4136k3469j932j8187J7796k1960m1943m3065J7618K1112K3308l7299
$$ 284040 318176 294707 292775 274588 292384 270424 228481 185416 203034 224146 247454 210155
13447B10155l6391k7787j8418j0141p204k0581k8416o698J6781k2864k1191K0509
$$ 210155 173764 145977 127559 117418 110214 89633 61217 54519 71300 48436 27245 47754
13435D7754J7131j1328Q140j3276k564L5106K7038j255n523J8308M909j0535m1183
$$ 47754 64885 53557 61697 48421 45857 80963 108001 106746 101223 119531 124440 113905 72722
13422G2722j3641L1719q855r128P409m400k272M3452q767p259r84K1296n507K77
$$ 72722 59081 90800 81945 72817 80226 75826 73554 117006 108239 100980 99996 121292 115785 116062
13408A16062K5170m311M80k3301q4109l1460K4355J9315R748n751j6567L6322
$$ 116062 141232 136921 137401 114100 29991 -1469 22886 42201 51949 46198 29631 65953
13396F5953L0843l0676n1787j1533K365N629N3968N2572J6666k9223N935J880
$$ 65953 96796 66120 14333 2800 5165 10794 64762 117334 134000 104777 110712 112592
13384A12592m1554K757N660j9659j7060j3307k0403L2683K9707k1673l3510R653
$$ 112592 71038 73795 79455 59796 42736 29429 9026 41709 71416 49743 16233 25886
13372B5886Q762j437L082K0849j2942k3557q718R585L4246j547j5936M2832m0390
$$ 25886 34648 33211 36293 57142 44200 20643 11925 21510 55756 54209 38273 81105 40715
13359D0715J709J1067J025P791m212J648J3865K4697r09k1018K7644l5017P283
$$ 40715 42424 53491 54516 62307 58095 59743 73608 98305 97396 76378 104022 69005 76288
13346G6288p555n2454j5440J4083N0956K7306l8196k6357k0347K2314N4498j7038
$$ 76288 68733 16279 839 14922 65878 93184 54988 28631 8284 30598 85096 68058
13334F8058o3945M386J8394K1884k8705l234N047o187K4292O5742L008Q920j2773
$$ 68058 4113 8499 26893 48777 20072 16838 21885 15698 39990 105732 108740 117660 104887
13321A04887m3951M499k7098k4953l8712J7188K574L6163L5442j4076l4553j6049
$$ 104887 60936 65435 38337 13384 -25328 -8140 -5566 30597 66039 51963 17410 1361
13309A361K3058Q000j1419k4395l4751j56L6783M4875K4481q578j7747o766l804
$$ 1361 24419 32419 21000 -3395 -38146 -38302 -1519 43356 67837 59259 41512 34746 30942
13296C0942K524j1782j621L705O2969K4067M12k2317j519n5581m2856K5556M104
$$ 30942 33466 21684 20063 23768 86737 110804 111216 88899 87380 31799 -11057 14499 18603
13283A8603L5592J5215l7710l1606J4981J974j1725M8541K9899O875l865J3332
$$ 18603 54195 69410 31700 94 15075 17049 5324 53865 83764 90639 86774 100106
13271A00106J1244J05J9253j2104q660k6634K8098L8559J0573j1881P6882Q3081
$$ 100106 111350 111455 130708 118604 109944 83310 111408 149967 160540 148659 225541 308622
13259C08622O7685Q7610J61828K10279K63628L71704L33543L28083K14921k2009
$$ 308622 376307 463917 625745 836024 1099652 1471356 1804899 2132982 2347903 2325894
13249B325894o7797j56270l24996l24981k46375k32291k11825j46892q2142p9903
$$ 2325894 2258097 2101827 1776831 1451850 1205475 973184 761359 614467 532325 452422
13239D52422o0214j5187L030o13L3294o5916r3073l7710K4472J6900l7828J2303
$$ 452422 392208 377021 380051 379438 412732 346816 253743 216033 240505 257405 219577 231880
13227B31880J9877J3352k1960k0888J147K042K9280K1267m277r015l9284p3005
$$ 231880 251757 265109 243149 222261 223408 225450 254730 275997 271720 262705 223421 150416
13215A50416o902R736j7542l545n176J3955P910l41P480k7551k016L659j9091
$$ 150416 143514 153250 135708 132163 126987 140942 148852 148511 155991 128440 126424 130083 110992
13202A10992K986j290j5404L524J5891J5714j7885k153n9743o642L7731J6127
$$ 110992 113978 112688 97284 100808 116699 132413 114528 112375 52632 45990 83721 99848
13190I9848L6384k56j3608k7494K0669j6788m5788m8826K1981L3220n832m954
$$ 99848 136232 135976 122368 94874 115543 98755 52967 4141 26122 59342 53510 48556
13178D8556L4991m50k2183k5988n6979J4520J1949Q6221J7098n399j1342k7691
$$ 48556 83547 83097 60914 34926 -22053 -7533 4416 90637 107735 102336 90994 63303
13166F3303k5165J2404k3185K7314k5988K4859K9764K7853j341j9094j7931k4197
$$ 63303 38138 50542 27357 54671 28683 53542 83306 111159 109818 90724 72793 48596
13154D8596n754k840K5021k8275o904M4704j3941M887J4508m5849k4955J416q331
$$ 48596 42842 40002 65023 36748 29844 74548 60607 65494 80002 34153 9198 10614 2283
13141B283m0090M9327J180j9992L0739N0823N034m0242o6007K0429J9286J1603
$$ 2283 -37807 11520 12700 -7292 23447 74270 79304 39062 -26945 -6516 12770 24373
13129B4373j458k6756p175M717m0047K6998O9690L7708l928L1470j1263j3268
$$ 24373 22915 -3841 -11016 -6299 -46346 -19348 50342 88050 84122 115592 104329 91061
13117I1061j0466j9075J0733k9948m1497o303J862K9515K1308n183l3208j4100
$$ 91061 80595 61520 72253 42305 808 -5495 -3633 25882 47190 42007 8799 -5301
13105e301j7852j1537l481J6805Q0796M5283p2204k2816L942j0705l368K7361
$$ -5301 -23153 -34690 -38171 -21366 59430 104713 32509 9693 13635 2930 -438 26923
13093B6923K1192K6660O999j7198k2408J4554o418q350l3102l6366j791O196J9221
$$ 26923 48115 74775 81774 64576 42168 56722 50304 41954 8852 -27514 -29305 -23109 -3888
13080c888j0499k4450J9100J8001L6412K2063n6967n6514j5757K399L8743M1037
$$ -3888 -14387 -38837 -19737 -1736 34676 56739 -228 -56742 -72499 -70100 -31357 9680
13068I680J3936q421m315k6624K1972L6273L784m0640l431m031L359r827k960
$$ 9680 23616 15195 10880 -15744 6228 42501 46285 5645 2214 -1817 1542 -8285 -11245
13055a1245L0548O303k897k0734r614L1814J8625N31L9587l2014m7564k440M9608
$$ -11245 19303 25606 22709 1975 -7639 24175 42800 43331 82918 50904 3340 900 50508
13042E0508J3970j764K316k727M669k9775j7427K8792j1055m3155o23j8813r617
$$ 50508 64478 62714 65030 62303 66972 37197 19770 48562 37507 -5648 -6271 -25084 -34701
13029c4701L0351N0514K3739L0206j4826m9096m8575Q764p809q089J0377o920
$$ -34701 -4350 46164 69903 100109 85283 36187 -12388 -3624 -11433 -19522 -9145 -16065
13017a6065j1033j4213L1742L2307M393j5719r676r097K084k0251k4612K8157
$$ -16065 -27098 -41311 -9569 22738 27131 11412 1736 -7361 -5277 -25528 -50140 -21983
13005b1983O5797l8252n9072J6723L6933K5237J2423K004k1310k079O443O065
$$ -21983 43814 5562 -53510 -36787 146 25383 37806 39810 18500 16421 22864 28929
12993B8929j1234K1212L8742k8551j6678J7205l588r506K9144L8m6322N609J0056
$$ 28929 17695 38907 77649 49098 32420 49625 46037 36531 65675 65713 19391 25000 35056
12980C5056k567M714k3616N653N2007J5980k4376J2502L609l2210m2263k5066
$$ 35056 32489 37203 13587 19240 71247 87227 62851 75353 78962 46752 4489 -20577
12968b0577P837L665Q988M4421J4967N944j3705k7281K0341K1227j9210j774J4893
$$ -20577 -12740 -9075 -87 44334 59301 65245 51540 24259 44600 65827 46617 44843 59736
12955E9736j4066K5041m0007p2237k6102n01Q0203j306k436L91m178p171j2632
$$ 59736 45670 70711 30704 -41533 -67635 -68136 12067 10761 8325 8716 4538 -2633 -15265
12942a5265k0272J5907K1794Q621k8522m3999K8871J9440J7839J2223M387J575
$$ -15265 -35537 -19630 2164 10785 -17737 -61736 -32865 -13425 4414 16637 21024 22599
12930B2599J1445J5505O966P094j9910l2271j2908Q094j0190K161j0658Q224r627
$$ 22599 34044 49549 56515 63609 43699 11428 -1480 6614 -3576 -1415 -12073 -3849 -13476
12917a3476k4829o934L5668J4889J5174K816k7335j4031Q716K8060q838L5319
$$ -13476 -38305 -45239 -9571 5318 20492 23308 -4027 -18058 -9342 18718 9880 45199
12905D5199Q058l3339K2938j0100k1924l6154n185j4432j1397L980M3709M2712
$$ 45199 53257 19918 42856 32756 10832 -25322 -30507 -44939 -56336 -52356 -8647 34065
12893C4065M5818j2506k9995j6628j0331j6716L3187k4370k3878n287L7380L2716
$$ 34065 79883 67377 37382 20754 10423 -6293 26894 2524 -21354 -26641 10739 43455
12881D3455l2321k3835L7628K1361k5326j6196l8395j3924j9939P166J0048L9489
$$ 43455 11134 -12701 24927 46288 20962 4766 -33629 -47553 -67492 -60326 -50278 -10789
12869a0789J9631L3790o614p154j0356r221n8325l1902p496q893K8199J5926j4224
$$ -10789 8842 42632 36018 28864 18508 9287 -49038 -80940 -88436 -97329 -69130 -53204 -67428
12856f7428K0575J7422j5156J9724N800J9055L6316l0761K0584K697p632K8772
$$ -67428 -46853 -29431 -44587 -24863 -19063 -8 36308 5547 26131 28828 21196 49968
12844D9968L1118l2221n8601J7382M0874r155j4154j9034k7350K2124r626K3662
$$ 49968 81086 48865 -9736 7646 48520 39365 25211 6177 -21173 951 -8675 14987
12832A4987M7974L7398l2525m1018J7273o726J4910K3214J8815l7m383l1308j1204
$$ 14987 62961 100359 67834 26816 44089 37363 52273 75487 94302 94265 89882 58574 47370
12819D7370k6369l7767J7937j4872r584N548j2185M635K0970j0569O249L6346
$$ 47370 21001 -16766 1171 -13701 -23285 -17737 -29922 -25287 -4317 -14886 -8637 27709
12807B7709j5774K581M9392m8364m9485O9621L1133J1933J1652l4069n3583j0420
$$ 27709 11935 14516 63908 15544 -33941 35680 66813 78746 90398 56329 2746 -7674
12795g674J8842j7453r092L9863N298M951K0954j9977l7584r365J6520j0089q585
$$ -7674 11168 -6285 -15377 24486 29784 34735 55689 35712 -1872 -11237 5283 -4806 -13391
12782a3391L2109K101j1029k9481m4463L508J2619j861M2942k109k0780J3538
$$ -13391 18718 20819 9790 -19691 -64154 -60646 -48027 -49888 -6946 -9055 -29835 -16297
12770a6297K7331k2123k1086K7327M1260L0885J7714j3626j0143n6108l7499Q189
$$ -16297 11034 -11089 -32175 -4848 36412 67297 85011 71385 61242 5134 -32365 -24176
12758b4176K6627M2889K9139l3685l4311j9105K867L0238m142l323J1863L327
$$ -24176 2451 45340 74479 40794 6483 -12622 -9755 20483 16341 13018 24881 28208
12746B8208r321l9787k1276J7892M7037K576J8351r22j6387l5602L768M6333m5496
$$ 28208 18887 -20900 -42176 -24284 22753 25329 43680 42758 26371 -9231 -5463 40870 -4626
12733d626n1075L5514K8171l321M123j778L395K3247K5973j9184l1177j2363k170
$$ -4626 -55701 -20187 7984 4663 8786 7008 10403 33650 59623 40439 9262 -3101 -5271
12720e271L7474K1691j818K5198n9356m3250j0736J7975Q498P537K4073k175k8302
$$ -5271 32203 53894 52076 77274 17918 -25332 -36068 -18093 -9595 -2058 22015 19840 -8462
12707h462Q71j381K2350K22n101j4382J80m5653m3998L4352O5989k687r992p538
$$ -8462 -7591 -8972 13378 13600 8499 -5883 -5703 -51356 -95354 -61002 4987 2300 -7692 -15230
12693a5230k8020n518j3728J5142L3871K2520k1515l7128p503P8601O058q861
$$ -15230 -43250 -48768 -62496 -47354 -13483 9037 -12478 -49606 -57109 21492 27550 18689
12681A8689P808j3447J7462J5882k5296J5461L1712J603o2982m5278l3908M641
$$ 18689 26497 13050 30512 46394 21098 36559 68271 69874 6892 -38386 -72294 -67653
12669f7653N1775K003j3048j8150M6600M0210K0741k7551o2616k317J1941L1097
$$ -67653 -15878 -13875 -26923 -45073 1527 41737 62478 34927 -27689 -30006 -18065 13032
12657A3032K7032K3277K3415k5567k5731l720k5107L372Q201K5368l0622m3336
$$ 13032 40064 63341 86756 61189 35458 31738 6631 10003 18204 43572 12950 -30386
12645c0386Q296M1224j9432K581j483k1312J1490k0904j0210r824Q87O5470N1337
$$ -30386 -22090 19134 -298 2283 800 -20512 -9022 -29926 -40136 -49960 -49073 16397 67734
12632F7734J9013k8977k5293k6753k2489j0219n74J5455K3100K465n5206n1364
$$ 67734 86747 57770 32477 5724 -16765 -26984 -27558 -12103 10997 13462 -41744 -93108
12620i3108K044L7158L4992O906J3880j6774J5493M9882J5466l3636L4447j2199
$$ -93108 -91064 -53906 -18914 -12008 1872 -14902 591 50473 65939 32303 66750 54551
12608E4551k5315k5375j2139j0118j6986K2471K1192k2214N42K6779Q350l9589
$$ 54551 29236 3861 -8278 -18396 -35382 -12911 8281 -13933 -13391 13388 21738 -17851
12596a7851j1617j0864q321J1397L4425O0641q970j7026P608n6037o8849j6676
$$ -17851 -29468 -40332 -48653 -37256 -2831 57810 48840 31814 39422 -16615 -85464 -102140
12584a02140J3894K5213j1026n588J7256J5507L1351J0116Q199n1032R661M68
$$ -102140 -88246 -63033 -74059 -79647 -62391 -46884 -15533 -5417 2782 -48250 -38589 -38121
12572c8121K1207M4051O892J969J5476J1786L734k8307j3j9371L9775K1478k5536
$$ -38121 -16914 27137 34029 35998 51474 63260 66994 38687 38674 19303 59078 80556 55020
12559E5020k725l6953n2853r674O746m6152L7978j670m452M3861K2237K951k2608
$$ 55020 52295 15342 -37511 -47185 -40439 -86591 -48613 -50283 -54735 -10874 11363 14314 -8294
12546h294J5443L8387l6286o057L3603k2460o831J6224j2201k3361J6755m8256
$$ -8294 7149 45536 9250 3193 36796 14336 7505 23729 11528 -11833 4922 -43334
12534d3334k3469l897M9741P8061J4208r133o4870j9796j553j5972m0308L2482
$$ -43334 -66803 -70700 -20959 57102 71310 62177 -2693 -22489 -24042 -40014 -80322 -47840
12522d7840K8250n15k3697r027M3402L3518j2437j0785P451K1420j6j4510l7722
$$ -47840 -19590 -20105 -43802 -52829 -9427 24091 11654 869 8320 29740 29724 15214 -22508
12509b2508K3105J4422M182j5668j1023J5680J1722k787K834l5815j4789l620
$$ -22508 597 15019 19201 3533 -7490 8190 19912 17125 19959 -15856 -30645 -34265
12497c4265J7413k7635K8222q761q377K8387J2636j8595j4463K317j8209j0352
$$ -34265 -16852 -44487 -16265 -25026 -33403 -5016 7620 -10975 -25438 -23121 -41330 -51682
12485e1682R722K5168J6669j6254L520K7207k8998j9041p472K3483j6611J0633
$$ -51682 -41960 -16792 -123 -16377 -12857 14350 -14648 -33689 -41161 -17678 -34289 -23656
12473b3656J6476k2779L2294O5104J5349k7761j7145j6226J8368K2650K7388n6830
$$ -23656 -7180 -29959 2335 67439 82788 55027 37882 21656 40024 62674 90062 33232
12461C3232p1403q2888J0228R3633J7757k4294J3983Q2788K8450m6582n3149j599
$$ 33232 -38171 -121059 -110831 -17198 559 -23735 -9752 73036 101486 54904 1755 156
12449A56J3976M949J2677r434o09K1821j7001l3943M086L321k6586j5706J2638
$$ 156 14132 19081 31758 22324 21715 43536 26535 -7408 -3322 -1 -26587 -42293 -29655
12436b9655N5054M849o2288j1909M2140J1738J0325k1508Q960j2j7071N071L2092
$$ -29655 25399 30248 -32040 -43949 -1809 9929 20254 -1254 7706 7694 -9377 -4306 27786
12423B7786M6985k9606l6939j129K5259J0741l0980j7347L0490m0055J415M2552
$$ 27786 74771 45165 8226 7097 32356 43097 12117 -5230 25260 -14795 -13380 29172
12411B9172l841r950j6419Q322L0431Q02j7513k8231l1565J6639N617M409J7622
$$ 29172 25331 15381 -1038 7284 37715 38517 21004 -7227 -38792 -22153 -16536 -12127 5495
12398E495L3725l8179n8532r321l27M1887L0607M168j0692k8403k569J7835K4568
$$ 5495 39220 1041 -57491 -66812 -67139 -25252 5355 9523 -1169 -29572 -32141 -14306 10262
12385A0262r939j5744r350n250L2435J9287j3545n333J2727K0242m1061l055O0429
$$ 10262 323 -15421 -24771 -30021 2414 21701 8156 2823 15550 35792 -5269 -8324 52105
12372E2105O746M768k4246m6568J3759k6508l2353J8259M8311M5728L4281n4466
$$ 52105 58851 63619 39373 -7195 6564 -19944 -52297 -34038 14273 60001 94282 39816
12360C9816k9201j7563q1J4117l0236m6146J1615J5754R680K2211L0300J2700
$$ 39816 10615 -6948 -7029 7088 -23148 -69294 -57679 -41925 -32245 -10034 20266 32966
12348C2966l4331o652P722k6623J2882L1137K4660l3336L494N087l315L695j5415
$$ 32966 -1365 -8017 -295 -26918 -14036 17101 41761 8425 11919 17006 13691 17386 1971
12335A971K4137L424J3900n4205o2472l4736K4853J06629m460o2305O466M8825
$$ 1971 26108 29532 43432 -10773 -73245 -107981 -83128 23501 19041 -43264 -36798 12027
12323A2027J6398p810L8203p264k0741l5306K3662J0303k5372j9208P75J8798
$$ 12027 28425 20615 58818 51554 30813 -4493 19169 29472 4100 -15108 -14333 4465
12311D465J600k4406L653M2604K0925k2456O420L4304q710m7870j0027m9670r830
$$ 4465 6065 -18341 -14688 27916 48841 26385 32805 67109 58399 10529 502 -49168 -58998
12298e8998J9787j5173J5954L2253M7067K4140J6253k8783r255q594M2279Q336
$$ -58998 -39211 -54384 -38430 -6177 40890 65030 81283 52500 43245 34651 76930 85266
12286H5266P990k0474j1851L5975l611l0180k4575k3389J0657J2116L2196J7255
$$ 85266 93256 72782 60931 96906 93295 63115 38540 15151 25808 37924 70120 87375
12274H7375K4820m9401p1955O963j09K6905J0357O054J348k5881k6573k465k3503
$$ 87375 112195 62794 -9161 -2198 -2307 24598 34955 41009 42357 16476 -10097 -12562 -36065
12261c6065l0456J5868M2200K663M716J7490J3403K3743J4600j3536n2917j3809
$$ -36065 -66521 -50653 -8453 -5790 -1074 16416 29819 53562 68162 54626 1709 -12100
12249a2100J3739L6676r810J58l594j9310o124J4210l324J0734L0882m5477p3928
$$ -12100 1639 38315 28505 28663 25069 5759 -365 13845 10521 21255 52137 6660 -67268
12236f7268j9464K0187k648K1375R38K3290K0648o509K8252K9594L4943j2596
$$ -67268 -86732 -66545 -69193 -47818 -46880 -23590 -2942 -9451 18801 48395 83338 70742
12224G0742l6084j2597m303o799n070n5109k3651p471K9078P0878N6735k5841
$$ 70742 34658 22061 17758 10959 5889 -49220 -72871 -80342 -51264 19614 76349 50508
12212E0508K774L1743k0933n0453k6096l9382q490L1919o376K4976N5713M2378
$$ 50508 53282 85025 64092 13639 -12457 -51839 -60329 -28410 -34786 -9810 45903 88281
12200H8281m4336l1123k7156L8335j4893p623k0093j3168k7114P371K3053L3901
$$ 88281 43945 12822 -14334 24001 9108 1485 -18608 -31776 -58890 -51519 -28466 5435
12188E435O879j4883l2402k3520K5410P516q417M3073K5393k33N2231J3088j8473
$$ 5435 12314 -2569 -34971 -58491 -33081 -25565 -33982 9091 34484 34251 86482 99570 81097
12175H1097J0050j0465l6430n081o266k5124K7682P084J4920J1015k8619l7613
$$ 81097 91147 80682 44252 39171 32905 7781 35463 42547 57467 68482 39863 2250
12163B250P076J4626Q562k8053k3021J7O211m2252j4607O4787k7151P396l224
$$ 2250 9326 23952 32514 4461 -18560 -18543 -12332 -54584 -69191 -4404 -31555 -24159 -27383
12150b7383P613L9543n090j9995j9633l2241K5459L3571l39K0106M385j786K2722
$$ -27383 -19770 19773 14683 -5312 -24945 -57186 -31727 1844 1505 21611 25996 24210 46932
12137D6932k2999k0610k5162q618r175j6447l4314M4100K4575O096L2439J8155
$$ 46932 23933 3323 -21839 -30457 -39632 -56079 -90393 -46293 -21718 -15622 16817 34972
12125C4972j3528J740j1968p319j4348n285K3849n276R566p326K2002K2530K8917
$$ 34972 21444 23184 11216 3897 -10451 -15736 8113 2837 12403 5077 27079 49609 78526
12112G8526j9263k0618k8041j099j0872K659L3315j0988O083k379J1820Q150k0041
$$ 78526 59263 38645 10604 9505 -1367 1292 34607 23619 29702 27323 39143 47293 27252
12099B7252j2081k3251J660R536r58k5851K9439K1793M766j0231J7557k3060N002
$$ 27252 15171 -8080 -6420 3116 2158 -23693 5746 27539 32305 22074 39631 16571 21573
12086B1573K2178J5750k1976k3732K9247K9229j2056k5434O577m0279j7643J6104
$$ 21573 43751 59501 37525 13793 43040 72269 60213 34779 41356 1077 -16566 -462
12074d62Q536q574M0052K6097j8679k5840j7378k3460J173j7984J2701P846N0527
$$ -462 8074 -500 39552 65649 46970 21130 3752 -19708 -18535 -36519 -23818 -15972 34555
12061C4555Q337L7934J5070o673l2633n3721K7599Q675j0552J8200l4403m244
$$ 34555 42892 80826 95896 89223 56590 2869 30468 39143 28591 46791 12388 8144
12049H144J2500k6611m637M2822o741m1774l0373l0675R170K3788N605K4137M9946
$$ 8144 20644 -5967 -10604 32218 25477 -16297 -46670 -77345 -68175 -44387 -38782 -14645 35301
12036C5301J9063m5045n2241j2592O0381J6400l6848n498L734J022L1060o744
$$ 35301 54364 9319 -42922 -55514 4867 21267 -15581 -21079 -17345 -16323 14737 7993
12024G993n2433J3740k8671j7969K3609L5908L3428j0985N355O84k4133j0804
$$ 7993 -44440 -30700 -59371 -77340 -53731 -17823 15605 4620 9975 10659 -13474 -24278
12012b4278p76K8469k777R219J3393j1132j1486P565n705m1892j2089K3939l1543
$$ -24278 -25054 3415 638 9857 23250 12118 632 8197 2492 -39400 -51489 -27550 -59093
11999e9093k1305M3277p481L2266j1568n6232k3705L4032O6058L279q793O212
$$ -59093 -80398 -37121 -44602 -12336 -23904 -80136 -103841 -69809 -3751 -472 -9265 -3053
11987c053J9632j8473J095L3293J7766N236R048j3297m8270l0193L1547N2189
$$ -3053 16579 -1894 -799 32494 50260 55496 64544 51247 2977 -27216 4331 56520
11975E6520l393j3292l4349j1906m4121k6975O2447M0355l3112j148O630k4625
$$ 56520 53127 39835 5486 -6420 -50541 -77516 -15069 25286 -7826 -8974 -2344 -26969
11963b6969J3518L9203j9525o2414k3587k5342k6317M1771K9195L2134M5103M9137
$$ -26969 -13451 25752 6227 -56187 -79774 -105116 -131433 -89662 -60467 -28333 16770 65907
11951F5907L550l869r3K4054k4562K3986r68k4690n1183l7718L5057K0057j2418
$$ 65907 69457 65588 65495 89549 64987 88973 88005 63315 12132 -25586 9471 29528 17110
11938A7110l8040J105M1004Q819k6268P612k4561r873j743K0508j755J0207j775
$$ 17110 -20930 -19825 21179 29998 3730 11342 -13219 -23092 -24835 -4327 -6082 4125 2350
11925B350K6068j4513K3036K4024R385J7567j6909j0280l2992L955K1340p924
$$ 2350 28418 13905 36941 60965 70350 87917 71008 60728 27736 31691 53031 45107
11913D5107j1870o369N880m2715o302O77R372R277M6857l2266n7385L0317o421
$$ 45107 33237 26868 32748 -9967 -16269 -15592 -6220 3057 49914 17648 -39737 -9420 -15841
11900a5841n727r006J0134j5547j5409K6942L3041K920J0505j8532K6776R364
$$ -15841 -21568 -30574 -20440 -35987 -51396 -24454 8587 11507 22012 3480 30256 39620
11888C9620m0102n53P686k8244l710J8946J2143K246o7992j5854L4538j428J5370
$$ 39620 -482 -1035 6651 -21593 -25303 -6357 5786 8032 -59960 -75814 -41276 -42704 -27334
11875b7334N733J7143j3469j2865L8218J1518R958l1921Q610Q0223O197l0831
$$ -27334 -21601 -4458 -17927 -30792 7426 18944 28902 -3019 5591 85814 92011 61180
11863F1180n1872j0156K4838K9765j5603l5510j4664k575L2925j2758o625O10
$$ 61180 9308 -848 23990 53755 38152 2642 -12022 -14597 18328 5570 -1055 -445
11851d45l021l8687L334k4239J1284R658n0332m706L1078L4294M9274J5970l581
$$ -445 -3466 -42153 -38819 -63058 -51774 -42116 -92448 -97154 -66076 -31782 17492 33462 29881
11838B9881j3693j6765J3708N3746j6528j2507Q331K8097J6579k7036l987j7170
$$ 29881 16188 -577 13131 66877 50349 37842 46173 74270 90849 63813 59826 42656
11826D2656o5109k0422K4941j0454L576L7265n34k1937K3954j5635n0534K2080
$$ 42656 -22453 -42875 -17934 -28388 -24812 12453 11919 -10018 13936 -1699 -52233 -30153
11814c0153m625P316J2042K0440P569q8j1281J0249J8390K7853L919j620l4090
$$ -30153 -34778 -27462 -15420 5020 12589 12501 1220 11469 29859 57712 61631 60011 25921
11801B5921o2764k4688L3470j750j8145K2543M0678J0930M108j7616r998j1505
$$ 25921 -36843 -61531 -28061 -29811 -47956 -25413 15265 26195 30303 12687 2689 -8816
11789h816l3830J9285K2356j314K1695J5339l0347l6191l6351o705M3574L2357
$$ -8816 -42646 -23361 -1005 -2319 19376 34715 4368 -31823 -68174 -74879 -31305 1052
11777A052j1665j5106K2691l4748J191K8942j3998Q753J0216k0783r97Q695k5153
$$ 1052 -10613 -25719 -3028 -37776 -36585 -7643 -21641 -12888 -2672 -23455 -24452 -15757 -40910
11764d0910k0611K6192J6689J1128l2573J1231K509K2667K6026L8155p374r723
$$ -40910 -61521 -35329 -18640 -7512 -40085 -28854 -26345 -3678 22348 60503 53129 43406
11752D3406r447l8642m0014q940N1705p031l5972L1651N4756o178j3593L724p62
$$ 43406 33959 -4683 -44697 -53637 -1932 -8963 -44935 -13284 41472 35294 21701 25425 24663
11739B4663l6353m6624K2477N5827j9572j0454K148j8257j6730K3368N2002J3074
$$ 24663 -11690 -58314 -35837 19990 418 -10036 -7888 -26145 -42875 -19507 32495 45569
11727D5569j5300j8598J2608J5232p71o950j7749M0923j196k3337j8131R513m860
$$ 45569 30269 11671 24279 39511 38740 31790 14041 54964 53768 30431 12300 21813 16953
11714A6953l098k9875J2133K7104j1621n1839l3357K5267q949k2363K1838L3254
$$ 16953 13855 -16020 -3887 23217 11596 -40243 -73600 -48333 -57282 -79645 -57807 -24553
11702b4553L3511L0003l7021m8789K4498m60j0160j2423K5277J1213j22k6908
$$ -24553 8958 38961 1940 -46849 -22351 -22811 -32971 -45394 -20117 -8904 -9026 -35934
11690c5934l1051r595L838O631j1322J4251K1632l6977r681m896L4660j918K6210
$$ -35934 -66985 -76580 -72742 -66111 -77433 -63182 -41550 -78527 -88208 -93104 -58444 -60362 -34152
11677c4152O791n270K1150k2987j7390J5397l8694j6991L2908J1026O1263k5915
$$ -34152 -27361 -32631 -11481 -34468 -51858 -36461 -75155 -92146 -59238 -48212 13051 -12864
11665a2864o4428j38O6925k0198l7999l126K4359O3832J9516j7401j6000l0367
$$ -12864 -77292 -77430 -10505 -30703 -68702 -71828 -47469 16363 35879 18478 2478 -27889
11653b7889m4341j7259M0435j2887L9509L0583O602J392l1681m2477j5217K5427
$$ -27889 -72230 -89489 -49054 -61941 -22432 8151 14753 16145 -15536 -58013 -73230 -47803
11641d7803L1635J6485J4580k5878j4941J6722K1293j8654j3678l323M297N78
$$ -47803 -16168 317 14897 -10981 -25922 -9200 12093 -6561 -20239 -23562 -19265 -18687
11629a8687p478M654L5300m5987k2006O1285L1001k9244q957J126j2374J496L3825
$$ -18687 -26165 -21511 13789 -32198 -54204 7081 38082 8838 -119 1007 -11367 -9871 23954
11616B3954l6090j9900k4579k1370J2208J3646J890K4405M4852L900Q000N0125
$$ 23954 -12136 -32036 -56615 -77985 -65777 -52131 -50241 -25836 19016 22916 30916 81041
11604H1041L0071l4292l7990k0131j0269K0031k8094q299J0167K5201j1348k7077
$$ 81041 111112 76820 38830 18699 8430 28461 367 -7932 2235 27436 16088 -10989
11592a0989l7295l1505j3708J6579M7164K5010r877r667k0142N9446k5257j074
$$ -10989 -48284 -79789 -93497 -76918 -29754 -4744 -14621 -24288 -44430 15016 -10241 -11315
11580a1315M2621l4019l9676q449J3100l2639n043L5856L1907K2540l7627j4996
$$ -11315 31306 -2713 -42389 -50838 -37738 -70377 -75420 -39564 -7657 14883 -22744 -37740
11568c7740q677r833L4345k6132K6812K6597J4926K7504n6589m1936K4818K427
$$ -37740 -46417 -56250 -21905 -48037 -21225 5372 20298 47802 -8787 -50723 -25905 -23478
11556b3478j0460j0979O5241M1794j5025k8517l7362J0421L7143L5462Q850p249
$$ -23478 -33938 -44917 20324 62118 47093 18576 -18786 -8365 28778 64240 73090 65841
11544F5841j624n5781O116J3275l872L547L411K6585j3370n8476j6245J9581M086
$$ 65841 64217 8436 14552 27827 23955 27502 30913 57498 44128 -14348 -30593 -11012 -6926
11531f926k2688K8188K0016K0528K1675m824o018o049j4947P025K7706J3132o24
$$ -6926 -29614 -1426 18590 39118 60793 55969 49951 43902 28955 35980 63686 76818 76194
11518G6194k9624l9284P305q114j7467L206j6824K8189M2733l5049j7877N469
$$ 76194 46570 7286 14591 6477 -10990 -7784 -24608 3581 46314 11265 -6612 -1143
11506a143j2557j3347J4463K3308M7501L160j1255O343p339P917J399r894K6110
$$ -1143 -13700 -27047 -12584 10724 58225 61385 50130 56473 49134 57051 58450 48556 74666
11493G4666M9688j1111j4463k9376j4143J968k0159k7567l5244O453l543m147
$$ 74666 124354 113243 98780 69404 55261 57229 37070 9503 -25741 -19288 -22831 -26978
11481b6978l5365n251j3262k58J8404N9464M547M302j7724Q162l850j2095j2499
$$ -26978 -62343 -67594 -80856 -81114 -62710 -3246 1301 5603 -12121 -3959 -7809 -19904 -32403
11468c2403K6185L1374N4914j4371n6171M441J8830M2360J0867R264p045k3320
$$ -32403 -6218 25156 80070 65699 9528 13969 32799 75159 86026 95290 88245 64925
11456F4925p2566p5438R31O2328j4601k1489J5418K4401o766j4140J8521O690
$$ 64925 -7641 -83079 -82148 -19820 -34421 -55910 -40492 -16091 -22857 -36997 -18476 -11786
11444a1786p186J8821n111j5054r310L092J0786L4869M3615p749m6801j9107k1557
$$ -11786 -18972 -151 -5262 -20316 -29626 -26534 -15748 19121 62736 54987 8186 -10921 -32478
11431c2478P924K8697M7657J4189k3394o7037l4873L4182J6521K8955L19r89K591
$$ -32478 -24554 4143 51800 65989 42595 -24442 -59315 -25133 -8612 20343 20662 19673 22264
11418B2264J5154k34Q257K1999K0025J3698K7836N58m0317r198r92K183j3153
$$ 22264 37418 37184 45441 67440 87465 101163 128999 129557 89240 80042 79050 81233 68080
11405F8080n5293l7122J1379j3763k7284L1176J2916K5243M7714L166K6567q393
$$ 68080 12787 -24335 -12956 -26719 -54003 -22827 -9911 15332 63046 66212 92779 84386
11393H4386k3572q361l8881m0487J1066R625q918N943l678j3552K8712K403K2889
$$ 84386 60814 52453 13572 -26915 -15849 -6224 -15142 -9199 -12877 -26429 2283 4686 27575
11380B7575M3871k5255j6306l5613k1209J4824N4018j6462k6641m4306k0215M9824
$$ 27575 71446 46191 29885 -5728 -26937 -12113 41905 25443 -1198 -45504 -65719 -15895
11368a5895J4863K0439L1376m3302l4281K1359J9187P173k3801n7093j8180l0223
$$ -15895 -1032 19407 50783 7481 -26800 -5441 13746 20919 -2882 -59975 -78155 -108378
11356a08378l4095M8514K4285J1970j254K4650M2369K8056N0001o3306p8305N796
$$ -108378 -142473 -93959 -69674 -57704 -58958 -34308 8061 36117 86118 22812 -55493 -49697
11344d9697M5310k7346j1934J8387K8337j2475l7294j3575l8247L1869L6810o446
$$ -49697 -4387 -31733 -43667 -25280 3057 -9418 -46712 -60287 -98534 -66665 -29855 -36301
11332c6301l7049K5314P8460j1163K033j2878j3498J5926O504m1507j3592j1098
$$ -36301 -73350 -48036 30424 19261 21294 8416 -5082 10844 17348 -24159 -37751 -48849
11320d8849L329L7023M4493j5124k9797j7261J5387P765K8733M9936k1835o3137
$$ -48849 -45520 -8497 35996 20872 -8925 -26186 -10799 -3034 25699 75635 53800 -9337
11308i337n1945L5215K3413k286K80l8408n2524K0004M6195l1220k0410J9700
$$ -9337 -61282 -26067 -2654 -4940 -4660 -43068 -95592 -75588 -29393 -60613 -81023 -61323
11296f1323k973O782j902k4420Q586M9257M1716L152l9991J2410j664j0120K8391
$$ -61323 -64296 -57514 -59416 -83836 -75250 -25993 15723 18875 -21116 -8706 -10370 -20490 7901
11283G901L8570k7071k7239j2783o895M047N64l6679o925N6311J5459n526m1786
$$ 7901 46471 19400 -7839 -20622 -27517 -23470 -22906 -59585 -66510 -10199 5260 -266 -42052
11270d2052k018L8753J4731j4237n1409K7839P4827J1033q470m0334k700K6525
$$ -42052 -44070 -5317 9414 -4823 -56232 -28393 46434 57467 48997 8663 5963 32488
11258C2488l3950k9466L990O397j3870k555J5730O513K6111M4059l2117k645m1582
$$ 32488 -1462 -30928 -26938 -20541 -34411 -36966 -21236 -14723 11388 55447 23330 20685 -20897
11245b0897k4190r134K2705j3363K8381P2881k5781k5819j5277O569l5590o342
$$ -20897 -45087 -54221 -31516 -44879 -16498 56383 30602 4783 -10494 -3925 -39515 -45857
11233d5857l920M199j3095L1455M2831K0681j3759o8654k6442J5711L2688K4572
$$ -45857 -49777 -45578 -58673 -27218 15613 36294 22535 -46119 -72561 -56850 -24162 410
11221D10m5942k3246r734J2026P8494L5671k2341r2123j8067K6788K2018J9024
$$ 410 -45532 -68778 -78512 -66486 12008 47679 25338 -66785 -84852 -58064 -36046 -17022
11209a7022K5718J9435l873M900J4565K2917L0246J445l5746l7191r829j5529
$$ -17022 8696 28131 24258 29158 43723 66640 96886 98331 62585 25394 15565 36
11197C6k7231q792L9566N1185k9834j2561L0081l5284n2355l7234l1870M1753
$$ 36 -27195 -35987 3579 54764 24930 12369 42450 7166 -45189 -82423 -114293 -72540
11185g2540N5610M7711j8252m6821k0858L2455K091k3300k3143L6099j23M8640
$$ -72540 -16930 30781 12529 -34292 -55150 -22695 -20604 -43904 -67047 -30948 -31071 17569
11173A7569J0924k6067k3185n683l8509n250M1194n586o745J6417L2662M9377
$$ 17569 28493 2426 -20759 -26442 -64951 -70201 -29007 -34593 -41338 -24921 7741 57118
11161E7118k1576m5860M8306K1971l6763k7532J115R81j6672j8209q030P2189
$$ 57118 35542 -10318 37988 59959 23196 -4336 -3221 -2240 -18912 -37121 -45151 27038
11149B7038M5154n901j1349l5127m5034k5585K6496k808L7723J9974m3225j7068
$$ 27038 72192 66291 54942 19815 -25219 -50804 -24308 -27116 10607 30581 -12644 -29712
11137b9712M3016L230l2123J0726L4726K0497j3733l2678p542q658j224N039J6323
$$ -29712 13304 16534 -15589 -4863 29863 50360 36627 3949 -3593 -12251 -13475 -8436 7887
11124G887k1819J8547J7351J6389j4317m9092N110n906K2125J115j1974N92O83
$$ 7887 -13932 4615 21966 38355 24038 -25054 -19944 -25850 -3725 -2610 -14584 -13992 -13309
11111a3309O462J5240K4178K2328k6953r271k5707L292k1472J8586M4286Q440
$$ -13309 -6847 8393 32571 54899 27946 18675 -7032 -3740 -25212 -6626 37660 46100
11099D6100j5919n0686m9914j2433N9433N3485l2486q348K207J8899j1869j6143
$$ 46100 30181 -20505 -70419 -82852 -23419 30066 -2420 -10768 -8561 10338 -1531 -17674
11087a7674j4766j5306J5107m554k3434J2613M6486N3773k9072k6363j3506r960
$$ -17674 -32440 -47746 -32639 -37193 -60627 -48014 -1528 52245 23173 -3190 -16696 -26656
11075b6656l592N033N0765Q0060j082k4191l4322J5063M1340P867o5332l2192
$$ -26656 -30248 -25215 25550 105610 104528 80337 46015 61078 102418 110285 44953 12761
11063A2761o390Q691l047O679l3707K838P509p08j4935m842j5197Q614O313J10
$$ 12761 6371 15062 12015 18694 -15013 -12175 -4666 -5374 -20309 -25151 -40348 -31734 -25421 -25311
11049b5311j2087M0207M8027k3023l9670L3262m592j8701j1056O459o681L8940
$$ -25311 -37398 2809 50836 27813 -11857 21405 16813 -1888 -12944 -6485 -13166 25774
11037B5774M3284j1338l7242m8144m751j2254M5032N6312J4381L1205q225o8146
$$ 25774 69058 57720 20478 -27666 -32417 -44671 361 56673 71054 102259 94034 25888
11025B5888n9522J6988l1649l0850o268j819J3511j6283K0319M6153M0531n6643
$$ 25888 -33634 -16646 -48295 -79145 -85413 -87232 -73721 -90004 -69685 -23532 16999 -39644
11013c9644l6854j7083K5605M5829r774J7679J5468n2890p1834K2252K9349K385
$$ -39644 -76498 -93581 -67976 -22147 -31921 -14242 1226 -51664 -123498 -101246 -71897 -69512
11001f9512J5134M2213r830r775j0319L2548J5578J024M0106J934l453j7448j9338
$$ -69512 -54378 -12165 -21995 -31770 -42089 -9541 6037 7061 47167 49101 45648 28200 8862
10988H862r263j3003M4855N3546k3899m6170j2430p647J5030j8035m497K6054
$$ 8862 -401 -13404 31451 84997 61098 14928 2498 -5149 9881 -8154 -12651 13403
10976A3403M93l3427j5840L7284K6850m531K997j65o762k6434l2091l23l5159
$$ 13403 13896 -19531 -35371 1913 28763 24232 27229 27064 20302 -6132 -38223 -38546 -73705
10963g3705J2200j5968K8794J6675k4599p29K0330k328j7458M1228O70r305l1940
$$ -73705 -61505 -77473 -48679 -32004 -56603 -57332 -37002 -39330 -56788 -15560 -14890 -24195 -56135
10950e6135l1974O611N7920L029j8482M4038m231k825J9753J5302K1020m6203
$$ -56135 -88109 -81498 -23578 -20549 -39031 5007 776 -2049 17704 33006 54026 7823
10938G823m0253j8012m277j7380L5223N1181M7300R234m7182l4968J1420j4009
$$ 7823 -32430 -50442 -54719 -72099 -36876 14305 61605 70839 23657 -11311 109 -13900
10926a3900l2640k5917j4920R253J6559N4661K1648K9588O478R05l3178O987j4491
$$ -13900 -46540 -72457 -87377 -78124 -61565 -6904 14744 44332 50810 51715 18537 25524 11033
10913A1033m6544l1124K6239J8709M551L1795j6947l267J4693l3842n2082K1505
$$ 11033 -35511 -66635 -40396 -21687 -17136 14659 -2288 -5555 9138 -24704 -76786 -55281
10901e5281L7888K4379J5122l6044l6572K9712M6301L7725j0979j9444K552K3612
$$ -55281 -17393 6986 22108 -13936 -50508 -20796 25505 63230 52251 32807 35359 58971
10889E8971J8737Q610n3714k6742L3554M988l3732k9168J9434J2102j9503o318
$$ 58971 77708 86318 32604 5862 39416 44404 10672 -18496 938 13040 -6463 -12781
10877a2781L5904l353k6216k7632K1728K6422J5550k3945j1627k270r327J4273
$$ -12781 23123 19770 -6446 -34078 -12350 14072 29622 5677 -5950 -8220 -17547 -3274
10865c274L4157J2247k1045j6094n1846J5090O088J5115k3335l064K2320K2109
$$ -3274 30883 43130 22085 5991 -45855 -30765 -24677 -9562 -32897 -35961 -13641 8468
10853H468j2706j6915j2226k478L4374M7863J301r558j9291q5717m1635M1053
$$ 8468 -4238 -21153 -33379 -35857 -1483 46380 47681 38123 18832 -66885 -108520 -67467
10841f7467Q819N165Q223K6142k3521j5084J3917J1417J0157r977n583L0282k5048
$$ -67467 -58648 -53483 -45260 -19118 -42639 -57723 -43806 -32389 -22232 -32209 -37792 -7510 -32558
10828c2558O741j4848K1490O9916J7687n8084n1071L7532r18j7098l82N0367J0978
$$ -32558 -25817 -40665 -19175 50741 68428 10344 -40727 -3195 -4113 -21211 -21593 28774 39752
10815C9752k3223J0390m827l2298N818J6796J2115L6775j6895k6483l0680L492
$$ 39752 16529 26919 22092 -10206 -4388 12408 24523 61298 44403 17920 -12760 -9268
10803i268L3319K1851o609j3140j6184k5845k9000n03L8281K1445O603L903j4561
$$ -9268 24051 45902 39293 26153 9969 -15876 -44876 -45379 -7098 14347 20950 24853 10292
10790A0292J3975q379L7447L0277k9230l0473M616o405j5629k396K8727m8737
$$ 10292 24267 15888 53335 83612 54382 23909 28525 22120 6491 4095 32822 -15915
10778a5915n8700r19R225L2362m064L3404j6360k175p825J0224k7681L4666j3634
$$ -15915 -74615 -75534 -66309 -33947 -38011 -4607 -20967 -23142 -30967 -20743 -48424 -13758 -27392
10765b7392M353L1817K5651o850k0953K8024l9887j8836K7812J5017k1605o9235
$$ -27392 -23039 8778 34429 27579 6626 34650 -5237 -24073 3739 18756 -2849 -72084
10753g2084l1625M6795O6243J4349K436k8961k5830k1871m0647K1357j502k3444
$$ -72084 -103709 -56914 9329 23678 26114 -2847 -28677 -50548 -91195 -69838 -71340 -94784
10741i4784L5820q301o312o336L1042J0388J1313N3676j2842l7422l367k8488
$$ -94784 -58964 -67265 -73577 -79913 -48871 -38483 -27170 26506 13664 -23758 -27125 -55613
10729e5613m807k0237J1196l224J9609J0151j4410Q152L520J4327J5182Q846k8362
$$ -55613 -60420 -80657 -69461 -72685 -53076 -42925 -57335 -49183 -45663 -31336 -16154 -7308 -35670
10716c5670J3501J8047j9407P488J476K4052r989l618l0206j478L2377Q619k209
$$ -35670 -22169 -4122 -23529 -16041 -14565 9487 -502 -4120 -34326 -35804 -3427 5192 2983
10703B983K9372o025M4807L8140m397o6188q253l8369J4305K2742K7987K0452
$$ 2983 32355 26330 71137 109277 104880 38692 30439 -7930 6375 29117 57104 77556
10691G7556J0776k9014l5314J3914K1394l5407n9728N0927J3928L566K4323p947
$$ 77556 88332 59318 24004 37918 59312 23905 -35823 15104 29032 32598 56921 48974
10679D8974l6399k1816J0664K6586K4411L3342K0040m1147k4357j3476L137j8871
$$ 48974 12575 -9241 1423 28009 52420 85762 105802 64655 40298 26822 29959 11088
10667A1088k4262m0677M2749M8971L5924K882L23j9171m1245j1723j6003K0247
$$ 11088 -13174 -53851 -11102 37869 73793 76675 76998 57827 16582 4859 -11144 9103
10655I103K9863J2208l5868L7339J9003j129j9890p922j1313r322j1543j2354
$$ 9103 38966 51174 15306 52645 71648 70519 50629 42707 31394 22072 10529 -1825
10643a825J6844l7429J7173K3023L4925K2069q0453n0211L0099J6390k6669J0980
$$ -1825 15019 -22410 -5237 17786 52711 74780 -5673 -55884 -25785 -9395 -36064 -25084
10631b5084M9907K7359J1392j1212l9204q272M7156j7878m3370j4838j7279R82
$$ -25084 24823 52182 63574 52362 13158 4886 52042 34164 -9206 -24044 -41323 -40341
10619d0341r795L0652J012k2322j3845K1314J8286K1037M2990k9594n76Q622j2061
$$ -40341 -50136 -19484 -18472 -40794 -54639 -33325 -15039 5998 48988 19394 18818 27440 15379
10606A5379m9927q893K0759j181p657L7114k8712j2999K56j1572O9963j610l1676
$$ 15379 -34548 -43441 -22682 -23863 -31520 5594 -23118 -36117 -35861 -47433 22530 20920 -10756
10593a0756k2275k3311k3589J633L8791L5267K8927Q516J0685l1994j7160L30
$$ -10756 -33031 -56342 -79931 -78298 -39507 -4240 24687 33203 43888 11894 -5266 -4936
10581d936q852J9251k7923j2340n534J3084L406q123J3316k159J1737J2294j3222
$$ -4936 -13788 5463 -22460 -34800 -40334 -27250 -23844 -31967 -18651 -20810 -9073 3221 -10001
10568a0001n2110j9729L6253O390j1384J659k940m5171J0292L8675J0473K0875
$$ -10001 -62111 -81840 -45587 -39197 -50581 -48922 -51862 -97033 -86741 -48066 -37593 -16718
10556a6718K1973K838n4723k922k9458L1103O892P16J839j036K726L2280P392
$$ -16718 5255 8093 -46630 -49552 -79010 -47907 -41015 -40299 -38460 -39496 -36770 -4490 2902
10543B902k943L2136J8691n401j267K4041K48j8615l528l12j1188m095l1900k3816
$$ 2902 -41 32095 50786 45385 44118 68159 68407 49792 46264 45952 34764 30669 -1231 -25047
10529b5047l9740j5108K9050L290K0200k5793j2622L7180k7924l5912J1530N883
$$ -25047 -64787 -79895 -50845 -47555 -27355 -53148 -65770 -28590 -56514 -92426 -80896 -75013
10517g5013K9607l226o2725J3682K4966r450M3764M989l781m937k7940l1839L7769
$$ -75013 -45406 -48632 -111357 -97675 -72709 -82159 -38395 -33406 -37187 -42124 -70064 -101903 -64134
10504f4134J795R970M778L006j9645N769K5721M7617L5779M0086j3212o5852J7616
$$ -64134 -62339 -52369 -47591 -44585 -64230 -58461 -32740 14877 50656 90742 77530 11678 29294
10491B9294J3987k2131l9856m0208J9483J4023K696K1629J8730J2699M203k3532
$$ 29294 43281 21150 -18706 -58914 -39431 -25408 -22712 -1083 17647 30346 34549 11017
10479A1017l8011j2507Q12J76k2994m570j1302l296J862L4015K8041k5010l5299
$$ 11017 -26994 -39501 -38689 -38513 -61507 -66077 -77379 -80675 -78813 -44798 -16757 -41767 -77066
10466g7066q384K3256m270J5143M3933N3814K7513K3931k3973l7833J6241r397
$$ -77066 -85450 -62194 -66464 -51321 -7388 46426 73939 97870 73897 36064 52305 42908
10454D2908j6231r769j9695M6392K911J361k6016o635M8866J1433n3706j56o668
$$ 42908 26677 16908 -2787 43605 46516 47877 21861 15226 64092 75525 21819 21663 14995
10441A4995n338K0207p723J3332j9272j1688k153K856J2043M7217K6414j6959
$$ 14995 9657 29864 22141 35473 16201 4513 2360 5216 17259 64476 90890 73931
10429G3931l6444J168k0693j4344J8112k0760l1122l2387q678L3571L3461j2509
$$ 73931 37487 38655 17962 3618 21730 970 -30152 -62539 -71217 -37646 -4185 -16694
10417a6694m6720p468J216j4338n78k1421R173N7652J7087l362L2306J709j6819
$$ -16694 -63414 -70882 -69666 -84004 -84582 -106003 -96830 -39178 -22091 -25453 6853 8562 -8257
10404h257j0500k736l0671O038K0874J4882J5105K1045q103j5602k0339L459r859
$$ -8257 -18757 -21493 -52164 -46126 -25252 -10370 4735 25780 17677 2075 -18264 -14805 -24664
10391b4664J0996k5382n464r626K2374J3273j2016k9813O330J5762M5855j1676
$$ -24664 -13668 -39050 -44514 -54140 -31766 -18493 -30509 -60322 -53992 -38230 7625 -4051
10379d051m0741l6136K14j869K876P3074M1336k8827l775j7796n3125N604J7930
$$ -4051 -44792 -80928 -80714 -82583 -79707 -6633 34703 5876 2101 -15695 -68820 -63216 -45286
10366d5286L3707N026l1016n9686J1980O440l0359K3316J2311K7830M4873J6160
$$ -45286 -11579 -6553 -37569 -97255 -85275 -78835 -109194 -85878 -73567 -45737 -864 15296
10354A5296K9060k499o2555J0114k550j4159m3309j9790L4725L0706K230M5166
$$ 15296 44356 41857 -20698 -10584 -13134 -27293 -70602 -90392 -55667 -24961 -22731 22435
10342B2435J4143j0811M5628K5461K8839m9299m1568k7930j5230K1149J4833j3907
$$ 22435 36578 25767 71395 96856 125695 76396 34828 6898 -8332 12817 27650 13743
10330A3743j0196K896j0769n3692p975j1330P730O1104K9166J5861k9568o66n0965
$$ 13743 3547 6443 -4326 -58018 -65993 -77323 -69593 -8489 20677 36538 6970 6304 -44661
10317d4661k1977K0595K8543o658j7259O861j9003k5479o141J2960O2858O2857
$$ -44661 -66638 -46043 -17500 -24158 -41417 -34556 -53559 -79038 -85179 -72219 -9361 53496
10305E3496j7210m8976l4166J7527K5121k037m5847j5394K8380k6350j4178N5971
$$ 53496 36286 -12690 -46856 -29329 -4208 -6245 -52092 -67486 -39106 -65456 -79634 -23663
10293b3663O5319j8973l6823k2113K6002K902l2959l1218P4287O8453J4361j2436
$$ -23663 41656 22683 -14140 -36253 -10251 -7349 -40308 -71526 2761 71214 85575 73139
10281G3139l4421m647M9459l0347m188J869j9779k1357k8925k5021L0849L0398
$$ 73139 38718 34071 83530 53183 48995 50864 31085 9728 -19197 -44218 -13369 17029
10269A7029l1033N50K4202n399j2466J4795K3904j3508j3058O524n846J5036k377
$$ 17029 -14004 -13454 10748 5349 -7117 7678 31582 18074 5016 11540 5694 20730 18353
10256A8353K129l9779n8776O262P0979N2404m990k504k781k8038l3452J1312L061
$$ 18353 20482 -19297 -78073 -71811 -832 51572 46582 44078 41297 13259 -20193 -8881 -5820
10243e820K1589q334j1128n567j5799O44O383L8889L1302q029r217o587j7946
$$ -5820 15769 7435 -3693 -9260 -25059 -24415 -18032 20857 52159 44130 34913 28326 10380
10230A0380J2492J4223l9455P606J3497l4827k3023J4362N4893K2149p145m5139
$$ 10380 22872 37095 -2360 5246 18743 -16084 -39107 -24745 30148 52297 45152 13
10218A3m345K8364j3073p5626j994K9797j0202M6198L1821p206o143j4543J1918
$$ 13 -4332 24032 10959 -64667 -66661 -36864 -47066 -868 30953 23747 17604 3061 14979
10205A4979j5919J3463J5453l9172J7197o248m1574J008M3730J8526O649p185
$$ 14979 -940 12523 27976 -11196 6001 -247 -41821 -40813 2917 21443 28092 20907
10193B0907k0445J584o207k4875q427J2021K8303l6369J2978K4242N208n05j0616
$$ 20907 462 2046 -4161 -29036 -37463 -25442 2861 -33508 -20530 3712 8920 8415 -2201
10180b201o43M5277M2506K2669K959o474j282M1059L7532l6985l9979j962p225
$$ -2201 -2844 42433 84939 107608 110567 104093 102811 143870 181402 144417 104438 102476 95251
10167I5251j2590J2378k3128n8258m2709k302j5902r530o139L6423J5004J2372
$$ 95251 82661 95039 71911 13653 -29056 -31358 -47260 -56790 -62929 -26506 -11502 870
10155H70p396M0303J2253l041l5208M9120J4140n4724j4892K2001K309l9463k0698
$$ 870 -6526 33777 46030 42989 7781 56901 71041 16317 1425 23426 25735 -13728 -34426
10142c4426J4217j5501K6266Q799Q662k0636m698K827k8125L9725K8076J924j5832
$$ -34426 -20209 -35710 -9444 -645 8017 -12619 -17317 -14490 -42615 -2890 25186 27110 11278
10129A1278j5379p468J18m733j6578q313j7173K0866k701j2992r010K0319R129
$$ 11278 -4101 -11569 -11451 -16184 -32762 -41075 -58248 -37382 -40083 -53075 -62085 -41766 -32637
10116c2637M885l0843j5586M8694J6068J3811K483l8017m455K8403K2669j0678
$$ -32637 -27752 -58595 -74181 -25487 -9419 4392 6875 -31142 -35597 -7194 15475 4797
10104D797k2066m321j6539j3139K3212J8157J6776O847l0489M457K7106j2971
$$ 4797 -17269 -21590 -38129 -51268 -28056 -9899 6877 13724 -16765 -12308 14798 1827
10092A827L432j3656n4995K643K6158P932J1134o599K4026k3259k0071J2516O3914
$$ 1827 5259 -8397 -63392 -60749 -34591 -26659 -15525 -22124 1902 -21357 -41428 -28912 35002
10079C5002p786O199L1807K7931l9998n8075k5781N150J8562m680J1473r308L939
$$ 35002 27216 33415 65222 93153 53155 -4920 -30701 -25551 -6989 -11669 -196 -9504 -5565
10066e565Q815j4743r550J6920p578l6688j4837l380M2771L3205J6142K4013L5229
$$ -5565 3250 -11493 -21043 -4123 -11701 -48389 -63226 -66606 -23835 9370 25512 49525 84754
10053H4754j8841m4401J8943K039n6078o3830N95O0092M1919k0266l4854N2173
$$ 84754 65913 21512 40455 42494 -13584 -77414 -76819 -16727 25192 4926 -29928 22245
10041B2245L3870l045j1347j8311n4223k7617J7363j3921k4168K4205L7394j0676
$$ 22245 56115 53070 41723 23412 -30811 -58428 -41065 -54986 -79154 -54949 -17555 -28231
10029b8231J3794K6781l1549m1618O11K5345K6744j0827j4191M3206k455j2442
$$ -28231 -14437 12344 -19205 -60823 -60212 -34867 -8123 -18950 -33141 10065 7610 -4832
10017d832k5526k5453O169P911r861J4270J4195j2624o840J0559K3113R626J2708
$$ -4832 -30358 -55811 -49642 -41731 -51592 -37322 -23127 -35751 -42591 -32032 -8919 707 13415
10004A3415j0049j8029m273J0878q609m732M4889K2861L024L1435m94M7002Q8712
$$ 13415 3366 -14663 -18936 -8058 -16667 -21399 23490 46351 49375 80810 80316 127318 216030
9991B16030J45612J60448J48023O0607j35800k35248j58858q2450n0092K5420
$$ 216030 361642 522090 670113 730720 594920 359672 200814 118364 68272 93692
9981I3692P505m5121N954J203j0756o097K2563L6423M0438L7314k4371m1772j108
$$ 93692 101197 56076 62030 63233 52477 46380 68943 105366 145804 183118 158747 116975 115867
9968A15867p207j2680n7180l0603k5125L1921L7940J5964o777j21k5605k1103
$$ 115867 108660 95980 38800 8197 -16928 14993 52933 68897 62120 61999 36394 15291
9956A5291k6469P937R800k845K0445j6024j1091k6097m6039M9323J8675p062J6373
$$ 15291 -11178 -3241 6559 3714 24159 8135 -2956 -29053 -75092 -25769 -7094 -14156 2217
9943B217M751K7683K86k8636J7580M1096k4902j8105k5459L2183M9866M0141l9189
$$ 2217 6968 34651 34937 6301 23881 64977 40075 21970 -3489 28694 78560 118701 79512
9930G9512J3559l0060N123J9864p70l7017m7314p428K6199M2375J279j4472k2961
$$ 79512 93071 63011 68134 87998 87228 50211 2897 -4531 21668 64043 65322 50850 27889
9917B7889m1906J4050M0905L396j5749l2792k2023j3346M3318J0288p653Q644
$$ 27889 -14017 33 40938 44334 28585 -4207 -26230 -39576 3742 14030 6377 15021
9905A5021m3742m27O672l300q205q829J912L6531J6132j2483J0603j978k0876
$$ 15021 -28721 -29148 -22476 -25776 -33981 -42810 -40898 -4367 11765 -718 9885 7907 -12969
9892a2969K4378L5483k6438k953Q548j8189j0821k2979R709K6916K0255j1988
$$ -12969 11409 46892 20454 17501 26049 7860 -2961 -25940 -16231 10685 30940 18952
9880A8952m3169m0689k1198J7492L9021M2329j1112j7477L613M3416K943L3161
$$ 18952 -24217 -64906 -86104 -68612 -29591 12738 1626 -15851 -12238 31178 34121 67282
9868F7282n557k4479m2735O1016Q9663j9794m989l6661m1048K9963K6181l0682
$$ 67282 61725 37246 -5489 55527 145190 125396 120407 83746 42698 72661 98842 68160
9856F8160p7099l9647j6329K9564L169J3798j1524l036p853L2123J3861j1105
$$ 68160 -8939 -48586 -64915 -35351 -32182 -18384 -29908 -32944 -40797 -8674 5187 -5918
9844e918j0993k8101J977J8538L9750j3807l371k8846J261j9942L0987L8499l1048
$$ -5918 -16911 -45012 -43035 -24497 15253 1446 -1925 -30771 -29510 -49452 -18465 20034 -11014
9831a1014M345J6532J7912L7687r634k0270k3086n4634r967K5439k6844J743J7747
$$ -11014 -6669 9863 27775 65462 55828 35558 12472 -42162 -52129 -26690 -53534 -51791 -34044
9818c4044J2236J5813n015q59j3785K7429M0380l4795n1576j0831l4902j6080
$$ -34044 -21808 -5995 -11010 -11869 -25654 1775 42155 7360 -44216 -55047 -89949 -106029
9806a06029L4974Q1467K4261l710k3596P208J4347K3287j1952j4048m0698m2236
$$ -106029 -71055 10412 34673 30963 7367 14575 28922 52209 40257 26209 -14489 -56725
9794e6725j0755L9011M1799Q927P939l74J2163k7939J7821n418p0466m468L6612
$$ -56725 -67480 -28469 13330 22257 30196 29822 41985 14046 31867 26449 -44017 -48485 -11873
9781a1873R616o0268M376L141n074L527M1962K1744L0j2520J3088j0693M852M296
$$ -11873 -2257 -62525 -58149 -55008 -60082 -56555 -14593 7151 7181 -5339 7749 -2944 1908 6204
9767F204m1596K5651R124l6608K5320J9960k7833J7556q964m131J5473O501m1594
$$ 6204 -35392 -9741 -617 -37225 -11905 8055 -19778 -2222 -11186 -15317 156 6657 -34937
9754c4937j0261L7764M503j6038m127K1954j106k0354m4866M7972L786k8551j8555
$$ -34937 -45198 -7434 -2931 -18969 -23096 -1142 -2248 -22602 -67468 -19496 -15710 -44261 -62816
9741f2816L8763L5212N05j1308K0609N722k0586l0658k6049O026p046k3640K3388
$$ -62816 -24053 11159 11664 356 20965 26687 6101 -24557 -50606 -44580 -51626 -75266 -51878
9728e1878L1866j0824k5897J2569q227P874J9647O826k2428J4184L0024M2583
$$ -51878 -20012 -30836 -56733 -44164 -52391 -44517 -24870 -18044 -40472 -26288 3736 46319
9716D6319j8957m5085k4480O319l103J5114m715J9162m9887r114J1287L8914L3891
$$ 46319 27362 -17723 -42203 -35884 -38987 -23873 -28588 -9426 -59313 -68427 -57140 -18226 15665
9703A5665J2774K110N389J3756k2923l4394K792L8755J8540l3518M3384L4957
$$ 15665 28439 30549 35938 49694 26771 -7623 -4831 33924 52464 18946 62330 97287
9691I7287n7341j4545j5634m7305m1039O074N9024N8367p945r281k9939j0432
$$ 97287 39946 25401 9767 -37538 -78577 -72503 -13479 44888 36943 27662 -2277 -12709
9679a2709J1628R416J1816L6162K6672j0495m3880l6028J1807m4033k7884J5499
$$ -12709 -1081 8335 20151 56313 82985 72490 28610 -7418 4389 -39644 -67528 -52029
9667e2029K7494j3891n335j1590K7906Q387K7655m194j1004P141q819J2607J1676
$$ -52029 -24535 -38426 -43761 -55351 -27445 -19058 8597 4403 -6601 540 -8279 4328 16004
9654A6004j7476j7128j6211K5288K4990J0343R805k0375Q086k4931m9338l200
$$ 16004 -1472 -18600 -34811 -9523 15467 25810 35615 15240 23326 -1605 -50943 -54143
9642e4143K7251K6786k6523k6834O5778N2012n2235j5432J4286k8256j685K4675
$$ -54143 -26892 -106 -26629 -53463 12315 64327 12092 -3340 10946 -17310 -18995 5680
9630E680O872j8209J1315N5639K6795l5379Q960k60j3755j5969k3476k3667l724
$$ 5680 12552 -5657 5658 61297 88092 52713 61673 61413 47658 31689 8213 -15454 -19178
9617a9178j164K952L3643M192k0388j0134o134J5252q960k8469l4277J275L3704
$$ -19178 -20342 -17390 16253 20445 57 -10077 -16211 -959 -9919 -38388 -72665 -71390 -37686
9604c7686J3853j901l509N382M550k5333K5529L1012J3421J939n253j0283L5735
$$ -37686 -23833 -25734 -29243 -23861 -19311 -44644 -19115 11897 25318 27257 22004 11721 47456
9591D7456O590k9898l4642J66N0563L4518r772j6896k9798k0788K2384o533J585
$$ 47456 54046 24148 -10494 -10328 40235 74753 64981 48085 18287 -2501 19883 13350 14935
9578A4935J0064O028j5533p006N852J0703k2124K2586R521j8927l1411J0062L781
$$ 14935 24999 31027 15494 8488 14340 25043 2919 25505 35026 16099 -15312 -5250 -1469
9565a469k1948P208K3536J1738k6526M795J9440K9120k2604o6336N07J8095J4275
$$ -1469 -23417 -16209 7327 19065 -7461 -2666 16774 45894 23290 -43046 -42539 -24444 -10169
9552a0169K5280M5255o447m7829m8219k7961k456J9847J0179Q670P476k5978l945
$$ -10169 15111 60366 53919 6090 -42129 -70090 -72546 -52699 -42520 -33850 -26374 -52352 -56297
9539e6297j319j0427j668l3081J2262L2721M7397K3028j1286k4966l1350O5971
$$ -56297 -57616 -68043 -69711 -102792 -90530 -57809 -10412 12616 1330 -23636 -54986 10985
9527A0985J4166k5191N71J133J0758o67l843M3001J2383m4127J8419o879K3217
$$ 10985 25151 -40 531 1664 12422 11755 7912 50913 63296 19169 37588 30709 53926
9514E3926m033o5316K3840L9138J290k8316p1712q818J0666j1362K8951R159j2421
$$ 53926 49893 -15423 8417 47555 48845 20529 -51183 -60001 -49335 -60697 -31746 -22587 -35008
9501c5008J7812N2211M8974j04p1365m7972l1866J4330K2399l5885k234L4006
$$ -35008 -17196 35015 83989 83885 12520 -35452 -67318 -52988 -30589 -66474 -68708 -34702
9489c4702k7894r571Q6285L6086j5636j6726N865l216L3679l1476n300j2760K7061
$$ -34702 -62596 -72167 14118 50204 34568 17842 23707 20491 54170 22694 17394 4634 31695
9476C1695R21n202L736L1902M4315k1332j9331L1180j1406k8867m0866j6000P11
$$ 31695 32616 27414 31150 63052 107367 86035 66704 97884 86478 57611 16745 745 1456
9463A456N208n667J3310R885m393J7407L8085l712o5202l1087m521L0380L4802
$$ 1456 6664 997 14307 24192 19799 37206 75291 71579 6377 -24710 -29231 1149 35951
9450C5951N513j8821J1046m3343j526K4589K9747M1054j6198n2152K514j4710
$$ 35951 41464 22643 33689 -9654 -11180 13409 43156 84210 68012 15860 18374 3664
9438C664j3086k3083r994J4364O016J1308J1333l5263j1399J4576j903j5910k1207
$$ 3664 -9422 -32505 -42499 -28135 -22119 -10811 522 -34741 -46140 -31564 -33467 -49377 -70584
9425g0584q28J7916L5438K1711j926j6653K0227K2191J3218j8818L3057q809l6680
$$ -70584 -71412 -53496 -18058 3653 1727 -14926 5301 27492 40710 21892 54949 46140 9460
9412I460j7625k979J6007M4208Q473j0675l2510J9696l48K3394N8281o1l0985
$$ 9460 -8165 -11144 4863 49071 57544 46869 14359 34055 33707 57101 115382 115321 84336
9399H4336j7386k6330n7712K2164l574K0341k2701n2473n889J3439K0979K1365
$$ 84336 66950 40620 -17092 5072 1498 21839 -862 -53335 -59224 -45785 -24806 -3441
9387c441J3700K4217R477k3006J8565l3330j2096Q326J7054M0159M9302K505j2750
$$ -3441 10259 34476 43953 20947 39512 6182 -5914 2412 19466 59625 108927 111432 98682
9374I8682N354k0149m2216n3692j8564J2942K0982L9071J5093l3727l691R470
$$ 98682 104036 83887 41671 -12021 -30585 -17643 3339 42410 57503 23776 20085 29555
9362B9555k2205J5837l835j660l3704j901J4578K6807N1901O1773j1512n8204
$$ 29555 7350 23187 19352 17692 -16012 -17913 -3335 23472 75373 137146 125634 67430
9350F7430r220J9727l8128k2243N51j4475M2L2334J0087k9366j9060J7246Q933
$$ 67430 58210 77937 39809 17566 18117 3642 3684 36018 46105 16739 -2321 14925 23858
9337B3858l8921k1070P613K2812J532p805K9227N269j101l654L48K8525K0650
$$ 23858 -15063 -36133 -28520 -5708 -4176 -11981 17246 22515 21414 17760 18108 46633 67283
9324F7283K2913j5067J5749j295j9607N674M3298k4603k4839l6200j1609k2884
$$ 67283 90196 75129 90878 89583 69976 75650 118948 94345 69506 33306 21697 -1187
9312a187J4339r905j6420k4660L035k994M9068j6365l9490J9384L3980M0903l0533
$$ -1187 13152 3247 -13173 -37833 -34798 -37792 11276 -5089 -44579 -25195 8785 49688 19155
9299A9155j8681j2998j0169l1343n9496P906K1207J6069L7876L6240j605k3808
$$ 19155 474 -12524 -22693 -54036 -113532 -105626 -84419 -68350 -30474 5766 4161 -19647
9287a9647j5048K8726K7697j0126J9618K8045k3460P33M606j1608k8731k3674
$$ -19647 -34695 -5969 21728 11602 31220 59265 35805 36538 41144 29536 805 -22869
9275b2869j701L1099M0421j2874o888N46J3502J5353k8697n3774m4947Q082j4701
$$ -22869 -24570 6529 46950 34076 27188 27734 41236 56589 27892 -25882 -70829 -62747 -77448
9262g7448R700M4926M2059Q277k4835Q378k3164k0463J3677m2474o630M8687L6751
$$ -77448 -67748 -22822 19237 27514 2679 11057 -12107 -32570 -18893 -61367 -67997 -19310 17441
9249A7441l3856l1270L5738K6975p476J0454J746N553k4032j7594q606J2541O372
$$ 17441 -16415 -47685 -11947 15028 7552 18006 19752 25305 1273 -16321 -24927 -12386 -6014
9236f014K1424q275R624j5111L6820p75p92m3490l1847J694j0836J1169N406j7281
$$ -6014 15410 7135 16759 1648 38468 37693 36901 -6589 -38436 -36742 -47578 -36409 -31003 -48284
9222d8284M5873M210J3822r694o388K7252K7722j2129k108k6752O319K6616r454
$$ -48284 -2411 1799 15621 5927 -461 26791 54513 42384 40276 13524 19843 46459 37005
9209C7005l0214k8035J1201J3826L0495P663j3175P038j3159Q277K9339L1166
$$ 37005 6791 -21244 -10043 3783 34278 41941 28766 35804 22645 30922 60261 91427
9197I1427Q11k6722j0721K9649K10m4018j4410J456l8976r83P240R980M7806J529
$$ 91427 92238 65516 54795 84444 84654 40636 26226 27682 -11294 -12277 -5037 4943 52749 54278
9183E4278j7188Q29j3962L555j0734n7016m9058L9820M1154j2335j5239q561K0952
$$ 54278 37090 37919 23957 27512 16778 -40238 -89296 -49476 -8322 -20657 -35896 -44457 -23505
9170b3505L3639l833N916j3558K0671L937j0210K2388K2022M095R536J9953l4265
$$ -23505 10134 6301 12217 -1341 19330 23267 13057 35445 57467 61562 71098 91051 56786
9157E6786r162k82o352K9304L9956j8668k8633l3876k6868J2009J5887J1758L7732
$$ 56786 47624 47342 40990 70294 110250 91582 62949 29073 2205 14214 30101 41859 79591
9144G9591J4155m5633k2493k8064k605m0858j3649M7712L8500m8099m0592K5202
$$ 79591 93746 48113 25620 -2444 -5049 -45907 -59556 -11844 26656 -21443 -62035 -36833
9132c6833O0350m5966k8859J3500K3795J1568j2445K5704j4226l581K9265L9181
$$ -36833 23517 -22449 -51308 -37808 -14013 -2445 -14890 10814 -3412 -6993 22272 61453
9120F1453q406l4161J3065q93L9295j2892m2962K9422M517j0169j0025P054K0257
$$ 61453 53047 18886 31951 31058 70353 57461 14499 43921 48438 38269 28244 35298 55555
9107E5555J0171l0027J7007N6192k9143j9944j4943o686J0798N3172J3722j3129
$$ 55555 65726 35699 52706 108898 79755 59811 44868 38182 48980 102152 115874 102745
9095A02745n8173J2317N0670L022L1569K8066k698K368J3182k018n074K507R82
$$ 102745 44572 56889 107559 110581 142150 170216 167518 169886 183068 181050 175976 178483 179465
9082A79465M741P2586K8127P170l3296K8928N4651J01885Q4560R105N2452L8660
$$ 179465 184206 256792 284919 292089 258793 287721 342372 444257 528817 537922 590374 629034
9070F29034J30279J72832K23561K87004L67149M58707P39900J286769K188397
$$ 629034 759313 932145 1155706 1442710 1809859 2268566 3008466 4295235 6483632
9061F483632L811694N997164P703731O733235r58462r486575p160947l937013
$$ 6483632 10295326 16292490 23996221 30729456 29770994 20284419 13123472 9186459
9053I186459k227006j351902q66334n42105m06502l67509l02240l01745k15726
$$ 9186459 6959453 5607551 4741217 4199112 3792610 3425101 3122861 2821116 2605390
9044B605390k04726j53318j12821j10457j19910n9252m3467q7651o4664k8409
$$ 2605390 2400664 2247346 2134525 2024068 1904158 1844906 1801439 1713788 1649124 1620715
9034A620715k9264q8720j00726m0194l2320o3921l4131l6621j765p7930p5598
$$ 1620715 1591451 1502731 1402005 1361811 1329491 1265570 1231439 1194818 1193053 1115123 1039525
9023A039525K545l7505o5954l0278n5855k1471J3468o679p356N316K003K5823
$$ 1039525 1042070 1004565 938611 908333 852478 831007 844475 837796 830440 835756 837759 863582
9011H63582k2666o6026r1702p575M950n283m9343l1586J0333K6474k1854k1980
$$ 863582 840916 774890 683188 675613 680563 675280 625937 594351 604684 631158 609304 587324
8999E87324l424j2675J4407r652l6716l3325k2335M2486P257o5630o6552j3884
$$ 587324 583900 571225 585632 575980 539264 505939 483604 526090 533347 467717 401165 387281
8987C87281L9250L0381k0304l2298o7157m785L0820r129j5004l486k2555K4133
$$ 387281 426531 456912 436608 404310 337153 332368 363188 354059 339055 335569 313014 337147
8975C37147O995J1785l5246m0505k2931l3572k6273K5324M005k7548L129P6222
$$ 337147 344142 355927 320681 280176 257245 223673 197400 222724 226729 199181 202310 278532
8963B78532P0577k1004p9108l0077K0030K6230j0436l1837k0109K6796L4410j0041
$$ 278532 349109 328105 248997 218920 238950 265180 254744 222907 202798 229594 264004 253963
8951B53963k8456l5866m1285O0379j5285l6947J2230j6773p2838O370j6834j7895
$$ 253963 225507 189641 148356 208735 193450 156503 168733 151960 79122 85492 68658 50763
8939E0763J9863M4534J1406K9312k2356k7334Q743K8913l492k475K4273m6004
$$ 50763 70626 115160 126566 155878 133522 106188 114931 143844 140352 137877 162150 116146
8927A16146m6621L068k3963M2113O0369l4352k8471k4522k3176j9857L5938M3428
$$ 116146 69525 72593 48630 90743 151112 116760 88289 63767 40591 20734 56672 100100
8915A00100k931j3118J8370m7620r628K0295q878m2708J2404N3460n409J1274
$$ 100100 97169 84051 102421 54801 45173 65468 56590 13882 26286 79746 74337 85611
8903H5611P393j5414L728Q193l9567l5837J7803n088j37J1588L455j262J3548
$$ 85611 93004 77590 81318 89511 49944 14107 31910 26822 26685 38273 41728 40466 54014
8890E4014k1077k7308l3426M315K0924j6454N0931K4406n098k8148j2884M8158
$$ 54014 32937 5629 -27797 -23482 -2558 -19012 31919 56325 51227 23079 10195 58353
8878E8353K0580j0624j5183j0528j4060K8288k5669n1684R156P840O706K6882
$$ 58353 78933 68309 53126 42598 28538 56826 31157 -20527 -11371 -3531 3175 30057
8866C0057L5727j7674k7004o076n876K1075k8816r445L0765l047J7910j2528n6939
$$ 30057 65784 48110 21106 15030 9154 30229 1413 -8032 22733 19686 37596 25068 -31871
8853c1871K0186O01l3923K4332O6627M8994l0667k2515j8360K8501P462K1658
$$ -31871 -11685 -11084 -45007 -20675 45952 94946 64279 41764 23404 51905 59367 81025
8841H1025j7810l2534o15j9431K7517J3509J8625J1244k0020j3793J5562K402
$$ 81025 63215 30681 30066 10635 38152 51661 70286 81530 61510 47717 63279 65681
8829F5681j5777j9522l0161J2163L1527K7123K6380K666O035J0021k6623l9668
$$ 65681 49904 30382 221 12384 43911 71034 97414 100080 106115 116136 89513 49845
8817D9845j0337j9283l7141K9684O1368P0798M0077M4753Q4277J42701J97352
$$ 49845 39508 20225 -16916 12768 74136 144934 185011 229764 314041 456742 654094
8806F54094J16945j9747j57323j55072j00169l7899o2770l8566l3361n1380J0849
$$ 654094 771039 751292 593969 438897 338728 300829 238059 199493 166132 114752 125601
8795A25601M0879k0786o5426Q001K8990N235j8671Q14Q050j7470L965j4944k1379
$$ 125601 166480 145694 80268 88269 117259 122494 103823 104637 112687 95217 99182 84238 62859
8782F2859K5197N2915m0791l5133j6645k9615J1808J7597j6742R193J9664l210
$$ 62859 88056 140971 100180 65047 48402 18787 30595 48192 31450 40643 60307 57097
8770E7097K644K7232N464l3779l6751k8184N1578J0357r496O351j6264L0446L4311
$$ 57097 59741 86973 92437 58658 21907 -6277 45301 55658 46162 52513 36249 66695 101006
8757A01006l0950j594j3711l1461j489p078p942l7925M730J457K79L1111N1m4044
$$ 101006 70056 68462 54751 23290 21801 14723 6781 -31144 -26414 -24957 -24678 6433 6484 -37560
8743c7560L7492K7319J0149K6315M8675q252o9367j2959J4392M074J3427J6529
$$ -37560 -68 27251 37400 63715 112390 104138 34771 21812 36204 40278 53705 70234
8731G0234m2288J0616j9240k8011J2696N530J1184N669J6301N788j2987j0488
$$ 70234 27946 38562 19322 -8689 4007 9537 20721 26390 42691 48479 35492 25004
8719B5004l2813J4329N2296L8754J8501m2428k7693J584j6832l028O66J7379P244
$$ 25004 -7809 6520 58816 97570 116071 73643 45950 47534 30702 27674 28340 45719 52963
8706E2963k0184l1644r686m073L3783K6453k0691k2574O475m744l7058q439R450
$$ 52963 32779 1135 -8551 -12624 21159 47612 26921 4347 10822 6078 -30980 -39419 -29969
8693b9969k0700l0170j2119M5911L2889k1212P311K7928L4660J5263n9098j5662
$$ -29969 -50669 -80839 -92958 -47047 -14158 -35370 -28059 -131 34529 49792 -9306 -24968
8681b4968K3344L0461j6172M229K9703K7874m833j4209j7161k0037n982k9694
$$ -24968 -1624 28837 12665 16894 46597 74471 69638 55429 38268 18231 12249 -17445
8669a7445K2501j5212o782j0508K111J7024j5064J8622M7412K2561O063o178n1154
$$ -17445 5056 -10156 -16938 -27446 -25335 -8311 -23375 -4753 42659 65220 71283 65105 13951
8656A3951j449K1731K9792J2612K0775j6459j9427R868K424K5822k7611k3608
$$ 13951 12502 34233 64025 76637 97412 80953 61526 71394 73818 99640 72029 48421
8644D8421K5350J647j2942q978J1633m2947k4361J4664L7558M885j760j5146n873
$$ 48421 73771 75418 62476 53498 65131 22184 -2177 12487 50045 54930 53170 38024 32151
8631C2151M684M1902k3305l8017N278J5869L4272K9008N617k1510k908j0266j9938
$$ 32151 36835 78737 55432 17415 22693 38562 72834 101842 107459 85949 83041 72775 52837
8618E2837k3309L1109k219j4712p066O0374l579r222P048k7899q374M3016N8211
$$ 52837 29528 60637 58418 43706 36640 97014 93435 84213 91261 63362 54988 98004 156215
8605A56215N328O804j9756K7079k3594J9213O2895P2710R068L4671k2041o4564
$$ 156215 161543 168347 148591 175670 152076 171289 234184 306894 315962 350633 328592 264028
8593B64028o3323k2250J1662L1857P520l2612l3023k8832k3174L5975j3943m3707
$$ 264028 200705 178455 190117 221974 229494 196882 163859 135027 111853 147828 133885 90178
8581I0178k8559L602j9424J6336L3052k4561k8024n2224k151J3470Q220j5246
$$ 90178 61619 65221 45797 62133 95185 70624 42600 -9624 -11775 1695 9915 -5331
8569e331R740L2080p863J4302J5654m9548j9298K7779L8392L740m3823j6342P214
$$ -5331 4409 36489 28626 42928 58582 9034 -10264 17515 55907 59647 15824 -518 6696
8556F696p187l4847j2523M3081O9950l760l5238k4104N1856K6863Q085Q435J2427
$$ 6696 -491 -35338 -47861 -4780 65170 61410 26172 2068 53924 80787 88872 97307 109734
8543A09734k3311n7300m526O929l5465J4712P801m7608m5022K80L3180K6327n235
$$ 109734 86423 29123 24597 31526 -3939 10773 18574 -29034 -74056 -73776 -40596 -14269 -19504
8530a9504k1107k7643M8929J7883j541K6587k8414k3316N492p757P1445n685k8830
$$ -19504 -40611 -68254 -19325 -1442 -2983 23604 -4810 -28126 -22634 -30391 41054 35369 6539
8517F539r346K5786k7207j2738L1973P491J8944J7931J908m368K3726k1230l4134
$$ 6539 -2807 22979 -4228 -16966 15007 22498 41442 59373 61281 56913 80639 59409 25275
8504B5275J0706O644n6943n6579j1054M497K6734K7556j2213K3814O6914l549
$$ 25275 35981 42625 -14318 -70897 -81951 -77454 -50720 -23164 -35377 -11563 55351 51802
8492E1802k4643l924m3157m6058K6424L9760J7150j18n484l054N77j1746L3926
$$ 51802 27159 23235 -19922 -65980 -39556 204 17354 17236 11752 8698 9275 -2471 31455
8479C1455j2m0333j6145j3779j8230R239L1288j2272L0451K5419L335k1643j3728
$$ 31455 31443 -8890 -25035 -38814 -57044 -47805 -16517 -28789 1662 27081 30416 8773 -4955
8466d955m725K0644M575J96j896J3615M270l1469j6447K8027L1926j1858J2758
$$ -4955 -9680 10964 15539 15735 13839 27454 31724 255 -16192 11835 43761 31903 44661
8453D4661j7220n0521l3702L0241J921j4972K1438r746l9265J2643N950j1691
$$ 44661 27441 -23080 -56782 -26541 -24620 -39592 -18154 -27900 -67165 -54522 -48572 -60263
8441f0263J9629j8843l204K4557k5520n023k597N184j6286k2415P387K6225L84
$$ -60263 -40634 -59477 -62681 -38124 -63644 -68667 -71264 -66080 -82366 -104781 -97394 -71169 -70785
8428g0785L0906o069n810l498l9529q729K5350j0536K352M6627J8041J7042p444
$$ -70785 -39879 -45948 -51758 -55256 -94785 -103514 -78164 -88700 -86348 -39721 -21680 -4638 -12082
8415a2082L4876O795k8605l5835l0190J3804o522O4251M5411o321l6665K081J0869
$$ -12082 22794 29589 984 -34851 -65041 -51237 -57759 6492 51903 45582 8917 10998 21867
8402B1867j4919k1838k5856K6331j539K505Q78K8447k002l4617J6007j3885K7725
$$ 21867 6948 -14890 -40746 -14415 -15954 -13449 -12571 15876 13874 -20743 -4736 -18621 9104
8389I104r515j1013K0193O009j5450K0265j2359K97K0362P769m0233k4753L00
$$ 9104 -411 -11424 8769 14778 -672 19593 7234 7531 27893 35662 -4571 -29324 -29024
8376b9024J0573K8835J7466M822j0682R765j0049l6842J5403O286j7132m3618
$$ -29024 -18451 10384 27850 32672 21990 31755 21706 -15136 267 6553 -10579 -54197
8364e4197K014L4622m499m0853K1003L8152Q78j5571J6714m373o111J2965J3474
$$ -54197 -52183 -17561 -22060 -62913 -41910 -3758 -2880 -18451 -1737 -6110 -12221 744 14218
8351A4218M3138l2522l4967j1266L4003j2492N246L2101N983k4862j5701q207
$$ 14218 57356 24834 -10133 -21399 12604 112 5358 37459 43442 18580 2879 -5328
8339e328n987k1297K2999K4166j5090Q234r274K0019n9184l0509Q623L6589J1974
$$ -5328 -11315 -32612 -9613 14553 -537 7697 -1577 18442 -40742 -71251 -62628 -26039 -14065
8326a4065j8543K0667K6466r139N211Q83K6170k2201L1257j3577l4627K9094k3354
$$ -14065 -32608 -11941 14525 5386 10597 11480 37650 15449 46706 33129 -1498 27596 4242
8313D242o1770j3778J9380K6602J7015N035l0712L0292J1087N174J3348Q666m9290
$$ 4242 -57528 -71306 -51926 -25324 -8309 -3274 -33986 -3694 7393 12567 25915 34581 -14709
8300a4709k3451p309l167N8597l043q125O1277k344l4915J618k7556l514l5076
$$ -14709 -38160 -45469 -48636 9961 6918 -1207 60070 57726 22811 24429 -3127 -6641 -41717
8287d1717l5997O771j3756q131k2033k0323M5473L0873k095q54L8509J241r757
$$ -41717 -77714 -70943 -84699 -92830 -114863 -135186 -89713 -58840 -60935 -61789 -23280 -22039 -31796
8274c1796k3977l1915K8309L6075o421K350L4978m650j8678j5061l3540J7975
$$ -31796 -55773 -87688 -59379 -23304 -29725 -27375 7603 2953 -15725 -30786 -64326 -46351
8262d6351M1563K7708M406j125J1524K4953J3758m1836l2427r727K416Q619J1977
$$ -46351 -4788 22920 27326 26201 37725 62678 76436 34600 2173 -7554 -5138 3481 15458
8249A5458J860M447l8223q703N299L435k4893R101K0742n3395l9587O2744O9045
$$ 15458 17318 21765 -16458 -25161 -19862 -16427 -41320 -32219 -11477 -64872 -104459 -41715 27330
8236B7330k3315J9154j160Q220J6782l8051r786l899l4531j5152J437N2385M0953
$$ 27330 4015 23169 22009 30229 47011 8960 -826 -4725 -39256 -54408 -52971 -586 40367
8223D0367o576P643k5456L849J7884j0738K5481j7436n3465J4204K1442J9228
$$ 40367 33791 41434 15978 19827 37711 26973 52454 35018 -18447 -4243 17199 36427
8211C6427K5162k7539r406K2090k5285L785K0601L6682K0324J142l6418n4650
$$ 36427 61589 34050 24644 46734 21449 25234 45835 82517 102841 103983 67565 12915
8199A2915l5649j1527L1623J9847m6902O779Q65K9166l462n450m4800j682J0388
$$ 12915 -22734 -34261 -2638 17209 -29693 -22914 -22049 7117 3655 -1795 -46595 -48277 -37889
8186c7889J5465N331k5788P069J0430M483L0383j6095q570J5477O927J865j4044
$$ -37889 -22424 -17093 -42881 -35812 -25382 -20899 9484 -6611 -15181 296 7223 9088 -4956
8173d956J5271J1516j2396M4528j0114j4149j6069j4031j8473J988L4985k0267
$$ -4956 10315 21831 9435 53963 43849 29700 13631 -400 -18873 -16885 18100 -2167
8161b167n2410Q026K4383n534J2798L6958Q863J586q376l0757l848K1431M809
$$ -2167 -54577 -46551 -22168 -27702 -14904 22054 30917 32503 24127 -6630 -10478 10953 15762
8148A5762k0545n7156J5548L3531J8427j7153l4301J3312J8314k5544J6987J5714
$$ 15762 -4783 -61939 -46391 -12860 5567 -11586 -45887 -32575 -14261 -39805 -22818 -7104
8136g104j1806N2833M6837j5844l9203m423O740L6831q952n0875n20r455m2094
$$ -7104 -18910 33923 80760 64916 25713 21290 28030 64861 55909 5034 4514 -4941 -47035
8123d7035K9806R075K7719J1179m0234l1552k4067M0531M8673J0544j345l8125
$$ -47035 -17229 -8154 19565 30744 -9490 -41042 -65109 -24578 24095 34639 33294 -4831
8111d831l2320n909L0701j8379K5896K9398M0353L5905r050m7673l2151r155Q970
$$ -4831 -37151 -43060 -12359 -30738 -4842 24556 64909 100814 91764 44091 11940 2785 11755
8098A1755M898K3155k8852J1856J7787j8088n5976l288O575L7201J8106l447k4401
$$ 11755 16653 39808 10956 22812 40599 22511 -33465 -36753 -30178 7023 25129 21682 -2719
8085b719j3041R727j7256l1553J2794L6598M3392L4391j5009k3867J2403k864
$$ -2719 -15760 -6033 -23289 -54842 -42048 -5450 37942 72333 57324 33457 45860 42996
8073D2996l1891L7256m6064p1150k6383N0077j4129j0535K2538J4541q202L1361
$$ 42996 11105 48361 2297 -68853 -95236 -45159 -59288 -69823 -47285 -32744 -40946 -9585
8061i585l34j0631L7708L2380j3170j2260k8731P030J248k4502k3268j1733m654
$$ -9585 -9919 -20550 17158 49538 36368 24108 -4623 2407 3655 -20847 -44115 -55848 -60502
8048f0502j8542j3548j2600L5878J3323j619M8479j5244m3542p906L8733L0813
$$ -60502 -79044 -92592 -105192 -69314 -55991 -57610 -9131 -24375 -67917 -75823 -37090 -6277
8036f277K4140J2992L2954o405M28M4343m7484j3257J7468j3587J3922N260n847
$$ -6277 17863 30855 63809 57404 57832 102175 54691 41434 58902 45315 59237 64497 58650
8023E8650q382Q181l5652p901M000R45j823j3968O083K590k0649k8238j9928K3731
$$ 58650 50268 58449 22797 14896 18896 19841 18018 4050 10133 12723 -7926 -36164 -56092 -32361
8009c2361K7554L2023K3863P827J2300o060O908N9807L728j8095k3041n8752k346
$$ -32361 -4807 27216 51079 58906 71206 65146 72054 131861 135589 117494 94453 35701 33355
7996C3355J4075k3894l4792J2365j09j301K5118k9889K3777K8156j1386o2745
$$ 33355 47430 23536 -11256 1109 1000 -301 24817 -5072 18705 46861 35475 -27270
7984b7270k6574o973q554j5176K4147L0543j8771m09M4211m093j5644N20J9858
$$ -27270 -53844 -60817 -69371 -84547 -60400 -29857 -48628 -49037 -4826 -8919 -24563 -24043 -4185
7971d185K6517K5786J6398J4675L6113j6061m8382m8926n221L8435m3155m1839
$$ -4185 22332 48118 64516 79191 115304 99243 50861 1935 -3286 35149 -8006 -49845
7959d9845J5198P527J0145m839L5296N3337K6022k1468m1306l7623K7199L1664
$$ -49845 -34647 -27120 -16975 -21814 13482 66819 92841 71373 30067 -7556 19643 51307
7947E1307m7699J0286N829l2260N069J858k9300j4258J4258q63L3878M3837k6912
$$ 51307 3608 13894 19723 -12537 -7468 -5610 -34910 -49168 -34910 -35773 -1895 41942 15030
7934A5030k6643j3409p529k6163L5104M8992K8860L908l1205l2886J3946K0954
$$ 15030 -11613 -25022 -32551 -58714 -23610 25382 54242 58150 26945 -5941 8005 28959
7922B8959k7281j0833j138p1j580r037R882j2146J632L2446P448j6432J8909J4764
$$ 28959 1678 -9155 -10293 -10364 -11944 -20981 -11099 -23245 -21613 10833 18281 1849 20758 35522
7908C5522j1830j2998J2456l7169n6600j792K1632L0972L0701l3264o0902L6414
$$ 35522 23692 10694 23150 -14019 -70619 -72411 -50779 -19807 10894 -22370 -83272 -46858
7896d6858M4682L1354J5598m595j9230k2570l5982l7952K1660P8571J8174M820
$$ -46858 -2176 29178 44776 40181 20951 -1619 -37601 -75553 -53893 24678 42852 47672
7884D7672k2796j7159J5239K5739L2834J7733l6839l4545K7926m24o2448m7053
$$ 47672 24876 7717 22956 48695 81529 99262 62423 27878 55804 55380 -7068 -54121
7872e4121j5783k8741R327P3287q913N385k7428J341J147l686L1635L1006L9095
$$ -54121 -69904 -98645 -89318 -16031 -24944 -19559 -46987 -45646 -44499 -48185 -16550 14456 53551
7859E3551k1397p9597k6319J851L2261M5590L6862j3532k3383j8663j3913m83
$$ 53551 32154 -47443 -73762 -71911 -39650 5940 42802 29270 5887 -12776 -26689 -27172
7847b7172p181J1537K4584l2266o46m464K3258P506L0073J8037j3731j5446L2239
$$ -27172 -34353 -22816 1768 -30498 -31144 -35608 -12350 -4844 25229 43266 29535 14089 46328
7834D6328k7350m9089j84o196J8470k3438j1368l886J5736M3431K5915m5305J463
$$ 46328 18978 -30111 -30295 -36491 -18021 -41459 -52827 -56713 -40977 2454 28369 -16936 -15473
7821a5473K3561O900l783J9004j9286Q692n093k300J9731R221n224j9020j1351
$$ -15473 8088 14988 11205 30209 10923 19615 14522 12222 31953 41174 35950 16930 5579
$$ [...]
##END NTUPLES=NMR SPECTRUM
##END=
