##TITLE=Analysis number 315615
Compound Code spb 01225
Project Code adrs
Chemist Name endeavour
##JCAMPDX= 6.0         $$ Bruker NMR JCAMP-DX V2.0
##DATA TYPE= NMR SPECTRUM
##DATA CLASS= NTUPLES
##ORIGIN= Bruker BioSpin GmbH
##OWNER= NMR
$$ XWIN-NMR		Version 3.5
$$ Thu Nov 24 15:30:05 2005 GMT Standard Time (UT+0h)  MAYBRIDGE\NMR@NMR_250MHZ
##.OBSERVE FREQUENCY= 250.131544655141
##.OBSERVE NUCLEUS= ^1H
##.ACQUISITION MODE= SIMULTANEOUS (DQD)
##.ACQUISITION SCHEME= undefined
##.AVERAGES= 16
##.DIGITISER RES= 18
##SPECTROMETER/DATA SYSTEM= dpx250
##.PULSE SEQUENCE= zg30
##.SOLVENT NAME= DMSO
##.SHIFT REFERENCE= (INTERNAL, DMSO, 0, 16.522)
##AUDIT TRAIL= $$ (NUMBER, WHEN, WHO, WHERE, WHAT)
$$ ##TITLE= Audit trail, XWIN-NMR		Version 3.5
$$ ##JCAMPDX= 5.01
$$ ##ORIGIN= Bruker BioSpin GmbH
$$ ##OWNER= NMR
$$ C:\u/data/dgb/nmr/ADRS/12970/pdata/1/auditp.txt
$$ ##AUDIT TRAIL=  $$ (NUMBER, WHEN, WHO, WHERE, WHAT)
(   1,<2005-11-24 15:29:46.21 +000>,<MAYBRIDGE\NMR>,<NMR_250MHZ>,
      <created by zg, POWCHK disabled, PULCHK disabled
       configuration hash MD5:
       62 19 C7 07 E1 42 D1 B7 37 6C 3D D0 77 39 F9 E6
       data hash MD5: 64K
       8C 9E 27 72 A3 8B 36 A2 84 77 66 E2 89 79 02 AD>)
(   2,<2005-11-24 15:29:58.40 +000>,<MAYBRIDGE\NMR>,<NMR_250MHZ>,
      <Start of raw data processing
       ef LB = 0.3 FT_mod = 6 PKNL = 1 SI = 32K 
       data hash MD5: 32K
       FF D3 EA 60 AF 4B 72 37 1C 94 51 E3 5C 08 FF 6F>)
(   3,<2005-11-24 15:30:00.23 +000>,<MAYBRIDGE\NMR>,<NMR_250MHZ>,
      <apk 
       data hash MD5: 32K
       99 B7 5B E0 33 FC 3F F0 35 F3 48 D6 A6 A9 FB 12>)
(   4,<2005-11-24 15:30:01.02 +000>,<MAYBRIDGE\NMR>,<NMR_250MHZ>,
      <abs ABSG = 5 
       data hash MD5: 32K
       A6 35 DB BE 36 72 7B 95 2F 6D 53 D6 6C 47 79 F3>)
$$ ##END=
$$ 
$$ hash MD5
$$ 03 B3 F2 EF CD 9C 2A 1F AE 88 54 27 2D 5B 83 FD
##$RELAX= 
##$RELAX= 
##$RELAX= 
##$RELAX= 
##$RELAX= 
##$RELAX= 
##$RELAX= 
$$ Bruker specific parameters
$$ --------------------------
##$DU= <C:\u>
##$EXPNO= 12970
##$NAME= <ADRS>
##$PROCNO= 1
##$TYPE= <nmr>
##$USER= <dgb>
##$AMP= (0..31)
100 100 100 100 100 100 100 100 100 100 100 100 100 100 100 100 100 100 
100 100 100 100 100 100 100 100 100 100 100 100 100 100 
##$AQSEQ= 0
##$AQ_mod= 3
##$AUNM= <au_zg>
##$AUTOPOS= <43 >
##$BF1= 250.13
##$BF2= 250.13
##$BF3= 250.13
##$BF4= 250.13
##$BF5= 500.13
##$BF6= 500.13
##$BF7= 500.13
##$BF8= 500.13
##$BYTORDA= 1
##$CFDGTYP= 0
##$CFRGTYP= 5
##$CHEMSTR= <none>
##$CNST= (0..31)
1 1 145 1 1 1 1 1 1 1 1 1 1 1 1 1 1 1 1 1 1 1 1 1 1 1 1 1 1 1 1 1 
##$CPDPRG= <>
##$CPDPRG1= <>
##$CPDPRG2= <>
##$CPDPRG3= <>
##$CPDPRG4= <mlev>
##$CPDPRG5= <mlev>
##$CPDPRG6= <mlev>
##$CPDPRG7= <mlev>
##$CPDPRG8= <mlev>
##$CPDPRGB= <>
##$CPDPRGT= <>
##$D= (0..31)
0 1 0 0 0 0 0 0 0 0.06 0 0 0 0 0 0 0.0002 0 0 0 0 0 0 0 0 0 0 0 0 0 0 
0 
##$DATE= 1132846185
##$DBL= (0..7)
120 120 120 120 120 120 120 120 
##$DBP= (0..7)
150 150 150 150 150 150 150 150 
##$DBP07= 0
##$DBPNAM0= <>
##$DBPNAM1= <>
##$DBPNAM2= <>
$$ [...]
##$SUBNAM7= <"">
##$SUBNAM8= <"">
##$SUBNAM9= <"">
##$SW= 20.6930455092707
##$SWIBOX= (0..15)
0 0 3 0 0 0 0 0 0 0 0 0 0 0 0 0 
##$SW_h= 5175.983436853
##$TD= 65536
##$TD0= 1
##$TE= 294.16
##$TE2= 300
##$TE3= 300
##$TEG= 300
##$TL= (0..7)
0 120 120 120 120 120 120 120 
##$TP= (0..7)
150 150 150 150 150 150 150 150 
##$TP07= 0
##$TPNAME0= <>
##$TPNAME1= <>
##$TPNAME2= <>
##$TPNAME3= <>
##$TPNAME4= <>
##$TPNAME5= <>
##$TPNAME6= <>
##$TPNAME7= <>
##$TPOAL= (0..7)
0.5 0.5 0.5 0.5 0.5 0.5 0.5 0.5 
##$TPOFFS= (0..7)
0 0 0 0 0 0 0 0 
##$TUNHIN= 0
##$TUNHOUT= 0
##$TUNXOUT= 0
##$USERA1= <user>
##$USERA2= <user>
##$USERA3= <user>
##$USERA4= <user>
##$USERA5= <user>
##$V9= 5
##$VALIST= <valist>
##$VCLIST= <CCCCCCCCCCCCCCC>
##$VD= 0
##$VDLIST= <DDDDDDDDDDDDDDD>
##$VPLIST= <PPPPPPPPPPPPPPP>
##$VTLIST= <TTTTTTTTTTTTTTT>
##$WBST= 1024
##$WBSW= 4
##$XGAIN= (0..3)
0 0 0 0 
##$XL= 0
##$YL= 0
##$YMAX_a= 524479
##$YMIN_a= -553522
##$ZGOPTNS= <>
##$ZL1= 120
##$ZL2= 120
##$ZL3= 120
##$ZL4= 120
##$ABSF1= 16.522
##$ABSF2= -4.171173
##$ABSG= 5
##$ABSL= 3
##$ALPHA= 0
##$AQORDER= 0
##$ASSFAC= 0
##$ASSFACI= 0
##$ASSFACX= 0
##$ASSWID= 0
##$AUNMP= <proc_1d>
##$AZFE= 0.1
##$AZFW= 0.1
##$BCFW= 0
##$BC_mod= 0
##$BYTORDP= 0
##$COROFFS= 0
##$CY= 12.5
##$DATMOD= 1
##$DC= 0
##$DFILT= <>
##$DTYPP= 0
##$F1P= 14.0000005364418
##$F2P= -0.99999901652339
##$FCOR= 0.5
##$FTSIZE= 32768
##$FT_mod= 6
##$GAMMA= 0
##$GB= 0
##$INTBC= 1
##$INTSCL= 1
##$ISEN= 128
##$LB= 0.3
##$LEV0= 0
##$LPBIN= 0
##$MAXI= 10000
##$MC2= 0
##$MEAN= 0
##$ME_mod= 0
##$MI= 0
##$NCOEF= 0
##$NC_proc= -2
##$NLEV= 6
##$NOISF1= 0
##$NOISF2= 0
##$NSP= 0
##$NTH_PI= 0
##$NZP= 0
##$OFFSET= 16.522
##$PC= 1
##$PHC0= 71.28259
##$PHC1= 6.789002
##$PH_mod= 1
##$PKNL= yes
##$PPARMOD= 0
##$PSCAL= 4
##$PSIGN= 0
##$REVERSE= no
##$SF= 250.13
##$SI= 32768
##$SIGF1= 0
##$SIGF2= 0
##$SINO= 400
##$SIOLD= 32768
##$SREGLST= <1H.DMSO>
##$SSB= 0
##$STSI= 32768
##$STSR= 0
##$SW_p= 5175.98343685301
##$SYMM= 0
##$S_DEV= 0
##$TDeff= 65536
##$TDoff= 0
##$TI= <Analysis number 999999
Compound Code 99
Book Reference 9
Project Code 9>
##$TILT= no
##$TM1= 0
##$TM2= 0
##$TOPLEV= 0
##$USERP1= <user>
##$USERP2= <user>
##$USERP3= <user>
##$USERP4= <user>
##$USERP5= <user>
##$WDW= 1
##$XDIM= 32768
##$YMAX_p= 392068980
##$YMIN_p= -100198
$$ End of Bruker specific parameters
$$ ---------------------------------
##NTUPLES= NMR SPECTRUM
##VAR_NAME=  FREQUENCY,     SPECTRUM/REAL,   SPECTRUM/IMAG
##SYMBOL=    X,             R,               I
##VAR_TYPE=  INDEPENDENT,   DEPENDENT,       DEPENDENT
##VAR_FORM=  AFFN,          ASDF,            ASDF
##VAR_DIM=   32768,         32768,           32768
##UNITS=     HZ,            ARBITRARY UNITS, ARBITRARY UNITS
##FACTOR=    0.157963299565203, 1,           1
##FIRST=     4132.6476996994, 0,             0
##LAST=      -1043.33573715361, 0,           0
##MIN=       -1043.33573715361, -100198,     0
##MAX=       4132.6476996994, 392068980,     0
$$ Real data points
##PAGE= N=1
##DATA TABLE= (X++(R..R)), XYDATA
$$ [...]
$$ plain form
14945 17566 22537 17937 4017 -2979 -7686 842 6714 87 3574 8755 7907 3371 -14316 -8904
14931 -8904 -1375 -852 -8742 -11465 -370 15395 6946 2354 -1918 9305 21849 14596 4137 -875
14917 -875 -7086 -386 -3604 -14204 -11635 -6184 970 -4176 951 2238 -4168 8872 10880 7439
14903 7439 -759 -2464 4426 11826 5019 -5141 -25309 -37970 -41317 -40130 -22984 -19601 -14916 134
14889 134 4382 4266 2924 11069 13046 18348 24850 13754 -5041 -14772 -10993 6596 3107 -10023
14875 -10023 -12995 -19007 -8142 5360 20792 30129 30618 26713 26988 31112 24018 7080 -7358 -8299
14861 -8299 -4206 1277 377 9276 16843 22694 15249 16394 15334 10796 15296 14168 23530 18598 13727
14846 13727 6238 1115 -2586 -7147 9482 17189 9280 -4558 5218 9510 19913 8517 -4068
$$ packed form
14945A7566M971m600j3920o996m707Q528N872o627L487N181q48m536j7687N412
14931h904P529N23p890k723J1095J5765q449m592m272J1223J2544p253j0459n012
14917h75o211O700l218j0600K569N451P154n146N127J287o406J3040K008l441
14903G439q198j705O890P400o807j0160k0168j2661l347J187J7146L383M685J5050
14889A34M248j16j342Q145J977N302O502j1096j8795r731L779J7589l489j3130
14875a0023k972o012J0865J3502J5432R337M89l905K75M124p094j6938j4438r41
14861h299M093N483r00Q899P567N851p445J145j060m538M500j128R362m932m871
14846A3727p489n123l701m561J6629P707p909j3838R776M292J0403j1396j2585
$$ plain form
14833 -4068 -11467 -11046 -3985 763 6786 1329 1049 212 13819 8696 -2607 2438 16009 3070
14819 3070 4959 5265 5912 951 -9491 3218 18054 19679 3275 6781 194 -20372 -20511 -11886
14805 -11886 3262 2721 -2776 -10956 -15954 -8810 -4929 2712 11416 6817 8122 11074 15711 25629
14791 25629 16800 -1869 -14080 -12794 -7777 -3156 14624 7649 8383 -276 -8882 -9571 -4633 -13212
14777 -13212 -19676 -13740 -1061 16857 11406 7352 7046 14856 12767 14107 1209 -6095 -6902 -12128
14763 -12128 -17524 -12000 -10187 -18288 -5545 -2351 -5520 -12533 -20500 -16804 -7214 -242 1370 745
14749 745 -10399 -11873 -15626 -21331 -21825 -11055 -1677 -13079 -17723 -4305 1600 -7657 -11729 -8057
14735 -8057 -3771 1364 -4587 -5591 -2015 -2469 -64 10399 17478 12593 8604 1437 6790 9334 1422
$$ packed form
14833d068p399M21P061M748O023n457k80q37J3607n123j1303N045J3571j2939
14819C070J889L06O47m961j0442J2709J4836J625j6404L506o587k0566j39Q625
14805a1886J5148n41n497q180m998P144L881P641Q704m599J305K952M637R918
14791B5629q829j8669j2211J286N017M621J7780o975P34q659q606o89M938q579
14777a3212o464N936J2679J7918n451m054l06P810k089J340j2898p304q07n226
14763a2128n396N524J813q101J2743L194l169p013p967L696R590O972J612o25
14749G45j1144j474l753n705m94J0770R378j1402m644J3418N905r257m072L672
14735h057M286N135n951j004L576m54K405J0463P079m885l989p167N353K544p912
$$ plain form
14720 1422 -7550 -15104 -14457 -12737 -4304 2850 1205 3209 -10862 -22195 -9325 -3638 4643 11935
14706 11935 5325 9037 14789 15218 264 -5491 3361 11233 5843 5484 8027 10643 -10203 -7598
14692 -7598 -3445 -6153 -17587 -20060 -9127 -5825 1838 14256 8605 4733 11579 3739 6374 57
14678 57 -2225 12667 21170 25416 21350 9589 14127 18422 8389 5039 9752 10754 4310 6220
14664 6220 22343 24331 12597 16266 22040 4316 -6614 -5929 4994 -9871 -16364 -22791 -12502
14651 -12502 -133 7949 4920 2896 4802 4387 2831 -4377 -7453 -3669 3972 5163 11904 10764
14637 10764 3637 6418 14475 16454 8974 6482 12091 17936 21688 24824 10080 -14215 -17958 -12193
14623 -12193 -2315 6375 3846 -6923 -5406 -4881 2930 -6370 -3160 12302 12075 5221 3663 -4690
$$ packed form
14720A422q972p554O47J720Q433P154j645K004j4071j1333J2870N687Q281P292
14706A1935o610L712N752M29j4954n755Q852P872n390l59K543K616k0846K605
14692g598M153k708j1434k473J0933L302P663J2418n651l872O846p840K635o317
14678E7k282J4892Q503M246m066j1761M538M295j0033l350M713J002o444J910
14664F220J6123J988j1734L669N774j7724j0930O85J0923j4865o493o427J0289
14651a2502J2369Q082l029k024J906m15j556p208l076L784P641J191O741j140
14637A0764p127K781Q057J979p480k492N609N845L752L136j4744k4295l743N765
14623a2193R878Q690k529j0769J517N25P811r300L210J5462k27o854j558q353
$$ plain form
14609 -4690 7741 14167 5991 8684 -2583 -18558 -19107 -5647 15609 9627 9653 9987 3106 18927
14595 18927 31563 10051 2437 955 -8325 -8231 -6867 -8010 -4369 -16738 -15982 -3466 -7276 -15214
14581 -15214 -9625 -7215 -1907 5978 -6608 -13843 -9525 -3677 -8692 -19279 -11974 -13339 -6990 -13119
14567 -13119 -4927 -8806 -10062 -18885 -32378 -22321 -22505 -13945 -6729 1372 14331 7849 1857 8449
14553 8449 1311 -3444 -263 -6015 3710 13313 15270 12975 4235 1859 2372 -1127 7568 14084 1553
14538 1553 -6825 -17278 -17224 -15388 -10419 -13686 -25865 -12625 -9364 -10706 2209 29 -4805 -24123
14524 -24123 -35320 -32961 -28123 -17188 -12763 -13535 -22468 -17814 6503 -5569 -11797 -403 -1932
14511 -1932 769 -3836 -16059 -17301 -18086 -16149 -18307 -21975 -22331 -23245 -14103 -450 360 -7615 -11345
$$ packed form
14609d690J2431O426q176K693j1267j5975n49J3460K1256n982K6L34o881J5821
14595A8927J2636k1512p614j482r280R4J364j143L641j2369P56J2516l810p938
14581a5214N589K410N308P885j2586p235M318N848n015j0587P305j365O349o129
14567a3119Q192l879j256q823j3493J0057j84Q560P216Q101J2959o482n992O592
14553H449p138m755L181n752R725R603J957k295q740k376N13l499Q695O516j2531
14538A553q378j0453N4J836M969l267j2179J3240L261j342J2915k180m834j9318
14524b4123j1197K359M838J0935M425p72q933M654K4317j2072o228J1394j529
14511a932K701m605j2223j242p85J937k158l668l56r14R142J3653Q10p975l730
$$ plain form
14496 -11345 169 -4130 -6740 -6495 -4599 -502 -3375 -2706 -3165 -15220 -12648 -3917 -2303 -16592
14482 -16592 -15095 -3346 -4810 5191 14740 12556 10272 1777 2456 2429 6905 12434 6849 4785 10760
14467 10760 1586 11933 12239 8876 13587 3969 11723 12954 5709 12518 16906 6814 -1082 -3295
14453 -3295 6755 4309 -4223 751 2949 13614 14309 -1083 -4584 8529 4964 -1409 3968 11733
14439 11733 3357 -22337 -37448 -31529 -22937 -11279 -52 2922 -10868 -16970 -18972 -19819 -18605
14426 -18605 -11305 2142 9606 15855 15741 -388 -13910 -28601 -29501 -13876 -2651 9424 -16226
14413 -16226 -15983 -9944 -5799 -11881 -14328 -5676 14332 13285 -7826 -17196 -12700 -5757 5433 1222
14399 1222 5750 5835 -11514 -5687 257 -7778 4162 2146 1869 9350 3966 -2359 -3440 1332 831
$$ packed form
14496a1345J1514m299k610K45J896M097k873O69m59j2055K572Q731J614j4289
14482a6592J497J1749j464J0001R549k184k284q495O79k7M476N529n585k064N975
14467A0760r174J0347L06l363M711r618P754J231p245O809M388j0092p896k213
14453c295J0050k446q532M974K198J0665O95j5392l501J3113l565o373N377P765
14439A1733q376k5694j5111N919Q592J1658J1227K974j3790o102k002q47J214
14426a8605P300J3447P464O249j14j6129j3522j4691r00J5625J1225J2075k5650
14413a6226K43O039M145o082k447Q652K0008j047k1111r370M496O943J1190m211
14399A222M528Q5j7349N827N944q035J1940k016k77P481n384o325j081M772n01
$$ plain form
14384 831 -400 1728 667 -5586 3047 7548 11540 281 3196 12719 4757 -13577 -23897 -20876
14370 -20876 -12303 -12513 -19000 -20845 -29050 -24836 -22036 -14272 -16277 -23783 -23082 -16259 -6632 -4394 -14686
14355 -14686 -10578 1744 14442 20326 16096 1057 -6171 1268 -5562 -8933 -6773 -16099 -12810 8702
14341 8702 11529 1208 -526 14366 23965 23374 7200 8580 -8043 -11735 -9232 -11713 -9634 -16754
14327 -16754 -18997 -14829 -17757 -23877 -25001 -12099 -15194 -11831 6785 9378 -472 -1288 1835 3926
14313 3926 2031 2551 -750 3856 706 -258 423 5832 6474 -907 7738 21099 9460 -1824 1487
14298 1487 217 9118 5218 -5714 -16041 -14290 -2636 -2718 -6460 -324 -6525 -1755 2073 -12320
14284 -12320 -13497 -16896 -7927 1370 -1859 -12350 -4654 5153 10414 4675 -1315 -8245 5051 -6326
$$ packed form
14384H31j231K128j061o253Q633M501L992j1259K915R523p962j8334j0320L021
14370b0876Q573k10o487j845q205M214K800P764k005p506P01O823R627K238j0292
14355a4686M108J2322J2698N884m230j5039p228P439o830l371K160r326L289K1512
14341H702K827j0321j734J4892R599n91j6174J380j6623l692K503k481K079p120
14327a6754k243M168k928o120j124J2902l095L363J8616K593r850q16L123K091
14313C926j895N20l301M606l150r64O81N409O42p381Q645J3361j1639j1284L311
14298A487j270Q901l900j0932j0327J751J1654q2l742O136o201M770L828j4393
14284a2320j177l399Q969R297l229j0491P696R807N261n739n990o930J3296j1377
$$ plain form
14270 -6326 -10404 -16794 -6225 -8550 -11788 -8347 -8852 -7059 2258 1977 7262 10519 -226 -1511 13597
14255 13597 -242 -22486 -23242 -22395 -18600 -14119 -15195 -18880 -29178 -24694 -7015 6654 12614 4953
14241 4953 -7447 52 -7520 -19 4401 2807 -4830 -22101 -33002 -30063 -23054 -6182 13521
14228 13521 18753 14689 13405 6841 3489 452 -2145 -5227 -20269 -14589 -9863 12165 22453 16723
14214 16723 4221 -3456 -8298 -634 -8037 -3979 2965 -10503 -12554 -8184 -2666 -5198 -8549 -15240
14200 -15240 -16203 1667 10937 7949 8704 1125 -3264 -6595 -13218 -19004 -10654 -15241 -15734 6652 17342
14185 17342 24973 17835 13971 8295 1947 -4386 -705 8312 19334 15644 8312 -15369 -24522 -11734
14171 -11734 -5489 -205 -5075 -2140 -358 -6444 -2150 -2296 -10446 -20170 -8101 9142 -3982 690
$$ packed form
14270f326m078o390J0569k325l238L441n05J793R317k81N285L257j0745j285J5108
14255A3597j3839k2244p56Q47L795M481j076l685j0298M484J7679J3669N960p661
14241D953j2400P499p572P501M420j594p637j7271j0901K939P009J6872J9703
14228A3521N232m064j284o564l352l037k597l082j5042N680M726K2028J0288n730
14214A6723j2502p677m842P664p403M058O944j3468k051M370N518k532l351o691
14200a5240r63J7870R270k988P55p579m389l331o623n786Q350m587m93K2386J0690
14185A7342P631p138l864n676o348o333L681R017J1022l690p332k3681r153J2788
14171a1734O245N284m870K935J782o086M294j46q150r724J2069J7243j3124M672
$$ plain form
14157 690 -515 3497 -111 2266 -5529 -4416 10747 21350 24795 26225 19514 5916 8338 -8333
14143 -8333 -504 10602 -1271 2934 -4399 -16909 -5059 6358 -6166 -16229 -17673 -18536 -18446 -16927
14129 -16927 -19527 -22232 -22054 -18190 -8055 -1042 85 3323 3567 16855 9830 2910 3648 7826 2093
14114 2093 -8048 -12810 -11318 -6136 -9738 -2540 854 2239 15929 10410 -4479 -10955 -15653 -15387
14100 -15387 -4138 18822 17987 7159 -5510 -6414 9264 13211 9737 -4133 1539 3479 3284 3223
14086 3223 12640 15820 8181 -25 -7865 -9181 -27577 -26474 -16536 -5869 1583 -2524 -10336 751
14072 751 -9843 2776 19514 13023 9808 -10505 -20568 -16046 -9110 -14513 -18164 -12792 -5526 -6520
14058 -6520 2720 12800 19260 20221 31315 36673 42137 31605 23629 18640 14026 -1319 -9669 -12402
$$ packed form
14157F90j205M012l608K377p795J113J5163J0603L445J430o711j3598K422j6671
14143h333P829J1106j1873M205p333j2510J1850J1417j2524j0063j444q63R0J519
14129a6927k600k705J78L864J0135P013J127L238K44J3288p025o920P38M178n733
14114B093j0141m762J492N182l602P198L394J385J3690n519j4889o476m698K66
14100a5387J1249K2960q35j0828j2669r04J5678L947l474j3870N672J940j95o1
14086C223R417L180p639q206p840j316j8396J103R938J0667P452m107p812J1087
14072G51j0594J2619J6738o491l215k0313j0063M522O936n403l651N372P266r94
14058f520R240J0080O460R61J1094N358N464j0532p976m989m614j5345q350k733
$$ plain form
14044 -12402 -10518 -9613 -3701 -2743 -4272 -14821 2146 20143 12344 4282 -2031 -6823 -7301 -6706 2874
14029 2874 15201 16786 13909 9071 5119 8518 2770 -11769 -18321 -15941 -13302 -2484 1518 2851
14015 2851 10256 2143 4929 1847 1280 7316 8500 -816 -21819 -7774 11382 14289 11077 570
14001 570 -4795 -1466 -2552 -1228 10855 17380 6351 -2396 -2604 -13439 -17617 -9971 -15530 -18738
13987 -18738 -18328 -19488 -4654 -4318 -5136 11115 -2725 -11418 -7398 8367 8846 4338 4231 1675 -9347
13972 -9347 -18072 -22234 -21600 -12366 -2155 629 7958 7242 -7829 -267 -6305 -9986 2528 12881
13958 12881 21272 5633 -2386 6410 14280 1765 5708 23781 23347 8830 -2068 -6335 -1811
13945 -1811 5724 15049 7525 11295 988 -5361 -9768 -8147 -18179 -14035 -8393 -6321 -2678 203
$$ packed form
14044a2402J884R05N912R58j529j0549J6967J7997p799q062o313m792m78N95R580
14029B874J2327J585k877m838l952L399n748j4539o552K380K639J0818M002J333
14015B851P405q113K786l082n67O036J184r316k1003J4045J9156K907l212j0507
14001E70n365L329j086J324J2083O525j1029q747k08j0835m178P646n559l208
13987a8738M10j160J4834L36q18J6251j3840q693M020J5765M79m508j07k556j1022
13972i347q725m162O34R234J0211K784P329p16j5071P562o038l681J2514J0353
13958A2881Q391j5639q019Q796P870j2515L943J8073m34j4517j0898m267M524
13945a811P535R325p524L770j0307o349m407J621j0032M144N642K072L643K881
$$ plain form
13931 203 -7236 -6782 -9308 -6647 -5337 -3616 -865 1393 -13800 -5742 5068 2260 -833 7548 6008
13916 6008 5707 -7081 2163 12413 12309 11969 9328 4642 -7862 -10178 5030 20546 18569 20353
13902 20353 16821 9062 11118 9006 12675 12054 7934 5903 10475 13208 4286 -12761 -21835 -13085
13888 -13085 -7001 3613 12800 11963 12049 14628 25447 33477 33251 45722 50615 52803 41122 21182
13874 21182 10839 14011 15543 26963 37590 42777 44998 33208 17101 31493 34121 30384 29537
13861 29537 38429 30879 40627 49225 42645 30556 15669 25528 25569 17002 18460 11127 9164 14046
13847 14046 9276 5057 -8008 -63 9910 8592 34783 38788 45875 65352 78918 82694 87517
13834 87517 98973 116109 119141 104603 105947 111593 101387 94930 85227 75466 57324 37316 31959
$$ packed form
13931B03p439M54k526K661J310J721K751K258j5193Q058J0810k808l093Q381j540
13916F008l01j2788R244J0250j04l40k641m686j2504k316J5208J5516j977J784
13902B0353l532p759K056k112L669o21m120k031M572K733q922j7047r074Q750
13888a3085O084J0614R187q37Q6K579J0819Q030k26J2471M893K188j1681j9940
13874B1182j0343L172J532J1420J0627N187K221j1790j6107J4392K628l737q47
13861B9537Q892p550R748Q598o580j2089j4887R859M1q567J458p333j963M882
13847A4046m770m219j3065P945R973j318K6191M005P087J9477J3566L776M823
13834H7517J1456J7136L032j4538J344N646j0206o457r703r761j8142k0008n357
$$ plain form
13821 31959 29731 30811 18102 12044 6073 5449 11545 16856 15924 17495 16310 21353 27164 34439 19623
13806 19623 24418 30953 41130 48869 42616 22342 17064 24622 18279 11028 19581 30749 37849 37885
13792 37885 59440 64537 85369 82540 70828 81558 91932 108819 106919 105359 84215 79370 79142
13779 79142 61313 48166 41247 36017 19552 10505 13685 29306 39256 33123 44876 37801 20117
13766 20117 10102 7299 18630 13389 20170 32932 31994 28361 24518 14746 29291 39886 37671
13753 37671 29926 21432 17404 20579 33263 24032 19521 17325 13039 7207 11393 32961 48994 60940
13739 60940 51648 50396 51634 42237 42682 34093 28684 22975 21522 20653 19934 13717 -2509 -4329 3532
13724 3532 13837 24556 20536 17320 8036 6594 12709 9015 -6549 -8530 -15521 4154 10174 4054
$$ packed form
13821C1959k228J080j2709o058n971o24O096N311r32J571j185N043N811P275j4816
13806A9623M795O535J0177P739o253k0274n278P558o343p251Q553J1168P100L6
13792C7885K1555N097K0832k829j1712J0730J0374J6887j900j560k1144m845k28
13779G9142j7829j3147o919n230j6465r047L180J5621R950o133J1753p075j7684
13766B0117j0015k803J1331n241O781J2762r38l633l843r772J4545J0595k215
13753C7671p745q494m028L175J2684r231m511k196m286n832M186K1568J6033J1946
13739F0940r292j252J238r397M45q589n409n709j453q69p19o217j6226j820P861
13724C532J0305J0719m020l216r284j442O115l694j5564j981o991J9675O020o120
$$ plain form
13710 4054 6324 11197 7955 1826 -11650 -6164 -1526 16208 17360 16619 23088 22015 22110 20785 17655
13695 17655 16128 4753 -7015 2885 3155 14172 27378 38112 44282 43742 31694 14161 9930
13682 9930 10050 21357 24821 14507 16246 23536 14079 6731 -5224 -4768 -525 -4812 -4913 -298 1009
13667 1009 -3536 -5000 6653 3183 4183 -2481 -18242 -10449 6274 -881 33 -2650 -9310 -7644
13653 -7644 -2137 2965 8465 -1495 -6263 -3393 14706 18773 4367 1949 11380 2455 -4295 -9619
13639 -9619 -5992 10069 17928 18819 34256 41405 43723 31604 25180 32057 32315 26224 17273 1960
13625 1960 -15811 -7881 18387 26485 31022 32143 29178 33048 30624 21379 10882 4937 6190 6079
13611 6079 10086 23072 14524 12149 25249 3218 -18661 -6181 3337 -5454 -6545 4121 23039
$$ packed form
13710D054K270M873l242o129j3476N486M638J7734J152p41O469j073R5j325l130
13695A7655j527j1375j1768R900K70J1017J3206J0734O170n40j2048j7533m231
13682I930J20J1307L464j0314J739P290r457p348j1955M56M243m287j01M615J307
13667A009m545j464J1653l470J000o664j5761P793J6723p155R14k683o660J666
13653g644N507N102N500r960m768K870J8099M067j4406k418R431q925o750n324
13639i619L627J6061P859Q91J5437P149K318j2119o424O877K58o091q951j5313
13625A960j7771P930K6268Q098M537J121k965L870k424r245j0497n945J253j11
13611F079M007J2986q548k375J3100k2031k1879J2480R518q791j091J0666J8918
$$ plain form
13598 23039 25559 25979 26889 12352 9182 19725 25363 22400 16547 27596 29065 25159 20346 8368
13584 8368 3616 9515 10689 27231 40384 24766 21652 30272 32133 28905 28520 47428 39130 31278
13570 31278 36145 35333 43137 47343 42818 37053 32068 35655 20579 14878 15875 16772 18419 11725 12049
13555 12049 20406 42847 43631 44301 50982 55852 52067 39087 30289 43382 48299 56148 51863 51015
13541 51015 56097 57144 66999 75494 72310 74521 76789 74443 63344 62026 60998 46265 31730 30654
13527 30654 45058 55868 58623 53751 58294 64402 54993 47997 38794 44923 51307 66583 70092 71009
13513 71009 60623 49700 41176 54724 62109 64694 70277 69637 73858 78655 82631 86586 90738 97922
13499 97922 107094 109271 107205 99998 90942 98077 102870 97435 94214 100053 104387 114636 115678 117733
$$ packed form
13598B3039K520M20R10j4537l170J0543N638k963n853J1049J469l906m813j1978
13584H368m752N899J174J6542J3153j5618l114Q620J861l228l85J8908q298p852
13570C1278M867q12P804M206m525n765m985L587j5076n701R97Q97J647o694L24
13555A2049Q357K2441P84O70O681M870l785j2980q798J3093M917P849m285q48
13541E1015N082J047R855Q495l184K211K268k346j1099j318j028j4733j4535j076
13527C0654J4404J0810K755m872M543O108r409o996r203O129O384J5276L509R17
13513G1009j0386j0923q524J3548P385K585N583o40M221M797L976L955M152P184
13499I7922R172K177k066p207r056P135M793n435l221N839M334J0249J042K055
$$ plain form
13485 117733 130000 142383 146595 149186 148221 151081 156682 155844 161073 169760 171934 171227 166906 150852
13471 150852 144038 155335 168203 165929 168334 179373 200125 215278 219812 219418 218854 222936 233708
13458 233708 247842 264382 273822 287638 295648 313083 323135 341131 360559 370733 371555 377280
13446 377280 398444 419687 427820 445802 489119 519094 517195 540079 573813 608783 644231 686911
13434 686911 735240 797879 864323 932622 1017516 1119726 1231572 1333918 1478778 1649727
13424 1649727 1863974 2109028 2387903 2706018 3071596 3529191 4070521 4690544 5363286
13415 5363286 6045338 6674063 7159280 7443569 7477394 7235554 6793979 6239171 5631539 5046718
13405 5046718 4542201 4101607 3731407 3416425 3143254 2916459 2741545 2605512 2487975
$$ packed form
13485A17733J2267J2383M212K591r65K860N601q38N229Q687K174p07m321j6054
13471A50852o814J1297J2868k274K405J1039K0752J5153M534l94n64M082J0772
13458B33708J4134J6540R440J3816Q010J7435J0052J7996J9428J0174Q22N725
13446C77280K1164K1243Q133J7982M3317K9975j899K2884L3734L4970L5448M2680
13434F86911M8329O2639O6444O8299Q4894J02210J11846J02346J44860J70949
13424A649727K14247K45054K78875L18115L65578M57595N41330O20023O72742
13415E363286O82052O28725M85217K84289L3825k41840m41575n54808o07632n84821
13405E046718n04517m40594l70200l14982k73171k26795j74914j36033j17537
$$ plain form
13396 2487975 2405700 2362936 2334624 2327166 2337890 2370807 2431996 2516676 2629972 2773440 2928206
13385 2928206 3110118 3341652 3633323 3971823 4375779 4854520 5417521 6101962 6911187
13376 6911187 7905192 9089252 10504186 12180585 14075748 16144579 18304954 20321490
13368 20321490 21904970 22783496 22750679 21813931 20185271 18178367 16070522 14077289 12322091
13359 12322091 10812527 9536679 8465808 7569287 6822578 6195953 5688798 5260022 4887776
13350 4887776 4581280 4340069 4150261 3997906 3899482 3834548 3800956 3814306 3866286 3954671
13340 3954671 4079408 4255255 4480741 4772302 5127614 5568360 6112694 6767269 7568065
13331 7568065 8539278 9702815 11108086 12759113 14668925 16767155 18931753 20951403
$$ packed form
13396B487975q2275m2764k8312p458J0724L2917O1189Q4680J13296J43468J54766
13385B928206J81912K31534K91671L38500M03956M78741N63001O84441Q09225
13376F911187R94005J184060J414934J676399J895163K068831K160375K016536
13368B0321490J583480Q78526l2817r36748j628660k006904k107845j993233j755198
13359A2322091j509564j275848j070871q96521p46709o26625n07155m28776l72246
13350D887776l06496k41211j89808j52355r8424o4934l3592J3350N1980Q8385
13340C954671J24737J75847K25486K91561L55312M40746N44334O54575Q00796
13331G568065R71213J163537J405271J651027J909812K098230K164598K019650
$$ plain form
13323 20951403 22510822 23302930 23175748 22141377 20413798 18308347 16120927 14056748
13315 14056748 12226698 10660619 9340031 8236202 7310599 6526233 5851153 5273650 4781306
13306 4781306 4368047 4002371 3698218 3441549 3231257 3046975 2888610 2766550 2665741
13297 2665741 2595645 2558539 2546232 2537302 2544194 2587059 2662809 2767373 2910643 3103447 3344006
13286 3344006 3635508 3983439 4410789 4922149 5511707 6147857 6792633 7378567 7800009
13277 7800009 7991643 7914204 7567867 7012442 6344231 5636462 4951706 4351951 3826465 3369927
13267 3369927 2980668 2651154 2385087 2144221 1941495 1762303 1607180 1455884 1335240
13258 1335240 1225281 1117991 1030882 971949 914033 863732 832547 777750 721345 672463 636438
$$ packed form
13323B0951403J559419P92108j27182j034371j727579k105451k187420k064179
13315A4056748j830050j566079j320588j103829r25603p84366o75080n77503m92344
13306D781306m13259l65676l04153k56669k10292j84282j58365j22060j00809
13297B665741p0096l7106j2307q930O892M2865P5750J04564J43270J92804K40559
13286C344006K91502L47931M27350N11360N89558O36150O44776N85934M21442
13277G800009J91634p7439l46337n55425o68211p07769o84756n99755n25486m56538
13267C369927l89259l29514k66067k40866k02726j79192j55123j51296j20644
13258A335240j09959j07290q7109n8933n7916n0301l1185n4797n6405m8882l6025
$$ plain form
13247 636438 610081 587368 552660 522448 510647 502370 476478 451944 440441 432909 422969 404040
13235 404040 381476 370176 357572 346256 327749 328260 332349 322795 304667 289246 289917 289045 270392
13222 270392 254314 239345 230786 211236 209106 210242 206309 198643 198490 207734 207610 207150 211530 200734
13208 200734 187611 185134 180483 179779 174532 167216 168693 172529 159306 148542 144044 131323 124729
13195 124729 128382 130459 129080 138524 131918 119947 125311 123033 119774 123459 132829 122428 111662
13182 111662 126872 118578 116853 125270 130676 129617 122625 108185 99122 91989 93235 99495 75043
13169 75043 71617 93154 104699 97114 98882 95600 91732 93109 90947 89316 91992 96815 90559 99843
13155 99843 111468 96091 80278 59527 57592 58568 70263 77273 92701 94112 84546 76749 57605
$$ packed form
13247F36438k6357k2713l4708l0212j1801q277k5892k4534j1503p532r940j8929
13235D04040k2564j1300j2604j1316j8507N11M089r554j8128j5421O71q72j8653
13222B70392j6078j4969q559j9550k130J136l933p666j53R244j24m60M380j0796
13208B00734j3123k477m651p04n247p316J477L836j3223j0764m498j2721o594
13195A24729L653K077j379R444o606j1971N364k278l259L685R370j0401j0766
13182A11662J5210q294j725Q417N406j059o992j4440r063p133J246O260k4452
13169G5043l426K1537J1545p585J768l282l868J377k162j631K676M823o256R284
13155I9843J1625j5377j5813k0751j935R76J1695P010J5428J411r566p797j9144
$$ plain form
13142 57605 56084 59308 56997 59358 57540 66120 69879 71621 78840 75401 67558 58502 58901 42787
13128 42787 43064 46799 53925 63566 63405 65339 72064 70830 58476 60854 63100 50087 52472 56990
13114 56990 56444 67262 65805 58933 53795 51984 48807 59859 53140 58958 59344 60823 61388 48114
13100 48114 40178 42983 40295 36243 41365 26786 35167 48833 40477 33291 33417 27681 24304 22909
13086 22909 38509 43584 46217 36670 30151 18870 12760 14737 31472 33870 26321 26232 21986 31482
13072 31482 40745 54676 46918 39347 37148 38205 48745 38936 28527 30382 33271 31428 24670 9317
13058 9317 3948 889 7758 15040 25325 31458 20152 14382 9958 6903 3 11970 13996 18587
13044 18587 18774 17744 17026 16483 15511 26380 25877 22962 24585 29463 36908 35357 19469 9087 9506
$$ packed form
13142E7605j521L224k311K361j818Q580L759J742P219l439p843r056L99j6114
13128D2787K77L735P126R641j61J934O725j234j2354K378K246j3013K385M518
13114E6990n46J0818j457o872n138j811l177J1052o719N818L86J479N65j3274
13100D8114p936K805k688m052N122j4579Q381J3666q356p186J26n736l377j395
13086B2909J5600N075K633r547o519j1281o110J977J6735K398p549q9m246R496
13072C1482R263J3931p758p571k199J057J0540r809j0409J855K889j843o758j5353
13058I317n369l059O869P282J0285O133j1306n770m424l055o900J1967K026M591
13044A8587J87j030p18n43r72J0869n03k915J623M878P445j551j5888j0382M19
$$ plain form
13029 9506 10281 8192 -3100 -276 3501 13316 28553 22579 8076 6409 11903 12920 25270 42654
13015 42654 46164 41125 21951 26630 22532 7113 13007 13565 7052 2586 10707 20141 12264 -3711
13001 -3711 -11309 5191 5063 2224 22314 32513 25960 30514 27345 32430 30845 14053 4454 13073
12987 13073 18310 26077 40308 51880 49552 26253 30928 22075 1468 3515 1713 -5615 -15555
12974 -15555 -5776 5601 -554 -5114 -6855 278 1650 -1259 -716 16506 24359 11970 14047 20756
12960 20756 14757 6246 9427 8607 560 1173 7462 17667 20641 25057 19478 23129 33449 36888
12946 36888 38616 52552 52100 39838 42315 48160 43886 31516 23955 29528 29855 26121 23149 25309
12932 25309 17466 12983 19030 14265 12609 27149 37628 36843 46059 28793 17960 28921 37505
$$ packed form
13029I506P75k089j1292K824L777R815J5237n974j4503j667N494J017J2350J7384
13015D2654L510n039j9174M679m098j5419N894N58o513m466Q121R434p877j5975
13001c711p598J6500j28k839K0090J0199o553M554l169N085j585j6792r599Q619
12987A3073N237P767J4231J1572k328k3299M675q853k0607K047j802p328r940
12974a5555R779J1377o155m560j741P133J372k909N43J7222P853j2389K077O709
12960B0756n999q511L181q20q047O13O289J0205K974M416n579L651J0320L439
12946C6888J728J3936m52j2262K477N845m274j2370p561N573L27l734k972K160
12932B5309p843m483O047m765j656J4540J0479p85R216j7266j0833J0961Q584
$$ plain form
12919 37505 30272 15766 16726 28716 33062 13961 15763 33274 45471 42571 41892 27825 19675
12906 19675 38370 39772 47699 61030 71258 68191 61130 83243 97444 108449 122049 117146 114417
12893 114417 114226 114298 105630 88972 81044 77883 67831 53371 54748 42522 37017 50648 54770 54237
12879 54237 39791 30702 32938 25179 19728 34609 57039 55557 38098 37293 39895 47476 46778 43681
12865 43681 46915 50051 54194 53289 36069 41960 49810 63580 70649 87162 106633 100017 105448 116786
12851 116786 128002 145855 156975 158779 122657 100308 86465 69001 53385 63531 56180 46259
12839 46259 49497 51220 35316 29615 27613 26048 21233 30928 43667 39190 22513 1870 -9680
12826 -9680 10400 27378 21339 14473 12988 24422 30969 21206 18905 27448 30394 30514 24966 30742
$$ packed form
12919C7505p233j4506R60J1990M346j9101J802J7511J2197k900o79j4067q150
12906A9675J8695J402P927J3331J0228l067p061K2113J4201J1005J3600m903k729
12893A14417j91P2q668j6658p928l161j0052j4460J377j2226n505J3631M122n33
12879E4237j4446r089K236p759n451J4881K2430j482j7459q05K602P581o98l097
12865D3681L234L136M143r05j7220N891P850J3770P069J6513J9471o616N431J1338
12851A16786J1216J7853J1120J804l6122k2349j3843j7464j5616J0146p351r921
12839D6259L238J723j5904n701k002j565m815R695J2739m477j6677k0643j1550
12826i680K0080J6978o039o866j485J1434O547r763k301Q543K946J20n548N776
$$ plain form
12812 30742 30897 45849 65154 52390 55663 47483 43859 48498 52644 49177 58460 51191 37323 22325
12798 22325 6148 2446 2338 -1801 1574 20784 32651 24275 36784 40811 34119 23701 -666
12785 -666 2102 15748 2229 -747 326 -6419 -9941 -12973 -6689 2747 15859 15481 25657 21839
12771 21839 14151 -4105 -10024 -810 157 -10356 -12762 -22812 -22202 -16970 -14579 -13810 -8386 2355
12757 2355 16134 8807 18150 16526 2898 12280 21377 17467 20237 25444 22552 22663 24790 23385
12743 23385 20995 20322 22520 17232 8082 -4415 -3759 -3536 -1219 3740 17000 12500 2012 -6770
12729 -6770 -2861 2397 6824 2836 -288 2384 3075 -3119 -5284 -6641 -17772 -26063 -24505 -28053 -24262
12714 -24262 -5629 -8749 -16350 -12802 -8702 -5000 4149 545 -13644 -2280 26372 30976 11231
$$ packed form
12812C0742J55J4952J9305j2764L273q180l624M639M146l467R283p269j3868j4998
12798B2325j6177l702j08m139L375J9210J1867q376J2509M027o692j0418k4367
12785f66K768J3646j3519k976J073o745l522l032O284R436J3112l78J0176l818
12771B1839p688j8256n919R214R67j0513k406j0050O10N232K391P69N424J0741
12757B355J3779p327R343j624j3628R382R097l910K770N207k892J11K127j405
12743B3385k390o73K198n288r150j2497O56K23K317M959J3260m500j0488q782
12729f770L909N258M427l988l124K672O91o194k165j357j1131q291J558l548L791
12714b4262J8633l120p601L548M100L702R149l604j4189J1364K8652M604j9745
$$ plain form
12701 11231 -1420 7902 6352 6687 13159 11337 16574 7532 -1052 130 6783 1989 -5507 102
12687 102 15880 17555 10514 2872 3403 13451 17099 17586 12883 4434 4879 12406 8077 2835 5846
12672 5846 3615 -378 3476 -4120 -3517 -10915 -24110 -26443 -17046 -1540 2402 -1624 1960 -11336
12658 -11336 -36056 -36367 -25384 -22559 -27725 -30639 -29353 -28816 -28780 -28793 -17082 -9306 -6875 1487 9430
12643 9430 11518 7898 4527 -1669 3691 6457 3618 -773 -9228 -12211 -12498 -12818 2586 5533 10629
12628 10629 18524 8490 -2226 -11409 -12404 -24100 -10009 -10170 -7662 -9246 -2493 -4678 -13055 -20153
12614 -20153 -22359 -11793 -3349 3897 4698 9516 14317 5183 1390 6967 18076 29329 28651 31272
12600 31272 31196 20427 14319 11819 18651 34626 39023 31169 23740 21012 17928 3709 2706 6848
$$ packed form
12701A1231j2651R322j550L35O472j822N237r042q584J182O653m794p496N609
12687A02J5778J675p041p642N31J0048L648M87m703q449M45P527m329n242L011
12672E846k231l993L854p596O03p398j3195k333R397J5506L942m026L584j3296
12658a1336k4720l11J0983K825n166k914J286N37L6j3J1711P776K431Q362P943
12643I430K088l620l371o196N360K766k839m391q455k983k87l20J5404K947N096
12628A0629P895j0034j0716r183r95j1696J4091j61K508j584O753k185q377p098
12614b0153k206J0566Q444P246Q01M818M801r134l793N577J1109J1253o78K621
12600C1272p6j0769o108k500O832J5975M397p854p429k728l084j4219j003M142
$$ plain form
12586 6848 14873 19034 15710 3446 986 3470 -4949 3103 4365 -433 -15166 -6219 5891 -1772
12572 -1772 -4926 -6389 -4072 4351 15324 18377 12492 16602 16092 14852 17524 15206 12477 14195 13393
12557 13393 15119 16773 17727 22991 22110 -1386 -4668 7896 16026 13766 13471 15750 16129 14323 1657
12542 1657 -4823 -14287 -12933 -2387 7060 1411 192 458 -7666 -18846 -19721 -22114 -23071 -7125 -6286
12527 -6286 -7198 -3517 -12819 -18762 -6922 -5403 2743 -6851 -3045 -8464 -15132 -15032 -19707 -16694 -17984
12512 -17984 -2114 12988 12861 13071 6102 2576 6292 17213 13791 -326 -11440 -2097 -3127 -14902
12498 -14902 -13136 -3130 8678 -514 -9063 -16118 -14259 -652 -1082 -1769 305 -7846 -16323 -19573
12484 -19573 -7114 -9584 -11013 -14641 -12336 -8768 -4274 -1955 -7505 -7762 -4336 3742 -9636 -15668
$$ packed form
12586F848Q025M161l324j2264k460K484q419Q052J262m798j4733Q947J2110p663
12572a772l154j463K317Q423J0973L053n885M110n10j240K672k318k729J718q02
12557A3393J726J654R54N264q81k3496l282J2564Q130k260k95K279L79j806j2666
12542A657o480r464J354J0546R447n649j219K66q124j1180q75k393r57J5946Q39
12527f286r12L681r302n943J1840J519Q146r594L806n419o668J00m675L013j290
12512a7984J5870J5102j27K10o969l526L716J0921l422j4117j1114R343j030j1775
12498a4902J766J0006J1808r192q549p055J859J3607m30o87K074q151q477l250
12484a9573J2459k470j429l628K305L568M494K319n550k57L426Q078j3378o032
$$ plain form
12470 -15668 -18653 -10143 -8789 -12441 -8557 -11316 -19333 -9994 -3328 -7093 -8391 -2452 7924 7785
12456 7785 -9398 -9550 2416 14835 13421 14363 19572 15589 18180 32837 31537 21556 3244 4033
12442 4033 2938 3411 10 3161 7270 -213 -3245 5215 2461 -8987 -11738 -4881 -3872 -3860 -4022
12427 -4022 -26772 -17630 -1623 -5555 -7758 6268 14959 7393 -14159 -21989 -17674 -5727 -1649
12414 -1649 -11077 -9976 -11075 -23851 -19745 -7840 3010 18293 17898 9511 16476 14732 14246 16081
12400 16081 5080 4615 6636 2273 10615 10989 14483 14070 16478 14268 -1987 -5681 565 3880 9746
12385 9746 16948 23614 14520 16327 12502 -667 6628 12728 9794 11183 15830 10723 16918 25848
12371 25848 16260 12560 14939 7308 5746 585 3205 -5144 -6731 8235 15735 17063 17530 19279
$$ packed form
12470a5668k985Q510J354l652L884k759q017R339O666l765j298N939J0376j39
12456G785j7183j52J1966J2419j414R42N209l983K591J4657j300r981j8312P89
12442D033j095M73l401L151M109p483l032Q460k754j1448k751O857J009J2j62
12427d022k2750R142J6007l932k203J4026Q691p566k1552p830M315J1947M078
12414a649r428J101j099j2776M106J1905J0850J5283l95q387O965j744m86J835
12400A6081j1001m65K021m363Q342L74L494m13K408k210j6255l694O246L315N866
12385I746P202O666r094J807l825j3169P295O100k934J389M647n107O195Q930
12371B5848r588l700K379p631j562n161K620q349j587J4966P500J328M67J749
$$ plain form
12357 19279 13707 250 -3782 -7953 -15026 -12457 -17332 -7782 -377 10983 14344 12656 7083 9707
12343 9707 8068 -143 -11769 -18491 -18144 -19590 -18476 -11254 -9994 -20772 -15391 -10050 -7054 -19459
12329 -19459 -28306 -27283 -9005 10862 8453 -771 -5480 -12826 -4397 5771 5043 -6410 -12928 -15368
12315 -15368 -3525 4700 1976 604 4463 7915 2292 4851 -400 -13936 -7110 3723 13215 12645
12301 12645 5523 8465 19195 24681 19289 12010 25121 31989 37624 32351 26861 9873 4756 5679
12287 5679 -5008 -13965 -14810 -12412 -15723 -18295 -12180 -21578 -22189 -16633 -9484 -3465 -2507 -2856 -12748
12272 -12748 -11876 -3636 11472 15473 11479 -109 5678 4491 584 -5679 -6808 -8752 -12942 -11464
12258 -11464 -19845 -14114 3774 -803 -16619 -16461 -8702 -6997 -1704 3913 -1606 -2844 -7414 -6009
$$ packed form
12357A9279n572j3457m032m171p073K569m875R550P405J1360L361j688n573K624
12343I707j639q211j1626o722L47j446J114P222J260j0778N381N341K996j2405
12329a9459q847J023J8278J9867k409r224m709p346Q429J0168p28j1453o518k440
12315a5368J1843Q225k724j372L859L452n623K559n251j3536O826J0833R492n70
12301A2645p122K942J0730N486n392p279J3111O868N635n273n490j6988n117R23
12287E679j0687q957q45K398l311k572O115r398o11N556P149O019R58l49r892
12272a2748Q72Q240J5108M001l994j1588N787j187l907o263j129j944m190J478
12258a1464q381N731J7888m577j5816J58P759J705N293N617n519j238m570J405
$$ plain form
12244 -6009 2026 18890 23660 8503 406 3174 22453 35522 29877 16047 21431 13205 13584 26911
12230 26911 25867 23195 35842 30758 32801 28731 14705 -1759 -10744 -22023 -34455 -39928 -38664
12217 -38664 -31863 -26162 -16225 -4573 -11114 -12861 -14189 -10932 118 16745 11484 -6909 -21824
12204 -21824 -32456 -40958 -34098 -27094 -18792 -26227 -28872 -27498 -28671 -13050 -7525 -16618 -25770 -15636
12190 -15636 -902 1858 1796 -3176 4335 9465 13832 17526 -3900 -28667 -30559 -29616 -18265 -9005
12176 -9005 -4912 14 -7915 -5620 15817 36625 33054 33888 26769 27368 34591 24262 12702 16949
12162 16949 33458 25379 -4624 -11889 -7953 -9626 -6089 -4901 -12992 -395 11508 10590 2816 -3958
12148 -3958 -5023 12067 20894 5877 6478 11508 11951 9139 19912 15645 -1258 -3602 -5441 -13024
$$ packed form
12244f009Q035J6864M770j5157q097K768J9279J3069n645j3830N384q226L79J3327
12230B6911j044k672J2647n084K043m070j4026j6464q985j1279j2432n473J264
12217c8664O801N701R937J1652o541j747j328L257J1050J6627n261j8393j4915
12204b1824j0632q502O860P004Q302p435k645J374j173J5621N525r093r152J0134
12190a5636J4734K760o2m972P511N130M367L694k1426k4767j892R43J1351R260
12176i005M093M926p929K295K1437K0808l571Q34p119N99P223j0329j1560M247
12162A6949J6509q079l0003p265L936j673L537J188q091J2597J1903r18p774o774
12148c958j065J7090Q827j5017O01N030M43k812J0773m267j6903k344j839p583
$$ plain form
12134 -13024 -16025 -13724 -724 -308 5504 -2286 -4041 -12034 -30059 -36795 -28832 -28179 -20330 -5153
12120 -5153 5717 12821 11086 11582 8268 7994 24599 20153 17570 16125 2425 2024 2274 4323 11528
12105 11528 26297 17401 8128 -1956 1543 19521 23783 17138 25259 32928 27257 22123 23460 9598
12091 9598 23555 26645 29789 37203 25001 11872 8226 3320 1926 -873 -1822 -2956 8326 8758
12077 8758 2600 4211 2345 11337 20579 22001 20667 25092 2146 -2680 5272 5303 -3310 -8095 -2652
12062 -2652 2770 286 1211 6655 4045 2826 9708 12328 16066 18730 4517 -11641 -13117 -2822
12048 -2822 6972 13069 23796 27173 29922 27133 24897 34284 46160 29812 15025 17028 13694 13018
12034 13018 27572 31771 29073 28226 27180 12642 3356 4593 -1863 -4832 -1525 -159 4744 4547
$$ packed form
12134a3024l001K301J3000M16N812p790j755p993j8025o736P963O53P849J5177
12120e153J0870P104j735M96l314k74J6605m446k583j445j3700m01K50K049P205
12105A1528J4769q896r273j0084L499J7978M262o645Q121P669n671n134J337j3862
12091I598J3957L090L144P414j2202j3129l646m906j394k799r49j134J1282M32
12077H758o158J611j866Q992R242J422j334M425k2946m826P952L1q613m785N443
12062b652N422k484R25N444k610j219O882K620L738K664j4213j6158j476J0295
12048b822R794O097J0727L377K749k789k236R387J1876j6348j4787K003l334o76
12034A3018J4554M199k698q47j046j4538r286J237o456k969L307J366M903j97
$$ plain form
12020 4547 18357 15580 10108 16405 11015 9519 22422 20583 11831 7740 5437 -6218 -3166 15701
12006 15701 23764 19200 17973 14326 22283 24798 27307 31960 29623 23478 35701 40819 20174 15529
11992 15529 20188 19486 35030 50267 64129 69628 79447 75379 71729 69799 63693 62302 63974 51228
11978 51228 57247 67899 74869 72971 82523 95219 96390 86570 77708 96811 115923 128191 133253
11965 133253 126249 131873 133046 126210 125141 130712 145430 162069 165363 179659 202801 218486 227279
11952 227279 234299 257973 279463 288371 296807 326616 355719 377259 403007 443030 501248 545800
11940 545800 582656 640163 698852 775253 867727 968414 1083546 1213078 1353944 1542177
11930 1542177 1792547 2088468 2439759 2891565 3484449 4282281 5362719 6888178 9053387
$$ packed form
12020D547J3810k777n472O297n390j496J2903j839q752m091k303j1655L052J8867
12006A5701Q063m564j227l647P957K515K509M653k337o145J2223N118k0645m645
11992A5529M659p02J5544J5237J3862N499R819m068l650j930o106j391J672j2746
11978E1228O019J0652O970j898R552J2696J171r820q862J9103J9112J2268N062
11965A33253p004N624J173o836j069N571J4718J6639L294J4296K3142J5685Q793
11952B27279P020K3674K1490Q908Q436K9809K9103K1540K5748M0023N8218M4552
11940E45800L6856N7507N8689P6401R2474J00687J15132J29532J40866J88233
11930A542177K50370K95921L51291M51806N92884P97832J080438J525459K165209
$$ plain form
11921 9053387 12128256 16444230 22212371 29160879 35839023 39434569 38019334 32630534
11913 32630534 25622288 19137283 14216629 10778995 8417092 6759703 5549841 4650490
11905 4650490 3953558 3391881 2947156 2593544 2296486 2037438 1827274 1649810 1494467
11896 1494467 1364038 1223610 1112135 1036589 967687 902258 848963 806967 770573 748254 729497
11885 729497 709014 708341 701435 686405 664612 662396 660203 651085 618128 583593 541440 504989 456582
11872 456582 410059 366898 331320 313043 285640 259514 239689 229468 230209 224348 216736 205296
11860 205296 180614 170783 156429 153678 145605 139089 118732 119822 133658 135054 118503 106446 108737
11847 108737 109509 119852 108194 87850 98101 107393 88625 77015 72973 48760 43894 65241
$$ packed form
11921I053387L074869M315974N768141O948508O678144L595546j415235n388800
11913C2630534p008246o485005m920654l437634k361903j657389j209862q99351
11905D650490o96932n61677m44725l53612k97058k59048k10164j77464j55343
11896A494467j30429j40428j11475p5546o8902o5429n3295m1996l6394k2319j8757
11885G29497k0483o73o906j5030k1793k216k193r118l2957l4535m2153l6451m8407
11872D56582m6523m3161l5578j8277k7403k6126j9825j0221P41n861p612j1440
11860B05296k4682r831j4354k751q073o516k0357J090J3836J396j6551j2057K291
11847A08737P72J0343j1658k0344J0251R292j8768j1610m042k4213m866K1347
$$ plain form
11835 65241 76906 79025 86247 76553 73115 79930 76922 79186 85572 83102 74960 65062 62084 59788
11821 59788 56201 53693 60528 54927 56841 63999 61645 54723 63836 65097 53462 39091 41268 54308
11807 54308 57281 59347 65724 56823 45118 34667 40195 47404 39515 32530 17123 8892 19534
11794 19534 26273 34226 34416 35378 46748 40587 39086 38151 35905 22942 31141 35453 45743 44051
11780 44051 39607 38131 32269 22562 32792 21248 14245 11700 5815 9903 7026 14614 30116 30346
11766 30346 36629 49464 54094 45932 34485 25464 24977 26781 33939 36203 17063 20454 33826 36446
11752 36446 30458 26516 27077 25165 20736 20570 26783 22648 15457 11553 18461 20022 17163 5919 16821
11737 16821 16310 13077 13731 14732 18864 27534 35494 29993 2665 811 6571 4841 10446 8133 -11214
$$ packed form
11835F5241J1665K119P222r694l438O815l008K264O386k470q142r898k978k296
11821E9788l587k508O835n601J914P158k354o922R113J261j1635j4371K177J3040
11807E4308K973K066O377q901j1705j0451N528P209p889o985j5407q231J0642
11794A9534O739P953J90R62J1370o161j501r35k246j2963Q199M312J0290j692
11780D4051m444j476n862r707J0230j1544p003k545n885M088k877P588J5502K30
11766C0346O283J2835M630q162j1447r021m87J804P158K264j9140L391J3372K620
11752C6446n988l942N61j912m429j66O213m135p191l904O908J561k859j1244J0902
11737A6821n11l233O54J001M132Q670P960n501k7328j854N760j730N605k313j9347
$$ plain form
11722 -11214 -13590 -4502 -9599 -10026 -1494 3302 -5041 -8897 -9422 -3928 9781 18722 17431 907
11708 907 4476 5320 1297 865 2193 5384 49 -4470 -2374 2612 7367 19317 21895 11954 -7265
11693 -7265 -4409 1893 4346 876 13256 9736 16174 19995 21205 7445 -3266 248 9058 7049
11679 7049 4741 12427 11621 14927 8453 -7143 -2021 15283 28567 27417 19114 20227 31968 31023
11665 31023 22072 6702 877 9083 14952 11945 2691 5058 -1969 9889 19831 33086 34204 26889
11651 26889 13953 4692 6634 3860 4378 -2451 -19479 -18264 -11123 -10712 -6097 9015 15135 15716
11637 15716 12570 3094 6863 10002 9341 28332 30125 26952 38945 36440 17647 6783 1233 8557
11623 8557 15593 12249 3666 17615 31584 36466 29289 18119 17466 9544 7026 4949 9092 20985
$$ packed form
11722a1214k376R088n097m27Q532M796q343l856n25N494J3709Q941j291j6524
11708I07L569Q44m023m32J328L191n335m519K096M986M755J1950K578r941j9219
11693g265K856O302K453l470J2380l520O438L821J210j3760j0711L514Q810k009
11679G049k308P686q06L306o474j5596N122J7304J3284j150q303J113J1741r45
11665C1023q951j5370n825Q206N869l007r254K367p027J1858R942J3255J118p315
11651B6889j2936r261J942k774N18o829j7028J215P141M11M615J5112O120N81
11637A5716l146r476L769L139o61J8991J793l173J1993k505j8793j0864n550P324
11623H557P036l344q583J3949J3969M882p177j1170o53p922k518k077M143J1893
$$ plain form
11609 20985 16282 1521 3264 8812 -5604 -16297 -15722 -16058 -18789 -25861 -18651 -4134 -14821 -22014
11595 -22014 -10473 -6036 -11386 -9226 -12453 -12197 -19609 -19137 -19569 -10865 -7782 -1153 13808 23655 24562
11580 24562 18440 6407 7799 -3779 -10968 -18897 -10657 -1210 3872 -1694 -12305 -16711 -19330 -23661
11566 -23661 -15312 -9706 -25485 -12189 -1735 2701 3851 1633 7555 3377 -7918 -19116 -11375
11553 -11375 -6775 -6365 -14265 -3466 1727 2961 -3570 5620 11108 14960 847 -15727 -11123 -10959
11539 -10959 -6095 -7851 -14756 -16439 6161 16489 16521 10437 11995 18446 14938 6452 22721 28530
11525 28530 21285 6034 -2866 -10940 -10851 -10936 -252 15398 28647 22709 15271 7560 10541 5989
11511 5989 10959 8811 14523 -9320 -20429 -19716 -13095 -16363 -24181 -22728 -20750 -13512 -8233 -9889
$$ packed form
11609B0985m703j4761J743N548j4416j0693N75l36k731p072P210J4517j0687p193
11595b2014J1541M437n350K160l227K56p412M72m32Q704L083O629J4961R847R07
11580B4562o122j2033J392j1578p189p929Q240R447N082n566j0611m406k619m331
11566b3661Q349N606j5779J3296J0454M436J150k218N922m178j1295j1198P741
11553a1375M600M10p900J0799N193J234o531R190N488L852j4113j6574M604J64
11539a0959M864j756o905j683K2600J0328L2o084J558O451l508q486J6269N809
11525B8530p245j5251q900q074Q9q5J0684J5650J3249n938p438p711K981m552
11511E989M970k148N712k3843j1109P13O621l268p818J453J978P238N279j656
$$ plain form
11497 -9889 -10883 -4695 -3557 -8746 -15213 -13152 -12926 -11182 -12605 -14698 -5846 344 5432 -1075 -15803
11482 -15803 -11881 -11513 -11557 -8961 13201 18484 7962 1153 -3309 -3434 -1332 -4716 -9875 -10577 -3572
11467 -3572 3617 8734 -2629 -3952 -12199 -7439 -5192 -7607 -11248 -16618 -2400 735 11938 14467
11453 14467 6906 4191 2635 -1910 8242 3114 -9668 -5136 -4184 -759 -4839 407 -3511 -3362
11439 -3362 -7605 -15628 -26040 -28517 -10913 21377 24866 24327 17679 12262 16220 1543 -5780 -13853
11425 -13853 -10247 -15756 -13829 -4236 4621 811 9226 1565 -6114 -8173 -10796 -9054 -12095 -8610
11411 -8610 11966 13150 -11498 -20265 -18175 -16820 -5400 4190 -934 -16927 -24612 -15339 -21383 -15195
11397 -15195 2266 316 -9553 -8027 5624 9186 15115 14175 -1204 11167 17462 7334 -3419
$$ packed form
11497i889r94O188J138n189o467K061K26J744j423k093Q852O190N088o507j4728
11482a5803L922L68m4K596K2162N283j0522o809m462j25K102l384n159p02P005
11467c572P189N117j1363j323q247M760K247k415l641n370J4218L135J1203K529
11453A4467p561k715j556m545J0152n128j2782M532R52L425m080N246l918J49
11439c362m243q023j0412k477J7604L2290L489n39o648n417L958j4677p323q073
11425a3853L606n509J927R593Q857l810Q415p661p679k059k623J742l041L485
11411h610K0576J184k4648q767K090J355J1420R590n124j5993p685R273o044O188
11397a5195J7461j950r869J526J3651L562N929r40j5379J2371O295j0128j0753
$$ plain form
11384 -3419 -10424 -20934 -10981 -340 -3841 -14960 -6440 652 -2013 2003 -2743 -10327 -1675 -196
11370 -196 7475 8127 -1224 -22192 -17251 -12137 -831 3046 -4579 -8282 -205 -11423 -10799 -2923 -7379
11355 -7379 -7759 -13884 -4895 -6595 -14329 -11306 -5846 9334 5837 8689 11553 18027 11102 -9541
11341 -9541 -16643 -2833 -2706 -4990 -3198 -5129 -13039 -1968 3068 5395 8308 3643 -2242 -9814
11327 -9814 5595 20368 7624 -17057 -19607 -15820 -6681 -6755 671 -4240 -18680 -22203 -22974 -17577
11313 -17577 -19063 -11870 -2968 -6252 -1816 2473 14919 12103 4182 3962 5492 1213 -5806 -3922
11299 -3922 -6564 -2790 5588 7396 -6400 -13485 -6075 -1752 -4982 -18242 -15206 -13153 -16031 -20334
11285 -20334 -24261 -13530 -8354 -15241 -551 -422 -6203 -20518 -29136 -18263 -12069 -22327 -16010
$$ packed form
11384c419p005j0510R953J0641l501j1119Q520P092k665M016m746p584Q652J479
11370a96P671O52r351k0968M941N114J1306L877p625l703Q077j1218O24P876m456
11355g379l80o125Q989j700p734L023N460J5180l497K852K864O474o925k0643
11341i541p102J3810J27k284J792j931p910J1071N036K327K913m665n885p572
11327i814J5409J4773j2744k4681k550L787R139p4P426m911j4440l523p71N397
11313a7577j486P193Q902l284M436M289J2446k816p921k20J530m279p019J884
11299c922k642L774Q378J808j3796p085P410M323l230j3260L036K053k878m303
11285b0334l927J0731N176o887J4690J29n781j4315q618J0873O194j0258O317
$$ plain form
11272 -16010 -1062 -7779 -11125 -23928 -16436 -16386 -10777 -18837 -19671 487 10401 17834 21453 15300
11258 15300 11729 -114 -2348 -4961 2035 15793 22943 7975 -11460 -22662 -19802 -15728 -9359
11245 -9359 -5230 -5452 -9633 -6077 -2728 7344 22692 19127 14437 3022 -11472 -3199 -3265 -2494 -10598
11230 -10598 -11839 -9392 3933 -57 -829 -2029 -6432 1014 -11329 -19292 -25226 -20208 -16293 -31055
11216 -31055 -30530 -17426 -5723 -3211 -213 -5876 -7811 -20850 -27758 -23823 -14911 -10092 -12661 -16251
11202 -16251 -19069 -21861 -21948 -12010 289 8193 -7604 -15353 -20932 -13120 -7555 -11973 -4077 -3913 -13163
11187 -13163 -9281 -12810 -12721 -7537 -4016 -2403 -9639 -8594 -11547 -20045 -9112 -18794 -9051 5276
11173 5276 1412 -5127 -6549 -12060 -4233 11494 14983 -17346 -11083 -11952 -16919 -20142 -14391 -15681
$$ packed form
11272a6010J4948o717l346j2803P492N0N609q060q34K0158R914P433L619o153
11258A5300l571j1843k234k613O996J3758P150j4968j9435j1202K860M074O369
11245i359M129k22m181L556L349J0072J5348l565m690j1415j4494Q273o6P71q104
11230a0598j241K447J3325l990p72j200m403P446j2343p963n934N018L915j4762
11216c1055N25J3104J1703K512K998n663j935j3039o908L935Q912M819k569l590
11202a6251k818k792q7R938J2299P904j5797p749n579P812N565m418P896J64r250
11187a3163L882l529Q9N184L521J613p236J045k953q498J0933r682R743J4327
11173E276l864o539j422n511P827J5727L489l2329O263q69m967l223N751j290
$$ plain form
11159 -15681 -13353 -2302 572 -2999 -693 -17584 -25333 -18001 -12361 -16866 -19633 -16051 -16508 2026
11145 2026 4879 -13274 -20390 -2156 830 2496 4899 3969 8929 16016 -2719 -5780 -3172 5833
11131 5833 10798 3233 7169 9470 14559 19749 16172 17268 12747 4273 -5999 -6760 887 -863 7384
11116 7384 14675 3979 -3389 -19896 -25440 -16477 -5022 7718 4450 1797 -247 -6589 6228
11103 6228 -7835 -21832 -27724 -23878 -6774 -4228 -2547 10234 8659 11717 2047 6603 -6329
11090 -6329 -19587 -21377 -23541 -20758 -14121 -14953 -10264 1676 2460 5140 6660 1 2623 7066 7433
11075 7433 8264 5374 -13 -2681 -13120 -10779 -4718 -8469 -5757 -10348 -12087 -13561 -953 -6745
11061 -6745 3768 277 6877 10797 13880 10593 2496 -954 -3960 -14873 -15750 -11291 -8877 -1429
$$ packed form
11159a5681K328J1051K874l571K306j6891p749P332N640m505k767L582m57J8534
11145B026K853j8153p116J8234K986J666K403r30M960P087j8735l061K608R005
11131E833M965p565L936K301N089N190l577J096m521q474j0272p61P647j750Q247
11116G384P291j0696p368j6507n544Q963J1455J2740l268k653k044o342J2817
11103F228j4063j3997n892L846J7104K546J681J2781j575L058r670M556j2932
11090f329j3258j790k164K783O637q32M689J1940P84K680J520o659K622M443L67
11075G433Q31k890n387k668j0439K341O061l751K712m591j739j474J2608n792
11061f745J0513l491O600L920L083l287q097l450l006j0913q77M459K414P448
$$ plain form
11047 -1429 12114 4353 3281 11613 17950 15054 9587 17791 28278 24957 20280 23277 23519 19238
11033 19238 8643 17417 30631 36596 32647 43876 53075 56092 54418 49550 48285 43809 37781 46245
11019 46245 54210 64994 71827 77311 89731 92483 103490 112497 96039 71742 71611 65959 69133
11006 69133 59262 58853 62723 78271 89704 82214 68527 44573 39214 32440 27243 29186 30792 26081
10992 26081 15992 17984 17139 18283 19987 15649 20380 19230 14377 22933 22301 1466 -8077 -16142
10978 -16142 -7374 -4440 -24548 -35056 -20913 -5781 9727 24465 8676 -8690 -11099 -13686
10966 -13686 -16928 -8118 -1609 -12897 -17900 -11056 -3198 -2729 -8252 -4932 -9624 -8778 -14158 -18223 -20376
10951 -20376 -18944 -21355 -13674 -3340 3794 9897 5438 -2222 -2537 -5821 -7222 -9848 -22791 -18597
$$ packed form
11047a429J3543p761j072Q332O337k896n467Q204J0487l321m677K997K42m281
11033A9238j0595Q774J3214N965l949J1229R199L017j674m868j265m476o028Q464
11019D6245P965J0784O833N484J2420K752J1007R007j6458k4297j31n652L174
11006F9133r871m09L870J5548J1433p490j3687k3954n359o774n197J943J606m711
10992B6081j0089J992q45J144J704m338M731j150m853Q556o32k0835r543q065
10978a6142Q768K934k0108j0508J4143J5132J5508J4738j5789j7366k409k587
10966a3686l242Q810O509j1288n003O844P858M69n523L320m692Q46n380m065k153
10951b0376J432k411P681J0334P134O103m459p660l15l284j401k626j2943M194
$$ plain form
10937 -18597 -19679 -26325 -26879 -19051 -19269 -20230 5006 12929 -3525 -4048 16011 13388 771 -51 -3305
10922 -3305 -16409 -21505 -8830 -5849 -2971 4825 -22 -3387 -13530 -15924 -13850 -8579 -6991 -1066
10908 -1066 -9691 -10532 -10827 -5691 -11829 -6563 5158 -17686 -27742 -17087 6266 15807 10521 8129
10894 8129 -2932 -10602 -10775 -21674 -15272 4918 1471 659 -2459 -6664 -6136 -14369 -20282 -34943
10880 -34943 -34240 -22362 -14192 -17831 -10339 -14315 -29053 -22894 -27738 -19110 -16388 -12161 -9701 -14669
10866 -14669 -9024 -16137 -31572 -31943 -21559 -12838 -17890 -20068 -21675 -26382 -20454 -13603 -10566 -12172
10852 -12172 3113 8411 3664 6422 20432 22152 -11986 -26375 -19171 -1735 -1895 5008 5509 10892
10838 10892 19981 8481 -8231 -19478 -7519 1446 -4370 -4202 -3357 6382 6465 16130 11486 30
$$ packed form
10937a8597j082o646n54P828k18r61K5236P923j6454n23K0059k623j2617q22l254
10922c305j3104n096J2675K981K878P796m847l365j0143k394K074N271J588N925
10908a066q625q41k95N136o138N266J1721k2844j0056J0655K3353R541n286k392
10894H129j1061p670j73j0899O402K0190l447q12l118m205N28q233n913j4661
10880c4943P03J1878Q170l639P492l976j4738O159m844Q628K722M227K460m968
10866a4669N645p113j5435l71J0384Q721n052k178j607m707N928O851L037j606
10852a2172J5285N298m747K758J4010J720l4138j4389P204J7436j60O903N01N383
10838A0892R089j1500j6712j1247J1959Q965n816J68Q45R739Q3R665m644j1456
$$ plain form
10824 30 -10192 -22817 -15505 -7654 -3351 -12294 -17548 -6710 5667 2521 4733 -1365 -14414 -14269
10810 -14269 394 10600 16952 6935 5653 14900 2891 -21999 -20266 -26282 -28063 -21750 -15899
10797 -15899 -23672 -22398 -9677 -12182 -10977 -21555 -16980 -5677 7200 13329 -2822 -2875 -18418
10784 -18418 -31612 -30291 -9128 1809 -3716 -8449 -10768 -6485 5402 6404 10433 20774 20355
10771 20355 18084 1942 -7974 -263 -1881 -21060 -28532 -22573 -13098 -10827 -13502 -11092 -15191 -22013
10757 -22013 -22970 -29259 -29675 -24139 -15046 -5232 -6900 -18726 -12107 -13901 -6135 -7876 -7262 -6853 -3601
10742 -3601 -215 -5777 -3329 -135 4034 -2055 -14897 -21943 -23054 -23798 -29152 -37203 -44169 -36091 -14668
10727 -14668 -14320 -4628 9836 16085 21531 16866 20487 21256 15872 8219 -2169 -5429 -8979 -12352
$$ packed form
10824C0j0222j2625P312P851M303q943n254J0838J2377l146K212o098j3049J45
10810a4269J4663J0206O352j0017j282R247j2009k4890J733o016j781O313N851
10797a5899p773J274J2721k505J205j0578M575J1303J2877O129j6151n3j5543
10784a8418j3194J321K1163J0937n525m733k319M283J1887J002M029J0341m19
10771B0355k271j6142r916P711j618j9179p472N959R475K271k675K410m099o822
10757b2013r57o289m16N536R093R814j668j1826O619j794P766j741O14M09L252
10742c601L386n562K448L194M169o089j2842p046j111p44n354q051o966Q078K1423
10727a4668L48R692J4464O249N446m665L621P69n384p653j0388l260l550l373
$$ plain form
10713 -12352 -4650 -2683 -8205 2349 9037 7540 1667 -2138 12287 17831 14983 19179 12982 12275
10699 12275 11372 368 -3582 -476 -5546 -3528 15496 24168 13897 12181 10015 4103 1343 1575
10685 1575 -3008 -8089 -10695 -10660 -3430 4634 -1784 -5361 -15086 -15041 -11796 2628 6188 5578 -5466
10670 -5466 -18435 -11169 -1043 10095 12406 13976 21079 27114 18394 16001 21211 8732 8006 19717
10656 19717 22906 22586 22670 10328 15499 6871 3199 317 14755 14495 21862 41432 45753 25756
10642 25756 12527 30208 48530 59199 56960 45235 47560 57227 60555 53813 66862 97078 104695
10629 104695 126261 146951 167234 181644 205103 243213 287542 316041 338558 385802 442692
10618 442692 502868 563254 661367 826046 1051252 1340622 1744605 2282334 2982031 3821875
$$ packed form
10713a2352P702J967n522J0554O688j497n873l805J4425N544k848M196o197p07
10699A2275r03j1004l950L106n070K018J9024Q672j0271j716k166n912k760K32
10685A575m583n081k606L5P230Q064o418l577r725M5L245J4424L560o10j1044
10670e466j2969P266J0126J1138K311J570P103O035q720k393N210j2479p26J1711
10656A9717L189l20Q4j2342N171q628l672k882J4438k60P367J9570M321j9997
10642B5756j3229J7681J8322J0669k239j1725K325R667L328o742J3049L0216P617
10629A04695K1566K0690K0283J4410K3459L8110M4329K8499K2517M7244N6890
10618D42692O0176O0386R8113J64679K25206K89370M03983N37729O99697Q39844
$$ plain form
10608 3821875 4701229 5459439 5918589 5984844 5770454 5493486 5350104 5457578 5902010 6741496
10598 6741496 8010074 9668279 11476697 12919265 13467035 13017691 11968685 10834447
10590 10834447 10038555 9795830 10167445 11176473 12827126 14960545 17170735 18687983
10582 18687983 18776872 17432175 15290295 13107039 11423038 10422017 10079467 10330916 11099852
10573 11099852 12200696 13282242 13820215 13368568 12024123 10241388 8515846 7186238
10565 7186238 6340200 5924854 5823639 5966176 6230641 6440568 6403224 5970392 5198896 4286650
10555 4286650 3413318 2694201 2132374 1722503 1426207 1207920 1040301 931579 821797
10546 821797 726834 638864 569171 520129 474740 433885 394587 358942 324529 295786 283169
$$ packed form
10608C821875Q79354P58210M59150O6255k14390k76968j43382J07474M44432Q39486
10598F741496J268578J658205J808418J442568N47770m49344j049006j134238
10590A0834447p95892k42725L71615J009028J650653K133419K210190J517248
10582A8687983Q8889j344697k141880k183256j684001j001021l42550K51449P68936
10573A1099852J100844J081546N37973m51647j344445j782735j725542j329608
10565G186238q46038m15346j01215J42537K64465K09927l7344m32832p71496r12246
10555D286650q73332p19117n61827m09871k96296k18287j67619j08722j09782
10546H21797r4963q7970o9693m9042m5389m0855l9298l5645l4413k8743j2617
$$ plain form
10535 283169 268919 252505 228987 216634 214942 215358 196711 191197 186208 171496 157890 146020
10523 146020 136438 131618 118933 107979 116000 114943 122423 128870 129817 123293 113751 102816 97366 84790
10509 84790 82491 75730 74298 78394 69005 71784 79782 79663 79834 70997 59180 56505 60956 53461 46818
10494 46818 40989 48464 60523 51089 42315 38506 43643 40987 38386 44919 36052 18241 28169 43539
10480 43539 45509 29638 21698 32258 25373 40068 41068 40142 45486 31292 10146 19519 28086
10467 28086 23052 9817 16423 29927 31054 32308 37332 34206 36977 33988 36208 27356 12294 5650
10453 5650 6560 15969 13192 14716 11160 32644 41172 30106 33056 34842 30382 35492 39001 30859
10439 30859 13691 -5272 -2888 8187 964 -3545 1023 16102 26734 28401 25974 14039 10026
$$ packed form
10535B83169j4250j6414k3518j2353j692M16j8647n514m989j4712j3606j1870
10523A46020r582m820j2685j0954Q021j057P480O447R47o524r542j0935n450j2576
10509H4790k299o761j432M096r389K779P998j19J71q837j1817k675M451p495o643
10494D6818n829P475J2059r434q774l809N137k656k601O533q867j7811R928J5370
10480D3539J970j5871p940J0560o885J4695J000r26N344j4194k1146R373Q567
10467B8086n034j3235O606J3504J127J254N024l126K771k989K220q852j5062o644
10453E650R10R409k777J524l556K1484Q528j1066K950J786m460N110L509q142
10439C0859j7168j8963K384J1075p223m509M568J5079J0632J667k427j1935m013
$$ plain form
10426 10026 2649 -1834 -3011 1346 -3602 -5718 -12686 -13379 -5793 -1438 -4989 -4987 15726 16296 16900 17787
10410 17787 11764 1117 -12018 -10899 10196 10331 -1166 3164 8553 11661 6274 457 -2918 4764
10396 4764 14427 10243 2555 1889 1984 -1197 3429 -1311 2484 6107 12397 21460 11549 3956 5201
10381 5201 4382 -4289 1839 7911 -1894 -8392 436 13450 8045 1271 3104 -42 -15828 -16845
10367 -16845 -23593 -19212 -12437 -13814 -13818 -20671 -31125 -39516 -39563 -20001 4948 14568 17884 4289 -5710
10352 -5710 -8903 -6102 16869 22342 22934 23112 21280 20148 18516 10453 1875 -5768 -22188 -26882 2407
10337 2407 22614 14590 10083 7898 20085 12816 -941 -8289 -22599 -20819 653 2826 -9915
10324 -9915 -13771 -12147 -4385 4249 3165 4142 6651 13229 19614 19257 21020 14582 15010 14454 24724
$$ packed form
10426A0026p377m483j177M357m948k116o968o93P586M355l551KK0713N70O04Q87
10410A7787o023j0647j3135J119K1095J35j1497M330N389L108n387n817l375P682
10396D764R663m184p688o66R5l181M626m740L795L623O290R063r911p593J245
10381E201q19q671O128O072r805o498Q828J3014n405o774J833l146j5786j017
10367a6845o748M381O775j377mo853j0454q391m7J9562K4949R620L316j3595r999
10352e710l193K801K2971N473N92J78j832j132j632q063q578p643j6420m694K9289
10337B407K0207q024m507k185J2187p269j3757p348j4310J780K1472K173j2741
10324i915l856J624P762Q634j084R77K509O578O385l57J763o438M28n56J0270
$$ plain form
10309 24724 24229 15952 -2690 -1550 -2444 -15120 -24837 -20673 -8626 -807 5678 11076 7402 -484
10295 -484 -1640 2189 11486 18337 16434 10831 9619 3401 -9813 1823 19095 15623 5446 -6905
10281 -6905 -5050 -5409 6775 15712 9844 -4983 -9033 1245 6661 9988 -3099 -17198 -11043 -11939
10267 -11939 -9686 3887 9417 13289 1130 -1895 3844 2905 -5519 -13158 -23075 -23662 -19984 -30462
10253 -30462 -35653 -31929 -22303 -19536 -5513 -5444 -5604 -19787 -29292 -31721 -24381 -34827 -38267 -30693
10239 -30693 -27660 -24836 -23174 -16333 -17209 -4769 6921 -7854 -20535 -25146 -33431 -22666 -11775
10226 -11775 -5520 -7220 -2347 -9286 -26900 -27089 -29993 -27906 -26439 -17849 -24638 -23887 -23602 -36247 -25014
10211 -25014 -17257 -6449 -2790 -4397 694 9998 19502 32775 46900 34985 35279 31093 26682 15921
$$ packed form
10309B4724m95q277j8642J140q94j2676r717M164J2047P819O485N398l674p886
10295d84j156L829R297O851j903n603j212o218j3214J1636J7272l472j0177j2351
10281f905J855l59J2184Q937n868j4827m050J0278N416L327j3087j4099O155q96
10267a1939K253J3573N530L872j2159l025N739r39q424p639r917n87L678j0478
10253c0462n191L724R626K767J4023O9j60j4183r505k429P340j0446l440P574
10239c0693L033K824J662O841q76J2440J1690j4775j2681m611q285J0765J0891
10226a1775O255j700M873o939j7614j89k904K087J467Q590o789P51K85j2645J1233
10211b5014P757J0808L659j607N091R304R504J3273J4125j1915K94m186m411j0761
$$ plain form
10197 15921 3350 -618 1023 -8200 -10613 -6453 -442 14287 8895 -1064 -7029 -12323 146 -9534
10183 -9534 -13665 -11428 -20010 -16084 -650 5941 2682 4910 6876 -2377 -1573 1759 8180 13824 22013
10168 22013 30220 20079 26643 26103 30297 28341 24780 32062 45023 56350 75952 74779 72558 67138
10154 67138 68033 57260 42291 41812 53443 67457 82041 102154 108018 88858 74124 69013 56371
10141 56371 44443 39205 38990 37750 55546 71143 77899 67771 53632 56008 44835 29904 29078
10128 29078 32418 28471 27548 26607 22164 12212 -2929 -2790 8457 17153 17333 3638 -2053 -12906
10114 -12906 -20938 -20925 -551 2246 1552 -6738 -2514 -7003 -13758 -11710 -7272 -3947 -15845 -26480
10100 -26480 -25694 -8779 -60 3159 104 5854 -2509 -12855 -11388 -13145 -16767 -7321 5117 -3400
$$ packed form
10197A5921j2571l968J641r223k413M160O011J4729n392r959n965n294J2469r680
10183i534m131K237q582L926J5434O591l259K228J966r253Q04L332O421N644Q189
10168B2013Q207j0141O564n40M194j956l561P282J2961J1327J9602j173k221n420
10154F7138Q95j0773j4969m79J1631J4014J4584K0113N864j9160j4734n111j2642
10141E6371j1928n238k15j240J7796J5597O756j0128j4139K376j1173j4931q26
10128B9078L340l947r23r41m443r952j5141J39J1247Q696J80j3695n691j0853
10114a2906q032J3K0374K797o94q290M224m489o755K048M438L325j1898j0635
10100b6480P86J6915Q719L219l055N750q363j0346J467j757l622R446J2438q517
$$ plain form
10086 -3400 -23543 -20377 -23605 -17396 -17094 -13783 -1934 4089 -1366 -92 -2774 -1129 -13799 -12861
10072 -12861 -5288 1274 15965 19839 18036 -2623 -11403 -23158 -17863 338 3256 4813 14408
10059 14408 11586 16079 6537 -643 4654 6171 10821 21181 19679 17542 8640 686 1804 -10978
10045 -10978 -17352 -22286 -21748 -20817 -9100 -17013 -16036 -1420 9834 17717 -1203 -21277 -19038 -10694
10031 -10694 -17869 -23505 -11616 -2875 -4251 -5215 -1602 -10820 -33159 -39382 -21536 -18564 -29019 -23365
10017 -23365 -18898 -13408 -18146 -25858 -26746 -20036 1919 3408 -8351 -21475 -24351 -21486 -11243 -19441
10003 -19441 -39207 -39769 -28897 -18854 -18235 -12152 309 -171 -9284 1788 2442 -2999 3247 -1350
9989 -1350 -9164 -10112 -5952 -8547 -12235 -12531 -13691 -26706 -24915 -15880 -15850 -22592 -23385 -22582 -12616 -16553
$$ packed form
10086c400k0143L166l228O209L02L311J1849O023n455J274k682J645j2670R38
10072a2861P573O562J4691L874j803k0659q780j1755N295J8201K918J557R595
10059A4408k822M493r542p180N297J517M650J0360j502k137q902p954J118j2782
10045a0978o374m934N38R31J1717p913R77J4616J1254P883j8920k0074K239Q344
10031a0694p175n636J1889Q741j376r64L613r218k2339o223J7846K972j0455N654
10017b3365M467N490m738p712q88O710K1955J489j1759j3124k876K865J0243q198
10003a9441j9766n62J0872J0043O19O083J2461m80r113J1072O54n441O246m597
9989a350p814r48M160k595l688k96j160j3015J791R035L0o742p93Q03R966l937
$$ plain form
9973 -16553 -6262 -6692 -3920 -6450 -6437 -15745 -21060 -12045 -8012 -947 -5630 -2917 -136 8111 15034
9958 15034 7981 -3029 -17709 -12171 -3828 7771 15579 19167 26036 20866 18152 29646 24070 23203
9944 23203 6461 -5383 -1518 -5614 5235 -7854 -11832 -13092 -11802 -6471 -20374 -26282 -24700
9931 -24700 -21697 -8176 -14836 -21917 -21333 -20206 -21106 -23317 -15874 -5339 2765 -4491 -6377 2812 -6354
9916 -6354 -12781 -11844 -16748 -13826 -9118 -17257 -22640 -26125 -25136 -22068 -27597 -19980 -1907 -3117 -17841
9901 -17841 -21873 -27132 -22996 -17093 -19240 -3997 -366 -5559 -9070 -13401 -17562 -3329 1306 -4628
9887 -4628 -3342 -3812 261 -5963 -19849 -29048 -25217 -4365 2875 12012 18260 17351 14495 24925 9739
9872 9739 4459 4976 4977 58 -16045 -7996 -10267 -23481 -30384 -33092 -14416 3160 9834 15011 4502
$$ packed form
9973a6553J0291m30K772k530J3r308n315R015M033P065m683K713K781Q247O923
9958A5034p053j1010j4680N538Q343J1599P808L588O869n170k714J1494n576q67
9944B3203j6742j1844L865m096J0849j3089l978j260J290N331j3903n908J582
9931b4700L003J3521o660p081N84J127r00k211P443J0535Q104p256j886R189r166
9916f354o427R37m904K922M708q139n383l485R89L068n529P617J8073j210j4724
9901a7841m032n259M136N903k147J5243L631n193l511m331m161J4233M635n934
9887d628J286m70M073o224j3886r199L831K0852P240R137O248r09k856J0430j5186
9872I739n280N17Jm919j6103Q049k271j3214o903k708J8676J7576O674N177j0509
$$ plain form
9857 4502 2673 -12155 -20934 -24580 -25231 -27304 -28382 -12878 -9051 -17587 -8537 4422 3122 -2364
9843 -2364 330 625 -3126 -16821 -16779 -13708 -9310 -9837 -20880 -18354 -5861 -15407 -14381 -10085 -1305
9828 -1305 -2504 -2184 -9467 -5119 5662 1574 -2182 -3691 -12800 -17094 -23376 -25521 -23271 -20141 -19321
9813 -19321 -15204 -14969 -7532 -11823 -8691 288 -6203 -9446 -8066 -16665 -29834 -19101 -9815 -1466
9799 -1466 4393 -4166 -9093 -10395 -15009 -24020 -24087 -2760 7939 3860 -6566 -16363 -26558 -34276
9785 -34276 -32581 -27178 -17724 -15598 -14890 -18469 -13092 -10231 -10690 -15312 -22177 -23611 -18885 -15522 -29601
9770 -29601 -35041 -25703 -31971 -29488 -21077 -12226 -4222 8914 -1494 -10875 -16708 -22054 -7347 -90
9756 -90 -2344 925 5104 541 -5011 -11145 -10665 -4496 1502 4074 4275 -5994 -14227 -14730 -15205 -8935
$$ packed form
9857D502j829j4828q779l646o51k073j078J5504L827q536R050J2959j300n486
9843b364K694K95l751j3695M2L071M398n27j1043K526J2493r546J026M296Q780
9828a305j199L20p283M348J0781m088l756j509r109m294o282k145K250L130Q20
9813a9321M117K35P437m291L132Q979o491l243J380q599j3169J0733R286Q349
9799a466N859q559m927j302m614r011o7K1327J0699m079j0426r797j0195p718
9785c4276J695N403R454K126P08l579N377K861m59m622o865j434M726L363j4079
9770b9601n440R338o268K483Q411Q851Q004J3136j0408r381n833n346J4707P257
9756i0k254L269M179m563n552o134M80O169N998K572K01j0269q233n03m75O270
$$ plain form
9740 -8935 -10209 -2724 -708 -5508 -6603 -8365 -17436 -25135 -22793 -18017 -11902 -15850 -4174 2304 -1488
9725 -1488 -13896 -10139 -16907 -22734 -23129 -17008 -16254 -23768 -17204 -19446 -13960 -17153 -16174 -6526 -989
9710 -989 9781 15090 3984 -9785 -17471 188 6388 872 -3531 -16582 -25142 -31168 -28698 -18830
9696 -18830 -4296 -4594 -17059 -26250 -31088 -31530 -26740 -22941 -22086 -23594 -20906 -26401 -27481 -21935 -10725
9681 -10725 -2392 -25 2478 -7193 6118 18232 5953 -10359 -16135 -8467 -16187 -15883 -30061 -38063
9667 -38063 -28889 -23768 -22844 -16670 -14761 -7348 -15520 -23955 -27732 -30333 -16904 -5489 -3529 -9587
9653 -9587 -15469 -16387 -7913 -7951 -10521 -13638 -14196 -15811 -10303 10330 29713 49080 50290 42899 14145
9638 14145 -1098 -4813 -6581 -18434 -22795 -26320 -32145 -27661 -23396 -26452 -27277 -21522 -13213 -17882
$$ packed form
9740h935j274P485K016m800j095j762r071p699K342M776O115l948J1676O478l792
9725a488j2408L757o768n827l95O121P54p514O564k242N486l193R79R648N537
9710i89J0770N309j1106j3769p686J7659O200n516m403j3051q560o026K470R868
9696a8830J4534k98j2465r191m838m42M790L799Q55j508K688n495j080N546J1210
9681a0725Q333K367K503r671J3311J2114j2279j6312n776P668p720L04j4178q002
9667c8063R174N121R24O174J909P413q172q435l777k601J3429J1415J960o058
9653i587n882r18Q474l8k570l117n58j615N508K0633J9383J9367J210p391k8754
9638A4145j5243l715j768j1853m361l525n825M484M265l056q25N755Q309m669
$$ plain form
9624 -17882 -15916 -22739 -9834 1086 -8830 -1783 2291 -3268 -7350 -9848 -6352 -4517 -335 -14446
9610 -14446 -40686 -40753 -24616 -4635 8458 -296 1490 -7451 -18612 -23690 -32920 -39704 -28843 -8718
9596 -8718 -17472 -20930 -3009 -989 -1089 -11656 -18485 -15748 -9247 -21970 -29018 -34895 -24246 -11308
9582 -11308 -12156 -11376 2442 15068 2176 -7958 -7521 -839 14169 20197 17169 9282 -719 -850
9568 -850 -13640 -10187 -3648 5437 1272 -14425 -11494 -9130 -19472 -22996 -27949 -19384 -19430 -4803 -3993
9553 -3993 -8095 -3725 -560 -6976 -10346 -9969 -7860 -13595 -19049 -28350 -33696 -29208 -23545 -15196 -24674
9538 -24674 -24527 -19654 -10063 -9463 -16706 -20987 -21023 -13540 -9088 -1924 4333 11184 -2842 -21909 -11055
9523 -11055 -7287 -9749 -20117 -26483 -35444 -33197 -27958 -25335 -17826 -10407 -22498 -25763 -14202 -5091
$$ packed form
9624a7882J966o823J2905J0920r916P047M074n559m082k498L496J835M182j4111
9610a4446k6240o7J6137J9981J3093q754J786q941j1161n078r230o784J0861K0125
9596h718q754l458J7921K020j00j0567o829K737O501j2723p048n877J0649J2938
9582a1308q48P80J3818J2626j2892j0134M37O682J5008O028l028p887j0001j31
9568h50j2790L453O539R085m165j5697K931K364j0342l524m953Q565m6J4627Q10
9553c993m102M370L165o416l370L77K109n735n454r301n346M488N663Q349r478
9538b4674J47M873R591O00p243m281l6P483M452P164O257O851j4026j9067J0854
9523a1055L768k462j0368o366q961K247N239K623P509P419j2091l265J1561R111
$$ plain form
9509 -5091 -3870 -7149 1431 3790 4018 -404 -9394 -12551 -16105 -33248 -27154 -24659 -20432 -14157 -17787
9494 -17787 -20536 -24753 -18660 -22994 -22763 -9389 -9122 -9732 -10445 -13230 -30761 -22722 -20027 -12470 5564
9479 5564 7002 -4699 -14238 -14681 -167 -2188 -7421 -4617 -6771 -3774 11907 12482 -4780 -13395
9465 -13395 -10721 -16972 -22151 -11450 -3138 -3332 -4033 3388 -7215 -13705 -15044 -13882 -8667 4232
9451 4232 1532 -9549 -19316 -27933 -16895 -18467 -25546 -13776 -4695 -10064 -26734 -20353 -13635 -13235
9437 -13235 -8352 -12316 -20667 -4630 1006 -4191 1296 1443 -3711 -2019 -9024 -4098 8820 3250
9423 3250 283 -14900 -22114 -10625 3620 1077 -7135 -19671 -17628 -16923 -17652 -14436 -13434 -8378
9409 -8378 -24808 -32883 -29920 -17425 -13033 -21609 -11015 -20972 -16280 -14052 -8202 -4303 -7274 -20977
$$ packed form
9509e091J221l279Q580K359K28m422q990l157l554j7143O094K495M227O275l630
9494a7787k749m217O093m334K31J3374K67o10p13k785j7531Q039K695P557J8034
9479E564J438j1701r539m43J4514k021n233K804k154K997J5681N75j7262q615
9465a3395K674o251n179J0701Q312j94p01P421j0603o490j339J162N215J2899
9451D232k700j1081r767q617J1038j572p079J1770R081n369j6670O381O718M00
9437a3235M883l964q351J6037N636n197N487J47n154J692p005M926J2918n570
9423C250k967j5183p214J1489J4245k543q212j2536K043P05p29L216J002N056
9409h378j6430q075K963J2495M392q576J0594r957M692K228N850L899k971j3703
$$ plain form
9395 -20977 -18976 -17531 -22483 -31684 -26050 -15920 -10190 -9778 -15799 -24120 -16511 -3399 -21546 -23507
9381 -23507 -11718 -10150 -10938 -6278 -5898 -1351 4136 10415 1461 -13639 -16628 -25377 -22837 -19953 -13267
9366 -13267 -9745 -15042 -13118 -6994 -6989 -8147 -667 8354 6649 7931 -2776 -13453 -4402 2369 17510
9351 17510 5916 -7297 -14934 -23289 -22108 -23495 -14665 -12907 -21667 -13732 9368 22579 26822 20571
9337 20571 15279 21817 18487 -4893 -15853 -18416 -4391 3996 535 -4723 -10152 -5322 -5086 -5324
9323 -5324 -6249 -14608 -32444 -41598 -38749 -31248 -35272 -39673 -36046 -23844 -22155 -18726 -2656 245
9309 245 607 1621 537 -1516 8531 13767 685 8543 5567 -3271 1502 -5937 -12328 -12774 -13511
9294 -13511 -7073 -6195 -5708 -11684 -13131 -6432 -10523 -1800 465 15204 18825 10902 2775 -10275 -1479
$$ packed form
9395b0977K001J445m952r201N634J0130N730M12o021q321P609J3112j8147j961
9381b3507J1789J568p88M660L80M547N487O279q954j5100k989q749K540K884O686
9366a3267L522n297J924O124Nj158P480R021j705J282j0707j0677R051O771J5141
9351A7510j1594j3213p637q355J181j387Q830J758q760P935K3100J3211M243o251
9337B0571n292O538l330k3380j0960k563J4025Q387l461n258n429M830K36k38
9323e324r25q359j7836r154K849P501m024m401L627J2202J689L429J6070K901
9309B45L62J014j084k053J0047N236j3082P858k976q838M773p439o391m46p37
9294a3511O438Q78M87n976j447O699m091Q723K265J4739L621p923q127j3050Q796
$$ plain form
9279 -1479 16148 18559 8040 -3973 -6746 -4482 -8396 -8678 -7694 -10933 -10202 771 5114 2342 -2594
9264 -2594 -11457 -9569 -6499 -15607 -26599 -30864 -21834 -19863 -10875 -11789 -27912 -28364 -28601 -28565 -22471 -14786
9248 -14786 1592 1471 -12268 -10840 -14535 -25970 -20899 -13398 -13571 -11985 -6937 -5293 -12473 5296
9234 5296 7998 8061 18971 15133 4322 -841 -3046 4299 7789 11118 4938 -8052 -16936 -15356 -6211
9219 -6211 -3441 5004 5496 -3001 -20888 -19575 -4767 -4995 4233 9576 2868 -841 -9072 -5437 -16969
9204 -16969 -4103 17116 13349 4742 -91 -7610 -4513 46 -196 -12526 -26049 -39239 -30382 -10120
9190 -10120 -8467 -25996 -21925 -20595 -22845 -21190 -18382 -16021 -17037 -12894 -14436 -25892 -25220 -15124
9176 -15124 5899 14259 19956 29838 38480 36834 28398 24943 25534 20483 12643 21344 22333 28545 28770
$$ packed form
9279a479J7627K411j0519j2013k773K264l914k82R84l239P31J0973M343k772m936
9264b594q863J888L070r108j0992m265R030J971Q988r14j6123m52k37L6O094P685
9248a4786J6378j21j3739J428l695j1435N071P501j73J586N048J644p180J7769
9234E296K702O3J0910l838j0811n163k205P345L490L329o180j2990q884J580R145
9219f211K770Q445M92q497j7887J313J4808k28R228N343o708l709q231L635j1532
9204a6969J2866K1219l767q607m833p519L097M559k42j2330j3523j3190Q857K0262
9190a0120J653j7529M071J330k250J655K808K361j016M143j542j1456O72J0096
9176a5124K1023Q360N697R882Q642j646q436l455N91n051p840Q701R89O212K25
$$ plain form
9161 28770 27107 23025 29749 29063 33923 36920 35659 20875 13917 23857 13118 21442 32150 31320
9147 31320 28269 17555 11287 1881 10251 15464 29286 28122 24954 24999 29119 28925 17012 15908 12166
9132 12166 13840 21283 22635 14871 -679 -13774 -15481 -16833 -22938 -23712 -8773 13664 12086 1042
9118 1042 -2482 6436 12778 21875 29471 16072 8437 628 -1811 -2921 -2278 15409 26055 13015
9104 13015 11760 18103 14026 16058 5720 5190 17499 24090 25954 33853 36560 37440 36802 36186 32854
9089 32854 50998 64849 66506 72162 72975 82722 92755 98679 128816 182862 221353 220274 208453
9076 208453 185545 154671 110181 91023 84766 63045 43706 30883 37388 43416 52201 53149 56960
9063 56960 48463 51121 50361 51519 61347 57838 58202 85205 88529 84209 74931 79062 88213 99743 111153
$$ packed form
9161B8770j663m082O724o86M860K997j261j4784o958R940j0739Q324J0708q30
9147C1320l051j0714o268r406Q370N213J3822j164l168M5M120j94j1913j104l742
9132A2166J674P443J352p764j5550j3095j707j352o105p74J4939K2437j578j1044
9118A042l524Q918O342R097P596j3399p635p809k439j110O43J7687J0646j3040
9104A3015j255O343m077K032j0338n30J2309O591J864P899K707Q80o38o16l332
9089C2854J8144J3851J657N656Q13R747J0033N924L0137N4046L8491j079j1821
9076B08453k2908l0874m4490j9158o257k1721j9339j2823O505O028Q785R48L811
9063E6960q497K658p60J158R828l509L64K7003L324m320r278M131R151J1530J1410
$$ plain form
9048 111153 141510 144765 158742 181467 207132 237794 285523 339126 387169 462667 560282 672467
9036 672467 810649 986077 1155231 1295171 1403172 1482576 1542329 1592317 1613633 1584178 1521094
9025 1521094 1420446 1307575 1175067 1029185 896288 787093 701415 620312 544105 473818
9015 473818 407794 357123 320480 293665 280902 268787 235219 203666 198518 191959 179069 161321
9003 161321 154661 157469 158493 152948 149111 159384 164471 168620 174315 176075 199016 223669 248397
8990 248397 270070 282898 275954 255293 216369 189117 173384 140683 122988 110587 100272 92029
8978 92029 92806 93089 98649 74865 65292 61702 55126 49776 47853 47892 52600 70599 84259 88978 95994
8963 95994 95277 102755 104247 99845 116522 134332 141045 139185 138758 160654 178269 191657 207740 231210
$$ packed form
9048A11153L0357L255J3977K2725K5665L0662M7729N3603M8043P5498R7615J12185
9036F72467J38182J75428J69154J39940J08001P9404N9753M9988K1316k9455o3084
9025A521094j00648j12871j32508j45882j32897j09195q5678q1103p6207p0287
9015D73818o6024n0671l6643k6815j2763j2115l3568l1553n148o559j2890j7748
9003A61321o660K808J024n545l837J0273N087M149N695J760K2941K4653K4728
8990B48397K1673J2828o944k0661l8924k7252j5733l2701j7695j2401j0315q243
8978I2029P77K83N560k3784r573l590o576n350j923L9M708J7999J3660M719P016
8963I5994p17P478J492m402J6677J7810O713j860m27K1896J7615J3388J6083K3470
$$ plain form
8949 231210 258651 274696 284368 286426 283476 287193 284567 254953 205976 133453 72559 42331 10992
8936 10992 -27644 -45376 -61294 -81655 -97537 -100198 -80458 -62188 -70751 -64104 -48500 -38673 -59046
8923 -59046 -65674 -60862 -57904 -56972 -57238 -42655 -52496 -61237 -49558 -31687 -15694 -6941 -18524 -18414
8909 -18414 -3195 2773 10644 20612 21188 19593 37669 43527 48542 46747 49903 43491 22311 11828
8895 11828 23003 33332 50257 83584 110958 141648 173957 213081 230023 233760 241587 236048
8883 236048 229027 218362 206936 194453 157511 143515 131120 123980 103874 84919 68646 57144
8871 57144 39911 34941 27921 36345 49308 58146 67067 72362 87165 81424 75725 97072 100215 94275
8857 94275 90845 68018 77903 72341 64925 71132 76197 78141 69864 67681 63089 53683 52038 60738
$$ packed form
8949B31210K7441J6045R672K058k950L717k626k9614m8977p2523o0894l0228l1339
8936A0992l8636j7732j5918k0361j5882k661J9740J8270q563O647J5604R827k0373
8923e9046o628M812K958R32k66J4583r841q741J1679J7871J5993Q753j1583J10
8909a8414J5219N968P871R968N76j595J8076N858N015j795L156o412k1180j0483
8895A1828J1175J0329J6925L3327K7374L0690L2309L9124J6942L737P827n539
8883B36048p021j0665j1426j2483l6942j3996j2395p140k0106j8955j6273j1502
8871E7144j7233m970p020Q424J2963Q838Q921N295J4803n741n699K1347L143n940
8857I4275l430k2827R885n562p416O207N065J944q277k183m592r406j645Q700
$$ plain form
8843 60738 65949 72561 70674 64609 79034 91925 95784 102617 114563 130137 142151 150246 161738
8830 161738 160768 168550 175032 189149 174735 156445 155051 154280 166564 176712 181155 192494 203090
8817 203090 215001 211101 218089 215655 204324 202230 191460 183961 175470 178839 175560 181898 180550 177215
8803 177215 166130 174625 171882 170890 171010 168168 162618 156616 157266 162670 154927 162680 178791 182904 185673
8788 185673 183674 195316 210712 200413 196115 196712 195543 180361 177209 194676 204848 209401 225227
8775 225227 248199 258563 265359 277658 276762 288574 304596 322586 336757 355004 373272 397396
8763 397396 428600 462690 491539 523739 566315 600961 618551 614715 596615 591196 583633 576057
8751 576057 554911 532348 522204 515690 507188 515044 523445 505984 496037 498815 501263 513200 516940
$$ packed form
8843F0738N211O612j887o065J4425J2891L859O833J1946J5574J2014Q095J1492
8830A61738r70P782O482J4117j4414j8290j394p71J2284J0148M443J1339J0596
8817B03090J1911l900O988k434j1331k094j0770p499q491L369l279O338j348l335
8803A77215j1085Q495k743r92J20k842n550o002O50N404p743P753J6111M113K769
8788A85673j999J1642J5396j0299m298N97j169j5182l152J7467J0172M553J5826
8775B25227K2972J0364O796J2299q96J1812J6022J7990J4171J8247J8268K4124
8763C97396L1204L4090K8849L2200M2576L4646J7590l836j8100n419p563p576
8751E76057k1146k2563j0144o514q502P856Q401j7461r947K778K448J1937L740
$$ plain form
8738 516940 511986 517857 529546 545078 558733 572779 586133 612707 634734 661114 685873 710743
8726 710743 735815 768133 803811 829414 850082 887481 928191 963946 1010679 1065201 1105175 1143655
8714 1143655 1188193 1235303 1282246 1323355 1369437 1421170 1478499 1539385 1612144 1704910 1804305
8703 1804305 1908445 2017510 2151242 2302540 2469740 2654801 2879692 3158070 3476872 3840998
8693 3840998 4247230 4716696 5281668 5983826 6901335 8135289 9832860 12154215 15338421
8684 15338421 19648152 25164394 31572114 37692141 41418594 41164406 37259972 31428918
8676 31428918 25512776 20655782 17085714 14577032 12857311 11666564 10844710 10284498
8668 10284498 9932541 9742024 9680833 9732282 9868891 10075540 10349676 10718685 11195677 11773047
$$ packed form
8738E16940m954N871J1689J5532J3655J4046J3354K6574K2027K6380K4759K4870
8726G10743K5072L2318L5678K5603K0668L7399M0710L5755M6733N4522L9974L8480
8714A143655M4538M7110M6943M1109M6082N1733N7329O0886P2759R2766R9395
8703A804305J04140J09065J33732J51298J67200J85061K24891K78378L18802L64126
8693C840998M06232M69466N64972P02158R17509J233954J697571K321355L184206
8684A5338421M309731N516242O407720O120027L726453k54188l904434n831054
8676C1428918n916142m856994l570068k508682j719721j190747q21854n60212
8668A0284498l51957j90517o1191N1449J36609K06649K74136L69009M76992N77370
$$ plain form
8658 11773047 12471077 13290522 14250156 15396712 16749633 18338268 20227655 22444334 25061025
8649 25061025 28131355 31707715 35827399 40586291 46098944 52570547 60335943 69998441
8641 69998441 82450474 98968731 121092147 150316988 187339094 230422222 274559780
8634 274559780 315286499 351150268 378974538 392068980 383944574 354200730 309696520
8627 309696520 260374425 214436217 175959748 145545954 122165744 104377057 90925598
8620 90925598 80743213 72938899 66682154 61208513 55957897 50711600 45566783 40771774
8612 40771774 36505044 32822996 29703667 27049739 24813737 22944357 21376504 20072010
8604 20072010 18991786 18104973 17394452 16906680 16644624 16679617 17100931 18038972 19651550
$$ packed form
8658A1773047O98030Q19445R59634J146556J352921J588635J889387K216679K616691
8649B5061025L070330L576360M119684M758892N512653O471603P765396R662498
8641F9998441J2452033J6518257K2123416K9224841L7022106M3083128M4137558
8634B74559780M0726719L5863769K7824270J3094442q124406k9743844m4504210
8627C09696520m9322095m5938208l8476469l0413794k3380210j7788687j3451459
8620I0925598j0182385p804314o256745n473641n250616n246297n144817m795009
8612D0771774m266730l682048l119329k653928k236002j869380j567853j304494
8604B0072010j080224q86813p10521m87772k62056L4993M21314R38041J612578
$$ plain form
8595 19651550 22161001 25763937 30532123 36097980 41241534 43915360 42709429 38115434
8587 38115434 31884816 25775586 20782362 17052608 14335571 12326146 10811839 9649278
8579 9649278 8738823 7996405 7361347 6822989 6360744 5946011 5566425 5211044 4905878 4638919
8569 4638919 4388816 4164927 3972919 3808364 3647789 3504490 3372770 3235383 3102875 2978013
8559 2978013 2859172 2745039 2652026 2559830 2481965 2409544 2342440 2281714 2203573 2133873 2075771
8548 2075771 2014867 1959767 1911672 1863383 1819830 1792437 1762850 1727834 1687714 1650729 1615060
8537 1615060 1588058 1571464 1543283 1522559 1490184 1461086 1438730 1410104 1391031 1368368 1333361
8526 1333361 1312916 1287486 1266903 1253858 1243191 1210965 1176280 1164527 1150481 1125280 1088121
$$ packed form
8595A9651550K509451L602936M768186N565857N143554K673826j205931m593995
8587C8115434o230618o109230m993224l729754k717037k009425j514307j162561
8579I649278r10455p42418o35058n38358m62245m14733l79586l55381l05166k66959
8569D638919k50103k23889j92008j64555j60575j43299j31720j37387j32508j24862
8559B978013j18841j14133r3013r2196p7865p2421o7104o0726p8141o9700n8102
8548B075771o0904n5100m8095m8289m3553k7393k9587l5016m0120l6985l5669
8537A615060k7002j6594k8181k0724l2375k9098k2356k8626j9073k2663l5007
8526A333361k0445k5430k0583j3045j0667l2226l4685j1753j4046k5201l7159
$$ plain form
8515 1088121 1047047 1021950 1015894 1020597 1007044 990545 972978 958805 950881 921386 893587 878967
8503 878967 894563 895812 890094 868124 847954 835411 823945 808159 780080 755976 756562 750900 732834
8490 732834 710744 716437 716929 709288 699530 680271 670684 654290 643768 655632 665799 672258 672531
8477 672531 669533 673039 665892 631958 613513 592816 591152 585714 569427 565429 562649 554303 533430
8464 533430 524187 546643 547780 542586 547338 532293 518932 517788 516729 508577 509009 512274 510511 517172
8450 517172 515256 490319 465087 443597 412696 378837 357865 365319 388793 383705 382257 378096 375219
8437 375219 366821 343090 333917 325933 308322 308778 306365 297651 306450 321910 331975 343213 350597
8424 350597 351608 346986 338824 356936 366179 356003 334844 320586 315408 311593 304305 304111 300997 302590
$$ packed form
8515A088121m1074k5097o056M703j3553j6499j7567j4173p924k9495k7799j4620
8503H78967J5596J249n718k1970k0170j2543j1466j5786k8079k4104N86n662j8066
8490G32834k2090N693M92p641r758j9259r587j6394j0522J1864J0167O459K73
8477F72531k998L506p147l3934j8445k0697j664n438j6287l998k780q346k0873
8464E33430r243K2456J137n194M752j5045j3361j144j059q152M32L265j763O661
8450E17172j916k4937k5232k1490l0901l3859k0972P454K3474n088j448m161k877
8437C75219q398k3731r173p984j7611M56k413q714Q799J5460J0065J1238P384
8424C50597J011m622q162J8112R243j0176k1159j4258n178l815p288j94l114J593
$$ plain form
8410 302590 308904 301485 299751 290368 276489 279078 281298 281221 294943 302501 305129 300772 296778 291813
8396 291813 282857 273477 284538 301102 293629 298839 300010 299714 296675 291755 292073 286100 300773 305927
8382 305927 308983 308110 312609 320279 314010 303335 307830 310326 309305 305128 297513 291993 283291 279833
8368 279833 275781 273424 260857 259480 263904 245785 235066 236377 250587 263671 272306 278988 280527
8355 280527 269225 259460 263051 262943 267994 275652 284231 291362 304446 310788 321126 332474 340711 345727
8341 345727 341603 351606 353253 351068 338807 322085 328135 341386 354950 359159 339834 307861 302265
8328 302265 288081 273692 248860 196652 145306 119193 80674 20594 -43558 -78606 -89987 -78624
8316 -78624 -54369 -41863 -5529 29630 56225 71917 85314 89686 85043 80109 70070 65961 71278
$$ packed form
8410C02590O314p419j734r383j3879K589K220p7J3722P558K628m357l994m965
8396B91813q956r380J1061J6564p473N210J171k96l039m920L18n973J4673N154
8382C05927L056q73M499P670o269j0675M495K496j021m177p615n520q702l458
8368B79833m052k357j2567j377M424j8119j0719J311J4210J3084Q635O682J539
8355B80527j1302r765L591j08N051P658Q579P131J3084O342J0338J1348Q237N016
8341C45727m124J0003J647k185j2261j6722O050J3251J3564M209j9325l1973n596
8328C02265j4184j4389k4832n2208n1346k6113l8519o0080o4152l5048j1381J1363
8316g8624K4255J2506L6334L5159K6595J5692J3397M372m643m934j0039m109N317
$$ plain form
8303 71278 69785 72610 87628 101590 114902 129737 135284 127375 133666 145175 151732 158573 175503
8290 175503 190195 205689 200630 186732 185549 190783 187589 177207 183557 199298 214645 226077 249455
8277 249455 298676 338072 352286 361700 344020 322014 310213 284148 262017 241638 213246 180464
8265 180464 155083 147008 162665 167565 168494 152762 140865 156709 163123 171629 181580 175810 174616
8252 174616 184937 197089 205446 231670 257565 268701 281155 299275 330490 358897 383271 417400
8240 417400 467635 522479 596573 684370 797779 959373 1136850 1340337 1561216 1757177
8230 1757177 1890767 1934784 1910957 1828696 1703388 1563928 1410130 1246856 1092468 951153
8220 951153 821556 715778 639225 579207 514812 463497 428271 404668 366649 327133 306994
$$ packed form
8303G1278j493K825J5018J3962J3312J4835N547p909O291J1509O557O841J6930
8290A75503J4692J5494n059j3898j183N234l194j0382O350J5741J5347J1432K3378
8277B49455M9221L9396J4214R414j7680k2006j1801k6065k2131k0379k8392l2782
8265A80464k5381q075J5657M900R29j5732j1897J5844O414Q506R951n770j194
8252A74616J0321J2152Q357K6224K5895J1136J2454J8120L1215K8407K4374L4129
8240D17400N0235N4844P4094Q7797J13409J61594J77477K03487K20879J95961
8230A757177J33590M4017k3827q2261j25308j39460j53798j63274j54388j41315
8220I51153j29597j05778p6553o0018o4395n1315l5226k3603l8019l9516k0139
$$ plain form
8209 306994 299743 281562 257993 242743 223756 215967 206325 202295 194178 189477 189626 196608 204656 199871
8195 199871 204524 204640 211367 206513 233465 256019 268479 280017 292036 298376 304069 292975 265647
8182 265647 227571 212757 200134 175159 152367 144887 125532 92112 89247 80345 77613 80190 77658
8169 77658 80872 77967 101249 114112 113227 109779 121857 111570 95370 79797 75494 73074 67961
8156 67961 92111 97813 89206 101832 106814 114498 113470 94646 94173 99735 96850 107954 106103 93627
8142 93627 92282 79261 75746 71439 76756 78693 87482 87978 80353 67581 62671 56042 64450 79985
8128 79985 82364 60999 64512 63637 61351 61904 58249 67513 74871 84563 86628 75825 76281 82770 62308
8113 62308 64331 71426 69082 68272 64977 56457 47869 56955 54238 51679 59777 58323 53616 56719 70861
$$ packed form
8209C06994p251j8181k3569j5250j8987p789r642m030q117m701J49O982Q048m785
8195A99871M653J16O727m854K6952K2554J2460J1538J2019O340N693j1094k7328
8182B65647l8076j4814j2623k4975k2792p480j9355l3420k865q902k732K577k532
8169G7658L214k905K3282J2863q85l448J2078j0287j6200j5573m303k420n113
8156F7961K4150N702q607J2626M982P684j028j8824m73N562k885J1104j851j2476
8142I3627j345j3021l515m307N317J937Q789M96p625j2772m910o629Q408J5535
8128G9985K379k1365L513q75k286N53l655R264P358R692K065j0803M56O489k0462
8113F2308K023P095k344q10l295q520q588R086k717k559Q098j454m707L103J4142
$$ plain form
8098 70861 64024 60698 58705 60586 65395 58651 55463 57232 51380 56700 50800 49639 59909 55142
8084 55142 47762 47173 44857 38382 43459 49005 56043 61586 60884 48448 44619 48085 51949 60076 61944
8069 61944 61923 57147 70453 86264 83877 67465 58788 44512 30261 34057 45622 58143 57351 48251
8055 48251 45710 44457 59088 50518 39567 51851 66507 68909 70720 60134 50482 41310 49745
8042 49745 53194 64208 65776 53982 37572 38328 33849 24801 24884 29202 22107 27037 15173 24323
8028 24323 46043 54564 60787 77657 81761 75834 75008 66664 62360 69997 79558 70048 60943 61413 59480
8013 59480 53687 58079 59024 56812 69845 75198 72173 72243 58250 54389 40636 38701 47063 53869 52396
7998 52396 48519 42578 36425 42374 55786 55758 55631 43914 49131 47979 41014 39806 36603 29652 38233
$$ packed form
8098G0861o837l326j993J881M809o744l188J769n852N320n900j161J0270m767
8084E5142p380n89k316o475N077N546P038N543p02j2436l829L466L864Q127J868
8069F1944k1m776J3306J5811k387j6412q677j4276j4251L796J1565J2521p92r100
8055D8251k541j253J4631q570j0951J2284J4656K402J811j0586r652r172Q435
8042D9745L449J1014J568j1794j6410P56m479r048Q3M318p095M930j1864R150
8028B4323K1720Q521O223J6870M104n927q26q344m304P637R561r510r105M70j933
8013E9480n793M392R45k212J3033N353l025P0j3993l861j3753j935Q362O806j473
7998E2396l877n941o153N949J3412k8j27j1717N217j152o965j208l203o951Q581
$$ plain form
7983 38233 54311 57621 53333 54340 48770 47251 60259 58537 48781 43399 41188 37924 47628 37613
7969 37613 36861 46359 42267 37651 43248 34799 32348 49063 54549 46131 53116 49606 47414 40428 36434
7954 36434 33983 30832 23239 19893 16893 26051 39902 40723 21885 23104 33162 39189 46204 47843
7940 47843 39253 33541 24488 22089 35940 54481 79913 73348 67068 69396 70587 76096 56257 40042
7926 40042 38144 42841 34020 41974 42327 39305 31890 36654 46105 51264 51965 46809 45110 40433 34482
7911 34482 29478 41568 48631 49389 50770 60097 60124 52280 47830 41051 27872 32573 39956 38310 31224
7896 31224 22038 15285 25042 32949 32926 26417 23591 28090 36007 31667 37404 36603 32184 35095 42659
7881 42659 40732 23776 26926 33152 44698 48033 45472 45420 44454 42844 39121 31725 38713 59271 60614
$$ packed form
7983C8233J6078L310m288J007n570j519J3008j722r756n382k211l264R704j0015
7969C7613p52R498m092m616N597q449k451J6715N486q418O985l510k192o986l994
7954C6434k451l151p593l346l000R158J3851Q21j8838J219J0058O027P015J639
7940D7843q590n712r053k399J3851J8541K5432o565o280K328J191N509j9839j6215
7926D0042j898M697q821P954L53l022p415M764R451N159P01n156j699m677n951
7911C4482n004J2090P063P58J381R327K7p844m450o779j3179M701P383j646p086
7896C1224r186o753R757P907k3o509k826M499P917m340N737q01m419K911P564
7881D2659j927j6956L150O226J1546L335k561n2r66j610l723p396O988K0558J343
$$ plain form
7866 60614 46848 41783 46078 49589 67218 74673 71236 52453 58259 51612 35316 43512 58247
7853 58247 59169 52021 67154 67695 77903 86660 73640 58249 42816 26811 21878 35190 41495
7840 41495 42373 45480 41426 30764 16504 26291 33405 32596 33294 30213 32710 31876 40504 48824 44750
7825 44750 48862 48469 43780 50303 50278 37848 45740 49929 52610 65329 68859 55118 47354 35699
7811 35699 29719 24626 27041 19647 19300 25445 26831 21342 19498 22856 23518 28273 29420 8541 6335
7796 6335 24324 37266 36874 26239 10566 13528 21327 33428 27250 24653 22495 19284 8658 -433
7782 -433 -3772 6172 13621 19588 40867 59488 55977 45056 45106 42564 39944 29393 15315 7556
7768 7556 9469 2208 2854 9002 28874 34979 30032 19991 23984 30248 34066 27675 24587 19041 13367
$$ packed form
7866F0614j3766n065M295L511J7629P455l437j8783N806o647j6296Q196J4735
7853E8247R22p148J5133N41J0208Q757j3020j5391j5433j6005m933J3312O305
7840D1495Q78L107m054j0662j4260R787P114q09O98l081K497q34Q628Q320m074
7825D4750M112l93m689O523k5j2430P892M189K681J2719L530j3741p764j1655
7811C5699n980n093K415p394l47O145J386n489j844L358O62M755J147k0879k206
7796F335J7989J2942l92j0635j5673K962P799J2101o178k597k158l211j0626r091
7782d33l339R944P449N967K1279J8621l511j0921N0k542k620j0551j4078p759
7768G556J913p261O46O148J9872O105m947j0041L993O264L818o391l088n546n674
$$ plain form
7753 13367 13659 32491 40206 35462 18922 13340 17035 11709 9989 22581 10774 8672 22897 32218
7739 32218 30499 22453 23219 29913 43332 34567 16397 13096 15517 21319 35874 35430 28789 31937
7725 31937 29374 28338 40058 36833 16061 12402 29297 34047 25119 24467 29829 26113 19408 7018
7711 7018 -1849 -1522 2128 16484 23513 14127 12041 12695 6749 11070 14726 13307 779 9650 20461
7696 20461 21363 32587 33937 24593 23158 14087 23680 31131 39092 30290 26854 27277 25307 24544 21526
7681 21526 23928 28868 32994 29639 15684 709 14310 36562 45789 49160 51464 48446 31725
7668 31725 25462 22195 28434 30283 24745 23924 33872 25673 29339 24702 18988 20646 26649 29252 26152
7653 26152 30769 33634 29493 18968 21498 20578 22495 19219 24550 29399 22804 23713 29753 33010 35426
$$ packed form
7753A3367K92J8832P715m744j6540n582L695n326j720J2592j1807k102J4225R321
7739C2218j719q046P66O694J3419q765j8170l301K421N802J4555m44o641L148
7725C1937k563j036J1720l225k0772l659J6895M750q928o52N362l716o705j2390
7711G018q867L27L650J4356P029r386k086O54n946M321L656j419j2528Q871J0811
7696B0461R02J1224J350r344j435r071R593P451P961q802l436M23j970p63l018
7681B1526K402M940M126l355j3955j4975J3601K2252R227L371K304l018j6721
7668C1725o263l267O239J849n538q21R948q199L666m637n714J658O003K603l100
7653B6152M617K865m141j0525K530r20J917l276N331M849o595R09O040L257K416
$$ plain form
7638 35426 45264 49273 48738 36164 17117 27165 23158 22397 27769 30259 28713 24925 17170 19626
7624 19626 30362 29948 20888 19817 15743 23738 26709 28033 30931 32736 39832 42298 30019 34024
7610 34024 42428 31821 13189 21919 24495 33977 30072 26775 23967 25383 2989 -2174 4012 1251
7596 1251 9187 8245 11696 24849 23456 26339 23522 39180 37592 27157 35501 37254 41989 41310 34141
7581 34141 43405 37870 42955 34478 33693 45707 40878 28825 25256 23493 23912 23341 11924 14784 23373
7566 23373 19893 26588 27655 32416 30872 18284 15886 8852 7126 11642 23729 18544 17416 18454
7552 18454 17366 26784 18327 17808 20617 22304 22858 19264 24857 17602 5758 7981 24392 24857 23534
7537 23534 19025 16661 23165 37476 33776 34852 14077 2892 7870 16314 8700 -903 1669 15129
$$ packed form
7638C5426R838M009n35j2574j9047J0048m007p61N372K490j546l788p755K456
7624A9626J0736m14r060j071m074P995K971J324K898J805P096K466j2279M005
7610C4024Q404j0607j8632Q730K576R482l905l297k808J416k2394n163O186k761
7596A251P936r42L451J3153j393K883k817J5658j588j0435Q344J753M735o79p169
7581C4141R264n535N085q477p85J2014m829j2053l569j763M19n71j1417K860Q589
7566B3373l480O695J067M761j544j2588k398p034j726M516J2087n185j128J038
7552A8454j088R418q457n19K809J687N54l594N593p255j1844K223J6411M65j323
7537B3534m509k364O504J4311l700J076k0775j1185M978Q444p614r603K572J3460
$$ plain form
7523 15129 23793 32928 29429 15761 16686 11656 17026 15225 11869 24341 19099 18160 18699 16679 10071
7508 10071 5545 6913 13907 12010 12042 11686 26645 28707 25021 13600 13084 11645 3189 -13470 -11475
7493 -11475 -3103 9356 22787 20192 8786 29995 43674 45504 34317 28525 23087 20320 27553
7480 27553 30955 24445 24788 23253 25161 16171 24159 41238 37965 16049 18977 27229 20965 28337
7466 28337 25044 24023 41041 42878 30683 24598 17068 16620 22643 26658 32899 37800 31851 24722
7452 24722 34117 24419 18854 26768 33361 29809 34047 43309 39903 28986 18719 11843 10936 7998
7438 7998 12776 4628 -3970 5890 19981 19825 17241 23950 23142 9688 -986 10006 21118 28858
7424 28858 19001 15743 27201 38291 36076 45020 47072 45583 27419 6580 -4597 -4551 -3465 2912
$$ packed form
7523A5129Q664R135l499j3668R25n030N370j801l356J2472n242r39N39k020o608
7508A0071m526J368O994j897L2l56J4959K062l686j1421n16j439q456j6659J995
7493a1475Q372J2459J3431k595j1406K1209J3679J830j1187n792n438k767P233
7480B7553L402o510L43j535J908q990P988J7079l273k1916K928Q252o264P372
7466B8337l293j021J7018J837j2195o085p530m48O023M015O241M901n949p129
7452B4722R395r698n565P914O593l552M238R262l406j0917j0267o876r07k938
7438G998M778q148q598R860J4091j56k584O709q08j3454j0674J0992J1112P740
7424B8858r857l258J1458J1090k215Q944K052j489j8164k0839j1177M6J086O377
$$ plain form
7410 2912 7975 3667 -8121 -13149 -9680 -9888 -21488 -5749 13632 13985 3233 9546 16401 9447
7396 9447 3718 2806 93 2382 8519 4347 -2251 1370 10358 20005 25566 19549 19564 24404 11436
7381 11436 9495 15011 13862 -8358 -17719 -11832 -7182 5036 14814 21989 21931 24186 27922 17198
7367 17198 14314 16569 23323 14517 13489 5319 5068 7147 7049 19472 16812 1934 -1330 -19483 -23235
7352 -23235 -10687 -6193 -5747 -11704 -10834 9275 13501 9630 -1309 -3380 2949 267 5442 -1560
7338 -1560 6363 1591 -4394 6177 16005 20764 17603 21763 20605 7829 -2105 9715 15725 15224
7324 15224 23251 26202 24534 6662 9571 9588 3263 -6528 -7130 -15062 -2697 885 4605 27365 21576
7309 21576 17833 22183 23443 28004 33050 30270 27486 24809 13703 15385 20815 23590 28907 28669 36505
$$ packed form
7410B912N063m308j1788n028L469k08j1600J5739J9381L53j0752O313O855o954
7396I447n729r12k713K289O137m172o598L621Q988R647N561o017J5M840j2968
7381A1436j941N516j149k2220r361N887M650J2218R778P175n8K255L736j0724
7367A7198k884K255O754q806j028q170k51K079r8J2423k660j4878l264j8153l752
7352b3235J2548M494M46n957Q70K0109M226l871j0939k071O329k682N175p002
7338a560P923m772n985J0571R828M759l161M160j158j2776r934J1820O010n01
7324A5224Q027K951j668j7872K909J7o325r791o02p932J2365L582L720K2760n789
7309B1576l743M350J260M561N046k780k784k677j1106J682N430K775N317k38P836
$$ plain form
7294 36505 32685 25383 28213 36215 34441 24443 29699 30867 22791 21879 19815 6129 -5053 -3491
7280 -3491 -3293 7630 28436 39746 32558 23682 15970 9986 15608 10187 12076 339 -10088 -7710
7266 -7710 2337 14698 22223 32860 18905 12553 22880 15081 7645 3724 2907 16333 5107
7253 5107 -9322 1147 12367 18489 12741 6502 15896 29230 34763 18330 9479 5829 15835
7240 15835 11048 14185 25223 23677 15923 -2325 -1542 9258 22813 16633 -2118 -3037 9474 2226
7226 2226 -4351 8145 20820 14905 4250 6971 19589 21884 14566 15608 20246 27073 21547 21420
7212 21420 11722 12374 17710 15324 7328 -2669 -2156 13175 18240 15009 4221 8973 17462 23656 26752
7197 26752 7448 -10473 -868 9877 23438 20261 22184 15431 8674 16774 24423 26717 30754 33885
$$ packed form
7294C6505l820p302K830Q002j774r998N256J168q076r12k064j3686j1182J562
7280c491J98J0923K0806J1310p188q876p712n984N622n421J889j1737j0427K378
7266g710J0047J2361P525J0637j3955o352J0327p799p436l921q17J3426j1226
7253E107j4429J0469J1220O122n748o239R394J3334N533j6433q851l650J0006
7240A5835m787L137J1038j546p754j8248P83J0800J3555o180j8751r19J2511p248
7226B226o577J2496J2675n915j0655K721J2618K295p318J042M638O827n526j27
7212B1420r698O52N336k386p996r997N13J5331N065l231j0788M752Q489O194L096
7197B6752j9304j7921R605J0745J3561l177J923o753o757Q100P649K294M037L131
$$ plain form
7183 33885 23816 15941 6047 8104 5938 10672 3542 -12864 -9290 925 9732 13908 1272 8578
7169 8578 21762 17586 6634 13929 15455 11953 5887 4900 15125 12942 7210 -174 3787 252
7155 252 5041 5589 -4635 -1434 2276 4556 -1309 -9835 777 3703 -28 16444 24458 23620 26538
7140 26538 23095 6815 5416 3886 -1946 -717 4228 -2689 6773 33036 23845 8922 8637 13871
7126 13871 29445 34780 26872 22512 23289 18952 9806 10078 17752 13119 13693 21426 32316 24139 19350
7111 19350 23219 8541 18125 27562 27864 36440 37231 36260 35566 13336 -6296 2568 14469 19018 23031
7096 23031 22822 22824 33600 41118 41324 24107 16516 4142 8272 17532 14395 7798 22652 14335 -2862
7081 -2862 -4872 9289 19000 7960 6386 3930 3260 7864 28242 33270 26041 15432 5655 13284
$$ packed form
7183C3885j0069p875r894K057k166M734p130j6406L574J0215Q807M176j2636P306
7169H578J3184m176j0952P295J526l502o066r87J0225k183n732p384L961l535
7155B52M789N48j0224L201L710K280n865q526J0612K926l731J6472Q014q38K918
7140B6538l443j6280j399j530n832J229M945o917R462K6263r191j4923k85N234
7126A3871J5574N335p908m360P77m337r146K72P674m633N74P733J0890q177m789
7111A9350L869j4678R584R437L02Q576P91r71o94k2230j9632Q864J1901M549M013
7096B3031k09KJ0776P518K06j7217p591j2374M130R260l137o597J4854q317j7197
7081b862k010J4161R711j1040j574k456o70M604K0378N028p229j0609r777P629
$$ plain form
7067 13284 13406 -1849 2245 9079 14588 16963 9609 -2890 -9832 -12607 -10530 2923 11674 3802
7053 3802 -265 3687 12647 7424 8177 4911 10031 15168 4750 8811 10769 -2404 2273 2511 6543
7038 6543 -2976 -17418 -17638 -18351 -19341 -7266 7431 9043 7543 17601 16034 12830 8345 9832 16972
7023 16972 14597 6859 -7802 -12660 -7743 3258 5810 4265 5411 7350 13703 14107 2007 -9967
7009 -9967 -12100 -4714 14087 17618 9019 6566 27 -4946 11121 30353 40570 47277 49722 41157
6995 41157 42216 45525 38950 26169 17689 4634 60 -2403 13087 11755 1438 1949 4013 4435
6981 4435 25320 27641 23799 15218 9324 9248 10582 12439 1635 8625 10629 8650 7105 7561 2802
6966 2802 5224 11012 7922 -4896 -8926 786 -4075 -1691 5723 6174 3365 -904 -8883 2130 5406
$$ packed form
7067A3284J22j5255M094O834N509K375p354j2499o942k775K077J3453Q751p872
7053C802m067L952Q960n223P53l266N120N137j0418M061J958j3173M677K38M032
7038F543r519j4442k20p13r90J2075J4697J612j500J0058j567l204m485J487P140
7023A6972k375p738j4661m858M917J1001K552j545J146J939O353M04j2100j1974
7009i967k133P386J8801L531q599k453o539m973J6067J9232J0217O707K445q565
6995D1157J059L309o575j2781q480j3055m574k463J5490j332j0317N11K064M22
6981D435K0885K321l842q581n894p6J334J857j0804O990K004j979j545M56m759
6966B802K422N788l090j2818m030R712m861K384P414M51k809m269p979J1013L276
$$ plain form
6951 5406 12520 14823 14572 19564 3727 6043 7326 10809 22162 19771 22528 36285 40578 25519
6937 25519 2139 -3141 176 2142 804 16254 15093 1026 -16792 -11846 4138 123 502 -823
6923 -823 6574 -2980 -4348 1110 -8474 -14426 -15995 -24340 -18249 -14484 -22779 -21050 -8137 4809 6366
6908 6366 8101 4392 2513 1031 -9031 -13960 -3787 3730 3812 5606 -3191 -5329 5658 18827
6894 18827 3512 -14655 -16710 -17491 -9013 -14283 -10758 -1289 -6382 1633 6983 14129 15062 8940 5576
6879 5576 8961 -3431 4067 17459 26117 26076 25523 28066 37360 32017 24481 16959 -4901 -13199 13902
6864 13902 17195 15914 22534 36771 28844 13899 10279 3095 -2519 -8516 -1559 6209 10055 16071
6850 16071 10636 -2599 -7767 1188 13907 12458 18018 24082 17388 11526 13127 12983 6222 -12858
$$ packed form
6951E406P114K303k51M992j5837K316J283L483J1353k391K757J3757M293j5059
6937B5519k3380n280L317J966j338J5450j161j4067j7818M946J5984m015L79j325
6923h23P397r554j368N458r584n952j569q345O091L765q295J729J2913J2946J557
6908F366J735l709j879j482j0062m929J0173P517Q2J794q797k138J0987J3169
6894A8827j5315j8167k055p81Q478n270L525R469n093Q015N350P146R33o122l364
6879E576L385j2392P498J3392Q658m1n53K543R294n343p536p522k1860q298K7101
6864A3902L293j281O620J4237p927j4945l620p184n614n997O957P768L846O016
6850A6071n435j3235n168Q955J2719j449N560O064o694n862J601j44o761j9080
$$ plain form
6836 -12858 -24768 -11244 4348 8517 1115 7358 2871 506 4425 9526 5491 7603 7511 -1063
6822 -1063 -10121 -10707 -1155 -4594 838 10231 9297 3807 8326 11242 10532 10652 12409 16765 16211 -1391
6806 -1391 -10510 8718 11681 3183 -8410 -4162 -2031 -1529 -16675 -20437 -18122 -2537 3892 -7377
6792 -7377 -5052 1173 -421 11616 16428 13113 12147 20518 13432 1959 -9035 -8575 -9255 -8521 -3341
6777 -3341 10257 3688 1427 804 -298 -14006 -8474 8140 13006 13966 12457 6428 -3290 -5631 5227
6762 5227 10622 12664 24876 20913 9436 15765 14627 21509 31766 29256 18541 4329 -5816
6749 -5816 4972 24340 36903 24556 24334 24852 25816 33431 35359 19112 7872 1467 -2610 5405
6735 5405 -1338 -2481 619 12956 10154 8118 12307 12013 15045 5538 6320 13996 235 -335 598
$$ packed form
6836a2858j1910J3524J5592M169p402O243m487k365L919N101m035K112r2q574
6822a063r058n86R552l439N432R393r34n490M519K916p10J20J757M356n54j7602
6806a391r119J9228K963q498j1593M248K131N02j5146l762K315J5585O429j1269
6792g377K325O225j594J2037M812l315r66Q371p086j1473j0994M60o80P34N180
6777c341J3598o569k261o23j102j3708N532J6614M866R60j509o029r718k341J0858
6762E227N395K042J2212l963j1477O329j138O882J0257k510j0715j4212j0145
6749e816J0788J9368J2563j2347k22N18R64P615J928j6247j1240o405m077Q015
6735E405o743j143L100J2337k802k036M189k94L032r507P82P676j3761n70R33
$$ plain form
6720 598 -6472 -12737 -9164 34 -6554 -7063 -14596 -8922 -6145 -16270 -3185 5741 7706 10100 4580
6705 4580 11898 12029 20692 28223 20598 7294 -246 -349 16330 30400 31281 17495 18923 15966 16845
6690 16845 7092 -4374 1874 -2172 -12442 -20061 -3363 -983 8281 5778 -4861 4519 5158 8126
6676 8126 10205 3791 7831 7224 7431 269 5257 9954 18752 22529 14358 11 -8746 -9762 -6866
6661 -6866 -5736 12041 26259 34514 22682 8261 3810 7888 7949 15746 21267 18025 7629 -1388
6647 -1388 -1348 8804 18629 20679 18412 17366 11685 7783 4405 8831 13527 7618 1486 1149 2668
6632 2668 12466 22854 20871 4707 -12735 -9002 5420 8908 12909 20717 27377 27684 17269 30484
6618 30484 30290 18752 17157 29344 21757 13852 19344 18894 15149 9832 4608 5770 14774 16493 15167
$$ packed form
6720E98p070o265L573R198o588n09p533N674K777j0125J3085Q926J965K394n520
6705D580P318J31Q663P531p625j3304p540j03J6679J4070Q81j3786J428k957Q79
6690A6845r753j1466O248m046j0270p619J6698K380R264k503j0639R380O39K968
6676H126K079o414M040o07K07p162M988M697Q798L777q171j4347q757j016K896
6661f866J130J7777J4218Q255j1832j4421m451M078O1P797N521l242j0396r017
6647a388M0J0152R825K050k267j046n681l902l378M426M696n909o132l37J519
6632B668R798J0388j983j6164j7442L733J4422L488M001P808O660L07j0415J3215
6618C0484j94j1538j595J2187p587p905N492m50l745n317n224J162R004J719j326
$$ plain form
6603 15167 8403 9454 2624 254 5201 1296 8771 10911 14354 9480 5395 7132 -1059 -8041 1033
6588 1033 1634 -6610 545 9773 23042 22558 22781 15476 18392 23622 12145 13959 16676 12158 -288
6573 -288 -10992 -5909 -10462 -16280 -8858 4531 15926 18063 26381 32049 40992 26364 17328 24797
6559 24797 2810 -20229 -12879 6838 14192 7306 14165 7390 -8145 -13211 -9432 -2176 -6825 -13005
6545 -13005 -10101 -5061 18253 27771 12441 13346 6773 2622 -23 1178 9095 20167 10909 1302
6531 1302 -1458 -5113 -5453 -9547 -17944 -13694 -7813 -8549 -2538 7349 13927 13330 13612 7900 9992 9651
6515 9651 14635 11779 18136 18201 11455 11972 16568 13211 18081 11395 3012 -13202 -11460 -5380 787
6500 787 6718 10535 -2250 -2991 975 1131 12115 13971 15431 5173 3907 -21 -10353 -17166 -20450
$$ packed form
6603A5167o764J051o830k370M947l905P475K140L443m874m085J737q191o982R074
6588A033O01q244P155R228J3269m84K23p305K916N230j1477J814K717m518j2446
6573b88j0704N083m553n818P422J3389J1395K137Q318N668Q943j4628r036P469
6559B4797k1987k3039P350J9717P354o886O859o775j5535n066L779P256m649o180
6545a3005K904N040K3314R518j5330R05o573m151k645J201P917J1072r258r607
6531A302k760l655l40m094q397M250N881p36O011R887O578n97K82n712K092l41
6515I651M984k856O357O5o746N17M596l357M870o686q383j6214J742O080O167
6500G87N931L817j2785p41L966J56J0984J856J460j0258j266l928j0332o813l284
$$ plain form
6485 -20450 -12933 -3787 9736 -45 2126 -7792 -12772 -12899 -13434 -2684 2800 7364 -1344 -8811 -3819
6470 -3819 2517 15962 14947 8571 5587 14868 22935 24606 25888 14054 1433 4997 14235 8134
6456 8134 8403 280 -7039 -7106 12568 17836 4358 5072 4417 8126 11216 7609 12498 4319 -8887
6441 -8887 -16333 -9834 -6689 -1346 -1158 -9973 -4095 3416 17766 22537 26924 26504 29683 28459 19172
6426 19172 19557 21795 12664 10464 10119 599 1306 -6382 -7184 -7577 -9851 -12458 -7923 2356 2207 -428
6410 -428 9434 12814 9972 18525 22033 17865 13756 602 -12625 -29053 -31948 -16038 3191 3238
6396 3238 -6420 -7426 -2380 5843 19157 22611 18769 13098 9766 11259 16108 26341 25016 32663
6382 32663 30006 14581 14005 10415 7697 12955 16409 8341 3584 -6410 -18425 -27304 -26543 -13029
$$ packed form
6485b0450P517R146J3523r781K171r918m980j27n35J0750N484M564q708p467M992
6470c819O336J3445j015o376k984R281Q067J671J282j1834j2621L564R238o101
6456H134K69q123p319o7J9674N268j3478P14o55L709L090l607M889q179j3206
6441h887p446O499L145N343J88q815N878P511J4350M771M387m20L179j224r287
6426A9172L85K238r131k200l45r520P07p688q02l93k274k607M535J0279j49k635
6410d28R862L380k842Q553L508m168m109j3154j3227j6428k895J5910J9229M7
6396C238r658j006N046Q223J3314L454l842n671l332J493M849J0233j325P647
6382C2663k657j5425n76l590k718N258L454q068m757r994j2015q879P61J3514
$$ plain form
6368 -13029 -9480 -1301 -12298 -18632 1966 5614 12434 24899 12112 2240 -5276 -7241 -5240 -6296
6354 -6296 -5931 -4326 -650 1762 4479 6545 30012 29824 24264 19505 21658 24098 9879 -5865 7560
6339 7560 26436 31968 29417 23165 10889 1007 -11042 -17978 -18209 -4513 55 -6417 -17195 -20984
6325 -20984 -11303 -4137 2156 3558 -6450 -3919 1103 10332 17943 21872 3819 741 9770 6389
6311 6389 14149 9579 -2692 -11304 -15994 -3050 7378 2898 4335 3622 668 1279 12384 19112
6297 19112 12844 17239 23227 30799 31884 23353 32528 35316 23225 14834 13083 16763 4830 -1828
6283 -1828 -2531 -9075 -18335 -16840 -4056 6292 -7596 -3575 1140 1143 6535 1478 -1312 8756 10125
6268 10125 7337 -1820 -2163 -4559 -10708 -12011 -7203 -7916 -4240 1333 -568 -131 -1151 6089 437
$$ packed form
6368a3029L549Q179j0997o334K0598L648O820J2465j2787r872p516j965K001j056
6354f296L65J605L676K412K717K066K3467j88n560m759K153K440j4219j5744J3425
6339G560J8876N532k551o252j2276r882j2049o936k31J3696M568o472j0778l789
6325b0984R681P166O293J402j0008K531N022R229P611L929j8053l078R029l381
6311F389P760m570j2271q612m690J2944J0428m480J437p13k954O11J1105O728
6297A9112o268M395N988P572J085q531R175K788j2091q391j751L680j1933o658
6283a828p03o544r260J495J2784J0348j3888M021M715LN392n057k790J0068J369
6268A0125k788r157l43k396o149j303M808p13L676N573j901M37j020P240n652
$$ plain form
6253 437 20973 18085 4741 8664 7420 5062 8634 9704 8837 19371 21960 11562 13855 11679
6239 11679 -2452 -14083 -6502 -698 6327 -2696 -11925 7405 22164 34450 29608 11910 1319
6226 1319 -5546 -1077 15166 12541 698 -9053 -3236 -7575 -1905 448 281 -9514 -12684 -15555 -628
6211 -628 12469 8919 13018 23628 30343 31296 30916 19410 12137 10425 6764 -509 1259 9320 13229
6196 13229 18122 31532 21719 11717 15880 16292 6812 9763 -762 1027 13660 10523 14580 16529
6182 16529 12109 15947 19622 4507 -214 -1815 2999 5955 11838 11399 -4685 -20487 -29782 -16740
6168 -16740 -15942 -18480 -5838 109 7626 10866 3740 4191 2070 -19790 -15902 -3694 -1170 -671 5517
6153 5517 -1471 4071 2540 -2426 -6872 -1765 -15305 946 5256 -4592 3513 5268 771 10556
$$ packed form
6253D37K0536k888j3344L923j244k358L572J070q67J0534K589j0398K293k176
6239A1679j4131j1631P581N804P025r023r229J9330J4759J2286m842j7698j0591
6226A319o865M469J6243k625j1843r751N817m339N670K353j67r795l170k871J4927
6211f28J3097l550M099J0610O715R53l80j1506p273j712l661p273J768Q061L909
6196A3229M893J3410r813j0002M163M12r480K951j0525J789J2633l137M057J949
6182A6529m420L838L675j5115m721j601M814K956N883m39j6084j5802r295J3042
6168a6740P98k538J2642N947P517L240p126M51k121k1860L888J2208K524M99O188
6153E517o988N542j531m966m446N107j3540J6251M310r848Q105J755m497R785
$$ plain form
6139 10556 460 2557 5367 -7276 -17450 -10964 -9258 5966 6475 -3229 -4051 3742 8140 4879
6125 4879 -3579 -9686 -15421 -24716 -25685 -14768 -11032 -19071 -15259 -14306 -9639 -4218 -3671 -2856 -8141 -10464
6109 -10464 -19802 -18875 -12763 -637 519 -8079 -6925 -2525 342 -1374 -12870 -20363 -11375 -7402
6095 -7402 8308 12011 11046 7151 15115 4516 -6812 -12981 -4658 -4387 -10020 -11811 -8281 7617
6081 7617 22061 21906 19453 18576 22301 31078 34165 17562 8097 16002 20315 8005 3064 5397 12162
6066 12162 15115 6728 -10915 -23439 -15999 -573 8503 11531 7370 309 3845 9309 25029 30477
6052 30477 23845 17652 20485 19287 1002 -14443 -17716 -16851 -19941 -23866 -15416 -16427 -11111 -15893
6038 -15893 -24006 -20219 -10780 -8119 -24714 -25056 -6454 -2909 -7404 -11144 -2962 822 -7714 -1308
$$ packed form
6139A0556j0096K097K810j2643j0174O486J706J5224N09r704q22P793M398l261
6125D879q458o107n735r295r69J0917L736q039L812R53M667N421N47Q15n285k323
6109a0464r338R27O112J2126J156q598J154M400K867j716j1496p493Q988L973
6095g402J5710L703r65l895P964j0599j1328o169Q323K71n633j791L530J5898
6081G617J4444j55k453q77L725Q777L087j6603r465P905M313j2310m941K333O765
6066A2162K953q387j7643j2524P440J5426R076L028m161p061L536N464J5720N448
6052C0477o632o193K833j198j8285j5445l273Q65l090l925Q450j011N316m782
6038a5893q113L787R439K661j6595l42J8602L545m495l740Q182L784q536O406
$$ plain form
6024 -1308 4680 4438 -4433 -17816 -25513 -15585 -9566 -10090 -854 -5983 -8241 -11460 -23499 -21869 -8410
6009 -8410 -14203 -14337 4076 16132 6023 10940 8785 -6075 -10869 -19424 -10571 -11056 -14640 -3764
5995 -3764 -3168 -4721 -12292 -9151 -21863 -29613 -31295 -21613 -9721 -16741 -37588 -29408 -18052 -9055
5981 -9055 -827 -530 4463 -880 3937 15834 23275 11937 -6106 -10128 -1638 -558 -11683 -12368
5967 -12368 -12997 -31003 -30734 -8633 4789 9117 23923 17348 10958 15132 21492 22674 9085 6925
5953 6925 2780 9025 16181 6656 -450 -2124 4820 2551 6004 5899 637 10933 18622 11884 -9579
5938 -9579 -10871 6135 -616 -2644 143 5867 20597 31317 34653 19074 1070 -3825 -13220 -11507
5924 -11507 -4396 6349 3562 -9447 -7483 -18487 -20432 -8517 2198 -1534 4432 931 -8382
$$ packed form
6024a308N988k42q871j3383p697R928O019n24R236n129k258l219j2039J630J3459
6009h410n793j34J8413J2056j0109M917k155j4860m794q555Q853m85l584J0876
5995c764N96j553p571L141j2712p750j682R682J1892p020k0847Q180J1356Q997
5981i055Q228K97M993n343M817J1897P441j1338j8043m022Q490J080j1125o85
5967a2368o29j8006K69K2101J3422M328J4806o575o390M174O360J182j3589k160
5953F925m145O245P156r525p106j674O944k269L453j05n262J0296P689o738k1463
5938i579j292J7006o751k028K787N724J4730J0720L336j5579j8004m895r395J713
5924a1507P111J0745k787j3009J964j1004j945J1915J0715l732N966l501r313
$$ plain form
5911 -8382 -1611 1311 2371 6110 16121 15786 8596 -12497 -26612 -6321 11824 12885 -3480 -13968
5897 -13968 4879 12667 10553 3731 -6686 -1090 -3869 -5020 -10578 -17098 -2775 4906 6809 12474
5883 12474 -2138 -13522 -13409 -21239 -21151 -12735 -4795 -8805 -21432 -23692 -10551 -4420 -6008 -2162
5869 -2162 -1939 1612 1029 4937 9644 3816 9379 -1229 2618 5356 6004 27894 28537 9182 13597
5854 13597 13660 7423 7239 14383 14448 22269 12729 3848 2685 2954 4911 10301 13192 18192 33377 37573
5838 37573 24762 18879 -766 -10424 -11895 -15963 -22656 -9547 -1957 -6514 -16522 -20212 -29046 -15319
5824 -15319 3590 1429 13846 27034 24723 21121 28968 31609 19128 9431 3995 -1248 -7662 -14577
5810 -14577 -30238 -22695 -6106 -1567 -3972 3981 4582 -999 128 10657 18508 26284 16647 5817
$$ packed form
5911h382O771K922J060L739J0011l35p190k1093j4115K0291J8145J061j6365j0488
5897a3968J8847P788k114o822j0417N596k779j151n558o520J4323P681J903N665
5883A2474j4612j1384J13p830Q8Q416P940m010j2627k260J3141O131j588L846
5869b162K23L551n83L908M707n828N563j0608L847K738O48K1890O43j9355M415
5854A3597O3o237j84P144O5P821r540q881j163K69J957N390K891N000J5185M196
5838C7573j2811n883j9645r658j471m068o693J3109P590m557j0008l690q834J3727
5824a5319J8909k161J2417J3188k311l602P847K641j2481r697n436n243o414o915
5810a4577j5661P543J6589M539k405P953O01n581J127J0529P851P776r637j0830
$$ plain form
5796 5817 2098 3395 2544 -14026 -6412 -1870 -818 -7250 -3763 -2027 3945 5088 8777 9920 19175
5781 19175 21867 11200 3710 5706 4460 6850 -4805 -16165 -9623 6553 10818 17852 20957 14764
5767 14764 9975 -1912 -2506 7398 28445 47760 57321 46081 49726 27676 2475 1332 9489
5754 9489 4765 4725 -1186 4659 -1402 -2542 5307 14694 13933 17073 10905 12802 13086 10428 18736 9615
5738 9615 -788 -901 -7884 -8144 -403 4427 6448 4665 7133 4925 -3269 2754 -15301 -7970 2884
5723 2884 7380 9440 -1316 -19221 -15951 -686 6735 -1026 3875 10609 12027 9918 14633 8838
5709 8838 1962 5855 7762 5474 5848 11152 16390 12095 9440 7939 14455 4694 -1091 1840 4407
5694 4407 11975 21256 18768 7087 2148 14694 24432 27414 19722 12039 -5268 -13245 -15050 -10227
$$ packed form
5796E817l719J297q51j6570P614M542J052o432L487J736N972J143L689J143R255
5781A9175K692j0667p490J996j246K390j1655j1360O542J6176M265P034L105o193
5767A4764m789j1887n94R904K1047J9315R561j1240L645k2050k5201j143Q157
5754I489m724m0n911N845o061j140P849R387p61L140o168J897K84k658Q308r121
5738I615j0403j13o983k60P741M830K021j783K468k208q194O023j8055P331J0854
5723B884M496K060j0756j7905L270J5265P421p761M901O734J418k109M715n795
5709H838o876L893J907k288L74N304N238m295k655j501O516r761n785K931K567
5694D407P568R281k488j1681m939J2546R738K982p692p683j7307p977j805M823
$$ plain form
5680 -10227 -1380 1867 178 11558 12658 16739 3782 6860 11609 11152 -305 -2380 -2366 -7681 -7333
5665 -7333 -2812 -6653 -4254 -8967 14 14960 13676 -15956 -23450 -14881 -10804 2566 -7460 -13211
5651 -13211 -5591 -16938 -21483 -22747 -19007 -4614 3253 1260 -3460 7794 4679 6031 -5069 -16497
5637 -16497 -23866 -14159 -8636 -9520 -11724 -6203 8797 10651 10630 782 2411 8365 3130 7697 2569
5622 2569 -4264 -9199 -6610 -5762 7670 19254 16965 14483 13232 10187 11017 4715 7615 1986 -5060
5607 -5060 -16746 -15849 -12574 -5659 -8203 -9296 9102 17258 17573 17229 14023 29574 27456 25882 13492
5592 13492 7790 5712 -137 -2217 1152 1718 7457 6885 14894 9417 10384 -537 -1654 1480 -523
5577 -523 -570 1182 -5443 -23118 -34361 -24642 -4957 5744 -5203 -3273 8180 6457 7968 7590
$$ packed form
5680a0227Q847L247j689J1380J100M081j2957L078M749m57j1457k075J4n315L48
5665g333M521l841K399m713Q981J4946j284k9632p494Q569M077J3370j0026n751
5651a3211P620j1347m545j264L740J4393P867j993m720J1254l115J352j1100j1428
5637a6497p369R707N523q84k204N521J5000J854k1r848J629N954n235M567n128
5622B569o833m935K589Q48J3432J1584k289k482j251l045Q30o302K900n629p046
5607e060j1686Q97L275O915k544j093J8398Q156L15l44l206J5551k118j574j2390
5592A3492n702k078n849k080L369N66N739n72Q009n477R67j0921j117L134k003
5577e23m7J752o625j7675j1243R719J9685J0701j0947J930J1453j723J511l78
$$ plain form
5563 7590 11669 1630 1773 3668 1989 8352 2716 -5784 -9865 -2952 -7971 -20633 -5308 10311
5549 10311 22947 27761 22721 5231 -9854 -1683 1714 9192 -8897 -29160 -15525 3403 1979
5536 1979 1068 2500 16176 20216 11235 -1056 -5597 -18646 -28883 -27525 -12337 -10825 -607 8775
5522 8775 25398 38805 12644 723 3212 5342 3175 -11970 -13557 -7234 1964 -752 10292
5509 10292 6082 -9704 -5239 -7689 -13832 -3639 4659 14081 17799 8223 -5522 -4524 -6861 2710
5495 2710 11117 5405 648 -152 -4941 -4761 9879 20432 10821 7409 -4521 -9028 -2042 -7710 -7861
5480 -7861 -17676 -9043 -11290 -11086 7000 2067 -5018 -2572 -1278 -5970 7264 16147 20405 5410
5466 5410 -7623 -30887 -22841 -1035 9545 2683 -17421 -13030 -6502 10395 13085 10897 8449
$$ packed form
5563G590M079j0039J43J895j679O363n636q500m081O913n019j2662J5325J5619
5549A0311J2636M814n040j7490j5085Q171L397P478j8089k0263J3635J8928j424
5536A979r11J432J3676M040q981j2291m541j3049j0237J358J5188J512J0218R382
5522H775J6623J3407k6161j1921K489K130k167j5145j587O323R198k716J1044
5509A0292m210j5786M465k450o143J0193Q298R422L718r576j3745R98k337R571
5495B710Q407n712m757q00m789J80J4640J0553r611l412j1930m507O986n668j51
5480g861r815Q633k247K04J8086m933p085K446J294m692J3234Q883M258j4995
5466E410j3033k3264Q046K1806J0580o862k0104M391O528J6897K690k188k448
$$ plain form
5453 8449 1831 1598 16493 16153 2582 -8740 -10045 -3920 -5000 961 7188 2206 1563 11150 10375
5438 10375 2811 463 -4776 -9282 -10937 -4021 10017 13476 7692 9720 15965 4029 1428 -1703
5424 -1703 -2915 -3687 -916 4554 6937 -934 9058 6755 -2087 5716 1315 -3294 -3090 4110 -284
5409 -284 -10457 -6537 1082 6516 -6323 -917 -6417 5502 9406 1149 -18304 -32430 -27395 -7359
5395 -7359 1719 -1641 -9828 -11209 -6422 377 10169 15292 5879 -2286 3011 13471 23303 6249
5381 6249 -18062 -18975 -12091 -11986 -22528 -23828 -19978 -11721 2601 6143 7961 6288 3366 2532 3164
5366 3164 -71 -5613 -2294 -1163 -4406 2755 23486 16468 -11672 -18326 -16815 -9913 -1959 -7423
5352 -7423 -4206 -2320 470 3069 -7036 -2728 -2943 -5047 5990 -303 650 -7321 -14854 -18158 -23750
$$ packed form
5453H449o618k33J4895l40j3571j1322j305O125j080N961O227m982o43R587p75
5438A0375p564k348n239m506j655O916J4038L459n784K028O245j1936k601l131
5424a703j212p72K771N470K383p871R992k303q842P803m401m609K04P200m394
5409b84j0173L920P619N434j2839N406n500J1919L904q257j9453j4126N035K0036
5395g359R078l360q187j381M787O799R792N123r413q165N297J0460R832j7054
5381F249k4311r13O884J05j0542j300L850Q257J4322L542J818j673k922q34O32
5366C164l235n542L319J131l243P161K0731p018k8140o654J511O902P954n464
5352g423L217J886K790K599j0105M308k15k104J1037o293R53p971p533l304n592
$$ plain form
5337 -23750 -5650 5831 -5019 8510 6920 -961 -6728 -2546 -7757 -10563 -6617 -5767 -3758 -4461
5323 -4461 -5682 527 9166 7412 -9284 5490 9283 -1337 -3870 2771 3335 -5 -16732 -17760
5309 -17760 -4721 -472 9397 10999 11119 11373 6107 -2601 -2016 -3348 -10634 -15265 -29090 -26252 -12407
5294 -12407 -3855 -10747 -7247 -1570 -14888 -8615 3961 10680 10089 9123 -10439 -9346 -6208 720
5280 720 15703 23222 20619 26170 18734 15527 19738 28302 17141 19039 16600 11347 21140 18300 2464
5265 2464 -6134 -8474 -4450 -1337 -6891 -15276 -8063 -5364 -4033 1105 1762 -1143 -2554 -1288 20252
5250 20252 29064 29290 22268 8492 7890 9986 10288 14923 19553 18710 17873 8211 14350 6447 1983 -1671
5234 -1671 -11350 -11292 -19177 -9212 8386 4106 -8175 -9505 7696 3598 -8094 -13968 -17615 -25923
$$ packed form
5337b3750J8100J1481j0850J3529j590p881n767M182n211k806L946Q50K009p03
5323d461j221O209Q639j754j6696J4774L793j0620k533O641N64l340j6727j028
5309a7760J3039M249R869J602J20K54n266q708N85j332p286m631j3825K838J3845
5294a2407Q552o892L500N677j3318O273J2576O719n91r66j9562J093L138O928
5280G20J4983P519k603N551p436l207M211Q564j1161J898k439n253R793k840j5836
5265B464q598k340M024L113n554q385P213K699J331N138O57k905j411J266K1540
5250B0252Q812K26p022j3776o02K096L02M635M630q43q37r662O139p903m464l654
5234a671r679N8p885R965J7598m280j2281j330J7201m098j1692n874l647q308
$$ plain form
5220 -25923 -20374 -15365 -5885 7634 7796 7196 7078 7819 8748 876 -14679 -17619 -7570 -6276 -11013
5205 -11013 -21868 -12364 5635 16067 14766 12476 8224 9597 4591 6268 4583 -4593 -11503 -8737
5191 -8737 -5816 -10324 -8239 -9336 4876 8414 2078 -6816 -16307 -10438 -2132 -2245 -9286 -8093 -5077
5176 -5077 6860 5897 10797 18461 12208 13312 9126 14872 22208 12992 3197 -7102 -11882 -12818 -16790
5161 -16790 -29419 -20010 1518 15455 17631 13232 13722 10063 -3462 -11966 -15694 -21507 -15115 -624
5147 -624 10467 1515 8693 13810 10875 -2106 -15862 -8386 -7959 -4610 -3950 -1165 -7307 -6219 5098
5132 5098 8740 2927 -8608 -14897 -8577 -3663 -719 5219 -5 -3351 -5009 -13193 -7916 4042
5118 4042 8059 -2671 -19043 -8413 11362 8083 7221 4732 -3302 3037 6498 13822 21229 17415
$$ packed form
5220b5923N549N009R480J3519J62o00j18P41R29p872j5555k940J0049J294m737
5205a1013j0855R504J7999J0432j301k290m252J373n006J677j685r176o910K766
5191h737K921m508K085j097J4212L538o336q894r491N869Q306j13p041J193L016
5176e077J1937r63M900P664o253J104m186N746P336r216r795j0299m780r36l972
5161a6790j2629R409K1528J3937K176m399M90l659j3525q504l728n813O392J4491
5147f24J1091q952P178N117k935j2981j3756P476M27L349O60K785o142J088J1317
5132E098L642n813j1535o289O320M914K944N938n224l346j658q184N277J1958
5118D042M017j0730j6372J0630J9775l279q62k489q034O339L461P324P407l814
$$ plain form
5104 17415 14746 24818 14850 -3667 -10445 -5230 -3298 -1702 -4767 -4220 -6764 -23619 -16200 -8483
5090 -8483 8215 -1296 -3793 -8592 -1657 7518 14634 8894 2655 -841 4102 10770 9139 7555 2105
5075 2105 -67 -6387 -4866 -15261 -19079 -19295 -8664 -3822 -7161 -21248 -24580 -6677 -726 -181
5061 -181 -4525 9696 3064 -2475 -1383 5281 9469 9953 17993 15992 4860 -711 3145 6080 9083
5046 9083 -7941 -8204 -6529 -16393 -4595 15732 10413 4785 1329 -2167 -1629 -11782 -3583 8026
5032 8026 7419 11214 13752 6339 -1025 -7610 -7071 -7710 -13621 -17409 -5672 6269 16166 16284 6036
5017 6036 -1543 -9659 -13634 -10068 -13086 -18033 -13532 -11145 -6664 -11052 -14931 -9397 -14712 -11214 919
5002 919 7748 9055 -3425 -5370 2410 6316 4521 -992 -8623 -3907 -8106 -4346 -6885 7117 30922
$$ packed form
5104A7415k669J0072r968j8517o778N215J932J596l065N47k544j6855P419P717
5090h483J6698r511k497m799O935R175P116n740o239l496M943O668j631j584n450
5075B105k172o320J521j0395l818k16J0631M842l339j4087l332J7903N951N45
5061a81m344J4221o632n539J092O664M188M84Q040k001j1132n571L856K935L003
5046I083j7024k63J675r864J1798K0327n319n628l456l496N38j0153Q199J1609
5032H026o07L795K538p413p364o585N39o39n911l788J1737J1941R897J18j0248
5017F036p579q116l975L566l018m947M501K387M481m388l879N534n315L498J2133
5002I19O829J307j2480j945P780L906j795n513p631M716m199L760k539J4002K3805
$$ plain form
4987 30922 34423 11893 -8970 -20697 -19714 -9470 1833 6014 15849 26803 21615 4715 12552
4974 12552 24632 18390 10848 3617 -7878 -6015 -12364 -6462 1113 2553 -1154 -9370 -18882 -22422
4960 -22422 -11349 -10830 -6160 -12420 -12954 5596 8765 4779 -9800 -5409 11351 -5247 -4339 11354
4946 11354 5376 2553 11302 12615 4639 -4760 -8480 6095 22110 20969 12407 11082 4303 507
4932 507 -6205 -16866 -2153 15819 15072 -1561 -6428 -7290 -3074 -648 160 -2049 -18339 -8740 -6000
4917 -6000 -4294 411 -8329 -19055 -14690 -6412 -1372 -4182 -15334 -16609 -23248 -19881 -15971 -9421
4903 -9421 -8704 523 -4208 921 9453 10512 18194 14968 -3476 -10130 -2843 3685 9884 9166 10733
4888 10733 -3561 -13831 -12784 2160 15506 17346 4146 -6080 -9824 -6227 -7611 5533 2365
$$ packed form
4987C0922L501k2530k0863j1727R83J0244J1303M181R835J0954n188j6900P837
4974A2552J2080o242p542p231j1495J863o349N902P575J440l707q216r512l540
4960b2422J1073N19M670o260n34J8550L169l986j4579M391J6760j6598R08J5693
4946A1354n978k823Q749J313p976r399l720J4575J6015j141q562j325o779l796
4932E07o712j0661J4713J7972p47j6633m867q62M216K426Q08k209j6290R599K740
4917f000J706M705q740j0726M365Q278N040k810j1152j275o639L367L910O550
4903i421P17R227m731N129Q532J059P682l226j8444o654P287O528O199p18J567
4888A0733j4294j0270J047J4944J3346J840j3200j0226l744L597j384J3144l168
$$ plain form
4875 2365 -361 -11711 -8897 4862 9310 2307 428 10211 11290 11483 3843 8104 -4194 -16537
4861 -16537 -10956 -10386 -11492 -7544 -321 4571 1359 -487 -10936 -7343 -155 2948 6532 4998 7285
4846 7285 15005 6798 -16882 -16295 -7760 -13351 -15792 -5419 -3077 -4683 3804 13 -10465 -18070
4832 -18070 -1827 3360 -4881 -3838 -18657 -25547 -20931 -13672 -14338 -12363 -5976 970 -1689 -682
4818 -682 2627 -630 4842 21504 29573 22890 10538 9628 2232 3098 -1816 -13171 -8798 -2473 4690
4803 4690 3477 -2587 -14548 -9500 -6778 -15311 -11051 7683 23043 23622 17138 14828 9166 -9016
4789 -9016 -4514 4155 -7887 -18738 -15878 -11845 -4591 7128 639 -8685 -14339 -14714 -16228 -5139
4775 -5139 5050 3032 -1993 -1411 -9478 -7961 874 2737 -3634 425 14672 6764 -1972 7191 7802
$$ packed form
4875B365k726j1350K814J3759M448p003j879R783J079J93p640M261j2298j2343
4861a6537N581N70j106L948P223M892l212j846j0449L593P188L103L584j534K287
4846G285P720q207k3680N87Q535n591k441J0373K342j606Q487l791j0478p605
4832a8070J6243N187q241J043j4819o890M616P259o66J975O387O946k659J007
4818f82L309l257N472J6662Q069o683j2352r10p396Q66m914j1355M373O325P163
4803D690j213o064j1961N048K722q533M260J8734J5360N79o484k310n662j8182
4789i016M502Q669j2042j0851K860M033P254J1719o489r324n654l75j514J1089
4775e139J0189k018n025N82q067J517Q835J863o371M059J4247p908q736R163O11
$$ plain form
4760 7802 -1461 -5111 -3201 4694 -3145 -11644 -14019 -16398 -16709 -22843 -24926 -7946 5627 5211 -5951
4745 -5951 -13704 -12045 3787 16667 18662 4293 -8684 -18089 421 5533 -6551 -9721 -1165
4732 -1165 -1647 -13769 -11812 -10785 -30506 -28746 -14560 -14505 -3714 -2700 1274 -7372 -14273 -11859 -14578
4717 -14578 -14413 -9541 -9914 -10332 -6372 -12703 -18663 688 7028 12215 10201 9893 -5582 -10649 -5641
4702 -5641 913 3604 1717 -10007 -14466 -19105 -21371 -24274 -21849 -23814 -22910 -21135 -8222 -2900 -490
4687 -490 -13562 -22592 -15002 -9189 5924 7225 8636 24407 23748 6628 1333 11321 19796 6435
4673 6435 -5426 -14259 -8400 -2486 181 10920 20241 20327 6279 5580 14692 -5829 -3055 1332 8749
4658 8749 9457 12213 163 -10963 -18423 -6363 -8672 -6309 893 -600 153 65 979 -7453 -25382
$$ packed form
4760G802r263l650J910P895p839q499k375k379l11o134k083J6980J3573m16j1162
4745e951p753J659J5832J2880J995j4369j2977r405J8510N112j2084l170Q556
4732a165m82j2122J957J027j9721J760J4186N5J0791J014L974q646o901K414k719
4717a4578J65M872l73m18L960o331n960J9351O340N187k014l08j5475n067N008
4702e641O554K691j887j1724m459m639k266k903K425j965R04J775J2913N322K410
4687d90j3072r030P590N813J5113J301J411J5771o59j7120n295R988Q475j3361
4673F435j1861q833N859N914K667J0739R321Q6j4048o99R112k0521K774M387P417
4658H749P08K756j2050j1126p460J2060k309K363P202j493P53q8R14q432j7929
$$ plain form
4643 -25382 -26372 -3791 10686 20093 13519 14412 938 -12299 -12981 -1552 478 348 -9683 -21410
4629 -21410 -18601 -5954 4002 4258 2403 2902 -2597 -7734 -18144 -25355 -19036 -10072 460 -9004
4615 -9004 -12790 -7096 -4634 -5305 1841 13924 14935 18667 9841 11862 15080 6137 5844 15422 19355
4600 19355 24884 26341 12964 37 -7695 -2597 3941 13262 -320 -8814 -2483 -3957 6436 851
4586 851 5824 3035 -7629 -15416 -21993 -24085 -24290 -19219 -13440 -11985 -11812 -8719 -9940 -2228 10421
4571 10421 11804 467 3571 8069 8171 5786 11275 13227 -9999 -3168 -3358 -9018 -3207 241 4316
4556 4316 -7336 -9477 -5571 -12066 -31740 -39398 -28543 -11615 -10516 -9102 10386 1071 -2547 -3385
4542 -3385 9285 18049 10692 24685 18724 8734 -47 -8527 -6931 -11315 -18224 -15963 -991 7461
$$ packed form
4643b5382r90K2581J4477R407o574Q93j3474j3237o82J1429K030j30j0031j1727
4629b1410K809J2647R956K56j855M99n499n137j0410p211O319Q964J0532r464
4615i004l786N694K462o71P146J2083J011L732q826K021L218q943k93R578L933
4600A9355N529J457j3377j2927p732N098O538R321j3582q494O331j474J0393n585
4586H51M973k789j0664p787o577k092k05N071N779J455J73L093j221P712J2649
4571A0421J383j1337L104M498J02k385N489J952k3226O831j90n660N811L448M075
4556D316j1652k141L906o495j9674p658J0855J6928J099J414J9488r315l618q38
4542c385J2670Q764p357J3993n961r990q781q480J596m384o909K261J4972Q452
$$ plain form
4528 7461 -3238 -4211 1008 -11664 -15921 -1719 3979 -6762 -7636 -11353 -22381 -23966 -20651 -10805
4514 -10805 -1920 4937 -3958 -12349 -8486 -11341 -4594 8893 20015 17963 6564 -8346 -6740 3153
4500 3153 -8212 -19135 -8581 2820 18239 15575 4235 3704 7022 -1211 -5473 -5713 4870 4037
4486 4037 -1014 2061 7122 5149 -10674 -15989 -15973 -3800 128 10346 9152 472 4176 13537 17584
4471 17584 22006 13944 -2990 766 4297 1126 -1990 -6832 -12592 -20407 -10141 -6584 -2887 4590
4457 4590 19238 25601 21939 8408 1039 -11184 -16852 -12955 -14654 -16565 -6686 2185 6349 1714
4443 1714 -1897 13487 26112 22481 8017 4239 -4263 -11085 -5190 -1593 -4455 -11359 -4737 1122
4429 1122 2542 6855 18029 17821 13411 -1286 -14479 -7054 -7814 -7506 3874 13386 13124 6930 15775
$$ packed form
4528G461j0699r73N219j2672m257J4202N698j0741q74l717j1028j585L315R846
4514a0805Q885O857q895q391L863k855O747J3487J1122k052j1399j4910J606R893
4500C153j1365j0923J0554J1401J5419k664j1340n31L318q233m262k40J0583q33
4486D037n051L075N061j973j5823n315J6J2173L928J0218j194q680L704R361M047
4471A7584M422q062j6934L756L531l171l116m842n760p815J0266L557L697P477
4457D590J4648O363l662j3531p369j2223n668L897j699j911R879Q871M164m635
4443A714l611J5384J2625l631j4464l778q502o822N895L597k862o904O622N859
4429A122J420M313J1174k08m410j4697j3193P425p60L08J1380R512k62o194Q845
$$ plain form
4414 15775 23052 4084 -12163 -8951 -12766 -12424 -7262 1186 1930 -2817 -15048 -7892 -13647 -2539
4400 -2539 3490 -10232 -15923 7885 23923 14060 8283 5252 -2255 -11255 -9039 -4713 -7337 -10999
4386 -10999 -1515 -1903 1593 -4742 -9715 -2056 -8058 -13147 -11056 -3536 2459 -1697 -3904 2857 9414
4371 9414 7808 -2005 11178 18165 8285 6182 18647 13526 -2434 -4536 -2358 1471 -6052 -10495
4357 -10495 -12643 -4842 -15956 -17903 -8062 -5658 -7899 -6749 -2258 -4689 -3122 5003 6408 2802
4343 2802 -4814 -17455 -23646 -25200 -21566 -4690 -9520 -9177 4925 2729 2976 1852 3000 -8743
4329 -8743 8792 10712 1193 6566 1849 -3831 -13316 -13337 -15681 -9094 -17686 -14206 -13651 -3919 8836
4314 8836 -3 -10311 -2845 10035 22748 13380 3253 6813 2914 -1510 -895 -11928 -11604 -8963
$$ packed form
4414A5775P277j8968j6247L212l815L42N162Q448P44m747j2231P156n755J1108
4400b539O029j3722n691K3808J6038r863n777l031p507r000K216M326k624l662
4386a0999R484l88L496o335m973P659o002n089K091P520N995m156k207O761O557
4371I414j606r813J3183O987r880k103J2465n121j5960k102K178L829p523m443
4357a0495k148P801j1114j947R841K404k241J150M491k431J567Q125J405l606
4343B802p616j2641o191j554L634J6876m830L43J4102k196K47j124J148j1743
4329h743J7535J920r519N373m717n680r485k1k344O587q592L480N55R732J2755
4314H836q839j0308P466J2880J2713r368j0127L560l899m424O15j1033L24K641
$$ plain form
4300 -8963 -7461 245 7445 8324 4745 17925 18888 16817 4060 547 -6414 -15506 -21439 -8334 -259
4285 -259 3226 583 -23941 -26945 -27105 -24624 -27108 -24331 -17151 -11683 -16076 -22837 -20337 -20193 -22987
4270 -22987 -21490 -16197 -3700 6727 2734 -9299 -23842 -34483 -22170 -5266 -4255 -258 373
4257 373 -5817 -8420 -9017 -7934 4561 7189 -1938 -15471 -30435 -21453 -2386 -124 -2889 -1194
4243 -1194 -8336 -11207 -4695 2013 16676 15588 8968 -4979 -12008 -9707 -11980 -22230 -19955 -13139
4229 -13139 -10030 -12787 13206 17577 18259 6974 -6688 -6289 -2979 775 10813 14016 21947 26071
4215 26071 12024 -17044 -19468 -14503 -1502 14646 19898 17829 18247 20046 11427 1060 -3218 -13669
4201 -13669 -12431 -11117 -584 8921 11791 8967 -5389 -8659 5590 23112 19480 11967 8218 1443
$$ packed form
4300h963J502P706P200Q79l579J3180R63k071j2757l513o961r092n933J3105Q075
4285b59L485k643k4524l004j60K481k484K777P180N468m393o761K500J44k794
4270b2987J497N293J2497J0427l993j2033j4543j0641J2313J6904J011L997O31
4257C73o190k603n97J083J2495K628r127j3533j4964Q982J9067K262k765J695
4243a194p142k871O512O708J4663j088o620j3947p029K301k273j0250K275O816
4229a3139L109k757K5993M371O82j1285j3662L99L310L754J0038L203P931M124
4215B6071j4047k9068k424M965J3001J6148N252k069M18J799q619j0367m278j0451
4201a3669J238J314J0533R505K870k824j4356l270J4249J7522l632p513l749o775
$$ plain form
4187 1443 5779 13037 18977 16596 8160 1786 -10039 -12385 -554 -3356 -3504 -2195 -19274 -23901
4173 -23901 -17729 -8383 -7127 -15446 -25368 -21873 -19103 -16110 -19944 -19095 -2430 2412 167 -13247
4159 -13247 -20110 -16193 -6974 -5508 1803 -9849 -9479 2612 16406 4742 -20472 -25520 -22103 -18679
4145 -18679 -23342 -1853 9170 7132 -3890 -7809 -21296 -16700 -6321 1766 -554 -1942 2829
4132 2829 -3096 0 3407 3386 -4497 -5844 -8217 -9882 -8589 1155 -1725 -8619 -16547 -1852 625
4117 625 -2339 -4047 -2856 -1495 4277 -2925 -18845 -25196 -14617 -9344 -6981 -407 1824 11314 8936
4102 8936 10852 2885 5217 9600 5135 226 -1538 -1664 -11841 -12805 -3485 13424 33835 19946
4088 19946 19676 25983 17216 6695 3115 10959 6979 7630 11068 20078 31552 25660 14819 14261 1111
$$ packed form
4187A443M336P258N940k381q436o374j1825k346J1831k802j48J309j7079m627
4173b3901O172R346J256q319r922L495K770K993l834Q49J6665M842k245j3414
4159a3247o863L917R219J466P311j1652L70J2091J3794j1664k5214n048L417L424
4145a8679m663K1489J1023k038j1022l919j3487M596J0379Q087k320j388M771
4132B829n925L096L407k1p883j347k373j665J293R744k880o894p928J4695K477
4117F25k964j708J191J361N772p202j5920o351J0579N273K363O574K231R490k378
4102H936J916p967K332M383m465m909j764j26j0177r64R320J6909K0411j3889
4088A9946k70O307q767j0521l580P844l980O51L438R010J1474n892j0841n58j3150
$$ plain form
4073 1111 -6216 -19014 -6167 11050 3852 2098 -181 649 -6688 -8786 -10967 -5080 -8246 -18555
4059 -18555 -712 20371 16562 -4605 -14368 -5212 -4768 -3135 5718 7803 2553 13847 4717 -6731
4045 -6731 -13857 -15030 -9483 2204 5385 -10389 -18744 -19067 -22060 -734 4220 -1971 -2394 1478 -8735
4030 -8735 -11366 -8122 -14018 -14515 -5760 6970 629 2528 11170 5289 -6074 -11066 -7335 -3966 5263
4015 5263 6752 9856 8793 -3947 -1881 2610 2025 -4433 -8053 2835 4743 -4480 -21357 -18332
4001 -18332 -9275 -5652 -623 -7774 -11327 -18883 -15364 -15062 -3809 -3319 -8808 -4713 -992 -6199 -16233
3986 -16233 -23304 -14543 -2603 -10010 -12098 -28707 -34279 -32821 -29197 -31409 -16562 3347 352 -9218
3972 -9218 -20558 -19305 -17080 -925 16974 11740 1035 -1471 -9153 -10495 8866 11187 11466 4705
$$ packed form
4073A111p327j2798J2847J7217p198j754k279Q30p337k098k181N887l166j0309
4059a8555J7843K1083l809k1167r763R156M44J633Q853K085n250J1294r130j1448
4045f731p126j173N547J1687L181j5774q355l23k993K1326M954o191m23L872j0213
4030h735k631L244n896m97Q755J2730o341J899Q642n881j1363m992L731L369R229
4015E263J489L104j063j2740K066M491n85o458l620J0888J908r223j6877L025
4001a8332R057L623N029p151l553p556L519L02J1253M90n489M095L721n207j0034
3986a6233p071Q761J1940p407k088j6609n572J458L624k212J4847J9909k995r570
3972i218j1340J253K225J6155J7899n234j0705k506p682j342J9361K321K79o761
$$ plain form
3958 4705 2740 5720 5067 -5584 -18401 -24656 -13345 -10639 -18577 -21934 -18693 -2638 6413 17761
3944 17761 26375 36611 20158 13463 28772 33367 11213 -2508 -287 -4205 -8682 -13164 -1721
3931 -1721 5032 2113 5277 17158 25847 24505 20866 -2384 -6335 -1916 -733 62 -12047 -20539
3917 -20539 -20382 -2965 1541 4531 14280 22387 24674 8077 8335 4302 3631 -6817 -15396 -14695 -12494
3902 -12494 -4804 -7774 -15098 -2399 11274 628 -545 2136 -2871 -3159 -19645 -27731 -19978 -12632
3888 -12632 -16891 -17515 -10447 -2691 1550 5466 -8138 -19394 -13031 -8411 -2109 10657 16938 3297
3874 3297 124 -5033 -10197 -9247 -11177 5181 18002 13276 7251 -3805 -10552 -23028 -13121 -5063
3860 -5063 -2499 -3135 -13415 -10803 4436 17565 19573 29574 23194 5980 -5370 -18546 -11097
$$ packed form
3958D705j965K980o53j0651j2817o255J1311K706p938l357L241J6055R051J1348
3944A7761Q614J0236j6453o695J5309M595k2154j3721K221l918m477m482J1443
3931a721O753k919L164J1881Q689j342l639k3250l951M419J183P95j2109q492
3917b0539J57J7417M506K990R749Q107K287j6597K58m033o71j0448q579P01K201
3902a2494P690k970p324J2699J3673j0646j173K681n007k88j6486q086P753P346
3888a2632m259o24P068P756M241L916j3604j1256O363M620O302J2766O281j3641
3874C297l173n157n164R50j930J6358J2821m726o025j1056o747j2476R907Q058
3860e063K564o36j0280K612J5239J3129K008J0001o380j7214j1350j3176P449
$$ plain form
3847 -11097 -3128 -6678 -11547 322 -3719 -20469 -23620 -2094 8574 7503 -3019 -17214 -13687
3834 -13687 -9990 -10575 -18574 -16973 -6051 -8570 -19520 -20208 -22951 -18622 -14364 -15039 -26510 -27739 -21669
3819 -21669 -18154 -9803 663 557 -5673 12530 22962 13721 3817 2092 -5996 1908 6167 5818
3805 5818 -4704 -10280 1394 4267 11995 16371 18258 13454 10090 -1388 -8546 -498 4953 2104
3791 2104 -406 1826 9771 20098 14615 3839 6566 14840 22655 17527 4747 499 -3426 -6990
3777 -6990 -11349 -11089 -3309 2931 15204 14824 16258 7844 -5633 -9124 -10033 -12547 -9103 1466 1041
3762 1041 -6365 -7993 -3045 6910 5623 5394 12855 8787 8488 13447 21765 10088 -1410 -3718 3676
3747 3676 13248 10733 5723 5102 1800 8196 2578 -2637 10318 11165 15210 8301 -64 -10802 -20706
$$ packed form
3847a1097P969l550m869J1869m041j6750l151K1526J0668j071j0522j4195L527
3834a3687L697n85p999J601J0922k519j0950o88k743M329M258o75j1471j229O070
3819b1669L515Q351J0466j06o230J8203J0432r241r904j725q088P904M259l49
3805E818j0522n576J1674K873P728M376J887m804l364j1478p158Q048N451k849
3791B104k510K232P945J0327n483j0776K727Q274P815n128j2780m248l925l564
3777f990m359K60P780O240J2273l80J434q414j3477l491r09k514L444J0569m25
3762A041p406j628M948R955j287k29P461m068k99M959Q318j1677j1498k308P394
3747C676R572k515n010o21l302O396n618n215J2955Q47M045o909q365j0738r904
$$ plain form
3732 -20706 -28699 -31713 -27542 -17938 -5398 14766 6461 6633 6195 6990 15275 15933 5058 -2776 -10329
3717 -10329 -151 -16800 -21543 -7786 -6895 -2053 -12792 -16369 -13654 -12473 -10489 -12958 -1846 3191
3703 3191 -2968 -4847 -2377 -6667 -19455 -7708 -856 8892 11668 -3220 -18214 -10681 -1024 1937
3689 1937 -30 3785 -4334 -7722 -13767 -18655 -8086 -14307 -24638 -19019 -23237 -16131 -8610 1814
3675 1814 9452 3557 -1186 -3334 -7306 -1205 -13044 -20925 -3609 18976 17969 -1106 -4550 9723
3661 9723 9217 6733 13459 18459 10981 4429 4830 -12152 -30632 -30352 -27263 -22880 -14650 -11883 -15351
3646 -15351 -11850 -20430 -22699 -2990 3629 -7565 -6727 -9219 -4685 -3907 -4577 -8 -6716 -8122 -750
3631 -750 -3970 -8795 -7435 -12123 -21544 -19102 -21845 -23540 -18587 -13760 -7953 -7150 2897 9310 15
$$ packed form
3732b0706p993l014M171R604J2540K0164q305J72m38P95Q285O58j0875p834p553
3717a0329J0178j6649m743J3757Q91M842j0739l577K715J181J984k469J1112N037
3703C191o159j879K470m290j2788J1747O852R748K776j4888j4994P533R657K961
3689A937j967L815q119l388o045m888J0569o221j0331N619m218P106P521J0424
3675A814P638n895m743k148l972O101j1839p881J7316K2585j007j9075l444J4273
3661I723n06k484O726N000p478o552M01j6982j8480K80L089M383Q230K767l468
3646a5351L501q580k269J9709O619j1194Q38k492M534P78o70M569o708j406P372
3631g50l220m825J360m688r421K442k743j695M953M827N807Q03J0047O413r295
$$ plain form
3616 15 -2642 -3881 2484 -8696 -14896 -14896 -14916 -16001 -15898 -23153 -19477 -16525 -26183 -37158 -33127 -22353
3600 -22353 -11186 -16397 -13215 -4842 -11642 -14610 -18474 -4760 -1346 7530 1203 -12847 -26185 -20833
3586 -20833 -15090 -14959 -2672 3320 5293 1507 -6956 -4561 6890 -5194 -10225 4484 2025 -2074
3572 -2074 3775 3778 4387 1661 15739 20010 19958 16299 13475 15935 14820 4069 -3379 811 1495 10061
3556 10061 12546 8428 4835 -12365 -17425 -18373 -14791 1823 -84 -2034 843 168 -2663 -6055 -17
3541 -17 3289 -601 5378 16942 24212 15536 19295 -3590 -14927 -16543 -13152 -14970 -14377 -10045 180
3526 180 -5747 -3127 229 720 -5476 -4232 -8198 -15491 -21602 -15199 -13946 -3461 103 -1789 -894
3511 -894 13392 17291 18400 16096 9646 2776 1074 -6189 -4315 17129 13257 11219 5620 6909 5681
$$ packed form
3616A5k657j239O365j1180o200%k0j085J03p255L676K952r658j0975M031J0774
3600b2353J1167n211L182Q373o800k968l864J3714L414Q876o327j4050j3338N352
3586b0833N743J31J2287N992J973l786q463K395J1451j2084n031J4709k459m099
3572b074N849LO09k726J4078M271n2l659k824K460j115j0751p448M190O84Q566
3556A0061K485m118l593j7200n060r48L582J6614j907j950K877o75k831l392O038
3541a7L306l890N979J1564P270q676L759k2885j1337j616L391j818N93M332J0225
3526A80n927K620L356M91o196J244l966p293o111O403J253J0485L564j892Q95
3511h94J4286L899J109k304o450o870j702p263J874K1444l872k038n599J289j228
$$ plain form
3496 5681 834 11991 2354 -729 -2087 4314 6651 -12400 -31768 -28597 -11967 1050 -10125
3483 -10125 -22671 -10268 -7873 -10544 2064 -15649 -22167 -20235 -12851 582 -9175 -13044 -17950
3470 -17950 -19741 -8285 -3375 -6967 -9062 -7831 -19615 -20490 -8842 -7955 -3 5572 4953 7488 2745
3455 2745 3071 4746 6601 8344 9216 7135 -1784 -24905 -28502 -21810 -21170 -19382 -26948 -30198 -12866
3440 -12866 -7319 -7700 1755 47 16492 10613 -6213 -18213 -16281 -13381 -106 860 -5827 -410
3426 -410 7534 3285 -15929 -22939 -11552 10287 11815 10609 17127 15372 3270 4394 7615 -12522
3412 -12522 -6329 7222 -1095 -4541 3527 662 12865 12674 -7951 -13702 -9660 -18710 -29922 -12557
3398 -12557 -547 -8120 -21507 -20277 -28529 -29098 -21154 -12605 -8496 -7972 -13298 -11750 -10728 -15496 -26746
$$ packed form
3496E681m847J1157r637l083j358O401K337j9051j9368L171J6630J3017j1175
3483a0125j2546J2403K395k671J2608j7713o518J932P384J3433r757l869m906
3470a7950j791J1456M910l592k095J231j1784q75J1648Q87P952N575o19K535m743
3455B745L26J675J855J743Q72k081q919k3121l597O692O40J788p566l250J7332
3440a2866N547l81R455j708J6445n879j6826j2000J932K900J3275R66o687N417
3426d10P944m249j9214p010J1387K1839J528j206O518j755j2102J124L221k0137
3412a2522O193J3551q317l446Q068k865J2203j91k0625n751M042r050j1212J7365
3398a2557J2010p573j3387J230q252n69P944Q549M109N24n326J548J022m768j1250
$$ plain form
3383 -26746 -29759 -10806 281 -516 -1675 -2340 -3098 -7570 -7893 -359 -5179 -10472 -4556 -5342 -5450 -4608
3367 -4608 -2121 8480 20577 14807 -2805 -7815 -11287 1945 15801 21565 3716 -3991 -4845 -6946
3353 -6946 -4560 2935 -1590 -3153 -3775 -5200 1201 -7375 271 -2714 -9402 -3734 7842 21864 27087
3338 27087 16845 7875 11734 4162 9269 -616 -10312 -5427 9137 6511 -1290 -7214 -9425 -7660
3324 -7660 -10909 -11109 -4694 -12050 -3625 2761 -4083 -8137 -2895 -5816 -15419 -6866 5843 17374 19074
3309 19074 14842 23794 27499 25900 27498 22079 8799 -1374 4637 -11108 -19320 -14838 -6266 1742
3295 1742 -9110 -21423 -18709 -13648 -18429 -11145 -12904 -9386 -11880 -2846 -149 -4416 -13139 19
3281 19 10568 3189 601 -18082 -19162 -6669 -5300 -6789 -3239 -2593 12793 27407 27106 8757
$$ packed form
3383b6746l013J8953J1087p97j159o65p58m472l23P534m820n293N916p86j08Q42
3367d608K487J0601J2097n770j7612n010l472J3232J3856N764j7849p707q54k101
3353f946K386P495m525j563o22j425O401q576P646k985o688N668J1576J4022N223
3338B7087j0242q970L859p572N107r885r696M885J4564k626p801n924k211J765
3324g660l249k00O415p356Q425O386o844m054N242k921r603Q553J2709J1531J700
3309A9074m232Q952L705j599J598n419j3280j0173O011j5745q212M482Q572Q008
3295A742j0852j2313K714N061m781P284j759L518k494R034K697m267q723J3158
3281A9J0549p379k588j8683j080J2493J369j489L550O46J5386J4614l01j8349
$$ plain form
3267 8757 -8873 -16038 -15604 -9954 -7296 -9038 -9263 -13254 -16024 -12497 -10916 -12612 -13056 -4322 -230
3252 -230 -18767 -12896 1756 10225 1372 -8036 -19525 -13894 -15980 -16038 -14468 -6264 -8019 -8944 -15036
3237 -15036 -17785 -933 15412 14262 16292 28935 35210 45284 32072 21571 21237 16640 3997
3224 3997 -4122 -11069 -6485 -5293 -8919 -10916 -18551 -20678 -17534 -19482 -23866 -12038 6652 2601
3210 2601 10 10785 18747 8342 6457 -5092 -9130 4380 13688 -6315 -17553 -13473 -10293
3197 -10293 -6976 -5064 -6035 -1253 -1484 -11127 -2309 3537 7868 12491 10560 9326 1540 2955 3123
3182 3123 -6168 -7987 -6706 -10587 -7890 2087 5071 -117 -5340 -14816 -3736 -11325 -22962 -15378
3168 -15378 -18329 -25274 -30267 -20329 -1732 3073 -2638 -16596 -21688 -28382 -23850 -19440 -18026 -10482
$$ packed form
3267H757j7630p165M34N650K658j742k25l991k770L527J581j696m44Q734M092
3252b30j8537N871J4652Q469q853r408j1489N631k086n8J570Q204j755r25o092
3237a5036k749J6852J6345j150K030J2643O275J0074j3212j0501l34m597j2643
3224C997q119o947M584J192l626j997p635k127L144j948m384J1828J8690m051
3210B601k591J0775P962j0405j885j1549m038J3510R308k0003j1238M080L180
3197a0293L317J912r71M782k31r643Q818N846M331M623j931j234p786J415J68
3182C123r291j819J281l881K697R977K984n188n223r476J1080p589j1637P584
3168a5378k951o945m993R938J8597M805n711j3958n092o694M532M410J414P544
$$ plain form
3154 -10482 -10445 -9682 -5328 -8674 -12288 -20973 -12788 -2714 5004 1030 2013 -1824 -8875 -16095 -3908
3139 -3908 405 -8570 -20276 -24241 -4813 936 9161 21453 6491 -4731 -5137 -8279 -7310 -7484
3125 -7484 652 -1002 2464 -3286 5265 93 4676 -3440 -5845 5115 6687 8026 959 -6569 149
3110 149 -1531 -2588 1494 9618 -604 -1176 3678 -10049 -16004 -10269 -3831 6695 21002 21125 11580
3095 11580 3768 9669 27450 25612 16285 15931 19790 10258 15494 19040 14785 9343 -3929 -17463
3081 -17463 -11875 1356 14381 26210 20982 8817 -1349 -8728 -9514 -5684 11968 20075 21471
3068 21471 14783 11845 18615 17531 2639 -17862 -22723 1823 6827 -2423 3910 3187 -1825 -5445
3054 -5445 -7887 -10636 -11301 -7392 -10130 -4209 3001 -153 -7116 -15842 -17957 -18538 -14175 -18069 -11145
$$ packed form
3154a0482L7P63M354l346l614q685Q185J0074P718l974R83l837p051p220J2187
3139c908M313q975j1706l965J9428N749Q225J2292j4962j1222m06l142R69j74
3125g484Q136j654L466n750Q551n172M583q116k405J0960J572J339p067p528O718
3110A49j680j057M082Q124j0222n72M854j3727n955N735O438J0526J4307J23r545
3095A1580p812N901J7781j838r327l54L859r532N236L546m255n442j3272j3534
3081a7463N588J3231J3025J1829n228j2165j0166p379p86L830J7652Q107J396
3068B1471o688k938O770j084j4892k0501m861K4546N004r250O333p23n012l620
3054e445k442k749o65L909k738N921P210l154o963q726k115n81M363l894O924
$$ plain form
3039 -11145 -1802 -7502 -22489 -12543 -10585 -4263 -1088 -7585 -15557 -430 8923 7157 7157 9433 7182
3024 7182 14048 20063 10947 1729 -14707 -23624 -28330 -25811 -13848 -19551 -17795 -13098 -24971 -26411
3010 -26411 -14216 -15858 -14474 2736 -468 -16661 -6866 -5066 -6374 2324 5348 -188 -88 3333
2996 3333 4454 3850 -2199 -4931 -1306 -12748 -16347 -13749 -7932 -4344 -7714 -14163 -10579 563 5853
2981 5853 11125 5164 -9389 -5458 -2083 6250 562 6399 11742 6867 -271 -5792 -4321 -5134 -11740
2966 -11740 -15895 -17711 -26723 -27558 -23419 -2214 4932 3312 6454 6492 5978 161 1029 -7652 -21517
2951 -21517 -30166 -19068 -9715 5965 5107 -8104 1078 11942 18311 20896 28262 28915 19271 16450
2937 16450 14195 27735 28588 21430 23303 20969 29511 21965 15205 6115 -2882 -10 7164 11110 10548
$$ packed form
3039a1145R343n700j4987R946J958O322L175o497p972J5127R353j766%K276k251
3024G182O866O015r116r218j6436q917m706K519J1963n703J756M697j1873j440
3010b6411J2195j642J384J7210l204j6193R795J800j308Q698L024n536J00L421
2996C333J121o04o049k732L625j1442l599K598N817L588l370o449L584J1142N290
2981E853N272n961j4553L931L375Q333n688N837N343m875p138n521J471q13o606
2966a1740m155j816r012q35M139K1205P146j620L142L8n14n817Q68q681j3865
2951b1517q649J1098R353J5680q58j3211R182J0864O369K585P366O53r644k821
2937A6450k255J3540Q53p158J873k334Q542p546o760r090q997K872P174L946n62
$$ plain form
2922 10548 8754 -2431 -19250 -30612 -19317 -18437 -16958 2845 9928 12991 4771 -3224 12733
2909 12733 19443 18520 19695 16466 -3733 -17165 -20970 -3910 11477 10764 14180 18551 -6246 -9859
2895 -9859 1638 -6221 -15569 -23123 -18656 -2634 3765 -3911 -572 -10829 -16072 -10950 -2371 -2522
2881 -2522 4165 587 -2052 3590 41 5267 13225 10651 4791 4093 2769 14068 9867 1284 6690
2866 6690 10884 11858 12721 7268 -4608 612 7484 18278 17939 12870 9694 13022 14169 17992 1130
2851 1130 1976 3123 8277 16319 13537 1544 2611 21581 27711 26037 13949 -1188 6833 11741
2837 11741 15622 9717 9027 -195 7244 13335 8948 9594 22931 32535 29213 23833 21862 7260 -228
2822 -228 -12047 -30157 -13198 3997 2173 -2110 -8627 -15311 5348 10484 2268 -476 5812 4420
$$ packed form
2922A0548j794j1185j6819j1362J1295Q80J479J9803P083L063q220p995J5957
2909A2733O710r23J175l229k0199j3432l805J7060J5387p13L416M371k4797l613
2895i859J1497p859r348p554M467J6022O399p676L339j0257n243N122Q579j51
2881b522O687l578k639N642l549N226P958k574n860o98j324J1299m201q583N406
2866F690M194R74Q63n453j1876N220O872J0794l39n069l176L328J147L823j6862
2851A130Q46J147N154Q042k782j1993J067J8970O130j674j2088j5137Q021M908
2837A1741L881n905o90r222P439O091m387O46J3337R604l322n380j971j4602p488
2822b28j1819j8110J6959J7195j824m283o517o684K0659N136q216k744O288j392
$$ plain form
2808 4420 12444 12555 10176 4936 7896 6536 13614 2595 -3406 6128 9319 7325 6713 3114 -6691
2793 -6691 -9778 -328 14908 6427 -8399 -21602 -18747 -2026 -4894 6484 27853 33176 26898
2780 26898 17811 -3794 -22857 -31465 -22961 -13019 4850 13069 15948 7587 -3172 -11155 -8064 -1514
2766 -1514 -2238 -4963 -9971 -1810 8166 -4294 -17817 -10016 -104 2596 4102 1325 -8534 135 6606
2751 6606 7337 11273 5647 -1062 889 -1651 3525 1261 3894 -4548 -3371 2204 1080 -147 5660
2736 5660 2055 -2694 -5930 -5532 3802 7897 10002 8168 -2080 -886 10390 6500 -8783 -15044
2722 -15044 -21600 -20571 -9980 -4444 -10958 -21394 -9555 -13913 -14784 -11104 3812 23781 15124 -239
2708 -239 3512 15119 18029 8631 -46 -3678 -5814 -20925 -22166 -6096 -4192 -2728 -8321 -14975
$$ packed form
2808D420Q024J11k379n240K960j360P078j1019o001R534L191j994o12l599r805
2793f691l087R450J5236q481j4826j3203K855J6721k868J1378K1369N323o278
2780B6898r087k1605j9063q608Q504R942J7869Q219K879q361j0759p983L091O550
2766a514p24k725n008Q161R976j2460j3523P801R912K700J506k777r859Q669O471
2751F606P31L936n626o709J951k540N176k264K633q442J177N575j124j227N807
2736E660l605m749l236L98R334M095K105j834j0248J194J1276l890j5283o261
2722a5044o556J029J0591N536o514j0436J1839m358q71L680J4916J9969q657j5363
2708b39L751J1607K910r398q677l632k136j5111j241J6070J904J464n593o654
$$ plain form
2694 -14975 -10324 6866 10727 4106 5407 4689 4171 11532 19945 12286 4148 -11622 -24076 -31145
2680 -31145 -22628 -12705 -6818 -9333 -544 3275 -8955 -20842 -19496 -17479 -12225 -16404 -18376 -8706
2666 -8706 -7150 -1958 5044 4245 -4280 -17035 -30856 -24619 -9865 -20140 -11143 -22025 -26664 -15438
2652 -15438 -6874 5456 -6199 -12837 -9199 -957 40 -4021 3188 -1977 5250 3029 -4192 -6441
2638 -6441 -2078 9343 5418 -6502 -7855 2012 11933 10914 3635 -121 -2069 -5897 -5532 -122 -2683
2623 -2683 -15811 -16122 -6634 495 2090 -7061 3376 17670 21741 8512 -3672 -393 11575 28324
2609 28324 32265 10239 -1188 46 -3799 -2678 1734 -12964 -12542 -4067 -3081 9699 17107 -822
2595 -822 -3298 8447 1959 14888 11347 17150 12074 2115 -1407 3423 3255 7828 11294 7431 9422
$$ packed form
2694a4975M651J7190L861o621J301p18n18P361Q413p659q138j5770j2454p069
2680c1145Q517R923N887k515Q789L819j2230j1887J346K017N254m179j972R670
2666h706J556N192P002p99q525j2755j3821O237J4754j0275Q997j0882m639J1226
2652a5438Q564J2330j1655o638L638Q242R97m061P209n165P227k221p221k249
2638f441M363J1421l925j1920j353R867R921j019p279l756j948l828L65N410k561
2623b683j3128l11R488P129J595r151J0437J4294M071j3229j2184L279J1968J6749
2609B8324L941k2026j1427J234l845J121M412j4698M22Q475R86J2780P408j7929
2595h22k476J1745o488J2929l541N803n076r959l522M830j68M573L466l863J991
$$ plain form
2580 9422 1947 -2290 -10405 -5756 -3292 -7313 -11299 -8618 -8745 -18963 -32184 -22789 -6158 -12545
2566 -12545 -14934 -23709 -17619 -9938 -1807 6031 3810 -2445 6307 1977 10473 4935 -2781 -973 -6081
2551 -6081 -9799 -13093 -24307 -31076 -28507 -25385 -5473 10252 -4 -9882 -4432 4369 -6248 3564
2537 3564 7719 16866 24997 18191 10471 2353 -441 -7309 -5995 -10112 -20046 -8507 7548 6128
2523 6128 5023 8406 -1323 -4491 4505 15937 20071 18707 5556 4784 -7569 -10101 -6509 -6618 -11827
2508 -11827 -20077 -8365 -311 -8094 -7246 5451 7393 7659 2760 -11988 -15433 -7208 88 -9523
2494 -9523 -538 11084 18824 9256 4244 7793 8723 -52 4566 16247 13559 12811 2984 4114 7291
2479 7291 9425 16242 11066 11638 9540 11377 9852 14374 8104 9828 14059 10237 9604 -6775 -23363
$$ packed form
2580I422p475m237q115M649K464m021l986K681j27j0218j3221R395J6631o387
2566a2545k389q775O090P681Q131P838k221o255Q752m330Q496n538p716J808n108
2551f081l718l294j1214o769K569L122J9912J5725j0256r878N450Q801j0617R812
2537C564M155R147Q131o806p720q118k794o868J314m117r934J1539J6055j420
2523F128j105L383r729l168Q996J1432M134j364j3151p72j2353k532L592j09n209
2508a1827q250J1712Q054p783Q48J2697J942K66m899j4748l445Q225P296r611
2494i523Q985J1622P740r568n012L549R30q775M618J1681k688p48r827J130L177
2479G291K134O817n176N72k098J837j525M522o270J724M231l822o33j6379j6588
$$ plain form
2464 -23363 -15023 -10541 -12364 -6952 -10652 -8002 -472 -2587 -6186 -13971 -10065 6213 3979 783
2450 783 4155 8549 11309 13120 2016 -829 -6222 -22985 -17207 -9359 -2389 -9557 -14289 -18909 -23840
2435 -23840 -31427 -24233 -16627 -21524 -23125 -30404 -24055 -21174 -19164 -17466 -29785 -36685 -23520 -6759
2421 -6759 -13947 -12492 -11698 -15461 -22154 -14283 -7326 -5784 -11094 -26424 -17859 -16270 -1128 5499 4276
2406 4276 5037 4412 2350 -6345 -7015 -8786 -12809 -15021 -5808 -319 6751 5745 4633 -5940 2089
2391 2089 8903 12532 -2089 1835 8416 12095 11738 7684 4504 -342 12177 19449 23951 26402 34135
2376 34135 29763 13936 6336 -2151 -6217 -10028 -13032 -23821 -30065 -30152 -14705 9093 7167 -2587
2362 -2587 -12281 -5620 -3469 -13774 -18901 -22963 -38240 -50001 -52518 -36142 -13363 -18016 -24017 -6860
$$ packed form
2464b3363Q340M482j823N412l700K650P530k115l599p785L906J6278k234l196
2450G83L372M394K760J811j1104k845n393j6763N778P848O970p168m732m620m931
2435b3840p587P194P606m897j601p279O349K881K010J698j2319o900J3165J6761
2421f759p188J455P94l763o693P871O957J542n310j5330Q565J589J5142O627j223
2406D276P61o25k062q695o70j771m023k212R213N489P070j006j112j0573Q029
2391B089O814L629j4621L924O581L679l57m054l180m846J2519P272M502K451P733
2376C4135m372j5827p600q487m066l811l004j0789o244q7J5447K3798j926r754
2362b587r694O661K151j0305n127m062j5277j1761k517J6376K2779m653o001J7157
$$ plain form
2348 -6860 -157 11386 14446 14143 8546 8757 8789 10111 12312 6703 -6465 -8888 -3132 -1455 -11923
2333 -11923 -27524 -23633 -21959 -9322 -7504 -3967 9540 20475 13084 7721 13549 8821 -4913
2320 -4913 -3809 736 4108 12903 17727 15355 11370 19162 19689 26125 8097 -6610 -1990 4359 3964
2305 3964 -172 1288 7548 1722 1056 839 -7033 -15342 -14739 -9395 11586 7868 -8609 -20243 -20105
2290 -20105 -20832 -28808 -18824 -14595 -26287 -27569 -14436 -3855 5616 1401 -3794 7323 299 -26445
2276 -26445 -25175 -11613 -4261 -2782 6594 7106 5379 -1846 -6937 -9890 -6343 -1400 -1158 33 -7231
2261 -7231 -23479 -18135 -4856 -1836 7781 23613 13498 -3168 -2158 -11189 -13450 -2230 1380
2248 1380 14296 14054 8302 1691 5618 12514 28183 31017 19025 7106 -12834 -8957 4307 4838
$$ packed form
2348f860O703J1543L060l03n597K11L2J322K201n609j3168k423N756J677j0468
2333a1923j5601L891J674J2637J818L537J3507J0935p391n363N828m728j3734
2320d913J104M545L372Q795M824k372l985P792N27O436j8028j4707M620O349l95
2305C964m136J460O260n826o66k17p872q309O03N344K0981l718j6477j1634J38
2290b0105p27p976R984M229j1692j282J3133J0581R471m215n195J1117p024k6744
2276b6445J270J3562P352J479R376N12j727p225n091k953L547M943K42J191p264
2261g231j6248N344J3279L020R617J5832j0115j6666J010r031k261J1220L610
2248A380J2916k42n752o611L927O896J5669K834j1992j1919j9940L877J3264N31
$$ plain form
2234 4838 6398 3133 1746 4138 -6977 -17304 -22179 -16850 -8734 -4643 14517 20653 9668 -12705
2220 -12705 -19838 -12446 -4177 3012 11635 16250 24053 24610 26831 9711 -884 -4459 6229 13724
2206 13724 5950 10160 15010 12946 17642 19332 29205 21175 5866 -2390 -774 20547 18357 2112
2192 2112 -11354 -14732 -11629 1135 -11084 -1726 7933 8316 4950 -5661 -13213 -6847 -1870 -4046
2178 -4046 -6345 -1071 -1345 -8635 -6969 14525 3983 -10304 -5988 -1484 479 1541 -2651 443
2164 443 5920 7445 2642 823 8009 11510 7308 -7965 -14509 -11196 -5766 -10617 1357 9393 977
2149 977 -7667 -5748 7181 7168 2944 6728 13650 11709 13428 21234 24124 7465 420 17571 14811
2134 14811 4703 1376 -949 -2532 5658 12184 6160 3460 3241 10363 20743 15197 18241 26456
$$ packed form
2234D838J560l265j387K392j1115j0327m875N329Q116M091J9160O136j0985k2373
2220a2705p133P392Q269P189Q623M615P803N57K221j7120j0595l575J0688P495
2206A3724p774M210M850k064M696J690R873q030j5309q256J616K1321k190j6245
2192B112j3466l378L103J2764j2219R358R659L83l366j0611p552O366M977k176
2178d046k299N274k74p290J666K1494j0542j4287M316M504J963J062m192L094
2164D43N477J525m803j819P186L501m202j5273o544L313N430m851J1974Q036q416
2149I77q644J919J2929j3m224L784O922j941J719P806K890j6659p045J7151k760
2134A4811j0108l327k325j583Q190O526o024k700k19P122J0380n546L044Q215
$$ plain form
2120 26456 17966 12651 11507 1818 6481 12413 14124 928 -11765 -22479 -18685 -6788 770 5568
2106 5568 6432 -1653 -16389 -13923 -6654 -10509 -8548 -6074 -9217 -20074 -12576 -3898 -495 9711
2092 9711 -404 8788 7564 8004 15493 22158 19868 18345 17523 13297 13520 9362 -8115 -5301 3736
2077 3736 -4454 -18919 -9079 5024 7608 7376 6512 9990 -344 -1371 7125 -3120 6212 10660
2063 10660 8473 -3435 -1041 -5708 3631 11732 7147 6586 -1538 -2080 -1860 -8080 -10954 -9842 -2316
2048 -2316 8034 13441 21199 19913 5602 5168 2666 4023 16178 6595 -144 -6402 -1611 -9593
2034 -9593 -12547 -11313 -9401 -10717 -11783 3145 16586 22580 21860 21745 26113 22782 3398 -15346
2020 -15346 -10101 -750 -3718 -17102 -17878 -9096 8683 10932 -7639 -808 -3124 -1953 -11846 -23059
$$ packed form
2120B6456q490n315j144r689M663N932J711j3196j2693j0714L794J1897P558M798
2106E568Q64q085j4736K466P269l855J961K474l143j0857P498Q678L403J0206
2092I711j0115R192j224M40P489O665k290j523q22m226K23m158j7477K814R037
2077C736q190j4465R840J4103K584k32q64L478j0334j027Q496j0245R332M448
2063A0660k187j1908K394m667R339Q101m585n61q124n42K20o220k874J112P526
2048b316J0350N407P758j286j4311m34k502J357J2155r583o739o258M791p982
2034i593k954J234J912j316j066J4928J3441N994p20j15M368l331j9384j8744
2020a5346N245R351k968j3384p76Q782J7779K249j8571O831k316J171r893j1213
$$ plain form
2006 -23059 -26729 -17625 -18148 -16902 -9797 -4156 -4237 3695 7362 -7032 -23252 -20689 -19608 -18037 -9539
$$ packed form
2006b3059l670R104n23J246P105N641q1P932L667j4394j6220K563J081J571Q498
$$ [...]
##END NTUPLES=NMR SPECTRUM
##END=
