##TITLE=Analysis number 317448
Compound Code spb 02551
Project Code qc-cat
Chemist Name ddc weighroom
##JCAMPDX= 6.0         $$ Bruker NMR JCAMP-DX V2.0
##DATA TYPE= NMR SPECTRUM
##DATA CLASS= NTUPLES
##ORIGIN= Bruker BioSpin GmbH
##OWNER= nmr
$$ XWIN-NMR		Version 3.5
$$ Mon Feb 20 17:17:57 2006 GMT Standard Time (UT+0h)  MAYBRIDGE\nmr@NMR_250MHZ
##.OBSERVE FREQUENCY= 250.131544655141
##.OBSERVE NUCLEUS= ^1H
##.ACQUISITION MODE= SIMULTANEOUS (DQD)
##.ACQUISITION SCHEME= undefined
##.AVERAGES= 16
##.DIGITISER RES= 18
##SPECTROMETER/DATA SYSTEM= dpx250
##.PULSE SEQUENCE= zg30
##.SOLVENT NAME= DMSO
##.SHIFT REFERENCE= (INTERNAL, DMSO, 0, 16.522)
##AUDIT TRAIL= $$ (NUMBER, WHEN, WHO, WHERE, WHAT)
$$ ##TITLE= Audit trail, XWIN-NMR		Version 3.5
$$ ##JCAMPDX= 5.01
$$ ##ORIGIN= Bruker BioSpin GmbH
$$ ##OWNER= nmr
$$ C:\u/data/dgb/nmr/ADRS/16430/pdata/1/auditp.txt
$$ ##AUDIT TRAIL=  $$ (NUMBER, WHEN, WHO, WHERE, WHAT)
(   1,<2006-02-20 17:17:30.03 +000>,<MAYBRIDGE\nmr>,<NMR_250MHZ>,
      <created by zg, POWCHK disabled, PULCHK disabled
       configuration hash MD5:
       84 BC 41 DB A1 6E 1D 46 DA 25 12 A5 C1 ED C5 3A
       data hash MD5: 64K
       82 CC E3 8D 5F E8 F9 5E 7D 63 45 43 50 3A C7 70>)
(   2,<2006-02-20 17:17:46.40 +000>,<MAYBRIDGE\nmr>,<NMR_250MHZ>,
      <Start of raw data processing
       ef LB = 0.3 FT_mod = 6 PKNL = 1 SI = 32K 
       data hash MD5: 32K
       54 24 EA 7B 06 1E 07 81 4D 31 D3 F2 15 DC C7 43>)
(   3,<2006-02-20 17:17:48.15 +000>,<MAYBRIDGE\nmr>,<NMR_250MHZ>,
      <apk 
       data hash MD5: 32K
       C9 24 EC 14 67 AB A7 B5 E7 24 69 63 8C 04 FC AB>)
(   4,<2006-02-20 17:17:48.89 +000>,<MAYBRIDGE\nmr>,<NMR_250MHZ>,
      <abs ABSG = 5 
       data hash MD5: 32K
       CA F6 E3 D7 30 84 44 45 0C 43 FD 43 3C AC 7C 70>)
$$ ##END=
$$ 
$$ hash MD5
$$ 9E 56 82 12 9E 7A 91 B2 62 1D 2C 32 7D 35 DA 63
##$RELAX= 
##$RELAX= 
##$RELAX= 
##$RELAX= 
##$RELAX= 
##$RELAX= 
##$RELAX= 
$$ Bruker specific parameters
$$ --------------------------
##$DU= <C:\u>
##$EXPNO= 16430
##$NAME= <ADRS>
##$PROCNO= 1
##$TYPE= <nmr>
##$USER= <dgb>
##$AMP= (0..31)
100 100 100 100 100 100 100 100 100 100 100 100 100 100 100 100 100 100 
100 100 100 100 100 100 100 100 100 100 100 100 100 100 
##$AQSEQ= 0
##$AQ_mod= 3
##$AUNM= <au_zg>
##$AUTOPOS= <57 >
##$BF1= 250.13
##$BF2= 250.13
##$BF3= 250.13
##$BF4= 250.13
##$BF5= 500.13
##$BF6= 500.13
##$BF7= 500.13
##$BF8= 500.13
##$BYTORDA= 1
##$CFDGTYP= 0
##$CFRGTYP= 5
##$CHEMSTR= <none>
##$CNST= (0..31)
1 1 145 1 1 1 1 1 1 1 1 1 1 1 1 1 1 1 1 1 1 1 1 1 1 1 1 1 1 1 1 1 
##$CPDPRG= <>
##$CPDPRG1= <>
##$CPDPRG2= <>
##$CPDPRG3= <>
##$CPDPRG4= <mlev>
##$CPDPRG5= <mlev>
##$CPDPRG6= <mlev>
##$CPDPRG7= <mlev>
##$CPDPRG8= <mlev>
##$CPDPRGB= <>
##$CPDPRGT= <>
##$D= (0..31)
0 1 0 0 0 0 0 0 0 0.06 0 0 0 0 0 0 0.0002 0 0 0 0 0 0 0 0 0 0 0 0 0 0 
0 
##$DATE= 1140455848
##$DBL= (0..7)
120 120 120 120 120 120 120 120 
##$DBP= (0..7)
150 150 150 150 150 150 150 150 
##$DBP07= 0
##$DBPNAM0= <>
##$DBPNAM1= <>
##$DBPNAM2= <>
$$ [...]
##$SUBNAM7= <"">
##$SUBNAM8= <"">
##$SUBNAM9= <"">
##$SW= 20.6930455092707
##$SWIBOX= (0..15)
0 0 3 0 0 0 0 0 0 0 0 0 0 0 0 0 
##$SW_h= 5175.983436853
##$TD= 65536
##$TD0= 1
##$TE= 294.16
##$TE2= 300
##$TE3= 300
##$TEG= 300
##$TL= (0..7)
0 120 120 120 120 120 120 120 
##$TP= (0..7)
150 150 150 150 150 150 150 150 
##$TP07= 0
##$TPNAME0= <>
##$TPNAME1= <>
##$TPNAME2= <>
##$TPNAME3= <>
##$TPNAME4= <>
##$TPNAME5= <>
##$TPNAME6= <>
##$TPNAME7= <>
##$TPOAL= (0..7)
0.5 0.5 0.5 0.5 0.5 0.5 0.5 0.5 
##$TPOFFS= (0..7)
0 0 0 0 0 0 0 0 
##$TUNHIN= 0
##$TUNHOUT= 0
##$TUNXOUT= 0
##$USERA1= <user>
##$USERA2= <user>
##$USERA3= <user>
##$USERA4= <user>
##$USERA5= <user>
##$V9= 5
##$VALIST= <valist>
##$VCLIST= <CCCCCCCCCCCCCCC>
##$VD= 0
##$VDLIST= <DDDDDDDDDDDDDDD>
##$VPLIST= <PPPPPPPPPPPPPPP>
##$VTLIST= <TTTTTTTTTTTTTTT>
##$WBST= 1024
##$WBSW= 4
##$XGAIN= (0..3)
0 0 0 0 
##$XL= 0
##$YL= 0
##$YMAX_a= 387978
##$YMIN_a= -412975
##$ZGOPTNS= <>
##$ZL1= 120
##$ZL2= 120
##$ZL3= 120
##$ZL4= 120
##$ABSF1= 16.522
##$ABSF2= -4.171173
##$ABSG= 5
##$ABSL= 3
##$ALPHA= 0
##$AQORDER= 0
##$ASSFAC= 0
##$ASSFACI= 0
##$ASSFACX= 0
##$ASSWID= 0
##$AUNMP= <proc_1d>
##$AZFE= 0.1
##$AZFW= 0.1
##$BCFW= 0
##$BC_mod= 0
##$BYTORDP= 0
##$COROFFS= 0
##$CY= 12.5
##$DATMOD= 1
##$DC= 0
##$DFILT= <>
##$DTYPP= 0
##$F1P= 14.0000005364418
##$F2P= -0.99999901652339
##$FCOR= 0.5
##$FTSIZE= 32768
##$FT_mod= 6
##$GAMMA= 0
##$GB= 0
##$INTBC= 1
##$INTSCL= 1
##$ISEN= 128
##$LB= 0.3
##$LEV0= 0
##$LPBIN= 0
##$MAXI= 10000
##$MC2= 0
##$MEAN= 0
##$ME_mod= 0
##$MI= 0
##$NCOEF= 0
##$NC_proc= -3
##$NLEV= 6
##$NOISF1= 0
##$NOISF2= 0
##$NSP= 0
##$NTH_PI= 0
##$NZP= 0
##$OFFSET= 16.522
##$PC= 1
##$PHC0= 240.9383
##$PHC1= 6.761546
##$PH_mod= 1
##$PKNL= yes
##$PPARMOD= 0
##$PSCAL= 4
##$PSIGN= 0
##$REVERSE= no
##$SF= 250.13
##$SI= 32768
##$SIGF1= 0
##$SIGF2= 0
##$SINO= 400
##$SIOLD= 32768
##$SREGLST= <1H.DMSO>
##$SSB= 0
##$STSI= 32768
##$STSR= 0
##$SW_p= 5175.98343685301
##$SYMM= 0
##$S_DEV= 0
##$TDeff= 65536
##$TDoff= 0
##$TI= <Analysis number 999999
Compound Code 99
Book Reference 9
Project Code 9>
##$TILT= no
##$TM1= 0
##$TM2= 0
##$TOPLEV= 0
##$USERP1= <user>
##$USERP2= <user>
##$USERP3= <user>
##$USERP4= <user>
##$USERP5= <user>
##$WDW= 1
##$XDIM= 32768
##$YMAX_p= 350602558
##$YMIN_p= -100441
$$ End of Bruker specific parameters
$$ ---------------------------------
##NTUPLES= NMR SPECTRUM
##VAR_NAME=  FREQUENCY,     SPECTRUM/REAL,   SPECTRUM/IMAG
##SYMBOL=    X,             R,               I
##VAR_TYPE=  INDEPENDENT,   DEPENDENT,       DEPENDENT
##VAR_FORM=  AFFN,          ASDF,            ASDF
##VAR_DIM=   32768,         32768,           32768
##UNITS=     HZ,            ARBITRARY UNITS, ARBITRARY UNITS
##FACTOR=    0.157963299565203, 1,           1
##FIRST=     4132.6476996994, 0,             0
##LAST=      -1043.33573715361, 0,           0
##MIN=       -1043.33573715361, -100441,     0
##MAX=       4132.6476996994, 350602558,     0
$$ Real data points
##PAGE= N=1
##DATA TABLE= (X++(R..R)), XYDATA
$$ [...]
7298A0099J458k3831p516N317R241P060j851P302K4332R648k2906j0966l817J2555
$$ 10099 11557 -12274 -19790 -14473 -5232 1828 -23 7279 31611 41259 18353 7387 3570 16125
7284A6125L2144k164k4864J3198j5451M846J3628j1208j9878p796j8140R300K8750
$$ 16125 48269 46105 21241 34439 18988 23834 37462 26254 6376 -1420 -19560 -10260 18490
7271A8490K8645o785J1840j071j8657r574R588j0269k0274k2J129n954q262M3429
$$ 18490 47135 40350 52190 51119 32462 22888 32476 22207 1933 1911 3040 -2914 -11176 32253
7257C2253P039k9640o925k208K141m653p355O055K9422L774M854O936j4460l2790
$$ 32253 39292 9652 2727 519 2660 -1993 -9348 -3293 26129 29903 34757 41693 27233 -5557
7243e557m834R31J6815L3652P227k8760k3422K0020N552p689P372k1367j1034
$$ -5557 -10391 -9460 7355 41007 48234 19474 -3948 16072 21624 13935 21307 -60 -11094
7230a1094J0795j1537p10L415K0663R344m00j3998m489r135o337r580j4984O042
$$ -11094 -299 -11836 -12546 -9131 11532 20876 20476 6478 1989 -7146 -13483 -23063 -38047 -32005
7216c2005J4471J7256n27l2783Q332r128J9201L0360j9354l3395k933K5531J123
$$ -32005 -17534 -278 -805 -33588 -25256 -34384 -15183 15177 -4177 -37572 -40505 -14974 -13851
7203a3851q591K1079N234J9900J8002j2365j7555Q412q304L32N602O825r69J0512
$$ -13851 -22442 -1363 3871 23771 41773 29408 11853 20265 11961 12293 17895 24720 23751 34263
7189C4263n12j1614j191q421j7133J762P276J6976L7576J3792k0964k4259l816
$$ 34263 33751 22137 20946 12525 -4608 -2846 4430 21406 58982 72774 51810 27551 23735
7176B3735R159R526o993q529j8850J1811j2337J0355J1829l250l8174k3418R457
$$ 23735 32894 42420 35427 26898 8048 19859 7522 17877 29706 26456 -11718 -35136 -25679
7163b5679L0659J9954k0386k0113J8374J3709m62k4772j6014N274K5070Q052j1812
$$ -25679 4980 24934 4548 -15565 2809 16518 16056 -8716 -24730 -19456 5614 13666 1854
7150A854k608k419K1035J867k0883J6091K81l980Q30k8861J0231K4364P675j371
$$ 1854 -754 -3173 17862 19729 -1154 14937 15218 11238 12068 -16793 -6562 17802 25477 24106
7136B4106M169K19O285j9654l165j6726J4045J3591q389j2696k6349j6584K4970
$$ 24106 28275 28494 34779 15125 11960 -4766 9279 22870 14481 1785 -24564 -41148 -16178
7123a6178K2065M2843K0195K1891j46l7134j1042J0482q039j5761j2676j3921
$$ -16178 5887 48730 68925 90816 90670 53536 42494 52976 44937 29176 16500 2579
7111B579k5303J2780J8103Q278O523j6167J0054j5447O25m908j1826j4781k6177
$$ 2579 -22724 -9944 8159 16437 22960 6793 16847 1400 2025 -2883 -14709 -29490 -55667
7098e5667J0356L9743J6425k7029Q269Q616n144m1232J6030K8935J9110j2092
$$ -55667 -45311 -5568 10857 -16172 -7903 713 -4431 -45663 -29633 -698 18412 6320
7086F320R855k155k3846k2770O765L7735j3155j1666j2902o1040j561K3931K3080
$$ 6320 16175 14020 -9826 -32596 -25831 11904 -1251 -12917 -25819 -86859 -88420 -64489 -41409
7073d1409J0467K9738L1736K4175k5439k9974o1j0431j3123Q01j4593Q072K0641
$$ -41409 -30942 -1204 30532 54707 29268 -706 -767 -11198 -24321 -23520 -38113 -30041 -9400
7060i400J5343j2051l161J8151Q596j5609j8607k074K7653M163J7403j361O316
$$ -9400 5943 -6108 -9269 8882 17478 1869 -16738 -18812 8841 13004 30407 29046 35362
7047C5362j525j9472j7853l0028q464J2627J3145n242p745k631J6531l97j521
$$ 35362 33837 14365 -3488 -33516 -41980 -29353 -16208 -21450 -29195 -31826 -15295 -15692 -17213
7034a7213K1795K1585q711l9447j5438j5862j5537K3251K210j6093j2244N6245
$$ -17213 4582 26167 17456 -21991 -37429 -53291 -68828 -45577 -43367 -59460 -71704 -15459
7022a5459K3997p683l8684O822R217j4557j3396j9976J5427J8527L5068J5595
$$ -15459 8538 855 -37829 -31007 -21790 -36347 -49743 -69719 -54292 -35765 -697 14898
7010A4898J7547P086k2504j6690K1726K0976P663n089j3438k0189K1103J8780
$$ 14898 32445 39531 17027 337 22063 43039 50702 45613 32175 11986 33089 51869
6998E1869k2061k86m5517J227R890p942q651R577k3535j1152j6722m361L1987
$$ 51869 29808 29522 -15995 -14768 -4878 -12820 -21471 -11894 -35429 -46581 -63303 -67664 -35677
6985c5677J835r84J2774l689L045m007k5975p887q162J7437L8113K308P684r883
$$ -35677 -33842 -34826 -22052 -25741 -22696 -26703 -52678 -60565 -68727 -51290 -13177 -10869 -3185 -13068
6971a3068j2232K0668j909j599m52J0415Q623O008N267K4314k823p701J1609J1406
$$ -13068 -25300 -4632 -6541 -8140 -8592 1823 10446 16454 21721 46035 43212 35511 47120 58526
6957E8526j3296m0634p49M919m020k568o317J305J0143L47M707K0673J062j2786
$$ 58526 45230 4596 3847 8766 4746 2178 -4139 -2834 7309 7656 12363 33036 34098 21312
6943B1312J9235o552r633K1991L3618k2177m6772j3587k1166j184P374P99J2033
$$ 21312 40547 33995 24362 46353 79971 57794 11022 -2565 -23731 -24915 -17541 -16742 -4709
6930d709Q510j9425O18J0941p09P04J0597k8804K9206J9607N267k227l1894L407
$$ -4709 3801 -15624 -15006 -4065 -4774 -4070 6527 -22277 6929 26536 31803 29576 -2318 1089
6916A089l418p686l7396Q565J0184j4927j9768J0732K8945K8664J465n56n723
$$ 1089 -2329 -10015 -47411 -38846 -28662 -43589 -63357 -52625 -23680 4984 6449 5893 170
6903A70k0478k6810M210K0699K4406J2193J2441J1219J6078m264j9658k0327k3612
$$ 170 -20308 -47118 -42908 -22209 2197 14390 26831 38050 54128 49864 30206 9879 -13733
6890a3733j2249Q65M0317l38k5972o983K0631M286J379K055l4334J693J3894n932
$$ -13733 -25982 -25117 15200 14862 -11110 -18093 2538 6824 8203 10258 -24076 -22383 -8489 -14421
6876a4421n589J246r651N482M0831O264j8787J9167Q796r095j5738q412j1936
$$ -14421 -20010 -18764 -28415 -22933 17898 24162 5375 24542 33338 24243 8505 93 -11843
6863a1843M408j8991n554q030J8330K0022J952j0984M742J0092K6520Q856j0615
$$ -11843 -7435 -26426 -31980 -40010 -21680 -1658 294 -10690 -5948 4144 30664 39520 28905
6850B8905o005J9917Q653l3580J1044J778K4892k2208N98m977n621j4512k1311
$$ 28905 22900 42817 51470 17890 28934 30712 55604 33396 33994 29017 23396 8884 -12427
6837a2427J9741L796J1661M342M565j5774r88J1617n479P919o137r641j2944n025
$$ -12427 7314 11110 22771 27113 31678 15904 14916 26533 21054 28973 22836 13195 251 -4774
6823d774k179O631k5314j2107J5515O681Q953N0773J5548o083j1913l738j7633
$$ -4774 -6953 -322 -25636 -37743 -22228 -15547 -6594 44179 59727 53644 41731 37993 20360
6810B0360N28k4409k4020L9899J3790j8327m157L498J8408o068k0443N787q139
$$ 20360 20888 -3521 -27541 12358 26148 7821 3664 7162 25570 19502 -941 4846 -3293
6797c293P161K4641L622J1975j6598k301J7519K911J3590k69k0978k4238K8547
$$ -3293 3868 28509 32131 44106 27508 25207 42726 45637 59227 58958 37980 13742 42289
6784D2289k5979j5559Q770J7645m654j9426j0625p716j187K2220k282m15K1015
$$ 42289 16310 751 9521 27166 22512 3086 -7539 -15255 -16442 5778 3496 3081 24096
6771B4096N748k924k9344K002J2505J0459n935M859N357j8781O428J8733K7170
$$ 24096 29844 26920 -2424 -422 12083 22542 16607 21466 26823 8042 14470 33203 60373
6758F0373K3270j4611k239J1373k0329l0547o770K418J0206j4021J1834P480P223
$$ 60373 83643 69032 66793 78166 57837 27290 20520 22938 33144 19123 30957 38437 45660
6745D5660j7622j1050j748M057J0J1787J3458q539k7569k5661Q799J4542l278
$$ 45660 28038 16988 15240 19297 19307 31094 44552 36013 8444 -17217 -8418 6124 2846
6732B846M205Q542r991j314j0231L123J666J696p082j8801J5873J5530j4667J7599
$$ 2846 7051 15593 5602 4288 -5943 -2820 -1154 542 -6540 -25341 -9468 6062 -8605 8994
6718H994o006J9718J2890J501k375n458J6048J1908m468O863l647J0126j4187
$$ 8994 2988 22706 35596 37097 34722 29264 45312 57220 52752 59615 55968 66094 51907
6705E1907r872J2830k0158K1777k2452j9461m3150k310L626j4075l452M2069L0895
$$ 51907 42035 54865 34707 56484 34032 14571 -28579 -30889 -27263 -41338 -44790 -2721 28174
6692B8174j445k6489r086r22j1403j9482K6866O983o75l800R040K4003p272k4542
$$ 28174 26729 240 -8846 -9768 -21171 -40653 -13787 -6804 -7479 -11279 -2239 21764 14492 -10050
6678a0050Q165M566m1175L488L2233o312l3840J8N3651N2646r82p632j7138l525
$$ -10050 -1885 2681 -38494 -35006 -2773 -9085 -42925 -42907 10744 63390 62408 54776 37638 34113
6664C4113L975j705n070l8054N476K0528P526r458j8068r906L3662J5221L5701
$$ 34113 38088 36383 31313 -6741 -1265 19263 26789 17331 -737 -10643 23019 38240 73941
6651G3941O6071M6736K1810K1259Q605l0416l1163m2264j6737r350l118J735k8613
$$ 73941 140012 186748 208558 229817 238422 208006 176843 134579 117842 108492 105374 107109 78496
6638G8496k9319j5955N431J8493k7704k2158K6559m557j5349J430J6558J3014
$$ 78496 49177 33222 38653 57146 29442 7284 33843 29286 13937 15367 31925 44939
6626D4939j2769J3931K4310j948l0515R963K1001P901l4523r12J0163J823J9136
$$ 44939 32170 46101 70411 68463 37948 47911 68912 76813 42290 41378 51541 53364 72500
6613G2500L2615o24n218L7563N4822L0474O890O9874J55596J95650J65122O300
$$ 72500 105115 104491 99273 136836 191658 222132 229022 298896 454492 650142 815264 821564
6601H21564j26325j69728j41812r7525r2637m8021k6679j8292q070o558m373J4921
$$ 821564 695239 525511 383699 286174 193537 145516 118837 100545 92475 85917 81544 96465
6589I6465k2258l1072p620L954j6935k0077K9661J1816J3377M606M055j1366J3393
$$ 96465 74207 43135 35515 39469 22534 2457 32118 43934 57311 61917 65972 54606 67999
6576F7999n000m6397j7714J0306L7427N0075K7303j5718j5097K28r3J7839O302
$$ 67999 62999 16602 -1112 9194 46621 96696 123999 108281 93184 93412 93319 111158 117460
6563A17460J2638P4414J31589J46514J61358J84420N2359j00530j88583j56424
$$ 117460 130098 204512 336101 482615 643973 828393 880752 780222 591639 435215
6553D35215j35924p5098j8399k9861n4669m1281o691N593n781j9486N729O600
$$ 435215 299291 224193 205794 175933 121264 79983 73292 78885 73104 53618 59347 65947
6541F5947N123K857N906P944j3316k1856l1532J4118Q983K535o738l811M771l317
$$ 65947 71070 73927 79833 87777 74461 52605 21073 35191 44174 46709 39971 36160 40931 37614
6527C7614K1698J4261K2570j2318l7991K7485R820R09j2069K761J3966N649M3412
$$ 37614 59312 73573 96143 83825 45834 73319 83139 84048 71979 74740 88706 94355 137767
6514A37767P0473M3310L071j3608n6774l3702l5184k0142O628r313j5747p351
$$ 137767 208240 251550 254621 241013 184239 150537 115353 95211 101839 92526 76779 69428
6502F9428q873J612r704K4189m069j7522l9154q142L3028M1618k2326j9826Q27
$$ 69428 60555 62167 52463 76652 72583 55061 15907 7765 40793 82411 60085 40259 41086
6489D1086L1175J6388j6081l2570J3714R065j536N962n18m828k0426M1087K3214
$$ 41086 72261 88649 72568 39998 53712 62777 61241 67203 66685 61857 41431 82518 105732
6476A05732k9603l450k0285l9451N343J4792o387J7112J1891m087n332P696l901
$$ 105732 76129 72679 52394 12943 18286 33078 26691 43803 55694 51607 46275 53971 50070
6463E0070j4414J1069J6655K4818N336j5361J670J1462k0346J3442L7733J404
$$ 50070 35656 46725 63380 88198 93534 78173 79843 91305 70959 84401 122134 123538
6451A23538j4072o00N37Q756p207m0590n7668K5906J9522K5101M870M950k3852
$$ 123538 109466 108866 109403 118159 110952 70362 12694 38600 58122 83223 88093 93043 69191
6438F9191q233j6537K8717L7483r028q690k3291o007K3632j202k1643o843J4596
$$ 69191 60958 44421 73138 110621 101593 92903 69612 63605 87237 86035 64392 57549 72145
6425G2145j3920p612k639r500L7583J3814R634K0837r371K343o994j3733K90J7004
$$ 72145 58225 50613 47974 38474 76057 89871 99505 120342 110971 113314 106320 92587 92877 109881
6411A09881O316k9719N704j3080k6163j3675p408m0851k678J9483J6643J6453
$$ 109881 116197 86478 92182 79102 52939 39264 31856 -8995 -11673 7810 24453 40906
6399D0906J1928m679K1430j5673m53L7503L0199K0063o543l1590j2658K5090L873
$$ 40906 52834 48155 69585 53912 53459 90962 121161 141224 134681 103091 90433 115523 119396
6386A19396j5148J0814n231P323P406L042l2437r580l386n928K8294K5950O886
$$ 119396 104248 115062 109831 117154 124560 127602 95165 85585 82199 76271 104565 130515 137401
6373A37401J03P536j7621o222j7014O367J4332o998l4308J4476P076j7389k6569
$$ 137401 137504 145040 127419 121197 104183 110550 124882 117884 83576 98052 105128 87739 61170
6360F1170l3222j1599k0649k834O271j0292O709P128Q750K7937J5500P319J8679
$$ 61170 27948 16349 -4300 -7134 -863 -11155 -4446 2682 11432 39369 54869 62188 80867
6347H0867L4845n972J3659M86P697j6178k1261j6818K0589N653j9152j9844P434
$$ 80867 115712 109740 123399 123885 131582 115404 94143 77325 97914 103567 84415 64571 72005
6334G2005K1387k4382n158j6347J603L3489M7687K7048p469l4253o74k0613r981
$$ 72005 93392 69010 63852 47505 49108 82597 130284 157332 149863 115610 114936 94323 84342
6321H4342J2310q968J590j7315l2064N12R031Q923q649J7503P285L0188L1178
$$ 84342 96652 87684 89274 71959 39895 40407 49438 58361 49712 67215 74500 104688 135866
6308A35866k4081k0741j4359k1m168J6915R687L0970K3327o503l8894J3286r70
$$ 135866 111785 91044 76685 76664 72496 89411 99098 130068 153395 146892 107998 121284 120314
6295A20314L5508L3327j0985k3723p753k6003p306m9982j3171K4844K3303J9475
$$ 120314 155822 189149 178164 154441 146688 120685 113379 63397 50226 75070 98373 117848
6283A17848K9600J6468J0862Q840j4938j8014j9239J2564J1722Q807q353l0268
$$ 117848 147448 163916 174778 183618 168680 150666 131427 143991 155713 164520 156167 125899
6271A25899m5574l6871q495L8944K1537J3280K9944J3113J512J7608J4868l4R995
$$ 125899 80325 43454 34959 73903 95440 108720 138664 151777 153289 170897 185765 185731 195726
6258A95726k461n534K5642L1136j020J1814Q152L3267L61q479k8059r526n182
$$ 195726 193265 187731 213373 244509 243489 255303 263455 296722 297083 288604 260545 251019 245837
6245B45837k6520n6247j5628k875j090K2838J5513l0283O736J5344j4335L5091
$$ 245837 219317 163070 147442 144567 143477 166315 181828 151545 158281 173625 159290 194381
6233A94381K2294K0289R160l0322r932K9974L226k6302j4329N3944L6556L794
$$ 194381 216675 236964 246124 215802 205870 235844 239070 212768 198439 252383 288939 292733
6221B92733J5255J9536L4493N6127N6481L8266L4731L9820L6235K5847N2948M5192
$$ 292733 307988 327524 362017 418144 474625 512891 547622 587442 623677 649524 702472 747664
6209G47664O2405M3748R099M5594O4881P0465P7466O1475O2391P9051O7947J09451
$$ 747664 810069 853817 862916 908510 973391 1043856 1121322 1182797 1245188 1324239 1392186 1501637
6197A501637J05590J95397K90219L81225M35190N68489P05291Q40547J098816
$$ 1501637 1607227 1802624 2092843 2474068 2909258 3477747 4183038 5023585 6122401
6188F122401J570586K331700L565807N565954Q466143J1057111R541721J880789
$$ 6122401 7692987 10024687 13590494 19156448 27622591 38679702 48221423 50102212
6180E0102212o878992j0556644r101782o259961m063532k666856j828159j247382
$$ 50102212 43223220 32666576 23564794 17304833 13241301 10574445 8746286 7498904
6172G498904q82184o97178n79511n14762l85578k43561j92670j80147j35630r6572
$$ 7498904 6616720 5919542 5340031 4825269 4439691 4196130 4003460 3823313 3687683 3591111
6162C591111p8344m3154J6873L8117Q0094J35411J87823J72881J55500K30641
$$ 3591111 3512767 3469613 3486486 3524603 3604697 3740108 3927931 4100812 4256312 4486953
6152D486953L54637N69718Q25145J088714J325272J606709J880291K302242L022307
$$ 4486953 4841590 5411308 6236453 7325167 8650439 10257148 12137439 14439681 17461988
6143A7461988M164194O176542R594345J5303283K4127229L4729403L6593483J4790721
$$ 17461988 21626182 27802724 37397069 52700352 76827581 111556984 148150467 162941188
6135A62941188j8627781l6658778l2831716k1969683j3727017q728373n783366
$$ 162941188 144313407 107654629 74822913 52853230 39126213 30397840 24614474
6128B4614474l981868k843254k234494j936363j704513j370428j045822p86914
$$ 24614474 20632606 17789352 15554858 13618495 11913982 10543554 9497732 8710818
6120H710818o55692o28153n74225m72696l38637k42602j43943p9224M707M2866
$$ 8710818 8055126 7426973 6852748 6380052 6041415 5798813 5654870 5575646 5580353 5623219
6110E623219O3440Q3135J58070L02316M56775P34525R81261J261116J531814J833239
$$ 5623219 5686659 5769794 5927864 6230180 6686955 7421480 8402741 9663857 11195671 13028910
6100A3028910K234259K892179L950439N736533Q852366J4058148K2289449L3094384
$$ 13028910 15263169 18155348 22105787 27842320 36694686 50752834 73042283 106136667
6092A06136667L8503228K1581114j2781710l6129278l5778256k4720312j5423303
$$ 106136667 144639895 166221009 153439299 117310021 81531765 56811453 41388150
6085D1388150r730787o389667m322828l083412k368446k069378j836412j504229
$$ 41388150 31657363 25267696 20944868 17861456 15493010 13423632 11587220 10082991
6077A0082991j173426r16028p74926p45736o52265n53785m43838l16921k83754
$$ 10082991 8909565 7993537 7218611 6472875 5820610 5266825 4822987 4506066 4222312
6068D222312j96194j53159j23418r1592o1666l6726K150M6040J70840K74171L39286
$$ 4222312 4026118 3872959 3749541 3657949 3596283 3559557 3561707 3607747 3778587 4052758 4392044
6057D392044M58974N72767P15971R72225J264029J821169K786758M353142O851399
$$ 4392044 4851018 5423785 6139756 7111981 8376010 10197179 12983937 17337079 24188478
6048B4188478J0075320J1745623P480233k207357j0027746j1383661q668499n666750
$$ 24188478 34263798 46009421 53489654 51282297 41254551 29870890 21202391 15535641
6040A5535641l634708k428834j668138j198649r08424p81002o52791n55220m47413
$$ 15535641 11900933 9472099 7803961 6605312 5696888 4915886 4263095 3707875 3260462
6031C260462l43499l50823l05261k82547k27360j84788j36886j10322p6484r0054
$$ 3260462 2916963 2566140 2260879 1978332 1750972 1566184 1429298 1318976 1242492 1152438
6021A152438q4054r1177p9438l9515l4489o1252n6473m6866k5268j0542p531R211
$$ 1152438 1068384 977207 897769 858254 823765 762513 706040 659174 633906 623364 615833 625044
6009F25044j6238k4709J974j1613n0324n8360j429J90j9734l5851l3485l3352
$$ 625044 608806 584097 586071 574458 524134 465774 464345 464535 444801 408950 375465 342113
5997C42113j1644J2784O880J403l9803m0552j5523M757Q814K8535l676k5396k
$$ 342113 330469 343253 350133 351536 311733 271181 255658 260415 269229 297764 294088 268692 268690
5984B68690l0934l2269n3593k7051Q886j1975O383M678l1726p093M274K5507M477
$$ 268690 237756 205487 151894 124843 133729 121754 128137 132815 101089 93996 98270 123777 128254
5971A28254J6603J3853K5191L7994m553j7587r924J5681o892J447p945J6433K908
$$ 128254 144857 158710 183901 221895 217342 199755 189831 205512 198620 200067 192122 208555 211463
5958B11463k190j38q886k4089o993J915k1362l4738l6397l670j4139O407L0024
$$ 211463 209273 209135 200249 176160 169167 171082 149720 114982 78585 74915 60776 67183 97207
5945I7207L6538Q91L5593K5261j8326q037j5060j9798n2900j2795Q221J9475j4348
$$ 97207 133745 134636 170229 195490 177164 169127 154067 134269 81369 68574 76795 96270 81922
5932H1922j9016j2208j2931P122L2022M0201K6932q850l076j3905j9757l7722
$$ 81922 62906 50698 37767 44889 76911 117112 144044 135194 132118 118213 98456 60734
5920F0734q388L9484K1586j7093R600J6025K298J9633r976k4103k7982K343K4371
$$ 60734 52346 91830 113416 96323 105923 121948 124246 143879 133903 109800 81818 84161 108532
5907A08532J4731k8842k1812k2363K738j1590j3955k0426j0064R188M1696Q079
$$ 108532 123263 94421 72609 50246 52984 41394 27439 7013 -3051 6137 47833 55912
5895E5912P477K585n546m278J0376j4509j8355m051J1564J8403n43L952J1367
$$ 55912 63389 65974 60428 56150 66526 52017 33662 29611 41175 59578 59035 62987 74354
5882G4354n292L9795p669k6419j6504j2224P688p506K271J7185R061K1838K2742
$$ 74354 69062 108857 101188 74769 58265 46041 53729 46223 48494 65679 74740 96578 119320
5869A19320J4147R321k0311k7931j0411k2117J388L923K290N525p575k5145m2715
$$ 119320 133467 142788 122477 94546 84135 62018 63406 67329 69619 75144 67569 42424 -291
5856b91j7498M464n960r269Q556J6425j775J9761K7128L1878J8905j8461j314
$$ -291 -17789 -13325 -19285 -28554 -19998 -3573 -5348 14413 41541 73419 92324 73863 72549
5843G2549k3492m5537J948K7817k1834K239J948N637K0426oJ7565J8575J8461
$$ 72549 49057 3520 5468 33285 11451 13690 15638 21275 41701 41695 59260 77835 96296
5830I6296j1381j7548k0431L2821L1498k7190m2981k3121N976m386l4226N929
$$ 96296 84915 67367 46936 79757 111255 84065 41084 17963 23939 19553 -14673 -8744
5818h744K928J13Q298m778K594l3275j5711l691j7261L2844P539L278K372k751
$$ -8744 -5816 -5703 2595 -2183 411 -32864 -48575 -52266 -69527 -36683 -29144 -25866 -23494 -26245
5804b6245Q169K7206K5738J1650K6228j4068j0012k1183j1554m523j6707O345
$$ -26245 -18076 9130 34868 46518 72746 58678 48666 27483 15929 11406 -5301 1044
5792A044k3089R080L3805K6295J6869R846k9016k6835N863R604J806k1040k6362
$$ 1044 -22045 -12965 20840 47135 64004 73850 44834 17999 23862 33466 35272 14232 -12130
5779a2130N984J3691o152j0302R606m019R054L2786P987m267Q041J7226m1681
$$ -12130 -6146 7545 1393 -8909 697 -3322 5732 38518 46505 42238 50279 67505 25824
5766B5824n3096j2266p397M597K2381J1875n49N503L6428m750k6204J1693J0103
$$ 25824 -27272 -39538 -46935 -42338 -19957 -8082 -8631 -3128 33300 28550 2346 14039 24142
5753B4142j6643j6959n835K2760O019k8081o121J652p105K1007L5167J5285O99
$$ 24142 7499 -9460 -15295 7465 13484 -14597 -20718 -19066 -26171 -5164 30003 45288 45987
5740D5987l343j5217j7716j4453J7518K9223J541J5400R584m1455j5009J355M755
$$ 45987 42644 27427 9711 -4742 12776 41999 43540 58940 68524 27069 12060 13415 18170
5727A8170q737l918j5666K7536P936k3985M515k917J8522K9715J0166N793k1095
$$ 18170 9433 5515 -10151 17385 25321 1336 5851 2934 21456 51171 61337 67130 46035
5714D6035k6955j3504l097K5116M2856O4241N9115L7310k091j8596p4307n2331
$$ 46035 19080 5576 2479 27595 70451 134692 193807 231117 229026 210430 136123 83792
5702H3792j7707Q12n805n256j559M12j6106M494j5758K794N581k2460o866J7068
$$ 83792 66085 66897 61092 55836 54277 54689 38583 43077 27319 30113 35694 13234 6368 23436
5688B3436Q547N090N005p582m462j4994Q109K437q652j937J4369J9296j146j3952
$$ 23436 31983 37073 42078 34496 30034 15040 23149 25586 16934 14997 29366 48662 47516 33564
5674C3564J837J8010K4726K4230L1503J0136J2162J6708O2294O0708Q2329J69120
$$ 33564 35401 53411 78137 102367 133870 144006 156168 172876 235170 295878 378207 547327
5662E47327J88534P7022q1591j60086j59932j19106p5478o2926l8896k4494O948
$$ 547327 735861 812883 731292 571206 411274 292168 216690 153764 114868 90374 97322
5651I7322l592J8397J9276Q655k5109j0921k5436j5113Q683p431O697k4109r337
$$ 97322 93730 112127 131403 140058 114949 104028 78592 63479 72162 64731 71428 47319 37982
5638C7982k2971L1400K8762J9210J4248M552j8283m0688n606N800k5238N422L2596
$$ 37982 15011 46411 75173 94383 108631 113183 94900 54212 48606 54406 29168 34590 67186
5625F7186K5911K7045J1619L4312M1470J02723J03718J54860J62944Q4187m5283
$$ 67186 93097 120142 131761 166073 207543 310266 413984 568844 731788 815975 770692
5614G70692j42537j60648j17280r8504p6320k5355l4730k6058q646J0765m566
$$ 770692 628155 467507 350227 251723 175403 150048 115318 89260 80614 91379 86813
5603H6813Q739M975k5572k6063j4610J6462n864l3586j6690R18K4965K5631L0315
$$ 86813 95552 100527 74955 48892 34282 50744 44880 11294 -5396 -4478 20487 46118 76433
5590G6433k1363l9600Q211K81K94o043J0970J253J4949j794K0525R884n292J0819
$$ 76433 55070 15470 23681 23962 24256 18213 29183 30436 45385 43591 64116 74000 68708 79527
5576G9527K7982j6859K6546N5232P4519L2635m819n2348n2871n8005l1283k5408
$$ 79527 107509 90650 117196 172428 246947 279582 274763 222415 169544 111539 80256 54848
5564E4848k4230o218R918k5248o846Q169J1668j5692l316j1973R106m25j1046
$$ 54848 30618 24400 34318 9070 2224 10393 22061 6369 3053 -8920 186 -239 -11285
5551a1285O109J1130J9632J1339j8480O297l775j1936K8071K017M871M526k2516
$$ -11285 -5176 5954 25586 36925 18445 24742 20967 9031 37102 39119 43990 48516 26000
5538B6000P52j0804k0173K3867r198m956j497j2335r383K6546J3061j0064n494
$$ 26000 26752 15948 -4225 19642 10444 5488 3991 -8344 -17727 8819 21880 11816 6322
5525F322p92J0322J1369N730L304k7413L013k1890q966j1225r376K6840K1822
$$ 6322 5530 15852 27221 32951 36255 8842 11855 -10035 -19001 -30226 -39602 -12762 9060
5512I060l703K3478Q92r236j7370m424J5619j9529q478j4991J655j2013K449J0833
$$ 9060 5357 28835 29727 20491 3121 -1303 14316 -5213 -13691 -28682 -27027 -39040 -36591 -25758
5498b5758K6947j3969J2811Q963k0256j3113J615q737m078J5668J8244K1934j1694
$$ -25758 1189 -12780 31 8994 -11262 -24375 -22760 -31497 -35575 -19907 -1663 20271 8577
5485H577l2655P364J4638j020k1571P368m985o272K5604R414p004J2583j2541
$$ 8577 -24078 -16714 -2076 -3096 -24667 -17299 -22284 -28556 -2952 6462 -542 12041 -500
5472e00j8521r426J2505J7807L2953j1763k5793k6471j7522J0877o932J4875j7190
$$ -500 -19021 -28447 -15942 1865 34818 23055 -2738 -29209 -46731 -35854 -42786 -27911 -45101
5459d5101N696N1401K694l0047N902J7536K4578N667p034j0444m933l078N507
$$ -45101 -39405 11996 14690 -15357 -9455 8081 32659 38326 31292 20848 15915 12837 18344
5446A8344N908r168L961o196j7641J8525o341j6234Q863o950p500q86K725J4034
$$ 18344 24252 15084 19045 12849 -4792 13733 7392 -8842 21 -6929 -14429 -15315 -12590 1444
5432A444N784J1490m771K65m731J1025m973K573J0684K632K8007k4519l816L2032
$$ 1444 7228 18718 13947 14212 9481 20506 15533 18106 28790 31422 59429 34910 31094 63126
5418F3126j1307l5545pl2099k1770J5077O234Q571j42j8076J2923K4894N779j2919
$$ 63126 51819 16274 16267 -15832 -37602 -22525 -16291 -7720 -7862 -25938 -13015 11879 17658 4739
5404D739o370K0366J9302m559k5196K617j348p727o070L723J6060J0364k4505
$$ 4739 -1631 18735 38037 33478 8282 10899 9551 1824 -4246 -523 15537 25901 1396
5391A396r295N779O010Q336j9581j4181j930K2192J6535K4961j6756k0686M599
$$ 1396 -7899 -2120 3890 12226 -7355 -21536 -23466 -1274 15261 40222 23466 2780 7379
5378G379N457j2231J1529q288p700L3230k9738j0275R173R54N705k0743k6757
$$ 7379 12836 605 12134 3846 -3854 29376 -362 -10637 -1464 -510 5195 -15548 -42305
5365d2305L2502n589j6656J5782J5150J2061k0205k3709j949P051o903m469r066
$$ -42305 -9803 -15392 -32048 -16266 -1116 10945 -9260 -32969 -34918 -27867 -34770 -39239 -48305
5352d8305K1508Q238K2155L7673k2475p038j3152j6887k337J334j3964j6123j4412
$$ -48305 -26797 -18559 3596 41269 18794 11756 -1396 -18283 -20620 -19286 -33250 -49373 -63785
5339f3785m26K5996R83j9540j364L4380J0343j6521j8646K2040Q317J7103j4390
$$ -63785 -64211 -38215 -37232 -56772 -58136 -23756 -13413 -29934 -48580 -26540 -18223 -1120 -15510
5326a5510N749Q564J4891K495m058n724l558P274k153M471k1533r121L1716J4448
$$ -15510 -9761 -1197 13694 16189 12131 6407 2849 10123 7970 12441 -9092 -18213 13503 27951
5312B7951j3767k0995o436k1282O508K1797K9659j4787k5215j4789Q258m604m723
$$ 27951 14184 -6811 -13247 -34529 -28021 -6224 23435 8648 -16567 -31356 -23098 -27702 -32425
5299c2425M133J6435K1184J5690l7085n930J3773K4306k3487k9185r041J3051
$$ -32425 -28292 -11857 9327 25017 -12068 -17998 -4225 20081 -3406 -32591 -41632 -28581
5287b8581J9248O18J1058K6614J218n777k7180j1691L875K5521J1623l485l0134
$$ -28581 -9333 -8715 2343 28957 30175 24398 -2782 -14473 -10598 14923 26546 23061 -7073
5274g073l331j8273j1837k5589L9058L0387J6481R282J2694J2956k1621m680O281
$$ -7073 -10404 -28677 -40514 -66103 -27045 3342 19823 29105 41799 54755 33134 28454 34735
5261C4735j3832p750M382M316K9534Q625J271j5848r922k0995k5121j0464J5048
$$ 34735 20903 13153 17535 21851 51385 60010 61281 45433 35511 14516 -10605 -21069 -6021
5248f021J987m213j0311q641L414L86O944l019K532j0515J549L1346K7831j553
$$ -6021 -4034 -8247 -18558 -27199 -23785 -23399 -16455 -19474 -16942 -27457 -25908 5438 33269 31716
5234C1716j0412k4438r478J2056k3696l4932r290J4308J8711J9620p915j0263
$$ 31716 21304 -3134 -12612 -556 -24252 -59184 -68474 -54166 -35455 -15835 -23750 -34013
5222c4013j195J1160L6090J4171M242k5990p666J0828l882o504N941N84j3801
$$ -34013 -35208 -24048 12042 26213 30455 4465 -3201 7627 3745 -2759 3182 3766 -10035
5209a0035P291j4986L442K8305J1892j531r742L149o938j7679k3983k8045O316
$$ -10035 -2744 -17730 -14288 14017 25909 24378 14636 17785 10847 -6832 -30815 -58860 -52544
5196e2544L914L8269N545j5878j1852j3193l2010L2960J6787q493j758p387L278
$$ -52544 -48630 -10361 -4816 -20694 -32546 -45739 -77749 -44789 -28002 -36495 -38253 -45640 -42362
5183d2362j0689K7763J4371J8250j3197j1076K837K8597J4540k5079k790k2868
$$ -42362 -53051 -25288 -10917 7333 -5864 -16940 -14103 14494 29034 3955 1165 -21703
5171b1703l2946r12J5317J7179P562K0576o10J0141J8021l146M814o667j2647
$$ -21703 -54649 -55561 -40244 -23065 -15503 5073 4463 14604 32625 29479 34293 27626 14979
5158A4979q503q773J2059K1161m6712j4767J7512K5323r955k5339O272J0005K1914
$$ 14979 6476 -2297 9762 30923 -15789 -30556 -13044 12279 2324 -23015 -16743 -6738 15176
5145A5176J4432J312o247l84j7637m040k920l393J3431J5288p976J3401J1478
$$ 15176 29608 30920 24673 24289 6652 2612 -308 -3701 9730 25018 17042 30443 41921
5132D1921O793K4895n60j6189p328m796k1932k4562J0308k2688o168J6542J4469
$$ 41921 48714 73609 73049 56860 49532 44736 22804 -1758 8550 -14138 -20306 -3764 10705
5119A0705J2685j2119m277L331k8138j2545O660J8949J3503j6179q035m692J3957
$$ 10705 23390 11271 6994 10325 -17813 -30358 -23698 -4749 8754 -7425 -15460 -20152 -6195
5106f195P620r168O989J1136j5290j0839N419O708K84R938j5438J0191J9899r514
$$ -6195 1425 -7743 -754 10382 -4908 -15747 -10328 -3620 -3336 6602 -8836 1355 21254 11740
5092A1740k6651L0639M657j4480j3388n642k834j0494K397K7982K3409o865j8291
$$ 11740 -14911 15728 20385 5905 -7483 -13125 -15959 -26453 -24056 3926 27335 20470 2179
5079B179j8215M534q166j0246o196Q868k1202j2981K5060N2068O367j0973L1980
$$ 2179 -16036 -11502 -19668 -29914 -36110 -27242 -48444 -61425 -36365 15703 22070 11097 43077
5066D3077L000m2892k906M420J9254Q368j7189j0024J8923J591J2249L3419K1232
$$ 43077 46077 3185 279 4699 23953 32321 15132 5108 24031 25622 37871 71290 92522
5053I2522P079j6618o340J6862K2672j0598l5204n574J0502J1391j8391l2610
$$ 92522 99601 82983 76643 93505 116177 105579 70375 64801 75303 86694 68303 35693
5041C5693k8184k988J2163j7088r276K3574K1144m330j9262r234M493K626j2529
$$ 35693 7509 4521 16684 -404 -9680 13894 35038 30708 11446 2212 6705 9331 -3198
5028c198j8316l416O210j0542K8503L8983Q191j583p51R651k432j4590k4547J1365
$$ -3198 -21514 -24930 -18720 -29262 -759 38224 46415 44832 44081 53732 51300 36710 12163 23528
5014B3528R248J2981j6115K142L451J0446M650j5966j7912p193J6894j554j9897
$$ 23528 32776 45757 29642 31784 35235 45681 50331 34365 16453 9260 26154 24600 4703
5001D703L282K262q132o119J3223j1851J841n023r37J7463J5848K7712K658j972
$$ 4703 7985 10247 2115 -4004 9219 -2632 -791 -5814 -6751 10712 26560 54272 56930 54958
4987E4958o224j0258m683L75k3293j3446p766j652K9455J4391J4483R115j1908
$$ 54958 48734 38476 33793 34168 10875 -2571 -10337 -11989 17466 31857 46340 55455 43547
4974D3547R184r60k8316J5132M618k307l7678k2794N866N67L305L1067J8529J0183
$$ 43547 52731 51771 23455 38587 43205 40898 3220 -19574 -13708 -13141 -9836 21231 39760 49943
4960D9943J3840l189r811j1331p732j712J758l3635l620K2104J8050M837l769
$$ 49943 63783 60594 50783 39452 31720 30008 31766 -1869 -5489 16615 34665 39502 35733
4947C5733l3054k9457J848m506Q918J7283K9917O694k7435k3303o372J1061J2420
$$ 35733 2679 -26778 -24930 -29436 -20518 -3235 26682 33376 5941 -17362 -23734 -12673 -253
4934b53k2031j434N1800J3796n1419m199j8472j2889O803K3816J5201M370o583
$$ -253 -22284 -23718 28082 41878 -9541 -13740 -32212 -45101 -38298 -14482 719 5089 -1494
4921a494k6047j6744L6899O235q253j2281j2061m271K6899P718n260K8986j816
$$ -1494 -27541 -44285 -7386 -1151 -9404 -21685 -33746 -38017 -11118 -3400 -8660 20326 18510
4908A8510o652p079k1726k1714J352J4513P117P469j2484j7025l6581j3049J8534
$$ 18510 11858 4779 -16947 -38661 -37309 -22796 -15679 -8210 -20694 -37719 -74300 -87349 -68815
4895f8815J9168k975L221j4708K1902L0725p430K01J3153K4158J8771q82p302
$$ -68815 -49647 -52622 -49401 -64109 -42207 -11482 -18912 -18711 -5558 18600 37371 36489 29187
4882B9187p468j6875k1796M809K2944P879J5149j9660k1448j9601j2141k2416
$$ 29187 21719 4844 -16952 -12143 10801 18680 33829 14169 -7279 -26880 -39021 -61437
4870f1437j3802J0875J0069k4505r623J1033K0745N0485J2160P905K9391J3435
$$ -61437 -75239 -64364 -54295 -78800 -88423 -77390 -56645 -6160 6000 13905 43296 56731
4858E6731l7694l2868K2J6218R776k1916o420Q203p712J3329q180j1969j7123
$$ 56731 19037 -13831 -13809 2409 12185 -9731 -16151 -7948 -15660 -2331 -10511 -22480 -39603
4845c9603K6405J8390r412k4839L1955P010J4096m494j0596j4063n521j7636N592
$$ -39603 -13198 5192 -4220 -29059 2896 9906 24002 19508 8912 -5151 -10672 -28308 -22716
4832b2716K6952m650O69n971R271J8638o392J700J540k0426j6180O440r195j1791
$$ -22716 4236 -414 255 -5716 3555 22193 15801 17501 19041 -1385 -17565 -11125 -20320 -32111
4818c2111J2782N274k7084K9794M0733n738j0224k5931l5298K2605K1264r914
$$ -32111 -19329 -14055 -41139 -11345 29388 23650 13426 -12505 -47803 -25198 -3934 -13848
4806a3848j2567k3575J828K7938L927K3135J7627J3707j3180P230k936m4022j2477
$$ -13848 -26415 -49990 -48162 -20224 -16297 6838 24465 38172 24992 32222 29286 -14736 -27213
4793b7213M295p82R089J2428l397k1469K9676L5643n477j7687N458M4393l4746
$$ -27213 -22918 -23700 -14611 -2183 -5580 -27049 2627 38270 32793 15106 20564 64957 30211
4780C0211l5120j307R17k676J6839j627k6706J4441L3725j0574j1179j7107l4960
$$ 30211 -4909 -6216 -5299 -7975 8864 7237 -19469 -5028 28697 18123 6944 -10163 -45123
4767d5123j5317L614K7019K4492l005p005M476K3102n159p216k5510j4491J0333
$$ -45123 -60440 -56826 -29807 -5315 -8320 -15325 -10849 12253 7094 -122 -25632 -40123 -29790
4754b9790J2928k997J3496j5866j7546M656K0117J8762J6602N463j9410n681m606
$$ -29790 -16862 -19859 -6363 -22229 -39775 -35119 -15002 3760 20362 25825 6415 734 -3872
4741c872l7451k2209Q468K2260J202j0431j8351L4584L8151J7805k1933k008N999
$$ -3872 -41323 -63532 -55064 -32804 -31602 -42033 -60384 -25800 12351 30156 8223 6215 12214
4728A2214k2387k665o08n459o231L2954J587l485p309J7345K5752n228l1383k2796
$$ 12214 -10173 -12838 -13446 -18905 -25136 7818 9405 5920 -1389 15956 41708 36480 5097 -17699
4714a7699Q418m497j8484J6163J9224J1795j3551o305j1139k6153Q78J9194r93
$$ -17699 -9281 -13778 -32262 -16099 3125 14920 1369 -4936 -16075 -42228 -41350 -22156 -23149
4701b3149m0694L527k341L4999L1881M3382j0992j6648k31O271j687n788k2231
$$ -23149 -63843 -60316 -62657 -27658 4223 47605 36613 19965 19734 26005 24318 18530 -3701
4688c701k8467L520J655J1218L6016J4065j6754j9709Q585J3046k731m61J1791
$$ -3701 -32168 -28648 -26993 -15775 20241 34306 17552 -2157 6428 19474 16743 16282 28073
4675B8073j2626l4787Q372J1342J6741M169j0865J3581K2969J1373k4062j3441
$$ 28073 15447 -19340 -10968 374 17115 21284 10419 24000 46969 58342 34280 20839
4663B0839J98k3964k7727J5147L5448k185j2559n663Q220j5229K35M0929K502
$$ 20839 21037 -2927 -30654 -15507 19941 17756 5197 -466 7754 -7475 -7240 33689 36191
4650C6191o335l0852l8577J3426M1495j3812J260j0256M683O713L944k2231r046
$$ 36191 29856 -996 -39573 -26147 15348 1536 2796 -7460 -2777 3936 7880 -14351 -23397
4637b3397J5373J3080J1625k2410K217K7500l888j7173k2537k662K375J8898R647
$$ -23397 -8024 5056 16681 -5729 -3512 23988 20100 2927 -19610 -22272 -19897 -999 8648
4624H648J3402p76j3821n474r851J5215J5810j3319K529j1194j5404K458m169
$$ 8648 22050 21274 7453 1979 -7872 7343 23153 9834 12363 1169 -14235 -11777 -15946
4611a5946l920O206k3948J1954K9219K4736j5651k5180k3183K7L0107L4205j2663
$$ -15946 -19866 -13660 -37608 -25654 3565 28301 12650 -12530 -35713 -35686 -5579 28626 15963
4598A5963j3259N231l373p779r467J5027j744p085K0620K200j462J0728j4891
$$ 15963 2704 7935 4562 -3217 -12684 2343 599 -6486 14134 16334 14872 25600 10709
4585A0709m5124r422K276O838K802K3989j0292J9916J1685j5832m243j7132o150
$$ 10709 -34415 -43837 -41561 -34723 -31921 -7932 -18224 1692 13377 -2455 -6698 -23830 -29980
4572b9980r190L708j6734N075L0648K0478j238n972R923p078j5882J7243k669
$$ -29980 -39170 -35462 -52196 -47121 -16473 4005 2767 -3205 6718 -360 -16242 1001 -1668
4559a668k576q068q331k0361k3903K7101Q29j6496K3388M676k1252q52L7688o568
$$ -1668 -4244 -12312 -20643 -41004 -64907 -37806 -36977 -53473 -30085 -25409 -46661 -47513 -9825 -16393
4545a6393j8020j1759K892K5139J1658j9395J2146j2819m409K7669N341J3946
$$ -16393 -34413 -46172 -43280 -18141 -6483 -25878 -13732 -26551 -30960 -3291 2050 15996
4533A5996J6079J9579l244j0660k2760j3106o796J5776K8768r926j1580l0922
$$ 15996 32075 51654 48410 37750 14990 1884 -4912 10864 39632 29706 18126 -12796
4521a2796j1632J229j537R745N581l838K952J3802L6002J2518J0305k4606l7011
$$ -12796 -24428 -23199 -24736 -14991 -9410 -13248 -10296 3506 39508 52026 62331 37725 714
4508G14m0159o291J1341k4587j5810K2968L7239J056Q958J5486p334k0763l1045
$$ 714 -39445 -45736 -34395 -58982 -74792 -51824 -14585 -13529 -4571 10915 3581 -17182 -48227
4495d8227K431q609M0912M226j0848M414J4279j0193R449P182K7292K0237j9031
$$ -48227 -45796 -54405 -13493 -9267 -20115 -15701 -1422 -11615 -2166 5016 32308 52545 33514
4482C3514l7154j095r000j0887K00j34J9597P95J5053L25j8172L91p670j8788
$$ 33514 -3640 -4735 -13735 -24622 -24422 -24556 -4959 -4164 10889 11214 -6958 -6567 -14237 -33025
4468c3025J9367L941K1043L032q31K640j2790k4466j4682J4228K1170N024J4582
$$ -33025 -13658 -9717 11326 14358 13527 16167 3377 -21089 -35771 -21543 -373 4651 19233
4455A9233j3953l3095m888J647j4587q966o070K1155J5247p577o009K1191J9098
$$ 19233 5280 -27815 -32703 -31056 -45643 -54609 -60679 -39524 -24277 -31854 -37863 -16672 2426
4442B426J3000j8865k4805L027J8566r708P928M2458j0977j0608j7999l035J1410
$$ 2426 15426 -3439 -28244 -25217 -6651 -16359 -8431 34027 23050 12442 -5557 -8592 2818
4429B818P377j061k4232k4038q922L8229K2109j7777k3788n398J4504Q539j8615
$$ 2818 10195 9134 -15098 -39136 -48058 -9829 12280 -5497 -29285 -34683 -20179 -11640 -30255
4416c0255K222J3725K8374R88q828J782q188n243J2187J0749J9372j9641k2300
$$ -30255 -28033 -14308 14066 15054 6226 8008 -180 -5423 6764 17513 36885 17244 -5056
4403e056q711q636J3698K687J9903K4634l5471k6666o350R384L1128K8379k37
$$ -5056 -13767 -22403 -8705 -6018 13885 38519 3048 -23618 -29968 -20584 10544 38923 38686
4390C8686K2128j7102k8585l379K018Q93K0958J2005L871j1277r616k1730l7753
$$ 38686 60814 43712 15127 11748 13766 14659 35617 47622 51493 40216 30600 8870 -28883
4377b8883N013j7786k1075J4183l595L789O360K1154O24q321K4788o64P639p225
$$ -28883 -23870 -41656 -62731 -48548 -52143 -48354 -41994 -20840 -20216 -28537 -3749 -4413 3226 -3999
4363c999R283m406j1749K5406J5266k0157k2741j0142J6744K1407J4427j5441
$$ -3999 5284 878 -10871 14535 29801 9644 -13097 -23239 -6495 14912 29339 13898
4351A3898j4919N297L064j885k3628q66p365j2984K1832N65J727J3394l140j4254
$$ 13898 -1021 4276 7340 5455 -18173 -19039 -26404 -39388 -17556 -16991 -15264 -1870 -5010 -19264
4337a9264M3998R700j7389J4224j6017m5429j5067K2679L4658L0907r667j1376
$$ -19264 24734 34434 17045 31269 15252 -30177 -45244 -22565 12093 43000 33333 21957
4325B1957K7102k4296k8579j631R297J1568j9509j9558N183L612n507k9078K4452
$$ 21957 49059 24763 -3816 -5447 3850 15418 -4091 -23649 -18466 -14854 -20361 -49439 -24987
4312b4987M2668J4952J836m396O899o274j8720j4171k515J1537q103P019l127
$$ -24987 17681 32633 34469 30073 36972 30698 11978 -2193 -4708 6829 -1274 5745 2618
4299B618k0303O696K1461l853l2655J5691J7771M075o376L4404L796n626k8518
$$ 2618 -17685 -10989 10472 6619 -26036 -10345 7426 11501 5125 39529 43325 37699 9181
4286I181j5116J3759l162J2188J8978j147m3936j8601j0776K531K7547J5075Q884
$$ 9181 -5935 7824 4662 16850 35828 34681 -9255 -27856 -38632 -36101 -8554 6521 15405
4273A5405k7244M063P614J2894O609l4033n354N173m668N521J526L6961L976r283
$$ 15405 -11839 -7776 -162 12732 19341 -14692 -20046 -14873 -19541 -14020 -12494 24467 28443 19160
4259A9160l2331j8295K540P586N555n557P039J0042L467k4595j9234M213Q125
$$ 19160 -13171 -31466 -28926 -21340 -15785 -21342 -14303 -4261 -794 -25389 -44623 -40410 -32285
4246c2285K8097j1600n497l703Q363j4386m551l516J9873o136K0572o277n404
$$ -32285 -4188 -15788 -21285 -24988 -16625 -31011 -35562 -39078 -19205 -25341 -4769 -11046 -16450
4233a6450M837R820k0048k402J1909K5204Q044q654p349J5827p893k1807P15J091
$$ -16450 -11613 -1793 -21841 -24243 -12334 12870 20914 12260 4911 20738 12845 -8962 -8247 -7156
4219g156k4181k716M1085k309l147L38j2473j1579q232K9731J5161p875J0571
$$ -7156 -31337 -34053 7032 4723 1576 1914 -10559 -22138 -30370 -639 14522 6647 17218
4206A7218o894k8689m45n796l8828k9760m943L7951L8957j1223m8516R526J8870
$$ 17218 10324 -18365 -18810 -24606 -63434 -93194 -98137 -60186 -21229 -32452 -80968 -71442 -52572
4193e2572J1028K0216Q752k6961l865Q098J7948M1357k0482j8928j8869q016k8061
$$ -52572 -41544 -21328 -12576 -39537 -43402 -35304 -17356 24001 3519 -15409 -34278 -42294 -70355
4180g0355Q881J6762J5645O968O001j7950K2414j5540l050L1279L1495P170J794
$$ -70355 -61474 -44712 -29067 -22099 -16098 -34048 -11634 -27174 -30224 1055 32550 39720 41514
4167D1514j464M13k5662j72N56m98j0706k2280q236L717K7575K1620j4942J4740
$$ 41514 40050 40463 14801 14629 15185 14687 3981 -18299 -26535 -22818 4757 26377 11435 26175
4153B6175K5819O591Q183k7588l1560j430O703j1483m2922l3332L6032M7756q766
$$ 26175 51994 58585 66768 39180 7620 6190 12893 1410 -41512 -74844 -38812 8944 178
4140A78o582N657M758l4688l5083K2895K6739j1690J141J708J0370J2426K1051
$$ 178 -6404 -747 4011 -30677 -65760 -42865 -16126 -27816 -26675 -24967 -14597 -2171 18880
4127A8880m286j7502j3520J8097J2883n857J6242k2888j413J7563r260Q071K8900
$$ 18880 14594 -2908 -16428 1669 14552 8695 24937 2049 636 18199 8939 17010 45910
4114D5910R797k0142j4933j9451O275Q496Q296K4344j5039j1685K657o964O321
$$ 45910 55707 35565 20632 1181 7456 15952 24248 48592 33553 21868 24525 17561 23882
4101B3882j0036l234j7443j5564Q711l637k407o012m29K4416J8959n641j9417
$$ 23882 13846 10612 -6831 -22395 -13684 -17321 -19728 -25740 -26169 -1753 17206 11565 -7852
4088g852l774O385j1203j2175J8384J1054J2260j7154q074q77k1840j040L0358
$$ -7852 -11626 -5241 -16444 -28619 -10235 819 13079 -4075 -12149 -13026 -34866 -35906 -5548
4075e548K8124j4094k1204k9297M50N260R804k93Q65J29j521K33K0156L504j0232
$$ -5548 22576 8482 -12722 -42019 -41569 -36309 -26505 -26798 -25933 -25804 -27325 -27092 -6936 -3432 -13664
4060a3664q754k4963K0469J4172j4291L731J5529m795P913M009J124K3577O786
$$ -13664 -22418 -47381 -26912 -12740 -27031 -23300 -7771 -12566 -4653 -644 480 24057 30843
4047C0843r803K997L235r2k3214k2925j5648R333K6561O818K4191k8077l1184
$$ 30843 21040 24037 27272 27180 3966 -18959 -34607 -25274 1287 8105 32296 4219 -26965
4034b6965J6617N0816k4086R233J5807k3907k8714l130J9053P552P455j7905J5980
$$ -26965 -10348 40468 16382 25615 41422 17515 -11199 -14329 4724 12276 19731 1826 17806
4021A7806K3949o110m600l528l4767k2310Q705m230R118J2363M108J6332k1581
$$ 17806 41755 35645 31045 27517 -7250 -29560 -20855 -25085 -15967 -3604 504 16836 -4745
4008d745k3819M322P448n418J660K0544K6197P747k5031l0463j4953r19N036L487
$$ -4745 -28564 -24242 -16794 -22212 -20552 -8 26189 33936 8905 -21558 -36511 -37430 -32394 -28907
3994b8907J8889J3979k0897J0285K3589M825q378L495r119J410J1815R005j0297
$$ -28907 -10018 3961 -16936 -6651 16938 21763 13385 16880 7761 9171 20986 29991 19694
3981A9694r764k3840m187j8142n787L025j8724J3587n454j3111j6869O985K8343
$$ 19694 9930 -13910 -18097 -36239 -42026 -39001 -57725 -44138 -49592 -62703 -79572 -72587 -44244
3968d4244K4335p381k019M571J1212k3600n0828m149L2482L185Q685J0103k9956
$$ -44244 -19909 -27290 -29309 -24738 -13526 -37126 -87954 -92103 -59621 -56436 -47751 -37648 -67604
3955f7604l160J1847M4919M517j0733j334j5969J9608O200j214l946j8511J4628
$$ -67604 -70764 -58917 -13998 -9481 -20214 -21548 -37517 -17909 -11709 -12923 -16869 -35380 -20752
3942b0752J6502R775n756L274m55j8632O824q947j5067n21P969J8332K67J9697
$$ -20752 -4250 5525 -231 3043 2588 -16044 -9220 -18167 -33234 -33755 -25786 -7454 -7187 12510
3928A2510k3877k6302j6563K0754K8105p622r91K7930k6419n0593m026K0448m438
$$ 12510 -11367 -37669 -54232 -33478 -5373 -12995 -13986 13944 -12475 -63068 -67094 -46646 -51084
3915e1084j890M1367P965L1637J1958k2592Q076K9106o498j5699j2333l1314j4235
$$ -51084 -52974 -11607 -3642 27995 39953 17361 25437 54543 48045 32346 20013 -11301 -25536
3902b5536K3793L8970J7800k1917o836l905l2324q726j3367L87L4321J7164R478
$$ -25536 -1743 37227 55027 33110 26274 22369 -9955 -18681 -32048 -31661 2660 19824 29302
3889B9302j7166j1724M881K0999l715j6870l222j334l346j406j8185J7072k570
$$ 29302 12136 412 5293 26292 22577 5707 2485 1151 -2195 -3601 -21786 -4714 -7284
3876g284l0653r594Q883Q036L1546J3872k784k6700j6398N089j2602r4Q607n252
$$ -7284 -37937 -47531 -38648 -30612 934 14806 12022 -14678 -31076 -25987 -38589 -38683 -30076 -35328
3862c5328R789N327K0556K9061j7013k5463O69m711K0026L6459P069k284j1727
$$ -35328 -25539 -20212 344 29405 12392 -13071 -12402 -17113 2913 39372 46441 44157 32430
3849C2430j2260k7991j3541p294J7310k644j5903j5291L134L7318L5174R493j9158
$$ 32430 20170 -7821 -21362 -28656 -11346 -13990 -29893 -45184 -42050 -4732 30442 39935 20777
3836B0777j2716J2414k888m5403k4623P863J6413R583o49L112j3231l3057L4251
$$ 20777 8061 20475 17587 -27816 -52439 -44576 -28163 -18580 -19229 -16117 -29348 -62405 -28154
3823b8154N463J512q364J800R272K3966J5072K224m477J2051k3085j2369j5528
$$ -28154 -22691 -21179 -29543 -27743 -18471 5495 20567 22791 18314 30365 7280 -5089 -20617
3810b0617o138j0825j1713j930M808N331n71n872K7739m97L024k85j5590J9122
$$ -20617 -26755 -37580 -49293 -51223 -46415 -41084 -41655 -47527 -19788 -20285 -17261 -17546 -33136 -14014
3796a4014n891r841J4698m698M017J3740N073J0898j7672k5538j4360J1385K8709
$$ -14014 -19905 -29746 -15048 -19746 -15729 -1989 3084 13982 -3690 -29228 -43588 -32203 -3494
3783c494M3338L2437k1460k5499j4326M810J059r859J5255p524L903r521L109
$$ -3494 39844 72281 50821 25322 10996 15806 16865 7006 22261 14737 18640 9119 12228
3770A2228J5952J5203k3431k8413k4390Q895j0116O467J8342J1971q336m0245
$$ 12228 28180 43383 19952 -8461 -32851 -23956 -34072 -27605 -9263 2708 -5628 -45873
3758d5873J9167K1986q617r531j9319J9361M4357l426O466j6446p366K2838L329
$$ -45873 -26706 -4720 -13337 -22868 -42187 -22826 21531 18105 24571 8125 759 23597 26926
3745B6926j8351k2317J2251M020l705M463j004o868N429J1457L004k3389m56O743
$$ 26926 8575 -13742 -1491 2529 -1176 3287 2283 -4585 844 12301 15305 -8084 -8540 -1797
3731a797K0436m22k0066j4901M314Q588r976k6647K017Q683o801j0652J2778L757
$$ -1797 18639 18217 -1849 -16750 -12436 -3848 -13824 -40471 -38454 -29771 -36572 -47224 -34446 -30689
3717c0689P229R915J3179J8612k214J6712l1392J25l668j2225J0912n205j3422
$$ -30689 -23460 -13545 -366 18246 16032 32744 1352 1477 -2191 -14416 -3504 -8709 -22131
3704b2131p762N541l445q73J1226K8605J1429R708j2572J3380J242M7l0108j9956
$$ -22131 -29893 -24352 -27797 -28670 -17444 11161 22590 32298 19726 33106 34348 34395 4287 -15669
3690a5669Q543J6015N036n387r821l6241k4720K5235N376k1804M905J5075J4268
$$ -15669 -7126 8889 13925 8538 -1283 -37524 -62244 -37009 -31633 -53437 -48532 -33457 -19189
3677a9189O149p403K6364J4533k490k3883j3372l8224J5279J2540k380L761k590
$$ -19189 -13040 -20443 5921 20454 17964 -5919 -19291 -57515 -42236 -29696 -32076 -28315 -30905
3664c0905M375j790J6227j1084K0904J0673k1936j8315K2171N175k342J1368k7864
$$ -30905 -26530 -28320 -12093 -23177 -2273 8400 -13536 -31851 -9680 -4505 -6847 4521 -23343
3651b3343J2312k5391j3186L4291N419j5544R23J1231K4995j1106j2408K1795
$$ -23343 -11031 -36422 -49608 -15317 -9898 -25442 -24519 -13288 11707 601 -11807 9988
3639I988l103j7337L9116L1087m740j0833P779O531l0932l4520M779K2929J8362
$$ 9988 6885 -10452 28664 59751 55011 44178 51957 58488 27556 -6964 -2185 20744 39106
3626C9106J557l8580J6397k3293j2607j3787l446l908j852j6986m719M1121M3003
$$ 39106 40663 2083 18480 -4813 -17420 -31207 -34653 -38561 -40413 -57399 -62118 -20997 22006
3613B2006q426m927M867J6362k5308o767J7225Q118k3022k4072K959K0936m933
$$ 22006 13580 8653 13520 29882 4574 -2193 15032 23150 128 -23944 -20985 -49 -4982
3600d982L930j683N298k6854j9059k751l663J0648Q546J8976J509k1811P470j0447
$$ -4982 -1052 -2735 2563 -24291 -43350 -46101 -49764 -39116 -30570 -11594 -10085 -31896 -24426 -34873
3586c4873j5701qL2776J7154M245L69L586K5125L537J5917k0840j6415R587J944
$$ -34873 -50574 -50582 -17806 -652 3593 3962 7548 32673 36210 52127 31287 14872 24459 26403
3572B6403J6192K0099j0071m1140m4828L275J0713j5643j926J0706k6160N775
$$ 26403 42595 62694 52623 11483 -33345 -30070 -19357 -35000 -36926 -26220 -52380 -46605
3560d6605K1362K0432n733k538O445k0012l43k035J700K0240j1699l660j240J1576
$$ -46605 -25243 -4811 -10544 -13082 -6637 -26649 -26992 -29027 -27327 -7087 -18786 -22446 -23686 -12110
3546a2110M4101k973l3561o01J7047j2137J3905R308J4706k2893n870k7857k3066
$$ -12110 31991 29018 -4543 -5144 11903 -234 13671 22979 37685 14792 8922 -18935 -42001
3533d2001n319K0810J4022j2021J515M027O017Q566j386m362J3847j5577J0288
$$ -42001 -47320 -26510 -12488 -24509 -22994 -18967 -12950 -4384 -5770 -10132 3715 -11862 -1574
3520a574K7974j0137k1802l2793n941K7908K482k3671J3447J4036M1893L949k9736
$$ -1574 26400 16263 -5539 -38332 -44273 -16365 -13883 -37554 -24107 -10071 31822 35771 6035
3507F035N007K2707k4526j1135l0652J3629j8683J128M7423K1285j7286J3611
$$ 6035 11042 33749 9223 -1912 -32564 -18935 -37618 -36490 10933 32218 14932 28543
3495B8543J2697O804j9601o422k871k3268N922J2272K7395J136l0378R999j5110
$$ 28543 41240 48044 28443 22021 19150 -4118 1804 14076 41471 42607 12229 22228 7118
3482G118j3087j6257J6827K7936K751l4978p513j3867j2607J5217K6063R369Q378
$$ 7118 -5969 -22226 -5399 22537 25288 -9690 -17203 -31070 -43677 -28460 -2397 6972 15350
3469A5350K6338k4835j0423j1171r790r275l983J5466k0235J0226J6045k0922
$$ 15350 41688 16853 6430 -4741 -14531 -23806 -27789 -12323 -32558 -22332 -6287 -27209
3457b7209j1148J2563j5663J9550J4075k5805L5302K2372l2806k9383m679J6769
$$ -27209 -38357 -25794 -41457 -21907 -7832 -33637 1665 24037 -8769 -38152 -42831 -26062
3445b6062L0267K9418l8472j9619N318J4198K6407k583k0459J504p919J507K2613
$$ -26062 4205 33623 -4849 -24468 -19150 -4952 21455 18872 -1587 -83 -8002 -6495 16118
3432A6118k456l275l500J3171j9515l7502r333m664J3678K489M358O029K0084
$$ 16118 13662 10387 6887 20058 543 -36959 -46292 -50956 -37278 -34789 -30431 -24402 -4318
3419d318l64k2881R32J8647K2091J5278R929q722k0952P653q241p638p868J7351
$$ -4318 -4682 -27563 -26631 -7984 14107 29385 39314 30592 9640 17293 9052 1414 -6454 10897
3405A0897N965o698Q807k4399k7706J5646O893n178p608K1767o019k4785j5686
$$ 10897 16862 10164 18971 -5428 -33134 -17488 -10595 -15773 -23381 -1614 -7633 -32418 -48104
3392d8104j6081J2588K752J8848J7994P42k2686k3139j4941J8771L5039J3717
$$ -48104 -64185 -51597 -48845 -29997 -12003 -11261 -33947 -57086 -72027 -53256 -18217 -4500
3380d500N514k7804k5334r972J686r667J9646J6391J9340K3266q315j8288j2986
$$ -4500 1014 -26790 -52124 -62096 -60410 -70077 -50431 -34040 -14700 8566 251 -18037 -31023
3367c1023k1752J7501K4127Q596L655j7864l627J3192N69Q964N264J7540q222
$$ -31023 -52775 -35274 -11147 -2551 1104 -16760 -20387 -7195 -6626 2338 7602 25142 16920
3354A6920j0296k9410N74P402l753j7061O069J8669J8895J8521L5067n807r24
$$ 16920 6624 -22786 -22212 -14810 -18563 -35624 -29555 -10886 8009 26530 61597 55790 54866
3341E4866k1140n9423q032J9083J2739J7030p061m000k0156N827L698L934Q503
$$ 54866 33726 -25697 -33729 -14646 -1907 15123 8062 4062 -16094 -10267 -6569 -2635 5868
3328E868R404J2814M220o464k3928Q634P151L791j588k9766l2175l973p67O327
$$ 5868 15272 28086 32306 25842 1914 10548 17699 21490 19902 -9864 -42039 -46012 -46779 -40452
3314d0452L6031R064K236p448q24q638r770K1768o642P42k2095J5341K2422r188
$$ -40452 -4421 4643 6879 -569 -1393 -10031 -19801 1967 -4675 -3933 -26028 -10687 11735 2547
3300B547r694M275O191Q206n389k800J6718O895Q142J7651m367k6797j2457J711
$$ 2547 -7147 -2872 3319 11525 6136 3336 20054 26949 35091 52742 48375 21578 9121 10832
3286A0832o053k029M436J6662j6400j3607R23N544p2j2354L799n340m3795l0367
$$ 10832 4779 2750 7186 23848 7448 -6159 -5236 308 236 -12118 -8319 -13659 -57454 -87821
3272h7821p948L8410J9480M374K1822P13l518L5234j0965k1403J6952j1571j7108
$$ -87821 -95769 -57359 -37879 -33505 -11683 -10970 -14488 20746 9781 -11622 5330 -6241 -23349
3259b3349P326j0012P257J0305j8155K3109J9861p422j9935r814j7588j2516j3193
$$ -23349 -16023 -26035 -18778 -8473 -26628 -3519 16342 8920 -11015 -20829 -38417 -50933 -64126
3246f4126n918p558K517L2814J2226J6655p651j8029L690J2864J4025m328m483
$$ -64126 -70044 -77602 -75085 -42271 -30045 -13390 -21041 -39070 -35380 -22516 -8491 -12819 -17302
3233a7302p284K8094K4202j1760q641J2368J3210j7518k5288J0687l432j0592
$$ -17302 -24586 3508 27710 15950 7309 19677 32887 15369 -9919 768 -2664 -13256
3221a3256J5708j2754j5197q079O590J0005Q281r491k1376k8043n019L5437M2619
$$ -13256 2452 -10302 -25499 -33578 -26988 -16983 -8702 -18193 -39569 -67612 -72631 -37194 5425
3208E425N287k3598P668J3823p678k8327q785K3470j3603r200J7545L5182Q864
$$ 5425 10712 -12886 -5218 8605 927 -27400 -36185 -12715 -26318 -35518 -17973 17209 26073
3195B6073q528R037J5828J0477k2858k1285l1655r457k115K0585M6671K1961J3778
$$ 26073 17545 26582 42410 52887 30029 8744 -22911 -32368 -34483 -13898 32773 54734 68512
3182F8512k0620m4511k1226l762M921k754J6461J2968J4700j5644j2468k376j780
$$ 68512 47892 3381 -17845 -21607 -16686 -19440 -2979 9989 24689 9045 -3423 -5799 -7579
3169g579j0189R185Q700j279j5818J8859J0504k1626J0674M9248m081k4137j5392
$$ -7579 -17768 -8583 117 -1162 -16980 1879 12383 -9243 1431 50679 46598 22461 7069
3156G069q088q584J1138r459P868J403r440k4765q893J383K5906k26k0334J8063
$$ 7069 -1019 -9603 1535 -7924 -56 1347 -8093 -32858 -41751 -40368 -14462 -14688 -35022 -16959
3142a6959K204k3346J2170j4279K252K015K6186L2094J1067j5025M249Q119k9051
$$ -16959 -14755 -38101 -25931 -40210 -37958 -35943 -9757 22337 33404 18379 22628 30747 1696
3129A696k0429O954p219P240J8713J589J1895k534J6753j3894J4559R621K0194
$$ 1696 -18733 -11779 -18998 -11758 6955 8544 20439 17905 34658 20764 35323 44944 65138
3116F5138K1518l1429n0435j2643O469Q833J4416q340m582j380J2385R43j2980
$$ 65138 86656 55227 4792 -7851 -1382 7451 21867 13527 8945 7565 19950 20893 7913
3103G913l6181J6782L0814J1811j7997j5352O434N722j6695O167j6199n329j4289
$$ 7913 -28268 -11486 19328 31139 13142 -2210 4224 9946 -6749 -582 -16781 -22110 -36399
3090c6399M846K2090k1962m093K138J0615L5183J7932o433j1867m166J884M490
$$ -36399 -31553 -9463 -31425 -35518 -33380 -22765 12418 30350 23917 12050 7884 9768 14258
3077A4258k251l1748J0186Q795N943J3278j0534l3926l417k4935J1853J8212j2969
$$ 14258 12007 -19741 -9555 -760 5183 18461 7927 -25999 -29416 -54351 -42498 -24286 -37255
3064c7255k1396j0495P863J3176J3696k040K0478K3635J526l073l680l3419j3240
$$ -37255 -58651 -69146 -61283 -48107 -34411 -36451 -15973 7662 9188 6115 2435 -30984 -44224
3051d4224J0644J9912J5907J7819j8183n547j085j0736j8832J4155k19N225l01
$$ -44224 -33580 -13668 2239 20058 1875 -3672 -4757 -15493 -34325 -20170 -20389 -15164 -15465
3038a5465M895J598J6040n248k2424k6230o85J584q328o851K6341K8769J2096
$$ -15465 -10570 -8972 7068 1820 -20604 -46834 -47519 -45935 -54263 -61114 -34773 -6004 6092
3025F092j8043j9182O645r739N020L5466J7650J0997p329l1097k2702q344J9467
$$ 6092 -11951 -31133 -24488 -34227 -29207 6259 23909 34906 27577 -3520 -26222 -34566 -15099
3012a5099k738J1957j0876k202j4884r892O578m250K7677P486R824o472K1734
$$ -15099 -17837 -5880 -16756 -18958 -33842 -43734 -37156 -41406 -13729 -6243 3581 -2891 18843
2999A8843j648J374n900j2462j8028J3947j26j7739j4135n374R343M3542q108
$$ 18843 17195 18569 12669 207 -17821 -3874 -4000 -21739 -35874 -41248 -31905 11637 3529
2986C529m0767q250J5448J4630L754j2071J369J0409J6364l1047O162j6723J5990
$$ 3529 -37238 -45488 -30040 -15410 -11656 -23727 -22358 -11949 4415 -26632 -20470 -37193 -21203
2973b1203L2114M932k1989j2924J1919K3867J058j986J4286J4835J1418o580k4484
$$ -21203 10911 15843 -6146 -19070 -7151 16716 17774 15788 30074 44909 56327 49747 25263
2960B5263j0382j6283K1077K2487k5687q333K7458l430j3079k385q164J4350J3966
$$ 25263 14881 -1402 19675 42162 16475 8142 35600 32170 19091 16706 8542 22892 36858
2947C6858J7710J461j7139k0493K3352K2146k9795p028j6522j8752j3390j745
$$ 36858 54568 56029 38890 18397 41749 63895 34100 27072 10550 -8202 -21592 -23337
2935b3337J2201O520j9270n00K5414J332J3525r798n082r839J2397p07k6529O179
$$ -23337 -11136 -4616 -23886 -24386 1028 2360 15885 6087 1005 -8834 3563 2856 -23673 -17494
2921a7494J8047L4677j7494j2643Q891j3442J555K4173R683Q413k7084k0017N697
$$ -17494 553 35230 17736 5093 13984 542 2097 26270 35953 44366 17282 -2735 2962
2908B962J5352l6897n231J0530M391Q43k1808j8497K334K0296L0976K3053J2222
$$ 2962 18314 -18583 -23814 -13284 -8893 -8050 -29858 -48355 -46021 -25725 5251 28304 40526
2895D0526m3801L712N7N304J8913Q780n2851k1226K2798L060m784J164K0218L8568
$$ 40526 -3275 437 494 5798 24711 33491 -19360 -40586 -17788 -14728 -19512 -18348 1870 40438
2881D0438l704l6246k1478K4124K6456J531r201q311j7130r303J9958J721l1466
$$ 40438 36734 488 -20990 3134 29590 31121 21920 13609 -3521 -12824 7134 8855 -22611
2868b2611j9474K3975O040l597J592J6761J507m600q992r046O930J0700J4206
$$ -22611 -42085 -18110 -12070 -15667 -14075 2686 4193 -407 -9399 -18445 -11515 -815 13391
2855A3391k1241j5079L4560K6262j1625Q041Q462l0818l1249K8158k979k2137
$$ 13391 -7850 -22929 11631 37893 26268 34309 42771 11953 -19296 8862 5883 -16254
2843a6254M481l2052J4851K3294J8502R537n0161K280L1811K4712j169J0865k385
$$ -16254 -11773 -43825 -28974 -5680 12822 22359 -27802 -25522 6289 31001 29832 40697 38312
2830C8312j1324K99M680r185k799J661n4280j2324J4379L1799n766j3509j9626
$$ 38312 26988 27287 31967 22782 19983 21644 -32636 -44960 -30581 1218 -4548 -18057 -37683
2817c7683J9749K3216O742J8959J4691m5836k4904j0348K1724r399J0473J657
$$ -37683 -17934 5282 12024 30983 45674 -162 -25066 -35414 -13690 -23089 -12616 -10959
2805a0959Q26Q70J2526p292K47j7301J4727J3209K2911j2892l4523p801J6205
$$ -10959 -10133 -9263 3263 -4029 -3782 -21083 -6356 6853 29764 16872 -17651 -25452 -9247
2792i247K758r247J3337l6024j5013K9685O699K1448l294O481j6703j761j7791
$$ -9247 -6489 -15736 -2399 -38423 -53436 -23751 -17052 4396 1102 7583 -9120 -10881 -28672
2779b8672j3216q664Q165K2857j4091J9628r506p343j5419q756K2775J3498j1723
$$ -28672 -41888 -50552 -42387 -19530 -33621 -13993 -23499 -30842 -46261 -55017 -32242 -18744 -30467
2766c0467p319P73J789l0960L775L0949L3180J3774j9237L901O374J883j9293
$$ -30467 -37786 -37013 -35224 -66184 -62409 -31460 1720 15494 -3743 158 6532 8415 -10878
2753a0878j4040L292J8450J3871R987K413j0800l0202l1566q511L0444J6001L668
$$ -10878 -24918 -21626 -3176 10695 20682 23095 12295 -17907 -49473 -57984 -27540 -11539 -7871
2740g871j0213j2130R850J0987K7653J0463N758J1182N570K504l5224j7161m077
$$ -7871 -18084 -30214 -20364 -9377 18276 28739 34497 45679 51249 53753 18529 1368 -2709
2727b709L812r956j0576p984R869K5663p244k2559o718M367O0393J3585k3706
$$ -2709 1103 -8853 -19429 -27413 -17544 8119 875 -21684 -28402 -24035 36358 49943 26237
2714B6237j8037o398N594j3051l1078J5541O33j766K9583J0168J3851K0540O881
$$ 26237 8200 1802 7396 -5655 -36733 -21192 -20559 -22325 7258 17426 31277 51817 58698
2701E8698j5560l5971j9889J2604j976n25j8550K9990l578j2651K1890m683j8496
$$ 58698 43138 7167 -12722 -118 -2094 -2619 -21169 8821 5243 -7408 14482 9799 -8697
2688h697J4526L0464K2713j184k2484m2427r109L0138N197J05l002j7669Q61K181
$$ -8697 5829 36293 59006 57822 35338 -7089 -16198 13940 19137 19242 16240 -1429 -568 1613
2674A613K3039N450k0670k859J3256j492K2618J3824L21j0127k1913j8855j1358
$$ 1613 24652 30102 9432 6573 19829 18337 40955 54779 55100 44973 23060 4205 -7153
2661g153K1247O117J0318M749L0268n582k0693l9963l1326K4088R1k1284p170
$$ -7153 14094 20211 30529 35278 65546 59964 39271 -692 -32018 -7930 -7839 -29123 -36293
2648c6293J3829N454J2073R746O387K330r976m10J3500P210K9325p119l1678j3686
$$ -36293 -22464 -17010 -4937 4809 11196 13526 3550 3140 16640 23850 53175 46056 14378 692
2634F92J0702j8858q456K3396L3085j5559j2525r24j4855p008j056J9086K4295
$$ 692 11394 -7464 -15920 7476 40561 25002 12477 11553 -3302 -10310 -11366 7720 32015
2621C2015J384j8062l15m196Q892J1634Q600j9389K769M032L025j849M220k9514
$$ 32015 33399 15337 15022 10826 19718 31352 39952 20563 23332 27364 30389 28540 32760 3246
2607C246Q542j84J308j0303j337m783m809j0696J3688N1972J2636j2601k1550
$$ 3246 11788 11604 12912 2609 1272 -3511 -8320 -19016 -5328 46644 59280 46679 25129
2594B5129J9121k1755k233J2326M627R651J9036M3352O0101K5380k2080k2824
$$ 25129 44250 22495 20262 32588 37215 46866 65902 109254 169355 194735 172655 149831
2582A49831J6822M6045O4283M4793J4559R7997J45769J39730J87113L10699N24505
$$ 149831 166653 212698 276981 321774 336333 434330 580099 719829 906942 1217641 1742146
2571A742146R08531J695818L296748M589120J698808k669152m258693k840040
$$ 1742146 2650677 4346495 7643243 12232363 13931171 11262019 7003326 4163286
2563D163286j469420p97114m95285l17746k05909j37048j13230q3057o3206n7038
$$ 4163286 2693866 1896752 1401467 1083721 877812 740764 627534 544477 481271 424233
2553D24233m2788l4428l8765k5463r651j2387j6514k5886k7152q022n898k8790
$$ 424233 381445 347017 308252 282789 273138 260751 244237 218351 191199 183177 177279 148489
2541A48489j6418k4569j9824j4742n993J8295k8875o19K264k4859j645P920j4843
$$ 148489 132071 107502 87678 72936 66943 85238 56363 55744 58008 33149 31504 39424 24581
2528B4581O959L2514k3829k0934J3608p034m085j2297j7336L5137N385k6553j7219
$$ 24581 31540 64054 40225 19291 32899 25865 21780 9483 -7853 27284 32669 6116 -11103
2515a1103J1983N164N77R199l776J9613Q059K5246n893k4858m6308O730L1629
$$ -11103 880 6044 6621 15820 12044 31657 39716 64962 59069 34211 -12097 -5367 26262
2502B6262j7640j2893K4237J2577k3061J4710J4248l795K830j943k1279j7437
$$ 26262 8622 -4271 19966 32543 9482 24192 38440 34645 37475 35532 14253 -3184
2490c184J0552K0868J1462P779l813J8095K5516Q14q018m1902k7230j364p762
$$ -3184 7368 28236 39698 47477 43664 61759 87275 88089 80071 38169 10939 9575 1813
2477A813L83k747j580j8329M249p890J2248L7417K8039j3664l2804j2593Q302
$$ 1813 2196 -551 -2131 -20460 -16211 -24101 -11853 25564 53603 39939 7135 -5458 2844
2464B844p908r965j4321L8027l3266j0787j8565J3919K0747n645J9028p099K275
$$ 2844 -5064 -15029 -29350 8677 -24589 -35376 -53941 -40022 -19275 -24920 -5892 -12991 -10716
2451a0716J841J8291L484j7022k6948o737J0464j0884j4440J9945L5597Q975p686
$$ -10716 -8875 9416 12900 -4122 -31070 -37807 -27343 -38227 -52667 -32722 2875 11850 4164
2438D164j016K0155K2894R468k63l4746k9745q23J5164M4480k383J9888L593j7729
$$ 4164 3148 23303 46197 55665 55402 20656 -9089 -9912 5252 49732 47349 67237 70830 53101
2424E3101j9693k465o705j5489j3068j2256K708K4381M672k5238j5042P65k356
$$ 53101 33408 30943 24238 8749 -4319 -16575 -13867 10514 15186 -10052 -25094 -24329 -26685
2411b6685K1538K3810K5113L23J6017q608l8755J1011J0025j097L875Q835j8072
$$ -26685 -5147 18663 43776 44099 60116 51508 12753 23764 33789 32692 36567 45402 27330
2398B7330P3j6027j5322l342m707J041L546J7763N85K431L57J3444q85j1147j1862
$$ 27330 27403 11376 -3946 -7288 -11995 -10954 -7408 10355 10940 13371 13728 27172 26287 15140 3278
2383C278l089J1539K7751K843l6429j496q670K18M268J4893K1934L3062j6044
$$ 3278 189 11728 39479 42322 5893 4397 -4273 -4055 213 15106 37040 70102 54058
2370E4058k4052l1822J9335L1641l552k5348n571J7207j7071l4620K5751J7506
$$ 54058 30006 -1816 17519 49160 45608 20260 14689 31896 14825 -19795 5956 23462
2358B3462K2470k4741N151j951l218K1710K036j3768N718k2773P288l77q996k7576
$$ 23462 45932 21191 26342 24391 21173 42883 44919 31151 36869 14096 21384 21007 12011 -15565
2344a5565p422J0929J1144J7333p461j8576k449R153r420j6340q851M869K9770
$$ -15565 -22987 -12058 -914 16419 8958 -9618 -12067 -2914 -12334 -28674 -37525 -32656 -2886
2331b886R8p391l26q451J9286K9229r228l9191n721n99q796R683K315p147J5874
$$ -2886 -2788 -10179 -10505 -18956 330 29559 20331 -18860 -24581 -25180 -33976 -24293 -21978 -29125 -13251
2316a3251J3336j2564K057j1862K0329L73l2908l2106r824L7357R641J0345J0530
$$ -13251 85 -12479 -10422 -22284 -1955 -1582 -34490 -66596 -76420 -39063 -29422 -19077 -8547
2303h547J5249j0870k5990J2132J0167O456j1199l1690l013K0001J243m296m89
$$ -8547 6702 -4168 -30158 -18026 -7859 -1403 -12602 -44292 -47305 -27304 -26061 -30357 -30846
2290c0846K3718K7502j9394m2259J8651L8945q869k4562j0440M618P89R179K8135
$$ -30846 -7128 20374 980 -41279 -22628 16317 7448 -17114 -27554 -22936 -22147 -12968 15167
2277A5167j0684j2653j9851j60j932m334J5604j3058k509K8698K9848p643p766
$$ 15167 4483 -8170 -28021 -28181 -30113 -34447 -18843 -31901 -34410 -5712 24136 16493 8727
2264H727k6429Q118p262n512K321O181K5060q113j7721P438J0859o311m386J8347
$$ 8727 -17702 -9584 -16846 -22358 -20037 -13856 11204 3091 -14630 -7192 3667 -2644 -7030 11317
2250A1317j4243K160L1033J2323k5502j2404L2015M779q612j8173j4637j6613
$$ 11317 -2926 -766 30267 42590 17088 4684 36699 41478 32866 14693 56 -16557
2238a6557j0821k2126k7300J4880L3505N077K0901J9252k2410r971J9358k2160
$$ -16557 -27378 -49504 -76804 -61924 -28419 -23342 -2441 16811 -5599 -15570 3788 -18372
2226a8372J888p291k502j571J3279k615j9551R769J2494P443J3260K1033L387
$$ -18372 -16484 -23775 -26277 -27848 -14569 -17184 -36735 -26966 -14472 -7029 6231 27264 30651
2213C0651p958j2668j2717Q972J189r998q08q699J9838P341j2498n178k750n060
$$ 30651 22693 10025 -2692 6280 7469 -2529 -3337 -12036 7802 15143 2645 -2533 -5283 -10343
2199a0343m265k2070J7465K8047j9767k4748L008J4330K330j8963k194k491J0073
$$ -10343 -14608 -36678 -19213 8834 -10933 -35681 -32673 -18343 -16013 -34976 -37170 -39661 -29588
2186b9588K917P191K3398n125l2678k8632L5507M0375K5991l0866k1674j853q232
$$ -29588 -26671 -19480 3918 -1207 -33885 -62517 -27010 13365 39356 8490 -13184 -15037 -23269
2173b3269J0729J5244l640n715k0474j274k410J2554m722J0329L0950n89n886
$$ -23269 -12540 2704 -936 -6651 -27125 -28399 -30809 -18255 -22977 -12648 18302 17713 11827
2160A1827J1775l0093J7413K1222j9696k0900n522j4451L0409L8859n239j2718
$$ 11827 23602 -6491 10922 32144 12448 -8452 -13974 -28425 1984 40843 35604 22886
2148B2886Q613j5811K0175j6021l7308k3966n522J4983K7964J3584n280q161m787
$$ 22886 31499 15688 35863 19842 -17466 -41432 -46954 -31971 -4007 9577 4297 -3864 -8651
2135h651r54n254Q342l971J5438L172j4376J1296j430k1704P195J9085J631p097
$$ -8651 -9605 -14859 -6517 -10488 4950 8122 -6254 5042 3612 -18092 -10897 8188 9819 2722
2121B722m808j2769l0725j738K8448L4584j9627j5502j56K6490R936j1976M998
$$ 2722 -2086 -14855 -45580 -47318 -18870 15714 -3913 -19415 -19571 6919 16855 4879 9877
2108I877P388R514M264n922K2856j3150m2621q656P343j1265M751J0823J2377
$$ 9877 17265 26779 31043 25121 47977 34827 -7794 -16450 -9107 -20372 -15621 -4798 7579
2095G579j0107j7416J0204K1203j2861N12M8389J6659k2177j7568m581r499k0318
$$ 7579 -2528 -19944 -9740 11463 -1398 -886 47503 64162 41985 24417 19836 10337 -9981
2082i981N213R19O907K4083j0038p841j1848P148m69k1573o431Q914L576J2711
$$ -9981 -4768 -3849 3058 27141 17103 9262 -2586 4562 4093 -17480 -23911 -14997 -11421 1290
2068A290n661m019K0608q644k981j3922m81L1642O016l3116j1195K156N825J3752
$$ 1290 -4371 -8390 12218 3574 593 -13329 -13810 17832 23848 -9268 -20463 -18307 -12482 1270
2054A270j5017R982K1885O577K611m249k3569j5462l072R804N200J9224J3312
$$ 1270 -13747 -3765 18120 24697 27308 23059 -510 -15972 -19044 -9240 -4040 15184 28496
2041B8496k1699k4945k5903P355K0211r427O147K5300K2433o918j292j7094J0932
$$ 28496 6797 -18148 -44051 -36696 -16485 -25912 -19765 5535 27968 21050 19758 2664 13596
2028A3596J7512K1779O079l417j972k3628j8130K1117o061j3132J706L1603K733
$$ 13596 31108 52887 58966 55549 53577 29949 11819 32936 26875 13743 15449 47052 49785
2015D9785L220k0756l4647J254n373J2940R213o94k698J0225J3124J461k407n297
$$ 49785 53005 32249 -2398 -1144 -6517 6423 15636 14942 12244 22469 35593 37054 34647 29350
2001B9350j0712L7174J3853m2745j0566k35k0407j3204J4966J7802K2306j0834
$$ 29350 18638 55812 69665 26920 16354 16119 -4288 -17492 -2526 15276 37582 26748
1989B6748j4218J3006L022J299l885k6146p900J3653L0896M965J133K0151k3028
$$ 26748 12530 25536 28558 29857 25972 -174 -8074 5579 36475 41440 42573 62724 39696
1976C9696j6809r747k6136j4017J9291P436L405J9679J9110m333j5640j7516J496
$$ 39696 22887 13140 -12996 -27013 -7722 -286 3119 22798 41908 37575 21935 4419 5915
1963E915K1179J6629R500k5987k2663K3L0248J4618k036j0870k1036j04J821k2073
$$ 5915 27094 43723 53223 27236 4573 4596 34844 49462 47426 36556 15520 15416 17237 -4836
1949d836P55m627j5988K3251L0080k1918m3057J1642K0310J4646k734o173l90
$$ -4836 -4081 -8708 -24696 -1445 28635 6717 -36340 -24698 -4388 10258 7524 1351 961
1936I61j498j8433l5832J1400J8564J7403K4687p021K43j0721J6356N699j2040
$$ 961 -537 -18970 -54802 -43402 -24838 -7435 17252 10231 10474 -247 16109 21808 9768
1923I768M763j0339k5391j4805q703J3172L4973K1915K7870r415j3953N494J9271
$$ 9768 14531 4192 -21199 -36004 -44707 -31535 3438 25353 53223 43808 29855 35349 54620
1910E4620Q721j7453k8943J3289P260r881j0860J1414J986J390j0921n909K331
$$ 54620 63341 45888 16945 30234 37494 27613 16753 28167 30153 31543 20622 14713 17044
1897A7044J2900j4636M635q27J84J9393N976j3055j2578m1J2981K9718J037r68
$$ 17044 29944 15308 19943 19116 19300 38693 44669 31614 19036 18995 31976 61694 62731 61763
1883F1763k4028k3181K6399J7265j90N155P979l947j9891R722J845k304n096j7879
$$ 61763 37735 14554 40953 58218 58028 63183 71162 67215 47324 57046 58891 56587 51491 33612
1869C3612M410N970p784l5258m180L1064K7004j9416k0692J063R813L9608l089
$$ 33612 38022 43992 36208 950 -3230 27834 54838 35422 14730 15793 25606 65214 62125
1856F2125m863n191J37J1768M540J5461o960n750L231M076k0438J5014k371j2043
$$ 62125 57262 52071 52208 63976 68516 83977 77017 71267 74498 78574 58136 73150 70779 58736
1842E8736j6542m3785R569J7778L5574L4798J5224p267o196k899j7721N469m935
$$ 58736 42194 -1591 7978 25756 61330 96128 111352 104085 97889 94990 77269 82738 77803
1829G7803j1565P193J6543k1372o802j4883M58R667q731J5965J6328Q481O730
$$ 77803 66238 73431 89974 68602 61800 46917 47375 57042 48311 64276 80604 89085 95815
1816I5815j0531j8489j0620J543J7991M3562L1094N556j3241J475L906J6652M6906
$$ 95815 85284 66795 56175 57718 75709 119271 150365 155921 142680 144155 148061 164713 211619
1803B11619J8830M7901P5128J39779J99376J61037N8770q6948j80990j54976q7816
$$ 211619 230449 278350 353478 493257 692633 853670 912440 825492 644502 489526 401710
1792D01710n2210k0061n3648n8437j2563j1856l1829K1592j5806O038r267Q403
$$ 401710 349500 329439 275791 217354 204791 192935 161106 182698 166892 172930 163663 172066
1780A72066L1483k5972k3645P337J4568K9144Q47N169j8949L802j3011j8527K4523
$$ 172066 203549 177577 153932 161269 175837 204981 205828 210997 192048 195850 182839 164312 188835
1767A88835J5126j9131p935M2261K6839L8276L1137K0041N2208O9872R9376J30403
$$ 188835 203961 184830 176895 219156 245995 284271 315408 335449 387657 457529 556905 687308
1755F87308K11843L60778M37488K34716j12276l60420l68543k81514j54067j15232
$$ 687308 899151 1259929 1697417 1932133 1819857 1459437 1090894 809380 655313 540081
1745E40081q0089l2115m1179j9063k6663j8108M898K9505K1512m499j6160k275
$$ 540081 459992 427877 386698 367635 340972 322864 327762 357267 378779 374280 358120 355845
1733C55845l3035j6946q56J9607p503p242K1114j330K480J6909P621N287J0640
$$ 355845 322810 305864 305008 324615 317112 309870 330984 329654 332134 349043 356664 361951 372591
1720C72591J3978K7833J9834J3613N2712L7110J7321O4874M5646N2711P5984J37214
$$ 372591 386569 414402 434236 447849 500561 537671 554992 619866 665512 718223 794207 931421
1708I31421J68260J09739Q216q8261j58553j31520q9158m7343n1532j7853j1691
$$ 931421 1099681 1209420 1217636 1129375 970822 839302 750144 702801 651269 633416 621725
1697F21725j242K5177J2976j6324P361J0090j7624O299K9460j3751J6121L1489
$$ 621725 620483 645660 658636 642312 649673 659763 642139 648438 677898 664147 680268 711757
1685G11757M6332M142l277J6907K0688j1554l2251o52j9410j9415q604o751J3730
$$ 711757 758089 762231 758954 775861 796549 784995 752744 752092 732682 713267 704663 697912 711642
1672G11642L1641j106k0760m681j1335R781k6913n2823l2555l2050m1978n014
$$ 711642 743283 742177 721417 716736 705401 715182 688269 635446 602891 570841 528863 523849
1660E23849j01J1296k4358J2998J3394o464J4189J6950o952k195M735P26m2798
$$ 523849 523748 535044 510686 523684 537078 530614 544803 561753 554801 552606 557341 558067 515269
1647E15269o0886n0292k2339j804K3086R087M743M283k3037k5102k2661j1986
$$ 515269 454383 404091 381752 379948 403034 412121 416864 421147 398110 373008 350347 338361
1635C38361m585K2824K4340M286j9042j234J857j9221j2763q871o473l9650K4751
$$ 338361 333776 356600 380940 385226 366184 364950 366807 347586 334823 325952 319479 279829 304580
1622C04580p737m2463l8829j3350N3r122j0075J69L7165O400j8004L2899K3625
$$ 304580 296843 254380 215551 202201 202254 193132 183057 183226 220391 226791 208787 241686 265311
1609B65311J5260L0138K2899L5147R078j8262l7488l1048j1995k1251j7573n998
$$ 265311 280571 310709 333608 368755 377833 359571 322083 291035 279040 257789 240216 234218
1597B34218l065j9754l6116j4892p621L4995L5435M0060J4803K7690l252n6715
$$ 234218 231153 211399 175283 160391 152770 187765 223200 263260 278063 305753 302501 245786
1585B45786j6762R807j2355j6688j1396j4095j2957p355l8476q957r321Q769N89
$$ 245786 229024 238831 226476 209788 198392 184297 171340 163985 125509 116552 107231 116000 116589
1572A16589O797K0318Q821j2193k8687J694L060n683K1266M2971K1384K3290L0739
$$ 116589 123386 143704 152525 140332 111645 113339 116399 110716 131982 174953 196337 219627 250366
1559B50366J1030r025m399o734K3344J8430K5027k1211l3003l1010l9935k0763
$$ 250366 261396 252371 247972 241238 264582 283012 308039 286828 253825 222815 182880 162117
1547A62117r792J8795K8510j9086k0556O46K6104L3595m8679j2447K3479L69N317
$$ 162117 152325 171120 199630 180544 159988 160634 186738 220333 171654 159207 182686 183055 188372
1534A88372j6827k0765k2115l7878j9592k6756L984K420P881K7842L6217L8784
$$ 188372 171545 150780 128665 90787 71195 44439 48423 50843 58724 86566 122783 161567
1522A61567j961K389J3061k3737M700o838K2954K4002L3367M429L0492J7627K0083
$$ 161567 159606 161995 175056 151319 156019 149181 172135 196137 229504 233933 264425 282052 302135
1509C02135M1315L4817n345o7979j10582m6781M818p80k3284j1190R464M2746
$$ 302135 343450 378267 372922 304943 194361 147580 152398 151618 128334 117144 126608 169354
1497A69354L5632O1341L0949j4616k0348k0426p799m924j7373k4653m8080m0914
$$ 169354 204986 266327 297276 282660 262312 241886 234087 229163 211790 187137 139057 98143
1485I8143o353k0039P189K5263M5454L0320L3021M4254O436J0234K3684N8869
$$ 98143 91790 71751 78940 104203 149657 179977 212998 257252 263688 273922 297606 356475
1473C56475K9436l753k5143K6141J2564L9008J5648J1319J6444O267j3087j4315
$$ 356475 385911 382158 357015 383156 395720 434728 450376 461695 478139 484406 471319 457004
1461D57004L190l2855m1287j0265k6007l4708j0451L974J1483J8963L5226J9305
$$ 457004 460194 427339 386052 375787 349780 315072 304621 308595 320078 339041 374267 393572
1449C93572N746M5743O8859L7170J4560L9059O3103L917k3970M07K4276M9895
$$ 393572 399318 445061 513920 551090 565650 604709 667812 671729 647759 648166 672442 722337
1437G22337M3278K6849L5450L7473P2177J19047J05118R7490Q9848N1789P3669
$$ 722337 765615 792464 827914 865387 937564 1056611 1161729 1259219 1349067 1400856 1474525
1426A474525J15639J25054J21086J06913R9754J11429J70550J94473J81131K15176
$$ 1474525 1590164 1715218 1836304 1943217 2042971 2154400 2324950 2519423 2700554 2915730
1416B915730K52275K64984K39318L09757N37001Q01896J004690J065067J053826
$$ 2915730 3168005 3432989 3672307 3982064 4519065 5320961 6325651 7390718 8444544
1407H444544J201052J636005K330456L393716M966061P486017J1647904J8749347
$$ 8444544 9645596 11281601 13612057 17005773 21971834 29457851 41105755 59855102
1399E9855102K9628489M0178806L4290387L840998k8150962l8448692l0573853
$$ 59855102 89483591 129662397 163952784 167793782 139642820 101194128 70620275
1392G0620275j9973534j2655436q304385n689972m006824k900641k144144j625971
$$ 70620275 50646741 37991305 29686920 23996948 19990124 17089483 14945339 13319368
1384A3319368j199074q13438n27644m68317n68176o04001n65673m75763l11167
$$ 13319368 12120294 11306856 10779212 10310895 9742719 9138718 8573045 8097282 7786115
1375G786115j61033k2797Q8333J77896K52147K51554K87050M25546Q27204J363721
$$ 7786115 7625082 7602285 7690618 7868514 8120661 8372215 8659265 9084811 9912015 11275736
1365A1275736J839594J941300J838080K011920K809356M110085N838594Q487175
$$ 11275736 13115330 15056630 16894710 18906630 21715986 25826071 31664665 40151840
1357D0151840J2840249K0185099L3033957N5106962Q3875113Q4082338K1327000
$$ 40151840 52992089 73177188 106211145 161318107 245193220 329275558 350602558
1350C50602558n5190984q4290728o7373658m3129600k6762852j7224039j1640480
$$ 350602558 295411574 211120846 143747188 100617588 73854736 56630697 44990217
1343D4990217q239887o010514m544605l506355k545722j644154j078854j067371
$$ 44990217 36750330 30739816 26195211 22688856 20143134 18498980 17420126 16352755
1335A6352755j420859j653446j511557j183170q39082o36941m72167l50101k32917
$$ 16352755 14931896 13278450 11766893 10583723 9744641 9107700 8635533 8285432 8052515
1326H052515j80584j37735n8052L0129J93793M26038O85633P92593Q26491R91227
$$ 8052515 7871931 7734196 7676144 7706273 7900066 8326104 9011737 9804330 10630821 11622048
1316A1622048J389120J954540K747822L968922N930904R108070J4610871K3459859
$$ 11622048 13011168 14965708 17713530 21682452 27613356 36721426 51332297 74792156
1308G4792156L4811878L8171456J7454093j6681522l6689161l4232680k3407819
$$ 74792156 109604034 147775490 165229583 148548061 111858900 77626220 54218401
1301E4218401j4685354r400516o312620m472462l321737k490880j882167j411505
$$ 54218401 39533047 30132531 23819911 19347449 16025712 13534832 11652665 10241160
1293A0241160r84217o71353o62810p98132q40718p94374o71420n51220m54404
$$ 10241160 9256943 8585590 7922780 7124648 6283930 5489556 4818136 4266916 3812512
1284C812512l51553k83945k14188k17363k18911k03946k06977j54312j10446p5511
$$ 3812512 3460959 3177014 2962826 2745463 2526552 2322606 2115629 1961317 1850871 1775360
1274A775360n2970q7686j20456j02940m6216k3458m7698q8921n0151l0179l2642
$$ 1775360 1722390 1634704 1514248 1411308 1365092 1341634 1293936 1205015 1154864 1124685 1092043
1263A092043R290j4460n9015q1884p8312n5945k9221Q089Q390n705J586m691k5563
$$ 1092043 1101333 1086873 1027858 945974 867662 811717 782496 790585 798975 793270 794856 790165 764602
1250G64602J4052R991l1349m3261n8220n0862n0886l1949l4595m4064k4108k1035
$$ 764602 778654 788645 757296 714035 655815 604953 554067 522118 487523 443459 419351 398316
1238C98316j8381k8647k1083k271O53J3048k0115P511J6213j531K0928J5749k6631
$$ 398316 379935 351288 330205 327934 328587 341635 321520 329031 345244 343713 364641 380390 353759
1225C53759j1253L0147L2740K6908K0856j3653J5568J1558l6849m8868o3278k6335
$$ 353759 342506 372653 405393 432301 453157 439504 455072 466630 429781 380913 317635 291300
1213B91300n223l3581m5684k5038m25M5265J726M92K1301M3451K6789J9747p760
$$ 291300 286077 252496 206812 181774 181349 226614 228340 228832 250133 293584 320373 340120 332360
1200C32360j4564k5592l7581p6706m4551j5351K696n307J334J1544M3190J7557
$$ 332360 317796 292204 254623 177917 133366 118015 120711 115404 116738 128282 171472 189029
1188A89029J2063J8258R960J2237k0307k5046R62j3259J8759M5766O67L4864K4227
$$ 189029 201092 219350 229310 241547 221240 196194 197156 183897 202656 248422 249089 283953 308180
1175C08180l9545k3979K3162j3466k3101j5990p657M05k7492k0127J0977m2951
$$ 308180 268635 244656 267818 254352 231251 215261 207604 208009 180517 160390 171367 128416
1163A28416n7075m236L7013K7410J1475M4840l297n862N579j2517j4825l2952
$$ 128416 71341 67105 104118 131528 143003 187843 184546 178684 184263 171746 156921 123969
1151A23969r131j2345j5748R252K9073K8431J4072L0782K2940R4725J02562j8843
$$ 123969 114838 102493 86745 95997 125070 153501 167573 198355 221295 316020 418582 399739
1139C99739p0503m5391o5175n4685l6807K0682L3521L124j3001M193L876J9269
$$ 399739 329236 283845 218670 163985 127178 147860 181381 184505 171504 175697 179573 198842
1127A98842n145k1094k138j2541k1546j0611j4978k6313m116j9107j5724l367
$$ 198842 193697 172603 170465 157924 136378 125767 110789 84476 80360 61253 45529 42162
1115D2162j56Q923K6384K2642J4518J0516J8003L0686j4279k7014J1402L9714
$$ 42162 42006 50929 77313 99955 114473 124989 142992 173678 159399 132385 143787 183501
1103A83501K3489k8453L7131M7062N4113J03519J45316J4362j11180j55472j08165
$$ 183501 206990 178537 215668 262730 316843 420362 565678 580040 468860 313388 205223
1092B05223j0415P915k041o818k0665r284K4617M944j0635j1045l3553l106l6933
$$ 205223 194808 202723 200682 193864 173199 163915 188532 193476 182841 171796 138243 135137 98204
1079I8204j1134O205k066j3447j7559j4209j2875k0308j3138J357J0124r886J2232
$$ 98204 87070 93275 91209 77762 60203 45994 33119 12811 -327 1030 11154 1268 13500
1066A3500M1061K5436J2902R570l461o918j320L2J6434J6034j5422R985O1151
$$ 13500 54561 79997 92899 102469 99008 92090 90770 90802 107236 123270 107848 117833 178984
1053A78984M5913K7078K726m9108o0949l7324Q490j1617k0707j0059q321K3136
$$ 178984 224897 251975 254701 205593 144644 107320 115810 104193 83486 73427 65106 88242
1041H8242K7404k968j7182k3303m1717m0306j264L3484N618J1837N710j9010m1096
$$ 88242 115646 112678 95496 72193 30476 -9830 -11094 22390 28008 39845 45555 26545 -14551
1028a4551J4574L7269O776k7068J645K4840k1665j7261J7937K6172J317j3343
$$ -14551 23 37292 44068 17000 18645 43485 21820 4559 22496 48668 49985 36642
1016C6642J62j1509k1551j0881K8128M4031K2375n327j6767P045r384k7310J3437
$$ 36642 36804 25295 3744 -7137 20991 65022 87397 82070 65303 72348 62964 35654 49091
1003D9091J4087P800K3836J4371J0995J5027M5517N7224K7207P5574J46912J65976
$$ 49091 63178 70978 94814 109185 120180 135207 180724 237948 265155 340729 487641 653617
991F53617J61009N6331q7837j72472j56125r7670r8765p8802k4985o905k3268
$$ 653617 814626 870957 783120 610648 454523 356853 258088 179286 154301 147396 124128
980A24128q670j007J0065O896j7594P864j5527j3217J4967K738k1438j6275J7732
$$ 124128 115458 114451 124516 131412 113818 121682 106155 92938 107905 110643 89205 72930 90662
967I0662K1043j3978j9909L107j1201l5384J1323J8322P982J4929J6565p55M0643
$$ 90662 111705 97727 77818 80925 69724 34340 45663 63985 71967 86896 103461 102706 143349
954A43349M0252K6621L3505O7038R2685J54015K52433L66564M29778K08389j59887
$$ 143349 183601 210222 243727 310765 403450 557465 809898 1176462 1606240 1814629 1654742
943A654742l93258m08706k53521j55443j07072l6176m0878o156j2220l7327k2607
$$ 1654742 1261484 852778 599257 443814 336742 300566 259688 253532 241312 203985 181378
932A81378j6182j7443l6403k0077N260j2735l2724J6813j661o451k012r905K0357
$$ 181378 165196 147753 111350 91273 96533 83798 51074 67887 66226 59775 57763 47858 68215
919F8215J1316P525l707n622j2506j6392J0514J9056m499j3418K662K1471L4039
$$ 68215 79531 87056 83349 77727 65221 48829 59343 78399 73900 60482 63144 84615 118654
906A18654P0342P9045N1948Q3961J40534J88729J15752n5529j47798j39991j29433
$$ 118654 188996 268041 319989 403950 544484 733213 848965 793436 645638 505647 376214
895C76214r8628p0682m8783k0433k2119k2904j7119J706J241l174j8409k6061
$$ 376214 277586 206904 158121 137688 115569 92665 75546 77252 78493 75319 56910 30849
883C0849J9031K3711j0636N512n775j7075P044r6k1729l723l5375k2281K9285
$$ 30849 49880 73591 62955 68467 62692 45617 52661 52565 30836 27113 -8262 -30543 -1258
870a258K7711m847j5714J4759R843r515j1268L086j483l008R691P325q04J030
$$ -1258 26453 21606 5892 20651 30494 20979 9711 12797 11314 8306 17997 25322 24518 25548
856B5548K150L600K5235K2877k4018m955m0190l1731k1066L050j3630J6466L6822
$$ 25548 27698 31298 56533 79410 55392 50437 10247 -21484 -42550 -39500 -53130 -36664 158
843A58n215k162K0314L5635j3604l5037J3409J2241m484q654J3464j0364K4642
$$ 158 -5057 -7219 13095 48730 35126 89 13498 25739 21255 12601 26065 15701 40343
830D0343J1957j7534j477m492K5737q298k4710n656r797m190n82L5230J4625j6447
$$ 40343 52300 34766 33289 28797 54534 46236 21526 15870 6073 1883 1301 36531 51156 34709
816C4709R775K4772J7603N516j6799k4107n204L2183q20j9084O562J1734L368
$$ 34709 44484 69256 86859 92375 75576 51469 46265 78448 77628 58544 65106 76840 80208
803H0208n826M056j4974j3671j1114J167k2570o845M354J1133K9925K7828j0760
$$ 80208 74382 78438 63464 49793 38679 39846 17276 10431 14785 25918 55843 83671 72911
790G2911k0632k7016p88j6169r543M508J1964k50K0161j741K021k6503Q4J1662
$$ 72911 52279 25263 24475 8306 -1237 3271 15235 14985 35146 33405 35426 8923 9007 20669
776B0669m567o27K092j3353P234L2142K2388q771J1794K2130k0229j9460J8925
$$ 20669 16102 15475 17567 4214 11448 43590 65978 57207 69001 91131 70902 51442 70367
763G0367j069L216J8512k604j9035K0654n777q826L098K4138k023k5984R140M296
$$ 70367 69298 72514 91026 88422 69387 90041 84264 75438 78536 102674 100651 74667 83807 88103
749H8103J2057n172j6930p904M513q442l1127k8090q799M049K0196L5963l1394
$$ 88103 100160 94988 78058 70154 74667 66225 35098 7008 -1791 2258 22454 58417 27023
736B7023j5672L07L678J8475J6333p7J199l5511j3180L262M3102K7177j4759q093
$$ 27023 11351 11658 15336 33811 50144 50067 51266 15755 2575 5837 48939 76116 61357 53264
722E3264j0953J4229K5381p750m0446N966Q958J8294J282q589K0452M546r283
$$ 53264 42311 56540 81921 74171 33725 39691 48649 66943 68225 59636 80088 84634 75351
709G5351J2648M318k7160J8308l4780r864M933J6012k75n933J2715J6665O615
$$ 75351 87999 92317 65157 83465 48685 38821 43754 59766 59491 53558 66273 82938 89553
696H9553j5293J856j1815q848j6306j6172k5750J5893L994j3485K701R069J0329
$$ 89553 74260 76116 64301 55453 39147 22975 -2775 13118 17112 3627 6328 15397 25726
683B5726K9329j2938j009J7172J0816j7857q65K625j4148J8825L0160J3006J2366
$$ 25726 55055 42117 41108 58280 69096 51239 50374 52999 38851 57676 87836 100842 113208
670A13208J0732j7281l1348j5379k42J1439R099j0190l3033k383R266m579N856
$$ 113208 123940 106659 75311 59932 59690 71129 80228 70038 37005 34622 43888 39309 45165
657D5165o8n692L1157n754J6503j9314j1926m929j6691O808l303k0359K2594J3530
$$ 45165 45097 39405 70562 64808 81311 61997 50071 45142 28451 35259 31956 11597 34191 47721
643D7721k6953m733q493J1394J9341K8283K0037k1869j6038k09O7j270Q317j454
$$ 47721 20768 16035 7542 18936 38277 66560 86597 64728 48690 48481 48548 47278 55595 54141
629E4141j6053J3582m383j5788K416K3201j415j3943J5486L896k456M368Q041
$$ 54141 38088 51670 47287 31499 33915 57116 55701 41758 57244 61140 58684 63052 71093
616G1093o734M190J4237j9699N059K6677J3668P65j8701p771o852J5160l4062
$$ 71093 64359 68549 82786 63087 68146 94823 108491 109256 90555 82784 75932 91092 57030
603E7030k1938M323j1593n799L349J3871j270P214J5274o902N326j9784k5719
$$ 57030 35092 39415 27822 22023 25372 39243 37973 45187 60461 53559 58885 39101 13382
590A3382J9023K931j8766K7336j0023J5453J2133J1849J2823J5176p032l0801
$$ 13382 32405 35336 16570 43906 33883 49336 61469 73318 86141 101317 94285 63484
578F3484j1262k457j8748k1360l730J2900K0542k201j5248J592K1132R693q002
$$ 63484 52222 49765 31017 9657 5927 18827 39369 37168 21920 23512 44644 54337 46335
565D6335J0377m512l4493o282J0095L8851j2051k8276l1294j0907L1227K4529
$$ 46335 56712 52200 17707 11425 21520 60371 48320 20044 -11250 -22157 9070 33599
553C3599K2545j2807m626l752Q574P356R705P561p046o906p213m679j6607n682
$$ 33599 56144 43337 38711 34959 43533 50889 60594 68155 61109 54203 46990 42311 25704 20022
539B0022O504q548j6774Q665K8228R698o029J3377J1069L936J3618j0253k2316
$$ 20022 26526 17978 1204 9869 38097 47795 41766 55143 66212 70148 83766 73513 51197
526E1197r21K2615L5518r080k6804j6551m373n506R967K7117m292K0058J94k2731
$$ 51197 50276 72891 108409 99329 72525 55974 51601 46095 56062 83179 78887 98945 99139 76408
512G6408N743O8j3850j0850J75o285m980J2949j319k3344J2489J961k2146r490
$$ 76408 82151 82219 68369 57519 57694 51409 46429 59378 58059 34715 47204 49165 27019 17529
498A7529N179J7488o808J5451j4960J0250n47k833N310J1658L6046l5719l0983
$$ 17529 22708 40196 33388 48839 33879 44129 43582 40749 46059 57717 93763 58044 27061
485B7061L0732Q530J113M13p603K1427N926j0560p795j7998k705J8104M0041K034
$$ 27061 57793 66323 67436 67849 60246 81673 87599 77039 69244 51246 48541 66645 106686 108720
471A08720Q550J1354k3067n2452J4524j505K349J3680j0509P505Q673l3515j5932
$$ 108720 117270 128624 105557 53105 67629 66124 68473 82153 71644 79149 87822 54307 38375
458C8375l144r098m979P398K3767L0904j1442k7652J0630K1836M129m670j2423
$$ 38375 35231 26133 21154 28552 52319 83223 71781 44129 54759 76595 80724 76054 63631
445F3631k8457k159K0597J8663J5071J962J494j4347j6079J004p848J2191K86
$$ 63631 35174 33015 53612 72275 87346 89308 90802 76455 60376 61380 53532 65723 66009
432F6009P506K2490o175k6272k1156r435j425J3294L993k66K797k8921N252L6737
$$ 66009 73515 96005 89830 63558 42402 32967 31542 44836 48829 48563 51360 22439 27691 64428
418F4428j2203j0634k7178K9481K4823q00r658k1540K318n672j2522n38Q316J2132
$$ 64428 52225 41591 14413 43894 68717 67917 58259 36719 39037 33365 20843 20305 28621 40753
404D0753K3829j8805q33K826J511M368M200O835j2176k3262k039r384j4376P368
$$ 40753 64582 45777 44944 47770 49281 53649 57849 64684 52508 29246 27207 17823 3447 10815
390A0815k2942o238J0261O279J254L6815K1575P474M896o48o860J49K936M075
$$ 10815 -12127 -18365 -8104 -1825 -571 36244 57819 65293 70189 69541 62681 62830 65766 69841
376F9841j6538o48j8762J417J0393K5613K3142j9943j7734P013j995K2624m566
$$ 69841 53303 52655 33893 35310 45703 71316 94458 74515 56781 63794 61799 84423 79857
363G9857J0233n711J0572p146j0214J336K56m160k0061k3323p87P119N745p906
$$ 79857 90090 84379 94951 87805 77591 78927 79183 75023 54962 31639 30852 37971 43716 35810
349C5810j5322k1973J4830J0466K8159Q179J3751o600j3063P048j3997J5944J7400
$$ 35810 20488 -1485 13345 23811 51970 60149 73900 67300 54237 61285 47288 63232 80632
336H0632N313k957k0231j3932j4352n146J0366J9031J7789k9928r467L883K0393
$$ 80632 85945 82988 62757 48825 34473 29327 39693 58724 76513 46585 37118 41001 61394
323F1394j306P576K4868j8337m4846m0091J2094M1116J7092j2332j1929m946J7179
$$ 61394 60088 67664 92532 74195 29349 -10742 1352 42468 59560 47228 35299 30353 47532
310D7532J2127k059j6995R326J7050J3673M235L25l638J6537K092j2463k9684
$$ 47532 59659 57600 40605 49931 66981 80654 84889 85214 81576 98113 100205 87742 58058
297E8058J3717K1859N442Q574k8262k3351K10J6528R295j1314r442m843m544J1495
$$ 58058 71775 93634 99076 107650 79388 56037 56247 72775 82070 70756 61314 56471 51927 63422
283F3422p882R211l486j2821N24j7248j6797j5754q123K1985J7182J5666M722
$$ 63422 55540 64751 61265 48444 48968 31720 14923 -831 -8954 13031 30213 45879 50601
270E0601J2312l170n919j4285L473J9053K2673o362j9220j6409j4150k222K0377
$$ 50601 62913 59743 53824 39539 43012 62065 84738 78376 59156 42747 28597 26375 46752
257D6752K486m3311j2902K8463P594K049K7402R428k6479l2642O580J0632N9286
$$ 46752 49238 5927 -6975 21488 29082 31131 58533 67961 41482 8840 15420 26052 85338
244H5338j3538m3099m977J0370J3967Q803K2167o641k0031j5529N635O256J6839
$$ 85338 71800 28701 23724 34094 48061 56864 79031 72390 52359 36830 42465 48721 65560
231F5560N923k4314J538P324j1084K2909j1106o083J315J2122J2318k5636j0293
$$ 65560 71483 47169 48707 56031 44947 67856 56750 50667 51982 64104 76422 50786 40493
218D0493J6037Q655j187j384K381j1521j501J0857j3997j463l173j9402J1955
$$ 40493 56530 65185 63998 62614 64995 53474 51973 62830 48833 47370 44197 24795 36750
205C6750J4285K0353j7700m4350J1726K2519P478J3968J4350L401j3827k717M944
$$ 36750 51035 71388 53688 9338 21064 43583 51061 65029 79379 82780 68953 66236 71180
192G1180p115J122k4268j8320J1297n615J4499q420j7575j2971K428K6745J1106
$$ 71180 64065 65187 40919 22599 33896 28281 42780 34360 16785 3814 6242 32987 44093
179D4093K2205P701k824N412l853J809k618j0627m255n376l45Q949k222J698l048
$$ 44093 66298 73999 71175 76587 72734 74543 71925 61298 57043 51667 51322 60271 58049 59747 56699
164E6699L693J3700q711J480k503l508q683j0581P217L23K2732R900k7524O866
$$ 56699 60392 74092 65381 66861 64358 60850 52167 41586 48803 49126 71858 81758 54234 61100
150F1100J2750k527l1146L733J860M861M260N026K6931K0368l1310n563N13N117
$$ 61100 73850 71323 40177 43910 45770 50631 54891 59917 86848 107216 75906 70343 70856 75973
136G5973K644j1516R93J40j1193o073N134O031Q335r380Q306J5825k1006N845
$$ 75973 78617 67101 68094 68234 57041 50968 56102 62133 70468 61088 69394 85219 64213 70058
122G0058J0313J3898r537j9432j1364N666J5427M548p199L892k5323j4791J5961
$$ 70058 80371 94269 84732 65300 53936 59602 75029 79577 72378 76270 50947 36156 52117
109E2117J096m445m459O452K6901m848l3093k302K0508q672M7n680j7495m104
$$ 52117 53213 48768 44309 50761 77662 72814 39721 37419 57927 49255 49302 43622 26127 22023
95B2023K3505K5517n704P418k3656P20R306J0424n360K124r601O563L3816Q655
$$ 22023 45528 71045 65341 72759 49103 49823 59129 69553 64193 66317 56716 63279 97095 105750
81A05750m66m969l2329q36L526j5058m896o229j266q26K959p086Q154R143Q727
$$ 105750 105284 100315 67986 67150 70676 55618 50722 44493 43227 42401 45360 38274 46428 55571 64298
66F4298M658j0937j7054o491j383j0002j1677J367P35J8677K1472P016o836j1035
$$ 64298 68956 58019 40965 34474 33091 23089 11412 12779 13514 32191 53663 60679 53843 42808
52D2808k0919J6041J9324m057j873P441P422L254r514n737q031m437J831j2418
$$ 42808 21889 37930 57254 53197 51324 58765 66187 69441 59927 54190 46159 41722 43553 31135
38C1135J6417J4431m107j1960k0053P361J3159k612J0284j31O66J382J1469j7665
$$ 31135 47552 61983 57876 45916 25863 33224 46383 43771 54055 53924 54590 55972 67441 49776
24D9776p56K8247K772k1027r793M742j4446k0233l59K1991J1340J1576Q946j49
$$ 49776 49020 77267 80039 59012 49219 53961 39515 19282 18923 40914 52254 63830 72776 72627
10G2627p911j5299J9108Q00k4331J7777K2842N830J191m196
$$ 72627 64716 49417 68525 69325 44994 62771 85613 91443 92634 88438
0H8438
$$ 88438
$$ Imaginary data points
##PAGE= N=2
##DATA TABLE= (X++(I..I)), XYDATA
32767b88092J1356K0122Q414O708J2607J0169p254j3589O130O551j5391R313K3847
$$ -288092 -276736 -256614 -248200 -241492 -228885 -218716 -225970 -239559 -233429 -226878 -242269 -232956 -209109
32754b09109P265P862j7511K2509L9331j3982j702q89n346k490j1871j1957j423
$$ -209109 -201844 -193982 -211493 -188984 -149653 -163635 -165337 -166226 -171572 -174062 -185933 -197890 -199313
32741a99313L446K0234K8200m254J387j8563L229j0259j841l207K7350O909j0793
$$ -199313 -195867 -175633 -147433 -151687 -150300 -168863 -165634 -175893 -177734 -180941 -153591 -146682 -157475
32728a57475L1508J2510l990j1096l8464J677J3951K5866J2720k5187j6929m933
$$ -157475 -125967 -113457 -117447 -128543 -167007 -165330 -151379 -125513 -112793 -137980 -154909 -159842
32716a59842K666q46O50j6381N328J8338J5965k947l317R874L2718J8210k3609
$$ -159842 -157176 -158022 -157372 -173753 -168425 -150087 -134122 -137069 -140386 -130512 -97794 -79584 -103193
32703a03193k6306k503q721L1931M019r873j0497k260Q359R876K0262j776j3246
$$ -103193 -129499 -132002 -140723 -108792 -104773 -114646 -125143 -127403 -119044 -109168 -88906 -90682 -103928
32690a03928J935J725l7112J5060K4365j4054R038J0280J4904J1823J591N269
$$ -103928 -101993 -100268 -137380 -122320 -97955 -112009 -102971 -92691 -77787 -65964 -64373 -59104
32678e9104J3455M251o961q41L391J087k201P835p876q091j878L119j8137k900
$$ -59104 -45649 -41398 -48359 -49200 -45809 -44722 -46923 -39088 -46964 -55055 -56933 -53814 -71951 -74851
32664g4851Q29J9227O158k263n544j5651R565L1884O694M372N185j3835o090j0419
$$ -74851 -74022 -54795 -48637 -50900 -56444 -72095 -62530 -30646 -23952 -19580 -14395 -28230 -34320 -44739
32650d4739J5250L0138O726j3176N715o210j770J1344K577l900l0420k809K7455
$$ -44739 -29489 649 7375 -5801 -86 -6296 -8066 3278 5855 1955 -28465 -31274 -3819
32637c819K6165K5439P467l4426k3166J5957j283m211n250K478L513K190l476
$$ -3819 22346 47785 55252 20826 -2340 13617 12334 8123 2873 5351 8864 11054 7578
32624G578N184O34k123n400R371P528j717N325n668K4330k6845k5770J3081K2941
$$ 7578 12762 13396 11273 5873 15244 22772 21055 26380 20712 45042 18197 -7573 5508 28449
32610B8449K6353k391k2074j3291O526R762j6458K5987L9060k8852k4032k0108
$$ 28449 54802 52411 30337 17046 23572 33334 16876 42863 81923 53071 29039 8931
32598H931Q40J3248K8004k778j1232p428J6612J6401j0600j314M57J0802J6975
$$ 8931 9771 23019 51023 48245 37013 29585 46197 62598 51998 50684 51141 61943 78918
32585G8918M105K2223l130j2616j1234m801K850N146K1521Q04p766j2156O762
$$ 78918 83023 105246 102116 89500 78266 73465 76315 81461 102982 103786 96020 83864 90626
32572I0626R918Q833l31o695L536J2014J2241P69j0042j0012J44K0517J673J4169
$$ 90626 100544 109377 109046 102351 105887 117901 130142 130911 120869 110857 111001 131518 133191 147360
32558A47360q577l7624k1158N883K1032k991n584k137J1114J2959p414j253J7713
$$ 147360 138783 101159 80001 85884 106916 103925 98341 96204 107318 120277 112863 111610 129323
32545A29323j3158p987r720l131K3689O592j7498o218J572J9801p898p217J9155
$$ 129323 116165 108178 98458 95327 119016 125608 108110 101892 103464 123265 115367 108150 127305
32532A27305o373j5968n689L489K4085J8186j5616K348J6426o561j150j4613r58
$$ 127305 120932 104964 99275 102764 126849 145035 129419 131767 148193 141632 140482 125869 124911
32519A24911M4644L54l241r901p776j5620j5201K4808K4482k044r31N371K202
$$ 124911 169555 169909 166668 156767 148991 133371 118170 142978 167460 165416 164485 169856 172058
32506A72058J910L1874j397k5588k528M051K8711J5527q65j2304k7470k9125j1710
$$ 172058 173968 205842 204445 178857 176329 180380 209091 224618 223753 211449 183979 154854 143144
32493A43144N469L7997J727L88k5883j0170J1071o66J1327K5506R994K98J835
$$ 143144 148613 186610 188337 188725 162842 152672 163743 163077 174404 199910 209904 210202 212037
32480B12037k4261M978K9166J0337O486J5164k0788j5694j2349j0280j204K2257
$$ 212037 187776 192754 221920 232257 238743 253907 233119 217425 205076 194796 193592 215849
32468B15849J701j9923k7315Q391j682q05L6996J9640k4541p673O619J3708j4846
$$ 215849 217550 197627 170312 178703 177021 176216 213212 232852 208311 200638 207257 220965 206119
32455B06119J6348K5445q28k2315r642n351o8p220m144P975j8557K4978R484l5884
$$ 206119 222467 247912 247084 224769 215127 209776 209708 202488 198344 206319 187762 212740 222224 186340
32441A86340l7105K9434K3714L0946Q515O325n840j013j1807k1504K3915J3622
$$ 186340 149235 178669 202383 233329 241844 248169 242329 241316 229509 208005 231920 245542
32429B45542j7891r071k2316o699J2840J6432J1386j1654j126M055R230m797P173
$$ 245542 227651 218580 196264 189565 202405 218837 230223 218569 217443 221498 230728 225931 233104
32416B33104J7394j7801M501K961q006k7760K215K9662J3868J8740N04m191k9394
$$ 233104 250498 232697 237198 240159 232153 204393 206608 236270 250138 268878 269382 265191 235797
32403B35797j0122J4370k83o889M05k0198J7166j033n477l729q194j5156K0168
$$ 235797 225675 240045 239762 232873 233278 213080 230246 229213 223736 220007 211813 196657 216825
32390B16825Q869j9139J932L5546L1587J3328k1109j387P943j8614j7168r615
$$ 216825 225694 206555 208487 244033 275620 288948 267839 266452 274395 255781 238613 228998
32378B28998J3523R5Q30J77K3485J7534n605n823l321j2197Q688j3532o317O216
$$ 228998 242521 242616 243446 243623 267108 284642 279037 273214 269893 257696 266384 252852 246535 252751
32364B52751j4315K0032K0748l1978J0728J3233k5545j4533j9352Q035J7711M937
$$ 252751 238436 258468 279216 247238 257966 271199 245654 231121 211769 219804 237515 242452
32352B42452p305n480o357J551J1551M331N67K546K0007N844j971k607j3024j6932
$$ 242452 235147 229667 223310 224861 236412 240743 241310 243856 263863 269707 267736 265129 252105 235173
32338B35173J1153K9468J1291L109k2229j4166J7997R032N043o471j8850k1174
$$ 235173 246326 275794 287085 290194 267965 253799 271796 280828 285871 279400 260550 239376
32326B39376K568Q537J1416j0320j6955J6016J1601p103Q743L0606k65R491K5841
$$ 239376 241944 250481 261897 251577 234622 250638 262239 255136 263879 294485 294220 303711 329552
32313C29552j2476l8716j2727l02K776m079J7834j1737O63Q332J183j3086q624
$$ 329552 317076 278360 265633 265331 268107 264028 281862 270125 270788 279120 280303 267217 258593
32300B58593L794j076L3241j0512P025j6245j2728K2980Q143j4062N91K525l57
$$ 258593 262387 261311 294552 284040 291065 274820 262092 285072 293215 279153 279744 282269 281912
32287B81912Q946j756j2782j9455l531L0597K830n822k1383j4628K8779K1060
$$ 281912 290858 289102 276320 256865 253334 283931 286761 280939 259556 244928 273707 294767
32275B94767q636P867K3604m396O857k7800l4137K32K283L0754J5659J1072p787
$$ 294767 286131 293998 317602 313206 320063 292263 258126 258358 260641 291395 307054 318126 310339
32262C10339j0452l5676j5670J0562J2810J305O936J6190J5629k928q39l7306
$$ 310339 299887 264211 248541 259103 271913 273218 280154 296344 311973 309045 308206 270900
32250B70900j1836J2706J1321K2316L175J457R782P184K1422J6928k904k3327
$$ 270900 259064 271770 283091 305407 308582 310039 319821 327005 348427 365355 362451 339124
32238C39124k1323k7619r589J2831J0688j9429l792K7444K1640k1326k2538K4063
$$ 339124 317801 290182 280593 293424 304112 284683 280891 308335 329975 308649 286111 310174
32226C10174J6923j3693k1995k3670k652J3347K1810J655j559P465p535k6410
$$ 310174 327097 313404 291409 267739 265087 278434 300244 301899 300340 307805 300270 273860
32214B73860O414j873P700P965O354m652O24J4615M4926J1292l6677j7548J9010
$$ 273860 280274 278401 286101 294066 300420 295768 296392 311007 355933 367225 330548 313000 332010
32201C32010J5823Q434k0043k991J7131j2800L975l494j4548o061k8987P431P721
$$ 332010 347833 356267 336224 333233 350364 337564 341539 338045 323497 317436 288449 295880 303601
32188C03601K7278r089Q468l1969r010K1786j6151l6687L4506K202K0111l399
$$ 303601 330879 321790 330258 298289 289279 311065 294914 258227 292733 294935 315046 311647
32176C11647p826j4788K361o182M446k8869J8729J7254J480J4161O515J5461m000
$$ 311647 303821 289033 291394 285212 289658 260789 279518 296772 298252 312413 318928 334389 330389
32163C30389j2023j8903m671K3613k682l4369j2829R581K5989N434J8090p10q131
$$ 330389 318366 299463 294792 318405 315723 281354 268525 278106 304095 309529 327619 326909 318778
32150C18778j6160k1937o734K663K6814J1030j9846J1178J2967K872j3753k474
$$ 318778 302618 280681 273947 276610 303424 314454 294608 305786 318753 321625 307872 305398
32138C05398l4187k9181k92M1045J7151k3330j2832j2011R377J3079Q246J2982
$$ 305398 271211 242030 241738 282783 299934 276604 263772 251761 261138 274217 282463 295445
32126B95445J524L0723J2314l0959j7182M429N793r041K0057k7839l6633K7589
$$ 295445 296969 327692 340006 309047 291865 296294 302087 293046 313103 285264 248631 276220
32114B76220J4607J2612l8530P663K0410r878L7707q738k8897j6732J1535J1490
$$ 276220 290827 303439 264909 272572 292982 283104 320811 312073 283176 266444 277979 289469
32102B89469p331O137K9952j734M729k6581l5913P369J851J4607j6613p818K7279
$$ 289469 282138 288275 318227 316493 321222 294641 258728 266097 267948 282555 265942 258124 285403
32089B85403k003K65J5467M297J253J45j5298l2594O675P623L769K7167J7182
$$ 285403 283400 283665 299132 303429 304682 304827 289529 256935 263610 271233 275002 302169 319351
32076C19351p919j4889L547q120M798l4168j6448K0758p270N455L0048m192M10
$$ 319351 311432 296543 300090 291970 296768 262600 246152 266910 259640 265095 295143 290951 291361
32063B91361Q215k604j7653l126N474m073J6170Q495k5501J6271J4684j6322l5615
$$ 291361 299576 296972 279319 276193 281667 277594 293764 302259 276758 293029 307713 291391 255776
32050B55776p149K9698J459K880o214p710J8266o76L2985J3194k4474j4584j6596
$$ 255776 248627 278325 279784 282664 276450 268740 287006 286330 319315 332509 308035 293451 276855
32037B76855K5397O291m67m622P363m247j1763J8158L2143j3207j4030R910R366
$$ 276855 302252 308543 308076 303454 310817 306570 294807 312965 345108 331901 317871 327781 337147
32024C37147j0194j8037m442p115n359P447R647J0267j1899J2336o300N316J199
$$ 337147 326953 308916 304474 297359 292000 299447 309094 319361 307462 319798 313498 318814 320013
32011C20013J4095m559j3878j3475K428J2538p310J0945k1554j0436l25J4170
$$ 320013 334108 329549 315671 302196 304624 317162 309852 320797 299243 288807 288482 302652
31999C02652J9695j4248p986J1384J1737k900P434R464M742J0563j5387j7695
$$ 302652 322347 308099 300113 311497 323234 320334 327768 337232 341974 352537 337150 319455
31987C19455j6034O714J481j3789k9987R73J988q594N657M2076J2590j640K627
$$ 319455 303421 310135 311616 297827 267840 268813 270801 262207 267864 309940 322530 320890 323517
31974C23517J078j9756O977K3211M73j0444J75Q140J0612r959l3274j1169j1316
$$ 323517 324595 304839 311816 335027 335500 325056 325231 333371 343983 334024 300750 289581 278265
31961B78265P466K0089o800k2870j0157L7746J3341j0609k933p038q722N984K5520
$$ 278265 285731 305820 299020 276150 265993 303739 317080 306471 303538 296500 287778 293762 319282
31948C19282O509n309p242k2185M14K2564K1066j8448j620k067q290j7780q029
$$ 319282 325791 320482 313240 291055 291469 314033 335099 316651 315031 312964 304674 286894 278865
31935B78865R278L510J887n779R405M6927Q564l4694q254J5926K4101j9120l502
$$ 278865 288143 291653 293540 287761 297166 344093 352657 317963 309709 325635 349736 330616 327114
31922C27114J8262p826j4802K662l705j8514j3626J9840J1803o091k5992L862
$$ 327114 345376 337550 322748 325410 321705 303191 289565 309405 321208 315117 289125 292987
31910B92987J962K2328M8738L0629l0495j8555J92k1352k7060Q387K781J4152
$$ 292987 294949 317277 366015 396644 366149 347594 347786 326434 299374 307761 310542 324694
31898C24694N438J4318l5332j0046J1503j25q895j7672m430p881j670L39q856
$$ 324694 330132 344450 309118 299072 310575 310450 301555 283883 279453 271572 269902 270241 261385
31885B61385j8623n056N980J872K2999K9741j0307p741J0100n717O09K596J2808
$$ 261385 242762 237706 243686 245558 268557 298298 287991 280250 290350 284633 285242 287838 300646
31872C00646j967J3598o154K78L0622N136q114O36K009q886k9562k962K5438Q364
$$ 300646 298679 312277 306123 306401 337023 342159 334045 334681 336690 327804 298242 295280 320718 329082
31858C29082N201J3976m072l5564k8567J0873M782j0971j4570K7447K6330k8924
$$ 329082 334283 348259 344187 308623 280056 290929 295711 284740 270170 297617 323947 295023
31846B95023J4295J9687j3410M373J3098r954k9482O7P864N255K0618o961p995
$$ 295023 309318 329005 315595 319968 333066 323112 293630 293697 301561 306816 327434 320473 312478
31833C12478J669P601j5572n265J662j5095j8396J750O779L1265M975k741j394
$$ 312478 314147 321748 306176 300911 302573 287478 269082 270832 277611 308876 313851 311110 309716
31820C09716j6051p519K103m670p90J3223K5247L5561p306k1231l099J318o239
$$ 309716 293665 286146 288249 283579 282789 296012 321259 356820 349514 328283 325184 326502 320263
31807C20263m234K5162r493k2905r269j8843r372J4223K0863R825m452j0565M555
$$ 320263 316029 341191 331698 308793 299524 280681 271309 285532 306395 316220 311768 301203 305758
31794C05758N287R8m219J3443j305j9225j2117j2549r166R231K4004l2995q89
$$ 305758 311045 311143 306924 320367 319062 299837 287720 275171 266005 275236 299240 266245 265356
31781B65356K1482K5112J7190N12j5999j8661J9006O918j523l4352k7276J542
$$ 265356 286838 311950 329140 329652 313653 294992 313998 320916 319393 285041 257765 259307
31769B59307J8850K4566K4574n550j1093m195L288J5343J4629j943K7043L916
$$ 259307 278157 302723 327297 321747 310654 306459 309747 325090 339719 337776 364819 368735
31757C68735n640j4781R152j71j9251k0176n53j1017k787k8187k6093K6988J6151
$$ 368735 363095 348314 357466 357295 338044 317868 317315 306298 303511 275324 249231 276219 292370
31744B92370J9077J1716K0662p070k8694j3699O56O628q942R349n678J3442O435
$$ 292370 311447 323163 343825 336755 308061 294362 295018 301646 292704 302053 296375 309817 316252
31731C16252j201N819M3264j6674n462k9155j8389L436k1756q9O580k968L709
$$ 316252 315051 320870 364134 347460 341998 312843 294454 297890 276134 276045 282625 279657 283366
31718B83366Q686K0088j4841k2152L581L4599k897j0564j466j4985k436L5547
$$ 283366 292052 312140 297299 275147 278728 313327 310430 299866 298400 283415 280979 316526
31706C16526j257k2025r834q964M39K5033J1790J4485J6557l6505k5658Q103J0516
$$ 316526 315269 293244 283410 274446 274885 299918 311708 326193 342750 306245 280587 288690 299206
31693B99206k0616p496M070j4771J560k604R477K4511N511P839J4407K205M950
$$ 299206 278590 271094 275164 260393 261953 259349 268826 293337 298848 306687 321094 323299 328249
31680C28249j7003j1219j3633n254J5057K1800J4333o966l8925p401K6847k0978
$$ 328249 311246 300027 286394 281140 296197 317997 332330 325364 286439 279038 305885 284907
31668B84907j8967P553Q537p547N436K976J1853j7436k313O220K0632L053J405
$$ 284907 265940 273493 282030 274483 279919 282895 294748 277312 274999 281219 301851 304904 306309
31655C06309j541m380k9558J1852n632j2233p270J0476K3247J9086J1074M021
$$ 306309 304768 300388 270830 282682 277050 264817 257547 268023 291270 310356 321430 325451
31643C25451J205L291j1679n448m466k0576Q021K1219J2458P848O282k3805o686
$$ 325451 326656 329947 318268 312820 308354 287778 295799 317018 329476 337324 343606 319801 313115
31630C13115J315j0602n571M362P296o535n067r354j2842J973N567k19j0545j9947
$$ 313115 314430 303828 298257 302619 309915 303380 298313 288959 276117 278090 283657 283438 272893 252946
31616B52946Q355M0302K4167j3453K0473J9369k977N472P670q113j0330N260k256
$$ 252946 261301 301603 325770 312317 332790 352159 349182 354654 362324 354211 343881 349141 346885
31603C46885k0988n874o40O950r692m046l568o824j8642J8232J3195j2084J8365
$$ 346885 325897 320023 319383 326333 316641 312595 309027 302203 283561 301793 314988 302904 321269
31590C21269M866j5969p991K3159Q39p343j4444J1230k076k1039j8789q869K5678
$$ 321269 326135 310166 302175 325334 326173 318830 304386 315616 313540 292501 273712 264843 290521
31577B90521J9656k9227j4213J4608q288J3678Q211p398p646p62K44K5533j249
$$ 290521 310177 280950 266737 281345 273057 286735 294946 287548 279902 279140 279384 304917 303668
31564C03668K855q156n674K1303p152j9450R592j002j288O056R75J6186p649k8912
$$ 303668 306523 298367 292693 313996 306844 287394 296986 295984 294696 300752 301727 317913 310264 281352
31550B81352L227K2265N806k811M458j8097m548O879K552J9649q249j1942l500
$$ 281352 284579 306844 312650 309839 314297 296200 291652 298531 301083 320732 312483 300541 297041
31537B97041P094p468J7104n362k106k7171L924L5056k7012j2504o072l026J3520
$$ 297041 304135 296667 313771 308409 306303 279132 283056 318112 291100 278596 272524 269498 283018
31524B83018K5056L5673L05j3443p766j3163K9115k108k3687j873J5040n9j4320
$$ 283018 308074 343747 344052 330609 322843 309680 338795 336687 313000 311127 326167 326108 311788
31511C11788j745Q666j1131k2428j8024J9141j073K0145K3678Q985k4182M477
$$ 311788 310043 318709 307578 285150 267126 286267 285194 305339 329017 338002 313820 318297
31499C18297K882l744j3419q355j994K3597q267j6478L1849J2074K0566k1093
$$ 318297 321179 317435 304016 295661 293667 317264 308997 292519 324368 336442 357008 335915
31487C35915l4565j4380m121J4010K7941J5448j3756J5097p648j9711k2153R429
$$ 335915 301350 286970 282849 296859 324800 340248 326492 341589 333941 314230 292077 301506
31475C01506J8471m108L663N894k297l601K1327o946J88N881J0524M801k9340
$$ 301506 319977 315869 319532 325426 323129 319528 340855 333909 334097 339978 350502 355303 325963
31462C25963l1516j1044j3055j4879J9172j257p973K7680N612Q846r740K3551
$$ 325963 294447 283403 270348 255469 274641 273384 265411 293091 298703 307549 297809 321360
31450C21360L4207J5911o28j0412n757o186k931N674K0696j1971j4800j6610J0958
$$ 321360 355567 371478 370850 360438 354681 348495 345564 351238 371934 359963 345163 328553 339511
31437C39511J7727J133o908k4971l815P458K4330n255m0939j0327K7294J7992
$$ 339511 357238 358371 351463 326492 322677 330135 354465 349210 308271 297944 325238 343230
31425C43230k5858J7827J0326k0513K2145L4732M54m5702j0468j5339j5130J8182
$$ 343230 317372 335199 345525 325012 347157 381889 382343 336641 326173 310834 295704 313886
31413C13886J5480j3620k0073J3639j4105k7435n861J7307O3882L7638k528k5595
$$ 313886 329366 315746 295673 309312 295207 267772 261911 279218 343100 380738 378210 352615
31401C52615j1862k7139k6200Q290J2065l925Q427l479J538J1137r304k5316J3070
$$ 352615 340753 313614 287414 295704 307769 303844 312271 308792 310330 321467 312163 286847 299917
31388B99917L544j6445N898P162j0225L078m479k912j0924j2300K2778Q109j924
$$ 299917 303461 287016 292914 300076 289851 292929 288450 285538 274614 262314 285092 293201 291277
31375B91277N779j4064J6969l8245M408K5998J9349K2370K922J102n380j2773
$$ 291277 297056 282992 299961 261716 266124 292122 311471 333841 336763 337865 332485 319712
31363C19712O13K5131j15p971j4069j175q219L4940K2733j0659q919n3021j6984
$$ 319712 320325 345456 345341 337370 323301 322126 313907 348847 371580 360921 352002 298981 281997
31350B81997K3982J9617J2188P122j5119J0097j2193k2973q066M218L976R7J3976
$$ 281997 305979 325596 337784 344906 329787 339884 327691 304718 296652 300870 304846 304943 318919
31337C18919Q226k5608j5270N630J051R01o538l590J8378K6023n670j4653p42
$$ 318919 327145 301537 286267 291897 292948 293849 287311 283721 302099 328122 322452 307799 307057
31324C07057K2036K3755n751r344M105M1568M502k8379j996j0477l9478J1807
$$ 307057 329093 352848 347097 337753 341858 383426 387928 359549 357553 347076 307598 319405
31312C19405K4122j7620J7752J3054j3145j0305K502j2743j0498j6253p951p978
$$ 319405 343527 325907 343659 356713 343568 333263 335765 323022 312524 296271 288320 280342
31300B80342l645J9463K244J8515j3986n21J0078J7880j3531k3637O937R84k3454
$$ 280342 276697 296160 298404 316919 302933 302412 312490 330370 316839 293202 300139 301123 277669
31287B77669Q747L4694J2129j3808l2897N497k675j4426k429L7574O690N053R477
$$ 277669 286416 321110 333239 319431 286534 292031 289356 274930 272501 310075 316765 321818 331295
31274C31295j4696J8566M898j7027J151j807l3427j2357N985K6771j936l062K8662
$$ 331295 316599 335165 340063 323036 324187 322380 288953 276596 282581 309352 307416 304354 333016
31261C33016j6434O778J5707k5869J2294j6725J0434J7692j9500k9308R788O039
$$ 333016 316582 323360 339067 313198 325492 308767 319201 336893 317393 288085 297873 303912
31249C03912J9817N637j2977J664N040l9943k6364o618J256K5041L454K7110o9
$$ 303912 323729 329366 316389 318053 323093 283150 256786 250168 251424 276465 279919 307029 306960
31236C06960Q903rM714L1653L3481l0026j4146j2875O584L622l778l197k0990
$$ 306960 315863 315854 320568 352221 385702 355676 341530 328655 335239 338861 335083 331886 310896
31223C10896l7163N712L0302o986K674J51l505J4497j2048j6123N866Q975j1558
$$ 310896 273733 279445 309747 302761 305435 305586 302081 316578 304530 288407 294273 303248 291690
31210B91690K336j7048L155j350O211J7174K6026J0303l969k0462j275L0873J015
$$ 291690 294026 276978 280133 278783 284994 302168 328194 338497 334528 314066 312791 343664 344679
31197C44679j5056r611p973J7572J4492K2031n937m8765M280J8118o683k96M235
$$ 344679 329623 320012 312039 329611 344103 366134 360197 311432 315712 333830 327147 326851 331086
31184C31086J5262r536l6159J341Q283k6377p556L0347L2729L030q479j5523L113
$$ 331086 346348 336812 300653 301994 310277 283900 276344 306691 339420 342450 333971 318448 321561
31171C21561R260j8004l245K6989j2202p496k39J4061l809k3788j4991J5930K3708
$$ 321561 330821 312817 309572 336561 324359 316863 316624 330685 326876 303088 288097 304027 327735
31158C27735j0608j5921p663j6017J7028L7498O032k7439k0945k886j2995j6808
$$ 327735 317127 301206 293543 277526 294554 332052 338084 310645 289700 286814 273819 257011
31146B57011K337K8794J9400R598r461J9651J6774O002j5789o997L769k461j1789
$$ 257011 259348 288142 307542 317140 307679 327330 344104 350106 334317 327320 331089 328628 316839
31133C16839J611O216j2795m862Q84p746K908k1589l9P309J8754J0968R576k3752
$$ 316839 318450 324666 311871 307009 307893 300147 303055 281466 281427 288736 307490 318458 328034 304282
31119C04282n793o495n95J5397L2222j8586j0147L4946l044K8468J4346j1182
$$ 304282 298489 291994 291399 306796 339018 320432 310285 345231 342187 370655 385001 373819
31107C73819j4802l1714k0775L4042j387J3325q778j3154J5662P29k4242j8276
$$ 373819 359017 327303 306528 340570 339183 352508 343730 330576 346238 346967 322725 304449
31095C04449M928J9643O133j2711Q386m478K805j1893K83K3141p985j2003j7785
$$ 304449 309377 329020 335153 322442 330828 326350 329155 317262 317545 340686 332701 320698 302913
31082C02913R44K755j3595l446q127J1398M896J185R275J2948J3769J8020l222
$$ 302913 303857 306612 293017 289571 281444 292842 297738 298923 308198 321146 334915 352935 349713
31069C49713j2464j2730K0046K2615j9179l4826k9588R960J7090K1879q505l2787
$$ 349713 337249 324519 344565 367180 348001 313175 283587 293547 310637 332516 324011 291224
31057B91224m889L653J6694K5554q805j2566K4875L7707l6470l1680k7868R341
$$ 291224 286335 289988 306682 332236 323431 310865 335740 373447 336977 305297 277429 286770
31045B86770J6181J058k0305n774K5011P90J4775n728k6541J463R688K0406k1874
$$ 286770 302951 304009 283704 277930 302941 303731 318506 312778 286237 287700 297388 317794 295920
31032B95920j1412N935j6269o927K1279R515J6734J3485J7073N762j8020j9320
$$ 295920 284508 290443 274174 267247 288526 298041 314775 328260 345333 351095 333075 313755
31020C13755j0710j0529k960J367J581J1534l565j3201K142j0695J4397J3260
$$ 313755 303045 292516 289556 290923 292504 304038 300473 287272 289414 278719 293116 306376
31008C06376L459K1015N53J7240J7069l4629m3528N308K2869J1587j0357J3020
$$ 306376 309835 330850 331403 348643 365712 331083 287555 292863 315732 327319 316962 329982
30996C29982R291J04M73j0416k3896k907K8376J8638l5977m646K1883m98k4591
$$ 329982 339273 339377 339850 329434 305538 302631 331007 349645 313668 309022 330905 330407 305816
30983C05816J9283K8540N198k5639j5674r885p834J5288J6098K022pP441l809
$$ 305816 325099 353639 358837 333198 317524 307639 299805 315093 331191 333213 333206 340647 336838
30970C36838j0165j3565k287R204k0314j09K3900J5683n5751j5543K3803O149
$$ 336838 326673 313108 310821 320025 299711 299602 323502 339185 283434 267891 291694 297843
30958B97843n313J1991P316l470N195J3168j9091J7908J8518J1392j6911k6875
$$ 297843 292530 304521 311837 308367 313562 326730 307639 325547 344065 355457 338546 311671
30946C11671K1682J6860J2609R413m951m609k80k8879l8994j2629J0985J2526
$$ 311671 333353 350213 362822 372235 367284 362675 362395 333516 294522 281893 292878 305404
30934C05404J2160l654J7806j5236k3972N012j437J0082j4944j5804J2313K6060
$$ 305404 317564 313910 331716 316480 292508 297520 296083 306165 291221 275417 287730 313790
30922C13790l383N713J3250J3899J0899j1887l747p287N977O777p546J233l882
$$ 313790 310407 316120 329370 343269 354168 342281 338534 331247 337224 344001 336455 337688 333806
30909C33806J536k862r310j3790J4859L6052J4235J0479j6137o889k44k4420m0058
$$ 333806 335342 332480 323170 309380 324239 360291 374526 385005 368868 361979 361735 337315 297257
30896B97257J1217j6514L1491L24k0003K9633J7492n607j8831J3036P13M995J311
$$ 297257 308474 291960 323451 323775 303772 333405 350897 345290 326459 339495 340208 345203 346514
30883C46514k5718O954p823J7562j0382j7908J1208p967k7303J3001J1225M046
$$ 346514 320796 327750 319927 337489 327107 309199 320407 312440 285137 298138 309363 313409
30871C13409j6220K2095J0572P66q698j0295J5286K0380J0317N289p85J8838j8161
$$ 313409 297189 319284 329856 330622 321924 311629 326915 347295 357612 362901 362116 380954 362793
30858C62793q26j2846j1749k1734k515K1450J182l9855K628K360j4037N84j1297
$$ 362793 361967 349121 337372 315638 313123 334573 335755 295900 298528 300888 286851 287435 276138
30845B76138J9490N8724Q620k9865j6973k9790l1256m65L1363O999J6175J5214
$$ 276138 295628 354352 362972 333107 316134 286344 255088 254623 285986 292985 309160 324374
30833C24374j8312K394N818q75J0346p327K2636P146L84j2050j8412m223j8405
$$ 324374 306062 308456 314274 313399 323745 316418 339054 346200 346584 334534 316122 311899 293494
30820B93494J0046J1430J1840k66j8309j2466J1216J9155J1074n549M146L0913
$$ 293494 303540 314970 326810 326544 308235 295769 306985 326140 337214 331665 335811 366724
30808C66724J2320n907j4984j4179j2520k2213J0184N147k2934j6662N479J3140
$$ 366724 379044 373137 358153 343974 331454 309241 319425 324572 301638 284976 290455 303595
30796C03595K1409n345k345M67N209R255j1278K918k7626J5044J3522k425q982
$$ 303595 325004 319659 317314 317781 322990 332245 320967 323885 296259 311303 324825 322400 313418
30783C13418O419J6088K6814N141n625j7103J790R690j6821m502j0163j4074j6964
$$ 313418 319837 335925 362739 367880 362255 345152 346942 356632 339811 335309 325146 311072 294108
30770B94108J3910J1635q647R312j4970L720K1228L728J098p994o495o711m682
$$ 294108 308018 319653 311006 320318 305348 309068 330296 334024 335122 327128 320633 313922 309240
30757C09240J4469J0790k2913j3991L5062M270k5463p365K3926p956j0639l659
$$ 309240 323709 334499 311586 297595 332657 336927 311464 304099 328025 320069 309430 305771
30745C05771J4625Q631K070j4321L8571j5677j0998J2771j3073o209l480J457
$$ 305771 320396 329027 331097 316776 355347 339670 328672 341443 328370 322161 318681 320138
30733C20138N374L6383J3786k5663k0451o522l072LJ708K0039q954j9819O366
$$ 320138 325512 361895 375681 350018 329567 323045 319973 319976 321684 341723 332769 312950 319316
30720C19316p201j1545j0526J2359L871J5811L5290N409k7192k0257k7126q139
$$ 319316 312115 300570 290044 302403 306274 322085 357375 362784 335592 315335 288209 280070
30708B80070k3033L0031K9694j212j4J2133J0334J4916R030j6106L933Q974j8187
$$ 280070 257037 287068 316762 315550 315536 327669 338003 352919 361949 345843 349776 358750 340563
30695C40563j9062k8125K8116O726M58P601P330j0784k2879N437J0263l897M285
$$ 340563 321501 293376 321492 328218 328676 336277 343607 332823 309944 315381 325644 321747 326032
30682C26032k0599N24N3468K1048n2759j6331j2285N389j2993N851M1913K2050
$$ 326032 305433 305957 359425 380473 327714 311383 299098 304487 291494 297345 339258 361308
30670C61308j2040J2378L363J0449p651o082L222R327k9186J4224L216j0800j4628
$$ 361308 349268 361646 365009 375458 367807 361725 364947 374274 345088 359312 362528 351728 337100
30657C37100l4295j9164R076J6717K5952J7612N356l2512j5605n847P358M3084
$$ 337100 302805 283641 292717 309434 335386 352998 358354 325842 310237 304390 311748 354832
30645C54832K1769J037q965N510j9781k4265J4356J6965j2189j6970l6560m4017
$$ 354832 376601 377638 368673 374183 354402 330137 344493 361458 349269 332299 295739 251722
30633B51722R227J5282K6018J3723K1073L944l333M182K6130j5262n733J0770
$$ 251722 260949 276231 302249 315972 337045 340989 337656 341838 367968 352706 346973 357743
30621C57743p117K234j0399r507K7439j9274O499Q93p465k2506l974o113K762
$$ 357743 350626 352860 342461 332954 360393 341119 347618 348511 341046 318540 314566 308453 311215
30608C11215J7976N554k4431l3275P031J5065m929K2755J9791j2289k0149k192
$$ 311215 329191 334745 310314 277039 284070 299135 294206 316961 336752 324463 304314 302122
30596C02122L5827K5395K6872j0111q097l761P547j2594k4736j7070q116J695
$$ 302122 337949 363344 390216 380105 372008 368247 375794 363200 338464 321394 313278 314973
30584C14973K4859R625k6415k493K462O433j2694R756M858o632q238J2377J7719
$$ 314973 339832 349457 323042 320549 323011 329444 316750 326506 331364 324732 316494 328871 346590
30571C46590J8941m150k9223l5389l687N929K7356k0684K0331K0686K0742O185
$$ 346590 365531 361381 332158 296769 293082 299011 326367 305683 326014 346700 367442 373627
30559C73627j7077j4280j3995j0372J8237k936k6770m081L345N856o33j0177o743
$$ 373627 356550 342270 328275 317903 336140 333204 306434 302353 305698 311554 310921 300744 294001
30546B94001J971L1283O206l6036R727L6718J3855r787j3726j1456O527j5030
$$ 294001 295972 327255 333461 297425 307152 343870 357725 347938 334212 322756 329283 314253
30534C14253J3481n11q322k0857j0410o111J1111Q835j5295J3871J758J411j1820
$$ 314253 327734 327223 318901 298044 287634 281523 292634 301469 286174 300045 301803 303214 291394
30521B91394j6435K90J179J0302J290J0829J4132k322L488j3025N651k0452K5235
$$ 291394 274959 275249 276428 286730 288020 298849 312981 310659 314147 301122 306773 286321 311556
30508C11556K5342J435k3040J1060R060k8881P867K5088J8679P27j0688j5169
$$ 311556 336898 338333 315293 326353 335413 306532 314399 339487 358166 358893 348205 333036
30496C33036j7241J5841O525J3856J9092O498j4351k2827m3762j3016J3411K0622
$$ 333036 315795 331636 338161 352017 371109 377607 363256 340429 296667 283651 297062 317684
30484C17684P743J2673J5843r703P574J5269J7132N401l0262j4166N396p443J1628
$$ 317684 325427 338100 353943 344240 351814 367083 384215 389616 359354 345188 350584 343141 354769
30471C54769o723K045j219k7695J6598R228n286J280o230k1368K9076K0775J1561
$$ 354769 348046 350091 348872 321177 337775 347003 341717 342997 336767 315399 344475 365250 376811
30458C76811r643j1666k6335K21J9972o238n473k4780J2362R200k4627J8184K5050
$$ 376811 367168 355502 329167 329388 349360 343122 337649 312869 325231 334431 309804 327988 353038
30445C53038l212O875j5m4388k7968J8098J7968J4572j4735r901L6472O202k4024
$$ 353038 349826 356701 356686 312298 284330 302428 320396 334968 320233 310332 346804 353006 328982
30432C28982j1124k2458o891K552m604j9227J2812o10n132J0355J5225J3393r199
$$ 328982 317858 295400 288509 291061 286457 267230 280042 279432 274300 284655 299880 313273 304074
30419C04074Q463M067j4427l735J1983K7908K4226j3850k2681M579J5099N727
$$ 304074 312537 316604 302177 298442 310425 338333 362559 348709 326028 330607 345706 351433
30407C51433j7214j66P514K257k6370O448L018l340n0545r400J355J8943J9692
$$ 351433 334219 334053 341567 343824 317454 323902 326920 323580 273035 263635 264990 283933 303625
30394C03625Q921M875k141q976k1410K5755p775k275r659J5528q757J0748J9609
$$ 303625 312546 317421 315280 306304 284894 310649 302874 300599 290940 306468 297711 308459 328068
30381C28068L7352Q211r962k2551l1894j6622p483O158J9741l529j636J431J5809
$$ 328068 365420 373631 363669 341118 309224 292602 285119 291277 311018 307489 305853 307284 323093
30368C23093J3191M691L1311j6783J7169K754k0280n6878K0143K3702N713J3328
$$ 323093 336284 340975 372286 355503 372672 375426 355146 298268 318411 342113 347826 361154
30356C61154r845j2949q790J1573Q78J2322l5287j3577O163J7786P483J2439j4639
$$ 361154 351309 338360 329570 341143 342021 354343 319056 305479 311642 329428 336911 349350 334711
30343C34711l4775J1630K5594j0426M1797J9418l8270k0513L164L009l644j024
$$ 334711 299936 311566 337160 326734 368531 387949 349679 329166 332330 335339 331695 330671
30331C30671R860j1860J2767K9513m0274j9416J4012K0185j7019l5466J23j1721
$$ 330671 340531 328671 341438 370951 330677 311261 325273 345458 328439 292973 293096 281375
30319B81375L924Q35j4700M7329r710j0490K2582J4420J3704M106J9488J6040
$$ 281375 285299 286134 271434 318763 309053 298563 321145 335565 349269 353375 372863 388903
30307C88903j7299j1221j1856J84l004J2800j4126j3473J089J238L093k8869j2454
$$ 388903 371604 360383 348527 348711 345707 358507 344381 330908 331997 333235 336328 307459 295005
30294B95005O100J9490J8608J9080K2165L261R23j1952k8796j1787m030o893O096
$$ 295005 301105 320595 339203 358283 380448 383709 384632 372680 343884 332097 328067 321174 327270
30281C27270J8008j4367j4482j1579R277j0963k9202j6362M5246K2607M73N751
$$ 327270 345278 330911 316429 304850 314127 303164 273962 257600 302846 325453 325926 331677
30269C31677k903Q361P952K4280j0001k5305r884L5366k636j4739K4718J4175
$$ 331677 328774 337135 345087 369367 359366 334061 324177 359543 356907 342168 366886 381061
30257C81061k0632l7933q419N126M204k7583l397K4454l806L2424J3198k1475
$$ 381061 360429 322496 314077 319203 323407 295824 292427 316881 313075 345499 358697 337222
30245C37222m538K2308L227M529j8108j2604l214K3284M474o720k5815l632n678
$$ 337222 332684 354992 358219 362748 344640 332036 328822 352106 356580 349860 324045 320413 314735
30232C14735J5778J2418m419k097J2942j2437j684L3740J827k2824j0220j297
$$ 314735 330513 342931 338512 336415 349357 336920 335236 368976 370803 347979 337759 336462
30220C36462n903p145K3500J2707p12P916N185j3183O978K2156K5267K373k1726
$$ 336462 330559 323414 346914 359621 358909 366825 372010 358827 365805 387961 413228 415601 393875
30207C93875k7051j8695p823J1228L032j2763k8282K2392J4999j5434Q99o361
$$ 393875 366824 348129 340306 351534 354566 341803 313521 335913 350912 335478 336377 330016
30195C30016J513k3501K702K1595J257K494j3358j1342j8642N961P283N849k796
$$ 330016 331529 308028 310730 332325 333582 336076 322718 311376 292734 298695 305978 311827 309031
30182C09031j2653O628j2767j6684q990K3898K471J4654J3294P421O952J1442
$$ 309031 296378 303006 290239 273555 264565 288463 290934 305588 318882 326303 333255 344697
30170C44697o598K70j6853K1937J3379J8079q184j0207K143j4010j3922j7385
$$ 344697 338099 338369 321516 343453 356832 374911 366727 356520 358663 344653 330731 313346
30158C13346M244K0980J0486K2396j6848k4975o174K0832J7157k2374k6497J512
$$ 313346 317590 338570 349056 371452 354604 329629 323455 344287 361444 339070 312573 314085
30146C14085P631L618j3083O847J348j0382q552j8066K5952J2453J9743J2758
$$ 314085 321716 325334 312251 319098 320446 310064 301512 283446 309398 321851 341594 354352
30134C54352j1436k1493k6519Q141j991L253O839k2420j326J2779j0104J4967
$$ 354352 342916 321423 294904 303045 301054 304307 311146 288726 287400 300179 290075 305042
30122C05042K2084K0129K201j5228j8406n041K6444O322J5626r304J3644J3847
$$ 305042 327126 347255 349456 334228 315822 310781 337225 343547 359173 349869 363513 377360
30110C77360l0933k045J5958k2458l2213K1325J6257L2794j4456j9659J6522M668
$$ 377360 346427 344382 360340 337882 305669 326994 343251 376045 361589 341930 358452 363120
30098C63120k7801j6421j9714L711L351r676J1011J8858J612j4269o177N930K550
$$ 363120 335319 318898 299184 302895 306246 296570 307581 326439 328051 313782 307605 313535 316085
30085C16085K2757Q371j2509Q076n086n165r573K3888k9232p482P932n244l288
$$ 316085 338842 347213 334704 342780 337694 332529 322956 346844 317612 310130 318062 312818 309530
30072C09530J9113R249k2062j8088R205K0635K3857J5642o899k5316J2500J9599
$$ 309530 328643 337892 315830 297742 306947 327582 351439 367081 360182 334866 347366 366965
30060C66965R346m0837k6750O524N99O620j0275K250k2384k972K2090l582K656
$$ 366965 376311 335474 308724 315248 315847 322467 312192 314442 292058 289086 311176 307594 310250
30047C10250O389r170R144L5200n110n77M998O683M3268j4376m7776j6479P583
$$ 310250 316639 307469 316613 351813 346703 346126 351124 357807 401075 386699 338923 322444 330027
30034C30027P957J5570p974k9767j5415K7461L7610n127k2029L627n098o773j1487
$$ 330027 337984 353554 345580 315813 300398 327859 365469 360342 338313 341940 336842 330069 318582
30021C18582J4025J1793J399l6542k767o6J926K5226K6226K1302k2264k7493O665
$$ 318582 332607 344400 345799 309257 306490 306424 308350 333576 359802 381104 358840 331347 338012
30008C38012l513j8109k6269k519J0562K435Q093L5793J2014j048m22j8908o29
$$ 338012 334499 316390 290121 287602 298164 300599 308692 344485 356499 355451 355029 336121 335492
29995C35492n365L757j3520j7472k911l167K3473J0947j8659o186J438K6333j7952
$$ 335492 330127 333884 320364 302892 299981 296814 320287 331234 312575 306389 307827 334160 316208
29982C16208l228J5083l371k395l76n066J6669J3106N785k9151N45J6018j1640
$$ 316208 312980 328063 324692 322297 321921 316855 333524 346630 352415 323264 323809 339827 328187
29969C28187j2207J0769N125L209N126L690k9617j8668K5175K6791J5732j0135
$$ 328187 315980 326749 331874 335083 340209 343899 314282 295614 320789 347580 363312 353177
29957C53177O50K7189R422p810k0044j7604j3849J1521n411k9180l5014J0029
$$ 353177 353827 381016 390438 382628 362584 344980 331131 342652 337241 308061 273047 283076
29945B83076J4619J2526P239O457r922j560O354P072L890K461J5184P978q077
$$ 283076 297695 310221 317460 323917 313995 312435 318789 325861 329751 332212 347396 355374 347297
29932C47297p763l75l2002l9616K7550Q364K084k84K8949Q345J0852J2250K4966
$$ 347297 339534 339159 307157 267541 295091 303455 305539 305255 334204 342549 353401 365651 390617
29919C90617k2896m7775K155j2279J029m295R151L2272l817l1071q471J3718J9920
$$ 390617 367721 319946 322101 309822 310851 306556 315707 347979 344162 313091 304620 318338 338258
29906C38258N975n253j3790K1424L6109k7509l6304k0410n241O923K4960J7433
$$ 338258 344233 338980 325190 346614 382723 355214 318910 298500 293259 300182 325142 342575
29894C42575p880Q265M1989J7123k2740r741l7905M302J0966p020L359o944j1978
$$ 342575 334695 342960 384949 402072 379332 369591 331686 335988 346954 339934 343293 336349 324371
29881C24371L260n823q53K7230J8918K7118k1834j137L224q154j6821l3026j0534
$$ 324371 327631 321808 320955 348185 367103 394221 372387 371250 374474 366320 349499 316473 305939
29868C05939K1569L130J2436J5534n912m424K5306J5784l3647j9076j9071j6805
$$ 305939 327508 330638 343074 358608 352696 348272 373578 389362 355715 336639 317568 300763
29856C00763q881l578N7501K3501q096K539j6299j7922r743J7319J4667K3266
$$ 300763 291882 288304 345805 369306 361210 363749 347450 329528 319785 337104 351771 375037
29844C75037P090K5540k5861m4285j5753l299l50J2943j0792J5728o377j2755
$$ 375037 382127 407667 381806 337521 321768 318469 318119 331062 320270 335998 329621 316866
29832C16866J9076K7874k5821N861K8901q508k1532J1483m483l7942l0708J7137
$$ 316866 335942 363816 337995 343856 372757 364249 342717 354200 349717 311775 281067 298204
29820B98204L8291Q648O986L063Q812J0624o108l6563J8044P771j0877K6402J3516
$$ 298204 336495 345143 352129 355192 364004 374628 368520 331957 350001 357772 346895 373297 386813
29807C86813k1433j5603J5660j578j0535o875J053J4188j1248j2086L191M2300
$$ 386813 365380 349777 365437 363859 353324 346449 347502 361690 350442 338356 341547 383847
29795C83847k5900j5998l507q459J2255K5044j4037m0331J9879M5457o403l2941
$$ 383847 357947 341949 338442 329983 342238 367282 353245 312914 332793 378250 371847 338906
29783C38906l2482l133J4906k576J8427K2327p070k2474K0709K97k8570k1889
$$ 338906 306424 303291 318197 315621 334048 356375 349305 326831 347540 347837 319267 297378
29771B97378M556N3192L1938k3953k3171j2116k314L148Q13K1898l235j5214m264
$$ 297378 301934 355126 387064 363111 339940 327824 325510 328658 329471 351369 348134 332920 328656
29758C28656j573n472J6635K3638j1549k5358k7435o25K2859p153j6001n864J3257
$$ 328656 327083 321611 338246 361884 350335 324977 297542 296917 319776 312623 296622 290758 304015
29745C04015J2640K3909K7061o298J4868J1329j2422l534r811j6124k5211j166
$$ 304015 316655 340564 367625 361327 376195 387524 375102 371568 361757 345633 320422 319256
29733C19256K2480J7047N121L636k4060n977p261k0032q470K7401J711l684k1993
$$ 319256 341736 358783 363904 367540 343480 337503 330242 310210 301740 329141 330852 327168 305175
29720C05175N664L7075r601m776j1656j8363J7952L52k04J1712L764K7897J820
$$ 305175 310839 347914 338313 333537 321881 303518 321470 321822 321618 333330 337094 364991 366811
29707C66811k1450J3385j9584r470j3631j6663n624J2620K6219j0238j4492R063
$$ 366811 345361 358746 339162 329692 316061 299398 293774 306394 332613 322375 307883 316946
29695C16946K6711m672l0411J381L0091K4285P280k9515l99l6057k2624j0917
$$ 316946 343657 338985 308574 309955 340046 364331 371611 342096 341697 305640 283016 272099
29683B72099J2020J1284O580K5222J113j5139r143R439k439R434L49L2349j3131
$$ 272099 284119 295403 301983 327205 328318 313179 304036 313475 311036 320470 320819 353168 340037
29670C40037j5451j3397j0223J562L732m780K3621L144M307J5214J6213l0957
$$ 340037 324586 311189 300966 302528 306260 301480 325101 328245 332552 347766 363979 333022
29658C33022j7136j2401k160J9501J8493K2761q775K7339j7315O01j5699m181
$$ 333022 315886 303485 301325 320826 339319 362080 353305 380644 363329 363930 348231 344050
29646C44050o812O671J3640o283p237m281m07N911j9375r49J1728J3346l334j986
$$ 344050 337238 343909 357549 351266 344029 339748 339341 345252 325877 324928 336656 350002 346668 344682
29632C44682m47p750k598j5824J1096L1121r014j9452J8752P326K2722r617l6195
$$ 344682 344235 336485 333887 318063 329159 360280 351266 331814 350566 357892 380614 370997 334802
29619C34802L61j3008j5265O572O96P10K093K574L3942N129k2332l6873J0026
$$ 334802 335163 322155 306890 313462 314158 314868 316961 319535 353477 358606 336274 299401 309427
29606C09427M3282k329k3393l562J373l262J5436K1339j5871j7917O112J933Q829
$$ 309427 352709 350380 326987 323425 324798 321536 336972 358311 342440 324523 330635 332568 341397
29593C41397j1948j8645j5433J0544K5115K5846K6280l303j144l8820k1000R188
$$ 341397 329449 310804 295371 305915 331030 356876 383156 379853 378709 339889 318889 328077
29581C28077J4005k0124J8785N485P022j0324j4409k9199J4451L2018Q494J7014
$$ 328077 342082 321958 340743 346228 353250 342926 328517 299318 313769 345787 354281 371295
29569C71295K6699N587j1093q702l1292n494J6925l5597J4056K266j0006J0483
$$ 371295 397994 403581 392488 383786 352494 347000 363925 328328 342384 344650 334644 345127
29557C45127P824m251K395K5918j2620k4563J523j4022j0314K9262J2174k2998
$$ 345127 352951 348700 351095 377013 364393 339830 341353 327331 317017 346279 358453 335455
29545C35455j7031J1151N343q102k0324k303L8548K0525n800L527j9760k3192
$$ 335455 318424 329575 334918 326816 306492 304189 342737 363262 357462 360989 341229 318037
29533C18037k8394M42R487n00j1434L3862M4669K9431k119m2945j0818m223k2012
$$ 318037 289643 290085 299572 299072 287638 321500 366169 395600 393481 350536 339718 335495 313483
29520C13483M115J1918k7235j9415l726l715q105Q917J7759K0894K6023K4801
$$ 313483 317598 329516 302281 282866 279140 275425 267320 276237 293996 314890 340913 365714
29508C65714N656R716j6137j7510o590O397k5403j5076L6260j6785m4241J9775
$$ 365714 371370 381086 364949 347439 340849 347246 321843 306767 343027 326242 282001 301776
29496C01776K9595J0709N081k2391k5655l497M0626K051r517Q001K7767K3125
$$ 301776 331371 342080 347161 324770 299115 295618 336244 338295 328778 336779 364546 387671
29484C87671l266j2475l3587N809K8011N835j658j3419J2668j757j3863j4287
$$ 387671 384405 371930 338343 344152 372163 377998 376340 362921 375589 373832 359969 345682
29472C45682j8785k766N926P154J0468o842m464l4212M898J9205J4177J2946J3193
$$ 345682 326897 324131 330057 337211 347679 340837 336373 302161 307059 326264 340441 353387 366580
29459C66580O136k5775j1812K0744p40L596J0450k4525L900K3839r541j934L670
$$ 366580 372716 346941 335129 355873 355133 358729 369179 344654 348554 372393 362852 360918 364588
29446C64588j4292j6326q062j0728J5079J0138j850K6344L1733m155m6175n4484
$$ 364588 350296 333970 325908 315180 330259 340397 338547 364891 396624 392469 346294 291810
29434B91810o052P349n673j2206o039J7437L5756P249j5434J879J4581o134J9372
$$ 291810 285758 293107 287434 275228 269189 286626 322382 329631 314197 316076 330657 324523 343895
29421C43895Q49q535J0513L4562N726l979M045k1002l1552l020q569P197K7795
$$ 343895 344744 336209 346722 381284 387010 383031 387076 366074 334522 331502 322933 330130 357925
29408C57925K1195k0614j7340J3423J7380j1477J16N187r06J8429j4718k6299
$$ 357925 379120 358506 341166 354589 371969 360492 360608 365795 364889 383318 368600 342301
29396C42301j6568M668K9098J4890j294j9103j9542L840K3982K8437k979l63o136
$$ 342301 325733 330401 359499 374389 373095 353992 334450 338290 362272 390709 387730 387367 381231
29383C81231k2873P862L2871J5652k8671j1184J2239p099m0277k9565J243K8785
$$ 381231 358358 366220 399091 414743 386072 374888 387127 380028 339751 310186 311429 340214
29371C40214k936n451J6870o043k9594P544K972J4272K1337P19L6793J5960m4221
$$ 340214 337278 331827 348697 342654 313060 320604 323576 337848 359185 359904 396697 412657 368436
29358C68436n1954k18O593L254K9874l309j105J3764P535K436j5015j6329P456
$$ 368436 316482 316264 322857 326111 355985 352676 351571 365335 372870 375306 360291 343962 351418
29345C51418j5765O403j7525l161j8759J7197J0787L1648N369l3574l453Q645
$$ 351418 335653 342056 324531 321370 302611 319808 330595 362243 367612 334038 330585 339230
29333C39230J2832J6990J3464o792n856J9152j3934n575J485J6060P65J0199l1581
$$ 339230 352062 369052 382516 375724 369868 389020 375086 369511 370996 387056 387821 398020 366439
29320C66439n2490o053K2572L809J9369N706J3679q323k6756l9170K3456Q37K4759
$$ 366439 313949 307896 330468 334277 353646 359352 373031 364708 337952 298782 322238 323075 347834
29307C47834N205P009p388m829j1400K324K3017J5920j7073j2821J4446J3286
$$ 347834 353039 360048 352660 347831 336431 338755 361772 377692 360619 347798 362244 375530
29295C75530J7430j7489M352j2202j6776j7448j5413R334J2523L396r85r870k7103
$$ 375530 392960 375471 379823 367621 350845 333397 317984 327318 339841 343237 342252 332382 305279
29282C05279k220L2972J3382o287k8290o157k210L703J3059M5221j4261N684J4078
$$ 305279 303059 336031 349413 343126 314836 308679 306469 310172 323231 368452 354191 359875 373953
29269C73953k1419p297Q135R780j6747k3203o542O041J2690J1801l2619o26p915
$$ 373953 352534 345237 353372 363152 346405 323202 316660 322701 335391 347192 314573 313947 306032
29256C06032l2926M674L0206j292p591p066L2749J0394J3699j2K4004l465k6528
$$ 306032 273106 277780 307986 306694 299103 292037 324786 335180 348879 348867 372871 369406 342878
29243C42878q33q259n045K2243O118K2822j3021J1107Q451j3465J713l2531j7442
$$ 342878 342045 333786 328741 350984 357102 379924 366903 378010 386461 372996 374709 342178 324736
29230C24736K162J9932k194J6641k4457k8739l0702J0479J4687p17K2616j897
$$ 324736 326898 346830 344636 361277 336820 308081 277379 287858 302545 301828 324444 322547
29218C22547j3969J7430K9286j6544j637N833j9887k2007l577L9175K0135k1280
$$ 322547 308578 326008 355294 338750 337113 342946 323059 301052 297475 336650 356785 335505
29206C35505J2214r07n1539J1910K2195r245m418l101R85P349J1861j1319j1929
$$ 335505 347719 346812 295273 307183 329378 320133 315715 312614 313599 320948 332809 321490 309561
29193C09561k1287Q098L3429K4395O754k0884N568j1874j5118j6141J0132P609
$$ 309561 288274 296372 329801 354196 360950 340066 345634 333760 318642 302501 312633 320242
29181C20242q183K2055K6461J5234L6172k6154L079J1482R108n0982l1062q883
$$ 320242 312059 334114 360575 375809 411981 385827 388906 400388 409496 358514 327452 318569
29169C18569R157J3290J9564R963K370j1416k6545j7189k0732N328L0402J3962
$$ 318569 327726 341016 360580 370543 372913 361497 334952 317763 297031 302359 332761 346723
29157C46723o10K871J8038j272j1308P435k0070p800J9907q151j1601j1436n075
$$ 346723 346113 348984 367022 365750 354442 361877 341807 334007 353914 345763 334162 322726 317651
29144C17651k991Q926j1680k587J9679m559q170r515J056J2372K702K0525J7886
$$ 317651 314660 323586 311906 309319 328998 324439 316269 306754 307810 320182 322884 343409 361295
29131C61295j3651k4849j1064K2856Q956Q623j673J1836N302j6207j9201k5270
$$ 361295 347644 322795 311731 334587 343543 352166 350493 362329 367631 351424 332223 306953
29119C06953j0676M238J9276m715R580M387n097O894L0540K2559M654j9441m264
$$ 306953 296277 300515 319791 315076 324656 329043 323946 330840 361380 383939 388593 369152 364888
29106C64888l379J6818J1791N89m5111q020j5134P303J834j1648p829K3760q73
$$ 364888 361509 378327 390118 390707 345596 337576 322442 329745 331579 319931 312102 335862 334989
29093C34989J751K1404M960J173m768J6220J264j5384J8844j2583p575j7548J2778
$$ 334989 336740 358144 363104 364277 359509 375729 376993 361609 380453 367870 360295 342747 355525
29080C55525J8003k9669m1703m526L4513J2424j1553Q966K2036M021J9647L3773
$$ 355525 373528 343859 302156 297630 332143 344567 333014 341980 364016 368037 387684 421457
29068D21457l9967l9548J8248J9444n441l0421k2107p212Q461K2455l404l2012
$$ 421457 381490 341942 360190 379634 374193 343772 321665 314453 322914 345369 341965 309953
29056C09953J512J2696J1060n039J2666J5959q353j9886j4503j0973q074N782
$$ 309953 311465 324161 335221 330182 342848 358807 350454 330568 316065 305092 297018 302800
29044C02800M105j5382j348J7810k445k0011N784K5827L243l843P873Q199q208
$$ 302800 306905 291523 290175 307985 305540 285529 291313 317140 320383 316540 324413 332612 324404
29031C24404K4206l730K6947K6152k9604K133Q295q506k5657K947J5033P378K1764
$$ 324404 348610 344880 371827 397979 368375 370508 378803 370297 344640 347587 362620 369998 391762
29018C91762j0971j0746m1680j3484L3984J3920j876j706N746j6024l3194J2831
$$ 391762 380791 370045 328365 314881 348865 362785 360909 359203 364949 348925 315731 328562
29006C28562J9351j7455K21K8849r202k5941J9911M0654n509l9861O606J0428
$$ 328562 347913 330458 330679 359528 350326 324385 344296 384950 379441 339580 346186 356614
28994C56614l190K3785j3667j1146J0886q602m186j875j4031j8684j0482k337
$$ 356614 353424 377209 363542 352396 363282 354680 350494 348619 334588 315904 305422 303085
28982C03085J0538O324J0013J7782K3499j6476k9777j4415J0518J0572P462Q23
$$ 303085 313623 319947 329960 347742 371241 354765 324988 310573 321091 331663 339125 339948
28970C39948R142j5255J126P530r031N77J0542R013k909P81J8130K0587K809j0466
$$ 339948 349090 333835 334961 342491 333460 334037 344579 353592 350683 351464 369594 390181 392990 382524
28956C82524r569j2132o651L3915P795k5881j9657j1832J3604P236n065k6240
$$ 382524 372955 360823 354172 388087 395882 370001 350344 338512 352116 359352 354287 328047
28944C28047r126K029r547J3537J3137J6339J7104r894k741K75N91j1062O147
$$ 328047 318921 320950 311403 324940 338077 354416 371520 361626 358885 359160 359751 348689 354836
28931C54836J9078K7853O990q933j6599k6498j9426j5401o175j5547K60L8641
$$ 354836 373914 401767 408757 399824 383225 356727 337301 321900 315725 300178 300438 339079
28919C39079M8854J2538%j5996l8271j0630L027J4031k128J5223j9771k1217K0427
$$ 339079 387933 400471 400471 384475 346204 335574 338601 352632 350504 365727 345956 324739 345166
28906C45166K3414k2704M313K6835k3215k4879Q419K2434J8320L72j401K2975
$$ 345166 368580 345876 350189 377024 353809 328930 337349 359783 378103 378475 377074 400049
28894D00049q271j5804l955j177M262n342j5801k0306J658K7016J824Q18p402
$$ 400049 391778 375974 372019 370842 375104 369762 353961 333655 335313 362329 364153 364971 357569
28881C57569J168q743P997Q09j0632j3126j3218O80K7323p071j4030L386N120
$$ 357569 358737 349994 357991 358800 348168 335042 321824 322504 349827 342756 328726 332112 337232
28868C37232K007l679j4348R559K042P269J3300r57J6023l875O527J1214j9088
$$ 337232 339239 335560 321212 330771 332813 340082 353382 352425 368448 364573 371100 382314 363226
28855C63226l5735L574M287j4222J1037J7945j7291J3612r53J4304j6693l3368
$$ 363226 327491 331065 335352 321130 332167 350112 332821 346433 345480 359784 343091 309723
28843C09723n050O456K3998J6386o516k3833J4540J0771j803L267j3060m447k90
$$ 309723 304673 311129 335127 351513 344997 321164 335704 346475 344672 347939 334879 330432 330142
28830C30142N868K9431K3183J7244o714j4376l7913k38J2642O5O571R568N859
$$ 330142 336010 365441 388624 405868 399154 384778 346865 346627 359269 359334 365905 375473 381332
28817C81332l727q870J0352o894l1453j5370k7616J347K6222J6846K0793p950
$$ 381332 377605 368735 379087 372193 340740 325370 297754 299101 325323 342169 362962 355012
28805C55012l3931r972K5014K1244M56j1312N183J3699J9773k5527l3258j411
$$ 355012 321081 311109 336123 357367 357823 346511 351694 365393 385166 359639 326381 324970
28793C24970M687P221O689L6013L2145j3488j0582L263j3601j2517K0688m383
$$ 324970 329657 336878 343567 379580 411725 398237 387655 390918 377317 364800 385488 381105
28781C81105j4040j8989L822P388J5415M576l0095j7632J9425l540p247L8464
$$ 381105 367065 348076 351898 359286 374701 379277 349182 331550 350975 347435 340188 378652
28769C78652M665m1755N89J0446J1261m885N141O381n016Q768j5949l1615j0178
$$ 378652 383317 341562 342151 352597 363858 358973 364114 370495 365479 374247 358298 326683 316505
28756C16505R670R576J3694J7196j3052k5452p147J8965J7508J3776k9910r029
$$ 316505 326175 335751 349445 366641 353589 328137 320990 339955 357463 371239 341329 332300
28744C32300j0888K8199k5317K94J8948r668p443m235P804n647J1202K0486o516
$$ 332300 321412 349611 324294 324588 343536 333868 326425 322190 329994 324347 335549 356035 349519
28731C49519m858MJ7191m851q273r033q764J0571Q674j6565k3294L586J9324M7157
$$ 349519 344661 344665 361856 357005 348732 339699 330935 341506 350180 333615 310321 313907 333231 380388
28717C80388J1380o907Q505L021k1824j7686j7822p115R779l754M759K5798r798
$$ 380388 391768 384861 393366 396387 374563 356877 339055 331940 341719 337965 342724 368522 358724
28704C58724j1162j0319M622J2932R641k574L102P200Q914J2657p844m597n439
$$ 358724 347562 337243 341865 354797 364438 361864 364966 372166 381080 393737 385893 381296 375857
28691C75857j7252Q318L613j7288k770K7467J0602M347j376k619k5545P062j0705
$$ 375857 358605 366923 370536 353248 350478 377945 388547 392894 391518 388899 363354 370416 359711
28678C59711m1573J3782L2760J9919r676j8103j8140O310N1462L0227l6728k4443
$$ 359711 318138 331920 364680 384599 374923 356820 338680 344990 396452 426679 389951 365508
28666C65508J1269n215k0139K5672K7068j2757k5266j4682L8348R635K614k5536
$$ 365508 376777 371562 351423 377095 404163 391406 366140 351458 389806 399441 402055 376519
28654C76519n097l150k748j4723K708p262j2789j7595J9078P897k3063O709k928
$$ 376519 371422 368272 365524 350801 353509 346247 333458 315863 334941 342838 319775 326484 323556
28641C23556n896J3690L0045R475L761r466J5438j2858j3601J0080J6931k6160
$$ 323556 317660 331350 361395 370870 374631 365165 380603 367745 354144 364224 381155 354995
28629C54995P492n390J2060l282p751l21l8567j3956J5956J3194L0362j0959k0795
$$ 354995 362487 357097 369157 365875 358124 357803 319236 305280 321236 334430 364792 353833 333038
28616C33038K2720j9699M900j1096o455J5840p871m1392J0362K8965J5590j0671
$$ 333038 355758 336059 340959 329863 323408 339248 331377 289985 300347 329312 344902 334231
28604C34231j4876K2435L4372K3613q882j4991j7505J0467o940K981O33m867q866
$$ 334231 319355 341790 376162 399775 390893 375902 358397 368864 361924 364905 365538 360671 351805
28591C51805p622p438j9290O48Q963L7210l181j1272j735m0479p460J9302J861
$$ 351805 344183 336745 317455 318103 327066 364276 361095 349823 348088 307609 300149 319451 321312
28578C21312J0482N46K8836Q92k9336N191K245P770K7742L1551p015J816j1810
$$ 321312 331794 332340 361176 362068 332732 337923 340168 347938 375680 407231 400216 402032 390222
28565C90222p8j076l6602r511R502j1909p787K7225P500j3968J1158j8411l4120
$$ 390222 390144 389068 352466 342955 352457 340548 332761 359986 367486 353518 364676 346265 312145
28552C12145o074p39J9847L776J0818k1404j9541O679J0779j0130K034J7965K7245
$$ 312145 306071 305332 325179 328955 339773 318369 298828 305507 316286 306156 308190 326155 353400
28539C53400p328n40J4511J3563j8785r40j3254n801r601J6576R996K6641L251
$$ 353400 346072 345532 360043 373606 354821 353881 340627 334826 325225 341801 351797 378438 381689
28526C81689J0107j1757L37k0055l9541L757M1529M1320J3518j8843J1689l4895
$$ 381689 391796 380039 380376 360321 320780 324537 366066 407386 420904 402061 413750 378855
28514C78855k0080l288K8276o17J036k4957j5806l7642J5804L7137K8171j032
$$ 378855 358775 355487 383763 383146 384182 359225 343419 305777 321581 358718 386889 385857
28502C85857J4892J4416k4134k9602n832l4332N894j8679Q126K5401j9331P143
$$ 385857 400749 415165 391031 361429 355597 321265 327159 308480 316606 342007 322676 329819
28490C29819j1628j1272J0924L2669j4012o08K7203J8930j9208M835j1918p583
$$ 329819 318191 306919 317843 350512 336500 335892 363095 382025 362817 367652 355734 348151
28478C48151j0622M296q467L6050J5519Q260k6531m3267J2601L4508K9622j023
$$ 348151 337529 341825 333358 369408 384927 393187 366656 323389 335990 370498 400120 399097
28466C99097q395q332J932K237j124l889k8584M360R517R616k914j7653r169K9436
$$ 399097 390702 382370 384302 386539 385415 381526 352942 357302 366819 376435 373521 355868 346699 376135
28452C76135j2195N040J9411J5194K1394m673l7360k5070P146q994J7147M276
$$ 376135 363940 368980 388391 403585 424979 420306 382946 357876 365022 356028 373175 377451
28440C77451n102l4547j877q199J9923L7533n682k4770K6132K2555J9660r443
$$ 377451 372349 337802 335925 327726 347649 385182 379500 354730 380862 403417 423077 413634
28428D13634j6425q370l2147l3077J2546l014K977m307k172p609K3632J4743o639
$$ 413634 397209 388839 356692 323615 336161 333147 336124 331817 329645 322036 345668 360411 353772
28415C53772P414J7466Q593j8339j9225j9838K6096J7310k686J283O97j4743p265
$$ 353772 361186 378652 387245 368906 349681 329843 355939 373249 370563 371846 372543 357800 350535
28402C50535J7337j1572j322j8440K2047L3493P892j1510o741o220j5037r850
$$ 350535 367872 356300 354978 336538 358585 392078 399970 388460 381719 375499 360462 350612
28390C50612L5392L9795j0237l8541j5012J1621l477j6973j9865J0919N841N582
$$ 350612 386004 425799 415562 377021 362009 373630 370153 353180 333315 344234 350075 355657
28378C55657o430j0970j0989K3237L0275j2203l7317N536J1352k403l763q328
$$ 355657 349227 338257 327268 350505 380780 368577 331260 336796 348148 345745 341982 333654
28366C33654P97k5549N215L1786K1494K0431k5130j3851P680Q995n124o591P9
$$ 333654 334451 308902 314117 345903 367397 387828 362698 348847 356527 365522 360398 353807 353886
28353C53886j4840n670J2813J5063j567j9942L950R796J1459p615J0116K1094
$$ 353886 339046 333376 346189 361252 359685 339743 343693 353489 364948 357333 367449 388543
28341C88543k3935k2136m0277l0526L5151M2271K6148K6787p991q197O205L219
$$ 388543 364608 342472 302195 271669 306820 349091 375239 402026 394035 385838 392043 395262
28329C95262L101j2277j5773M413k1755r351K3788o552n0035r134R000J1856K0032
$$ 395262 398363 386086 370313 374726 352971 343620 367408 360856 310821 301687 310687 322543 342575
28316C42575l310K1953K0754q501l3074p766P728K2822k301j80k6790J1027K8333
$$ 342575 339265 361218 381972 373471 340397 332631 340359 363181 360880 360700 333910 344937 373270
28303C73270q306j3930K944j111R255K9610j0860j1155o636j6453J2205O468m7958
$$ 373270 364964 351034 353978 352867 362122 391732 380872 369717 363081 346628 358833 365301 317343
28290C17343o780J936K3179N296K2524J1828P15q879N669m928K2682J6253k2691
$$ 317343 310563 312499 335678 340974 363498 375326 376041 367162 372831 367903 390585 406838 384147
28277C84147o436J6133R534r948j1643l9000o1530m293L5045K1868M123j0788
$$ 384147 377711 393844 403378 393430 381787 342787 281257 276964 312009 333877 338000 327212
28265C27212N692J1375K9071o903l773J1460j7108k6110j2753J5072J067j2800
$$ 327212 332904 344279 373350 366447 362674 374134 357026 330916 318163 333235 334302 321502
28253C21502M5903P635k3555n910l284K9680J817l1441m908m941P826R869P461
$$ 321502 367405 375040 351485 345575 342291 371971 373788 342347 337439 332498 340324 350193 357654
28240C57654k2041q374J6961K0805j7002M079j1327O506J9525k798J1274l3498
$$ 357654 335613 327239 344200 365005 348003 352082 340755 347261 366786 363988 375262 341764
$$ [...]
##END NTUPLES=NMR SPECTRUM
##END=
