##TITLE=Analysis number 318608
Compound Code spb 02802
Project Code adrs
Chemist Name fudan
##JCAMPDX= 6.0         $$ Bruker NMR JCAMP-DX V2.0
##DATA TYPE= NMR SPECTRUM
##DATA CLASS= NTUPLES
##ORIGIN= Bruker BioSpin GmbH
##OWNER= nmr
$$ XWIN-NMR		Version 3.5
$$ Wed Apr  5 15:52:23 2006 GMT Daylight Time (UT+1h)  MAYBRIDGE\nmr@NMR_250MHZ
##.OBSERVE FREQUENCY= 250.131544655141
##.OBSERVE NUCLEUS= ^1H
##.ACQUISITION MODE= SIMULTANEOUS (DQD)
##.ACQUISITION SCHEME= undefined
##.AVERAGES= 16
##.DIGITISER RES= 18
##SPECTROMETER/DATA SYSTEM= dpx250
##.PULSE SEQUENCE= zg30
##.SOLVENT NAME= DMSO
##.SHIFT REFERENCE= (INTERNAL, DMSO, 0, 16.522)
##AUDIT TRAIL= $$ (NUMBER, WHEN, WHO, WHERE, WHAT)
$$ ##TITLE= Audit trail, XWIN-NMR		Version 3.5
$$ ##JCAMPDX= 5.01
$$ ##ORIGIN= Bruker BioSpin GmbH
$$ ##OWNER= nmr
$$ C:\u/data/dgb/nmr/ADRS/2180/pdata/1/auditp.txt
$$ ##AUDIT TRAIL=  $$ (NUMBER, WHEN, WHO, WHERE, WHAT)
(   1,<2006-04-05 15:51:54.70 +100>,<MAYBRIDGE\nmr>,<NMR_250MHZ>,
      <created by zg, POWCHK disabled, PULCHK disabled
       configuration hash MD5:
       84 BC 41 DB A1 6E 1D 46 DA 25 12 A5 C1 ED C5 3A
       data hash MD5: 64K
       32 0A C8 EE 88 F7 7A 25 19 19 DB 6E 42 6D B5 90>)
(   2,<2006-04-05 15:52:11.93 +100>,<MAYBRIDGE\nmr>,<NMR_250MHZ>,
      <Start of raw data processing
       ef LB = 0.3 FT_mod = 6 PKNL = 1 SI = 32K 
       data hash MD5: 32K
       26 AB F7 57 18 C9 A5 DA 27 97 7C F6 AC EA 5D E9>)
(   3,<2006-04-05 15:52:14.05 +100>,<MAYBRIDGE\nmr>,<NMR_250MHZ>,
      <apk 
       data hash MD5: 32K
       FE 33 86 08 68 2A E7 5B 86 D9 68 2C 85 DC 4C DD>)
(   4,<2006-04-05 15:52:15.02 +100>,<MAYBRIDGE\nmr>,<NMR_250MHZ>,
      <abs ABSG = 5 
       data hash MD5: 32K
       03 4F 21 A1 2A 13 65 AD CA 8F 81 B1 02 38 C2 CA>)
$$ ##END=
$$ 
$$ hash MD5
$$ FF D7 1C 68 AC A1 25 54 7D E2 BC 13 F4 7E 65 06
##$RELAX= 
##$RELAX= 
##$RELAX= 
##$RELAX= 
##$RELAX= 
##$RELAX= 
##$RELAX= 
$$ Bruker specific parameters
$$ --------------------------
##$DU= <C:\u>
##$EXPNO= 2180
##$NAME= <ADRS>
##$PROCNO= 1
##$TYPE= <nmr>
##$USER= <dgb>
##$AMP= (0..31)
100 100 100 100 100 100 100 100 100 100 100 100 100 100 100 100 100 100 
100 100 100 100 100 100 100 100 100 100 100 100 100 100 
##$AQSEQ= 0
##$AQ_mod= 3
##$AUNM= <au_zg>
##$AUTOPOS= <53 >
##$BF1= 250.13
##$BF2= 250.13
##$BF3= 250.13
##$BF4= 250.13
##$BF5= 500.13
##$BF6= 500.13
##$BF7= 500.13
##$BF8= 500.13
##$BYTORDA= 1
##$CFDGTYP= 0
##$CFRGTYP= 5
##$CHEMSTR= <none>
##$CNST= (0..31)
1 1 145 1 1 1 1 1 1 1 1 1 1 1 1 1 1 1 1 1 1 1 1 1 1 1 1 1 1 1 1 1 
##$CPDPRG= <>
##$CPDPRG1= <>
##$CPDPRG2= <>
##$CPDPRG3= <>
##$CPDPRG4= <mlev>
##$CPDPRG5= <mlev>
##$CPDPRG6= <mlev>
##$CPDPRG7= <mlev>
##$CPDPRG8= <mlev>
##$CPDPRGB= <>
##$CPDPRGT= <>
##$D= (0..31)
0 1 0 0 0 0 0 0 0 0.06 0 0 0 0 0 0 0.0002 0 0 0 0 0 0 0 0 0 0 0 0 0 0 
0 
##$DATE= 1144248713
##$DBL= (0..7)
120 120 120 120 120 120 120 120 
##$DBP= (0..7)
150 150 150 150 150 150 150 150 
##$DBP07= 0
##$DBPNAM0= <>
##$DBPNAM1= <>
##$DBPNAM2= <>
##$DBPNAM3= <>
$$ [...]
##$SUBNAM6= <"">
##$SUBNAM7= <"">
##$SUBNAM8= <"">
##$SUBNAM9= <"">
##$SW= 20.6930455092707
##$SWIBOX= (0..15)
0 0 3 0 0 0 0 0 0 0 0 0 0 0 0 0 
##$SW_h= 5175.983436853
##$TD= 65536
##$TD0= 1
##$TE= 295.16
##$TE2= 300
##$TE3= 300
##$TEG= 300
##$TL= (0..7)
0 120 120 120 120 120 120 120 
##$TP= (0..7)
150 150 150 150 150 150 150 150 
##$TP07= 0
##$TPNAME0= <>
##$TPNAME1= <>
##$TPNAME2= <>
##$TPNAME3= <>
##$TPNAME4= <>
##$TPNAME5= <>
##$TPNAME6= <>
##$TPNAME7= <>
##$TPOAL= (0..7)
0.5 0.5 0.5 0.5 0.5 0.5 0.5 0.5 
##$TPOFFS= (0..7)
0 0 0 0 0 0 0 0 
##$TUNHIN= 0
##$TUNHOUT= 0
##$TUNXOUT= 0
##$USERA1= <user>
##$USERA2= <user>
##$USERA3= <user>
##$USERA4= <user>
##$USERA5= <user>
##$V9= 5
##$VALIST= <valist>
##$VCLIST= <CCCCCCCCCCCCCCC>
##$VD= 0
##$VDLIST= <DDDDDDDDDDDDDDD>
##$VPLIST= <PPPPPPPPPPPPPPP>
##$VTLIST= <TTTTTTTTTTTTTTT>
##$WBST= 1024
##$WBSW= 4
##$XGAIN= (0..3)
0 0 0 0 
##$XL= 0
##$YL= 0
##$YMAX_a= 346034
##$YMIN_a= -379861
##$ZGOPTNS= <>
##$ZL1= 120
##$ZL2= 120
##$ZL3= 120
##$ZL4= 120
##$ABSF1= 16.522
##$ABSF2= -4.171173
##$ABSG= 5
##$ABSL= 3
##$ALPHA= 0
##$AQORDER= 0
##$ASSFAC= 0
##$ASSFACI= 0
##$ASSFACX= 0
##$ASSWID= 0
##$AUNMP= <proc_1d>
##$AZFE= 0.1
##$AZFW= 0.1
##$BCFW= 0
##$BC_mod= 0
##$BYTORDP= 0
##$COROFFS= 0
##$CY= 12.5
##$DATMOD= 1
##$DC= 0
##$DFILT= <>
##$DTYPP= 0
##$F1P= 14.0000005364418
##$F2P= -0.99999901652339
##$FCOR= 0.5
##$FTSIZE= 32768
##$FT_mod= 6
##$GAMMA= 0
##$GB= 0
##$INTBC= 1
##$INTSCL= 1
##$ISEN= 128
##$LB= 0.3
##$LEV0= 0
##$LPBIN= 0
##$MAXI= 10000
##$MC2= 0
##$MEAN= 0
##$ME_mod= 0
##$MI= 0
##$NCOEF= 0
##$NC_proc= -3
##$NLEV= 6
##$NOISF1= 0
##$NOISF2= 0
##$NSP= 0
##$NTH_PI= 0
##$NZP= 0
##$OFFSET= 16.522
##$PC= 1
##$PHC0= 163.1645
##$PHC1= 9.16103
##$PH_mod= 1
##$PKNL= yes
##$PPARMOD= 0
##$PSCAL= 4
##$PSIGN= 0
##$REVERSE= no
##$SF= 250.13
##$SI= 32768
##$SIGF1= 0
##$SIGF2= 0
##$SINO= 400
##$SIOLD= 32768
##$SREGLST= <1H.DMSO>
##$SSB= 0
##$STSI= 32768
##$STSR= 0
##$SW_p= 5175.98343685301
##$SYMM= 0
##$S_DEV= 0
##$TDeff= 65536
##$TDoff= 0
##$TI= <Analysis number 999999
Compound Code 99
Book Reference 9
Project Code 9>
##$TILT= no
##$TM1= 0
##$TM2= 0
##$TOPLEV= 0
##$USERP1= <user>
##$USERP2= <user>
##$USERP3= <user>
##$USERP4= <user>
##$USERP5= <user>
##$WDW= 1
##$XDIM= 32768
##$YMAX_p= 324361252
##$YMIN_p= -284370
$$ End of Bruker specific parameters
$$ ---------------------------------
##NTUPLES= NMR SPECTRUM
##VAR_NAME=  FREQUENCY,     SPECTRUM/REAL,   SPECTRUM/IMAG
##SYMBOL=    X,             R,               I
##VAR_TYPE=  INDEPENDENT,   DEPENDENT,       DEPENDENT
##VAR_FORM=  AFFN,          ASDF,            ASDF
##VAR_DIM=   32768,         32768,           32768
##UNITS=     HZ,            ARBITRARY UNITS, ARBITRARY UNITS
##FACTOR=    0.157963299565203, 1,           1
##FIRST=     4132.6476996994, 0,             0
##LAST=      -1043.33573715361, 0,           0
##MIN=       -1043.33573715361, -284370,     0
##MAX=       4132.6476996994, 324361252,     0
$$ Real data points
##PAGE= N=1
##DATA TABLE= (X++(R..R)), XYDATA
$$ [...]
16591d2886r763k3876l9118J3447N0784J4006m5574L4818Q407k2345p8507J036
16579a39571Q5301J0616j3581K0298q894P393J8109k4611k5521P966k6564m2520
16567a31579N3139N3867l6924K3807Q7074k1062o0399o7752L854L5575j1863j18
16555g2381j718k0231J26798L7536o4757q1533N8610k388o4932J9691M2640k2262
16543d4927k6676P752O0716L6143l5290j1435N0824R442l2468p633j5092m2702
16531e1346K64n495l327k7441J84K0376O66l036N9461M9212j0150p5205l0740
16518g6577K2847L2281N4375k4986n5107K4350N7046O8857k4730p6777n990o0352
16506f4763n0091k4264M8186M3720p5749L0882N0569K8510K6522P6817L171k9575
$$ plain form
16591 -42886 -52649 -76525 -115643 -102196 -51412 -37406 -82980 -48162 -39755 -62100 -140607 -139571
16579 -139571 -54270 -43654 -57235 -36937 -45831 -38438 -20329 -44940 -70461 -62495 -89059 -131579
16567 -131579 -78440 -24573 -61497 -37690 49384 28322 -32077 -99829 -95975 -60400 -72263 -72381
16555 -72381 -74099 -94330 32468 70004 5247 -76286 -17676 -20064 -84996 -65305 -22665 -44927
16543 -44927 -71603 -63851 -3135 33008 -2282 -13717 37107 46549 14081 6448 -8644 -51346
16531 -51346 -51082 -56577 -59904 -87345 -87161 -66785 -66119 -69155 -9694 39518 29368 -45837 -76577
16518 -76577 -53730 -21449 32926 7940 -47167 -22817 34229 103086 78356 1579 -4411 -64763
16506 -64763 -114854 -139118 -90932 -47212 -122961 -92079 -41510 -13000 13522 90339 93510 63935
16494F3935l9948J2229L1262k2893K6886J1569j7528J460o261j7512o4001m4781
16482f5583J4664J5997l9344R63K5255O5284L7704K1481l4789k7161o6190k3254
16470g4973L2384r3708K795Q3829L7096L5183M683m7115o4275R727N903N161K9157
16457c4153K0783k3402N9855j9164o1792k7878M6608O3891m75j480k1821P840
16445H812m9479J7626P111j126p674k6951L8500Q4185O1424o2367n1493J9573
16433C8141M638k1143O1265K3618j8069k3277j6455m6695j6177R7300K290k7919
16421E7517q5849m9776J0036N8062K3094K6188j0737k1267N4262q0486o8447M6025
16409d1378m6861k5777M0394O7709J19102o607j2257m8169o1345p1144J1782l2377
$$ plain form
16494 63935 23987 36216 67478 44585 71471 83040 65512 66972 60711 43199 -20802 -65583
16482 -65583 -50919 -34922 -74266 -73303 -48048 17236 54940 76421 41632 14471 -51719 -74973
16470 -74973 -42589 -136297 -133502 -49673 -12577 22606 27289 -19826 -84101 -74374 -68471 -63310 -34153
16457 -34153 -13370 -36772 23083 3919 -57873 -85751 -39143 24748 24273 22793 972 8812
16445 8812 -40667 -23041 -15930 -17056 -24730 -51681 -13181 71004 132428 70061 18568 38141
16433 38141 42779 21636 82901 106519 88450 65173 48718 2023 -14154 83146 85436 57517
16421 57517 -28332 -78108 -68072 -10010 13084 39272 28535 7268 61530 -18956 -87403 -41378
16409 -41378 -88239 -114016 -73622 -5913 113189 106582 94325 46156 -15189 -86333 -74551 -106928
16397a06928R820L4311P5008l976k3872j4538L0504L290J2489j6964n4620m983
16385f0459K7251l4226J2419M2769J05959K6345J858k0235l4882j01423p9531
16374a14155p270N7596L1785L6075K7450M9649m574k7304j7412j7251m0196J3005
16362a2602j8263J6501J8433m826K0125J0769j5655k4000l3636K3916l8173K837
16350e4574O2305l473L0625q4890o1855N9391P0411p5796Q978M4402L4581O825
16338C6930k1165L2108N1807m0573l0884N7112o6522r229j4597r6920J048M1392
16326e9493L013J68k2968n5122P2935O5863M7286j7862j37j2025k7415l6195L5859
16313f093O244j0408n1174O177N9902J2791k9624l6413j7207K0325R0687K6577
$$ plain form
16397 -106928 -97108 -62797 12211 8235 -15637 -30175 329 3619 16108 -856 -55476 -60459
16385 -60459 -33208 -67434 -55015 -12246 93713 120058 121916 101681 66799 -34624 -114155
16374 -114155 -121425 -63829 -32044 4031 31481 81130 76556 49252 31840 14589 -25607 -12602
16362 -12602 -30865 -14364 4069 -757 19368 30137 14482 -9518 -43154 -19238 -57411 -54574
16350 -54574 7731 4258 34883 -50007 -111862 -52471 17940 -57856 -48878 -4476 30105 36930
16338 36930 15765 47873 99680 59107 28223 85335 18813 9584 -5013 -101933 -100885 -59493
16326 -59493 -56480 -56312 -79280 -134402 -61467 4396 51682 33820 33683 21658 -5757 -41952 -6093
16313 -6093 151 -10257 -61431 -55254 4648 17439 -12185 -48598 -65805 -45480 45207 71784
16301G1784k6849q175K3158Q392l8504r2897J9188P0614j7076l3360L2646M7809
16289E6730j113L792m0838L8357K5850o9003p5508J7100N6702O9305J5293j1196
16277H5471P928P176K2830K3178m1488j9488k3135n6739O2980K3514j9452K4553
16265I7328O7778k5169q3707o1683m8053L5658L2810n94K4109O259m5254o7013
16253f7531j669N9695O3198N3819k1222o5784j1605k9247p288m400N5165l7901
16241a4770L2024L5668J6286j8613l1323J6126j8366j6353m4841o813p139m9642
16229a07756M5200J08550k1532m6545j8441k4139L6310K561k5162J4931K1156
16218a4867P4865L0526o0287j03894m9986L8593K2607Q1773M6570L5013n885n7132
$$ plain form
16301 71784 44935 36760 59918 68310 29806 -63091 -43903 26711 9635 -23725 8921 56730
16289 56730 55617 59409 18571 56928 82778 13775 -61733 -44633 12069 81374 96667 85471
16277 85471 93399 100575 123405 146583 105095 85607 62472 5733 68713 92227 72775 97328
16265 97328 165106 139937 56230 -5453 -53506 -17848 14962 14368 38477 44736 -518 -67531
16253 -67531 -69200 -9505 53693 107512 86290 20506 8901 -20346 -27634 -32034 23131 -14770
16241 -14770 17254 52922 69208 50595 19272 35398 17032 679 -44162 -50975 -58114 -107756
16229 -107756 -62556 45994 24462 -22083 -40524 -64663 -28353 -25792 -50954 -36023 -14867
16218 -14867 59998 90524 30237 -73657 -123643 -85050 -62443 19330 65900 100913 95028 37896
16206C7896j8700k9236j0672N1733Q786j2590l4917j7331j253l5982L4249J9125
16194h892L5165M4308j9152l0444m1701Q8206L4767J5622K9140l828p5469o335
16182F1387l7712l6298J14531N7637o055m3503M8514L2975J9167o4383r8657p0009
16170b2406J15248O8650l6072r0609n8918l078m4492K9149K7098l6714j5984o019
16158g4147J2687K0259P9244n941j5778K4071j6319j7238K5131O4973M6522P070
16146A50534m6684j3477k2435p4355q9070r792K4486Q174N350L5097M4153J6001
16134B7982J4055p7101q6113K5989Q8876m6283j7877m9332n4292P7317M0286P2893
16122A6400M3559k8136n962o0145J753R8551K6131J5358J3926j0218Q017L1850
$$ plain form
16206 37896 19196 -10040 -20712 31021 39807 27217 -7700 -25031 -26284 -62266 -28017 -8892
16194 -8892 26273 70581 51429 20985 -20716 67490 102257 117879 147019 143191 67722 61387
16182 61387 23675 -12623 101908 159545 153490 109987 158501 191476 210643 146260 47603 -22406
16170 -22406 92842 161492 125420 34811 -24107 -27185 -71677 -42528 -15430 -52144 -68128 -74147
16158 -74147 -61460 -41201 38043 32102 16324 40395 24076 6838 31969 96942 143464 150534
16146 150534 103850 90373 67938 -6417 -95487 -105279 -80793 -72619 -67269 -32172 11981 27982
16134 27982 42037 -35064 -121177 -95188 -6312 -52595 -70472 -119804 -174096 -96779 -56493 16400
16122 16400 59959 31823 25861 -34284 -32531 66020 92151 107509 121435 111217 119234 151084
16110A51084L3574p5921n9328l0342m5110k8732K3766O2168J5627N2100k1637
16099G7249m7452m3694r9313m6165l7835Q507L3653K9212m826P4031J3577L159
16087c9897K8172M7634M3923J2609o2801k8198r626p3395K1161N0536L5272m2057
16075a6667l2962L0851P4185o220o2552M564M5070J680o8431K2197K7237k4643
16063e691j7962m7762O968K1247r426L0929M4835K8823k1557Q616p5203k3799
16051e9982J1417N5414Q6228M8893l3960q7055j8651K079n3469q2329J0006M1263
16039h0146L3682L6670o7005j242j3544N1698M8097k7003n2336k1681L1472j4450
16027g5788N7966n520K8565Q1576L761l7168k1613J400o8042k3845L031O7613
$$ plain form
16110 151084 184658 108737 49409 19067 -26043 -54775 -31009 31159 46786 98886 77249
16099 77249 29797 -13897 -113210 -159375 -197210 -188703 -155050 -125838 -130664 -56633 -43056 -39897
16087 -39897 -11725 35909 79832 92441 29640 1442 -8184 -81579 -60418 -9882 25390 -16667
16075 -16667 -49629 -18778 55407 49187 -13365 -8801 36269 37949 -30482 -8285 18952 -5691
16063 -5691 -23653 -71415 -64447 -43200 -52626 -21697 23138 51961 30404 39020 -36183 -59982
16051 -59982 -48565 6849 93077 141970 108010 20955 2304 4383 -49086 -131415 -121409 -80146
16039 -80146 -46464 -9794 -76799 -78041 -91585 -39887 8210 -18793 -71129 -92810 -61338 -75788
16027 -75788 -17822 -23342 5223 86799 90560 53392 31779 33179 -34863 -58708 -55677 11936
16015A1936N8522j1494p3885k4276L3707M9741P418J6224k1976M244o0904j26441
16003a37184j6945M2666n610L7516M5943j0872k73J6156m424K1538l3306q0330
15991a25125K4844K3071K2045J8690J7665N9477K8272j0901J4121l146j01631
15980c2618p3659L3050O6873k6472p2336J3022P6650j9809P189J1531j4028j5159
15968d5766p465N9312m939r859K0492m9703j2056m7124l460P860N4692J6091o7673
15955h9598M4855k6431J3955M3554K3135j240m6294m3007M0248L0600l9034j8395
15943f7652k655N4750J4579n688J6350Q223p0305K5079n6833R067M8231J2639
15931a4215n179O2914N9407k6085j22372K0759R4800L197P182L3243p063o6001
$$ plain form
16015 11936 70458 58964 -14921 -39197 -5490 44251 51669 67893 45917 50161 -10743 -137184
16003 -137184 -154129 -111463 -117073 -79557 -33614 -44486 -44759 -28603 -33027 -11489 -44795 -125125
15991 -125125 -100281 -77210 -55165 -36475 -18810 40667 68939 58038 72159 69013 -32618
15980 -32618 -106277 -73227 -6354 -32826 -105162 -92140 -15490 -35299 -28110 -16579 -30607 -45766
15968 -45766 -53231 6081 1142 -8717 11775 -37928 -49984 -97108 -100568 -92708 -38016 -21925 -89598
15955 -89598 -44743 -71174 -57219 -13665 9470 8230 -38064 -81071 -40823 -10223 -49257 -67652
15943 -67652 -70307 -15557 -978 -6666 9684 17907 -52398 -27319 -84152 -75085 -26854 -14215
15931 -14215 -19394 43520 102927 76842 -45530 -24771 70029 73226 80408 113651 106588 40587
15919D0587j4028l6622j8112J4734q458N958l1568J76n1049J5909M7148M7030
15907A1705m407N2382j4698L328o602L7971O0287k7749K492m0951n9229p4202
15895e9673q7418P1908J02258M9688K5564n0198o4181l4779L854K4236Q6654J8339
15883H6252J2588K9641j137j4190L0296n4826n7240K4282k1768m6600o2984j8240
15871i3926Q1404P8636n1703k1382R3378L7473k0463q8716p1375l1870L966R7474
15859A2896j4608q7558R999P9738K1358l8924l8386m3759J1801R0791J0141L4882
15847D8371j4715o3408j5057L814k0043M5350n6014J9681L0725l0549L1977N4693
15835C4825o0712m7863N4769Q6774P206m7561j11498m3851N7997N0831k8095L985
$$ plain form
15919 40587 26559 -10063 -28175 -13441 -21899 -15941 -47509 -47333 -98382 -82473 -35325 11705
15907 11705 7298 59680 44982 48310 41708 79679 139966 112217 114709 73758 14529 -59673
15895 -59673 -147091 -75183 27075 76763 102327 52129 -12052 -46831 -42977 -18741 67913 86252
15883 86252 98840 128481 127344 113154 143450 88624 31384 55666 33898 -12702 -75686 -93926
15871 -93926 -12522 66114 14411 -6971 86407 123880 103417 14701 -56674 -88544 -84578 12896
15859 12896 -1712 -89270 -79271 467 21825 -17099 -55485 -99244 -87443 3348 13489 48371
15847 48371 33656 -29752 -44809 -40995 -61038 -15688 -71702 -52021 -21296 -51845 -19868 34825
15835 34825 -25887 -73750 -18981 67793 74999 27438 -84060 -127911 -69914 -19083 -47178 -43193
15823d3193O717L0097M6047j8273n6609J2386q325l7728L193N0304K2604m8003
15811d0783n7077l4963J7646L1326K4403M6255N0612M6659j5684n1142p6911r793
15799f9452P716l5882L853M8801Q522K8782K931p058J8468j9415j2533l0877M0661
15786a5483L3343m6722M0699n4165j7503N6952M3726o8456o1462j4430K4950P77
15774g7774j7519L8834L7941o899j4314m0227n6676N8977K5575j2134n486Q9104
15762A9402J6961m7925m146K8646O014Q150o6261j0321r421k663L1023N1769K4419
15749D5647l3351r9422q0658J0476R4275P3830o9042r6873K8291J53111k647n6292
15737c2655l2580q3698m7846R842Q0363J36810K4143j247k252J3453K2743k8927
$$ plain form
15823 -43193 -36476 -6379 39668 21395 -35214 -22828 -31153 -68881 -65688 -15384 7220 -40783
15811 -40783 -97860 -132823 -115177 -83851 -59448 -13193 37419 84078 68394 17252 -59659 -69452
15799 -69452 -61736 -97618 -93765 -44964 -36442 -7660 -4729 -11787 6681 -12734 -25267 -56144 -15483
15786 -15483 17860 -28862 11837 -42328 -59831 -2879 40847 -27609 -89071 -103501 -78551 -77774
15774 -77774 -95293 -56459 -18518 -25417 -39731 -79958 -136634 -77657 -52082 -64216 -69702 19402
15762 19402 36363 -11562 -15708 12938 18952 27102 -39159 -49480 -58901 -61564 -30541 21228 45647
15749 45647 12296 -87126 -167784 -157308 -63033 10797 -58245 -155118 -126827 26284 23637 -32655
15737 -32655 -65235 -148933 -196779 -186937 -106574 30236 54379 53132 50880 64333 87076 58149
15725E8149o2854L0881M6572m5320m0653J5965K687j155N766L6811j5907k8698
15713B244L5496Q8345m1029l4760j2953q3505m4955M4097J4374k4857p613j5036
15701h0152m7792K5738J09461J7429m7159K5313l3297l4322j8238N23K5263j2983
15689g0216J0296k3327O1173K8883m9732q977o871j1565O7000O9970j523j3070
15677E2041k3900o216N7158k787Q041r3159K2743K7717j7824L8566o5667Q147
15665D860l7916m3237m6579o4443j4040M2720Q2620K5420L4631L7350k692n3004
15653c4310l5217k3m925J4888N9745M2877n3745n1959P748o345k6862m520K732
15640h9916o3261O5850Q39M3676R187k1174L3983j6300l3744L5191L4683p2119
$$ plain form
15725 58149 -4705 26176 72748 27428 -13225 2740 5427 4272 10038 46849 30942 2244
15713 2244 37740 126085 85056 50296 37343 -46162 -91117 -47020 -32646 -57503 -65116 -80152
15701 -80152 -127944 -102206 7255 24684 -22475 2838 -30459 -64781 -83019 -82496 -57233 -70216
15689 -70216 -59920 -83247 -22074 6809 -42923 -51900 -58771 -70336 -3336 66634 65111 52041
15677 52041 28141 21925 79083 76296 84337 -8822 13921 41638 23814 62380 -3287 4860
15665 4860 -33056 -76293 -122872 -187315 -201355 -158635 -76015 -50595 -15964 21386 18694 -34310
15653 -34310 -69527 -69550 -74475 -59587 158 43035 -10710 -62669 -54921 -61266 -88128 -92648 -89916
15640 -89916 -153177 -87327 -86488 -42812 -33625 -54799 -20816 -37116 -70860 -35669 -986 -73105
15628g3105n1562l0060J23731J4983M0180j18433l79M4195L8309K1856J0528o6190
15616d5947l8567N4563J3188j1135K6181k8563J4216L4446L1930K1056p4946l0632
15604c4210r891l3783j0624r392p391J9072Q8570N2402m6721j1703P363K4094
15592B7786O7057J4406m0304l0972j0786L371O8942P5804J7079j38946o4257N494
15580e326k803p9000l2516L8823N0207P129j2324J4183M334M1562j300q666L687
15567A7990j9070R4804K1670K734p7398j6665J2559m2804k0796n636p013P6481
15555C6856j2032l5188O6760K598K3760n2916n526M9029K9423l6183o8522m636
15543f577m5360j0561m40p9654l9378J06164J09586L5979j6506j14616l8387L2916
$$ plain form
15628 -73105 -124667 -154727 -30996 -16013 24167 -94266 -94645 -50450 -12141 9715 20243 -45947
15616 -45947 -84514 -29951 -16763 -27898 -1717 -30280 -16064 18382 50312 71368 -3578 -34210
15604 -34210 -44101 -77884 -88508 -97900 -105291 -86219 2351 54753 8032 -3671 3692 27786
15592 27786 94843 109249 68945 37973 27187 30558 99500 175304 192383 53437 -10820 -5326
15580 -5326 -8129 -87129 -119645 -80822 -30615 -23486 -35810 -21627 -17293 24269 22969 14303 17990
15567 17990 -1080 93724 115394 118128 40730 24065 36624 -6180 -26976 -32612 -39625 36856
15555 36856 24824 -10364 56396 58994 82754 29838 24312 73341 102764 66581 -1941 -6577
15543 -6577 -51937 -62498 -62938 -142592 -181970 -75806 33780 69759 53253 -61363 -99750 -66834
15531f6834M7207M8983q288J3950L0565m6013l6854l324O2290M754p1693j577
15519b6834K5061o4648m9714N8809P5557L0566k9344k6634n9972N6656K5190l9751
15507b5058n3962l9103P852R195Q7849N0363o9155o1370M7724j7450N2404K1037
15495A0326q003k5862j307m2665l9537j431K9554N8086M7355n8136m3918k6672
15483a02210O418K2015m9736m7383J3353q79L3401P8546K5555k4052J0201N5576
15471B0805K7422l3067k8458l6898p24N521L6196j5457N3427m840n3294K9680
15459C13K6136L7408m6163m2814q951r339r746J9893k7527m4554L0115O948K7249
15446d1032K9778j7945L5434J2762K477O296k793m805P221k6003m3799j9958L7387
$$ plain form
15531 -66834 -19627 29356 21068 35018 65583 19570 -17284 -20608 41682 46436 -25257 -26834
15519 -26834 -1773 -66421 -116135 -57326 18231 48797 19453 -7181 -67153 -10497 14693 -25058
15507 -25058 -79020 -118123 -110271 -101076 -13227 37136 -32019 -93389 -45665 -63115 -10711 10326
15495 10326 2323 -23539 -24846 -67511 -107048 -108479 -78925 -20839 26516 -31620 -75538 -102210
15483 -102210 -95792 -73777 -123513 -170896 -157543 -158422 -125021 -46475 -20920 -44972 -34771 20805
15471 20805 48227 15160 -13298 -50196 -50920 -45399 -9203 -24660 28767 23927 -29367 313
15459 313 26449 63857 17694 -25120 -34071 -43410 -53156 -33263 -60790 -105344 -75229 -68281 -41032
15446 -41032 -11254 -29199 6235 18997 21474 27770 24977 20172 27393 1390 -42409 -62367 -24980
15433b4980P4304l1973q992P5287L7804j0489J1490J7348J0513j4276p378o7189
15421F1469l1680j0237j2499m2254n8230m1824K9518J9486j7672J819l6171P6526
15409f1749M5499l1952M5329K8312k3978K7586K9675j6245P1326J8593p7412q0552
15397b5568n4166n7321O4365K9343k0711K8295P9145M5273l6686k4860K2012j7473
15385C1648l0219L709n3936j7128m2749M1242L2949J6202j2368q1459N6201J21877
15373F5969m5692n8813L716j5937r743Q7735O6840K4755j9710n1114J5922l4801
15361B9127n9760n3497J3255J3118M3546k3390M5896K7947o425n9168j5608m7457
15349i2416J5590P2327J9615J5743K2383J750N6843N1448n5575l3489K8982l2935
$$ plain form
15433 -24980 49324 17351 8359 83646 121450 110961 122451 139799 150312 136036 128658 61469
15421 61469 29789 19552 7053 -35201 -93431 -135255 -105737 -86251 -103923 -102104 -138275 -61749
15409 -61749 -16250 -48202 -2873 25439 1461 29047 58722 42477 113803 132396 54984 -25568
15397 -25568 -79734 -137055 -72690 -43347 -64058 -35763 43382 88655 51969 27109 49121 31648
15385 31648 1429 5138 -48798 -65926 -108675 -67433 -34484 -18282 -30650 -112109 -55908 65969
15373 65969 20277 -38536 -34820 -50757 -60500 27235 94075 118830 99120 48006 63928 29127
15361 29127 -30633 -84130 -70875 -57757 -14211 -37601 8295 36242 29817 -29351 -44959 -92416
15349 -92416 -76826 -4499 15116 30859 53242 54992 111835 163283 107708 74219 103201 70266
15337G0266j8507l8502o9745n1223J5273J9916p4908k7074J10023J15342O2219
15326A13080m806l8706n9392r480k6071l6820l2631l087O3077K4784N9252j9834
15314B9366j1789j7777J577n0517m929M885q445O9582N921k6188l1096K8281J0827
15301c02k4313k8599k6357m5531K7321R9971j5256k5999J9641J7619j8751L1577
15289A1021j1838p8650K8710L8916Q910K0499N0739K0406o0993j156N6467l9302
15277D3729n4204n190L881j9849J3095l3935L229M2076k2409n5279l1974L3812
15265h3018O8090p769j1315L1756j0101j2786N5331J2013m8079j7392j022k0571
15253d4863J6950N0130j5925k4311k4966N39J6935O6089K8520o3972K420O2301
$$ plain form
15337 70266 51759 13257 -56488 -107711 -92438 -72522 -147430 -174504 -64481 50861 113080
15326 113080 108274 69568 10176 696 -25375 -62195 -94826 -97913 -34836 -10052 49200 29366
15314 29366 17577 -200 1377 -49140 -54069 -49184 -57629 11953 17874 -8314 -39410 -11129 -302
15301 -302 -24615 -53214 -79571 -125102 -97781 2190 -13066 -39065 -19424 -1805 -20556 11021
15289 11021 -817 -79467 -50757 -11841 -2931 17568 68307 88713 27720 26564 83031 43729
15277 43729 -10475 -15665 -11784 -31633 -18538 -52473 -49244 -7168 -29577 -84856 -116830 -83018
15265 -83018 -14928 -22697 -34012 -2256 -12357 -25143 30188 42201 -5878 -23270 -24292 -44863
15253 -44863 -27913 22217 6292 -18019 -42985 -42446 -25511 40578 69098 5126 7546 69847
15241F9847o2223m3921r898J1741K9304j7619o9943m2353J00344L3993K1850j051
15229B0071l6201M2639M5144m2454M5123J5285j0915o467k4001n2427n9145j0924
15217g4272O1710J04181N7926m8289n1983N8484j3830K8965k335K3821o1205n9758
15205B3415m6268M1841l3578j2267K8545R7855K521Q55l3486p619k2683m2937
15193c806l0087j0299k408J1518L7314M0088n870J8030L473m2034n2892K4490
15181a2483N1998K4111o5588L6050j28l7141l9989k8109k6673O3033K3208J5733
15169D022J3215l5180k400K294J2217N9975L4281q3682j1854K677j707M4411K1309
15156E9578k1470O672R169N010o7057p0339J3806K4137N2990n0144l1191m308
$$ plain form
15241 69847 7624 -36297 -46195 -34454 -5150 -22769 -92712 -135065 -34721 -728 21122 20071
15229 20071 -16130 26509 71653 29199 74322 89607 78692 72225 48224 -4203 -63348 -74272
15217 -74272 -12562 91619 149545 101256 49273 107757 93927 122892 120557 144378 83173 23415
15205 23415 -22853 18988 -14590 -26857 1688 99543 102064 102919 69433 61814 39131 -3806
15193 -3806 -33893 -44192 -46600 -35082 2232 42320 36450 54480 57953 15919 -36973 -12483
15181 -12483 39515 63626 -1962 34088 33960 -3181 -43170 -71279 -97952 -34919 -11711 4022
15169 4022 17237 -17943 -20343 -18049 -5832 54143 88424 4742 -7112 -4435 -6142 38269 59578
15156 59578 38108 44780 53949 58959 -8098 -78437 -64631 -40494 12496 -37648 -68839 -73147
15144g3147R34j092J1569M1660K9914p6734j8597K8565Q0221m8701K6698K1864
15132B3154o9192L7468L817k9196n4511m6715l4595M6038J27431K5034l8899J9362
15120I196J3253K1622l523k4463j2237r058q5837j641L8518O3907K5009n7213
15108b2467K6396P2550M800n8200j835M5697J4016k7875l3880o2786k1364K7558
15096c7390K5217m2094l8111j2025J2016M4317l9884j0339M8271J7326L089K1464
15084h143L0931k0063p227o1556l400M2557j1141n0920M5277R869K9317M5306
15072D0807J1588l4244m9992o7754J5597L70J6663J7268N3741l8610m4275L6425
15060d2416R8776m7698r605Q1170M6763K6384k3021j29115q0506P3491k0212q823
$$ plain form
15144 -73147 -72213 -73305 -61736 -20076 9838 -66896 -85493 -56928 23293 -25408 1290 23154
15132 23154 -46038 -8570 -4753 -33949 -88460 -135175 -169770 -123732 3699 28733 -10166 9196
15120 9196 22449 44071 40548 16085 3848 -5210 -91047 -92688 -54170 9737 34746 -22467
15108 -22467 3929 76479 81279 23079 21244 66941 80957 53082 19202 -43584 -64948 -37390
15096 -37390 -12173 -54267 -92378 -104403 -92387 -48070 -87954 -98293 -50022 -32696 -29607 -8143
15084 -8143 22788 2725 -4502 -66058 -69458 -26901 -38042 -88962 -43685 -33816 -4499 40807
15072 40807 52395 18151 -31841 -99595 -83998 -83628 -66965 -49697 4044 -34566 -78841 -42416
15060 -42416 56360 8662 -943 80227 126990 153374 130353 1238 -79268 -5777 -25989 -34812
15048c4812m4404L6090k9005r1583J7076J01231M3037L2335O182j4573l0674R570
15036D70m2618k7050k5799l248j9134j2258J14368N9745j3798K5521L4662m2961
15024D7900j5290j6252n2091j8064L0943K743k8157j4677M8636K6596o1930K2272
15012b7371L1259l6958k5442l987R2533N7162j3309p3427m6019k1294j9128N8990
15000b6991J8844Q1215o1164o0065k3791l4885L8287M583O1508J9717p019j0753
14988e14N4899o750k9548j9092n0680L1040K504q224K1059L0917l3902L954k963
14975g300K724q051O3452M506l94m3700m202J7107J8200l0904n2568M6453O3081
14962F8404L1992N3008j2866j19001p8561L4074J6835n662J0422J1572J1199L1214
$$ plain form
15048 -34812 -79216 -43126 -72131 -163714 -146638 -45407 -2370 29965 36147 21574 -9100 470
15036 470 -42148 -69198 -94997 -98245 -117379 -129637 -15269 44476 30678 56199 90861 47900
15024 47900 32610 16358 -35733 -53797 -22854 -20111 -48268 -62945 -14309 12287 -49643 -27371
15012 -27371 3888 -33070 -58512 -62499 30034 87196 73887 460 -45559 -66853 -85981 -26991
15000 -26991 -8147 73068 11904 -48161 -71952 -106837 -68550 -63967 -2459 17258 10239 -514
14988 -514 54385 47635 18087 -1005 -51685 -20645 -18141 -26365 -5306 25611 -8291 -4337 -7300
14975 -7300 -4576 -12627 50825 55331 54937 11237 7035 24142 42342 11438 -41130 5323 68404
14962 68404 100396 153404 140538 21537 -57024 -22950 -6115 -11777 -1355 10217 21416 52630
14950E2630K2598n1684q4579L2847o484L4339J883J5212K9699Q766j2124k9035
14938A4068N22N3985N1009j4502n5334q493o6622J5718L4550M5736j3525J4138
14926G1250m9855q8612M0884o225j5109J8885N9675j2293l146n4846m8679M8821
14914c9250L4213k4954N616N0638k142m1131L7512r752l7217j9178K0944K8556
14902C855l519j4965j4852L8210N7482O5152m0624m2677m3794j2090N3410M8387
14890I3975J057j7873j0224j4841p3706m5632M5438K5799J0812l5410r3672n578
14878a19855N2211P0792l193J2884l311j5094L1086J3179P2011J6463M2241K566
14866A71980n9860j11092M267J4315K6412j3560N3720K8025l7902j3606p4044
$$ plain form
14950 52630 75228 23544 -61035 -28188 -34672 -333 1550 16762 46461 55227 43103 14068
14938 14068 14590 68575 119584 105082 49748 41255 -25367 -9649 24901 70637 57112 71250
14926 71250 21395 -67217 -26333 -32558 -47667 -28782 30893 18600 15454 -39392 -88071 -39250
14914 -39250 -5037 -29991 -24375 26263 24121 -17010 20502 10750 -26467 -45645 -24701 3855
14902 3855 336 -14629 -29481 8729 66211 131363 90739 48062 4268 -7822 45588 93975
14890 93975 95032 77159 66935 52094 -21612 -67244 -21806 3993 14805 -20605 -114277 -119855
14878 -119855 -67644 3148 -45 12839 9528 -5566 25520 38699 110710 127173 169414 171980
14866 171980 112120 1028 5295 19610 46022 32462 86182 114207 76305 62699 -11345
14855a1345j1681N1316Q943J4562J4936q435m2078k9812N8042N5700m7317L1451
14843H4282k7930L365o6927j0363R533l1269m4639O7556N8284J2833j07643m3577
14831i6495L4303P3059M6488l1404o990k3032j5613k6015J171p874R7753O4313
14819A09664j2004k4655l7483N492K0918k9806Q775K8919M7591k3885n2235o4979
14807b3688l5372O3133Q4615L1411q5003j04489K9227J11536k5330j8299j7202
14796A0539n1721k5265P9309R2469k8057k3446L8944k0718L9870k5060p5730L5111
14784D6245K5799L9433n3968J0385L3698n875j9315j8801j5897L0919R36p5914
14772b355m2793L089P6422J1959n6995l6098k4421k9262j1458k0720j8463L3145
$$ plain form
14855 -11345 -23026 28290 37233 51795 66731 58296 16218 -13594 44448 100148 52831 84282
14843 84282 56352 59717 -7210 -17573 -8040 -39309 -83948 -16392 41892 54725 -52918 -96495
14831 -96495 -62192 10867 57355 25951 18961 -4071 -19684 -45699 -44528 -52402 45351 109664
14819 109664 97660 73005 35522 41014 61932 32126 40901 69820 117411 93526 41291 -23688
14807 -23688 -59060 4073 88688 120099 35096 -69393 -40166 71370 46040 27741 10539
14796 10539 -41182 -66447 12862 105331 77274 53828 92772 72054 111924 86864 11134 46245
14784 46245 72044 111477 57509 67894 101592 95717 76402 57601 41704 72623 73559 -2355
14772 -2355 -45148 -42059 34363 46322 -10673 -46771 -71192 -100454 -111912 -132632 -151095 -117950
14760a17950M5144N6690O0307j1406j4331J9646l655m460L0742j1227j5592m5752
14748a1844k2966j004O8251L511J0340o0618J0236N3029j370n4908n615l0935
14736d3893Q793k8263L5925o794m2769J4086j9533m6058j9203L47M0998J2033
14724i4331L5722O7052j7762r328K3417q8607l9220M5684N0194K7487M2372L6971
14712G9651p3671J3901p2342L202L8321j8899k8485k1656J4511p259Q361M4824
14700a9541m1802j4071M8272l6948n2063Q955M5409K0492k1699m241j2365N475
14688g4127P9304L0401k672l4148o1181J9964p20k5983o169O2833m325k5227l8932
14675h0982k2948K2282J39449L7161j9175p0261l5494L979k032J815L7508M7471
$$ plain form
14760 -117950 -72806 -16116 44191 32785 18454 38100 34445 29985 60727 49500 33908 -11844
14748 -11844 -34810 -35814 32437 35948 46288 -14330 -4094 48935 47565 -7343 -12958 -43893
14736 -43893 -35100 -63363 -27438 -34232 -77001 -62915 -82448 -128506 -147709 -147362 -106364 -94331
14724 -94331 -58609 8443 -9319 -18647 4770 -83837 -123057 -77373 -27179 308 42680 79651
14712 79651 5980 19881 -52461 -49259 -10938 -29837 -58322 -79978 -65467 -72726 -64365 -19541
14700 -19541 -61343 -75414 -27142 -64090 -116153 -107198 -61789 -41297 -62996 -67237 -79602 -74127
14688 -74127 5177 35578 32906 -1242 -62423 -42459 -43179 -69162 -75331 -12498 -16823 -42050 -80982
14675 -80982 -103930 -81648 57801 94962 75787 5526 -29968 -25989 -28021 -26206 11302 58773
14663E8773l4444r284P091L2734n4102q3591N736R3665l3198r632k2357K542J4056
14650c2011k837l98j094q798J1999K9581j4818J3094L3317j7945J4646K7957K4593
14637G7286q1231l9404N5401J2565p606n6999j291k9358j8386j1861n4919J6070
14625a39733L2549O6227p23q626r295P9300M8871n829q0831K1678O3504k7008
14613D0084j315L0297K2850N6140n4881p7932l8666L2727n927l5168p0605L8985
14601f3411R180L3215K7665K5170J3635K196J7975L4768K785m8811n1939J2659
14589A5087J3194q8935n880J2280k0882K3063N4439j2780n4030n3340j4142M0062
14577i1864n936p723m9268J0761R4036J02657l1857j7310J9963J3779M812k5003
$$ plain form
14663 58773 24329 15045 22136 54870 768 -82823 -77087 16578 -16620 -26252 -48609 -46067 -32011
14650 -32011 -34848 -35246 -36340 -45138 -33139 -3558 -18376 -5282 28035 10090 24736 52693 77286
14637 77286 -3945 -43349 12052 24617 17011 -39988 -41279 -70637 -89023 -100884 -155803 -139733
14625 -139733 -107184 -40957 -41680 -50306 -59601 19699 68570 62741 -18090 3588 67092 40084
14613 40084 38769 69066 91916 148056 93175 15243 -23423 9304 3377 -31791 -102396 -63411
14601 -63411 -54231 -21016 6649 31819 45454 47650 65625 100393 103178 54367 2428 15087
14589 15087 28281 -60654 -66534 -54254 -75136 -52073 2366 -10414 -64444 -117784 -131926 -91864
14577 -91864 -97800 -105523 -154791 -144030 -49994 52663 20806 3496 23459 37238 42050 17047
14565A7047q746L1718K9388r341r4342J9618O2399j4077r618L8760l7939n0991
14553b6124m8190k4168O4286j027J8170q8808j0815O1486k4622k3738K173n2287
14541a53664j1086M6450K6088L8249J4948K1333N1214O3767m8957o9339p7007
14530i8004r476K7535M9627K7409M9235m9926j2835P046m6361l082m1898K4685
14518g6045L3640l323L3651J3279L3306R151q274J4446l2126M0773M709o1340
14506A847L3636R215M2052L7131l855j05763o5291m9646n7729N8522K3276L350
14494g3255M4719M7637J0661r8581l0741m7413M6199N7167O2124R4726m4912m7858
14482B0473N2666k1954Q344k8382k4520j4424N837l7532K171n5748m8060P4349
$$ plain form
14565 17047 8301 40019 69407 60066 -34276 -14658 47741 33664 24046 62806 24867 -26124
14553 -26124 -74314 -98482 -34196 -35223 -17053 -105861 -116676 -55190 -79812 -103550 -101377 -153664
14541 -153664 -164750 -118300 -92212 -53963 -39015 -17682 33532 97299 48342 -20997 -98004
14530 -98004 -107480 -79945 -30318 -2909 46326 -3600 -16435 -9389 -55750 -58832 -100730 -76045
14518 -76045 -42405 -45728 -12077 1202 34508 43659 35385 49831 17705 58478 63187 1847
14506 1847 35483 44698 86750 123881 120026 14263 -51028 -100674 -158403 -99881 -76605 -73255
14494 -73255 -28536 19101 29762 -68819 -99560 -146973 -100774 -43607 18517 113243 68331 20473
14482 20473 73139 51185 59529 31147 6627 -7797 -1960 -39492 -37321 -93069 -141129 -66780
14470f6780j2599k4828M0243j0096N1352N8604k6336m0968L81L6945L8512l3052
14458A1378Q910q007K2904L2462r320m3482k993M5247l7003k2169J523M7482J2826
14445E9758m8925m277o498n208J0976n4097n3258K6145N2184M0874J7131p023
14433B7782k0737O5076J5167m7306L6253O3258p7440p4961n9406K8583m686k2887
14421g1304k8130O0670K1433L1957K3479K9377J6593n4070q078l9904l0015L7860
14409a0132l1231K4325K7807q474k9503j4081K0251l4492L8605L2521J167n089
14397A1674L9535J2683p817j020M8720J8956j14828m4926M2490n0216L536N0426
14385I213K6852j795m2821n2935o4997o122K7694L0578L0300l613M2128K1755
$$ plain form
14470 -66780 -79379 -104207 -63964 -74060 -22708 35896 9560 -31408 -31027 5918 44430 11378
14458 11378 20288 12281 35185 67647 58327 14845 11852 57099 20096 -2073 -550 46932 59758
14445 59758 10833 6556 58 -5150 5826 -48271 -101529 -75384 -23200 17674 34805 27782
14433 27782 7045 72121 87288 39982 76235 139493 62053 -12908 -72314 -43731 -48417 -71304
14421 -71304 -99434 -38764 -17331 14626 38105 67482 84075 30005 21927 -17977 -47992 -10132
14409 -10132 -41363 -17038 10769 2295 -27208 -41289 -21038 -55530 -16925 15596 16763 11674
14397 11674 51209 63892 56075 55055 103775 122731 7903 -37023 5467 -44749 -41213 9213
14385 9213 36065 34270 -8551 -61486 -126483 -132605 -104911 -74333 -44033 -47646 -5518 16237
14373A6237n825k501K1694K9748J3932l3775l8774o4534P0007K9465K8490k1344
14361D2820L1026J320n1335K0298j1989j1390O4824k947o6630J1403N491m5330
14349a2439o3137k0029M1582k0546P8791P8360k8329j9666m1851l0256n7002q8925
14337a83447K1353Q8117l5957m264m3049J8990N0203j2079L1416O2519k7749M8369
14325A4422K3861p758j8687L7182j5810k4476K4758k3827N951P049J5346l4443
14313C568j5720j014l121o5732L0565J7812J21853m5553l7806J4514O418o300
14301A9484M7286m807k3761k1070o0940r587L1590j9469K6522m0321l1911j186
14289h8170K4259m1302l1926L1907K9179J5110N8499M3348k3016q7090j0667m5722
$$ plain form
14373 16237 10412 7911 29605 59353 73285 39510 736 -63798 6209 35674 64164 42820
14361 42820 73846 75166 23831 44129 32140 20750 85574 82627 15997 27400 32891 -12439
14349 -12439 -75576 -95605 -54023 -74569 4222 82582 54253 34587 -7264 -37520 -94522 -183447
14337 -183447 -162094 -73977 -109934 -114198 -157247 -138257 -88054 -100133 -68717 -6198 -33947 14422
14325 14422 38283 30525 11838 49020 33210 8734 33492 9665 15616 22665 38011 3568
14313 3568 -12152 -13166 -16287 -82019 -51454 -33642 88211 42658 4852 19366 25784 19484
14301 19484 66770 61963 38202 17132 -43808 -53395 -21805 -41274 -14752 -55073 -86984 -88170
14289 -88170 -63911 -105213 -137139 -105232 -76053 -60943 -2444 40904 17888 -69202 -79869 -125591
14277a25591l7489Q9720J9637J1156L0820P1853l915j7524m754m1154n5162K4415
14265c7988j5391L2795N5194L9147l0843j6087l6475j1125l1231L713J3525k3581
14253e8347j6100J7651k3964k2425K4435n6046m1480N2559N6634J6199k1387K0287
14241e1984O4723j9093r704j5646O5098k9221o0011l3880o333J9053j03597L6882
14229a43713P1288J0723K97m9623l3644K6777N0873N9061M5620L307M640n7436
14217a1830l5657q7910Q6720K1479j1890k1442r6466K3408M6708Q5775L7951K2779
14205E9625K1066k1084o1751k9960j6187N5124J2125k6261K5701j4290l866n6651
14193e6409M9312m0506j4076Q731j3558J1920j2657M0256O2644L471m6302m8952
$$ plain form
14277 -125591 -163080 -73360 -53723 -42567 -11747 60106 56191 38667 33913 -7241 -62403 -37988
14265 -37988 -53379 -20584 34610 73757 42914 26827 -9648 -20773 -52004 -48291 -34766 -58347
14253 -58347 -74447 -56796 -80760 -103185 -78750 -134796 -176276 -123717 -67083 -50884 -72271 -51984
14241 -51984 12739 -6354 -16058 -31704 33394 4173 -55838 -89718 -96051 -76998 -180595 -143713
14229 -143713 -72425 -61702 -61405 -111028 -144672 -117895 -67022 -7961 37659 40966 45606 -11830
14217 -11830 -47487 -135397 -48677 -27198 -39088 -60530 -156996 -133588 -86880 -1105 36846 59625
14205 59625 80691 59607 -2144 -32104 -48291 6833 18958 -7303 18398 4108 242 -56409
14193 -56409 -7097 -47603 -61679 -52948 -66506 -54586 -67243 -26987 35657 39128 -7174 -56126
14181e6126J8809L3634J1886J2113N3351K8156l679j579p473o2263o504m020j2211
14168D094k4907j3157n1679j2795R803M3589R1759P0512j8346o2883m3588n6825
14156f4423K6183R067R157L5216m0632m9381K6583j2486Q6894L4130J3250l1355
14144D2203J7646K1519m4311K7135k1890k7564k3996J271K051K3787l3613O129
14132i633N1385r02M552P8545O6738L6983r6200Q845n523k2617l8032r610l4989
14119B9542l7974j0719J434q962K1766j0281L0203P2152M918m8736j0497n06k3332
14106I008j1800J03926n589j21120k6916L5160M8696n2307o2138M9323M6029L0426
14094D2698J1447k8319q092M5865n804j4500n3944p8587K6349Q6201L4212q5937
$$ plain form
14181 -56126 -37317 -3683 8203 20316 73667 101823 98144 96565 89092 26829 20325 16305 4094
14168 4094 -20813 -33970 -85649 -98444 -88641 -45052 46707 117219 98873 35990 -7598 -64423
14156 -64423 -38240 -29173 -20016 15200 -25432 -74813 -48230 -60716 26178 60308 73558 42203
14144 42203 59849 81368 37057 64192 42302 14738 -9258 -7987 -5936 17851 -15762 -9633
14132 -9633 41752 40850 45402 123947 190685 227668 131468 140313 134790 112173 74141 64531 29542
14119 29542 -8432 -19151 -17717 -26679 -4913 -15194 15009 87161 92079 43343 32846 32340 9008
14106 9008 -2792 101134 95545 -25575 -52491 -17331 31365 -20942 -83080 -33757 12272 42698
14094 42698 54145 25826 17734 63599 57795 43295 -10649 -89236 -62887 23314 57526 -28411
14082b8411N057J296R8938O134k1437o3146o3638j9613O4249O5796k4236j00654
14070g9665o3886N850Q7190j2696j4344J4752m206O9320P7881k6701k1479P501
14058C9517L9644J0469K9519N0457k3452n7681o7046J6326m9715o936m3933O674
14046e6157P6888L2185q6888o0094L9987l242J3934o392m1689L8533M1074m6993
14034e8854Q2378O097o3571k9945k2032K894J4022M2227N2317l2564l4841q222
14022e0094K8285R3075L2311l4683o658m3584K8233N1875m5162j8609N6667k5928
14010F5728m4539q0741o7222L1986K2479m453Q669n4440N9309l0813L8580Q5360
13998B9903k8554m8674L4401L3809o022O5277O5284n0024n4846m7117o8428J4353
$$ plain form
14082 -28411 -23354 -22058 76880 83014 61577 -1569 -65207 -84820 -20571 45225 20989 -79665
14070 -79665 -143551 -137701 -50511 -63207 -77551 -62799 -67005 2315 80196 53495 32016 39517
14058 39517 79161 89630 119149 169606 146154 88473 21427 37753 -11962 -18898 -62831 -56157
14046 -56157 20731 52916 -33972 -94066 -54079 -57321 -43387 -49779 -91468 -52935 -11861 -58854
14034 -58854 23524 29621 -33950 -63895 -85927 -83033 -69011 -26784 25533 -7031 -41872 -50094
14022 -50094 -21809 71266 103577 68894 62236 18652 46885 98760 53598 34989 91656 65728
14010 65728 21189 -59552 -126774 -94788 -72309 -76762 -68093 -122533 -63224 -94037 -55457 29903
13998 29903 1349 -47325 -12924 20885 14863 80140 145424 95400 40554 -6563 -74991 -60638
13986f0638M3555J6087J099L0962J6742o5333J372l23m5123j1069J9715k9011
13974h1965j5248J3597J9212L7977k9277M6588Q5695P5424k03q8330K819L8874
13962A05163n4444n1508P4581k4506p0485M2110Q1270j2597l1966l4428m0539
13951a7349J8993N6680n5676n0565l3039J3396N150j0286j7014N1307P5768m9173
13939a1808n3864j575j7708M9610j1354J3527Q2617K9961p879j2232l2696n0380
13927b3781n972j2079J3335N5864j3198m5436o092K1589j9756L0918K8015J223
13915B4630k2364p0708j4660M5308j7317J1499K3187m7219l326P326m525J2370
13903e5799N5006L4505l8445q6873P4297N0664j9775J9687p452M2994K7630L679
$$ plain form
13986 -60638 -17083 -996 103 31065 47807 -17526 -16154 -16477 -61600 -72669 -52954 -81965
13974 -81965 -97213 -83616 -64404 -26427 -55704 -9116 76579 152003 151800 63470 66289 105163
13962 105163 50719 -789 73792 49286 -21199 20911 102181 89584 57618 23190 -17349
13951 -17349 1644 58324 2648 -47917 -80956 -67560 -62410 -72696 -89710 -38403 37365 -11808
13939 -11808 -65672 -67247 -84955 -35345 -46699 -33172 49445 79406 71527 59295 26599 -23781
13927 -23781 -29753 -41832 -28497 27367 14169 -31267 -37359 -15770 -35526 -4608 23407 24630
13915 24630 2266 -68442 -83102 -37794 -55111 -43612 -20425 -67644 -70970 -63644 -68169 -55799
13903 -55799 -793 33712 -4733 -91606 -17309 33355 13580 33267 25815 68809 96439 100118
13891A00118k2714O2506m5739r2031J1967N0695J5957j6257P735j0268m33l1987
13879B9549p5387k8939j5841Q9979M083k4000N112M0844M6378j3383l039J1818
13867F7174p686J0910l51K0391q1034k9699K6838j8065k5396L2596P955k5142
13855b1509N2134l5172n8591P4935N2887M1512l1491j04763L9841K3206p9666
13844d6677P647O4822j7985J3805L9906o341q1854k1231P6734O2060j5789J1582
13832H6679n7643j1529n7662o4993l1545J01627r720o8018n5133J2858L3634q707
13820a30152J157N7415K9702N9259L6922l4993k7357l0469j0680L1864L6851J1448
13808C0967M8165R489m2820r9649l500L0231k9135L7424k5080M189K7813O8470
$$ plain form
13891 100118 77404 139910 94171 2140 14107 64802 80759 64502 72237 61969 61536 29549
13879 29549 -45838 -74777 -90618 -639 3444 -20556 -15444 25400 71778 58395 55356 67174
13867 67174 59488 70398 70047 90438 9404 -20295 6543 -11522 -36918 -4322 3633 -21509
13855 -21509 30625 -4547 -63138 11797 64684 106196 74705 -30058 9783 32989 -46677
13844 -46677 -39030 25792 7807 21612 61518 55177 -26677 -47908 28826 90886 75097 86679
13832 86679 29036 17507 -40155 -105148 -136693 -35066 -44786 -112804 -167937 -155079 -121445 -130152
13820 -130152 -128995 -71580 -41878 17381 54303 19310 -8047 -38516 -49196 -17332 19519 30967
13808 30967 79132 88621 45801 -53848 -57348 -27117 -56252 -18828 -43908 -39719 -11906 56564
13796E6564K955R131n0199m2550j2500M49P287k792J4655n162l4885m9854L5458
13783g1443j3755n4178j3567o30L4654O1279J2610m9198M2159N2561m7562o118
13771e3188N972N3312R6768m5926m1617L5512L1984j9072r0008j8635K1171j3763
13759c7490R651l7818l3627J8822K1958N5837R3035J1953j07326q0930L5323O4388
13747A3776m7038N979O8522p138m3290q5432k8407J1789M7192J10161n4556m9464
13735e7906K9786J8483r251n130N1148N5828J039j05655k2939o87k3814J01177
13723C2079K8852k1308n0143l3585p314K2330M0836K3612Q8301N6026j23626n9262
13711c202J197l5517l1634J4136M7609M0861J0932p2173q237m703J836Q0342M4172
$$ plain form
13796 56564 59519 68650 18451 -24099 -36599 -36150 -28863 -31655 -17000 -22162 -57047 -106901 -71443
13783 -71443 -85198 -139376 -152943 -153573 -118919 -57640 -45030 -94228 -52069 492 -47070 -53188
13771 -53188 -47216 6096 102864 56938 15321 50833 82817 63745 -26263 -44898 -23727 -37490
13759 -37490 -27839 -65657 -99284 -80462 -58504 -2667 90368 102321 -5005 -85935 -50612 13776
13747 13776 -33262 -27283 41239 34101 -9189 -94621 -123028 -111239 -64047 46114 -8442 -57906
13735 -57906 -28120 -9637 -18888 -24018 27130 82958 83997 -21658 -44597 -45284 -69098 32079
13723 32079 60931 39623 -10520 -44105 -51419 -29089 11747 35359 123660 179686 56060 -3202
13711 -3202 -2005 -37522 -69156 -55020 -7411 33450 44382 -27791 -36028 -40731 -38895 41447 85619
13698H5619j6014p7924l8669m4837k4337j5320L5425K2544j1415m070P6453J26310
13686A13765J3691j0027n2149j08030m4474L8349j4907j8249M1336O9608L6819
13675F5732m9763o1553k3138M1522n559j9224k2903J6631O4792L189j5746l5446
13663d1466l7377R450K6685k9165P1037l898j2872K9536M4885l6430k2369o58
13651b642N3638R521j6712k0047k3142L4771M6339n3756k5935M4472J4357j2990
13639D7874n1038o3661R616M1514K7955k2010L8244L3647L3143R4175L6918p441
13627B18936p8200o1959j17832j5922J2574j3291L3753r964p90M4798M1531M3769
13615I7403o8937k0428j3556j9030K4030M9793J8332l8906L9382L0068l9252m0620
$$ plain form
13698 85619 69605 -8319 -46988 -91825 -116162 -131482 -96057 -73513 -84928 -88998 -12545 113765
13686 113765 127456 117429 65280 -42750 -87224 -48875 -63782 -82031 -40695 28913 65732
13675 65732 15969 -45584 -68722 -27200 -32759 -51983 -74886 -58255 6537 9726 -6020 -41466
13663 -41466 -78843 -69393 -42708 -71873 -836 -4734 -17606 11930 56815 20385 -1984 -2642
13651 -2642 50996 60517 43805 23758 616 35387 81726 27970 2035 46507 60864 47874
13639 47874 -3164 -66825 -57209 -15695 12260 -9750 28494 62141 95284 189459 226377 218936
13627 218936 140736 78777 -39055 -54977 -42403 -55694 -21941 -31905 -32695 12103 53634 97403
13615 97403 28466 8038 -5518 -24548 -518 49275 67607 28701 68083 98151 58899 18279
13603A8279O0613q43o6139m145K7909l399j6444K5051N1096k7260l6405o3587
13591c5274J7154K5065M7955M8799n5476q1037N81R723J7623m2065k5978J8710
13579e4220j904P3438q834m7845p11J6731M0277k912l7143K2793j3734k9580k4419
13566f8063K3390Q0169O25q1570k2075K726J1341M8857K4144j0864l5898K2376
13554d842O6938n4603k2377K544M0210r188k9528R0287j34r4773n1157k369K1979
13541d7013N4923o95M047K7637P613J747O5401k9306k2616k4254k6491O245k1952
13528d714r8314l5968L0094N8004M7190j1319R846O0525O275n6080L8119m307
13516C9351n0751l1291Q047j8955N2342J4149P03L3568K6968L1293O177r8586
$$ plain form
13603 18279 78892 78049 11910 7765 35674 32275 15831 40882 91978 64718 28313 -35274
13591 -35274 -18120 6945 54900 103699 48223 -32814 -32233 -22510 -4887 -46952 -72930 -54220
13579 -54220 -56124 17314 8480 -39365 -40076 -23345 16932 14020 -23123 -330 -14064 -43644 -68063
13566 -68063 -44673 35496 36121 -45449 -67524 -64798 -53457 -4600 19544 8680 -27218 -4842
13554 -4842 62096 7493 -14884 -12340 27870 18682 -10846 79441 79307 -15466 -66623 -68992 -47013
13541 -47013 7910 7215 11262 38899 46512 48259 113660 84354 61738 37484 10993 17238 -4714
13528 -4714 -103028 -138996 -108902 -50898 -3708 -15027 -5181 55344 61619 5539 43658 39351
13516 39351 -11400 -42691 -34644 -53599 -1257 12892 13595 47163 74131 105424 111601 13015
13504A3015p1218M3062M2101l3006n7718K5356Q9969O6187J5337R71n091L5501
13492A64466p8104j9855K3346P634k5750J0210l524k2568l6070q448K9213J6052
13480E6602M6636k9568n5137l2318K7466M7062M1383J4590p1711k1341L1649l0513
13468B4800N011R5834L1245R934p1944q3410m60J7733k7284J0772L4677N5994
13456A02902q719k5564j6017O3213J6492J1247j4097m3418j6827n036n7034o2580
13444e5438k5032O7057J20294J3009k4487m5853J809k8697q0139L485K7333L4584
13432G925L0860q795k4724K0253N1882K013j1284l4643k1938l2269k7618M1256
13420g082L2541L0326L9079j2951q3962p4594n5599L7218M5396l0465M1137K7574
$$ plain form
13504 13015 -58203 -15141 26960 -6046 -63764 -38408 51561 117748 133085 134056 128965 164466
13492 164466 86362 66507 89853 97487 71737 81947 78423 55855 19785 11337 40550 56602
13480 56602 103238 73670 18533 -13785 13681 60743 102126 116716 45005 23664 55313 24800
13468 24800 29811 125645 156890 166824 94880 11470 11010 28743 1459 12231 46908 102902
13456 102902 94183 68619 52602 115815 132307 143554 129457 86039 69212 64176 7142 -55438
13444 -55438 -80470 -13413 106881 119890 95403 49550 51359 22662 -57477 -53992 -26659 7925
13432 7925 38785 29990 5266 25519 77401 79414 68130 33487 11549 -20720 -48338 -7082
13420 -7082 25459 55785 94864 81913 -2049 -76643 -132242 -95024 -49628 -80093 -38956 -11382
13408a1382j0644k3827j4487j3247M8801K4405K8881j2079o0975J1439Q6639O3852
13396A17376l5236o2330K7716k0137k7756j7695k0424r2254J12389J9173J3000
13385A3822L5216j1741j1647L002Q534K2385m0280j125J1853K8873k2258j5249
13373B1385L729O5780M6683Q05q4555l9741K3032j8653J2855J2916l9831o0587
13361e6182l1774j1373j2111O4159M4904L3515l3068r497m749m0614k4027M2188
13349c8629O123l9285J2468M3425L2689k9664l0094q740k327j3501l5358j4485
13337a17378R3769l1475l714Q9954K0045m8224j0422K8957K4509m9357j9906K045
13325b1197K4417M6755j0758o2090J6721L8936k9779q2123J4447O7580K5379L3040
$$ plain form
13408 -11382 -22026 -45853 -60340 -73587 -24786 -381 28500 16421 -44554 -33115 53524 117376
13396 117376 82140 19810 47526 27389 -367 -18062 -38486 -130740 -18351 822 13822
13385 13822 49038 37297 25650 28652 37186 59571 19291 18166 30019 58892 36634 21385
13373 21385 25114 90894 137577 138382 53827 14086 37118 18465 31320 44236 4405 -56182
13361 -56182 -87956 -99329 -111440 -47281 -2377 31138 -1930 -11427 -16176 -56790 -80817 -38629
13349 -38629 -32506 -71791 -59323 -15898 16791 -12873 -42967 -51707 -54034 -67535 -102893 -117378
13337 -117378 -23609 -55084 -58798 31156 51201 2977 -7445 21512 46021 -3336 -23242 -21197
13325 -21197 3220 49975 39217 -22873 -6152 32784 3005 -79118 -64671 2909 28288 61328
13313F1328K6208l0020N4605J0533j13802m2330O90J8607m5417J1932M6002M5303
13301D3639M6013P508q7174n8710K6803J6638L5658n0833q2396J938R815O2753
13289b8348J0993m565k403o0677m3592M4775L4860k216k3653O852K7367k6194
13277f6801O7668Q0898o943m8347k9308k1604J6335J9074r240l89l4022j6615
13265d9294K3818l1909n0406Q3527P1134L3816j9809o9532Q708Q393l8566N4356
13253B4236O4037q4861J6587j6330L057k2319K0735Q6875L0041O0681n8748q7484
13241C6507m8356M5558M8653J4890J7986J7753l4367j6145l4550r6561p9000M3229
13229h4403R5133m1360l6098K779j6737j523M1328O6320J290m9643k6855L8185
$$ plain form
13313 61328 87536 57516 112121 122654 8852 -33478 -32788 -14181 -59598 -47666 -1664 43639
13301 43639 89652 97160 9986 -48724 -21921 -5283 30375 -20458 -102854 -100916 -91101 -28348
13289 -28348 -17355 -21920 -24323 -85000 -128592 -83817 -48957 -51173 -74826 -67974 -40607 -66801
13277 -66801 867 81765 74822 26475 -2833 -24437 -8102 10972 1732 1343 -32679 -49294
13265 -49294 -25476 -57385 -107791 -24264 46870 80686 60877 -8655 53 8446 -30120 24236
13253 24236 88273 3412 19999 3669 6726 -15593 5142 92017 122058 182739 123991 36507
13241 36507 -11849 33709 82362 97252 115238 132991 98624 82479 47929 -48632 -127632 -84403
13229 -84403 10730 -30630 -66728 -63949 -80686 -82209 -40881 25439 26729 -22914 -49769 -11584
13217a1584R263L0885J7103k4108o0799N3060J6997l4148p701p862M0128o669
13205A4565J9068M1831k9219k3033N005n8739J2977j1430n8771j7083O2708L5014
13193g107R008k317m23M0244N3551L9144k5579J7305m8726p7038J7553m7537N05
13180c1417M1310J1120o2042j52192p6751Q1920P7123J2358P877P108j2065N7019
13168c8632M9036l9043j8051O1615J0240n2448L918R1248J6465l7448J9672M3802
13156A10374J4380p4961o8634k4206P987M2351m2829P0912l4682n502M2218m7170
13144i762M0947N9515k1547k0138J4414k7732J4446K372m1590l1174L3779J534
13132A5064Q875J823l8406p360n120o4001m3794j2973J03026K3851q722j564k2544
$$ plain form
13217 -11584 -2321 28564 45667 21559 -39240 13820 30817 -3331 -11032 -18894 21234 14565
13205 14565 33633 75464 46245 23212 28217 -30522 -17545 -28975 -87746 -104829 -42121 -7107
13193 -7107 1901 -416 -839 39405 92956 132100 106521 123826 75100 -1938 15615 -31922 -31417
13180 -31417 9893 21013 -41029 -193221 -269972 -188052 -110929 -98571 -90694 -83586 -95651 -38632
13168 -38632 10404 -28639 -46690 14925 25165 -27283 -23365 67883 84348 46900 66572 110374
13156 110374 124754 49793 -18841 -43047 -35060 7291 -35538 35374 692 -4810 37408 -9762
13144 -9762 31185 90700 69153 49015 63429 35697 50143 52515 10925 -20249 13530 15064
13132 15064 23939 25762 -12644 -20004 -25124 -89125 -132919 -145892 -42866 -19015 -27737 -29301 -51845
13119e1845J7052K3336l3082K7844l9428k0258O9493k4069n8564j3289L610J4282
13107h4918J09050L9516q053j9971K5208r280l2643k4656l0380K3541O686M3620
13095C7720L1063P520o1415J1317N4532r0o1948l741k16J1727j142j6206N7970
13082F7091P3673p1987j9884l7075K9244Q6568N681J3307m1568j10388j01734
13071a07072K8574K3076K1847M3687J86n7602l8896L7923l1485j8692Q3433K6380
13059A1359o8628j7427O8008L2495j7720L287K6475K2007q81J1077M1184L0262
13047A41498m4990P43l2292n1901m6173l8012J2856p426j9324m1999j4064O8664
13035g2420N3603J3259L2424m9649m6198L6485l2193P394M4547k4550l1688k662
$$ plain form
13119 -51845 -34793 -11457 -44539 -16695 -56123 -76381 -6888 -30957 -89521 -102810 -99200 -84918
13107 -84918 24132 63648 55595 35624 60832 51552 18909 -5747 -36127 -12586 -5900 37720
13095 37720 68783 76303 14888 26205 80737 80647 18699 14958 14742 26469 25327 9121 67091
13082 67091 140764 68777 48893 11818 41062 127630 133311 146618 105050 -5338 -107072
13071 -107072 -78498 -55422 -33575 10112 10298 -47304 -86200 -48277 -79762 -98454 -15021 11359
13059 11359 -57269 -74696 -6688 25807 8087 11374 37849 59856 58975 70052 111236 141498
13047 141498 96508 97251 64959 13058 -33115 -71127 -58271 -65697 -85021 -127020 -141084 -72420
13035 -72420 -18817 -5558 26866 -22783 -68981 -32496 -64689 -57295 -12748 -37298 -68986 -71648
13023g1648R7822M1348q5779K5536M4282k9771K1805K3775r841j003R7489M8028
13011B02043k457l3072n0188l9578j3060p085r2725l4463Q555L0684q3822l967
12999a19135k5630M6644N4559J4789K9737J3806n855k9172m1324j0939R23P8K363
12986f9156m2704k6369N7047J03647L0925o031k5530m7444m818J1105P8736j722
12974E7686n9298q5171J6119J5821j40Q8230M3536n2187k9743L3143L8151k5009
12962D1138l7245K182l0915K001m994j8717J0364L0487J25019K1130n2014o6805
12950B1631J9801r7081q468O5394m324j1571L6588P9073j8015j08277p9560M3121
12938f1688O3665k3576q049P9316P6l8806j1738k9246k3057J7019M3765k5616
$$ plain form
13023 -71648 26174 67522 -18257 7279 51561 21790 43595 67370 57529 56526 154015 202043
13011 202043 199586 166514 116326 76748 63688 56603 -36122 -70585 -62030 -31346 -115168 -119135
12999 -119135 -144765 -98121 -43562 -28773 964 14770 8915 -20257 -61581 -72520 -71597 -71519 -69156
12986 -69156 -111860 -138229 -81182 22465 53390 47359 21829 -25615 -30433 -19328 59408 57686
12974 57686 -1612 -86783 -70664 -54843 -54983 33247 76783 24596 -5147 27996 66147 41138
12962 41138 3893 6075 -24840 -22839 -27833 -46550 -36186 -5699 119320 140450 88436 21631
12950 21631 41432 -55649 -64117 1277 -3047 -14618 21970 101043 83028 -25249 -104809 -61688
12938 -61688 1977 -21599 -29648 49668 49744 10938 -800 -30046 -53103 -36084 7681 -17935
12926a7935p3953j650j1235n6925Q536J07718M0808o440j9743n8767J5104N1052
12914b3430j1377j9957j0907J7368k0438O6116M7961J520P5574m6778o0085O290
12902B1857Q24r259j3575k2448o0200o3551M4634P5316O801l1084L469M121L1135
12889a1960l1973l9998Q8647M3817p2702N402N8500L5086m9469q0321j2028J2540
12877e4459P5433J0423l6028l5371o3203L271M8273L9326p0811k0111P1691J3298
12865a8268r4595p550M3048l0772j958o048P2093P7063L5737n0805O657M2090
12853F6692p385L697p1712k171k4472L5729r657J3770L4740K3574L130p1647o812
12840a2524Q0386m3740j0015K6507N543M9209L9179r5212j5228M1839L1668m474
$$ plain form
12926 -17935 -91888 -93538 -104773 -161698 -153162 -45444 -4636 -11076 -30819 -89586 -74482 -23430
12914 -23430 -34807 -54764 -65671 -48303 -68741 -2625 45336 46856 122430 75652 15567 21857
12902 21857 22681 13422 -153 -22601 -82801 -146352 -101718 -26402 -19601 -50685 -47216 -43095 -11960
12889 -11960 -43933 -83931 4716 48533 -24169 -18767 39733 74819 25350 -54971 -66999 -54459
12877 -54459 20974 31397 -4631 -40002 -103205 -99934 -51661 -12335 -83146 -103257 -31566 -18268
12865 -18268 -112863 -120413 -77365 -108137 -110095 -116143 -44050 33013 68750 17945 24602 66692
12853 66692 59307 63004 -8708 -10879 -35351 378 -9279 4491 39231 62805 65935 -5712 -12524
12840 -12524 67862 24122 14107 40614 46157 95366 134545 39333 24105 65944 97612 93138
12828I3138m173L4321j8261j02343m4964M4315l588O331r307m988L4996K0879
12816D6356R816K4207J5971M8506p040q0243o7815o452k2969J00489L0623o1506
12804B9943J031O4051q0545m0871n9202K5007k2020J6272O4571R793n1159p5848
12792a18977N824N7556L2657N8248J9536k8163L221p632K1935m1614m5373l8706
12780h1488o221j6441L503R2631K2110k4252N6237L06n388j833k5002n674J3249
12767B1737j4955P6314P857j31051p148J03428k979L1375k806k6429O4338N637
12755A25318n5501p8997n677r830k627j3769p4673l2947R684M4461R3232L2664
12743C1338L649Q434K5796l9437m6423l0708L4709K6961J5266K0812K7367n7734
$$ plain form
12828 93138 88965 123286 105025 2682 -42282 2033 -1555 4776 -4531 -9519 25477 46356
12816 46356 56172 80379 96350 144856 137816 57573 -10242 -16694 -39663 60826 91449 29943
12804 29943 30974 95025 14480 -26391 -85593 -60586 -82606 -66334 -1763 8030 -43129 -118977
12792 -118977 -113153 -55597 -22940 35308 54844 26681 29902 22270 44205 2591 -42782 -81488
12780 -81488 -87709 -104150 -100647 -8016 14094 -10158 46079 46385 40997 39164 14162 8488 21737
12767 21737 6782 83096 90953 -40098 -47246 56182 53203 84578 81772 55343 119681 125318
12755 125318 69817 -9180 -14857 -24687 -27314 -41083 -115756 -148703 -139019 -94558 -1326 31338
12743 31338 34987 43421 69217 29780 -16643 -47351 -12642 14319 29585 50397 77764 20030
12731B0030o8994r6563m8907Q3063k702r180K4625J4757N8379N8019J6163M4457
12719I3147k8282m7650K6685o283J016l1676m4471m0908P594j098j3240J3254
12707g1912O9203M178L5093K2792j8799k7691L79J4329m7892K9210Q0741k0253
12695F9378l3939l0791n246k8158M0320Q767q9278N7880O3304m3729m3685n559
12683d0736O603P1229P9601n1922q6930k5898K4558L2754m209L8457J1642l0665
12671B4484l507o1498j36568J9310L2850L2036R3952j3818n3506k4226j3062j9197
12659a22750N888K1554K6912j4162l6480L3798J04015R3967l4320m9221j5769
12648A3432q081j1603k3592j5417O0858K3542J3030m4614k6180l697m8015j6619
$$ plain form
12731 20030 -48964 -145527 -194434 -111371 -114073 -123253 -98628 -83871 -25492 32527 48690 93147
12719 93147 64865 17215 43900 37617 38633 6957 -37514 -78422 -70828 -71926 -85166 -71912
12707 -71912 -2709 1469 36562 59354 40555 12864 13243 27572 -20320 8890 89631 69378
12695 69378 35439 4648 -598 -28756 11564 20331 -68947 -11067 52237 8508 -35177 -40736
12683 -40736 -34133 37096 116697 64775 -22155 -48053 -23495 9259 5050 43507 55149 24484
12671 24484 20977 -40521 -177089 -157779 -124929 -92893 1059 -12759 -66265 -90491 -103553 -122750
12659 -122750 -116862 -95308 -68396 -82558 -119038 -85240 18775 112742 78422 29201 13432
12648 13432 5351 -6252 -29844 -45261 15597 39139 52169 7555 -18625 -22322 -70337 -86956
12636h6956N0793J2967j1402k0048n5498Q1470J45235L6852l8400l1235k0057
12625F3721J7724N8864r60m7811p2365m3695k3076J7520K7514O1277L1102j01031
12613a1216q6087l3939L7525L7554N4412K2194j4053m294M490O8121l8143q7400
12601e0836l7374k8982M2609L9229O3569J9692O0009k42o1161J2967k9549k5588
12589D343M440o3658l745K5814j7171p484k920K6301M8798j834k5646k5610N9177
12576B0805M0846M43o4948m8109p4069p322J15300K7764K0366j1087J7031j7637
12564A9383P299O394k1115K2794l414l1953O673n0944j1171J05182N3657m2396
12552F0389k9417M8942q565L8312k2710p2704m0095R946J508j6947N1243Q535
$$ plain form
12636 -86956 -36163 -23196 -34598 -54646 -110144 -28674 116561 153413 115013 83778 63721
12625 63721 81445 140309 139349 91538 19173 -24522 -47598 -30078 -2564 58713 89815 -11216
12613 -11216 -97303 -131242 -93717 -56163 -1751 20443 6390 2096 6586 74707 36564 -50836
12601 -50836 -88210 -117192 -74583 -35354 28215 47907 107916 107674 46513 59480 29931 4343
12589 4343 8783 -54875 -58620 -32806 -49977 -57461 -60381 -34080 14718 12884 -12762 -38372 20805
12576 20805 61651 62094 -2854 -50963 -125032 -132354 -17054 10710 31076 19989 37020 19383
12564 19383 26682 33076 11961 34755 31341 -612 6061 -44883 -56054 49128 102785 60389
12552 60389 30972 79914 71349 109661 86951 14247 -25848 -15902 -14394 -31341 19902 28437
12540B8437j1795L9072J5365o9159r225J6708J4535O9763m6062L5026O9138k1459
12528A30344m5747n5845o3901l941M0307k4473j8830k4874K8813k994J6703M6264
12516B1826J28248j0079q7001j01229L6889J8294n2560J3952K1389K0568k3124
12505a2827J168l934K1089N5923J0731q4566m6441M9349L5847K9408l8172J3214
12493C0789j7219p3010J7206J1482J9563K1008K1584q2959l2418Q5025l0376p5427
12481a04752O4288M1026j3714j2094L9594l7739J8275j4967j8969K9925n5181
12470f4308l4105R8342N9454M5205J439j6459p5595J7582Q566K190n3655L6518
12458B5174Q1838l0592J4389L372n7987n1017J5189J916K0071K3347L8846J7672
$$ plain form
12540 28437 16642 55714 71079 1920 -7305 9403 23938 93701 47639 82665 151803 130344
12528 130344 84597 28752 -35149 -39090 1217 -23256 -42086 -66960 -38147 -41141 -24438 21826
12516 21826 150074 139995 52994 -48235 -11346 6948 -45612 -31660 -10271 10297 -12827
12505 -12827 -11659 -15593 5496 61419 72150 -12416 -58857 -9508 26339 55747 17575 30789
12493 30789 13570 -59440 -42234 -30752 -11189 9819 31403 -51556 -83974 1051 -29325 -104752
12481 -104752 -40464 562 -13152 -25246 14348 -23391 -5116 -20083 -39052 -9127 -64308
12470 -64308 -98413 -71 59383 104588 106027 89568 13973 31555 40121 42311 -11344 25174
12458 25174 107012 76420 90809 94181 36194 -14823 366 2282 22353 45700 84546 102218
12446A02218M66J0668J1986Q554K9676p5013j49697o1745K4497K6805M5981R1018
12434F5414j4503n792K4041L6356j3344l9923L7092l8566p3744O014L523K1920
12422H488M5845J8382o9838l8527l1018j7472Q3548O8730j6762R163K0426K0895
12410A01860n4687j2834n3884l6550L0071L9901K7585j7964J8331j5642Q339k271
12398C2255J919L701o3860l0185Q3767L9616M4916K3947j01579q9422L584k1818
12386g3159L6140M7917K7958j6333o753K3237n327R82q327l2949L7886j3963N1674
12373F8983P680j7576j1924q5907j04835m1482N4043Q8139K3230L5952L0047n982
12361D0368n2830j784L4224q1495j1621O5559L8366k6439k4885l2030O8962N3663
$$ plain form
12446 102218 102684 113352 125338 133892 163568 88555 -61142 -122887 -98390 -71585 -25604 65414
12434 65414 50911 45119 69160 105516 92172 52249 89341 50775 -22969 -16955 -13432 8488
12422 8488 54333 72715 2877 -35650 -66668 -84140 -592 68138 51376 60539 80965 101860
12410 101860 47173 34339 -19545 -56095 -26024 13877 41462 23498 41829 26187 34526 32255
12398 32255 34174 37875 -25985 -56170 27597 67213 112129 136076 34497 -54925 -51341 -73159
12386 -73159 -37019 10898 38856 22523 15770 39007 33680 34662 26335 -6614 31272 17309 68983
12373 68983 76663 59087 47163 -38744 -143579 -185061 -131018 -42879 -19649 16303 46350 40368
12361 40368 -12462 -14246 19978 -61517 -73138 -7579 30787 4348 -20537 -52567 16395 70058
12349G0058n2553p668j6492j072J5144P506n5087j6501k2442l1320l0671K0734
12337a20364J23810J8621l2150J3960L5102K2125p2385J4864K8208k1315r6886
12326h6410m863R0591O4482l6102m9296j2800J2927k3197O7029j9371k0629K6255
12314H616O134K6314m2277n1756R5140K9334K7308k5799j2484J9667k6550l8614
12302A5033n4491N4209L6986K2555o8525j2478q180o2875l9799M2510N2312M0013
12290A7270m741n8441L316o4830r96J12509J0658K4049j0516k5281m1266l4841
12278g3110j5557o2549L1548N0816L7792M4683j0163n465M2186L8858m765o8700
12266E574j6699L4266J0505j7308J8685P076p1662L7722P136k2624N4375K5429
$$ plain form
12349 70058 17505 9837 -6655 -7727 7417 14923 -40164 -56665 -79107 -110427 -141098 -120364
12337 -120364 3446 22067 -10083 3877 38979 61104 -11281 3583 31791 10476 -86410
12326 -86410 -91273 -682 63800 27698 -21598 -34398 -21471 -44668 22361 2990 -17639 8616
12314 8616 14750 41064 -1213 -52969 42171 71505 98813 73014 60530 80197 53647 15033
12302 15033 -39458 14751 51737 74292 5767 -6711 -14891 -77766 -117565 -75055 -22743 17270
12290 17270 12529 -45912 -42596 -107426 -108422 4087 14745 38794 28278 2997 -38269 -73110
12278 -73110 -88667 -151216 -119668 -68852 -31060 13623 3460 -2005 40181 79039 74274 5574
12266 5574 -11125 23141 33646 16338 35023 42099 -29563 8159 15295 -7329 47046 72475
12254G2475M21k7690o694K8858j433l9898K1628L4690l4888q2271m056L6061J4048
12241A1251j3126L73M4699k9348l9935J3791J0398O1141J2438k8475O749M368
12229E4324o5654M2r1250k9927P4818N6331K7885j9019L3232N3126k3998K9653
12217I9563l8557m457l8688n203N230k9665J5671J2107q4894j6659Q0163K7785
12205B2396l3186k6578n952J7364L4069K2122L186j9434J3055o0484m5576P2896
12193f122P5787k0235m8936M9146K2055k7327k6333J6586Q0236n7332m3083m5441
12181c0999J2990O241N123Q9067L8504l3294j7311L903K657M5166n6642l4065
12169C1340q695L0333l3037m1339J023j2163J3259N111k8440K1008K3616J18453
$$ plain form
12254 72475 72896 45206 38512 67370 65937 26039 47667 82357 47469 -34802 -38858 -2797 11251
12241 11251 -1875 -1502 43197 13849 -26086 -12295 -1897 59244 71682 43207 49956 54324
12229 54324 -11330 -11288 -102538 -132465 -57647 -1316 26569 7550 40782 93908 69910 99563
12217 99563 61006 56549 17861 12658 17888 -11777 3894 16001 -68893 -85552 -5389 22396
12205 22396 -10790 -37368 -43320 -25956 8113 30235 33421 13987 27042 -33442 -79018 -6122
12193 -6122 69665 49430 494 49640 71695 44368 18035 34621 114857 57525 14442 -30999
12181 -30999 -18009 -11768 -6645 82422 120926 87632 70321 74224 76881 122047 65405 31340
12169 31340 22645 52978 19941 -21398 -20375 -32538 -19279 -14168 -42608 -21600 2016 120469
12157A20469K5780q6888q732K7028k5399j1446j7171N4892p216o9481j0123K4082
12145A5795K1942n565n103j7736k5273M2594N3790J1328j9259N404o9515j0275
12133a873m3061n465j2430N1080M8258L0223K7398m2444k7281M714J3112l3272
12121H959j0532l1361l0425J1346j2106K8093k5058n69J7919L9861Q1964K0373
12109I8464l0679o7281p149M5123J394M8981L8372k5652q0753j13762o6000k0666
12097a79608J6633K1538Q1013P8666O710n2054J5795J5237J5703L4308q665q85
12085D4391N1179o907m6381j8738K1230p2545j1028J57582O3535l8630j4877j740
12073A27071n5365o2407o0843r578L22L8310n871N786O8058N462m7694L7888k2757
$$ plain form
12157 120469 146249 59361 50629 77657 52258 40812 23641 78533 71317 1836 -8287 15795
12145 15795 37737 32172 27069 9333 -15940 26654 80444 91772 72513 77917 8402 -1873
12133 -1873 -44934 -50399 -62829 -11749 36509 66732 94130 51686 24405 29119 42231 8959
12121 8959 -1573 -32934 -63359 -52013 -64119 -36026 -61084 -61653 -43734 -3873 78091 98464
12109 98464 67785 504 -6645 38478 39872 88853 127225 101573 20820 -92942 -158942 -179608
12097 -179608 -162975 -141437 -60424 18242 24952 -27102 -11307 3930 19633 53941 45276 44391
12085 44391 95570 88663 42282 23544 44774 -27771 -38799 118783 182318 143688 128811 127071
12073 127071 71706 9299 -51544 -61122 -60800 -22490 -28361 -22575 45483 50945 3251 41139 18382
12060A8382J0563M8063j0466l3855L8503M3349N8431l5659p658k4201P456L4664
12048A47572K3722J1008k3573M9978j1869n3123j1109P8699L7668m673N5033J03190
12036D02523k2463k5618J3405K7107r9057n627N4341J515j0331M6154J0135N85
12024C92669l383l6470m1769j6758l6766m8477k7791Q1489L9258m7303J2771j
12012B67469m0454K7491l5097m7771J1274r614p3645K830N7229j5951j7581J7639
12000A43819K6814k8883O0603K702j6741M50o5092o6071J04675N3062L2802m9840
11988A98300o2981M7479M9016N0018K2507n6959J3601l1177n8941J0430N8693
11977B39986j0299j83J15013M1076l6686o0974l2290j2833k392K2701J0543M9889
$$ plain form
12060 18382 28945 77008 66542 32687 71190 114539 172970 137311 129653 105452 112908 147572
12048 147572 171294 182302 158729 208707 196838 143715 132606 211305 248973 244300 299333 402523
12036 402523 380060 354442 367847 394954 295897 290270 344611 346126 335795 381949 392084 392669
12024 392669 389286 352816 311047 294289 257523 209046 181255 262744 302002 254699 267470 267469
12012 267469 227015 254506 219409 171638 182912 173298 99653 102483 159712 143761 126180 143819
12000 143819 170633 141750 202353 205055 188314 188764 123672 57601 162276 215338 248140 198300
11988 198300 135319 182798 231814 281832 304339 247380 260981 229804 170863 181293 239986
11977 239986 229687 229504 344517 385593 348907 287933 255643 242810 240418 263119 273662 323551
11965C23551j09938m6299P1493J42448k5901j8248P4187L8023q912J2888K2800
11954D76092j2608R0351R0611n5870J6294O1724l659J538L142O4305N0622Q5362
11942H67904N5231R8973L1849m4434r605O2200O1074J43606J35669M9770J77083
11931A629320K30300J56691K08509K50449J72189K44743L47287M36652M90920
11922D167060O08868Q69662J088713J342494J902245K764295L782916N372737
11914B1898990P600421J0072341J1411129J1118631R801592Q764950O142127j451916
11906H5358265j1418111j5657283j3491572r659004o661872m694918l356739k422245
11898A7996521j990100j543193j197137j012751q56099o57349n83800n44918o03952
$$ plain form
11965 323551 213613 167314 238807 381255 355354 337106 411293 449316 440404 453292 476092
11954 476092 463484 553835 644446 588576 604870 666594 662935 664473 667615 731920 782542 867904
11942 867904 923135 1022108 1053957 1009523 999918 1062118 1123192 1266798 1402467 1452237 1629320
11931 1629320 1859620 2016311 2224820 2475269 2647458 2892201 3239488 3676140 4167060
11922 4167060 4775928 5645590 6734303 8076797 9979042 12743337 16526253 21898990
11914 21898990 29499411 39571752 50982881 62101512 71903104 80668054 86810181 85358265
11906 85358265 73940154 58282871 44791299 35132295 28470423 23775505 20418766 17996521
11898 17996521 16006421 14463228 13266091 12253340 11397241 10739892 10156092 9611174 9007222
11889I007222m60841m49732m80837m11238l18415k98113k50433k18212k39022
11880E880379k07220j63067k60924k52482k22255j74794o0680q0056j07581j09062
11870D242258j11932j45433j08311j21595n9336q9406j60479j54732r9262o4937
11860C126835r4428K1256r1453o2879n3299r0782m5346l9949o8486l3182M0275
11849B608562J0869r1222j16679m2335j42416q6599k1222M6860q2340j23334j34120
11838A826024n0675M3276p7412p6429j2620k4293q5843l5555j8773o3114o166
11827A418420M9833M9856k0153j15822j19144K703J8951l4343K2571m435n5849
11816A212588l0753k9621o3960o3179k7333n0088j6490K2156M478j8235J6048
$$ plain form
11889 9007222 8546381 8096649 7615812 7204574 6886159 6588046 6337613 6119401 5880379
11880 5880379 5673159 5510092 5249168 4996686 4774431 4599637 4538957 4458901 4351320 4242258
11870 4242258 4130326 3984893 3876582 3754987 3695651 3606245 3445766 3291034 3191772 3126835
11860 3126835 3032407 3053663 2962210 2899331 2846032 2755250 2709904 2669955 2601469 2568287 2608562
11849 2608562 2619431 2528209 2411530 2369195 2226779 2140180 2118958 2165818 2083478 1960144 1826024
11838 1826024 1775349 1818625 1741213 1664784 1652164 1627871 1542028 1506473 1487700 1424586 1418420
11827 1418420 1468253 1518109 1497956 1382134 1262990 1265693 1284644 1250301 1272872 1268437 1212588
11816 1212588 1181835 1152214 1088254 1025075 997742 947654 931164 953320 957798 939563 955611
11805I55611j5871n4146r4978L6207N5122J7057n2404j4757O0312k0535M16O415
11793H78449P722p433J722j3515K9359j0816l8942M3372P9607L88q4351n6200
11781H29362J0384K6212o38l5839j6706n8543j07908p9829K762M8272N7873m787
11769F70615m2025J3278J4905P2189L7224m1222p8760j24539J8256j6230k6305
11758D97386j0313j008k6430n2874J2790K40P693R654K5408J8662k2412Q453K2641
11745D89890l4404p9498p4219M1602M7762q840n1650N7162j7279K9639K654k793
11733D00026p4042r378J4393m2747R9327m0587r4919n9559k4217J7716R2336O9248
11721C47597M728n7708j819j6329l7263J8131M4927J1266q9783k8558L5609l3926
$$ plain form
11805 955611 939740 885594 790616 826823 881945 899002 846598 831841 892153 871618 872034 878449
11793 878449 886171 878738 880460 866945 896304 885488 846546 889918 969525 969913 885562 829362
11781 829362 839746 865958 865320 829481 812775 754232 646324 566495 569257 617529 675402 670615
11769 670615 628590 641868 656773 728962 766186 724964 646204 521665 539921 523691 497386
11758 497386 487073 486065 459635 406761 419551 419791 427484 437138 462546 481208 458796 467249 489890
11745 489890 455486 375988 301769 343371 391133 382293 330643 387805 370526 400165 402819 400026
11733 400026 325984 316606 330999 288252 387579 346992 252073 192514 168297 186013 278349 347597
11721 347597 352325 294617 292798 276469 239206 257337 302264 313530 223747 195189 230798 196872
11709A96872J6651M568L3246L7586n7106r8113P1474K422m6978o5254M737R1940
11697A92045k0511o7245p72O9942J2033J3113m3501l8458L3146N4964J1150l3369
11685A82537K3157O931p0827k2794Q436K3770m7348J5083N5671N370q414M4533
11673B16105j8088Q258L2657l9709j8415p081j9724p646k4672k8769O7414K6084
11661A86414j7966J0024M8953q741J0069N2816J08324N1530m3860o9400Q4088
11650D12251K6174p8073o5993m679M7589k028n6882n5349K6197J2790o0839q845
11638A92313J1065k3055l4292L2323K537M9359L314p3589n124n1225j1915p563
11626H4148j9417j5222L4643j7205k7936j1298Q4245P2425j6605j3368j0088l4228
$$ plain form
11709 196872 213523 218091 251337 288923 231817 133704 205178 207600 160622 95368 100105 192045
11697 192045 171534 104289 103517 173459 185492 198605 155104 116646 149792 204756 215906 182537
11685 182537 205694 212625 141798 119004 127440 151210 103862 118945 174616 179986 171572 216105
11673 216105 198017 206275 238932 199223 180808 173727 154003 146357 121685 92916 160330 186414
11661 186414 168448 178472 227425 218684 228753 281569 389893 441423 397563 328163 412251
11650 412251 438425 360352 294359 289680 337269 335241 278359 223010 249207 261997 201158 192313
11638 192313 203378 180323 146031 178354 180891 230250 233564 159975 154851 103626 91711 84148
11626 84148 64731 49509 84152 66947 39011 27713 111958 184383 167778 154410 144322 110094
11614A10094l3296K3192M4221n99J1828k4576m9819j8876K1051o957J5519n7118
11602C4664j82N2670p0047r2605J11730M2761l8477N887O5052m4503J6322L6955
11590A20227l4878m6058L5235P5352P783K0361k3290O922n1522q375k8597J9884
11578I3044L7093M5212k2551L9655K2408q2170j05418m9659K4787J18612J4569
11567A35582n7818j06043o002J13969J234n5393R786j0749p265Q057q870N213
11555B1701M8147K9806p8736j05239j7597k965K6732J04260N6559l6781j8513
11544B7374m1964K7815M1789j0705L5775l246k7848M4134O5599L693j14299M4770
11532I2887P000p2455n0161K3372M2912p315k3672o102M2765N8985M751p2084
$$ plain form
11614 110094 76798 99990 144211 143612 155440 130864 81045 62169 83220 76263 91782 34664
11602 34664 34482 87152 17105 -75500 36230 78991 40514 46401 111453 66950 83272 120227
11590 120227 85349 39291 74526 149878 157661 178022 154732 161654 110132 101757 73160 93044
11578 93044 130137 175349 152798 192453 214861 132691 27273 -22386 2401 121013 135582
11567 135582 77764 -28279 -34281 79688 80922 25529 35315 24566 17301 25358 16488 21701
11555 21701 69848 99654 20918 -84321 -101918 -104883 -78151 26109 82668 45887 27374
11544 27374 -14590 13225 55014 44309 80084 76838 48990 93124 158723 162416 48117 92887
11532 92887 99887 27432 -22729 643 43555 36240 12568 6466 49231 108216 112967 40883
11520D0883J4831O315l0356k3595J3614N573k1640r1472K276N8749L0451J8410
11508B4039L8625l5355k5229O029K9417j0083q312K6251j8380l1326j1060L8103
11496B2719j7515N1778R245j2335K0392j753p1937j6492L1957K424p9650n9131
11484a20298o913M4582O3289N1627k095l6095n2666l7736J3058J3117J6280Q7682
11472C3832O318m5397P2599j9538j4365M4677K775o079o3804l8868N5266L6930
11460F4346k6059K954p9560k0531K2003k2521n1696K8033m665l0415L1052Q5987
11448a072R5792n3595l7217k0541J3154P8025j4117m2573l3325j0240O5317L1198
11436G0806j2631k305m5056r700L4702J25260K2949r9954r0859k0637K1125P6305
$$ plain form
11520 40883 55714 62029 31673 8078 21692 27265 5625 -85847 -83571 -24822 5629 24039
11508 24039 62664 27309 2080 8109 37526 27443 19131 45382 27002 -4324 -15384 22719
11496 22719 5204 56982 66227 53892 74284 72531 594 -15898 16059 18483 -61167 -120298
11484 -120298 -127211 -82629 -19340 32287 30192 -5903 -58569 -96305 -83247 -70130 -53850 33832
11472 33832 40150 -5247 67352 47814 33449 78126 80901 74822 11018 -27850 27416 64346
11460 64346 38287 41241 -38319 -58850 -36847 -59368 -111064 -83031 -87696 -118111 -87059 -1072
11448 -1072 94720 41125 3908 -16633 -3479 74546 60429 17856 -15469 -25709 39608 70806
11436 70806 58175 55870 10814 1114 35816 161076 184025 84071 -6788 -27425 -6300 70005
11424G0005L676q3887o4060L692K5697M3272L2486K0581k0609m2091M6533L3286
11412F8581J4708N5686M8026J3773j12296J7606l6996p673l8193k5740k5538N7868
11400B9812K7430l1524J9592K195j09148J2764Q6834M8040l5126L1603L4008J1250
11388A27730n5848r3090J8616J4129K5390n0786l6528j7763J308N3016J1194k3461
11376b6093P0630K9457j7439m4133K3740j8919o1479k0398L1701L0878J8704k1680
11364e031m3792k1404L0715o601m762l6819M5973O4993L0531O4959j4276q5715
11352A8771k4909M0205n997n1548P244L1413J8772K6168m1619M2845M6041l0350
11340G7036j9626k4971K834L7869J7928J5302k6401j9549m112L5320n7198M722
$$ plain form
11424 70005 73681 -10206 -74266 -70574 -44877 -1605 30881 51462 30853 -11238 35295 68581
11412 68581 83289 138975 187001 200774 88478 106084 69088 61415 23222 -2518 -28056 29812
11400 29812 57242 25718 45310 47505 -61643 -48879 37955 85995 50869 82472 116480 127730
11388 127730 71882 -21208 -2592 11537 36927 -13859 -50387 -68150 -66842 -13826 -2632 -26093
11376 -26093 44537 73994 56555 12422 36162 17243 -44236 -64634 -32933 -2055 16649 -5031
11364 -5031 -48823 -70227 -39512 -46113 -50875 -87694 -41721 23272 53803 118762 104486 18771
11352 18771 -6138 34067 28070 -23478 -16234 15179 33951 60119 18500 61345 107386 77036
11340 77036 57410 32439 35273 73142 91070 106372 79971 60422 56310 91630 34432 39154
11328C9154j8686L4936L5426n6729k0178J8937m3124Q6884K9307n7963J9309j2775
11316E4498l0364M3673K0430k5108L0240L8175M2488q498L4494R4551J28537J38069
11304E61185J12440J76272K32427J71053K09968K36939m668l28240l52511l18785
11294F96080j33272j04582o9034L322K3585l1512k2329Q949l5896l3319J3002
11283C14994p4295j7821n8927l3338j7746k8327L1729n333p975j4059k8141J2389
11271G3150J6277M9118o0930j7301n166m5067K1592J5973P9579N9746J984n6126
11259A32829n3187K7355k1651n5182m1176J1196J05820J10191p6795q8395l6925
11248A4080m7070P9571K1367o463j0587J1742Q674P1532N6540k8814l8228l5870
$$ plain form
11328 39154 20468 55404 90830 34101 13923 32860 -10264 76620 105927 47964 67273 54498
11316 54498 24134 67807 88237 63129 93369 131544 174032 165534 200028 294579 423116 561185
11304 561185 673625 849897 1082324 1253377 1463345 1700284 1695616 1367376 1014865 696080
11294 696080 562808 458226 389192 392514 416099 384587 362258 371207 335311 301992 314994
11283 314994 240699 222878 163951 130613 112867 84540 116269 110936 102961 88902 60761 73150
11271 73150 89427 138545 77615 60314 55148 10081 31673 47646 127225 186971 188955 132829
11259 132829 79642 106997 85346 30164 -11012 184 106004 216195 139400 51005 14080
11248 14080 -32990 46581 67948 61485 50898 62640 71314 142846 199386 170572 132344 96474
11236I6474J0411L3455n9218n0757j2335P2916l6729k4266o6354M524O9068J680
11224C8869k6531M2393N2350L1922J0553m0749j1448J02080L5293k3869K4051
11213B34914M68P66L5409O1559N5437L5377J02133J43546K25344J93347q599j13894
11201I65807r0513j70920j86759j87656j72932n6496N614l3417L4810l2126O027
11190H1439q858N0986k3531j3039J8315j53M2364L8912k7865j057R9394J5112
11178B72019p3894l6893o183O891l8026K9212O0491K7277k6471l8635o8257L0580
11166A38111m519j1798J5957K1991O6121j2838J6223K2649l8460p9138n2511J4757
11154I6545Q3058P9893o2267m9097R076L3807M8886m4536l8572P7213K4899m6109
$$ plain form
11236 96474 106885 140340 81122 30365 18030 90946 54217 29951 -36403 -31879 37189 38869
11224 38869 12338 54731 107081 139003 149556 108807 97359 199439 234732 210863 234914
11213 234914 235382 236148 271557 333116 388553 423930 526063 669609 894953 1088300 1079701 965807
11201 965807 875294 704374 517615 329959 157027 100531 106145 72728 107538 75412 81439
11190 81439 72581 123567 100036 86997 105312 105159 147523 186435 158570 157513 256907 272019
11178 272019 198125 161232 155049 161940 123914 153126 213617 240894 214423 175788 107531 138111
11166 138111 133592 121794 137751 159742 225863 213025 229248 251897 213437 134299 81788 96545
11154 96545 179603 259496 197229 148132 157208 191015 239901 195365 156793 234006 258905 212796
11142B12796k9526J8605K3097L278l1047l7618p592K813L6103k1998k069J7204
11130A84046l7049M4604J4410k4529m1770m8350l311r252L5619m4974k7721J4350
11118E6073P10M3976O0425j8959l3823j1706r027n7546j3822Q3512N5251K4646
11106A79710P7848K8119l2324l9466o3405l8148l050K7631L1163j7526L6380Q115
11094A95047l967j9334n4233m2753L8512L6396O8o5604n3851N7494j4897n7284
11082A5594M2532J9675L9851J1582m6652J9762L5599l5193k3381m700K207L2212
11070A09088L4296l545M788j16445J1777K6165j2449k7593N2589L473j5650o9411
11058b917m2458L3118K9617J815K1153l1825M5653J3703N5138Q6731K7632M1214
$$ plain form
11142 212796 183270 201875 224972 228250 197203 159585 151993 154806 190909 168911 166842 184046
11130 184046 146997 191601 206011 181482 139712 91362 88051 78799 114418 69444 41723 56073
11118 56073 56783 100759 161184 142225 108402 96696 87669 30123 16301 99813 155064 179710
11106 179710 257558 285677 253353 213887 150482 112334 109284 136915 168078 150552 186932 195047
11094 195047 191080 171746 117513 74760 113272 149668 149736 84132 30281 87775 72878 15594
11082 15594 58126 77801 117652 129234 82582 102344 137943 102750 79369 74669 76876 109088
11070 109088 143384 139839 144627 28182 39959 66124 53675 26082 78671 82144 66494 -2917
11058 -2917 -45375 -12257 17360 19175 40328 8503 54156 67859 122997 209728 237360 278574
11046B78574j949p0815k9527L3084M4762L2726k9245j9728P4821J26640L8522
11035D77865M2662j5478l3425P1256J53372K550l9299j2237n847K2899R8983J76602
11023I39903J72713K54981K30610J47457q2703o6640n9298o5387o2666l1110j6797
11012A361063K102k1576P6511N8070l9852o3737j11746j37266j48833p9816m1712
11001H53208J4177l2533l193P7859K4406r1728o1416j0452k1636j862j0220J5605
10989G52215l8940l9953R442j6912Q291N0391p634j5162m6204n683M6481p7343
10977F18989j28775l592M4323N3367M2822j0524J2420J178n1184l9238L0085l203
10965E66668K5947L0423M3971J3511P1141K7909N4052J12180R2662Q4641j8547
$$ plain form
11046 278574 276625 205810 176283 209367 254129 286855 257610 237882 312703 439343 477865
11035 477865 520527 505049 471624 542880 696252 698802 659503 647266 641419 664318 763301 939903
11023 939903 1112616 1367597 1598207 1745664 1662961 1596321 1537023 1471636 1408970 1377860 1361063
11012 1361063 1363165 1341589 1418100 1476170 1436318 1372581 1260835 1123569 974736 894920 853208
11001 853208 867385 834852 831659 909518 933924 842196 780780 770328 748692 746830 736610 752215
10989 752215 713275 673322 682764 665852 674143 724534 716900 701738 655534 649851 696332 618989
10977 618989 490214 486622 530945 584312 627134 616610 629030 630208 579024 539786 569871 566668
10965 566668 592615 623038 667009 680520 751661 779570 833622 945802 1038464 1123105 1104558
10954A104558M2831J51109J93252Q0475m5955l2967n243n7671j31775j55977n7850
10943A084787M399l4136m55R1532N713l6702Q3116L9427J4382k7441K0506J8853
10931A263981Q5062Q8627O7852J42280J24187M7825P7235J33357J02070J08687
10921B241163K03584J67901J44351L32745M84320M78461N16759M63469M83792
10912E516545N33314K93425J52463K20716L17036O63664R70344J237497J551079
10903A1456083J853693K357971L154641M382859O563752J0088790J5881693K5474554
10895H1214036L7574137M6006411M3776394L5186656L6058104L8918428N627086
10888C24361252o0149680p8936017n5088631l3076622k0001273j2674318q487837
$$ plain form
10954 1104558 1147389 1298498 1491750 1572225 1526270 1493303 1488060 1430389 1298614 1142637 1084787
10943 1084787 1089186 1055050 1054595 1146127 1151840 1115138 1198254 1237681 1252063 1224622 1245128 1263981
10931 1263981 1349043 1437670 1505522 1647802 1771989 1819814 1897049 2030406 2132476 2241163
10921 2241163 2444747 2612648 2756999 3089744 3574064 4052525 4569284 5032753 5516545
10912 5516545 6049859 6343284 6495747 6716463 7033499 7697163 8667507 9905004 11456083
10903 11456083 13309776 15667747 18822388 23205247 29768999 39857789 55739482 81214036
10895 81214036 118788173 164794584 208570978 243757634 279815738 318734166 324361252
10888 324361252 264211572 185275555 130186924 97110302 77109029 64434711 55946874
10881E5946874n991464m835053m290457l598343k951984k403728k006600j655171
10873B8214074j344959j219347j099274j016631r13976r19973p81262n78734n56925
10864A9782993p69847r10062r11717q00429o15363o11665n39217m87961m83185
10855A3653547l80601l05527k82118k80691l50506l71641l18919l06020l72911
10846A0684613l14427k75847k72209k49218j44255j76549j65536k85550k32555
10837H568467j61840j52063j80843j79754k21790j81895j28474p7290j25360q7913
10827G071245j97747k22112q1122j52493j35571q4591n0750j27206k03687j55148
10817E660818o9684n4560j50064k02564r9216o9937l1702r7423p6507j29564j43857
$$ plain form
10881 55946874 49955410 45120357 40829900 37231557 34279573 31875845 29869245 28214074
10873 28214074 26869115 25649768 24550494 23533863 22619887 21699914 20918652 20339918 19782993
10864 19782993 19013146 18103084 17191367 16390938 15775575 15163910 14624693 14136732 13653547
10855 13653547 13272946 12967419 12685301 12404610 12054104 11682463 11363544 11057524 10684613
10846 10684613 10370186 10094339 9822130 9572912 9428657 9252108 9086572 8801022 8568467
10837 8568467 8406627 8254564 8073721 7893967 7672177 7490282 7361808 7284518 7159158 7071245
10827 7071245 6873498 6651386 6570264 6417771 6282200 6197609 6146859 6019653 5815966 5660818
10817 5660818 5591134 5536574 5386510 5183946 5084730 5014793 4983091 4885668 4809161 4679597 4535740
10806D535740l5675o3788r2529q9662j10309j92387r0010k3068l9878j21466j16093
10795C560875j8522o1999q9367N99m4804r4617r1336j6417l4492j10937p2434
10784B926549n7379p4009k7670n6821Q009N5520J0870J9334j7235j5277M0913
10773B812804N9778J19526R6101O1270M9341J9742L3294M260k2803n6267o5433
10762C111613r8324j31900q6470n8039m1506j48877p3286j7529n4321j11951q9212
10751B200198J5732M1124m3906L577n5235q9840r9475O758N956j2541k202n7213
10739A912933J1292M142l3140M855r4098j5266M845J7451P8856k8663j650m0268
10727A821289m8774J7775L0654K9107J6780J245N0216J7843j5105n4378k463L654
$$ plain form
10806 4535740 4500065 4436277 4343748 4254086 4143777 3951390 3861380 3838312 3798434 3676968 3560875
10795 3560875 3542353 3480354 3390987 3391586 3346782 3252165 3160829 3144412 3109920 2998983 2926549
10784 2926549 2869170 2795161 2767491 2710670 2718679 2774199 2785069 2804403 2787168 2771891 2812804
10773 2812804 2872582 2992108 3088209 3149479 3198820 3218562 3251856 3256116 3233313 3177046 3111613
10762 3111613 3013289 2881389 2794919 2736880 2695374 2546497 2473211 2455682 2401361 2289410 2200198
10751 2200198 2215930 2257054 2213148 2216725 2161490 2071650 1972175 1978933 1984889 1972348 1970146 1912933
10739 1912933 1924225 1928367 1895227 1900082 1805984 1790718 1795563 1813014 1891870 1863207 1861557 1821289
10727 1821289 1772515 1790290 1820944 1850051 1866831 1868076 1918292 1936135 1921030 1866652 1864189 1867843
10715A867843j5648p8218j18332m9851K0972o5594O2985Q8523j6875j4323l2968
10704A648514k2464p3394J7644J030R220n3601J9832l5798k4569l3188N830M799
10692A463855o1148p087l78j14938k355K7120n1506m1509j9070K1355m4818J4448
10680A183969K9630k099k5740o6753j21215L742R3765k0078n1463L2843m2274
10669A014327j6935J5236N5529L0487k7621o4071O8479L6923O388M3252K384j1009
10657A153369J0442K1294L4341L5089M9518p630O9465j4463m1125k0123j3112
10646A277065K9581m9611j51208j11046N5513N5596M4682J46780J10043J65753
10636A573148J50883J34693J07155J13047J70326J65299K75646J78256J88378
$$ plain form
10715 1867843 1852195 1773977 1655645 1605794 1626766 1561172 1624157 1712680 1695805 1681482 1648514
10704 1648514 1626050 1552656 1570300 1571330 1580550 1526949 1546781 1510983 1486414 1453226 1459056 1463855
10692 1463855 1402707 1395620 1395242 1280304 1277949 1305069 1253563 1212054 1192984 1214339 1169521 1183969
10680 1183969 1213599 1211500 1185760 1119007 997792 1001534 1095299 1075221 1023758 1056601 1014327
10669 1014327 997392 1012628 1068157 1098644 1071023 1006952 1075431 1112354 1118742 1161994 1164378 1153369
10657 1153369 1163811 1185105 1219446 1254535 1304053 1296423 1365888 1351425 1310300 1290177 1277065
10646 1277065 1306646 1257035 1105827 994781 1050294 1105890 1150572 1297352 1407395 1573148
10636 1573148 1724031 1858724 1965879 2078926 2249252 2414551 2690197 2868453 3056831
10627C056831J68329K03557L10265M76860O09136Q39115J262892J767916K255085
10618A0949986K825767L143471L206661L188009L108557K465889J202227j45558
10610B9945009o36286j53934J168815L012386M729196N792541O085541N925093
10602E5868361N394136L714932K69096l360224m426044k890643q3085K973334
10594E7459863N592842P045629P204678O761480N641895K690224k853129q229403
10586H1314079r560808p353649l975726q24514J506872K776818L079848K799447
10578F9762367J949021l13228m082038p350067p823239o113749l849099j918913
10570D0261055n24867J35588L40573J49608l94484j430785l000729m003862m078397
$$ plain form
10627 3056831 3225160 3428717 3738982 4215842 4824978 5664093 6926985 8694901 10949986
10618 10949986 13775753 16919224 20125885 23313894 26422451 28888340 30090567 29945009
10610 29945009 29308723 29154789 30323604 33335990 38065186 43857727 49943268 55868361
10602 55868361 61262497 64977429 65246525 61886301 57460257 54569614 54486529 57459863
10594 57459863 63052705 70098334 77303012 84064492 89706387 92396611 89543482 81314079
10586 81314079 71753271 64399622 60423896 59599382 61106254 63883072 66962920 69762367
10578 69762367 71711388 71398160 67316122 59966055 52142816 46029067 42179968 40261055
10570 40261055 39736188 39871776 40212349 40361957 39967473 38536688 35535959 31532097 27453700
10561B7453700l536988k719889k120077j650261j216885r76880q11712o81464
10553A3739544o08179m55560m62576n53657m71498l55772l70174l25530k68091
10544I868507l47995k97980k70385k50634j82718k03020k78363j60394k21318
10535G655700j05631j06842j76871j36150k26109j47522j06475q7934o4571j60663
10525F336932k00438j51185j74998j73728j69563m5188o4041n5887j30595j98317
10515D972992o7112p8879j10799j17196r1869j04521p5834o1522j13182o6166
10505D085912o9045j26976m7022m2067j08853m418p2593j13339M964l8599m007
10494C463957n6485k9320q0633p5680o1687j6813n2077m6116j1057K8428K7065
$$ plain form
10561 27453700 23916712 21196823 19076746 17426485 16209600 15232720 14421008 13739544
10553 13739544 13131365 12675805 12213229 11659572 11188074 10832302 10462128 10136598 9868507
10544 9868507 9520512 9222532 8952147 8701513 8518795 8315775 8037412 7877018 7655700
10535 7655700 7550069 7443227 7266356 7130206 6904097 6756575 6650100 6562166 6497595 6336932
10525 6336932 6136494 5985309 5810311 5636583 5467020 5421832 5357791 5301904 5171309 4972992
10515 4972992 4905880 4827001 4716202 4599006 4507137 4402616 4326782 4265260 4152078 4085912
10505 4085912 4016867 3889891 3842869 3800802 3691949 3687531 3614938 3501599 3506563 3467964 3463957
10494 3463957 3407472 3378152 3297519 3221839 3160152 3143339 3091262 3045146 3034089 3062517 3089582
10483C089582N2603Q2574R1594J55515K34623K53644J41322M2850J43133o2167
10473D225273l12612l54071k45349k31365j67689j3893o8021r0809n9925l2072
10463B649467r0931l7654q0460l834L7483o3687p6919l2212j2783j0543o1639
10452B216288p8753n0732J1073P0885j9143n2797o5209m2335N6581k1993j30895
10441A892970j08319O095l4475l6124q6761o2855r186J9226L702J0637J0505j07049
10429A498366n6715J4590p1327o6681O5567L5185q1128o0706j2056J9124n579
10418A278640o5759j2124j2834m0457m9484N5271j2874l0484K9593r81m9479p9512
10406A009516m7716l4435R143o5217J027J9587p2042l9554n0411r3022j0719Q7131
$$ plain form
10483 3089582 3142185 3224759 3316353 3471868 3706491 3960135 4101457 4144307 4287440 4225273
10473 4225273 3912661 3558590 3313241 3081876 2914187 2900294 2832273 2741464 2681539 2649467
10463 2649467 2558536 2520882 2440422 2436588 2474071 2410384 2333465 2301253 2288470 2277927 2216288
10452 2216288 2137535 2086803 2097876 2168761 2149618 2096821 2031612 1989277 2045858 2023865 1892970
10441 1892970 1784651 1790746 1756271 1720147 1633386 1570531 1561345 1580571 1584273 1594910 1605415 1498366
10429 1498366 1441651 1456241 1384914 1318233 1383800 1418985 1337857 1277151 1265095 1284219 1278640
10418 1278640 1212881 1200757 1187923 1147466 1097982 1153253 1140379 1109895 1139488 1138507 1089028 1009516
10406 1009516 961800 927365 936508 871291 872318 891905 819863 780309 729898 636876 626157 713288
10394G13288N6800j5222J0247j6318n1270j1927O2575J730l0939J4127p071k4450
10382G01570M247m1436l1349L3994R737O259L1221K0926J7976j8744m0367M0510
10370G34544k1265p0211l9114Q594j4591n1068n8050N3166k1500p316l4116J2909
10358D91982O5538m8981l393P9077k8516n5708m3038J3822O8914j5509l9308K5311
10346E10191P8337J6036m2952l1294l9150n1974m2594j9388j1426p1342N1914
10335C46358M5042n7081p13l2450p2653l728J3815L6457N3112L966N7144J0055
10323C99324k1670R608O0565K6270p680l5320J0251J5158J3402N0566P0088Q4254
10311F74816J71348K17631J68203J89976J92401M7387j8036j81252j71747j75335
$$ plain form
10394 713288 770088 754866 765113 748795 697525 685598 748173 749903 718964 733091 726020 701570
10382 701570 705817 664381 633032 667026 676763 683022 714243 735169 753145 734401 694034 734544
10370 734544 713279 643068 603954 612548 597957 546889 488839 542005 520505 513189 479073 491982
10358 491982 557520 508539 505146 584223 555707 499999 456961 470783 539697 524188 484880 510191
10346 510191 588528 604564 561612 530318 491168 439194 396600 377212 365786 294444 346358
10335 346358 391400 334319 333606 301156 228503 224775 238590 275047 328159 332125 389269 399324
10323 399324 377654 387262 447827 474097 466417 431097 441348 456506 469908 520474 590562 674816
10311 674816 846164 1063795 1231998 1421974 1614375 1661762 1643726 1462474 1290727 1115392
10301A115392k36395j62566j28694n8535M176K856p180m953l458o9819m6089K467
10289D07202l7417n5658o0532n9409K5391Q1317k28n8133j5188o9262j7798O8372
10277B08657M6719l0360m388O6969K9152j0157p123J135q447m3381q6381K5061
10265A87456J2643j2808M3129P9001l8781m0417m8781J4830n4836j7540O0441
10254A84337L9387j2172l0390K7414j7538K732k6462m3077K678L5619l3299N3782
10242A83011k742L665m6571L631K9505J4073j7315l2334k4852N7328K890l7994
10230A32295K4888J4242L284K467r062K9443j3376J7605k4033k7284j0423M7640
10218A87686R117l9187l2878j0031L7449K7870K6946p0203n3388P9079O019m890
$$ plain form
10301 1115392 878997 716431 587737 529202 533378 536234 529054 524101 520643 450824 404735 407202
10289 407202 369785 314127 253595 194186 219577 300894 300666 242533 227345 158083 140285 208657
10277 208657 255376 225016 220628 287597 316749 306592 299469 300604 292157 248776 162395 187456
10265 187456 200099 187291 230420 309421 270640 230223 181442 196272 141436 123896 184337
10254 184337 223724 211552 181162 208576 191038 193770 167308 124231 126909 162528 129229 183011
10242 183011 180269 183934 137363 140994 170499 184572 167257 134923 110071 167399 170289 132295
10230 132295 157183 171425 174709 177176 168114 197557 184181 201786 177753 150469 140046 187686
10218 187686 196803 157616 124738 114707 152156 180026 206972 136769 83381 162460 168479 163589
10206A63589n495m9484m4225j3100m283L352j7442l6312L223N14O047K4071M6234
10193G6689J6503o402j1961l8727k9260L9562L0537L8296J3797l1049K4496N6887
10181A79368K666Q0890q69m9389J6708k712q656K6382J4788m7584p4752o8433
10169F8407Q1021R8428Q0249J12065L0915M4620K9971n174k4677m0927k1858k8066
10157D24974j0189O7639O9676l4497l6261J4417m889l3003n7964n3349k3447Q814
10145C31921L7861o1204L8686P9063j7965j9033m0893n3183k8850n4528J2834
10134B24709l3202K514k9422N4211J8388m3197q0562J2115L7651J4123m3826n2555
10122H0947j6191J0492k4428P0505J03865l7828j490R9952l4319q9476N475M2085
$$ plain form
10206 163589 158094 108610 64385 51285 47002 50354 32912 -3400 -177 337 6384 30455 76689
10193 76689 93192 86790 74829 36102 6842 46404 76941 115237 129034 97985 122481 179368
10181 179368 182034 262924 262055 212666 229374 226662 218006 244388 259176 211592 136840 68407
10169 68407 149428 247856 328105 440170 471085 515705 545676 540502 515825 474898 453040 424974
10157 424974 414785 482424 552100 517603 481342 495759 490870 457867 399903 346554 323107 331921
10145 331921 369782 308578 347264 426327 408362 389329 348436 295253 266403 211875 224709
10134 224709 191507 194021 164599 218810 237198 194001 113439 125554 163205 177328 133502 80947
10122 80947 64756 75248 50820 121325 225190 187362 185872 285824 251505 162029 167504 209589
10110B09589J341l2206n7367n8169P5816J3462m9625q2330J6382j225j3980N6433
10098G8121J30602O6601n5494n1146p4814J9935m126L0478K8659K788k453o1884
10086A07267J5882N4018K9403o002m9187l8017K798j9385Q020O8423J2815m5618
10074A40417q0101l1508O0513O7059M4802k7965l3581j2644j4111j16586L1829
10063B8124Q7469L8720n338j25884p6373K8722L9192M6879K4570M28K6944k4937
10051H8516O205l7187J296O993K5387N6486l2316l2438j6859K8731l2887m8245
10039A3682L5183O1546K060n8617n3025M0481K1087O557j7460j2245L9751M551
10027H3551J1999M3362K4809K818l0034k3651N15P561j8697J5236p136p1197Q703
$$ plain form
10110 209589 210930 178724 121357 63188 139004 152466 102841 20511 36893 35668 21688 78121
10098 78121 208723 275324 219830 168684 93870 113805 109679 140157 168816 171604 169151 107267
10086 107267 123149 177167 206570 200568 151381 113364 116162 96777 104797 173220 186035 140417
10074 140417 60316 28808 89321 156380 201182 173217 139636 126992 112881 -3705 28124
10063 28124 115593 154313 148975 23091 -53282 -24560 14632 61511 86081 86509 113453 88516
10051 88516 94721 57534 58830 65823 91210 147696 115380 82942 66083 94814 61927 13682
10039 13682 48865 110411 112471 53854 829 41310 62397 68954 51494 39249 79000 83551
10027 83551 95550 138912 163721 166539 136505 112854 113369 120930 102233 117469 110333 39136 47839
10014D7839j8309l7769k5174R6161L8439M5217J7772j6000j9895p2903j6577N5913
10002I4714J4248n7010N980K2921N0493M6420o4170l8025R221J4880j6819l4164
9990D8689R820R5336K7191M6861m2853m4131O5589j9386j8616j9797J9237q067
9978A59873n2473n841j9576o0385M5825K777p7291o2490K5597l004L2691l473
9966a7770R220N4665l2095n190R556n3352l5209K3604k7393J1048k2837l2470
9954a18223p642J15731j7461m4814N804N3625R5938m3729K5706J592K685n1384
9942A7828m1844k0096k7825N805J5551K8759L3871p730k4102O4497M8230L6584
9930A29528J1350m9901J2695m1339q5681k2214O9473M9244L2594J09557J49908
$$ plain form
10014 47839 29530 -8239 -33413 62748 101187 146404 164176 148176 128281 55378 38801 94714
10002 94714 108962 51952 57932 80853 131346 177766 113596 75571 84792 99672 82853 48689
9990 48689 58509 153845 181036 227897 185044 140913 206502 187116 168500 148703 167940 159873
9978 159873 107400 101559 81983 21598 67423 70200 -7091 -69581 -43984 -46988 -14297 -17770
9966 -17770 -8550 46115 14020 8830 18386 -34966 -70175 -46571 -73964 -62916 -85753 -118223
9954 -118223 -125865 -10134 -27595 -72409 -66605 -12980 82958 39229 64935 66527 69212 17828
9942 17828 -24016 -44112 -71937 -66132 -50581 -21822 12049 4319 -19783 44714 92944 129528
9930 129528 140878 90977 103672 62333 -23348 -45562 23911 73155 105749 215306 365214
9919C65214J52693J34727J05510J02590J54700K4056l01563k30631j76760q7408
9909B43128p8129j18749o536J2548Q417j652L0761o6476q343J5594N773J089N7632
9896I5057j8276m1238J3475J1243K1624K1776j3161J1023O692q816L4758l5535
9884I8622n5587k7996M7321k8485P097L5081M769J3833j7552m1727p0760j9235
9872e4619M3979P2883J066k3447j9633m2415N491J06301N434n9912k626N1110
9860H3612N751m3715l1462M733l9391M4238O4786J3093m2070m1425N71M2271M4141
9847A05133k9867j0379l8383J838k2893J4481J1962P145J89J1721K053l8766K261
9834A6495l3153N9838P4635p996k9372l2702R278l878L8664q0843j3893R4378
$$ plain form
9919 365214 517907 652634 758144 860734 1015434 1039490 737927 507296 330536 243128
9909 243128 164999 46250 39714 52262 60679 59027 89788 23312 14969 30563 36336 37425 95057
9896 95057 76781 35543 49018 60261 81885 103661 90500 101523 108215 99399 134157 98622
9884 98622 43035 15039 62360 33875 40972 76053 80822 94655 77103 35376 -35384 -54619
9872 -54619 -10640 62243 63309 39862 20229 -22186 -16695 89606 95040 35128 32502 83612
9860 83612 89363 45648 14186 18919 -20472 23766 88552 101645 59575 18150 18721 60992 105133
9847 105133 75266 64887 26504 28342 5449 19930 31892 39037 39226 50947 53000 14234 16495
9834 16495 -16658 43180 117815 109819 80447 47745 57023 53145 91809 10966 -2927 91451
9822I1451q5595K2167P2716P5582K4400k224o0705l6264l4145j7910k2126K7832
9810E5179j43n5908l3724L1073O7677l0820o4668l6969J9735n394M4955N4810
9798D5803K0109p2941k5130N186Q0361K1214l7358l101M1392m331l7707j12936
9786g9439k1527J05858l1247M0460P9857l3011j1899j3989r438k5728n650J1701
9774E948N0418M5812M7956k916m0111k7659m9941j23581J4820M1568L579j8088
9762e2195N5419L6370P043L7275J7828k923p2639m9447n762j3807J2995N9317
9750B9474J8735j830J339L3589K8359q8506j15290j3521J8641R0863K2978l5150
9738a0319m6623j9250K0260L0843J6080l8206J4310O6319l1317M4223k1024m3975
$$ plain form
9822 91451 5856 28023 100739 176321 200721 198497 137792 101528 67383 49473 27347 55179
9810 55179 55036 -872 -34596 -3523 64154 33334 -31334 -68303 -48568 -53962 -9007 45803
9798 45803 65912 -7029 -32159 -26973 53388 74602 37244 34143 75535 71204 33497 -79439
9786 -79439 -100966 4892 -26355 14105 93962 60951 49052 35063 25625 -103 -5753 5948
9774 5948 56366 102178 150134 147218 107107 79448 29507 -94074 -79254 -37686 -34107 -52195
9762 -52195 3224 39594 46637 83912 101740 98817 26178 -23269 -29031 -42838 -29843 29474
9750 29474 48209 46379 47718 81307 109666 21160 -94130 -107651 -89010 1853 24831 -10319
9738 -10319 -56942 -76192 -55932 -25089 -9009 -47215 -32905 33414 2097 46320 25296 -18679
9726a8679m8608j3119p903L9937J3303p313K9669P3266k0295j0771n6112m7682
9714g4307L6011K3751l2219L5516L816o1316j7422L4972J3948O3685r644J9171
9702C5962m567o4226p387L9714M609Q363j838M3703L6361N1250k4468r4309j1587
9689A1580J7563n72n7844O013L3371O937p8730K6363N0384Q2146N949n4043r6565
9676d7448L1067l897N603J20716R7483m5923j68049J7352Q1964P4533j0983l7296
9664A15122q7890p9562O1381M0541m9795r279M6300J7242Q7685M2177R7034J24956
9652D05912J6183N5552J52378L3931k18734k01731q4668k0876m2061n8376l9997
9641b487P206K4947l3711o91J1983M9215m979k8714M2296k1576m7718J2503P1533
$$ plain form
9726 -18679 -67287 -80406 -88309 -48372 -35069 -42382 -12713 60553 40258 29487 -26625 -74307
9714 -74307 -38296 -14545 -46764 -11248 -7432 -68748 -86170 -51198 -37250 26435 16791 35962
9702 35962 31395 -32831 -40218 -504 4105 12468 10630 54333 90694 141944 117476 23167 11580
9689 11580 29143 28571 -29273 -23260 10111 17048 -61682 -35319 15065 97211 103160 49117 -47448
9676 -47448 -16381 -20278 -14675 106041 203524 157601 -10448 6904 88868 163401 152418 115122
9664 115122 27232 -52330 9051 49592 -203 -9482 36818 54060 141745 183922 280956 405912
9652 405912 422095 477647 630025 663956 445222 243491 158823 137947 95886 37510 -2487
9641 -2487 4719 29666 -4045 -4736 7247 56462 51483 22769 65065 43489 -4229 8274 79807
9628G9807J5880m3687n226K3078n341l5671J6096K5320R94j1286o5097k3158o4106
9615i2397L3600J1917L5696R4627L3831o7507m0433m1411L7549J9037l8170N541
9603h120R8464O3446n9581o4909Q581J5137p4150o9655j2210p573M0483K4133
9591d5954O652N2616O8906Q8539K6409q0204l9426K7817K1395q8706m8587L5009
9579B4466L0751M896Q452K0665J2598M0436r549j3659m3660L223L6082k719l5540
9566G6442r01j2899J2000k1832N3902L5016o176m3662m2048m4450l7596K4064
9554h140k1768l5107L5497J9638j9282J4185k5309M043K8977J6595j1035N2762
9542E1056J2904J9873P449K1241l5623l0775L1147N5956q3046L1549N9951o1940
$$ plain form
9628 79807 95687 52000 46774 69852 64511 28840 44936 70256 71250 59964 -5133 -28291 -92397
9615 -92397 -58797 -46880 -11184 83443 117274 49767 9334 -32077 5472 24509 -13661 -8120
9603 -8120 90344 153790 94209 29300 37881 53018 -21132 -90787 -102997 -110570 -70087 -45954
9591 -45954 -39302 13314 82220 170759 197168 116964 77538 105355 126750 38044 -10543 24466
9579 24466 55217 60113 68565 89230 101828 142264 132715 119056 75396 78619 114701 111982 76442
9566 76442 75541 62642 74642 52810 106712 141728 135552 91890 49842 5392 -32204 -8140
9554 -8140 -29908 -65015 -29518 -9880 -29162 -14977 -40286 -36243 -7266 9329 -1706 51056
9542 51056 63960 83833 91282 112523 76900 46125 77272 133228 50182 81731 141682 79742
9530G9742n6998L1187L1654n0737k831R433J2605N7866L8815K616r4695o5286
9518f629k8319M8019j4193L6634N165M377j3689n0106m574l7071l3707K4822L2391
9505c6880Q314N4906p10m8947o1194k8980M8825Q6246L1366l3687M709j4834m7682
9492c8548n2196P814k9229P8384J08773m1263N180J7332O750N4098N2411o8322
9480A01184Q74O927n4681o4880M7796J4779p5683o4041L7355K9670j8309l913
9468d2922p587J6418N3737M0716n697o6066q155j9533l2913Q901K3577O0023l0428
9455i929R337q8415m3705k2044J10437J89115J9985n864J055j35897j19494K4350
9443g1069N4221M5858K4762J3442p7972l658J1155j7732M9979P2608j3979r0772
$$ plain form
9530 79742 22744 53931 85585 34848 32017 41450 54055 111921 150736 153352 58657 -6629
9518 -6629 -34948 13071 -1122 35512 40677 45054 31365 -18741 -23315 -60386 -94093 -69271 -36880
9505 -36880 -28566 26340 25630 -23317 -84511 -113491 -64666 21580 52946 19259 23968 9134 -38548
9492 -38548 -90744 -82930 -112159 -33775 74998 33735 38915 56247 62997 117095 169506 101184
9480 101184 102058 108985 54304 -10576 37220 51999 -23684 -87725 -50370 -20700 -39009 -42922
9468 -42922 -50509 -34091 19646 60362 54665 -11401 -19556 -39089 -72002 -63101 -39524 20499 -9929
9455 -9929 -592 -89007 -132712 -154756 -44319 144796 164781 158917 159972 24075 -95419 -71069
9443 -71069 -16848 29010 53772 67214 -10758 -14416 -3261 -20993 28986 101594 87615 -3157
9431c157o8629L7121J0939J3606n944L6258k1891K5304o4409L024Q5188M1535
9419H8945l9239L0449M3440m6862Q985N1541m9132K7901N0965K3796l7676N4042
9407B07155N7429q607j1842j2378k2064l9434k9096L4326j6947q4188n4099n6048
9395c5793p6853O4562O8670N1274j769j0869k257o3395m9864k7345P2938M1387
9383C0686j4711M2682M2890l9108k4458n48k0156o2024N2959m132o8310J8780
9371d5450O4260P1249N1844l7032m8319l6152j5792L7059M461k1771j6656N5259
9359F2960J5233p1962L1190M8302K642J3199l0306m6189N1810P30m9866q6503
9347e8760k2879N7483P2770L1571m7474j14033m2829N4526K9661j8568L0971q2998
$$ plain form
9431 -3157 -71786 -34665 -23726 -10120 -16064 20194 -1697 23607 -40802 -37778 47410 88945
9419 88945 49706 80155 123595 76733 85718 137259 88127 116028 166993 190789 153113 207155
9407 207155 264584 255977 244135 231757 209693 170259 141163 175489 158542 74354 20255 -35793
9395 -35793 -112646 -48084 20586 71860 70091 59222 56965 -6430 -56294 -83639 -10701 30686
9383 30686 15975 58657 101547 62439 37981 37433 17277 -44747 8212 4080 -64230 -45450
9371 -45450 18810 90059 141903 104871 56552 20400 4608 41667 46128 24357 7701 62960
9359 62960 78193 6231 37421 85723 88365 101564 71258 25069 76879 77609 27743 -58760
9347 -58760 -81639 -24156 48614 80185 32711 -81322 -124151 -69625 -39964 -58532 -27561 -110559
9335a10559n0366P2260M5010l4916K5036Q358N9551J5862J5939j9899m4583N344
9323a2963p5162m2305L0505Q6223J49j3457K270M4959j3131r144j4189o3860k2000
9310a02105K7872l713M4778K4865N2950K6664n4406p9540k3432j3071M576J4459
9298h0103L0745J8761K7570N8422o8322m1169P0753J24668L6399p0802r1037m6040
9286c0155k6951J571J9091J2239r389N665R7108O751J5578o4843k4917m0480N300
9273c3432K4837Q2400M5700p1807r9098l0630J1249r192m0640N5460J27653P2348
9261A34848R10q0799n4174N8393J546o5081p322L4265l8273R430P2954M1437K1573
9248A29707o8954N605m0385o010l2733k9015o8513N8753Q0906l3686o5397m2046
$$ plain form
9335 -110559 -160925 -88665 -43655 -78571 -53535 -45177 14374 30236 46175 26276 -18307 -12963
9323 -12963 -88125 -130430 -99925 -13702 -13553 -27010 -24740 20219 7088 -2056 -16245 -80105 -102105
9310 -102105 -74233 -77946 -33168 -8303 44647 71311 16905 -62635 -86067 -99138 -94562 -80103
9298 -80103 -49358 -30597 -3027 55395 -12927 -54096 16657 141325 177724 106922 15885 -30155
9286 -30155 -57106 -55535 -36444 -24205 -33594 -27929 69179 75930 91508 26665 1748 -38732 -33432
9273 -33432 -8595 73805 119505 47698 -51400 -82030 -70781 -79973 -120613 -65153 62500 134848
9261 134848 135758 54959 785 59178 60724 -4357 -11679 22586 -15687 -6257 66697 108134 129707
9248 129707 60753 66358 25973 19963 -12770 -41785 -110298 -51545 29361 -4325 -69722 -111768
9236a11768Q7737Q3544J8624L0105K7r5589p7406j4349N9470j3573k4511L3274
9224b4415L1357o9373K1677M2898j7438K3548K1059j649n4008o8471Q8383N6366
9212D9934k4926J2649o0990k4222N5171R1776O5979K140j21354j01323J5398j4480
9200e4248l7907Q2363k3293q7721L00L9202N1866L5445M6927P774J5496j4058
9188F2146R051L9424l5794J3187K8456O7176r697m2007q9700n0166j7456q9995
9176a15375L189k26J5857N6330O0468M4019n2398K4271N610l8708k8619J6435
9164i147l118j0909l4218o7964L7537J5457k1292j6392j4118O2680M2508P8015
9152E9039L4003j1302p9691q7121P3080N2797o0081r4005J1189M5404J04883L4448
$$ plain form
9236 -111768 -24031 59513 78137 108242 108269 12680 -64726 -79075 -19605 -33178 -57689 -24415
9224 -24415 6942 -62431 -40754 2144 -15294 8254 29313 27664 -26344 -94815 -6432 49934
9212 49934 25008 37657 -23333 -47555 7616 99392 165371 167511 46157 -55166 -39768 -54248
9200 -54248 -92155 -9792 -33085 -120806 -120506 -81304 -29438 6007 52934 60708 76204 62146
9188 62146 71197 110621 74827 88014 116470 183646 173949 131942 42242 -7924 -25380 -115375
9176 -115375 -112186 -112412 -96555 -40225 20243 64262 11864 36135 41745 3037 -25582 -9147
9164 -9147 -12265 -23174 -57392 -125356 -87819 -72362 -93654 -110046 -124164 -61484 -18976 59039
9152 59039 93042 81740 2049 -85072 -11992 40805 -19276 -113281 -102092 -56688 48195 82643
9140H2643p5486l6206M8975l6626L7283k4627N2080K5549p5552J0267K6430K6444
9128F1174K3612j7748k4374N1925J0787o0898n1545o8940O492M5327N7251J7153
9116E0216r02J053o002q3664l161p133N5148M611o2768j9273O1327l098K771J1010
9102A35O657K3762P6876m531k5436o3972O47q75n612R409j4258l1794O3915J3094
9088D8017l4415N8802J1127l355O8681k6951j9131M8016o13r2940k1895j6716
9076A8627m346n476k4826l4186q226L60L6062L1645K7388o9519j6547O7840K9137
9063D7933O771M1100o144r0274j0880K5890m7049J7427R898m2607k8607j8745
9051i5287j7484O6692j858n5172J4357M3329M710m1024l9322j2055N2170N6826
$$ plain form
9140 82643 7157 -29049 19926 -16700 20583 -4044 48036 73585 -1967 8300 34730 61174
9128 61174 84786 67038 42664 94589 105376 44478 -7067 -76007 -69515 -24188 33063 50216
9116 50216 49314 50367 44365 -39299 -42460 -49593 5555 10166 -52602 -71875 -10548 -13646 -10875 135
9102 135 6792 30554 107430 102899 77463 13491 14138 13263 7651 17060 2802 -28992 34923 48017
9088 48017 13602 72404 83531 80176 148857 121906 102775 150791 150178 57238 35343 18627
9076 18627 14281 8805 -16021 -50207 -58433 -58073 -22011 9634 37022 -32497 -49044 18796 47933
9063 47933 54704 95804 89660 -614 -11494 14396 -32653 -15226 -5328 -47935 -76542 -95287
9051 -95287 -112771 -46079 -47937 -103109 -88752 -45423 -40713 -81737 -121059 -133114 -80944 -24118
9039b4118n498j0307K9494O6925L4096J838m2723q2646j3348j1123O6767L9895
9027D9252j9429o8948O2324k0204k6799K4304K3009P8297m1111m2242L6603l2936
9015B2120p5526L4060M672k2746l8202M071K6695P2094m725o6157m5224P0363
9003a8505R4193J5488n9515j11842K7788P0443j9772m0894o5596J6869J0538P8156
8991b649N2337O2314n5043m2399k8466j8210L1658K8997Q906j5050J6141k3626
8979A4910l0386J8958N8156L2573K2857o0303p6879m6482M2129k6141r7487m4272
8967a92367n3087M564J30037J08571p769m8412M7121N8339N9048k2464m6139m6830
8955i388N0929K2875j753j6482k1511j6684Q751N043q706k2355k5914J8650j9605
$$ plain form
9039 -24118 -29616 -39923 -10429 56496 90592 92430 49707 -32939 -46287 -57410 9357 49252
9027 49252 29823 -39125 23199 2995 -23804 500 23509 101806 60695 18453 55056 22120
9015 22120 -53406 -19346 -14674 -37420 -75622 -71551 -44856 27238 22513 -43644 -88868 -18505
9003 -18505 75688 91176 31661 -80181 -52393 18050 -1722 -42616 -108212 -91343 -80805 -2649
8991 -2649 49688 112002 56959 14560 -13906 -32116 -458 28539 37445 22395 38536 14910
8979 14910 -15476 3482 61638 94211 117068 56765 -20114 -66596 -24467 -50608 -148095 -192367
8967 -192367 -245454 -240890 -110853 -2282 -10051 -58463 -11342 46997 106045 83581 37442 -9388
8955 -9388 41541 64416 62663 46181 24670 7986 16737 21780 13074 -9281 -35195 -16545 -36150
8942c6150k9548q477M9197J8214L2948K2707l7332n7145m8963L5445N1564R1359
8930H3819L785j07162m6933J1347R2640L4634j08264p8123R446O6142N4512J5342
8918C1185K3759j1063j0201m1791M3050L0975j7266k4124m0692o4856M5571N2058
8906A6605o0097K8761P6429J3563j4303j9342l6876L0712K8147K4784m7915m9326
8894h858k9475N4771N6412K2945q373m8969J7731m004p665J5390j5021J3049k5956
8881C1977m7984p8127k9480M8931J8740L8188O6512K2090q6895j45640k2260J0010
8869a73938P1884Q8561M9016R6934L8720q4760k3460K6293Q393R66n2384m4116
8857B109j2277n5198L0363n6292L8011K4818j1585M7062O1640M986p0330j17341
$$ plain form
8942 -36150 -65698 -74175 -24978 -6764 26184 48891 11559 -45586 -94549 -59104 -7540 83819
8930 83819 87604 -19558 -66491 -55144 37496 72130 -36134 -114257 -104811 -38669 15843 31185
8918 31185 54944 43881 33680 -8111 34939 65914 48648 24524 -16168 -81024 -35453 16605
8906 16605 -43492 -14731 61698 75261 60958 41616 4740 35452 63599 88383 40468 -8858
8894 -8858 -38333 16438 72850 95795 87422 38453 56184 52180 44515 59905 44884 57933 31977
8881 31977 -16007 -94134 -123614 -74683 -55943 -17755 48757 70847 -16048 -161688 -183948 -173938
8869 -173938 -102054 -13493 35523 132457 171177 86417 62957 89250 97643 98609 46225 2109
8857 2109 -10168 -65366 -35003 -91295 -53284 -28466 -40051 7011 68651 73637 3307 -114034
8845a14034R706j2280k8044m5543M4027M980M0889K6653J2853K5802O473o8264
8833i6782k7613Q7948N764M2210R1412k9591o7164O1769J3418j21831p817M6570
8821a707q0259N9530P0483m6461j0647J6839l3922m8217O4206J911m6343M2307
8809a2280K6911J690m1803Q4041L322n3235k7756O4439M4401l5196k2979j664
8797B9891J9192Q441N787l1183k8402k5459K6302K587N1670N0177k2570J9126
8785A05559k2255l6723r618p2736J7577L4656m894k9468k4506J8479k3469J5119
8773c2279K0428o566m7417J5805J11430K85l7942K1363M4552J4651Q139l8351
8761G4098p665L2436m6298l4853O1548K3337l415j9756k4181J1704r524j145m3822
$$ plain form
8845 -114034 -104328 -116608 -144652 -190195 -146168 -141188 -100299 -73646 -60793 -34991 -28518 -96782
8833 -96782 -124395 -36447 -30683 11527 102939 73348 6184 67953 81371 -40460 -48277 -1707
8821 -1707 -81966 -22436 48047 1586 -9061 7778 -26144 -74361 -10155 -8244 -54587 -12280
8809 -12280 14631 16321 -25482 58559 61881 8646 -19110 45329 89730 54534 31555 29891
8797 29891 49083 57524 63311 32128 3726 -21733 4569 7156 58826 109003 86433 105559
8785 105559 83304 46581 36963 -35773 -18196 16460 11566 -17902 -42408 -23929 -47398 -32279
8773 -32279 -11851 -18417 -65834 -50029 61401 61686 23744 45107 89659 104310 112449 74098
8761 74098 66433 98869 52571 17718 79266 102603 99188 79432 55251 66955 57431 56286 12464
8748A2464j03k691M7620K0840k3299m1077k608j7029k0064K8105Q4824L8563m8147
8735G7398j00683p7239J6479K6404K2326K6025L6164K0739p9050j0550J8079j5381
8723c9289k1987N3125P1377k7081j11k6937K3628J6384n9081k0357j6018J6048
8711c0299M6785k7993j41239j1995J44910N6660j4891K0664M3642m643m0998k0704
8699A9899Q8072N8003p1534m6957o185J5312n0278l4629O678J3715o1902K3902
8687d5904P2708l207J9830n0216j9443M4346J4948k2356K2375k2280l7247N0513
8675B4067k7830N04L2974O1118R754P3583l6920k6023J5626n7320n1544k4276
8663f287m5197J0489M9433J0924r763J5820L619J5305L7357k219J1215j6103p5581
$$ plain form
8748 12464 12361 9670 57290 78130 54831 13754 11146 -5883 -25947 2158 86982 125545 77398
8735 77398 -23285 -100524 -84045 -57641 -35315 -9290 26874 47613 -31437 -41987 -23908 -39289
8723 -39289 -61276 -8151 63226 36145 36034 9097 32725 49109 -9972 -30329 -46347 -30299
8711 -30299 16486 -11507 -152746 -164741 -19831 36829 21938 42602 86244 81601 40603 19899
8699 19899 107971 165974 94440 47483 41298 56610 6332 -28297 -21619 -7904 -69806 -45904
8687 -45904 26804 23597 43427 -6789 -26232 18114 33062 10706 33081 10801 -26446 24067
8675 24067 -3763 -3259 29715 90833 100587 174170 137250 111227 126853 69533 17989 -6287
8663 -6287 -51484 -40995 8438 19362 9599 25419 29038 44343 81700 79481 90696 74593 -988
8650i88M4834J5214M74j5475M5914N8174o5620j5071o265J3816O658m7502n6318
8637b2155O388M51K5986K3160k4741K7429O8499j6867l7592j2763k7611L4012
8625D4196J8834J7935l6673n3567j0774Q0833J4590o9856l1425N5576n312J4634
8613C8991q765K5596N2911q389p3668k949P995r0357j0811P2804M7765j4051M6118
8600H3190k3684o0372o94j1837K9225O9491m0367p860K8611R6839O6809o7812
8588A61539L385l8552n413M223J582o6512J4157k9096L0268M1872r1116j07641
8576h1304L3204j4750L1409Q6415L6600k3214Q768J5339k5811p5634K6913L4055
8564E1990l9149L546J0675K2177J0195m4232n4013k7j7731Q8643P3423q68N5443
$$ plain form
8650 -988 43846 59060 59534 44059 89973 148147 82527 67456 61191 75007 81665 34163 -22155
8637 -22155 -15767 -15316 10670 33830 9089 36518 105017 88150 50558 37795 10184 44196
8625 44196 63030 80965 44292 -9275 -20049 60784 75374 5518 -25907 29669 24357 38991
8613 38991 30226 55822 108733 100344 26676 23727 31722 -58635 -69446 3358 51123 37072 83190
8600 83190 59506 -866 -1560 -13397 15828 85319 44952 37092 65703 162542 229351 161539
8588 161539 164924 126372 120959 125182 126764 60252 74409 45313 75581 117453 26337 -81304
8576 -81304 -48100 -62850 -31441 54974 91574 68360 77128 92467 66656 -8978 17935 51990
8564 51990 12841 16387 27062 49239 59434 15202 -38811 -38838 -56569 32074 105497 104629 160072
8551A60072l9520m2191n9648q3366J7766J02036l5590J339N8862k4218m8381K4729
8539C1890m1178l2143J4634M4781J6658k5577l1148k6503M4419j4164j0556n292
8527c4179N8582K6318k9565l9433J2945L3546k7070L6163p1942L4017k5464n7134
8515h3216q615J6909k550J8719N0695l137J3770O7493n25Q795N7260K6420l7063
8502A24955P449J5936q1019J0826m2341n5588j754k6819m0185K4232j697M0326
8490b5679k592K8342J9175L2074J130k5627J880p2569M8383M595k5660M2483k4983
8477I52l5977l2762P414J3899L4337L7523K650k558P722k1155L9591l2297j1472
8464G867R9794K255l7507p2227K5343R478L8100j667j04O5896K6251j0380l3238
$$ plain form
8551 160072 120552 78361 18713 -64653 -46887 55149 19559 20898 79760 55542 7161 31890
8539 31890 -9288 -41431 -26797 17984 34642 9065 -22083 -48586 -4167 -18331 -28887 -34179
8527 -34179 24403 50721 21156 -18277 -5332 28214 1144 37307 -34635 -618 -26082 -83216
8515 -83216 -91831 -74922 -77472 -58753 -8058 -11195 2575 70068 69543 78338 135598 162018 124955
8502 124955 132404 148340 67321 78147 35806 -19782 -21536 -48355 -88540 -64308 -66005 -25679
8490 -25679 -28271 71 19246 51320 52450 26823 28703 -43866 4517 9112 -16548 25935 952
8477 952 -35025 -67787 -60373 -46474 -12137 25386 28036 25478 33200 12045 51636 19339 7867
8464 7867 107661 109916 72409 182 25525 35003 73103 71436 71332 137228 163479 153099 119861
8451A19861k5814o6017R6411O5579r798m4724l8478k1160L5461o7947K8970O2556
8439A34900k6605n1822J4318P701M212k7222l0828K3926K0853p91N3733n0441
8427G1934l6759j3614l9745J3070R23k0476K1325m0796n5397J5282Q4048J16068
8415A15863k1416J5052m1357p3338M7190K7508k6177o2222N497j028o4748l4632
8403a13808O419J0849P8196M1596K0973P874N3271L1271n3981k4163j01783P6045
8391C2759N0366l8619q818j03597j0500L7542M77J7515J5106r344q745l3345p580
8378f6783j6248j6203J9946L7633j3908P1873j9854m2855l3400N6518N8333K4184
8366E9236J2562L1975j05655o2504J645M7918J4596K0347O8305k7146n4708J5486
$$ plain form
8451 119861 94047 28030 124441 190020 180222 135498 97020 75860 111321 43374 72344 134900
8439 134900 108295 56473 70791 78492 82704 55482 24654 48580 69433 68642 122375 71934
8427 71934 35175 21561 -18184 -5114 -4191 -24667 -3342 -44138 -99535 -84253 -205 115863
8415 115863 94447 109499 68142 -5196 41994 69502 43325 -18897 -13400 -14428 -79176 -113808
8403 -113808 -107389 -96540 -18344 23252 44225 52099 105370 136641 82660 58497 -43286 32759
8391 32759 83125 44506 35688 -67909 -78409 -40867 -40390 -22875 -7769 -17113 -25858 -59203 -66783
8378 -66783 -83031 -99234 -79288 -41655 -55563 16310 -3544 -46399 -79799 -23281 35052 59236
8366 59236 71798 103773 -1882 -64386 -62741 -14823 -227 20120 88425 61279 6571 22057
8354B2057R5203j7153n4908J2082o6228l1973N3941N5908l6306n409M5621L2413
8342A05248o1162m6036K4433J9516J1542K3762l2029k9887N6652K5338N697L1412
8330A34486K5409k1022m2173n9848m4383q1010P5147R6762n8265k5615K0274J794
8318B1556k6910k9821j5082k3163J48232P6588J8559q3890j03761o8386o2745
8307a48823Q524N253O6613M8684K0614j0053K6324O1784L4570M918k4126j145
8295I3137m3850k1313l4281J3535k7345n4566J5843P359m9245m990P8150L1878
8283D312L747K9394Q160n839j7321k0754k6957n3607r302M9001p308j215M297
8270d3392L6369P6659M2271k2794o1601r211j0743o28P6776N3360j8267p2406
$$ plain form
8354 22057 117260 100107 45199 57281 -8947 -40920 13021 68929 32623 27214 72835 105248
8342 105248 44086 -1950 22483 41999 53541 77303 45274 15387 72039 97377 103074 134486
8330 134486 159895 138873 96700 36852 -7531 -88541 -13394 83368 25103 -512 19762 21556
8318 21556 -5354 -35175 -50257 -73420 74812 151400 169959 86069 -17692 -86078 -148823
8307 -148823 -140299 -135046 -68433 -19749 865 -9188 17136 78920 113490 118408 94282 93137
8295 93137 49287 27974 -6307 7228 -20117 -74683 -58840 -51481 -100726 -105716 -27566 4312
8283 4312 8059 37453 45613 39774 22453 1699 -25258 -78865 -88167 -39166 -46474 -47689 -43392
8270 -43392 -7023 69636 111907 89113 27512 18301 7558 6930 83706 137066 118799 46393
8258D6393j2106L3687P0981j0112r1025l5935L8898l9659J501L7524k5930k7074
8246a2857k7729l0422l4577L1634l7205M5340P2385K2952K4744L1393r1296n264
8234a0902J9839l0917M5407O5185N1392m066k2734n7455k1866j32505J6282J4062
8222f8278p7324l97N3612N8098O4081K7425O962p1989l0714l0832N7037Q5332
8210G3013p938m6864m4724M9329K512L570m7949k7994J5888O9669K1127j6799
8198D2840m6673o4516k0284O5050N048M8334M0638j5505o449j3410m0191K0236
8186A5118j1588O182J3803j02482P343M0500j3300L42L6250J8364n8934l7740
8174h6142L2519k2644L0458L4495J0341M3139m3304p6229M9964J10585L1987q1745
$$ plain form
8258 46393 34287 67974 138955 128843 37818 1883 40781 1122 2623 40147 14217 -12857
8246 -12857 -40586 -71008 -105585 -73951 -111156 -65816 6569 29521 54265 85658 -5638 -10902
8234 -10902 8937 -21980 23427 88612 140004 135938 113204 55749 33883 -98622 -82340 -68278
8222 -68278 -145602 -145999 -92387 -34289 29792 57217 64179 -7810 -38524 -69356 -12319 73013
8210 73013 65075 18211 -26513 22816 25328 28898 -19051 -47045 -31157 38512 59639 42840
8198 42840 -3833 -68349 -88633 -23583 -18535 29799 70437 54932 48483 35073 -5118 15118
8186 15118 3530 9712 23515 -78967 -71624 -31124 -44424 -44082 -7832 10532 -48402 -86142
8174 -86142 -53623 -76267 -45809 -11314 -973 42166 -1138 -77367 -27403 83182 115169 33424
8162C3424q5815l338m4165k4061L2422N8758P0530j8605l7311M779N330k4346
8150c2398M0945R632m3227k9474n903m6289l4265K6032J9634l7932K3890J08866
8138d89M8332P88l1179p0752J3578L8702K2068j0267O76k2829l5448L125L8361
8125e334L8380L3301q0491o8994N2947L146K4019M0784l51n3030L1159O7230M8660
8112A31426o0943m8531l4220Q5334M2401P269J0782n710j02218k7533K036k8098
8100b8005k6247O294R8106J9630K9785J2853k2936o8604o6071O9900k0249r5534
8088i1078p768K9362L8185j5901n2461k9873K9817M0689O868J7622K7331m1829
8076d9036j6359M9884j3314o8875k525J09432O7684k3667m6043r133J6825K3896
$$ plain form
8162 33424 -52391 -55729 -99894 -123955 -91533 -32775 37755 19150 -18161 -13382 -8052 -32398
8150 -32398 8547 18179 -25048 -54522 -60425 -106714 -140979 -114947 -95313 -133245 -109355 -489
8138 -489 47843 48631 17452 -53300 -39722 -1020 21048 10781 11457 -11372 -46820 -43695 -5334
8125 -5334 33046 66347 -14144 -83138 -30191 -27045 -3026 37758 37407 -15623 15536 82766 131426
8112 131426 70483 21952 -12268 73066 115467 122736 133518 127808 25590 -1943 93 -28005
8100 -28005 -54252 -47958 50148 69778 99563 112416 89480 20876 -45195 24705 4456 -91078
8088 -91078 -98846 -69484 -31299 -47200 -99661 -129534 -99717 -59028 -52160 -34538 -7207 -49036
8076 -49036 -65395 -15511 -28825 -97700 -100225 9207 76891 53224 7181 -1952 14873 38769
8064C8769l0175o203k5601M1393L2296N5423N594r0371J3278R3766K6975n716
8052A49428q9200p943M7168m3174j04052m9511O3401O9650j6059k1018L3325K5872
8040E7887n1545j6660J0243J9447L6943l0919m8815J7041l4852J6669J20281k1086
8028G4634L0397k0288p3587N5352n3550k9051K5413L4541J7140K013K8816L9079
8016A30909j8706n8070j5010O3307k5470l9136n8530m6706j05905N5417J9274
8005i8626R338N0458K9342r076k8321l3423L1755L2959p8906m4550P1352R2680
7993B4982l8613J2050M2931r017J4400n1875r2059j7318K311L636K4964L0309
7981e3299O9161J0697o5090M4666m4801K3770o309o352O227K429K8436M2209r65
$$ plain form
8064 38769 8594 2391 -23210 18183 50479 105902 111496 21125 34403 128169 155144 149428
8052 149428 60228 52285 99453 56279 -47773 -97284 -33883 35767 19708 -1310 32015 57887
8040 57887 6342 -10318 -75 19372 56315 25396 -23419 -6378 -41230 -24561 95720 74634
8028 74634 105031 84743 11156 66508 12958 -16093 9320 43861 61001 63014 91830 130909
8016 130909 112203 54133 39123 102430 76960 37824 -20706 -67412 -173317 -117900 -98626
8005 -98626 -89288 -38830 -9488 -18564 -46885 -80308 -48553 -15594 -94500 -139050 -67698 24982
7993 24982 -13631 -1581 41350 32333 46733 -5142 -97201 -114519 -112208 -108572 -83608 -53299
7981 -53299 15862 26559 -38531 6135 -38666 -14896 -21205 -27557 -21330 -18901 9535 51744 50779
7968E0779k7892k9634M8551j3390r3787k3179O613N8406K0195O7417J583k4505
7956D1157j069j4629K2258N696m3689n9746L2991k14j62L648J6779l5717M11k7730
7942f0016K0142L3397K9351l8372m3986k8646k4614P8641P6008M1487J4480m3630
7930E4242n1071R60L0972L1138L932l56q007O9451j2488n121J4988l9631J2122
7917A01131M6689N2775q074n5849j03807k5373k4301J5654K2217M3313k9755p4038
7905c9418J5242P6566p957k8368K1407L7868K14p0646J6624O1609J6860j7998
7893H2003k1389O883m164L0877L0993n1765j2618M790P238M0873j2913l0472o7462
7880B874o0563m553N0323K5412n1912n0072K0444K9919N5810l6026m1066O9520
$$ plain form
7968 50779 22887 -6747 41804 28414 -65373 -88552 -81939 -23533 -3338 64079 65662 41157
7956 41157 40088 25459 47717 53413 9724 -50022 -17031 -17245 -17407 -13759 3020 -32697 -32286 -60016
7942 -60016 -39874 -6477 22874 -15498 -59484 -88130 -112744 -34103 41905 83392 97872 54242
7930 54242 3171 4131 35103 66241 70173 69817 61810 131261 118773 113652 128640 89009 101131
7917 101131 147820 200595 192521 136672 32865 7492 -16809 -1155 21062 64375 34620 -39418
7905 -39418 -24176 52390 44433 16065 37472 75340 75554 4908 21532 83141 100001 82003
7893 82003 60614 67497 63333 94210 125203 73438 60820 65610 72848 113721 100808 70336 2874
7880 2874 -57689 -62242 -11919 13493 -38419 -88491 -68047 -38128 17682 -18344 -59410 10110
7868A0110j7819l388M027J5616n460J6436q238m2459l8597L6477p0567r323Q6694
7855b6491L6000J5480k9481p5364o2975K1289m675J127P9173P1070k5459q7446
7843h7752k5843m9385Q004K6173N4971K6760J3204J8180%M2956J9298n0469l9483
7830d3386K8234J13J879M2558J6413o6281l1564P1754j7857J7101K9068J5544
7818F3576n910P90L0945j1831M4203M2326j7810j09535j3022J393O714o165j2673
7805A3001k3402J5672o9524O197L52j4415M619K4838L4722j8844k1258q1862j4038
7792a43942K1530M9466n530P236K5243N0039j4043j5823P7750L7118m7712m0887
7780D45L7827L0452o7684j4334N4904k9320l6819m258M185J6281L9359p1058J1338
$$ plain form
7868 10110 -7709 -11097 -7070 8546 3086 19522 11284 -31175 -69772 -33295 -103862 -113185 -26491
7855 -26491 9509 24989 -4492 -79856 -142831 -121542 -126217 -125090 -45917 25153 -306 -87752
7843 -87752 -113595 -162980 -154976 -128803 -73832 -47072 -33868 -15688 -15688 27268 46566 -3903 -43386
7830 -43386 -15152 -15039 -13160 29398 45811 -20470 -52034 19720 1863 18964 48032 63576
7818 63576 57666 58456 89401 77570 121773 164099 146289 36754 23732 25125 31839 25674 13001
7805 13001 -10401 5271 -64253 -58056 -57704 -72119 -67500 -42662 -7940 -26784 -48042 -129904 -143942
7792 -143942 -122412 -72946 -78476 -71240 -45997 4042 -10001 -25824 51926 89044 41332 445
7780 445 38272 68724 1040 -13294 41610 12290 -24529 -28787 -24602 -8321 31038 -40020 -28682
7767b8682J3320N3710K9949K4011O6794k56l8267J1714o491p75p1956o2962k2796
7754c2687K0162O0376o839O1913L3201o1126j8545n323L1376k785n4616j6039
7742I068K3676P1761l2230k1731l9241l4574m543j8926m8458J5940l99M8682M5195
7729A4220P6188J5054m9724o9900L3353K9716J1295J8428J5536j5558m3861r4585
7717e9838j6466m5783J3328M9152L6544j2148L470k1332j1284J7586R091l9525
7705g7205N6237R4170P9076l0390k0710Q061K6313l160J4055p2259r5813n7296
7693g8921o6310K8147Q4740N8907m847k8212k9282N9566L2045m2189l6277l771
7681b6404j5980K0993m665m0326p224J4311M903O2957l5160q4317L2461P1337
$$ plain form
7767 -28682 -15362 38348 68297 92308 159102 158846 120579 132293 125802 125027 53071 -9891 -32687
7754 -32687 -12525 47851 41012 102925 136126 75000 56455 51132 82508 79723 25107 9068
7742 9068 32744 104505 72275 50544 11303 -23271 -27814 -46740 -95198 -79258 -79657 -30975 14220
7729 14220 90408 105462 55738 -14162 19191 48907 60202 78630 94166 78608 34747 -59838
7717 -59838 -76304 -122087 -108759 -59607 -23063 -35211 -31741 -53073 -64357 -46771 -37680 -77205
7705 -77205 -20968 73202 152278 121888 101178 109239 135552 132392 146447 74188 -21625 -78921
7693 -78921 -145231 -117084 -32344 26563 21716 -6496 -35778 23788 55833 13644 -22633 -26404
7681 -26404 -42384 -21391 -26056 -66382 -73606 -59295 -54392 8565 -26595 -110912 -78451 -7114
7669g114M6548J3428o8953m6526l144O316o486J8944l1506M7111M145o7272N375
7656h9134J18867O6936k1761l4830l4963l3989p0427M1509K3648m5063N7442N0240
7644B8475p3867r198J032M987N201M0203Q105O763K1355k564k2290j0013k4752
7631b6563k6069N5572N0249Q2384k874k7670o089o7285r9603O3583K7387j8002
7619E020q0533J5509J05691K6588k4609l3583k8003L7773P3649r1182n9498L0762
7607b2416M7710R9617P6341n5863j48586n6141O4604K7022k5605k963j8027j13210
7595a27517m388M7222N6718p995l9970J6665N4418K0530M2266m578k6442j6161
7583A0768O3327k921j0909k4013M1997o98R895k7053o3092n6825N7537L4767K4350
$$ plain form
7669 -7114 39434 52862 -16091 -62617 -65761 -59445 -65931 -46987 -78493 -31382 -27237 -94509 -89134
7656 -89134 29733 96669 74908 40078 5115 -28874 -99301 -57792 -34144 -79207 -21765 28475
7644 28475 -45392 -54590 -53558 -48571 -43370 -3167 4938 11701 33056 30492 8202 -1811 -26563
7631 -26563 -52632 2940 53189 135573 132699 105029 98940 31655 -67948 -4365 23022 5020
7619 5020 -75513 -60004 45687 72275 47666 14083 -13920 23853 97502 6320 -53178 -22416
7607 -22416 25294 124911 201252 145389 -3197 -59338 5266 32288 6683 3720 -14307 -127517
7595 -127517 -131905 -84683 -27965 -35960 -75930 -59265 -4847 15683 57949 53371 26929 10768
7583 10768 74095 71174 60265 36252 78249 77551 87446 60393 -2699 -59524 -1987 32780 57130
7570E7130q2068o5939M5770K7260R638p7173l2663K5540M3208M9551o810P919
7558A363M9547J0832k0650J9540k9942l0223m644N4650K6677m9166J291Q356m5718
7545h087n3579l4930O658J5416m6691k5570P9322L0296q8346k029L4501P933J6580
7532f8526n6757K4540J17619j0269J516o700m6201l5283m2940L3043j2239j6880
7520a19077L1315N4808P967O0809j5215n3064J0667N0599M4582L3950p6490p1815
7508d0964l5410m7720N2793P1212l3349m990j97J2257l8102K4922J06953M0790
7496A08195J0920L5637r334j5140L4127n5452r8521j7964k2848n2999K5129J05552
7484D7302M8283n4943o0161q3089R43J11633M8268l7108J5298K6661k1723l179
$$ plain form
7570 57130 -24938 -90877 -45107 -17847 -8209 -85382 -118045 -92505 -49297 254 -6556 1363
7558 1363 50910 61742 41092 60632 30690 467 -4177 50473 77150 27984 29275 37631 -8087
7545 -8087 -61666 -96596 -89938 -74522 -121213 -146783 -67461 -37165 -125511 -127540 -93039 -85106 -68526
7532 -68526 -125283 -100743 16876 6607 8123 1423 -44778 -80061 -123001 -89958 -102197 -119077
7520 -119077 -87762 -32954 -24987 35822 20607 -32457 -21790 28809 73391 107341 30851 -40964
7508 -40964 -76374 -124094 -71301 -89 -33438 -38428 -38625 -26368 -64470 -39548 67405 108195
7496 108195 119115 154752 145418 130278 164405 108953 10432 -7532 -30380 -83379 -58250 47302
7484 47302 95585 40642 -19519 -102608 -101665 9968 58236 21128 36426 63087 41364 38185
7472C8185K8781K4887o0044l8264J3286l3364l2422K4301K9008q9370o988M5168
7460e6836K544L1018j0449m2636p807j0359m148N7M7807m6832N1862N9999m0173
7447b5953k3715k3257j7330K6899J1812M6866O258l4489l1794N3836k4128n4064
7435h9059J3124L029M5088j4980N6720L8550n216L8901r3553o3902J0238J9593
7423d1467J6808L6220k7834n3886k7436O9217M8596L688M8719N2138J6713l556
7411A37920p2991p7460m2141n916M1256N455m0060L2006M7219K8122j9443l2901
7399A066l0243J4074m5866p4648O1075O6098M6033j5972o3606l2700J7240N1146
7387f303K8666R995o239K472l1117j7614l3434k5866K262N8455l861l9038k12
$$ plain form
7472 38185 66966 91853 31809 -6455 6831 -26533 -58955 -34654 -5646 -95016 -102004 -56836
7460 -56836 -54292 -23274 -33723 -76359 -84166 -94525 -98673 -98616 -50809 -97641 -45779 14220 -25953
7447 -25953 -49668 -72925 -90255 -63356 -51544 -4678 1580 -32909 -64703 -10867 -34995 -89059
7435 -89059 -75935 -72906 -27818 -42798 13922 52472 47256 86157 -7396 -71298 -61060 -41467
7423 -41467 -24659 11561 -16273 -70159 -97595 -28378 20218 23906 72625 124763 141476 137920
7411 137920 64929 -12531 -54672 -60588 -19332 -13877 -53937 -21931 25288 53410 33967 1066
7399 1066 -29177 -15103 -60969 -135617 -74542 -8444 37589 21617 -41989 -74689 -57449 -6303
7387 -6303 22363 32358 26119 28591 -2526 -20140 -53574 -79440 -77178 -18723 -22584 -61622 -61834
7374f1834J8679k4413K3038o8631r8280J9820J9663P1183O3498R335j319m6622
7362g5883Q383R8312P907m0498j3477K4809j3984J8392J192l8429l4016j3303
7350g0595L3324R44m9337K0568K4184L0826M2048j7119q4598o4598K7201N3231
7338e3921N6361l156J9781K4232p0297O677m70l0573j9784L1395N7378l2292k4458
7325c9127j5l7627j12612l594N5227M3830P0642J2209j9492P4097k864m0943O047
7312E778O8149K3098j0378r8415p6689J8447Q133j8571M1634L40M8636K4218R7510
7299A31890L6735q1320k1338j1888p9070N307N4875K9035o5861o4368M7193P9120
7287F0310j4440K5792L373l7961k5276J7606n6237N545r495J0227L109K5255m9972
$$ plain form
7374 -61834 -43155 -67568 -44530 -113161 -211441 -191621 -171958 -100775 -37277 -27942 -29261 -75883
7362 -75883 -67500 30812 38719 -1779 -15256 9553 -4431 13961 15153 -23276 -57292 -70595
7350 -70595 -37271 -36327 -85664 -65096 -40912 -10086 31962 14843 -69755 -134353 -107152 -53921
7338 -53921 2440 -716 19065 43297 -27000 -20323 -20793 -51366 -71150 -39755 17623 -14669 -39127
7325 -39127 -39142 -76769 -189381 -192975 -137748 -93918 -23276 -11067 -30559 43538 40674 -269 5778
7312 5778 73927 97025 86647 -11768 -88457 -70010 -61877 -80448 -38814 -38474 10162 34380 131890
7299 131890 168625 87305 65967 54079 -24991 -19684 35191 64226 -1635 -66003 -18810 60310
7287 60310 45870 71662 75035 37074 11798 29404 -26833 -21288 -30783 -20556 -17447 7808 -42164
7274d2164l8681K6336M7355k6386j8151k7039K3173L2760J4284o33l0387m5415
7262h4948L4500O5465o061p0121k1772M3797l760O204L6848J658p3837l7685O0538
7249d9174O136k0593M4726N9395l6685n1774m4211J2959L4526N2860K5513K5030
7237E8708n8781m6189K0757J9442L2259O3453l067n048m9419J64K7908L1026j3950
7224G7263j6180L9574n7641n0416q6216P627L5032J8221j8250L8927L735o3589
7212g1913q2938k7834J1943J3590L7473K1964J5654m2590k7580M6729R701L4362
7200f1439N6607N5267p290l6929K3691O8530k2478r29j7897n9758m6463n4701
7188a03789R332J7059O6091P0562k3700k5696n1958K0083N9607L3149o882J1883
$$ plain form
7274 -42164 -80845 -54509 -7154 -33540 -51691 -78730 -55557 -22797 -8513 -9146 -39533 -84948
7262 -84948 -50448 15017 8956 -61165 -82937 -39140 -42900 -36696 152 1810 -72027 -109712 -49174
7249 -49174 -43038 -63631 -18905 40490 3805 -47969 -92180 -79221 -44695 8165 33678 58708
7237 58708 -73 -46262 -25505 -6063 26196 89649 86582 81534 32115 32279 60187 91213 77263
7224 77263 61083 100657 43016 -7400 -93616 -85989 -50957 -32736 -50986 -12059 -8324 -71913
7212 -71913 -154851 -182685 -170742 -157152 -119679 -97715 -82061 -124651 -152231 -105502 -95801 -61439
7200 -61439 -4832 50435 43145 6216 29907 98437 75959 75030 57133 -2625 -49088 -103789
7188 -103789 -94457 -77398 -11307 59255 35555 9859 -42099 -22016 37591 70740 63858 75741
7176G5741m622l4307L017L6188r760l5794l4125q230L3975k5892J155l3394N7011
7163B0963m4859O9523l2529m0269L8992L3514p7856k32N6540m5204k8867R816
7151d0468m7092K3641K8340L0847N5467j840j23532j7300N1630m2115k7043O5807
7139d3658N560O3002j3577j8700j1876l0232m847L2678J9636j8434o0326J8760
7127f2014M5446J1964L8620O2950L6230n6703r9588m9302K3338N4497K1052l8586
7115a2096l4176J9243L0935R089M4921J328r5397n5280k1619r774M6618K0296
7103e5912p50j8557l8846R326J4544L9005L0894J4493P8167K6154M659Q2670M78
7090A86325j5571q845k8044j2230j3336J782J0381j9991m8541j5222j01869q3668
$$ plain form
7176 75741 71119 36812 39829 76017 66257 30463 -3662 -11892 22083 -3809 -2654 -36048 20963
7163 20963 -23896 45627 13098 -27171 11821 45335 -32521 -32753 23787 -21417 -50284 -40468
7151 -40468 -87560 -63919 -35579 -4732 50735 48895 -74637 -91937 -40307 -82422 -109465 -43658
7139 -43658 -38098 24904 11327 -7373 -19249 -49481 -54328 -21650 -2014 -20448 -80774 -62014
7127 -62014 -16568 -4604 34016 96966 133196 76493 -23095 -72397 -49059 5438 26490 -12096
7115 -12096 -46272 -27029 3906 12995 57916 59244 -36153 -91433 -113052 -122826 -76208 -55912
7103 -55912 -56662 -75219 -114065 -104739 -90195 -51190 -20296 -5803 72364 98518 103177 185847 186325
7090 186325 170754 161909 133865 121635 108299 110081 120462 100471 51930 36708 -65161 -148829
7078a48829P745P291J0717M6526L5678m5215R37l1868J5110R2151R318l9037L156
7065c6320l3499L9313m6273o804k9355P5418O2747m8836J5859K8828m1802o4924
7053h5648K8296O7297Q8309j1703n5431n4287m1785l2586M2119O2839R806j00937
7041h3711J3375J01269J02453l1027J1656p0703j3134p2963l0152N7407n708l3505
7029e4743N3339l779L331K2912K2120K737o3510o9893r9840L0453O6380m156m8268
7016a42917n866K0345P2794J6385j2284Q2620M1561k8760K8215J4976q366k4816
7004E3887m1189l3948m7574N0750J089m6695J672j6014O650p851K3059L1890o927
6991c1201m5761l2008n3470J5641Q0079Q6855L1843n9918o5093M472M970O7552
$$ plain form
7078 -148829 -141084 -133793 -123076 -76550 -40872 -86087 -85150 -117018 -101908 -9757 -439 -39476 -36320
7065 -36320 -69819 -30506 -76779 -83583 -112938 -37520 25227 -23609 -7750 21078 -20724 -85648
7053 -85648 -57352 9945 98254 86551 31120 -23167 -64952 -97538 -55419 7420 17226 -83711
7041 -83711 -70336 30933 133386 102359 114015 43312 30178 -42785 -72937 -15530 -21238 -54743
7029 -54743 -1404 -5183 -1852 21060 43180 45917 -17593 -87486 -187326 -156873 -90493 -94649 -142917
7016 -142917 -148783 -128438 -55644 -39259 -51543 31077 72638 43878 72093 87069 78703 53887
7004 53887 12698 -21250 -68824 -18074 -16985 -63680 -62008 -78022 -71372 -79223 -56164 -24274 -31201
6991 -31201 -76962 -108970 -162440 -146799 -66720 20135 51978 -7940 -73033 -68561 -63591 3961
6979C961J3463p9664L819j2585k9031K1283l615O7453K4910K9917n977J5126m745
6966D4315j1821J1093J9852N1404L7962j6687L799o6155r2890p7723q9229L3062
6954a53018P9719N1039K862P6109N8169p1557l7287o09K7321Q2894k599p1977
6942D1066o649q7156m0199R672K5698r532K6182K6380N405N1219K4349M1224j2509
6929I5150J4256j8198l4114n7519m3919J928P4444M6l7120q9692N5753J09657
6917G0672k9177m3684j5918l697P845k8120j7173m2293J852P7779M5304L6842
6905F0232m6432r0107r35R6463j6090j4993M9410Q0078k4885m4847j9992n1756
6893b3854M9335P4277M1223k9161q3606q584K3650N5295r197j4238k6362K7218
$$ plain form
6979 3961 17424 -62240 -58421 -71006 -100037 -78754 -82369 -14916 9994 39911 33934 49060 44315
6966 44315 32494 43587 63439 114843 152805 136118 139917 73762 -19128 -96851 -186080 -153018
6954 -153018 -73299 -22260 -19398 56711 114880 43323 6036 5427 32748 115642 113043 41066
6942 41066 34417 -52739 -92938 -83266 -57568 -67100 -40918 -14538 -9133 42086 66435 107659 95150
6929 95150 109406 91208 57094 -425 -44344 -42416 32028 32074 -5046 -94738 -38985 70672
6917 70672 41495 -2189 -18107 -21804 -13959 -42079 -59252 -101545 -99693 -21914 23390 60232
6905 60232 13800 -76307 -77242 19221 3131 -11862 37548 117626 92741 47894 27902 -23854
6893 -23854 25481 99758 140981 111820 28214 19630 43280 98575 89378 75140 48778 75996
6881G5996J7599n2997k9919k2482M0620L3867m1385n6559N186L6346k8914l9276
6869f1918l0897k9886o262m1615N9414M5208M7574n366k1975j569P0272o816k3229
6856g065j3675J9383P4132n2814q5785K52O3790J6052r4027n1055k957M7729M283
6843h1757L105M1928m2886k5199K4719o340J512N3907K5723k1925K9376M1206
6831D3369l4189n3357j2302N2222N0739J9133Q653k3265j1612N084k7071N8168
6819G5572m2686r1099Q389K621K8585K6125k9204n955O84N7732J7076k4067r179
6806A4594m2041r0540l4550R9627O111m4679J0328L2142j183P6813J22814k0494
6794A28942r9941L5641n996k7632n9632p2117P22P0053N9824N1957L5345k1184
$$ plain form
6881 75996 93595 40598 10679 -11803 28817 62684 21299 -35260 -30074 6272 -22642 -61918
6869 -61918 -92815 -122701 -128963 -170578 -111164 -65956 -18382 -23748 -45723 -47292 22980 16164 -7065
6856 -7065 -20740 -1357 72775 19961 -65824 -65572 -1782 14270 -79757 -130812 -133769 -86040 -81757
6843 -81757 -78652 -36724 -79610 -104809 -80090 -86430 -84918 -31011 -5288 -27213 2163 43369
6831 43369 9180 -44177 -56479 -4257 46482 65615 74268 51003 39391 44475 17404 75572
6819 75572 32886 -58213 -49824 -47203 -18618 7507 -21697 -27652 -26968 30764 47840 23773 14594
6806 14594 -27447 -117987 -152537 -52910 -46799 -91478 -81150 -49008 -50191 26622 149436 128942
6794 128942 29001 64642 58646 31014 -28618 -100735 -100013 -29960 29864 81821 117166 95982
6782I5982k6083n1243j5940M9228k3956j2474k5331M9562J9240m3646k5711K8490
6770A8118j3016n6046n3216P4988J26052M2217O03m9014p3929j3251K2100m514
6758B1092p0422M2968n138r560J6737J4430k3886j0475K7165j3596L5719J7103
6746D2137o3218n3336p501m084N1254j8558m7923J2018K0330o710N5954M4027
6734B4390N9721j6904l3276k3274J0940R438m1130J2525l8130r1542k3127L8971
6722a11398N1510M1650N6650O8946j9697n4419j03751o2547k7329L7575Q5028
6711c7782L9898K9117Q850n0469n0795M4164J8366O1171J592j8738o8965J0215
6699a3376K0312o5774l6534L3109N2583j4605k7730J9213J2806l3098l3778j106
$$ plain form
6782 95982 69899 18656 2716 51944 27988 15514 -9817 39745 58985 15339 -10372 18118
6770 18118 5102 -50944 -104160 -29172 96880 139097 139700 90686 16757 3506 25606 21092
6758 21092 -49330 -6362 -11500 -21060 -4323 10107 -13779 -24254 2911 -10685 25034 42137
6746 42137 -21081 -74417 -81918 -86002 -34748 -53306 -101229 -89211 -68881 -75591 -19637 24390
6734 24390 84111 67207 33931 10657 21597 31035 -10095 2430 -35700 -127242 -150369 -111398
6722 -111398 -59888 -18238 38412 107358 87661 33242 -70509 -133056 -160385 -122810 -37782
6711 -37782 2116 31233 40083 -10386 -61181 -17017 1349 62520 64112 45374 -23591 -13376
6699 -13376 6936 -58838 -95372 -62263 -9680 -24285 -52015 -32802 -19996 -53094 -86872 -87978
6687h7978M055J7580P673K6489L8355l6712j8892k748n9286q6722M5605N6344
6675i6237Q2593m573L2892N9071o9635m8275M2524R560J2615m7741j5913n384
6663d8503o6553p269J7310J008M9622K9883N4786M0276k381k5943j07331m8810
6651a13905O5980J5820N391k1756k2658l2939O0127O7863l1687l690L9938J0873
6639C9357K3584J7108j3866n0129o349Q885n7599L4106J6146q2361J0592L8152
6627b2374N5314L5721n9985l795j006J8254l0992J7886K5297k226l2034k7670
6615b7610o3532m8641P16J30910O9010k0515l7900J5124k1250M906j6979m756
6603b0517m3673l7509J8341L2085L2850R7961L9970j9460j1616l3000l4942m7443
$$ plain form
6687 -87978 -83923 -66343 -58670 -32181 6174 -30538 -49430 -52178 -111464 -198186 -152581 -96237
6675 -96237 -13644 -18217 14675 73746 4111 -44164 -1640 7920 20535 -27206 -43119 -48503
6663 -48503 -115056 -122325 -105015 -104007 -54385 -24502 30284 70560 68179 42236 -65095 -113905
6651 -113905 -47925 -32105 -26714 -48470 -71128 -104067 -43940 23923 -7764 -11454 28484 39357
6639 39357 62941 80049 66183 16054 9705 18590 -39009 -4903 11243 -71118 -60526 -22374
6627 -22374 32940 68661 8676 4881 3875 22129 -8863 9023 34320 32094 60 -27610
6615 -27610 -91142 -139783 -139067 -8157 60853 40338 2438 17562 -3688 1218 -15761 -20517
6603 -20517 -64190 -101699 -83358 -51273 -18423 79538 119508 100048 88432 55432 20490 -26953
6591b6953l3919q350J1402N3809K407k610M7545k522K8352n1611k8925r585M2848
6578B1888J1958k49K5259N3182j0334r7696m5447j5586K9703K2473k1878J5583
6566a1144L7818k6610o2483M6285K4938J14864M1519k6889J0996p2098J5124J3822
6554A06142j9409L4146p4327m9676M180l8484j139n5172k8490P2562K8050K6173
6542D556M0113N1620j5323J4403M0202k9976o7464n5472l6428j5695J13087R4922
6530A38545K9250l2869K0045N5644L548j4464l9125j6541P9731l6490p5861K8228
6518A39641K1075K923l318l9497q0822n8178K0927K4964L6013O03o1871n7015
6506e4555n705L1483N2458L4400J0679N5932J6844K7343R170m4538j15662m0171
$$ plain form
6591 -26953 -60872 -69222 -57820 -4011 -1604 -4214 43331 40809 69161 17550 -11375 -20960 21888
6578 21888 33846 33597 58856 112038 101704 4008 -41439 -57025 -27322 -4849 -26727 -11144
6566 -11144 26674 64 -62419 -16134 8804 123668 165187 138298 149294 77196 92320 106142
6554 106142 86733 120879 46552 -3124 1056 -37428 -38567 -93739 -122229 -49667 -21617 4556
6542 4556 44669 96289 80966 95369 135571 105595 38131 -17341 -53769 -69464 43623 138545
6530 138545 167795 134926 154971 210615 214163 199699 160574 144033 223764 187274 111413 139641
6518 139641 160716 163639 160321 120824 40002 -18176 2751 27715 63728 64331 2460 -54555
6506 -54555 -60260 -28777 23681 58081 68760 124692 141536 168879 178049 133511 17849 -22322
6494b2322J05231P3149P1554n3425j57193p7277o214j7677L7836O3876O8392m2371
6482D3559n493o9058o0141M1939P5846L2813m5993R322j2320k0939q1974j806
6470i4245J5655L1090k8324P3655L2439j05830M9245K4045J48845r818q5804m0938
6458A0015J0575N4708n7231n1775Q2370O9834K9556j4479k6835p8795r1825j3207
6446g7089P4848O9470K1947n1856N5947q969J1150L6477O630p3608r4679J4155
6434a5577O1106L249n1026p6390n579J15992L0212q4993q382L1524o2166j7151
6422g9181K2819K3213l1622j7366K7826j1335l5742O9114M1161l1878j6262m3770
6410h3023p135R9567O4151O8575k7503M0947l2656n173l4461m3944L5852J5670
$$ plain form
6494 -22322 82909 156058 227612 174187 16994 -60283 -66497 -84174 -46338 17538 85930 43559
6482 43559 38066 -30992 -91133 -49194 26652 59465 13472 22794 10474 -10465 -92439 -94245
6470 -94245 -78590 -47500 -75824 -2169 30270 -75560 -26315 -2270 146575 136757 50953 10015
6458 10015 20590 75298 18067 -33708 48662 118496 148052 133573 106738 27943 -63882 -77089
6446 -77089 -2241 67229 89176 37320 93267 84298 95448 131925 138555 64947 -29732 -15577
6434 -15577 45529 48778 -2248 -78638 -84217 31775 61987 -23006 -31388 136 -62030 -79181
6422 -79181 -56362 -33149 -64771 -82137 -54311 -65646 -101388 -32274 8887 -22991 -39253 -83023
6410 -83023 -90158 9409 73560 142135 114632 155579 122923 117750 83289 39345 75197 90867
6398I0867m9044r9843k0282P6865M8513m6848L1426K2583K458l6360R804N704
6386C5843o0332j0676o3362j8406R3649K14k2123o9945J1387L3633L0737J6259
6374b3122K1110o066l3321L2757l1109l6129j5686L562Q4091l8572n7201J35895
6362C6209P2511p3305l7260P783L460k6028J7620r18m7450M2876K236l5294M040
6349c3520K9926N3133o4287j6822M147k8265n9252M7285O5703J8755J9327j5362
6337B0768K4585O4161q5744J303m209L2939M4K7629K2976L7604J026q8740l7862
6324A6480J9746p383o7748l4654R7504L3182j4029k4208m4718K2957N84l5103
6312c7390l5273M114J594K9714N025M0300N161k0600l4667l4320m9873l043N5710
$$ plain form
6398 90867 41823 -58020 -78302 -1437 47076 228 31654 54237 56695 20335 30139 35843
6386 35843 -24489 -35165 -98527 -116933 -23284 -23070 -45193 -115138 -103751 -70118 -39381 -23122
6374 -23122 -2012 -8078 -41399 -8642 -39751 -75880 -91566 -88004 -3913 -42485 -99686 36209
6362 36209 108720 35415 -1845 5938 9398 -16630 990 72 -47378 -4502 -2266 -37560 -33520
6349 -33520 -3594 49539 -14748 -31570 -27423 -55688 -114940 -67655 -1952 16803 36130 20768
6337 20768 45353 109514 23770 25073 20864 53803 53847 81476 104452 142056 143082 54342 16480
6324 16480 36226 28843 -38905 -73559 23945 57127 43098 18890 -25828 -2871 -2287 -37390
6312 -37390 -72663 -68549 -66955 -37241 -32216 8084 13245 -7355 -42022 -76342 -126215 -129258 -73548
6299g3548J43139L2560p1106L557m1964o1050L792K6750M1424L1614j9955j4719
6287D94m6257l2640J1894M2664L3595L1325K1775K4671J6074m8739m4140n2642
6275d1926P609j8337J383J7852j1476j297k0536L208N7747k033j5042m9673q1055
6262a53576m147P1422r88j060J1192n6457j2313N7337L8474N4723N934M7936J2333
6249G0810P371R764q4986l9728O642N1300O6165k8956p2512o1015N530R923l6701
6236i6393M2947J09763M603q6322m0194L6701n1644N6012N3219L0515P1225k6813
6224A03619j35650o2952N2674M8876k3708k5790j1018M1843N4274k9656j2120
6213C92N5910J4691n1755K6036K0627j474P3085k3930m5396l4443p7314l8436
$$ plain form
6299 -73548 69591 102151 31045 34602 -7362 -68412 -64620 -37870 3554 35168 15213 494
6287 494 -45763 -78403 -66509 -23845 9750 41075 62850 87521 103595 54856 10716 -41926
6275 -41926 -34317 -52654 -51271 -33419 -44895 -46192 -66728 -63520 -5773 -7806 -22848 -72521 -153576
6262 -153576 -157723 -86301 -87289 -88349 -77157 -133614 -145927 -88590 -50116 4607 10541 58477 70810
6249 70810 78181 87945 2959 -36769 -30127 21173 87338 58382 -14130 -75145 -69615 -59692 -96393
6236 -96393 -53446 56317 60920 -25402 -65596 -28895 -80539 -24527 28692 59207 130432 103619
6224 103619 -32031 -94983 -42309 6567 -17141 -42931 -53949 -12106 42168 12512 392
6213 392 56302 70993 19238 45274 65901 64427 137512 113582 68186 33743 -43571 -82007
6201h2007k9876N1139K4582O8538j4233o7009K0456L9811m2659M9940J07650l6446
6189H9886o4873j8193j7048M9356J1283k2596l8128O788J9516k410n4200N1095
6177A0476j8579K8243l036l4951O0267L9766l1506j5447l019n0794O2013O3466
6165A06899J4187q837m9793l5557l4328n0208L546m4530j8655N9976N0434N805
6153a061k4848o0509k672N5838j8202k3257j4587M5792J8887j8179o2842k2581
6141a28221k2994L5377J44435N9557q5126J097P8998m4337n8762k5798N6170L029
6129A3425m5617k2550M4890M2049j9006k0059p9088l2229M0198Q5592m9117r160
6117e0672J9267Q8887K4301o4443q5653J5757N8712k2120k1451L494N2256J6144
$$ plain form
6201 -82007 -111883 -60744 -36162 32376 18143 -48866 -28410 11401 -31258 18682 126332 89886
6189 89886 25013 6820 -10228 39128 50411 27815 -10313 -3525 15991 13581 -40619 10476
6177 10476 -8103 20140 17104 -17847 42420 82186 50680 35233 32214 -18580 43433 106899
6165 106899 121086 112249 62456 26899 -7429 -57637 -54091 -98621 -117276 -57300 -6866 -1061
6153 -1061 -25909 -86418 -89090 -33252 -51454 -74711 -89298 -43506 -24619 -42798 -105640 -128221
6141 -128221 -151215 -115838 28597 88154 3028 4125 83123 38786 -19976 -45774 10396 13425
6129 13425 -32192 -54742 -9852 32197 13191 -6868 -85956 -118185 -77987 7605 -41512 -50672
6117 -50672 -31405 57482 81783 17340 -68313 -52556 6156 -15964 -37415 -33921 18335 34479
6105C4479k7353n4115M9134o6555P413P772j0122M2634L75p7794J7450N3123O5652
6092D2093M8898j104q0628P311J2556j8957n762q229l1677k7446k4426R2848R2172
6079I7649K0670n1192l6446j2397k2332J4946k4460l18l2892J7409L4325K0112
6067B5074L1955l932K4942J0682j4808l3544m2679L7316K9677m5113p188J4929
6055B7311N4111m0791j04016n4291O4231M3897p4510j0401K5669n737n5611L505
6043a26633N9181K7116R103N878L2979M2530l5518o978K7693k2877J8996j5443
6031A6027j29727m7143J20871P0073p755O7086l463n6871j24711j381O9487M0933
6019A3426O2422L5827m1945n4751K048k8085O316k0382j4289j6517J0137O4686
$$ plain form
6105 34479 7126 -46989 2145 -64410 -56997 -49225 -59347 -16713 -16338 -94132 -76682 -23559 42093
6092 42093 90991 89887 9259 16570 29126 10169 4407 -3822 -35499 -62945 -87371 5477 97649
6079 97649 118319 67127 30681 18284 -4048 10898 -13562 -13880 -46772 -29363 4962 25074
6067 25074 57029 53097 78039 88721 73913 40369 -2310 35006 64683 19570 12382 27311
6055 27311 81422 40631 -63385 -117676 -53445 -9548 -84058 -94459 -68790 -74527 -130138 -126633
6043 -126633 -67452 -40336 -31233 -25355 7624 50154 14636 7658 35351 12474 31470 16027
6031 16027 -113700 -160843 -39972 30101 22346 89432 85969 29098 -95613 -96994 -27507 13426
6019 13426 75848 111675 69730 14979 17027 -11058 -4742 -25124 -39413 -55930 -45793 18893
6007A8893K1017K4259l3720j12303k1556j4670K2154N3480J5791J3611k675M7291
5995C1572k9646m0546P8278Q408l5954q4840k2867o85M5820N9981K3881L149o2859
5982b6308q5127k5628J03686J4578J3969J2598O061j5852n7756J1909M101M0289
5970c480N7534m9332r97l4062k2034l611P709J2363K6947K4431J9826Q146k9760
5957A3680N23j6700l5335j4471N4127l5591o2924P5413J13728J5078M3970m5921
5945A05577p4594K0667l8866m5548J1572j6037K4969O576j4212k0785J0195M189
5933b6297J2292L7529N5717O250q8510n3946M5726K621J905O8977k9938o3753
5921c1427k1572M3422K1557l5857l1327l0807j5888M5676L231j301l6686J4490
$$ plain form
6007 18893 39910 64169 30449 -81854 -103410 -118080 -95926 -42446 -26655 -13044 -15719 31572
5995 31572 1926 -38620 39658 48066 12112 -72728 -95595 -96280 -50460 9521 33402 36551 -26308
5982 -26308 -111435 -137063 -33377 -18799 -4830 7768 13829 -2023 -59779 -47870 -43769 -3480
5970 -3480 54054 4722 3725 -30337 -52371 -55982 -48273 -35910 -8963 15468 35294 43440 13680
5957 13680 14203 -2497 -37832 -52303 1824 -33767 -96691 -21278 92450 107528 151498 105577
5945 105577 30983 51650 12784 -32764 -21192 -37229 -12260 -5684 -19896 -40681 -30486 -26297
5933 -26297 -14005 23524 79241 85491 -3019 -56965 -11239 -8618 -6713 62264 32326 -31427
5921 -31427 -52999 -9577 11980 -23877 -55204 -86011 -101899 -56223 -52992 -54293 -90979 -76489
5909g6489j2802J4459k887n1563J0068O7440J30090N3230q5540q2703L4526K1037
5897A8866J497n3574p5287K2896L4913L1200L2648k6608m6977l2326K9661j9811
5885h2902L3862j2040p5767j2102M1738O3027K7187m6013r3967N7126L9879K7964
5873c2008J5849J6685N3668L3399m6425n625l9409k9884J5061P641m1846k0379
5861g3273j2671N919N7121P8076J1214p2516l4316O7638p002q3298M4730P5916
5849E7538L7515q7125n3806k187O8471K1517J8281j04156J2836O9853k3451o3733
5837d8447J3468K3484k379k1831k3215K0077K0905J17167p8598L811M1711p8760
5825a2607n8215q112L4622M9109o580K4843O0522o6346o9229k4168J245N1006
$$ plain form
5909 -76489 -89291 -74832 -77719 -129282 -119214 -51774 78316 131546 46006 -36697 -2171 18866
5897 18866 20363 -33211 -108498 -85602 -50689 -19489 13159 -13449 -60426 -92752 -63091 -82902
5885 -82902 -49040 -61080 -136847 -148949 -107211 -44184 -16997 -63010 -156977 -99851 -59972 -32008
5873 -32008 -16159 526 54194 87593 41168 35543 -3866 -33750 -18689 -11048 -52894 -73273
5861 -73273 -85944 -80025 -22904 55172 66386 -6130 -40446 27192 20190 -63108 -18378 57538
5849 57538 95053 7928 -45878 -48065 20406 41923 60204 -43952 -31116 38737 15286 -48447
5837 -48447 -34979 -11495 -13874 -35705 -58920 -38843 -17938 99229 20631 24442 66153 -12607
5825 -12607 -70822 -78934 -44312 4797 -1783 23060 83582 17236 -51993 -76161 -74916 -23910
5813b3910K3042K5493j4048k8195p5934j8038P6721O4110J2157K6848K3462k4435
5801F7273M3599K2530k4545k1069m1724l3005N3682J2535j3135P86p4888m3796
5789e1757K0489J6755j8944k4541M229N1176K83k3826n0282j5441L8600L8018
5777a5241Q456M6646J322n3938j2052K8392k350k339L3170o896k92n9814r733
5764d4669j0098j4831M1209j7023k9846k1130K6099O2598L2760O898m9725o001
5752b3759N8010Q771l9788n6578k7420N2786P8300J6239J8248j2028o3735l9545
5740c0499N9766j0146K13K5275j7069o9173k4052m0625M9385Q118K6960m3312
5728f5159k0979j8979k4704M3175L3017L2417O0786P0744n4312p800m8428n1085
$$ plain form
5813 -23910 -868 24625 10577 -17618 -93552 -111590 -34869 29241 41398 68246 91708 67273
5801 67273 110872 133402 108857 87788 46064 13059 66741 79276 66141 66927 -7961 -51757
5789 -51757 -31268 -14513 -33457 -57998 -53769 -2593 -2310 -26136 -76418 -91859 -53259 -15241
5777 -15241 -6785 39861 41183 -12755 -24807 3585 1235 -1104 32066 25170 24878 -34936 -44669
5764 -44669 -54767 -69598 -28389 -45412 -75258 -96388 -70289 -7691 25069 31967 -17758 -23759
5752 -23759 34251 43022 3234 -53344 -80764 -27978 50322 66561 84809 72781 9046 -30499
5740 -30499 29267 19121 19334 44609 27540 -41633 -65685 -106310 -56925 -48807 -21847 -65159
5728 -65159 -86138 -105117 -129821 -86646 -53629 -21212 39574 110318 56006 48206 -222 -51307
5716e1307o5503j7112k4677J5602P3053Q9082j1506n4775J8534K3742J7078L9868
5704E2079l37k0378L1631J5195o9510l8710m244M9198J3114K0607j1540J4733
5692E1838l0555m4945j6437M3594O4202j7880l0592o058k6710L2171M5194J0323
5680G4145O689j7883o0570L3819L0157j7473m4250j0804k3655L131j9753k2404
5668f8851J3591Q088o817J2253n3190n9583M9450N0900M3495M2849L4590j4010
5656E2765o3940l1670N9441m8526k4388M9397o9387l8460P6342Q0306N1600L2211
5644A25691k7500q2256P053j1946l3960p038q367p257L7165K4392k8064j4416
5632b6503N3870K403m3245J7496L5404R42o3057n3820N6389K143k3939Q2568K6028
$$ plain form
5716 -51307 -116810 -133922 -158599 -142997 -69944 19138 7632 -47143 -28609 -4867 12211 52079
5704 52079 51742 31364 62995 78190 8680 -30030 -34274 14924 28038 48645 37105 51838
5692 51838 21283 -23662 -40099 3495 67697 49817 19225 13167 -13543 18628 63822 74145
5680 74145 80834 62951 2381 36200 66357 48884 4634 -6170 -29825 -26694 -46447 -68851
5668 -68851 -55260 -47172 -53989 -41736 -94926 -154509 -105059 -54159 -10664 32185 66775 52765
5656 52765 -11175 -42845 16596 -31930 -56318 -6921 -76308 -114768 -38426 41880 93480 125691
5644 125691 98191 15935 22988 11042 -22918 -29956 -38323 -45580 -8415 15977 -12087 -26503
5632 -26503 27367 29770 -13475 4021 39425 40367 -22690 -76510 -20121 -17978 -41917 40651 66679
5619F6679o6854l1156m2194J4417r94N6786Q9818P4131o0408r2202M6312K0786
5607G5121p2585P820K0822J4857n4163P963M8006m4706o471r071n9098K8361K5410
5594a7734K7157L4632m5878q4273O919n92L6200J5150M7624l5486o8291K0859
5582f3713P223K5782Q029P2615q04l753K95J8136O18m373K8053K8007k9551l3184
5568E3380k4733j4666j6862l4123J3609J8639l7005r098l9393N775M6696j3285
5556e1066L3083j13294l0013K8365J5843O9138R171l5867M0715M2254k0231K939
5544h963o4484J6189m8304m9277K8203o384l5566l131O3279J05318M5732J2621
5532E5233r302l2412l133K7099M925l3646n043L1091J8338J3271p9704k8005j3915
$$ plain form
5619 66679 -175 -31331 -73525 -59108 -60102 -3316 86502 160633 100225 8023 54335 75121
5607 75121 2536 10356 31178 46035 -8128 -165 47841 3135 -3336 -12407 -71505 -43144 -17734
5594 -17734 9423 44055 -1823 -86096 -79177 -79769 -43569 -28419 19205 -16281 -84572 -63713
5582 -63713 -56490 -30708 -22679 49936 49132 45379 45674 63810 64428 60055 88108 116115 86564 53380
5568 53380 28647 13981 -2881 -37004 -23395 -4756 -41761 -50859 -90252 -84477 -37781 -51066
5556 -51066 -17983 -131277 -161290 -132925 -117082 -47944 -38773 -74640 -33925 8329 -11902 -8963
5544 -8963 -73447 -57258 -105562 -154839 -126636 -133020 -168586 -171717 -108438 -3120 42612 55233
5532 55233 45931 13519 10386 37485 42410 8764 3721 34812 53150 66421 -13283 -41288 -55203
5519e5203l8631n5838J2996N4425M0170N1207m4347q3O2937l9213j5602k4639
5507e1821l5184o062N3041M8394m2906l8239O7084N2825j1950Q684J8827m1364
5495B1329p2933m6891J07422R3647j5813j16458q9759J6423K942l407O0794Q0637
5483C7933K0226j3438j3810M4338o716n955M47q576J6742J724l674Q425m5742
5470C1924k4621R447p893J1216j1514j775o4122j078L0723J8087N872P3766l8730
5457C1302n3824k2185K2205K4148M1061l018o3454P532j7376L7360O761P77k6377
5444a5088m5184K2715q183N205k5311n0122k5952o062R876R2894P1434k5786p9538
5431g9102Q05L7617O6059J6701j5484M96K1666J5609k9205r485m3379J8735mO4375
$$ plain form
5519 -55203 -93834 -149672 -136676 -82251 -42081 9126 -35221 -35304 27633 -11580 -27182 -51821
5507 -51821 -87005 -93067 -40026 8368 -34538 -72777 -5693 47132 35182 43866 62693 21329
5495 21329 -51604 -98495 8927 102574 86761 -29697 -119456 -103033 -100091 -103498 -42704 37933
5483 37933 58159 44721 30911 75249 68533 62578 63025 54449 71191 72915 69241 77666 31924
5470 31924 7303 16750 8857 20073 8559 6784 -57338 -58416 -27693 -9606 -3734 70032 31302
5457 31302 -22522 -44707 -22502 1646 42707 39689 -23765 -16233 -33609 3751 10512 11289 -15088
5444 -15088 -60272 -37557 -45740 -40535 -65846 -115968 -141920 -147982 -138106 -45212 26222 436 -79102
5431 -79102 -78297 -40680 25379 42080 26596 27092 48758 64367 35162 25677 -17702 1033 1029 65404
5417F5404L5749l4807n7516k8979J6150p1351k6346J3962O6209K4618L5465n2572
5405a4014l2255P905P6702P968J9743L852J5034j2831K89M8597k5331k0586k0205
5392E4868M3274K0236k2459m2165j8208N2279m0665o0944n7428m5228m745K8350
5380i2835N1308P012L4029p7749k1763M0738J079p4257p4240L8502J13351k670
5368e7495K0662m714K4092J6723k0893j5638J7833R1117P0363m1350j8056J1900
5356I4544l3017o3476n0987k5813j4457J3725L078j4523j6208n0989k0073P2524
5344a05672O1353K8526J5523j0834m897K8735O3524M601j0400p917M260n5268
5332A1534j5425l578m7876J924j0754J5393m469L7983L7849l5345l6139N0564
$$ plain form
5417 65404 101153 66346 8830 -20149 -3999 -75350 -101696 -87734 -21525 3093 38558 -14014
5405 -14014 -46269 -38364 38338 46306 66049 69901 84935 72104 72393 120990 95659 75073 54868
5392 54868 98142 118378 95919 53754 35546 87825 47160 -13784 -71212 -116440 -121185 -92835
5380 -92835 -41527 -34515 -486 -78235 -99998 -59260 -58181 -132438 -206678 -168176 -54825 -57495
5368 -57495 -36833 -41547 -17455 -732 -21625 -37263 -19430 71687 142050 100700 82644 94544
5356 94544 61527 -1949 -52936 -78749 -93206 -79481 -76403 -90926 -107134 -158123 -178196 -105672
5344 -105672 -44319 -15793 -270 -11104 -16001 12734 76258 80859 70459 62542 66802 11534
5332 11534 -3891 -7469 -55345 -53421 -64175 -48782 -53251 -15268 22581 -12764 -48903 1661
5320A661N0029j5743m31P209J3245p1546m1449k5883j2741K3410K1083l1360l8793
5307a21309j9466n6875N5006R6862m4123p6120J3904k471O5529P3387m369j3482
5295c3527p0343Q324R1293J05104n4257l2502r763k2684l605j5134J3221K7623
5283C750J9582J4675J1980M6531K2244j1911j3465l7801K288J1158l3091j781
5271C4159l7837j6544L2130J9392q714O4416L9850l8516j09167n4131P658P5260
5259G956P3717j0100N032P714m2660q5537L8626L4496j874J1186P1980o531o4078
5246C9927o3024J1218P5228K8913K864o3812q8131J235J05888K2613p1818j9061
5234a7960M7667o5930j8298M1905J14623M5804K4379q5118q0549j8177k7273k8534
$$ plain form
5320 1661 51690 35947 35516 42725 55970 -15576 -57025 -82908 -95649 -72239 -51156 -82516 -121309
5307 -121309 -140775 -197650 -142644 -45782 -89905 -166025 -152121 -154592 -89063 -15676 -20045 -33527
5295 -33527 -103870 -95546 -4253 100851 46594 14092 4329 -18355 -21960 -37094 -23873 3750
5283 3750 23332 38007 49987 96518 118762 106851 93386 55585 57873 69031 35940 34159
5271 34159 -3678 -20222 11908 31300 22586 87002 126852 88336 -20831 -74962 -67304 7956
5259 7956 81673 71573 76605 84319 41659 -43878 -5252 29244 27370 38556 110536 104005 39927
5246 39927 -23097 -11879 63349 92262 95126 31314 -56817 -55582 50306 72919 1101 -17960
5234 -17960 29707 -36223 -54521 -12616 102007 147811 172190 87072 6523 -11654 -38927 -67461
5222f7461j5886K0035K263J5478L4776j3626j3143M1125k986n0295N2608K8457
5210C1345K1468O4215R964m0560p9848K2732K6051m9407j2024L428l1608k2281
5198e6525j2494J0308O6496M1758p279l5293p6268k0072N7237j9095J3687L7186
5186c54K2466K8364K824O0257m5929j18053j19573m234K6818P98J27385R9267
5174H0036k5625q2140k4121R87O8265l9262l597L425k1957p0454l7400K8197P3443
5161e0203j3836K6444N4697K3742j1981p0648J503M1952r871l2860J2510P855
5149b0696j2879m9502q7801n012K4549O2144L2420o750R0733Q3477k2782p666
5137H0235j04347l3724J7852J3437j1228R480L5723k415O66K8960j1060o1087
$$ plain form
5222 -67461 -83347 -63312 -61049 -45571 -10795 -24421 -37564 3561 575 -49720 2888 31345
5210 31345 52813 117028 126992 86432 6584 29316 55367 5960 -6064 -2636 -34244 -56525
5198 -56525 -69019 -58711 7785 49543 42264 6971 -69297 -89369 -32132 -51227 -37540 -354
5186 -354 22112 50476 53300 113557 67628 -50425 -169998 -174232 -147414 -146616 -19231 80036
5174 80036 54411 -27729 -51850 -50863 17402 -21860 -25457 -22032 -43989 -114443 -151843 -123646 -50203
5161 -50203 -64039 -37595 17102 40844 28863 -41785 -40282 1670 -8201 -41061 -28551 -20696
5149 -20696 -33575 -83077 -170878 -175890 -151341 -89197 -56777 -63527 27206 110683 87901 80235
5137 80235 -24112 -57836 -39984 -26547 -37775 -28295 7428 5013 5679 34639 23579 -37508
$$ [...]
##END NTUPLES=NMR SPECTRUM
##END=
