##TITLE=Analysis number 313850
Compound Code spb 03031
Book Reference 441/151/3
Project Code adrs
Chemist Name colinb
##JCAMPDX= 6.0         $$ Bruker NMR JCAMP-DX V2.0
##DATA TYPE= NMR SPECTRUM
##DATA CLASS= NTUPLES
##ORIGIN= Bruker BioSpin GmbH
##OWNER= NMR
$$ XWIN-NMR		Version 3.5
$$ Fri Sep 23 12:18:45 2005 GMT Daylight Time (UT+1h)  MAYBRIDGE\NMR@NMR_250MHZ
##.OBSERVE FREQUENCY= 250.131544655141
##.OBSERVE NUCLEUS= ^1H
##.ACQUISITION MODE= SIMULTANEOUS (DQD)
##.ACQUISITION SCHEME= undefined
##.AVERAGES= 16
##.DIGITISER RES= 18
##SPECTROMETER/DATA SYSTEM= dpx250
##.PULSE SEQUENCE= zg30
##.SOLVENT NAME= DMSO
##.SHIFT REFERENCE= (INTERNAL, DMSO, 0, 16.522)
##AUDIT TRAIL= $$ (NUMBER, WHEN, WHO, WHERE, WHAT)
$$ ##TITLE= Audit trail, XWIN-NMR		Version 3.5
$$ ##JCAMPDX= 5.01
$$ ##ORIGIN= Bruker BioSpin GmbH
$$ ##OWNER= NMR
$$ C:\u/data/dgb/nmr/ADRS/9900/pdata/1/auditp.txt
$$ ##AUDIT TRAIL=  $$ (NUMBER, WHEN, WHO, WHERE, WHAT)
(   1,<2005-09-23 12:18:15.61 +100>,<MAYBRIDGE\NMR>,<NMR_250MHZ>,
      <created by zg, POWCHK disabled, PULCHK disabled
       configuration hash MD5:
       62 19 C7 07 E1 42 D1 B7 37 6C 3D D0 77 39 F9 E6
       data hash MD5: 64K
       FA F7 54 62 73 8B AD 70 E3 7C B8 24 5B 43 3B BA>)
(   2,<2005-09-23 12:18:34.13 +100>,<MAYBRIDGE\NMR>,<NMR_250MHZ>,
      <Start of raw data processing
       ef LB = 0.3 FT_mod = 6 PKNL = 1 SI = 32K 
       data hash MD5: 32K
       D5 E2 4E 08 01 00 31 C5 80 F1 C9 BE 5B C7 47 5D>)
(   3,<2005-09-23 12:18:36.14 +100>,<MAYBRIDGE\NMR>,<NMR_250MHZ>,
      <apk 
       data hash MD5: 32K
       07 DB 7D 71 83 28 18 90 FB 08 8D C1 31 B7 90 58>)
(   4,<2005-09-23 12:18:36.88 +100>,<MAYBRIDGE\NMR>,<NMR_250MHZ>,
      <abs ABSG = 5 
       data hash MD5: 32K
       4F C0 1B AA 99 0E 91 F2 86 73 0D 8D 4A 1D 78 7D>)
$$ ##END=
$$ 
$$ hash MD5
$$ B7 88 F2 41 5C 0C 44 8A B9 2E F8 74 6A 99 CF 19
##$RELAX= 
##$RELAX= 
##$RELAX= 
##$RELAX= 
##$RELAX= 
##$RELAX= 
##$RELAX= 
$$ Bruker specific parameters
$$ --------------------------
##$DU= <C:\u>
##$EXPNO= 9900
##$NAME= <ADRS>
##$PROCNO= 1
##$TYPE= <nmr>
##$USER= <dgb>
##$AMP= (0..31)
100 100 100 100 100 100 100 100 100 100 100 100 100 100 100 100 100 100 
100 100 100 100 100 100 100 100 100 100 100 100 100 100 
##$AQSEQ= 0
##$AQ_mod= 3
##$AUNM= <au_zg>
##$AUTOPOS= <23 >
##$BF1= 250.13
##$BF2= 250.13
##$BF3= 250.13
##$BF4= 250.13
##$BF5= 500.13
##$BF6= 500.13
##$BF7= 500.13
##$BF8= 500.13
##$BYTORDA= 1
##$CFDGTYP= 0
##$CFRGTYP= 5
##$CHEMSTR= <none>
##$CNST= (0..31)
1 1 145 1 1 1 1 1 1 1 1 1 1 1 1 1 1 1 1 1 1 1 1 1 1 1 1 1 1 1 1 1 
##$CPDPRG= <>
##$CPDPRG1= <>
##$CPDPRG2= <>
##$CPDPRG3= <>
##$CPDPRG4= <mlev>
##$CPDPRG5= <mlev>
##$CPDPRG6= <mlev>
##$CPDPRG7= <mlev>
##$CPDPRG8= <mlev>
##$CPDPRGB= <>
##$CPDPRGT= <>
##$D= (0..31)
0 1 0 0 0 0 0 0 0 0.06 0 0 0 0 0 0 0.0002 0 0 0 0 0 0 0 0 0 0 0 0 0 0 
0 
##$DATE= 1127474294
##$DBL= (0..7)
120 120 120 120 120 120 120 120 
##$DBP= (0..7)
150 150 150 150 150 150 150 150 
##$DBP07= 0
##$DBPNAM0= <>
##$DBPNAM1= <>
$$ [...]
##$SUBNAM7= <"">
##$SUBNAM8= <"">
##$SUBNAM9= <"">
##$SW= 20.6930455092707
##$SWIBOX= (0..15)
0 0 3 0 0 0 0 0 0 0 0 0 0 0 0 0 
##$SW_h= 5175.983436853
##$TD= 65536
##$TD0= 1
##$TE= 295.16
##$TE2= 300
##$TE3= 300
##$TEG= 300
##$TL= (0..7)
0 120 120 120 120 120 120 120 
##$TP= (0..7)
150 150 150 150 150 150 150 150 
##$TP07= 0
##$TPNAME0= <>
##$TPNAME1= <>
##$TPNAME2= <>
##$TPNAME3= <>
##$TPNAME4= <>
##$TPNAME5= <>
##$TPNAME6= <>
##$TPNAME7= <>
##$TPOAL= (0..7)
0.5 0.5 0.5 0.5 0.5 0.5 0.5 0.5 
##$TPOFFS= (0..7)
0 0 0 0 0 0 0 0 
##$TUNHIN= 0
##$TUNHOUT= 0
##$TUNXOUT= 0
##$USERA1= <user>
##$USERA2= <user>
##$USERA3= <user>
##$USERA4= <user>
##$USERA5= <user>
##$V9= 5
##$VALIST= <valist>
##$VCLIST= <CCCCCCCCCCCCCCC>
##$VD= 0
##$VDLIST= <DDDDDDDDDDDDDDD>
##$VPLIST= <PPPPPPPPPPPPPPP>
##$VTLIST= <TTTTTTTTTTTTTTT>
##$WBST= 1024
##$WBSW= 4
##$XGAIN= (0..3)
0 0 0 0 
##$XL= 0
##$YL= 0
##$YMAX_a= 477944
##$YMIN_a= -504911
##$ZGOPTNS= <>
##$ZL1= 120
##$ZL2= 120
##$ZL3= 120
##$ZL4= 120
##$ABSF1= 16.522
##$ABSF2= -4.171173
##$ABSG= 5
##$ABSL= 3
##$ALPHA= 0
##$AQORDER= 0
##$ASSFAC= 0
##$ASSFACI= 0
##$ASSFACX= 0
##$ASSWID= 0
##$AUNMP= <proc_1d>
##$AZFE= 0.1
##$AZFW= 0.1
##$BCFW= 0
##$BC_mod= 0
##$BYTORDP= 0
##$COROFFS= 0
##$CY= 12.5
##$DATMOD= 1
##$DC= 0
##$DFILT= <>
##$DTYPP= 0
##$F1P= 14.0000005364418
##$F2P= -0.99999901652339
##$FCOR= 0.5
##$FTSIZE= 32768
##$FT_mod= 6
##$GAMMA= 0
##$GB= 0
##$INTBC= 1
##$INTSCL= 1
##$ISEN= 128
##$LB= 0.3
##$LEV0= 0
##$LPBIN= 0
##$MAXI= 10000
##$MC2= 0
##$MEAN= 0
##$ME_mod= 0
##$MI= 0
##$NCOEF= 0
##$NC_proc= -2
##$NLEV= 6
##$NOISF1= 0
##$NOISF2= 0
##$NSP= 0
##$NTH_PI= 0
##$NZP= 0
##$OFFSET= 16.522
##$PC= 1
##$PHC0= -89.07922
##$PHC1= 5.902568
##$PH_mod= 1
##$PKNL= yes
##$PPARMOD= 0
##$PSCAL= 4
##$PSIGN= 0
##$REVERSE= no
##$SF= 250.13
##$SI= 32768
##$SIGF1= 0
##$SIGF2= 0
##$SINO= 400
##$SIOLD= 32768
##$SREGLST= <1H.DMSO>
##$SSB= 0
##$STSI= 32768
##$STSR= 0
##$SW_p= 5175.98343685301
##$SYMM= 0
##$S_DEV= 0
##$TDeff= 65536
##$TDoff= 0
##$TI= <Analysis number 999999
Compound Code 99
Book Reference 9
Project Code 9>
##$TILT= no
##$TM1= 0
##$TM2= 0
##$TOPLEV= 0
##$USERP1= <user>
##$USERP2= <user>
##$USERP3= <user>
##$USERP4= <user>
##$USERP5= <user>
##$WDW= 1
##$XDIM= 32768
##$YMAX_p= 436647481
##$YMIN_p= -624511
$$ End of Bruker specific parameters
$$ ---------------------------------
##NTUPLES= NMR SPECTRUM
##VAR_NAME=  FREQUENCY,     SPECTRUM/REAL,   SPECTRUM/IMAG
##SYMBOL=    X,             R,               I
##VAR_TYPE=  INDEPENDENT,   DEPENDENT,       DEPENDENT
##VAR_FORM=  AFFN,          ASDF,            ASDF
##VAR_DIM=   32768,         32768,           32768
##UNITS=     HZ,            ARBITRARY UNITS, ARBITRARY UNITS
##FACTOR=    0.157963299565203, 1,           1
##FIRST=     4132.6476996994, 0,             0
##LAST=      -1043.33573715361, 0,           0
##MIN=       -1043.33573715361, -624511,     0
##MAX=       4132.6476996994, 436647481,     0
$$ Real data points
##PAGE= N=1
##DATA TABLE= (X++(R..R)), XYDATA
$$ [...]
15278A5122n428L001l118K654j2708j868P772R309L360q131n179R89l689M527
15264F613J200o952l961j650o972P600R145N762L935q86l149m626N686O924K578
15249B1247L497l803q222l602n457p946O179L213M028J577o125j899J573J0405
15235A4665P365m137O001J824q40K424J59j1218j275R913M69j5668J350M307o19
15220A4720n766Q27L046O316L072p95k489j435k374j748M923m18N80K153k098
15205A8514N048n333J168K0042P42n008M422k344n467q555l911m723k571O380
15191A8404m837r43N394Q387L820M483j0978j7921m769p6Q057M078K048N987L135
15176B4269o556O41L048Q854J933J853J860n984l287N456P963o524j0132l186
$$ y = [15122, 9694, 12695, 9577, 12231, -477, -2345, 5427, 14736, 18096, 9965, 4786, 5775, 2086, 6613, 7813, 861, -3100, -4750, -11722, -4122, 5023, 10785, 14720, 13834, 10685, 6059, 11745, 18669, 21247, 24744, 20941, 12719, 9117, 3660, -4286, 1893, 5106, 9134, 10711, 4586, 2687, 4260, 14665, 22030, 17893, 23894, 25718, 24878, 27302, 27461, 16243, 14968, 24881, 25350, 9682, 11032, 15339, 14720, 8954, 9781, 12827, 19143, 22215, 21420, 18931, 17496, 15122, 13374, 18297, 17879, 18459, 20612, 18514, 23562, 18229, 19397, 39439, 40181, 35173, 39595, 37251, 31784, 23229, 19318, 14595, 12024, 18404, 13567, 12624, 18018, 26405, 30225, 34708, 23730, 5809, 1040, 964, 9021, 13099, 15147, 21134, 24269, 17713, 18354, 21402, 30256, 32189, 34042, 35902, 29918, 26631, 32087, 40050, 33526, 23394, 20208]
15162B0208K424N043R633N748k241r303K507N179N843O842M959N058p199N177
15148E9878J6605J1718R355J2223J1444M718P377J2002J1798J7899J4033O822
15136A95872M829M59o772l612j7815j4540p466n312j3113j3885j1550j8925j4319
15123G3851j1254n428m458j876n662m652r43J537k972M90o82j0598p879j242O067
15108B4299J0839P333j030m412l611l460k965q86k746l396L542Q907j822m951
15094B5641o341J249p99l172J6336K380o741o154j209o292N385P566K753J710
15080C2312j0260p439R73r042k952J721k616O053K145n003n343q933M716j265
15066d933p192N630J0180J044J897K731p592q867O070J0398l239n464K762J1648
$$ y = [20208, 22632, 27675, 37308, 43056, 40815, 31512, 34019, 39198, 45041, 51883, 56842, 61900, 54701, 59878, 76483, 88201, 97556, 109779, 121223, 125941, 133318, 145320, 157118, 175017, 189050, 195872, 200701, 201160, 194388, 190776, 172961, 158421, 150955, 145643, 132530, 118645, 107095, 88170, 73851, 62597, 57169, 52711, 50835, 45173, 40521, 39578, 41115, 38143, 38633, 37951, 27353, 19474, 18232, 24299, 35138, 42471, 41441, 37029, 33418, 29958, 26993, 26107, 23361, 19965, 23507, 32414, 30592, 25641, 19300, 20549, 19750, 16578, 32914, 35294, 28553, 22399, 21190, 14898, 20283, 27849, 30602, 32312, 22052, 14613, 15586, 6544, 3592, 5313, 2697, 8750, 10895, 5892, 549, -8384, -3668, -4933, -12125, -6495, 3685, 4729, 6626, 9357, 1765, -7102, -1032, 9366, 6127, 663, 3425, 15073]
15052A5073J2112Q798P57q350j2732j0504J8J1416K764o980p558M007j832K879
15038I868J0374P508p002o776q458n265J595Q117M275J892k344R48J3753K400
15024C0885o192j0350p160l901J852n547o33o70m465M051Q627K083O06J826M687
15009A5699m745q989K4R76J2278P10n605M33L103o39N835n441O559Q0m793K320
14993A7805J79j445n16k611j1844j0718P944J2134J614p4M819j1787r993m456
14979h949Q432J303L155J3620J495l063j008R98L13K580l851o919J85M905R54
14964A4150m061n419l740K35M910M983n811l741k852Q43J169k306K078M568j879
14949C127k701m204k217l288P381O921o963m954N982n1M213J284L682M91l251
$$ y = [15073, 27185, 35983, 36740, 28390, 15658, 5154, 5172, 16588, 19352, 12372, 4814, 8821, 6989, 9868, 20242, 27750, 20748, 13972, 5514, 249, 1844, 9961, 14236, 16128, 13784, 14732, 28485, 30885, 24693, 14343, 7183, 3282, 5134, -413, -1046, -1716, -6181, -2130, 6497, 8580, 9186, 11012, 15699, 10954, 1965, 1989, 2965, 15243, 15953, 10348, 10781, 13884, 13245, 19080, 13639, 20198, 20278, 15485, 17805, 17984, 16539, 16023, 13412, 1568, -9150, -1206, 10928, 12542, 12468, 17287, 5500, -4493, -8949, -517, 786, 3941, 17561, 19056, 15993, 14985, 15983, 16296, 18876, 15025, 8106, 8291, 13196, 14150, 10089, 4670, 930, 1165, 6075, 11058, 5247, 1506, -1346, -503, 666, -1640, 438, 5006, 3127, 426, -3778, -5995, -9283, -1902, 5019, -1944, -6898, -916, -967, 3246, 4530, 8212, 8703, 5452]
14934E452n114p173K023K957K184J1297m953j1496j979j177J1015R475p692o696
14920a877M854L571K007J340L461J418Q803j0851j1890l417M828R945m333p274
14906E85P98m631j369M588L066Q815j044k722j4484r855J4723J0475N555J582
14892A6082p681l521N400l791p492O98J1346q712q03Q112j824l887J158j870L267
14877F482K060L676q95N230N564p680j0959n15J271N127J288n869n513m003L145
14862a591L014o811o359N089M255R337m963L04R307q21n779L912M285k805m748
14847E626k675N444q123l644M980R173O211o848l128J370o299m295l320m554M988
14832e094j013M622J2291M870r034j7556K227Q084l809P071l512J860l035j503
$$ y = [5452, 338, -6835, -4812, -1855, 329, 11626, 6673, -4823, -6802, -7979, 3036, 12511, 4819, -1877, 2977, 6548, 8555, 9895, 13356, 14774, 23577, 12726, 836, -2581, 2247, 12192, 7859, 585, 1383, -3248, -4617, -29, 3037, 11852, 10808, 8086, -6398, -16253, -1530, 8945, 14500, 16082, 8401, 4880, 10280, 6489, -1003, -305, 11041, 2329, 1526, 9638, 7814, 3927, 5085, 3215, 6482, 8542, 12218, 11323, 16553, 22117, 14437, 3478, 2963, 4234, 9361, 10649, 4780, -733, -4736, -1591, 1423, -5388, -11747, -6658, -2403, 6934, 1971, 2275, 11582, 10761, 4982, 8894, 13179, 10374, 5626, 2951, 8395, 272, -3372, 1608, 10781, 16992, 10144, 7016, 8386, 2087, -2208, -5528, -10082, -5094, -6107, -1485, 10806, 15676, 6642, -10914, -8687, -603, -4412, 2659, -853, 1007, -2028, -3531]
14818c531M902J790M754L195o512n963M727L661K854l508p240j5357o931K462
14804b0697J1815n4j644J1309J143M370R256R07K533j1781q052l599n474r631
14790a9599N852R534J0545M160n869l322J793L939M474N722o485k188l075p247
14776a766M311l23L74l935M023k846k23N42O92L897n710K951J729k892J792J318
14760C934Q094l838n249l560j0818J787O616R630N221j562o272m199M898N704
14746A0386n330J0332O595l038o596o039j765L160K312L33j488j938L390j993
14732H321k18m669j2527k730m708O409K142P632m14L633m00k402q447K485K875
14717c018P68n783L292R907K27o778K983j201J531P122L971N450r872o595j616
$$ y = [-3531, 1371, 3161, 7915, 11110, 4598, -1365, 3362, 7023, 9877, 6369, -871, -16228, -23159, -20697, -8882, -8936, -10580, 729, 1872, 6242, 15498, 16405, 18938, 7157, -895, -4494, -9968, -19599, -13747, -4213, 6332, 10492, 4623, 1301, 3094, 7033, 11507, 17229, 10744, 8556, 5481, -1766, 2545, 2222, 2596, -1339, 2684, -162, -385, 157, 849, 4746, -964, 1987, 3716, 824, 2616, 3934, 12028, 8190, 2941, -619, -11437, -9650, -3034, 6596, 11817, 10255, 3983, -216, 4682, 10386, 5056, 15388, 21983, 18945, 12349, 6310, 4545, 7705, 10017, 10350, 8862, 6924, 10314, 8321, 8103, 3434, -9093, -11823, -16531, -10122, -7980, -348, -762, 2871, 2471, 69, -8378, -5893, -3018, -2250, -8033, -4741, 5166, 5393, -1385, 1598, 397, 1928, 9050, 13021, 18471, 8599, 2004, 388]
14702C88j111L048K562J2820K760j5008j1195P72j520K29m115M673o89O86M468
14687a232n11P42o416R92o165J527K098j38Q581QN098P783k179k487k538l046
14671B117M828O33l96n068j104k679R16M473L514M778J955q262n197L444r10J124
14655D166k462k674K24l159P426L604R56j072m945o416j2780k351L114J1720O667
14640B018N448l893j778N868O431r119k452p715j491k005N403J904J609K963M460
14625G651M403j0908j664l61L359J361K03l631k836r830o345N951J1393j515O180
14610C411J83p041j233j975k467L344L578p848j1541M006M620Q104N750n026l56
14595d491n496QK633o943p035J630J3554L262l323O266K697J0549Q715j2902n823
$$ y = [388, -723, 2325, 4887, 17707, 20467, 5459, -5736, -4964, -6484, -6255, -10370, -5697, -6386, -5700, -1232, -1743, -1001, -7417, -6425, -12590, -11063, -8965, -9103, -522, -514, 4584, 12367, 10188, 7701, 5163, 2117, 6945, 7578, 7182, 2114, 1010, -1669, -753, 3720, 7234, 12012, 13967, 5705, 508, 3952, 3042, 4166, 1704, -970, -746, -3905, 3521, 7125, 8081, 7009, 2064, -4352, -17132, -19483, -16369, -4649, 2018, 7466, 3573, 1795, 7663, 14094, 4975, 2523, -5192, -6683, -8688, -3285, -1381, 228, 3191, 7651, 12054, 1146, -518, -879, 2480, 3841, 4044, 413, -2423, -12253, -18598, -12647, -1254, -2769, 3411, 3594, -3447, -4680, -6655, -9122, -5778, -2200, -10048, -21589, -17583, -12963, -4859, 891, -4135, -4491, -9987, -9979, -7346, -14289, -21324, -19694, -6140, -2878, -6201, 65, 2762, 13311, 22026, 9124, 3301]
14580C301J663K742m681K531k607n451p40l369l862K307Q675J119o293O974M140
14565F449M509M791M472q160K480M79r224q503L563L887K801p286O815o458l614
14550b999O473k120k365L131n63Q14K408J257P278j250j0252N654p17q23P343
14535A3269j1427n142O354M344l29l290M008j673n78R882q048m043j2165R12J4516
14520F590l238m78q25J441j637k869p483J29K671O732J940j938m04K68l800K073
14504h28L490R51P797R247o448j941l4r148p364L418N922j25k394J607J501j37
14488E514j260L591J2936r279j2237m04N667n751j545J0407k675n556L890M662
14474G960j082n754l155o172J1700Q224j44p672L993K587j896q65j7446R9J0324
$$ y = [3301, 4964, 7706, 3025, 5556, 2949, -2502, -3242, -6611, -10473, -8166, 509, 1628, -4665, 2309, 6449, 10958, 15749, 20221, 12061, 14541, 15020, 5796, -2707, 856, 4743, 7544, 258, 7073, 615, -2999, 3474, 1354, -1011, 2120, 1557, 2371, 4779, 6036, 13314, 12064, 1812, 7466, 6749, 5926, 13269, 1842, -3300, 3054, 7398, 7069, 3779, 7787, 6114, 5536, 15418, 7370, 3327, -8838, -7926, 6590, 3352, 2874, 2049, 3490, 1853, -1016, -8499, -8370, -5699, 1033, 2973, 1035, 631, 899, -2901, -828, 2662, 3613, 11410, 20657, 14209, 12268, 12234, 3086, -4278, -860, 5062, 4937, 2543, 4150, 5651, 5514, 4254, 7845, 20781, 11502, -735, -1139, 4528, -1223, -2768, 7639, 4964, -592, 3298, 7960, 6878, 1124, -2031, -8203, 3497, 11721, 11577, 3905, 7898, 10485, 8589, 7724, -9722, -9623, 701]
14459G01K551p808m148J0785j942n673p017j102N027N228M615n61q260l501k121
14444a3226R045J4227j957l953j673n41k666m505P818J175o797j2049l127Q709
14430i520l932p283K715L629R33N146O699k803J723R91m288L773K757J378p799
14415e881o670J443J1172J0201K594j2773n811r50l884m088j030Q952K667K708
14401a350k536o633k481L683P257j791o771O238M261j593j904o82m136j047R156
14386c29j994l161O40L614K006Q610j640K521L843r159j2451r793r11N116R29
14371a2159n244N288P743P02l299K137J434L201J604n648l443K928K391j090m149
14356g604J630N337j601m092J327J1719m579q871o877Q74k835l457J0603P533
$$ y = [701, 3252, -4556, -8704, 2081, 139, -5534, -12551, -13653, -8626, -3398, 1217, 656, -7604, -11105, -13226, -4181, 10046, 8089, 4136, 2463, 1922, -744, -5249, 2569, 3744, -3053, -15102, -18229, -9520, -13452, -20735, -18020, -14391, -13458, -8312, -1613, -4416, -2693, -1702, -5990, -2217, 540, 1918, -5881, -12551, -11108, 64, 10265, 12859, 86, -5725, -6675, -10559, -14647, -15677, -6725, -4058, -1350, -3886, -10519, -13000, -9317, -2060, -3851, -10622, -4384, -123, -1716, -3620, -4302, -8438, -9485, -329, -2323, -5484, -4844, -1230, 776, 9386, 7746, 10267, 14110, 4951, -7500, -17293, -18204, -13088, -12159, -17403, -12115, -4372, -3670, -6969, -4832, -3398, -197, 1407, -4241, -7684, -4756, -2365, -3455, -7604, -5974, -637, -2238, -6330, -5003, 6716, 2137, -6734, -13611, -12737, -15572, -19029, -8426, -893]
14342h93N845l170j0512J2967O532n969n598Q56J984J669k655k289M685M178k812
14327D818K348l797q293J5421O499l799m137K995n528J32l701L877J3313q46n952
14312A3350j800k433n986k262o770r521n8j251P45l458L61R702J153J348M623
14297b257M55j84M518J630m593j0501j831O106M36p662m803k130J0959R715J0355
14282A0213m997r658j739Q610N886q56N026L572n640k180l294q608l017Q96k17
14267f003N169L40p181N651N282K342j584o642j13M339K665Q517J3335n288m810
14252A6019O251n728j4530j3884n23R787k548o972Q606N883l487m098q68R55k944
14237h081j336o887L505L051J1052L019l565j344M392k896N205M451m161j794
$$ y = [-893, 4952, 1782, -8730, 4237, 10769, 4800, -798, 58, 2042, 3711, 1056, -1233, 3452, 7630, 4818, 7166, 3369, -4924, 10497, 16996, 13197, 9060, 12055, 6527, 6659, 2958, 6835, 20148, 19302, 13350, 11550, 9117, 3131, 869, -5901, -15422, -15480, -16731, -15986, -19444, -19083, -9381, -8228, -6880, -2257, -1802, -1986, 2532, 4162, -431, -10932, -12763, -6657, -6221, -13883, -18686, -20816, -9857, -142, 10213, 5216, -4442, -6181, 2429, 8315, 7459, 12485, 16057, 10417, 8237, 4943, -3665, -6682, -5786, -6003, -834, -494, -7675, -2024, 3258, 5600, 4016, -2626, -2739, 1600, 4265, 12782, 26117, 20829, 16019, 22270, 16542, 2012, -11872, -12395, -2608, -5156, -12128, -3522, 2361, -1126, -5224, -6092, -5137, -8081, -9417, -16304, -12799, -9748, 1304, 4323, 758, -586, 3806, 910, 6115, 10566, 6405, 4611]
14223D611r622J366M303j417P30j3355N550K741j616o409k821M424J6816o17O16
14208E300o755J3797O964r572j3004l9M050J094j706J092j1589O232J0990K489
14194I343N83j2795m690J2704J2961M999N00j1280o125o714p412p750k643k268
14180b0587N022N193M043O533J340k050o805p44o610J383l455k066R904P993Q006
14165G100j0J185l795j297j976m974k722l817K733J1237P3j2084n821K071N676
14150f421J85P457Q15Q73k348J616J0082M370j517J755K770r493j661J762l770
14135F475p531n993J877N884K361J680l309J599m00L773M436l833p948O301K157
14120G529n032k997l979N98M177J2646K456j0098q91m826K690O513m779O93O860
$$ y = [4611, -5011, -3645, 658, -759, -29, -13384, -7834, -5093, -6709, -13118, -15939, -11515, 5301, 4684, 5300, -1455, 12342, 19306, 9734, -3270, -3309, 741, 1835, 129, 1221, -10368, -4136, 6854, 9343, 9926, -2869, -7559, 5145, 18106, 23105, 23605, 12325, 6200, -514, -7926, -15676, -18319, -20587, -15565, -10372, -6329, 204, 1544, -506, -7311, -8055, -14665, -13282, -16737, -18803, -8899, -906, 7100, 7090, 8275, 4480, 3183, 1207, -3767, -6489, -10306, -7573, 3664, 3737, -8347, -14168, -12097, -6421, -6236, 1221, 2036, 2909, 561, 2177, 12259, 16629, 15112, 16867, 19637, 10144, 8483, 10245, 6475, -1056, -7049, -5172, 712, 3073, 4753, 1444, 3043, 2643, 6416, 10852, 7019, -929, 5372, 7529, 2497, -500, -4479, -3881, 296, 12942, 15398, 5300, 4409, -417, 2273, 8786, 4007, 4700, 11560]
14105A1560K783r248k603L768j0117L82N116M821k729j0536j269P198N354Q124
14091A2604l859p813n298J842L81k982l503k088k274O172P264j643O611L695l037
14076F072n054L247K351m71k739n950J680P465k839m826P82Q279n377k611K156
14061B165l727n507M01N46K594o770O315k281m374r01P433r15j519M760N309n77
14045B952l887m762o294J437N123J1005q411J158R094j699o395m53k539O23l016
14030f064j246j229j591J216n71L595L576q2J47O132q215j0726R54J1009K183
14015i12j771j591J145N80k092K222J939j796m455K665m98L097k934k816J925
14000e292l352j061k798j910K799k568N53L638O640K355L746J172m30O145K629
$$ y = [11560, 14343, 5095, 2492, 6260, -3857, -3475, 1641, 6462, 3733, -6803, -8072, -874, 4480, 12604, 8745, 932, -4366, -2524, -2143, -5125, -8628, -10716, -12990, -6818, 446, -1197, 5414, 9109, 6072, 1018, 4265, 6616, 6145, 3406, -2544, -864, 6601, 3762, -1064, -282, 7997, 2620, 9, 2165, -1562, -7069, -6668, -6122, -3528, -10298, -3983, -6264, -10638, -11539, -4106, -5021, -6540, -1780, 3529, 2952, -935, -5697, -11991, -10554, -5431, 5574, -2837, -1679, 7415, 5716, -679, -1132, -3671, -3048, -6064, -7310, -8539, -10130, -8914, -9485, -5890, -2314, -2396, -2249, 3883, -4332, -15058, -14104, -3095, -912, -2683, -4274, -3129, -2549, -4641, -2419, -480, -2276, -6731, -4066, -4564, -1467, -4401, -7217, -5292, -8644, -9705, -12503, -14413, -11614, -14182, -13629, -9991, -3351, -996, 2750, 3922, 3492, 9637, 12266]
13985A2266r959m338m556n227j0291Q099J8217J5132L781k739k866k681j932j099
13971A1807J560q02K24k588o773O421L691k440o742k538j013j728K729J061L418
13956F287J158m041r830j116Q344M756q743j0471k410n0l747N710N921j554N161
13941d625P877m104k345M468q610J103N245J642k229k571l792L224M639j378l17
13926a773Q1k945q081K488J0306M613n647o104K972J3073K551p3K573j5362k826
13911d154l381j455l01j809J992k976M908J0674N092m574j748J42J136N586p694
13896A438j422M486n529q434p902Q828J2440K110l128j506K415j2663l510N082
13882g295R95O82n604M520P408J939k97m468J448O516m059n469N291N352K263
$$ y = [12266, 2307, -2031, -6587, -11814, -22105, -14006, 4211, 19343, 23124, 20385, 17519, 14838, 12906, 11807, 13367, 12565, 12789, 10201, 3428, 9849, 13540, 11100, 4358, 1820, 807, -921, 1808, 2869, 6287, 7445, 3404, -6426, -7542, 802, 5558, -3185, -13656, -16066, -16116, -19863, -14153, -8232, -9786, -4625, 3252, -852, -3197, 1271, -7339, -6236, -991, 651, -1578, -4149, -7941, -4717, -78, -1456, -1773, -1692, -4637, -12718, -10230, 76, 4689, -958, -7062, -4090, 8983, 11534, 11461, 14034, -1328, -4154, -7535, -8990, -9291, -11100, -9108, -12084, -7176, 3498, 8590, 4016, 2268, 2410, 3546, 9132, 1438, 16, 4502, -1027, -9461, -17363, -8535, 3905, 6015, 2887, 1381, 3796, -8867, -12377, -7295, -6300, -5618, -11222, -6702, 706, 2645, 2348, -2120, -672, 5844, 1785, -3684, 1607, 6959, 9222]
13867I222l484m805k041p838j105K260j864K837N793m560o73n824k057O096L333
13852d710O659J762R59k874k225l601r04l0L702p052k019N003M072m27j404n544
13836h633l106P189Q538l556L4L149L173K1l893j2487O10j393m327L290L935n551
13820a3007j316N021K557n737l295Q176J7p812K115K702K83J960o039p88O101
13805i062O215q104j481L231P133k475m350M036O611Q66m976k860O936N74L889
13790F183r758p334L923Q013J1681l910q619p366j612L531M622N886m44J480j0080
13775c804q016O146N016O229P16q367m639N329K551J66P300J795q139q989j914
13760h620q45L036n944M054j308m279J631R636K35L268J0343R118q98p149o966
$$ y = [9222, 5738, 933, -1108, -8946, -10051, -7791, -9655, -6818, -1025, -5585, -6258, -12082, -14139, -8043, -4710, 1949, 3711, 4670, 1796, -429, -4030, -4934, -4964, -1262, -8314, -10333, -5330, -1258, -1685, -3089, -8633, -11739, -4550, 3988, 432, 466, 3615, 6788, 6809, 2916, -9571, -8961, -10354, -14681, -11391, -7456, -13007, -14323, -9302, -6745, -12482, -15777, -7601, -7584, -15396, -13281, -10579, -10296, -8336, -14375, -15163, -9062, -2847, -10951, -12432, -9201, -2068, -4543, -8893, -4857, 1754, 2620, -2356, -5216, 1720, 2294, 6183, -3575, -10909, -6986, 1027, 12708, 8798, 179, -7187, -8799, -5268, -646, 5240, 4796, 6276, -3804, -11820, -5674, -658, 5571, 6287, -2080, -6719, -1390, 1161, 1327, 8627, 10422, 2283, -6706, -8620, -9465, -6429, -12373, -8319, -9627, -13906, -12275, -2639, -2404, 864, 11207, 20325, 19427, 12278, 5312]
13745E312p460l976P026M210P938n564p260N547m812l839k125N377Q501P443k174
13730A4144O739l122j0555l967J79l58J235n832L070P883j596p172p416l300Q996
13715a072Q890K909n554o671o670o261Q444o808N67N436m47k66L058J2955K624
13700A1134j416j0348q542N989j671Q31j180J619M676M721k878J527l79j695K701
13685E089J666k302r755Q536l047j2191K516N905j540K473o09J0510J4499k336
13671A9414j4808l986k566L34L245l002j1836k961J765M865P778K50K936P0L77
13656A875n239l403P05k292M875J0102K279n843q739L759m616j2685K770J0968
13642e484N676j1557j3709o766J197R549J1282N604L741k737l997k144O271J1524
$$ y = [5312, -2148, -6124, 902, 5112, 13050, 7486, 226, 5773, 961, -2878, -5003, 374, 8875, 16318, 14144, 20883, 17761, 7206, 3239, 3418, 3060, 4295, -1537, 1533, 9416, 7820, 648, -6768, -10068, -1072, 7818, 10727, 5173, -1498, -8168, -14429, -5985, -12793, -12226, -6790, -7237, -7503, -4445, 8510, 11134, 9718, -630, -9172, -3183, -4854, -4023, -5203, -3584, 1092, 5813, 2935, 4462, 4083, 2388, 5089, 6755, 4453, -5302, 3234, 187, -12004, -9488, -3583, -5123, -2650, -3259, 7251, 21750, 19414, 4606, 620, -1946, -1612, 1633, -1369, -13205, -16166, -14401, -9536, -1758, -1508, 1428, 1498, 1875, -3364, -6767, -6062, -8354, -3479, 6623, 8902, 3059, -5680, -1921, -6537, -19222, -16452, -5484, 192, -11365, -25074, -31840, -30643, -21094, -9812, -4208, -467, -3204, -7201, -9345, -3074, 8450]
13628H450J1026J849q295K343oo203p400o252l638J666l310k696N581N304J2025
13613A0444r80j2809M78J79m821M533J0714k878p180O416K974q340P36R267K756
13598A1489r847p150L456j062q033J919J2611m62r988m178P71K138J949j514k041
13583i942M706o61l184K955r241L54Q148J1207L926J495j972j1769m492K51l763
13568a1982J1276O665R06J767L95m394m907o060O703k805j780P733n666n525O098
13553a576O137J815O601m519m552o955J154O535L676r294m50O158J148p07p131
13538a960m877Mj398m171J0877Q70m171r24n075P791P95j506n448K105R412N141
13522G465p607K128l251n692K953M7o286q25L63J0490Q89m205J661N427o824p028
$$ y = [8450, 19476, 21325, 13030, 15373, 15367, 9164, 1764, -4488, -8126, -6460, -9770, -12466, -6885, -1581, 10444, 9464, -3345, -2867, -2688, -7509, -2976, 7738, 4860, -2320, 4096, 7070, -1270, -534, 8733, 11489, 1642, -5508, -2052, -3114, -11147, -9228, 3383, 2921, -7067, -11245, -10474, -8336, -6387, -7901, -9942, -5236, -5897, -9081, -6126, -15367, -15013, -6865, 4342, 8268, 9763, 7791, -3978, -8470, -8219, -11982, -706, 5959, 6865, 8632, 9027, 4633, -274, -6334, 369, -2436, -4216, 3517, -2149, -7674, -1576, 4561, 6376, 12977, 8458, 3906, -3049, -1895, 4640, 8316, -978, -1428, 4730, 5878, 5171, -1960, -6837, -6833, -8231, -12402, -1525, -655, -4826, -5750, -10825, -3034, -2239, -3745, -9193, -7088, 2324, 7465, -142, 1986, -1265, -6957, -4004, -3957, -10243, -11068, -10705, -215, 674, -3531, -1870, 3557, -3267, -10295]
13506a0295K464n61o101n078M121N247R189l187P06r33O044Q969p561n810k702
13491e488j090K412M546j340j478k052m87l637K337n631K07J385M324R04o390
13476a1478j03L304Q432N026m806O056l79j2462p87K31j687j398R543Q3p826k812
13460a1063q908l48J828M314L068K960J2458m780n586R00r67p521j533J1609J782
13445a787q713P72J6299R332o206p072p249n472n28J1262j57k516L647m406r56
13430c750J859j220K833l899N90j684k414j542L456P914r51P53l537m838p97Q120
13414H93Q694k091p114J7n729n376J567P691k1m608R797J1155l110j7403L590
13399b048m50j036K666n262k666O013Q656j343n187o655o886k99r15N585J595
$$ y = [-10295, -7831, -8392, -14493, -19571, -15450, -10203, -1014, -4201, -3495, -4428, 1616, 10585, 3024, -2786, -5488, -6578, -4166, 380, -960, -2438, -4490, -4977, -8614, -6277, -11908, -11701, -10316, -5992, -5088, -11478, -11581, -8277, 155, 5181, 375, 6431, 6052, -6410, -7197, -6966, -8653, -10051, -508, -425, -8251, -11063, -19971, -20319, -18491, -14177, -11109, -8149, 4309, -471, -6057, -5157, -6124, -13645, -15178, -3569, -1787, -10500, -9728, 6571, 15903, 9697, 2625, -4624, -10096, -10624, 638, 481, -2035, 1612, -2794, -3750, -1891, -3111, -278, -4177, -3587, -5271, -7685, -9227, -5771, 2143, 1192, 1945, -1592, -6430, -7227, 893, 9587, 7496, 382, 399, -5330, -10706, -9139, -1448, -1469, -6077, 3720, 14875, 11765, -5638, -2048, -2498, -3534, -868, -6130, -8796, -2783, 5873, 4530, -657, -7312, -14198, -14497, -15412, -9827, -8232]
13384h232n977j1987L186J5936L411j556J668p112n741L943j838j653O186O267
13370c499M297l39q066m632K274R618N568L9r331j0061p36L935l161K130N004
13355f960J054k850l237J210M814j169J342r059P465J0684J643r499J548R054
13341F040K300o252P202R782l901r607n007Q917R49r587k642j43N902Q95k241
13326B607K453J211P33j380J635p546k473O451N745n014l185n684L564M512K013
13311E642K486J886o644k663o10N139M767p228l076k491p71l634m969O395M103
13296a668m739l409M771L88M829N423j2292j147M456m746K066M032J319q02k489
13281d008N213P821o515p299l497N58M004O679r46j0040m970l654l105O999Q116
$$ y = [-8232, -14209, -26196, -23010, -7074, -3663, -5219, -3551, -10663, -16404, -12461, -14299, -15952, -9766, -3499, 798, 459, -7607, -12239, -9965, -347, 5221, 5260, -4071, -14132, -14868, -10933, -14094, -11964, -6960, -5906, -8756, -11993, -10783, -5969, -7138, -5796, -14855, -7390, 3294, 4937, -4562, -3014, 6040, 8340, 2088, 9290, 19072, 15171, 5564, 557, 9474, 10423, 836, -1806, -1949, 3953, 4848, 2607, 5060, 6271, 7004, 5624, 7259, -287, -2760, 3691, 9436, 4422, 1237, -4447, -883, 3629, 5642, 8128, 10014, 3370, 707, 97, 5236, 10003, 2775, -301, -2792, -3563, -7197, -12166, -5771, -1668, -6407, -9816, -5045, -4657, 172, 5595, -6697, -7844, -3388, -8134, -6068, -2036, -717, -1519, -4008, 1205, 9026, 2511, -4788, -8285, -7727, -3723, 2956, 2010, -8030, -13000, -16654, -19759, -12760, -4644]
13266d644O605j539j451o308K78R043J809k243N76J615j934l370J226j542o493
13251h372m001O909O223N118L212J515q218j1860p840M048j760L381Q224Q909
13237E488k941N36j489M192K946p716o218k578J1857r3j3146m672l822q337l794
13222b9787P626O584j103J236R979J7988j120m077K381k349l672l500Q991P272
13208A6449Q59j1866o605M212K595j1698p909M069J776j059Q016P181p260j142
13194b382J661k161K373J294m433O978N597n498r033J461R21M022L057j467Q225
13179A0615L766k341r156j3703l367J0489Q139l890n551Q282L787o674n527j1271
13165a6402k624R447R547k965q651n624L41K949N585Q31K504K294K259n93k214
$$ y = [-4644, 1961, 422, -1029, -7337, -7059, 1984, 3793, 1550, 2126, 3741, 1807, -1563, -337, -1879, -8372, -12373, -5464, 759, 5877, 9089, 10604, 2386, -9474, -17314, -13266, -15026, -11645, -3421, 5488, 2547, 3083, 1594, 5786, 8732, 1016, -5202, -7780, 4077, 3984, -9162, -13834, -17656, -25993, -29787, -22161, -15577, -16680, -15444, -5465, 12523, 11403, 7326, 9707, 7358, 3686, 186, 9177, 16449, 17308, 5442, -1163, 3049, 5644, -6054, -13963, -9894, -8118, -9177, -1161, 6020, -1240, -2382, -721, -2882, -509, 785, -3648, 3330, 8927, 3429, -5604, -4143, -3222, 800, 3857, 2390, 10615, 14381, 12040, 2884, -10819, -14186, -3697, 4442, 552, -4999, 3283, 7070, 396, -5131, -16402, -19026, -9579, -32, -2997, -11648, -17272, -16931, -13982, -8397, -7566, -5062, -2768, -509, -1102, -3316]
13150c316O249L718l914l268m888l565l189K791J1732Q806j0156q913l805n388
13136a7106j803R035K744J949J2873J0845J694j0037o008q926N082J4522l000
13123A1864q647q560M615O43o385k416N519O725l746n454j958l045N073Q449k633
13108D4o581m919M039P385M585k075n380O63M685N14m437k464L866k900M231N648
13092F904o697k714N38k72k219J698q490m883J2501J3768J64m534P155K266l682
13077A1503K91O92o529j2607q921J745O479K1p396N774J1753N23n034k185m049
13062g940J540n097K87J3445N702j2403j1868r373K0691J5346n582n634J112L231
13048C457l520k936M011j263o744o818Q132P322Q589L54R826J234q268n415p396
$$ y = [-3316, 2933, 6651, 2737, -531, -5419, -8984, -12173, -9382, 2350, 11156, 1000, -7913, -11718, -17106, -18909, -9874, -7130, -5181, 7692, 18537, 20231, 10194, 4186, -4740, 342, 14864, 11864, 3217, -5343, -728, -85, -6470, -8886, -3367, 3358, -388, -5842, -7800, -10845, -5772, 2677, 44, -6537, -11456, -7417, -32, 4553, 2478, -2902, -2239, 2446, 2960, -1477, -3941, -75, -2975, 1256, 6904, 207, -2507, -1969, -2241, -4460, -2762, -11252, -16135, -3634, 10134, 10298, 5764, 12919, 15185, 11503, 11794, 12486, 5957, -6650, -15571, -13826, -7347, -7326, -14722, -8948, 2805, 3328, -1706, -3891, -7940, -6400, -11497, -11210, 2235, 7937, -4466, -16334, -25707, -5016, 10330, 4748, -886, 226, 3457, -63, -2999, 1012, -251, -6995, -13813, -5681, 1641, 10230, 10584, 20410, 21644, 13376, 7961, 565]
13033E65l751j0751J838P667J785O576N921K933l979k191M606j0836m898j869
13019f384L112M310P41j0513n749M788J954O951j072L747M606m957n593K780J5024
13004A3745L661l606r791k165j608m808R151q82n752K555O649M222q156j3705
12990a0490k512M615O803K485Q261k456m999R91K942O803M731j4434j4904k995
12976a5159M956m700P320J2161J210M7R075j729l647m045k367p40n58n363m134
12961g673k943N072N681J644l771r51N469J630k037p449r216R84L582K516O624
12946h38J1850o3m102o572m76K176o955L521N511K392q659n097Q07K06j1904k80
12930a8483L715q199K670P571J1817j170K899j085l324Q734R30n878M250r252
$$ y = [565, -3186, -13937, -12099, -4432, -2647, 3929, 9850, 12783, 8804, 6613, 11219, 383, -4515, -6384, -3272, 1038, 1779, -8734, -14483, -9695, -7741, -790, -1862, 1885, 6491, 1534, -4059, -1279, 13745, 17406, 13800, 4009, 1844, 236, -4572, 4579, 3697, -2055, 500, 7149, 11371, 3215, -10490, -13002, -8387, -1584, 901, 9162, 6706, 1707, 2698, 5640, 12443, 17174, 2740, -12164, -15159, -10203, -14903, -7583, 4578, 5788, 5835, 14910, 13181, 9534, 5489, 3122, 2382, 1824, -3539, -7673, -10616, -5544, 137, 1781, -1990, -2941, 2528, 4158, 2121, -5328, -14544, -13560, -9978, -7462, -838, 11012, 10949, 6847, 275, -201, 1975, -4980, -1459, 4052, 6444, -2215, -7312, -6505, -6299, -18203, -18483, -14768, -22967, -20297, -12726, -909, -2079, 820, -265, -3589, 5145, 6075, 197, 4447, -4805]
12916d805j4682N467P289P832O305Q018k834m109m041o985M984J2150k077P67
12902A3279j799K225p751m345K073m54o583m47j838N608P769Q492j1943qJ258
12887E536L087q22K218n286j1828k491R328J4088L198k752j2466O802m588q57
12873C167J113J401L461L33m698K947J539r639k781l330l346P763L307J0446l162
12858H521n194n271K512J801P758J044n563m209N923j43o186J426O436l375o046
12843e66j485N463M634L192k862L757N626p736N35J565M62l667q004J536R486
12828A1936J488K016l293o641J396J258n646J456O487o907O93o545O269P907L954
12813A5828m484j805p588P996K502n403J367n09k941L19K016m422m659m367J836
$$ y = [-4805, -19487, -14020, -6731, 1101, 7406, 15424, 12590, 8481, 4440, -2545, 2439, 14589, 12512, 13279, 11480, 13705, 5954, 1609, 3682, 3228, -3355, -3802, -5640, -32, 7737, 16229, 4286, 4278, 5536, 8623, 7801, 10019, 4733, -7095, -9586, -258, 13830, 17028, 14276, 1810, 8612, 4024, 3167, 4280, 5681, 9142, 9475, 4777, 7724, 9263, -376, -3157, -6487, -9833, -2070, 1237, 11683, 8521, 3327, -1944, 568, 2369, 10127, 11171, 5608, 1399, 7322, 7179, 993, 2419, 8855, 5480, -566, -2051, 3412, 8046, 11238, 8376, 12133, 17759, 10023, 10558, 12123, 12585, 8918, 914, 2450, 11936, 13424, 15440, 12147, 5506, 6902, 8160, 2514, 3970, 10457, 3550, 4243, -2302, 3967, 11874, 15828, 11344, 9539, 1951, 9947, 12449, 7046, 8413, 7904, 4963, 5282, 7298, 2876, -1783, -6150, -4314]
12798d314l8n715j947K040M895L385J028o57n923J542O323Q728J2740k889p363
12783A1835n0l700m637M894p754q199J1220Q631o211N667N696k729p74j686r370
12768B833O661Q208l771j2317l665K221k698k323L744J691J35o936L386n78R46
12753b463L511n58k580P72J101j0M842L195l49m486l455o035K402K831J1376K631
12737A2725k252J646P65K235N944l961n244j0123o192N859J370n819n333m672
12723a3052P81l739M080L505J2631R068l626n096o671k562J859K171l449Q870
12709D770R121k55k087L801j0310N138O67Q874N330r772r688k84P11M307K43m41
12693A0125n77J13r217n817J7L431N840j724j266j842J644R56K300P222k905r606
$$ y = [-4314, -4352, -10067, -12014, -9974, -5079, -1694, -666, -1323, -7246, -5704, 619, 9347, 22087, 19198, 11835, 11785, 8085, 3448, 8342, 588, -7611, 3609, 12240, 6029, 11696, 17392, 14663, 13889, 12203, 2833, 9494, 17702, 13931, 1614, -2051, 170, -2528, -4851, -1107, 584, 719, -6217, -2831, -3409, -2463, 1048, 490, -2090, -1318, -217, -227, 4615, 7810, 7461, 2975, -480, -6515, -4113, -1282, 10094, 12725, 10473, 12119, 12884, 15119, 21063, 17102, 11858, 1735, -4457, 1402, 2772, -3047, -8380, -13052, -12271, -16010, -11930, -8425, 4206, 13274, 9648, 4552, -2119, -4681, -2822, -651, -4100, 4770, 13891, 13636, 11549, 15350, 5040, 10178, 10845, 19719, 25049, 15277, 5589, 5305, 6016, 10323, 10566, 10125, 9548, 9661, 444, -5373, -5356, -1925, 3915, 2191, 925, -917, 727, 1683, 3983, 11205, 8300, -1306]
12677a306N32K220K504N754m597j896p02N439m739j533R966P726l359p289k487
12662F233R46M134L352o548n170K435R996M73J986K16o512l537R67L981J0529
12647B3481n822j9125K347l696K513M285k368j789M64R703J869n635l000q981
12633e754m623K091O148j304O390M579j403K616M965q05M91q863k853K454L212
12618G341n45P330Q288q691p994Q160Q77r48Q84j2872n194O587P436M950L544
12603A9153p111l922n070l02n40L923N560j001k92n136L602J162J410K949J709
12588A6094m661j701j078J829J001L213j839M450n285L066O9q288j678J366O438
12573A2996J787n834l591q601J541O972L669j164J538L481Q54o429k561L309J611
$$ y = [-1306, -774, 1446, 3950, 9704, 5107, 3211, 2509, 7948, 3209, 1676, 11642, 19368, 16009, 8720, 6233, 7179, 11313, 14665, 8117, 2947, 5382, 15378, 15851, 17837, 18053, 11541, 8004, 8971, 12952, 23481, 17659, -1466, 881, -2815, -302, 3983, 1615, -174, 290, 9993, 11862, 6227, 3227, -5754, -10377, -8286, -2138, -3442, 2948, 7527, 6124, 8740, 13705, 12900, 13391, 4528, 1675, 4129, 7341, 6796, 14126, 22414, 13723, 5729, 13889, 14766, 13818, 14702, 1830, -3364, 3223, 10659, 15609, 19153, 12042, 8120, 3050, 2748, 2208, 6131, 11691, 10690, 10398, 5262, 8864, 10026, 11436, 14385, 16094, 11433, 9732, 8654, 10483, 11484, 14697, 12858, 17308, 12023, 15089, 15158, 6870, 5192, 6558, 12996, 14783, 8949, 5358, -3243, -1702, 5270, 8939, 7775, 9313, 12794, 13648, 7219, 4658, 7967, 9578]
12558I578j086j0639J478M844O648K794l190j657j844P24L088Q026K04l687J488
12543A6769n592n367P527J023M370J527k891r317L021P536o216m441Q736O206
12529B2891m922o007P502j425k045l398j314l039l541J0399R813L458m952j1290
12515A2130l266q896k125N954K196M152J2486l516k566j082m221m704q59M138
12501I821j0573m232J0921m233m045L340l74k252j010J145O282J0906j525m808
12487I363K741J0321L005O088J542j128o353n225n554j1593M198O056K936Q155
12473B4552J603J344n969l959o722o780m090J1668R81m518R19P252K545k91K588
12458B1123J0305l234o287n352j907p40J535O507N836O033N777J437q051q780
$$ y = [9578, 8492, -2147, -669, 4175, 10823, 13617, 10427, 8770, 6926, 7650, 10738, 18764, 18968, 15281, 16769, 11177, 5810, 13337, 14360, 18730, 20257, 17366, 8049, 11070, 18606, 12390, 7949, 16685, 22891, 17969, 11962, 19464, 18039, 15994, 12596, 11282, 8243, 4702, 15101, 24914, 28372, 23420, 12130, 8864, -32, -2157, 3797, 5993, 10145, 22631, 19115, 16549, 15467, 11246, 6542, 5683, 9821, -752, -4984, 5937, 1704, -2341, 999, 625, -1627, -2637, -1492, 4790, 15696, 14171, 9363, 12104, 22425, 25430, 31518, 33060, 31932, 25579, 20354, 14800, 3207, 7405, 13461, 16397, 24552, 26155, 27499, 21530, 17571, 10849, 4069, -21, 11647, 12628, 8110, 9029, 16281, 18826, 18535, 21123, 31428, 28194, 21907, 16555, 14648, 13908, 15443, 21950, 27786, 33819, 39596, 41033, 32982, 24202]
12444B4202K52K833J2325O495j4665j3939o67j39K722k860l027M425n498l389
12430I070M185P668M33j485m009l162j768R496R771j423r154q83m98L247r89Q246
12414B8745J0271J686l684o666J171m937M656k785J23l476P405K354n264k995
12400B6604N333K552n396J05M502N946j474o453o717M446J3014M282m700m400
12386C7644j593l873N095l709n493L607J4561l549j1155r43L18N542j654j0733
12372B4065q737k655J9281J6480L837K565l397r030l185l293k225j233m117K504
12358C0860m42j836l017o24M555J0547N731J615r435j119j794k211j555r75n483
12343B4817p569L040L901K967Q69m804O376O089p709k898M044M72L855O893J555
$$ y = [24202, 24454, 27287, 39612, 46107, 31442, 17503, 16836, 16697, 19419, 16559, 13532, 17957, 12459, 9070, 13255, 20923, 21356, 19871, 15862, 12700, 10932, 20428, 30199, 28776, 19622, 18739, 18241, 21488, 20499, 28745, 39016, 40702, 37018, 30352, 31523, 26586, 31242, 28457, 28580, 25104, 32509, 34863, 29599, 26604, 31937, 34489, 29093, 29198, 33700, 39646, 38172, 31719, 25002, 29448, 42462, 46744, 42044, 37644, 36051, 32178, 37273, 33564, 28071, 31678, 46239, 42690, 31535, 30592, 30910, 36452, 34798, 24065, 15328, 12673, 31954, 48434, 52271, 54836, 51439, 42409, 39224, 35931, 33706, 32473, 28356, 30860, 30418, 28582, 25565, 24941, 29496, 40043, 45774, 47389, 37954, 36835, 35041, 32830, 31275, 30300, 24817, 17248, 20288, 24189, 27156, 28025, 23221, 29597, 35686, 27977, 25079, 29123, 29595, 33450, 40343, 41898]
12328D1898M510J148m498m63K804o43P62L170l876m326l675R82R14n475J5735
12313D8967K935p771J779M509J766n153K213R582m758j3545j339P88J13R207M063
12298E3356P380j142m531L550k601j2680P740M4p299l695K648m171J920P505k158
12283D5866M701K109j2594q00N241M013j649j183K612L281n66l618N619P957K516
12268F3505k110l53p419Q951L392k34j917o595J452j916m674J5409p28n293l662
12253E7808N182J0158k180l176P172j425r132l047j617J972M676q82j508k437
12239F1564N402m783n360M311J6372M469l793m611k683j544K521m282M07N523
12225G3513k11K821K203m732m043k586l692k343j71j317Q557J217L640K205k953
$$ y = [41898, 46408, 47556, 43058, 42595, 45399, 44756, 45518, 48688, 44812, 40486, 36811, 37793, 38707, 33232, 48967, 51902, 44131, 45910, 50419, 52185, 47032, 49245, 58827, 54069, 40524, 39185, 39973, 40086, 49293, 53356, 60736, 59594, 55063, 58613, 56012, 43332, 51072, 51116, 43817, 40122, 42770, 38599, 40519, 48024, 45866, 50567, 52676, 40082, 39282, 44523, 48536, 46887, 45704, 48316, 51597, 51031, 47413, 53032, 60989, 63505, 61395, 61042, 53623, 62574, 65966, 65732, 63815, 57220, 58672, 56756, 52082, 67491, 66763, 61470, 57808, 62990, 73148, 70968, 67792, 74964, 73539, 64407, 61360, 59743, 61715, 66391, 65509, 64001, 61564, 66966, 62183, 56823, 61134, 77506, 81975, 78182, 73571, 70888, 69344, 71865, 67583, 67990, 73513, 73302, 76123, 78326, 73594, 69551, 66965, 63273, 60930, 60759, 59442, 67999, 69216, 72856, 75061, 72108]
12210G2108K981m83O337n360q331N730M498J818N543M931j06r146j300j218L288
12195H1290L067M043K219M11N55p322k958N435K063K474m645o626L865M982N483
12180I4336J468J623M354p16N012R52o03J018k808j116l591L810j991M45k039
12165A00154L817J2412R312N173j1175j1684m308p9J0454J2431K791m898p981
12152A16419j16R5O496O758N984O982l80k072j165j860n224O61R392J0532l126
12137A49376p611j547M134P72o57P492j125L854K605p300L440J0211K599M905
12123A71148K061L581q443m028N153R635J986k629K426o6r80Q81P870L790L904
12108A96289J8193O620P48n998K52O662J311J20k935Q1J1315R055k13K662J066
$$ y = [72108, 75089, 74606, 80943, 75583, 67252, 72982, 77480, 79298, 84841, 89772, 89666, 80520, 79220, 78002, 81290, 84357, 88400, 90619, 91030, 91585, 84263, 81305, 86740, 88803, 91277, 86632, 80006, 83871, 88853, 94336, 95804, 97427, 101781, 101065, 106077, 107029, 106426, 107444, 104636, 103520, 99929, 103739, 101748, 102193, 100154, 103971, 116383, 125695, 130868, 119693, 108009, 103701, 103622, 114076, 126507, 129298, 124400, 116419, 116303, 116398, 122894, 129652, 135636, 142618, 142238, 140166, 139001, 137141, 131917, 132578, 141970, 152502, 149376, 141765, 140218, 144352, 145124, 144467, 151959, 150834, 154688, 157293, 149993, 153433, 163644, 166243, 171148, 173209, 176790, 168347, 164319, 169472, 179107, 181093, 178464, 180890, 180824, 179844, 180725, 188595, 192385, 196289, 214482, 221102, 221850, 215852, 216104, 222766, 224077, 224197, 221262, 221343, 232658, 241713, 241500, 244162, 245228]
12093B45228N053P665q158J104l21M242R921N434L284L618j739K48J0511M936
12079B91026O767N547n93n98K472K468K605O20O605J1742J0793P748J820j003
12065C48019k722N154M889J716M83R902J2052R109J3326P111M587N443L630R857
12051D32556P108N822R535M540j422O153J2281J625J1101P738o036n346Q81J9986
12037E06522J4505J7979J4762J0101Q506J6981Q392m30J7679K1627Q935K955P679
12024F56193J8266J0042J2093J1225J2350J3946J4049J1968J1673J6208J7904
12013H05917L0419J5875M564J5681J4745J2483J7491K4980K1827K0081O432J8396
12001A008891J1653J7513K2273J4109J8527L6110K7573J0762K3977K6818L1718
$$ y = [245228, 250281, 257946, 249788, 250892, 250571, 254813, 264734, 270168, 273452, 277070, 275331, 275579, 286090, 291026, 297793, 303340, 302747, 302149, 304621, 307089, 309694, 310314, 316919, 328661, 339454, 347202, 349022, 348019, 345297, 350451, 355340, 357056, 357539, 367441, 379493, 388602, 401928, 409039, 413626, 419069, 422699, 432556, 439664, 445486, 455021, 459561, 458139, 464292, 476573, 478198, 489299, 497037, 491001, 485655, 486536, 506522, 521027, 539006, 553768, 563869, 572375, 589356, 597748, 597318, 614997, 636624, 645559, 648514, 656193, 674459, 684501, 696594, 707819, 720169, 734115, 748164, 760132, 771805, 788013, 805917, 836336, 852211, 856775, 872456, 887201, 899684, 917175, 942155, 963982, 984063, 990495, 1008891, 1020544, 1038057, 1060330, 1074439, 1092966, 1129076, 1156649, 1167411, 1191388, 1218206, 1249924]
11990A249924K7866L1272K3125K1502K6134K7592K4792J8727K9914K4845K2989
11979A528682K5091K6877L5763L1059K6462L2651L9714K3743L0070L1248K6820
11968A858180J9430J9974L2637L0479L1144K4345K8837L2936K8462J8969O242
11957B131635J7923K0744J9874J8833J0167O753J8493J3402J3164Q251J1732L845
11945B294816J7n61J970M563r927m441j0984q012r628p798j2925j4515j4836k7942
11931B179797k0649j7671j8863j5869k0471k3092j7549k2408k4931l1765k7314
11920A939215l3344l2234k2030k7970l1854k6661k1777l5249k7745k8938k7368
11909A624045l9535l5607k5113k2153j5535l0684k8244k2598k3787k6371k4039
$$ y = [1249924, 1277790, 1309062, 1332187, 1353689, 1379823, 1407415, 1432207, 1450934, 1480848, 1505693, 1528682, 1553773, 1580650, 1616413, 1647472, 1673934, 1706585, 1746299, 1770042, 1800112, 1831360, 1858180, 1877610, 1897584, 1930221, 1960700, 1991844, 2016189, 2045026, 2077962, 2106424, 2125393, 2131635, 2149558, 2170302, 2190176, 2209009, 2219176, 2225929, 2244422, 2257824, 2270988, 2279239, 2290971, 2294816, 2294833, 2294272, 2296242, 2300805, 2290878, 2286437, 2275453, 2267441, 2257813, 2250015, 2237090, 2222575, 2207739, 2179797, 2159148, 2141477, 2122614, 2106745, 2086274, 2063182, 2045633, 2023225, 1998294, 1966529, 1939215, 1905871, 1873637, 1851607, 1823637, 1791783, 1765122, 1743345, 1708096, 1680351, 1651413, 1624045, 1584510, 1548903, 1523790, 1501637, 1486102, 1455418, 1427174, 1404576, 1380789, 1354418, 1330379]
11898A330379k6451k9273l4291k5450k9122l1711j1511j3016k2858j7937k7095
11887A061664k3251k0206k4442j6524j3688j6341r181j6390k0847j7959j2023
11876H70812j0107j2941j9813k6016k3449j6126j1438j9686r292r665j3601q777
11864F89901j0346r713p962r763p351j0182j7987j6616p216j2777n877j4218j4620
11851E45273j0343j0910m128n457q718M911l875j4811j7414j3355j0705j0989
11839D39479n358o476n84j4194n793j0584j082n030m018o825j3631o064P001K253
11825C69094k989j3600m112l416q790r712J0685M908o421M691j0217m25j0533
11812C19163j5500j4600q84M585m736j430q143o826m401O857j0625o539k100O551
$$ y = [1330379, 1303928, 1274655, 1240364, 1214914, 1185792, 1154081, 1142570, 1129554, 1106696, 1088759, 1061664, 1038413, 1018207, 993765, 977241, 963553, 947212, 938031, 921641, 900794, 882835, 870812, 860705, 847764, 827951, 801935, 778486, 762360, 750922, 731236, 721944, 712279, 698678, 689901, 679555, 669842, 661880, 652117, 644766, 634584, 616597, 599981, 592765, 579988, 574111, 559893, 545273, 534930, 524020, 519892, 514435, 505717, 510628, 506753, 491942, 474528, 461173, 450468, 439479, 434121, 427645, 427061, 412867, 407074, 396490, 395408, 390378, 386360, 379535, 365904, 359840, 366841, 369094, 366105, 352505, 348393, 344977, 336187, 326475, 337160, 342068, 335647, 340338, 330121, 329696, 319163, 303663, 289063, 288179, 292764, 288028, 286598, 278455, 271629, 267228, 274085, 263460, 256921, 254821, 261372]
11798B61372J001q505L778j1812o728q440o34R79k492q541m694K404j510M848
11784B21026k147k763k249o382p51l717n237R22N97n911l274J234J628m983l242
11769A84751o764l264J403j3564j0616J0155k38q81L921J994l86m426o97L922
11755A65310k731m475j7307j789P68O632K838m522l133M670N01j114m676q375
11741A32597K591M467j2886p722m661J875p44k812M662N102K338J580k326J24
11727A24185n396n23O898l721K576N24q837j0150K521R526m567k605p384J95J734
11712A04976j370O83j995r220P747J0882l318j25J13n56q327M025j816n787L416
11697I9328J214m125n983M560O564n635m114p65L473J45m415m872m73j611L983
$$ y = [261372, 262373, 253868, 257646, 245834, 239106, 230666, 230032, 231011, 228519, 219978, 215284, 217688, 216178, 221026, 218879, 216116, 213867, 207485, 206734, 203017, 197780, 198702, 199299, 193388, 190114, 191348, 192976, 187993, 184751, 177987, 174723, 176126, 162562, 151946, 162101, 161863, 160982, 164903, 166897, 166511, 162085, 161388, 165310, 162579, 158104, 140797, 139008, 139776, 146408, 149246, 144724, 141591, 146261, 146762, 145648, 140972, 132597, 135188, 139655, 126769, 119047, 114386, 116261, 115517, 112705, 117367, 122469, 124807, 126387, 124061, 124185, 118789, 118266, 125164, 121443, 124019, 124543, 115706, 105556, 108077, 117603, 113036, 110431, 103047, 103242, 104976, 103606, 104289, 102294, 93074, 100821, 111703, 108385, 108260, 108373, 107817, 99490, 103515, 101699, 95912, 99328, 100542, 96417, 90434, 94994, 101558, 95923, 91809, 91044, 94517, 94662, 90247, 85375, 84902, 83291, 87274]
11682H7274K670o770q953n432M694J3509K233q729l285n504j003J2118L766n214
11668H1374k599J233O419o863l441K188o058K866p267n276j279Q843J0366N053
11654H5559l678l800k503n923n916O203J524P14j309N654q122p656p215l200k04
11639E0128N687m452J981K897p61o180L029l997Q10J232N438L032p395P357J567
11624F0373J397K478j7041K590J5985P04n174r511n354k814r161m915M80L571
11610C3608M752n759m488j624m598M807N370L427Q958M70k103k97l805j215l902
11595C3601l22J962k188K049J1202O728k178o071o424J91j744m119L57j649j365
11580C0030K308K328j362k882o635P666O063j70P236M58m448o369K288n36j3492
$$ y = [87274, 89944, 83174, 74221, 68789, 73483, 86992, 89225, 80496, 77211, 71707, 70704, 82822, 86588, 81374, 78775, 80008, 86427, 79564, 76123, 78311, 72253, 75119, 67852, 62576, 61297, 70140, 80506, 85559, 81881, 78081, 75578, 69655, 63739, 69942, 71466, 72180, 70871, 76525, 68403, 60747, 53532, 50332, 50128, 55815, 51363, 53344, 56241, 55480, 49300, 52329, 48332, 49142, 50374, 55812, 58844, 51449, 58806, 60373, 61770, 64248, 47207, 49797, 65782, 66486, 61312, 51801, 46447, 43633, 34472, 29557, 30037, 33608, 38360, 32601, 28113, 26489, 21891, 26698, 32068, 35495, 44453, 44923, 42820, 42523, 38718, 37503, 33601, 33279, 35241, 33053, 35102, 46304, 53032, 50854, 44783, 38359, 38550, 36806, 32687, 33044, 31395, 30030, 32338, 34666, 33304, 30422, 23787, 31453, 37516, 37346, 44582, 45040, 40592, 34223, 36511, 35975, 22483]
11565B2483O201O998O170q407l197l713k239l133l261l339J0665L307r12k853
11551B4770O827M72K83K479M390J896j990o690q501r503K043M138L442L039R471
11536C6566L310j2671K14K966K29K351M155L673J273l056j811N7Q255l640j100
11521D0771J159p058L619m10rp428o669n667o515QM607J2643J268j694m964J928
11505B5589M217J355p371K113J747O224j603r518r983m149L093P78J257R393J538
11490B4680n71k617M054M865J79m802k007o841L011J0851K76M338L689k784K088
11475C8409m888p307o962k195l672q401J4736M507q100j2644Q959P276K029j531
11461B0216P984j3121n806R412n361o00R107k486M908k520p656o887N769J952
$$ y = [22483, 28684, 35682, 41852, 33445, 30248, 26535, 24296, 21163, 17902, 14563, 25228, 28535, 27623, 24770, 31597, 32069, 32352, 34831, 39221, 41117, 39127, 32437, 23936, 14433, 16476, 20614, 24056, 27095, 36566, 39876, 27205, 27419, 30385, 30614, 32965, 37120, 40793, 42066, 39010, 37199, 37256, 45511, 41871, 40771, 41930, 34872, 38491, 38081, 38072, 30644, 23975, 18308, 11793, 11801, 16408, 29051, 30319, 28625, 23661, 25589, 29806, 31161, 23790, 25903, 27650, 33874, 32271, 22753, 12770, 8621, 11714, 12492, 13749, 23142, 24680, 24109, 21492, 25546, 30411, 30590, 25788, 23781, 16940, 19951, 30802, 31078, 35416, 39105, 36321, 38409, 33521, 26214, 19252, 17057, 13385, 4984, 19720, 24227, 16127, 3483, 12442, 19718, 21747, 20216, 28200, 15079, 9273, 18685, 13324, 12724, 21831, 19345, 24253, 21733, 14077, 7190, 12959, 14911]
11447A4911p331K38L794N218M396N531N508Q48m772j1402l431m61p590k228J4622
11432A7851O076j4037m951L383L790O619p096j0981n467J2863R218O234n779l260
11418A4463j472j2333M2J2506N35j2359o670o235Q219j731n804N070O818J508
11404B557M938K951Q04l032N380M582q115R332J1661o32j1283p345n09P667o51
11389A8305j824j703n740L01R237O788R93L17o240J848M441J737n9p089j0909
11374A0403m828l142K803R437J757o591r929J991L622N376N345n018j543L785
11360A3468q00p758l349P999N728j589j210K255n141J946J2539jn211M63r542
11345I797r423q113q19J0139R791J054j454p055J47P273O464N27q021o059K941
$$ y = [14911, 7580, 7818, 11612, 16830, 21226, 26757, 32265, 33113, 28341, 16939, 13508, 13047, 5457, 3229, 17851, 23927, 9890, 4939, 8322, 12112, 18731, 11635, 654, -4813, 8050, 17268, 23502, 17723, 14463, 12991, 658, 700, 13206, 13741, 1382, -5288, -11523, -3304, -5035, -10839, -5769, 1049, 2557, 7495, 10446, 11250, 8218, 13598, 18180, 10065, 19397, 31058, 30426, 19143, 11798, 11289, 18956, 18305, 16481, 14778, 9038, 9339, 18576, 25364, 26357, 26674, 20434, 22282, 26723, 28460, 28401, 21312, 10403, 5575, 2433, 5236, 14673, 16430, 9839, -90, 1901, 5523, 10899, 16244, 11226, 9683, 13468, 12668, 4910, 1561, 9560, 15288, 13699, 12489, 14744, 9603, 11549, 24088, 24087, 18876, 19339, 9797, 374, -7739, -8558, 1581, 11372, 12426, 10972, 3917, 4064, 11337, 17801, 18328, 10307, 4248, 7189]
11330G189j433Q022L588r898l879P366j1412q819j673P014n05N039R381K071N242
11315A7293o393j3897r510J0082L245n107k431j924L945K152J0773N131o008j1729
11301d378p011J481N630L262m004Q152M286K647N856m812j0110K310q05K600O802
11286A1906N06o689K524J0114L188n119N731k942n145k681J694J456P246l061
11272A8728m972P311j0933j6107r166k433P108L150O915J620K957l716Q340j0062
11258a260n193J274O536j050M106J320l436j0364n811O093J5440N385N45L209
11244A6794j365r27j394p738m063l510j721J095N402j741j16p852Q63k850O890
11229b233Q913O948K42P45P7l673R730m518j9754l293J01n0K024K779J0461R902
$$ y = [7189, 5756, 13778, 17366, 7468, 3589, 10955, -457, -9276, -10949, -3935, -4440, 599, 9980, 12051, 17293, 10900, -2997, -12507, -2425, 820, -4287, -6718, -8642, -4697, -2545, 8228, 13359, 7351, -4378, -11389, -9908, -4278, -1016, -5020, 3132, 7418, 10065, 15921, 11109, 999, 3309, 2504, 5104, 11906, 12412, 5723, 8247, 18361, 21549, 16430, 22161, 19219, 14074, 11393, 13087, 14543, 21789, 18728, 13756, 21067, 10134, -5973, -15139, -17572, -10464, -7314, -399, 1221, 4178, 462, 8802, -1260, -6453, -5179, 1357, 307, 4413, 5733, 2297, -8067, -13878, -7785, 7655, 13040, 13585, 16794, 15429, 14502, 13108, 5370, 1307, -2203, -3924, -2829, 2573, 832, 716, -7136, -6273, -9123, -2233, 6680, 13628, 13870, 14615, 14692, 11019, 20749, 16231, -3523, -6816, -6715, -6765, -4741, -1962, 8499, 18401]
11213A8401J985j1556j1321k773r48L680R573J0855r33l8k686j481M424n708o480
11198D994J413l921m011L971K72j287k749J107k805J0832J662p064P342l651r846
11183c741m009M727N538K309J0367k390j5961M298M903k895l491m611K203P054
11169D301k651q987j971M34P574M73m953O450l57o831j2959j517J5130J5258N024
11154A4418o093q996j2846M087K221o8P447N970m417o144P152P239n150o034K77
11139i37n491N740J3647O663P271o193j0561q138l757l733q371l501J3886j04
11125c579m095j392J845R53M640N582L142J179k203M518k416m294r289n914O693
11110d630j586L318l994j0043J464R324M384n520l521J217n403p763K474m040
$$ y = [18401, 20386, 8830, -2491, -5264, -6212, -2532, 7041, 17896, 16963, 16925, 14239, 12758, 17182, 11474, 4994, 6407, 2486, -1525, 2446, 2718, 1431, -1318, -211, -3016, 7816, 9478, 2414, 9756, 6105, -3741, -7750, -3023, 2515, 4824, 15191, 12801, -3160, 1138, 6041, 3146, -345, -4956, -2753, 4301, 1650, -7337, -9308, -8874, -1300, -827, -5780, 670, 313, -6518, -19477, -20994, -5864, 9394, 14418, 8325, -671, -13517, -9430, -7209, -7277, 170, 6140, 1723, -4421, 2731, 9970, 4820, -1214, -937, -6428, -688, 12959, 19622, 26893, 20700, 10139, 2001, -1756, -5489, -13860, -17361, -3475, -3579, -7674, -9066, -7221, -6268, -1628, 3954, 7096, 8275, 6072, 10590, 8174, 3880, -5409, -11323, -4630, -6216, -2898, -6892, -16935, -15471, -6147, -1763, -7283, -10804, -9587, -14990, -22753, -20279, -24319]
11096b4319K520J305o19K600M508P471J732J4102P105P64q9j0908o532L212n207
11081b355j740K956N517L832K295R56l078p136k598P7n955L92O834P276j414R06
11065F765p61m059o825o78R002P426N008o294M101P895l218P97r035m773O67m851
11049A167j853O312N090J3040J6954M437r773n067n676J027R5n975O186K006K712
11034C0682N885J3303k550M664P3p311K423k37o129n346L261O401M360Q082l63
11019E7198L164J157n100j2414p401N376l789K282L291P082O681j937l263k529
11005D9798j0523j6474m455J479M907L433k483k942m18N690N949m673j0810o806
10991A1672j005o720q465Q57l078K18N52O718J871J139j31N347l6M052L670j0480
$$ y = [-24319, -21799, -20494, -21113, -18513, -14005, -6534, -4802, 9300, 16405, 17169, 17080, 6172, -360, 2852, -2355, -4095, -1139, 4378, 8210, 10505, 11461, 8383, 1247, -1351, -1274, -7229, -6837, -3, 7273, 5859, 6765, 6004, 1945, -4880, -5558, 3444, 10870, 15878, 9584, 13685, 21580, 18362, 19159, 10124, 5351, 6018, 1167, -686, 5626, 10716, 23756, 40710, 45147, 35374, 30307, 24631, 25658, 25753, 19778, 25964, 27970, 30682, 36567, 49870, 47320, 51984, 52057, 44746, 47169, 46932, 40803, 35457, 38718, 45119, 49479, 57561, 57198, 60362, 61519, 56419, 44005, 36604, 41980, 38191, 40473, 43764, 50846, 57527, 55590, 52327, 49798, 39275, 22801, 18346, 19825, 24732, 28165, 25682, 22740, 22322, 28012, 33961, 29288, 18478, 11672, 10667, 3947, -4518, -3661, -6739, -6521, -5969, 749, 2620, 3759, 3628, 8975, 8939, 12991, 16661, 6181]
10975F181J232K515Q08n170o961m64P485j803o894N810l628L415l457r731M34
10960a0228N034k594r21N55m300Q076N182M430L98m494k932k978l058M391J1955
10945H516O574l951j0177l22K620K827O429o999r034o878M144l294m197P060m364
10930a1046M935M528j746l954J659n963N827P669M901n64q439P406J9761M621
10916B9595m611p952j1928k906J802q948n338J846K260O464q249k524O087Q216
10902C814J695M31j1455k526p669n30J6842J6979L996m199r577j0440r624N061
10888g202J0613q893r920P360o40r32O596P219j39p86L078j0214l821N921J389
10873c71m661o013L750J3365j270K242l330j258k402L003M028M743J843p746q673
$$ y = [6181, 7413, 9928, 10736, 5566, -1395, -1859, 5626, 3823, -3071, 2739, -889, 2526, -931, -10662, -10228, -5194, -7788, -8709, -8154, -12454, -4378, 804, 5234, 5632, 1138, -1794, -4772, -7830, -3439, 8516, 15090, 11139, 962, 640, 3260, 6087, 12516, 5517, -3517, -10395, -6251, -9545, -13742, -6682, -11046, -6111, -1583, -3329, -7283, -5624, -11587, -5760, 1909, 6810, 6246, -2193, 5213, 24974, 29595, 24984, 17032, 5104, 2198, 4000, -4948, -10286, -8440, -6180, 284, -7965, -10489, -4402, 3814, 5509, 5940, -5515, -8041, -15710, -16240, 602, 17581, 21577, 17378, 7801, -2639, -12263, -7202, 3411, -5482, -15402, -8042, -8682, -9614, -3018, 4201, 4062, 3276, 6354, -3860, -7681, -1760, -371, -5032, -11045, -7295, 6070, 4800, 7042, 3712, 2454, 52, 3055, 7083, 11826, 13669, 5923, -2750]
10858b750k50J0560J536J857o92m175n716o923l642o65J0254M183k291m575q35
10843d124o009k178O059o44o776O406Q098K113O495N337j536n832l742j0717k922
10828i972r24J605n13O451L291O022o396r101O977m3M593L993n530K235J401q661
10812d572L710J0795n563j429J762J384O978o987r308J748J466m693r33j297K673
10797d266M717P876k125o224M448P66q177l056m69n285m107P722L493n186j0392
10782b0265N6k354N093k046l785M388J2767R771J751n140j976L433K61n531l485
10767g062l444P662R998m99n440j3685p681Nr05j0037j000K023L351K161K359
10752b2194L477J0791K377j849m700o010p45N087J2358L295k322O916N941J766
$$ y = [-2750, -3000, 7560, 9096, 10953, 10261, 6086, 370, -6553, -10195, -10860, -606, 3577, 1286, -3289, -4124, -10133, -12311, -6252, -6896, -13672, -7266, 832, 2945, 9440, 14777, 13241, 7409, 3667, -7050, -9972, -10896, -9291, -9804, -3353, -62, 5960, -436, -9537, -2560, -2603, 1990, 5983, 453, 2688, 4089, -4572, -862, 9933, 4370, 2941, 4703, 6087, 13065, 6078, -3230, -1482, -16, -4709, -5642, -6939, -4266, 451, 8327, 6202, -22, 4426, 5192, -2985, -6041, -6510, -11795, -15902, -8180, -4687, -9873, -20265, -20209, -22563, -17470, -19516, -23301, -18913, -6146, 3625, 5376, 236, -1740, 1693, 1954, -3577, -7062, -10506, -2844, 7154, 6655, 1215, -12470, -20151, -20146, -21051, -31088, -32088, -30065, -26714, -24553, -22194, -18717, -7926, -5549, -7398, -12098, -18108, -18853, -13766, -1408, 1887, -435, 6481, 12422, 14188]
10738A4188n005j729j56j2483M02j061R824O898N419j8k693M331M188n356o044
10723A0705p147P765K228K496l31n404M435P514j756j878J736L341K874n251r662
10708A1665P383k499m184K318o729J496J119j04l777M716N384j888r20j791j241
10693A0948O069O728q240l511K767N030M31o000l918k126m495R654K69m124J401
10678A0883P652J062j0022l396L083M424Q479j874j1277j0272L903R2N451M263
10664A2451K801l12J569k57j493P818R346M601n754J11O492M523M368Q417k438
10649E2243P94K528M478M326j956k442P095O132n224O123J508n73J1483O759K3515
10634A16789J4167R002K4521K8391K1433J0382K0478K9364K9193M2881N4315O2724
$$ y = [14188, 9183, 7454, 7298, -5185, -4783, -5844, 3980, 10878, 16297, 16279, 13586, 17917, 22105, 16749, 10705, 3558, 11323, 13551, 16047, 15716, 10312, 14747, 22261, 20505, 18627, 20363, 23704, 26578, 21327, 11665, 19048, 16549, 12365, 14683, 7954, 9450, 10569, 10465, 6688, 11404, 16788, 14900, 13980, 12189, 10948, 17017, 23745, 15505, 11994, 14761, 19791, 20222, 14222, 10304, 8178, 3683, 13337, 13606, 9482, 10883, 18535, 19597, 9575, 6179, 9262, 13686, 22165, 20291, 9014, -1258, 2645, 2737, 8188, 12451, 15252, 14940, 16509, 16252, 14759, 22577, 31923, 36524, 30770, 30881, 37373, 41896, 46264, 54681, 52243, 53037, 55565, 60043, 64369, 62413, 59971, 67066, 73198, 67974, 74097, 75605, 75032, 86515, 93274, 116789, 130956, 139958, 164479, 192870, 214303, 224685, 245163, 274527, 303720, 346601, 400916, 463640]
10622D63640Q2898J15429J60139K28514L10228M25493N51167O56018O47036M94634
10612D135196K53505K3269j31143j62380p8202R7782L63780O89894J023189J283362
10602G498252J263451Q28616J98875l60551p04920p32505n12243j47208L09466
10593G641233Q24877J328604J645846J480995P31757k22318j009081j442576j454410
10584I524927j143493p07621k41778K17086O14960Q15988O66493J48315m91087
10575I403790r79663j203732j149986q97347o06386l18201o9617J09970J81856
10566D470684R2036j19051l63607n47169o22223n94367n01545l93660l02897k17434
10556I00767j63624j22155q7186o8591n7585n3814m1465l8875j7829k2067j5346
$$ y = [463640, 546538, 661967, 822106, 1050620, 1360848, 1786341, 2337508, 2993526, 3640562, 4135196, 4388701, 4411970, 4280827, 4118447, 4040245, 4138027, 4501807, 5191701, 6214890, 7498252, 8761703, 9590319, 9789194, 9428643, 8723723, 7991218, 7478975, 7331767, 7641233, 8466110, 9794714, 11440560, 12921555, 13653312, 13430994, 12421913, 10979337, 9524927, 8381434, 7673813, 7432035, 7649121, 8264081, 9080069, 9746562, 9894877, 9403790, 8424127, 7220395, 6070409, 5173062, 4566676, 4248475, 4178858, 4288828, 4470684, 4562720, 4443669, 4080062, 3532893, 2910670, 2316303, 1814758, 1421098, 1118201, 900767, 737143, 614988, 527802, 459211, 401626, 347812, 306347, 267472, 249643, 227576, 212230]
10545B12230k0359j3962j6141m231l848k0726q198o417n089n299n151j1696q92
10532I0221o998l227J088n644j2474J723k339q2J029m326K400j744J803Q60l958
10517E8332l914n00K284o862L82J304J08m84j5348k020K555N313J845n377k143
10502C5475j373L359n032R613M97M011J706n620p094m003l287k231O742N04K98
10487C3565o357p689k646k268k794K262n66r783o501N057M035J82m75N407J1n110
10471F330M025K989l226j145J111l573J587j68P85o840K300m344j025o11J896
10456I1J80j1234j306O001o22o241Q125k74M454j265M621N476j532R78j247M272
10440A0477L100m727N940Q846n364m816O76K477P494K802o191l990k919m030n312
$$ y = [212230, 191871, 177909, 161768, 157537, 153689, 132963, 124765, 118348, 113259, 107960, 102809, 91113, 90221, 83223, 79996, 81084, 75440, 62966, 64689, 62350, 62268, 63297, 58971, 61371, 59627, 61430, 62290, 58332, 54418, 53918, 56202, 49340, 49722, 51026, 51134, 50650, 35302, 33282, 35837, 41150, 42995, 37618, 35475, 34102, 37461, 32429, 42042, 42539, 46550, 48256, 42636, 35542, 31539, 28252, 26021, 32763, 33267, 33565, 27208, 19519, 16873, 14605, 11811, 14073, 13507, 3724, -2777, 2280, 6315, 6497, 6022, 11429, 11440, 6330, 10355, 13344, 10118, 8973, 10084, 6511, 8098, 7930, 8715, 1875, 4175, -169, -1194, -1805, 91, 271, -10963, -12269, -6268, -6890, -13131, -5006, -5280, -826, -2091, 2530, 8006, 6474, 7452, 6205, 10477, 13577, 8850, 14790, 23636, 18272, 13456, 14132, 16609, 24103, 26905, 20714, 16724, 13805, 9775, 4463]
10425D463K150Q19Q366J0324l62r192O67N873j891n769L636P16p585j907n202
10410E106n582J3587Q005q640n688k652M234k996R9l670K296l451n273O978k58
10395B095k870l561N504M378k1N194k261r278K348J0829L40l673k716n060n038
10380c790L701O060K126M140n094L611K608q41o37j0182l015k025Q765m757P623
10365H293J246n75J609j040n796o171N625J14r06j509N250P275n935l539L819
10350G760m096O172j0469q502M140R432l353r700K540n109q648N675N546R346
10336G34L637l293k18K534Q92k572m332q507O225P181M551O236o658k437n080
10321a107j382K120n824N013J999j373j008J591L418O66l41N144l201o007q496
$$ y = [4463, 6613, 7432, 15798, 26122, 25760, 16568, 17235, 23108, 21217, 15448, 19084, 19800, 12215, 10308, 5106, -476, 13111, 21116, 12476, 6788, 4136, 8370, 5374, 5473, 1803, 4099, 648, -4625, 2353, 2095, -775, -4336, 1168, 5546, 5525, 10719, 8458, -820, 1528, 12357, 12697, 9024, 6308, 1248, -3790, -89, 5971, 8097, 12237, 7143, 10754, 13362, 12521, 11884, 1702, -1313, -3338, 5427, 670, 8293, 9539, 8964, 10573, 9533, 3737, -2434, 3191, 3305, 2399, 890, 6140, 13415, 7480, 3941, 7760, 3664, 9836, -633, -9135, -4995, 4437, 1084, -8616, -6076, -11185, -19833, -14158, -8612, 734, 4371, 1078, 860, 3394, 4286, 1714, -2618, -11125, -4900, 2281, 6832, 13068, 6410, 3973, -1107, -2489, -369, -6193, -1180, 819, -554, -1562, 29, 3447, 4113, 3772, 8916, 5715, -292, -8788]
10306h788l48J2332O836M914l051l875j2151k371J0088J0040Q14j570m097n30
10292H243o159l387k369j2945j2132O702J4689K417K392Q622m359r247o184k882
10278a6599J635P048J2188Q782P701J1507J1859K3884K9629K0769J8349K6089
10266A62841J8563J8261L714j634l406r35j4672m3484l2045k8117k4407j0246
10254D4433p724j9604k835M640N2n419n377K195k4q194K11M188l623n106P80L035
10238A628L506Q594L697o383n445m77p984l858M817K939l572j583j781M60J925
10223c517J350M04n507J294N612J889n353j704k654l552M70k468M392J0544J2629
10208A3829o91r080o207k592m018l809o401k831m273J1901M072N179l476j001
$$ y = [-8788, -9136, 3196, 10032, 14946, 11895, 8020, -4131, -6502, 3586, 13626, 14440, 12870, 8773, 8243, 2084, -1303, -3672, -16617, -28749, -22047, -7358, -4941, -2549, 6073, 1714, -7533, -13717, -16599, -14964, -7916, 4272, 13054, 20755, 32262, 44121, 68005, 97634, 118403, 136752, 162841, 181404, 199665, 203379, 201745, 198339, 197404, 182732, 139248, 107203, 79086, 54679, 44433, 36709, 17105, 14270, 18910, 18962, 13543, 8166, 10361, 10337, 2143, 2354, 6542, 2919, -2187, -1407, 1628, 5134, 13728, 17425, 11042, 5597, 5120, -2864, -6722, -1905, 1034, -2538, -4121, -5902, -5442, -3517, -2167, -1763, -7270, -5976, -364, 1525, -3828, -5532, -8186, -11738, -11268, -13736, -9344, 1200, 13829, 13138, 4058, -2149, -4741, -8759, -12568, -18969, -21800, -26073, -14172, -10100, -4921, -8397, -9398]
10194i398J458k080O267o6j383o05L562p23k199K386k79j215P077M852J983m578
10178E059L030K404k364L110O230j0736n813L34k923J115J4257Q638L90L932J3440
10163D0103J759m840j451k687m974o213N936M691J3225J2084J0467L697k892j0824
10149E8081j2334L948k066n876j575n592j770J2385j724n091q561j0583o890p468
10135D884r48k859J2048M51q639p263m034P107Q473L23n898m566j780m310j3638
10120b0649m004J4365J0511L266q877r058j0105O193R33J780O73j672O045P145
10106c454o882j091N244l185Q603n312m321M494p915L564P911L097O518k081q674
10091c484m813n751M075J4819N696k7r00q624j0143k361o979L64J233J116jK54
$$ y = [-9398, -7940, -10020, -3753, -3819, -5202, -5807, -2245, -2968, -5167, -2781, -3060, -4275, 2802, 7654, 9637, 5059, 8089, 10493, 8129, 11239, 17469, 6733, 920, 1254, -1669, -554, 13703, 22341, 22731, 26663, 40103, 41862, 37022, 35571, 32884, 27910, 21697, 27633, 32324, 45549, 57633, 68100, 71797, 68905, 58081, 45747, 49695, 47629, 41753, 40178, 34586, 32816, 45201, 43477, 38386, 29825, 19242, 12352, 4884, 3936, 1077, 13125, 13576, 4937, -2326, -6360, 747, 9220, 9543, 3645, -921, -2701, -7011, -20649, -24653, -10288, 223, 3489, -5388, -14446, -24551, -18358, -17425, -15645, -14972, -16644, -10599, -3454, -10336, -11427, -6183, -9368, -765, -6077, -10398, -5904, -13819, -10255, -2344, 753, 7271, 5190, -3484, -8297, -14048, -9973, 4846, 10542, 10515, 9615, 991, -9152, -11513, -18492, -18128, -16895, -15779, -15780, -15526]
10075a5526Q13N662n16j3174O878J6976M191J751l479m800M150n65m078o820j0145
10060a8682N499L303N255M648M9r47J853K039L599L221j869j2438m692J371Q827
10045A036m915J751J240m267l560M149L785l73l076p918l09p84k972o517P556
10030a5174M694K358q957J513m353j472J3062Q441j084j1302n789N866k319R66
10016a3550P623J973k874o14j920j977j0459n888N1R47N595Q004M57J0481M557
10001B406l163j597J860L368j70L8n937p044k772j584K591j12K576K054m1P912
9985C85P26O146N976m267n293K969k018q467l380J0899l73m632P862q835k640
9970d942L830O03o224k032L580k19j839J252M564K73o958p742j0261M664K963
$$ y = [-15526, -14713, -9051, -9567, -22741, -15863, 1113, 5304, 7055, 3576, -1224, 2926, 2361, -1717, -8537, -18682, -13183, -9880, -4625, 23, 72, -875, 978, 3017, 6616, 9837, 7968, -4470, -9162, -7791, 1036, -3879, -2128, -888, -5155, -8715, -4566, -781, -1154, -4230, -12148, -12457, -13241, -16213, -22730, -15174, -10480, -8122, -17079, -15566, -19919, -21391, -8329, 112, -972, -12274, -18063, -12197, -14516, -13550, -5927, -3954, -6828, -7442, -9362, -11339, -21798, -27686, -27635, -26688, -21093, -13089, -12632, -2151, 2406, -757, -2354, -494, 2874, 2704, 2742, -3195, -10239, -13011, -14595, -12004, -12116, -9540, -7486, -7527, 385, 1111, 7257, 13233, 8966, 3673, 6642, 4624, -3843, -7223, 3676, 3303, -1329, 6533, -2302, -4942, -1112, -509, -6733, -8765, -5185, -5404, -7243, -5991, -1427, -1154, -8112, -15854, -26115, -21451, -18488]
9955a8488j987M090L19j859l720r518N537R182P776J358n733j652N730J0989j128
9940H96o661o406N322p809n42J0845N987n676m555o176l089L828k299L915J832
9925a0588l070Q01m519K306L440p2M28R086j872N789q116m487K907O188o266p145
9909a5190K35k137R752J4137q507r621P55M911M671K792j803N69Q21m257o858
9894i730j114K722o017O314K065j832K262K753j680L661O691m875o30p176k780
9879i366O956M663l493J151K674o122M070L364j4544l223J0575N676L352n226
9865E07k100J806l876N43J0607K236r77m063n059J447l174j2372L890J7056j431
9850E040n67l8p311j4869j080J014Q696J1300j336n729o340Q022K251r600q369
$$ y = [-18488, -20475, -16385, -16066, -17925, -21645, -31163, -25626, -16444, -8668, -7310, -13043, -14695, -8965, 2024, 896, -5765, -12171, -6849, -14658, -15200, -4355, 1632, -4044, -8599, -14775, -17864, -14036, -16335, -12420, -10588, -13658, -12857, -17376, -15070, -11630, -11702, -11274, -2188, -4060, 1729, -6387, -10874, -7967, -1779, -8045, -15190, -14955, -17092, -7340, 6797, -1710, -11331, -10576, -5665, -994, 1798, -5, 564, 1385, -2872, -9730, -10844, -8122, -14139, -7825, -5760, -7592, -5330, -2577, -4257, -596, 6095, 1220, 590, -6586, -9366, -2410, 2253, -1240, -89, 2585, -3537, 533, 3897, -10647, -13870, -3295, 2381, 5733, 507, -1593, 213, -3663, -3120, 7487, 9723, 8746, 4683, -376, 1071, -2103, -14475, -10585, 6471, 5040, 4473, 4435, -2876, -17745, -18825, -17811, -9115, 2185, 849, -4880, -11220, -3198, -947, -10547, -18916]
9835a8916j921K963r790P678J1900L551M162L929p346k986k33j891R75k711n342
9820a5978L082J731J704J346Q636n689N50M553m187p413n192p138q204J3253R728
9805i218m19L787K321k454L631K498p010l579J502J970k173J901J404K542n947
9790i244l326K197N57P228L920n004l76m45M950O981k676p387n649P67P603N717
9774E813q22J878K511L750k846m257m888o429l823m789j428Q791N234J083L82
9759A60j2790K998m44r420K293P39L225Q575Q01k49k709l144l725n766k478o59
9743b2593N133K781J331L366o043L92j126o078q88k834N182O832p33k665Q05N373
9727a1765n8m680K507j443k943P890k418J815M350J2197j054j027O776n15o460
$$ y = [-18916, -20837, -17874, -27664, -19986, -8086, -4535, -373, 3556, -3790, -6776, -7009, -8900, -7925, -10636, -15978, -12896, -11165, -9461, -8115, 521, -5168, -4618, -65, -4252, -11665, -16857, -23995, -32199, -18946, -9218, -9637, -5850, -3529, -5983, -2352, 146, -6864, -10443, -8941, -6971, -9144, -7243, -5839, -3297, -9244, -12570, -10373, -9816, -2588, 1332, -3672, -4048, -4493, 457, 7438, 4762, -2625, -8274, -7507, 96, 5813, 4991, 6869, 9380, 13130, 10284, 6027, 1139, -5290, -9113, -13902, -15330, -6539, -1305, -222, 160, -12630, -9632, -10076, -19496, -17203, -16464, -13239, -4664, -3863, -4112, -6821, -9965, -13690, -19456, -21934, -22593, -17460, -14679, -13348, -9982, -16025, -15633, -16759, -22837, -23725, -26559, -21377, -14545, -15278, -17943, -17138, -11765, -11823, -16503, -13996, -15439, -18382, -10492, -12910, -11095, -6745, 5452, 4398, 3371, 10147, 9632, 3172]
9712C172l350N787k885o329l154L497o229j107k670m928l144N494L27K858j365
9697a4026n004kQ707m972l329Q946O062K080m842o217K181J3606J1654o346l620
9682D878R69J30j5888k325R632O562J194m005n057N437N551n492l894n276L516
9667d068K480l959Q31M500m76m805P505o070L502j357K193L162j338J7656K2540
9652D2296J5987O022m671k4172j5578p449j1817j1085O59l668q802M537J3371
9639d370J2702j274q851o396j646K580P16J378m851l845o188L872m61k653J057
9624a8230L561J2809O659J9k573R68q197p498K239k548P22L859K774o185K271
9609i350P434O100m358l285o42k344J081r33M986j030l324o506L044O800O048
$$ y = [3172, -178, 5609, 2724, -3605, -6759, -3262, -9491, -10598, -13268, -18196, -21340, -15846, -15519, -12661, -14026, -19030, -19032, -10325, -15297, -18626, -9680, -3618, -1538, -6380, -12597, -10416, 3190, 14844, 8498, 4878, 5847, 5977, -9911, -12236, -2604, 3958, 5152, 1147, -3910, 1527, 7078, 1586, -2308, -7584, -4068, -1588, -5547, -4716, -216, -692, -5497, 2008, -4062, -560, -1917, 276, 3438, 2100, 19756, 42296, 58283, 64305, 59634, 35462, 19884, 12435, 618, -10467, -9808, -13476, -22278, -17741, -4370, 8332, 7058, -1793, -8189, -9835, -7255, -6539, -5161, -10012, -13857, -20045, -16173, -16634, -19287, -18230, -14669, -1860, 4799, 4818, 2245, 3213, -4984, -12482, -10243, -12791, -12069, -8210, -5436, -11621, -9350, -1916, 4184, -174, -3459, -4101, -6445, -5364, -6297, -1311, -2341, -5665, -12171, -9127, -2327, 3721]
9594C721P473n837j3061k819N213K605j419K847r5j920n247p134J0028O382N338
9579F075n05j4448j1102O369P735J250o78M104R388k881o37j099o243J014m436
9564f094K390j360N568l688K631K545m797o886q393m075N86J3498J495q063n752
9549b0395m62k51N13J027L427P985O324N186J780J026j0437j4174o782K030L538
9534a9665M342M317R962k170m014R84k975K971J1621m692M61M348l262M913l057
9519D084p209Q05K296k425K428j880o66N626n728o336r096N003J513n209O346
9504a0448J4368O661m630k293o953r970p467k27N952J2803N78r27p06n441n018
9489a3718P92o133r8J1109J116M081j40M369J833m064p38N556k165J93q68k711
$$ y = [3721, 11194, 5357, -7704, -10523, -5310, -2705, -4124, -1277, -1372, -3292, -8539, -15673, -5645, 737, 6075, 5570, -8878, -19980, -13611, -5876, -4626, -5304, -1200, 8188, 5307, 4670, 3571, -2672, -1658, -6094, -3704, -5064, 504, -3184, -553, 1992, -2805, -9691, -18084, -22159, -21573, -8075, -6580, -14643, -20395, -20857, -21108, -20595, -19568, -16141, -8156, -1832, 3354, 5134, 6160, -4277, -18451, -25233, -23203, -19665, -15323, -11006, -1044, -3214, -7228, -6244, -9219, -6248, 5373, 681, 1142, 5490, 2228, 7141, 4084, -3125, -2320, -24, -2449, -21, -1901, -2567, 3059, -2669, -9005, -18101, -13098, -11585, -16794, -10448, 3920, 10581, 5951, 3658, -3295, -13265, -20732, -20959, -15007, -2204, -1626, -2553, -3259, -8700, -13718, -12926, -19059, -19157, -8048, -6932, -2851, -2991, 1378, 3211, -853, -1591, 3965, 1800, 1993, 1125, -1586]
9473a586P375k550p409q91L756J177K114m625L52n81j644r746j1011R765K623
9458a2881l278M140O799m355n952N285M118J441q802o722O962R194n411l156L712
9443h906K343p517K86M631l63M221K109j246o859J968k634p60P86O76L316j1828
9427a9777q048K594J4059O51P315M465q202j803K015j436J911o203P808N351J297
9412A997K784o83n406p0J915m873q600m466K773m0M707Q983n263M69J4931K900
9396A2058j737j1593r766o506m935K609M653Q844R109k408O861j337n76n4N09
9381E731p22Q11j850j3153k795J0545J5411p886q897j434J149O531P033J995q666
9366C803m249R252q289m886P21J3239R768m908o199K929L845l294j1259p281R488
$$ y = [-1586, 5789, 3239, -4170, -5061, -1305, -128, 1986, -2639, -2287, -2868, -4512, -14258, -25269, -15504, -12881, -16159, -12019, -5220, -9575, -15527, -10242, -6124, -4683, -13485, -20207, -13245, -4051, -9462, -12618, -8906, -6563, -14080, -13794, -9163, -9526, -5305, -3196, -4442, -11301, -9333, -11967, -12727, -11941, -11265, -7949, -19777, -27825, -25231, -11172, -10521, -3206, 1259, -6943, -8746, -6731, -8167, -6256, -12459, -4651, 700, 1997, 4781, 4098, -1308, -1378, 537, -4336, -12936, -17402, -14629, -14669, -9962, -979, -6242, -5773, 9158, 12058, 10321, -1272, -11038, -17544, -22479, -19870, -15217, -6373, 2736, 328, 7189, 5852, 5276, 5222, 5731, 5009, 5820, 3970, -9183, -11978, -1433, 13978, 6092, -2805, -4239, -3090, 3441, 10474, 12469, 3803, -446, 8806, 517, -4369, -3648, 9591, 19359, 14451, 8252, 11181, 15026, 11732, 473, -6808, 2680]
9351B680L157n872m421r7P207J286j484m861j943m548j0733k96J2260L697l956
9336g924m275j499l184L789O206M357M464l64M144l28M626Q428l329q815O3p464
9320a105k154O177m602m283O295j373o19K543M313J0417R31k307l289K086K768
9305A5798j277j0087q132p478p552J1626P733r126J042J0073K37j2944l127k774
9291a5988K036N29M459n84K083K119m584Q316j95p265O46o37Q24M949O327k279
9275G56N016k530m246n130l763N578L852j139l616lk507l583J985O47m74K9J0071
9258I43J811p885k683J400N568R058K397m414Q840o168o088m687o117K268O6j763
9242g454N840k19J000k657k339J079P280k328o292n255N863j149l43N59j959K621
$$ y = [2680, 5837, -35, -4456, -4553, 2654, 3940, 2456, -2405, -4348, -8896, -19629, -19925, -7665, -3968, -7924, -12199, -13698, -16882, -13093, -6887, -2530, 1934, 1570, 5714, 5386, 10012, 18440, 15111, 6296, 6359, -1105, -3259, 2918, -1684, -5967, 328, -1045, -1664, 879, 5192, 15609, 16540, 14233, 10944, 13030, 15798, 14521, 4434, -3698, -11176, -18728, -7102, 631, -8495, -7453, 2620, 2857, -10087, -13214, -15988, -13952, -13423, -8964, -9548, -7465, -5346, -9930, -1614, -1809, -9074, -8428, -9065, -8241, -3292, 3035, 756, 5772, 3242, -1004, -6134, -9897, -4319, -467, -1606, -5222, -5225, -7732, -11315, -9330, -8683, -9157, -9128, 943, 2754, -5131, -7814, -6414, -846, 8212, 10609, 6195, 15035, 8867, 2779, -1908, -8025, -5757, -5691, -7454, -1614, -1833, -833, -3490, -5829, -4750, 2530, 202, -6090, -11345, -5482, -6631, -6974, -6415, -8374, -5753]
9226e753N021M314K433j3568k773k71N814M013N023M539p168j2785o876k786K813
9211a8010R571m90m356J416L102L602O709M501l226q15j651o713r406J074Q662
9196f030O174R57J806l215n120l437r532k503P203R33l905k56O018N290N250k137
9180b504n976K769m828L608L55l327l27P392l285j6017l59Q023l658l204K259
9165a9079P3o581l957J555O559Q303J1915M301J255k543m485j3456K770J1595
9151a775J068m550r899M289L895q104K58R950J014O557M662j697K42P284m075
9136I119m505k80j825J380M683L493Q341o097j0832j682P240N079j912j778j201
9121I223J737K247Q325J783r341j2135p059r058M571j038n041k996O289O1l945
$$ y = [-5753, -732, 3582, 6015, -7553, -10326, -10597, -4783, -770, 4253, 8792, 1624, -11161, -18037, -20823, -18010, -8439, -8929, -13285, -11869, -8767, -5165, 1544, 6045, 2819, 2004, 353, -6360, -15766, -14692, -6030, 144, 1101, 2907, -308, -5428, -8865, -18397, -20900, -13697, -12764, -16669, -16925, -10907, -5617, -367, -2504, -8480, -5711, -10539, -6931, -6576, -9903, -10230, -2838, -6123, -22140, -22499, -14476, -18134, -21338, -19079, -19006, -25587, -29544, -27989, -21430, -13127, -1212, 3089, 4344, 1801, -2684, -16140, -13370, -1775, -707, -5257, -15156, -10867, -6972, -15076, -14818, -4868, -3854, 2703, 7365, 5668, 5910, 13194, 9119, 4614, 4334, 2509, 3889, 8572, 12065, 20406, 14309, 3477, 1795, 9035, 14114, 12202, 10424, 9223, 10960, 13207, 21532, 23315, 13974, 1839, -5220, -14278, -9707, -10745, -15786, -18782, -12493, -12432, -16377]
9106a6377p548j361j281L301M879K915J3P550O28p953k297o424J311J841N028
9091a5775j1190j3414O365J3352M487j673J0042K1642L9043M7222L6311J9595
9079A56007J6973r179k8221j5235k0661j9116k445j122J766O71j4668l870L278
9066F4178q792m466P69O556K782K020M122k508j2914r009r025p690o341k916Q088
9051B4854J7292J3336L47o903m761k668N875N099N437l88m609k333K330O103K296
9036F1307J1732P80J1936J1117R731k472K70J4918J5274J4337J6422K5550K4132
9023B15034K2125K6297L9427N6607Q8428J05657J34697J63680J78145J90865J83245
9012A404207J40351Q4676J0095p0378j34108j82090j81719j77660j63980j39617
$$ y = [-16377, -23925, -25286, -26567, -23266, -18387, -15472, -15459, -7909, -7281, -15234, -17531, -23955, -22644, -20803, -15775, -26965, -40379, -34014, -20662, -16175, -17848, -7806, 13836, 52879, 100101, 136412, 156007, 172980, 163801, 135580, 120345, 99684, 80568, 78123, 77001, 78767, 79438, 64770, 60900, 64178, 55386, 50920, 51689, 58245, 61027, 63047, 67169, 64661, 51747, 42738, 33713, 26023, 19682, 16766, 24854, 42146, 55482, 55829, 48926, 44165, 41497, 47372, 52471, 57908, 57520, 52911, 50578, 52908, 59011, 61307, 73039, 73819, 85755, 96872, 106603, 104131, 104401, 119319, 134593, 148930, 165352, 190902, 215034, 237159, 263456, 302883, 359490, 447918, 553575, 688272, 851952, 1030097, 1220962, 1404207, 1544558, 1629234, 1639329, 1568951, 1434843, 1252753, 1071034, 893374, 729394, 589777]
9002E89777r9882q0887o9288n3582m5481k9220k4952j1979j4021j7056p268j0539
8990A25622j7562q898j994j2188j4757q339J76l322k681L029M998k778j1742N140
8976E4704R386M801n637n364k826K32k753q453m625M16M610J2346K038n607n251
8961D8017L24L02Q922Q935k174o562k038M941J963J057n2L142j724j275m892O882
8945F5768K495M739N997k011j804O520N379O587l250L065J9397J1584J0902J7759
8931A53127J4682K7564K5167J4404k0702l3965m1588m3604l4191j2959j3137q691
8919B6107n350r836m209P649N107P124K913M339P326n90p208k524k56r107l603
8904A7882o892j3318L185N35l576o074j3616l445P188O847J1280q271p10J0302
$$ y = [589777, 489895, 409008, 339720, 286138, 240657, 211437, 186485, 174506, 160485, 143429, 136161, 125622, 108060, 99162, 97168, 84980, 70223, 61884, 62060, 58738, 56057, 59086, 64084, 61306, 49564, 54704, 64090, 68891, 63254, 57890, 55064, 55296, 52543, 44090, 39465, 39881, 44491, 56837, 58875, 53268, 48017, 48341, 48643, 57565, 66500, 64326, 57764, 55726, 60667, 62630, 63687, 63635, 66777, 65053, 63778, 58886, 65768, 68263, 73002, 78999, 76988, 75184, 81704, 87083, 93670, 90420, 93485, 112882, 124466, 135368, 153127, 167809, 195373, 220540, 234944, 214242, 180277, 138689, 95085, 60894, 47935, 34798, 26107, 20757, 10921, 6712, 14361, 19468, 26592, 29505, 33844, 41170, 40580, 33372, 30848, 30592, 21485, 17882, 10990, -2328, 857, 1392, -2184, -8258, -21874, -25319, -18131, -11284, -4, -8275, -8985, 1317]
8890A317K208J8824J1833M384o418l714n728k191m059l607j555J2408R067P507
8876D0276R663K095L152J2948K7220L6179M0465M6094L5438K0698M402j5154m1468
8863B22008m0771l5751k9631k6286j3350j4531K020N296q856j9175j0444q930
8851B1599l268q069j1445j8480j6354l544Q578M527J1413J0395J2745J4305M133
8838B6535L176m924j042O575j241m382J997J4458J1471k813q750k977j479p058
8824B9546q155r563o272m391N920L428k488R914Q129J7060K1586J7159K093J620
8810H5586p065k0568k0930p979J1803L2635K9931l19j9519j0772m712q801j6556
8797D2734k1906j6915k658M713N922Q997p919p401q934j3215j0582q462r783j5840
$$ y = [1317, 3525, 22349, 34182, 38566, 32148, 28434, 22706, 20515, 16456, 12849, 11294, 23702, 32769, 40276, 49939, 52034, 55186, 68134, 95354, 131533, 171998, 218092, 253530, 274228, 278630, 263476, 222008, 181237, 145486, 115855, 89569, 76219, 61688, 63708, 69004, 60148, 40973, 30529, 21599, 18331, 10262, -1183, -19663, -36017, -39561, -30983, -26456, -15043, -4648, 8097, 22402, 26535, 29711, 24787, 23745, 30320, 29079, 24697, 26694, 41152, 52623, 49810, 41060, 38083, 36604, 29546, 21391, 11828, 5556, 1165, 7085, 10513, 8025, 17939, 26068, 43128, 64714, 81873, 83966, 85586, 78521, 57953, 37023, 29044, 40847, 73482, 103413, 103094, 83575, 72803, 68091, 59290, 42734, 20828, 3913, 1255, 5968, 11890, 20887, 12968, 5567, -3367, -16582, -27164, -35626, -45409, -61249]
8783f1249k1605j6895k2179k6203k5227k8937n1030p0688q2960r1170r6601k9767
8771f24511Q2581J66946J82554J80386J48876R7376N6333L5064L5853L2003J5960
8760D09421R996J7659Q623J637J2812L705r40O983J3493O645N467J3255K8455
8747E37211M5280M2545N3882M7294N2991J5582m0780o0272q7908r8745o6457n7571
8735C83052n3397l8649k5303n690M088O816R796J345m266j729o195n595m730L318
8721B62861N767P661O045R646J3554J1027N785Q728R243K24j957O491J2534Q366
8707C65975J6552J6539O734J4625K0810J0946P582J4422J1559Q447J1373J7995
8695E23559K0067J7625K1182K3969J7075K5166J6815N777J194M291J6134J9184
$$ y = [-61249, -82854, -99749, -121928, -148131, -173358, -202295, -253325, -324013, -406973, -498143, -594744, -624511, -541930, -374984, -192430, -12044, 136832, 234208, 290541, 325605, 361458, 393461, 409421, 419417, 437076, 445699, 447336, 460148, 463853, 462913, 469896, 483389, 490034, 495501, 508756, 537211, 582491, 625036, 678918, 726212, 779203, 794785, 754005, 693733, 605825, 507080, 440623, 383052, 329655, 291006, 265703, 260013, 264101, 270917, 280713, 282058, 277792, 276063, 269868, 264273, 259543, 262861, 268628, 276289, 282334, 291980, 305534, 316561, 322346, 331074, 340317, 340541, 338584, 345075, 357609, 365975, 382527, 399066, 405800, 420425, 441235, 452181, 459763, 474185, 485744, 494191, 505564, 523559, 543626, 561251, 582433, 606402, 623477, 648643, 665458, 671235, 672429, 676720, 692854, 712038]
8683G12038K2889K8231L4853L1866L2063L2202K6225K2849L5550L7887L9365L0867
8671A086885L7862N7898N4907M6609N1628N1874O4121O4644P8071Q6608P8506
8660A759613R0905J02136J07078J12477J39148J70051K10945K46574K85919L24005
8650C548851L63619L94097L83006L37660K56831J90666J54307J71646K26705L32841
8640F360229M29037N34106O66928Q19146R98019J224192J501211J838794K213959
8631A6585621K604778K993098L274186L344380L396287L731991M672691O480555
8623D7083587R434993J3959059K0808116L1413168M7557892O9218138Q7416096
8616C26891049P7912218L1844214j7275707n1793500p1642215p1457477n7474184
$$ y = [712038, 734927, 763158, 798011, 829877, 861940, 894142, 920367, 943216, 978766, 1016653, 1056018, 1086885, 1124747, 1182645, 1237552, 1284161, 1335789, 1387663, 1451784, 1516428, 1594499, 1681107, 1759613, 1850518, 1952654, 2059732, 2172209, 2311357, 2481408, 2692353, 2938927, 3224846, 3548851, 3912470, 4306567, 4689573, 5027233, 5284064, 5474730, 5629037, 5800683, 6027388, 6360229, 6789266, 7323372, 7990300, 8809446, 9807465, 11031657, 12532868, 14371662, 16585621, 19190399, 22183497, 25457683, 28802063, 32198350, 35930341, 40603032, 47083587, 56518580, 70477639, 91285755, 122698923, 170256815, 239474953, 326891049, 404803267, 436647481, 419371774, 367578274, 295936059, 224478582, 167004398]
8609A67004398m1941607k9747411k0957730j4755921j0276835p002143m776599
8602C7546152l625862l246948l166135l158201l064117k773779k385735k020826
8594A4104549j688262j405818j161404r49108q02586o95382n98531n19547m59727
8585E824184l97230l62451l17807k96754k78544k49698k25220j84376j57192j41409
8575C213503j41804j28057j19315j27424j26576j24163j06532r6664q8513o8000
8565B086455p0800p3476p8021o6292p0616o7157n1333n9075o4950m6741l3357
8554A404637l2554n1285m3800l7619l3869l0430k6882l1198l3434l8144l4823
8543A010599l8533l9460l1218k9532k6196j5311j6551j5762k1069k3348k3525
$$ y = [167004398, 125062791, 95315380, 74357650, 59601729, 49324894, 42322751, 37546152, 33920290, 30673342, 27507207, 24349006, 21284889, 18511110, 16125375, 14104549, 12416287, 11010469, 9849065, 8899957, 8097371, 7401989, 6803458, 6283911, 5824184, 5426954, 5064503, 4746696, 4449942, 4171398, 3921700, 3696480, 3512104, 3354912, 3213503, 3071699, 2943642, 2824327, 2696903, 2570327, 2446164, 2339632, 2242968, 2154455, 2086455, 2015655, 1942179, 1864158, 1797866, 1727250, 1660093, 1608760, 1549685, 1484735, 1437994, 1404637, 1372083, 1320798, 1276998, 1239379, 1205510, 1175080, 1148198, 1117000, 1083566, 1045422, 1010599, 972066, 932606, 901388, 871856, 845660, 830349, 813798, 798036, 776967, 753619, 730094]
8532G30094j1481L185k518j7888k1288k4739k4038j3074L043J21q018o41p990
8519F04768j7669j4380o677j7495k1176n402r247r503l616M876L098j1653N19
8506D96443j0410n521n46O99n111n097L428Q679J8164Q055J2128L827p48J5126
8492E39116J0243p982l5161p0943q4041r3820q3174m9736k6865j6043j7852k0438
8480D3304q152j272o048o902o616j1356j0878l852m263J62M812P765J1441J1973
8466B0118J1738J0413L0207O2976J11548J73721K02785J56230R2393L2361l0763
8455H73727q7287q3490p8567o3220m6767m1097k9997k5164k5893k6446j6296j0845
8443C38658j1373p479j3749j9228p326j418n714J489m302k55m864j2045j6725
$$ y = [730094, 718613, 721798, 719280, 701392, 680104, 655365, 631327, 618253, 621296, 621417, 613399, 612758, 604768, 587099, 572719, 566042, 548547, 527371, 521969, 512722, 503219, 499603, 504479, 507577, 495924, 496443, 486033, 480512, 479966, 480665, 475554, 470457, 473885, 482564, 500728, 508783, 520911, 524738, 523990, 539116, 549359, 541377, 506216, 435273, 351232, 257412, 174238, 124502, 97637, 81594, 63742, 43304, 35152, 33880, 27832, 20930, 14314, 2958, -7920, -11772, -16035, -15873, -11061, -3296, 8145, 20118, 31856, 42269, 72476, 135452, 247000, 420721, 623506, 779736, 872129, 904490, 873727, 786440, 702950, 624383, 561163, 514396, 473299, 443302, 418138, 392245, 365799, 349503, 338658, 327285, 319806, 306057, 286829, 279503, 278085, 272371, 273860, 269558, 269303, 264439, 252394, 235669]
8430B35669k8069k7248j8269j7331j0734J7266M2701K9265O686j5672k9517k1592
8418A63155j2818n133J6498P586Q147J3561R007K850N052q679j4390r819j1392
8405A63625j6123j2225J892O439k869m001M183K434J0492J3204J1j7614j2900
8392A36548o832l307J4651P382K862J4429J2125J6432K355k373o209J349p180
8379A82232j0205p809o066o800j0884j8706m847p014k557Q212J4197P446Q664
8366A45863j099p479N576K547M699N886R597J03n873L360o072l348k900j2269
8352A38591j892p025m994l229O336J1304o853j2146n89m165o264Q734L664P441
8338A28913K829j490j210J746M56j02j57l316j662m573k577M286Q23j9574j3119
$$ y = [235669, 207600, 180352, 162083, 144752, 134018, 151284, 193985, 223250, 229936, 214264, 184747, 163155, 150337, 145204, 161702, 169288, 177435, 190996, 200003, 202853, 207905, 199226, 184836, 175017, 163625, 147502, 135277, 137169, 143608, 140739, 136738, 140921, 143355, 153847, 167051, 167062, 149448, 136548, 129716, 126409, 141060, 148442, 151304, 165733, 177858, 194290, 196645, 194272, 188063, 189412, 182232, 172027, 164218, 158152, 151352, 140468, 121762, 116915, 109901, 107344, 115556, 129753, 137199, 145863, 144764, 137285, 142861, 145408, 150107, 155993, 165590, 165693, 159820, 163180, 157108, 153760, 150860, 138591, 136699, 129674, 124680, 121451, 127787, 139091, 132238, 120092, 119503, 115338, 109074, 117808, 121472, 128913, 131742, 130252, 129042, 130788, 131244, 131142, 130985, 127669, 126007, 121434, 118857, 123143, 123966, 104392, 91273]
8323I1273j0449j3012K378J1406R03p408l624J0450Q406K438m356N649l181r418
8309H1455n489o426k6017k8632m2207m9307l9562k3568L035K4606J6973J5377
8297g9762K0039K2704J3979O164l808M276N480P441J8717Q255L356m202K046k78
8283B4407q276l416J1425K355J245M420K20J856k872j086O445o631j1121l058
8269A5913n202L395P373J4924K172q126n471J1958J3656M91o667j5151j820Q954
8255C6399J1776L731M656j145o81P528J288m964p065L130K0473J3276j376q187
8241G8839o742r82O373O88Q367J6146J2375R168J4172J2361O877R454J0059K5314
8227B02469J6973K0581K6617L6323M8162N8573P2902J24304J57283J80629J96975
$$ y = [91273, 80824, 67812, 70190, 81596, 82499, 75091, 71467, 81917, 90323, 92761, 88405, 94054, 90873, 81455, 75966, 69540, 43523, 14891, -27316, -76623, -116185, -139753, -136718, -112112, -95139, -79762, -59723, -37019, -23040, -16876, -20684, -16408, -10928, -3487, 15230, 23485, 26841, 22639, 24685, 24407, 16131, 12715, 24140, 26495, 27740, 32160, 32380, 34236, 31364, 30278, 36723, 30092, 18971, 15913, 10711, 14106, 21479, 36403, 38575, 30449, 24978, 36936, 50592, 51083, 44416, 29265, 27445, 36399, 48175, 51906, 56562, 55417, 54736, 62264, 63552, 58588, 51523, 54653, 75126, 88402, 87026, 78839, 72097, 71115, 77488, 78176, 86543, 102689, 115064, 124232, 138404, 150765, 157642, 167096, 177155, 202469, 219442, 240023, 266640, 302963, 351125, 409698, 482600, 606904, 764187, 944816, 1141791]
8216A141791J93060J69651J09612L4083m8123j20550j73353j89532j91679j72176
8206G52784j31116j13936r0157o3449n6039m8261l9075k7499k0400j7310k1973
8195A23569j9301j0828n809r510r197P869q212o745o282J96m340m028l930K16
8181D3668m326M559N828N977Q857J559n884j6595j3150j1389j4064K611j696j763
8167D192k739o610J728j82N085l457l737j0547l457j7777j41j76j2429j2290j0256
8152g2793j7107j4785m050R394K5970M0214L0490L3699K0580L243j436k502L873
8139E4790L36j1726L772r32m764L467K120m167m86K233J1722k83m28L536K475
8124F1665q154m352L508l64k17j803P272M873o761n742j5429j6555p92Q205J5617
$$ y = [1141791, 1334851, 1504502, 1614114, 1648197, 1600074, 1479524, 1306171, 1116639, 924960, 752784, 621668, 507732, 417575, 354126, 298087, 249826, 210751, 183252, 162852, 145542, 123569, 104268, 93440, 87631, 78121, 68924, 76793, 68581, 61836, 55554, 55750, 51410, 47382, 43452, 43668, 39342, 43901, 49729, 55706, 64563, 66122, 60238, 43643, 30493, 19104, 5040, 7651, 5955, 4192, 1453, -5157, -3429, -3611, 1474, -1983, -5720, -16267, -19724, -37501, -37642, -37818, -50247, -62537, -72793, -89900, -104685, -108735, -99341, -73371, -33157, -2667, 31032, 51612, 54855, 53419, 50917, 54790, 55126, 43400, 47172, 46240, 41476, 44943, 47063, 42896, 42410, 44643, 56365, 56082, 55654, 59190, 61665, 53511, 49159, 52667, 52303, 52086, 50283, 57555, 62428, 55667, 49925, 34496, 17941, 17149, 25354, 40971]
8109D0971R026o277k665O40o149p133L545J0158K188q335l145N672M462l400K971
8094D2529o801p933r12N66j057J265r92M23J040K866N081K865K702j434J211N641
8078D7060O78J583j1465o973p38J627j2252m020J0078J1071n761j2464J644J238
8064B1306L089J290P51j254O01K994m902j140k551L16o33J646j038j485M494l873
8048A9611j966j2339O555P973M342N343l597r930m162N907O731J66O58J583l116
8033B3759j979l940J2023J425o558K17M44N178J625j4656m492R14L048L016m461
8018A5563k283Q01Q49L872P044j0360j719j387K431M156J681N206J0377J706j254
8003C6683l497q434J660J663N04J485R77K266l825m271l495k414N269P223q81
$$ y = [40971, 49997, 43720, 41055, 41695, 35546, 28413, 31958, 42116, 44304, 35969, 32824, 38496, 42958, 39558, 42529, 35728, 27795, 26883, 27449, 26392, 27657, 26665, 27088, 28128, 30994, 36075, 38940, 41642, 40208, 41419, 47060, 47738, 49321, 37856, 30883, 30145, 31772, 19520, 15500, 25578, 36649, 30888, 18424, 20068, 21306, 24395, 25685, 26436, 25182, 25783, 28777, 23875, 22735, 20184, 20500, 19867, 21513, 20475, 18990, 23484, 19611, 17645, 5306, 11861, 19834, 24176, 29519, 25922, 15992, 11830, 17737, 24468, 24634, 25292, 26875, 23759, 21780, 17840, 29863, 31288, 24730, 24947, 25391, 30569, 32194, 17538, 13046, 13960, 17008, 20024, 15563, 13280, 14081, 14930, 18802, 25846, 15486, 13767, 12380, 14811, 18967, 20648, 25854, 36231, 37937, 36683, 33186, 24752, 26412, 28075, 28579, 30064, 31041, 33307, 29482, 25211, 21716, 19302, 24571, 31794, 30913]
7988C0913j2625m7M465j042r12l287j443o181P940M509r378m498L50L155n387
7973F532J598L07n802P989O703j708m285N31L834m880L248R868m006k348j527
7958A6054M63P147K316K101m802N187k439m978m453j434j859N723m477j0339K61
7943D471K765k912n142M675J1218O589k084m329L894m193n011J487O374K82k402
7928A5682N589j118M138m06k666k897q156n468Q324P08o580K735Q92P142L433
7913B1352L128L655p758q785o686M754L184l267l924Q075R472R82q739m554l045
7898G844P263R897m365n756n691p900N818n34N963j345j127j285m164o839L88
7883a833R710J356j470L379M66m055J487m460L421Q215K80N171M980o280l802
$$ y = [30913, 18288, 18241, 22706, 21664, 20752, 17465, 16022, 9841, 17781, 22290, 12912, 8414, 8764, 11919, 6532, 8130, 8437, 2635, 10624, 17327, 15619, 11334, 11865, 15699, 10819, 14067, 23935, 19929, 17581, 16054, 16517, 23664, 25980, 28081, 23279, 28466, 26027, 21049, 16596, 15162, 13303, 19026, 14549, 4210, 4471, 7236, 4324, -818, 3857, 15075, 21664, 19580, 15251, 19145, 14952, 9941, 11428, 17802, 18084, 15682, 21271, 20153, 24291, 23885, 21219, 18322, 10166, 4698, 13022, 13730, 7150, 9885, 10777, 17919, 21352, 24480, 28135, 20377, 11592, 4906, 9660, 12844, 9577, 5653, 13728, 23200, 24182, 15443, 10889, 7844, 15107, 25004, 20639, 14883, 9192, 1292, 7110, 6576, 12539, 11194, 10067, 8782, 4618, -2221, -1833, 7877, 9233, 7763, 11142, 11608, 7553, 9040, 4580, 8001, 16216, 16496, 21667, 26647, 20367, 16565]
7868A6565q352J283j989L763j676J827J502l615o592M241J81l693k717J063j325
7853D66L908L912J351j980L846Nj770p542l107m7P549M722K438j703K471L01n75
7836A4245K011O255l618n669l083N000N341O485p506p780j0110N166P705K296
7822A6738o6j0438L876J570m61k780P467M181k392M090r780m272R972Q00n745
7807A2760M718n49r633m866Q821J2928r746k093O955J152K181L240n762j2464
7793G642n215m188Q605K0010o980j0391L996P035Q92j2180p289k49R948J0680
7779B2316j034p129j915j053L786o480m744M60Q046L948q343j403K718p28J625
7764A0070k972P676P375j620o110p851J479L987n525K126L760K375j609k941N168
$$ y = [16565, 8213, 9496, 7507, 11270, 9594, 11421, 12923, 9308, 2716, 6957, 7138, 3445, 728, 1791, 466, 4374, 8286, 9637, 7657, 11503, 11508, 9738, 2196, -911, -958, 6591, 11313, 13751, 12048, 14519, 14820, 14245, 16256, 22511, 18893, 13224, 10141, 15141, 20482, 26967, 19461, 11681, 1571, 6737, 14442, 16738, 16672, 6234, 10110, 11680, 11219, 8439, 15906, 20087, 17695, 21785, 12005, 7733, 17705, 18505, 12760, 17478, 16929, 7296, 2430, 11251, 24179, 14433, 12340, 19295, 20447, 22628, 25868, 20106, 7642, 2427, -1761, 6844, 26854, 19874, 9483, 13479, 20514, 21406, 9226, 1937, 1688, 11636, 22316, 21282, 14153, 12238, 11185, 14971, 8491, 3747, 4207, 12253, 16201, 7858, 6455, 9173, 8445, 10070, 7098, 14774, 22149, 20529, 14419, 6568, 8047, 12034, 6509, 8635, 12395, 14770, 13161, 10220, 15388]
7749A5388k848k114M7J548q677L116K244J839M582l323r885K297M411O71k02J883
7733A0977o603m901K34J627J939k462l464O139P929K406r229m644q551n03J522
7718g584O755J037j620k366R824O509K314j6684j6Q575k413p682N19R385J067
7703G620O727j858j2516k183n735k834Q399J223K011n94K517l762m97K987M753
7688F258p62k890K552M679M869m812M047P90m054k74N531N40n769K039R543J0799
7672C3086p560q591m556m097j1313n535L228L750n119p933J750L149M587Q331
7658C177q610K850J9735R764m225j5681m968N945K117O878J2873J561q314n660
7644A7442q175m348K53L66j654r59N503M505O081n946l931Q18J0596L521j018
$$ y = [15388, 12540, 10426, 10473, 12021, 3344, 6460, 8704, 10543, 15125, 11802, 1917, 4214, 8625, 9296, 9094, 10977, 4374, -527, -293, 1334, 3273, 811, -2653, 3486, 11415, 13821, 4592, -52, -8603, -9106, -7584, -829, 208, -1412, -3778, 6046, 12555, 14869, -1815, -1831, 6744, 4331, -3351, -2832, 6553, 7620, 14347, 12489, -27, -2210, -7945, -10779, -2380, -1157, 854, 260, 2777, -985, -1482, 1505, 6258, 5496, 2606, 5158, 9837, 14706, 9894, 13941, 14731, 10677, 10403, 15934, 16474, 10705, 12744, 22287, 33086, 25526, 16935, 12379, 8282, -3031, -8566, -5338, -1588, -6707, -14640, -12890, -9741, -5154, 3177, -5433, -2583, 17152, 26916, 22691, 7010, 2042, 7987, 10104, 16982, 29855, 31416, 23102, 17442, 9267, 4919, 5172, 5538, 3884, 2925, 8428, 12933, 19014, 13068, 9137, 9955, 20551, 24072, 23054]
7629B3054j2079m089K83r23o369K285R650N050q408o412o171L700P113M596N709
7614A6989l01O781K828j038R13j4296p317M078L686M230Q521j0109j402P828l994
7599A7397m060n985O031N177l933o427J518J1830K375r472j0687m424L210P83
7585C333m059o692K883P540l307n215R238J0278j700k596m441l053P804l809k597
7570C607l044k708P86J2862Q303j6190n282j232P378Q313R725O543l451q580j905
7555A5125n911K828k423J532m549m520M991l036P9K048n594O183J2267P11r928
7540I803m748J377K964K655l053l137m765L922N567j3892o381R734P341N09n848
7525B048R81m3l524m722N001J682M273p857N061P654K360Q71N30j0218n180q266
$$ y = [23054, 10975, 6886, 7169, 6246, -123, 2162, 11812, 16862, 8454, 2042, -4129, -429, 6684, 11280, 16989, 16688, 23469, 26297, 25259, 26172, 11876, 4559, 8637, 12323, 16553, 25074, 14965, 13563, 21391, 17397, 13337, 7352, 13383, 18560, 14627, 8200, 9718, 21548, 23923, 14451, 3764, -660, 2550, 3333, -726, -7418, -4535, 3005, -302, -5517, 3721, 13999, 12299, 9703, 5262, 2209, 10013, 6204, 3607, 563, -2145, -1359, 11503, 19806, 3616, -1666, -2898, 4480, 12793, 22518, 29061, 25610, 17030, 15125, 9214, 12042, 9619, 11151, 6602, 2082, 7073, 4037, 4116, 6164, 570, 6753, 19020, 19731, 9803, 5055, 6432, 9396, 12051, 8998, 5861, 1096, 5018, 10585, -3307, -9688, 46, 7387, 7896, 2048, 3029, 2986, -538, -5260, -259, 1423, 5696, -2161, 2900, 10554, 12914, 13785, 14315, 4097, -1083, -9349]
7509i349l534N127R240k634L90n736K399p048m245L113M536N417J903o196N083
7494a534J2754M387J514r409m949k375L915J473k911o360n53L686P59P62P220
7479H379o009j248M645O49M360K293J76l407r971q083m586Q59J2304K779P325
7464A0465m249l573r58Q23k97K328J261m927K740M331r557n531K409Q975j56q690
7448d606k585J0402J509N47o695O439L823m115O82Q27j97q152r13j165P321M711
7432G833M93J594Q06J917J903n140l959l390J696l295k968r00R6J201N298P227
7416A0412M335K126n223J651k229m823J083J0886q30j2002n21o32K748P777o802
7401G956q996j858J1599M358N724j451n599o456l113k458J016Q750o061N886k450
$$ y = [-9349, -12883, -7756, 1484, -1150, -760, -6496, -4097, -11145, -15390, -12277, -7741, -2324, -421, -6617, -1534, 11220, 15607, 17121, 7712, 2763, 388, 4303, 5776, 2865, -3495, -4048, -362, 397, 1159, 8379, 2370, 1122, 5767, 6416, 10776, 13069, 13245, 9838, -133, -8216, -12802, -11943, 361, 3140, 10465, 6216, 2643, 1685, 2508, 2211, 4539, 5800, 873, 3613, 7944, -1613, -7144, -4735, 4240, 4084, -4606, -7191, 3211, 4720, 5267, -1428, 5011, 8834, 4719, 5401, 6228, 6031, -2121, -3034, -4199, 3122, 7833, 8326, 9920, 10726, 12643, 14546, 9406, 5447, 2057, 3753, 458, -2510, -3410, -3314, -2113, 3185, 10412, 14747, 16873, 11650, 13301, 11072, 6249, 7332, 18218, 17388, 5386, 4865, 4233, 6981, 14758, 7956, -1040, -2898, 8701, 13059, 18783, 17332, 11733, 5277, 2164, -294, 722, 9472, 3411, 9297, 6847]
7386F847o580r742R659J4136l74J23j0378m977K52j977o311j2290Q119J0356P644
7371D507m880q337L836k618L37j151M626J1245l256R230l474p317M05L46L015
7356F514r416n14L5m570o438O878O674J935M354O016L455n313J321q926n158j371
7340d524J0372J1630J134j2549j115o963N955J514K276M805M003l639r515K87
7326C671J169L28o794M835L516o321k576M973P26j959J67l839J09L700k754k009
7310c058M347L556o574m806l006J3413J0410R42j689J429j970m205M70J117M088
7295A4464m295o390P92K066J907M250P100n087p261j0522o274J896j0705K650
7281a5409J4758M681L665k420l438L596m657j529L520K744M931j0560k43J1219
$$ y = [6847, 267, -9475, 184, 14320, 13946, 14069, 3691, -1286, -1034, -3011, -9322, -21612, -13493, -3137, 4507, -373, -8710, -4874, -7492, -7155, -8306, -3680, 7565, 4309, 13539, 10065, 2748, 3153, 3499, 6514, -2902, -3416, -3381, -7951, -14389, -7511, -837, 1098, 5452, 11468, 14923, 9610, 10931, 2005, -3153, -4524, 5848, 17478, 18612, 6063, 4948, -2015, 3940, 5454, 7730, 12535, 16538, 12899, 3384, 3671, 4840, 5168, -1626, 3209, 6725, 404, -2172, 2801, 3527, 1568, 1735, -2104, -1995, 1705, -1049, -3058, 1289, 4845, -1729, -6535, -9541, 3872, 14282, 15224, 13535, 14964, 12994, 8789, 9259, 10376, 14464, 10169, 3779, 4571, 6637, 8544, 12794, 19894, 14807, 7546, -2976, -9250, -7354, -18059, -15409, -651, 4030, 7695, 5275, 1837, 5433, 776, -753, 2767, 5511, 10442, -118, -361, 10858]
7267A0858R477o786j3788j301j991K492j78P99L101l190K515j510M839Q408J1451
7252B5196j200n479p280p332Q21o101j550O076k579k011J1069p183m894J681J149
7237C83N821n172j0727K181R44M17P118K527P375J654j0986K127L358N578L798
7222A6396j0106l901K352l32N883Q537l415q070l87L677l868q93Q206R762L000
7207B6841q345M217l087L443L288j0206l139M436o777m602j924m821j785K278
7193a83Q936L143j0043r511l267J4886O29N452o723j123L971O385Q753o435n170
7178I700J276k806k633M266K173q933j940L293K987N99M773M426L334P99o417
7163A4897q675n574m087M466M881O795O76m997l645n7o568p129l368J867L376
$$ y = [10858, 20335, 13549, -239, -1540, -3531, -1039, -1217, -418, 2683, -507, 2008, 498, 5337, 13745, 25196, 23996, 18517, 11237, 3905, 4726, -1375, -2925, 3151, 572, -1439, 9630, 2447, -2447, -766, 383, 6204, 1032, -9695, -7514, -6570, -6153, 965, 3492, 10867, 12521, 1535, 3662, 7020, 12598, 16396, 6290, 2389, 4741, 4409, 10292, 18829, 15414, 7344, 6957, 10634, 6766, 5873, 14079, 23841, 26841, 18496, 22713, 19626, 23069, 26357, 16151, 13012, 17448, 10671, 6069, 4145, -676, -2461, -183, 8753, 11896, 1853, -7658, -10925, 3961, 4590, 10042, 3319, 2196, 6167, 12552, 21305, 14870, 9700, 10976, 8170, 5537, 9803, 11976, 3043, 1103, 4396, 7383, 7982, 12755, 17181, 20515, 21314, 14897, 6222, 648, -3439, 1027, 5908, 12703, 13379, 8382, 4737, 4680, -1888, -9017, -12385, -10518, -7142]
7148g142M864L856M404k765r95l654J741J1047L473j026p412j3382J127O861j111
7133a14j494O544n1M802j0028j951l964k509L678n280n047m001Q009R890L010
7118A494N696o19J903k905n378K219K974o98J216K613N473r972j2557L393J4576
7103I428P479l313J009L331m996j2546j232P005M059r830o418K126N349m999p114
7088a0662L378J0138q007L069k704n35N058j162n200j652p515J375L244J8819
7074G644j367r294K839J2893q688q879R712P731L237l033q215r369M173N816J032
7059F232L181o777j5321R41J1843K661q30J1054P61p649l861L858J387j0275o197
7044h992K42P611J3365M92k772p483p169K226N893M553l92n330j4913N107J34
$$ y = [-7142, -2278, 1578, 5982, 3217, 2222, -1432, 309, 11356, 14829, 13803, 6391, -6991, -5864, 997, -114, -1608, 4936, 4885, 9687, -341, -2292, -6256, -8765, -5087, -10367, -15414, -19415, -11406, -1516, 1494, 7190, 6571, 8474, 5569, 191, 2410, 5384, 4686, 5902, 8515, 13988, 4016, -8541, -5148, 9428, 16907, 13594, 14603, 17934, 12938, 392, -840, 6165, 10224, 394, -6024, -3898, 1451, -3548, -10662, -7284, 2854, -5153, -2084, -4788, -5323, -265, -1427, -6627, -8279, -15794, -14419, -11175, 7644, 6277, -3017, -178, 12715, 4027, -4852, 4860, 12591, 15828, 12795, 4580, -4789, -616, 5200, 6232, 9413, 2636, -12685, -11744, 99, 2760, 1930, 12984, 13745, 6096, 2235, 6093, 7480, -2795, -8992, -8750, -1139, 12226, 12718, 9946, 2463, -4706, -2480, 3413, 7966, 7574, 2244, -12669, -7562, -7428]
7029g428M891R821R076J951P714k345q884l908M993N729j795p392p175j31k428
7014B689K065l397o470j404J8675P807L451l679m700p689n25Q31j96M539l885
6999H112m917q274m715J2527Q876K654J431O52m164J85p196n174L200L662K618
6984I477P76q336O721l678l950n61L758N021M33n685k888j215l514o357m757J305
6968a3450N348O490P588L46n520n633p850k720Q870K796M303O387m988j0206q14
6953i053O723L19l73J0506K012j2771j800P102O102J935N59l044n102k325r14
6938a24M666K201o96l258r35N52J856M706l394k645J686q387J896Q12l819j414
6922f297J0704r48j841M2R184N298l802Q95n717j756j1754j4377k036j400O458
$$ y = [-7428, -2537, 7284, 16360, 18311, 26025, 23680, 14796, 10888, 15881, 21610, 19815, 12423, 5248, 5117, 2689, 4754, 1357, -5113, -6517, 12158, 19965, 23416, 19737, 15037, 7348, 6823, 7654, 7458, 11997, 8112, 3195, -5079, -9794, 2733, 11609, 14263, 15694, 16346, 12182, 12367, 5171, -3, 3197, 6859, 9477, 10253, 1917, 8638, 4960, 1010, 449, 4207, 9228, 9661, 3976, 1088, -127, -3641, -9998, -14755, -13450, -8102, -1612, 5976, 6322, 802, -4831, -12681, -15401, -6531, -3735, 568, 6955, 1967, -8239, -9053, -2330, -2011, -2384, 8122, 10134, -2637, -4437, 2665, 8767, 10702, 11261, 8217, 3115, 790, -124, 4542, 6743, 6047, 2789, 1854, 2406, 4262, 8968, 5574, 2929, 4615, -3772, -1876, -1064, -4883, -6297, 4407, 3459, 1618, 1660, 10844, 16142, 12340, 13235, 7518, 5762, -5992, -20369, -22405, -23805, -17347]
6907a7347K657L689N156p449O52L217N727P637O21L66o026J112l454m462J3808
6892E904M18o023n241N03J6985m20j3268L170N577m140K740j325K259m263q064
6877e188n82L031k508k112O38K811K582M989r702l613L146M594Q590l570l871
6862g65Q336j93K451J662n195q481j338K244O502M897l486j0497r812p14N647
6847h742R21n18j29K605O158J722J538O520n11K981j1922K801M912J23l338l781
6831A340j0994p677q695K794P67p23J1452J1871M874k554O4K581M227j1205j2640
6816a4518l380P253k77o963M727K057k131K5j394N143K814K263P327l124k252
6801b430K616R020r592p785n969m518M552M741M576j53J173R720J0339k104j5532
$$ y = [-17347, -14690, -11001, -5845, -13294, -12642, -9425, -3698, 3939, 4560, 4926, -1100, 12, -3442, -7904, 5904, 6322, 299, -4942, -4439, 12546, 12126, -1142, 2028, 7605, 3465, 6205, 4880, 7139, 2876, -5188, -5770, -2739, -5247, -7359, -6721, -3910, -1328, 3661, -6041, -9654, -6508, -1914, 6676, 3106, -765, 7571, 7378, 9829, 11491, 6296, -2185, -3523, -1279, 5223, 10120, 6634, -3863, -13675, -14389, -8742, -7821, -8339, -8468, -5863, 295, 2017, 3555, 10075, 9564, 12545, 623, 3424, 8336, 8459, 5121, 1340, -9654, -17331, -26026, -23232, -22465, -23188, -11736, 135, 5009, 2455, 2519, 5100, 9327, -1878, -14518, -17898, -10645, -10922, -17885, -13158, -11101, -13232, -13207, -14601, -9458, -6644, -4381, 2946, -178, -2430, 186, 9206, -386, -8171, -14140, -18658, -14106, -9365, -4789, -4942, -3769, 5951, 16290, 14186, -1346]
6786a346J335K433j45k477l362p481M616J3162k163j0039l277Q560M986j016j3268
6771i482m438m034o467N865L63J0894J0794M82o695j882J522N79m049n833O87
6756a1694N592M870o012K72m312L297P350j565m197N104J1946k208M233n557r048
6741a929n928j359M729O745q290l006J1015J0599R3m553o953p96K221q526j4973
6726b0911O036J2953p473q943N657R494l1m149K080l531p570P885p556n30O707
6711i882L986Q107P010R39q499m334K096O110r436K345R033L328l479k48p260
6696a84r521l735l630l976j499P017M904L980j069L982P878J929K395O292k401
6681A2362M825q894r734j196P609N37k7m342p776R087K083M501m001k232P96L811
$$ y = [-1346, -11, 2422, 2277, -200, -3562, -11043, -6427, 6735, 4572, -5467, -8744, -184, 4802, 3786, -9482, -13920, -17954, -24421, -18556, -18193, -7299, 3495, 3977, -2718, -4600, -3078, -2499, -6548, -12381, -11694, -6102, -1232, -7244, -6972, -11284, -7987, -637, -2202, -6399, -1295, 10651, 8443, 12676, 7119, -1929, -7857, -9216, -4487, 2258, -6032, -9038, 1977, 12576, 12669, 8116, 1163, 367, 2588, -5938, -20911, -14875, -1922, -9395, -18338, -12681, -3187, -3218, -7367, -5287, -8818, -16388, -8503, -16059, -16589, -9882, -5896, 2211, 9221, 10160, 1661, -2673, -577, 5533, -3903, -1558, 7475, 10803, 7324, 7076, -184, -9705, -13440, -17070, -21046, -22545, -15528, -10624, -6644, -7713, -3731, 4147, 6076, 8471, 14763, 12362, 17187, 8293, -1441, -2637, 4972, 5509, 5482, 1140, -6636, 2451, 4534, 9035, 5034, 2802, 3598, 7409]
6665G409R957N74n165j1897j0544L892l525j1074R86O302R336N898K32k745M29
6650F5K449n003j26m087L770N736K596k4m490K865Q84o682n548L192m799J507
6634g695l199p709K990O867L894q93L144k02o900m886K388O569J4283n275m940
6619a564j371P61j917k55J847k799m707L024J2377J449L903p62j475n502p477
6604d468J952j114j819N781K527n493N541J877M431jQ36j781k449k58j0171p208
6588a1817p715J975N830N244J660L59p915O95J918m33p19m654o556K482M182j927
6572a7391J114R663Q723N041l300L031K267j622j2840L82N000P128Q556k406q598
6557D748j600j214O841O557L893l140k814m695O646O072r090q357j968K636K575
$$ y = [7409, 17366, 17940, 12775, 878, -9666, -5774, -9299, -20373, -19387, -13085, -3749, 2149, 2381, -364, 65, 2514, -2489, -2615, -6702, -2932, 2804, 5400, 5376, 886, 3751, 4635, -2047, -7595, -4403, -9202, -7695, -10894, -18603, -15613, -8746, -4852, -5745, -2601, -2803, -9703, -14589, -12201, -5632, 8651, 3376, -1564, -2935, -2174, -4091, -4346, -2499, -5298, -10005, -6981, 5396, 6845, 10748, 9986, 8511, 3009, -4468, -2516, -3630, -5449, 332, 2859, -2634, 2907, 4784, 9215, 9214, 10050, 8269, 5820, 5562, -4609, -11817, -19532, -17557, -11727, -6483, -4823, -4464, -12379, -11684, -9766, -10199, -10918, -15572, -22128, -19646, -15464, -17391, -16277, -6614, 2109, 7150, 3850, 6881, 9148, 7526, -5314, -4932, 68, 7196, 15752, 13346, 4748, 3148, 1934, 8775, 15332, 19225, 16085, 13271, 8576, 15222, 21294, 12204, 3847, 1879, 4515, 7090]
6542G090P24J790j12m672k296O158j772l745J42l819N990n262n463k707J139m127
6526a0942N576K999q590L513L530N284K492P795m564k326J630j170j489p036K1
6511c277m426j0531O830k671K539O853k894J297K467O948p08m495k507m299n720
6496a4594O717J1485M839M740n473m360j136J571O77l87n996m912K803M998r215
6481h243Q777J497K766k283K100J170n521M889m508r959o566m952O969J1067Q141
6466E344q121o951j44j628J764M462n547j635P465J0074R603L800p682j4352o474
6451a0022j536j131L706q77l857Q85j014j239O909P251p304n523l345P35N654
6436a0708K818N624K024l85M362n14p372J278N304q10l942l76M074j044p770r37
$$ y = [7090, 7814, 9604, 9492, 4820, 2524, 8682, 6910, 3165, 3307, -512, 5478, 216, -5247, -7954, -6815, -10942, -5366, -2367, -10957, -7444, -3914, 1370, 3862, 11657, 7093, 4767, 6397, 5227, 3738, -3298, -3277, -7703, -18234, -11404, -14075, -11536, -4683, -7577, -6280, -3813, 3135, 2427, -2068, -4575, -8874, -14594, -7877, 3608, 8447, 13187, 7714, 3354, 2218, 3789, 4466, 4079, -1917, -6829, -4026, 972, -8243, 534, 2031, 4797, 2514, 4614, 5784, 263, 5152, 644, -9315, -15881, -20833, -13864, -2797, 5344, -2777, -9728, -9872, -11500, -9736, -5274, -10821, -12456, -4991, 5083, 14686, 18486, 10804, -3548, -10022, -11558, -12689, -8983, -9860, -13717, -12832, -13846, -15085, -8176, -925, -8229, -13752, -17097, -16362, -10708, -7890, -2266, -242, -627, 3735, 3221, -4151, -2873, 2431, 1621, -2321, -2697, 1377, 333, -7437, -8374]
6420h374r91m263l50L539p86k870K123p65Q50J72L331Q232O384M998n303j59j662
6403D106L014m246o24P064l578m879J996m393p810k484J2234Q066j1209j573K184
6388b132p77o92M199M981q050k564K78k402J320o50K83Q762J371L40o57n708o929
6371i027K922R207J827M373O13n948M13m902o596K116O184l481q212j24J646J0797
6355A808j398o73L733j167K781L681r524r699m698L796k081K487J1485l823L6
6340c256P169l357K953M539j192m077R233O964m065n353k778j2056O42J2292k697
6325D961P939M723o730j92L997o408O360o244o366o005k02P06n86K751N827q023
6309c492q733J271j085k505j57P33J875L359r15L628n230K638K467p137M565K043
$$ y = [-8374, -9365, -13628, -13978, -10439, -11225, -14095, -11972, -12737, -11887, -11715, -8384, -152, 6232, 11230, 5927, 5768, 4106, 7120, 2874, 2250, 9314, 5736, 857, 2853, -1540, -9350, -11834, 400, 8466, -2743, -4316, -2132, -2909, -3601, 598, 5579, -2471, -5035, -4757, -7159, -5839, -6489, -6206, 2556, 3927, 4267, 3610, -2098, -9027, -6105, 3102, 4929, 9302, 9915, 3967, 4380, -522, -7118, -5002, 1182, -2299, -10511, -10635, -8989, 1808, 410, -263, 3470, 2303, 5084, 8765, -759, -10458, -15156, -11360, -13441, -10954, 531, -3292, -3256, 3913, 556, 3509, 8048, 6856, 2779, 12012, 18976, 14911, 9558, 6780, -5276, -4634, 7658, 4961, 12900, 17623, 10893, 10701, 14698, 8290, 14650, 8406, 2040, -3965, -4167, -3461, -4047, -1296, 4531, -3492, -12225, -10954, -12039, -14544, -14701, -13968, -12093, -8734, -9649, -6021, -11251, -8613, -6146, -13283, -8718, -6675]
6293f675N02P43P72L938N347N669j978P07K182q158o905k359Q15n339Q593L229
6277A083j4714j2364L109R650R832m192l601R368N456m114k699m510R401Q545
6263A0250j442M078n64n971m502k862J995L09R048J0477p112q605P006p137k487
6248B481Q603l902J175L597j30k398m587R05r432o812J126L378J594J0581p439
6233a260o710k830J846O708Q932L802m851j430j287m605k443K681j695m161L282
6218d021Q738O837O905r94k807n817l978K09K840j85p728L110R965l582n398n058
6202i64k234J2404M766l071l019n627J994k852N423P00j422l023j547J025r347
6187f794j563M02K565P247L396n027o190O887K482k049M779m949N82k503l342
$$ y = [-6675, -6173, -5430, -4658, -720, 4627, 10296, 8318, 9025, 11207, 3049, -3856, -6215, -5400, -10739, -2146, 1083, -13631, -25995, -22886, -13236, -3404, -7596, -11197, -1829, 3627, -487, -3186, -7696, 1705, 10250, 8808, 12886, 12322, 6351, 1849, -1013, 982, 1291, 10339, 20816, 13704, 5099, 12105, 4968, 2481, 11084, 7182, 8357, 11954, 11824, 9426, 4839, 5744, -3688, -10500, -9374, -5996, -4402, 6179, -1260, -7970, -10800, -8954, -2246, 6686, 10488, 5637, 4207, 2920, -1685, -4128, -1447, -3142, -7303, -4021, 4717, 11554, 18459, 17465, 14658, 8841, 4863, 5072, 7912, 7727, -1, 3109, 13074, 9492, 4094, -964, -3198, 9206, 13972, 10901, 7882, 2255, 4249, 1397, 6820, 7520, 6098, 3075, 1528, 2553, -6794, -8357, -7955, -5390, 1857, 5253, 226, -5964, 923, 3405, 1356, 6135, 1186, 1768, -735, -4077]
6172d077q86J0817M243J362P41l13o538p242K388j191L592R352o151j1683K754
6157b832N447M364K936o025q225j412J360K253J039O150k408O68Q748K199o57
6142A3605l754L226K965r127j1080J056L779k36J220o134k518k042l66m60J332
6127h534j600J403N693j902p056Q200J1062R529m379o613k809j595q407q910M653
6112a1265L091L40N59n074p254M69M742K156J061N591P831k746o751M327N261
6097B338K980l010r127m290R233q21q13k759L042m180k207K130k385M324q287
6082a3832N514K209J146j043R267N194k723n4q655k059n512p63P268R958N72Q21
6066G308M395l683q323J009K92p117j0746J1158J0258n685n038N389M44K402O353
$$ y = [-4077, -4963, 5854, 10097, 11459, 12200, 11887, 5349, -1893, 495, -696, 2896, 12248, 6097, -5586, -2832, 2615, 6979, 9915, 3890, -4335, -5747, -4387, -2134, -1095, 5055, 2647, 3315, 12063, 14262, 13605, 9851, 13077, 16042, 6915, -4165, -3109, 670, 434, 1654, -4480, -6998, -9040, -9406, -9866, -8534, -10134, -8731, -3038, -4940, -11996, -3796, 7266, 16795, 12416, 5803, 2994, 1399, -7008, -15918, -11265, -8174, -7834, -7275, -12349, -19603, -19134, -14392, -12236, -11175, -5584, 2247, -499, -7250, -2923, 2338, 5318, 2308, -6819, -11109, -1876, -2697, -3510, -6269, -3227, -7407, -9614, -7484, -9869, -5545, -13832, -8318, -6109, -4963, -6006, 3261, 8455, 5732, 5678, -2977, -5036, -10548, -11311, -4043, 5915, 6487, 7308, 11703, 8020, -303, 706, 998, -6119, -16865, -5707, 4551, -1134, -6172, -783, -339, 2063, 8416]
6051H416l284j5423L022P150n136K969J0575n162r580m069O703l336m721L221
6037h655R448N274q279J509N945M857l065j0477p269j057P740j630P34M315K776
6022B166P48r321r442l365J249J371J0121M926j465Q49L62K140o485k447k702
6007a1295R533M618l446M594L351m764j586o738l083k968J284l080L843Q06n80
5992i511L993k472j632j651n523M341L355j0322K31k181J1719R654N216J4555
5978A9772J407j4033L751k087n774m038k933J2207O069l624p38J635n888K785
5964H511k060j0828m145P094K620l788L930l721o86O321J100J869j80l780r392
5949g135l9M263J2745N235k129j1784j746Q639j43k845n824o858K77r85M408l980
$$ y = [8416, 5132, -10291, -7269, -119, -5255, -2286, 8289, 3127, -6453, -10522, -3819, -7155, -11876, -8655, 793, 6067, -2212, -703, 5242, 10099, 7034, -3443, -10712, -11769, -4029, -5659, -4925, -610, 2166, 2914, -6407, -15849, -19214, -17965, -16594, -6473, -1547, -3012, -2163, -1801, 339, -6146, -8593, -11295, -1762, 2856, -590, 4004, 7355, 2591, 1005, -5733, -8816, -11784, -10500, -13580, -9737, -8931, -9511, -5518, -7990, -9622, -11273, -16796, -12455, -9100, -19422, -19191, -21372, -9653, 1, 5217, 19772, 21179, 7146, 10897, 8810, 3036, -1002, -3935, 8272, 14341, 10717, 9979, 11614, 5726, 8511, 6451, -4377, -8522, -1428, 1192, -2596, 1334, -2387, -3073, 3248, 4348, 6217, 6037, 2257, -7135, -7174, -2911, 9834, 15069, 12940, 1156, -590, 8049, 7906, 5061, -763, -7621, -7344, -8329, -3921, -7901]
5933g901j967R153K903m360J255o06M48k590O542P63j0459J137K671l789L482
5918c318l072L179J276P40j873j596p95L454j665P946j397q358P6J819n319L707
5902e196N112m152k955r961J072O750ol055k723l145Q267N604m621k269o966O659
5886a1585O368n5M013N963j660o004o589J0302J2674K879n407j0204k058L160
5872A797L428k248m859q348k821L412K046m111n227N431l370p855m471N792P947
5857a3457J5154J923n060o724q005o099l606R52O469L374N159R323n109j629j619
5842h954N89O275n724j802j743j61L712K875o87o37k736J700L027o65P996P05
5826C770p910J903k299j391L515o827j207j0396l657j420P555l442o443M20J3768
$$ y = [-7901, -9868, -715, 2188, -2172, -917, -1523, -1075, -3665, 2877, 3640, -6819, -5682, -3011, -6800, -3318, -6390, -3211, -1935, -1195, -3068, -4664, -5459, -2005, -3670, 4276, 2879, -5479, -5403, -3584, -8903, -5196, -84, -4236, -7191, -17152, -16080, -9330, -9336, -12391, -15114, -18259, -9992, -4388, -9009, -11278, -18244, -11585, -5217, -5272, -1259, 4704, 3044, -2960, -9549, 753, 13427, 16306, 10899, 695, -1363, 1797, 5225, 2977, -1882, -10230, -13051, -9639, -7593, -11704, -16931, -11500, -14870, -22725, -27196, -21404, -13457, 1697, 3620, -1440, -8164, -16169, -22268, -25874, -24922, -18453, -15079, -9920, -597, -5706, -7335, -8954, -8365, -2090, -7814, -9616, -11359, -11520, -7808, -4933, -5620, -6257, -8993, -7293, -4266, -4931, 3065, 3770, -4140, -2237, -4536, -5927, -2412, -9239, -10446, -20842, -24499, -25919, -18364, -21806, -28249, -27829, -14061]
5811a4061J1447j470m846j877J535M83p33L139Q7J247p103P373Q829l552r511
5796i013P67L48N495K234M03m88Q71K068l750p168L494R557O13q639M164L949
5780D905J602R98k833K868l725q391J100J370p454L549N731M40k965j346Q38j008
5764d321q793j0068n144O727J0190M403M109N954o690k277l205N319n947J666
5750h077R820R549r0n194K052n325r111j173O851J084M93j1103N196N526N932
5735F430l593o459j564k244k555M033Q136q1m24M118l18r721j140M638K931m857
5719b670k056j293N18o7R719L098O514Q177j670n254j0282N519K962J424n807
5704H832o794l49n138o086O9q58P98L618K56M477o66K081M250O652r000J64L662
$$ y = [-14061, -2614, -4084, -8930, -10807, -9272, -8789, -9522, -6383, -6296, -5049, -12152, -4779, 4050, 498, -9013, -8246, -7898, -2403, -169, 234, -254, 617, 2685, -1065, -8233, -4739, 4818, 5431, -3208, 956, 4905, 6507, 7505, 4672, 7540, 3815, -4576, -3476, -2106, -9560, -6011, -280, 160, -2805, -4151, -3313, -4321, -13114, -23182, -28326, -21599, -11409, -7006, -2897, 3057, -3633, -5910, -9115, -3796, -9743, -8077, 1743, 11292, 11202, 6008, 8060, 2735, -6376, -7549, -698, 386, 879, -10224, -5028, 498, 6430, 2837, -3622, -5186, -7430, -9985, -5952, 2184, 2103, 1679, 5797, 5479, -4242, -5382, -744, 2187, -2670, -4726, -6019, -5501, -5568, 4151, 7249, 13763, 21940, 20270, 15016, 4734, 10253, 13215, 14639, 8832, 2038, 1689, -3449, -9535, -9466, -10324, -9526, -5908, -5652, -1175, -1841, 240, 4490, 11142, 2142, 2306, 5968]
5687E968n350k210j206l835r401J1066P286r021P61p140K510M984L380L838J619
5672C249j299j4801o672O873J2594P155M774N838j851j0841j493l272j488M665
5658C431o502j0389K26J715M740M308Q566Q06q082o838P392P683k134j2068r845
5643a6991L199K204n334l789N118Q980m268k587J01K320o280O666j393L807L897
5628d350l185J631M019J952J652J3196M020p456n728M256k852k920K885Q009M503
5613A9632n345J084j830k994L837o052n553J344o941l816O58J756L821j179m91
5598b069M146j124o360l628l715J001O899k597m179K997L754K036L532l399k087
5583d793Q489O967L570J11P96o666j5542n8M610M459P89q514p69m085N514k482
$$ y = [5968, 618, -1592, -2798, -6633, -16034, -4968, 2318, -6703, -5942, -13082, -10572, -5588, -2208, 1630, 3249, 1950, -12851, -19523, -12650, -56, 7099, 11873, 17711, 15860, 5019, 3526, 254, -1234, 3431, -3071, -13460, -13234, -11519, -6779, -2471, 6095, 6901, -1181, -8019, -627, 7056, 4922, -7146, -16991, -13792, -11588, -16922, -20711, -15593, -6613, -10881, -13468, -13367, -11047, -17327, -10661, -12054, -8247, -4350, -7535, -5904, -1885, 67, 1719, 14915, 18935, 11479, 5751, 10007, 7155, 4235, 7120, 15129, 19632, 14287, 15371, 13541, 10547, 14384, 8332, 2779, 4123, -2818, -6634, -5976, -4220, -399, -1578, -2069, 2077, 953, -5407, -9035, -12750, -11749, -4850, -7447, -11626, -8629, -4875, -2839, 693, -2706, -4793, 3696, 10663, 14233, 14344, 15140, 8474, -7068, -7126, -2516, 1943, 2732, -5782, -6551, -10636, -5122, -7604]
5567g604j811o82j210K222N683m409k943L576l928l696M277j128M086j689m140
5552a3396K82o465m99Q006M336K38l398J609n13R49P991J4213n801n25K296J813
5536A1136n174m940J410r486m560N052J6018M481q113r110L47j827j0136j109
5522a6011K076K587k355M600N99n526j787Q204K261Q203j341n066P117n043p882
5507i364K000Q029l310n914Q905K264K699j2151J66M498j270J337N841O616o52
5492I694o648n373r292n38N240Q86Q09P974M034L303m134j1141p117J916Q655
5477a732k083J967k573L786M048p491l898q36O005J792O388J1925n1n241p799
5462D207j419l210Q70O874K769o155o771p144L596J384m327n003K666N340m119
$$ y = [-7604, -9415, -10097, -11307, -9085, -3402, -7811, -10754, -7178, -11106, -14802, -10525, -11653, -7567, -9256, -13396, -13114, -19579, -20078, -12072, -7736, -7498, -10896, -9287, -9800, -8851, -860, 13353, 7552, 7027, 9323, 11136, 5962, 1022, 2432, -7054, -11614, -6562, 9456, 13937, 5824, -3286, -2939, -4766, -14902, -16011, -13935, -11348, -13703, -9103, -8504, -14030, -15817, -7613, -5352, 2851, 1510, -3556, 3561, -1482, -9364, -7364, 665, -2645, -8559, 346, 2610, 5309, -6842, -6676, -2178, -3448, -2111, 3730, 10346, 9694, 3046, -2327, -11619, -12157, -6917, -6031, -5222, 2752, 6786, 10089, 5955, -5186, -12303, -10387, -1732, -3815, -1848, -4421, -635, 3413, -4078, -7976, -8812, -2807, -1015, 5373, 17298, 17247, 12006, 4207, 2788, -422, 448, 7322, 10091, 3936, -2835, -9979, -6383, -4999, -9326, -14329, -11663, -6323, -10442]
5447a0442L628l98O057K484k40l750n054N407J1442p328k414j013l045l369r08
5432h943q029l512O603Q331J490O46N187k300j329J300o090L29J0669k216k507
5417c71J131K309P61P08l528r191K50N239n3n059j321O365M505q45L569J661q242
5400b112l798n916R317K88q820j589N184k204j0208R67Q492L496N891O281l25
5385D944j599l947M989k583l742P98L048J587k16q143p89N484P421L604j287M60
5369A0029o687j0647q688N78P858j551O583L474p105P62j071L051J1029k578j086
5354C951j661N084M182j338q273n185j12O57j877j519j414k724O824L088J837
5339A520j0993n374L763M112j53m695K374M960N78J450l411l888l382n280m270
$$ y = [-10442, -6814, -7212, -1155, 1329, 1089, -2661, -7715, -2308, 9134, 1806, -608, -1621, -4666, -8035, -8943, -16972, -20484, -13881, -5550, -4060, -3414, 1773, -527, -1856, -556, -6646, -6317, 4352, 2136, -371, 760, 3069, 3830, 4538, 1010, -8181, -7931, -2692, -2745, -7804, -9125, -2760, 1745, 900, 4469, 6130, -2112, -5910, -11826, -2509, -2221, -11041, -12630, -7446, -9650, -19858, -18891, -10399, -6903, -1012, 5269, 4944, 3345, -602, 4387, 1804, -1938, -1140, 1908, 3495, 3279, -4864, -5653, -169, 7252, 10856, 9569, 10029, 3342, -7305, -15993, -15415, -7557, -9108, -2525, 949, -6156, -5394, -6465, -3414, 7615, 5037, 3951, 2290, 7374, 11556, 10218, 1945, -3240, -3352, -2695, -4572, -6091, -7505, -10229, -3405, -317, 1520, -9473, -14847, -11084, -6972, -7125, -11820, -9446, -4486, -3908, -2458, -5869, -9757, -13139, -18419, -22689]
5324b2689k67P61N327P975N709L525J9o407O149M167q588j167Q439P239j410J950
5308A0732n365K998p0j3908j4681o40O666J2942k165l068l006J0144R288o907
5294B960m987L898J95j180J2955P129l565l639J106J872n444k776l42j698J483
5279G967l192l247R12p209l360k579K986J0182N499J718l459k934P098L19m321
5264F380j0119L508L755R304o277p352p628k514J0234o115j5550K753J6155P785
5250D319l723o262n123J768O729l257L27n414j72l69k846j780k733J4483L988
5235f5m398q61P950o925L758P552k673m567j1967m093Q338O285K533J0539m065
5220G341m077j788j823N105P238P554K782j319n705l246M571q857l210O951q174
$$ y = [-22689, -22956, -22195, -16868, -8893, -3184, 341, 360, -6047, 102, 4269, -4319, -5486, 2953, 10192, 8782, 10732, 5367, 8365, 8295, -5613, -20294, -20934, -14268, -1326, -3491, -6559, -9565, 579, 9867, 2960, -2027, 1871, 2066, 886, 13841, 20970, 17405, 13766, 14872, 16744, 11300, 8524, 8182, 6484, 7967, 4775, 1528, 2440, -4769, -8129, -10708, -7722, 2460, 7959, 9677, 6218, 3284, 10382, 10701, 6380, -3739, -231, 3524, 12828, 6551, -801, -8429, -10943, -709, -6824, -22374, -19621, -3466, 4319, 596, -5666, -10789, -9021, -2292, -5549, -5222, -10636, -10808, -11177, -14023, -15803, -18536, -4053, -65, -4463, -5324, 2626, -4299, -541, 7011, 4338, -229, -12196, -16289, -7951, -1666, 867, 11406, 7341, 3264, 1476, -347, 4758, 11996, 19550, 22332, 21013, 15308, 12062, 16633, 7776, 4566, 11517, 3343]
5205C343j0848j2104N436J732P681R497P315l272k129n32P091p952j6452N501
5191e693P820j498K154L064k612j72J090L480r330l929K259k484m729k756l401
5176a6737J045M978J383K509Q533j12m804o197J171K710l258r634l893J628M058
5161a6620L695l888K907L296j465M796Q03M026k358j0841l150J4291J789M212
5147A493P45K375j050k489L174L925P721m594p359j412L860k341K095m861j1024
5132i742M905M224n445n904N634N700m83k075p149m061P623J3782n635q921n806
5117a3353J937N933J0639J946q16P610J374j1719P52P745o255r28n279n758K837
5102c335J673k051K764L143R268K312m496Q04k144q99l386n192o338P433L138
$$ y = [3343, -7505, -19609, -14173, -12441, -4760, 4737, 12052, 8780, 6651, 6119, 13210, 5258, -11194, -5693, 2127, 629, 2783, 5847, 3235, 3063, 4153, 7633, -1697, -5626, -3367, -5851, -10580, -13336, -16737, -15692, -10714, -9331, -6822, 1711, 1599, -3205, -9402, -8231, -5521, -8779, -18413, -22306, -20678, -16620, -12925, -16813, -13906, -10610, -12075, -7279, -6476, -2450, -4808, -15649, -18799, -4508, -2719, 1493, 2238, 4613, 3563, 1074, 4248, 8173, 15894, 11300, 3941, 2529, 6389, 4048, 6143, 1282, -9742, -4837, -613, -6058, -11962, -6328, -628, -1111, -3186, -10335, -14396, -6773, 7009, 1374, -7547, -13353, -11416, -5483, 5156, 7102, 6286, 13896, 15270, 3551, 4303, 12048, 5793, 4865, -414, -6172, -3335, -1662, -3713, -949, 2194, 11462, 13774, 9278, 10082, 7938, 7039, 3653, -1539, -7877, -444, 2694]
5087B694m043j61n11L122K897N550m515j1239q389N68P867R922n222P57M437K828
5071F562j0112p98N490L165J115j134j704K185m204j0204m831j818L600n262J110
5056a6840M900M913J295K801R81K440j366l992J242k669L367n7q40M353n247n124
5040i843m232k051J7250M784o244n568k494J990j58R848M5j2499k449J548K155
5025g918K426J451M275n861K303J196o352L970K585L992L708r607j1807L161L325
5010i153o65k526l317N323J4946P938j39k359K771K942O38r028r846j0283o727
4995a9485P458P986N944j062q146j61P097n65j2314l418O302O123O423N903k787
4980E298k863L842o306j4059j446J3245M398p309p728R43l10N870l088O231J2919
$$ y = [2694, -1349, -1510, -2021, 1101, 3998, 9548, 5033, -6206, -14595, -14027, -6160, 3762, -1460, -703, 3734, 6562, -3550, -4348, 1142, 4307, 5422, 4288, 2584, 4769, 565, -9639, -14470, -16288, -12688, -17950, -16840, -11940, -7027, -5732, -2931, -1950, 490, -876, -4868, -3626, -6295, -2928, -2985, -3825, 528, -4719, -9843, -14075, -16126, 1124, 5908, -336, -5904, -8398, -6408, -6566, 3282, 3327, -9172, -11621, -10073, -7918, -5492, -4041, 234, -5627, -3324, -2128, -8480, -4510, -1925, 2067, 5775, -3832, -15639, -12478, -9153, -9818, -12344, -15661, -10338, 4608, 12546, 12407, 10048, 12819, 15761, 16399, 7371, -2475, -12758, -19485, -12027, -4041, 1903, 841, -7305, -7466, -369, -934, -13248, -16666, -10364, -4241, 2182, 8085, 5298, 2435, 6277, -29, -14088, -15534, -2289, 2109, -5200, -12928, -11985, -12295, -6425, -9513, -3282, 9637]
4965I637o094K66m635m610M512k24l708L23N669p071N377J0914L723m969j0654
4950a544q166L70L628J135P99P41o46J705R982n455j1344J0043m88N936M828K086
4934A3610p469k639O45n677j2633K881O145K444L057l19K250k459J591n469q198
4919a2240j010o387k340M511M938O542J877K062l4m759Q071N041M116n159n217
4904A2J189n119j0892l409K745m33j809N095J3476N622j698o725m250J107M721
4889c68M873O27n120j3711r332L867P153N129P936p125m435J768K999m710j962
4874a2411P521N505j213j1500l54l785j56M989J2247Q348p386j5680l531J5809
4860a597p4k964j005m080L054M760K734j87L985J101o521M941N241M662j830q450
$$ y = [9637, 3543, 3809, -826, -5436, -924, -1148, -4856, -4533, 1136, -5935, -558, 10356, 14079, 9110, -1544, -9710, -9340, -5712, -4577, -3778, -3037, -3683, -1978, 8004, 2549, -8795, 1248, 760, 6696, 11524, 13610, 6141, 3502, 4147, -1530, -14163, -11282, -5137, -2693, 364, 45, 2295, -164, 1427, -4042, -12240, -13250, -19637, -21977, -17466, -12528, -5986, -4109, -2047, -2081, -6840, 1231, 6272, 10388, 5229, 12, 1201, -3918, -14810, -18219, -15474, -15907, -17716, -12621, 855, 6477, 4779, -1946, -6196, -5089, -368, 4505, 5132, 12, -13699, -23031, -19164, -12011, -6882, 1054, -6071, -10506, -8738, -5739, -10449, -12411, -4890, 615, -598, -12098, -12452, -16237, -16393, -11404, 843, 9191, 1805, -13875, -17406, -1597, -1671, -4635, -5640, -9720, -6666, -1906, 828, 641, 4626, 5727, -794, 4147, 9388, 14050, 12220, 3770]
4844C770m956k406q54J308r21K8Q234K566K257j449j0712J285N881M148j768n653
4828G58m484j786j2311Q49M66J1043P733m542j584n165K329j7J331O394Q222Q143
4812A7379L462M39j0975r941M28l485q728j673J0123j17r506P212R141j810n524
4797c575J74k653L792L105k815K910N76j775m521n941N621J156p383O944J429
4782b956j7374o695P369N511o70J340j35J055o275N580J632p636N110M221O448
4767c475L916L150m183j0318k865K504J577J3231K995o465m054k185m74J496Q831
4752C681l743k367o57K385J2861M998K259m485j1571j660k030J013O392q72l002
4737C202m880K148P006o701m395n352P411j484n76P466n434q57m743j0604m155
$$ y = [3770, -1186, -3592, -4446, -3138, -4059, -4031, 4203, 6769, 9026, 7577, -3135, -1850, 4031, 8179, 6411, 758, -3726, -5512, -17823, -16974, -16508, -5465, 2268, -2274, -3858, -9023, -6694, -6711, -5380, 1014, 9236, 17379, 20841, 21280, 10305, 364, 792, -2693, -11421, -13094, -2971, -3088, -12594, -5382, 3759, 1949, -3575, -3401, -6054, -2262, 843, -1972, 938, 1514, -261, -4782, -10723, -5102, -3946, -11329, -4385, -2956, -20330, -27025, -19656, -14145, -14815, -13475, -13610, -12555, -18830, -13250, -11618, -19254, -14144, -9923, -3475, 441, 3591, -592, -10910, -13775, -11271, -9694, 3537, 6532, 67, -3987, -6172, -6646, -5150, 3681, -62, -2429, -3086, -701, 12160, 17158, 19417, 14932, 3361, 1701, -329, 684, 7076, 6204, 3202, -1678, 470, 7476, 775, -3620, -8972, -1561, -3045, -3621, 3845, -1589, -2446, -7189, -17793, -21948]
4722b1948O168M575L618r23K983M402M89N439k922k695J714q01q317m267l489
4707a5974L92Q740P033j2966N178J2080J045m413O702J244J0568j99j1551p068
4693H11k335j845L161L885k489l451j049o253Q338J2138K313l193q016j2051r355
4678a9391Q391Q925K002O924K886j7215m282M823M370q298J501L928J1404J0990
4664A6958M047r248j6457m202L350J12p79O507P545K269l621p901k635j0142O971
4649g226Q907P858L044p519o057o834l005P084J0016L094l055k831n766r501N760
4634f031R042J2n80n654k758o478J491P193M879P129k775j434K863L280n5r16
4618I208n07L658R830O523m666p953j2565n973k983k019o724k25m410K551O166
$$ y = [-21948, -15780, -11205, -7587, -8510, -5527, -1125, -636, 4803, 1881, -814, 900, 99, -8218, -12485, -15974, -15582, -6842, 191, -12775, -7597, 4483, 5528, 1115, 7817, 9061, 19629, 19430, 7879, 811, -1524, -3369, -208, 3677, 1188, -2263, -3312, -9565, -1227, 10911, 13224, 10031, 2015, -10036, -19391, -11000, -2075, -73, 6851, 9737, -7478, -11760, -6937, -2567, -10865, -9364, -5436, 5968, 16958, 21005, 11757, -4700, -8902, -5552, -5440, -6219, 288, 7833, 10102, 6481, -1420, -4055, -14197, -7226, 1681, 9539, 12583, 5064, -993, -7827, -10832, -3748, 6268, 9362, 6307, 3476, -2290, -11791, -6031, 3011, 3023, 2443, -3211, -5969, -12447, -10956, -3763, 1116, 8245, 5470, 4036, 6899, 10179, 10124, 9208, 8701, 12359, 22189, 28712, 24046, 16093, 3528, -2445, -5428, -7447, -14171, -14396, -18806, -16255, -10089]
4603a0089j160l375k772R874J3296j2076q992R89R499O788K10K078K762P276m339
4588I969q043j591J523Q764j414j0812n611M218O995J676l823j0053m201R311
4574c092o420N118j507l472N114o412n990r79P627Q113M665l275L076o637l692
4559g763M794M761p349j045J14J726N949q71j896N939j876l963k057J935j664
4544c266n511j737K833O793L88J544K101m491O532J421k692K487o531n153K048
4529c234k286L552R027O110m116M966n45j3678m817K24o232M592r84l166O262
4514d325M041K92L799J471j6073p779L371J922J0477M582P030O222k925n4n264
4499F787m190n42N165L309j4049n64J0559o581l475m042j319l18K756n79pK203
$$ y = [-10089, -11249, -14624, -17396, -7522, 5774, -6302, -15294, -14305, -4806, 1982, 2192, 4270, 7032, 14308, 9969, 1926, 335, 1858, 10622, 9208, -1604, -7215, -2997, 3998, 5674, 1851, -8202, -12403, -3092, -9512, -4394, -5901, -9373, -4259, -10671, -16661, -17640, -10013, -1900, 2765, -510, 2566, -4071, -7763, -2969, 1792, -5557, -6602, -6488, -4762, 1187, 316, -1580, 4359, 2483, -1480, -3537, -1602, -3266, -8777, -10514, -7681, -888, -500, 1044, 3145, -1346, 5186, 6607, 3915, 6402, -129, -5282, -3234, -5520, -1968, 7059, 13169, 9053, 14019, 13474, -204, -5021, -4797, -11029, -6437, -7421, -10587, -4325, -284, 8, 3807, 5278, -10795, -18574, -15203, -13281, -2804, 1778, 8808, 15030, 12105, 12051, 6787, 2597, 2055, 7220, 10529, -3520, -4084, 6475, -106, -3581, -7623, -8942, -9260, -6504, -7083, -7090, -4887]
4483d887j446j98o688m170L811K806L732K971J957l932o962m556l946K410P227
4468a1871M35J0982M792R07j1884o345P212M518P49L70o4M847P019l224r882N94
4452h45L234n620N047J378L648j911l242L075n049r875j956Q261o801J942O624
4437b090N482Q543L372O601q045j1526r178M494N777o011m574m820L839J971J0613
4422D448J329n374n514o410m416N694O262m585K814O561k698m751l80O95P531
4407A206O113q587M331R36m806K447K984r65m312L250p097j626k134L729k488
4392g019R09l154Q556L037M42k529O307k37m296L683K72p842J51n487m083j0977
4376b2267k121l247M159J499P127J7545O741J47o664j753J01O719J828l425n418
$$ y = [-4887, -6333, -6531, -13219, -17389, -13578, -10772, -7040, -4069, -2112, -6044, -13006, -17562, -21508, -19098, -11871, -11436, -454, 4338, 5245, -6639, -12984, -5772, -1254, -505, -135, -199, 4648, 11667, 8443, -1439, -845, 2389, -3231, 1816, 3194, 6842, 4931, 1689, 4764, -285, -10160, -12116, -3855, -10656, -8714, -2090, 3392, 11935, 15307, 21908, 13863, 2337, -6841, -2347, 3430, -2581, -7155, -11975, -8136, -6165, 4448, 5777, 403, -5111, -11521, -15937, -10243, -3981, -8566, -5752, 809, -1889, -6640, -7020, -6325, 1206, 7319, -1268, 3063, 3999, -807, 1640, 4624, 3659, -653, 2597, -4500, -6126, -8260, -4531, -7019, -6110, -9264, -708, 2329, 2771, 242, 6549, 6312, 2016, 5699, 5971, -1871, -1720, -7207, -11290, -22267, -24388, -27635, -23476, -21977, -14850, 2695, 9436, 9583, 2919, 1166, 1267, 7986, 9814, 6389, 971]
4361I71N541K686l961n342p679o375K334J835l039N921M029m506r182J015K823
4346a2929J241O056M717L664o938j901L38N964l70j289l764N283j783j2122o089
4331a9922Q502l55R826J50n544K500N069N923r712l109Q712P076n470J865L51
4316E862o384o951k919p8o868K71L476l498Q045j009O984L036j746j57L311N483
4300F858j307N045o529j2765L511O70J290P587o695n262m853P158M326n391J329
4285e028N664o410n508o401l27J17P396J854J612K351n84l229j188m57O624k40
4269c754q426j11l139L190J3529J3692J1744k827q057j1322J116k181o948K613
4255h81O27J025p024P570P137o143J592n387r40N581L289M964J715m499l671M865
$$ y = [971, 6512, 9198, 5237, -105, -7784, -14159, -11825, -9990, -13029, -7108, -3079, -7585, -16767, -15752, -12929, -11688, -5632, -915, 2749, -4189, -6090, -5752, 212, -158, -1447, -5211, 72, -1711, -13833, -19922, -11420, -11775, -1949, -1799, -7343, -4843, 226, 6149, -3563, -6672, 2040, 9116, 3646, 5511, 5862, -522, -7473, -10392, -10470, -17338, -17067, -13591, -17089, -9044, -10053, -3069, -33, -1779, -1936, 1375, 6858, 5551, 10596, 4067, -8698, -5187, -4517, -3227, 4360, -2335, -7597, -12450, -5292, -966, -6357, -5028, 636, -5774, -11282, -17683, -18010, -17893, -10497, -8643, -7031, -4680, -5264, -8493, -9681, -10138, -3514, -3754, -12180, -12291, -15430, -12240, 1289, 14981, 26725, 23898, 15841, 4519, 5635, 3454, -3494, -881, -254, 771, -6253, 1317, 8454, 2311, 3903, -1484, -2424, 3157, 6446, 11410, 13125, 8626, 4955, 9820]
4239I820P067l075j1135k203j250n56p699j655jk0N241n464Q92L214j201j608
4223i633j3745K77J1316P534l471k147K283j276l051J867m525J754k18Q74K011
4208a0150N865P829k766o013l012Q842k008l245J044O10l383l834Q580J1530l903
4193E986r094O44N379o42n698l084J973q92K842J962o098M130K281k542l670n47
4177g070O961M789P06p464K557M427k431P775l111k789J441q005j987K207j52
4162b146n963n009l133M399m398M438k207L84L446R672Q484M118j783m596k896
4147B810j0282P92L285n87O194J817L758K474n156m011j0032P902N341O554Q86
4132A1745R11j3727K84N632p100n835K67k177N229p43j308m75K12k970k548O820
$$ y = [9820, 16887, 13812, 2677, 474, -776, -1332, -9031, -10686, -10687, -10707, -5466, -10930, -10038, -6824, -8025, -9633, -23378, -23101, -11785, -4251, -7722, -9869, -7586, -8862, -11913, -10046, -14571, -12817, -13035, -12161, -10150, -4285, 3544, 778, -5235, -8247, 595, -1413, -4658, -3614, -3004, -6387, -10221, -1641, 9889, 5986, -3108, -2464, 2915, 2273, -3425, -6509, -4536, -5428, -2586, -624, -6722, -2592, -311, -2853, -6523, -7070, -109, 4680, 5386, -2078, 479, 4906, 2475, 10250, 7139, 4350, 5791, -2214, -4201, -1994, -2146, -8109, -13118, -16251, -11852, -16250, -11812, -14019, -13635, -10189, -517, 7967, 12085, 10302, 5706, 2810, -7472, -6680, -3395, -3982, 2212, 4029, 7787, 10261, 5105, 1094, -8938, -1036, 4305, 10859, 11745, 12656, -1071, -787, 4845, -2255, -8090, -7823, -10000, -4771, -5514, -6822, -7297, -7085, -10055, -12603, -5783]
4116e783K789j384k92J4502J332M917m490M70k800Q596j3423o640m685o619L817
4101i693Q072P633p973m420L752n20j636j813m900L841m946l569k176M137l960
4086a8171J879J2562M722j2024r111M502P313P417J53m050l961l205j0166k420
4072b4560O373k52j162l144J250P235J1802J5610M792m883j626m197n974p352
4058f088j0298L449J1545K047J251P31J908m538j453M594P792L450o721m724K045
4043D990j011L015J677q946k154j947P250l642M496L913j83J818L158K237L837
4028A8508l794R477M128n017K031l371m760n231q024M2k630j029O382J0532J144
4013A8388n541j0313r860L213Q204N753q17p112J093M673r7j1107j6465m70R916
$$ y = [-5783, -2994, -4378, -4670, 9832, 11164, 16081, 11591, 12061, 9261, 17857, 4434, -2206, -6891, -13510, -9693, -1621, 6012, -1961, -6381, -2629, -3149, -4785, -6598, -11498, -7657, -12603, -16172, -18348, -14211, -18171, -16292, -3730, 992, -11032, -20143, -15641, -8328, -911, -758, -4808, -8769, -11974, -22140, -24560, -18187, -18439, -19601, -22745, -21495, -14260, -2458, 13152, 17944, 13061, 11435, 7238, 1264, -6088, -16386, -12937, -1392, 655, 1906, 2637, 4545, 7, -1446, 3148, 10940, 14390, 7669, 2945, 4990, 3979, 6994, 8671, -275, -2429, -4376, 2874, -768, 3728, 7641, 7458, 9276, 12434, 14671, 18508, 14714, 24191, 28319, 23302, 25333, 21962, 17202, 11971, 3947, 3989, 1359, 330, 6712, 17244, 18388, 12847, 2534, -7326, -4113, 4091, 9844, 9027, 1915, 3008, 7681, 7584, -3523, -19988, -20458, -10542]
3998a0542K493o962J727k331k566k470P958M757J2639J279j0569n17M536N518
3984D950O480r482j6903O785P648J204J5088K243r240r843p48N590N019J029R33
3969A0753l011k165j4255m367p212Q780p6j330K153o66l312M257M690l64J2589
3954F464Q812j092j0257l484n467m186K350K223K578k28m769m67N812K502k212
3939a421j865J450K538m060k441N66j894k637J816k673K051J298J921k995m788
3924a3134J029P703L690J96O47K052l363k611L26j2l290M066M383K492j456J1393
3908A4111K356j589M64q263j3107l117J6188Q762J456Q03j0558r81n554j3001
3894a2030N81k519n531M841J461k393R99J961k390Q956Q977N619j489m494m141
$$ y = [-10542, -8049, -15011, -13284, -15615, -18181, -20651, -12693, -7936, 4703, 5982, -4587, -5104, -568, 4950, 11430, 1948, -14955, -8170, -522, 682, 15770, 18013, 8773, -1070, -1818, 3772, 8791, 9820, 10753, 7742, 5577, -8678, -13045, -20257, -11477, -11553, -12883, -10730, -11396, -14708, -10451, -5761, -6125, 6464, 15276, 14184, 3927, 443, -5024, -9210, -6860, -4637, -2059, -2287, -7056, -7523, -1711, 791, -1421, -3286, -1836, 702, -3358, -5799, -5233, -7127, -9764, -7948, -10621, -8570, -7272, -5351, -8346, -13134, -12105, -4402, -712, -516, 131, 2183, -1180, -3791, -3465, -3477, -6767, -2701, 1682, 4174, 2718, 14111, 16467, 14878, 15342, 7079, -6028, -9145, 7043, 15805, 17261, 18064, 7506, 6525, 971, -12030, -11449, -13968, -19499, -14658, -13197, -15590, -14591, -12630, -15020, -6064, 2913, 8532, 7043, 2549, -1592]
3879a592k147m310K806J926m45M562P698k800K127o050q27Q844P126J739p120
3864A1537j2472j0539l46J769M961N701J2607j405j8055L348j271l834k800M324
3850f475J0032N500p50n290N310N894n036n815P80J412J139j01j844j995k927
3835a66M05O4J0503N397P97J696n974j2786j822j1818r424r8O702O726o61n18
3819a0977k2K5L776N874J533L87j0324o850m237O953J2754k347l871Q488L898
3804E060M199N114j0097q582q66M223N66q08j815q74o734l915l532Q608q42l875
3788a4170M982L187N537n239r097L483J4118m039j606J86p227j1755O752P389
3774g499l756J662M103J105L053K922K833k479j0260l312J472m765j0659P837
$$ y = [-1592, -3739, -8049, -5243, -3317, -3762, 800, 8498, 5698, 7825, 1775, 948, 9792, 16918, 18657, 11537, -935, -11474, -11820, -10051, -5090, 611, 13218, 11813, -6242, -2894, -4165, -7999, -10799, -6475, 3557, 9057, 8307, 3017, 8327, 14221, 9185, 3370, 4150, 5562, 6701, 6600, 4756, 2761, -166, 239, 303, 10806, 16203, 17000, 18696, 12722, -64, -1886, -13704, -23128, -23226, -16524, -9798, -10459, -10977, -10999, -10974, -7198, -1324, 209, 596, -9728, -16578, -20815, -13862, -1108, -3455, -7326, 1162, 5060, 9259, 14373, 4276, -4306, -5172, -949, -383, -1191, -3006, -3880, -10614, -14529, -18061, -9453, -10295, -14170, -9188, -6001, -464, -5703, -14800, -11317, 2801, -1238, -2844, -2658, -9885, -21640, -14888, -7499, -11255, -9593, -5490, -4385, -1332, 1590, 4423, 1944, -8316, -11628, -10156, -14921, -25580, -17743]
3760a7743J5460N089r844k835p625n38O056Q364j1755o546O814R652J0303N54
3746E406M21k670N27j7036K244Q105P736L328P81j1621K631J1112N559j2708j3421
3731i606l841n520N107L623j934O3M301k032r59K060k112J1082J0712o544q19
3716C581L917n969m428n011q517L060J2965J4163k882k860j6739p01Q441J228
3702B48p369J2146j823l503M973m343L070m620n023O63q093m117R363O209J1373
3687I154l39j250K537n912l652m2k742n452O642l888p439N671J2212N793k303
3672H990K093j055j1306M612J2407M283k614q290J238J050q834m320M77Q926L622
3657A1279k028m067j0904k799j464j89J737p32L111K733M730L615n659j893j967
$$ y = [-17743, -2283, 2806, -7038, -9873, -17498, -18036, -11980, -3616, -15371, -21917, -15103, -5451, 4852, 5406, 5827, 3157, 3684, -13352, -11108, -3003, 4733, 8061, 8842, -2779, -148, 10964, 16523, 3815, -9606, -13447, -18967, -13860, -10237, -12171, -12108, -7807, -9839, -10798, -8738, -10850, 232, 10944, 4400, 3581, 7498, 1529, -2899, -7910, -16427, -13367, -402, 13761, 10879, 8019, -8720, -9421, -980, 248, -7121, 5025, 3202, -301, 4672, 329, 3399, -1221, -6244, -5581, -13674, -17791, -8428, -2219, 9154, 8815, 7565, 10102, 4190, 538, 496, -2246, -7698, -1056, -4944, -12383, -6712, 5500, 11293, 8990, 11083, 10028, -1278, 3334, 15741, 20024, 17410, 9120, 10358, 11408, 2574, -1746, -1269, 7657, 11279, 9251, 5184, -5720, -8519, -9983, -10172, -8435, -9167, -6056, -3323, 1407, 5022, -637, -2530, -4497]
3642d497n34j514K892K769O294j763o504L19Q04q737M655R811N895R065N745j8222
3626F478j7835K085O291R750k318n29p98r189j626K50J358M328K15o853K534O705
3610H46k284r973L54q076J983J507k453R07K032K951Q352l233r23K335k654M47
3594g882K508r43N865M49k363l080N28j601j854p74n911j1432O036N145J2750
3579b559J5061J239j617m052j58P50k134L046j020l870Q341K762j0200m947O474
3564G116O426P987m451J014K318j2603o777n138n236p969k937K743J844l569L15
3549a8917J0112o690J171k4O682L328p452l454R546J0264p001J170J57N904O792
3534A1588n197o524o839m910O946o12L45K008M491N422j627r635j570R161P630
$$ y = [-4497, -5031, -6545, -3653, -884, 5410, 3647, -2857, -2538, -1734, -10471, -5816, 3995, 9890, 18955, 24700, 6478, -11357, -9272, -2981, 6769, 4451, 3922, 3124, -6065, -7691, -7441, -6083, -1755, -1540, -8393, -5859, 846, -1438, -11411, -11057, -19133, -17150, -15643, -18096, -17189, -15157, -12206, -3854, -7087, -8010, -5675, -8329, -7882, -5374, -6317, -452, -3, -2366, -5446, -4918, -6519, -8373, -9147, -15058, -26490, -20454, -15309, -2559, 12502, 13741, 12124, 8072, 7914, 8664, 6530, 9576, 8556, 4686, 13027, 15789, 5589, 642, 7116, 13542, 21529, 17078, 18092, 20410, 7807, 1030, -4108, -9344, -17313, -20250, -17507, -15663, -19232, -18917, -8805, -15495, -14324, -14348, -7666, -4338, -11790, -15244, -5698, 4566, -2435, -1265, -1108, 4796, 11588, 6391, -133, -6972, -11882, -4936, -5548, -5203, -3195, 1296, 6718, 5091, -4544, -6114, 3047, 10677]
3519A0677k608q277j0585m117r88n771J0244M567m765l199p028L119N273j498
3505a4956P414O122L667o728L975L360M710j652m523p204j165k118N461O953j102
3490B214p930o773P304J1482N861j463p428k586q722p446K186J579j904L107O000
3475d519J1511k869o490j400o00k171K758k532K616J0855m821o173j863r642k566
3460a7906R414l262rP047N029j863k058p288j450j424l131R322J573l837N845
3445c998j099L323L36N897N242n13o742o611L137m737K601k678r91k270m085R54
3429a2234O507Q167o65j1285K21J1675K369J130n075n361J690J924m267M165L555
3414B516n017k617J165N2K563J0471k022p881L995n715n206M340j796l435K548
$$ y = [10677, 8069, -208, -10793, -14910, -15898, -21669, -11425, -6858, -11623, -14822, -21850, -18731, -13458, -14956, -7542, -1420, 2247, -4481, -506, 2854, 7564, 5912, 1389, -5815, -6980, -9098, -3637, 3316, 2214, -5716, -12489, -5185, 6297, 12158, 10695, 3267, 681, -8041, -15487, -13301, -11722, -13626, -10519, -4519, 6992, 4123, -2367, -3767, -4367, -6538, -3780, -6312, -3696, 7159, 2338, -3835, -5698, -15340, -17906, -8492, -11754, -11763, -4716, 313, -1550, -3608, -10896, -12346, -13770, -16901, -7579, -6006, -9843, -3998, -5097, -1774, -1438, 4459, 9701, 9188, 2446, -4165, -1028, -5765, -3164, -5842, -6833, -9103, -13188, -12234, -5727, 2440, 1775, -9510, -9289, 2386, 4755, 5885, 810, -4551, -2861, -937, -5204, -1039, 2516, -2501, -5118, -3953, -3901, -1338, 9133, 7111, -770, 3225, -2490, -7696, -3356, -5152, -8587, -6039]
3399f039O726J1530o479k768O583R760p497q808j954N050m068r479o484j244J1043
3384d128Q741p401n025P118L653L156l778n494P49O645m23j14k716q209o188P99
3368a2615N808L076p772j15K730L708j30J524K717L702l179k470M09J474j168
3353b301q7r233k770J0294L429M773J243j1925j443M430R336K387k196k961m701
3338a725l776J045Q063L487K778l357j3853j8964O676K0865j090k417P141n921
3324a048j0609M360M660m180Q472L892j7309r190P711l37m83Q18k256k448n665
3309b3612M512J0904O255j1854m427l05J2855J0981J960j1763J291k545j1015
3296a6763M088Q762j06L502J1528K80q937l966m595o105o434J278J7750J3566
$$ y = [-6039, 687, 12217, 5738, 2970, 9553, 19313, 11816, 3008, 1054, 6104, 2036, -7443, -13927, -15171, -4128, 4613, -2788, -7813, -695, 2958, 6114, 2336, -3158, -2409, 4236, 3813, 3699, 983, -7226, -13414, -12615, -6807, -3731, -11503, -11618, -8888, -5180, -5310, -3786, -1069, 2633, -546, -3016, -2607, -1133, -2301, -2388, -11621, -14391, -4097, -668, 4105, 5348, -6577, -8020, -3590, 5746, 8133, 5937, 2976, -1725, -5501, -4456, 3607, 7094, 9872, 6515, -7338, -26302, -19626, 1239, 149, -2268, 4873, -1048, -11657, -7297, -2637, -6817, 1655, 5547, -11762, -20952, -13241, -13578, -14061, -13243, -15499, -17947, -23612, -19100, -8196, -1941, -13795, -18222, -18527, -5672, 5309, 7269, -4494, -3203, -5748, -16763, -12675, -3913, -4019, -517, 11011, 11291, 2354, -1612, -6207, -12312, -18746, -17468, 282, 13848]
3282A3848p82j0491j0578K849K789l63n626j5921k502L973J1669J739M839m024
3268h581m197N613J334k532o943j1243K705R291O346j824k93q83P478J0624m731
3253B164L878Mq869o97J342j527K457Q271o034n958p61J612L017j968J1320J024
3237I275q237m547o4K097l648J10O861R936o8q144l284K050J386J1624l130j2692
3221d75j0652q087J155Q169k247Q43q827n142J1575J3364p800o00L356m475J63
3206i680k551M212Q820M807K972p073j7199P535N834M770j047L002L784j7431
3192i245j2793M986M077K959N500j0405j264J3310R492O198L87J676NK974p54
3177A7103K460P71n813j7898o014L671q66m271N211R293O201l904o327J217l316
$$ y = [13848, 13066, 2575, -8003, -5154, -2365, -2728, -8354, -24275, -26777, -22804, -11135, -9396, -4557, -8581, -12778, -7165, -5831, -8363, -15306, -26549, -23844, -14553, -8207, -10031, -10324, -11207, -3729, 6895, 2164, 6042, 6046, -2823, -3520, -2178, -3705, -1248, 7023, 989, -4969, -5730, -4118, -1101, -3069, 8251, 9275, 1038, -3509, -3573, -1476, -5124, -5014, 1847, 11783, 11715, 3571, 287, 2337, 3723, 15347, 12217, -475, -11127, -19214, -18059, -9890, -12137, -11294, -20121, -25263, -13688, -324, -8124, -8724, -5368, -9843, -9680, -12231, -8019, 801, 5608, 8580, 1507, -15692, -8157, -2323, 2447, 1400, 4402, 8186, -9245, -22038, -17052, -12975, -10016, -4516, -14921, -16185, -2875, 6617, 12815, 13202, 14878, 14883, 17857, 17103, 19563, 20334, 14521, -3377, -9391, -5720, -6586, -10857, -5646, 3647, 9848, 5944, -383, 834, -2482]
3162b482l607j849L322j961j081J335N3R567K694m267K854J896o558r05M099M102
3146G212J696r211k737p553N652L727k520J16r34J2693O973k342J034L58j1589
3131B575k785L284Q413Q192j1686q457m856J97Q163j866l045l24N860l17o62K632
3115E318J535j4343L82O163P405L833o268q210N95K202j3179k529M225J2099K840
3100B068n338N153K687o05R483K883m921n800k350J396K819Q606M416m699k749
3085A3049K080N194m119p425p60l802o45L179J857%K80m28l778p910L549N354
3069E675K013p018L694k714p855L060m472m585m141m131L692N841J5028N552j4074
3054d435k829M411J539L119m710L22K6k586L992J1363k797q107q303K742o1n805
$$ y = [-2482, -6089, -7938, -4616, -6577, -7658, -6323, -6270, 3297, 5991, 1724, 4578, 6474, -84, -989, 3110, 7212, 8908, -303, -3040, -10593, -4941, -1214, -3734, -3618, -4552, 8141, 15114, 12772, 13806, 14164, 2575, -210, 3074, 11487, 19679, 7993, -464, -5320, -5123, 3040, 1174, -1871, -2195, 3665, 3348, 2686, 5318, 6853, -7490, -7108, -945, 6460, 10293, 4025, -4185, -3590, -1388, -14567, -17096, -12871, -772, 2068, -3270, 1883, 4570, 3965, 13448, 16331, 11410, 5610, 3260, 4656, 7475, 16081, 20497, 15798, 13049, 15129, 20323, 16204, 8779, 8019, 4217, 3572, 6751, 8608, 8608, 8888, 8460, 4682, -3228, 321, 5675, 7688, 670, 4364, 1650, -6205, -3145, -7617, -12202, -16343, -20474, -16782, -10941, 4087, 9639, -4435, -7264, -2853, -1314, 1805, -2905, -2583, -2557, -5143, -1151, 10212, 7415, -692, -8995, -6253, -6314, -12119]
3038a2119Q056M965m135j307N589O21q28k152l948J429m654R43N269J2480P419
3023A7628p347q275N848Q861j895j3769q698N556K955m905m829r77K157J0644
3009B954j80k834J1312J535J119J974j1807q515N260J6786M949o634j189o566
2995H164q54M0p721k709o177j728j242J3373J0003K865K453L626l775j673M126
2980A8771k252q764K820j980m983j714M82M261J2783K509l450j3958j0640M662
2966a453P450P09O34j3330l877j343m790K387Q329j304m852J154J551J572l824
2951a0987J938M537J781o733l726l517m997K488R499J7370O285m842j8589q375
2937a7868N93k647O153J0965j228M026Q38r050o557P695O078N671l481N76K956
$$ y = [-12119, -4063, 902, -3233, -4540, 1049, 1670, 842, -1310, -5258, -3829, -8483, -7540, -2271, 10209, 17628, 10281, 2006, 7854, 16715, 14820, 1051, -7647, -2091, 864, -4041, -8870, -9847, -7690, 2954, 2774, -60, 11252, 12787, 13906, 15880, 4073, -4442, 818, 17604, 22553, 15919, 14730, 8164, 7310, 7350, -371, -3080, -9257, -10985, -12227, 1146, 11149, 14014, 16467, 20093, 16318, 14645, 18771, 16519, 7755, 10575, 8595, 3612, 1898, 2380, 6641, 19424, 21933, 18483, 4525, -6115, -1453, 5997, 6706, 7340, -5990, -9867, -11210, -16000, -13613, -5284, -6588, -11440, -10286, -8735, -7163, -10987, -9049, -4512, -2731, -9464, -13190, -16707, -21704, -19216, -9717, 7653, 13938, 9096, -9493, -17868, -17275, -19922, -13769, -2804, -4032, -6, 832, -8218, -14775, -7080, -1002, 4669, 1188, 1764, 4720]
2922D720m31o775n384k874j868O170M474K223m784j12J815n355k603J965N479
2907c340N139J2922l62r799n765K348m374p202l578k350J1986N596l745l401n170
2892a1095N271M807Q22k049K843k617J353j094Q307j027K154l706n158j514k357
2877e060j346m216K100O129R153l84q667l135J622O630K354J073j113n161j535
2862a556J240K836O577n7k866j4384n59J259r42j242P766q3N46K321k268o548
2846g960q16J1017M796Q147r019j2728j539N787N128j715p93M18J028l537M434
2831B648J854m148R319n978n222N244L212r796k412p85N686K565n155l754k237
2816h959p14R029N243K885n939o190J62l507L687M718J819K620M983r22q787j1068
$$ y = [4720, 4289, -2486, -7870, -10744, -12612, -6442, -1968, 255, -4529, -4641, -2826, -8181, -10784, -8819, -3340, 1799, 14721, 14359, 4560, -1205, 1143, -3231, -10433, -14011, -16361, -4375, 1221, -2524, -5925, -11095, -5824, -1017, -195, -2244, 599, -2018, -665, -1759, 6548, 5521, 7675, 3969, -1189, -2703, -5060, -6406, -10622, -8522, -2393, 6760, 6376, -2291, -5426, -3804, 2826, 5180, 6253, 5140, -21, -1556, -316, 2520, 9097, 9040, 6174, -8210, -8769, -7510, -8452, -9694, -1928, -2011, -1465, 856, -1412, -7960, -8776, 2241, 7037, 15184, 6165, -6563, -8102, -2315, 2813, 1098, 305, 723, 1751, -1786, 2648, 4502, 354, 9673, 3695, -1527, 3717, 6929, -2867, -5279, -6064, -378, 2187, -2968, -6722, -8959, -9673, -644, 4599, 7484, 1545, -4645, -4483, -7990, -4303, 415, 2234, 4854, 9837, 8915, 128, -10940]
2800a0940J204J4093n112r420j0341K082R792j594K707J1613M313n737J050l232
2786D78P081K906n040j810R867L761k387k537k160Q421p29p961l887j591J127
2771E539K11k080k198m945l62l555M696P843k073L210P082Q607n513N457n343
2756A6576n632j145q96L188p89L34n915j617J312q101l443L595P901L998L649
2741A3015k546m019j540q926M121Q042J748J012q474m183K66m888j011l82K20
2726g545J185O748J590j0707n719L652N994M799m890o315J0984P608K735m673
2712E446p030k918K286l483j876k55O948K466L355L97p014m73k641J469J772N325
2696C774j16j864J1m739l79j134k891p074J742J0373M224o259M758K520J76n320
$$ y = [-10940, -9736, 4357, -755, -10175, -20516, -18434, -8642, -10236, -7529, 4084, 8397, 2660, 3710, 478, 7559, 10465, 5425, 3615, 13482, 17243, 14856, 12319, 10159, 18580, 17851, 9890, 6003, 4412, 5539, 5750, 3670, 1472, -3473, -3835, -7390, -2694, 5149, 3076, 6286, 13368, 21975, 16462, 21919, 16576, 10944, 9799, 8903, 12091, 11302, 11636, 5721, 4104, 5416, -2685, -6128, -2533, 5368, 9366, 13015, 10469, 6450, 4910, -4016, 105, 8147, 9895, 10907, 2433, -1750, -1484, -6372, -7383, -7765, -7545, -6360, 388, 1978, -8729, -14448, -10796, -4802, -3, -4893, -11208, -224, 7384, 10119, 5446, -1584, -4502, -2216, -5699, -7575, -7830, -882, 1584, 4939, 5336, -1678, -2151, -4792, -3323, -1551, 3774, 3658, 1794, 1805, -2934, -3313, -4447, -7338, -14412, -12670, -2297, 1927, -4332, 426, 2946, 3122, -2198]
2680b198J8801n888j1973K431M568M031O307p26o944J204l070l127J558K536j7814
2665a0304m838Q280Q298K320j0133n453Q658M235J279K670J643O320L230p433
2651H772k450k70o061k263k024J232M413L072M058J243o814l13M557J788r38o466
2635A536l795n939m616l699P129J084M51J1817L433J627P128j5625j2168j956
2621a3593n772m290j2k726L698J4105M825l367M262n244q033l896m139M599J0582
2606i001J6213L403n221j4360n863O081j157J302O386O880j738j006Q945M908
2592A5772p920j197q522o660L811N918O879l432m346r63P716L038o629J429Q60
2577E754n329j0755r594n483J910M084N042K16j53p672Q53J4828J1540m054r364
$$ y = [-2198, 16603, 10715, -1258, 1173, 5741, 9772, 16079, 15353, 8409, 9613, 6543, 3416, 4974, 7510, -10304, -15142, -6862, 1436, 3756, -6377, -11830, -3172, 1063, 2342, 5012, 6655, 12975, 16205, 8772, 6322, 6052, -9, -2272, -4296, -3064, 1349, 4421, 8479, 9722, 2908, 2595, 7152, 8940, 8002, 1536, -2259, -8198, -12814, -16513, -9384, -8300, -7849, 3968, 7401, 9028, 16156, 531, -11637, -13593, -19365, -23655, -23667, -26393, -22695, -8590, -3765, -7132, -2870, -8114, -16147, -20043, -24182, -19583, -9001, 7212, 10615, 5394, -8966, -14829, -8748, -9905, -8603, -2217, 4663, 2925, 1919, 10864, 15772, 7852, 6655, -1867, -8527, -4716, 1202, 8081, 4649, 303, -660, 7056, 10094, 3465, 4894, 5754, 425, -10330, -19924, -25407, -23497, -19413, -14371, -14155, -14308, -21980, -21127, -6299, 5241, 1187, -8177]
2562h177q923L532M023k871L59Q059M899J310M408J945j460J589J0234l107q444
2547G376k570j1008K390R815M576P18k329K589K654j0316k569L207k016m109P8
2532a514M542L937K451k562l057l224l953R108L836o100q267p646J858P23l23
2517a0191r844l348J0344J3749J6860m493o653L592r256m058l449K07L415N83
2503b542P586L918K157m678M379N100P73j053j2868j2165P91P90k42o527J021
2488a3560P156L34J249j948p45m268J747P963j721O108J6665p05j1455m104O077
2473H793L520o930j71K836k82k251N655l677K44L317n079J335M042q674q396N392
2457c26L774L024N492o296j875n133M628J529m137j3267N019L961N603K336J360
$$ y = [-8177, -17100, -13568, -9545, -12416, -12057, -3998, 901, 2211, 6619, 8564, 7104, 8693, 18927, 15820, 7376, 4806, -6202, -3812, 6003, 10579, 11297, 8968, 11557, 14211, 3895, 1326, 4533, 2517, -1592, -1514, 3028, 6965, 9416, 6854, 3797, 573, -3380, 5728, 9564, 3464, -4803, -12449, -10591, -9868, -10191, -20035, -23383, -13039, 710, 17570, 13077, 6424, 10016, 760, -3298, -6747, -6540, -3125, -2542, 5044, 8962, 11119, 6441, 10820, 15920, 16693, 15640, 2772, -9393, -8602, -7812, -8054, -14581, -13560, -6404, -6070, -4821, -6769, -7514, -11782, -10035, -2072, -3793, 2315, 18980, 18275, 6820, 2716, 8793, 12313, 5383, 5212, 8048, 7766, 5515, 11170, 7493, 7737, 11054, 5975, 7310, 11352, 2678, -5718, -326, 3448, 6472, 11964, 5668, 3793, -1340, 3288, 4817, 680, -12587, -7568, -3607, 1996, 4332, 5692]
2442E692m460q430M820J8627L455p005q969K524q920q84N614J789p06L76j847
2427A676L893j937j0054m943J739J0691O018k102J503r99J423l949L825k3n36
2412F225r500k703N152J1535J0138q83n673K076r009n970Q528m053J386k065m933
2397B51M947L16j1841n908P17N917L327K140j2931n414K034J0574l494O400O389
2382C424K480o990j0696K08J2841J0864K261j1936L505N932o979j126J0379m510
2368I657j2886p98N433j963o218P805O734N543k746k367k838l884l549n577K676
2353d978M64O679L43l292l830j969j413N282R847L334n414J40r329m588R090M177
2337D543O43Q343K670q594r590p489J141k155L049k197L006P767O2J636q869J944
$$ y = [5692, 1232, -7198, -2378, 16249, 19704, 12699, 3730, 6254, -2666, -3550, 2064, 3853, 3147, 3523, 1676, 5569, 3632, -6422, -11365, -9626, 1065, 7083, 4981, 6484, 5485, 6908, 2959, 6784, 6761, 6225, -3275, -5978, -826, 10709, 20847, 19964, 14291, 16367, 7358, 1388, 9916, 5863, 7249, 5184, 251, 5198, 5514, -6327, -12235, -11518, -5601, -2274, -134, -13065, -18479, -16445, -5871, -9365, -2965, 3424, 5904, -1086, -11782, -11574, 1267, 12131, 14392, 2456, 5961, 11893, 4914, 3788, 14167, 9657, -3229, -4027, 1406, -557, -6775, 1030, 7764, 13307, 10561, 8194, 5356, 1472, -2077, -7654, -4978, -4514, 2165, 2508, -784, -4614, -6583, -7996, -2714, 7133, 10467, 5053, 5193, -4136, -8724, 366, 4543, 5186, 13529, 16199, 7605, -1985, -9474, -8333, -10488, -7439, -9636, -6630, 1137, 1199, 2835, -6034, -4090]
2321d090k12K123L121o86M290L562k7j2355M952K664n722o95l242l488m208o122
2305b0135j535J1906O916Q484Q630R010p47j89n350j0652p299M66K200J478M235
2290G418P681l23o957q418K099K590J116L955K462L929O475p693p160L919j0553
2275E40l725L457p549R342Q24j218j3138l05P410P263K828p527l679J277M266
2260F6J1060k055l468M790m525O012k653j1354L114Q208o924m851k993k410R557
2245A574O299q509N391k202q008r19L672m521k686j131Q358L475l175q146j971
2230a2499J207L828J491j625p342M714Q484k689r496m25o591L678L250P48J841
2215a1426l272k340l669j232Q554J4256J603K500j862J413J894p776o781O364
$$ y = [-4090, -4302, -2179, 942, 256, 4546, 8108, 8081, -4274, 678, 3342, -2380, -3075, -6317, -9805, -14013, -20135, -21670, -9764, -2848, 5636, 14266, 23276, 22529, 22340, 16990, 6338, -961, -495, 1705, 3183, 7418, 15099, 14776, 7819, -599, 1500, 4090, 5206, 9161, 11623, 15552, 22027, 14334, 7174, 11093, 540, -3185, 272, -7277, 2065, 2889, 1671, -11467, -11772, -4362, 2901, 5729, -1798, -5477, -4200, 66, 11126, 9071, 5603, 10393, 5868, 11880, 9227, -2127, 987, 9195, 2271, -2580, -5573, -7983, 1574, 7873, -636, 4755, 2553, -5455, -6374, -2702, -7223, -9909, -11040, -2682, 793, -2382, -10528, -12499, -11292, -7464, -5973, -7598, -14940, -10226, -1742, -4431, -13927, -14352, -20943, -17265, -14015, -13267, -11426, -14698, -17038, -20707, -21939, -13385, 871, 2474, 4974, 3112, 4525, 6419, -1357, -8138, -1774]
2201a774N955K16K968K780l587K06l53o376j761J150l903m827p128K279O871J4304
2185G020n75n517M356J3200M535q924p808m239Q107O423L706K122n763o159l292
2170G192o902K234L465L2P40O88n902p694K774Q506R050K790r648J662K537r824
2154A700Q2k752k412o50m360q842M100M592m870R356J1567m271q982o46P650K557
2138C819K44r89M242o064j0763M663m159K830P457M877J658n133k185K724L416
2123F637n73k881k269l217k607P003L203j043j382K110j399J328Q67j1772J075
2108d920P466P416m313l531N236K972M587m692o223j1102j573m957M703Q721O873
2093F663K41J381J57o057p972j598J099K328M113R856q661K806K093R83l872q755
$$ y = [-1774, 4181, 4397, 7365, 10145, 6558, 6764, 6411, 35, -1726, -576, -4479, -9306, -16434, -14155, -7284, 7020, 6445, 928, 5284, 18484, 23019, 14095, 6287, 2048, 10155, 16578, 20284, 22406, 16643, 10484, 7192, 290, 2524, 5989, 6021, 6761, 7449, 1547, -6147, -3373, 5133, 14183, 16973, 7325, 8987, 11524, 1700, 1782, -970, -3382, -4032, -8392, -17234, -13134, -8542, -13412, -4056, 7511, 3240, -5742, -6388, 1262, 3819, 4063, 3074, 7316, 1252, -9511, -4848, -9007, -6177, 1280, 6157, 7815, 2682, 497, 3221, 6637, 6064, 3183, 914, -2303, -4910, 2093, 5296, 4253, 2871, 4981, 3582, 4910, 5777, -5995, -4920, 2546, 9962, 5649, 2118, 7354, 10326, 14913, 10221, 3998, -7104, -8677, -13634, -8931, -210, 6663, 6904, 8285, 8442, 2385, -5587, -7185, -6086, -3758, 355, 10211, 1550, 4356, 6449, 7432, 3560, -5195]
2077e195m359M858P870n522p54J51K211M739J0506P919n995l925n104m969j104
2062A327O43j807J435N619j577P404p57j968J022N445j0270j626j929Q684L646
2047A5291p555K519Q21J018o892N304Q478l922k643J301m09n348L526k599j461
2032G429J602o794q441K606N740k12M34R411j885k514l66M724J534K658K278n550
2016A2654p005J967N488L170m880o425o766Q053j723o726Q95j281l309O11J437
2001c840R969J462J552j0177m147L153O675r15k395l936J3067J0354j0390p744
1987B688k127j1370j926K934K655l342J343J400K567M305j769M38n16o90Q687
1972E277P374k692r010k463k717K916M743M649l267J15q75J024J0939j409n517
$$ y = [-5195, -9554, -4696, 3174, -2348, -3102, -2951, -740, 3999, 14505, 22424, 16429, 12504, 7400, 2431, 1327, 1970, 163, 1598, 7217, 5640, 13044, 12287, 10319, 11341, 16786, 6516, 4890, 2961, 11645, 15291, 7736, 10255, 11076, 12094, 5202, 10506, 18984, 15062, 12419, 13720, 13311, 7963, 11489, 8890, 7429, 9031, 2237, -6204, -3598, 2142, 1930, 2364, 11775, 9890, 7376, 7010, 11734, 13268, 15926, 18204, 12654, 5649, 7616, 13104, 16274, 11394, 4969, -1797, 6256, 4533, -2193, -1298, -2579, -5888, -5277, -3840, 6129, 7591, 9143, -1034, -5181, -2028, 4647, 3732, 1337, -2599, 10468, 20822, 10432, 2688, 561, -10809, -12735, -9801, -7146, -10488, -9145, -7745, -5178, -873, -2642, -2204, -2720, -3410, 5277, 12651, 9959, 949, -1514, -4231, -1315, 3428, 8077, 4810, 4925, 4050, 5074, 16013, 14604, 9087]
1957I087j2280M839L016L82m064L895k937k045Q569M837o123j1746o140m891L092
1942a2509r733q755J796J3148O581J0108j715q53L4j740m789J075J415l497n931
1927a5365m28J1125Q919k344q173l035m211j685J2170J1361m577p717m174L280
1913d854m473J149O880k229O105J887j2953q117k851O217M807m097j764K442l331
1898a5182k615L426R759J6561j549j1258j0816N621Q942P163l376l412j504o49
1884A111k298K759K366J8J973L206k159m194L39n48L483m452n298n900l871J1092
1868b373J3061Q16j234l928n952M736M431k360j1448q464K131r55L545P732p23
1853i85m805K710n317K59n475O478N031M338L656K811K287m085p57q5K177N472
$$ y = [9087, -3193, 1646, 4662, 5044, 980, 4875, 1938, -107, 8462, 13299, 7176, -4570, -10710, -15601, -12509, -22242, -30997, -29201, -16053, -9472, 636, -1079, -1932, -1898, -3638, -8427, -7352, -5937, -9434, -15365, -15793, -4668, 4251, 1907, -6266, -9301, -13512, -15197, -3027, 8334, 3757, -3960, -8134, -4854, -9327, -8178, -1298, -3527, 2578, 4465, -8488, -16605, -19456, -13239, -8432, -12529, -14293, -11851, -15182, -17797, -14371, -4612, 11949, 10400, -858, -11674, -6053, 2889, 10052, 6676, 3264, 1760, 1111, -1187, 1572, 3938, 3956, 5929, 9135, 6976, 2782, 3121, 2573, 6056, 1604, -3694, -9594, -13465, -2373, 10688, 11504, 10270, 6342, 390, 5126, 9557, 7197, -4251, -12715, -10584, -11539, -7994, -262, -985, -5790, -3080, -8397, -8138, -13613, -7135, -2104, 2234, 5890, 8701, 10988, 6903, 6146, 6061, 8238, 13710]
1837A3710p71o024p5j887K565j613M85M436M186q26K773n300o679R77j129L958
1821H786j2344J914M071j176r27M018L196m566m258k910Q42L492j009o93j593
1806c157o06j178O939j899r56J0187K611N737Q520n177j380q244q058N98P594
1791A1531p09j2241M051m575j946R64l680K804L842J0296m854k684m605n261n661
1776a2728L416J1905N244P252k954o817M50p576n539m77O382L795K589M255J759
1761A0956Q429j599n347P761j207k536n174l303J352o384J744Q334j467q140q731
1746e312L01P609k219K118m407R97K490J045Q243O702l59l827M736N890o493j5938
1730A576j1525L342L871L046P040N894L823j633j262P57j1214o79j583k634n059
$$ y = [13710, 12939, 6915, 6840, 4953, 7518, 5905, 6390, 10826, 15012, 14186, 16959, 11659, 4980, 5957, 4828, 8786, -3558, -1644, 2427, 1251, 324, 4342, 7538, 2972, -1286, -4196, -3354, 138, -871, -1564, -3157, -3763, -4941, 1998, 99, -857, 9330, 11941, 17678, 26198, 21021, 19641, 11397, 3339, 3937, 11531, 10822, -1419, 2632, -1943, -3889, -2925, -6605, -3801, 41, 10337, 5483, 2799, -1806, -7067, -12728, -9312, 2593, 7837, 15089, 12135, 5318, 5768, -1808, -7347, -7824, -1442, 2353, 4942, 9197, 10956, 19385, 17786, 12439, 20200, 18993, 16457, 11283, 7980, 9332, 2948, 4692, 13026, 11559, 3419, -5312, -5011, 2598, 379, 2497, -1910, -913, 1577, 2622, 10865, 17567, 17208, 13381, 18117, 24007, 17514, 1576, -9949, -6607, -2736, 310, 7350, 13244, 17067, 15434, 14172, 14929, 3715, 3036, 1453, -1181, -6240]
$$ [...]
##END NTUPLES=NMR SPECTRUM
##END=
