##TITLE=Analysis number 314998
Compound Code spb 03128
Project Code adrs
Chemist Name fudan
##JCAMPDX= 6.0         $$ Bruker NMR JCAMP-DX V2.0
##DATA TYPE= NMR SPECTRUM
##DATA CLASS= NTUPLES
##ORIGIN= Bruker BioSpin GmbH
##OWNER= NMR
$$ XWIN-NMR		Version 3.5
$$ Wed Nov  2 14:28:16 2005 GMT Standard Time (UT+0h)  MAYBRIDGE\NMR@NMR_250MHZ
##.OBSERVE FREQUENCY= 250.131544655141
##.OBSERVE NUCLEUS= ^1H
##.ACQUISITION MODE= SIMULTANEOUS (DQD)
##.ACQUISITION SCHEME= undefined
##.AVERAGES= 16
##.DIGITISER RES= 18
##SPECTROMETER/DATA SYSTEM= dpx250
##.PULSE SEQUENCE= zg30
##.SOLVENT NAME= DMSO
##.SHIFT REFERENCE= (INTERNAL, DMSO, 0, 16.522)
##AUDIT TRAIL= $$ (NUMBER, WHEN, WHO, WHERE, WHAT)
$$ ##TITLE= Audit trail, XWIN-NMR		Version 3.5
$$ ##JCAMPDX= 5.01
$$ ##ORIGIN= Bruker BioSpin GmbH
$$ ##OWNER= NMR
$$ C:\u/data/dgb/nmr/ADRS/11780/pdata/1/auditp.txt
$$ ##AUDIT TRAIL=  $$ (NUMBER, WHEN, WHO, WHERE, WHAT)
(   1,<2005-11-02 14:27:46.19 +000>,<MAYBRIDGE\NMR>,<NMR_250MHZ>,
      <created by zg, POWCHK disabled, PULCHK disabled
       configuration hash MD5:
       62 19 C7 07 E1 42 D1 B7 37 6C 3D D0 77 39 F9 E6
       data hash MD5: 64K
       66 56 5A 86 CD EB 12 2B 96 74 EB 8D 59 97 37 96>)
(   2,<2005-11-02 14:27:59.86 +000>,<MAYBRIDGE\NMR>,<NMR_250MHZ>,
      <Start of raw data processing
       ef LB = 0.3 FT_mod = 6 PKNL = 1 SI = 32K 
       data hash MD5: 32K
       4A 38 22 A7 1F 6E 8D 9A 7E EE A5 8A 36 93 B8 59>)
(   3,<2005-11-02 14:28:01.66 +000>,<MAYBRIDGE\NMR>,<NMR_250MHZ>,
      <apk 
       data hash MD5: 32K
       81 08 5E 46 C0 91 87 32 16 C6 5F 8A D5 35 2F F2>)
(   4,<2005-11-02 14:28:02.71 +000>,<MAYBRIDGE\NMR>,<NMR_250MHZ>,
      <abs ABSG = 5 
       data hash MD5: 32K
       FC 20 35 C0 31 8C C1 DD CE 68 64 51 4C A4 62 5F>)
$$ ##END=
$$ 
$$ hash MD5
$$ 4D AC 5C 3F DE F1 2E 53 0D 03 BD D6 EE E5 7F C7
##$RELAX= 
##$RELAX= 
##$RELAX= 
##$RELAX= 
##$RELAX= 
##$RELAX= 
##$RELAX= 
$$ Bruker specific parameters
$$ --------------------------
##$DU= <C:\u>
##$EXPNO= 11780
##$NAME= <ADRS>
##$PROCNO= 1
##$TYPE= <nmr>
##$USER= <dgb>
##$AMP= (0..31)
100 100 100 100 100 100 100 100 100 100 100 100 100 100 100 100 100 100 
100 100 100 100 100 100 100 100 100 100 100 100 100 100 
##$AQSEQ= 0
##$AQ_mod= 3
##$AUNM= <au_zg>
##$AUTOPOS= <30 >
##$BF1= 250.13
##$BF2= 250.13
##$BF3= 250.13
##$BF4= 250.13
##$BF5= 500.13
##$BF6= 500.13
##$BF7= 500.13
##$BF8= 500.13
##$BYTORDA= 1
##$CFDGTYP= 0
##$CFRGTYP= 5
##$CHEMSTR= <none>
##$CNST= (0..31)
1 1 145 1 1 1 1 1 1 1 1 1 1 1 1 1 1 1 1 1 1 1 1 1 1 1 1 1 1 1 1 1 
##$CPDPRG= <>
##$CPDPRG1= <>
##$CPDPRG2= <>
##$CPDPRG3= <>
##$CPDPRG4= <mlev>
##$CPDPRG5= <mlev>
##$CPDPRG6= <mlev>
##$CPDPRG7= <mlev>
##$CPDPRG8= <mlev>
##$CPDPRGB= <>
##$CPDPRGT= <>
##$D= (0..31)
0 1 0 0 0 0 0 0 0 0.06 0 0 0 0 0 0 0.0002 0 0 0 0 0 0 0 0 0 0 0 0 0 0 
0 
##$DATE= 1130941665
##$DBL= (0..7)
120 120 120 120 120 120 120 120 
##$DBP= (0..7)
150 150 150 150 150 150 150 150 
##$DBP07= 0
##$DBPNAM0= <>
##$DBPNAM1= <>
##$DBPNAM2= <>
$$ [...]
##$SUBNAM7= <"">
##$SUBNAM8= <"">
##$SUBNAM9= <"">
##$SW= 20.6930455092707
##$SWIBOX= (0..15)
0 0 3 0 0 0 0 0 0 0 0 0 0 0 0 0 
##$SW_h= 5175.983436853
##$TD= 65536
##$TD0= 1
##$TE= 295.16
##$TE2= 300
##$TE3= 300
##$TEG= 300
##$TL= (0..7)
0 120 120 120 120 120 120 120 
##$TP= (0..7)
150 150 150 150 150 150 150 150 
##$TP07= 0
##$TPNAME0= <>
##$TPNAME1= <>
##$TPNAME2= <>
##$TPNAME3= <>
##$TPNAME4= <>
##$TPNAME5= <>
##$TPNAME6= <>
##$TPNAME7= <>
##$TPOAL= (0..7)
0.5 0.5 0.5 0.5 0.5 0.5 0.5 0.5 
##$TPOFFS= (0..7)
0 0 0 0 0 0 0 0 
##$TUNHIN= 0
##$TUNHOUT= 0
##$TUNXOUT= 0
##$USERA1= <user>
##$USERA2= <user>
##$USERA3= <user>
##$USERA4= <user>
##$USERA5= <user>
##$V9= 5
##$VALIST= <valist>
##$VCLIST= <CCCCCCCCCCCCCCC>
##$VD= 0
##$VDLIST= <DDDDDDDDDDDDDDD>
##$VPLIST= <PPPPPPPPPPPPPPP>
##$VTLIST= <TTTTTTTTTTTTTTT>
##$WBST= 1024
##$WBSW= 4
##$XGAIN= (0..3)
0 0 0 0 
##$XL= 0
##$YL= 0
##$YMAX_a= 445854
##$YMIN_a= -460179
##$ZGOPTNS= <>
##$ZL1= 120
##$ZL2= 120
##$ZL3= 120
##$ZL4= 120
##$ABSF1= 16.522
##$ABSF2= -4.171173
##$ABSG= 5
##$ABSL= 3
##$ALPHA= 0
##$AQORDER= 0
##$ASSFAC= 0
##$ASSFACI= 0
##$ASSFACX= 0
##$ASSWID= 0
##$AUNMP= <proc_1d>
##$AZFE= 0.1
##$AZFW= 0.1
##$BCFW= 0
##$BC_mod= 0
##$BYTORDP= 0
##$COROFFS= 0
##$CY= 12.5
##$DATMOD= 1
##$DC= 0
##$DFILT= <>
##$DTYPP= 0
##$F1P= 14.0000005364418
##$F2P= -0.99999901652339
##$FCOR= 0.5
##$FTSIZE= 32768
##$FT_mod= 6
##$GAMMA= 0
##$GB= 0
##$INTBC= 1
##$INTSCL= 1
##$ISEN= 128
##$LB= 0.3
##$LEV0= 0
##$LPBIN= 0
##$MAXI= 10000
##$MC2= 0
##$MEAN= 0
##$ME_mod= 0
##$MI= 0
##$NCOEF= 0
##$NC_proc= -2
##$NLEV= 6
##$NOISF1= 0
##$NOISF2= 0
##$NSP= 0
##$NTH_PI= 0
##$NZP= 0
##$OFFSET= 16.522
##$PC= 1
##$PHC0= 62.15512
##$PHC1= 5.456306
##$PH_mod= 1
##$PKNL= yes
##$PPARMOD= 0
##$PSCAL= 4
##$PSIGN= 0
##$REVERSE= no
##$SF= 250.13
##$SI= 32768
##$SIGF1= 0
##$SIGF2= 0
##$SINO= 400
##$SIOLD= 32768
##$SREGLST= <1H.DMSO>
##$SSB= 0
##$STSI= 32768
##$STSR= 0
##$SW_p= 5175.98343685301
##$SYMM= 0
##$S_DEV= 0
##$TDeff= 65536
##$TDoff= 0
##$TI= <Analysis number 999999
Compound Code 99
Book Reference 9
Project Code 9>
##$TILT= no
##$TM1= 0
##$TM2= 0
##$TOPLEV= 0
##$USERP1= <user>
##$USERP2= <user>
##$USERP3= <user>
##$USERP4= <user>
##$USERP5= <user>
##$WDW= 1
##$XDIM= 32768
##$YMAX_p= 463563174
##$YMIN_p= -138028
$$ End of Bruker specific parameters
$$ ---------------------------------
##NTUPLES= NMR SPECTRUM
##VAR_NAME=  FREQUENCY,     SPECTRUM/REAL,   SPECTRUM/IMAG
##SYMBOL=    X,             R,               I
##VAR_TYPE=  INDEPENDENT,   DEPENDENT,       DEPENDENT
##VAR_FORM=  AFFN,          ASDF,            ASDF
##VAR_DIM=   32768,         32768,           32768
##UNITS=     HZ,            ARBITRARY UNITS, ARBITRARY UNITS
##FACTOR=    0.157963299565203, 1,           1
##FIRST=     4132.6476996994, 0,             0
##LAST=      -1043.33573715361, 0,           0
##MIN=       -1043.33573715361, -138028,     0
##MAX=       4132.6476996994, 463563174,     0
$$ Real data points
##PAGE= N=1
##DATA TABLE= (X++(R..R)), XYDATA
$$ [...]
$$ plain form
15890 -6180 -3830 -1969 -1915 -3371 -5653 68 646 -961 -2361 -3790 -11282 -9085 -4995 -4580 -2581 -321
15874 -321 926 6404 2112 -2206 -553 -2406 2002 7495 3522 -3578 -2465 -5250 -2453 948 836
15859 836 5880 9365 11771 6208 1271 1727 1407 -3384 -8020 -8324 -9003 -9161 -7599 -9251 -10870 -8283
15843 -8283 -14124 -19018 -15394 -8648 -8449 -9286 -6664 -5084 -1463 2715 2374 -1758 812 2834 -503
15828 -503 -6641 -9135 -10476 -9427 -1592 7712 10536 2098 -2416 -5533 -1996 426 -6369 -13202 -10164
15813 -10164 -7995 -11794 -8486 -9491 -6167 1224 3624 1619 -3798 -7386 -7580 -10047 -5822 -4640 -1993
15798 -1993 935 7308 8443 7247 3437 -2415 -1513 -3311 -5131 -9259 -11742 -9467 -5873 -6945 -8890
15783 -8890 969 3364 3595 4562 -3210 -1811 6123 7014 3856 4896 4175 2411 6044 -1699 -5882 -6799
$$ packed form
15890f180K350J861N4j456k282N721N78j607j400j429p492K197M090M15J999K260
15874c21J247N478m292m318J653j853M408N493l973p100J113k785K797L401j12
15859H36N044L485K406n563m937M56l20m791m636l04o79j58J562j652j619K587
15843h283n841m894L624O746J99q37K622J580L621M178l41m132K570K022l337
15828e03o138k494j341J049P835R304K824q438m514l117L537K422o795o833L038
15813a0164K169l799L308j005L324P391K400k005n417l588j94k467M225J182K647
15798a993K928O373J135j196l810n852R02j798j820m128k483K275L594j072j945
15783h890R859K395K31R67p772J399P934Q91l158J040p21j764L633p743m183r17
$$ plain form
15767 -6799 -4184 1381 5087 1327 -948 4968 2674 -5728 -7695 -1723 -4028 -10116 -13309 -15877 -9186
15752 -9186 -2505 -1944 -1426 -1047 5416 318 -4940 -5417 -5421 -6292 -6877 -3506 -5016 -6618 -6800 -1426 579
15735 579 -6129 -9630 -5400 -2802 1897 -297 -9412 -7613 -720 857 4660 2432 -107 -2273 -5095
15720 -5095 -4155 -4364 -1764 -3997 -9551 -13346 -14950 -11436 -9700 -5339 6776 955 -8916 -1677 5128
15705 5128 8980 9592 2496 3008 6093 2722 4327 5455 1847 5343 4320 1042 -5006 -6487 -1784
15690 -1784 2222 2366 4734 5025 2039 -3863 -3392 -4990 -4655 -7076 -7679 -7231 -7503 -5483 -4739 -7143 -8158
15673 -8158 -4892 -3057 -7310 -9703 -12378 -5764 -2345 -4018 -9894 -19495 -14569 -7820 -905 1095 3000
15658 3000 6399 16 6297 7823 948 -687 -4085 -10215 -12927 4065 4769 -3958 -362 -286 -9487
$$ packed form
15767f799K615N565L706l760k275N916k294q402j967N972k305o088l193k568O691
15752i186O681N61N18L79O463n098n258m77mq71n85L371j510j602j82N374K005
15735E79o708l501M230K598M699k194r115J799O893J577L803k228k539k166k822
15720e095R40k09K600k233n554l795j604L514J736M361J2115n821r871P239O805
15705E128L852O12p096N12L085l371J605J128l608L496j023l278o048j481M703
15690a784M006J44K368K91k986n902M71j598L35k421o03M48k72K020P44k404j015
15673h158L266J835m253k393k675O614L419j673n876r601M926O749O915K000J905
15658C000L399o383O281J526o875j635l398o130k712J6992P04q727L596P6r201
$$ plain form
15643 -9487 -5059 -2893 -3630 -6610 -677 -1395 -6613 -11096 -8365 -504 -1139 -10359 -17887 -16786 -15157
15628 -15157 -11340 -13684 -17160 -11928 -7544 1596 12242 7762 -2900 -4558 -8128 -8731 -10802 -9776
15614 -9776 -6502 -6959 -1496 -1728 -2410 -378 -2810 -5592 633 8471 7605 8069 1622 -4706 -1158 6357
15598 6357 2357 -8625 -11611 -13354 -3941 3417 -808 -1507 -4051 -13639 -18296 -7559 -2693 1290
15584 1290 6760 8334 6324 -936 526 10494 7168 7469 4533 -643 -6859 -13605 -13161 -12577 -10485
15569 -10485 -6792 -5614 -5722 -6826 -4221 -3686 -5469 -8928 -6576 -2937 156 4767 2456 5443 816
15554 816 -1109 -3933 -550 -2637 -2212 -44 -382 -7080 -13040 -13338 -15936 -18056 -13170 -6785 6390
15539 6390 9655 10662 6151 4273 -1345 -2702 -5080 -333 2548 -1291 -4629 -12349 -13646 -12476 -10507
$$ packed form
15643i487M428K166p37k980N933p18n218m483K731P861o35r220p528J101J629
15628a5157L817k344l476N232M384R140J0646m480j0662j658l570o03k071J026
15614i776L274m57N463k32o82K032k432k782O225P838q66M64o447o328L548P515
15598F357m000j0982k986j743R413P358m225o99k544r588m657J0737M866L983
15584A290N470J574k010p260J462R968l326L01k936n176o216o746M44N84K092
15569a0485L693J178j08j104K605N35j783l459K352L639L093M611k311K987m627
15554H16j925k824L383k087M25K168l38o698n960k98k598k120M886O385J3175
15539F390L265J007m511j878n618j357k378M747K881l839l338p720j297J170J969
$$ plain form
15524 -10507 -6893 -8553 -6681 -5817 -5209 -2787 -1412 -1393 -1825 -2216 -399 -5711 -6979 -5115 -1436 -7761
15508 -7761 -7052 -2635 -215 2608 6429 6755 12463 10907 4274 -4336 363 7432 14350 12490 7085
15493 7085 1839 625 1475 -7398 -10447 -13489 -8224 -4102 794 2609 2908 -5798 -10792 -11303 -9352
15478 -9352 1787 5043 -541 -5605 -1681 -5686 -9676 -3243 -752 -1386 915 -585 -5216 -8696 -10691
15463 -10691 -5333 -2847 -762 140 -9324 -18906 -17459 -8645 -2071 -2098 -13990 -12013 2993 4660 301
15448 301 1418 1315 -509 8341 7479 8827 2934 -3844 -1584 1644 1625 -2609 -5371 -5456 -746 5839
15432 5839 2184 -4098 -8074 -9208 -8673 -4669 -1819 -3236 -4040 -7431 -10913 -3124 115 -1363 511
15417 511 6028 12467 8912 5174 9417 4903 6025 12084 15829 15069 8589 6305 2402 -5397 51
$$ packed form
15524a0507L614j660J872Q64O08K422J375J9m32l91J817n312j268J864L679o325
15508g761P09M417K420K823L821L26N708j556o633q610M699P069O918j860n405
15493G085n246j214Q50q873l049l042N265M122M896J815K99q706m994n11J951
15478i352J1139L256n584n064L924m005l990O433K491o34K301j500m631l480j995
15463a0691N358K486K085R02r464r582J447Q814O574k7j1892J977J5006J667m359
15448C01J117j03j824Q850q62J348n893o778K260L228j9m234k762q5M710O585
15432E839l655o282l976j134N35M004K850j417q04l391l482P789L239j478J874
15417E11N517O439l555l738M243m514J122O059L745p60o480k284l903p799N448
$$ plain form
15402 51 544 -1631 -1380 140 -224 4430 6004 2734 62 4293 -862 -1440 3720 752 -3491 -382
15386 -382 -882 -4062 -4457 -4284 -2826 375 -2819 -7805 -3299 872 -100 -5128 -14238 -16473 -14623 -9290
15370 -9290 -8548 -3668 -206 -3902 -6178 -5104 -10619 -14485 -14038 -8071 -6671 -7 1759 1183 1182 3907
15354 3907 1086 -1511 -542 -481 -3494 -2485 1698 5453 1279 4590 11240 10105 9917 7309 3759 3163
15338 3163 6491 9004 3409 -399 2049 1538 4086 2985 -720 -1579 -2946 -7898 -13944 -14812 -5603
15323 -5603 -1343 696 4993 6169 5649 4759 1886 -4826 -8516 -6645 -238 -1441 -3289 -4022 1755
15308 1755 2851 4020 3399 2051 -6927 -8837 -5461 -3353 -2984 -6139 -4526 -6341 -13267 -11362 -9232
15293 -9232 -10304 -14237 -10367 -10998 -11667 -17366 -11576 -1343 -4056 -5952 -7336 -8272 -13750 -13495 -5912
$$ packed form
15402E1M93k175K51J520l64M654J574l270k672M231n155n78N160k968m243L109
15386c82n00l180l95J73J458L201l194m986M506M171r72n028r110k235J850N333
15370i290P42M880L462l696k276J074n515l866M47N967J400O664J766n76jK725
15354C907k821k597R69O1l013J009M183L755m174L311O650j135j88k608l550n96
15338C163L328K513n595l808K448n11K548j101l705q59j367m952o046q68R209
15323e603M260K039M297J176n20q90k873o712l690J871O407j203j848p33N777
15308A755J096J169o21j348q978j910L376K108L69l155J613j815o926J905K130
15293i232j072l933L870o31o69n699N790J0233k713j896j384r36n478K55P583
$$ plain form
15278 -5912 -4486 -15 -6164 -12427 -6314 758 2780 6511 6187 8400 7216 5796 8627 1788 727
15263 727 -189 -9414 -13348 -10016 -4244 -2306 -3536 401 2888 14381 12973 8644 9453 9822 12268
15248 12268 9745 4347 4367 2313 546 7120 7433 8824 14864 3241 -1434 7038 7114 4544 1577
15233 1577 6751 7350 2994 837 -1012 -4370 -93 1182 -3350 -5007 -2919 323 2763 4123 1102
15218 1102 -4829 -77 -91 -3094 -4011 -2745 -1092 4415 1584 4306 5278 6130 -2960 -6039 -6162 -6307
15202 -6307 -5617 -4104 -3641 -4286 -4907 -8105 -2056 1518 11534 13359 12276 5748 3236 -881 -3284
15187 -3284 -4506 -7887 -4901 -3248 -6967 -14080 -11120 -8775 -6292 -6230 -3946 -90 -4566 -7562 -6662
15172 -6662 -7948 1037 556 -1825 785 -780 -4734 -2686 -3373 226 -2638 -9789 -14804 -10207 -3664
$$ packed form
15278e912J426M471o149o263O113P072K022L731l24K213j184j420K831o839j061
15263G27r16r225l934L332N772J938j230L937K487J1493j408m329Q09L69K446
15248A2268k523n398K0k054j767O574L13J391O040j1623m675Q472P6k570k967
15233A577N174N99m356k157j849l358M277J275m532j657K088L242K440J360l021
15218A102n931M752j4l003r17J266J653N507k831K722R72Q52r090l079j23j45
15202f307O90J513M63o45o21l198O049L574J0016J825j083o528k512m117k403
15187c284j222l381K986J653l719p113K960K345K483O2K284L856m476k996R00
15172f662j286Q985m81k381K610j565l954K048o87L599k864p151n015M597O543
$$ plain form
15157 -3664 -919 726 -983 -2987 -129 602 1942 -3023 -5783 -2274 5021 3479 881 1128 -433
15142 -433 2098 4729 4899 2972 429 -1224 -1643 -1229 -2042 5217 -1152 -1356 2191 -2915 -3761 -2646
15126 -2646 -3719 2886 7673 1759 1416 88 -1563 847 -3051 -8246 -12569 -11139 -8715 -842 -4848
15111 -4848 -5068 -4727 -7868 -9886 -4952 512 3708 -1071 1126 4604 1467 -2546 -7414 -2113 2714
15096 2714 1971 3323 6089 5708 1738 351 4008 -1233 -8176 -5290 99 2006 -213 -4059 2735
15081 2735 1586 -3484 -5253 -6893 -3531 -1364 -2874 -9257 -11814 -7871 -1004 -3532 -10053 -13777 -18155
15066 -18155 -14545 -12930 -16771 -13718 -6117 -9869 -7297 -945 3866 23 238 -6373 -7867 -8106 -5998
15051 -5998 -3570 -1754 -2269 -2666 -6379 -7872 -10792 -17090 -17453 -11877 -15269 -8953 -2472 3449 7031
$$ packed form
15157c664K745J645j709k004K858P31J340m965k760L509P295j542k598K47j561
15142d33K531K631J70j927k543j653m19M14q13P259o369k04L547n106q46J115
15126b646j073O605M787n914l43j328j651K410l898n195m323J430K424P873m006
15111d848k20L41l141k018M934N464L196m779K197L478l137m013m868N301M827
15096B714p43J352K766l81l970j387L657n241o943K886N389J907k219l846O794
15081B735j149n070j769j640L362K167j510o383k557L943O867k528o521l724m378
15066a8155L610J615l841L053P601l752K572O352M811l843K15o611j494k39K108
15051e998K428J816n15l97l713j493k920o298l63N576l392O316O481N921L582
$$ plain form
15036 7031 -763 -4418 -3943 -972 -4171 -5485 -10143 -10713 -14291 -14975 -12608 -13755 -15066 -16150 -12248
15021 -12248 -10304 -13005 -14128 -8663 -1643 2428 4249 1668 230 -3241 -6244 -7767 -11898 -9629
15007 -9629 -10853 -11790 -7843 -9744 -9488 -11469 -4451 -10468 -13500 -10092 -1960 5029 4653 2270 344
14992 344 -7640 -7598 -2099 4265 2178 -533 1677 6448 9105 14901 9986 -2350 -985 -2574 -2057
14977 -2057 -1363 -3901 -7373 -3054 2577 5430 3720 1434 -9635 -10846 -7739 -8994 -5849 -6723 -6562
14962 -6562 -3361 -6 -1712 -1440 -1695 -1695 -4134 -771 -1855 -5578 -6878 -7982 -9233 -5049 -6984 -4885
14946 -4885 -4060 -15177 -15662 -7769 -11203 -19150 -13790 -6623 -9026 -8367 -5028 -2868 -6993 -10168 -9463
14931 -9463 -8506 -5661 1079 2486 -1406 -9546 -10635 -11070 -14704 -10115 -2264 2826 2791 4755 6813 6782
$$ packed form
15036G031p794l655M75K971l199j314m658n70l578o84K367j147j311j084L902
15021a2248J944k701j123N465P020M071J821k581j438l471l003j523m131K269
15007i629j224r37L947j901K56j981P018o017l032L408Q132O989l76k383j926
14992C44p984M2N499O364k087k711K210M771K657N796m915j2336J365j589N17
14977b057O94k538l472M319N631K853j710k286j1069j211L107j255L145q74J61
14962f562L201L355j706K72k55%k439L363j084l723j300j104j251M184j935K099
14946d885Q25j1117m85P893l434p947N360P167k403O59L339K160m125l175P05
14931i463R57K845O740J407l892q140j089m35l634M589P851N090l5J964K058l1
$$ plain form
14915 6782 -2766 -5440 -7338 -7288 -11578 -7416 -12352 -13790 -11762 -10818 -12876 -15082 -9729 -830 -1974
14900 -1974 -2690 -4865 -7524 -9346 -4985 -5594 -1536 -688 -2874 850 -54 -297 -3561 -5232 -2235 923
14884 923 -4424 61 4554 10360 6494 1565 1381 -920 293 -4171 -6798 -4287 -2908 -1360 -5758
14869 -5758 -1146 947 -2918 -4446 -3201 -1612 -1454 -608 -7525 -9162 -6970 -6850 -3315 -2396 -738 -1891
14853 -1891 -3710 -2818 -452 -4235 -7343 -4734 -1118 -7324 -7989 -5932 -5587 -3277 -5850 -6432 -3893 -5859
14837 -5859 -5121 -976 3740 -1965 -6404 -8097 -5774 -11817 -13744 -12749 -11553 -9676 -6387 -4198 -3002
14822 -3002 -1507 -3348 -2285 -6616 -4938 -2851 -2338 -2040 -2762 -3108 1916 3170 -808 -1111 3457 163
14806 163 -4856 -3663 -2028 -6497 -9808 -5556 -568 3280 -2645 -9678 -10265 -7577 -3336 1337 -2630
$$ packed form
14915F782r548k674j898N0m290M162m936j438K028R44k058k206N353Q899j144
14900a974p16k175k659j822M361o09M058Q48k186L724r04k43l264j671K997L158
14884I23n347M485M493N806l866m929j84k301J213m464k627K511J379J548m398
14869e758M612K093l865j528J245J589J58Q46o917j637K192J20L535R19J658j153
14853a891j819Q92K366l783l108K609L616o206o65K057L45K310k573n82K539j966
14837e859P38M145M716n705m439j693K323o043j927R95J196J877L289K189J196
14822c002J495j841J063m331J678K087N13K98p22l46N024J254l978l03M568l294
14806A63n019J193J635m469l311M252M988L848n925p033n87K688M241M673l967
$$ plain form
14791 -2630 2183 2270 -6004 -3797 -755 -5700 -10485 -3724 -7646 -10878 -13840 -1956 5389 6958 4712
14776 4712 -3484 -13500 -19554 -16121 -9580 -6908 -4221 -2119 -6394 -6188 -9299 -9968 -5858 -9564 -8124
14761 -8124 -3112 -999 -8394 -6729 -376 -4228 -6221 -567 -7915 -9287 -6089 -9567 -14187 -14797 -12357
14746 -12357 -4327 -3753 -12855 -18843 -21905 -12615 -8454 -4889 -648 1915 12338 8065 -684 -6106
14732 -6106 2032 1309 -3674 -8901 -10653 -8737 -10162 -9115 -2349 -9157 -5648 2756 1742 -2239 533
14717 533 337 -2176 -5309 -3058 429 827 1935 6721 403 -6594 -2596 -2338 -8053 -9634 -1067 5939
14701 5939 5104 2305 2293 2838 -5233 -7547 -4943 -3482 -8533 -8899 -5089 2667 10651 15236 11344 9089
14685 9089 8160 10463 8283 639 -2155 -2891 4095 6030 2097 262 -5405 -4166 -245 4451 4129
$$ packed form
14791b630M813Q7q274K207L042m945m785O761l922l232k962J1884P345J569k246
14776D712q196j0016o054L433O541K672K687K102m275K06l111o69M110l706J440
14761h124N012K113p395J665O353l852j993N654p348j372L198l478m620o10K440
14746a2357Q030N74r102n988l062R290M161L565M241K563J0423m273q749n422
14732f106Q138p23m983n227j752J916j425J047O766o808L509Q404j014l981K772
14717E33j96k513l133K251L487L98J108M786o318o997L998K58n715j581Q567P006
14701E939q35k799j2N45q071k314K604J461n051l66L810P756P984M585l892k255
14685I089r29K303k180p644k794p36O986J935l933j835n667J239L921M696l22
$$ plain form
14670 4129 2923 2978 -3752 -6959 -4928 -3157 3014 4107 1910 -171 -5915 -7846 -10241 -11609 -9667
14655 -9667 -1974 -2998 -3147 1972 -6672 -5329 -2056 -974 -3793 1631 5720 2575 -6517 -6967 -10741
14640 -10741 -4760 -6230 -13669 -21727 -10030 -2755 59 480 682 1086 -5847 -7410 -5141 1165 -5996
14625 -5996 -9356 -4694 -1805 -2947 -10014 -11044 -5858 -5468 -3457 5261 8075 6866 6582 6291 3466
14610 3466 4093 1470 -112 2923 4749 1148 -2291 -2517 -2640 544 1123 8171 14729 8531 4805 -18
14594 -18 -2765 -700 -72 2367 -4178 -10350 -10705 -6411 -8549 -6626 -3877 -4442 -6757 -5288 -5963 -6231
14578 -6231 -8504 -6265 -6260 -4793 -3227 -4810 -7593 -12647 -11911 -9020 -10576 -9494 -10563 -14554 -5576 4414
14562 4414 -4417 -12881 -12302 -11411 -11280 -16474 -18943 -6733 6019 8545 8243 4202 7999 10372 9247
$$ packed form
14670D129j206N5o730l207K031J771O171J093k197k081n744j931k395j368J942
14655i667P693j024j49N119q644J343L273J082k819N424M089l145r092m50l774
14640a0741N981j470p439q058J1697P275K814M21K02M04o933j563K269O306p161
14625e996l360M662K889j142p067j030N186L90K011Q718K814j209k84k91k825
14610C466O27k623j582L035J826l601l439k26j23L184N79P048O558o198l726m823
14594a8k747K065O28K439o545o172l55M294k138J923K749n65k315J469o75k68
14578f231k273K239NJ467J566j583k783n054P36K891j556J082j069l991Q978R990
14562D414q831q464N79Q91J31n194k469J2210J2752K526l02m041L797K373j125
$$ plain form
14547 9247 6489 6487 -1463 -4066 -4714 -2223 -532 -5122 -4384 -6271 -9734 -9576 -13576 -3850 -2651 -6987
14531 -6987 -82 -5009 -12560 -7403 -7029 -1237 3668 2222 -2999 64 -768 -172 2158 -6297 -15469
14516 -15469 -14533 -8379 -3574 -8326 -13882 -10762 -9218 -3950 1227 1147 -3234 -5288 -4346 -2096 -1543 -365
14500 -365 -3201 -4141 1196 7765 4602 -3918 -6232 -2477 -4873 -1125 4124 3946 429 -3710 -418
14485 -418 -3483 -3160 -11168 -9166 -8624 -14712 -12075 -231 2115 -4499 -537 438 2294 -2326 -2847 -2556
14469 -2556 -3970 -4983 -3559 -6878 -3063 -3850 -5845 -2866 -2642 -217 -1592 1304 8893 8075 -1798
14454 -1798 -6250 1296 4781 4825 3967 2909 1811 5423 5988 6045 7801 1977 -121 -205 -2495 -2505 -7951
14437 -7951 -2721 2367 3362 6669 4332 2543 3271 -3493 -9660 -23868 -27207 -24559 -20335 -14185 -13858
$$ packed form
14547I247k758kp950k603o48K491J691m590P38j887l463J58m000R726J199m336
14531f987O905m927p551N157L74N792M905j446n221L063q32N96K330q455r172
14516a5469R36O154M805m752n556L120J544N268N177q0m381k054R42K250N53J178
14500c65k836r40N337O569l163q520k314L755k396L748N249j78l517m139L292
14485d18l065L23q008K002N42o088K637J1844K346o614L962R75J856m620n21K91
14469b556j414j013J424l319L815p87j995K979K24K425j375K896P589q18r873
14454a798m452P546L485M4q58j058j098L612N65N7J756n824k098q4k290j0n446
14437g951N230N088R95L307k337j789P28o764o167j4208l339K648M224O150L27
$$ plain form
14422 -13858 -11020 -7425 -2456 -1195 -6852 -12016 -3829 -3621 -4103 -6094 -4069 -4246 9123 12379 870
14407 870 2736 7510 6944 8104 11467 10019 3951 -2 -3868 226 -3555 -9913 -7989 -4406 -6094
14392 -6094 368 3777 3586 1405 2061 6523 9345 5394 -1203 -1509 2105 1899 -3603 -10722 -8137 -7573
14376 -7573 -7495 190 7266 3783 2914 3678 7471 9799 14239 6621 -86 192 -2721 -4755 -4217 -5163
14360 -5163 -1452 -6488 -7169 -13860 -14002 -11819 -8894 -10337 -5116 -1197 -8242 -8429 -5708 229 -571 -3507
14344 -3507 -5658 -7787 -4895 -1737 629 -1628 1426 5058 3232 -1969 -11115 -14093 -13222 -7477 -3941
14329 -3941 -345 3002 -2207 339 1071 -2660 -5293 -6384 -4220 -2348 -4155 -8113 -10986 -8258 -3640
14314 -3640 366 8278 9369 1801 -271 -1788 2222 1178 -520 -4701 -9865 -13725 -10196 -6281 2434
$$ packed form
14422a3858K838L595M969J261n657n164Q187K08m82j991K025j77J3369L256j1509
14407H70J866M774n66J160L363j448o068l953l866M094l781o358J924L583j688
14392f094O462L409j91k181O56M462K822l951o597l06L614k06n502p119K585N64
14376g573P8P685P076l483q69P64L793K328M440p618o707K78k913k034N38r46
14360e163L711n036o81o691j42K183K925j443N221L919p045j87K721N937q00k936
14344c507k151k129K892L158K366k257L054L632j826n201r146k978Q71N745L536
14329c941L596L347n209K546P32l731k633j091K164J872j807l958k873K728M618
14314c640M006P912J091p568k072j517M010j044j698m181n164l860L529L915Q715
$$ plain form
14299 2434 8048 5608 -798 -3117 -3035 -2876 -5641 -5103 1822 5160 -4337 -7111 -6143 -9941 -10289 -2602
14283 -2602 1393 4565 -2960 -10574 -6280 -621 4936 7626 2131 -1383 683 1124 -14 -4693 -92
14268 -92 6411 4170 -2331 -4707 -8428 -12558 -8664 -8824 -14899 -12196 -13079 -8099 -6558 -5229 -4756 -9296
14252 -9296 -9420 -5651 -1726 3980 3365 -6231 -8754 -11495 -2319 3266 524 -2593 -6015 -4472 -6664
14237 -6664 -3198 -3575 -511 1277 -625 -5565 -6548 -7532 -13879 -9098 -3832 3525 4944 414 557 2149
14221 2149 2099 1512 186 -2351 -3714 -554 1599 -358 3638 909 -6211 -7973 -8506 -11596 -10917 -10713
14205 -10713 -12550 -14547 -14289 -8492 -7352 -12084 -7704 -7252 -5622 -6020 -7614 -4833 906 7403 8697
14190 8697 2837 -33 4943 8156 541 -2472 -6880 -8859 -8780 -5454 -8902 -4327 851 -3218 -6435
$$ packed form
14299B434N614k440o406k319Q2J59k765N38O925L338r497k774R68l798l48P687
14283b602L995L172p525p614M294N659N557K690n495l514K066M41j138m679M601
14268i2O503k241o501k376l721m130L894j60o075K703q83M980J541J329M73m540
14252i296j24L769L925N706o15r596k523k741R176N585k742l117l422J543k192
14237f664L466l77L064J788j902m940r83r84o347M781N266P357J419m530J43J592
14221B149n0n87j326k537j363L160K153j957L996k729p120j762n33l090O79K04
14205a0713j837j997K58N797J140m732M380M52J630l98j594K781N739O497J294
14190H697n860k870M976L213p615l013m408j979P9L326l448M575N178m069l217
$$ plain form
14175 -6435 -7769 -5588 -2779 -2379 -3831 -4354 -6233 -9773 -14750 -12655 -14339 -16459 -7545 -4085 -6987
14160 -6987 -7969 -4285 -680 2666 96 -8567 -11566 -10511 -8288 -5902 -3872 -3806 1337 -4553 -5836
14145 -5836 -2136 156 -1632 -1058 -1009 -3735 -3923 -8239 -6185 -2333 -2852 -3417 -4344 -4811 -4754 -7040 -9616
14128 -9616 -3569 -6009 -4387 -5341 -4369 -1346 8901 6697 -4990 -2493 4518 5565 2756 -1958 -3471
14113 -3471 -6471 -10722 -16585 -18032 -10497 -6298 -4191 -3088 -1987 -1550 -1874 4499 6207 -2110 -6115
14098 -6115 -5159 -4970 -4161 1100 1256 219 2821 7914 -1622 -7592 1020 7604 5438 2688 5164 13201
14082 13201 16028 10898 10586 9269 4210 -3558 -8355 -4392 351 2943 -2848 -2518 1660 -2326 -5580
14067 -5580 -4859 -6824 -7529 1219 9049 4532 1047 4781 5859 5980 4681 6366 -2668 -5151 -5584 -980
$$ packed form
14175f435j334K181K809M00j452n23j879l540m977K095j684k120Q914L460k902
14160f987r82L684L605L346k570q663k999J055K223K386K030O6N143n890j283
14145e836L700K292j788N74M9k726j88m316K054L852n19n65r27m67N7k286k576
14128i616O047k440J622r54R72L023J0247k204j1687K497P011J047k809m714j513
14113c471l000m251n863j447P535M199K107J103J101M37l24O373J708q317m005
14098f115R56J89Q09N261J56j037K602N093r536n970Q612O584k166k750K476Q037
14082A3201K827n130l12j317n059p768m797L963M743K592n791L30M178l986l254
14067e580P21j965p05Q748P830m517l485L734J078J21j299J685r034k483m33M604
$$ plain form
14051 -980 7419 15784 12222 2381 -5244 -385 6513 1512 -97 -3942 -6863 -248 4784 -133 3824
14036 3824 2980 -3669 -6784 -6871 1951 6466 -3750 14 -4448 -12975 -15752 -14317 -10027 -4953 -4295
14021 -4295 -5816 -3597 -1358 -12268 -21304 -16408 -5490 -7590 -13536 -11345 -2453 -1104 -218 -3930
14007 -3930 -2656 -7771 -4531 -1771 -193 684 -4079 -1086 -255 -1933 -1860 2114 -172 -2471 107 1363
13991 1363 1796 -2623 601 6638 5224 4203 -2878 -4251 -5384 -6163 -8037 -1817 155 -460 5249
13976 5249 6682 1279 -9801 -10824 -10929 -9757 -11772 -13302 -16334 -10424 -9094 -796 1568 445 -2666
13961 -2666 -7638 -6736 671 7030 13820 14487 15759 15272 11719 4868 2065 -1241 1760 414 -7657
13946 -7657 -15929 -18350 -17485 -8812 -7264 -6919 -2639 4596 9734 6753 902 -1831 -6766 -8101 -2621
$$ packed form
14051i80Q399Q365l562r841p625M859O898n001j609l845k921O615N032m917L957
14036C824q44o649l115q7Q822M515j0216L764m462q527k777J435M290N074O58
14021d295j521K219K239j0910r036M896J0918k100n946K191Q892J349Q86l712
14007c930J274n115L240K760J578Q77m763K993Q31j678P3L974k286k299K578J256
13991A363M33m419L224O037j414j021p081j373j133p79j874O220J972o15N709
13976E249J433n403j1080j023j05J172k015j530l032N910J330Q298K364j123l111
13961b666m972R02P407O359O790O67J272m87l553o851k803l306L001j346q071
13946g657q272k421Q65Q673J548L45M280P235N138k981n851k733m935j335N480
$$ plain form
13931 -2621 -1913 -2669 -4154 1882 2427 7831 1234 6514 7123 1842 -3864 -1019 -4772 -7464 -9814 -7905
13915 -7905 -3411 -3515 -8071 -916 1847 5477 5435 3707 -892 223 830 -3213 -12582 -11232 -4882 -13124
13899 -13124 -7593 -7265 -12208 -14506 -14139 -9439 -6478 -7376 -15581 -15584 -11441 -12790 -12406 -3754 -6133 -5811
13883 -5811 -8624 -14076 -15623 -12839 -9127 -9289 -10728 -8529 -8661 -12976 -19763 -17684 -11459 487 5833
13868 5833 1183 -2312 -1131 -2644 -7163 -9913 -2893 1161 4175 2672 2628 -5207 -10014 -9837 -7502
13853 -7502 -596 4195 1949 -546 4920 7792 6973 -1302 -5376 -6934 -8567 -10723 -13545 -12222 -10347
13838 -10347 -10360 -12744 -16288 -15047 -7860 -1589 -4231 -3875 -10163 -14781 -8597 -298 -2944 3547 5077
13823 5077 7574 6272 3268 3824 6119 3710 3715 2962 -5430 -7703 535 5760 1081 -4437 -1174 4589
$$ packed form
13931b621P08p56j485O036N45N404o597N280O09n281n706K845l753k692k350J909
13915g905M494j04m556P155K763L630m2j728m599J115O07m043r369J350O350q242
13899a3124N531L28m943k298L67M700K961q98q205lM143j349L84Q652k379L22
13883e811k813n452j547K784L712j62j439K199j32m315o787K079O225J1946N346
13868E833m650l495J181j513m519k750P020M054L014j503m4p835m807J77K335
13853g502O906M791k246k495N466K872q19q275m074j558j633k156k822J323J875
13838a0347j3k384l544J241P187O271k642L56o288m618O184Q299k646O491J530
13823E077K497j302l004N56K295k409Np53q392k273Q238N225m679n518L263N763
$$ plain form
13807 4589 10651 8147 1477 -5907 -4084 3439 606 -4599 -3087 -3118 -161 -606 -655 950 6410 4848
13791 4848 -73 3957 6999 5422 2621 4606 2976 -374 -6582 -8210 -6825 -3861 -7347 -9622 -4949
13776 -4949 -128 448 -155 -644 1919 -1540 -4575 -2432 -3122 6167 11095 6491 -651 756 -5979 -7213
13760 -7213 -2676 -2732 1398 4887 3049 -1563 3606 7159 5786 2792 1879 2648 -26 -5357 -7291 -8424
13744 -8424 -4767 -3449 -4474 -3913 -6229 -9776 -10426 -1775 -331 -2099 -8652 -7001 -1314 675 1019
13729 1019 -94 -6 2952 2718 -73 -1823 -2753 -1532 -291 -43 -3156 -4838 -3122 3564 7655 15790
13713 15790 11562 6570 598 -9898 -7800 -8905 -7956 -9657 2935 5529 8664 15893 9986 -1807
13699 -1807 -5324 -369 1407 -6133 -12558 -10872 -7910 -4948 5419 7038 5781 5057 -1660 -9429 -13814
$$ packed form
13807D589O062k504o670p384J823P523k833n205J512l1K957m45m9J605N460j562
13791D848m921M030L042j577k801J985j630l350o208j628J385K964l486k275M673
13776d949M821N76o03m89K563l459l035K143o90R289M928m604p142J407o735j234
13760g213M537n6M130L489j838m612N169L553j373k994r13P69k674n331j934j133
13744h424L657J318j025N61k316l547o50Q651J444j768o553J651N687J989L44
13729A019j113Q8K958k34k791j750r30J221J241K48l113j682J716O686M091Q135
13713A5790m228m992n972j0496K098j105R49j701J2592K594L135P229n907j1793
13699a807l517M955J776p540o425J686K962K962J0367J619j257p24o717p769m385
$$ plain form
13684 -13814 -8134 -5101 -5060 -5157 -5147 -3179 -831 5216 6687 6715 3349 2954 3909 783 -2944 -3632 -8619
13667 -8619 -11187 -5941 -1527 -5089 -6477 -4472 -2639 -1382 307 -6309 -11081 -13653 -10754 -10112 27
13652 27 -996 3241 7375 303 -12083 -14604 -11258 -12031 -9554 -8693 -7804 -5816 -10014 -5082 3094 1700
13636 1700 -6921 -9649 -12172 -19238 -20064 -20634 -15827 -6792 734 4150 6072 -3178 -14579 -14194 -10886
13621 -10886 -8348 -7125 -10637 -12669 -18130 -18966 -16206 -15549 -12177 -7533 -6421 -6051 -2707 -2388 -10391
13606 -10391 -11361 -12112 -10385 -8161 -7182 -7188 -3670 2297 1264 -523 -5794 -1810 2397 1816 -11158 -11855
13590 -11855 -6012 -4289 -3941 -1146 -7339 -3100 -3987 -7463 -9622 -13017 -13849 -17740 -15299 -10664 -10443
13575 -10443 -14976 -18602 -13495 -11276 -10231 -5211 137 -3213 -7481 -11631 -8605 -4371 -5160 -4682 -5396
$$ packed form
13684a3814N680L033M1r7J0J968K348O047J471K8l366l95R55l126l727o88m987
13667h619k568N246M414l562j388K005J833J257J689o616m772k572K899O42J0139
13652B7j023M237M134p072j2386k521L346p73K477Q61Q89J988m198M932Q176j394
13636A700q621k728k523p066q26n70M807R035P526L416J922r250j1401L85L308
13621a0886K538J223l512k032n461q36K760O57L372M644J112L70L344L19q003
13606a0391r70p51J727K224R79oL518N967j033j787n271L984M207n81j2974o97
13590a1855N843J723L48K795o193M239q87l476k159l395q32l891K441M635K21
13575a0443m533l626N107K219J045N020N348l350m268m150L026M234p89M78p14
$$ plain form
13560 -5396 -4380 -6079 -3502 -657 -70 3397 3674 -2718 -5422 -5131 -5833 -4043 -1367 -1863 -4063 -3821
13544 -3821 -5537 -1730 -1906 383 7354 5319 7194 4783 5269 5141 854 -1615 -4743 -2516 -1017
13529 -1017 1138 -1724 -5433 -10575 -11485 -4172 -5472 -6644 -2914 -4487 -6294 -8358 -4383 -1534 -3507
13514 -3507 -7628 -6335 -221 1239 -2684 -4344 -6045 -1651 159 -2736 -4067 1179 7110 5390 801
13499 801 -3533 -5294 -4592 -4285 -3192 -1400 1948 4010 3501 -467 756 2249 1533 -6105 -6898 -5878
13483 -5878 771 3018 9313 5834 -383 -7577 -8935 -3928 3405 3587 4711 -5688 -11119 -6782 -2884
13468 -2884 -5395 392 1821 4305 7737 5920 3680 7355 9165 92 -3775 -1990 455 2254 28
13453 28 -2660 -2931 -2683 -4450 -2293 -335 248 1871 -1927 -11566 -18039 -15297 -6367 8606 13343 4152
$$ packed form
13560e396J016j699K577K845N87L467K77o392k704K91p02J790K676m96k200K42
13544c821j716L807j76K289O971k035J875k411M86j28m287k469l128K227J499
13529a017K155k862l709n142r10P313j300j172L730j573j807k064L975K849j973
13514c507m121J293O114J460l923j660j701M394J810k895j331N246N931j720m589
13499H01m334j761P02L07J093J792L348K062n09l968J223J493p16p638p93J020
13483e878O649K247O295l479o217p194j358N007P333J82J124j0399n431M337L898
13468b884k511N787J429K484L432j817k240L675J810r073l867J785K445J799k226
13453B8k688k71K48j767K157J958N83J623l798r639o473K742Q930J4973M737r191
$$ plain form
13437 4152 -2204 2311 2350 -1267 2827 1706 -2552 -1666 1038 -1093 -2504 -2441 -1118 -3675 -4258 -408
13421 -408 5648 5575 1057 3914 4561 -684 -6040 -3795 -7612 -9506 -5017 -4710 -10433 -8829 -2521 659
13405 659 -2122 -3135 -5771 -9307 -9693 -4174 -465 -898 608 600 2814 5874 5714 7501 3958 2217
13389 2217 3305 2927 -368 -454 -6221 -7241 2254 7268 4024 1091 -360 -1026 -1407 -2318 -8163 -5476
13373 -5476 -4446 -7618 -3951 -462 457 2826 7449 3280 -5737 -4630 -2181 -4731 -9834 -12792 -10920
13358 -10920 -12455 -7314 -3506 -5572 -6242 -7892 -6013 1090 -398 -2841 -3499 -2606 501 8947 9708
13343 9708 -3646 -10976 -8826 -8611 -2605 -1478 1912 4563 7581 8680 10080 5735 -2279 -4488 -4127
13328 -4127 -3540 -6973 -9298 -4539 -729 -1940 4004 5462 4287 -734 3334 955 -2384 -4110 -5297
$$ packed form
13437D152o356M515L9l617M094j121m258Q86K704k131j411O3J323k557n83L850
13421d08O056p3m518K857O47n245n356K245l817j894M489L07n723J604O308L180
13405F59k781j013k636l536l86N519L709m33J506qK214L060j60J787l543j741
13389B217J088l78l295q6n767j020R495N014l244k933j451o66l81r11n845K687
13373e476J030l172L667L489R19K369M623m169r017J107K449k550n103k958J872
13358a0920j535N141L808k066o70j650J879P103j488k443o58Q93L107Q446P61
13343I708j3354p330K150K15O006J127L390K651L018J099J400m345q014k209L61
13328d127N87l433k325M759L810j211N944J458j175n021M068k379l339j726j187
$$ plain form
13313 -5297 4832 14167 9188 3976 2430 -1920 -626 -5594 -3826 -1818 2258 1083 3268 3198 3758
13298 3758 4896 4664 2932 2263 -2382 -10064 -5620 -1670 4110 4333 6290 7326 2785 -801 -3567
13283 -3567 -1630 5830 -556 351 7059 7750 9979 9985 8241 2523 3405 3960 470 -968 440 5553
13267 5553 7250 5053 -1914 -2225 1969 5426 5471 5352 8951 7441 12569 11548 6455 9025 9313 12535
13251 12535 6325 5661 1968 1171 -182 -570 2951 7134 4167 5293 9629 14070 7204 10203 9185
13236 9185 4531 7571 6421 8600 7289 10680 16532 19529 11077 2476 4117 3604 4060 1533 -4342
13221 -4342 220 5515 6407 7049 5291 17086 25099 27099 23794 23769 17142 15655 22392 23993 18526
13206 18526 12091 8263 9550 5360 1432 914 5473 13973 8030 2716 -1274 -321 4587 9492 13845
$$ packed form
13313e297J0129R335m979n212j546m350J294m968J768K008M076j175K185p0N60
13298C758J138k32j732o69m645p682M444L950N780K23J957J036m541l586k766
13283c567J937P460o386R07O708O91K229Oj744n718Q82N55l490j438J408N113
13267E553J697k197o967l11M194L457M5j19L599j510N128j021n093K570K88L222
13251A2535o210o64l693p97j353l88L521M183k967J126M336M441o866K999j018
13236I185m654L040j150K179j311L391N852K997q452q601J641n13M56k527n875
13221d342M562N295Q92O42j758J1795Q013K000l305k5o627j487O737J601n467
13206A8526o435l828J287m190l928n18M559Q500n943n314l990R53M908M905M353
$$ plain form
13191 13845 14026 12996 15461 14216 13317 12307 8558 7176 8876 3749 -3475 -5426 -8254 -4860 -7740
13176 -7740 1138 9911 11986 13701 16457 16119 16927 9729 8468 9824 7579 7506 8202 9286 11326 15562
13160 15562 17604 16467 9264 5216 4563 1258 626 2420 8347 15870 14058 18565 16839 24912 28518
13145 28518 27514 29720 29070 30089 25500 17454 9757 5333 7337 6544 4502 -1258 -2132 7203 13094
13130 13094 15724 11322 10806 11640 10006 4327 5399 4509 7204 10067 7725 8918 8538 7290 5704
13115 5704 5060 7935 14762 15540 8917 8492 7827 7385 12107 20307 23088 20547 19575 16546 10796 4704
13099 4704 -357 3334 12358 17628 14345 11446 8596 13274 15582 13380 13643 11920 14724 14165 15882
13084 15882 15924 18677 13008 12756 17788 18304 13502 8875 3626 3934 9430 5672 3371 572 -3176 -3135
$$ packed form
13191A3845J81j030K465j245q99j010l749j382J700n127p224j951k828L394k880
13176g740Q878Q773K075J715K756l38Q08p198j261J356k245p3O96J084K040M236
13160A5562K042j137p203m048o53l305o32J794N927P523j812M507j726Q073L606
13145B8518j004K206o50J019m589q046p697m424K004p93k042n760q74R335N891
13130A3094K630m402n16Q34j634n679J072q90K695K863k342J193l80j248j586
13115E704o44K875O827P78o623m25o65m42M722Q200K781k541r72l029n750o092
13099D704n061L691R024N270l283k899k850M678K308k202K63j723K804n59J717
13084A5882M2K753n669k52N032N16m802m627n249L08N496l758k301k799l748M1
$$ plain form
13068 -3135 -3712 -2123 2288 6256 5450 6401 4850 9857 12989 18128 21227 17625 14833 11226 6976
13053 6976 6760 9529 7289 6201 13295 17868 17107 14496 11955 14905 12931 13624 13430 18266 19166 22369
13037 22369 24234 14943 9570 14102 10840 12342 16867 17201 15373 11468 6975 10085 11914 18257 19964
13022 19964 19829 12225 3742 2988 6394 8316 5496 1836 3732 8970 12330 12608 11592 16070 17166
13007 17166 16766 11869 11720 14034 8777 6848 9149 7423 9010 8171 5852 9322 12472 10993 9421
12992 9421 13812 13379 19965 16216 7543 10220 6195 2267 10902 10265 6348 8894 9787 7472 4483
12977 4483 7990 9791 5115 7593 5870 14199 15363 8267 5377 3046 2216 1198 4698 10282 11043
12962 11043 14092 16256 9063 235 -1705 -4872 -8219 -2433 5973 6891 3419 6359 10227 8353 3961
$$ packed form
13068c135n77J589M411L968q06R51j551N007L132N139L099l602k792l607m250
13053F976k16K769k240j088P094M573p61k611k541K950j974O93j94M836R00L203
13037B2369J865r291n373M532l262J502M525L34j828l905m493L110J829O343J707
13022A9964j35p604q483p54L406J922k820l660J896N238L360K78j016M478J096
13007A7166m00m897j49K314n257j929K301j726J587q39k319L470L150j479j572
12992I421M391m33O586l749q673K677m025l928Q635o37l917K546Q93k315k989
12977D483L507J801m676K478j723Q329J164p096k890k331q30j018L500N584P61
12962A1043L049K164p193q828j940l167l347N786Q406R18l472K940L868j874m392
$$ plain form
12947 3961 9119 3600 -5111 -3801 884 4603 6286 3213 7988 1118 -322 2715 3997 -612 -6958
12932 -6958 -2293 -497 -4411 130 3663 2038 -3150 -8598 898 11310 14516 8354 6679 8133
12918 8133 9819 7415 401 -1350 2077 2659 -1166 457 5195 4717 7404 4675 2318 5963 -2292
12903 -2292 -6669 -5068 -5070 -5320 -674 1855 8746 16708 16736 10443 1434 -3318 853 3635 427 -1253
12887 -1253 3535 2838 -240 4566 3874 6352 7698 5127 7145 2130 -2171 -3399 -109 1917 2720
12872 2720 -1582 -6902 -4779 254 2054 -2207 -3785 -6080 -4075 1784 4508 -677 -1992 -3411 -12921
12857 -12921 -13867 -6088 228 554 7472 12542 2530 -2183 -2557 -92 -2034 -2436 -4929 1527 -2041
12842 -2041 -5340 830 14084 11598 10969 10438 5068 -3279 -3594 -2600 487 -3477 -3059 3944 7337 5095
$$ packed form
12947C961N158n519q711J310M685L719J683l073M775o870j440L037J282m609o346
12932f958M665J796l914M541L533j625n188n448R496J0412L206o162j675J454
12918H133J686k404p014j751L427N82l825J623M738m78K687k729k357L645q255
12903b292m377J601kk50M646K529O891P962K8o293r009m752M171K782l208j680
12887a253M788o97l078M806o92K478J346k571K018n015m301j228L290K026Q03
12872B720m302n320K123N033J800m261j578k295K005N859K724n185j315j419r510
12857a2921r46P779O316L26O918N070j0012m713l74K465j942m02k493O456l568
12842b041l299O170J3254k486o29n31n370q347l15R94L087l964M18P003L393k242
$$ plain form
12826 5095 115 -3439 -1535 8646 8778 1839 3459 3665 2540 -305 1495 2241 224 4260 4741
12811 4741 -936 -2755 -514 5371 3522 7460 9831 9143 2253 563 -961 1158 6635 5781 4216
12796 4216 -1788 -3615 -1560 -816 3627 -1663 -149 4028 7817 13032 14455 14145 11027 8706 11158
12781 11158 11748 10923 2814 1233 5958 1946 4971 4580 2729 9239 6888 10054 9872 8607 6985
12766 6985 316 859 12774 16739 19442 12749 7305 2471 -933 6591 4455 2941 4774 8571 12654
12751 12654 11942 7134 -335 2015 -936 -6952 -3609 -5788 -9447 -6768 -2030 555 -1975 -12993
12737 -12993 -14899 -10646 -7832 -3097 2469 2891 5202 4327 2823 -3868 -3170 -449 5892 8325 10065
12722 10065 14647 14922 11492 7064 2788 1474 -466 -666 154 -2654 -964 -1232 -3374 -5498 -5909 -7524
$$ packed form
12826E095m980l554J904J0181J32o939J620K06j125k845J800P46k017M036M81
12811D741n677j819K241N885j849L938K371o88o890j690j524K119N477q54j565
12796D216o004j827K055P44M443n290J514M177L789N215J423l10l118k321K452
12781A1158N90q25q109j581M725m012L025l91j851O510k351L166j82j265j622
12766F985o669N43J1915L965K703o693n444m834l404P524k136j514J833L797M083
12751A2654p12m808p469K350k951o016L343k179l659K679M738K585k530j1018
12737a2993j906M253K814M735N566M22K311q75j504o691O98K721O341K433J740
12722A0065M582K75l430m428m276j314j940k00Q20k808J690k68k142k124m11j615
$$ plain form
12706 -7524 -7128 -307 197 840 1318 2349 717 4300 2727 4104 4074 -2746 -1633 6299 5809 6318 6301
12689 6301 4333 1170 1494 -839 736 157 3364 6899 3707 -1313 -612 3163 6183 277 -1388
12674 -1388 -4771 -6805 -157 2841 -1431 4349 6528 5729 611 -2397 -6603 -1625 7539 8599 2566
12659 2566 -283 -5080 -2381 -5556 -4348 1933 401 3740 8359 11072 13539 12415 2898 8062 10238
12644 10238 12940 9089 3682 4081 4727 10163 10257 6189 7911 11006 13279 10710 11960 14610 14733 9461
12628 9461 10545 7158 5010 3598 2083 -4705 -4540 -6975 -7720 1570 8802 6002 1697 -4602 -1822
12613 -1822 1610 4828 7016 15707 14132 9447 9622 9407 7958 7535 3529 4210 5595 3748 -3629 -5677
12597 -5677 -733 2514 987 1640 5022 3694 1861 1775 -2718 -5379 -4491 -5841 -5379 -8925 -3599 5593
$$ packed form
12706g524L96O821N04O43M78J031j632L583j573J377l0o820J113P932m90N09j7
12689F301j968l163L24k333J575n79L207L535l192n020P01L775L020n906j665
12674a388l383k034O648K998m272N780K179p99n118l008m206M978R164J060o033
12659B566k849m797K699l175J208O281j532L339M619K713K467j124r517N164K176
12644A0238K702l851n407L99O46N436R4m068J722L095K273k569J250K650J23n272
12628I461J084l387k148j412j515o788J65k435p45R290P232k800m305o299K780
12613a822L432L218K188Q691j575m685J75k15j449m23m006O81J385j847p377k048
12597e677M944L247j527O53L382j328j833q6m493k661Q88j350M62l546N326R192
$$ plain form
12581 5593 8519 4479 254 528 5904 16328 16330 14020 2312 1141 8495 9275 9083 15251 18481 16015
12565 16015 10472 14999 16978 14067 15279 9378 -211 3823 -2143 -164 3000 438 -3210 3027
12551 3027 10824 11975 5539 2629 1955 1756 -859 659 4452 8075 10046 11279 7911 510 -1887
12536 -1887 1956 3901 2546 1687 767 1196 3669 3927 5114 7506 5302 6266 8909 11551 9702 10948
12520 10948 10641 4477 3537 15133 15483 17260 14365 4812 -1997 2086 7899 5178 -493 181 7077
12505 7077 6405 10962 18743 19546 17547 10354 5267 5160 8700 18169 20620 17749 14147 8656 11456
12490 11456 18355 21067 18007 19097 23033 16714 6267 13364 15458 15799 20325 26272 23212 12309
12476 12309 10103 9899 8903 10412 12559 10525 13304 18178 12138 14060 15002 13924 12082 18538 14592
$$ packed form
12581E593K926m040m225K74N376J0424Kk310j1708j171P354P80j92O168L230k466
12565A6015n543M527J979k911J212n901r589M034n966J979L164k562l648O237
12551C027P797J151o436k910o74j99k615J518L793L623J971J233l368p401k397
12536a887L843J945j355q59r20M29K473K58J187K392k204R64K643K642j849J246
12520A0948l07o164r40J1596L50J777k895r553o809M083N813k721n671O74O896
12505G077o72M557P781Q03j999p193n087j07L540R469K451k871l602n491K800
12490A1456O899K712l060J090L936o319j0447P097K094L41M526N947l060j0903
12476A2309k206k04r96J509K147k034K779M874o040J922R42j078j842O456l946
$$ plain form
12461 14592 12070 13030 16925 11492 7667 13822 13980 11503 10678 8745 7040 9761 12752 10723 6117
12446 6117 4319 8229 16592 18581 16802 12541 12781 11525 7111 3568 3415 1984 3479 5552 3981
12431 3981 7302 12687 12017 9391 5994 3842 5012 2015 1230 1988 7548 15938 16715 4403 -717
12416 -717 5458 11679 15763 10076 9370 13761 14543 23971 19053 13379 16846 21279 22509 18667 19197 17426
12400 17426 12437 6866 6768 9057 8299 14390 11817 10177 9606 7817 6511 -1184 -126 4140 17850
12385 17850 21067 14710 6593 7369 11669 15226 9864 11768 19992 23473 26432 27421 23900 21187 15761
12370 15761 13888 15819 16040 19730 28325 34537 34476 29683 23116 22520 12215 8333 6963 6425 7280 10004
12354 10004 15843 19145 21145 25084 24746 23849 20231 18228 17119 21291 20630 19875 13519 15370 17754
$$ packed form
12461A4592k522R60L895n433l825O155J58k477q25j933j705K721K991k029m606
12446F117j798L910Q363J989j779m261K40j256m414l543j53j431J495K073j571
12431C981L321N385o70k626l397k152J170k997p85P58N560Q390P77j2312n120
12416g17O175O221M084n687p06M391P82R428m918n674L467M433J230l842N30j771
12400A7426m989n571r8K289p58O091k573j640n71j789j306p695J058M266J3710
12385A7850L217o357q117P76M300L557n362J904Q224L481K959R89l521k713n426
12370A5761j873J931K21L690Q595O212o1m793o567n96j0305l882j370n38Q55K724
12354A0004N839L302K000L939l38q97l618k003j109M172o61p55o356J851K384
$$ plain form
12339 17754 18437 19708 20952 14443 9517 13450 15652 16294 19348 23944 23437 17639 13757 9624 9863
12324 9863 4185 8675 22752 37243 41544 35019 28289 27438 29427 32938 32540 22712 20920 18916 12783
12309 12783 14019 12488 16594 16565 14230 15480 23844 25364 26983 26752 20401 21080 25770 23289 19270
12294 19270 19438 22377 24072 26617 21916 22611 27349 31671 27830 28224 21376 18926 25669 25170 26457
12279 26457 32497 30674 30881 32785 30175 27442 27699 31508 35266 32401 22771 19551 20949 26826 30942
12264 30942 33686 27539 27351 30534 33870 30470 29200 30806 41615 40070 42349 45623 51053 50672 46788
12249 46788 43003 45894 37759 37435 39947 45606 49406 46469 42901 37311 38065 38892 42602 42562 42371 42090
12233 42090 41508 38953 44732 43801 43020 40167 38159 35340 31371 33613 41329 49381 51006 44343 43705
$$ packed form
12339A7754O83J271J244o509m926L933K202O42L054M596n07n798l882m133K39
12324I863n678M490J4077J4491M301o525o730q51J989L511l98r828j792k004o133
12309A2783J236j531M106k9k335J250Q364J520J619k31o351O79M690k481m019
12294A9270J68K939J695K545m701O95M738M322l841L94o848k450O743m99J287
12279B6457O040j823K07J904k610k733K57L809L758k865r630l220J398N877M116
12264C0942K744o147j88L183L336l400j270J606J0809j545K279L274N430l81l884
12249D6788l785K891q135l24K512N659L800k937l568n590P54Q27L710m0j91k81
12233D2090n82k555N779r31p81k853k008k819l969K242P716Q052J625o663o38
$$ plain form
12218 43705 42739 38862 43453 46894 45678 39251 38282 37941 36655 31086 36368 47959 48640 52168 55577
12203 55577 58870 52818 48837 43851 44111 48795 54042 53806 56930 57503 50229 49755 49281 47345 45366 46296
12187 46296 48291 50458 49146 51063 50367 50665 56032 58094 64368 65164 63455 68887 66954 67218 66660 67774
12171 67774 67518 73522 74561 72089 73200 68246 68463 74995 76709 73997 75887 80478 81145 71568 64893
12156 64893 61603 61527 68381 78834 81413 78372 76854 81531 83004 77241 72736 69400 67071 71937 81663
12141 81663 82816 88600 94515 97709 96541 96515 102080 106584 104277 100114 96633 91320 88963 94535 92722
12126 92722 96859 101271 101343 101582 103189 113338 120137 115411 111911 109511 112973 118956 116665 112436 110860
12111 110860 113823 121431 126659 131746 138164 135025 137365 134601 136017 135459 131347 125864 129549 133430
$$ packed form
12218D3705r66l877M591L441j216o427r69l41j286n569N282J1591O81L528L409
12203E5577L293o052l981m986K60M684N247k36L124N73p274m74m74j936j979R30
12187D6296J995K167j312J917o96K98N367K062O274P96j709N432j933K64n58J114
12171F7774k56O004J039k472J111m954K17O532J714k712J890M591O67r577o675
12156F4893l290p6O854J0453K579l041j518M677J473n763m505l336k329M866R726
12141H1663J153N784N915L194j168k6N565M504k307m163l481n313k357N572j813
12126I2722M137M412P2K39J607J0149O799m726l500k400L462N983k291m229j576
12111A10860K963P608N228N087O418l139K340k764J416n58m112n483L685L881
$$ plain form
12097 133430 134029 136405 141295 138532 142171 151674 156267 157459 154827 160000 161326 159475 158709 163287 168716
12082 168716 160601 163543 169986 177173 183733 184632 188782 183738 183824 190975 197240 199363 198937 193805 190129
12067 190129 191189 197600 202037 207405 209144 211575 214738 213520 215313 220595 225152 229812 234468 233427
12053 233427 234438 243200 242286 246638 254534 262930 270972 266865 265844 271437 278694 279905 277831 281219
12039 281219 283941 285465 290701 295590 302184 309139 313534 318377 327350 332920 337330 336113 339377 345553
12025 345553 348922 351581 361787 375620 381122 392663 396873 392907 397701 406650 416375 419366 427952
12012 427952 440533 444437 445288 450016 458712 470267 483037 492310 496473 502681 515720 531030 541372
11999 541372 550009 559904 570549 577962 589775 599621 618051 627708 637882 650829 658154 664487 674408
$$ packed form
12097A33430N99K376M890k763L639R503M593J192k632N173J326j851p66M578N429
12082A68716q115K942O443P187O560Q99M150n044Q6P151O265K123m26n132l676
12067A90129J060O411M437N368J739K431L163j218J793N282M557M660M656j041
12053B33427J011Q762r14M352P896Q396Q042m107j021N593P257J211k074L388
12039B81219K722J524N236M889O594O955M395M843Q973N570M410j217L264O176
12025C45553L369K659J0206J3833N502J1541M210l966M794Q949R725K991Q586
12012D27952J2581L904Q51M728Q696J1555J2770R273M163O208J3039J5310J0342
11999E41372Q637R895J0645P413J1813R846J8430R657J0174J2947P325O333R921
$$ plain form
11986 674408 692934 700587 707715 717993 729777 738053 752865 772025 786519 799829 816475 823097
11974 823097 833718 856972 874862 889191 899480 912980 930344 946139 961868 982770 1003479
11963 1003479 1016931 1034802 1052957 1070526 1083550 1095656 1111449 1125182 1138656 1149295 1165686
11952 1165686 1189229 1206096 1214684 1222558 1239884 1256120 1270147 1280936 1290466 1300088 1312324 1318479
11940 1318479 1324707 1324467 1324407 1323638 1330187 1340173 1344208 1355541 1357904 1355664 1343181 1339522 1339900 1337081 1341885
11925 1341885 1352308 1343656 1325886 1310722 1299421 1292811 1280019 1269889 1255178 1247620 1240604 1226289
11913 1226289 1216292 1200442 1187775 1180431 1167934 1150390 1128645 1114826 1104974 1086833 1069155 1059442
11901 1059442 1038185 1024366 1010947 987996 972335 961824 946449 933179 919918 898964 878219
$$ packed form
11986F74408J8526P653P128J0278J1784Q276J4812J9160J4494J3310J6646O622
11974H23097J0621K3254J7890J4329J0289J3500J7364J5795J5729K0902K0709
11963A003479J3452J7871J8155J7569J3024J2106J5793J3733J3474J0639J6391
11952A165686K3543J6867Q588P874J7326J6236J4027J0789R530R622J2236O155
11940A318479O228k40o0p69O549R986M035J1333K363k240j2483l659L78k819M804
11925A341885J0423q652j7770j5164j1301o610j2792j0130j4711p558p016j4315
11913A226289r997j5850j2667p344j2497j7544k1745j3819r852j8141j7678r713
11901A059442k1257j3819j3419k2951j5661j0511j5375j3270j3261k0954k0745
$$ plain form
11890 878219 861469 846537 836946 822068 808114 790378 779833 769083 761336 746165 726258 716419
11878 716419 698858 687066 676679 663428 656449 641575 628866 618956 608699 603800 596710 583918
11866 583918 568524 556382 552534 545256 534077 518928 505885 492984 489504 489374 478911 469426 460479
11853 460479 450365 443104 439717 436265 426221 416528 410737 406723 400992 388275 378514 371994 369305
11840 369305 364622 357551 347888 340743 336710 331254 323973 322529 317709 314514 306211 299389 291087 286868
11826 286868 287411 283535 278642 270187 259543 257797 258077 261426 258715 258745 255918 256829 245212 235434 231311
11811 231311 231129 227652 223654 226459 226654 223333 212954 200380 193507 192394 188649 185056 185483 186534
11797 186534 189547 183269 171926 168508 167945 174437 171636 168973 174598 177072 170944 170964 168468 159892 158811
$$ packed form
11890H78219j6750j4932r591j4878j3954j7736j0545j0750p747j5171j9907r839
11878G16419j7561j1792j0387j3251o979j4874j2709r910j0257m899p090j2792
11866E83918j5394j2142l848p278j1179j5149j3043j2901l480j30j0463r485q947
11853D60479j0114p261l387l452j0044r693n791m014n731j2717r761o520k689
11840C69305m683p071r663p145m033n456p281j444m820l195q303o822q302m219
11826B86868N43l876m893q455j0644j746K80L349k711L0k827R11j1617r778m123
11811B31311j82l477l998K805J95l321j0379j2574o873j113l745l593M27J051
11797A86534L013o278j1343l418n63O492k801k663N625K474o128K0k496q576j081
$$ plain form
11782 158811 157347 149917 151748 154458 156220 154602 153514 148092 141802 138676 131768 128272 130408 130434 128410
11767 128410 129965 129419 123947 125379 129957 129776 126791 126891 124632 115373 110060 111918 118304 113991 106440
11752 106440 105920 107383 105245 107890 105715 104958 110599 115505 117298 112057 105262 97276 93094 92341 96509
11737 96509 95986 98752 97313 94383 89833 91957 91317 88303 87783 84319 80366 79111 81532 83328 80519
11722 80519 83723 88034 93148 93090 93069 92279 89027 84051 74140 68137 66754 71282 77182 76838 73236 77949
11706 77949 81152 84733 84204 79531 78669 79990 80162 75786 74207 70598 67343 72028 76612 76309 72204
11691 72204 73361 75669 78426 77414 73006 71210 70192 68627 74102 77625 73587 67710 66409 74063
11677 74063 74719 72815 76899 80799 82285 70897 68759 75523 83617 76879 78098 82767 75284 72930
$$ packed form
11782A58811j464p430J831K710J762j618j088n422o290l126o908l496K136K6k024
11767A28410J555n46n472J432M578j81k985J00k259r259n313J858O386m313p551
11752A06440n20J463k138K645k175p57N641M906J793n241o795p986m182p53M168
11737I6509n23K766j439k930m550K124o40l014n20l464l953j255K421J796k809
11722H0519L204M311N114n8k1p90l252m976r911o003j383M528N900l44l602M713
11706G7949L203L581n29m673q62J321J72m376j579l609l255M685M584l03m105
11691G2204J157K308K757j012m408j796j018j565N475L523m038n877j301P654
11677G4063O56j904M084L900J486j1388k138O764Q094o738J219M669p483k354
$$ plain form
11663 72930 85589 95060 99701 99816 92653 89811 92215 95587 107628 123045 136326 143321 159365
11650 159365 188647 212339 238048 275378 322723 383307 458767 554410 684124 847439 1011097
11639 1011097 1145600 1208381 1184057 1084331 941001 785494 635596 510975 418006 354872
11629 354872 294650 245470 217529 191180 163134 141076 131452 123936 109328 99479 94569 89084
11617 89084 76868 69531 66640 65666 68089 67243 61834 57015 60493 57026 57417 61731 56797 48066 41582
11602 41582 43126 38622 36046 40440 45589 44386 43004 34550 28597 33571 34221 35367 36234 40981 35473
11587 35473 32552 28636 26528 26862 28445 26030 27359 22163 22597 27470 25806 31095 33577 37544 31105
11572 31105 25945 28239 31430 27773 20168 19719 18827 21573 23379 21477 21030 23532 26783 32607 36718
$$ packed form
11663G2930J2659R471M641J15p163k842K404L372J2041J5417J3281O995J6044
11650A59365K9282K3692K5709L7330M7345O0584P5460R5643J29714J63315J63658
11639A011097J34503O2781k4324r9726j43330j55507j49898j24621r2969o3134
11629C54872o0222m9180k7941k6349k8046k2058r624p516j4608r849m910n485
11617H9084j2216p337k891r74K423q46n409m819L478l467L91M314m934q731o484
11602D1582J544m504k576M394N149j203j382q454n953M974O50J146Q67M747n508
11587C5473k921l916k108L34J583k415J329n196M34M873j664N289K482L967o439
11572C1105n160K294L191l657p605m49q92K746J806j902m47K502L251N824M111
$$ plain form
11557 36718 38038 34676 33477 27538 23752 27130 29855 22247 20820 28861 27711 16164 18254 24675
11543 24675 30994 35556 31143 13691 8308 10206 10584 7545 17123 22646 17355 13817 13047 8368 5694
11528 5694 9998 8158 3832 11554 15645 22372 31208 27365 19151 20234 19608 18370 15808 16162 12457
11513 12457 12033 20365 19014 15302 12761 6912 8237 14215 18088 19268 22479 18223 19439 13957 16974
11498 16974 15989 8124 11602 11867 15965 13377 15672 22323 21189 17416 10250 15088 19760 11444 6753
11483 6753 10567 11718 19818 19355 22147 15074 13275 14864 13653 12989 13361 14707 11808 7999 6748
11468 6748 14768 22514 15490 12045 16901 18489 15843 10120 7761 7199 7577 7840 3086 6473 7574
11453 7574 4888 6203 11946 12343 12142 7563 2276 959 3387 5774 7628 8772 15952 19377 11337
$$ packed form
11557C6718J320l362j199n939l786L378K725p608j427Q041j150j1547K090O421
11543B4675O319M562m413j7452n383J898L78l039R578N523n291l538p70m679k674
11528E694M304j840m326P722M091O727Q836l843q214J083o26j238k562L54l705
11513A2457m24Q332j351l712k541n849J325N978L873J180L211m256J216n482L017
11498A6974r85p865L478K65M098k588K295O651j134l773p166M838M672q316m691
11483F753L814J151Q100m63K792p073j799J589j211o64L72J346k899l809j251
11468F748Q020P746p024l445M856J588k646n723k359n62L78K63m754L387J101
11453G574k686J315N743L97k01m579n287j317K428K387J854J144P180L425q040
$$ plain form
11438 11337 2612 3261 8447 13944 18356 20181 15236 11924 11482 9955 10973 13178 13990 18222 21286
11423 21286 24841 21576 17614 12545 10699 7290 10807 8452 6113 56 6311 15844 19124 14549
11409 14549 14629 8291 4227 3774 6067 5116 428 7660 14213 16508 16111 6583 4079 6042 8245 8227
11393 8227 9999 10648 6941 5264 3934 2921 2185 2913 -2664 -6536 -7914 -4647 -3285 1409 -789
11378 -789 1892 6157 6171 11282 17688 15181 11950 9249 6588 5072 2062 -1908 -4435 -40 4072
11363 4072 1079 3704 8300 4397 5038 2668 -585 3826 8811 14593 14500 15235 14123 8464 -785 -4764
11347 -4764 -3655 39 3712 12660 13761 10345 12625 13175 7644 813 -4266 -1024 -366 255 3417
11332 3417 3698 1621 -1201 6436 10300 7834 5696 3064 12 -807 -3008 -8790 -3327 -152 -1332
$$ packed form
11438A1337q725O49N186N497M412J825m945l312m42j527J018K205Q12M232L064
11423B1286L555l265l962n069j846l409L517k355k339o057O255R533L280m575
11409A4549Q0o338m064m53K293r51m688P232O553K295l97r528k504J963K203j8
11393H227J772O49l707j677j330j013p36P28n577l872j378L267J362M694k198
11378g89K681M265J4N111O406k507l231k701k661j516l010l970k527M395M112
11363D072k993K625M596l903O41k370l253M411M985N782r3P35j112n659r249l979
11347d764J109L694L673Q948J101l416K280N50n531o831n079L242O58O21L162
11332C417K81k077k822P637L864k466k138k632l052q19k201n782N463L175j180
$$ plain form
11317 -1332 -3111 -2510 -3828 -746 1308 -852 -1850 206 5811 12320 4129 2407 4434 1772 280
11302 280 -1614 4833 4549 2575 3690 6125 1212 -5127 -643 -1325 -2215 -2595 6237 7371 4588 783
11286 783 4791 8286 6316 8685 15784 12195 1077 1843 -1698 -3568 -7121 -3970 655 -1336 -175
11271 -175 1221 -2240 -4505 -9626 -7093 -2593 7421 5435 5060 1178 1620 4667 9707 10496 4607
11256 4607 1521 3748 8535 4425 227 -1038 -3118 102 6732 8596 5150 2371 4078 6548 9455
11241 9455 8444 5816 3491 12158 13661 13618 11768 7989 1889 623 3125 11085 6499 2077 -2187
11226 -2187 -6247 -410 -5845 -11466 -12199 -7355 -1351 7750 13924 12957 12365 6856 7336 5360 2699 1057
11210 1057 -258 450 -1365 -4915 -5135 -4487 -2080 3814 9807 12573 12098 13365 7203 8201 8389 6411
$$ packed form
11317a332j779O01j318L082K054k160r98K056N605O509q191j722K027k662j492
11302B80j894O447k84j974J115K435m913o339M484o82q90l80Q832J134k783l805
11286G83M008L495j970K369P099l589j1118P66l541j870l553L151M625j991J161
11271a75J396l461k265n121K533M500J0014j986l75l882M42L047N040P89n889
11256D607l086K227M787m110m198j265k080L220O630J864l446k779J707K470K907
11241I455j011k628k325Q667J503m3j850l779o100j266K502P960m586m422m264
11226b187m060N837n435n621p33M844O004R101O174r67n92n509M80j976k661j642
11210A057j315P08j815l550k20O48K407N894N993K766m75J267o162R98J88j978
$$ plain form
11194 6411 7309 15446 13943 9758 2299 557 1426 1849 1341 815 433 3437 7969 2538 -3593 -7511
11178 -7511 -3884 -5551 1738 7248 5614 1070 -1708 -8221 -8969 -6250 -7393 -8333 -10460 -5255 -572
11163 -572 1055 338 6621 12143 12324 18702 19614 25440 25686 20682 12174 6267 2137 1749 4633 2686
11147 2686 -399 3891 1618 2498 3843 3574 -2580 2386 8446 11620 12373 9158 3602 1245 5139
11132 5139 8003 5127 -2499 2066 2179 1712 6917 7009 5113 3404 2996 1545 -173 -2551 -48 -1988
11116 -1988 -3560 -7696 -12076 -7831 -6996 -4880 -2411 1822 4197 3953 6817 1652 -416 -5335 -7093
11101 -7093 -4585 -2593 -2408 -4231 -4142 -5227 -1318 -737 -3627 -3030 -3700 -2216 -7631 -9163 -4843 -7165
11085 -7165 -1758 1141 4011 8702 4969 2346 4860 9222 11788 6855 3345 -546 -1667 1308 -3444
$$ packed form
11194F411Q98Q137j503m185p459j742Q69M23n08n26l82L004M532n431o131l918
11178g511L627j667P289N510j634m544k778o513p48K719j143r40k127N205M683
11163e72J627p17O283N522J81O378R12N826K46n004q508n907m130l88K884j947
11147B686l085M290k273Q80J345k69o154M966O060L174P53l215n556k357L894
11132E139K864k876p626M565J13m67N205R2j896j709m08j451j718k378K503j940
11116a988j572m136m380M245Q35K116K469M233K375k44K864n165k068m919j758
11101g093K508J992J85j823Q9j085L909N81k890N97o70J484n415j532M320k322
11085g165N407K899K870M691l733k623K514M362K566m933l510l891j121K975m752
$$ plain form
11070 -3444 -4415 -59 3328 5967 -3886 -5926 1081 3114 421 -6995 -5196 -3417 -9734 -10849 -12367
11055 -12367 -7661 -4872 -4037 -243 657 2018 4923 5350 11451 10740 10989 8724 2570 -1704 -2047 2410
11039 2410 5673 9805 6661 8004 12957 11753 7429 5148 9562 17654 28029 29960 32967 34632
11025 34632 34018 37582 37985 31072 24239 10017 8955 12402 18819 34391 48781 55644 56765 46896
11011 46896 36677 36051 26980 23823 23574 25089 24728 25555 32047 36453 34367 33926 33518 30086 25218 13588
10995 13588 10212 15246 13127 10949 20261 24322 22574 25095 19743 19433 19477 12177 3979 4708 6697
10980 6697 7283 5909 -6270 -20187 -17966 -12331 -4915 -45 -1795 -277 -2703 -8769 -8250 -7448 -4946
10965 -4946 -4421 -8212 -2044 1846 -2484 5141 4584 2420 51 -43 -1910 30 7942 8362 -2156 -11163
$$ packed form
11070c444r71M356L387K639r853k040P007K033k693p416J799J779o317j115j518
11055a2367M706K789Q35L794R00J361K905M27O101p11K49k265o154m274l43M457
11039B410L263M132l144J343M953j204m324k281M414Q092J0375J931L007J665
11025C4632o14L564M03o913o833j4222j062L447O417J5572J4390O863J121r869
11011D6896j0219o26r071l157k49J515l61Q27O492M406k086m41m08l432m868j1630
10995A3588l376N034k119k178R312M061j748K521n352l10M4p300q198P29J989
10980F697N86j374j2179j3917K221N635P416M870j750J518k426o066N19Q02K502
10965d946N25l791O168L890m330P625n57k164k369r4j867J940P912M20j0518r007
$$ plain form
10949 -11163 -3660 -584 -1698 -908 -3628 487 3898 -2579 -5323 -2023 2441 5824 2703 756 44
10934 44 -3359 -3743 -7086 -9762 -8899 -5908 -6503 -3119 1019 4613 8667 9759 4329 2739 3304 6470
10918 6470 8916 2535 10440 8491 4843 2799 5062 5026 1890 -4015 -3538 -2959 -4243 -4393 -3337 -1406
10902 -1406 1972 6361 3609 211 -6729 -7898 1413 1932 -1460 -6523 -9063 -8987 -9069 -9698 -6735 361
10886 361 2957 933 -1220 2167 -3258 -5435 -3992 -1343 -2145 -2225 8052 10298 2826 -927 -7672
10871 -7672 -4851 -492 4071 -3068 1512 3339 -51 1490 4686 3684 -4715 -5999 -11009 -13582 -4530
10856 -4530 8379 4751 -3527 -6139 -3630 -2569 217 5183 5098 5749 9 -4323 -1717 4870 7761
10841 7761 3512 6442 8101 1902 -842 -5313 -6013 -5827 -3236 1586 3294 1235 -349 5019 10166
$$ packed form
10949a1163P503L076j114P90k720M115L411o477k744L300M464L383l121j947p12
10934D4l403l84l343k676Q63K991n95L384M138L594M054J092n430j590N65L166
10918F470K446o381P905j949l648k044K263l6l136n905M77N79j284j50J056J931
10902a406L378M389k752l398o940j169R311N19l392n063k540P6q2o29K963P096
10886C61K596k024k153L387n425k177J443K649q02q0J0277K246p472l753o745
10871g672K821M359M563p139M580J827l390J541L196j002q399j284n010k573R052
10856d530J2909l628q278k612K509J061K786M966q5O51n740m332K606O587K891
10841G761m249K930J659o199k744m471p00J86K591M822J708k059j584N368N147
$$ plain form
10826 10166 9830 7893 6464 11170 12249 9636 6094 -2503 -925 5329 3940 -4373 -16108 -16631 -9872
10811 -9872 -7695 -4057 -2493 -2882 -3409 -4357 1406 -11 -4015 -8729 -13263 -7032 1811 849 2308 3350
10795 3350 5246 2179 -902 1788 6145 7652 2695 -1272 -1035 -3723 -6884 -8029 -10142 -3923 4200
10780 4200 5813 5564 2258 -609 -4441 -6795 -3444 6065 10742 11204 14686 15377 7673 -1945 -2302 -918
10764 -918 4439 4683 4683 4855 3505 5272 2762 10376 13354 14270 15413 15569 10933 793 2216 7347
10748 7347 7230 -979 -4470 -6590 -5737 -3145 -6689 -9088 -7782 -10873 -17264 -21107 -13893 -9246 -5884
10733 -5884 -4409 -2290 -2275 -3096 -5498 -1761 -4612 -5557 -11301 -8855 -6366 -7334 -8156 -2507 -2549 -3910 -1026
10716 -1026 6752 6866 5119 2714 2952 1475 2201 5479 9109 6667 15861 13906 5702 -925 -5333
$$ packed form
10826A0166l36j937j429M706J079k613l542q597J578O254j389q313j1735n23O759
10811i872K177L638J564l89n27r48N763j417m004m714m534O231Q843r62J459J042
10795C350J896l067l081K690M357J507m957l967K37k688l161j145k113O219Q123
10780D200J613k49l306k867l832k354L351R509M677M62L482O91p704r618l57J384
10764i18N357K44%J72j350J767k510P614K978R16J143J56m636j0140J423N131
10748G347j17q209l491k120Q53K592l544k399J306l091o391l843P214M647L362
10733e884J475K119J5q21k402L737k851r45n744K446K489r68q22N649m2j361K884
10716a026P778J14j747k405K38j477P26L278L630k442R194j955q204o627m408
$$ plain form
10701 -5333 -4184 828 1028 5087 5465 5835 7661 12253 11105 17356 24027 21388 15488 10767 10123 12158
10685 12158 8359 11015 16562 13834 3592 2980 12097 11123 10852 13868 18739 20497 21531 23250 23685
10670 23685 24612 24003 18721 12744 8738 7378 14517 12523 10514 10487 10805 8273 10635 15694 18885 18778
10654 18778 26710 27015 17998 19399 13358 10877 12949 19583 23161 28412 27869 29732 30698 31794 30612
10639 30612 28959 35507 39463 38658 39532 43225 49205 52783 53929 55590 73853 94739 112521 122169
10625 122169 133105 148706 162888 178037 201066 220068 244882 275459 316347 377854 460592
10614 460592 573897 738476 968588 1277575 1681664 2157355 2635384 2999687 3148618 3106096
10604 3106096 2949459 2785120 2712232 2798546 3070802 3579496 4348713 5323571 6278881 6892103
$$ packed form
10701e333J149N012K00M059L78L70J826M592j148O251O671k639n900m721o44K035
10685A2158l799K656N547k728j0242o12R117r74k71L016M871J758J034J719M35
10670B3685R27o09n282n977m006j360P139j994k009k7L18k532K362N059L191j07
10654A8778P932L05r017J401o041k481K072O634L578N251n43J863R66J096j182
10639C0612j653O548L956q05Q74L693N980L578J146J661J8263K0886J7782R648
10625A22169J0936J5601J4182J5149K3029J9002K4814L0577M0888O1507Q2738
10614D60592J13305J64579K30112L08987M04089M75691M78029L64303J48931m2522
10604C106096j56637j64339p2888Q6314K72256N08694P69217R74858R55310O13222
$$ plain form
10594 6892103 6960260 6546464 5909943 5324006 4958530 4907266 5195877 5845790 6853525 8111313
10584 8111313 9247883 9779244 9489811 8563356 7367839 6269888 5478545 5039382 4945351
10575 4945351 5173915 5693023 6363826 6909776 7017400 6581072 5743201 4779460 3938690
10566 3938690 3328728 2957137 2789563 2796942 2931782 3116015 3220054 3133821 2836698 2401631
10556 2401631 1927460 1496793 1147312 884835 699379 566160 479188 412133 352689 308256
10546 308256 269780 241805 220553 196150 174892 152017 137007 128451 122790 119422 115031 111966
10534 111966 102953 87557 81233 79228 80131 82013 75443 63522 56828 57895 62835 62700 57841 56759
10520 56759 59670 60790 51932 49343 50014 46635 43566 36443 34025 32951 35282 40378 41168 40869 45448
$$ packed form
10594F892103O8157m13796o36521n85937l65476n1264K88611O49913J007735J257788
10584H111313J136570N31361k89433r26455j195517j097951p91343m39163r4031
10575D945351K28564N19108O70803N45950J07624m36328q37871r63741q40770
10566C938690o09962l71591j67574P379J34840J84233J04039q6233k97123m35067
10556B401631m74171m30667l49481k62477j85456j33219q6972o7055n9444m4433
10546C08256l8476k7975k1252k4403k1258k2875j5010q556n661l368m391l065
10534A11966r013j5396o324k005R03J882o570j1921o694J067M940j35m859j082
10520E6759K911J120q858k589O71l379l069p123k418j074K331N096P90k99M579
$$ plain form
10505 45448 47600 41492 28211 28164 33333 27982 22229 24204 22064 22922 28632 31452 32257 34928 35954
10490 35954 36684 42301 48007 53805 59622 70463 89226 115140 159730 212718 254744 267304 273021
10477 273021 275583 280800 281028 254532 211183 165111 119840 88458 70939 59218 52671 49625 42402
10464 42402 40243 35729 28744 29352 34198 35655 36213 33688 34081 35589 37878 34231 33048 31064 34622
10449 34622 29390 23915 27546 30576 28237 35444 37342 39231 42393 43145 34626 27440 31911 31518 30846
10434 30846 33379 44236 55353 55290 52036 50330 51254 55469 64619 68252 71473 84538 92960 106385
10420 106385 125085 154947 194592 245917 326160 430253 553620 661842 731919 764385 756153
10409 756153 685736 576536 455823 347359 261316 201610 162891 142934 115966 96412 87378
$$ packed form
10505D5448K152o108j3281m7N169n351n753J975k140Q58N710K820Q05K671J026
10490C5954P30N617N706N798N817J0841J8763K5914M4590N2988M2026J2560N717
10477B73021K562N217K28k6496m3349m6072m5271l1382j7519j1721o547l046p223
10464D2402k159m514o985O08M846J457N58k525L93J508K289l647j183j984L558
10449C4622n232n475L631L030k339P207J898J889L162P52q519p186M471l93o72
10434C0846K533J0857J1117o3l254j706R24M215R150L633L221J3065Q422J3425
10420A06385J8700K9862L9645N1325Q0243J04093J23367J08222P0077L2466q232
10409G56153p0417j09200j20713j08464q6043n9706l8719j9957k6968j9554r034
$$ plain form
10398 87378 78651 71964 62252 48610 39820 41613 42713 40472 39062 41735 37873 34888 32327 33430
10384 33430 26600 17242 10950 13723 15202 18740 16529 14141 13161 10965 9311 14862 16323 12893 11813
10369 11813 10034 8564 11367 14973 17609 12534 14562 14021 9563 9101 8970 11592 17786 20762 16656
10354 16656 15269 14642 13604 19123 12682 4486 7868 20524 28904 22011 16257 13604 13769 15247 18421
10339 18421 18006 20136 20791 18775 12242 6412 12407 21760 22969 23240 25713 25336 23050 20481 19009
10324 19009 18179 21190 15137 13061 14457 16084 14599 11497 16126 19843 24080 17652 15464 14109 11197
10309 11197 8425 5877 7298 1718 -830 3897 11212 16708 19818 19819 20242 23864 16708 8677 7091
10294 7091 12659 22937 23637 21801 21874 24226 23887 22522 15670 6909 1567 5654 8838 13635 14893
$$ packed form
10398H7378q727o687r712j3642q790J793J100k241j410K673l862k985k561J103
10384C3430o830r358o292K773J479L538k211k388r80k196j654N551J461l430j080
10369A1813j779j470K803L606K636n075K028n41m458m62j31K622O194K976m106
10354A6656j387o27j038N519o441q196L382J2656Q380o893n754k653J65J478L174
10339A8421m15K130O55k016o533n830N995R353J209K71K473l77k286k569j472
10324A9009q30L011o053k076J396J627j485l102M629L717M237o428k188j355k912
10309A1197k772k548J421n580k548M727P315N496L110JM23L622p156q031j586
10294G091N568J0278P00j836P3K352l39j365o852q761n342M087L184M797J258
$$ plain form
10279 14893 13405 14360 17881 28745 38701 41600 49021 52445 62547 73036 84549 83429 80275 86519
10265 86519 93361 93672 88389 84784 80353 70793 60396 47971 41466 31954 25226 15854 7448 8473
10251 8473 19151 20998 25138 24397 25781 28592 29567 29020 31445 30150 29194 31809 34821 31685 20295
10236 20295 21403 28327 26742 29094 28111 29245 30938 33918 29727 27108 31731 26337 29720 28584 23828
10221 23828 29625 34310 31066 33064 31170 32880 37785 40040 44934 42113 37240 38184 37867 29899 30360
10206 30360 38132 44918 61319 76111 85536 85793 89822 91590 86558 80081 74156 66191 61932 58333
10192 58333 55536 57904 57214 54123 60968 64192 66895 68584 67879 62495 60852 64128 69818 74387 73294
10177 73294 79824 90723 102218 104894 110887 114321 109695 97453 73193 51799 23466 -6130 -32039
$$ packed form
10279A4893j488R55L521J0864R956K899P421L424J0102J0489J1513j120l154O244
10265H6519O842L11n283l605m431r560j0397j2425o505r512o728r372q406J025
10251H473J0678J847M140p41J384K811R75n47K425j295r56K615L012l136j1390
10236B0295J108O924j585K352r83J134J693K980m191k619M623n394L383j136m756
10221B3828N797M685l244J998j894J710M905K255M894k821m873R44l17p968M61
10206C0360P772O786J6401J4792R425K57M029J768n032o477n925p965m259l599
10192E8333k797K368o90l091O845L224K703J689p05n384j643L276N690M569j093
10177G3294O530J0899J1495K676N993L434m626j2242k4260k1394k8333k9596k5909
$$ plain form
10164 -32039 -51687 -46719 -33135 -13788 -246 16225 22445 25258 32069 27934 23272 32431 33983
10151 33983 34384 38652 51450 51626 53961 50443 45165 29980 9020 -2737 -10866 -4798 9404 28722
10137 28722 60133 92181 120303 134288 143542 147416 149911 154038 158115 159870 154050 151059 141511
10124 141511 139005 140621 138918 138457 136651 133549 127009 127154 133567 127021 127762 130422 135023 136703 134085
10109 134085 134169 134466 131669 129950 134207 140946 146022 150030 152731 145858 147352 152158 149692 156799 161254
10094 161254 168603 168359 169454 173578 180839 184789 192886 200009 211342 216159 213977 219462 221509 219517
10080 219517 223058 229481 230421 230540 241418 257369 267230 275359 285124 301599 319472 340267 361426
10067 361426 380032 395766 414985 437099 460541 480777 498961 519497 539738 560612 585076
$$ packed form
10164c2039j9648M968J3584J9347J3542J6471O220K813O811m135m662R159J552
10151C3983M01M268J2798J76K335l518n278j5185k0960j1757q129O068J4202J9318
10137B8722L1411L2048K8122J3985R254L874K495M127M077J755n820k991r548
10124A41511k506J616j703m61j806l102o540J45O413o546P41K660M601J680k618
10109A34085Q4K97k797j719M257O739N076M008K701o873J494M806k466P107M455
10094A61254P349k44J095M124P261L950Q097P123J1333M817k182N485K047j992
10080B19517L541O423R40J19J0878J5951R861Q129R765J6475J7873K0795K1159
10067C61426J8606J5734J9219K2114K3442K0236J8184K0536K0241K0874K4464
$$ plain form
10056 585076 617096 649243 687905 734700 780254 820928 859459 914397 970959 1027763 1095016
10045 1095016 1180838 1266887 1361582 1470057 1597706 1736810 1896727 2082680 2305716 2575193
10035 2575193 2901068 3254238 3598212 3953763 4329618 4718414 5151552 5669328 6320987
10026 6320987 7186554 8314684 9754504 11569446 13891572 16974973 21223082 27297052
10018 27297052 36205094 49376433 68516121 93663792 118313649 134039731 142233408
10011 142233408 143813457 134541459 115758313 92469896 69083146 50451534 37394776
10004 37394776 28481533 22375836 18066384 14906809 12516285 10632808 9105758 7869198
9996 7869198 6886534 6131634 5571967 5157112 4814658 4483295 4169998 3855026 3511169 3160781
$$ packed form
10056E85076L2020L2147L8662M6795M5554M0674L8531N4938N6562N6804O7253
10045A095016Q5822Q6049R4695J08475J27649J39104J59917J85953K23036K69477
10035B575193L25875L53170L43974L55551L75855L88796M33138N17776O51659
10026F320987Q65567J128130J439820J814942K322126L083401M248109O073970
10018B7297052Q908042J3171339J9139688K5147671K4649857J5726082Q193677
10011A42233408J580049r271998j8783146k3288417k3386750j8631612j3056758
10004C7394776q913243o105697m309452l159575k390524j883477j527050j236560
9996G869198r82664p54900n59667m14855l42454l31363l13297l14972l43857l50388
$$ plain form
9986 3160781 2825949 2526471 2283370 2089088 1923076 1779064 1663919 1561664 1472382 1389844
9976 1389844 1321288 1252284 1186554 1126473 1064739 1014774 975015 937432 891197 848865 814559
9965 814559 780128 742190 710087 682513 658218 639801 617331 601302 590977 580834 566755 553964
9953 553964 541308 536585 525349 502144 480422 464141 454013 445699 433971 423521 411666 394240
9941 394240 378735 369256 356997 345406 326954 309402 300178 293139 285526 281663 277776 274425 269468
9928 269468 259333 252259 247901 248333 228423 215076 220030 216892 210629 207994 204763 196504 192119 190357
9914 190357 183831 175116 166166 156395 153066 150678 148336 144332 141714 144207 147360 145635 141732 131834
9900 131834 125428 121624 121154 113029 103422 92944 81501 73861 70260 77919 93578 115429 133704
$$ packed form
9986C160781l34832k99478k43101j94282j66012j44012j15145j02255q9282q2538
9976A389844o8556o9004o5730o0081o1734m9965l9759l7583m6235m2332l4306
9965H14559l4431l7938l2103k7574k4295j8417k2470j6029j0325j0143j4079j2791
9953E53964j2656m723j1236k3205k1722j6281j0128q314j1728j0450j1855j7426
9941C94240j5505r479j2259j1591j8452j7552r224p039p613l863l887l351m957
9928B69468j0135p074m358M32j9910j3347M954l138o263k635l231q259m385j762
9914A90357o526q715q950r771l329k388k342m004k618K493L153j725l903r898
9900A31834o406l804m70q125r607j0478j1443p640l601P659J5659K1851J8275
$$ plain form
9887 133704 153674 175759 202059 216728 222074 221014 215169 207146 199567 200086 200671 193683 183490 181462
9873 181462 175280 170156 173324 181333 178105 175407 176057 175518 170033 168194 178007 195038 203803 202438 188877
9858 188877 168323 145656 117710 95610 71287 48680 39254 34022 35310 33803 37051 41322 42799
9845 42799 44490 44989 49140 56923 64013 66559 70352 69766 64147 62218 59949 56798 65734 70621 68437
9830 68437 64187 57815 52769 47735 45627 35926 26584 23484 24512 34904 41196 42768 47240 51205
9816 51205 55519 59034 63003 65686 67768 61940 53176 51023 48074 41472 36460 36861 36510 35022 34857
9801 34857 30876 32462 33360 43370 46694 45168 42974 41600 39233 40233 40457 47649 50151 45489 44592
9786 44592 46924 40068 39355 38392 37926 37716 42102 47762 41923 40956 40860 46448 58673 62872 69987 69502
$$ packed form
9887A33704J9970K2085K6300J4669N346j060n845q023p579N19N85o988j0193k028
9873A81462o182n124L168Q009l228k698O50n39n485j839R813J7031Q765j365j3561
9858A88877k0554k2667k7946k2100k4323k2607r426n232J288j507L248M271J477
9845D2799J691M99M151P783P090K546L793n86n619j929k269l151Q936M887k184
9830F8437m250o372n046n034k108r701r342l100J028J0392O292J572M472L965
9816E1205M314L515L969K683K082n828q764k153k949o602n012M01l51j488j65
9801C4857l981J586Q98J0010L324j526k194j374k367J000K24P192K502m662q97
9786D4592K332o856p13r63m66k10M386N660n839r67r6N588J2225M199P115m85
$$ plain form
9770 69502 66287 61137 62806 61312 59409 53499 50873 52863 53288 51686 47524 44998 44391 44051 45135
9755 45135 45989 45565 47446 35855 37840 37834 34564 34533 34050 36205 38459 44842 44144 37059 39383 41995 34929
9738 34929 24499 23013 32493 28799 19455 15687 23004 25121 24607 23396 22837 26187 30286 29470 28029
9723 28029 31770 35217 29834 34171 33213 32761 33764 34191 35228 28159 25315 22264 18690 17462 16316
9708 16316 12102 16693 23837 26764 25537 34054 41546 43842 43129 38989 40974 42841 41721 39900 43823
9693 43823 41295 44611 41102 39568 42761 43414 34943 34547 32521 32346 30113 28076 29822 31789 29132
9678 29132 28342 31185 27658 24947 23686 26414 34522 36869 36944 40812 45256 38090 40015 34982 28698
9663 28698 28827 33955 34217 34084 35621 41242 41141 33823 43399 52198 51777 42699 42120 49497 56784 61182
$$ packed form
9770F9502l215n150J669j494j903n910k626J990M25j602m162k526o07l40J084
9755D5135Q54m24J881j1591J985ol270l1m83K155K254O383o98p085K324K612p066
9738C4929j0430j486R480l694r344l768P317K117n14j211n59L350M099q16j441
9723B8029L741L447n383M337r58m52J003M27J037p069k844l051l574j228j146
9708A6316m214M591P144K927j227Q517P492K296p13m140J985J867j120j821L923
9693D3823k528L316l509j534L193O53q471l96k026j75k233k037J746J967k657
9678B9132p90K843l527k711j261K728Q108K347P5L868M444p166J925n033o284
9663B8698J29N128K62j33J537N621j01p318R576Q799m21r078n79P377P287M398
$$ plain form
9647 61182 67739 71697 80502 87176 98353 108087 105201 95541 77773 70886 63830 63304 61434 60035
9633 60035 55880 57869 62677 64780 63555 64443 70406 71150 70351 72326 67956 71362 79672 80748 86536
9618 86536 100184 109495 127254 157775 195304 246533 315519 420520 545315 668944 753017
9607 753017 792389 794274 750307 661303 552777 446943 360713 299523 267112 237628 211144
9596 211144 186682 182763 186560 197041 211539 231065 245132 273554 311893 357372 409987 477458
9584 477458 564744 671915 802146 960534 1134355 1308846 1471056 1592217 1661192 1674300
9574 1674300 1626161 1528820 1393185 1228186 1060891 907867 766987 648314 545469 459920
9564 459920 393257 339395 288182 251287 221477 199468 183538 175424 162671 143760 131103 127895
$$ packed form
9647F1182O557L958Q805O674J1177R734k886r660j7768o887p056n26j870j399
9633F0035m155J989M808K103j225Q88N963P44p99J975m370L406Q310J076N788
9618H6536J3648R311J7759L0521L7529N1229O8986J05001J24795J23629Q4073
9607G53017L9372J885m3967q9004j08526j05834q6230o1190l2411k9484k6484
9596B11144k4462l919L797J0481J4498J9526J4067K8422L8339M5479N2615O7471
9584D77458Q7286J07171J30231J58388J73821J74491J62210J21161O8975J3108
9574A674300m8139r7341j35635j64999j67295j53024j40880j18673j02845q5549
9564D59920o6663n3862n1213l6895k9810k2009j5930q114j2753j8911j2657l208
$$ plain form
9552 127895 123276 111601 108172 107742 93109 82654 73068 61809 57098 52656 53390 57461 56417 63605
9538 63605 63678 62791 57183 54686 56525 53096 56332 55837 58257 56084 46514 37512 41481 50959 56690 56188
9522 56188 47279 46684 50049 52019 48547 52795 63616 62372 65875 68603 72889 73797 72839 68354 69607
9507 69607 73242 75429 75930 72251 65960 60051 52749 49992 50206 50126 53113 50246 50320 52099 56868 63334
9491 63334 63637 63833 61670 54859 55947 49010 43978 44297 52462 65239 75684 75763 77595 87393 82887
9476 82887 77253 71582 67846 63369 58642 56450 57632 59377 60298 61212 59817 58585 58516 59675 61302 61170
9460 61170 66813 72945 74411 76519 79447 81854 85816 82240 79039 68660 64796 62911 53614 49743
9446 49743 51207 50729 58215 73114 83969 85234 89279 99548 117253 132978 145845 171013 194306
$$ packed form
9552A27895m619j1675l429m30j4633j0455r586j1259m711m442P34M071j044P188
9538F3605P3q87n608k497J839l429L236m95K420k173r570r002L969R478N731n02
9522E6188q909n95L365J970l472M248J0821j244L503K728M286R08r58m485J253
9507F9607L635K187N01l679o291n909p302k757K14q0K987k867P4J779M769O466
9491F3334L03J96k163o811J088o937n032L19Q165J2777J0445P9J832R798m506
9476H2887n634n671l736m477m727k192J182J745R21R14j395j232o9J159J627j32
9460F1170N643O132J466K108K928K407L962l576l201j0379l864j885r297l871
9446D9743J464m78P486J4899J0855J265M045J0269J7705J5725J2867K5168K3293
$$ plain form
9433 194306 216547 243936 277879 292736 275040 260294 249640 249660 260181 256110 221812 176970
9421 176970 140432 103686 83775 79084 76939 76235 71956 64722 68275 69859 73570 79756 82967 89698
9407 89698 96686 105521 113027 110325 105571 104394 103412 95247 88832 83538 84341 99011 106605 99322 94737
9392 94737 99419 100697 96264 86133 83615 89860 88017 93695 99821 108042 120614 124332 127607 127709
9378 127709 122274 110610 108627 117109 116183 106468 108558 105863 110724 135903 164918 203259 233323
9365 233323 256835 267495 260721 251260 237019 218011 196646 180027 164256 159300 168188 180405
9353 180405 194822 200846 202897 193930 189020 181466 181665 184160 191956 203980 226333 245973 253404 264007
9339 264007 270926 273396 281372 294730 312699 313938 278797 207627 107924 -595 -89175 -133573
$$ packed form
9433A94306K2241K7389L3943J4857j7696j4746j0654K0J0521m071l4298m4842
9421A76970l6538l6746j9911m691k145p04m279p234L553J584L711O186L211O731
9407H9698O988Q835P506k702m754j177r82q165o415n294Q03J4670P594p283m585
9392I4737M682J278m433j0131k518O245j843N678O126Q221J2572L718L275J02
9378A27709n435j1664j983Q482r26r715K090k695M861K5179K9015L8341L0064
9365B33323K3512J0660o774r461j4241j9008k1365j6619j5771m956Q888J2217
9353A80405J4417O024K051q967m910p554J99K495P796J2024K2353J9640P431J0603
9339B64007O919K470P976J3358J7969J239l5141p1170r9703j08519q8580m4398
$$ plain form
9327 -133573 -138028 -121232 -96252 -71113 -49828 -40124 -24841 -11285 2983 10567 8885 9668 14466
9314 14466 18732 20887 25362 25345 19440 18186 11762 -14135 -39152 -69561 -87795 -63481 4842 103084
9300 103084 199648 269910 322145 374771 418147 447518 458059 451941 443937 440376 433414 423714 412717
9287 412717 411840 413741 418530 417083 419096 422289 418741 419446 429066 435541 441900 444841 447957 456296 463590
9272 463590 460458 455419 458062 466328 480776 496184 512312 525384 534761 539101 540433 541883 546378
9259 546378 558366 574425 596788 617617 630634 643906 662246 681290 691962 712596 731605 738115
9247 738115 741981 755601 772237 783687 802137 823156 846386 878115 910309 943221 975510 1016044
9235 1016044 1058661 1110368 1171706 1232469 1295116 1352082 1426792 1499213 1575989 1649871 1718745
$$ packed form
9327a33573m455J6796K4980K5139K1285R704J5283J3556J4268P584j682P83M798
9314A4466M266K155M475j7n905j254o424k5897k5017l0409j8234K4314O8323R8242
9300A03084R6564P0262N2235N2626M3376K9371J0541o118q004l561o962r700j0997
9287D12717q77J901M789j447K013L193l548P05R620O475O359K941L116Q339P294
9272D63590l132n039K643Q266J4448J5408J6128J3072R377M340J332J450M495
9259E46378J1988J6059K2363K0829J3017J3272J8340J9044J0672K0634J9009O510
9247G38115L866J3620J6636J1450J8450K1019K3230L1729L2194L2912L2289M0534
9235A016044M2617N1707O1338O0763O2647N6966P4710P2421P6776P3882O8874
$$ plain form
9224 1718745 1792698 1863467 1935725 2024666 2125594 2238896 2365437 2492548 2633046 2781561
9214 2781561 2931317 3087426 3262285 3459342 3686138 3937412 4206099 4495088 4820654 5188446
9204 5188446 5599927 6050020 6542300 7093068 7701794 8386555 9178461 10117945 11249358
9195 11249358 12610632 14256860 16242956 18617477 21417100 24670013 28417554 32628424
9187 32628424 37300680 42708545 49471010 58482310 70941682 88616188 114151392 151296485
9179 151296485 204751666 277758328 363660439 436190640 463563174 438146202 374931199
9172 374931199 296164194 223267744 166696534 126183423 97903403 78101796 64000999
9165 64000999 53774086 46238115 40588050 36142362 32318860 28765578 25415392 22333846
$$ packed form
9224A718745P3953P0769P2258Q8941J00928J13302J26541J27111J40498J48515
9214B781561J49756J56109J74859J97057K26796K51274K68687K88989L25566L67792
9204E188446M11481M50093M92280N50768O08726O84761P91906R39484J131413
9195A1249358J361274J646228J986096K374521K799623L252913L747541M210870
9187C2628424M672256N407865O762465R011300J2459372J7674506K5535204L7145093
9179A51296485N3455181P3006662Q5902111P2530201K7372534k5416972o3215003
9172C74931199p8767005p2896450n6571210m0513111k8280020j9801607j4100797
9165F4000999j0226913p535971n650065m445688l823502l553282l350186l081546
$$ plain form
9157 22333846 19616700 17305314 15361385 13711127 12296184 11081864 10036900 9140492
9149 9140492 8373325 7718063 7162765 6686780 6264022 5884091 5539641 5221307 4937476 4681471
9139 4681471 4442197 4220957 4008147 3798825 3602439 3427492 3275435 3140825 3023515 2908063
9129 2908063 2797709 2691803 2584607 2484459 2392778 2316138 2256928 2204383 2160953 2119892 2101500
9118 2101500 2116546 2169376 2297889 2526073 2777013 2866480 2734198 2471702 2170474 1918185
9108 1918185 1734065 1598413 1494544 1414082 1350934 1294133 1234857 1186662 1149373 1117796 1087398
9097 1087398 1055010 1020098 993901 971545 951284 931902 910664 886757 860687 832384 796625
9086 796625 771516 754077 734491 715376 704323 695165 678257 659205 642010 626338 612443 588029
$$ packed form
9157B2333846k717146k311386j943929j650258j414943j214320j044964q96408
9149I140492p67167o55262n55298m75985m22758l79931l44450l18334k83831k56005
9139D681471k39274k21240k12810k09322j96386j74947j52057j34610j17310j15452
9129B908063j10354j05906j07196j00148r1681p6640n9210n2545m3430m1061j8392
9118B101500J5046N2830J28513K28184K50940Q9467j32282k62496l01228k52289
9108A918185j84120j35652j03869q0462o3148n6801n9276m8195l7289l1577l0398
9097A087398l2388l4912k6197k2356k0261j9382k1238k3907k6070k8303l5759
9086G96625k5109j7439j9586j9115j1053r158j6908j9052j7195j5672j3895k4414
$$ plain form
9074 588029 567185 551291 529317 512758 500834 487930 481468 475593 463906 451199 435105 419784
9062 419784 407173 385495 366923 350067 325327 310384 294641 280286 280643 307355 390384 509603
9050 509603 617126 670889 680671 687341 704843 711044 700246 684897 661303 635642 617366 595011
9038 595011 570126 555041 546479 540736 536789 538229 534715 535456 536045 538244 549009 563956 573507 589970
9024 589970 601508 616056 602502 562366 478362 368298 264588 185769 139428 129885 132735 136491
9012 136491 145076 150169 155967 156908 159228 165511 172455 180211 177943 173323 175177 172121 160217 153477
8998 153477 149513 154228 160667 165523 165349 160856 143528 122434 111742 98560 84525 76932 59104
8985 59104 47831 53967 81826 109129 137255 160459 166046 172626 164314 154725 143521 137564 130610
$$ packed form
9074E88029k0844j5894k1974j6559j1924j2904o462n875j1687j2707j6094j5321
9062D19784j2611k1678j8572j6856k4740j4943j5743j4355L57K6712Q3029J19219
9050E09603J07523N3763R782O670J7502O201j0798j5349k3594k5661j8276k2355
9038E95011k4885j5085q562n743l947J440l514P41N89K199J0765J4947R551J6463
9024E89970J1538J4548j3554m0136q4004j10064j03710p8819m6341r543K850L756
9012A36491Q585N093N798R41K320O283O944P756k268m620J854l056j1904o740
8998A53477l964M715O439M856j74m493j7328k1094j0692j3182j4035p593j7828
8985E9104j1273O136K7859K7303K8126K3204N587O580q312r589j1204n957o954
$$ plain form
8972 130610 125943 126071 127609 126812 130424 136575 140431 142258 145771 149314 152835 154242 147742 136334 132212
8957 132212 134237 133569 130237 128417 124849 129225 130973 124530 116813 114113 115475 116607 115719 118513 123573
8942 123573 124359 126824 132644 141196 152642 155317 158474 161131 160317 160210 160935 156140 148184 138933 130675
8927 130675 124643 120768 114014 114983 117665 114244 113926 118702 118554 118327 120939 121770 114537 112863 109771 108813
8911 108813 113138 119628 128067 135295 133870 133206 137986 136206 124225 113818 108339 99289 84471 77610
8897 77610 79231 75998 66106 71164 78698 86156 94783 93556 79149 69990 79310 83728 77433 74836
8883 74836 73356 72056 67590 71695 69577 71848 73933 72403 65051 66997 65779 50853 50864 59231 69648
8868 69648 74731 75839 76438 73057 66774 65889 66368 58646 58909 68410 73255 71561 71924 70162 64517 67374
$$ packed form
8972A30610m667J28J538p97L612O151L856J827L513L543L521J407o500j1408m122
8957A32212K025o68l332j820l568M376J748o443p717k700J362J132q88K794N060
8942A23573P86K465N820Q552J1446K675L157K657q14j07P25m795p956r251q258
8927A30675o032l875o754R69K682l421l18M776j48k27K612Q31p233j674l092r58
8911A08813M325O490Q439P228j425o64M780j780j1981j0407n479r050j4818o861
8897G7610J621l233r892N058P534P458Q627j227j4407r159R320M418o295k597
8883G4836j480j300m466M105k118K271K085j530p352J946j218j4926J1Q367J0417
8868F9648N083J108N99l381o283q85M79p722K63R501M845j694L63j762n645K857
$$ plain form
8852 67374 71457 72159 71680 63523 62999 61672 57918 55440 55017 54013 57367 52152 52245 57144 57990 58910 56985
8835 56985 61857 65692 58914 55052 63740 68904 65327 73636 70989 70173 69141 71456 73002 74414 79304
8820 79304 79177 80001 81556 83605 81383 74007 73699 73597 72575 81384 89142 88223 79459 82302 83493 82873
8804 82873 81908 82524 84289 80252 81505 81253 83937 91385 92090 96212 108705 118141 123801 128848 125008
8789 125008 129073 137275 147987 162348 180312 202458 233071 264616 302143 349946 414757 494069
8777 494069 588900 709141 848015 1007104 1178652 1346846 1506697 1622479 1678982 1676491
8767 1676491 1611031 1483507 1323779 1151625 983797 825092 683951 571610 484387 409725
8757 409725 356832 311060 273144 240359 216588 195383 174517 159764 149892 136383 125993 120304
$$ packed form
8852F7374M083P02m79q157n24j327l754k478m23j004L354n215R3M899Q46R20j925
8835E6985M872L835o778l862Q688N164l577Q309k647q16j032K315J546J412M890
8820G9304j27Q24J555K049k222p376l08j02j022Q809P758r19q764K843J191o20
8804H2873r65O16J765m037J253k52K684P448P05M122J2493R436N660N047l840
8789A25008M065Q202J0712J4361J7964K2146L0613L1545L7527M7803O4811P9312
8777D94069R4831J20241J38874J59089J71548J68194J59851J15782N6503k491
8767A676491o5460j27524j59728j72154j67828j58705j41141j12341q7223p4662
8757D09725n2893m5772l7916l2785k3771k1205k0866j4753r872j3509j0390n689
$$ plain form
8745 120304 118253 111163 107310 105625 97570 93421 86506 86028 85860 83883 81113 82760 81689 71350 67056
8730 67056 67150 64324 57078 53798 51545 45441 41436 40483 39045 38697 46659 56818 60004 56669 46959
8715 46959 45899 44595 43537 38701 39929 26377 11545 10603 8598 6041 12263 23223 30021 26028
8701 26028 26468 25938 28124 35280 40532 42000 44566 48771 42754 42245 39750 42717 48007 47582 41762 36135
8685 36135 35448 42510 48574 44242 43662 40903 36485 37534 46170 45534 38457 36335 35182 35465 38455 41827
8669 41827 42654 39765 33356 33930 35521 34769 30290 28242 33614 35812 36647 40149 39804 37165 31698 35630
8653 35630 39775 40142 29081 25988 32007 30116 25826 29237 35541 33614 32553 34650 34482 30983 29660
8638 29660 26759 26936 24141 24762 27262 24967 21439 21627 25656 27205 31502 28267 24371 16744 16824 20902
$$ packed form
8745A20304k051p090l853j685q055m149o915m78j68j977k770J647j071j0339m294
8730F7056R4k826p246l280k253o104m005r53j438l48P962J0159L186l335r710
8715D6959j060j304j058m836J228j3552j4832r42k005k557O222J0960O798l993
8701B6028M40n30K186P156N252J468K566M205o017n09k495K967N290m25n820n627
8685C6135o87P062O064m332n80k759m418J049Q636o36p077k122j153K83K990L372
8669D1827Q27k889o409N74J591p52m479k048N372K198Q35L502l45k639n467L932
8653C5630M145L67j1061l093O019j891m290L411O304j927j061K097j68l499j323
8638B9660k901J77k795O21K500k295l528J88M029J549M297l235l896p627Q0M078
$$ plain form
8622 20902 27493 33443 26134 17103 14259 22186 21876 23873 23841 24063 25058 23123 24760 19604 7530 4142
8606 4142 10064 16799 17172 20379 25044 32888 34457 27085 18902 21231 28660 22386 19043 13284 14211
8591 14211 22335 31942 33469 35965 35298 35270 35491 33576 26024 26956 20174 16401 13916 12257 13578 22123
8575 22123 20389 24949 27176 15765 14379 15792 17653 17972 19980 26237 25743 18184 15531 20342 20163
8560 20163 23238 21266 24086 24313 24958 29237 29919 21223 21492 24935 26877 24962 25375 25041 26895 28646
8544 28646 27826 22206 12021 10617 11816 13259 10933 11698 11901 15078 23364 23219 20317 17352 14513
8529 14513 18114 21529 22050 14386 6691 2536 939 2102 7735 14140 10896 8493 3940 5440 5116
8514 5116 4227 5955 8470 15435 22406 26110 24384 25490 25272 28795 28783 32564 32999 32548 31879 26848 21443
$$ packed form
8622B0902O591N950p309r031k844P927l10J997l2K22R95j935J637n156j2074l388
8606D142N922O735L73L207M665P844J569p372q183K329P429o274l343n759R27
8591A4211Q124R607J527K496o67k8K21j915p552R32o782l773k485j659J321Q545
8575B2123j734M560K227j1411j386J413J861L19K008O257m94p559k653M811j79
8560B0163L075j972K820K27O45M279O82q696K69L443J942j915M13l34J854J751
8544B8646q20n620j0185j404J199J443k326P65K03L177Q286j45k902k965k839
8529A4513L601L415N21p664p695m155j597J163N633O405l244k403m553J500l24
8514E116q89J728K515O965O971L704j726J106k18L523j2L781M35m51o69n031n405
$$ plain form
8497 21443 15767 15590 20454 19938 19856 17931 22583 20223 17039 15947 14001 15781 19609 23403 24011 15864
8481 15864 14975 15825 18228 14180 5524 2220 2539 4142 6543 9593 11683 14123 14051 9188 4710 3660
8465 3660 6185 12613 12425 10023 6917 7675 6308 7998 8399 8582 11648 15995 13995 15117 15576 6461
8449 6461 4936 16705 19875 23385 16738 13487 15946 18871 24629 26586 18741 18345 24617 27631 22034
8434 22034 25010 26821 30146 30451 27398 21641 19547 20002 20805 23291 30032 29227 19736 12877 12411 13526
8418 13526 11050 14729 12729 5786 7295 12568 14617 12379 11733 10743 13990 17779 20087 20279 22545
8403 22545 17938 17788 15422 12225 4617 378 2862 5023 9350 14749 12582 9521 8562 11546 16623
8388 16623 20232 21370 21189 20761 24432 25742 27102 27209 28407 29924 22364 20738 22943 22948 17130 14283
$$ packed form
8497B1443n676j77M864n16q2j925M652k360l184j092j946J780L828L794O08q147
8481A5864q89Q50K403m048q656l304L19J603K401L050K090K440p2m863m478j050
8465C660K525O428j88k402l106P58j367J690M01J83L066M347k000J122M59r115
8449F461j525J1769L170L510o647l251K459K925N758J957p845l96O272L014n597
8434B2034K976J811L325L05l053n757k094M55Q03K486O741q05r491o859m66J115
8418A3526k476L679k000o943J509N273K049k238o46r90L247L789K308J92K266
8403B2545m607j50k366l197p608m239K484K161M327N399k167l061r59K984N077
8388A6623L609J138j81m28L671J310J360J07J198J517p560j626K205Nn818k847
$$ plain form
8372 14283 9392 9089 14501 9775 10243 16714 25267 23291 20588 15154 13953 17429 20354 12330 9498
8357 9498 14042 16808 18214 18285 18753 21226 23065 21616 22438 18663 7599 1064 2901 6412 3913 9422
8341 9422 15571 24485 30185 29679 25110 27681 35341 35208 21940 14192 15769 21493 17331 7895 124
8326 124 -256 10250 15645 7108 6120 6177 6005 9432 6356 9996 12442 13175 5553 6383 11940 10375 15748
8309 15748 20332 19579 15469 17874 20365 24735 25915 20218 19679 12326 16812 21188 19645 15993 15691
8294 15691 15258 21368 36525 55080 67443 66411 58209 40192 25914 21302 18705 15954 6958 3603
8280 3603 3096 5902 11437 9500 9947 8167 9444 8577 10550 12211 7509 7415 6091 8786 7907 6202
8264 6202 8269 12374 9944 12531 12250 8844 8047 12488 12024 8117 7685 3653 4982 4772 3434 7115
$$ packed form
8372A4283m891l03N412m726M68O471Q553j976k703n434j201L476K925q024k832
8357I498M544K766J406P1M68K473J839j449Q22l775j1064o535J837L511k499N509
8341I422O149Q914N700n06m569K571P660j33j3268p748J577N724m162r436p771
8326A24l80J0506N395q537r88N7j72L427l076L640K446P33p622Q30N557j565N373
8309A5748M584p53m110K405K491M370J180n697n39p353M486M376j543l652l02
8294A5691m33O110J5157J8555J2363j032q202j8017j4278m612k597k751q996l355
8280C603n07K806N535j937M47j780J277q67J973J661m702r4j324K695q79j705
8264F202K067M105k430K587k81l406p97M441m64l907m32m032J329k10j338L681
$$ plain form
8248 7115 10435 21198 34670 32706 21664 9780 10846 8968 5075 2863 1250 728 2562 2412
8234 2412 -6730 -7619 -2567 -1518 1483 4452 3973 9195 11736 13736 7599 4783 -293 -1185 -4577 -6190
8218 -6190 924 -998 -2924 1687 2457 6453 6139 4902 161 -4045 -2992 -583 4854 9870 3302
8203 3302 -160 4928 11508 12362 11250 10656 12432 13812 9112 5803 9194 9668 2949 914 847 2606
8187 2606 2525 1363 -3634 -2547 3395 10453 9926 4893 -905 77 927 4919 9463 9051 4023 -3620
8171 -3620 -4477 -2073 772 7544 4590 5748 11451 7530 3956 11753 13737 13175 8890 1876 5324
8156 5324 15923 13919 10567 5484 239 1552 -368 3105 5244 4130 7860 14869 16838 14228 16799
8141 16799 13196 12247 11709 17186 15623 14633 14435 15673 15209 13999 8196 8505 8291 6559 3873 956
$$ packed form
8248G115L320J0763J3472j964j1042j1884J066j878l893k212j613n22J834j50
8234B412r142q89N052J049L001K969m79N222K541K000o137k816n076q92l392j613
8218f190P114j922j926M611P70L996l14j237m741m206J053K409N437N016o568
8203C302l462N088O580Q54j112n94J776J380m700l309L391M74o719k035o7J759
8187B606q1j162m997J087N942P058n27n033n798R82Q50L992M544m12n028p643
8171c620q57K404K845O772k954J158N703l921l574P797J984n62m285p014L448
8156E324J0599k004l352n083n245J313j920L473K139j114L730P009J969k610K571
8141A6799l603r49n38N477j563r90j98J238m64j210n803L09k14j732k686k917
$$ plain form
8125 956 2277 3965 5966 6886 2786 5002 13891 11090 6959 5138 7111 -80 -4227 202 5557
8110 5557 7638 10828 12011 13434 12598 14492 14836 15709 14631 10882 8130 8002 8059 11016 13055 12911 14186
8093 14186 19748 20197 14046 2415 4699 565 615 9512 12653 10118 11892 10836 6636 4687 3412
8078 3412 6790 6002 -118 -2643 -2973 4386 5057 3560 -3710 -1230 -993 2365 5052 2285 3357 6418
8062 6418 5317 5015 8303 5957 8468 4000 2068 -225 -1127 7621 11704 15308 18845 18278 11272 4689
8046 4689 2593 1590 5185 8620 8395 10930 5425 1134 363 1509 9196 7413 5511 5042 5608 315
8030 315 776 -2776 -1147 -662 -3398 -1819 7115 13570 17660 19577 8935 2441 2 434 4843 4161
8014 4161 2138 1807 3669 6300 7193 9171 6159 2700 4884 10183 3931 2061 6078 4518 3201
$$ packed form
8125I56J321J688K001R20m100K216Q889k801m131j821J973p191m147M429N355
8110E557K081L190J183J423q36J894L44Q73j078l749k752j28N7K957K039j44J275
8093A4186N562M49o151j1631K284m134N0Q897L141k535J774j056m200j949j275
8078C412L378p88o120k525l30P359O71j497p270K480K37L358K687k767J072L061
8062F418j101l02L288k346K511m468j932k293r02Q748M083L604L537n67p006o583
8046D689k096j003L595L435k25K535n505m291p71J146P687j783j902m69N66n293
8030C15M61l552J629M85k736J579Q934O455M090J917j0642o494k439M32M409o82
8014D161k023l31J862K631Q93J978l012l459K184N299o252j870M017j560j317
$$ plain form
7999 3201 845 -4566 -477 3934 3190 1793 10989 12299 11894 7865 4901 -97 -1371 2525 3784
7984 3784 3153 3965 7844 11099 9402 5709 6337 5247 7922 10255 4536 2123 4939 4928 5409 5195 2223
7967 2223 -995 1951 6833 12862 15419 9317 10070 12199 14644 12784 10007 9843 8630 5608 5962 13301
7951 13301 12017 12836 17480 18219 13725 15915 10482 8023 9529 8297 13044 12956 7269 3948 197 6361
7935 6361 11879 10980 7025 4128 -356 -4366 -7276 -4272 -1834 -210 3551 -1609 -2993 5200 5246 4168
7919 4168 8235 8138 8846 11343 6216 5562 6498 2714 8454 9575 13810 11793 8520 3521 4430 12816
7903 12816 9430 8687 8307 11098 8807 5729 -1702 -5751 132 4155 4632 -312 2081 8532 7156
7888 7156 4742 7756 11560 12739 6567 7420 8494 9677 9081 5403 2418 921 2222 -726 -1108 -4151
$$ packed form
7999C201k356n411M089M411p44j397R196J310m05m029k964m998j274L896J259
7984C784o31Q12L879L255j697l693O28j090K675K333n719k413K816j1M81k14k972
7967B223l218K946M882O029K557o102P53K129K445j860k777j64j213l022L54P339
7951A3301j284Q19M644P39m494K190n433k459J506j232M747q8n687l321l751O164
7935F361N518q99l955k897m484m010k910L004K438J624L761n160j384Q193M6j078
7919D168M067r7P08K497n127o54R36l784N740J121M235k017l273m999R09Q386
7903A2816l386p43l80K791k291l078p431m049N883M023M77m944K393O451j376
7888G156k414L014L804J179o172Q53J074J183n96l678k985j497J301k948l82l043
$$ plain form
7872 -4151 -8012 -5643 -1988 -7352 -5591 -471 -2034 -10599 -9825 -3331 -1535 2054 -3572 -1878 17
7857 17 2692 3802 3155 1211 5236 8558 10793 9936 9714 13756 12779 10917 13034 20959 20621 11681 -2005
7840 -2005 -8332 -6827 -9151 -3774 -2384 1910 4008 3061 4018 5293 5166 8887 16708 14875 8644 7753
7824 7753 6578 7720 10267 1996 -271 1124 -2379 -4174 -3009 -3318 3827 8928 15872 7419 -1575
7809 -1575 407 8474 8356 5259 72 2910 7891 8547 8012 6648 2941 4842 5331 -773 4612 3678
7793 3678 5466 13324 15341 10292 6088 9715 10408 6903 4478 -906 7032 4266 1155 3990 1755
7778 1755 -4339 -6820 -637 1659 -2478 1350 4381 2557 8044 5292 1961 8313 5342 251 -3620
7763 -3620 -6578 -2275 -959 -723 -1866 3003 1515 -623 -1066 -4800 -2817 -1895 2693 5810 8469 19453
$$ packed form
7872d151l861K369L655n364J761N120j563q565P74O494J796L589n626J694J895
7857A7K675J110o47j944M025L322K235q57k22M042r77j862K117P925l38q940j3686
7840b005o327J505k324N377J390M294K098r47R57J275j27L721P821j833o231q91
7824G753j175J142K547q271k267J395l503j795J165l09P145N101O944q453q994
7809a575J982Q067j18l097n187K838M981O56n35j364l707J901M89o104N385r34
7793C678J788P858K017n049m204L627O93l505k425n384P938k766l111K835k235
7778A755o094k481O183K296m137L828L031j824N487k752l331O352k971n091l871
7763c620k958M303J316K36j143M869j488k138m43l734J983R22M588L117K659J0984
$$ plain form
7747 19453 17479 10732 7952 8058 13516 11870 2927 -173 4275 1582 3105 4789 3745 2041 4034
7732 4034 4255 8173 5909 7026 8014 1952 2269 7229 8356 10409 7031 6524 9109 14623 15608 13569
7716 13569 6791 3295 353 4872 8640 10828 6693 2260 4299 4988 11910 19918 22235 17787 7991
7701 7991 7035 -2261 -3018 -568 -1992 -4161 -6051 -4652 -5373 2105 2095 5913 8267 2170 1349 3258
7685 3258 9168 5389 58 656 -357 -5470 -1815 2266 -1273 -2775 -133 3939 4683 -1782 -7225
7670 -7225 -6025 1818 5236 -1982 2796 6015 2517 12635 12539 3834 -4030 -2664 2357 8880 4220
7655 4220 -3088 3600 8032 11856 15534 13618 7057 -3848 -2821 -3614 -814 5239 7989 3519 1345
7640 1345 -7594 -12030 -2848 6230 5751 149 -4693 1691 5264 3350 1487 -4807 -5661 -741 5169
$$ packed form
7747A9453j974o747k780J06N458j646q943l100M448k693J523J684j044j704J993
7732D034K21L918k264J117R88o062L17M960J127K053l378n07K585N514R85k039
7716A3569o778l496k942M519L768K188m135m433K039O89O922Q008K317m448r796
7701G991r56r296p57K450j424k169j890J399p21P478j0L818K354o097q21J909
7685C258N910l779n331N98j013n113L655M081l539j502K642M072P44o465n443
7670g225J200P843L418p218M778L219l498J0118r6q705p864J366N021O523m660
7655D220p308O688M432L824L678j916o561j0905J027p93K800O053K750m470k174
7640A345q939m436R182R078m79n602m842O384L573j914j863o294q54M920N910
$$ plain form
7625 5169 522 -5751 -5108 -5221 -5414 -5341 706 2070 1272 2204 84 -4974 -4915 1765 -201 3902 2680
7608 2680 -25 1131 7259 10504 6152 9512 16185 16978 19562 19931 8456 8725 13935 14639 13585 7021
7592 7021 -192 -6950 -5055 -1422 6869 12579 6499 4897 11237 13872 17994 19979 18987 17725 14373
7577 14373 12030 11176 7421 12502 19083 17618 13280 12361 13866 7681 -5100 -2265 -981 -45 1095
7562 1095 -2530 -2929 -3168 26 4683 16149 16444 17313 18423 9780 3267 -5047 -7923 -3780 10017
7547 10017 11503 13809 11729 -9 -6082 -2648 1330 2460 10916 15962 15368 3119 -3201 -4992
7533 -4992 -4020 2562 6834 9070 3769 -2815 -5690 -892 2863 3272 64 848 -514 -3015 -2052 -667
7517 -667 5409 2779 664 -4931 -7101 -3554 -3395 -1867 2089 2622 3771 5630 -867 -5641 -7506 -9195
$$ packed form
7625E169m647o273O43j13j93P3O047J364p98R32k120n058N9O680j966M103j222
7608B680k705J156O128L245m352L360O673P93K584L69j1475K69N210P04j054o564
7592G021p213o758J895L633Q291N710o080j602O340K635M122J985r92j262l352
7577A4373k343q54l755N081O581j465m338r19J505o185j2781K835J284R36J140
7562A095l625l99k39L194M657J1466K95Q69J110q643o513q314k876M143J3797
7547A0017J486K306k080j1738o073L434L978J130Q456N046n94j2249o320j791
7533d992R72O582M272K236n301o584k875M798L755M09l208P84j362k501R63J385
7517f67O076k630k115n595k170L547J59J528L956N33J149J859o497m774j865j689
$$ plain form
7501 -9195 -7312 3006 1469 -4842 -5582 -2789 -71 3363 8474 4654 -4148 -2885 -3355 3974 8733
7486 8733 13020 3284 -10052 -10033 -3711 2725 5466 4363 3485 5648 9690 7298 2022 -3051 -9726
7471 -9726 -3284 -825 -2786 -1288 5522 7963 7706 7763 6507 2892 10894 13447 2756 4540 -1145
7456 -1145 -1882 3599 5251 4160 2721 7195 12573 3068 -413 -4314 -9081 -8434 -4337 3690 5170
7441 5170 1648 -2769 -1002 -3978 666 -870 -2580 -826 -1657 -2289 -3794 -5441 -2497 3222 -3227
7426 -3227 -1871 1163 10297 17652 13513 11225 6194 -4202 -7324 -1964 -4054 -4308 -10098 -10831 -9979
7411 -9979 -7961 -8314 -10494 -6588 -5077 -2440 2208 3351 2637 -1588 -409 2234 216 -3938 -1328
7396 -1328 4671 7649 8359 10251 9993 10434 12139 10364 10249 9048 6621 5394 -710 -5887 -5767 -751
$$ packed form
7501i195J883J0318j537o311p40K793K718L434N111l820q802J263m70P329M759
7486H733M287r736j3336J9O322O436K741j103q78K163M042k392n276n073o675
7471i726O442K459j961J498O810K441k57N7j256l615Q002K553j0691J784n685
7456a145p37N481J652j091j439M474N378r505l481l901m767O47M097Q027J480
7441E170l522m417J767k976M644j536j710J754q31o32j505j647K944N719o449
7426c227J356L034R134P355m139k288n031j0396l122N360k090k54n790p33Q52
7411i979K018l53k180L906J511K637M648J143p14m225J179K643k018m154K610
7396a328N999K978P10J892k58M41J705j775j15j201k427j227o104n177J20N016
$$ plain form
7380 -751 924 -2089 -4520 -2917 1288 2993 6655 5694 4746 3467 1267 4142 7372 3659 -3379 -3866
7364 -3866 -683 -3556 -2843 2099 3067 -3102 -546 -5744 -2000 1495 -5294 -4374 -6227 -4378 -3667 3584
7348 3584 5697 43 3747 5970 -2678 -4148 -4712 -3655 -10951 -10967 -10089 -8972 -2316 -2809 -708 -4962
7332 -4962 -6603 -4824 -7943 -9404 -2963 3058 -419 -4060 -3364 2178 981 1337 6042 5482 5108 287
7316 287 5083 4730 2782 6312 11239 7841 6676 4520 -7884 -6351 -3948 -5689 -647 3011 2725
7301 2725 1316 -1573 -913 -3802 -8642 -6305 -6575 -891 3637 4383 2298 -5371 -12055 -10279 -8997 -10574
7285 -10574 -10964 -5604 4470 11705 6030 -100 -1925 -2960 -7201 -8614 -15541 -17376 -12799 -13260 -9741
7270 -9741 -8140 -5534 1530 2275 -1689 -9772 -12959 -13939 -7933 -6163 -8053 -4321 323 1121 -2151 -8259
$$ packed form
7380g51J675l013k431J603M205J705L662r61r48j279k200K875L230l713p038m87
7364c866L183k873P13M942R68o169K556n198L744L495o789R20j853J849P11P251
7348C584K113n654L704K223q648j470n64J057p296j6Q78J117O656m93K101m254
7332d962j641J779l119j461O441O021l477l641O96N542j197L56M705n60l74m821
7316B87M796l53j948L530M927l398j165k156j2404J533K403j741N042L658k86
7301B725j409k889O60k889m840K337k70N684M528P46k085p669o684J776J282j577
7285a0574l90N360J0074P235n675o130j825j035m241j413o927j835M577m61L519
7270i741J601K606P064P45l964q083l187r80O006J770j890L732M644P98l272o108
$$ plain form
7254 -8259 -9921 -7707 -1447 -2487 -571 548 -4805 1067 8549 10155 10222 4171 -736 3135 2903 2800
7238 2800 -224 -14 -2190 -10296 -12433 -7432 -4053 -5211 -4539 2262 -1605 -5889 -313 8497 2964
7223 2964 -160 -2471 7611 9153 1443 103 3238 1396 6782 13244 5274 4965 4267 2696 6317
7208 6317 10449 9932 6260 2167 -617 4716 6922 619 5400 9690 6377 2799 5581 9183 8906
7193 8906 14732 15709 5518 -181 -4133 -904 2912 6361 -717 -543 -2624 3429 3475 9466 7550 6737
7177 6737 5541 5805 5359 928 -4602 -3076 -1751 -24 -535 2199 7547 7133 6748 8562 9835 3759
7161 3759 -2659 -3047 604 2616 -1764 -8582 -7347 -2890 3237 7402 938 -1105 -3748 -5157 -1810
7146 -1810 -1599 -852 910 3011 9079 4589 4422 7432 6170 2626 6633 6043 1133 364 1376 3310
$$ packed form
7254h259j662K214O260j040J916J119n353N872P482J606O7o051m907L871k32j03
7238B800l024K10k176q106k137N001L379j158O72O801l867m284N576Q810n533
7223B964l124k311J0082J542p710j340L135j842N386O462p970l09o98j571L621
7208F317M132n17l672m093k784N333K206o303M781M290l313l578K782L602k77
7193H906N826R77j0191n699l952L229L816L449p078J74k081O053M6N991j916q13
7177F737j196K64m46m431n530J526J325J727n11K734N348m14l85J814J273o076
7161C759o418l88L651K012m380o818J235M457O127M165o464k043k643j409L347
7146a810K11P47J762K101O068m490j67L010j262l544M007n90m910p69J012J934
$$ plain form
7130 3310 -1425 -996 -5964 -5136 -237 915 -2515 -891 -2153 -5777 -4699 -4160 464 2885 -847 -3473
7114 -3473 1921 7692 7759 8762 6492 6411 9970 2626 183 1566 10376 12492 -845 -5439 1648 4879
7098 4879 1051 42 -943 -1401 -577 8172 2861 1430 3211 -2180 -4847 -5336 -10726 -13091 -8478 -10403
7082 -10403 -12174 -10871 -7474 -5536 -12839 -16665 -19584 -20902 -13642 -12999 -14585 -12042 -5340 -3653 2599
7067 2599 7624 4517 216 2253 -1828 1038 -3102 -73 5430 491 451 2412 6891 7793 3271 2823
7051 2823 3883 -1718 -5557 -4731 138 2462 414 -828 -8061 -6992 -4418 954 6372 2909 2307
7036 2307 5194 3255 6090 3903 -2238 -938 -3387 -5585 -9303 -11614 -8388 -1450 5425 7351 -3020
7021 -3020 295 -3495 -4155 -3007 -364 316 1070 4483 2365 -5836 -4458 -5057 -4966 -1551 -858 -778 -2705
$$ packed form
7130C310m735M29m968Q28M899J152l430J624j262l624J078N39M624K421l732k626
7114c473N394N771O7J003k270q1L559p344k443J383Q810K116j3337m594P087L231
7098D879l828j009r85m58Q24Q749n311j431J781n391k667m89n390k365M613j925
7082a0403j771J303L397J938p303l826k919j318P260O43j586K543O702J687O252
7067B599N025l107m301K037m081K866m140L029N503m939m0J961M479R02m522m48
7051B823J060n601l839Q26M869K324k048j242p233J069K574N372N418l463o02
7036B307K887j939K835k187o141J300k449k198l718k311L226O938O875J926j0371
7021c020L315l790o60J148K643O80P54L413k118q201J378n99R1L415O93Q0j927
$$ plain form
7004 -2705 -5239 -1412 5978 7643 10185 8359 7112 12539 3812 1398 5449 2890 -1878 -11825 -15506
6989 -15506 -11274 -10307 -6714 9102 17646 13334 6760 1421 9293 5702 1127 2159 -2675 -5011 -3239
6974 -3239 297 1201 -2656 -11340 -6910 4304 3515 4230 4734 4971 -1087 -888 -415 2915 2210 5692 2447
6957 2447 2259 -2364 -7783 -8813 -7339 -1768 5259 1690 -570 -4650 -741 2199 -4159 -7880 -6125
6942 -6125 -3258 584 2938 7046 4516 2438 4920 1501 2673 5296 4150 29 -3214 -4740 271
6927 271 2203 1257 325 -1820 -3541 -1943 -6409 -3795 -2408 -479 3955 2227 -274 2360 9680 12453
6911 12453 12394 5634 1719 3006 3954 3324 1091 2375 3538 -1310 -1442 1044 5809 10428 2323 3070
6895 3070 5023 425 1596 3422 -1452 -2764 -3420 -2142 -6187 -10941 -9031 -9477 -8616 -6918 -5638 -6121
$$ packed form
7004b705k534L827P390J665K542j826j247N427q727k414M051k559m768r947l681
6989a5506M232R67L593J5816Q544m312o574n339P872l591m575J032m834k336J772
6974c239L536R04l857q684M430J1214p89P15N04K37o058J99M73L330p05L482l245
6957B447j88m623n419j030J474N571P027l569k260m080L909K940o358l721J755
6942f125K867L842K354M108k530k078K482l419J172K623j146m121l243j526N011
6927B71J932r46r32k145j721J598m466K614J387J929M434j728k501K634P320K773
6911A2453n9o760l915J287R48o30k233J284J163m848j32K486M765M619q105P47
6895C070J953m598J171J826m874j312o56J278m045m754J910m46Q61J698J280m83
$$ plain form
6879 -6121 -3180 -6028 -6751 -2107 -3078 -4562 -834 -2343 808 6391 -325 -8660 -4928 -6651 -6687 -5002
6863 -5002 -6216 -3919 -624 3910 1812 -648 -4287 -12507 -11309 529 4269 3280 -2516 -4658 -8760
6848 -8760 -2888 -604 -2836 -3388 1028 3484 4806 1643 1404 7772 8162 4910 1266 4248 8213 8139
6832 8139 3356 -2749 -5582 -4190 -500 -2646 1356 359 -2206 4650 17953 11618 3732 -1807 -5854
6817 -5854 3892 8252 -1245 -3852 -2584 -2154 4730 8029 5742 1691 1477 1335 8206 7441 13277 17358
6801 17358 17303 11561 4243 -1172 5523 17524 18308 17987 14449 12126 8744 9917 7046 -597 -4603
6786 -4603 1437 2816 -1597 -6499 -6177 -3602 -2627 -25 2486 -3079 -4985 -2342 1393 270 237 216
6770 216 7787 10137 14644 16460 8845 3160 3129 3091 284 -2808 -10093 -9075 -9492 -11437 -6912 -2806
$$ packed form
6879f121K941k848p23M644r71j484L728j509L151N583o716q335L732j723l6J685
6863e002j214K297L295M534k098k460l639q220J198J1838L740r89n796k142m102
6848h760N872K284k232n52M416K456J322l163k39O368L90l252l644K982L965p4
6832H139m783o105k833J392L690k146M002r97k565O856J3303o335p886n539m047
6817e854R746M360r497k607J268M30O884L299k287m051k14j42O871p65N836M081
6801A7358n5n742p318n415O695J2001P84l21l538k323l382J173k871p643m006
6786d603O040J379m413m902L22K575R75K602K511n565j906K643L735j123l3k1
6770B16P571K350M507J816p615n685l1l8k807l092p285J018m17j945M525M106
$$ plain form
6754 -2806 -1012 2165 -1091 -2495 -5519 -3623 476 -2461 -3223 -7422 -8615 -4830 -7848 -13288 -14088
6739 -14088 -8839 -6693 -6463 -3050 -3330 -4227 -1986 926 -668 -3119 454 6003 5085 2926 -215 -1485
6723 -1485 -3160 -2853 511 -6941 -12295 -8240 -1683 930 2172 -649 -3219 -4959 -4764 -5743 -8142 -9643
6707 -9643 -9579 -836 3437 2603 4290 2712 2844 606 -2140 -4851 -8220 -6710 -6829 -1039 4039 4433
6691 4433 3389 4743 6617 2643 1585 2060 793 4442 16822 16629 10170 3719 -28 4506 2253
6676 2253 -2200 -11668 -16687 -12385 -11083 -8403 -9545 -7703 -1768 867 513 -800 -3772 -577 3815
6661 3815 10943 11175 14503 12389 7892 6545 657 -5004 -10490 -12353 -6356 8100 8866 9053 5885
6646 5885 4778 5552 8370 10353 9629 7829 12216 16174 10473 7350 3935 938 246 1487 5345 13062
$$ packed form
6754b806J794L177l256j404l024J896M099k937p62m199j193L785l018n440q00
6739a4088N249K146K30L413k80q97K241K912j594k451L573N549r18k159l141j270
6723a485j675L07L364p452n354M055O557K613J242k821k570j740J95r79k399j501
6707i643O4Q743M273q34J687j578J32k238k746k711l369J510j19N790N078L94
6691D433j044J354J874l974j058M75j267L649J2380j93o459o451l747M534k253
6676B253m453r468n019M302J302K680j142J842N935K635l54j313k972L195M392
6661C815P128K32L328k114m497j347n888n661n486j863N997J4456P66J87l168
6646E885j107P74K818J983p24j800M387L958n701l123l415k997o92J241L858P717
$$ plain form
6630 13062 15080 8371 2257 4683 7551 5333 -600 -1637 -8207 -8812 -7578 -10232 -8849 -3427 1067
6615 1067 1812 2749 3798 3996 4167 -1360 -3132 -7036 -5085 -759 -194 -2301 -2777 7918 4961 5522
6599 5522 5497 1067 3351 5128 4491 5455 8972 12657 16304 12569 7356 14408 14060 4521 6180 6434
6583 6434 859 -415 5975 8247 7607 10875 16117 21471 18477 9243 -1868 -4619 998 5056 -3455
6568 -3455 -8634 -3518 -810 1126 -5437 -2958 -106 2433 4857 9920 5858 3512 6340 11929 4938
6553 4938 -1438 3003 2831 5876 12411 8804 4624 6958 9635 10858 10558 6649 4534 549 -6413
6538 -6413 -11401 -4687 9075 14656 13515 8370 5035 -5126 -8333 -4980 2809 4724 2273 -2792
6524 -2792 -7435 -7503 -9141 -8224 -4992 -840 1929 -380 1499 4192 5981 9197 6819 2327 4390 862
$$ packed form
6630A3062K018o709o114K426K868k218n933j037o570o05J234k654J383N422M494
6615A067P45R37J049J98J71n527j772l904J951M326N65k107m76J0695k957N61
6599E522k5m430K284J777o37R64L517L685L647l735n213P052l48r539J659K54
6583F434n575j274O390K272o40L268N242N354k994r234j1111k751N617M058q511
6568c455n179N116K708J936o563K479K852K539K424N063m062k346K828N589o991
6553D938o376M441j72L045O535l607m180K334K677J223l00l909k115l985o962
6538f413m988O714J3762N581j141n145l335j0161l207L353P789J915k451n065
6524b792m643o8j638R17L232M152K769k309J879K693J789L216k378m492K063l528
$$ plain form
6508 862 6056 10615 4900 3238 946 -3243 -3277 -116 -4762 -7907 -6939 -4389 -4096 -6146 -4756 555
6492 555 -1838 -7577 -6246 -6203 -8679 -11264 -10982 -8027 -9839 -11176 -10231 -10029 -7774 -3666 -1300 -322 1057
6475 1057 -529 -5833 -11055 -9519 -13795 -17277 -14609 -12770 -5434 -4005 -7531 -709 3756 10115 7308
6460 7308 8847 10936 -1129 -7952 -603 3154 5326 6168 5240 2120 -5344 -4455 -835 -6728 -11947
6445 -11947 -5843 -7924 -12402 -6731 -8633 -3416 -5149 -10201 -2604 5496 1953 4114 9628 9857 2122
6430 2122 2102 143 -2063 -1292 -6259 -10573 -8098 -6080 -6918 -6135 1479 9143 2327 -60 8561 8184
6414 8184 1019 -3799 -3583 -5959 -8746 -6967 -920 -9316 -10732 -7264 -6377 -3308 -6417 -13207 -15741
6399 -15741 -11828 -1468 4308 2988 423 3417 9585 7242 -1933 -6627 1087 1598 -5459 -8052 -8200
$$ packed form
6508H62N194M559n715j662k292m189l4L161m646l145R68K550K93k050J390N311
6492E55k393n739J331M3k476k585K82K955j812j337R45K02K255M108K366R78J379
6475A057j586n304n222J536m276l482K668J839P336J429l526O822M465O359k807
6460G308J539K089j2065o823P349L757K172Q42r28l120p464Q89L620n893n219
6445a1947O104k081m478N671j902N217j733n052P597Q100l543K161N514K29p735
6430B122k0j959k206P71m967m314K475K018q38P83P614P664o816k387Q621l77
6414H184p165m818K16k376k787J779O047q396j416L468Q87L069l109o790k534
6399a5741L913J0360N776j320k565K994O168k343r175m694P714N11p057k593j48
$$ plain form
6384 -8200 -10181 -11954 -9262 -3974 -1018 4695 3593 -2757 -7897 -15032 -5824 5141 6176 1054 3779
6369 3779 1588 1882 5567 1645 -6488 -8185 -674 3207 4044 699 2378 2419 -2614 -4858 -6246 -2292
6353 -2292 -4202 -8646 -10457 -3896 380 7382 14812 16233 13606 7146 -4567 -6989 -6735 -102 1846
6338 1846 4102 3998 -72 5339 3272 -1462 2245 7710 7843 4613 12347 12377 -4735 -4105 4239 6263
6322 6263 1637 -3212 -8485 -7112 -9138 -11587 -4239 -3437 -6795 -2000 -1525 488 5445 -877 -5555
6307 -5555 -6268 -6322 -7682 -11505 -9883 -3253 4119 7675 7972 861 -7453 -10044 -7009 -8565 -7163 -691
6291 -691 8908 9900 6275 6391 12003 10190 2363 -14196 -14169 -7843 -2276 -7338 -9166 -8571 -5511 -1331
6275 -1331 6710 -3878 -6596 -1548 -1806 3816 6747 5422 802 -2244 550 -4704 -6649 -5895 -230
$$ packed form
6384h200j981j773K692N288K956N713j102o350n140p135R208J0965J035n122K725
6369C779k191K94L685l922q133j697P511L881Q37l345J679M1n033k244j388L954
6353b292j910m444j811O561M276P002P430J421k627o460j1713k422K54O633J948
6338A846K256j04m070N411k067m734L707N465J33l230P734L0j7112O30Q344K024
6322F263m626m849n273J373k026k449P348Q02l358M795M75K013M957o322m678
6307e555p13n4j360l823J622O630P372L556K97p111q314k591L035j556J402O472
6291f91R599R92l625J16N612j813p827j6559K7O326N567n062j828N95L060M180
6275a331Q041j0588k718N048k58N622K931j325m620l046K794n254j945P54N665
$$ plain form
6260 -230 8482 10710 11517 1943 -7467 -7326 -6112 -1953 -3499 -11432 -13060 -4502 -5021 -5678 -10808 -9232
6244 -9232 -4638 -6509 -7652 -6395 -7866 -4099 -4892 -10109 -11068 -10356 -7641 -4029 -6335 -3716 -1752 1675
6228 1675 2279 -3280 -5649 -4356 -6731 -6917 -5556 -2386 5661 9772 1311 -6083 -9234 -13589 -11618
6213 -11618 -10965 -11633 -16198 -16728 -13928 -16995 -13470 -10376 -4417 -2331 -7144 -4205 -3850 -6174 -813 4070
6197 4070 4420 -2636 -4675 4125 9461 2959 1468 4618 -774 -5141 -9263 -9891 -11017 -7883 -8693 -1444
6181 -1444 3876 3497 -1068 -3683 -5957 -2603 -5340 -8971 -12596 -13976 -16499 -13504 -7918 -9902 -10701
6166 -10701 -296 9275 7399 -409 -3875 6320 6397 2492 3521 116 2561 5575 8644 4676 2326
6151 2326 -834 -4651 -4680 -1450 -2386 1368 4093 573 1703 7122 4097 3128 768 3044 10886 4014
$$ packed form
6260b30Q712K228Q07r574r410J41J214M159j546p933j628Q558n19o57n130J576
6244i232M594j871j143J257j471L767p93n217r59P12K715L612k306K619J964L427
6228A675O04n559k369J293k375j86J361L170Q047M111q461p394l151m355J971
6213a1618O53o68m565n30K800l067L525L094N959K086m813K939L55k324N361M883
6197D070L50p056k039Q800N336o502j491L150n392m367m122o28j126L134q10P249
6181a444N320l79m565k615k274L354k737l631l625j380k523K995N586j984p99
6166a0701J0405R571j876p808l466J0195P7l905J029l405K445L014L069l968k350
6151B326l160l817k9L230r36L754K725l520J130N419l025r69k360K276P842o872
$$ plain form
6135 4014 -6687 -10043 -8781 -6960 -3437 -1978 -1884 -7088 -2737 12330 16219 9478 7384 9873 9948
6120 9948 6831 -6019 -8909 -2424 1617 3166 8459 1348 -4648 -4608 -933 2118 437 2379 3946
6105 3946 765 -4424 -8851 -8657 -10682 -8960 -12199 -12077 -8112 -6680 -2575 4928 6100 1395 1740 -228
6089 -228 3896 7389 6908 3270 4370 2102 -1263 2683 4747 603 -905 2258 2733 64 -774 -1259
6073 -1259 -5216 -1822 4993 11866 14449 12268 9201 2424 1256 2406 821 121 -1871 -4165 -4632
6058 -4632 -2733 -1823 -5337 -3659 1364 2115 -586 -1119 228 -506 -1315 -2357 -2505 -6067 -5016 -2362
6042 -2362 -7116 -9008 -9875 -5428 -4762 -5034 -3239 1597 5373 371 -6117 -6072 -4611 -5549 -6981 -5534
6026 -5534 -968 1886 1651 875 1265 -705 -1242 2769 6386 5713 6955 4020 543 -38 240 131 -2980
$$ packed form
6135D014j0701l356J262J821L523J459R4n204M351J5067L889o741k094K489P5
6120I948l117j2850k890O485M041J549N293p111n996M0L675L051j681J942J567
6105C946l181n189m427J94k025J722l239J22L965J432M105P503J172m705L45j968
6089b28M124L493m81l638J100k268l365L946K064m144j508L163M75k669q38m85
6073a259l957L394O815O873K583k181l067o777j168J150j585p00j992k294m67
6058d632J899R10l514J678N023P51k701n33J347p34q09j042j48l562J051K654
6042b362m754j892q67M447O66k72J795M836L776n002o488M5J461r38j432J447
6026e534M566K854k35p76L90j970n37M011L617o73J242k935l477n81K78j09l111
$$ plain form
6009 -2980 -8765 -10350 -7629 -1535 -5101 -4627 394 3826 205 3134 6278 6296 5987 546 2654 5646
5993 5646 6123 4972 332 3735 4743 1590 652 1391 3752 1148 -102 9359 7422 -1786 -1627 1014
5977 1014 5607 6864 -1033 -5526 -5333 -4280 -10688 -12102 -10588 -4753 -3732 5779 8450 8460 8709 3582
5961 3582 -1987 -5803 -1264 4757 8823 6838 6751 3410 -2480 -5829 -4735 -6549 -7387 -4215 -1368 -425
5945 -425 -854 -256 -3517 -2776 -6342 -13256 -12706 -9765 -5344 -8468 -10759 -5500 1223 -1082 -3558 679
5929 679 2140 3624 7290 7716 5506 4998 2822 3338 7212 350 -6867 -4102 -1470 -2268 329 1149
5913 1149 4357 4009 -6573 -12472 -6128 -2863 -6091 -5051 -6918 -7083 -1893 -1861 -10233 -14655 -12378 -10511
5897 -10511 -10742 -5714 -625 6606 4868 -1307 -2461 -4225 1856 7615 9745 3667 -287 -4187 -5656
$$ packed form
6009b980n785j585K721O094l566M74N021L432l621K929L144J8l09n441K108K992
5993E646M77j151m640L403J008l153r38P39K361k604j250R461j937r208J59K641
5977A014M593J257p897m493J93J053o408j414J514N835J021R511K671J0K49n127
5961C582n569l816M539O021M066j985q7l341n890l349J094j814q38L172K847R43
5945d25m29N98l261P41l566o914N50K941M421l124k291N259O723k305k476M237
5929F79J461J484L666M26k210n08k176N16L874o862p217K765K632p98K597Q20
5913A149L208l48j0582n899O344L265l228J040j867j65N190L2q372m422K277J867
5897a0511k31N028N089P231j738o175j154j764O081N759K130o078l954l900j469
$$ plain form
5882 -5656 153 4088 -888 -8986 -10763 -9667 -3566 3039 6840 10570 6264 3425 1861 -1127 -7354
5867 -7354 -6562 -4061 -1165 -1642 -3268 -9394 -12097 -16735 -10731 -5018 -4848 -6645 696 3598 -1536 -7823
5851 -7823 -4543 -3447 -2819 -3177 -5901 -3854 -4793 -8196 -8890 -6861 -5234 -2228 -1577 -5805 -7106 -3260
5835 -3260 3938 2806 -4693 -4042 -3355 -10627 -17294 -9585 -2297 -882 2747 231 -480 -2382 6081 5341
5819 5341 5233 -49 -5480 -6979 -9530 -9402 -7119 -4932 -3324 -7113 -5008 -6853 -6176 -4256 -1654 619
5803 619 2844 3495 7248 10557 4736 1384 1698 8567 9030 10017 11854 10535 3405 3091 1369 -1312
5787 -1312 -1352 1747 8727 11147 11825 11699 6865 8312 10326 10019 3964 1699 5219 5948 6920 3408 -1220
5770 -1220 328 -810 -8047 -7731 -1188 3513 7665 10242 8788 6873 6049 4573 5344 3396 -418 773
$$ packed form
5882e656N809L935m976q098j777J096O101O605L801L730m306k839j564k988o227
5867g354P92K501K896m77j626o126k703m638O004N713J70j797P341K902n134o287
5851g823L280J096O28l58k724K047r39l403o94K029J627L006O51m228j301L846
5835c260P198j132p499O51O87p272o667P709P288J415L629k516p11j902Q463p40
5819E341j08n282n431j499k551J28K283K187J608l789K105j845O77J920K602K273
5803F19K225O51L753L309n821l352L14O869M63R87J837j319p130l14j722k681
5787a312m0L099O980K420O78j26m834J447K014l07o055k265L520P29R72l512m628
5770a220J548j138p237L16O543M701M152K577j454j915q24j476P71j948l814J191
$$ plain form
5754 773 -354 -8330 -5373 5479 -231 -2429 394 103 -2461 -7037 -6582 -10296 -10497 -10460 -12456 -15535
5738 -15535 -13752 -12131 -8461 -5364 -2219 -2152 -4943 -12636 -15768 -19003 -13996 -7961 -4436 -7183 -6462
5723 -6462 -2976 -3131 -3950 -11302 -18951 -12285 -6930 -1066 3037 2186 690 -927 -3669 -7852 -3856 762
5707 762 9075 8210 5764 -4569 -5548 -831 5824 4771 -1898 -7715 -11202 -13005 -8524 -1196 -2861
5692 -2861 -1034 -676 -331 2371 4716 3327 6426 4022 -3838 -6421 -10911 -6074 -1380 -5167 -1713
5677 -1713 7040 5137 -1243 1737 8671 12016 7772 723 -2391 -7081 -2756 -5742 -7111 -9134 -7180
5662 -7180 -4382 -7467 -9649 -7586 -5700 -7837 -5382 -4333 -5261 -10093 -10002 -4966 -7462 -6814 -4921 -5448
5646 -5448 -7130 -9674 -6672 -4789 -5978 -3343 -1778 2783 8580 2459 -2723 -6120 -3562 -638 -1829
$$ packed form
5754G73j127p976K957J0852n710k198K823k91k564m576M55l714k01L7j996l079
5738a5535J783J621L670L097L145O7k791p693l132l235N007O035L525k747P21
5723f462L486j55q19p352p649O666N355N864M103q51j496j617k742m183L996M618
5707G62Q313q65k446j0333r79M717O655j053o669n817l487j803M481P328j665
5692b861J827L58L45K702K345j389L099k404p860k583m490M837M694l787L454
5677a713Q753j903o380K980O934L345m244p049l114m690M325k986j369k023J954
5662g180K798l085k182K063J886k137K455J049r28m832R1N036k496O48J893n27
5646e448j682k544L002J883j189K635J565M561N797o121n182l397K558K924j191
$$ plain form
5631 -1829 1602 3639 1005 -3766 -7727 -10552 -7924 1258 1465 3410 5868 2774 2691 2594 31 -423
5615 -423 2570 1688 -3381 -8495 -17008 -18268 -10242 -7510 -3993 -1642 -3048 -1456 2965 8641 4579
5600 4579 2611 -274 78 -870 -7171 -11393 -13342 -8033 -8537 -5742 -3744 -954 727 -1730 -4129 -3213
5584 -3213 -5175 -5806 -776 2497 -3594 -4405 -1318 2270 -798 -5102 -3439 -1180 2030 -3193 -6639
5569 -6639 -9765 -6865 -8774 -8195 -6323 -6815 -3586 1439 1761 1481 3993 1857 -2208 -1843 -4665 -3840
5553 -3840 -2205 -3239 -4891 -5085 -3664 -2462 -820 -1870 3423 4394 3853 3450 7506 7500 9202 7850 4966
5536 4966 5697 1013 801 2955 4062 834 408 -5721 -10217 -6322 -6973 -5621 -424 -3787 -8343 -9983
5520 -9983 -9467 -7150 -11958 -10550 -6473 -1773 -1626 -2094 -2042 -3133 -11530 -10995 -8423 -11352 -9197 -6907
$$ packed form
5631a829L431K037k634m771l961k825K628R182K07J945K458l094q3r7k563m54
5615d23K993q82n069n114q513j260Q026K732L517K351j406J592M421N676m062
5600D579j968k885L52r48o301m222j949N309n04K795J998K790J681k457k399R16
5584c213j962o31N030L273o091q11L087L588l068m304J663K259L210n223l446
5569f639l126K900j909N79J872m92L229N025L22k80K512k136m065L65k822Q25
5553c840J635j034j652j94J421J202J642j050N293R71n41m03M056oJ702j352k884
5536D966P31m684k12K154J107l228m26o129m496L895o51J352N197l363m556j640
5520i983N16K317m808J408M077M700J47m68N2j091q397N35K572k929K155K290
$$ plain form
5504 -6907 -8209 -5905 -3283 -3248 -1469 -3954 -9110 -13232 -12976 -9228 -6772 -466 1961 -7763 -8166 -2826
5488 -2826 -1658 16 3221 1956 6275 11120 7706 6365 14908 10675 -5917 -14321 -13457 -5685 -3437
5473 -3437 -6229 -2851 2278 1056 -352 -2904 -3196 -5629 -4268 -5703 -3812 -3337 -2246 3035 8558
5458 8558 4855 828 -1883 -4434 -5523 -1361 373 1781 -5720 -5665 2105 5144 -1009 -237 -1038 -3566
5442 -3566 -7049 -7193 -8117 -8616 712 4267 1015 -809 1615 989 -1241 1648 5050 4782 -1300 -4282
5426 -4282 -4553 -2485 -4588 -6626 -3138 -2239 425 -5451 -12244 -6840 -3862 22 -928 -5776 -8682 -10356
5410 -10356 -3958 -60 5361 5118 2037 -2320 -352 3092 9491 3662 -7980 -10540 -8279 -5259 -3096
5395 -3096 -2826 -1184 -1189 -1656 -576 -943 -7735 -5388 3779 3949 -1671 -9227 -9942 -301 3444 -233 713
$$ packed form
5504f907j302K304K622L5J779k485n156m122K56L748K456O306K427r724m03N340
5488b826J168J674L205j265M319M845l414j341Q543m233j6592q404Q64P772K248
5473c437k792L378N129j222j408k552k92k433J361j435J891M75J091N281N523
5458H558l703m027k711k551j089M162J734J408p501N5P770L039o153P72q01k528
5442c566l483j44r24m99R328L555l252j824K424o26k230K889L402k68o082k982
5426d282k71K068k103k038L488Q99K664n876o793N404K978L884r50m848k906j674
5410a0356O398L898N421k43l081m357J968L444O399n829j1642k560K261L020K163
5395c096K70J642nm67J080l67o792K347R167J70n620p556p15R641L745l677R46
$$ plain form
5378 713 2709 4355 -2615 -6679 -9062 -5653 -3234 3623 4869 5311 6823 10067 8081 3300 394
5363 394 5834 4106 2747 5083 2514 -2274 -1133 -1988 -4678 1243 1364 -1434 -2093 5918 8233 4579
5347 4579 3835 -5557 -11852 -5190 -4622 -11438 -14123 -15520 -19789 -9537 -5030 -11278 -11244 -9058 -7378 -8640
5331 -8640 -6957 -4097 1117 4036 -338 -678 1204 -281 751 -10610 -10412 -3642 -2463 938 -2492
5316 -2492 -2090 -4577 1769 9559 4902 513 7780 4539 8117 5875 473 -6022 -8225 -8719 -11501
5301 -11501 -17069 -16100 -10134 -4585 -3975 -811 -127 -2544 -5763 -3437 4810 4432 -400 -7024 -15149 -14008
5285 -14008 -8984 -4436 -1423 -4499 -6339 -4235 877 -1644 1210 -9647 -11908 -6592 -5006 -7063
5271 -7063 -1242 -3208 -9413 -8697 -3573 -1266 531 3785 -1543 -1680 -3357 -6311 -5792 1106 954 -2529
$$ packed form
5378G13J996J646o970m064k383L409K419O857J246M42J512L244j986m781k906
5363C94N440j728j359K336k569m788J141q55k690N921J21k798o59Q011K315l654
5347D579p44r392o295O662N68o816k685j397m269J0252M507o248L4K186J680j262
5331h640J683K860N214K919m374l40J882j485J032j1361J98O770J179L401l430
5316b492M02k487O346P790m657m389P267l241L578k242n402o495k203m94k782
5301a1501n568R69N966N549O10L164O84k417l219K326Q247l78m832o624q125J141
5285a4008N024M548L013l076j840K104N112k521K854j0857k261N316J586k057
5271g063N821j966o205P16N124K307J797L254n328j37j677k954N19O898j52l483
$$ plain form
5255 -2529 -4796 -415 -1202 -8186 -8170 -4026 -5654 -6762 -6733 -3492 -2258 -4913 -2397 2072 6483 -312
5239 -312 -5000 -7292 -8731 -10096 -11809 -10848 -8104 -7612 -7642 -10033 -11158 -10217 -2008 -4631 -2004 -1560 -9112
5222 -9112 -15118 -17600 -13013 -9901 -5780 7070 9056 -1089 -6166 -4111 -3448 -1767 -3014 -11708 -10947
5207 -10947 -8586 -7431 -632 6116 4646 583 -5359 375 1040 327 5777 2342 -6882 -10255 -432
5192 -432 1404 -1687 -3862 -3080 -2866 -12325 -18323 -12120 -1638 3660 49 -3685 -4808 -3687 360
5177 360 2116 -414 -3400 -8593 -6528 -6913 -7733 -2496 5578 7394 6293 -1193 -10238 -8037 -3899 -5356
5161 -5356 -7135 -2405 -3927 -3844 897 6336 2335 -4468 -1864 -1865 3632 4588 2632 -1349 -4723 -1681
5145 -1681 225 498 -1353 -4825 -3750 -3332 -7353 -8358 -8899 -12315 -9750 -3577 3148 1325 -3781 -4908
$$ packed form
5255b529k267M381p87o984J6M144j628j108K9L241J234k655K516M469M411o795
5239c12m688k292j439j365j713R61K744M92l0k391j125R41Q209k623K627M44p552
5222i112o006k482M587L112M121J2850J986j0145n077K055O63J681j247q694P61
5207a0947K361J155O799O748j470m063n942N734O65p13N450l435r224l373R823
5192d32J836l091k175P82K14r459n998O203J0482N298l611l734j123J121M047
5177C60J756k530k986n193K065l85q20N237Q074J816j101p486r045K201M138j457
5161e356j779M730j522Q3M741N439m001o803K604jN497R56j956l981l374L042
5145a681J906K73j851l472J075M18m021j005n41l416K565O173O725j823n106j127
$$ plain form
5129 -4908 -2364 -3822 -3246 -4535 -6938 -13560 -11681 -4942 -875 5796 8613 2452 4233 5088 11381
5114 11381 6601 1679 215 -1897 -4853 -11268 -15071 -10984 -1215 5983 6168 -1016 -2571 -8427 -4974
5099 -4974 -3554 -2925 -1832 -1055 -5800 -17120 -16788 -7895 -1586 807 -5579 -13705 -14000 -11411 -6733 -4351
5083 -4351 -1960 -1481 -505 -5156 -14561 -17766 -17026 -11600 -5612 642 392 -801 -4907 -8618 -10120 -6609
5067 -6609 -5571 -3662 151 2326 -2067 -8199 -7840 -4825 -1199 -1689 -3179 -4752 -2744 -2161 -381 2111
5051 2111 -353 557 1986 2950 2832 1195 5416 9032 6770 1050 -2350 -5123 -9360 -6753 -4050 1284
5035 1284 2704 4237 6992 5683 2475 4850 6694 -1600 763 300 -2469 -3215 -3996 1454 1554 217
5019 217 -1876 -5004 -8507 -6094 1647 -711 -7341 -4679 -1313 -5004 -6104 -5950 -8582 -15232 -10671
$$ packed form
5129d908K544j458N76j289k403o622J879O739M067O671K817o161J781Q55O293
5114A1381m780m922j464k112k956o415l803M087R769P198J85p184j555n856L453
5099d974J420O29J093P77m745j1320L32Q893O309K393o386q126k95K589M678K382
5083d351K391M79R76m651r405l205P40N426N988O254k50j193m106l711j502L511
5067f609J038J909L813K175m393o132L59L015L626m90j490j573K008N83J780K492
5051B111k464R10J429R64j18j637M221L616k262n720l400k773m237K607K703N334
5035A284J420J533K755j309l208K375J844q294K363m63k769p46p81N450J00j337
5019B17k093l128l503K413P741k358o630K662L366l691j100J54k632o650M561
$$ plain form
5004 -10671 -10711 -12826 -13839 -13208 -4941 -4795 -6121 -3537 -8113 -16849 -4145 -3156 -6806 -6222 -7088 -2459
4988 -2459 3972 3563 4194 1953 -3818 -5089 -5007 -11905 -12731 -8201 -1794 2157 -767 -1733 -545 1651
4972 1651 2753 -121 -2452 -6207 -9207 -9259 -6564 -9340 -2990 2201 2589 2405 -609 -6020 -6376 -4219
4956 -4219 -549 -2321 -8705 -9930 -8255 -13233 -8592 -2946 -8113 -16842 -20853 -12067 -3056 -2990 -3834 -5153
4940 -5153 -7945 -8413 -4821 3974 5344 -3854 -6752 -5923 -3900 -7703 -9036 -12638 -16943 -15513 -13486
4925 -13486 -11656 -8946 -2440 461 -3836 -5724 -5001 2448 5155 -202 -1183 -7432 -7843 1062 2653
4910 2653 355 2603 3608 10300 10390 1687 -6468 -11809 -4712 -2528 -1168 -4415 1115 2835 -3576
4895 -3576 -7783 -9646 -9450 -5222 -1598 -2731 -4292 -9289 -11528 -11798 -7035 -430 3253 -508 908
$$ packed form
5004a0671m0k115j013O31Q267J46j326K584m576q736J2704R89l650N84q66M629
4988b459O431m09O31k241n771j271Q2o898q26M530O407L951k924r66J188K196
4972A651J102k874k331l755l000n2K695k776O350N191L88j84l014n411l56K157
4956d219L670j772o384j225J675m978M641N646n167q729m011Q786R011O6q44j319
4940e153k792m68L592Q795J370r198k898Q29K023l803j333l602m305J430K027
4925a3486J830K710O506K901m297j888P23P449K707n357r81o249m11Q905J591
4910B653k298K248J005O692R0q703q155n341P097K184J360l247N530J720o411
4895c576m207j863J96M228L624j133j561m997k239k70M763O605L683l761J416
$$ plain form
4880 908 -63 -1566 -3292 1233 4895 6803 6958 5983 3841 1780 1794 2499 6986 5479 896 -3082 851
4863 851 -982 -445 -502 -2340 277 -1618 2726 7421 6724 1522 6847 2313 2012 -2434 -3079 -2472 2417
4846 2417 504 -11511 -15596 -11261 -9142 -5008 422 2498 384 -2275 1061 -566 -2187 781 790
4831 790 -6570 -9392 -6531 -8685 -14492 -12446 -3900 -1461 -3255 -6920 -794 2296 1983 2497 4210 4767
4815 4767 507 -8994 -15196 -19688 -13507 -11254 -10201 -10791 -9150 -3951 -3430 27 6549 15577 7857
4800 7857 -943 -7674 -8940 -6396 -3966 -14050 -19049 -15344 -15369 -9537 -3638 1254 4974 5134 381
4785 381 -4253 -3791 -4229 -1968 1961 -4131 -9094 -7673 -4353 258 3189 6710 3637 7069 8302 6141
4769 6141 8658 9283 5867 4470 -983 4062 4964 -4356 -7020 -2529 -6777 -7553 -6948 -6435 -4519 -10791
$$ packed form
4880I08r71j503j726M525L662J908J55r75k142k061J4P05M487j507m583l978L933
4863H51j833N37n7j838K617j895M344M695o97n202N325m534l01m446o45O07M889
4846B417j913j2015m085M335K119M134N430K076k114k659L336j627j621K968R
4831G90p360k822K861k154n807K046Q546K439j794l665O126L090l13N14J713N57
4815D767m260r501o202m492O181K253J053n90J641N199N21L457O522R028p720
4800G857q800o731j266K544K430j0084m999L705k5N832N899M892L720J60m753
4785C81m634M62m38K261L929o092m963J421L320M611K931L521l073L432J233k161
4769F141K517O25l416j397n453N045R02r320k664M491m248p76O05N13J916o272
$$ plain form
4753 -10791 -13366 -15420 -20321 -20368 -15774 -10691 -4118 -11319 -15354 -12635 -9969 -12151 -14685 -10154 -4911
4738 -4911 -9825 -14976 -13528 -12837 -4733 -6732 -10008 -6847 -5268 -7829 -5296 -98 5450 4980 2528
4723 2528 1041 -8930 -9649 -12584 -8017 -1955 -6017 -13084 -15584 -13989 -11635 -17179 -15685 -16802 -11204
4708 -11204 -3329 985 6933 5366 -1963 -2552 3726 -1927 -1781 -3844 -293 -8676 -12225 -12696 -10883
4693 -10883 -10155 -6969 -590 2320 -716 4210 -69 -5539 -5906 -5634 -5788 -7293 -5653 -4585 -9527 -13925
4677 -13925 -17191 -18421 -21225 -21110 -15899 -7850 -3484 -6756 -9149 -14530 -17250 -17559 -18614 -15560 -9483
4662 -9483 -7019 -8065 -6627 -5130 -424 4209 2130 2276 -1823 -3175 -5856 -6209 -11795 -10997 -5233 -3583
4646 -3583 -5040 -9302 -10043 -7688 -7315 -6046 -1241 -4414 -13712 -13496 -7225 -5619 -2346 -5145 -2191 -4728
$$ packed form
4753a0791k575k054m901m7M594N083O573p201m035K719K666k182k534M531N243
4738d911m914n151J448O91Q104j999l276L161J579k561K533N198N548m70k452
4723B528j487r971p19k935M567O062m062p067k500J595K354n544J494j117N598
4708a1204P875M314N948j567p329n89O278n653J46k063L551q383l549m71J813
4693a0883P28L186O379K910l036M926m279n470l67K72j54j505J640J068m942m398
4677a3925l266j230k804J15N211Q049M366l272k393n381k720l09j055L054O077
4662i483K464j046J438J497M706M633k079J46m099j352k681l53n586P98N764J650
4646c583j457m262p41K355L73J269M805l173r298K16O271J606L273k799K954k537
$$ plain form
4630 -4728 -8183 -12937 -17435 -8155 1932 -2960 -9199 -11495 -6947 -2566 840 2842 803 -1578 -2352
4615 -2352 -969 -1394 -3911 -8468 -7171 -5837 -4062 -1645 -4382 -2663 -4415 -4069 -11306 -15398 -16741
4600 -16741 -16712 -13017 -9925 -6823 -4325 -5904 -8422 -13239 -13808 -15787 -10150 -8375 -6543 595 4579
4585 4579 3808 2551 3752 5002 -121 -6237 -2208 2523 190 -5240 -15366 -18483 -7869 -1041 1851
4570 1851 350 2293 -2597 -9442 -14861 -15372 -13924 -7813 -5600 -4428 94 -2835 -11393 -12878 -1168
4555 -1168 -1224 -8170 -13067 -13573 -5816 1728 2025 5402 5063 1549 -2585 -2126 714 -1900 -4592 -4573 -2764
4538 -2764 -4415 -2864 2364 -764 -3816 -5549 -5402 -5677 -7234 -6669 -3110 820 5655 -1890 804 4581
4522 4581 6168 5488 3884 5302 6610 5003 2182 1522 5336 7087 4321 1737 1111 3413 5641 6294
$$ packed form
4630d728l455m754m498R280J0087m892o239k296M548M381L406K002k039k381p74
4615b352J383m25k517m557J297J334J775K417k737J719j752L46p237m092j343
4600a6741K9L695L092L102K498j579k518m817n69j979N637J775J832P138L984
4585D579p71j257J201J250n123o116M029M731k333n430j0126l117J0614O828K892
4570A851j501J943m890o845n419n11J448O111K213J172M522k929q558j485J1710
4555a168n6o946m897n06P757P544K97L377l39l514m134M59K840k614k692J9J809
4538b764j651J551N228l128l052j733J47k75j557N65L559L930M835p545K694L777
4522D581J587o80j604J418J308j607k821o60L814J751k766k584o26K302K228O53
$$ plain form
4506 6294 9299 12946 7544 -2340 -2318 -1535 602 6586 8710 6615 1747 -1300 -2577 -1039 -414 -3886
4490 -3886 -4397 481 81 568 2418 2383 -339 4097 8295 6311 5521 -5326 -15210 -13634 -11062 -4020
4474 -4020 -1958 627 -5295 -3602 5081 -135 -5715 -9178 -10527 -13288 -10549 -3082 56 1095 5633
4459 5633 7456 9254 6980 4863 5222 818 2488 7956 14370 9053 3869 235 -1714 -6614 -7577
4444 -7577 -6428 -4119 -4557 -3492 -2421 -4073 -2171 2315 3084 3898 8788 8408 10126 -476 -6552 -3823
4428 -3823 1772 4493 -489 -663 -350 1806 -4465 -7941 -5895 596 -1386 -8957 -11308 -12881 -7924
4413 -7924 -4137 2466 1338 -1186 5684 3263 -5489 -11829 -13570 -5778 -7729 -8549 -2476 -5924 -9996
4398 -9996 -13454 -5807 26 3968 1998 4349 3506 7725 7550 2384 1354 -3549 -8468 -6137 -7011 -1287
$$ packed form
4506F294L005L647n402r884K2P83K137N984K124k095m868l047j277J538O25l472
4490c886n11M878m00M87J850l5k722M436M198j984p90j0847r884J576K572P042
4474d020K062K585n922J693Q683n216n580l463j349k761K739P467L138J039M538
4459E633J823J798k274k117L59m404J670N468O414n317n184l634j949m900r63
4444g577J149K309m38J065J071j652J902M486P69Q14M890l80J718j0602o076K729
4428c823N595K721m982j74L13K156o271l476K046O491j982p571k351j573M957
4413g924L787O603j128k524O870k421q752o340j741P792j951q20O073l448m072
4398i996l458P647N833L942j970K351q43M219j75n166j030m903m919K331q74N724
$$ plain form
4382 -1287 1473 1730 -8995 -14227 -10468 -15189 -20360 -13045 -7155 -6142 508 1178 1394 581 92 6808
4366 6808 7074 529 -4107 -3800 -155 -2894 -8605 -6421 -1669 176 -909 3189 3984 3752 -1701 -10740
4350 -10740 -10665 -5595 -1459 -1013 -5642 -3528 1588 7331 10729 8313 3573 1433 2566 12646 12802
4335 12802 -3860 -13413 -6460 766 37 -1287 -1198 -2809 3627 3199 -2340 -8301 -13422 -12294 -7122
4320 -7122 -7275 -5500 -6499 -7740 -4114 -5257 -6217 -3477 4382 2847 4456 9317 7803 6478 2998 -5764
4304 -5764 -11059 -3979 4406 856 -8737 -8338 -461 6614 4804 -1141 -3994 -2504 -505 1217 -2746
4289 -2746 -10817 -13722 -6375 -3991 -7249 -4213 -507 7913 1327 -8009 -6483 -10247 -6839 -3892 -75
4274 -75 2129 -1418 -447 -923 -1193 1574 -1019 3413 7698 8856 1958 -636 1402 2120 1582 1143 308
$$ packed form
4382a287K760K57j0725n232L759m721n171P315N890J013O650O70K16q13m89O716
4366F808K66o545m636L07L645k739n711K184M752J845j085M098P95k32n453r039
4350a0740P5N070M136M46m629K114N116N743L398k416m740k140J133J0080J56
4335A2802j6662r553O953P226p29j324Q9j611O436m28n539n961n121J128N172
4320g122j53J775r99j241L626j143r60K740P859j535J609M861j514j325l480q762
4304e764n295P080Q385l550r593L99P877P075j810n945k853J490J999J722l963
4289b746q071k905P347K384l258L036L706Q420o586r336J526l764L408K947L817
4274g5K204l547R71m76k70K767k593M432M285J158o898k594K038P18n38m39q35
$$ plain form
4257 308 472 -2270 -3570 5470 3064 1224 1222 3224 3702 3548 1163 2636 4376 -725 1126 5629 1978
4240 1978 5143 7355 6980 10675 11367 4130 1580 3084 1690 2159 2313 3934 1851 -5117 -2406 -3997
4224 -3997 -9316 -7851 2199 4864 2741 -818 -2930 -2821 -1779 -404 -4759 -1178 864 -66 4180
4209 4180 2954 3213 1803 -4686 -7511 -6348 -8644 -7084 -11602 -9595 -5003 -3718 2536 5106 1437
4194 1437 -7178 -9218 -10382 -8837 -4343 1955 3493 15252 12224 1498 -9252 -17302 -13970 -11390
4180 -11390 -14119 -15965 -15456 -11090 -8910 -1439 -493 -5690 3032 6678 2105 3851 3704 -2065 -7069
4165 -7069 -2620 877 -2818 -1152 3304 436 -1254 -4247 -8397 1570 11584 11280 1611 691 3500
4150 3500 1747 1482 -3484 -11952 -5978 -4992 -4486 -486 -4673 -8602 -7683 -2655 -201 2915 3866 2924
$$ packed form
4257C08J64k742j300R040k406j840kK002M78j54k385J473J740n101J851M503l651
4240A978L165K212l75L695O92p237k550J504j394M69J54J621k083o968K711j591
4224c997n319J465J0050K665k123l559k112J09J042J375m355L581K042r30M246
4209D180j226K59j410o489k825J163k296J560m518K007M592J285O254K570l669
4194A437q615k040j164J545M494O298J538J1759l028j0726j0750q050L332K580
4180a1390k729j846N09M366K180P471R46n197Q722L646m573J746j47n769n004
4165g069M449L497l695J666M456k868j690k993m150R967J0014l04r669r20K809
4150C500j753k65m966q468N974R86N06M000m187l929R19N028K454L116R51r42
$$ plain form
4134 2924 2924 1157 3871 11895 9742 2017 4418 1968 -4961 -7274 -9525 -13719 -12490 -6768 2071 236
4118 236 -1615 -7039 -5932 1973 6173 2700 -3163 -3244 -8736 -7429 -6846 -13578 -13345 -11509 -4705 -3780
4102 -3780 -2797 -7279 -4815 7927 10766 14637 11899 6980 9369 9458 5097 5345 12927 9422 3797 11219
4086 11219 14459 4268 -4911 -5441 -6522 -6952 -4006 -2225 -4753 -4949 -9261 -8816 -8168 -5337 -8414 -10037
4070 -10037 -4288 -3599 -8111 -6974 -4490 -6342 -9328 -9208 -5806 2285 3423 6165 5948 -2890 -94
4055 -94 -1999 -7808 -369 3481 4065 -5538 -8336 -9896 -5936 -9481 -10846 -4505 1377 4343 6562 4835
4039 4835 -2358 -6801 -8267 -9021 -7224 -1988 7263 2317 -4880 -8212 -6274 -4761 -7721 -11249 -10808
4024 -10808 -9558 -7085 -5583 -6795 -6507 -10800 -7105 894 7938 8329 1604 3294 5618 1824 49
$$ packed form
4134B924%j767K714Q024k153p725K401k450o929k313k251m194J229N722Q839j835
4118B36j851n424J107P905M200l473n863q1n492J307N83o732K33J836O804R25
4102c780R83m482K464J2742K839L871k738m919K389Q9m361K48P582l505n625P422
4086A1219L240j0191r179n30j081m30K946J781k528j96m312M45O48K831l077j623
4070a0037N749O89m512J137K484j852k986J20L402Q091J138K742k17q838K796
4055i4j905n809P439L850N84r603k798j560L960l545j365O341N882K966K219j727
4039D835p193m443j466p54J797N236R251m946p197l332J938J513k960l528M41
4024a0808J250K473J502j212K88m293L695P999P044L91o725J690K324l794j775
$$ plain form
4009 49 4057 -610 -482 -1677 -1511 -7321 -7825 -1715 -499 503 3684 3425 2933 7876 5276 1458 2673
3992 2673 -2734 -1711 -2553 -5789 -9129 -8565 -4517 -8975 -15314 -13830 -12651 -10645 -772 5622 1199
3977 1199 -8655 -2248 1216 -1339 -2697 -2104 -8264 -4775 -2935 -8028 -7149 1079 1847 -5231 -5837 -3086
3961 -3086 -5667 -11754 -10091 -10014 -7859 -7859 -10765 -7202 -7180 -2855 -4450 -8679 -8843 -8867 -6586 -9348 -1858
3944 -1858 6980 3075 2266 -796 3091 2344 5174 4678 2160 2800 -4987 -11465 -11590 -10359 -10626 -9391
3928 -9391 -5054 -1792 3528 7447 7424 7451 -1745 -3393 -1215 -946 549 802 1615 -5059 -5736 -8196 -50
3911 -50 3905 3748 -2062 -4967 -5305 -1581 1508 427 186 -1873 -7222 -10658 -11515 -5741 -6303 -6494 -10201
3894 -10201 -10267 -12509 -8118 -2190 -356 2557 -4159 -5073 -803 3516 1253 -4567 2662 -1547 -2902
$$ packed form
4009D9M008m667J28j195J66n810n04O110J216J002L181k59m92M943k600l818J215
3992B673n407J023q42l236l340N64M048m458o339J484J179K006R873O394m423
3977A199r854O407L464k555j358N93o160L489J840n093Q79Q228P68p078o06K751
3961c086k581o087J663P7K155%k906L563K2M325j595m229j64k4K281k762P490
3944a858Q838l905q09l062L887p47K830m96k518O40p787o478j25J231k67J235
3928i391M337L262N320L919k3K7r196j648K178K69J495K53Q13o674o77k460Q146
3911e0L955j57n810k905l38L724L089j081k41k059n349l436q57N774n62j91l707
3894a0201o6k242M391N928J834K913o716r14M270M319k263n820P229m209j355
$$ plain form
3879 -2902 -120 -6533 -9312 757 8054 2377 2670 1666 904 -5722 -10817 -8819 -6417 205 10799
3864 10799 7990 -2355 -8456 -7756 -5297 -5557 1055 8340 13754 13858 2617 -2142 -3541 -8609 -11726
3849 -11726 -3700 561 3865 3848 2835 988 2582 832 3806 7459 2256 -820 4372 2394 -6586
3834 -6586 -9438 -6583 -3326 2844 763 -2005 -145 -761 -2401 -2576 -7456 -11939 -6366 -2877 -4805
3819 -4805 -8151 -6434 1555 6134 6355 3486 -2229 -2621 -7012 -7673 -5132 -1214 3423 1397 -1678 -1642
3803 -1642 -9887 -11606 -11067 -6518 -5228 -4688 -7672 -4784 -6630 -13077 -10523 -7605 -8200 -7187 4366
3788 4366 2674 -5350 -5958 -4050 -144 4238 596 -1734 -6259 -5857 -2902 3687 9151 8448 11857 4732
3772 4732 11098 13967 6952 -2553 2140 1318 -5829 -2572 2050 3253 730 -204 404 -1360 255 4166
$$ packed form
3879b902K782o413k779J0069P297n677K93j004p62o626n095J998K402O622J0594
3864A0799k809j0345o101P00K459k60O612P285N414J04j1241m759j399n068l117
3849a1726Q026M261L304j7j013j847J594j750K974L653n203l076N192j978q980
3834f586k852K855L257O170k081k768J860o16j640j75m880m483N573L489j928
3819d805l346J717P989M579K21k869n715l92m391o61K541L918M637k026l075L6
3803a642q245j719N39M549J290N40k984K888j846o447K554K918n95J013J1553
3788D366j692q024o08J908L906M382l642k330m525M02K955O589N464p03L409p125
3772D732O366K869p015r505M693q22p147L257M622J203k523r34O08j764J615L911
$$ plain form
3756 4166 4699 671 -9054 -10247 -9114 -9048 -7850 -4140 -4007 230 5224 434 498 -1607 -2110 232 1839
3739 1839 -110 6035 3428 -871 3737 268 -994 -6198 -6270 -53 4815 2400 -3269 -200 6818
3724 6818 4493 6603 8019 5721 6014 5314 2698 -370 -571 8026 13571 3573 1202 2094 -1849 -2500
3708 -2500 3022 8746 5542 -2137 -5451 -6485 -6523 -5658 -5796 -6587 -7358 -2644 -4117 3342 12008 6986
3692 6986 1864 -4796 -3582 -4655 -9039 -1103 7503 9997 1438 -1694 -658 -1564 -5872 -7718 -3942
3677 -3942 -2178 -9358 -9983 -10723 -15393 -10856 -10576 -11981 -9237 -11829 -11185 -5018 -2943 4637 3051 1783
3661 1783 771 -493 -952 5226 6369 651 1025 4113 3679 3553 -1995 -2825 -8017 -5273 -1867 -7865
3645 -7865 -5863 -2731 -803 -2053 -5829 -14295 -17605 -10534 -7314 -9244 -5767 -3797 5092 9603 9274
$$ packed form
3756D166N33m028r725j193J133O6J198L710J33M237M994m790O4k105n03K342J607
3739A839j949O145k607m299M608l469j262n204p2O217M868k415n669L069P018
3724F818k325K110J416k298K93p00k616l068k01Q597N545r998k371Q92l943o51
3708b500N522N724l204p679l314j034l8Q65j38p91p71M714j473P459Q666n022
3692F986n122o660J214j073m384P936Q606K494q559l132J036r06m308j846L776
3677c942J764p180o25p40m670M537K80j405K744k592O44O167K075P580j586j268
3661A783j012j264m59O178J143n718L74L088m34j26n548q30n192K744L406n998
3645g865K002L132J928j250l776q466l310P071L220j930L477J970Q889M511l29
$$ plain form
3630 9274 6492 1014 -1342 -9461 -13781 -10889 -10078 -10964 -9882 -7988 -1356 -997 -1204 -10106 -6293 182
3614 182 2088 -714 763 1914 -2540 -7265 -8431 -8093 -8614 -14226 -16697 -12951 -8355 -884 -339 -4009
3598 -4009 -9588 -14899 -11370 -14124 -17720 -8508 4177 -3111 -18876 -12795 -1832 1953 -329 -1160
3584 -1160 934 -357 -4811 -3626 -487 -1155 3089 -228 73 1375 -4198 -3510 1158 -4848 -5767 3659
3568 3659 6293 4272 -3805 -9568 -11873 -7973 -5840 -6378 -2420 -3193 -6587 -4763 788 6357 10834
3553 10834 12755 11954 12265 13566 9801 5045 -4534 -2609 3226 5518 1477 -3600 -3631 646 4531 5346
3537 5346 224 -3035 -1121 -1328 798 4716 7946 12399 8774 97 -5456 -1901 2548 -5641 -1194
3522 -1194 -276 -6016 -11935 -11086 -7347 -6964 -7929 -3340 -1952 359 -1267 1258 4113 8423 1970 -1169
$$ packed form
3630I274k782n478k356q119m320K892Q11q86J082J894O632L59k07q902L813O475
3614A82J906k802J477J151m454m725j166L38n21n612k471L746M596P471N45l670
3598d009n579n311L529k754l596R212J2685p288j5765O081J0963L785k282q31
3584a160K094j291m454J185L139o68M244l317L01J302n573O88M668o006r19R426
3568C659K634k021q077n763k305L900K133n38L958p73l394J824N551N569M477
3553A0834J921q01L11J301l765m756r579J925N835K292m041n077l1M277L885Q15
3537E346n122l259J914k07K126L918L230M453l625q677n553L555M449q189M447
3522a194R18n740n919Q49L739L83r65M589J388K311j626K525K855M310o453l139
$$ plain form
3506 -1169 -2812 -1291 1465 6412 11685 -537 -10146 -6503 -1022 576 868 -2663 -1019 -5170 -2367
3491 -2367 831 -753 -5292 -4805 -1459 -746 -4883 -8177 -9105 -6094 -8873 -11521 -14025 -17221 -7667 -804
3475 -804 -598 5571 3842 -176 -3486 -2678 2748 2543 2972 -5003 -7209 -9231 -2825 -2811 -2489 427 2419
3458 2419 4861 1799 -1915 -3569 -9213 -7912 -5529 -6193 -6785 -11545 -12199 -6791 -1844 3568 1508 -2030
3442 -2030 -1665 -1467 -700 -525 -8890 -10027 -10585 -7763 -3889 -6843 -7038 -9419 -9941 -5699 -14574 -16602 -9626
3425 -9626 -3724 -2242 6677 4211 1376 5987 2350 -1794 -7588 -11109 -5556 -3305 938 3733 4201
3410 4201 -1781 -6216 -4794 -5408 -1225 -4742 -721 1348 -2437 -6562 -6821 -7389 -11877 -9094 -11318 -4721
3394 -4721 124 1941 692 555 1132 588 4118 -4714 -6827 -5433 -5099 1421 2682 -2147 -10275 -13877
$$ packed form
3506a169j643J521K756M947N273j2222r609L643N481J598K92l531J644m151K803
3491b367L198j584m539M87L346P13m137l294r28L011k779k648k504l196R554O863
3475h04K06O169j729m018l310Q08N426k05M29p975k206k022O406J4L22K916J992
3458B419K442l062l714j654n644J301K383o64n92m760o54N408M947N412k060l538
3442b030L65J98P67J75q365j137n58K822L874k954j95k381n22M242q875k028O976
3425i626N902J482Q919k466k835M611l637m144n794l521N553K251M243K795M68
3410D201n982m435J422o14M183l517M021K069l785m125k59n68m488K783k224O597
3394d721M845J817j249j37N77n44L530q832k113J394L34O520J261m829q128l602
$$ plain form
3378 -13877 -13301 -10232 -6481 450 -2096 -912 1144 241 -5832 -4686 -3457 -4147 -4155 -3604 532 2398
3362 2398 1247 -1850 -3362 -4900 -5963 -7005 -6650 -9542 -8078 -3109 -2112 -2762 -7394 -14466 -11656 -9617
3346 -9617 -2931 -222 -7770 -9311 -9992 -8913 -9102 -5309 -3805 -6705 -6004 -3635 -2621 -6132 -11331 -9184
3330 -9184 -11306 -13605 -12747 -6499 -4968 -551 -2206 -5719 -6609 -3455 526 -7721 -9773 -4476 -5365 -5241
3314 -5241 -3391 -5954 -993 4069 4015 -1980 -7667 -9067 -11129 -10212 -5526 -4348 -7801 -10493 -4334 3928
3298 3928 3595 -1035 -9446 -16237 -15349 -10711 -6423 1691 -295 -8828 -9437 -4747 -3626 -527 4966 -1290
3282 -1290 -1737 -1155 5103 11493 12035 6258 7582 9240 6484 192 -2697 -803 -569 -2071 -5139 -4548
3266 -4548 -6824 -8122 -6394 -1844 910 -7759 -8285 -3461 -3499 -5170 -2405 -1438 3006 13368 12961 4219
$$ packed form
3378a3877N76L069L751O931k546J184K056r03o073J146J229o90qN51M136J866
3362B398j151l097j512j538j063j042L55k892J464M969R97o50m632p072K810K039
3346i617O686K709p548j541o81J079j89L793J504k900P01K369J014l511n199K147
3330i184k122k299Q58O248J531M417j655l513q90L154L981q247k052N297q89J24
3314e241J850k563M961N062n4n995n687j400k062R17M686J178l453k692O159Q262
3298C928l33m630q411o791Q88M638M288Q114j986q533o09M690J121L099N493o256
3282a290m47N82O258O390N42n777J324J658k756o292k889J894K34j502l068N91
3266d548k276j298J728M550K754q669n26M824l8j671K765R67M444J0362m07q742
$$ plain form
3250 4219 3297 4481 -571 -3440 -11673 -4549 834 -2590 -1029 4261 4477 5260 8568 9965 4274 2547
3234 2547 3392 6885 427 -1053 -3583 -4908 995 5447 5089 5017 687 -7224 -18697 -21089 -15846 -10875
3218 -10875 -9830 -12123 -6137 1791 3490 6720 1354 -213 3761 6591 5286 1694 3032 2190 3403
3203 3403 5121 1637 -5032 -3236 -498 -2208 -2339 -7687 -3970 770 2910 4692 903 -5642 -5408
3188 -5408 -5277 -6016 -4213 -7810 937 4610 -3929 -8332 -10221 -13406 -15290 -10734 -3946 -2267 -829
3173 -829 1187 -1517 -5807 -11425 -13559 -13924 -10126 -14003 -11058 -5392 -6398 -9680 -7567 -4998 -4138 -7231
3157 -7231 -8937 541 6327 3348 -6416 -4226 -1311 3316 5614 3313 -2725 3491 7508 1768 -2796
3142 -2796 1953 3349 -1961 -4446 -276 7044 8382 7853 5494 3532 -38 -8511 -10721 -8097 -6167
$$ packed form
3250D219r22J184n052k869q233P124N383l424J561N290K16P83L308J397n691j727
3234B547Q45L493o458j480k530j325N903M452l58p2m330p911j1473k392N243M971
3218a0875J045k293N986P928J699L230n366j567L974K830j305l592J338q42J213
3203C403J718l484o669J796K738j710j31n348L717M740K140J782l789o545K34
3188e408J31p39J803l597Q747L673q539m403j889l185j884M556O788J679J438
3173h29K016k704m290n618k134l65L798l877K945N666j006l282K113K569Q60l093
3157g231j706R478N786k979r764K190K915M627K298k301o038O216M017n740m564
3142b796M749J396n310k485M170P320J338n29k359j962l570q473k210K624J930
$$ plain form
3127 -6167 -5171 2604 3868 9014 7885 5071 -869 -6904 -10443 -7512 -4129 7166 7079 4970 5375 6792
3111 6792 5955 3064 -794 268 2537 1655 1405 -5182 -787 1909 1806 -7122 -5955 2864 7654 3124
3095 3124 4959 4172 2626 -6639 -5032 -487 -1814 -1150 -629 -4315 -1622 2249 2673 376 1625 -2266
3079 -2266 -4999 -4165 -381 11763 7632 -373 -7543 -9097 -1945 5450 7408 3187 -155 -7232 -4115
3064 -4115 -4052 -2840 146 2763 8546 7873 5278 -3555 -9049 -4800 -6151 -2352 -3910 -8893 -7624 -1991
3048 -1991 639 -1811 -7938 -10096 -1514 -781 -5970 -10081 -7934 -7463 -11843 -10462 -6739 -3712 -1701
3033 -1701 1662 6244 11566 5271 1537 -3482 -4007 -2679 -1038 928 1044 1581 3117 5822 5652 -2107
3017 -2107 -4795 -6012 2555 5310 4786 2534 -346 -5472 -8879 -2369 736 3475 11749 11959 2979
$$ packed form
3127f167R96P775J264N146j129k814n940o035l539K931L383J1295q7k109M05J417
3111F792q37k891l858J062K269q82k50o587M395K696j03q928J167Q819M790m530
3095C124J835p87j546r265J607M545j327O64N21l686K693L871M24k297J249l891
3079b266k733Q34L784J2144m131q005p170j554P152P395J958m221l342p077L117
3064d115O3J212K986K617N783o73k595q833n494M249j351L799j558m983J269N633
3048a991K630k450o127k158Q582P33n189m111K147M71m380J381L723L027K011
3033a701L363M582N322o295l734n019n25J328J641J966J16N37J536K705j70p759
3017b107k688j217Q567K755n24k252k880n126l407O510L105K739Q274K10q980
$$ plain form
3002 2979 -433 -2576 -3779 -8965 -14560 -7865 2330 5712 2483 3474 3505 792 -3043 2056 12193
2987 12193 13636 12902 9219 4501 -1741 -1426 -1471 -3670 -1241 1810 3485 -1684 -4729 1740 6022 4627
2971 4627 -1617 -1819 -1236 -1772 -4695 -4557 -7614 -9358 -914 3809 4883 -3306 -2987 6523 4511 -3818
2955 -3818 -7078 -10260 -9947 -9475 -8609 -11397 -7204 -3696 -3127 2916 4244 -94 -7314 -8622 -7463 -8896
2939 -8896 -13873 -9410 -5194 4909 4205 1766 2406 3358 7217 5261 1612 2131 3143 2334 6505 1469
2923 1469 -5899 -8798 -5212 -1829 -1624 4199 9571 5803 -1008 -1926 4431 3845 -1150 1452 6314 6711
2907 6711 -251 2945 8056 8752 11129 11695 9043 10206 8732 4950 4011 3634 6773 5539 1880 237
2891 237 2274 6491 -275 -5317 -5243 -5089 221 1651 -2187 -6252 -6429 -5755 -2849 -960 -2874 -6342
$$ packed form
3002B979l412k143j203n186n595O695J0195L382l229R91L1k713l835N099J0137
2987A2193J443p34l683m718o242L15m5k199K429L051J675n169l045O469M282j395
2971D627o244k02N83n36k923J38l057j744Q444M723J074q189L19R510k012q329
2955c818l260l182L13M72Q66k788M193L508N69O043J328m338p220j308J159j433
2939h896m977M463M216J0103p04k439O40R52L859j956l649N19J012q09M171n036
2923A469p368k899L586L383K05N823N372l768o811r18O357n86m995K602M862L97
2907F711o962L196N111O96K377N66k652J163j474l782r39l77L139j234l659j643
2891B37K037M217o766n042P4J54N310J430l838m065j77O74K906J889j914l468
$$ plain form
2875 -6342 -5813 -1773 628 1948 2534 2787 5462 4835 10391 11797 9904 -572 720 8876 6500 6294
2859 6294 4717 -2685 -432 694 -4277 2170 553 -4752 -3369 3518 8723 7102 6315 6231 6781 503
2843 503 -481 3665 3603 -5082 -5608 295 5232 7331 3508 7437 2632 2066 3255 1791 -2429 620
2827 620 -6830 -14351 -8323 5759 7584 4149 5692 -222 -3400 876 5464 4670 2639 4211 2847
2812 2847 -768 979 -3279 -1795 5684 -891 -9320 -7351 -7314 -4281 -3140 -2162 -1666 4054 -925 -2708
2796 -2708 -229 6209 7269 509 -5990 -14408 -14223 -11475 -7872 -1876 6374 14141 11902 8998 5901
2781 5901 2040 -837 -1337 1163 1354 -2452 -9499 -9178 -11435 -1751 1364 -2811 -3614 -2992 -824 -2485
2765 -2485 3199 8465 6735 2787 -2433 -3048 -6949 -10692 -9439 -9014 -161 6495 3467 -552 -4636
$$ packed form
2875f342N29M040K401J320N86K53K675o27N556J406j893j0476J292Q156k376k06
2859F294j577p402K253J126m971O447j617n305J383O887N205j621p87q4N50o278
2843E03r84M146o2q685n26N903M937K099l823L929m805n66J189j464m220L049
2827F20p450p521O028J4082J825l435J543n914l178M276M588p94k031J572j364
2812B847l615J747m258J484P479o575q429J969L7L033J141R78M96N720m979j783
2796b708K479O438J060o760o499q418J85K748L603N996Q250P767k239k904l097
2781E901l861k877n00K500J91l806p047L21k257R684L115m175q03O22K168j661
2765b485N684N266j730l948n220o15l901l743J253M25Q853O656l028m019m084
$$ plain form
2750 -4636 -1323 6202 2899 -4013 -10130 -7286 -6790 -7984 -6897 -1683 -1629 1699 3266 335 -1473 -1554
2734 -1554 -6158 -13562 -3980 2347 -23 -4489 -1301 -2292 -6400 -8561 -6374 -8524 -6156 -8126 -1034
2719 -1034 4609 7879 10869 4714 197 -4743 -4334 -7199 -8035 -8385 -5895 663 5644 6130 4054 863
2703 863 6356 -1730 -5282 -1027 -2247 -540 705 -563 -2138 -6586 -3210 -2174 -8820 -8951 -5873
2688 -5873 2556 4752 4889 9782 7919 3601 2608 796 -457 796 4994 10631 3381 -1222 -3020
2673 -3020 -2165 -3744 -2936 3698 5226 -684 -8578 -6777 4715 5349 5816 710 -3327 -207 -1920 -2622
2657 -2622 2380 6609 6986 5701 -897 1196 -3749 -5026 -7796 -7474 -8802 -5763 491 5691 3436
2642 3436 915 -2449 -2565 -3753 -4532 -11959 -12803 -6167 -1292 4022 8719 1195 -8662 -8572 -3554 3635
$$ packed form
2750d636L313P525l303o912o117K844M96j194J087N214N4L328J567k931j808q1
2734a554m604p404R582O327k370m466L188r91m108k161K187k150K368j970P092
2719a034N643L270K990o155m517m940M09k865q36l50K490O558M981M86k076l191
2703H63N493q086l552M255j220J707J245j268j575m448L376J036o646j31L078
2688e873Q429K196J37M893j863m318r93j812j253J253M198N637p250m603j798
2673c020Q55j579Q08O634J528n910p894J801J1492O34M67n106m037L120j713p02
2657b622N002M229L77j285o598K093m945j277k770L22j328L039O254N200k255
2642C436k521l364j16j188p79p427q44O636M875N314M697p524r857R0N018P189
$$ plain form
2626 3635 2463 3218 5353 7276 12845 7216 2822 1043 3415 2912 5404 838 -1414 -1936 -10531 -10266
2610 -10266 -5187 -1674 -3806 63 8587 8483 4866 1136 -895 -6095 -7691 -525 856 -11441 -13802
2595 -13802 -7348 -3153 5506 6327 4796 161 429 6974 7922 778 -7655 -7450 -709 2524 -1459 -4786
2579 -4786 -3594 -7859 -7444 -2908 -638 2231 3204 3876 1954 -2101 -781 360 -1224 -4834 -7417 -5161
2563 -5161 -4766 -3086 4021 6216 3997 4910 1246 -5858 -9872 -4087 1041 2697 5049 2157 5097
2548 5097 3480 88 -868 4666 4175 2717 -488 -5762 -6152 -7539 -7135 3981 7367 9617 10196 5535
2532 5535 5868 2225 -4596 -6301 -8908 -2821 5464 5051 9378 13659 14908 10130 5102 4842 5540 -1190
2516 -1190 -659 3866 9879 5395 4903 7199 9579 12867 12931 7274 3617 464 -4582 -2965 2361 -1609
$$ packed form
2626C635j172P55K135J923N569n629m394j779K372n03K492m566k252n22q595K65
2610a0266N079L513k132L869Q524j04l617l730k031n200j596P166J381j2297k361
2595a3802O454M195Q659Q21j531m635K68O545R48p144q433K05O741L233l983l327
2579d786J192m265M15M536K270K869R73O72j922m055J320J141j584l610k583K256
2563e161L95J680P107K195k219R13l664p104m014N785N128J656K352k892K940
2548E097j617l392r56N534m91j458l205n274l90j387M04J1116L386K250N79m661
2532E535L33l643o821j705k607O087Q285m13M327M281J249m778n028k60O98o730
2516a190N31M525O013m484m92K296K380L288O4n657l657l153n046J617N326l970
$$ plain form
2500 -1609 3755 -327 152 9005 7152 2219 8085 192 -14870 -23324 -16536 -4203 3289 3274 -6709
2485 -6709 -9180 -1139 9278 9109 8549 3946 -870 -3715 -6137 -6628 -3032 2187 3437 5923 8792
2470 8792 6181 -4211 -6284 -7311 -7532 -7695 -12808 -8906 -4974 -6442 -9191 -8686 -9775 -9702 -5289 -3427
2454 -3427 2167 -1662 -6121 -5619 790 6458 -1305 -5494 -3897 -5185 1283 -3879 -7134 -6568 -2896
2439 -2896 2147 9264 11325 12310 14043 7644 6297 7176 10437 7425 1103 -982 -1998 364 3225
2424 3225 5340 2990 -534 -3302 -1677 -3670 -3156 -4324 -3301 -3100 -2537 -1438 -3174 -5979 4892
2409 4892 9310 9951 5691 6736 3976 4931 -3019 -6552 -3120 -5168 -2562 174 -1318 1789 1704 2614
2393 2614 9264 672 -8801 -8232 -13017 -18047 -23218 -16195 -11490 -9980 -11008 -8267 -2680 -3424 -6156
$$ packed form
2500a609N364m082M79Q853j853m933N866p893j5062q454O788J2333P492j5r983
2485f709k471Q041J0417j69n60m603m816k845k422m91L596N219J250K486K869
2470H792k611j0392k073j027k21j63n113L902L932j468k749N05j089P3M413J862
2454c427N594l829m459N02O409N668p763m189J597j288O468n162l255N66L672
2439b896N043P117K061R85J733o399j347Q79L261l012o322k085j016K362K861
2424C225K115k350l524k768J625j993N14j168J023K01N63J099j736k805J0871
2409D892M418O41m260J045k760R55p950l533L432k048K606K736j492L107q5R10
2393B614O650q592r473N69m785n030n171P023M705J510j028K741N587p44k732
$$ plain form
2378 -6156 -6464 1327 50 -2115 -2096 3137 4061 1910 -4163 -460 3799 5875 8191 7701 -483 -7892
2362 -7892 -9243 -9916 -6849 -1881 -958 1231 5536 -1597 -7653 -1068 -1070 -1878 -5958 -7745 -6135 506
2346 506 6886 4100 -3550 -7603 -6367 421 -648 -4827 -3619 -1584 -2553 -6184 -10269 -5035 -3902
2331 -3902 -7746 -8034 -5562 3334 6534 5867 3714 -2834 -1804 1712 5618 4439 -3315 -8200 -6304
2316 -6304 781 1746 -3381 -2035 6726 8057 1668 4015 1988 -750 939 2815 -876 933 6061
2301 6061 428 6635 9300 6047 2978 224 -977 3163 8034 7419 1954 -31 -5691 -2932 -2872 -5938
2285 -5938 -8261 -7170 -5422 -3694 -1036 1878 -4914 -3454 1180 5319 6882 6297 3988 -4878 -7428
2270 -7428 -4863 -636 -7296 -10742 -12177 -6810 -227 228 -1400 -862 6433 14165 11342 4578 3854 1259
$$ packed form
2378f156l08P791j277k165J9N233R24k151o073L703M259K076K316m90q184p409
2362g892j351o73L067M968R23K189M305p133o056O585kq08m080j787J610O641
2346E06O380k786p650m053J236O788j069m179J208K035r69l631m085N234J133
2331c902l844k88K472Q896L200o67k153o548J030L516L906j179p754m885J896
2316f304P085R65n127J346Q761J331o389K347k027k738J689J876l691J809N128
2301F061n633O207K665l253l069k754j201M140M871o15n465j985n660K759O0l066
2285e938k323J091J748J728K658K914o792J460M634M139J563n85k309q866k550
2270g428K565M227o660l446j435N367O583M55j628N38P295P732k823o764p24k595
$$ plain form
2254 1259 -2404 -4520 -5226 -2868 4386 5056 9241 6536 799 -6647 -9804 -13592 -15639 -8055 -6629
2239 -6629 -7611 -4079 5484 4097 -7648 -5358 -8421 -8023 -3256 -643 691 7916 -1568 -7470 -433
2224 -433 -65 314 -5488 951 516 -3261 -5392 -3417 -1202 -1853 678 3772 7171 5603 1726 6874
2208 6874 10522 9622 4801 8313 1740 -439 -9072 -5210 -3120 -5807 -1866 4700 7567 -336 -3756
2193 -3756 -1130 -2769 -9042 -4829 -677 -11344 -16649 -9867 -6055 -4953 -6819 -9177 -4403 -3472 -4741
2178 -4741 -3054 -89 -4770 -3719 -2169 -2336 -403 10030 9483 7774 363 621 -2324 -2650 -3580 -6640
2162 -6640 -8819 -5409 4161 10391 7215 7213 -495 1271 -1287 -3313 -5653 -1885 -977 -4312 -8374 -4504
2146 -4504 1594 -2088 -3310 -3924 -2625 -493 -5794 -5968 -1361 1596 1038 -1423 -5225 -5278 -5772 -7320
$$ packed form
2254A259l663k116p06K358P254O70M185k705n737p446l157l788k047P584J426
2239f629r82L532R563j387j1745K290l063L98M767K613J334P225r484n902P037
2224d33L68L79n802O439m35l777k131J975K215o51K531L094L399j568l877N148
2208F874L648r00m821L512o573k179q633L862K090k687L941O566K867p903l420
2193c756K626j639o273M213M152j0667n305O782L812J102j866k358M774R31j269
2178d741J687K965m681J051J550j67J933J0433n47j709p411K58k945l26r30l060
2162f640k179L410R570O230l176kp708J766k558k026k340L768R08l335m062L870
2146d504O098l682j222o14J299K132n301j74M607K957n58k461l802n3m94j548
$$ plain form
2130 -7320 -1937 -311 2888 3359 3304 4914 6147 4002 -1701 1847 3728 -2753 -6227 4345 4458 4137
2114 4137 7962 6341 -1139 1342 5741 8032 6073 5747 10121 8995 2999 3985 5905 214 -1630
2099 -1630 282 9436 14073 16875 16731 11864 6247 3015 1770 1 4611 8164 2788 -2476 -3503
2084 -3503 -4539 4961 10225 7596 3131 -4774 -6365 -5003 -10607 -11306 -8204 -11153 -8057 1864 3459
2069 3459 5098 8989 4575 2040 1269 1124 448 1725 6728 8108 936 171 -581 -2021 -661 2614
$$ packed form
2130g320N383J626L199M71n5J610J233k145n703L548J881o481l474J0572J13l21
2114D137L825j621p480K481M399K291j959l26M374j126n996R86J920n691j844
2099a630J912R154M637K802j44m867n617l232j245j769M610L553n376n264j027
2084c503j036R500N264k629m465p905j591J362n604o99L102k949L096R921J595
2069C459J639L891m414k535p71j45o76J277N003J380p172p65p52j440J360L275
$$ [...]
##END NTUPLES=NMR SPECTRUM
##END=
