##TITLE=Analysis number 318011
Compound Code spb 04750
Book Reference 468/51
Project Code adrs
Chemist Name colinb
##JCAMPDX= 6.0         $$ Bruker NMR JCAMP-DX V2.0
##DATA TYPE= NMR SPECTRUM
##DATA CLASS= NTUPLES
##ORIGIN= Bruker BioSpin GmbH
##OWNER= nmr
$$ XWIN-NMR		Version 3.5
$$ Mon Mar 13 09:04:19 2006 GMT Standard Time (UT+0h)  MAYBRIDGE\nmr@NMR_250MHZ
##.OBSERVE FREQUENCY= 250.131544655141
##.OBSERVE NUCLEUS= ^1H
##.ACQUISITION MODE= SIMULTANEOUS (DQD)
##.ACQUISITION SCHEME= undefined
##.AVERAGES= 16
##.DIGITISER RES= 18
##SPECTROMETER/DATA SYSTEM= dpx250
##.PULSE SEQUENCE= zg30
##.SOLVENT NAME= CDCl3
##.SHIFT REFERENCE= (INTERNAL, CDCl3, 0, 16.522)
##AUDIT TRAIL= $$ (NUMBER, WHEN, WHO, WHERE, WHAT)
$$ ##TITLE= Audit trail, XWIN-NMR		Version 3.5
$$ ##JCAMPDX= 5.01
$$ ##ORIGIN= Bruker BioSpin GmbH
$$ ##OWNER= nmr
$$ C:\u/data/dgb/nmr/ADRS/570/pdata/1/auditp.txt
$$ ##AUDIT TRAIL=  $$ (NUMBER, WHEN, WHO, WHERE, WHAT)
(   1,<2006-03-13 09:03:59.25 +000>,<MAYBRIDGE\nmr>,<NMR_250MHZ>,
      <created by zg, POWCHK disabled, PULCHK disabled
       configuration hash MD5:
       84 BC 41 DB A1 6E 1D 46 DA 25 12 A5 C1 ED C5 3A
       data hash MD5: 64K
       1B 37 C9 43 67 55 63 6D 4D B7 F4 C7 68 71 01 E0>)
(   2,<2006-03-13 09:04:11.75 +000>,<MAYBRIDGE\nmr>,<NMR_250MHZ>,
      <Start of raw data processing
       ef LB = 0.3 FT_mod = 6 PKNL = 1 SI = 32K 
       data hash MD5: 32K
       EF 68 06 21 3E E0 37 3C 68 BE A3 50 38 8D D6 7D>)
(   3,<2006-03-13 09:04:13.33 +000>,<MAYBRIDGE\nmr>,<NMR_250MHZ>,
      <apk 
       data hash MD5: 32K
       14 C1 31 FE C3 5C 7D 12 B3 6B 20 91 C6 E2 A0 CE>)
(   4,<2006-03-13 09:04:14.09 +000>,<MAYBRIDGE\nmr>,<NMR_250MHZ>,
      <abs ABSG = 5 
       data hash MD5: 32K
       5F 97 AC 41 59 71 64 48 44 26 0D AA 66 4C AA AC>)
$$ ##END=
$$ 
$$ hash MD5
$$ 07 30 4D 62 3F 6E 20 75 A9 3F D0 61 75 0A 95 C0
##$RELAX= 
##$RELAX= 
##$RELAX= 
##$RELAX= 
##$RELAX= 
##$RELAX= 
##$RELAX= 
$$ Bruker specific parameters
$$ --------------------------
##$DU= <C:\u>
##$EXPNO= 570
##$NAME= <ADRS>
##$PROCNO= 1
##$TYPE= <nmr>
##$USER= <dgb>
##$AMP= (0..31)
100 100 100 100 100 100 100 100 100 100 100 100 100 100 100 100 100 100 
100 100 100 100 100 100 100 100 100 100 100 100 100 100 
##$AQSEQ= 0
##$AQ_mod= 3
##$AUNM= <au_zg>
##$AUTOPOS= <8 >
##$BF1= 250.13
##$BF2= 250.13
##$BF3= 250.13
##$BF4= 250.13
##$BF5= 500.13
##$BF6= 500.13
##$BF7= 500.13
##$BF8= 500.13
##$BYTORDA= 1
##$CFDGTYP= 0
##$CFRGTYP= 5
##$CHEMSTR= <none>
##$CNST= (0..31)
1 1 145 1 1 1 1 1 1 1 1 1 1 1 1 1 1 1 1 1 1 1 1 1 1 1 1 1 1 1 1 1 
##$CPDPRG= <>
##$CPDPRG1= <>
##$CPDPRG2= <>
##$CPDPRG3= <>
##$CPDPRG4= <mlev>
##$CPDPRG5= <mlev>
##$CPDPRG6= <mlev>
##$CPDPRG7= <mlev>
##$CPDPRG8= <mlev>
##$CPDPRGB= <>
##$CPDPRGT= <>
##$D= (0..31)
0 1 0 0 0 0 0 0 0 0.06 0 0 0 0 0 0 0.0002 0 0 0 0 0 0 0 0 0 0 0 0 0 0 
0 
##$DATE= 1142240638
##$DBL= (0..7)
120 120 120 120 120 120 120 120 
##$DBP= (0..7)
150 150 150 150 150 150 150 150 
##$DBP07= 0
##$DBPNAM0= <>
##$DBPNAM1= <>
$$ [...]
##$SUBNAM7= <"">
##$SUBNAM8= <"">
##$SUBNAM9= <"">
##$SW= 20.6930455092707
##$SWIBOX= (0..15)
0 0 3 0 0 0 0 0 0 0 0 0 0 0 0 0 
##$SW_h= 5175.983436853
##$TD= 65536
##$TD0= 1
##$TE= 294.16
##$TE2= 300
##$TE3= 300
##$TEG= 300
##$TL= (0..7)
0 120 120 120 120 120 120 120 
##$TP= (0..7)
150 150 150 150 150 150 150 150 
##$TP07= 0
##$TPNAME0= <>
##$TPNAME1= <>
##$TPNAME2= <>
##$TPNAME3= <>
##$TPNAME4= <>
##$TPNAME5= <>
##$TPNAME6= <>
##$TPNAME7= <>
##$TPOAL= (0..7)
0.5 0.5 0.5 0.5 0.5 0.5 0.5 0.5 
##$TPOFFS= (0..7)
0 0 0 0 0 0 0 0 
##$TUNHIN= 0
##$TUNHOUT= 0
##$TUNXOUT= 0
##$USERA1= <user>
##$USERA2= <user>
##$USERA3= <user>
##$USERA4= <user>
##$USERA5= <user>
##$V9= 5
##$VALIST= <valist>
##$VCLIST= <CCCCCCCCCCCCCCC>
##$VD= 0
##$VDLIST= <DDDDDDDDDDDDDDD>
##$VPLIST= <PPPPPPPPPPPPPPP>
##$VTLIST= <TTTTTTTTTTTTTTT>
##$WBST= 1024
##$WBSW= 4
##$XGAIN= (0..3)
0 0 0 0 
##$XL= 0
##$YL= 0
##$YMAX_a= 480887
##$YMIN_a= -543803
##$ZGOPTNS= <>
##$ZL1= 120
##$ZL2= 120
##$ZL3= 120
##$ZL4= 120
##$ABSF1= 16.522
##$ABSF2= -4.171173
##$ABSG= 5
##$ABSL= 3
##$ALPHA= 0
##$AQORDER= 0
##$ASSFAC= 0
##$ASSFACI= 0
##$ASSFACX= 0
##$ASSWID= 0
##$AUNMP= <proc_1d>
##$AZFE= 0.1
##$AZFW= 0.1
##$BCFW= 0
##$BC_mod= 0
##$BYTORDP= 0
##$COROFFS= 0
##$CY= 12.5
##$DATMOD= 1
##$DC= 0
##$DFILT= <>
##$DTYPP= 0
##$F1P= 14.0000005364418
##$F2P= -0.99999901652339
##$FCOR= 0.5
##$FTSIZE= 32768
##$FT_mod= 6
##$GAMMA= 0
##$GB= 0
##$INTBC= 1
##$INTSCL= 1
##$ISEN= 128
##$LB= 0.3
##$LEV0= 0
##$LPBIN= 0
##$MAXI= 10000
##$MC2= 0
##$MEAN= 0
##$ME_mod= 0
##$MI= 0
##$NCOEF= 0
##$NC_proc= -2
##$NLEV= 6
##$NOISF1= 0
##$NOISF2= 0
##$NSP= 0
##$NTH_PI= 0
##$NZP= 0
##$OFFSET= 16.522
##$PC= 1
##$PHC0= 172.5275
##$PHC1= 4.996467
##$PH_mod= 1
##$PKNL= yes
##$PPARMOD= 0
##$PSCAL= 4
##$PSIGN= 0
##$REVERSE= no
##$SF= 250.13
##$SI= 32768
##$SIGF1= 0
##$SIGF2= 0
##$SINO= 400
##$SIOLD= 32768
##$SREGLST= <1H.CDCl3>
##$SSB= 0
##$STSI= 32768
##$STSR= 0
##$SW_p= 5175.98343685301
##$SYMM= 0
##$S_DEV= 0
##$TDeff= 65536
##$TDoff= 0
##$TI= <Analysis number 999999
Compound Code 99
Book Reference 9
Project Code 9>
##$TILT= no
##$TM1= 0
##$TM2= 0
##$TOPLEV= 0
##$USERP1= <user>
##$USERP2= <user>
##$USERP3= <user>
##$USERP4= <user>
##$USERP5= <user>
##$WDW= 1
##$XDIM= 32768
##$YMAX_p= 301437195
##$YMIN_p= -59164
$$ End of Bruker specific parameters
$$ ---------------------------------
##NTUPLES= NMR SPECTRUM
##VAR_NAME=  FREQUENCY,     SPECTRUM/REAL,   SPECTRUM/IMAG
##SYMBOL=    X,             R,               I
##VAR_TYPE=  INDEPENDENT,   DEPENDENT,       DEPENDENT
##VAR_FORM=  AFFN,          ASDF,            ASDF
##VAR_DIM=   32768,         32768,           32768
##UNITS=     HZ,            ARBITRARY UNITS, ARBITRARY UNITS
##FACTOR=    0.157963299565203, 1,           1
##FIRST=     4132.6476996994, 0,             0
##LAST=      -1043.33573715361, 0,           0
##MIN=       -1043.33573715361, -59164,      0
##MAX=       4132.6476996994, 301437195,     0
$$ Real data points
##PAGE= N=1
##DATA TABLE= (X++(R..R)), XYDATA
$$ [...]
$$ plain form
15143 260 -12548 -13536 -5267 2370 5293 -930 -11902 -27565 -19465 -3543 8924 13717 20477 19386
15129 19386 3754 -19668 -13547 3664 8494 -10261 -8103 4450 7642 5465 10909 9370 7546
15116 7546 -1549 -6858 -639 -18906 -32883 -21424 -2978 -52 452 1011 816 -9129 -9079 -18315 -25919
15101 -25919 -15356 -5801 -430 -260 8500 16386 -2629 -14245 -9337 -7627 -10811 -5314 -9665 -16945
15087 -16945 -8184 -10997 -18675 -11466 7 6080 -5397 -17421 -20691 -6111 -4390 -10120 -1059
15074 -1059 18024 5154 -2938 4992 7218 -3391 -10382 -1547 626 -669 1985 6615 7706 4656
15060 4656 -11765 -8926 -2784 -12770 -3203 985 8149 310 -11908 -1280 3671 -3086 -8625 -8126
15046 -8126 -9340 -29280 -20038 -15563 -17116 -8778 -19456 -12268 1635 1693 -15569 -21681 -10218 -3001
$$ packed form
15143B60j2808r88Q269P637K923o223j0972j5663Q100J5922J2467M793O760j091
15129A9386j5632k3422O121J7211M830j8755K158J2553L192k177N444j539j824
15116G546r095n309O219j8267j3977J1459J8446K926N04N59j95r945N0r236p604
15101b5919J0563R555N371J70Q760P886j9015j1616M908J710l184N497m351p280
15087a6945Q761k813p678P209J1473O073j1477j2024l270J4580J721n730R061
15074a059J9083j2870q092P930K226j0609o991Q835K173j295K654M630J091l050
15060D656j6421K839O142r986R567M188P164p839j2218J0628M951o757n539M99
15046h126j214j9940R242M475j553Q338j0678P188J3903N8j7262o112J1463P217
$$ plain form
15032 -3001 2979 3763 14160 20684 28652 18573 8087 -2556 -6248 -1682 -7451 -20145 -30568
15019 -30568 -20367 -3180 -9046 43 -12307 -21054 -24573 -11049 -1321 -8222 -19386 -17511 -13245
15006 -13245 -4310 -1105 3483 6608 31 10910 13210 3672 4752 -1370 12554 29080 24505 28175
14992 28175 32086 34357 34518 27120 20574 26943 7276 7286 3338 -6388 592 -3366 -4033 -10345 -17331
14977 -17331 -8375 -1133 -9479 -21531 -28012 -31680 -20766 -12697 3390 -7190 -8551 181 11318
14964 11318 5526 -8028 -11706 -7894 -3825 7699 22595 12489 5420 -6924 3866 15609 13648
14951 13648 7473 4369 -7103 -22381 -23264 -21218 -12024 -3373 -10489 -1254 11818 24873 19964 7170
14937 7170 -16071 -11537 -9934 11928 26185 26713 22421 12242 15573 7181 11034 621 -17492
$$ packed form
15032c001N980P84J0397O524P968j0079j0486j0643l692M566n769j2694j0423
15019c0568J0201J7187n866R089j2350q747l519J3524R728o901j1164J875M266
15006a3245Q935L205M588L125o577J0879K300r538J080o122J3924J6526m575L670
14992B8175L911K271J61p398o546O369j9667J0l948r726O980l958o67o312o986
14977a7331Q956P242q346j2052o481l668J0914Q069J6087j0580j361Q732J1137
14964A1318n792j3554l678L812M069J1524J4896j0106p069j2344J0790J1743j961
14951A3648o175l104j1472j5278q83K046R194Q651p116R235J3072J3055m909j2794
14937G170k3241M534J603K1862J4257N28m292j0179L331q392L853j0413j8113
$$ plain form
14924 -17492 -9722 13245 23620 6697 -3829 -7837 -14041 -19367 -25601 -14844 7364 9575 7915
14911 7915 2580 -3263 2532 15487 13256 10759 16201 21832 10655 -3066 200 -2441 8301 -3377
14897 -3377 -2906 5829 12632 7813 -2961 3008 -11366 -19685 -12336 10890 33902 37912 39136 25633
14883 25633 26476 7893 -3169 -11840 -9520 -1919 -12427 -9771 -6340 -312 4156 1694 -11155 -17184
14869 -17184 -20073 2221 7016 -5103 -1357 -279 -2405 -16307 -19618 2258 4349 -3353 -7693
14856 -7693 -4701 -9124 -7834 -312 -5717 -7693 -12540 -18585 -16983 -14529 -13308 -11225 -9944 -15299 -19323
14841 -19323 -27618 -28476 -28454 -32266 -16428 -10889 -8641 -362 3670 16173 27383 15963 5478 589
14827 589 4360 12377 26312 32159 24209 19098 14191 7616 3014 -478 -11550 -14868 -622 13074
$$ packed form
14924a7492P770K2967J0375j6923j0526m008o204n326o234J0757K2208K211j660
14911G915n335n843N795J2955k231k497N442N631j1177j3721L266k641J0742j1678
14897c377M71Q735O803m819j0774N969j4374q319P349K3226K3012M010J224j3503
14883B5633Q43j8583j1062q671K320P601j0508K656L431O028M468k462j2849o029
14869a7184k889K2294M795j2119L746J078k126j3902l311K1876K091p702m340
14856g693K992m423J290P522n405j976m847o045J602K454J221K083J281n355m024
14841a9323q295q58K2l812J5838N539K248Q279M032J2503J1210j1420j0485m889
14827E89L771Q017J3935N847p950n111m907o575m602l492j1072l318J4246J3696
$$ plain form
14813 13074 8036 497 5734 1423 7049 20932 23947 6830 -13360 -19154 -4702 14468 21278
14800 21278 21265 27599 20482 33142 27253 15663 4279 -4579 -2498 -1547 -11247 689 14901 15993
14786 15993 10822 11854 12181 14066 10876 13587 7285 16228 16268 8106 1131 7608 7846 2399 24591
14771 24591 42183 34105 27140 12105 -2982 -3141 -1391 2301 7293 7859 17150 5979 -6115 904
14757 904 19 1404 1761 1243 5531 -8060 -11407 -9863 -11720 -12627 -24521 -23439 -16478 -6720 -24458
14742 -24458 -24643 -10746 -597 -7311 -1852 10416 9983 4799 -1635 -6950 4045 15426 17833 19790
14728 19790 23138 -1849 -6810 11835 24392 25854 20024 28792 25529 3050 -10896 -9436 1835
14715 1835 -4688 -18781 -14841 -5759 4595 10127 -2138 -4944 5875 10353 20176 15859 9693 176
$$ packed form
14813A3074n038p539N237m311N626J3883L015j7117k0190n794J4452J9170O810
14800B1278j3O334p117J2660n889j1590j1384q858K081R51r700J1936J4212J092
14786A5993n171J032L27J885l190K711o302Q943M0q162o975O477K38n447K2192
14771B4591J7592q078o965j5035j5087j59J750L692M992N66R291j1171j2094P019
14757I04q85J385L57n18M288j3591l347J544j857r07j1894J082O961R758j7738
14742b4458j85J3897J0149o714N459J2268m33n184o434n315J0995J1381K407J957
14728A9790L348k4987m961J8645J2557J462n830Q768l263k2479j3946J460J1271
14715A835o523j4093L940R082J0354N532j2265k806J0819M478R823m317o166r517
$$ plain form
14701 176 -9338 -16427 -3771 15431 17195 4347 -9409 -17529 -11536 -18800 -4054 10411 10564 -1279
14687 -1279 1184 -725 411 13747 15717 3723 -15935 -12994 -9142 -9195 -19108 -22181 -22663 -32092 -44215
14672 -44215 -48973 -40724 -22508 1254 15612 21380 6214 -4327 -10187 -3828 9420 30253 22192
14659 22192 12094 5026 -4861 -18613 -286 14855 12217 -3555 -8236 -2320 -9179 -8002 -1907
14646 -1907 -4715 -533 7905 5240 7736 -2609 -15428 -10089 -11488 -15783 -24592 -30060 -9398 -17
14632 -17 382 -11169 -5402 14656 22115 15994 6655 -10095 -10748 3487 24870 31451 27846 31348
14618 31348 28558 25392 21936 17219 16930 10468 15639 31517 23212 18786 6068 9304 4651 -3364
14604 -3364 -7537 -8702 -5718 11066 3390 -5838 -3405 -362 21731 31728 33701 22038 21082 444
$$ packed form
14701A76r514p089J2656J9202J764j2848j3756q120N993p264J4746J4465J53j1843
14687a279K463j909J136J3336J970j1994j9658K941L852n3r913l073m82r429j2123
14672d4215m758Q249J8216K3762J4358N768j5166j0541n860O359J3248K0833q061
14659B2192j0098p068r887j3752J8327J5141k638j5772m681N916o859J177O095
14646a907k808M182Q438k665K496j0345j2819N339j399m295q809n468K0662R381
14632a7L99j1551N767K0058P459o121r339j6750o53J4235K1383O581l605L502
14618C1348k790l166l456m717k89o462N171J5878q305m426j2718L236m653q015
14604c364m173j165K984J6784p676r228K433L043K2093R997J973j1663r56k0638
$$ plain form
14590 444 -25319 -11754 5394 14618 5560 1992 -1343 4495 7845 -260 1965 -9173 -20951 -18018
14576 -18018 5026 22477 27270 21699 27033 36964 24661 14461 5039 -7837 -12581 -10580 -8906
14563 -8906 -11567 -2740 -5103 -9992 -6755 -10135 -17354 -17905 -11477 -516 -5143 -6919 -11682 6156
14549 6156 15130 14208 11370 3636 -6351 -5524 11298 10736 8431 8721 21061 22586 16014 9808 -8941
14534 -8941 -9410 18013 22721 12650 2390 15173 21540 9375 4979 2312 12446 2499 -6528
14521 -6528 -923 -14128 -18928 1474 10952 3915 8648 13214 1027 -2826 680 -13483 -16113 1122
14507 1122 15457 20093 20204 24985 9676 -7614 -2333 -6915 -10161 -18805 -18362 -8819 798 11874
14493 11874 13992 7600 5773 940 6078 143 -2630 4186 7650 2591 -302 -2371 -1513 2349 9761
$$ packed form
14590D44k5763J3565J7148R224r058l568l335N838L350q105K225j1138j1778K933
14576a8018K3044J7451M793n571N334R931j2303j0200r422j2876m744K001J674
14563h906k661Q827k363m889L237l380p219n51O428J0961m627j776m763J7838
14549F156Q974r22k838p734r987Q27J6822n62k305K90J2340J525o572o206j8749
14534h941m69K7423M708j0071j0260J2783O367j2165m396k667J0134r947r027
14521f528N605j3205m800K0402R478p037M733M566j2187l853L506j4163k630J7235
14507A122J4335M636J11M781j5309j7290N281m582l246q644M43R543R617J1076
14493A1874K118o392j827m833N138n935k773O816L464n059k893k069Q58L862P412
$$ plain form
14478 9761 18269 3123 3437 21082 20732 3788 -2903 2106 1769 10035 -493 -7120 4426 6720
14464 6720 -3278 -17473 -23261 -20216 -7242 -8417 -11957 -23870 -27785 -26262 -15380 -14687 -16870 -4853
14450 -4853 -7188 -13041 -25473 -25155 -13333 779 -13647 -26561 -27472 -22293 -10351 -5652 5419
14437 5419 8943 6139 -1783 4884 18261 13426 11716 14735 5819 738 4958 7412 8554 22507
14423 22507 11183 -670 -2546 -5033 -8566 5379 7840 12039 8277 -1861 -6160 6338 12332
14410 12332 11625 19023 25001 13291 7538 24900 41129 33163 9180 -11132 -6581 -6679 -16766 -19278
14396 -19278 -22178 -16220 -14134 -26025 -15618 -2436 12516 17812 23463 26064 12230 2702 -8431
14383 -8431 -2561 -10842 31 7477 828 5592 8485 -5462 -13153 -11941 -7960 6954 7356 -1230
$$ packed form
14478I761Q508j5146L14J7645l50j6944o691N009l37Q266j0528o627J1546K294
14464F720r998j4195n788L045J2974j175l540j1913l915J523J0882O93k183J2017
14450d853k335n853j2432L18J1822J4112j4426j2914r11N179J1942M699J1071
14437E419L524k804p922O667J3377m835j710L019q916n081M220K454J142J3953
14423B2507j1324j1853j876k487l533J3945K461M199l762j0138m299J2498N994
14410A2332p07P398N978j1710n753J7362J6229p966k3983k0312M551r8j0087k512
14396a9278k900N958K086j1891J0407J3182J4952N296N651K601j3834r528j1133
14383h431N870q281J0873P446o649M764K893j3947p691J212L981J4914M02q586
$$ plain form
14369 -1230 6632 9372 -3874 313 -2160 -10300 1617 9634 14576 6521 4539 -17034 -18139 -1359
14355 -1359 16611 11677 9325 -10664 -23508 -14542 -17404 -6670 16664 26709 19419 13446 8686
14342 8686 14081 19727 15735 17386 20140 12048 16858 21925 20907 12533 11795 1292 -14250 -1355
14328 -1355 1148 -17633 -18760 -1113 5063 41 445 -10131 -5261 15393 29604 8437 -581
14315 -581 -15143 -29131 -21469 -5635 4543 1936 2636 2601 5965 4641 7625 21175 19127 8400
14301 8400 12118 5505 17657 16251 -536 -8525 -11883 -21669 -26989 -35034 -36342 -26319 -6463 -3632
14287 -3632 -2099 11415 20916 17053 18894 23062 22786 -2603 -19139 -4621 23098 33870 28625
14274 28625 25315 21914 15754 5119 5165 18905 14418 27972 45724 61049 85972 126162 174735
$$ packed form
14369a230P862K740j3246M187k473q140J1917Q017M942q055j982k1573j105J6780
14355a359J7970m934k352j9989j2844Q966k862J0734K3334J0045p290n973m760
14342H686N395N646l992J651K754q092M810N067j018q374p38j0503j5542J2895
14328a355K503j8781j127J7647O176n022M04j0576M870K0654J4211k1167r018
14315e81j4562j3988P662J5834J0178k607P00l5L364j324K984J3550k048j0727
14301H400L718o613J2152j406j6787p989l358r786n320q045j308J0023J9856K831
14287c632J533J3514R501l863J841M168k76k5389j6536J4518K7719J0772n245
14274B8625l310l401o160j0635M6J3740m487J3554J7752J5325K4923M0190M8573
$$ plain form
14261 174735 228098 271345 251530 210499 177213 139621 107563 87656 78758 60578 32704 30110
14249 30110 16529 11949 14852 8159 19508 26744 21076 31516 24377 20484 22105 23297 20378 21523
14235 21523 31339 32283 27337 30969 32588 13916 15480 17029 27097 33132 16864 29116 63627
14222 63627 92973 113390 151316 195792 267604 398602 585258 732079 734953 643096 498946
14211 498946 363441 250077 177624 136779 126890 104231 94431 87072 70912 64493 39383 25019
14199 25019 36810 33432 23627 15866 18839 34368 39116 34199 33093 27562 31908 49790 63123
14186 63123 65709 57612 48833 40168 36922 30655 22329 32898 63138 85739 111218 138931 186734
14173 186734 266310 399932 578546 739765 777784 704375 579010 430026 306701 210524
$$ packed form
14261A74735N3363M3247j9815m1031l3286l7592l2058j9907q898j8180k7874k594
14249C0110j3581m580K903o693J1349P236n668J0440p139l893J621J192k919J145
14235B1523R816R44m946L632J619j8672J564J549J0068O035j6268J2252L4511
14222F3627K9346K0417L7926M4476P1812J30998J86656J46821K874r1857j44150
14211D98946j35505j13364p2453m0845r889k2659r800p359j6160o419k5110j4364
14199B5019J1791l378r805p761K973J5529M748m917j106n531M346J7882J3333
14186F3123K586q097q779q665l246o267q326J0569L0240K2601K5479K7713M7803
14173A86734P9576J33622J78614J61219L8019p3409j25365j48984j23325r6177
$$ plain form
14163 210524 152998 124193 99072 87325 78331 64073 54058 47012 45986 40243 35022 27325 39068
14150 39068 35300 32357 23601 14482 31406 44948 42103 31274 48134 48833 34627 43081 51279
14137 51279 48754 43956 25619 24435 31417 30693 40381 61304 80063 101081 135254 189163 233802
14124 233802 257549 260840 223774 165748 116212 74602 57294 46040 49656 44891 51233 57940
14112 57940 58067 47570 32390 32282 30333 28880 23676 23044 33675 35033 26122 21430 21181 23666 23148
14097 23148 40757 50776 47949 49545 45240 55003 50311 38594 37586 43186 31981 26801 52012
14084 52012 52234 42743 35835 37589 37554 32772 28416 13089 14424 25379 29182 14966 22202 27880
14070 27880 9762 12394 14586 13379 28580 54077 69256 72862 61494 41759 15439 20614 27368
$$ packed form
14163B10524n7526k8805k5121j1747q994j4258j0015p046j026n743n221p697J1743
14150C9068l768k943q756r119J6924J3542k845j0829J6860O99j4206Q454Q198
14137E1279k525m798j8337j184O982p24R688K0923J8759K1018L4173N3909M4639
14124B33802K3747L291l7066n8026m9536m1610j7308j1254L616m765O342O707
14112E7940J27j0497j5180j08j949j453n204o32J0631J358q911m692k49K485n18
14097B3148J7609J0019k827J596m305R763m692j1717j008N600j1205n180K5211
14084E2012K22r491o908J754l5m782m356j5327J335J0955L803j4216P236N678
14070B7880j8118K632K192j207J5201K5497J5179L606j1368j9735k6320N175O754
$$ plain form
14057 27368 46578 44476 37534 40384 46155 44602 59516 62032 47390 55708 71630 65336 61086
14044 61086 64184 66752 68875 68422 60907 52500 54150 50785 34624 29478 27799 25175 9507 4787
14030 4787 12763 16678 24642 36855 37195 33619 45503 46902 52801 55269 55877 59841 56947 60230 56852
14015 56852 48937 49617 57087 56653 74929 76040 64903 73990 88352 97533 99203 115880 139256 162401
14001 162401 171473 154580 134605 111382 118210 120018 93331 74315 70147 68949 60107 61368 53852
13988 53852 44945 35836 32923 46745 65949 70798 61320 54851 37274 38731 50485 74932 91239
13975 91239 92933 84714 69375 73137 68199 71871 75577 78968 66101 69744 83981 98575 106512
13962 106512 116215 133310 184921 205710 217835 207601 190292 171265 155089 130096 122600 92723
$$ packed form
14057B7368J9210k102o942K850N771j553J4914K516j4642Q318J5922o294m250
14044F1086L098K568K123m53p515q407J650l365j6161n146j679k624j5668m720
14030D787P976L915P964J2213L40l576J1884J399N899K468O08L964k894L283l378
14015E6852p915O80P470m34J8276J111j1137R087J4362R181J670J6677K3376K3145
14001A62401R072j6893j9975k3223O828J808k6687j9016m168j198q842J261p516
13988E3852q907r109k913J3822J9204M849r478o469j7577J457J1754K4447J6307
13975I1239J694q219j5339L762m938L672L706L391j2867L643J4237J4594P937
13962A06512R703J7095N1611K0789J2125j0234j7309j9027j6176k4993p496k9877
$$ plain form
13950 92723 60482 44635 49477 53604 66630 79693 103458 106361 97966 96548 98366 92320 99364
13937 99364 115680 115049 114868 106280 92250 76200 71593 74794 94294 108130 114031 108211 109897 118346
13923 118346 112502 110090 112276 110984 114055 119787 127762 154648 189716 191562 171181 156040 142295
13910 142295 105557 82461 63344 63440 59880 56405 42809 59409 95262 128831 150020 167482
13898 167482 164760 166198 155638 169152 163990 174158 205955 218022 219694 235479 274457 369626
13886 369626 514068 735813 955563 1040356 988325 857551 682231 502511 385224 314339
13876 314339 272035 247160 223209 215760 214961 205819 200081 189214 163005 139061 128671 134780 136595
13863 136595 130167 130802 130695 133427 109866 109103 129586 156548 178288 197479 218606 230779 247777
$$ packed form
13950I2723l2241j5847M842M127J3026J3063K3765K903q395j418J818o046P044
13937I9364J6316o31j81q588j4030j6050m607L201J9500J3836N901n820J686Q449
13923A18346n844k412K186j292L071N732P975K6886L5068J846k0381j5141j3745
13910A42295l6738k3096j9117R6l560l475j3596J6600L5853L3569K1189J7462
13898A67482k722J438j0560J3514n162J0168L1797J2067J672J5785L8978R5169
13886C69626J44442K21745K19750Q4793n2031j30774j75320j79720j17287p0885
13876C14339m2304k4875k3951p449p99r142n738j0867k6209k3944j0390O109J815
13863A36595o428O35j07K732k3561p63K0483K6962K1740J9191K1127J2173J6998
$$ plain form
13850 247777 263546 307247 359944 391529 433270 479909 567948 696842 891277 1248815 1843235
13839 1843235 2629419 3095185 2996898 2656238 2100011 1503084 1103635 860066 715864 623557
13829 623557 559244 517195 502798 494803 506301 497105 472653 453957 448469 452867 468669 504705
13817 504705 539017 567344 607941 632837 684677 741854 800439 865263 971699 1107349 1248459
13806 1248459 1403260 1622816 1946321 2361022 2869448 3478084 4263662 5320910 6909928
13797 6909928 9481993 13856104 21377636 32908487 44455345 48307589 45088495 38037837
13789 38037837 28354022 19680650 13889839 10345220 8109414 6675545 5694750 4959903
13781 4959903 4356250 3858103 3425348 3079125 2803916 2608611 2445065 2335198 2291423 2283258
$$ packed form
13850B47777J5769M3701N2697L1585M1741M6639Q8039J28894J94435L57538N94420
13839A843235P86184M65766r8287l40660n56227n96927l99449k43569j44202r2307
13829F23557o4313m2049j4397p995J1498r196k4452j8696n488M398J5802L6036
13817E04705L4312K8327M0597K4896N1840N7177N8585O4824J06436J35650J41110
13806A248459J54801K19556L23505M14701N08426O08636P85578J057248J589018
13797F909928K572065M374111P521532J1530851J1546858L852244l219094p050658
13789C8037837r683815q673372n790811l544619k235806j433869r80795p34847
13781D959903o03653m98147m32755l46223k75209j95305j63546j09867m3775q165
$$ plain form
13771 2283258 2295697 2337726 2391035 2448411 2514106 2632023 2782880 2977215 3266034 3644382
13761 3644382 4093806 4674003 5464252 6539927 7890564 9499006 11551865 14282801 18285184
13752 18285184 24686738 35424328 54071965 84904777 123414998 143787011 136740656
13745 136740656 118479026 90263540 61446419 41779221 30083532 23022010 18545125
13738 18545125 15555012 13355511 11540528 9975624 8640995 7502037 6621278 5932263
13730 5932263 5382920 4967777 4658785 4417287 4246552 4122850 4021125 3968742 3978675 4052860
13720 4052860 4151117 4268789 4456174 4757964 5136814 5623734 6343857 7334408 8621748
13711 8621748 10150827 12066686 14587684 18216850 23963227 33505375 49981901 77913638
$$ packed form
13771B283258J2439M2029N3309N7376O5695J17917J50857J94335K88819L78348
13761C644382M49424N80197P90249J075675J350637J608442K052859K730936M002383
13752A8285184O401554J0737590J8647637L0832812L8510221K0372013p046355
13745A36740656j8261630k8215486k8817121j9667198j1695689p061522m476885
13738A8545125k990113k199501j814983j564904j334629j138958q80759o89015
13730E932263n49343m15143l08992k41498j70735j23702j01725n2383R933P4185
13720D052860R8257J17672J87385L01790L78850M86920P20123R90551J287340
13711H621748J529079J915859K520998L629166N746377R542148J6476526K7931737
$$ plain form
13703 77913638 116640732 144221968 141720689 125101658 98512293 67864258 45497181
13696 45497181 32093266 24105316 19145345 15895548 13544914 11637397 9976702 8544037
13688 8544037 7323679 6350716 5601275 5018180 4520678 4129625 3817485 3537969 3303554
13679 3303554 3111489 2948343 2853007 2813659 2797310 2793618 2796640 2825888 2874058 2989253 3171292
13668 3171292 3431500 3816338 4289961 4888131 5663119 6791438 8551467 11458857 16450783
13659 16450783 24934100 37003612 46895386 48048737 43373167 35199858 25243045 17270193
13651 17270193 12181350 9084422 7171466 5911482 4993069 4274227 3680462 3163438 2703350
13642 2703350 2311380 2028323 1813619 1622636 1466034 1353608 1250608 1147005 1045829
$$ packed form
13703G7913638L8727094K7581236k501279j6619031k6589365l0648035k2367077
13696D5497181j3403915p987950m959971l249797k350634j907517j660695j432665
13688H544037j220358r72963p49441n83095m97502l91053l12140k79516k34415
13679C303554j92065j63146r5336l9348j6349l692L022K9248M8170J15195J82039
13668C171292K60208L84838M73623N98170P74988J128319J760029K907390M991926
13659A6450783Q483317J2069512R891774J153351m675570q173309r956813p972852
13651A7270193n088843l096928j912956j259984r18413p18842n93765n17024m60088
13642B703350l91970k83057k14704j90983j56602j12426j03000j03603j01176
$$ plain form
13633 1045829 968695 922407 885690 846298 824904 795304 758369 721786 685176 652140 610525
13622 610525 577324 548518 515732 504658 480805 456818 427923 402033 382191 382486 357939 333045
13610 333045 329143 319672 326636 371037 406518 377188 318370 270984 237637 210192 190171 187894
13598 187894 189476 159401 158454 167215 180559 192568 205271 202533 213622 216886 219083 203731 189895
13585 189895 179478 174802 176082 180303 183804 174357 178418 180124 179232 160807 158874 177779 173312 160159
13571 160159 141632 170867 195973 200758 204476 182161 175409 172511 193505 249237 275792 255097
13559 255097 213532 162673 116692 99774 85211 79940 68265 47099 36524 42438 47353 42476
13547 42476 54589 82376 100376 113020 120252 119232 109266 102469 122703 127445 125500 116302 113995
$$ packed form
13633A045829p7134m6288l6717l9392k1394k9600l6935l6583l6610l3036m1615
13622F10525l3201k8806l2786j1074k3853k3987k8895k5890j9842K95k4547k4894
13610C33045l902r471O964M4401L5481k9330n8818m7386l3347k7445k0021k277
13598A87894J582l0075r47Q761J3344J2009J2703k738J1089L264K197j5352j3836
13585A89895j0417m676J280M221L501r447M061J706q92j8425j933J8905m467j3153
13571A60159j8527K9235K5106M785L718k2315o752k898K0994N5732K6555k0695
13559B55097m1565n0859m5981j6918j4563n271j1675k1166j0575N914M915m877
13547D2476J2113K7787J8000J2644P232j020r966o797K0234M742j945r198k307
$$ plain form
13534 113995 110033 96790 88484 88031 97161 102396 118296 130624 145940 193658 261345 281210 270431
13521 270431 247003 197079 145103 117366 137194 164972 180374 156883 116958 73941 60609
13510 60609 58381 47245 50450 45227 28267 21187 8913 8353 35282 48876 46777 55824 61660
13497 61660 56817 61112 69284 76118 71963 79342 83261 83888 82908 72797 58682 50188 45165 53737
13483 53737 71079 72047 92874 133953 204139 251465 259113 223984 160262 111974 88401 84001
13471 84001 86563 86590 86885 84914 75192 68101 88057 84283 58954 53678 55736 51173 34206 34201 36443
13456 36443 29014 36137 49422 65536 57907 47820 42171 43010 42931 43264 36818 34864 22963 25296
13442 25296 42493 58113 72098 81216 72515 68197 83074 108310 130474 132823 124607 108346 87866
$$ packed form
13534A13995l962j3243q306m53R130N235J5900J2328J5316M7718O7687J9865j0779
13521B70431k3428m9924n1976k7737J9828K7778J5402k3491l9925m3017j3332
13510F0609k228j1136L205n223j6960p080j2274n60K6929J3594k099R047N836
13497F1660m843M295Q172O834m155P379L919O27r80j0111j4115q494n023Q572
13483E3737J7342R68K0827M1079P0186M7326P648l5129o3722m8288k3573m400
13471H4001K562K7K95j971r722p091J9956l774k5329n276K058m563j6967nK242
13456C6443p429P123J3285J6114p629j0087n649Q39p9L33o446j954j1901K333
13442B5296J7197J5620J3985R118q701m318J4877K5236K2164K349q216j6261k0480
$$ plain form
13429 87866 82101 88399 89760 89920 119105 122915 131860 134465 115661 92751 92042 97039 83414 70672
13415 70672 55396 71764 70053 62513 60671 40666 24089 21457 21495 23105 20095 31820 31630 37379
13401 37379 56607 57182 60337 72831 81427 85839 87503 91478 89613 81375 70689 77600 103103 115479
13387 115479 105323 100230 88539 85158 101225 138239 176097 235819 303405 298872 247479 201785
13375 201785 174965 149877 127053 101468 81686 63259 60917 52342 43626 43997 44647 34765 32896
13362 32896 40797 56439 61429 71721 74957 65286 55322 41570 28603 20454 46291 81016 85763
13349 85763 94919 106293 109667 110384 121312 122128 99533 92881 88522 74698 90341 98797 122096
13336 122096 169520 218598 276723 279960 275367 257716 229770 220020 233766 252334 231259 198923
$$ packed form
13429H7866n765O298J361J60K9185L810Q945K605j8804k2910p09M997j3625j2742
13415G0672j5276J6368j711p540j842k0005j6577k632L8J610l010J1725j90N749
13401C7379J9228N75L155J2494Q596M412J664L975j865q238j0686O911K5503J2376
13387A15479j0156n093j1691l381J6067L7014L7858N9722O7586m533n1393m5694
13375B01785k6820k5088k2824k5585j9782j8427k342q575q716L71O50r882j869
13362C2896P901J5642M990J0292L236r671r964j3752j2967q149K5837L4725M747
13349H5763R156J1374L374P17J0928Q16k2595o652m359j3824J5643Q456K3299
13336A22096M7424M9078N8125L237m593j7651k7946r750J3746J8568k1075l2336
$$ plain form
13324 198923 172072 142977 109903 97549 97441 117827 181665 236359 282872 300047 275981 229509
13312 229509 185807 161248 133651 101562 88966 67258 59549 62380 64817 82426 97270 88532
13300 88532 79575 77626 83658 79040 82257 85795 77100 76395 89706 86137 113628 144755 159310 151911
13286 151911 152060 174232 222140 293080 382317 429133 404583 360071 315445 269474 242442 248861
13274 248861 311547 415403 579464 743914 778653 728039 606995 446590 314245 221361
13264 221361 171483 135737 117322 122536 122050 115663 108545 97598 88655 86493 93757 92765 88423 84635
13250 84635 81706 81504 73803 71003 58928 42622 32261 49359 89409 104571 125513 165128 242778
13237 242778 336804 398300 412329 374050 302610 247697 221933 230010 279800 368277 546040
$$ packed form
13324A98923k6851k9095l3074j2354j08K0386O3838N4694M6513J7175k4066m6472
13312B29509m3702k4559k7597l2089j2596k1708p709K831K437J7609J4844q738
13300H8532q957j949O032m618L217L538q695p05J3311l569K7491L1127J4555p399
13286A51911J49K2172M7908P0940Q9237M6816k4550m4512m4626m5971k7032O419
13274B48861O2686J03856J64061J64450L4739n0614j21044j60405j32345r2884
13264B21361m9878l5746j8415N214m86o387p118j0947q943k162P264r92m342l788
13250H4635k929k02p701k800j2075j6306j0361J7098M0050J5162K0942L9615P7650
13237B42778R4026O1496J4029l8279p1440n4913k5764Q077M9790Q8477J77763
$$ plain form
13226 546040 723108 791575 751687 646074 483353 350537 233376 160655 134133 134904 119084
13215 119084 102329 107473 86254 70389 55289 50374 55890 61053 53841 50415 53174 57597 49265
13202 49265 52332 48279 37860 36034 38739 31390 37765 60757 81144 85300 117124 145868 149251
13189 149251 141374 114487 88677 94473 100989 106446 135398 182031 232406 266044 251207 229312
13177 229312 184430 134063 98283 88947 81709 76854 65949 48460 44601 39546 39778 37418 27812
13164 27812 11591 19232 26106 26677 21488 4381 -15546 -13531 16366 34857 30151 16069 20222
13151 20222 32743 38281 43052 34983 41410 38499 28794 3541 5489 12221 -6305 -9322 -3538 -8681
13137 -8681 -7964 -4342 -4288 3751 -15 7195 8829 4903 16369 14491 8026 -11075 -12910 -3268 7715
$$ packed form
13226E46040J77068O8467l9888j05613j62721j32816j17161p2721k6522P71j5820
13215A19084j6755N144k1219j5865j5100m915N516N163p212l426K759M423q332
13202D9265L067m053j0419j826K705p349O375K2992K0387M156L1824K8744L383
13189A49251p877k6887k5810N796O516N457K8952M6633N0375L3638j4837k1895
13177B29312m4882n0367l5780r336p238m855j0905j7489l859n055K32k360r606
13164B7812j6221P641O874N71n189j7107j9927K015K9897J8491m706j4082M153
13151B0222J2521N538M771q069O427k911r705k5253J948O732j8526l017N784n143
13137h681P17L622N4Q039l766P210J634l926J1466j878o465j9101j835R642J0983
$$ plain form
13122 7715 17000 21955 13339 9648 -3698 -22115 -28967 -30203 -20078 -10320 -1872 -8344 -7583 7978
13108 7978 26251 14481 5515 22700 28514 19804 7821 -2734 -7529 -234 -7107 -6723 5561
13095 5561 20112 15191 5199 9274 24428 34606 24481 15772 23327 14994 667 -10463 -18822
13082 -18822 6768 20129 -1254 282 9141 9118 18154 27002 18808 11642 18583 23949 22299 14608
13068 14608 2539 -3625 -38 2312 -6228 -5951 -5510 -11765 -18444 -4676 5914 12441 8698 22716
13054 22716 24948 13412 7965 15527 7912 -6702 -8390 -1627 -1388 -12730 -16805 -11538 4860 15774
13040 15774 10671 6476 11754 -6327 -18832 -12457 3963 23187 31796 30434 25027 19979 19317 10605
13026 10605 -1369 -4741 -8267 6626 5413 3853 10876 20160 34101 26528 27747 20072 -2682
$$ packed form
13122G715R285M955q616l691j3346j8417o852j236J0125R758Q448o472P61J5561
13108G978J8273j1770q966J7185N814q710j1983j0555m795P295o873L84J2284
13095E561J4551m921r992M075J5154J0178j0125q709P555q333j4327j1130q359
13082a8822K5590J3361k1383J536Q859k3R036Q848q194p166O941N366j650p691
13068A4608j2069o164L587K350q540K77M41o255o679J3768J0590O527l743J4018
13054B2716K232j1536n447P562p615j4614j688O763K39j1342m075N267J6398J0914
13040A5774n103m195N278j8081j2505O375J6420J9224Q609j362n407n048o62q712
13026A0605j1974l372l526J4893j213j560P023R284J3941p573J219p675k2754
$$ plain form
13013 -2682 5338 4948 250 -2639 -13820 -13049 6467 18967 1172 1651 32056 48847 70561 78039
12999 78039 82537 81098 62353 27655 9524 2185 13936 29454 13856 6760 27175 33602 30382
12986 30382 27538 24695 27098 21256 12133 10437 19050 13683 -5841 -4441 5203 13741 13786 26456
12972 26456 33496 11936 2858 4025 14469 18270 19927 26691 18508 16099 4865 13024 18472 21911
12958 21911 21065 17323 -8303 -17199 -8984 2111 5776 -4534 529 5503 18 -23010 -21358 -12414
12944 -12414 -13301 -4154 3227 8902 9202 12253 14234 13334 14197 4401 4720 4678 2325 7914 29138 34159
12928 34159 19091 13961 13709 11276 3321 719 -10957 -9476 3446 -11161 -25164 -25765 -18727 -11792
12914 -11792 -1780 6157 8787 6844 -2779 -1125 8141 -471 886 16478 20052 19287 6805 -2431
$$ packed form
13013b682Q020l90m698k889j1181P71J9516J2500j7795M79L0405J6791K1714P478
12999G8039M498j439j8745l4698j8131p339J1751J5518j5598p096K0415O427l220
12986C0382k844k843K403n842r123j696Q613n367j9524J400R644Q538M5J2670
12972B6456P040k1560r078J167J0444L801J657O764q183k409j1234Q159N448L439
12958B1911q46l742k5626q896Q215J1095L665j0310N063M974n485k3028J652Q944
12944a2414q87R147P381N675L00L051J981r00Q63r796L19m2k353N589K1224N021
12928C4159j5068n130k52k433p955k602j1676J481J2922j4607j4003o01P038O935
12914a1792J0012P937K630j943r623J654R266q612J357J5592L574p65j2482r236
$$ plain form
12900 -2431 -5593 -6045 -4766 -10390 -532 597 26008 29732 5712 -869 -2975 -12796 -22699 -21143
12886 -21143 -20010 -19432 -6038 2253 -8302 -18525 -6065 -39 -6880 -14606 -24067 -21130 -12788 -1177
12872 -1177 2580 -2887 -7613 -8255 -6765 -13224 -14561 -8884 7071 23354 27892 21456 9570 6376
12858 6376 3445 11989 22252 9407 10322 7962 15126 15682 227 2905 7481 13884 19246 -24275
12844 -24275 -21497 -5738 -3788 3464 6931 -9018 -3920 -1699 -2672 6872 9178 10286 5515 6005
12830 6005 -5267 -11129 -10166 -12536 -15329 -6532 7260 10342 6441 8389 10758 12712 7346 -3941
12816 -3941 9626 18278 12647 5844 3911 12018 10481 9128 7340 22652 30286 11097 10512 19050
12802 19050 18293 29549 19634 6973 11264 7714 650 -10485 -1816 1867 1979 2533 -8899 -12821
$$ packed form
12900b431l162m52J279n624R858J129K5411L724k4020o581k106r821r903J556
12886b1143J133N78J3394Q291j0555j0223J2460O026o841p726r461K937Q342J1611
12872a177L757n467m726o42J490o459j337N677J5955J6283M538o436j1886l194
12858F376k931Q544J0263j2845R15k360P164N56j5455K678M576O403N362m3521
12844b4275K778J5759J950P252L467j5949N098K221r73R544K306J108m771M90
12830F005j1272n862R63k370k793Q797J3792L082l901J948K369J954n366j1287
12816c941J3567Q652n631o803j933Q107j537j353j788J5312P634j9189n85Q538
12802A9050p57J1256r915j2661M291l550p064j1135Q669L683J12N54j1432l922
$$ plain form
12788 -12821 3477 1363 -2759 -17247 -10361 3463 13039 13113 -2834 -13592 -16732 -9025 11243
12775 11243 298 -1317 215 -19344 -15536 -404 -10803 -6729 9088 15412 -2722 -12190 -12806
12762 -12806 -1981 -6780 4097 11581 20159 12243 10896 25885 4930 25 5642 -4063 8524
12749 8524 2708 10324 33519 42316 32831 15611 2651 4132 2272 -1272 -1234 -17605 -24663 -11078
12735 -11078 13149 27637 27211 8846 -7138 -9204 -12436 -4813 -1755 -6810 2236 9146 3370 2582
12721 2582 -9365 -8947 -7849 -2016 -13760 -11492 7715 11776 7557 16041 12424 8433 7968 9117
12707 9117 1687 4067 4368 13165 18190 16100 22626 11640 3999 8618 2400 -7866 -5384 -6659
12693 -6659 -16439 -15619 -13626 -4778 2526 -3882 -18296 -23422 -12512 -5496 -15069 -1317 20238 31006
$$ packed form
12788a2821J6298k114m122j4488O886J3824R576P4j5947j0758l140P707K0268
12775A1243j0945j615J532j9559L808J5132j0399M074J5817O324j8134r468o16
12762a2806J0825m799J0877P484Q578p916j347J4989k0955m905N617r705J2587
12749H524n816P616K3195Q797r485j7220j2960J481j860l544L8j6371p058J3585
12735a1078K4227J4488m26j8365j5984k066l232P623L058n055R046O910n776p88
12721B582j1947M18J098N833j1744K268J9207M061m219Q484l617l991m65J149
12707I117p430K380L01Q797N025k090O526j0986p641M619o218j0266K482j275
12693f659r780Q20J993Q848P304o408j4414n126J0910P016r573J3752K1555J0768
$$ plain form
12679 31006 36098 23313 12369 3597 -9927 -21814 -11881 6566 7996 4024 -3730 -14022 -9158
12666 -9158 -9374 -8573 11422 15782 19976 12779 7830 -13611 -36986 -23997 -10973 -3730 75 -6439
12652 -6439 -20869 -29462 -22031 -13535 -126 -5962 -24390 -12122 -14971 -4285 -373 1725 -5814
12639 -5814 6381 562 -5655 -6676 9890 20281 7514 207 -10549 -24637 -24403 -15050 10575
12626 10575 17877 4627 -1986 246 -7642 55 -317 2824 -5811 -8502 -12222 -24437 -31540 -25542
12612 -25542 -19643 -6641 -18485 -17933 6476 6927 -6029 -1898 -2217 17789 24966 25189 17423 15428
12598 15428 165 -15347 -15645 1029 -618 12211 15338 13672 12611 -3654 -16906 -15096 -6082
12585 -6082 10609 11579 10144 6209 17486 13447 4247 -6785 -7840 -8363 -20883 -19266 -13664 -8172
$$ packed form
12679C1006N092j2785j0944q772j3524j1887R933J8447J430l972p754j0292M864
12666i158k16Q01J9995M360M194p197m949k1441k3375J2989J3024P243L805o514
12652f439j4430q593P431Q496J3409n836j8428J2268k849J0686L912K098p539
12639e814J2195n819o217j021J6566J0391j2767p307j0756j4088K34R353K5625
12626A0575P302j3250o613K232p888P697l72L141q635k691l720j2215p103N998
12612b5542N899J3002j1844N52K4409M51j2956M131l19K0006P177K23p766j995
12598A5428j5263j5512k98J6674j647J2829L127j666j061j6265j3252J810R014
12585f082J6691R70j435l935J1277m039r200j1032j055n23j2520J617N602N492
$$ plain form
12571 -8172 1185 5918 -1647 -1924 459 11904 20575 11991 7080 9686 19125 16400 15574 21825 27609
12556 27609 21851 -363 -20912 -16543 -4290 6314 -8104 -16526 -5122 7914 12040 6576 -19447
12543 -19447 -21297 -8112 4789 -11641 -8223 2170 19520 12242 6479 13520 -7393 -24270 -13137
12530 -13137 4606 4933 -4564 205 3939 864 5041 11928 17099 22703 32670 17524 15029 22372
12516 22372 15694 -3743 -9776 -16311 -10690 8189 14351 8792 2565 4300 2595 6803 -645 -22807
12502 -22807 -23923 -9687 -781 -646 14019 3546 -9422 -22326 -33522 -35603 -35913 -24931 -6806
12489 -6806 7926 2294 4942 8304 -9858 -37776 -39888 -35436 -16358 -3059 7305 1502 8663
12476 8663 4136 -2845 8185 7519 9549 1692 7759 5383 10276 9559 -3985 -6405 -9006 1551
$$ packed form
12571h172R357M733p565k77K383J1445Q671q584m911K606R439k725q26O251N784
12556B7609n758k2214k0549M369J2253J0604j4418q422J1404J3036M126n464k6023
12543a9447j850J3185J2901j6430L418J0393J7350p278n763P041k0913j6877J1133
12530a3137J7743L27r497M769L734l075M177O887N171N604R967j5146k495P343
12516B2372o678j9437o033o535N621J8879O162n559o227J735j705M208p448k2162
12502b2807j116J4236Q906J35J4665j0473j2968j2904j1196k081l10J0982J8125
12489f806J4732n632K648L362j8162k7918k112M452J9078J3299J0364n803P161
12476H663m527o981J1030o66K030p857O067k376M893p17j3544k420k601J0557
$$ plain form
12462 1551 -13641 -8049 -19329 -35157 -45508 -34043 -11965 6225 16612 16600 3207 3802 16613
12449 16613 15299 15664 4549 -6790 -1762 405 -10783 4362 4422 -2120 6979 8729 12534 -4455
12435 -4455 -12568 -8957 -17602 -16524 -7351 -1278 4310 -2968 4278 12111 2605 -11639 -8823 -4498
12421 -4498 -6377 -9586 -17542 -24134 -17379 -12256 -11080 -9828 -3652 9079 9314 5751 15715 1680
12407 1680 -4900 -8560 -15299 -361 12045 4752 -16977 -23434 -17996 -10409 -2404 -4918 -11121 -3324
12393 -3324 14683 13616 -3238 -29821 -21803 3862 6659 385 8563 3764 -1282 -2035 -2071 6862
12379 6862 10206 1545 -20229 -24285 -3899 -3653 -21034 -17147 -12268 -6929 -15247 -8866 -6473 -726
12365 -726 -13643 -18251 -7918 1632 44 -13927 -16115 -5822 -4081 -4285 3472 9120 4560 2632
$$ packed form
12462A551j5192N592j1280j5828j0351J1465K2078J8190J0387j2j3393N95J2811
12449A6613j314L65j1115j1339N028K167j1188J5145O0o542R099J750L805j6989
12435d455q113L611q645J078R173O073N588p278P246P833r506j4244K816M325
12421d498j879l209p956o592O755N123J176J252O176J2731K35l563R964j4035
12407A680o580l660o739J4938J2406p293k1729o457N438P587Q005k514o203P797
12393c324J8007j067j6854k6583Q018K5665K797o274Q178m799n046p53l6Q933
12379F862L344q661k1774m056K0386K46j7381L887M879N339q318O381K393N747
12365g26j2917m608J0333R550j588j3971k188J0293J741k04P757N648m560j928
$$ plain form
12351 2632 1118 -10680 -30983 -27140 -1302 -3032 10138 15836 10191 11876 13750 4795 7239 9295
12337 9295 20916 7735 -1344 10631 8808 4929 -5841 -20703 -28498 -12929 -253 34 -5585
12324 -5585 260 -7388 -140 7146 -491 -10485 -10562 -3259 3674 12137 23467 19110 10760 8425 15567
12309 15567 16953 13585 959 8242 13309 6741 20576 18093 -3664 -20405 -19966 -28160 -24464 -14767
12295 -14767 -14247 -13826 -9328 -15740 -13170 5705 11303 3788 -10061 -13544 -8964 11020 26747 16749
12281 16749 6015 9178 -919 5515 -588 4478 3556 2569 2705 10445 12067 7613 2288 -5094 -2945
12266 -2945 3025 11693 14394 6736 14588 19069 28548 34589 16444 1701 -1819 5052 594 5772
12252 5772 -466 2752 11632 13936 2043 -20074 -32284 -24258 -14584 -14635 -12791 -20182 -28902 -30142
$$ packed form
12351B632j514j1798k0303L843K5838j730J3170N698n645J685J874q955K444K056
12337I295J1621j3181r079J1975j823l879j0770j4862p795J5569J2676K87n619
12324e585N845p648P248P286p637r994p7P303O933Q463J1330m357q350k335P142
12309A5567J386l368j2626P283N067o568J3835k483k1757j6741M39q194L696R697
12295a4767N20M21M498o412K570J8875N598p515j3849l483M580J9984J5727r998
12281A6749j0734L163j0097O434o103N066r22r87J36P740J622m454n325p382K149
12266b945N970Q668K701p658P852M481R479O041j8145j4743l520O871m458N178
12252E772o238L218Q880K304j1893k2117j2210Q026R674n1J844p391q720j240
$$ plain form
12238 -30142 -20377 -4863 -1537 -7971 -10019 -15204 -17523 -18658 -17565 -26793 -15453 -7095 4245 11952
12224 11952 13848 16872 2667 12191 23287 8392 -7243 -12380 -15717 580 6522 3605 -6136
12211 -6136 -8225 10055 16100 9978 3790 7351 3079 -8038 -129 26992 34642 31115 30164 21487
12197 21487 12300 -7684 -1274 5058 20374 24526 17718 20399 10198 -4024 -12243 -10386 51
12184 51 7231 21716 34283 25606 13194 6949 14508 15078 7391 15565 15002 5011 4684 12436 8571
12169 8571 2028 3513 9841 3885 5440 4288 9167 12116 5650 8686 -4041 -9042 -10038 -7684 -4184
12154 -4184 1775 -1971 -1491 -5360 -12478 -2733 -6520 3889 -6246 -9942 -7532 -8475 -19327 -20955
12140 -20955 -20834 -18387 -10247 9537 27382 20825 13515 24021 10602 -7831 -5697 13257 18415
$$ packed form
12238c0142R765J5514L326o434k048n185k319j135J093r228J1340Q358J1340P707
12224A1952J896L024j4205R524J1096j4895j5635n137l337J6297N942k917r741
12211f136k089J8280O045o122o188L561m272j1117P909K7121P650l527r51q677
12197B1487r187j9984O410O332J5316M152o808K681j0201j4222q219J857J0437
12184E1P180J4485J2567q677j2412o245P559N70p687Q174n63r991l27P752l865
12169H571o543J485O328n956J555j152M879K949o466L036j2727n001r96K354L500
12154d184N959l746M80l869p118R745l787J0409j0135l696K410r43j0852j628
12140b0955J21K447Q140J9784J7845o557p310J0506j3419j8433K134J8954N158
$$ plain form
12127 18415 7221 1406 -94 -4279 -3801 -992 6904 -9477 -17133 -21551 -21962 -27804 -15607 -5443
12113 -5443 -16413 -2356 5157 -3803 -4675 -14933 -12120 3229 916 -2019 194 2630 9647 11721
12099 11721 -9187 -18591 -8217 12629 12737 11341 11369 10915 11674 9544 23760 26879 18116 27244 15399
12084 15399 2216 7994 13284 12362 -1149 -4611 10327 8803 9799 14102 22462 25422 31503 33728
12070 33728 28230 28927 29834 37101 44097 26956 30393 49037 60582 60426 75787 110548 130120 120143
12056 120143 101957 59179 32278 34098 33445 18562 18243 28053 7719 3756 13795 22566 16330
12043 16330 858 10751 21916 19942 26811 30435 21322 20289 19889 -2696 -6739 1913 16770 17696
12029 17696 12154 5440 -2766 1614 12955 11588 -1149 -11022 -14148 -12512 255 9778 14851 21109
$$ packed form
12127A8415j1194n815j500m185M78K809P896j6381p656m418m11n842J2197J0164
12113e443j0970J4057P513q960q72j0258K813J5349k313k935K213K436P017K074
12099A1721k0908r404J0374K0846J08j396K8m54P59k130J4216L119q763R128j1845
12084A5399j3183N778N290r22j3511l462J4938j524R96M303Q360K960O081K225
12070C3728n498O97R07P267O996j7141L437J8644J1545j56J5361L4761J9572r977
12056A20143j8186m2778k6901J820o53j4883l19R810k0334l963J0039Q771o236
12043A6330j5472R893J1165j974O869L624r113j033m00k2585m043Q652J4857R26
12029A7696n542o714q206M380J1341j367j2737r873l126J636J2767R523N073O258
$$ plain form
12015 21109 27269 16978 10008 15998 -1453 -10154 -5394 -20037 -30236 -18424 -9739 -4357 11152
12002 11152 10166 450 1111 4426 5853 2966 10644 15511 13185 23729 23285 14918 9523 8680 18319
11987 18319 7676 5614 9270 3236 -7005 -8323 -19936 -41324 -21432 -448 -7522 -12203 -13421
11974 -13421 -6511 -8746 -7443 -15817 -12303 -5960 -6253 -2999 -588 3824 -5129 11304 28036 23286
11960 23286 -19 -12152 -11528 1004 -14624 -7327 5313 -6793 -19082 -2966 -5310 -18852
11948 -18852 -17517 -3438 5932 14933 16847 29874 15875 12831 22996 4815 -3813 -2637 -5334
11935 -5334 -8751 -12581 3738 444 14121 21556 22636 31595 56583 88561 165091 284911 419007
11922 419007 499518 479430 419268 315699 214128 145077 91190 79142 58252 54658 34750
$$ packed form
12015B1109O160j0291o970N990j7451q701M760j4643j0199J1812Q685N382J5509
12002A1152r86r716O61L315J427k887P678M867k326J0544m44q367n395q43R639
11987A8319j0643k062L656o034j0241j318j1613k1388J9892K0984p074m681j218
11974a3421O910k235J303q374L514O343k93L254K411M412q953J6433J6732m750
11960B3286k3305j2133O24J2532j5628P297J2640j2106j2289J6116k344j3542
11948a8852J335J4079R370R001J914J3027j3999l044J0165j8181q628J176k697
11935e334l417l830J6319l294J3677P435J080Q959K4988L1978P6530J19820J34096
11922D19007Q0511k0088o0162j03569j01571o9051n3887j2048k0890l594j9908
$$ plain form
11911 34750 34185 23268 9469 18309 23371 14822 100 -8789 -11752 6250 15966 22648 34831
11898 34831 47194 25173 12349 15734 22457 21401 17921 9713 13963 15799 13556 21567 22529 26749
11884 26749 25429 17515 22543 19126 1164 -14380 -22478 -24783 -10862 -2105 11737 25450 18013
11871 18013 2169 -15676 -5559 4632 -2520 -17718 -17479 -7260 -6150 -4675 -9019 -19093 -8383
11858 -8383 -14224 -16568 -1196 -7043 -11758 -1016 20507 27982 13697 8486 -19949 -20616 2869
11845 2869 2125 -23021 -35335 -30227 -13005 -10594 -8233 -22006 -35659 -37081 -31184 -30361 -23293 -15435
11831 -15435 -4467 12963 31883 32967 28489 4574 182 -8035 -16903 -11617 -20565 -20217 -12291 -8816
11817 -8816 -7519 -3734 6985 9108 10756 12452 17051 18570 26488 14443 9658 6853 7428 -1443
$$ packed form
11911C4750n65j0917j3799Q840N062q549j4722q889k963J8002R716O682J2183
11898C4831J2363k2021j2824L385O723j056l480q208M250J836k243Q011R62M220
11884B6749j320p914N028l417j7962j5544q098k305J3921Q757J3842J3713p437
11871A8013j5844j7845J0117J0191p152j5198K39J0219J110J475m344j0074J0710
11858h383n841k344J5372n847m715J0742K1523P475j4285n211k8435o67K3485
11845B869p44k5146j2314N108J7222K411K361j3773j3653j422N897Q23P068P858
11831a5435J0968J7430J8920J084m478k3915m392q217q868N286q948L48P926L475
11817h816J297L785J0719K123J648J696M599J519P918j2045m785k805N75q871
$$ plain form
11803 -1443 1634 8504 14936 19982 14488 16151 4849 -5294 1638 1325 3475 1910 3953 8370
11789 8370 2290 18279 22281 25412 30682 34470 51325 44649 17174 11848 15558 1047 -11684
11776 -11684 -13092 -2739 -7729 -17027 -11839 -4246 -5181 10158 6130 -5443 -15569 -13184 -22868 -24825
11762 -24825 -15726 -8561 -18281 -15895 -23627 -31623 -34486 -20214 -5349 -878 571 18335 6839
11749 6839 3984 -987 -5533 -322 5275 17736 29868 37611 16484 11406 -3943 3048 6242 -1016
11735 -1016 -5014 -7517 -18132 -39084 -44316 -28297 -10938 -16592 -15427 -4718 -3569 455 2070
11722 2070 -6723 -11382 -12924 -9752 14946 11373 702 -3931 -3446 -5478 -1362 4304 -2524 -10743
11708 -10743 -22027 -21725 -22768 -18968 -17848 -8178 -3292 12250 20366 32054 21354 10297 3396
$$ packed form
11803a443L077O870O432N046n494J663j1302j0143O932l13K150j565K043M417
11789H370o080J5989M002L131N270L788J6855o676k7475n326L710j4511j2731
11776a1684j408J0353m990r298N188P593r35J5339m028j1573j0126K385r684j957
11762b4825R099P165r720K386p732p996k863J4272J4865M471J449J7764j1496
11749F839k855m971m546N211N597J2461J2132P743k1127n078j5349O991L194p258
11735a016l998k503j0615k0952n232J6019J7359n654J165J0709J149M024J615
11722B070q793m659j542L172K4698l573j0671m633M85k032M116N666o828q219
11708a0743j1284L02j043L800J120R670M886J5542Q116J1688j0700j1057o901
$$ plain form
11695 3396 6778 7594 6868 9963 1780 14330 18412 9647 13262 7339 -456 -4664 -7418 -6063 -3762
11680 -3762 9035 7750 8304 8646 -3104 -8910 -12573 -24936 -29706 -22707 -25841 -10813 6839 8467
11666 8467 5211 -11039 -14034 -15810 -13441 -10481 -8552 -15363 -21268 -33719 -24368 -14872 -8994 -9270
11652 -9270 -7382 -8398 -17005 -23763 -20438 -152 -4509 -13536 -17615 -679 8601 16314 11764 12298
11638 12298 24263 13431 -1408 -7846 -13329 -13131 -11027 -6309 -13301 -21069 -2734 -399 -1204 -7154
11624 -7154 -35112 -49287 -39047 -27440 -27347 -18848 -1385 -5777 -12862 -12232 -8648 -11801 409 14618
11610 14618 7391 975 -21893 -19903 -10283 -1732 5273 16702 13614 14655 20814 1 -15419
11597 -15419 -8918 -4639 -16723 -6632 -1706 13689 29951 25066 24475 22480 18927 1609 -18229
$$ packed form
11695C396L382Q16p26L095q183J2550M082q765L615n923p795m208k754J355K301
11680c762J2797j285N54L42j1750n806l663j2363m770O999l134J5028J7652J628
11666H467l256j6250k995j776K369K960J929o811n905j2451R351R496N878k76
11652i270J888j016q607o758L325K0286m357r027m079J6936R280P713m550N34
11638A2298J1965j0832j4839o438n483J98K104M718o992p768J8335K335q05n950
11624g154k7958j4175J0240J1607R3Q499J7463m392p085O30L584l153J2210J4209
11610A4618p227o416k2868J990R620Q551P005J1429l088J041O159k0813j5420
11597a5419O501M279j2084J0091M926J5395J6262m885n91j995l553j7318j9838
$$ plain form
11584 -18229 -20707 -12301 -14366 -18547 -13949 -9104 -10768 10308 20149 14110 13415 8877 13123 18220
11570 18220 16350 869 3090 11522 -4505 -16204 -23232 -1651 12762 10609 12381 5922 -3975
11557 -3975 -1928 5714 22892 26927 20425 40098 31596 18942 14911 19406 21289 7489 -6192
11544 -6192 -2713 13039 28046 21357 13923 9412 6985 8114 15799 2730 -12245 -22388 1203
11531 1203 16773 32386 31023 14375 3356 -4087 -22596 -15053 -10860 1193 11313 -7798 -3362
11518 -3362 5090 21133 18000 5021 -4915 -15636 -18641 -12853 -28794 -34065 -19600 -25410 -28577
11505 -28577 -26110 -24569 -17630 -11503 -21393 -17999 1971 5730 4956 -6691 -4088 -2950 1261 -6353
11491 -6353 -2311 9018 -5649 -12274 -5985 7139 -4814 -18103 -11665 2868 13923 -5860 -11819
$$ packed form
11584a8229k478Q406k065m181M598M845j664K1076R841o039o95m538M246N097
11570A8220j870j5481K221Q432j6027j1699p028K1581J4413k153J772o459r897
11557c975K047P642J7178M035o502J9673q502j2654m031M495J883j3800j3681
11544f192L479J5752J5007o689p434m511k427J129P685j3069j4975j0143K3591
11531A203J5570J5613j363j6648j1019p443j8509P543M193J2053J0120j9111M436
11518c362Q452J6043l133j2979r936j0721l005N788j5941n271J4465n810l167
11505b8577K467J541O939O127r890L394J9970L759p74j1647K603J138M211p614
11491f353M042J1329j4667o625O289J3124j1953j3289O438J4533J1055j9783n959
$$ plain form
11478 -11819 -16857 -17586 -4083 4107 8619 16358 10680 -8615 -18318 -6061 -1655 1308 7152 -5593
11464 -5593 -17935 -21788 -16945 -19421 -23636 -27671 -33407 -23426 -10438 -5185 2183 3137 -5254 -114
11450 -114 12309 11747 -8356 -4735 -17635 -26662 -24703 -12119 -4567 1534 1570 -4709 6317 24770
11436 24770 18623 16182 18723 14129 14737 -1367 -7407 3196 -3022 -3561 -925 10893 20520 10038
11422 10038 -9914 -8548 -13931 -40986 -41524 -15980 -3419 -11958 -10435 -7539 3058 1777 10749
11409 10749 10902 5037 -9002 2453 6075 -7987 -6429 -2524 55 2550 4991 -5631 -4961 -11922
11395 -11922 -16823 -11866 -13969 -14829 -14105 -12418 -21720 -22259 -7753 -8282 -6290 -1359 11766 7567 -7515
11380 -7515 -19937 -20975 -19128 -21497 -8627 2990 -2710 57 -2109 2053 -5947 -23971 -23699 -20492
$$ packed form
11478a1819n038p29J3503Q190M512P739n678j9295r703J2257M406K963N844j2745
11464e593j2342l853M843k476m215m035n736R981J2988N253P368R54q391N140
11450a14J2423n62k0103L621j2900r027J959J2584P552O101L6o279J1026J8453
11436B4770o147k441K541m594O08j6104o040J0603o218n39K636J1818R627j0482
11422A0038j9952J366n383k7055n38K5544J2561q539J523K896J0597j281Q972
11409A0749J53n865j4039J1455L622j4062J558L905K579K495K441j0622O70o961
11395a1922m901M957k103q60P24J687r302n39J4506n29J992M931J3125m199j5082
11380g515j2422j038J847k369J2870J1617n700K767k166M162q000j8024K72L207
$$ plain form
11366 -20492 -21570 -13808 -12322 -11800 -16950 -20999 -18031 -7273 13050 13918 10649 14207 15573 34385
11352 34385 46762 35969 19227 11131 7083 -3049 -13361 -19671 -19964 -20121 -11538 -2113 -1085 16146
11338 16146 24723 7208 -9696 -15821 -21759 -21856 -13137 -2019 -4286 -7132 -505 997 -6198 -2266
11324 -2266 7902 14151 10866 2544 -4536 -11119 -5168 1510 10126 10093 8937 10195 18249 14901 19446
11309 19446 24258 30495 27718 12541 8055 12531 11884 10690 18771 -880 -17359 3909 19187
11296 19187 10725 4469 12339 7581 1214 18917 28655 32869 23753 31958 31951 32538 17885 6447 4003
11281 4003 15696 30334 21923 24020 26650 19831 8208 -3645 8042 20153 13351 12189 14768
11268 14768 20150 29288 15498 11025 11320 24748 13644 -1839 -2441 -7766 -9896 6982 13602 12430
$$ packed form
11366b0492j078P762J486N22n150m049K968J0758K0323Q68l269L558J366J8812
11352C4385J2377j0793j6742q096m048j0132j0312o310k93j57Q583R425J028J7231
11338A6146Q577j7515j6904o125n938r7Q719J1118k267k846O627J502p195L932
11324b266J0168O249l285q322p080o583N951O678Q616l3j156J258Q054l348M545
11309A9446M812O237k777j5177m486M476o47j194Q081j9651j6479K1268J5278
11296A9187q462o256P870m758o367J7703R738M214r116Q205pN87j4653j1438k444
11281D003J1693J4638q411K097K630o819j1623j1853J1687J2111o802j162K579
11268A4768N382R138j3790m473K95J3428j1104j5483o02n325k130J6878O620j172
$$ plain form
11254 12430 -4622 -6950 9111 17493 9545 14766 11190 3044 2821 2594 -2498 -1214 2735 -1752
11240 -1752 -12003 -5212 7517 -122 -4787 2891 -14196 -16837 -21761 -30765 -12434 8240 14763
11227 14763 9725 -1363 -5096 -4664 -1123 6292 3679 -12671 -17766 -17903 -20432 -11838 578 -2334
11213 -2334 -5368 6018 7673 -1459 -5281 -2888 654 -3447 -18358 -10391 -4959 262 -5671 -21410
11199 -21410 -26713 -11086 -7388 -8254 -15155 -8588 8757 12149 15224 21064 8325 -7254 -16836 -13423
11185 -13423 -16000 -15154 -23118 -17556 -5171 -6658 -1350 7776 3593 15738 9956 -7134 3137 17837
11171 17837 27461 23836 12536 23153 20530 12463 1115 -8440 -17796 -11980 -8121 -17720 -22791 -3720
11157 -3720 18087 12473 5143 11298 -3861 -16074 1126 16352 2019 -4577 -12057 8011 15177
$$ packed form
11254A2430j7052k328J6061Q382p948N221l576q146k23k27n092J284L949m487
11240a752j0251O791J2729p639m665P678j7087k641m924r004J8331K0674O523
11227A4763n038j1088l733M32L541P415k613j6350n095j37k529Q594J2416k912
11213b334l034J1386J655r132l822K393L542m101j4911P967N432N221n933j5739
11199b1410n303J5627L698q66o901O567J7345L392L075N840j2739j5579r582L413
11185a3423k577Q46p964N562J2385j487N308R126m183J2145n782j7090J0271J4700
11171A7837R624l625j1300J0617k623q067j1348r555r356N816L859r599n071J9071
11157c720K1807n614p330O155j5159j2213J7200J5226j4333o596p480K0068P166
$$ plain form
11144 15177 4473 -1459 -9945 -20645 -15220 -6924 -4172 -5768 -4437 -1131 -12931 -1967 -2030 -14643
11130 -14643 -30615 -32615 -18975 -5594 -5533 -16429 -18448 -8341 -4284 -9527 -25866 -39342 -29428
11117 -29428 -22071 -19685 -15896 -20496 -20843 -28666 -32560 -30927 -23287 -20156 -24278 -17310 334 2780
11103 2780 -427 4226 7595 5838 12118 3289 3624 15308 22352 1876 1131 -103 1587 5367 20886
11088 20886 13301 18158 1455 -13236 -2321 7206 11514 -66 -15221 -16137 -14980 -22755 -23269 -29715
11074 -29715 -25113 -42933 -53571 -33668 -16318 387 11083 3652 -2559 -12432 -14560 -14718 -18156
11061 -18156 -28626 -19894 -2694 10407 11508 5205 1206 -3867 -3849 -4153 -2528 -4603 -7998 -20474
11047 -20474 -21802 -17167 -10168 -3574 6210 3107 -13341 -13107 -14878 -17576 -20811 -21883 -20332 -20247 -674
$$ packed form
11144A5177j0704n932q486j0700N425Q296K752j596J331L306j1800J0964o3j2613
11130a4643j5972k000J3640J3381O1j0896k019J0107M057n243j6339j3476R914
11117b9428P357K386L789m600l47p823l894J633P640L131m122O968J7644K446
11103B780l207M653L369j757O280q829L35J1684P044k0476p45j234J690L780J5519
11088B0886p585M857j6703j4691J0915R527M308j1580j5155r16J157p775n14o446
11074b9715M602j7820j0638J9903J7350J6705J0696p431o211r873k128j58l438
11061a8156j0470Q732J7200J3101J101o303l999n073J8l04J625k075l395j2476
11047b0474j328M635O999O594R784l103j6448K34j771k698l235j072J551Q5J9573
$$ plain form
11032 -674 17227 21898 17463 11093 6886 -1773 6691 9683 10834 10432 13786 10982 20244 19456 -10471
11017 -10471 -11949 -277 -7661 -12451 -10726 6140 10331 13951 20875 11491 11714 17015 22760 32473
11003 32473 36943 30578 13983 13856 8990 1720 8624 5753 8416 1241 -5248 -4847 3969 -4623 -14393
10988 -14393 -411 13640 6384 -5440 -14911 -18835 -4889 3061 -1929 -13744 -15985 -18009 2928
10975 2928 6717 -16873 -18579 -9957 -8654 4365 14241 10186 22195 11642 1911 -9128 -18981
10962 -18981 -4420 -7434 -6857 8179 5505 1517 -1761 -3064 -12900 -11201 -22157 -20113 -15359 -25009
10948 -25009 -16751 -9656 -5975 -10091 -28229 -19549 -10229 -10879 -12210 -6504 18737 25039 27929 10186
10934 10186 3194 -746 12142 18967 17296 14685 8944 2618 -7248 -27220 -21566 9091 12751 9430
$$ packed form
11032f74J7901M671m435o370m207q659Q464K992J151m02L354k804R262p88k9927
11017a0471j478J1672p384m790J725J6866M191L620O924r384K23N301N745R713
11003C2473M470o365j6595j27m866p270O904k871K663p175o489M01Q816q592r770
10988a4393J3982J4051p256j1824r471l924J3946P950m990j1815k241k024K0937
10975B928L789k3590j706Q622J303J3019R876m055J2009j0553r731j1039r853
10962a8981J4561l014N77J5036k674l988l278j303r836J699j0956K044M754r650
10948b5009Q258P095L681m116j8138Q680R320o50j331N706K5241O302K890j7743
10934A0186o992l940J2888O825j671k611n741o326r866j9972N654L0657L660l321
$$ plain form
10920 9430 -8769 -11182 -545 14110 14855 12613 20844 20377 23597 4427 -1543 12193 24419 16221
10906 16221 16967 9454 8285 6848 1053 -4291 -2389 -11617 -10999 117 990 15533 31341 22330
10892 22330 2772 -17839 -13158 18424 21791 13996 -3394 -22967 -25989 -38117 -39211 -16100 -14392
10879 -14392 -21008 -19290 -7515 -12663 -12231 -6549 -10156 -3422 -2322 -4262 -8986 -8184 -1721 8706
10865 8706 -2486 4690 3803 -7523 3723 3385 -1252 3478 -9836 -19731 -13755 -10171 -8627 546
10851 546 -1000 -3767 11098 16733 21817 22392 7998 9224 15497 17581 22535 22945 17810 14400 26669
10836 26669 22735 -3201 -21486 -15938 11968 7340 -17325 -26000 -29276 -17587 -3786 4817 14641
10823 14641 14207 20189 12284 966 4572 21891 37639 19728 23180 18351 12472 -277 7759
$$ packed form
10920I430j8199k413J0637J4655P45k242Q231m67L220j9170n970J3736J2226q198
10906A6221P46p513j169j437n795n344J902r228O18J1116Q73J4543J5808r011
10892B2330j9558k0611M681L1582L367p795j7390j9573l022j2128j094K3111J708
10879a4392o616J718J1775n148M32N682l607O734J100j940m724Q02O463J0427
10865H706j1192P176q87j1326J1246l38m637M730j3314r895N976L584J544R173
10851E46j546k767J4865N635N084N75j4394J226O273K084M954M10n135l410J2269
10836B6669l934k5936j8285N548K7906m628k4665q675l276J1689J3801Q603R824
10823A4641m34N982p905j1318L606J7319J5748j7911L452m829n879j2749Q036
$$ plain form
10810 7759 23030 34298 38636 31376 23507 10100 15063 22445 18177 907 -8426 -2050 -10936 -15209
10796 -15209 -18932 -14062 2565 9242 -1739 -2854 -3053 -12891 -19932 -4285 -3623 -6720 539 -11998
10782 -11998 -20006 -26407 -18165 -12084 -5118 -3893 -4651 -5145 -6077 5994 15903 13353 14336 -10387 -20433
10767 -20433 -12715 7388 14402 5093 6082 22688 21603 15726 14525 -1258 979 10493 16159 421
10753 421 6382 12763 25708 27369 28058 20964 12385 18212 18329 20694 16862 3225 3506 13373 2538
10738 2538 -643 8434 15340 23722 18606 1685 1211 4811 1227 -13797 -9656 15803 14416 4599
10724 4599 -5766 -22318 -20140 -12201 -1833 -4135 -13943 -14250 -8690 8343 16319 3811 -747 9529
10710 9529 14575 12450 1205 -2637 -5364 -5257 -3229 -8651 -5311 8516 16109 15102 7494 -12417
$$ packed form
10810G759J5271J1268M338p260p869j3407M963P382m268j7270r333O376q886m273
10796a5209l723M870J6627O677j0981j115j99r838p041J5647O62l097P259j2537
10782a1998q008o401Q242O081O966J225p58m94r32J2071R909k550R83k4723j0046
10767b0433P718K0103P014r309R89J6606j085n877j201j5783K237R514N666j5738
10753D21N961O381J2945J661O89p094q579N827J17K365l832j3637K81R867j0835
10738B538l181R077O906Q382n116j6921m74L600l584j5024M141K5459j387r817
10724D599j0365j6552K178P939J0368k302r808l07N560J7033P976j2508m558J0276
10710I529N046k125j1245l842k727J07K028n422L340J3827P593j007p608j9911
$$ plain form
10696 -12417 560 1502 2385 5662 18169 22584 25409 14643 5937 1254 8763 -1896 -14195 -19870
10682 -19870 -7489 -8662 -8066 -4294 -5313 5602 11188 16825 12424 -9352 -12724 -20433 -26648 -13469
10668 -13469 -2650 -8716 -491 -1266 5995 14827 9067 9665 25121 13638 -7056 -11361 4696 10249
10654 10249 18323 21278 9419 -2010 -9165 -5817 -5948 -18296 -17096 -12441 -8071 -17937 -9987 12353
10640 12353 18632 9267 -22311 -30149 -8812 -3327 -328 -7500 -5750 -11231 -13753 -15176 -16581 -19831
10626 -19831 -14267 -11430 -4642 -5672 -36 -4361 -10295 1030 -12525 -34363 -36803 -30513 -13795
10613 -13795 -16933 -29648 -19991 -11144 -5771 -8837 -14515 -15890 -14718 -13532 5077 7012 -760 8040
10599 8040 18365 20054 14238 5251 -1294 -2632 -13424 -2712 -1256 -6195 -6288 -7492 -11583 -1274
$$ packed form
10696a2417J2977R42Q83L277J2507M415K825j0766q706m683P509j0659j2299n675
10682a9870J2381j173N96L772j019J0915N586N637m401k1776l372p709o215J3179
10668a3469J0819o066Q225p75P261Q832n760N98J5456j1483k0694m305J6057N553
10654A0249Q074K955j1859j1429p155L348j31j2348J200M655M370r866P950K2340
10640A2353O279r365l1578p838K1337N485K999p172J750n481k522j423j405l250
10626a9831N564K837O788j030N636m325n934J1325j3555k1838k440O290J6718
10613a3795l138j2715R657Q847N373l066n678j375J172J186J8609J935p772Q800
10599H040J0325J689n816q987o545j338j0792J0712J456m939r3j204m091J0309
$$ plain form
10585 -1274 -1440 18335 22630 21599 22739 14247 9445 18814 13295 9714 16846 20883 21180 17609 11343
10570 11343 16144 37439 48024 48007 50422 36587 22776 28092 29527 5641 -17932 -30754 -21523
10557 -21523 -19200 -18498 -11180 -368 -3866 -5031 -6174 1343 12220 -4104 980 -5673 -13518 12357
10543 12357 22310 29088 20325 -4264 -3485 -973 5873 3226 -11337 -13438 7864 13915 5354 -16865
10529 -16865 -27189 -27397 -25691 -27984 -22432 -12625 -10355 6256 16203 17196 16562 -3407 -140 5686
10515 5686 7540 12906 26826 26912 12965 4537 12198 18532 7904 -10576 -6986 -4608 -1908 1694
10501 1694 -318 3883 -1523 -19752 -17965 -5202 -10235 1765 2549 -9576 -11029 -11870 -4750 8406
10487 8406 8267 -1072 337 -12091 -19117 -8093 9595 8384 7495 6382 5123 12929 14300 9438
$$ packed form
10585a274j66J9775M295j031J140q492m802R369n519l581P132M037K97l571o266
10570A1343M801K1295J0585j7K415j3835j3811N316J435k3886k3573j2822R231
10557b1523K323P02P318J0812l498j165j143P517J0877j6324N084o653p845K5875
10543A2357R953O778q763k4589P79K512O846k647j4563k101K1302O051q561k2219
10529a6865j0324k08J706k293N552R807K270J6611R947R93o34j9969L267N826
10515E686J854N366J3920Q6j3947q428P661O334j0628j8480L590K378K700L602
10501A694k012M201n406j8229J787J2763n033J2000P84j2125j453q41P120J3156
10487H406j39r339J409j2428p026J1024J7688j211q89j113j259P806J371m862
$$ plain form
10473 9438 3344 -1632 2488 8540 13931 9472 1570 25865 12752 3816 8669 10065 6867 10602
10459 10602 18623 18151 2786 -12230 -5242 3008 2021 -4239 -5014 -7362 -4225 -4292 -7949 5221 764
10444 764 6451 6110 -7819 -1850 17018 24431 17244 14018 8268 6402 3117 154 4090 3449 17880
10429 17880 22169 23164 19885 26092 25622 25153 27569 22841 9693 -2178 -15167 -10135 -2648 4440
10415 4440 -2583 -2928 2050 -1814 -12257 -10800 -4903 -5121 -10839 -4195 -7850 -5101 -3894 -3632 -7765
10400 -7765 -11666 -15845 -7317 3547 -5041 -15586 -24404 -40286 -29700 -18848 -15950 -12948 7335
10387 7335 12514 14420 13748 15875 18623 17136 16490 11153 3423 -591 1283 1965 -1477 -645 111 13913
10371 13913 13373 7999 -8262 -18892 -15423 13617 19204 4411 1095 7892 15266 20426 30737
$$ packed form
10473I438o094m976M120O052N391m459p902K4295j3113q936M853J396l198L735
10459A0602Q021m72j5365j5016O988Q250r87o260p75k348L137o7l657J3170m457
10444G64N687l41j3929N969J8868P413p187l226n750j866l285k963L936o41J4431
10429A7880M289R95l279O207m70m69K416m728j3148j1871j2989N032P487P088
10415D440p023l45M978l864j0443J457N897k18n718O644l655K749J207K62m133
10400g765l901m179Q528J0864q588j0545q818j5882J0586J0852K898L002K0283
10387G335N179J906o72K127K748j487o46n337p730m014J874O82l442Q32P56J3802
10371A3913n40n374j6261j0630L469K9040N587j4793l316O797P374N160J0311
$$ plain form
10358 30737 30752 23747 20494 -1103 -12158 -11203 -24941 -20928 -15468 -776 24363 26484 23781 9930
10344 9930 -3516 -21718 -12943 -10194 -14310 -22102 -15010 -5072 12563 2616 -4518 -13090 -3046 6921
10330 6921 22980 19514 21480 19179 6016 -6876 5057 8259 3863 -6443 -12732 -7599 -21483
10317 -21483 -23697 -4767 5052 10881 7478 -247 -1674 -7236 -2795 15165 -65 -12156 -13204
10304 -13204 -10083 -6227 -6372 -2041 -13204 -11327 -10080 -3111 -3550 -3509 7795 21219 14217 33025
10290 33025 48808 37333 23000 15343 21420 15637 27231 34652 17011 3789 11044 14278 7389
10277 7389 16945 11810 16985 10306 20500 17579 16487 38453 34377 17795 6121 -5890 -14714
10264 -14714 -9688 -6440 3664 12501 1717 -9284 -12383 -18712 -9751 -1572 10563 18278 17552 9921
$$ packed form
10358C0737J5p005l253k1597j1055R55j3738M013N460J4692K5139K121k703j3851
10344I930j3446j8202Q775K749m116p792P092R938J7635r947p134q572J0044R967
10330F921J6059l466J966k301j3163j2892J1933L202m396j0306o289N133j3884
10317b1483k214J8930R819N829l403p725j427n562M441J7960j5230j2091j048
10304a3204L121L856j45M331j1163J877J247O969m39M1J1304J3424p002J8808
10290C3025J5783j1475j4333p657O077n783J1594P421j7641j3222P255L234o889
10277G389R556n135N175o679J0194k921j092K1966m076j6582j1674j2011q824
10264a4714N026L248J0104Q837j0784j1001l099o329Q961Q179J2135P715p26p631
$$ plain form
10250 9921 8308 14238 8766 2332 -15903 -23235 -13303 5750 24158 34988 30121 25134 18552 18831
10236 18831 20658 7606 -708 11741 34231 24840 22256 17608 13835 22682 9801 2134 4967
10223 4967 6117 14280 16315 7391 6071 -3087 -561 9249 7768 400 2794 8946 18783 21854 22297
10208 22297 13738 5389 7363 9624 10233 31943 20407 6782 1363 -610 866 -12048 -8305 -1115
10194 -1115 -9145 -22826 -13946 -28069 -20734 -11873 -11026 -11755 -14207 -16359 -4631 14710 15802 17416
10180 17416 10693 2166 2418 -4829 -12827 91 -2844 -1383 14550 5712 -14655 2059 9247 4799
10166 4799 13353 17349 14064 18692 12437 9681 2386 -5874 -9447 -6612 12024 20212 16909 9394
10152 9394 1857 -7476 4291 20687 11354 6806 16150 22356 27524 26513 7035 -2121 3059 85
$$ packed form
10250I921j613N930n472o434j8235p332R932J9053J8408J0830m867m987o582K79
10236A8831J827j3052q314J2449K2490r391k584m648l773Q847j2881p667K833
10223D967J150Q163K035q924j320r158K526R810j481p368K394O152R837L071M43
10208B2297q559q349J974K261O09K1710j1536j3625n419j973J476j2914L743P190
10194a115q030j3681Q880j4123P335Q861Q47p29k452k152J1728J9341J092J614
10180A7416o723q527K52p247p998J2918k935J461J5933q838k0367J6714P188m448
10166D799Q554L996l285M628o255k756p295q260l573K835J8636Q188l303p515
10152I394p537r333J1767J6396r333m548R344O206N168j011j9478r156N180k974
$$ plain form
10138 85 -3425 7748 17070 19166 5962 -17362 -22720 -4264 -919 1180 6519 9788 2774 945
10124 945 6253 6070 16939 21874 6881 5871 -168 -13498 -5442 -2969 17566 31526 35793 28592
10110 28592 7847 -18456 -27240 -9004 11607 22261 23859 21015 13061 16475 22322 30117 27441
10097 27441 38534 31257 19751 15565 14005 20394 6740 10157 2369 -5409 -4113 2929 7570 10818
10083 10818 13544 12487 17271 24592 9708 8324 14290 21504 11978 3848 -4813 197 11582 -4887
10069 -4887 -9907 -7071 -19610 -16672 -10589 -70 12004 16842 11986 10606 25609 21388 4014
10056 4014 1586 -4134 -11288 -320 15748 35845 41987 30208 22928 33012 29453 24377 11565
10043 11565 -15644 -32312 -7376 10052 31828 46422 59193 81659 134220 159441 137452 128514
$$ packed form
10138H5l510J1173R322K096j3204k3324n358J8456L345K099N339L269p014j829
10124I45N308j83J0869M935j4993j010o039j3330Q056K473K0535J3960M267p201
10110B8592k0745k6303q784J8236K0611J0654J598k844p954L414N847P795k676
10097B7441J1093p277j1506m186j560O389j3654L417p788p778J296P042M641L248
10083A0818K726j057M784P321j4884j384N966P214r526q130q661N010J1385j6469
10069d887n020K836j2539K938O083J0519J2074M838m856j380J5003m221j7374
10056D014k428n720p154J0968J6068K0097O142j1779p280J0084l559n076j2812
10043A1565k7209j6668K4936J7428K1776J4594J2771K2466N2561K5221k1989q938
$$ plain form
10031 128514 99353 68953 41297 22810 19965 17245 11024 17390 33363 29227 16070 9642 -398
10018 -398 8534 29170 29294 23112 24302 35565 24890 7436 8188 8120 16750 10707 6656 8901 11416
10003 11416 7487 9996 6986 -4746 -22549 -24167 -5371 2071 3992 8292 4752 -7984 -3416
9990 -3416 5624 10649 -6125 -9523 -5405 -3652 -9479 -7327 -2907 -3894 -4630 12647 33581 44578
9976 44578 40297 31257 34606 30579 12378 12327 19422 25506 19101 14870 34383 33539 23540 16099 10349
9961 10349 5738 3990 -13433 -14554 -9847 -2210 -3400 -718 14817 17418 21934 21037 24374 44675
9947 44675 48692 36412 33210 15294 30 33 7075 20217 18334 13691 25136 23007 20264 20568
9933 20568 21144 17667 23784 33541 24017 7452 -8136 -3364 5785 14486 32683 54583 57064 44689
$$ packed form
10031A28514k9161l0400k7656j8487k845k720o221O366J5973m136j3157o428j0040
10018c98Q932K0636J24o182J190J1263j0675j7454P52o8Q630o043m051K245K515
10003A1416l929K509l010j1732j7803j618J8796P442J921M300l540j2736M568
9990c416R040N025j6774l398M118J753n827K152M420r87p36J7277K0934J0997
9976D4578m281r040L349m027j8201n1P095O084o405m231J9513q44r999p441n750
9961A0349m611j748j7423j121M707P637j190K682J5535K601M516q97L337K0301
9947D4675M017j2280l202j7916j5264LP042J3142j883m643J1445k129k743L04
9933B0568N76l477O117R757r524j6565j5588M772R149Q701J8197K1900K481j2375
$$ plain form
9919 44689 40636 35999 31399 16854 -1204 1753 6976 4100 -7266 -553 9181 4789 4112 -6647
9905 -6647 -13788 7118 15274 22383 28687 24963 7100 -3657 2285 11056 3387 9583 26648 27056
9891 27056 9115 -4482 -9899 8395 24257 18699 11248 14990 13659 -2387 -11131 -6970 8753
9878 8753 15526 20616 22659 14054 15665 4621 4807 9254 6563 -562 2079 844 -980 -1021 557
9863 557 3874 -10358 -20390 -1881 8072 11164 20669 30195 30022 34028 37397 22050 22641 20404 15617
9848 15617 33507 33917 41527 41721 41302 48424 36338 29950 38987 43724 40262 35718 48123 52857 33915
9833 33915 36383 26142 19566 7727 2834 -1523 -3068 405 2172 10523 10796 -3543 -10754 6155
9819 6155 9944 15447 10643 17831 19884 21503 17873 18513 19201 36172 39853 36995 30684 45393 46388
$$ packed form
9919D4689m053m637m600j4545j8058K957N223k876j1366O713R734m392o77j0759
9905f647p141K0906Q156P109O304l724j7863j0757N942Q771p669O196J7065M08
9891B7056j7941j3597n417J8294J5862n558p451L742j331j6046q744M161J5723
9878H753O773N090K043q605J611j1044J86M447k691p125K641j235j824m1J578
9863E57L317j4232j0032J8509R953L092R505R526j73M006L369j5347N91k237m787
9848A5617J7890M10P610J94m19P122j2086o388R037M737l462m544J2405M734j8942
9833C3915K468j0241o576j1839m893m357j545L473J767Q351K73j4339p211J6909
9819F155L789N503m804P188K053J619l630O40O88J6971L681k858o311J4709R95
$$ plain form
9804 46388 32392 18692 21064 29963 36235 24107 29021 50893 43482 26060 12720 4998 2745
9791 2745 7111 11271 15801 16093 1034 -86 -5771 -16817 -12047 61 24558 35919 30456 16490
9777 16490 2702 -240 13744 25908 12291 3104 11053 16719 8821 10292 8750 8502 2568 7253
9763 7253 24059 26289 25761 18978 20786 20425 5546 -7636 3055 17883 16644 15168 -2075 -5175
9749 -5175 7509 9391 7583 31594 28522 15513 19213 26945 19514 12741 11211 7288 17314 32587
9735 32587 21704 4143 20953 39191 45141 40357 30724 23913 17984 1614 -3619 9590 6222
9722 6222 8692 1455 2578 4167 5038 -1962 5115 18427 22862 9975 7767 20780 29019 31785
9708 31785 33918 34182 28074 24095 3376 -2844 5198 14730 20325 17939 12965 25127 31783 34632
$$ packed form
9804D6388j3996j3700K372Q899O272j2128M914K1872p411j7422j3340p722k253
9791B745M366M160M530K92j5059j120n685j1046M770J2108K4497J1361n463j3966
9777A6490j3788k942J3984J2164j3617r187P949N666p898J471j542k48n934M685
9763G253J6806K230n28o783J808l61j4879j3182J0691J4828j239j476j7243l100
9749e175J2684J882j808K4011l072j3009L700P732p431o773j530l923J0026J5273
9735C2587j0883j7561J6810J8238N950m784r633o811n929j6370n233J3209l368
9722F222K470p237J123J589Q71p000P077J3312M435j2887k208J3013Q239K766
9708C1785K133K64o108l979k0719o220Q042R532N595k386m974J2162O656K849
$$ plain form
9694 34632 31219 22840 26119 25449 15866 1878 14314 22228 22484 18913 8154 3201 4060 22754
9680 22754 16931 338 -7594 -21293 -1390 8975 5932 21411 28578 20334 24924 24584 11230
9667 11230 1079 -4748 -2364 15392 26043 24254 14919 8421 20548 21083 20343 16173 14396 11753
9653 11753 18714 21297 18319 24613 20993 11698 18620 15931 9524 5309 23391 43837 42711 37875
9639 37875 26722 12882 7725 11924 9502 13383 12860 7304 16256 7211 5649 5629 8625 3105 20927
9624 20927 16708 28841 37425 45973 40780 22353 19875 27188 35406 41005 47076 37942 26367 34035
9610 34035 32380 22856 16150 22294 19830 7460 31119 32647 30030 28346 31644 27551 17675 15288
9596 15288 18186 10336 -944 -2672 7260 17122 25302 18872 26024 24382 25002 36332 34713 33026
$$ packed form
9694C4632l413q379L279o70r583j3988J2436P914K56l571j0759m953Q59J8694
9680B2754n823j6593p932j3699J9903J0365l043J5479P167q244M590l40j3354
9667A1230j0151n827K384J7756J0651j789r335o498J2127N35p40m170j777k643
9653A1753O961K583k978O294l620r295O922k689o407m215J8082K0446j126m836
9639C7875j1153j3840n157M199k422L881n23n556Q952r045j562k0K996n520J7822
9624B0927m219J2133Q584Q548n193j8427k478P313Q218N599O071r134j1575P668
9610C4035j655r524o706O144k464j2370K3659J528k617j684L298m093r876k387
9596A5288K898p850j1280j728R932R862Q180o430P152j642O20J1330j619j687
$$ plain form
9582 33026 37042 46035 41397 16348 14906 24965 15514 1870 5028 17143 14657 7323 12847 39400
9568 39400 45099 30291 28300 39859 24514 39567 52582 68692 68860 52914 38211 40751 44663
9555 44663 37092 43774 40923 22540 23169 36399 36467 28270 28621 38481 43126 41061 31614 32458 38752
9540 38752 36836 51831 44616 40142 50684 48744 39369 24067 30656 55469 58632 60628 51547 32012
9526 32012 23022 26626 29288 26633 21073 6291 -518 16711 29826 41761 39336 36528 33072 19136
9512 19136 13378 26377 16913 16717 32398 36535 49703 58199 56417 58502 52286 43532 40059 35285
9498 35285 32531 33135 42466 56587 56858 47395 36769 45967 45857 49081 42685 43290 54865 50581 41589
9483 41589 48247 36174 28409 30970 42626 53735 44472 37862 37138 28676 20661 29346 36099 29743
$$ packed form
9582C3026M016Q993m638k5049j442J0059r451j3644L158J2115k486p334N524K6553
9568C9400N699j4808j991J1559j5345J5053J3015J6110J68j5946j4703K540L912
9555D4663p571O682k851j8383O29J3230O8q197L51R860M645k065r447Q44O294
9540C8752j916J4995p215m474J0542j940r375j5302O589K4813L163J996r081j9535
9526C2012q990L604K662k655n560j4782o809J7229J3115J1935k425k808l456j3936
9512A9136n758J2999r464j96J5681M137J3168Q496j782K085o216q754l473m774
9498C5285k754O04R331J4121K71r463j0626R198j10L224o396O05J1575m284q992
9483D1589O658j2073p765K561J1656J1109r263o610p24q462q015Q685O753o356
$$ plain form
9469 29743 20767 11335 13340 21233 24542 34887 33614 30202 42469 51023 46341 38793 50540 63950
9455 63950 53694 56840 56068 54720 54218 40137 34146 43040 42589 50881 58540 62867 64885 67136 69756
9440 69756 54795 39183 37840 28556 32629 24701 21287 39459 50462 48297 35032 33052 44400
9427 44400 57537 62970 55406 47892 50149 52918 55059 57388 55808 45992 31906 53199 67574 58592
9413 58592 57924 54690 61106 76800 78628 88509 107728 112637 109675 101655 94841 86135 84669 68882
9399 68882 62280 70783 82896 100265 104751 106742 96628 62635 56159 53171 54291 65390 64643 68466
9385 68466 64868 61220 76087 83844 75666 69042 69170 69226 71638 70715 72045 67666 56343 53864 65454
9370 65454 79064 73806 79776 96989 86785 88779 90630 85849 76291 92149 97295 90387 86716 93728
$$ packed form
9469B9743q976r432K005P893L309J0345j273l412J2267Q554m682p548J1747J3410
9455F3950j0256L146p72j348n02j4081n991Q894m51Q292P659M327K018K251K620
9440F9756j4961j5612j343r284M073p928l414J8172J1003k165j3265j980J1348
9427D4400J3137N433p564p514K257K769K141K329j580r816j4086K1293J4375q982
9413E8592o68l234O416J5694J828R881J9219M909k962q020o814q706j466j5787
9399F8882o602Q503J2113J7369M486J991j0114l3993o476k988J120J1099p47L823
9385F8466l598l648J4867P757q178o624J28N6K412r23J330m379j1323k479J1590
9370F5454J3610n258N970J7213j0204J994J851m781r558J5858N146o908l671P012
$$ plain form
9356 93728 106472 124789 135400 120272 130888 145919 151264 141943 153927 180638 202067 237602
9344 237602 315746 436275 630028 804096 848643 781424 665794 528311 392875 311101
9334 311101 257001 205374 177438 156391 143674 157566 150503 153769 161269 154640 156191 160335 147545
9321 147545 137052 139853 140202 129947 128790 145697 153305 158907 161004 160398 170150 168988 169589 168885 164165
9306 164165 183349 204603 223919 250171 276891 311341 382707 507738 736743 1123686 1549262
9295 1549262 1694804 1604986 1385291 1072732 780973 589001 472554 389519 345706 306016
9285 306016 274374 252884 228998 224658 225757 236338 237385 224249 213110 190394 192442 201895 199916
9272 199916 179346 180056 190609 195561 190279 191424 196652 196837 189836 183759 183886 194129 214770 232188
$$ packed form
9356I3728J2744J8317J0611j5128J0616J5031N345r321J1984K6711K1429L5535
9344B37602P8144J20529J93753J74068M4547o7219j15630j37483j35436q1774
9334C11101n4100n1627k7936k1047j2717J3892p063L266P500o629J551M144j2790
9321A47545j0493K801L49j0255j157J6907P608N602K097o06R752j162O01p04m720
9306A64165J9184K1254J9316K6252K6720L4450P1366J25031K29005L86943M25576
9295A549262J45542q9818k19695l12559k91759j91972j16447q3035m3813l9690
9285C06016l1642k1490k3886m340J099J0581J047j3136j1139k2716K048R453j979
9272A99916k0570P10J0553M952n282J145N228J85p001o077J27J0243K0641J7418
$$ plain form
9258 232188 242217 254262 284084 320900 367034 452349 606243 806701 924621 910071 826379
9247 826379 678661 519251 412415 338082 308712 297377 289034 283985 285244 273771 228134 224073
9235 224073 222615 230029 241992 248485 243829 237937 229288 241267 222537 202717 196459 194549 193411
9222 193411 205983 216262 216092 217189 222417 204200 193041 190402 197839 196606 187880 182572 185132 179117
9208 179117 184448 204351 202806 200382 205093 229821 227329 208970 202879 216997 224420 255412 278305
9195 278305 282470 296071 315503 310422 300944 281710 284600 287806 273657 260610 265270 260248 241550
9182 241550 231127 217537 212995 204295 194610 197629 195293 193530 190731 191988 201948 210956 215286 226681
9168 226681 234281 229204 232275 221868 220875 239549 248639 245055 254012 257609 263711 263022 248444 256537
$$ packed form
9258B32188J0029J2045K9822L6816M6134Q5315J53894K00458J17920j4550q3692
9247H26379j47718j59410j06836p4333k9370j1335q343n049J259j1473m5637m061
9235B24073j458P414J1963O493m656n892q649J1979j8730j9820o258j910j138
9222A93411J2572J0279j70J097N228j8217j1159k639P437j233q726n308K560o015
9208A79117N331J9903j545k424M711K4728k492j8359o091J4118P423L0992K2893
9195B78305M165J3601J9432n081r478j9234K890L206j4149j3047M660n022j8698
9182B41550j0423j3590m542q700r685L019k336j763k799J257R960R008M330J1395
9168B26681P600n077L071j0407r93J8674R090l584Q957L597O102o89j4578Q093
$$ plain form
9154 256537 268609 280255 295806 327027 371644 412482 433936 429915 393840 346437 327648 316660
9142 316660 285315 258544 258130 276395 278331 279820 277281 287585 266692 247997 252246 254504 275618
9129 275618 286204 273853 269395 265149 263382 264268 279110 289158 305983 314044 307015 297701 288846
9116 288846 292668 292446 275637 273647 262535 259962 252742 244986 232216 223635 216582 207395 215783 233157
9102 233157 244351 230789 202618 180589 178735 173378 175010 197712 235278 272455 300022 316895
9090 316895 304064 301035 294634 305450 315175 327520 336914 340510 293514 244607 221725 239888 268647
9077 268647 288872 294327 284699 279793 273552 266568 265131 263724 254450 253158 234654 239146 254564 262438
9063 262438 256608 226941 203441 189445 177211 164957 136350 125019 126280 128511 135455 133081 124588
$$ packed form
9154B56537J2072J1646J5551L1221M4617M0838K1454m021l6075m7403j8789j0988
9142C16660l1345k6771m14J8265J936J489k539J0304k0893j8695M249K258K1114
9129B75618J0586j2351m458m246j767Q86J4842J0048J6825Q061p029r314q855
9116B88846L822k22j6809j990j1112k573p220p756j2770q581p053r187Q388J7374
9102B33157J1194j3562k8171k2029j854n357J632K2702L7566L7177K7567J6873
9090C16895j2831l029o401J0816R725J2345R394L596m6996m8907k2882J8163K8759
9077B68647K0225N455r628m906o241o984j437j407r274j292j8504M492J5418P874
9063B62438n830k9667k3500j3996j2234j2254k8607j1331J261K231O944k374q493
$$ plain form
9050 124588 151570 196289 233489 259780 277993 305804 317988 322904 343083 363667 380052 368431
9038 368431 336534 304760 272834 265543 267185 265114 274199 271431 274677 289408 304878 317995 313907
9025 313907 319647 313532 321732 313810 285833 295462 327554 356410 350976 336473 328022 307645 305821
9012 305821 319427 320086 318304 336819 368322 380450 385663 393228 399003 411568 460561 501347 554014
8999 554014 626582 699889 804794 981722 1293055 1851794 2677358 3366388 3466390 3206185
8989 3206185 2723706 2103432 1615665 1334674 1185206 1071992 976673 909731 872223 870387
8979 870387 869977 855344 842427 819691 847249 889074 928774 951352 955709 976727 994128 1031589
8967 1031589 1101980 1195728 1315235 1442266 1583730 1727800 1863430 2013163 2163755 2346685
$$ packed form
9050A24588K6982M4719L7200K6291J8213K7811J2184M916K0179K0584J6385j1621
9038C68431l1897l1774l1926p291J642k071R085k768L246J4731J5470J3117m088
9025C13907N740o115Q200p922k7977R629L2092K8856n434j4503q451k0377j824
9012C05821J3606O59j782J8515L1503J2128N213P565N775J2565M8993M0786N2667
8999E54014P2568P3307J04905J76928L11333N58739Q25564O89030J00002k60205
8989C206185m82479o20274m87767k80991j49468j13214r5319o6942l7508j836
8979H70387m10j4633j2917k2736K7558M1825L9700K2578M357K1018J7401L7461
8967A031589P0391R3748J19507J27031J41464J44070J35630J49733J50592J82930
$$ plain form
8957 2346685 2595025 2918545 3359810 3974206 4740669 5548606 6462933 7735700 9662892
8948 9662892 12632019 16359394 19750633 23832016 30217153 41267979 62028973 97306178
8940 97306178 136777152 150954408 140844525 119591330 88365673 59723788 40947793
8933 40947793 29694680 22700878 18067500 14853496 12573176 10906259 9659094 8746798
8925 8746798 8112764 7573254 7042584 6553484 6151071 5823168 5587016 5474907 5455728 5466359
8915 5466359 5515700 5661453 5886079 6154019 6541810 7156127 8068098 9248023 10468369
8906 10468369 11685218 13215769 15265579 18216048 22449828 27950877 35563935 47514600
8898 47514600 67720486 104650973 171659253 260311022 301437195 285291142 248459388
$$ packed form
8957B346685K48340L23520M41265O14396P66463Q07937R14327J272767J927192
8948I662892K969127L727375L391239M081383O385137J1050826K0760994L5277205
8940I7306178L9470974J4177256j0109883k1253195l1225657k8641885j8775995
8933D0947793j1253113o993802m633378l214004k280320j666917j247165r12296
8925H746798o34034n39510n30670m89100m02413l27903k36152j12109j9179J0631
8915E466359M9341J45753K24626K67940L87791O14317R11971J179925J220346
8906A0468369J216849J530551K049810K950469M233780N501049P613058J1950665
8898D7514600K0205886L6930487O7008280Q8651769M1126173j6146053l6831754
$$ plain form
8891 248459388 186441827 124591218 83408106 59042043 44194787 34512679 27823183
8884 27823183 23058830 19594554 17012712 15158923 13893127 12828644 11676122 10546128
8876 10546128 9476718 8498044 7686543 7078074 6620332 6298139 6069314 5929443 5885817
8867 5885817 5906738 5960705 6106151 6393740 6787085 7229384 7667792 8213018 8941636 9966018
8857 9966018 11485169 13780957 17263643 22747223 31859716 47761718 75544488 115087018
8849 115087018 143265963 141821373 125838393 99162144 68353725 45587460 31784955
8842 31784955 23481771 18162441 14526064 11969423 10109545 8712801 7689298 6953153
8834 6953153 6364751 5781095 5196419 4641452 4088619 3604479 3196940 2886486 2629968 2430849
$$ packed form
8891B48459388o2017561o1850609m1183112k4366063j4847256r682108o689496
8884B7823183m764353l464276k581842j853789j265796j064483j152522j129994
8876A0546128j069410r78674q11501o08469m57742l22193k28825j39871m3626
8867E885817K0921N3967J45446K87589L93345M42299M38408N45226P28618J024382
8857I966018J519151K295788L482686N483580R112493J5902002K7782770L9542530
8849A15087018K8178945j444590j5982980k6676249l0808419k2766265j3802505
8842C1784955q303184n319330l636377k556641j859878j396744j023503p36145
8834F953153n88402n83656n84676n54967n52833m84140m07539l10454k56518j99119
$$ plain form
8824 2430849 2283709 2203894 2106871 2006203 1943337 1902310 1866640 1813360 1718378 1631722 1528726
8813 1528726 1446651 1385094 1291046 1175877 1062909 960554 892720 843342 796918 760253 733688
8802 733688 720243 684526 628428 578729 545360 530192 510571 491390 482081 469774 467036 465178
8790 465178 460750 439487 433613 437091 476106 556460 620287 641223 605259 538952 491135 453304
8778 453304 426352 417397 420194 425505 439012 460519 460954 452685 442949 411307 386618 411346 412455
8765 412455 382442 333169 280758 273984 271046 260571 231895 205634 187238 187875 183260 199739 216662
8752 216662 209021 181502 149869 117768 110015 116391 119947 122635 153418 197340 250934 330229 472279
8739 472279 646856 706328 681155 623819 545724 492401 455292 425627 397551 355663 323588
$$ packed form
8824B430849j47140p9815r7023j00668o2866m1027l5670n3280r4982q6656j02996
8813A528726q2075o1557r4048j15169j12968j02355o7834m9378m6424l6665k6565
8802G33688j3445l5717n6098m9699l3369j5168j9621j9181r309j2307k738j858
8790D65178m428k1263n874L478L9015Q0354O3827K0936l5964o6307m7817l7831
8778D53304k6952q955K797N311J3507K1507M35q269r736l1642k4689K4728J109
8765D12455l0013m9273n2411o774k938j0475k8676k6261j8396O37m615J6479J6923
8752B16662p641k7519l1633l2101p753O376L556K688L0783M3922N3594P9295J42050
8739D72279J74577N9472k5173n7336p8095n3323l7109k9665k8076m1888l2075
$$ plain form
8728 323588 293532 263255 234634 214020 193155 155869 165921 189818 187501 178401 162898 161484
8716 161484 166969 175404 183560 201161 242970 296679 302743 286470 261697 229392 170486 99208
8704 99208 46957 47895 73067 100383 139499 159567 161502 167100 176164 228378 332686 383137 390023
8691 390023 380389 367159 348166 322193 306208 299749 279465 258520 239362 220273 206671 198529
8679 198529 211095 229757 245378 265924 294211 377694 463930 488642 461394 399251 352410 367292
8667 367292 458136 547736 536961 490283 427942 325965 248148 188320 157216 152826 182101 202632
8655 202632 232518 258056 246202 223715 176877 133993 133965 129075 128116 129833 132418 138868 149899
8642 149899 156306 132024 126197 121997 122831 111085 107439 136606 154941 180019 207006 262601 385181
$$ packed form
8728C23588l0056l0277k8621k0614k0865l7286J0052K3897k317r100j5503j414
8716A61484N485Q435Q156J7601M1809N3709O064j6273k4773l2305n8906p1278
8704I9208n2251R38K5172K7316L9116K0068J935N598R064N2214J04308N0451O886
8691C90023r634j3230j8993k5973j5985o459k0284k0945j9158j9089j3602q142
8679A98529J2566J8662J5621K0546K8287Q3483Q6236K4712k7248o2143m6841J4882
8667C67292R0844Q9600j0775m6678o2341j01977p7817n9828l1104m390K9275K0531
8655B02632K9886K5538j1854k2487m6838m2884k8m890r59J717K585O450J1031
8642A49899O407k4282n827m200Q34j1746l646K9167J8335K5078K6987N5595J22580
$$ plain form
8629 385181 583440 805775 855159 795477 682377 512024 401203 363873 376472 360912 321019
8618 321019 280899 238425 204173 167416 147113 153172 161035 173547 190952 183219 163036 158817
8606 158817 145164 124011 109347 104893 92171 84448 85690 73620 60593 56832 54942 40712 39437
8593 39437 40629 61737 64435 70699 88619 104713 124730 157719 193412 274911 399224 464271
8581 464271 450772 389789 308014 231788 192779 172552 154850 160268 148220 127362 118267 107814
8569 107814 101072 98145 91511 67022 55667 60139 66691 87856 93370 83750 62807 63162 59695 50068
8555 50068 57879 50150 40546 39209 37292 51660 57044 51171 63704 71386 67538 60532 76257 93476
8541 93476 94713 103008 123162 157729 211279 304943 416129 599426 774089 823183 752611 637813
$$ packed form
8629C85181J98259K22335M9384n9682j13100j70353j10821l7330J2599j5560l9893
8618C21019m0120m2474l4252l6757k0303O059P863J2512J7405p733k0183m219
8606A58817j3653k1153j4664m454j2722p723J242j2070j3027l761j890j4230j275
8593C9437J192K1108K698O264J7920J6094K0017L2989L5693Q1499J24313O5047
8581D64271j3499o0983q1775p6226l9009k0227j7702N418j2048k0858r095j0453
8569A07814o742k927o634k4489j1355M472O552K1165N514r620k0943L55l467r627
8555E0068P811p729r604j337j917J4368N384n873J2533P682l848p006J5725J7219
8541I3476J237Q295K0154L4567N3550R3664J11186J83297J74663M9094p0572j14798
$$ plain form
8529 637813 472170 335396 260166 208294 176568 152867 126091 104726 104121 101043 99834 101940
8517 101940 96612 89171 79235 70418 62489 48918 44369 51105 65083 52195 47581 76704 90880
8504 90880 89629 99592 103637 105944 104307 108676 118913 114564 105040 132186 178843 235702 305622
8491 305622 432359 639010 998050 1445359 1606896 1512130 1296897 963241 659268 463958
8481 463958 355069 276539 230950 210251 193984 168143 142356 114062 91696 84174 88844 91661
8469 91661 87398 76882 67712 60679 55066 58332 63116 53613 42108 44885 52402 53204 53500 48134 58158
8454 58158 71892 64286 57908 54440 69809 98096 126430 171224 227826 321197 477831 678088
8442 678088 791607 766802 663367 517871 368309 248312 183286 145832 127896 114385 90312
$$ packed form
8529F37813j65643j36774p5230n1872l1726k3701k6776k1365o05l078j209K106
8517A01940n328p441r936q817p929j3571m549O736J3978j2888m614K9123J4176
8504I0880j251R963M045K307j637M369J0237m349r524K7146M6657N6859O9920
8491C05622J26737K06651L59040M47309J61537r4766k15233l33656l03973j95310
8481D63958j08889p8530m5589k0699j6267k5841k5787k8294k2366p522M670K817
8469I1661m263j0516r170p033n613L266M784r503j1505K777P517Q02K96n366J0024
8454E8158J3734p606o378l468J5369K8287K8334M4794N6602R3371J56634K00257
8442F78088J13519k4805j03435j45496j49562j19997o5026l7454j7936j3511k4073
$$ plain form
8431 90312 78592 54834 49463 40798 18195 17466 36951 54413 50022 28372 18879 13359 23112
8418 23112 38528 47697 58018 59557 38563 32659 39689 38738 50324 46802 45297 47891 47689 42295
8404 42295 31853 30280 47679 43034 34940 37707 44148 44724 43414 28752 25220 32500 20923 18045
8390 18045 18475 35597 32838 20933 32304 37260 26609 20679 18670 24682 33111 31216 24077 26562
8376 26562 23722 9626 14287 9758 30555 35002 29915 6826 4601 2767 9251 24919 29473 31422
8362 31422 28745 2409 -8969 374 12984 10362 6100 3957 11036 21227 19869 11313 2008 4952
8348 4952 -5461 -12767 -16565 -11145 -8547 -5248 7962 13506 18073 9250 3797 26026 29545 17745
8334 17745 5668 -1315 21160 13826 14420 28724 29189 21373 11838 7783 6983 6546 24798 38160
$$ packed form
8431I0312j1720k3758n371q665k2603p29J9485J7462m391k1650r493n520R753
8418B3112J5416R169J0321J539k0994n904P030r51J1586l522j505K594k02n394
8404D2295j0442j573J7399m645q094K767O441N76j310j4662l532P280j1577k878
8390A8045M30J7122k759j1905J1371M956j0651n930k009O012Q429j895p139K485
8376B6562k840j4096M661m529K0797M447n087k3089k225j834O484J5668M554J949
8362C1422k677k6336j1378R343J2610k622m262k143P079J0191j358q556r305K944
8348D952j0413p306l798N420K598L299J3210N544M567q823n453K2229L519j1800
8334A7745j2077o983K2475p334N94J4304M65p816r535m055q00m37J8252J3362
$$ plain form
8320 38160 35093 25939 18887 12197 20799 26135 19903 15056 20396 17431 -1588 784 6781 4573
8306 4573 2398 2336 2291 -1235 -8156 -20226 -18887 -11071 -2350 -2719 959 13247 16531 5368 -6322
8291 -6322 -18830 -21539 -9542 4681 7224 14308 22533 28597 12469 4000 3101 6765 18609 20277
8277 20277 12635 27072 26081 30838 20229 16691 36831 45976 28596 10722 4255 3120 -388 7314
8263 7314 12553 15729 16173 17032 11183 9205 5859 1292 514 -11663 2483 18315 14010 17625 10459
8248 10459 -7310 -18288 -11309 8915 15845 30700 27849 20904 16769 -1094 -7350 18276 28728
8235 28728 31932 28255 38771 34673 17592 24731 25560 31395 33073 18894 5247 -3922 -16813 -3407
8221 -3407 9162 3539 -4682 -5663 -4645 11375 16772 25190 21721 18397 17237 22375 29067 25025 25388
$$ packed form
8320C8160l067r154p052o690Q602N336o232m847N340k965j9019K372N997k208
8306D573k175o2m5l526o921j2070J339P816Q721l69L678J2288L284j1163j1690
8291f322j2508k709J1997J4223K543P084Q225O064j6128q469q99L664J1844J668
8277B0277p642J4437r91M757j0609l538K0140R145j7380j7874o467j135l508P702
8263G314N239L176M44Q59n849j978l346m567p78j2177J4146J5832m305L615p166
8248A0459j7769j0978O979K0224O930J4855k851o945m135j7863o256K5626J0452
8235B8728L204l677J0516m098j7081P139Q29N835J678j4179j3647r169j2891J3406
8221c407J2569n623q221r81J018J6020N397Q418l469l324j160N138O692m042L63
$$ plain form
8206 25388 6079 -3476 8671 23316 41651 42526 19676 -2234 -2749 7738 6443 -2689 -17981
8193 -17981 -18677 -5548 -9959 -9807 7948 18246 19499 28803 31987 20321 623 8886 20271 29128
8179 29128 30369 21606 21220 20485 38282 28406 -253 2349 22184 27002 18830 7882 -1730 -3057
8165 -3057 17702 25168 24083 15212 12861 21874 15323 17927 13710 3334 5836 5923 3589 2700 14391
8150 14391 18905 19205 19978 9071 5615 15507 23105 9318 -1811 -12288 -12908 -15171 -18631 -4349
8136 -4349 -2289 3227 481 -7813 -10047 -6794 -7118 -1774 7640 6883 13029 28271 33512 33273 12894
8121 12894 3144 -2733 -15814 -14453 1771 2200 -21426 -24189 -3526 10372 2490 5835 8463 269
8107 269 -8686 -8225 4058 -1842 5199 10311 11418 6198 2517 -2756 -6957 -8622 -11541 -21468 -5931
$$ packed form
8206B5388j9309r555J2147J4645J8335Q75k2850k1910n15J0487j295r132j5292
8193a7981o96J3129m411J52J7755J0298J253R304L184j1666j9698Q263J1385Q857
8179B9128J241q763l86p35J7797r876k8659K602J9835M818q172j0948r612j327
8165c057K0759P466j085q871k351R013o551K604m217j0376K502Q7k334q89J1691
8150A4391M514L00P73j0907l456R892P598j3787j1129j0477o20k263l460J4282
8136d349K060N516k746q294k234L253l24N344R414p57O146J5242N241k39k0379
8121A2894r750n877j3081J361J6224M29k3626k763K0663J3898p882L345K628q194
8107B69q955M61J2283n900P041N112J107n220l681n273m201j665k919r927J5537
$$ plain form
8092 -5931 11483 16893 13649 5112 5506 15328 15677 6572 -999 -3167 -5332 1484 7401 18174 43740
8077 43740 34971 21616 24561 35547 35605 22180 11185 -874 -6215 679 14938 13564 6234 -2212
8063 -2212 -3773 -15559 -16481 -19569 -11428 -6965 -22108 -26162 -22249 -30815 -23101 7443 4759 1292
8049 1292 -1088 -16027 3882 12259 12077 15459 956 -9942 -10012 -1780 9266 15467 8309 14579
8035 14579 17831 4764 -17302 -1515 14387 5437 10709 16360 20126 12041 2010 -20126 -30146
8022 -30146 -29108 -17666 -384 9492 17218 20864 29268 24070 18115 10397 -4628 -7707 521 8680
8008 8680 15510 20404 21125 16508 25839 29348 14443 18896 26598 32379 38774 29506 16993 15497 22192
7993 22192 23256 22370 22423 37161 25338 14311 12082 3509 16165 25122 27664 29174 22128 18924
$$ packed form
8092e931J7414N410l244q537L94R822L49r105p571k168k165O816N917J0773K5566
8077D3740q769j3355K945J0986N8j3425j0995j2059n341O894J4259j374p330q446
8063b212j561j1786r22l088Q141M463j5143m054L913q566P714L0544k684l467
8049A292k380j4939J9909Q377j82L382j4503j0898p0Q232J1046O201p158O270
8035A4579L252j3067k2066J5787J5902q950N272N651L766q085j0031k2136j0020
8022c0146J038J1442J7282R876P726L646Q404n198n955p718j5025l079Q228Q159
8008H680O830M894P21m617R331L509j4905M453P702N781O395r268j2513j496O695
7993B2192J064q86N3J4738j1823j1027k229q573J2656Q957K542J510p046l204
$$ plain form
7979 18924 33290 34772 23397 16962 20415 24278 30213 45703 51485 48255 58182 49718 44131 35567
7965 35567 16802 7617 -1660 -9905 -10622 -1545 -4266 -19911 -20806 -15889 -3708 -1758 -10215 3450
7951 3450 11103 12735 19141 3293 -250 3586 461 7237 24724 9926 12428 8808 14033 22488
7937 22488 14337 8959 3715 5925 7654 3120 -4589 -3976 331 15539 20099 34895 30565 16157
7923 16157 4587 -10491 -21697 -12235 11093 13267 -4097 2862 10011 -1657 -325 -3830 -12635
7910 -12635 -19316 -15388 -4293 2577 8206 6014 1571 3602 -7912 -5663 6333 15641 26246 26027
7896 26027 23647 30708 40299 43314 32958 24284 23182 24012 8853 11488 12121 -427 -3717 -2722 -5146
7881 -5146 -7736 2202 -11580 -29287 -32587 -21168 -11133 4563 -959 -11234 -7449 6449 20899
$$ packed form
7979A8924J4366J482j1375o435L453L863N935J5490N782l230R927q464n587q564
7965C5567j8765r185r277q245p17R077k721j5645q95M917J2181J950q457J3665
7951C450P653J632O406j5848l543L836l125O776J7487j4798K502l620N225Q455
7937B2488q151n378n244K210J729m534p709O13M307J5208M560J4796m330j4408
7923A6157j1570j5078j1206R462K3328K174j7364O959P149j1668J332l505q805
7910a2635o681L928J1095O870N629k192m443K031j1514K249J1996R308J0605k19
7896B6027k380P061R591L015j0356q674j102Q30j5159K635O33j2548l290R95k424
7881e146k590R938j3782j7707l300J1419J0035J5696n522j0275L785J3898J4450
$$ plain form
7868 20899 14413 17669 22512 21887 15998 -4498 -19661 -21870 -7547 9833 13749 9376 -8952 -35771
7854 -35771 -35838 -22263 -6791 13042 8823 -12487 -5683 13697 30198 26838 7797 1900 -11172
7841 -11172 -12517 -6212 -4871 -8432 -8419 -18219 -19810 -11653 -7871 -9462 -6348 -2524 -10884 -16652 -18069
7826 -18069 -18361 -3751 -6356 -14300 -15602 -29434 -33593 -31237 -19202 3026 15861 2182 7880
7813 7880 -8200 -22208 -29590 -20984 -351 23716 18684 16900 20722 6902 18738 22506 2016
7800 2016 -600 -10956 -9756 -15335 -18420 -6682 -480 4470 -1046 4644 5958 -10613 -14234 2252
7786 2252 -206 -2215 9346 3090 -5011 -13944 -12555 -6049 -13774 -16981 -3564 8895 -3308 -11656
7772 -11656 -11247 -17293 -16658 -11452 3232 5322 7955 7131 6823 668 -8711 -10487 -7783 -8585 -15701 -7241
$$ packed form
7868B0899o486L256M843o25n889k0496j5163k209J4323J7380L916m373j8328k6819
7854c5771o7J3575J5472J9833m219k1310O804J9380J6501l360j9041n897j3072
7841a1172j345O305J341l561J3r800j591Q157L782j591L114L824q360n768j417
7826a8069k92J4610k605p944j302j3832m159K356J2035K2228J2835j3679N698
7813G880j6080j4008p382Q606K0633K4067n032j784L822j3820J1836L768k0490
7800B016k616j0356J200n579l085J1738O202M950n516N690J314j6571l621J6486
7786B252k458k009J1561o256q101q933J389O506p725l207J3417J2459j2203q348
7772a1656M09o046O35N206J4684K090K633q24l08o155r379j776K704q02p116Q460
$$ plain form
7756 -7241 -5176 -15751 -3525 12952 10209 7509 -853 -3780 -8402 -11275 -14516 -7923 4818 9248
7742 9248 17257 14260 9774 -832 7161 16528 -5198 -5295 401 -370 -6430 -12230 1655 -274 5186
7727 5186 7908 -8042 -16995 6678 23754 14692 5852 3648 -22869 -24697 -5607 10976 7998
7714 7998 7795 14422 9132 -5240 -15092 1700 13631 15434 12515 20814 11899 -10139 -5482 -11601
7700 -11601 3422 3972 -7741 -5250 -1867 921 2089 4614 -1215 -7275 -11928 -22585 -16948 -23492
7686 -23492 -13490 -729 -7028 -9290 -8793 11870 17193 13798 -4505 -5229 -3034 -6434 -7973 -13122
7672 -13122 -16864 -20879 -19800 -26134 -19143 -11332 -3778 1525 -7662 -4987 -12978 -17900 -8000 10912
7658 10912 28022 43787 37357 12259 1480 -5597 -6077 -4906 5260 8766 439 12831 12562 19715
$$ packed form
7756g241K065j0575J2226J6477k743k700q362k927m622k873l241O593J2741M430
7742I248Q009k997m486j0606P993R367k1726r7N696p71o060n800J3885j929N460
7727E186K722j5950q953K3673J7076r062q840k204k6517j828J9090J6583k978
7714G998k03O627n290j4372r852J6792J1931J803k919Q299q915k2038M657o119
7700a1601J5023N50j1713K491L383K788J168K525n829o060m653j0657N637o544
7686b3492J0002J2761o299k262M97K0663N323l395j8303p24K195l400j539n149
7672a3122l742m015J079o334O991P811P554N303r187K675p991m922R900J8912
7658A0912J7110J5765o430k5098j0779p077m80J171J0166L506q327J2392k69P153
$$ plain form
7644 19715 20346 11057 4895 -13260 -16414 -4387 4312 4364 25225 38780 21518 2566 14478 17308
7630 17308 11368 17321 28160 19957 9375 -6352 2797 10457 8247 11819 14165 14601 16783 23069
7616 23069 12585 3921 2052 -10515 -19982 -15047 -18110 -27259 -17240 -1655 1804 4959 -6091
7603 -6091 -2870 4360 10447 -5277 -15141 -7931 8159 2728 4830 -9210 -12890 -1793 -10325 -1424
7589 -1424 11621 10655 16261 14325 2838 11668 18144 6491 4497 6318 11581 4712 -4095 1042
7575 1042 -3289 201 6318 18892 20217 5014 -8469 -11676 -7755 -11953 -7558 -2239 15440 -6516
7561 -6516 -25497 -14369 -8952 -12121 -31660 -16792 -3109 -10031 -18730 -20488 -16648 6324 10324
7548 10324 10063 12508 12143 12263 11234 13745 29374 31201 34228 41634 16568 -7561 -16363 -16893 -10318
$$ packed form
7644A9715O31r289o162j8155l154J2027Q699N2K0861J3555j7262j8952J1912K830
7630A7308n940N953J0839q203j0582j5727R149P660k210L572K346M36K182O286
7616B3069j0484q664j869j2567r467M935l063r149J0019J5585L459L155j1050
7603f091L221P230O087j5724r864P210J6090n431K102j4040l680J1097q532Q901
7589a424J3045r66N606j936j1487Q830O476j1653j994J821N263o869q807N137
7575A042m331L490O117J2574J325j5203j3483l207L921m198M395N319J7679k1956
7561f516j8981J1128N417l169j9539J4868J3683o922q699j758L840K2972M000
7548A0324k61K445l65J20j029K511J5629J827L027P406k5066k4129q802n30O575
$$ plain form
7533 -10318 -6271 -1665 -1814 -12676 -1912 -9926 -22472 -850 34166 31614 12584 351 -7747
7520 -7747 -5103 -7822 -10738 -6416 -2572 -13748 -27050 -3951 9209 1759 5568 2537 -2457 -1395
7506 -1395 -343 -11277 -14574 -5445 476 11811 2719 62 3736 -13819 -14599 -8544 5874 9846
7492 9846 -20409 -36555 -35913 -29346 -21253 -26196 -11475 7439 11304 -2596 -4519 2347 158 1408
7478 1408 -1731 1973 12886 23917 16648 7842 -6328 -2408 718 375 168 -8970 -16531 -22788 -20271
7463 -20271 -28984 -51848 -52600 -41144 -17131 -10556 -12570 -18883 -16595 -16301 -20115 -29992 -29571 -11272
7449 -11272 -6969 -4909 -3505 -9583 -8264 -6524 -10914 -19526 -11946 -11678 -14192 -15282 -2904 11114
7435 11114 14068 -449 -8440 8454 10269 14024 14138 -1414 -871 -5293 4432 3179 -240 -8498
$$ packed form
7533a0318M047M606j49j0862J0764q014j2546K1622L5016k552j9030j2233q098
7520g747K644k719k916M322L844j1176j3302K3099J3160p450L809l031m994J062
7506a395J052j0934l297R129N921J1335r092k657L674j7555p80O055J4418L972
7492I846l0255j6146O42O567Q093m943J4721J8914L865j3900j923O866k189J250
7478A408l139L704J0913J1031p269q806j4170L920L126l43k07r138p561o257K517
7463b0271q713k2864p52J1456K4013O575k014o313K288K94l814r877M21J8299
7449a1272M303K060J404o078J319J740m390q612P580K68k514j090J2378J4018
7435A1114K954j4517p991J6894J815L755J14j5552N43m422R725j253l419q258
$$ plain form
7421 -8498 -1838 12816 17275 12586 3657 -8113 -1091 310 7744 16962 17191 17750 20483 32994 26638
7406 26638 16896 6040 11037 2993 -10337 -7933 6607 1748 2438 6345 5291 -807 9492 -4868
7392 -4868 -11598 -4249 18643 23487 22344 18113 1710 -33 7142 -4365 6760 25847 21177 10629
7378 10629 8161 -6205 -25993 -30573 -20268 -15616 -3894 -13539 5185 19068 9805 827 3407
7365 3407 7151 -7523 -6979 -5780 -5259 -764 -9267 -11087 -17292 5279 15737 29865 26925 24612
7351 24612 25767 12282 -3669 3914 12542 5396 -2198 -3690 9363 13776 3422 8783 2478 -1273
7337 -1273 -5010 8356 7778 6343 17860 4008 2528 7836 -12638 -20725 -14907 -9252 -586 206
7323 206 5161 19089 14309 1237 309 136 319 1064 -2405 1932 -5419 -370 -7299 9764 13446
$$ packed form
7421h498O660J4654M459m689q929j1770P022J401P434R218K29N59K733J2511o356
7406B6638r742j0856M997q044j3330K404J4540m859O90L907j054o098J0299j4360
7392d868o730P349K2892M844j143m231j6403j743P175j1507J1125J9087m670j0548
7378A0629k468j4366j9788m580J0305M652J1722r645J8724J3883r263q978K580
7365C407L744j4674N44J199N21M495q503j820o205K2571J0458J4128k940k313
7351B4612J155j3485j5951P583Q628p146p594j492J3053M413j0354N361o305l751
7337a273l737J3366n78j435J1517j3852j480N308k0474q087N818N655Q666P92
7323B06M955J3928m780j3072r28j73J83P45l469M337p351N049o929J7063L682
$$ plain form
7308 13446 11660 -12904 -23290 -24020 -18456 -3588 18650 12466 1298 -9846 -14466 -7570 -6679 -1669
7294 -1669 6269 -3309 6163 9073 8267 -3524 -1383 -1554 5537 13502 3626 -12794 -10812 -11542 -12726
7279 -12726 -14279 -8558 -10645 -5026 -2797 -11370 -9534 1335 1764 1877 -4914 1004 5924 -3119 12923
7264 12923 17600 17040 16165 14227 -8705 -16551 -6868 -4799 4497 10019 15960 -1197 -15168 -7396
7250 -7396 -2307 -4029 -11830 -25083 -5426 6051 633 1162 -537 15049 8846 8644 3047 -7289
7236 -7289 -19091 -2340 -5109 -5339 -43 4076 4887 704 -18663 -27552 -11955 -1552 4127 6199
7222 6199 4697 10720 17710 22017 10945 -5053 -9687 -6393 6859 9654 1289 -6756 -12397 -16592
7208 -16592 -20323 -32808 -23188 -7886 3605 -3223 -12489 -6746 -3669 -72 -4097 -995 -1733 -8605
$$ packed form
7308A3446j786k4564j0386p30N564J4868K2238o184j1168j1144m620O896Q91N010
7294a669P938r578R472K910q06j1791K141j71P091P965r876j6420J982p30j184
7279a2726j553N721k087N619K229q573J836J0869M29J13o791N918M920r043J6042
7264A2923M677n60q75j938k2932p846R683K069R296N522N941j7157j3971P772
7250g396N089j722p801j3253J9657J1477n418N29j699J5586o203k02n597j0336
7236g289j1802J6751k769k30N296M119Q11m183j9367q889J5597J0403N679K072
7222F199j502O023O990M307j1072j5998m634L294J3252K795q365q045n641m195
7208a6592l731j2485R620J5302J1491o828r266N743L077L597m025L102p38o872
$$ plain form
7194 -8605 -12443 -18301 -2561 1204 4376 14752 19009 10509 -4554 -12963 -8554 -8373 -16383 173
7180 173 15617 7752 -3841 8406 12254 -2507 -18301 -27607 -37505 -26381 -12208 -735 9114
7167 9114 14621 8035 7030 5353 -1265 -7601 -10553 -12674 -9923 13754 23171 5394 -18106 -21789
7153 -21789 -17959 -7803 -6634 -4235 -15333 -32389 -31848 -21947 -38467 -43886 -45361 -48243 -51645 -38261
7139 -38261 -35310 -35665 -18481 -12434 -13796 -1855 7555 11617 7904 1552 -7909 -13619 -9855 -4903
7125 -4903 4874 9352 8845 7568 -691 6894 9826 -1458 -9190 -4777 -7997 -3771 10225 23191
7111 23191 14610 -1371 10668 25175 25504 20470 17465 11884 -721 -6037 -24685 -24266 -16863 -8426
7097 -8426 -16023 -15929 -18915 -17694 -12439 -6356 -4607 -4284 928 -1155 -3869 -8437 -16041 -15144 -12448 -10359
$$ packed form
7194h605l838n858J5740L765L172J0376M257q500j5063q409M409J81q010J6556
7180A73J5444p865j1593J2247L848j4761j5794r306r898J1124J4173J1473R849
7167I114N507o586j005j677o618o336k952k121K751K3677R417j7777k3500l683
7153b1789L830J0156J169K399j1098j7056N41R901j6520n419j475k882l402J3384
7139c8261K951l55J7184O047j362J1941R410M062l713o352r461n710L764M952
7125d903R777M478n07j277q259P585K932j1284p732M413l220M226J3996J2966
7111B3191q581j5981J2039J4507L29n034l005n581j2605n316j8648M19P403Q437
7097h426p597R4k986J221N255O083J749L23N212k083k714m568p604Q97K696K089
$$ plain form
7081 -10359 -3211 9778 10545 5789 -2592 -3422 14833 15464 -5491 -4333 -279 -2041 -2912 -8224 -17991
7066 -17991 -15082 -14955 -8365 -7296 4414 -16568 -33197 -22141 -5347 -13473 -18125 -3954 9547
7053 9547 4411 -9982 -17823 -9645 -12816 -7715 9995 15754 1387 -16529 -27838 -11660 -1442
7040 -1442 -1240 -8219 288 2546 -5136 -5555 8244 9396 13689 23111 10862 18694 6927 1233 1219
7025 1219 -3399 -7218 -7145 -8796 1683 6338 10488 6903 4128 -17384 -38858 -29295 -8546 -2124
7011 -2124 -11723 -17057 -27574 -26373 -10200 -5351 -11587 -2702 -875 7914 12174 9277 11944 559
6997 559 -7554 -345 3301 5280 -4867 -4126 7681 16735 9686 8644 12090 -3510 -9570 142 -3716
6982 -3716 -4112 8335 19141 24985 30884 11174 10439 12977 15825 269 3872 4342 2748 4438 18996
$$ packed form
7081a0359P148J2989P67m756q381q30J8255O31k0955J158M054j762q71n312r767
7066a7991K909J27O590J069J1710k0982j6629J1056J6794q126m652J4171J3501
7053I547n136j4393p841Q178l171N101J7710N759j4367j7916j1309J6178J0218
7040a442K02o979Q507K258p682m19J3799J152M293R422j2249P832j1767n694j4
7025A219m618l819P3j651J0479M655M150l585k775k1512k1474R563K0749O422
7011b124r599n334j0517J201J6173M849o236Q885J827Q789M260k897K667j1385
6997E59q113P209L646J979j0147P41J1807R054p049j042L446j5600o060R712l858
6982c716l96J2447J0806N844N899j9710p35K538K848j5556L603M70j594J690J4558
$$ plain form
6967 18996 26660 25680 13467 17004 25250 -3747 -9937 -18117 -22890 -12374 -15408 -20891 -22837 -30774
6953 -30774 -15850 -6753 143 -5907 -17830 -16727 -12817 -23150 -27862 -18671 -22393 -17842 -10654 -2638
6939 -2638 -2270 -300 6046 9230 6453 -3331 6536 14894 18602 12841 10565 6161 -3989 6075 4541
6924 4541 5567 -9965 -33479 -41121 -16797 -6145 -29722 -29027 -10737 -3902 -879 -1444 -2009 4798
6910 4798 5848 19536 26264 23468 22338 13107 12701 18115 12618 3400 -21115 -26488 -7857 -14235
6896 -14235 -26735 -24275 -16945 -14653 -2268 10678 10725 -1726 -4524 -15394 -8345 -4907 11679 6720
6882 6720 -5342 -13645 -11753 -17884 -21157 -28312 -16060 -5182 3819 -6431 5171 18476 4940
6869 4940 -26728 -23448 -18130 -17137 4204 3913 -5042 1427 -997 -18428 -22603 -36433 -36445 -36248 -35484
$$ packed form
6967A8996P664r80j2213L537Q246k8997o190q180m773J0516l034n483j946p937
6953c0774J4924R097O896o050j1923J103L910j0333m712R191l722M551P188Q016
6939b638L68J970O346L184k777r784R867Q358L708n761k276m404j0150J0064j534
6924D541J026j5532k3514p642K4324J0652k3577O95J8290O835L023n65n65O807
6910D798J050J3688O728k796j130r231m06N414n497r218k4515n373J8631o378
6896a4235j2500K460P330K292J2385J2946M7j2451k798j0870P049L438J6586m959
6882F720j2062q303J892o131l273p155J2252J0878R001j0250J1602J3305j3536
6869D940l1668L280N318R93K1341k91q955O469k424j7431m175j3830j2J97P64
$$ plain form
6854 -35484 -31173 -12541 -4521 -7562 6577 3820 -14575 -6340 -10305 -14297 -1994 -2563 -4648 6197
6840 6197 5093 9764 946 11911 30604 29691 26735 39390 22584 3823 -15764 -21686 -14223 2568
6826 2568 -4358 -3974 5155 8173 762 -6457 -5581 -7212 6105 4946 -2872 -11620 -14398 -13942 -10665
6811 -10665 -2983 -8792 -1621 -610 -11118 -23200 -30320 -38273 -19151 -8877 9266 8276 -651 -14851
6797 -14851 -22393 -34706 -27582 -6156 -2495 -11838 -18858 -25772 -9960 -6179 -6935 -3521 -14836 -10423
6783 -10423 3955 11984 14861 7448 9136 13044 1150 -1874 744 -2120 2737 653 -8779 -2143
6769 -2143 17059 12559 9245 2239 -12050 -4554 19031 27057 11238 5435 -628 865 -1688 -4585
6755 -4585 -9869 -8302 -11956 -15074 -9376 979 3893 3357 8777 26086 31838 12296 -34 -5403
$$ packed form
6854c5484M311J8632Q020l041J4139k757j8395Q235l965l992J2303n69k085J0845
6840F197j104M671q818J0965J8693r13k956J2655j6806j8761j9587n922P463J6791
6826B568o926L84R129L018p411p219Q76j631J3317j159p818q748k778M56L277
6811a0665P682n809P171J011j0508j2082p120p953J9122J0274J8143r90q927j4200
6797a4851p542j2313P124K1426L661r343p020o914J5812L781p56L414j1315M413
6783a0423J4378Q029K877p413J688L908j1894l024K618k864M857k084r432O636
6769b143J9202m500l314p006j4289P496K3585Q026j5819n803o063J493k553k897
6755d585n284J567l654l118N698J0355K914n36N420J7309N752j9542j2330n369
$$ plain form
6741 -5403 -2841 -4806 3776 305 -12123 -9829 6635 19977 33674 33098 32064 34456 37139 26787
6727 26787 13995 22952 21359 -5937 -10170 2206 5921 10056 3371 -8097 -3138 16436 17315 12053
6713 12053 3751 -5016 -7874 494 14914 24611 24600 15486 -6667 -12522 -10891 -1563 -7909 -9411 -3201
6698 -3201 16136 16038 11590 12617 5330 -4718 -13192 -12288 -16002 -7877 -4162 -13068 -13286 -16681 -19398
6683 -19398 -6270 -9793 -20024 -28982 -28433 -19864 -15162 -4973 -8350 -11096 -9755 381 14690 17811
6669 17811 24786 34578 22068 2591 1422 5099 -14269 -11972 3064 5239 3182 14572 16791
6656 16791 903 459 1662 6695 7035 -4055 -5012 -4588 -5802 1871 6508 3508 207 9779 15664
6641 15664 -6309 -7851 5621 15569 1655 -1325 4394 25602 29651 10460 -2409 5711 7977
$$ packed form
6741e403K562j965Q582l471j2428K294J6464J3342J3697n76j034K392K683j0352
6727B6787j2792Q957j593k7296m233J2376L715M135o685j1468M959J9574Q79n262
6713A2053q302q767k858Q368J4420R697j1r114k2153n855J631R328o346j502O210
6698c201J9337r8m448J027p287j0048q474R04l714Q125L715q906k18l395k717
6683a9398J3128l523j0231q958N49Q569M702J0189l377k746J341J0136J4309L121
6669A7811O975R792j2510j9477j169L677j9368K297J5036K175k057J1390K219
6656A6791j5888m44J203N033L40j1090r57M24j214P673M637l000l301R572N885
6641A5664k1973j542J3472R948j3914k980N719K1208M049j9191j2869Q120K266
$$ plain form
6628 7977 -4342 1086 6401 -10845 -15969 -22229 -26636 -22096 -30722 -26831 -7153 19900 19695 19329
6614 19329 15410 658 -10486 -22785 -19822 -15012 -25920 -31733 -25229 -5633 725 -2664 3107
6601 3107 4415 -4274 -13259 -7143 -128 5461 6663 -7044 -14456 -13958 -11965 -2906 -2381 -21636 -15952
6586 -15952 10479 27973 15851 14241 5878 -3317 -5549 -15633 -7743 -12302 -10914 -8865 -7147 10114
6572 10114 4207 -4021 2431 -4139 -1259 6852 14352 7362 11945 5867 3922 -13433 -12283 -1980
6558 -1980 5571 13414 13554 18800 21882 4060 -21516 -21132 -15302 -2692 4923 11685 4084 -15348
6544 -15348 -11114 -9837 -17164 -9033 7069 10609 -5110 3251 11206 5242 -3926 -11182 -7035 -9210
6530 -9210 -5280 2357 21374 22844 23954 19850 7000 14923 7895 -11732 -18542 -121 1885 3089
$$ packed form
6628G977j2319N428N315j7246n124o260m407M540q626L891J9678K7053k05l66
6614A9329l919j4752j1144j2299K963M810j0908n813O504J9596O358l389N771
6601C107J308q689q985O116P015N589J202j3707p412M98J993R059N25j9255N684
6586a5952K6431J7494j2122j610q363r195k232j0084P890m559J388K049J718J7261
6572A0114n907q228O452o570K880Q111P500o990M583o078j945j7355J150J0303
6558a980P551P843J40N246L082j7822k5576L84N830J2610P615O762p601j9432
6544a5348M234J277p327Q131J6102L540j5719Q361P955n964r168p256M147k175
6530i210L930P637J9017J470J110m104j2850P923p028j9627o810J8421K006J204
$$ plain form
6516 3089 7566 -1818 -6532 -8108 -7386 0 1870 1799 -6889 -9912 -10129 -8265 -9427 -18391 -7411 -5430
6500 -5430 -23091 -27770 -27631 -33592 -32646 -17919 5430 17279 14430 3919 1959 -2349 -9149 -4342
6486 -4342 3233 -1255 7929 16362 13141 3848 -6090 -2311 -552 -5141 -3266 5085 4921 1791 -14630
6471 -14630 -5789 1854 -5730 -8914 -5178 -8934 -13217 -21188 -15357 -15450 1406 6011 9886 19513 6457
6456 6457 4033 1743 -8263 2242 11195 -1123 -3323 -5449 9239 -11709 -16057 -5457 -12261
6443 -12261 -23879 -17676 -29356 -33317 -28401 -17671 6119 15109 47 11685 8322 3577 5357
6430 5357 9509 4919 -7217 -11223 6122 6960 2103 -19522 -5514 8218 8871 727 -9679 -12632
6416 -12632 -9322 -10310 -16974 -26459 -10131 14331 17098 15196 8102 2037 6756 11821 17822 18740 8296
$$ packed form
6516C089M477r384m714j576P22P386J870p1q688l023k17J864j162q964J0980J981
6500e430j7661m679J39n961R46J4727K3349J1849k849j0511j960m308o800M807
6486d342P575m488R184Q433l221r293r938L779J759m589J875Q351j64l130j6421
6471a4630Q841P643p584l184L736l756m283p971N831r3J6856M605L875R627j3056
6456F457k424k290j0006J0505Q953j2318k200k126J4688k0948m348J0600o804
6443a2261j1618O203j1680l961M916J0730K3790Q990j5062J1638l363m745J780
6430E357M152m590j2136m006J7345Q38m857k1625J4008J3732O53q144j0406k953
6416a2632L310r88o664r485J6328K4462K767j902p094o065M719N065O001R18j0444
$$ plain form
6401 8296 12183 9301 10719 15522 10740 11290 8150 -1432 -2387 -16247 -19984 -17411 -18057 -41091 -39954
6386 -39954 -33648 -42671 -49309 -41349 -17244 6386 6273 -12083 -1809 8151 11257 15995 -1045 -21409
6372 -21409 -28317 -29261 -18632 -4055 -1855 -3773 -6252 -532 6785 -4632 -2678 3310 -4964 -2206
6358 -2206 -1848 -6135 -12982 -27422 -29434 -3229 19432 15356 6001 -8198 -7114 -6417 7932 5763
6344 5763 -6445 -15727 -12049 -5525 -4671 -14516 -22800 -17325 -7439 -8968 -2102 3650 1228 2185 7236
6329 7236 7179 -3342 -15764 -24364 -17623 -10728 17239 13209 9321 6122 -2934 1016 -9377 -9630 5322
6314 5322 -3534 -15427 -3978 7244 17441 11110 -4106 -8206 -18855 -19028 -12149 9552 6984
6301 6984 5759 7770 -8377 -12109 -16185 2501 2637 1767 -10935 -33400 -51596 -46551 -31769 -22396
$$ packed form
6401H296L887k882J418M803m782N50l140r582r55j3860l737K573o46k3034J137
6386c9954O306r023o638P960K4105K3630j13j8356J0274R960L106M738j7040k0364
6372b1409o908r44J0629J4577K200j918k479N720P317j1417J954N988q274K758
6358b206L58m287o847j4440k012K6205K2661m076r355j4199J084O97J4349k169
6344E763j2208r282L678O524Q54r845q284N475R886j529O866N752k422R57N051
6329G236n7j0521j2422q600O741O895K7967m030l888l199r056L950j0393k53J4952
6314E322q856j1893J1449J1222J0197o331j5216m100j0649j73O879K1701k568
6301F984j225K011j6147l732m076J8686J36q70j2702k2465j8196N045J4782R373
$$ plain form
6287 -22396 -11417 -12599 -15986 -14773 3774 -846 -4332 -14248 1596 19488 17503 24050 6296
6274 6296 -10681 -9926 7436 10678 23161 29227 9665 -2073 -11476 -15070 -16595 -4882 -3637 -11755
6260 -11755 -3877 16095 14581 7266 6119 5522 11795 3136 7518 24410 -1422 -13371 -5261 -11135
6246 -11135 -24885 -17795 -7669 -3467 -6937 -9845 -10130 -18246 -23620 -10293 13236 31841 20285
6233 20285 13313 17228 32781 31729 18906 3889 -15701 -29354 -23171 -17959 -12922 8946 11218
6220 11218 5141 -6717 -19973 -13204 -24731 -22626 -22026 -14453 1919 6718 1423 -6572 -12595 -19609
6206 -19609 -25837 -22854 -27625 -19956 -11928 4586 4294 6145 5190 -3991 -2222 2132 14650 22533 14827
6191 14827 625 904 -11841 -16711 -7993 -4730 -7854 6917 19774 25961 31064 36821 19692 -2094
$$ packed form
6287b2396J0979j182l387J213J8547m620l486r916J5844J7892j985O547j7754
6274F296j6977P55J7362L242J2483O066j9562j1738r403l594j525J1713J245q118
6260a1755P878J9972j514p315j147n97O273q659M382J6892k5832j1949Q110n874
6246a1135j3750P090J0126M202l470k908k85q116n374J3327K3529J8605j1556
6233B0285o972L915J5553j052j2823j5017j9590j3653O183N212N037K1868K272
6220A1218o077j1858j3256O769j1527K105O00P573J6372M799n295p995o023p014
6206a9609o228K983m771P669Q028J6514k92J851r55r181J769M354J2518P883p706
6191A4827j4202K79j2745m870Q718L263l124J4771J2857O187N103N757j7129k1786
$$ plain form
6177 -2094 -5939 3803 15803 6249 8317 961 1391 2029 -5393 5043 7322 10765 -3924 -16664
6163 -16664 -14635 -8485 -3386 -15367 -25067 -21817 -24230 -27939 -12530 -2822 -8904 -1001 -342 3548
6149 3548 12084 7539 -617 -11430 -5870 1689 -9324 -13235 -13525 -27468 -11041 11543 12822 16994
6135 16994 7355 1313 -1165 17327 39898 39327 35373 35940 26002 15092 10701 9382 18368 8933
6121 8933 3601 -8177 -6993 -12553 -37122 -38598 -16459 5455 11918 25641 11545 3884 370
6108 370 -13480 -7178 -4374 5852 9292 8791 18521 11368 -904 1695 3922 11071 -6633 -7980
6094 -7980 9943 13692 12160 -10397 -20300 -5326 16611 16116 10163 3427 9062 20051 28097 19163
6080 19163 16658 2933 -3514 9368 19745 11615 12853 18193 10400 9749 634 2193 11457 0
$$ packed form
6177b094l845R742J2000r554K068p356M30O38p422J0436K279L443j4689j2740
6163a6664K029O150N099j1981r700L250k413l709J5409R708o082P903O59L890
6149C548Q536m545q156j0813N560P559j1013l911k90j3943J6427K2584J279M172
6135A6994r639o042k478J8492K2571n71l954N67r938j0910m391j319Q986r435
6121H933n332j1778J184n560k4569j476K2139K1914O463J3723j4096p661l514
6108C70j3850O302K804J0226L440n01R730p153j2272K599K227P149j7704j347
6094g980J7923L749j532k2557r903J4974K1937m95n953o736N635J0989Q046q934
6080A9163k505j3725o447J2882J0377q130J238N340p793o51r115J559R264j1457
$$ plain form
6066 0 11767 14452 -2589 -5345 -2944 -11571 -23511 -28228 -29439 -24650 -14949 3400 -1809 9348
6052 9348 9936 4611 404 8147 11763 -2812 -15250 -12081 -13654 -3981 16232 22111 16220 8822
6038 8822 11728 16800 12531 -5972 -7781 -6596 3290 16160 11539 15114 20881 22113 8938 -857
6024 -857 3075 932 -3387 -11210 1011 3502 3032 10616 -4613 -11553 -12454 -10569 -7145 3646 6325
6009 6325 8830 6332 10949 2633 -4388 -3902 -6389 1944 -4665 -12345 -21030 -20751 -7090 -1341 4905
5994 4905 -475 -24198 -25550 -30450 -16757 -21930 -22359 -15737 -10754 -7964 -6978 -14715 -18516 -27032 -13918
5979 -13918 -14929 -2321 3060 -492 7093 -2010 2133 -10014 -18344 -10680 -11017 208 2594 647
5965 647 -2153 -2423 7211 8647 5980 -90 3358 3450 -5088 -11425 -6415 4346 501 -1613 -741 -10837
$$ packed form
6066@J1767K685j7041k756K401q627j1940m717j211M789R701J8349n209J1157
6052I348N88n325m207P743L616j4575j2438L169j573R673K0213N879n891p398
6038H822K906N072m269j8503j809J185R886J2870m621L575N767J232j3175r795
6024h57L932k143m319p823J2221K491m70P584j5229o940r01J885L424J0791K679
6009F325K505k498M617q316p021M86k487Q333o609p680q685K79J3661N749O246
5994D905n380k3723j352m900J3693n173m29O622M983K790R86p737l801q516J3114
5979a3918j011J2608N381l552P585r103M143j2147q330P664l37J1225K386j947
5965F47k800k70R634J436k667o070L448R2q538o337N010J0761l845k114Q72j0096
$$ plain form
5949 -10837 -11997 -713 -4257 -13818 -6043 5177 14172 8926 4290 2339 -1187 275 7671 9934
5935 9934 3785 -1407 -11710 -23718 -21290 -20971 -24451 -28047 -13596 -17880 -25937 -25084 -29980 -40322
5921 -40322 -35586 -21172 -26537 -22628 -8468 -4763 -13635 -22493 -25371 -16703 -11560 -6573 -3114 -4151
5907 -4151 9448 21296 31138 26617 6918 -19023 -32643 -29588 -25495 -19030 -15302 -21867 -15225 -21306
5893 -21306 -15507 -11893 -10435 -10865 -12275 -20926 -34133 -30913 -14428 3355 -1654 -6495 6824 14169
5879 14169 11300 229 -12758 -10179 -12464 -2575 -11234 -12770 -24884 581 8744 -11642 974
5866 974 -4920 -8184 -2135 1133 -2835 10628 4887 7186 6009 -13790 5150 -3261 774 -2234
5852 -2234 -5836 -10325 -11041 -816 -2257 -3959 7109 21483 22133 3261 -12075 -17335 -8777 -4096
$$ packed form
5949a0837j160J1284l544r561P775J1220Q995n246m636j951l526J462P396K263
5935I934o149n192j0303j2008K428L19l480l596J4451m284q057Q53m896j0342
5921d0322M736J4414n365L909J4160L705q872q858k878Q668N143M987L459j037
5907d151J3599J1848R842m521j9699k5941j3620L055M093O465L728o565O642o081
5893b1306N799L614J458m30j410q651j3207L220J6485J7783n009m841J3319P345
5879A4169k869j1071j2987K579k285R889q659j536j2114K5465Q163k0386J2616
5866I74n894l264O049L268l968J3463n741K299j177j9799J8940q411M035l008
5852b234l602m489p16J0225j441j702J1068J4374O50j8872j5336n260Q558M681
$$ plain form
5838 -4096 -9637 -22302 -22436 6110 14595 13362 15544 13216 12452 15960 22244 30422 23539 6706 -1014
5823 -1014 11568 13085 1673 -1141 -1595 -15881 -5053 -14621 -18254 -14166 -9108 -20742 -7271 1557
5809 1557 15580 18239 6222 -10691 -23212 -24459 -19567 -23352 -15595 -4675 9716 15594 9894
5796 9894 16354 27511 16849 -2759 3290 1222 -8617 -13007 -13857 -12378 -10228 -5914 -5107 -1156 -4715
5781 -4715 4234 11115 7084 -8297 2999 9922 172 -9381 -22587 -22909 -20457 -17604 -23045 -14129
5767 -14129 2514 -2003 -11057 -10101 -8192 -771 11295 18561 24760 18090 23571 18587 6153 -1666
5753 -1666 -6642 1801 -4607 -5562 -1339 -1299 -5296 -5829 -18454 -21061 -12115 7826 -2745 -6967 615
5738 615 -10689 -19953 -9861 -11038 -7520 -17413 -30659 -42568 -39933 -45353 -39691 -35536 -25140 -6778
$$ packed form
5838d096n541j2665j34K8546Q485j233K182k328p64L508O284Q178o883j6833p720
5823a014J2582J517j1412k814m54j4286J0828r568l633M088N058j1634J3471Q828
5809A557J4023K659j2017j6913j2521j247M892l785P757J0920J4391N878n700
5796I894O460J1157j0662j9608O049k068r839m390q50J479K150M314Q07L951l559
5781d715Q949O881m031j5381J1296O923r750r553j3206l22K452K853n441Q916
5767a4129J6643m517r054R56J909P421J2066P266O199o670N481m984j2434p819
5753a666m976Q443o408r55M223M0l997n33j2625k607Q946J9941j0571m222P582
5738F15j1304r264J0092j177L518r893j3246j1909K635n420N662M155J0396J8362
$$ plain form
5724 -6778 -3160 -3815 603 6318 -836 -6956 4009 8408 -5653 -8926 -489 4084 9712 4992 12932
5709 12932 776 -16163 -15505 -15992 -710 -5893 -11793 -20737 -30000 -9334 9346 10733 -10179 -17894
5695 -17894 -2899 6034 11373 7630 -17579 -17176 -14789 -15091 -5643 -1839 -651 -1577 9451 17205 17780
5680 17780 24737 15054 565 -2796 -3880 -7485 -5031 -5128 17814 28487 27518 39850 37245 18216
5666 18216 11531 10225 -3116 -9029 -8672 -13888 -10968 1824 4211 3222 10861 18102 -6305 -21618
5652 -21618 -6714 1937 6760 5452 376 957 -11479 -4649 -9422 -16384 -7379 -6268 -3101 -43
5638 -43 -14081 -7218 7439 1329 -14266 -12903 -5644 -23005 -21241 5054 9187 6599 19354 18340
5624 18340 8220 -3690 -18858 -21360 -23729 -16308 5333 32288 32238 20357 2087 7291 8029 -6402
$$ packed form
5724f778L618o55M418N715p154o120J0965M399j4061l273Q437M573N628m720P940
5709A2932j2156j6939O58m87J5282n183n900q944r263K0666J8680J387k0912p715
5695a7894J4995Q933N339l743k5209M03K387l02R448L804J188r26J1028P754N75
5680A7780O957r683j4489l361j084l605K454r7K2942J0673r69J2332k605j9029
5666A8216o685j306j3341n913L57n216K920J2792K387r89P639P241k4407j5313
5652b1618J4904Q651M823j308n076N81j2436O830m773o962R005J111L167L058
5638d3j4038O863J4657o110j5595J363P259j7361J764K6295M133k588J2755j014
5624A8340j0120j1910j5168k502k369P421K1641K6955n0j1881j8270N204P38j4431
$$ plain form
5610 -6402 -12987 -20297 -19777 -6791 -4903 -17496 -14280 -6992 -4139 -6389 -7631 -6526 -6686 949 -402
5595 -402 -85 -7199 -27282 -18840 -9627 -4396 -17671 -13249 -7891 3850 13002 6699 -18815 -21271
5581 -21271 -7862 10582 8732 -5491 -10558 -18791 -14833 -29687 -24327 -16173 -1294 9518 20509
5568 20509 23568 10808 754 1641 19 8281 5377 -9842 -13283 -2962 -2730 -5614 9700 6579
5554 6579 -4836 -8400 -336 7485 -179 8239 16665 25963 13149 5063 8371 3093 -1757 -677
5540 -677 5191 9438 13531 9500 -7346 -11098 -23801 -21997 -29933 -12402 -918 -4132 -7358 -6329
5526 -6329 -6192 -641 -4585 -14493 -20113 -19706 -22714 -24319 -20002 -24934 -17105 1727 12605 -10368 -15816
5511 -15816 -19459 -16111 2811 10881 3644 4003 5866 -3601 8240 18292 13124 -12459 -22292 -18952
$$ packed form
5610f402o585p310N20J2986J888j2593L216P288K853k250j242J105j60P635j351
5595d02L17p114k0083Q442R213N231j3275M422N358J1741R152o303k5514k456
5581b1271J3409J8444j850j4223n067q233L958j4854N360Q154J4879J0812J0991
5568B0509L059j2760j0054Q87j622Q262k904j5219l441J0321K32k884J5314l121
5554F579j1415l564Q064P821p664Q418Q426R298j2814q086L308n278m850J080
5540f77N868M247M093m031j6846l752j2703J804p936J7531J1484l214l226J029
5526f329J37N551l944r908n620M07l008j605M317m932P829J8832J0878k2973n448
5511a5816l643L348J8922Q070p237L59J863r467J1841J0052n168k5583r833L340
$$ plain form
5497 -18952 -13582 -14806 -1252 887 -6775 -2988 14685 21853 16296 7488 1447 6035 10601 -670
5483 -670 -23501 -16321 7629 19654 -2260 -12367 6259 235 6607 -14341 -19212 -870 20700
5470 20700 26109 28069 25991 12926 15601 7840 5219 7497 15094 22623 11197 4739 4606 -11764
5456 -11764 -29762 -22533 -32078 -25975 -25657 -33593 -18230 1410 2496 3803 3701 -244 -485 -9859 -20703
5441 -20703 -23603 -20270 -9733 -14339 -7822 -5237 -14529 -16943 -14695 -15103 -5812 -262 10327 8593
5427 8593 8 -34505 -41064 -28329 -25377 -9011 4964 6239 -6885 -7617 -5366 -2522 -4211 -13331
5413 -13331 -5146 -5456 -3810 -334 8541 -7191 -17852 5127 9620 -2831 -3299 -3025 19256 12517
5399 12517 -6083 -8802 4598 10037 1678 -3788 -7420 -5822 -7312 -17986 -11499 -8797 3309 14431
$$ packed form
5497a8952N370j224J3554K139p662L787J7673P168n557q808o041M588M566j1271
5483f70k2831P180K3950J2025k1914j0107J8626o024O372k0948m871J8342K1570
5470B0700N409J960k078j3065K675p761k621K278P597P529j1426o458j33j6370
5456a1764j7998P229r545O103L18p936J5363J9640J086J307j02l945k41r374j0844
5441b0703k900L333J0537m606O517K585r292k414K248m08R291N550J0589j734
5427H593q585l4513o559J2735K952J6366J3975J275j3124p32K251K844j689r120
5413a3331Q185l10J646L476Q875j5732j0661K2979M493j2451m68K74K2281o739
5399A2517j8600k719J3400N439q359n466l632J598j490j0674O487K702J2106J1122
$$ plain form
5385 14431 5224 -14004 -7999 -3087 -13880 -14302 -2478 -11252 -7308 -10105 -19796 -19461 -16055 -24097
5371 -24097 -25610 -22806 -17786 -9210 -11703 -8808 -10832 -30346 -19689 -11185 -7950 -9852 -9260 -22305
5357 -22305 -29555 -13257 -143 5875 1740 4026 3935 -3685 -3936 6245 -7436 -16338 -4339 13277
5343 13277 27638 19057 11821 18381 4377 -5800 -4174 -6171 -23813 -28673 -25288 -17577 -10604 8675
5329 8675 7527 -1654 -5138 -12958 -18758 -20703 -14238 6202 33344 27216 14355 6238 -4161 -1950
5315 -1950 -8520 -6620 -3176 -5807 -21651 -15247 -10495 -12822 -25042 -13161 -2032 -1625 -23112 -19502
5301 -19502 -9750 3367 15136 24563 17594 12 -1100 7894 14918 19983 19522 12437 8435 16604
5287 16604 10608 -1582 -2922 -5950 4466 13758 13964 14837 10897 12626 23113 13662 13151 6445 5109
$$ packed form
5385A4431r207j9228O005M912j0793m22J1824q774L944k797r691L35L406q042
5371b4097j513K804N020Q576k493K895k024j9514J0657Q504L235j902N92j3045
5357b2305p250J6298J3114O018m135K286r1p620k51J0181j3681q902J1999J7616
5343A3277J4361q581p236O560j4004j0177J626j997j7642m860L385P711O973J9279
5329H675j148r181l484p820n800j945O465K0440K7142o128j2861q117j0399K211
5315a950o570J900L444k631j5844O404M752k327j2220J1881J1129M07k1487L610
5301a9502R752J3117J1769R427o969j7582j112Q994P024N065m61p085m002Q169
5287A6604n996j2190j340l028J0416R292K06Q73l940J729J0487r451n11o706j336
$$ plain form
5272 5109 6817 -11827 -10254 -6621 -8529 -2064 8640 12053 10142 15163 25466 32061 24228 14634
5258 14634 -9030 -1658 8574 -5500 -18422 -19415 -17985 -2757 6953 17669 14910 -9468 -32969
5245 -32969 -29631 -13631 -10111 2727 11638 5768 -3349 16397 6303 -12380 -6124 17897 23871
5232 23871 19662 16463 20608 15060 8524 -1662 6626 -3819 -14683 -4945 -4371 -11325 -21278 -20291
5218 -20291 -10616 -19640 -25938 -17017 -14712 -15765 1493 -7836 -12532 247 15098 16524 4580 -11772
5204 -11772 828 7408 15750 20957 16223 13236 8838 -633 -5965 -14421 -4125 -3228 -2119 8640
5190 8640 20600 22598 15924 11950 4794 -424 500 18414 17399 9242 2006 -3774 2297 -3319 -442
5175 -442 2750 7581 1021 6063 15285 17410 4159 2013 1629 9872 19411 23058 34411 17562 5652
$$ packed form
5272E109J708j8644J573L633j908O465J0704L413j911N021J0303O595p833r594
5258A4634k3664P372J0232j4074j2922r93J430J5228R710J0716k759k4378k3501
5245c2969L338J6000L520J2838Q911n870r117J9746j0094j8683O256K4021N974
5232B3871m209l199M145n548o536j0186Q288j0445j0864R738N74o954r953R87
5218b0291R675r024o298Q921K305j053J7258r329m696J2779J4851J426j1944j6352
5204a1772J2600O580Q342N207m734k987m398r471n332q456J0296Q97J109J0759
5190H640J1960J998o674l974p156n218R24J7914j015q157p236n780O071n616K877
5175d42L192M831o560N042R222K125j3251k146l84Q243R539L647J1353j6849j1910
$$ plain form
5160 5652 2315 -6650 -6652 -14418 -4040 1524 -466 -9754 -8076 -2995 -1477 -48 9098 21796 15836
5145 15836 3548 -22863 -29008 -23010 -22308 -12805 -8374 -14334 -4687 -2708 -10672 -16222 -14013 -6769
5131 -6769 13266 18770 -5696 -9992 -14464 -16519 -15177 -16241 -29681 -21802 -29797 -33070 -21259 -7835
5117 -7835 -2840 -14771 -26720 -19253 -13955 -5740 17924 33943 31707 17787 17404 10443 -2564 -9547
5103 -9547 -11687 -28851 -32187 -28013 -17334 -6649 -5125 -13200 -12636 -9116 -2791 6068 892 -11229
5089 -11229 -2155 3317 7463 31866 29019 17241 2645 3231 11988 18721 10734 16351 4350 -9311
5075 -9311 -13746 -14149 -14613 -3253 14513 13522 659 7708 -799 -14333 -13046 -13667 -13555 -3135 -2084
5060 -2084 1007 7316 12940 9559 -7636 -14361 -4298 4596 -2611 -2821 -277 -4363 5096 26491
$$ packed form
5160E652l337q965kp766J0378N564j990r288J678N081J518J429R146J2698n960
5145A5836j2288k6411o145N998P02R503M431n960R647J979p964n550K209P244
5131f769K0035N504k4466m296m472k055J342j064j3440P879p995l273J1811J3424
5117g835M995j1931j1949P467N298Q215K3664J6019k236j3920l83o961j3007o983
5103i547k140j7164l336M174J0679J0685J524q075N64L520O325Q859n176j2121
5089a1229R074N472M146K4403k847j1778j4596N86Q757O733p987N617j2001j3661
5075i311m435m03m64J1360J7766r91j2863P049q507j3534J287o21J12J0420J051
5060b084L091O309N624l381j7195o725J0063Q894p207k10K544m086R459K1395
$$ plain form
5046 26491 27900 18191 7854 7510 5713 -4110 113 4638 1804 1342 2328 4395 11127 77 -23065
5031 -23065 -22754 -12307 -9540 -11401 -27027 -32107 -15170 -1820 -9770 -11196 -5813 -9973 -22189 -31091
5017 -31091 -17694 -11632 -2007 -3848 -6928 7620 24014 21218 11851 4452 -12657 -15136 3129
5004 3129 8230 4012 14440 -1086 7411 10071 6629 -4279 -18736 -14959 -3123 16852 18343
4991 18343 8618 1807 1461 -9446 -22390 -14392 -10243 -4639 3865 13673 10736 -1550 -9828 -14800
4977 -14800 -13245 -6811 -567 1463 1494 3665 16737 21714 14892 9840 7045 -7166 -10580 -10790 -2113
4962 -2113 -12637 -22578 -20866 -14737 -13450 -9013 -3720 -85 -1684 -9319 -1585 8363 2444 -3125 4113
4947 4113 8692 14719 -3585 -5945 13630 19145 1744 -4439 5639 10533 7447 7529 -2678 -21058
$$ packed form
5046B6491J409r709j0337l44j797r823M223M525k834m62R86K067O732j1050k3142
5031b3065L11J0447K767j861j5626n080J6937J3350p950j426N383m160j2216q902
5017c1091J3397O062R625j841l080J4548J6394k796r367p399j7109k479J8265
5004C129N101m218J0428j5526Q497K660l442j0908j4457L777J1836J9975J491
4991A8343r725o811l46j0907j2944P998M149N604Q504R808k937j2286q278m972
4977a4800J555O434O244K030L1K171J3072M977o822n052k795j4211l414k10Q677
4962b113j0524r941J712O129J287M437N293L635j599p635P734R948n919n569P238
4947D113M579O027j8304k360J9575N515j7401o183J0078M894l086Q2j0207j8380
$$ plain form
4933 -21058 -27746 -33660 -35588 -23941 -8829 -15363 -34829 -50121 -28999 -17576 -4588 8577 24472
4920 24472 16713 -7511 -16440 -17277 -22175 -20233 -12851 1120 -1356 -6250 -5596 -7421 -11670 -10720 -22378
4905 -22378 -17118 1785 4287 -8956 -5401 -9233 -15063 -1097 -12836 -18229 -5372 -12670 -23304
4892 -23304 -18683 -9702 -1310 4889 1465 -2492 -2001 -9089 -18481 -13346 -10657 -714 2682 11238 4988
4877 4988 -8382 -8900 -12380 -19257 -1335 13100 2733 766 -82 -1527 9457 -5430 -12603 -4164
4863 -4164 -4344 7486 -1752 -8266 -16056 -16426 -30315 -34348 -38574 -25602 -17762 -2035 9133 15789
4849 15789 -96 -5626 -11175 -13297 -9733 -24303 -32870 -14074 -12288 -8522 1082 -11028 -7548 21467
4835 21467 34901 38669 32351 31502 27544 18099 8384 14111 8608 3719 -5820 -7047 -6945 -7631 9889
$$ packed form
4933b1058o688n914j928J1647J5112o534j9466j5292K1122J1423J2988J3165J5895
4920B4472p759k4224q929q37m898J942P382J3971k476m894O54j825m249R50j1658
4905b2378N260J8903K502j3243L555l832n830J3966j1739n393J2857p298j0634
4892b3304M621Q981Q392O199l424l957M91p088r392N135K689R943L396Q556o250
4877D988j3370n18l480o877J7922J4435j0367j967q48j445J0984j4887p173Q439
4863d164j80J1830r238o514p790l70j3889m033m226J2972P840J5727J1168O656
4849A5789j5885n530n549k122L564j4570q567J8796J786L766R604j2110L480K9015
4835B1467J3434L768o318q49l958r445r715N727n503m889r539j227J02o86J7520
$$ plain form
4820 9889 21033 1276 -1571 -15635 -16933 -6006 -9216 -12017 -18207 -19025 -6279 9746 9084 6137
4806 6137 -8821 -7914 -8071 3084 10580 9567 11545 27157 22234 -25 -8512 -17566 -13626 -16145
4792 -16145 -22655 -7894 855 -457 6993 20682 11843 2665 9305 3390 -13324 -19715 -7479 -935
4778 -935 8212 13299 22764 28118 16222 17612 12376 17700 20870 25805 21565 6592 3293 1486 8858
4763 8858 24763 17769 17197 18448 9581 3137 8203 -920 -7828 -9604 -5898 -3900 5722 15253 13777
4748 13777 -738 -10961 -5429 11211 20371 16400 11099 -1078 -5515 -12663 -28931 -19544 -9393
4735 -9393 -823 8364 4159 7927 -685 -19310 -17375 -9189 -10803 -23572 -21932 1273 11770 6362
4721 6362 271 -2875 -1042 -185 -6939 -2524 12026 14436 9008 4349 -2165 -11598 -5502 -7930 -19763
$$ packed form
4820I889J1144j9757k847j4064j298J0927l210k801o190q18J2746J6025o62k947
4806F137j4958R07j57J1155P496j013J978J5612m923k2259q487r054L940k519
4792a6145o510J4761Q749j312P450J3689q839r178O640n915j6714o391J2236O544
4778i35R147N087R465N354j1896J390n236N324L170M935m240j4973l299j807P372
4763H858J5905o994n72J251q867o444N066r123o908j776L706J998R622R531j476
4748A3777j4515j0223N532J6640R160l971n301j2177m437p148j6268R387J0151
4735i393Q570R187m205L768q612j8625J935Q186j614j2769J640K3205J0497n408
4721F362o091l146J833Q57o754M415J4550K410n428m659o514r433O096k428j1833
$$ plain form
4706 -19763 -16291 -11712 -15573 -7317 232 -500 -1516 -11970 -26574 -27322 -21045 -6063 3259 -27391
4692 -27391 -48700 -59164 -42423 -23390 -18624 -19928 -25259 -26470 -20535 -16544 -13450 -10783 -23188
4679 -23188 -21415 -17866 -30008 -26814 -8261 -8348 2575 -12050 -28747 -28257 -26944 -29459 -38547 -30374
4665 -30374 -23532 -16880 -11207 -10477 -21034 -31209 -28654 -26313 -16543 -12390 -16057 -14162 -7187 -9714
4651 -9714 -6066 16015 36305 19849 1072 -2894 3145 6322 16652 20691 11433 11465 -3015 -11880
4637 -11880 2147 2655 -4794 -8267 862 18944 23552 15361 25965 17348 20988 9499 -19969 -13610
4623 -13610 7150 13119 -9146 -19736 -5010 -4318 -11345 -2780 18647 32762 20428 -4300 557
4610 557 1190 3664 14083 9041 6080 1203 2091 15802 14772 7459 3189 -7221 -6067 1017 624
$$ packed form
4706a9763L472M579l861Q256P549p32j016j0454j4604p48O277J4982R322l0650
4692b7391k1309j0464J6741J9033M766j304n331j211N935L991L094K667j2405
4679b3188J773L549j2142L194J8553q7J0923j4625j6697M90J313k515r088Q173
4665c0374O842O652N673P30j0557j0175K555K341R770M153l667J895O975k527
4651i714L648K2081K0290j6456j8777l966O039L177J0330M039r258L2j4480q865
4637a1880J4027N08p449l473R129J8082M608q191J0604q617L640j1489k9468O359
4623a3610K0760N969k2265j0590J4726O92p027Q565K1427J4115j2334k4728M857
4610E57O33K474J0419n042k961m877Q88J3711j030p313m270j0410J154P084l93
$$ plain form
4595 624 -4263 10167 740 -8972 -19790 -22224 -10504 -9872 -7840 -690 4985 -2019 -12384 -10727
4581 -10727 -5012 -26261 -35454 -29704 -30901 -39777 -39483 -31732 -24889 -7562 6250 -4267 -10646 -11210
4567 -11210 -1471 -15993 -9742 -5248 3582 -32 9965 12109 11293 -3604 -6929 -11132 -19690 -11214
4553 -11214 -9369 -12075 -12853 -20102 -20417 -12495 -22887 -21340 -16622 -12736 -20121 -22178 -17585 -14619 -2664
4538 -2664 12567 22104 16044 -5344 -10314 -8125 -2173 -13414 -18767 -24290 -10250 1777 -12068
4525 -12068 485 791 -3526 -11539 -24517 -19501 9200 12197 1556 -1324 -19217 -15117 -11592 1332
4511 1332 3799 4721 1098 463 -15 -14726 -14773 -7432 -13373 -23388 -12891 -13605 -15724 9037 12970
4496 12970 1587 290 10963 26316 14015 -13930 -22829 -31235 -31571 -18796 910 15858 21972
$$ packed form
4595F24m887J4430r427r712j0818k434J1720O32K032P150N675p004j0365J657
4581a0727N715k1249r193N750j197q876K94P751O843J7327J3812j0517o379n64
4567a1210R739j4522O251M494Q830l614R997K144q16j4897l325m203q558Q476
4553a1214J845k706p78p249l15P922j0392J547M718L886p385k057M593K966J1955
4538b664J5231R537o060k1388m970K189N952j1241n353n523J4040J2027j3845
4525a2068J2553L06m317q013j2978N016K8701K997j0641k880j7893M100L525J2924
4511A332K467R22l623o35m78j4711m7P341n941j0015J0497p14k119K4761L933
4496A2970j1383j297J0673J5353j2301k7945q899q406l36J2775J9706J4948O114
$$ plain form
4483 21972 13042 7383 3076 -20839 -36857 -32597 -13369 -8972 -14185 -26244 -23853 -14927 3453
4470 3453 16448 3062 8836 13611 11196 -3676 -8411 -11363 -20635 -14097 -2703 6260 14274 6800
4456 6800 302 -3634 -8583 -5702 -6166 -8484 -8250 -1450 6910 4250 13068 13465 2375 -6621 -22195
4441 -22195 -23675 -14255 -5410 -9688 -1492 15648 9594 5736 7032 6539 144 -570 6532 9988 15651
4426 15651 13655 13364 10454 23973 40907 18166 7129 10593 4942 -1022 -8805 -16704 -15274 -8310
4412 -8310 -65 5158 4024 12434 20886 9830 -6467 -18648 -28768 -22413 -11922 10543 6680
4399 6680 -7293 -14588 -10318 -10689 -11256 -21191 -18190 6923 23584 14960 2731 1505 -2455 -2892 -5059
4384 -5059 -4293 -3562 -18010 -13283 -25803 -28514 -26519 -29475 -13477 3338 8055 -813 -19974 -19881 -16804
$$ packed form
4483B1972q930n659m307k3915j6018M260J9228M397n213j2059K391Q926J8380
4470C453J2995j3386N774M775k415j4872m735k952r272O538J1394Q963Q014p474
4456F800o498l936m949K881m64k318K34O800Q360k660Q818L97j1090q996j5574
4441b2195j480R420Q845m278Q196J7140o054l858J296m93o395p14P102L456N663
4426A5651j996k91k910J3519J6934k2741j1037L464n651n964p783p899J430O964
4412h310Q245N223j134Q410Q452j1056j6297j2181j0120O355J0491K2465l863
4399F680j3973p295M270l71n67r935L001K5113J6661q624j2229j226l960m37k167
4384e059P66P31j4448M727j2520k711J995k956J5998J6815M717q868j9161R3L077
$$ plain form
4369 -16804 -14230 7289 13273 16566 18110 20161 16693 19880 31291 34603 18212 -483 6108 22371
4355 22371 23391 12579 -3134 -6581 6557 12799 17938 14304 1619 -23248 -20423 -12026 -14406
4342 -14406 -17920 -25113 -20585 -511 5948 197 3502 2877 5778 999 4132 -5771 -11091 -12174 -15820
4327 -15820 -17922 -4319 6300 9188 -427 -9901 -13088 -10250 -22298 -23314 -21421 -14039 -17987 -18232
4313 -18232 -17875 -14906 -6800 -2533 -5354 -13074 -15263 -10086 -14450 -18964 -12892 2937 5090 -3965 10303
4298 10303 28396 24179 24352 21737 12065 4984 13924 21128 14638 9268 367 3903 -1388 -16179
4284 -16179 -12492 -3287 -7482 6278 21454 25614 23652 5941 9583 17911 13483 17575 18883 11215
4270 11215 10717 9249 8234 2024 -1734 -20449 -488 25562 18583 24924 22125 24525 18031 22172
$$ packed form
4369a6804K574K1519N984L293J544K051l468L187J1411L312j6391j8695O591J6263
4355B2371J020j0812j5713l447J3138O242N139l634j2685k4867K825Q397k380
4342a4406l514p193M528K0074O459n751L305o25K901m779L133r903n320j083l646
4327a5820k102J3603J0619K888r615r474l187K838j2048j016J893P382l948k45
4313a8232L57K969Q106M267k821p720k189N177m364m514O072J5829K153r055J4268
4298A0303J8093m217J73k615r672p081Q940P204o490n370q901L536n291j4791
4284a6179L687R205m195J3760J5176M160j962j7711L642Q328m428M092J308p668
4270A1215m98j468j015o210l758j8715J9961K6050o979O341k799K400o494M141
$$ plain form
4256 22172 22248 12426 -5440 -2151 -5500 -9286 -5524 9452 20728 26622 4675 -5185 10530 9265
4242 9265 -2159 437 6652 -6349 -11225 -6107 2239 10314 21897 14273 4715 1549 -4453 -302
4228 -302 -6969 -8327 -7582 -6608 1803 5253 3580 9783 6119 6474 7238 -5171 -24244 -11867 4053
4213 4053 -307 -5590 -6184 2903 7207 17827 18145 1378 -18684 -22835 -16914 -10743 -14403 -21764 -27036
4198 -27036 -29079 -25181 -32285 -28241 -9963 -5306 -9611 -7982 -2039 -2660 -11075 -14545 -17223 -22284 -26958
4183 -26958 -28503 -15101 -10703 -16785 -10109 -7507 -15114 -19866 -18316 -17227 -19159 -13186 -14812 -10725
4169 -10725 -18729 -15668 226 19389 26074 12519 12285 28022 27462 16560 15022 17135 10919 7209
4155 7209 13080 750 -7133 -1165 -6297 7327 17639 14169 2124 4974 11266 13525 3105 3321
$$ packed form
4256B2172P6r822j7866L289l349l786L762J4976J1276N894k1947r860J5715j265
4242I265j1424K596O215j3001m876N118Q346Q075J1583p624r558l166o002M151
4228c02o667j358P45R74Q411L450j673O203l664L55P64j2409j9073J2377J5920
4213D053m360n283n94R087M304J0620L18j6767k0062m151N921O171l660p361n272
4198b7036k043L898p104M044J8278M657m305J629N943o21q415l470k678n061m674
4183b6958j545J3402M398o082O676K602p607m752J550J089j932N973j626M087
4169a0725q004L061J5894J9163O685j3555k34J5737n60j0902j538K113o216l710
4155G209N871j2330p883N968n132J3624J0312l470j2045K850O292K259j0420K16
$$ plain form
4141 3321 9189 16431 11757 -11350 804 5397 15082 33195 28640 24304 6868 -9977 -19305 -13968
4127 -13968 1151 -4973 -2540 2989 5519 6875 16965 19183 24958 21578 4120 6043 16434 17392
4113 17392 20009 24258 13805 -8653 -1808 8725 -2204 -3180 -20883 -17292 -1409 1021 19202
4100 19202 14475 6726 -5930 -15660 -13903 2149 867 8630 -5303 -7572 1171 1908 15066 24433
4086 24433 14427 14018 8999 9485 5194 -9681 -29461 -25648 -20059 -19548 -26741 -21805 -15443 12160
4072 12160 24840 22366 14770 2634 1502 -4302 -18219 -11843 7505 15865 13165 19100 6228
4059 6228 -2146 3348 17545 24459 32062 35680 20135 -877 1073 13598 23516 36859 30016 8282
4045 8282 2641 7411 15185 33931 17216 6054 7159 -388 -22545 -20076 -6990 9910 9122 1279
$$ packed form
4141C321N868P242m674k3107J2154M593R685J8113m555m336j7436j6845r328N337
4127a3968J5119o124K433N529K530J356J0090K218N775l380j7458J923J0391R58
4113A7392K617M249j0453k2458O845J0533j0929r76j7703L591J5883K430J8181
4100A9202m727p749j2656r730J757J6052j282P763j3933k269Q743P37J3158R367
4086B4433j0006m09n019M86m291j4875j9780L813N589N11p193M936O362K7603
4072A2160J2680k474p596j2136j132n804j3917O376J9348Q360k700N935j2872
4059F228q374N494J4197O914P603L618j5545k1012J950J2525R918J3343o843k1734
4045H282n641M770P774J8746j6715j1162J105p547k2157K469J3086J6900p88p843
$$ plain form
4031 1279 1662 382 2026 4252 16730 31200 36302 15281 170 -8155 -6128 9541 6610 724
4017 724 3813 7573 17659 8470 -2712 -12485 -7167 -27416 -34324 -32624 -42525 -35785 -23079 -9502
4003 -9502 1361 13443 6861 -2531 -3858 472 -2252 -8583 -6741 -13972 -18867 -5414 6460 14902
3989 14902 10906 15212 17243 27961 25569 24542 15163 -2056 10721 8752 1370 -3896 -5876 -13551
3975 -13551 -2693 16319 8413 -654 -9110 -13965 -7327 7777 11959 9359 6556 14372 12265 12997
3961 12997 13586 11899 1934 27485 40880 34582 28653 9077 -7148 -14157 -2780 -1227 -12006
3948 -12006 -15415 -12166 -5949 8475 27910 35229 40179 20592 -5628 2776 2013 16229 3840
3935 3840 -21413 -14321 -142 5343 3242 -7997 -2884 18651 9816 2445 134 -5179 916 -16708
$$ packed form
4031A279L83j280J644K226J2478J4470N102k1021j5111q325K027J5669k931n886
4017G24L089L760J0086r189j1182r773N318k0249o908J700r901O740J2706J3577
4003i502J0863J2082o582r392j327M330k724o331J842p231m895J3453J1874Q442
3989A4902l996M306K031J0718k392j027r379j7219J2777j969p382n266j980p675
3975a3551J0858J9012p906r067q456m855O638J5104M182k600k803P816k107P32
3961A2997N89j687r965K5551J3395o298n929j9576j6225p009J1377J553j0779
3948a2006l409L249O217J4424J9435P319M950j9587k6220Q404p63J4216j2389
3935C840k5253P092J4179N485k101j1239N113K1535q835p371k311n313O095j7624
$$ plain form
3921 -16708 -24615 -29848 -21950 -9138 -9662 -9510 -626 9013 6911 10022 4407 -498 -5075 2033 17802
3906 17802 10261 14696 12263 15766 4155 -12688 -24060 -19330 -6187 995 427 14836 17102 24131
3892 24131 52009 33898 17404 17025 19588 20724 15404 15596 17963 21746 22602 23780 13193 -5811
3878 -5811 8494 23378 10128 13920 17099 10250 -8319 -10541 -21433 -25866 -16285 -106 5762
3865 5762 -2767 833 4403 -1477 -11822 -22474 -11519 -1581 2826 16245 8318 -2186 -10243 -209
3851 -209 8073 17423 13828 1243 -8099 -292 -7480 -17289 -8229 1400 -4296 532 -792 14180 19890
3836 19890 16203 -3342 -22291 -24696 -18311 -14021 -16410 -6714 -1895 -10093 2395 -3138 -14670 -76
3822 -76 17928 21769 15736 8523 7374 -8759 -20261 -25234 -23371 -12369 -8168 -18168 -11643 4618
$$ packed form
3921a6708p907n233P898J2812n24J52Q884R639k102L111n615m905m577P108J5769
3906A7802p541M435k433L503j1611j6843j1372M730J3143P182n68J4409K266P029
3892B4131K7878j8111j6494l79K563J136n320J92K367L783Q56J178j0587j9004
3878e811J4305J4884j3250L792L179o849j8569k222j0892m433R581J6179N868
3865E762q529L600L570n880j0345j0652J0955R938M407J3419p927j0504q057J0034
3851b09Q282R350l595j2585r342P807p188r809R060R629n696M828j324J4972N710
3836A9890l687j9545j8949k405O385M290k389R696M819q198J2488n533j1532J4594
3822g6J8004L841o033p213j149j6133j1502m973J863J1002M201j0000O525J6261
$$ plain form
3808 4618 2779 -6022 -17609 -9968 -3888 -8703 -7914 -10379 -8637 -248 -4037 -8402 11950 31432
3794 31432 32695 22789 1374 -12419 -12409 -13546 -12332 -7006 -1233 -9 9053 994 -1612 7367 2447
3779 2447 -16967 -32283 -31347 -38467 -29762 -21082 -11757 1495 3550 10460 21731 7328 -14343 -31158
3765 -31158 -26458 -21922 -32713 -31364 -15634 -7915 -5751 -16506 -18097 -8065 -381 -130 -12566 -6120
3751 -6120 6275 -1996 4365 17795 31136 20906 25922 40092 32796 24037 5767 -6726 -18846
3738 -18846 -2123 5052 8716 8258 10121 2471 2212 3914 16568 25012 23132 13918 16775 13174 18478
3723 18478 15919 4987 -9784 -19255 -13461 -13154 -11784 1055 4606 6732 9825 4317 -12817 -16572
3709 -16572 -9879 -4515 -17893 -16538 -23651 -24292 -21248 -3487 5810 -6996 -13322 -17333 -12794 -5614
$$ packed form
3808D618j839q801j1587P641O080m815P89k465J742Q389l789m365K0352J9482
3794C1432J263r906k1415j3793J0j137J214N326N773J224R062q059k606Q979m920
3779B447j9414j5316R36p120Q705Q680R325J3252K055O910J1271j4403k1671j6815
3765c1158M700M536j0791J349J5730P719K164j0755j591J0032P684K51j2436O446
3751f120J2395q271O361J3430J3341j0230N016J4170p296q759j8270j2493j2120
3738a8846J6723P175L664m58J863p650k59J702J2654Q444j880r214K857l601N304
3723A8478k559j0932j4771r471N794L07J370J2839L551K126L093n508j7134l755
3709a6572O693N364j3378J355p113o41L044J7761R297j2806o326m011M539P180
$$ plain form
3695 -5614 1101 3881 7434 21317 24493 3720 5762 18097 16349 7901 -4878 -1083 -5863 -23627
3681 -23627 -11397 -37 -12693 -12254 -8428 -22910 -35759 -27144 -30418 -31595 -25994 -7965 -7704 -294
3667 -294 -496 -6702 5221 -1458 892 12306 -1859 -18159 -25281 -14947 -2332 -7338 -6971 3816
3653 3816 -7078 -12819 -1846 2590 24 10879 13209 2371 5553 -5250 -1245 -2579 -17100
3640 -17100 -11029 2695 10090 8114 236 -6338 3875 6252 -3560 -26288 -33885 -23995 -11840 3644
3626 3644 29927 26458 27164 24290 26330 27312 20250 6650 6216 6837 -5318 -6796 -2596 8556 14857
3611 14857 12403 13083 7189 6662 -293 -20008 -35158 -23638 -20396 -16340 -9883 -8396 -782 6597
3597 6597 7753 2435 -6036 -489 2430 15321 13383 2714 1807 -6513 -16151 -1815 -6292 -1522
$$ packed form
3695e614O715K780L553J3883L176k0773K042J2335j748q448j2779L795m780j7764
3681b3627J2230J1360j2656M39L826j4482j2849Q615l274j177N601J8029K61P410
3667b94k02o206J1923o679K350J1414j4165j6300p122J0334J2615n006L67J0787
3653C816j0894n741J0973M436k566J0855K330j0838L182j0803M005j334j4521
3640a7100O071J3724P395j976p878o574J0213K377r812k2728p597R890J2155J5484
3626C644K6283l469P06k874K040R82p062j3600m34O21j2155j478M200J1152O301
3611A4857k454O80n894n27o955j9715j5150J1520L242M056O457J487P614P379
3597F597J156n318q471N547K919J2891j938j0669r07q320r638J4336m477M770
$$ plain form
3583 -1522 -8133 -8109 6871 21499 15418 8909 11810 4644 1614 9044 12274 9905 3475 -5413 -9450
3568 -9450 -8724 18457 37335 35149 17519 7908 148 -4299 4415 19411 19718 7695 -2163 -9023
3554 -9023 -6056 -6423 -10412 -16351 -15733 1414 10414 6522 4989 973 -432 3141 -6430 -1837 -7748
3539 -7748 -4149 5640 9575 -2094 5186 1592 -2387 8084 -14148 -27030 -14141 -4256 5696 6104
3525 6104 5713 7503 8119 1199 -19161 -18838 -16017 -17193 -20168 -25877 -11317 7153 11368 9931 711
3510 711 -5837 -16993 -18362 -397 -1555 2412 3389 986 -7114 -5344 -1836 18903 14125 -5287
3496 -5287 -10586 -8517 -1418 -18785 -11169 4062 -779 -11621 -28199 -23629 -20792 -29542 -30420 -29212
3482 -29212 -34955 -37493 -27470 -29210 -22275 -702 14040 14747 18239 -3329 2296 -1895 -20338 -25527
$$ packed form
3583a522o611K4J4980J4628o081o509K901p166l030P430L230k369o430q888m037
3568i450P26K7181J8878k186j7630r611p760m447Q714J4996L07j2023r858o860
3554i023K967l67l989n939O18J7147R000l892j533m016j405L573r571M593n911
3539g748L599R789L935j1669P280l594l979J0471k2232j2882J2889R885R952M08
3525F104l91J790O16o920k0360L23K821j176k975n709J4560J8470M215j437r220
3510G11o548j1156j369J7965j158L967R77k403q100J770L508K0739m778j9412
3496e287n299K069P099j7367P616J5231m841j0842j6578M570K837q750q78J208
3482b9212n743k538J0023j740O935K1573J4742P07L492k1568N625m191j8443n189
$$ plain form
3468 -25527 -12972 -10498 -9 2179 -5945 -20092 -14479 -3063 -2339 -1845 8880 8387 -10235 -13677
3454 -13677 -6100 11376 13716 1237 -7716 -14347 -15365 8809 689 -2269 -10481 -13229 -15444 -4479
3440 -4479 -11493 -13235 -7219 6539 18851 7022 -23992 -16947 8612 5661 7830 4262 -473 -4635
3426 -4635 4206 13149 3977 -5752 -4492 269 5448 22974 25336 14368 -34 -18738 -29044 -15684
3412 -15684 -13690 -3389 -1022 -13200 -7480 -13089 -17675 -10896 -4433 4437 -5677 1861 6345 285
3398 285 7618 144 -6073 -365 -2787 -763 -356 -10053 -12414 -6536 -741 15211 10424 -973 -4391
3383 -4391 -10796 4108 2614 687 1886 -201 -14828 -4945 5013 -10799 -23033 -24376 -23016 -9097
3369 -9097 3168 13885 17055 26954 3603 -5921 9690 12046 15941 26598 30210 11601 1857
$$ packed form
3468b5527J2555K474J0489K188q124j4147N613J1416P24M94J0725m93j8622l442
3454a3677P577J7476K340j2479q953o631j018K4174q120k958q212k748k215J0965
3440d479p014j742O016J3758J2312j1829l1014P045K5559k951K169l568m735m162
3426d635Q841Q943r172r729J260M761N179J7526K362j0968j4402j8704j0306J3360
3412a5684J994J0301K367j2178N720n609m586O779O463Q870j0114P538M484o060
3398B85P333p474o217N708k422K024M07r697k361N878N795J5952m787j1397l418
3383d391o405J4904j494j927J199k087j4627R883R958j5812j2234j343J360J3919
3369i097J2265J0717L170R899k3351r524J5611K356L895J0657L612j8609r744
$$ plain form
3356 1857 3484 -2290 -792 3467 8814 10973 13470 14890 17295 10881 7311 -1305 9758 4283 -4000
3341 -4000 -14015 116 10490 12272 -7879 -18631 -12694 -25165 -27948 -23088 -13403 -1990 5223
3328 5223 8098 5877 7169 4379 -8610 -24852 -16996 -12241 -14829 -8616 -6825 7128 898 -10525
3314 -10525 2333 -4800 -13929 -15205 2379 -1600 -19873 -36411 -30353 -17267 -17676 -6267 -1078
3301 -1078 1 5519 1182 -2192 -13230 -7529 -10366 -12907 479 14213 13135 11246 4065 612
3287 612 4903 -5415 -13029 -4306 1640 -5611 -7896 -8737 5447 17237 21060 -15158 -21023 -22656
3273 -22656 -12793 -3078 9754 18181 4838 3378 1481 -14353 -29603 -19588 -10873 -22177 -13517
3260 -13517 -11797 -7456 228 18991 31187 26070 35420 28686 10232 2450 -846 13879 28300
$$ packed form
3356A857J627n774J498M259N347K159K497J420K405o414l570q616J1063n475q283
3341d000j0015J4131J0374J782k0151j0752N937j2471k783M860R685J1413P213
3328E223K875k221J292k790j2989j6242P856M755k588O213J791J3953o230j1423
3314a0525J2858p133r129j276J7584l979j8273j6538O058J3086m09J1409N189
3301a078J079N518m337l374j1038N701k837k541J3386J3734j078j889p181l453
3287F12M291j0318p614Q723N946p251k285q41J4184J1790L823l6218n865j633
3273b2656R863R715J2832Q427j3343j460j897j5834j5250J0015Q715j1304Q660
3260a3517J720M341P684J8763J2196n117R350o734j8454p782l296J4725J4421
$$ plain form
3247 28300 25664 6548 166 -10991 -8396 -6413 3705 -2322 -368 -10123 -5981 -10898 -25405 -19565
3233 -19565 -7443 9483 12264 7586 592 -4806 7208 12327 20969 14013 7601 1373 226 -6017
3219 -6017 -4248 -3060 -2445 -710 11619 -1371 -8334 -12445 -14667 -10896 -11347 -13800 -17886 -18002 -15896
3204 -15896 -4962 -1698 3798 2916 -10440 -4060 9900 13167 19000 20533 37419 40280 33184 35805
3190 35805 17843 -4811 -5804 17759 12165 7363 1826 5607 2499 -4788 7532 26977 19923 4634
3176 4634 -3435 -11805 -30132 -44833 -27647 -18164 -80 4210 1429 9505 20762 19866 19748 13119
3162 13119 -7748 -19848 -21941 -20042 -21085 -16258 -4649 5649 7900 5953 -5952 -19001 -33779
3149 -33779 -41649 -32962 -20446 -20925 -17691 -7257 2110 1512 -15355 -16035 -2203 246 5733 -597
$$ packed form
3247B8300k636j9116o382j1157K595J983J0118o027J954r755M142m917j4507N840
3233a9565J2122J6926K781m678o994n398J2014N119Q642o956o412o228j147o243
3219f017J769J188O15J735J2329j2990o963m111k222L771m51k453m086j16K106
3204a5896J0934L264N496q82j3356O380J3960L267N833J533J6886K861p096K621
3190C5805j7962k2654r93K3563n594m802n537L781l108p287J2320J9445p054j5289
3176D634q069q370j8327j4701J7186R483J8084M290k781Q076J1257q96j18o629
3162A3119k0867j2100k093J899j043M827J1609J0298K251j947j1905j3049j4778
3149c3779p870Q687J2516m79L234J0434R367n98j6867o80J3832K449N487o330
$$ plain form
3135 -597 -6511 -12374 -11546 3426 19882 8145 12420 17314 11394 8955 3019 -3431 -11179 -8551 -17339
3120 -17339 -21239 -24516 -26068 -19498 -6978 4869 11957 2770 -16059 -16131 -20565 -25025 -7161 -642
3106 -642 9628 10667 17686 10059 -5272 -7854 5220 753 6614 13316 20147 13724 21567 38403
3092 38403 26591 10701 13900 10869 9761 -1072 -7687 13292 19370 6684 11827 8732 -4375
3079 -4375 -2490 1868 9772 11400 3030 3960 9059 2917 6956 -4682 -13407 -10306 1361 -3604 -11554
3064 -11554 554 -3759 -20679 -23578 -4058 -6025 -1528 3373 2413 -1300 88 11286 5814 -578
3050 -578 -8951 -3528 12371 15108 7293 4727 13286 16683 1531 -13793 -16693 -21701 -19916 -12936
3036 -12936 -5036 -6965 -2013 5719 6549 3117 1530 360 14636 16345 8971 12344 14585 14925 209
$$ packed form
3135e97n914n863Q28J4972J6456j1737M275M894n920k439n936o450p748K628q788
3120a7339l900l277j552O570J2520J1847P088r187j8829p2m434m460J7864O519
3106f42J0270J039P019p627j5331k582J3074m467N861O702O831o423P843J6836
3092C8403j1812j5890L199l031j108j0833o615K0979O078j2686N143l095j3107
3079d375J885M358P904J628q370R30N099o142M039j1638q725L101J1667m965p950
3064a1554J2108m313j6920k899J9520j967M497M901r60l713J388J1198n472o392
3050e78q373N423J5899K737p815k566Q559L397j5152j5324k900n008J785O980
3036a2936P900j929M952P732Q30l432j587j170J4276J709p374L373K241L40j4716
$$ plain form
3021 209 -2290 -3874 748 17977 27178 13747 -2699 -3505 -7876 -4196 -970 -3921 17416 6729
3007 6729 -5030 -6079 4859 -3790 -9524 -19102 -6695 -11479 -10419 -19739 -14186 -23261 -16125 -19522
2993 -19522 -22179 -4935 1524 -825 274 -12706 -22740 -21553 -14732 -8137 -1207 -6606 -8221 2339
2979 2339 -607 -4298 21 3437 -326 9826 9812 10230 15015 20856 10643 9823 19726 14787 12254
2964 12254 17363 27118 45922 45708 25898 2135 10337 16492 30709 38850 47427 42953 24495 15906
2950 15906 17016 14326 24386 28371 22219 8609 -183 5443 -2268 -9459 2417 4578 -9423 3519
2936 3519 8704 10915 20230 22514 7226 3507 8139 20369 23627 1340 1735 9068 6813 -5804
2922 -5804 -16193 -19718 -18833 -31416 -30322 -20652 -10067 -4046 -6163 -6332 -3987 7156 15879 22337
$$ packed form
3021B09k499j584M622J7229R201j3431j6446q06m371L680L226k951K1337j0687
3007F729j1759j049J0938q649n734r578J2407m784J060r320N553r075P136l397
2993a9522k657J7244O459k349J099j2980j0034J187O821O595O930n399j615J0560
2979B339k946l691M319L416l763J0152j4M18M785N841j0213q20R903m939k533
2964A2254N109R755J8804k14j9810k3763Q202O155J4217Q141Q577m474j8458q589
2950A5906J110k690J0060L985o152j3610q792N626p711p191J1876K161j4001J2942
2936C519N185K211R315K284j5288l719M632J2230L258k2287L95P333k255j2617
2922e804j0389l525Q85j2583J094R670J0585O021k117j69K345J1143Q723O458
$$ plain form
2908 22337 12479 15 804 8558 16084 15316 9901 -3092 13899 19461 25824 24935 17156 4236
2894 4236 -7578 -7709 -6842 1557 16426 18794 17769 23051 11840 7468 -1015 -11239 -8890 -9579 -38
2879 -38 4380 -5752 -19144 -18187 -11392 -6179 -3449 1697 6971 833 7805 3149 -10255 -25418 -12117
2864 -12117 851 6732 14341 -2173 -16726 -9650 -13680 -13108 -6499 12077 24064 20414 17811 15692
2850 15692 -186 4918 12570 18155 33645 38641 40908 48904 54628 39784 16315 15460 44 9099
2836 9099 3141 -14204 -8278 5218 3595 9320 5760 -13437 -25553 -20497 -9170 -9497 -9789 -25426
2822 -25426 -3719 23143 9052 558 2156 6959 19380 36637 22551 6380 6805 7919 1743
2809 1743 -6562 4497 3564 -10702 -9368 -5856 -7375 -22978 -22237 -9481 -4353 2938 -2861 -4097
$$ packed form
2908B2337r858j2464P89P754P526p68n415j2993J6991N562O363q89p779j2920
2894D236j1814j31Q67Q399J4869K368j025N282j1211m372q483j0224K349o89R541
2879c8M418j0132j3392R57O795N213K730N146N274o138O972m656j3404j5163J3301
2864a2117J2968N881P609j6514j4553P076m030N72O609J8576J1987l650k603k119
2850A5692j5878N104P652N585J5490M996K267P996N724j4844k3469q55j5416R055
2836I099n958j7345N926J3496j623N725l560j9197j2116N056J1327l27k92j5637
2822b5426K1707K6862j4091q494J598M803J2421J7257j4086j6171M25J114o176
2809A743q305J1059r33j4266J334L512j519j5603P41J2756N128P291n799j236
$$ plain form
2795 -4097 -6484 -6206 15183 16458 5010 -6245 305 9501 9919 4965 -18779 -16501 -10211 -19640
2781 -19640 -20629 -23436 -17194 -5438 7965 5899 5472 6949 -3236 3352 12594 1392 -6290 4191
2767 4191 -2507 -10604 -3181 11082 15491 17111 2523 7176 10716 3740 -14500 -19803 -25245 -22094
2753 -22094 -26031 -36558 -20591 -14552 -10410 -7974 -13627 -13633 -10048 -2493 1814 13840 17852 16474 20634
2738 20634 30124 8694 -18747 -17023 -4059 -5159 -8793 -9940 -14700 -12799 -7631 474 -5978 -11030
2724 -11030 -24115 -29270 -25685 -15850 -15167 -20267 -22090 -19734 -4975 26180 30274 31168 18510 13615
2710 13615 6942 -1624 -5739 40 -1341 7809 15512 10603 13407 5811 904 8204 3530 -2739 -16299
2695 -16299 -6182 929 -4045 -16093 -16540 -21867 -30035 -33058 -27843 -17271 -6086 4284 7991 15390
$$ packed form
2795d097k387K78K1389J275j1448j1255O550R196M18m954k3744K278O290r429
2781a9640r89k807O242J1756J3403k066m27J477j0185O588R242j1202p682J0481
2767D191o698q097P423J4263M409J620j4588M653L540o976j8240n303n442L151
2753b2094l937j0527J5967O039M142K436n653oL585P555M307J2026M012j378M160
2738B0634R490k1430k7441J724J2964j100l634j147m760J901N168Q105o452n052
2724a1030j3085n155L585R835O83n100j823K356J4759L1155M094Q94j2658m895
2710A3615o673q566m115N779j381R150P703m909K804p596m907P300m674o269j3560
2695a6299J0117P111m974j2048m47n327q168l023N215J0572J1185J0370L707P399
$$ plain form
2681 15390 10943 -1104 -4126 7427 19819 20314 7973 604 7692 12491 10688 3823 -3083 -4284
2667 -4284 -7586 3397 -680 -5202 5082 15713 15158 -1043 -4694 -18845 -28871 -22928 -23734 -9846
2653 -9846 1808 3977 13144 29168 16930 14350 18155 10159 -7847 -6736 12349 20324 14157 14675
2639 14675 9582 5592 7617 3129 -5931 8605 13720 6786 7504 2931 9253 5274 9782 9140 -3431
2624 -3431 1970 9077 -2734 -14041 -11385 -7427 -128 2770 -8625 -15883 -1404 2351 6153 12211
2610 12211 221 1043 6778 -5614 3788 12014 16150 7375 -2101 2575 -3908 -8836 1033 -8083
2596 -8083 -7846 -1694 6048 7548 5392 159 -5094 -6243 2775 3559 3917 16702 37826 48587 41929
2581 41929 23197 2443 8035 6361 370 -8396 -3269 -194 -8955 -11843 -18532 -23532 -1979 18314
$$ packed form
2681A5390m447j2047l022J1553J2392M95j2341p369P088M799j803o865o906j201
2667d284l302J0983m077m522J0284J0631n55j6201l651j4151j0026N943q06J3888
2653i846J1654K169R167J6024j2238k580L805p996j8006J111J9085P975o167N18
2639A4675n093l990K025m488r060J4536N115o934P18m573O322l979M508o42j2571
2624c431N401P107j1811j1307K656L958P299K898j1395p258J4479L755L802O058
2610A2211j1990Q22N735j2392R402Q226M136q775r476M676o483m928R869r116
2596h083K37O152P742J500k156n233n253j149R018P84L58J2785K1124J0761o658
2581D1929j8732k0754N592j674n991q766N127L075q761k888o689n000K1553K0293
$$ plain form
2567 18314 19098 21383 10309 -8236 -6151 -2903 -12962 -14920 -7938 -15758 -6348 2395 -9433 -13791
2553 -13791 -13466 -10943 -13410 -11812 -3151 -9661 -24800 -24163 -18056 -8370 -1894 -1041 1942 19012 40400
2538 40400 35188 32095 34213 26123 18959 17499 16170 -958 4081 -1868 -11784 -5018 -3644 -17776
2524 -17776 -15972 -11443 -16627 -5811 11654 10826 3781 19492 30677 24066 18326 16813 20092 11253
2510 11253 11720 -15798 -22690 -18362 -12910 -1880 -5231 -5907 9949 17152 16181 1897 3056 -149
2496 -149 11731 22175 14005 15383 686 -6714 2958 3175 2491 -1822 -408 9633 18430 20804 7908
2481 7908 12545 5367 10645 11284 1332 -5587 -833 4718 -6128 -7469 -9795 -21532 -25170 -11585
2467 -11585 -23851 -24054 -13727 9677 15243 16642 24636 10382 4989 -4303 -8642 -4677 -7851 -10962
$$ packed form
2567A8314P84K285j1074j8545K085L248j0059j958O982p820R410Q743j1828m358
2553a3791L25K523k467J598Q661o510j5139O37O107R686O476Q53K983J7070K1388
2538D0400n212l093K118q090p164j460j329j7128N039n949r916O766J374j4132
2524a7776J804M529n184J0816J7465q28p045J5711J1185o611n740j513L279q839
2510A1253M67k7518o892M328N452J1030l351o76J5856P203r71j4284J159l205
2496a49J1880J0444q170J378j4697p400R672K17o84m313J414J0041Q797K374j2896
2481G908M637p178N278O39r952o919M754N551j0846j341k326j1737l638J3585
2467a1585j2266k03J0327K3404N566J399P994j4254n393r292m339L965l174l111
$$ plain form
2453 -10962 -18436 -37002 -29567 -24986 -22353 -13114 -953 -8105 -20472 -15527 -13158 -12138 -13169 -4655
2439 -4655 -317 6855 22335 18101 5515 -4122 11814 19890 22727 25611 5345 2824 19708 25216
2425 25216 9558 3135 3619 6013 8343 23748 24967 24757 8277 1600 1146 -16628 -22411 -15449
2411 -15449 -13221 -6023 1394 14094 12361 19190 1668 -6428 5698 13556 14239 4268 11929 -2149
2397 -2149 -19586 -12422 -8699 8152 6998 -1868 1442 11644 14707 5395 3065 -11047 -19349 -11665
2383 -11665 -21412 -15325 -4547 9072 6711 5745 16669 16202 -2167 -14831 -29252 -18256 -15729
2370 -15729 -19905 2406 8395 10832 -2964 -11576 -24521 -30026 -19616 7534 7927 -16476 -25474
2357 -25474 -7848 3188 -2723 -3453 -3130 914 -9926 -8581 5134 14864 17477 10262 1133 3936
$$ packed form
2453a0962p474j8566P435M581K633R239J2161p152j2367M945K369J020j031Q514
2439d655M338P172J5480m234j2586r637J5936Q076K837K884k0266k521J6884N508
2425B5216j5658o423M84K394K330J5405J219k10j6480o677m54j7774n783O962
2411a5449K228P198P417J2700j733O829j7522q096J2126P858O83r971P661j4078
2397b149j7437P164L723J6851j154q866L310J0202L063r312k330j4112q302P684
2383a1665r747O087J0778J3619k361r66J0924m67j8369j2664j4421J0996K527
2370a5729m176K2311N989K437j3796q612j2945n505J0410K7150L93k4403q998
2357b5474J7626J1036n911p30L23M044j0840J345J3715R730K613p215r129K803
$$ plain form
2343 3936 12570 4483 -6684 -12485 -12331 -13463 -6044 -3286 7093 10645 -1657 -8161 -10305 -3273
$$ packed form
2343C936Q634q087j1167n801J54j132P419K758J0379L552j2302o504k144P032
$$ [...]
##END NTUPLES=NMR SPECTRUM
##END=
